##TITLE=Analysis number 321838
Compound Code sb 01266
Book Reference 2
Project Code adrs
Chemist Name stores
##JCAMPDX= 6.0         $$ Bruker NMR JCAMP-DX V2.0
##DATA TYPE= NMR SPECTRUM
##DATA CLASS= NTUPLES
##ORIGIN= Bruker BioSpin GmbH
##OWNER= nmr
$$ XWIN-NMR		Version 3.5
$$ Wed Aug 30 12:08:18 2006 GMT Daylight Time (UT+1h)  MAYBRIDGE\nmr@NMR_250MHZ
##.OBSERVE FREQUENCY= 250.131544655141
##.OBSERVE NUCLEUS= ^1H
##.ACQUISITION MODE= SIMULTANEOUS (DQD)
##.ACQUISITION SCHEME= undefined
##.AVERAGES= 16
##.DIGITISER RES= 18
##SPECTROMETER/DATA SYSTEM= dpx250
##.PULSE SEQUENCE= zg30
##.SOLVENT NAME= CDCl3
##.SHIFT REFERENCE= (INTERNAL, CDCl3, 0, 16.522)
##AUDIT TRAIL= $$ (NUMBER, WHEN, WHO, WHERE, WHAT)
$$ ##TITLE= Audit trail, XWIN-NMR		Version 3.5
$$ ##JCAMPDX= 5.01
$$ ##ORIGIN= Bruker BioSpin GmbH
$$ ##OWNER= nmr
$$ C:\u/data/dgb/nmr/ADRS/1950/pdata/1/auditp.txt
$$ ##AUDIT TRAIL=  $$ (NUMBER, WHEN, WHO, WHERE, WHAT)
(   1,<2006-08-30 12:07:58.78 +100>,<MAYBRIDGE\nmr>,<NMR_250MHZ>,
      <created by zg, POWCHK disabled, PULCHK disabled
       configuration hash MD5:
       E2 DF 36 D8 04 B2 41 60 5A D7 A3 38 5A 4B D0 FE
       data hash MD5: 64K
       04 10 3A DA C5 E1 4A 27 E4 DD 8D 9D 1D BF E5 D6>)
(   2,<2006-08-30 12:08:10.31 +100>,<MAYBRIDGE\nmr>,<NMR_250MHZ>,
      <Start of raw data processing
       ef LB = 0.3 FT_mod = 6 PKNL = 1 SI = 32K 
       data hash MD5: 32K
       39 95 9C 71 3D D4 C1 BA 5C 31 28 4E 9A 7E C0 63>)
(   3,<2006-08-30 12:08:12.03 +100>,<MAYBRIDGE\nmr>,<NMR_250MHZ>,
      <apk 
       data hash MD5: 32K
       67 1E 49 B5 4E 31 18 88 E4 02 D6 13 50 B9 43 80>)
(   4,<2006-08-30 12:08:12.78 +100>,<MAYBRIDGE\nmr>,<NMR_250MHZ>,
      <abs ABSG = 5 
       data hash MD5: 32K
       14 DE A4 34 8B 79 E0 E0 98 39 F4 FB AE FC 02 6A>)
$$ ##END=
$$ 
$$ hash MD5
$$ 5A 7B 4A 2D 86 40 66 05 16 13 77 4D 32 BB CC 1F
##$RELAX= 
##$RELAX= 
##$RELAX= 
##$RELAX= 
##$RELAX= 
##$RELAX= 
##$RELAX= 
$$ Bruker specific parameters
$$ --------------------------
##$DU= <C:\u>
##$EXPNO= 1950
##$NAME= <ADRS>
##$PROCNO= 1
##$TYPE= <nmr>
##$USER= <dgb>
##$AMP= (0..31)
100 100 100 100 100 100 100 100 100 100 100 100 100 100 100 100 100 100 
100 100 100 100 100 100 100 100 100 100 100 100 100 100 
##$AQSEQ= 0
##$AQ_mod= 3
##$AUNM= <au_zg>
##$AUTOPOS= <22 >
##$BF1= 250.13
##$BF2= 250.13
##$BF3= 250.13
##$BF4= 250.13
##$BF5= 500.13
##$BF6= 500.13
##$BF7= 500.13
##$BF8= 500.13
##$BYTORDA= 1
##$CFDGTYP= 0
##$CFRGTYP= 5
##$CHEMSTR= <none>
##$CNST= (0..31)
1 1 145 1 1 1 1 1 1 1 1 1 1 1 1 1 1 1 1 1 1 1 1 1 1 1 1 1 1 1 1 1 
##$CPDPRG= <>
##$CPDPRG1= <>
##$CPDPRG2= <>
##$CPDPRG3= <>
##$CPDPRG4= <mlev>
##$CPDPRG5= <mlev>
##$CPDPRG6= <mlev>
##$CPDPRG7= <mlev>
##$CPDPRG8= <mlev>
##$CPDPRGB= <>
##$CPDPRGT= <>
##$D= (0..31)
0 1 0 0 0 0 0 0 0 0.06 0 0 0 0 0 0 0.0002 0 0 0 0 0 0 0 0 0 0 0 0 0 0 
0 
##$DATE= 1156936077
##$DBL= (0..7)
120 120 120 120 120 120 120 120 
##$DBP= (0..7)
150 150 150 150 150 150 150 150 
##$DBP07= 0
##$DBPNAM0= <>
##$DBPNAM1= <>
$$ [...]
##$SUBNAM7= <"">
##$SUBNAM8= <"">
##$SUBNAM9= <"">
##$SW= 20.6930455092707
##$SWIBOX= (0..15)
0 0 3 0 0 0 0 0 0 0 0 0 0 0 0 0 
##$SW_h= 5175.983436853
##$TD= 65536
##$TD0= 1
##$TE= 296.16
##$TE2= 300
##$TE3= 300
##$TEG= 300
##$TL= (0..7)
0 120 120 120 120 120 120 120 
##$TP= (0..7)
150 150 150 150 150 150 150 150 
##$TP07= 0
##$TPNAME0= <>
##$TPNAME1= <>
##$TPNAME2= <>
##$TPNAME3= <>
##$TPNAME4= <>
##$TPNAME5= <>
##$TPNAME6= <>
##$TPNAME7= <>
##$TPOAL= (0..7)
0.5 0.5 0.5 0.5 0.5 0.5 0.5 0.5 
##$TPOFFS= (0..7)
0 0 0 0 0 0 0 0 
##$TUNHIN= 0
##$TUNHOUT= 0
##$TUNXOUT= 0
##$USERA1= <user>
##$USERA2= <user>
##$USERA3= <user>
##$USERA4= <user>
##$USERA5= <user>
##$V9= 5
##$VALIST= <valist>
##$VCLIST= <CCCCCCCCCCCCCCC>
##$VD= 0
##$VDLIST= <DDDDDDDDDDDDDDD>
##$VPLIST= <PPPPPPPPPPPPPPP>
##$VTLIST= <TTTTTTTTTTTTTTT>
##$WBST= 1024
##$WBSW= 4
##$XGAIN= (0..3)
0 0 0 0 
##$XL= 0
##$YL= 0
##$YMAX_a= 432447
##$YMIN_a= -494271
##$ZGOPTNS= <>
##$ZL1= 120
##$ZL2= 120
##$ZL3= 120
##$ZL4= 120
##$ABSF1= 16.522
##$ABSF2= -4.171173
##$ABSG= 5
##$ABSL= 3
##$ALPHA= 0
##$AQORDER= 0
##$ASSFAC= 0
##$ASSFACI= 0
##$ASSFACX= 0
##$ASSWID= 0
##$AUNMP= <proc_1d>
##$AZFE= 0.1
##$AZFW= 0.1
##$BCFW= 0
##$BC_mod= 0
##$BYTORDP= 0
##$COROFFS= 0
##$CY= 12.5
##$DATMOD= 1
##$DC= 0
##$DFILT= <>
##$DTYPP= 0
##$F1P= 14.0000005364418
##$F2P= -0.99999901652339
##$FCOR= 0.5
##$FTSIZE= 32768
##$FT_mod= 6
##$GAMMA= 0
##$GB= 0
##$INTBC= 1
##$INTSCL= 1
##$ISEN= 128
##$LB= 0.3
##$LEV0= 0
##$LPBIN= 0
##$MAXI= 10000
##$MC2= 0
##$MEAN= 0
##$ME_mod= 0
##$MI= 0
##$NCOEF= 0
##$NC_proc= -4
##$NLEV= 6
##$NOISF1= 0
##$NOISF2= 0
##$NSP= 0
##$NTH_PI= 0
##$NZP= 0
##$OFFSET= 16.522
##$PC= 1
##$PHC0= 147.5712
##$PHC1= 7.021231
##$PH_mod= 1
##$PKNL= yes
##$PPARMOD= 0
##$PSCAL= 4
##$PSIGN= 0
##$REVERSE= no
##$SF= 250.13
##$SI= 32768
##$SIGF1= 0
##$SIGF2= 0
##$SINO= 400
##$SIOLD= 32768
##$SREGLST= <1H.CDCl3>
##$SSB= 0
##$STSI= 32768
##$STSR= 0
##$SW_p= 5175.98343685301
##$SYMM= 0
##$S_DEV= 0
##$TDeff= 65536
##$TDoff= 0
##$TI= <Analysis number 999999
Compound Code 99
Book Reference 9
Project Code 9>
##$TILT= no
##$TM1= 0
##$TM2= 0
##$TOPLEV= 0
##$USERP1= <user>
##$USERP2= <user>
##$USERP3= <user>
##$USERP4= <user>
##$USERP5= <user>
##$WDW= 1
##$XDIM= 32768
##$YMAX_p= 566777232
##$YMIN_p= -108034
$$ End of Bruker specific parameters
$$ ---------------------------------
##NTUPLES= NMR SPECTRUM
##VAR_NAME=  FREQUENCY,     SPECTRUM/REAL,   SPECTRUM/IMAG
##SYMBOL=    X,             R,               I
##VAR_TYPE=  INDEPENDENT,   DEPENDENT,       DEPENDENT
##VAR_FORM=  AFFN,          ASDF,            ASDF
##VAR_DIM=   32768,         32768,           32768
##UNITS=     HZ,            ARBITRARY UNITS, ARBITRARY UNITS
##FACTOR=    0.157963299565203, 1,           1
##FIRST=     4132.6476996994, 0,             0
##LAST=      -1043.33573715361, 0,           0
##MIN=       -1043.33573715361, -108034,     0
##MAX=       4132.6476996994, 566777232,     0
$$ Real data points
##PAGE= N=1
##DATA TABLE= (X++(R..R)), XYDATA
$$ [...]
$$ plain form
19650 19831278 19179021 18585873 18089445 17685514 17338504 16938774 16472848 15969269 15408975
19641 15408975 14768375 14079543 13439438 12855067 12371551 11956544 11563355 11250907 10983632
19632 10983632 10728748 10520905 10320887 10074281 9847540 9647567 9463449 9283138 9105393
19623 9105393 8976085 8864233 8729393 8627802 8554735 8506322 8483250 8516427 8574828 8658225
19613 8658225 8795396 9039298 9328992 9687480 10130084 10758206 11711672 13105553 15261545
19604 15261545 18613284 23709274 30568216 38567669 46680487 52879596 56740554 58000119
19596 58000119 58483956 59966743 62742624 66679005 69639461 70633332 69094831 66224147
19588 66224147 64066481 63076264 63725082 64663909 64662452 63364658 61064497 59513652 59057693
$$ packed form
19650A9831278o52257n93148m96428m03931l47010l99730m65926n03579n60294
19641A5408975o40600o88832o40105n84371m83516m15007l93189l12448k67275
19632A0983632k54884k07843k00018k46606k26741j99973j84118j80311j77745
19623I105393j29308j11852j34840j01591p3067m8413k3072L3177N8401Q3397
19613H658225J37171K43902K89694L58488M42604O28122R53466J393881K155992
19604A5261545L351739N095990O858942P999453Q112818O199109L860958J259565
19596E8000119M83837J482787K775881L936381K960456R93871j538501k870684
19588F6224147k157666r90217O48818R38827j457j297794k300161j550845m55959
$$ plain form
19579 59057693 59840676 60715200 60176133 57713268 52899394 47322780 41703054 36768739
19571 36768739 32847327 29728222 27196614 25120593 23438160 22055212 20923819 20009331
19563 20009331 19261638 18647793 18171608 17827216 17646089 17630771 17823654 18237578 18999984
19554 18999984 20342972 22533110 26161602 31755764 39114721 47594569 55779931 61661911
19546 61661911 65013870 65791670 66365680 67950806 70959220 74796797 77185666 77423825
19538 77423825 75110466 72218728 70507030 70518740 72199207 73647849 73844017 72295263
19530 72295263 69933021 68600546 68514876 69717061 70420266 69238642 65474183 59326307
19522 59326307 52611635 46047517 40531044 36204841 32790694 30038504 27772390 25891652
$$ packed form
19579E9057693P82983Q74524n39067k462865m813874n576614n619726m934315
19571C6768739l921412l119105k531608k076021j682433j382948j131393r14488
19563B0009331p47693o13845m76185l44392j81127j5318J92883M13924P62406
19554A8999984J342988K190138L628492N594162P358957Q479848Q185362N881980
19546F1661911L351959P77800N74010J585126L008414L837577K388869K38159
19538G7423825k313359k891738j711698J1710J680467J448642J96168j548754
19530G2295263k362242j332475q5670J202185P03205j181624l764459o147876
19522E9326307o714672o564118n516473m326203l414147k752190k266114j880738
$$ plain form
19514 25891652 24293232 22878543 21635074 20547215 19605923 18746469 17948077 17218687 16525042
19505 16525042 15839307 15208029 14657429 14121355 13617690 13192518 12759090 12326549 11915582
19496 11915582 11558725 11190688 10835112 10564922 10272356 9938909 9580116 9218868 8864622
19487 8864622 8524527 8195840 7896271 7623721 7362648 7132466 6912730 6719371 6537862
19478 6537862 6366772 6199549 6056245 5914161 5779219 5667555 5542565 5435052 5342811 5321917
19468 5321917 5332742 5353872 5385885 5415546 5478486 5566598 5619283 5602406 5541787 5497931 5458379
19457 5458379 5400175 5369337 5323022 5253273 5153041 5104145 5053531 4950634 4890989 4845150 4770934
19446 4770934 4704419 4643181 4561643 4475444 4400786 4309967 4212083 4088549 3890985 3674280 3483457
$$ packed form
19514B5891652j598420j414689j243469j087859r41292q59454p98392p29390o93645
19505A6525042o85735o31278n50600n36074n03665m25172m33428m32541m10967
19496A1915582l56857l68037l55576k70190k92566l33447l58793l61248l54246
19487H864622l40095l28687k99569k72550k61073k30182k19736j93359j81509
19478F537862j71090j67223j43304j42084j34942j11664j24990j07513r2241k0894
19468E321917J0825K1130L2013K9661O2940Q8112N2685j6877o0619m3856l9552
19457E458379n8204l0838m6315o9749j00232m8896n0614j02897n9645m5839p4216
19446D770934o6515o1238q1538q6199p4658r0819r7884j23534j97564k16705j90823
$$ plain form
19435 3483457 3271024 3074383 2935377 2857686 2775422 2675168 2575954 2502544 2393476 2318911
19425 2318911 2272920 2205602 2131759 2098918 2078020 2056615 2040442 1978249 1901977 1864311 1828814
19414 1828814 1778385 1740967 1712407 1679796 1672058 1618845 1551297 1517168 1479891 1444043 1429193
19403 1429193 1415608 1430722 1406855 1404658 1406704 1417779 1404161 1397683 1381285 1404003 1416565 1414393
19391 1414393 1394144 1394171 1421044 1439957 1434393 1418441 1434943 1447737 1414798 1392882 1398233 1369259
19379 1369259 1344306 1311551 1253659 1221812 1163481 1098821 1066762 1026621 999759 967548 928925
19368 928925 914816 915154 872143 830914 789980 772991 762188 745467 711216 682397 651606 646333
19356 646333 632700 630053 617497 620762 630970 653328 688097 727015 742739 783072 828290 854810
$$ packed form
19435C483457k12433j96641j39006p7691q2264j00254r9214p3410j09068p4565
19425B318911m5991o7318p3843l2841k0898k1405j6173o2193p6272l7666l5497
19414A828814n0429l7418k8560l2611p738n3213o7548l4129l7277l5848j4850
19403A429193j3585J5114k3867k197K046J1075j3618o478j6398K2718J2562k172
19391A414393k0249K7K6873J8913n564j5952J6502J2794l2939k1916N351k8974
19379A369259k4953l2755n7892l1847n8331o4660l2059m0141k6862l2211l8623
19368I28925j4109L38m3011m1229m0934j6989j0803j6721l4251k8819l0791n273
19356F46333j3633k647j2556L265J0208K2358L4769L8918J5724M0333M5218K6520
$$ plain form
19344 854810 852973 823850 809194 831824 878152 888110 902537 919124 928627 917852 865708 858612
19332 858612 845989 839354 820742 798913 787691 785825 765586 743289 704059 628480 590870 545568
19320 545568 496122 467509 430838 395798 417609 419545 427626 415070 391068 374810 341867 296919
19308 296919 277339 293770 302181 283067 293541 302364 318983 304910 269793 271447 284311 291668
19296 291668 288734 294858 289499 299411 307696 297845 265824 270847 288272 309024 324986 355581 383325
19283 383325 342973 297114 306603 302059 283142 301577 311381 288910 278405 275058 265363 253100
19271 253100 247144 244622 269346 269841 250991 235138 224105 240150 249990 247387 238065 220855 217457
19258 217457 213141 184924 179400 190747 175879 163504 173729 183091 193545 169299 141032 128529
$$ packed form
19344H54810j837k9123j4656K2630M6328R958J4427J6587R503j0775n2144p096
19332H58612j2623o635j8612k1829j1222j866k0239k2297l9230p5579l7610m5302
19320E45568m9446k8613l6671l5040K1811J936Q081j2556k4002j6258l2943m4948
19308B96919j9580J6431Q411j9114J0474Q823J6619j4073l5117J654J2864P357
19296B91668k934O124n359R912Q285r851l2021N023J7425K0752J5962L0595K7744
19283C83325m0352m5859R489m544j8917J8435R804k2471j0505l347r695j2263
19271B53100n956k522K4724M95j8850j5853j1033J6045R840k603r322j7210l398
19258B17457m316k8217n524J1347j4868j2375J0225R362J0454k4246k8267j2503
$$ plain form
19246 128529 165293 162691 121387 123477 128320 136160 120358 114374 115474 116656 113419 98447 133980
19233 133980 134932 121168 126142 114449 82617 93821 127445 104149 93873 111209 141031 113570
19221 113570 99176 105809 124530 149433 158267 126765 121661 131499 132581 140991 128586 101946 94050
19208 94050 90890 99604 117284 119234 105828 104157 97908 97023 110231 111348 111890 115326 112192 104066
19194 104066 112268 108052 89306 84806 84245 104249 96813 112220 150488 198020 184069 163298 152461
19181 152461 174468 186307 222606 274387 301144 354217 423165 464852 503786 526069 558998
19170 558998 571129 566414 548372 526193 590066 638983 698229 758153 832940 879646 952882 955557
19158 955557 894099 870668 876980 829055 792696 799273 827815 866156 927471 947874 980728 1006711
$$ packed form
19246A28529L6764k602m1304K090M843P840j5802n984J100J182l237j4972L5533
19233A33980R52j3764M974j1693l1832J1204L3624k3296j0276J7336K9822k7461
19221A13570j4394O633J8721K4903Q834l1502n104R838J082Q410j2405k6640p896
19208I4050l160Q714J7680J950j3406j671o249q85J3208J117N42L436l134q126
19194A04066Q202m216j8746m500n61K0004p436J5407L8268M7532j3951k0771j0837
19181A52461K2007J1839L6299N1781K6757N3073O8948M1687L8934K2283L2929
19170E58998J2131m715j8042k2179O3873M8917N9246N9924P4787M6706P3236K675
19158I55557o1458k3431O312m7925l6359O577K8542L8341O1315K0403L2854K5983
$$ plain form
19146 1006711 1007252 981307 939403 894733 812976 701684 623095 563920 481484 446339 410297
19135 410297 394298 382125 371353 366851 374986 379635 371920 360514 320991 313263 299953 315975
19123 315975 293431 314474 327092 300526 271269 274356 295936 319253 314955 298169 276864 269968
19111 269968 312207 336314 329987 349858 359267 336648 325509 359469 412441 494708 605090 730991
19099 730991 858169 976961 1042816 1020179 988753 912454 821003 732496 646219 593104 554204
19088 554204 519944 470964 413569 395174 427017 449731 427478 408120 385975 359324 371216
19077 371216 393980 375070 371419 389979 387308 376648 389421 387844 383327 394550 417212 430035
19065 430035 477595 527102 521179 516253 510551 502858 515060 531275 523538 522830 551297 576669 614399
$$ packed form
19146A006711N41k5945m1904m4670q1757j11292p8589n9175q2436l5145l6042
19135D10297j5999j2173j0772m502Q135M649p715j1406l9523p728j3310J6022
19123C15975k2544K1043J2618k6566k9257L087K1580K3317m298j6786k1305o896
19111B69968M2239K4107o327J9871R409k2619j1139L3960N2972Q2267J10382J25901
19099G30991J27178J18792O5855k2637l1426p6299r1451q8507q6277n3115l8900
19088E54204l4260m8980n7395j8395L1843K2714k2253j9358k2145k6651J1892
19077C71216K2764j8910l651J8560k671j0660J2773j577m517J1223K2662J2823
19065D30035M7560M9507n923m926n702p693J2202J6215p737p08K8467K5372L7730
$$ plain form
19052 614399 662068 721017 780704 855137 915756 935752 977567 1005793 967841 919837 872701
19041 872701 835352 801818 744555 706251 688124 633245 574042 546974 523363 488381 479595 498649
19029 498649 482921 489050 505837 493272 474840 465191 429594 419531 421423 409116 413695 420385
19017 420385 439067 440080 437788 471153 521229 550604 572805 588758 599176 607273 599011 587201
19005 587201 598392 645034 682155 694015 655670 609662 628143 660224 691302 701894 689731
18994 689731 675638 669107 658924 676754 659437 650713 662981 656391 628188 582441 578783 535010
18982 535010 479876 483126 482717 460008 454731 464277 452559 433292 422996 464134 479548 446976
18970 446976 457398 449013 442606 426741 421851 406694 400452 416412 412510 431591 424644 423464 461123
$$ packed form
19052F14399M7669N8949N9687P4433O0619J9996M1815K8226l7952m8004m7136
19041H72701l7349l3534n7263l8304j8127n4879n9203k7068k3611l4982q786J9054
19029D98649j5728O129J6787j2565j8432r649l5597j0063J892j2307M579O690
19017D20385J8682J013k292L3365N0076K9375K2201J5953J0418Q097q262j1810
19005E87201J1191M6642L7121J1860l8345m6008J8481L2081L1078J0592j2163
18994F89731j4093o531j0183J7830j7317q724J2268o590k8203m5747l658m3773
18982E35010n5134L250m09k2709n277R546j1718j9267j0296M1138J5414l2572
18970D46976J0422q385o407j5865m890j5157o242J5960l902J9081o947j180L7659
$$ plain form
18957 461123 459913 439114 441377 401481 390077 401664 451056 461519 446581 421652 424287 422557
18945 422557 392244 380745 376777 373258 389819 414143 427781 429187 427040 449413 452736 458381 493285
18932 493285 522725 529756 521540 523093 524902 541061 543897 573311 638264 670310 708798 748451
18920 748451 797599 847165 877253 945495 1039329 1150599 1250869 1378474 1505090 1616331
18910 1616331 1716627 1825434 1964400 2142623 2314123 2506058 2695332 2910770 3191029
18901 3191029 3535224 3925551 4415897 5044010 5946759 7238858 9249784 12349551 16605217
18892 16605217 21416339 26547383 31835156 36697836 40658797 43429582 45953401 48882629
18884 48882629 52039320 55665395 60104998 64071239 66509324 67547458 68047061 67294219
$$ packed form
18957D61123j210k0799K263l9896j1404J1587M9392J0463j4938k4929K635j730
18945D22557l0313j1499l968l519J6561K4324J3638J406k147K2373L323N645L4904
18932D93285K9440P031q216J553J809J6159K836K9414O4953L2046L8488L9653
18920G48451M9148M9566L0088O8242R3834J11270J00270J27605J26616J11241
18910A616331J00296J08807J38966J78223J71500J91935J89274K15438K80259
18901C191029L44195L90327M90346O28113R02749J292099K010926L099767M255666
18892A6605217M811122N131044N287773M862680L960961K770785K523819K929228
18884D8882629L156691L626075M439603L966241K438085J038134M99603p52842
$$ plain form
18876 67294219 64904414 62554182 61146907 60019708 58876961 57837781 56191902 53117990
18868 53117990 48620238 44145617 39614104 34792293 30586871 27286297 24781301 22792039
18860 22792039 21122495 19773482 18745973 17949606 17310801 16842066 16502906 16261148 16168470
18851 16168470 16261388 16582363 17216446 18318435 20184805 23324223 28226898 34522715 41359672
18842 41359672 48734681 56194271 62645698 67520185 70585578 73838418 77579990 81604677
18834 81604677 86746479 92662370 97519430 100188959 101696872 102053613 100147515 96166918
18826 96166918 92932550 90712070 88507185 86269331 83930557 80557451 75025673 68413213
18818 68413213 61867627 54969352 48089932 42387346 37903805 34333626 31384033 28845329
$$ packed form
18876F7294219k389805k350232j407275j127199j142747j039180j645879l073912
18868E3117990m497752m474621m531513m821811m205422l300574k504996j989262
18860B2792039j669544j349013j027509p96367o38805m68735l39160k41758r2678
18851A6168470R2918L20975O34083J101989J866370L139418M902675O295817O836957
18842D1359672P375009P459590O451427M874487L065393L252840L741572M024687
18834H1604677N141802N915891M857060K669529J507913L56741j906098l980597
18826I6166918l234368k220480k204885k237854k338774l373106n531778o612460
18818F8413213o545586o898275o879420n702586m483541l570179k949593k538704
$$ plain form
18810 28845329 26703238 24889174 23346161 22028983 20858706 19814002 18870250 17996219
18802 17996219 17203027 16470922 15825177 15249629 14775481 14312460 13897450 13521438 13216238
18793 13216238 12990189 12771889 12533589 12280851 12084311 11922157 11778465 11610922 11395730
18784 11395730 11170581 10976861 10821459 10655113 10384320 10095929 9826440 9545525 9316036
18775 9316036 9092409 8828339 8504361 8150386 7853629 7611228 7327460 7026117 6766185
18766 6766185 6557757 6368244 6161610 5937389 5719910 5517177 5327383 5170469 5006513
18757 5006513 4873949 4703157 4534310 4416363 4274141 4150325 4042995 3935769 3816787
18748 3816787 3700270 3568023 3452042 3375268 3291111 3210899 3123348 3054421 3007139 2943455 2882660
$$ packed form
18810B8845329k142091j814064j543013j317178j170277j044704r43752q74031
18802A7996219p93192p32105o45745n75548m74148m63021m15010l76012l05200
18793A3216238k26049k18300k38300k52738j96540j62154j43692j67543k15192
18784A1395730k25149j93720j55402j66346k70793k88391k69489k80915k29489
18775I316036k23627k64070l23978l53975k96757k42401k83768l01343k59932
18766F766185k08428j89513k06634k24221k17479k02733j89794j56914j63956
18757E006513j32564j70792j68847j17947j42222j23816j07330j07226j18982
18748C816787j16517j32247j15981p6774q4157q0212q7551o8927m7282o3684o0795
$$ plain form
18737 2882660 2841589 2796792 2734996 2704185 2654021 2599762 2561930 2518029 2490700 2497006 2473601
18726 2473601 2458149 2418719 2363865 2313164 2272597 2259386 2221085 2166906 2116361 2099924 2087130
18715 2087130 2071385 2053776 2023308 1989304 1950922 1945420 1931131 1898756 1893980 1870631 1850366 1838452
18703 1838452 1789803 1751833 1688316 1627315 1580768 1569446 1541412 1495191 1444127 1419765 1402988
18692 1402988 1379876 1374742 1356324 1320542 1289565 1215700 1178402 1166997 1165752 1196600 1206129 1217664
18680 1217664 1231473 1234636 1233214 1225682 1204399 1194151 1193708 1195246 1196473 1171867 1160944 1136592 1130945
18667 1130945 1119829 1135402 1144216 1132538 1172881 1216417 1259823 1291475 1338025 1420382 1511758
18656 1511758 1655245 1810119 1925310 2037288 2138020 2245090 2317046 2350439 2402392 2424019
$$ packed form
18737B882660m1071m4797o1796l0811n0164n4259l7832m3901k7329O306k3405
18726B473601j5452l9430n4854n0701m0567j3211l8301n4179n0545j6437j2794
18715B087130j5745j7609l0468l4004l8382n502j4289l2375m776k3349k0265j1914
18703A838452m8649l7970o3517o1001m6547j1322k8034m6221n1064k4362j6777
18692A402988k3112n134j8418l5782l0977p3865l7298j1405j245L0848R529J1535
18680A217664J3809L163j422p532k1283j0248m43J538J227k4606j0923k4352n647
18667A130945j1116J5573Q814j1678M0343M3536M3406L1652M6550Q2357R1376
18656A511758J43487J54874J15191J11978J00732J07070P1956L3393N1953K1627
$$ plain form
18646 2424019 2406825 2366882 2332751 2356839 2440625 2584855 2747831 2943333 3271015 3683484
18636 3683484 4151085 4744558 5495470 6474503 7787268 9625213 12328541 16417898 22820288
18627 22820288 32618525 46116281 62276773 78050043 90717661 97861448 98813584 93622907
18619 93622907 83505901 71117060 59290885 49610571 42231871 36426555 31667570 27749578
18611 27749578 24563549 21998773 20014135 18448660 17237610 16298167 15530274 14896539
18603 14896539 14319396 13760106 13238311 12776455 12376130 12013418 11697080 11418975 11154332
18594 11154332 10937163 10793302 10695424 10608513 10609592 10702848 10896510 11231321 11739882 12456118
18584 12456118 13526136 15074926 17316515 20602675 25492302 32782236 43407546 57709349
$$ packed form
18646B424019j7194l9943l4131K4088Q3786J44230J62976J95502L27682M12469
18636C683484M67601N93473P50912R79033J312765J837945K703328M089357O402390
18627B2820288R798237J3497756J6160492J5773270J2667618P143787R52136n190677
18619I3622907j0117006j2388841j1826175r680314p378700n805316m758985l917992
18611B7749578l186029k564776j984638j565475j211050r39443p67893o33735
18603A4896539n77143n59290n21795m61856m00325l62712l16338k78105k64643
18594A1154332k17169j43861r7878q6911J079R3256J93662L34811N08561P16236
18584A2456118J070018J548790K241589L286160M889627P289934J0625310J4301803
$$ plain form
18576 57709349 75335074 94781324 114373756 131619851 143461802 148211781 144790805
18569 144790805 135142986 121284341 105141516 89340352 75472657 64416409 55825932
18562 55825932 48961625 43315956 38610228 34743167 31654965 29106885 26951313 25164083
18554 25164083 23644451 22361955 21214938 20157638 19231610 18399230 17647590 16992386 16420019
18545 16420019 15888967 15391514 14975962 14598287 14230028 13920229 13618424 13319005 13149236
18536 13149236 13055783 13100625 13353065 13859115 14676271 15876211 17619552 20124179 23780401
18527 23780401 29202327 36821176 46365774 56443384 64901527 70387351 71868354 69275366
18519 69275366 63262872 54943826 46561269 39313048 33756485 29479290 26015291 23175915
$$ packed form
18576E7709349J7625725J9446250J9592432J7246095J1841951M749979l420976
18569A44790805r647819j3858645j6142825j5801164j3867695j1056248q590477
18562E5825932o864307n645669m705728l867061l088202k548080k155572j787230
18554B5164083j519632j282496j147017j057300r26028q32380p51640o55204n72367
18545A6420019n31052m97453m15552l77675l68259l09799l01805k99419j69769
18536A3149236r3453M4842K52440N06050Q17156J199940J743341K504627L656222
18527B3780401N421926P618849R544598J0077610Q458143N485824J481003k592988
18519F9275366o012494q319046q382557p248221n556563m277195l463999k839376
$$ plain form
18511 23175915 20835158 18930302 17364739 16067851 14990696 14071605 13293779 12608286
18503 12608286 11956008 11356190 10782894 10283410 9865102 9493766 9169261 8857684 8598004
18494 8598004 8314611 8077384 7868249 7618804 7339469 7064177 6822363 6605092 6374451
18485 6374451 6212291 6090965 6024523 6042057 6104972 6235278 6376568 6465988 6468645 6358327
18475 6358327 6150749 5837687 5507285 5165432 4881814 4666928 4474210 4306161 4168977
18466 4168977 4044811 3942292 3801730 3668196 3591618 3497451 3389034 3301015 3247764 3191164
18456 3191164 3103711 3040272 2938062 2870803 2805153 2757938 2671767 2604918 2552147 2516349 2461063
18445 2461063 2385613 2318056 2258620 2197966 2106817 2058945 2001173 1929809 1891220 1855054 1813603
$$ packed form
18511B3175915k340757j904856j565563j296888j077155r19091p77826o85493
18503A2608286o52278n99818n73296m99484m18308l71336l24505l11577k59680
18494H598004k83393k37227k09135k49445k79335k75292k41814k17271k30641
18485F374451j62160j21326o6442J7534O2915J30306J41290Q9420K657j10318
18475F358327k07578l13062l30402l41853k83618k14886j92718j68049j37184
18466D168977j24166j02519j40562j33534p6578r4167j08417q8019n3251n6600
18456C191164q7453o3439j02210o7259o5650m7215q6171o6849n2771l5798n5286
18445B461063p5450o7557n9436o0654r1149m7872n7772p1364l8589l6166m1451
$$ plain form
18434 1813603 1785902 1728050 1675192 1636110 1600137 1569163 1534101 1513000 1505589 1472380 1414535
18423 1414535 1339250 1280407 1262912 1256882 1256090 1270020 1245398 1201026 1200586 1205243 1198967 1187307 1170713
18410 1170713 1141400 1092988 1068443 1044283 1010748 977269 957810 947598 949516 925688 907571
18399 907571 893671 880408 875367 877535 867257 874757 838557 802481 802422 803310 774500 735898 719791
18386 719791 719650 694633 660036 620280 610630 618856 609525 602186 583395 590021 572258 606090 657368
18373 657368 680750 729573 744213 748107 751343 761958 784651 774538 787540 867464 928756 950642
18361 950642 972679 954987 924506 912050 897979 858720 849702 849718 817290 781086 768594 734943
18349 734943 726705 672931 610521 561208 527362 505190 477102 454232 414889 369862 363193 341295
$$ packed form
18434A813603k7701n7852n2858l9082l5973l0974l5062k1101p411l3209n7845
18423A414535p5285n8843j7495o030p92J3930k4622m4372m40M657o276j1660j6594
18410A170713k9313m8412k4545k4160l3535l3479j9459j0212J918k3828j8117
18399I07571j3900j3263n041K168j0278P500l6200l6076n9Q88k8810l8602j6107
18386G19791j41k5017l4597l9756r650Q226r331p339j8791O626j7763L3832N1278
18373F57368K3382M8823J4640L894L236J0615K2693j0113J3002P9924O1292K1886
18361I50642K2037j7692l0481j2456j4071l9259r018J6l2428l6204j2492l3651
18349G34943q238n3774o2410m9313l3846k2172k8088k2870l9343m5027o669k1898
$$ plain form
18337 341295 343996 330014 332218 313806 285766 272574 284061 301701 296644 278365 296447 319553
18325 319553 355277 394650 424185 468706 480525 494832 491472 480073 448929 455315 506921 548949
18313 548949 554524 561465 551784 564975 548125 543213 545567 516415 480862 438809 442829 501690 507580
18300 507580 444404 400922 363082 317768 307375 309645 303778 256116 219463 219823 214526 198950
18288 198950 187655 199480 236023 222054 188437 195057 187752 198651 213516 177701 189485 167423
18276 167423 167086 178471 166782 150373 155710 134646 168264 162464 147511 139589 128099 145159
18264 145159 128937 119209 132745 145758 151659 145666 172106 164195 154034 148947 165050 157201 130568
18251 130568 119739 129135 109545 83467 81851 89389 71489 101226 115736 87489 83166 96114
$$ packed form
18337C41295K701j3982K204j8412k8040j3192J1487J7640n057j8279J8082K3106
18325C19553L5724L9373K9535M4521J1819J4307l360j1399l1144O386N1606M2028
18313E48949N575O941r681J3191j6850m912K354k9152l5553m2053M020N8861N890
18300E07580o3176m3482l7840m5314j0393K270n867m7662l6653L60n297j5576
18288A98950j1295J1825L6543j3969l3617O620p305J0899J4865l5815J1784k2062
18276A67423l37J1385j1689j6409N337k1064L3618n800j4953p922j1490J7060
18264A45159j6222r728J3536J3013N901n993K6440p911j0161n087J6103p849k6633
18251A30568j0829R396j9590k6078j616P538j7900K9737J4510k8247m323J2948
$$ plain form
18239 96114 116657 118110 114437 102906 106256 122288 141355 151047 135678 119341 122909 107964 61072
18226 61072 60322 99777 88710 62899 75948 101574 86850 78104 70000 69644 86517 77411 97304
18213 97304 81664 54481 32233 44117 55255 52070 42159 56407 90119 98272 81765 53976
18201 53976 44862 39969 35853 60262 91008 59100 62540 71245 71933 115964 132323 108810 77846
18188 77846 66448 56491 37510 68425 60974 50185 60374 69772 62646 41236 34491 53575 73422
18175 73422 91246 78202 78208 57247 -1132 -5390 40242 37130 42844 55380 49892 41790 30190
18162 30190 8180 20028 24784 3066 8144 20357 16747 8248 14569 11079 34461 58403 36911
18149 36911 44719 78183 88651 82483 53454 55991 60721 55250 63208 71466 85631 114642 133894
$$ packed form
18239I6114K0543J453l673j1531L350J6032J9067R692j5369j6337L568j4945m6892
18226F1072p50L9455j1067k5811J3049K5626j4724q746q104l56J6873r106J9893
18213I7304j5640k7183k2248J1884J1138l185r911J4248L3712Q153j6507k7789
18201E3976r114m893m116K4409L0746l1908L440Q705O88M4031J6359k3513l0964
18188G7846j1398r957j8981L0915p451j0789J0189R398p126k1410o745J9084J9847
18175G3422J7824j3044Ok0961n8379m258M5632l112N714J2536n488q102j1600
18162C0190k2010J1848M756k1718N078J2213l610q499O321l490K3382K3942k1492
18149C6911P808L3464J0468o168k9029K537M730n471P958Q258J4165K9011J9252
$$ plain form
18136 133894 124661 136552 160748 151523 132183 137236 175245 209406 224432 245493 281115 308694
18124 308694 314061 333070 357771 391016 454202 529826 639826 762562 905326 1091242 1322038
18113 1322038 1640885 2119197 2878633 4145554 6316163 10302646 17014736 24162860 27638959
18104 27638959 25928922 19836976 14968810 12050115 10274442 8879562 7602470 6593395
18096 6593395 5811929 5125800 4511183 3972843 3578120 3238297 2984062 2793834 2608791
18087 2608791 2461836 2311659 2137781 1983480 1858313 1752830 1625525 1528181 1487442 1416505
18077 1416505 1332859 1298840 1269517 1239375 1196719 1130506 1089796 1052860 1005471 984738 969439
18066 969439 955972 924007 884864 860759 851696 810381 800695 766455 747426 724936 746591 753048
$$ packed form
18136A33894r233J1891K4196r225j9340N053L8009L4161J5026K1061L5622K7579
18124C08694N367J9009K4701L3245O3186P5624J10000J22736J42764J85916K30796
18113A322038L18847M78312P59436J266921K170609L986483O712090P148124L476099
18104B7638959j710037o091946m868166k918695j775673j394880j277092j009075
18096F593395p81466o86129o14617n38340l94723l39823k54235j90228j85043
18087B608791j46955j50177j73878j54301j25167j05483j27305r7344m0739p0937
18077A416505q3646l4019k9323l0142m2656o6213m0710l6936m7389k0733j5299
18066I69439j3467l1965l9143k4105r063m1315r686l4240j9029k2490K1655O457
$$ plain form
18054 753048 773712 804099 881322 960001 1067535 1168528 1261599 1316696 1356218 1317540 1263048
18043 1263048 1201729 1098754 965193 882100 785839 694956 640069 568876 525436 537352 546272
18032 546272 520099 498388 481959 449574 412206 400697 392091 350901 339825 335152 304731 257091
18020 257091 244355 276307 283688 296222 271922 276380 270252 253771 264234 261834 242490 250696
18008 250696 245436 254891 295947 305279 300029 309200 316371 353496 426378 514489 569436 613461 625753
17995 625753 622097 590284 513169 474051 448717 392170 341596 302258 270366 229030 202144 213722
17983 213722 237437 237851 217884 217376 206287 184873 207986 235891 224056 203017 166466 170859
17971 170859 158183 151274 169743 189440 171656 165163 145107 146989 155261 144904 118676 123671
$$ packed form
18054G53048K0664L0387P7223P8679J07534J00993R3071N5097L9522l8678n4492
18043A263048o1319j02975j33561q3093r6261r0883n4887p1193m3440J1916Q920
18032E46272k6173k1711j6429l2385l7368j1509q606m1190j1076m673l0421m7640
18020B57091j2736L1952P381J2534k4300M458o128j6481J0463k400j9344Q206
18008B50696n260R455M1056R332n250R171P171L7125P2882Q8111N4947M4025J2292
17995F25753l656l1813p7115l9118k5334n6547n0574l9338l1892m1336k6886J1578
17983B13722K3715M14j9967n08j1089k1414K3113K7905j1835k1039l6551M393
17971A70859j2676o909J8469J9697j7784o493k0056J882Q272j0357k6228M995
$$ plain form
17959 123671 169550 179605 161368 174534 187490 173992 147523 159067 150529 126562 110823 91884
17947 91884 85233 67210 54128 62864 97922 103408 109618 124515 127700 97323 81884 86602 99859
17934 99859 124116 125548 111542 80188 61336 46024 48703 79123 94347 110796 68383 63381
17922 63381 33258 18139 3954 13856 30263 32410 67835 46122 15074 3431 -19302 -5281
17910 -5281 17802 11082 -6147 2599 27424 36250 34023 15102 -8619 -19389 -15088 -2580 -1969
17897 -1969 13574 25132 22703 27152 35513 27240 26686 25104 19871 21201 28464 17713 17018 37114
17883 37114 60130 60889 39535 50498 56045 31155 17231 268 11160 25386 -14578 -21324
17871 -21324 8364 10837 22220 36952 18796 14377 16121 23765 35470 38380 45783 53464 28572
$$ packed form
17959A23671M5879J0055j8237J3166J2956j3498k6469J1544q538k3967j5739j8939
17947I1884o651j8023j3082Q736L5058N486O210J4897L185l0377j5439M718J3257
17934I9859K4257J432j4006l1354j8852j5312K679L0420J5224J6449m2413n002
17922F3381l0123j5119j4185R902J6407K147L5425k1713l1048j1643k2733J4021
17910e281K3083o720j7229Q746K4825Q826k227j8921k3721j0770M301J2508O11
17897a969J5543J1558k429M449Q361q273n54j582n233J330P263j0751o95K0096
17883C7114K3016P59k1354J0963N547k4890j3924j6963J0892J4226l9964o746
17871b1324K9688K473J1383J4732j8156m419J744P644J1705K910P403P681k4892
$$ plain form
17858 28572 50030 47073 22592 -3724 -11679 -18318 -48285 -45763 -29136 -17644 -16357 -15902 2925
17845 2925 -17180 -31723 -3615 38118 61109 49723 30279 28592 25856 43554 33522 42616
17833 42616 45939 37777 39570 25980 -15175 -28093 -26068 -5444 -2082 21780 47118 43295 27131
17820 27131 -3156 -8080 -9552 -4090 -6091 1764 -6735 3201 29756 58518 45843 27702 21338
17807 21338 2429 -22484 -1157 15776 7676 -19731 -19516 1900 -6374 14944 59837 56520 36944
17794 36944 23206 9997 17910 29325 33358 11031 3873 7748 22116 12473 1678 -8624 -16918
17781 -16918 -23091 -28166 -20158 -21669 -3747 -13857 -14703 -19965 -8007 8828 17000 25050 40086
17768 40086 34511 12637 -3205 6759 10697 14959 20221 10794 -4194 -3510 -4543 24220 11812
$$ packed form
17858B8572K1458k957k4481k6316p955o639k9967K522J6627J1492J287M55J8827
17845B925k0105j4543K8108M1733K2991j1386j9444j687k736J7698j0032R094
17833D2616L323q162J793j3590m1155j2918K025K0624L362K3862K5338l823j6164
17820B7131l0287m924j472N462k001P855q499R936K6555K8762j2675j8141o364
17807B1338j8909k4913K1327J6933q100k7407K15K1416q274K1318M4893l317j9576
17794C6944j3738j3209P913J1415M033k2327p158L875J4368r643j0795j0302q294
17781a6918o173n075Q008j511J7922j0110q46n262J1958J6835Q172Q050J5036
17768D0086n575k1874j5842R964L938M262N262r427j4988O84j033K8763j2408
$$ plain form
17755 11812 -6903 -9931 -6392 10376 7882 -16885 -26702 -5397 -4090 5697 -18534 -5633 33760
17742 33760 26705 5918 4200 13140 7986 491 20981 32991 17257 11749 1754 29194 18094
17729 18094 -8945 541 16411 33232 3488 -8034 -6043 -13175 -11883 -25049 -25398 -22313 -15278
17716 -15278 4153 -12358 -30657 -12789 5856 2804 33004 34215 -2026 -13527 -16136 -30176
17704 -30176 -37469 -28163 -32003 -375 6319 -27189 -23597 -10615 1668 -14090 -1281 -20538 -20098
17691 -20098 -4823 12727 39524 47177 27120 -5776 2020 28851 46882 71354 75382 41030
17679 41030 15081 14837 -771 -27865 -15112 18680 24917 2667 3011 30247 36517 30055 24380
17666 24380 -4408 -2634 6038 2982 12623 17301 -6226 -15792 15560 23725 16939 -8832 -32393
$$ packed form
17755A1812j8715l028L539J6768k494k4767r817K1305J307R787k4231J2901L9393
17742C3760p055k0787j718Q940n154p495K0490J2010j5734n508r995K7440j1100
17729A8094k7039R486J5870J6821k9744j1522J991p132J292j3166l49L085P035
17716a5278J9431j6511j8299J7868J8645l052L0200J211l6241j1501k609j4040
17704c0176p293R306l840L1628O694l3508L592J2982J2283j5758J2809j9257M40
17691b0098J5275J7550K6797P653k0057l2896P796K6831J8031K4472M028l4352
17679D1030k5949k44j5608k7094J2753L3792O237k2250L44K7236O270o462n675
17666B4380k8788J774Q672l056R641M678k3527r566L1352Q165o786k5771k3561
$$ plain form
17653 -32393 -52821 -69705 -52685 -6155 7017 10033 -9187 -16404 -5252 6180 15765 10349
17641 10349 26049 47880 52998 35828 1403 -10888 -13807 -3103 -31960 -52327 -51129 -46480
17629 -46480 -49208 -42036 -33601 -23077 -26175 -24915 25466 55848 37611 9775 -10142 -18177 -2224
17616 -2224 -5193 -13574 6670 13182 -4858 -19916 -13961 10782 16027 -16581 -17197 9706 26083
17603 26083 14450 8297 20920 -2634 -4856 1321 18012 1235 2208 6546 -9925 5287 10226
17590 10226 17209 6863 -13573 -10496 -26919 -30666 7076 43488 33411 5908 -29773 -59055
17578 -59055 -62257 -45918 -41949 -43219 -8102 -14990 -34287 -41351 -14597 -7019 5580 -10561 -8447
17565 -8447 -14549 7233 -14414 -39092 -38308 -23278 -8301 -17641 -36843 -29000 -31553 -48329 -51029
$$ packed form
17653c2393k0428j6884J7020M6530J3172L016j9220p217J1152J1432R585n416
17641A0349J5700K1831N118j7170l4425j2291k919J0704k8857k0367J198M649
17629d6480k728P172Q435J0524l098J260N0381L0382j8237k7836j9917q035J5953
17616b224k969q381K0244O512j8040j5058N955K4743N245l2608o16K6903J6377
17603B6083j1633o153J2623k3554k222O177J6691j6777R73M338j6471J5212M939
17590A0226O983j0346k0436L077j6423l747L7742L6412j0077k7503l5681k9282
17578e9055l202J6339L969j270L5117o888j9297p064K6754P578J2599j6141K114
17565h447o102K1782k1647k4678P84J5030J4977r340j9202P843k553j6776k700
$$ plain form
17552 -51029 -49863 -27936 -10911 3160 709 5633 -11973 -23198 -19046 -27988 -25366 -12119 9857
17539 9857 34806 36429 7039 -10662 -23049 14669 34509 -1253 -22209 -19033 -10344 4372
17527 4372 -675 -18092 -10278 -4968 -4473 4237 15593 31789 35886 25271 4543 -31325 -35032
17514 -35032 -35941 -23942 -23059 -24930 -37169 -31753 -31712 -35319 -29747 -19997 -6530 -21697 -43556 -40202
17500 -40202 -19867 -32512 -15232 -19492 -31112 -11959 -18931 -15243 17056 42673 51228 46516 6749
17487 6749 -12997 -16940 -16502 -5959 11122 29860 34920 9335 -15106 -47528 -26559 -23971 -38150
17474 -38150 -32008 -7734 -21580 -11291 -32145 -26704 -16220 -19155 -27278 -40121 -23843 -12810
17462 -12810 -16405 -13862 -9381 11160 7744 4337 8901 -5491 -26294 10821 30507 42870 23010
$$ packed form
17552e1029J166K1927J7025J4071k451M924j7606j1225M152q942K622J3247K1976
17539I857K4949J623k9390j7701j2387L7718J9840l5762k0956L176Q689J4716
17527D372n047j7417P814N310M95Q710J1356J6196M097j0615k0728l5868l707
17514c5032r09J1999Q83j871j2239N416M1l607N572R750J3467j5167k1859L354
17500d0202K0335j2645J7280m260j1620J9153o972L688L2299K5617Q555m712l9767
17487F749j9746l943M38J0543J7081J8738N060k5585k4441l2422K0969K588j4179
17474c8150O142K4274j3846J0289k0854N441J0484k935q123j2843J6278J1033
17462a2810l595K543M481K0541l416l407M564j4392k0803L7115J9686J2363j9860
$$ plain form
17449 23010 14490 -1312 9805 17496 31465 62109 54740 50465 74081 111481 154923 147646 77709
17436 77709 35211 41549 38864 -1738 -11266 5592 30871 20378 14529 28190 24308 13135 11188
17423 11188 6351 -25799 -52354 -59665 -46927 -14349 -13702 -14131 -9101 -15481 -8417 10418 -2459
17410 -2459 1301 13688 -721 -11028 5790 -2808 -690 -7175 7058 4355 -14923 -49844 -55811
17397 -55811 -61358 -54783 -30954 -27059 4815 17060 13862 29658 55210 55699 31413 2372 16782
17384 16782 30464 26856 35705 38762 22930 11970 6788 968 -19395 -35585 -32580 -1488 -2425
17371 -2425 3651 25383 11105 -4832 -7223 -42362 -39768 -18103 6744 -17010 -34434 -39973 -30438
17358 -30438 -34248 -27503 -3088 -6041 -3474 -24342 -15130 6615 19374 24566 24422 38030 46577
$$ packed form
17449B3010q520j5802J1117P691J3969L0644p369m275K3616L7400M3442p277o9937
17436G7709m2498O338k685m0602r528J6858K5279j0493n849J3661l882j1173j947
17423A1188m837l2150k6555p311J2738L2578O47m29N030o380P064J8835j2877
17410b459L760J2387j4409j0307J6818q598K118o485J4233k703j9278l4921n967
17397e5811n547O575K3829L895L1874J2245l198J5796K5552M89k4286k9041J4410
17384A6782J3682l608Q849L057j5832j0960n182n820k0363j6190L005L1092r37
17371b425O076K1732j4278j5937k391l5139K594K1665K4847k3754j7424n539R535
17358c0438l810O745K4415k953K567k0868R212K1745J2759N192j44J3608Q547
$$ plain form
17345 46577 16468 27685 37091 22172 9898 33467 42758 19117 8180 2695 7001 21442
17333 21442 50539 52064 20082 -24446 -45912 -42542 -37387 -23687 -17512 -32904 -3271 12712
17321 12712 10023 17964 31341 31606 32553 17993 21403 17503 46555 43017 18770 2170 -40785
17308 -40785 -61775 -53523 -27476 -17770 -13001 -23537 -60536 -49495 -29584 -869 11133 -5563
17296 -5563 -11170 -8148 -921 9399 27014 19174 5185 -3688 -12274 -30502 -28067 593 3555
17283 3555 8234 15144 27046 4613 9229 2432 -17479 11540 8977 -2160 -6344 -16852 -8781
17270 -8781 6309 -519 -43233 -47235 -43409 -41308 -60548 -61777 -27683 -6721 5207 9072 4497
17257 4497 -16845 -10764 -3644 -17242 -13606 -5403 24393 38717 -1362 -7245 12402 -2802 -2514
$$ packed form
17345D6577l0109J1217R406j4919j2274K3569R291k3641j0937n485M306J4441
17333B1442K9097J525l1982m4528k1466L370N155J3700O175j5392K9633J5983
17321A2712k689P941J3377K65R47j4560L410l900K9052l538k4247j6600m2955
17308d0785k0990Q252K6047R706M769j0536l6999J1041J9911K8715J2002j6696
17296e563n607L022P227J0320J7615p840j3989q873q586j8228K435K8660K962
17283C555M679O910J1902k2433M616o797j9911K9019k563j1137m184j0508Q071
17270h781J5090o828m2714m002L826K101j9240j229L4094K0962J1928L865m575
17257D497k1342O081P120j3598L636Q203K9796J4324m0079n883J9647j5204K88
$$ plain form
17244 -2514 -21739 -66011 -46920 -6531 5894 20604 30850 34793 19958 6241 1466 27039
17232 27039 49370 46575 19707 -13700 -20740 -35021 -38030 -16274 -1292 -33776 -37365 -31676 -33179
17219 -33179 -32202 -21940 -13695 15375 14829 -612 41286 27985 12890 9556 121 -8657 23687
17206 23687 39163 16957 -17892 -12074 -36973 -42542 -37829 -6666 -5414 -3591 21509 22489 23843
17193 23843 39590 19676 -1695 -24240 -3114 23048 1487 -25144 -33622 -27937 -3009 -25306
17181 -25306 -42398 -46469 -29233 -30515 -14428 -7511 11072 13079 -13532 -55679 -45851 -33622 -51536
17168 -51536 -39723 -45285 -55742 -59972 -28832 -27860 -24665 -19060 -6080 -5370 -23165 -30038 -21733 -31371
17154 -31371 -42445 -45781 -30510 -13363 5004 9771 9047 1586 -1844 10314 24193 5637 -7587
$$ packed form
17244b514j9225m4272J9091M0389J2425J4710J0246L943j4835j3717m775K5573
17232B7039K2331k795k6868l3407p040j4281l009K1756J4982l2484l589N689j503
17219c3179R77J0262Q245K9070n46j5441M1898j3301j5095l334r435q778L2344
17206B3687J5476k2206l4849N818k4899n569M713L1163J252J823K5100R80J354
17193B3843J5747j9914k1371k2545K1126K6162k1561k6631q478N685K4928k2297
17181b5306j7092m071J7236j282J6087O917J8583K007k6611m2147R828J2229j7914
17168e1536J1813n562j0457m230L1140R72L195N605J2980P10j7795o873Q305r638
17154c1371j1074l336J5271J7147J8367M767p24p461l430J2158J3879j8556j3224
$$ plain form
17141 -7587 -12598 -17515 -16394 -11300 -17968 14889 33970 38830 52951 27565 13402 18598 17493
17128 17493 42004 -5688 -27672 -27122 -44788 -48948 -47149 -10555 3149 -396 19565 24217 16665
17115 16665 -2467 -3288 -26414 -20123 -8164 -24153 -25685 -17771 2413 -9644 -9279 -27825 -55712
17102 -55712 -37844 -34835 -19702 -12595 -2351 13160 41987 48819 24526 -6611 6014 4200
17090 4200 -5131 -37389 -45821 -47802 -49984 -38467 -20570 -22629 -6667 2173 8055 5065 20059
17077 20059 18126 7154 -6505 -17081 -13306 -13380 13679 20799 -1520 4591 24308 15908 10353
17064 10353 11110 15025 16994 29883 34321 7904 -12379 6754 -12475 -13758 -23137 -30537 -41806
17051 -41806 -21333 13652 25136 -640 -9131 -22338 -8820 2703 16123 -15896 -19342 -6498
$$ packed form
17141g587n011m917J121N094o668L2857J9081M860J4121k5386j4163N196j105
17128A7493K4511m7692k1984N50j7666m160J799L6594J3704l545J9961M652p552
17115A6665j9132q21k3126O291J1959j5989j532P914K0184j2057L65j8546k7887
17102e5712J7868L009J5133P107J0244J5511K8827O832k4293l1137J2625j814
17090D200r331l2258q432j981k182J1517J7897k059J5962Q840N882k990J4994
17077B0059j933j0972j3659j0576L775p4K7059P120k2319O111J9717q400n555
17064A0353P57L915J969J2889M438k6417k0283J9133j9229j283r379p400j1269
17051d1806K0473L4985J1484k5776q491j3207J3518J1523J3420l2019l446J2844
$$ plain form
17039 -6498 11550 3487 14217 15378 15499 -10007 -37650 -19739 -11169 -20208 -21820 -3185 -1984
17026 -1984 -7294 -2064 -20258 -23225 -3998 22868 31910 29837 -1595 -12847 19760 30032 28606
17013 28606 23679 8217 5702 10910 27543 23857 24600 17082 -352 -12974 -2621 1278 -20455
17000 -20455 -18425 -18480 -12051 680 1979 9100 8718 -15544 -5827 28610 34959 13884 2316 13721
16986 13721 33167 36348 477 -22435 -36954 -12716 1101 12269 8920 -15533 -25494 -2303
16974 -2303 6907 -15687 -58632 -87296 -97057 -72171 -61178 -74887 -80831 -56634 -50352 -48281 -56233
16961 -56233 -38338 -26932 -17844 8017 19737 26151 -592 -7630 -4833 -49698 -68724 -40127
16949 -40127 -17809 -59 -18265 -43324 -37089 102 158 -15136 5183 28361 31920 36664 21710
$$ packed form
17039f498J8048q063J0730J161J21k5506k7643J7911Q570r039j612J8635J201
17026a984n310N230j8194k967J9227K6866R042k073l1432j1252L2607J0272j426
17013B8606m927j5462k515N208J6633l686P43p518j7434j2622J0353L899k1733
17000b0455K030n5O429J2731J299P121l82k4262R717L4437O349k1075j1568J1405
16986A3721J9446L181l5871k2912j4519K4238J3817J1168l349k4453r961K3191
16974b303R210k2594m2945k8664r761K4886J0993j3709n944K4197O282K071p952
16961e6233J7895J1406R088K5861J1720O414k6743p038K797m4865j9026K8597
16949d0127K2318J7750j8206k5059O235L7191N6j5294K0319K3178L559M744j4954
$$ plain form
16936 21710 17481 -2677 -16872 -11931 -3748 -11267 -24012 -31392 -30202 -1086 29915 38876 20789
16923 20789 -16274 -40917 -6072 7289 -8410 389 -7344 -38103 -32182 -2490 9236 5104
16911 5104 -6034 -3090 -2968 -11999 -19894 -18794 -3353 -10467 -20467 -25804 -38692 -35168 -47819 -12084
16897 -12084 1522 2690 -18212 -35885 -25915 -17072 -27983 -12348 -26603 -47301 -58766 -51089
16885 -51089 -34919 -31781 -15148 -36304 -53657 -53505 -21553 -2734 364 5129 -3581 -11394 -6745
16872 -6745 6453 15203 19759 -7955 -19405 12315 14268 19257 17914 -1468 -2582 -1867 -4401 -33237
16858 -33237 -33127 -11432 12881 25281 -22981 -41591 -14905 -14301 -12600 -12363 -24125 -22811 -16443
16845 -16443 -1880 12442 19426 8995 -24658 -15965 -9401 -32110 -49842 -47959 -56630 -50509 -51889
$$ packed form
16936B1710m229k0158j4195M941Q183p519j2745p380J190K9116L1001Q961j8087
16923B0789l7063k4643L4845J3361j5699Q799p733l0759N921K9692J1726m132
16911E104j1138K944J22r031p895J100J5441p114j0000n337j2888L524j2651L5735
16897a2084J3606J168k0902j7673R970Q843j0911J5635j4255k0698j1465P677
16885e1089J6170L138J6633k1156j7353J52L1952J8819L098M765q710p813M649
16872f745J3198Q750M556k7714j1450L1720J953M989j343j9382j114P15k534k8836
16858c3237J10K1695K4313J2400m8262j8610K6686O04J701K37j1762J314O368
16845a6443J4563J4322O984j0431l3653Q693O564k2709j7732J883q671O121j380
$$ plain form
16832 -51889 -45191 -47177 -21972 -21716 -23170 -18583 13201 -2694 2271 1925 9754 7949 17195 29019
16818 29019 17886 33847 40533 4954 -17635 -19999 -15258 -19816 -19518 5368 10285 11482 -7912
16805 -7912 -13393 -23350 -34000 -39072 -35715 -23954 4545 -3152 -23542 -35045 -26357 231 -19088
16792 -19088 -54880 -38453 -13747 -13301 -2900 -20000 -16182 -33037 -14599 2897 10370 14190 13073
16779 13073 17278 27875 22068 38619 5008 -12236 -31276 -43665 -71731 -44299 -33931 -7164
16767 -7164 8307 2180 -18325 -8015 2699 15054 5220 -4428 -31038 -23777 768 663 4423
16754 4423 -11352 -15976 -6061 -10054 -19447 -17817 -10494 -23125 -24440 -29508 -52771 -52084 -48505 -38610
16740 -38610 -24676 -9104 -30261 -39584 -37088 -20132 -49338 -53910 -27594 -28120 -39009 -11535 -13765
$$ packed form
16832e1889O698j986K5205K56j454M587L1784j5895M965l46P829j805R246J1824
16818B9019j1133J5961O686l5579k2589k364M741m558K98K4886M917J197j9394
16805g912n481r957j0650n072L357J1761K8499p697k0390j1503Q688K6588j9319
16792a9088l5792J6427K4706M46J0401j7100L818j6855J8438J7496P473L820j117
16779A3073M205J0597n807J6551l3611j7244j9040j2389k8066K7432J0368K6767
16767g164J5471o127k0505J0310J0714J2355r834r648k6610P261K4545j05L760
16754D423j5775m624R915l993r393J630P323j2631j315n068k3263O87L579R895
16740c8610J3934J5572k1157r323K496J6956k9206m572K6316n26j0889K7474k230
$$ plain form
16727 -13765 -21510 8999 11273 -3835 -14047 -20519 6025 16439 -18738 -43702 -24568 -10414
16715 -10414 -9819 -9998 -5407 -27774 -24488 13708 -2846 -10823 629 -1219 -24249 -17334 10214
16702 10214 24190 41401 38131 22994 12246 4130 -7491 -12494 -22744 -50155 -39969 -40048 -36311
16689 -36311 -31709 -36578 -27157 -17521 -21171 -24754 -42339 -39684 -38336 -20203 -26964 -33349 -8948 35813
16675 35813 37373 -11011 -20586 4892 17168 28057 4187 -838 1978 -18846 -27670 -21907 -22173
16662 -22173 -34548 -41353 -31306 -24453 14417 35979 48353 64774 50392 24467 64325 51804
16650 51804 21764 7440 9059 9506 -11793 -20690 -22575 -50030 -17090 21590 17139 11239 -6518
16637 -6518 6783 26802 26216 23670 -7346 -33440 -20546 -28623 -36911 -31251 -8297 2464 22262
$$ packed form
16727a3765p745L0509K274j5108j0212o472K6544J0414l5177k4964J9134J4154
16715a0414N95j79M591k2367L286L8196j6554p977J1452j848k3030O915K7548
16702A0214J3976J7211l270j5137j0748q116j1621n003j0250k7411J0186p9L737
16689c6311M602m869R421R636l650l583j7585K655J348J8133o761o385K4401M4761
16675C5813J560m8384r575K5478J2276J0889k3870n025K816k0824q824N763k66
16662b2173j2375o805J0047O853L8870K1562J2374J6421j4382k5925L9858j2521
16650E1804l0040j4324J619M47k1299q897j885k7455L2940L8680m451n900j7757
16637f518J3301K0019n86k546l1016k6094J2894q077q288N660K2954J0761J9798
$$ plain form
16624 22262 4323 -14747 -7997 -16277 6957 13982 819 20938 23446 24157 3679 -19292 -24932
16611 -24932 -17449 5098 4927 -26919 -24295 -39207 -66486 -47786 -35873 -6739 10902 8204 2450
16598 2450 11200 -11725 -1306 41177 39174 21013 -3626 -49497 -26002 -1554 5721 -11957
16586 -11957 -20650 -17702 -8766 -2097 1061 3486 6132 17228 23395 15177 8675 -4610 -5813 -21148
16572 -21148 -45827 -43583 -24992 -28319 -14942 -19202 -15644 -16751 -8731 19585 19437 28336 27887 -5179
16558 -5179 -28068 -41815 -8619 -1295 2570 10346 -4757 -24792 -36264 -25457 -42716 -58561
16546 -58561 -26876 6666 8405 8557 5870 4491 1545 4963 -22344 -31161 -26861 -25707 -22536 -16394
16532 -16394 1549 563 3270 1029 4900 -6525 -3964 -23883 -14959 -127 -3852 12440 -2636
$$ packed form
16624B2262j7939j9070O750q280K3234P025j3163K0119K508P11k0478k2971n640
16611b4932P483K2547j71l1846K624j4912k7279J8700J1913K9134J7641k698n754
16598B450Q750k2925J0419M2483k003j8161k4639m5871K3495K4448P275j7678
16586a1957q693K948Q936O669L158K425K646J1096O167q218o502j3285j203j5335
16572b1148k4679K244J8591l327J3377m260L558j107Q020K8316j48Q899m49l3066
16558e179k2889j3747L3196P324L865P776j5103k0035j1472J0807j7259j5845
16546e8561L1685L3542J739J52k687j379k946L418k7307q817M300J154L171O142
16532a6394J7943r86K707k241L871j1425K561j9919Q924J4832l725J6292j5076
$$ plain form
16519 -2636 -18290 -19276 -8387 -29618 -40501 -47459 -50525 -37994 10666 38043 63483 54028 49973
16506 49973 22054 -92 4396 -585 -17689 -19287 -13394 -10027 -1000 -2770 -5418 5283 24469
16493 24469 40485 35213 48379 29725 29104 32145 7532 16443 24895 -2268 -9035 3273 -5824
16480 -5824 -16989 -35659 -51151 -17268 4302 -2434 -10926 -10192 13463 31585 41628 10212 25997
16467 25997 23842 3920 9545 30628 40864 35387 2008 -14976 -14822 -28239 -34283 -49743 -49595
16454 -49595 -49813 -33433 -46486 -70745 -66372 -57310 -33691 -5830 6687 12587 16965 38005 25731
16441 25731 9971 18261 9172 -24164 -27518 -4253 19956 -64 -4792 -14289 -39946 -41297 -7108
16428 -7108 12759 5051 13641 16958 4070 9482 14762 17009 8226 -5075 -11964 -11912 4034 10734
$$ packed form
16519b636j5654r86J0889k1231j0883o958l066J2531M8660K7377K5440r455m055
16506D9973k7919k2146M488m981j7104j598N893L367R027j770k648J0701J9186
16493B4469J6016n272J3166j8654o21L041k4613Q911Q452k7163o767J2308r097
16480e824j1165j8670j5492L3883K1570o736q492P34K3655J8122J0043l1416J5785
16467B5997k155j9922N625K1083J0236n477l3379j6984J54j3417o044j5460J48
16454d9595k18J6380j3053k4259M373R062K3619K7861J2517N900M378K1040j2274
16441B5731j5760Q290r089l3336l354K3265K4209k0020m728r497k5657j351L4189
16428g108J9867p708Q590L317j2888N412N280K247q783j3301o889N2J5946O700
$$ plain form
16414 10734 9267 -12388 -21315 -28674 -36815 -33847 -21139 -29569 -18156 -3124 11087 6564 -13437
16401 -13437 -25520 -35344 -41804 -50691 -35984 -29935 -42396 -38065 -46087 -51924 -41357 -49451 -19760
16388 -19760 12507 4437 -7589 1133 -4389 -26945 -36457 -17110 -19805 -43663 -44829 -38429 -60113
16375 -60113 -79862 -68073 -42388 -5550 9361 -3820 -20388 -12681 -4136 450 -9963 -15021
16363 -15021 -16686 -35858 -44564 -26969 -38369 -55266 -45327 -39382 -2016 16078 25631 23531 4556
16350 4556 -5839 -21235 -34461 -502 25843 15221 3957 -24862 -34665 -29970 -40475 -73995
16338 -73995 -63939 -26066 -4282 -11404 -738 -21928 -27006 -19123 -27750 -46120 -54116 -39159 -50775
16325 -50775 -51531 -42336 -25165 -13410 -9143 14919 -758 10280 20217 12470 6584 389 -2676
$$ packed form
16414A0734j467k1655q927p359q141K968J2708q430J1413J5032J4211m523k0001
16401a3437j2083r824o460q887J4707O049j2461M331q022n837J0567q094K9691
16388a9760L2267q070j2026Q722n522k2556r512J9347k695k3858j166O400k1684
16375f0113j9749J1789K5685L6838J4911j3181j6568P707Q545M586j0413n058
16363a5021j665j9172q706J7595j1400j6897R939N945L7366J8094R553k100j8975
16350D556j0395j5396j3226L3959K6345j0622j1264k8819r803M695j0505l3520
16338g3995J0056L7873K1784p122J0666k1190n078P883q627j8370p996J4957j1616
16325e0775p56R195J7171J1755M267K4062j5677J1038R937p747n886o195l065
$$ plain form
16312 -2676 -20253 -19715 -22785 -16183 25654 35322 17183 8843 7803 12632 -10310 -57095 -49686 -26916
16298 -26916 2582 6040 15702 -2413 -28619 -27911 -33572 -29782 -25638 -12447 14947 32571 9456
16285 9456 -33743 -28154 -15174 -10751 -2336 -5100 -3508 1225 -11368 -13984 -25987 -23174 -41301
16272 -41301 -45864 -48264 -39242 -20419 11632 12486 32795 35605 9593 -12576 -7659 5375 3939
16259 3939 2787 588 485 45257 59406 34279 1899 7028 2903 -20823 -19078 -15333 -12619 -13698
16245 -13698 -1899 -1618 -22663 -32376 -28876 -14967 -25587 -21057 -12171 3495 1523 2132 -11480
16232 -11480 -11755 -9474 24160 46124 36039 5258 4324 20443 20152 15287 -16720 -24153 -29924 -12261
16218 -12261 15804 14611 572 -12595 -29875 -40744 -25620 8482 27603 29032 12036 1067
$$ packed form
16312b676j7577N38l070O602M1837R668j8139q340j040M829k2942m6785P409K2770
16298b6916K9498L458R662j8115k6206P08n661L790M144J3191K7394J7624k3115
16285I456m3199N589J2980M423Q415k764J592M733j2593k616j2003K813j8127
16272d1301m563k400R022J8823L2051Q54K0309K810k6012k2169M917J3034j436
16259C939j152k199j03M4772J4149k5127l2380N129m125k3726J745L745K714j079
16245a3698J1799K81k1045r713L500J3909j0620M530Q886J5666j972O09j3612
16232a1480k75K281L3634K1964j0085l0781r34J6119k91m865l2007p433n771J7663
16218a2261K8065j193j4039j3167j7280j0869J5124L4102J9121J429j6996j0969
$$ plain form
16206 1067 5742 -7884 -10467 2192 8942 7515 -8983 -17063 -19195 -21579 -35541 -25005 -3651
16193 -3651 -9621 14375 -9153 -46014 -35326 -19722 -31469 -20227 -24189 -28408 -14721 -16598 -10619
16180 -10619 -22424 -19334 2780 15594 8049 -44 -9758 -27834 -51372 -47018 -20959 5134 6725
16167 6725 6100 20114 38556 27704 15837 -3904 -16739 -36383 -40002 -40085 -53798 -37401 -25831
16154 -25831 -11061 -8268 -22475 -21896 -18217 -12829 293 8054 -10878 -31460 -40555 -23891 -25751
16141 -25751 -49354 -64244 -66466 -52535 -18907 -11821 -35997 -33217 -33072 -39142 -26798 -4387 -15798
16128 -15798 -36456 -38774 -47951 -67277 -78639 -76686 -65248 -52787 -54619 -63120 -52811 -45783 -38565
16115 -38565 -37635 -40716 -14644 -8246 562 -4181 18313 20108 6307 -17045 -11669 5492 2020
$$ packed form
16206A067M675j3626k583J2659O750j427j6498q080k132k384j3962J0536K1354
16193c651n970K3996k3528l6861J0688J5604j1747J1242l962m219J3687j877N979
16180a0619j1805L090K2114J2814p545q093r714j8076k3538M354K6059K6093J591
16167F725o25J4014J8442j0852j1867j9741j2835j9644l619q3j3713J6397J1570
16154b5831J4770K793j4207N79L679N388J3122P761j8932k0582r095J6664j860
16141b5751k3603j4890k222J3931L3628P086k4176K780J45o070J2344K2411j1411
16128a5798k0658k318r177j9326j1362J953J1438J2461j832q501J0309P028P218
16115c8565R30l081K6072O398Q808m743K2494J795j3801k3352N376J7161l472
$$ plain form
16102 2020 -7408 -34584 -21261 5609 36243 53965 38217 21919 6965 -27281 -16773 24714
16090 24714 20893 27502 7811 -8478 3063 -6889 -23239 -7039 29987 52462 9636 -2700
16078 -2700 12662 -4745 1237 -18488 5769 1193 -1936 -20303 -10112 5363 -2468 -29619 -30669
16065 -30669 -13190 -14056 -21476 19979 47216 29094 10465 -17726 -37202 -23213 -22694 -16582 -16056
16052 -16056 -11618 11437 28506 37174 29702 44908 64188 64547 49115 26037 -3588 -17802 10402
16039 10402 28027 20991 22681 8048 -12353 -22373 -10801 -10635 -7184 -1892 -12684 8364 30947
16026 30947 19424 960 -28196 -40590 -33990 -21637 -11034 24858 33461 36428 34178 29296 30572
16013 30572 19046 24525 10015 14502 -10784 -30271 -30493 -29838 -24805 -12465 -16055 -32587 -2618
$$ packed form
16102B020r428k7176J3323K6870L0634J7722j5748j6298j4954l4246J0508M1487
16090B4714l821O609j9691j6289J1541r952j6350J6200L7026K2475m2826j2336
16078b700J5362j7407N982j9725K4257m576l129j8367J0191J5475p831k7151j050
16065c0669J7479q66p420M1455K7237j8122j8629k8191j9476J3989N19O112N26
16052a6056M438K3055J7069Q668p472J5206J9280L59j5432k3078k9625j4214K8204
16039A0402J7625p036J690j4633k0401j0020J1572J66L451N292j0792K1048K2583
16026C0947j1523j8464k9156j2394O600J2353J0603L5892Q603K967k250m882J276
16013C0572j1526N479j4510M487k5286j9487k22O55N033J2340l590j6532K9969
$$ plain form
16000 -2618 -1218 7238 -716 -34418 -42359 -28243 -35018 -11758 -1409 -31999 -29163 -35996 -62999
15987 -62999 -22565 13826 11825 -34707 -52015 -59564 -29270 17121 29194 14958 870 7090
15975 7090 20119 46242 50431 25372 -9093 -7100 18111 26971 24540 23543 36770 46328 18176
15962 18176 -610 3406 4919 9013 12617 20148 3782 -10800 4989 1468 496 12982 34664
15949 34664 45392 19085 19108 28612 38453 41898 32457 12618 -12612 -21810 -14253 -16086 3216 29812
15935 29812 23400 22816 7146 9821 -19361 -49016 -67617 -53344 -50369 -13651 13022 9893 14635
15922 14635 -208 -23977 -44991 -35507 -17322 -23272 -3968 5665 10963 9062 -5399 -14581 -19414
15909 -19414 -36558 -26098 -9268 -21110 -22200 -10119 -23227 -18551 -31023 5334 35809 26523
$$ packed form
16000b618J400Q456p954l3702p941J4116o775K3260J0349l0590K836o833k7003
15987f2999M0434L6391k001m6532j7308p549L0294M6391J2073j4236j4088O220
15975G090J3029K6123M189k5059l4465J993K5211Q860k431r97J3227R558k8152
15962A8176j8786M016J513M094L604P531j6366j4582J5789l521r72J2486K1682
15949C4664J0728k6307K3R504R841L445r441j9839k5230r198P557j833J9302K6596
15935B9812o412n84j5670K675k9182k9655j8601J4273K975L6718K6673l129M742
15922A4635j4843k3769k1014R484J8185n950J9304R633N298j901j4461r182m833
15909a9414j7144J0460J6830j1842j090J2081j3108M676j2472L6357L0475r286
$$ plain form
15897 26523 35855 11914 -11808 -31714 -18719 18265 23186 52905 17556 2105 32788 36885
15885 36885 18733 10515 1166 -19277 -35478 -35840 -3432 -11887 -23798 -19742 -9153 -12126 -41170
15872 -41170 -42356 -37527 2962 19499 -6648 -26726 -19080 17978 40152 9192 -14174 -3991
15860 -3991 1038 18766 27953 -5269 -34537 -44468 -49383 -51192 -61924 -36190 -19219 -17788 -15548
15847 -15548 -34290 -36296 -8120 14963 21972 1619 -20847 -16383 -21431 -14476 -5725 -3196 32154
15834 32154 41921 23079 -9126 -3404 5724 -1992 11661 13323 -522 514 18213 -9749 -22152
15821 -22152 2835 9482 -1066 -2894 5360 -19659 -4637 11261 26368 19164 -2828 7104 10475
15808 10475 -8015 -27516 -33701 -39723 -22300 -21801 -18354 -12967 -2194 11216 9946 -10922 -12844
$$ packed form
15897B6523R332k3941k3722j9906J2995L6984M921K9719l5349j5451L0683M097
15885C6885j8152q218r349k0443j6201l62L2408q455j1911M056J0589k973k9044
15872d1170j186M829M0489J6537k6147k0078P646L7058K2174l0960k3366J0183
15860c991N029J7728R187l3222k9268r931m915j809j0732K5734J6971J431K240
15847a5548j8742k006K8176K3083P009k0353k2466M464n048O955Q751K529L5350
15834C2154R767j8842l2205N722R128p716J3653J662j3845J036J7699k7962j2403
15821b2152K4987O647j0548j828Q254k5019J5022J5898J5107p204k1992R932L371
15808A0475j8490j9501o185o022J7423M99L447N387J0773J3410j270k0868j922
$$ plain form
15795 -12844 -22324 -17347 -21805 5256 11261 -9698 -40154 -38949 -23361 -28693 -49140 -24606 -2752
15782 -2752 -23640 -48704 -69507 -70307 -61544 -45630 -38689 -18614 -12706 -7336 -3786 -1527 -15716
15769 -15716 -32624 -26306 -4953 33078 18313 15921 12052 6132 -3300 -21653 -30345 -49485 -65025
15756 -65025 -38044 -40114 -26675 13131 14087 -19891 -28400 -8606 17715 -5711 -20200 -14276 2340
15743 2340 31131 52499 42335 12694 -11317 -8271 -19640 -24857 -7215 -3516 -21085 -35386
15731 -35386 -31287 -24840 -14803 -4687 -8111 -37854 -37914 -38610 -57308 -47743 -45222 -44317 -27382 -2899
15717 -2899 13674 42504 29022 2449 -11166 -25069 -3774 -17102 -20001 -27077 5876 3882
15705 3882 -17804 6541 40417 40140 19080 -11071 -21369 -20411 -30371 -23993 -12576 -34054 -69019
$$ packed form
15795a2844r480M977m458K7061O005k0959l0456J205J5588n332k0447K4534K1854
15782b752k0888k5064k0803q00Q763J5914O941K0075N908N370L550K259j4189
15769a5716j6908O318K1353L8031j4765k392l869n920r432j8353q692j9140j5540
15756f5025K6981k070J3439L9806R56l3978q509J9794K6321k3426j4489N924J6616
15743B340K8791K1368j0164k9641k4011L046j1369n217J7642L699j7569j4301
15731c5386M099O447J0037J0116l424k9743o0o96j8698R565K521R05J6935K4483
15717b899J6573K8830j3482k6573j3615j3903K1295j3328k899p076L2953j994
15705C882k1686K4345L3876k77k1060l0151j0298R58r960O378J1417k1478l4965
$$ plain form
15692 -69019 -63199 -18613 -8976 -25057 -27698 -28612 -43836 -28369 -12602 10361 12163 -26353 -40766
15679 -40766 -18708 -7467 -5453 5792 27555 32764 17261 -5710 -13760 17126 14640 -12544
15667 -12544 -6110 -10083 -12272 -6969 -2412 -15630 -42617 -60274 -34522 2698 22032 27451 16511
15654 16511 7211 13195 4817 -5793 -128 -21012 -25753 -24267 -9457 5009 -4039 -15553 -23189
15641 -23189 -23612 -19915 -3944 15104 -9324 -16421 -10293 -38427 -14246 27014 40991 -4031 -25423
15628 -25423 13651 19288 12222 6330 3280 18322 11062 -4615 -5125 -26499 -31538 -45576 -46602
15615 -46602 -52019 -52485 -47708 -20752 -12391 -12637 -17307 -7815 -5159 -13962 -19075 -14490 -18616 -23308 -34966
15600 -34966 -31815 -20096 -42657 -34033 -17475 -12274 -17141 -9064 871 16053 34116 20352 -19857
$$ packed form
15692f9019N820M4586R637j6081k641r14j5224J5467J5767K2963J802l8516j4413
15679d0766K2058J1241K014J1245K1763N209j5503k2971q050L0886k486k7184
15667a2544O434l973k189N303M557j3218k6987j7657K5752L7220J9334N419j0940
15654A6511r300N984q378j0610N665k0884m741J486J4810J4466r048j1514p636
15641b3189m23L697J5971J9048k4428p097O128k8134K4181M1260J3977m5022k1392
15628b5423L9074N637p066n892l050J5042p260j5677n10k1374n039j4038j026
15615d6602n417m66M777K6956Q361k46m670R492K656q803n113M585m126m692j1658
15600c4966L151J1719k2561Q624J6558N201m867Q077R935J5182J8063j3764m0209
$$ plain form
15587 -19857 -35243 -21364 -1421 543 -3068 -1115 -12275 -27072 -18333 2850 -9359 -12530 11715
15574 11715 23159 38001 38265 13587 -17528 -26381 2085 168 -3364 -10517 -32018 -37031 -46294
15561 -46294 -29081 -19979 -137 -5653 -1132 8220 4740 -10405 -15140 21944 49216 33796 3098
15548 3098 -11959 -3906 18726 16447 -159 -17324 -2561 17429 25227 38188 33753 19295 -4340
15535 -4340 -8876 -15536 -38201 -22662 -9147 1721 -13014 -11563 3415 -3678 -9321 -7878 -51456
15522 -51456 -52812 -29941 -28837 -18816 -12681 -25549 -31504 -42584 -26745 -32402 -21365 -4030 -5195
15509 -5195 3442 28321 8265 -6884 -4001 -13886 -22684 -45571 -64325 -51557 -37770 -33026 -44883
15496 -44883 -29160 -17551 -12257 -10234 -6062 2333 7281 2998 3731 6405 7750 -3506 -18912 -6045
$$ packed form
15587a9857j5386J3879J9943J964l611J953j1160j4797Q739K1183j2209l171K4245
15574A1715J1444J4842K64k4678l1115q853K8466j917l532p153k1501n013r263
15561d6294J7213R102J9842n516M521R352l480j5145m735L7084K7272j5420l0698
15548C098j5057Q053K2632k279j6606j7165J4763J9990P798J2961m435j4458k3635
15535d340m536o660k2665J5539J3515J0868j4735J451J4978p093n643J443m3578
15522e1456j356K2871J104J0021O135j2868n955j1080J5839n657J1037J7335j165
15509e195Q637K4879k0056j5149K883r885q798k2887j8754J2768J3787M744j1857
15496d4883J5723J1609N294K023M172Q395M948m283P33K674J345j1256j5406J2867
$$ plain form
15482 -6045 14146 37231 24637 44325 46133 42915 21908 6160 4136 -2135 7629 2654 -1143
15469 -1143 -5402 -19555 -23712 -36653 -41084 -30578 -23675 -39477 -57668 -59431 -58869 -34617 -33032
15456 -33032 -28977 -18638 -6626 -7864 -5826 14232 25234 21061 6920 -2356 11187 -4338 -29827
15443 -29827 -15449 -9414 -16003 -31249 -27609 2033 -2373 1379 8680 3670 14332 17214 37717
15430 37717 43718 26993 316 5365 8139 10607 32502 44155 11763 -12851 -21430 -49481 -37097
15417 -37097 -16140 7496 11049 2426 -3439 -3193 -6867 -13088 -10529 -20885 -23726 -6301 -8116 -4595
15403 -4595 -169 -16877 -28714 -6660 -8767 -29020 -27144 -21980 -26746 -16922 240 -617 22209
15390 22209 21064 2240 10197 24581 31891 -11546 -13427 -22296 -66908 -47610 -27051 -43642 -47043
$$ packed form
15482f045K0191K3085j2594J9688J808l218k1007j5748k024o271R764m975l797
15469a143m259j4153m157j2941m431J0506O903j5802j8191j763N62K4252J585
15456c3032M055J0339J2012j238K038K0058J1002m173j4141r276J3543j5525k5489
15443b9827J4378O035o589j5246L640K9642m406L752P301n010J0662K882K0503
15430C7717O001j6725k6677N049K774K468K1895J1653l2392k4614q579k8051J2384
15417c7097K0957K3636L553q623n865K46l674o221K559j0356k841J7425j815L521
15403d595M426j6708j1837K2054k107k0253J876N164m766R824J7162q57K2826
15390B2209j145j8824P957J4384P310m3437j881q869m4612J9298K0559j6591l401
$$ plain form
15377 -47043 -35372 -25092 -25858 -10760 2685 5973 -9520 -20793 39 9177 8895 16793 1760
15364 1760 11084 25907 -12932 -4019 -5895 -9740 -1702 -8735 -44003 -66865 -88739 -66298 -33390
15351 -33390 -23857 -14323 9929 -21715 -45032 -23869 -11438 2860 924 34077 55843 34967
15339 34967 23028 42364 34765 -16504 -37397 -27147 -42916 -50791 -48947 -36276 -39155 -37612 -34943
15326 -34943 -37110 -26710 -24705 -16961 1970 13025 32612 31225 15822 640 -6721 -4112 -314
15313 -314 -5871 -4058 3440 -10076 -16796 -19057 -33050 -50734 -71534 -73202 -60664 -38458 -43220
15300 -43220 -43646 -49922 -33907 -19881 12593 37002 5041 -159 -1393 -31280 -24380 -17651 -7627
15287 -7627 -19811 -14185 -17619 -2043 13440 5909 -9908 -19315 -69211 -55153 -30002 -34680 -15412
$$ packed form
15377d7043J1671J0280p66J5098J3445L288j5493j1273K0832R138k82P898j5033
15364A760R324J4823l8839Q913j876l845Q038p033l5268k2862k1874K2441L2908
15351c3390R533R534K4252l1644k3317K1163J2431J4298j936L3153K1766k0876
15339C4967j1939J9336p599n1269k0893J0250j5769p875J844J2671k879J543K669
15326c4943k167J0400K005P744J8931J1055J9587j387j5403j5182p361K609L798
15313c14n557J813P498j3516o720k261j3993j7684k0800j668J2538K2206m762
15300d3220m26o276J6015J4026L2474K4409l1961n200j234k9887O900O729J0024
15287g627j2184N626l434J5576J5483p531j5817r407m9896J4058K5151m678J9268
$$ plain form
15274 -15412 -5292 -24716 -25324 -37811 -24221 11258 29184 44451 48816 32095 17182 16121
15262 16121 -9957 -21958 -12739 -2188 -7445 -15206 -43658 -53327 -47002 -48162 -49813 -51312 -63373
15249 -63373 -64938 -67412 -49600 -42955 -27140 -17921 -33113 -37277 -25153 -15012 -7206 -8594 -20530
15236 -20530 -21306 -18103 4289 65 3166 19447 22569 -13223 -21916 20843 14321 27012 53007
15223 53007 23411 1597 -18742 -877 24535 60950 64253 46186 21680 5993 16740 20453
15211 20453 28456 27898 15001 19304 26873 24516 29719 31960 43607 17668 11288 5484 -26740 -41934
15197 -41934 147 -9614 -1611 16590 12254 -584 11728 19535 -420 5778 14940 6854 6678
15184 6678 16071 15873 37856 1717 -12836 -1482 5230 41633 42691 21012 42924 35271 6354
$$ packed form
15274a5412J0120j9424o08j2487J3590L5479J7926J5267M365j6721j4913j061
15262A6121k6078j2001R219J0551n257p761k8452r669O325j160j651j499j2061
15249f3373j565k474J7812O645J5815R219j5192m164J2124J0141P806j388j1936
15236b0530p76L203K2392m224L101J6281L122l5792q693M2759o522J2691K5995
15223E3007k9596k1814k0339J7865K5412L6415L303j8067k4506j5687J0747L713
15211B0453Q003n58j2897M303P569k357N203K241J1647k5939o380n804l2224j5194
15197d1934M2081r761Q003J8201m336j2838J2312P807j9955O198R162q086j76
15184F678R393j98K1983l6139j4553J1354O712L6403J058k1679K1912p653k8917
$$ plain form
15171 6354 14777 23863 48385 40675 17803 11874 34071 35775 11008 7620 -4957 -3550 -18815
15158 -18815 10002 7260 -16971 -29619 -26228 -35870 -54584 -65523 -43366 -31567 -38347 -29713 -5162
15145 -5162 23595 56902 72383 37961 8655 18048 2142 -40778 -17683 -562 -15254 -39751
15133 -39751 -34716 -18301 4167 6355 12905 30 -20360 -25023 -8039 -25030 -21667 11537 -1390
15120 -1390 -49511 -77980 -64844 -59323 -48294 -31352 6332 17285 25130 -7908 -3755 -5121 -14715
15107 -14715 -54194 -86839 -65996 -30393 -9205 -17294 -6228 -9581 -17032 -22079 -8820 -1420 -1999
15094 -1999 8742 12760 -302 -9968 -3277 11714 -12619 -27777 -35226 -36104 -31361 -20489 -22805
15081 -22805 -26663 -93 6844 -8580 -11363 2207 -17658 -17607 -10322 -71 -4015 5072 12556 -3318
$$ packed form
15171F354Q423R086K4522p710k2872n929K2197J704k4767l388j2577J407j5265
15158a8815K8817k742k4231j2648L391r642j8714j0939K2157J1799o780Q634K4551
15145e162K8757L3307J5481l4422k9306R393j5906m2920K3095J7121j4692k4497
15133c9751N035J6415K2468K188O550j2875k0390m663J6984j6991L363L3204j2927
15120a390m8121k8469J3136N521J1029J6942L7684J0953P845l3038M153j366r594
15107a4715l9479l2645K0843L5603K1188q089J1066l353p451n047J3259P400n79
15094a999J0741M018j3062r666O691J4991k4333j5158p449q78M743J0872k316
15081b2805l858K6570O937j5424k783J3570j9865N1P285J0251l944R087P484j5874
$$ plain form
15067 -3318 13003 7136 -9313 -18001 1079 11063 20890 35083 22079 35936 37246 25659 5580
15054 5580 -25080 -20236 12185 -761 -2841 -6441 10327 14941 16284 25112 28775 8297 -25536
15041 -25536 -27942 -9786 4251 -2942 -6425 -19521 -7110 -17594 -31831 -35837 -37830 -34946 -31447
15028 -31447 -42019 -29309 -8928 -6125 7651 18002 15230 4006 -22062 -32796 -24494 -39611
15016 -39611 -57449 -50486 -46887 -16706 -7960 -464 -603 11526 21398 22837 28725 36839 58148 76950
15002 76950 121181 146724 208036 269569 315789 335670 343300 358001 374317 386703 389507 376802
14990 376802 349312 337244 335579 316024 272086 246760 189901 143038 144674 164416 149836 134963
14978 134963 96352 71349 65341 58583 57838 56587 43271 27823 32233 29021 42987 63985 63314
$$ packed form
15067c318J6321n867j6449q688J9080R984R827J4193j3004J3857J310j1587k0079
15054E580l0660M844L2421j2946k080l600J6768M614J343Q828L663k0478l3833
15041b5536k406J8156J4037p193l483j3096J2411j0484j4237m006j993K884L499
15028c1447j0572J2710K0381K803J3776J0351k772j1224k6068j0734Q302j5117
15016c9611j7838O963L599L0181Q746P496j39J2129R872J439N888Q114K1309J8802
15002G6950M4231K5543O1312O1533M6220J9881P630J4701J6316J2386K804j2705
14990C76802k7490j2068j665j9555m3938k5326n6859m6863J636J9742j4580j4873
14978A34963l8611k5003o008o758p45j251j3316j5448M410l212J3966K0998o71
$$ plain form
14965 63314 45754 29017 31966 40662 42341 30997 -3658 14090 26970 53120 58523 48470
14953 48470 62334 63927 51908 53148 46186 22727 -1379 15473 1354 -11976 21557 33400
14941 33400 26734 16869 -14982 -19857 -25415 -10561 -486 -13463 -4460 3433 5860 3619 13266
14928 13266 22808 8811 -17444 -13942 10888 20944 46898 23755 20522 26624 17138 23129 19657
14915 19657 1365 -4522 11131 17001 18636 32195 25675 38156 38595 65877 57201 30789 45496
14902 45496 39835 48945 40177 15564 2375 17933 21092 -9137 -28163 -46713 -29088 -15041
14890 -15041 -17731 13494 40657 40172 47496 63975 31406 7907 3563 -13 -9258 -13142 -10513
14877 -10513 -5748 -11656 11599 21492 20498 28218 17985 -11954 -8457 14293 36981 33266 51484
$$ packed form
14965F3314j7560j6737K949Q696J679j1344l4655J7748J2880K6150N403j0053
14953D8470J3864J593j2019J240o962k3459k4106J6852j4119j3330L3533J1843
14941C3400o666r865l1851m875n558J4854J0075j2977R003P893K427k241R647
14928A3266R542j3997k6255L502K4830J0056K5954k3143l233O102r486N991l472
14915A9657j8292n887J5653N870J635J3559o520J2481M39K7282q676k6412J4707
14902D5496n661R110q768k4613j3189J5558L159l0229j9026j8550J7625J4047
14890a5041k690L1225K7163m85P324J6479l2569k3499m344l576r245l884K629
14877a0513M765n908K3255R893r94P720j0233k9939L497K2750K2688l715J8218
$$ plain form
14864 51484 38559 29024 33341 52673 27168 -13078 -20134 -19735 -16296 10811 -9605 -25645 -25588
14851 -25588 -25103 -748 21438 23816 27749 11302 -19933 -28364 -52498 -45314 -30875 -1448 -7762
14838 -7762 2572 -23397 -46205 -52860 -51792 -29266 -35918 -29810 -24725 -34148 -40746 -48931 -36761
14825 -36761 -10588 -12110 -25420 -18916 -18979 -26133 -29961 -26524 -10431 -20294 -30565 -36383 -7167 2085
14811 2085 -20526 -27689 -17210 -1474 -2341 -15616 -19516 -17037 5961 35279 18415 15911 29676
14798 29676 39044 40558 21580 6449 -4710 -2124 -1310 -6372 -8745 -8161 5133 27189 32815 5014
14784 5014 -522 -1715 -2715 16125 30711 36899 23169 9100 31702 48758 21145 20239 26551
14771 26551 21331 5995 -330 27263 13975 -3702 12295 17291 13542 4634 -17066 -32514 -29799
$$ packed form
14864E1484j2925r535M317J9332k5505m0246p056L99L439K7107k0416j6040N7
14851b5588M85K4355K2186K378L933j6447l1235q431k4134P184J4439K9427o314
14838g762J0334k5969k2808o655J068K2526o652O108N085r423o598q185J2170
14825c6761K6173j522j3310O504o3p154l828L437J6093r863j0271n818K9216R252
14811B085k2611p163J0479J5736q67j3275l900K479K2998K9318j6864k504J3765
14798B9676R368J514j8978j5131j1159K586Q14n062k373N84J3294K2056N626k7801
14784E014n536j193j000J8840J4586O188j3730j4069K2602J7056k7613r06O312
14771B6551n220j5336o325K7593j3288j7677J5997M996l749q908k1700j5448K715
$$ plain form
14758 -29799 -9721 -21127 -28839 -21148 -23297 -18960 -14867 27565 38044 -3267 -19626 -161 30158
14745 30158 -446 -26483 -15542 -7205 3065 14463 25673 11019 -13880 -30337 -8983 7689
14733 7689 18849 22705 3493 11977 41562 64441 57651 50565 45009 39226 22570 49635 64466
14720 64466 42080 61749 78726 88839 92277 86397 58342 49506 50598 73095 84058 92864 71547
14707 71547 64766 73127 76514 68483 71278 64983 46442 52031 69871 67318 64928 61794 61793 63660 74099
14692 74099 89357 83090 84619 82033 75463 68759 70167 54789 57781 62150 58589 66758 44548 45755
14678 45755 70547 74890 41445 31404 37948 33542 40144 23865 24027 21871 24969 55438 87494
14665 87494 89782 76635 52748 38424 22066 24300 44983 37944 40555 40515 38269 69278 48838
$$ packed form
14758b9799K0078j1406p712P691k149M337M093M2432J0479m1311j6359J9465L0319
14745C0158l0604k6037J0941Q337J0270J1398J1210j4654k4899j6457K1354J6672
14733G689J1160L856j9212Q484K9585K2879o790p086n556n783j6656K7065J4831
14720F4466k2386J9669J6977J0113L438n880k8055q836J092K2497J0963Q806k1317
14707G1547o781Q361L387q031K795o295j8541N589J7840k553k390l134jJ867J0439
14692G4099J5258o267J529k586o570o704J408j5378K992M369l561Q169k2210J207
14678D5755K4792M343l3445j0041O544m406O602j6279J62k156L098L0469L2056
14665H7494K288j3147k3887j4324j6358K234K0683p039K611m0k246L1009k0440
$$ plain form
14652 48838 34485 45427 63677 46764 33685 7480 1083 27104 37242 71600 74387 48535
14640 48535 35242 45142 40803 49601 82202 88546 113477 109054 88983 41188 26200 27296 18802
14627 18802 6874 -1937 11479 31526 65076 43559 17776 1108 -3068 2553 19476 23879
14615 23879 18699 19980 17327 21953 12681 11131 39078 61771 81521 62135 63695 65922 48676
14602 48676 46914 52680 57081 28036 17350 23180 26287 7690 8403 16416 10992 10816 3142 7250
14588 7250 5852 27922 42897 22925 16981 38903 55545 47860 39018 16456 688 16176 38595
14575 38595 66949 64506 69389 55726 7944 -18051 1409 20871 46003 40139 14635 31818
14563 31818 46656 37765 21302 9226 8846 13154 34498 60930 75607 76775 65661 34544 26927
$$ packed form
14652D8838j4353J0942J8250j6913j3079k6205o397K6021J0138L4358K787k5852
14640D8535j3293R900m339Q798L2601O344K4931m423k0071m7795j4988J096q494
14627A8802j1928q811J3416K0047L3550k1517k5783j6668m176N621J6923M403
14615B3879n180J281k653M626r272j550K7947K2693J9750j9386J560K227j7246
14602D8676j762N766M401k9045j0686N830L107j8597P13Q013n424j76p674M108
14588G250j398K2070J4975j9972n944K1922J6642p685q842k2562j5768J5488K2419
14575C8595K8354k443M883j3663m7782k5995J9460J9462K5132n864k5504J7183
14563C1818J4838q891j6463j2076l80M308K1344K6432J4677J168j1114l1117p617
$$ plain form
14550 26927 19163 23759 33046 24645 9658 18436 27961 28684 11196 3248 36485 92928 121379
14537 121379 101583 87141 44928 16035 28907 18302 10537 19345 37740 62930 32825 2876
14525 2876 18152 37089 57164 34710 6104 17123 -787 -5408 44552 91156 93614 86752
14513 86752 80764 60011 46528 54483 53294 43484 43474 50943 60049 59859 49350 51854 73950 84580
14499 84580 97534 123584 131637 120880 150553 152510 151928 168942 172025 196357 200734 186202 177287
14486 177287 182025 213536 250066 319047 385677 478984 540207 519267 545486 519591 473986 428935
14474 428935 420527 421789 494463 574379 709954 930607 1216142 1583797 1985708 2406975 2770866
14463 2770866 3033583 3159970 3114097 2898498 2623574 2301190 1995882 1679995 1394058 1170213
$$ packed form
14550B6927p764M596R287q401j4987Q778R525P23j7488p948L3237N6443K8451
14537A21379j9796j4442m2213k8893J2872j0605p765Q808J8395K5190l0105k9949
14525B876J5276J8937K0075k2454k8606J1019j7910m621M9960M6604K458o862
14513H6752n988k0753j3483P955j189r810j0P469R106j90j0509K504K2096J0630
14499H4580J2954K6050Q053j0757K9673J957n82J7014L083K4332M377j4532q915
14486A77287M738L1511L6530O8981O6630R3307O1223k0940K6219k5895m5605m5051
14474D28935q408J262P2674P9916J35575K20653K85535L67655M01911M21267L63891
14463B770866K62717J26387m5873k15599k74924l22384l05308l15887k85937k23845
$$ plain form
14453 1170213 990776 880345 822587 758404 716142 692060 658168 636012 634636 641211 612553
14442 612553 558485 527719 516923 512255 468934 443943 426621 404105 370447 347022 325742 303923
14430 303923 299391 314400 299095 274289 250745 251848 234481 228516 226957 216449 234151 218833
14418 218833 199047 195069 180647 170392 162036 185396 197412 186934 183475 178937 195796 204994
14406 204994 200667 217996 220779 215181 220517 240981 231904 212185 195868 159313 157317 150441 151364
14393 151364 164436 160327 177208 163560 140937 137828 129581 119042 154001 163071 135445 122464
14381 122464 95520 102478 147815 177320 159421 124149 124954 126951 106356 78639 96321 84845
14369 84845 100766 122768 102017 109692 126022 152333 150707 140053 134557 82032 80859 72144 66442
$$ packed form
14453A170213j79437j10431n7758o4183m2262k4082l3892k2156j376O575k8658
14442F12553n4068l0766j0796m668m3321k4991j7322k2516l3658k3425k1280k1819
14430C03923m532J5009j5305k4806k3544J103j7367n965j559j0508J7702j5318
14418B18833j9786l978j4422j0255q356K3360J2016j0478l459m538J6859R198
14406B04994m327J7329K783n598N336K0464r077j9719j6317l6555j996o876R23
14393A51364J3072m109J6881j3648k2623l109q247j0539L4959R070k7626j2981
14381A22464k6944O958M5337K9505j7899l5272Q05J997k0595k7717J7682j1476
14369H4845J5921K2002k0751P675J6330K6311j626j0654n496n2525j173q715n702
$$ plain form
14356 66442 74375 49083 25626 24098 29416 32246 26274 33124 65001 74287 88862 102332 81092
14343 81092 80771 89956 101051 99927 104166 115731 135561 152567 133533 132732 113223 101521 132062
14330 132062 131111 141118 146281 136788 147251 123887 98889 98327 123293 144025 149211 147943 149244
14317 149244 108230 89299 120246 127327 123585 135053 137243 136769 133872 136308 172456 189483 218199
14304 218199 237976 239295 232377 267393 275757 282202 299195 322676 361019 379949 370471 399395
14292 399395 426467 444477 472286 522152 599240 650538 673252 689380 751004 818384 891456
14281 891456 979471 1082582 1157848 1246711 1379358 1527510 1652761 1816507 1991130 2208220
14271 2208220 2463136 2720762 2995478 3331296 3732175 4164151 4681362 5170321 5665155
$$ packed form
14356F6442P933k5292k3457j528N318K830n972O850L1877R286J4575J3470k1240
14343H1092l21R185J1095j124M239J1565J9830J7006j9034q01j9509j1702L0541
14330A32062r51J0007N163r493J0463k3364k4998n62K4966K0732N186j268J301
14317A49244m1014j8931L0947P081l742J1468K190m74k897K436L6148J7027K8716
14304B18199J9777J319o918L5016Q364O445J6993K3481L8343J8930r478K8924
14292C99395K7072J8010K7809M9866P7088N1298K2714J6128O1624O7380P3072
14281H91456Q8015J03111P5266Q8863J32647J48152J25251J63746J74623K17090
14271B208220K54916K57626K74716L35818M00879M31976N17211M88959M94834
$$ plain form
14262 5665155 6171293 6744629 7282405 7717203 8066282 8369809 8584892 8685264 8697395 8633091
14252 8633091 8448722 8153060 7827919 7452757 7023988 6602524 6175863 5793675 5472811
14243 5472811 5135110 4820845 4544165 4275970 4012836 3751055 3486632 3288800 3126885
14234 3126885 2989194 2842877 2681679 2532605 2401207 2270979 2169510 2046415 1935590
14225 1935590 1827855 1725520 1641591 1576616 1505803 1426649 1365964 1335914 1317268 1294456 1257572
14214 1257572 1239400 1234962 1194748 1145609 1095288 1062804 1045490 1038817 1004287 937066 895667 876327
14202 876327 868313 850548 809629 798433 789740 777179 740742 724885 764791 806278 804181 795618
14190 795618 821809 822140 822187 836196 837158 860814 861111 861084 842647 860382 907337 920467 906393 899844
$$ packed form
14262E665155N06138N73336N37776M34798L49079L03527K15083J00372J2131o4304
14252H633091j84369k95662l25141l75162m28769m21464m26661l82188l20864
14243E472811l37701l14265k76680k68195k63134k61781k64423j97832j61915
14234C126885j37691j46317j61198j49074j31398j30228j01469j23095j10825
14225A935590j07735j02335q3929o4975p0813p9154o0685l0050j8646k2812l6884
14214A257572j8172m438m0214m9139n0321l2484j7314o673l4530o7221m1399j9340
14202H76327q014j7765m0919j1196q693j2561l6437j5857L9906M1487k097q563
14190G95618K6191L31M7J4009R62K3656K97k7j8437J7735M6955J3130j4074o549
$$ plain form
14176 899844 871319 845791 817763 739973 696257 670370 637666 604723 570299 564705 554374 534765
14164 534765 502900 501832 484855 440456 402822 413619 417462 402499 411704 432001 431840 413628
14152 413628 436772 465732 455459 453843 473963 476920 453463 449907 452497 453131 454247 473474 486055
14139 486055 500867 529157 521109 484186 438175 432245 417882 422516 401461 396876 380830 367059
14127 367059 383995 403133 445814 464526 487720 477027 473231 519640 508233 478456 461083 456724
14115 456724 466355 463330 432518 395938 371692 358034 355904 351391 353070 379087 361168 345804
14103 345804 351857 356493 388857 401998 434695 456566 459517 459421 480247 521340 561137 571872 572356
14090 572356 585268 619350 643329 629745 609313 645412 671920 689320 712383 729828 742067
$$ packed form
14176H99844k8525k5528k8028p7790m3716k5887l2704l2943l4424n594j0331j9609
14164E34765l1865j068j6977m4399l7634J0797L843j4963R205K0297j61j8212
14152D13628K3144K8960j0273j616K0120K957k3457l556K590O34J116J9227J2581
14139D86055J4812K8290q048l6923m6011n930j4363M634k1055m585j6046j3771
14127C67059J6936J9138M2681J8712K3194j0693l796M6409j1407k9777j7373m359
14115D56724R631l025l0812l6580k4246j3658k130m513J679K6017j7919j5364
14103C45804O053M636L2364J3141L2697K1871K951r6K0826M1093L9797J0735M84
14090E72356J2912L4082K3979j3584k0432L6099K6508J7400K3063J7445J2239
$$ plain form
14079 742067 777708 828680 868476 880833 903745 938208 959442 992090 991226 1054748 1096874 1151906
14067 1151906 1259961 1305840 1346255 1382913 1426928 1460205 1460089 1428708 1378998 1320036 1276547
14056 1276547 1227808 1180208 1099896 1009843 945382 898854 878625 861434 867439 904079 945623
14045 945623 973446 1025097 1076171 1134707 1182209 1230254 1260804 1276275 1308464 1328648 1338375 1375525
14033 1375525 1431226 1493637 1547046 1591753 1660371 1743522 1808826 1881149 1952946 2025830 2140764
14022 2140764 2282568 2434099 2602176 2821408 3070385 3335395 3695012 4084802 4527950
14013 4527950 5032902 5612453 6305182 7100310 8051645 9260620 10753340 12606889 14823292
14004 14823292 17351548 20180465 23239298 26553299 30176356 34294270 39323089 45989562
$$ packed form
14079G42067L5641N0972L9796J2357K2912L4463K1234L2648q64O3522M2126N5032
14067A151906J08055M5879M0415L6658M4015L3277j16l1381m9710n8962m3489
14056A276547m8739m7600q0312r0053o4461m6528k0229j7191O005L6640M1544
14045I45623K7823N1651N1074N8536M7502M8045L0550J5471L2189K0184R727L7150
14033A375525N5701O2411N3409M4707O8618Q3151O5304P2323P1797P2884J14934
14022B140764J41804J51531J68077K19232K48977K65010L59617L89790M43148
14013D527950N04952N79551O92729P95128R51335J208975J492720J853549K216403
14004A4823292K528256K828917L058833L314001L623057M117914N028819O666473
$$ plain form
13996 45989562 55606351 70609902 94846004 132363091 184278898 250617183 326313217
13989 326313217 404935044 476965483 532026458 562553156 566777232 543470987 499997440
13982 499997440 443640359 382353692 324004992 272192355 230227671 198158508 173476037
13975 173476037 154052723 138571405 126209022 116257452 107973135 100796800 94359401
13968 94359401 88353449 82650602 77184108 71965362 67103294 62616274 58536246 54906253
13960 54906253 51693976 48905041 46444481 44309724 42469935 40786029 39264418 37856377
13952 37856377 36534436 35241974 34005780 32814048 31667942 30522173 29428888 28390733
13944 28390733 27382319 26410393 25468791 24623602 23861841 23110962 22412310 21776144 21133875
$$ packed form
13996D5989562R616789J5003551K4236102L7517087N1915807O6338285P5696034
13989C26313217P8621827P2030439N5060975L0526698M224076k3306245m3473547
13982D99997440n6357081o1286667n8348700n1812637m1964684l2069163k4682471
13975A73476037j9423314j5481318j2362383r951570q284317p176335o437399
13968I4359401o005952n702847n466494n218746m862068m487020m080028l629993
13960E4906253l212277k788935k460560k134757j839789j683906j521611j408041
13952C7856377j321941j292462j236194j191732j146106j145769j093285j038155
13944B8390733j008414r71926r41602q45189p61761p50879o98652o36166o42269
$$ plain form
13935 21133875 20520673 19928754 19390405 18901992 18412389 17972631 17585316 17257936 16912975
13926 16912975 16563689 16216035 15860063 15496647 15094199 14663379 14204545 13756299 13281199
13917 13281199 12836266 12391737 11963388 11558683 11178905 10826600 10478096 10152061 9859636
13908 9859636 9555324 9263187 9005576 8767752 8545340 8281060 8038132 7818771 7599622
13899 7599622 7400872 7219801 7062646 6925011 6782443 6652379 6539332 6441236 6341350 6260267
13889 6260267 6168106 6035581 5902050 5771651 5648064 5512203 5389874 5279552 5179008 5083979
13879 5083979 4981745 4878599 4790541 4711810 4599373 4530236 4472354 4387231 4294757 4231528 4180920
13868 4180920 4100850 4030679 3984752 3950064 3956412 3949660 3941266 3907559 3863821 3794830 3712336 3612649
$$ packed form
13935B1133875o13202n91919n38349m88413m89603m39758l87315l27380l44961
13926A6912975l49286l47654l55972l63416m02448m30820m58834m48246m75100
13917A3281199m44933m44529m28349m04705l79778l52305l48504l26035k92425
13908I859636l04312k92137k57611k37824k22412k64280k42928k19361k19149
13899G599622j98750j81071j57155j37635j42568j30064j13047r8096r9886q1083
13889F260267r2161j32525j33531j30399j23587j35861j22329j10322j00544r5029
13879E083979j02234j03146q8058p8731j12437o9137n7882q5123r2474o3229n0608
13868D180920q0070p0171m5927l4688O348o752q394l3707m3738o8991q2494r9687
$$ plain form
13856 3612649 3504920 3395991 3277324 3147322 3055955 2969665 2891842 2829618 2761803 2756675 2754480
13845 2754480 2742757 2727157 2706568 2706871 2682595 2635377 2598369 2538189 2465025 2419237 2395549 2364780
13833 2364780 2311322 2258268 2257328 2245952 2207673 2178908 2151085 2126242 2115123 2072384 2022955 1963994
13821 1963994 1927463 1898838 1853310 1801886 1761690 1758437 1758135 1724975 1680406 1598564 1570737 1556278
13809 1556278 1517887 1499206 1506264 1484311 1469559 1430412 1406513 1384796 1322955 1212433 1112039
13798 1112039 1062141 1054364 1006692 940391 886340 853863 833422 781883 749554 724460 704576
13787 704576 671100 652362 621066 610780 609172 605382 589571 561663 531204 521151 544257 574643
13775 574643 615419 588519 597076 580770 577575 583929 566216 544801 527761 481425 467611 470591
$$ packed form
13856C612649j07729j08929j18667j30002r1367q6290p7823o2224o7815n128k195
13845B754480j1723j5600k0589L03k4276m7218l7008o0180p3164m5788k3688l0769
13833B364780n3458n3054r40j1376l8279k8765k7823k4843j1119m2739m9429n8961
13821A963994l6531k8625m5528n1424m0196l253l02l3160m4569q1842k7827j4459
13809A556278l8391j8681P058k1953j4752l9147k3899k1717o1841j10522j00394
13798A112039m9898p777m7672o6301n4051l2477k0441n1539l2329k5094j9884
13787G04576l3476j8738l1296j0286j608l790j5811k7908l0459j0053K3106L0386
13775E74643M0776k6900Q557j6306l195O354j7713k1415j7040m6336j3814K980
$$ plain form
13763 470591 456682 404433 370342 349190 350179 342143 323276 321126 332565 354049 356755 346707
13751 346707 327047 324018 343455 353773 336783 312444 310777 314143 330914 341062 306932 302814
13739 302814 297313 292193 316316 325455 335869 331593 319295 339739 350807 373969 353225 345811
13727 345811 361892 357452 330412 288244 255671 258909 269331 299850 289170 281159 287402 296023
13715 296023 281986 274304 267992 248549 224505 229286 221095 188435 178780 185042 192484 190164 183603
13702 183603 190431 192258 189328 167783 174665 207978 220330 227882 231269 201057 183730 215924 239506
13689 239506 236977 253641 254890 257977 269622 273537 269493 272599 249074 229946 218503 243183 234750
13676 234750 221962 246510 232035 225173 213104 199452 212545 212379 221416 221905 220069 225349 208391
$$ packed form
13763D70591j3909n2249l4091k1152R89q036j8867k150J1439K1484K706j0048
13751C46707j9660l029J9437J0318j6990k4339j667L366J6771J0148l4130m118
13739C02814n501n120K4123R139J0414m276j2298K0444J1068K3162k0744p414
13727C45811J6081m440k7040m2168l2573L238J0422L0519j0680q011O243Q621
13715B96023j4037p682o312j9443k4044M781q191l2660r655O262P442k320o561
13702A83603O828J827k930k1545O882L3313J2352P552L387l0212j7327L2194K3582
13689B39506k529J6664J249L087J1645L915m044L106k3525j9128j1443K4680q433
13676B34750j2788K4548j4475o862j2069j3652J3093j66R037M89j836N280j6958
$$ plain form
13663 208391 211653 186148 176795 180572 193162 194022 202978 195313 174060 149673 146763 179906 197623
13650 197623 187609 193006 202283 201211 187348 178985 174154 157388 154839 149684 128208 124807 120582
13637 120582 108055 101849 103100 105039 65288 55655 73784 103647 108170 97744 75194 52542
13625 52542 74624 102107 126988 143254 127613 106709 125455 151117 145782 126685 131934 153656
13613 153656 171473 141164 102582 85122 70579 73120 72741 86797 95152 94288 117167 133914 101354
13600 101354 84330 88716 100900 102644 74397 52008 66317 95511 94423 71686 42296 31077
13588 31077 44610 48510 85966 133689 113588 94589 89670 75911 49043 34042 42936 43282 19685
13575 19685 41278 54443 53847 64786 44701 46409 72471 86692 85579 96088 102411 80155 49860
$$ packed form
13663B08391L262k5505r353L777J2590Q60Q956p665k1253k4387k910L3143J7717
13650A97623j0014N397R277j072j3863q363m831j6766k549n155k1476l401m225
13637A20582j2527o206J251J939l9751r633J8129K9863M523j0426k2550k2652
13625E2542K2082K7483K4881J6266j5641k0904J8746K5662n335j9097N249K1722
13613A53656J7817l0309l8582j7460j4543K541l79J4056Q355q64K2879J6747l2560
13600A01354j7024M386J2184J744k8247k2389J4309K9194j088k2737k9390j1219
13588C1077J3533L900L7456M7723k0101j8999m919j3759k6868j5001Q894L46k3597
13575A9685K1593J3165n96J0939k0085J708K6062J4221j113J0509O323k2256l0295
$$ plain form
13562 49860 35510 36767 46148 75859 86225 59778 60059 57572 70720 35550 54774 73277 85751
13549 85751 66241 73050 78909 76079 76752 67558 57889 47735 47365 67749 45516 37595 18886 -27773
13535 -27773 -75281 -77090 -67250 -79474 -108034 -88979 -57668 -40863 -9179 24235 40649 50243
13523 50243 78994 107024 135021 151496 175235 184418 204101 232527 250819 306032 354578 395218
13511 395218 498490 644992 909213 1269443 1650479 2059534 2463176 2846723 3095806 3171424
13501 3171424 3115385 2944473 2690544 2348217 1986228 1679075 1445248 1261771 1096940 952338
13491 952338 868297 791284 712859 633950 576249 561252 517863 483462 435615 398307 374754
13480 374754 331190 316216 300350 321066 325774 311613 288171 264548 251242 230198 227896 205860
$$ packed form
13562D9860j4350J257R381K9711J0366k6447K81k487J3148l5170J9224J8503J2474
13549H5751j9510O809N859k830O73r194r669j0154l70K0384k2233p921j8709m6659
13535b7773m7508j809R840j2224k8560J9055L1311J6805L1684L3414J6414R594
13523E0243K8751K8030K7997J6475K3739R183J9683K8426J8292N5213M8546M0640
13511C95218J03272J46502K64221L60230L81036M09055M03642L83547K49083P5618
13501C171424n6039j70912k53929l42327l61989l07153k33827j83477j64831j44602
13491I52338q4041p7013p8425p8909n7701j4997m3389l4401m7847l7308k3553
13480C74754m3564j4974j5866K0716M708j4161k3442k3623j3306k1044k302k2036
$$ plain form
13468 205860 220347 253169 253174 218150 190786 199670 173296 193789 192090 168996 151033 156746 145337
13455 145337 143850 134836 130639 127983 145205 118842 88322 90854 107954 108624 121839 123673 130097
13442 130097 143484 168001 169135 161536 139711 97389 73712 74492 87495 88138 70122 56479 40115
13429 40115 52182 50219 54066 72972 75509 89926 93761 64113 62838 46414 56264 66642 84699
13416 84699 77931 58779 43871 48984 72000 83784 81128 43150 16186 23503 49654 53644 31712
13403 31712 29889 32715 30730 39094 58327 60170 54151 58102 84865 70931 70720 64400 89895 109189
13389 109189 113577 97913 89133 83620 72095 56534 80121 66606 59313 61321 44518 40273 15776
13376 15776 27943 57003 70012 43637 12185 3055 18391 27595 18944 26265 65492 94367
$$ packed form
13468B05860J4487L2822Nl5024k7364Q884k6374K0493j699k3094j7963N713j1409
13455A45337j487r014m197k656J7222k6363l0520K532J7100O70J3215J834O424
13442A30097J3387K4517J134p599k1825m2322k3677P80J3003O43j8016j3643j6364
13429D0115J2067j963L847J8906K537J4417L835k9648j275j6424R850J0378J8057
13416H4699o768j9152j4908N113K3016J1784k656l7978k6964P317K6151L990k1932
13403C1712j823K826j985Q364J9233J843o019L951K6763j3934k11o320K5495J9294
13389A09189M388j5664q780n513j1525j5561K3587j3515p293K008j6803m245k4497
13376A5776J2167K9060J3009k6375l1452r130J5336R204q651P321L9227K8875
$$ plain form
13364 94367 91490 71386 68066 44713 58475 70856 63928 70760 33541 31960 9250 62193 110000
13351 110000 80752 84066 41972 50305 52151 55113 66621 49528 30817 44738 68841 92014
13339 92014 94918 97703 80689 63525 70062 62889 63836 72919 71486 71950 60121 49502 55717 51465
13325 51465 35591 48059 65149 68546 55499 37879 59840 74562 63075 38206 18815 -2421
13313 -2421 7594 54849 42601 30823 51766 77828 78663 50612 35268 47096 39441 33772 40988
13300 40988 57299 49288 50321 58503 47682 54712 55883 32702 10213 -190 -4059 39381 65708
13287 65708 61386 43735 54970 64811 62132 61533 69767 64940 56046 60461 80148 72882 76439 72217
13273 72217 77698 62057 23740 -6555 16880 70322 74223 43250 27698 19640 25995 30636 41072
$$ packed form
13364I4367k877k0104l320k3353J3762J2381o928O832l7219j581k2710N2943M7807
13351A10000k9248L314m2094Q333J846K962J1508j7093j8711J3921K4103K3173
13339I2014K904K785j7014j7164O537p173R47R083j433M64j1829j0619O215m252
13325E1465j5874J2468J7090L397j3047j7620K1961J4722j1487k4869j9391k1236
13313b421J0015M7255j2248j1778K0943K6062Q35k8051j5344J1828p655n669P216
13300D0988J6311q011J033Q182j0821P030J171k3181k2489j0403l869M3440K6327
13287F5708m322j7651J1235R841k679n99Q234m827q894M415J9687p266L557m222
13273G2217N481j5641l8317l0295K3435N3442L901l0973j5552q058O355M641J0436
$$ plain form
13260 41072 58298 44808 24605 21383 26901 35922 27687 -1553 7161 34942 50959 35778 34614
13247 34614 26787 43290 29053 27215 32287 5483 -1857 18321 48924 58009 60900 54201 43828
13234 43828 16766 9604 10562 14475 26598 38177 58167 40451 24611 33068 28300 693 -10337
13221 -10337 -4194 23735 35687 34214 21480 13182 16716 37258 15732 12391 38478 35335 28285
13208 28285 36929 32310 14203 21595 3654 10476 17077 17906 1906 -4342 -24666 -37636 -10727
13195 -10727 14647 -19141 -41678 -42880 -49334 -42635 -4193 34553 61180 45237 15590 -2416
13183 -2416 17681 31150 50956 60142 69267 49015 30859 18913 -4675 7031 -2462 -18284
13171 -18284 -14785 -12847 2757 2144 25369 21776 42801 51714 28612 3902 22256 32676 7692
$$ packed form
13260D1072J7226j3490k0203l222N518R021q235k9240Q714K7781J6017j5181j164
13247C4614p827J6503j4237j838N072k6804p340K0178L0603R085K891o699j0373
13234D3828k7062p162R58L913J2123J1579J9990j7716j5840Q457m768k7607j1030
13221a0337O143K7929J1952j473j2734q298L534K0542k1526l341K6087l143p050
13208B8285Q644m619j8107P392j7941O822O601Q29j6000o248k0324j2970K6909
13195a0727K5374l3788k2537j202o454O699L8442L8746K6627j5943k9647j8006
13183b416K0097J3469J9806R186R125k0252j8156j1946k3588J1706r493j5822
13171a8284L499J938J5604o13K3225l593K1025Q913k3102k4710J8354J0420k4984
$$ plain form
13158 7692 -12724 10291 43264 30589 -4141 -1344 18602 8522 13735 13616 -656 2091 -18784
13145 -18784 -42216 -74754 -71223 -27499 5122 21942 27786 40414 40110 4963 3449 18344 11032
13132 11032 20607 38305 46835 48989 40434 36730 30056 -823 -21131 -26159 -42790 -49728 -16524
13119 -16524 25355 26978 32176 50726 36578 21157 20730 17833 9220 17375 3494 18948 12197
13106 12197 3018 -9682 17660 23957 21927 24371 28543 28333 42213 -1554 -2759 11579 19596
13093 19596 9725 8566 18713 5959 -18616 -14882 -11507 -9477 -10782 6362 29574 2394 -20718
13080 -20718 -40171 -17680 6335 29886 50347 45518 40833 46033 47209 29552 23449 10785 28317
13067 28317 49761 35413 -792 -10566 -5980 43392 69747 46336 4660 166 15274 28650
$$ packed form
13158G692k0416K3015L2973j2675l4730K797J9946j0080N213j19j4272K747k0875
13145a8784k3432l2538L531M3724L2621J6820N844J2628l04l5147j514J4895p312
13132A1032R575J7698Q530K154q555l704o674l0879k0308n028j6631o938L3204
13119a6524M1879J623N198J8550j4148j5421m27k897q613Q155j3881J5454o751
13106A2197r179j2700K7342O297k030K444M172k10J3880m3767j205J4338Q017
13093A9596r871j159J0147j2754k4575L734L375K030j305J7144K3212k7180k3112
13080b0718j9453K2491K4015K3551K0461m829m685N200J176j7657o103j2664J7532
13067B8317K1444j4348l6205r774M586M9372K6355k3411m1676m494J5108J3376
$$ plain form
13055 28650 31653 40464 71005 73252 45208 30467 20394 40509 34745 22402 20406 26202 9796
13042 9796 3365 -10804 -8357 8712 15895 57538 62838 51198 28298 18732 26968 27120 27979 33618
13028 33618 17034 -5616 16414 40864 27186 15203 3242 -7423 6422 5523 36708 41267
13016 41267 43562 54269 73072 65107 37661 43096 26116 12459 10986 -6448 -14024 2667 -2652
13003 -2652 -5590 11590 680 -1695 25750 14636 10808 15370 15934 13830 15387 19519 19362 22237
12989 22237 5044 17275 52631 62825 35785 52450 81610 81065 74384 60773 22759 -18609
12977 -18609 -15505 3392 8107 5981 43126 61292 47320 19400 33298 55047 46902 29427
12965 29427 41519 52465 45900 14226 9765 11442 -4888 -12606 -30328 3093 6539 1354 1728
$$ packed form
13055B8650L003Q811L0541K247k8044j4741j0073K0115n764j2343j996N796j6406
13042I796o431j4169K447J7069P183M1643N300j1640k2900r566Q236J52Q59N639
13028C3618j6584k2650K2030K4450j3678j1983j1961j0665J3845q99L1185M559
13016D1267K295J0707J8803p965k7446N435j6980j3657j473j7434p576J6691n319
13003b652k938J7180j0910k375K7445j1114l828M562N64k104J557M132j57K875
12989B2237j7193J2231L5356J0194k7040J6665K9160n45o681j3611l8014m1368
12977a8609L104J8897M715k126L7145J8166j3972k7920J3898K1749q145j7475
12965B9427J2092J0946o565l1674m461J677j6330p718j7722L3421L446n185L74
$$ plain form
12952 1728 12850 11576 927 -3611 7872 18051 22438 22474 -1984 18701 35036 19451 -8864
12939 -8864 -13208 -21207 -6493 19218 3920 -285 -8029 -12124 -16927 6596 23135 29781 13743
12926 13743 11459 -13208 -37097 -29300 -649 2641 5296 18609 26492 18467 16678 46658 65550
12913 65550 51274 45429 22409 -3830 6748 9088 3181 20595 8235 8194 35803 39667 55778
12900 55778 81496 57513 50042 12696 25791 30438 52583 50184 40190 -6622 -14671 -8064 -10866
12887 -10866 -5790 15130 14544 37 13401 19709 46551 64484 59060 57959 62069 45594 48744
12874 48744 17388 -6887 2595 28268 6814 3627 45510 77256 61242 38854 42478 21474
12862 21474 16764 12290 -15797 -28195 8613 22462 697 24707 66991 71804 69792 61525 64517
$$ packed form
12952A728J1122j274j0649m538J1483J0179M387L6k4458K0685J6335j5585k8315
12939h864m344p999J4714K5711j5298m205p744m095m803K3523J6539O646j6038
12926A3743k284k4667k3889P797K8651L290K655J3313P883q025j789K9980J8892
12913F5550j4276n845k3020k6239J0578K340n907J7414j2360m1K7609L864J6111
12900E5778K5718k3983p471l7346J3095M647K2145k399r994m6812q049O607k802
12887a0866N076K0920n86j4507J3364O308K6842J7933n424j101M110j6475L150
12874D8744l1356k4275R482K5673k1454l187M1883L1746j6014k2388L624k1004
12862B1474m710m474k8087j2398L6808J3849k1765K4010M2284M813k012q267K992
$$ plain form
12849 64517 55036 17174 16608 30355 50011 46407 46099 25655 11881 8514 2087 1948 10560 -6989
12835 -6989 2722 -1950 11033 25984 18859 9822 25141 32551 19184 -6642 20205 31587 12763
12822 12763 -1831 35195 25564 20784 21044 31404 26985 44662 40604 11198 -5944 1892 20907
12809 20907 3144 -10121 -8583 8033 21298 32309 30146 8918 -7736 -12536 -5798 25588
12797 25588 24819 -15128 -42446 -15850 -21533 -20219 -10321 13438 46491 54631 62037 39717 20221
12784 20221 2491 8030 22853 42546 28552 21681 25042 59139 65386 72070 36593 19522 7216
12771 7216 15003 30522 36115 37026 47133 19265 -1196 7968 29203 29365 12982 -10588 -10349 -4175
12757 -4175 3307 8128 19360 41803 35296 7835 11821 29604 29076 26295 19729 27149 24915 9985
$$ packed form
12849F4517r481l7862n66J3747J9656l604l08k0444j3774l367o427j39Q612j7549
12835f989R711m672J2983J4951p125r037J5319P410j3367k5826K6847J1382j8824
12822A2763j4594L7026r631m780K60J0360m419J7677m058k9406j7142P836J9015
12809B0907j7763j3265J538J6616J3265J1011k163k1228j6654m800O738L1386
12797B5588p69l9947k7318K6596n683J314R898K3759L3053Q140P406k2320j9496
12784B0221j7730N539J4823J9693j3994o871L361L4097O247O684l5477j7071j2306
12771G216P787J5519N593R11J0107k7868k0461R164K1235J62j6383k3570K39O174
12757d175P482M821J1232K2443o507k7461L986J7783n28k781o566P420k234j4930
$$ plain form
12743 9985 13992 29668 2036 -27319 -41346 -2529 -15330 -20810 -21996 -30288 -40420 -23358 -10395
12730 -10395 3117 13824 30511 43178 59370 32907 14261 -571 23114 46669 52520 39746
12718 39746 3440 -14786 -5424 3515 -24532 -19899 7269 22834 15372 -1531 3416 18253 -4632
12705 -4632 -5239 28210 23184 4807 9306 -7396 -10744 -12361 4945 29536 21764 3715 -7721
12692 -7721 -23480 -41360 -59079 -58622 -34625 -11713 15298 8963 38294 40331 31028 -7364 -10547
12679 -10547 3494 18034 6406 54 7568 3151 -15504 -24888 3856 9045 -27628 -44122 -44414
12666 -44414 -26588 -8273 -13404 -23619 -2499 15733 2165 19605 60092 71571 50083 9310
12654 9310 3852 11759 -1801 -17548 17492 45361 34855 5217 -1004 5645 22005 14119 18149
$$ packed form
12743I985M007J5676k7632k9355j4027L8817j2801n480j186q292j0132J7062J2963
12730a0395J3512J0707J6687J2667J6192k6463j8646j4832K3685K3555N851j2774
12718C9746l6306j8226R362Q939k8047M633K7168J5565p462j6903M947J4837k2885
12705d632o07L3449n026j8377M499j6702l348j617J7306K4591p772j8049j1436
12692g721j5759j7880j7719M57K3997K2912K7011o335K9331K037r303l8392l183
12679a0547J4041J4540j1628o352P514m417j8655r384K8744N189l6673j6494k92
12666d4414J7826J8315n131j0215K1120J8232j3568J7440M0487J1479k1488m0773
12654I310n458P907j3560j5747L5040K7869j0506k9638o221O649J6360p886M030
$$ plain form
12641 18149 9037 -19212 -43539 -24389 -20229 -22599 -16619 12423 29527 18155 14373 9274 33601
12628 33601 34773 41827 45040 31905 817 9201 11662 -12124 -12348 27373 44013 32886 48300
12615 48300 79960 71500 36572 22107 -9083 -20147 5118 15618 13448 -695 -7000 -15282
12603 -15282 -28863 -21126 -8254 1455 -2647 -8003 -27227 -4200 -5339 319 10752 -15671 -18122
12590 -18122 -11506 -30150 311 20773 16397 8664 11459 -3506 -12075 13952 -12005 -26014 -1224
12577 -1224 8385 3600 7088 2381 -498 -22901 -27419 -1364 22294 37240 69062 53383 47394
12564 47394 25521 22762 7528 22900 20512 1612 25278 34527 40962 33223 5435 -11029 11263
12551 11263 8848 -12937 10362 30257 47096 37716 14068 3674 -11894 14550 27156 30535
$$ packed form
12641A8149r112k8249k4327J9150M160k370N980K9042J7104j1372l782n099K4327
12628C3601J172P054L213j3135l1088Q384K461k3786k24L9721J6640j1127J5414
12615D8300L1660q460l4928j4465l1190j1064K5265J0500k170j4143o305q282
12603a5282j3581P737J2872R709m102n356j9224K3027j139N658J0433k6423k451
12590a8122O616j8644L0461K0462m376p733K795j4965q569K6027k5957j4009K4790
12577a224R609m785L488m707k879k2403m518K6055K3658J4946L1822j5679n989
12564D7394k1873k759j5234J5372k388j8900K3666R249O435p739k7788j6464K2292
12551A1263k415k1785K3299J9895J6839r380k3648j0394j5568K6444J2606L379
$$ plain form
12539 30535 39477 40942 49064 27082 17534 18138 21398 10028 19152 9618 6546 -18333 -41257 -21154
12525 -21154 -510 4946 -4375 -18060 -2638 9262 3178 14446 35074 44907 30645 30093 40940
12512 40940 30808 2955 -16895 -2694 10335 10139 -3090 -17819 -34446 -41080 -55969 -53664
12500 -53664 -46306 -27625 -29771 -32124 -12690 3991 19274 51375 52062 48639 41602 13425 -4587
12487 -4587 -18638 -21786 -12366 -12995 -19878 7333 -13466 -23892 -4244 3045 17064 10530 -2108
12474 -2108 -8751 -16801 -31330 -31899 -23667 -10053 13411 18529 1872 -11878 -28105 -30494 -28875
12461 -28875 -25132 -13588 12044 7389 -12978 -46103 -43454 -14139 -24756 -45576 -54682 -63441 -37842
12448 -37842 -24138 -14018 1662 19489 6817 7142 -7663 10858 10703 26745 37264 32076 16102
$$ packed form
12539C0535Q942J465Q122k1982r548O04L260j1370R124r534l072k4879k2924K0103
12525b1154K0644N456r321j3685J5422J1900o084J1268K0628R833j4262n52J0847
12512D0940j0132k7853j9850J4201J3029j96j3229j4729j6627o634j4889K305
12500e3664P358J8681k146k353J9434J6681J5283L2101O87l423p037k8177j8012
12487d587j4051l148R420o29o883K7211k0799j0426J9648P289J4019o534j2638
12474b108o643q050j4529n69Q232J3614K3464N118j6657j3750j6227k389J619
12461b8875L743J1544K5632m655k0367l3125K649K9315j0617k0820r106q759K5599
12448c7842J3704J0120J5680J7827j2672L25j4805J8521j55J6042J0519n188j5974
$$ plain form
12435 16102 -27193 -41280 -28218 -18102 25510 8264 -33511 -43592 -15971 -6170 -45799 -44990
12423 -44990 -24444 -1407 27440 34726 45011 38297 -1242 240 4171 -683 31630 66292 43559
12410 43559 16077 27576 18850 -34585 -40664 -5292 20891 24303 24496 34537 29235 -1925 -22805
12397 -22805 -17870 -4634 1436 -13377 -29323 -34281 -9682 19284 18837 22242 18168 -2351 16378
12384 16378 50144 68328 50410 26910 19028 22465 36269 16882 12969 3764 -31228 -23010 -4754
12371 -4754 37681 23160 9821 16289 29801 57615 60188 37468 17285 -4566 -1476 -17222
12359 -17222 1741 25606 33921 4288 -10507 4820 5431 -19966 -39630 -26191 6198 15146
12347 15146 22459 1932 -11560 -5601 8297 -20353 -25400 -18948 -14950 -7190 -11609 -4186 -372
$$ packed form
12435A6102m3295j4087J3062J0116M3612j7246m1775j0081K7621R801l9629Q09
12423d4990K0546K3037K8847P286J0285o714l9539J482L931m854L2313L4662k2733
12410D3559k7482J1499q726n3435o079L5372K6183L412J93J0041n302l1160k0880
12397b2805M935J3236O070j4813j5946m958K4599K8966m47L405m074k0519J8729
12384A6378L3766J8184j7918k3500p882L437J3804j9387l913r205l4992Q218J8256
12371d754M2435j4521j3339O468J3512K7814K573k2720k0183k1851L090j5746
12359a7222J8963K3865Q315k9633j4795J5327O11k5397j9664J3439L2389Q948
12347A5146P313k0527j3492N959J3898k8650n047O452L998P760m419P423L814
$$ plain form
12334 -372 -7078 10361 27417 28234 40534 18472 -9608 -19877 -12605 -1221 -9924 -30441 -29004
12321 -29004 -16905 -11432 -4359 17525 37174 55321 39089 18449 13884 20700 41329 37114 11214
12308 11214 -8407 -23869 -29231 -33167 -19131 5941 22168 16930 10048 7539 9571 8154 2665
12295 2665 -1693 2900 -3245 -15291 -2096 3498 -7204 -4833 -21549 -287 633 -13366 -26426
12282 -26426 -28805 -31046 -11389 16446 30201 -16582 -34482 -29699 -29166 -32184 -24670 -8241 -3862
12269 -3862 -20231 -61618 -54247 -45901 -27264 -38671 -29390 -22834 -25762 4455 24075 11543 -17178
12256 -17178 -6472 3401 -5515 -7318 -3835 6330 21608 13151 17384 25641 4112 5647 2380
12243 2380 6923 13852 7411 3170 -13390 7883 25776 2681 -9451 -9510 -4189 24736 24136 17108
$$ packed form
12334c72o706J7439J7056Q17J2300k2062k8080j0269P272J1384q703k0517J437
12321b9004J2099N473P073K1884J9649J8147j6232k0640m565O816K0629m215k5900
12308A1214j9621j5462n362l936J4036K5072J6227n238o882k509K032j417n489
12295B665m358M593o145j2046J3195N594j0702K371j6716K1262R20j3999j3060
12282b6426k379k241J9657K7835J3755m6783j7900M783N33l018P514J6429M379
12269c862j6369m1387P371Q346J8637j1407R281O556k928L0217J9620j2532k8721
12256a7178J0706R873q916j803L483J0165J5278q457M233Q257k1529J535l267
12243B380M543O929o441m241j6560K1273J7893k3095j2132n9N321K8925o00p028
$$ plain form
12229 17108 205 25355 52350 49708 49408 23322 -17154 -26289 -44728 -29816 -30718 -10504 35514
12216 35514 16251 19939 13894 -19886 -8550 -9133 -12387 -2232 5338 1947 32986 27538 18662
12203 18662 5301 4609 9044 4659 -2138 -18757 -40386 -20218 -37792 -55839 -91977 -83147 -50281
12190 -50281 -6947 5814 -10551 -52420 -49653 -39192 -55494 -25316 7905 8258 -9094 -8037
12178 -8037 4786 19896 37863 27105 5247 19617 35612 26240 12006 -772 -256 -901 -7380
12165 -7380 19344 32246 29591 13091 14809 40718 42091 7814 19649 25468 3219 -13103 -24361
12152 -24361 -12036 12938 32942 47111 33440 15074 15913 6326 -20498 -13684 -4510 -18851 -35052
12139 -35052 -16750 21839 29895 16398 34587 21196 -16944 -12005 -9236 5442 29547 43481
$$ packed form
12229A7108j6903K5150K6995k642l00k6086m0476r135j8439J4912r02K0214M6018
12216C5514j9263L688o045l3780J1336n83l254J0155P570l391L1039n448q876
12203A8662j3361o92M435m385o797j6619k1629K0168j7574j8047l6138Q830L2866
12190e0281M3334J2761j6365m1869K767J0461j6302L0178L3221L53j7352J057
12178h037J2823J5110J7967j0758k1858J4370J5995r372j4234j2778N16o45o479
12165g380K6724J2902k655j6500J718K5909J373l4277J1835N819k2249j6322j1258
12152b4361J2325K4974K0004J4169j3671j8366Q39r587k6824O814R174j4341j6201
12139c5052J8302L8589Q056j3497J8189j3391l8140M939K769J4678K4105J3934
$$ plain form
12127 43481 48656 37408 66768 23797 -9738 -3235 13733 23067 18522 -5054 2037 10628 27793
12114 27793 15606 1108 -1095 16318 50182 70749 49624 9970 2160 -9620 -25361 -14756
12102 -14756 -9632 811 9967 7558 -736 -388 45085 23356 -5110 -7733 8963 -2481 -46356
12089 -46356 -26651 -3811 -9817 -42671 -64483 -60008 -42820 -16117 -4200 9496 35179 46213
12077 46213 28446 11330 41201 23333 -10985 -27737 -13032 -3681 -5047 -24302 2273 38996
12065 38996 32265 26564 42629 65218 76916 78974 94315 75610 22215 19453 28172 4481 -5675
12052 -5675 -8212 18372 6050 9592 52061 59638 48936 42865 35353 -1341 -28183 8673 28711
12039 28711 48779 44635 297 -18660 10872 -6179 -20442 523 10502 -23671 -38802 -16441
$$ packed form
12127D3481N175j1248K9360m2971l3535O503J6968R334m545k3576P091Q591J7165
12114B7793j2187j4498k203J7413L3864K0567k1125l9654p810j1780j5741J0605
12102a4756N124J0443R156k409q294L48M5473k1729k8466k623J6696j1444m3875
12089d6356J9705K2840o006l2854k1812M475J7188K6703J1917J3696K5683J1034
12077D6213j7767j7116K9871j7868l4318j6752J4705R351j366j9255K6575L6723
12065C8996o731n701J6065K2589J1698K058J5341j8705n3395k762Q719k3691j0156
12052e675k537K6584j2322L542M2469P577j0702o071p512l6694k6842L6856K0038
12039B8711K0068m144m4338j8957K9532j7051j4263K0965R979l4173j5131K2361
$$ plain form
12027 -16441 -18742 -1922 -8977 -9967 11264 27674 18614 3212 9093 -11600 -52612 -45532 -45028
12014 -45028 -24422 -19742 -27740 -24085 -34224 -30793 -28524 -19434 -17285 -13840 -23504 -10239 19714
12001 19714 20637 18210 37539 30873 16814 4379 9358 4450 6666 -8219 15155 9781 -5376
11988 -5376 -5267 7582 19603 -6887 -21378 -7068 -228 4315 12568 21554 -13396 -44155 -49428
11975 -49428 -20453 -1772 -13537 -24065 -14487 -21545 -29721 -29777 -24920 -36848 -40024 -44198 -19814
11962 -19814 -28056 -31025 -18610 5721 7608 -28615 -13874 -4934 -15136 -14001 -22948 -24483 -43949
11949 -43949 -45018 -21500 11175 486 5014 25222 36178 44051 33094 36078 33497 34284 27377
11936 27377 23300 48017 34575 12700 -5379 -7455 -15943 -41770 -32412 -38886 -34981 -27442 -38389
$$ packed form
12027a6441k301J6820p055r90K1231J6410r060j5402N881k0693m1012P080N04
12014d5028K0606M680p998L655j0139L431K269R090K149L445r664J3265K9953
12001A9714R23k427J9329o666j4059j2435M979m908K216j4885K3374n374j5157
11988e376J09J2849J2021k6490j4491J4310O840M543Q253Q986l4950l0759n273
11975d9428K8975J8681j1765j0528R578p058q176n6M857j1928l176m174K4384
11962a9814q242k969J2415K4331J887l6223J4741Q940j0202J135q947j535j9466
11949d3949j069K3518L2675j0689M528K0208J0956P873j0957K984k581P87o907
11936B7377m077K4717j3442k1875j8079k076q488k5827R358o474L905P539j0947
$$ plain form
11923 -38389 -38137 899 -15085 -29077 -21479 -27882 -24566 -15170 -30560 -21816 -9537 -33756 -40614
11910 -40614 -35446 -29343 -12541 -2986 3825 30385 30122 8407 -25305 -47822 -41143 -47587 -34202
11897 -34202 -8331 1180 -11453 -9838 26587 36270 20135 6672 -20644 -8582 13603 -5508
11885 -5508 -37733 -36560 -24463 3212 14874 -8552 -23940 -23705 -23770 -20885 -29084 -40112 -5116
11872 -5116 14510 11834 -12408 -27417 2913 27203 42576 65175 72303 42727 46270 31997
11860 31997 13456 5887 -6230 -13392 -28764 -23962 -52785 -44480 -32228 -2634 25608 -1500
11848 -1500 -28555 -19968 -11875 -31477 -46896 -32478 -35885 -51967 -47132 -46278 -36278 -16910 3348
11835 3348 23317 31235 5954 12462 32815 11332 -206 12341 27354 -7074 -26709 -3949
$$ packed form
11923c8389K52L9036j5984j3992P598o403L316R396j5390Q744J2279k4219o858
11910d0614N168O103J6802R555O811K6560k63k1715l3712k2517O679o444J3385
11897c4202K5871R511j2633J615L6425R683j6135j3463k7316J2062K2185j9111
11885e508l2225J173J2097K7675J1662k3426j5388K35o5K885q199j1028L4996
11872e116J9626k676k4242j5009L0330K4290J5373K2599P128k9576L543j4273
11860C1997j8541p569j2117p162j5372M802k8823Q305J2252K9594K8242k7108
11848a500k7055Q587Q093j9602j5419J4418l407j6082M835Q54J0000J9368K0258
11835C348J9969P918k5281O508K0353k1483j1538J2547J5013l4428j9635K2760
$$ plain form
11823 -3949 -16857 -13959 -10387 -20085 -4040 16613 2668 -29558 -42563 -47497 -35724 139 4728
11810 4728 -21390 -20686 -9851 -4642 9833 29060 32008 21657 719 -16820 -15714 -5418 26505
11797 26505 28219 3061 -2347 -4157 -7890 -571 -917 1277 -24548 -40955 -26569 18975 28339
11784 28339 30972 22889 12051 -9992 -32636 -32929 -47704 -38119 -40279 -19425 -3701 -9799 -11545
11771 -11545 -17490 -6591 -10735 8770 16775 13454 3191 -16425 -12484 -40034 -39825 -2620 14051
11758 14051 -3817 -14741 -13985 -21250 -34465 -8928 -1378 10558 28423 14288 -14315 -31017
11746 -31017 -28161 14787 38453 12607 10148 20844 27011 21845 19105 41043 56436 43797 40748
11733 40748 24719 21068 922 27179 35479 23762 33171 29117 1763 11294 22414 7702 -2303
$$ packed form
11823c949j2908K898L572r698J6045K0653j3945l2226j3005m934J1773L5863M589
11810D728k6118P04J0835N209J4475J9227K948j0351k0938j7539J106J0296L1923
11797B6505J714k5158n408j810l733P319l46K194k5825j6407J4386M5544R364
11784B8339K633q083j0838k2043k2644k93j4775R585k160K0854J5724o098j746
11771a1545n945J0899m144J9505Q005l321j0263j9616L941k7550K09L7205J6671
11758A4051j7868j0924P56p265j3215K5537P550J1936J7865j4135k8603j6702
11746c1017K856M2948K3666k5846k459J0696O167n166k740K1938J5393j2639l049
11733D0748j6029l651k0146K6257Q300j1717R409m054k7354R531J1120j4712j0005
$$ plain form
11720 -2303 -11049 18637 50108 25377 1568 -10379 -9695 -12623 -15651 -30363 -28362 -17162 -10843
11707 -10843 4352 12477 -15504 -9765 -19182 -26276 -13709 -18988 -33585 -34542 -24175 4167 -11573
11694 -11573 -11350 593 -3084 -37540 -27404 -6703 -34025 -45009 -48388 -42317 -19432 -7903 -9228
11681 -9228 2319 8774 7760 16027 9806 3329 6340 -4514 6729 37315 25136 11740 -18733
11668 -18733 -17737 -1092 10629 14710 47237 42576 -887 -19763 -17893 19149 37586 50270 83329
11655 83329 63447 43821 10138 -51043 -54172 -14678 11226 13273 9748 22624 33365 31498
11643 31498 34909 13757 16406 -17288 -43439 -50315 -14386 -7318 -27580 6598 9485 -7542 -9937
11630 -9937 -4136 -28685 -37893 5668 16906 27500 44369 23260 10115 8657 3380 6955 32172
$$ packed form
11720b303q746K9686L1471k4731k3809j1947O84k928l028j4712K001J1200O319
11707a0843J5195Q125k7981N739r417p094J2567n279j4597r57J0367K8342j5740
11694a1573K23J1943l677l4456J0136K0701k7322j0984l379O071K2885J1529j325
11681i228J1547O455j014Q267o221o477L011j0854J1243L0586j2179j3396l0473
11668a8733R96J6645J1721M081L2527m661m3463j8876J870L7042J8437J2684L3059
11655H3329j9882j9626l3683o1181l129L9494K5904K047l525J2876J0741j867
11643C1498L411k1152K649l3694k6151o876L5929P068k0262L4178K887j7027k395
11630i937N801k4549r208M3561J1238J0594J6869k1109j3145j458n277L575K5217
$$ plain form
11617 32172 12694 -5443 -5325 -10390 -17213 -23056 -14906 7918 38441 18688 1699 33858 59956
11604 59956 71081 61228 33907 35311 52982 42632 27218 8227 22390 219 -42232 -43554
11592 -43554 -24131 -25002 -19435 -8426 -1222 1906 24436 42018 38203 2269 -18368 -23640 -13597
11579 -13597 8822 -16891 -24783 -31166 -18715 -20465 -21276 20429 25327 36737 32834 5017 -7657
11566 -7657 -3094 -7412 -12875 -1638 -10718 -23993 -13509 -11967 -6754 -23128 -47620 -51453 -28910
11553 -28910 -4331 8148 -16639 -8573 21584 17809 13996 -5248 -13294 -5873 -20698 -4978 -19103
11540 -19103 -39494 -28673 -30498 8707 8166 -27077 -22904 -20608 -19581 -18826 -25234 -41411 -35972 -10400
11526 -10400 28504 45383 27836 57860 54026 32041 -2608 -14317 -4312 2752 1790 -4637 -8570
$$ packed form
11617C2172j9478j8137J18n065o823n843Q150K2824L0523j9753j6989L2159K6098
11604E9956J1125r853k7321J404J7671j0350j5414j8991J4163k2171m2451j322
11592d3554J9423q71N567J1009P204L128K2530J7582l815l5934k0637n272J0043
11579a3597K2419k5713p892o383J2451j750q11M1705M898J1410l903k7817j2674
11566g657M563m318n463J1237r080j3275J0484J542N213j6374k4492l833K2543
11553b8910K4579J2479k4787Q066L0157l775l813j9244q046P421j4825J5720j4125
11540a9103k0391J0821j825L9205n41l5243M173K296J027P55o408j6177N439K5572
11526a0400L8904J6879j7547L0024l834k1985l4649j1709J0005P064r62o427l933
$$ plain form
11513 -8570 -7300 8061 29290 27909 13324 20068 19027 20999 11146 2766 -20457 5876 24509
11500 24509 20274 2561 -10920 -25976 -16168 26362 26369 -12316 -17555 -1511 7180 28556 22987
11487 22987 20052 713 -29734 -16341 -8967 -11114 -17450 3287 -14396 -13583 2241 -25533 -24690
11474 -24690 -31986 -37932 -46797 -30956 -6659 2861 25598 30607 23394 15855 35164 35330 39255 32908
11460 32908 10567 10548 17952 13551 11722 15898 -6994 -16124 -28323 -50118 -51964 -26402 10515
11447 10515 13012 11923 15329 6217 10472 14844 6924 3345 15717 20159 16020 7128 8647 12739
11433 12739 -32407 -58716 -35119 -1559 13932 8263 1771 -16839 -1435 26836 16349 -13551
11421 -13551 -13827 -23821 -10147 5591 12586 -7431 -6386 -21618 -7329 7964 8227 14289 22628
$$ packed form
11513h570J270J5361K1229j381j4585O744j041J972r853q380k3223K6333J8633
11500B4509m235j7713j3481j5056R808M2530Pl8685n239J6044Q691K1376n569
11487B2987k935j9339l0447J3393P374k147o336K0737j7683Q13J5824k7774Q43
11474b4690p296n946q865J5841K4297R520K2737N009p213p539J9309J66L925o347
11460C2908k2341j9P404m401j829M176k2892r130j2199k1795j846K5562L6917
11447A0515K497j089L406r112M255M372p920l579J2372M442m139q892J519M092
11433A2739m5146k6309K3597L3560J5491n669o492j8610J5404K8271j0487k9900
11421a3551k76r994J3674J5738O995k0017J045j5232J4289J5293K63O062Q339
$$ plain form
11408 22628 46690 40211 44560 41762 22722 18125 11890 -13354 -20082 -13470 -11034 -27953 -29411
11395 -29411 -41993 -35904 -1748 22557 32359 16924 34973 27743 -8234 -27109 -27590 -18396 -7341
11382 -7341 -6822 -19568 4613 30475 35631 21218 17980 40041 29947 2312 -14249 21863 25504
11369 25504 9834 -23205 -22265 -27124 -11671 10738 1668 -7768 -16550 3113 -17872 -39839 -23683
11356 -23683 -24906 -1742 -24476 -34106 -22967 -10277 -29436 -16359 -5241 -10436 -10724 -18551 -29428
11343 -29428 -45788 -51949 -41362 -8570 -3705 -11053 -15608 -17930 -8594 -2097 -5510 -7073 11725
11330 11725 6789 -28356 -45122 -34476 -31411 -3921 4054 -7275 10292 12190 770 -20223
11318 -20223 -4907 -25871 -14121 -2564 -21653 -20336 -11691 -13392 -38024 -49276 -23022 -5816
$$ packed form
11408B2628K4062o479M349k798j9040m597o235k5244o728O612K436j6919j458
11395b9411j2582O089L4156K4305R802j5435J8049p230l5977j8875m81R194J1055
11382g341N19j2746K4181K5862N156j4413l238K2061j0094k7635j6561L6112L641
11369B5504j5670l3039R40m859J5453K2409r070r436q782J9663k0985k1967J6156
11356b3683j223K3164k2734r630J1139J2690j9159J3077J1118n195k88p827j0877
11343b9428j6360o161J0587L2792M865p348m555k322R336O497l413j563J8798
11330A1725m936l5145j6766J0646L065K7490P975j1329J7567J898j1420k0993
11318b0223J5316k0964J1750J1557j9089J317Q645j701k4632j1252K6254J7206
$$ plain form
11306 -5816 -17899 -23668 -36697 -35480 -49445 -35137 -16074 9696 12484 23025 26556 22067 27262
11293 27262 44576 35515 15945 -4972 42154 101579 139759 151020 153467 166418 186189 185406
11281 185406 170491 106973 83492 87478 87724 78487 56468 36445 21195 25410 28930 4928 -7183
11268 -7183 -5182 23206 27645 15054 7393 17419 9578 19925 4869 5681 -9769 -8300 -5208
11255 -5208 -1076 11875 -13753 -6363 14903 19250 11578 9507 6156 18135 -4650 -4294 36014
11242 36014 17011 -15836 -8696 8623 20278 9189 -9025 -41877 -55734 -64952 -51069 -50882
11230 -50882 -57160 -41339 -14134 8996 -20095 -34941 -30952 -22078 -1421 16543 27237 7578
11218 7578 12319 -11392 -56514 -46579 -19480 -10383 21144 40899 14964 26958 31799 -805 -1396
$$ packed form
11306e816j2083n769j3029J217j3965J4308J9063K5770K788J0541L531m489N195
11293B7262J7314r061j9570k0917M7126N9425L8180J1261K447J2951J9771p83
11281A85406j4915o3518k3481L986K46r237k2019k0023j5250M215L520k4002j2111
11268g183K001K8388M439j2591p661J0026p841J0347j5056Q12j5450J469L092
11255e208M132J2951k5628P390K1266M347p672k071l351J1979k2785L56M0308
11242C6014j9003l2847P140J7319J1655j1089j8214l2852j3857r218J3883J87
11230e0882o278J5821K7205K3130k9091j4846L989Q874K0657J7964J0694j9659
11218G578M741k3711m5122R935K7099R097L1527J9755k5935J1994M841l2604n91
$$ plain form
11205 -1396 -4300 -10864 -14625 -4976 12646 3824 17220 -20063 -33450 -6201 -3728 -2081 -10469
11192 -10469 -18554 -33560 -42583 -14984 13423 5859 3986 2095 -8736 -23438 -33196 -45108 -39153
11179 -39153 -27475 -7489 3282 3903 9475 20910 14162 -24026 -14213 24594 49845 39280 24328
11166 24328 36054 91103 132094 145895 149993 166546 157549 159188 171560 156931 122099 86415
11154 86415 70118 70705 56665 20770 15987 18923 42706 37173 19936 34302 56718 33813 5163
11141 5163 -10367 2827 40274 36171 17869 1918 -21891 -25196 4859 14896 27260 22030
11129 22030 2518 -3367 7954 17215 10667 -2149 8173 -10299 -38973 -40445 -14581 21523
11117 21523 3927 -7967 -4126 4688 2266 18390 34072 17098 16081 66089 64016 30766 32179
$$ packed form
11205a396k904o564l761R649J7622q822J3396l7283j3387K7249K473J647q388
11192a0469q085j5006r023K7599K8407p564j873j891j0831j4702r758j1912N955
11179c9153J1678J9986J0771O21N572J1435o748l8188R813L8807K5251j0565j4952
11166B4328J1726N5049M0991J3801M098J6553q997J639J2372j4629l4832l5684
11154H6415j6297N87j4040l5895m783K936K3783n533j7237J4366K2416k2905k8650
11141E163j5530J3194L7447m103j8302j5951k3809l305L0055J0037J2364n230
11129B2030j9512n885J1321R261o548j2816J0322j8472k8674j472K5864L6104
11117B1523j7596j1894L841Q814k422J6124J5682j6974j017N0008k073l3250J413
$$ plain form
11104 32179 28108 -2361 -10045 -6518 6381 -4192 6913 1177 19940 10571 20782 59971 63816
11091 63816 36455 19042 20234 18681 10340 31785 21242 -647 7815 -10529 -16328 9517 51497
11078 51497 12157 -5902 -895 30396 32994 17526 42627 50731 28231 20687 -10622 -18281 -23168
11065 -23168 -33827 -28066 -10224 -17502 -42963 -60338 -41074 -28596 -21107 -3932 5829 1956 8577
11052 8577 -4753 -13923 -15651 -11166 -15307 -10781 -18282 9905 19213 -15249 -35670 -27065 -31789 -24158
11038 -24158 -16036 -33638 -29899 -119 -11008 -23937 -47911 -56451 -39504 -35259 -39041 -20419 -13094
11025 -13094 6966 -3246 -12793 -14985 596 17727 34887 27112 21007 24940 35615 51748 32534
11012 32534 2816 11453 12496 -5011 -28025 -10517 18142 7940 -31898 -40315 -27372 -1784
$$ packed form
11104C2179m071l0469p684L527J2899j0573J1105n736J8763r369J0211L9189L845
11091F3816k7361j7413J192j553q341K1445j0543k1889Q462j8344n799K5845M1980
11078E1497l9340j8059N007L1291K598j5468K5101Q104k2500p544l1309p659m887
11065b3168j0659N761J7842p278k5461j7375J9264J2478P489J7175R761l873O621
11052H577j3330r170j728M485m141M526p501K8187R308l4462k0421Q605m724P631
11038b4158Q122j7602L739K9780j0889j2929k3974q540J6947M245l782J8622P325
11025a3094K0060j0212r547k192J5581J7131J7160p775o105L933J0675J6133j9214
11012C2534k9718Q637J043j7507k3014J7508K8659j0202l9838q417J2943K5588
$$ plain form
11000 -1784 10664 -235 -9586 -9764 644 12801 8436 24968 28352 19140 12770 8315 7895 23807
10986 23807 50217 77518 58185 19686 23071 15269 7351 31921 91794 107195 102760 90346
10974 90346 84881 79129 79414 113764 135327 131290 141739 164638 166656 175753 205256 207911 220917
10961 220917 222365 256956 296261 319307 344238 358417 392049 440485 463109 497571 515456 557714
10949 557714 600086 648106 701348 730622 773774 809871 852940 933357 973985 1002041 1027997
10938 1027997 1065723 1076154 1042124 978661 973372 932328 904366 872086 852064 815188 774836
10927 774836 732128 683911 644320 613609 562115 532861 505715 486816 444532 419365 386457
10916 386457 379605 369499 365057 366983 335594 322227 297544 276096 271918 289639 261946 275286
$$ packed form
11000a784J2448j0899r351j78J0408J2157m365J6532L384r212o370m455m20J5912
10986B3807K6410K7301j9333l8499L385p802p918K4570N9873J5401m435j2414
10974I0346n465n752K85L4350K1563m037J0449K2899K018R097K9503K655J3006
10961B20917J448L4591L9305K3046K4931J4179L3632M8436K2624L4462J7885M2258
10949E57714M2372M8020N3242K9274M3152L6097M3069Q0417M0628K8056K5956
10938A027997L7726J0431l4030o3463n289m1044k7962l2280k0022l6876m0352
10927G74836m2708m8217l9591l0711n1494k9254k7146j8899m2284k5167l2908
10916C86457o852j0106m442J926l1389j3367k4683k1448m178J7721k7693J3340
$$ plain form
10904 275286 264794 223432 174083 165837 167865 150030 131433 150413 169493 172458 173336 199155
10892 199155 188670 197005 183845 171339 161528 140734 119558 115056 110382 106955 82396 66025
10880 66025 75886 89752 84509 64147 65750 71251 62390 55325 49937 24773 59429 78666 68594
10867 68594 35093 54338 93738 72412 73856 73443 65496 61050 62124 91842 78914 71000 44792
10854 44792 35343 28921 35231 33183 35956 47486 41516 24958 16622 33716 48368 57755 52032
10841 52032 41094 25759 24850 31929 26660 28876 28903 25103 36768 58838 76910 78257 71458 53787
10827 53787 35523 37098 39993 15594 11132 24276 28507 544 5298 27828 29552 43354 44891
10814 44891 19934 5493 -12857 -13726 5481 17178 38288 35395 21780 32157 1286 -9077
$$ packed form
10904B75286j0492m1362m9349q246K028j7835j8597J8980J9080K965Q78K5819
10892A99155j0485Q335j3160j2506r811k0794k1176m502m674l427k4559j6371
10880F6025R861J3866n243k0362J603N501q861p065n388k5164L4656J9237j0072
10867F8594l3501J9245L9400k1326J444m13p947m446J074K9718j2928p914k6208
10854D4792r449o422O310k048K773J1530n970j6558q336J7094J4652R387n723
10841E2032j0938j5335r09P079n269K216K7l800J1665K2070J8072J347o799j7671
10827E3787j8264J575K895k4399m462J3144M231k7963M754K2530J724J3802J537
10814D4891k4957j4441j8350q69J9207J1697K1110k893j3615J0377l0871j0363
$$ plain form
10802 -9077 14350 16720 47462 35252 1773 17988 11204 -2109 33681 62885 66728 31711
10790 31711 10708 7873 74 15139 19369 26724 18600 -9423 -10144 -5843 -4511 -18301 -71062
10777 -71062 -87044 -76665 -53473 -17780 23229 -895 -32765 -33072 763 17495 10918 -5059
10765 -5059 -3696 -1858 -4483 -4198 -1422 684 -1444 4825 2465 -17306 -26716 -6664 -1310 -22713
10751 -22713 -17701 -13991 -38435 -59999 -48314 -35596 -168 5154 1205 -5368 -5068 -22330 -31456
10738 -31456 -25524 -12696 1515 20341 9696 -8469 12715 55600 40178 1654 11695 22053
10726 22053 37327 29004 -3228 -37678 -33085 -45280 -42392 -40282 -27088 -10509 6635 5497 12073
10713 12073 -625 -4865 638 19410 8329 871 -5433 -30565 -50836 -30231 -22702 -18293 -15718
$$ packed form
10802i077K3427K370L0742j2210l3479J6215o784j3313L5790K9204L843l5017
10790C1711k1003k835p799J5065M230P355q124k8023p21M301J332j3790n2761
10777g1062j5982J0379K3192L5693M1009k4124l1870l07L3835J6732o577j5977
10765e059J363J838k625K85K776K106k128O269k360j9771r410K0052N354k1403
10751b2713N012L710k4444k1564J1685J2718L5428N322l949o573L00j7262r126
10738c1456N932J2828J4211J8826j0645j8165K1184M2885j5422l8524J0041J0358
10726B2053J5274q323l2232l4450M593j2195K888K110J3194J6579J7144j138O576
10713A2073j2698m240N503J8772j1081p458o304k5132k0271K0605P529M409K575
$$ plain form
10700 -15718 -12995 -16104 -2030 -371 -35509 -23810 -26766 -18774 17031 7831 -17308 -19493 -10139
10687 -10139 -15704 -7204 -10510 -3332 10637 -14347 -12751 7816 11187 18003 41431 39334 7704
10674 7704 5335 -2494 -13346 7989 -3369 5005 13708 -5811 -12229 -24317 -32734 -53270 -60409
10661 -60409 -60232 -50287 -36270 6213 12238 -1586 5197 30408 35647 14260 26413 9062 421
10648 421 -3517 12756 13830 3710 5522 29700 8844 23759 28967 22818 37394 484 1825
10635 1825 6544 -8748 7366 17019 18474 16212 -1741 -12304 -32981 -18455 16256 31490 19345
10622 19345 219 5226 -6933 -23491 -7362 5533 -3155 -17484 8948 33746 61253 62498
10610 62498 31610 10218 7072 29499 25256 3343 -20033 -33568 -39092 3540 12251 4305 -1586
$$ packed form
10700a5718K723l109J4074J659l5138J1699k956P992L5805r200k5139k185R354
10687a0139n565Q500l306P178J3969k4984J596K0567L371O816K3428k097l1630
10674G704k369p829j0852K1335j1358Q374Q703j9519o418j2088q417k0536p139
10661f0409J77R945J4017M2483O025j3824O783K5211N239k1387J2153j7351q641
10648D21l938J6273J074j0120J812K4178k0856J4915N208o149J4576l6910J341
10635A825M719j5292J6114R653J455k262j7953j0563k0677J4526L4711J5234j2145
10622A9345j9126N007j2159j6558J6129J2895q688j4329K6432K4798K7507J245
10610F2498l0888k1392l146K2427m243k1913k3376j3535n524M2632Q711p946n891
$$ plain form
10597 -1586 7783 25147 22569 43516 26210 28388 20360 -31463 -20159 12375 4162 -12739 11871
10584 11871 12366 -10541 6137 -244 6283 23800 14556 21340 21744 19898 33011 22886 6532
10571 6532 14058 41027 11606 -27613 -46006 -21400 -8433 -17144 -5075 19006 38384 24440
10559 24440 8583 -17927 4402 16791 -24795 -55120 -41458 16664 42705 33756 11563 -28796
10547 -28796 -41395 -47142 -35868 -7151 3167 10910 -3020 11608 22797 18990 437 976 -5938
10534 -5938 -13073 -7843 7391 32068 42196 48921 13990 -4688 48 -15409 -13784 -19612 -44286
10521 -44286 -48463 -18103 -8105 -14594 -14878 -7279 377 -8326 2416 19136 59502 46496 36540
10508 36540 50965 49386 34224 16063 27999 22017 36618 20848 16174 48769 41100 5461
$$ packed form
10597a586R369J7364k578K0947j7306K178q028n1823J1304L2534q213j6901K4610
10584A1871M95k2907J6678o381O527J7517r244O784M04j846J3113j0125j6354
10571F532P526K6969k9421l9219j8393K4606J2967q711J2069K4081J9378j3944
10559B4440j5857k6510K2329J2389m1586l0325J3662N8122K6041q949k2193m0359
10547b8796j2599n747J1274K8717J0318P743j3930J4628J1189l807j8553N39o914
10534e938p135N230J5234K4677J0128O725l4931j8678M736j5457J625n828k4674
10521d4286m177L0360R998o489k84P599P656q703J0742J6720M0366j3006r956
10508C6540J4425j579j5162j8161J1936n982J4601j5770m674L2595p669l5639
$$ plain form
10496 5461 -3709 15487 1317 -16841 -7562 587 -4271 -21089 -12998 -13076 -26184 -43832 -25721
10483 -25721 -28595 -17746 -7880 -18182 -19253 -13068 352 332 -16350 -13384 -12547 -3138 23508 38927
10469 38927 34274 1125 -16068 -26890 -11297 -6037 -6745 27394 25299 3323 -6576 13046 16128
10456 16128 -10394 6274 16514 19483 -1474 -18706 3934 -22253 -33017 -26736 767 22419
10444 22419 1144 -32867 -24817 -6870 -7501 5338 -7255 10724 -13567 -45771 -43202 -22194
10432 -22194 0 16725 -2711 -1493 24155 66084 65245 26018 -13733 -14000 2278 21691 9988
10419 9988 22643 18222 -7516 9712 27908 25038 2401 4492 -12510 -8744 11962 4268 29353
10406 29353 26730 -20605 -33435 -28802 -30785 -9275 -28406 -28990 -9689 -519 -7915 -15493 -28962
$$ packed form
10496E461r170J9196j4170j8158R279Q149m858j6818Q091p8j3108j7648J8111
10483b5721k874J0849R866j0302j071O185J3420k0j6682K966Q37R409K6646J5419
10469C8927m653l3149j7193j0822J5593N260p08L4139k095k1976r899J9622L082
10456A6128k6522J6668J0240K969k0957j7232K2640k6187j0764O281K7503K1652
10444B2419k1275l4011Q050J7947o31J2839j2593J7979k4291l2204K569K1008
10432b2194K2194J6725j9436J218K5648M1929q39l9227l9751k67J6278J9413j1703
10419I988J2655m421k5738J7228J8196k870k2637K091j7002L766K0706p694K5085
10406B9353k623m7335j2830M633j983K1510j9131n84J9301R170p396p578j3469
$$ plain form
10393 -28962 -29270 -7716 11222 24655 23249 9189 2008 21125 23258 23022 16135 7264 391 -1197
10379 -1197 -6402 -8084 1417 14084 9473 520 36879 29236 13100 18049 35260 15456 -1343
10366 -1343 -9543 -8432 -9887 -565 7778 19530 30423 22810 -2249 -7906 7639 -21204 -37065
10353 -37065 -51707 -45733 1709 -3379 3188 -8327 -16830 -10469 -12254 -27763 -43842 -63884 -40779
10340 -40779 -29726 -17475 1130 -13210 -30311 -34858 -22680 -6227 13048 5279 -1159 19638
10328 19638 22921 -9996 -11015 -19421 -23216 -14647 -30480 -46187 -29422 -8290 -33121 -1927 22066
10315 22066 2094 -10770 4543 -13893 -36912 -27454 -18887 -6819 -4560 12190 15615 15658 19774
10302 19774 18124 27372 -9331 -23117 -13414 -14563 -22115 9440 34794 24759 1555 13716 -10888
$$ packed form
10393b8962l08K1554J8938J3433j406j4060p181J9117K133k36o887q871o873j588
10379a197n205j682R501J2667m611q953L6359p643j6136M949J7211j9804j6799
10366a343q200J111j455R322Q343J1752J0893p613k5059n657J5545k8843j5861
10353c7065j4642N974M7442n088O567j1515q503O361j785j5509j6079k0042K3105
10340d0779J1053J2251J8605j4340j7101m547J2178J6453J9275p769o438K0797
10328A9638L283l2917j019q406l795Q569j5833j5707J6765K1132k4831L1194K3993
10315B2066j9972j2864J5313j8436k3019R458Q567J2068K259J6750L425M3M116
10302A9774j650R248l6703j3786R703j149p552L1555K5354j0035k3204J2161k4604
$$ plain form
10289 -10888 -884 33834 34318 30966 9156 -2116 14700 26842 28532 16398 5134 18962
10277 18962 12812 -747 16327 31547 40542 27559 11484 10820 18007 9345 10664 36047 27967
10264 27967 8889 -1249 14073 27057 30462 32449 30440 2865 14310 25848 13017 14094
10252 14094 11094 16436 37384 36843 21930 13917 -5937 -19096 -7639 21163 19363 -7976 1663
10239 1663 37872 69818 69263 66532 48202 23083 27595 16013 16564 31041 29872 22444 14611 -7430
10225 -7430 302 9867 -3153 -7585 -9013 -16019 13177 21465 -8319 -29417 -12608 27609 49603
10212 49603 20102 2792 -11199 -35121 -24135 -1854 -28888 -39558 -28093 -18436 -11050 7807
10200 7807 27494 22978 1206 -27229 -17573 6993 22940 27161 21084 -4611 -19840 17663 29953
$$ packed form
10289a0888J0004L4718M84l352k1810j1272J6816J2142J690j2134j1264J3828
10277A8962o150j3559J7074J5220Q995j2983j6075o64P187q662J319K5383q080
10264B7967j9078j0138J5322J2984L405J987k009k7575J1445J1538j2831J077
10252A4094l000N342K0948n41j4913q013j9854j3159J1457K8802j800k7339R639
10239A663L6209L1946n55k731j8330k5119M512j1582N51J4477j169p428p833k2041
10225g430P732R565j3020m432j428p006K9196Q288k9784k1098J6809M0217K1994
10212D9603k9501j7310j3991k3922J0986K2281k7034j0670J1465R657P386J8857
10200G807J9687m516k1772k8435R656K4566J5947M221o077k5695j5229L7503J2290
$$ plain form
10187 29953 16309 5570 7526 17861 43572 56784 65634 75470 55190 67793 70012 49335
10175 49335 15148 896 33385 68498 63233 29655 9235 -9286 23043 58712 47663 40931
10163 40931 40318 50093 32250 28736 42560 18364 25440 11025 -14347 -13026 -30191 -55939 -32310
10150 -32310 11769 15512 -15514 -5721 1753 19883 14995 -146 3391 14486 9671 27952 31099
10137 31099 -2010 -21006 -24858 -17036 22928 30897 50941 51546 39207 4011 1462 32051 54351
10124 54351 45253 63046 68085 76667 63530 69079 70260 29082 18842 27643 21929 37654 26970
10111 26970 19856 28865 33598 33575 37877 36066 58992 54024 44852 55392 66951 89440 67709 67060
10097 67060 59414 37771 33499 23899 29017 36373 44852 50504 44790 -4909 -867 20845 9030
$$ packed form
10187B9953j3644j0739J956J0335K5711J3212Q850R836k0280J2603K219k0677
10175D9335l4187j4252L2489L5113n265l3578k0420j8521L2329L5669j1049o732
10163D0931o13R775j7843l514J3824k4196P076j4415k5372J321j7165k5748K3629
10150c2310M4079L743l1026R793P474J8130m888j5141L537J1095m815J8281L147
10137C1099l3109j8996l852P822L9964P969K0044O05j2339l5196k549L0589K2300
10124E4351r098J7793N039Q582j3137N549J181m1178j0240Q801n714J5725j0684
10111B6970p114R009M733k3M302j811K2926m968r172J0540J1559K2489k1731o49
10097F7060p646k1643m272r600N118P356Q479N652n714m9699M042K1712j1815
$$ plain form
10084 9030 15918 26585 53677 64118 42504 56907 51545 57863 62968 47289 56449 46893 46555
10071 46555 33774 28317 16780 7295 -1770 18426 28892 14489 -27607 -25505 -26802 -14504 14066
10058 14066 14885 51763 61744 43759 11797 -4351 -28035 -13709 13890 16451 15731 11900 3222
10045 3222 18053 10336 18729 32889 35113 29950 30004 46507 49287 49097 32839 48045 42584 15234
10031 15234 -2966 -2478 1536 27184 54138 32329 3851 35218 58704 45314 43375 38856 8882
10018 8882 18983 16144 14155 20984 42025 49242 34901 18921 38390 36699 47810 38208 23237
10005 23237 21909 11979 3398 -8015 26643 29605 38331 49391 51210 16499 15037 46165 67563
9992 67563 78501 74044 62512 83332 67380 50042 53574 59082 72812 91671 98850 100284 95817
$$ packed form
10084I030O888J0667K7092J0441k1614J4403n362O318N105j5679R160r556l38
10071D6555j2781n457j1537r485r065K0196J0466j4403m2096K102j297J2298K8570
10058A4066Q19L6878R981j7985l1962j6148k3684J4326K7599K561p20l831q678
10045C222J4831p717Q393J4160K224n163N4J6503K780j90j6258J5206n461k7350
10031A5234j8200M88M014K5648K6954k1809k8478L1367K3486j3390j939m519k9974
10018H882J0101k839j989O829K1041P217j4341j5980J9469j691J1111r602j4971
10005B3237j328r930q581j1413L4658K962Q726J1060J819l4711j462L1128K1398
9992F7563J0938m457j1532K0820j5952j7338L532N508J3730J8859P179J434m467
$$ plain form
9979 95817 92765 45784 60799 83226 73553 73317 52536 52866 67216 77975 106457 100782 99715
9966 99715 84258 65100 47443 64199 65443 73769 48969 71057 110113 89025 73726 68183
9954 68183 69257 78810 80716 76250 60385 67167 103193 110921 100432 98565 114390 131316 137391
9941 137391 159541 162651 177575 186675 210620 176700 147019 151987 160947 187654 170155 171218 201737
9928 201737 195009 147378 132024 147425 168185 185340 186491 198235 222171 242779 227048 206908
9916 206908 179773 188959 172729 185441 194043 198466 229496 246303 263631 276748 287332 273820
9904 273820 264634 240238 224856 239697 261092 260929 242409 238993 276831 294441 277446 269776 273455
9891 273455 280695 300428 319566 311446 308270 314576 332080 346084 388468 420546 429968 436142 452831
$$ packed form
9979I5817l052m6981J5015K2427r673k36k0781L30J4350J0759K8482n675j067
9966I9715j5457j9158j7657J6756J244Q326k4800K2088L9056k1088j5299n543
9954F8183J074R553J906m466j5865O782L6026P728j0489j867J5825J6926O075
9941A37391K2150L110J4924R100K3945l3920k9681M968Q960K6707j7499J063L0519
9928B01737o728m7631j5354J5401K0760J7155J151J1744K3936K0608j5731k0140
9916B06908k7135R186j6230J2712Q602M423L1030J6807J7328J3117J0584j3512
9904B73820r186k4396j5382J4841K1395j63j8520l416L7838J7610j6995p670L679
9891B73455P240J9733J9138q120l176O306J7504J4004M2384L2078R422O174J6689
$$ plain form
9878 452831 470743 453934 418105 421514 438845 445765 459312 465484 468747 491387 485267 472050 464923
9865 464923 490944 526901 544306 550546 533587 516182 520880 533356 571557 589408 618163 626434
9853 626434 607060 607382 618941 621271 646095 674255 680882 670847 688267 699345 695649 691464 715907
9840 715907 743354 752659 786442 771670 748464 772921 804776 805991 789799 774199 776558 790515
9828 790515 796480 810884 800565 785901 796540 825794 820977 817350 830678 850186 835350 812909
9816 812909 810936 823893 842088 843201 829340 826029 842223 850764 865258 860337 832407 826625 844611
9803 844611 872264 862531 844679 825711 841719 857167 846914 818914 789071 776718 765567 778030
9791 778030 757547 732274 722051 719647 710895 706122 711986 715549 733629 730659 731178 698299 664652
$$ packed form
9878D52831J7912j6809l5829L409J7331O920J3547O172L263K2640o120j3217p127
9865D64923K6021L5957J7405O240j6959j7405M698J2476L8201J7851K8755Q271
9853F26434j9374L22J1559K330K4824K8160O627j0035J7420J1078l696m185K4443
9840G15907K7447R305L3783j4772k3206K4457L1855J215j6192j5600K359J3957
9828G90515N965J4404j0319j4664J0639K9254m817l627J3328J9508j4836k2441
9816H12909j973J2957J8195J113j3861l311J6194Q541J4494m921k7930n782J7986
9803H44611K7653r733j7852j8968J6008J5448j0253k8000k9843j2353j1151J2463
9791G78030k0483k5273j0223k404q752m773N864L563J8080k970N19l2879l3647
$$ plain form
9778 664652 671702 681714 690189 692936 692079 681331 657106 659902 657223 658577 643249 606737 572037
9765 572037 572308 571748 590936 583660 574880 562695 561962 525481 494792 460567 466058 498871 504687 479120
9751 479120 476166 481856 493883 489484 475372 470516 486921 455459 428652 420451 426101 426041 451148
9738 451148 452595 459686 421206 394888 379580 386787 377942 356349 324865 335040 338240 337207 306397
9725 306397 316921 308238 318891 329534 358443 339319 326638 312733 301732 293080 284364 253244
9713 253244 264903 274507 291415 290750 283568 287411 284050 255491 245674 231388 220229 234675 226632
9700 226632 239835 245233 224029 240561 268496 260492 236558 204390 205064 190640 183028 170988 185604
9687 185604 175028 175914 194355 213481 214233 220655 197165 183720 184111 212539 234682 221536 221236
$$ packed form
9778F64652P050J0012Q475K747q57j0748k4225K796k679J354j5328l6512l4700
9765E72037K71n60J9188p276q780j2185p33l6481l0689l4225N491L2813N816k5567
9751D79120k954N690J2027m399j4112m856J6405l1462k6807q201N650o0K5107
9738D51148J447P091l8480k6318j5308P207q845k1593l1484J0175L200j033l0810
9725C06397J0524q683J0653J0643K8909j9124j2681j3905j1001q652q716l1120
9713B53244J1659R604J6908o65p182L843l361k8559r817j4286j1159J4446q043
9700B26632J3203N398k1204J6532K7935q004k3934l2168O74j4424p612j2040J4616
9687A85604j0576Q86J8441J9126P52O422k3490j3445L91K8428K2143j3146l00
$$ plain form
9674 221236 216987 169869 140092 132707 130470 154861 179504 178925 184588 169334 159221 175046 161881
9661 161881 178475 176324 185871 180426 166003 145762 126707 84612 85123 121300 137645 149047 161883
9648 161883 185145 175036 159449 150664 158492 152732 119340 120429 129798 136723 142416 155907 180560
9635 180560 164788 169144 179602 176828 163723 148006 129836 127610 116933 117070 114518 125554 152996
9622 152996 136945 91645 92824 99484 117452 96525 97702 89414 138214 150172 118527 101871
9610 101871 99010 91747 113557 117008 118246 124859 106121 132417 127397 107582 105860 95536 104709
9597 104709 138116 157505 140700 118432 100374 86134 98589 100497 86983 55529 53600 56339
9585 56339 69339 69927 79132 86573 67256 81999 112701 128945 142919 122265 100853 94579 94755
$$ packed form
9674B21236m249m7118k9777p385k237K4391K4643n79N663j5254j0113J5825j3165
9661A61881J6594k151R547n445j4423k0241j9055m2095N11L6177J6345J1402J2836
9648A61883K3262j0109j5587q785P828n760l3392J089R369O925N693J3491K4653
9635A80560j5772M356J0458k774j3105j5717j8170k226j0677J37k552J1036K7442
9622A52996j6051m5300J179O660J7968k0927J177q288M8800J1958l1645j6656
9610A01871k861p263K1810L451J238O613j8738K6296n020j9815j722j0324R173
9597A04709L3407J9389j6805k2268j8058j4240J2455J908j3514l1454j929K739
9585E6339J3000N88R205P441j9317J4743L0702J6244J3974k0654k1412o274J76
$$ plain form
9572 94755 92290 83885 78436 83157 109757 118154 118383 99138 81307 111425 110346 101333 119100 105357
9558 105357 98781 67254 58731 77330 106024 92953 71590 77724 84515 60113 50653 60730 63192
9545 63192 40935 7028 18604 63429 92867 96318 83835 81060 67786 44288 54946 59343
9533 59343 66653 71244 80941 93899 103616 98585 98909 91408 88065 111057 105633 82449 68557 58890
9519 58890 84818 89876 82194 76780 94309 95909 95242 89028 72347 91758 89283 86815 67173 58408
9505 58408 90100 87220 102558 79381 55314 76541 92298 68749 34669 27524 47807 42346
9493 42346 66759 98322 83388 67401 69270 37705 41119 74454 95455 99334 78268 82643 77393
9480 77393 59891 51833 39598 52282 69398 81368 51097 25516 15231 27764 39440 41387
$$ packed form
9572I4755k465q405n449M721K6600Q397K29j9245j7831L0118j079r013J7767j3743
9558A05357o576l1527q523J8599K8694j3071k1363O134O791k4402r460J0077K462
9545F3192k2257l3907J1576M4825K9438L451j2483k775j3274k3498J0658M397
9533E9343P310M591R697J2958R717n031L24p501l343K2992n424k3184j3892r667
9519E8890K5928N058p682n414J7529J600o67o214j6681J9411k475k468j9642q765
9505E8408L1692k880J5338k3177k4067K1227J5757k3549l4080p145K0283n461
9493D2346K4413L1563j4934j5987J869l1565L414L3335K1001L879k1066M375n250
9480G7393j7502q058j2235J2684J7116J1970l0271k5581j0285J2533J1676J947
$$ plain form
9468 41387 23170 26804 40529 53317 60354 81968 97778 87050 57621 56741 72326 65474 33538
9455 33538 12843 25171 36654 68183 70459 60786 53362 86857 89265 98755 98539 88996 71479
9442 71479 51973 54253 58082 54163 61548 59201 65128 65870 43026 57121 51659 53443 59385 93133
9428 93133 95414 117765 107239 95104 87959 43583 31189 55279 84467 93967 77824 67178
9416 67178 71839 64524 46942 48668 56988 59189 63548 74703 63599 65442 78411 92140 96272
9403 96272 122498 135558 135396 143733 131338 113210 132175 128850 114313 106437 104971 99739 72562
9390 72562 48351 52011 87063 96558 87100 80004 94868 107717 92682 75273 62939 63262 66506
9377 66506 80402 70937 78117 86718 92773 90737 81510 88925 116226 98495 92813 104140 97683 92900
$$ packed form
9468D1387j8217L634J3725J2788P037K1614J5810j0728k9429q80J5585o852l1936
9455C3538k0695J2328J1483L1529K276r673p424L3495K408R490k16r543j7517
9442G1479j9506K280L829l919P385k347N927P42k2844J4095n462J784N942L3748
9428I3133K281K2351j0526j2135p145m4376j2394K4090K9188R500j6143j0646
9416F7178M661p315j7582J726Q320K201M359J1155j1104J843J2969J3729M132
9403I6272K6226J3060j62Q337j2395j8128J8965l325j4537p876j466n232k7177
9390G2562k4211L660L5052R495r458p096J4864J2849j5035j7409j2334L23L244
9377F6506J3896r465P180Q601O055k036r227P415K7301j7731n682J1327o457m783
$$ plain form
9363 92900 84880 91368 124995 95882 91948 72061 66172 99493 119873 140938 155486 204827 207247
9350 207247 159555 157839 163638 148214 141986 122206 69192 61237 75939 73398 58835 75451 100372
9337 100372 124787 144381 165217 138961 144736 130496 132454 121578 110506 131676 128350 114983
9325 114983 121312 126071 127585 130550 136210 150207 130163 104055 81445 102695 110109 104313 112376
9312 112376 126868 122920 116786 136575 137169 126417 147143 177121 191223 184898 155670 122989 129075
9299 129075 163862 188244 184793 205396 173593 141757 142394 144656 132336 99173 86508 117943
9287 117943 117001 129526 158139 161817 177631 204836 212257 205066 200062 204031 200572 188997 182069
9274 182069 175465 198684 194632 201265 216372 240149 233320 234551 244813 238686 228362 228420 249523
$$ packed form
9363I2900q020O488L3627k9113l934j9887n889L3321K0380K1065J4548M9341K420
9350B07247m7692j716N799j5424o228j9780n3014p955J4702k541j4563J6616K4921
9337A00372K4415J9594K0836k6256N775j4240J958j0876j1072K1170l326j3367
9325A14983O329M759J514K965N660J3997k0044k6108k2610K1250P414n796Q063
9312A12376J4492l948o134J9789N94j0752K0726K9978J4102o325k9228l2681O086
9299A29075L4787K4382l451K0603l1803l1836O37K262j2320l3163j2665L1435
9287A17943r42J2525K8613L678J5814K7205P421p191n004L969l459j1575o928
9274A82069o604K3219m052O633J5107K3777o829J231J0262o127j0324N8K1103
$$ plain form
9261 249523 258068 268215 244499 233668 205212 200765 195600 197356 223339 253476 252040 278083 283497
9248 283497 271009 276153 307250 317933 302708 308894 322921 296618 288429 314228 306524 317095
9236 317095 357006 359758 372472 365655 355056 342796 354382 379166 344432 351272 390840 411012
9224 411012 443032 438898 446819 454622 445795 451348 466912 470268 458492 435062 418777 406388 423742
9211 423742 462274 519237 560423 573054 581403 575843 564400 544919 529506 527632 549735 574055
9199 574055 573286 577455 607161 621628 633619 646367 644362 649598 694593 717764 729748 708966 711155
9186 711155 731617 739297 755705 778957 793398 814428 833222 847044 865098 883044 870718 882699
9174 882699 897875 919275 922345 946617 965726 942970 939629 982954 991619 955057 954528 984948 993955
$$ packed form
9261B49523Q545J0147k3716j0831k8456m447n165J756K5983L0137j436K6043N414
9248B83497j2488N144L1097J0683j5225O186J4027k6303q189K5799p704J0571
9236C17095L9911K752J2714o817j0599j2260J1586K4784l4734O840L9568K0172
9224D11012L2020m134P921P803q827N553J5564L356j1776k3430j6285j2389J7354
9211D23742L8532N6963M1186J2631Q349n560j1443j9481j5413j874K2103K4320
9199E74055p69M169K9706J4467J1991J2748k005N236M4995K3171J1984k0782K189
9186G11155K0462P680J6408K3252J4441K1030J8794J3822J8054J7946j2326J1981
9174H82699J5176K1400L070K4272J9109k2756l341M3325Q665l6562n29L0420R007
$$ plain form
9161 993955 971342 966682 995758 1008433 1016352 1044166 1033439 1013129 1004318 996127 1026394 1042845
9149 1042845 1042866 1028231 1023119 1036904 1004347 973138 960748 966163 964190 935921 940918 943135 938273
9136 938273 916208 907741 905614 874489 834052 813060 823369 824849 828166 831199 794951 775477 786086
9123 786086 768451 738040 735938 736808 737471 726241 728333 716167 686598 673239 679653 649225 632345
9110 632345 647527 634627 594927 585948 583911 582606 576675 565065 554601 548635 529240 516338 504541
9097 504541 479669 472769 479059 465757 462835 439830 438222 446144 452566 449231 447712 430589 424198
9084 424198 429064 408378 402178 387042 365681 349434 354053 365596 360564 356634 342126 346258 340103
9071 340103 331020 317649 313301 322933 297205 269945 276904 274054 257604 228303 229074 254267 278115
$$ packed form
9161I93955k2613m660K9076J2675P919K7814j0727k0310q811q191L0267J6451
9149A042845K1j4635n112J3785l2557l1209j2390N415j973k8269M997K217m862
9136I38273k2065q467k127l1125m0437k0992J0309J480L317L033l6248j9474J0609
9123G86086j7635l0411k102Q70O63j1230K092j2166k9569j3359O414l0428j6880
9110F32345J5182j2900l9700q979k037j305n931j1610j0464n966j9395j2902j1797
9097E04541k4872o900O290j3302k922k3005j608P922O422l335j519j7123o391
9084D24198M866k0686o200j5136k1361j6247M619J1543n032l930j4508M132o155
9071C40103r083j3371m348R632k5728k7260O959k850j6450k9301P71K5193K3848
$$ plain form
9058 278115 258498 266131 283318 284588 283012 283807 285192 264758 239600 204464 184638 188664 205573
9045 205573 195800 197884 200140 201081 221171 230346 194241 165921 177744 210844 198134 171096 177271
9032 177271 185448 157125 154316 162271 167335 152648 146916 123538 91915 112067 109253 127063 155682
9019 155682 138869 114754 112287 98874 106273 100825 84275 96732 134997 130166 110173 115399 110595
9006 110595 110664 90887 71700 64313 84683 111931 124020 136299 119265 69082 46845 73709
8994 73709 92071 120780 117587 86143 73261 59300 81377 100852 100724 92162 82614 71306 78400
8981 78400 96615 114488 119291 125780 114848 100602 108494 104065 87205 81597 84361 84524 96810
8968 96810 111134 135515 139088 127865 95011 111323 121353 129593 112725 114056 103709 103311 97792
$$ packed form
9058B78115j9617P633J7187J270j576P95J385k0434k5158l5136j9826M026J6909
9045B05573r773K084K256R41K0090R175l6105k8320J1823L3100j2710k7038O175
9032A77271Q177k8323k809P955N064j4687n732k3378l1623K0152k814J7810K8619
9019A55682j6813k4115k467j3413P399n448j6550J2457L8265m831j9993N226m804
9006A10595O9j9777j9187p387K0370K7248J2089J2279j7034n0183k2237K6864
8994G3709J8362K8709l193l1444j2882j3961K2077J9475j28q562r548j1308P094
8981G8400J8215J7873M803O489j0932j4246P892m429j6860n608K764J63J2286
8968I6810J4324K4381L573j1223l2854J6312J0030Q240j6868J331j0347l98n519
$$ plain form
8955 97792 101577 112616 108513 94259 72473 61391 46615 27936 41302 40363 39152 53791 17239
8942 17239 -6679 30010 37823 45019 48372 68465 80626 80859 76129 97297 89620 69112 73178
8929 73178 65617 50740 49774 54552 62454 50505 35177 19718 14934 18256 27188 27644 29070 10997
8915 10997 38144 61917 76021 75757 75926 75880 61587 66638 55952 64906 74732 50651 35993 16266
8901 16266 -16568 -7283 13448 57135 61223 54094 10321 -22451 2225 18819 37213 24820
8889 24820 43982 59920 48298 29885 16180 5096 13400 20222 16324 -6251 33932 46135
8877 46135 46742 55463 52869 46183 61088 54327 28990 -474 -16263 -22522 14619 80734 101446
8864 101446 73100 55060 58553 33530 34582 38497 46209 51241 29262 29792 56882 80842 57381
$$ packed form
8955I7792L785J1039m103j4254k1786j1082j4776j8679J3366r39j211J4639l6552
8942A7239k3918L6689P813P196L353K0093J2161K33m730K1168p677k0508M066
8929G3178p561j4877r66M778P902j1949j5328j5459m784L322Q932M56J426j8073
8915A0997K7147K3773J4104k64J69m6j4293N051j0686Q954R826k4081j4658j9727
8901A6266l2834R285K0731M3687M088p129m3773l2772K4676J6594J8394j2393
8889B4820J9162J5938j1622j8413j3705j1084Q304O822l898k2575M0183J2203
8877D6135O07Q721k594o686J4905o761k5337k9464j5789o259L7141O6115K0712
8864A01446k8346j8040L493k5023J052L915P712N032k1979N30K7090K3960k3461
$$ plain form
8851 57381 49196 47986 17910 -11487 -2287 33298 53024 61916 32969 13956 4115 15846 24759
8838 24759 34433 58349 40940 29303 42669 79993 93650 99047 117025 108622 73027 31633
8826 31633 34299 65549 60522 66278 64795 47472 16860 7880 19720 12690 21170 -2009 3077
8813 3077 23491 5252 8889 3679 -10921 5124 17457 40988 44522 39357 38505 26937 7989
8800 7989 10535 11630 19142 28692 -73 8240 30907 44308 31499 29689 38106 -9135 -13885 21652
8786 21652 34135 34871 48740 58303 52182 42397 27942 20525 11722 -2979 892 26856 26116 41838
8772 41838 35779 32860 51810 44660 59113 61891 42142 22081 17906 31978 9570 -7866 -12862
8759 -12862 -16378 -18045 -10242 -1021 40554 35211 16930 13205 -10816 -7625 5310 37313 44682
$$ packed form
8851E7381q185j210l0076k9397R200L5585J9726Q892k8947j9013r841J1731Q913
8838B4759R674K3916j7409j1637J3366L7324J3657N397J7978q403l5595m1394
8826C1633K666L1250n027N756j483j7323l0612q980J1840p030Q480k3179N086
8813C077K0414j8239L637n210j4600J6045J2333K3531L534n165q52j1568j8948
8800G989K546J095P512R550k8765Q313K2667J3401j2809j810Q417m7241m750L5537
8786B1652J2483P36J3869R563o121r785j4455p417q803j4701L871K5964p40J5722
8772D1838o059k919J8950p150J4453K778j9749k0061m175J4072k2408j7436m996
8759a2862l516j667P803R221M1575n343j8281l725k4021L191J2935L2003P369
$$ plain form
8746 44682 28596 29299 29574 41386 37701 22381 39311 49581 29342 7031 2557 18913 19925
8733 19925 29153 57364 62332 70546 91470 84214 71834 62225 60864 44049 32874 16149 27518
8720 27518 35856 26114 30304 72147 75817 65215 49799 19846 6569 26683 62220 4812 -28037
8707 -28037 -27806 -7782 -11675 -4154 -14511 -17128 -1194 -2359 5691 10524 10679 24553 38486 39209
8693 39209 17018 -8576 -22903 -11171 11926 11481 -12481 -27123 -10437 -7972 4699 29430
8681 29430 57034 27064 -2108 10399 50283 51191 47422 38232 43458 26913 -9225 14035 44709
8668 44709 37155 20030 12983 7813 24659 38451 57814 57487 48402 55184 89777 80243 66636
8655 66636 47694 35822 58059 82860 72100 65140 54112 46884 17266 13775 34572 16041
$$ packed form
8746D4682j6086P03K75J1812l685j5320J6930J0270k0239k2311m474J6356J012
8733A9925R228K8211M968Q214K0924p256j2380r609j361j6815j1175j6725J1369
8720B7518Q338r742M190M1843L670j0602j5416k9953j3277K0114L5537n7408l2849
8707b8037K31K0024l893P521j0357k617J5934j165Q050M833J55J3874J3933P23
8693C9209k2191k5594j4327J1732K3097m45k3962j4642J6686K465J2671K4731
8681B9430K7604k9970k9172J2507L9884R08l769r190N226j6545l6138K3260L0674
8668D4709p554j7125p047n170J6846J3792J9363l27r085O782L4593r534j3607
8655F6636j8942j1872K2237K4801j0760o960j1028p228k9618l491K0797j8531
$$ plain form
8643 16041 -5457 -6552 7329 11170 41847 73552 75078 59273 54753 36949 34474 6773 -3418
8630 -3418 1050 11782 30254 30898 34835 30759 24200 18307 -3553 17056 39861 41509 60409 42785
8616 42785 60242 58181 62225 45231 27454 -1128 -727 24321 52017 62918 35095 23747 18350
8603 18350 12662 18569 -13153 -37573 -62801 -63953 -45364 -31177 -11597 -496 -9093 -21215 -25762
8590 -25762 -5874 4552 19501 17877 -713 -5434 -22489 -16877 -12251 -20185 -27238 -38034 -5738
8577 -5738 13854 12519 8394 -2249 -12658 -13755 1367 16101 20743 5525 -1566 -5898 -15361
8564 -15361 -5921 26500 11299 -18410 -13341 15563 9877 6350 13250 -5333 -30339 -41230 -20613
8551 -20613 -17941 -11235 -15992 -8032 9275 378 -41314 -65253 -67266 -56655 -7645 -9670 -37452
$$ packed form
8643A6041k1498j095J3881L841L0677L1705J526j5805m520j7804k475k7701j0191
8630c418M468J0732J8472O44L937m076o559n893k1860K0609K2805J648J8900j7624
8616D2785J7457k061M044j6994j7777k8582M01K5048K7696J0901k7823j1348n397
8603A8350n688N907l1722k4420k5228j152J8589J4187J9580J1101q597j2122m547
8590b5762J9888J0426J4949j624j8590m721j7055N612M626p934p053j0796L2296
8577e738J9592j335m125j0643j0409j097J5122J4734M642j5218p091m332r463
8564a5361R440L2421j5201k9709N069K8904n686l527O900j8583k5006j0891K0617
8551b0613K672O706m757P960J7307q897m1692k3939k013J0611M9010k025k7782
$$ plain form
8538 -37452 -45148 -28278 -26002 -12402 23725 26705 13800 38172 34201 43564 56041 55445 24803
8525 24803 -17401 -28931 -473 20787 55479 51714 23919 -14424 -41090 -37728 -30368 -7370
8513 -7370 -9958 -35281 -44456 -34073 -48728 -32958 -17254 -18421 -21275 -3458 -219 -1167 14727
8500 14727 4627 -21453 -20032 -19106 -33088 -39655 -23264 8100 10640 -4261 18896 -5467 -40282
8487 -40282 -47949 -64290 -70540 -53308 -26062 -32737 -31388 -7271 14664 9954 -20275 -41542 -36187
8474 -36187 -36110 -25713 -18231 -12203 -3592 -15269 -5993 12681 20972 7468 18492 36638 14373
8461 14373 -25884 -21452 -14242 1654 2144 6829 18487 18882 28155 4340 -19942 13050 35622
8448 35622 27104 31499 34930 31279 6715 17474 30571 33079 36944 51129 43620 39874 46269 43915
$$ packed form
8538c7452p696J6870K276J3600L6127K980j2905K4372l971R363J2477n96l0642
8525B4803m2204j1530K8458K1260L4692l765k7795l8343k6666L362P360K2998
8513g370k588k5323r175J0383j4655J5770J5704j167k854J7817L239r48J5894
8500A4727j0100k6080J421R26j3982o567J6391L1364K540j4901K3157k4363l4815
8487d0282p667j6341o250J7232K7246o675J349K4117K1935m710l0229k1267N355
8474c6187P7J0397P482O028Q611j1677R276J8674Q291j3504J1024J8146k2265
8461A4373m0257M432P210J5896M90M685J1658L95R273k3815k4282L2992K2572
8448C5622q518M395L431l651k4564J0759J3097K508L865J4185p509l746O395k354
$$ plain form
8434 43915 47103 11785 -32331 2892 41186 24474 6393 -12797 -14780 -2148 10154 32912
8422 32912 13134 1841 3128 -4841 -19703 -19064 5035 25769 23509 13492 8939 -10604 -32260
8409 -32260 -35762 -45823 -28755 -10898 -35483 -49442 -54886 -55553 -37573 -6992 3411 -12164 -8250
8396 -8250 6153 27985 40852 13989 16186 24548 35738 33092 37849 40354 23144 -2784 -6513
8383 -6513 -19562 -9415 16819 21656 6889 17141 45131 73065 19960 4728 6797 21914
8371 21914 12851 -736 -2644 13390 1214 -19487 -28507 -23763 -12538 -5528 -5359 3109 -9912
8358 -9912 -16258 -25248 -50662 -25324 4808 3436 -13321 -4174 9300 -15576 -34921 -29784 14043
8345 14043 -8690 -40597 -49579 -28633 -6061 8117 15219 10679 30717 22405 -4901 -22454 -29882
$$ packed form
8434D3915L188l5318m4116L5223L8294j6712j8081j9190j983J2632J2302K2758
8422C2912j9778j1293J287p969j4862O39K4099K0734k260j0017m553j9543k1656
8409c2260l502j0061J7068J7857k4585j3959n444o67J7980L0581J0403j5575L914
8396h250J4403K1832J2867k6863K197Q362J1190k646M757K505j7210k5928l729
8383f513j3049J0147K6234M837j4767J0252K7990K7934n3105j5232K069J5117
8371B1914r063j3587j908J6034j2176k0701r020M744J1225P010J69Q468j3021
8358i912o346q990k5414K5338L0132j372j6757R147J3474k4876j9345N137M3827
8345A4043k2733l1907q982K0946K2572J4178P102m540K0038q312k7306j7553p428
$$ plain form
8332 -29882 -32364 -2474 -17651 -8870 -5263 -9662 -5357 -8142 -18091 -25118 -37952 -22125 -22744 9
8318 9 -11462 -42578 -42102 -26061 -10836 -6827 12903 26446 28944 25655 1567 -6622 9555 -5900
8304 -5900 -11269 16458 -10556 -20485 -4601 5556 33936 34311 22212 14102 24732 36850 19112
8291 19112 -16967 -32145 -26717 -17975 -14414 -14562 -9432 -3231 33597 37787 45483 20346 -21169 -43493
8277 -43493 -47124 -22583 -21078 -25483 -34607 -18494 22586 19200 -10432 -3492 18948 18149 6958
8264 6958 -9962 -11118 -15962 -23875 11835 26021 5406 3659 -3907 -74 42977 68461 50224
8251 50224 35437 34625 12949 -13968 -11254 -6014 109 22231 16247 37175 38780 17837 29259
8238 29259 27160 -1778 -26447 -9966 -17162 -19200 -20034 -37875 -72023 -60645 2871 12000 8128
$$ packed form
8332b9882k482K9890j5177Q781L607m399M305k785r949p027j2834J5827o19K2753
8318Ij1471l1116M76J6041J5225M009J9730J3543K498l289k4088q189J6177j5455
8304e900n369K7727k7014r929J5884J0157K8380L75j2099q110J0630J2118j7738
8291A9112l6079j5178N428Q742L561j48N130O201L6828M190P696k5137m1515k2324
8277d3493l631K4541J505m405r124J6113M1080l386k9632O940K2440p99j1191
8264F958j6920j156m844p913L5710J4186k0615j747p566L833M3051K5484j8237
8251E0224j4787q12k1676k6917K714N240O123K2122n984K0928J605k0943J1422
8238B9259k099k8938k4669J6481p196k038q34j7841l4148J1378O3516R129l872
$$ plain form
8225 8128 3805 6902 10745 18753 -19320 -47471 -30221 -3060 -1352 -795 9287 15087 495 -19003
8211 -19003 -20955 -17294 2482 17212 2692 -4263 -5914 17760 29825 16710 20875 47906 44001
8198 44001 64 -5990 1004 2092 3005 8473 -7190 -18133 -16707 -25895 -48351 -49135 -16709 11864
8184 11864 25077 15554 -10734 -46217 -40231 -21731 -23230 -10777 -22088 -8957 -2320 -12818 -32413
8171 -32413 -40365 -10733 1835 540 -2868 370 23164 5066 6776 16325 18191 20629 -6186
8158 -6186 -13392 -17895 -45363 -31275 -27597 -38627 -15898 7216 2625 18055 5325 -3120 -4020
8145 -4020 -23143 -31944 -34201 -40133 -21673 -19869 -14274 -732 -5941 -24629 -8783 -26493 -55364
8132 -55364 -41415 -12511 -12979 3357 -21054 -19010 -7793 -1834 -2839 12386 -5240 -49009 -62890
$$ packed form
8225H128m323L097L843Q008l8073k8151J7250K7161J708N57J0082N800j4592j9498
8211a9003j952L661J9776J4730j4520o955j651K3674J2065j3115M165K7031l905
8198D4001m3937o054O994J088R13N468j5663j0943J426r188k2456p84L2426K8573
8184A1864J3213r523k6288l5483N986J8500j499J2453j1311J3131O637j0498j9595
8171c2413p952K9632J2568j295l408L238K2794j8098J710R549J866K438k6815
8158f186p206m503k7468J4088L678j1030K2729K3114m591J5430j2730q445r00
8145d020j9123q801k257n932J8460J804N595J3542n209j8688J5846j7710k8871
8132e5364J3949K8904m68J6336k4411K044J1217N959j005J5225j7626m3769j3881
$$ plain form
8119 -62890 -36333 -17970 13080 15903 -9963 -27979 -29735 10412 489 -7152 11907 7017 1901
8106 1901 8381 35138 42062 64075 70584 51606 31080 14399 17659 15265 10281 22648 44570
8093 44570 15026 -6222 -24297 -59899 -63890 -32957 -15986 -6668 -13415 -765 -6169 -18482 -21882
8080 -21882 -5703 -24574 -12228 3910 2934 -19205 -31209 -41080 -30287 -38604 -34860 -30607 -14767
8067 -14767 -6393 -3811 15490 19291 -15394 -7254 -50 7866 9315 42637 53490 43669 7495
8054 7495 -742 8554 19794 22570 15791 2605 11958 21772 50361 44855 53518 92262 88529 56600
8040 56600 39137 47309 59264 56348 36921 18921 25553 15259 22396 22605 -7974 -22468 -11737
8027 -11737 -9470 -18838 -23319 -2978 -3726 -7328 12471 11941 -6547 5951 6370 26277 27239 29359
$$ packed form
8119f2890K6557J8363L1050K823k5866j8016j756M0147r923p641J9059m890n116
8106A901O480K6757O924K2013O509j8978k0526j6681L260k394m984J2367K1922
8093D4570k9544k1248j8075l5602l991L0933J6971R318o747J2650n404j2313l400
8080b1882J6179j8871J2346J6138r76k2139j2004r871J0793q317L744M253J5840
8067a4767Q374K582J9301L801l4685Q140P204P916J449L3322J0853r821l6174
8054G495q237R296J1240K776o779j3186R353R814K8589n506Q663L8744l733l1929
8040E6600j7463Q172J1955k916j9427j8000O632j0294P137K09l0579j4494J0731
8027a1737K267r368m481K0341p48l602J9799n30j8488J2498M19J9907R62K120
$$ plain form
8013 29359 40312 65702 72432 47407 43717 42875 51405 26681 4393 32416 25029 28607 62912
8000 62912 48977 46176 56815 79668 73871 43525 50353 48387 30465 11234 -19695 -33604 -2954
7987 -2954 15205 19720 -5289 -7326 4657 1783 30760 51270 29718 1558 -15965 -43947 -39292
7974 -39292 26870 38486 3713 -28845 -32844 -34564 -52406 -40240 7811 763 -2333 15866 2318
7961 2318 -20575 4749 30459 28587 16180 -3641 -5563 9930 -6384 -5659 -10946 -19416 4139
7948 4139 7883 18356 22103 31443 50636 28994 -8084 -9473 11473 30266 36675 29982 31256
$$ packed form
8013B9359J0953K5390O730k5025l690q42Q530k4724k2288K8023p387L578L4305
8000F2912j3935k801J0639K2853n797l0346O828j966j7922j9231l0929j3909L0650
7987b954J8159M515k5009k037J1983k874K8977K0510k1552k8160j7523k7982M655
7974c9292O6162J1616l4773l2558l999j720j7842J2166M8051p048l096J8199j3548
7961B318k2893K5324K5710j872j2407j9821j922J5493j6314P25n287q470K3555
7948D139L744J0473L747R340J9193k1642l7078j389K0946J8793O409o693J274
$$ [...]
##END NTUPLES=NMR SPECTRUM
##END=
