##TITLE=Analysis number 321836
Compound Code sb 01932
Project Code adrs
Chemist Name stores
##JCAMPDX= 6.0         $$ Bruker NMR JCAMP-DX V2.0
##DATA TYPE= NMR SPECTRUM
##DATA CLASS= NTUPLES
##ORIGIN= Bruker BioSpin GmbH
##OWNER= nmr
$$ XWIN-NMR		Version 3.5
$$ Wed Aug 30 11:53:07 2006 GMT Daylight Time (UT+1h)  MAYBRIDGE\nmr@NMR_250MHZ
##.OBSERVE FREQUENCY= 250.131544655141
##.OBSERVE NUCLEUS= ^1H
##.ACQUISITION MODE= SIMULTANEOUS (DQD)
##.ACQUISITION SCHEME= undefined
##.AVERAGES= 16
##.DIGITISER RES= 18
##SPECTROMETER/DATA SYSTEM= dpx250
##.PULSE SEQUENCE= zg30
##.SOLVENT NAME= CDCl3
##.SHIFT REFERENCE= (INTERNAL, CDCl3, 0, 16.522)
##AUDIT TRAIL= $$ (NUMBER, WHEN, WHO, WHERE, WHAT)
$$ ##TITLE= Audit trail, XWIN-NMR		Version 3.5
$$ ##JCAMPDX= 5.01
$$ ##ORIGIN= Bruker BioSpin GmbH
$$ ##OWNER= nmr
$$ C:\u/data/dgb/nmr/ADRS/1930/pdata/1/auditp.txt
$$ ##AUDIT TRAIL=  $$ (NUMBER, WHEN, WHO, WHERE, WHAT)
(   1,<2006-08-30 11:52:37.73 +100>,<MAYBRIDGE\nmr>,<NMR_250MHZ>,
      <created by zg, POWCHK disabled, PULCHK disabled
       configuration hash MD5:
       E2 DF 36 D8 04 B2 41 60 5A D7 A3 38 5A 4B D0 FE
       data hash MD5: 64K
       13 4D F3 45 C8 8D 80 59 B9 A4 4F DA 9A E8 DC F6>)
(   2,<2006-08-30 11:52:54.51 +100>,<MAYBRIDGE\nmr>,<NMR_250MHZ>,
      <Start of raw data processing
       ef LB = 0.3 FT_mod = 6 PKNL = 1 SI = 32K 
       data hash MD5: 32K
       51 15 BA 33 A5 37 F9 16 8F DB 56 1A 0C 39 B4 2E>)
(   3,<2006-08-30 11:52:56.45 +100>,<MAYBRIDGE\nmr>,<NMR_250MHZ>,
      <apk 
       data hash MD5: 32K
       C5 55 8F D6 48 CC 8E 72 D8 0E 5C 8E D6 B8 7A 27>)
(   4,<2006-08-30 11:52:57.21 +100>,<MAYBRIDGE\nmr>,<NMR_250MHZ>,
      <abs ABSG = 5 
       data hash MD5: 32K
       F4 DC 26 86 2B 10 DE F2 5F 14 FF 83 5F 68 ED CF>)
$$ ##END=
$$ 
$$ hash MD5
$$ 30 B7 BD 6B E8 85 89 B7 06 B2 99 FF F5 A8 2A 01
##$RELAX= 
##$RELAX= 
##$RELAX= 
##$RELAX= 
##$RELAX= 
##$RELAX= 
##$RELAX= 
$$ Bruker specific parameters
$$ --------------------------
##$DU= <C:\u>
##$EXPNO= 1930
##$NAME= <ADRS>
##$PROCNO= 1
##$TYPE= <nmr>
##$USER= <dgb>
##$AMP= (0..31)
100 100 100 100 100 100 100 100 100 100 100 100 100 100 100 100 100 100 
100 100 100 100 100 100 100 100 100 100 100 100 100 100 
##$AQSEQ= 0
##$AQ_mod= 3
##$AUNM= <au_zg>
##$AUTOPOS= <20 >
##$BF1= 250.13
##$BF2= 250.13
##$BF3= 250.13
##$BF4= 250.13
##$BF5= 500.13
##$BF6= 500.13
##$BF7= 500.13
##$BF8= 500.13
##$BYTORDA= 1
##$CFDGTYP= 0
##$CFRGTYP= 5
##$CHEMSTR= <none>
##$CNST= (0..31)
1 1 145 1 1 1 1 1 1 1 1 1 1 1 1 1 1 1 1 1 1 1 1 1 1 1 1 1 1 1 1 1 
##$CPDPRG= <>
##$CPDPRG1= <>
##$CPDPRG2= <>
##$CPDPRG3= <>
##$CPDPRG4= <mlev>
##$CPDPRG5= <mlev>
##$CPDPRG6= <mlev>
##$CPDPRG7= <mlev>
##$CPDPRG8= <mlev>
##$CPDPRGB= <>
##$CPDPRGT= <>
##$D= (0..31)
0 1 0 0 0 0 0 0 0 0.06 0 0 0 0 0 0 0.0002 0 0 0 0 0 0 0 0 0 0 0 0 0 0 
0 
##$DATE= 1156935156
##$DBL= (0..7)
120 120 120 120 120 120 120 120 
##$DBP= (0..7)
150 150 150 150 150 150 150 150 
##$DBP07= 0
##$DBPNAM0= <>
##$DBPNAM1= <>
##$DBPNAM2= <>
$$ [...]
##$SUBNAM7= <"">
##$SUBNAM8= <"">
##$SUBNAM9= <"">
##$SW= 20.6930455092707
##$SWIBOX= (0..15)
0 0 3 0 0 0 0 0 0 0 0 0 0 0 0 0 
##$SW_h= 5175.983436853
##$TD= 65536
##$TD0= 1
##$TE= 296.16
##$TE2= 300
##$TE3= 300
##$TEG= 300
##$TL= (0..7)
0 120 120 120 120 120 120 120 
##$TP= (0..7)
150 150 150 150 150 150 150 150 
##$TP07= 0
##$TPNAME0= <>
##$TPNAME1= <>
##$TPNAME2= <>
##$TPNAME3= <>
##$TPNAME4= <>
##$TPNAME5= <>
##$TPNAME6= <>
##$TPNAME7= <>
##$TPOAL= (0..7)
0.5 0.5 0.5 0.5 0.5 0.5 0.5 0.5 
##$TPOFFS= (0..7)
0 0 0 0 0 0 0 0 
##$TUNHIN= 0
##$TUNHOUT= 0
##$TUNXOUT= 0
##$USERA1= <user>
##$USERA2= <user>
##$USERA3= <user>
##$USERA4= <user>
##$USERA5= <user>
##$V9= 5
##$VALIST= <valist>
##$VCLIST= <CCCCCCCCCCCCCCC>
##$VD= 0
##$VDLIST= <DDDDDDDDDDDDDDD>
##$VPLIST= <PPPPPPPPPPPPPPP>
##$VTLIST= <TTTTTTTTTTTTTTT>
##$WBST= 1024
##$WBSW= 4
##$XGAIN= (0..3)
0 0 0 0 
##$XL= 0
##$YL= 0
##$YMAX_a= 599176
##$YMIN_a= -793443
##$ZGOPTNS= <>
##$ZL1= 120
##$ZL2= 120
##$ZL3= 120
##$ZL4= 120
##$ABSF1= 16.522
##$ABSF2= -4.171173
##$ABSG= 5
##$ABSL= 3
##$ALPHA= 0
##$AQORDER= 0
##$ASSFAC= 0
##$ASSFACI= 0
##$ASSFACX= 0
##$ASSWID= 0
##$AUNMP= <proc_1d>
##$AZFE= 0.1
##$AZFW= 0.1
##$BCFW= 0
##$BC_mod= 0
##$BYTORDP= 0
##$COROFFS= 0
##$CY= 12.5
##$DATMOD= 1
##$DC= 0
##$DFILT= <>
##$DTYPP= 0
##$F1P= 14.0000005364418
##$F2P= -0.99999901652339
##$FCOR= 0.5
##$FTSIZE= 32768
##$FT_mod= 6
##$GAMMA= 0
##$GB= 0
##$INTBC= 1
##$INTSCL= 1
##$ISEN= 128
##$LB= 0.3
##$LEV0= 0
##$LPBIN= 0
##$MAXI= 10000
##$MC2= 0
##$MEAN= 0
##$ME_mod= 0
##$MI= 0
##$NCOEF= 0
##$NC_proc= -3
##$NLEV= 6
##$NOISF1= 0
##$NOISF2= 0
##$NSP= 0
##$NTH_PI= 0
##$NZP= 0
##$OFFSET= 16.522
##$PC= 1
##$PHC0= 148.4431
##$PHC1= 6.169485
##$PH_mod= 1
##$PKNL= yes
##$PPARMOD= 0
##$PSCAL= 4
##$PSIGN= 0
##$REVERSE= no
##$SF= 250.13
##$SI= 32768
##$SIGF1= 0
##$SIGF2= 0
##$SINO= 400
##$SIOLD= 32768
##$SREGLST= <1H.CDCl3>
##$SSB= 0
##$STSI= 32768
##$STSR= 0
##$SW_p= 5175.98343685301
##$SYMM= 0
##$S_DEV= 0
##$TDeff= 65536
##$TDoff= 0
##$TI= <Analysis number 999999
Compound Code 99
Book Reference 9
Project Code 9>
##$TILT= no
##$TM1= 0
##$TM2= 0
##$TOPLEV= 0
##$USERP1= <user>
##$USERP2= <user>
##$USERP3= <user>
##$USERP4= <user>
##$USERP5= <user>
##$WDW= 1
##$XDIM= 32768
##$YMAX_p= 413289408
##$YMIN_p= -230097
$$ End of Bruker specific parameters
$$ ---------------------------------
##NTUPLES= NMR SPECTRUM
##VAR_NAME=  FREQUENCY,     SPECTRUM/REAL,   SPECTRUM/IMAG
##SYMBOL=    X,             R,               I
##VAR_TYPE=  INDEPENDENT,   DEPENDENT,       DEPENDENT
##VAR_FORM=  AFFN,          ASDF,            ASDF
##VAR_DIM=   32768,         32768,           32768
##UNITS=     HZ,            ARBITRARY UNITS, ARBITRARY UNITS
##FACTOR=    0.157963299565203, 1,           1
##FIRST=     4132.6476996994, 0,             0
##LAST=      -1043.33573715361, 0,           0
##MIN=       -1043.33573715361, -230097,     0
##MAX=       4132.6476996994, 413289408,     0
$$ Real data points
##PAGE= N=1
##DATA TABLE= (X++(R..R)), XYDATA
$$ [...]
$$ plain form
19607 -3398 -4135 -11543 -9574 -6569 -14055 -17707 -21222 -14665 -12788 -3940 6081 6667 15429 13820 -825
19592 -825 10349 17785 7933 -3294 3710 -971 2093 9015 13635 16724 8396 6780 5945 4545 -779
19577 -779 -9144 -19275 -2547 4224 3546 -4769 6396 12037 21508 5509 1894 9105 8708 3025
19563 3025 8 -7732 -6614 -40 -3731 -11899 -6694 -7097 -3860 3518 5332 7890 13254 12879 11663
19548 11663 1689 -5377 -5068 18189 31367 22818 29835 46045 50987 59631 56790 58107 41136 28937
19534 28937 28443 21242 18403 34029 51978 54469 52678 64435 87557 133230 189075 275825 342046
19521 342046 356684 340018 327242 287357 247555 219574 191298 174884 171592 173528 166855 168951
19509 168951 178714 193061 187506 172199 163416 150814 132968 119114 109962 108786 119565 119746 123677
$$ packed form
19607c398p37p408J969L005p486l652l515O557J877Q848J0021N86Q762j609j4645
19592h25J1174P436r852j1227P004m681L064O922M620L089q328j616q35j400n324
19577g79q365j0131J6728O771o78q315J1165N641R471j5999l615P211l97n683
19563C025l017p740J118O574l691q168N205m03L237P378J814K558N364l75j216
19548A1663r974p066L09K3257J3178q549P017J6210M942Q644k841J317j6971j2199
19534B8937m94p201k839J5626J7949K491j791J1757K3122M5673N5845Q6750O6221
19521C42046J4638j6666j2776l9885l9802k7981k8276j6414l292J936o673K096
19509A68951R763J4347n555j5307q783j2602j7846j3854r152j176J0779J81L931
$$ plain form
19496 123677 135150 132777 130136 141161 165481 196166 239054 316634 406211 441525 450534 431924
19484 431924 411761 372110 340865 333795 331503 320475 315750 309932 315974 321784 328640 310503 292679
19471 292679 279119 298513 335482 368320 410112 463020 507964 507987 459040 385304 324586 285453
19459 285453 253140 224637 210096 205800 188356 171130 157168 153394 154849 157698 161976 173270
19447 173270 193466 197543 218763 232407 233644 229136 212485 185020 173660 182314 192890 215374
19435 215374 252494 284567 341528 413916 475639 472220 427838 366618 314659 278588 256736 231717
19423 231717 206270 200313 187563 166205 141636 121135 105366 100678 107883 120917 123115 127348
19411 127348 128342 118591 107536 103119 101928 77369 65779 71544 72000 72997 76100 67221 57415 56418
$$ packed form
19496A23677J1473k373k641J1025K4320L0685M2888P7580Q9577L5314R009j8610
19484D31924k0163l9651l1245p070k292j1028m725n818O042N810O856j8137j7824
19471B92679j3560J9394L6969L2838M1792N2908M4944K3m8947p3736o0718l9133
19459B85453l2313k8503j4541m296j7444j7226j3962l774J455K849M278J1294
19447A73270K0196M077K1220J3644J237m508j6651k7465j1360Q654J0576K2484
19435B15374L7120L2073N6961P2388O1723l419m4382o1220n1959l6071k1852k5019
19423B31717k5447n957j2750k1358k4569k0501j5769m688P205J3034K198M233
19411A27348R94r751j1055m417j191k4559j1590N765M56R97L103q879r806r97
$$ plain form
19397 56418 58852 68154 76181 68989 53736 55679 57731 41413 37866 42989 44345 45015 38706 27273
19383 27273 16215 9712 3132 17559 26712 25263 22257 14442 20232 16872 -4683 -8712 -2300 19874
19369 19874 43187 54503 42711 16309 6654 5176 6061 5037 9676 21453 24935 27708 15299
19356 15299 -4577 4892 26483 26592 31557 24567 20659 18666 5891 6773 8949 7719 19202 43884
19342 43884 50326 45202 24160 5299 -2530 3803 2943 2452 332 3452 7540 15742 14789 12821 18041
19327 18041 10961 10147 8786 9449 15780 23578 32831 24350 26366 18792 2429 -5671 -1493 9272
19313 9272 6479 1503 4777 17347 7717 23554 21613 7188 3068 -7619 -5414 -7418 -10329 -3737
19299 -3737 -1591 -8050 -4148 -6094 2334 8803 5488 -16374 -12768 -3948 -4271 2624 15720 10341
$$ packed form
19397E6418K434R302Q027p192j5253J943K052j6318l547N123J356O70o309j1433
19383B7273j1058o503o580J4427R153j449l006p815N790l360k1555m029O412K2174
19369A9874K3313J1316j1792k6402r655j478Q85j024M639J1777L482K773j2409
19356A5299j9876R469K1591J09M965o990l908j993j2775Q82K176j230J1483K4682
19342D3884O442n124k1042j8861p829O333q60m91k120L120M088Q202r53j968N220
19327A8041p080q14j361O63O331P798R253q481K016p574j6363q100M178J0765
19313I272k793m976L274J2570r630J5837j941j4425m120j0687K205k004k911O592
19299c737K146o459L902j946Q428O469l315k1862L606Q820l23O895J3096n379
$$ plain form
19285 10341 25699 21709 22559 25481 21803 30752 39475 34783 38382 23711 22650 20451 11545 6804
19271 6804 11680 10831 9530 6015 3951 5407 11863 9319 12255 13923 22602 10661 1438 4485 1056
19256 1056 -3846 4597 1415 6312 19531 22695 20518 20808 30691 26447 19713 19040 -592 6850 21175
19241 21175 13245 3394 2262 5602 7489 19470 25360 29498 23391 18589 24503 25941 33145 51612
19227 51612 50475 28482 28049 31442 40298 47669 41829 45884 37301 37406 39030 51499 58832 64760
19213 64760 93489 107179 117689 137961 141665 138771 127230 124102 130550 127472 131827 152438 165406
19200 165406 191093 243493 308114 429354 634278 920820 1171081 1225536 1152002 1063849 958122
19189 958122 828129 718015 629725 566872 532780 518736 538527 598123 652288 657364 608142
$$ packed form
19285A0341J5358l990Q50K922l678Q949Q723m692L599j4671j061k199q906m741
19271F804M876q49j301l515k064J456O456k544K936J668Q679j1941r223L047l429
19256A056m902Q443l182M897J3219L164k177K90R883m244o734o73j9632P442J4325
19241B1175p930r851j132L340J887J1981N890M138o107m802N914J438P204J8467
19227E1612j137k1993m33L393Q856P371n840M055q583J05J624J2469P333N928
19213F4760K8729J3690J0510K0272L704k894j1541l128O448l078M355K0611J2968
19200A65406K5687N2400O4621J21240K04924K86542K50261N4455p3534q8153j05727
19189I58122j29993j10114q8290o2853l4092j4044J9791N9596N4165N076m9222
$$ plain form
19178 608142 563921 535120 502031 458142 423120 399702 373706 360018 341064 337413 348775 373185
19166 373185 402004 434655 488299 582122 746276 1013461 1292303 1414291 1370132 1270349 1176321
19155 1176321 1083307 1021900 985231 988970 1012193 994004 963688 950324 974454 991706 957236
19144 957236 921693 950944 1024163 1146162 1288762 1495375 1692368 1706433 1519126 1283980
19134 1283980 1104180 970046 866684 781722 707399 641973 601139 563165 545901 529972 523143
19123 523143 536010 573176 607057 625342 653413 690970 741416 768014 724309 685772 648394
19112 648394 622201 610401 627452 673956 777386 921994 1081643 1279717 1510020 1622996
19102 1622996 1510770 1283522 1061209 910902 801501 723359 649935 577133 521211 478473
$$ packed form
19178F08142m4221k8801l3089m3889l5022k3418k5996j3688j8954l651J1362K4410
19166C73185K8819L2651N3644R3823J64154K67185K78842J21988m4159r9783r4028
19155A176321r3014o1407l6669L739K3223j8189l0316j3364K4130J7252l4470
19144I57236l5543K9251P3219J21999J42600K06613J96993J4065j87307k35146
19134A283980j79800j34134j03362q4962p4323o5426m0834l7974j7264j5929o829
19123E23143J2867L7166L3881J8285K8071L7557N0446K6598m3705l8537l7378
19112F48394k6193j1800J7051M6504J03430J44608J59649J98074K30303J12976
19102A622996j12226k27248k22313j50307j09401p8142p3424p2802n5922m2738
$$ plain form
19092 478473 453139 444164 434000 439219 461376 456220 436388 403458 367706 345744 332948 308065
19080 308065 275797 257294 242513 223149 221020 228691 220569 215383 209480 186891 188842 188792 194995
19067 194995 187813 175883 165339 168872 156423 152246 145817 128840 124314 124587 131157 135888 122209
19054 122209 120023 124773 119329 115863 102534 87712 80800 89140 87799 88042 87308 87694 69826 68113
19040 68113 85792 87205 79480 66964 83248 89297 74669 73375 78517 79951 70733 71074 78535 75279
19026 75279 78807 73445 54665 54649 56931 53989 61081 57938 57271 60467 57856 67147 60857 48812 46278
19011 46278 57643 71146 68097 57900 57458 49698 62941 62921 46591 41001 44105 49672 53797 52592
18997 52592 50826 63632 62848 57019 47952 56172 55932 46161 40139 41356 24813 25155 32356 31531 27912
$$ packed form
19092D78473k5334q975j0164N219K2157n156j9832l2930l5752k1962j2796k4883
19080C08065l2268j8503j4781j9364k129P671q122n186n903k2589J951n0O203
19067A94995p182j1930j0544L533j2449m177o429j6977m526K73O570M731j3679
19054A22209k186M750n444l466j3329j4822o912Q340j341K43p34L86j7868j713
19040F8113J7679J413p725j2516J6284O049j4628j294N142J434r218L41P461l256
19026G5279L528n362j8780j6K282k942P092l143o67L196k611R291o290j2045k534
19011D6278J1365J3503l049j0197m42p760J3243k0j6330n590L104N567M125j205
18997E2592j766J2806p84n829r067Q220k40r771o022J217j6543L42P201q25l619
$$ plain form
18982 27912 29687 45148 61390 59168 51130 53317 57290 48479 44630 37115 46646 49859 57074 56271
18968 56271 50651 56616 67542 71388 81911 74226 63240 48771 65277 69988 77769 80771 71380
18955 71380 73192 77476 86741 66365 61096 62809 52002 51758 48458 44243 38463 49879 48888 57787
18941 57787 63857 57307 48694 46425 32692 31116 42721 41251 33319 41247 35134 43371 46895 36387
18927 36387 26909 30575 35223 34762 39424 42805 53415 36103 18415 7932 26065 43771 46030
18914 46030 45036 53306 60069 69773 50694 33459 42890 48076 47512 35596 39591 54306 59328 49229
18900 49229 41772 44804 39699 45190 41315 35647 38046 39709 33643 30793 33357 40306 48485 51835
18886 51835 46442 40111 43709 54299 62226 63697 59441 52411 45609 49322 48486 47651 55091 67192
$$ packed form
18982B7912J775J5461J6242k222q038K187L973q811l849p515R531L213P215q03
18968E6271n620N965J0926L846J0523p685j0986j4469J6506M711P781L002r391
18955G1380J812M284R265k0376n269J713j0807k44l300m215n780J1416r91Q899
18941E7787O070o550q613k269j3733j576J1605j470p932P928o113Q237L524j0508
18927C6387r478L666M648m61M662L381J0610j7312j7688j0483J8133J7706K259
18914D6030r94Q270O763R704j9079j7235R431N186n64j1916L995J4715N022j0099
18900D9229p457L032n105N491l875n668K399J663o066k850K564O949Q179L350
18886E1835n393o331L598J0590P927J471m256p030o802L713q36q35P440J2101
$$ plain form
18872 67192 53175 52584 58833 48157 41345 43446 54652 78489 84067 77443 71617 76403 74647 64816
18858 64816 74777 88227 77691 74203 76682 91703 103806 123499 144025 154589 159410 166691 189143
18845 189143 199519 210780 237884 268549 278089 272303 253355 239408 243677 250318 262068 279686
18833 279686 296070 309145 320127 328651 319777 312008 329897 333686 323788 312050 289226 270464
18821 270464 266358 282037 283577 289503 318481 325547 332186 334114 323986 326233 328191 342266 355342
18808 355342 354783 341864 333793 332751 332498 334044 337411 348651 357331 385007 413651 439722 456271
18795 456271 468402 473468 476930 467338 451128 427923 406126 412932 447138 481756 501582 518052
18783 518052 520241 517730 515673 516494 499772 482059 459121 430721 412744 394536 391323 405789 415828
$$ packed form
18872F7192j4017n91O249j0676o812K101J1206K3837N578o624n826M786j756r831
18858F4816R961J3450j0536l488K479J5021J2103J9693K0526J0564M821P281K2452
18845A89143J0376J1261K7104L0665R540n786j8948j3947M269O641J1750J7618
18833B79686J6384J3075J0982Q524q874p769J7889L789r898j1738k2824j8762
18821B70464m106J5679J540N926K8978P066O639J928j0128K247J958J4075J3076
18808C55342n59j2919q071j042k53J546L367J1240Q680K7676K8644K6071J6549
18795D56271J2131N066L462r592j6210k3205k1797O806L4206L4618J9826J6470
18783E18052K189k511k057Q21j6722j7713k2938k8400j7977j8208l213J4466J0039
$$ plain form
18770 415828 422102 417498 418698 433256 454390 463402 472798 471990 460734 445528 420227 376087 359569
18757 359569 349884 352801 364921 380438 392039 400199 410286 406630 417890 421042 422185 413809 400273
18744 400273 401347 385830 361636 355033 354733 351800 357312 366880 353896 345661 337441 327354 297461
18731 297461 279126 267895 247087 239584 224747 206981 198976 183835 176313 167624 161100 162961 156891
18718 156891 140067 129081 121902 120805 114858 124848 122719 124328 128594 143202 147824 146896 129179
18705 129179 111320 108251 100472 97032 103512 93589 105486 107765 108604 103907 102574 99736 91308 89022
18691 89022 84305 90531 87215 91359 76903 73035 62602 65410 70621 84803 93388 85338 80190 81636
18677 81636 96453 112082 130428 130656 124656 117015 124644 134317 146936 167034 186833 202118 215063
$$ packed form
18770D15828O274m604J200J4558K1134R012R396q08j1256j5206k5301m4140j6518
18757C59569r685K917J2120J5517J1601Q160J0087l656J1260L152J143q376j3536
18744D00273J074j5517k4194o603l00k933N512R568j2984q235q220j0087k9893
18731B97461j8335j1231k0808p503j4837j7766q005j5141p522q689o524J861o070
18718A56891j6824j0986p179j097n947R990k129J609M266J4608M622r28j7717
18705A29179j7859l069p779l440O480r923J1897K279Q39m697j333k838q428k286
18691H9022m717O226l316M144j4456l868j0433K808N211J4182Q585q050n148J446
18677H1636J4817J5629J8346K28o000p641P629R673J2619K0098J9799J5285J2945
$$ plain form
18664 215063 214148 203573 191790 184343 187063 192418 204923 209645 207345 217776 229659 246548 268021
18651 268021 315805 389560 533881 760788 1016414 1218186 1366133 1384255 1299052 1177085
18641 1177085 1047804 923104 822653 746954 687359 673370 683725 726567 771242 808661 804458
18630 804458 765928 704181 635672 581012 558094 518248 497227 491170 479311 482158 510621 554452
18618 554452 606598 700573 878755 1130331 1341063 1501229 1565245 1490617 1380062 1252637
18608 1252637 1139061 1062578 1037013 1040528 1071656 1114901 1166266 1195180 1179948 1144257 1107063
18597 1107063 1058702 1015701 1012693 1053528 1160272 1339269 1566901 1802788 1921790 1904662
18587 1904662 1803452 1605569 1398236 1237266 1122153 1020663 939246 867190 811007 766414
$$ packed form
18664B15063r15j0575j1783p447K720N355J2505M722k300J0431J1883J6889K1473
18651B68021M7784P3755J44321K26907K55626K01772J47947J8122q5203j21967
18641A177085j29281j24700j00451p5699n9595j3989J0355M2842M4675L7419m203
18630H04458l8530o1747o8509n4660k2918l9846k1021o057j1859K847K8463M3831
18618E54452N2146R3975J78182K51576K10732J60166O4016p4628j10555j27425
18608A252637j13576p6483k5565L515L1128M3245N1365K8914j5232l5691l7194
18597A107063m8361m3001l008M0835J06744J78997K27632K35887J19002j7128
18587A904662j01210j97883k07333j60970j15113j01490q1417p2056n6183m4593
$$ plain form
18577 766414 745381 753143 783157 800256 840407 909870 973071 1012211 1011040 973639 910592 859625
18565 859625 835263 837289 855012 918044 1037350 1204681 1430412 1672897 1841700 1883118 1802752
18554 1802752 1620457 1402519 1228773 1098142 992878 895359 817642 765240 722021 683771
18544 683771 651299 616301 595814 588668 577533 574849 607189 619619 618182 598524 552068 514210
18532 514210 494265 493073 492574 482045 464358 439207 428949 425398 428970 444613 470043 491015
18520 491015 513768 534267 538635 536964 525567 507704 488922 471609 453749 433177 428285 426536
18508 426536 435697 447044 454774 450495 446223 433606 425785 403397 369788 349477 354116 363508 362733
18495 362733 341433 333732 335289 349147 357982 359107 396812 439040 473407 490850 526277 529583
$$ packed form
18577G66414k1033P762L0014J7099M0151O9463O3201L9140j171l7401o3047n0967
18565H59625k4362K026J7723O3032J19306J67331K25731K42485J68803M1418q0366
18554A802752j82295k17938j73746j30631j05264r7519p7717n2402m3219l8250
18544F83771l2472l4998k0487p146j1135k684L2340J2430j437j9658m6456l7858
18532E14210j9945j192m99j0529j7687k5151j0258l551L572J5643K5430K0972
18520D91015K2753K0499M368j671j1397j7863j8782j7313j7860k0572m892j749
18508D26536R161J1347P730m279m272j2617p821k2388l3609k0311M639R392p75
18495C62733k1300p701J557J3858Q835J125L7705M2228L4367J7443L5427L306
$$ plain form
18483 529583 518616 507232 492199 480693 493028 497426 493260 489269 489182 495939 496358 495330 495918 490675
18469 490675 468959 463070 485825 502673 536041 568058 588815 592633 572305 563742 541929 515535
18457 515535 499930 493091 470506 452275 460138 457127 458394 463337 467757 472766 481530 498195 506495
18444 506495 514549 522066 527010 529587 526843 517686 532316 539690 539557 553366 580580 621145 662040
18431 662040 691075 709687 734584 738329 727625 711008 686437 678554 670410 657843 653927 659188
18419 659188 649561 635126 639928 656751 652563 645456 645680 653129 657961 672990 693623 703196 706610
18406 706610 718962 729440 741690 747704 762871 771691 782077 800564 814012 838181 854271 864676
18394 864676 882472 898033 900709 901200 904450 922359 935676 945316 956131 994113 1029512 1050211
$$ packed form
18483E29583j0967j1384j5033j1506J2335M398m166l991q7O757M19j028N88n243
18469D90675k1716n889K2755J6848L3368L2017K0757L818k0328q563k1813k6394
18457E15535j5605o839k2585j8231P863l011J267M943M420N009Q764J6665Q300
18444E06495Q054P517M944K577k744r157J4630P374j33J3809K7214M0565M0895
18431F62040K9035J8612K4897L745j0704j6617k4571p883q144j2567l916N261
18419F59188r627j4435M802J6823m188p107K24P449M832J5029K0633R573L414
18406G06610J2352J0478J2250O014J5167Q820J0386J8487J3448K4169J6090J0405
18394H64676J7796J5561K676M91L250J7909J3317R640J0815L7982L5399K0699
$$ plain form
18382 1050211 1065775 1071388 1094726 1099382 1128270 1154346 1175095 1205845 1243197 1278253 1328575 1382939
18370 1382939 1448493 1517623 1595863 1705860 1828964 1977961 2109596 2206890 2295469 2377840
18360 2377840 2453700 2536885 2640270 2797252 3025386 3382647 3902279 4672111 5651358 6662269
18350 6662269 7693122 8547415 8892377 8926634 8758811 8451644 8225960 8183650 8328189 8688746
18340 8688746 9302645 10211505 11535752 13501083 16517606 21280420 28797759 38902133
18332 38902133 49758392 61438962 71259503 75654710 76039784 73127396 67054064 59836725
18324 59836725 53266488 47596778 43184922 40480655 39655900 40495337 42126101 44109433
18316 44109433 45624987 45148385 43176389 40346565 36857707 33539427 30894697 28931345
$$ packed form
18382A050211J5564N613K3338M656K8888K6076K0749L0750L7352L5056N0322N4364
18370A382939O5554O9130P8240J09997J23104J48997J31635R7294Q8579Q2371
18360B377840P5860Q3185J03385J56982K28134L57261N19632P69832R79247J010911
18350F662269J030853Q54293L44962L4257j67823l07167k25684m2310J44539L60557
18340H688746O13899R08860J324247J965331L016523M762814P517339J0104374
18332C8902133J0856259J1680570R820541M395207L85074k912388o073332p217339
18324E9836725o570237n669710m411856k704267q24755Q39437J630764J983332
18316D4109433J515554m76602j971996k829824l488858l318280k644730j963352
$$ plain form
18308 28931345 27592710 26788821 26536379 26941567 28103994 30233821 33829010 39882222
18300 39882222 48995816 59526333 70883663 82072466 88482237 90336943 89325301 85526982
18292 85526982 80652885 76940826 74375334 72883990 72209602 71311925 70676029 70248545 69747133
18283 69747133 69707152 69644688 70079465 71996933 75618774 82318010 92135947 101975946 110544415
18274 110544415 116876837 116284364 109717095 100561701 89237658 77953082 68658606 61333686
18266 61333686 55582716 51068918 47519884 44817749 42950149 41987235 42131373 43696924
18258 43696924 46766152 50509752 54381763 57798793 58897605 57945686 55956771 53172259
18250 53172259 50668914 49478680 50080666 52931766 58138698 66214718 77532850 89554274
$$ packed form
18308B8931345j338635q03889k52442M05188J162427K129827L595189O053212
18300C9882222R113594J0530517J1357330J1188803O409771J854706j011642l798319
18292H5526982m874097l712059k565492j491344o74388q97677o35896m27484n01412
18283F9747133l9981o2464M34777J917468L621841O699236R817937R839999Q568469
18274A10544415O332422n92473o567269r155394j1324043j1284576r294476p324920
18266F1333686n750970m513798l549034k702135j867600r62914J44138J565551
18258D3696924L069228L743600L872011L417030J098812r51919j988915k784512
18250E3172259k503345j190234O01986K851100N206932Q076020J1318132J2021424
$$ plain form
18242 89554274 99941982 108483072 111367892 106952137 98992612 88484652 76924052 66891197
18234 66891197 58877898 52413995 47204664 42928097 39384907 36509543 34250934 32559480
18226 32559480 31459888 30938976 30732597 30603939 30493291 29835415 28610905 27158457 25498382
18217 25498382 23843999 22411141 21197281 20168465 19256450 18446618 17741723 17113219 16517735
18208 16517735 15961112 15435816 14929094 14448363 13992437 13530019 13102577 12730213 12350011
18199 12350011 11944074 11541855 11168193 10810073 10452160 10115414 9783179 9469760 9202291
18190 9202291 8958062 8723245 8490458 8255264 8032094 7845407 7663937 7497294 7324290
18181 7324290 7147488 6976423 6793183 6602025 6402704 6224730 6077116 5939427 5808946
$$ packed form
18242H9554274J0387708Q541090K884820m415755p959525j0507960j1560600j0032855
18234F6891197q013299o463903n209331m276567l543190k875364k258609j691454
18226C2559480j099592n20912k06379j28658j10648o57876j224510j452448j660075
18217B5498382j654383j432858j213860j028816r12015q09832p04895o28504n95484
18208A6517735n56623n25296n06722m80731m55926m62418m27442l72364l80202
18199A2350011m05937m02219l73662l58120l57913l36746l32235l13419k67469
18190I202291k44229k34817k32787k35194k23170j86687j81470j66643j73004
18181G324290j76802j71065j83240j91158j99321j77974j47614j37689j30481
$$ plain form
18172 5808946 5679670 5530655 5398640 5284056 5151211 5015066 4904672 4799921 4681826
18163 4681826 4564207 4446770 4342175 4261016 4187602 4112134 4027368 3931819 3826480 3716688
18153 3716688 3635158 3555646 3483759 3404645 3319877 3240905 3167010 3079367 2989753 2916512 2828619
18142 2828619 2730260 2634969 2563963 2500886 2457842 2431521 2395708 2377195 2352128 2308476 2280167
18131 2280167 2256929 2238812 2208183 2161385 2118731 2101756 2105579 2127684 2145580 2170016 2191445
18120 2191445 2200109 2215090 2252576 2316514 2403221 2491388 2596468 2735463 2971472 3366617 3968318
18109 3968318 4875401 6478905 9580760 13881010 15214667 13155927 10666053 8905190
18101 8905190 7835977 7169397 6578288 6020539 5465293 4907051 4428627 4045516 3698655
$$ packed form
18172E808946j29276j49015j32015j14584j32845j36145j10394j04751j18095
18163D681826j17619j17437j04595q1159p3414p5468q4766r5549j05339j09792
18153C716688q1530p9512p1887p9114q4768p8972p3895q7643q9614p3241q7893
18142B828619r8359r5291p1006o3077m3044k6321l5813j8513k5067m3652k8309
18131B280167k3238j8117l0629m6798m2654j6975L823K2105J7896K4436K1429
18120B191445Q664J4981L7486O3938Q6707Q8167J05080J38995K36009L95145O01701
18109C968318R07083J603504L101855M300250J333657k058740k489874j760863
18101H905190j069213o66580n91109n57749n55246n58242m78424l83111l46861
$$ plain form
18092 3698655 3398609 3149246 2928703 2747529 2620393 2519876 2406382 2298348 2206129 2112904
18082 2112904 2028415 1965786 1916362 1871224 1824629 1777638 1739651 1708037 1667253 1630945 1595529
18071 1595529 1546571 1499611 1469139 1443200 1413355 1417689 1445702 1468605 1505805 1555618 1543724
18060 1543724 1510255 1491586 1489577 1499158 1487465 1457860 1420976 1386242 1364931 1395841 1497696
18049 1497696 1709640 2023151 2334654 2629357 2924817 3074481 3027917 2908806 2737140 2491678
18039 2491678 2240051 2033476 1879888 1770650 1694999 1643050 1596607 1556751 1504462 1433376
18029 1433376 1353676 1302122 1255313 1201913 1175320 1132733 1090441 1054340 1021334 1003129 980750
18018 980750 940533 903088 876894 853044 841418 852140 847015 837855 856272 871457 880761 905432
$$ packed form
18092C698655l00046k49363k20543j81174j27136j00517j13494j08034r2219r3225
18082B112904q4489o2629m9424m5138m6595m6991l7987l1614m0784l6308l5416
18071A595529m8958m6960l0472k5939k9845M334K8013K2903L7200M9813j1894
18060A543724l3469j8669k009R581j1693k9605l6884l4734k1311L0910J01855
18049A497696K11944L13511L11503K94703K95460J49664m6564j19111j71666k45462
18039B491678k51627k06575j53588j09238p5651n1949m6443l9856n2289p1086
18029A433376p9700n1554m6809n3400k6593m2587m2292l6101l3006j8205k2379
18018I80750m0217l7445k6194k3850j1626J0722n125r160J8417J5185R304K4671
$$ plain form
18006 905432 939616 999769 1038606 1061048 1095317 1112688 1098118 1094618 1098161 1122128 1179303 1264544
17994 1264544 1382569 1562197 1813467 2071884 2273816 2386628 2372219 2214929 2022085 1836794
17984 1836794 1671373 1542202 1441153 1355564 1273438 1228226 1192744 1174651 1179614 1159840 1124618
17973 1124618 1080979 1036631 985394 932677 881026 849908 821458 776535 733289 708320 706608
17962 706608 700219 686644 670682 655361 671510 690451 693135 702248 714033 726495 731557 727863
17950 727863 740666 768792 802055 830966 854898 867204 855142 864795 886074 925143 963380 1034253
17938 1034253 1140456 1275411 1416002 1521985 1612797 1698642 1704502 1639211 1516523 1401621
17928 1401621 1295171 1202379 1137151 1089276 1062123 1041918 1039414 1020283 997002 958122 920900
$$ packed form
18006I05432L4184O0153L8837K2442L4269J7371j4570l500L543K3967N7175Q5241
17994A264544J18025J79628K51270K58417K01932J12812j4409j57290j92844j85291
17984A836794j65421j29171j01049q5589q2126m5212l5482j8093M963j9774l5222
17973A124618m3639m4348n1237n2717n1651l1118k8450m4923m3246k4969j712
17962G06608o389j3575j5962j5321J6149J8941K684R113J1785J2462N062l694
17950G27863J2803K8126L3263K8911K3932J2306j2062R653K1279L9069L8237P0873
17938A034253J06203J34955J40591J05983R0812Q5845N860o5291j22688j14902
17928A401621j06450r2792o5228m7875k7153k0205k504j9131k3281l8880l7222
$$ plain form
17917 920900 888848 875360 847700 834103 818465 797383 777700 761617 768626 762966 746643 754777
17905 754777 776859 790978 806354 808242 826375 844494 855773 864618 875679 893436 915859 941606
17893 941606 969010 981544 981647 971176 965656 964491 947868 941101 955333 979470 1026736 1091316
17881 1091316 1165859 1261347 1338851 1369935 1340384 1301940 1263257 1210719 1175082 1137091 1118124
17870 1118124 1102260 1088054 1097049 1123448 1149696 1153834 1166954 1188888 1197665 1212039 1237437 1292654
17858 1292654 1362889 1419003 1416580 1409286 1428833 1455599 1453825 1446824 1464413 1492373 1519093 1555093
17846 1555093 1627602 1725205 1822149 1945461 2130007 2406248 2790344 3193884 3529529 3708281
17836 3708281 3731217 3644020 3502503 3373214 3278116 3238760 3248343 3293106 3417012 3637592 3982495
$$ packed form
17917I20900l2052j3488k7660j3597j5638k1082j9683j6083P009n660j6323Q134
17905G54777K2082J4119J5376J888J8133J8119J1279Q845J1061J7757K2423K5747
17893I41606K7404J2534J03j0471n520j165j6623o767J4232K4137M7266O4580
17881A091316P4543R5488P7504L1084k9551l8444l8683n2538l5637l7991j8967
17870A118124j5864j4206Q995K6399K6248M138J3120K1934Q777J4374K5398N5217
17858A292654P0235N6114k423p294J9547K6766j774p001J7589K7960K6720L6000
17846A555093P2509R7603R6944J23312J84546K76241L84096M03540L35645J78752
17836C708281K2936q7197j41517j29289r5098l9356R583M4763J23906K20580L44903
$$ plain form
17825 3982495 4426881 4950859 5546252 6278745 7310838 8793581 10557643 12153137 12932527
17816 12932527 12816543 12168249 11482449 11034834 10855312 10911380 11188842 11746114 12639035
17807 12639035 13980609 15996686 18996378 23490017 30558595 41928360 58245728 77078874
17799 77078874 93279103 101255264 100263372 93024593 83029296 72809238 63526242 55795602
17791 55795602 49867487 45670465 43213240 42747247 44327298 47012797 49315562 49509427
17783 49509427 47283800 43461169 39249117 35462927 32279666 29621293 27377941 25555385
17775 25555385 24164388 23173312 22501494 22082584 21805848 21595906 21505344 21658690 22183097
17766 22183097 23219766 24758909 26516973 27976225 28960523 29923075 31660269 34768533
$$ packed form
17825C982495M44386N23978N95393P32493J032093J482743J764062J595494P79390
17816A2932527j15984o48294o85800m47615j79522N6068K77462N57272Q92921
17807A2639035J341574K016077K999692M493639P068578J1369765J6317368J8833146
17799G7078874J6200229P976161r91892p238779r995297j0220058r282996p730640
17791E5795602n928115m197022k457225m65993J580051K685499K302765J93865
17783D9509427k225627l822631m212052l786190l183261k658373k243352j822556
17775B5555385j390997r91076o71818m18910k76736k09942r0562J53346N24407
17766B2183097J036669J539143J758064J459252R84298R62552J737194L108264
$$ plain form
17758 34768533 38882122 42811041 44979996 45089778 44047808 43256672 43831117 46386634
17750 46386634 51537783 60523690 75222456 97182809 124951155 154061155 176391768
17743 176391768 186515331 182390873 167150093 146734149 126459255 109340213 95933454
17736 95933454 85605981 77826513 72573674 69936121 69400922 69689963 68996292 66184643
17728 66184643 61784561 57008200 52938755 49848900 47348779 44817923 42008820 39130077
17720 39130077 36518096 34339783 32563407 31059351 29744475 28557730 27507436 26570947
17712 26570947 25746373 25072114 24634782 24528627 24831466 25738831 27518166 30509988 34533882
17703 34533882 38598593 41206505 41414722 39762711 37461107 35650287 34884845 35410707
$$ packed form
17758C4768533M113589L928919K168955J09782j041970p91136N74445K555517
17750D6386634N151149Q985907J4698766K1960353K7768346K9110000K2330613
17743A76391768J0123563m124458j5240780k0415944k0274894j7119042j3406759
17736I5933454j0327473p779468n252839k637553n35199K89041o93671k811649
17728F6184643m400082m776361m069445l089855k500121k530856k809103k878743
17720C9130077k611981k178313j776376j504056j314876j186745j050294r36489
17712B6570947q24574o74259m37332j06155L02839R07365J779335K991822M023894
17703C4533882M064711K607912K08217j652011k301604j810820p65442N25862
$$ plain form
17695 35410707 37533836 41711417 48198714 57064357 67973359 79838357 89639995 93877010
17687 93877010 90264085 81035913 69860512 59795300 51887187 45709124 40705227 36592595
17679 36592595 33185609 30409160 28142193 26315030 24909712 23880436 23228506 23023731
17671 23023731 23158809 23333185 23139026 22318487 21047655 19639275 18365908 17304575 16388134
17662 16388134 15573315 14825068 14142130 13530611 12956521 12414652 11910330 11449085 11034618
17653 11034618 10644412 10278512 9936620 9640883 9356527 9086308 8819424 8576516 8340582
17644 8340582 8097676 7859032 7621847 7395796 7183117 6981209 6796643 6616392 6447390
17635 6447390 6281522 6125783 5971044 5818494 5658815 5506802 5370974 5231659 5077614
$$ packed form
17695C5410707K123129M177581O487297Q865643J0909002J1864998R801638M237015
17687I3877010l612925r228172j1175401j0065212p908113o178063n003897m112632
17679C6592595l406986k776449k266967j827163j405318j029276o51930k04775
17671B3023731J35078J74376j94159q20539j270832j408380j273367j061333r16441
17662A6388134q14819p48247o82938o11519n74090n41869n04322m61245m14467
17653A1034618l90206l65900l41892k95737k84356k70219k66884k42908k35934
17644H340582k42906k38644k37185k26051k12679k01908j84566j80251j69002
17635F447390j65868j55739j54739j52550j59679j52013j35828j39315j54045
$$ plain form
17626 5077614 4935434 4808859 4695245 4580059 4462791 4365811 4280129 4183858 4083179 3984807
17616 3984807 3884393 3766591 3645342 3531016 3419848 3287377 3164628 3088964 3046004 2994275
17606 2994275 2962689 2937294 2902752 2864762 2823648 2759427 2700140 2652621 2595741 2524200 2462013
17595 2462013 2391312 2330185 2286393 2235879 2187621 2129924 2088193 2071252 2030381 1984553 1959724
17584 1959724 1932562 1889607 1859419 1841132 1804311 1776017 1752554 1710405 1675139 1633672 1593219
17573 1593219 1552854 1516001 1472542 1424607 1392277 1350845 1320444 1291741 1268947 1244868 1205459
17562 1205459 1158098 1123380 1070169 1006234 939307 851781 757586 676311 625077 630547 659245
17551 659245 692736 726960 753584 757303 744756 737429 741394 729140 720084 696524 679461 661783
$$ packed form
17626E077614j42180j26575j13614j15186j17268r6980q5682r6271j00679r8372
17616C984807j00414j17802j21249j14326j11168j32471j22749p5664m2960n1729
17606B994275l1586k5395l4542l7990m1114o4221n9287m7519n6880p1541o2187
17595B462013p0701o1127m3792n0514m8258n7697m1731j6941m0871m5828k4829
17584A959724k7162m2955l0188j8287l6821k8294k3463m2149l5266m1467m0453
17573A593219m0365l6853m3459m7935l2330m1432l0401k8703k2794k4079l9409
17562A205459m7361l4718n3211o3935o6927q7526r4195q1275n1234N470K8698
17551F59245L3491L4224K6624L719j2547p327L965j2254r056k3560j7063j7678
$$ plain form
17539 661783 661528 654781 648682 649888 636190 630197 629433 632108 639490 642657 630401 625328 631990 641615
17525 641615 639432 640546 646427 630997 619139 605077 579684 560645 549889 520332 490918 459138
17513 459138 447232 444962 453582 445247 433927 419134 414802 395103 379633 353147 321273 295137
17501 295137 247801 213287 214686 216805 212134 230060 259485 281594 293163 300307 301274 314939 316242
17488 316242 310293 307444 301994 290998 298653 312108 311666 306169 302630 285318 278640 273119 267780 276395
17474 276395 292418 288560 264810 257216 257943 266144 265419 264142 247130 230713 222766 220249 229965 239325
17460 239325 242746 241882 240757 245721 231623 228617 224342 227378 217771 218936 219777 222948 228316 230793
17446 230793 216358 213391 219925 215744 215262 225151 240883 254194 257881 239615 246260 243250 229951
$$ packed form
17539F61783k55o747o099J206j3698n993p64K675P382L167j2256n073O662R625
17525F41615k183J114N881j5430j1858j4062k5393j9039j0756k9557k9414l1780
17513D59138j1906k270Q620q335j1320j4793m332j9699j5470k6486l1874k6136
17501B95137m7336l4514J399K119m671J7926K9425K2109J1569P144R67J3665J303
17488C16242n949k849n450j0996P655J3455m42n497l539j7312o678n521n339Q615
17474B76395J6023l858k3750p594P27Q201p25j277j7012j6417p947k517R716R360
17460B39325L421q64j125M964j4098l006m275L036r607J165Q41L171N368K477
17446B30793j4435k967O534m181m82R889J5732J3311L687j8266O645l010j3299
$$ plain form
17433 229951 226735 205694 194347 185232 168812 171331 181007 174608 157811 158263 168746 173714 176713
17420 176713 167435 163160 169807 186224 198039 196623 172293 158675 154451 156379 155929 144403 152386
17407 152386 157511 138396 130971 129295 135586 146424 149567 141949 138033 142027 144988 144509 142830 130546
17393 130546 131184 121463 111981 105832 113819 122715 120384 105914 101669 106298 108952 106697 102997 103427
17379 103427 110022 117607 119709 111007 101153 108817 124479 124708 111241 110348 110028 109168 101885 99023 111833
17364 111833 109662 122083 137516 115589 94104 85500 99435 116443 119203 121408 123404 113576 100933
17351 100933 98526 90832 100842 109140 115307 105708 98243 112701 116733 122384 130602 123069 135632
17338 135632 139887 141085 142389 138218 133695 124829 113216 107394 93987 80920 81702 75926 86893
$$ packed form
17433B29951l216k1041j1347r115j6420K519R676o399j6797M52J0483M968K999
17420A76713r278m275O647J6417J1815j416k4330j3618m224J928m50j1526P983
17407A52386N125j9115p425j676O291J0838L143p618l916L994K961m79j679j2284
17393A30546O38r721r482o149P987Q896k331j4470m245M629K654k255l700M30
17379A03427O595P585K102q702r854P664J5662K29j3467q93l20q60p283k862J2810
17364A11833k171J2421J5433k1927k1485q604J3935J7008K760K205J996r828j2643
17351A00933k407p694J0010Q298O167r599p465J4458M032N651Q218p533J2563
17338A35632M255J198J304m171m523q866j1613n822j3407j3067P82n776J0967
$$ plain form
17325 86893 101652 94793 93967 95050 90036 85181 89010 95382 81846 69875 75528 83247 94401 112885
17311 112885 102648 89976 86954 79743 77064 63943 62536 66234 71358 90907 112671 132259 130281
17298 130281 136786 139887 143532 155273 163542 166122 173128 195201 223754 240847 274030 306513 327400
17285 327400 329946 334380 335534 341631 360068 356892 336041 290116 271843 267461 283499 306548 310648
17272 310648 333436 360667 376605 372853 352679 330452 292437 274681 267107 234369 217079 214245
17260 214245 216905 220617 226074 234323 231162 232672 231291 211468 198397 181121 163460 147729 152907
17247 152907 168757 181102 200637 213806 218970 214739 210590 220730 243076 282447 340800 397046
17235 397046 438899 484191 534871 578617 607276 589423 588100 593533 595350 564551 531732 498504
$$ packed form
17325H6893J4759o859q26J083n014m855L829O372j3536j1971N653P719J1154J8484
17311A12885j0237j2672l022p211k679j3121j407L698N124J9549K1764J9588j978
17298A30281O505L101L645J1741Q269K580P006K2073K8553J7093L3183L2483K0887
17285C27400K546M434J154O097J8437l176k0851m5925j8273m382J6038K3049M100
17272C10648K2788K7231J5938l752k0174k2227l8015j7756p574l2738j7290k834
17260B14245K660L712N457Q249l161J510j381j9823j3071j7276j7661j5731N178
17247A52907J5850J2345J9535J3169N164m231m149J0140K2346L9371N8353N6246
17235C97046M1853M5292N0680M3746K8659j7853j323N433J817l0799l2819l3228
$$ plain form
17223 498504 460235 435171 450254 462204 487591 508841 536443 556752 575480 590442 585384 568578
17211 568578 535225 494232 463312 436442 396743 376041 371631 353015 339103 351638 346336 326023
17199 326023 285613 253207 240350 230993 222031 224818 215455 205398 208363 205428 210265 204711 200147
17186 200147 221554 241855 264003 287258 304650 311834 322390 340052 346880 355976 375227 377667
17174 377667 365369 362787 343282 319849 309611 290174 270158 268814 264856 255932 247709 251205 277348
17161 277348 306139 325012 345498 363532 379128 371517 360174 331672 315818 311884 294227 291058
17149 291058 299127 304525 304562 298105 305765 316970 348246 387646 435251 515989 631253 801902
17137 801902 1098878 1520643 2078923 2683336 3222996 3577193 3632249 3427326 3054552 2624583
$$ packed form
17223D98504l8269k5064J5083J1950K5387K1250K7602K0309J8728J4962n058j6806
17211E68578l3353m0993l0920k6870l9699k0702m410j8616j3912J2535n302k0313
17199C26023m0410l2406j2857r357q962K787r363j0057K965k935M837n554m564
17186B00147K1407K0301K2148K3255J7392P184J0556J7662O828R096J9251K440
17174C77667j2298k582j9505k3433j0238j9437k0016j344l958q924q223L496K6143
17161B77348K8791J8873K0486J8034J5596p611j1343k8502j5854l934j7657l169
17149B91058Q069N398L7o457P660J1205L1276L9400M7605Q0738J15264J70649
17137H01902K96976M21765N58280O04413N39660L54197N5056k04923l72774m29969
$$ plain form
17127 2624583 2202376 1859434 1587344 1385965 1215146 1067318 954416 854773 782123 726458
17117 726458 671668 624095 586468 533661 489008 465072 446758 423249 402183 377087 359255
17106 359255 359508 354867 336081 324902 327696 313204 301386 293844 272979 270159 264425 242875 232269
17093 232269 230437 236072 235949 231491 216640 201308 188728 177017 171378 179093 174941 182489 173288
17080 173288 169279 162928 157641 153622 141960 128597 148011 142852 128358 123245 114583 111855 105473
17067 105473 108124 111169 110900 115898 114379 115121 112858 111138 107412 97812 94223 92166 94297 77666
17053 77666 74330 75206 72332 72260 79561 85395 82893 83867 82090 79650 86901 71252 65485 70633 74404
17038 74404 68621 71046 66352 57602 60655 69727 83535 77223 76382 77312 74563 59333 56830 55996 50483
$$ packed form
17127B624583m22207l42942k72090k01379j70819j47828j12902r9643p2650n5665
17117G26458n4790m7573l7627n2807m4653k3936j8314k3509k1066k5096j7832
17106C59255K53m641j8786j1179K794j4492j1818p542k0865k820n734k1550j0606
17093B32269j832N635j23m458j4851j5332j2580j1711n639P715m152P548r201
17080A73288m009o351n287m019j1662j3363J9414n159j4494n113q662k728o382
17067A05473K651L045k69M998j519P42k263j720l726r600l589k057K131j6631
17053G7666l336Q76k874p2P301N834k502R74j777k440P251j5649n767N148L771
17038G4404n783K425m694q750L053R072J3808o312q41R30k749j5230k503q34n513
$$ plain form
17023 50483 50609 53542 44191 40733 45143 58559 51693 43351 38172 34337 35880 38329 49970 42155
17009 42155 44688 45503 52600 66827 69392 62238 53214 37974 41627 33096 32361 36715 40189 39274 34265
16994 34265 28877 24991 22990 25814 33902 30346 39815 40004 47078 47221 43767 38649 33681 38835 53452
16979 53452 57336 43329 29280 37133 40481 39823 44304 41447 28524 29932 12406 -7415 16385
16966 16385 37961 38628 23053 12502 8448 13297 15498 12728 35731 41914 35074 34484 37241 37503
16952 37503 36898 20688 12354 4362 7745 19145 14635 10681 8451 16230 22164 26956 26471 35889
16938 35889 35081 41691 32158 19554 28349 39029 37343 28263 23389 14971 13611 8257 3227 -512
16924 -512 -2086 514 16479 33139 35748 28172 18269 2328 14752 28771 23223 18427 35204
$$ packed form
17023E0483J26K933r351l458M410J3416o866q342n179l835J543K449J1641p815
17009D2155K533Q15P097J4227K565p154r024j5240L653q531p35M354L474r15n009
16994C4265n388l886k001K824Q088l556R469J89P074J43l454n118m968N154J4617
16979E3452L884j4007j4049P853L348o58M481k857j2923J408j7526j9821K3800
16966A6385K1576O67j5575j0551m054M849K201k770K3003O183o840n90K757K62
16952C7503o05j6210q334p992L383J1400m510l954k230P779N934M792m85R418
16938C5889q08O610r533j2604Q795J0680j686r080m874q418j360n354n030l739
16924e12j574K600J5965J6660K609p576r903j5941J2424J4019n548m796J6777
$$ plain form
16911 35204 37625 12689 3619 9661 20230 19967 22493 23510 16917 19870 23908 18926 21945 22748
16897 22748 30055 26948 14945 -13647 -12653 9940 18445 23078 25918 29218 30302 29476 21292 21963
16883 21963 21954 19517 6862 11987 8737 13586 4287 -7270 -3144 409 1609 2546 -9592 -7985 8574
16868 8574 15616 14098 -387 -7325 -10363 -17263 -6096 13523 3000 -2404 -815 -12 -4271 3590
16854 3590 19189 13066 7147 -5054 -11392 -7725 14047 20016 24108 25810 16651 16769 4621 7985
16840 7985 15031 5218 -10201 -5730 -1593 13586 11817 11075 888 -1278 12630 25825 22214 17945
16826 17945 25780 27378 23655 4283 -15044 -711 8315 13517 26919 23090 22435 15129 -457
16813 -457 -4383 1384 11860 17154 19888 6561 2919 -1859 -8948 -2107 2501 -1147 -14023 -11722
$$ packed form
16911C5204K421k4936r070O042J0569k63K526J017o593K953M038m982L019Q03
16897B2748P307l107j2003k8592R94K2593Q505M633K840L300J084q26q184O71
16883B1963rk437j2655N125l250M849r299j1557M126L553J200R37j2138J607J6559
16868H574P042j518j4485o938l038o900J1167J9619j0523n404J589Q03m259P861
16854C590J5599o123n919j2201o338L667K1772N969M092J702r159J18j2148L364
16840G985P046r813j5419M471M137J5179j769p42j0187k166J3908J3195l611m269
16826A7945P835J598l723j9372j9327J4333R026N202J3402l829o55p306j5586
16813d57l926N767J0476N294K734j3327l642m778p089O841M608l648j2876K301
$$ plain form
16799 -11722 -9619 -18812 -30991 -18006 -8702 2744 7728 6079 4603 11207 13488 8380 16241 13617
16785 13617 -6866 -4991 -8643 -14746 -12153 -17316 -13371 1549 -3089 -12669 -5026 -267 4474 1191
16771 1191 -5052 -7354 -1054 11313 25737 26712 20574 10014 2047 6422 14166 13741 13995 16512 18898
16756 18898 31158 43122 54793 47244 37039 24473 14015 10248 14814 13439 11519 5502 8619
16743 8619 2512 13906 18846 4243 6134 14389 8222 13854 21209 20766 21319 33693 29547 20422
16729 20422 12944 4432 2670 1091 -11341 -20463 -22305 -3700 -9647 537 13636 15588 18006
16716 18006 19286 17963 15041 3698 -2621 -3766 373 9940 9162 4255 15158 20437 7511 -11712
16702 -11712 -10969 -8818 -10119 -8734 6117 18116 12523 3191 -11149 -13419 -5393 1041 -2428 -9824
$$ packed form
16799a1722K103r193j2179J2985R304J1446M984j649j476O604K281n108P861k624
16785A3617k0483J875l652o103K593n163L945J4920m638r580P643M759M741l283
16771A191o243k302O300J2367J4424R75o138j0560p967M375P744m25K54K517K386
16756A8898J2260J1964J1671p549j0205j2566j0458l767M566j375j920o017L117
16743H619o107J1394M940j4603J891Q255o167N632P355m43N53J2374m146r125
16729B0422p478q512j762j579j2432r122j842J8605n947J0184J3099J952K418
16716A8006J280j323k922j1343o319j145M139R567p78m907J0903N279j2926j9223
16702a1712P43K151j301J385J4851J1999n593r332j4340k270Q026O434l469p396
$$ plain form
16688 -9824 -6325 3385 15853 22230 11352 1994 1525 -817 -298 -8089 -1607 5658 7022 10678 7457
16673 7457 -2558 -5051 -4069 3972 10617 9747 6126 7760 11556 -818 -13301 -15324 -11664 -10578
16659 -10578 -14946 -11885 -5016 1859 2393 2923 6515 2248 -6730 4642 17323 27146 21253 5442
16645 5442 -10418 -5734 3105 3472 10430 11101 9856 2191 -15962 -16647 -7520 -1687 12451 8768 10545
16630 10545 18141 20441 16042 7089 12219 21550 20241 963 -14002 -12981 -4377 -3249 -8046 -4370
16616 -4370 -3802 -12558 -21829 -18553 -26892 -19273 -16813 -15291 -25291 -16016 -13886 -17957 -15044 -6304 807
16601 807 8789 6257 -2606 3631 15577 11159 16356 16831 12397 19008 27729 20148 11790 11364 21910
16586 21910 13208 1872 -4563 -5355 -21621 -26750 -29242 -25914 -21204 -25574 -23147 -885 10122 20225
$$ packed form
16688i824L499R710J2468O377j0878r358m69k342N19p791O482P265J364L656l221
16673G457j0015k493R82Q041O645q70l621J634L796j2374j2483k023L660J086
16659a0578m368L061O869O875N34N30L592m267q978J1372J2681R823n893j5811
16645E442j5860M684Q839L67O958O71j245p665j8153o85R127N833J4138l683J777
16630A0545P596K300m399q953N130R331j309j9278j4965J021Q604J128m797L676
16616d370N68q756r271L276q339P619K460J522j0000R275K130m071K913Q740P111
16601H07P982k532q863O237J1946m418N197M75m434O611Q721p581q358m26J0546
16586B1910q702j1336o435p92j6266n129k492L328M710m370K427K2262J1007J0103
$$ plain form
16572 20225 13635 7951 11690 13690 18962 19747 25271 27579 19442 14788 16213 31033 30150 16474
16558 16474 6331 -3022 -10434 -9319 -3526 -1328 -5184 -2706 372 6611 -3260 -8797 -1164 -9394
16544 -9394 -15701 -17746 -31023 -24301 -13997 -8733 752 2404 -13376 -8241 7211 10686 13311 10169
16530 10169 1466 -6805 7675 10083 2958 1419 4062 751 -4777 6280 13641 5893 6222 6350
16516 6350 8076 553 -14775 -7582 -21124 -21775 -17513 -17026 -18743 -5984 14017 30673 27876 27260
16502 27260 19642 7294 -5425 -16819 -23784 -15178 1694 -5298 -2158 -2482 -16741 -13448 -24658
16489 -24658 -18835 -10003 5967 18726 13207 -6666 -9583 2106 -3887 -1244 11994 18706 16016
16476 16016 12462 10095 6964 543 9994 10263 908 5310 4672 -7913 -11042 -7435 -3316 1793 11481
$$ packed form
16572B0225o590n684L739K000N272P85N524K308q137m654J425J4820q83j3676
16558A6474j0143r353p412J115N793K198l856K478L078O239r871n537P633q230
16544i394o307k045j3277O722J0304N264R485J652j5780N135J5452L475K625l142
16530A0169q703q271J4480K408p125j539K643l311n528J1057P361p748L29J28
16516F350J726p523j5328P193j3542o51M262M87j717J2759K0001J6656k797o16
16502B7260p618j2348j2719j1394o965Q606J6872o992L140l24j4259L293j1210
16489b4658N823Q832J5970J2759n519j9873k917J1689n993K643J3238O712k690
16476A6016l554k367l131o421R451K69r355M402o38j2585l129L607M119N109R688
$$ plain form
16461 11481 8907 13126 2495 -2305 21335 27082 17337 6507 2166 9424 10311 7284 -4083 -15291
16447 -15291 -22937 -19162 -8583 -300 2938 7048 8485 7026 17687 1115 1157 3626 10222 15170
16433 15170 7240 12750 -148 406 5885 -3767 -5079 -9284 -12605 -666 -7394 -22836 -29782 -28402
16419 -28402 -8929 -2028 -4685 -121 12832 17382 12053 1575 -9857 -3964 -7725 -10661 -22614
16406 -22614 -8341 1830 12439 7455 1708 3438 11200 7496 13766 7082 9680 8125 1188 -2199
16392 -2199 2166 -357 5189 414 -4968 -11973 -11315 -1593 -5373 -13795 -17987 -16259 5188 13428 -13451
16377 -13451 -22502 -13060 -10949 -13238 -9359 8072 12462 17606 11712 -2627 -6172 -8020 -1938 -651
16363 -651 -6500 -11684 -16593 -12417 -2718 1367 377 -9825 -6105 -312 4207 -5729 -8350 -5788 3018
$$ packed form
16461A1481k574M219j0631m800K3640N747r745j0830m341P258Q87l027j1367j1208
16447a5291p646L775J0579Q283L238M110J437j459J0661j6572M2K469O596M948
16433A5170p930N510j2898N54N479r652j312m205l321J1939o728j5442o946J380
16419b8402J9473O901k657M564J2953M550n329j0478j1432N893l761k936j1953
16406b2614J4273J0171J0609m984n747J730P762l704O270o684K598j555o937l387
16392b199M365k523N546m775n382p005O58R722l780q422m192J728K1447Q240k6879
16377a3451r051R442K111k289L879J7431M390N144n894j4339l545j848O082J287
16363f51n849n184m909M176R699M085r90j0202L720N793M519r936k621K562Q806
$$ plain form
16348 3018 23940 30747 12646 -6507 -11697 -15556 -15101 1808 10319 10995 8376 24268 19862 2106
16334 2106 163 11659 16441 8606 -1916 -10732 -10905 2323 2034 7193 -2907 -4832 15837 11194
16320 11194 10203 12409 19054 13161 1658 -7191 -4545 8426 18914 20720 14816 764 3172 -1200
16306 -1200 2429 -4071 -6073 3352 -193 -3241 3135 13984 7695 2357 3238 -6182 -18853 -7664
16292 -7664 4825 8304 -2585 -9323 -5171 2884 12136 238 -2102 -10440 -13183 -171 -331 -12503
16278 -12503 -4363 11171 11116 -601 -214 3803 198 -5598 2233 -6438 -7977 -659 -660 5739 2788
16263 2788 -3449 -7961 -7885 -9142 -4935 3223 4297 -896 -1584 1949 4416 6066 -951 -8706 -2071
16248 -2071 8609 10788 12640 11032 15454 7857 -14113 -16207 -10767 -8173 -6841 -5599 3517 6083
$$ packed form
16348C018K0922O807j8101j9153n190l859M55J6909Q511O76k619J5892m406j7756
16334B106j943J1496M782p835j0522q816j73J3228k89N159j0100j925K0669m643
16320A1194r91K206O645n893j1503q849K646J2971J0488J806n904j4052K408m372
16306a200L629o500k002R425l545l048O376J0849o289n338Q81r420j2671J1189
16292g664J2489L479j0889o738M152Q055R252j1898k340q338k743J3012j60j2172
16278a2503Q140J5534n5j1717L87M017l605n796P831q671j539P318jO399k951
16263B788o237m512P6j257M207Q158J074n193o88L533K467J650p017p755O635
16248b071J0680K179J852j608M422p597k1970k094N440K594J332J242R116K566
$$ plain form
16234 6083 -4700 -14313 -16432 -15483 -2946 2872 2867 -10588 -4301 8645 13194 -5949 -20163 -7048
16220 -7048 3779 -2282 2827 4810 -1511 -7932 -9007 -7833 1836 2569 1629 -18855 -29539 -29403 -31070
16205 -31070 -22432 -20919 -26596 -10806 -10659 -9151 -1212 -2002 -2810 -9221 -14756 -2620 8500 6419
16191 6419 -2631 -4014 -2039 -1536 939 8326 2198 14 9067 11331 15301 1318 -10307 -9801 -7187
16176 -7187 -31034 -33540 -25520 -23884 -16441 -13573 -16896 -12781 -18232 -19223 -15401 -10990 -12314 -9033 1746
16161 1746 -9339 -20421 -24096 -6527 2062 8798 6914 8265 -6127 -4913 -1473 2333 8184 1236
16147 1236 -1451 5654 22991 35988 11317 -13196 -16257 -18000 -30489 -15731 -9953 -4961 9179
16134 9179 13014 5002 -3970 9769 7927 -2295 -7718 -14232 -11741 2096 -829 -3523 -6925 -11881
$$ packed form
16234F083j0783r613k119R49J2537N818nj3455O287J2946M549j9143j4214J3115
16220g048J0827o061N109J983o321o421j075J174R669P33r40k0484j0684J36j667
16205c1070Q638J513n677J5790J47J508P939p90q08o411n535J2136J1120k081
16191F419r050j383J975N03K475P387o128k184R053K264L970j3983j1625N06K614
16176g187k3847k506Q020J636P443K868l323M115n451r91L822M411j324L281J0779
16161A746j1085j1082l675J7569Q589O736j884J351j4392J214L440L806N851o948
16147A236k687P105J7337J2997k4671k4513l061j743j2489J4758N778M992J4140
16134I179L835q012q972J3739j842j0222n423o514K491J3837k925k694l402m956
$$ plain form
16120 -11881 -12310 -10291 -8494 -5076 -18191 -28672 -14376 2765 5178 12424 24165 12886 2700
16107 2700 -9798 -21170 -18584 -6330 3946 -1873 -10530 -20255 -15838 -14933 -14545 403 15536 8985
16093 8985 4763 -2932 -7030 -8410 -6182 -3680 808 8244 2700 -706 3007 -3441 -6021 2043 4616
16078 4616 -4056 -5433 -8984 -21000 -28176 -22860 -15528 -11539 -7261 10775 12881 -7644 -12470 -13011
16064 -13011 -13305 -13023 -15706 -16614 -18008 -12418 4182 1279 -1047 8164 17802 17964 12098 9871 12806
16049 12806 11120 4756 425 -9367 -9035 -1511 4231 1601 -420 -8251 -11271 -14019 -3265 -13922
16035 -13922 -19249 -20168 -18370 -13236 -4975 -2586 -1570 -5705 -5772 6907 5157 -4419 1652 9676 9546
16020 9546 11878 26572 30215 19955 13019 -540 21 15196 20756 21168 26567 23486 4970 -302
$$ packed form
16120a1881m29K019J797L418j3115j0481J4296J7141K413P246J1741j1279j0186
16107B700j2498j1372K586J2254J0276n819q657r725M417R05L88J4948J5133o551
16093H985m222p695m098j380K228K502M488P436n544l406L713o448k580Q064K573
16078D616q672j377l551j2016p176N316P332L989M278J8036K106k0525m826n41
16064a3011k94K82k683r08j394N590J6600k903k326R211R638J62n866k227K935
16049A2806j686o364m331r792L32P524N742k630k021p831l020k748J0754j0657
16035a3922n327r19J798N134Q261K389J016m135o7J2679j750r576O071Q024j30
16020I546K332J4694L643j0260o936j3559N61J5175N560M12N399l081j8516n272
$$ plain form
16006 -302 -4396 -21834 -30847 -21502 -15773 -5308 12499 14108 2129 -16588 -24691 -18386 6504
15993 6504 12622 9934 1250 4133 6686 -13084 -15338 -5265 -9464 -25913 -25668 -12380 -1002 655
15979 655 10343 8869 4137 13155 12837 7744 14449 22891 18606 10118 -5127 1204 12920 5592 1804
15964 1804 -10169 -8354 -3847 -10079 -6709 -5762 -5996 -3871 4289 7592 4184 -10607 -13284 -6125 -14338
15949 -14338 -30904 -31436 -19123 -5340 3159 674 3684 8294 3655 12330 20796 20078 -1623 -15061
15935 -15061 -22915 -12147 -13850 -11126 -6384 -19027 -18173 -13283 -1262 1718 -15684 -11120 15
15922 15 -1714 -4523 -555 -119 -17478 -16319 -20380 -25965 -22545 -15396 -5925 7564 14435 9779 -5233
15907 -5233 5596 16582 11986 13768 9836 5635 1433 -10748 -21254 -23439 -10483 539 -1807
$$ packed form
16006c02m094j7438r013R345N729J0465J7807J609j1979j8717q103O305K4890
15993F504O118k688q684K883K553j9770k254J0073m199j6449K45J3288J1378J657
15979F55R688j474m732R018l18n093O705Q442m285q488j5245O331J1716p328l788
15964A804j1973J815M507o232L370R47k34K125Q160L303l408j4791k677P159q213
15949a4338j6566n32J2313J3783Q499k485L010M610m639Q675Q466p18k1701j3438
15935a5061p854J0768j703K724M742j2643Q54M890J2021K980j7402M564J1135
15922A5j729k809L968M36j7359J159m061n585L420P149R471J3489O871m656j5012
15907e233J0829J0986m596J782l932m201m202j2181j0506k185J2956J1022k346
$$ plain form
15894 -1807 -12761 -11408 -10207 -1847 -3655 -9522 -5768 -4692 3488 6413 6729 9846 3800 -4069 -268
15879 -268 3396 -2064 -11869 -24361 -13616 2832 -12168 -14077 -10255 2023 -8089 -14446 -29226
15866 -29226 -31019 -20908 -12583 -9137 32 -2962 -6430 -1230 10930 9777 -8790 -17725 -22851 -32265
15852 -32265 -22096 -11695 -10034 3849 9184 6554 3236 3453 3273 -4600 -9001 -12116 -10808 537
15838 537 4943 766 -9831 -23621 -31095 -26757 -27558 -18017 -454 149 -13757 -7690 -9509 -11161
15824 -11161 -14351 -24710 -20138 -14793 -26763 -19452 -12953 -25821 -32033 -27038 -18774 -19672 -17839 -8102
15810 -8102 -4767 -12356 1275 17931 29272 28590 12091 12312 17283 13807 10041 11806 5236 -1701
15796 -1701 -535 -5812 -18536 791 9874 11946 8924 11588 5453 4289 9018 3077 3614 -2982
$$ packed form
15894a807j0954J353J201Q360j808n867L754J076Q180K925L16L117o046p869L801
15879b68L664n460r805j2492J0745J6448j5000j909L822J2278j0112o357j4780
15866b9226j793J0111Q325L446R169k994l468N200J2160j153j8567q935n126r414
15852c2265J0169J0401J661J3883N335k630l318K17j80p873m401l115J308J1345
15838E37M406m177j0597j3790p474M338q01R541J7563O03j3906O067j819j652
15824a1161l190j0359M572N345j1970P311O499j2868o212M995Q264q98J833R737
15810h102L335p589J3631J6656J1341o82j6499K21M971l476l766J765o570o937
15796a701J166n277j2724J9327R083K072l022K664o135j164M729n941N37o596
$$ plain form
15782 -2982 -10071 -5159 -12762 -23764 -28980 -23932 -10611 -4748 -5555 -21683 -24009 -30228 -18712 -11312
15768 -11312 -6598 7392 11398 12905 7193 -3653 -20626 -16893 4477 2422 4631 -6318 -3954
15755 -3954 8101 23481 23677 23078 4956 -2464 -16311 -18555 -19266 -9668 2245 19084 6415 -7613
15741 -7613 -520 1385 -3930 2050 4097 -3550 8034 8749 -2856 -2503 -24051 -29507 -12034 -4151
15727 -4151 -6587 -18118 -16383 -7150 -11414 -14788 -21866 -21559 -12710 -19991 -20172 -13220 -4474 7018 3919
15712 3919 6877 5885 2741 3575 788 9302 3546 -15304 -11686 -2940 -992 2353 -2662 -9796 -56
15697 -56 11825 862 3996 7313 -2088 -16790 -14266 -6107 9222 16780 29096 18401 -5297
15684 -5297 -12256 -6193 -2155 -4349 -5795 2480 -2942 2549 2767 -1297 2390 -2619 6112 5274 5822
$$ packed form
15782b982p089M912p603j1002n216N048J3321N863q07j6128k326o219J1516P400
15768a1312M714J3990M006J507n712j0846j6973L733K1370k055K209j0949K364
15755c954J2055J5380J96n99j8122p420j3847k244p11R598J1913J6839j2669j4028
15741g613P093J905n315N980K047p647J1584P15j1605L53k1548n456J7473P883
15727d151k436j1531J735R233m264l374p078L07Q849p281j81O952Q746J1492l099
15712C919K958r92l144Q34k787Q514n756j8850L618Q746J948L345n015p134R740
15697e6J1881j0963L134L317r401j4702K524Q159J5329P558J2316j0695k3698
15684e297o959O063M038k194j446Q275n422N491K18m064L687n009Q731q38N48
$$ plain form
15669 5822 2178 -3742 -2544 -1971 -3964 -7687 -6650 -4535 -830 -15811 -28616 -20013 3693 19912
15655 19912 7776 -2788 -15513 -2727 3219 14825 13584 -2143 -10922 -7841 -1657 -9295 -17571
15642 -17571 -18788 -18601 -12067 -8695 -13727 -10313 -9250 4074 20 -7708 118 3183 -9489 -11392
15628 -11392 -8968 -15628 -11201 -6389 -5609 -4088 -12492 -14529 -9776 4739 11093 9621 13870 9772
15614 9772 233 7338 11149 1856 6141 8458 -493 -16141 -14875 -7596 -11497 -12128 -8534 -24194
15600 -24194 -35548 -24537 -13741 -14306 -4241 -3116 -9076 -4539 -2400 4685 2870 11809 22161
15587 22161 21785 13027 17022 -2502 -14991 -6689 -6044 -7965 -25266 -26420 -19879 -6273 -13858 -29643
15573 -29643 -38669 -34296 -26891 -13729 -5016 -3830 -7907 -18951 -17727 -6537 -7191 -24803 -37308
$$ packed form
15669E822l644n920J198N73j993l723J037K115L705j4981j2805Q603K3706J6219
15655A9912j2136j0564j2725J2786N946J1606j241j5727q779L081O184p638q276
15642a7571j217J87O534L372n032L414J063J3324m054p728P826L065j2672j903
15628a1392K424o660M427M812P80J521q404k037M753J4515O354j472M249m098
15614I772r539P105L811r293M285K317q951j5648J266P279l901o31L594j5660
15600b4194j1354J1011J0796n65J0065J125n960M537K139P085j815Q939J0352
15587B2161l76q758L995j9524j2489Q302O45j921j7301j154O541J3606p585j5785
15573b9643r026M373P405J3162Q713J186m077j1044J224J1190o54j7612j2505
$$ plain form
15560 -37308 -37239 -28902 -17058 -9163 -7059 890 -3162 -4664 -23364 -21015 -8979 -13268 -22581 -20141
15546 -20141 -4555 -11138 -9390 -693 2581 777 -5966 -12321 -19021 -5095 246 -3787 -5047 -6796
15532 -6796 -14156 -24898 -22238 -18283 -14572 -7403 4118 1446 2251 2770 -4775 -11581 -12849 -20644 -23791
15517 -23791 -24184 -12181 5719 314 -9541 -18977 -13926 -1432 13074 10553 4619 9632 8501 -8120
15503 -8120 1470 1094 -4090 -3041 -16530 -21856 -16971 -6989 389 10569 5136 -4795 -9556 -21196
15489 -21196 -26168 -14073 -11267 -3531 -8232 -17477 -21339 -29169 -22028 -21675 -22358 -9110 -6541 -1968
15475 -1968 -2295 -597 4888 3588 -5232 4956 18337 10730 10306 1317 -897 -884 -11921 451 1317
15460 1317 3374 -3685 -4341 -1535 5597 17262 26795 27722 29840 22694 21552 7974 4627 -134 105
$$ packed form
15560c7308O9Q337J1844P895K104P949m052j502j8700K349J2036m289r313K440
15546b0141J5586o583J748Q697L274j804o743o355o700J3926N341m033j260j749
15532f796p360j0742K660L955L711P169J1521k672Q05N19p545o806j268p795l147
15517b3791l93J2003J7900n405r855r436N051J2494J4506k521n934N013j131j6621
15503h120R590l76n184J049j3489n326M885R982P378J0180n433r931m761j1640
15489b1196m972J2095K806P736m701r245l862p830P141L53o83J3248K569M573
15475a968l27J698N485j300q820J0188J3381p607m24q989k214J3j1037J2372Q66
15460A317K057p059o56K806P132J1665R533R27K118p146j142j3578l347m761K39
$$ plain form
15445 105 2886 9992 8911 3503 5242 2667 -3189 1611 -1953 -15861 -16022 -14349 -6743 3615 8573
15430 8573 -8829 -13099 -17827 -14117 -12358 -7057 -4985 -1183 6531 2337 -6942 3848 -8043 -31980
15416 -31980 -54696 -51140 -31449 -24479 -18216 -13264 -16364 -16692 -14282 -5677 -9153 -15227 -20011 -19071
15402 -19071 -14185 -9640 -1465 -12038 -12812 -23939 -17048 -6666 8116 10077 5011 16581 10663
15389 10663 -5433 -2952 -3867 -4867 -8390 -10106 -9674 -9574 -9809 -11323 -20349 -13352 1199 4601 910
15374 910 -2450 -874 -1970 -5124 2524 7055 -1483 -7324 -21005 -24552 -11670 -7132 -3564 -3490 -6834
15359 -6834 -30 4072 -2437 -6079 -2621 -3312 -13953 -4844 -11772 -9357 -16907 -20075 -9654 778
15345 778 -568 3083 7889 10091 -147 2706 -10177 2468 10873 1415 -9398 -2996 3902 -529
$$ packed form
15445A05K781P106j081n408J739k575n856M800l564j3908j61J673P606J0358M958
15430H573j7402m270m728L710J759N301K072L802P714m194r279J0790j1891k3937
15416c1980k2716L556J9691O970O263M952l100l28K410Q605l476o074m784R40
15402a9071M886M545Q175j0573p74j1127O891J0382J4782J961n066J1570n918
15389A0663j6096K481r15j000l523j716M32J00k35j514r026O997J4551L402l691
15374I10l360J576j096l154P648M531q538n841j3681l547J2882M538L568P4l344
15359f834O804M102o509l642L458o91j0641R109o928K415p550l168J0421J0432
15345G78j346L651M806K202j0238K853j2883J2645Q405r458j0813O402O898m431
$$ plain form
15331 -529 -6010 -2696 2850 7871 6412 -1716 -3717 9885 11537 12057 250 -4732 -4977 -11211 -25581
15316 -25581 -16708 -9570 -1489 3681 -6269 -5081 -8060 -6739 -3268 776 -3391 13517 9623 -9553
15302 -9553 -21039 -14901 -28168 -32501 -29485 -31736 -36569 -27198 -15802 -3033 -5234 -734 -7188 -25229
15288 -25229 -28783 -27489 -20803 -11836 -6808 -8821 -10029 -10849 -10891 -3115 2344 12154 13151 28463 25407
15273 25407 14718 9450 8751 -5679 -14135 -15046 -24423 -38005 -38109 -20249 -10660 -4103 -12153 -4335
15259 -4335 -16275 -15027 -16349 -23507 -13897 -6469 -2004 7372 8592 -4664 -10006 -10687 -7841 -17027
15245 -17027 -11573 -16323 -19827 -12930 -14615 -6969 -11260 -15155 -15917 -3213 2018 -5589 -12957 -3443
15231 -3443 10130 9559 -12626 -12568 -187 6190 16916 19787 16124 22902 13328 12707 14894 11903 8044
$$ packed form
15331e29n481L314N546N021j459q128k001J3602J652N20j1807m982k45o234j4370
15316b5581Q873P138Q081N170r950J188k979J321L471M044m167J6908l894j9176
15302i553j1486O138j3267m333L016k251m833R371J1396J2769k201M500o454j8041
15288b5229l554J294O686Q967N028k013j208q20m2P776N459R810R97J5312l056
15273B5407j0689n268o99j4430q456r11r377j3582j04J7860R589O557q050P818
15259d335j1940J248j322p158R610P428M465R376J220j3256n342o81K846r186
15245a7027N454m750l504O897j685P646m291l895p62J2704N231p607p368R514
15231c443J3573n71k2185N8J2381O377J0726K871l663O778r574o21K187k991l859
$$ plain form
15216 8044 2818 -522 1109 2818 5832 -4180 -11325 -1125 -532 90 1684 -12159 -15721 -8755
15202 -8755 -12459 -13472 -21171 -26088 -15643 -10705 -1085 -5418 -1621 2724 12567 12301 5543 -637 -11681
15187 -11681 -25984 -22949 -6353 5528 9959 14289 12015 11944 11747 13672 27891 32017 23744 17349
15173 17349 19985 21156 6535 1427 -647 1806 -8506 -12080 -6434 2412 10033 5806 4594 -1806
15159 -1806 1185 1859 6843 5174 13766 10244 4623 3943 -2359 -4846 -597 -13418 -21870 -10321 -18483
15144 -18483 -8245 10370 15055 3635 -5831 -1318 10947 -234 -18739 -24509 -10024 -6187 -13057
15131 -13057 -5524 -148 2143 -5098 -10776 -1081 -3914 -17241 -14294 -16834 -25259 -18974 -8621 6275
15117 6275 7730 1879 -4498 -16087 -21182 -21458 -17848 -8423 2119 9563 16294 13143 9899 -1871
$$ packed form
15216H044n226l340J631J709L014j0012p145J0200N93O22J594j3843l562O966
15202h755l704j013p699m917J0445M938R620m333L797M345R843k66o758o180j1044
15187a1681j4303L035J6596J1881M431M330k274p1j97J925J4219M126q273o395
15173A7349K636J171j4621n108k074K453j0312l574N646Q846P621m227j212o400
15159a806K991O74M984j669Q592l522n621o80o302k487M249j2821q452J1549q162
15144a8483J0238J8615M685j1420r466M513J2265j1181j8505n770J4485L837o870
15131a3057P533N376K291p241n678R695k833j3327K947k540q425O285J0353J4896
15117F275J455n851o377j1589n095k76L610R425J0542P444O731l151l244j1770
$$ plain form
15103 -1871 -17133 -17882 1612 3249 12682 13719 7829 16448 11807 -1788 -15183 -15644 -9968 -18810
15089 -18810 -34169 -35431 -24195 -20774 -20421 -23477 -21243 -8495 6364 16053 27989 2937 -2744
15076 -2744 8508 -2774 -18537 -11988 3417 -3417 -20097 -34917 -17410 4653 -4214 -10251 -5117
15063 -5117 4009 -952 -19392 -12711 -2767 -16152 -30061 -31928 -18071 -7232 -5855 -5594 -10200 -19522
15049 -19522 -20125 -9818 8741 19442 19695 27300 27718 32418 44271 50748 47432 29954 26459 36227
15035 36227 44754 53398 42999 20432 20311 20500 13461 7464 -3329 2708 -5834 -10045 -19430 -21737
15021 -21737 -12949 -7687 -4922 -4759 -7309 -16722 -22389 -31465 -26908 -17693 -9396 -9421 -22961 -10768 -2881
15006 -2881 -12505 -14937 -6249 -9589 -10307 -10768 -21248 -20812 -18403 -21889 -19363 -16037 -14596 -19377 -3510
$$ packed form
15103a871j5262p49J9494J637R433J037n890Q619m641j3595j3395m61N676q842
15089a8810j5359j262J1236L421L53l056K234J2748J4859R689J1936k5052n681
15076b744J1252j1282j5763O549J5405o834j6680j4820J7507K2063q867o037N134
15063e117R126m961j8440O681R944j3385j3909j867J3857J0839J377K61m606r322
15049a9522o03J0307J8559J0701K53P605M18M700J1853O477l316j7478l495R768
15035C6227Q527Q644j0399k2567j21J89p039n997j0793O037q542m211r385k307
15021b1737Q788N262K765J63k550r413n667r076M557R215Q297k5j3540J2193P887
15006b881r624k432Q688l340p18m61j0480M36K409l486K526L326J441m781J5867
$$ plain form
14991 -3510 1456 -1851 -3418 -17037 -14972 -4137 -1900 7403 6952 2104 -9417 -4708 17190 23971
14977 23971 8491 2872 90 -1988 -8011 -19789 -9927 -11520 -15442 -6825 -1586 1359 2742 2973
14963 2973 17985 24234 19116 9074 -3412 -8193 -7684 -16751 -15402 -695 -4214 -14373 -4034
14950 -4034 -1501 -1195 -6175 -12622 -21212 -22550 -17136 -12084 -2414 -1767 8891 41394 37232 24300
14936 24300 17407 13291 12884 17189 9436 -8552 -22202 -13444 -10561 -19783 -23883 -21392 -21983 -16308
14922 -16308 -4284 -10978 -28097 -20950 -10006 2450 7284 9424 8864 10 -1829 -12112 -13885
14909 -13885 -18439 -13799 -8818 -11432 -6340 -4272 -18270 -26222 -37715 -34781 -34223 -36197 -14734 -11339
14895 -11339 -12343 -11089 -15227 -8115 -1295 -757 7507 151 -5098 2903 -3766 4061 4049 814 -13341
$$ packed form
14991c510M966l307j567j3619K065J0835K237R303m51m848j1521M709K1898O781
14977B3971j5480n619k782k078o023j1778R862j593l922Q617N239K945J383K31
14963B973J5012O249n118j0042j2486m781N09r067J349J4707l519j0159J0339
14950d034K533L06m980o447q590j338N414N052R670O47J0658L2503m162j2932
14936B4300o893m116m07M305p753j7988j3650Q758K883r222m100K491n91N675
14922a6308J2024o694j7119P147J0944J2456M834K140n60q854j839j0283j773
14909a3885m554M640M981k614N092K068j3998p952j1493K934N58j974K1463L395
14895a1339j004J254m138P112O820N38Q264p356n249Q001o669P827j2l235j4155
$$ plain form
14880 -13341 -5090 -5126 -12184 -13183 -14969 1310 7824 1627 -5670 -9142 -12873 -14317 -28644 -32229 -23712
14865 -23712 -9622 6225 7419 -2474 -146 3853 -5562 -17393 -17779 -24182 -24512 -24378 -32049 -39286
14851 -39286 -34381 -23097 -15780 -9868 -7385 8093 11249 2221 -8885 -21541 -21663 -12262 -7069 -6525
14837 -6525 -6508 -10370 -11148 -7627 -88 15578 10576 -422 -14802 -7094 -63 168 1845 14944 1977
14822 1977 -6163 -9977 -11686 -21944 -33292 -22269 617 31733 37400 41910 40523 44071 51615
14809 51615 67205 88538 93683 85985 88387 92334 93828 83905 71352 65926 74006 70696 69214 61219
14795 61219 39157 27941 31996 15362 8125 22950 32825 27750 32570 21188 5828 1046 16021
14782 16021 15998 25061 36096 20866 7977 3413 3051 -3731 4512 -10987 -22983 -9061 10831
$$ packed form
14880a3341Q251l6p058r99j786J6279O514o197p297l472l731j444j4327l585Q517
14865b3712J4090J5847J194r893K328L999r415j1831l86o403l30J34p671p237
14851c9286M905J1284P317N912K483J5478L156r028j1106j2656j22R401N193N44
14837f525J7l862p78L521P539J5666n002j0998j4380P708P031K31J677J3099j2967
14822A977q140l814j709j0258j1348J1023K2886L1116N667M510j387L548P544
14809E1615J5590K1333N145p698K402L947J494r923j2553n426Q080l310j482p995
14795F1219k2062j1216M055j6634p237J4825R875n075M820j1382j5360m782J4975
14782A6021k3R063J1035j5230j2889m564l62o782Q243j5499j1996J3922J9892
$$ plain form
14769 10831 28239 40182 28978 18301 8514 923 -5230 -1015 2301 15891 12814 1308 -1698
14756 -1698 1867 -1951 -4435 8127 3876 13215 22939 19297 4642 454 3623 -1912 -6409 -5477
14742 -5477 154 -2225 -7128 -1117 10958 17664 12051 16917 17101 16808 20553 14973 32270 44256
14728 44256 32698 32307 36929 40013 22366 1788 -919 13699 34696 50270 49683 37025 16221
14715 16221 -3358 -4564 13564 24854 16708 7027 -15073 -13970 -12590 -14878 -11630 -465 7833
14702 7833 13822 3821 7116 6937 -6823 -7053 -16865 -12452 -5854 4195 10126 290 -16458 -11550
14688 -11550 3388 20488 20847 21496 14510 2855 -327 -3065 -2980 17592 11320 2747 1132 1799 -2362
14673 -2362 3906 9668 4524 6611 -7672 -6806 -11229 6009 4487 8691 21299 21466 21559 23275 18913
$$ packed form
14769A0831J7408J1943j1204j0677r787p591o153M215L316J3590l077j1506l006
14756a698L565l818k484J2562m251R339R724l642j4655m188L169n535m497R32
14742e477N631k379m903O011J2075O706n613M866J84k93L745n580J7297J1986
14728D4256j1558l91M622L084j7647k0578k707J4618K0997J5574n87j2658k0804
14715A6221j9579j206J8128J1290q146r681k2100J103J380k288L248J1165Q298
14702G833N989j0001L295j79j3760k30r812M413O598J0049N931r836j6748M908
14688a1550J4938J7100L59O49o986j1655l182k738Q5K0572o272q573j615O67m161
14673b362O268N762n144K087j4283Q66m423J7238j522M204J2608J67R3J716m362
$$ plain form
14658 18913 25099 26675 25826 24205 20660 23620 30140 30512 14444 18236 29325 31320 27150 31376
14644 31376 29472 30468 28253 15930 7892 20536 19921 3618 -34 -15195 -18528 -19194 -12500 4347
14630 4347 14179 27921 21360 14267 11273 8156 15450 1023 -961 -6001 -6149 -2886 3255 5240
14616 5240 2334 379 189 1535 692 -6996 -3650 2762 6298 10889 16351 11922 9660 3495 5885
14601 5885 6600 10683 11151 2320 -5299 -7788 1400 7533 10834 15221 2937 -16285 -13859 -3622
14587 -3622 8035 -1701 -5367 5799 3443 -12743 -7485 -4634 -21914 -20738 -12366 -9294 -11565 -5548
14573 -5548 1434 3065 6042 12528 11708 1747 -1681 2503 15071 17195 6153 -8725 -9861 -6593
14559 -6593 -8813 -8646 -7870 -148 11326 20157 115 272 1535 -6592 -3312 1810 6594 -2351 -12736
$$ packed form
14658A8913O186J576q49j621l545K960O520L72j6068L792J1089J995m170M226
14644C1376j904R96k215j2323q038J2644o15j6303l652j5161l333o66O694J6847
14630D347R832J3742o561p093k994l117P294j4427j984n040j48L263O141J985
14616E240k906j955j90J346q43p688L346O412L536M591N462m429k262o165K390
14601E885P15M083M68q831p619k489R188O133L301M387j2284j9222K426J0237
14587c622J1657r736l666J1166k356j6186N258K851j7280J176Q372L072k271O017
14573e548O982J631K977O486q20r961l428M184J2568K124j1042j4878j136L268
14559f593k220J67P76P722J1474Q831k0042J57J263q127L280N122M784q945j0385
$$ plain form
14544 -12736 -5314 -6950 -15005 8333 30645 23974 13548 9838 -178 1145 13184 16832 1292
14531 1292 -4028 -271 16249 14329 2963 -3577 1265 21043 17910 15428 20394 10501 5253 5673
14517 5673 7384 11045 16046 3460 7083 8563 2703 4467 4261 -10152 -8639 -1721 3460 -4963
14503 -4963 3435 14967 8101 2871 -11581 -19061 -16146 1307 11090 15101 3844 -11401 -9521
14490 -9521 1671 7876 12473 11750 -3895 -18410 -18908 -6130 65 -5339 7237 -11030 -10193 -7644
14476 -7644 48 11978 6641 5519 6988 13874 18353 11810 -3235 16886 25522 33203 40647 41794
14462 41794 30757 29920 40763 30080 19254 13537 20045 23111 20577 17153 91 -3334 18807
14449 18807 12879 399 2565 17896 16307 12668 6007 4716 228 13869 31100 27066 7964
$$ packed form
14544a2736P422j636q055K3338K2312o671j0426l710j0016J323J2039L648j5540
14531A292n320L757J6520j920j1366o540M842J9778l133k482M966r893n248M20
14517E673J711L661N001j2586L623J480n860J764k06j4413J513O918N181q423
14503d963Q398J1532o866n230j4452p480K915J7453R783M011j1257j5245J880
14490i521J1192O205M597p23j5645j4515m98J2778O195n404J2576j8267Q37K549
14476g644P692J1930n337j122J469O886M479o543j5045K0121Q636P681P444J147
14462D1794j1037q37J0843j0683j0826n717O508L066k534l424j7062l425K2141
14449A8807n928j2480K166J5331j589l639o661j291m488J3641J7231m034j9102
$$ plain form
14436 7964 3212 10462 5331 -4710 -3846 5765 973 890 4380 12513 25800 20988 19805 -684 -9736
14421 -9736 4644 18459 14030 10568 23879 15511 9676 17596 4939 -867 2972 2179 -2206 -7668
14407 -7668 -6998 5997 8065 -4268 -5932 4892 27258 20393 13347 23109 40504 43526 45002 34707
14393 34707 42781 42729 30391 15637 13519 14439 24702 26806 29069 26342 22356 20344 16103 26533
14379 26533 35560 32378 28573 44386 53146 36494 26703 32509 41819 36341 25842 15160 2295
14366 2295 10653 32137 22913 15141 17265 29031 32805 27091 32526 41552 39171 47837 47928 48199 41510
14351 41510 50669 48984 47714 46787 31767 28315 22292 12053 14423 10895 14058 23777 28374 36065
14337 36065 38464 37827 38027 35099 35355 37938 49735 54453 51440 49209 37343 23537 17918 26617
$$ packed form
14436G964m752P250n131j0041Q64R611m792q3L490Q133J3287m812j183k0489r052
14421i736J4380J3815m429l462J3311q368n835P920j2657n806L839p93m385n462
14407g668O70J2995K068j2333j664J0824K2366o865p046R762J7395L022J476j0295
14393C4707Q074n2j2338j4754k118R20J0263K104K263k727l986k012m241J0430
14379B6533R027l182l805J5813Q760j6652r791N806R310n478j0499j0682j2865
14366B295Q358K1484r224p772K124J1766L774n714N435R026k381Q666R1K71o689
14351D1510R159j685j270r27j5020l452o023j0239K370l528L163R719M597P691
14337C6065K399o37K00k928K56K583J1797M718l013k231j1866j3806n619Q699
$$ plain form
14323 26617 40415 30309 26920 22590 19783 20430 22951 29403 27297 26886 26031 34474 28449 18768 27469
14308 27469 33491 41892 35882 32299 32414 19414 19942 41755 50378 43172 40294 27087 23911 11455
14294 11455 5650 19179 19309 26421 37182 36212 30112 22159 19885 8184 5525 19894 23636 27266
14280 27266 22775 18238 14538 21504 24644 26120 39192 50065 58343 60350 48114 40680 31377 29108
14266 29108 32585 30608 37075 55770 49233 53115 59268 61273 65059 72691 76356 71466 70452 64994
14252 64994 51824 50815 42305 40114 37906 36453 40038 31923 23075 34792 60172 50327 46293 42979
14238 42979 43470 49212 50997 34384 32330 34057 34584 24079 22483 28054 33057 48351 61345 61725
14224 61725 44849 55806 58706 79021 81564 82999 83061 77735 74109 74283 76099 69255 63260 73880
$$ packed form
14323B6617J3798j0106l389m330k807O47K521O452k106m11q55Q443o025r681Q701
14308B7469O022Q401o010l583J15j3000N28K1813Q623p206k878j3207l176j2456
14294A1455n805J3529J30P112J0761r70o100p953k274j1701k659J4369L742L630
14280B7266m491m537l700O966L140J476J3072J0873Q278K007j2236p434r303k269
14266B9108L477j977O467J8695o537L882O153K005L786P632L665m890j014n458
14252F4994j3170j009q510k191k208j453L585q115q848J1717K5380r845m034l314
14238D2979M91N742J785j6613k054J727N27j0505j596N571N003J5294J2994L80
14224F1725j6876J0957K900K0315K543J435O2n326l626J74J816o844n995J0620
$$ plain form
14210 73880 73969 76389 98197 113774 123631 142093 159560 188905 204679 206765 213071 228061 239265
14197 239265 266224 328315 419864 549537 707902 929337 1216087 1529423 1845251 2094394
14187 2094394 2251339 2311635 2245678 2087014 1860771 1614044 1384632 1185203 1030451 900395
14177 900395 801056 720170 648389 588728 546192 504587 440617 386059 350348 317179 302156
14166 302156 282526 248456 228295 228193 225608 206652 179793 167526 161027 162114 166740 173687 162896
14153 162896 159568 159766 154168 143405 127328 118852 114932 123384 140953 143464 145196 151483 155356 162962
14139 162962 163293 168657 178486 171609 162102 150081 139874 127359 118912 110540 109287 111625 92338
14126 92338 83782 100414 118035 112348 105032 99471 96015 89521 78935 71865 70890 65949 75522 64856
$$ packed form
14210G3880Q9K420K1808J5577R857J8462J7467K9345J5774K086O306J4990J1204
14197B39265K6959O2091R1549J29673J58365K21435K86750L13336L15828K49143
14187B094394J56945O0296o5957j58664k26243k46727k29412j99429j54752j30056
14177I00395r9339q0886p1781n9661m2536m1605o3970n4558l5711l3169j5023
14166C02156j9630l4070k0161j02k585j8956k6859j2267o499J087M626O947j0791
14153A62896l328J98n598j0763j6077q476l920Q452J7569K511J732O287L873P606
14139A62962L31N364R829o877r507j2021j0207j2515q447q372j253K338j9287
14126I2338q556J6632J7621n687p316n561l456o494j0586p070r75m941R573j0666
$$ plain form
14112 64856 61673 62712 61105 51463 33003 15251 23902 31990 44203 50127 55024 56613 56669 54804
14098 54804 50968 43178 48130 44983 38861 42215 42478 44855 37398 46798 63673 64895 59383 56866
14084 56866 63841 61081 57701 61502 64504 55557 62839 75197 70570 65862 65976 78139 75551 76614
14070 76614 70372 78025 80892 72230 72618 65616 49976 56461 62012 44095 37113 27407 36157 45850
14056 45850 50933 54498 68333 81529 95962 102204 75019 72021 91003 92678 89940 99178 98116
14043 98116 91645 74305 57728 43458 45733 59802 58063 60509 76449 75283 78373 104106 133799
14030 133799 147786 149993 157948 174290 192063 235117 275967 324153 380047 462799 584577 743734
14018 743734 937620 1133912 1350238 1581986 1808543 2014154 2173946 2289100 2372571 2398393
$$ packed form
14112F4856l183J039j607r642j8460j7752Q651Q088J2213N924M897J589N6j865
14098E4804l836p790M952l147o122L354K63K377p457R400J6875J222n512k517
14084E6866O975k760l380L801L002q947P282J2358m627m708J14J2163k588J063
14070G6614o242P653K867q662L88p002j5640O485N551j7917o982r706Q750R693
14056D5850N083L565J3835J3196J4433O242k7185k998J8982J675k738R238j062
14043I8116o471j7340j6577j4270K275J4069j739K446J5940j166L090K5733K9693
14030A33799J3987K207P955J6342J7773M3054M0850M8186N5894Q2752J21778J59157
14018G43734J93886J96292K16326K31748K26557K05611J59792J15154Q3471K5822
$$ plain form
14008 2398393 2351717 2238336 2091918 1925727 1754820 1572608 1379440 1210340 1058545 932248
13998 932248 819609 723453 671736 624209 565958 514904 487614 466466 437141 414643 399655
13987 399655 389827 392106 385946 379707 374966 370694 370978 356731 342141 329129 322078 320082 303464
13974 303464 297759 301095 294586 282904 282819 288104 270006 264585 287656 305400 317660 319365 329388
13961 329388 343918 356628 364449 375022 383880 391581 399356 391796 382702 362941 333428 318947 306328
13948 306328 285805 278481 271223 269591 260392 253776 247848 247577 239239 240927 244310 242145 235881 231053
13934 231053 217226 203852 197703 194868 196046 191756 178229 178907 170213 186057 209654 213762 224041
13921 224041 228932 230667 245648 244211 232804 237414 240518 237131 231138 231231 239375 244362 245476 247648
$$ packed form
14008B398393m6676j13381j46418j66191j70907j82212j93168j69100j51795j26297
13998I32248j12639r6156n1717m7527n8251n1054k7290k1148k9325k2498j4988
13987C99655r828K279o160o239m741m272K84j4247j4590j3012p051j996j6618
13974C03464n705L336o509j1682q5N285j8098n421K3071J7744J2260J705J0023
13961C29388J4530J2710P821J0573Q858P701P775p560r094j9761k9513j4481j2619
13948C06328k0523p324p258j632r199o616n928k71q338J688L383k165o264m828
13934B31053j3827j3374o149k835J178m290j3527O78q694J5844K3597M108J0279
13921B24041M891J735J4981j437j1407M610L104l387n993R3Q144M987J114K172
$$ plain form
13907 247648 247057 251037 265665 294656 343255 401258 486077 606161 733946 880128 1025793
13896 1025793 1145842 1215322 1220979 1188053 1132634 1053707 958585 866765 792195 737674 686353
13885 686353 645982 612582 561194 526918 501714 476395 441144 417409 382148 349257 327073
13874 327073 313491 305841 296072 293784 308203 312202 312110 323317 360807 375112 394873 418077 437720
13861 437720 460773 473367 479805 477182 477595 477924 467519 449383 440485 434295 416404 402174 391958
13848 391958 387300 379982 378462 374055 382530 385865 388587 387931 399959 415452 419456 430471 463533
13835 463533 493847 501211 509768 519432 556293 585466 603176 622520 648278 651993 651415 656569 659579
13822 659579 649014 660362 674336 687184 691598 691747 704955 712460 725471 722564 729373 756068 759144
$$ packed form
13907B47648n91L980J4628K8991M8599N8003Q4819J20084J27785J46182J45665
13896A025793J20049O9480N657l2926n5419p8927r5122r1820p4570n4521n1321
13885F86353m0371l3400n1388l4276k5204k5319l5251k3735l5261l2891k2184
13874C27073j3582p650r769k288J4419L999r2J1207L7490J4305J9761K3204J9643
13861D37720K3053J2594O438k623M13L29j0405j8136q898o190j7891j4230j0216
13848C91958m658p318j520m407Q475L335K722o56J2028J5493M004J1015L3062
13835D63533L0314P364Q557R664L6861K9173J7710J9344K5758L715n78N154L010
13822F59579j0565J1348J3974J2848M414J49J3208P505J3011k907O809K6695L076
$$ plain form
13809 759144 773358 790502 809985 818315 814424 811171 816631 831761 831796 822477 832090 845092 850533
13796 850533 848803 871414 905005 944547 988126 1037066 1091040 1161359 1242358 1317928 1371051 1407379
13784 1407379 1425641 1463532 1496693 1521830 1544666 1551324 1552474 1554600 1539398 1532899 1541137 1552194
13772 1552194 1559882 1559440 1566188 1592580 1604758 1638538 1689683 1741807 1814355 1912976 1993724 2076736
13760 2076736 2138820 2180012 2205100 2233847 2245233 2256037 2255297 2288210 2332291 2378347 2417270 2474161
13748 2474161 2522886 2583460 2650307 2741009 2849770 2960516 3095410 3239974 3389842 3569962
13738 3569962 3786218 4035148 4318374 4660146 5061485 5542268 6108672 6788780 7610821
13729 7610821 8595924 9763030 11131632 12708789 14467259 16395909 18465405 20724922
$$ packed form
13809G59144J4214J7144J9483Q330l891l253N460J5130L5r319R613J3002N441
13796H50533j730K2611L3591L9542M3579M8940N3974P0319Q0999P5570N3123L6328
13784A407379J8262L7891L3161K5137K2836O658J150K126j5202o499Q238J1057
13772A552194P688m42O748K6392J2178L3780N1145N2124P2548R8621Q0748Q3012
13760B076736O2084M1192K5088K8747J1386J0804p40L2913M4081M6056L8923N6891
13748B474161M8725O0574O6847R0702J08761J10746J34894J44564J49868J80120
13738C569962K16256K48930K83226L41772M01339M80783N66404O80108Q22041
13729G610821R85103J167106J368602J577157J758470J928650K069496K259517
$$ plain form
13721 20724922 23241469 26163994 29695241 34096674 39823356 47588996 58719815 75508267
13713 75508267 100822439 136104700 182317582 236858977 293862312 346900751 387313358
13706 387313358 410153721 413289408 396684213 365524690 325315710 282470665 242228107
13699 242228107 207185651 178485495 155618136 137240186 122353585 110296488 100437202
13692 100437202 92231689 85317351 79273053 73746473 68671926 64052004 59854224 56054825
13684 56054825 52701049 49847752 47411391 45312205 43474237 41805523 40234705 38753646
13676 38753646 37331629 35950516 34610362 33333197 32094436 30903415 29753398 28662808
13668 28662808 27635863 26657357 25728776 24838384 23994163 23173564 22364724 21576231 20833367
$$ packed form
13721B0724922K516547K922525L531247M401433N726682P765640J1130819J6788452
13713G5508267K5314172L5282261M6212882N4541395N7003335N3038439M0412607
13706C87313358K2840363L135687j6605195l1159523m0208980m2845045m0242558
13699B42228107l5042456k8700156k2867359j8377950j4886601j2057097r859286
13692A00437202q205513o914338o044298n526580n074547m619922m197780l799399
13684E6054825l353776k853297k436361k099186j837968j668714j570818j481059
13676C8753646j422017j381113j340154j277165j238761j191021j150017j090590
13668B8662808j026945r78506r28581q90392q44221q20599q08840p88493p42864
$$ plain form
13659 20833367 20145169 19520243 18933384 18385695 17882787 17424259 16968439 16521058 16090736
13650 16090736 15665600 15226067 14784686 14352633 13913533 13477635 13056832 12647748 12264187
13641 12264187 11922426 11591209 11276667 10984465 10702183 10440386 10184638 9929464 9676660
13632 9676660 9431341 9182298 8925996 8676699 8431897 8193365 7974424 7775563 7597647
13623 7597647 7430595 7267480 7120419 6974747 6824645 6678921 6539419 6409531 6303831
13614 6303831 6182115 6050862 5939545 5826180 5709821 5594322 5459886 5332727 5191716
13605 5191716 5066763 4941611 4821319 4697166 4571510 4443847 4316212 4213511 4105185
13596 4105185 3996995 3895648 3780274 3669243 3571651 3479149 3392887 3308352 3225256 3178135
$$ packed form
13659B0833367o88198o24926n86859n47689n02908m58528m55820m47381m30322
13650A6090736m25136m39533m41381m32053m39100m35898m20803m09084l83561
13641A2264187l41761l31217l14542k92202k82282k61797k55748k55174k52804
13632I676660k45319k49043k56302k49297k44802k38532k18941j98861j77916
13623G597647j67052j63115j47061j45672j50102j45724j39502j29888j05700
13614F303831j21716j31253j11317j13365j16359j15499j34436j27159j41011
13605E191716j24953j25152j20292j24153j25656j27663j27635j02701j08326
13596D105185j08190j01347j15374j11031r7592r2502q6262q4535q3096m7121
$$ plain form
13586 3178135 3140555 3087112 3050424 3015406 2990613 2944114 2885158 2831477 2782217 2711301 2633631
13575 2633631 2566791 2519511 2492876 2480476 2448275 2411822 2378054 2321842 2269393 2210488 2160305
13564 2160305 2112831 2069092 2031141 1984279 1929104 1864148 1797045 1749543 1696854 1641439 1604105
13553 1604105 1578157 1549405 1534166 1517762 1507235 1518910 1524409 1531467 1537756 1526820 1511174 1500749
13541 1500749 1498588 1498725 1480187 1449600 1412610 1378899 1346348 1307926 1285128 1249533 1193781 1143069
13529 1143069 1083770 1011576 942478 886900 809596 721486 593838 452749 291463 148687
13519 148687 1164 -129127 -203575 -230097 -200077 -146044 -72957 22144 116562 200388 267568
13508 267568 316040 340518 369217 378512 377575 389997 409540 427160 426280 414010 416757 413928 414149
$$ packed form
13586C178135l7580n3443l6688l5018k4793m6499n8956n3681m9260p0916p7670
13575B633631o6840m7280k6635j2400l2201l6453l3768n6212n2449n8905n0183
13564B160305m7474m3739l7951m6862n5175o4956o7103m7502n2689n5415l7334
13553A604105k5948k8752j5239j6404j0527J1675N499P058O289j0936j5646j0425
13541A500749k161J37j8538l0587l6990l3711l2551l8422k2798l5595n5752n0712
13529A143069n9299p2194o9098n5578p7304q8110j27648j41089j61286j42776
13519A48687j47523j30291p4448k6522L0020N4033P3087R5101R4418Q3826O7180
13508B67568M8472K4478K8699R295r37J2422J9543J7620q80j2270K747k829K21
$$ plain form
13495 414149 399901 389189 379031 375166 389759 395188 390174 391623 397647 392638 401109 415858 429327
13482 429327 430158 422970 418831 399662 381899 375234 370924 372348 365989 354745 341440 344709 344320 342981
13468 342981 338749 326542 317237 313204 323921 333071 342946 337365 334842 339845 354537 357077 348182
13455 348182 357157 359549 349490 350222 347218 337640 327897 325078 330363 329921 320371 298522 299974 309616
13441 309616 316996 305304 291836 281080 275561 255007 233066 227242 240912 253544 256039 258951
13429 258951 245022 235535 229164 217375 220469 233286 250619 254610 250639 245780 252554 253169 250095
13416 250095 251981 256717 259305 251561 243461 226642 217820 220783 222556 222451 232239 229050 222163 213662
13402 213662 190199 171166 164531 155978 156584 138687 117765 122092 124836 133989 143795 139330 139348 141634
$$ packed form
13495D14149j4248j0712j0158l865J4593N429n014J449O024n009Q471J4749J3469
13482D29327Q31p188m139j9169j7763o665m310J424o359j1244j3305L269l89j339
13468C42981m232j2207r305m033J0717R150R875n581k523N003J4692K540q895
13455C48182Q975K392j0059P32l004r578r743k819N285m42r550k1849J452R642
13441C09616P380j1692j3468j0756n519k0554k1941n824J3670J2632K495K912
13429B58951j3929r487o371j1789L094J2817J7333L991l971m859O774O15l074
13416B50095J886M736K588p744q100j6819q822K963J773j05R788l189o887q501
13402B13662k3463j9033o635q553O06j7897k0922M327K744R153R806m465J8K286
$$ plain form
13388 141634 142665 150652 145860 134931 136002 134714 133304 132122 126953 137012 143780 145900 142112 155366
13374 155366 141210 121950 100640 78704 65737 67586 58767 63083 72965 74484 77667 85354 79231
13361 79231 80603 73458 64761 79397 91558 83591 78141 84531 85724 96900 96291 94723 106972 121695
13347 121695 120809 108065 119391 114816 97088 98508 106482 109690 107649 101105 86783 86138 91826 91277
13333 91277 92244 99679 117499 104049 98420 93849 87739 87825 79760 74724 81824 91346 80344 76924
13319 76924 69474 65553 71334 79459 96089 99106 105888 117697 135400 126946 112973 110783 109546
13306 109546 116259 114563 120767 113573 111028 118964 113393 101658 107159 121544 122086 110833 105904 88469
13292 88469 88240 103160 114152 107000 98199 98691 104088 95813 79920 71246 74450 62680 58425 48171
$$ packed form
13388A41634J031P987m792j0929J071j288j410j182n169J0059O768K120l788J3254
13374A55366j4156j9260k1310k1936j2967J849q819M316R882J519L183P687o123
13361G9231J372p145q697J4636J2161p967n450O390J193J1176o09j568J2249J4723
13347A21695q86j2744J1326m575j7728J420P974L208k041o544j4322o45N688n49
13333I1277R67P435J7820j3450n629m571o110Q6q065n036P100R522j1002l420
13319G6924p450l921N781Q125J6630L017O782J1809J7703q454j3973k190j237
13306A09546O713j696O204p194k545P936n571j1735N501J4385N42j1253m929j7435
13292H8469k29J4920J0992p152q801M92N397q275j5893q674L204j1770m255j0254
$$ plain form
13278 48171 46016 56179 61770 62357 50218 52098 53872 53202 60183 62521 65653 77979 86446 92112
13264 92112 113215 131959 123858 123308 135562 126620 115252 111990 116896 127101 134218 129162 138657
13251 138657 145067 142694 157771 160506 164668 184181 188661 193962 182354 159299 153006 148058 133934
13238 133934 147886 166523 165705 171185 174749 178227 201760 232679 265382 282745 313713 374305
13226 374305 454976 573930 760637 985364 1276720 1599381 1896007 2123287 2261079 2285989
13216 2285989 2195759 2039409 1831937 1593548 1371843 1179372 1033090 912867 816617 740911
13206 740911 676249 613855 559983 503216 465716 430020 388272 371922 358663 350231 331628 302727
13194 302727 276593 274874 267186 255761 234586 220479 212942 194508 185953 196408 200995 206131 188813
$$ packed form
13278D8171k155J0163N591N87j2139J880J774o70O981K338L132J2326Q467N666
13264I2112K1103J8744q101n50J2254q942j1368l262M906J0205P117n056R495
13251A38657O410k373J5077K735M162J9513M480N301j1608k3055o293m948j4124
13238A33934J3952J8637q18N480L564L478K3533L0919L2703J7363L0968O0592
13226C74305Q0671J18954J86707K24727K91356L22661K96626K27280J37792K4910
13216B285989r0230j56350k07472k38389k21705j92471j46282j20223r6250p5706
13206G40911o4662o2394n3872n6767l7500l5696m1748j6350j3259q432j8603k8901
13194C02727k6134j719p688j1425k1175j4107p537j8434q555J0455M587N136j7318
$$ plain form
13181 188813 175207 177122 198825 205164 205714 216402 224410 209208 194092 179196 161296 155020 142879
13168 142879 141709 159731 153913 141089 141670 130183 121144 118439 122990 129750 135322 120921 128163
13155 128163 131638 126215 123202 124445 133909 121531 93756 78270 70716 67936 79765 86857 79624
13142 79624 60124 42157 35520 41583 43537 44011 58414 65103 65432 67144 60484 60555 51855 55872 55067
13127 55067 52171 44860 41694 53070 57752 56095 52967 44893 46339 49010 57110 60017 63189 51020
13113 51020 45431 46032 40740 36789 49954 61218 51373 43134 44453 50442 52092 53198 64484 67739
13099 67739 62443 55314 53498 54046 46918 41220 34791 27724 26192 19459 23849 21876 27050 42753
13085 42753 42163 25128 26689 27744 36249 31901 40053 60579 71339 62304 46038 39873 36772 15890
$$ packed form
13181A88813j3606J915K1703O339N50J0688Q008j5202j5116j4896j7900o276j2141
13168A42879j170J8022n818j2824N81j1487r039k705M551O760N572j4401P242
13155A28163L475n423l013J243R464j2378k7775j5486p554k780J1829P092p233
13142G9624j9500j7967o637O063J954M74J4403O689L29J712o660P1q700M017q05
13127E5067k896p311l166J1376M682j657l128q074J446K671Q100K907L172j2169
13113E1020n589O01n292l951J3165J1264r845q239J319N989J650J106J1286L255
13099F7739n296p129j816N48p128n698o429p067j532o733M390j973N174J5703
13085D2753n90j7035J561J055Q505m348Q152K0526J0760r035j6266o165l101k0882
$$ plain form
13071 15890 12341 2129 18193 34646 29398 18935 15668 479 4378 13911 12416 14034 17111
13058 17111 7529 -187 8129 12744 15604 25955 18422 13288 13984 22623 20525 32855 33446 40879
13044 40879 43102 35251 29919 22252 14368 20190 28905 27287 24050 23166 11512 16145 16158 -14 -1633
13029 -1633 -2554 17154 35317 34909 42803 20082 13101 27404 34166 24175 24199 22825 18292 13521 5821
13014 5821 16991 28647 26682 13615 13573 14962 9763 22200 32663 16964 1308 2246 19760
13001 19760 25449 25990 24276 10628 4055 2007 -5128 -3412 11311 17569 23576 26441 30293 20320
12987 20320 20246 30459 33687 32715 15445 8844 11813 27332 27206 17201 18442 20639 9963 4543
12973 4543 -1216 1428 -4729 1049 22809 22722 13177 10809 15841 29079 27228 27042 18131 15548 25037
$$ packed form
13071A5890l549j0212J6064J6453n248j0463l267j5189L899R533j495J618L077
13058A7111r582p716Q316M615K860J0351p533n134O96Q639k098J2330N91P433
13044D0879K223p851n332p667p884N822Q715j618l237q84j1654M633J3j6172j619
13029a633r21J9708J8163m08P894k2721o981J4303O762r991K4j374m533m771p700
13014E821J1170J1656j965j3067m2J389n199J2437J0463j5699j5656R38J7514
13001A9760N689N41j714j3648o573k048p135J716J4723O258O007K865L852r973
12987B0320p4J0213L228r72j7270o601K969J5519j26j0005J241K197j0676n420
12973D543n759K644o157N778K1760q7r545k368N032J3238j851j86q911k583R489
$$ plain form
12958 25037 29783 32473 29485 21542 13313 16183 7098 -1798 95 83 3053 7847 2547 14194 22523
12943 22523 32478 31548 26912 36169 32576 22387 23497 40273 37541 28353 24942 17544 17422 16703 8851
12928 8851 4495 3757 14219 27847 33256 33133 14456 -4002 -4853 9436 11731 18604 17389 -230
12914 -230 -14032 -8637 -8880 -7751 1674 7544 15269 22503 13402 5085 12157 12834 7388 12212 15012
12899 15012 4032 10308 4985 -1991 -8961 -4023 5973 -1118 1359 -2396 5080 14050 5524 -2056
12885 -2056 13391 22726 24252 17003 -2710 -13473 4129 19550 14442 9856 12233 12632 18240 23497
12871 23497 16116 14675 27668 24577 27268 35445 36336 40421 50160 45436 28546 2172 -764 -1835
12857 -1835 6809 11042 13056 6302 1590 6985 19234 15383 14077 21358 20199 4344 3584 -881
$$ packed form
12958B5037M746K690k988p943q229K870r085q896J893j2K970M794n300J1647Q329
12943B2523R955r30m636R257l593j0189J110J6776k732r188l411p398j22p19p852
12928H851m356p38J0462J3628N409j23j8677j8458q51J4289K295O873j215j7619
12914b30j3802N395k43J129R425N870P725P234r101q317P072O77n446M824K800
12899A5012j0980O276n323o976o970M938R996p091K477l755P476Q970q526p580
12885b056J5447R335J526p249j9713j0763J7602J5421n108m586K377L99N608N257
12871B3497p381j441J2993l091K691Q177Q91M085R739m724j6890k6374k936j071
12857a835Q644M233K014o754m712N395J2249l851j306P281j159j5855p60m465
$$ plain form
12843 -881 -4947 -8148 -429 -4680 -9152 -9717 -7939 -903 -2983 -15258 -25129 -10911 -2936 -12230 -444
12828 -444 22817 28481 24686 12975 18458 11577 8767 4926 1651 -1471 2824 -3302 3079 25231
12814 25231 46828 39484 28571 10820 -9753 -8482 -9076 -7107 -5913 -6266 16027 14753 1034
12801 1034 -5840 2096 8577 12318 21371 36554 25514 22011 33376 28663 17347 14589 16884 14734
12787 14734 17180 25324 26794 19881 7652 -1920 -194 9863 11115 10693 -150 3357 25934 32523
12773 32523 22554 207 -18995 -13696 -12847 -10721 -13902 -9627 -11696 -2125 -8498 1864 4704 -14956
12759 -14956 -23034 -8326 2641 -5001 4252 2911 2234 -10910 -4445 -6982 -4159 -8863 -18074 -6440
12745 -6440 -385 -12 10906 9888 7400 7215 24170 31632 29863 34434 39416 50945 58234 70768
$$ packed form
12843h81m066l201P719m251m472n65J778P036k080j2275r871J4218P975r294J1786
12828d44K3261N664l795j1711N483o881k810l841l275l122M295o126O381K2152
12814B5231K1597p344j0913j7751k0573J271n94J969J194l53K2293j274j3719
12801A034o874P936O481L741R053J5183j1040l503J1365m713j1316k758K295k150
12787A4734K446Q144J470o913j2229r572J726J0057J252m22j0843L507K2577O589
12773C2523r969k2347j9202N299Q49K126l181M275k069R571o373J0362K840j9660
12759a4956q078J4708J0967p642R253j341o77j3144O465k537K823m704r211J1634
12745f440O055L73J0918j018k488j85J6955P462j769M571M982J1529P289J2534
$$ plain form
12731 70768 75679 82460 60935 41842 44314 52363 54647 47352 45725 25236 10838 17198 25876
12718 25876 8683 4653 6967 10757 24680 28188 23413 27918 27826 21838 717 -9644 -4481 17355
12704 17355 36736 40841 25596 22314 18748 26757 23462 19686 18965 22798 24184 15111 12229 4006
12690 4006 8346 10250 -13 -2825 2770 17802 29913 31657 20649 13502 8289 7621 23755 45382
12676 45382 46261 59012 97705 109053 103089 87956 71453 58241 55662 24751 24293 28418 25061
12663 25061 28109 35324 47495 41218 26225 27883 24529 28981 20951 12028 6162 12498 17728 26553
12649 26553 28638 19778 2340 -178 14901 16630 6305 -14818 -14098 418 16422 23162 13976
12636 13976 11045 4178 840 -2314 286 9675 6214 13738 22245 19056 574 -5636 2572 -337
$$ packed form
12731G0768M911O781k1525j9093K472Q049K284p295j627k0489j4398O360Q678
12718B5876j7193m030K314L790J3923L508m775M505r2n988k1121j0361N163K1836
12704A7355J9381M105j5245l282l566Q009l295l776p21L833J386r073k882q223
12690D006M340J904j0263k812N595J5032J2111J744j1008p147n213o68J6134K1627
12676D5382Q79J2751L8693J1348n964j5133j6503j3212k579l0911m58M125l357
12663B5061L048P215J2171o277j4993J658l354M452q030q923n866O336N230Q825
12649B6553K085q860j7438k518J5079J729j0325k1123P20J4516J6004O740r186
12636A3976k931o867l338l154K600R389l461P524Q507l189j8482o210Q208k909
$$ plain form
12622 -337 11890 24326 31405 27676 41130 38979 26016 19355 20990 16738 8181 -4639 -958 -6995
12608 -6995 -9069 1005 8458 -579 -7011 6272 5934 -14783 -30297 -12202 -7452 -16832 -8249 2886
12594 2886 -88 -663 -8114 572 10914 20474 20039 8870 6979 8493 7788 6990 -4314 -10819 -3436
12579 -3436 -3793 -3121 -5435 -6014 2671 2182 -600 8377 775 -6893 3781 1560 8271 5435 -1679
12564 -1679 -9938 -2312 829 -2357 -22043 -22970 -18102 -14842 3359 29956 34402 20023 13207 13625
12550 13625 24254 15341 8270 2502 5999 -4219 454 8916 12536 8489 -6223 -5586 2395 -5730
12536 -5730 -11023 3759 -4150 -9479 -13884 -15826 -24483 -28520 -3800 10838 10166 6201 20153 27582
12522 27582 25783 1888 -2337 -3417 10041 13090 13039 -2291 -15725 -16564 -23641 -15526 -2865 2721
$$ packed form
12622c37J2227J2436P079l729J3454k151j2963o661J635m252q557j2820L681o037
12608f995k074J0074P453r037o432J3283l38k0717j5514J8095M750r380Q583J1135
12594B886k974n75p451Q686J0342R560m35j1169j891J514p05p98j1304o505P383
12579c436l57O72k314n79Q685m89k782Q977p602p668J0674k221O711k836p114
12564a679q259P626L141l186j9686r27M868L260J8201K6597M446j4379o816M18
12550A3625J0629q913p071n768L497j0218M673Q462L620m047j4712O37P981q125
12536e730n293J4782p909n329m405j942q657m037K4720J4638o72l965J3952P429
12522B7582j799k3895m225j080J3458L049n1j5330j3434q39p077Q115J2661N586
$$ plain form
12508 2721 2813 -12080 -9929 -7565 -14360 -9338 -2231 -1972 -12277 -7487 -14599 -22323 -12727 -6695 -1975
12493 -1975 -3709 -8991 470 852 9 -53 -3681 -4338 10848 18468 -2890 -2615 -7057 -1690 -7203 -8829
12477 -8829 -10703 -10362 -19999 -2368 16193 9817 1841 2840 6647 11440 12871 9980 21435 20862 4514
12462 4514 -3352 382 1900 12072 19054 16756 18351 17404 6201 3800 -1501 -7008 -3601 -3261 1094
12447 1094 -5196 5425 14154 3779 -6362 -15196 -10211 -7838 -9978 -11785 -10665 -693 6562 5206
12433 5206 5382 11073 14602 10276 9755 14451 19089 6126 3872 21997 29438 19144 14080 17854
12419 17854 20809 18309 11424 4315 -3353 -12546 -15528 -12607 -5047 10775 23306 25159 13912 8589
12405 8589 10078 11054 19883 22957 18588 11049 11584 13402 9735 1076 4005 3760 -3009 -11650 -15421
$$ packed form
12508B721R2j4893K151K364o795N022P107K59j0305M790p112p724R596O032M720
12493a975j734n282R461L82q43o2l628o57J5186P620k1358K75m442N367n513j626
12477h829j874L41r637J7631J8561o376p976R99L807M793J431k891J1455n73j6348
12462D514p866L734J518J0172O982k298J595r47j1203k401n301n507L407L40M355
12447A094o290J0621Q729j0375j0141q834M985K373k140j807J120R972P255j356
12433E206J76N691L529m326n21M696M638j2963k254J8125P441j0294n064L774
12419A7854K955k500o885p109p668r193k982K921P560J5822J2531J853j1247n323
12405H589J489R76Q829L074m369p539N35J818l667q659K929k45o769q641l771
$$ plain form
12390 -15421 -17309 -6818 4421 18177 4107 -14631 -20031 -10541 4790 13480 20805 9529 13096
12377 13096 11292 9009 17561 17161 11236 3773 2939 6450 11151 10333 5882 1813 -7666 -5448 -2221
12362 -2221 -4245 -1315 6987 20090 16389 654 -4994 -14385 -14840 2304 -1598 -5567 -817 107
12348 107 386 -145 7588 5947 -6965 -19880 -16584 -2482 9741 9615 9161 11311 10406 2916 -2044
12333 -2044 2541 6159 -563 -4406 -3454 -2930 -12091 -5036 -1769 567 6479 10112 17604 2476 1338
12318 1338 -9100 -11612 142 9376 11646 16519 16790 12757 4673 5765 1248 1267 9830 7982 -5548
12303 -5548 -14045 -13910 -14050 -17663 -16639 8324 16677 9382 2449 -1527 7265 -990 -11300 -1532 587
12288 587 4628 -1424 -12679 -26645 -5255 22357 17906 9072 21321 28939 14076 12060 15992
$$ packed form
12390a5421j888J0491J1239J3756j4070j8738n400R490J5331Q690P325j1276L567
12377A3096j804k283Q552m00n925p463q34L511M701q18m451m069r479K218L227
12362b221k024K930Q302J3103l701j5735n648r391m55J7144l902l969M750R24
12348A07K79n31P733j641j2912j2915L296J4102J2223j26m54K150r05p490m960
12333b044M585L618o722l843R52N24r161P055L267K336N912L633P492j5128j138
12318A338j0438k512J1754R234K270M873K71m033q084J092m517J9Q563j848j3530
12303e548q497J35j40l613J024K4963Q353p295o933l976Q792q255j0310R768K119
12288E87M041o052j1255j3966K1390K7612m451q834J2249P618j4863k016L932
$$ plain form
12275 15992 14981 7767 683 -6121 -15776 -17852 -9447 -20054 -22018 -7846 -5336 -11938 -24637 -18208
12261 -18208 -9555 -7856 4709 7348 17723 11579 9769 14211 14814 12328 147 15245 19561 10126
12247 10126 6325 5069 -5347 -13397 -4619 7534 2525 -2191 5977 9098 15467 6397 3367 984
12233 984 6410 9166 15699 15735 5530 -2423 3101 9339 10877 17677 10366 5723 -9668 -19302 -15709
12218 -15709 -7069 -6334 2707 8457 5215 12772 11103 -3439 4843 24687 34710 28255 10755 4295
12204 4295 19007 28814 13512 4586 5810 8253 16648 21275 22532 24819 20940 27435 28679 34095
12190 34095 24794 9459 -7073 -15386 -17106 1691 87 -10006 -7031 8335 18369 14377 11652
12177 11652 15831 11089 13624 17727 23958 273 -2293 6790 12844 9455 -1451 -2233 -2751 6270
$$ packed form
12275A5992j011p214p084o804r655k076Q405j0607j964J4172K510o602j2699O429
12261a8208Q653J699J2565K639J0375o144j810M442O03k486j2181J5098M316r435
12247A0126l801j256j0416q050Q778J2153n009m716Q168L121O369r070l030k383
12233I84N426K756O533L6j0205p953N524O238J538O800p311m643j5391r634L593
12218a5709Q640P35R041N750l242P557j669j4542Q282J9844J0023o455j7500o460
12204D295J4712R807j5302q926J224K443Q395M627J257K287l879O495J244N416
12190C4095r301j5335j6532q313j720J8797j604j0093K975J5366J0034l992k725
12177A1652M179m742K535M103O231k3685k566R083O054l389j0906p82n18R021
$$ plain form
12163 6270 4880 3716 3727 2217 3482 1592 -2759 3714 10991 8576 16469 21384 11200 8690 -2806
12148 -2806 -6483 -11110 -2136 1856 8135 7245 5669 -4237 5576 12673 12282 11822 7505 -11502 -19035
12133 -19035 -12868 -1935 1233 5747 2896 -6608 -11591 540 11997 11062 -1727 -4239 -14076 -14876
12119 -14876 -14639 -8571 -1804 -11438 -13903 -15838 -15386 2142 2948 -9291 -20401 -18892 -12304 -5708
12105 -5708 -732 -7275 2673 5986 6483 4703 6163 -4861 -11248 -2931 -566 -8956 -6646 4623
12091 4623 8812 16083 11885 -9183 -16616 -7992 -3343 10189 20333 27248 4713 1341 -5372 -3371
12077 -3371 10789 19071 9825 9660 613 -3218 -9573 -7639 -1268 39 5225 10570 20278 25592 20409
12062 20409 16467 19409 16161 -661 -4720 -7804 2097 5345 7911 7012 121 7269 10084 13242
$$ packed form
12163F270j390j164J1j510J265j890m351O473P277k415P893M915j0184k510j1496
12148b806l677m627Q974L992O279q90j576r906R813P097l91m60m317j9007p533
12133a9035O167J0933L168M514k851r504m983J2131J1457r35j2789k512r837q00
12119a4876K37O068O767r634k465j935M52J7528Q06j2239j1110J509O588O596
12105e708M976o543R948L313M97j780J460j1024o387Q317K365q390K310J1269
12091D623M189P271m198k1068p433Q624M649J3532J0144O915k2535l372o713K001
12077c371J4160Q282r246j65r047l831o355J934O371J307N186N345R708N314n183
12062B0409l942K942l248j6822m059l084R901L248K566q99o891P148K815L158
$$ plain form
12048 13242 14241 -905 -3778 3466 7800 15272 15863 16792 38610 45120 50272 36761 45557 47047
12034 47047 46954 71308 83829 84293 95937 94907 90328 77576 78557 79140 78057 74326 69580 49526
12020 49526 45678 54136 58142 56860 59671 61654 44015 34032 23395 11649 12948 -1362 -16361
12007 -16361 -6016 7125 12288 -3736 -447 12761 13417 4559 -453 -9513 2007 -3410 -22351
11994 -22351 -24729 -13610 -12862 -5915 2296 -5369 -10156 -5598 3946 6728 11998 20544 27754 31815
11980 31815 28901 19386 28033 37829 34686 35344 31487 19486 9646 15095 6201 9215 13524 13399 15553
11965 15553 20590 25173 23221 16771 13872 22481 30230 30873 20532 3965 3547 1509 -277 8865
11951 8865 20964 12592 9363 3896 -5088 -18352 -12524 1714 20620 23357 13701 9412 -2462
$$ packed form
12048A3242R99j5146k873P244M334P472N91R29K1818O510N152j3511Q796J490
12034D7047r3K4354J2521M64J1644j030m579j2752R81N83j083l731m746k0054
12020D9526l848Q458M006j282K811J983j7639r983j0637j1746J299j4310j4999
12007a6361J0345J3141N163j6024L289J3208O56q858n012r060J1520n417j8941
11994b2351k378J1119P48O947Q211p665m787M558R544K782N270Q546P210M061
11980C1815k914r515Q647R796l143O58l857j2001r840N449q894L014M309j25K154
11965A5553N037M583j952o450k899Q609P749O43j0341j6567m18k038j786R142
11951H865J2099q372l229n467q984j3264N828J4238J8906K737r656m289j1874
$$ plain form
11938 -2462 -1118 14717 18892 20833 22434 17533 6349 795 4618 4434 3826 15226 319 -10313
11924 -10313 -15399 -10202 -2006 -14595 -21161 -8292 -5581 -7638 -14538 -3920 7738 148 4432
11911 4432 9843 10034 8799 10584 -1907 -9694 -13480 -14678 -11239 -11604 -16179 -13666 6361 2757 2772
11896 2772 780 -2312 -2414 -4524 -17943 -8864 7839 3777 -3995 -21377 -27459 -23410 -28071 -21354
11882 -21354 -22946 -17955 -2183 3226 -10498 -20152 -14556 4337 11642 13868 9779 976 -147 -654
11868 -654 -16979 -25103 -31171 -26199 -27331 -10064 -7489 6392 -2997 -12979 -5142 5663 2538 3886
11854 3886 -8950 -15351 -17086 -13027 -11949 -10606 -15872 -14298 -7937 -14433 -7401 -6267 -8384 15624
11840 15624 9728 -10534 -14651 -19356 -15555 -16749 -19703 -6707 11758 19215 14709 4795 -5121 -6228
$$ packed form
11938b462J344J5835M175J941J601m901j1184n554L823j84o08J1400j4907j0632
11924a0313n086N197Q196j2589o566J2869K711k057o900J0618J1658p590M284
11911D432N411J91j235J785j2491p787l786j198L439l65m575K513K0027l604J5
11896B772j992l092j02k110j3419R079J6703m062p772j7382o082M049m661O717
11882b1354j592M991J5772N409j3724r654N596J8893P305K226m089q803j123n07
11868f54j6325q124o068M972j132J7267K575J3881r389r982P837J0805l125J348
11854C886j2836o401j735M059J078J343n266J574O361o496P032J134k117K4008
11840A5624n896k0262m117m705L801j194k954J2996J8465P457m506r914r916j107
$$ plain form
11826 -6228 6128 11236 204 -96 -18401 -5686 -2607 -1024 -12470 -6391 3085 -1995 -16612
11813 -16612 -14531 -15261 -11130 -4366 -6937 -17542 -24837 -21037 -7551 -9214 -1061 9949 1681 -5048
11799 -5048 -8865 -11480 -16013 -24807 -21542 -6295 -9090 -11423 -9541 -12250 -2941 13006 9658 9187
11785 9187 8414 -1519 -9217 -15266 -7242 -7764 -20106 -28113 -14640 3555 23925 11904 -6514 -14798
11771 -14798 -11664 -10370 -2194 -6715 -9964 -8492 -10213 -16277 -14147 -14462 -19436 -12960 -14073 -14768 -3728
11756 -3728 4723 229 -7646 -13706 -13846 -2111 1656 -2485 14353 24164 19142 7336 4979 2318
11742 2318 -5414 -9781 -13978 -12508 -6755 -12760 -15044 -9769 -11700 -10803 7836 8117 -11239 -8633 -534
11727 -534 14173 18815 13918 9511 9095 -1307 -4780 3591 4158 11315 10514 12727 20947 12451 7231
$$ packed form
11826f228J2356N108j1032l00j8305J2715L079J583j1446O079R476n080j4617
11813a6612K081p30M131O764k571j0605p295L800J3486j663Q153J1010q268o729
11799e048l817k615m533q794L265J5247k795k333J882k709R309J5947l348m71
11785I187p73r933p698o049Q024n22j2342q007J3473J8195K0370j2021j8418q284
11771a4798L134J294Q176m521l249J472j721o064K130l15m974O476j113o95J1040
11756c728Q451m494p875o060j40J1735L767m141J6838R811n022j1806k357k661
11742B318p732m367m197J470N753o005k284N275j931Q97J8639K81j9356K606Q099
11727e34J4707M642m897m407m16j0402l473Q371N67P157q01K213Q220q496n220
$$ plain form
11712 7231 10098 3308 269 1206 7773 2006 -86 13341 10243 252 -3855 -12146 -13924 -16105 -14911
11697 -14911 -6320 -7615 -9197 -10063 -10438 -8046 -11460 -11075 -3878 -9475 -14986 -27956 -33727 -33985 -34316
11682 -34316 -27604 -15293 -13807 -17179 -25581 -12429 -1762 -2986 -2239 -4499 -272 3573 3308 -15063
11668 -15063 -10904 6021 4297 -1549 -4103 -8694 -20077 -20312 -26785 -16276 -5335 8382 21387
11655 21387 20393 19179 10715 6483 5929 10230 17947 15504 15022 7667 -11912 -21346 -6508 -8192 -4711
11640 -4711 10097 18748 14903 -9349 -11403 -6377 -9155 -1127 358 -4523 -5032 -4410 -3970 -3988 -5504
11625 -5504 374 7773 -340 2165 -4277 -22607 -10583 -580 -6979 -6866 -11184 -13324 -5744 1019
11611 1019 8937 3073 -3809 -10938 -13665 -6838 -4261 1566 9572 5509 1599 3144 -3554 -4638 -4692
$$ packed form
11712G231K867o790l039R37O567n767k092J3427l098r991m107q291j778k181J194
11697a4911Q591j295j582q66l75K392l414L85P197n597n511j2970n771k58l31
11682c4316O712J2311J486l372q402J3152J0667j224P47k260M227L845k65j8371
11668a5063M159J6925j724n846k554m591j1383k35o473J0509J0941J3717J3005
11655B1387r94j214q464m232n54M301P717k443m82p355j9579r434J4838j684L481
11640d711J4808Q651l845k4252k054N026k778Q028J485m881n09O22M40j8j516
11625e504N878P399q113K505o442j8330J2024J0003o399J13m318k140P580O763
11611A019P918n864o882p129k727O827K577N827Q006m063l910J545o698j084n4
$$ plain form
11596 -4692 12591 14367 7027 10057 11534 -6449 -5281 5651 2178 -6872 -4868 -7807 -11119 -11437
11582 -11437 -13422 -10555 -4192 -3834 -3882 6660 -3134 183 -175 7881 -157 -31016 -35887 -28805 -26471
11567 -26471 -15105 -8458 -12895 -9186 -20787 -17044 -14368 -4379 3140 -5208 -9507 -482 8884 1028
11553 1028 2781 9798 5832 15564 15927 -1741 2392 9431 -1397 -4559 -2627 13328 5910 -7239
11539 -7239 -598 -691 -3304 -11173 -18338 -20586 -12216 -6003 -4552 4970 8178 5116 10601 -136 -11098
11524 -11098 -22856 -14623 -3916 -3273 6834 18446 17268 8955 -10298 -22170 -16378 -7796 -6137
11511 -6137 1114 587 -2136 -7454 -5142 -173 4683 -3999 -5651 -6863 -8041 -5055 -5546 253 17233
11496 17233 23295 -1404 -19136 -14332 -4034 6387 8140 -641 -252 8501 4832 -9818 -6042
$$ packed form
11596d692J7283J776p340L030J477j7983J168J0932l473r050K004k939l312l18
11582a1437j985K867O363L58m8J0542r794L317l58Q056q038l0859m871P082K334
11567b6471J1366O647m437L709j1601L743K676R989P519q348m299R025R366p856
11553A028J753P017l966R732L63j7668M133P039j0828l162J932J5955p418j3149
11539g239O641r3k613p869p165k248Q370O213J451R522L208l062N485j0737j0962
11524a1098j1758Q233J0707O43J0107J1612j178q313j9253j1872N792Q582J659
11511f137P251n27k723n318K312M969M856q682j652j212j178K986m91N799J6980
11496A7233O062k4699j7732M804J0298J0421J753q781L89Q753l669j4650L776
$$ plain form
11483 -6042 -11076 -7893 -8989 -10359 -19720 -24844 -9984 1081 2523 2967 9222 12108 21889 25775
11469 25775 22223 22418 23511 11245 -9326 -17327 -23773 -13695 -4970 -2813 -4773 -9225 4061 9655
11455 9655 5990 5475 8533 -1382 -645 2489 -6080 -8107 -6046 -5199 -8304 -11475 2203 2616 -13521
11440 -13521 -20658 -5507 488 5043 8998 3176 -1915 -1461 595 4155 14621 8510 3490 4932
11426 4932 12919 16223 18453 6370 1695 5650 -3598 2462 665 -3173 -1484 9756 3196 7413
11412 7413 12766 17981 15917 7645 14642 12126 8575 -4072 -5754 -16757 -12111 -4610 -15765 -2518
11398 -2518 7301 9763 4182 4307 11186 15283 1295 -4573 -6507 -3542 -5449 -7619 -7676 -10134 -13789
11383 -13789 -1907 1659 -4391 -4641 11408 10929 5315 2057 3440 -6811 1790 17679 22897 24006
$$ packed form
11483f042n034L183j096j370r361n124J4860J1065J442M44O255K886R781L886
11469B5775l552J95J093j2266k0571q001o446J0078Q725K157j960m452J3286N594
11455I655l665n15L058r915P37L134q569k027K061Q47l105l171J3678M13j6137
11440a3521p137J5151N995M555L955n822n091M54K056L560J0466o111n020J442
11426D932P987L304K230j2083m675L955r248O060j797l838J689J1240o560M217
11412G413N353N215k064q272O997k516l551j2647j682j1003M646P501j1155J3247
11398b518R819K462n581J25O879M097j3988n868j934K965j907k170n7k458l655
11383a3789J1882L566o050k50J6049m79n614l258J383j0251Q601J5889N218J109
$$ plain form
11369 24006 41866 48993 40594 41046 57362 85091 98445 98567 92493 96530 85153 55628 43758
11356 43758 48506 48633 39845 30208 23889 37788 37016 30543 16383 16350 20988 9297 7728 14160 15435
11341 15435 11900 27888 30063 28948 14771 4800 1902 8488 28790 28560 32584 27619 27443 25957
11327 25957 13551 7987 5390 879 -13885 -3742 4833 8644 5157 9325 1077 4953 9445 9258
11313 9258 9441 20164 16452 -3266 -8487 -4292 -1099 8104 -3258 -18642 -19706 -16945 -22505 -22772
11299 -22772 -12804 -2844 4101 -1383 -5118 5742 8291 13415 11665 8360 11687 20489 11323 3647
11285 3647 6340 1911 -4474 -12587 -5208 -7056 -4122 -3258 -14941 -14127 -6821 6124 4807 -1140 -1127
11270 -1127 6051 19261 17694 12952 11869 11954 17229 6140 -1621 539 5998 11463 12821 18835 14280
$$ packed form
11369B4006J7860P127q399M52J6316K7729J3354J22o074M037j1377k9525j1870
11356D3758M748J27q788r637o319J3899p72o473j4160l3M638j1691j569O432J275
11341A5435l535J5988K175j115j4177r971k898O586K0302k30M024m965j76j486
11327B5957j2406n564k597m511j4764J0143Q575L811l487M168q248L876M492j87
11313I258J83J0723l712j9718n221M195L193R203j1362j5384j064K761n560k67
11299b2772R968R960O945n484l735J0860K549N124j750l305L327Q802r166p676
11285C647K693m429o385q113P379j848K934Q64j1683Q14P306J2945j317n947J3
11270a127P178J3210j567m742j083Q5N275j1089p761K160N459N465J358O014m555
$$ plain form
11255 14280 16529 21185 5716 -12542 -6483 3775 155 -1662 3531 5719 -10639 -16085 -22118
11242 -22118 -20597 -29252 -23704 -19796 -7238 7244 8040 -1674 -17698 -12259 -12565 -13201 -1649 13728
11228 13728 5451 -544 4264 5995 726 -7912 -5381 -89 4846 13231 11984 2986 5249 16093
11214 16093 8582 5374 14594 14890 13058 15424 6516 6346 -3029 -18428 -22686 -6164 6844 -370
11200 -370 -10915 -13190 -21425 -13356 -16634 -2954 3237 11036 13048 6078 3854 -4906 -7656 -9990
11186 -9990 -8920 -4472 -1170 15473 12643 9709 1579 -4202 -303 -4388 -5224 7072 21505 15112
11172 15112 13331 15520 15882 3965 -5048 -17763 -10740 -708 1491 -7848 -11862 -13178 -7750 -2637
11158 -2637 -5300 -13576 -9020 -3957 -4803 -3348 -13125 -17430 -5334 6950 17843 10065 3983 -7723
$$ packed form
11255A4280K249M656j5469j8258O059J0258l620j817N193K188j6358n446o033
11242b2118J521q655N548L908J2558J4482P96r714j6024N439l06o36J1552J5377
11228A3728q277n995M808J731n269q638K531N292M935Q385j247q998K263J0844
11214A6093p511l208R220K96j832K366q908j70r375j5399m258J6522J3008p214
11200c70j0545k275q235Q069l278J3680O191P799K012o970k224q760k750k334
11186i990J070M448L302J6643k830k934q130n781L899m085q36J2296J4433o393
11172A5112j781K189L62j1917r013j2715P023J0032K199r339m014j316N428N113
11158b637k663q276M556N063q46J455r777m305J2096J2284J0893p778o082j1706
$$ plain form
11144 -7723 -12292 -5951 -4939 6002 -5688 -9154 -6737 -539 8207 134 -28257 -43468 -28375
11131 -28375 -21416 -27317 -25282 -19648 -14326 -15889 -12202 -2821 -2812 -8030 5243 3949 10422 16902 11308
11116 11308 7587 465 -9519 -9006 -6915 -16048 -20734 -24633 -31173 -35240 -36696 -28199 -16090 -6074
11102 -6074 -4503 -2046 3537 4131 23763 25591 16465 9051 -7994 -1464 7375 -644 -4316 2205
11088 2205 5163 9942 11980 10250 9990 13694 23057 7077 -5957 -7997 -572 -727 -5306 -16541
11074 -16541 -29363 -32994 -37713 -31513 -19670 -13723 -9848 -5262 -13321 -17503 -4697 5152 4891 12384
11060 12384 7116 2958 5442 7888 16199 887 -5932 -2159 196 6273 15313 21317 14698 5223
11046 5223 -3991 -2440 6500 2896 -3360 -9251 -7620 4457 11908 12279 14006 -1736 -11496 -8027
$$ packed form
11144g723m569O341J012J0941j1690l466K417O198Q746q073k8391j5211J5093
11131b8375O959n901K035N634N322j563L687R381Rn218J3273j294O473O480n594
11116A1308l721p122r984N13K091r133m686l899o540m067j456Q497J2109J0016
11102f074J571K457N583N94J9632J828r126p414j7045O530Q839q019l672O521
11088B205K958M779K038j730k60L704R363j5980j3034k040P425j55m579j1235
11074a6541j2822l631m719O200J1843N947L875M586q059m182J2806R849k61P493
11060A2384n268m158K484K446Q311j5312o819L773K355O077R040O004o619r475
11046E223r214J551Q940l604o256n891J631J2077P451L71J727j5742r760L469
$$ plain form
11032 -8027 -4723 6752 -3420 -10768 -5813 -12738 -16487 -5609 -6638 -5058 -1591 -13952 -2767
11019 -2767 -2955 -9186 -11400 -4915 1550 2263 -4701 -10382 -18396 -10445 943 -5594 -16254 -13945 -3588
11004 -3588 -7261 -23561 -26529 -20872 -3864 -2542 -2167 7482 -711 -11473 -4679 -245 -9500 -6546
10990 -6546 -2808 -12479 -18460 -29354 -32613 -25889 -12976 -3627 1227 9324 21471 14116 20467 28215
10976 28215 17639 6864 -3862 -23579 -11116 -10843 -23247 -17417 5125 1836 -10183 -7702 -1232
10963 -1232 -12823 -9020 -8569 -6206 473 1807 -4547 -12350 -6442 -2013 -8744 -9710 -7052 -3196 -1516
10948 -1516 6995 18869 1089 4867 12861 8137 -2959 -15899 -21832 -16601 -14565 -7753 3968
10935 3968 2702 -2714 -1050 -1249 1509 -6017 -11081 -3955 11287 2013 -10583 -7825 3290 17355
$$ packed form
11032h027L304J1475j0172p348M955o925l749J0878j029J580L467j2361J1185
11019b767j88o231k214O485O465P13o964n681q014P951J1388o537j0660K309J0357
11004c588l673j6300k968N657J7008J322L75R649q193j0762O794M434r255K954
10990f546L738r671n981j0894l259O724J2913R349M854Q097J2147p355O351P748
10976B8215j0576j0775j0726j9717J2463K73j2404N830K2542l289j2019K481O470
10963a232j1591L803M51K363O679J334o354p803N908M429o731r66K658L856J680
10948a516Q511J1874j7780L778P994m724j1096j2940n933N231K036O812J1721
10935C968j266n416J664j99K758p526n064P126J5242r274j2596K758J1115J4065
$$ plain form
10921 17355 7365 -4897 -14792 -17857 -7805 -2085 367 -1535 5815 9102 4648 5651 -3814 -3337
10907 -3337 -9199 -13250 -1917 8588 14458 10905 4048 7715 2549 1662 -9735 -15137 -5872 -8474
10893 -8474 -18350 -4823 7642 7242 -721 1946 13496 20537 23071 20982 10548 7121 11575 4896
10879 4896 6959 10347 7543 2174 4059 3584 -1397 6212 11493 -5125 -12463 -13558 -18106 136
10865 136 9881 865 -5241 -691 -9878 -22048 -28687 -26805 -15438 -9467 -17405 -15198 -19690 -8440
10851 -8440 7835 8681 13420 15231 6460 -431 -5318 9972 16702 1014 8393 16916 5686 12878
10837 12878 20456 14491 13751 10021 -6618 -20843 -14068 -11259 -4991 -3828 -16188 -18125 -419 11289
10823 11289 7953 2672 3913 6966 6371 1457 -11315 -7101 -8027 -6304 2543 9585 20740 17568
$$ packed form
10921A7355r990j2262r895l065J0052N720K452j902P350L287m454J003r465M77
10907c337n862m051J1333J0505N870l553o857L667n166q87j1397n402R265k602
10893h474r876J3527J2465m00p963K667J1550P041K534k089j0434l427M454o679
10879D896K063L388k804n369J885m75m981P609N281j6618p338j095m548J8242
10865A36R745r016o106M550r187j2170o639J882J1367N971p938K207m492J1250
10851h440J6275Q46M739J811q771o891m887J5290O730j5688P379Q523j1230P192
10837A2878P578n965p40l730j6639j4225O775K809O268J163j2360j937J7706J1708
10823A1289l336n281J241L053n95m914j2772M214r26J723Q847P042J1155l172
$$ plain form
10809 17568 14169 13650 -1722 -7922 -6603 -9710 -1631 2270 -716 -8340 -3831 -8469 -9562 -14673
10795 -14673 -10085 -3735 8636 19372 13264 6899 -3888 -7184 -12773 -1934 10311 -703 -8465
10782 -8465 -12014 -4308 3167 5944 665 -1233 6825 9010 -8849 -16335 -9336 -1622 11910 21305
10768 21305 10332 -4073 -4736 1738 5234 -4530 -3771 -349 -5028 -15496 74 13418 9806 10464
10754 10464 -13238 -29647 -25732 -20539 -7848 7954 7121 2051 -3028 -13246 -15170 -2400 -4908
10741 -4908 -20918 -21181 -3166 583 555 -1321 2200 4950 1374 1384 2841 1619 17842 15585 -1641
10726 -1641 -14803 -1460 -576 -19792 -16262 -1210 2608 -3456 -2713 1020 221 2871 9044 16228
10712 16228 15907 21634 17218 12653 -1340 -11209 -11055 -13089 -6370 6171 7204 -2755 507 19087
$$ packed form
10809A7568l399n19j5372o200J319l107Q079L901k986p624M509m638j093n111
10795a4673M588O350J2371J0736o108o365j0787l296n589J0839J2245j1014p762
10782h465l549P706P475K777n279j898Q058K185j7859p486O999P714J3532R395
10768B1305j0973j4405o63O474L496r764P59L422m679j0468J5570J3344l612O58
10754A0464k3702j6409L915N193J2691J5802q33n070n079j0218j924J2770k508
10741d908j6010k63J8015L749k8j876L521K750l576J0J457j222J6223k257j7226
10726a641j3162J3343Q84j9216L530J5052L818o064P43L733p99K650O173P184
10712A6228l21N727m416m565j3993r869J54k034O719J2541J033r959L262J8580
$$ plain form
10698 19087 34154 26333 14056 17794 27691 27821 27735 29249 21768 16793 10821 6700 15171 19162 5682
10683 5682 -16506 -17752 -7106 5386 13576 28760 25911 13757 5848 2477 -4132 6245 15030
10670 15030 14611 15021 2300 -7753 -2687 6171 5603 -203 4680 1903 -4964 -7408 -13322 -10163 1211
10655 1211 7116 4314 7873 11868 16091 12607 21659 22233 11265 5929 3138 2020 11909 19242 25621
10640 25621 27367 24308 22890 19138 9502 6761 11200 9810 -2066 484 -6380 -8033 -693 -2118
10626 -2118 10821 19434 4943 -2640 -6183 -14569 -5428 -9856 -4478 16163 14002 10705 17550 15262
10612 15262 7838 18713 33995 33001 18266 10852 5336 21643 34897 35583 36276 33711 22889 21306
10598 21306 16435 20103 22740 18624 4649 -10253 -10977 -284 -12729 -22669 -22754 -17771 2964 29080
$$ packed form
10698A9087J5067p821j2277L738R897J30q6J514p481m975n972m121Q471L991j3480
10683E682k2188j246J0646J2492Q190J5184k849j2154p909l371o609J0377Q785
10670A5030m19M10j2721j0053N066Q858n68n806M883k777o867k444n914L159J1374
10655A211N905k802L559L995M223l484R052N74j0968n336k791j118R889P333O379
10640B5621J746l059j418l752r636k741M439j390j1876K550o864j653P340j425
10626b118J2939Q613j4491p583l543q386R141m428N378K0641k161l297O845k288
10612A5262p424J0875J5282r94j4735p414n516J6307J3254O86O93k565j0822j583
10598B1306m871L668K637m116j3975j4902p24J0693j2445r940q5M983K0735K6116
$$ plain form
10584 29080 21253 -6824 -7341 -4378 -4578 1122 6908 1698 2231 -696 489 -3331 9243 16937 19177
10569 19177 8149 9085 10100 7484 -2779 -8151 -12076 -10667 -14524 356 13597 -3086 -11743
10556 -11743 -2116 -3031 -7658 -7022 940 -2573 -6261 -370 -2073 -4727 4394 12513 8066 1688 7137
10541 7137 9272 4285 1274 11377 15101 11054 -3622 -17883 -12524 1146 9034 4081 2545 20121
10527 20121 30068 27455 29275 30538 31998 31696 31559 34372 39829 10732 -2090 10112 3014 4184
10513 4184 11292 18250 24369 33891 40944 32608 17630 6198 5317 11873 26406 36586 16713 11871
10499 11871 6894 17139 18779 3857 8258 16651 21578 8747 -11187 -12852 -6637 -3184 6295
10486 6295 13100 19369 15457 18044 11073 12705 10818 14521 10882 5712 6396 8349 -9189 -7211 -21202
$$ packed form
10584B9080p827k8077n17K963k00N700N786n210N33k927J185l820J2574P694K240
10569A9177j1028R36J015k616j0263n372l925J409l857J4880J3241j6683q657
10556a1743R627r15m627O36P962l513l688N891j703k654R121Q119m447o378N449
10541G137K135m987l011J0103L724m047j4676j4261N359J3670P888m953j536J7576
10527B0121R947k613J820J263J460l02j37K813N457k9097j2822J2202p098J170
10513D184P108O958O119R522P053q336j4978j1432q81O556J4533J0180j9873m842
10499A1871m977J0245J640j4922M401Q393M927j2831j9934j665O215L453R479
10486F295O805O269l912K587o971J632j887L703l639n170O84J953j7538J978j3991
$$ plain form
10471 -21202 -21909 -23957 -23262 -6377 13858 17652 11402 2928 14213 14432 16604 26376 25791 14493
10457 14493 22299 16526 12674 7742 -4087 -17699 -15416 -11009 -10857 2791 1560 5935 1823 2544
10443 2544 9634 7226 11355 21754 30366 38851 40944 40452 39218 25246 23231 23705 18106 14119 6967
10428 6967 2155 4696 13322 5924 6204 13889 18968 8594 5357 10793 14801 4755 1961 14129
10414 14129 19128 21224 13600 -7859 -19735 -8031 -2330 11840 21287 22566 11327 21340 27967
10401 27967 24579 18092 15723 33949 40288 39713 57969 72755 86652 90913 110255 114026 115212
10388 115212 121441 134725 149311 150598 153734 147790 136767 108480 90448 82633 75786 70597 62581
10375 62581 50298 54922 50968 49576 39663 39600 49924 43487 45328 49954 50769 46788 51191 58742 54720
$$ packed form
10471b1202p07k048O95J6885K0235L794o250q474J1285K19K172R772n85j1298
10457A4493P806n773l852m932j1829j3612K283M407J52J3648j231M375m112P21
10443B544P090k408M129J0399Q612Q485K093m92j234j3972k015M74n599l987p152
10428F967m812K541Q626p398K80P685N079j0374l237N436M008j0046k794J2168
10414A4129M999K096p624k1459j1876J1704N701J4170R447J279j1239J0013O627
10401B7967l388o487k369J8226O339n75J8256J4786J3897M261J9342L771J186
10388A15212O229J3284J4586J287L136n944j1023k8287j8032p815o847n189q016
10375F2581j2283M624l954j392r913o3J0324o437J841M626Q15l981M403P551m022
$$ plain form
10360 54720 39476 36133 37228 44145 58257 86955 113084 127163 144297 161639 175762 190463
10348 190463 193384 200096 202447 205420 218959 216401 186082 168948 162773 137342 119643 101672 86794
10335 86794 73820 63451 60492 61690 50127 43848 45770 60106 61687 60371 58841 52923 49134
10322 49134 41002 43450 45630 40855 49670 57064 58004 42216 33723 28215 21555 17370 27794 39422
10308 39422 54217 49191 30674 25764 34650 44762 39541 38017 36473 29567 37219 61236 74551
10295 74551 97675 125857 145943 166970 189969 207537 212879 220531 233204 230750 218485 216270
10283 216270 219922 218428 216834 222464 213776 196385 188204 193570 206723 228119 225416 218267 223380
10270 223380 228443 252431 281217 288800 299225 296937 289942 291309 295742 289864 279599 273828 250324
$$ packed form
10360E4720j5244l343J095O917J4112K8698K6129J4079J7134J7342J4123J4701
10348A90463K921O712K351K973J3539k558l0319j7134o175k5431j7699j7971j4878
10335H6794j2974j0369k959J198j1563o279J922J4336J581j316j530n918l789
10322D9134q132K448K180m775Q815P394R40j5788q493n508o660m185J0424J1628
10308C9422J4795n026j8517m910Q886J0112n221j524j544o906P652K4017J3315
10295G4551K3124K8182K0086K1027K2999J7568N342P652J2673k454j2265k215
10283B16270L652j494j594N630q688j7391q181N366J3153K1396k703p149N113
10270B23380N063K3988K8786P583J0425k288o995J367M433n878j0265n771k3504
$$ plain form
10257 250324 233241 222029 202244 163386 146346 134905 125756 124351 115532 111945 85623 73807
10245 73807 72862 66227 70103 73708 83597 84802 75182 66762 69290 72859 75378 65122 64570 44117
10231 44117 37516 35109 34652 42174 44576 39904 44257 33875 36274 35211 32568 32563 37819 50258 57698
10216 57698 60380 44285 35927 40270 33961 37690 51692 49544 46445 36761 33855 34061 38477 40554
10202 40554 45608 56080 59760 52157 43139 47414 39679 31806 34777 28664 37999 41319 35227 37255
10188 37255 31431 26417 27913 27957 26951 31863 27181 26826 31736 39948 50171 61379 54597 44656 31568
10173 31568 29778 29244 39468 34605 30406 35678 57120 60751 65913 65704 54332 30043 17086 26237
10159 26237 34446 34852 37907 41232 31080 25852 33973 32986 31472 37617 25747 22410 22919 21963 27761
$$ packed form
10257B50324j7083j1212j9785l8858j7040j1441r149j405q819l587k6322j1816
10245G3807r45o635L876L605R889J205r620q420K528L569K519j0256n52k0453
10231D4117o601k407m57P522K402m672M353j0382K399j063k643nN256J2439P440
10216E7698K682j6095q358M343o309L729J4002k148l099r684k906K06M416K077
10202D0554N054J0472L680p603r018M275p735p873K971o113R335L320o092K028
10188C7255n824n014J496M4j006M912m682l55M910Q212J0223J1208o782r941j3088
10173C1568j790n34J0224m863m199N272K1442L631N162k09j1372k4289j2957R151
10159B6237Q209M06L055L325j0152n228Q121r87j514O145j1870l337N09r56N798
$$ plain form
10144 27761 16403 16153 12253 -1196 7088 4179 8595 27683 40316 43945 46912 44047 41654 44330
10130 44330 42775 47598 37033 26399 30200 35835 26394 12891 21578 31749 36491 40114 51287
10117 51287 52607 32552 21985 17599 22374 22395 22491 14938 2122 -873 4571 8351 10016 9270 4675
10102 4675 16698 27587 24162 23806 11710 11079 26982 31733 18409 21661 46829 44408 26787
10089 26787 22653 19158 15652 18743 38932 34772 18359 10869 15230 26193 31723 32475 29166 35579
10075 35579 39232 44451 34884 34610 34267 36069 27937 20729 13281 2496 12131 13000 17228 24903 28915
10060 28915 38764 48165 47161 52920 87640 120007 121031 104235 78105 57043 51977 48467 45988
10047 45988 44993 46270 25610 19659 34081 35108 32960 28922 22740 24466 33645 29262 19183 21362
$$ packed form
10144B7761j1358k50l900j3449Q284k909M416J9088J2633L629K967k865k393K676
10130D4330j555M823j0565j0634L801N635r441j3503Q687J0171M742L623J1173
10117E1287J320k0055j0567m386M775K1R6p553j2816k995N444L780J665p46m595
10102D675J2023J0889l425l56j2096o31J5903M751j3324L252K5168k421j7621
10089B6787m134l495l506L091K0189m160j6413p490M361J0963N530P52l309O413
10075C5579L653N219r567k74l43J802q132p208p448j0785R635Q69M228P675M012
10060B8915R849R401j004N759L4720L2367J024j6796k6130k1062n066l510k479
10047D5988r95J277k0660n951J4422J027k148m038o182J726R179m383j0079K179
$$ plain form
10033 21362 26911 34063 39771 39229 41626 35342 40000 28137 27200 31281 14143 -47 2821 7178
10019 7178 9654 10235 12251 26924 24979 27174 33559 32435 43575 46061 41370 21524 10071 13264
10005 13264 23151 32066 37339 37600 36345 38279 32392 38880 44905 44269 34804 20754 22719 12435
9991 12435 9556 16254 25094 27084 31977 25707 26217 19685 14579 8896 3030 12579 18932 21508 16644
9976 16644 15993 28324 51009 56946 56238 41579 26408 26403 33755 28916 22700 16543 8827 6652 15365
9961 15365 29583 34306 36407 28285 19635 17697 19224 28836 33715 26703 22008 17591 15962 28708
9947 28708 36703 28688 20640 16882 24474 39180 55106 74814 88536 93590 80445 87560 95215
9934 95215 73967 44156 39275 32419 21464 25757 36018 48653 51042 54069 49522 34983 19333
$$ packed form
10033B1362N549P152N708n42K397o284M658j1863r37M081j7138j4190K868M357
10019G178K476N81K016J4673j945K195O385j124J1140K486m691j9846j1453L193
10005A3264R887Q915N273K61j255J934n887O488O025o36r465j4050J965j0284
9991A2435k879O698Q840J990M893o270N10o532n106n683n866R549O353K576m864
9976A6644o51J2331K2685N937p08j4659j5171nP352m839o216o157p716k175Q713
9961A5365J4218M723K101q122q650j938J527R612M879p012m695m417j629J2746
9947B8708P995q015q048l758P592J4706J5926J9708J3722N054j3145P115P655
9934I5215k1248k9811m881o856j0955M293J0261J2635K389L027m547j4539j5650
$$ plain form
9921 19333 13749 21990 39790 47435 50693 46708 32170 35130 42171 42836 46033 49474 44079 37172
9907 37172 28587 31528 34561 33658 29126 29248 38219 31832 29990 45709 54030 52325 41839 38161 31464
9892 31464 18332 18651 30825 33963 31027 36950 45801 50754 58965 46585 36870 29871 38112 61328
9878 61328 67549 59605 50457 33812 27092 21028 24282 25231 12162 9873 15936 26001 26911 30131
9864 30131 34775 34068 35903 42910 49216 42827 39454 45108 55914 47070 43498 42881 46536 42149 50168
9849 50168 57724 42853 27644 20973 26021 39302 43918 43688 39938 44267 50510 50603 56724 45741
9835 45741 55230 60789 51546 43359 26967 30300 34878 53434 48241 48442 49513 37161 21667 30811
9821 30811 48915 63836 57448 44813 43803 38147 29966 43877 51237 51152 44536 45308 40541 19555
$$ packed form
9921A9333n584Q241J7800P645L258l985j4538K960P041O65L197L441n395o907
9907C7172q585K941L033r03m532J22Q971o387j842J5719Q321j705j0486l678o697
9892C1464j3132L19J2174L138k936N923Q851M953Q211j2380r715o999Q241K3216
9878F1328O221p944r148j6645o720o064L254R49j3069k289O063J0065R10L220
9864C0131M644p07J835P007O306o389l373N654J0806q844l572o17L655m387Q019
9849E0168P556j4871j5209o671N048J3281M616k30l750M329O243R3O121j0983
9835D5741R489N559r243q187j6392L333M578J8556n193K01J071j2352j5494R144
9821C0811J8104J4921o388j2635j010n656q181J3911P360q5o616P72m767k0986
$$ plain form
9807 19555 18202 23207 40095 44325 42643 37849 40525 53365 59901 58722 43926 40714 45342 42240
9793 42240 40555 27680 32414 33774 38397 49684 56445 58942 49326 32470 35351 41701 35395 30299
9779 30299 33812 41700 46896 54987 56452 52653 51008 59381 54238 56392 63109 57928 59863 55202 49576
9764 49576 41817 29893 21626 34989 42157 29522 33428 48637 61791 57642 50679 45686 36605
9751 36605 35672 33273 21623 12822 20309 34615 33688 38234 37297 37962 30838 37703 51624 59227 57892
9736 57892 43694 48733 55024 63608 68116 52701 41865 43718 44291 39069 36920 57708 72466 74561
9722 74561 78630 69516 62987 53643 36473 39793 37145 35931 43886 38064 41402 40113 46195 53129
9708 53129 70382 68651 59314 41948 50712 58524 57072 63277 68249 59313 53587 59541 59518 45005
$$ packed form
9807A9555j353N005J6888M230j682m794K676J2840O536j179j4796l212M628l102
9793D2240j685j2875M734J360M623J1287O761K497r616j6856K881O350o306n096
9779C0299L513P888N196Q091J465l799j645Q373n143K154O717n181J935m661n626
9764D9576p759j1924q267J3363P168j2635L906J5209J3154m149o963m993r081
9751C6605r33k399j1650q801P487J4306r27M546r37O65p124O865J3921P603j335
9736E7892j4198N039O291Q584M508j5415j0836J853N73n222k149K0788J4758K095
9722G4561M069r114o529r344j7170L320k648j214P955n822L338j289O082O934
9708E3129J7253j731r337j7366Q764P812j452O205M972q936n726N954k3j4513
$$ plain form
9694 45005 43253 40925 44425 49417 37797 20581 15351 22169 31887 33254 42182 49821 61309 71982
9680 71982 61815 44367 42321 58034 53323 38743 40584 62419 79858 92072 85698 89978 89814
9667 89814 85661 78959 75640 51936 53443 56585 61481 57294 56277 51424 51778 65504 63598 56753
9653 56753 37695 19975 17182 35818 39302 27445 15855 19060 26788 31421 40760 40861 40251 31204
9639 31204 31794 39941 42741 45720 46154 48228 53778 55343 55741 56838 56367 40705 34046 47884 50946
9624 50946 55191 63324 70449 61433 58592 73824 85014 81638 81183 66969 61640 55754 51447 48138
9610 48138 42670 49126 49556 44896 40246 50651 52482 54182 60940 66043 74566 70959 66947 72753 73387
9595 73387 64629 67159 70784 64449 54368 62823 59576 40946 24149 37255 44786 47129 38089 42344
$$ packed form
9694D5005j752k328L500M992j1620j7216n230O818R718J367Q928P639J1488J0673
9680G1982j0167j7448k046J5713m711j4580J841K1835J7439J2214o374M280j64
9667H9814m153o702l319k3704J507L142M896m187j017m853L54J3726j906o845
9653E6753j9058j7720k793J8636L484j1857j1590L205P728M633R339J01o10r047
9639C1204N90Q147K800K979M34K074N550J565L98J097m71j5662o659J3838L062
9624E0946M245Q133P125r016k841J5232J1190l376m55j4214n329n886m307l309
9610D8138n468O456M30m660m650J0405J831J700O758N103Q523l607m012N806O34
9595G3387q758K530L625o335j0081Q455l247j8630j6797J3106P531K343r040M255
$$ plain form
9581 42344 58753 67545 53286 46198 45458 44215 51544 55846 60097 67565 66650 61398 72048 71438 77085
9566 77085 73137 66289 71933 71341 69038 59724 46832 45223 49365 56143 61300 72997 76145 79812
9552 79812 67999 85073 94249 97041 93116 88578 91022 89668 69413 57078 55095 60215 52355 59977
9538 59977 71556 73345 74291 76889 85807 88219 91026 82679 72329 81437 83694 91145 91311 76060
9524 76060 59849 62483 79577 78724 60776 70020 70735 57195 57631 48454 47303 54362 66318 75811
9510 75811 68866 69884 67590 61740 66433 72901 79948 84886 73229 76889 71635 87429 78488 74430
9496 74430 86267 98433 95959 90777 91061 95133 89567 94634 92933 74195 63957 58113 65283 82846
9482 82846 90159 79220 75979 88199 92217 92248 85871 83390 89021 88638 88063 83159 73304 73883 65850
$$ packed form
9581D2344J6409Q792j4259p088p40j243P329M302M251P468r15n252J0650o10N647
9566G7085l948o848N644n92k303r314j2892j609M142O778N157J1697L148L667
9552G9812j1813J7074R176K792l925m538K444j354k0255j2335j983N120p860P622
9538E9977J1579J789R46K598Q918K412K807q347j0350R108K257P451J66j5251
9524G6060j6211K634J7094q53j7948R244P15j3540M36r177j151P059J1956R493
9510G5811o945J018k294n850M693O468P047M938j1657L660n254J5794q941m058
9496G4430J1837J2166k474n182K84M072n566N067j701j8738j0238n844P170J7563
9482H2846P313j0939l241J2220M018L1o377k481N631l83n75m904r855N79q033
$$ plain form
9467 65850 76521 89875 89022 77861 93198 92207 79293 82141 91094 88789 101673 105505 102249 97133
9453 97133 79276 66397 74382 76887 84587 90207 89577 74693 70067 78317 81058 82526 87890 80360
9439 80360 66440 67270 85349 94050 85047 84718 95293 94634 99971 102766 91839 100433 100869 105018 106688
9424 106688 97901 107744 111573 112663 115377 115232 125099 146376 148298 153511 166374 180652 190512 175671
9410 175671 158506 153202 155689 146541 144415 133361 132986 124757 110327 106051 109050 121470 124681 128248
9396 128248 125181 113997 108870 107959 114050 118853 121309 116475 102698 101759 100515 96667 97036 106263 117924
9381 117924 124328 126890 112985 116151 127478 133554 131548 137979 145722 164086 177146 194154 196012
9368 196012 196410 195846 181217 162386 155505 163547 153172 132609 129811 141575 156190 158414 152346
$$ packed form
9467F5850J0671J3354q53j1161J5337r91j2914K848Q953k305J2884L832l256n116
9453I7133j7857j2879P985K505P700N620o30j4884m626Q250K741J468N364p530
9439H0360j3920Q30J8079Q701r003l29J0575o59N337K795j0927Q594M36M149J670
9424A06688q787R843L829J090K714j45R867K1277J922N213J2863J4278R860j4841
9410A75671j7165n304K487r148k126j1054l75q229j4430m276K999J2420L211L567
9396A28248l067j1184n127r11O091M803K456m834j3777r39j244l848L69R227J1661
9381A17924O404K562j3905L166J1327O076k006O431P743J8364J3060J7008J858
9368A96012L98n64j4629j8831o881Q042j0375k0563k798J1764J4615K224o068
$$ plain form
9355 152346 142768 152660 145517 132618 118841 129563 136499 133197 135955 126332 117383 132207 129686
9342 129686 114057 124675 113216 113155 114044 125224 139618 152543 145724 130207 123740 121732 123841
9329 123841 124866 112021 118600 119960 107514 97761 102127 104116 101751 109860 132911 145201 136228
9316 136228 135289 121834 126970 129900 122947 117754 125413 131923 140683 132279 141950 145941 128216 131410
9302 131410 145528 161893 166902 159035 137908 125463 111450 109134 114433 120885 127236 123769 117357
9289 117357 107821 109635 100642 96464 119194 127785 143135 136024 122588 116705 114463 114618 122153 124886
9275 124886 123835 129496 130046 121788 124320 125379 134080 143221 130710 117501 124751 123793 121430 109802
9261 109802 100046 110119 125066 117135 100690 103535 124984 132055 133210 137791 126826 127836 117846
$$ packed form
9355A52346r578R892p143j2899j3777J0722O936l302K758r623q949J4824k521
9342A29686j5629J0618j1459o1Q89J1180J4394J2925o819j5517o467k008K109
9329A23841J025j2845O579J360j2446r753M366J989k365Q109K3051J2290q973
9316A36228r39j3455N136K930o953n193P659O510Q760q404R671L991j7725L194
9302A31410J4118J6365N009p867k1127j2445j4013k316N299O452O351l467o412
9289A17357r536J814q993m178K2730Q591J5350p111j3436n883k242J55P535K733
9275A24886j051N661N50q258K532J059Q701R141j2511j3209P250r58k363j1628
9261A09802r756J0073J4947p931j6445K845K1449P071J155M581j0965J010r990
$$ plain form
9248 117846 128040 123908 122491 118777 121597 124181 125283 119906 123932 120299 117905 123913 125240 114412
9234 114412 118535 106605 104852 108332 101836 93300 82062 81177 88549 90564 84955 84610 94946 89970
9220 89970 102058 109223 111649 111560 113346 112957 103839 110874 110881 101040 96636 113240 129696 116887 112219
9205 112219 126183 130330 106308 88794 83799 100462 105276 104269 105674 98614 98073 109815 121092
9192 121092 109295 102259 112078 127400 123924 107998 102233 107953 115117 121018 110128 113598 115641
9179 115641 112089 107183 102679 115528 121227 115463 123106 132332 135815 125546 99671 99050 121295 121380
9165 121380 120677 105756 82211 82974 89565 95319 105539 107522 92302 103176 99856 86898 87107 100611
9151 100611 104347 95564 82686 81743 83645 86599 101714 119591 121257 128687 125194 117424 109229 110968
$$ packed form
9248A17846J0194m132j417l714K820K584J102n377M026l633k394O008J327j0828
9234A14412M123j1930j753L480o496q536j1238q85P372K015n609l45J0336m976
9220H9970J2088P165K426q9J786l89r118P035Pr841m404J6604J6456j2809m668
9205A12219J3964M147k4022j7514m995J6663M814j007J405p060n41J1742J1277
9192A21092j1797p036R819J5322l476j5926n765N720P164N901j0890L470K043
9179A15641l552m906m504J2849N699n764P643R226L483j0269k5875o21K2245Q5
9165A21380p03j4921k3545P63O591N754J0220J983j5220J0874l320j2958K09J3504
9151A00611L736q783j2878r43J902K954J5115J7877J666P430l493p770q195J739
$$ plain form
9137 110968 118275 123533 140122 156279 137252 115827 112194 113252 101325 91741 81437 76028 88812
9124 88812 99927 107880 111080 108131 109846 124971 123201 106697 112697 114467 109558 118824 112899 103353
9110 103353 99255 89162 80459 82798 96720 105285 107109 105302 120023 121029 121385 120146 110009 101412
9096 101412 94439 103685 98355 93102 97610 109267 106895 101116 105917 114782 113998 110402 99226 103809
9082 103809 120988 123026 117842 111051 111258 108480 94682 78319 87414 108314 110888 95809 83168
9069 83168 76465 79866 78082 77377 78886 67913 71395 85523 97075 103933 89280 89553 102101 101467
9055 101467 102636 97939 81797 79952 83452 90635 90329 90733 79335 86778 89474 86058 76789 80269
9041 80269 96362 100345 102713 115273 122707 120739 113395 100234 76416 74232 91037 94179 89877
$$ packed form
9137A10968P307N258J6589J6157j9027k1425l633J058j1927r584j0304n409J2784
9124H8812J1115P953L200k949J715J5125j770j6504O000J770m909R266n925r546
9110A03353m098j0093q703K339J3922Q565J824j807J4721J006L56j239j0137q597
9096A01412o973R246n330n253M508J1657k372n779M801Q865p84l596j1176M583
9082A03809J7179K038n184o791K07k778j3798j6363R095K0900K574j5079j2641
9069H3168o703L401j784p05J509j0973L482J4128J1552O858j4653K73J2548o34
9055A01467J169m697j6142j845L500P183l06M04j1398P443K696l416r269L480
9041H0269J6093L983K368J2560P434j968p344j3161k3818k184J6805L142m302
$$ plain form
9028 89877 91018 97516 93934 83702 84479 89938 92164 87634 83289 88985 92077 84646 79288 89941
9014 89941 91121 88569 77779 76289 77881 88243 96457 86037 83169 82279 78743 76799 77908 82009
9000 82009 76387 79741 79721 70286 80432 96848 114331 123109 123998 110727 98745 99735 97716 101103
8986 101103 92603 91169 88875 89787 75967 86849 87611 84430 94004 94940 97507 88287 92417 86100 83342
8971 83342 74761 70523 70317 72947 76241 90274 73578 81482 78913 86983 86129 84324 80015 75950 66102
8956 66102 64975 69124 62240 56879 68577 67317 73800 72820 73815 62214 73540 93782 108581 101028
8942 101028 94200 91815 86634 85941 94179 86365 56719 43266 46946 67441 71969 67170 50459 46581
8928 46581 59575 49593 42842 57347 61073 67887 78454 82934 81155 83234 85777 84689 87937 94088
$$ packed form
9028H9877J141O498l582j0232P77N459K226m530m345N696L092p431n358J0653
9014H9941J180k552j0790j490J592J0362Q214j0420k868q90l536j944J109M101
9000H2009n622L354k0r435J0146J6416J7483Q778Q89j3271j1982R90k019L387
8986A01103q500j434k294R12j3820J0882P62l181R574R36K567r220M130o317k758
8971H3342q581m238k06K630L294J4033j6696P904k569Q070q54j805m309m065r848
8956F6102j127M149o884n361J1698j260O483r80R95j1601J1326K0242J4799p553
8942A01028o828k385n181o93Q238p814k9646j3453L680K0495M528m799j6711l878
8928D6581J2994r982o751J4505L726O814J0567M480j779K079K543j088L248O151
$$ plain form
8914 94088 86560 78219 80981 80857 76453 75362 65127 66094 68245 66348 76381 91840 94437 83597
8900 83597 77546 64995 44011 49784 54551 61087 69399 70496 53952 61626 68904 69920 71336 77130
8886 77130 78475 76819 93076 93091 84840 94313 104465 110661 99983 90306 90450 81779 66589 60383
8872 60383 55649 57151 72748 77628 63186 64717 74543 72172 60990 63870 65566 70473 63277 62115
8858 62115 80096 69239 57351 50945 46750 51940 39358 35903 38686 50488 61859 68898 76780
8845 76780 79556 86739 92554 85182 81019 69091 74528 77891 83803 89715 90127 85000 88397 76145
8831 76145 64784 56754 54277 48841 58217 69337 88687 105447 98246 71132 63830 83281 73719
8818 73719 61331 58133 60016 68050 70823 62508 50904 59462 65992 70192 67489 66328 51264 78646
$$ packed form
8914I4088p528q341K762j24m404j091j0235R67K151j897J0033J5459K597j0840
8900H3597o051j2551k0984N773M767O536Q312J097j6544P674P278J016J416N794
8886G7130J345j656J6257J5q251R473J0152O196j0678r677J44q671j5190o206
8872F0383m734J502J5597M880j4442J531R826k371j1182K880J696M907p196j162
8858F2115J7981j0857j1888o406m195N190j2582l455K783J1802J1371P039P882
8845G6780K776P183N815p372m163j1928N437L363N912N912M12n127L397j2252
8831G6145j1361q030k477n436R376J1120J9350J6760p201k7114p302J9451r562
8818G3719j2388l198J883Q034K773q315j1604Q558O530M200k703j161j5064K7382
$$ plain form
8804 78646 94573 69841 44220 59066 72710 75141 64933 48358 53871 54243 46096 49725 71821
8791 71821 86260 86651 66036 59609 61039 72276 67287 65263 72854 61986 53943 55348 68113 77247
8777 77247 71939 79324 72986 79154 77468 63311 60552 57483 59099 77008 78020 70385 74831 76989
8763 76989 77917 64192 53704 54512 45061 41691 41068 38966 27889 23208 32286 52894 63164 59430
8749 59430 59102 63984 61449 66919 64751 65408 85360 75178 65569 78168 85951 92343 85240 78982
8735 78982 95720 105247 106843 97006 104102 97620 85140 81441 77462 67069 70207 72476 79395 100171
8721 100171 112984 105740 95273 91521 89630 96371 97894 100426 99370 91712 89803 83298 66892 58569
8707 58569 66692 76427 63063 55118 52539 53743 66234 86219 92712 92337 98724 98458 90943 74285
$$ packed form
8804G8646J5927k4732k5621J4846J3644K431j0208j6575N513L72q147L629K2096
8791G1821J4439L91k0615o427J430J1237m989k024P591j0868q043J405J2765R134
8777G7247n308P385o338O168j686j4157k759l069J616J7909J012p635M446K158
8763G6989R28j3725j0488Q08r451l370o23k102j1077m681R078K0608J0270l734
8749E9430l28M882k535N470k168O57J9952j0182r609J2599P783O392p103o258
8735G8982J6738R527J596r837P096o482j2480l699l979j0393L138K269O919K0776
8721A00171J2813p244j0467l752j891O741J523K532j056p658j909o505j6406q323
8707E8569Q123R735j3364p945k579J204J2491J9985O493l75O387k66p515j6658
$$ plain form
8693 74285 72015 68201 70880 79658 87573 92238 93956 79111 63757 74053 67978 59361 59442 61166
8679 61166 64512 68216 67851 57377 64353 73206 67524 64863 67691 75383 58761 55820 66434 64852
8665 64852 59983 61684 53480 56144 52659 65196 54533 44456 49644 58688 58681 58866 48388 49779 55717
8650 55717 57135 55281 54370 53841 51756 48033 50112 48932 45840 49532 43280 49058 58055 62067 76706
8635 76706 81632 74124 67776 67931 43597 26265 34938 32505 36315 48682 55690 66769 75977 71058
8621 71058 66708 63781 56714 48285 52013 58572 53770 46048 33564 39884 41834 47859 48898 51262
8607 51262 57907 63659 65032 63379 60813 57648 45527 47962 41471 40068 37122 16526 14522 17631
8593 17631 6820 1165 -4350 -4285 -4704 6661 27033 35749 34960 32243 31454 28749 34376 36217 50566
$$ packed form
8693G4285k270l814K679Q778P915M665J718j4845j5354J0296o075q617Q1J724
8679F1166L346L704l65j0474O976Q853n682k661K828P692j6622k941J0614j582
8665F4852m869J701q204K664l485J2537j0663j0077N188R044pJ85j0478J391N938
8650E5717J418j854r11n29k085l723K079j180l092L692o252N778Q997M012J4639
8635G6706M926p508o348J55k4334j7332Q673k433L810J2367P008J1079R208m919
8621G1058m350k927p067q429L728O559m802p722j2484O320J950O025J039K364
8607E1262O645N752J373j653k566l165j2121K435o491j403k946k0596k004L109
8593A7631j0811n655n515O5m19J1365K0372Q716p89k717p89k705N627J841J4349
$$ plain form
8578 50566 42686 30323 31528 28141 27850 31922 28317 34961 31712 14928 8153 13937 26389 31462
8564 31462 20994 10715 3879 9708 11303 21297 26906 21187 11277 -178 9248 19513 8694
8551 8694 14013 26271 23160 21377 14861 4438 3815 9888 26390 31277 22223 12967 10113 12559
8537 12559 17444 21783 20520 23208 19304 11221 -2224 -349 3986 7052 -2348 -4439 9983 20998
8523 20998 22302 20082 5033 -3406 11618 22210 9749 2068 14889 17135 15196 26583 25830
8510 25830 33360 40777 37581 34591 26618 20044 7504 7567 22324 26811 33200 26909 20374 21560 23343
8495 23343 19824 9235 13257 19849 28163 19612 6852 25622 33983 17355 14577 14820 4097 -2230
8481 -2230 7387 7809 15478 10910 24182 31164 25578 19741 21481 20706 18989 23844 38161 34148 22533
$$ packed form
8578E0566p880j2363J205l387k91M072l605O644l249j6784o775N784J2452N073
8564C1462j0468j0279o836N829J595R994N609n719r910j1455R426J0265j0819
8551H694N319J2258l111j783o516j0423o23O073J6502M887r054r256k854K446
8537A2559M885M339j263K688l904q083j3445J875M335L066r400k091J4422J1015
8523B0998J304k220j5049q439J5024J0592j2461p681J2821K246j939J1387p53
8510B5830P530P417l196k990p973o574j2540O3J4757M487O389o291o535J186J783
8495B3343l519j0589M022O592Q314q551j2760J8770Q361j6628k778K43j0723o327
8481b230R617M22P669m568J3272O982n586n837J740p75j717M855J4317m013j1615
$$ plain form
8466 22533 18575 26871 37781 36132 27379 9303 4150 -4123 -7779 -4142 7988 12662 2922 15273
8452 15273 14205 17502 26608 36748 31285 8116 13701 26628 32341 32486 22601 25388 24446 21291
8438 21291 17789 8202 330 -9837 -14237 -20913 -15913 -7118 10650 16386 15805 31164 21049 10054
8424 10054 13508 12330 16511 14081 7763 778 -8759 3373 8562 -2401 -6022 9664 4018 7242
8410 7242 -782 -3763 2197 10476 13115 19303 5338 3027 7674 9515 13535 20709 19971 9908 11993
8395 11993 16520 23373 14534 9094 14898 21372 24194 15669 17144 15203 16652 20566 14567 11082 27938
8380 27938 33541 35346 42345 38278 25280 19157 8307 10744 2139 -4362 12681 13994 15586 14237
8366 14237 -6490 -6702 3975 2588 -9485 -7149 2160 -580 10411 23851 23517 15919 14894 21992
$$ packed form
8466B2533l958Q296J0910j649q753j8076n153q273l656L637J2130M674r740J2351
8452A5273j068L297R106J0140n463k3169N585J2927N713J45r885K787r42l155
8438B1291l502r587p872j0167m400o676N000Q795J7768N736n81J5359j0115j0995
8424A0054L454j178M181k430o318o985r537J2132N189j0963l621J5686n646L224
8410G242q024k981N960Q279K639O188j3965k311M647J841M020P174p38j0063K085
8395A1993M527O853q839n440N804O474K822q525J475j941J449L914n999l485J6856
8380B7938N603J805O999m067j2998o123j0850K437q605o501J7043J313J592j349
8366A4237k0727k12J0677j387j2073K336R309k740J0991J3440l34p598j025P098
$$ plain form
8352 21992 13259 -7550 -13813 -15952 -12166 206 2984 -4150 3911 15547 12142 12240 16070 20364
8338 20364 18425 4543 6763 687 606 9391 17465 11845 10023 21422 35071 35877 19216 17337
8324 17337 18087 20440 11702 -3960 -5323 5318 9155 729 5705 9330 -5623 3858 20633 20544
8310 20544 17875 5425 20750 28288 19978 8427 -1525 -2190 2005 9553 6517 3296 -1104 6556
8296 6556 18886 20462 1451 -5055 -9044 -6763 409 10279 4759 12782 22304 11083 8608 13319
8282 13319 12682 9650 13332 19903 32277 39374 31618 5187 -8044 -20951 -16977 -5883 7143
8269 7143 12082 2545 9309 8758 6055 5535 23533 23986 15265 23013 16299 18623 13963 -1672 -7181
8254 -7181 -8579 8428 15689 22285 21941 9625 -9874 -13927 -23692 -35947 -29478 -10274 -10725 -6028
$$ packed form
8352B1992q733k0809o263k139L786J2372K778p134Q061J1636l405R8L830M294
8338B0364j939j3882K220o076q1Q785Q074n620j822J1399J3649Q06j6661j879
8324A7337P50K353q738j5662j363J0641L837q426M976L625j4953R481J6775q9
8310B0544k669j2450J5325P538q310j1551r952o65M195P548l036l221m400P660
8296F556J2330J576j9011o506l989K281P172R870n520Q023R522j1221k475M711
8282A3319o37l032L682O571J2374P097p756k6431j3231j2907L974J1094J3026
8269G143M939r537O764n51k703n20J7998M53q721P748o714K324m660j5635n509
8254g181j398J7007P261O596l44j2316j9499m053r765j2255O469J9204m51M697
$$ plain form
8240 -6028 12382 20478 21734 12749 15405 15780 172 18 13425 4010 -4072 -8521 1940 20321
8226 20321 16320 1962 -6556 -4433 3203 15014 12702 9068 2226 -2967 -435 -2062 -9643 -4993
8212 -4993 5130 10079 -2233 586 22822 14419 13433 6693 1591 -6860 -6032 -467 3772 9423 23563
8197 23563 15961 6614 9733 6570 18218 14110 14698 7561 18595 32450 6848 -10427 -4192 -9951
8183 -9951 -12198 -6948 -10056 -17066 -18158 -19121 -11583 2246 229 9348 16358 16250 27564 18322 8961
8168 8961 10766 2525 -35 -1572 -22495 -22642 -4502 10929 12918 18110 18096 809 -4265 3723 4602
8153 4602 4221 5031 9673 773 4345 12921 13752 11846 13372 3760 16755 22708 20628 19225 23653
8138 23653 35925 42500 53295 48709 36868 20936 16611 20388 22425 15470 20876 18332 9583 18567
$$ packed form
8240f028J8410Q096J256q985K656L75j5608j54J3407r415q082m449J0461J8381
8226B0321m001j4358q518K123P636J1811k312l634o842n193K532j627p581M650
8212d993J0123M949j2312K819K2236q403r86o740n102q451Q28N565M239N651J4140
8197B3563p602r347L119l163J1648m108N88p137J1034J3855k5602j7275O235n759
8183i951k247N250l108p010j092r63P538J3829k017R119P010j08J1314r242r361
8168H961J805q241k560j537k0923j47J8140J5431J989N192j4j7287n074P988Q79
8153D602l81Q10M642q900L572Q576Q31j906J526r612J2995N953k080j403M428
8138B3653J2272O575J0795m586j1841j5932m325L777K037o955N406k544q749Q984
$$ plain form
8124 18567 14570 13855 20041 17145 6824 6644 13013 13209 17354 17919 14245 9484 16953 21374 12458
8109 12458 5754 6975 18838 28479 29218 4044 -16982 -27999 -30853 -18744 6354 32610 40298
8096 40298 35830 43260 38873 32548 35507 57365 80606 81648 82514 100299 99854 84073 57671 58512
8082 58512 58446 59632 53235 64428 62421 52172 50660 44176 30660 15109 12539 12325 29988 32558
8068 32558 33652 32843 31648 26389 32500 41303 38456 31545 21334 20733 26708 41661 37861 29076 34906
8053 34906 53655 58180 63977 69024 71604 62858 53544 60278 76228 74334 61374 61915 60251 62960
8039 62960 57850 36548 29730 31717 32881 28948 33069 26440 29423 35987 24939 29228 49052 48125
8025 48125 26931 11908 18374 20581 19695 22361 31716 35079 29233 21229 13519 10342 12750 28047
$$ packed form
8124A8567l997p15O186k896j0321j80O369J96M145N65l674m761P469M421q916
8109A2458o704J221J1863R641P39k5174k1026j1017k854J2109K5098K6256P688
8096D0298m468P430m387o325K959K1858K3241J042Q66J7785m45j5781k6402Q41
8082E8512o6J186o397J1193k007j0249j512o484j3516j5551k570k14J7663K570
8068C2558J094q09j195n259O111Q803k847o911j0211o01N975J4953l800q785N830
8053C4906J8749M525N797N047K580q746r314O734J5950j894j2960N41j664K709
8039F2960n110k1302o818J987J164l933M121o629K983O564j1048M289J9824r27
8025D8125k1194j5023O466K207q86K666R355L363n846q004p710l177K408J5297
$$ plain form
8011 28047 41914 40320 26772 35165 44966 46882 48336 46169 32210 31622 17732 37141 45703 28766
7997 28766 21654 19826 24127 26988 22759 6149 993 -1642 -2523 13415 31538 26245 17278 15097
7983 15097 8375 2316 6176 8185 19440 16734 28017 28439 18643 19446 15188 20221 38481 43052
7969 43052 43255 39430 30176 8858 2818 20971 25761 19977 7987 -1027 2804 12260 17837 14482
7955 14482 10268 10928 3562 -4698 10083 10724 9968 8264 10912 18439 20328 7542 3965 -1843 -3587
7940 -3587 11221 10277 12264 -888 2059 11398 11099 6971 11788 20609 11501 21045 14652 16949 8433
7925 8433 13120 8578 13414 28071 32227 22547 11579 -8653 -6220 -6913 -1464 11461 22337 23919
7911 23919 15285 11583 10166 8847 5268 -3730 -3133 10229 16592 6562 890 -1585 -6609 15922
$$ packed form
8011B8047J3867j594j3548Q393R801J916J454k167j3959n88j3890J9409Q562j6937
7997B8766p112j828M301K861m229j6610n156k635q81J5938J8123n293q967k181
7983A5097o722o059L860K009J1255k706J1283M22r796Q03m258N033J8260M571
7969D3052K03l825r254k1318o040J8153M790n784j1990r014L831R456N577l355
7955A4482m214O60p366q260J4781O41p56j704K648P527J889j2786l577n808j744
7940c587J4808r44J987j3152K947R339k99m128M817Q821r108R544o393K297q516
7925H433M687m542M836J4657M156r680j0968k0232K433o93N449J2925J0876J582
7911B3919q634l702j417j319l579q998N97J3362O363j0030n672k475n024K2531
$$ plain form
7897 15922 17429 14268 13191 13438 10206 3002 -248 -10866 -4412 6569 4951 -5650 -3126 -4237
7883 -4237 -3167 -1950 660 -9889 -9116 7244 16421 9576 -3350 -2609 1101 11522 4394 10304
7869 10304 16942 2079 -5045 -5506 -5790 -4595 1462 16611 10360 682 7124 736 -9977 -7707
7855 -7707 -9583 -14672 -15650 -14601 -4542 14014 17597 16892 20840 38233 24724 10172 367 -4939
7841 -4939 7063 3913 -3422 -16059 -15877 -14945 -10869 3150 18072 25921 15271 1456 2794 4795
7827 4795 1983 -946 -6119 3589 15017 5039 -5528 -12926 -17962 -16460 -14714 -14206 -12620 -13700 -15235
7812 -15235 -23928 -25748 -20274 -4361 -2660 -2734 -5238 -10693 -8951 3981 12109 10224 4281 -1148 3859
7797 3859 6785 10766 9648 215 7008 -10419 -22364 -24166 -13590 -3331 -5030 3114 10421 -408
$$ packed form
7897A5922J507l161j077K47l232p204l250j0618O454J0981j618j0601K524j111
7883d237J070J217K610j0549P73J6360R177o845j2926P41L710J0421p128N910
7869A0304O638j4863p124m61k84J195O057J5149o251r678O442o388j0713K270
7855g707j876n089r78J049J0059J8556L583p05L948J7393j3509j4552r805n306
7841d939J2002l150p335j2637J82R32M076J4019J4922P849j0650j3815J338K001
7827D795k812k929n173R708J1428r978j0567p398n036J502J746N08J586j080j535
7812a5235q693j820N474J5913J701p4k504n455J742J2932Q128j885n943n429N007
7797C859K926L981j118r433O793j7427j1945j802J0576J0259j699Q144P307j0829
$$ plain form
7783 -408 -7098 418 3839 22754 10675 -11843 -11723 -24574 -23147 -18875 -8566 5108 5137 -9415
7769 -9415 -7863 -1966 3393 6724 14352 14625 16638 16928 3442 -6945 2785 2268 567 -888 -9232
7754 -9232 -3381 -8685 -20772 -16880 -8162 2350 -4790 -13934 -16737 -11185 6297 13744 3566 -11014
7740 -11014 -8010 -6155 -16792 -21024 -13113 -11221 -7844 -9123 -11598 -1284 665 -4327 -7310 -24147
7726 -24147 -19943 -5886 -3472 -6068 -7138 -12379 -10005 -16979 -32213 -31404 -33955 -22126 -19952 -26100
7712 -26100 -12783 -9285 -15704 -11935 -2017 -4812 -9667 -9430 -9286 -33141 -43123 -40120 -35633 -36792 -35170
7697 -35170 -13308 -381 -6632 -7937 -3777 3287 15513 14265 478 6811 11978 8654 7016 24612
7683 24612 30353 31411 21945 17587 20878 1560 -10616 -12828 -13793 -8518 5222 20759 27982 11842
$$ packed form
7783d08o690P516L421J8915j2079k2518J20j2851J427M272J0309J3674K9j4552
7769i415J552N897N359L331P628K73K013K90j3486j0387R730n17j701j455q344
7754i232N851n304j2087L892Q718J0512p140r144k803N552J7482P447j0178j4580
7740a1014L004J855j0637m232P911J892L377j279k475J0314J949m992k983j6837
7726b4147M204J4057K414k596j070n241K374o974j5234Q09k551J1829K174o148
7712b6100J3317L498o419L769R918k795m855K37J44k3855r982L003M487j159J622
7697c5170K1862J2927o251j305M160P064J2226j248j3787O333N167l324j638J7596
7683B4612N741J058r466m358L291j9318j2176k212r65N275J3740J5537P223j6140
$$ plain form
7669 11842 333 -1703 2659 2052 -7575 -22444 -9725 9340 4722 -4688 3325 3078 2965 -7580
7655 -7580 -17759 -26587 -14138 -1012 17789 9108 6148 4170 -13497 -8503 -7837 -15396 -14595 -23596
7641 -23596 -25339 -19868 -13430 -10211 10344 4351 -20451 -25206 -10695 -4758 -8165 2760 7221 -1168
7627 -1168 -9659 -9694 -6683 -4320 -5563 -12951 -15073 2897 21683 19124 7675 -3734 -7182 -4364
7613 -4364 -11212 -8476 645 -12264 -10292 -2845 -2747 -2903 7348 2308 -13399 -13093 -7351 1341 -8103
7598 -8103 -11761 -9433 -9757 -21431 -9298 -10418 -4124 4916 -5979 -15333 -7124 1195 8824 7654
7584 7654 9347 -4648 -44 5963 3610 3692 11344 9168 1845 -1819 2458 -4586 -23091 -28082 -25652
7569 -25652 -19170 -28579 -23800 -15926 -6042 -8472 -13875 -15846 -15178 -19779 -9346 -9646 -16675 -20348 -3340
$$ packed form
7669A1842j1509k036M362o07r627j4869J2719J9065m618r410Q013k47j13j0545
7655g580j0179q828J2449J3126J8801q681k960j978j7667M994O66p559Q01r001
7641b3596j743N471O438L219K0555n993k4802m755J4511N937l407J0925M461q389
7627a168q491l5L011K363j243p388k122J7970J8786k559j1449j1409l448K818
7613d364o848K736R121j2909J972P447R8j56J0251n040j5707L06N742Q692r444
7598h103l658K328l24j1674J2133j120O294R040j0895r354Q209Q319P629j170
7584G654J693j3995M604O007k353Q2P652k176p323l664M277p044j8505m991K430
7569b5652O482r409M779P874R884k430n403j971O68m601J0433l00p029l673J7008
$$ plain form
7554 -3340 -2335 -3603 -19087 -29194 -29417 -27222 -31571 -14927 3309 8296 13017 5649 -3756 -6381
7540 -6381 -9810 -12329 -10536 -7686 -20486 -29365 -34187 -20424 -3190 3972 6782 7269 913 11155
7526 11155 10699 9762 -4002 -22446 -19695 -12262 -14268 -13527 -3843 2051 -10595 -14249 -13988 -16869 -27745
7511 -27745 -28313 -16122 -10938 -9448 -15393 -29948 -38008 -20912 -10377 -17567 -20082 -29808 -31989 -26410
7497 -26410 -26260 -14244 -11517 -9789 -12644 -11377 -5734 -16270 -3585 -3827 -16865 -32601 -33873 -42960
7483 -42960 -35112 -22277 -11270 -10409 -16631 -25160 -20876 -31106 -36402 -30029 -18980 -9434 -7154 28
7469 28 -4216 -6347 -11294 -20613 -18453 -8288 -1477 11785 4254 -16530 -12349 -2237 5399 5814 2646
7454 2646 -6573 -6983 -9913 -1011 6810 4980 -6671 -4406 5340 19275 6061 -17493 -27658 -30402
$$ packed form
7554c340J005j268j5484j0107k23K195m349J6644J8236M987M721p368r405k625
7540f381l429k519J793K850j2800q879m822J3763J7234P162K810M87o356J0242
7526A1155m56r37j3764j8444K751P433k006P41R684N894j2646l654K61k881j0876
7511b7745n68J2191N184J490n945j4555q060J7096J0535p190k515r726k181N579
7497b6410J50J2016K727J728k855J267N643j0536J2685k42j3038j5736j272r087
7483d2960P848J2835J1007Q61o222q529M284j0230n296O373J1049R546K280P182
7469B8m244k131m947r319K160J0165O811J3262p531k0784M181J0112P636M15l168
7454B646r219m10k930Q902P821j830j1651K265R746J3935j3214k3554j0165k744
$$ plain form
7440 -30402 -27452 -30998 -35713 -29737 -11641 4513 14721 10602 -2376 -3956 -4511 -5395 -1971 5324
7426 5324 3208 -7646 -1871 -16364 -17287 -16796 -2971 -7842 -10995 -19362 -12130 -9688 -5093 4369 -204
7411 -204 -17194 -25843 -11430 -7116 -3691 -14596 -18431 -22085 -22205 -22275 1900 19413 15842 5214
7397 5214 -7190 -16524 -15347 -11469 -4946 -24497 -29054 -21424 -20044 -15021 -17388 -16961 -12939 -3703 -2784
7382 -2784 -5287 -8932 -7439 -18128 -24791 -26505 -13477 4264 1299 -18542 -36533 -29864 -9693
7369 -9693 -6025 -8665 6518 9525 1982 1733 1261 -15846 -10749 1082 5072 -2531 -11426 -19092 -24789
7354 -24789 -24337 -20203 -1953 5032 4447 5948 2068 3891 9354 12576 3979 -10239 -12869 -10342 -1666
7339 -1666 -974 -3266 -11341 -16870 -12952 -7960 -15026 -23429 -16176 -15586 -5707 3391 -2444 -15509 -11052
$$ packed form
7440c0402K950l546m715N976J8096J6154J0208m119j2978j580n55q84L424P295
7426E324k116j0854N775j4493r23M91J3825m871l153q367P232K442M595R462m573
7411b04j6990q649J4413M314L425j0905l835l654j20p0K4175J7513l571j0628
7397E214j2404r334J177L878O523j9551m557P630J380N023k367M27M022R236R19
7382b784k503l645J493j0689o663j714J3028J7741k965j9841j7991O669K0171
7369i693L668k640J5183L007p543k49m72j7107N097J1831L990p603q895p666n697
7354b4789M52M134J8250O985n85J501l880J823N463L222q597j4218k630K527Q676
7339a666O92k292q075n529L918M992p066q403P253N90R879R098n835j3065M457
$$ plain form
7324 -11052 2325 591 -9837 -2143 5417 14938 31476 23312 5333 5968 9687 2449 -11607 -13331
7310 -13331 -9339 -21185 -27881 -23749 -17164 -11297 -16799 -1553 -3654 -12531 -24376 -19819 -11557 -6790
7296 -6790 -13190 697 3290 -1913 2549 -14117 -27029 -23803 -17225 -14016 -18386 -22484 -20873 -14942
7282 -14942 -15554 -7365 -8841 -7032 -8059 -17452 -12864 -20194 -29783 -30044 -20746 -18717 -28885 -30844 -22677
7267 -22677 -3556 3643 -4187 -137 -284 -5187 -11988 -7884 -3898 5640 20822 17521 -1795 -19321
7253 -19321 -9214 -12447 -7912 -9678 -15875 -13347 -9561 -11976 -15990 -29654 -26356 -13709 -17283 -16936
$$ packed form
7324a1052J3377j734j0428P694P560R521J6538q164j7979O35L719p238j4056j724
7310a3331L992j1846o696M132O585N867n502J5246k101q877j1845M557Q262M767
7296f790o400J3887K593n203M462j6666j2912L226O578L209m370m098J611N931
7282a4942o12Q189j476J809j027r393M588p330r589k61R298K029j0168j959Q167
7267b2677J9121P199p830M050j47m903o801M104L986R538J5182l301j9316j7526
7253a9321J0107l233M535j766o197K528L786k415m014j3664L298J2647l574L47
$$ [...]
##END NTUPLES=NMR SPECTRUM
##END=
