##TITLE=Analysis number 321259
Compound Code spb 08402
Project Code adrs
Chemist Name prosynth
##JCAMPDX= 6.0         $$ Bruker NMR JCAMP-DX V2.0
##DATA TYPE= NMR SPECTRUM
##DATA CLASS= NTUPLES
##ORIGIN= Bruker BioSpin GmbH
##OWNER= nmr
$$ XWIN-NMR		Version 3.5
$$ Tue Aug  1 13:43:23 2006 GMT Daylight Time (UT+1h)  MAYBRIDGE\nmr@NMR_250MHZ
##.OBSERVE FREQUENCY= 250.131544655141
##.OBSERVE NUCLEUS= ^1H
##.ACQUISITION MODE= SIMULTANEOUS (DQD)
##.ACQUISITION SCHEME= undefined
##.AVERAGES= 16
##.DIGITISER RES= 18
##SPECTROMETER/DATA SYSTEM= dpx250
##.PULSE SEQUENCE= zg30
##.SOLVENT NAME= DMSO
##.SHIFT REFERENCE= (INTERNAL, DMSO, 0, 16.522)
##AUDIT TRAIL= $$ (NUMBER, WHEN, WHO, WHERE, WHAT)
$$ ##TITLE= Audit trail, XWIN-NMR		Version 3.5
$$ ##JCAMPDX= 5.01
$$ ##ORIGIN= Bruker BioSpin GmbH
$$ ##OWNER= nmr
$$ C:\u/data/dgb/nmr/ADRS/50/pdata/1/auditp.txt
$$ ##AUDIT TRAIL=  $$ (NUMBER, WHEN, WHO, WHERE, WHAT)
(   1,<2006-08-01 13:42:41.09 +100>,<MAYBRIDGE\nmr>,<NMR_250MHZ>,
      <created by zg, POWCHK disabled, PULCHK disabled
       configuration hash MD5:
       E2 DF 36 D8 04 B2 41 60 5A D7 A3 38 5A 4B D0 FE
       data hash MD5: 64K
       CA 87 5C FE 72 1F D7 51 91 A7 58 4B 2F 24 32 5E>)
(   2,<2006-08-01 13:43:07.47 +100>,<MAYBRIDGE\nmr>,<NMR_250MHZ>,
      <Start of raw data processing
       ef LB = 0.3 FT_mod = 6 PKNL = 1 SI = 32K 
       data hash MD5: 32K
       38 8C 84 3C A9 3D 27 AB 9B C2 AA BA 27 F1 58 F9>)
(   3,<2006-08-01 13:43:11.56 +100>,<MAYBRIDGE\nmr>,<NMR_250MHZ>,
      <apk 
       data hash MD5: 32K
       08 1E 52 63 CC B2 5D 72 7B 3D 05 CC AC 8E BA C4>)
(   4,<2006-08-01 13:43:12.67 +100>,<MAYBRIDGE\nmr>,<NMR_250MHZ>,
      <abs ABSG = 5 
       data hash MD5: 32K
       A2 71 11 E4 72 1F FE 9D B0 46 5F 9D FB 79 6B A0>)
$$ ##END=
$$ 
$$ hash MD5
$$ B2 F5 3E BA ED A7 2D F8 27 62 EE 49 2E 28 35 25
##$RELAX= 
##$RELAX= 
##$RELAX= 
##$RELAX= 
##$RELAX= 
##$RELAX= 
##$RELAX= 
$$ Bruker specific parameters
$$ --------------------------
##$DU= <C:\u>
##$EXPNO= 50
##$NAME= <ADRS>
##$PROCNO= 1
##$TYPE= <nmr>
##$USER= <dgb>
##$AMP= (0..31)
100 100 100 100 100 100 100 100 100 100 100 100 100 100 100 100 100 100 
100 100 100 100 100 100 100 100 100 100 100 100 100 100 
##$AQSEQ= 0
##$AQ_mod= 3
##$AUNM= <au_zg>
##$AUTOPOS= <51 >
##$BF1= 250.13
##$BF2= 250.13
##$BF3= 250.13
##$BF4= 250.13
##$BF5= 500.13
##$BF6= 500.13
##$BF7= 500.13
##$BF8= 500.13
##$BYTORDA= 1
##$CFDGTYP= 0
##$CFRGTYP= 5
##$CHEMSTR= <none>
##$CNST= (0..31)
1 1 145 1 1 1 1 1 1 1 1 1 1 1 1 1 1 1 1 1 1 1 1 1 1 1 1 1 1 1 1 1 
##$CPDPRG= <>
##$CPDPRG1= <>
##$CPDPRG2= <>
##$CPDPRG3= <>
##$CPDPRG4= <mlev>
##$CPDPRG5= <mlev>
##$CPDPRG6= <mlev>
##$CPDPRG7= <mlev>
##$CPDPRG8= <mlev>
##$CPDPRGB= <>
##$CPDPRGT= <>
##$D= (0..31)
0 1 0 0 0 0 0 0 0 0.06 0 0 0 0 0 0 0.0002 0 0 0 0 0 0 0 0 0 0 0 0 0 0 
0 
##$DATE= 1154436159
##$DBL= (0..7)
120 120 120 120 120 120 120 120 
##$DBP= (0..7)
150 150 150 150 150 150 150 150 
##$DBP07= 0
##$DBPNAM0= <>
##$DBPNAM1= <>
##$DBPNAM2= <>
##$DBPNAM3= <>
$$ [...]
##$SUBNAM7= <"">
##$SUBNAM8= <"">
##$SUBNAM9= <"">
##$SW= 20.6930455092707
##$SWIBOX= (0..15)
0 0 3 0 0 0 0 0 0 0 0 0 0 0 0 0 
##$SW_h= 5175.983436853
##$TD= 65536
##$TD0= 1
##$TE= 295.16
##$TE2= 300
##$TE3= 300
##$TEG= 300
##$TL= (0..7)
0 120 120 120 120 120 120 120 
##$TP= (0..7)
150 150 150 150 150 150 150 150 
##$TP07= 0
##$TPNAME0= <>
##$TPNAME1= <>
##$TPNAME2= <>
##$TPNAME3= <>
##$TPNAME4= <>
##$TPNAME5= <>
##$TPNAME6= <>
##$TPNAME7= <>
##$TPOAL= (0..7)
0.5 0.5 0.5 0.5 0.5 0.5 0.5 0.5 
##$TPOFFS= (0..7)
0 0 0 0 0 0 0 0 
##$TUNHIN= 0
##$TUNHOUT= 0
##$TUNXOUT= 0
##$USERA1= <user>
##$USERA2= <user>
##$USERA3= <user>
##$USERA4= <user>
##$USERA5= <user>
##$V9= 5
##$VALIST= <valist>
##$VCLIST= <CCCCCCCCCCCCCCC>
##$VD= 0
##$VDLIST= <DDDDDDDDDDDDDDD>
##$VPLIST= <PPPPPPPPPPPPPPP>
##$VTLIST= <TTTTTTTTTTTTTTT>
##$WBST= 1024
##$WBSW= 4
##$XGAIN= (0..3)
0 0 0 0 
##$XL= 0
##$YL= 0
##$YMAX_a= 360639
##$YMIN_a= -288073
##$ZGOPTNS= <>
##$ZL1= 120
##$ZL2= 120
##$ZL3= 120
##$ZL4= 120
##$ABSF1= 16.522
##$ABSF2= -4.171173
##$ABSG= 5
##$ABSL= 3
##$ALPHA= 0
##$AQORDER= 0
##$ASSFAC= 0
##$ASSFACI= 0
##$ASSFACX= 0
##$ASSWID= 0
##$AUNMP= <proc_1d>
##$AZFE= 0.1
##$AZFW= 0.1
##$BCFW= 0
##$BC_mod= 0
##$BYTORDP= 0
##$COROFFS= 0
##$CY= 12.5
##$DATMOD= 1
##$DC= 0
##$DFILT= <>
##$DTYPP= 0
##$F1P= 14.0000005364418
##$F2P= -0.99999901652339
##$FCOR= 0.5
##$FTSIZE= 32768
##$FT_mod= 6
##$GAMMA= 0
##$GB= 0
##$INTBC= 1
##$INTSCL= 1
##$ISEN= 128
##$LB= 0.3
##$LEV0= 0
##$LPBIN= 0
##$MAXI= 10000
##$MC2= 0
##$MEAN= 0
##$ME_mod= 0
##$MI= 0
##$NCOEF= 0
##$NC_proc= -4
##$NLEV= 6
##$NOISF1= 0
##$NOISF2= 0
##$NSP= 0
##$NTH_PI= 0
##$NZP= 0
##$OFFSET= 16.522
##$PC= 1
##$PHC0= 133.5429
##$PHC1= 4.795394
##$PH_mod= 1
##$PKNL= yes
##$PPARMOD= 0
##$PSCAL= 4
##$PSIGN= 0
##$REVERSE= no
##$SF= 250.13
##$SI= 32768
##$SIGF1= 0
##$SIGF2= 0
##$SINO= 400
##$SIOLD= 32768
##$SREGLST= <1H.DMSO>
##$SSB= 0
##$STSI= 32768
##$STSR= 0
##$SW_p= 5175.98343685301
##$SYMM= 0
##$S_DEV= 0
##$TDeff= 65536
##$TDoff= 0
##$TI= <Analysis number 999999
Compound Code 99
Book Reference 9
Project Code 9>
##$TILT= no
##$TM1= 0
##$TM2= 0
##$TOPLEV= 0
##$USERP1= <user>
##$USERP2= <user>
##$USERP3= <user>
##$USERP4= <user>
##$USERP5= <user>
##$WDW= 1
##$XDIM= 32768
##$YMAX_p= 604483126
##$YMIN_p= -265146
$$ End of Bruker specific parameters
$$ ---------------------------------
##NTUPLES= NMR SPECTRUM
##VAR_NAME=  FREQUENCY,     SPECTRUM/REAL,   SPECTRUM/IMAG
##SYMBOL=    X,             R,               I
##VAR_TYPE=  INDEPENDENT,   DEPENDENT,       DEPENDENT
##VAR_FORM=  AFFN,          ASDF,            ASDF
##VAR_DIM=   32768,         32768,           32768
##UNITS=     HZ,            ARBITRARY UNITS, ARBITRARY UNITS
##FACTOR=    0.157963299565203, 1,           1
##FIRST=     4132.6476996994, 0,             0
##LAST=      -1043.33573715361, 0,           0
##MIN=       -1043.33573715361, -265146,     0
##MAX=       4132.6476996994, 604483126,     0
$$ Real data points
##PAGE= N=1
##DATA TABLE= (X++(R..R)), XYDATA
$$ [...]
$$ plain form
14319 -34644 -38693 -57809 -63475 -18974 21058 5851 -51916 -62471 -13753 -13276 26484 17142 -152
14306 -152 3761 -46974 -79210 -11722 -14744 -37141 -49129 -13684 2483 -3217 -31229 -40635 -23307
14293 -23307 3075 -4797 -42623 -43916 -82573 -119427 -60573 5442 -11748 -22028 -22390 -39535
14281 -39535 -87631 -114957 -140105 -128633 -85972 -27075 -21424 -75100 -119764 -77554 -32810 32191
14269 32191 57233 70120 123246 128011 83862 79680 82830 4803 -35238 -112002 -156499 -98704
14257 -98704 -60166 -20995 13576 11336 -12084 1467 -31565 -81824 -87903 -96040 -46002 -54832
14245 -54832 -85578 -136553 -156554 -116181 -131156 -55251 79360 38814 -31456 -47401 -15613
14234 -15613 27253 69416 80419 92364 95360 85837 37415 -37211 -98828 -123122 -100761 -34586
$$ packed form
14319c4644m049j9116n666M4501M0032j5207n7767j0555M8718M77L9760r342j7294
14306a52L913n0735l2236O7488l022k2397j1988L5445J6167n700k8012r406J7328
14293b3307K6382p872l7826j293l8657l6854N8854O6015j7190j0280l62j7145
14281c9535m8096k7326k5148J1472M2661N8897N651n3676m4664M2210M4744O5001
14269C2191K5042J2887N3126M765m4149m182L150p8027m0041p6764m4497N7795
14257i8704L8538L9171L4571k240k3420J3551l3032n0259o079q137N0038q830
14245e4832l0746n0975k0001M0373j4975P5905J34611m0546p0270j5945L1788
14234a5613M2866M2163J1003J1945K996r523m8422p4626o1617k4294K2361O6175
$$ plain form
14222 -34586 -15858 -34341 -82693 -58134 -89596 -93487 -53991 -20722 3954 -48622 -55663 -90803
14210 -90803 -124355 -140826 -134354 -137209 -121534 -44875 -69919 -4633 23076 75253 33287 6095
14198 6095 14205 -10939 -33412 -37212 -65344 -25836 8107 19747 -9091 -35681 -94060 -114577
14186 -114577 -103398 -47314 -51340 -31111 -46267 -21738 -23495 -26065 -26514 -24135 -24267 -16094 -3977
14173 -3977 -32340 -61883 -12412 59884 91722 97220 83071 41461 45191 13313 2695 17297
14161 17297 -56411 -125055 -99552 -60292 -43766 -84737 -66943 -34866 -66850 -7417 15341 -17309
14149 -17309 -38579 -54030 -60782 -71991 -70815 -21478 -14719 -11767 -45457 -68654 -77303 -78779 -59252
14136 -59252 -41053 -50176 -31151 -39454 4538 13656 -3959 9161 1593 -42229 -14756 33256
$$ packed form
14222c4586J8728j8483m8352K4559l1462l891L9496L3269K4676n2576p041l5140
14210i0803l3552j6471O472k855J5675P6659k5044O5286K7709N2177m1966k7192
14198F095Q110k5144k2473l800k8132L9508L3943J1640k8838k6590n8379k0517
14186a14577J1179N6084m026K0229j5156K4529j757k570m49K379j32Q173J2117
14173c977k8363k9543M9471P2296L1838N498j4149m1610L730l1878j0618J4602
14161A7297p3708o8644K5503L9260J6526m0971J7794L2077l1984N9433K2758l2650
14149a7309k1270j5451o752j1209J176M9337O759K952l3690k3197q649j476J9527
14136e9252J8199r123J9025q303M3992R118j7615J3120p568m3822K7473M8012
$$ plain form
14124 33256 -37485 -8233 36769 22205 1719 70409 103370 94804 81607 48354 13173 -521
14112 -521 -11259 -59042 -68153 -56875 -68766 -79688 -77727 -93068 -124004 -130095 -118554 -64187 -23016
14099 -23016 -13814 -14375 -21454 -37098 -105859 -134370 -119488 -76568 -128921 -162485 -129322 -82304
14087 -82304 -58132 -65375 -58537 -58554 -23574 2918 18939 20919 9192 -34047 1105 23197 35160
14074 35160 14090 -13142 25673 73001 59291 5444 -25278 -41093 -14988 -24249 -37375 -31031
14062 -31031 7686 -29415 -50985 -68571 -35529 -63903 -62294 -53685 -57677 -36190 -72660 -79243
14050 -79243 -14130 -34965 -98229 -125439 -42709 12487 53836 69586 82368 94648 35446 62230
14038 62230 56156 33932 -28694 -37445 57493 53192 45156 74045 50645 63250 63015 26030 -27015
$$ packed form
14124C3256p0741K9252M5002j4564k0486O8690L2961q566j3197l3253l5181j3694
14112e21j0738m7783r111J1278j1891j0922J961j5341l0936o091J1541N4367M1171
14099b3016R202n61p079j5644o8761k8511J4882M2920n2353l3564L3163M7018
14087h2304K4172p243O838j7L4980K6492J6021J980j1727m3239L5152K2092J1963
14074C5160k1070k7232L8815M7328j3710n3847l0722j5815K6105r261j3126O344
14062c1031L8717l7101k1570j7586L3042k8374J609Q609l992K1487l6470o583
14050g9243O5113k0835o3264k7210Q2730N5196M1349J5750J2782J2280n9202K6784
14038F2230o074k2224o2626q751R4938m301q036K8889k3400J2605k35l6985n3045
$$ plain form
14025 -27015 -82118 -116738 -96053 -72212 -43880 -43467 -18981 10150 29293 27644 20223 18146 45400
14012 45400 -12275 -22203 12496 62129 91779 76420 -9651 -63321 -65439 -47785 -8510 -33046
14000 -33046 -115176 -101547 -90500 -73567 -51768 -13783 7726 -11441 -79858 -96186 -71682 -59892
13988 -59892 -48695 -30803 10153 -961 -42942 -63481 -80863 -116422 -83484 23149 26984 -1999
13976 -1999 38503 65298 -34135 -97884 -89088 -26972 -13979 -34290 -43181 -73810 -72725 -18596
13964 -18596 -27870 -34997 -89215 -84312 -76261 -77937 -74733 -62311 -64593 -89700 -143884 -201691 -181879
13951 -181879 -138622 -89452 -99258 -91555 -93449 -72162 -52030 -35267 23951 30522 -9713 -21998
13939 -21998 14909 -20080 -15126 -856 30563 19330 3157 2779 -25244 -19741 -20652 1162 2041
$$ packed form
14025b7015n5103l4620K0685K3841K8332M13K4486K9131J9143j649p421k077K7254
14012D5400n7675r928L4699M9633K9650j5359q6071n3670k118J7654L9275k4536
14000c3046q2130J3629J1047J6933K1799L7985K1509j9167o8417j6328K4504J1790
13988e9892J1197J7892M0956j1114m1981k0539j7382l5559L2938J06633L835k8983
13976a999M0502K6795r9433o3749Q796O2116J2993k0311q891l0629J085N4129
13964a8596r274p127n4218M903Q051j676L204J2422k282k5107n4184n7807J9812
13951a81879M3257M9170r806P703j894K1287K0132J6763N9218O571m0235j2285
13939b1998L6907l4989M954J4270L1419j1233j6173l78k8023N503r11K1814Q79
$$ plain form
13926 2041 5980 18692 18423 14747 38895 40783 84636 42129 -57816 -102699 -61925 -48028 -88564
13913 -88564 -54071 -71816 -68606 -64470 -68978 -20087 19846 -5539 -50972 -34650 14406 54745
13901 54745 76495 27401 -338 -32285 -22399 -36288 6158 3415 -18983 -41941 -26368 4232
13889 4232 2325 -34076 -64481 -28468 -4758 8272 51875 40910 516 43590 45935 -16921
13877 -16921 20827 21914 -19923 -112675 -115888 -72410 -79340 -61430 -83129 -66594 -44815 4686
13865 4686 28442 32221 39008 18121 -12671 -16321 -32777 -85223 -66337 -24134 1524 50921
13853 50921 93495 93405 35402 42504 64270 40166 28731 -29365 -76316 -73376 -79783 -61255 -12878
13840 -12878 -9791 -44988 -88472 -87387 -75132 25134 32367 -7861 -21913 -38761 3170 20134
$$ packed form
13926B041L939J2712k69l676K4148J888M3853m2507r9945m4883M0774J3897m0536
13913h8564L4493j7745L210M136m508M8891L9933k5385m5433J6322M9056M0339
13901E4745K1750m9094k7739l1947R886j3889M2446k743k2398k2958J5573L0600
13889D232j907l6401l0405L6013K3710J3030M3603j0965m0394M3074K345o2856
13877a6921L7748J087m1837r2752l213M3478o930J7910k1699J6535K1779M9501
13865D686K3756L779O787k0887l0792l650j6456n2446J8886M2203K5658M9397
13853E0921M2574r0n8003P102K1766k4104j1435n8096m6951K940o407J8528M8377
13840a2878L087l5197m3484J085J2255J00266P233m0228j4052j6848M1931J6964
$$ plain form
13828 20134 59479 55998 14375 -29173 -56101 -61470 -84172 -74233 -83036 -73430 -100433 -106095 -66515
13815 -66515 -33063 35179 6114 -43013 -26041 15516 39370 2598 -4969 -45139 -55956 -22901
13803 -22901 -63926 -34438 -18782 -16191 -42882 -106433 -151006 -123496 -10456 -9839 -50294 -60366
13791 -60366 -64862 -54070 -40899 -25814 2142 -22142 -34437 6863 -21678 -55193 -90840 -87574
13779 -87574 6377 77717 21558 -39353 -116337 -119959 -93578 -54388 -45387 -2022 35870 34455
13767 34455 12198 -28251 -865 5943 -62959 -84102 -62357 -50329 -42752 -63533 -92356 -100739
13755 -100739 -70987 -90313 -71304 -37558 -58585 -73881 -38862 -28534 -19136 -10531 31009 113313
13743 113313 78655 34753 8878 -23136 -11446 -57434 -111135 -113974 -55690 3723 -48123 -29119
$$ packed form
13828B0134L9345l481m1623m3548k6928n369k2702R939q803R606k7003n662L9580
13815f6515L3452O8242k9065m9127J6972M1557K3854l6772p567m0170j0817L3055
13803b2901m1025K9488J5656K591k6691o3551m4573K7510J13040O17m0455j0072
13791f0366m496J0792J3171J5085K7956k4284j2295M1300k8541l3515l5647L266
13779h7574R3951P1340n6159o0911p6984l622K6381L9190R001M3365L7892j415
13767C4455k2257m0449K7386O808o8902k1143K1745J2028P577k0781k8823q383
13755a00739K9752j9326J9009L3746k1027j5296L5019J0328R398Q605M1540Q2304
13743A13313l4658m3902k5875l2014J1690m5988n3701k839N8284N9413n1846J9004
$$ plain form
13731 -29119 -7790 -51765 -54798 -58768 -56877 8436 -31159 -73770 -15621 -26592 -38216 -4820
13719 -4820 -9325 20770 47780 16026 -47985 -64454 -72018 -89233 -65155 -65200 -52147 -32545 -23040
13706 -23040 3853 -20538 13764 51933 89460 49444 48058 28494 21678 46521 -56873 -51102
13694 -51102 -31094 18741 58448 94783 -9607 7389 47560 8971 18609 46426 -8000 -86868
13682 -86868 -59992 15691 726 -87887 -126653 -81530 -82587 -43211 -33942 -75047 -61783 -86477
13670 -86477 -88321 -73658 -69222 -79299 -89936 -76254 -24527 47712 19538 -49799 -109904 -62695
13658 -62695 -39913 -55321 -69047 -58748 -44160 -14794 -48831 -52267 -61968 -28220 -4330 -24730
13646 -24730 -48493 -12700 -5895 -31674 -9569 62772 80021 22100 7845 9527 77271 85085
$$ packed form
13731b9119K1329m3975l033l970J891O5313l9595m2611N8149j0971j1624L3396
13719d820m505L0095K7010l1754o4011j6469p564j7215K4078m5J3053J9602R505
13706b3040K6893k4391L4302L8169L7527m0016j386j9564o816K4843j03394N771
13694e1102K0008M9835L9707L6335j04390J6996M0171l8589R638K7817n4426p8868
13682h6868K6876P5683j4965q8613l8766M5123j057L9376R269m1105J3264k4694
13670h6477j844J4663M436j0077j0637J3682N1727P2239k8174o9337o0105M7209
13658f2695K2782j5408j3726J0299J4588K9366l4037l436r701L3748K3890k0400
13646b4730k3763L5793O805k5779K2105P2341J7249n7921j4255J682O7744P814
$$ plain form
13634 85085 35039 -46502 -50803 11569 14313 -10578 51127 69438 41692 -11161 -60642 -62997
13622 -62997 -71872 -26729 12366 45228 14938 4101 -58626 -93557 -55292 -2225 -63802 -65711
13610 -65711 -63947 -74954 -59228 9731 -34205 -22113 -33557 -35418 -30408 -2362 -61264 -109555
13598 -109555 -130738 -123970 -162955 -158607 -85850 -91001 -68260 -73231 -81896 -77581 -80242 -45988 -98124
13585 -98124 -80025 28233 18800 997 8266 12945 -5240 -26863 -51038 -88851 -20019 -2391
13573 -2391 17458 -21270 -81643 -85025 -99061 -120981 -126415 -52445 15183 -43363 -97610 -68529
13561 -68529 -80420 -75359 -84796 -6608 30279 -2742 -42675 -41406 -4825 -13234 -31351 -56568
13549 -56568 -18710 -4556 3061 -11913 -33118 -49155 -32393 -11028 55491 126553 142378 99183
$$ packed form
13634H5085n0046q1541m301O2372K744k4891O1705J8311k7746n2853m9481k355
13622f2997q875M5143L9095L2862l0290j0837o2727l4931L8265N3067o1577j909
13610f5711J764j1007J5726O8959m3936J2092j1444j861N010K8046n8902m8291
13598a09555k1183O768l8985M348P2757n151K2741m971q665M315k661L4254n2136
13585i8124J8099J08258r433j7803P269M679j8185k1623k4175l7813O8832J7628
13573b391J9849l8728o0373l382j4036k1920n434P3970O7628n8546n4247K9081
13561f8529j1891N061r437P8188L6887l3021l9933J269L6581q409j8117k5217
13549e6568L7858J4154P617j4974k1205j6037J6762K1365O6519P1062J5825m3195
$$ plain form
13537 99183 43973 -6916 -798 20340 40828 69989 -625 26859 16688 -29210 -38201 -76365
13525 -76365 -136098 -101158 -101339 -86974 -46197 -12926 -2809 -39015 -124586 -122884 -43737 -51087
13513 -51087 -67601 -67462 -58239 -38103 -19608 46252 95921 87612 32058 15288 -5490 -55587
13501 -55587 -64412 8215 59308 41934 33910 -1686 -57799 -62881 -46441 -34811 19474 56836
13489 56836 24756 12435 17962 14988 1842 -68901 -70529 -53357 -74685 -80120 -64454 -50740
13477 -50740 -23724 -42904 -67464 -76528 -71291 -85531 -110263 -114507 -159128 -126936 -61359 -27733
13465 -27733 -49095 -55445 -55480 -49345 -11174 -69759 -141263 -65584 -15077 -60888 -81908 -47486 16041
13452 16041 11337 14669 42151 59571 78781 -40458 -74321 -46599 -99609 -91707 -51357 -95635
$$ packed form
13537I9183n5210n0889O118K1138K0488K9161p0614K7484j0171m5898q991l8164
13525g6365n9733L4940j81J4365M0777L3271J0117l6206q5571J702P9147p350
13513e1087j6514J39R223K0136J8495O5860M9669q309n5554j6770k0778n0097
13501e5587q825P2627N1093j7374q024l5596n6113n082J6440J1630N4285L7362
13489E6836l2080j2321N527k974j3146p0743j628J7172k1328n435J5666J3714
13477e0740K7016j9180k4560r064N237j4240k4732m244m4621L2192O5577L3626
13465b7733k1362o350l5O135L8171n8585p1504P5679N0507m5811k1020L4422O3527
13452A6041m704L332K7482J7420J9210j19239l3863K7722n3010P902M0350m4278
$$ plain form
13440 -95635 -148527 -97497 -66036 -43699 -7411 -8533 -32748 -70581 -32926 -17989 -86985 -149812
13428 -149812 -178713 -216976 -200968 -144052 -84361 -122128 -161209 -216914 -177501 -111750 -67443
13417 -67443 -3278 -24665 -102794 -114425 -103531 -65296 -7134 4378 37901 31285 15083 -856
13405 -856 31863 8471 -238 -29584 -60263 -117913 -101746 -91272 -123078 -88615 -50656 -91474
13393 -91474 -72705 -53065 -32800 -5807 -64568 -37885 -27305 -23697 -68342 -29163 -39466 -65117
13381 -65117 -40888 -40333 -87774 -68816 -65423 -39200 -49665 -40915 -39555 -47113 -52819 -53974 -56
13368 -56 12322 -14267 -42391 -35295 -36105 -50584 5499 25397 -17083 341 -8373 218 27522
13355 27522 43872 51114 37378 -29272 -49945 -50570 -67639 -87153 -49319 -68918 -64356 -13362
$$ packed form
13440i5635n2892N1030L1461K2337L6288j122k4215l7833L7655J4937o8996o2827
13428a49812k8901l8263J6008N6916N9691l7767l9081n5705L9413O5751M4307
13417f7443O4165k1387p8129j1631J0894L8235N8162J1512L3523o616j6202j5939
13405h56L2719k3392q709k9346l0679n7650J6167J0474l1806L4463L7959m0818
13393i1474J8769J9640K0265K6993n8761K6683J0580L608m4645L9179j0303k5651
13381f5117K4229N55m7441J8958L393K6223j0465Q750J360p558n706j155N3918
13368e6J2378k6589k8124P096q10j4479N6083J9898m2480J7424q714Q591K7304
13355B7522J6350P242j3736o6650k0673o25j7069j9514L7834j9599M562N0994
$$ plain form
13343 -13362 25704 27759 7419 -27507 6516 21395 8048 1346 22393 37218 15773 5161
13331 5161 16199 8682 53006 32810 -32132 -41559 -45342 -25666 -21694 6065 33785 14558 -32243
13318 -32243 -70627 -65734 -45713 8521 -54451 -66264 -48380 -46956 11428 14801 12598 -27785
13306 -27785 -54344 -12452 38093 34782 53280 -2355 -63181 -74746 -9653 37970 11054 40181
13294 40181 9922 2600 -67050 -45657 -9247 -21189 -5033 14842 32669 -1286 -25461 -60321
13282 -60321 -13730 -41198 -127872 -138194 -115495 -58072 9116 22155 -75153 -42147 -22738 -79559
13270 -79559 -66073 -55273 -47169 -86329 -105585 -74475 -23088 -14172 -32532 -61146 -54911 -62678
13258 -62678 -58995 31300 84056 91927 44160 14347 35039 17378 16630 45147 24103 -10687
$$ packed form
13343a3362L9066K055k0340l4926L4023J4879j3347o702K1047J4825k1445j0612
13331E161J1038p517M4324k0196o4942r427l783J9676L972K7759K7720j9227m6801
13318c2243l8384M893K0021N4234o2972j1813J7884J424N8384L373k203m0383
13306b7785k6559M1892N0545l311J8498n5635o0826j1565O5093M7623k6916K9127
13294D0181l0259p322o9650K1393L6410j1942J6156J9875J7827l3955k4175l4860
13282f0321M6591k7468q6674j0322K2699N7423O7188J3039r7308L3006J9409n6821
13270g9559J3486J0800Q104l9160j9256L1110N1387Q916j8360k8614O235p767
13258f2678L683R0295N2756P871m7767k9813K0692j7661p48K8517k1044l4790
$$ plain form
13246 -10687 -45777 -79396 -9329 17188 -6625 -78449 -125993 -94611 -87428 -83986 -98479 -129800
13234 -129800 -100004 -61945 -90857 -106091 -107112 -26927 14684 43980 36965 -31958 3158 -4142
13222 -4142 -11409 -33738 24932 1693 -27317 28291 -25846 -90095 -92510 -48930 -30086 -64332
13210 -64332 -66506 -23026 -7704 39331 -3055 12211 -7011 -60095 -40304 36853 7200 1559
13198 1559 35710 82934 76371 12205 -56750 -50624 -38674 -45796 -47397 -91295 -27018 3062 -19119
13185 -19119 43225 89858 61564 37385 23278 5332 -9656 24271 28826 -35177 -95217 -99682
13173 -99682 -48947 -58177 -74176 -69779 -98633 -128748 -124969 -105797 -52926 -2768 5118 -66093
13161 -66093 -58276 -53930 -7661 46877 50560 23278 15352 -41687 -4625 26721 14477 33233
$$ packed form
13246a0687l5090l3619P0067K6517k3813p1824m7544L1382P183L442j4493l1321
13234a29800K9796L8059k8912j5234j021Q0185M1611K9296p015o8923L5116p300
13222d142p267k2329N8670k3239k9010N5608n4137o4249k415M3580J8844l4246
13210f4332k174M3480J5322M7035m2386J5266j9222n3084J9791P7157k9653n641
13198A559L4151M7224o563o4166o8955O126J1950p122j601m3898O4277L0080k2181
13185a9119O2344M6633k8294k4179j4107j7946j4988L3927M555o4003o0040m465
13173i9682N0735r230j5999M397k8854l0115L779J9172N2871N0158P886p1211
13161f6093P817M346M6269N4538L683k7282p926n7039L7062L1346j2244J8756
$$ plain form
13149 33233 36680 -37297 -55806 -40730 -24488 -27571 -86052 -8611 34540 17094 -11807 -19773
13137 -19773 40179 48112 -18609 -96646 -70466 -45243 -19969 -9243 21916 10758 -11918 15760
13125 15760 27489 8621 -20865 -1604 56244 51594 -126 -31868 -77538 -144724 -103982 -33399
13113 -33399 -17432 6904 26332 98912 58587 30967 27203 -60148 -115368 -98702 -89184 -121746
13101 -121746 -177446 -197496 -189401 -150717 -133900 -93693 -53450 -54727 -79100 -73448 -96080 -113281
13089 -113281 -44888 135 -11705 -64391 -57740 -12648 31143 6463 -18423 -53202 -11225 -16170
13077 -16170 -3759 -22895 -65166 -76047 -34446 -38540 -11910 -20968 -44583 -13795 24072 5509
13065 5509 4196 -308 -34184 51644 40700 -10291 -39036 -3016 3031 -11691 -23160 -61241
$$ packed form
13149C3233L447p3977j8509J5076J6242l083n8481P7441M3151j7446k8901p966
13137a9773N9952P933o6721p8037K6180K5223K5274J0726L1159j1158k2676K7678
13125A5760J1729j8868k9486J9261N7848m650n1720l1742m5670o7186M0742P0583
13113c3399J5967K4336J9428P2580m0325k7620l764q7351n5220J6666R518l2562
13101a21746n5700k0050Q095L8684J6817M0207M0243j277k4373N652k2632j7201
13089a13281O8393M5023j1840n2686O651M5092M3791k4680k4886l4779M1977m945
13077a6170J2411j9136m2271j0881M1601m094K6630r058k3615L0788L7867j8563
13065E509j313m504l3876Q5828j0944n0991k8745L6020O047j4722j1469l8081
$$ plain form
13053 -61241 -39860 -47658 -83957 -80011 -85686 -73436 -65118 -49391 -29310 -34772 7589 -24618 -5480
13040 -5480 -6289 8744 11008 4082 23939 68591 60759 7404 43407 -14235 -89451 -123587 -117945
13027 -117945 -62061 -344 -22912 42322 148147 147302 133057 116328 64650 39650 68772 107950
13015 107950 65785 -4464 -1352 3009 23904 19176 -6810 -64758 -58610 -38848 -57272 23695
13003 23695 49955 23257 39550 51805 10775 -13956 34829 99241 87948 79066 9683 -63512
12991 -63512 -85226 -76352 -61338 -14483 29346 83117 71287 12403 22001 69482 42517 57577
12979 57577 80173 94088 62833 93555 150731 191928 149233 82345 479 -16933 41213 75691
12967 75691 55136 16143 -2492 15517 24963 34555 84250 110608 89821 94267 67225 25488
$$ packed form
13053f1241K1381p798l6299L946n675J2250Q318J5727K0081n462M2361l2207J9138
13040e480q09J5033K264o926J9857M4652p832n3355L6003n7642p5216l4136N642
13027a17945N5884O1717k2568O5234J05825q45j4245j6729n1678k5000K9122L9178
13015A07950m2165p0249L112M361K0895m728k5986n7948O148J9762j8424Q0967
13003B3695K6260k6698J6293J2255m1030k4731M8785O4412j1293q882o9383p3195
12991f3512k1714Q874J5014M6855M3829N3771j1830n8884R598M7481k6965J5060
12979E7577K2596J3915l1255L0722N7176M1197m2695o6888q1866j7412N8146L4478
12967G5691k0555l8993j8635J8009R446R592M9695K6358k0787M446k7042m1737
$$ plain form
12955 25488 -638 21103 24383 7847 -35995 -44521 7685 1803 -14389 -65512 -42451 -28512
12943 -28512 -38020 -43906 17165 8666 19140 52864 105160 82155 54182 39038 17221 19546
12931 19546 36743 31254 16937 -12579 -3487 49169 48452 14113 -9914 -64861 -83516 -52273
12919 -52273 -36382 -67518 -39850 -8249 -16108 -53373 -77023 -37043 78786 89274 57120 34565
12907 34565 57857 3209 -95050 -91352 -27803 -6442 -16279 -29681 -11593 -5262 -8088 12985
12895 12985 4514 71629 60424 -29482 -66595 -27951 13400 63830 -6157 -18640 33962 21979
12883 21979 -26602 -4844 -3585 -52317 -55759 -47091 -31560 -36401 1613 4736 -10740 -36417 -94910
12870 -94910 -22796 17480 38777 46307 -6445 -21965 -29225 -77215 -131874 -157321 -139079 -129860
$$ packed form
12955B5488k6126K1741L280j6536m3842q526N2206n882j6192n1123K3061J3939
12943b8512r508n886O1071q499J0474L3724N2296k3005k7973j5144k1817K325
12931A9546J7197n489j4317k9516R092N2656p17l4339k4027n4947j8655L1243
12919e2273J5891l1136K7668L1601p859l7265k3650L9980J15829J0488l2154k2555
12907C4565K3292n4648r8259L698O3549K1361r837j3402J8088O331k826K1073
12895A2985q471O7115j1205q9906l7113L8644M1351N0430o9987j2483N2602j1983
12883B1979m8581K1758J259m8732l442Q668J5531m841L8014L123j5476k5677n8493
12870i4910P2114M0276K1297P530n2752j5520p260m7990n4659k5447J8242R219
$$ plain form
12858 -129860 -76550 -50125 -82994 -45867 -29310 -26796 -55102 -51882 -31246 -10136 12076 -9762
12846 -9762 -23065 -10529 -10288 -17220 -17842 -27301 -59100 44682 59421 32576 -20154 -109193 -161805
12833 -161805 -116088 -83638 -86415 -40613 -8520 2103 33365 39894 -56715 -93301 -71064 -30069
12821 -30069 -32871 -14318 12504 -915 9966 -22765 -73601 3758 23436 -8027 -1915 23514
12809 23514 -10305 -69920 -112054 -134915 -69630 -40091 -85229 -93264 -71184 -10413 38773 -13027
12797 -13027 -56050 -96583 -138016 -160989 -120876 -90011 -51324 -19294 -33645 -15819 -10200 -20834
12785 -20834 -63276 -101231 -80715 -73131 -98243 -54219 -39421 -6192 -27659 -50657 16528 52834
12773 52834 60120 28255 -30237 -54480 -43068 -97821 -138750 -116236 -73794 -75907 -83148 -70978
$$ packed form
12858a29860N3310K6425l2869L7127J6557K514k8306L220K0636K1110K2212k1838
12846i762j3303J2536K41o932o22r459l1799J03782J4739k6845n2730q9039n2612
12833a61805M5717L2450k777M5802L2093J0623L1262O529r6609l6586K2237M0995
12821c0069k802J8553K6822j3419J0881l2731n0836P7359J9678l1463O112K5429
12809B3514l3819n9615m2134k2861O5285K9539m5138q035K2080O0771M9186n1800
12797a3027m3023m0533m1433k2973M0113L0865L8687L2030j4351J7826N619j0634
12785b0834m2442l7955K0516P584k5112M4024J4798L3229k1467k2998O7185L6306
12773E2834P286l1865n8492k4243J1412n4753m0929K2514M2442k113p241J2170
$$ plain form
12761 -70978 -25383 -8363 -48255 -70831 -12369 -23808 -46440 -60077 -76663 -109937 -91462 -75368
12749 -75368 -52990 -20264 563 12403 30467 64498 43812 -2612 -39141 -43870 -50005 -86990
12737 -86990 -63799 28890 53470 9698 -24373 -27133 11195 -6618 -41603 -46464 -77003 -82885
12725 -82885 -65962 -17780 -88877 -106683 -98480 -60119 0 21830 63424 129984 91396 87398
12713 87398 64925 33359 42915 40181 57573 73049 24220 -12712 27338 88842 112693 93178
12701 93178 -3264 2186 101764 132875 156479 174241 86854 34477 40966 113294 122488 74919
12689 74919 22499 47740 99012 72177 50021 21559 13683 29814 104675 108253 121257 129990
12677 129990 88591 38526 27063 43441 87030 51108 -25162 -20252 27016 73716 94548 88604
$$ packed form
12761g0978M5595J7020l9892k2576N8462j1439k2632j3637j6586l3274J8475J6094
12749g5368K2378L2726K0827J1840J8064L4031k0686m6424l6529m729o135l6985
12737h6990K3191R2689K4580m3772l4071k760L8328j7813l4985m861l0539n882
12725h2885J6923M8182p1097j7806Q203L8361O0119K1830M1594O6560l8588l998
12713H7398k2473l1566R556k734J7392J5476m8829l6932M0050O1504K3851j9515
12701I3178r6442N450R9578L1111K3604J7762q7387n2377O489P2328R194m7569
12689G4919n2420K5241N1272k6835k2156k8462p876J6131P4861L578J3004Q733
12677A29990m1399n0065j1463J6378M3589l5922p6270M910M7268M6700K0832n944
$$ plain form
12665 88604 -3638 -3589 68070 90083 56080 34014 81432 96764 66662 62212 69701 62975 25229
12652 25229 63250 75925 59741 54222 44072 39427 31441 -28939 -11464 42872 15482 18581
12640 18581 20014 45872 68326 83668 65417 20579 55277 125008 146637 119263 111404 89445
12628 89445 73696 45676 77354 52102 -2240 24278 54800 35880 -12825 -20387 -12414 -56155
12616 -56155 -77358 -38007 9394 -46792 -35219 -36186 -30775 -54427 -38650 14946 19532 10175 -13641
12603 -13641 18173 22252 -21097 -27234 -26576 1809 46195 75845 52065 26956 -30401 -54828
12591 -54828 -102072 -109828 -77276 -58173 -23449 54049 47131 25314 -21310 -10980 17714 9670
12579 9670 29898 56528 49316 76925 64571 50125 -9471 -37594 -37931 -17726 -6935 45758
$$ packed form
12665H8604r2242M9P1659K2013l4003k2066M7418J5332l0102m450P489o726l7746
12652B5229L8021J2675j6184n519j0150m645p986o0380J7475N4336k7390L099
12640A8581J433K5858K2454J5342j8251m4838L4698O9731K1629k7374p859k1959
12628H9445j5749k8020L1678k5252n4342K6518L0522j8920m8705p562P973m3741
12616e6155k1203L9351M7401n6186J1573r67N411k3652J5777N3596M586r357k3816
12603a3641L1814M079m3349o137O58K8385M4386K9650k3780k5109n7357k4427
12591e4828m7244p756L2552J9103L4724P7498o918k1817m6624J0330K8694q044
12579I670K0228K6630p212K7609j2354j4446n9596k8123l37K0205J0791N2693
$$ plain form
12567 45758 54679 19737 5392 19793 -16815 -14502 20294 53948 42597 -11741 21697 30402
12555 30402 23062 -10321 -13318 52698 141644 163628 148637 189415 195832 124598 61717 59312
12543 59312 57576 78019 117983 120854 112099 116120 107551 56160 -12477 -72404 -89135 -50589 -54836
12530 -54836 -18755 49040 20125 58666 71512 55838 37897 31941 9020 59840 50059 47144
12518 47144 53551 114739 131885 99226 66336 133225 159172 130836 91082 71585 91942 123634
12506 123634 188143 223612 203656 174732 127762 148871 123944 44507 -115 -11372 6030
12495 6030 16767 52563 34682 48130 45051 5385 3122 35967 46220 -4650 30509 13201
12483 13201 -2513 -11239 50442 91706 87474 80593 91478 133690 122084 108358 117995 114275 73915
$$ packed form
12567D5758Q921l4942j4345J4401l6608K313L4796L3654j1351n4338L3438Q705
12555C0402p340l3383k997O6016Q8946K1984j4991M0778O417p1234o2881k405
12543E9312j736K0443L9964K871q755M021q569n1391o8637n9927j6731L8546m247
12530e4836L6081O7795k8915L8541J2846j5674j7941n956k2921N0820r781k915
12518D7144O407O1188J7146l2659l2890O6889K5947k8336l9754j9497K0357L1692
12506A23634O4509L5469j9956k8924m6970K1109k4927p9437m4622j1257J7402
12495F030J0737L5796j7881J3448l079l9666k263L2845J0253n0870L5159j7308
12483A3201j5714q726O1681M1264m232o881J0885M2212j1606j3726R637l720m0360
$$ plain form
12470 73915 52391 104784 143659 98809 42977 32583 28090 70350 37709 12473 228 -35180
12458 -35180 -38340 14066 55251 91343 81172 109370 143469 210081 175454 192009 192146 105932
12446 105932 133011 161270 116199 68544 49287 66113 77706 83240 83328 86538 106267 117211
12434 117211 111270 80683 34818 23531 24472 53093 9106 11581 23064 84503 115130 100094
12422 100094 76061 41039 52870 12608 27725 17452 -16409 -73552 -47212 10770 21877
12411 21877 -17325 -17497 -6118 -8677 -30326 12681 119917 129848 86625 66358 29491 -10773
12399 -10773 14591 17349 -2808 -2340 28548 52315 18804 54917 901 -36635 -56129 -2933
12387 -2933 24359 -3924 -23135 -54995 -62533 -38737 -46532 -36076 -25249 -10074 48493 103876
$$ packed form
12470G3915k1524N2393L8875m4850n5832j0394m493M2260l2641k5236j2245l5408
12458c5180l160N2406M1185L6092j0171K8198L4099O6612l4627J6555J37q6214
12446A05932K7079K8259m5071m7655j9257J6826J1593N534Q8L210J9729J0944
12434A17211n941l0587m5865j1287R41K8621m3987K475J1483O1439L0627j5036
12422A00094k4033l5022J1831m0262J5117j0273l3861n7143K6340N7982J1107
12411B1877l9202j72J1379k559k1649M3007J07236R931m3223k0267l6867m0264
12399a0773K5364K758k0157M68L0888K3767l3511L6113n4016l7536j9494N3196
12387b933K7292k8283j9211l1860p538K3796p795J0456J0827J5175N8567N5383
$$ plain form
12375 103876 79140 32587 -27472 -64491 -45967 -39758 -91364 -136044 -94711 -68515 -17576 28071
12363 28071 44630 -45203 -119651 -70332 -62403 -50633 -28646 37031 61282 40597 -4137 24502
12351 24502 -40030 -96121 -115714 -58104 63215 65805 72890 47046 24926 35942 89296 83152
12339 83152 81863 -737 -41179 -32965 -13192 10209 55480 -5624 -27690 -9026 9655 -14193
12327 -14193 24990 57749 22852 -24103 -9359 -17685 -20746 -66744 -1375 29109 -14294 -11834
12315 -11834 33689 38643 -3523 -34145 -42546 -44512 19518 17390 -21846 -52830 -49441 -48690 -63719
12302 -63719 -23086 -45426 -4734 7709 -1977 -43674 -53147 -38648 -18691 -31724 -123511 -150588
12290 -150588 -126084 -50633 22224 45946 -53002 -53299 33223 -16898 -15308 -4374 -45080 -51600
$$ packed form
12375A03876k4736m6553o0059l7019J8524O209n1606m4680M1333K6196N0939M5647
12363B8071J6559q9833p4448M9319P929J1770K1987O5677K4251k0685m4734K8639
12351B4502o4532n6091j9593N7610J21319K590P085k5844k2120J1016N3354o144
12339H3152j289q2600m0442Q214J9773K3401M5271o1104k2066J8664J8681k3848
12327a4193L9183L2759l4897m6955J4744q326l061m5998O5369L0484m3403K460
12315a1834M5523M954m2166l0622q401j966O4030k128l9236l0984L389P51j5029
12302f3719M0633k2340M0692J2443r686m1697r473J4499J9957j3033r1787k7077
12290a50588K4504P5451P2857K3722r8948k97Q6522n0121J590J0934m0706o520
$$ plain form
12278 -51600 -18417 -34317 -61117 -11573 -3745 3833 -21284 -3170 -1719 -5955 57327 152447
12266 152447 69610 -24891 -31043 14914 92261 108604 55061 28833 85159 53924 27895 -9788
12254 -9788 -25071 -15042 -12932 -8597 4745 3586 41482 57467 55571 71564 115610 103705 121047
12241 121047 42151 -28985 -12067 3489 9356 7561 -9305 -1261 24123 14764 110610 169970
12229 169970 89330 24305 33063 58790 68729 66230 61587 72680 72048 84333 65602 50131 54571
12216 54571 84032 150436 156502 174713 128573 94654 137862 172330 136154 104674 158980 205683
12204 205683 217945 141256 98218 102408 76322 87170 52657 70286 38995 2172 73523 103267
12192 103267 112073 112140 170755 201801 192725 120080 72734 72256 108419 120652 83382 105476 164333
$$ packed form
12278e1600L3183j5900k6800M9544P828P578k5117J8114J451m236O3282R5120
12266A52447q2837r4501o152M5957P7347J6343n3543k6228N6326l1235k6029l7683
12254i788j5283J0029K110M335J3342j159L7896J5985j896J5993M4046j1905J7342
12241A21047p8896p1136J6918J5556N867j795j6866Q044K5384r359R5846N9360
12229A69970q0640o5025Q758K5727R939k499m643J1093o32J2285j8731j5471M440
12216E4571K9461O6404O066J8211m6140l3919M3208L4468l6176l1480N4306M6703
12204B05683J2262p6689m3038M190k6086J0848l4513J7629l1291l6823P1351K9744
12192A03267Q806O7N8615L1046r076p2645m7346m78L6163J2233l7270K2094N8857
$$ plain form
12179 164333 157750 175404 135470 107295 73236 126484 149537 149715 201283 251679 284382 241187
12167 241187 248406 195053 194203 242178 255659 209431 183198 202542 226394 272391 267085 263383
12155 263383 260073 258860 221259 140289 106081 149882 111073 196502 245237 222159 182117 190845
12143 190845 155052 112916 123272 78411 51946 148188 146845 146837 142119 35082 14890 -28657
12131 -28657 -16606 -16834 -2102 18756 -67925 -57462 58865 127309 97631 118874 126459 163302
12119 163302 142711 127702 111897 134666 152352 169355 158364 185709 165154 87101 11797
12108 11797 14559 55737 66798 57852 68376 100471 81195 21284 -1690 36916 21391 51121
12096 51121 83549 49530 30037 6760 5073 -6577 1489 41227 86335 135021 82755 59780
$$ packed form
12179A64333o583J7654l9934k8175l4059N3248K3053J78N1568N0396L2703m3195
12167B41187P219n3353q50M7975J3481m6228k6233J9344K3852M5997n306l702
12155B63383l310j213l7601q0970l4208M3801l8809Q5429M8735k3078m0042Q728
12143A90845l5793m2136J0356m4861k6465R6242j343qm718j07037k0192m3547
12131b8657J2051k28J4732K0858q6681J0463J16327O8444k9678K1243P585L6843
12119A63302k0591j5009j5805K2769J7686J7003j0991K7345k0555p8053p5304
12108A1797K762M1178J1061q946J0524L2095j9276n9911k2974L8606j5525K9730
12096E1121L2428l4019j9493k3277j687j1650Q066L9738M5108M8686n2266k2975
$$ plain form
12084 59780 31268 98778 111579 92664 119159 91305 -18376 -66132 -37938 42617 51754 59558
12072 59558 87229 107379 108948 58583 17961 36360 7035 -29196 -21632 -60 -10854 41040
12060 41040 95340 88460 73486 70763 82880 118063 94885 69373 95447 105362 48924 36291
12048 36291 79242 126771 37579 -3462 56837 59157 56078 44209 82795 86227 110289 176685
12036 176685 174571 196745 180709 237025 306236 365155 376475 352635 307733 273824 231527 192920
12024 192920 181186 193581 148637 83103 109247 153471 194498 255418 230099 186894 166796
12013 166796 139192 150426 118935 139814 185512 223495 229740 204381 243863 249754 252665 232743
12001 232743 249915 243049 244137 267963 263929 261532 296423 306590 320771 357823 363032 355652 348489
$$ packed form
12084E9780k8512O7510J2801j8915K6495k7854j09681m7756K8194Q0555R137P804
12072E9558K7671K0150J569n0365m0622J8399k9325l6231P564K1572j0794N1894
12060D1040N4300o880j4974k723J2117L5183k3178k5512K6074R915n6438j2633
12048C6291M2951M7529q9192m1041O0299K320l079j1869L8586L432K4062O6396
12036A76685k114K2174j6036N6316O9211N8919J1320k3840m4902l3909m2297l8607
12024A92920j1734J2395m4944o5534K6144M4224M1027O0920k5319m3205k0098
12013A66796k7604J1234l1491K0879M5698L7983O245k5359L9482N891K911j9922
12001B32743J7172o866J088K3826m034k397L4891J0167J4181L7052N209p380p163
$$ plain form
11988 348489 325677 316494 332541 420558 411060 331626 296666 324440 352299 365375 398058 435983
11976 435983 448166 379843 375495 370288 373342 438988 456323 400048 395591 458168 443971 447802
11964 447802 481820 544689 573956 585538 590733 620062 621875 605797 674364 721230 677290 682862
11952 682862 743752 815171 847321 832684 855191 946824 986394 982070 996484 1126951 1211534
11941 1211534 1268784 1360161 1413110 1472163 1588995 1740926 1786304 1882619 1972475 2156819 2366283
11930 2366283 2597147 2863793 3126813 3452506 3798594 4049546 4391984 4869210 5376231
11921 5376231 6021177 6689549 7532018 8602481 9902168 11563874 13629431 16285145 19794135
11912 19794135 24482119 30856298 39695733 51930247 68119989 87630250 107531374
$$ packed form
11988C48489k2812r183J6047Q8017r498p9434l4960K7774K7859J3076L2683L7925
11976D35983J2183o8323m348n207L054O5646J7335n6275m457O2577j4197L831
11964D47802L4018O2869K9267J1582N195K9329J813j6078O8567M6866m3940N572
11952F82862O0890P1419L2150j4637K2507R1633L9570m324J4414J30467Q4583
11941A211534N7250R1377N2949N9053J16832J51931M5378R6315Q9856J84344K09464
11930B366283K30864K66646K63020L25693L46088K50952L42438M77226N07021
11921E376231O44946O68372Q42469J070463J299687J661706K065557K655714L508990
11912A9794135M687984O374179Q839435J2234514J6189742J9510261J9901124
$$ plain form
11905 107531374 123772267 134633807 138923574 133599291 117939242 97026347 77467299
11898 77467299 62089748 50819292 42585844 36447792 31778252 28109972 25176012 22791005
11890 22791005 20787876 19095507 17673046 16451599 15372246 14475806 13685634 12955488
11882 12955488 12319106 11759752 11330604 10992338 10623060 10274667 9927927 9592410 9277868
11873 9277868 8943225 8698614 8446657 8212794 8019400 7773031 7546935 7273309 7025998
11864 7025998 6749847 6500472 6320143 6114012 5971299 5833116 5697721 5534844 5404336
11855 5404336 5232259 5115721 5005431 4828674 4727247 4666295 4566814 4471078 4376706 4244356
11845 4244356 4105860 3971537 3912724 3825975 3776271 3733470 3685333 3637782 3556084 3510932 3459146
$$ packed form
11905A07531374J6240893J0861540M289767n324283j5660049k0912895j9559048
11898G7467299j5377551j1270456q233448o138052m669540l668280k933960k385007
11890B2791005k003129j692369j422461j221447j079353q96440p90172p30146
11882A2955488o36382n59354m29148l38266l69278l48393l46740l35517l14542
11873I277868l34643k44611k51957k33863j93394k46369k26096k73626k47311
11864G025998k76151k49375j80329k06131j42713j38183j35395j62877j30508
11855E404336j72077j16538j10290j76757j01427o0952r9481r5736r4372j32350
11845D244356j38496j34323n8813q6749m9704m2801m8137m7551q1698m5152n1786
$$ plain form
11834 3459146 3448139 3477271 3464289 3477957 3465930 3588199 3725849 3796040 3934379 4141369
11824 4141369 4339664 4425168 4596796 4896468 5257054 5796516 6428740 7255306 8248407 9449002
11814 9449002 10888043 12449309 13969764 15221413 16104643 16539275 16400540 15779059 14763954
11805 14763954 13533759 12303845 11126619 10135537 9376635 8746049 8205859 7824658 7509291
11796 7509291 7327047 7245994 7214478 7275709 7389849 7566662 7822687 8158043 8577099 8965718
11786 8965718 9419835 9914853 10419599 10998527 11666950 12407531 13382561 14718616 16380524
11777 16380524 18280420 20449518 22802260 25132841 27235829 28987780 30249817 30825347
11769 30825347 30794406 30414610 29946140 29551623 29244541 28984223 28611241 28024704 27133186
$$ packed form
11834C459146j1007K9132j2982J3668j2027J22269J37650P0191J38339K06990
11824D141369J98295Q5504J71628K99672L60586N39462O32224Q26566R93101J200595
11814I449002J439041J561266J520455J251649Q83230M34632j38735o21481j015105
11805A4763954j230195j229914j177226r91082p58902o30586n40190l81201l15367
11796G509291j82244q1053l1516O1231J14140J76813K56025L35356M19056L88619
11786H965718M54117M95018N04746N78928O68423P40581R75030J336055J661908
11777A6380524J899896K169098K352742K330581K102988J751951J262037N75530
11769C0825347l0941l79796m68470l94517l07082k60318l72982n86537q91518
$$ plain form
11760 27133186 25949514 24584328 23285045 22244026 21604293 21423668 21572054 21901661 22293929
11751 22293929 22529674 22466000 22041164 21328245 20413260 19414838 18571078 18004936 17721973
11742 17721973 17681982 17899795 18371527 19054844 20015260 21178249 22353853 23495432 24582307
11733 24582307 25493439 26301117 27061654 27766616 28444773 29144931 29768498 30063909 30063463 29826620
11723 29826620 29356963 28800059 28394497 28451086 29143340 30353284 31889434 33465684 34809745
11714 34809745 35538222 35271618 34046625 31945269 29299904 26390489 23494936 20970632
11706 20970632 18903817 17308440 16009571 14987281 14149489 13395397 12780405 12235627 11861988
11697 11861988 11651655 11539075 11546843 11559691 11677298 11910899 12173158 12411625 12677785 12996487
$$ packed form
11760B7133186j183672j365186j299283j041019o39733j80625J48386L29607L92268
11751B2293929K35745o3674m24836p12919r14985r98422q43760n66142k82963
11742A7721973l9991K17813M71732O83317R60416J162989J175604J141579J086875
11733B4582307R11132Q07678P60537P04962O78157P00158O23567K95411m46k36843
11723B9826620m69657n56904m05562N6589O92254J209944J536150J576250J344061
11714C4809745P28477k66604j224993k101356k645365k909415k895553k524304
11706B0970632k066815j595377j298869j022290q37792p54092o14992n44778l73639
11697A1861988k10333j12580P768J2848J17607K33601K62259K38467K66160L18702
$$ plain form
11687 12996487 13214739 13482036 13951344 14559122 15433867 16623050 18012829 19411921 20642766
11678 20642766 21611435 22102481 21980317 21166073 19792148 18068660 16262522 14622339 13186351
11669 13186351 11896160 10831485 9930654 9148755 8416078 7833956 7372658 6997939 6632716
11660 6632716 6290765 5964675 5661821 5400327 5180747 4968397 4817947 4648107 4531136
11651 4531136 4446334 4280922 4090065 3980803 3902883 3776994 3708103 3638019 3574347 3469491
11641 3469491 3401929 3345035 3371795 3374578 3393820 3399032 3430360 3459014 3517587 3602851 3631233 3648020
11629 3648020 3598667 3480093 3300446 3141437 2965355 2805330 2716423 2597323 2474430 2365262
11619 2365262 2239767 2173402 2094040 2032412 2015925 1934838 1910019 1895908 1866063 1871857 1879710
$$ packed form
11687A2996487K18252K67297M69308O07778Q74745J189183J389779J399092J230845
11678B0642766R68669M91046j22164q14244j373925j723488j806138j640183j435988
11669A3186351j290191j064675r00831p81899p32677n82122m61298l74719l65223
11660F632716l41951l26090l02854k61494k19580k12350j50450j69840j16971
11651D531136q4802j65412j90857j09262p7920j25889o8891p0084o3672j04856
11641C469491o7562n6894K6760K783J9242N212L1328K8654N8573Q5264K8382J6787
11629C648020m9353j18574j79647j59009j76082j60025q8907j19100j22893j09168
11619B365262j25495o6365p9362o1628j6487q1087k4819j4111k9845N794P853
$$ plain form
11608 1879710 1848025 1820454 1777313 1724690 1749580 1758173 1722856 1721206 1717549 1698857 1815441 1889746
11596 1889746 1975140 2123029 2237114 2283468 2361616 2378803 2421078 2402269 2289289 2092382
11586 2092382 1950832 1866445 1732654 1579343 1519133 1464375 1366504 1315512 1204517 1190665
11576 1190665 1123677 1083621 1053406 1019399 973605 937789 905877 926960 927368 934522 926042 921862
11564 921862 906161 869862 866734 875289 938614 946664 919674 916218 974710 995653 1055025 1074317
11552 1074317 1140441 1130445 1080475 1076807 1005786 895239 828857 785265 724290 618423 584972
11541 584972 595780 580445 600602 596341 610000 590054 584647 599437 578609 532539 533615 556863
11529 556863 469347 429339 453041 424081 411548 365340 363083 412512 412419 405283 352223 366995
$$ packed form
11608A879710l1685k7571m3141n2623K4890Q593l5317j650l657j8692J16584P4305
11596A889746Q5394J47889J14085M6354P8148J7187M2275j8809j12980j96907
11586B092382j41550q4387j33791j53311o0210n4758r7871n0992j10995j3852
11576A190665o6988m0056l0215l4007m5794l5816l1912K1083M08P154q480m180
11564I21862j5701l6299l128Q555O3325Q050k6990l456N8492K0943N9372J9292
11552A074317O6124r996m9970l668p1021j10547o6382m3592o0975j05867l3451
11541E84972J0808j5335K0157m261J3659j9946n407J4790k0828m6070J076K3248
11529E56863q7516m0008K3702k8960j2533m6208k257M9429r3p136n3060J4772
$$ plain form
11517 366995 379187 363168 342748 375305 362410 324514 308826 327840 327935 368214 405210 446423
11505 446423 448906 394717 350588 296434 260188 237599 214164 178264 259605 260139 226076 224024
11493 224024 268589 263939 188066 170664 168024 196639 231952 254098 227374 208064 169577 226888
11481 226888 261940 284391 232627 199690 197067 171469 209677 258728 246173 215190 219726 188080
11469 188080 166478 143002 197584 164046 140527 160030 122329 36728 20595 82589 137447
11458 137447 158886 151312 98568 145263 183698 230418 254607 208713 156414 137663 150352 136676
11446 136676 128753 84188 100755 167058 207278 234962 203362 148957 144282 160699 143847 111183
11434 111183 101261 80561 105211 83017 101584 138216 143893 113183 142527 131845 96290 87388
$$ packed form
11517C66995J2192j6019k0420L2557j2895l7896j5688J9014R5M0279L6996M1213
11505D46423K483n4189m4129n4154l6246k2589k3435l5900Q1341N34l4063k052
11493B24024M4565m650p5873j7402k640K8615L5313K2146k6724j9310l8487N7311
11481B26888L5052K2451n1764l2937k623k5598L8208M9051j2555l0983M536l1646
11469A88080k1602k3476N4582l3538k3519J9503l7701q5601j6133O1994N4858
11458A37447K1439p574n2744M6695L8435M6720K4189m5894n2299j8751J2689j3676
11446A36676p923m4565J6567O6303M0220K7684l1600n4405m675J6417j6852l2664
11434A11183r922k0700K4650k2194J8567L6632N677l0710K9344j0682l5555q902
$$ plain form
11422 87388 115962 115092 114526 49652 22972 17929 56096 27453 80060 60259 82018 92244 136693
11409 136693 134356 93103 104770 88291 50105 63607 93677 95843 129351 160878 85369 78056
11397 78056 76087 92496 67404 126614 127203 130072 142985 156538 172243 160252 149819 170034
11385 170034 165571 107545 106482 73758 90846 71470 75832 112651 105371 144608 145329 110792 154297
11372 154297 162565 117058 97591 172753 180017 144192 152047 154229 189587 175538 172686 182989
11360 182989 170285 159598 161857 144089 119112 105503 109425 89025 129644 157215 159352 120844
11348 120844 80269 96846 121407 100568 72445 10467 -22456 4360 69430 141495 121235
11337 121235 113234 133323 142328 207306 264240 224424 211974 273645 295613 268513 238848 238733
$$ packed form
11422H7388K8574q70n66o4874k6680n043L8167k8643N2607j9801K1759J0226M4449
11409A36693k337m1253J1667j6479l8186J3502L0070K166L3508L1527p5509p313
11397G8056j969J6409k5092N9210N89K869J2913J3553J5705j1991j0433K0215
11385A70034m463n8026j063l2724J7088j9376M362L6819p280L9237P21l4537M3505
11372A54297Q268m5507j9467P5162P264l5825P855K182L5358j4049k852J0303
11360A82989j2704j0687K259j7768k4977j3609L922k0400M0619K7571K137l8508
11348A20844m0575J6577K4561k0839k8123o1978l2923K6816O5070P2065k0260
11337A21235q001K0089R005O4978N6934l9816j2450O1671K1968k7100k9665j15
$$ plain form
11325 238733 256229 220040 226848 250296 214026 212141 223601 215758 239561 208253 185054 210713
11313 210713 215833 163440 163728 186882 160692 202150 216988 192747 165171 189742 154438 132658
11301 132658 93344 61286 161532 223202 212509 202520 226198 218436 243364 256431 227513 272727
11289 272727 284958 226943 211735 189935 179911 184078 261407 290579 288096 265596 233582 245568
11277 245568 270425 197020 192306 193894 229303 219110 158996 160887 183723 259406 344606 357475
11265 357475 338742 311068 245009 203380 191405 146629 90047 79557 72009 85017 103242 135003
11253 135003 123943 123728 66686 71108 146388 171748 123788 134576 196072 205367 187616 189873
11241 189873 196902 218472 197714 102932 32506 29092 104487 83015 68017 104531 122091 131019
$$ packed form
11325B38733J7496l6189O808K3448l6270j885J1460p843K3803l1308k3199K5659
11313B10713N120n2393K88K3154k6190M1458J4838k4241k7576K4571l5304k1780
11301A32658l9314l2058J00246O1670j0693r989K3678p762K4928J3067k8918M5214
11289B72727J2231n8015j5208k1800j0024M167P7329K9172k483k2500l2014J1986
11277B45568K4857p3405m714J588L5409j0193o0114J891K2836P5683Q5200J2869
11265C57475j8733k7674o6059m1629j1975m4776n6582j0490p548J3008J8225L1761
11253A35003j1060k15n7042M422P5280K5360m7960J0788O1496R295j7751K257
11241A89873P029K1570k0758r4782p0426l414P5395k1472j4998L6514J7560Q928
$$ plain form
11229 131019 119141 146746 151474 162586 118266 112883 101984 67363 59957 95369 113545 111032
11217 111032 60751 47811 73301 107057 112265 134706 148256 140946 146907 96313 124405 96236
11205 96236 64291 104735 138168 83111 100837 150570 176434 160113 138330 163042 179697 183842
11193 183842 149756 170720 213510 227940 217847 219145 202933 152351 145111 171362 161249 134322
11181 134322 130788 146829 183841 237576 267307 271529 300280 320705 277310 264412 279839 282105
11169 282105 327178 388261 449434 447312 417365 420405 400830 357871 378292 405546 362270 340335
11157 340335 298921 303226 327615 368663 432925 410752 384845 449242 417262 336208 347230 377013
11145 377013 287512 246320 240479 234231 223924 260910 280593 247787 237325 256396 332720 424255
$$ packed form
11229A31019j1878K7605M728J1112m4320n383j0899l4621p406L5412J8176k513
11217A11032n0281j2940K5490L3756N208K2441J3550p310N961n0594K8092k8169
11205I6236l1945M0444L3433n5057J7726M9733K5864j6321k1783K4712J6655M145
11193A83842l4086K0964M2790J4430j0093J298j6212n0582p240K6251j0113k6927
11181A34322l534J6041L7012N3735K9731M222K8751K0425m3395j2898J5427K266
11169B82105M5073O1083O1173k122k9947L040j9575m2959K0421K7254m3276k1935
11157C40335m1414M305K4389M1048O4262k2173k5907O4397l1980q1054J1022K9783
11145C77013q9501m1192n841o248j0307L6986J9683l2806j0462J9071P6324R1535
$$ plain form
11133 424255 404029 441355 545852 595095 624484 600973 638175 528069 431213 429114 437385
11122 437385 385457 418510 415146 407410 444095 465514 414656 388951 382610 405419 454641 501394
11110 501394 525212 494070 486199 474974 481712 476308 447552 442962 451287 381657 364897 323892
11098 323892 302972 277882 254820 207504 212997 256171 316200 329525 317610 316981 300204 282575
11086 282575 242178 214503 243529 272005 239208 202782 192414 196482 218753 235297 191024 166739
11074 166739 199156 246446 298509 273137 258091 336663 361935 352252 355048 321943 293861 234358
11062 234358 199259 177826 187665 227927 264432 192971 121554 110182 49082 43640 83256 76173
11050 76173 87861 88588 51531 28737 80626 117534 143331 149249 173330 194507 199576 209368 223021
$$ packed form
11133D24255k0226L7326J04497M9243K9389k3511L7202j10106r6856k099Q271
11122D37385n1928L3053l364p736L6685K1419n0858k5705o341K2809M9222M6753
11110E01394K3818l1142p871j1225O738n404k8756m590Q325o9630j6760m1005
11098C23892k0920k5090k3062m7316N493M3174O0029J3325j1915o29j6777j7629
11086B82575m0397k7675K9026K8476l2797l6426j0368M068K2271J6544m4273k4285
11074A66739L2417M7290N2063k5372j5046P8572K5272r683K796l3105k8082n9503
11062B34358l5099k1433R839M0262L6505p1461p1417j1372o1100n442L9616p083
11050G6173J1688P27l7057k2794N1889L6908K5797N918K4081K1177N069R792J3653
$$ plain form
11037 223021 209281 239605 300130 303647 279636 240382 280132 282986 222367 256598 210194 185941
11025 185941 201596 252648 264561 278949 325365 350493 374076 374125 398397 415252 382853 397725
11013 397725 402219 422241 466829 469687 460415 418972 376316 356638 363856 309195 286018 314324
11001 314324 332154 351617 355627 293832 241802 251521 241889 244911 216347 220853 259514 292391
10989 292391 216919 183641 217851 220494 189205 163681 98773 82197 147516 187560 147337 180548
10977 180548 233604 219985 223990 213418 157567 96031 97893 89733 82879 60440 102994 158711
10965 158711 132234 65709 68245 125748 127267 94939 59966 65636 32224 22578 23333 61353 118115
10952 118115 146305 157257 170595 159153 116583 63921 15987 51800 103750 179425 187749 162201
$$ packed form
11037B23021j3740L0324O0525L517k4011l9254L9750K854o0619L4231m6404k4253
11025A85941J5655N1052J1913J4388M6416K5128K3583M9K4272J6855l2399J4872
11013C97725M494K0022M4588K858r272m1443m2656j9678P218n4661k3177K8306
11001C14324J7830J9463M010o1795n2030R719r632L022k8564M506L8661L2877
10989B92391p5472l3278L4210K643l1289k5524o4908j6576O5319M0044m0223L3211
10977A80548N3056j3619M005j0572n5851o1536J862q160o854k2439M2554N5717
10965A58711k6477o6525K536N7503J519l2328l4973N670l3412r646P55L8020N6762
10952A18115K8190J0952J3338j1442m2570n2662m7934L5813N1950P5675Q324k5548
$$ plain form
10940 162201 170411 194914 200092 200303 219566 189715 170642 153452 159698 152254 157099 95366 68260
10927 68260 86311 103560 104440 71369 50108 61610 113923 148020 128955 138265 145205 113124
10915 113124 118032 138620 132302 146907 199624 220640 189719 156203 186901 183812 182163 249053
10903 249053 308176 232443 139846 133065 191425 217728 196182 213738 133798 117865 158823 222164
10891 222164 222656 215962 196547 190185 202668 168574 116223 191768 285065 242623 161958 138416
10879 138416 242372 304725 324390 313188 285503 244237 255472 288456 271002 281524 278752
10868 278752 289327 311154 316917 279834 303325 304589 223434 188384 213976 262628 251150 244392
10856 244392 253280 278100 288698 296553 324181 365156 369198 425017 465668 483425 420916 428296
$$ packed form
10940A62201Q210K4503N178K11J9263k9851j9073j7190O246p444M845o1733k7106
10927F8260J8051J7249Q80l3071k1261J1502N2313L4097j9065R310O940l2081
10915A13124M908K0588o318J4605N2717K1016l0921l3516L0698l089j649O6890
10903B49053N9123p5733r2597o781N8360K6303k1546J7556p9940j5933M0958O3341
10891B22164M92o694j9415o362J2483l4094n2351P5545R3297m2442q0665k3542
10879A38416J03956O2353J9665j1202k7685m1266J1235L2984j7454J0522k772
10868B78752J0575K1827N763l7083K3491J264q1155l5050K5592M8652j1478o758
10856B44392Q888K4820J0598P855K7628M0975M042N5819M0651J7757o2509P380
$$ plain form
10844 428296 510949 471308 424581 453709 517167 541984 495683 404411 345227 315093 356855
10833 356855 370745 376113 363397 397280 400262 407015 365645 345344 314680 332839 381213 348166
10821 348166 342024 368403 436499 494359 527866 615655 622746 629175 633399 636857 601349 606715 608411
10808 608411 654700 603166 619741 611485 672589 765826 799385 753871 768454 805546 822892 886437
10796 886437 887672 900203 957955 1034026 1088183 1125559 1172714 1214592 1237374 1330170 1409383 1512060
10784 1512060 1646016 1742670 1847853 1942513 2085355 2320678 2685655 3063920 3429832 3833658
10774 3833658 4316050 4808381 5428257 6045759 6642216 7259958 7961461 8852080 10058574
10765 10058574 11618269 13701949 16320578 19504792 23012713 26809337 30580954 33889024
$$ packed form
10844D28296Q2653l9641m6727K9128O3458K4817m6301r1272n9184l0134M1762
10833C56855J3890N368j2716L3883K982O753m1370k0301l0664J8159M8374l3047
10821C48166o142K6379O8096N7860L3507Q7789P091O429M224L458l5508N366J696
10808F08411M6289n1534J6575q256O1104R3237L3559m5514J4583L7092J7346O3545
10796H86437J235J2531N7752P6071N4157L7376M7155M1878K2782R2796P9213J02677
10784A512060J33956R6654J05183R4660J42842K35323L64977L78265L65912M03826
10774C833658M82392M92331O19876O17502N96457O17742P01503Q90619J206494
10765A0058574J559695K083680K618629L184214L507921L796624L771617L308070
$$ plain form
10757 33889024 36323176 37690747 37726771 36506048 34171951 31100812 27782750 24547165
10749 24547165 21634078 19106463 17038512 15294635 13874024 12707707 11852988 11183351
10741 11183351 10651888 10285482 10054699 9816929 9763054 9834710 10065223 10415031 10888124 11366751
10731 11366751 11937969 12568031 13283678 14081713 15012282 16214898 17890189 20054031 22506140
10722 22506140 24996221 27365892 29336948 30817941 31663765 32019924 32064923 32060964 32402571
10713 32402571 33380435 35115039 37494753 40184483 42896840 45219310 46920346 47828300
10705 47828300 47922239 47357254 46347094 45028814 43476314 41707707 39554138 37081609
10697 37081609 34224927 31192921 28183406 25330179 22788134 20687990 18982885 17654860
$$ packed form
10757C3889024K434152J367571L6024j220723k334097l071139l318062l235585
10749B4547165k913087k527615k067951j743877j420611j166317q54719o69637
10741A1183351n31463l66406k30783k37770n3875P1656K30513L49808M73093M78627
10731A1366751N71218O30062P15647P98035R30569J202616J675291K163842K452109
10722B2506140K490081K369671J971056J480993Q45824L56159M4999l959L41607
10713C2402571R77864J734604K379714K689730K712357K322470J701036R07954
10705D7828300R3939n64985j010160j318280j552500j768607k153569k472529
10697C7081609k856682l032006l009515k853227k542045k100144j705105j328025
$$ plain form
10689 17654860 16547725 15537263 14637733 13950891 13315403 12714016 12246303 11926061 11652850
10680 11652850 11437150 11283147 11238475 11236934 11327848 11499148 11780399 12198280 12786805 13555104
10670 13555104 14615713 15994861 17737097 19989273 22604685 25472222 28470099 31277930
10662 31277930 33467562 34872636 35276479 34534111 32761071 30198137 27156879 24079265
10654 24079265 21154955 18666933 16589469 14858793 13445561 12241050 11253051 10458734
10646 10458734 9816521 9269640 8732153 8229827 7841785 7495655 7176416 6844655 6530212
10637 6530212 6301898 6110118 5920137 5739247 5556289 5447217 5335242 5238250 5174339 5111382
10627 5111382 5058241 5045783 5042180 5050225 5129855 5108688 5152207 5221582 5347651 5616057 5965860
$$ packed form
10689A7654860j107135j010462q99530o86842o35488o01387m67713l20242k73211
10680A1652850k15700j54003m4672j541R0914J71300K81251M17881N88525P68299
10670A3555104J060609J379148J742236K252176K615412K867537K997877K807831
10662C1277930K189632J405074M03843p42368j773040k562934l041258l077614
10654B4079265k924310k488022k077464j730676j413232j204511r87999p94317
10646A0458734o42213n46881n37487n02326l88042l46130l19239l31761l14443
10637F530212k28314j91780j89981j80890j82958j09072j11975r6992o3911o2957
10627E111382n3141j2458l603Q045P9630k1167M3519O9375J26069K68406L49803
$$ plain form
10616 5965860 6425112 7098305 8056286 9340826 11074764 13286781 15740601 18132738 20254222
10607 20254222 21923854 22840263 23018382 22745048 22544384 22983774 24511224 27352688 31377347
10598 31377347 36050971 40493181 44088617 46562855 47329707 46034955 43403908 41129964
10590 41129964 40281719 41445138 44646539 49536456 55180255 60242824 63897292 65594320
10582 65594320 64538247 60400492 54576517 49157097 45457651 43822782 44172615 45983094
10574 45983094 48379005 50407080 51477536 51194908 48994007 44792976 39744946 35176080
10566 35176080 31856481 29938766 29093597 29018565 29224873 29308307 28919236 27846475 26046405
10557 26046405 23578729 20832488 18204361 16059789 14349859 13066773 12075659 11278390
$$ packed form
10616E965860M59252O73193R57981J284540J733938K212017K453820K392137K121484
10607B0254222J669632R16409J78119k73334k00664M39390J527450K841464M024659
10598C1377347M673624M442210L595436K474238P66852j294752k631047k273944
10590D1129964q48245J163419L201401M889917N643799N062569L654468J697028
10582F5594320j056073m137755n823975n419420l699446j634869L49833J810479
10574D5983094K395911K028075J070456k82628k200901m201031n048030m568866
10566C5176080l319599j917715q45169p5032K06308Q3434l89071j072761j800070
10557B6046405k467676k746241k628127k144572j709930j283086r91114p97269
$$ plain form
10549 11278390 10578740 10026384 9540175 9162488 8797731 8549188 8254042 7900277 7577855
10540 7577855 7290905 7071942 6860119 6638608 6445751 6260264 6068365 5919818 5717089
10531 5717089 5503380 5375961 5223011 5012085 4834948 4733350 4649121 4533658 4416246 4271313
10521 4271313 4133254 4016643 3893910 3843257 3793888 3617258 3499606 3443360 3388201 3299540
10511 3299540 3203520 3097358 2998543 2887941 2886884 2828113 2752017 2643360 2546661 2484851 2405973
10500 2405973 2409762 2338249 2285529 2210166 2127888 2095690 2037422 1988466 1967913 1985471 1964772
10489 1964772 1877518 1791050 1737026 1699016 1622509 1604164 1624039 1639455 1660531 1640872 1578962
10478 1578962 1548298 1507208 1473267 1477922 1503462 1454958 1450905 1374985 1296797 1295512 1262649 1273742
$$ packed form
10549A1278390o99650n52356m86209l77687l64757k48543k95146l53765l22422
10540G577855k86950k18963k11823k21511j92857j85487j91899j48547k02729
10531E717089k13709j27419j52950k10926j77137j01598q4229j15463j17412j44933
10521D271313j38059j16611j22733n0653m9369j76630j17652n6246n5159q8661
10511C299540r6020j06162r8815j10602j057n8771p6096j08657r6699o1810p8878
10500B405973L789p1513n2720p5363q2278l2198n8268m8956k0553J7558k0699
10489A964772q7254q6468n4024l8010p6507j8345J9875J5416K1076j9659o1910
10478A578962l0664m1090l3941M655K5540m8504m053p5920p8188j285l2863J1093
$$ plain form
10466 1273742 1309639 1264645 1186913 1149268 1142338 1166741 1191520 1158160 1121500 1137473 1101465
10455 1101465 985968 933624 967907 987748 957873 955857 978670 921781 891401 881945 877536 861458
10443 861458 843918 787936 741232 743266 715141 733955 695198 659774 641746 652199 672338 701343
10431 701343 682875 667477 674894 641243 623382 649795 659886 657782 658567 728257 709145 682995
10419 682995 635681 577591 518361 541783 573241 542436 578847 575557 524083 482035 493442 477940
10407 477940 437446 426220 416809 373295 353326 360705 350459 322159 365656 393218 342361 276627
10395 276627 242929 230770 236289 282239 268515 299872 321091 217252 171890 185811 167619
10384 167619 193793 218720 220390 190580 163804 209560 278603 253206 215023 227748 186177 114887
$$ packed form
10466A273742L5897m4994p7732l7645o930K4403K4779l3360l6660J5973l6008
10455A101465j15497n2344L4283J9841k9875k016K2813n6889l0380r456m409j6078
10443H61458j7540n5982m6704K034k8125J8814l8757l5424j8028J0453K0139K9005
10431G01343j8468j5398P417l3651j7861K6413J0091k104P85O9690j9112k6150
10419F82995m7314n8090n9230K3422L1458l0805L6411l290n1474m2048J1407j5502
10407D77940m0494j1226r411m3514j9969P379j0246k8300M3497K7562n0857o5734
10395B76627l3698j2159N519M5950j3724L1357K1219j03839m5362J3921j8192
10384A67619K6174K4927J670k9810k6776M5756O9043k5397l8183J2725m1571p1290
$$ plain form
10372 114887 53584 68145 82681 146812 182176 159760 158933 201984 183477 195015 262776 312402
10360 312402 287435 174713 150971 187002 252948 292009 263276 214615 258871 287907 255959
10349 255959 256375 249170 281211 346580 315949 351446 357411 338700 378720 372719 329996 284053
10337 284053 281678 236470 212373 214435 216984 226269 175350 177330 154176 164530 192006 168827
10325 168827 150254 197750 194998 171947 143053 144559 143431 148303 153913 185642 179001 182959 134524
10312 134524 106574 155286 237120 222990 214012 242243 233273 206003 227139 310211 387013 385083
10300 385083 308002 350025 394237 388223 366176 383900 372699 343570 387238 396245 360292 340028
10288 340028 357407 324290 288918 291052 332568 305361 273968 241206 153419 116062 86595 94331
$$ packed form
10372A14887o1303J4561J4536O4131L5364k2416q27M3051j8507J1538O7761M9626
10360C12402k4967j12722k3742L6031O5946L9061k8733m8661M4256K9036l1948
10349B55959M16p205L2041O5369l0631L5497N965j8711M0020o001m2723m5943
10337B84053k375m5208k4097K062K549R285n0919J980k3154J0354K7476k3179
10325A68827j8573M7496k752k3051k8894J506j128M872N610L1729o641L958m8435
10312A34524k7950M8712Q1834j4130q978K8231q970k7270K1136Q3072P6802j930
10300C85083p7081M2023M4212o014k2047J7724j1201k9129M3668R007l5953k0264
10288C40028J7379l3117l5372K134M1516k7207l1393l2762q7787l7357k9467P736
$$ plain form
10276 94331 105949 147078 167772 196172 147849 105565 80208 85943 67377 116771 140479 166703
10264 166703 142496 81345 102908 165854 225856 182732 130752 121165 110839 121195 159925 198400
10252 198400 256054 315877 290852 231337 208046 283141 240419 170759 232250 238551 149295 158940
10240 158940 148225 155546 155870 164511 84346 36739 48771 53162 110595 80874 -660 -34623
10228 -34623 9705 56414 30798 36147 42944 28389 64452 85756 91824 66609 51919 14950
10216 14950 58897 47868 63831 79578 45893 -8880 -15493 -12289 10677 33103 29647 29738 40129
10203 40129 27349 28154 10058 -18781 5978 54073 81063 126488 108279 43669 60214 85481
10191 85481 50971 25515 -11081 28050 -5349 4145 54206 112523 143789 136905 171905 143899
$$ packed form
10276I4331J1618M1129K0694K8400m8323m2284k5357N735j8566M9394K3708K6224
10264A66703k4207o1151K1563O2946O0002m3124n1980r587j0326J0356L8730L8475
10252A98400N7654N9823k5025n9515k3291P5095m2722o9660O1491O301q9256R645
10240A58940j0715P321L24Q641q0165m7607J2032M391N7433k9721q1534l3963
10228c4623M4328M6709k5616N349O797j4555L6063K1304O068k5215j4690l6969
10216A4950M3947j1029J5963J5747l3685n4773o613L204K2966K2426l456R1J0391
10203D0129j2780Q05j8096k8839K4759M8095K6990M5425j8209o4610J6545K5267
10191H5481l4510k5456l6596L9131l3399R494N0061N8317L1266o884L5000k8006
$$ plain form
10179 143899 115113 74417 49625 39329 70585 86365 104462 81324 102922 99152 121261 113475
10167 113475 90195 158129 170827 171698 185859 219396 291142 322175 313678 281150 260613 298871
10155 298871 275248 242247 267482 325631 428648 472537 503320 509724 525749 490292 444251
10144 444251 418585 347853 299373 312243 293160 299156 273803 267283 254324 256789 320421 326802
10132 326802 292337 254284 234714 183973 128283 161110 173421 114436 74164 75002 122639 131436
10120 131436 134211 183571 183508 134743 117292 125660 134230 114488 123526 110815 104127 64348 51781
10107 51781 60518 156672 194180 140674 95635 65621 15199 39395 80431 35229 38944 3797
10095 3797 -2241 -7380 -6913 110 48693 113528 65828 -18988 8249 52089 23895 66729 87943
$$ packed form
10179A43899k8786m0696k4792j0296L1256J5780J8097k3138K1598l770K2109p786
10167A13475k3280O7934J2698Q71J4161L3537P1746L1033q497l2528k0537L8258
10155B98871k3623l3001K5235N8149J03017M3889L0783O404J6025l5457m6041
10144D44251k5666p0732m8480J2870j9083N996k5353o520j2959K465O3632O381
10132C26802l4465l8053j9570n0741n5690L2827J2311n8985m0272Q38M7637Q797
10120A31436K775M9360o3m8765j7451Q368Q570j9742R038j2711o688l9779j2567
10107E1781Q737R6154L7508n3506m5039l0014n0422K4196M1036m5202L715l5147
10095C797o038n139M67P023M8583O4835m7700q4816K7237M3840k8194M2834K1214
$$ plain form
10082 87943 88246 15812 -52406 -9696 40212 31607 33064 40464 7226 53727 37464 18997 73547
10069 73547 49783 8059 25551 89052 131414 139463 102525 34976 14315 -19897 -30740 20392
10057 20392 15499 87873 135761 130852 114473 117816 102282 92109 110377 50019 33534 50616
10045 50616 63738 80596 50675 6898 62904 86902 81582 38144 29214 8385 68899 70012
10033 70012 41855 -1611 -14908 -10214 -9101 -42634 -43657 -88310 -145285 -101493 -88434 -53561
10021 -53561 -4214 18750 -2071 5235 22878 69107 95656 100045 100757 68537 7069 -28978
10009 -28978 -4624 6008 -3864 -31450 -60501 -36134 -5559 2395 -77333 -77155 -65543 -43248
9997 -43248 -41312 -81263 -83153 -25501 16452 96102 96496 75578 96280 46816 10180 -29654 -46568
$$ packed form
10082H7943L03p2434o8218M2710M9908q605J457P400l3238M6501j6263j8467N4550
10069G3547k3764m1724J7492O3501M2362Q049l6938o7549k0661l4212j0843N1132
10057B0392m893P2374M7888m909j6379L343j5534j0173J8268o0358j6485J7082
10045E0616J3122J6858k9921m3777N6006K3998n320m3438q930k0829O0514J113
10033G0012k8157m3466j3297M694J113l3533j023m4653n6975M3792J3059L4873
10021e3561M9347K2964k0821P306J7643M6229K6549M389P12l2220o1468l6047
10009b8978K4354J0632r872k7586k9051K4367L0575P954p9728J78J1612K2295
9997d3248J936l9951j890N7652M1953P9650L94k0918K0702m9464l6636l9834j6914
$$ plain form
9984 -46568 -65460 -86884 -87576 -92473 -82100 -42586 -23140 16796 20804 -15506 11447 7794 7427
9971 7427 15471 44394 40613 13798 2325 -12821 26999 21292 21912 30786 50596 79894 85685
9958 85685 102346 88488 68493 61069 44503 54116 38578 79986 138742 126039 121283 119348 126095
9945 126095 83451 21783 36254 52197 78463 68179 6744 20800 73187 114005 97581 56547
9933 56547 106310 106362 103901 149775 139369 129049 162439 260692 356305 331775 294472 286366 181110
9920 181110 80533 66507 124660 110105 76230 62247 73384 86691 95071 98681 115034 120487
9908 120487 89924 690 13010 28350 60461 85233 38662 -9627 -6219 42411 89414 116344
9896 116344 115635 74521 10101 13325 57302 85234 43071 -10960 24041 41402 -5271 4525
$$ packed form
9984d6568j8892k1424o92m897J0373L9514J9446L9936M008l6310K6953l653l67
9971G427Q044K8923l781k6815j1473j5146L9820n707O20Q874J9810K9298N791
9958H5685J6661j3858j9995p424j6566R613j5538M1408N8756j2703m756j935O747
9945A26095m2644o1668J4471J5943K6266j0284o1435J4056N2387M0818j6424m1034
9933E6547M9763N2k461M5874j0406j0320L3390R8253R5613k4530l7303q106j05256
9920A81110j00577j4026N8153j4555l3875j3983J1137J3307Q380L610J6353N453
9908A20487l0563q9234J2320J5340L2111K4772m6571m8289L408M8630M7003K6930
9896A16344p09m1114o4420L224M3977K7932m2163n4031L5001J7361m6673R796
$$ plain form
9884 4525 38611 34765 73515 51350 11085 23061 53936 43723 43179 30747 15754 65483 120437
9871 120437 72358 57895 35698 -19012 -24131 -9942 35206 67054 31796 15786 55319 -8730
9859 -8730 -61462 -52611 -26802 -8341 47416 36081 25660 26205 -13797 75041 96225 26582 8378
9846 8378 -28668 -61878 -37335 36279 43348 16069 -6233 34653 -6472 3510 12212 -14804 -46144
9833 -46144 -53526 -3966 -2113 45871 101616 125493 127191 36904 68453 115195 116571 119866 72892
9820 72892 18109 -5493 42734 79967 47068 14305 -19419 -59000 -27865 -46538 -1708 75984
9808 75984 60120 1719 -35460 -11999 -12470 -56698 -12052 22752 23077 35242 22860 8708 -58476
9795 -58476 -41962 -28374 -46364 -15508 -5729 23112 34319 2117 -4693 49056 49285 46318 -5170
$$ packed form
9884D525L4086l846L8750k2165m0265J1976L0875j0213n44j2432j4993M9729N4954
9871A20437m8079j4463k2197n4710n119J4189M5148L1848l5258j6010L9533o4049
9859h730n2732Q851K5809J8461N5757j1335j0421N45m0002Q8838K1184o9643j8204
9846H378l7046l3210K4543P3614P069k7279k2302M0886m1125R982Q702k7016l1340
9833d6144p382M9560J853M7984N5745K3877J698r0287L1549M6742J376L295m6974
9820G2892n4783k3602M8227L7233l2899l2763l3724l9581L1135j8673M4830P7692
9808G5984j5864n8401l7179K3461m71m4228M4646L4804L25J2165j2382j4152o7184
9795e8476J6514J3588j7990L0856R779K8841J1207l2202o810N3749K29k967n1488
$$ plain form
9782 -5170 -22045 7596 29493 11390 73969 117907 53082 115239 182342 301300 413848 454590
9770 454590 526729 551683 491725 375672 226598 126468 133343 130234 81262 72418 91599 112416
9758 112416 130250 149266 143264 110719 84756 108736 122907 109181 118385 124300 63946 16413
9746 16413 24144 17585 12976 17042 55694 -3257 39320 109948 101853 33658 35357 72338 91304
9733 91304 138495 107717 46290 -20629 -37787 -55857 -55685 -28702 -27639 -4447 32037 -277
9721 -277 738 -2987 17597 -28420 -45511 -10268 56148 58893 87683 20562 -42863 -24177 -27785
9708 -27785 -43733 -96257 -149093 -138593 -138811 -131345 -82494 -81184 -84652 -63786 34701 69395 32611
9695 32611 9468 5959 -1024 33985 21226 -3818 24470 78167 117628 67840 7712 9580
$$ packed form
9782e170j6875K9641K1897j8103O2579M3938o4825O2157O7103J18958J12548M0742
9770D54590P2139K4954n9958j16053j49074j00130O875l109m8972q844J9181K0817
9758A12416J7834J9016o002l2545k5963K3980J4171j3726R204N915o0354m7533
9746A6413P731o559m609M066L8652n8951M2577P0628q095o8195J699L6981J8966
9733I1304M7191l0778o1427o6919j7158j8070J72K6983J063K3192L6484l2314
9721b77J015l725K0584m6017j7091L5243O6416K745K8790o7121o3425J8686l608
9708b7785j5948n2524n2836J0500k18P466M8851J310l468K0866R8487L4694l6784
9695C2611k3143l509o983L5009j2759k5044K8288N3697L9461m9788o0128J868
$$ plain form
9683 9580 -2495 -46636 -58179 -8118 -10910 20499 1459 -59513 -26070 -25321 -31607 -4910 -30675
9670 -30675 -41915 -31352 3538 14815 9568 20061 35638 36853 23597 36203 52383 98283
9658 98283 39295 11435 8318 57789 97383 93304 83872 100382 50211 -40696 -2956 22920
9646 22920 65086 98192 122635 158720 194703 207862 103547 91884 43129 -14962 57098 82452
9634 82452 76617 92222 101512 41244 48098 47022 23518 -6281 -30200 29995 32440 48039 788
9621 788 17666 35192 -8591 -16761 -28575 15332 5838 -20696 -27416 5019 68284 82435 25394
9608 25394 2738 48113 81644 81918 41075 23021 1153 -8177 -38603 -63425 -9015 9269
9596 9269 4140 5584 37444 33531 7505 29514 -1437 -22810 -40531 -11583 28412 20845 76573
$$ packed form
9683I580j2075m4141j1543N0061k792L1409j9040o0972L3443P49o286K6697k5765
9670c0675j1240J0563L4890J1277n247J0493J5577J215j3256J2606J6180M5900
9658I8283n8988k7860l117M9471L9594m079r432J6510n0171r0907L7740K5876
9646B2920M2166L3106K4443L6085L5983J3159j04315j1663m8755n8091P2060K5354
9634H2452n835J5605R290o0268O854j076k3504k9799k3919O0195K445J5599m7251
9621G88J6878J7526m3783q170j1814M3907r494k6534o720L2435O3265J4151n7041
9608B5394k2656M5375L3531K74m0843j8054k1868r330l0426k4822N4410J8284
9596I269n129J444L1860l913k6026K2009l0951k1373j7721K8948L9995p567N5728
$$ plain form
9583 76573 61914 -87740 -117324 -28717 -25259 -13803 -1014 -2156 -39784 -29799 -24288 -42199
9571 -42199 -5143 28816 1351 1925 -48409 -85895 -102946 -63163 -31739 -31069 -50045 -82830 -21692
9558 -21692 4082 22864 -19412 53571 114554 102521 65450 -18097 -30417 -51945 -77426 -90904
9546 -90904 -58666 10837 77223 88840 4861 -53578 -90503 -103825 -65901 -64373 -18253 -47783
9534 -47783 -59878 8426 36616 -19412 -60562 -18089 8957 1698 -7623 2833 2748 -16269 -52686
9521 -52686 30757 82046 116199 124335 38420 45625 33065 21870 -10700 -85429 -130634 -101714
9509 -101714 -67556 -57014 -47717 -29033 -33948 -69897 -62389 -25029 -28295 -50222 -2562 61461
9497 61461 103113 121420 40882 -11615 25225 -20503 -58222 -63902 -33387 -20463 -18145 -29994
$$ packed form
9583G6573j4659j49654k9584Q8607L458J1456J2789j142l7628R985N511j7911
9571d2199L7056L3959k7465N74n0334l7486j7051L9783L1424O70j8976l2785O1138
9558b1692K5774J8782m2276P2983O0983j2033l7071q3547j2320k1528k5481j3478
9546i0904L2238O9503O6386J1617q3979n8439l6925j3322L7924J528M6120k9530
9534d7783j2095O8304K8190n6028m1150M2473K7046p259r321J0456q5j9017l6417
9521e2686Q3443N1289L4153Q136q5915P205j2560j1195l2570p4729m5205K8920
9509a01714L4158J0542R297J8684m915l5949P508L7360l266k1927M7660O4023
9497F1461M1652J8307q0538n2497L6840m5728l7719n680L0515J2924K318j1849
$$ plain form
9485 -29994 2897 11931 5213 18125 37664 52906 75418 114395 116578 129818 157812 147911 92169
9472 92169 96519 44862 -19945 -27533 33589 67901 84455 109076 146160 154022 139741 123866
9460 123866 67519 48686 44285 38098 36403 19983 38829 49530 38899 57761 17967 36416
9448 36416 98645 108570 72520 95457 154632 146279 72328 6482 -49787 -53145 -65947 -37617
9436 -37617 -19846 15568 27871 37190 9162 42391 45242 6361 9134 -14294 -39842 44148
9424 44148 98474 101276 83690 76044 60169 95208 73320 26559 29362 34293 49006 69409 39981
9411 39981 82612 71628 7332 36583 76039 110142 119120 146800 123368 152004 158068 182640
9399 182640 143353 113786 90937 79800 71735 107885 84544 43140 -7158 -16217 -12497 33551
$$ packed form
9485b9994L2891R034o718J2912J9539J5242K2512L8977K183J3240K7994r901n5742
9472I2169M350n1657o4807p588O1122L4312J6554K4621L7084P862j4281j5875
9460A23866n6347j8833m401o187j695j6420J8846J0701j0631J8862l9794J8449
9448C6416O2229R925l6050K2937N9175q353p3951o5846n6269l358j2802K8330
9436c7617J7771L5414J2303R319k8028L3229K851l8881K773k3428k5548Q3990
9424D4148N4326K802j7586p646j5875L5039k1888m6761K803M931J4713K0403k9428
9411C9981M2631j0984o4296K9251L9456L4103Q978K7680k3432K8636O064K4572
9399A82640l9287k9567k2849j1137q065L6150k3341m1404n0298r059L720M6048
$$ plain form
9387 33551 40120 5618 39622 32072 28557 30880 88 48526 80930 79028 8596 -35059 -35171
9374 -35171 -2173 71364 122066 78123 -7165 -58125 -13414 35944 72786 65162 30055 28056
9362 28056 62049 73720 31324 9786 14589 -10283 1199 24567 26668 19658 -18544 -59687
9350 -59687 -83874 -50336 -53587 -43711 -22673 -13767 25705 45735 28688 34252 39760 52694 2333
9337 2333 -2615 -17952 6073 7784 27737 257 -8424 1287 62490 95150 91103 131917 85066
9324 85066 38905 13722 -3569 -23613 -21720 -984 36339 53328 37830 10156 -6995 34341
9312 34341 94740 123044 109307 110322 43646 42689 116251 196670 245013 216180 156352 177206
9300 177206 166453 133142 111685 119894 171686 152855 118382 111704 124826 110038 84924 5467
$$ packed form
9387C3551O569l4502L4004p550l515K323l0792M8438L2404j902p0432m3655j12
9374c5171L2998P3537N0702m3943q5288n0960M4711M9358L6842p624l5107j999
9362B8056L3993J1671m2396k1538M803k4872J1482K3368K101p010l8202m1143
9350e9687k4187L3538l251R876K1038Q906L9472K0030j7047N564N508J2934n0361
9337B333m948j5337K4025J711J9953k7480q681R711O1203L2660m047M0814m6851
9324H5066m6161k5183j7291k0044J893K0736L7323J6989j5498k7674j7151M1336
9312C4341O0399K8304j3737J015o6676r57P3562Q0419M8343k8833n9828K0854
9300A77206j0753l3311k1457Q209N1792j8831l4473o678J3122j4788k5114p9457
$$ plain form
9288 5467 67243 103700 36038 18128 10696 80131 128262 109965 56776 42826 14989 15492 70724
9275 70724 77685 96578 98169 74834 55511 59346 120608 173129 128853 85749 84316 97183 136819
9262 136819 32472 -22751 -18854 -8522 72912 72149 2317 -2467 106109 130165 104971 80554
9250 80554 132778 125614 138613 146535 111877 109395 145888 150036 146599 125250 86823 49822 64627
9237 64627 56166 48544 63900 82014 90754 108651 94940 24776 9947 34676 92555 160224
9225 160224 184302 225281 263820 250029 257884 311416 331611 334358 333911 389000 400725 413009
9213 413009 404058 437641 515658 552927 562904 629170 652068 745597 838174 940200 975409 1047046
9201 1047046 1158564 1308499 1524649 1806440 2017164 2123312 2272263 2421379 2557667 2573477
$$ packed form
9288E467O1776L6457o7662j7910p432O9435M8131j8297n3189j3950k7837N03N5232
9275G0724O961J8893J591k3335j9323L835O1262N2521m4276m3104j433J2867L9636
9262A36819j04347n5223L897J0332Q1434p63o9832m784J08576K4056k5194k4417
9250H0554N2224p164J2999P922l4658k482L6493M148l437k1349l8427l7001J4805
9237F4627q461p622J5356J8114Q740J7897j3711p0164j4829K4729N7879O7669
9225A60224K4078M0979L8539j3791P855N3532K0195K747m47N5089J1725J2284
9213D13009q951L3583P8017L7269R977O6266K2898R3529R2577J02026L5209P1637
9201A047046J11518J49935K16150K81791K10724J06148J48951J49116J36288J5810
$$ plain form
9191 2573477 2540490 2481228 2377076 2249093 2107829 1946701 1835595 1703058 1510625 1335344
9181 1335344 1148480 1015290 938349 845496 765428 726837 680494 656878 584910 578602 588692
9170 588692 591295 570004 560169 536191 513988 520812 464762 434555 411975 380365 417331 440857
9158 440857 382293 365570 352532 330002 397510 384749 349987 339861 372577 322470 280537 244703
9146 244703 175495 148955 177271 275286 294282 258551 262863 286931 281802 252561 217541 217662
9134 217662 236206 186098 211492 232208 226503 152822 186122 210123 221082 237475 227948 192761
9122 192761 190418 186596 185450 189862 164122 183726 204711 147122 109920 119071 115070 91760 97167
9109 97167 144107 189508 193248 229942 289043 297954 284666 254086 303841 274374 281560 327947
$$ packed form
9191B573477l2987n9262j04152j27983j41264j61128j11106j32537j92433j75281
9181A335344j86864j33190p6941r2853q0068l8591m6343k3616p1968o308J0090
9170E88692K603k1291r835k3978k2203O824n6050l0207k2580l1610L6966K3526
9158D40857n8564j6723j3038k2530O7508j2761l4762j0126L2716n0107m1933l5834
9146B44703o9208k6540K8316R8015J8996l5731M312K4068n129k9241l5020J21
9134B17662J8544n0108K5394K0716n705p3681L3300K4001J0959J6393r527l5187
9122A92761k343l822j146M412k5740J9604K0985n7589l7202R151m001k3310N407
9109I7167M6940M5401L740L6694N9101Q911j3288l0580M9755k9467P186M6387
$$ plain form
9097 327947 333230 248159 211307 185095 180732 153842 176013 193361 169029 203457 237086 157486
9085 157486 119010 126609 157357 192243 239604 237538 173481 186970 250365 281394 241266 151455
9073 151455 62578 38241 75642 134320 195180 212680 220353 243889 252600 235539 241233 262014
9061 262014 288439 304478 310255 310590 316158 340207 414285 475741 501867 503696 485598 469913 453794
9048 453794 448110 488182 491210 467908 485908 527813 475527 446178 456599 429322 460341 506817
9036 506817 503262 419672 402600 411889 376465 352305 329797 287927 284359 297251 281788 218947
9024 218947 240163 301183 340956 383780 402066 366658 391623 402121 387141 335180 263191 206338
9012 206338 200124 248594 315990 340521 339305 324617 331280 330358 324841 288616 282874 341573 362961
$$ packed form
9097C27947N283q5071l6852k6212m363k6890K2171J7348k4332L4428L3629p9600
9085A57486l8476P599L0748L4886M7361k066o4057J3489O3395L1029m0128q9811
9073A51455q8877k4337L7401N8678O0860J7500P673K3536Q711j7061N694K0781
9061B62014K6425J6039N777L35N568K4049P4078O1456K6126J829j8098j5685j6119
9048D53794n684M0072L028k3302J8000M1905n2286k9349J0421k7277L1019M6476
9036E06817l555q3590j7072R289l5424k4160k2508m1870l568J2892j5463o2841
9024B18947K1216O1020L9773M2824J8286l5408K4965J0498j4980n1961p1989n6853
9012B06338o214M8470O7396K4531j216j4688O663r22n517l6225n742N8699K1388
$$ plain form
8999 362961 357865 360617 364834 338531 212210 235369 206050 266696 287424 246371 283011 342596
8987 342596 341864 318017 357734 389359 367448 351488 454238 545103 593756 567544 487528 425559
8975 425559 421942 417681 425760 459115 463086 501183 537405 540571 532715 543818 521468 475310 458247
8962 458247 458855 372051 440094 430056 415990 489330 540372 548611 497300 462768 493412 565637
8950 565637 523255 433120 465839 475388 449309 410194 427296 492523 515855 526945 551888 599317
8938 599317 595030 632438 656918 690277 808754 840736 873662 915101 974886 1017776 1055650 1139958
8926 1139958 1231614 1281830 1355690 1451610 1541093 1585832 1588425 1551372 1500807 1433673 1420925 1407131
8914 1407131 1401284 1403208 1418070 1426709 1425379 1394024 1419762 1520737 1593596 1622014 1642797 1699920
$$ packed form
8999C62961n096K752M217k6303j26321K3159k9319O0646K0728m1053L6640N9585
8987C42596p32k3847L9717L1625k1911j5960J02750R0865M8653k6212q0016o1969
8975D25559l617m261Q079L3355L971L8097L6222L166p856J1103k2350m6158j7063
8962D58247O08q6804O8043j0038j4066P3340N1042Q239n1311l4532L0644P2225
8950E65637m2382r0135L2719R549k6079l9115J7102O5227K3332J1090K4943M7429
8938E99317m287L7408K4480L3359J18477L1982L2926M1439N9785M2890L7874Q4308
8926A139958R1656N0216P3860R5920Q9483M4739K593l7053n0565o7134j2748j3794
8914A407131n847J924J4862Q639j330l1355K5738J00975P2859K8418K0783N7123
$$ plain form
8902 1699920 1744551 1774577 1808767 1870577 1925343 1963789 1976927 1971173 1988032 2034675 2004335 2026270
8890 2026270 2138427 2193118 2237677 2316957 2316087 2329726 2415107 2435673 2515639 2621642 2748145
8879 2748145 2784702 2847306 2931274 2991769 3039676 3070131 3143510 3200561 3284464 3385638 3490719
8868 3490719 3655925 3833409 3945978 4089582 4232637 4377505 4526262 4732974 4977029 5117447
8858 5117447 5282102 5492882 5694986 5976364 6312757 6631436 6843125 7190837 7556646 7979684
8848 7979684 8434742 8843746 9275642 9804792 10339530 10891400 11434168 12059408 12701730 13393479
8838 13393479 14166622 15084792 15983071 16897348 17936282 18964882 20138854 21377136 22725783
8829 22725783 24241219 25844229 27639343 29707787 31998135 34616168 37626089 41119380
$$ packed form
8902A699920M4631L0026L4190O1810N4766L8446J3138n754J6859M6643l0340K1935
8890B026270J12157N4691M4559P9280q70J3639Q5381K0566P9966J06003J26503
8879B748145L6557O2604Q3968O0495M7907L0455P3379N7051Q3903J01174J05081
8868C490719J65206J77484J12569J43604J43055J44868J48757K06712K44055J40418
8858E117447J64655K10780K02104K81378L36393L18679K11689L47712L65809M23038
8848G979684M55058M09004M31896N29150N34738N51870N42768O25240O42322O91749
8838A3393479P73143R18170Q98279R14277J038934J028600J173972J238282J348647
8829B2725783J515436J603010J795114K068444K290348K618033L009921L493291
$$ plain form
8821 41119380 45127400 49625344 54617949 59941240 65314141 70635239 75817862 80859249
8813 80859249 85961082 91583913 98218537 106217007 116008721 127960069 142469234 160134442
8805 160134442 181834634 208648435 241688121 282130389 330684056 386595142 446870265
8798 446870265 505844943 556107716 590715089 604483126 594366457 561024459 510061956
8791 510061956 450732529 391991121 339232039 294521295 257671692 227652777 203170732
8784 203170732 183140785 166416427 152229547 140023618 129313573 119755395 111311234
8777 111311234 103817728 97115539 91126982 85832687 81215962 77135965 73463546 70133094
8769 70133094 67078506 64265286 61604161 59168961 56844409 54598711 52485358 50544881
$$ packed form
8821D1119380M008020M497944M992605N323291N372901N321098N182623N041387
8813H0859249N101833N622831O634624P998470R791714J1951348J4509165J7665208
8805A60134442K1700192K6813801L3039686M0442268M8553667N5911086O0275123
8798D46870265N8974678N0262773L4607373J3768037j0116669l3341998n0962503
8791E10061956n9329427n8741408n2759082m4710744l6849603l0018915k4482045
8784B03170732k0029947j6724358j4186880j2205929j0710045r558178q444161
8777A11311234p493506o702189n988557n294295m616725m079997l672419l330452
8769G0133094l054588k813220k661125k435200k324552k245698k113353j940477
$$ plain form
8761 50544881 48709430 46969872 45320811 43774755 42288987 40912781 39661384 38374707
8753 38374707 37129282 35959771 34844124 33787011 32807464 31882019 30937023 29991750 29074062
8744 29074062 28216548 27412028 26646062 25873108 25123159 24424292 23684181 22892009 22203002
8735 22203002 21515414 20817610 20168330 19611888 19025796 18445144 17952509 17460819 17024193
8726 17024193 16573235 16134822 15741002 15327029 14988402 14661645 14318491 13969768 13627644
8717 13627644 13329983 12916414 12543234 12170434 11840050 11493102 11253558 11064575 10902098
8708 10902098 10708296 10503911 10303275 10103799 9889667 9618991 9363110 9192814 8992727
8699 8992727 8739362 8555390 8376543 8186599 8014804 7861744 7638107 7501632 7334697 7152457
$$ packed form
8761E0544881j835451j739558j649061j546056j485768j376206j251397j286677
8753C8374707j245425j169511j115647j057113r79547r25445r44996r45273r17688
8744B9074062q57514q04520p65966p72954p49949o98867p40111p92172o89007
8735B2203002o87588o97804o49280n56442n86092n80652m92635m91690m36626
8726A7024193m50958m38413l93820m13973l38627l26757l43154l48723l42124
8717A3627644k97661m13569l73180l72800l30384l46948k39544j88983j62477
8708A0902098j93802k04385k00636j99476k14132k70676k55881j70296k00087
8699H992727k53365j83972j78847j89944j71795j53060k23637j36475j66935j82240
$$ plain form
8689 7152457 7036754 6926794 6843433 6725094 6595644 6441657 6299806 6205478 6141316 6072494
8679 6072494 5953794 5825212 5754340 5662217 5521728 5423197 5334344 5260535 5183874 5136797 5030906
8668 5030906 4925035 4825405 4733896 4656404 4597890 4501206 4434991 4338604 4238474 4156890 4172125
8657 4172125 4067384 3959878 3831050 3657895 3566939 3560390 3572790 3541668 3476148 3405446 3330493
8646 3330493 3249426 3200372 3144549 3088928 2970271 2909025 2878750 2818623 2796126 2788606 2794049 2829772
8634 2829772 2830134 2786269 2707362 2667473 2565047 2527607 2491325 2469758 2469387 2377925 2298026 2226322
8622 2226322 2150619 2170233 2138009 2056183 1985844 1922878 1853686 1829065 1764940 1630995 1569730
8611 1569730 1551089 1570295 1572675 1556077 1586361 1578719 1571923 1558252 1494873 1428680 1352532 1311132
$$ packed form
8689G152457j15703j09960q3361j18339j29450j53987j41851r4328o4162o8822
8679F072494j18700j28582p0872r2123j40489r8531q8853p3809p6661m7077j05891
8668E030906j05871r9630r1509p7492n8514r6684o6215r6387j00130q1584J5235
8657D172125j04741j07506j28828j73155r0956o549J2400l1122o5520p0702p4953
8646C330493q1067m9054n5823n5621j18657o1246l0275o0127k2497p520N443L5723
8634B829772L62m3865p8907l9889j02426l7440l6282k1567l71r1462p9899p1704
8622B226322p5703J9614l2224q1826p0339o2966o9192k4621o4125j33945o1265
8611A569730j8641J9206K380j6598L0284p642o796j3671o3379o6193p6148m1400
$$ plain form
8599 1311132 1316055 1345948 1285477 1186077 1177467 1167365 1150693 1146024 1193014 1185155 1123927 1037361
8587 1037361 1025106 1041802 1020856 1009756 984661 1020439 996608 992266 979482 946738 996048 1000135
8575 1000135 942154 936510 903854 935821 934433 869382 840204 809265 804060 777044 768251 833575
8563 833575 833356 789582 785483 776269 783775 869168 844199 733201 680440 697460 701548 716540 715473
8550 715473 723050 741325 719944 703872 688005 689322 724970 704862 727150 780137 780688 780625 804852
8537 804852 834594 830234 761084 698523 698733 697936 690699 640401 651008 659472 744038 760357 692418
8524 692418 665866 743745 747102 656077 616972 656550 719407 702935 612524 548660 531499 544592
8512 544592 572379 585129 610018 613928 554915 507963 527428 511319 442431 414103 422598 416532
$$ packed form
8599A311132M923K9893o0471r9400q610j0102j6672m669M6990p859o1228q6566
8587A037361j2255J6696k0946j1100k5095L5778k3831m342j2784l2744M9310M087
8575A000135n7981n644l2656L1967j388o5051k9178l0939n205k7016q793O5324
8563H33575k19m3774m099r214P506Q5393k4969j10998n2761J7020M088J4992j067
8550G15473P577J8275k1381j6072j5867J317L5648k0108K2288N2987N51o3K4227
8537H04852K9742m360o9150o2561K10p97p237n0298J0607Q464Q4566J6319o7939
8524F92418k6552P7879L357r1025l9105L9578O2857j6472r0411o3864j7161J3093
8512E44592K7787J2750K4889L910n9013m6952J9465j6109o8888k8328Q495o066
$$ plain form
8500 416532 407775 423083 427083 381567 289600 333004 374767 359072 339850 334926 324236 267284
8488 267284 265065 345229 394491 399757 510777 569259 592105 619902 679578 698185 644131 557949
8476 557949 496597 479567 465477 427152 372246 376332 421193 396752 374716 357201 362243 369436
8464 369436 356652 336134 303385 347639 354186 288621 239431 275945 339818 312570 269511 248459
8452 248459 278426 372746 404410 378426 395287 397396 422426 430794 407071 384069 436228 424520
8440 424520 355097 332364 419772 462649 502563 576372 620188 599511 494110 427063 459987
8429 459987 495306 484107 574978 570857 530133 498863 491111 481303 493146 505372 504825 526998 545278
8416 545278 601010 650362 702593 724287 750908 736969 721844 791300 870490 905538 939604 1062653
$$ packed form
8500D16532q757J5308M000m5516r1967M3404M1763j5695j9222m924j0690n6952
8488B67284k219Q0164M9262N266J11020N8482K2846K7797N9676J8607n4054q6182
8476E57949o1352j7030j4090l8325n4906M086M4861k4441k2036j7515N042P193
8464C69436j2784k0518l2749M4254O547o5565m9190L6514O3873k7248m3059k1052
8452B48459K9967R4320L1664k5984J6861K109K5030Q368k3723k3002N2159j1708
8440D24520o9423k2733Q7408M2877L9914P3809M3816k0677j05401o7047L2924
8429D59987L5319j1199R0871m121m0724l1270p752r808J1843J2226n47K2173J8280
8416E45278N5732M9352N2231K1694K6621j3939j5125O9456P9190L5048L4066J23049
$$ plain form
8404 1062653 1195815 1292416 1426436 1555931 1657168 1837168 2013798 2225092 2412144 2596504
8394 2596504 2712223 2753160 2818353 2777018 2693603 2598295 2473756 2307325 2127906 1951511
8384 1951511 1738257 1546077 1452518 1361879 1247484 1134665 1097242 1031919 975421 896076 821820
8373 821820 737762 607104 541281 570282 607793 613850 560508 566449 611757 617993 610992 564760
8361 564760 515348 502199 441644 374248 394541 417706 403564 382973 398518 353171 278342 299943
8349 299943 347198 360346 351217 313455 325134 313998 287685 267985 332655 393395 378416 374681
8337 374681 338546 373250 397837 327663 278226 296633 266294 196990 185796 218244 196241 134384
8325 134384 110412 142652 159559 233175 312050 289677 196031 173734 131437 57832 31361 85988
$$ packed form
8404A062653J33162R6601J34020J29495J01237J80000J76630K11294J87052J84360
8394B596504J15719M0937O5193m1335q3415r5308j24539j66431j79419j76395
8384A951511k13254j92180r3559r0639j14395j12819l7423o5323n6498p9345p4256
8373H21820q4058j30658o5823K9001L7511O057n3342N941M5308O236p001m6232
8361E64760m9412j3149o0555o7396K0293K3165j4142k0591J5545m5347p4829K1601
8349B99943M7255J3148r129l7762J1679j1136k6313j9700O4670O0740j4979l735
8337C74681l6135L4704K4587p0174m9437J8407l0339o9304j1194L2448k2003o1857
8325A34384k3972L2240J6907P3616P8875k2373r3646k2297m2297p3605k6471N4627
$$ plain form
8313 85988 133618 111769 167886 238445 287321 312021 284638 183228 151231 188455 192818 149514
8301 149514 195875 293981 262713 172516 131745 168668 221209 324266 295078 256456 211622
8290 211622 165328 124611 105229 121969 133808 154259 202647 217657 202693 209991 217452 147356
8278 147356 110092 95459 67216 111383 150817 157688 125488 148182 177397 221973 207752 184227
8266 184227 174261 148793 102256 122245 146680 178923 176525 121814 109350 151095 102627 56193
8254 56193 127518 189454 214546 253745 251837 224612 222637 231894 270390 221445 118710 139277
8242 139277 184625 236179 233204 192249 133580 158950 170798 216278 206964 168649 102312 75606
8230 75606 87055 114727 54025 39700 65963 126218 74996 66560 39579 10514 44395 83108
$$ packed form
8313H5988M7630k1849N6117P0559M8876K4700k7383j01410l1997L7224M363m3304
8301A49514M6361R8106l1268r0197m0771L6923N2541J03057k9188l8622m4834
8290B11622m6294m0717j9382J6740J1839K0451M8388J5010j4964P298P461p0096
8278A47356l7264j4633k8243M4167L9434O871l2200K2694K9215M4576j4221k3525
8266A84227r966k5468m6537J9989K4435L2243k398n4711j2464M1745m8468m6434
8254E6193P1325O1936K5092L9199j908k7225j975R257L8496m8945j02735K0567
8242A39277M5348N1554k975m0955n8669K5370J1848M5480r314l8315o6337k6706
8230G5606J1449K7672o0702j4325K6263O0255n1222q436k6981k9065L3881L8713
$$ plain form
8218 83108 96710 58735 14220 6863 22557 -12844 -27519 -7345 27003 55435 102440 122251
8206 122251 80077 105329 212076 224730 155451 89663 140465 130335 121879 104809 90647 65311
8194 65311 96571 58190 856 50387 91502 50454 66374 68188 72080 102729 140052 153617
8182 153617 143660 118730 22430 32222 107645 101447 76042 68804 52482 106060 119865 113241 153407
8169 153407 182858 99181 72433 8225 21178 41326 12810 67427 112349 90057 80817 125150
8157 125150 126426 156724 143997 143848 177419 116342 52920 42377 43079 81660 68523 50351 116601
8144 116601 87940 81093 95538 95897 55319 102300 112991 89130 101534 128078 91400 80354
8132 80354 50566 32320 28287 45705 80122 71756 16627 26671 83083 48103 11352 -1058
$$ packed form
8218H3108J3602l7975m4515p357J5694l5401j4675K0174L4348K8432M7005J9811
8206A22251m2174K5252J06747J2654o9279o5788N0802j0130q456j7070j4162k5336
8194F5311L1260l8381n7334M9531M1115m1048J5920J814L892L0649L7323J3565
8182A53617r957k4930r6300R792P5423o198k5405p238j6322N3578J3805o624M0166
8169A53407K9451q3677k6748o4208J2953K0148k8516N4617M4922k2292r240M4333
8157A25150J276L0298j2727j49L3571o1077o3422j0543P02L8581j3137j8172O6250
8144A16601k8661o847J4445L59m0578M6981J0691k3861J2404K6544l6678j1046
8132H0354k9788j8246m033J7418L4417q366n5129J0044N6412l4980l6751j2410
$$ plain form
8120 -1058 20465 28265 22225 25293 53560 21706 42446 55207 90186 101585 46061 19580 32458
8107 32458 30732 23231 64836 101944 98081 94579 91781 86073 125679 143432 97829 77226 89208
8094 89208 75852 97644 126967 165135 127389 49977 39769 -19530 -63449 -55570 -16181 -13794
8082 -13794 20370 90925 117203 137170 94241 96517 115311 134681 63156 33782 43376 35158
8070 35158 56561 53975 46664 92633 87179 41817 1833 -8255 6507 113715 189791 133231
8058 133231 47022 20312 19994 38684 67006 40064 33252 41888 89099 132660 104401 129256
8046 129256 88794 15350 73510 118201 122533 53679 75261 125811 125364 156730 184982 138354
8034 138354 34182 -14244 -23751 -68641 -44784 -31579 -45460 -40493 -70001 6678 46774 74779
$$ packed form
8120a058K1523P800o040L068K8267l1854K0740J2761L4979J1399n5524k6481J2878
8107C2458j726p501M1605L7108l863l502k798n708L9606J7753m5603k0603J1982
8094H9208j3356K1792K9323L8168l7746p7412j0208n9299m3919P879L9389K387
8082a3794L4164P0555K6278J9967m2929K276J8794J9370p1525k9374R594q218
8070C5158K1403k586p311M5969n454m5362l9984j0088J4762J07208P6076n6560
8058A33231q6209k6710l18J8690K8322k6942o812Q636M7211M3561k8259K4855
8046A29256m0462p3444N8160M4691M332o8854K1582N0550m47L1366K8252m6628
8034A38354j04172m8426r507m4890K3857J3205j3881M967k9508P6679M0096K8005
$$ plain form
8022 74779 86610 75116 87193 85242 66509 29921 -4442 -3420 -6206 66197 66624 38706 19809
8009 19809 44959 57722 63431 49444 67794 90833 45152 53700 72193 75752 78883 32086 -3688
7996 -3688 32650 18575 16356 92701 110404 87855 94904 138701 135382 101405 75020 87520 105717
7983 105717 84768 58960 11753 15721 60454 40817 60309 91954 78573 69018 23569 7652
7971 7652 54603 73001 46891 16400 2095 -8284 1206 11445 46705 122990 147825 100893
7959 100893 85582 68976 103491 129246 95992 99834 127444 97094 88925 64480 43357 17282
7947 17282 16512 26053 59149 95993 60370 35001 24462 24603 13686 -4585 -18644 13789 46782
7934 46782 75135 90942 80656 138621 152839 86333 43505 -3813 -54862 -57273 -51713 -10969
$$ packed form
8022G4779J1831j1494J2077j951j8733l6588l4363J022k786P2403M27k7918j8897
8009A9809K5150J2763N709j3987J8350K3039m5681Q548J8493L559L131m6797l5774
7996c688L6338j4075k219P6345J7703k2549P049M3797l319l3977k6385J2500J8197
7983A05717k0949k5808m7207L968M4733j9637J9492L1645j3381r555m5449j5917
7971G652M6951J8398k6110l0491j4305j0379R490J0239L5260P6285K4835m6932
7959A00893j5311j6606L4515K5755l3254L842K7610l0350q169k4445k1123k6075
7947A7282p70R541L3096L6844l5623k5369j0539J41j0917j8271j4059L2433L2993
7934D6782K8353J5807j0286N7965J4218o6506m2828m7318n1049k411N560M0744
$$ plain form
7922 -10969 19130 -40780 -30777 50028 43459 -12771 -57730 -96593 -28754 6056 21248 7394
7910 7394 -7246 29448 32750 47628 93464 63885 63306 138773 109203 74183 85598 85310 79674
7897 79674 87920 97152 99503 113401 59065 56515 79199 119363 91559 55500 38914 19695 23878
7884 23878 -12956 -38843 -19843 4561 16353 96421 53154 91681 123931 139885 151733 153688
7872 153688 123204 84496 27301 -24350 -16248 -20335 -28282 10205 -37401 -61726 -4351 9922
7860 9922 83836 110209 14236 28865 42523 -928 3009 48811 55911 -104 -75732 -15302
7848 -15302 16438 -73301 -113145 -75436 -70842 -81783 -42093 -1228 23896 16630 3360 -46735
7836 -46735 -66770 -35724 -13205 24051 -54633 -16461 6910 1567 18942 78531 114132 130902
$$ packed form
7922a0969L0099n9910J0003Q0805o569n6230m4959l8863O7839L4810J5192j3854
7910G394j4640L6694L302J4878M5836k9579n79P5467k9570l5020J1415k88n636
7897G9674Q246R232K351J3898n4336k550K2684M0164k7804l6059j6586j9219M183
7884B3878l6834k5887J9000K4404J1792Q0068m3267L8527L2250J5954J1848J955
7872A53688l0484l8708n7195n1651Q102m087p947L8487m7606k4325N7375J4273
7860I922P3914K6373r5973J4629J3658m3451L937M5802P100n6015p5628O0430
7848a5302L1740q9739l9844L7709M594j0941L9690M0865K5124p266j3270n0095
7836d6735k0035L1046K2519L7256p8684L8172K3371n343J7375N9589L5601J6770
$$ plain form
7824 130902 77053 -16425 -46500 -35678 -24233 -34702 12853 32189 71371 54723 94232 67506
7812 67506 57756 87798 147459 131748 95935 68508 31970 -4988 18959 40899 23957 62498
7800 62498 136781 167071 156473 155222 113934 34850 17864 23371 36949 54132 126724 202090
7788 202090 110987 -6648 -28387 -32557 -36992 6350 -6453 31113 86335 85537 10858 -1485
7776 -1485 42894 89957 135302 160393 134471 86179 20396 -23175 -111822 -140817 -100661 -49355
7764 -49355 4077 -3889 30657 68312 81069 50603 8595 19632 19978 6065 37370 86177
7752 86177 56115 8179 -16574 18116 -17222 -22843 16718 24161 228 -76683 -86475 -25321
7740 -25321 45682 44547 -3569 -25527 -41866 -62552 -17898 19901 28055 37049 38242 -18368 -30605
$$ packed form
7824A30902n3849r3478l0075J0822J1445j0469M7555J9336L9182j6648L9509k6726
7812F7506r750L0042N9661j5711l5813k7427l6538l6958K3947K1940j6942L8541
7800F2498P4283L0290j0598j251m1288p9084j6986N507J3578J7183P2592P5366
7788B02090r1103j17635k1739m170m435M3342j2803L7566N5222p98p4679j2343
7776a485M4379M7063M5345K5091k5922m8292o5783m3571q8647k8995M0156N1306
7764d9355N3432p966L4546L7655J2757l0466m2008J1037L46j3913L1305M8807
7752H6177l0062m7936k4753L4690l5338n621L9561P443k3933p6911r792O1154
7740b5321P1003j135m8116k1958j6339k0686M4654L7799Q154Q994J193n6610j2237
$$ plain form
7727 -30605 45903 112942 107173 83209 97695 102463 94078 52744 50985 80719 95370 50281 40025
7714 40025 85785 72190 85682 86033 36431 -63371 -63653 3435 50437 70962 15008 -29827 -28051
7701 -28051 -22359 -8933 14229 75774 96151 59557 35306 113211 129027 99836 45488 69572
7689 69572 58066 44659 27909 -23788 -66100 -66896 -31123 -877 59030 19356 -6872 2466
7677 2466 4155 24331 -25412 67 12565 36697 61098 91292 51146 66070 111737 112970
7665 112970 104835 75865 70266 93868 73188 78109 86564 65157 18411 -49216 -63570 -51695
7653 -51695 -44207 -50508 2894 1212 27439 48369 61020 117910 181336 200456 122186 22362
7641 22362 -24259 -9150 18851 13881 29545 -13008 -41612 30725 85733 81485 68439 52894
$$ packed form
7727c0605P6508O7039n769k3964J4486M768q385m1334j759K9734J4651m5089j0256
7714D0025M5760j3595J3492L51m9602r9802k82O7088M7002K0525n5954m4835J776
7701b8051N692J3426K3162O1545K0377l6594k4251P7905J5816k9191n4348K4084
7689F9572j1506j3407j6750n1697m2312p96L5773L0246N9907l9674k6228R338
7677B466J689K0176m9743K5479J2498K4132K4401L0194m0146J4924M5667J233
7665A12970q135k8970n599K3602k0680M921Q455k1407m6746o7627j4354J1875
7653e1695P488o301N3402j682K6227K0930J2651N6890O3426J9120p8270r9824
7641B2362m6621J5109K8001m970J5664m2553k8604P2337N5008m248j3046j5545
$$ plain form
7629 52894 100543 103146 74063 52578 66923 73694 55058 92866 58384 -37601 -102382 -49201
7617 -49201 35015 46932 95025 60758 6687 45893 53782 61309 95129 74605 51892 79033
7605 79033 81130 42796 33755 50397 60447 62365 -8816 -52848 -62823 -72045 -71043 -80306 -55096
7592 -55096 8740 20597 7328 17721 -24052 -43364 -34928 -11763 13307 41041 80621 71253
7580 71253 57967 86360 46010 33182 74523 23420 35211 83466 69661 94191 103550 60383
7568 60383 26571 85964 101134 81405 36101 -19415 4373 53384 27632 -4043 5934 68515
7556 68515 99299 54116 -921 8163 42868 92272 82139 31792 -8114 -25966 -74039 -62303
7544 -62303 -30195 2714 27459 -1212 -7030 -30954 -40899 -66715 -54007 210 26652 103872
$$ packed form
7629E2894M7649K603k9083k1485J4345O771j8636L7808l4482r5985o4781N3181
7617d9201Q4216J1917M8093l4267n4071L9206P889P527L3820k0524k2713K7141
7605G9033K097l8334r041J6642J0050J918p1181m4032r975r222J002r263K5210
7592e5096O3836J1857j3269J0393m1773j9312Q436K3165K5070K7734L9580r368
7580G1253j3286K8393m0350j2828M1341n1103J1791M8255j3805K4530R359m3167
7568F0383l3812N9393J5170j9729m5304n5516K3788M9011k5752l1675R977O2581
7556F8515L0784m5183n5037R084L4705M9404j0133n0347l9906j7852m8073J1736
7544f2303L2108L2909K4745k8671n818k3924r945k5816J2708N4217K6442P7220
$$ plain form
7532 103872 139102 95463 30919 -22017 -25162 -33441 -8749 11385 32180 30699 19285 175
7520 175 12776 27880 35227 3634 -9418 17745 68343 69776 123021 115897 57600 29363 7058
7507 7058 34040 44344 78853 98675 87842 63278 51483 16721 -1342 62352 63724 51558
7495 51558 67295 68520 35948 11364 9585 7325 -2196 27676 25864 -10097 9165 -31802 -61357
7482 -61357 -45075 28165 124398 74069 45550 63394 93520 69083 53922 72751 75946 10872
7470 10872 16839 31699 54240 40951 -14110 32159 25909 78670 135462 126423 95314 87511 134423
7457 134423 122258 51614 -9932 -94391 -91285 -93350 -56754 -56706 12314 -6446 13936 42791 66186
7444 66186 86668 81394 53753 28296 57701 46829 28375 -42455 -95871 -95286 -22729 4749
$$ packed form
7532A03872L5230m3639o4544n2936l145q279K4692K0134K0795j481j1414j9110
7520A75J2601J5104P347l1593j3052K7163N0598J433N3245p124n8297k8237k2305
7507G058K6982J0304L4509J9822j0833k4564j1795l4762j8063O3694J372j2166
7495E1558J5737J225l2572k4584j779k260r521K9872j812l5961J9262m0967k9555
7482f1357J6282P3240R6233n0329k8519J7844L0126k4437j5161J8829L195o5074
7470A0872N967J4860K2541j3289n5061M6269o250N2761N6792r039l1109p803M6912
7457A34423j2165p0644o1546q4459L106k065L6596M8O9020j8760K0382K8855K3395
7444F6186K0482n274k7641k5457K9405j0872j8454p0830n3416N85P2557K7478
$$ plain form
7432 4749 322 8108 -47110 -98843 -107153 -69488 22726 19281 -7019 -10972 -15109 32364 67985
7419 67985 51174 -1349 -27211 -18004 43308 88399 83218 64684 36010 -56677 -56975 -31836 -19560
7406 -19560 35863 14353 -284 -34166 -71980 -44278 2777 -6932 51646 71104 49035 65190
7394 65190 101898 71219 6156 2887 -7895 70823 103589 78958 29277 32242 32827 -40883 22187
7381 22187 57592 45281 59861 82815 50927 45222 8436 -4131 29835 -39376 -99742 -87493
7369 -87493 -26877 15906 35933 19278 -2432 -30652 22480 15751 -3854 26163 20414 -3926
7357 -3926 18899 100511 114926 81499 42181 246 -48755 -24462 22648 18131 -31367 -15142
7345 -15142 34274 26051 49043 87840 58495 21355 -53787 -83486 -40267 -3073 -9003 -57967
$$ packed form
7432D749m427P786n5218n1733q310L7665R2214l445k6300l953m137M7473L5621
7419F7985j6811n2523k5862R207O1312M5091n181j8534k8674r2687k98K5139J2276
7406a9560N5423k1510j4637l3882l7814K7702M7055r709N8578J9458k2069J6155
7394F5190L6708l0679o5063l269j0782P8718L2766k4631m9681K965N85p3710O3070
7381B2187L5405j2311J4580K2954l1888n705l6786j2567L3966o9211o0366J2249
7369h7493O0616M2783K0027j6655k1710k8220N3132o729j9605L0017n749k4340
7357c926K2825Q1612J4415l3427l9318m1935m9001K4293M7110m517m9498J6225
7345a5142M9416q223K2992L8797k9345l7140p5142k9699M3219L7194n930m8964
$$ plain form
7333 -57967 -73612 -72076 -78525 -79918 -83787 -123552 -139608 -156407 -133271 -58211 -32423 -19307 -18188
7320 -18188 -58811 -69564 -51308 -10759 19199 -6635 -40102 -53147 -38819 -22176 -6916 -69619
7308 -69619 -88698 -41234 -32356 -48286 -56251 -63790 -17516 46984 54850 9331 -8500 -12303 -48411
7295 -48411 -14304 -299 61913 78513 30599 15749 26206 34655 44215 10274 38780 49948
7283 49948 54689 22214 -25713 7373 53786 55182 23996 -4898 -40844 5778 13703 -23348
7271 -23348 -55263 -27107 -41752 -38003 3994 -9195 -66768 -63270 -61023 18702 -8296 18851
7259 18851 -10743 14527 9931 -44225 17352 64245 106320 75943 42592 42381 56611 -33955
7247 -33955 -120835 -116399 -126177 -101791 -63777 -42730 -40017 -17490 2448 10135 7022 3888 17124
$$ packed form
7333e7967j5645J536o449j393l869l9765j6056j6799K3136P5060K5788J3116J119
7320a8188m0623j0753J8256M0549K9958k5834l3467j3045J4328J6643J5260o2703
7308f9619j9079M7464Q878j5930p965p539M6274O4500P866m5519j7831l803l6108
7295d8411L4107J4005O2212J6600m7914j4850J0457Q449R560l3941K8506J1168
7283D9948M741l2475m7927L3086M6413J396l1186k8894l5946M6622P925l7051
7271b3348l1915K8156j4645L749M1997j3189n7573L498K247P9725k6998K7147
7259A8851k9594K5270m596n4156O1577M6893M2075l0377l3351k11J4230r0566
7247c3955q6880M436r778K4386L8014K1047K713K2527J9938P687l113l134J3236
$$ plain form
7234 17124 9818 89762 116591 81126 23299 -22177 -26976 -12192 -9222 -6414 -22568 -77949 -75720
7221 -75720 -91703 -45397 11758 7696 42216 28777 -24480 -22758 -17539 -51207 -52596 -37470 -6167
7208 -6167 4738 27868 -10757 -76173 -60397 -5979 34425 11020 -48050 -111629 -61045 10080
7196 10080 22598 54953 83242 73843 65033 -2657 3394 5921 -10597 10158 23027 -27588 -71125
7183 -71125 -52124 -31312 -19560 35450 17099 19471 -7659 -43113 10286 41811 39130 72393
7171 72393 58058 47583 -13152 -75082 -53907 -3264 16920 48710 27215 -16743 344 20230
7159 20230 -32451 -29919 20540 64053 5254 -3833 -12881 -39708 -41809 -22013 -80309 -76414 5271
7146 5271 26273 -34248 -45090 -41800 -37954 9962 71286 11159 -66501 -51962 -116642 -115154 -90785
$$ packed form
7234A7124p306P9944K6829l5465n7827m5476m799J4784K970K808j6154n5381K229
7221g5720j5983M6306N7155m062L4520j3439n3257J722N219l3668j389J5126L1303
7208f167J0905K3130l8625o5416J5776N4418M0404k3405n9070o3579N0584P1125
7196A0080J2518L2355K8289r399q810o7690O051K527j6518K0755J2869n0615m3537
7183g1125J9001K0812J1752N5010j8351K372k7130l5454N3399L1525k681L3263
7171G2393j4335j0475o0735o1930K1175N0643K0184L1790k1495m3958J7087J9886
7159B0230n2681K532N0459M3513n8799r087r048k6827k101J9796n8296L895Q1685
7146E271K1002o0521j0842L290L846M7916O1324o0127p7660J4539o4680J488K4369
$$ plain form
7133 -90785 -133541 -86585 2651 33383 15615 16412 -36495 -32913 -20459 -2394 39936 20922
7121 20922 -2181 -5729 -63586 -40278 6890 -42327 -32403 -24418 -21325 -20270 -39410 -43441 -41932
7108 -41932 -73683 -90927 -28503 24822 4064 -7089 -29916 -58931 -15478 31851 45254 63205
7096 63205 115859 112363 48947 54119 83943 56702 28958 19724 55666 16196 -51882 -56314 -71343
7083 -71343 -72261 -46877 -3268 2061 -15156 -52435 8857 56103 63250 61539 124409 151982 73024
7070 73024 95442 96401 75921 75443 54010 49747 38127 50299 32144 82376 106709 94398 89738
7057 89738 71784 44788 118092 95376 19138 -57 26339 41980 20407 -24967 763 -13666
7045 -13666 -19216 -44948 -88444 -98099 -82170 -69526 -98822 -51240 -45978 -117661 -127853 -117269
$$ packed form
7133i0785m2756M6956Q9236L0732j7768P97n2907L582J2454J8065M2330j9014
7121B0922k3103l548n7857K3308M7168m9217R924P985L093J055j9140m031J509
7108d1932l1751j7244O2424N3325k0758j1153k2827k9015M3453M7329J3403J7951
7096F3205N2654l496o3416N172K9824k7241k7744r234L5942l9470o8078m432j5029
7083g1343r18K5384M3609N329j7217l7279O1292M7246P147j711O2870K7573p8958
7070G3024K2418R59k0480m78k1433m263j1620J2172j8155N0232K4333j2311m660
7057H9738j7954k6996P3304k2716p6238j9195K6396J5641k1573m5374K5730j4429
7045a3666n550k5732m3496r655J5929J2644k9296M7582N262p1683j0192J0584
$$ plain form
7033 -117269 -54555 -8793 -91383 -168167 -143835 -152883 -157107 -68495 10362 4169 33476 9722
7021 9722 -25517 -52263 -64071 -92037 -59299 -31483 -45876 -33376 -25122 -8157 24872 34438
7009 34438 27128 42604 48054 30401 32851 40367 35159 46082 4692 17555 -8767 32143 42922
6996 42922 -3450 -73841 -79800 -15108 23342 -11786 5319 55929 59959 54111 56070 42489 79551
6983 79551 57009 24636 27048 33047 39877 102603 77616 -240 -79803 -66888 -42245 -8262
6971 -8262 -16908 -36706 -32952 -96275 -71683 -2426 28881 763 -52739 -54114 -29991 -20062 -13150
6958 -13150 -42963 -15212 -51775 6068 43543 33301 -7325 -48808 -31991 -42666 -68528 30047
6946 30047 75329 38382 -3754 7813 41519 17541 29463 3056 6870 -32215 -28491 -33932
$$ packed form
7033a17269O2714M5762q2590p6784K4332r048m224Q8612P8857o193K9307k3754
7021I722l5239k6746j1808k7966L2738K7816j4393J2500Q254J6965L3029R566
7009C4438p310J5476N450j7653K450P516n208J0923m1390J2863k6322M0910J0779
6996D2922m6372p0391n959O4692L8450l5128J7105N0610M030n848J959j3581L7062
6983G9551k2542l2373K412N999O830O2726k4987p7856p9563J2915K4643L3983
6971h262q646j9798L754o3323K4592O9257L1307k8118n3502j375K4123R929O912
6958a3150k9813K7751l6563N7843L7475j0242m0626m1483J6817j0675k5862R8575
6946C0047M5282l6947m2136J1567L3706k3978J1922k6407L814l9085L724n441
$$ plain form
6934 -33932 -50491 -33574 14220 22856 9874 -3041 -52664 -79467 -54949 -52405 -25871 -19689
6922 -19689 -69673 -16570 45893 38448 38404 -14450 -58855 -64008 -48055 -42487 -38963 -22542 24376
6909 24376 13663 1023 -41572 -12193 -13085 3634 35278 94588 93680 48925 65115 100146 83555
6896 83555 95807 42169 47025 -9443 -101029 -87416 -17487 -37995 -40786 -3405 11908 12160 28787
6883 28787 -6935 -5305 -67296 -57439 -2673 27000 -6894 -14701 13526 -10691 9078 -42 52092
6870 52092 103076 64523 36825 54358 47265 -40544 -82517 -16854 14074 76330 57776 23086
6858 23086 37601 44412 47435 21700 6299 -69123 -121917 -101375 -87108 -36003 -25044 -78569
6846 -78569 -90489 -48971 -56285 -25125 19233 221 13673 9847 -47796 -84371 -104460 -28233
$$ packed form
6934c3932j6559J6917M7794Q636j2982j2915m9623k6803K4518K544K6534O182
6922a9689m9984N3103O2463p445m4n2854m4405n153J5953N568L524J6421M6918
6909B4376j0713j2640m2595K9379q92J6719L1644N9310r08m4755J6190L5031j6591
6896H3555J2252n3638M856n6468r1586J3613O9929k0508k791L7381J5313K52J6627
6883B8787l5722J630o1991R857N4766K9673l3894p807K8227k4217J9769r120N2134
6870E2092N0984l8553k7698J7533p093q7809m1973O5663L0928O2256j8554l4690
6858B3086J4515O811L023k5735j5401p5422n2794K0542J4267N1105J0959n3525
6846g8569j1920M1518p314L1160M4358j9012J3452l826n7643l6575k0089P6227
$$ plain form
6834 -28233 -21967 -44332 -10835 12543 65565 42890 42272 18917 29408 55592 50549 17357 23258
6821 23258 87773 110074 66693 88496 139428 151704 93258 71584 69614 35462 38539 38733 11816
6808 11816 -28437 -86642 -110409 -75413 -25920 -45471 -74541 -58636 -29881 -29661 -3961 39536
6796 39536 27515 -14974 -22835 -22123 536 -8719 847 -12017 28295 27758 9058 -869 -72737
6783 -72737 -64803 -94222 -122745 -94862 -79222 -44898 -14710 -15022 10935 -15765 27316 44057
6771 44057 18618 37148 -10890 -69567 -88279 -56968 -37771 -25114 19524 38405 62010 2469
6759 2469 -12429 -16594 -20501 -22209 -47729 -53680 -45111 -18297 -9103 14673 10256 -22900 -12050
6746 -12050 -19490 -48713 -77713 -65255 -41610 24914 50856 74340 36510 -41278 -33409 -26500
$$ packed form
6834b8233O266k2365L3497K3378N3022k2675o18k3355J0491K6184n043l3192N901
6821B3258O4515K2301m3381K1803N0932J2276n8446k1674j970l4152L077J94k6917
6808A1816m0253n8205k3767L4996M9493j9551k9070J5905K8755K20K5700M3497
6796C9536j2021m2489p861P12K2659r255R566j2864M0312n37j8700r927p1868
6783g2737P934k9419k8523K7883J5640L4324L0188l12K5957k6700M3081J6741
6771D4057k5439J8530m8038n8677j8712L1311J9197J2657M4638J8881K3605n9541
6759B469j4898m165l907j708k5520n951Q569K6814R194K3776m417l3156J0850
6746a2050p440k9223k9000J2458K3645O6524K5942K3484l7830p7788P869O909
$$ plain form
6734 -26500 20547 93523 35214 -16825 18573 -29999 -73702 -42019 -1751 88413 108383 100680
6722 100680 132276 126665 79268 46081 101147 78318 -7495 -34099 -36477 23063 73925 57643
6710 57643 94192 132936 93666 59196 21408 38484 78963 113929 93891 68851 6665 -8098
6698 -8098 8750 18624 -16826 -5838 -634 -29313 -57110 -52717 -32923 -11328 -3958 -7400 28182
6685 28182 29120 38929 32944 29590 45193 18048 -17721 -13385 -3574 -9473 -47928 -49437 -4195 -86866
6671 -86866 -87050 -47209 -4420 31647 45901 4141 -35430 -71948 -73695 -32440 -37493 -20534 45475
6658 45475 77804 69582 72076 84972 147433 118214 35892 -3731 15270 15141 20608 -19340 -84700
6645 -84700 -105395 -68877 -24319 -55314 -58849 -16856 837 66013 65812 63872 38090 -18307 -26785
$$ packed form
6734b6500M7047P2976n8309n2039L5398m8572m3703L1683M0268R0164J9970p703
6722A00680L1596n611m7397l3187N5066k2829q5813k6604k378N9540N0862j6282
6710E7643L6549L8744l9270l4470l7788J7076M0479L4966k0038k5040o2186j4763
6698h098J6848R874l5450J0988N204k8679k7797M393J9794K1595P370l442L5582
6685B8182R38R809n985l354J5603k7145l5769M336R811n899l8455j509M5242q2671
6671h6866j84L9841M2789L6067J4254m1760l9571l6518j747M1255n053J6959O6009
6658D5475L2329q222K494J2896O2461k9219q2322l9623J9001j29N467l9948o5360
6645h4700k0695L6518M4558l0995l535M1993J7693O5176k01j940k5782n6397q478
$$ plain form
6632 -26785 -9713 41458 25766 4134 45686 50018 27220 40329 34681 3229 12646 50377
6620 50377 58037 -22820 535 29322 -45900 -57097 -26510 -10654 -5493 -59348 -110817 -66983
6608 -66983 -38442 -25428 -28650 4887 17862 58372 79009 57193 71408 96343 68735 74439
6596 74439 70070 -13276 -56491 -101846 -93864 -20733 -3276 -7583 16222 24937 -22104 -1403 36511
6583 36511 42320 60611 72358 7181 -16300 -43992 -21978 -38567 -35351 56536 44423 8104
6571 8104 -5324 -34136 -39224 -46299 -68705 -95859 -55355 13973 47338 17726 -40554 -87507
6559 -87507 -156576 -101681 -35283 -15708 -34582 -30563 -22425 33328 30884 19485 -21509 13682
6547 13682 43709 111302 127153 76169 99017 66756 12270 21880 20184 86747 118008 89710
$$ packed form
6632b6785J7072N1171j5692k1632M1552M332k2798J3109n648l1452R417L7731
6620E0377P660q0857K3355K8787p5222j1197L0587J5856N161n3855n1469M3834
6608f6983K8541J3014l222L3537J2975M0510K0637k1816J4215K4935k7608N704
6596G4439m369q3346m3215m5355P982P3131J7457m307K3805Q715m7041K0701L7914
6583C6511N809J8291J1747o5177k3481k7692K2014j6589L216R1887j2113l6319
6571H104j3428k8812n088p075k2406k7154M0504O9328L3365k9612n8280m6953
6559h7507o9069N4895O6398J9575j8874M019Q138N5753k444j1399m0994L5191
6547A3682L0027O7593J5851n0984K2848l2261n4486R610j696O6563L1261k8298
$$ plain form
6535 89710 54843 69146 102294 150423 162410 134839 68974 50919 81959 120641 141790 145499
6523 145499 106277 125654 113354 82821 119010 162345 180226 176400 227654 233186 245075 238494
6511 238494 197344 211343 238165 200559 171914 190509 191030 177773 169353 188256 187132 188765 149476
6498 149476 147307 136351 120996 84429 37468 40596 103857 113946 138330 102902 118638 122964
6486 122964 98343 71018 82573 118185 159673 212852 145777 82866 65958 45021 30217 52638
6474 52638 47659 153836 178997 155088 67456 28928 37014 -14882 -12203 11507 25004 -3789
6462 -3789 -4264 -27810 27404 51682 33860 -32290 -23577 -43812 -55724 -29218 -81090 -64507 8869
6449 8869 13863 -6785 5347 34494 97356 148476 135737 113783 110391 165852 203647 178273
$$ packed form
6535H9710l4867J4303L3148M8129J1987k7571o5865j8055L1040L8682K1149L709
6523A45499l9222J9377j2300l0533L6189M3335J7881l826N1254N532J1889o581
6511B38494m1150J3999K6822l7606k8645J8595N21j3257q420J8903j124J633l9289
6498A49476k169j0956j5355l6567m6961L128O3261J0089K4384l5428J5736M326
6486A22964k4621k7325J1555L5612M1488N3179o7075o2911j6908k0937j4804K2421
6474E2638m979J06177K5161k3909q7632l8528Q086n1896K679K3710J3497k8793
6462c789m75k3546N5214K4278j7822o6150Q713k0235j1912K6506n1872J6583P3376
6449H869M994k0648J2132K9147O2862N1120j2739k1954l392N5461L7795k5374
$$ plain form
6437 178273 130608 82822 84186 101436 91608 -2445 -15091 22754 8386 57848 94600 75444
6425 75444 58517 64917 25509 -32233 43181 97078 122790 90657 85204 70625 29663 16890
6413 16890 61589 75835 78398 83371 47962 -9058 42401 69435 14230 -30173 -64511 -31426
6401 -31426 -8449 9313 77588 84399 39688 35971 13425 4009 37240 4382 -19572 -47488
6389 -47488 -15662 28614 20905 -21212 -52338 -63882 -54264 -4953 26551 49953 68386 75597
6377 75597 108411 91008 13703 -13995 -51702 -75425 -87824 -82383 -49938 -20099 17192 66596
6365 66596 16739 21662 98240 59571 77627 108427 109652 58246 23273 -20183 13828 20412
6353 20412 21926 18171 7507 27158 26282 -10923 -61894 -54743 4947 -12418 13848 645 -21122
$$ packed form
6437A78273m7665m7786J364J7250r828r4053j2646L7845j4368M9462L6752j9156
6425G5444j6927O400l9408n7742P5414N3897K5712l2133n453j4579m0962j2773
6413A6890M4699J4246K563M973l5409n7020N1459K7034n5205m4403l4338L3085
6401c1426K2977J7762O8275O811m4711l717k2546r416L3231l2858k3954k7916
6389d7488L1826M4276p709m2117l1126j1544R618M9311L1504K3402J8433P211
6377G5597L2814j7403p7305k7698l7707k3723j2399N441L2445K9839L7291M9404
6365F6596m9857M923P6578l8669J8056L0800J225n1406l4973m3456L4011O584
6353B0412J514l755j0664J9651q76l7205n0971P151N9690j7365K6266j3203k1767
$$ plain form
6340 -21122 -17423 -77703 -144072 -86037 12792 81958 14213 -12456 42027 56812 21899 8144
6328 8144 -28874 -35424 -85648 -71623 -25695 -49145 -90355 -104283 -74399 -38808 -37107 2133
6316 2133 8593 -11886 -56846 -54229 -25843 -41659 -31055 -26840 22911 5152 -19166 -41945 -33985
6303 -33985 -36916 -15998 -10887 -21081 -2863 -22882 -23818 -42779 -49783 -60607 -63043 -27644 -6944
6290 -6944 25663 -19848 4163 15254 36014 -13101 -36613 -7388 -25021 -76932 -65007 -6158
6278 -6158 9480 12587 -4913 -29869 -59184 -141310 -119561 -73690 -45486 -38272 -56648 -69011
6266 -69011 -51549 -48472 -20644 -78951 -125637 -81779 -87977 -64325 -85074 -83341 -55201 26823
6254 26823 57161 33247 32177 17442 22440 24024 -27010 -19843 11013 -9827 33754 2030 -54473
$$ packed form
6340b1122L699o0280o6369N8035R8829O9166o7745k6669N4483J4785l4913j3755
6328H144l7018o550n0224J4025M5928k3450m1210j3928K9884L5591J701L9240
6316B133O460k0479m4960K617K8386j5816J0604M215M9751j7759k4318k2779P960
6303c3985k931K0918N111j0194J8218k0019r36j8961p004j0824k436L5399K0700
6290f944L2607m5511K4011J1091K0760m9115k3512K9225j7633n1911J1925N8849
6278f158J5638L107j7500k4956k9315q2126K1749M5871K8204P214j8376j2363
6266f9011J7462L077K7828n8307m6686M3858o198K3652k0749J733K8140Q2024
6254B6823L0338k3914j070j4735M998J584n1034P167L0856k0840M3581l1724n6503
$$ plain form
6241 -54473 -107904 -111625 -36436 22286 24717 64771 82339 31709 -531 8919 51162 14991
6229 14991 -62869 -98028 -51900 -8371 16746 12470 14933 -21325 -19758 19485 38582 34715 40860
6216 40860 56079 38550 13701 -47119 -68777 -59453 -61887 -48391 -58367 -56206 -45841 13574 38448
6203 38448 -15907 -34086 -21012 -21310 -4533 2322 3909 -8322 6562 -6018 -46733 -53641 -31901
6190 -31901 -34087 -55871 -11754 5983 -8686 17353 38529 18102 25671 31340 52457 43623 -9943
6177 -9943 -30081 -12902 -12130 -26270 -3192 36322 42677 38548 10378 -8368 924 16725 7334
6164 7334 -57453 -105668 -111266 -73848 -127024 -137321 -133100 -143445 -49524 -4148 34900 28295 -5681
6151 -5681 -19762 -19176 22234 43140 66323 59111 31622 -11042 -34442 4267 30581 27374 -24301
$$ packed form
6241e4473n3431l721P5189N8722K431M0054J7568n0630l2240R450M2243l6171
6229A4991p7860l5159M6128M3529K5117m276K463l6258J567L9243J9097l867O145
6216D0860J5219j7529k4849o0820k1658R324k434J3496r976K161J0365N9415K4874
6203C8448n4355j8179J3074k98J6777O855J587j2231J4884j2580m0715o908K1740
6190c1901k186k1784M4117J7737j4669K6039K1176k0427P569N669K1117q834n3566
6177i943k0138J7179P72j4140K3078L9514O355m129k8170j8746R292J5801r391
6164G334o4787m8215n598L7418n3176j0297M221j0345R3921M5376L9048o605l3976
6151e681j4081N86M1410K0906K3183p212k7489m2664k3400L8709K6314l207n1675
$$ plain form
6138 -24301 -65005 -48511 -37929 15701 3451 4565 9850 -21828 -48389 -58320 -47788 -18946
6126 -18946 48479 78051 -14685 -19190 73057 79021 90727 79805 -11337 -75897 -83718 -49142
6114 -49142 10816 15492 -4120 -31946 -55397 -73383 -76863 3174 45786 61215 56776 9955
6102 9955 -29695 -77842 -107007 -106327 -73800 -46817 -48073 -18606 8128 12725 4817 804 -29651
6089 -29651 -70754 -82176 -29873 39930 64452 85425 63672 24368 32177 11762 -22769 9285
6077 9285 -16355 -39405 -13706 -38229 10834 8506 -18978 -26260 4302 -19 -1505 -83646 -96374
6064 -96374 -88864 -50402 -73004 -48788 -61399 -35522 34064 117830 112888 55817 32342 56115
6052 56115 62919 35582 54027 67774 62812 29149 -27728 -23991 -1224 -68228 -90791 -49706
$$ packed form
6138b4301m0704J6494J0582N3630j2250J114N285l1678k6561r931J0532K8842
6126a8946O7425K9572r2736m505R2247N964J1706j0922r1142o4560p821L4576
6114d9142N9958M676j9612k7826k3451j7986l480Q0037M2612J5429m439m6821
6102I955l9650m8147k9165O80L2527K6983j256K9467K6734M597p908m013l0455
6089b9651m1103j1422N2303O9803K4522K0973k1753l9304P809k0415l4531L2054
6077I285k5640k3050K5699k4523M9063k328k7484p282L0562m321j486q2141j2728
6064i6374P510L8462k2602K4216j2611K5877O9586Q3766m942n7071k3475K3773
6052E6115O804k7337J8445J3747m962l3663n6877L737K2767o7004k2563M1085
$$ plain form
6040 -49706 -11328 35336 59662 11132 77513 129772 107450 42079 23205 -10276 46 56683
6028 56683 79469 79992 38087 -28554 -9852 59671 72885 55974 527 5556 53275 -3848
6016 -3848 -11635 -38433 -41932 1735 -31393 -58027 -80242 -70614 -90829 -123392 -113382 -51792 -87470
6003 -87470 -81120 -80004 -44967 -24071 8198 27266 34125 -14558 13853 43388 12793 -11643
5991 -11643 -36530 -9949 -7593 38249 27631 50248 83684 93767 62433 9147 -23343 19639
5979 19639 60486 9858 -24140 -18063 281 -11321 -125103 -135036 -86814 -50349 -73319 -39920
5967 -39920 -39403 4277 32537 21111 31754 -17816 -30090 11122 20276 11322 11473 -45276 -40885
5954 -40885 -42291 -96093 -125973 -109103 -109030 -55355 -62583 -89528 -63655 -47080 19224 80256 73713
$$ packed form
6040d9706L8378M6664K4326m8530O6381N2259k2322o5371j8874l3481J0322N6637
6028E6683K2786N23m1905o6641J8702O9523J3214j6911n5447N029M7719n7123
6016c848p787k6798l499M3667l3128k6634k2215R628k0215l2563J0010O1590l5678
6003h7470O350J116L5037K0896L2269J9068O859m8683K8411K9535l0595k4436
5991a1643k4887K6581K356M5842j0618K2617L3436J0083l1334n3286l2490M2982
5979A9639M0847n0628l3998O077J8344j1602j13782r933M8222L6465k2970L3399
5967c9920N17M3680K8260j1426J0643m9570j2274M1212R154q954J51n6749M391
5954d0885j406n3802k9880J6870P3N3675p228k6945K5873J6575O6304O1032o543
$$ plain form
5941 73713 62823 36365 -39995 -61282 -6168 47322 71481 63622 70821 66744 6568 20295
5929 20295 18616 -9900 -41558 -71730 -15329 -20061 -77205 -62314 -38322 -67582 -18515 -21865
5917 -21865 -16423 20250 48769 8483 19416 57763 87850 112802 131368 98489 33723 8326
5905 8326 30960 80900 138819 151224 69031 32969 24703 35817 4601 26102 35817 18900
5893 18900 48953 63572 89763 67975 20790 -27646 -28387 -47217 -39536 -81251 -124307 -135676
5881 -135676 -81104 -49527 9140 34818 31816 19068 -11342 2421 53915 32302 4684 34609
5869 34609 89814 52725 35035 36896 42105 49901 43720 4466 -4768 17583 27697 -20563 -47331
5856 -47331 -35054 -32491 -8176 -26585 -54314 -40956 -11817 -25439 8045 12524 -10145 -22145
$$ packed form
5941G3713j0890k6458p6360k1287N5114N3490K4159p859P199m077o0176J3727
5929B0295j679k8516l1658l0172N6401m732n7144J4891K3992k9260M9067l350
5917b1865N442L6673K8519m0286J0933L8347L0087K4952J8566l2879o4766k5397
5905H326K2634M9940N7919J2405q2193l6062q266J1114l1216K1501R715j6917
5893A8900L0053J4619K6191k1788m7185m8436p41j8830P681m1715m3056j1369
5881a35676N4572L1577N8667K5678l002j2748l0410J3763N1494k1613k7618K9925
5869C4609N5205l7089j7690J861N209P796o181l9254r234K2351J0114m8260k6768
5856d7331J2277K563K4315j8409k7729J3358K9139j3622L3484M479k2669j2000
$$ plain form
5844 -22145 37298 24782 15127 86462 90658 68430 16970 40913 58125 -2042 -55028 -54059 26378
5831 26378 65282 38450 90622 82141 44421 -12456 -13813 -73322 -42564 26880 44703 -11338
5819 -11338 -49881 -48582 -52452 -29356 -44158 -44526 -34434 -38384 -47429 -6962 5700 61086 35969
5806 35969 -1817 35651 19637 -58233 -42503 -8693 -2306 6726 -37746 -47048 -70793 -122592
5794 -122592 -91063 -24813 -62928 -62256 -88663 -123432 -160858 -138543 -32395 -29256 -36054 -62864
5782 -62864 -84383 -85316 -46407 -66928 -66300 -62751 -23498 19242 25078 22173 -21198 -59363 -27058
5769 -27058 -25251 -77054 -75608 -34643 -32462 -77688 -41267 46730 70666 25067 12083 20677 40364
5756 40364 59493 -50871 -92812 -100487 -111174 -30029 5904 -11511 -20777 58839 94051 121598
$$ packed form
5844b2145N9443j2516r655P1335M196k2228n1460K3943J7212o0167n2986R69Q0437
5831B6378L8904k6832N2172q481l7720n6877j357n9509L0758O9444J7823n6041
5819a1338l8543J299l870K3096j4802l68J0092l950r045M0467J2662N5386k5117
5806C5969l7786L7468j6014p7870J5730L3810O387R032m4472r302k3745n1799
5794a22592L1529O6250l8115O72k6407l4769l7426K2315J06148L139o798k6810
5782f2864k1519r33L8909k0521O28L549L9253M2740N836k905m3371l8165L2305
5769b7058J807n1803J446M0965K181m5226L6421Q7997K3936m5599j2984Q594J9687
5756D0364J9129j10364m1941p675j0687Q1145L5933j7415r266P9616L5212K7547
$$ plain form
5744 121598 131673 91508 51569 25504 -16235 -17336 19438 6403 -39902 -39278 -16512 -54299
5732 -54299 -70070 1372 19223 9007 -3211 -3139 -23415 -37240 -38304 -3292 -24853 -64401 -107931
5719 -107931 -139866 -44712 -14679 -91641 -72567 2087 -18079 -73156 -96766 -81105 -99592 -122142
5707 -122142 -143407 -120771 -99290 -72827 -62076 -52251 -56385 -15744 -31953 -103147 -191394 -222999
5695 -222999 -188439 -145099 -114977 -21358 64136 121171 144290 110227 77046 47722 69521 91536
5683 91536 88152 57493 38638 14502 -58016 -75165 -33515 -39007 -36967 -55966 -38248 -41943 -16494
5670 -16494 39931 91763 45056 -33377 -22631 23186 41361 12611 -6009 -15442 -65093 -33552
5658 -33552 -20383 7091 -5276 -30337 -38311 -20217 49553 33357 49927 36542 68377 67063
$$ packed form
5744A21598J0075m0165l9939k6065m1739j101L6774j3035m6305O24K2766l7787
5732e4299j5771P1442J7851j0216j2218P2k0276j3825j064L5012k1561l9548m3530
5719a07931l1935R5154L0033p6962J9074P4654k0166n5077k3610J5661j8487k2550
5707a22142k1265K2636K1481K6463J0751R825m134M0641j6209p1194q8247l1605
5695b22999L4560M3340L0122R3619Q5494N7035K3119l4063l3181k9324K1799K2015
5683I1536l384l0659j8855k4136p2518j7149M1650n492K040j8999J7718l695K5449
5670a6494N6425N1832m6707p8433J0746M5817J8175k8750j8620r433m9651L1541
5658c3552J3169K7474j2367k5061p974J8094O9770j6196J6570j3385L1835j314
$$ plain form
5646 67063 129926 93621 35321 -42424 -50914 -24874 -13127 -83073 -89059 14249 72054 77915
5634 77915 81274 77222 -1313 -96571 -82148 -101460 -43607 32794 66223 114431 98840 32066
5622 32066 -9887 -5890 -59014 -39312 16206 17067 -13195 -29591 49108 64949 5935 -12237
5610 -12237 20666 -18707 -53145 -42984 1032 -20038 -8219 16453 -8787 -47283 -76228 -33319
5598 -33319 -1143 -18230 -38927 -52619 -52562 -79780 -78647 -105183 -94002 -4669 26500 -42136 -62601
5585 -62601 -21816 -7719 -2099 -4661 11181 56364 51950 36377 -16654 -54085 -43174 -83673
5573 -83673 -131607 -95155 -37799 26552 16420 -7076 7300 -40693 -70948 -75807 -11708 42430
5561 42430 55933 -31750 -43709 -14709 -54201 -125910 -141603 -168579 -157342 -97467 -41736 -69696
$$ packed form
5646F7063O2863l6305n8300p7745q490K6040J1747o9946n986J03308N7805N861
5634G7915L359m052p8535r5258J4423j9312N7853P6401L3429M8208j5591o6774
5622C2066m1953L997n3124J9702N5518Q61l0262j6396P8699J5841n9014j8172
5610a2237L2903l9373l4438J0161M4016k1070J1819K4672k5240l8496k8945M2909
5598c3319L2176j7087k0697j3692N7k7218J133k6536J1181Q9333L1169o8636k0465
5585f2601M0785J4097N620k562J5842M5183m414j5573n3031l7431J0911m0499
5573h3673m7934L6452N7356O4351j0132k3496J4376m7993l0255m859O4099N4138
5561D2430J3503q7683j1959K9000l9492p1709j5693k6976J1237N9875N5731k7960
$$ plain form
5549 -69696 -56869 -44094 -68289 -75028 -74405 -43958 -16576 -18443 -71305 -140667 -93842 -19625 -9939
5536 -9939 -13547 12797 28231 -25463 -50092 -28424 -43898 -74678 -42891 -25145 -22677 -19621 -58201
5523 -58201 -22099 -15183 -19619 1375 21453 4284 4316 -18552 -18116 9474 -34845 12882 -2929
5510 -2929 -20537 -15246 -21441 -56340 -10250 -29846 -36554 -12700 -21846 -17034 -33351 -75227 -103691
5497 -103691 -50204 -17002 -53341 -73510 -74325 -143411 -126630 -54036 6109 69241 82730 -5336
5485 -5336 -26786 -46278 -71306 -64599 -69727 -22321 24909 -14022 -52167 -36511 -16818 -3418
5473 -3418 6196 24872 40014 -40795 -27023 27638 97923 135274 101835 1431 -47103 -59701
5461 -59701 -25274 -55797 -80839 -20425 29051 99419 86288 16313 -41433 -60431 -62027 -11772
$$ packed form
5549f9696J2827J2775k4195o739O23L0447K7382j867n2862o9362M6825P4217R686
5536i939l608K6344J5434n3694k4629K1668j5474l0780L1787J7746K468L056l8580
5523e8201L6102O916m436K0994K0078j7169L2k2868M36K7590m4319M7727j5811
5510b929j7608N291o195l4899M6090j9596o708K3854r146M812j6317m1876k8464
5497a03691N3487L3202l6339k0169q15o9086J6781P2594O0145O3132J3489q8066
5485e336k1450j9492k5028O707n128M7406M7230l8931l8145J5656J9693J3400
5473c418R614J8676J5142q0809J3772N4661P0285L7351l3439j00404m8534j2598
5461e9701L4427l0523k5042O0414M9476P0368j3131o9975n7746j8998j596N0255
$$ plain form
5449 -11772 -50044 -48899 -71104 -27772 43028 45657 37321 20646 -2531 -43326 -8090 -7503 -38650
5436 -38650 -25379 -11435 -53536 -85058 -74265 19642 44661 31177 10737 9812 5901 24952
5424 24952 8462 26480 33826 -36596 -65143 -134816 -90314 -52451 -11490 3438 37436 -8706
5412 -8706 -39209 -41353 -62476 -36318 -6252 19240 60034 62050 94105 99709 104767 70693 75940
5399 75940 74370 53075 -3591 -54291 -101742 -157667 -146981 -96104 -64979 -66791 -55727 -46107
5387 -46107 -73963 -27457 -8552 -72234 -36655 19906 -49280 -87921 -69453 -119405 -126139 -135065
5375 -135065 -128444 -139153 -161780 -112943 -81253 -82090 -68870 -68469 6636 34591 47575 56887 8809
5362 8809 4256 14653 63999 97054 117482 46585 -9056 -5097 -7222 48176 96798 88695 41396
$$ packed form
5449a1772l8272J145k2205M3332P0800K629q336j6675k3177m0795L5236N87l1147
5436c8650J3271J3944m2101l1522J0793R3907K5019j3484k0440r25l911J9051
5424B4952j6490J8018P346p0422k8547o9673M4502L7863M0961J4928L3998m6142
5412h706l0503k144k1123K6158L0066K5492M0794K016L2055N604N058l4074N247
5399G5940j570k1295n6666n0700m7451n5925J0686N0877L1125j812J1064R620
5387d6107k7856M6506J8905o3682L5579N6561o9186l8641J8468m9952o734q926
5375a35065O621j0709k2627M8837L1690q37J3220M01P5105K7955J2984R312m8078
5362H809m553J0397M9346L3055K0428p0897n5641L959k125N5398M8622q103m7299
$$ plain form
5349 41396 -11099 -17496 -29025 -35175 -69052 -38191 28061 34227 -2118 -4728 -46572 -103550 -57257
5336 -57257 67568 101824 78629 50088 7180 6330 -85003 -75219 -37490 32203 17564 -30807
5324 -30807 -39284 10859 10882 -5397 13741 26018 31886 85832 129981 24832 -69578 -61194 -11718
5311 -11718 -28924 -64493 -58336 8481 24501 -17589 -39184 -47917 -38774 37206 99004 85201
5299 85201 63920 27246 -579 34250 36944 32386 -35393 -108729 -34439 24160 -24532 -75302
5287 -75302 -106872 -172485 -148609 -135631 -111546 -91503 -133975 -144437 -54700 -56280 -70706 -48295
5275 -48295 -66076 337 44214 -2638 10923 50381 44852 46920 23354 -37075 -62493 -86989
5263 -86989 -53418 -23261 -23336 -55043 -45823 -58590 -36592 -40541 -21121 -7586 17597 41207 36167
$$ packed form
5349D1396n2495o397j1529o150l3877L0861O6252O166l6345k610m1844n6978M6293
5336e7257J24825L4256k3195k8541m2908q50r1333R784L7729O9693j4639m8371
5324c0807q477N0143K3j6279J9138J2277N868N3946M4149j05149r4410Q384M9476
5311a1718j7206l5569O157O6817J6020m2090k1595q733R143P5980O1798j3803
5299H5201k1281l6674k7825L4829K694m558o7779p3336P4290N8599m8692n0770
5287g5302l1570o5613K3876J2978K4085K0043m2472j0462Q9737j580j4426K2411
5275d8295j7781O6413M3877m6852J3561L9458n529K068k3566o0429k5418k4496
5263h6989L3571L0157p5l1707R220j2767K1998l949J9420J3535K5183K3610n040
$$ plain form
5250 36167 -12722 -16885 -9974 -3918 26470 47569 24165 -7174 -55236 -13906 37270 -30768
5238 -30768 -63846 -80722 -129160 -105548 -46285 -86136 -108242 -88518 -56897 -27573 -23587 30824
5226 30824 95906 56637 -23724 -39805 -12815 29510 20444 11282 32588 35558 -7233 -9915 23540
5213 23540 28053 -4237 -23911 -9915 -4092 49327 77883 68741 43575 16426 2889 19714
5201 19714 4222 3269 -15985 -38297 -45424 -81070 -59845 -25805 -46300 -111086 -127875 -91283
5189 -91283 -49456 -8814 -369 -65734 -43237 -19338 -47039 -16716 -31398 -33378 10918 818
5177 818 -11020 -41319 586 -2665 -86169 -140753 -59203 -64469 -59355 7241 62436 65610 -9876
5164 -9876 -32588 -61479 -10639 45237 26178 41327 49721 -36974 -46480 -10621 -32050 -65192
$$ packed form
5250C6167m8889m163O911O056L0388K1099k3404l1339m8062M1330N1176o8038
5238c0768l3078j6876m8438K3612N9263l9851k2106J9724L1621K9324L986N4411
5226C0824O5082l9269q0361j6081K6990M2325r066r162K1306K970m2791k682L3455
5213B3540M513l2290j9674J3996N823N3419K8556r142k5166k7149j3537J6825
5201A9714j5492r53j9254k2312p127l5646K1225L4040k0495o4786j6789L6592
5189i1283M1827M0642Q445o5365K2497K3899k7701L0323j4682j980M4296j0100
5177H18j1838l0299M1905l251q3504n4584Q1550n266N114O6596N5195L174p5486
5164i876k2712k8891N0840N5876j9059J5149Q394q6695r506L5859k1429l3142
$$ plain form
5152 -65192 -56490 -6323 19291 42770 18406 11098 61905 63117 -23973 -139218 -204166 -179215
5140 -179215 -94043 -30250 -11679 -28564 -52612 6440 58364 67474 13660 5787 14128 -18195
5128 -18195 -63656 -79718 -39483 -11564 -35727 -28962 -28025 -38174 1163 -23305 443 49334
5116 49334 39163 56596 115975 97717 18226 -55924 -61958 -34963 -39464 -20405 20547 58739
5104 58739 69503 18512 44908 37235 46721 25832 -24293 -30773 -77592 -113701 -97500 -155211
5092 -155211 -164234 -118762 -71406 -41205 -25493 -26267 -22509 -32080 14106 6573 18098 77490 61157
5079 61157 18305 35165 46058 34873 28477 10350 29115 60845 -77 6256 13586 10218 724
5066 724 -42692 -51673 -62770 -80736 -104975 -64744 -37735 -38135 -75001 -85758 -93497 -118323 -86968
$$ packed form
5152f5192Q702N0167K5614K3479k4364p308N0807J212q7090j15245o4948K4951
5140a79215Q5172O3793J8571j6885k4048N9052N1924R110n3814p873Q341l2323
5128a8195m5461j6062M0235K7919k4163O765R37j0149L9337k4468K3748M8891
5116D9334j0171J7433N9379j8258p9491p4150o034K6995m501J9059M0952L8192
5104E8739J0764n0991K6396p673R486k0889n0125o480m6819l6109J6201n7711
5092a55211r023M5472M7356L0201J5712p74L758r571M6186p533J1525N9392j6333
5079F1157m2852J6860J0893j1185o396j8127J8765L1730o0922O333P330l368r494
5066G24m3416q981j1097j7966k4239M0231K7009m00l6866j0757p739k4826L1355
$$ plain form
5053 -86968 -61376 -27755 41234 -6993 -25997 -5537 -20030 -83318 -70085 -20617 34925 13950
5041 13950 -74483 -68658 -49724 -68226 -10899 55990 28311 41043 2210 -38787 -79075 -126476
5029 -126476 -96239 -57710 -64956 -54079 -56129 -52323 -35707 36603 91831 44078 2661 -42918
5017 -42918 -9491 -11302 -21231 -62640 -66793 -9526 -36057 -74964 -92896 -75138 -13964 21110
5005 21110 46086 16177 -33973 -86397 -112591 -115645 -67740 -18578 -28086 -27557 -47134 -68861 -58088
4992 -58088 -25885 -23268 -15476 -5643 36015 55938 99334 61020 31995 41960 47842 47241 11498
4979 11498 -62274 -112287 -63277 -914 9809 -38142 -79110 -35898 15272 24101 6402 11600
4967 11600 -60717 -29958 -42891 -9255 906 2501 72898 78883 70892 24182 -16181 1379
$$ packed form
5053h6968K5592L3621O8989m8227j9004K0460j4493o3288J3233M9468N5542k0975
5041A3950q8433N825J8934j8502N7327O6889k7679J2732l8833m0997m0288m7401
5029a26476L0237L8529p246J0877k050L806J6616P2310N5228m7753m1417m5579
5017d2918L3427j811r929m1409m153N7267k6531l8907j7932J7758O1174L5074
5005B1110K4976k9909n0150n2424k6194l054M7905M9162r508N29j9577k1727J0773
4992e8088L2203K617P792R833M1658J9923M3396l8314k9025R965N882o01l5743
4979A1498p3772n0013M9010O2363J0723m7951m0968M3212N1170Q829j7699N198
4967A1600p2317L0759j2933L3636J0161J595P0397N985p991m6710m0363J7560
$$ plain form
4955 1379 -36695 187 -4716 -31644 -56777 -71119 -928 -13758 -8103 59109 59848 30293 13954
4942 13954 67079 115284 59858 -20489 -55177 -74822 -65156 -80714 -88199 -60599 -59989 -48718 7103
4929 7103 -5548 -6440 36111 26104 64343 21599 -10085 34956 56158 35318 -25627 -81091
4917 -81091 -125805 -132415 -107849 -89064 -59260 -28181 -98296 -150825 -145205 -101787 -74960 -39765
4905 -39765 663 41318 44208 3169 -60879 -59316 -37478 -36393 18111 53037 40750 -556
4893 -556 -12714 -25635 -32772 -48047 -92942 -54058 -36531 3086 -12813 -16912 -16757 -14645 57839
4880 57839 70364 -20489 -30077 -34115 -56287 -98497 -115655 -117540 -116410 -34753 26731 -22193 -55350
4867 -55350 -55438 -48385 -35821 -38821 22682 37320 49191 63467 70734 20378 -7533 -12641 -23785
$$ packed form
4955A379l8074L6882m903k6928k5133j4342P0191j2830N655O7212P39k9555j6339
4942A3954N3125M8205n5426q0347l4688j9645R666j5558p485K7600O10J1271N5821
4929G103j2651q92M2551j0007L8239m2744l1684M5041K1202k0840o0945n5464
4917h1091m4714o610K4566J8785K9804L1079p0115n2529N620M3418K6827L5195
4905c9765M0428M0655K890m1039o4048J563K1838J085N4504L4926j2287m1306
4893e56j2158j2921p137j5275m4895L8884J7527L9617j5899m099J55K112P2484
4880E7839J2525r0853r588m038k2172m2210j7158j885J130Q1657O1484m8924l3157
4867e5350q8P053J2564l000O1503J4638J1871J4276P267n0356k7911n108j1144
$$ plain form
4854 -23785 -26323 -46714 -38636 -5520 40520 -4328 -35691 -36597 -63901 -263 14849 8265 27637
4841 27637 33056 19965 11101 34779 58081 1977 -39441 -52626 -60942 -74070 -11458 -39527
4829 -39527 -22479 -22230 9376 -161 -69085 -56949 -66933 -74008 -63838 -45896 -6244 58451 67200
4816 67200 6079 -49447 -143836 -123763 -72966 -84234 -69305 -82773 -149349 -146228 -119685 -125854
4804 -125854 -76684 -55944 -96477 -140520 -98841 -86515 -50634 -66893 -67598 -67521 25946 36502 45685
4791 45685 46894 33415 39044 73077 103183 64142 22996 -76183 -82558 -2521 -9697 -14244 -60875
4778 -60875 -45369 -24462 -39785 15632 14805 10174 25491 33841 -31467 -99542 -66866 -32816 -59218
4765 -59218 -102255 -52556 10817 17666 -23112 -42430 -31291 -63894 -49629 12779 28579 31859
$$ packed form
4854b3785k538k0391Q078L3116M6040m4848l1363r06k7304O3638J5112o584J9372
4841B7637N419j3091q864K3678K3302n6104m1418j3185q316j3128O2612k8069
4829c9527J7048K49L1606r537o8924J2136r984p075J0170J7942L9652O4695Q749
4816F7200o1121n5526r4389K0073N0797j1268J4929j3468o6576L121K6543o169
4804a25854M9170K0740m0533m4043M1679J2326L5881j6259p05P7R3467J0556R183
4791D5685J209j3479N629L4033L0106l9041m1146r9179o375Q0037p176m547m6631
4778f0875J5506K0907j5323N5417q27m631J5317Q350o5308o8075L2676L4050k6402
4765e9218m3037M9699O3373O849m0778j9318J1139l2603J4265O2408J5800L280
$$ plain form
4753 31859 14032 22632 31524 29038 34151 43932 60294 47561 -26418 -111830 -124991 -122259 -112786
4740 -112786 -76174 -20502 -12864 13397 -34631 -71035 -28010 -22496 -82007 -91814 -72094 -32134
4728 -32134 -44282 -86150 -101546 -104268 -118684 -13312 21278 78122 63894 2174 20832 52552
4716 52552 72547 88909 42379 50889 -7206 -43755 -5651 -44774 -104306 -35909 12143 63018
4704 63018 97892 86444 63670 108601 111173 93073 57991 5253 19292 13710 41112 16180
4692 16180 1724 -20943 -8817 2873 4037 -35251 -62431 -77428 -75800 -42249 -14662 -13047
4680 -13047 37772 18395 14263 27814 -29683 -32261 -9952 -60373 -72995 -66355 -31789 -52942
4668 -52942 -105319 -67158 -10054 -9816 -18964 -23044 1033 -637 18016 62544 42022 22999 42227
$$ packed form
4753C1859j7827Q600Q892k486N113R781J6362j2733p3979q5412j3161K732R473
4740a12786L6612N5672P638K6261m8028l6404M3025N514n9511r807J9720L9960
4728c2134j2148m1868j5396k722j4416J05372L4590N6844j4228o1720J8658L1720
4716E2552J9995J6362m6530Q510n8095l6549L8104l9123n9532O8397M8052N0875
4704F3018L4874j1448k2774M4931K572j8100l5082n2738J4039n582K7402k4932
4692A6180j4456k2667J2126J1690J164l9288k7180j4997J628L3551K7587J615
4680a3047N0819j9377m132J3551n7497k578K2309n0421j2622O640L4566k1153
4668e2942n2377L8161N7104K38r148m080K4077j670J8653M4528k0522j9023J9228
$$ plain form
4655 42227 23293 -15163 -50139 -44621 -46053 -26322 -31077 -77950 -81609 -41736 -48248 -55509 -57016
4642 -57016 -65627 -94940 -80267 -67733 -112776 -169123 -168336 -125975 -96385 -95649 -63554 -35478 -34827
4629 -34827 -12164 -9272 -39094 -23410 -5293 -40821 -46008 -44140 -67563 -8759 82340 78940 18493
4616 18493 -7922 2713 28214 31461 -4148 -12141 813 -22544 -55148 -10398 -45675 -8064
4604 -8064 -10811 -4929 19321 48752 -12607 -21922 9490 -21589 -37142 -53216 -61335 -111239 -124672
4591 -124672 -73814 -68162 -71980 -34892 -7071 -27561 23496 83586 126393 135733 79525 58426
4579 58426 32923 -1290 4125 33724 104972 79220 43477 -12374 42385 58939 40342 -1748
4567 -1748 -33093 -50884 -57176 -37783 -13965 -36213 16218 21238 19957 38625 52301 38965 91907
$$ packed form
4655D2227j8934l8456l4976N518j432J9731m755m6873l659L9873o512p261j507
4642e7016q611k9313J4673J2534m5043n6347P87M2361K9590P36L2095K8076O51
4629c4827K2663K892k9822J5684J8117l5528n187J868k3423N8804R1099l400o0447
4616A8493k6415J0635K5501L247l5609p993J2954k3357l2604M4750l5277L7611
4604h064k747N882K4250K9431o1359r315L1412l1079j5553j6074q119m9904j3433
4591a24672N0858N652l818L7088K7821k0490N1057O0090M2807R340n6208k1099
4579E8426k5503l4213N415K9599P1248k5752l5743n5851N4759J6554j8597m2090
4567a748l1345j7791o292J9393K3818k2248N2431N020j281J8668J3676j3336N2942
$$ plain form
4554 91907 77458 21434 21743 49557 36765 40682 8911 -2884 -12197 6464 -11915 -48798 -32547
4541 -32547 5630 22424 50536 -10439 -46525 -11995 -578 -1431 -61232 -65280 -18255 -23365 -79061
4528 -79061 -87553 -79743 -96173 -65776 -51356 -49685 -40814 -12722 -50978 -97378 -114559 -171255 -147140
4515 -147140 -98988 -81906 -49916 -28376 57102 103203 61312 31997 37085 2337 11061 21884
4503 21884 -1995 -17276 15696 -14287 12412 17906 20985 29692 38813 9981 -43841 -108068 -95056
4490 -95056 -85197 -42612 1168 -16022 -32184 -27888 -50472 9292 34837 26632 3165 -39205
4478 -39205 -50817 -47629 -31991 -823 -37353 -128015 -166236 -144601 -75624 -97937 -71212 -50186
4466 -50186 -28990 2135 -4786 -23681 56648 46199 9134 3471 -50183 -51150 -54501 -17619 18916
$$ packed form
4554I1907j4449n6024L09K7814j2792L917l1771j1795r313J8661j8379l6883J6251
4541c2547L8177J6794K8112o0975l6086L4530J1417q53n9801m048M7025n110n5696
4528g9061q492P810j6430L0397J4420J671Q871K8092l8256m6400j7181n6696K4115
4515a47140M8152J7082L1990K1540Q5478M6101m1891k9315N088l4748Q724J0823
4503B1884k3879j5281L2972k9983K6699N494L079Q707R121k8832n3822o4227J3012
4490i5056R859M2585M3780j7190j6162M296k2584N9764K5545q205k3467m2370
4478c9205j1612L188J5638L1168l6530r0662l8221K1635O8977k2313K6725K1026
4466e0186K1196L1125o921j8895Q0329j0449l7065n663n3654r67l351L6882L6535
$$ plain form
4453 18916 31417 42423 16179 -16546 -46310 -88878 -128759 -125292 -83895 -53438 -16591 -218
4441 -218 -6282 -25193 -41809 -27060 -19027 -62038 -120887 -126283 -92715 -58937 -44896 -30994 -47311
4428 -47311 -28623 -32788 -111683 -133846 -82153 -89791 -93662 -31006 28668 22817 -18647 -92470 -100344
4415 -100344 -56776 -3172 3722 91483 53252 -31300 -102086 -112754 -126630 -76360 11861 52117
4403 52117 66083 56942 17333 -32292 -43767 -35151 -87951 -68324 -66772 -14547 761 2948 106073
4390 106073 159692 96150 57156 60967 61540 61289 25809 6439 -7004 -24157 882 -23799 -31385
4377 -31385 -5974 3130 -48584 -56376 -64106 -38548 -16754 20623 62740 28731 30500 50980 31319
4364 31319 -6031 -13437 48210 69910 -28939 -117467 -74579 -30978 8935 12549 -15311 -14534 11098
$$ packed form
4453A8916J2501J1006k6244l2725k9764m2568l9881L467M1397L0457L6847J6373
4441b18o064j8911j6616J4749Q033m3011n8849n396L3568L3778J4041J3902j6317
4428d7311J8688m165p8895k2163N1693p638l871O2656N9674n851m1464p3823p874
4415a00344M3568N3604O894Q7761l8231q4552p0786j0668j3876N0270Q8221M0256
4403E2117J3966r141l9609m9625j1475Q616n2800J9627J552N2225J5308K187J03125
4390A06073N3619o3542l8994L811N73k51l5480j9370j3443j7153K5039k4681p586
4377c1385K5411R104n1714p792p730K5558K1794L7377M2117l4009J769K0480j9661
4364C1319l7350p406O1647K1700r8849q8528M2888M3601L9913L614k7860P77K5632
$$ plain form
4351 11098 -24760 -66384 19682 51915 98156 82774 65892 14727 21142 -6980 10027 19380
4339 19380 35293 82651 85224 23885 -23081 3317 52703 53408 15347 22894 -34141 -30008 -18736
4326 -18736 -37883 -79062 -19348 -173 -33674 11540 12355 35165 23812 19972 -22438 -43018
4314 -43018 -30892 -52914 -41818 -30283 -7719 -58860 -120631 -122347 -92688 -41978 -12149 38886
4302 38886 89873 84728 96297 61200 -34986 -89514 -21066 17291 31424 63897 65728 22565
4290 22565 4064 1700 42390 2265 -20284 -1478 -14914 -44775 -82767 -93946 -101941 -139515
4278 -139515 -106766 -63253 -54894 23566 96499 57454 -15849 -21371 -11112 -671 -16200 -5205
4266 -5205 -20083 -23230 -20464 -15310 -29228 -42097 7802 41212 56536 66676 98001 63734 4859
$$ packed form
4351A1098l5858m1624Q6066L2233M6241j5382j6882n1165O415k8122J7007R353
4339A9380J5913M7358K573o1339m6966K6398M9386P05l8061P547n7035M133J1272
4326a8736j9147m1179N9714J9175l3501M5214Q15K2810j1353l840m2410k0580
4314d3018J2126k2022J1096J1535K2564n1141o1771j716K9659N0710K9829N1035
4302C8886N0987n145J1569l5097r6186n4528O8448L8357J4133L2473J831m3163
4290B2565j8501k364M0690m0125k2549J8806j3436k9861l7992j1179p995l7574
4278a39515L2749M3513Q359P8460P2933l9045p3303n522J0259J0441j5529J0995
4266e205j4878l147K766N154j3918j2869M9899L3410J5324J0140L1325l4267n8875
$$ plain form
4253 4859 9839 -18067 -5169 -58729 -49182 18677 39539 42867 54195 1990 6920 4586 -41909
4240 -41909 -99545 -93758 -81355 -108719 -138854 -92770 -59999 -57372 -42011 45896 41168 53328
4228 53328 39450 25358 -7780 9595 27791 96462 58325 -25048 -2826 32762 43989 20024
4216 20024 -56611 -31411 -15632 -21535 12464 51363 61626 66177 56174 60419 99860 94181 5391
4203 5391 -4396 93814 116968 33789 -15868 38586 44506 53409 96692 64091 26451 51238 27503
4190 27503 14318 -31591 -79867 -74914 -67099 -49585 -33715 -51818 -55525 -74714 -64972 -63263 -27303
4177 -27303 -8967 -76191 -95856 -138 67814 71951 76502 63150 65462 58383 121517 78568 45101
4164 45101 33460 19496 -13990 -56909 -26311 33684 18250 -10025 -30617 -92580 -53003 -38869
$$ packed form
4253D859M980k7906J2898n3560R547O7859K0862L328J1328n2205M930k334m6495
4240d1909n7636N787J2403k7364l0135M6084L2771K627J5361Q7907m728J2160
4228E3328j3878j4092l3138J7375J8196O8671l8137q3373K2222L5588J1227k3965
4216B0024p6635K5200J5779n903L3999L8899J0263M551j0003M245L9441n679q8790
4203E391r787R8210K3154q3179m9657N4454N920Q903M3283l2601l7640K4787k3735
4190B7503j3185m5909m8276M953P815J7514J5870j8103l707j9189R742J709L5960
4177b7303J8336o7224j9665R5718O7952M137M551j3352K312p079O3134m2949l3467
4164D5101j1641j3964l3486m2919L0598N9995j5434k8275k0592o1963L9577J4134
$$ plain form
4152 -38869 -32263 -19767 -14178 -27675 10405 79329 119795 108253 94827 87575 96487 28066 -4488
4139 -4488 -37667 -78273 -94618 -125130 -143799 -128997 -71213 4547 60694 24044 -34762 -30393
4127 -30393 -21256 -65990 -96913 -118041 -49675 -4078 -13758 -58001 -42093 -38989 -57033 -24376
4115 -24376 -41880 -47869 -44363 -90236 -116381 -100939 -44254 -85470 -52339 7815 18623 10619
4103 10619 -26858 -45167 -71196 -37037 -77226 -44341 -5156 41635 -15110 -35116 34548 24793
4091 24793 -25031 -42111 -55757 -2075 -15377 -16840 -29545 -46391 -29417 -7225 -9228 -56522
4079 -56522 -95876 -78621 -28206 -18089 -52272 -34863 -27946 1039 55765 49780 82563 91449
4067 91449 45041 43449 41757 37927 -18659 -37435 -43286 -29099 -49427 -74713 -115465 -64757 -32470
$$ packed form
4152c8869O606J2496N589j3497L8080O8924M0466j1542j3426p252Q912o8421l2554
4139d488l3179m0606j6345l0512j8669J4802N7784P5760N6147l6650n8806M369
4127c0393R137m4734l0923k1128O8366M5597r680m4243J5908L104j8044L2657
4115b4376j7504n989L506m5873k6145J5442N6685m1216L3131O0154J0808q004
4103A0619l7477j8309k6029L4159m0189L2885L9185M6791n6745k0006O9664r755
4091B4793m9824j7080j3646N3682j3302j463j2705j6846J6974K2192k003m7294
4079e6522l9354J7255N0415J0117l4183J7409O917K8985N4726n985L2783Q886
4067I1449m6408j592j692l830n6586j8776n851J4187k0328k5286m0752N0708L2287
$$ plain form
4054 -32470 -17817 -35089 -89957 -58796 -45554 -10687 -4226 -5196 22917 22300 31884 35915 -41308
4041 -41308 -28218 31033 35811 37690 7534 -25332 -63600 -43330 -11361 -7610 -45273 10398
4029 10398 29421 -1630 5793 25927 25975 -36247 -50379 -59219 -38482 -29235 -42599 -62919 -41036
4016 -41036 -33072 -17202 -52578 -35758 10125 -31112 -105179 -131547 -76069 24163 49266 35717
4004 35717 13944 7222 -19251 -36313 -3212 -26491 -25646 -44026 -44968 -99621 -120270 -63919 22076
3991 22076 44964 22990 24394 70154 68209 26413 55202 10518 -43624 -51921 -55620 -29592 -1871
3978 -1871 3283 -41173 -51200 -43239 -40301 -55586 -9050 -12016 -18155 53621 29951 -25864 -18675
3965 -18675 -24241 -82933 -81904 -77916 -64102 -73619 -14850 56905 49933 11764 -9213 6151 -12450
$$ packed form
4054c2470J4653j7272n4868L1161J3242L4867O461r70K8113o17R584M031p7223
4041d1308J3090N9251M778J879l0156l2866l8268K0270L1969L751l7663N5671
4029A0398J9023l1051P423K0134M8o2222j4132q840K0737R247j3364k0320K1883
4016d1036P964J5870l5376J6820M5883m1237p4067k6368N5478J00232K5103j3549
4004C5717k1773o722k6473j7062L3101k3279Q45j8380r42n4653k0649N6351Q5995
3991B2076K2888k1974J404M5760j945m1796K8789m4684n4142q297l699K6028K7721
3978a871N154m4456j0027P961K938j5285M6536k966o139P1776k3670n5815P189
3965a8675n566n8692J029L988J3814r517N8769P1755o972l8169k0977J5364j8601
$$ plain form
3952 -12450 -72644 -79460 -57503 -43767 -63038 -103835 -76247 48351 69764 14627 -8809 -8692
3940 -8692 -8502 5682 -17198 -78461 -69287 -7174 24587 74484 94745 85713 54006 8020 -36449
3927 -36449 -29166 42986 75862 -2328 11120 11593 14771 70070 20772 32852 6495 -22848 -32098
3914 -32098 20542 54985 81147 74021 42754 -13439 18240 108361 108868 62542 51756 44166 -11400
3901 -11400 -71152 -129257 -90139 -14312 -13757 -22102 -17006 -16263 -3210 -41287 -45206 -60572 -31750
3888 -31750 -35242 -19933 -33347 25234 73570 62325 60635 36469 -37916 -56182 -38293 -38618 14969
3875 14969 28577 17525 16600 -17642 -53808 -11929 -9287 -29480 33705 91255 85515 90929 56143
3862 56143 36414 23240 3528 -22809 -1765 -4231 28900 64992 16279 26147 62423 32345
$$ packed form
3952a2450o0194o816K1957J3736j9271m0797K7588J24598K1413n5137k3436J17
3940h692J90J4184k2880o1263R174O2113L1761M9897K0261r032l1707m5986m4469
3927c6449P283P2152L2876p8190J3448M73L178N5299m9298J2080k6357k9343r250
3914c2098N2640L4443K6162p126l1267n6193L1679R0121N07m6326j0786p590n5566
3901a1400n9752n8105L9118P5827N55q345N096P43J3053l8077l919j5366K8822
3888c1750l492J5309j3414N8581M8336j1245j690k4166p4385j8266J7889l25N3587
3875A4969J3608j1052r25l4242l6166M1879K642k0193O3185N7550n740N414l4786
3862E6143j9729j3174j9712k6337K1044k466L3131L6092m8713R868L6276l0078
$$ plain form
3850 32345 43076 86988 77064 57475 129626 155159 100750 83589 89439 22166 -30888 -42905
3838 -42905 -23461 -29546 -19718 -14946 -36297 -35167 -64422 -49365 4020 22489 26301 38152 1376
3825 1376 48163 105088 84660 24142 30851 3850 16618 51779 50780 10288 7104 7087 14509 19083
3811 19083 15247 -25344 -34841 -14027 -23511 5606 -64191 -28381 1913 -1506 -10935 -10663 -46682
3798 -46682 -105343 -106978 -21356 60429 148129 95079 -19240 -7688 -65655 -119064 -123385 -97146
3786 -97146 -63276 -16671 20649 1729 -14689 -39514 -85819 -103754 -59926 -13644 -6703 15881
3774 15881 -27489 -32005 -13016 -50444 -49743 1627 12842 68217 56969 -56232 -66458 -22053
3762 -22053 -45357 -28364 -57098 -27002 29680 37597 26958 33665 31310 -5516 -326 43114 9247
$$ packed form
3850C2345J0731M3912r924j9589P2151K5533n4409j7161N850o7273n3054j2017
3838d2905J9444o085R828M772k1351J130k9255J5057N3385J8469L812J1851l6776
3825A376M6787N6925k0428o0518O709k7001J2768L5161r99m0492l184j7P422M574
3811A9083l836m0591r497K0814r484K9117o9797L5810L0294l419r429K72l6019
3798d6682n8661j635Q5622Q1785Q7700n3050j14319J1552n7967n3409m321K6239
3786i7146L3870M6605L7320j8920j6418k4825m6305j7935M3828M6282O941K2584
3774A5881m3370m516J8989l7428P01N1370J1215N5375j1248j13201j0226M4405
3762b2053k3304J6993k8734L0096N6682P917j0639O707k355l6826N190M3440l3867
$$ plain form
3749 9247 11494 -6225 -18988 -20179 29501 33742 13833 -29677 -63097 -39958 -62308 -121868 -157768
3736 -157768 -137245 -85643 -57354 -70167 -56039 -31212 9691 8728 -1471 -22630 -12346 -4229
3724 -4229 8457 -30669 -3516 -14210 29432 -3358 1592 -16621 13164 25219 40506 53777
3712 53777 55800 55740 62050 96797 74574 19295 6425 466 -69178 -52412 29913 23597 37064
3699 37064 71676 91038 163717 103815 38531 -12213 -8538 -9667 -9488 -69921 -30392 -6258 -15442
3686 -15442 -35870 -11214 77389 82106 39996 -64361 -90054 -67852 -6220 27027 13531 35964
3674 35964 7347 16602 34791 57859 45410 25444 -22775 3202 51629 82203 113419 96390
3662 96390 90617 13881 -32791 -55565 -81782 -43433 -66109 -77016 -59286 -56708 -43205 -74122
$$ packed form
3749I247K247j7719j2763j191M9680M241j9909m3510l3420K3139k2350n9560l5900
3736a57768K0523N1602K8289j2813J4128K4827M0903r63j0199k1159J0284Q117
3724d229J2686l9126K7153j0694M3642l2790M950j8213K9785J2055J5287J3271
3712E3777K023o0O310L4747k2223n5279j2870n959o9644J6766Q2325o316J3467
3699C7064L4612J9362P2679n9902o5284n0744L675j129J79o0433L9529K4134r184
3686a5442k0428K4656Q8603M717m2110j04357k5693K2202O1632L3247j3496K2433
3674C5964k8617R255J8189K3068j2449j9966m8219K5977M8427L0574L1216j7029
3662I6390n773p6736m6672k2774k6217L8349k2676j0907J7730K578J3503l0917
$$ plain form
3650 -74122 -135366 -111772 -1249 56947 37607 -33418 -70471 -79842 -75363 -66750 -38592 -28038
3638 -28038 -39500 22601 20797 -14043 -15335 6026 -532 -51557 -83354 -122869 -89549 -58668
3626 -58668 -51319 15887 12649 12829 35771 131295 129177 100497 46307 56057 89224 97447 46287
3613 46287 -713 54544 136168 142373 64890 -17326 14727 44547 67464 42520 -9271 -49557
3601 -49557 -74178 -66238 -51034 1583 2960 12895 1629 5824 -49361 -87939 -74072 -64915 -103556
3588 -103556 -130411 -69237 -43849 21409 54104 29482 -21582 -52445 -36654 -68229 -32129 -32762
3576 -32762 -45330 -4608 45134 49234 28941 21266 57773 108235 135123 78586 14209 9002
3564 9002 10683 -38050 -78121 -29659 23415 38241 24830 14120 19966 39187 -26096 -53581
$$ packed form
3650g4122o1244K3594J10523N8196j9340p1025l7053r371M479Q613K8158J0554
3638b8038j1462O2101j804l4840j292K1361o558n1025l1797l9515L3320L0881
3626e8668P349O7206l238J80K2942R5524k118k8680n4190R750L3167Q223n1160
3613D6287m7000N5257Q1624O205p7483q2216L2053K9820K2917k4944n1791m0286
3601d9557k4621P940J5204N2617J377R935j1266M195n5185l8578J3867R157l8641
3588a03556k6855O1174K5388O5258L2695k4622n1064l0863J5791l1575L6100o33
3576c2762j2568M0722M9742M100k0293p675L6507N0462K6888n6537o4377n207
3564I002J681m8733m0071M8462N3074J4826j3411j0710N846J9221o5283k7485
$$ plain form
3552 -53581 -35670 -30100 8992 11477 9476 -36629 -10294 16073 16669 26655 15928 -57832 -110142
3539 -110142 -50660 16762 -10862 -69362 -63476 -7017 -13673 24240 40800 30661 21744 -14013
3527 -14013 -72308 -42595 -6817 62654 75689 71023 62539 48096 21700 52256 35856 -33760
3515 -33760 15279 68126 8164 -48764 -62198 -6639 -20987 -66888 -23663 -21260 -77570 -65514
3503 -65514 -23057 -22908 -72197 -73212 -17106 -11288 -17087 -23255 25305 1729 -29937 -52134 17131
3490 17131 20196 -17643 -51858 -22479 5491 -34060 -36071 -55323 -33058 -48409 -58775 -52189
3478 -52189 -29423 987 31029 51712 14473 12938 56153 86740 16564 9944 4587 -80655
3466 -80655 -139495 -101302 -4911 18959 -16034 -36676 -44478 -28620 5404 31530 43930 43716
$$ packed form
3552e3581J7911N570L9092K485k001m6105K6335K6367N96R986j0727p3760n2310
3539a10142N9482O7422k7624n8500N886N6459o656L7913J6560j0139q917l5757
3527a4013n8295K9713L5778O9471J3035m666q484j4443k6396L0556j6400o9616
3515c3760M9039N2847n9962n6928j3434N5559j4348m5901M3225K403n6310J2056
3503f5514M2457J49m9289j015N6106N818n799o168M8560k3576l1666k2197O9265
3490A7131L065l7839l4215K9379K7970l9551k011j9252K2265j5351j0366O586
3478e2189K2766L0410L0042K0683l7239j535M3215L0587p0176o620n357q5242
3466h0655n8840L8193R6391K3870l4993k0642p802J5858L4024K6126J2400k14
$$ plain form
3454 43716 11600 19537 27881 26820 -2336 -19486 -53725 -74005 -83777 -67364 -39687 -50604 -56925
3441 -56925 -22065 11536 -7334 -41866 -32606 -50063 -30486 -39702 2212 -13695 -32213 -72333
3429 -72333 -63989 -36343 -75478 -130561 -157760 -143794 -141328 -170340 -142635 -78522 -47549 -55818
3417 -55818 -79724 -82170 -102568 -100053 -97531 -73661 -32925 -9798 -48632 -9523 -20509 -17824 -37459
3404 -37459 -30116 -35705 -5142 23683 5975 11111 -27198 -9092 -20128 -88276 -64383 22112
3392 22112 62980 50481 23795 31508 68838 -36913 -39354 15195 -26609 17334 49032 -1186
3380 -1186 21774 13113 -2994 40257 42564 39706 -22571 -77640 -92905 -135459 -73242 -61462 -59156
3367 -59156 -96857 -86637 -32600 -29809 -26554 27183 30766 56408 96899 87816 90344 75066 40470
$$ packed form
3454D3716l2116P937Q344j061k9156j7150l4239k0280r772J6413K7677j0917o321
3441e6925L4860L3601j8870l4532R260j7457J9577r216M1914j5907j8518m0120
3429g2333Q344K7646l9135n5083k7199J3966K466k9012K7705O4113L0973q269
3417e5818k3906k446k0398K515K522K3870M0736K3127l8834L9109j0986K685j9635
3404c7459P343n589L0563K8825j7708N136l8309J8106j1036o8148K3893Q6495
3392B2112M0868j2499k6686P713L7330j05751k441N4549m1804M3943L1698n0218
3380a186K2960q661j6107M3251K307k858o2277n5069j5265m2554O2217J1780K306
3367e9156l7701J0220N4037K791L255N3737L583K5642M0491r083K528j5278l4596
$$ plain form
3354 40470 18584 -19238 -12164 23758 55473 24234 -14754 -2966 -36901 3912 32267 37883
3342 37883 46527 49579 76880 105868 110298 61177 63374 37728 14993 27319 17347 -18477 -25325
3329 -25325 -3949 -21190 -32769 -32352 -13943 -21584 -69573 -134587 -125149 -134139 -112533 -110504 -75316
3316 -75316 -16127 -28891 -18253 -18283 41948 113776 98719 90843 109185 76182 39523 59865 56772
3303 56772 151773 141237 31314 -9574 13212 16073 10554 16636 24814 45642 73712 41755
3291 41755 52030 45812 53525 103700 119444 24032 -18944 -36115 -40031 -20418 47478 108515
3279 108515 122675 121288 91844 62603 56674 -10232 -78155 -52727 18918 44378 39487 54002
3267 54002 61637 -6348 -68208 -93860 -110978 -62967 -73811 -101544 -62776 -4660 24013 -9803
$$ packed form
3354D0470k1886l7822P074L5922L1715l1239l8988J1788l3935M0813K8355N616
3342C7883Q644L052K7301K8988M430m9121K197k5646k2735J2326r972l5824o848
3329b5325K1376j7241j1579M17J8409p641m7989o5014R438q990K1606K029L5188
3316g5316N9189j2764J0638l0O0231P1828j5057p876J8342l3003l6659K0342l093
3303E6772R5001j0536j09923m0888K2786K861n519O082Q178K0828K8070l1957
3291D1755J0275o218P713N0175J5744r5412m2976j7171l916J9613O7896O1037
3279A08515J4160j387k9444k9241n929o6906o7923K5428P1645K5460m891J4515
3267E4002P635o7985o1860k5652j7118M8011j0844k7733L8768N8116K8673l3816
$$ plain form
3255 -9803 -32536 -51785 -30032 10900 -13951 -6150 66135 92542 104233 12265 13346 46308
3243 46308 3895 -9862 -68594 -69026 -33188 -44985 -79646 -93777 -51493 -38699 -85075 -110775
3231 -110775 -103012 -73093 1977 -28709 -71869 -38638 -5791 18225 22835 -35054 -26161 -29171
3219 -29171 9152 -15797 -55113 -33648 33345 -26718 -43160 -40700 -30304 -17193 13665 -9739
3207 -9739 10285 30685 8049 -43972 -58174 -58863 -34479 -30258 -14180 -12139 12119 7946 -1969
3194 -1969 -139 -12668 9853 58291 56765 13693 1550 -21384 3429 21165 22134 -10971 5566
3181 5566 13558 59684 69256 92749 62539 5548 -46304 -60810 -83192 -43493 -8100 -7300 48017
3168 48017 28148 14715 -17592 -20847 -73585 -155119 -95202 -18628 -18005 18833 7808 -28590
$$ packed form
3255i803k2733j9249K1753M0932k4851P801P2285K6407J1691r1968J081L2962
3243D6308m2413j3757n8732m32L5838j1797l4661j4131M2284J2794m6376k5700
3231a10775P763K9919P5070l0686m3160L3231L2847K4016M610n7889Q893l010
3219b9171L8323k4949l9316K1465O6993o0063j6442K460J0396J3111L0858k3404
3207i739K0024K0400k2636n2021j4202o89K4384M221J6078K041K4258m173r915
3194a969J830j2529K2521M8438j526m3072j2143k2934K4813J7736R69l3105J6537
3181E566P992M6126R572K3493l0210n6991n1852j4506k2382L9699L5393Q00N5317
3168D8017j9869j3433l2307l255n2738q1534N9917P6574O23L6838j1025l6398
$$ plain form
3156 -28590 -11264 -37276 -71062 -41042 -88059 -61190 -37918 -42447 -65100 -43228 -73718 -156142
3144 -156142 -146807 -103678 -92103 -69367 -31993 -28834 -109009 -108083 -20517 26609 -14027 -17158 -15311
3131 -15311 -7748 -21616 -51370 -5391 45883 50629 5534 -68514 -87956 -53912 19716 28250
3119 28250 -35744 -59663 -92128 -56281 -35696 -33659 -7271 -13305 -15657 -15331 -31869 11543 62656
3106 62656 57201 55346 44289 77885 20832 20706 72350 112163 93673 39712 -9035 -14932 13223
3093 13223 31545 28205 -807 -30696 13067 15965 43390 101439 70953 10027 7295 -26320
3081 -26320 -20823 -14216 -50097 -18238 45102 102570 103828 47331 2012 -10244 -39585 -19706
3069 -19706 -102731 -109553 -85234 -21501 36573 62931 40479 26577 4673 35894 -9321 3980
$$ packed form
3156b8590J7326k6012l3786L0020m7017K6869K3272m529k2653K1872l0490q2424
3144a56142R335M3129J1575K2736L7374L159q0175R26Q7566M7126m0636l131J847
3131a5311P563j3868k9754M5979N1274M746m5095p4048j9442L4044P3628Q534
3119B8250o3994k3919l2465L5847K0585K037K6388o034k352L26j6538M3412N1113
3106F2656n455j855j1057L3596n7053j26N1644L9813j8490n3961m8747n897K8155
3093A3223J8322l340k9012k9889M3763K898K7425N8049l0486o0926k732l3615
3081b6320N497O607l5881L1859O3340N7468J258n6497m5319j2256k9341J9879
3069a9706q3025o822K4319O3733N8074K6358k2452j3902k1904L1221m5215J3301
$$ plain form
3057 3980 -70583 -81487 -72140 -65920 -44509 -91751 -119192 -142648 -177750 -182712 -160628 -85643 -10652
3044 -10652 -40703 -126337 -88617 -34188 -75399 -134390 -134049 -87163 -59382 -39545 -47874 -67833
3032 -67833 -62720 -82799 -74764 -75070 -52309 -41300 -47527 -56007 -67344 -38819 35580 70300 66480
3019 66480 73928 80197 75588 56046 44443 69351 -8132 -30928 -39589 -95548 -100586 -18010 37288
3006 37288 51735 88150 111836 55092 2553 61531 35434 24126 -49876 -106201 -84155 3453
2994 3453 -35680 -35358 -14813 65555 42301 -16206 14103 2341 -1751 -32787 -37187 8257 -14500
2981 -14500 -17698 9047 33532 21283 17275 21821 -39333 -105810 -85523 -108675 -114459 -126794 -143055
2968 -143055 -122807 -62628 -39277 -50229 -23979 28792 50696 6224 -24918 -130328 -128978 -94769
$$ packed form
3057C980p4563j0904R347O220K1411m7242k7441k3456l5102m962K2084P4985P4991
3044a0652l0051q5634L7720N4429m1211n8991L41M6886K7781J9837q329j9959
3032f7833N113k0079Q035l06K2761J1009o227q480j1337K8525P4399L4720l820
3019F6480P448O269m609j9542j1603K4908p7483k2796q661n5959n038Q2576N5298
3006C7288J4447L6415K3686n6744n2539N8978k6097j1308p4002n6325K2046Q7608
2994C453l9133L22K0545Q0368k3254n8507L0309j1762m092l1036m400M5444k2757
2981a4500l198K6745K4485j2249m008M546o1154o6477K0287k3152n784j2335j6261
2968a43055K0248O0179K3351j0952K6250N2771K1904m4472l1142j05410J350L4209
$$ plain form
2956 -94769 -59198 10038 27548 14816 -36287 -13953 -32730 -61669 -47730 4163 64249 77439
$$ packed form
2956i4769L5571O9236J7510j2732n1103K2334j8777k8939J3939N1893O0086J3190
$$ [...]
##END NTUPLES=NMR SPECTRUM
##END=
