##TITLE=Analysis number 321135
Compound Code btb 13613
Project Code adrs
Chemist Name greyhound chromatography
##JCAMPDX= 6.0         $$ Bruker NMR JCAMP-DX V2.0
##DATA TYPE= NMR SPECTRUM
##DATA CLASS= NTUPLES
##ORIGIN= Bruker BioSpin GmbH
##OWNER= nmr
$$ XWIN-NMR		Version 3.5
$$ Tue Jul 25 19:11:54 2006 GMT Daylight Time (UT+1h)  MAYBRIDGE\nmr@NMR_250MHZ
##.OBSERVE FREQUENCY= 250.131544655141
##.OBSERVE NUCLEUS= ^1H
##.ACQUISITION MODE= SIMULTANEOUS (DQD)
##.ACQUISITION SCHEME= undefined
##.AVERAGES= 16
##.DIGITISER RES= 18
##SPECTROMETER/DATA SYSTEM= dpx250
##.PULSE SEQUENCE= zg30
##.SOLVENT NAME= DMSO
##.SHIFT REFERENCE= (INTERNAL, DMSO, 0, 16.522)
##AUDIT TRAIL= $$ (NUMBER, WHEN, WHO, WHERE, WHAT)
$$ ##TITLE= Audit trail, XWIN-NMR		Version 3.5
$$ ##JCAMPDX= 5.01
$$ ##ORIGIN= Bruker BioSpin GmbH
$$ ##OWNER= nmr
$$ C:\u/data/dgb/nmr/ADRS/3590/pdata/1/auditp.txt
$$ ##AUDIT TRAIL=  $$ (NUMBER, WHEN, WHO, WHERE, WHAT)
(   1,<2006-07-25 19:11:20.60 +100>,<MAYBRIDGE\nmr>,<NMR_250MHZ>,
      <created by zg, POWCHK disabled, PULCHK disabled
       configuration hash MD5:
       E2 DF 36 D8 04 B2 41 60 5A D7 A3 38 5A 4B D0 FE
       data hash MD5: 64K
       E7 74 7A 01 A9 43 57 21 F9 9E 39 D5 1F CC 92 FD>)
(   2,<2006-07-25 19:11:42.88 +100>,<MAYBRIDGE\nmr>,<NMR_250MHZ>,
      <Start of raw data processing
       ef LB = 0.3 FT_mod = 6 PKNL = 1 SI = 32K 
       data hash MD5: 32K
       01 DA 24 5A E2 E6 A1 0C B3 F5 10 AF 0C 99 81 58>)
(   3,<2006-07-25 19:11:45.51 +100>,<MAYBRIDGE\nmr>,<NMR_250MHZ>,
      <apk 
       data hash MD5: 32K
       08 6E 6D 7A 18 4D 77 2A B2 35 AC 2E 17 2C E5 66>)
(   4,<2006-07-25 19:11:46.29 +100>,<MAYBRIDGE\nmr>,<NMR_250MHZ>,
      <abs ABSG = 5 
       data hash MD5: 32K
       D7 35 9E 9D CA E6 2C E8 A8 77 F0 44 DF DE C6 A9>)
$$ ##END=
$$ 
$$ hash MD5
$$ 5D C6 73 7C BA F7 C1 FB F1 EA EC A0 E3 1D 47 23
##$RELAX= 
##$RELAX= 
##$RELAX= 
##$RELAX= 
##$RELAX= 
##$RELAX= 
##$RELAX= 
$$ Bruker specific parameters
$$ --------------------------
##$DU= <C:\u>
##$EXPNO= 3590
##$NAME= <ADRS>
##$PROCNO= 1
##$TYPE= <nmr>
##$USER= <dgb>
##$AMP= (0..31)
100 100 100 100 100 100 100 100 100 100 100 100 100 100 100 100 100 100 
100 100 100 100 100 100 100 100 100 100 100 100 100 100 
##$AQSEQ= 0
##$AQ_mod= 3
##$AUNM= <au_zg>
##$AUTOPOS= <13 >
##$BF1= 250.13
##$BF2= 250.13
##$BF3= 250.13
##$BF4= 250.13
##$BF5= 500.13
##$BF6= 500.13
##$BF7= 500.13
##$BF8= 500.13
##$BYTORDA= 1
##$CFDGTYP= 0
##$CFRGTYP= 5
##$CHEMSTR= <none>
##$CNST= (0..31)
1 1 145 1 1 1 1 1 1 1 1 1 1 1 1 1 1 1 1 1 1 1 1 1 1 1 1 1 1 1 1 1 
##$CPDPRG= <>
##$CPDPRG1= <>
##$CPDPRG2= <>
##$CPDPRG3= <>
##$CPDPRG4= <mlev>
##$CPDPRG5= <mlev>
##$CPDPRG6= <mlev>
##$CPDPRG7= <mlev>
##$CPDPRG8= <mlev>
##$CPDPRGB= <>
##$CPDPRGT= <>
##$D= (0..31)
0 1 0 0 0 0 0 0 0 0.06 0 0 0 0 0 0 0.0002 0 0 0 0 0 0 0 0 0 0 0 0 0 0 
0 
##$DATE= 1153851078
##$DBL= (0..7)
120 120 120 120 120 120 120 120 
##$DBP= (0..7)
150 150 150 150 150 150 150 150 
##$DBP07= 0
##$DBPNAM0= <>
##$DBPNAM1= <>
$$ [...]
##$SUBNAM7= <"">
##$SUBNAM8= <"">
##$SUBNAM9= <"">
##$SW= 20.6930455092707
##$SWIBOX= (0..15)
0 0 3 0 0 0 0 0 0 0 0 0 0 0 0 0 
##$SW_h= 5175.983436853
##$TD= 65536
##$TD0= 1
##$TE= 295.16
##$TE2= 300
##$TE3= 300
##$TEG= 300
##$TL= (0..7)
0 120 120 120 120 120 120 120 
##$TP= (0..7)
150 150 150 150 150 150 150 150 
##$TP07= 0
##$TPNAME0= <>
##$TPNAME1= <>
##$TPNAME2= <>
##$TPNAME3= <>
##$TPNAME4= <>
##$TPNAME5= <>
##$TPNAME6= <>
##$TPNAME7= <>
##$TPOAL= (0..7)
0.5 0.5 0.5 0.5 0.5 0.5 0.5 0.5 
##$TPOFFS= (0..7)
0 0 0 0 0 0 0 0 
##$TUNHIN= 0
##$TUNHOUT= 0
##$TUNXOUT= 0
##$USERA1= <user>
##$USERA2= <user>
##$USERA3= <user>
##$USERA4= <user>
##$USERA5= <user>
##$V9= 5
##$VALIST= <valist>
##$VCLIST= <CCCCCCCCCCCCCCC>
##$VD= 0
##$VDLIST= <DDDDDDDDDDDDDDD>
##$VPLIST= <PPPPPPPPPPPPPPP>
##$VTLIST= <TTTTTTTTTTTTTTT>
##$WBST= 1024
##$WBSW= 4
##$XGAIN= (0..3)
0 0 0 0 
##$XL= 0
##$YL= 0
##$YMAX_a= 281740
##$YMIN_a= -496831
##$ZGOPTNS= <>
##$ZL1= 120
##$ZL2= 120
##$ZL3= 120
##$ZL4= 120
##$ABSF1= 16.522
##$ABSF2= -4.171173
##$ABSG= 5
##$ABSL= 3
##$ALPHA= 0
##$AQORDER= 0
##$ASSFAC= 0
##$ASSFACI= 0
##$ASSFACX= 0
##$ASSWID= 0
##$AUNMP= <proc_1d>
##$AZFE= 0.1
##$AZFW= 0.1
##$BCFW= 0
##$BC_mod= 0
##$BYTORDP= 0
##$COROFFS= 0
##$CY= 12.5
##$DATMOD= 1
##$DC= 0
##$DFILT= <>
##$DTYPP= 0
##$F1P= 14.0000005364418
##$F2P= -0.99999901652339
##$FCOR= 0.5
##$FTSIZE= 32768
##$FT_mod= 6
##$GAMMA= 0
##$GB= 0
##$INTBC= 1
##$INTSCL= 1
##$ISEN= 128
##$LB= 0.3
##$LEV0= 0
##$LPBIN= 0
##$MAXI= 10000
##$MC2= 0
##$MEAN= 0
##$ME_mod= 0
##$MI= 0
##$NCOEF= 0
##$NC_proc= -6
##$NLEV= 6
##$NOISF1= 0
##$NOISF2= 0
##$NSP= 0
##$NTH_PI= 0
##$NZP= 0
##$OFFSET= 16.522
##$PC= 1
##$PHC0= 146.2022
##$PHC1= 30.43674
##$PH_mod= 1
##$PKNL= yes
##$PPARMOD= 0
##$PSCAL= 4
##$PSIGN= 0
##$REVERSE= no
##$SF= 250.13
##$SI= 32768
##$SIGF1= 0
##$SIGF2= 0
##$SINO= 400
##$SIOLD= 32768
##$SREGLST= <1H.DMSO>
##$SSB= 0
##$STSI= 32768
##$STSR= 0
##$SW_p= 5175.98343685301
##$SYMM= 0
##$S_DEV= 0
##$TDeff= 65536
##$TDoff= 0
##$TI= <Analysis number 999999
Compound Code 99
Book Reference 9
Project Code 9>
##$TILT= no
##$TM1= 0
##$TM2= 0
##$TOPLEV= 0
##$USERP1= <user>
##$USERP2= <user>
##$USERP3= <user>
##$USERP4= <user>
##$USERP5= <user>
##$WDW= 1
##$XDIM= 32768
##$YMAX_p= 443816722
##$YMIN_p= -1302456
$$ End of Bruker specific parameters
$$ ---------------------------------
##NTUPLES= NMR SPECTRUM
##VAR_NAME=  FREQUENCY,     SPECTRUM/REAL,   SPECTRUM/IMAG
##SYMBOL=    X,             R,               I
##VAR_TYPE=  INDEPENDENT,   DEPENDENT,       DEPENDENT
##VAR_FORM=  AFFN,          ASDF,            ASDF
##VAR_DIM=   32768,         32768,           32768
##UNITS=     HZ,            ARBITRARY UNITS, ARBITRARY UNITS
##FACTOR=    0.157963299565203, 1,           1
##FIRST=     4132.6476996994, 0,             0
##LAST=      -1043.33573715361, 0,           0
##MIN=       -1043.33573715361, -1302456,    0
##MAX=       4132.6476996994, 443816722,     0
$$ Real data points
##PAGE= N=1
##DATA TABLE= (X++(R..R)), XYDATA
$$ [...]
15318G5192q3050M49408M8726j47272J80325k22206l35718K03039J47271P9064
15308C94779r7816Q8620R4408m4305P8393K24337M233k17857j70847p9112r9919
15297A74914M63909L33320L5090m02645j02645k67033P3996M3480j51367l2037
15287A68982Q9752j92921o8939j51649Q5162o2302K16176K5001J73521M36206
15277G18989K5302q0601p0609q3574l01803q0360R7130M3381o0156J64258j25660
15266B46297n4536J51374M6372J76704j41262r0507J81086r229j18328o6511J81332
15255E02792J2993l15889j47120O3966K53577L16784o61l00728j89039j52285
15245D4390j53947K18573J95606L8854o3944j06969K39554M642N8865J22048M0397
$$ y = [75192, -7858, 441550, 490276, 343004, 523329, 301123, -34595, 168444, 315715, 394779, 296963, 385583, 479991, 435686, 514079, 738416, 742649, 524792, 353945, 274833, 174914, 638823, 972143, 1007233, 604588, 501943, 234910, 308906, 352386, 201019, 168982, 258734, 65813, -3126, -154775, -69613, -131915, 84261, 109262, 282783, 718989, 744291, 663690, 593081, 509507, 207704, 127344, 224474, 267855, 207699, 371957, 246297, 191761, 343135, 389507, 566211, 424949, 334442, 515528, 506299, 387971, 321460, 502792, 515785, 199896, 52776, 116742, 370319, 687103, 686442, 385714, 196675, 44390, -109557, 109016, 304622, 343476, 279532, 172563, 412117, 416759, 475624, 597672, 638069]
15234F38069K7744k00531J26079n6993o6554j90696m66004Q7577K42005J86483
15224C27179p0341j75451k15271K87497K69512r3736o6732J50996j85345J71670
15214C99978J96977j80514P8315J39111K0113k74946l57675m0564L19944K76663
15204E77402l76765J07907K31991r026R1039M24658n4470k23585o8100O3320J21967
15193H86338L9336j63711k04218l75810J55731O6438K55632K33709r4628o4405
15183G34412K61452J5465l42816k16401J2736m4585M7704L01945j51877j44536
15173D73499j06529j63417J4556L19947M29551j84514j66434l9170j20094k71587
15163A85808L468j0835J56653j9984n0583O719J91855K14064J68696k24469l7094
$$ y = [638069, 665813, 465282, 591361, 534368, 467814, 277118, -188886, -101309, 140696, 327179, 256838, 81387, -133884, 153613, 423125, 329389, 262657, 413653, 228308, 399978, 596955, 416441, 494756, 633867, 653980, 379034, 21359, -19205, 300739, 577402, 200637, 308544, 540535, 531509, 622548, 1047206, 992736, 769151, 701051, 764371, 886338, 925674, 761963, 557745, 181935, 337666, 404104, 659736, 893445, 798817, 734412, 995864, 1011329, 668513, 452112, 464848, 420263, 467967, 769912, 618035, 473499, 366970, 203553, 218109, 538056, 967607, 783093, 616659, 577489, 457395, 185808, 189276, 178441, 335094, 315110, 264527, 271246, 463101, 677165, 845861, 621392, 584298]
15152E84298P4478L8234J99937Q0084J06349J75029l71932k72647P7071K85479
15142I76380o5872m29229j10469o1678N6706K56200j21664Q823J72682J9786l83362
15131C18303J0979K65659R6302R2569J40857K95261j18370j82700J19843j04390
15121I34313j93104j52444R2555q3064k59361j21123J30957K44904K11913n8536
15111G47010j15222l79639r3673K59368R0745J01381n743l46072j6009M26622
15101F68768K94677m3891j61337j78931j65672M3230J75120J01053J29575n16071
15091C46521k259K79468J75880j18924j48965j6910j09811L74086N09303Q921
15081A297310m19984k04640q1634l63656L18782M93100p1709Q6637m3137o08000
$$ y = [584298, 658776, 697010, 896947, 977031, 1083380, 1258409, 886477, 613830, 690901, 976380, 910508, 481279, 370810, 309132, 365838, 622038, 500374, 509197, 681879, 701665, 318303, 329282, 594941, 691243, 783812, 924669, 1219930, 1101560, 918860, 1038703, 934313, 741209, 588765, 681320, 598256, 338895, 217772, 348729, 593633, 805546, 747010, 631788, 252149, 158476, 417844, 508589, 609970, 604227, 258155, 242146, 668768, 963445, 919554, 758217, 579286, 413614, 456844, 631964, 733017, 862592, 346521, 344262, 623730, 799610, 680686, 531721, 514811, 405000, 779086, 1288389, 1297310, 877326, 672686, 591052, 227396, 546178, 1039278, 967569, 1054206, 1011069, 403069]
15071D03069m9555K45912K21146J00333J42184J7702j27604m07453m79414L35398
15061D01718N90377k6362l06392k22979J36588P8895l52596J59378j12179j42850
15051B03598J07584L56879K35574J8763l8860P8505J93850j01334l37744K34942
15041I51757J0180m51777k9321L62973J86937l01781k46493k13558K066M2185
15031C13168J8459j34353J87890K1402k6042n0026K16756L63578k26358l65987
15021C18487j46612M28993j8654J73537m5588j48424L98463J15601K8869Q053
15011A112725J3467L2961l53645j61099k3442n7648k922J97306J3960N4992o3605
15000G63050J06744J05332j87213j14171j3298J99323K5947j35874n14090l43319
$$ y = [403069, 353514, 599426, 820572, 920905, 1063089, 1080791, 953187, 545734, 66320, 401718, 992095, 965733, 659341, 436362, 572950, 651845, 299249, 458627, 346448, 203598, 311182, 668061, 903635, 922398, 883538, 962043, 1155893, 1054559, 716815, 951757, 961937, 510160, 480839, 843812, 1030749, 728968, 482475, 268917, 270983, 313168, 331627, 197274, 385164, 406566, 380524, 330498, 547254, 910832, 684474, 318487, 171875, 600868, 582214, 755751, 710163, 561739, 960202, 1075803, 1104672, 1112725, 1126192, 1159153, 805508, 644409, 620967, 563319, 560397, 757703, 771663, 826655, 763050, 869794, 975126, 787913, 673742, 660444, 859767, 885714, 749840, 235750, -107569]
14990a07569L17165K92734J38777Q2053j8136O7132R3260j46802J12585l46709
14980D84490k16654K37650O47974k6400k86248l979Q3944n2706n10501m53078
14970i5508M73130O63277J10172j65836k37278K89219J62586J7942l476m7698
14960A166530R1419m2485m723N31N3128j49930l77410K21258M12011j5426K6646
14949A381549k77160l37163o5277K46230j92072j86013k46681j5860L47489J99428
14939H54470j66724N0443L23150P9366j78362j46005J00591J40133r6682L9568
14929I99948K28340o6428j59791j8980R6727j61749R1998K29092J83938K88222
14919A711317l165k19725k44684j80312n2695L50687J24624k22799l48429j57895
$$ y = [-107569, 209596, 502330, 641107, 723160, 705024, 772156, 865416, 718614, 831199, 484490, 267836, 505486, 1153460, 1127060, 840812, 836833, 920777, 868071, 357570, -95508, 377622, 1040899, 1151071, 985235, 747957, 1037176, 1199762, 1217704, 1214228, 1166530, 1257949, 1215464, 1210741, 1211272, 1264400, 1114470, 737060, 958318, 1370329, 1354903, 1381549, 1104389, 767226, 701949, 948179, 756107, 570094, 323413, 307553, 655042, 854470, 687746, 738189, 1061339, 1140705, 962343, 816338, 916929, 1057062, 960380, 999948, 1228288, 1161860, 1002069, 983089, 1079816, 918067, 1010065, 1239157, 1423095, 1711317, 1708152, 1488427, 1243743, 1063431, 1010736, 1361423, 1486047, 1263248, 914819, 756924]
14909G56924R3306L60131J37953J18608O9104j79500j12460j94131q9719K06006
14899A166222j0259Q6423K7865k56615L7584P6517k98149k14413R9173M16724
14889A131072L03828l60091j69823r9421l86630k2498j83903j04076K29664M58245
14879G96367L15344j9868r0160j93777l36433l6018q910K57161M16229J4280n43238
14868E70977l80136L61181O88174l30976l88848J38880J93493P1204j76789J87048
14858I34208r7134m11106m24566R6404M65659M98180J56281j99113j94502J43677
14848I67988J16565J32766j42232J1159L7812k24620L9703K94852k03103k58583
14838G72307l71756P2716N41794L76799K2786k6937m8362k17134m43197p6933
$$ y = [756924, 850230, 1210361, 1348314, 1466922, 1536026, 1356526, 1244066, 1049935, 960216, 1166222, 1155963, 1242386, 1270251, 1013636, 1051220, 1127737, 829588, 615175, 714348, 1131072, 1434900, 1074809, 904986, 805565, 418935, 396437, 212534, 108458, 338122, 796367, 1111711, 1091843, 1001683, 807906, 471473, 435455, 426545, 683706, 1099935, 1114215, 570977, 190841, 552022, 1240196, 909220, 520372, 659252, 852745, 923949, 747160, 934208, 837074, 425968, 1402, 97806, 563465, 1061645, 1217926, 1018813, 824311, 967988, 1084553, 1217319, 1075087, 1086246, 1124058, 899438, 939141, 1233993, 1030890, 772307, 400551, 473267, 1015061, 1391860, 1414646, 1387709, 1339347, 1122213, 679016, 602083]
14828F02083J90633J63657K53313J2910J22359K0215j21755j98306J90082L78229
14818A613420R2818M147L601k08582l12900j55552J44615K53723J55541k18194
14808A372637l0304J81410M5229l3075j97272k3133N8709o1176J52169j32172
14798A333022j01148J75694o6114p4154r915K06912j62569k84141o8851L54883
14788A303619K76436j70198k31770j22335j29956M876K81829k74937k14241j40619
14778E82704M6959M69008L68727o66k88132k66864J77803j67673r9802L94614
14768A216678L94419j4130J32493j47672k72725j56861j66734J8038M0088J09014
14758A152608l0407K5879j4849K37930k8084O2317L1651o2127m6141l70461k36355
$$ y = [602083, 792716, 956373, 1209686, 1222596, 1344955, 1365170, 1243415, 1045109, 1235191, 1613420, 1706238, 1710385, 1713986, 1505404, 1192504, 1036952, 1181567, 1435290, 1590831, 1372637, 1342333, 1523743, 1568972, 1535897, 1338625, 1315492, 1374201, 1313025, 1465194, 1333022, 1231874, 1407568, 1341454, 1267300, 1257385, 1464297, 1301728, 1017587, 948736, 1303619, 1580055, 1409857, 1178087, 1055752, 925796, 930672, 1212501, 937564, 723323, 582704, 629663, 1098671, 1467398, 1466732, 1178600, 911736, 1089539, 921866, 822064, 1216678, 1611097, 1596967, 1729460, 1581788, 1309063, 1152202, 985468, 1003506, 1043594, 1152608, 1122201, 1148080, 1133231, 1371161, 1343077, 1405394, 1437045, 1374918, 1328777, 958316, 721961]
14747G21961K29373K64655J58293k68040P6282N6022j59135k63122K36053M34644
14737A486986q9494K03423O956m6003O5864k7019Q8937m295Q9786l08813q9047
14726A377281J99049J93808j86090m83485k41159N3694J73973K73962L80021p9210
14716A661844j78248l27609k8303J71423J12233J02100j34100r6183j35753J64310
14706A311714k32969J9237M4508k99201J59948L31897J07678j77272L89488L2377
14696A687405l6420O2838j37281K9380J19080j81586K19598P6913j94446l12996
14686A332485M28562L09793r9181O2070o3693l11281j89390j61159l8968K01267
14676A470505k14206j40165R5777J24918J79822J0914N8487l40835j34230N034
$$ y = [721961, 951334, 1215989, 1374282, 1106242, 1182524, 1238546, 1079411, 816289, 1052342, 1486986, 1397492, 1600915, 1607871, 1561868, 1627732, 1600713, 1689650, 1685355, 1775141, 1466328, 1377281, 1576330, 1770138, 1584048, 1100563, 859404, 913098, 1087071, 1361033, 1741054, 1661844, 1483596, 1155987, 1127684, 1299107, 1411340, 1513440, 1379340, 1283157, 1147404, 1311714, 1078745, 1097982, 1142490, 843289, 1003237, 1335134, 1442812, 1265540, 1655028, 1687405, 1650985, 1713823, 1576542, 1605922, 1725002, 1543416, 1763014, 1839927, 1645481, 1332485, 1761047, 2070840, 1971659, 2033729, 1970036, 1658755, 1469365, 1308206, 1269238, 1470505, 1256299, 1116134, 1211911, 1336829, 1516651, 1527565, 1586052, 1245217, 1110987, 1116021]
14666A116021n5189m58696l07065K19117M72070K52685O8873K53206n001j12669
14656A443352J06412k6668j87578R2606L66951J92424M7380j50618k20191k55329
14646A408741j42212K0946L3647k10303o5874L6709K83066L86829K7079p8507
14636A700121K0650R3599K21969J30611j85968k16869k92218L8634n3644j47787
14626A309098k03964J03280J42684n6907L16193M59455j16778k37690j72833J33349
14616A675887l6321j06657j42986k7845P7012J84706K50280m7735J18696M731
14606A949768J84311l0991o56756k93088K47725P8909Q8252L25799j93055J25217
14596A826091L12360J35501m96683O9076j73998k01283j91638J23747K2152o9445
$$ y = [1116021, 1060832, 602136, 295071, 514188, 986258, 1238943, 1307816, 1561022, 1556021, 1443352, 1549764, 1523096, 1335518, 1428124, 1795075, 1987499, 2034879, 1884261, 1664070, 1408741, 1266529, 1287475, 1321122, 1110819, 1044945, 1081654, 1364720, 1751549, 1778628, 1700121, 1720771, 1814370, 2036339, 2166950, 1980982, 1764113, 1471895, 1510529, 1456885, 1309098, 1105134, 1208414, 1351098, 1294191, 1610384, 2069839, 1953061, 1715371, 1542538, 1675887, 1639566, 1532909, 1389923, 1362078, 1439090, 1623796, 1874076, 1826341, 1945037, 1949768, 2134079, 2103088, 1446332, 1153244, 1400969, 1479878, 1568130, 1893929, 1700874, 1826091, 2138451, 2273952, 1777269, 1846345, 1672347, 1471064, 1279426, 1403173, 1425325, 1355880]
14586A355880M66828M83740j80094Q3170K23865M07045o7844m36978J63835r8679
14576B400768l50669j53087r3116n7836M9207L37661K48725M1850l74315k39328
14566A809860o5463K54717J52247J43533l03516j55953J59747j27561k81129j90198
14556A396284P9920j994K88339n9687J07493J34920n4368k17482J47870M2941
14546A864236o8927M8055L6384Q3031Q8109j512j34411M2150p2549P6437k3341
14535A937662M2395l2802N7997j44687k49417j95051K96293J33604m0083j70477
14525A635434l49954J24691K77890l5901J50018q4405j23487L11464j54643K72058
14515B023165J46708j3681k20137J0035L39259K47578j74501P0376k18064j59022
$$ y = [1355880, 1822708, 2306448, 2126354, 2209524, 2433389, 2840434, 2772590, 2335612, 2499447, 2400768, 2050099, 1897012, 1803896, 1746060, 1795267, 2132928, 2381653, 2423503, 2049188, 1809860, 1744397, 1999114, 2151361, 2294894, 1991378, 1835425, 1995172, 1867611, 1586482, 1396284, 1476204, 1474210, 1762549, 1702862, 1810355, 1945275, 1890907, 1673425, 1821295, 1864236, 1795309, 1843364, 1879748, 1962779, 2050888, 2049376, 1914965, 1957115, 1884566, 1961003, 1937662, 1980057, 1947255, 2005252, 1860565, 1611148, 1416097, 1712390, 1845994, 1805911, 1635434, 1285480, 1410171, 1688061, 1652160, 1802178, 1717773, 1594286, 1905750, 1751107, 2023165, 2169873, 2156192, 1936055, 1946090, 2285349, 2532927, 2358426, 2428802, 2210738, 2051716]
14505B051716R9097n3779j24811o3061k64293j3345m4427K3426o7902R4508K72335
14494A909464j63968r9928M48594M44775J91510j67666j42863l6088K9181p2610
14484B340401j98200l46654p984M26508Q0255j90156n9091p8726k54232N37269
14474B249390M98428M5330k46408k61487k33841L7203q715j90654k96346K45895
14464A838795j50015K36326P3992J27140J28606p0630o5047j31592q4881M0208
14454A942902o9959J86996K82328M4574P9295j55677j33161R5835J83405R8109
14444B554647Q1434m53881K8703J65287J71507n4248J29577r6196M4205K96476
14434B867511M4561j16014k97246j60283J65987Q8723l13320p6080L69569m950
$$ y = [2051716, 2150813, 2097034, 1972223, 1909162, 1644869, 1631524, 1587097, 1610523, 1542621, 1637129, 1909464, 1745496, 1645568, 2094162, 2538937, 2730447, 2562781, 2419918, 2383830, 2413011, 2340401, 2142201, 1795547, 1787563, 2214071, 2294326, 2104170, 2045079, 1966353, 1712121, 2249390, 2747818, 2793148, 2546740, 2285253, 2051412, 2088615, 2079900, 1889246, 1592900, 1838795, 1688780, 1925106, 1999098, 2126238, 2254844, 2184214, 2119167, 1987575, 1902694, 1942902, 1872943, 2059939, 2342267, 2386841, 2466136, 2310459, 2177298, 2273133, 2456538, 2554647, 2636081, 2182200, 2210903, 2376190, 2547697, 2493449, 2623026, 2526830, 2571035, 2867511, 2912072, 2796058, 2498812, 2338529, 2504516, 2593239, 2279919, 2203839, 2573408, 2568458]
14424B568458J77826J07339n20152l60205J2250J78377p4139M9690J52302m8569
14414B243177L99078J97434q5993m64193k26821P6077K03039N2823k7335L630
14404B370916L28343O895r8294m3461j76383J24768J45671J1658Q7539j53588
14394B604064p7540P6881J48216N3748K18107k83339J04078j70711n5243J71350
14384B789611L5607r6136k66703p6483j09784o7512M03488O36230L9386P9598
14374C367302l24566k18037R7293k30002l35197K61635j96863m2530P9169M0715
14364B498919q9061j11587L65777m4420p7299n2188j45242L4716K12819l352j62031
14353B427051J65683K27909K9778K5885J43788J22019N6924J13220j33362o26474
$$ y = [2568458, 2746284, 2853623, 2333471, 1973266, 1985516, 2163893, 2089754, 2139444, 2291746, 2243177, 2642255, 2839689, 2753696, 2289503, 2062682, 2138759, 2341798, 2394621, 2367286, 2370916, 2699259, 2706154, 2607860, 2564399, 2388016, 2512784, 2658455, 2670113, 2757652, 2604064, 2526524, 2603405, 2751621, 2805369, 3023476, 2740137, 2844215, 2673504, 2618261, 2789611, 2825218, 2729082, 2462379, 2385896, 2276112, 2208600, 2612088, 3248318, 3287704, 3367302, 3042736, 2824699, 2921992, 2691990, 2356793, 2618428, 2421565, 2379035, 2458204, 2498919, 2409858, 2298271, 2664048, 2619628, 2542329, 2490141, 2344899, 2379615, 2592434, 2589082, 2427051, 2592734, 2820643, 2850421, 2876306, 3020094, 3142113, 3199037, 3312257, 3178895, 2552421]
14343B552421Q7791P3883K63460j60301J52441q868l6992K04643q7359p3683K0209
14332B987645k27384j84939k58948J30659J20599j78128L90821O45605J08159
14323C534089l46724J67668J68836k63427n17158J40833J16105J04288j93420
14314B911090K18677K7431M4863M74453K76924k49404l33051j97208k70644J57659
14304C060790L09081J23720K30722l8043m14348j10756K01102O7451j96941k09369
14294C023409L2694R2393P2612q3854k37183L74074K83098l3051j35381j52503
14284C236308n0698N15281J66506k61772j69215j69073j00136J46981M91872J06185
14274C912239K47292J48123m70272k91741L80133J82810n49819l02419L73236
$$ y = [2552421, 2640212, 2714095, 2977555, 2817254, 2969695, 2960827, 2923835, 3128478, 3041119, 2967436, 2987645, 2760261, 2575322, 2316374, 2447033, 2567632, 2389504, 2780325, 3425930, 3534089, 3187365, 3355033, 3523869, 3260442, 2743284, 2884117, 3000222, 3104510, 2911090, 3129767, 3157198, 3202061, 3676514, 3953438, 3704034, 3370983, 3173775, 2903131, 3060790, 3369871, 3493591, 3724313, 3686270, 3271922, 3161166, 3362268, 3429719, 3232778, 3023409, 3056103, 3148496, 3221108, 3137254, 2900071, 3274145, 3557243, 3524192, 3388811, 3236308, 3185610, 3700891, 3867397, 3605625, 3436410, 3267337, 3167201, 3314182, 3806054, 3912239, 4159531, 4307654, 3837382, 3545641, 3925774, 4108584, 3558765, 3256346, 3629582]
14265C629582J62507M7151j21838J70825K65413m3726j08805k13406q2151P7823
14255C783375P400k89523m18898o6017Q1614j33967L62796K74559j98486K417
14245C405270K73134Q1134o7695o61J48184J31093j20382m4766R4898K10406L9868
14234D150483k07491m93801N8111L98131m97004K01437P0705K0662j40333k03423
14224C357477j17113N94004J68358m55517J78950l2726Q3043P9234O2595M11327
14214D329632r0615k28076j55901j67729L82214L80865p0391Q3739L2872k55719
14204D240891q8806O7849l27j61534r6884j02189J23262j42130j70247K49282
14194C919167k47329k56159J97399j95881K39808J39227K00637k19353k14952
$$ y = [3629582, 3792089, 3839240, 3717402, 3888227, 4153640, 4109914, 4001109, 3787703, 3705552, 3783375, 3790775, 3501252, 3082354, 3016337, 3097951, 2963984, 3326780, 3601339, 3402853, 3405270, 3678404, 3759538, 3691843, 3691182, 3839366, 3970459, 3850077, 3805311, 3900209, 4110615, 4150483, 3942992, 3449191, 3507302, 3905433, 3408429, 3609866, 3680571, 3701233, 3560900, 3357477, 3240364, 3834368, 4002726, 3547209, 3726159, 3693433, 3776476, 3855710, 3918305, 4329632, 4239017, 4010941, 3855040, 3687311, 4069525, 4450390, 4379999, 4463738, 4496610, 4240891, 4152085, 4219934, 4219607, 4058073, 3961189, 3859000, 3982262, 3840132, 3669885, 3919167, 3671838, 3415679, 3613078, 3417197, 3657005, 3796232, 3996869, 3777516, 3562564]
14185C562564K38132N71697J26775K2654J74112J10797k25810q1453J54021k84482
14175D369007m82545l6761j39341K41420K66962j23819N9873k00812k64612L17686
14165D007058N22835L36235J16259n26340o3359k6151J36516J49485n4304M1213
14155D639447j36718J01039k28090m87J1830O17215J48429k35712j65064R0795
14145D842684Q670J05163k79873j01525J96463l71831J00121j9829k74268k4371
14135D181404J8359J63985o6862m12318L7971L4209K89740J01901K67296J62851
14125D778536k8988Q0189N1129l9868K30616L2123j72589P2610J3615k93497J7561
14114D741437J36237q0093k59997Q0075K28732j82066N1361K36389Q955k25135
$$ y = [3562564, 3800696, 4372393, 4499168, 4521822, 4695934, 4806731, 4580921, 4499468, 4653489, 4369007, 3886462, 3849701, 3710360, 3951780, 4218742, 4094923, 4154796, 3953984, 3689372, 4007058, 4529893, 4866128, 4982387, 4456047, 4392688, 4366537, 4503053, 4652538, 4598234, 4639447, 4502729, 4603768, 4375678, 4375191, 4387021, 5004236, 5152665, 4916953, 4751889, 4842684, 4851354, 4956517, 4676644, 4575119, 4771582, 4399751, 4499872, 4480043, 4205775, 4181404, 4199763, 4363748, 4296886, 3884568, 3922539, 3956748, 4246488, 4348389, 4615685, 4778536, 4749548, 4829737, 4880866, 4840998, 5071614, 5103737, 4931148, 5003758, 5017373, 4723876, 4741437, 4877674, 4797581, 4537584, 4617659, 4846391, 4664325, 4715686, 4952075, 4961030, 4735895]
14104D735895K60629J42803j96162K63749Q9605j22412J73926r1121k42585j22717
14094D891610J02876k36886j54184J86041N14314j32085l03367p1241l2015L35832
14084E100895J24953J14847m85710l62983L28823O19239n7860m03334j43835m066
14074D830969J9666K1800J52928M54105J37419k10553l14432Q7284J43932R9777
14064E422895j88960J0865L16055M56864m8396m25861k11669R8009K36331l2914
14054E633219k29557k3411J40687L72462k06227k64885k69654r7706J48732M01613
14044E605273L28753M9937K10812P8547l11469K46112r0263l50287j64239m2275
14034E560901j59943J63999J65320P8398L36143l1032j48637K68672K17314r8325
$$ y = [4735895, 4996524, 5139327, 4943165, 5206914, 5296519, 5174107, 5348033, 5256912, 5014327, 4891610, 4994486, 4757600, 4603416, 4789457, 5303771, 5171686, 4868319, 4797078, 4765063, 5100895, 5225848, 5340695, 4854985, 4492002, 4820825, 5440064, 5382204, 4978870, 4835035, 4830969, 4850635, 4872435, 5025363, 5479468, 5616887, 5406334, 5091902, 5179186, 5323118, 5422895, 5233935, 5244800, 5560855, 6017719, 5969323, 5543462, 5331793, 5429802, 5666133, 5633219, 5403662, 5380251, 5520938, 5893400, 5687173, 5422288, 5152634, 5054928, 5203660, 5605273, 5934026, 5983963, 6194775, 6273322, 5961853, 6207965, 6117702, 5767415, 5603176, 5560901, 5400958, 5564957, 5730277, 5808675, 6144818, 6113786, 5965149, 6233821, 6451135, 6352810]
14024F352810l52387q2525K48684r8673P3220m09008K01690k6410j72024K50261
14014E985638j47280J0842J30424p491m39602o1948L93089J69485K39362L35768
14004F608287J66754k13348j23036j71749L1215k55844q9910K31256K2646O7922
13994F274193L00823L75421J01018p8535J09553k35742j29294P8278J74908j788
13984F968835n9933p768j60458j76957j07265n7867J8898L96418K01191K28869
13974G243963J0378j23255R7409Q1771J8846r8731M9536R1087j06697k32269j02221
13963F929817o8686j89639j76851J53845J9386Q3307k3381p7752m4675K62040
13953F867411J93029J00542k27961j42530r418o3892K72467J29536k35892R6228
$$ y = [6352810, 6000423, 5917898, 6166582, 6067909, 6141129, 5732121, 5933811, 5907401, 5735377, 5985638, 5838358, 5849200, 5979624, 5972133, 5532531, 5470583, 5863672, 6033157, 6272519, 6608287, 6775041, 6561693, 6438657, 6266908, 6298123, 6042279, 5952369, 6183625, 6206271, 6274193, 6575016, 6950437, 7051455, 6972920, 7082473, 6846731, 6717437, 6795715, 6970623, 6968835, 6908902, 6901134, 6740676, 6563719, 6456454, 6398587, 6417485, 6813903, 7015094, 7243963, 7254341, 7131086, 7228495, 7310266, 7329112, 7230381, 7279917, 7371004, 7264307, 7032038, 6929817, 6861131, 6671492, 6494641, 6648486, 6667872, 6751179, 6727798, 6650046, 6605371, 6867411, 7060440, 7160982, 6933021, 6790491, 6781073, 6717181, 6989648, 7119184, 6883292, 6979520]
13943F979520N1476j05547l84714K83633J77817L1427K47495n7185l4019M23254
13933G613157K5395k63143j72845K8243q4510K14294J19471K11129j5102P1724
13923G747813L05116K74564n8740j92169P4679q4126j04025j37083K54842J05794
13913H186665J56704N991j22912j21839J32266o2085l8675j87259M5523J2024
13903H006403M34409L30121K0402O6971k70462l8131j23898M11305N8284m42223
13893H453181l06976k47428J67279L16703J92086K045m5240J09711k72872K40249
13883H608738L70828l48043k47305l3669M48723J89219l998J22589p6720j78108
13873H852254M7430K33590K26457r6479l77082k3814K23873R1217j03285K3025
$$ y = [6979520, 7030996, 6925449, 6540735, 6824368, 7002185, 7033612, 7281107, 7223922, 7189903, 7613157, 7638552, 7375409, 7202564, 7230807, 7146297, 7360591, 7480062, 7691191, 7676089, 7747813, 8052929, 8327493, 8268753, 8076584, 8151263, 8067137, 7963112, 7826029, 8080871, 8186665, 8343369, 8349360, 8226448, 8104609, 8236875, 8174790, 8136115, 7948856, 7994379, 8006403, 8440812, 8770933, 8791335, 8858306, 8587844, 8549713, 8425815, 8837120, 8895404, 8453181, 8146205, 7898777, 8066056, 8382759, 8574845, 8576890, 8531650, 8641361, 8368489, 8608738, 8979566, 8631523, 8384218, 8350549, 8799272, 8988491, 8984493, 9107082, 9030362, 8852254, 8899684, 9133274, 9359731, 9263252, 8886170, 8862356, 9086229, 9177446, 9074161, 9097186]
13863I097186R7314j15929J34511K04699L3224k60337R2441p3925l41329J19488
13853H987343L14096K6454l74J04978O7574j28060J24949Q6669j31092L1168L42297
13842I826002L18764j39459j30923J71290l8211o11758K7169K94214K95740k87042
13832I725786r2321L07460j3779J72555J65105K58313k64035J68510j3685l27997
13822A0085912q6261K61852M99786j80946J60115M54809m0003j87072p3921O9662
13812A0963933L6465o6538P747J78095J10480O0996q2921m22337J08394K1295
13802A0915609l44495K08926J1264J34617J73162k11206m4859l6672R2063K22706
13792A1121115n2894m3310M082J73931Q7398K78408K3700k43064j19997K51779
$$ y = [9097186, 9194500, 9078571, 9213082, 9417781, 9451005, 9190668, 9283109, 9209184, 8867855, 8987343, 9301439, 9327893, 9327519, 9432497, 9500071, 9372011, 9496960, 9583629, 9452537, 9483705, 9826002, 10144766, 10005307, 9874384, 10045674, 10007463, 9395705, 9422874, 9717088, 10012828, 9725786, 9633465, 9940925, 9927146, 10099701, 10264806, 10523119, 10259084, 10427594, 10413909, 10085912, 9999651, 10261503, 10761289, 10580343, 10740458, 11195267, 11155264, 10968192, 10894271, 10963933, 11000398, 10933860, 10941607, 11119702, 11230182, 11291178, 11208257, 10785920, 10894314, 10915609, 10571114, 10780040, 10791304, 10925921, 11099083, 10887877, 10843018, 10806346, 10898409, 11121115, 11068221, 11024911, 11028993, 11202924, 11290322, 11568730, 11592430, 11349366, 11229369, 11481148]
13782A1481148M0019r4673K50932j73000N728L08826Q6106r2743J76508K01743
13772A2190594j42903j0205p4002k83050J13833m0961o7194L50698L18527J24681
13762A2480018j32418K51347m3691q430L9883Q821M51156R6158j66393m6206j84883
13751A2745362P1944K24031P5818k80453j52968p696R4942J50394J78485J16647
13741A3216506n8490O89K33834J79046J075K8488M5201K53487N3803R1353k43746
13730A3801246j13444M9460K05337L10837L63595j03759k26174k87888m25646
13721A3573564M05576M25137Q2699j69446k42192K26579J06862J45361J3366q8410
13711A4479096j857O61344j5318m06870l55607J53500M13664M46162Q9060n0553
$$ y = [11481148, 11521167, 11426494, 11677426, 11504426, 11510154, 11818980, 11905086, 11812343, 11988851, 12190594, 12047691, 12037486, 11963484, 11680434, 11794267, 11753306, 11686112, 12036810, 12355337, 12480018, 12347600, 12598947, 12555256, 12546826, 12586709, 12595530, 13046686, 13142844, 12976451, 12930245, 12745362, 12817306, 13041337, 13117155, 12836702, 12683734, 12676038, 12770980, 12921374, 13099859, 13216506, 13158016, 13158705, 13392539, 13571585, 13572660, 13601148, 13646349, 13899836, 13953639, 14044992, 13801246, 13687802, 13737262, 13942599, 14253436, 14617031, 14513272, 14287098, 13999210, 13573564, 13979140, 14404277, 14486976, 14317530, 14075338, 14301917, 14408779, 14554140, 14567506, 14479096, 14477239, 15138583, 15123265, 14716395, 14360788, 14514288, 14927952, 15374114, 15463174, 15412621]
13701A5412621J81042j02177K7011L01414K84948k24465j20177k38151J00735
13692A5622801R5418k00306k11402L20827J94143O92050J7875k66459K08750j76797
13682A6296900l05635k89905J49170J53046j6006K90441L91959K45545J69811
13673A7085326m6438j02987k67585n7896J31511J02550O9724J48221P3576J03376
13663A7239378M7343k3470Q9273K40474M1227j42490M04028K86867j29730K37426
13653A8290326J43876j96859J41821L79673k36845J41150k15958J48406J71464
13644A8767054J90733L38764o8923K5110J32596L4709K99288L68453j51286j47997
13634A9788501j7103J86313K02135j02628p684p9492q2597L40528L88855l7394
$$ y = [15412621, 15593663, 15491486, 15518497, 15819911, 16104859, 15880394, 15760217, 15522066, 15622801, 15718219, 15517913, 15306511, 15627338, 15821481, 16513531, 16531406, 16264947, 16473697, 16296900, 15991265, 15701360, 15850530, 16003576, 15987570, 16278011, 16669970, 16915515, 17085326, 17038888, 16935901, 16668316, 16610420, 16741931, 16844481, 16914205, 17062426, 17136002, 17239378, 17286721, 17263251, 17352524, 17592998, 17634225, 17491735, 17895763, 18182630, 18052900, 18290326, 18434202, 18237343, 18379164, 18758837, 18521992, 18663142, 18447184, 18595590, 18767054, 18957787, 19296551, 19227628, 19252738, 19385334, 19420043, 19719331, 20087784, 19936498, 19788501, 19771398, 19957711, 20159846, 20057218, 20049534, 19970042, 19887445, 20227973, 20616828, 20579434]
13624B0579434o6952J1166q9197l04698j75257k2892L33998L14804J67825L90774
13614B1139005J17192k38129O6651J95143K94658L36834K40525j03711m41661
13605B1606507j97887Q4767K07458J45252m02244J331K82581J14311m6463J66199
13595B1961812M45447L39607R2346J21835j0218j60981L0443K22668k7062r3068
13585B2922829K41096j10961M8855K97725K54638n0389L450J37063q0097J04503
13575B3768712J20936l5760K54667J37943L02899J64267k23927J75383J07332
13566B4772452J51751O7484n7392J66368N02127L43083K01355k3938j33848J56745
13556B6146187j68897p9720J32421j44987J33723j03147J6179M96040J10313J05498
$$ y = [20579434, 20512482, 20523648, 20434451, 20129753, 19954496, 19931604, 20265602, 20580406, 20748231, 21139005, 21256197, 21018068, 21084719, 21279862, 21574520, 21911354, 22151879, 22048168, 21606507, 21408620, 21493387, 21700845, 21846097, 21443853, 21445184, 21727765, 21842076, 21795613, 21961812, 22407259, 22746866, 22839212, 22961047, 22950829, 22789848, 22820291, 23042959, 23015897, 22922829, 23163925, 23052964, 23101819, 23399544, 23654182, 23603793, 23607243, 23744306, 23664209, 23768712, 23889648, 23853888, 24108555, 24246498, 24549397, 24713664, 24489737, 24665120, 24772452, 24924203, 24991687, 24934295, 25100663, 25602790, 25945873, 26147228, 26123290, 25989442, 26146187, 25977290, 25897570, 26029991, 25885004, 26018727, 25915580, 25931759, 26427799, 26538112, 26643610]
13546B6643610m2875O71366J63515P8628q0201j98841J36822K19394L17364J64980
13536B8073762j8006k7385K67516K10452L40945L65124r0719J8809K92280K30546
13526B9663324k12283m7824K24277m9292K56546J95525K60105J51350K23931J26993
13516C0792652N925q4317j1627J29175k724K25662J42083P178J72403N47739R6217
13505C2020366r5284R1687J38300L39602j41828L63226M31169K76424k7894q5078
13495C3310690J42406P2556O8340M1551L35693j06212j08293M53859M34409N41517
13485C5186516q3120J85719J7655j8539L53719l234J74912N17463N6985m22864
13475C5965212K43336L89874N5326J80051J78818n8210M56164o3872J37824J9095
$$ y = [26643610, 26600735, 27272101, 27435616, 27514244, 27434043, 27235202, 27372024, 27591418, 27908782, 28073762, 28055756, 28028371, 28295887, 28506339, 28847284, 29212408, 29121689, 29140498, 29432778, 29663324, 29451041, 29403217, 29627494, 29578202, 29834748, 30030273, 30290378, 30441728, 30665659, 30792652, 30798577, 30714260, 30702633, 30831808, 30829084, 31054746, 31196829, 31204007, 31376410, 31924149, 32020366, 31925082, 32016769, 32155069, 32494671, 32352843, 32716069, 33147238, 33423662, 33395768, 33310690, 33453096, 33525652, 33593992, 33635543, 33971236, 33865024, 33756731, 34210590, 34644999, 35186516, 35103396, 35289115, 35306770, 35288231, 35641950, 35638716, 35813628, 36331091, 36388076, 35965212, 36208548, 36598422, 36653748, 36833799, 37012617, 36954407, 37410571, 37346699, 37484523, 37503618]
13465C7503618j345L61188M01378L15699J92945J96073K49927K31527K99381l84264
13455C9366127L3487K97084J15826K55073O35945K55313K50981L5502j44125l3389
13445D1067824K06570K64178J75910K1228K81599L28634K69681J73253N24554
13436D3313431P55594K68367N715O1720q8093N605N2468L34734M55220Q6075K13639
13425D5464475M13792k75757k24149K62351M49547M12209J46025J83344N1758
13416D6883595J72538K0593Q3263M17690L37390K24288L77823K43221L2117K51605
13406D9044123M42256K96222M50531J29527O4819M12210M67187L84354r2771l37690
13396E1260768J02935M05124O05839P09880L35723K15035M4901l16654j12266
$$ y = [37503618, 37502273, 37863461, 38264839, 38580538, 38773483, 38969556, 39219483, 39451010, 39750391, 39366127, 39399614, 39696698, 39812524, 40067597, 40703542, 40958855, 41209836, 41245338, 41101213, 41067824, 41274394, 41538572, 41714482, 41735710, 42017309, 42345943, 42615624, 42788877, 43313431, 44069025, 44337392, 44343107, 44404827, 44316734, 44322339, 44374807, 44709541, 45164761, 45250836, 45464475, 45878267, 45602510, 45378361, 45640712, 46090259, 46502468, 46648493, 46831837, 46883595, 47056133, 47076726, 47159989, 47577679, 47915069, 48139357, 48517180, 48760401, 48792518, 49044123, 49486379, 49782601, 50233132, 50362659, 50427478, 50839688, 51306875, 51691229, 51598458, 51260768, 51363703, 51768827, 52374666, 53084546, 53420269, 53635304, 53680205, 53363551, 53251285]
13387E3251285J90254N3395O16260O73123L55722K09074M65245L93878j44889
13378E6063347J7749L32425L62589K36666N44814L40024J37561L13403L69361
13369E8717939N50831K86129j07089o0021K31005L16393J40039M16353N38157
13360F1029736M63221L1727J34955k13179M28890K35729N21564M84643O796N48388
13350F3672470Q52478K78058O3165L75157j01413M03667K65854J92669M80016
13341F6482121L08605L26755O07937J53305K06077L05584j34822L37428J89178
13332F8782168M70427N99659K64325r03M31827M06905J35936K79789K62083L17130
13322G1949346N24563K09731O30395K63910J36243K59965N03690J75306L10289
$$ y = [53251285, 53441539, 53494934, 54111194, 54784317, 55140039, 55349113, 55814358, 56208236, 56063347, 56081096, 56413521, 56776110, 57012776, 57557590, 57897614, 58035175, 58348578, 58717939, 59268770, 59554899, 59447810, 59387789, 59618794, 59935187, 60075226, 60491579, 61029736, 61492957, 61524684, 61659639, 61446460, 61875350, 62111079, 62632643, 63117286, 63124082, 63672470, 64524948, 64803006, 64866171, 65241328, 65139915, 65543582, 65809436, 66002105, 66482121, 66790726, 67117481, 67725418, 67878723, 68084800, 68390384, 68255562, 68592990, 68782168, 69252595, 69852254, 70116579, 70115676, 70547503, 70954408, 71090344, 71370133, 71632216, 71949346, 72473909, 72683640, 73314035, 73577945, 73714188, 73974153, 74477843, 74653149, 74963438]
13313G4963438K57631L0785L70486L28357K92770L98213L26735R9640L85260N54410
13303G8007725J01966L11205N17519M81762N20195J33454Q3836J48330L21817
13294H0627809N09110M91860J81037K31961M77507M73452L48050L24342O3076
13285H3728204k32473K72287Q40528P22884J51981L00849J59648L7350P53733
13276H6734991K97923K4225M03064L94174M93587M44464M59944j00578N34088
13267H9685882M94263J89360N54196L83190J10949K29778M79721L99895N06133
13258I3033367J51534L22764J28269K86286K10385L1641L24597M11917J52553
13249I5053313J65851K14150O77404Q41637L96812J16633K66446J34469Q6716
$$ y = [74963438, 75221069, 75251854, 75622340, 75950697, 76243467, 76641680, 76968415, 77068055, 77453315, 78007725, 78109691, 78420896, 78938415, 79420177, 79940372, 80073826, 80157662, 80305992, 80627809, 81136919, 81628779, 81809816, 82041777, 82519284, 82992736, 83340786, 83665128, 83728204, 83495731, 83768018, 84608546, 85331430, 85483411, 85784260, 85943908, 85981258, 86734991, 87032914, 87057139, 87460203, 87854377, 88347964, 88792428, 89252372, 89151794, 89685882, 90180145, 90369505, 90923701, 91306891, 91417840, 91647618, 92127339, 92527234, 93033367, 93184901, 93507665, 93635934, 93922220, 94132605, 94164246, 94488843, 94900760, 95053313, 95219164, 95433314, 96110718, 96952355, 97349167, 97465800, 97732246, 97866715, 97953431]
13240I7953431M0478M39355N09740j14413K93498K91119K49254P5350L44313N12391
13230A00594516K46094P75197J25489N41962M76239J06569L42286k205J00051
13221A03306198m4616R4175K25082J73553M71518N30780K02316J82419L26511
13212A05467936j10236K07731O23229R1469l5129K89849K41456J58072K28768
13203A07163145N44054L14282j21637J80898p9697K61130K88429m4076N6295J17246
13193A08680069p8670K88448M19124M82424J08283J53165K15011K32209j19496
13184A10380567O7482k3981J75297L06127K03716N7424K2904J05634j1934j22624
13174A11160612j00695M03125M97983J81211q5004j43590k8602J60444j67679
$$ y = [97953431, 97993909, 98433264, 98943004, 98828591, 99122089, 99413208, 99662462, 99737812, 100082125, 100594516, 100840610, 101615807, 101741296, 102283258, 102759497, 102866066, 103208352, 103206147, 103306198, 103261582, 103355757, 103580839, 103754392, 104225910, 104756690, 104959006, 105141425, 105467936, 105357700, 105565431, 106188660, 106280129, 106245000, 106534849, 106776305, 106934377, 107163145, 107707199, 108021481, 107899844, 108080742, 108001045, 108262175, 108550604, 108506528, 108562823, 108680069, 108601399, 108889847, 109308971, 109791395, 109899678, 110052843, 110267854, 110500063, 110380567, 110448049, 110424068, 110599365, 110905492, 111109208, 111166632, 111189536, 111295170, 111283236, 111160612, 111059917, 111463042, 111961025, 112142236, 112057232, 111913642, 111885040, 112045484, 111877805]
13165A11877805O32026L09440J48064O4238k62034j23721J04253j18264J34848
13156A12766655O9122O2050j05637k66427j19380R9323j1068N72457J10590l90759
13146A12786926J15614L64536p4214k74948j94622k13222l49021L5171J71337
13137A12367557J11856j42560k78013j26206Q5223k37366O7014q6758J17369J95126
13127A12073242k51196k78332k55599K04582j44678j93027k28316j28103K98117
13118A11096690K29925j84615m02597l59594r8650j77494l52201l15581m10517
13109A09025366q7154j58924r3812m5890j04582p1090n16470k99683o3676J38915
13099A07723000j21406q4975j52524o17000k62046K39398m89445k74380M1382
$$ y = [111877805, 112509831, 112819271, 112967335, 113031573, 112769539, 112645818, 112750071, 112631807, 112766655, 112835777, 112897827, 112792190, 112525763, 112406383, 112505706, 112494638, 113067095, 113177685, 112786926, 112902540, 113267076, 113192862, 112917914, 112723292, 112510070, 112161049, 112196220, 112367557, 112479413, 112336853, 112058840, 111932634, 112017857, 111780491, 111847505, 111760747, 111878116, 112073242, 111822046, 111543714, 111288115, 111492697, 111348019, 111154992, 110926676, 110798573, 111096690, 111326615, 111142000, 110739403, 110379809, 110281159, 110103665, 109751464, 109435883, 109025366, 108938212, 108779288, 108685476, 108639586, 108535004, 108463914, 107947444, 107647761, 107584085, 107723000, 107601594, 107516619, 107364095, 106747095, 106485049, 106724447, 106235002, 105960622, 106002004]
13090A06002004k15545M6003m5697q8627n4284n09671o14564l15028j8363j66480
13080A04019748l29847l27834k49381m60889l82462k63899j33885k42207m28325
13071A01201019m20728k12269j47333j46287J59578n8499o17919m83155j78002
13062I9096405m25792l33563j54013o03510o96410k04026j57920j47851l62437
13053I6010883k58572j45056j90429l86464o31688j97154k00921j60791l83835
13044I3455973l45505o09131m30416J85976m18408l69410k93146n30726m81551
13035I0163656k06840m13478j37037k36025n49106n27022j70755j38580m09983
13026H7374830l2881n00287o16917n98292k9849J39291l14382n54356l60171l11228
$$ y = [106002004, 105786459, 105832462, 105786765, 105698138, 105643854, 105134183, 104519619, 104204591, 104186228, 104019748, 103689901, 103362067, 103112686, 102651797, 102269335, 102005436, 101871551, 101629344, 101201019, 100780291, 100568022, 100420689, 100274402, 100433980, 100375481, 99757562, 99274407, 99096405, 98670613, 98337050, 98183037, 97579527, 96883117, 96679091, 96521171, 96373320, 96010883, 95752311, 95607255, 95416826, 95030362, 94398674, 94201520, 94000599, 93839808, 93455973, 93110468, 92501337, 92070921, 92256897, 91838489, 91469079, 91175933, 90645207, 90163656, 89956816, 89543338, 89406301, 89170276, 88621170, 88094148, 87923393, 87784813, 87374830, 87341949, 86841662, 86224745, 85626453, 85596604, 85735895, 85421513, 84867157, 84506986, 84195758]
13016H4195758k52638l31038k24641m26764p14982J7375k76138m41572l10079
13007H1235281m53083n19010j89422l73007k97592n23541m70255j72468j1580
12998G8225323P6091l47046n10628o23207k97327o81821j85701j88190o79311
12989G4788183m21838j46898M146J80683l66816r30300m69212j86134k80600M5097
12979G2216311K5340P2960n29309o06613j65921j05010l27493j91592m88532o02736
12969F9297405m28945m09262k19177J75988j32964m73135n26961n16141k40109
12960F6526699l33622k48889k10775j16562o762Q3888k63802q54619l87512l06800
12950F3881244j39640n45677n29252n39499m0309j53458O3786k93916m97443m39231
$$ y = [84195758, 83943120, 83612082, 83387441, 82960677, 82245695, 82263070, 81986932, 81545360, 81235281, 80782198, 80263188, 80073766, 79700759, 79403167, 78879626, 78409371, 78236903, 78225323, 78301414, 77954368, 77443740, 76820533, 76523206, 75841385, 75655684, 75467494, 74788183, 74366345, 74219447, 74223593, 74404276, 74037460, 73107160, 72637948, 72451814, 72171214, 72216311, 72241651, 72314611, 71785302, 71178689, 71012768, 70907758, 70580265, 70388673, 69900141, 69297405, 68868460, 68459198, 68240021, 68416009, 68283045, 67809910, 67282949, 66766808, 66526699, 66193077, 65944188, 65733413, 65616851, 65610089, 65693977, 65430175, 64575556, 64188044, 63881244, 63741604, 63195927, 62666675, 62127176, 62086867, 61933409, 61997195, 61703279, 61205836, 60766605]
12940F0766605l7789O2494n6650l94542l55168k49944o26864m73062m9878N8785
12930E8643987k07263m84453m36664k99920l17612L9134l73741k25990j24890
12921E6212588m09571k73370m11473k05699j04042k00217k33032k39633l15109
12912E3820442k08758k69922R4915L70615j86593q13018l61931l70668K0154q0732
12902E2014504m71415o16226j83239P4884n78453m21883j89843l93826j11859
12893D9122644P3516K4412n05126l17978o2349j14995m40789Q6317l25965n44782
12883D6994905j99940j2893k80389l03895N4056p5289P4945m69959m75169p7999
12873D5228373l27427n65835K9670o7548M5872K14465k88617n29733l23942j19862
$$ y = [60766605, 60728816, 60791310, 60734660, 60340118, 59984950, 59735006, 59108142, 58635080, 58585202, 58643987, 58436724, 57952271, 57515607, 57215687, 56898075, 56937209, 56563468, 56337478, 56212588, 55803017, 55529647, 55118174, 54912475, 54808433, 54608216, 54375184, 54135551, 53820442, 53611684, 53341762, 53436677, 53807292, 53620699, 52807681, 52445750, 52075082, 52095236, 52014504, 51543089, 50926863, 50743624, 50818508, 50240055, 49818172, 49628329, 49234503, 49122644, 49196160, 49220572, 48715446, 48397468, 48335119, 48220124, 47779335, 47865652, 47539687, 46994905, 46794965, 46782072, 46501683, 46197788, 46251844, 46176555, 46251500, 45781541, 45306372, 45228373, 44900946, 44335111, 44364781, 44297233, 44343105, 44557570, 44268953, 43739220, 43415278, 43295416]
12863D3295416j82452k47098k24450k11467m13722n04820l52274K43118M07139
12854D1809390L87584k32801p90939m64340k50938j0746k50601J79562o4571k02602
12844D0108998J5542o6389o05152m79107k67454j5179J59818j27530m62947j41589
12834C8119011j75470N6790n2657j65474j34349o6500j08474k53691k32414j56369
12824C6830403k7462k67852l92145k54368m27293l54056j18526k2381o5210J72668
12814C5073778k94700l57516l68304n2005j978M8508l62030M2652j85530n54460
12804C2988415k20349K83295L62947m06260k12279J47779l63820k24722m06710
12795C1948296P6358K30216J59060j92729j7531J9049m38977q47132o37588j61608
$$ y = [43295416, 43112964, 42865866, 42641416, 42429949, 42016227, 41511407, 41159133, 41402251, 41809390, 42196974, 41964173, 41173234, 40708894, 40457956, 40447210, 40196609, 40376171, 40311600, 40108998, 40124540, 40058151, 39452999, 38973892, 38706438, 38691259, 38851077, 38723547, 38260600, 38119011, 37943541, 38000331, 37947674, 37782200, 37647851, 37581351, 37472877, 37219186, 36986772, 36830403, 36802941, 36535089, 36142944, 35888576, 35461283, 35107227, 34988701, 34966320, 34901110, 35073778, 34779078, 34421562, 34053258, 34001253, 33999275, 34047783, 33685753, 33728405, 33542875, 32988415, 32768066, 33051361, 33414308, 33008048, 32795769, 32943548, 32579728, 32355006, 31948296, 32024654, 32254870, 32413930, 32221201, 32203670, 32222719, 31783742, 30936610, 30299022, 30137414]
12785C0137414M84866k63525l90021Q6428R8115J18942Q1632j05014j44176K8890
12775C0133551m32974K02412j93004l79828l58860n2288o77l8405L59614j76160
12765B9063381m47159l83969l15518L863j45421j94366Q7344J61868j20121j94455
12755B7515447K96954L0947k39708k69753m65040k21122k1688l9565j72265J22895
12745B6537102k42935j84361J0257J18254k5529M9824l31565m32549L7062q845
12735B5526715m0890j76257l45580l51540J6656K32416k28232k61782J00013P8274
12725B4549793J995O1240N4343l32600k19436j4209j72916K333j16352j4768K08560
12714B4007983J0162o01445o72982m815K89738J68666J60822j47603l7190L54798
$$ y = [30137414, 30622280, 30358755, 29968734, 30055162, 30153277, 30272219, 30353851, 30248837, 30104661, 30133551, 29700577, 29902989, 29709985, 29330157, 28971297, 28919009, 28918332, 28879927, 29239541, 29063381, 28616222, 28232253, 27916735, 27920598, 27775177, 27580811, 27668155, 27830023, 27709902, 27515447, 27812401, 27843348, 27603640, 27333887, 26868847, 26647725, 26626037, 26586472, 26414207, 26537102, 26294167, 26109806, 26120063, 26238317, 26212788, 26262612, 25931047, 25498498, 25535560, 25526715, 25485825, 25309568, 24963988, 24612448, 24629104, 24861520, 24633288, 24371506, 24471519, 24549793, 24551788, 24613028, 24667371, 24334771, 24115335, 24101126, 23928210, 23930543, 23814191, 23799423, 24007983, 24018145, 23416700, 22743718, 22738903, 23028641, 23197307, 23358129, 23210526, 23173336, 23528134]
12704B3528134k98480j94897l76814q3205K8243o5971k25534j62610k9622m69318
12694B1649926k27262m69844Q7268M24691J22047O0320l55530l01061r9469Q6642
12684B0977728n5171Q0034J96946K7905j98988k03938K35903k95727m22366l25860
12674B0016466j25908l16639k56744J24025L14397J76079j72078k05098J31686
12665A9686186j06990J60387j66154m12993l1920K41190o3601k09585n8358Q0449
12655A9118611o3067N7513k05877N8853J19555j17179m48570K6653K53587o4239
12645A8735840j72606J5150J53888K18591L2236K2910m94802l49749l79191K13288
12635A7995555K29372j86192L3756J15795m91749j99440l58913j22619R6748Q2114
$$ y = [23528134, 23229654, 23034757, 22657943, 22574738, 22602981, 22537010, 22311476, 22148866, 22119244, 21649926, 21422664, 20952820, 21040088, 21464779, 21586826, 21647146, 21291616, 20990555, 20891086, 20977728, 20922557, 21002591, 21199537, 21227442, 21028454, 20824516, 21060419, 20764692, 20342326, 20016466, 19890558, 19573919, 19317175, 19441200, 19755597, 19931676, 19759598, 19554500, 19686186, 19579196, 19739583, 19573429, 19160436, 19128516, 19369706, 19306105, 19096520, 19038162, 19118611, 19055544, 19113057, 18907180, 18966033, 19085588, 18968409, 18519839, 18546492, 18800079, 18735840, 18563234, 18578384, 18732272, 18950863, 18983099, 19006009, 18511207, 18161458, 17782267, 17995555, 18224927, 18038735, 18072491, 18188286, 17696537, 17497097, 17138184, 17015565, 17112313, 17194427]
12625A7194427J80996j32568J74603q0077j72725k79124k79923j21248l9738J60278
12615A6604901J97217o6170l98059L66576m06227q66178p94J45140J61342Q8134
12605A5825882l2584K37363K08230l6323j31827j08751j13640k10412j19848j62234
12595A5355856n4854o8553J95637Q9148K04559J491j31001j97900k01465N682
12585A5198600O6742j30007J18858l3189k71464Q0202K43506l3691j39092J14380
12575A5214845L3319k98340l89775k9389K1689k60007j13491n7283j59444j31785
12565A3830339K21702m613k39837M2769j59941j73526J31606L04548R1724K62535
12555A4307306q8947m1814J37493j73481l17285k04174k60370j09007K39856j98658
$$ y = [17194427, 17375423, 17242855, 17417458, 17337381, 17164656, 16885532, 16605609, 16484361, 16444623, 16604901, 16802118, 16735948, 16337889, 16704465, 16298238, 15432060, 15431266, 15576406, 15737748, 15825882, 15793298, 16030661, 16238891, 16202568, 16070741, 15961990, 15848350, 15637938, 15518090, 15355856, 15301002, 15232449, 15428086, 15517234, 15721793, 15723284, 15592283, 15394383, 15192918, 15198600, 15265342, 15135335, 15254193, 15221004, 14949540, 15029742, 15273248, 15239557, 15100465, 15214845, 15248164, 14949824, 14560049, 14530660, 14552349, 14292342, 14178851, 14121568, 13962124, 13830339, 14052041, 14047428, 13807591, 13850360, 13690419, 13516893, 13648499, 13953047, 14044771, 14307306, 14218359, 14176545, 14314038, 14140557, 13823272, 13619098, 13358728, 13249721, 13489577, 13290919]
12545A3290919L25Q4924k07078j09726j63380j52598O8895k45432J19285L59960
12535A3046094j78126O7263L1557j75987j04741j18909K55438n6744l03894k21071
12525A2240880k1862K67080J71500l8812j50816k00733m50811R4107o7343j15517
12515A1727673K76682K65396q9931J99561R8137j65739l26961J28007L17710k02877
12505A2227658J33166J30915M8598q3125j81702m53332k50711M38863J57627k43250
12495A1924707m38974M579j41474m1780q4199k0639J96228j71661J11573J60140
12485A1498500j00876l59208n02515l3170o3746n3184L88877K7313l8620L17038
12475A1080409J00311j8922J69574q9919q3415j08354j76103P3978j59224l11399
$$ y = [13290919, 13291244, 13376168, 13169090, 13059364, 12895984, 12743386, 12812281, 12566849, 12686134, 13046094, 12867968, 12935231, 12966788, 12790801, 12686060, 12567151, 12822589, 12765845, 12461951, 12240880, 12219018, 12486098, 12657598, 12618786, 12467970, 12267237, 11816426, 11910533, 11843190, 11727673, 12004355, 12269751, 12179820, 12379381, 12477518, 12311779, 11984818, 12112825, 12430535, 12227658, 12360824, 12491739, 12540337, 12457212, 12275510, 11822178, 11571467, 12010330, 12167957, 11924707, 11485733, 11490312, 11348838, 11307058, 11222859, 11202220, 11398448, 11226787, 11338360, 11498500, 11397624, 11038416, 10535901, 10502731, 10438985, 10385801, 10774678, 10801991, 10763371, 11080409, 11180720, 11161798, 11331372, 11241453, 11158038, 11049684, 10873581, 10947559, 10788335, 10476936]
12465A0476936P7008J33593J75366j38321k37823J20953l1502k13038O5129k30564
12455A0197737p5445J78121N7333J4852k71754L7127r3374K5697k877J0092R3856
12444A0171365m1730Q6882K76508K2037k05562l21444K14450R974j24925l56351
12434I731204l02735K99907J77139J71161j30253q1312j06045j88476p2717j0815
12424I487058K91030j94475k49997l25515p9760q4800k73388l38039K34055N92821
12414I058990M69617p2944j00979j85373k64992P2239J37605J15093J91271N0176
12404I470703j56146n1094j24341m7612j30768m66173L6255k9405k41548n9664
12394H200207J44872L46091J29843j25397J97044N9438j75380j74142J04154k4129
$$ y = [10476936, 10553944, 10687537, 10862903, 10724582, 10486759, 10607712, 10576210, 10363172, 10428301, 10197737, 10122292, 10300413, 10357746, 10372598, 10100844, 10137971, 10044597, 10070294, 10067417, 10077509, 10171365, 10129635, 10216517, 10493025, 10515062, 10309500, 9988056, 10202506, 10212480, 10087555, 9731204, 9428469, 9728376, 9905515, 10076676, 9946423, 9865111, 9759066, 9570590, 9497873, 9487058, 9778088, 9583613, 9333616, 9008101, 8928341, 8843541, 8570153, 8232114, 8466169, 9058990, 9528607, 9455663, 9354684, 9169311, 8904319, 8976558, 9114163, 9229256, 9420527, 9470703, 9314557, 9263463, 9139122, 9091510, 8960742, 8494569, 8530824, 8501419, 8259871, 8200207, 8345079, 8691170, 8821013, 8695616, 8892660, 8952098, 8776718, 8602576, 8706730, 8682601]
12384H682601j28967J03817K828k85181m29310m0986Q6193J55903k00131K32035
12374H178802m05856j17238M0677J48839P4483J4009n1711j152R7909K9063l45806
12363G662019m0660J73581J1886m30834k92992J83065R2963M27406P384K51269
12353H045087R867n8385J04485l64462l52885k21637k0935j39837J94254O11722
12343G807274L78412n07810k62684R4463R849J6996J65357j58446L008J85680
12333G732099P760J85019L3740j15865n66007k76188K99407K395k42885P8920
12323G138395k11428k5097J41265J30113J07810J07410l7832J72468Q8853j19952
12313G492005R4512m1091k69890l24890j29809L4438p6475j79055K86851r4027
$$ y = [8682601, 8553634, 8657451, 8660279, 8375098, 7945788, 7904802, 7990995, 8146898, 7946767, 8178802, 7772946, 7655708, 7696385, 7845224, 7919707, 7933716, 7882005, 7880853, 7978762, 8007825, 7662019, 7621359, 7794940, 7806826, 7375992, 7083000, 7266065, 7359028, 7786434, 7793818, 8045087, 8054954, 7996569, 8101054, 7736592, 7383707, 7162070, 7141135, 7001298, 7195552, 7807274, 8185686, 7677876, 7415192, 7509655, 7519504, 7536500, 7701857, 7543411, 7546419, 7732099, 7739859, 7924878, 7958618, 7842753, 7276746, 7000558, 7299965, 7302360, 7059475, 7138395, 6926967, 6901870, 7043135, 7173248, 7281058, 7388468, 7350636, 7523104, 7611957, 7492005, 7586517, 7545426, 7275536, 6950646, 6820837, 6855275, 6778800, 6599745, 6886596, 6792569]
12303F792569P4560o9780M7503R4653p3529K0923o0896n22126J02991J76696k13441
12292F370123K91679j10711p4703J4296K40895q9947j0691J10717j01078J1383
12282F651963J47943L46469k01083j80696J06607J60089R9811M16400k35857l91956
12272F919690l72607L4633q099k02785j86166l69788k30983P8011M92281M04408
12262F558595k12515K57267j86950k58694m1960J10333k10173j89731o8476L44390
12252F102086J76560l09557n0186R2845J28144k60919k57868K70695p7435p5842
12242E738523J32094K71117n7984k55854k06251k08370L6524M69831J11260K8638
12232F059528j52314q9450J40918R9469J25697J72917k55647m78948l0489J91440
$$ y = [6792569, 6867129, 6797349, 6844852, 6939505, 6865976, 6886899, 6826003, 6303877, 6406868, 6583564, 6370123, 6661802, 6551091, 6476388, 6490684, 6731579, 6641632, 6630941, 6741658, 6640580, 6651963, 6799906, 7146375, 6945292, 6764596, 6871203, 7031292, 7131103, 7547503, 7311646, 6919690, 6547083, 6581716, 6573617, 6370832, 6184666, 5814878, 5583895, 5661906, 6154187, 6558595, 6346080, 6603347, 6416397, 6157703, 6115743, 6226076, 6015903, 5826172, 5757696, 6102086, 6278646, 5969089, 5918903, 6011748, 6139892, 5878973, 5621105, 5891800, 5814365, 5738523, 5870617, 6141734, 6083750, 5827896, 5621645, 5413275, 5449799, 5919630, 6030890, 6059528, 5907214, 5817764, 5958682, 6058151, 6183848, 6356765, 6101118, 5622170, 5591681, 5783121]
12222E783121R8590J73595j07176j79488j39544n1367j8436r0707K68279k76880
12212E459987j42850K6859m5577j57316k4470P9811r1680J49268J11461k42284
12202E123209J53191J08018l41797o7884J34088k76018L0155K2738j8526J22427
12192D989601K05802L31054M6745n20402k58324N8813L48256J71227l48714k07499
12182D816559j43209j43063M35114L04565L6987k66013m2079K78825l3078Q6146
12172E330754K50281k40994j07988K14460o8474m46980j5433R1793M465m2867
12162D969017j95618L81404K26854o6637J33765p8787l42409k46005k08087l4380
12152D539117J03011k3583P0977K1722j7543J16597O1106k21465J44987P5380
$$ y = [5783121, 5881711, 6055306, 5948130, 5768642, 5629098, 5577731, 5559295, 5468588, 5736867, 5459987, 5317137, 5343996, 5298419, 5141103, 5116633, 5196444, 5104764, 5254032, 5365493, 5123209, 5276400, 5384418, 5042621, 4974737, 5108825, 4832807, 4862962, 4885700, 4867174, 4989601, 5195403, 5526457, 5573202, 5052800, 4794476, 4853289, 5201545, 5372772, 5024058, 4816559, 4673350, 4530287, 4965401, 5269966, 5306953, 5040940, 4998861, 5277686, 5244608, 5330754, 5581035, 5340041, 5232053, 5446513, 5378039, 4931059, 4915626, 5007419, 5011884, 4969017, 4773399, 5154803, 5381657, 5315020, 5448785, 5369998, 5027589, 4781584, 4573497, 4539117, 4642128, 4618545, 4689522, 4711244, 4693701, 4810298, 4871404, 4649939, 4794926, 4870306]
12142D870306R5704L32863R2159k6239m08751k43192k17983M5702j73356l3471
12132D333742l3229J93467K77133k53114L14536J04743l18259l61922J2218M44152
12122D713467j67179j57976J8882J26713k33694p1951K50744K44162M05488k8196
12112E100460k36148J4409k21684l27192k36770N4894m7642K45056M130J24483
12102D473996K24949p1985m2320K11178P6507Q6779M4889l7295l07306O7381K20467
12091D947240J06678l38066k74144k512K67521p6916j65764j46460N3k8166r8962
12080D190502l84854n0166L29680k94446l12494L52389L71963J9267j6035j77331
12070D028475K9442l2433N3819K40803J70973Q6781l87031N1200m9144j95940
$$ y = [4870306, 4966010, 5298873, 5391032, 5364793, 4956042, 4712850, 4494867, 4540569, 4367213, 4333742, 4300513, 4493980, 4771113, 4517999, 4832535, 4937278, 4619019, 4257097, 4269315, 4713467, 4546288, 4388312, 4407194, 4533907, 4300213, 4228262, 4479006, 4723168, 5128656, 5100460, 4864312, 4878721, 4657037, 4329845, 4093075, 4147969, 4100327, 4345383, 4349513, 4473996, 4698945, 4626960, 4584640, 4795818, 4872325, 4959104, 5003993, 4966698, 4659392, 4726773, 4947240, 5053918, 4715852, 4441708, 4439196, 4706717, 4629801, 4464037, 4317577, 4317630, 4289464, 4190502, 3805648, 3755482, 4085162, 3790716, 3478222, 3830611, 4202574, 4221841, 4205806, 4028475, 4057917, 4025484, 4079303, 4320106, 4491079, 4577860, 4190829, 4242029, 4192885, 3996945]
12060C996945j18915l39404L97608L45591J99256q0137m3791J66387l15569l16399
12050C891572L25523K69923l90713k36401K24281K08023J03293j49634N0931j4114
12040D282684l18175L378P8889j91414j83779N7626J18251P0185N4717J93610
12030D165972J03750j81428k12037j65951j49523M2564J60007j29337J5070q6523
12020C562564o2370K93978k27128k71085m937L82636K38866m263l53j74310R4729
12009C828327L04380n7147j06027k8699K0461j98255K60628J62013k03623L39936
11999D321994R5025r6858k28333r6745l39260N9724K27173J4264L7380J6974O945
11988D018283k21046K3244m02627l32005Q2484P5629k49258m0383L04975N6970
$$ y = [3996945, 3878030, 3538626, 3936234, 4281825, 4481081, 4400944, 4357153, 4523540, 4207971, 3891572, 4217095, 4487018, 4096305, 3859904, 4084185, 4292208, 4395501, 4245867, 4296798, 4282684, 3964509, 3967887, 4046776, 3855362, 3671583, 3729209, 3847460, 3917645, 3972362, 4165972, 4269722, 4088294, 3876257, 3710306, 3560783, 3603347, 3763354, 3634017, 3649087, 3562564, 3500194, 3794172, 3567044, 3295959, 3291022, 3673658, 3912524, 3908261, 3907908, 3733598, 3828327, 4132707, 4075560, 3969533, 3940834, 3961295, 3763040, 4023668, 4185681, 3982058, 4321994, 4417019, 4320161, 4091828, 3995083, 3655823, 3715547, 3942720, 3956984, 3994364, 4011338, 4018283, 3797237, 3820481, 3417854, 3085849, 3168333, 3243962, 2994704, 2954321, 3259296, 3316266]
11978C316266l70773Q4563R2268L42385m7934j38051J09078J56758K19580J22431
11968C886571P2862j81400n56300P4555J18088m5766r5708j20931P7076K04581
11958C433628k60522k59747K40389j67110m8757r3919K46599K17596k28839K21049
11948C300367J40394l5345k09058k01016j8956j09673L07389J45360k62161J17038
11938C174339N21445o1050l20596K1527k49636r9100r9773k38520M01256J0706
11928C060598m15038R5624N3860J84916N3977j16755Q5182M07466l40511r7764
11918B971555j66449k41219K27069L59761P4529j19465m05985k9752L05300L93816
11908C369160l27505m68754N44587K65531j84352j31476l34299N9495J87144j8260
$$ y = [3316266, 2945493, 3030056, 3122324, 3464709, 3416775, 3278724, 3387802, 3544560, 3764140, 3886571, 3959433, 3778033, 3221733, 3296288, 3414376, 3368610, 3272902, 3151971, 3229047, 3433628, 3173106, 2913359, 3153748, 2986638, 2937881, 2843962, 3090561, 3308157, 3079318, 3300367, 3440761, 3405416, 3196358, 2995342, 2976386, 2866713, 3174102, 3319462, 3057301, 3174339, 3695784, 3634734, 3314138, 3335665, 3086029, 2986929, 2887156, 2648636, 3049892, 3060598, 2645560, 2741184, 2795044, 2979960, 3033937, 2917182, 3002364, 3409830, 3069319, 2971555, 2805106, 2563887, 2790956, 3150717, 3225246, 3105781, 2699796, 2670044, 2975344, 3369160, 3041655, 2572901, 3117488, 3383019, 3198667, 3067191, 2732892, 2792387, 2979531, 2961271]
11898B961271N4348Q1822j22034j02034J40331k56807j60974j98853K8096K83012
11888B708178L55058j87754k08494l39153l90563k1329K76565K32037o9020l16068
11878B039457L26583M28239M24042j71523p2861j74705j49724J75448L95874k91117
11868B929713p13810k18705O15456J93717j15722K2539j62299j76508k93110K17916
11858B299187J20325J08100M86933K98583k31816k04386l47975N0952K47869L68358
11848C196130j10547l89000Q3941l0809q5780k45970K10M23905j67681j02089
11838B572310K43958P6155J02585K92642j82263j71812l35382k95463L34195L15466
11828B952391l19415j41098P6748k60766L7588o1977m1578k49528j17602J32187
$$ y = [2961271, 3015619, 3097441, 2975407, 2873373, 3013704, 2756897, 2595923, 2397070, 2425166, 2708178, 3063236, 2875482, 2666988, 2327835, 1937272, 1915943, 2192508, 2424545, 2355525, 2039457, 2366040, 2794279, 3218321, 3046798, 2973937, 2799232, 2649508, 2824956, 3220830, 2929713, 2215903, 1997198, 2612654, 2806371, 2690649, 2713188, 2550889, 2374381, 2081271, 2299187, 2419512, 2527612, 3014545, 3313128, 3081312, 2876926, 2528951, 2579903, 2827772, 3196130, 3085583, 2696583, 2780524, 2749715, 2663935, 2417965, 2418175, 2842080, 2674399, 2572310, 2816268, 2892423, 2995008, 3287650, 3105387, 2933575, 2598193, 2302730, 2636925, 2952391, 2632976, 2491878, 2568626, 2307860, 2345448, 2283471, 2241893, 1992365, 1874763, 2006950]
11818B006950K91682L8272J64264J7082p8229j89882m8173l25723N6899L32660
11808B265802n5677j23131p4030L60404N9687K5445k22877o1213J51033L0958
11798B356401k27267p4630L20833J69500J21804K10169Q0572J0350q66L1189m29562
11787B568493N8603P8241k21918r8715j8155L94302L43954k09395l04237Q0378
11777B671551j43437k05026l9802j3906k04310J64027p6927p0869j66150R6507
11767B011658j13314q533k8715J39281J02396J74734L74986O7374l39085j13107
11757B267675Q3127J49073m17240k39259K05115L9317J16963J0634r3117j27181
11747A995107L20129o6115l10279m0515L8555J3371J34452J30689j28903j31480
$$ y = [2006950, 2298632, 2336904, 2501168, 2518250, 2440021, 2250139, 2201966, 1876243, 1933142, 2265802, 2210125, 2086994, 2012964, 2373368, 2433055, 2458500, 2235623, 2174410, 2325443, 2356401, 2129134, 2054504, 2375337, 2544837, 2666641, 2876810, 2957382, 2967732, 2966866, 2998055, 2568493, 2627096, 2705337, 2483419, 2384704, 2366549, 2760851, 3104805, 2895410, 2591173, 2671551, 2528114, 2323088, 2283286, 2269380, 2065070, 2229097, 2152170, 2081301, 1915151, 2011658, 1898344, 1889811, 1861096, 2000377, 2102773, 2277507, 2652493, 2719867, 2380782, 2267675, 2350802, 2499875, 2082635, 1843376, 2048491, 2087808, 2204771, 2215405, 2122288, 1995107, 2315236, 2249121, 1938842, 1898327, 1936882, 1950253, 2084705, 2215394, 2086491, 1955011]
11737A955011J36553K05940j16777o5744j1312r9747j76500K4203q412J34302
11727A977517K05625J6445k27350j4916J7081Q902j3358q6641k16646j92671K63968
11716A737956M31082L67184L05504k56146m53097m04134L6809o4401Q5211K46590
11706B032558J39811k26378m1349q2115K94337J85036R4676p582J72175j75089
11696B386080j19979j85754l59295P4813K70759n6305k22868P7368J4778q6844
11686A792753O7639L38122J80610k26525k76622M36522J32538m21708k04580J51637
11676A970386R365P9132J48169k10259k11495P4941J62489q8382k78165k35934
11666A420247j51344Q9994N591J88854J03002r40K42570q4495M2442l12549J07503
$$ y = [1955011, 2091564, 2297504, 2180727, 2114983, 2103671, 2003924, 1827424, 1851627, 1843215, 1977517, 2183142, 2199587, 1972237, 1957321, 1974402, 1983304, 1969946, 1883305, 1666659, 1473988, 1737956, 2169038, 2536222, 2841726, 2585580, 2132483, 1728349, 1765158, 1700757, 1785968, 2032558, 2172369, 1945991, 1904642, 1822527, 2116864, 2301900, 2396576, 2388994, 2561169, 2386080, 2266101, 2080347, 1721052, 1795865, 2066624, 2010319, 1787451, 1864819, 1879597, 1792753, 1860392, 2198514, 2379124, 2152599, 1875977, 2312499, 2445037, 2023329, 1818749, 1970386, 1979751, 2058883, 2207052, 1996793, 1785298, 1860239, 2022728, 1934346, 1656181, 1420247, 1268903, 1358897, 1364488, 1553342, 1656344, 1655404, 1897974, 1813479, 1855921, 1543372, 1650875]
11655A650875J9141J81685R0219l42872N6634L61360j83022j70072j40949K6919
11645A549918m4870n75113m4161L06596M44302J90223j90488n42218J7412N23000
11635A634601K71500j04162k77697N0919L09633r2635n5558k98024j20388m8437
11625A269752K1860O1448K1126L68473J28666j6517j8828l0890K991l15057k42386
11614A250638J68829J50768k25678j44587M94478Q8493O8426J1482j93324l78
11604A669147k13644L15004K04578o6346l79522j54415K096J44861Q5838M462
11594A612059Q953K21947J83078k09428n15187l62100j05784J44159J59795M06464
11584A543956L07672j85904j53051J8735M11046J73944l26775j56387p947j78475
$$ y = [1650875, 1670016, 1851701, 1941920, 1599048, 1655682, 2017042, 1834020, 1663948, 1522999, 1549918, 1505048, 929935, 885774, 1192370, 1636672, 1826895, 1636407, 1094189, 1111601, 1634601, 1906101, 1801939, 1524242, 1575161, 1884794, 1792159, 1736601, 1438577, 1318189, 1269752, 1291612, 1353060, 1374186, 1742659, 1871325, 1854808, 1835980, 1805090, 1808081, 1493024, 1250638, 1419467, 1570235, 1344557, 1199970, 1694448, 1782941, 1851367, 1862849, 1669525, 1669147, 1455503, 1770507, 1975085, 1908739, 1529217, 1374802, 1376898, 1521759, 1607597, 1612059, 1621012, 1842959, 2026037, 1816609, 1301422, 939322, 833538, 977697, 1137492, 1543956, 1851628, 1665724, 1512673, 1531408, 1942454, 2116398, 1789623, 1633236, 1625289, 1446814]
11574A446814q1904M8607r835l74499l76178N68742M37489L5273l51428n656J16132
11563A453557J89443K2318k25682K65313j90672k19420L13343L9876O4275P5222
11553A787573K11362j36345j31236J11879j21539k24671j1703j61698l6229O9606
11543A356999j23555r1021K56305K49889J83096K1204K3996m8870o64620l23093
11533H40330K67330M13411q916p3301l03828o3479q7693l76605l71645J41373
11523C76977N45976M67582N2095K98938j12388j77796L1704O5232L08977k12422
11513A644875j26121L12217m1173M5288m4355k10177r750m13559q9385l57429
11503G10431j38473k2528J16506K38591L75943j97996k06872j6870K59784L19449
$$ y = [1446814, 1364910, 1413517, 1403682, 1029183, 653005, 1221747, 1659236, 1694509, 1343081, 1337425, 1453557, 1643000, 1665318, 1439636, 1704949, 1514277, 1294857, 1608200, 1648076, 1712351, 1787573, 1998935, 1862590, 1731354, 1843233, 1721694, 1497023, 1485320, 1323622, 1287393, 1356999, 1233444, 1142423, 1398728, 1648617, 1831713, 1852917, 1876913, 1828043, 1163423, 840330, 1107660, 1521071, 1512155, 1438854, 1135026, 1071547, 983854, 607249, 235604, 376977, 922953, 1390535, 1442630, 1741568, 1629180, 1451384, 1483088, 1548320, 1857297, 1644875, 1518754, 1830971, 1789798, 1835086, 1790731, 1580554, 1570804, 1157245, 1067860, 710431, 571958, 549430, 665936, 904527, 1280470, 1082474, 875602, 858732, 1118516, 1437965]
11493A437965j84501J04108K42440O086k66544L762k35638K17551P7118J05352
11483A507699K303k94310l80770j86252O3419K97457J31310K58125l88028k01211
11473H09742J55130J29124J43025Q0696j58785J91612L81721k99714l18933N315
11463A118933k15846Q8065J52724J26303K3292K1944q2764k28906j0939J89709
11453A182515P9257L47090k0822l48840k82571J99169N0123j22419k30126k95002
11443E58374K24684P4763K19105j40417k2113k05101q6151L24241M49006k6203
11433A370188k42010N3979k84040O3222n1808K17439J14782k65617k1683l43570
11423F10882j09287M29802K3048k12925l10473Q2133n51L28938K91647J30743
$$ y = [1437965, 1253464, 1357572, 1600012, 1606098, 1339554, 1343316, 1107678, 1325229, 1402347, 1507699, 1510002, 1215692, 834922, 648670, 712089, 1009546, 1140856, 1398981, 1010953, 809742, 964872, 1093996, 1237021, 1317717, 1158932, 1350544, 1732265, 1432551, 1113618, 1118933, 903087, 991152, 1143876, 1270179, 1293471, 1315415, 1232651, 1003745, 992806, 1182515, 1261772, 1608862, 1588040, 1239200, 956629, 1155798, 1205921, 1083502, 853376, 558374, 783058, 857821, 1076926, 936509, 914396, 709295, 623144, 947385, 1396391, 1370188, 1128178, 1182157, 898117, 961339, 909531, 1126970, 1241752, 976135, 954452, 610882, 501595, 931397, 954445, 741520, 431047, 513180, 512629, 841567, 1133214, 1263957]
11413A263957k95157l11137K487K37601J2158r0723l07454R6096J23378O3618
11403G94824l56215J48521K90360N5394J61568n7013k29046o2134l8094p9538
11393F28627R616L33158J72921j34064j54582n3801J30639J78992j00046j19452
11383H92008j10262j05352J29957j00228j58091j06517J90485M37808k0015k58481
11373G91312O1615J84616L09812j61287m25853k26473K6098Q0689L9606J82637
11363H62772J14581q2547j55911K28271o1501k46218n2291l22246j55736M91152
11353F20326K29800l98595j57166L24055L9203J05056K66743J49212m4415j43972
11343I90247o8122K21984q7358m60264m6240q3955o3535J59723N6466j26170J41534
$$ y = [1263957, 968800, 657663, 660150, 897751, 909909, 819186, 511732, 607828, 731206, 794824, 438609, 587130, 877490, 932884, 1094452, 1037439, 808393, 746259, 708165, 628627, 638243, 971401, 1144322, 1010258, 855676, 801875, 932514, 1111506, 1011460, 892008, 781746, 676394, 806351, 706123, 548032, 441515, 632000, 1069808, 1049793, 791312, 852927, 1037543, 1347355, 1186068, 760215, 533742, 559840, 640529, 680135, 862772, 977353, 894806, 738895, 967166, 905665, 659447, 607156, 284910, 129174, 620326, 850126, 451531, 294365, 618420, 657623, 762679, 1029422, 1178634, 1134219, 990247, 922125, 1144109, 1056751, 596487, 550247, 466292, 402757, 562480, 618946, 492776, 634310]
11332F34310l5120Q3470R6932K47358j15748j82602J0449m27063k0070J78511
11322D70427k1149j6057P1078J75164P8668q8141q7567k94833J5036M5441K84740
11311F32807K32869n858j38299J30768j64590k69449n8754K72560K34668N67289
11301A434011J38993l84950j18464j32724j18533M7417k31028k75646m1186J16489
11291D34379L89536p9761k38816K09265j8445J03617K26741K81044M29718l22304
11281A414974j7793k3190j21021L2270L53627R579L81757K44549k43241J86700
11271B218211K69385M6454j65100q9871P4572k8944k44772l95563k8388K6526
11261A682510m67825r6509k63595J9972J9155J6163j83612j15812K24982j24880
$$ y = [634310, 599190, 682660, 779592, 1026950, 911202, 728600, 739049, 311986, 291916, 470427, 449278, 433221, 504299, 679463, 758131, 669990, 582423, 287590, 302626, 348067, 632807, 865676, 859818, 721519, 852287, 687697, 418248, 359494, 632054, 866722, 1434011, 1573004, 1188054, 1069590, 936866, 818333, 865750, 634722, 359076, 317890, 434379, 823915, 744154, 505338, 714603, 696158, 799775, 1026516, 1307560, 1737278, 1414974, 1397181, 1373991, 1252970, 1285240, 1638867, 1648446, 2030203, 2274752, 2031511, 2218211, 2487596, 2534050, 2368950, 2279079, 2353651, 2324707, 2079935, 1684372, 1655984, 1682510, 1214685, 1118176, 854581, 874553, 893708, 909871, 726259, 610447, 835429, 710549]
11251G10549M1129K25164Q8564k17123J21165M7541n4241K6113j67780j42316
11241F78765r2643J64939j34197k57094q9785m7437J66952J60009k52203K89643
11231E86949L5114q5451q6703K04103k3381q2127L42520L8496o733k82534J92505
11220H32758N7826r6998k7248J16949k53810k2200o9334l47971O430J18306m8151
11209B66557k51546J33850L79758J06687r5378l56629R6111k8718l4534j11994
11199A04164Q6572K2798m04225P7434J26665J17363J32152l26029m51885L81424
11189a33567M32787L00966J45131J15430k61081r1962J4134J24390k48029R5082
11179D93281k13069j6386K26468k91853k34503j6886r9290J32375K20395o520
$$ y = [710549, 751678, 976842, 1065406, 848283, 969448, 1016989, 962748, 988861, 821081, 678765, 586122, 751061, 616864, 359770, 269985, 222548, 389500, 549509, 297306, 586949, 622063, 536612, 449909, 654012, 630631, 548504, 891024, 929520, 922787, 640253, 832758, 890584, 793586, 766338, 883287, 629477, 607277, 537943, 189972, 196402, 314708, 266557, 15011, 148861, 528619, 635306, 539928, 183299, 279410, 250692, 216158, 104164, 190736, 213534, -190691, -113257, 13408, 130771, 262923, -63106, -514991, -133567, 299220, 600186, 745317, 860747, 599666, 507704, 521838, 646228, 398199, 493281, 280212, 263826, 490294, 198441, -36062, -52948, -152238, -19863, 200532, 194012]
11169A94012n7778L13817R6384k02970m3776K25672J97945J9638n22960j33706
11159H6278K66740K70567P019L4858k65476n5802K76830p1588j40318R6200j24724
11148C80584n9196K13104J2850j72775J1201k49125J23041K32608K6863L17525
11138H36680J7402k75328j69249P7651L21818K1292k08596j8787J65501L34880
11128A103264J59361M9081m14500l65093r9137p7387o4499j9065k34709m85964
11118d48648m0508J46799k42006J37190K49571K0320R984J77684J25049J86965
11108C22400J01700K36396j89255k33671R8696k89447k79028K38821J28529p1348
11098F3793l82159k48944R5795K62342K29099k15525j45955n9845Q5336J06132
$$ y = [194012, 136234, 450051, 546435, 343465, 299689, 525361, 723306, 742944, 219984, 86278, 353018, 623585, 630604, 665462, 399986, 344184, 621014, 549426, 409108, 505308, 380584, 321388, 534492, 547342, 374567, 385768, 136643, 259684, 492292, 519155, 836680, 854082, 578754, 409505, 487156, 808974, 830266, 621670, 602883, 768384, 1103264, 1262625, 1311706, 897206, 532113, 432976, 355589, 291090, 272025, 37316, -448648, -489156, -342357, -584363, -447173, -197602, -177282, -167298, 10386, 135435, 322400, 424100, 660496, 471241, 237570, 336266, 46819, -232209, 6612, 135141, 63793, -318366, -567310, -471515, -209173, 19926, -195599, -341554, -401399, -316063, -209931]
11088b09931L56128L91423J87045j18716k05296k15754r1082k43175q1539m8685
11078b79582L48483M3296l90807J63586k47833k84415P7341M12538J98687J7681
11068E8975o0148j14740M02370M92090j6726m36603k73108m1688j82275M09252
11058B37399L4202j60811j1854J28956L9297K13341L16419j5454k87735k6341
11048D67419r3340k7272K79070L61003K79012j18560l10797j04826J26622J41151
11038I99482K51468K72275L88859J75544k82281J2563k78107m38279L67004M53754
11028A922282J91011O2355K69048R3368m63483K87981L19185q4703j49759l30808
11018B116477m88534k54564p9159K71087L4357j6637K14941N4293j09497M8281
$$ y = [-209931, 146197, 537620, 724665, 605949, 400653, 184899, 93817, -149358, -230897, -279582, 68901, 112197, -278610, -115024, -362857, -647272, -569931, -157393, 41294, 58975, -1173, -115913, 286457, 778547, 761821, 325218, 52110, 10422, -171853, 237399, 271601, 110790, 98936, 227892, 267189, 480530, 796949, 781495, 493760, 467419, 374079, 346807, 625877, 986880, 1265892, 1147332, 836535, 731709, 858331, 999482, 1250950, 1523225, 1912084, 2087628, 1805347, 1817910, 1539803, 1101524, 1468528, 1922282, 2113293, 2175648, 2444696, 2538064, 2074581, 2362562, 2681747, 2597044, 2447285, 2116477, 1627943, 1373379, 1294220, 1565307, 1599664, 1583027, 1797968, 1852261, 1742764, 1791045]
11008A791045j37961k65311J57232j12714j86736j8722Q0487j00256j92662O4363
10998A078765P4558J95851L045r5541j54320K27891R6341j52036j87551J01154
10988A188157k38662p7711j47852j76044Q1040m0907k06503O0607j28293k26875
10978H6957Q8985L3528J42506L68785k7768J4133K1105l5254k37706J10391L83262
10967I48924Q823k35453m28853j25195K31571L15488L11570k66264k05853K1761
10957E76519K00659p718l7778r7770P3204R075J17383L39334k11845l26882J04363
10946G38544J9432K46690N07441k85674j57280n2631k26849j55653L41362J41857
10936A117239M64686L8203p2934K03829O3646L52958J56695j83560j66883J56974
$$ y = [1791045, 1653084, 1387773, 1545005, 1432291, 1245555, 1226833, 1307320, 1207064, 1014402, 1078765, 1153323, 1349174, 1352219, 1256678, 1102358, 1330249, 1426590, 1274554, 1087003, 1188157, 949495, 871784, 723932, 547888, 628928, 588021, 381518, 442125, 313832, 86957, 175942, 209470, 351976, 720761, 692993, 707126, 728231, 692977, 455271, 565662, 948924, 957747, 722294, 293441, 168246, 399817, 715305, 1026875, 760611, 554758, 576519, 777178, 769460, 731682, 633912, 707116, 716191, 833574, 1172908, 961063, 634181, 738544, 757976, 1004666, 1512107, 1226433, 1069153, 1016522, 789673, 634020, 975382, 1117239, 1581925, 1620128, 1547194, 1751023, 1814669, 2167627, 2324322, 2140762, 1973879, 2130853]
10926B130853l40624K07785K91670J64126o6330J59601L36493N43111J60349J99089
10916C786123K37864M6291R6285j33432R1893P21940Q17788M97018P2415L35812
10906F569997K76680M05677O34849N66116M46005O92732J025601J003718R27583
10897A2548958J170689J597565J762526J314556K152313K525201K790808K827379
10889B8689995K974759L528848L768073M329793N564099O746350P753755R432235
10881G2787907J1246985J3209797J6409799K0805035K5411586K9404000L1970388
10874B21245497L3055933L2998816L0545701K7135899K2572894J6339855O396325
10867C90290920l946798j3738401k2514900k9223378l2845190l4000603l2768420
$$ y = [2130853, 1790229, 1998014, 2289684, 2453810, 2387480, 2547081, 2883574, 3426685, 3587034, 3786123, 4023987, 4070278, 4166563, 4033131, 4125024, 4846964, 5664752, 6161770, 6234185, 6569997, 6846677, 7252354, 7887203, 8453319, 8899324, 9592056, 10617657, 11621375, 12548958, 13719647, 15317212, 17079738, 18394294, 20546607, 23071808, 25862616, 28689995, 31664754, 35193602, 38961675, 43291468, 48855567, 55601917, 63355672, 72787907, 84034892, 97244689, 113654488, 134459523, 159871109, 189275109, 221245497, 254301430, 287300246, 317845947, 344981846, 367554740, 383894595, 390290920, 386344122, 372605721, 350090821, 320867443, 288022253, 254021650, 221253230]
10860B21253230k7722654k2853362j8600463j4954519j2093430r805315q357881
10853A06865606p388453o050870n417471m978610m464462m248283l644275l256389
10845F7416793l404311l209692l084006k573291k609845k389984k043200j473987
10837D6628477j575331j520101j297309j409037j522805j444357p86314p90426
10829C6282797j217488r50412j126702p25017o88207j148464j213123r64432j166095
10820B7082857j065953r37706p14987q84695o71531m92018m16376p55082q06908
10811B0337601n86519m05131o48423n45013l35907p30746m76528n56249o95973
10802A5357112k13777k95293m72149k02022k36188m06848k60321k83021j14718
$$ y = [221253230, 193530576, 170677214, 152076751, 137122232, 125028802, 115223487, 106865606, 99477153, 93426283, 88008812, 83030202, 78565740, 74317457, 70673182, 67416793, 64012482, 60802790, 57718784, 55145493, 52535648, 50145664, 48102464, 46628477, 45053146, 43533045, 42235736, 40826699, 39303894, 37859537, 37073223, 36282797, 35065309, 34114897, 32988195, 32263178, 31574971, 30426507, 29213384, 28248952, 27082857, 26016904, 25079198, 24364211, 23479516, 22807985, 22315967, 21899591, 21144509, 20337601, 19751082, 19345951, 18697528, 18152515, 17816608, 17085862, 16609334, 16053085, 15357112, 15143335, 14848042, 14375893, 14173871, 13937683, 13530835, 13270514, 12987493, 12872775]
10793A2872775l19476l88555n97670m03476j15762n33372j34627k14123j41757
10784A0023957J5506j69159o35204j64653j10206j31333m70343k32090j35635
10775G990840j65707k02892l33210n7391j04740l49936k12454k22083j30041j04403
10765F107983Q4722r2442k280k89004l19279l79458K62124K21120l34915n93057
10755D665514k78100p9821l3920R5121N1387k54313k22952j41579j7582p1990
10745C711765J09477L15503j68759j68534k53594q3086k2412J9512o7033J04104
10735C496943m9941l04415j51132K16577J42500J45468J83880m52433m38847J63607
10725B952207J32516j70784r6652J87253j50285k44634J24544k2139l42108j74004
$$ y = [12872775, 12553299, 12164744, 11567074, 11163598, 11047836, 10514464, 10379837, 10165714, 10023957, 10039463, 9870304, 9235100, 9070447, 8960241, 8828908, 8358565, 8126475, 7990840, 7825133, 7622241, 7289031, 7231640, 7126900, 6776964, 6564510, 6342427, 6212386, 6107983, 6192705, 6100263, 6097983, 5808979, 5489700, 5110242, 5372366, 5593486, 5258571, 4665514, 4387414, 4307593, 4273673, 4368794, 4420181, 4165868, 3942916, 3801337, 3783755, 3711765, 3821242, 4136745, 3967986, 3799452, 3545858, 3462772, 3440360, 3459872, 3392839, 3496943, 3447002, 3142587, 2991455, 3208032, 3350532, 3496000, 3679880, 3227447, 2788600, 2952207, 3084723, 2913939, 2817287, 3004540, 2854255, 2609621, 2734165, 2712026, 2369918, 2195914]
10715B195914J95006K63555k23213k53993K37260L55754l28559k85727j78404
10706A977593j27514k32448K39755L04230j01104k18794j15615J56196M9838P1435
10696B003572K42628k02658l23311m93925j74735o1166l72844l11071K04693L07102
10686H18285o0201j98015J05313K25687j03490k41306j18234j33887p0065j58615
10676F5472O7589j13923l64208L088N22316M31811J44318k90769j39862J98869
10666E24701k91709j17362R7005l52227P2760j15568K218J25126p8144j60453
10656b93653m42957p564L08226J87239K60694k97326K19507J59815J32150L00399
10646E26530n7471k8902L5493L00595O15581O61475L00066P45240Q32132J423225
$$ y = [2195914, 2390920, 2654475, 2431262, 2177269, 2414529, 2770283, 2441724, 2155997, 1977593, 1850079, 1617631, 1857386, 2161616, 2060512, 1841718, 1726103, 1882299, 1932137, 2003572, 2246200, 2043542, 1720231, 1226306, 1051571, 990405, 617561, 306490, 511183, 818285, 758084, 560069, 665382, 891069, 787579, 546273, 428039, 294152, 224087, 65472, 133061, 19138, -345070, -341982, 180334, 612145, 756463, 465694, 325832, 524701, 232992, 115630, 212635, -139592, -66832, -182400, -180182, -55056, -133200, -293653, -736610, -744174, -435948, -248709, 11985, -285341, -65834, 93981, 226131, 526530, 469059, 440157, 475650, 776245, 1391826, 2053301, 2353367, 3098607, 3930739, 5353964]
10636E353964J519779J009044J036452J027186J031243R05995J342574K465842
10628A5692079L892039N021740P019338R053425J1170733J3597025J3827218J2921783
10620I2195380J1916588J1759026J1958898J1519552R594367O725870N682675
10613A61352356Q612520J4326774J9567277K1149790J9359491J7240023J7541192
10606B79149423J8356942J6866021R616995n6658m284708k17685R470497J7578875
10598C46479702K0293092J8253752J5853180J6085805J5907457J0943734k365635
10591D41451087j8849807k8098474k4304095j4546628n447193r24889o08255o0000
10583C48611746J527660J822299k237095j2112645k2512725k7286404k5003827
$$ y = [5353964, 6873743, 7882787, 8919239, 9946425, 10977668, 11883663, 13226237, 15692079, 19584118, 24605858, 31625196, 40678621, 51849354, 65446379, 79273597, 92195380, 104111968, 115870994, 127829892, 139349444, 148943811, 155669681, 161352356, 169964876, 184291650, 203858927, 225008717, 244368208, 261608231, 279149423, 297506365, 314372386, 323989381, 323932723, 319648015, 319430330, 328900827, 346479702, 366772794, 385026546, 400879726, 416965531, 432872988, 443816722, 441451087, 422601280, 394502806, 370198711, 355652083, 350204890, 349280001, 348671746, 348611746, 350139406, 351961705, 349724610, 337611965, 315099240, 287812836, 262809009]
10576B62809009j8554818j2101636q584452o628193n157718m895845n738498p756218
10568A93391631j1856769j5548801j7692923j6809179j4247128j1291886q594378
10561I7350567p276078o022075n213620m517057l750545l323607k862360k251890
10553F2133335k109781k355230k297731j908822j616768j516375j579035j349528
10545D7400065j344369j356843j649193j352156j205154j247327j347731j112418
10537C6784874q99359q49029q85525p70981p15800j242325j044812o11446p15665
10528B9049932q19422k46416m26593j201914p41782o45571o73352p76434n77990
10519B2940458m88975k62048l87791k05353n47899n23356l34847l34773l29779
$$ y = [262809009, 244254191, 232152555, 223568103, 216939910, 211782192, 206886347, 201147849, 193391631, 181534862, 165986061, 148293138, 131483959, 117236831, 105944945, 97350567, 90074489, 84052414, 78838794, 74321737, 70571192, 67247585, 64385225, 62133335, 60023554, 57668324, 55370593, 53461771, 51845003, 50328628, 48749593, 47400065, 46055696, 44698853, 43049660, 41697504, 40492350, 39245023, 37897292, 36784874, 35885515, 35036486, 34150961, 33379980, 32664180, 31421855, 30377043, 29765597, 29049932, 28230510, 27984094, 27557501, 26355587, 25613805, 24968234, 24294882, 23518448, 22940458, 22451483, 22189435, 21801644, 21596291, 21048392, 20525036, 20190189, 19855416, 19525637]
10510A9525637m72041m20669n30459k48469l94745p24956r9313j80525j87807
10501A6266653l25109m45130m19062m61339j12825l26752k60920r4017k72816
10492A3548683k93402l06863l39841k79307N8712J2890l82840m56296j16215j43664
10482A1301857m29872N3507J33784m11846k03149k61574j97444L34563q7671k64957
10472I967198L8247J351J30184L5652j71392k12973L33737K08707o9852M72350
10462A0733209N1777j24701j48139j11443k25983k60358m5714n91642m83095j13217
10452H680694P9256j21091m83087m71830k30732l21284K15020L45453o8974m38190
10442G185235k12171O6844k2059J53065k78014k09623j95887K12115K24683k51408
$$ y = [19525637, 19053596, 18632927, 18102468, 17853999, 17459254, 16734298, 16634985, 16454460, 16266653, 15941544, 15496414, 15077352, 14616013, 14503188, 14176436, 13915516, 13821499, 13548683, 13255281, 12948418, 12608577, 12329270, 12387982, 12400872, 12018032, 11561736, 11445521, 11301857, 10871985, 10925492, 11059276, 10647430, 10444281, 10182707, 9985263, 10319826, 10232155, 9967198, 10005445, 10006796, 10136980, 10172632, 10001240, 9788267, 10122004, 10330711, 10260859, 10733209, 10784986, 10660285, 10512146, 10400703, 10174720, 9914362, 9868648, 9277006, 8793911, 8680694, 8759950, 8638859, 8155772, 7683942, 7453210, 7131926, 7346946, 7692399, 7623425, 7185235, 6973064, 7039908, 7017849, 7170914, 6892900, 6683277, 6487390, 6699505, 6924188, 6672780]
10432F672780l25786q6376j34286j84641m81252m320J49966r944K2516K56703
10422E875360k2990m92053j15431r4487l24996J1054j37313k76337j34257J3289
10412D301839j44523J7965n6089J47616K06173l4931J41137J57769j61937m07406
10402D167613r1812k09772j31613j74644L96488J29099m96421j3098M68783r7409
10392C947214M7911j4557l8294o8744k21171k17460J6809m5503j05044o0841m1355
10381C198965J24229l739L1334j97279J85157O8338m1810k53186j65256j22204
10371B824549N9459l90215J9505L94835J52883J12474R687m7869l06536K19504
10361C048276K22586O3383j34350j70743M0223m7543j05707J9460j57250J71830
$$ y = [6672780, 6346994, 6260618, 6126332, 5941691, 5460439, 5456119, 5606085, 5596141, 5618657, 5875360, 5852370, 5360317, 5244886, 5150399, 4825403, 4836457, 4699144, 4422807, 4288550, 4301839, 4157316, 4175281, 4119192, 4266808, 4472981, 4438050, 4579187, 4736956, 4575019, 4167613, 4075801, 3866029, 3734416, 3559772, 3956260, 4085359, 3588938, 3575840, 4044623, 3947214, 3995125, 3980568, 3942274, 3873530, 3652359, 3434899, 3451708, 3406205, 3301161, 3240320, 3198965, 3323194, 3319455, 3350789, 3153510, 3338667, 3407005, 3365195, 3112009, 2946753, 2824549, 2884008, 2493793, 2513298, 2908133, 3061016, 3173490, 3183177, 3135308, 2828772, 3048276, 3270862, 3334245, 3199895, 3029152, 3069375, 3021832, 2916125, 2935585, 2778335, 2950165]
10351B950165K16998K10370j70524l54838P0128k16899k63321p7280L89028M752
10341B758579P8220J061p7363j47967j83034q8853K69982K46393j87973J09041
10331B778086K28730J3932l45385n8067L14851k9506k32460N7262j13901J9998
10321B633540J83383M3579k05871k02117R7413L87365P0186j06887L6174K8053
10311B964818q8204q1240m47391L8192J08938J61883M4516P793j53023k02733
10301B353549P4691l82225m37201P5708K10134K44266j54472q2267r8134J70738
10291A974787K49302M01976J4272m16491l61905j01916L54047J61458j3716m39641
10281A822173l07753J37000J21736j16698p9997R5628M91375J02757j42396K38702
$$ y = [2950165, 3167163, 3377533, 3207009, 2852171, 2922299, 2705400, 2442079, 2364799, 2753827, 2758579, 2836799, 2837860, 2760497, 2612530, 2429496, 2340643, 2610625, 2857018, 2669045, 2778086, 3006816, 3020748, 2675363, 2617296, 2932147, 2902641, 2670181, 2727443, 2613542, 2633540, 2816923, 2860502, 2654631, 2452514, 2549927, 2937292, 3007478, 2900591, 2936765, 2964818, 2876614, 2795374, 2347983, 2386175, 2495113, 2656996, 2701512, 2709305, 2556282, 2353549, 2428240, 2046015, 1608814, 1684522, 1894656, 2138922, 1984450, 1902183, 1804049, 1974787, 2224089, 2626065, 2640337, 2223846, 1861941, 1760025, 2114072, 2275530, 2261814, 1822173, 1514420, 1651420, 1773156, 1656458, 1576461, 1672089, 2163464, 2266221, 2123825, 2362527]
10271B362527J24747j5629j7671L3135j66998q8027l7388p7829l27364k94982
10261A494521k1098j83000l051K29083M1866j2737m3660J62992M8236J46687m2709
10250A817130R2232O9600J3923j10645p2824n9707J62905K57774M8602j67150
10240B051840n3566O7460k11047j63723L63004O3665J3198O2706k42152n5557
10230A895828j30738m54619o07530M9435K38484j0547j91267K61894L76405k06324
10220A221021k08986L07087L56070j82844k54358J93457R3101J68192p4472M8429
10210A666697l54672j95119M6924J97007M60893K58948k24926l4975L16780k73040
10200A864517o3071J80728K26289P9898L3233N1193k29876N3966Q5120J12045
$$ y = [2362527, 2487274, 2471645, 2453974, 2487109, 2320111, 2232084, 2194696, 2116867, 1789503, 1494521, 1473423, 1290423, 1287372, 1516455, 1558321, 1545584, 1501924, 1664916, 1713152, 1859839, 1817130, 1909362, 1978962, 1992885, 1882240, 1809416, 1749709, 1912614, 2170388, 2218990, 2051840, 1998274, 2065734, 1854687, 1690964, 2053968, 2117633, 2130831, 2193537, 1951385, 1895828, 1765090, 1310471, 702941, 752376, 990860, 980313, 789046, 1050940, 1427345, 1221021, 1012035, 1319122, 1675192, 1492348, 1237990, 1431447, 1524548, 1692740, 1618268, 1666697, 1312025, 1116906, 1163830, 1360837, 1821730, 2080678, 1855752, 1820777, 2137557, 1864517, 1801446, 1982174, 2208463, 2288361, 2321594, 2372787, 2142911, 2196877, 2281997, 2394042]
10190B394042L274j4300j93544N5744J01997j52896l6302K67652K37949k3820
10180B639796n6731J39933k21878j60568r6630K33590q7361J6024M7226n1589
10170B401812P4542L55499K37263R8270K5694J82388k9259J769M3522l0347r4290
10159C266863N33678K35041J53636k92500J31687J60698k38918p51667m52181
10150B746337P508K46661P07254L3352l26982r5313o9745j79531j28859m79649
10140B461033O9606k8659j01738k50356n05007K52215O52763l2327l19409k8479
10130B169642K2145N8185k41073K39491M8873p7730n14586J6522p615j02472J573
10119A612955J27083O1067J65626n7941l02168j45856p360j21714N2097J06279
$$ y = [2394042, 2397316, 2383016, 2189472, 2245216, 2347213, 2194317, 2158015, 2425667, 2663616, 2639796, 2583065, 2722998, 2501120, 2340552, 2243922, 2477512, 2390151, 2406175, 2453401, 2401812, 2476354, 2831853, 3069116, 3167386, 3193080, 3375468, 3346209, 3347978, 3391500, 3361153, 3266863, 3800541, 4035582, 4189218, 3896718, 4028405, 4189103, 3950185, 3198518, 2746337, 2753845, 3000506, 3707760, 3741112, 3414130, 3318817, 3249072, 3069541, 2940682, 2461033, 2530639, 2501980, 2400242, 2149886, 1644879, 1897094, 2549857, 2517530, 2198121, 2169642, 2191787, 2249972, 2008899, 2248390, 2297263, 2219533, 1704947, 1721469, 1713854, 1611382, 1612955, 1740038, 1801105, 1966731, 1908790, 1606622, 1460766, 1453406, 1331692, 1383789, 1490068]
10109A490068R8674R2793j94050M229l8007m88672J69033k5332K59804R0119n40887
10098I17772l46018L88173K85250k7496J00779J55201Q7939o1408J25565M0215
10088A665972K45746k14080K70581J37237m98860o10949r5558J60557K53451j46838
10078A167259J30743N4342j02418M6725r9779l92452L99073L35158j73667j26116
10068A238868Q1192Q3970n7719j71386P1470K43376J2760j99301l75915m85058
10058D42257j07512N62573K38270M45526R1236l38898k99378k29984M04950M16461
10048A625501m5886j38749m09699M9549K4931K35233q408J04170J6128l96159
10038A056611k66478o4567J33959J2080J26531j34110m3827K9903O6768J78784
$$ y = [1490068, 1588742, 1681535, 1487485, 1491714, 1453707, 965035, 1134068, 1108736, 1368540, 1458659, 917772, 571754, 959927, 1245177, 1217681, 1318460, 1473661, 1561600, 1500192, 1625757, 1665972, 1911718, 1697638, 1968219, 2105456, 1606596, 995647, 900089, 1060646, 1314097, 1167259, 1298002, 1352344, 1249926, 1296651, 1196872, 804420, 1203493, 1538651, 1364984, 1238868, 1320060, 1404030, 1346311, 1174925, 1246395, 1489771, 1502531, 1303230, 927315, 442257, 334745, 897318, 1135588, 1581114, 1672350, 1333452, 1034074, 804090, 1209040, 1625501, 1579615, 1440866, 1031167, 1080716, 1105647, 1340880, 1332472, 1436642, 1452770, 1056611, 790133, 725566, 859525, 871605, 998136, 864026, 820199, 850102, 916870, 1095654]
10028A095654M44768K03870O6076k43640L6117j15950j80360k14049Q5768R8777
10018A277031k23204l25868R0454K41191L99111k42272m31985k79777J09511q0201
10008E33991K40343J73605J02910J55513K56414P4294j03998J11092j26534j07852
9998A309778n0872j57497j25001n31253p4k1033R1176J71326M00908L30202J8966
9987A436626j21124l22182l2276J24676p6201k60123M084J59062q4398J35605
9977I63749L41157q5497m20968J38868J4986J58572K10793K16348k33042r5491
9967A209475K02303j35763j37621n5642O3883J19456j31499J64827l10664P0037
9957A058792j75143k42716L34978J35478r2614M2440k8829k05111O3162k47805
$$ y = [1095654, 1540422, 1744292, 1810368, 1566728, 1602845, 1486895, 1306535, 1092486, 1178254, 1277031, 1053827, 727959, 818413, 1059604, 1458715, 1216443, 784458, 504681, 614192, 533991, 774334, 947939, 1050849, 1206362, 1462776, 1537070, 1433072, 1544164, 1417630, 1309778, 1258906, 1101409, 976408, 445155, 445081, 424048, 515224, 686550, 1087458, 1417660, 1436626, 1315502, 993320, 961044, 1085720, 1009519, 749396, 753480, 912542, 828144, 963749, 1304906, 1219409, 798441, 937309, 952295, 1110867, 1321660, 1538008, 1304966, 1209475, 1411778, 1276015, 1138394, 1082752, 1146635, 1266091, 1134592, 1299419, 988755, 1058792, 883649, 640933, 975911, 1111389, 1018775, 1061215, 1032386, 827275, 890437, 642632]
9947F42632k09327k29420O1527K36834J95246J19006q6627K0156j2423J9090K36481
9936I93175J31159M1723r4776K00080O7283R5861k75260k55747k49615K08390
9926H62273n5757j73373N911J31615r7282O6914l4183M03954j35460m3862l46861
9915E83889Q8920J50639j61829J0529K34287K56529l2743m4660L6229j44597r2263
9904H84930K20761J48908K74513q9835K52515J38111n13970l95238k68829l0282
9894F21584J54807j9367Q5700k19225k45645K07036L04574k834o3418j6271p8545
9883G28396o8744L2075r7741j27923k3068J69244j04147Q7181N39566J15335j36582
9872A113592k43192r2095N75790L33274p1316j20194k85973k29550J20875j92461
$$ y = [642632, 433305, 203885, 265412, 502246, 697492, 816498, 729871, 750027, 737604, 756694, 993175, 1124334, 1166057, 1071281, 1271361, 1338644, 1434505, 1159245, 903498, 653883, 862273, 806516, 633143, 639054, 770669, 673387, 740301, 706118, 1110072, 974612, 930750, 583889, 672809, 823448, 661619, 672148, 906435, 1162964, 1130221, 1085561, 1121790, 977193, 884930, 1105691, 1254599, 1529112, 1439277, 1691792, 1829903, 1315933, 920695, 651866, 621584, 776391, 757024, 842724, 623499, 377854, 584890, 889464, 886630, 823212, 806941, 728396, 659652, 691727, 593986, 466063, 442995, 612239, 508092, 595273, 1134839, 1250174, 1113592, 870400, 778305, 1354095, 1687369, 1616053, 1495859, 1209886, 980336, 1101211, 908750]
9862I08750l1740j21834m4909j55164J17622j60198r0683L60453K91118j82564
9852H90851j3719J3912L3254k10824m90743K18592L67554R3226p2915m2736K3697
9841H10149l37494m7512J92076o4969r1758n7679j08228K27428N08584J4998k16605
9830H28990o2429k24296J31680L10389J28453l3553m1775J50048m02083q5265
9820G00159J48312r3100l53733n8050p5944m6342l0708K89473L09323K1321o5550
9809G45161j11082q1675M8279l5953j46914J8844j23088K7552J87319l03995k1074
9798B03374L79549O11143K18786m03497j08802l0300j11087j75649j38911j53242
9788B91364l5057J29369K71236m8854l63016m8112j13183J43090P7832M01696
$$ y = [908750, 877010, 755176, 710267, 555103, 672725, 512527, 421844, 782297, 1073415, 890851, 877132, 891044, 924298, 713474, 222731, 441323, 808877, 902103, 829188, 786452, 810149, 472655, 425143, 617219, 552250, 460492, 402813, 294585, 522013, 1030597, 1045595, 828990, 766561, 542265, 673945, 984334, 1112787, 1079234, 1037459, 1187507, 785424, 700159, 848471, 755371, 401638, 343588, 267644, 221302, 190594, 480067, 789390, 810711, 745161, 634079, 552404, 600683, 564730, 417816, 436660, 313572, 341124, 528443, 224448, 203374, 582923, 1194066, 1412852, 1009355, 900553, 870253, 759166, 583517, 444606, 291364, 256307, 385676, 656912, 608058, 245042, 196930, 83747, 226837, 304669, 706365]
9778G06365K80347K87367k21345n0687K53005k28482l34630J88240L06544j42826
9768A043898j19900j80109m1403J54093J46229J26486j88512o3242k7846L0887
9758H80581k2540n8888j4604P9782j65111k75213k6064M69264n4483m4006K52279
9747A020997k98256k65198l0403P2610L08823J9590P8599r2472k58829j11016
9737D44445r1747k66586k2004O9654P3718M4109m8737k18200j60756O9890K75949
9726A69735N04575K4837j57472J10324J28463j1988j82996m0613J86998j58769
9716E73094m50160J84128M77251O020k09874K03948M38207j98765k05923J67063
9706I84989k17195r4131j0685Q8756K5507K1663l32778p4372l1672K25701J58384
$$ y = [706365, 986712, 1274079, 1052734, 1002047, 1255052, 1026570, 691940, 880180, 1186724, 1043898, 923998, 743889, 702486, 856579, 1002808, 1129294, 940782, 877540, 849694, 880581, 858041, 799153, 784549, 864331, 699220, 424007, 397943, 867207, 812724, 768718, 1020997, 722741, 457543, 427140, 499750, 808573, 828163, 906762, 814290, 555461, 444445, 352698, 86112, 64108, 133762, 207480, 251589, 202852, -15348, -176104, -106214, 169735, 674310, 699147, 541675, 651999, 780462, 768474, 585478, 544865, 731863, 573094, 122934, 307062, 784313, 790333, 580459, 784407, 1222614, 1023849, 817926, 984989, 767794, 673663, 662978, 751734, 777241, 798904, 466126, 391754, 360082, 585783, 744167]
9695G44167k9030J68q7982J18284L25857K8206R2129J68873m63526m00038j56238
9684C40870n5941J75854J64122k89485j7433Q3713K06531j36292k60557O0978
9674B72360K40348l6380k42733j06782J64537K64223L28576l49525j75606J2316
9664C71334K6440k4974R4166J29949J10157l3544o3542j36251j4723K80560J98726
9653I38298k65366j78422J66081K95775L4821l6111j0227k41666j74733J769L80490
9642I10709L12290K95807k16697m37720j91978j46717l61064J1739K83583R8214
9632E58166l41894l04523k47187K85197M19977P0722j84488J46930R0712O6280
9622E59892L88354p5958m95848l02181q2881j64614M19314K44834J1611P568M0734
$$ y = [744167, 715137, 715305, 627323, 745607, 1071464, 1099670, 1191799, 1360672, 897146, 497108, 340870, 284929, 460783, 624905, 335420, 317987, 401700, 608231, 471939, 211382, 272360, 512708, 476328, 233595, 126813, 291350, 555573, 884149, 534624, 359018, 371334, 397774, 372800, 466966, 596915, 707072, 673528, 609986, 473735, 459012, 739572, 938298, 672932, 494510, 660591, 956366, 991187, 955076, 944849, 703183, 528450, 530219, 910709, 1222999, 1518806, 1302109, 864389, 672411, 525694, 164630, 176369, 459952, 558166, 216272, -88251, -335438, -50241, 369736, 440458, 255970, 402900, 493612, 559892, 948246, 872288, 376440, 74259, -8622, -173236, 246078, 490912, 502523, 510091, 550825]
9611E50825j04861J84492J90991L13823J73779k12451k88743j71145K24611N6225
9601I17546m38878j66814J08763l61486l40085J29288j98909M06907L51549L70107
9591G77988K41377k45452k77495j9077P0225k47893l99812Q4128M13162L77035
9581G74186K41994l86204l1287J25786P8680k60729j16931j39566l29254N4212
9571A0887K46982M35616K46785j10620k46647p2666N37084l4880j87853j80043
9561F44645l55217j78840j1787j48871J88293R3068J94151k48454K10170K91720
9551F78878n0341l40164o3462M25263J87681R1990j78335k18856k29270p0712
9541B32672o8595k173N886M2357J77519n4461j68508Q6199j89634j21457j8864
$$ y = [550825, 445964, 630456, 821447, 1135270, 1309049, 1096598, 807855, 636710, 861321, 917546, 478668, 311854, 420617, 59131, -280954, -151666, -350575, 56332, 407881, 777988, 1019365, 773913, 496418, 477341, 547566, 299673, -100139, -16011, 397151, 774186, 1016180, 629976, 598689, 724475, 803155, 542426, 425495, 285929, -43325, 10887, 257869, 693485, 940270, 829650, 583003, 510337, 1047421, 1012541, 824688, 644645, 289428, 110588, 98801, -50070, 138223, 231291, 425442, 176988, 387158, 678878, 628537, 288373, 224911, 650174, 837855, 929845, 751510, 532654, 303384, 232672, 164077, 161904, 167790, 210147, 387666, 333205, 164697, 250896, 61262, -60195, -79059]
9530g9059J08882K99015M47973l75645k37076K31532K63119k69501l71249M16026
9520D34017P0801j99768N7441K62396k23919j73923K73808M5372k20358m7183
9510B78684J51848k35771J29447K59953o0012J1809R1266R487j56234k23054L16795
9499E74218Q6561l17044n6707J61115l02255Q9370M7081r0172J36779l3546K78793
9488E74193K4333m8479k03033J88255Q707j21096o2602O6536J65592J99367o26187
9477A65586j69053O4838K54695P1057O7945L4213K1362M5764j42991k30660O664
9466A89420q5067K06434N87309Q3058j58348m42342k57098p2489L64762J28184
9456E43823q3730k40488j47967j07810o7209O0382M51017J41940K87868J23585
$$ y = [-79059, 29823, 328838, 776811, 401166, 164090, 395622, 658741, 389240, 17991, 434017, 504818, 305050, 362491, 624887, 400968, 227045, 500853, 546225, 325867, 278684, 430532, 194761, 324208, 584161, 524149, 535958, 627224, 636711, 480477, 257423, 574218, 660779, 343735, 287028, 448143, 145888, 235258, 282339, 192167, 328946, 295400, 574193, 598526, 550047, 347014, 535269, 543976, 422880, 360278, 426814, 592406, 791773, 165586, -3467, 61371, 316066, 387123, 455068, 489281, 510643, 556407, 413416, 182756, 189420, 104353, 310787, 898096, 981154, 822806, 380464, 123366, 50877, 415639, 543823, 460093, 219605, 71638, -36172, -103381, -42999, 408018, 549958, 837826, 961411]
9446I61411j22250K8739l37464j56157l2577J509k49191k75599J81298K7599l51293
9435c23975M08705N72930M4480m0832k98520l3641J15289k08682J72949k77058
9425A31645J13676n4771J60412K97802M10247j88996j9010L6693p6285n87735
9415B23678l38910J73269L09805Q1907P6550K46300K47702j58655j95276j52410
9405E13960K56570K70747k49355k88157p715j99407q4040J30774Q2397m06749
9395A9025j17613O1377K97522K98236l64171j17272j0127J40068K93440l7086
9385D63399k62162j72290Q644J9006K7959J43500P0464N2521j33741j0300J10683
9374C17683j46142l96959k82247L04604L39343J72657J34400N8473n6083J64702
$$ y = [961411, 839161, 867900, 530436, 374279, 341702, 343211, 94020, -181579, -281, 27318, -323975, 84730, 657660, 702140, 661308, 362788, 329147, 444436, 235754, 408703, 131645, 245321, 190550, 350962, 648764, 1059011, 870015, 851005, 887698, 811413, 223678, -115232, 58037, 367842, 449749, 526299, 772599, 1020301, 861646, 666370, 513960, 770530, 1041277, 791922, 503765, 496050, 296643, 212603, 343377, 425774, 19025, -98588, -37211, 260311, 558547, 194376, 77104, 66977, 207045, 500485, 463399, 201237, 28947, 37591, 56597, 84556, 228056, 298520, 351041, 217300, 207000, 317683, 171541, -225418, -507665, -203061, 136282, 308939, 443339, 501812, 445729, 610431]
9364F10431J45457J62349k44342k66690j53596j57617R1671Q3287K18131J32248
9354F21329M21631L1787K404q2606j48299j21855o3739r1904k90434k85578N7606
9343E0342L22897J91512K10532l2833n55944L86611q7812j33270J014q3290l12825
9332d3066l08800m1747K00264N07488J54358O102j79161n9373J05692k0491K04551
9321E25817k8664k27341k95317k77766K97037K37174K33917k31072j40756J84014
9311B77043N9701J32906N0580J11444J45824j00894j91940j73390j14019n1778
9301A45477J99891J37294J45595k10906K0459m8241L6627k14154l5179J47011
9291C23874J40937M06882O4234j00978n00247l79388J08488M79109n4328j29941
$$ y = [610431, 755888, 918237, 673895, 407205, 253609, 95992, 187663, 270950, 489081, 621329, 1042960, 1074747, 1077151, 994545, 846246, 724391, 660652, 568748, 278314, -7264, 50342, 373239, 564751, 775283, 742450, 186506, 573117, 485305, 352035, 353049, 269759, -43066, -351866, -393613, -193349, 314139, 468497, 474599, 295438, 236065, 341757, 321266, 525817, 497153, 269812, -25505, -303271, -6234, 230940, 464857, 233785, 93029, 277043, 336744, 469650, 520230, 631674, 777498, 676604, 484664, 311274, 197255, 145477, 345368, 482662, 628257, 417351, 437810, 389569, 426196, 212042, 176863, 323874, 464811, 871693, 935927, 834949, 334702, -44686, 63802, 542911, 488583, 358642]
9281C58642j73194M8106M09662O8017m37333k50989M47745J4643j74963J64669
9271D75005R2086j95857k68896O0451K40069M83277K87116M08946k63913n01320
9261H16964l33140J5319k70639K9098K68945L78270n847r3228l59304r4640n3495
9250B98303j41271n2439j24624L15422J10585k44609K25533P7605o7216q2797
9240C14492k46933Q0755m6029l09219m0109J79009Q5817o4470O6595J89217L62470
9229E71595K69138j64883k39311J1861M1575J64099j85725j41238L84109J08138
9219H19358k23100J07508j65800l86864k47054N55159P4486l11831J50299j19807
9209B52354j95666K13371M14919J67715j6240J03943k53282l32704N4809l45451
$$ y = [358642, 185448, 233554, 643216, 711233, 273900, 22911, 470656, 485299, 310336, 475005, 567091, 371234, 102338, 162789, 402858, 886135, 1173251, 1582197, 1318284, 816964, 483824, 499143, 228504, 257602, 526547, 904817, 898970, 805742, 446438, 351798, 298303, 157032, 104593, -20031, 295391, 405976, 161367, 386900, 464505, 397289, 314492, 67559, 148314, 102285, -206934, -247043, -68034, 17783, -46687, 19908, 209125, 571595, 840733, 675850, 436539, 448400, 489975, 654074, 468349, 327111, 711220, 819358, 596258, 703766, 537966, 151102, -95952, 459207, 533693, 221862, 372161, 252354, 56688, 270059, 684978, 852693, 836453, 940396, 687114, 354410, 409219, 63768]
9199F3768r3899J05480j103J32871l9959j48610J69860J88787J79067n3069j99835
9188C03358k73936j74867K55887K27913j79431k3456R3924J44104j80957r1969
9178A00570L15294N14653O9138m64326k43598n2824M2272j93816p9169j67790
9168a59596l19691P2968J05531M719J60646M36289N49754L7136o04624k26762
9158E6370j75613P6395k85864j01207L07249K31452J63311k71683J1556L58240
9148C70206L6110R8815J79202j75250J30352J30780k05132j56580j56889l3481
9138B18133N958O3292K78984R3173n3803k10622L2559r7203m144K58009K17005
9127H01341J63017o8485n2677l67166Q5806k55086j06315L34494j82093l20114
$$ y = [63768, -30131, 75349, 74246, 207117, 167158, 18548, 188408, 377195, 556262, 503193, 303358, 29422, -145445, 110442, 338355, 158924, 135468, 229392, 373496, 192539, 100570, 415864, 930517, 999655, 535329, 291731, 238907, 281179, 87363, 8194, -159596, -479287, -406319, -300788, -296069, -135423, 300866, 850620, 887756, 283132, 56370, -119243, -42848, -328712, -429919, -122670, 108782, 272093, 410, 11966, 370206, 406316, 505131, 684333, 509083, 639435, 770215, 565083, 408503, 251614, 218133, 224091, 287383, 566367, 659540, 605737, 395115, 427674, 330471, 326327, 584336, 801341, 964358, 895873, 843196, 476030, 561836, 306750, 200435, 534929, 352836, 32722]
9117C2722K48943J6106J41625J49889M2121N8358J0700m12711n4341k2371m5097
9106A65944J84937K21139n1169j57208J80498j14178k22740J29286j06337r3464
9096A36708R0784k59911j08617J44182j8386j64964k09301J76580O06490K01488
9086E95053k27092j68328p7441J41030O3988j41299o6208K62260K24959J1888
9076F18810K33267J63784j20695m18323K60677J10616Q1247j11494l71354j66885
9066B79650M88117J92978n7381N5443o9644L290K52391j63805n23204P293j97812
9055B67316n7232k78120j97295J25251L11968J5643K94103K7672Q3906p7353l13031
9044B02828p7060J49315Q7996k26374j98837q8856j29260J73617J90872j17936
$$ y = [32722, 281665, 297771, 439396, 589285, 631406, 689764, 700464, 287753, 233412, 211041, 165944, 350881, 572020, 520851, 363643, 544141, 429963, 207223, 336509, 230172, 136708, 227492, -32419, -141036, 3146, -15240, -180204, -389505, -212925, 393565, 595053, 367961, 199633, 122192, 263222, 327210, 185911, 119703, 381963, 606922, 618810, 852077, 1015861, 895166, 476843, 737520, 848136, 929383, 817889, 446535, 279650, 767767, 960745, 903364, 958807, 889163, 892453, 1144844, 981039, 457835, 465128, 267316, 210084, -68036, -265331, -140080, 171888, 187531, 481634, 509306, 593212, 515859, 202828, 125768, 275083, 363079, 136705, -62132, -150988, -280248, -106631, 84241, -33695]
9034c3695k41766k72773J46701M24992J64393K12120k02375j82868j70527j25107
9024b80905j1200J15229l675J01873J61449K22212j9368m5295l5664J09369K34767
9013E48792k13119p4017Q9915j11972K9671R86k49429L57321J65045l28505j40044
9002G4644o4260q7769K87887L0961P232k36619M0110j93025J6518L42176j53619
8991F4236L13448Q233l82959K13784L98736K02702J071l98713k79139m783J09893
8980B46509M8282R058j03739L9575L70723L40368j97750m74771l22176K4695J53520
8969A34294k97704k4097J15674J43531Q1660J41536j08279L44781J49572J1585
8959F92553k45746j52803k32435J57340J99545k9073j2957k12271O011K01450
$$ y = [-33695, -275461, -548234, -401533, 23459, 187852, 399972, 197597, 14729, -155798, -280905, -292105, -176876, -180551, -78678, 82771, 304983, 285615, 240320, 204656, 314025, 548792, 335673, 261656, 351571, 239599, 269270, 270256, 20827, 378148, 543193, 214688, 74644, 10384, -77385, 210502, 241463, 248695, 12076, 52186, -140839, -124321, 217855, 64236, 377684, 385917, 2958, 216742, 615478, 818180, 819251, 420538, 141399, 136616, 246509, 294791, 303849, 200110, 239685, 610408, 950776, 753026, 278255, -43921, -19226, 134294, -163410, -187507, -71833, 71698, 153358, 294894, 186615, 531396, 680968, 692553, 446807, 294004, 61569, 218909, 418454, 389381, 376424, 164153, 170164, 371614]
8949C71614p1840l12775P7466L54091K04112J16031q3360l61379r5791o8778K5716
8938A55107L11362J45962p0219j69014J61593J35504l01446n522J76752O2542
8928F02621n66828j02216p1801J31733K92292L76634R7393r5526m98898k73190
8918a07786L1277K27462J96430r60j35556J64713K50150J19768q7703L9715m03699
8907B93811n01380M64319o5279Q8178J5307j7392J70979j24327N6378j44747L099
8896B38946L7575L5990M5522l57623k24524N8840R8230Q4149Q1180O8143L8480
8885B04908J99295k85109k2798J52359O9981p7918p2418l982O8381k04038J6576
8874D5237L44980j85822J2270k29300p0994J76762L56975j09106r132J86945K02186
$$ y = [371614, 299774, -13001, 64465, 418556, 622668, 738699, 655339, 293960, 198169, 129391, 155107, 466469, 612431, 542212, 373198, 534791, 670295, 368849, 363327, 540079, 602621, 35793, -66423, -138224, -6491, 285801, 662435, 759828, 664302, 165404, -107786, -76509, 150953, 347383, 346423, 210867, 375580, 625730, 745498, 657795, 697510, 293811, -207569, 256750, 191471, 279649, 294956, 277564, 448543, 324216, 380594, 235847, 238946, 276521, 312511, 358033, 410, -224114, -165274, -67044, 17105, 98285, 166428, 204908, 404203, 119094, 96296, 248655, 318636, 240718, 168300, 164318, 232699, 28661, 45237, 390217, 204395, 216665, -12635, -83629, 93133, 450108, 341002, 331870, 518815, 721001]
8863G21001J11902r7636L58363J32235m43798k10136K6555L1262J36417J1414
8853G77579J1598j30028l18927k27777p801L22794j95802K449K09654m4183k74522
8842A25034L6375j31863J22273J04606R1059J30315j50817n491k30424K11532
8832C02599j12371J63897j4044l45309j25391J10676J33724k4773j87387j21968
8822b20347R7634K41365J02002l13524J43050M738N2602R8666K78675m1691l02304
8811A40866l09857M8613j42519K20319J58032j69575J19327K11706L67850K00192
8801H44954p0656K36126l78580k94647k59507k6411M35566J40520J513j06997
8791E21881p7220l55445k12203J21575J62441j03091k17142K38545R8340j06723
$$ y = [721001, 832903, 735267, 1093630, 1225865, 782067, 571931, 598486, 629748, 766165, 777579, 789177, 659149, 340222, 112445, 104644, 427438, 231636, 234085, 443739, 399556, 125034, 161409, 29546, 151819, 256425, 347484, 477799, 326982, 321491, 91067, 302599, 190228, 354125, 340081, -5228, -130619, -19943, 113781, 89008, -98379, -220347, -122713, 118652, 220654, -92870, 50180, 54918, 107520, 206186, 484861, 443170, 140866, -168991, -120378, -262897, -42578, 115454, -54121, 65206, 276912, 644762, 844954, 774298, 1010424, 631844, 337197, 77690, 51279, 486845, 627365, 628878, 521881, 444661, 89216, -122987, -1412, 161029, 57938, -159204, 79341, 177681, 70958]
8781G0958k02474M6547q7190o4419j97394J55807N84970L02059k30445l45286
8771C3133j7983q3099k41937O6132L93004q9489j22341R3726K23476l39j64804
8760H9479J3258K82696N4417j91544m06487K40767R8787J25179K66507k65261
8750C07798p6882k56635P096l6360Q053k09608N6437L77899J57060P5424R4030
8739E04312j51380j09191m05794J26352L42826J15347J16198j43742N0145J74620
8729F19693j69568p70812o3126P72347J53519k80989L2649q7341K84084O3228
8719E53684k56237k92797k80120R702L41806J98258L59798k0648q2087j08262
8709D23097N1453P6954J40834l7930J310K27216j81215k30214k03571l8815J22154
$$ y = [70958, -131516, -84969, -172159, -236578, -433972, -278165, 306805, 608864, 378419, 33133, 15150, -67949, -309886, -243754, 149250, 59761, -62580, 31146, 254622, 254283, 89479, 102737, 385433, 439850, 248306, -158181, 82586, 181373, 306552, 573059, 307798, 230916, -25719, -18623, -54983, -46930, -256538, -200101, 177798, 334858, 410282, 504312, 352932, 243741, -162053, -35701, 307125, 422472, 538670, 394928, 445073, 619693, 450125, -320687, -383813, 388534, 542053, 261064, 293713, 206372, 490456, 553684, 297447, 4650, -275470, -265768, 76038, 274296, 634094, 613446, 531359, 423097, 474550, 551504, 692338, 654408, 655718, 882934, 701719, 471505, 267934, 229119, 351273]
8698C51273l8622P6934j49635K682N0637L8791k82889m25111m6161K93446M32889
8687C04234K7905J10435K05223M12461k70179r8492k6480j30699k59527j24724
8677A50157n8571j98789j89511K96107L18583K94638L2679k07495J23838k44954
8667C16682j52902K11634N5059j84042L44733L76332k55833k55385j26062j22434
8657B07782n4727J05512K01630L7774r8612J8784K43269j30584j02520j40132
8647B88176J94057R6354j35363r0651K72627k9074r7275K66338K43044l66882
8637F41351n0339l25006k45338Q8610J76794J24684j34436P7712j2170J52077
8627D93939j82119k52172m2750K55990l4292j95407M13815K61648j26296J19473
$$ y = [351273, 312651, 389585, 239950, 242632, 293269, 332060, 49171, -375940, -422101, -128655, 304234, 332139, 442574, 647797, 1060258, 790079, 691587, 665107, 534408, 274881, 150157, 91586, -107203, -296714, -607, 317976, 612614, 645293, 437798, 561636, 316682, 163780, 375414, 430473, 246431, 591164, 967496, 711663, 456278, 330216, 207782, 153055, 258567, 460197, 497971, 399359, 418143, 661412, 530828, 428308, 288176, 482233, 578587, 443224, 352573, 625200, 596126, 498851, 765189, 1008233, 641351, 591012, 266006, 20668, 109278, 286072, 410756, 276320, 354032, 341862, 493939, 311820, 59648, 16898, 272888, 238596, 43189, 457004, 718652, 592356, 711829]
8617G11829M8071j81802l61318l34972P6183M3614J9981K56968j85362k73623
8607a80431K37070o054L25023J74269K47502K69044m1908k93266M9921K63655
8597A044825J80501j37142k71524L9765k01726l26564L293j3167P8022K02975
8587E99258K94084K78414N1565k8300L0808j87200J67312m58484p6217J55822
8577H27062J02247J30362k01745j12903r1853n4357j19601m04440J18582J81186
8567C74540o7947M4584k589j31985J07359l10620J15547k6948k23948K12590M93655
8556E84238M01700P2250j22203m94483k48922L34020j10461O8771P4241K13796
8546G72947M524K4819k21294Q7860p1196r5186j96745j24666j76523n6006k54903
$$ y = [711829, 759900, 578098, 216780, -118192, -42009, 1605, 21586, 278554, 93192, -180431, 56639, 50585, 375608, 549877, 797379, 1066423, 1024515, 731249, 781170, 1044825, 1225326, 1088184, 816660, 856425, 654699, 328135, 331428, 318261, 396283, 599258, 893342, 1171756, 1223321, 1195021, 1225829, 1038629, 1205941, 747457, 671240, 827062, 929309, 1059671, 857926, 745023, 653170, 598813, 479212, 74772, 193354, 374540, 306593, 351177, 348588, 216603, 323962, 13342, 128889, 101941, -122007, 90583, 584238, 985938, 1058188, 935985, 441502, 192580, 526600, 416139, 484910, 559151, 772947, 777471, 802290, 580996, 668856, 597660, 502474, 305729, 181063, 4540, -51466, -306369]
8535c06369P796L32597K59072Q4629L9570K58209k99515l00931K11533J99260
8525D85851j1070k46771k35695K20566K07972l9127J66651J35188l33468j01029
8515B49068j73955j20723o7233q2422M59538J2583R1461j6951j39234m00102P3087
8504a14883n2612q9402J00087K25447L13381j8284p6758k98985k01872J03953
8494a09928K6755P9231n9450j32883K6647J39449K14411J93040K49421o5170l65508
8483A96015J44305j2993p5119J66874L04652j78604k17646K37710K8328L6131
8473F29653Q8437l2841k09208J61896J64875q836j11086O3034k8083l85409m06277
8462g3845k17624O6112K91881K00536k44662l9537O6673J82350M1860K5534j93921
$$ y = [-306369, -298573, 34024, 293096, 377725, 417295, 675504, 375989, 75058, 286591, 485851, 474781, 228010, -7685, 212881, 420853, 381726, 548377, 683565, 350097, 249068, 75113, -45610, -112843, -195265, 264273, 276856, 368317, 351366, 212132, -187970, -114883, -167495, -256897, -156810, 68637, 382018, 363734, 286976, -12009, -213881, -109928, -83173, -3942, -63392, -196275, -169628, -30179, 184232, 377272, 626693, 561523, 196015, 340320, 327327, 252208, 419082, 723734, 545130, 327484, 565194, 593522, 629653, 718090, 685249, 476041, 637937, 802812, 793976, 682890, 745924, 717841, 332432, -73845, -291469, -225357, 66524, 267060, 22398, -17139, 49534, 231884, 273744, 299278, 105357]
8451A05357n2082M2544K82564k97006k07798L2743N5326J85874P141k45204Q658
8440h1883m8919n7326J64167M02177L3920K3850n5768j42716Q4292J92879j42658
8429C72015k6811n2583n5911O6223k36551j14880J63338j16383M4907j30812K6439
8418f1009q7586j40010J17466L13176J47355j18774j30418p1674O1141m7112j92483
8407b09928j93330N90830L28547r5606j92281J06588k13155M5307l23625K2080
8397a34573K71155J26751M5461j24853l47508K5708L37489Q0065Q9847o4388l89465
8386h4311Q3168L22349k69621k18224p9526J31939O6099k9259k50870k22077l5864
8375e86197o8722p8922J28483N03236L22341O3542k44035p4776R7034k81113j46571
$$ y = [105357, 53275, 95819, 378383, 81377, -126421, -93678, -38352, 147522, 154663, -90541, -81883, -130802, -188128, -23961, 378216, 412136, 435986, 380218, 237502, 321794, 514673, 372015, 345204, 292621, 236710, 302933, 66382, -48498, 114840, -1543, 43364, -87448, -61009, -148595, -288605, -171139, 142037, 289392, 170618, 40200, -31474, 29667, -17445, -209928, -403258, 187572, 516119, 420513, 228232, 334820, 121665, 166972, -156653, -134573, 136582, 263333, 308794, 183941, -163567, -137859, 199630, 279695, 369542, 305154, -84311, -1143, 321206, 51585, -166639, -246165, -114226, -48127, -77386, -328256, -550333, -586197, -654919, -733841, -605358, -102122, 220219, 283761, 39726, -35050, 61984, -219129, -365700]
8364c65700J97671L1179P6279P8634j87847k16749K46192M39633N0991l80130
8354b9847L4216K70225K76524j38129k21925K18836N7853j37121n0773M4689j1874
8343C12674k29196k0937J13654L49126J58542N1217l65114j28926j17555R1382
8333B14867L97952o0726k69452k0567J42618J27643J22795K27718k93417l81305
8323B08126m27720m32J38797j42024k0685L31170L34719j03390j97563J43991
8313B64989p6071q7617j03869J04016J05082N0559M7823J81531q0958k07650J2329
8302B10164j23094M1094n372J87653j524J04940j53871r4399j13183J05796P0765
8291B28969m7237r7409n7108M0108K22106J71808j27361P2247j06879j95621m9365
$$ y = [-365700, -168029, -136850, -60571, 18063, -169784, -386533, -140341, 299292, 350283, -29847, 4369, 274594, 551118, 412989, 191064, 409900, 467753, 330632, 279859, 324548, 312674, 83478, 62541, 176195, 525321, 683863, 735080, 369966, 241040, 123485, 214867, 612819, 552093, 282641, 262074, 404692, 532335, 655130, 882848, 589431, 208126, -219594, -220026, -81229, -223253, -243938, 87232, 421951, 318561, 120998, 264989, 188918, 101301, -2568, 101448, 206530, 257089, 304912, 486443, 405485, 197835, 210164, 87070, 128164, 122792, 310445, 308921, 413861, 259990, 165591, 52408, 158204, 228969, 181732, 84323, 27215, 67323, 289429, 461237, 333876, 406123, 299244, 103623, 54258]
8280E4258k35995M62298j7947k65996N6267k4521j748K9386J0908l9281r2641
8269f5012m0110N2988p6567o68533L32546L03641q8823m3258J6308j08365l2563
8258d17748K6807j80611n8343M03013J72203k65251l01796r7336J24998J73246
8248d20818J2066L77796J23371j59539m47668k28299o64M0800j0279K97307N02920
8237H6993J46122Q7542j68069l08783L6586M06158p9765q5615L95622k59694j27913
8226A29184m945J96293J26350k42608j53740L48239J35391k16522K16193r7576
8216D36259k77021n19468k7743L73403J93482M26037o4254j05707k04448l04670
8206g4130K8137L77019O247k86826K06967j16259K59533M38104J09312l73954
$$ y = [54258, -181737, 280561, 262614, -3382, 52885, 28364, 26616, 56002, 66910, 27629, -65012, -105122, -52134, -128701, -797234, -464688, -161047, -249870, -293128, -276820, -385185, -417748, -390941, -571552, -629895, -226882, -54679, -319930, -621726, -719062, -594064, -420818, -408752, -30956, 92415, -67124, -514792, -743091, -743755, -702955, -713234, -415927, 86993, 233115, 320657, 152588, -156195, -119609, 286549, 206784, 121169, 516791, 257097, 129184, 124239, 320532, 446882, 204274, 50534, 398773, 534164, 317642, 533835, 436259, 159238, -360230, -387973, -14570, 178912, 604949, 540695, 434988, 230540, -74130, -45993, 331026, 337273, 50447, 257414, 141155, 400688, 838792, 948104, 574150]
8196E74150j28825k12711j50572j064J04976K46077j4381k59121n01771j7047
8186c60289O277k09363j21031K35100L17425K41623K13412q9019k27260j28170
8176a21295J10545j90164K80999K49646o8590k75993l54278k97767M94866P43132
8166E71101Q4305l86908k1492k35878k04158j35494l14913l6249K00645J92996
8156b86045J92166L79860m1423q3413Q8289Q0028M11855j28871k45487k02432
8146A64527Q4424k36210J29012L66990j2776M1652L19895m2624m62357k06277
8136A46256j86586j51134L53322P4777n5901j93088P1428J147r3611J43794L5331
8125A45735k38273j55229O6112M6050Q6125k03407J40565K15167k6476n8980K27937
$$ y = [574150, 445325, 232614, 82042, 80978, 185954, 432031, 417650, 158529, -343242, -360289, -354012, -563375, -684406, -449306, -131881, 109742, 323154, 234135, 6875, -121295, -10750, -200914, 80085, 329731, 261141, -14852, -369130, -666897, -172031, 571101, 655406, 268498, 247006, 11128, -193030, -328524, -643437, -679686, -479041, -286045, -93879, 285981, 244558, 161145, 249434, 329462, 741317, 612446, 366959, 164527, 248951, 12741, 141753, 508743, 495967, 537619, 857514, 814890, 352533, 146256, -40330, -191464, 161858, 236635, 180734, -12354, 59074, 60221, -33390, 110404, 145735, -92538, -247767, -181655, -135605, -49480, -252887, -112322, 102845, 76369, 17389, 245326]
8114B45326j77714l35235K65971L43349L4226R4558j14197k66130m49118m6553
8104d05517K15021J31070K9618L2849k65111L55670J72658Q6389K49736j70868
8094D31515m00322j71366J49387J94454q229K8537M2454k65147N0806L2368m00315
8083c15858k50877L0801L27553O7899R6030j24762K98686P6103o0764J46927J14285
8072D06023K7035j27498q6508K64480J44604j27255l01197l07442j36445K66942
8062B2739N9043K9134K51518k98784k09578q8477J19701J30694P7576j04936r0470
8051a01840R6468L51506K13917j22839j55844M5978j07402k69476J5996j22130
8041a55666l55066m3593N20130j50554R4186K82527J79484J26995l5529k00301
$$ y = [245326, 67612, -267623, -1652, 341697, 375923, 470481, 356284, 90154, -358964, -405517, -190496, -59426, -29808, 3041, -262070, 93600, 266258, 352647, 602383, 431515, 31193, -140173, 9214, 203668, 195439, 223976, 266430, 1283, 52089, 84457, -315858, -566735, -535934, -208381, -140482, -44452, -169214, 129472, 205575, 144811, 291738, 406023, 433058, 305560, 219052, 483532, 628136, 500881, 199684, -107758, -244203, 22739, 81782, 110916, 362434, 63650, -145928, -234405, -114704, 15990, 93566, -11370, -101840, -5372, 346134, 560051, 437212, 281368, 327346, 219944, -49532, -33536, -155666, -510732, -554325, -34195, -184749, -90563, 191964, 371448, 498443, 462914, 262613]
8031B62613k94926k73822n2643J31371k87963j72438L15024N15297N3984k20337
8021b3840P860L23739j14192k04909J79103K65961n8563j56867j98352o27185
8011f07245J11078N83012K42580o920j74006K61901N20170J73033m55623l12413
8001C35567j76859k21061K4531J09364q3819q272K35628J94084N2635m6492r0973
7990C24333l9818J53720R4865K55605J73111L7515k35685l85642K10926n8892
7980E30038m42006q7405K20508J52229L7077L03094K94200K75910l21898m54162
7970E07585j78153L40972k25373q3535K10292j43641q0529o7400o0807m6353k9622
7959A43436J06235R8419l80445n30285L6373M34512K56467j11418j854K38613
$$ y = [262613, -32313, -306135, -358778, -227407, -515370, -687808, -372784, 142513, 196497, -23840, -15980, 307759, 193567, -11342, 167761, 433722, 375159, 218292, 19940, -607245, -496167, 86845, 329425, 322505, 148499, 410400, 930570, 1103603, 647980, 335567, 158708, -62353, -37822, 71542, -12277, -20549, 215079, 409163, 461798, 415306, 324333, 284515, 438235, 533100, 788705, 961816, 999331, 763646, 378004, 588930, 530038, 88032, 627, 221135, 373364, 410441, 713535, 1007735, 1283645, 961747, 507585, 329432, 670404, 445031, 361496, 571788, 428147, 347618, 280218, 219411, 173058, 143436, 249671, 348090, -32355, -562640, -526267, -91755, 164712, 53294, 51440, 290053]
7949B90053k9555l92132k01431o4426N21932k1369m7242l9550J27461o5585q8718
7938a0562Q168J31124R3783K45169J34439J67184M386m22526m84142j23449k9837
7927b86263N58437K96705j05186k09884n98651p9066K94199K10215n31540j15350
7917e66384M99123L10529L05512q520r6847J28603k01803k81995K3606N7673k03410
7906c3913k01043J25245J02548L29495k30851L7341o2023N7907O4001k33315J93953
7895A49345J52609L6237K62342j8033k22161J23151n8381o8843k28043k61494
7885a33271n3888M551J40926R8622J4151k57814n2352J77811J1268J07562l6545
7874B1021l83460j04897J39489L52613M63153R0327j6828l98927j78683P0874
$$ y = [290053, 260498, -131634, -333065, -397491, 124441, 103072, 55830, 16280, 143741, 78156, -10562, -2394, 128730, 222513, 467682, 602121, 769305, 773691, 351165, -132977, -256426, -286263, 272174, 568879, 463693, 253809, -344842, -423908, -129709, 80506, -451034, -566384, -67261, 243268, 548780, 540260, 443413, 572016, 370213, 88218, 111824, 169497, -33913, -234956, -109711, -7163, 322332, 91481, 128822, 66799, 124706, 188707, -44608, 149345, 301954, 338191, 600533, 582500, 360339, 483490, 425109, 356266, 128223, -133271, -187159, -182608, -41682, 56940, 71091, -186723, -239075, -61264, -49996, 57566, 21021, -362439, -467336, -327847, 24766, 487919, 578246, 561418, 162491, -16192, 54682]
7864E4682K51131J79689M5092j84330n6021j40025k12542j53635M93639J85473
7854D63153j97902j31498L23921j17768n423k42920k71255n38944K94950L35544
7844h8142n8585J92238K25522J15589N6754K18583Q3820n8862n1853k34200r0369
7833C10495K4732K6220L86556k78085m04870K04798J96723l96864k44648L7265
7823a37678L31066K20532K41117k34562l32681k35359J70515j75023l89459J29246
7813d12286R3827K39108K60705r5076j42002k19613J89029n8345J1785o2761p7627
7802b73256R0482j17979K77189L56687J67052L4141k54604j26575l5213j37524
7792a9600J23476j79648l50539K02748J56173j48813K64122L27801O2868k078
$$ y = [54682, 305813, 485502, 530594, 346264, 290243, 150218, -62324, -215959, 277680, 463153, 265251, 133753, 457674, 339906, 334483, 91563, -179692, -718636, -423686, -88142, -146727, 45511, 271033, 386622, 443376, 661959, 745779, 686917, 635064, 400864, 310495, 335227, 361447, 748003, 469918, 65048, 269846, 466569, 69705, -174943, -137678, 193388, 413920, 655037, 420475, 87794, -147565, 22950, -152073, -541532, -412286, -318459, -79351, 181354, 86278, -55724, -275337, -86308, -144653, -132868, -195629, -273256, -182774, -300753, -23564, 333123, 500175, 534316, 279712, 153137, 117924, -19600, 103876, -75772, -426311, -223563, -67390, -216203, 47919, 375720, 438588, 436510]
7782D36510j45960k91599m18012j56434K7717L58407J47954n124J33183L44622
7772D31264j85334l52468j97449j89304m6196L47101M11343O6967j65796k9539
7762I0589J9497J40884J50721o8379l77188J5781P8534L5451n0858l01699l42210
7751f08877l5248J64190N0098Q8140J51529J27453l2366L15427M0297O258j31000
7740A35901j7759m7893J96290p5923k75334j20205j32149n1084J57731O84556
7730D54131L28053m27756m25227k54140L5373K28766K90479K40357j23353j93813
7720A52870l02797j71932o8366M71802j61205j21355M04j49589L5034K63600j48192
7709a99726P4232j74277j33031P8203J24211J00140j36909J7930j73961J06125
$$ y = [436510, 290550, -1049, -419061, -575495, -547778, -189371, -41417, -46541, 86642, 431264, 245930, -106538, -303987, -493291, -539487, -192386, 218957, 285924, 120128, 90589, 110086, 250970, 401691, 333312, -43876, -28095, 50439, 85890, 35032, -266667, -608877, -644125, -479935, -429837, -341697, -190168, -62715, -95081, 220346, 260643, 266901, 135901, 118142, 70249, 266539, 190616, -84718, -204923, -337072, -388156, -230425, 454131, 782184, 354428, -70799, -324939, -289566, -60800, 229679, 470036, 346683, 152870, -149927, -321859, -390225, 81577, -79628, -200983, -200579, -350168, -315134, -51534, -199726, -125494, -299771, -432802, -354599, -230388, -130248, -267157, -249227, -423188, -317063]
7699c17063K0808k02668k24786L79666J35510L96200J42854j86465q5779M13120
7689D71397J89440j67862L2944l6286l88111j41635q0452J71409Q9720K217l80434
7678b37653K1676o2127j9513j0989Q6912K17537O2370k79575o0747j06257M34828
7667D6462O10401m67215m65807j40708L5107k30091L14821K78224j74179n6002
7657b48987j15337J6635r440N3346K73359o9483j36428l11132L8757K90860K8301
7646a89549J96204r2770j6087K7003J25368K98810R4727l61320J8664M39501m9096
7635D91455k39576k13595J52761K97491k8022j50479l95352k19564l57807k0186
7625f82874J04297K36957J50893L7559J7739O6785J63496K32296l28979j08550
$$ y = [-317063, -296255, -498923, -723709, -344043, -208533, 187667, 330521, 144056, 58277, 471397, 660837, 492975, 525919, 489633, 101522, -40113, -120565, 50844, 140564, 142781, -237653, -215977, -278104, -297617, -308606, -221694, -4157, 58213, -221362, -282109, -388366, 46462, 656863, 189648, -276159, -416867, -381760, -611851, -297030, -18806, -192985, -248987, -364324, -347689, -357129, -303783, -30424, -99907, -236335, -547467, -508710, -217850, -189549, 6655, -86115, -102202, -75199, 50169, 348979, 443706, 82386, 101050, 540551, 491455, 251879, 38284, 191045, 488536, 460514, 310035, -85317, -304881, -662688, -682874, -578577, -341620, -190727, -153168, -135429, -68644, 94852, 327148, -1831, -110381]
7615a10381Q2707p5105K36220k72591k54601K28214n9447K47808K83486J64745
7605D71055m366J07852l44843m17112L61777K35970l2766L3800L7453J1653P1036
7594E31509j93850j35001o3771L0795J76169N7211l96424l96820J04167M41945
7584A55930J03058J70701j62469p2492J63864j31810k55616k7037K48314K41534
7574D33977j32343p6962Q7649m08888k64569j07927J04289K82630K67860j90267
7564d551l18093K04338L2474J12426Q4194Q1976n5374j57851j52652l139k1231
7553a97483j32864l20637j69151p767O29200J32209M6185k65075O8810K87793
7543G1220l00113k62691P3728K44285P2439M0021P253m22278j00020L74594M61722
$$ y = [-110381, -27674, -102779, 133441, -139150, -393751, -165537, -224984, 22824, 306310, 471055, 466689, 574541, 229698, -187414, 174363, 410333, 377567, 411367, 448820, 460473, 531509, 337659, 202658, 138887, 169682, 345851, 403062, 6638, -390182, -286015, 155930, 258988, 429689, 267220, 194728, 358592, 226782, -28834, -55871, 192443, 433977, 301634, 224672, 312321, -96567, -361136, -469063, -364774, -82144, 185716, -4551, -322644, -118306, -85832, 26594, 110788, 192764, 137390, -20461, -173113, -176252, -197483, -330347, -650984, -820135, -827902, -198702, -66493, -20308, -285383, -216573, 71220, -228893, -491584, -417856, -173571, -101132, -61111, -53858, -476136, -576156, -201562, 260160]
7532B60160L77127k20550m19603k89657J26438K10331J75830k96101k17201p5812
7522c69038M71066q7403j4880P0992J87122j52395l5191N1643l05966l564N4530
7511a33084J98980N9796N1246k19561k82068l37263j18072K51210M40221K53676
7501A65081m4962p8134L23536q8151j36004P0058n0892K9322j72464k59494j42540
7490c84644N8090o771P1351P5309j49569k17120J43512K10167J44009K22916M04109
7479E71359j86775k15205j178J71746J93978k84547L8114j26233l22735K70035
7469A08559J03393N4268J69793R8060j40555j43361J96822R2513j31784o28842
7459b21134n0914O7155K39605Q6565j61668q5837j01408K50331L69075O9478l73360
$$ y = [260160, 637287, 416737, -2866, -292523, -166085, 44246, 220076, -76025, -293226, -369038, 102028, 14625, -255, 70737, 257859, 105464, 70273, 121916, -184050, -187614, -133084, 65896, 125692, 176938, -42623, -324691, -661954, -780026, -528816, -88595, 165081, 120119, 41985, 365521, 277370, 141366, 211424, 160532, 189854, 17390, -242104, -384644, -326554, -333325, -261974, -186665, -336234, -553354, -409842, -199675, -55666, 167250, 571359, 384584, 169379, 168201, 339947, 533925, 249378, 287492, 161259, -161476, 108559, 211952, 266220, 436013, 534073, 393518, 250157, 446979, 539492, 407708, -221134, -272048, -204893, 34712, 121277, -40391, -126228, -227636, 22695, 391770, 461248, 87888]
7448H7888o11785o0280J75974J74840M6387o7609L99722K04054L5306k56556k82713
7437a54772j49099n7163n3247J93035K0312j86844j52635k9421J66266K25024
7427a78544j10377m0943j38990l5147J07179O3865L5886J32739J77460J95160
7417B08288k16890j18217L11839j30517j74705K31327K71753k35665n53743j83849
7407e90379k18456n5574K15914J65638L92597L5315J2955L59838M8723k14337
7397A52234j78659k63609k3473k20253J53626K25882k0408P013M0617K0932j5788
7386a21886k50362j43495N2649J52406L16866J3437J22213J81529l4787j94063
7376I4507L7622K49376N5630L3954l51045k01385k34884k21087P482L13217J6835
$$ y = [87888, -523897, -584177, -408203, -233363, -186976, -254585, 145137, 349191, 384497, 127941, -154772, -303871, -361034, -414281, -221246, -200934, -387778, -540413, -569834, -403568, -178544, -288921, -329864, -468854, -504001, -396822, -332957, -297071, -164332, 13128, 208288, -8602, -126819, 185020, 54503, -120202, 111125, 382878, 147213, -406530, -590379, -808835, -864409, -648495, -482857, -90260, -54945, -41990, 317848, 366571, 152234, -26425, -290034, -313507, -533760, -380134, -154252, -174660, -167647, -127030, -106098, -121886, -372248, -515743, -463094, -310688, 6178, 19615, 141828, 323357, 288570, 94507, 132129, 381505, 437135, 471089, 120044, -81341, -316225, -537312, -529830, -216613, -199778]
7365a99778K23113N2088j26034Q6499j33906L19465j44079l40070k4520K97699
7355A0477K71469l19308l83296r6382J26648L3537K15302J13651q7730j02342
7345b17974R6930M0806n3222K1539J26496L21004J07137O7630K58314J79945m42147
7334E06458l75525Q5947j92265j10743M7199j52355K71715J99774k60973m47532
7324d28300q2636R4135J93029M0064Q3559k41191j8262L8864k23192K70186N32099
7313B58355O1430r3783o0784J63040n2124J10897J14537k6602n3633k99586l52319
7302b30572J98687R7292l2612M978K98381O8625m40832j31865P6280J73279J92331
7291B73972j15326J59425k27937j24258R7154r3964l18858k5742M2443n1854J99043
$$ y = [-199778, 23335, 75423, -50611, 35888, -98018, 221447, 77368, -262702, -287222, 10477, 281946, -37362, -420658, -517040, -390392, -356855, -141553, -27902, -115632, -217974, -121044, -80238, -133460, -111921, 14575, 335579, 442716, 510346, 768660, 948605, 506458, 130933, 216880, 24615, -86128, -38929, -191284, 80431, 280205, 19232, -428300, -510936, -416801, -223772, -183708, -100149, -341340, -359602, -320738, -543930, -273744, 258355, 319785, 226002, 165218, 328258, 276134, 387031, 501568, 474966, 421333, 121747, -230572, -31885, 65407, 32795, 37773, 336154, 404779, -36053, -167918, -91638, 81641, 273972, 158646, 318071, 90134, -34124, 63030, -30934, -349792, -375534, -333091, -384945, -185902]
7280a85902J44078j41541k9813K4442M80340Q2280n37813l06805N7552p5388J92170
7269b96400p4001J27307k01725p3744J79997j6430N7956J49319n0608j53450J03983
7258b47796K21236K20528j7949j41452k76390j1856j84681o7748L95411J30360
7248A9663j5632Q6863r8066Q0176J7394l22703l9230N4780J57232K55596K3953
7237B20026K66851k05970j72339M51537J58212m83785k55997R4048O1537J31073
7227B65193K4118J58613j613p6909k35436J92868Q6725k03526l04643j53077q8706
7216c36393j18948K52467Q2242j17855j33788j79577L2007m8718R6339p844r8052
7205e78120M664M26024J05535m5851k5865k12491K80519J32427Q8334K54064o5249
$$ y = [-185902, -41824, -183365, -213178, -188736, 291604, 373884, -163929, -470734, -413182, -488570, -296400, -370401, -243094, -444819, -518563, -338566, -354996, -297040, -147721, -198329, -351779, -247796, -26560, 193968, 176019, 34567, -241823, -253679, -438360, -506108, -110697, 19663, 4031, 90894, -7172, 73004, 90398, -232305, -271535, -216755, -59523, 196073, 220026, 486877, 280907, 108568, 560105, 718317, 234532, -21465, 72583, 134120, 265193, 289311, 447924, 446311, 369402, 133966, 326834, 413559, 210033, -94610, -247687, -336393, -455341, -202874, -120632, -238487, -372275, -551852, -519845, -568563, -472224, -480068, -578120, -573456, -147432, -41897, -87748, -113613, -326104, -45585, 86842, 175176, 429240, 363991]
7194C63991k62018o9121P4516m10178r8451j91435k02434k56969J6816K41198
7184g94085K76208J78376o2025M6280Q9840J65650k89065j7418k7539q0410J81281
7173c32907L15040J29565j41952k08541m1709R5625J72253R4039j48619k08573
7163b75779j41945K44221L8314K19183J95769j39559j82876J40871K2321k0076
7153A00444r4763K56797p8322k83517Q6794n2297k29641j40129K11970p2172K01607
7142i3229M5055J5466R7280j31642q6030J1627l1387j05516P7085L58773P0583
7131B28065l68453j71661k630j98113L63090J54983J8098j23600o3481k6146J8782
7120a71066k08521J10547j1515p6452k52801j98726K68389J80226k30021J46094
$$ y = [363991, 101973, 32852, 107368, -302810, -401261, -592696, -795130, -1052099, -1035283, -794085, -517877, -339501, -401526, -355246, -265406, -99756, -388821, -406239, -433778, -514188, -332907, -17867, 111698, -30254, -238795, -280504, -184879, -12626, 81413, -67206, -275779, -417724, -173503, -135189, 83994, 279763, 140204, -42672, 98199, 120520, 100444, 5681, 262478, 184156, -99361, -12567, -64864, -294505, -434634, -222664, -294836, -93229, -48174, -32708, 64572, -67070, -153100, -141473, -172860, -278376, -201291, 157482, 228065, -140388, -312049, -314679, -512792, -149702, 5281, 23379, -100221, -163702, -189848, -171066, -379587, -269040, -280555, -357007, -609808, -808534, -540145, -359919, -589940, -443846]
7110d43846K0137K58824M21278L24998l0006L2161j17083N0461J26581j59874
7100D83631j56473q9170j91098j52285j9257j87491J08177N9318R8261m8594M03758
7089C08777K06251l62297m40984J30979L35706o9531Q1767J69781J23751N0588
7079E34788J00929k43095K06340Q4391P592r8545q1233k91479j93745J46750m4921
7068A27772j50557J96314K2397q3737J71992J32232m45138J56952L51124J13322
7058E92673j23963l3798l47619k46705P6027M54040K71358j04688j11363J2371
7048D38333l43457O5385R1637J40006l9642m33571n0814N55636l37946o1757M40473
7037D64283j3226N112k10887m61259r4772K16884j19958P1017N25611J90833m07248
$$ y = [-443846, -423709, -164885, 256393, 581391, 551385, 583546, 466463, 516924, 643505, 483631, 327158, 237988, 46890, -105395, -124652, -312143, -203966, -144648, -46387, -94981, 308777, 515028, 152731, -288253, -157274, 178432, 108901, 190668, 360449, 484200, 534788, 635717, 392622, 598962, 683353, 690945, 592400, 511167, 219688, 25943, 172693, 127772, -22785, 173529, 195926, 112189, 284181, 416413, -28725, 128227, 479351, 592673, 468710, 434912, 87293, -159412, -83385, 370655, 642013, 537325, 425962, 438333, 94876, 160261, 251898, 391904, 352262, -81309, -132123, 423513, 85567, 23810, 464283, 451057, 456169, 245282, -215977, -310749, -93865, -213823, -142806, 382805, 573638, 166390]
7026A66390n05676J04325N97672Q7213k3372J97463o62697l82803K35529K95520
7016A09564j09299J81515J66304L5456j31208r3805J65137L3252m12905m020Q0671
7005B0662J20904k36354k65014m848K49348O6008o9637k31849r1782J11955J08677
6994b21930K92464k6808r2187K23383K26574j39767l52914P4800K27986k92989
6984h1388k77699j83449J58872J46850J23789M55538R1987p1421K29221J5293
6974F07593l54160l96147j29355j73779n41592q2312N70373M47973n0777j37917
6964b40100p0450Q7528K02221N33084j94673p42269k31325K3498N0671L2910L56850
6953a92055N1912k03195K35936J10425m94363m28571P1892L65133J87507j988
$$ y = [166390, -339286, -234961, 362711, 449924, 426552, 624015, -38682, -421485, -185956, 109564, 265, 181780, 348084, 383540, 252332, 158527, 323664, 356916, -55989, -60009, 20662, 141566, -94788, -359802, -364650, -115302, -49294, -118931, -350780, -442562, -330607, -221930, 70534, 43726, -48461, 174922, 401496, 261729, -91185, -16385, 211601, -81388, -359087, -542536, -383664, -236814, -113025, 342513, 434500, 363079, 592300, 607593, 253433, -142714, -272069, -445848, -987440, -1069752, -499379, -51406, -102183, -240100, -310550, -223022, -20801, 512283, 317610, -424659, -655984, -632486, -581815, -548905, -192055, -140143, -343338, -107402, 3023, -491340, -919911, -848019, -482886, -295379, -297367]
6943b97367l07333k09962J34006L15311o5352K28305L28001M2515j77111J90104
6933A81117l8100k17843p8056k3968j53503M6706j94524m404J36425j8831J37325
6922b27656m7473l47354J53480m3274l728L61023J52301J95739j73253j05871
6912h6066L01124m2790j41753L6758J03166q9569k11238j22116q5032J64900K0676
6901a51940m36252L14980M55461J23961j75030k73832p6515O415K66982j77605
6891a23375m27558n7219M50760K94626m3716l02052j0897J67762m41455m6377
6881e39501J3854M8742M55652M53987J9521o0267r8217m68387j46811j71621k99509
6870g92557J80206K76927Q176M027K06738o4084m58479r3325Q2058M70983K41145
$$ y = [-297367, -604700, -814662, -680656, -365345, -430697, -202392, 125609, 168124, -8987, 181117, 143017, -74826, -152882, -176850, -330353, -283647, -478171, -482575, -346150, -364981, -227656, -275129, -622483, -469003, -512277, -516005, -154982, -2681, 193058, 19805, -86066, 215058, 172268, 30515, 67273, 170439, 80870, -130368, -252484, -337516, -172616, -151940, -588192, -273212, 182249, 306210, 131180, -142652, -219167, -212752, 54230, -123375, -550933, -608152, -157392, 137234, 93518, -208534, -219431, -51669, -493124, -539501, -525647, -476905, -21253, 432734, 452255, 391988, 293771, -174616, -321427, -493048, -792557, -612351, -335424, -327248, -323221, -116483, -180567, -639046, -732371, -650313, -179330, 61815]
6859F1815k80966K27240L9478J03849j13312K49107n7127k6237O4401J86877l60835
6848I4290j16253N3525J31430J79855k21640l2650J45299k31283m55491n9732
6838e12650L33259J78006K260J59741J36317j85880n6737n2282l11248m9534J94681
6827a64067J31055k87150L03713m2344J54820k9264l58277N5737J22653J77115
6817F3991J02736N486K4957K9710K19217J2540J5724J8589K0394N2613m9799r1606
6805D24552l86165k20081k11928j00608L97202J64499N0764m9841p4089j63700
6795a69395m321R9533J49305J54857j0631m06483j09079L56056K14697P935k74439
6784H035j46441J38932K86099k11868k34456J52775K68513j0950k03910M6691
$$ y = [61815, -219151, 8089, 47567, 151416, 38104, 287211, 230084, 203847, 268248, 455125, 94290, -21963, 31562, 162992, 342847, 121207, 88557, 233856, 2573, -452918, -512650, -179391, -1385, 875, 160616, 296933, 111053, 54316, 2034, -309214, -358748, -164067, -33012, -320162, -16449, -58793, 96027, 66763, -291514, -235777, -113124, 63991, 166727, 172213, 197170, 226880, 446097, 458637, 474361, 492950, 513344, 565957, 516158, 424552, 38387, -181694, -393622, -494230, -97028, 67471, 118235, 68394, -5695, -169395, -173716, -74183, 75122, 229979, 219348, -187135, -296214, 59842, 274539, 282474, 8035, -138406, 526, 286625, 74757, -159699, -6924, 261589, 250639, 46729, 93420]
6774I3420L8895Q567J30614J804J2806q3908j66438j81974j42260K2180M51354
6763A85060R678j87178Q5061n4939j55048q342Q0438O3123K23437k20638m3722
6752b3070J50696o1332k06003K76420k42202r55R5337P193J4397l3080N0759j4357
6740A3803J35514J58470k50495j20439J80130J55154Q448l5618k25740K3236J06845
6729A49308K0033k90476n3621J93109L2265J81137l0943j05714o7114j24597j81376
6718b77989j6286J87157l68353K15605J06357k7678K50200L41532R7857m28951
6708G9451K84983J35043J82042q2487l94265J05307j52244r9895j99397o07501
6698g48963k51216J68586L16055l1421J47378J06300L72538O9534J62201j12331
$$ y = [93420, 132315, 140882, 271496, 273300, 286106, 202198, 35760, -146214, -288474, -266294, 185060, 194738, 7560, 92621, 37682, -117366, -125708, -45270, 17853, 241290, 20652, -23070, 127626, 66294, -139709, 136711, -105491, -106446, -11109, -3916, 10481, -22599, 28160, 13803, 149317, 307787, 57292, -63147, 116983, 272137, 280585, 244967, 19227, 42463, 149308, 169341, -121135, -174756, 18353, 50618, 231755, 200812, 95098, 27984, -96613, -277989, -294275, -107118, -475471, -259866, -153509, -181187, 69013, 410545, 508402, 79451, 364434, 499477, 681519, 599032, 204767, 310074, 157830, 57935, -141462, -748963, -1000179, -831593, -515538, -546959, -399581, -293281, 79257, 148791, 310992, 198661]
6688A98661k88018k7149k51992j61560N07863p5990J35430j09867K01026k15591
6678h7187P4273J74741m0705o5083m3039R764N9720k29116k79087j92645N4734
6667e63630Q4364L09296N4102P2485J67935q9823k94402L4330J36327q1348J18435
6656e1929l09275m65759R5901K44258J82038N2327l74051m3561M05503M76562
6646B12014o9414k32609K14777K40004M1542j65739J61266k17974l00498o61n9534
6635a76826j56344L70891J47109j23836J47378L01798k29194j03948p2155j05427
6625e54k92872l72265J19679k0355J16964J39508o2276N97703K54407m389k88311
6614A87239k31069J97579k51707l29774K8092K12252J38711O5720j6587k04039
$$ y = [198661, -89357, -116506, -368498, -530058, -22195, -98185, 37245, -72622, 128404, -87187, -12914, 161827, 121122, 56039, 13000, 22764, 82484, -146632, -425719, -618364, -563630, -479266, -169970, -115868, -43383, 124552, 34729, -259673, -225343, -89016, -170364, -51929, -361204, -826963, -731062, -486804, -304766, -252439, -626490, -670051, -264548, 212014, 142600, -90009, 124768, 364772, 406314, 240575, 401841, 183867, -116631, -117292, -176826, -333170, 37721, 184830, 60994, 208372, 510170, 280976, 177028, 104873, -554, -293426, -665691, -546012, -566367, -449403, -309895, -372171, 225532, 479939, 475550, 187239, -43830, 153749, -97958, -427732, -399640, -187388, -48677, 17043, 456, -203583]
6604b03583L73584J42349k07322k1365l46193q8510R6740R7212L78965K6006k27373
6593B0510j61591K91568J96050j81715l4940P5727j747l2554K27672j34601r5070
6582A69309k17698m22428k24984k2711L27308K1866P5704k42250K02221J54266
6572a79397L03566J08101J93093J22718R6538k74344j68781j07500Q3918k36520
6562e8608J03694N1713k36203p3425r62K85919J74102L2935m7723k19216p3888
6551f1662J04699N9841k65892j99277m439J46879j483j08379M4181j28759N3932
6540c60359k73574j08680Q6530K73912J80127j37208k54007N7479J24962J69241
6530b41577J01912p5311j33214J61910J43288Q5807J26935j83283Q5194L6544
$$ y = [-203583, 170001, 312350, 105028, 83663, -262530, -351040, -254300, -157088, 221877, 247883, 20510, -141081, 150487, 346537, 164822, 129882, 205609, 203862, 171308, 398980, 264379, 169309, -48389, -470817, -695801, -718512, -391204, -369338, -293634, -535884, -333663, -179397, 124169, 232270, 425363, 548081, 644619, 370275, 201494, 93994, 177912, -58608, 45086, 96799, -139404, -212829, -213791, 72128, 246230, 279165, 231442, 12226, -61662, 43037, 102878, -163014, -362291, -366730, -219851, -221334, -329713, -285532, -414291, -360359, -633933, -742613, -656083, -382171, -202044, -339252, -593259, -535780, -410818, -241577, -139665, -214976, -348190, -186280, -42992, 42815, 169750, -13533, 71661, 108205]
6520A08205j07651m8308j62616k01029j74112J50171K46593l6948n6486j23494
6510d05675j61886j4739K84184O5499n1210n1655P8900K62250J61333N5118j33948
6499H8171k94167Q92j7537M587q5659l7664K129n3587N2425n2132J21600J89438
6487h1504j88627k12100j76802N1000P642J16867Q5087J32010L14738o1398L725
6476i362r1833j33410q8852J76921j60936k46157k4732K91705j12036J57729R2545
6465a48418n559j87428k47589o2279L23872M18407P4575J09633K17277j75987
6455C16504j43818j5442j97127L0211j88421m1319j75543J3621M56044K77425
6445C32135j1971j94252j43643r4296J32187K16593j60300k38333J04601j41102
$$ y = [108205, 554, -47754, -210370, -411399, -585511, -435340, -188747, -225695, -282181, -405675, -567561, -582300, -298116, -232617, -283827, -335482, -256582, 5668, 167001, 222119, 88171, -205996, -205104, -222641, -218054, -303713, -341377, -339248, -392835, -340410, -392542, -270942, -81504, -270131, -482231, -659033, -608033, -600391, -483524, -398437, -266427, 48311, -13087, -9362, -101195, -234605, -323457, -146536, -307472, -553629, -578361, -286656, -398692, -240963, -148418, -153977, -341405, -588994, -651273, -327401, 91006, 165581, 275214, 492491, 316504, 172686, 157244, -39883, -9672, -198093, -239412, -414955, -401334, 54710, 332135, 320164, 125912, -17731, -112027, 20160, 236753, 76453, -161880, -57279, -198381]
6435a98381L1817k85639r9619k88090o7126R7866L34478L8657K39825O9751p8926
6424b05387J30575J24348m9854n0073J99223j46412r2363J8372J21066J21668
6414A71163k60254k91987j81135O9874Q0191m3016l69010L8151N16763O56713
6404C87453N5927m6108p2612N1124o8834j05161J62909R0365j26180K6651k5633
6393C29901q9816q2340k01785j11822j3203P0757k4580j00477l27750j80895L87797
6382c44213j04392K54494Q9945J82075J08807r0592j72905J13565k43642l1535
6372b38393O510j7523J26927J08007N7267L39394J55185j52004j88633l79577
6362a82840j53634j15880Q1627J21763j53803J53696L58864p5537l76802L9368
$$ y = [-198381, -166564, -452203, -551822, -839912, -907038, -809172, -474694, -436037, -196212, -126461, -205387, -74812, 49536, -318, -50391, 148832, 2420, -89943, -71571, 49495, 171163, -89091, -381078, -562213, -492339, -412148, -455164, -824174, -786023, -269260, 387453, 443380, 397272, 324660, 375784, 306950, 201789, 364698, 455063, 328883, 355534, 329901, 240085, 157745, -44040, -155862, -169065, -98308, -122888, -223365, -551115, -732010, -344213, -448605, -194111, -104166, 77909, 186716, 96124, -76781, 36784, -206858, -238393, -231883, -249406, -122479, -14472, 42795, 382189, 537374, 385370, 196737, -182840, -336474, -452354, -370727, -248964, -402767, -249071, 109793, 34256, -342546, -303178]
6352c03178K64962N0618l0574R2799j2686m5581j08975K34252j7093N6081k08918
6341b8293K6748J4744P5850k73579j60414p0247j37293L4685J87912j023N2746
6330b78164K12234j46293J59472n282j09374j5826J15480J26768Q7701j40593
6320F123k08981K05657J92532J47838l91770j55447l6030j73320Q3838K33204
6310i6356J69638j65789l80303j55538M5546l2967J77876M68289r6110K02123
6300A36409K33578m31091j96968p3466q7900J14552L35090j5276q2131P8785K68082
6289B79664q6590m2873k31674l42302J03198R1059J94684J64223l22212k31686
6279d24509M3705J4027n1161J02187P981P688k417k8200l4737J26812L9362J4324
$$ y = [-303178, -38216, 12402, -18172, 74627, 61941, 16360, -92615, 141637, 124544, 180625, -28293, -1545, 13199, 89049, -184530, -344944, -415191, -552484, -517799, -329887, -330910, -278164, -65930, -212223, -52751, -58033, -167407, -183233, -67753, 59015, 146716, 6123, -202858, 2799, 195331, 343169, -48601, -204048, -240078, -413398, -329560, -96356, 73282, -92507, -472810, -628348, -582802, -615769, -437893, 30396, -65714, 136409, 369987, -61104, -258072, -331538, -419438, -304886, 30204, 14928, -67203, 11582, 279664, 193074, 150201, -81473, -423775, -320577, -229518, -34834, 129389, -192823, -424509, -380804, -366777, -417938, -315751, -307770, -300082, -302499, -330699, -365436, -238624, -199262, -184938]
6267a84938M766M52627J41000l67143r1008N4511O0092j11645j53879K85708P2466
6256A62557k73115k64140r2501q9554K46827J97706k20240M735M45871j72996
6246e4850J4444k6907j56619L70675J3849j28098k9783O4089r698j4183p1091
6235b8172J45111J62183j47461j2274l65524j76357L5389J85297k1501R8104q2338
6224b07543j27351L2473n9405K89373P2887J99018J01371j54409j98051O2207
6214A0570K26968j68389j22599Q0550r2703J42971L74906L6064l49569j64434
6204b5665J90518j78731K14985K58819j45329n09700p3575O44530K44275J17091
6194G37218k70318o23685k48234J64906p5651j2650L1419K76894k4336j40233
$$ y = [-184938, -180172, 272455, 413455, 46312, -44696, 9815, 69907, -41738, -195617, 90091, 162557, -110558, -374698, -467199, -556753, -309926, -112220, -332460, -327725, 118146, -54850, -40406, -67313, -223932, 146743, 160592, 32494, 2711, 66800, 57102, 42919, -28172, 116939, 279122, 131661, 119387, -246137, -422494, -387105, -201808, -223309, -125205, -207543, -334894, -302421, -361826, -72453, 434, 199452, 300823, 146414, -51637, 10570, 237538, 69149, -53450, 27100, -65603, 77368, 452274, 488338, 138769, -25665, 164853, -13878, 201107, 459926, 314597, -195103, -268678, 375852, 620127, 737218, 466900, -156785, -405019, -240113, -315764, -328414, -296995, -20101, -44437, -184670]
6184a84670K79924M2005k40717k2080K18630J24146K05592O9872P9431r3099p0757
6173D08277l08297j4273J29938r3188j19681j7228l5504r8755j03678r1458P6635
6162b67212k05289R7828N6838J68082L91466o3707o9401J29470j51987l74420
6152b88332J09327R6113l0825P812p7212K12109k9408J73435Q3142k4680r1144
6141A40337m8394J25753j75557J17030J43443m52467k11260o0006j35646n9903
6131f16670L09021o626k0865j87006p5939J88983J88387j83492k34454O178L17533
6120c14950L86707n0034j1862Q2011p3452P3250J74865j39283J35308r5372l62490
6109a95302j74937M28467M78331m08765l50193J49246K31649R231m48736P4423
$$ y = [-184670, 95254, 137259, -103458, -125538, 93092, 217238, 422830, 492702, 572133, 479034, 408277, 99980, 85707, 215645, 122457, 2776, -14452, -49956, -148711, -252389, -343847, -267212, -472501, -374673, -317835, -149753, 241713, 178006, 108605, 238075, 86088, -288332, -179005, -82892, -113717, -105905, -183117, 28992, -416, 173019, 256161, 231481, 140337, 91943, 217696, 42139, 159169, 302612, -149855, -361115, -421121, -556767, -616670, -307649, -314275, -335140, -522146, -598085, -409102, -220715, -404207, -638661, -632483, -314950, 71757, 21723, 9861, 91872, 18420, 91670, 266535, 127252, 262560, 167188, -195302, -370239, 58228, 536559, 127794, -222399, -73153, 158496, 167727, -281009, -206586]
6099b06586J45321k41551j26380k61620L58333K31604Q8191l53309j18612O4848
6089d19761K88545N35732m3291k93083j27155r4333J9193L32151R2447j11567
6079A78878k27936j24857k1231K01322K83081k3007l6372j66371J52622k10269
6069E860k76985J97759P9136P3544L7514n2645j75564j97029m04934j58787L6844
6058h35287K77207J82201L54171P5890K1k84742l27069L47420N4569j17653N3727
6047b19545k18866q4202K82638L39649L20520j2720k97918l23223k4781j5557
6037b54005J21028K62213K64205k62956m43191P1623J04074j37360p6360m096
6027c54825J16141j74973k59325M65824N87680j74922L2445Q7375L6146j25895
$$ y = [-206586, -61265, -302816, -429196, -690816, -332483, -100879, -12688, -365997, -484609, -419761, -131216, 404516, 361225, 68142, -59013, -153346, -134153, 197998, 290445, 178878, -49058, -173915, -195146, 6176, 289257, 266250, 229878, 63507, 216129, 5860, -271125, -73366, 5770, 79314, 116828, 64183, -111381, -308410, -713344, -872131, -835287, -558080, -375879, -21708, 54182, 54203, -230539, -557608, -210188, -155619, -273272, -219545, -438411, -522613, -239975, 99674, 420194, 407474, 109556, -213667, -238448, -254005, -132977, 129236, 393441, 130485, -312706, -241083, -137009, -274369, -350729, -354825, -238684, -413657, -672982, -207158, 380522, 205600, 238045, 325420, 361566, 235671]
6017B35671k32778P1500j92403l38864j79264J62145l2782M09712K48045l3362
6007A17620K48671J23659m92923k68639M21418j98678K76031K18059M6408Q7517
5997E79143j50867l67835k04154j31702k49628J5204P9401K32886K37057K00969
5987B40474J39162J04043j48130j80753k07149R0624Q8976k9479j44929M9089
5977A928q8205M7693l3276j41074j39190K17296O1781K072O6437j68695J68805
5966d428m0852k47553j67128o545k0612K7868J76984J82543K51229J99203K33120
5955E83829k52147k29865J44861L44771j87024k97160k56051K66457o7527j39925
5945h9781j2005l8224n9326j56308J73903l43114R9021J30790J54487P230j27977
$$ y = [235671, 2893, 74393, -118010, -456874, -636138, -473993, -506775, -97063, 150982, 117620, 366291, 489950, -2973, -271612, 149806, -48872, 227159, 445218, 491626, 579143, 428276, 60441, -143713, -275415, -525043, -509839, -430438, -197552, 39505, 240474, 379636, 483679, 335549, 154796, -52353, 38271, 127247, 97768, -47161, 1928, -86277, -38584, -71860, -212934, -352124, -134828, -73047, -70975, -4538, -173233, -4428, -45280, -292833, -459961, -466506, -487118, -459250, -282266, -99723, 151506, 350709, 583829, 331682, 101817, 246678, 591449, 404425, 107265, -148786, 117671, 50144, -89781, -101786, -140010, -199336, -355644, -181741, -524855, -425834, -295044, -140557, -133327, -261304]
5934b61304o5939j64890L52973J64161M9077o7186m0064n2044P7720l9224R3611
5923D6891o0479k49106p9600J80389k31413q8105L67798J89749N0183k9318k42033
5912a45044l84353J80444R4793J36788Q2896P4184j01538L105k57114M0875j2264
5901b87228M26666L25956j1071k9590j77453l38724P5494k92M2863o6888r8726
5890a38993J35531L53212k536j92704J0728l68322K64627J28666k3268n1926J9131
5879A34146j04171j45637j38146L7551p5072l2963L1665l8472j46779L34766K02494
5868E9382J96462k16019n00835J38858L33521p25k0666l23237k5818K90359L9452
5857b9266Q0748j95243j32178L2797R4705M9239J02573m49998J01484J07774L06865
$$ y = [-261304, -327243, -492133, -139160, 25001, 74078, 6892, -33172, -85216, -7496, -46720, 46891, -13588, -262694, -342294, -161905, -393318, -481423, -113625, 76124, 126307, 96989, -145044, -529397, -348953, -254160, -117372, -34476, 39708, -61830, -58725, -315839, -274964, -287228, 139438, 465394, 454323, 424733, 247280, -91444, -15950, -16242, 26621, -40267, -138993, -3462, 349750, 347214, 154510, 165238, -203084, 61543, 190209, 166941, 115015, 134146, 29975, -115662, -253808, -216257, -291329, -324292, -292627, -331099, -477878, -143112, 59382, 255844, 39825, -461010, -322152, 11369, 10644, -10022, -333259, -359077, -68718, -29266, 51482, -143761, -275939, -243142, -148437, -99198, 3375, -446623, -345139, -237365, 69500]
5846F9500K24010m3297j30670k25205k82843k32478n7116P9899k6121p5631J87942
5835e12010J55945P389K91654q5205K5072o3534p8876J51917K24070N9670m00629
5824b24537j19770o473L17473K35478J7212l41850n87785j08069J25553N5624
5814f37144P8295J24057Q9719l039o2235L19509L40874o1089k21119M646k00588
5803b28114j91536J7799M7000k21933j55301L04807K90092J86241N9808j28084
5793a9221k08151r5786j19409K26610M84071J76898l89027l97772n5647J72541
5783b24893J14307m0734K1713R371L5605j14554l24916R3463j16484j33808J29023
5772e51907N9280J19805J7233J60832P0691l27342J59611J33389r5757k9967R3720
$$ y = [69500, 293510, 250213, 119543, -105662, -388505, -620983, -678099, -598200, -624321, -699952, -512010, -356065, -348676, -57022, -142227, -117155, -180689, -259565, -107648, 116422, 176092, -224537, -344307, -350780, -33307, 202171, 219383, -122467, -710252, -818321, -692768, -637144, -558849, -434792, -345073, -348112, -410347, -90838, 250036, 188947, -32172, -27526, -228114, -419650, -401851, -354851, -576784, -732085, -427278, -137186, 49055, 108863, -19221, -227372, -323158, -442567, -215957, 268114, 445012, 55985, -341787, -397434, -224893, -110586, -151320, -129607, -120236, -84631, -199185, -524101, -430638, -547122, -680930, -551907, -492627, -372822, -355589, -194757, -124066, -451408, -291797, -158408, -254165, -284132, -190412]
5761a90412J18934K95671J34184l40551k56727L34309n8570O7566o2889J4827
5751E6342L76729n445q5954j27264k35061J19438J02432M7459j33173k50791J90699
5740E5411K0218K41903L66548k38696k76429j53263P8427K8871M50032l17088
5730B55934n98236j04004M57745K87180K951j42692n6491J58113J45983k24732
5720A81751J40917L811l01255r6248k45740k68915l5132O5714O18889J5581m94284
5709d14911l62905j71818N09383M21915l7265j94107K9268J85070J06338j04265
5699c3297l1943j14143r7515L66977K7333j12412j31857k08250L27799K59874
5689B52566l1966q6603m55453j05813L11176J74194N5717m322l33710l8216J63689
$$ y = [-190412, -71478, 224193, 358377, 17826, -238901, 95408, 36838, 104404, 41515, 56342, 433071, 427626, 341672, 214408, -20653, 98785, 201217, 248676, 115503, -135288, 55411, 75629, 317532, 684080, 445384, 168955, 15692, 94119, 122990, 573022, 255934, -342302, -446306, 11439, 298619, 301570, 158878, 102387, 260500, 406483, 181751, 322668, 326479, 25224, -71024, -316764, -585679, -620811, -555097, 63792, 79373, -414911, -777816, -949634, -440251, -18336, -55601, -249708, -220440, -35370, 70968, -33297, -65240, -179383, -276898, 90079, 117412, 5000, -126857, -335107, -7308, 252566, 220600, 133997, -321456, -427269, -116093, 58101, 113818, 109496, -224214, -262430, -98741]
5678i8741q7498k19011J41261M38508k54837r5549P5157l70775k3470K44826j28316
5667c78445J71263K17930O2659P4779M414k35620j07220k55185K02910L11450
5657F8935l5341J4728j05446k07051j04931Q3920j77548J45927J40271K05225
5647B8689L30653K49092m0543m37294k84338k00375l3147J78968L31556j63644
5637d0383l8470J10156k6938Q2533J73413j2558j45972j14384J6030J32712J06497
$$ y = [-98741, -186239, -405250, -263989, 174519, -80318, -175867, -100710, -471485, -494955, -250129, -378445, -207182, 10748, 73407, 148186, 152600, -83020, -190240, -445425, -242515, 68935, 33594, 48322, -57124, -264175, -369106, -285186, -462734, -316807, -176536, 28689, 359342, 608434, 567891, 130597, -153741, -354116, -387263, -208295, 123261, -40383, -78853, 31303, 4365, 86898, 260311, 247753, 101781, -12603, 3427, 136139, 242636]
$$ [...]
##END NTUPLES=NMR SPECTRUM
##END=
