##TITLE=Analysis number 320795
Compound Code cc 43251
Book Reference 467/48
Project Code adrs
Chemist Name benw
##JCAMPDX= 6.0         $$ Bruker NMR JCAMP-DX V2.0
##DATA TYPE= NMR SPECTRUM
##DATA CLASS= NTUPLES
##ORIGIN= Bruker BioSpin GmbH
##OWNER= nmr
$$ XWIN-NMR		Version 3.5
$$ Tue Jul 11 08:32:36 2006 GMT Daylight Time (UT+1h)  MAYBRIDGE\nmr@NMR_250MHZ
##.OBSERVE FREQUENCY= 250.131544655141
##.OBSERVE NUCLEUS= ^1H
##.ACQUISITION MODE= SIMULTANEOUS (DQD)
##.ACQUISITION SCHEME= undefined
##.AVERAGES= 16
##.DIGITISER RES= 18
##SPECTROMETER/DATA SYSTEM= dpx250
##.PULSE SEQUENCE= zg30
##.SOLVENT NAME= DMSO
##.SHIFT REFERENCE= (INTERNAL, DMSO, 0, 16.522)
##AUDIT TRAIL= $$ (NUMBER, WHEN, WHO, WHERE, WHAT)
$$ ##TITLE= Audit trail, XWIN-NMR		Version 3.5
$$ ##JCAMPDX= 5.01
$$ ##ORIGIN= Bruker BioSpin GmbH
$$ ##OWNER= nmr
$$ C:\u/data/dgb/nmr/ADRS/2590/pdata/1/auditp.txt
$$ ##AUDIT TRAIL=  $$ (NUMBER, WHEN, WHO, WHERE, WHAT)
(   1,<2006-07-11 08:32:11.43 +100>,<MAYBRIDGE\nmr>,<NMR_250MHZ>,
      <created by zg, POWCHK disabled, PULCHK disabled
       configuration hash MD5:
       E2 DF 36 D8 04 B2 41 60 5A D7 A3 38 5A 4B D0 FE
       data hash MD5: 64K
       37 EF 2B 18 DE 21 80 6B 9C D4 8E E9 DB 87 EF 1E>)
(   2,<2006-07-11 08:32:25.36 +100>,<MAYBRIDGE\nmr>,<NMR_250MHZ>,
      <Start of raw data processing
       ef LB = 0.3 FT_mod = 6 PKNL = 1 SI = 32K 
       data hash MD5: 32K
       79 06 70 5F 1F F3 33 14 9F 1F DC 20 84 2A 3C 59>)
(   3,<2006-07-11 08:32:27.52 +100>,<MAYBRIDGE\nmr>,<NMR_250MHZ>,
      <apk 
       data hash MD5: 32K
       30 51 49 21 7E C3 00 F6 47 8B 34 18 85 1E 32 D9>)
(   4,<2006-07-11 08:32:28.47 +100>,<MAYBRIDGE\nmr>,<NMR_250MHZ>,
      <abs ABSG = 5 
       data hash MD5: 32K
       59 D8 C5 F0 27 BB 77 13 69 58 DE 0F 2A 60 2B FA>)
$$ ##END=
$$ 
$$ hash MD5
$$ 1D 31 A0 49 78 33 B8 69 E3 DC A2 5F F5 46 6A 1B
##$RELAX= 
##$RELAX= 
##$RELAX= 
##$RELAX= 
##$RELAX= 
##$RELAX= 
##$RELAX= 
$$ Bruker specific parameters
$$ --------------------------
##$DU= <C:\u>
##$EXPNO= 2590
##$NAME= <ADRS>
##$PROCNO= 1
##$TYPE= <nmr>
##$USER= <dgb>
##$AMP= (0..31)
100 100 100 100 100 100 100 100 100 100 100 100 100 100 100 100 100 100 
100 100 100 100 100 100 100 100 100 100 100 100 100 100 
##$AQSEQ= 0
##$AQ_mod= 3
##$AUNM= <au_zg>
##$AUTOPOS= <1 >
##$BF1= 250.13
##$BF2= 250.13
##$BF3= 250.13
##$BF4= 250.13
##$BF5= 500.13
##$BF6= 500.13
##$BF7= 500.13
##$BF8= 500.13
##$BYTORDA= 1
##$CFDGTYP= 0
##$CFRGTYP= 5
##$CHEMSTR= <none>
##$CNST= (0..31)
1 1 145 1 1 1 1 1 1 1 1 1 1 1 1 1 1 1 1 1 1 1 1 1 1 1 1 1 1 1 1 1 
##$CPDPRG= <>
##$CPDPRG1= <>
##$CPDPRG2= <>
##$CPDPRG3= <>
##$CPDPRG4= <mlev>
##$CPDPRG5= <mlev>
##$CPDPRG6= <mlev>
##$CPDPRG7= <mlev>
##$CPDPRG8= <mlev>
##$CPDPRGB= <>
##$CPDPRGT= <>
##$D= (0..31)
0 1 0 0 0 0 0 0 0 0.06 0 0 0 0 0 0 0.0002 0 0 0 0 0 0 0 0 0 0 0 0 0 0 
0 
##$DATE= 1152603130
##$DBL= (0..7)
120 120 120 120 120 120 120 120 
##$DBP= (0..7)
150 150 150 150 150 150 150 150 
##$DBP07= 0
##$DBPNAM0= <>
##$DBPNAM1= <>
$$ [...]
##$SUBNAM7= <"">
##$SUBNAM8= <"">
##$SUBNAM9= <"">
##$SW= 20.6930455092707
##$SWIBOX= (0..15)
0 0 3 0 0 0 0 0 0 0 0 0 0 0 0 0 
##$SW_h= 5175.983436853
##$TD= 65536
##$TD0= 1
##$TE= 295.16
##$TE2= 300
##$TE3= 300
##$TEG= 300
##$TL= (0..7)
0 120 120 120 120 120 120 120 
##$TP= (0..7)
150 150 150 150 150 150 150 150 
##$TP07= 0
##$TPNAME0= <>
##$TPNAME1= <>
##$TPNAME2= <>
##$TPNAME3= <>
##$TPNAME4= <>
##$TPNAME5= <>
##$TPNAME6= <>
##$TPNAME7= <>
##$TPOAL= (0..7)
0.5 0.5 0.5 0.5 0.5 0.5 0.5 0.5 
##$TPOFFS= (0..7)
0 0 0 0 0 0 0 0 
##$TUNHIN= 0
##$TUNHOUT= 0
##$TUNXOUT= 0
##$USERA1= <user>
##$USERA2= <user>
##$USERA3= <user>
##$USERA4= <user>
##$USERA5= <user>
##$V9= 5
##$VALIST= <valist>
##$VCLIST= <CCCCCCCCCCCCCCC>
##$VD= 0
##$VDLIST= <DDDDDDDDDDDDDDD>
##$VPLIST= <PPPPPPPPPPPPPPP>
##$VTLIST= <TTTTTTTTTTTTTTT>
##$WBST= 1024
##$WBSW= 4
##$XGAIN= (0..3)
0 0 0 0 
##$XL= 0
##$YL= 0
##$YMAX_a= 270288
##$YMIN_a= -382158
##$ZGOPTNS= <>
##$ZL1= 120
##$ZL2= 120
##$ZL3= 120
##$ZL4= 120
##$ABSF1= 16.522
##$ABSF2= -4.171173
##$ABSG= 5
##$ABSL= 3
##$ALPHA= 0
##$AQORDER= 0
##$ASSFAC= 0
##$ASSFACI= 0
##$ASSFACX= 0
##$ASSWID= 0
##$AUNMP= <proc_1d>
##$AZFE= 0.1
##$AZFW= 0.1
##$BCFW= 0
##$BC_mod= 0
##$BYTORDP= 0
##$COROFFS= 0
##$CY= 12.5
##$DATMOD= 1
##$DC= 0
##$DFILT= <>
##$DTYPP= 0
##$F1P= 14.0000005364418
##$F2P= -0.99999901652339
##$FCOR= 0.5
##$FTSIZE= 32768
##$FT_mod= 6
##$GAMMA= 0
##$GB= 0
##$INTBC= 1
##$INTSCL= 1
##$ISEN= 128
##$LB= 0.3
##$LEV0= 0
##$LPBIN= 0
##$MAXI= 10000
##$MC2= 0
##$MEAN= 0
##$ME_mod= 0
##$MI= 0
##$NCOEF= 0
##$NC_proc= -5
##$NLEV= 6
##$NOISF1= 0
##$NOISF2= 0
##$NSP= 0
##$NTH_PI= 0
##$NZP= 0
##$OFFSET= 16.522
##$PC= 1
##$PHC0= 139.8799
##$PHC1= 33.85213
##$PH_mod= 1
##$PKNL= yes
##$PPARMOD= 0
##$PSCAL= 4
##$PSIGN= 0
##$REVERSE= no
##$SF= 250.13
##$SI= 32768
##$SIGF1= 0
##$SIGF2= 0
##$SINO= 400
##$SIOLD= 32768
##$SREGLST= <1H.DMSO>
##$SSB= 0
##$STSI= 32768
##$STSR= 0
##$SW_p= 5175.98343685301
##$SYMM= 0
##$S_DEV= 0
##$TDeff= 65536
##$TDoff= 0
##$TI= <Analysis number 999999
Compound Code 99
Book Reference 9
Project Code 9>
##$TILT= no
##$TM1= 0
##$TM2= 0
##$TOPLEV= 0
##$USERP1= <user>
##$USERP2= <user>
##$USERP3= <user>
##$USERP4= <user>
##$USERP5= <user>
##$WDW= 1
##$XDIM= 32768
##$YMAX_p= 372431266
##$YMIN_p= -3103245
$$ End of Bruker specific parameters
$$ ---------------------------------
##NTUPLES= NMR SPECTRUM
##VAR_NAME=  FREQUENCY,     SPECTRUM/REAL,   SPECTRUM/IMAG
##SYMBOL=    X,             R,               I
##VAR_TYPE=  INDEPENDENT,   DEPENDENT,       DEPENDENT
##VAR_FORM=  AFFN,          ASDF,            ASDF
##VAR_DIM=   32768,         32768,           32768
##UNITS=     HZ,            ARBITRARY UNITS, ARBITRARY UNITS
##FACTOR=    0.157963299565203, 1,           1
##FIRST=     4132.6476996994, 0,             0
##LAST=      -1043.33573715361, 0,           0
##MIN=       -1043.33573715361, -3103245,    0
##MAX=       4132.6476996994, 372431266,     0
$$ Real data points
##PAGE= N=1
##DATA TABLE= (X++(R..R)), XYDATA
$$ [...]
20518D98212p9573m9425l7924k6088l3288N4780R7042K3446o4210k7709n9910
20507B95353K354O9678q642j0528K7150l4462j7511j7273r717m4841L147K6815
20495B81523L4136N2621l0610o8389j3167J8224K2921K3688K5177l5009r179l210
20483B98726K2807K5726M2035n161K9196K5922J3984j2328l3259j8763p984K1992
20471D02893O6515q932p3392m4277k157M3920N742m2689k6958K6464N1980L807
20459D02916j1272l3005P449J3642j1259M2218J2868k0425j9169l3056Q89P222
20447C59018K1923l0909o5094O5389P8431K539k5910r4913l0748L9836L2763P4881
20435D27206N6268j4027p757Q664L3567j7023l3788n598K0050M997P138k873P3121
$$ plain form
20518 498212 418639 369214 331290 305202 271914 326694 423736 447182 382972 355263 295353
20507 295353 297707 367385 358743 348215 375365 340903 323392 306119 296402 251561 254708 281523
20495 281523 315659 368280 337670 269281 256114 274338 297259 320947 346124 311115 301936 298726
20483 298726 321533 347259 389294 384133 413329 439251 453235 440907 407648 388885 380901 402893
20471 402893 469408 460476 387084 342807 340650 384570 390312 347623 320665 347129 399109 402916
20459 402916 391644 358639 366088 379730 368471 410689 423557 403132 383963 350907 351796 359018
20447 359018 380941 350032 284938 350327 428758 431297 405387 310474 279726 319562 352325 427206
20435 427206 483474 469447 461690 470354 503921 486898 453110 447512 467562 472559 479697 476824 549945
20422E49945K1954o5506r889k016m0698l2202p145J3895O0023O6828n3170r9605
20410D02414J4474M9119k8680L2895O4923k3647j183L194l7076j3553j2122K2600
20398D73358Q821N2955J5366j4800K0471O248n6809l5610K644j0172J3950L8505
20386E14927p9355J1466N1852j6836k6063L851l2785m6870K1846M1869j9063l0214
20374C94625M805L2998L0604J6279m9371K0267M2126K5845j7135J434m2477J2520
20362D72520L8857M8254j9580l3860r9300j3154K0379L3488j2135l1908N7883
20351D61444M7987m785q285j5691o0946k194J9294L7763k6824k8690j5231m6656
20339C57186k5398K2884O8461M5244j3982K1900l5269n8893l5321j308L3092J3733
$$ plain form
20422 549945 571899 506393 496504 494488 453790 421588 414443 428338 488361 555189 502019 402414
20410 402414 416888 466007 437327 470222 535145 511498 510315 513509 476433 462880 450758 473358
20398 473358 482179 535134 550500 535700 556171 562419 505610 470000 472644 462472 476422 514927
20386 514927 435572 447038 498890 482054 455991 459842 427057 380187 402033 443902 424839 394625
20374 394625 399430 432428 463032 479311 429940 450207 492333 518178 501043 502477 460000 472520
20362 472520 511377 559631 540051 506191 406891 393737 414116 447604 435469 403561 461444
20351 461444 509431 504646 496361 480670 419724 417530 436824 474587 447763 419073 403842 357186
20339 357186 331788 354672 423133 468377 454395 476295 441026 382133 346812 345504 378596 392329
20327C92329M2360M963j0582J8439j4904K5204k2118j9875M376l1157O1920j717
20315D49238j2187K2527L3348l1380n7640p8482k0098P5868N1795K8988k2816
20304D39161k6844k7477K4453m879Q805M1297L413p675M3293K0401o9890m2644
20292D01414l5161M2124N6310M3018K1423j8565k9101K3939J4380k5991K8872
20281E22662p784J2304J4866J931j7837m3676k7905L9067O3227L4212l5958K611
20269E57720L1744l8650p7329m222J6085l2667o711L9241K0176l772m376r62n681
20256D90596J4499r259L1999j987n3735k2507K2111m9864j6905N5230j8036K9269
20244D71411K3390q187K4413j3645m4922p5662L1785M4314J8751L7487m08j759
$$ plain form
20327 392329 434689 439652 429070 447509 432605 457809 435691 415816 420192 389035 450955 449238
20315 449238 437051 459578 492926 461546 403906 325424 305326 381194 432989 461977 439161
20304 439161 412317 384840 409293 404414 413219 454516 457929 450254 493547 513948 444058 401414
20292 401414 366253 408377 464687 507705 529128 510563 481462 505401 519781 493790 522662
20281 522662 514878 527182 542048 543979 526142 482466 454561 493628 556855 591067 555109 557720
20269 557720 589464 550814 473485 469263 485348 452681 445970 485211 505387 501615 497239 496277 490596
20256 490596 505095 495836 527835 525848 472113 449606 471717 421853 404948 460178 442142 471411
20244 471411 494801 486614 511027 497382 452460 376798 408583 452897 471648 509135 508727 506968
20232E06968o4262K4098L7641j282m4398l0555M9083N2416K0807K0109j9911k5238
20220E25476J9232l898K421j2332m0592j7257k5420M4255l550N4030j3662k6303
20208E02400L3038n088j7401p40Q221M122k3526K1083L4703K3532p0900m3792
20196D65652K1382J3692K3535k5981P2878L2809k4771k591k4395m4882j224K5350
20184E31454M7676M8582K304m8719j9792J7480O047m1165j1991M1226L8529L2011
20172F43642j0114m4386o5218L222P098J3912n1653k4108L4431p30O3908k3889
20160E46115j9054m5938k6262J4953K3326k2058L7823J7448L048n0010J1973O7906
20148E59270M3471O4466k2292n6223j8733k9099l0433k6318J0632k9960j4942
$$ plain form
20232 506968 442706 466804 504445 503163 458765 428210 477293 529709 550516 570625 550714 525476
20220 525476 544708 540810 543231 530899 490307 473050 447630 491885 488335 542365 528703 502400
20208 502400 535438 530350 512949 512209 520430 524552 501026 522109 556812 580344 509444 465652
20196 465652 487034 500726 524261 498280 571158 603967 579196 576605 552210 507328 506104 531454
20184 531454 579130 627712 630016 581297 561505 578985 585032 543867 531876 573102 611631 643642
20172 643642 633528 589142 523924 527146 534244 548156 496503 472395 506826 506096 570004 546115
20160 546115 527061 481123 454861 469814 493140 471082 508905 526353 529401 479391 491364 559270
20148 559270 602741 667207 644915 588692 569959 540860 510427 484109 494741 464781 449839
20137D49839O6116L1268m7770m941R188O3286l70k6063N2072L4329m6691k2024
20125E58239r258k4306M1257R80o9691l371N1474L6783O107r172r027j7328l3596
20112E19091J6978j7324l3779m758P7471L8642L6547n3304r0244j8789O1743L9648
20100E71922j6723j2151N3897L5639J6827o227k8317q67K1177p4572j6956j2776
20088E30873P0908J4028K9679O7420L428r0306k3502N8016M2601J2036o8550l2590
20076F14041j4427J0050M0896O7148j1821j3684q831N6102N2565p8288l8978O3264
20064G38037Q9884K8032K1096M5170O2556J2882J1340M3163O2459M0103K854M9294
20052A206870M3841k2650J4491Q7913M6958m7860p667M4048L3140P175q5778j08562
$$ plain form
20137 449839 515955 547223 499453 494512 503700 566986 566616 540553 592625 626954 580263 558239
20125 558239 548981 524675 565932 566912 497221 493850 545324 582107 588214 579042 570015 552687 519091
20112 519091 536069 518745 484966 480208 557679 596321 632868 579564 489320 470531 532274 571922
20100 571922 555199 543048 596945 632584 649411 643184 614867 614000 635177 560605 543649 530873
20088 530873 601781 615809 645488 712908 716336 626030 602528 660544 703145 715181 646631 614041
20076 614041 599614 609664 650560 717708 705887 692203 683372 739474 792039 713751 674773 738037
20064 738037 827921 855953 877049 922219 984775 997657 1008997 1052160 1114619 1154722 1157576 1206870
20052 1206870 1250711 1228061 1242552 1330465 1377423 1329563 1321896 1365944 1399084 1406259 1320481 1211919
20040A211919l8332o1633n5933J0237L2259P924J6765o0183j05286k2439L3574
20029I68872J3338m6469l3095n2494l9595J9501j9611k167L269K0861k3806K462
20017H11066L7963K6648L1970R0907Q7971O6230J03337R8386J97968J25136R2743
20006A770325J63015Q7084N6479N7573Q0185J10542J81437J39519M7739O8931
19996B762829J55185J20423O4899J4361L237Q090m6953n9427j01118j53910k02225
19985B565391j29903o5680l0341o2527o2172j46728j26032j34072j29821j32884
19975A545231j12426j71451j53283n1720j2688n2347p616l3732J5055L5005n2567
19964I47461j1229l9613L955j0901m1879n2393m2637K9220O257O258l705J0161
$$ plain form
20040 1211919 1173587 1111954 1056021 1066258 1098517 1106441 1123206 1063023 957737 935298 968872
20029 968872 982210 935741 902646 850152 810557 830058 810447 808280 811549 832410 808604 811066
20017 811066 849029 875677 907647 998554 1086525 1152755 1256092 1354478 1552446 1677582 1770325
20006 1770325 1933340 2020424 2076903 2134476 2214661 2325203 2506640 2646159 2693898 2762829
19996 2762829 2918014 3038437 3103336 3117697 3120934 3129024 3082071 3022644 2921526 2767616 2565391
19985 2565391 2435488 2369808 2339467 2276940 2214768 2068040 1942008 1807936 1678115 1545231
19975 1545231 1432805 1261354 1108071 1056351 1043663 991316 983700 949968 965023 1000028 947461
19964 947461 936232 896619 900574 889673 847794 795401 752764 781984 788241 794499 790794 800955
19952H00955J5429R03k1947o791L2905K0479K6566m22j5095k9944N6J7080k9992
19939H10182k2815l4838J2020K6049O244j0697O712n1780n3293L6815N487J6363
19927G46449J6143J4416P617k5937j2546J1046L6140J9081l3046m2937l8642k4368
19915F73416Q97M0112l4052p0444J4949L9152M2697M7620J43p4201L5266K9923
19903G45478o633j9309j3140J59K6504K6438N3617N7005L229j1286l6971m3108
19891G81983j9024l6758k351L0197O461k6677j689K4618J516M7397J9247n6409
19879G68511K7781r412n8567k5775J7500K0964Q317l580j9562N9278O6330k1058
19867H30727R166j870j5432l6186P6583j7315j9654L9883M9323l829r0713m9693
$$ plain form
19952 800955 816384 817287 795340 788549 821454 841933 868499 868077 852982 823038 823094 840174 810182
19939 810182 787367 752529 764549 790598 796842 786145 792857 741077 687784 724599 730086 746449
19927 746449 762592 777008 784625 758688 746142 757188 793328 812409 779363 736426 697784 673416
19915 673416 674313 714425 680373 609929 624878 664030 706727 754347 754490 680289 715555 745478
19903 745478 738845 719536 706396 706555 733059 759497 813114 870119 873348 862062 825091 781983
19891 781983 762959 726201 723850 754047 760508 733831 732142 756760 758276 805673 824920 768511
19879 768511 796292 786880 728313 702538 720038 741002 749319 745739 726177 785455 851785 830727
19867 830727 839893 838023 822591 786405 862988 845673 826019 865902 915225 911396 820683 770990
19855G70990k3285K084O7023r017k2823J6460j631J6508K1845J0233L9599N2136
19843I40122J32L441L6969J8055N0295M0156m7973o327k1828M3820N0250N9693
19831A166805J16327L4935K6398K9090l855J2361L0924P0132j1796P94l781n926
19819A462408K1575K7726J3837l836K441J2742L28j07862o4258m1052j8765M5249
19807A350533Q196j7976n8076o2087n1826o2261L7425J8550m4635n0682J3703
19796A080864J2941k2031m3482k0014P70O855n2332p4778M0009N6837q636K235
19784I79238N1226K8103l8330j213q333M8989L9846r590j2801M4077j9956p848
19772A093408j4680o411L8105k2609k5865l25j3984K4784J6037l9122r923O267
$$ plain form
19855 770990 747705 749789 816812 807795 784972 801432 799801 816309 838154 848387 887986 940122
19843 940122 940254 943695 980664 998719 1049014 1089170 1041197 1034870 1013042 1056862 1107112 1166805
19831 1166805 1283132 1318067 1344465 1373555 1369700 1382061 1412985 1483117 1471321 1472115 1468334 1462408
19819 1462408 1483983 1511709 1525546 1521710 1524151 1536893 1537221 1429359 1365101 1324049 1305284 1350533
19807 1350533 1358729 1340753 1282677 1220590 1168764 1106503 1143928 1162478 1117843 1067161 1080864
19796 1080864 1093805 1071774 1028292 1008278 1009048 1015903 963571 888793 928802 985639 977003 979238
19784 979238 1030464 1058567 1020237 1019024 1010691 1059680 1099526 1089936 1077135 1121212 1101256 1093408
19772 1093408 1078728 1072317 1110422 1087813 1061948 1061623 1047639 1072423 1088460 1049338 1039415 1045682
19760A045682L354k3387M984L7987L1648o763k1786K8279N6479p539k8138J7805
19748A138605N6045K2910j7727j485M0669M3910n536N4581P0509M0987K2848J14540
19736A580856P8199J4758J0056J33491R3864P7722K2182N6939N8139o3997N164
19725B067373Q5669M488j7404J7713k5320n6165m2502Q081Q561l3899k5781M7403
19713B038217m5714k7638k9795p3839p4193q5291l971K9028K5919P1365L2210
19702A856298k0168J12935P4171L0390P6594R6099J03532L9848n5472j0136Q3264
19691B387355M8614M8512Q5183M7024j01653k4139k2401l9280o8722q0987l3892
19680B245614K5113j6171n5297n377m0480q8058o7456k1509k3316j6217K1780
$$ plain form
19760 1045682 1049036 1025649 1030633 1068620 1100268 1093505 1071719 1099998 1156477 1148938 1120800 1138605
19748 1138605 1194650 1217560 1199833 1198348 1239017 1282927 1277391 1331972 1402481 1443468 1466316 1580856
19736 1580856 1659055 1673813 1683869 1817360 1911224 1988946 2011128 2068067 2126206 2062209 2067373
19725 2067373 2153042 2157530 2140126 2157839 2132519 2076354 2033852 2041933 2050494 2016595 1990814 2038217
19713 2038217 1992503 1964865 1935070 1861231 1787038 1701747 1697776 1726804 1752723 1824088 1856298
19702 1856298 1836130 1949065 2023236 2053626 2130220 2226319 2329851 2369699 2314227 2304091 2387355
19691 2387355 2435969 2484481 2569664 2616688 2515035 2490896 2468495 2429215 2360493 2279506 2245614
19680 2245614 2270727 2254556 2199259 2193882 2153402 2065344 1997888 1976379 1953063 1936846 1958626
19669A958626r828k5457k6956k1212L4389M1849o7284p0461m0438K9160M3560
19658A845948K3596Q6196J00181N0863K4243K6054M9348P2451R3267J58503J02735
19647B633385N5707m7390L1414M652l2157m47K3767N002o0574o1911n1215l4034
19635B466199q1392p7066j31436r6479j4926R156j014p9016j14209j60087j18759
19624A600971r4450m8030M78J975k2958L5309L7273k0037L1984N9635R7891K3986
19612A704027k8075j4391j5841j8536J2745m3082o6950J5627K6068l8836M390
19601A537146n3403r2870k7157J0785K3067j2101l8044J4093M2607M1502j6828
19590A428797J179O1446K0533r243K3552L9469J1300N0025N5568O5121P5190N9698
$$ plain form
19669 1958626 1948798 1923341 1896385 1875173 1909562 1951411 1884127 1813666 1773228 1802388 1845948
19658 1845948 1869544 1955740 2055921 2106784 2131027 2157081 2206429 2278880 2372147 2530650 2633385
19647 2633385 2689092 2641702 2673116 2677768 2645611 2645164 2668931 2673933 2613359 2551448 2500233 2466199
19635 2466199 2384807 2307741 2176305 2079826 2064900 2074056 2073042 1994026 1879817 1719730 1600971
19624 1600971 1506521 1458491 1458969 1460944 1437986 1473295 1510568 1490531 1522515 1582150 1680041 1704027
19612 1704027 1675952 1661561 1645720 1627184 1639929 1596847 1529897 1545524 1571592 1532756 1537146
19601 1537146 1483743 1390873 1363716 1374501 1397568 1385467 1347423 1361516 1404123 1445625 1428797
19590 1428797 1429976 1491422 1511955 1502712 1526264 1565733 1577033 1627058 1682626 1747747 1822937 1882635
19578A882635P5356M3867Q2682J09512J07702L7342p1257o638M590J3034q499
19567B270326n9223n558M4505k492k1263L2443k929m1523J2163p004k5257P004
19555B201192N029J34948J65378P3223O040K9159L916P5204P9557P0012P3672
19544B917330j5903J951P219J060M1090Q3644N2485J6903K7285m4591m9576j8134
19532C020763R723M1355M0322P188j0257K0261j947j19407n7805J5513k39P964
19520B973434l7753m0988k5643q744N0758M2989k5502m2160k8040o8575l1354
19509B758422p7051l3463K7070P1467K4974Q2774M2373Q8883J02542J28366J77876
19498C394233J83746J39145Q362R891O3799M8417l79N2511N5745P4109O5347J593
$$ plain form
19578 1882635 1957991 2001858 2084540 2194052 2301754 2339096 2267839 2261201 2265791 2278825 2270326
19567 2270326 2211103 2205545 2250050 2247558 2226295 2258738 2255809 2214286 2226449 2219445 2194188 2201192
19555 2201192 2206221 2341169 2506547 2579770 2585810 2614969 2618885 2694089 2773646 2843658 2917330
19544 2917330 2901427 2903378 2910597 2911657 2952747 3036391 3088876 3105779 3133064 3088473 3038897 3020763
19532 3020763 3030486 3071841 3112163 3119351 3109094 3129355 3127408 3008001 2950196 2965709 2965470 2973434
19520 2973434 2935681 2894693 2869050 2860306 2911064 2954053 2928551 2886391 2858351 2789776 2758422
19509 2758422 2681371 2647908 2674978 2746445 2771419 2854193 2896566 2985449 3087991 3216357 3394233
19498 3394233 3577979 3717124 3725486 3735377 3799176 3847593 3847214 3899725 3955470 4029579 4094926 4096519
19486D096519r1539j56832j29659o7463L3806O2768K7001p0502m1377j06236r0640
19475C465846o7531n7649l8567q94k0128J0432J4138k765P0143J0959K1369O231
19463C411584L5703L8769J5893q18J2109N9586P6127o332k3111k4310k4626M0695
19451C611269j636l2672j2074K2699n5502m0439m8556n5760K672j3718l6389k7011
19439C312883L0142m6053p0863J1612j7449M164k017n8283j19776l8404j6963
19428B988993l7782o948K7383O5489M1106J7013M6081J5975j8902P345j4897N8094
19416C188950Q76o783N8712M6000Q8752K2554k565J6625N2075Q983k2912L3256
19404C484523K2426j873O339K4753r5998j5120K7480r460k2653K5302Q959k3087
$$ plain form
19486 4096519 4004980 3848148 3718489 3651026 3684832 3747600 3774601 3704099 3662722 3556486 3465846
19475 3465846 3398315 3340666 3302099 3301205 3281077 3291509 3305647 3302882 3373025 3383984 3405353 3411584
19463 3411584 3447287 3486056 3501949 3501131 3513240 3572826 3648953 3642621 3619510 3595200 3570574 3611269
19451 3611269 3609633 3576961 3564887 3587586 3532084 3491645 3443089 3387329 3390001 3376283 3339894 3312883
19439 3312883 3343025 3296972 3226109 3237721 3220272 3224436 3222419 3164136 3044360 3005956 2988993
19428 2988993 2951211 2944263 2971646 3037135 3078241 3095254 3141335 3157310 3138408 3145753 3130856 3188950
19416 3188950 3189826 3183043 3241755 3287755 3376507 3399061 3396496 3413121 3465196 3474179 3451267 3484523
19404 3484523 3506949 3505076 3511415 3536168 3440170 3425050 3452530 3443070 3420417 3445719 3454678 3431591
19392C431591j0544K285O7388P1147J7731N2575m30m301K7228M0747P5622M9475
19380C820514N0859Q0946P5136L6749K4481P4325Q1224O7083Q4442M1056L9470
19369D476285O0886N1152Q9303L9437J05009J11776J40890J70658J51810J30849
19359E528055J20734J28604J43901J72468J96693K47430J20146J93946K10992
19350G062969K39917K65564K55160L05421L46382L29178M09819M02192L61829
19341I978431M02152N35192N34916N79012P07710Q87228R61441J079180J306803
19332A6972065J599833J953812K427508L072795L917898M807784N668429O369815
19324D6789939O726830O959457P129243P034715O582657O343947O452215O723647
$$ plain form
19392 3431591 3421047 3423332 3490720 3561867 3579598 3632173 3631743 3627442 3654670 3695417 3771039 3820514
19380 3820514 3871373 3952319 4027455 4064204 4088685 4163010 4244234 4311317 4395759 4436815 4476285
19369 4476285 4537171 4588323 4677626 4717063 4822072 4933848 5074738 5245396 5397206 5528055
19359 5528055 5648789 5777393 5921294 6093762 6290455 6537885 6658031 6851977 7062969
19350 7062969 7302886 7568450 7823610 8129031 8475413 8804591 9214410 9616602 9978431
19341 9978431 10380583 10915775 11450691 12029703 12737413 13624641 14586082 15665262 16972065
19332 16972065 18571898 20525710 22953218 26026013 29943911 34751695 40420124 46789939
19324 46789939 53516769 60476226 67605469 74640184 81222841 87566788 94019003 100742650
19316A00742650O953030P383773P651023P100434O242340N958035N579153M438973
19308A52049411K852620J379448k66547k100996l464289m311373n213416o324989
19300A34599869o655255n920745n163424n113927n259414n722986o675277p771680
19292H6317161q349944q330992q339808q032596p100837n933747m781926l801404
19284C1645907l077618k476575j947759j711326j513325j258003j143521j026342
19276A7491438r91136q47501p61624o73775n65047n56624n04217l77708m00955
19267A1812851l91827l21759k74691k34717k53427k11331k16243j19703r7286
19258I691867j56145j73946j05718j36603j29216n362l0827k1062n5669q9495
$$ plain form
19316 100742650 107695680 115079453 122730476 129830910 136073250 142031285 147610438 152049411
19308 152049411 154902031 156281479 156014932 153913936 150449647 146138274 140924858 134599869
19300 134599869 127944614 122023869 116860445 111746518 106487104 100764118 94088841 86317161
19292 86317161 77967217 69636225 61296417 53263821 46162984 40229237 35447311 31645907
19284 31645907 28568289 26091714 24143955 22432629 20919304 19661301 18517780 17491438
19276 17491438 16500302 15652801 14891177 14217402 13652355 13095731 12591514 12213806 11812851
19267 11812851 11421024 11099265 10824574 10589857 10336430 10125099 9908856 9789153 9691867
19258 9691867 9535722 9361776 9256058 9119455 8990239 8984877 8954050 8932988 8877319 8787824
19248H787824K211j4633l0388P2686R9770M3560P0207J43364J61197J74422K66280
19237I776500K88531K44918L49663M64770N62611P03700R29936J127396J489558
19228A5937583J967617K660113L529032M508684N103921M924933M186124L761913
19220D6579920M023478M600826N381598O025115N881035M447747K528552J346290
19212H0814561R00227P06398N79181L85258k59893j394538k589442l457788m281483
19203G1402481n103111n054178m193616l228357k713781k834427l484152m384976
19195D0405883m827662m587448l704038k673726j863157j273746r07775n60887
19187B0007444k70114j34596J5476J72836L95212O81625R39826J459749K174615
$$ plain form
19248 8787824 8790035 8775402 8745014 8817700 8917470 8961030 9031237 9174601 9335798 9510220 9776500
19237 9776500 10065031 10309949 10659612 11124382 11686993 12390693 13320629 14448025 15937583
19228 15937583 17905200 20565313 24094345 28603029 33706950 38631883 42818007 46579920
19220 46579920 50603398 55204224 60585822 66610937 72491972 76939719 79468271 80814561
19212 80814561 81714788 82421186 83000367 83385625 83125732 81731194 79141752 75683964 71402481
19203 71402481 66299370 61245192 57051576 53823219 51109438 48275011 44790859 40405883
19195 40405883 35578221 30990773 27286735 24613009 22749852 21476106 20568331 20007444
19187 20007444 19737330 19602734 19618210 19791046 20186258 20867883 21807709 23267458 25442073
19178B5442073K964298M092112N204028N846452N497254M644127M221583M560653
19170F2472580N330945O009032O298408N732942M153203K541742J651435J023394
19162I5213681N28025L09976J40537n66626j603882k630058l897913n584770o507145
19153G5401825o152251n148716m141815l629237l823517m639936n488873n758121
19145C6619359n229566m255689l204896k351429j782563j376831j016391q31451
19137A6570543p46458o03075m85017n73375m68081l79393l02419k81573k58664
19128A2472488k51860j55921r6329j37539m0940j4128Q7810J52744J14990J99664
19118A2330979K58104K69894K84787L72289N77674O73648Q42803J076412J312780
$$ plain form
19178 25442073 28406371 32498483 37702511 43548963 49046217 53690344 57911927 62472580
19170 62472580 67803525 73812557 80110965 85843907 89997110 92538852 94190287 95213681
19162 95213681 95741706 96051682 96192219 95625593 94021711 91391653 87493740 81908970 75401825
19153 75401825 69249574 64100858 59959043 56329806 52506289 47866353 42377480 36619359
19145 36619359 31389793 27134104 23929208 21577779 19795216 18418385 17401994 16570543
19137 16570543 15824085 15221010 14735993 14162618 13694537 13315144 13012725 12731152 12472488
19128 12472488 12220628 12064707 11968378 11830839 11789899 11775771 11863581 12016325 12131315 12330979
19118 12330979 12589083 12858977 13143764 13516053 14093727 14767375 15610178 16686590 17999370
19109A7999370J689561K162576K952525M107227N858192Q364960J0852378J1454464
19101F5441253R134667O127267N122510O080597P449862Q476413R054495Q475251
19093A25362315O670656N306791N536991O715426O322083M302294L030116K545204
19085A65791876Q17094k703953n432581o244828p079709q698716r892230r115012
19077A17441941o537669l982746k964500l619683o199512j0590145j3958782j3700081
19069E5888823j0702315p418904n114306l632169k744998k124171j706219j459881
19061B0985860j318690j159797j032071r94365r06357q31641p44976o07964n47981
19052A2842018n86572n69940m68976l59933m00853m09926l75791l43819l68976
$$ plain form
19109 17999370 19688931 21851507 24804032 28911259 34769451 43134411 53986789 65441253
19101 65441253 74575920 80703187 85825697 91906294 99356156 107832569 116887064 125362315
19093 125362315 132032971 137339762 142876753 149592179 155914262 160216556 163246672 165791876
19085 165791876 166608970 163905017 158472436 152227608 145147899 136449183 126556953 117441941
19077 117441941 110904272 106921526 103957026 100337343 94137831 83547686 69588904 55888823
19069 55888823 45186508 37767604 32653298 29021129 26276131 24151960 22445741 20985860
19061 20985860 19667170 18507373 17475302 16480937 15574580 14742939 13997963 13389999 12842018
19052 12842018 12255446 11685506 11216530 10856597 10455744 10045818 9670027 9326208 8957232
19043H957232l48359l05492k48857k54806k92985k60130k53078k16802k36977
19034F539746k58550k33362k48001j76556j96334k23833k22660j63219j59354
19025D657877j69548j80255j19941j01938j22457r5161j19658j11425j10667j08580
19015C418247l7127m7006l1371j02662j18108m1608m2141m9656l3680l5497p2405
19004B806986k838l1026o7025j219n244o0841k1526L302k9377K58o4353m6383
18992B480714j3723q093J2805L9024M2058J8251J0220N7193m4953p0509j4422
18981B508565J0340M282n33L9649l9482k7962n688k7498O794l1127p194m381j2857
18968B412908k9290j3187j114N5851j3163j4536N4622p197j2144J3204j1495R5291
$$ plain form
19043 8957232 8608873 8303381 8054524 7799718 7506733 7246603 6993525 6776723 6539746
19034 6539746 6281196 6047834 5799833 5623277 5426943 5203110 4980450 4817231 4657877
19025 4657877 4488329 4308074 4188133 4086195 3963738 3868577 3748919 3637494 3526827 3418247
19015 3418247 3381120 3334114 3302743 3200081 3081973 3040365 2998224 2948568 2914888 2879391 2806986
19004 2806986 2804148 2773122 2706097 2704878 2699634 2638793 2617267 2620569 2591192 2591450 2527097 2480714
18992 2480714 2466991 2458898 2471703 2510727 2552785 2571036 2581256 2638449 2593496 2522987 2508565
18981 2508565 2518905 2523187 2522654 2562303 2522821 2494859 2489171 2461673 2468467 2437340 2430146 2425765 2412908
18968 2412908 2383618 2370431 2369317 2425168 2412005 2397469 2452091 2444894 2432750 2445954 2434459 2529750
18956B529750M3068j3401L0596M9027Q6444N5870M6353J19275P5100P833k5173
18945C004742p140L6741R4527P7307N7729N7336P0633M7077J01684R9236J13537
18934C753409J48075J89978K08989J87057J72479K26477J77728J94062K25372
18925E483626J74620J16659J09567J25320L5093m3966q5568M980M1516N9929K0824
18914F042600P5815O5971L8607J7792O9644J24096R3815J48043J84054J04248
18904F964685J19260Q6003J62978K22458K47397J98871K13977K83853L42756L29365
18894I171603L83771M54401N45401O28659P79338R74710J156869J497716J933597
18885A7526065K309574K956448L604885M086802M377863M201576L801623L786009
$$ plain form
18956 2529750 2572818 2559417 2590013 2639040 2725484 2781354 2827707 2946982 3022082 3029915 3004742
18945 3004742 2997602 3034343 3128870 3206177 3263906 3321242 3391875 3438952 3540636 3639872 3753409
18934 3753409 3901484 4091462 4300451 4487508 4659987 4886464 5064192 5258254 5483626
18925 5483626 5658246 5774905 5884472 6009792 6044885 6000919 5915351 5920331 5961847 6021776 6042600
18914 6042600 6118415 6184386 6222993 6240785 6310429 6434525 6528340 6676383 6860437 6964685
18904 6964685 7083945 7169948 7332926 7555384 7802781 8001652 8215629 8499482 8842238 9171603
18894 9171603 9555374 10009775 10555176 11183835 11963173 12937883 14094752 15592468 17526065
18885 17526065 19835639 22792087 26396972 30483774 34861637 39063213 42864836 46650845
18877D6650845M113471M266589M317487M378586L985515K912661K026700K077278
18869G4729132K398196K306360K058608J784634J588645J482737J977655L314663
18861I1640630N412826P670725R543227R131533N974933L285085L031693M279398
18853A39970050N347900O061672O386179N325552K726421P80285J934015M142332
18845A72674406L933641K401433J710071R61571j748116m946134n544267m711951
18837A64730654n348890p040553o842283l602387L24231K430051K157665K86688
18829A47095176l134133o826814q056495o011595l318216j842979j543496j012596
18821A15348852m0508M62006J22768n18483j159602j853130k498426k791545k949895
$$ plain form
18877 46650845 50764316 55030905 59348392 63726978 67712493 70625154 72651854 74729132
18869 74729132 77127328 79433688 81492296 83276930 84865575 86348312 88325967 91640630
18861 91640630 97053456 104724181 114267408 123398941 129373874 132658959 135690652 139970050
18853 139970050 145317950 151379622 157765801 163091353 165817774 166598059 168532074 172674406
18845 172674406 176608047 179009480 180719551 181681122 179933006 174986872 169442605 164730654
18837 164730654 159381764 152341211 145498928 141896541 142220772 144650823 146808488 147095176
18829 147095176 143961043 137134229 129077734 123066139 119747923 117904944 116361448 115348852
18821 115348852 115308344 115770350 115893118 115374635 114215033 112361903 109863477 107071932 104122037
18812A04122037l748306m877203n401729m947870l823369k572012j540663j560645
18804G5650240l258469m801805m915781l886031k545858j316244l74084o19368
18796E3932600k554092m061545l736251k538263j629340j309291j384832k236495
18788C4482491l488409m082862l633192k711457j914258j412261j160426r62905
18780A5116721p35043o28006o07589n22013m57956m46727m14891m70661m84679
18771A0349156m07864m10686l52702l41816m48019m80654l90041l79939m09988
18762F727447l31053k86267k38004k00807k19037k40319k15613j70888k11318
18753D614141j61124j82043j64165r7660j24849j42170j68267j45818j19595q8760
$$ plain form
18812 104122037 100373731 95496528 90094799 85146929 81323560 78751548 77210885 75650240
18804 75650240 72391771 67589966 62674185 58788154 56242296 54926052 54551968 53932600
18796 53932600 51378508 47316963 43580712 41042449 39413109 38103818 36718986 34482491
18788 34482491 30994082 26911220 23278028 20566571 18652313 17240052 16079626 15116721
18780 15116721 14381678 13753672 13146083 12624070 12166114 11719387 11304496 10833835 10349156
18771 10349156 9941292 9530606 9177904 8836088 8388069 7907415 7517374 7137435 6727447
18762 6727447 6396394 6110127 5872123 5671316 5452279 5211960 4996347 4825459 4614141
18753 4614141 4453017 4270974 4106809 4009149 3884300 3742130 3573863 3428045 3308450 3219690
18743C219690p1878r8482j10806j29370j26324q8151p3563j00769n8585o4659
18733B297103q1332j5446M7678K669p041L837k5931j5957j7362K9139m4759p6460
18721B096138n0822m2893r0593j34441j58234j45663r2642o7433j25068j25898
18711A062451o8952m8850m6493l898j4938m851Q1995L9367l1888K3986k012l4573
18699I51344m838o2523l9715j2154O242n3310k515J7105l0707J670j4320p08M1937
18686G97508m3555k6154k6968N163M0102O582O2268R7481K2210J0104L7001O2814
18674A044556J2819M560K8699L867M9150P6905Q604o3503M063O4565Q2509J00301
18662A417095R4459M6061M3409R2771J30594J39399J11588J48922J73349J70245
$$ plain form
18743 3219690 3147812 3049330 2938524 2809154 2682830 2594679 2521116 2420347 2361762 2297103
18733 2297103 2215771 2200325 2248003 2250672 2243631 2247468 2221537 2205580 2188218 2217357 2172598 2096138
18721 2096138 2045316 2002423 1911830 1777389 1619155 1473492 1380850 1313417 1188349 1062451
18711 1062451 993499 944649 898156 894258 879320 874469 956464 995831 963943 987929 985917 951344
18699 951344 946506 883983 844268 832114 838356 785046 782531 799636 768929 770599 756279 755571 797508
18686 797508 753953 727799 700831 705994 746096 752678 814946 912427 934637 944741 981742 1044556
18674 1044556 1057375 1061935 1090634 1094501 1143651 1220556 1229160 1165657 1169720 1234285 1316794 1417095
18662 1417095 1511554 1557615 1601024 1693795 1824389 1963788 2075376 2224298 2397647 2567892
18652B567892J71816K28034K38181K33993K54292J79266K65002K24660K90765
18643D653901K24497J61610J57136J97065L16691L15034L38741L81002M31506
18634G177183O17482Q27567J119732J444055J872626K482263L283421M518371
18626B3342700O196721P859140Q867875Q674815P921268P249063O200986M267420
18618H0579988K140645L59503j733395m343642o454412p845690q777653q935353
18610D4989991q116242o547697m818001l395926k412675j777344j297590r80599
18602A5643917p25069n47232m60162l77773k20717j57618j30578o3652q4016k9410
18592A2847690L334J7182Q7754R0165J84319L05225M79999P43180J045373J515935
$$ plain form
18652 2567892 2739708 2967742 3205923 3439916 3694208 3873474 4138476 4363136 4653901
18643 4653901 4878398 5040008 5197144 5394209 5710900 6025934 6364675 6745677 7177183
18634 7177183 7794665 8622232 9741964 11186019 13058645 15540908 18824329 23342700
18626 23342700 29539421 37398561 46266436 54941251 62862519 70111582 76312568 80579988
18618 80579988 82720633 83080136 81346741 77003099 70548687 62702997 53925344 44989991
18610 44989991 36873749 30326052 25508051 22112125 19699450 17922106 16624516 15643917
18602 15643917 14918848 14371616 13911454 13533681 13312964 13155346 13024768 12961116 12877100 12847690
18592 12847690 12851024 12868206 12955960 13046125 13230444 13535669 14015668 14758848 15804221 17320156
18582A7320156K040840K834952L941763N403233P497152J0305688J2789252J3789810
18574G5922846J3080471J2063498J1051195Q860627N455751K437733l63522m051981
18566A24456618p999155j1021814j3027824j4290297j4249859j2425690r770748
18559D1671231p122530m991119l567757k714523k077121j677359j373199j156965
18551A6990658r34680p28406o36531n89189n18807m46344m22369l62902l56045
18542A1995385m12413l60697l11739k60570k29851j53569L2916J94456L98353
18533A0892271P10664J065312J592317K288010L278373M426198N191406N268454
18525C4713005M952612M638521M125087K911538J487706L70123q01784k389066
$$ plain form
18582 17320156 19360996 22195948 26137711 31540944 39038096 49343784 62133036 75922846
18574 75922846 89003317 101066815 112118010 120978637 126434388 128872121 128508599 124456618
18566 124456618 116457463 105435649 92407825 78117528 63867669 51441979 41671231
18559 41671231 34548701 29557582 25989825 23275302 21198181 19520822 18147623 16990658
18551 16990658 16055978 15327572 14691041 14101852 13583045 13136701 12714332 12351430 11995385
18542 11995385 11582972 11222275 10910536 10649966 10420115 10266546 10299462 10493918 10892271
18533 10892271 11602935 12668247 14260564 16548574 19826947 24253145 29444551 34713005
18525 34713005 39665617 44304138 48429225 51340763 52828469 53198592 52396808 50007742
18517E0007742l934305m882786n529607n906066n652003m635265l433653k523306
18509A3510751j775119j389788j036752q09218o35035n93277n51614m69273l31287
18500E919388l39349l28778k69110k17951k36149k34391k57906k23152k45551
18491C567051k32772k47916k16717k14816j88511j14216r6897j00884r2458p4132
18481A987732r0696p6075r6080j44039n9870j5071M0678o203p4508q0687p30m9540
18469A334911l0740l183N598j2009m819L4184n8526j3321K1147k4104J4852J3353
18457A277343o4732o7551l9485J4784K5499J2157m7077k3486j3055j4795m3461
18446A016141p5483k1887l1927r3039r3502l5729l3886o2097q3677q1252l7356
$$ plain form
18517 50007742 46073437 41190651 35661044 29754978 24102975 19467710 16034057 13510751
18509 13510751 11735632 10345844 9309092 8499874 7864839 7271562 6719948 6250675 5919388
18500 5919388 5580039 5251261 4982151 4764200 4528051 4293660 4035754 3812602 3567051
18491 3567051 3334279 3086363 2869646 2654830 2466319 2352103 2255206 2154322 2061864 1987732
18481 1987732 1897036 1820961 1724881 1580842 1520972 1505901 1546579 1540376 1465868 1385181 1384451 1334911
18469 1334911 1304171 1300988 1306586 1294577 1289758 1323942 1265416 1252095 1273242 1249138 1263990 1277343
18457 1277343 1212611 1145060 1105575 1120359 1145858 1158015 1110938 1087452 1074397 1059602 1016141
18446 1016141 940658 918771 886844 793805 700303 664574 630688 568591 484914 403662 366306
18435C66306p941j030k1228k6521K2180o3385m7326k3932m3672j06378m4758j5971
18423a3656j4812q317J5193k1524m9204j9641R845K9752k4538l4904k5068K1360
18411a35514k1680n9359p0780J0610l5763m2074L5537K563m2078m3780m7088j5146
18399d64552j666M0532n1701j0113k3123p80J224l1861K2128p533M1472Q020l461
18386d81414L7013j1039p7K2847R509l8677J4927N8425J7161k6137J177M794J3621
18373c77870J504l9216O0012J6943L5427O6258J4781l0819J0804j8321M6348p649
18361b21798J3611J6601M1316O0188J4916k9569K7541P5816K539o9246l6142k2738
18349a26965q475K3472J6065l5376n2047j0205j0819j2723l0185M3440P2808N252
$$ plain form
18435 366306 358365 357335 336107 309586 331766 268381 221055 197123 153451 47073 2315 -13656
18423 -13656 -28468 -36785 -21592 -43116 -92320 -111961 -102116 -72364 -96902 -131806 -156874 -135514
18411 -135514 -157194 -216553 -287333 -276723 -312486 -354560 -319023 -316460 -358538 -402318 -449406 -464552
18399 -464552 -466218 -425686 -477387 -487500 -510623 -511403 -510179 -542040 -519912 -527445 -485973 -477953 -481414
18386 -481414 -444401 -455440 -455517 -432670 -423161 -461838 -446911 -388486 -371325 -397462 -396285 -391491 -377870
18373 -377870 -376366 -415582 -355570 -338627 -303200 -236942 -222161 -252980 -242176 -260497 -214149 -221798
18361 -221798 -208187 -191586 -150270 -90082 -75166 -104735 -77194 -1378 1161 -68085 -104227 -126965
18349 -126965 -135440 -111968 -95903 -131279 -183326 -193531 -204350 -217073 -247258 -203818 -131010 -125758
18337a25758J107M591J5623l528m1910n7823j2452k6191j7506l6735k0693J4781
18325c06494M5607O0685j5135n7498m8960k2135J351m7169k9750N6857L1451O9430
18313b61760k4711n6170K2212Q2274N176j5628M6812K7441L531R579j2424o6965
18301b40633k3187J5391L9663J4340k2372k814n1003q711L083l6764p8197J4968
18289c76236P3007L2898m867K468k4250k3198J2163K4205k6864m9434J128J6464
18277c42516j4393K2539K0068j1277k9418k5620j1282M5802o5669J8488L6027
18266c57251J6101r66O200l2171m4462m9522k2548j7951n1618k4311P999q3007
18254f53507L8563M7753K0313J6408O1706m1365o5254l2910K5231R0180m9513
$$ plain form
18337 -125758 -124651 -120060 -104437 -107965 -149875 -207698 -220150 -246341 -263847 -300582 -321275 -306494
18325 -306494 -260887 -200202 -215337 -272835 -321795 -343930 -342579 -389748 -419498 -362641 -331190 -261760
18313 -261760 -286471 -342641 -320429 -238155 -232979 -248607 -201795 -174354 -170823 -161244 -173668 -240633
18301 -240633 -263820 -248429 -208766 -194426 -216798 -219612 -270615 -279326 -276243 -313007 -391204 -376236
18289 -376236 -303229 -270331 -275198 -272730 -296980 -320178 -308015 -283810 -310674 -360108 -358980 -342516
18277 -342516 -356909 -334370 -314302 -325579 -354997 -380617 -391899 -346097 -411766 -393278 -357251
18266 -357251 -341150 -342116 -335916 -368087 -412549 -462071 -484619 -502570 -554188 -578499 -570500 -653507
18254 -653507 -614944 -567191 -546878 -530470 -468764 -510129 -575383 -608293 -583062 -492882 -542395
18243e42395j7299j1074J6462Q7583R8044o6479l6758j5673L3348J06938K4736
18232c22567k1582o189K6109K4101j7047n9804l9809J4618P5289L1926l5093n8020
18220c88068k046N5991O9252Q0886K2382K5130O1223M0746O3458L5003N251k494
18208F6714J6753O5606M7055K8605j1455M3171O1135J2503n585n0894m2842n2439
18196A78327L5983J8088O3401k1818q4194m4850m5272k7939L2694n1796j1740
18185D0884k8382n9388k6066m9906n9496l8235J2506J9738j5806l1180j9562o3507
18173c18400J184L4421L6487J7298j3710n056k5152K5746J4602N1467j9818l5720
18161b36651J5725P2654K8476J9016m9577m2409J6776P4549L5325J8731j5711
$$ plain form
18243 -542395 -559694 -570768 -554306 -466723 -368679 -435158 -471916 -487589 -454241 -347303 -322567
18232 -322567 -344149 -350338 -324229 -300128 -317175 -376979 -416788 -402170 -326881 -294955 -330048 -388068
18220 -388068 -390114 -334123 -264871 -183985 -161603 -136473 -75250 -34504 28954 63957 69208 66714
18208 66714 83467 149073 196128 224733 213278 256449 317584 330087 324502 273608 230766 178327
18196 178327 214310 232398 295799 273981 189787 144937 99665 71726 104420 52624 40884
18185 40884 12502 -46886 -72952 -122858 -182354 -220589 -208083 -188345 -204151 -235331 -254893 -318400
18173 -318400 -317216 -282795 -246308 -229010 -242720 -247776 -272928 -247182 -232580 -181113 -200931 -236651
18161 -236651 -220926 -148272 -119796 -100780 -150357 -192766 -175990 -101441 -66116 -47385 -63096
18150f3096n642M349N0033N6272N6092M8319O4314L2398L5473M6592N5624P5937
18138D56665O7181M7919M2534K5443m0160m529m931j3205p5526k5951L970p8243
18126D01167r3624j18556p8255K4631n701o8084k7532l1539J607l2981n8668K7218
18114f0317J1806M6502J9317j1352M7943J3244o5210q2353M5368J04245K477k1088
18102E0582J03792J20670J33030J05675R0791J35554J50790J09350R2151J48519
18092A240904J46174J36866J11847L0220o3097o5069n112L4820J05971R6186Q255
18081A777965r9587j79295j44647p5728j0717j07722j57190j80447r1502j27450
18071F03680j41055j09034l7980p7629l3546J1915L8536K2079R1664N7737O8898
$$ plain form
18150 -63096 -68738 -64389 -14356 41916 98008 146327 210641 243039 278512 325104 380728 456665
18138 456665 523846 571765 614299 639742 599582 595053 590122 576917 501391 475440 479410 401167
18126 401167 307543 188987 110732 135363 129662 61578 34046 2507 4114 -28867 -87535 -60317
18114 -60317 -48511 -2009 17308 5956 53899 67143 1933 -80420 -35052 69193 71670 50582
18102 50582 154374 275044 408074 513749 604540 740094 890884 1000234 1092385 1240904
18092 1240904 1387078 1523944 1635791 1666011 1602914 1537845 1532733 1567553 1673524 1769710 1777965
18081 1777965 1678378 1499083 1354436 1278708 1267991 1160269 1003079 822632 731130 603680
18071 603680 462625 353591 315611 237982 204436 216351 254887 276966 368630 426367 495265
18060D95265J35111O5243R1964O8546K5568L1412Q8563M9044l4089l8628J6243
18049I94242J37310K47401K40755J79628J48822Q8326P1206J91492J97897J14523
18039B611602J1383j05680k17900k48752j97458j31165j82911k35807k21654j87676
18029H93982j64620q2833n4583l3038n7148p3881r0405q3457n8855k7197k8143
18018A39822L3940l8645J6080J7300j0697R845l3956n8653N2749l663r940n107
18006A09075J2229M8804P1259M5219Q3214N5800J1295J37996N5145K7754Q6051
17995G43841M0337J07904J52647J01879J22409J69736J19950J88017K29417J65374
17985B141511J54215J78866K22977J59836J22801J32784Q4629O8622j21282q7416
$$ plain form
18060 495265 630376 695619 787583 856129 881697 913109 1001672 1050716 1016627 977999 994242
18049 994242 1131552 1378953 1619708 1799336 1948158 2036484 2107690 2299182 2497079 2611602
18039 2611602 2622985 2517305 2299405 2050653 1853195 1722030 1539119 1303312 1081658 893982
18029 893982 729362 646529 591946 558908 501760 427879 337474 254017 195162 167965 139822
18018 139822 173762 135117 151197 168497 157800 167645 133689 75036 127785 124122 114182 109075
18006 109075 121304 170108 241367 286586 369800 425600 436895 574891 630036 657790 743841
17995 743841 784178 892082 1044729 1146608 1269017 1438753 1558703 1746720 1976137 2141511
17985 2141511 2295726 2474592 2697569 2857405 2980206 3112990 3197619 3266241 3144959 3057543
17975C057543j58602k07480k27185j92835k05481k70246k12905j61746j37805
17966A283258k6817M5680Q5448R1985P6946m801M345R842o3167j01838m1955l9402
17954A319524q8972l7990j4530k3185m6193q2363m7904M422O2080J14680N6021
17943A215590K7914R4410L9888M5574N877K8241K2746J5065N6690j4906n1415
17932A485674j8685n0402o902J799j05992j09066n0434r2715l5413k2133n7445
17921I38286j17304n9960j5471j4928l4402L719J1968R4808O5301J9751K6680
17910I18448j9554k4418q3781m6724j0625m9591r1128j30004o6778p1853j20558
17899B03434j42280o0784n7391l2702L1790N3494P155k5837k184m531o269j4299
$$ plain form
17975 3057543 2898941 2691461 2464276 2271441 2065960 1795714 1582809 1421063 1283258
17966 1283258 1256441 1302121 1387569 1479554 1556500 1551699 1556044 1565886 1502719 1400881 1358926 1319524
17954 1319524 1230552 1192562 1178032 1154847 1108654 1026291 978387 982809 1044889 1159569 1215590
17943 1215590 1243504 1337914 1377802 1423376 1429253 1457494 1480240 1495305 1551995 1537089 1485674
17932 1485674 1466989 1416587 1409685 1411484 1305492 1196426 1145992 1053277 1017864 995731 938286
17921 938286 820982 761022 745551 730623 696221 699940 711908 806716 872017 891768 918448
17910 918448 898894 874476 790695 743971 733346 683755 592627 462623 395845 323992 203434
17899 203434 61154 370 -57021 -89723 -57933 -4439 2716 -23121 -25305 -29836 -36105 -50404
17887e0404o5099N942k8378k0658o171L1952q936m3953p974N4148m870L5765j2594
17874a21230k6767q678p519K6707J6656N0261L0350m996j3254j1419P849j2158
17862g4198m4784n9711j9808J2910l7444o931j4499l1291p4114l9923r148N0861
17850c48080P644o2786p2145n958N585L9297M1574m486p0055m7318N9129J19603
17838c37996K5237k0330n2159n3967k6252K9565j0562r543K8925M087k101L2641
17826c92455R725J1263m8733k185M6996O0563m5667o3580l5424J4780N4940p774
17814c97551l2707m9006R390K025O547L0083o100j4594K2256Q431L7174K788l4273
17801d15537j42m2190k2975j9739P760L9627n2269m0582L1486M984P9046O6504
$$ plain form
17887 -50404 -115503 -109561 -137939 -158597 -164768 -132816 -141752 -185705 -193679 -139531 -144401 -108636 -121230
17874 -121230 -147997 -156675 -164194 -137487 -120831 -70570 -40220 -45216 -58470 -69889 -62040 -74198
17862 -74198 -118982 -178693 -198501 -185591 -223035 -229966 -244465 -275756 -349870 -389793 -398941 -348080
17850 -348080 -340436 -403222 -475367 -481325 -475740 -436443 -394869 -399355 -469410 -516728 -457599 -337996
17838 -337996 -312759 -333089 -385248 -439215 -465467 -435902 -446464 -456007 -427082 -422995 -425096 -392455
17826 -392455 -382730 -371467 -420200 -422385 -375389 -314826 -360493 -424073 -459497 -444717 -389777 -397551
17814 -397551 -430258 -479264 -469874 -467849 -461302 -431219 -437319 -451913 -429657 -421226 -384052 -381264 -415537
17801 -415537 -415679 -457869 -480844 -500583 -492823 -453196 -505465 -546047 -514561 -509577 -430531 -364027
17789c64027M8186P030J2011l1622k079O2597K4461n3445l1094k3472j9704m6259
17777d17417m7825P7872L0291J2693J268m2255j5604n634j4666P7510n3232k1007
17765d18006M8630J3879k654r765K788k57l1476k0308l4113J4700M5405M925J087
17752c85165j6551k0834k444j9014K9644m6650j6533L2550j9430M8438R2026R089
17740c14874l8025l7635M976j0504P740J047J4283k0989m4661K3711j089k6992
17728d43012K9611K6822j206k9824J1566m000j8321n175L9370j493m259J4996
17716c84925J3007n0556k9560j1379j8221K3680n2900K3480m904J5726M5140M976
17704d26436j2108M473M5300o43l6842n2734J5902N9473O5828J1310q253k9027
$$ plain form
17789 -364027 -315841 -308811 -296800 -328422 -330501 -267904 -243443 -296888 -327982 -351454 -371158 -417417
17777 -417417 -465242 -387370 -357079 -344386 -343118 -385373 -400977 -406611 -421277 -343767 -396999 -418006
17765 -418006 -369376 -355497 -358151 -367916 -365128 -365385 -396861 -417169 -451282 -436582 -391177 -386252 -385165
17752 -385165 -401716 -422550 -424994 -444008 -414364 -461014 -477547 -444997 -464427 -415989 -323963 -314874
17740 -314874 -352899 -390534 -385558 -396062 -388322 -387275 -372992 -393981 -438642 -414931 -416020 -443012
17728 -443012 -413401 -386579 -387785 -417609 -406043 -410043 -428364 -433539 -394169 -395662 -399921 -384925
17716 -384925 -371918 -422474 -452034 -463413 -481634 -457954 -510854 -487374 -492278 -476552 -431412 -426436
17704 -426436 -438544 -434071 -388771 -389414 -426256 -478990 -463088 -403615 -337787 -326477 -334730 -363757
17692c63757o9612J291l822n0506j764K6761J7456L786k5680L1097N742N8321
17680c70687O244m1933l3963L6645K7646O6918k5439n6393k5229L7156Q923l7944
17668d08056j7984k9388k7492j8417j5764M2930N8318r255K9061J2761m3671K4280
17656d02677Q280k6776P809K8776P7048M9111q6943p4380M1589N273j04316l8140
17644e15346L7276K8142o3415k835M5478Q4680J8037k3994J404k2795k3019M1975
17632c94412N5387r319k4124n5481L4845M9298l5844m8561J8973k4066p5195m1754
17620e50253Q0668K6701k4488K8294L8554O609l0023P990j1160l9800m6899M3925
17608d69882L6202l9690M8468J5838k2008O2194K3762J6987k6211l9545m9701
$$ plain form
17692 -363757 -433369 -432078 -435900 -486406 -488170 -461409 -443953 -440167 -465847 -434750 -429008 -370687
17680 -370687 -364443 -406376 -440339 -403694 -376048 -309130 -334569 -390962 -416191 -379035 -370112 -408056
17668 -408056 -426040 -455428 -482920 -501337 -517101 -474171 -415853 -425108 -396047 -383286 -426957 -402677
17656 -402677 -394397 -421173 -413364 -384588 -307540 -258429 -345372 -419752 -378163 -372890 -477206 -515346
17644 -515346 -478070 -449928 -513343 -516178 -470700 -386020 -367983 -391977 -390573 -413368 -436387 -394412
17632 -394412 -339025 -348344 -372468 -427949 -393104 -343806 -379650 -428211 -409238 -433304 -508499 -550253
17620 -550253 -469585 -442884 -467372 -439078 -400524 -393915 -423938 -415948 -427108 -466908 -513807 -469882
17608 -469882 -433680 -473370 -424902 -409064 -431072 -368878 -345116 -328129 -354340 -393885 -443586
17597d43586M0563M5480K0541n592P7739j233n0621q1898l9563r657J2287N4044
17585c81496J4409k2774j7782m5528M419M0490L479k7974k4273N1683M3089K5073
17573c37185K065k6156l0558l5770J6785N150l3249k0529L0255M637l2101n637
17561d62293O9082O3115l8270j4916l378o963l4356M3448K2407J0819L4815q574
17549c25064o1298K3713K5215l2320k3901J8422j6111l8354J080j0232l7753n8372
17537e34975O1701J6422K1138Q8771J3748m6413m1544K6716j1825k4486l0148
17526d60895j4369L3801R4213q348O7792P353p6465m7682M4109K4973j8545k0766
17514c74829o115L9752j8629O2743J2439l0924k1897l9849j6924L2179J9758j2528
$$ plain form
17597 -443586 -403023 -357543 -337002 -342594 -264855 -266088 -316709 -398607 -438170 -447827 -435540 -381496
17585 -381496 -367087 -389861 -407643 -453171 -448752 -408262 -404783 -432757 -457030 -405347 -362258 -337185
17573 -337185 -335120 -361276 -391834 -427604 -410819 -405669 -438918 -459447 -429192 -424555 -456656 -462293
17561 -462293 -393211 -330096 -368366 -383282 -386660 -393623 -427979 -384531 -362124 -351305 -316490 -325064
17549 -325064 -386362 -362649 -337434 -369754 -393655 -375233 -391344 -429698 -428618 -438850 -476603 -534975
17537 -534975 -473274 -456852 -435714 -346943 -333195 -379608 -421152 -394436 -406261 -430747 -460895
17526 -460895 -475264 -441463 -347250 -355598 -287806 -280453 -356918 -404600 -360491 -335518 -354063 -374829
17514 -374829 -380944 -341192 -359821 -297078 -284639 -315563 -337460 -377309 -394233 -362054 -342296 -354824
17502c54824J355m2405j5201q619n7664l1194L2082J5148N271O6833J374j6472
17490d04316J520l7775o741J631j2896L5091L0820O78M7944K5608k0942m939j7899
17477c62216m0450j0614P3410M5752k2176m0260O391o2788J762P2068k8496n1317
17465d18934J6432n6559J6122R606k6279l0718O9798J7747K8637M0290m4194J545
17453c76507n5227j811N4086K6242J2093N7918j1893n495K6449o0998o0018L6490
17441c58671J8705Q26L699j9845k2537K6827j1634K5146M6194K7919j04830j5970
17429c84171P1267m8924n1129J2525L5797N373o22k7528J1510j3305N025L1535
17417c52647J09727n9878n1765m6465M1780N3531L36r805L924k635k6602o6531
$$ plain form
17502 -354824 -353469 -395874 -411075 -419694 -477358 -508552 -476470 -461322 -456051 -389218 -387844 -404316
17490 -404316 -402796 -440571 -447312 -445681 -458577 -423486 -392666 -391988 -344044 -318436 -339378 -344317 -362216
17477 -362216 -402666 -413280 -339870 -294118 -316294 -356554 -350163 -412951 -411189 -339121 -367617 -418934
17465 -418934 -402502 -459061 -442939 -433333 -459612 -490330 -420532 -402785 -374148 -333858 -378052 -376507
17453 -376507 -431734 -433545 -379459 -353217 -341124 -283206 -295099 -300594 -274145 -335143 -395161 -358671
17441 -358671 -339966 -339140 -335441 -355286 -377823 -350996 -362630 -337484 -291290 -263371 -368201 -384171
17429 -384171 -312904 -361828 -412957 -400432 -364635 -359262 -359884 -387412 -375902 -389207 -384182 -352647
17417 -352647 -242920 -302798 -354563 -401028 -359248 -305717 -305381 -315186 -311262 -313897 -340499 -407030
17405d07030k5661K7643l2140J0648J8573L232Q6353K8988l7376n5624P588J9130
17393c55676J8926L7289k768l9464j5806J5796J3626k5115J3260N0426q833l4952
17381c33291L8501M070j2826J233J9727p678k4287R892j2278J4378J721m3678
17369c44516k2270L8501K9823n8739k0351q593j5005n2779Q3387L4101l3044L4383
17357c35102R088k2301k1469j3871L4355P0326P138r2556K7830P283m9008l277
17345c81564J3718M3565J3594m2748l3534k1730m102k0564J7928n5090k6718N3656
17333d43589P4307M4582N378l7324L9991J6687j9449J083J180L8256J7132m2777
17321c04543k7965L7860M3749P530J0539k623l7055M8305k1729m9734j7599q463
$$ plain form
17405 -407030 -432691 -405048 -437188 -426540 -407967 -404735 -318382 -289394 -326770 -382394 -374806 -355676
17393 -355676 -336750 -299461 -302229 -341693 -357499 -341703 -328077 -353192 -339932 -289506 -298339 -333291
17381 -333291 -294790 -290720 -303546 -302313 -282586 -290264 -314551 -304659 -316937 -302559 -300838 -344516
17369 -344516 -366786 -328285 -298462 -357201 -377552 -386145 -401150 -453929 -370542 -336441 -369485 -335102
17357 -335102 -326014 -348315 -369784 -383655 -349300 -278974 -271836 -364392 -336562 -329279 -378287 -381564
17345 -381564 -367846 -324281 -310687 -353435 -386969 -408699 -412801 -433365 -415437 -470527 -497245 -443589
17333 -443589 -369282 -324700 -319322 -356646 -316655 -299968 -319417 -318334 -317154 -278898 -261766 -304543
17321 -304543 -332508 -294648 -250899 -243369 -232830 -235453 -272508 -224203 -245932 -295666 -313265 -321728
17309c21728n799J4056L4048n2113m0658j990N3702K2396M5989n2104R428M3309
17297b51464k5787K4702l5932k8077J248m6605L9760J571l7263p845J2374K7716
17285c25602K6496j2965j0592J1963Q484l2311P246K0328J8889L1939m4539n6065
17273c56729J379M9529K8600L800J8408l242j7170j5208l8418L0685K8748l6198
17261c05816o1390l8130l704O8575K1951j1602K6N9645l5115j2608p868N9631
17249b66405J5310l9668l0059O941J9766N5339q413L1338k3154j1813n9484L0863
17237b79439L5933M9030L5146m7621k0809j5925N35l7383K0283n864l8689n1741
17225c56544L1429L6133R723J2050k1810J7399j1692k2462o6508m6500M6703O4259
$$ plain form
17309 -321728 -327527 -313471 -279423 -331536 -372194 -374184 -320482 -298086 -252097 -304201 -294773 -251464
17297 -251464 -277251 -252549 -288481 -316558 -315310 -361915 -322155 -320584 -357847 -365692 -353318 -325602
17285 -325602 -299106 -312071 -322663 -310700 -302216 -334527 -327281 -306953 -288064 -256125 -300664 -356729
17273 -356729 -355350 -305821 -277221 -273421 -255013 -258255 -275425 -290633 -329051 -298366 -269618 -305816
17261 -305816 -367206 -405336 -409040 -340465 -318514 -330116 -330090 -270445 -305560 -318168 -326036 -266405
17249 -266405 -251095 -290763 -320822 -313881 -294115 -238776 -247189 -215851 -239005 -250818 -310302 -279439
17237 -279439 -243506 -194476 -159330 -206951 -227760 -243685 -243150 -280533 -260250 -266114 -304803 -356544
17225 -356544 -325115 -288982 -279259 -267209 -289019 -271620 -283312 -305774 -372282 -418782 -372079 -307820
17213c07820J4100j8314m4881J3273R095K7568L6424m4884M8138P8934j367r3264
17201b82998p0873j6406M4215J4151O748m075m5850j6318r726K2552K3699Q891
17189c25990o054k255J2970M0859j5451l5599j6611k1203l0154J8962N4492O0025
17177b66009J4026o1740m3076N1244k215K078l9390r421K3693M3617k8502p8195
17165c93890k1868N2834k799L3397O5731k1728L305j0362m3475n2093K6563J4772
17153c49613L1807k9297m2050N6813K7699k6835K4348m7348k0603l8152J9092
17142c94139j0906l7520O6943J2737L2577M8201K3364L5402J4190l1907n3402
17131b94460k3452J7838j6704n2901j0483j8207p950L3695P3327K2524l2437l433
$$ plain form
17213 -307820 -293720 -312034 -356915 -343642 -334547 -306979 -270555 -315439 -267301 -188367 -189734 -282998
17201 -282998 -353871 -370277 -326062 -311911 -305163 -309238 -355088 -371406 -381132 -358580 -334881 -325990
17189 -325990 -332044 -334299 -321329 -280470 -295921 -331520 -348131 -369334 -399488 -380526 -326034 -266009
17177 -266009 -251983 -313723 -356799 -305555 -307770 -305692 -345082 -354503 -330810 -287193 -315695 -393890
17165 -393890 -415758 -362924 -365723 -332326 -266595 -288323 -285018 -295380 -338855 -390948 -364385 -349613
17153 -349613 -317806 -347103 -389153 -332340 -304641 -331476 -307128 -354476 -375079 -413231 -394139
17142 -394139 -405045 -442565 -375622 -362885 -330308 -282107 -258743 -223341 -209151 -241058 -294460
17131 -294460 -317912 -300074 -316778 -369679 -380162 -398369 -406319 -372624 -299297 -276773 -309210 -312643
17119c12643j9930j9847L465l9916k739P1179L7472k4901l639M2347K042K996
17107b64114n4981k7226J7554m6919m2476K8538P883j5480J3578J1137k2651K3414
17095c71743O5227M2617J530j9216n792L9214r651K156o962k9968R877q818k3154
17082c14683j3999m5892p9686K7631P1664J1811o669J322L2054K5742m0386K5020
17070c06071M1895k8920p9722j5185J0530P7190L1351M6721j6359n0520m6734
17059c35824o522N624L672J3775L6232m074J6834k3228k3885o0053l1520K9904
17047c79065j3817Q515Q3679R5688l0013p5455j10956L9715J00664P2573o993
17036b15465l4633k8252l3324J809K4576Q852j8005m4951K4426O574L478j0607
$$ plain form
17119 -312643 -332573 -352420 -348955 -388871 -391610 -320431 -282959 -307860 -311499 -269152 -267110 -264114
17107 -264114 -319095 -346321 -328767 -375686 -418162 -389624 -381741 -397221 -383643 -372506 -395157 -371743
17095 -371743 -306516 -263899 -262369 -281585 -287377 -248163 -257814 -255658 -262620 -292588 -282711 -291529 -314683
17082 -314683 -328682 -374574 -454260 -426629 -354965 -343154 -349823 -348501 -316447 -290705 -331091 -306071
17070 -306071 -264176 -293096 -372818 -388003 -377473 -300283 -268932 -222211 -238570 -289090 -335824
17059 -335824 -342346 -336722 -333050 -319275 -283043 -287117 -270283 -293511 -317396 -377449 -408969 -379065
17047 -379065 -392882 -384367 -300688 -205000 -235013 -310468 -421424 -381709 -281045 -208472 -215465
17036 -215465 -250098 -278350 -311674 -309865 -285289 -276437 -294442 -339393 -314967 -308393 -304915 -315522
17024c15522j2448j4597J1025k5813K3442J0840K987j4552J3367k9099j3126J4914
17012c48582m513k5553j1197l7185j5297K7718P1838N2822M9397K8940o1265l9569
17000c12446R389m8398O2856L9435j384M0835k7434k7559k5629l2515k6034q618
16988c57502J9992J3973l162M6676P377l0724m3313J5602J9671J3328K4491K9862
16976b43729L634J7523j8023j872K1895P339l4303n7676k240M0599L5720J8403
16964b12730p5557j7629L1359N2839L3275n3888m7456m3175p6114r557M2282J4143
16952c62208j6474J5057N2599J4322l2343L143r511J3300L122o108K58M0458O9562
16939b14823l5130n4527J9193J1354l1711K545J2308K3739l3128m4851K2030k5489
$$ plain form
17024 -315522 -327970 -342567 -331542 -357355 -333913 -323073 -320086 -334638 -321271 -350370 -363496 -348582
17012 -348582 -353095 -378648 -389845 -427030 -442327 -414609 -342771 -289949 -240552 -211612 -272877 -312446
17000 -312446 -303057 -351455 -288599 -249164 -250548 -209713 -237147 -264706 -290335 -322850 -348884 -357502
16988 -357502 -337510 -323537 -326699 -280023 -272646 -303370 -346683 -331081 -311410 -298082 -273591 -243729
16976 -243729 -240095 -222572 -240595 -242467 -220572 -213233 -247536 -305212 -307452 -266853 -231133 -212730
16964 -212730 -288287 -305916 -274557 -221718 -188443 -242331 -289787 -332962 -409076 -418633 -376351 -362208
16952 -362208 -378682 -363625 -311026 -296704 -329047 -325904 -335415 -322115 -318993 -325101 -324843 -284385 -214823
16939 -214823 -249953 -304480 -285287 -273933 -305644 -303099 -290791 -267052 -300180 -345031 -323001 -348490
16927c48490k879J6106O1653L6470l0919k4068L4692n8593q9283J8497M7572O1645
16915b77597j4990o8275J9462P4931J9509R579n3090k7609J5750j6022K45J2629
16903c05478J1441l3919j9576K3299J139L0419J3398J5962L2674j5179m4105n6393
16891c46318K2927M1760L3870L15M8698l8318j7469N526j4500l2856l5070l7775
16879c69210M0128N5457O604K3970q490j209J6621l2149j8898n7254j5319N9090
16867c00659j3666j3209L846J1815l940k5936j9465j645M7833K3380l622J3425
16855b81843J8967N3456P795l4348k562k8890n7438j3131k1673j3871j840L1530
16843c43848L769K381J3408j7731l401N3170p65j7312J1346n211m916K3735K8144
$$ plain form
16927 -348490 -351369 -335263 -273610 -237140 -268059 -292127 -257435 -316028 -405311 -386814 -339242 -277597
16915 -277597 -292587 -360862 -341400 -266469 -246960 -237381 -290471 -318080 -302330 -318352 -318107 -305478
16903 -305478 -294037 -327956 -347532 -324233 -323094 -292675 -279277 -263315 -230641 -245820 -289925 -346318
16891 -346318 -323391 -281631 -247761 -247446 -198748 -237066 -254535 -249009 -263509 -296365 -331435 -369210
16879 -369210 -329082 -273625 -267021 -243051 -251541 -252750 -236129 -268278 -287176 -344430 -359749 -300659
16867 -300659 -314325 -327534 -323688 -311873 -315813 -341749 -361214 -362859 -315026 -291646 -295268 -281843
16855 -281843 -262876 -209420 -201625 -235973 -238535 -267425 -324863 -337994 -359667 -373538 -375378 -343848
16843 -343848 -340079 -337698 -324290 -342021 -345422 -292252 -293017 -310329 -298983 -304194 -309110 -285375 -257231
16830b57231J8183N2375m8785p8176m908P0377J4356k7708j2149m5861j1245J1487
16818c19285n736j0580l8940O0227J9789j3647L2197L6615K59o7799l2500J280
16806c38120R925J542l0178P560O9991J1169j3752n2240k5479M1685r584m5087
16794c72568P013N2639L4636q641n0923K9277K2325q723j4402k7408M9958L3012
16782b53805L7939L2368n4678l7619r448K529p0004N1218L9832q3558k8420L5569
16770c38077K569J9808j1943J0512N254K4494j3074j3517j197K1891N8187J1309
16758b23784j6552l0532Q2951j5632o9403l2965k5397m6759M1210r215j3716l986
16746c63780m074M8536l086N441L6893k6346p0452J9508M5597M2335O177n8140
$$ plain form
16830 -257231 -239048 -186673 -235458 -313634 -318542 -248165 -233809 -261517 -273666 -319527 -330772 -319285
16818 -319285 -325021 -335601 -374541 -314314 -294525 -308172 -275975 -239360 -239101 -306900 -339400 -338120
16806 -338120 -328195 -326653 -356831 -349271 -279280 -268111 -281863 -334103 -359582 -317897 -327481 -372568
16794 -372568 -365555 -312916 -278280 -286921 -337844 -308567 -286242 -294965 -309367 -336775 -286817 -253805
16782 -253805 -215866 -183498 -238176 -275795 -285243 -282714 -352718 -301500 -261668 -345226 -373646 -338077
16770 -338077 -335508 -315700 -327643 -317131 -311877 -287383 -300457 -313974 -315171 -293280 -235093 -223784
16758 -223784 -240336 -270868 -187917 -203549 -272952 -305917 -331314 -378073 -336863 -346078 -359794 -363780
16746 -363780 -367854 -319318 -322404 -316963 -280070 -306416 -376868 -357360 -311763 -269428 -263251 -321391
16734c21391r31L9128j0980q2046J1191j8921O4582L0082j8874O3804J3121l4373
16722b65608j4806n1815j8867m6183O2221k912p8181j0342K920l345k0499J1701
16710d35716j4794L6459N6026K3619K0526O2683L4438k1034j1499k4954l9147
16699c13393m1011n086J6219K0197P1883J4396m9546J4532m853l9558J434L306
16687c11480j9665J7328N6112q40j4917k3356n4786q938P2454j888M394P893l9337
16674c17026n288k0384j1048M5009L752o871K2579p253Q728j5580k3678L4571
16662b92489p0646k6592L4419k8870K9357N1636j5912l3935J6228K3745N1841
16651b61218m2084J8004M5664l1664n6411m9581K1848N8354Q5084R94p6963j4208
$$ plain form
16734 -321391 -322322 -283194 -294174 -376220 -365029 -383950 -319368 -289286 -308160 -244356 -231235 -265608
16722 -265608 -280414 -332229 -351096 -397279 -335058 -337970 -416151 -426493 -423573 -426918 -447417 -435716
16710 -435716 -450510 -414051 -358025 -334406 -313880 -251197 -216759 -237793 -249292 -274246 -313393
16699 -313393 -354404 -359490 -343271 -323074 -251191 -236795 -286341 -271809 -276662 -316220 -314786 -311480
16687 -311480 -331145 -313817 -257705 -258545 -273462 -296818 -351604 -360542 -288088 -289976 -285582 -277689 -317026
16674 -317026 -322314 -342698 -353746 -308737 -304985 -311856 -289277 -296530 -287802 -303382 -327060 -292489
16662 -292489 -363135 -389727 -355308 -384178 -354821 -303185 -319097 -353032 -336804 -313059 -261218
16651 -261218 -303302 -285298 -239634 -271298 -327709 -377290 -355442 -297088 -212004 -211010 -287973 -302181
16639c02181n431M530K5624L588m932N503l637J6614M606l2248k1353K6873N9781
16626b22663k283n2578j05058r895O7000L0063k1632n9126O788O1109M6564m5339
16614c07050l2012m73K6805J4384P577O3126n3331m7167L5524Q798m054k6501
16602c14374l1419k4831J8991l131M2080N5637L4300K9857N56l4557k3162o7885
16590c17938n4229L472L2270L7270k4632K6388O0692j6681j3670L9004L5051n3003
16578b46006k8262K1391j2947k7702N08J4109K5107l4762n036O109R91J8635K1671
16565b46194k3829l0981j4432l4117m8191j5676O9210O4139K6450J4528o8146
16554c07239J1375j4103j7076L1584l3182l1645J127j8847N51L7748k6428Q64
$$ plain form
16639 -302181 -307612 -303082 -277458 -273870 -278802 -273299 -276936 -260322 -255716 -287964 -309317 -282444 -222663
16626 -222663 -224946 -277524 -382582 -392477 -325477 -295414 -317046 -376172 -369384 -308275 -261711 -307050
16614 -307050 -339062 -339535 -312730 -298346 -290769 -227643 -280974 -328141 -292617 -283819 -287873 -314374
16602 -314374 -345793 -370624 -351633 -354764 -312684 -257047 -222747 -192890 -192334 -226891 -250053 -317938
16590 -317938 -372167 -368695 -336425 -299155 -323787 -297399 -236707 -253388 -267058 -228054 -193003 -246006
16578 -246006 -274268 -252877 -265824 -293526 -293018 -278909 -253802 -288564 -293600 -287491 -286500 -267865 -246194
16565 -246194 -270023 -301004 -315436 -349553 -397744 -413420 -344210 -280071 -253621 -239093 -307239
16554 -307239 -295864 -309967 -327043 -295459 -328641 -360286 -359159 -378006 -377455 -339707 -366135 -365271
16542c65271K586L030N6097L7616K982m2615N07K1846l590K7475p439j1893m7332
16529c26001o5209J0481M2873O3505N6818N6970p124k3995k5286n2137j01092
16518c70197k1984J6787j799j0173N890L4667L4484J1600K4613l48k673L8398
16506b40735l0048m4178R701L5959J5114m293J5096k1941k827P5430M5421j9877
16494a67178n5209q9239J0488P427n544j2408L8428k1972k9685j078l157K4853
16482c04274O5916J3720J4071j7917k6367J3363l2969k560K2813q837n5741k0345
16470c39127r299M6835L6749k0904p802N0453J6653j8897k1199J3014j3153N2942
16458b13735j3171k9319k562J7293n041n705k5941n12M3605q505o2421k6674j668
$$ plain form
16542 -365271 -362685 -359655 -303558 -265942 -262960 -305575 -305068 -283222 -286812 -259337 -266776 -278669 -326001
16529 -326001 -391210 -380729 -337856 -274351 -217533 -160563 -167687 -191682 -216968 -269105 -370197
16518 -370197 -392181 -375394 -377193 -387366 -381476 -346809 -312325 -300725 -276112 -276460 -279133 -240735
16506 -240735 -270783 -314961 -305260 -269301 -254187 -258480 -243384 -265325 -268152 -192722 -147301 -167178
16494 -167178 -222387 -311626 -301138 -293711 -299255 -311663 -273235 -295207 -324892 -325970 -329127 -304274
16482 -304274 -238358 -224638 -210567 -228484 -254851 -241488 -274457 -277017 -254204 -263041 -318782 -339127
16470 -339127 -348426 -301591 -264842 -285746 -293548 -243095 -226442 -245339 -266538 -253524 -266677 -213735
16458 -213735 -226906 -256225 -258787 -241494 -246535 -252240 -278181 -278693 -235088 -243593 -306014 -332688 -334356
16445c34356J391K3677J1674n3341l0197J6708k6541J7408K8214L6585j3779N6049
16433b66508N4087j5132l171j5249r87J141J3820k0978J5138o665l0274m7063
16421c21841j4820K0251J5425K3236N4540R022j9005l188p512K2717j7096L184
16409b35087k5889j5208l1983k6193K4727M0433K0991J882L7878J4771j5879k1262
16397b30819N805j3715k8139N3003K1133k9113L5482k8550k4411p280J8871R609
16385b18124j5242j5035k093o4813o879j5930M5900M3283K9780O064J9860L5365
16373a57864K761n0169l0493J7383M4855j435n187q0956k1864P1068L1544p6221
16361b56578m6648p369q907K6063N9484l5651R184L3724n6479o8728l2624J2597
$$ plain form
16445 -334356 -332965 -309288 -297614 -350955 -381152 -364444 -390985 -373577 -345363 -308778 -322557 -266508
16433 -266508 -212421 -227553 -230724 -245973 -246960 -245819 -231999 -252977 -237839 -244504 -274778 -321841
16421 -321841 -336661 -316410 -300985 -277749 -223209 -214187 -233192 -236380 -243892 -221175 -238271 -235087
16409 -235087 -260976 -276184 -308167 -334360 -309633 -269200 -248209 -246327 -208449 -193678 -209557 -230819
16397 -230819 -225014 -238729 -266868 -213865 -192732 -221845 -186363 -214913 -239324 -246604 -227733 -218124
16385 -218124 -233366 -248401 -250494 -315307 -322186 -338116 -292216 -248933 -219153 -213089 -193229 -157864
16373 -157864 -155103 -205272 -235765 -218382 -173527 -174962 -180149 -261105 -282969 -211901 -180357 -256578
16361 -256578 -303226 -310595 -319502 -293439 -233955 -269606 -260422 -226698 -283177 -351905 -384529 -371932
16349c71932J6610K8163K9785j5943K4204M7446L6346P716l8677n6404N1291N9440
16337a81955m1037l580Q568k4556r547J2283l483J1116j3759m2354j4309R0O309
16324b96214J5885M2444K0111L7336l3101R726P915M7741K4130k6822k4276p1670
16312b46795j7658J4057O543m2170M5722M4589k0148p5594k6826M1207N4418l3297
16300b55952m9875j24J5096j8487j8134j2433N500r670K9778K5436k2949l1797
16288c43611P829O3848j9374m8207M2170N2729m7705k5616K6492M918J81m622
16276b90968J5398j9284P943l1974J699K1212L5436L1260o617m1740K6480K2668
16264b28487J6347J7068m4623o5106m379m6070J7139m537K5174P9662J5710J431
$$ plain form
16349 -371932 -355322 -327159 -297374 -313317 -289113 -241667 -205321 -197605 -236282 -292686 -241395 -181955
16337 -181955 -222992 -226572 -218004 -242560 -252107 -239824 -243307 -232191 -245950 -288304 -302613 -302523 -296214
16324 -296214 -280329 -237885 -217774 -180438 -213539 -203813 -195898 -148157 -124027 -150849 -175125 -246795
16312 -246795 -264453 -250396 -243853 -286023 -240301 -195712 -215860 -291454 -318280 -277073 -222655 -255952
16300 -255952 -305827 -305951 -290855 -309342 -327476 -339909 -334409 -344079 -314301 -288865 -311814 -343611
16288 -343611 -335782 -271934 -291308 -339515 -297345 -244616 -292321 -317937 -291445 -286527 -286346 -290968
16276 -290968 -275570 -294854 -286911 -318885 -317186 -295974 -260538 -229278 -235895 -277635 -251155 -228487
16264 -228487 -212140 -195072 -239695 -304801 -309180 -355250 -338111 -342648 -317474 -237812 -222102 -220671
16252b20671l7945P337K0539o981n241j5608K4457q33l2034m4396K8016J1608
16240b71752n1044K7395j800J9396K1259N48P278L988m4569l7904L0337R7238
16228a99630n592J6981P1112R318o3489l1562k3170p9327N1810N8784k8669m1359
16216b64793o764J819L4152Q087l1831k9463M2323j5522l4354l1513J0883j2831
16204c29807k3971N9134j4014J156M4805K5356l1538l6483K3548J8470K079k1313
16192b82578M7656J6406M3727l2897K4222k0971o0624k1772L7593J7370K3520
16181b08348k4375k1369m9118j1230L524l3092J5413L0329k0045l2148J2456L0232
16169c07771L6258O1446l0614k9453L4987O999J4653k5014o412L3016k0492J9619
$$ plain form
16252 -220671 -258616 -251279 -230740 -237721 -242962 -258570 -234113 -234946 -266980 -311376 -283360 -271752
16240 -271752 -322796 -295401 -297201 -277805 -256546 -255998 -248720 -244732 -289301 -327205 -296868 -199630
16228 -199630 -205222 -188241 -117129 -107811 -171300 -202862 -226032 -305359 -253549 -194765 -223434 -264793
16216 -264793 -271557 -269738 -235586 -227499 -259330 -288793 -246470 -261992 -296346 -327859 -316976 -329807
16204 -329807 -353778 -294644 -308658 -307502 -262697 -237341 -268879 -305362 -281814 -263344 -261265 -282578
16192 -282578 -234922 -218516 -174789 -207686 -183464 -204435 -265059 -286831 -249238 -231868 -208348
16181 -208348 -232723 -254092 -303210 -314440 -310916 -344008 -328595 -298266 -318311 -350459 -338003 -307771
16169 -307771 -271513 -210067 -240681 -270134 -235147 -228148 -213495 -238509 -244921 -211905 -232397 -212778
16157b12778J2204k0795n4453P125O424j5576O3641P835n6825m0845L4779O9668
16145a99596L6620m3215m2195R498K4784K2442l9202j6877Q6207J8401k410l4151
16133a79694m1850o231K0312k7967k6847K9141L2695j4724m489n666K6691L8232
16121a60397J0138N8390J4202p2260m9868l4513j2721K7334j921L552K625J3873
16109b01566P812J0872P019j8959K3696K6911o4393l0262J9521M1011J1916m2662
16097b09084K2353K7405k0458q48K6050J5730n1697n8120K8560K1187J4682j0401
16085a94641M1576J7145l0697q5344J9504K6590J0576M506l9319j5529k6503l0599
16073c02735L4524L9164K3808k8684J0202p680k3906j4145j4592O8475L2411R668
$$ plain form
16157 -212778 -200574 -221369 -275822 -268697 -262273 -277849 -214208 -206373 -263198 -304043 -269264 -199596
16145 -199596 -162976 -206191 -248386 -238888 -214104 -191662 -230864 -247741 -161534 -143133 -145543 -179694
16133 -179694 -221544 -227775 -207463 -235430 -262277 -233136 -200441 -215165 -219654 -225320 -198629 -160397
16121 -160397 -150259 -91869 -77667 -149927 -199795 -234308 -247029 -219695 -221616 -218064 -215439 -201566
16109 -201566 -193754 -182882 -175863 -194822 -171126 -144215 -208608 -238870 -219349 -178338 -166422 -209084
16097 -209084 -186731 -159326 -179784 -180632 -154582 -138852 -190549 -248669 -220109 -198922 -184240 -194641
16085 -194641 -153065 -135920 -166617 -251961 -232457 -205867 -195291 -190785 -230104 -245633 -272136 -302735
16073 -302735 -268211 -229047 -205239 -233923 -223721 -231401 -255307 -269452 -284044 -215569 -183158 -173490
16061a73490k8494l0752K1405M877j3483m0993M6738M2615l4745Q637J5568m2733
16049b24850l394O951m1815n6909k5035L2735Q9563p681l8617L0966k5429O6166
16037a97349J3667m4131P293M1931J2357k9315l878k6978j8023J2502j141L1348
16025b01717J6151J9952k0705k2705m849j5410k0427L421M1144J119r026k8990
16013b42042K657k6388l8264K6807j9227n939P8117P7385L0329n2184o7806Q018
16001b28537l8528J4152K2909N0609j9601l0778M1826M2073K7230k313j7238l1720
15989a69916n7983m0495J6017K1172r828k403M7351k6634n511R0908K2583L422
15977a11317K8838m6093n5245k5875N0286k2540r1807j6503R5911P815J4944J4640
$$ plain form
16061 -173490 -201984 -232736 -211331 -206454 -219937 -260930 -214192 -171577 -206322 -197685 -182117 -224850
16049 -224850 -228244 -221293 -263108 -320017 -345052 -312317 -222754 -230435 -269052 -238086 -263515 -197349
16037 -197349 -183682 -227813 -220520 -178589 -166232 -195547 -199425 -226403 -244426 -231924 -233065 -201717
16025 -201717 -185566 -165614 -186319 -209024 -213873 -229283 -249710 -246289 -205145 -204026 -213052 -242042
16013 -242042 -239385 -265773 -304037 -277230 -296457 -302396 -224279 -146894 -116565 -168749 -236555 -228537
16001 -228537 -267065 -252913 -230004 -179395 -198996 -229774 -187948 -145875 -118645 -120958 -138196 -169916
15989 -169916 -227899 -268394 -252377 -231205 -241033 -243436 -196085 -222719 -228230 -137322 -114739 -111317
15977 -111317 -82479 -128572 -183817 -209692 -159406 -181946 -273753 -290256 -194345 -186530 -171586 -156946
15965a56946n205K1663l5554K5148O3935K0166p693l6709n2155j1306L4039L5106
15953a05511l4141p182J2319J856L1315L9513K0137J6896L3251l2976n2709K3093
15941e4139J1449j472M0154J5396o2564j4472l0356k4315k7726k4412J2116N9079
15929a01262J0256o0962n609O1699K4489l8963L6308M1733K2065J0512M3570J2520
15917E6356j536r8j5080K1206J6231j455Q8759Q9466j6319k0063N0607M0949P2569
15904C81592L7240R3683R2802L0685J5344Q3198J35414N8424O9984J20653J10139
15893A229158P7033L1535M7701Q6277K0607K1225j4658l9636m8742j56046j14385
15882A140069r5239r5926n6787j40432j18423j4696m1527j01530k6090j5497m2752
$$ plain form
15965 -156946 -162151 -140488 -176042 -150894 -86959 -66793 -74486 -111195 -163350 -174656 -140617 -105511
15953 -105511 -139652 -146834 -134515 -132659 -101344 -61831 -41694 -24798 8453 -24523 -77232 -54139
15941 -54139 -42690 -44162 -4008 11388 -51176 -65648 -96004 -120319 -148045 -172457 -160341 -101262
15929 -101262 -91006 -151968 -157577 -95878 -71389 -110352 -74044 -32311 -10246 266 43836 56356
15917 56356 54820 54722 39642 60848 77079 75624 164383 253849 237530 217467 268074 309023 381592
15904 381592 418832 512515 605317 636002 651346 734544 869958 928382 998366 1119019 1229158
15893 1229158 1306191 1337726 1385427 1471704 1492311 1513536 1498878 1459242 1410500 1254454 1140069
15882 1140069 1044830 948904 892117 751685 633262 618566 577039 475509 449419 433922 391170
15871C91170m4898r551l4674k6889p994j5956J0673n9306l0800j6593n4253l7468
15859F3461J2696k3954k7247M9760L8997m6789q7828n613Q600P729k9837L0341
15847i684l8987L186N6044L1055o090l712j8869m029k4982n1182K9644M4832m890
15834B336o6339k9307k8891j0092K1185J2940J0495L5945j2042l8325r750O3892
15822d7953K8525n4895K8383J33k3699l9909r89M7296K8088k6869L2183K4083
15810e623P510j5513k5142q167N3651M10j9405J2875J1590o9376j5174K9908N4696
15797A2240N3186m8984l2379k0876M6287L1433N1537Q2857L6688J6068j2631l8603
15785A76823K4889k4751m736j0010m2268p219M9932M3315K305n2984k4694k4251
$$ plain form
15871 391170 346272 336721 302047 275158 267164 251208 261881 202575 171775 155182 100929 63461
15859 63461 76157 52203 24956 74716 113713 66924 -20904 -26517 -17917 -10188 -40025 -9684
15847 -9684 -48671 -45485 10559 41614 35524 31812 12943 8914 -16068 -67250 -37606 7226 2336
15834 2336 -64003 -93310 -122201 -132293 -111108 -98168 -87673 -51728 -63770 -102095 -111845 -47953
15822 -47953 -19428 -74323 -45940 -45807 -69506 -109415 -110404 -63108 -35020 -61889 -29706 -5623
15810 -5623 1887 -13626 -38768 -46935 6716 7126 -12279 596 12186 -57190 -72364 -42456 12240
15797 12240 65426 16442 -15937 -36813 9474 40907 92444 175301 211989 228057 215426 176823
15785 176823 201712 176961 172225 162215 119947 112728 162660 205975 208280 155296 130602 106351
15773A06351q6240l6676N3193J5549R761O845k280N9378j7474m0105P9l8465o6976
15760c7060L7971R5620j1487q4053m6446R109k6365M331M7313l583m385k6414
15748d5449j6257J0929l8697n678J5692M610M0927m253N287n708J259Q349j0559
15735c9548j6741r759N544J8684K8982K825L4393J6789l8604n78K4644m173k3603
15722a145L3507l3569k2114K3550l016j0051M5774O374R46m3566n3995n0729J4231
15709i3803J8079j38L840N1677r66K1573K9458p630j4846l5949J9891j2726k0316
15696d1856k6844K1586R0212M4166L3880J905J7710L3773O478P994J7741R485
15684B16230P070k1948O1858L215m8289m4118K5033N6763n0651l4757K6290N8224
$$ plain form
15773 106351 20111 -16565 36628 52177 61938 68783 66503 125881 108407 68302 68381 29916 -37060
15760 -37060 911 96531 85044 991 -45455 -36346 -62711 -58380 -11067 -14650 -19035 -45449
15748 -45449 -61706 -50777 -89474 -95152 -79460 -74850 -33923 -38176 -32889 -38597 -37338 -28989 -39548
15735 -39548 -56289 -66048 -60504 -41820 -12838 -10013 24380 41169 2565 1987 26631 22458 -1145
15722 -1145 32362 -1207 -23321 229 -2787 -12838 32936 39310 40256 -3310 -57305 -108034 -93803
15709 -93803 -75724 -75862 -72022 -20345 -21311 262 29720 22090 7244 -28705 -8814 -21540 -41856
15696 -41856 -68700 -47114 43098 87264 121144 123049 140759 174532 181010 189004 206745 216230
15684 216230 223300 201352 263210 266425 218136 174018 199051 255814 205163 170406 196696 254920
15672B54920j2557P942m832j5537L901J455N544K6253k0549m3430j7653J9538
15660B04995Q202P19m4558r669J966l3550J7430L4362o129K44l799j3406k2826
15647A33981k4848k9687M4985L8547j6370J9068M585L45L4675K0258J1309q466
15635B28382P2460J7113q2074n2703K547j1321L8457j9487j6261N625M9330M1454
15623B73522K3811n492o4841L652M5037J2970k0813Q887k0097j7666P1010K6991
15611C36971j9982K8448j7031Q861L7059O470m0891j3873N5677J9410L5989J2495
15599D49603K3417K4931J7755M3421K2144j1863O3907J2889l4571K0362N0078
15588F82073j2434l4525o7526n7224o4861L4878N0970N5202O3019O2417L8176
$$ plain form
15672 254920 242363 250305 245473 229936 233837 235292 240836 267089 246540 203110 185457 204995
15660 204995 213197 213916 169358 159689 161655 128105 145535 179897 173768 174012 170213 156807 133981
15647 133981 109133 79446 124431 162978 146608 165676 170261 170606 205281 225539 236848 228382
15635 228382 300842 317955 235881 183178 185725 174404 212861 193374 177113 182738 232068 273522
15623 273522 297333 291841 227000 230652 275689 288659 267846 276733 256636 238970 309980 336971
15611 336971 316989 345437 328406 337267 374326 380796 339905 326032 381709 401119 437108 449603
15599 449603 473020 497951 515706 559127 581271 569408 633315 646204 611633 631995 682073
15588 682073 669639 635114 567588 510364 445503 480381 531351 586553 649572 711989 750165
15577G50165n4030m2765O5380N6853M1772P0431P11L4587P2128l7026P582K4147
15565I89935J6202k6559J0573N6588N3648K4878K3874N4959L6336n9912k5027
15554A155495L7612K6550K7894p7626m7554L2982N8246L0654j2260o777k7366
15543A197850K6187N5369M0612o311j0127O4534M1254K2516j9027n426L4709N5767
15531A497907L3372m1397k1621O5571J9408L7999J39663R1476Q1001P5667N761
15520A984807J9688J8695P6442J97335Q9285P3152N9341J10055R0239K2805R1418
15509B833262J48901R4664P9332L4599M3657K3043Q1626Q0995N9085J14311J19253
15498C712728J15131J01359Q7490J16465J60834J37366J06082J15874R4273J15818
$$ plain form
15577 750165 696135 653370 718750 775603 817375 887806 888517 923104 995232 958206 965788 989935
15565 989935 1006137 979578 990151 1046739 1100387 1125265 1149139 1204098 1240434 1180522 1155495
15554 1155495 1193107 1219657 1247551 1169925 1122371 1155353 1213599 1244253 1231993 1225216 1197850
15543 1197850 1224037 1279406 1320018 1313707 1303580 1368114 1409368 1431884 1412857 1407431 1442140 1497907
15531 1497907 1531279 1489882 1468261 1533832 1553240 1591239 1730902 1822378 1903379 1979046 1984807
15520 1984807 2004495 2023190 2099632 2296967 2386252 2459404 2518745 2628800 2719039 2741844 2833262
15509 2833262 2982163 3076827 3156159 3190758 3234415 3257458 3339084 3420079 3479164 3593475 3712728
15498 3712728 3827859 3929218 4016708 4133173 4294007 4431373 4537455 4653329 4747602 4863420
15488D863420J60129J28029K07132J64337K23693J94716K44525K49410K82858
15479F718249L25288L25679L29914M04737M12668M87609N60459N65045N56764
15470A0686412O55410O89242P27407Q76376R39236J071728J190889J325924J477638
15461A9640262J646892J883287K114123K458221K792961L280534L803457M295300
15453D1915037M925687N721577O624095P867810R348331J1144365J3388920J5929085
15445A16864907J8675985K1597062K4317427K6492140K7983056K8422599K7533267
15438B91886443K5432857K1941514J7118534J1280875M771043k058480q655068
15431C61717718j4681907j9758191k3504598k5807154k6719946k6188294k4679288
$$ plain form
15488 4863420 5023549 5151578 5358710 5523047 5746740 5941456 6185981 6435391 6718249
15479 6718249 7043537 7369216 7699130 8103867 8516535 9004144 9564603 10129648 10686412
15470 10686412 11341822 12031064 12758471 13634847 14574083 15645811 16836700 18162624 19640262
15461 19640262 21287154 23170441 25284564 27742785 30535746 33816280 37619737 41915037
15453 41915037 46840724 52562301 59186396 67054206 76402537 87546902 100935822 116864907
15445 116864907 135540892 157137954 181455381 207947521 235930577 264353176 291886443
15438 291886443 317319300 339260814 356379348 367660223 372431266 370372786 361717718
15431 361717718 347035811 327277620 303773022 277965868 251245922 225057628 200378340
15424B00378340k2445668j9760855j7068726j4530711j2283000j0432441q927865
15417I4929074p769083o822790o065184n444169m943591m409748m013444l607038
15409E1854027l268286k977290k712283k393469k209595k004536j804382j676239
15401C2807947j560165j382507j364213j264157j145694j039833r70597q30046
15393B3250735q60458q45518q83045q04277p29471p09410o97707o45205n19303
15384A6556341n08230n37514m58103m70491n12694m72616m17421l91336m24404
15375A2363532m37819l71269l04523l57500l26410l45394l31514k64811l07774
15366I316518j98645k66700l06127k46912k30592k16954k17676k04661j81813
$$ plain form
15424 200378340 177932672 158171817 141103091 126572380 114289380 103856939 94929074
15417 94929074 87159991 80337201 74272017 68827848 63884257 59474509 55461065 51854027
15409 51854027 48585741 45608451 42896168 40502699 38293104 36288568 34484186 32807947
15401 32807947 31247782 29865275 28501062 27236905 26091211 25051378 24080781 23250735
15393 23250735 22390277 21544759 20661714 19857437 19127966 18418556 17720849 17075644 16556341
15384 16556341 16048111 15510597 15052494 14582003 14069309 13596693 13179272 12787936 12363532
15375 12363532 11925713 11554444 11249921 10892421 10566011 10220617 9889103 9624292 9316518
15366 9316518 9117873 8851173 8545046 8298134 8067542 7850588 7632912 7428251 7246438
15357G246438k02412k70309j74868j53122j49996j87210j65899j84430j73638
15348E584554j39707j51663j76736j56480j07031r6836n5989o3360r8708j02996
15338D435048j04733q7133o9041q4473o2947j40729j11664k8317q7913q0079r4575
15327C483444r8889r4016r8217r7739r9440p6550o0389j05827q0772q8714q9818
15316B493073j11052j17584j19215p4038n0632j07779j66323q5154l0821l0402
15306A600073o1505q0852j04356m9419p9343q7871P1092J7924m8845m4833p2492
15295A059573l9850k9421O573j2631k2915o649k2118l2593k2638k8462J1063K8258
15283H88190K7825k3938l8451m2608j01810n1994l4646n2921j1764P1128L0073
$$ plain form
15357 7246438 7044026 6773717 6598849 6445727 6295731 6108521 5942622 5758192 5584554
15348 5584554 5444847 5293184 5116448 4959968 4852937 4756101 4700112 4636752 4538044 4435048
15338 4435048 4330315 4243182 4174141 4089668 4026721 3885992 3774328 3746011 3658098 3578019 3483444
15327 3483444 3384555 3290539 3192322 3094583 2995143 2918593 2858204 2752377 2671605 2582891 2493073
15316 2493073 2382021 2264437 2145222 2071184 2020552 1912773 1746450 1661296 1630475 1600073
15306 1600073 1538568 1457716 1353360 1303941 1224598 1136727 1207819 1225743 1176898 1132065 1059573
15295 1059573 1019723 990302 996875 984244 961329 954680 932562 899969 877331 848869 859932 888190
15283 888190 916015 892077 853626 811018 709208 657214 622568 569647 557883 629011 659084
15272F59084N0510J0094l4835o5807n654K8771J1750n5813j021L0598q476m6690
15260E72511l9590K0674N4694J1323k3757l8143K1116k2423m5972j3948j8526
15249D77959l0594k4901J5982j4128L2861j6685l8255J4843K3799m762l8786O419
15237D03752L0423L1750l1263n9995o173k466J8269N3109l5970p1448j0019L3398
15225C53367K9200N6510Q5681K6102J7194J2596l1560l1850k9353m5094k5039
15214D17754K5936l9210m4264J4372m3968K9518k5055r438J5840m9181o0823k7647
15202B03834J7175P8915K4257k5103l5694l3252K1312J2207j6539q345k518o166
15190B30083R167l0718k0013K9166M2571j8600J0879Q0133N8359m2013j9127l0290
$$ plain form
15272 659084 709594 719688 684853 619046 613392 642163 653913 598100 597079 627677 619201 572511
15260 572511 532921 553595 608289 619612 595855 557712 578828 556405 510433 496485 477959
15249 477959 447365 422464 438446 424318 457179 440494 402239 417082 440881 436119 397333 403752
15237 403752 434175 465925 434662 374667 368494 366028 384297 437406 401436 329988 319969 353367
15225 353367 382567 439077 524758 550860 568054 580650 549090 517240 487887 442793 417754
15214 417754 443690 404480 360216 374588 330620 360138 335083 325645 341485 292304 231481 203834
15202 203834 221009 299924 324181 299078 263384 230132 251444 263651 247112 238767 236249 230083
15190 230083 239250 208532 188519 217685 260256 241656 252535 332668 391027 349014 329887 299597
15178B99597o293N7373q364k1364M284r520R378n1616l592K3680j8368m9272j8753
15165B07170j7103K0164K7084m582k1565k5941l2916j5167J097j8344k66R027
15153A28658N8137K279n4853k1050j8123m5510k4173p367Q540k158j056R956m1571
15140h291j3074P2188J6369k9297n0906j0543m2546n2029M848N7891J9605L026
15128c2759m8454m210L326K8742L5984J828K0574n377n164K5806J7407j642L1658
15115F7719r208m7762L7428L7241j2922k2775k9613K7121j9470j9536K7277J3811
15103D9311r677J2338Q246K2830K9018k6435J9358K5119l466N0094N9517r0113
15091A46140n6059M4012R953m0549k460J2338M2244r941k9614n3350o933k7428
$$ plain form
15178 299597 293304 350677 342313 320949 325233 315713 325091 273475 269883 293563 275195 225923 207170
15165 207170 190067 210231 237315 232733 211168 185227 152311 137144 138241 119897 119631 128658
15153 128658 186795 189074 134221 113171 95048 49538 25365 17998 26538 24380 23324 33280 -8291
15140 -8291 -21365 50823 67192 37895 -13011 -23554 -66100 -118129 -113281 -55390 -35785 -32759
15128 -32759 -81213 -85423 -82097 -53355 -17371 -15543 5031 -346 -5510 20296 37703 36061 67719
15115 67719 58511 10749 48177 85418 72496 49721 20108 47229 27759 8223 35500 49311
15103 49311 39634 51972 60218 83048 112066 85631 104989 130108 126642 176736 236253 146140
15091 146140 90081 134093 144046 103497 101037 113375 155619 145678 116064 62714 55781 28353
15079B8353K4921K8955m3215O777j7627O065M9532K4154k0830J6055K2332k117
15067A23355l1553k3883N6245j4002o5972l5741j1177q276L9264N5291L0416n5664
15055E8303l0440l2782J6867L5085K7151l2916k8708j1643l6958j5812K0359j4730
15043d6224L5628L0866p0k4082K7351j9266P077M3576k9121j388j8156M378p0828
15030f0259K7473J1015k2057j6987p685L0874K2628j9738n0880j3091k7149J3208
15018a12648M5195k5302N3566K8410M547M5569N8429o213j7423m0442L830L8397
15006G5915p178m5034k0982M9541L3356K809n524n4808J519M073L0854R5278O7772
14993B27591p388k7723L243N2379M0798M9029M0712J4567R0854J24108O6002R3567
$$ plain form
15079 28353 53274 82229 39014 45791 28164 34229 83761 107915 87085 103140 125472 123355
15067 123355 91802 67919 124164 110162 44190 8449 -2728 -11004 28260 83551 113967 58303
15055 58303 27863 -4919 11948 47033 74184 41268 12560 917 -36041 -51853 -31494 -46224
15043 -46224 -10596 20270 20200 -3882 23469 4203 11280 54856 25735 24347 6191 10569 -60259
15030 -60259 -32786 -21771 -43828 -60815 -68500 -37626 -14998 -34736 -85616 -98707 -125856 -112648
15018 -112648 -67453 -92755 -39189 -10779 -6232 39337 97766 91553 74130 33688 37518 75915
15006 75915 68737 23703 2721 52262 85618 88427 82903 28095 29614 33687 64541 159819 227591
14993 227591 220203 192480 195723 248102 288900 337929 378641 393208 484062 608170 674172 767739
14981G67739P4091J6751J11644J49287J82668J39034O3518R9129J1169o5793p8843
14970A470394k2022o1635r5366r3807p8072k4911p2212j90071j04908n4229j01609
14959E71552j09023p4562l8110m3448k8266p464k0494K8234r612m9048n6299k1530
14947A41930J8180p3166k9782j6553l0308l6024m287M1227J0450j8059L1870K1782
14935E7260j0016j8673j1482L5292K1418m8179n3046J3232l1641J9049K0799K9529
14923B3542L923m8287J5097M552K3468K0070o7886p111N5988l7513m4665J0315
14911d8507j4884k234J4885J919k6822p0239n6606m045K878K777J251N5617K8289
14898a15721L783q540j5721K8135j1710J5499K9146K8436m5465m2615p3895P348
$$ plain form
14981 767739 841830 858581 970225 1119512 1302180 1441214 1504732 1603861 1615030 1549237 1470394
14970 1470394 1448372 1386737 1291371 1197564 1119492 1094581 1022369 832298 727390 673161 571552
14959 571552 462529 387967 349857 306409 278143 270679 250185 278419 268807 219759 163460 141930
14947 141930 160110 86944 57162 40609 10301 -25723 -30010 11217 21667 3608 35478 57260
14935 57260 47244 28571 17089 52381 73799 25620 -27426 -14194 -45835 -26786 -5987 23542
14923 23542 27465 -20822 -5725 -1173 22295 42365 -25521 -32632 23356 -14157 -58822 -48507
14911 -48507 -63391 -65625 -50740 -48821 -75643 -145882 -202488 -206533 -203655 -200878 -199627 -144010 -115721
14898 -115721 -111938 -120478 -136199 -108064 -119774 -104275 -75129 -46693 -92158 -134773 -208668 -201320
14886b01320R410k583m1043O59J9542M7601L7860L5885l7709l790J943K2971M7799
14873f2775L9674J6554j2097p9971o3458m4444P10M8886K2967J8795l7600j2538
14861a65297R249j3192k6242O71M0321M8448K7066n681r354k0362M6147J3034
14849e5192l658P320m1697l5492l7860K3510k463l3248P301J8327Q4014m81m1542
14836a11161n0569k2970P9827o159j3817j7045M133j0051j441q415K5399K9757
14824a02512M420m3609m602m508J3354J4016n692q073O8473o5455k4652k7250
14812a86090j1579J1851P1162M8765o722m3982k9521L8336K9762r541j3655k7768
14800a28982l5446Q665J5615K3605k5134n190N0537N8188K4693m9443l1820l2933
$$ plain form
14886 -201320 -191910 -194493 -235536 -234877 -215335 -167734 -129874 -93989 -131698 -135488 -133545 -110574 -62775
14873 -62775 -23101 -6547 -18644 -98615 -162073 -206517 -205807 -156921 -133954 -115159 -152759 -165297
14861 -165297 -156048 -169240 -195482 -194811 -154490 -106042 -78976 -84657 -94011 -114373 -68226 -55192
14849 -55192 -58850 -51530 -93227 -128719 -166579 -143069 -145532 -178780 -171479 -153152 -69138 -69619 -111161
14836 -111161 -161730 -184700 -104873 -111032 -124849 -141894 -137761 -147812 -149253 -157668 -132269 -102512
14824 -102512 -98092 -141701 -146303 -150811 -137457 -123441 -129133 -137206 -68733 -134188 -158840 -186090
14812 -186090 -197669 -185818 -114656 -65891 -72613 -116595 -146116 -107780 -78018 -87559 -101214 -128982
14800 -128982 -164428 -155763 -140148 -116543 -141677 -146867 -96330 -38142 -13449 -62892 -94712 -127645
14788a27645M4680K3869k0120q983j2427j4359k5384K554L8001J8315o7485o99
14776a49683l303J0686j1242J1556m3646O2263Q4916J8577m4019n1770J3231J0513
14764i1921p8815r239j3592l410L288k8656M8908L9891j6326n8250J0631j0140
14752b07631j076q99N7156L7259j1207j3868M5546M4577M50m6847K2906N3993
14740a9641l9858m1578k0676J2851K6335p133k7630J0548J095q856J753j7783
14728a30573K672o0566k9261J5735O4556J8354j3474K7878k2573k8468j1610n0211
14716b17541Q057Q8968k3573l7288M6476j2280l7800j771J606J8313K7823K476
14704a36534j2391m9126K7298j166K9660K898K6106L994p1285k212P4940K1567
$$ plain form
14788 -127645 -82965 -59096 -79216 -88199 -100626 -114985 -140369 -137815 -99814 -81499 -148984 -149683
14776 -149683 -152986 -142300 -153542 -141986 -185632 -123369 -38453 -19876 -63895 -115665 -102434 -91921
14764 -91921 -170736 -179975 -193567 -196977 -193689 -222345 -173437 -133546 -149872 -208122 -197491 -207631
14752 -207631 -208707 -209606 -152450 -115191 -126398 -140266 -94720 -50143 -49693 -96540 -73634 -19641
14740 -19641 -59499 -101077 -121753 -108902 -82567 -89700 -117330 -106782 -105687 -114543 -112790 -130573
14728 -130573 -127901 -188467 -217728 -201993 -137437 -119083 -132557 -104679 -127252 -155720 -167330 -217541
14716 -217541 -209484 -120516 -144089 -181377 -134901 -147181 -184981 -186752 -185146 -166833 -139010 -136534
14704 -136534 -148925 -198051 -170753 -171919 -142259 -139361 -113255 -109261 -180546 -182758 -107818 -86251
14692h6251J7021j8024J5221J5627p85l1686M877j3199k6510k7809j7505L56M2542
14679a26125J1627k0141l0445J7173M3980J8018n1654j3700k0780p5186k3576
14668b70809L5972Q3703J6580r039j1299m7494j2164Q1113L9329o1613m1143J6772
14656a80092m6415k3269J9327J4862L3995K3824J442j2764k6646Q4551L3363k2302
14644a00124j1703O7714O094n665k224n4952l8288l6987l921m810l5140k8541
14632b48547j0515J4675L7327K0377R323K8835O069l1115k1891l0140K215O6091
14620a57296J09348P655p0813k8250p9577l2147Q9218L4720l1544P218J716k1900
14608a71652l2970N640k758n795J6901L308L3810R2147J8924m8221l8740l6011
$$ plain form
14692 -86251 -69230 -87254 -72033 -56406 -57191 -88877 -84000 -97199 -123709 -151518 -169023 -168667 -126125
14679 -126125 -114498 -134639 -165084 -147911 -103931 -85913 -137567 -151267 -172047 -247233 -270809
14668 -270809 -234837 -151134 -134554 -143593 -154892 -202386 -214550 -133437 -94108 -155721 -196864 -180092
14656 -180092 -226507 -249776 -230449 -215587 -181592 -157768 -156326 -169090 -195736 -111185 -77822 -100124
14644 -100124 -111827 -44113 -38019 -43684 -45908 -100860 -139148 -176135 -180056 -184866 -220006 -248547
14632 -248547 -259062 -244387 -207060 -186683 -177360 -148525 -142456 -173571 -195462 -225602 -223387 -157296
14620 -157296 -47948 -40293 -111106 -139356 -218933 -251080 -161862 -127142 -158686 -151468 -149752 -171652
14608 -171652 -204622 -198982 -201740 -207535 -190634 -187326 -153516 -61369 -42445 -90666 -129406 -165417
14596a65417o2469m1080K1729O1892L3821L4578L1075o8621N792J9631J325j8799
14584a46543j5258P84o156M692M6561J0684k665R141j5581o538j6046p259o8506
14571b12690p7551K2820j2429R094j868k2839M9520L7693M9311J7810J312K5549
14559a14268k1608n0669n0441j9534N6335N2253J0773J6149l4575m7439J7410
14548a85614O8097O384K2785N493O223j1992p7749l9258j3362q101n2260k8237
14536c07591L3397K8960R0561L1572m0729j370k1608l745j7129N548L4114Q7061
14524h0959O910j8826M1569J2102m6847j4744n0602l3660L610J3577M4611L1241
14512i2018p8337l9832l9507J993M0266O2401O3656p527n1164J9503o4507j4715
$$ plain form
14596 -165417 -227886 -268966 -247237 -185345 -151524 -116946 -85871 -154492 -148700 -129069 -127744 -146543
14584 -146543 -161801 -161017 -167173 -162481 -115920 -105236 -107901 -98760 -114341 -120879 -136925 -144184 -212690
14571 -212690 -290241 -267421 -279850 -270756 -272624 -295463 -245943 -208250 -158939 -141129 -139817 -114268
14559 -114268 -135876 -186545 -236986 -256520 -200185 -147932 -137159 -121010 -155585 -203024 -185614
14548 -185614 -117517 -111133 -88348 -82855 -76632 -88624 -166373 -205631 -218993 -227094 -279354 -307591
14536 -307591 -274194 -245234 -154673 -123101 -163830 -165200 -186808 -190553 -207682 -202134 -168020 -80959
14524 -80959 -74049 -92875 -51306 -39204 -86051 -100795 -151397 -185057 -181447 -167870 -123259 -92018
14512 -92018 -170355 -210187 -249694 -247701 -207435 -145034 -81378 -88905 -140069 -120566 -185073 -199788
14500a99788l7264J7537K2876L4582L9207M8144K5066l2142l6841J5950L0724
14489g1949j993o6505n4831l6404m2393L9061J5395j7015J8061L4543J2809k2719
14477a93940K1174O3750L7490j5578k2913m7114k4856k4139l7439N3793J3440
14466a76332l2038j102P155L2502K7291n1003j6032k4841j115J7459Q6220J702
14454a30134q3969J688L8697l3747l1148l897N8478M8907p65O284m39j5584P6425
14441f9204Q089M2154K564l3364m3984l5377J84O0617J2392l1132k5059J5414
14429i6706m3569J1504k8472k6232k0709Q897L9549q9565L989K5125L3273J2073
14417a70843K2228j4869K1483k2263l4138j244J5637J4418k6645K637M5777K4413
$$ plain form
14500 -199788 -237052 -219515 -196639 -162057 -122850 -74706 -49640 -81782 -118623 -102673 -71949
14489 -71949 -73942 -140447 -195278 -231682 -274075 -235014 -219619 -236634 -218573 -184030 -171221 -193940
14477 -193940 -172766 -109016 -71526 -87104 -110017 -157131 -181987 -206126 -243565 -189772 -176332
14466 -176332 -208370 -209472 -202317 -169815 -142524 -193527 -209559 -234400 -235515 -218056 -131836 -130134
14454 -130134 -214103 -212415 -173718 -207465 -238613 -242510 -184032 -135125 -135890 -129606 -130045 -145629 -69204
14441 -69204 -61115 -18961 -16397 -49761 -93745 -129122 -128938 -68321 -55929 -87061 -112120 -96706
14429 -96706 -140275 -128771 -157243 -183475 -204184 -195287 -155738 -245303 -241314 -216189 -182916 -170843
14417 -170843 -148615 -163484 -142001 -164264 -198402 -199646 -184009 -169591 -196236 -193599 -147822 -123409
14405a23409l7987l59j5079j4037K0344j5739k7868M3835Q166J1762K7514L7545
14393h5312k8545r106j7468n977n703l1519l2192k192R643o76J6584N3181N3254
14380h6028j687l5188r683J7314j8087k7381K8453M2586J500N810o854l4272n6828
14367a80345k454L6154m858j6325m0111Q201J1967N0786P3767K0717p973M9655
14355h19n0436l0689J2081K921o0778l5927L9526l9039M4938k0858k6722j3801
14343a79603J1425K4211M9482j0520J3858M2455m200l0702o805k6961M771L9259
14331g3330m0272m7178p0251J5000N1631l7323P500M7844M48k0443j1478m688
14319a82540n7303J4685O8733K6665J4636p060J8306P4496j8082m1353l0317j2896
$$ plain form
14405 -123409 -161396 -161755 -176834 -190871 -170527 -186266 -214134 -170299 -162133 -150371 -122857 -85312
14393 -85312 -113857 -122963 -140431 -146408 -152111 -183630 -215822 -218014 -208371 -209047 -192463 -139282 -86028
14380 -86028 -87715 -122903 -132586 -115272 -133359 -160740 -132287 -89701 -88201 -82391 -89245 -123517 -180345
14367 -180345 -182799 -146645 -151503 -167828 -207939 -199738 -187771 -136985 -63218 -42501 -50474 -819
14355 -819 -51255 -81944 -69863 -66942 -127720 -163647 -124121 -163160 -118222 -139080 -165802 -179603
14343 -179603 -168178 -143967 -94485 -105005 -91147 -48692 -52892 -83594 -90399 -117360 -112589 -73330
14331 -73330 -113602 -160780 -231031 -216031 -164400 -201723 -194223 -146379 -145931 -166374 -177852 -182540
14319 -182540 -239843 -225158 -156425 -129760 -115124 -122184 -103878 -29382 -47464 -88817 -119134 -132030
14307a32030L5759j6003m6888o9992q803K7840L1871J250j880k8089j382L8390
14295a69957N7117L7604m1420J7724l5748n2728J4405J7536O702L4998K7077q583
14283i5273n5174j8029N697l70O7433l9265n3401N040P187p700K1438J9732l81
14270a43066J2307p72j2519R91J5126P4067K1563l180l678o452P839K8453k0467
14257b9788l9847l2980j0260K6791j8106N385j4661j4081J092l2332K7055k018
14245a33750m3985k1337J0519K067p255L2545K0027m3300j7247L3725L5995N898
14233a26098J6037o98J4546k0410l2650j9346l9992k3432J2464M5652L1181J621
14221a41125M2855J389n1995M0534J048q98j8470k8232M531K2765L2697P331M9235
$$ plain form
14307 -132030 -96271 -112274 -159162 -229154 -237957 -210117 -178246 -176996 -178876 -206965 -208347 -169957
14295 -169957 -112840 -75236 -116656 -98932 -134680 -187408 -173003 -155467 -148765 -113767 -86690 -95273
14283 -95273 -150447 -168476 -162779 -163149 -95716 -134981 -188382 -183342 -176155 -183855 -162417 -142685 -143066
14270 -143066 -130759 -131531 -144050 -143059 -127933 -53866 -32303 -35483 -39161 -45613 -37774 -9321 -29788
14257 -29788 -69635 -102615 -112875 -86084 -104190 -98805 -113466 -127547 -126455 -158787 -131732 -133750
14245 -133750 -177735 -199072 -188553 -186486 -193741 -161196 -141169 -184469 -201716 -167991 -131996 -126098
14233 -126098 -110061 -110759 -96213 -116623 -149273 -168619 -208611 -232043 -219579 -173927 -142746 -141125
14221 -141125 -98270 -96881 -148876 -108342 -107294 -108192 -126662 -154894 -150363 -127598 -94901 -87570 -38335
14208c8335l5375r0358l2327R427k5937J6394M3276L6919J2528r89Q3656k9974
14196e1095n861L042n7721m5507J296L521J9078n7789K302K2030J4124K2242j694
14183a32032m6280o429L2514M3726j0241K5168j0764j5705l5816Q276r844O5575
14171i1852j7950n7083L1060M8333j6625L9162k5486J5640p059O048m165J1998
14159f7979l9797j2621M720L7881P071m6893j9807k3422J7738R466L1521r174
14147a11296r006O1674J3922m221j1213q6128l5855J0564K9254R766l6323K6029
14135a42833K8004J7026K6721j5688m8503k0799N536N136J0390J4977K4711L7051
14123e8271J3654K3378R031m4352n1515n67m5255J2533k687j388k6483M9403j2533
$$ plain form
14208 -38335 -73710 -164068 -196395 -186968 -212905 -196511 -153235 -116316 -103788 -104777 -21121 -51095
14196 -51095 -56956 -53914 -111635 -157142 -155846 -152325 -133247 -191036 -188734 -166704 -152580 -130338 -132032
14183 -132032 -178312 -184741 -152227 -108501 -118742 -93574 -104338 -120043 -155859 -147583 -157427 -91852
14171 -91852 -109802 -166885 -135825 -87492 -104117 -64955 -90441 -74801 -81860 -75812 -79977 -67979
14159 -67979 -107776 -120397 -115677 -77796 -70725 -117618 -137425 -160847 -143109 -133643 -102122 -111296
14147 -111296 -120302 -58628 -44706 -48927 -60140 -146268 -182123 -171559 -142305 -132539 -168862 -142833
14135 -142833 -114829 -97803 -71082 -86770 -135273 -156072 -150536 -145400 -135010 -120033 -95322 -58271
14123 -58271 -44617 -21239 -12208 -56560 -108075 -108642 -153897 -141364 -144051 -145439 -171922 -122519 -135052
14110a35052k4714j4126J1402J9160K8813N7261J3243k3877k3515m187j5132Q174
14098a02550k4455j6756N9465O8716j03365p103J6348n510K3763q778p695J1451
14086i6469j4670L7771j185n7296j8314L5309L059j4066n2853O385N7411O4019
14074e0899J5432k3312m9456l0745j6728P8390M5951m5048j2064n068J521J5327
14062g6699p200k029N355J886j3291l4113l4577L1767M8763j4180k8108m943R87
14049a26382j674L975k033J8765Q2522K4976m2285o1609m6761L884K0559P601
14037a18462q597J4058j9646m006k1821Q320K8695j27L0684O055j3025K6673o4913
14024a36112k8070j8939k0841L1234M4142J8144j5468j3321r616M2080J6804j8776
$$ plain form
14110 -135052 -159766 -173892 -162490 -143330 -114517 -57256 -44013 -67890 -91405 -95592 -110724 -102550
14098 -102550 -127005 -143761 -84296 -15580 -118945 -126048 -109700 -115210 -91447 -100225 -107920 -96469
14086 -96469 -111139 -73368 -74553 -131849 -150163 -114854 -111795 -125861 -178714 -172329 -114918 -50899
14074 -50899 -35467 -58779 -108235 -138980 -155708 -77318 -31367 -76415 -88479 -93547 -92026 -76699
14062 -76699 -83899 -85928 -80573 -78687 -91978 -126091 -160668 -128901 -80138 -94318 -122426 -127369 -126382
14049 -126382 -128056 -124081 -126114 -107349 -24827 149 -42136 -103745 -150506 -146622 -126063 -118462
14037 -118462 -127059 -113001 -132647 -136653 -158474 -150154 -121459 -121586 -90902 -84847 -97872 -71199 -136112
14024 -136112 -164182 -183121 -203962 -172728 -128586 -110442 -125910 -139231 -148847 -106767 -89963 -108739
14012a08739l8864k7951o663M695O1829J8589J2696p7461q912M0293L6457K8915
14000f5116J6341l8975q609j2718O812J1465L4698J5610l0473j6188O513k7290
13988a07930j8199M7018R214k7583L1142k9652o599k9209p6102n4893J32252J20346
13976a0195J3494m6806r4079J949j8605p706K3695K6827l8680m5282k519P276
13964a90631N6370N6713K7916m2520l3501j4231J9290L5899J1518M5612m0090
13953f7655o5975r504J5524J2466M1752K6750p30J9593k1029o9642j9634K4977
13941a13107K3845m4571J4596L7896J3604J1115p5364r069N4315N7092O1518N416
13929C7286l6597L2257J4420q3383n3812L6900J2997L7091j9918M64M863n479
$$ plain form
14012 -108739 -147603 -175554 -182217 -177522 -115693 -97104 -84408 -161869 -170781 -130488 -94031 -65116
14000 -65116 -48775 -87750 -96359 -109077 -102265 -90800 -56102 -40492 -70965 -87153 -80640 -107930
13988 -107930 -126129 -79111 -69897 -97480 -66338 -95990 -102589 -131798 -207900 -262793 -130541 -10195
13976 -10195 3299 -43507 -137586 -135637 -154242 -161948 -138253 -111426 -150106 -195388 -197907 -190631
13964 -190631 -134261 -77548 -49632 -92152 -125653 -139884 -120594 -84695 -73177 -27565 -67655
13953 -67655 -133630 -143134 -127610 -115144 -73392 -46642 -47372 -27779 -48808 -118450 -138084 -113107
13941 -113107 -89262 -133833 -119237 -81341 -67737 -56622 -131986 -141055 -86740 -29648 31870 37286
13929 37286 689 32946 47366 -36017 -89829 -52929 -39932 -2841 -22759 -22295 -17432 -22911
13917b2911o0863Q042L9639J8093J2453p7l2066J805J9277L9531l931l0910j4418
13904b6336m2599J4868O8908j7902l7196p5189J0458L6962L0871L4542k903m7018
13892e2534L2120k7623K0901N1797k9597p1789M3591o0518j5427K5819J4898R160
13880e9202m3241n9369p589R133P9139j9342j105O3902L8655N414K352k1674m3907
13867e6834n5504J8834K600j4015M2667M8067j1366j0013J8750m0632l9863J2322
13855h4987J27139L0997m3408j1597j2922P903n076n7748q723J9094l5778O948
13843f8158K3127j5819k1510L6142M516k2957l9098J0813J2560M0147K9951J4132
13831C846K2807n84k4939k171j1022m752m5886M3933k4123l6074k5105o0616n799
$$ plain form
13917 -22911 -83774 -75732 -36093 -18000 -5547 -5624 -37690 -35885 -16608 22923 18992 -11918 -26336
13904 -26336 -68935 -54067 14841 -3061 -40257 -115446 -104988 -68026 -37155 -2613 -5516 -52534
13892 -52534 -20414 -48037 -27136 24661 -4936 -76725 -33134 -93652 -109079 -83260 -68362 -59202
13880 -59202 -102443 -161812 -169401 -160268 -81129 -100471 -101576 -37674 981 6395 8747 -12927 -56834
13867 -56834 -112338 -93504 -90904 -104919 -62252 -14185 -25551 -35564 -16814 -57446 -97309 -84987
13855 -84987 42152 73149 29741 18144 5222 13125 8049 -49699 -58422 -39328 -75106 -68158
13843 -68158 -45031 -60850 -82360 -46218 -41702 -64659 -103757 -92944 -80384 -40237 -10286 3846
13831 3846 26653 26069 1130 -1041 -12063 -16815 -62701 -18768 -42891 -78965 -104070 -164686 -170485
13818a70485N7802M3316J4545J7373J4604j6003k0884L6924j0168j3492K021L6390
13806h057j4584m8615n613k1953J0869R0780J4241l3694m837N7769j2494p1173
13794d7361r539N5086K0091k1181K4327j9410l7199l3851K1284N6998J4367j0895
13782A2717m8513j6479l7810N3471K4677j0943J8124j5489J0800J9271m4341M599
13770b9916k6301j5734L3069j3944p2632n471J8579O6412Q0445l192m2610j862
13758a3157K0030o5733k1021M4687K3146j2463k3004K910n2991m9679N2819L5440
13746e9016M2738L4014K2621m813k9957j4112K5395o2365J3222J4147j1929k3917
13734e3972K916q377M2367j1982K4976N692k5629k7620M722r10L6961j171l0296
$$ plain form
13818 -170485 -112683 -69367 -54822 -37449 -22845 -38848 -59732 -22808 -32976 -46468 -44447 -8057
13806 -8057 -22641 -71256 -76869 -98822 -87953 2827 17068 -16626 -21463 36306 23812 -47361
13794 -47361 -56900 -1814 18277 -2904 21423 2013 -35186 -69037 -47753 9245 23612 12717
13782 12717 -35796 -52275 -90085 -36614 -11937 -22880 -4756 -20245 -9445 9826 -34515 -29916
13770 -29916 -56217 -71951 -38882 -52826 -125458 -130929 -112350 -45938 34507 31315 -11295 -13157
13758 -13157 6873 -58860 -79881 -35194 -12048 -24511 -47515 -44605 -97596 -147275 -94456 -59016
13746 -59016 -16278 17736 40357 35544 5587 -8525 16870 -45495 -32273 -18126 -30055 -53972
13734 -53972 -51056 -59433 -17066 -29048 -4072 1620 -24009 -51629 -46907 -47817 -10856 -12027 -42323
13721d2323J3999J1881L1805m109J3547Q3322l1563o0250m3388L97K8792J8610
13709B0720m3700k6077j8908M2134j2638m5404k3503O0606O3866k8591K7410k4252
13697h337l9700j6443l414j5208j0924k536L026j8829l9725N2872N0730O4296
13685A5808m7827K7555M9793J4964J3406l5806m3049n3463M7373O5831k4800r8070
13673f8285k751L6554L0714M0929m6744l594N4159M2088k5309m461j3832r261
13661C0207J0815j2945P804L678k0092K4432M0955q6635q480N087L9686J3063
13649D7575l5854K8394K6985m1813J8231K0011M9380q695r520j9557k1902k1504
13637C1731J0513k4929L7001Q239M268j058J786J7041l3750j8756j3344J125j348
$$ plain form
13721 -42323 -28324 -16443 15362 11253 24800 108122 76559 16309 -27079 -26682 2110 20720
13709 20720 -22980 -49057 -67965 -25831 -38469 -83873 -107376 -46770 17096 -11495 15915 -8337
13697 -8337 -48037 -64480 -67894 -83102 -94026 -96562 -93536 -112365 -152090 -99218 -48488 15808
13685 15808 -32019 -4464 45329 60293 73699 37893 -5156 -58619 -11246 54585 29785 -68285
13673 -68285 -71036 -34482 -3768 37161 -9583 -13177 40982 83070 57761 53300 39468 30207
13661 30207 41022 28077 35881 39559 19467 43899 84854 -1781 -10261 -5174 34512 47575
13649 47575 11721 40115 67100 25287 43518 63529 112909 104214 94694 75137 53235 31731
13637 31731 42244 17315 54316 62555 66823 65765 67551 84592 50842 32086 18742 19867 18519
13624A8519m0552k0264Q2621K8565K5772l2046l1390j6287l2711l6769L9034K5579
13612A0071o0563J0702j9647m0225L2692L4391K0877j1068J5023m0406o5183r52
13600a14288J00223N4755J8551m3494j8895l2257J1193N3828k8157K0512M469
13589B6440M0817j7476p4803m15J3632P472K5647J7995J5061n606j4579r9506
13577f5321M5107J04652P3070m3442n3515J1703L8609P551O074j4648J2713J3839
13565A36392r738o7269n0245J2596O0371M9102p9963N693M136n0339J2921k2521
13553A136Q514j2317M1070M7601o09l2856j6082N657j8032o9916O597L9399Q4553
13540H4715N4977m8195O280J9574r317m514R606j386O6584k144r7370j6844N5429
$$ plain form
13624 18519 -22033 -42297 40324 68889 94661 62615 31225 14938 -17773 -54542 -15508 10071
13612 10071 -50492 -39790 -59437 -99662 -66970 -32579 -11702 -22770 -7747 -48153 -113336 -114288
13600 -114288 -14065 40690 59241 15747 -3148 -35405 -24212 29616 1459 21971 26440
13589 26440 67257 49781 -25022 -25437 -11805 -4333 21314 39309 54370 48764 34185 -65321
13577 -65321 -20214 84438 157508 114066 60551 72254 110863 118414 124488 109840 122553 136392
13565 136392 126654 59385 9140 21736 82107 131209 51246 56939 61075 10736 23657 1136
13553 1136 9650 -2667 38403 86004 85395 52539 36457 42114 24082 -45834 -39237 162 84715
13540 84715 139692 91497 97777 117351 108034 103520 113126 111740 178324 176180 78810 61966 117395
13527A17395K7382J8130J0537o0455l4950n760K61j7137K6896R844j0667J1754
13515I3230K8794J8986j3411o63m2707l3061l8895r368O287L0972j3475J5124
13503D1813j707o2355K4071Q0615L7766K2470k2036k3105k1632M5250k3978o6876
13491C0296o2537l1145k1961K9654M4193P5704K6460l9995o4878N454P0968J0487
13479G2700l064m2338m6931m6542K7036N3298m2338P1115N4596l6495j8220J7979
13467F0796M250L1997J2374M503n290n365j9300L1559K6992j8476k4069l1723
13455F8248l8760q204R229L0982K7501L2436J8094k1434l3300l5630j4276j2651
13443B2235N2633K9670N8311q4528j3864J530o030K4836J2096m3947N6591L1056
$$ plain form
13527 117395 144777 162907 173444 112989 78039 72279 72540 55403 82299 92143 81476 93230
13515 93230 122024 141010 127599 126936 84229 51168 12273 2905 9192 40164 26689 41813
13503 41813 40106 -22249 1822 82437 120203 142673 120637 97532 75900 121150 97172 30296
13491 30296 -32241 -63386 -85347 -55693 -11500 64204 90664 50669 -14209 -8755 62213 72700
13479 72700 69636 27298 -19633 -66175 -39139 14159 -28179 42936 97532 61037 42817 60796
13467 60796 65046 97043 109417 113920 108630 103265 83965 115524 142516 124040 99971 68248
13455 68248 29488 21284 30513 61495 88996 121432 139526 118092 84792 49162 34886 22235
13443 22235 74868 104538 162849 78321 64457 65987 59957 84793 96889 52942 109533 140589
13431A40589O555j795m0735o76k1447q022M599K2693M097J8868K0989n3272m3905
13418D8538J181P4506k236r904J6712q134L699K4545K5266m3121k2107M0708K4509
13405A74162o0751m6027J6769M309L5822K9819m1736m0161K5901l8215L7439P4782
13393A72113J9891l0642o2675l6130J0394J2188K5619M4790L9173n4208n4704
13382H5809j5414L2057M4749m3672j3380R650K8572J8989O990K6506j9446P021
13370A68431K8486K3553m8238k8009J5838k5208k3972M2818N1982j6572m0826
13359A48283j9986k2254j4301J7839P0205L8717L220m3985j5873K366k8645J0172
13347A45758N4271j4413K9471k9912k5701n602K7298m2604L816R546k461P477
$$ plain form
13431 140589 147144 145349 104614 103938 82491 74469 79068 101761 105858 124726 145715 92443 48538
13418 48538 49719 124225 121989 112085 128797 120663 124362 148907 174173 131052 108945 149653 174162
13405 174162 113411 67384 84153 88462 124284 154103 112367 72206 98107 59892 97331 172113
13393 172113 192004 161362 98687 62557 72951 85139 110758 155548 194721 140513 85809
13382 85809 70395 102452 147201 103529 90149 99799 128371 147360 154350 180856 161410 168431
13370 168431 196917 220470 172232 144223 160061 134853 110881 153699 205681 189109 148283
13359 148283 128297 106043 91742 109581 179786 218503 221723 177738 161865 164231 135586 145758
13347 145758 200029 185616 215087 185175 159474 153872 181170 138566 142382 151928 149467 156944
13335A56944j3078J7114k301j2082k4929J2492J0552j316K1573M3536L8304k375
13323B44434p090n7027l6303K0048j944j2024j2802J0892J8269k653P09m9653
13311A14856M9949K313m306N6357L1406N588o2557k6175J7317J8156k8205k9450
13299A45249k7786J4114q1j367k0398J4579M6737j0591l8853Q255M086K4457o008
13286A52393K6977N0492O854j1913J4823l0017k9642P171L5633k3660J4755J01454
13274C15320l3656k3615p923J8422M1027m3030m8907l1706j470L6536Q563J515
13262B31076l6800m4233j3632K2331n891q361L1269O6468l5078n589j3969j3142
13250A74449Q841k3456n6088O234P7831M8551j9873m0960o2212L0767M8269l3868
$$ plain form
13335 156944 143866 160980 158679 146597 121668 134160 144712 143396 164969 208505 246809 244434
13323 244434 237344 180317 144014 164062 162118 150094 137292 148184 166453 163800 164509 114856
13311 114856 164805 167118 162812 219169 250575 256163 193606 167431 184748 202904 174699 145249
13299 145249 117463 131577 131496 130129 109731 124310 171047 160456 121603 129858 133944 158401 152393
13286 152393 179370 229862 236716 224803 239626 209609 179967 187138 222771 199111 213866 315320
13274 315320 281664 258049 250126 268548 309575 266545 217638 185932 184462 220998 229561 231076
13262 231076 194276 150043 136411 158742 152851 144490 175759 242227 207149 201560 187591 174449
13250 174449 183290 159834 103746 109980 187811 236362 216489 175529 113317 144084 192353 158485
13238A58485k4631K8376j1816j2692K9400N4163M0027P918m0279l1598q893O446
13226A94906l0427j5605M3151M6666j7910m5530K4587j0065j9715L8794N9515
13215B68367p8693k5610q922N6938J4360J0144k4774m2361J2906K2002O6387M1384
13203C12128r912k1919k2603J4692M0180k6856p3021l7183L2011R8658j6729j1536
13191B77910N926J9905j8587j1931J0892K6603l3711k2041j5372m5799Q632j6466
13179A85961M1452O8079k6348N4725l3362n6522M5380L1298J660N018k3808O879
13167C00412k8887l9183J7143L3467J8717N204O7683J0286r778q1112p7969J9575
13155B35558N6599K9782n780j7403l4545m7334k491K9303K8385Q050K9653K4011
$$ plain form
13238 158485 133854 162230 150414 137722 167122 221285 261312 269230 228951 197353 188460 194906
13226 194906 164479 148874 192025 238691 220781 175251 199838 189773 170058 208852 268367
13215 268367 189674 164064 155142 212080 226440 236584 211810 169449 182355 204357 270744 312128
13203 312128 302216 280297 257694 272386 312566 285710 212689 175506 207517 306175 289446 277910
13191 277910 283836 303741 285154 273223 284115 310718 277007 254966 239594 193795 202427 185961
13179 185961 227413 295492 269144 323869 290507 233985 279365 310663 312323 317341 293533 300412
13167 300412 271525 232342 249485 282952 301669 306873 374556 384842 375064 293952 215983 235558
13155 235558 292157 321939 316159 298756 264211 216877 214386 243689 272074 280124 309777 333788
13143C33788l7653k8842j9493M71J32L303j5375l9243K4995O3293k6825j3608
13131B44943O7522j8356m1321L2787L9666j8355o2213J715J4371j7332O6153Q9322
13119C98902O6013j8591n9995m499n7921o2038K7339K8132q68j6239K8982M4451
13107C73668m1373j3942M6723J973L5247k6130O16n2620o00L8736J1549j5665
13095C58182K2507O6493N7955l8255o5931j6545m507j8141J0086J0951P0224J0436
13083D63455n0828R965M6923k8467M2N3357J0787L4435o1535p8469J0068L2207
13071D41940P0045J2246o0850j4860n7075j9612l5643M714O3871L9527m127m6775
13059C93401J0958M6552k4208p3222n2480M5683L3385k427m8725J5918J7427j0420
$$ plain form
13143 333788 296135 267293 247800 248271 248403 251706 236331 197088 222083 285376 258551 244943
13131 244943 312465 294109 252788 285575 325241 306886 244673 246388 260759 243427 309580 398902
13119 398902 464915 446324 386329 381830 323909 261871 289210 317342 316474 300235 329217 373668
13107 373668 332295 318353 365076 367049 402296 376166 376782 324162 323562 362298 373847 358182
13095 358182 380689 447182 505137 466882 400951 384406 379899 361758 371844 382795 453019 463455
13083 463455 412627 422592 469515 441048 441090 494447 505234 539669 478134 399665 409733 441940
13071 441940 511985 524231 463381 448521 391446 371834 336191 340905 404776 444303 440176 393401
13059 393401 404359 450911 426703 353481 301001 346684 380069 377642 328917 344835 362262 351842
13047C51842N0688K0948m5939p1107K1273N0188M3862j1885l0884j1363J2569
13036C80192J1189L692m3809q433N7557J6258j3338k8967J8525k3813O222k7512
13024C47763j4368J5203J5374m7752o513N0265R6682j8810j08285k7182P825K4647
13012C34849M7052j816l3491N864k530N510j8019N359q51M0190j3752K1569L7435
12999D27369o542n9925K0993M5792l2877L5789N874n4744J820j955m593k7998
12987C49003L2375K2990k4488n2519M6226J2117O4252J9823k9878k5530k1412
12976C92959Q217M6118K2161m6749m2785N953N881O541n226P915L0099j2168o061
12963D12855k4722L3241M5819n9030l0451J9837n2839Q200L7020J9024l6245J0409
$$ plain form
13047 351842 402530 423478 377539 306432 327705 377893 421755 409870 378986 367623 380192
13036 380192 391381 395073 351264 342831 400388 416646 403308 374341 392866 369053 375275 347763
13024 347763 333395 348598 363972 316220 309707 359972 456654 437844 329559 302377 310202 334849
13012 334849 381901 380085 346594 352458 349928 355438 337419 342778 341927 382117 368365 389934 427369
12999 427369 420827 360902 381895 427687 394810 430599 436473 381729 383549 381594 377001 349003
12987 349003 381378 404368 379880 327361 373587 385704 449956 469779 439901 414371 392959
12976 392959 401176 447294 469455 422706 379921 385874 391755 398296 393070 400985 431084 418916 412855
12963 412855 388133 421374 467193 408163 377712 397549 344710 352910 389930 408954 372709 383118
12951C83118J8301M512K2585j8471Q754k4882j0647k676L9465K5192K441p514
12939D40178M752l5098p176N4043j7292o304m6681L834J9988M4659K0741j6436
12927D59208j0478j5009l2487l3408M605K6374L5498J7090p866q893K641K0531
12915D57806L3658J0611n0536M0118N3105l3650m6549K287J7291j9649o372Q0874
12903E38994N5208n0171o5261n9311j9865O355K7035J2309L314k3993n3382n982
12891C65250M1812J7248Q964j616J8531k6959k4315O8243J9248L1881K4971K7881
12879E71139n2417o8417p5713m9074O9127J2221m652K9979J1851M1916K6578k4120
12867D88418k8408L0878J0219l3691k8212L8213L012K0259k1998L6246o841q7767
$$ plain form
12951 383118 401419 405931 428516 410045 418799 393917 383270 380594 420059 445251 447692 440178
12939 440178 444930 409832 402656 456699 439407 433103 386422 390256 410244 454903 475644 459208
12927 459208 448730 433721 401234 367826 372431 398805 434303 451393 443527 434634 437275 457806
12915 457806 491464 502075 451539 491657 544762 511112 464563 466850 484141 464492 458120 538994
12903 538994 594202 544031 478770 419459 399594 405949 432984 445293 448607 424614 371232 365250
12891 365250 407062 424310 433274 431658 450189 423230 398915 467158 486406 518287 543258 571139
12879 571139 518722 450305 374592 325518 394645 406866 402214 432193 444044 485960 512538 488418
12867 488418 460010 490888 501107 467416 439204 477417 480429 500688 478690 514936 508095 420328
12855D20328j3764Q1626r247k6167q163M8523M9049J3598J9473L0276l0554m1623
12843E33355l1290K4450N925l8117j3079n1389o2100j6623L5246j3836J574K8312
12831D02428n5702L1894M2548j6651J4299Q1126K3102L1109J0823Q4780J6637
12820F66393o4661k109l9993l1496l419m586j0777K076K3037j8925o1017j4750
12808D39773N8522P3370N2161l8590M945n662m8588n4145j3930M881R476p229
12796D74984P518L9942p879J7093N9648N0846o7590j6990Q370j0709m1035k5941
12784D88257L6110K7124k0085j7711j4491M3351q747k9328j4740L145k1090J0269
12772D82064L1189R873J3511k9786j6190q834N62K374K0740k8206M3511k3262
$$ plain form
12855 420328 406564 488190 478943 452776 444613 493136 542185 555783 575256 605532 574978 533355
12843 533355 502065 526515 532440 494323 481244 429855 367755 351132 386378 372542 374116 402428
12831 402428 346726 378620 421168 404517 418816 499942 523044 554153 564976 649756 666393
12820 666393 601732 599623 559630 528134 524715 520129 509352 511428 534465 515540 454523 439773
12808 439773 498295 571665 623826 585236 590181 584519 535931 481786 467856 472737 482213 474984
12796 474984 482502 522444 514565 531658 591306 642152 574562 557572 565942 555233 514198 488257
12784 488257 524367 551491 531406 513695 499204 542555 533808 504480 489740 492885 471795 482064
12772 482064 513253 523126 536637 506851 490661 481827 482389 484763 505503 477297 520808 497546
12760D97546K1888K4918m1081j0920M0610J0598m0553n082P0722p728m8097l3898
12748D78923j8555k0185j1053L0053L6826l3952O0924Q4451J2286l1514J2461
12737F00665P1390l0500p1593k4520k8081n0848K3890K9624Q352j3651j2843J6792
12725E18677p224K1585J0441L2217j239m0527K2861L2709K8203P255j2060j1324
12713F01574R220L1343k6681N355l8542k6322l3593k2469O6564K9399r7150K5097
12701E23795M5008r358K6917J0925n929O545j0869j4638J3236K6977K3077P07
12689F36393o903K4345O439k7633j5893j8362L2754k95K5960r655j3507L0197
12677F63840K7114j7319l4780k8030m0220k201N8731R2414L1836r2287n4963O2130
$$ plain form
12760 497546 519434 544352 503271 492351 532961 543559 503006 497924 568646 560918 512821 478923
12748 478923 460368 440183 429130 459183 496009 462057 522981 607432 619718 588204 600665
12737 600665 672055 641555 569962 545442 517361 466513 490403 520027 528379 514728 501885 518677
12725 518677 511453 533038 543479 575696 574457 533930 556791 589500 617703 624958 612898 601574
12713 601574 610794 642137 615456 620811 582269 555947 522354 499885 566449 595848 498698 523795
12701 523795 568803 559445 586362 597287 591358 597903 587034 572396 585632 612609 635686 636393
12689 636393 629490 653835 660274 632641 616748 598386 631140 630845 656805 647150 633643 663840
12677 663840 690954 673635 638855 610825 570605 568404 627135 719549 751385 659098 604135 666265
12665F66265L2008m7610K2738j0327p8107j7799K8872K0161J4773l6877n3556
12654E40541K2642j6204L920k7819L4055N1412M3132P392k443J1480P604K9249
12642G04961J1223J4483r871j8568l7104P241M6694j215k6958K6497k0621M7362
12630G44124l1078m8980k9391n1330m918L3068J00626k4176l9779n024o8042m8508
12618E26592M5830J7525N6907O2539M1228o2435l4520M956k609m8963J549M3361
12606F51960J6043L0288M8549m2496m0931N379j9084L954Q789k4649O955K8154
12594F72911J3370j2026l016J0062k6105Q73N2038j5899L1056J183k1705k4977
12582F77765o0144O554l264L2132K9571l8815l2122k286K8020M0181m7389k3522
$$ plain form
12665 666265 698273 650663 673401 663074 584967 567168 596040 616201 630974 594097 540541
12654 540541 563183 546979 550899 523080 557135 608547 651679 659071 656628 668108 675712 704961
12642 704961 716184 730667 720796 702228 665124 672365 719059 717844 690886 717383 696762 744124
12630 744124 713046 664066 634675 583345 578427 611495 712121 687945 648166 643142 575100 526592
12618 526592 572422 589947 646854 709393 750621 688186 653666 658622 656013 607050 608599 651960
12606 651960 668003 698291 746840 704344 663413 668792 649708 653662 662451 637802 644757 672911
12594 672911 686281 674255 671239 681301 655196 656069 708107 692208 723264 724447 702742 677765
12582 677765 617621 624175 620911 653043 682614 643799 611677 609391 637411 677592 630203 606681
12570F06681L9664j7308N2178R2874R760n035o8190r2415r667K7483K4190K0358
12558F80573K0853K7657o0020m6834J0441K4198N8832O8920K5385l4646q3885
12547F91474p9867J0366K2864j3685r062L3088J7181n926m8042L8892j4826k0797
12535F21660L9652K8007j5814l8379o528J0747k4652j6003k3485K4809J08142
12524G08156m57J5195O2289k885p2663q8067K5236k1150m5629L4522J3040O6013
12512F93600q315J2086j8043k291N5967K7071k4701p642l5253o7786k4916L9124
12500F38901k479k9291j5565J7953J2635K1741r729K4385M504o329r894K9070
12488F75902j5866K4274Q222j8255k920P691O848j8837J909N315l6474J3979L1874
$$ plain form
12570 606681 646345 629037 681215 774089 783849 778814 710624 618209 608542 636025 660215 680573
12558 680573 701426 729083 669063 622229 632670 656868 715700 784620 810005 775359 691474
12547 691474 611607 621973 644837 631152 622090 655178 672359 666433 618391 657283 642457 621660
12535 621660 661312 689319 673505 635126 628598 639345 614693 598690 575205 600014 708156
12524 708156 707699 722894 785183 782298 709635 621568 646804 625654 580025 614547 627587 693600
12512 693600 685285 697371 679328 677037 733004 760075 735374 727732 692479 624693 599777 638901
12500 638901 636422 607131 591566 609519 622154 643895 634166 658551 663055 656726 646832 675902
12488 675902 660036 684310 692532 674277 671357 679048 685896 667059 668968 674283 637809 651788 683662
12475F83662j229k8087N418J6668J3148K8259J6636m2967n0986j9380L1449K4195
12463F76786J4149j08o7019p5487J3328P4714J664L510p911j9253p066N921k2875
12450E90353K5282Q9654Q9332o524l3637m4256o4313m596J4169j1126M227N1400
12438F99965p809k9968j6816L6084o74p0348l0688N547K391J0254J2766L2007
12426F42711K5889N7255m061m0909L2764O9823l7566j8525M7189J1532k7133p9199
12414F79770J7127l419l6135M6235L2517k7223k2560n7870J3397M302j609k1132
12402F23400n480J4200j9852N1076K8518N3507k3200j0819K1358o6318m5567J0256
12390F31079K0017n0477k1046K3056P3444K1558J1471m3874j7512J8856L1456
$$ plain form
12475 683662 682433 654346 659764 676432 689580 717839 734475 691508 640522 621142 652591 676786
12463 676786 690935 690827 623808 548321 561649 636363 638027 641537 633626 614373 607307 613228 590353
12450 590353 615635 705289 794621 788097 754460 710204 645891 641295 655464 644338 648565 699965
12438 699965 692156 662188 645372 681456 680782 610434 579746 585293 587684 597938 610704 642711
12426 642711 668600 725855 721794 680885 713649 783472 745906 727381 774570 786102 758969 679770
12414 679770 696897 693478 657343 703578 736095 708872 686312 628442 641839 646141 644532 623400
12402 623400 617920 632120 612268 663344 691862 745369 722169 711350 732708 666390 620823 631079
12390 631079 651096 600619 579573 602629 676073 697631 709102 665228 647716 666572 698028
12379F98028L4265L4552o1252l1143k5775l4656N6719K6126J1762J7743L2514
12368G58883L9678p659j0897m4718j3123L8399N5075k151m2665n1344m0149J8015
12356F97344O363j3132o782R03K2701J7125J9137k4932p2180j643K780J03762
12344G51446L8993m1510l9403p143j8517J4519L9680M4570K4373K7059J1140m4940
12332H00267m8234L9127m277N638j8472L003M2822K2522M0009J1009l0849l918
12320H58647k9583p7982J9610J6564j3918J4823k6013m1830J6032k1609j4819
12309F99922m2707P931j4872n045l8301l6229M1396P4022N1274p893N7711J9489
12297H06698k0784k6857K2503o642k5950k0829k2500p6092k4002M4808P5680K7287
$$ plain form
12379 698028 732293 766845 705593 674450 648675 614019 670738 696864 708626 726369 758883
12368 758883 798561 790902 780005 735287 722164 760563 815638 813487 770822 719478 679329 697344
12356 697344 703707 690575 683793 684696 707397 724522 743659 718727 646547 644904 647684 751446
12344 751446 790439 748929 709526 702383 683866 698385 738065 782635 807008 834067 845207 800267
12332 800267 752033 791160 786883 792521 774049 777052 819874 842396 882405 893414 862565 858647
12320 858647 829064 751082 770692 787256 773338 788161 762148 720318 736350 714741 699922
12309 699922 657215 665146 650274 645229 606928 570699 612095 686117 737391 729498 787209 806698
12297 806698 785914 759057 781560 774918 748968 728139 705639 629547 605545 650353 726033 753320
12285G53320k6479P549l1647k8043l4650M411R772J4101L2213k2818K1629O5136
12273G64494K481m3794o1091J6117L3441K6358K1683l3387j10268l3750R03J69
12261E83356O4676N1453M7319q567l9290j2172k7676j0345o5934J3824N1507O6734
12249G14885J6739K0934k7447l1201j7495J0141M550M1521M764J6906r543n8297
12237F86457l317k3916j6582R499N5672q530l500K9527n432L9429l5749o615N9240
12224G76183J0698k4407j3910K5542m5752m2963n5870j0733P2766J6999M6880
12213G55433K7734r470o2797k9985j4854J0289J9567l6027k312J690L9188O9027
12201G67483j9736l6717R249j6812K9004L913j459k1761n5365l8159J6717J7715
$$ plain form
12285 753320 726841 734390 702743 674700 640050 644461 654233 668334 700547 677729 699358 764494
12273 764494 766975 723181 662090 678207 711648 738006 759689 726302 616034 582284 583187 583356
12261 583356 648032 699485 746804 738237 698947 686775 659099 648754 582820 596644 648151 714885
12249 714885 731624 752558 725111 693910 676415 686556 691106 732627 737391 754297 744754 686457
12237 686457 683140 659224 642642 652141 707813 699283 695783 725310 719878 759307 723558 716943 776183
12224 776183 786881 762474 748564 774106 728354 685391 629521 618788 691554 708553 755433
12213 755433 783167 773697 710900 680915 666061 676350 695917 659890 657578 659268 698456 767483
12201 767483 747747 711030 720279 703467 732471 736384 734925 713164 657799 619640 636357 654072
12189F54072M5471K9700J2617L5872q433m49l3495o7747j6311J9247M2669N671
12177G18884j668k7896m1518n6291n4021P2140P7993n477k3169R412K1744q94
12165F89239l448J0989p8605n0662N3406M8638N2566L1807l5415k0238L8713j6676
12153G20314o2569J2134M5308K016l2683n1977J0396M0579l276J0032J3015l3513
12141F69776K9629M2964l6827N879L470l791M3378J7403n8167o6530N2152P2877
12129G72213J4678L1909J4356m7326n3906m8057O929K750o9864L5659K8027l2849
12117F54519k0199L1151r901K0216K8358j4247k5309r290K2785O965r35j7570
12105F66543j8846K9477k9790j7051K7758k1469L0517k697J3769l7273m3322M6947
$$ plain form
12189 654072 699543 729243 741860 777732 769299 768850 735355 667608 651297 670544 713213 718884
12177 718884 717216 689320 647802 591511 537490 609630 687623 682146 658977 668389 690133 689239
12165 689239 685791 696780 618175 567513 620919 669557 722123 753930 718515 698277 736990 720314
12153 720314 657745 669879 715187 717203 684520 632543 642939 683518 680242 690274 703289 669776
12141 669776 699405 742369 705542 711421 714891 711100 754478 771881 713714 647184 699336 772213
12129 772213 786891 818800 833156 785830 731924 683867 690796 693546 623682 659341 687368 654519
12117 654519 634320 665471 655570 675786 704144 689897 664588 655298 678083 685048 684113 666543
12105 666543 647697 677174 647384 630333 658091 636622 667139 664442 678211 640938 597616 644563
12093F44563j9930k7316q875L674L8658M0166l341k8678j2239k0284k427j937
12081F02034J2452L4956N4257M0806l6738k7393J1140L7473K3188R408l2396q1877
12069F47310o758j0418n8176p753M1411R898J1767m466M6993j3312J1186L6602
12057G04284j4780j4171k946j2191J8944m1995J5926k8882k7197N3319P1423k7867
12045F93867k5951k7121k8275q195L2609k2712j5331J1387r8495m4259O576J1725
12033D85825J9187J02474P3546j762j7663m2153m2612O9623J1055j0344l9634
12022F07542j9253J908J2984k7226l2789J2335l1253K1342K0213k1317l0402q871
12010E05213L8104j6051Q949L8033L7011l0523M3968P1742Q149q4769o4318m6369
$$ plain form
12093 644563 624633 597317 588442 592116 630774 670940 667599 638921 626682 606398 603971 602034
12081 602034 614486 649442 703699 744505 707767 680374 691514 728987 752175 761583 729187 647310
12069 647310 640552 630134 571958 564205 605616 615514 627281 622815 669808 656496 667682 704284
12057 704284 689504 675333 672387 660196 679140 637145 653071 624189 596992 650311 721734 693867
12045 693867 667916 640795 612520 604325 636934 614222 598891 610278 511783 467524 474100 485825
12033 485825 505012 607486 681032 679270 661607 619454 576842 646465 657520 647176 607542
12022 607542 588289 590197 603181 575955 543166 555501 524248 545590 565803 544486 514084 505213
12010 505213 543317 527266 536215 574248 611259 580736 624704 696446 704595 619826 555508 509139
11998E09139P561O3524K0404J6149M4578M3439K9572m7596l8816L8241J8787l1085
11986F73897k442n4263j8028N302L17j6265N5305L3819j5378j4863Q01K0580k0425
11973F48357k4226m1021M808k807M710j4505l9746P2318J5737j8507L0897J6430
11961F52445l1929P101J2924K1375l3576o7138l2487J0756O804l2311j752J5947
11949E28159Q2483M1705j6884l3033O177n0760l338Q965M8190j8814m0794M395
11937E56451O816N9043J5640j8673o6700n9008K724k3999K7372N2176L2978K39
11925E85059L5408J4887n2374K1025K466l7515l1180k5608K2978l9517n5199K8104
11913D68534N8630L1783M1305N056k1359l0153K8092n210o2469j08838M3740Q4775
$$ plain form
11998 509139 516700 580224 600628 616777 661355 704794 734366 686770 647954 686195 704982 673897
11986 673897 671455 617192 599164 604466 604783 588518 643823 677642 662264 647401 648202 668782 648357
11973 648357 624131 583110 587918 585111 589821 575316 535570 607888 623625 605118 636015 652445
11961 652445 620516 627617 640541 661916 628340 561202 528715 539471 546275 513964 512212 528159
11949 528159 610642 652347 635463 602430 608607 557847 554509 563474 611664 592850 552056 556451
11937 556451 563267 622310 637950 619277 552577 493569 496293 472294 499666 551842 584820 585059
11925 585059 620467 635354 582980 604005 606471 568956 537776 512168 535146 495629 440430 468534
11913 468534 527164 558947 600252 605308 583949 553796 581888 576678 514209 405371 449111 533886
11901E33886m8984M8583L2656j1926J5683K4317j3752Q166n46j8344L478j0746
11889E62471j4881k3631m908K3928k6826K8180L6215P0644l7470p4995P708k990
11877E43445k7080m95k6151K457m8213R029O4166M4349L0864m893n7756l4230
11865D95492m0457j5041N362J9280L3685j9505k2015L1392N6985O0324K666o7848
11853E40320m2427L1502M919m2886k7168j7077M8388R3393k4222m0057K3313k0024
11841E27974k0682n7069n7117k9181j0185O226Q575K2468K0323O2283M3047j3230
11829E03432J987P015L2013M0422J8427o0740l6194N5736m4068m8249O5505Q651
11817E43937j6552j3674l1897o9074m3524J526J5367N665K203N3527K6752J3100
$$ plain form
11901 533886 484902 533485 566141 554215 569898 594215 580463 588629 588083 569739 573217 562471
11889 562471 547590 523959 519051 542979 516153 544333 580548 651192 613722 538727 546435 543445
11877 543445 516365 515870 489719 492176 443963 452992 517158 561507 592371 587478 529722 495492
11865 495492 455035 439994 445356 464636 498321 478816 456801 488193 545178 605502 608168 540320
11853 540320 497893 529395 534314 491428 464260 447183 495571 588964 564742 524685 547998 527974
11841 527974 507292 450223 393106 363925 353740 359966 368541 391009 411332 473615 516662 503432
11829 503432 505419 512434 544447 584869 603296 542556 506362 562098 518030 469781 535286 543937
11817 543937 527385 513711 481814 412740 369216 370742 386109 391774 393977 447504 474256 487356
11805D87356J7058k9799o5775M338M1337L1772p297o783n7034K5333K8949Q689
11793D78144j4050K5193L3645j8283m0491l9968M5726O8259l7089n102L1459K374
11781E29817N0095J2649j05898m4820Q7554L0767l2585q0591m2806K3123J6799
11770D44104j7194l0239J3076K8994Q014J5381o7578r537M4365K4966J081L1285
11758D86718k4131j9626o2204l4550k386P0700M9231K5077r10j9220k6260j7934
11746D24505j3322k3486k2624l6918l882k9604k2538N5739M8885K0574l9839l9663
11734C17827L9921L1143k7823k7753L1640L9369m8380m086q69K7054K1977n7216
11722C42804m9991K8586N8706k859M008L631J7153l7770k1442N6164K9781q948
$$ plain form
11805 487356 504414 474615 408840 413178 454515 486287 478990 472207 415173 440506 469455 478144
11793 478144 464094 489287 522932 504649 464158 424190 469916 538175 501086 495984 527443 529817
11781 529817 579912 592561 486663 441843 529397 560164 527579 446988 404182 427305 444104
11770 444104 426910 396671 409747 438741 446755 462136 394558 385021 429386 454352 455433 486718
11758 486718 462587 442961 380757 346207 343821 414521 463752 488829 487919 468699 442439 424505
11746 424505 411183 387697 365073 328155 324273 294669 272131 327870 376755 397329 357490 317827
11734 317827 357748 388891 361068 333315 364955 404324 355944 351858 350989 378043 400020 342804
11722 342804 292813 321399 380105 377246 381254 384885 402038 364268 342826 398990 428771 419823
11710D19823l6505l9251q846n097J9654L5894M0276J7078j7164P128K1686J9837
11698D74513n4655r0068j8293L3429k2852o303q432M1322L4862L5941m8519k8020
11686C42925l4301J8167N6845j9846l7844k915K630N311M3326N871k6909p106
11674C46154J3218L1792L5744J5923m378m8604k9105L0822m221k2842l2789j199
11662C30515J8935j6405l3319l5266r61L3800n5628k981K0762N6086L9544n2102
11650C02980K7030L7483m586L1975j0381k9868K1534k7914j3513o7849k0969L7025
11638B82947M8049M6026j4548k603m1818o915L2007J1336m2026n0567L0438N2954
11626C45280P750N277q016l0846M0063N5364j7959q0139m1008M1655O314m7707
$$ plain form
11710 419823 383318 344067 335221 330124 349778 385672 425948 443026 425862 432990 454676 474513
11698 474513 419858 329790 311497 344926 322074 315771 307339 348661 383523 419464 370945 342925
11686 342925 308624 326791 383636 363790 325946 323031 325661 330972 374298 380169 353260 346154
11674 346154 359372 391164 426908 442831 438453 389849 360744 391566 387345 364503 331714 330515
11662 330515 349450 333045 299726 264460 263499 297299 241671 238690 259452 315538 355082 302980
11650 302980 330010 367493 362907 394882 384501 354633 376167 348253 334740 266891 245922 282947
11638 282947 330996 377022 362474 359871 318053 311138 343145 354481 312455 261888 292326 345280
11626 345280 353030 358307 350291 319445 359508 414872 396913 316774 275766 317421 323735 276028
11614B76028L7662K9947N9437k8078k6064n8498l6280j5994j3681j7040J3489
11603B20928J9711N6847P1335N1238n9769j1456J975J7155L197l3506J8940K2365
11591C78960l6538k1619K2160J5745N3526j0726n2820m2569J5185J2372J7504
11580C51180l4913j6885m7882l9215Q792L3266p156m4828K4155J3977L4609L8323
11568C13423K8222K0718l8930m5325l6170l3875K743L4852O5082j2336j5380j8344
11556B64680l2416M615N196l6021k892R499O2675P820k8650j1672K1107n9413
11544B04528m6638k6056J5022N1311m279m7027L218K5885L4762N498n9887m647
11532A51690K5299K2550k126Q787l7142J4242M0218N092M1588o5536j4277J5828
$$ plain form
11614 276028 313690 343637 403074 374996 348932 290434 254154 238160 224479 207439 220928
11603 220928 240639 297486 368821 420059 360290 348834 350809 367964 371161 337655 356595 378960
11591 378960 342422 320803 342963 358708 412234 401508 348688 306119 321304 333676 351180
11580 351180 316267 299382 251500 212285 221077 254343 247187 202359 226514 240491 275100 313423
11568 313423 341645 362363 323433 278108 241938 208063 210806 245658 310740 298404 283024 264680
11556 264680 232264 236879 242075 206054 203162 212661 275336 283156 254506 242834 263941 204528
11544 204528 157890 131834 146856 198167 193888 146861 150079 175964 210726 216224 156337 151690
11532 151690 176989 199539 197413 206200 169058 183300 223518 228610 270198 204662 190385 206213
11520B06213l6702m7546J4243R748J7628L2776k1024K9115J6319K8812k3022j9425
11508B07135K5656l0117K5798o3073p9274K0750M6140o311r053L7071J4029R52
11496A89703K0094J0163J767j0585J1596k7101l4797O335N7242R064K3025r3J3471
11483B69884l4428j3683l504m5971k3107K0128p093k1463l3697O233M0529K7466
11471A81294l054r5784l5358R712J8922K2605j9930L7696O6112N8258L3490k7200
11459B46763l9956k2743j6363P738n960K0549J4767m422j5519K9541K4610m3900
11447A95105J9981j378L7769M2704P131J6476l3363J1106n9410j03148q530K8929
11435A53372L6949K4603n0205o3736J0794O1492J2353j8964o486J3511J8635K6336
$$ plain form
11520 206213 169511 121965 136208 145956 163584 196360 175336 204451 220770 249582 226560 207135
11508 207135 232791 202674 228472 165399 86125 106875 153015 146704 137651 174722 188751 189703
11496 189703 209797 219960 221727 211142 222738 195637 160840 167175 224417 233481 256506 256413 269884
11483 269884 235456 221773 218269 172298 149191 169319 162226 140763 107066 113299 153828 181294
11471 181294 178240 82456 47098 56810 75732 98337 78407 116103 182215 240473 273963 246763
11459 246763 206807 184064 167701 175439 169479 190028 204795 200373 184854 214395 239005 195105
11447 195105 215086 213708 251477 294181 301312 317788 284425 295531 236121 132973 124443 153372
11435 153372 190321 214924 164719 100983 111777 173269 185622 166658 160172 173683 192318 218654
11423B18654j5275j3135k9874o2049k32l0558J2244J7689M1227j3096m6419J9606
11411I8782l8586J6718k8463j0655M0308p095q673J0611K5238k8848L7344p419
11399I9262l5535J8825L757J1248o134l5605L3043J160j6412j5913L03J1247N98
11386F9844K2924M5578J1377j6756r02J2083k4207j0936L0157M0017q608j2906
11374A57665j6814l1774J8196k2704J1980L2958L6670K0527O854q4231m5993K0312
11362A03646k0758p753o5159J172M3856k2369m4117L1860l1133L6633L2145j8902
11350C9121m398J500p230j0359R685M190J7555L0328o6577M4636O6151K3396j2323
11337A35675J1834j5958j2429J6387k4611n1771l0219L848j4586j0795J403L8290
$$ plain form
11423 218654 203379 190244 160370 98321 98089 67531 79775 97464 138691 125595 79176 98782
11411 98782 60196 76914 48451 37796 78104 71009 62336 72947 98185 69337 106681 99262
11399 99262 63727 82552 86309 97557 91423 55818 88861 90021 73609 57696 57999 69246 69844
11386 69844 92768 138346 149723 132967 132065 144148 119941 109005 139162 179179 170571 157665
11374 157665 140851 109077 127273 104569 116549 149507 186177 206704 213558 129327 83334 103646
11362 103646 82888 75135 9976 11148 55004 32635 -11482 20378 -10755 25878 58023 39121
11350 39121 34723 36223 28993 18634 28319 32509 50064 80392 13815 58451 124602 147998 135675
11337 135675 147509 131551 119122 135509 110898 59127 28908 32756 18170 7375 8778 47068
11325D7068K6258j1754j9471j328K6693o9013l0919M7944L4880J888O3877J9707
11313A35830n1053m6434l221L7892m241r333m3945J8442K8155m1698m045R532
11301B5881M6820O8317j2976p9965J6519q247j0104k9691j8888K5102k1054J5765
11289A7479j5096m3889J8112P3142P337K9142J5884j0006q111q9501r483N1627
11277C6637M0347K9442q467j01037j2528Q230k5310L6486M2679j5791J313Q918
11265D0919j0467o8618K3026N4875M2690j1711K0206K6039k4745k7211j8877K3382
11253F9508m40n6460m4367M5153k3399m6219K8296J9941n004r993j3387N4746
11241A8375M5241k7457m6722n3087j1255o986L2575k1900L11O0480m7870R613
$$ plain form
11325 47068 73326 61572 42101 40773 67466 -1547 -32466 15478 50358 52246 116123 135830
11313 135830 84777 38343 35122 73014 68773 59440 15495 33937 62092 20394 16349 25881
11301 25881 72701 141018 128042 48077 64596 56349 46245 16554 -2334 22768 1714 17479
11289 17479 2383 -41506 -23394 49748 57085 86227 102111 92105 83994 -5507 -14990 36637
11277 36637 76984 106426 97959 -3078 -15606 -7376 -32686 3800 46479 30688 32001 40919
11265 40919 30452 -38166 -15140 39735 82425 70714 90920 116959 92214 65003 46126 69508
11253 69508 69068 12608 -31759 13394 -10005 -56224 -27928 -7987 -12991 -22984 -36371 18375
11241 18375 63616 36159 -10563 -63650 -74905 -81891 -49316 -71216 -70905 -10425 -58295 -48682
11229d8682K7793Q119l1754o3671J3869N335K918M9185M6273j8535m5484J0439
11217d4195J2204n619K4436q607l0741k410q586r620l173L0261K6048k707K241
11204b0468M8822L2100n4933N650K3280k6148n3212m2084K5761k6422P9366J56607
11192A48319M5391J2616m016R6512N9275r925M3986N160m1317n2046p2068q5503
11180A46384p2150o1382n0799O2764K1995m9048R568J8488l0188n4279J0038O342
11168d2267j5654K56R186M0674L355m7833m1135k5924j2738k405P7633J2699m6419
11155i0572Q553O616l379J7926O5738J230q3920M320K1973K6569L8634j8305m7404
11142e2021k6235n0384o129P3736m9843m473J4889L3323K2757o0844j709N3011
$$ plain form
11229 -48682 -20889 -12770 -44524 -108195 -94326 -88991 -86073 -36888 9385 -9150 -54634 -44195
11217 -44195 -31991 -37610 -13174 -21781 -52522 -54932 -63518 -73138 -76311 -46050 -20002 -22709 -20468
11204 -20468 28354 60454 5521 11171 34451 8303 -44909 -86993 -61232 -87654 -8288 148319
11192 148319 193710 206326 202310 298822 358097 348172 392158 397318 356001 303955 231887 146384
11180 146384 74234 12852 -37947 24817 46812 -2236 7332 25820 -4368 -58647 -48609 -42267
11168 -42267 -57921 -57665 -48479 -7805 -4450 -52283 -93418 -119342 -132080 -134485 -56852 -44153 -90572
11155 -90572 -82019 -75403 -78782 -60856 4882 6112 -77808 -73488 -51515 -24946 13688 -4617 -52021
11142 -52021 -78256 -128640 -134769 -61033 -110876 -115349 -100460 -67137 -44380 -105224 -106933 -53922
11130e3922J9971n4009k4015N047k21l0172j1092J4761j3823K7843J7427m428
11118a06633K5587J7569j6297N2505K742r0609p2527J9093j6723j7687M6410L0051
11106a26519n904l3372K366L1391P994n1750O0373Q8230l9058J21J4048l5817
11094h7897l6292l5202k7703n110k7865Q33p539M0785N3609l5936L150O7394K6995
11081g0778k6294r59m1799k1869k393k9786r237j1071J3307j0455M827J891j6253
11068b20869N8215J9767Q909N1053K0178o9658q7844J4844O9401L3258k0078L7861
11056h4963R589N307j186l2058n8740N9457l0407r1O0831M2249K7298K5562J4209
11043C7057k2188n5633L5157J15100N3289O4670J4297m8748j4592Q7576K0447
$$ plain form
11130 -53922 -33951 -87960 -111975 -106928 -107149 -137321 -148413 -133652 -147475 -119632 -102205 -106633
11118 -106633 -81046 -63477 -79774 -27269 -24527 -115136 -187663 -168570 -185293 -202980 -156570 -126519
11106 -126519 -132423 -165795 -163429 -132038 -124044 -175794 -115421 -27191 -66249 -66128 -52080 -87897
11094 -87897 -124189 -159391 -187094 -192204 -220069 -219236 -226775 -185990 -132381 -168317 -165167 -97773 -70778
11081 -70778 -97072 -98031 -139830 -161699 -164092 -193878 -203115 -214186 -200879 -211334 -206507 -204616 -220869
11068 -220869 -162654 -142887 -133978 -82925 -62747 -132405 -220249 -205405 -136004 -102746 -122824 -84963
11056 -84963 -75374 -70067 -71253 -103311 -162051 -102594 -133001 -133092 -72261 -30012 -2714 22848 37057
11043 37057 14869 -40764 -5607 109493 162782 227452 241749 193001 178409 265985 286432
11032B86432J1259K6284L942n6869k265L5885Q742K2068k9464p344l5312o9466
11020A93892o1700L268L6666O4271N240M721n6951J3102q83L2039Q986m2822k2871
11007A76958J6000l2243k547l4622o1145l2592r505o141L7899l3466J3187o3445
10995c1662j636o627n6403k2581L2692K1373Q547j2736k163k1831j2567l2171
10983a37765J0959n5l7813k3270k8437j937o42K0380n0592K5005K3766q4501j5276
10970c00178P156j4932J3933M9701L3861L898l5587n907N6271o0526q2277m7418
10958c82005l811K0163J1928o478M6464P2651K3625l9488L4134K1562k4969r7591
10946c23815n7868R20K0574J6964P217r773M5743Q923k0172J00965J03282N1830
$$ plain form
11032 286432 297691 323975 327917 271048 268783 304668 313410 335478 306014 298670 263358 193892
11020 193892 132192 135460 172126 236397 241637 246358 189407 202509 201626 233665 242651 199829 176958
11007 176958 192958 160715 158168 123546 62401 29809 20304 14163 52062 18596 31783 -31662
10995 -31662 -33298 -39925 -96328 -118909 -86217 -64844 -56297 -69033 -71196 -93027 -105594 -137765
10983 -137765 -126806 -126861 -164674 -187944 -216381 -218318 -218960 -198580 -249172 -224167 -200401 -284902 -300178
10970 -300178 -293022 -307954 -294021 -244320 -210459 -206561 -242148 -248055 -191784 -252310 -334587 -382005
10958 -382005 -385816 -365653 -353725 -360203 -313739 -241088 -217463 -256951 -222817 -201255 -226224 -323815
10946 -323815 -381683 -380763 -360189 -343225 -336008 -345781 -300038 -291115 -311287 -210322 -107040 -55210
10934e5210P9788N459J2909M9619L1193k5186j5411J0180k4185r1999n0479j2837
10922h6159j0247l8495p6700q8743k4492l974l4942O808K3465P256j0881p124
10910c44228J1253K1343J7484Q0062k3417n9987o180J3587m6035j9209P730M4413
10898c03184j03J8215L6031j2547l7014j4705p8423l0531L4761j1799N9678k1498
10886c61119k6268k570L384M4275L849K49J877l8752n7867j823M5218P3823O116
10873c09608R928j8528pr67m0490k9823j1947l6437L784j1299L3372N1591k787
10860c63218N5458O8313l1452m4774k9152O246o0328k0282M4926M9101j3341l8892
10848c77395k6821J6848P7059K3565l0034N4581n0058j9029L4165m82K331m9526
$$ plain form
10934 -55210 24578 30037 42946 92565 123758 98572 83161 93341 69156 -22843 -73322 -86159
10922 -86159 -96406 -134901 -211601 -300344 -324836 -328810 -363752 -356944 -333479 -326223 -337104 -344228
10910 -344228 -332975 -311632 -294148 -214086 -237503 -297490 -303670 -290083 -336118 -355327 -347597 -303184
10898 -303184 -303287 -285072 -249041 -261588 -298602 -313307 -391730 -422261 -387500 -399299 -339621 -361119
10886 -361119 -387387 -389957 -386573 -342298 -338449 -338200 -336323 -375075 -432942 -434765 -389547 -315724 -309608
10873 -309608 -299680 -318208 -318215 -319182 -359672 -389495 -401442 -437879 -434095 -445394 -412022 -360431 -363218
10860 -363218 -307760 -239447 -270899 -315673 -344825 -338579 -398907 -419189 -374263 -325162 -338503 -377395
10848 -377395 -404216 -387368 -310309 -286744 -316778 -262197 -312255 -331284 -297119 -297601 -295270 -344796
10836c44796k0396k2335l5934j323o860j696M9811K4021n7400K1771K5243p904
10824c77798M1414j514m0170l2448M7665J676k6192r921q668l4558k4666j3491
10812d78671o0985r942K6357J9807N7399O8133l1550l5037L7597J7238j1099m2818
10800d43571p6264K1265M9792L3634m8886m0921K7981K3898o757K3463K8438l6098
10788d44026n7468j1337o7r363j1149k5897j6495P140K3409k439K3414K4849K5310
10775d74119m5768n5885R528j4211M2923N2584L3289k1368R700k712p0562j3548
10763e50149K0181k710o2369p427M1588l0329k7291P54M837K9991J5793k3034
10751e90165k7262m7274J7308J7196j2834M0513K3773m6902l5983M848J2425J8750
$$ plain form
10836 -344796 -365192 -387527 -423461 -424784 -431644 -433340 -383529 -359508 -416908 -395137 -369894 -377798
10824 -377798 -336384 -337898 -378068 -410516 -362851 -361175 -387367 -397288 -405956 -440514 -465180 -478671
10812 -478671 -539656 -549598 -523241 -503434 -446035 -377902 -409452 -444489 -406892 -389654 -400753 -443571
10800 -443571 -519835 -498570 -448778 -415144 -464030 -504951 -476970 -453072 -459829 -436366 -407928 -444026
10788 -444026 -501494 -512831 -512898 -522261 -533410 -559307 -575802 -568662 -545253 -547692 -524278 -499429 -474119
10775 -474119 -519887 -575772 -566244 -580455 -537532 -484948 -451659 -473027 -463327 -466039 -536601 -550149
10763 -550149 -529968 -532678 -595047 -602474 -560886 -591215 -618506 -617752 -612915 -582924 -567131 -590165
10751 -590165 -617427 -664701 -647393 -630197 -643031 -602518 -578745 -625647 -661630 -656782 -644357 -625607
10739f25607k3652P60M1478L8856M650k3961q314J0655j6968O4189K6616k4363
10727e35661j9742j2655k1622J9494o6432m3363J1144m263J161K4966p57K3576
10715f24154l0654j0700M591N679m0120o2820M0614K3801K3911o2817o6619M3156
10703g56132P757m7775M3496j2769n8930J4704L4442n011k0953K209j1693J2412
10691g98243J9237k6034j9426l2215m9657O5737J8779j4793k5796L2939R860k1066
10679h40678n7758l6371q20J2778j5587L0578q1912m6291Q6379j5333n6949L4241
10667i87723j0117j8362L2946O179p2474l1857j6742Q18P3745O1649M7804K9307
10655h84827Q7566L5745L4769m2777m6983m2449J8735Q078j9490l966j0339k2311
$$ plain form
10739 -625607 -649259 -648499 -607021 -568165 -563515 -587476 -595790 -585135 -602103 -537914 -511298 -535661
10727 -535661 -555403 -568058 -589680 -570186 -636618 -679981 -668837 -673100 -671939 -646973 -647730 -624154
10715 -624154 -654808 -665508 -660917 -655238 -695358 -758178 -717564 -693763 -669852 -732669 -799288 -756132
10703 -756132 -748375 -796150 -752654 -765423 -824353 -809649 -775207 -780218 -801171 -798962 -810655 -798243
10691 -798243 -779006 -805040 -824466 -856681 -906338 -840601 -821822 -836615 -862411 -829472 -819612 -840678
10679 -840678 -898436 -934807 -935627 -922849 -938436 -907858 -989770 -1036061 -949682 -965015 -1021964 -987723
10667 -987723 -997840 -1016202 -983256 -977077 -1049551 -1081408 -1098150 -1097332 -1023587 -961938 -914134 -884827
10655 -884827 -797261 -761516 -726747 -769524 -816507 -858956 -840221 -832143 -851633 -855599 -865938 -888249
10643h88249j6736M6139P1998J30437J34288K29016K25159J97204J82196J74691
10633D86143J22856K58875L45347L23674L43093M61736O09962Q95015J239810
10624E086511J558860K080762K636393K991103L047181K657500K397542K288528
10616B4744380K288705K283633K311173K340034K467507K992836L841485M572965
10608D7842718M408766L599405K985001K890697K984224K971599K748700K087737
10600G2518847J571105J747725K818008L817343L649160K684502K011133J908875
10592I2726698J917900J429131L68883j354708l095750l796543l002560j815736
10584H3377315j399992j487571j502905j239012r32034j184400j983268l269511
$$ plain form
10643 -888249 -904985 -858846 -786848 -656411 -522123 -293107 -67948 129256 311452 486143
10633 486143 608999 867874 1213221 1536895 1879988 2341724 2951686 3846701 5086511
10624 5086511 6645371 8726133 11362526 14353629 17400810 20058310 22455852 24744380
10616 24744380 27033085 29316718 31627891 33967925 36435432 39428268 43269753 47842718
10608 47842718 52251484 55850889 58835890 61726587 64710811 67682410 70431110 72518847
10600 72518847 74089952 75837677 78655685 82473028 86122188 88806690 90817823 92726698
10592 92726698 94644598 96073729 96442612 95087904 91992154 88195611 85193051 83377315
10584 83377315 81977323 80489752 78986847 77747835 76815801 75631401 73648133 70378622
10576G0378622m447939m853130m361942l498805k738951k314923k027467j833352
10568D4302113j775537j892931k325682k857345l318727l473710l153273k615940
10560B2888968j981494j474426j167432r75745r24451p86121o21267m92517n46821
10551A3918694o06884o41045p08659o91959o58238m95150m48058m30152l41052
10542H897497l93861k77504k64637k80223k16730k41008k39428k18806j81103
10533F584197k19957k16524j54690j93280j26576j29226q4719r0890r7555j474
10523E269306J361k7285n3539o7549r9995p1097r4485j02395j10588k17007k56733
10512D169994j74668j16034j51446j43671j38318j03818q3198o6163o5958q4886
$$ plain form
10576 70378622 65930683 61077553 56715611 53216806 50477855 48162932 46135465 44302113
10568 44302113 42526576 40633645 38307963 35450618 32131891 28658181 25504908 22888968
10560 22888968 20907474 19433048 18265616 17289871 16365420 15579299 14958032 14465515 13918694
10551 13918694 13311810 12670765 11962106 11270147 10611909 10116759 9668701 9238549 8897497
10542 8897497 8503636 8226132 7961495 7681272 7464542 7223534 6984106 6765300 6584197
10533 6584197 6364240 6147716 5993026 5799746 5673170 5543944 5459225 5368335 5270780 5269306
10523 5269306 5270667 5243382 5189843 5122294 5022299 4951202 4856717 4754322 4643734 4426727 4169994
10512 4169994 3995326 3879292 3727846 3584175 3445857 3342039 3258841 3192678 3126720 3041834
10502C041834r5636k8335j34204j03488m5769o3444o6154n028j023n2388o2977
10491B383388m6446j08714o1328l2690j3978r4136q8120q47m1563p8161l9079
10480A778326k8017q0694q3258m1917J6218n4539r311o3252n8706k0890m0478
10469A313482j9066M929n5736m0573j6471K3503n1853k5648k9895J4258o398n8002
10457A052530k2574O581o3951k8318J5305L730k6123j5154l7188j0758o7286k5350
10445G81444K9901j290K2037j6764R62P452m3948k9759n743q556l0704o596M0901
10432G39337j651n5364n404M7462j9238n6260J8886n2478n0509l0762J5926L9611
10420E89556K5900m2281l8310l6184p9026l9015J3595L3549q344M1204K3699J8879
$$ plain form
10502 3041834 2946198 2917863 2783659 2680171 2634402 2570958 2504804 2499776 2498753 2446365 2383388
10491 2383388 2336942 2228228 2166900 2134210 2120232 2026096 1937976 1937129 1895566 1817405 1778326
10480 1778326 1750309 1669615 1586357 1544440 1560658 1506119 1496808 1433556 1374850 1353960 1313482
10469 1313482 1294416 1299345 1243609 1203036 1186565 1210068 1158215 1132567 1102672 1116930 1110532 1052530
10457 1052530 1029956 1036537 972586 944268 959573 963303 937180 922026 884838 874080 806794 781444
10445 781444 811345 810055 832092 815328 816290 823742 779794 750035 744292 735736 705032 698436 739337
10432 739337 737686 682322 676918 724380 705142 648882 667768 615290 564781 534019 549945 589556
10420 589556 615456 573175 534865 498681 419655 380640 394235 427784 419440 460644 484343 503222
10408E03222m791m9473m6158r676q640K083M3897r890j6115j9415M649J2472K3440
10395D25605l580l3072j3704k5864K8755m0419Q839L2775O4261M3047m4444k5921
10383D16278J5895N1201m1753j3664n792K213n0965o368J5377j5842R755j6204
10371C60131j4638j077k2966j9126M3766Q6114P3072n4806P937m754l7136k4445
10359C92072k0271J3502k2772j9143q81j4950n0092k4212Q2522N1877M1288L2700
10347D61640J066P993K8340J813k2411q1357o3954q4845L2540K2914Q350Q16L485
10334C16390o4544j5455l6657J6276k9686r382J00076Q816k6052k1292l3495k489
10322B02506M3133k3532P2828K2710k3587P626k6948K299j8427q2412j1654j2162
$$ plain form
10408 503222 498431 448958 402800 393124 384484 386567 430464 420574 404459 385044 389693 402165 425605
10395 425605 422025 388953 375249 349385 378140 337721 346560 379335 443596 486643 442199 416278
10383 416278 432173 483374 441621 427957 422165 424378 373413 367045 382422 366580 376335 360131
10371 360131 345493 344416 321450 302324 346090 432204 505276 450470 458407 453653 416517 392072
10359 392072 371801 385303 362531 343388 342507 327557 277465 253253 335775 387652 428940 461640
10347 461640 462706 470699 499039 500852 478441 397084 333130 248285 280825 303739 312089 312905 316390
10334 316390 251846 236391 199734 216010 186324 176942 277018 285834 259782 238490 204995 202506
10322 202506 245639 222107 294935 317645 294058 301684 274736 277035 258608 176196 164542 152380
10310A52380o529l4701P397J3277k9274k8174L0569P0279L0089n1091l6742L265
10298A20745J1818L9679J5955n5887o2660M1336K1607p1101l9333J8872K578K6258
10286F9867K9085k7728r172j4331L2614l5712k2486n5773j4209j30J8193J4390
10274a5392k5818j6588O2973O0619j2429n3056M593O2284l9084K4235M4123j0555
10262H5905J5679M1498N4683k6186O1934P5740N8690N7625O9047J11696K23859
10251H30170L71421M33850N44780O69875Q55036J031475J151414J038458J023413
10242G949892R61046Q36077O15937L34836K2044k16459n03107o85451q60693r39509
10232G514613r36291r29659q69509p23670o29380n41313l98710k41936j77324
$$ plain form
10310 152380 145851 111150 118547 131824 102550 74376 104945 175224 205313 154222 117480 120745
10298 120745 132563 172242 188197 132310 69650 110986 132593 61492 22159 41031 43609 69867
10286 69867 98952 71224 62052 47721 80335 44623 22137 -33636 -47845 -47975 -29782 -15392
10274 -15392 -41210 -57798 5175 65794 53365 309 4902 67186 28102 52337 96460 85905
10262 85905 101584 143082 197765 171579 233513 309253 367943 425568 494615 606311 830170
10251 830170 1201591 1635441 2180221 2850096 3705132 4736607 5888021 6926479 7949892
10242 7949892 8910938 9747015 10362952 10697788 10719832 10503373 10000266 9314815 8454122 7514613
10232 7514613 6578322 5648663 4779154 4055484 3426104 2884791 2486081 2244145 2066821
10223B066821j36693j50148j07667m8024j03434j04057j08151j22915q4429o4831
10213A036472p5704m6353l1312k2445l8491l3845l3008J6228M292l1496p2497
10202F71841l809j1050o5514n9227n333k8472l371K0371L9862M7546j6929o8749
10190E17166m1949l834l6554j4892K3451K2760j7564m4275O7247M2981J6353k800
10178E28090m581j5539l312P2113L1363j7109j6360o1901M7891K6416n173K5029
10166F06927L7763O0275n4723k4416L3844k8017j9361J6203n510J6965J7030L6595
10154F93575J343n6879j5023l8330r046m0799m5372n7355k6773Q034K3082M38
10142D36895K7802K323K4852M0058j7258o0794m5507j4162p052m9757q6186o981
$$ plain form
10223 2066821 1930128 1779980 1672313 1624289 1520855 1416798 1308647 1185732 1101303 1036472
10213 1036472 960768 914415 883103 860658 822167 788322 755314 771542 775834 744338 671841
10202 671841 668032 656982 591468 532241 526908 498436 495065 515436 555298 602844 585915 517166
10190 517166 475217 471383 434829 419937 443388 466148 448584 404309 471556 514537 530890 528090
10178 528090 523509 507970 504658 576771 608134 591025 574665 512764 560655 587071 581898 606927
10166 606927 644690 704965 650242 625826 659670 631653 612292 628495 622985 639950 656980 693575
10154 693575 694918 638039 623016 584686 575640 534841 489469 432114 405341 413375 436457 436895
10142 436895 464697 467020 491872 531930 514672 453878 408371 394209 387157 337400 251214 244233
10130B44233P48j4615K4673l458k0629L391j3718p1264K668l7245P774k6883o6108
10117B9567J5112J2404M9992k2503p1320J8639N5326J795l66j702J0448n2692
10105D4700j7240K3434k0880j0926J2461k6875K6956N2613j6450k6386o980n870
10093B8557j6503j5545j0503m9452r930L8298M8811o989K0776l8699l1726K4581
10081a8324r761J9244Q697K1421q898j3647l3634l8107n0572k3771K5829N9409
10069f2114O1337N1775K9786q143M84m249p8155n0708M2700M3627K4135l6598
10057A3877o2177K3340r078J749L198L5090l127j4456j1635k1120j9308r375K1356
$$ plain form
10130 244233 244981 230366 255039 251581 230952 234343 220625 149361 152029 114784 122558 95675 29567
10117 29567 44679 57083 107075 84572 13252 31891 87217 89012 88646 86944 97392 44700
10105 44700 27460 50894 30014 19088 31549 4674 31630 84243 67793 41407 34427 28557
10093 28557 12054 -3491 -13994 -63446 -73376 -35078 13733 6744 27520 -11179 -42905 -18324
10081 -18324 -28085 -8841 -144 21277 12379 -1268 -34902 -73009 -123581 -147352 -121523 -62114
10069 -62114 -777 50998 80784 72641 73125 68876 -9279 -59987 -17287 26340 50475 13877
10057 13877 -48300 -24960 -34038 -32289 -29091 5999 2872 -11584 -23219 -44339 -63647 -73022 -51666
$$ [...]
##END NTUPLES=NMR SPECTRUM
##END=
