##TITLE=Analysis number 321139
Compound Code cc 44213
Book Reference 468/121
Project Code adrs
Chemist Name colinb
##JCAMPDX= 6.0         $$ Bruker NMR JCAMP-DX V2.0
##DATA TYPE= NMR SPECTRUM
##DATA CLASS= NTUPLES
##ORIGIN= Bruker BioSpin GmbH
##OWNER= nmr
$$ XWIN-NMR		Version 3.5
$$ Wed Jul 26 11:22:29 2006 GMT Daylight Time (UT+1h)  MAYBRIDGE\nmr@NMR_250MHZ
##.OBSERVE FREQUENCY= 250.131544655141
##.OBSERVE NUCLEUS= ^1H
##.ACQUISITION MODE= SIMULTANEOUS (DQD)
##.ACQUISITION SCHEME= undefined
##.AVERAGES= 16
##.DIGITISER RES= 18
##SPECTROMETER/DATA SYSTEM= dpx250
##.PULSE SEQUENCE= zg30
##.SOLVENT NAME= CDCl3
##.SHIFT REFERENCE= (INTERNAL, CDCl3, 0, 16.522)
##AUDIT TRAIL= $$ (NUMBER, WHEN, WHO, WHERE, WHAT)
$$ ##TITLE= Audit trail, XWIN-NMR		Version 3.5
$$ ##JCAMPDX= 5.01
$$ ##ORIGIN= Bruker BioSpin GmbH
$$ ##OWNER= nmr
$$ C:\u/data/dgb/nmr/ADRS/3620/pdata/1/auditp.txt
$$ ##AUDIT TRAIL=  $$ (NUMBER, WHEN, WHO, WHERE, WHAT)
(   1,<2006-07-26 11:22:03.29 +100>,<MAYBRIDGE\nmr>,<NMR_250MHZ>,
      <created by zg, POWCHK disabled, PULCHK disabled
       configuration hash MD5:
       E2 DF 36 D8 04 B2 41 60 5A D7 A3 38 5A 4B D0 FE
       data hash MD5: 64K
       09 C2 A5 2D 3C BB 37 05 3E 2A 60 FC 8A 7D F0 84>)
(   2,<2006-07-26 11:22:19.51 +100>,<MAYBRIDGE\nmr>,<NMR_250MHZ>,
      <Start of raw data processing
       ef LB = 0.3 FT_mod = 6 PKNL = 1 SI = 32K 
       data hash MD5: 32K
       E8 CA 6F 93 9E 08 07 6F 5D 35 83 E5 B7 22 CF B6>)
(   3,<2006-07-26 11:22:21.07 +100>,<MAYBRIDGE\nmr>,<NMR_250MHZ>,
      <apk 
       data hash MD5: 32K
       79 BB 6D A7 D7 5A F8 5E 9F 3D E8 1C 58 38 B7 64>)
(   4,<2006-07-26 11:22:21.82 +100>,<MAYBRIDGE\nmr>,<NMR_250MHZ>,
      <abs ABSG = 5 
       data hash MD5: 32K
       54 9C 60 84 81 5B B3 57 CD 33 18 DC CB 8E F9 CA>)
$$ ##END=
$$ 
$$ hash MD5
$$ B5 C7 BB A4 18 A9 04 6D D4 F3 94 53 8F 40 F5 B2
##$RELAX= 
##$RELAX= 
##$RELAX= 
##$RELAX= 
##$RELAX= 
##$RELAX= 
##$RELAX= 
$$ Bruker specific parameters
$$ --------------------------
##$DU= <C:\u>
##$EXPNO= 3620
##$NAME= <ADRS>
##$PROCNO= 1
##$TYPE= <nmr>
##$USER= <dgb>
##$AMP= (0..31)
100 100 100 100 100 100 100 100 100 100 100 100 100 100 100 100 100 100 
100 100 100 100 100 100 100 100 100 100 100 100 100 100 
##$AQSEQ= 0
##$AQ_mod= 3
##$AUNM= <au_zg>
##$AUTOPOS= <19 >
##$BF1= 250.13
##$BF2= 250.13
##$BF3= 250.13
##$BF4= 250.13
##$BF5= 500.13
##$BF6= 500.13
##$BF7= 500.13
##$BF8= 500.13
##$BYTORDA= 1
##$CFDGTYP= 0
##$CFRGTYP= 5
##$CHEMSTR= <none>
##$CNST= (0..31)
1 1 145 1 1 1 1 1 1 1 1 1 1 1 1 1 1 1 1 1 1 1 1 1 1 1 1 1 1 1 1 1 
##$CPDPRG= <>
##$CPDPRG1= <>
##$CPDPRG2= <>
##$CPDPRG3= <>
##$CPDPRG4= <mlev>
##$CPDPRG5= <mlev>
##$CPDPRG6= <mlev>
##$CPDPRG7= <mlev>
##$CPDPRG8= <mlev>
##$CPDPRGB= <>
##$CPDPRGT= <>
##$D= (0..31)
0 1 0 0 0 0 0 0 0 0.06 0 0 0 0 0 0 0.0002 0 0 0 0 0 0 0 0 0 0 0 0 0 0 
0 
##$DATE= 1153909322
##$DBL= (0..7)
120 120 120 120 120 120 120 120 
##$DBP= (0..7)
150 150 150 150 150 150 150 150 
##$DBP07= 0
##$DBPNAM0= <>
##$DBPNAM1= <>
$$ [...]
##$SUBNAM7= <"">
##$SUBNAM8= <"">
##$SUBNAM9= <"">
##$SW= 20.6930455092707
##$SWIBOX= (0..15)
0 0 3 0 0 0 0 0 0 0 0 0 0 0 0 0 
##$SW_h= 5175.983436853
##$TD= 65536
##$TD0= 1
##$TE= 295.16
##$TE2= 300
##$TE3= 300
##$TEG= 300
##$TL= (0..7)
0 120 120 120 120 120 120 120 
##$TP= (0..7)
150 150 150 150 150 150 150 150 
##$TP07= 0
##$TPNAME0= <>
##$TPNAME1= <>
##$TPNAME2= <>
##$TPNAME3= <>
##$TPNAME4= <>
##$TPNAME5= <>
##$TPNAME6= <>
##$TPNAME7= <>
##$TPOAL= (0..7)
0.5 0.5 0.5 0.5 0.5 0.5 0.5 0.5 
##$TPOFFS= (0..7)
0 0 0 0 0 0 0 0 
##$TUNHIN= 0
##$TUNHOUT= 0
##$TUNXOUT= 0
##$USERA1= <user>
##$USERA2= <user>
##$USERA3= <user>
##$USERA4= <user>
##$USERA5= <user>
##$V9= 5
##$VALIST= <valist>
##$VCLIST= <CCCCCCCCCCCCCCC>
##$VD= 0
##$VDLIST= <DDDDDDDDDDDDDDD>
##$VPLIST= <PPPPPPPPPPPPPPP>
##$VTLIST= <TTTTTTTTTTTTTTT>
##$WBST= 1024
##$WBSW= 4
##$XGAIN= (0..3)
0 0 0 0 
##$XL= 0
##$YL= 0
##$YMAX_a= 286857
##$YMIN_a= -442423
##$ZGOPTNS= <>
##$ZL1= 120
##$ZL2= 120
##$ZL3= 120
##$ZL4= 120
##$ABSF1= 16.522
##$ABSF2= -4.171173
##$ABSG= 5
##$ABSL= 3
##$ALPHA= 0
##$AQORDER= 0
##$ASSFAC= 0
##$ASSFACI= 0
##$ASSFACX= 0
##$ASSWID= 0
##$AUNMP= <proc_1d>
##$AZFE= 0.1
##$AZFW= 0.1
##$BCFW= 0
##$BC_mod= 0
##$BYTORDP= 0
##$COROFFS= 0
##$CY= 12.5
##$DATMOD= 1
##$DC= 0
##$DFILT= <>
##$DTYPP= 0
##$F1P= 14.0000005364418
##$F2P= -0.99999901652339
##$FCOR= 0.5
##$FTSIZE= 32768
##$FT_mod= 6
##$GAMMA= 0
##$GB= 0
##$INTBC= 1
##$INTSCL= 1
##$ISEN= 128
##$LB= 0.3
##$LEV0= 0
##$LPBIN= 0
##$MAXI= 10000
##$MC2= 0
##$MEAN= 0
##$ME_mod= 0
##$MI= 0
##$NCOEF= 0
##$NC_proc= -4
##$NLEV= 6
##$NOISF1= 0
##$NOISF2= 0
##$NSP= 0
##$NTH_PI= 0
##$NZP= 0
##$OFFSET= 16.522
##$PC= 1
##$PHC0= 169.7834
##$PHC1= 5.653118
##$PH_mod= 1
##$PKNL= yes
##$PPARMOD= 0
##$PSCAL= 4
##$PSIGN= 0
##$REVERSE= no
##$SF= 250.13
##$SI= 32768
##$SIGF1= 0
##$SIGF2= 0
##$SINO= 400
##$SIOLD= 32768
##$SREGLST= <1H.CDCl3>
##$SSB= 0
##$STSI= 32768
##$STSR= 0
##$SW_p= 5175.98343685301
##$SYMM= 0
##$S_DEV= 0
##$TDeff= 65536
##$TDoff= 0
##$TI= <Analysis number 999999
Compound Code 99
Book Reference 9
Project Code 9>
##$TILT= no
##$TM1= 0
##$TM2= 0
##$TOPLEV= 0
##$USERP1= <user>
##$USERP2= <user>
##$USERP3= <user>
##$USERP4= <user>
##$USERP5= <user>
##$WDW= 1
##$XDIM= 32768
##$YMAX_p= 373638741
##$YMIN_p= -485431
$$ End of Bruker specific parameters
$$ ---------------------------------
##NTUPLES= NMR SPECTRUM
##VAR_NAME=  FREQUENCY,     SPECTRUM/REAL,   SPECTRUM/IMAG
##SYMBOL=    X,             R,               I
##VAR_TYPE=  INDEPENDENT,   DEPENDENT,       DEPENDENT
##VAR_FORM=  AFFN,          ASDF,            ASDF
##VAR_DIM=   32768,         32768,           32768
##UNITS=     HZ,            ARBITRARY UNITS, ARBITRARY UNITS
##FACTOR=    0.157963299565203, 1,           1
##FIRST=     4132.6476996994, 0,             0
##LAST=      -1043.33573715361, 0,           0
##MIN=       -1043.33573715361, -485431,     0
##MAX=       4132.6476996994, 373638741,     0
$$ Real data points
##PAGE= N=1
##DATA TABLE= (X++(R..R)), XYDATA
$$ [...]
17908F18922P34l9507j38720m2857J01128Q946o1719l6939L1373P9083n8256p0555
17896C91633R9032J20092K2647k9555p1951j32374L3310J27834J1045l1559M350
17885E44504J00284L6237K8979M969j8483O520O2150R0239P0625j08031K5884
17874H43877k981j29300j647Q2847M5641J41128l5246P668J27893O8048m895k298
17862A140735j9061p7087J4477J4664L8692J24689J21751J57604Q9722J7129K07175
17851A830490J57754N924l624P2480N8605M2926K71129J53015M2502J32301J89464
17840B952966J27947J86599L28376L26266K99789L18633L53495L54481M46377
17831E694929M44337M16655M00773N80097P07057Q53284R95408J497004J910654
$$ y = [618922, 619656, 580149, 441429, 398572, 499700, 508646, 446927, 409988, 441361, 520444, 462188, 391633, 490665, 610757, 633404, 603849, 531898, 399524, 432834, 560668, 571713, 540154, 544504, 644788, 681025, 710004, 714973, 696490, 703010, 765160, 855399, 926024, 817993, 843877, 840896, 711596, 709949, 792796, 838437, 979565, 944319, 951987, 1079880, 1147928, 1143033, 1140735, 1121674, 1044587, 1059064, 1073728, 1112420, 1237109, 1358860, 1516464, 1606186, 1623315, 1830490, 1988244, 1994168, 1990544, 2063024, 2121629, 2164555, 2435684, 2588699, 2631201, 2763502, 2952966, 3080913, 3267512, 3595888, 3922154, 4221943, 4540576, 4894071, 5248552, 5694929, 6139266, 6555921, 6956694, 7536791, 8243848, 9097132, 10092540, 11589544, 13500198]
17822A3500198K548502L306779L780400L926958M190792L488655K228596J311464
17814C8282344N56502K4087l55629l71813j02106L95265M46205k37163q83147
17805C7754545j602449k167899k792172l575897l606758l339263k977767k378681
17797A5313659j604603j019509n99489l44331l60416j60646j1942j2457j2688
17788A1187578K46034L56058M08306M15563M46977N09471O14570O04550O52312
17779A5441419O95303P42023Q41865R67929J292056J770770K254969L017378M068867
17770C1092579N504422P171582R149195J1131857J1631307R825007O651962L381111
17762I5539022J53039k336894m482668o480605p068998o584589n768993m540891
$$ y = [13500198, 16048700, 19355479, 23135879, 27062837, 31253629, 34742284, 36970880, 38282344, 38838846, 38862933, 38507304, 38135491, 38033385, 38428650, 38874855, 38637692, 37754545, 36152096, 33984197, 31192025, 27616128, 24009370, 20670107, 17692340, 15313659, 13709056, 12689547, 12090058, 11745727, 11385311, 11224665, 11212723, 11200266, 11187578, 11433612, 11789670, 12197976, 12613539, 13060516, 13569987, 14184557, 14789107, 15441419, 16136722, 16878745, 17720610, 18688539, 19980595, 21751365, 24006334, 27023712, 31092579, 36597001, 43768583, 52917778, 64049635, 75680942, 85505949, 92157911, 95539022, 95692061, 93355167, 88872499, 82391894, 75322896, 68738307, 62969314, 58428423]
17754E8428423l417925k825569k358066k026883j140310P86709L126686N146601
17746E5719666O331314N533315L186531M99378j798492l844784o001051p877180
17738E1748697q652064p847034o341939m594887l276820k330030j602182j211034
17730A5892707j061856q55741q52122p59189m75032m08305m58724m41770m01490
17721A0178478k94149l76689l45133k98548m97956l05969l23270n03747j83741
17712G049276j27324l41985m09198k69173j52433j20407l10056k52295j10440
17703D955965j08622k63148k51216J0821j35800j50420p9002j17375q0114k03647
17693C577442k83354q0730j7868j21341j84090n9141p0776k49690n8446j3346
$$ y = [58428423, 55010498, 52184929, 49826863, 47799980, 46659670, 47446379, 50573065, 55719666, 62050980, 67584295, 70770826, 71270204, 69471712, 65626928, 59625877, 51748697, 43096633, 35249599, 28907660, 24312773, 21035953, 18705923, 17103741, 15892707, 14830851, 13975110, 13122988, 12363799, 11888767, 11480462, 11021738, 10579968, 10178478, 9884329, 9507640, 9162507, 8863959, 8366003, 8060034, 7736764, 7233017, 7049276, 6921952, 6579967, 6170769, 5901596, 5749163, 5628756, 5318700, 5066405, 4955965, 4847343, 4584195, 4332979, 4343800, 4208000, 4057580, 3978578, 3861203, 3781089, 3577442, 3294088, 3213358, 3195490, 3074149, 2890059, 2830918, 2760142, 2510452, 2452006, 2438660]
17683B438660j10570o3875J7198L6651n2207j79923k24756l788Q4230J09480J00769
17672B151869p319k05383j35918j8610K6060q2934o0539L7009J732p0809N8998
17661A694156R968n1939r3881J5834j08425j30833L9764j1957l4034q6191j09736
17650A132726Q267l7413p5444j15051n0881j1373J20070N975M3857K243j5673
17639A007303p4106p8911r3214l7995k4457l6103J3338l7478J0951o7340l9118
17628E42870l1758j15926K5620j46810k2759J68991O2638n6122j6148j4242j4116
17617C82238n3022j07071J2815J4749Q417k9972j47082P919J09859k3424r138
17606A66288m2218m6934n7808Q8653l5531L2466J05995M9289Q9923o9215j24163
$$ y = [2438660, 2328090, 2264215, 2281413, 2318064, 2265857, 2085934, 1861178, 1857390, 1941620, 2051100, 2151869, 2144550, 1939167, 1803249, 1784639, 1810699, 1727765, 1667226, 1704235, 1705967, 1635158, 1694156, 1704124, 1652185, 1558304, 1574138, 1465713, 1334880, 1374644, 1362687, 1328653, 1242462, 1132726, 1140993, 1103580, 1028136, 913085, 862204, 850831, 970901, 976876, 1020733, 1022976, 1007303, 933197, 854286, 761072, 723077, 698620, 662517, 675855, 638377, 649328, 581988, 542870, 511112, 395186, 420806, 273996, 251237, 420228, 482866, 426744, 410596, 396354, 382238, 329216, 222145, 234960, 249709, 258126, 228154, 81072, 88991, 198850, 175426, 166288, 124070, 77136, 19328, 107981, 72450, 104916, 210911, 260200, 350123, 280908, 156745]
17595A56745k4255R2644L9841J3485o3279K3600J05632j14003p0910j3626K6340
17584A72214O8742O9626m5772m2217k08891j20330m4722J733J21698m547k7027
17573e9493J06921R770p1544K4988O5572O2080N7781K8922l1410j00125n4218
17562C9244J5150m0801k1178l1737L8605n5852n029P2492k2710J25244N3626n2086
17550A14968m5503P069Q076j33524J11702J54646O8744N219j38906j10963J19595
17539A61123q9085o8422m0024M3197n536M5647O4361m9494J5603p384R2012J1537
17527A73535M086J1306l0201Q9668n5301l1470N6258P5734P5473M1313j93590
17516B16811l9305Q2073r2658j90040K5376l1294j47747M2441Q6588O0018M0977
$$ y = [156745, 132490, 225134, 264975, 278460, 215181, 238781, 344413, 230410, 159500, 145874, 172214, 240956, 310582, 264810, 222593, 13702, -106628, -151350, -149617, -27919, -32466, -59493, 47428, 57198, -14346, 10642, 76214, 138294, 196075, 224997, 193587, 93462, 39244, 54394, 13593, -7585, -39322, -717, -56569, -61598, 10894, -11816, 113428, 167054, 114968, 69465, 76534, 84610, -48914, 62788, 217434, 286178, 291397, 152491, 41528, 161123, 72038, 3616, -36408, 6789, 1253, 46900, 111261, 61767, 77370, 69986, 161998, 173535, 177621, 188927, 158726, 248394, 193093, 161623, 217881, 293615, 369088, 410401, 216811, 177506, 259579, 166921, -23119, 2257, -29037, -176784, -134343, -47755, 12263, 53240]
17505E3240P4644J3666J5985j11428n3603O0810J2554l4008R0906q638o1769n73
17493E1786J40499j840o7184l8450m1392r4055n3370K739l3683K697J62366J39600
17481A69713p9744p9666M8964M437m7553M5363M1242q1871j01399Q0485O6138
17470F6109o9975n9016m6081J1003Q1240J38269k3247p7853J14449L0199j2803
17459A52294l1448o4740P550P7437J18982r1853j02576L279Q0351J27631M8807
17448C25714k0968K5450N3820J3286P825R0358j1496p4768m1845j02102j06747
17437A58527j5104J17047o7906j51038j05218J48331M9406L1976l7291J00379
17427B29109l8551j0901j2838j07595O1424J16259N4458q8898M1599L7324l2589
$$ y = [53240, 127884, 141550, 157535, 46107, -7496, 53314, 65868, 31860, 122766, 114128, 52359, 51786, 192285, 190445, 123261, 84811, 43419, -50636, -104006, -101267, -134950, -132253, 30113, 169713, 89969, 10303, 59267, 63704, 16151, 61514, 102756, 20885, -80514, -29, 66109, -3866, -62882, -108963, -97960, -16720, 121549, 98302, 20449, 134898, 165097, 152294, 120846, 56106, 63656, 141093, 260075, 168222, 65646, 68925, 149276, 276907, 325714, 304746, 330196, 384016, 397302, 405127, 495485, 483989, 409221, 367376, 265274, 158527, 143423, 260470, 192564, 41526, -63692, 84639, 134045, 166021, 128730, 229109, 190558, 179657, 166819, 59224, 120648, 236907, 291365, 202467, 244066, 281390, 248801]
17416B48801Q14o7562l4120j23645r0646R7504J66279J5148o5516K3864M0817
17405B11738O4310O1349N1998J1445k4250l4241k0020P8915m7668j09159K7290
17394B71707m9874l1962J45867P580j10966j0957M9139n23k6693o6555J24037
17383C00800K22049P5522J15527o448l7446J6410j42896q6353k4477J0221k8109
17372D14800j59005j49418o4871l9542r1156p0584k1416M7631N3939N6047J27142
17361A03567L0014k0660j23626p3086J60637P55l8511L8409j03136J2967J7607
17350D937n0259p112n7176N9587J30749J00898p958j4443J9006l4686P694q207
17338A43030k1838j13855q5776N5840l5759J05471P6576j36479m7491p7525j02290
$$ y = [248801, 249615, 182053, 147933, 24288, -66358, 31146, 197425, 212573, 147057, 170921, 211738, 276048, 337397, 389395, 400840, 376590, 342349, 322329, 401244, 353576, 244417, 271707, 221833, 189871, 335738, 343318, 232352, 221395, 270534, 270011, 243318, 176763, 300800, 522849, 598371, 713898, 707450, 670004, 686414, 543518, 457165, 432688, 442909, 414800, 255795, 106377, 41506, 1964, -89192, -159776, -181192, -133561, -79622, -23575, 103567, 133581, 112921, -10705, -83791, 76846, 77601, 39090, 77499, -25637, -12670, 4937, -45322, -52434, -109610, -50023, 80726, 181624, 173666, 159223, 178229, 143543, 151237, 143030, 121192, 7337, -78439, -22599, -58358, 47113, 123689, -12790, -60281, -137806, -240096]
17327b40096M1060K23066J54649R7406O1694j11664j7562n0628n552m8758J9980
17316A23595O7232O4369p8922n8272J31706R6116j69043k2121q575K9716J1653
17305A87454k2714O2122o7249j42054p7563l907P179q6161M118J15738m6994K4330
17293d5701p2098M3839L4475k241n1897o0467J0913N8240R6064M3406l925n9928
17281i320N320P7602j36783n439k7383N5023O4262j04902Q0118J10332R0414o1202
17269A38042j99144j1037O145M0513K4538j8899O0745p3726j0201J20093J27861
17258B04930p6445n0063r4889j0136J31387n7373L2773M2654q5936j04223J05243
17247C7922l486J06840J5869r1039j15211m8496m2942m527J37662Q3441J14192
$$ y = [-240096, -199036, 24030, 178679, 276085, 337779, 226115, 208553, 157925, 152373, 103615, 123595, 190827, 255196, 176274, 118002, 249708, 345824, 176781, 154660, 146085, 175801, 187454, 164740, 226862, 159613, 17559, -60004, -63911, -56732, -142893, -138775, -23037, -70031, -45701, -117799, -73960, -39485, -41726, -93623, -154090, -143177, -84937, 11127, 54533, 50608, -9320, -4000, 73602, -63181, -68620, -96003, -40980, 23282, -81620, -1502, 108830, 199244, 138042, -61102, -72139, -65994, -25481, -943, -19842, 40903, -32823, -43024, 77069, 204930, 128485, 78422, -16467, -26603, 104784, 47411, 80184, 122838, 36902, -67321, 37922, 34436, 141276, 157145, 66106, -49105, -97601, -140543, -145070, -7408, 76033, 190225]
17236A90225n2110j39861l5705o3385O1243L3608j10513L860L6889j608r2636
17225a69993J4750Q3978l8739K4273J23474k0314n8797Q817K4545n9256m2306
17214a09568n5736K7653J09303k1909j25386N0200M9400O4214M1260j14250J9754
17203f5065Q8823J79888L1570q8096n0108n2317k9220j5397p0982l3600J63817
17192E9313J36291K8923q6753l5909K3621K9215R4555M0250k8187r532j29981
17181A21806J5947J14397o9500L0853M7454q8029j07389k6145l6843l3306J31335
17170A00580O0784Q3196P1312Q1763J3429l5432L6120m2759J9985j3279r9612
17159B76087j80304j02265P6304n2894m67N6032j1783q6949n4675K950M3467j03485
$$ y = [190225, 138115, -1746, -37451, -100836, -39593, -5985, -116498, -112638, -75749, -77357, -169993, -155243, -71265, -110004, -85731, 37743, 17429, -41368, -32551, -8006, -67262, -109568, -165304, -137651, -28348, -50257, -175643, -125443, -76043, -11829, 29431, -84819, -65065, 23758, 203646, 235216, 147120, 97012, 44695, 15475, 78, -70904, -104504, 59313, 195604, 224527, 137774, 101865, 125486, 154701, 249256, 289506, 261319, 251787, 121806, 137753, 252150, 182650, 213503, 260957, 172928, 65539, 39394, 2551, -30755, 100580, 161364, 244560, 315872, 397635, 411064, 375632, 411752, 368993, 388978, 375699, 276087, 95783, -6482, 69822, 16928, 16461, 72493, 60710, -26239, -80914, -77964, -34497, -137982]
17147a37982J52048K85514l6272k22784j06846J21408M6160l2243P8923N8264
17137B06190n0610l6020k6348j54427j55912K38265Q0057o4542n5095q8387n254
17126a12083P7842J18999J05161o2482P9494J4854j9735j1558j9284p0188M8194
17115A49214K4593j10231q2490J3725O2422r3296l8884M6800L9362L4293r287
17104C6221M393n1566o8706l9856Q0339J59013j7692L2932K8684o5653j35239
17093c7130m1058Q2258K3741o2999L7103K6668q8174l619P1108J5414O398l8543
17081h833K1612N2752J54232j36960L9118L1189p6442q9105o3561J9549O1672
17070E223J66670M1445j33114p3174j14865n7621O2362K3033n329N5977R0010
$$ y = [-137982, 14066, 299580, 263308, 40524, -66322, 55086, 101246, 69003, 147926, 206190, 155580, 119560, 93212, -61215, -217127, 21138, 101195, 36653, -18442, -106829, -112083, -34241, 84758, 189919, 127437, 206931, 221785, 202050, 190492, 171208, 101020, 149214, 173807, 63576, -18914, -5189, 57233, -36063, -74947, -28147, 11215, 45508, 36221, 40614, -10952, -79658, -119514, -39175, 119838, 102146, 135078, 163762, 98109, -37130, -78188, 4070, 27811, -35188, 1915, 28583, -59591, -63210, 7898, 23312, 29710, -8833, 12779, 65531, 219763, 82803, 121921, 153110, 76668, -12437, -75998, -56449, 5223, 171893, 213338, 80224, 7050, -107815, -165436, -103074, -80041, -85370, -29393, 60617]
17059F0617j005j59392q3312k8895J32764J29171P85p8202R9362P3257j4375k1470
17047A09305j25766k6617N939j0054q7255j15594N2099K7267l4756M5165K6931
17036a33336L9009M9440J35126m4501o2020k8008O5230J76442M2387r1840l6648
17025A11281l3757J9435R359O220j3181l6924o0047n706O8096O1282J3773M8212
17013A88043q045p5377l4912K8922L4917j5715q1054J6055O4003j34607p7611
17002i5381M5112K63313k2948j06262n6511j28635J4431J83623K546L080j50110
16991d7742O1617J07304l0420J30312N0350k3860k08437r5468J03786P6725l762
16980A20405J36455P830j528m7957o8733j3768j13794j03878K255N7347K8496
$$ y = [60617, 59612, -99780, -183092, -211987, -79223, 49948, 50733, -27469, 71893, 145150, 130775, 109305, -16461, -43078, -37139, -47193, -134448, -250042, -197943, -170676, -205432, -160267, -133336, -94327, -44887, 90239, 45738, -16282, -44290, 20940, 197382, 239769, 147929, 111281, 77524, 96959, 106318, 112538, 99357, 62433, 2386, -3320, 64776, 126058, 139831, 188043, 179998, 104621, 69709, 98631, 133548, 117833, 36779, 52834, 116837, -17770, -95381, -50269, 213044, 190096, 83834, 27323, -101312, -86881, 96742, 99288, 102368, -47742, 13875, 121179, 90759, 221071, 271421, 247561, 39124, -56344, 47442, 124167, 120405, 256860, 264690, 263162, 215205, 146472, 132704, 18910, -84968, -82713, -25366, 3130]
16969C130q918o9500L6838L1229J04184N5366J3133R589Q5748L1651L5749K3472
16957C51671j6686L6579n7464l6973M9887J49622O6419l6668m9657m0582J9515
16946D35663m3978q3834j19469N0638J74297l6655J20746N0872n8321R0069p6186
16935E03842j8808N0375n2474l6020q3265J8609M7045J850j8370l0463o3325l9291
16923B79705N6301N9851J5848K2333O7656O8301J37982k7557k8901n709J45027
16912G90837J04369l0709M9160L7210l9566j19671q4787Q7695P3040P3168J00064
16901A040810J29774P6205L4065K2478K1179q4825M0577K75756K49125k669r1337
16890A711138R7177J68477J32579P4729J58938J62940K40908J70127J81278J23316
$$ y = [3130, -5788, -75288, -38450, -7221, 96963, 152329, 165462, 175051, 260799, 292450, 328199, 351671, 334985, 371564, 314100, 277127, 327014, 476636, 543055, 506387, 456730, 416148, 435663, 391685, 307851, 188382, 239020, 413317, 376662, 497408, 548280, 489959, 580028, 503842, 485034, 535409, 482935, 446915, 363650, 382259, 429304, 431154, 412784, 382321, 318996, 279705, 336006, 395857, 411705, 434038, 501694, 569995, 707977, 680420, 651519, 645810, 790837, 895206, 864497, 913657, 950867, 911301, 791630, 706843, 794538, 867578, 940746, 1040810, 1170584, 1246789, 1280854, 1303332, 1324511, 1239686, 1280263, 1556019, 1805144, 1802475, 1711138, 1808315, 1976792, 2109371, 2184100, 2343038, 2505978, 2746886, 2917013, 3098291, 3221607]
16880C221607P4897L28591M19819K03552L10179M24781M58790N53817O12691M92112
16870G100836L92896M65074O89790Q09090Q34389R17204J378156J724804K185563
16861A6497802L175426M791714O658011O587450M392592K516667K993136M394510
16853E2007308M006039P57971l316238m600792l402093k451811l457173m977713
16845C4565498m868717l249541j361332K59878K197433M206296N724480N003155
16837D2477150K538498J425324K416482L619709K568525j481846m794402m825160
16829D3944280l534261l258437m741793o045484n307785l734670k581664j751626
16821A2988560j321806r75055o62206n24259m62509k98339m24713m47187n22670
$$ y = [3221607, 3296504, 3625095, 4044914, 4248466, 4558645, 4983426, 5442216, 5996033, 6608724, 7100836, 7493732, 7958806, 8648596, 9457686, 10292075, 11209279, 12587435, 14312239, 16497802, 19673228, 24464942, 31122953, 37710403, 42102995, 44619662, 47612798, 52007308, 56013347, 56771318, 53455080, 48854288, 45452195, 43000384, 39543211, 34565498, 29696781, 26447240, 25085908, 25345786, 27543219, 31749515, 37473995, 42477150, 45015648, 46440972, 48857454, 52477163, 55045688, 53563842, 48769440, 43944280, 40410019, 37151582, 32409789, 26364305, 21056520, 17321850, 14740186, 12988560, 11666754, 10691699, 10029493, 9505234, 9042725, 8744386, 8319673, 7872486, 7349816]
16812G349816l81192l38565k69911k42844k10007j71977j59608j38613k29622
16803E207477l49980k38962j59172j42974j95804j62664n6064k12473j81081j34304
16793C373999j57097j76504n3420j46863k22455k14555r0248o0633o6529K1715
16783B207410J788k1779J3963o9340j83135j614Q6881q4155N4064l5337j34179
16772A834567j03175j92756m1209j40118p2898l6850J88815J0029j53240n9730
16762A233435j60180r3176K474J33057L4222o2164o6161q0613n3693m6955r8116
16751G42130j44478j1113Q3991P3958j01123j76567q157N7937L1365J55396K2465
16740G25804p2431J17841P1651j03565n741m8125p6053l4598q7432L4719R0002
$$ y = [7349816, 6968624, 6630059, 6360148, 6117304, 5907297, 5735320, 5575712, 5437099, 5207477, 4857497, 4618535, 4459363, 4316389, 4120585, 3957921, 3901857, 3689384, 3508303, 3373999, 3216902, 3040398, 2986978, 2840115, 2617660, 2403105, 2312857, 2252224, 2185695, 2207410, 2209198, 2187419, 2201382, 2132042, 1948907, 1947293, 2034174, 1950019, 2004083, 1968746, 1834567, 1731392, 1538636, 1497427, 1357309, 1284411, 1247561, 1436376, 1446405, 1293165, 1233435, 1073255, 980079, 982553, 1115610, 1149832, 1087668, 1021507, 940894, 887201, 840246, 742130, 597652, 586539, 670530, 744488, 643365, 466798, 458641, 516578, 547943, 703339, 725804, 653373, 771214, 842865, 739300, 733559, 685434, 609381, 574783, 487351, 522070, 612072]
16729F12072r5625m5448N3663P3840p1322p5731k2230r1003q2577p5961J9139
16718A98817P8912Q6118N4560n7355O0466R5476o0607j30718n256j23893l0301
16707A66219P676P9621R847j06932k1603L060m8325n8324O266k0830k5208P7771
16695F9238j6810p322O7130J62064m854r6846N6236R0199j46768k5119o8653j31576
16683e3081N1683J03458m2055R8642q856n1932N8907Q8404j22444j51614P646
16672b1242R919Q3652Q8461Q6907K5236l9904K3600m9145r2072M5025J22414j7689
16660B65162j78916q9152J02326k9856j23659J065J5757N5743m0197N0683N3165
16649H2121O0229m2145k956K5035O0807n1117q669K7711j26243j21569O4723O1382
$$ y = [612072, 516447, 470999, 524662, 598502, 527180, 451449, 429219, 338216, 255639, 179678, 198817, 277729, 363847, 418407, 361052, 421518, 516994, 456387, 325669, 320413, 196520, 166219, 173895, 253516, 263363, 156431, 134828, 137888, 89563, 31239, 37505, 16675, -8533, 69238, 52428, 45106, 112236, 274300, 269446, 172600, 228836, 319035, 172267, 147148, 78495, -53081, -1398, 102060, 60005, 158647, 149791, 97859, 156766, 245170, 122726, -28888, -21242, -11323, 72329, 160790, 247697, 272933, 233029, 256629, 207484, 115412, 160437, 282851, 265162, 86246, -2906, 99420, 69564, -54095, -53030, -37273, 18470, -21727, 28956, 82121, 142350, 100205, 97249, 122284, 183091, 131974, 123305, 151016, 24773, -96796, -32073, 29309]
16637B9309M4795n9895J6813l1390R891K4180k7184m429k0733J14030p5634n9447
16625c9694Q6299j8493L4233n3166J69478O4542k0239L438M7978m6986j35351
16614I2039L4528j47960o5594K4703M2782r575n3623P6302O532K7239N1l584j8108
16601E732l1829N2604K0483k9409K5682N9317q1083K8518M5155p1731k1001m8332
16589d5894k5273j6873j34042J23047Q4040o1066m9344Q2194n6202n9914j8480
16578a77807J2594J20057J4983M6445K0331k0612L218K3319J2387K9788n883l6555
16566D2265p0764q7294K811J01120M4161n122Q9167J554j29635r310p5815L0047
16554f6815l1582J6051k6455l099J05443l8287j1157M1054n4652l6464J1263R5743
$$ y = [29309, 74104, 14209, 31022, -368, 9523, 33703, 6519, 2090, -18643, 95387, 19753, -39694, 46605, 28112, 62345, 9179, 178657, 243199, 222960, 226398, 274376, 227390, 92039, 126567, -21393, -86987, -62284, -19502, -29077, -82700, -6398, 134, 27373, 27424, 23840, 5732, -26097, 26507, 46990, 17581, 43263, 102580, 21497, 50015, 95170, 23439, 2438, -45894, -71167, -88040, -222082, -99035, -14995, -76061, -125405, -43211, -99413, -159327, -177807, -165213, -45156, -30173, 16272, 36603, 15991, 19209, 42528, 54915, 84703, 78820, 42265, -28499, -115793, -112982, -11862, 32299, 27177, 116344, 117898, -11737, -21047, -96862, -66815, -98397, -82346, -108801, -111900, -6457, -44744, -55901, -14847, -69499, -105963, -94700, 1043]
16542A043k3174j04162R1861l7325k2514m4997J03686J0752J44390N3997L5824
16531B09381m4508j25716K7284R5761L8586l7894q1116K8640k274o1758j36674
16520i0288n5528J1666q861L5707J14654n994q6380l8853M0006Q8364K9832j11645
16508g7320L9545R2893O7714j41691j86039l5358J04354J03783R2227l7646P4751
16497I7213p850o0464L6903m750j36820J51194r9080q3283J51838n8106j00158
16486a13363n6361P5260J02267q8720n6592k2696R6656l0081p6703J05919J51358
16475H6944M0067j05956n9523p895k3653L723j7313k4384k077o5395Q7625q1869
16463a69706o2661J6287J28315K1707J20144O5920k6435N9586n9452k5423m5584
$$ y = [1043, -22131, -126293, -34432, -71757, -94271, -139268, -35582, -24830, 119560, 173557, 209381, 164873, 39157, 66441, 162202, 200788, 162894, 81778, 110418, 108144, 46386, -90288, -145816, -134150, -143011, -107304, 7350, 1356, -85024, -123877, -83871, 4493, 34325, -77320, -37775, 55118, 122832, -18859, -204898, -240256, -135902, -32119, 60108, 22462, 97213, 89363, 28899, 65802, 61052, -75768, 75426, -23654, -106937, 44901, -13205, -113363, -169724, -94464, 7803, -80917, -137509, -160205, -63549, -93630, -170333, -64414, 86944, 127011, 21055, -38468, -46363, -70016, -66293, -83606, -107990, -110067, -175462, -87837, -169706, -232367, -216080, -87765, -66058, 54086, 120006, 93571, 153157, 93705, 68282, 22698]
16452B2698o6450L775l105j0938K1715q447l2800q999l4516O182J07390K2423
16440A8928Q083Q7619r4937l9800l430M616l1952K2706l1903m2587Q1409o3844
16428h5092j36803p1152N6695Q2535J36882k9615k5061O8287P3152K3947R4811
16417A88586r1519J410L824M2663J9304j67l7740p6794r016J8388j53819j17619
16405b12499N1610L0047K6509L8066K028P5389l7647n9671Q2170N1816Q7769K7843
16393A63430j20770L7813p1439L964k9490n496l3829l3933r2212l4206J10650
16382a05518J04676q5752o8360m1572m1831l721Q7805Q6334j7416l3248j7294
16371a35897k1425K7807J19825L1804n4828P3024R674R254J0224J2183j05033
$$ y = [22698, -43752, -39977, -43082, -54020, -32305, -40752, -73552, -82551, -117067, -110885, -3495, 18928, 27011, 114630, 19693, -20107, -23537, -18921, -50873, -28167, -60070, -102657, -21248, -85092, -221895, -293047, -236352, -153817, -16935, -46550, -71611, -3324, 69828, 93775, 188586, 97067, 98477, 102301, 144964, 164268, 164101, 126361, 49567, 40551, 58939, -94880, -212499, -160889, -130842, -104333, -66267, -64239, 11150, -26497, -86168, -3998, 47818, 135587, 163430, 42660, 80473, 9034, 12998, -16492, -21988, -55817, -89750, -181962, -216168, -105518, -842, -86594, -154954, -196526, -238357, -242078, -154273, -67939, -85355, -118603, -135897, -157322, -129515, -9690, 22114, -32714, 40310, 49984, 59238, 69462, 81645, -23388]
16360b3388p2520L7326J17999J2330P744j24874r2282J8977J30175P2124J5249
16349I8860j09725j06206K2097J25454J6053q3747n4440r0361j89N0595Q813K2508
16337a00288j86041J07849J60697J97066N9898j19006n6209K3596j02957o431
16327b1826O2111l8713l0160J4718M2299n2558Q0818Q0130q5087j16914M9911
16316a5271R229J12822K0159k8866j16265J078R7416J2357p225O3564J62146j7232
16304B93912N08N8720m9666j3926J6855J9421r5689j8402J9517j17665M4659J41390
16292B99634N5347p7434j54773j23419N089J30416Q0232J4633N9213r669R9851
16281C79120R9864m5917m6353j99195j2645K5679j1539n1928n3898j05741p2043
$$ y = [-23388, -95908, -58582, 59417, 71747, 79491, -45383, -137665, -118688, 11487, 83611, 98860, -10865, -117071, -94974, 30480, 46533, -37214, -91654, -182015, -182204, -131609, -122796, -100288, -286329, -178480, -17783, 179283, 239181, 120175, 63966, 87562, -15395, -21826, 40285, 1572, -28588, -13870, 28429, -24129, 56689, 136819, 51732, -65182, -15271, -6042, 106780, 126939, 98073, -18192, -17114, 80302, 92659, 85434, 148998, 311144, 293912, 294420, 353140, 303474, 289548, 306403, 325824, 230135, 211733, 231250, 113585, 158244, 299634, 354981, 277547, 122774, -645, 4444, 134860, 215092, 229725, 288938, 279269, 379120, 478984, 433067, 386714, 187519, 174874, 200553, 189014, 137086, 83188, -22553, -94596]
16270i4596K3949L9145q1004M8769O7685N3520n2677L3366L6789m1772j8444k6739
16258a2009n0713L1713n7016R8580o5620o3957P8684n9097m0651J37175N2984
16247E0073N6748j61178n5414R0045Q4579k536L1973n9863j05565J6139M9064
16236e935l9438p1305j43034N187K679K2271O4884N2411J71844J61282J74385
16225C95231j23439N1460j87317j55001Q3923J22188K073j48369k5473Q9230m0523
16214F3983n8993r5453J35725Q6133j00571q3369J14028j0110j07270K3807P1509
16203C9419p6988q7161P0291r4243J9202J44641N2249Q2511J2851Q2343K0078
16192B65193j04820j45437j323q1170k8272m2640J33648J80456J49057j1013j34276
$$ y = [-94596, -70647, -31502, -112506, -63737, 3948, 57468, 4791, 38157, 74946, 33174, 14730, -12009, -62722, -31009, -88025, 10555, -55065, -119022, -40338, -99435, -140086, -2911, 50073, 106821, -54357, -109771, -19726, 64853, 62317, 94290, 34427, -71138, -54999, -5935, -45373, -116678, -259712, -254525, -251846, -229575, -164691, -112280, 59564, 220846, 395231, 271792, 323252, 135935, -19066, 64857, 187045, 189118, 40749, 15276, 104506, 63983, 4990, -90463, 45262, 131395, 30824, -52545, 61483, 51373, -55897, -32090, 39419, -37569, -124730, -54439, -148682, -129480, 15161, 67410, 149921, 162772, 245115, 265193, 160373, 14936, 13613, -67557, -95829, -138469, -4821, 175635, 324692, 313679, 179403]
16181A79403m2804K979M1296k4575l2263p5433L476J6417j11525j29494n345J72286
16169e582M8191J0702Q0836o3795o6030j07786q0131K5776N8934J20096Q015N1420
16157H0646n365j1552M7594j24354m0271k8703P59J5250L4174l8778M0640O2453
16145C2493J2387N0508l3929j46874p0682Q0348L8577r2310R3480L5784p4425
16134g4643m2919m813J05889J32061l5304p8053j38929o7936J20777J10775o8699
16123d1794m432j07789k2140r979J30295J16762m2924L5968O4936K0401k322j6944
16111A20038R1096K0995k01144j67110r5315J10016J03786L287o568J7110n033
16100h842j2390N3902q8681j6095J7116J7238l2771Q5914Q7745K0284k2929j4023
$$ y = [179403, 136599, 139578, 180874, 156299, 124036, 48603, 52079, 68496, -43029, -172523, -177868, -5582, 42609, 53311, 134147, 70352, 4322, -103464, -183595, -157819, -98885, 21211, 29226, 80646, 75281, 63729, 111323, -13031, -53302, -82005, -81246, -65996, -31822, -70600, -29960, 32493, 44880, 95388, 61459, -85415, -156097, -75749, -37172, -129482, -36002, -218, -74643, -117562, -122375, -16486, 115575, 80271, 2218, -136711, -204647, -83870, 26905, -41794, -46226, -154015, -176155, -186134, -55839, 60923, 17999, 53967, 118903, 139304, 136982, 120038, 211134, 232129, 30985, -136125, -231440, -121424, -17638, -14351, -20919, -3809, -8842, -21232, 32670, -56011, -72106, -54990, -37752, -70523, 15391, 103136, 123420, 100491, 86468]
16088H6468l4363j22404l516L8071R3887K9721j2524j3038K5221N434j69143n6897
16076a33083J14995M6840j10620R2516Q0818l1395m5839N2374K9277K7767n9886
16065F3764o7740j4271J02525P0922m3664l294q220J264P2681o7065j80825O0717
16053a3206J2684m4636J01868r7320M4073R5320P1720M8968j22907p3733k6295
16042c464N7192O1031L4640k2847k9535J926J1813p6957j54285p912J35884p0273
16030f2787k1519Q6710N7708O2781j19251j30363j02434Q3583J4709j5163k6927
16019a72953L6875L9577R0066o6556k14822k9830J96377J41469M2338p8047n3146
16008f8652N245m2878N1548o3046j44230m9282R9905J34508J19784l4181J31646
$$ y = [86468, 52105, -70299, -73815, -35744, 58143, 87864, 75340, 62302, 87523, 92957, -76186, -133083, -18088, 28752, -81868, 10648, 91466, 60071, 14232, 66606, 95883, 123650, 63764, -3976, -18247, 84278, 155200, 111536, 108242, 100022, 101286, 173967, 106902, -73923, -13206, -522, -45158, 56710, -40610, 3463, 98783, 170503, 219471, 96564, 22831, -3464, 53728, 114759, 149399, 126552, 97017, 98943, 110756, 33799, -120486, -128398, 7486, -62787, -84306, 2404, 60112, 122893, 3642, -126721, -229155, -145572, -130863, -146026, -172953, -136078, -96501, -6435, -72991, -287813, -317643, -121266, 20203, 62541, -15506, -68652, -63407, -106285, -54737, -117783, -262013, -311295, -211390, -76882, 42902, 8721, 140367]
15997A40367m8292j32429j6978K9353k9482j08302N9465O4310J2105m0387K1867
15986d8403J99235J04094o3759j12768m9422j27178m5424J21327R6452k3424n1764
15975a034k8566L6547o6678L717Q8126j5516K6454P9012J8822M9889N2172r6443
15963A46502j23322j0864J4039o720k7900j00164N2263Q3434o371j4597m1937
15952c5637K0590P628N7403l8330k8289m2090r352m366J35886K3184j793j11482
15940b6648N8148O6010K2509P5551o8871k04835M1694O6109l2706O7453l7200
15929B7214M5267r549m8023O4786J49645l1149n2715j3004m0584J4651r0868o3377
15917d7706O7342l6131p18l7705J56996K6661j33557l6064R0004n0476J9417p4601
$$ y = [140367, 92075, -40354, -57332, -27979, -57461, -165763, -106298, -41988, -29883, -70270, -48403, 150832, 254926, 191167, 78399, 28977, -98201, -143625, -22298, 74154, 50730, -1034, -29600, 6947, -59731, -56014, 32112, 16596, 43050, 122062, 140884, 190773, 242945, 146502, 23180, 12316, 26355, 19635, -8265, -108429, -56166, 27268, 20897, 6300, -35637, -15047, -7419, 49984, 11654, -16635, -58725, -68077, -72443, 63443, 86627, 84834, -26648, 31500, 97510, 120019, 195570, 126699, -78136, -36442, 29667, -3039, 64414, 27214, 72481, 62932, 14909, 79695, 229340, 198191, 145476, 132472, 91888, 106539, 15671, -47706, 19636, -16495, -17213, -54918, 102078, 128739, -4818, -40882, 49122, -1354, 18063, -56538]
15905e6538N212J6899k4335m0398p2695o5518Q5710J09357k9k6649o0220o484
15893a35688J13248Q3999j9058j40440o0125R5559J65602O327r7990O092Q4741
15882A02267J3070p6447r7983m7016P1675r1767J7391P2408J05211N8929m2053
15871H5685K2623j5689l1746l6217j4637j01023o09P6420j28899j4045L5309J8823
15859a04005L4383n8687r5693l3270M6527K02482Q9039r6411m8733l1357j7863
15848a13588J26449m42q0124l7987M3285M6117r6148j1990r5146n0977K6179j596
15836b45968M0284J51714J4963j4216k7916L4275R3144K5557l2266Q3057n0505
15825G2123r7461L1432j8455r0286M5714N7297m2072l7035O0536J79057J09183
$$ y = [-56538, -51326, -34427, -58762, -99160, -171855, -237373, -151663, -42306, -42335, -68984, -129204, -135688, -22440, 61559, 42501, -97939, -158064, -62505, 103097, 109424, 11434, 17526, 102267, 115337, 38890, -59093, -106109, -34434, -126201, -108810, -36402, 68809, 127738, 85685, 108308, 92619, 60873, 24656, 10019, -91004, -91613, -15193, -144092, -158137, -122828, -104005, -69622, -128309, -224002, -257272, -210745, -8263, 80776, -15635, -64368, -95725, -113588, 12861, 12419, -67705, -105692, -62407, -16290, -112438, -124428, -219574, -270551, -244372, -245968, -205684, -53970, -39007, -53223, -81139, -46864, 46280, 71837, 39571, 122628, 72123, -25338, 6094, -12361, -102647, -56933, 364, -41708, -78743, -18207, 160850, 270033]
15814B70033j03621j14285K711r0341k7194j2432j55274p1163J40099J40602l4372
15803e5237J9515l8860j4066o8196r776J69933J8939p097p7080j62656L2038J4169
15791a78374J8545N8384J10694J4488L7618J1362J8081j4501P426J4134j29014
15780c1157N789p545Q1269j3653j10983m4818O3061J44323k4031O5178J2644j11938
15768B8139j29622m1314K8173p4411j2072m4984O5478P3961o5394r8853p9240
15757c50139J41986J16903K8299O4679O1973o7712q4325N6596q272j23879R2624
15746g1267J41801l5368m9419P9365j36167j69739j8266O5988n1344J6330Q8116
15735a39970J49703J62447M1856q9036j62449j12643n209L9994m2369p7419J8257
$$ y = [270033, 166412, 52127, 54838, -35503, -62697, -75129, -230403, -301566, -161467, -20865, -55237, -35722, -74582, -88648, -156844, -166620, 3313, 22252, 15155, -61925, -224581, -192543, -178374, -159829, -101445, 9249, 23737, 61355, 72717, 90798, 76297, 83723, 97857, -31157, -25368, -32913, 48356, 34703, -76280, -121098, -58037, 86286, 62255, 127433, 140077, 28139, -101483, -142797, -114624, -189035, -201107, -246091, -180613, -106652, -172046, -270899, -350139, -208153, -91250, -62951, 1728, 63701, -4011, -88336, -31740, -40012, -163891, -71267, 70534, 35166, -14253, 65112, -71055, -240794, -259060, -193072, -244416, -228086, -139970, 9733, 172180, 214036, 125000, -37449, -150092, -155301, -115307, -157676, -235095, -216838]
15724b16838K27566J31075m3145p0027m7328j32092m7659J28631N4027r8613j2188
15713a26591n2639J5794J07037k1837j9111J36545k4116m1253j42265o0498J2958
15702b15976O0252l5913Q9638m036O1624o5120j66342J19758K18384J7714j29697
15691d9714o2807K6382N30j45362L0867K0721m8033l2741m4935J2290l5893J27981
15679b00714Q4763Q2597k8544O8215J30653m609n5003k1588m9697J09221K6175
15668A41469l773J7803O2772j4203j26107N8468k9294k9368p3047j00890q1498
15657a77668k5372J45574J5812J4684m5178o0851j7224J10337n4593l437O1724
15646c6192p2262j00525M2604k4580J25212Q7771j0840J32584l6367j1119l8758
$$ y = [-216838, 10728, 141803, 98658, 28631, -18697, -150789, -198448, -69817, -15790, -114403, -126591, -179230, -163436, -56399, -78236, -97347, 39198, 15082, -26171, -168436, -228934, -215976, -155724, -191637, -101999, -106035, -44411, -109531, -275873, -156115, 62269, 79983, -49714, -112521, -86139, -85609, -230971, -200104, -179383, -227416, -260157, -305092, -292802, -328695, -200714, -115951, -33354, -61898, 6317, 136970, 132361, 77358, 55770, 6073, 115294, 141469, 137696, 155499, 218271, 204068, 77961, 136429, 107135, 77767, 4720, -96170, -177668, -203040, -57466, -41654, -26970, -72148, -132999, -150223, -39886, -94479, -97916, -36192, -108454, -208979, -166375, -190955, -65743, 22028, 11188, 143772, 107405, 96286, 57528]
15635E7528L4254L9694P2580j30905n1099k6692j62462J9720O0605J4309K5942
15624d6526J2466J9766O2278K7518O10j07111p3692l4103j8859P2278l143k3580
15612a12098p9480o418J02317m4303L4245K9327J24390K1880l4559N522j56682
15601a15859j08633J02375M0540n6016L1573J22134J21323M8280p7918N35o2006
15590D6328N148j1996Q7658M3183k1053p9678j40123j0078Q9218o5831j18591
15579a75815m1859Q8507Q6615P6515R9357m3234p1033J3995L3699m5800Q4459
15568A05406n3162l8071M3710j9931q772J8830l0318q0002o7637N1241R4944L8981
15556E5219j5219m9085K5962N9906j947j25757j1128O6232R237L5270L1086k0642
$$ y = [57528, 91782, 131476, 204056, 73151, 22052, -4640, -167102, -147382, -86777, -72468, -46526, -34060, -14294, 47984, 75502, 76112, -30999, -104691, -138794, -157653, -85375, -88518, -112098, -191578, -197996, -95679, -139982, -105737, -76410, 47980, 69860, 35301, 40823, -115859, -224492, -122117, -81577, -137593, -106020, 16114, 137437, 185717, 107799, 108334, 46328, 51476, 39480, 127138, 170321, 149268, 69590, -70533, -80611, 8607, -57224, -175815, -217674, -129167, -42552, 33963, 133320, 90086, 19053, 33048, 66747, 20947, 105406, 52244, 14173, 57883, 37952, 29180, 48010, 17692, -62310, -129947, -78706, 16238, 55219, 40000, -9085, 16877, 76783, 74836, -50921, -62049, 4183, 13420, 48690, 79776, 59134]
15544E9134O1696m7762q5591L802p0360o767K2223M0157M7152j4267K7246j5054
15532B1609o0542M8396m7877o1811O1397j1933O7506J27671l974j7498k2745j5763
15520H4436O8521N0380O2878J3076k0219Q865p4014r4182k5435n9206r1424q1017
15508a57341J27428M4882q6380r0641j2010l6496j0051M8344o699O4274J42473
15497B7783j7160m2808L1992q36p982Q8163l9720l9352J8005p2719q4506N5144
15485h3996M3985K1127m1294M3946Q7684R0908M917M9844K9744p3742r7083k6935
15473D9105k9990o6574J19607M6213q4955k02658p7320J68705O2830J0763m2096
15462d6370q4859N1192R7661L7826N9695k1232k0818l7073o8952K9460p4568k5710
$$ y = [59134, 120830, 73068, -12523, -8721, -79081, -85848, -63625, -23468, 23684, 9417, 36663, 21609, -38933, 9463, -38414, -100225, -38828, -50761, 16745, 144416, 140442, 122944, 100199, 84436, 152957, 203337, 266215, 279291, 259072, 267937, 193923, 99741, 74306, 15100, -76324, -157341, -29913, 14969, -71411, -162052, -174062, -210558, -220609, -172265, -178964, -114690, 27783, 10623, -32185, -193, -1029, -9011, 79152, 39432, 80, 18085, -54634, -139140, -83996, -40011, -18884, -60178, -16232, 71452, 162360, 167277, 217121, 246865, 173123, 76040, 49105, 19115, -47459, 72148, 118361, 33406, -169252, -246572, -77867, -15037, -4274, -46370, -131229, -80037, 17624, 55450, 115145, 93913, 73095, 36022, -32930, -3470, -78038, -103748]
15450a03748P3505P918j62743p1571K55374j4217j17911L1542j3829j29882j1222
15439b56784N6563m1783J8013J11103J0907k0986j0049o9177m8685O8480K19863
15428C7465N8405r5803q8273O4846j53709l5947J09861K1508K6554o345m2847
15417a04285P811R2544n2921j31595M9413J06447r8954J5240p3329o4157m2780
15406b96566P7138p6787n6472R2519J79087L2777J4874J0170j4888m1848o965
15395h6961m5321J7494l958m5204O0056m1527L2365Q9669J5940j29869j64354
15384c01670q3826M4193J78013J76314O45j9628m8003r6854j63298J61315J58131
15373E332l003q3950K3171p1186L1677J12836R8306m3419J3825r5381l5608L1228
$$ y = [-103748, -30243, -22325, -185068, -256639, -1265, -15482, -133393, -101851, -115680, -245562, -256784, -200221, -242004, -223991, -112888, -101981, -122967, -133016, -202193, -250878, -182398, 37465, 95870, 67, -88206, -23360, -177069, -213016, -103155, -81647, -55093, -61438, -104285, -96474, -3930, -56851, -188446, -139033, -32586, -131540, -116300, -189629, -253786, -296566, -219428, -296215, -352687, -260168, -81081, -48304, -33430, -23260, -38148, -79996, -86961, -132282, -114788, -118746, -163950, -103894, -145421, -113056, -23387, -7447, -137316, -301670, -385496, -341303, -163290, 13024, 13669, -5959, -53962, -150816, -314114, -152799, 5332, 2329, -81621, -58450, -129636, -97959, 14877, 113183, 69764, 83589, -11792, -47400, -16172]
15361a6172r265K5495M1591q0509p4836p663N0986j33638q4912O030Q6563J29444
15349f6886l8297o6256K9038J82493J07464j42645M4441K1197p9348p5100o076
15338h9975K9965J0084m6991K0040m7918O2339J07201O5926j7885K2764p9660
15327C5890k5190K4908m2105N839n7570j12238k9299n9702J40485J31401j2515
15316i6L4425L7831o4566m7185M6728j34823k9340J30742N8636Q2521m5151r4128
15304b4406q845k6515k7074k5098j633Q5161j8959k7263n0769k4441m9046J8837
15292a80051J04261O3643r5061r0672J26042o1137L9174Q8476J05242n2403o5261
15281a7747o5700n539p685n4212M2868l964P3599L4525j5838j3298M4170K3193
$$ y = [-16172, -25437, 58, 41649, -38860, -113696, -121359, -70373, -204011, -288923, -282893, -196330, -66886, -105183, -171439, -142401, 40092, 147556, 4911, 49352, 70549, -8799, -83899, -89975, -60010, -49926, -96917, -76877, -124795, -62456, 44745, 110671, 92786, 115550, 35890, 10700, 35608, -6497, -658, -58228, -170466, -199765, -259467, -118982, 12419, -96, 34329, 72160, 7594, -39591, 7137, -127686, -157026, -26284, 32352, 114873, 69722, -24406, -33251, -59766, -86840, -111938, -113571, -28410, -47369, -74632, -125401, -149842, -198888, -180051, -75790, -12147, -107208, -197880, -71838, -132975, -93801, -5325, 99917, 47514, -17747, -83447, -88986, -96671, -150883, -108015, -111979, -38380, -3855, -19693, -32991, 11179, 34372]
15269C4372K1500J04069P4829p2138j34360Q780P2933O2432j38979j46944N9152
15258e4354k842Q6843L6690O5545K4632m5952J1590N7036K2628n5970l933p6157
15246F5756r3714K9558Q1261J31223p6408p0339o7193m1263J4013o7589P1703
15235b2992Q5000O2198P3192j6158K1200p6706j944o298o253O8102p4765j6704
15223H7872N9763j04944N291K2517m2296o2215j920J22551m2043j01850m6810
15212a04084p2138L2739O2805n2665n5360M0494P1210j0861j1062J2746j53840
15201b40016l144J15280J33538J15985j30288n6171R0187K1542J41512R2982k44264
15190C7143m7298j3760p6673P1928N0294m4121r840m684J5227R2792k8254p7080
$$ y = [34372, 55872, 159941, 234770, 162632, 28272, 37052, 109985, 172417, 33438, -113506, -54354, -57196, 29647, 66337, 131882, 156514, 110562, 122152, 179188, 201816, 145846, 141913, 65756, -27958, 1600, 82861, 214084, 137676, 67337, 144, -41119, -27106, -94695, -22992, 62008, 124206, 197398, 181240, 202440, 125734, 123790, 117492, 111239, 179341, 104576, 87872, 147635, 42691, 47982, 70499, 28203, -34012, -35932, 86619, 44576, -57274, -104084, -176222, -143483, -80678, -133343, -188703, -148209, -76999, -87860, -98922, -86176, -240016, -243160, -127880, 5658, 121643, -8645, -64816, 25371, 46913, 188425, 281407, 37143, -10155, -23915, -100588, -28660, 21634, -22487, -32327, -37011, -21784, 71008, 42754, -34326]
15178c4326r0021k4854J14984R1732O7572m8940j10603M4477J10012k3888m2692
15167E3453j10373N4471j8081N5609P1094j771k6695p8905J3980j5276L9338m9434
15155a2590J16530k4737j27164l207j4610N7593j8026J2805o6766q0238K8479
15144a31931n508L7122l023n1148M7425K1653J32631J43179l9590M8970O0282
15133B60062n2211j74804j57262r4773p0120N9441P4899J03321R0205R4566k3027
15122A10297j29705K6680L4414M0443N7390K925k1524k8150j876n2677n8840O0399
15110C9776J20617n7973k04685m3362n6923l2343O3086J35768K03174l7686j19958
15099I491o3241J72394p6424m6934o9168m5798q972p8618K3553J71475L4710n9405
$$ y = [-34326, -124347, -149201, -34217, 57515, 125087, 76147, -34456, 10021, 120033, 96145, 53453, -56920, -2449, -20530, 35079, 106173, 104402, 77707, -1198, 12782, -2494, 36844, -12590, 103940, 79203, -47961, -51168, -65778, -8185, -26211, -13406, -80172, -160410, -131931, -137439, -100317, -103340, -154488, -107063, -85410, 47221, 190400, 150810, 199780, 260062, 207851, 33047, -124215, -218988, -289108, -229667, -154768, -51447, 38758, 133324, 110297, -19408, 7272, 41686, 82129, 139519, 142444, 120920, 92770, 90894, 38217, -20623, 39776, 160393, 102420, -102265, -145627, -202550, -234893, -171807, -36039, 167135, 129449, 9491, -53750, 118644, 42220, -4714, -73882, -119680, -128652, -207270, -183717, -12242, 22468, -36937]
15087c6937M6410k1106K1924J0129k553j12921r2795J7893J51135R4362r2603
15076a7062o1010j59418N3690M1363O9313J43805J15794q2319J6548P2672P7023
15065B70399K2718r2936J4782j45092j35243K5105M6415k674J12548J22329r7714
15054A40637r2135k5128r6614j574n0923k3788J44481Q8344j40293o6115J57179
15043C4071J14181j8514k4280M8015j12453n3907J44720P4227j42896O3750k6752
15032A00162p6439M5864n6067q0097J3590o7313o9897m907P0707n4988L1551J33500
15020a4334Q2726l2634l2261n1951K9233K5294l1699m4400j9042p4426M0967J17748
15008d779N2575p057N2188m7819j41472p414J19582K9589L6694j03710j49397
$$ y = [-36937, 9473, -11633, 10291, 20420, 17867, -95054, -187849, -169956, -18821, 75541, -17062, -78072, -237490, -183800, -142437, -73124, 70681, 186475, 104156, 120704, 193376, 270399, 293117, 200181, 214963, 69871, -65372, -40267, 6148, 3474, 116022, 238351, 140637, 48502, 23374, -73240, -74814, -125737, -149525, -5044, 83300, -56993, -123108, 34071, 148252, 129738, 105458, 153473, 41020, -12887, 131833, 206060, 63164, 126914, 100162, 23723, 69587, 13520, -66577, -52987, -120300, -190197, -195104, -124397, -179385, -147834, -14334, 68392, 35758, 3497, -48454, -19221, 6073, -25626, -70026, -89068, -163494, -122527, -4779, 47796, 40739, 92927, 45108, -96364, -103778, 15804, 45393, 82087, -21623, -171020]
14997a71020m3162L6079R04K5933p1325N156J30004L9599L8702j232k1018r3202
14985a24582l9905J6952j4873O5407Q3444J87743M5862l4107l8364J36848k3902
14974B60523j68749N0888o2161K6010M0266K9442r3521j87720l717P8186K8361
14963b192q8532j0787R3388Q4667O798j11310q1286P938j7181N3497J76211j5709
14951I5502j3574N616j30598l4399M2086J00121n9961j06032P568K4843q2138
14940a50966j00334L8669N1707m461r1880j09965J10172J86232n010l6072L8442
14929g3466j7644j80478r0802J20234J54651J06719m6151p3534j9385J2826p4471
14918a81501q4524J57740Q8283k57003j51734N4160J21853K33413J32566j38773
$$ y = [-171020, -214182, -178103, -177199, -151266, -222591, -217435, -87431, -47832, -9130, -10362, -31380, -124582, -164487, -147535, -162408, -97001, -13557, 174186, 220048, 185941, 147577, 284425, 260523, 91774, 142662, 80501, 106511, 146777, 176219, 82698, -105022, -108739, -30553, -2192, -90724, -101511, -8123, 76544, 83342, -27968, -109254, -101316, -118497, -65000, 111211, 95502, 81928, 87544, -43054, -77453, -35367, 64754, 4793, -101239, -93671, -68828, -150966, -251300, -212631, -160924, -165385, -257265, -367230, -257058, -70826, -75836, -111908, -73466, -91110, -271588, -362390, -242156, -87505, 19214, -26937, -100471, -119856, -107030, -181501, -266025, -108285, -20002, -277005, -428739, -374579, -252726, -19313, 113253, -25520]
14908b5520j76449j309J64836J11883m892J40769L357l3388R3O431q9184n1237
14896D5390P523r1248j03620k7337K8800M2518R6913J20958J06484j6204m4307
14885A65870j28172j336J09784O0064n1500m4369K2103n1598O3833J50247r5692
14874A99234j35030p0308J08453o969j29349o2168N7326O3405l9717Q6952N7550
14863A29379j39786m9632j65531n0851j9122j1869R0557q088R0901J04314P1701
14852D1973J51P2637o6258p4152q936P2868k7935l1933Q4059J270J2216n7162
14840A8798k9627O8677j4434p6730k4610J72299J5234j04086J616m8481n1822
14829g3166K5476M2036J7121j01238j7009k7687j4561Q1316O1875P5597L6817
$$ y = [-25520, -201969, -203278, -38442, 73441, 68549, 209318, 212675, 179287, 179380, 185811, 96627, 45390, 52913, -38335, -141955, -169292, -140492, -97974, -1061, 119897, 226381, 210177, 165870, 37698, 36362, 146146, 206210, 154710, 110341, 132444, 80846, 144679, 294926, 199234, 64204, -6104, 102349, 95380, -33969, -96137, -38811, 24594, -15123, 71829, 129379, -10407, -60039, -225570, -276421, -295543, -307412, -216855, -224943, -134042, -29728, 41973, 42124, 114761, 48503, -25649, -34585, 38283, 10348, -21585, 62474, 63744, 75960, 18798, -10829, 57848, 43414, -33316, -57926, 114373, 129607, 25521, 27137, -21344, -73166, -47690, -5654, 11467, -89771, -106780, -134467, -149028, -67712, -5837, 69760, 106577]
14818A06577m3593l8668k8728l7043K3145o2932J24229p8957r6290Q5567P1348
14807B4655Q219O8383K114m8995N4933O0445K7481q6192M1485J15991l7305r5544
14795A35670n0505J1539R7093m3547o3241p362q5709m5286K8525L4929N4041k1094
14783D5053M4390J40760L4860j43733j0908J985l1744o4067K391l7359j17618
14772a35990m0369R9937O3608m5333J29152J40934J080p1356l0405K7188p8237
14761F0209J0659K2159k7011j4529M8608n9987p943j17937k00062M1082J22064
14750a22688J36066N4531J34969K4882k9975j34359o7795L1704N2382j1249N6525
14739A24993j9509k1630q6077q2778K9706P541N9271J7864n2193m2360k1499p50
$$ y = [106577, 62984, 24316, -4412, -41455, -18310, -81242, 42987, -35970, -132260, -46693, 24655, 32874, 101257, 103371, 54376, 109309, 169754, 197235, 111043, 152528, 268519, 231214, 135670, 85165, 96704, 193797, 150250, 87009, 79647, -6062, -51348, -22823, 12106, 66147, 45053, 89443, 230203, 265063, 121330, 110422, 112407, 80663, 16596, 18987, -18372, -135990, -176359, -76422, -12814, -58147, 71005, 211939, 213019, 141663, 111258, 138446, 60209, 70868, 93027, 66016, 51487, 100095, 40108, 32165, -85772, -285834, -244752, -122688, 13378, 67909, 202878, 227760, 197785, 63426, -4369, 27335, 79717, 68468, 124993, 105484, 83854, -2223, -85001, -55295, -47754, 11517, 29381, -22812, -65172, -86671, -87421]
14727h7421P2907N060M1212K1197q5223j137p8025m7588R2614M9989o1808j00919
14715a79142o3157J29871J38492k8717J4114N3238L3297l3776j69622q4443k9144
14704b18989J30688N8878J7590k8731n6728Q339o4670k0610o8287P7790R8086
14693f6644N4374p2794K1435k094o2886K8543L9740j5594J6636L8329P0073m0058
14681I060O7244n5980j39378q1093R6603M7349K492o141M5998J8136l879J34754
14669A35165j2517j04625r5694l0328l4363J01354O6608J00644m2440j1186o4618
14658H000j08677o3955k312K8370N6277J9628J58424K6029M8755Q8928q1359n0765
14646A27343q4478j9583J10619n4994p6224K2292J8116k0527o3734J8667q0837
$$ y = [-87421, -14514, -9454, 31758, 52955, -32268, -33405, -111430, -159018, -66404, -16415, -78223, -179142, -242299, -112428, 26064, -2653, 11461, 64699, 97996, 64220, -105402, -189845, -218989, -88301, -29423, -11833, -40564, -97292, -88953, -153623, -174233, -242520, -164730, -66644, -12270, -85064, -63629, -65723, -128609, -100066, -60326, -75920, -59284, -20955, 49118, 9060, 76304, 20324, -119054, -200147, -103544, -56195, -53703, -59844, -13846, 4290, 411, 135165, 122648, 18023, -77671, -107999, -142362, -41008, 25600, 126244, 83804, 72618, 8000, -100677, -164632, -166944, -138574, -82297, -62669, 95755, 121784, 170539, 259467, 178108, 127343, 42865, 23282, 133901, 78907, 2683, 24975, 43091, 22564, -41170, -22503, -103340]
14635a03340l4054J43433m7575k2577M2229l791L2509P1773j09018m6338M9164
14624b7585j0072Q0323K8353m6271j0638o7814l7766N5493K03922n361q2280q303
14612G2001J13470Q8206p8796j19910j07132q5088l6877K34180R6471p6681p0412
14601B9432l8835p0791m9084l8653M4403M652J7092M3023J79j6547L5617O7157
14589B7645j75101J0949j2714L5959Q5650j4467l2708N9805K8704N384m3089n4741
14577g8724J31911Q3082m0494O2842O1120k3298k9848o1560m0645m4337J11520
14566A31569n0523q9519O6926L0931M7005k5688j06558j4784K4311o2158N6445
14555G957q4296q8088r293J6607K31055O4259j4920l5768j46061k7125L7445l0809
$$ y = [-103340, -137394, 6039, -41536, -64113, -21884, -25675, 6834, 78607, -30411, -76749, -27585, -37657, 42666, 71019, 24748, 14110, -53704, -91470, -35977, 167945, 162584, 80304, 72001, 185471, 273677, 194881, 74971, -32161, -117249, -154126, 80054, 176525, 99844, 29432, -9403, -80194, -129278, -167931, -123528, -118876, -101784, -58761, -58582, -75129, -39512, 27645, -147456, -136507, -149221, -113262, -27612, -42079, -74787, -14982, 13722, 19106, -23983, -78724, 53187, 136269, 95775, 158617, 219737, 196439, 166591, 105031, 64386, 20049, 131569, 81046, -8473, 58453, 89384, 136389, 110701, 4143, -10641, 13670, -48488, 7957, -76339, -164427, -173720, -157113, 73942, 138201, 123281, 87513, -58548, -85673, -48228, -79037]
14543g9037j0994r502j3159Q7673n8672L0406R5178l0341j50839N381Q6898J36488
14531H9480R5329M9094M4947J9621n6568q0044J4112L0745j26240p0008R2722
14520A03190L7496k4176J37705j46970L9627M7795k9193k5487j6607j2010N2811
14509A64181n7095j5808j04396p6299M5938R0324l275M7072Q6338L4834m8132
14498A63682o838j13105o8379j03127P567J18904q0057q4254r6809J30434J82452
14487E0470k3156k0631q8200P1492o0410j21052q7407M9460m2383K8314J33405
14476a10098J08619L7301n7958k0776J13862J11100M9061j4546o7340j4118j09111
14465B5996J18211J34743j10796j06519l7229j28260o0330J27807Q0868m9536
$$ y = [-79037, -90031, -99533, -112692, -25019, -83691, -53285, 41893, 11552, -139287, -133906, -47008, 89480, 184809, 233903, 278850, 298471, 241903, 161859, 175971, 206716, 80476, 10468, 103190, 140686, 116510, 254215, 107245, 146872, 194667, 165474, 139987, 123380, 111370, 164181, 107086, 91278, -13118, -89417, -43479, 46845, 43570, 90642, 176980, 211814, 163682, 156844, 43739, -24640, -127767, -120200, -1296, -81353, -165607, -262416, -131982, 50470, 27314, 6683, -81517, -10025, -70435, -191487, -278894, -229434, -271817, -243503, -110098, -1479, 35822, -22136, -42912, 70950, 182050, 231111, 216565, 149225, 135107, 25996, 144207, 278950, 168154, 61635, 24406, -103854, -164184, -36377, 44491, -5045]
14455e045j02147k6977l6632K51776m0733o3372J34903j33612j08902M5684R5340
14444A0283r9719N7256J08674K4259L9535j1390L1870K7454m6567q5416M0364
14433I6603J24024Q6262l5888o1140o3672n302q7245j15278P215n6680J36146
14422B5045O6407m6204o4572K4818K5947P5274J21036p5777j29692m4480o521
14411b8719M8270m771j38531j65768N081K4501P57n4231J02939K13610m2724L3982
14399e604J41666l4466k4333p4007m7280J14000p0119p8289n9804r4900K4018
14388b09118P7707J76339N2964n1187n6678n15J04238M8154k9009k3165j50339
14377f0609J7121J552j8603k4995N1535N4759p3603j26975m2742m5074L2097m891
$$ y = [-5045, -107192, -134169, -170801, 80975, 40242, -23130, 111773, -21839, -130741, -85057, 10283, -89436, -32180, 76494, 100753, 140288, 128898, 160768, 188222, 141655, 56239, 96603, 220627, 306889, 271001, 209861, 146189, 140887, 53642, -61636, -54421, -111101, 25045, 91452, 45248, -19324, 5494, 31441, 106715, 227751, 151974, 22282, -22198, -28719, 19551, 14780, -123751, -289519, -284438, -259937, -259180, -313411, -210472, 3138, -39586, -5604, 136062, 101596, 77263, 3256, -44024, 69976, -143, -78432, -138236, -233136, -209118, -131411, 44928, 97892, 46705, -9973, -10488, 93750, 141904, 112895, 89730, -60609, -43488, -41936, -60539, -85534, -33999, 20760, -52843, -179818, -222560, -267634, -235537, -240428]
14365b40428J3335R5298K4218K0076J02895j8695N0094L94L702j52406j15439
14354b16956O7390O9169K6653N5733R4561J4168j5638N5803J1380M643R1896q3837
14342A74965j14724j63387r5927K0442Q3745K6185k7552j4172J04887K2244m3588
14331b6882k5974j24133q0594N0004P1530K3378j3352R1469O1357j01563L8595
14320c6165N6587n14p847j06570K0874J09778n1255n7524J5249Q3139J2604o2329
14308b3973k6830P479N647r6928J6729J8472j41674n8178j4793L2903P3096J24822
14296h3228J58747l7351j51085l1294J08620K1854l9261p1073p0276J16027J09130
14285C0810L9209k1730J8216P5521J8780q2123j19917N4609O4271n4823m1923
$$ y = [-240428, -227093, -131795, -107577, -87501, 15394, -3301, 46793, 47187, 50889, -101517, -216956, -149566, -80397, -53744, 1989, 96550, 110718, 95080, 150883, 162263, 166906, 258802, 174965, 60241, -103146, -199073, -178631, -94886, -68701, -96253, -110425, -5538, 16706, -26882, -52856, -176989, -257583, -207579, -136049, -112671, -126023, -34554, 26803, -74760, -36165, 20422, 19908, 12061, -94509, -73635, 36143, -15112, -72636, -57387, 25752, 38356, -23973, -50803, -43324, -37677, -134605, -117876, -99404, -241078, -299256, -314049, -281146, -208050, -83228, 75519, 38168, -112917, -144211, -35591, -13737, -52998, -124071, -194347, -78320, 30810, 70019, 48289, 66505, 142026, 160806, 78683, -41234, 13375, 77646, 22823, -19100]
14274a9100K7604j2890n7240J6617l7628J613r6419J7059L6329R6166j05577j54690
14262b88156l1628J35675P9433N1742J05285L2720k4944k342m0163q9087K80r6409
14250a67594O0802k0317M4714Q4270J0516N2789j6572n5854L2898j7816k9270
14239b1434n5740o3799J15866O3399r776P560M6661l227J4228l5062o4519l7750
14227d3593K5341J2093R3534P0133j13834R1847O893j4330P1776m7930k0326r9469
14215C2135j16245J5252J09754J4436O175m8421J5361J19784r1P5695l2455q7392
14203A03988m9315N8760r8347k1080n4169j0821O1205N7924m0959o620K0894L4792
14191E6252O2282m4436K3128K0866n3788N8713j66359m5767N8496M29r8148J22355
$$ y = [-19100, 8504, -4386, -61626, -45009, -82637, -81024, -177443, -160384, -124055, -27889, -133466, -288156, -319784, -184109, -104676, -52934, 52351, 85071, 60127, 57785, 17622, -71465, -71185, -167594, -106792, -127109, -82395, 1875, 12391, 65180, 48608, -7246, 25652, 7836, -21434, -77174, -140973, -25107, 38292, 28516, 36076, 82737, 79510, 93738, 58676, -5843, -43593, -18252, -6159, 87375, 157508, 43674, 135521, 142414, 128084, 199860, 151930, 131604, 32135, -84110, -68858, 40896, 55332, 61507, 13086, 28447, 148231, 148140, 223835, 191380, 103988, 54673, 113433, 15086, -5994, -60163, -70984, -9779, 48145, 7186, 566, 21460, 56252, 118534, 74098, 97226, 118092, 64304, 123017, -43342, -89109, -30613, -30184, -128332, -5977]
14179e977l5894j41164m6742l7073m0054Q9557Q0392o6824M8011J19154L4730
14168a884r1132q5232J4307K7469O5841J44851N7806K9865j41010K5858J2680
14157E9419j05249l894J51j01141L6994j16212j7052J10674M2931K7791k7473
14146i3061m4950k2019K3577L1965N581j05042J30672Q6727J11807Q9635n1258
14135A63634l6215k3535p2579j71368n4362P2644p124p8305M4562N6258R8093
14124h297P9208L1433k4923l378j27801j12276K6167J34603k8609n9056r300J4935
14112h7294L9984p5491l6574J07225J20689l2891Q1250K4602J5352r2702j63256
14101i9106j05321q1485o950Q6942r632K601J44699J25142Q5700N8654M9247j40443
$$ y = [-5977, -41871, -183035, -229777, -266850, -306904, -217347, -136955, -203779, -155768, -36614, -1884, -93016, -178248, -163941, -136472, -70631, 74220, 132026, 161891, 20881, 46739, 59419, -45830, -49724, -49573, -150714, -113720, -229932, -246984, -136310, -93379, -65588, -93061, -138011, -160030, -136453, -104488, -98907, -203949, -73277, 13450, 125257, 214892, 163634, 127419, 103884, 31305, -140063, -194425, -121781, -128905, -207210, -162648, -106390, -8297, 70911, 102344, 77421, 74043, -53758, -166034, -139867, -5264, -33873, -92929, -102229, -87294, -47310, -122801, -159375, -52150, 68539, 35648, 116898, 141500, 156852, 64150, -99106, -204427, -285912, -292862, -205920, -215552, -212951, -68252, 56890, 142590, 201244, 250491, 110048]
14089A10048j38318m8279n1134L4790L3457K3022J20521P5856k6423l4235k0671
14078G8634j9010l7131M302j47280m2709M6428L0810J1562j5157J7888J06505
14067C4842M4743O3096J0244m2139l3128k5943j7666m4660M1789j6468J1579l5518
14055i229j6026M0206k5043J3555j2743m3554K5215N6359m722o6226P7856J729
14043C7377M9409m2909k72428j43701J24417J67442J39695K0498j29262p9647
14033a29109k8230J0353R7049O6697o5795O5957n1113m8807o4718J5607K202o802
14021a36709M2752l648O7346m0071L6183L8706q493J1248J3930L7563J5376r7652
14009b3469p8740j9682J406j9874j52540J6119M7861L5000J03025R1427O6913
$$ y = [110048, -28270, -76549, -127683, -92893, -59436, -36414, 84107, 159963, 133540, 99305, 78634, 59624, 22493, 26795, -120485, -163194, -116766, -85956, -74394, -89551, -71663, 34842, 79585, 142681, 152925, 110786, 77658, 51715, 34049, -10611, 31178, 14710, 26289, -9229, -25255, 14951, -10092, 3463, -9280, -52834, -27619, 28740, 24018, -42208, 35648, 37377, 86786, 43877, -228551, -372252, -247835, -80393, 59302, 79800, -49462, -129109, -157339, -146986, -49937, 16760, -49035, 16922, -34191, -82998, -147716, -132109, -129907, -136709, -93957, -97605, -30259, -70330, -34147, 4559, -3934, 7314, 21244, 58807, 74183, -23469, -102209, -121891, -120485, -140359, -292899, -276780, -228919, -193919, -90894, 533, 67446]
13998F7446j25570l7149P6326J6308M5486o3958n40P0779N890j04294J4495O7595
13986C2814k2374J33n624K8882M9084N945j1834m5750n5911O724M1812l9006P949
13973g156J9608r2947k2298j01540J38059J22847R688p4799J07777j52720j56157
13962b09638j024Q7954N8608J0948N7992o7862p0300j603K1215K5648o2629q360
13950a59051N6814J37518m2750j42941Q6944O4195J02278J33433N8100p4764j51434
13939F8342L0654j2448m1205N8741o435n7750k0241O6869K0985j6385n9089R5418
13927A27456J466q274j18809j37472L7866L9007O7660J02781j19863m3832r939
13916f1953Q0178N8317n8431n4096R6500O6623o9923l2753j12150J13666k5693
$$ y = [67446, -58124, -95273, -18947, -2639, 42847, -21111, -21651, 49128, 55018, -49276, -34781, 32814, 10440, 10573, 4949, 33831, 82915, 88860, 77026, 31276, -24635, -17911, 23901, -15105, -7156, 12452, -80495, -102793, -204333, -66274, 56573, 66261, -8538, 99239, -53481, -209638, -210662, -122708, -64100, -53152, 4840, -63022, -133322, -134925, -113710, -88062, -150691, -159051, -102237, 35281, -7469, -150410, -63466, 729, 103007, 236440, 294540, 219776, 68342, 98996, 86548, 45343, 104084, 97649, 39899, 19658, 86527, 107512, 91127, 32038, 127456, 128922, 120648, 1839, -135633, -97767, -58760, 8900, 111681, -8182, -52014, -61953, 18225, 76542, 18111, -35985, 60515, 127138, 57215, 24462, -87688, 25978, 285]
13905B85k301J4133k8921N8216L8333l3771j66803j077J21368L0617j03966k9053
13893a02940N7962k3409J12799R4200l6137r6130n1113k6155K932R0651O2783
13882H5443O69p4546l5614L0914q600o837r5916k6942J64552K3698J2833o9425
13870B29L0176R67q6140j49580M8261J77785M5870n350n3213j43168m5916J7121
13858a62958k5950j0964k6556O9282J26470r723P9349l2257j4803j2647l6529
13847e7286l0681P9839L377P1686j07L4287M7897q3465l0993l9047r5548o9040
13835a69081K5928M0751O713J24417J58365k4536p1184j0095j45300k7085L7124
13824e3983l788J14226j0648N2396M3096k8939j19870L9005k1038m605J25520
$$ y = [285, -2016, 12117, -16804, 41412, 79745, 45974, -120829, -121906, -538, 30079, -73887, -102940, -44978, -68387, 44412, 138612, 102475, 6345, -44768, -70923, -67991, 22660, 85443, 86112, 11566, -24048, 6866, -1734, -8571, -104487, -131429, 33123, 56821, 69654, 229, 30405, 31372, -54768, -204348, -156087, 21698, 67568, 62218, 9005, -134163, -180079, -162958, -188908, -199872, -226428, -157146, -30676, -40399, 38950, 6693, -8110, -20757, -57286, -87967, -8128, -4751, 66935, 66828, 101115, 149012, 65547, 34554, -4493, -100041, -169081, -143153, -102402, -95689, 28728, 187093, 162557, 91373, 81278, -64022, -91107, -53983, -57771, 56455, 45807, 98203, 141299, 112360, -7510, 31495, 10457, 5852, 131372]
13813A31372r9733P2697P1529L3346J2257p5391O2074K5239j48279j44801o1927
13802a21617J16964m8955L6034N6218J58423L2237r3547r9346j1035R4026j87884
13791f8482j00793J76482R2875J9197M2533p5482j7734r6293j07197J32459N0847
13780D8412o1762n5905Q0281N9926O7226Q5255N675n9775r1529J762J42544m652
13768B17458j08974M5870O9012j28170m8542p3020p7368n2907O224L6696p4473
13757a88194m8811q4465O7347N2730p0507K812R6106N9073L3866J62477k5244
13746E7190j19972n4984K3675m8417l1986K1035l1255k7278L773k7555J73375
13735f2399M8246P7075o5936j18398q9710M0761K2336k0586L5248P6185L1678
$$ y = [131372, 31639, 104336, 175865, 209211, 221468, 146077, 208151, 233390, 85111, -59690, -121617, -4653, -53608, -17574, 38644, 197067, 229304, 135757, 36411, 25376, 119402, -68482, -169275, 7207, 100082, 119279, 161812, 86330, 68596, -27697, -134894, -2435, 48412, -13350, -69255, 11026, 70952, 138178, 223433, 229108, 169333, 77804, 79566, 222110, 217458, 108484, 154354, 223366, 95196, 46654, -26366, -103734, -156641, -150417, -113721, -188194, -237005, -321470, -254123, -201393, -271900, -269088, -172982, -113909, -80043, 82434, 57190, -62782, -117766, -94091, -142508, -174494, -153459, -184714, -211992, -208219, -235774, -62399, -14153, 62922, -3014, -121412, -211122, -170361, -148025, -168611, -133363, -57178, -25500]
13724b5500K3907m8420L3529L560j32627o2182J24166J78963J27112n934r3942
13713A22632j41082q8605K3582P9237l1340N96j695J7576Q70M2595l5296R010
13701a920K5472q8318J5130j3543j0757k6918O6661L4541n7076j8833l1236K8124
13689g8673n4565r8899r6618R6396J68854j5078R4923J61747k8195J2911q9877
13678G2926n1184p3985l6786j4747R718L4402L2910k803M6171j3506J09513M0876
13666A53505q5358M2663o2128k6502l4712n4693j04206J01983N4272n2889R7808
13655B9743J10496M1899j48674j99292o8439N1203L5804P3822O9653j04195j3325
13644a21305J8990Q8028J72183L6416j51372m9725Q6160J133k7002l3897q696
$$ y = [-25500, -1593, -50013, -16484, -12924, -145551, -207733, -83567, 95396, 222508, 216574, 122632, -18450, -107055, -83473, -4236, -35576, -34980, -36675, -19099, -18229, 24366, -10930, -1920, 23552, -64766, -49636, -63179, -73936, -100854, -34193, 348, -56728, -75561, -106797, -78673, -133238, -232137, -328755, -232359, -63505, -78583, 16340, 178087, 149892, 162803, 72926, 21742, -52243, -89029, -103776, -94058, -59656, -26746, -29549, 16622, 3116, 112629, 153505, 68147, 110810, 48682, 22180, -12532, -67225, -171431, -69448, -15176, -68065, 29743, 140239, 182138, 33464, -165828, -234267, -183064, -147260, -73438, -3785, -107980, -121305, -102315, -14287, 157896, 194312, 42940, -6785, 79375, 80508, 53506, 19609, 10913]
13633A0913J14475k3273q9317r0603N9068M2079p0989M4360R5932N90j12370J2856
13621f279o0551q2299L235Q8721N2793N1622L3133M5866P9657J8742j00756r984
13609A13900j17505p4777J43998J6945M1312q9511q1515K5633j03817J6128J69371
13598F0162J18418o992l9211O3877j9346j3319n3248j01849P9213J02133R089
13587A98927p6377j17487k1710K3906j04395n271N1858O032O2018O9224r7966
13576a1241j51136J12040M808P1037k2582J2747J91790k4052r1337o6520Q161
13565C3715j1960Q9970L9547n7601J13577n3355j6264r196m0887n63N6601L3560
13553A77144j09750m8687K3212j58170m8576l466R8756N4459P6998K7437r1984
$$ y = [10913, 125388, 102115, 12798, -77805, -18737, 23342, -47647, -3287, 92645, 93235, -19135, -6279, -66830, -149129, -145894, -57173, -4380, 47242, 80375, 126241, 205898, 224640, 123884, 113900, -3605, -78382, 65616, 82561, 123873, 34362, -47153, -21520, -125337, -109209, 60162, 178580, 171588, 132377, 196254, 176908, 163589, 110341, 8492, 87705, 189838, 198927, 122550, 5063, -16647, 7259, -97136, -102407, -50549, -44517, 17501, 86725, -11241, -162377, -50337, -45529, 25508, 2926, 15673, 207463, 183411, 92074, 25554, 33715, 21755, 111725, 151272, 93671, 207248, 153893, 137629, 128433, 87546, 86983, 143584, 177144, 67394, 18707, 41919, -116251, -164827, -168293, -69537, -15078, 61920, 89357, -2627]
13542b627K1153J9775M7579Q4103J3020q4535k9371P5786l3831J6476q7028O0837
13530A01337O8551Q3640K6342j8403j59715R907k3172M2821J23029R7089L9373
13519C90799m2661j67007j17142j59195j46910J319J25849P7165P9699o3832M0920
13508A9004n5823o0111p8741m2391J26879L2841Q9162M1557L253N9798j36733
13497a305j33101J2779L1169N1680Q3436m5089J3146L0023m4627M375l2862j73876
13485b04252M6106R3278j143P5634K6721l6613r6967q9264P4758R1735P5555O58
13473E6206l1451j08146j74801O8334J30285m4670N6928N8285j3825P9232o0631
13462A5746q466j9185k1680k9596J0588N3796L3974P7973j1103L9342n700k3184
$$ y = [-2627, 18526, 38301, 85880, 169983, 183003, 98468, 69097, 144883, 111052, 127528, 40500, 101337, 169888, 253528, 279870, 261467, 101752, 111659, 88487, 131308, 254337, 351426, 390799, 348138, 181131, 63989, -95206, -242116, -240797, -114948, -37783, 41916, -21916, 19004, -36819, -96930, -175671, -218062, -91183, -58342, 30820, 72377, 75630, 135428, -1305, -134406, -121627, -90458, -38778, 44658, -431, 12715, 42738, -1889, 2486, -30376, -204252, -158146, -64868, -66011, 9623, 36344, -269, -97236, -186500, -111742, -20007, 55548, 56206, 24755, -83391, -258192, -189858, -59573, -104243, -47315, 10970, -2855, 76377, 15746, 7280, -11905, -33585, -63181, -52593, 1203, 35177, 113150, 102047, 141389, 135689, 112505]
13450A12505P1663j56713j82803n7490M8283Q4421O3412L9875J17727m2194r1161
13439G525m9383J8188Q7594k6234j10980j2331R7117o554l5874J5859J7319Q7378
13427H9624m6646q4184k9242J08344p7001j35852j8427L7308R349J45306R410
13416G989O7257J07255Q0104J8751j10093o1463o878o834M1567p1787K5360O5733
13404A56961O6914o8629Q355p8088j37006q0906J22321l2388O1759P4298r7400
13393c809P5926O5760Q8601L4739o2772o429N3164J1812r7224q349P3673J86412
13381D11504P017J34692J10426J15949J26936k0619J10909J45904R0441j00110
13371A133049j38266k08683j24141q1519o5767L7528p6433j04963j01410j13827
$$ y = [112505, 184168, 27455, -155348, -212838, -164555, -80134, -16722, 23153, 140880, 98686, 7525, -41858, -23670, 63924, 37690, -73290, -85621, 11496, 4942, -30932, -15073, 2246, 89624, 42978, -41206, -70448, 37896, -39105, -174957, -193384, -156076, -146727, -1421, 7989, 75246, 182501, 262605, 281356, 171263, 109800, 102922, 96088, 137655, 65868, 91228, 156961, 223875, 155246, 163601, 85513, -51493, -132399, -10078, -42466, 19293, 93591, -3809, 72117, 137877, 226478, 261217, 198445, 192016, 245180, 256992, 159768, 151419, 225092, 411504, 418521, 553213, 663639, 779588, 906524, 885905, 996814, 1142718, 1233159, 1133049, 994783, 786100, 661959, 580440, 514673, 552201, 475768, 370805, 269395, 155568]
13361A55568m7577J1087j7838M1747K6191k0779J9269J4669m7597O627O0238m2702
13349A58903M7200O5009q0705j73322r4616m221J5166O0264K2541j5315O8715
13338F9619l8744p3161Q2701O400O5607R6130J3301o5056j0980r8966L34Q5869
13326A33054q7741j32291O2487J012K8256J5269K124o6407R3179J35226r0985
13315I3183l4452p4065n3420K4461J51338K7608q5832j7443p8683o6689k8590
13304a42584j289M8468J02132R3677O0741j8522q1562o4321j348J22912j3943
13293A04361j87205J9094N2875Q0029N822l0284P0339m9974J0477N8610r4086
13282D0058r7983M9264J31419k2873J3525M2655p9841r7677N3857m4133n4771
$$ y = [155568, 107991, 119078, 101240, 142987, 169178, 148399, 167668, 182337, 134740, 141367, 201605, 158903, 206103, 271112, 190407, 17085, -77531, -81752, -66586, -6322, 16219, 904, 69619, 30875, -42286, 40415, 46815, 112422, 208552, 221853, 156797, 145817, 46851, 47185, 133054, 45313, -86978, -24491, -23479, 4777, 20046, 22170, -44237, 48942, 184168, 93183, 58731, -15334, -68754, -44293, 107045, 134653, 48821, 31378, -47305, -113994, -142584, -143873, -95405, 6727, 100404, 161145, 142623, 61061, -3260, -4608, 118304, 104361, -82844, -63750, -10875, 69154, 74976, 44692, 115031, 65057, 75534, 134144, 40058, -57925, -8661, 122758, 99885, 113410, 156065, 76224, -21453, 32404, -11729, -66500]
13271f6500J11953K8972k9476L7795J04274L5077k7112q3301Q8425L0144n2939
13260A77312M4772L1940o2850m4044o7301N3765J3454j3275J37491K2383j88400
13249A05247q3018K2296Q4629p9598j21255l0487M969M3936J30715K09277l0768
13238B55943j68127K2408Q3744j13488o5998k6383j10802L8287o607k6085M606
13227a12502J42724j382p3534Q0438N3629N1380J2786O691K5510J5517m056N6580
13215B53781o2883q0503M9967R3328o6903p3912O1221R103O352O4870k9143j6488
13203B08790J1589k4727P8122k5160n4056k8542q545o7153N6452P9618O2543O2742
13191C51673o5677o3927O1922k4944o4797R5464Q1676j05628j8503N690p0414
$$ y = [-66500, 45453, 74425, 44949, 82744, 187018, 222095, 194983, 111682, 200107, 230251, 177312, 222084, 254024, 191174, 147130, 79829, 133594, 147048, 133773, 271264, 293647, 105247, 22229, 44525, 129154, 49556, -71699, -102186, -97217, -53281, 77434, 286711, 255943, 87816, 110224, 193968, 80480, 14482, -11901, -122703, -84416, -91023, -117108, -112502, 30222, 28840, -44694, 35744, 89373, 140753, 153539, 160230, 185740, 201257, 197201, 253781, 190898, 110395, 160362, 253690, 186787, 112875, 174096, 183199, 189551, 254421, 225278, 208790, 220379, 195652, 273774, 248614, 194558, 166016, 157471, 90318, 146770, 226388, 288931, 351673, 285996, 222069, 283991, 259047, 194250, 289714, 371390, 265762, 247259, 252949, 182535]
13180A82535l8866J37884o7380q2493o8763j0491k6627Q5108J35745q446j34006
13169A04200j24039N1149J93289j1037n9165q756l6190J5260P3806r8997o0528
13158C8992m4735r2040J1250J2652J796R3137J01729l9451K0699m9231L8433J70934
13146B64165J12039j22069o9906n1872m6922o8287O6871J10685j3654L8969n397
13135B14622m0515m1248k5123M4709R1826K3107j0585o1843r6590p0168J19451
13124A47643O5508l3449k6485q476j36386l515j7351j9789P9270K11252m6630
13113B11592j43699m6614k1472K23487P0678k11913j06564R0382J11481l735p9641
13102I3982o7563O7044K4021j6802J30847J47032n1046j20085n5975K6536k5638
$$ y = [182535, 143669, 281553, 214173, 131680, 62917, 52426, 25799, 110907, 246652, 238206, 104200, -19839, 31310, 224599, 213562, 154397, 145641, 109451, 124711, 198517, 99520, 38992, -5743, -97783, -86533, -73881, -72085, 21052, 122781, 83330, 104029, 54798, 93231, 264165, 376204, 254135, 184229, 132357, 85435, 17148, 84019, 194704, 181050, 220019, 214622, 174107, 132859, 107736, 152445, 244271, 267378, 256793, 194950, 98360, 28192, 147643, 213151, 179702, 153217, 144741, 8355, 4840, -12511, -32300, 46970, 258222, 211592, 67893, 21279, -193, 223294, 293972, 82059, -24505, 65877, 177358, 173623, 93982, 26419, 93463, 117484, 100682, 231529, 378561, 327515, 207430, 151455, 177991, 152353]
13091A52353j22108Q9634J70421n3051j05213J8968J19442J03789P4549O1722
13081E10506O7192N8733M7404j12204j14008K00772L6592K1298q3010K5291K47626
13070I06192R6421M4208m4730o9531p4080K692J31462N9851K1589J76604L68204
13059A618882M10194K48161K17768J32994n397n5106k65832l12512k01512k90246
13049A497394k12282n7193j23920m462j9652q9413j46209N3283Q0031K16859J03377
13038A297813k01964r6354J32447P4529l7133m276J08192K2178L6812j746N145
13027A335643K8093J05593n4830L4002l7982n8362j4698L3097K20668L0416q3528
13016A538112J58500O1589J14791M9083K8752M5591O77J34857J29160R3389K15830
$$ y = [152353, 30245, 119879, 290300, 237249, 132036, 151004, 270446, 374235, 448784, 510506, 577698, 636431, 683835, 571631, 457623, 658395, 694987, 716285, 633275, 658566, 906192, 1002613, 1046821, 1002091, 932560, 858480, 861172, 992634, 1052485, 1074074, 1250678, 1618882, 2029076, 2277237, 2495005, 2627999, 2622602, 2567496, 2301664, 1989152, 1787640, 1497394, 1285112, 1227919, 1103999, 1099537, 1079885, 990472, 844263, 897546, 977577, 1194436, 1297813, 1095849, 999495, 1131942, 1206471, 1169338, 1165062, 1273254, 1295432, 1332244, 1330498, 1335643, 1363736, 1469329, 1414499, 1448501, 1410519, 1352157, 1337459, 1370556, 1591224, 1621640, 1538112, 1696612, 1758201, 1872992, 1922075, 1950827, 1996418, 1997095, 2131952, 2261112, 2354501, 2570331]
13005B570331N0070j62164Q0471P5497J65092J45119J66169J75139K30125J72898
12995C668747J62231J23390J61316J93541Q6538L31231M65504L31990K20355J81545
12985E926388L41060L12792L74121M71997M97868M66032O07369O92108P59944
12976A0449679P84918R82303J081201J366142J460674J630044J887850J969862
12968B1612673K161618K212021K474209K704457K840599L303379L911166M784119
12960D6004241O403681R097946J2270953J5563614J7750826J8933152J9454993
12953A45479406J8746851J6009314J0676300M510584j806736p834224j3414155
12946A72367340j7863839j9772696j9655742j8392694j6422862j4011666j1041023
$$ y = [2570331, 2620401, 2458237, 2538708, 2614205, 2779297, 2924416, 3090585, 3265724, 3495849, 3668747, 3830978, 3954368, 4115684, 4309225, 4395763, 4726994, 5192498, 5524488, 5744843, 5926388, 6267448, 6580240, 6954361, 7426358, 7924226, 8390258, 8997627, 9689735, 10449679, 11234597, 12216900, 13298101, 14664243, 16124917, 17754961, 19642811, 21612673, 23774291, 25986312, 28460521, 31164978, 34005577, 37308956, 41220122, 46004241, 52407922, 61505868, 73776821, 89340435, 107091261, 126024413, 145479406, 164226257, 180235571, 190911871, 195422455, 193615719, 185781495, 172367340, 154503501, 134730805, 115075063, 96682369, 80259507, 66247841, 55206818]
12939E5206818p930559n587757m283699l216929k462538k070433j849981j784266
12931B6020656j569324j577010j468871j380496j212548r64701p69767q60973
12923A6216966p44156o00953p04664n54431n80249n41226n83508n24634o10790
12914A0772355m87679l17711m28586l34323l55173k36625k99801k65081l85437
12905G661939l75315k00005k4030k20372j26667k40444l92017k01662j50496k93790
12895E437141j39434n2530j57431j82590k02389j93419k05509j76585j97445j62286
12885C767523j82679K01n4495k3254O2454q8355m2479j15019q6549j02681o748
12874C127919o5701j81196k38888j17353q1552p3267q0495p3433j21088M883m928
$$ y = [55206818, 47276259, 41688502, 37404803, 34187874, 31725336, 29654903, 27804922, 26020656, 24451332, 22874322, 21405451, 20024955, 18812407, 17847706, 17077939, 16216966, 15472810, 14871857, 14167193, 13612762, 13032513, 12491287, 11907779, 11383145, 10772355, 10284676, 9966965, 9538379, 9204056, 8848883, 8612258, 8312457, 8047376, 7661939, 7286624, 7086619, 7062589, 6842217, 6715550, 6475106, 6083089, 5881427, 5730931, 5437141, 5297707, 5245177, 5087746, 4905156, 4702767, 4509348, 4303839, 4127254, 3929809, 3767523, 3584844, 3585045, 3530550, 3507296, 3569750, 3481395, 3438916, 3323897, 3237348, 3134667, 3127919, 3062218, 2881022, 2642134, 2524781, 2443229, 2369962, 2289467, 2216034, 2094946, 2099829, 2094901]
12863B094901j2037Q2650j509r0601k14910k3343J64495M9701o2323j0649j73705
12852A802670j26218n8376l6098j07745j44091m7256o5080N9804K5664M1966O8058
12841A413298n2796m4611N1389o067q1440k28398K4116O2628k8743o6901k6033
12830A016442n258j9522j48587j78543O792J1820k4014n0030M7699l199j90440
12819D63160K4477o7605m7591J1608L6695K15701r301j24280j37152L0623P2676
12808D69011q358j36896k0008J29135Q4554P6604j02662p1465J71194L1389P9350
12797G01848j66633j68497J32121J15552L7873r1269J9143j53071j14238n0907
12787B61922P565O9443J32602L9870l6077K7468l8841j48373P307M491m1302J7059
$$ y = [2094901, 2082864, 2165514, 2164005, 2073404, 1858494, 1835151, 1999646, 2049347, 1987024, 1976375, 1802670, 1676452, 1618076, 1581978, 1474233, 1330142, 1282886, 1217806, 1277610, 1303274, 1345240, 1413298, 1360502, 1315891, 1367280, 1361213, 1279773, 1051375, 1075491, 1138119, 1109376, 1042475, 1016442, 1011184, 991662, 843075, 664532, 671324, 683144, 659130, 609100, 656799, 653600, 463160, 487637, 420032, 372441, 384049, 420744, 636445, 627144, 502864, 365712, 396335, 469011, 460653, 323757, 303749, 432884, 517438, 594042, 491380, 419915, 591109, 622498, 701848, 535215, 366718, 498839, 614391, 652264, 560995, 580138, 427067, 312829, 261922, 269487, 338930, 471532, 511402, 475325, 502793, 463952, 315579, 322886, 327377, 286075, 303134]
12775C03134J030J8495J20640l2207p7453N0810P0024J33583m0558o116k696l9948
12763D98738k2239l7070q353j82645n2739J14430Q6197R2407J60114J17888L8112
12752H04840J21944N1714L5765j2837r8807j83566o1538K11794J35039j0631n7997
12741I35720L017j0462j48807j16781Q355J11633J52656P2501N0803j4375N778
12730A050038M7346j7680j15518p1502J03655J28971j9070j73031J4370K08999
12720A156578J04458R0134J0049M796q0421k7465P1393q2613k3172Q6296J01130
12709A411163k1090j21222N396J47533J12323J26287j15603K2225O7520J7891
12699A652423L8193P4457O7124l938m8356K06543J11297q00o1343l3813P2006
$$ y = [303134, 304164, 322659, 443299, 411092, 333639, 384449, 454473, 588056, 547498, 541382, 538686, 498738, 476499, 439429, 431076, 248431, 195692, 310122, 396319, 488726, 648840, 766728, 804840, 926784, 978498, 1014263, 1001426, 902619, 719053, 657515, 869309, 1004348, 993717, 935720, 938737, 928275, 779468, 662687, 671042, 782675, 935331, 1007832, 1058635, 1044260, 1050038, 1097384, 1079704, 964186, 892684, 996339, 1125310, 1106240, 933209, 947579, 1156578, 1261036, 1351170, 1361219, 1366015, 1285594, 1258129, 1329522, 1246909, 1223737, 1310033, 1411163, 1390073, 1268851, 1274247, 1421780, 1534103, 1660390, 1544787, 1567012, 1634532, 1652423, 1690616, 1765073, 1832197, 1828259, 1779903, 1986446, 2097743, 2096943, 2035600, 2001787, 2073793]
12688B073793J02726J74647J25520J5065k5895K7323l0903j6504J52981K87878
12678B886631K33990J60152Q5997J34872J88082K16337K79351K44032K21404J76110
12668D826958J49115J30989K81621K85481K20162J20860L05307M86058M03853
12659G210404M89819M99108M31606M95327L74856N33513O69102O60988Q41428
12650A2206151R58386J014851J018852J238213J479999J777503K020311K269613
12642B3983879K683343L033034L195565L344797L481827L640270L827040M097002
12634E1286757M827780N818562P103586R335555J2990473J9088155K9556620M5841936
12626A85849424O3143054O5648489M4866172J4131602n266906j1147380k1732177
$$ y = [2073793, 2176519, 2351166, 2476686, 2491751, 2465856, 2493179, 2462276, 2445772, 2598753, 2886631, 3120621, 3280773, 3366770, 3501642, 3689724, 3906061, 4185412, 4429444, 4650848, 4826958, 4976073, 5107062, 5388683, 5674164, 5894326, 6015186, 6320493, 6806551, 7210404, 7700223, 8199331, 8630937, 9126264, 9501120, 10034633, 10703735, 11364723, 12206151, 13164537, 14179388, 15198240, 16436453, 17916452, 19693955, 21714266, 23983879, 26667222, 29700256, 32895821, 36240618, 39722445, 43362715, 47189755, 51286757, 56114537, 61933099, 69036685, 78372240, 91362713, 110450868, 140007488, 185849424, 248992478, 314640967, 359507139, 373638741, 368371835, 357224455, 335492278]
12619C35492278m2627199n9971438n9801206m4982909k8579426j7738017j1741564
12612G0050519q488653o435236n181129m502227l770842l025018k600979k108806
12604C3937629j787420j570796j304799j165609j262799j157705j167853j025234
12596B3495414j034709j003165r08667q09428p14453q17457p99949q94752p73694
12587A5739140n80076n58100o16925m60084n04956o02774m09425l08164m79829
12578A1218807l94435l91854l57648k40032m41886l30489j76597l28094k16626
12569H341146j81073j90262k27663k23009j47487k19792j73905k71272k55628
12560F451055l06368l54386l77200p7498n0155k88889k60134j14987j28698k00241
$$ y = [335492278, 292865079, 232893641, 173092435, 128109526, 99530100, 81792083, 70050519, 61561866, 55126630, 49945501, 45443274, 41672432, 38647414, 36046435, 33937629, 32150209, 30579413, 29274614, 28109005, 26846206, 25688501, 24520648, 23495414, 22460705, 21457540, 20548873, 19739445, 19024992, 18207535, 17407586, 16512834, 15739140, 15159064, 14600964, 13984039, 13523955, 13018999, 12416225, 12006800, 11698636, 11218807, 10824372, 10432518, 10074870, 9834838, 9392952, 9062463, 8885866, 8557772, 8341146, 8160073, 7969811, 7742148, 7519139, 7371652, 7151860, 6977955, 6706683, 6451055, 6144687, 5790301, 5413101, 5335603, 5285448, 4996559, 4736425, 4621438, 4492740, 4292499]
12550D292499j13057K4646p9638j54278j81193q5857q451j14642j71244m0647
12540C368138R891j22806j34366M8729p691Q8142j6056j8371o2712n1039r1836
12529C010023L6796J54958Q4340r5197j6395Q5519J15883J43889K46748K56586
12519D023150J79798J01400j00275j59684j67116k40839k97660l40795k69752
12510B728227k00875j82826k12486m2514q2899q4240m4711n3977q7984m7322q4834
12499A603559k1649o1030n0683r5582j24523j89647j21346j47522j59626k3240
12489F08711M5358R0275q0264l7904J00181r1729n9353l1988N3299M5058q157
12478F33487r1020O9814K0375k4479q561p5369n6715L8127N8438l9210n5868k9069
$$ y = [4292499, 4179442, 4204088, 4124450, 3970172, 3788979, 3703122, 3694671, 3580029, 3408785, 3368138, 3378029, 3255223, 3120857, 3169586, 3161895, 3250037, 3233981, 3215610, 3152898, 3101859, 3010023, 3046819, 3201777, 3286117, 3190920, 3174525, 3260044, 3375927, 3519816, 3766564, 4023150, 4202948, 4304348, 4204073, 4044389, 3877273, 3636434, 3338774, 2997979, 2728227, 2527352, 2344526, 2132040, 2089526, 2006627, 1922387, 1877676, 1823699, 1735715, 1688393, 1603559, 1581910, 1520880, 1470197, 1374615, 1250092, 1060445, 939099, 791577, 631951, 608711, 654069, 744344, 664080, 626176, 726357, 634628, 575275, 543287, 596586, 641644, 633487, 542467, 612281, 632656, 608177, 599616, 524247, 467532, 505659, 564097, 524887, 469019, 439950]
12466D39950j07860L4293P1505P6440N7917j9094p4500n5307m4893K4524J06793
12455E09768o1540p0699o150n8020j8877J08702j43866p931M8709m1733j3198
12444B45165Q6129J7548r1650K9115K1874n0932m2680r8110J64495O1233n8535
12433B83652j25854O2700p221o9357J13866N578q4539J6314J7699M787J09231
12422C26856l6943n535O3492j879n2178K5145n340q9791J45606O1631O7578j82549
12410C16093k39226N0659K6768m7690m2115j8343L8601o2080N6942J59285K2903
12399B61797m0922R4711K6411j19506n1153k8692q2175k797n2126J6121J48268
12388A69937M4493n0461M9237j1716Q3424o7634M6841K5725j79038q7366M5371
$$ y = [439950, 332090, 366383, 437888, 514328, 572245, 553151, 478651, 423344, 378451, 402975, 509768, 448228, 377529, 371379, 313359, 294482, 403184, 259318, 251387, 300096, 258363, 245165, 331294, 348842, 257192, 286307, 308181, 257249, 214569, 116459, 280954, 342187, 283652, 157798, 220498, 213277, 143920, 257786, 263364, 178825, 195139, 212838, 217625, 326856, 289913, 284378, 347870, 345991, 293813, 318958, 313618, 223827, 369433, 431064, 498642, 316093, 76867, 127526, 154294, 106604, 64489, 46146, 84747, 22667, 79609, 238894, 261797, 220875, 315586, 341997, 222491, 171338, 142646, 60471, 57674, 5548, 21669, 169937, 214430, 163969, 213206, 201490, 284914, 217280, 264121, 289846, 110808, 23442, 68813]
12377F8813N3986N8166K2733O7255N7593m784o4462k8556J14311N3268j61960
12366B36363j90178k9341Q6729J47061m7528m525n9642j323J04002P4275q0546
12355B35347j07755J1174M5513m6549O6036K0581l6752j19943p4772L7229N2714
12344H2823Q1904N5906r0181p3775N331K5038m3939O022N0832Q0864K2439k1494
12332A81770o672J7489R532j6225l1649j62890O7628L4802p2183k6227j2458j35575
12320a52658j15916j9732O7938J29737J64818o979j05746j702j2053o9555P2952
12309d8896M2725l0627n5697J5239j3339J21152L6724Q8865p3113k52817p848
12298a77632N2409m197Q6325P1054N6052p4692l7156m7559o4820k2510P2088M3029
$$ y = [68813, 122799, 180965, 203698, 270953, 328546, 323762, 259300, 230744, 345055, 398323, 236363, 46185, 16844, 103573, 250634, 203106, 198581, 138939, 137616, 241618, 315893, 235347, 127592, 138766, 184279, 137730, 203766, 224347, 187595, 67652, -7120, 30109, 82823, 164727, 220633, 130452, 56677, 62008, 87046, 43107, 49129, 99961, 180825, 203264, 181770, 175098, 192587, 202119, 185894, 154245, -8645, 58983, 93785, 21602, -4625, -17083, -152658, -268574, -288306, -220368, -90631, 74187, 67208, -38538, -40240, -52293, -121848, -48896, -6171, -36798, -92495, -77256, -90595, 30557, 67281, 156146, 83033, -169784, -177632, -125223, -129420, -43095, 27959, 84011, 9319, -27837, -75396, -140216, -162726, -90638, -47609]
12286d7609n5947Q5907K9132K0700p970l1562n4538n8797m1329J04941Q8070P2125
12274A03123j6081P4571l5807r3746j32816j41125N4706P8889M4053J92656k9739
12263I8684r3661O6583R4125J500r0065K8626K21m2005m8466n6010L7525M1164
12251C8221K5270L1567n4231j56890l5166J39785m404j63686l6419N5308j0602
12240a71247J03109J49804l2753j17713J6783M5376N600o959o3702J5302j8021
12229g4421N0927P2341j5282q0422j6892J5718J30090J12088l4471r1727j93125
12218a25176l9152M3882l4772R0175J30669M003j2243N1893J29867k8325n5005
12207A55816P789n8128o3335N1504J46611q682q4651Q5659Q6986O6668m640n2142
$$ y = [-47609, -103556, -17649, 11483, 32183, 24213, -7349, -61887, -120684, -162013, -57072, 30998, 103123, 87042, 161613, 125806, 32060, -100756, -241881, -187175, -108286, -64233, 128423, 98684, 5023, 71606, 165731, 167231, 77166, 105792, 106013, 64008, 15542, -40468, -2943, 38221, 63491, 95058, 40827, -116063, -151229, -11444, -15848, -179534, -215953, -160645, -171247, -68138, 81666, 48913, -68800, -52017, -6641, -1041, -8000, -71702, -56400, -74421, -23494, 48847, 33565, -46857, -63749, -48031, 82059, 194147, 159676, 67949, -125176, -164328, -120446, -155218, -65043, 65626, 69629, 57386, 109279, 239146, 210821, 155816, 163605, 105477, 42142, 93646, 240257, 231575, 146924, 232583, 319569, 386237, 381597, 329455]
12195C29455L5405k365K6028q9061J0939J9781L0691J66255J88061K25836L11748
12184A252773L90122J22050m793q3624j72317j15186j16915l04597k33004j63151
12174E71358k08146o6911l5650J4066r23n2651n4613k8982k1730j12541o5017
12163f1740L8335q8224O0302J22069O4118j32008p9409J6951J7831q984P8263
12152B7504P4956M7950P6027q2444o9221q4282k6023j7763N8484J19967j2093
12141A13062j03917J8536O8510L156l3685r1776K9901J7763M7646N6968n1844
12130G4320k0749n8413r044N762l4696l199K7009K7762m8211J5884K7047k856
12118F16k6879K799J16302L5565j63972J5821m9044o2171J11204O2975n3865j5770
$$ y = [329455, 364860, 362495, 388523, 299462, 310401, 330182, 360873, 527128, 715189, 941025, 1252773, 1642895, 1764945, 1760152, 1676528, 1504211, 1389025, 1272110, 967513, 734509, 571358, 363212, 296301, 260651, 274717, 273794, 221143, 166530, 137548, 115818, 3277, -61740, -23405, -111629, -51327, 70742, 134860, 2852, -76557, -59606, -41775, -50759, 27504, 102460, 150410, 226437, 143993, 74772, -9510, -35533, -53296, 5188, 125155, 113062, 9145, 27681, 96191, 99347, 65662, -26114, 3787, 21550, 69196, 126164, 74320, 53571, -4842, -13886, -8124, -42820, -46019, -19010, 8752, -39459, -23575, 3472, 616, -26263, -23464, 92838, 128403, -35569, -19748, -68792, -130963, -19759, 43216, -10649, -26419]
12106b6419m3165J27866K7801p7646k7630Q236o2889j11416J34187J61596L4186
12095A44707J8619j2208n8749Q96O1904p8314n5600k4696M2624l8179r9487L9871
12083e8612J4597k4306k08106R7434J36932R2786L2478m5029m1775p8977j04189
12072a86767K0324N9112m1701l1096J1370J05529J1299J09431l4665o7308p944
12061e2416j23812k8210Q4154L4477p3682k0907k8118M0465N6347M9380n0377
12050a12699l0021K0862J25813L6333l2263l9648J4747j6173O0785M0730j34104
12039f5638j76418k5837J46940L6862j45790o594K27770J61715M0839j5341q5323
12028I3185O7312l7838k17557K7856K49057J5638l6345o1187m5138r0444p6838
$$ y = [-26419, -69584, 58282, 86083, 8437, -19193, -10957, -73846, -185262, -51075, 110521, 144707, 163326, 151118, 92369, 93265, 155169, 76855, 21255, -3441, 39183, 1004, -98483, -58612, -44015, -68321, -276427, -178993, -42061, 50725, 83203, 38174, -3601, -82578, -186767, -166443, -107331, -149032, -180128, -168758, -63229, -51930, 57501, 22836, -44472, -52416, -176228, -204438, -120284, -85807, -159489, -180396, -208514, -168049, -111702, -62322, -112699, -142720, -121858, 3955, 40288, 8025, -31623, -16876, -33049, 27736, 68466, -65638, -242056, -267893, -120953, -84091, -229881, -236475, -8705, 153010, 193849, 178508, 93185, 160497, 122659, -94898, -67042, 182015, 197653, 161308, 100121, 54983, -35461, -112299]
12017a12299j7563J47667L0301p5208q6023k7949M4490k1861J505J75816O2669
12006A21545j9923o1147k0406N4722P258m2706q7205m7436j6763N9626J8259j14542
11994a48718k0067J40263J16513j40432k0071R1029j9168m6331J6735R3451L1565
11983I4769N0920m5287j14621p8088k4636L7581L3591N340M3554L3572J23521
11972A60216r901j45085m5194M7776P001j4067j1076j11657l6554M9173P0147
11961c9221r9366n0725J84606J07331J332n0886j18248n2694J4535J12436o4027
11950e4927o2333R150P3784L1625m1415q0796N9280J22378J9225j7316K1736M8839
11938A29230m4116M0167N984p9888r3892J10315J2988j70829J0959M1848N4501
$$ y = [-112299, -129862, 17805, 48106, -27102, -113125, -141074, -96584, -118445, -116940, 58876, 121545, 101622, 40475, 20069, 74791, 82049, 39343, -47862, -95298, -112061, -52435, -34176, -148718, -168785, -28522, 87991, -52441, -72512, 18517, -651, -46982, -30247, 63204, 94769, 145689, 100402, -14219, -92307, -116943, -79362, -45771, -40431, 3123, 36695, 160216, 150315, 5230, -39964, 7812, 14813, 746, -10330, -121987, -158541, -109368, -39221, -138587, -189312, -4706, 102625, 103957, 53071, -65177, -117871, -103336, 9100, -54927, -117260, -108110, -34326, -2701, -44116, -124912, -65632, 56746, 75971, 58655, 80391, 129230, 85114, 125281, 131265, 51377, -42515, 67800, 80788, -90041, -79082, -37234, 17267]
11927A7267L9691q062l7371L473m0549K0679M2392M9774K2618m7640l6184q0457
11915e4369j03078q9934P8511J03898K5316l046R8142N069m3865K7918j4139o5340
11903c4917j51770o7502M4963k3413N4006M8951J77148l7193j31171K4644j50256
11892b46510o670Q3117J10878m2787j79015K2907J06740K01188N1913p7643m4391
11881b0273Q5545m3034r3887J3728L6580l6068o6763r3778K8148Q1094K7452R9738
11869A8482l1428p4371O8203O3725k3844L4289m0118p0649M0208J6160M8740K5438
11857G4835J02377m5043q5120j27344O8470R9035M068M0607l8988j59075j50157
11846b16335l8209r5970J87291Q7007J06453J4977j4271R8580o8677j3442J40336
$$ y = [17267, 56958, 48896, 11525, 14998, -25551, -4872, 37520, 87294, 109912, 62272, 26088, -54369, -157447, -247381, -168870, -64972, -39656, -42702, 55440, 60509, 16644, 44562, 30423, -34917, -186687, -254189, -209226, -232639, -178633, -129682, 47466, 10273, -120898, -96254, -246510, -253180, -170063, -59185, -101972, -280987, -258080, -151340, 49848, 101761, 24118, -20273, 65272, 22238, -71649, -57921, -21341, -57409, -124172, -217950, -189802, -108708, -81256, 18482, -12946, -87317, -19114, 44611, 20767, 55056, 14938, -55711, -15503, 657, 49397, 74835, 177212, 132169, 47049, -80295, -11825, 87210, 91278, 131885, 92897, -66178, -216335, -254544, -350514, -163223, -76216, 30237, 45214, 30943, 129523, 60846, 47404, 187740]
11835A87740R6274k6359j12271j08490q4567o2408q1519k8355P4442O2625J38791
11824E5903P3168K1740N8522r0630m9359L4795M3082m9548J02471J46824j54718
11813A92250j91784j83182j2253M9870J8639M6581J45424n6343l2422N3557J19179
11802A49516K4389j51565q4707k6644j21162o3173M1746N5304n4363j49844Q6289
11791b94214J18203M1554P5053J225n0417O4352L8794k2077l7876j93852p4461
11780c33716R1435J64120Q9151l7883m9156k4219P3827Q893j10954k2953L3660
11769a17795M1559O10K3235Q6980O3830p7264k9025l6697j2223P8219q8876q8772
11757a56219O0707Q8331o7745j8559J9932J49851J18595o6163L7718r4016L1017
$$ y = [187740, 284014, 257655, 145384, 36894, -47673, -110081, -191600, -219955, -145513, -82888, 55903, 129071, 150811, 209333, 118703, 69344, 104139, 147221, 97673, 200144, 346968, 192250, 466, -182716, -194969, -145099, -126460, -79879, 65545, 9202, -23220, 30337, 149516, 173905, 22340, -62367, -89011, -210173, -273346, -231600, -176296, -230659, -380503, -294214, -176011, -134457, -59404, -58179, -108596, -44244, -5450, -27527, -65403, -259255, -333716, -242281, -78161, 10990, -26893, -76049, -100268, -26441, -17548, -128502, -151455, -117795, -76236, -75626, -52391, 34589, 98419, 21155, -7870, -44567, -56790, 21429, -67447, -156219, -95512, -7181, -74926, -93485, -73553, 76298, 194893, 128730, 166448, 72432, 103449]
11746A03449J2624m6075j39785k8565L8133P6232j7450N1740K6686j00273p0333
11735i3617l0680r5268M8023K04146P5093j57526J6898Q0725K7862q4544m7784
11724e6672j21395O9457J21832Q4369K977j8249q5497l3007l0745Q3349J695r0826
11712g2712R5857J29042m0171j11076K5002P2709N9793n9681P0452J1918j45032
11701C6101l1844R2827K9629j20087j2821J25885Q2379j8923K2444n8700L0473
11690A77363j63759r9555J18345J30194j02491p0446N8226J3422j3479m7158l7023
11679c6361N3690l8034p6962L7414Q6566m1161n4080P5833l7292K2738N5357J3625
11667F1333O8025J8508l5723J14343J7673j32684p0729j08958o4410N853M068
$$ y = [103449, 116073, 69998, -69787, -98352, -60219, 16013, -1437, 50303, 76989, -23284, -93617, -124297, -219565, -171542, 32604, 107697, -49829, -32931, 47794, 75656, -8888, -56672, -178067, -108610, 13222, 97591, 100568, 82319, -3178, -36185, -66930, 16419, 18114, -72712, 23145, 152187, 112016, 940, 25942, 98651, 158444, 98763, 169215, 181133, 36101, 4257, 97084, 126713, 6626, -6195, 119690, 202069, 183146, 205590, 146890, 177363, 13604, -85951, 32394, 162588, 60097, -10349, 47877, 61299, 47820, 662, -36361, 17329, -20705, -97667, -60253, 26313, -14848, -68928, 6905, -30387, -7649, 47708, 61333, 129358, 147866, 112143, 226486, 244159, 111475, 40746, -68212, -132622, -126769, -122701]
11656a22701q8057j4394J7849R1361n9518J9213Q7918j6984l0252M9395K5470
11645d0700k647r7308l3521J00190R1917R4308M9767n4411o3271p7585N5679N3402
11633G5820k1294l1801j00851m2700J5753k8949k6558K4716m0327J57536J8699
11622D4p7447q3883J13322O9645o8870l8023K5033P8558P6287r010j72830j16458
11610b03632K6306k0867l4432L4229J80479l2082j6058O5048q5898N0094j5550
11599e2363M3249o3191m5275j2777k3707q6269n7894K0534K3434R8279J71188
11588A5208K9289o4268J08117M5738L8735m9284r8149O2889N0293L6140p710m4046
11576A22952M3697o684r5256P0j261N1408p7360k3693j9752K6197k4930K0678
$$ y = [-122701, -210758, -225152, -207303, -115942, -175460, -156247, -68329, -85313, -115565, -66170, -40700, -43347, -140655, -174176, -73986, 17931, 112239, 162006, 107595, 44324, -33261, 22418, 75820, 54526, 22725, -78126, -120826, -105073, -134022, -160580, -135864, -176191, -18655, 44, -77403, -161286, -47964, 21681, -47189, -85212, -60179, 18379, 94666, 85656, -87174, -203632, -177326, -198193, -232625, -198396, -17917, -49999, -66057, -1009, -86907, -36813, -52363, -9114, -72305, -117580, -130357, -154064, -240333, -298227, -277693, -254259, -155980, 15208, 44497, -19771, 88346, 134084, 172819, 123535, 25386, 88275, 138568, 174708, 166998, 122952, 166649, 159965, 64709, 64779, 63518, 114926, 37566, 13873, -5879, 20318, -4612, 16066]
11564A6066L4648J08873L9163r1281j12502j11695m5181J2475l4637m6923J85736
11553d5258J0658r6545o0925K8907J41629N2493N601J5677q3906m2249R7640m4155
11541b0433o0574R1561N00j02604N0305R4258q2621L7740K640N7008O1213n0135
11529G8858l3012K2945K1938j14585j24575j09399J32487J17691J03160Q2913
11519A78421N4390j15828j87936K9491o4257p0120M1996K8242L5401Q9000k8928
11508a0128k3075K1484k9839k6883J04177J24957p3318j07698r7743q148j924
11497a28138K3938J06304K357j4976q4717J07107Q0208J8950r682n4338o7666
11486b0653M5047n9486o1555R337J12246l8570n2576m4074J20716L4793j22254
$$ y = [16066, 50714, 159587, 198750, 107469, -5033, -116728, -161909, -149434, -184071, -230994, -45258, -34600, -131145, -192070, -163163, -21534, 30959, 36560, 52237, -31669, -73918, 23722, -20433, -81007, 10554, 11054, -91550, -41245, 53013, -29608, 8132, 10772, 67780, 128993, 78858, 45846, 68791, 90729, -23856, -148431, -257830, -125343, -7652, 95508, 178421, 232811, 116983, -70953, -41462, -105719, -175839, -133843, -105601, -70200, 18800, -10128, -33203, -11719, -41558, -68441, 35736, 160693, 87375, -20323, -118066, -126214, -128138, -104200, 2104, 4461, -10515, -95232, 11875, 92083, 111033, 101351, 47013, -20653, 24394, -35092, -96647, -87310, 24936, -13634, -66210, -110284, 10432, 45225, -77029]
11475g7029l1533J01525k3575K9525J6327M8707q7856k3042j04715j8451K1069
11464a49048Q2865J00571l9410r9322K5405K0687J47098N409l1434N8188m7444
11453G3565n8629q8074j37542j3417J62010P5236j7378l6035p4186J1662p3719
11442a76507K754J29662p4976j2434P3684M1669l4345n5768K0560N2454K8068
11431e179M0354p0074j32871j09255J1856J97625o7556k9947n1568K2446j01592
11420b95761k7887J46685J13852n1418j7261K46316l1282n9604l1439j7397J9086
11409f110M0273m0412n3941K1489J9289K2126K210j94527j09901J18404R8529
11398h2571O4889n5419n5640j5538K7710J60005q6036N3253J543j03432k5991
$$ y = [-77029, -108562, -7037, -30612, -1087, 15240, 63947, -23909, -46951, -151666, -170117, -149048, -66183, 34388, -5022, -104344, -78939, -58252, 88846, 94255, 62821, 121009, 73565, 14936, -73138, -210680, -224097, -62087, 13149, -4229, -40264, -114450, -102788, -176507, -173753, -44091, -119067, -131501, -57817, -16148, -50493, -106261, -85701, -33247, -5179, 35175, -34899, -167770, -277025, -265169, -67544, -135100, -165047, -216615, -194169, -295761, -323648, -176963, -63111, -114529, -131790, 114526, 83244, 23640, -7799, -25196, -6110, 34163, -6249, -60190, -38701, -19412, 2714, 4924, -189603, -299504, -181100, -82571, -17682, -73101, -128741, -144279, -116569, 43436, -42600, 10653, 12196, -91236, -117227]
11387a17227J32726O5220k5916k2884J37260O2907j36200j14135o9979k5394M2335
11376g1287P7660J4498j43425n736P1294Q2785R2595m533j61504j00371N414M7795
11364i4815L0237p1791J6929K8421n3269L6833O9098M6671j44428j00557L5511
11353b01160M9544O1317r1954j8629L2347J22897j15861p179j0880l9729j0244
11342b29531K1750Q1126P6361J396m9183J08655J47611k1167j79796q2338m9055
11331a74171m5079K6926n8009R5935J2531R1614P0463J38087L6277O871q4989
11320A16456k68231q8280R6933m5544K470k620l0747j4935k6079O9938J97146
11309F507N7373q5450O382k0156L7293m1272k52638R1964Q1278r3877K6987R2917
$$ y = [-117227, 15499, 80719, 54803, 31919, 169179, 232086, 95886, -18249, -88228, -113622, -71287, 6373, 20871, -122554, -128290, -56996, 25789, 118384, 113851, -47653, -148024, -142610, -94815, -64578, -136369, -119440, -91019, -144288, -107455, -38357, 8314, -136114, -236671, -201160, -151616, -90299, -182253, -200882, -168535, -45638, -161499, -168678, -179558, -219287, -229531, -207781, -126655, -50294, -48898, -98081, 10574, 158185, 137018, -42778, -125116, -174171, -219250, -192324, -250333, -154398, -141867, -50253, 20210, 158297, 194574, 201445, 116456, -151775, -240055, -143122, -188666, -186196, -188816, -219563, -234498, -260577, -190639, 6507, 63880, -21570, -15188, -35344, 1949, -39323, -291961, -199997, -118719, -212596, -185609, -92692]
11297i2692P7706m4635K616J17456Q2717n3770p0929r1682k6088j3054n8744M0806
11285a30293P4538P6249k3682L397r911J6766J9040j12941j57675J08108J42678
11274F274o4652j01293P16Q4280R298J1571j01516K2834J36038O9636m067j11936
11262d2817m7948m8625P0448P7395o5721R222L3223j6647n1285n749R4037n4183
11250d8650j9250M5101J95197N7287j12936r8379P8558l545J2546m0866j07873
11239d2810p8550j22974m4368P2365M1961N1880q3319k61N1753N25m236K298J43312
11226a2424J3618J8891J34710K9796j4462q9780k8387M9747k4067k1527N9479
11215A15594M201n0191j7564o2062j64893O7300r9172L3413L1115r5076n3819
$$ y = [-92692, -14986, -59621, -57005, 60451, 143168, 89398, 18469, -73213, -99301, -112355, -171099, -130293, -55755, 20494, -3188, 209, -9702, 7064, 26104, -86837, -244512, -136404, 6274, -58378, -159671, -158955, -74675, -65377, -53806, -155322, -132488, 3550, 73186, 69119, -42817, -90765, -139390, -68942, 8453, -57268, -48046, -14823, -31470, -82755, -88504, 5533, -48650, -67900, -22799, 172398, 229685, 116749, 18370, 96928, 93383, 105929, 65063, -42810, -121360, -244334, -288702, -216337, -174376, -122496, -205815, -206076, -154323, -153798, -158034, -155736, -12424, 1194, 20085, 154795, 184591, 170129, 80349, 51962, 101709, 77642, 56115, 115594, 119795, 69604, 52040, -10022, -174915, -107615, -206787, -173374, -142259, -237335, -291154]
11204b91154J29319K6591N9742Q3151q5475K3832q832k9595j79413k3897J45155
11193a50576K8032P5404P0626j13851o024L4394m0812N962N1758K5062j7263p9574
11181a16862J4399n5099k6377J24333j00937j15015N5313O5688J42995L1501P9688
11170I9627m9901k4218j6774l6135j04627R6699J01209m2704k10153j51470j02739
11159d41186m4245J03780J52613J18327J11159q8150p2349J1913O0529R0802o62
11148B531O105j2122j909R454K7744N0976p861q9760K2831k5640l7901K6971J1253
11135a7328p692N089m407O2869N5506o3284n0689R9417o3630o4332m5787O0558
11123c3710N9010k085P2945M6647o0560K0401n0910k7613j01705j69231l0911
$$ y = [-291154, -161835, -135244, -75502, 7649, -77826, -53994, -62826, -92421, -271834, -295731, -150576, -122544, -47140, 23486, -90365, -96389, -61995, -102807, -96845, -45087, -20025, -37288, -116862, -102463, -157562, -183939, -59606, -160543, -275558, -220245, -154557, -11562, 19939, 99627, 49726, 25508, 8734, -27401, -132028, -35329, 65880, 23176, -186977, -338447, -441186, -485431, -381651, -229038, -110711, 448, -87702, -160051, -148138, -87609, 3193, 2531, 8636, -3486, -5395, 4059, 31803, 82779, 74918, -14842, 7989, -17651, -55552, -28581, -17328, -25020, -19931, -24338, 38531, 94037, 30753, -19936, 79481, 15851, -48481, -94268, -33710, 25300, 23215, 96160, 142807, 82247, 102648, 51738, 24125, -77580, -246811, -277722]
11112b77722J34583J24653r9928O3235Q0089M8471n472j62081j5924j72329r6405
11101c78830J65706M9223R8757m4860j9736J34658N6313j00333J8121M7253j9706
11090F566p0431j26862q4655K1035K0943N9094L2807Q474J37786K3590m6164k6517
11078d4334o8910r3087p7340l1046P9501J21074J04800M3240K3568j05181L4708
11067a3007n5398p3135p623K2513O6565k3690o1673p87K1082O6142p444r0565
11055a57020K0688J22798r6337q9660J1841J8190P2425K9526J6146j21652m3434
11044b16489P8904M774J7507M1720j2426l5342j0310l725J2729n6198j02813J19322
11032a62347J17823j4875M3752J96058l2634j64855j19226O7097L4729M4729L0742
$$ y = [-277722, -143139, -18486, -118414, -55179, 24910, 73381, 67909, -94172, -110096, -282425, -378830, -213124, -163901, -65144, -110004, -129740, 4918, 61231, -39102, -20981, 26272, 6566, -63865, -190727, -275382, -254347, -233404, -174310, -141503, -133029, 4757, 28347, -17817, -44334, -113244, -206331, -283671, -314717, -235216, -114142, -9342, 33898, 57466, -47715, -13007, -68405, -141540, -149163, -126650, -60085, -83775, -145448, -146235, -125153, -59011, -66455, -157020, -136332, -13534, -109871, -199531, -187690, -169500, -97075, -67549, -51403, -173055, -216489, -137585, -132811, -115304, -73584, -86010, -121352, -131662, -135387, -122658, -178856, -281669, -162347, -44524, -59399, -15647, 180411, 147777, -17078, -136304, -69207, -34478, 10251, 40993]
11021D0993q333m2901K3610k0154j9657P7732p4978M1695J3019j63859Q0736J0567
11009d1530p6955o5675j1142O5814R2012J07843O9985j99200j15724L7605N3516
10998h3451O0582p7661l7151J9611L3079P3719M8875L5886r4885j04343j5228
10987a40967O5529p6761j0429K4904P9459J47544L1826L6946P0797q5010n3487
10976I0351J90865l0599j76567n9933m6459M0035M4732o3324j0794J16081O7617
10965A62005k7249l9589j30055n7711Q4926o1153L7534M4201J7770P0022p5041
10954B5660q1583j01357j1733J57146O9148n562m5607L4347j4364j5537M4166
10943E4724j9940j50841m0546J6505M7900O8663m6499k6406J3873J9222Q3180
$$ y = [40993, 32660, -10241, 13369, -6785, -26442, 51290, -23688, 18007, 31026, -132833, -52097, -41530, -118485, -184160, -195302, -129488, -37476, 70367, 140352, -58848, -174572, -136967, -83451, -22869, -100530, -137681, -118070, -84991, -11272, 37603, 73489, -21396, -125739, -140967, -75438, -152199, -162628, -137724, -58265, 89279, 121105, 158051, 228848, 143838, 90351, 281216, 250617, 74050, 14117, -32342, 7693, 52425, -10899, -21693, 94388, 162005, 134756, 95167, -34888, -92599, -7673, -68826, -31292, 12909, 30679, 100701, 25660, -55923, -157280, -169013, -11867, 57281, 51719, 6112, 40459, 26095, 10558, 54724, 34784, -116057, -156603, -140098, -92198, -23535, -70034, -96440, -82567, -63345, 19835]
10932A9835j6314K4483j931L0538l6629O36j7882l4845j15491J47663Q0907j5378
10920F5592J6795L5748k5421m2627j00219q4229q2899q1755K9077O3986J09903
10909i6049J8421O3972l8170J3491Q9353L8119j61142j99776j69436R8346K27835
10898a15036J22329Q392O5604O4376m0753K3027l4867j11383n5357Q069P9071
10887A3472J0165K7757J6924J6395k15011k8609J38860Q423k4653J116N5007r9846
10875h0000n9821p2404M3832M2849O7575P7315n1695O845L6855Q3437J4067j21329
10863a2474k14777N8472Q5017J04702J13727j55524j81156R0850j7134q347Q292
10852a28352J4921K1587M0631N0007J7083L1989m0560q9308n4096O1644r878J2467
$$ y = [19835, 3521, 28004, 26073, 56611, 19982, 20618, 2736, -32109, -147600, 63, 80970, 65592, 82387, 118135, 92714, 50087, -50132, -134361, -217260, -299015, -269938, -205952, -96049, -77628, -13656, -51826, -38335, 51018, 89137, -72005, -271781, -441217, -342871, -115036, 7293, 15685, 81289, 145665, 104912, 127939, 93072, -18311, -73668, -65599, 13472, 23637, 51394, 68318, 84713, -130298, -158907, -20047, -11624, -36277, -35161, 19846, -80000, -139821, -212225, -168393, -125544, -57969, 19346, -32349, -25504, 11351, 94788, 108855, -12474, -227251, -168779, -83762, 20940, 134667, -20857, -202013, -111163, -128297, -136644, -128352, -113431, -91844, -51213, -1206, 15877, 47866, 7306, -82002, -136098, -74454, -84332, -71865]
10840g1865j7087j5003L9169N236Q8870l7997j14020l1247K01583J28708j35213
10829D1134r3047J8761m3605p1388m3139J26106N6404k0647m8019l7958K0103
10818i5295P0306L4027P4483m6835R705m8769j07324m2817J46865R298q0083j3842
10806i0281L1328N4034R3760m0180r9074N2886N7268Q6850k7332o1323j05889
10795d7953P3768R502M100r2366l8361L4915O1182l858r2902o5636r8094P4572
10783a81131Q4831q2026j00605J29310J44177K4983o5848L0747o0487P2817K24812
10772B21580o7712k1550m5016n9780J04769R5265r1101p2581r6435j31058m9390
10761b13009N2887R8835K3681K2427j53737j6096m7124L2691J04684J10708J2956
$$ y = [-71865, -88952, -103955, -64786, -59550, 29320, -8677, -122697, -153944, 47639, 176347, 41134, -51913, -33152, -76757, -148145, -191284, -65178, -8774, -29421, -77440, -115398, -95295, -24989, 9038, 83521, 36686, 46391, -2378, -109702, -152519, -5654, 3644, -76439, -90281, -58953, -4919, 88841, 48661, -50413, 2473, 59741, 146591, 119259, 57936, -47953, 25815, 35317, 39417, -52949, -91310, -56395, 4787, 929, -91973, -157609, -255703, -181131, -96300, -178326, -278931, -149621, -5444, 19539, -46309, -15562, -76049, -3232, 221580, 153868, 132318, 87302, 27522, 132291, 227556, 136455, 63874, -32561, -163619, -213009, -160122, -61287, -37606, -15179, -168916, -185012, -232136, -199445, -94761, 15947, 28903]
10750B8903l5181K6006N7749o764l5071N9345n6601j58198P2261o845M9117O4653
10738E9374o3973q4829j19627r3237J12977J15587O8330P1456l9730K5402J00025
10727A51755n8029L5944o0858q4711p0333K2862P6987m2134o3882j34590l4123
10716b61112L2286N6280J22607J20521O7315q5976o5775j04898P2421N0391m5449
10705d1389p408n9934j63772j46058J52304J01780Q7551j13932L1861K1370o706
10694a44333J4995O1975M0513j8247R0374J19889L7488k7634m3952n5809j05798
10683c0539N4826j17224M4982O2924j1398O1210P8434R2978k2214j24948l7127
10672E1904m7579R628q2816l1617J9822p034l3576q705j15747r5877m2743L3419
$$ y = [28903, -6278, 19728, 77477, 70713, 35642, 94987, 38386, -119812, -47551, -54396, -5279, 59374, -4599, -89428, -209055, -302292, -189315, -73728, -5398, 66058, 26328, 51730, 151755, 93726, 129670, 68812, -15899, -86232, -63370, 13617, -28517, -92399, -226989, -261112, -228826, -172546, -49939, 70582, 137897, 51921, -13854, -118752, -46331, 4060, -41389, -48797, -108731, -272503, -418561, -266257, -164477, -76926, -190858, -158997, -137627, -144333, -129338, -67363, -26850, -45097, 45277, 165166, 202654, 175020, 131068, 75259, -30539, 24287, -92937, -47955, 14969, 3571, 64781, 143215, 236193, 213979, 89031, 51904, 4325, 13953, -68863, -100480, -80658, -87692, -121268, -129973, -245720, -341597, -384340, -350921]
10660c50921J73555O2887N5974O6730q7605M522j2152J63403M1197n3113L337
10649F7814r855j11642p4266O731M6127Q222K6652L0056m6475P4334J8297J8474
10637E4469J59419P1218k4813J0664p7005j72216l6488o3496j18402n2273L7397
10626b11526J09506M2031r1634j40618r1094R8787O4947N9024L561J31590K6694
10615A268r1740p291Q8159N4895l8473L6865o2161j58444M4439J24871l362m2313
10603e3287K2690J8539P1656j9566q099K7061r0314k776m3271Q8194M7344K4407
10591H2578m2813o662R1841L1288n6554M3012m562j39608m9924r7322p5154O7994
10579a55886J24164J6760n440m4863r9921n4326o5612J51363J05240k6251L4211
$$ y = [-350921, -177366, -114479, -58505, 8225, -79380, -74858, -87010, 76393, 117590, 64477, 67814, 57959, -53683, -127949, -121218, -75091, -66869, -40217, -10161, -56636, 17698, 35995, 54469, 213888, 285106, 260293, 270957, 193952, 21736, -14752, -78248, -196650, -248923, -211526, -102020, -59989, -151623, -292241, -383335, -284548, -219601, -160577, -157016, -25426, 1268, -90472, -97763, -9604, 45291, 6818, 43683, -18478, -176922, -132483, -7612, -10974, -53287, -30597, -12058, 59598, 40032, 31933, 58994, -31320, -34096, -77367, 10827, 58171, 82578, 39765, 33103, 124944, 156232, 99678, 142690, 138128, -1480, -51404, -148726, -223880, -155886, -31722, -14962, -20402, -65265, -165186, -219512, -285124, -133761, -28521, -54772, -20561]
10568b0561J65144n2953o9603q9361L3683J49055L4542o2120n6988N3043R9278
10557A83159M5990j2527p1021j79897L4650j14582j0759J4685J58109O8402K1406
10546A37615k3370n1817j03565j12491n0159P2594J0775j13193M0489L6395Q3791
10535g2936K7582Q4232l7338q4523j09312k6297k2959p8311J02766J56944J42362
10524H2210l4428j06533r4824J38614Q7026j8908q5062k1015m7541K9057R6615
10513B5211k3334o5568o8787J9848J45911L7458m4438j4709J9730L4025n7795
10502G552N8341M2850N4002j21624j2922j30414l7069O2312j9650j7462R6284
10491a7800k1712n2044N3804J68364J09842J26504k7630j07708j54280m6971O0339
$$ y = [-20561, 144583, 91630, 22027, -67334, -33651, 115404, 149946, 87826, 30838, 83881, 183159, 229149, 216622, 145601, -34296, 354, -114228, -124987, -110302, 47807, 116209, 137615, 114245, 62428, -41137, -153628, -203787, -131193, -120418, -233611, -193122, -156727, -72936, -45354, 38878, 1540, -82983, -192295, -218592, -241551, -319862, -217096, -60152, 82210, 47782, -58751, -153575, -14961, 72065, 53157, -31905, -52920, -100461, -71404, 25211, 1877, -63691, -132478, -112630, 33281, 70739, 26301, 11592, 31322, 65347, 7552, 65893, 108743, 162745, 41121, 28199, -102215, -139284, -76972, -96622, -114084, -17800, -39512, -91556, -37752, 130612, 240454, 366958, 339328, 231620, 77340, 30369, 90708]
10480I0708m7668j19693k3546k0929N5862J01796o1174l7362n611M075m1665O4612
10468d0595J06241M9132k3613j23808p8495j6115M8111K9575j64622q340M7648
10457a74881J3534J3967p8048J9074k8184k7736j1711M0837K168O9325P6824j00948
10445a85779K471K47990N6187o5140L956m1491j3400o3652j05727r9944K0737
10434b43792J37545j5033q13P5388N1418R9767K0235p7082j17894n0747o1695
10423a82703M3374k7445L263J14624M9512m4667N4818J50131N4359k17606J1661
10412I321m6263j36451n6204N7140K7103m7988j8862J57987Q3498o1702q2028
10401a14449j14450Q2336O8966P417J86239K7792j18626p3867M9450p4516j0150
$$ y = [90708, 43040, -76653, -100199, -121128, -65266, 36530, -24644, -62006, -67617, -63542, -105207, -40595, 65646, 114778, 91165, -32643, -111138, -127253, -79142, -49567, -214189, -222529, -174881, -161347, -147380, -225428, -206354, -234538, -262274, -273985, -233148, -230980, -161655, -84831, -185779, -183308, 64682, 120869, 55729, 59685, 18194, 4794, -58858, -164585, -264529, -243792, -106247, -121280, -122093, -46705, 4713, 104480, 124715, 47633, -70261, -121008, -182703, -139329, -166774, -163511, -48887, 625, -44042, 10776, 160907, 215266, -2340, 9321, -36942, -173393, -229597, -172457, -145354, -193342, -212204, -54217, 29281, -32421, -114449, -228899, -146563, -77597, -70180, 116059, 143851, 25225, -48642, 808, -73708, -83858]
10390h3858k4063K583j01119J7652N0070Q7800L8618o5800n7889k9790N4594l5550
10378a46752l8053J1310J40751n8281L5370L2336L7782R5007J6285r8917p5662
10367d8824J00192L8816j26907n980O085p613k1834j9470P1571R3235m0291Q9152
10355A28132L565l4772Q877j08708j53952p811l0627J5093j3950L8371J63192
10344G410O3033J3199J1811K4416l6401L4031O214j6480n1651j07036O5056O1781
10332G5383K1787L7365o0232q5197N262j3256j0931K7409k385p4971J2210O6651
10320i05l4245l9859n9910j15802J48720J17578O6119k8402m8584p3195n0815
10309a19300J0440J58707J11741L7917j6557o8720l5904M659N27j49493m0376
$$ y = [-83858, -107921, -105338, -206457, -188805, -138735, -50935, -12317, -78117, -136006, -165796, -111202, -146752, -184805, -173495, -32744, -91025, -55655, -23319, 14463, 109470, 125755, 26838, -48824, 51368, 90184, -36723, -42703, -36618, -44231, -66065, -85535, -13964, 79271, 38980, 128132, 131697, 96925, 105802, -2906, -156858, -164669, -195296, -180203, -194153, -155782, 7410, 70443, 83642, 95453, 119869, 83468, 117499, 123713, 107233, 55582, -51454, 13602, 75383, 97170, 134535, 74303, -10894, -5632, -18888, -29819, -2410, -4795, -79766, -67556, -905, -35150, -75009, -134919, -250721, -102001, 15577, 81696, 53294, 4710, -68485, -119300, -108860, 49847, 161588, 199505, 182948, 114228, 78324, 82983, 83510, -65983, -106359]
10298a06359P2878N3376j0766K2450m534P9052P3905J90910Q5543j06783q2802
10287B66870r302L9479n8344q5373L4229J65992J60937M2160J39608J13449J00139
10276I09844Q0914R8739P6880K4731j83299j65022j30783l2732j11817l0764j10840
10265D25851j66041o8840j05497K0083P4324J6406l7111j5881o7742l7736Q0769
10254A18585n6430P928k1201o3216j24434m75Q4850k2670J28141J3243j78P5294
10242A39437j9224N914l7779q231o0599n2158l3543P4204P1837Q9557K1366p6000
10230A14781j9688J57306O6486j05398j00633q0729j20526k9388O0343N8946P8137
10219G9637Q8032R6836p1071J6847k3070q6768q5794K229p7148l9771J3185j2062
$$ y = [-106359, -33481, 19895, 9129, 31579, 27045, 106097, 180002, 370912, 456455, 349672, 266870, 257568, 297047, 238703, 153330, 187559, 353551, 514488, 556648, 696256, 809705, 909844, 990758, 1089497, 1166377, 1191108, 1007809, 842787, 712004, 679272, 567455, 536691, 425851, 259810, 190970, 85473, 105556, 179880, 196286, 159175, 143294, 75552, 37816, 118585, 62155, 70083, 48882, -14334, -138768, -139243, -54393, -77063, 51078, 64321, 64143, 139437, 120213, 126127, 88348, 80117, 19518, -32640, -66183, 8021, 79858, 169415, 190781, 114781, 95093, 252399, 318885, 213487, 112854, 32125, -88401, -117789, -57446, 1500, 79637, 167669, 264505, 193434, 210281, 187211, 100443, 14649, 16878, -60270, -100041, -86856, -98918]
10207i8918j5812q796J08585o3260j2878P4471K8118l7316j5113o2971R186l610
10195i8314J7745N9435Q1928M2285J8344p6750j05100Q7245R1721p6560M939P479
10183E4397J21281N505M8890J5466o0050m6390L7487p2785q6677k5699k4221L7045
10171D249J2083M3858K4640n8471r2438o0545N5163j31548j7315O6730k112R8105
10159e7601R8227N8693N3236k7101k4195K1111q1941q409p1687Q0200L1267p6436
10147d636J1150J2991M1195K1724M071l0829J35257l8340K0661J11474R6575k1240
10135C60053j54790k1732j4744l454j42921R1965J01760l9987J6420m9649J5050
10124A57971j52174k0979J23395L9350p5131n8127Q607o1102j51111R6971K05681
$$ y = [-98918, -114730, -123526, -14941, -78201, -91079, -16608, 11510, -25806, -40919, -103890, -94704, -98314, -80569, -21134, 60794, 103079, 121423, 44673, -60427, 26818, 118539, 41979, 46918, 54397, 175678, 181183, 230073, 245539, 185489, 139099, 176586, 103801, 17124, -8575, -32796, 4249, 16332, 60190, 84830, 26359, -66079, -126624, -71461, -203009, -220324, -153594, -155706, -57601, 40626, 99319, 152555, 125454, 101259, 122370, 40429, 32020, -39667, 40533, 71800, -4636, 6514, 19505, 60700, 82424, 86495, 55666, 190923, 152583, 173244, 284718, 381293, 360053, 205263, 183531, 168787, 165333, 22412, 114377, 216137, 176150, 192570, 142921, 157971, 5797, -15182, 108213, 147563, 72432, 14305, 22912, -38190, -189301, -92330, 113351]
10113A13351R2146l3453Q2309q2308p8469o1633k7028L6272l9167j944q7249q6050
10101a73223J0135J08844O4832N130q7633K9297P6103R4706Q6773P2177m7982
10090B39159j84016k3293n5884l167n9544r4896L4747R834R3626l8758n3268n8264
10078a93724J06560J46834J5669J3587J13254k006j13373q0944k2943P995m5221
10067e4312M5447J05391k8876N3940J02622j86575j24595r6752k0223J85828J10958
10056I2853L5946n9895j05536R2322O6433r3081l0692R3513j5599k7534N461j7247
10044C6944l7139r2527J2335L9196O8585m5762Q3477L8584k5842k6181m5732N3854
10032E9792J2650l471l9926j3944j6778K8670Q0724J9422o3804j27739N0487L7894
$$ y = [113351, 205497, 172044, 254353, 172045, 93576, 31943, 4915, 41187, 2020, 76, -87173, -173223, -163088, -54244, 10588, 15718, -71915, -42618, 33485, 128191, 214964, 287141, 239159, 55143, 31850, -24034, -27201, -86745, -181641, -146894, -137060, -43434, -82192, -135460, -193724, -87164, 59670, 75339, 88926, 202180, 200174, 86801, 5857, -17086, -9091, -54312, -8865, 96526, 67650, 121590, 224212, 37637, -86958, -183710, -203933, -18105, 92853, 128799, 68904, -36632, 55690, 122123, 29042, -1650, 91863, 76264, 48730, 54191, 36944, -195, -92722, -80387, -41191, 27394, -18368, 65109, 103693, 77851, 51670, 5938, 59792, 72442, 68971, 29045, 15101, -1677, 26993, 107717, 127139, 63335, -64404, -13917, 23977]
10020B3977j5775N4365Q3822o9432o2604L363o9120o7558R4163n796N908k6369
10008e1056r188N3887K4237k037o5635K4048R9513J01745j22093r4047l3834J59624
9996H5164J0952m3441k5833L8177o7420O6473M0922M4350q2171o9244R708J53368
9984A61005M2806j11590j82630j7894N435Q9240n357n1021j6931P2311l4421n1561
9972a00608o3504J2308N123J38727m7514j7156J53661O4255l9768q2570m7830
9961b4876l9725K6416j08928J4587Q6889L6175j38955j7822m6225l1676J14915
9950a29225J15295n959l0784J10413n5486j27047J3977j2816k8064N6418r836
9939a03114N9714J9360R0844J03420K7670o1687p1707K7591l2121k1723n3417
$$ y = [23977, 8202, 62567, 146389, 76957, 14353, 17716, -51404, -118962, -24799, -30595, -24687, -51056, -60244, -6357, 17880, 15843, -49792, -25744, 73769, 175514, 53421, -40626, -74460, 85164, 96116, 52675, 26842, 65019, -2401, 64072, 104994, 149344, 67173, -2071, 7637, 161005, 203811, 92221, -90409, -108303, -102868, -13628, -18985, -70006, -86937, -14626, -49047, -100608, -164112, -151804, -146681, -7954, -55468, -72624, 81037, 145292, 105524, 22954, -24876, -64601, -38185, -147113, -132526, -45637, -9462, -148417, -166239, -212464, -244140, -129225, -13930, -19889, -50673, 59740, 4254, -122793, -108816, -121632, -149696, -93278, -103114, -43400, -24040, 66804, 170224, 197894, 136207, 64500, 92091, 59970, 38247, -15170]
9928a5170j40288j02562J03029J29292P0951J2747k057R084M1484M7003l4737
9917A18776j73036J3805J09162m291q2634r4070L9184J16709M4191J0524k2435
9906G5885Q4049l6482p9129L7254k2107M9712M6941Q2551r3276o0969l9053j17805
9894g2429r0523O3118K5414N9844J02263J6399p9589Q4564K7868q8358Q468j09425
9882e2386q9023o2138J05650R400j20881Q6491J16088p2495l6460R9700J91050
9871A74996m0665N6751J08881p0278n9400L9930o1315l1227L7255n907M7570L4028
9859B30619k7437j73232o067N4621J17340n716j26836M52l5659k4871k2504O6403
9847D7113K0029r7170j09920k3852R0206K0287N981J49259Q860J1679o6367R409
$$ y = [-15170, -155458, -258020, -154991, -25699, 45252, 57999, 55942, 65026, 106510, 153513, 118776, -54260, -40455, 68707, 64416, -18218, -112288, -73104, 43605, 87796, 98320, 75885, 159934, 123452, 44323, 81577, 59470, 109182, 156123, 238674, 145398, 84429, 45376, -72429, -162952, -99834, -74420, -14576, 87687, 104086, 24497, 109061, 136929, 48571, 57039, -52386, -141409, -203547, -97897, -88497, -209378, -122887, -6799, -79294, -115754, -16054, 174996, 134331, 191082, 299963, 229685, 170285, 210215, 148900, 117673, 154928, 149021, 196591, 230619, 203182, 29950, 23883, 78504, 195844, 190128, 63292, 63744, 28085, 3214, -19290, 47113, 67142, -30028, -139948, -163800, -73594, -53307, -47326, 101933, 110793, 122472, 56105, 65514]
9835F5514q5373l8036l4895j8694J05879J34306N095R2189q2001M156r525j9402
9823A19213p2919l381L1265J21184J67218O897p947j45060j05651m5934O4452
9812A29337J6917j46781j48651m9123N4222J48067N5169q2802M7026J40671J65758
9801C29810Q743N4485K2133r5378j93027q5700J17968K701k3907o0837l0527L2634
9789G9098j6821j31769J7933J20169l2849n1976j1453J3080J29097O4663M0849
9778B20021N069m6643q7650K7080J32251q6635n8335L0562J02706J2060j08603
9767A41883M8221K0909q2819l3208P5256L3627q4870O5109P7586o4856j09251
9756H7587o6700l9758M2816k31r7361M5511R6464M7698j1616J9451N5620j441
$$ y = [65514, -19859, -57895, -92790, -111484, -5605, 128701, 133796, 225985, 143984, 148140, 138615, 119213, 46294, 42913, 74178, 195362, 362580, 369477, 361530, 216470, 110819, 64885, 129337, 146254, -527, -149178, -198301, -144079, 3988, 59157, -23645, 23381, 164052, 329810, 338553, 393038, 415171, 319793, 126766, 41066, 159034, 161735, 137828, 76991, 46464, 79098, 62277, -69492, -51559, 68610, 35761, -16215, -27668, -14588, 114509, 179172, 220021, 225090, 178447, 90797, 117877, 250128, 163493, 105158, 135720, 238426, 250486, 141883, 190104, 211013, 128194, 94986, 170242, 203869, 118999, 184108, 261694, 196838, 87587, 20887, -18871, 23945, 23714, -73647, -28136, 68328, 116026, 104410, 123861, 179481, 178040]
9744A78040j5844Q3165M2076j00048j52880l0480l6854p992j8517L4849J50722
9733A26237M2597l9016P4535p55L907q0624j2046q7197j01797N4827N1156J4781
9721D6605l504J6744J24189k8963k3897n9223j47939N552J08426L8397j9873k07604
9709a51090j6278J00515R2545k7425O9650L39N9615Q052q2339j3380k7192M194
9697A7206R7432N8340l3851o8709j8066q1393J0046k8975o1415q8975N2054J31903
9685a4403l722j39306j64289L7124m3718R3010J30165r1514m0688Q5160R6149
9674e6032R7178L4940m5366K8295n559K5802m7019l9132j77957J1914Q1367J4869
9662g6700P5823o8130K1400J15145o5731m9554l0068k0817L5573o2918o1688j4249
$$ y = [178040, 162196, 245361, 287437, 187389, 34509, 4029, -32825, -40817, -59334, -24485, 126237, 168834, 129818, 204353, 203598, 207505, 126881, 114835, 27638, -74159, -19332, 31824, 46605, 43101, 59845, 184034, 155071, 131174, 71951, -75988, -70436, 37990, 76387, 56514, -151090, -167368, -66853, 25692, -1733, 67917, 68256, 127871, 135923, 53584, 40204, 13012, 17206, 114638, 172978, 139127, 70418, 52352, -29041, -18995, -47970, -109385, -198360, -146306, -14403, -18125, -157431, -321720, -284596, -328314, -235304, -105139, -196653, -237341, -152181, -56032, 41146, 76086, 30720, 59015, 53456, 79258, 32239, -6893, -184850, -172936, -91569, -76700, -877, -69007, -47607, 67538, 1807, -47747, -77815, -98632, -63059, -125977, -187665, -201914]
9650b01914N3684J78779P9698n8400k4227J00805L7261p8760j5666J9945p0010
9639B1195q74M2062l3610L7312R0876r0784K0566n3877m7408L5545J296k2601
9627c02j10217k2027j241P7730P2792j0222J7513K3556m6308l4616J0340J86986
9615A63984J12782k7965j80367r2861L674M6334J51403J05636o1504q3633n5843
9604H1640Q492N0222P4379J7566j2869K4289l4987m5543r4821p6483o8929J7983
9592e9061Q6068J4666r0687J73196J12737K6175j86531j17107o9691J39008J21022
9581A49795j8815p2689j15886Q179L8053Q373J07759l130P8687L8949k7579n7485
9569A34211L7271N8227N4706J0332l4260l7968r8151j74281m7513J73875O033
$$ y = [-201914, -148230, 30549, 110247, 51847, 27620, 128425, 165686, 86926, 71260, 91205, 21195, 20321, 62383, 28773, 66085, 156961, 66177, 86743, 32866, -14542, 21003, 22299, -302, -110519, -132546, -133787, -56057, 16735, 6513, 24026, 47582, 1274, -33342, -23002, 163984, 276766, 248801, 68434, -24427, -20753, 25581, 176984, 282620, 221116, 137483, 81640, 90132, 140354, 214733, 232299, 219430, 243719, 208732, 163189, 68368, -8115, -77044, -59061, 27007, 41673, -49014, 124182, 236919, 263094, 76563, -40544, -110235, 28773, 149795, 130980, 58291, -57595, -49416, -11363, -2990, 104769, 101639, 180326, 219275, 191696, 134211, 171482, 229709, 284415, 294747, 260487, 222519, 124368, -49913, -97426, 76449, 82482]
9558H2482j24796J4999J03292J64741O9919j60930l9772J6452o6453N435J58333
9547B23702j9545P9398k0800j23152j69623j17547n7282M5525l8454O0356P2665
9536f4757M208Q4388J6057K6432J6898n3923p6506M2489R551O9603N4346m3500
9524H5286J76047J06832j03698j7556O2347r3418m4942p3718k5342m1303q0551
9513e0016K04377J74645j36892j46633O5209m0999r4297p4094p659O1407J37723
9502I2771m1927P6638j321o1406L817K0815K0337j3110j8611J7329K2458r5853
9490B1937j37386R1910J83288m8827P5159j14Q038k4491q6172P9989M6700n3042
9478A56989M8722J5453q758L7016k1487L5285k06810j0026M0335M6319J17910
$$ y = [82482, -42314, -27315, 75977, 240718, 310637, 149707, 109935, 126387, 59934, 65369, 223702, 204157, 283555, 262755, 139603, -30020, -147567, -204849, -159324, -197778, -137422, -64757, -60549, 23839, 39896, 66328, 83226, 29303, -47203, -4714, 4837, 74440, 128786, 85286, 261333, 368165, 264467, 246911, 309258, 215840, 170898, 97180, 71838, 30535, -50016, 154361, 329006, 192114, 45481, 110690, 69691, -24606, -98700, -106359, -44952, 92771, 50844, 127482, 126161, 64755, 68572, 89387, 109724, 96614, 78003, 95332, 117790, 21937, -115449, -23539, 159749, 110922, 186081, 185967, 194005, 169514, 83342, 163331, 210031, 156989, 205711, 221164, 212406, 249422, 227935, 263220, 56410, 46384, 86719, 133038, 250948]
9467B50948p9151o5358J06341P5778k0356q4030L3966q1320k4103J65662L7068
9456C15445q3956M9802k5104r7268K5638J3921n237J9774K8346l707j18869k2259
9444I6526J10600J94797q3338Q443n3551p6102o5689p6814M9230R6868Q2570m8524
9432B35016p1874K0404m5929l2508m3861K8059J04402r5254p041J5332R3463q505
9420A91704L246P4805m9099o6385O8932j3999k17544j8011J92931R910J20679
9409B97169P0217m2416j756M4155K7529K3265j1641k7926J7536O3112m4904m4413
9397C69927K4960P21j8360m3480J08735M1970j5978j6305m800k6899r3073j39308
9385A88110o260J84814L081j27022o0827j20648k677J83546L5114j10604m9920
$$ y = [250948, 171797, 106439, 212780, 288558, 268202, 184172, 218138, 136818, 112715, 278377, 315445, 231489, 281291, 256187, 158919, 184557, 198478, 193241, 213015, 241361, 237654, 118785, 96526, 207126, 401923, 318585, 327028, 273477, 197375, 131686, 54872, 104102, 200970, 283540, 235016, 163142, 183546, 137617, 105109, 61248, 89307, 193709, 98455, 91414, 106746, 200209, 191704, 194950, 269755, 220656, 154271, 223203, 209204, -8340, -26351, 166580, 176490, 297169, 367386, 324970, 323214, 367369, 394898, 418163, 406522, 378596, 396132, 459244, 414340, 369927, 394887, 395608, 377248, 333768, 442503, 484473, 468495, 452190, 447390, 420491, 327418, 188110, 181850, 366664, 369745, 242723, 181896, 61248, 58571, 242117, 277231, 166627, 116707]
9374A16707O1913J01223j04893R8245N9955o3331n8136q154J68487R4187L6938
9363E03141j01411q1830m0901J6119N2861K6214j00131p7719R2510K7442N0021
9352C66316N4376J6038n8800Q498O9090Q2840o1716m0752Q4968J38116p0962n0244
9340E37768q6299K6591J8682J9889L9029q1826m1321K1158L4554L939o5540M0154
9328D66778K9358l4052j4565J1349n8206Q6118Q0048r515m3710q9025r6042M2299
9316C70835N1248L0353k8072k6644m3775Q1783J32094P4412M70n5291J6726p1764
9304E32375J3946Q6814n4276m1524P3102J11901l7782J740k2117l2046K7402l3455
9292F26080Q554j2608j20913J40256o9031j59867m3615K0584K4034p9796L2227
$$ y = [116707, 178620, 279843, 174950, 273195, 333150, 269819, 211683, 203529, 372016, 466203, 503141, 401730, 319900, 278999, 295118, 347979, 374193, 274062, 196343, 288853, 316295, 366316, 420692, 436730, 377930, 386428, 455518, 538358, 476642, 435890, 520858, 658974, 588012, 537768, 451469, 478060, 496742, 516631, 555660, 473834, 432513, 453671, 488225, 492164, 426624, 466778, 496136, 462084, 447519, 458868, 400662, 486780, 566828, 557313, 513603, 424578, 328536, 370835, 422083, 452436, 424364, 397720, 353945, 435728, 567822, 642234, 642704, 587413, 604139, 532375, 546321, 633135, 578859, 537335, 610437, 722338, 684556, 686296, 664179, 632133, 659535, 626080, 634634, 622026, 501113, 641369, 572338, 412471, 368856, 389440, 413474, 333678, 365905]
9281C65905J50027J66297L7580k5650L2553j4938n0919q921L4425P095O9224j07889
9269F54789o2731J79033J08013N5062r9622K3205o2985q5438l0704J01328Q011
9258G87961j55489P0875J57314n0180M6798O4668n2929l1793R2041J09880O1308
9247A100454k8923k3481J3082l0933J53796R9345K3348q0928P157r861J32005
9236A355061Q5802j14442j01452j08942J2095P5390K4902j37099J17818M5328
9226A254461J57674K12160L2847J18236O5298r5225K5706l0311j07506J7746J57232
9215A808318k6531o3423O2204R9240R4432Q6850k0345m4887j6348R7947P8352
9204B155809J13365P5824N9007o2673O2095Q5173j4396o4111j2595j8167K6760
$$ y = [365905, 515932, 682229, 719809, 694159, 726712, 711774, 660855, 651934, 686359, 693454, 762678, 654789, 592058, 771091, 879104, 934166, 834544, 857749, 794764, 709326, 678622, 779950, 787961, 632472, 703347, 860661, 810481, 857279, 921947, 869018, 837225, 929266, 1039146, 1100454, 1071531, 1048050, 1061132, 1030199, 1183995, 1283340, 1306688, 1225760, 1232917, 1223056, 1355061, 1440863, 1326421, 1224969, 1116027, 1128122, 1203512, 1228414, 1091315, 1209133, 1254461, 1412135, 1624295, 1657142, 1775378, 1840676, 1745451, 1771157, 1740846, 1633340, 1651086, 1808318, 1781787, 1718364, 1780568, 1879808, 1974240, 2061090, 2040745, 1995858, 1979510, 2077457, 2155809, 2269174, 2344998, 2404005, 2341332, 2403427, 2488600, 2474204, 2410093, 2397498, 2379331, 2406091]
9193B406091Q4457J89414P0285n7942Q2356K00934J60838K6537P9940J16843p279
9182C352474K3438Q3837N5158J09530M0814J35145J57888J6104J5806Q8122P0084
9171D148400m459M2342Q4417J70641K37186J66246J02526M1673O4733O1259J18268
9160E233232K7993J82403L54267K02136K24600J66700J16150J93332K52557K58880
9150G212250K93284K20479L64459K87058J38055J86946K82265L29282L80030M41695
9140A0135803M15832M02836K71625L77152N06521M65570M74557O71032O72208
9131A4393136P30378P38082O61638O52621P80753R59312J056434J084873R68227
9122B2025454J039302J112643J229588J399038J486749J590344J773356J866437
$$ y = [2406091, 2490548, 2679962, 2750247, 2692305, 2774661, 2975595, 3136433, 3162970, 3242910, 3359753, 3352474, 3375912, 3459749, 3514907, 3624437, 3665251, 3800396, 3958284, 3974388, 3990194, 4078316, 4148400, 4143941, 4186283, 4270700, 4441341, 4678527, 4844773, 4947299, 4988972, 5053705, 5114964, 5233232, 5261225, 5443628, 5797895, 6000031, 6224631, 6391331, 6507481, 6700813, 6953370, 7212250, 7505534, 7726013, 8090472, 8377530, 8515585, 8702531, 8984796, 9314078, 9694108, 10135803, 10551635, 10954471, 11226096, 11603248, 12109769, 12575339, 13049896, 13720928, 14393136, 15123514, 15861596, 16523234, 17175855, 17956608, 18915920, 19972354, 21057227, 22025454, 23064756, 24177399, 25406987, 26806025, 28292774, 29883118, 31656474, 33522911]
9114C3522911K008265K094476K289205K573886K780675K965446K999991L352490
9106E4587345L631231L906849M251852M641893N046735N617343O092180O411650
9098I4187078O612365O983728P268719P365468P262025O742130N881485M719661
9090A47022659L360895J504332l78131k120308l786599n294356o406381o934809
9082A26967302p212697p515293p340071p072027o724245o195499n567247n120690
9074G4219533m575604m288452l962691l453391l242619k903166k776296k508998
9066D6508316k239751k113975j871137j865901j752226j627301j511442j439689
9058C2086894j383383j221180j147920j143925r99392j053555q45814p37510q81214
$$ y = [33522911, 35531176, 37625652, 39914857, 42488743, 45269418, 48234864, 51234855, 54587345, 58218576, 62125425, 66377277, 71019170, 76065905, 81683248, 87775428, 94187078, 100799443, 107783171, 115051890, 122417358, 129679383, 136421513, 142302998, 147022659, 150383554, 151887886, 151509755, 149389447, 145602848, 140308492, 133902111, 126967302, 119754605, 112239312, 104899241, 97827214, 91102969, 84907470, 79340223, 74219533, 69643929, 65355477, 61392786, 57939395, 54696776, 51793610, 49017314, 46508316, 44268565, 42154590, 40283453, 38417552, 36665326, 35038025, 33526583, 32086894, 30703511, 29482331, 28334411, 27190486, 26191094, 25137539, 24291725, 23554215, 22673001]
9049B2673001p97210p66105q01701o60240p16405p75498m52460n34265o21293
9040A6547824m80360m61315m23368m60286o16119n25180l84065n04984l66960
9031A2325187l36296k40192k50429m14829m36525l51644k85514k30279k46368
9022I533111k61842k13580l09540k25539k71494k75696k47951j54524j00320j74662
9012G297963k45104k82429l55996l2970J34837j1778m3430j96407k46717j33095
9002E884874p0025j79425k75093q3617j28739j90035j05297n4912r1272j29912
8992D576547m2499o9240l09194p6858l0154j17979q3383q7257j8701j48232j32641
8981C460409o7712j1244l3614j84963L576j07309j11356q0289L2247Q837j2841
$$ y = [22673001, 21875791, 21109686, 20307985, 19647745, 18931340, 18155842, 17703382, 17169117, 16547824, 16067464, 15606149, 15182781, 14722495, 14106376, 13581196, 13197131, 12692147, 12325187, 11988891, 11748699, 11498270, 11083441, 10646916, 10295272, 10009758, 9779479, 9533111, 9271269, 9057689, 8748149, 8522610, 8251116, 7975420, 7727469, 7572945, 7472625, 7297963, 7052859, 6770430, 6414434, 6381464, 6516301, 6504523, 6461093, 6264686, 6017969, 5884874, 5814849, 5635424, 5360331, 5276714, 5147975, 4957940, 4852643, 4797731, 4706459, 4576547, 4534048, 4464808, 4155614, 4078756, 4048602, 3930623, 3847240, 3759983, 3741282, 3593050, 3460409, 3392697, 3381453, 3347839, 3162876, 3166452, 3059143, 2947787, 2867498, 2899745, 2908582, 2895741]
8970B895741j18850M1136o5602l9761L8417j21313j76238m4785j42911l9701O0451
8959B286584k287p8189j05188l2854r3437q4268J0858q5922p7626k7660L7110
8948A747121m106j25643K8566m7133K1405P5860m6084q2732j53657m502N2378
8937A461473J17118o1329l7590o8607j12351j82947p5810K7022O6367R7057l6216
8926A194187k5510m4897j84615P8459O6155k4388K5946K32J5545p3722j14680
8915I12712q5660N2633J76499M6939j7969p114j2973r7960j40180R7524R8092
8904A022543j09369l3253o7259J16448P5152j09097j20310p0706L350p3405r5212
8893E38882N0678L4586J34238m190j1287N2147o8287r4230N5208O9438p4530N2783
$$ y = [2895741, 2776891, 2818027, 2752425, 2712664, 2751081, 2629768, 2453530, 2408745, 2265834, 2226133, 2286584, 2284297, 2206108, 2100920, 2068066, 1974629, 1890361, 1901219, 1815297, 1737671, 1710011, 1747121, 1743015, 1617372, 1645938, 1598805, 1620210, 1696070, 1649986, 1567254, 1413597, 1409095, 1461473, 1578591, 1517262, 1479672, 1411065, 1298714, 1115767, 1039957, 1066979, 1133346, 1230403, 1194187, 1168677, 1123780, 939165, 1017624, 1083779, 1059391, 1085337, 1085569, 1101114, 1027392, 912712, 827052, 879685, 1056184, 1103123, 1085154, 1078040, 1065067, 967107, 826927, 924451, 1022543, 913174, 879921, 812662, 929110, 1004262, 895165, 774855, 704149, 707499, 634094, 538882, 589560, 624146, 758384, 754194, 742907, 795054, 726767, 632537, 687745, 757183, 682653, 735436]
8881G35436k1338N3550L3875o5575l9070r2611r789M0523P2371k2200K642j6419
8869F71395L594p4704l8701Q8050l1924r0626m325J6949q0958r5784l6061J8897
8857C45802J17534Q4705K3864J3571j07156l9852P8067J1391J4319o3553m1715
8846D36977O2145M952J8249m9054j1439K012m4519k0531N183P4183J25389j20752
8834D82795j17481k8014R1655k211k3082L5878J35013m5223p9382j6833N7157
8823D90272P5094j48099j04916N571M8605l9428q2427M2151o5983l9722J38041
8812C19159J01364P1803k0065m6860m0372J9157M800k4734j78473k5266K31086
8801D11599J64755k0628l8515n5292o6584q0947r3271M7218L5114m4720j3447
$$ y = [735436, 714098, 767648, 801523, 735948, 696878, 604267, 594478, 635001, 707372, 685172, 687814, 671395, 674989, 600285, 561584, 649634, 617710, 527084, 522759, 539708, 458750, 362966, 326905, 345802, 463336, 548041, 571905, 585476, 478320, 438468, 516535, 527926, 542245, 478692, 436977, 499122, 504074, 522323, 473269, 461830, 463842, 419323, 398792, 403975, 478158, 603547, 482795, 365314, 337300, 428955, 426744, 403662, 439540, 574553, 529330, 449948, 433115, 490272, 565366, 417267, 312351, 317922, 366527, 327099, 244672, 286823, 220840, 181118, 319159, 420523, 492326, 472261, 425401, 385029, 404186, 408986, 384252, 205779, 180513, 411599, 576354, 555726, 517211, 461919, 395335, 314388, 221117, 268335, 303449, 258729, 245282]
8790B45282j40235m9433N426p5776N853J14397P2679K7978n8334J5738P8216n575
8778B36216p7523P9475L5698M5601J30859n7243j1628q6549q1089j02593J9577
8767A30801J51316J8582k9314n3243m7683m4109m3099q376L4717M8554R6502K92
8755B54940j07771L9311q7296l54L9660Q5047M2164N1847j55994J5783J02349
8744B79686j8726P350n4022k4215O1473J4746m3187J29735Q5789n2858n4186K7193
8732C58778l0751l797o5383m8435L0012N3290K2293o414n7671j4682J03801R4501
8720D35542o6452j28775J5085l7217j5190M2457R8349o1734j28085N3318K9938
8709B37236l1415L1184o9384m3995r7162K4473J41289J79925R1081k2229K972
$$ y = [245282, 105047, 55614, 61040, -14736, -8883, 105514, 178193, 206171, 147837, 163575, 241791, 236216, 158693, 238168, 273866, 319467, 450326, 393083, 381455, 294906, 213817, 111224, 130801, 282117, 300699, 271385, 218142, 170459, 126350, 83251, 74875, 109592, 158146, 254648, 254940, 147169, 186480, 99184, 98830, 138490, 223537, 265701, 317548, 161554, 177337, 279686, 260960, 268310, 214288, 190073, 251546, 266292, 223105, 352840, 438629, 385771, 331585, 358778, 328027, 324230, 258847, 210412, 240424, 293714, 316007, 309593, 251922, 237240, 341041, 435542, 369090, 240315, 255400, 218183, 202993, 245450, 343799, 282065, 153980, 207298, 237236, 205821, 237005, 167621, 123626, 26464, 50937, 192226, 372151, 463232, 441003, 443975]
8698D43975m4082J10198j70673o5214Q1694k2174j40672j61010r8994O8317K9581
8687C0946M6756J8653P0956M3704k5893j9887j94131l6571J83773J57510m2639
8676B33177r2743j40800O8879J63528k531J3636r05j43317L2984J46521Q4746
8665C63175N2541P6866m3977M0581l1312n039j6063k8030J2566k5598p8725l8325
8653B78660k9647J48810J03773O2783n6510j227p1556L2391J53678j5975o0352
8642E44828r3163j28935m2677O7477Q4175l5898Q8480k741o8159N8031r9417k3571
8630C48430O070J01892L3343L3369J7858k0529R9473p2359p9636P6503k6438P5985
8618E93961J88951l1087l1639M961J61966K2370R2212K19339O3441j15714J5327
$$ y = [443975, 399893, 510091, 339418, 274204, 355898, 333724, 193052, 32042, -66952, 1365, 30946, 77702, 96355, 167311, 211015, 185122, 165235, -28896, -65467, 118306, 275816, 233177, 140434, -366, 68513, 232041, 229510, 243146, 242241, 98924, 131908, 278429, 363175, 415716, 492582, 448605, 489186, 457874, 452835, 436772, 408742, 421308, 395710, 316985, 278660, 249013, 397823, 501596, 564379, 507869, 506642, 435086, 467477, 621155, 605180, 544828, 451665, 322730, 280053, 347530, 431705, 395807, 484287, 481546, 413387, 471418, 372001, 348430, 354500, 456392, 489735, 523104, 540962, 520433, 619906, 547547, 467911, 544414, 517976, 593961, 782912, 751825, 720186, 725147, 887113, 909483, 1001695, 1221034, 1284475, 1168761, 1184088]
8607A184088n6252Q9684J10636J0579N6891P5224M2399j44210j48104m2616q79
8596A177440j909j06793j58136j20888o2031k7840m0855j09008j17769L9822Q8173
8585E60206Q0340R1213O4052j23072q6092j4196L0908m9106m0378j10910j39084
8574B63881N5185L6881r4905j5294q7384k0902P1057O1026Q437P1201L4805R2094
8562D76082j03224j32810J6924K10333M6002j57912q4199J06182j16935j7159
8552B43284J37121L3435p8348j16437J6508M42p9939P181J79061J19918j3850
8541D48376p8590n8966p3865r2414k5373O1006j5575m6795J12157J398K5734L9555
8529B96648n0285L0478k0182n170N5633n2789n0080L2273n1484M5756K9293q1117
$$ y = [1184088, 1127836, 1217520, 1328156, 1338735, 1395626, 1470850, 1513249, 1369039, 1220935, 1178319, 1177440, 1175531, 1068738, 910602, 789714, 727683, 699843, 658988, 549980, 432211, 472033, 560206, 640546, 731759, 795811, 672739, 586647, 572451, 603359, 554253, 513875, 402965, 263881, 319066, 355947, 261042, 245748, 158364, 137462, 208519, 269545, 277982, 349183, 383988, 476082, 372858, 240048, 256972, 467305, 513307, 355395, 271196, 377378, 260443, 243284, 380405, 413840, 335492, 219055, 235563, 236005, 156066, 163247, 342308, 462226, 448376, 369786, 310820, 236955, 144541, 119168, 180174, 164599, 117804, 229961, 231359, 257093, 296648, 246363, 276841, 256659, 251489, 307122, 254333, 204253, 236526, 185042, 230798, 260091, 178974]
8517A78974k2765L1146J8957j4787M9529M9032M1008p9688j01768j89029K5861
8506a3530K2414P598P9950J15773P2995l1005l0318q9672L7859J11416l3365k6835
8494B23280J7391J1236p8621k7528L5912J2217J7101o7924j5911K8395J3860J567
8482A70975M7548o5472r4289n546L2445J5787J7419j6969K9615L1941j05826J69167
8470B26795O4001m8729j44883O643n8488j38165J46120L501m2586O0457J36607
8459B11273k9308l6573J9669M9194O3644j3559p881R826o47J7071l8549j17806
8447A26354J7164J04054Q8643k2836p2177q1827j17708l018K633J16320Q1413
8436B39015j21934K8897l4196K9910K01608m2547m6318J9532q1429p4699q0605
$$ y = [178974, 156209, 187355, 206312, 191525, 241054, 290086, 331094, 251406, 149638, -39391, -13530, 8884, 16482, 96432, 212205, 285200, 254195, 223877, 134205, 172064, 283480, 250115, 223280, 240671, 251907, 173286, 145758, 181670, 193887, 210988, 143064, 127153, 155548, 169408, 170975, 218523, 153051, 58762, 53216, 85661, 101448, 118867, 101898, 131513, 163454, 57628, 226795, 290796, 242067, 97184, 103827, 45339, -92826, 53294, 56795, 14209, 74666, 211273, 181965, 145392, 165061, 214255, 277899, 264340, 256459, 266285, 265638, 282709, 244160, 126354, 143518, 247572, 336215, 313379, 241202, 159375, 41667, 38649, 41282, 157602, 239015, 117081, 145978, 111782, 141692, 343300, 300753, 254435, 273967, 192538, 117839, 37234]
8425C7234J958J12626O9841o2780R1965l926q5628q1998P3561o532k4632O3209
8413A84898M5334l1366p5881n1560k4545j9419K0885J34577n8483r0750l42L6685
8401G0033J7677L7220p3901k8757Q1267M1810p362o500R8175N1081j63803o7776
8389D9164O2858J6382k1439O8312p409o5485l6743l6271o4652m0005J34985Q5180
8377A44877L0713j05751n0382J40417J6373n5326l4972k336J1951j4099J0939
8366I2404J47673j0373j25827J3936R5115q8278j55014q4289L8205J26355J36751
8355A86658j01376r6115j52731J23622J44299L6357N7163n8792K9318J7664P627
8344A93694p7511j43535K0025O2458J29711l6875K4800P0804n0092j06767p2085
$$ y = [37234, 39192, 151818, 221659, 158879, 250844, 246918, 161290, 79292, 152853, 146321, 121689, 184898, 230232, 198866, 122985, 71425, 46880, 27461, 48346, 182923, 124440, 33690, 33348, 70033, 87710, 124930, 51029, 22272, 103539, 145349, 137987, 131487, 229662, 280743, 116940, 49164, 112022, 128404, 106965, 175277, 167868, 102383, 65640, 29369, -35283, -75288, 59697, 144877, 175590, 69839, 19457, 159874, 176247, 120921, 85949, 83613, 95564, 81465, 92404, 240077, 229704, 103877, 117813, 212928, 124650, -30364, -114653, -76448, 49907, 186658, 85282, -10833, -163564, -39942, 104357, 140714, 197877, 139085, 168403, 186067, 193694, 116183, -27352, -7327, 55131, 184842, 147967, 172767, 243571, 193479, 86712, 14627]
8333A4627Q8115J28511r5246l4239k793j7194m83P2912j2617l9454l2847P9675
8321A48967o6717j16218m9378N2445R4k825n5798k443Q8771n194J59298L3766
8309A84768L580k1224l252j64240o0046Q3579N6929n0847p278M2677M2926o097
8297A01475j25965m7242o191Q216M7435O7554j420p3648j33908k7548J36636l8375
8285i2981o1752J16661J46801J639j86343p9679q9306O7458m0016j29601r0829
8274d37948R2721P5289L0907J69816M2711N9509l0070q9632p7798n431O6508J61720
8262E8302P1021N6751N7501L2096J5000n292o5348j18924L5763N0901l0222j23163
8250C4386j7242k5276O5155j1332L2842p8220j1025P8937R7233N1692j27623k1604
$$ y = [14627, 102742, 231253, 136007, 101768, 98975, 81781, 81298, 154210, 141593, 102139, 69292, 148967, 82250, -33968, -83346, -30901, -30807, -33632, -89430, -91873, -3102, -8296, 151002, 184768, 188348, 167124, 163872, -368, -60414, 23165, 80094, 29247, 21969, 64646, 107572, 101475, -24490, -71732, -77923, -69707, -22272, 45282, 43862, -29786, -163694, -191242, -54606, -92981, -154733, -38072, 108729, 110368, -75975, -155654, -244960, -177502, -217518, -347119, -437948, -345227, -269938, -239031, -69215, -26504, 33005, 2935, -86697, -164495, -169926, -103418, 58302, 129323, 186074, 243575, 275671, 290671, 285379, 220031, 101107, 136870, 187771, 157549, 34386, 17144, -8132, 57023, 45691, 78533, 313, -10712, 68225, 165458, 217150, 89527, 67923]
8238F7923r5014J6250J5750m603L6448N0607R989K3233O552q2401Q7255p3762
8226E8227P2943R7489m5208o1973n7474m1074M2627J20192L1085m642J8330j11528
8214A18994p7891J00614J49373j31245j90041M9037L2485q979P2729O3880l6398
8203A42558L4782P337L380P135k9540m9013K3599p9191J3065P7864J32781N9086
8191C43843K1991K9358K7195j404p3858j63109j42662L7751K6849J1711l9867
8180G7798R6300O9530j17282j17310r49j5119L6579K6218J1117k5518Q743L0046
8168H0153n2505l7282O3222O9190L3183o7569l2745k7695k1501J67112L3566l207
8156B03922M807j57230k2693O2482o6579j03790j6017K9059P3946L7789J61327
$$ y = [67923, -27091, -10841, 4909, 306, 36754, 87361, 97350, 120583, 127135, 44734, 131989, 58227, 131170, 228659, 183451, 121478, 64004, 22930, 65557, 185749, 216834, 212192, 230522, 118994, 41103, 141717, 291090, 159845, -30196, 18841, 51326, 42347, 115076, 178956, 142558, 177340, 184677, 188057, 195192, 165652, 116639, 140238, 61047, 74112, 151976, 284757, 343843, 365834, 395192, 422387, 420983, 347125, 184016, 41354, 79105, 105954, 117665, 77798, 174098, 243628, 126346, 9036, 8087, -7032, 29547, 55765, 66882, 41364, 50107, 80153, 27648, -9634, 53588, 122778, 155961, 88392, 55647, 27952, 6451, 173563, 207129, 203922, 208729, 51499, 28806, 91288, 24709, -79081, -95098, -66039, 7907, 45696, 207023]
8145B07023k4665p2563j55676l9987J72257O3009r0578q2402R331J3945J9719
8134A9413J29134J3966M659M850k9991J9895p822m7792j6150p2091N2485R6947
8122A67503m4754k902J7577p719J01746L6623K924k9660n9190J292k2311j17339
8110D3790n6444O0818J04561m6613q8118m0018j2478k3624P2239J18466K6527
8099A59106l893o9952L3750j122J9410J7169l3721m4182Q2448M5429j08977j07277
8087a1812L2974R6907Q8015Q7254p597n0777r6385r1830j2561O0722L4418K753
8075A32081L0578J0243l3561j27195m414J8560N6226M1220j703P8236p9081r8831
8063B2359L2541j16362O170J15727L5620J35410R3695l5373j40920N620R3984
$$ y = [207023, 182358, 109795, -45881, -85868, 86389, 149398, 58820, -23582, -14251, -306, 19413, 148547, 162513, 167172, 172022, 142031, 161926, 154104, 106312, 90162, 18071, 70556, 167503, 122749, 119847, 137424, 129705, 231451, 268074, 270998, 241338, 182148, 183440, 161129, 43790, -12654, 48164, 152725, 106112, 17994, -22024, -34502, -58126, 14113, 132579, 159106, 155213, 85261, 119011, 117889, 137299, 154468, 120747, 76565, 159013, 204442, 95465, -11812, 21162, 118069, 206084, 293338, 285741, 234964, 138579, 46749, 34188, 94910, 129328, 132081, 162659, 172902, 139341, 12146, 7732, 26292, 82518, 123738, 122035, 200271, 121190, 22359, 54900, -61462, -55292, 60435, 96055, 231465, 325160, 289787, 148867, 154487, 248471]
8052B48471p8075j08415o196l537K3877L6761N5295k3807j51026o8500P6343R8550
8040I9741L9021O5958L6853j8267M2159P6663L1709o6691j12148j0124M4739l5507
8028A94106J12594n7757m3196j05471K673J09133k8621r1766O8708J37331q3880
8017B13854n2516k6275R3875J19114N7356o702M2644M5189J0046M9767p8733m8657
8005D18962R7227m0496p5987m0163N524l0477m2723o7350k4490O4839l9284K6188
7993B51770J3849L7174R2020R2172p7855p9378O0747N0199L7919P1118q3367n3821
7981D12547L6540J9980M7485J2368j6871J5641K7298R7939L314j39015l92N814
7969E22648q9303Q1725J33433O2713j07946L4526O6022k29140k07224R6911J13226
$$ y = [248471, 170396, 61981, 55785, 52248, 76125, 112886, 168181, 144374, -6652, -75152, 1191, 99741, 138762, 204720, 241573, 223306, 265465, 342128, 373837, 307146, 194998, 184874, 229613, 194106, 306700, 248943, 205747, 100276, 102949, 212082, 183461, 91695, 160403, 297734, 213854, 161338, 135063, 228938, 348052, 405408, 398706, 441350, 486539, 496585, 546352, 467619, 418962, 516189, 475693, 399706, 359543, 365067, 334590, 291867, 224517, 200027, 264866, 225582, 251770, 265619, 302793, 394813, 486985, 409130, 329752, 390499, 440698, 478617, 549735, 466368, 412547, 449087, 469067, 516552, 528920, 512049, 527690, 554988, 652927, 656241, 517226, 516834, 522648, 433345, 515070, 648503, 711216, 603270, 637796, 703818, 474678, 267454, 364365, 477591]
7958D77591P0553O6958q3801j33939K5766L6965J9277Q3362M0749q9560j26050
7947C87871L1637N3721N6101N307l1333K7845K3962N4096O5454j8429j83749o6935
7935D05548J3544K9561L5441J58453J01017m4608n1720l1820M9554q3875o1312
7924E19783j47895j7277R169N3113J5161Q3258Q5848q4373n5881r6660j7449P5910
7912D22707Q406j764J1558j365p9575J13818J7463J1356n4036K2801J04213j21638
7900D53944m4968L4067q9128n4549O9905J9415J0074k5730n3502p0116n2626o6076
7888A30710M0534L0754O8389N5861K9293n778J04447n4760p5204K4300l5222r5219
7876B18105j7508m4838O5171J04508O991J3562r7007L3762L6670P892p9699p8884
$$ y = [477591, 548144, 615102, 531301, 397362, 423128, 460093, 479370, 562732, 603481, 513921, 387871, 419508, 473229, 529330, 534637, 503304, 531149, 555111, 609207, 674661, 656232, 472483, 405548, 419092, 448653, 484094, 642547, 743564, 698956, 647236, 615416, 664970, 581095, 519783, 371888, 354611, 363780, 416893, 432054, 515312, 601160, 516787, 460906, 364246, 346797, 422707, 431113, 429349, 440907, 439542, 359967, 473785, 491248, 502604, 448568, 471369, 575582, 453944, 408976, 443043, 353915, 299366, 369271, 388686, 398760, 373030, 319528, 249412, 196786, 130710, 171244, 201998, 270387, 326248, 355541, 349763, 454210, 399450, 324246, 348546, 313324, 218105, 200597, 155759, 220930, 325438, 332429, 345991, 248984, 282746, 319416, 327308, 247609, 168725]
7864A68725j14814Q6655L0206m9648K2726J0907j2450j6012K7588M1001j15034
7853G9850l7981P5385P3738N9634n6606n3602r049m9990q58J01956J9297l7978
7841A63796n2718J49765R0022j87711j64377j32626N8454L4967m3512J3620K65
7830g0055L4869k7977j04231o3647J24318Q5158O6152O9336o2752j4862Q8167
7819A24476m9918k7833J62784J39812P2764j03438j17708N2447q6086P259k120
7808A72439N1144o3441j7270l9773k8319r6153q3943N8706N9008m0551m0371J87518
7796A18994P7942l6898q1187j32943j6241Q9479k5592n4647K6024L904J0277m1081
7784f1969p437J1212P1206q985N3669Q9524K7565k0473j1675j4815P3800p5979
$$ y = [168725, 53911, 140566, 170772, 121124, 143850, 154757, 142307, 126295, 153883, 194884, 79850, 41869, 117254, 190992, 250626, 194020, 140418, 131369, 81379, 80521, 182477, 201774, 163796, 111078, 260843, 350865, 163154, -1223, -133849, -75395, -40428, -83940, -70320, -70055, -35186, -63163, -167394, -231041, -106723, -21565, 44587, 113923, 51171, 36309, 124476, 74558, 46725, 209509, 349321, 422085, 318647, 200939, 253386, 167300, 174559, 172439, 223583, 160142, 142872, 103099, 74780, -21373, -105316, -46610, 12398, -28153, -68524, 118994, 196936, 160038, 78851, -54092, -70333, 19146, -6446, -61093, -35069, -31165, -20888, -61969, -69406, -58194, 13012, 4027, 57696, 147220, 174785, 154312, 142637, 127822, 201622, 125643]
7772A25643K1153j7746k4044J5763n3961M7970n2261j02663K2078k7418Q6050
7761D0564J6584J11134Q8981j40813k09745l2851P9655q822k3446O849M3381k5637
7749e4166K5641J7713k4141J654N1991L6035o487L8946r1661J17218J41311k6771
7737B27283L999J8552O7605q2395j90729R015N318M5766L7801m0522n5710J8228
7725F4211Q272m7781j40692p8077J20015R7346j15580m8980J19109J12038J7752
7714A07633K8251R9007L9618j28593j15340J6689J53729n3934P908M6972j51982
7703D9958o7991P5132j33701p7236K3772M559N1673N582R7517j27312j32163N2789
7691a77421J21626J5329m7091l9674Q3059k5521N181M1221O1006R6712m5540q4442
$$ y = [125643, 146796, 129050, 105006, 120769, 66808, 114778, 62517, -40146, -18068, -45486, 40564, 57148, 168282, 257263, 116450, -93295, -126146, -46491, -55313, -78759, -71910, -28529, -54166, -28525, -10812, -34953, -33299, 18692, 54727, 48240, 87186, -4475, 112743, 254054, 227283, 231282, 249834, 317439, 235044, 44315, 53330, 58648, 104414, 142215, 101693, 45983, 64211, 72483, 24702, -115990, -194067, -74052, 23294, -92286, -141266, -22157, 89881, 107633, 135884, 234891, 274509, 145916, 30576, 47265, 200994, 147060, 154968, 201940, 49958, -18033, 57099, -76602, -153838, -130066, -125507, -73834, -68252, 29265, -98047, -230210, -177421, -55795, -40466, -87557, -127231, -44172, -69693, -64512, -23291, 37715, 134427, 88887, 4445]
7679D445n7264o4521k7195J12259K1153Q188p5802Q1651O6688o039R993J2321
7667H5877k7260N5309o8869j21715P350K59m7388K5713M7564j41260m5560J75164
7655e4816N6215l457O6568J7542R7688L030j12205k8237J6148P8141p6942j35083
7643g5408m4540K4441r5725j1268R7070J43435P2259k0490r1768p9898o5829r6875
7631b44596j12940J1062J00890k791J39096J41119Q5798O6881N5812k05172j23260
7620h8101o351N7235j438J5327L0595m6077l5162O3820P7084j64740l4378n4208
7608a86394k0695M977J02755J42504J49177M1144j11655k02542J7368k435q0277
7597a46073j8104l4542L1539k8795j6362j7625J51599L7956J9098r9579q195Q5896
$$ y = [4445, -52819, -117340, -144535, -32276, -11123, -2935, -78737, 2914, 69602, 63563, 73556, 85877, 58617, 113926, 45057, -76658, -69308, -69049, -116437, -90724, -43160, -184420, -229980, -54816, 1399, -2058, 64510, 82052, 179740, 182770, 70565, 42328, 58476, 136617, 59675, -75408, -119948, -95507, -191232, -202500, -105430, 38005, 110264, 89774, -1994, -81892, -147721, -244596, -357536, -346474, -245584, -248375, -109279, 31840, 117638, 184519, 240331, 35159, -88101, -94452, -37217, -38655, -23328, 7267, -38810, -73972, -10152, 66932, -97808, -132186, -186394, -207089, -202112, -99357, 43147, 192324, 233468, 121813, -80729, -63361, -65796, -146073, -164177, -198719, -167180, -195975, -212337, -229962, -78363, -40407, -21309, -120888, -129083, -43187]
7585d3187N1150J328j28676j34604O4855J53765R0455m2779K8399l295M2156m1188
7573C8379j7163R1305J522J6560M487p1509j3685k9739o0105o7923J10625o761
7561d007J1077k9035j34075N179n9461q5704Q0005o098M423O3760J0132R639o8228
7548b02393M4502J60095J72046p6374l5625o7304o9396J4970J19515K008p3643
7537a1599j25937K6681R4627P9184J7594j46953n1743P1233L2265Q8454N4074
7526A27880p6686j24022O7902J79655q3670p1152k145K5211o8694j5426k0385
7515f1532N416J00519n6176j17967l0368K3063k6256P3149J1538Q8769L0964J22858
7503A63977L4198p2444q3990q4153L5604J28068Q8113J0452j26777q672N2820
$$ y = [-43187, 7963, 9291, -119385, -253989, -189134, -35369, 55086, 12307, 40706, 37411, 79567, 38379, 21216, 112521, 114043, 130603, 135090, 63581, 49896, 20157, -39948, -107871, 2754, -4007, 7070, -21965, -156040, -150861, -210322, -296026, -216021, -222119, -217696, -153936, -143804, -134165, -202393, -157891, 2204, 174250, 97876, 62251, -5053, -74449, -59479, 60036, 62044, -11599, -137536, -110855, -16228, 62956, 80550, -66403, -118146, -46913, -14648, 73806, 127880, 51194, -72828, -4926, 174729, 91059, 19907, 17762, 42973, -25721, -41147, -61532, -56116, 44403, -11773, -129740, -160108, -137045, -163301, -90152, -78614, 10155, 41119, 163977, 198175, 125731, 41741, -42412, -6808, 121260, 209373, 219825, 93048, 84376, 137196]
7492A37196K9302j10489K6907O1851O0247k7404j57097j31286J02327Q8476o8041
7481A1989o5642k0384Q8634o111K6702o5543l2907o8479m3407O8692J5847l574
7469i4183o418l9939J60966J07324j8612m4056o2558r1732j3884P975n4750r6852
7457b46719R6818K4550j09792K9421j1843O2837J2649J6945o6034O1415l4613
7446a64366l5051Q9391M7738J00104Q0088k7397M6710p9402j13148r9468P5952
7435g8849l0810j06909Q0355J39979M3486o1491n8725l6165J02920J3581m2824
7424c5452J5822o6690M8702N7310j08980o6919O3507J09545L2912J7819K6184
7413I3760n2777M0747J9454r7304N0521K1219J9512j42992j41713J9194J02465
$$ y = [137196, 166498, 56009, 82916, 144767, 205014, 177610, 20513, -110773, -8446, 80030, 11989, -53653, -74037, 14597, 8486, 35188, -30355, -63262, -131741, -175148, -106456, -90609, -94183, -100601, -140540, 20426, 127750, 109138, 65082, 2524, -89208, -103092, -95117, -149867, -246719, -149901, -125351, -235143, -205722, -217565, -154728, -142079, -125134, -191168, -129753, -164366, -199417, -110026, -62288, 37816, 117904, 90507, 137217, 57815, -55333, -154801, -78849, -109659, -216568, -136213, 3766, 47252, -14239, -72964, -109129, -6209, 7372, -35452, -19630, -86320, -37618, 19692, -89288, -156207, -92700, 16845, 49757, 67576, 93760, 40983, 81730, 101184, 3880, 54401, 75620, 95132, -47860, -189573, -170379, -67914]
7402f7914o410O2n094j956P682k900k8183K1357J1808j22242j14855J47517J83675
7389B2547J4879p3344J9267M2171N3150q0755n1259J4883p3774r6590m131Q1740
7377a31216K7676J03300r2839k2495M6480M8933J37778J31243j66284j92620n2684
7366a62728J79846Q1543o2988j61757m4003Q4981q2739n523P9738J8703k9237
7355a04164k590M364L3636o7293n5699Q4317j6101J31252P5366L0836N6049j24702
7343D5271K7138L1447q6541j02983N7193J23099P960l8411j7065n5531l2231J16337
7331G5683J4873K7412k1042o9258o0159O1380L4604n2989p2888j2890m2551L9478
7319g8347p0472k351J66413P0494j44875l9996J27253Q4194K438j14475j61892
$$ y = [-67914, -74324, -74262, -79356, -81312, -73630, -76530, -104713, -83356, -71548, -193790, -308645, -161128, 22547, 37426, -35918, -16651, 25520, 78670, -2085, -53344, -38461, -112235, -208825, -212956, -131216, -103540, -240, -93079, -115574, -69094, -20161, 117617, 248860, 82576, -110044, -162728, 17118, 98661, 35673, -126084, -170087, -85106, -167845, -173368, -93630, -74927, -104164, -106754, -102390, -68754, -136047, -191746, -107429, -123530, 7722, 83088, 113924, 169973, 45271, 72409, 103856, 17315, -85668, -28475, 94624, 102584, 64173, 47108, -8423, -40654, 75683, 90556, 117968, 96926, 27668, -32491, 28889, 63493, 10504, -62384, -75274, -117825, -78347, -148819, -151170, 15243, 85737, -59138, -99134, 28119, 112313, 114751, 276, -161616]
7308a61616P7891O6973N2158j98218j74728q0555J20978J77186J05416J01502
7298H6987R5552j03633l6170n4437r409m8476K4397m6635p281M9753L340m7903
7286i3915p2002j44923M4018M2094J4233J634Q0892Q5032J6707n1620N6602O4352
7274D3104q451N002j06451j05388O1306m1146m3373R8599K9413J4095k2164J3787
7262f1667J32698N5439q7131o5683o961J77883j13261r8968L2760J09441P406
7251H1956K7214m5937k8088p1069M5942J38628k5784N2324N295n5424p5323P2856
7239A22590j4727j33139k9047J35240J48386N6793j69201j64907k9899R8525O1488
7228H2102J8282p2267j37954j34910l9471n1286R059J23764J6540J27797r7402
$$ y = [-161616, -83725, -16752, 35406, -162812, -337540, -418095, -297117, -119931, -14515, 86987, 182539, 78906, 42736, -11701, -21110, -69586, -45189, -91824, -99105, -49352, -46012, -93915, -165917, -310840, -266822, -224728, -210495, -208861, -127969, -42937, -26230, -77850, -21248, 43104, 34653, 39655, -66796, -172184, -110878, -152024, -195397, -96798, -67385, -53290, -75454, -61667, 71031, 126470, 39339, -26344, -33305, 144578, 31317, -67651, -34891, 74550, 81956, 109170, 63233, 35145, -35924, 10018, 148646, 122862, 175186, 180481, 125057, 49734, 122590, 107863, -25276, -54323, 80917, 229303, 286096, 116895, -48012, -77911, 20614, 82102, 100384, 28117, -109837, -244747, -284218, -335504, -326445, -202681, -186141, -58344, -155746]
7217a55746j41736M2874R5858m7512j9186j8463J13159Q0893L676j0803M1257
7206a5729j852l2451n677M360m7895l2387N0706Q1472k6093p7647j32166Q6548
$$ y = [-155746, -297482, -254608, -158750, -206262, -225448, -243911, -130752, -49859, -46183, -56986, -15729, -17581, -50032, -55709, -51349, -99244, -131631, -80925, 547, -25546, -103193, -235359, -148811]
$$ [...]
##END NTUPLES=NMR SPECTRUM
##END=
