##TITLE=Analysis number 320924
Compound Code cc 44216
Book Reference 468/115
Project Code adrs
Chemist Name colinb
##JCAMPDX= 6.0         $$ Bruker NMR JCAMP-DX V2.0
##DATA TYPE= NMR SPECTRUM
##DATA CLASS= NTUPLES
##ORIGIN= Bruker BioSpin GmbH
##OWNER= nmr
$$ XWIN-NMR		Version 3.5
$$ Tue Jul 18 10:56:33 2006 GMT Daylight Time (UT+1h)  MAYBRIDGE\nmr@NMR_250MHZ
##.OBSERVE FREQUENCY= 250.131544655141
##.OBSERVE NUCLEUS= ^1H
##.ACQUISITION MODE= SIMULTANEOUS (DQD)
##.ACQUISITION SCHEME= undefined
##.AVERAGES= 16
##.DIGITISER RES= 18
##SPECTROMETER/DATA SYSTEM= dpx250
##.PULSE SEQUENCE= zg30
##.SOLVENT NAME= CDCl3
##.SHIFT REFERENCE= (INTERNAL, CDCl3, 0, 16.522)
##AUDIT TRAIL= $$ (NUMBER, WHEN, WHO, WHERE, WHAT)
$$ ##TITLE= Audit trail, XWIN-NMR		Version 3.5
$$ ##JCAMPDX= 5.01
$$ ##ORIGIN= Bruker BioSpin GmbH
$$ ##OWNER= nmr
$$ C:\u/data/dgb/nmr/ADRS/2900/pdata/1/auditp.txt
$$ ##AUDIT TRAIL=  $$ (NUMBER, WHEN, WHO, WHERE, WHAT)
(   1,<2006-07-18 10:56:12.01 +100>,<MAYBRIDGE\nmr>,<NMR_250MHZ>,
      <created by zg, POWCHK disabled, PULCHK disabled
       configuration hash MD5:
       E2 DF 36 D8 04 B2 41 60 5A D7 A3 38 5A 4B D0 FE
       data hash MD5: 64K
       CB A4 77 B1 D7 A5 6D E2 FB 84 2A 7A 09 67 43 44>)
(   2,<2006-07-18 10:56:23.69 +100>,<MAYBRIDGE\nmr>,<NMR_250MHZ>,
      <Start of raw data processing
       ef LB = 0.3 FT_mod = 6 PKNL = 1 SI = 32K 
       data hash MD5: 32K
       9B C0 1A 38 A7 B4 0A B1 1B DD 28 DB D7 92 17 ED>)
(   3,<2006-07-18 10:56:25.44 +100>,<MAYBRIDGE\nmr>,<NMR_250MHZ>,
      <apk 
       data hash MD5: 32K
       E3 9E AE 84 D0 6E 78 C7 FC 87 11 60 C7 79 0F 50>)
(   4,<2006-07-18 10:56:26.22 +100>,<MAYBRIDGE\nmr>,<NMR_250MHZ>,
      <abs ABSG = 5 
       data hash MD5: 32K
       DA CE C3 59 83 B0 73 C4 DB 96 62 D8 C9 6B A0 E3>)
$$ ##END=
$$ 
$$ hash MD5
$$ 3E F5 65 E3 0A B8 56 67 62 43 D5 CC 6B 57 01 0D
##$RELAX= 
##$RELAX= 
##$RELAX= 
##$RELAX= 
##$RELAX= 
##$RELAX= 
##$RELAX= 
$$ Bruker specific parameters
$$ --------------------------
##$DU= <C:\u>
##$EXPNO= 2900
##$NAME= <ADRS>
##$PROCNO= 1
##$TYPE= <nmr>
##$USER= <dgb>
##$AMP= (0..31)
100 100 100 100 100 100 100 100 100 100 100 100 100 100 100 100 100 100 
100 100 100 100 100 100 100 100 100 100 100 100 100 100 
##$AQSEQ= 0
##$AQ_mod= 3
##$AUNM= <au_zg>
##$AUTOPOS= <16 >
##$BF1= 250.13
##$BF2= 250.13
##$BF3= 250.13
##$BF4= 250.13
##$BF5= 500.13
##$BF6= 500.13
##$BF7= 500.13
##$BF8= 500.13
##$BYTORDA= 1
##$CFDGTYP= 0
##$CFRGTYP= 5
##$CHEMSTR= <none>
##$CNST= (0..31)
1 1 145 1 1 1 1 1 1 1 1 1 1 1 1 1 1 1 1 1 1 1 1 1 1 1 1 1 1 1 1 1 
##$CPDPRG= <>
##$CPDPRG1= <>
##$CPDPRG2= <>
##$CPDPRG3= <>
##$CPDPRG4= <mlev>
##$CPDPRG5= <mlev>
##$CPDPRG6= <mlev>
##$CPDPRG7= <mlev>
##$CPDPRG8= <mlev>
##$CPDPRGB= <>
##$CPDPRGT= <>
##$D= (0..31)
0 1 0 0 0 0 0 0 0 0.06 0 0 0 0 0 0 0.0002 0 0 0 0 0 0 0 0 0 0 0 0 0 0 
0 
##$DATE= 1153216571
##$DBL= (0..7)
120 120 120 120 120 120 120 120 
##$DBP= (0..7)
150 150 150 150 150 150 150 150 
##$DBP07= 0
##$DBPNAM0= <>
##$DBPNAM1= <>
$$ [...]
##$SUBNAM7= <"">
##$SUBNAM8= <"">
##$SUBNAM9= <"">
##$SW= 20.6930455092707
##$SWIBOX= (0..15)
0 0 3 0 0 0 0 0 0 0 0 0 0 0 0 0 
##$SW_h= 5175.983436853
##$TD= 65536
##$TD0= 1
##$TE= 296.16
##$TE2= 300
##$TE3= 300
##$TEG= 300
##$TL= (0..7)
0 120 120 120 120 120 120 120 
##$TP= (0..7)
150 150 150 150 150 150 150 150 
##$TP07= 0
##$TPNAME0= <>
##$TPNAME1= <>
##$TPNAME2= <>
##$TPNAME3= <>
##$TPNAME4= <>
##$TPNAME5= <>
##$TPNAME6= <>
##$TPNAME7= <>
##$TPOAL= (0..7)
0.5 0.5 0.5 0.5 0.5 0.5 0.5 0.5 
##$TPOFFS= (0..7)
0 0 0 0 0 0 0 0 
##$TUNHIN= 0
##$TUNHOUT= 0
##$TUNXOUT= 0
##$USERA1= <user>
##$USERA2= <user>
##$USERA3= <user>
##$USERA4= <user>
##$USERA5= <user>
##$V9= 5
##$VALIST= <valist>
##$VCLIST= <CCCCCCCCCCCCCCC>
##$VD= 0
##$VDLIST= <DDDDDDDDDDDDDDD>
##$VPLIST= <PPPPPPPPPPPPPPP>
##$VTLIST= <TTTTTTTTTTTTTTT>
##$WBST= 1024
##$WBSW= 4
##$XGAIN= (0..3)
0 0 0 0 
##$XL= 0
##$YL= 0
##$YMAX_a= 337569
##$YMIN_a= -477064
##$ZGOPTNS= <>
##$ZL1= 120
##$ZL2= 120
##$ZL3= 120
##$ZL4= 120
##$ABSF1= 16.522
##$ABSF2= -4.171173
##$ABSG= 5
##$ABSL= 3
##$ALPHA= 0
##$AQORDER= 0
##$ASSFAC= 0
##$ASSFACI= 0
##$ASSFACX= 0
##$ASSWID= 0
##$AUNMP= <proc_1d>
##$AZFE= 0.1
##$AZFW= 0.1
##$BCFW= 0
##$BC_mod= 0
##$BYTORDP= 0
##$COROFFS= 0
##$CY= 12.5
##$DATMOD= 1
##$DC= 0
##$DFILT= <>
##$DTYPP= 0
##$F1P= 14.0000005364418
##$F2P= -0.99999901652339
##$FCOR= 0.5
##$FTSIZE= 32768
##$FT_mod= 6
##$GAMMA= 0
##$GB= 0
##$INTBC= 1
##$INTSCL= 1
##$ISEN= 128
##$LB= 0.3
##$LEV0= 0
##$LPBIN= 0
##$MAXI= 10000
##$MC2= 0
##$MEAN= 0
##$ME_mod= 0
##$MI= 0
##$NCOEF= 0
##$NC_proc= -3
##$NLEV= 6
##$NOISF1= 0
##$NOISF2= 0
##$NSP= 0
##$NTH_PI= 0
##$NZP= 0
##$OFFSET= 16.522
##$PC= 1
##$PHC0= 170.795
##$PHC1= 6.115777
##$PH_mod= 1
##$PKNL= yes
##$PPARMOD= 0
##$PSCAL= 4
##$PSIGN= 0
##$REVERSE= no
##$SF= 250.13
##$SI= 32768
##$SIGF1= 0
##$SIGF2= 0
##$SINO= 400
##$SIOLD= 32768
##$SREGLST= <1H.CDCl3>
##$SSB= 0
##$STSI= 32768
##$STSR= 0
##$SW_p= 5175.98343685301
##$SYMM= 0
##$S_DEV= 0
##$TDeff= 65536
##$TDoff= 0
##$TI= <Analysis number 999999
Compound Code 99
Book Reference 9
Project Code 9>
##$TILT= no
##$TM1= 0
##$TM2= 0
##$TOPLEV= 0
##$USERP1= <user>
##$USERP2= <user>
##$USERP3= <user>
##$USERP4= <user>
##$USERP5= <user>
##$WDW= 1
##$XDIM= 32768
##$YMAX_p= 410965334
##$YMIN_p= -177334
$$ End of Bruker specific parameters
$$ ---------------------------------
##NTUPLES= NMR SPECTRUM
##VAR_NAME=  FREQUENCY,     SPECTRUM/REAL,   SPECTRUM/IMAG
##SYMBOL=    X,             R,               I
##VAR_TYPE=  INDEPENDENT,   DEPENDENT,       DEPENDENT
##VAR_FORM=  AFFN,          ASDF,            ASDF
##VAR_DIM=   32768,         32768,           32768
##UNITS=     HZ,            ARBITRARY UNITS, ARBITRARY UNITS
##FACTOR=    0.157963299565203, 1,           1
##FIRST=     4132.6476996994, 0,             0
##LAST=      -1043.33573715361, 0,           0
##MIN=       -1043.33573715361, -177334,     0
##MAX=       4132.6476996994, 410965334,     0
$$ Real data points
##PAGE= N=1
##DATA TABLE= (X++(R..R)), XYDATA
$$ [...]
18451B96370l0410k1293j0631k8786j6006L9381K2450l9259k0763J887l6406J307
18439A57841N510K4514P358m998l1426Q605o377J2517M0751l995j4649j1089k4739
18426A59823j814J4971K7271L8787L2434N3904L5025m6430k5614j6318k7341R160
18414B53858j1397k8680J6328K1936j6931k5300j3111k0541k4194J8188k2066
18403A48090p215L2974J354K0916j1263k1038p629M695m3728k6814J9659M6132
18391A56133J4906m2299j2610j8842N36M5016L3175q729j7215r531j5801R544
18379A34283K8722J6618K4659j0530k1180J0562P421j7948O032J7261k9523k7167
18367A39210m063R57K445K8334K8089r534R043M695J4494r04r714m0922m8662
$$ plain form
18451 296370 265960 244667 234036 205250 189244 228625 251075 211816 191053 192940 156534 157841
18439 157841 163351 187865 195223 190225 158799 167404 161027 173544 214295 210300 195651 184562 159823
18426 159823 158009 172980 200251 239038 271472 325376 360401 313971 288357 272039 244698 253858
18414 253858 242461 213781 230109 252045 235114 209814 196703 176162 151968 170156 148090
18403 148090 140875 173849 175203 196119 184856 163818 156189 160884 117156 90342 110001 156133
18391 156133 171039 128740 116130 97288 97824 142840 176015 167286 150071 140540 124739 134283
18379 134283 163005 179623 204282 193752 172572 183134 190555 172607 178639 195900 166377 139210
18367 139210 135147 136104 138549 166883 194972 185438 194481 199176 213670 212766 203052 162130 113468
18354A13468k8582M8945o209q215J0579J9788j2957J143J1060Q876L3679J3954
18342B05529k429j7345j3414J0714J8595k8444j1764M8679M2919l9707k8434K3205
18330B08104k3156j1520j8198K2160J1959m848J5682K4923L0770m9492K675M9519
18318B58578L1355Q667q360k1731P463l1056o573J6260j0145R777k3376k0956
18306B09903Q791k989L6982l4019j4595L0733L8021P717j7779J9314k1996j6000
18294B44083P2772J3156j7958j8081L7107N5990R36q825K1979L5597P4674J01439
18282F12869J12696M8147N2607R5850J27266Q7413O2708l45O4088J12056J30708
18271A506063J21942J32827J45874J60254J95367K18534K66036L73084N65082
$$ plain form
18354 113468 84886 133831 127622 119407 129986 149774 136817 137960 149020 157896 191575 205529
18342 205529 203100 185755 172341 183055 201650 173206 161442 210121 253040 213333 184899 208104
18330 208104 184948 173428 155230 177390 189349 184501 200183 225106 255876 206384 209059 258578
18318 258578 289933 298600 290240 268509 275972 244916 238343 254603 244458 254235 230859 209903
18306 209903 218694 215705 252687 218668 204073 234806 272827 280544 262765 282079 260083 244083
18294 244083 316855 330011 312053 293972 331079 387069 388005 379180 401159 436756 511430 612869
18282 612869 725565 773712 826319 922169 1049435 1136848 1199556 1199211 1263299 1375355 1506063
18271 1506063 1628005 1760832 1906706 2066960 2262327 2480861 2746897 3119981 3685063
18262C685063Q06850J196096J880098L060787M566344N802934N888224M933951
18254C1820347M514584M813220L350197j233289m488730k346412N85879J244751
18246C8260547J376812J891577P02915l884078q267646p439771m543800k622690
18238A5473866j715382j262022r54400o95715l62737k04907k17530k99449k51276
18229I510448j82591j78177j87763j90608k69144l35434k88395j75297j91729
18220G511310j51720j09979O888K5330k0555j8679K3725N1930J53153K22758K62021
18209G956182M20139P51808J416627K427667L610114M352906M118581L497260
18201B8551284L431675L430194J600202j795278k651271m16953J163126J378712
$$ plain form
18262 3685063 4491913 5688009 7568107 10628894 15195238 20998172 26886396 31820347
18254 31820347 36334931 41148151 44498348 43265059 38776329 36429917 37015796 38260547
18246 38260547 39637359 41528936 42231851 38347773 30080127 22640356 18096556 15473866
18238 15473866 13758484 12496462 11542062 10846347 10483610 10278703 10061173 9761724 9510448
18229 9510448 9327857 9149680 8961917 8771309 8502165 8166731 7878336 7703039 7511310
18220 7511310 7359590 7249611 7256499 7281829 7261274 7242595 7266320 7318250 7471403 7694161 7956182
18209 7956182 8376321 9128129 10544756 12972423 16582537 20935443 25054024 28551284
18201 28551284 31982959 35413153 37013355 35218077 32566806 32149853 33312979 34691691
18193C4691691J550123J612054l38765m934772p567960n946310l598581k227924
18185A3239556j632380j247942r72563p75022o41300n23241l90740l10911l08696
18176F436761l09869k77394j81383j69933j86210j58791j31248j35322j13649
18167D772962j59325j67437q2221r0045j48999j15320j46879j30417j10024j00581
18157C521714m9116k9821r1872j24183q1691p4097j29432o3480j8217j2551k5255
18146B821999q743k6024Q111N2527R607O7270N7885N3877J09195J26335Q0464
18135C352503J34465J44366Q2535R7209O0517L6565K2001O9636J11493J71581
18125D282871L08488L71643N41901P20492R58234J253718J741974K613784M005381
$$ plain form
18193 34691691 36241814 37853868 37515103 32580331 25012371 19066061 15467480 13239556
18185 13239556 11607176 10359234 9386671 8611649 7970349 7447108 7056368 6745457 6436761
18176 6436761 6126892 5849498 5668115 5498182 5311972 5153181 5021933 4886611 4772962
18167 4772962 4613637 4446200 4363979 4273934 4124935 4009615 3862736 3732319 3622295 3521714
18157 3521714 3472598 3442777 3350905 3226722 3145031 3070934 2941502 2878022 2859805 2847254 2821999
18146 2821999 2813256 2787232 2795343 2847870 2857477 2924747 2982632 3036509 3145704 3272039 3352503
18135 3352503 3486968 3631334 3713869 3811078 3871595 3908160 3930161 3999797 4111290 4282871
18125 4282871 4591359 4963002 5504903 6225395 7183629 8437347 10179321 12793105 16798486
18116A6798486O231468R351458J2658537J4426658J3202151J1129593J0041728
18109I3840079P422513j183970j4501851j8364420j4783508j0577336p219175
18102C4632332m881266l305418k068975r59055K41524J782313L638150N552202
18094C4631807P070952P797209P650424O678869M688944J331822l239979p450004
18086E9160044r736117r445789p515706n346121l739912k782407k248733j838758
18078A6506501j493912j170760r79023q27667p21406n97052m60077l48354l21473
18069I586777k81821k48850k14999j75662j93894k46460k67784k55572l25992
18060G375743l14506k53268k37278k62724k78462j96567j47653j51938j83498
$$ plain form
18116 16798486 23029954 32381412 45039949 59466607 72668758 83798351 93840079
18109 93840079 101262592 100078622 85576771 67212351 52428843 41851507 34632332
18102 34632332 29751066 26445648 24376673 23417618 23659142 25441455 29079605 34631807
18094 34631807 41702759 49499968 57150392 63829261 68518205 69850027 66610048 59160044
18086 59160044 49423927 39978138 32462432 27116311 23376399 20593992 18345259 16506501
18078 16506501 15012589 13841829 12862806 12035139 11313733 10716681 10256604 9908250 9586777
18069 9586777 9304956 9056106 8841107 8665445 8471551 8225091 7957307 7701735 7375743
18060 7375743 7061237 6807969 6570691 6307967 6029505 5832938 5685285 5533347 5349849
18051E349849j63109j24446j63795j80175j64812j28495r4060j02981j11763j11171
18041D005042j01580j28178q1827o9150p7513j08136q6955r7903k5847j4321m9905
18030C163727p9018k6531q1398q4626o4815l8434r3987j61060j12174j00869l7457
18019B283358l0125o8929q2938k0398R350J5421k1959m5834j0620l7265o5096
18008A924965j9383m787m6496o5498j0136m2219k4907l3680m8436n6283o5976
17997A507164n8068n4621q718M155o2467n8692l1479k9411q20M3415K5915n2394
17985A223979n8869j2816m9391m0123l3986n7124l5205J384j632P521j8546m6306
17973H78886m781K2064k5675k9058j3416l8076l1020r880P127l9021n1401j7290
$$ plain form
18051 5349849 5186740 5062294 4898499 4718324 4553512 4425017 4330957 4227976 4116213 4005042
18041 4005042 3903462 3775284 3693457 3624307 3546794 3438658 3351703 3253800 3227953 3213632 3163727
18030 3163727 3084709 3058178 2976780 2892154 2827339 2788905 2694918 2533858 2421684 2320815 2283358
18019 2283358 2253233 2184304 2101366 2080968 2090318 2105739 2083780 2037946 2027326 1990061 1924965
18008 1924965 1905582 1900795 1854299 1788801 1778665 1736446 1711539 1677859 1629423 1573140 1507164
17997 1507164 1449096 1394475 1385757 1389912 1327445 1268753 1237274 1207863 1207043 1250458 1276373 1223979
17985 1223979 1165110 1152294 1102903 1062780 1028794 971670 936465 937849 936217 943738 925192 878886
17973 878886 874105 896169 870494 841436 828020 789944 758924 749044 756171 717150 665749 648459
17961F48459J5370L5843l2116n9463j7878J9995K6025j9294k6130o999j8563j5922
17949E49327o889j0556Q030j5419l6359l614K1567k800K0510k018m1320m7762
17937D32697j3821l529k8447J5214N92m82j7881j618k913J7117N058M922R469
17924D16378J1397q552j34K762J732L5548J1097j9892j2276j8609p081k0478o1520
17911C30372l5225K4247L9512P023l154o4480q1455K2061L8739N6350J9508K8357
17899C81855j0985n4762o3048k3420L1793J5954m885o6721n0925J1391N1930J9260
17887B37437J568K90Q660K6982J944l4725k5473k9424J3794j361l467J4140r019
17874B01346k0980M399J669R08J0453l7890J5927O947k4761L367M493j2429k1895
$$ plain form
17961 648459 663829 699672 667556 608093 590215 610210 636235 616941 590811 583812 565249 549327
17949 549327 542438 531882 539912 524493 488134 484520 506087 503287 523797 521779 480459 432697
17937 432697 418876 415347 386900 402114 402706 402224 384343 382725 379812 396929 401987 406909 416378
17924 416378 427775 419223 419089 421851 423583 459131 470228 450336 438060 419451 412370 391892 330372
17911 330372 295147 319394 358906 365929 362775 298295 216840 238901 277640 333990 353498 381855
17899 381855 370870 316108 253060 229640 261433 277387 272502 205781 154856 166247 218177 237437
17887 237437 239005 239295 247955 274937 276881 242156 216683 187259 201053 199692 196225 210365 201346
17874 201346 180366 184765 186434 187342 197795 159905 175832 182779 158018 161385 165878 153449 131554
17861A31554L991M582j8538Q391K4616k3548l7243J5024K0639J0837L3257o312
17849A67250j7334m7705p495L2307r12O974j4769K0416J5249L2942j37L2148r170
17836B09764l3566Q318L3113p101l3541j8085p335l8942j3283O099m6738r380
17824D9323P9831q592j5573J1083M358m7674l8971k3429k0393K0967L2442o395
17812C6977J0110L7939l2216n0275j832J6440J7369K3072N3642l3181l591k7875
17800D6579L4157K1665l3645n4090K3542J3006L1526J7824l88k1329l79K491J0797
17787I1756j0967L3113J9903L6008k0049l1585N18j7424j4668k0288M1264L1682
17775A39263l2116P498O3393L6632l645L0143Q188J3987K26p876m1647k1964k8870
$$ plain form
17861 131554 135545 140127 121589 129980 154596 131048 93805 108829 129468 140305 173562 167250
17849 167250 149916 102211 94716 127023 126111 133085 118316 138732 153981 186923 186786 218934 209764
17836 209764 176198 184516 217629 210528 176987 158902 151567 112625 99342 105441 58703 49323
17824 49323 129154 120562 104989 116072 120430 72756 33785 10356 -10037 10930 43372 36977
17812 36977 47087 85026 52810 2535 703 17143 34512 57584 111226 78045 74454 46579
17800 46579 80736 102401 68756 14666 38208 51214 82740 100564 100176 78847 78468 80959 91756
17787 91756 80789 113902 133805 169813 149764 118179 118697 101273 86605 66317 107581 139263
17775 139263 107147 114645 178038 214670 211025 241168 249356 263343 263569 255693 214046 192082 163212
17762A63212k6904L0398K5377J9219J8994k0397p905o114N315N41K4787L0198
17750B56721K6810J3971K7800L777Q056K9205j1774J118O802M2838L9590O317
17738D51231j8837l3134N699M3973L5824M8510J9945m593k5242n2062o5304J915
17726D07925J8648L5494k358m8736l2993k0350q655j3050o2592n1873j8743M698
17714B07415M515n7282q342k8737j9592k023J6542K9962L1315j9936l8301Q450
17702A23986P805K4681J4317k8928l8659j3025m9125k4549K3104M014J0447L4039
17690H8107M4241L0538J3779p980J6647J6885K1643O911R8R774m1405J169j579
17677A98828N933K4568m493J4017K8639p74r940K9363Q608k0905j3383n5296o2976
$$ plain form
17762 163212 136308 166706 192083 211302 230296 209899 201994 195880 201195 201736 226523 256721
17750 256721 283531 297502 325302 329079 337135 366340 354566 355684 362486 405324 444914 451231
17738 451231 432394 399260 404959 448932 484756 533266 553211 548618 523376 471314 406010 407925
17726 407925 426573 462067 459709 410973 377980 357630 348975 335925 273333 221460 202717 207415
17714 207415 211930 154648 146306 117569 97977 95954 112496 142458 173773 153837 115536 123986
17702 123986 131791 156472 170789 141861 103202 90177 41052 16503 39607 43621 54068 88107
17690 88107 132348 162886 176665 168685 185332 202217 223860 230771 230869 240643 199238 200407 198828
17677 198828 204761 229329 224836 238853 267492 266718 256778 286141 294749 273844 260461 205165 142189
17664A42189j0257J7217P203m2278M541J7723m298k2239K3305L6556Q318p688
17652A70292L828O740m0198o792j5201r182r12J7571k2179R338K791o45n1372
17639F4079k7471J2929q381l7463N939J4608k4251L2139L5935J2790j3831K3828
17627I0850J0999J2183N2014n533o5787m8004k0776k2651o564J2630M0059J733
17615E1153J77J2830k485n5791P705K6838M1360j0595K4142L6516k6019k3985
17603H1846p7488k1782l0561O6L1859m2554k2743M5200K1914L6613k6883l5149
17591c9662O266N5969O8123l1183n7378R53j5741J9796N138K9485K1084o658m084
17578E2108K079l018m955k722J0861J2368l6899r337j6477j482K1870N7234N213
$$ plain form
17664 142189 131932 149149 156352 114074 118615 136338 132040 109801 133106 169662 177980 170292
17652 170292 174120 180860 140662 133870 118669 109487 108575 126146 103967 113305 116096 115451 64079
17639 64079 36608 49537 41156 3693 9632 24240 -11 32128 68063 80853 67022 90850
17627 90850 101849 114032 166046 160513 94726 46722 25946 3295 -3269 9361 49420 51153
17615 51153 51330 64160 61675 5884 13589 40427 81787 71192 95334 131850 105831 81846
17603 81846 4358 -17424 -47985 -47919 -16060 -58614 -81357 -36157 -14243 22370 -4513 -39662
17591 -39662 -33396 22573 90696 59513 2135 3088 -12653 7143 12281 41766 62850 56192 52108
17578 52108 54187 51169 46214 43492 54353 66721 29822 20485 4008 2526 24396 81630 86843
17565H6843Q0408J8325L6411P3784L2074J4378o620K864n511n8477l2201l6053
17553B06225k8246m895k7683k7824J1989Q1229J0331J2737O9620L6225R802J069
17541C50579l0592j5352q120N1764j0427l3488j6105j0353q411K7849O0261K2447
17529C80052o965J0578j499j7779j54J0073m2236n6746o0852q3184l1429J2772
17517A12631L9131J0978j4962P192L3702N239N1746J172N051J9340M0137L7095
17505C48452p939j1457n9752o3567q5538L98j225k8124o471j6966k3615m122j3867
17492B6207l8753Q249L5211N035O389m387K2292k5955q596l77R543p844n050j5891
17478F073K5224K8397K6461m176m5530J0826m026k3906J0798j0434L2953j1248
$$ plain form
17565 86843 167251 185576 221987 295771 327845 342223 335603 338467 332956 274479 242278 206225
17553 206225 177979 173084 145401 117577 129566 210795 221126 233863 303483 339708 349510 350579
17541 350579 319987 304635 296515 348279 337852 304364 288259 277906 269495 297344 357605 380052
17529 380052 373087 383665 382166 364387 364233 374306 332070 275324 214472 131288 99859 112631
17517 112631 151762 162740 147778 154970 188672 193911 245657 246829 251880 271220 311357 348452
17505 348452 340513 329056 269304 205737 120199 120597 119372 91248 84777 67811 44196 40074 26207
17492 26207 -12546 -4297 30914 35949 42338 37951 60243 34288 25692 25315 34858 27014 21964 6073
17478 6073 31297 59694 86155 81979 36449 47275 43249 19343 30141 19707 52660 41412
17466D1412k5940q812l2211J1733P5227P361j6594K6987q12m9311l4146p166k1994
17453c4266j8940M7283K9993j131j3499O4526O9746M2772l4399l934R504M7983
17441B05638j1946l4750k0248j2332K3246M433n1831n1977m9168l4497J0163J2783
17429a0486L4958l590k9441K2295K7829J7049j870J0808n632k6945o325J0064
17417C8714q551j8294k798L6888K9065l7186l6519m7997L2736j9357n218Q550
17405b9967L0763L2406N187J2016N262k7031k6979j5634p0034J5614P9K1435N5269
17392H386K4629J7137K0669j6929j5380K9806k3890q222l4476j912j1678k4057
17380c5917J8463M7551O7073K2353k3783m6033k1438N180l486J2118j8992l0251
$$ plain form
17466 41412 15472 6660 -25551 -13818 61409 68770 52176 79163 78351 29040 -5106 -12272 -34266
17453 -34266 -53206 -5923 24070 22939 9440 73966 143712 186484 152085 148151 157655 205638
17441 205638 193692 158942 138694 126362 149608 154041 102210 50233 1065 -33432 -23269 -10486
17429 -10486 24472 20882 -8559 13736 41565 58614 56744 67552 61920 34975 28650 38714
17417 38714 30163 11869 9071 45959 75024 37838 1319 -46678 -13942 -33299 -38517 -29967
17405 -29967 796 33202 38389 50405 55667 28636 1657 -13977 -84011 -68397 -68318 -46883 8386
17392 8386 33015 50152 70821 53892 38512 68318 44428 36206 1730 -182 -11860 -35917
17380 -35917 -17454 30097 97170 119523 95740 49707 28269 33449 29963 42081 23089 -7162
17368g162L3127M497R022J3671J1044k0807k9602m5830M728L1004R095j1302n0343
17355d8858K994K8825M9715L7270j1730l7106k0276o919J8716K7342J1684K0394
17343G2051k2561q291k051j093j1483j5144j9579N100M207k5176k2341l1418K0192
17330e7587M3634j5995l1287j3546K2061P2444L9245o6567l2961Q188j4312L7813
17318h870N1827j1759j6591J1338l1245j4113j340L644j717J7247N3093j8117
17306C3397q927J6518m1964k4922n677M611P851M398j8044j4724O489J5962K3501
17293a531k2006l0421K2065n693k1535j5751P5108L8624l4749k6177K9732m64
17281G202p528K0161O204P871N596j9701m9941k8225J9908M4505M2114L441K6522
$$ plain form
17368 -7162 25965 30462 39484 53155 64199 43392 13790 -32040 -27312 3692 12787 1485 -48858
17355 -48858 -45864 -17039 32676 69946 58216 21110 834 -6085 12631 39973 51657 72051
17343 72051 49490 41199 39148 38055 26572 11428 -8151 -3051 1156 -24020 -46361 -77779 -57587
17330 -57587 -13953 -29948 -61235 -74781 -52720 19724 58969 -7598 -40559 -32371 -46683 -8870
17318 -8870 42957 31198 14607 25945 -5300 -19413 -20753 -17109 -18826 -1579 51514 33397
17306 33397 24470 40988 -976 -25898 -31575 -26964 -19113 -14715 -32759 -47483 -40994 -25032 -1531
17293 -1531 -23537 -53958 -31893 -37586 -59121 -74872 236 38860 4111 -22066 7666 7202
17281 7202 -326 19835 26039 33910 39506 19805 -30136 -58361 -38453 6052 48166 51607 78129
17268G8129O41k9823J0623N476j6027k741k7141O396l6948l991j866N333l6507
17255d8446M946K3829K2506J5746j6414K1485Q097N1786J9829J7343r399l4747
17243G6561l9760p75o966l003L1464n142l7643l7519K1789K5391K4381K4219J953
17230G4950l7363j3812N514k7879N0439J848k7909k7379l3175N768L8982K3316
17218C3300o404j273K9005K5371j7106j8076K959l082k0868K3030J1481p404j713
17205D9220p777m0731m4529r446K7338j6684l2542O0407Q689k0694j0705Q906
17193b8548j0236L9996K2859k8898l0704k9982p994M8672P6221K9424m4012m8438
17181a1640k2661P495J2564M5713K7824K9307Q070l7976m8438k396l20J8035K3301
$$ plain form
17268 78129 78770 48947 59570 65046 49019 46278 19137 25533 -11415 -15406 -17272 -11939 -48446
17255 -48446 -43500 -19671 2835 18581 2167 23652 31749 83535 103364 120707 111308 76561
17243 76561 36801 36026 29060 26057 57521 52379 14736 -22783 -994 24397 48778 72997 74950
17230 74950 37587 23775 29289 1410 51849 53697 25788 -1591 -34766 -28998 9984 33300
17218 33300 26896 25623 54628 79999 62893 44817 47776 44694 23826 46856 58337 50933 49220
17205 49220 41443 712 -43817 -53263 -25925 -42609 -75151 -14744 -6055 -26749 -37454 -28548
17193 -28548 -38784 1212 24071 -4827 -35531 -65513 -73507 -24835 51386 80810 36798 -11640
17181 -11640 -34301 -26806 -14242 31471 59295 88602 96672 58696 10258 7862 7542 25577 48878
17168D8878J8470k7752j7675o481j657J3645k6907o880J3619j3266J4738L0312
17156C9044q804k0029M8339J266l849J9534n288K96l6460j7335J5426L8252K4706
17143I5098K4769m286k9489j1953K443j5285l3581k0579N12K5836M9172M2527
17131A25184k0599m1771j0483J2603k7116K5840K7442M4943J8385j4596r680l0627
17119I9525m1979L624J7607K2237N7656K0542k3940n7445j352J6901K6246K4356
17107A63978j7351n4669P350j6664K8283J7975J5068k8723k9850l9541l341L5462
17095G7977J1564j639n662l0093L1717J2202j1751J9580N9350k405R340K6184
17083A96364j9503l7019j2948l1235K8103O689m6093J7437N2098k5355k7848J815
$$ plain form
17168 48878 67348 39596 21921 15440 13783 27428 521 -6359 7260 -6006 8732 39044
17156 39044 30240 10211 58550 59816 55967 75501 70213 70509 34049 16714 32140 70392 95098
17143 95098 119867 115581 86092 74139 76582 61297 27716 7137 7649 33485 82657 125184
17131 125184 104585 62814 52331 64934 37818 63658 91100 136043 154428 139832 130152 99525
17119 99525 57546 61170 78777 101014 158670 179212 155272 97827 96475 113376 139622 163978
17107 163978 146627 91958 99308 82644 110927 128902 143970 115247 85397 45856 42515 77977
17095 77977 89541 87902 82240 52147 83864 96066 84315 103895 163245 160840 170180 196364
17083 196364 176861 139842 126894 95659 123762 130451 84358 101795 153893 128538 100690 102505
17071A02505O176M1148J2414K0801J4588K831J6439O145o764l6419j4700J6108
17059A81272j120J6629N6731K6342o429j3060k5962J1267k9423J7116P6381M5311
17047C55055M718r989L0697r850L6390O2940P4512M3266P8172L4350Q0229Q3861
17035H64351J36530J02215P7915J07192J52883J26473J49592J74342J76766J57387
17025B225646J95339K70987L29603L56637L84597N52934Q04861J179528J766984
17016H067116K701598M027023N291045N788762N431934N493282O395970O249235
17008D9445965K994016j693351k940683j159881K06349j449165n791748p992247
17000C1619255o023621l306758j399774N6395J502469L075383M393685M637686
$$ plain form
17071 102505 108681 149829 162243 183044 197632 200463 216902 223047 216283 179864 165164 181272
17059 181272 180152 196781 253512 279854 273425 260365 234403 245670 216247 233363 309744 355055
17047 355055 359773 349784 380481 370631 407021 469961 544473 587739 665911 700261 780490 864351
17035 864351 1000881 1103096 1181011 1288203 1441086 1567559 1717151 1891493 2068259 2225646
17025 2225646 2420985 2691972 3021575 3378212 3762809 4315743 5120604 6300132 8067116
17016 8067116 10768714 14795737 20086782 25875544 31307478 36800760 43196730 49445965
17008 49445965 52439981 50746630 47805947 46646066 46852415 45403250 39611502 31619255
17000 31619255 25595634 22288876 20889102 20945497 22447966 25523349 29917034 34554720
16992C4554720M377123M881112N722875M539827L80263l173280k783253q80532
16984D7618855n15724l424851p542882p905610n452021l467211k354365j837905
16976A5118286j513512j230832r23463p65639p29890o17625m55565m03822l70535
16967H107403m07009l28308k83020k22943k62534k13982j94025j99928j33127
16958E862527j54038k13285j85228j70449j95293j78276j66990j44771j78920
16949D275277j63445j30223j18251j07132j22135j51002n4422r3304r4530n2205
16939C188628r3970j04594r3177p7158p9963p7228o0814p2370q5472p7506k9733
16928B336643j9234o2206p6452l6589p5015m4027l4940o8553n8242o0577l4552
$$ plain form
16992 34554720 38931843 43812955 49535830 54075657 54455920 51282640 48499387 47618855
16984 47618855 47103131 43678280 36135398 28229788 22777767 19310556 16956191 15118286
16976 15118286 13604774 12373942 11450479 10684840 9954950 9337325 8881760 8477938 8107403
16967 8107403 7700394 7372086 7089066 6866123 6603589 6389607 6195582 5995654 5862527
16958 5862527 5708489 5495204 5309976 5139527 4944234 4765958 4598968 4454197 4275277
16949 4275277 4111832 3981609 3863358 3756226 3634091 3483089 3428667 3335363 3240833 3188628
16939 3188628 3094658 2990064 2896887 2819729 2739766 2662538 2601724 2529354 2443882 2366376 2336643
16928 2336643 2317409 2255203 2178751 2142162 2067147 2023120 1988180 1919627 1861385 1800808 1766256
16917A766256o6014n5954o8766j0163O368k0694k4625K0242l8368l0329l7850
16906A440103M440n3005p3493o6807n5467R242k5743n2513n2746N163N321j0887
16894A073608l3358k5077N311J5353l6512j5261m7760n9529k5233j1119n3886
16883G86537o5861L4944j855J6780K012K8240O271j3225j1535l2786n3361o2280
16871F33881m6966R154K0222K5733k6155l8917j0666Q34N701M054p940J2505k3112
16858E58328j1307k8284K60l3685k214J6610l4357j6895k6741Q081K4513L5459
16846D89768K0273J5922k1986j3896l53M315j0612l5697l4095P1522L8313k0165
16834E03309m6685l2259j012j8835J1958M2281m108j5262k7012J1345k5319n57
$$ plain form
16917 1766256 1700242 1644288 1575522 1565359 1571727 1551033 1526408 1546650 1508282 1477953 1440103
16906 1440103 1444543 1391538 1318045 1251238 1195771 1205013 1179270 1126757 1074011 1079174 1084495 1073608
16894 1073608 1040250 1015173 1020484 1035837 999325 984064 936304 876775 851542 840423 786537
16883 786537 720676 755620 753765 770545 772557 800797 807068 793843 782308 749522 696161 633881
16871 633881 586915 596069 616291 642024 615869 576952 566286 567120 572821 576875 568935 581440 558328
16858 558328 547021 518737 518997 485312 483098 499708 465351 448456 421715 429796 454309 489768
16846 489768 510041 525963 503977 490081 489728 494043 483431 447734 413639 485161 523474 503309
16834 503309 456624 424365 423353 404518 416476 458757 454649 439387 412375 423720 398401 397844
16822C97844J8691J0237k8897l336J4634K2935l8225k9327P786J0305k1586O98
16810C61759k4396m9287q37J083m5556J0165L4482J3727r105n7927k0874r046
16798B04188K4088Q887k3400l2202j1999k403K1617J4144l3885K0089o735J6115
16786A98504R898R47j2118q989k5046j208n6210l977j3061j6964j1246n6908p135
16773c513O418K5570N1475J8507j8904J4678O0424M087j3091P600j1034M160M0863
16760A87240Q474k0981j0206j3716l0123k0363j8908J6385Q83n103m6562l6188
16748A0832J9114K8749N8503K7878l742j1956m1787j6054k3565j541J2494K5949
16736H4874R039J2928L1237K9907l7531l7984n592k0226k8625q486L6666O4057
$$ plain form
16822 397844 416535 426772 397875 394539 409173 432108 393883 364556 372342 382647 361061 361759
16810 361759 337363 288076 287239 288322 242766 252931 287413 301140 292035 234108 213234 204188
16798 204188 228276 237163 213763 181561 169562 167159 188776 202920 169035 189124 182389 198504
16786 198504 208402 209349 197231 188242 163196 161988 105778 101801 88740 71776 60530 3622 -3513
16773 -3513 2905 28475 79950 98457 79553 94231 154655 158742 145651 153251 142217 146377 187240
16760 187240 195714 174733 164527 150811 120688 100325 81417 97802 98685 93582 47020 10832
16748 10832 29946 58695 117198 145076 141334 129378 87591 71537 47972 46431 58925 84874
16736 84874 93913 106841 138078 167985 130454 92470 86878 66652 38027 29541 66207 130264
16724A30264l0022m2996k0853j1855n925l2232r37n0736j872N8897J3811k2677
16712a7133L7177M6480J0066l9241m2151K5359k7494n5680L5061K1882N25K7757
16700B2608J5877M2979J9266j8792r574k8032L111q782N346J0278n1298p243J7298
16687A3042m769M0524j895K549K4037M1051n1607o8185r53r673L1125J5568r267
16674B1547O735O918J9717J2697k1093j7831l2576q968L8661L7504j4692l4828
16662A3791l179J2870K1041j3022J62l3147m5197n856p985M4517J297k4129J4061
16649b4776K5791J0190L6233j3918q820k5966o328K2055j8983K158j6539j5247
16637c4150J2692J0690l11K3231l730o033R276r756l139M53j7626j2264p088p594
$$ plain form
16724 130264 100242 57246 36393 24538 18613 -13619 -14556 -65292 -67164 -8267 5544 -17133
16712 -17133 20044 66524 76590 37349 -4802 20557 -6937 -62617 -27556 -5674 -5149 22608
16700 22608 38485 81464 100730 81938 72364 44332 47443 38661 44007 54285 2987 -4256 13042
16687 13042 8273 48797 46902 49451 73488 114539 62932 -5253 -6206 -15879 15246 30814 21547
16674 21547 28282 35200 54917 67614 46521 28690 -3886 -12854 25807 63311 48619 13791
16662 13791 10612 23482 44523 31501 31663 -1484 -46681 -52537 -60522 -16005 -14708 -38837 -24776
16649 -24776 1015 11205 47438 33520 24700 -1266 -7594 14461 -4522 -2364 -18903 -34150
16637 -34150 -21458 -10768 -11079 12152 8422 2389 11665 1909 -1230 -777 -18403 -30667 -37755 -45349
16623d5349M183M9038K0286q873k0333q395q77l708j798j4059J1546M9629J37
16610C1427J901k7252K6206j1790P100K8548k9888j2052j3476M5728M336m4982
16598E806K7133j4970j037P411l909k7848p163k9835j4642P750J3691J4141L2
16585b3440J7530K0343j5937p118j649r484P524K553j192L2260k6058k4966L620
16572b6014r695m2549j2379j5517M1778K8225M1657K864j6103k1101l3962K1782
16560d1014K1953k9949J245o595K9464J9345q910j219J3285R183L2970J7810J1384
16547F8952n3826j3019j2440N2807l5318l8763K9492k9627j9085L680K0128J8987
16535h032o370M10J1482m585J6130k3688p703K7525K2861J8741m661J1988k926
$$ plain form
16623 -45349 -41166 7872 28158 19285 -1048 -9443 -10320 -14028 -15826 -29885 -18339 31290 31427
16610 31427 33328 6076 32282 20492 27592 56140 26252 14200 724 46452 50788 5806
16598 5806 32939 17969 16932 24343 20434 -7414 -14577 -44412 -59054 -51304 -37613 -23472 -23440
16585 -23440 -5910 14433 -1504 -8622 -10271 -19755 -12231 -9678 -10870 21390 -4668 -29634 -26014
16572 -26014 -35709 -78258 -90637 -106154 -64376 -36151 5506 8370 -7733 -28834 -62796 -41014
16560 -41014 -19061 -49010 -47765 -54360 -24896 -5551 -14461 -15680 -2395 6788 39758 57568 68952
16547 68952 15126 2107 -10333 42474 7156 -31607 -2115 -31742 -50827 -47147 -27019 -8032
16535 -8032 -14402 -13992 -2510 -7095 9035 -14653 -22356 5169 28030 46771 42110 54098 51172
16522E1172l6391m7925J4197J1988o255q506J8586L365j4278J5169J1152k497
16510I777k9095j4214N7639M2814l5527o0617J8028o923K180J2487l0159j0385
16498d3995O5508M1902m1332k2882K7575L4915J8339l6037m5471K909J0198N6263
16486F7892j9803R86L9545L8277k4690m8822q270q503k9751k0346j3549J593M1325
16473A5884P06l6005K0292L0536k426l3041k0403K0657q150k133k2864J9511N948
16460a1488L3195N6592K0907P433M6697N6334M2571N343m6914O4508J07552p08
16448C82022o9894l5169j7367l4657K9130o1511j00100k3324K3086L7293l709
16437A25800m732K328M1377L8823K2945M4225N3765r259k4985J566q574k3627
$$ plain form
16522 51172 14781 -33144 -18947 -6959 -13214 -21720 -3134 231 -14047 1122 12274 9777
16510 9777 -19318 -33532 24107 66921 31394 -29223 -11195 -18118 -15938 -3451 -33610 -43995
16498 -43995 21513 63415 22083 -799 26776 61691 80030 43993 -1478 1431 11629 67892
16486 67892 48089 49075 88620 126897 102207 53385 45115 36612 6861 -13485 -27034 -25441 15884
16473 15884 16590 -19415 877 31413 28987 -4054 -24457 -3800 -11950 -14083 -36947 -17436 -11488
16460 -11488 21707 78299 99206 106639 153336 209670 252241 257584 210670 275178 382730 382022
16448 382022 312128 276959 259592 224935 254065 192554 92454 69130 92216 129509 125800
16437 125800 121068 123396 164773 203596 226541 270766 324531 315272 290287 291853 283279 259652
16425B59652Q477r716k0574l4396k9673k4099k8672m7393R382L7758m2711n5135
16413B2900j9576K573l1650J4704K4857k035l0440K6822j4132K3077m82M383K9496
16400E0497K7398j4361k8326n4228j7061M9919N3702J2855j2504n789k292j0286
16388D9524Q002r550l0509j5436k2203j3958m9332J1112p935R503l1832J7811
16376h4803O5120L7076k3964j2202Q246m641Q209j7825m0289N1876K1517m709
16364C611k9945M6070L025O462J0343J0433m707r378p022m146J2397m6881R591
16351a47M2759R071K4559r700m4909k9119j084L0971j9708j8162P700K0140j7966
16338e595n2963l7267L2230M521K6084j7441r98j9936J336L2088l550k0846O3261
$$ plain form
16425 259652 268129 258413 237839 203443 173770 149671 120999 73606 82988 120746 78035 22900
16413 22900 3324 5897 -25753 -11049 13808 11773 -18667 8155 -5977 17100 16618 21001 50497
16400 50497 77895 63534 35208 -19020 -36081 13838 67540 80395 67891 62102 59810 49524
16388 49524 57526 47976 17467 2031 -20172 -34130 -83462 -72350 -80285 -70782 -102614 -84803
16376 -84803 -19683 17393 -6571 -18773 -10527 -15168 -6959 -24784 -65073 -13197 8320 3611
16364 3611 -26334 19736 22761 29223 39566 49999 45292 35914 28892 24746 37143 -9738 -147
16351 -147 42612 51683 76242 66542 21633 -7486 -8570 22401 2693 -15469 -7769 12371 -5595
16338 -5595 -58558 -95825 -63595 -59074 -32990 -50431 -51429 -71365 -70029 -37941 -41491 -62337 924
16325I24L5105n1245m4418L0589L4645R018j4978m4624R882L3092O959K3137k6599
16312A487k5328L389J7099J061j6866l8424j0205J3601M1968J1983l3565k935
16300c6735l0786K3718M6840L7015J1073k3530K984m2252k8199J0733q90Q501
16288b1528K0180j3179M1246J5153m8597l7736J7179K3771J2769k8953M8146K2173
16276E0624m0697l6708J6307L2079K5591l5275r703j5408l6745j2600l0310k6260
16264a19105m364N7308K6661m3567j50K0100k5601j5704L9140n999N781K7691
16252c7809R761M0851j2140K3114k530k5104k0005j87L7948J4786r803l5856j1335
16239b8309k5921j586l7385N130q514j1007r843L6755K2050P889J0804j0621k7779
$$ plain form
16325 924 36029 -15216 -59634 -29045 5600 14618 -360 -44984 -35102 -2010 4949 28086 1487
16312 1487 -23841 -20452 -3353 -2292 -19158 -57582 -67787 -54186 -12218 -235 -33800 -36735
16300 -36735 -67521 -43803 3037 40052 51125 27595 30579 -11673 -39872 -29139 -30029 -21528
16288 -21528 -1348 -14527 26719 41872 -6725 -44461 -27282 -3511 9258 -19695 28451 50624
16276 50624 9927 -26781 -10474 21605 47196 11921 2218 -13190 -49935 -62535 -92845 -119105
16264 -119105 -123469 -66161 -39500 -83067 -83217 -63117 -88718 -104422 -65282 -71281 -65500 -37809
16252 -37809 -28048 12803 663 23777 21247 -3857 -23862 -24049 13899 28685 18882 -16974 -28309
16239 -28309 -54230 -55816 -93201 -88071 -96585 -107592 -117435 -80680 -58630 -50741 -39937 -50558 -78337
16226g8337J1640J8412K5810n234P858J7831L2123M4930R054J4984J2293n3613
16214E7751n8807N6774K4190l0203J4921o561R353l0145k9489J3333l3229m0352
16202e2464M274J1407O046Q74l2349k0000m877M8911m73l0571j8342N371M0671
16189d1522L2093j812J5701P536J1622J5397M1062j963p0329J3610O3903l2553
16177E2745o1837P543K5277k5974J3888n514m7505m4790R602J5860O610j9645
16165g3740J2971L3663k5369o285K1363L1051L2766j5952n8822l3691J1438M6823
16153b3784K2176p137K9010K7568R043n2521j4213n009k5180l5308j0732L7N2261
16140c3789N6253M2619j28l7565j4841k1682j8069J778K6523O8414M7860j5184
$$ plain form
16226 -78337 -66697 -48285 -22475 -27709 -19851 -2020 30103 75033 84087 99071 111364 57751
16214 57751 -1056 55718 79908 49705 64626 58065 67418 37273 7784 21117 -12112 -52464
16202 -52464 -48190 -36783 -30737 -29863 -62212 -82212 -87089 -38178 -38651 -69222 -87564 -82193 -41522
16189 -41522 -9429 -11241 4460 11996 23618 39015 80077 78114 7785 21395 85298 52745
16177 52745 -9092 -1549 23728 -2246 11642 6128 -41377 -86167 -76565 -60705 -54095 -73740
16165 -73740 -60769 -27106 -52475 -58760 -37397 -6346 26420 10468 -48354 -82045 -70607 -23784
16153 -23784 -1608 -8745 20265 47833 56876 4355 -9858 -14867 -40047 -75355 -86087 -86050 -33789
16140 -33789 22464 65083 64955 27390 12549 -9133 -27202 -25424 1099 69513 117373 102189
16128A02189m1083l2420k1394j0419L049R17l0272k5398K8149O8517n934j489
16116C4412n9504M614N7425r43j4801j3811K1493K8879j0341J040m2427l3321
16104b7285m4717N8090J7268J3759J4877j8747J3293j0105k0285L4551L0654r152
16092E2201P850l6131l1325o692J2030N714j0311J2128L5150J6304n22K2q3918
16079b7500j1716J6314j812l6242K9101K9374L004m6317l6825k3920O8500O4674
16067B6635j3517j8249l6446K990M8985j5306J0061R734r359l0466m6316j6303
16055h7557m05m369K9897K674r472P139N2797K0864m7264j6373J8475K9761N4590
16042E0757j8147p2042k0487N9874M190L3582M0198n328m6252j8196l783k3745
$$ plain form
16128 102189 61106 28686 7292 -3127 -78 839 -29433 -54831 -26682 41835 35901 34412
16116 34412 -25092 -20478 36947 36004 21203 7392 28885 57764 47423 48463 6036 -27285
16104 -27285 -72002 -13912 3356 17115 31992 13245 26538 16433 -3852 30699 61353 52201
16092 52201 60051 23920 -7405 -14097 -2067 3647 -6664 5464 40614 56918 56396 56418 -27500
16079 -27500 -39216 -22902 -24714 -60956 -31855 -2481 523 -45794 -82619 -106539 -38039 26635
16067 26635 13118 -5131 -41577 -38587 10398 -4908 5153 14887 5528 -24938 -71254 -87557
16055 -87557 -87962 -92331 -62434 -59760 -69232 -62093 -9296 11568 -35696 -52069 -33594 -3833 50757
16042 50757 32610 -39432 -59919 -45 4145 37727 77925 72597 26345 8149 4366 -19379
16030a9379j8130o640m7940K6170N4809K2004K3908p380O896K6728j9271m6104
16018d329p729l0027L4286M9750k4701m641j1892N415J3132J1475J670k1399K824
16005A3834j9365K7795r225j9218J5645j5951J8445M481j7063o819k1634L86P0187
15992D1498q743k5323k3185q52M3546M6374K1316l3471n3984m9347L0735K9415
15980A7979k4863K4272o285n863M000k7255q88L7786L2635j424m3159n358l420
15967a843Q835j00l584L245l2747r393l3754m399l8273M8852M3352N714l4659
15954d8754j6927J8193K7541P6878p319n7743k573K7788j7960m6635K6067K7901
15942F457r212K0959l6670m4810J9902J6544n37J68k7589P773M1032J7674j0947
$$ plain form
16030 -19379 -37509 -44149 -92089 -65919 -11110 10894 34802 27422 34318 61046 41775 -4329
16018 -4329 -12058 -42085 -7799 41951 17250 12609 717 6132 19264 30739 32409 11010 13834
16005 13834 -5531 22264 13039 -6179 9466 -6485 11960 16441 -622 -7441 -29075 -28689 41498
15992 41498 32755 7432 -15753 -16605 26941 73315 94631 61160 7176 -42171 -11436 17979
15980 17979 -6884 17388 11103 5240 9240 -18015 -18903 18883 51518 50094 6935 1577 -1843
15967 -1843 6992 6892 3308 6553 -26194 -35587 -69341 -73740 -112013 -63161 -19809 -14095 -48754
15954 -48754 -65681 -47488 -19947 56931 49612 -8131 -10704 17084 -876 -47511 -21444 6457
15942 6457 -2755 18204 -18466 -63276 -43374 -26830 -27367 -27199 -54788 -47015 -5983 11691 744
15929G44j6996q673J2501k0180m061K6093m705L4237j845k0463K1012J0917l5974
15916g393j5133K6558L2261M503k6360l4807q437r900J0975J5283O789L419O121
15903C879M2783q534J10K5268j6037k0403l8799j0325P765M9041J5879k467o8626
15890b0466l7649q507O4114L734l7151m7612K0876M2149M1717k8319m755K5446
15878A3577L9333L335j3469k5884r251R65J167J2421p0984p81M0146Q733Q776
15865H084j4547l0609K0408O382j5185j4765J5913l1405j3967N5838N2798K6885
15853F5830p040j6054J4761K5031J4000j5522o2045J181K248l7560M24J2186J547
15840a013K7293M2325N388l6658m538N8689N370o6077n9844k1574K0564k1416
$$ plain form
15929 744 -16252 -24925 -12424 -32604 -36665 -10572 -15277 18960 17115 -3348 17664 28581 -7393
15916 -7393 -22526 4032 36293 40796 14436 -20371 -28808 -38708 -27733 -12450 -5661 -2242 3879
15903 3879 46662 38128 38238 63506 47469 27066 -11733 -22058 -14293 34748 50627 48160 -20466
15890 -20466 -58115 -66622 -2508 1226 -35925 -83537 -62661 -20512 21205 -7114 -11869 13577
15878 13577 52910 56245 42776 16892 7641 8606 9773 22194 -48790 -49571 -9425 -692 8084
15865 8084 -6463 -37072 -16664 -10282 -25467 -40232 -24319 -55724 -69691 -13853 38945 65830
15853 65830 58790 42736 57497 82528 96528 81006 18961 20142 22390 -15170 -14746 -2560 -1013
15840 -1013 26280 68605 73993 37335 32797 91486 96856 30779 -29065 -50639 -30075 -51491
15828e1491l3747p199m188K6616J6607j5366L0390M0610M9396n869m2637j2645
15816i523J1214o428K1312j2085q527k3218J5522P178k101L04l464K5596j0358
15803E422k874l753k9384L5420K0839J8019j6868J0267q856K7561Q275n1571k8077
15790a5580k5977J5580M207k1866j0863J9805K2319O3213L7011n8753n3203l3655
15778e7762J5127L6508j6710M480M31n4762R568N8505L4378k5044l1232K1191
15766e322J8695l2896l7946M8946P1990R914o6717p592J6282l8722j1503M3274
15754H403M4941j9946J9019j3763r115R494k3535J3511j5652k1787K3413M8815
15742F3798j022j6200M3118P571J2692n8842q6173l5513K4191Q4223K3446l4228
$$ plain form
15828 -51491 -85238 -92437 -96625 -70009 -53402 -68768 -38378 2232 51628 45759 3122 -9523
15816 -9523 1691 -4737 16575 4490 -4037 -27255 -11733 -4555 -6656 -6352 -9816 15780 5422
15803 5422 2548 -1205 -30589 4831 25670 43689 26821 37088 28232 55793 64068 12497 -15580
15790 -15580 -41557 -25977 -21770 -43636 -54499 -34694 -12375 50838 87849 29096 -24107 -57762
15778 -57762 -42635 -6127 -22837 -18357 -17926 -72688 -63120 -4615 29763 4719 -26513 -5322
15766 -5322 13373 -19523 -57469 -8523 63467 73381 6664 -928 15354 -23368 -34871 8403
15754 8403 53344 33398 52417 38654 29539 39033 15498 29009 13357 -8430 14983 63798
15742 63798 62776 46576 89694 97265 109957 51115 -35058 -70571 -46380 37843 61289 27061
15730B7061o5345l2036L0331K9815L4811Q066k5499j5128J270J4695L0146K3681
15718F1868p655j1705l6668k6929l317J9321K0523M6736L4180l209k8996l149
15706F1000o135p0452J9812M2611l7078j6023Q386n81l8945o369o893j1437J9649
15693d2455L074j0857R360M0169J673l9907q672K7167N790j6050l0883j9442J3951
15680f7082n710K50q274j2072K6486K9791m338r956j7314J2226K3464j3577j7725
15667f3831l8032M502J2101N120r655L0890k1259j6241L1229N8977K0283q153
15655E931l990j3944K812k1695K8459N2953L547q2l6709j4563K1328r247m7358
15642c2558L8032K7455m3483l6803m3461j5871L9125K6446n194K4921J6762k9251
$$ plain form
15730 27061 -38284 -70320 -39989 -10174 24637 32703 7204 -7924 -6654 8041 38187 61868
15718 61868 54213 42508 5840 -21089 -24406 -5085 15438 62174 96354 93145 64149 61000
15706 61000 54865 -15587 4225 46836 9758 -6265 2121 1540 -37405 -43774 -50667 -62104 -42455
15693 -42455 -39381 -50238 -40878 -709 964 -38943 -47615 -20448 -14658 -30708 -61591 -81033 -67082
15680 -67082 -72792 -72542 -80816 -92888 -66402 -36611 -40949 -50905 -68219 -55993 -32529 -46106 -63831
15667 -63831 -101863 -97361 -85260 -80140 -89795 -58905 -80164 -96405 -65176 -6199 14084 5931
15655 5931 1941 -12003 -9191 -30886 -2427 50526 54073 53991 17282 2719 24047 14800 -32558
15642 -32558 5474 32929 -10554 -47357 -90818 -106689 -67564 -41118 -46312 -21391 -4629 -33880
15630c3880l672J7137K2281j0754Q532k5708o404L465J9698P3400J1401n1151
15618B4345l9340l6003l2230n64L3094L1245M4591K437j2205o555j1863m4734
15606d7782k2324L595N5038J73k5933k1081J4820k1025r522J8069k9744j3443
15594i9159K8416M6808J5579K9128J235k5770k148R078j7858l2085K100k7941
15582g2617n652K1125K6603J6478N580Q685J7332K3948o3293k3381N7690J1971
15570B4469j5595l0261j6329j2438j2453K3329M626K4647R228m261j0869N748
15558a0159m736j3160j6542O062O840n602q039j677l1228K6337K0425L0329L0406
15545B9256K8147l3710n4954k8276p751O0881O333j3275L5636k445j2825l2147
$$ plain form
15630 -33880 -37552 -20415 1866 -8888 -356 -26064 -32468 -29003 -9305 64095 75496 24345
15618 24345 -14995 -50998 -83228 -83792 -50698 -19453 25138 27575 15370 8815 -3048 -47782
15606 -47782 -70106 -66511 -11473 -11300 -37233 -58314 -43494 -64519 -74041 -55972 -85716 -99159
15594 -99159 -70743 -23935 -8356 20772 22007 -3763 -5911 3167 -14691 -46776 -44676 -72617
15582 -72617 -78269 -57144 -30541 -14063 -8483 202 17534 41482 -21811 -45192 12498 24469
15570 24469 8874 -21387 -37716 -50154 -62607 -39278 -34652 -10005 -777 -5038 -15907 -10159
15558 -10159 -14895 -28055 -44597 -38535 -31695 -37297 -45336 -47013 -78241 -51904 -31479 -1150 29256
15545 29256 57403 23693 -31261 -59537 -67288 -6407 -74 -13349 22287 19842 7017 -25130
15533b5130R886j0684J0644K1407J0695J2335J2833k3410l7516n837L897O275
15521a4605j958J5804p081J7619k1729l763J9129J5463r19r672L409J3889K7800
15508E3386m7943l7628J9826q728k4564j9817J5857L1984r58J1938k0240j7395
15496d4282L1341L9473j5907o727q670m950J4799j9073K1437k0739O11J8617J2668
15483A8598j5221j4883j265K5571J2428N665k4991k1713K6968m305j3424K3537
15471A6965J1464j410o64k5995J6684K5648j9358l3843J8006p98k4075n325p758
15458c0459o921k009L5179K5744j1708j1415k2384l2929j2529J3642O000l4255
15446h4044k67J0554K7322K284R431J7437K329P108J470J7111k971P703l5545
$$ plain form
15533 -25130 -15244 -25928 -15284 6123 16818 29153 41986 18576 -18940 -24777 -20880 -14605
15521 -14605 -16563 -759 -7840 9779 -11950 -15713 3416 18879 17960 8288 11697 25586 53386
15508 53386 5443 -32185 -12359 -21087 -45651 -65468 -49611 -17627 -18585 -6647 -26887 -44282
15496 -44282 -12941 26532 10625 3898 -4772 -9722 5077 -13996 7441 -13298 -12687 5930 18598
15483 18598 3377 -11506 -12771 12800 25228 30893 5902 -15811 11157 6852 -6572 16965
15471 16965 28429 27019 26355 360 17044 42692 23334 -10509 7497 6699 -17376 -22701 -30459
15458 -30459 -37380 -39389 -4210 21534 9826 -1589 -23973 -56902 -69431 -55789 -49789 -84044
15446 -84044 -84311 -73757 -46435 -44151 -34720 -17283 -14954 -7846 -6376 10735 7764 15467 -20078
15433b0078J8085L7435N776P082l2207J1694L2827k775L0192K402m1400k0904
15421B8129n0589l1252K4154O7182M3877m7816k0043k6201K4743N992L7958L8490
15409I4624J3252n5649l6492M6859j1630j1750q293l535k7419j5957N3592M4414
15397H2016R113m2298m0288o0526j4401K3318J6530K532O049K5907l685L3865
15385C8132J7294k0656M234J245l3169m2562K5842j5312R457N5132o331n3345
15373b0039n305j2251n162P98L9891N8600k37K930m0623p7786L1151O5181L3282
15360G0430k823m3359m7157l0668K717N350Q0119K5331o8427K1101k1830k9708
15348c8924N2614p91L116K2318M941n3075o808J5068r655r241K0592Q534j6848
$$ plain form
15433 -20078 -1993 35442 41218 48300 16093 27787 60614 57839 88031 90433 49033 28129
15421 28129 -22460 -53712 -29558 37624 81501 33685 13642 -12559 12184 18176 56134 94624
15409 94624 107876 52227 15735 62594 50964 39214 30921 27386 -33 -15990 37602 82016
15397 82016 91129 48831 8543 -51983 -66384 -43066 -26536 -24004 -17955 7952 4267 38132
15385 38132 55426 34770 39004 40249 7080 -35482 -9640 -24952 -15495 39637 33306 -20039
15373 -20039 -25344 -37595 -42757 -41959 -2068 56532 56295 59225 18602 -59184 -28033 37148 70430
15360 70430 67607 24248 -22909 -53577 -50860 -45510 34609 59940 -8487 12614 -9216 -38924
15348 -38924 13690 12899 16015 38333 43274 -9801 -16609 -1541 -11196 -20437 155 8689 -8159
15335h159M0775n115k3618l218P342J4653N891j1497m032l8967j5721j1690L0414
15322b2942M4682J1603n2249n8103M6125P7729K264Q497K5458k3737o9021n8527
15310f8221L4906M9798l953r802k9036k1766k522k9631J33J4545M6031M106o589
15297b2001k0866K53J7546p807M0541J8717K5437j5768k3392K429K1880N978J492
15284D4439j6983j6934j0723j28K1385k1559m5338P67j3797j8131K5402J3065
15272c8535o738N555R098j0550L5818L1180j9981J1492n353o30K4649p820J8183
15259D6368M410n8384j1870l4692j7953O9279J4378l2015l309N170P880L1679
15247B0941K2166J601L9994n0522o6065K0156J5321m992k0180P951j0088n8987
$$ plain form
15335 -8159 32616 27501 3883 665 8007 22660 28551 17054 13022 -25945 -41666 -53356 -22942
15322 -22942 21740 33343 -18906 -77009 -30884 46845 49109 57606 83064 59327 -9694 -68221
15310 -68221 -33315 16483 12530 2728 -26308 -48074 -50596 -80227 -80094 -65549 -19518 -15412 -22001
15297 -22001 -42867 -42614 -25068 -32875 7666 26383 51820 36052 12660 15089 36969 42947 44439
15284 44439 27456 10522 -201 -329 21056 -503 -45841 -45074 -58871 -77002 -51600 -38535
15272 -38535 -45273 -39718 -30620 -41170 -5352 25828 5847 17339 11986 11356 36005 28185 46368
15259 46368 50778 -7606 -19476 -54168 -72121 -2842 11536 -20479 -23788 -18618 -10738 20941
15247 20941 43107 44708 84702 34180 -31885 -11729 3592 -1400 -21580 -13629 -23717 -82704
15235h2704k5371O0624N7867q979R992J3991k4967l6348l2433P112n3092j4973
15223a29281L390O1166M2042L1985J6614k2126j7012j7594k2992p373P099k5218
15211g9300K4569L5195K8530l1686j4172L2572J0847j1060j5039o719j4526j718
15199d2507J7644k6811l2035K6919J5411M4289J7254J118j5976J2345j5600n5494
15187e3443L320k638K8863K6995l1223n2359j947J6102M135l471N2444Q765J8451
15174A3994j8778J3289J0902K3049J916K6353N209k1155m8552J0598J1532m3462
15162a5105k9135j468Q089K8221N426l1358j5938j5412K1095K6224j0734k0325
15150e0420K5155M7951j7812k2709k1942L900n0101N870K5245J5817l3706K9703
$$ plain form
15235 -82704 -108075 -47451 10416 1437 11429 25420 453 -35895 -68328 -61216 -114308 -129281
15223 -129281 -125891 -64725 -22683 9302 25916 3790 -13222 -30816 -53808 -61181 -54082 -79300
15211 -79300 -54731 -19536 8994 -22692 -36864 -4292 6555 -4505 -19544 -26263 -40789 -42507
15199 -42507 -24863 -51674 -83709 -56790 -41379 2910 20164 21282 5306 17651 2051 -53443
15187 -53443 -50123 -52761 -23898 3097 -28126 -80485 -82432 -66330 -62195 -65666 -13222 -4457 13994
15174 13994 -4784 8505 19407 42456 44372 70725 75934 54779 6227 16825 28357 -15105
15162 -15105 -44240 -45708 -37619 -9398 -3972 -35330 -51268 -66680 -45585 -19361 -30095 -50420
15150 -50420 -25265 22686 4874 -17835 -39777 -35877 -85978 -80108 -54863 -39046 -72752 -43049
15138d3049L5655J6600J4551j962m640j0830l4316j1637l2583N0813R834k4559
15126c6123M199J6670L5194K189k0390l9815K3917m1822l4768K2271K6606Q630
15114c3242k4971j1647L079K1021J7684j7067K0117m905k3862P195J0407k847
15102c9038l778N548r763M4059j5987o900K0920Q804J2j9956Q288M4352j3406
15089B3155k1510J2694j3739m1846O550J8689N835k7725j1209M038P635K0345
15077a7088L010l8212J4772K9766q867k2143k792J6636J6657N307j644j2699J4949
15064b348K53k1523L367N711R435n142j0473J16P537J1389L3402m0717j8158l044
15050c0195N980k057J4574R244L7902J3920l0643r869J2775k39j8715J191m5992
$$ plain form
15138 -43049 -7394 9206 23757 21795 17155 6325 -27991 -39628 -72211 -21398 -11564 -36123
15126 -36123 -31924 -15254 19940 22129 1739 -38076 -14159 -55981 -90749 -68478 -41872 -33242
15114 -33242 -58213 -69860 -66781 -45760 -28076 -45143 -25026 -29931 -53793 -46598 -36191 -39038
15102 -39038 -42816 -37268 -47031 -2972 -18959 -25859 -4939 3865 3877 -16079 -7791 36561 23155
15089 23155 1645 14339 600 -41246 -34696 -16007 -10172 -37897 -49106 -45068 -37433 -17088
15077 -17088 -14078 -52290 -37518 -7752 -16619 -38762 -41554 -24918 -8261 -2954 -4598 -17297 -2348
15064 -2348 -2095 -23618 -20251 -14540 -5105 -10247 -20720 -20604 -13067 -1678 31724 -8993 -27151 -30195
15050 -30195 -24215 -26272 -11698 -2454 35448 49368 18725 8856 21631 21392 2677 3868 -42124
15037d2124K6397K2084P513J0281P92J4385k431J1202o549j2032l4777j073K1107
15024A4775j7551j3934j3793K2193L7743j3860m0671m891J9315k7045k4850r54
15012f3523L7613J4025Q24k3073L2673N1928L4732O1K498M134K14n482l2121m4288
14998A0215m459Q896k3727k8325K4260j4190N0928k6136r963M4330j6813q1491
14986f6475n5191J3757L7397L4776j4875l3001L9934K4351l0413Q171O572J4434
14974b0563L419J053J4477K6565l3572k8809M0839L4883J6977P342l9344p4602
14962e1335J5631O0571J3753l3338k3320K1492J0484M1830j3690k1111J278J2830
14950C5075L0575j0614l7688k8532N800J9718j2681l9688j8777q504L2926M7697
$$ plain form
15037 -42124 -15727 6357 13870 24151 24943 39328 36897 48099 41550 29518 -5259 -6332 14775
15024 14775 -2776 -16710 -30503 -8310 29433 15573 -25098 -29989 -10674 -37719 -62569 -63523
15012 -63523 -25910 -11885 -11061 -34134 -1461 50467 85199 85260 87758 91892 92106 86624 54503 10215
14998 10215 5756 14652 -9075 -37400 -13140 -27330 23598 -2538 -12501 31829 15016 -66475
14986 -66475 -121666 -107909 -70512 -35736 -50611 -83612 -43678 -19327 -49740 -41569 -34997 -20563
14974 -20563 -17144 -16091 -1614 24951 -8621 -37430 3409 38292 55269 62611 23267 -51335
14962 -51335 -35704 24867 38620 5282 -18038 3454 13938 55768 42078 20967 22245 35075
14950 35075 65650 55036 17348 -11184 -5384 14334 1653 -38035 -56812 -65316 -32390 15307
14938A5307l7267J9209K5718K768m0211j8815O58O220j3835q817M2731L1916j5677
14925I905j0150j2553k8911p537K8381J0292j6717P127K3753M1466k1581k4659
14913a184L285R697q849j7598k4100K6392k350m5826L6778O1519K7662m228l6151
14900B5047P139l0263q7O8414M3287r1j407k4301m8603j2912j5063l2734k4923
14887d6497l9047L0628M2203l841k9992j8254J386k6877l0690L7222M568J610
14875g7581n947K827K6097j0925K2636N5980N863J6532N4682M466j4817l2936
14863D6877m3721k9919k5770K8906L3324q807k3293k9440J1476J9883K5765K7752
14851C3033k366l1338l5960n1169N2464L2553L3499Q678j016l819K3457L3693
$$ plain form
14938 15307 -21960 -2751 22967 25735 -14476 -33291 -32633 -26413 -40248 -49065 -6334 25582 9905
14925 9905 -245 -12798 -41709 -49246 -20865 -10573 -27290 -20163 3590 45056 23475 -1184
14913 -1184 2101 11798 2949 -14649 -38749 -12357 -14707 -60533 -23755 37764 65426 61198 25047
14900 25047 32186 1923 1836 70250 113537 113446 112039 87738 39135 26223 11160 -21574 -46497
14887 -46497 -85544 -54916 -12713 -16554 -46546 -64800 -63414 -90291 -120981 -83759 -79191 -77581
14875 -77581 -83528 -80701 -54604 -65529 -42893 13087 18950 35482 90164 94630 79813 46877
14863 46877 3156 -26763 -52533 -23627 9697 890 -22403 -51843 -40367 -20484 5281 33033
14851 33033 30667 -671 -36631 -87800 -35336 -2783 30716 39394 38378 34559 58016 91709
14839I1709o6952p6369K1016K9273j2651p907J5387k2996k0101J4010J3141K1279
14827a161M685r066l2045j1479N0044J5136M128l7294k7266k7261K8Q658J9383
14814d3510Q200k3543K3350R669k2822L2152J9344K9679m636K9153j104m153k1656
14801C0123l4475K8106m124Q761K4645p369l8740j5809L012j0736r292K9710o691
14788b879K225K4458P079L031l4163j3621k0344J3269M010J2968M3953l856p1635
14775c5505m8091P2292O1610j6337j8095K5863m6490J9818K3388k3881N057P057
14763B6686l3942J1576L0326m1716k7871J5533K2389N037Q130O238k7835p038
14751a2487O84j61L182q247k9624o74j2738K2983K4663K4306k8133m4216R941
$$ plain form
14839 91709 24757 -51612 -30596 -1323 -13974 -21881 -6494 -29490 -49591 -35581 -22440 -1161
14827 -1161 3524 -5542 -37587 -49066 978 16114 20242 -17052 -44318 -71579 -71551 -62893 -43510
14814 -43510 -35310 -58853 -35503 -25834 -48656 -16504 2840 32519 27883 57036 55932 51779 30123
14801 30123 -4352 23754 19630 28391 53036 45667 6927 -8882 -5870 -16606 -25898 3812 -2879
14788 -2879 -654 23804 30883 33914 -249 -13870 -34214 -20945 -16935 -3967 39986 36130 -35505
14775 -35505 -83596 -11304 50306 33969 15874 41737 -4753 15065 38453 14572 19629 26686
14763 26686 -7256 4320 34646 -7070 -34941 -19408 2981 8018 16148 22386 -5449 -12487
14751 -12487 -11803 -11964 -8782 -17029 -46653 -47327 -60065 -37082 -12419 11887 -16246 -60462 -50521
14738e0521P3720J6223q946l3048j3133K7081J9240j5450J8502K1438j4240j5845
14726B5021p931M6646q6l6113O504J949j4802R834k1437j0351J0814Q382j8738
14713c08L826m603j5086K952J2611R519j6077k7184K7012K3339j1721r223k2468
14700b7411J9080O014l616o34m2379K0314K5492M2344l1592L0881l9154k8220
14688b8881k4887l597J4158O086p788M3101N6287j2569l9651L038L4653J2837
14676E2787l9814l6476J9938K6460k6497k0356J4472k386j7515k392J4035P0256
14664E2512l1257k5389k6235k1508j2035L8315l544k805J2289N1875j7682j7727
14652c191N342k0020L522K1426k8396j6804J8584P293L5639M6873P962k7873m3469
$$ plain form
14738 -50521 23199 39422 30476 -2572 -15705 11376 30616 15166 33668 55106 40866 25021
14726 25021 17090 63736 63650 27537 34041 35990 21188 31022 9585 -766 10048 18430 -308
14713 -308 3518 -1085 -16171 -13219 -608 8911 -7166 -34350 -7338 16001 4280 -4943 -27411
14700 -27411 -8331 -2317 -5933 -6567 -48946 -28632 -3140 39204 7612 38493 -661 -28881
14688 -28881 -53768 -57365 -43207 -37121 -44909 -1808 54479 41910 2259 5297 39950 52787
14676 52787 12973 -23503 -3565 22895 -3602 -23958 -9486 -11872 -29387 -31779 -17744 52512
14664 52512 21255 -4134 -30369 -51877 -63912 -25597 -29141 -31946 -19657 32218 14536 -3191
14652 -3191 2151 -17869 -14347 7079 -21317 -38121 -19537 -12244 23395 70268 78230 50357 6888
14639F888p0428Q69L6344Q716K0431o81p232M7933K9188l4298k8634j0566r693
14626a1163M543j3223j3565M7461J3474k048k8810k5564J3341J8063k2531M2091
14614B2069K5426l0988m0007k5647j4642J4486K5035L1957k4414m7250J141r563
14602g2397j5768J4601L8021P493K6455p574r897j0648J6469p075j9594P708K9419
14589b787K5524j2125m4653j6478J0484N3895q31o8055k0397J6902L5523L9500
14577A6502N909m768q660J8819m2055J6675L3519j3409l2111J3296O631k2735
14565a2387j8432k173k9861p834O9241K6282k3022L976k7347J3310L3880J4481
14553D0114o5380j3126M2262K1323j8851l436p380J1208l598k2367l9084Q011
$$ plain form
14639 6888 -63540 -62671 -26327 -17611 2820 2139 -5093 42840 72028 37730 9096 -1470 -11163
14626 -11163 -6620 -19843 -33408 14053 27527 25479 -3331 -28895 -15554 2509 -20022 22069
14614 22069 47495 16507 -23500 -49147 -63789 -49303 -24268 7689 -16725 -63975 -62834 -72397
14602 -72397 -88165 -73564 -35543 -28050 -1595 -9169 -19066 -29714 -13245 -20320 -39914 -32206 -2787
14589 -2787 22737 10612 -34041 -50519 -40035 13860 13029 -55026 -75423 -58521 -22998 16502
14577 16502 22411 17643 8983 27802 -14253 2422 35941 22532 -9579 3717 10348 -12387
14565 -12387 -30819 -32992 -62853 -70687 -1446 24836 1814 5790 -21557 -8247 25633 40114
14553 40114 -25266 -38392 3870 25193 6342 2906 -4474 6734 3136 -19231 -58315 -50304
14541e0304M6708M2140o4006L4805N6217R683J1811J395o2237n4338k1139J7193
14529c2072K2607L010l0739l7261j7585M2500j202p353P4270K1841p4n8004k4979
14516d5041J8182K7862R448J0981K2308l1894k5106J9313K9227J8810M516k203
14504E6403J0354m9989m6170K6576l300j5970p764L4836J1202m6385L713M1112
14492A4618P283K08Q430j7267n640J8168r483K654j3395P486K6131J6241l4168
14479B1266o0684l5642J4220O835L2722N2792K3937m130j11786m9121M3482K3463
14467d2646M1979L7935k2432k9938j184K6439j6615j5716j2090M243J7122j8720
14455c1623L0371J9008m8716J4004J9285K514l3571j2231K818K1241K0018k3515
$$ plain form
14541 -50304 -3596 38544 -25462 9343 65560 75243 87054 88449 26212 -28126 -49265 -32072
14529 -32072 -9465 -6455 -37194 -74455 -92040 -49540 -50742 -58095 16175 38016 37942 -20062 -45041
14516 -45041 -26859 1003 10451 21432 43740 11846 -13260 6053 35280 54090 58606 56403
14504 56403 66757 16768 -29402 -2826 -6126 -22096 -29860 4976 16178 -30207 -26494 14618
14492 14618 21901 22109 30539 13272 7632 25800 16317 18971 5576 13062 39193 55434 21266
14479 21266 -39418 -75060 -60840 -54005 -21283 31509 55446 51316 -60470 -109591 -66109 -42646
14467 -42646 -667 37268 14836 -15102 -16286 10153 -6462 -22178 -34268 -30025 -12903 -31623
14455 -31623 -1252 17756 -30960 -16956 2329 4843 -28728 -40959 -38141 -16900 3118 -20397
14443b0397K9918K8138n15l1718l0580K0302m1603K0827N4329Q969K6464J910
14431F6044j0262J551Q077o864k7318k0562k193j8716l5168j4573r003l3046M274
14418i7759N4244N389l0556j575K1394L6383J7930J878L465j3041P390O852K0845
14405C2839K589L0318r312l3981k7611J8118J5202n157o757j5780L4138n041k6719
14392B846J7860L4576l7641n1090k7388q468K4419J8276l806n302O3384O831l649
14379C0848j2318m566K5062k0941p60L505k1772k2366L354K0965q406j0577l3098
14366e1070j0044L1225P158L926M7560R261m4694l8324j9478M4207r594o885j2562
14353d9314n986m7069j3508O804J9316J3070k4531j9466J7349L2013K248m770
$$ plain form
14443 -20397 9521 37659 37144 5426 -25154 -4852 -46455 -25628 28701 37670 64134 66044
14431 66044 55782 57333 65410 58546 31228 10666 8473 -10243 -45411 -59984 -68987 -102033 -97759
14418 -97759 -43515 -38126 -68682 -70257 -48863 -12480 5450 7328 10793 -2248 5142 11994 32839
14405 32839 35428 65746 56434 22453 -5158 12960 28162 23005 16248 468 34606 29565 2846
14392 2846 20706 55282 17641 -33449 -60837 -69305 -44886 -26610 -30416 -35718 27666 34497 30848
14379 30848 18530 13964 39026 18085 17325 20830 -942 -23308 -19954 1011 -7395 -17972 -51070
14366 -51070 -61114 -29889 -22731 -18805 28755 38016 -6678 -45002 -64480 -20273 -29867 -36752 -49314
14353 -49314 -55300 -102369 -115877 -109073 -89757 -76687 -101218 -120684 -103335 -71322 -69074 -73844
14341g3844O2059O8772k9539M2975J5867k9031l8807J0414j6531j8583o1141j4391
14329h1780M9701j2469n3807j7317K7444M4146Q733j1408l2992J9574M5556K7265
14317A2646M451k2623p240k422P486k4528n3508K786K0086K5139O782k7090j2067
14304g0102M5108K2314j5372l9790J2551N098L2809J8570l8046l5393J3479J7137
14292c1637j3701k2299M601Q903J7910k209j957N5289m457R54K324O437J4501
14279C4659k098k856K2839J5337m4889o3053j5760L8439k9073K966r681K5018
14267b8152L0907L8938n579m6612R871K9607K2659K1484j7139k7839m9502k2810
14255d4167O2641K4297q249r988m1891o374Q461K56K3928L4986j4390p798r984
$$ plain form
14341 -73844 -11785 56987 27448 70423 86290 57259 18452 28866 12335 -6248 -67389 -81780
14329 -81780 -32079 -44548 -98355 -115672 -88228 -44082 -35349 -46757 -79749 -60175 -14619 12646
14317 12646 17097 -5526 -12766 -15188 -7702 -32230 -85738 -82952 -62866 -37727 -30945 -58035 -70102
14304 -70102 -24994 -2680 -18052 -57842 -45291 -40193 -7384 11186 -26860 -62253 -48774 -31637
14292 -31637 -45338 -67637 -63036 -54133 -36223 -38432 -40389 14900 10443 11397 13721 20158 34659
14279 34659 32561 29705 52544 67881 22992 -40061 -55821 -17382 -46455 -43489 -53170 -28152
14267 -28152 2755 41693 36114 -10498 -627 28980 51639 73123 55984 28145 -21357 -44167
14255 -44167 18474 42771 34522 24534 -17357 -23731 -15270 -15014 8914 43900 29510 21712 11728
14242A1728l2322j3942l0110K9117K2868J6467R576j3927L819j7692R348n103
14230a0173l2060M404M0135l0514q475L3077J6061K1058J9611l0416j8733j9455
14218a5480O570l0433K3855J2077j2998m6899l402o728J7987K4960k039N135M7185
14205A9790K6659P761n8967n7726r709l528L330J7448O093M982M7840J8820k5513
14192b720n648r559k7755l0940m367K724K949L5529N5135K2799J5287j7628j7247
14179A8559o4350m6240K6176M6026n855J5154j397K3470l095n2535J3426l2122
14167f2783J8413j2540J0172k580j6445n168J4216K7721J2226j0918K0205N315
14155b166M748O1559K2431m784l2071m5535K2166M233J1319N806j6905o0765j7641
$$ plain form
14242 11728 -20594 -34536 -64646 -35529 -12661 3806 13382 -545 3274 -14418 -5070 -10173
14230 -10173 -42233 -37829 2306 -28208 -36683 -3606 12455 33513 53124 22708 3975 -15480
14218 -15480 -8910 -39343 -15488 -3411 -16409 -63308 -66710 -73438 -55451 -30491 -32530 -27395 19790
14205 19790 46449 54210 -4757 -62483 -72192 -75720 -72390 -54942 -48849 -43867 3973 22793 -2720
14192 -2720 -8368 -17927 -45682 -76622 -80989 -78265 -75316 -39787 15348 38147 53434 35806 18559
14179 18559 -45791 -92031 -65855 -19829 -25684 -10530 -11927 11543 8448 -44087 -30661 -62783
14167 -62783 -44370 -56910 -46738 -49318 -65763 -70931 -56715 -28994 -16768 -27686 -7481 -2166
14155 -2166 2582 64141 86572 81788 49717 4182 26348 30581 41900 47706 30801 -29964 -47605
14142d7605K3477Q485J8887M8143k0003k0850k3796k6335K514o24k089Q756K2609
14129h431K2205j1864J0488p808o040o461j4114k4915J0313P4709K9365l3233
14117C4214o7285l6894K9677M2555K2781l850j0769K8838N0000J841j6168m017
14105G0923l4159j1647o578o0719k1570M0601M3017j1178J895q160J8835m1285
14093b0025l5664L3721J2011O115L2652l147k4740l449k761K25J761m585P107
14080g79R713j2175R272k7443k5727K9185L6824m829L7811M605m079N3392q699
14067I7071n9764m1180p558j9667j1627J7287L5917M8193j2858o192l0932j6655
14055g965k9582l8411K0932L9090m497j1578L452J0046l8815j8316L5626J4527
$$ plain form
14142 -47605 -24128 -15643 3244 51387 31384 10534 -13262 -39597 -37083 -37707 -39796 -31040 -8431
14129 -8431 13774 1910 12398 4590 -1450 -7911 -22025 -46940 -36627 38082 67447 34214
14117 34214 -33071 -69965 -40288 2267 25048 21198 10429 39267 89267 91108 74940 70923
14105 70923 36764 25117 18539 -42180 -63750 -23149 19868 8690 10585 2425 21260 -20025
14093 -20025 -55689 -21968 -9957 -3842 28810 25663 923 -2526 -5287 -5062 -3301 -7886 -779
14080 -779 8934 -3241 6031 -21412 -47139 -17954 18870 14041 51852 56457 52378 105770 97071
14067 97071 37307 -3873 -11431 -31098 -42725 -25438 10479 58672 45814 39622 8690 -7965
14055 -7965 -37547 -75958 -55026 -15936 -20433 -32011 -28559 -18513 -57328 -75644 -40018 -25491
14043b5491J7820J6748M7767J8187l8762o2858n2828L283L7927n1210k195L2987
14031e8625j2271K7317J6635K3394L296l7025j0972R042J1759K6226J5283Q896
14019B2955K6540N344k6282l1636k9040j5554j9748j4551O0778N5235J279p0176
14007c4856l5609j5997J2438O2030K7597k0688M7338k1429l1103L9325k4401p6944
13995g2299o895L0017M04J9808K5966m374J6655l284j9689P082j790k8843J8641
13982a8601k6344j0831J1018Q650R910K9543J1072L1096r643K5310J0904j8448
13970E3636k9820r277k8468l4170J6416J0588M943J4591L5830m575j6411k6501
13958a3218k679l0822J261J2317J1894L1275J1739J4511J0586J434k4735j1381
$$ plain form
14043 -25491 -7671 9077 56844 75031 36269 -26589 -79417 -76134 -38207 -89417 -91612 -58625
14031 -58625 -70896 -43579 -26944 -3550 -254 -37279 -48251 -39209 -27450 -1224 14059 22955
14019 22955 49495 54839 28557 -3079 -32119 -47673 -67421 -81972 -21194 34041 35320 -34856
14007 -34856 -70465 -86462 -74024 -11994 15603 -5085 42253 20824 -10279 29046 4645 -72299
13995 -72299 -79194 -49177 -48773 -28965 -2999 -7373 9282 5998 -13691 -6609 -8399 -37242 -18601
13982 -18601 -44945 -55776 -44758 -36108 -26198 3345 14417 45513 35870 61180 72084 53636
13970 53636 23816 14539 -13929 -48099 -31683 -21095 -16152 -1561 34269 29694 13283 -13218
13958 -13218 -15897 -46719 -45458 -33141 -21247 10028 21767 36278 46864 48298 23563 12182
13946A2182J0065K3469n8835l3234N0948M9952p473n133N534l7373k4251K6623
13934A2474M0028l0120j6922j4820j8635J1921P186Q392M5854J7082K350k9742
13922C5048j2931j4656n9789j9042J3751J0943k5396p389K5544M2692L573J6274
13910H622k5999l911j1535O812o774K6032Q0542J4778k4723k2770j0374J2002
13898D2702k9575m8314k0414K6846K7412N2230J4358k6618j6381j9390k7470J1144
13886a3470k0562k0971j9361K948Q6403L3402N594k67r438k6212j9298J0475L2448
13873D1691l3561j0941Q093O928j4546K3991L1651o1343n3377K4883P8365P52
13861D2586o3444L450J3695k0011r061l797K7885l984L487l6424j7712J9690K2763
$$ plain form
13946 12182 22247 45716 -13119 -46353 4595 54547 47074 41941 47475 10102 -14149 12474
13934 12474 52502 22382 5460 -9360 -27995 -16074 -8888 -496 45358 62440 64790 35048
13922 35048 22117 7461 -52328 -71370 -57619 -46676 -72072 -79461 -53917 -11225 -7652 8622
13910 8622 -17377 -21288 -32823 -26011 -32785 -6753 73789 88567 63844 41074 30700 42702
13898 42702 13127 -35187 -55601 -28755 -1343 50887 65245 38627 22246 2856 -24614 -13470
13886 -13470 -34032 -55003 -74364 -71416 14987 48389 53983 53716 44278 18066 -1232 9243 41691
13873 41691 8130 -2811 5282 12210 -2336 21655 53306 -8037 -61414 -36531 41834 42586
13861 42586 -20858 -17408 -3713 -23724 -32785 -36582 -8697 -12681 -9194 -45618 -63330 -43640 -20877
13848b0877N945K4717m2216k1139L6672J6973K074k2502n6571L5347R0722K0895
13836G0040l2884l9656m4718M426K0714L6980k599J067k003k7285M995J1218n490
13823e195O863L6277R652j3726k0690N956p431j8731J8242J3336l4184k9929K9316
13810a0244k6925j1872L0785k125l73N5121p540L133q195L179m3979J6061P934
13797D960N370k5068J7652l668j6822J6477K6203J8508k6331n3953k3803j1912
13785g2387M6393K810K8723K0802k1247k3958K1453M1116l230n5766k4409J9654
13773b0046p07J1911K2786P8172l2794n4709k9889l2999O490J0454j1026m5368
13761i7725j7058K1859N8652O1593j9566k1828n105j6314k6430K0366N358j6976
$$ plain form
13848 -20877 -14932 9785 -32431 -53570 -16898 75 2149 -20353 -76924 -41577 49145 70040
13836 70040 37156 -2500 -47218 -42792 -22078 14902 12303 13370 11367 -15918 -10923 295 -5195
13823 -5195 1668 37945 47597 33871 13181 19137 11706 -7025 11217 24553 -9631 -39560 -10244
13810 -10244 -37169 -49041 -18256 -20381 -20754 34367 26827 29960 21765 24944 -19035 -2974 4960
13797 4960 10330 -14738 2914 -754 -17576 -1099 25104 43612 17281 -36672 -60475 -72387
13785 -72387 -25994 -23184 5539 26341 5094 -18864 2589 43705 40475 -15291 -39700 -20046
13773 -20046 -20753 -8842 13944 92116 59322 4613 -25276 -58275 -51785 -41331 -52357 -97725
13761 -97725 -114783 -92924 -34272 27321 7755 -14073 -19178 -35492 -61922 -41556 -36198 -53174
13749e3174J1863M8775J2026j5843j0028J3913M1236o285j740j1602k7623k0797
13737a9279J4288R162N0828k1494J292j340K738K5639n0979m4714J9558L6223
13725B1922M406n6328p398N1707M7939M4624k2176l3762J3950L2082k2891m9124
13713B4951l9846n776J5651N793N424R790J683p617p472K4022N954M100L354k6406
13699A3605M6k0956K5575J0938p202j6562l349l8167j6529J3863j2653j2049M5522
13686a7918K0993j5733J3772J8776O457K7872o776l0027j522n5807l68J9268J8465
13673b548m2788j1766M3768l4230j7746N1711m572k0142J4381L3011q59J583K5123
13660C4926p518j5415K5040P845k5034k206k8485o820L0724J5200l61K0250J5226
$$ plain form
13749 -53174 -41311 7464 19490 3647 -6381 7532 48768 42483 40743 29141 1518 -19279
13737 -19279 -4991 4171 54999 33505 34797 33457 36195 61834 10855 -33859 -14301 21922
13725 21922 26328 -30000 -37398 14309 62248 106872 84696 50934 64884 96966 74075 24951
13713 24951 -14895 -20671 -5020 773 6197 15987 17670 10053 2581 26603 32557 36657 40011 13605
13699 13605 13651 -7305 18270 29208 22006 5444 2095 -36072 -52601 -38738 -51391 -63440 -17918
13686 -17918 3075 -12658 1114 19890 26347 54219 47443 17416 15894 -39913 -40281 -21013 -2548
13673 -2548 -45336 -57102 -13334 -47564 -65310 -13599 -18171 -38313 -23932 9079 8220 9803 34926
13660 34926 27408 11993 37033 44878 19844 17638 -10847 -17667 13057 28257 27896 48146 63372
13647F3372k8149n5667R238J5686k240j367o725J8269J9891j7992l6732k3893
13635d6309K4234L4884R649j3864J1689J1180n6646m8593o587M4179J5829j2825
13623c3180K035r713L5907o099N77n380L2346r156m4763k795N6329M4968N865
13610F6941k569r168J8311O102m6544j5277J201J3327k961K4761o567K588k2986
13597B7159n5191o0544L5734M2269K2228K258l9858q0091K958J8028J7669J7514
13585d9867K7926M3786L7195K1082J0494n046m99j4478L545r859m7359q742k2048
13572a3870l2464K8578l2003p124M6749J4407j2079m7917J3607j5085o6241O170
13560a17272O0271K9756L7086k3558k8936j6321K3576J0271m130K4474K1319n447
$$ plain form
13647 63372 35223 -20444 -11206 4480 2240 873 -5852 12417 32308 14316 -22416 -46309
13635 -46309 -22075 12809 22458 8594 20283 31463 -25183 -73776 -80363 -36184 -20355 -33180
13623 -33180 -31145 -40858 -4951 -11050 -10473 -15853 16493 7337 -37426 -40221 16108 61076 66941
13610 66941 64372 55204 73515 79617 33073 17796 18997 32324 29363 54124 47557 50145 27159
13597 27159 -28032 -88576 -52842 -10573 11655 13913 -25945 -106036 -103078 -85050 -67381 -49867
13585 -49867 -21941 21845 59040 80122 90616 85570 85071 70593 74138 64279 16920 8178 -13870
13572 -13870 -46334 -17756 -49759 -56883 -10134 4273 -7806 -55723 -42116 -57201 -123442 -117272
13560 -117272 -57001 -27245 9841 -13717 -42653 -58974 -35398 -25127 -29257 -4783 16536 11089
13548A1089J8175j5481j8873K0602J9221J0766k2615r389j0112l9796J7320j6377
13536c5470J7390N6423J1928k3500j0932k9533M0778K1933r34k4932m475J5243
13524C3919j0766l9505k1243J825K6913M5880L6832J560l1843j7519K4486J0849
13512F1388l2194n9141j6941L54P088j3681j2203j5113J6355L2089j2254J3898
13500c0355L7550Q659p932L631J3461k5157k7279j130m567n546K1199J9404K4599
13487B6537l8197l0262K2102K6453m0025j4797L3992L3917m1336L941Q772J3655
13475D752k3832K6194L4815J0732j2352k869q014J2704k7993M772J0319j4837
13463A4391k3432j3676M337J4544k3066l6911j6301L6456L0206J6680M8255k0376
$$ plain form
13548 11089 29264 13783 -5090 15512 34733 45499 22884 13495 3383 -36413 -19093 -35470
13536 -35470 -18080 38343 50271 26771 15839 -13694 27084 49017 48083 23151 18676 33919
13524 33919 23153 -16352 -37595 -35770 -8857 37023 73855 75415 43572 26053 50539 61388
13512 61388 29194 -29947 -46888 -46534 -39446 -53127 -65330 -80443 -64088 -31999 -44253 -30355
13500 -30355 7195 15854 7922 11553 25014 -143 -27422 -28552 -33119 -38665 -17466 1938 26537
13487 26537 -11660 -41922 -19820 6633 -33392 -48189 -14197 19720 -21616 -17675 -8903 4752
13475 4752 -19080 7114 41929 52661 40309 37440 29426 42130 14137 18909 29228 14391
13463 14391 -9041 -22717 -18380 -3836 -26902 -63813 -80114 -43658 -13452 3228 51483 31107
13451C1107m0597l6220k0154r187O8851M2497k9962J0493K8650P541j4191L4902
13439G3730J2079l9829l6967m88j9530k2561q575J3924R330L1017L3226j1897
13427C3459O481j0908J4792M66l5166l0789k7009J8750M9332k879j6988J1495
13415A1036K2469l3751j6452L0671L8640K883m0205L393L2071K9126R609l1835
13403E7655J0883k943k4209K4503k7240n1675K3262K0110K146L3683K2250j5289
13391G3136J3505p627m3283K8112r233k4542j2266m645k0398k9776K8431K6463
13379A7877J1911L2437q850k9949J4598J295m5995m0215l0508R757J0813M0164
13367a6665M2256J0106M615P777o068n8045K4635J6180L368K7193j0313l2640
$$ plain form
13451 31107 -9490 -45710 -65864 -75051 -6200 36297 6335 16828 45478 53019 38828 73730
13439 73730 85809 45980 9013 8525 -11005 -33566 -42141 -28217 -18887 12130 45356 33459
13427 33459 39940 29032 43824 44290 9124 -21665 -48674 -29924 19408 16529 -459 11036
13415 11036 33505 -246 -16698 13973 52613 55496 15291 18684 50755 79881 89490 57655
13403 57655 68538 65595 41386 65889 38649 -13026 10236 30346 32492 66175 88425 73136
13391 73136 86641 79014 35731 63843 54610 30068 17802 13157 -7241 -37017 -8586 17877
13379 17877 29788 62225 53375 23426 38024 39319 -6676 -46891 -77399 -67642 -56829 -16665
13367 -16665 25591 35697 40312 48089 42021 -16024 8611 24791 28159 55352 45039 12399
13355A2399j9297j4505L546N8089K9280n6340l1308L0222K1691J5586M2522L761
13343I5646j9127l0590k5129Q455K633l0032L3546P724p568j4575l354k2548k4500
13330b9419L7090Q948l1314m255Q4067K6652k2721k2413L012Q439k8749O77j4992
13317A5022j2146L5158L7078M316j4897K4217J0671o5728n7830q0658j9494K160
13305a22131L8216N1971K3545L4742M3200p277l4419q247L6151j6153l1058R052
13293A7592M9487M769p620l9382J5381J0601l517j0139L0259J1242n0386O182
13281C4469k208R133j4943j3403K2583k9706j0755L1863M6410K9542m0909K561
13269F4637q775j3311R080R901L6256k1521k5577k412J3342n625k1147O884J1975
$$ plain form
13355 12399 -6898 -21403 -17857 40232 69512 13172 -18136 12086 33777 49363 91885 95646
13343 95646 76519 45929 20800 29255 31888 1856 35402 43126 35558 20983 17629 -4919 -29419
13330 -29419 7671 16619 -14695 -18950 65117 91769 69048 46635 49647 58086 29337 30014 15022
13317 15022 2876 38034 75112 79428 64531 88748 99419 33691 -24139 -104797 -124291 -122131
13305 -122131 -83915 -31944 -8399 26343 69543 62266 27847 19600 55751 39598 8540 17592
13293 17592 67079 71848 64228 24846 40227 50828 47311 37172 67431 78673 28287 34469
13281 34469 32261 41394 26451 13048 35631 5925 -4830 27033 73443 102985 62076 64637
13269 64637 55862 42551 51631 61532 97788 76267 50690 48278 61620 55995 34848 41732 53707
13256E3707k6881k0576P389J3722K552j7723k5994r383q535m418m941K6888L4923
13243B0730L4310R583J5748M8321l465k4080j6375k6094lL7914L5216k1797j9223
13230I0785J3519J3082k6713j1742j1803k5320n6482j1282M7629N3420j1086j3155
13218E0852L3583M710l6493j6424k5155M5214L0462q662j6816J1892J4833K8141
13206A16137l4852k4605o7489j4132M713J4624M592P751J9821O0555L1050k5838
13194I2327m6894M340J994J8784n6539n0211R289L2300J5664J8688J2270M4403
13182I6415k6406k6556j3012k2739J086j889J1021J4221q577j2014p789J3445
13170A7206J1578n804j0460J9608K2621M7674l444k4528J3756j7010n1660J1053
$$ plain form
13256 53707 26826 6250 13639 27361 29913 12190 -13804 -23187 -31722 -36140 -41081 -14193 20730
13243 20730 55040 64623 80371 128692 125227 101147 84772 58678 58675 96589 131805 110008 90785
13230 90785 104304 117386 90673 78931 67128 41808 -14674 -25956 21673 75093 64007 50852
13218 50852 84435 89145 52652 36228 11073 56287 86749 78087 61271 73163 87996 116137
13206 116137 81285 56680 -10809 -24941 -20228 -5604 -1012 6739 26560 87115 118165 92327
13194 92327 45433 49773 51767 70551 14012 -36199 -26910 5390 21054 39742 52012 96415
13182 96415 70009 43453 30441 7702 8788 6899 17920 32141 23564 11550 3761 17206
13170 17206 28784 22980 12520 32128 54749 102423 98979 74451 88207 71197 19537 30590
13158C0590l029l0685k8712N8727J4101J279L8742j1357J3505J5514n855r781
13146H3039j0375M1178J8046O4486P8300J26394J55051K29732K97390K76323K38655
13135A598219K29827J77415J0453k23849l60990l52861k81161j21528p5678j24758
13125D75089p7477l9250m0315k7441l137m6824j4496J266l6441m3196k3741p495
13113A16542O12M2169L891m8760l7077k1500L0487L2106J1974p073Q33o008j0184
13100A08012L4443J7821J7785O889N671j0078l3240l1391k3354j4239m5774L392
13088C5937j6713J3831o364l5123K2309L153L2702K8101K5747K960L4746J8618
13076A59904K0120o2664n8899J6300O033m7562L732M0244k753K825m3205j4332
$$ plain form
13158 30590 27561 -3124 -31836 26891 40992 42271 81013 69656 83161 98675 92820 83039
13146 83039 72664 113842 131888 196374 274674 401068 556119 785851 1083241 1359564 1598219
13135 1598219 1828046 2005461 2015914 1792065 1431075 1078214 797053 675525 599847 475089
13125 475089 397612 358362 318047 290606 287469 240645 226149 227415 190974 147778 124037 116542
13113 116542 117154 159323 163214 114454 77377 55877 86364 118470 130444 123371 124204 118196 108012
13100 108012 142455 160276 178061 184950 190621 180543 147303 115912 92558 78319 32545 35937
13088 35937 19224 33055 26691 -8432 13877 17030 49732 77833 103580 106540 141286 159904
13076 159904 180024 117360 58461 74761 80794 33232 36964 77208 74455 77280 34075 19743
13064A9743J6194L632j8285k906L2168p068J7618j723m6184j4265o743j3304J507
13051a9616O685r090J0179j314J1932L8530K7558N812m02j5692j4319Q008Q764
13038E7035k5434q990k659n064K4430n451J2275M4345j0611K446J0087j9824K0271
13025I2856L1087o6781l6809j7496o141j2713o707K0577j2658J0358K1094k3881
13013g214k4962l2444J0115L4963O547J1356O8899l503N021j9034k0811J6110
13001D5043r210O5394K7190k9372N5244j4314m9333k5820k95j7198K1130M2813
12989A11272l097l8014P917J9413J5193M6032k3166m9476J987J970L4368k4371
12977A00028l1102o2109Q86M1400Q734J0182n7925o6749n234K5239J513J0525
$$ plain form
13064 19743 35937 39569 21284 18378 50546 43478 61096 59373 13189 -1076 -7819 -21123 -19616
13051 -19616 -12931 -22021 -11842 -13156 -1224 37306 64864 70676 70274 54582 40263 48271 57035
13038 57035 31601 22611 19952 14888 39318 33867 46142 90487 79876 82322 92409 72585 92856
13025 92856 123943 57162 20353 2857 -3284 -15997 -22704 -2127 -14785 -4427 16667 -7214
13013 -7214 -32176 -64620 -54505 -19542 -12995 -1639 67260 63757 68778 49744 28933 45043
13001 45043 35833 101227 128417 99045 154289 139975 90642 64822 64527 47329 68459 111272
12989 111272 108175 70161 78078 97491 112684 158716 135550 86074 88061 90031 124399 100028
12977 100028 68926 6817 7703 49103 57837 68019 10094 -56655 -61889 -36650 -35137 -24612
12965b4612J7815L5854L4315J9097L3156O2533K6815L0568k1278m1773q301M1795
12953B05984M8628K1734j175k6596m4090p6079j1134J7871J3045k2783p3754o1653
12941a0002L1460M7138L7384K0437L0620p679K43j9271m6367j1407k5880J4517
12929F1193k686J8992L5465L3637J0427k8918n1120l660n150j3667l269j4211
12917C7033N111l6893l9690L623K469K7513l08Q076L7658L9824j4949j609k4050
12904D3808L1356j8232j3712J6772K8629l6662M667K1728l938m1770M804N80k260
12891C5770k5054l7228l9717L251L6836K5553J5477M3297M2127o81o2420k910
12879C4301j4033J6893l3206l2697m070O283J0522K3831K6322L2071J1520l2281
$$ plain form
12965 -24612 -6797 29057 63372 82469 115625 178158 204973 235541 214263 172490 164189 205984
12953 205984 254612 276346 275171 248575 204485 128406 117272 135143 148188 125405 51651 -10002
12941 -10002 21458 68596 105980 126417 157037 149358 149601 130330 83963 72556 46676 61193
12929 61193 58507 77499 112964 146601 157028 128110 76990 73330 68180 54513 51244 37033
12917 37033 42144 5251 -34439 -30816 -28347 -834 -1142 6934 44592 84416 69467 67858 43808
12904 43808 75164 56932 43220 59992 88621 51959 56626 78354 74416 32646 37450 38030 35770
12891 35770 10716 -26512 -66229 -62978 -26142 -589 14888 58185 100312 99631 37211 34301
12879 34301 20268 37161 3955 -28742 -32812 -26529 -16007 7824 34146 66217 77737 45456
12867D5456j3434K907L8095L2628K5540K5846N8394R883n333j2109L2269K4824
12855B64966m3284l9814J8066k6109k6285k5144N374M2852l9244J5174K4530K0729
12843A91811j2297l6656M1685K7534j5932n972k5023L390j4277L8997K4437L7910
12831B55607K0373M8949O6562M5378J03397Q5519N4216M390J7760J6212K3870
12820G42233J7385m8936l6275m1436p2199m6813m0466l7996j0195l4346n431J2250
12808C97775K273l7811k8140K1186P971j1502L8601M9177k6129J7691K8249k5179
12796D34162k5977k7101L003K4148O4339O1703j9446L0471K6031j3215q7258l9418
12784D31442k7734K1116K8275j4151j3572j285M704L0668L9321K6383K7984R124
$$ plain form
12867 45456 32022 34929 73024 105652 131192 157038 215432 225315 219982 207873 240142 264966
12855 264966 221682 181868 199934 173825 147540 122396 127770 170622 131378 146552 171082 191811
12843 191811 179514 142858 184543 212077 196145 190173 165150 168540 154263 193260 217697 255607
12831 255607 275980 324929 391491 436869 540266 625785 680001 684391 702151 718363 742233
12820 742233 759618 710682 674407 632971 560772 513959 473493 435497 425302 390956 385525 397775
12808 397775 400048 362237 334097 355283 363254 351752 390353 439530 413401 431092 459341 434162
12796 434162 408185 381084 384087 408235 472574 534277 514831 545302 571333 558118 470860 431442
12784 431442 403708 424824 453099 438948 425376 424091 428795 459463 498784 525167 553151 562275
12772E62275O42j4413l2136j9144k4239j4234M0235M7127j657Q480M3005K8428
12760F24369N6379L2137J4906M2801M6094J2895J5379L3047J4538l949M32K2312
12748I11340J3611K2332L9106M6866N002J5558J6778M8861O4053M5327P4077L5696
12736A338607P5354J47924J55240J65232K54734K91552L17994L21352L09017L34636
12726C711642L07368K93851K16396K05451K87725L30303L82522M40877M69295
12717F645430N42633P81751J048191J428720J808705K230495K836197L468226
12709B0790348M240007N419576P290547J0708794J6791057K7012686M1051780
12702A33304795N4259873N8904449N4362140M7235072M0435675K2463330j7856535
$$ plain form
12772 562275 562917 548504 516368 497224 472985 458751 498986 546113 544456 552936 595941 624369
12760 624369 680748 712885 727791 770592 816686 829581 844960 878007 892545 888596 889028 911340
12748 911340 924951 947283 986389 1033255 1038257 1053815 1070593 1119454 1183507 1228834 1302911 1338607
12736 1338607 1413961 1561885 1717125 1882357 2137091 2428643 2746637 3067989 3377006 3711642
12726 3711642 4019010 4312861 4529257 4734708 5022433 5352736 5735258 6176135 6645430
12717 6645430 7188063 7969814 9018005 10446725 12255430 14485925 17322122 20790348
12709 20790348 25030355 30449931 37740478 48449272 65240329 92253015 133304795
12702 133304795 187564668 246469117 300831257 348066329 388502004 410965334 393108799
12695C93108799o0119149p9770876o7378695m2683381k6181789j8156840j3917255
12688H4900814j0973503q761493p254025o194080n226171m255520l431525k848415
12680C5956082k410715k051505j777841j482661j213300r89874q12773o41068
12672B4576345o30095n35961n42571o07913o46739o51083o68038p10336p23183
12663A8860426o69883n75274n06395n39867n74345n96553o07765n84535n30259
12654A3675550m86482m41296m38499l91370l66323l12438k73847l42812k94161
12645A0328322k86078l15175l27586k96940k75265k31618j95329j61759j47938
12636H090634j75222j44339j62785j44708j74787j78241j45773j86542k01306
$$ plain form
12695 393108799 332989650 253218774 185840079 143156698 116974909 98818069 84900814
12688 84900814 73927311 65165818 57911793 51717713 46491542 42236022 38804497 35956082
12680 35956082 33545367 31493862 29716021 28233360 27020060 26030186 25217413 24576345
12672 24576345 23946250 23410289 22867718 22259805 21613066 20961983 20293945 19583609 18860426
12663 18860426 18190543 17615269 17108874 16569007 15994662 15398109 14790344 14205809 13675550
12654 13675550 13189068 12747772 12309273 11917903 11551580 11239142 10965295 10622483 10328322
12645 10328322 10042244 9727069 9399483 9102543 8827278 8595660 8400331 8238572 8090634
12636 8090634 7915412 7771073 7608288 7463580 7288793 7110552 6964779 6778237 6576931
12627F576931j48790j67052j82326j38505j01902q8503j25661j57559k3140m5716
12617E397777j01001j66782j62904j02558j02786j14329j11779j22919j85116
12608D227603j47825j07032r3995p3020m9424n4126n3541m7005n3306n6103j893
12597C490333L4971j1390K8582R7969J62771J48906J62301J63564J04787K4144
12587D406938j40058k81225l46904k79016j87964j90864j93067r3354l3474n1222
12577B609790n7066p8628m2641r787j01606j02504O400N2903R2361J22401J47206
12566B638829J02885J33754J00932l1528j48427k52038k65963k37272j60433o2063
12556A818676k2805n6842p0734q1440p2203n8694m2606k8041j3472j7245n8085
$$ plain form
12627 6576931 6428141 6261089 6078763 5940258 5838356 5749853 5624192 5466633 5443493 5397777
12617 5397777 5296776 5129994 4967090 4864532 4761746 4647417 4535638 4412719 4227603
12608 4227603 4079778 3972746 3878751 3805731 3756307 3702181 3648640 3601635 3548329 3492226 3490333
12597 3490333 3525304 3513914 3542496 3640465 3803236 3952142 4114443 4278007 4382794 4406938
12587 4406938 4266880 3985655 3638751 3359735 3171771 2980907 2787840 2694486 2661012 2609790
12577 2609790 2552724 2474096 2431455 2421668 2320062 2217558 2223958 2276861 2369222 2491623 2638829
12566 2638829 2741714 2875468 2976400 2944872 2796445 2544407 2278444 2041172 1880739 1818676
12556 1818676 1795871 1739029 1668295 1586855 1514652 1455958 1413352 1385311 1371839 1354594 1296509
12545A296509p3006j6591L1922J1822l3481l1453N576l4147k4720l0525j417j2028
12533A088461k7357l0326J658L299j3767J0955K5079O0786j3858m2951j3795o732
12521A041452n8369j4008j0390l7365m5846l7312K010J085j049m5373j9056J4362
12509G90141L4267J9754m177M1863o7593j1757J3072q1287r1179m3778j4957P579
12497E91948l6663N2801K8204m3124n4409j6029k5300j7590l3802N117K6532m8030
12485D29655k520n401P68j695O122L977N3855J8276M5L5402k2618l8006n3205
12472D24655J745K1313J4606j4211k1301o5654o8398K2030L8770L617l1443l1086
12460B94643N915k2089L802N9262J2283m011q066o662m8864k2959O053j910k1921
$$ plain form
12545 1296509 1223503 1206912 1238834 1250656 1217175 1185722 1191298 1157151 1132431 1101906 1100489 1088461
12533 1088461 1061104 1030778 1032436 1035735 1021968 1032923 1058002 1118788 1104930 1061979 1048184 1041452
12521 1041452 983083 969075 958685 921320 875474 838162 840172 841257 840208 794835 775779 790141
12509 790141 824408 844162 839985 881848 814255 802498 815570 734283 643104 599326 584369 591948
12497 591948 555285 608086 636290 593166 538757 522728 497428 479838 446036 451153 477685 429655
12485 429655 427135 421734 422502 420807 426929 430906 484761 503037 503082 538484 515866 477860 424655
12472 424655 426400 447713 462319 448108 426807 361153 292755 314785 353555 357172 325729 294643
12460 294643 300558 278469 282271 341533 353816 349805 341739 335077 286213 263254 269307 267397 245476
12447B45476N717j2891n726J9436k7362n7333k6525K059j2463j735J9715n160
12435A43208J4542j1875k7723Q325J3889J4803M3342j6156m7937q894j6122l7459
12423G1943L615J7403J7477O797L849K7593q970k6506k3208M9127R10j7973l041
12410A19016J714k3373j2035m527K8033K0718J7978j6074J4395R026k0831m1869
12398I2171l1684L0807L5860M216L0274k051m0631m8368l5710R644L6424N0544
12386A31496K6918J1993l3085k3072J2077p143J8574n457j6051j6013K4341j888
12374A22690o1279n725R767m935L9545j535M389L7660n781m315L0150j471j7869
12361A41291j6457l065l6014j5563Q503R304O827k186p975p760L2218j2205j148
$$ plain form
12447 245476 251193 238302 232576 252012 224650 167317 140792 142851 130388 128653 148368 143208
12435 143208 157750 145875 118152 126477 140366 155169 198511 182355 134418 125524 109402 71943
12423 71943 75558 92961 110438 117235 121084 148677 139707 113201 89993 139120 140030 122057 119016
12410 119016 120730 97357 85322 80795 108828 129546 147524 131450 145845 154871 134040 92171
12398 92171 60487 91294 127154 131370 161644 159593 118962 70594 34884 44528 80952 131496
12386 131496 158414 170407 137322 114250 126327 119184 137758 132301 116250 100237 124578 122690
12374 122690 61411 55686 65453 60518 100063 98528 102917 140577 134796 130481 160631 159160 141291
12361 141291 124834 121769 85755 70192 78695 87999 94826 92640 84665 76905 109123 96918 95770
12348I5770L7734j3592M476K4348l816m9013J553J4963o655m1381N733J840n3585
12335A8375j325J8396M5386J0507K2329k2426l741R601J5087j7899K008k8674
12323F7624l5248j1976m6669J2399N5499K3981q696K2162l0093m8073J4480R454
12311B4844l5626l1413O432j3624J9160O9480J3854J5505j2952J3166k993k6826
12299C9007Q52J8221L0888k5404l6757p892j0430K4725O151Q789l6056k2786J1628
12286I36K5842o580J3042k7588k6083M5011K6293M7560J9615j1620J2398j0222
12274A08604L602j3275k6148j2019n40M3074P232n917j4732P2672M5243L2192
12262B39988R8940J69301K04807K38301K72055K44548K33070J96511J28582l5532
$$ plain form
12348 95770 133504 119912 124388 148736 144920 95907 97460 112423 105768 64387 70120 71960 18375
12335 18375 17050 35446 80832 91339 113668 91242 87501 97102 112189 94290 96298 67624
12323 67624 32376 20400 -26269 -13870 41629 65610 56914 79076 48983 910 15390 24844
12311 24844 -10782 -42195 -35763 -49387 -30227 39253 53107 68612 55660 68826 65833 39007
12299 39007 39859 58080 88968 63564 26807 18915 8485 33210 39361 48150 12094 -10692 936
12286 936 26778 20198 33240 5652 -20431 24580 50873 98433 118048 106428 118826 108604
12274 108604 112206 98931 72783 60764 60224 103298 110530 104613 89881 162553 207796 239988
12262 239988 338928 508229 713036 951337 1223392 1467940 1701010 1897521 2026103 1990571
12252A990571k21973l89049l75216k28312j65914r1707q3205k6882k2236l1872
12242C54205n4749k6286P474q989l6653k7296j8871Q532q882l7874m387j4461
12230A31763k7825O248k3259n792J1219j2157k4287K4444K0952N095k5218M463
12218H5646j690J2073J673l8437R405L0401q571M515K2293L75J7504K2542p3712
12205H4017p9386J3429N7231l4488l1612L4942L4318L9475l4098k2640j1562j3283
12193C6343M740m2690l0467K80J7954k1758o076M0049P9202L709o0369l0776O4731
12180E4872K9061J5299j6535j6276J1663K1480O923j4890K113K928O499l8962
12168F4175l009n352j2326j778K2795j8j0668q827p619j0112K182K9597M0143
$$ plain form
12252 1990571 1768598 1379549 1004333 776021 610107 518400 435195 408313 386077 354205
12242 354205 299456 273170 280644 271655 235002 207706 188835 197367 188485 150611 146224 131763
12230 131763 103938 110186 86927 81135 92354 80197 55910 80354 101306 106401 81183 85646
12218 85646 83956 96029 97702 59265 68670 99071 90500 95015 117308 117683 135187 157729 84017
12205 84017 4631 18060 75291 40803 9191 44133 78451 117926 83828 61188 49626 36343
12193 36343 41083 -1607 -32074 -31794 -13840 -35598 -41674 -1625 77577 81286 20917 -9859 54872
12180 54872 83933 99232 82697 66421 78084 99564 106487 91597 93710 96638 103137 64175
12168 64175 61166 55814 43488 41710 64505 64487 53819 44992 37373 27261 29443 59040 99183
12155I9183L808n6444l8957N3533K2141p022N6110K8538k0695j9759q873k1545
12143I0018Q074l1557J8139L2066j2554j880n4772l2499M714j2660M5558J9902
12131G2549j0136n4606J2813J0522k6876k2354L0628R820j8690j1829P034j8701
12119a9826K5410J3461K070J5729K6350N8771K6113j6107j2814m6444r714m782
12107E8217N084p566o2087k4868j6125O2075J1099j1755J007O945J7298J0429
12095D9753j6082k2175j8708J6701M2372M690l5475R660l4955l948J2248j0883
12083f802k2367k7238K7368N0707L8237L979j2128m4329j5137m7196K187K2961
12071b9758J3901K8431L3186j1044m2871j3868j7932j3826K7488K4006j3067K1643
$$ plain form
12155 99183 102991 46547 7590 61123 83264 76242 132352 160890 140195 120436 111563 90018
12143 90018 98092 66535 84674 116740 104186 102306 47534 15035 19749 7089 52647 72549
12131 72549 62413 7807 20620 31142 4266 -18088 12540 22360 3670 -8159 -1125 -19826
12119 -19826 5584 19045 21115 36844 63194 121965 148078 131971 119157 72713 62999 58217
12107 58217 63301 55735 -6352 -31220 -47345 14730 25829 14074 15081 22026 39324 49753
12095 49753 33671 11496 -7212 9489 51861 56551 21076 30736 -4219 -8167 4081 -6802
12083 -6802 -29169 -56407 -29039 21668 59905 63884 51756 7427 -7710 -54906 -52719 -29758
12071 -29758 -15857 12574 45760 34716 -8155 -22023 -39955 -53781 -26293 -2287 -15354 6289
12059F289R647k6445p846O3633R427J1554L7648k4863j8860o6834r220P319j1516
12046b0067k0905l0175K8349K5874J9067L063l453J1003j7436m320l1894r878
12034e0772K7228K0040J4275j1053L568j9081j228N280K3198j1036K6267J7178
12022D3864j6059k4682J49K8530L6368K471M896O493N0057P8636K7460J4364N9762
12009C12309j8326j9453j8301m8759m5019q208m1853p3869j8784M0237K0959p168
11997G3765k9627L747J2775j794n5680n0404J9623K9278J0684N974o122k0421
11985h202J6847J3686K0559J8009l9086j4333J3568L9553J5530J1894K2302J1191
11973A21518j5101L6843N1279L8916O3519J00824K8792o074K3642l3453n9425
$$ plain form
12059 6289 15936 -10509 -18355 45278 54705 66259 103907 79044 60184 -6650 -15870 -8551 -20067
12046 -20067 -40972 -71147 -42798 -16924 2143 5206 1753 12756 -4680 -9000 -40894 -50772
12034 -50772 -23544 -3504 10771 -282 3286 -15795 -17023 -11743 11455 419 26686 43864
12022 43864 27805 3123 3272 31802 68170 70641 75537 82030 132087 210723 238183 252547 312309
12009 312309 293983 274530 256229 207470 162451 154243 112390 38521 19737 59974 80933 73765
11997 73765 44138 47885 60660 58866 3186 -47218 -27595 1683 12367 18341 12219 -8202
11985 -8202 8645 22331 42890 60899 21813 7480 21048 60601 76131 88025 110327 121518
11973 121518 106417 143260 194539 233455 296974 397798 426590 420516 444158 410705 351280
11962C51280l1342r422k2261j2158o5053m3847m0357K023M1728m2759j8363m1593
11950F7876k4589J0133k0188k4491J24J5535j751l5751Q381J3331N6656L5761
11938A01027j2453k4784j9182K1782P3756J4273j2502l6679l8538n247j3536K4528
11926G2445M6478Q0126K5904O525L2433N1800j6725q732J8986n5645n6146p3437
11914A24012k6061o692j2318L1772P472k2816l9245j8717K5412n794k8297k2675
11902F053P394L0114L1730o807R752j2163j7120l4157o219J9285k8598J1205J1121
11889B1590K4133l6128n7612j643L8558J8576K7024L8397L0077j947n7251k9931
11877A3843Q075k112j9559J9262N431L593j3016k2264J2925R572l0552J3364J7628
$$ plain form
11962 351280 319938 310516 288255 276097 211044 167197 126840 128863 170591 127832 109469 67876
11950 67876 43287 53420 33232 8741 8865 24400 22649 -13102 -4721 8610 65266 101027
11938 101027 88574 63790 44608 66390 140146 154419 141917 105238 66700 61453 47917 72445
11926 72445 118923 199049 224953 231478 263911 315711 298986 290254 309240 253595 197449 124012
11914 124012 97951 91259 78941 110713 118185 95369 56124 37407 62819 57025 28728 6053
11902 6053 13447 43561 75291 68484 78236 66073 48953 14796 8577 27862 -736 10469 21590
11889 21590 45723 9595 -48017 -49660 -11102 7474 34498 72895 102972 101025 43774 13843
11877 13843 21918 19806 247 19509 24940 28533 15517 -6747 6178 15750 -14802 -1438 16190
11864A6190K1853J4370j3563k8249L7125k4142j9797j1597j8156n679J6171j8568
11852c4042l8807J0363K5605K6844O306J6275J5200R132J151J2719o426n6228
11840a1908j9935L6183M5855k8976k3876O579q580J1511M8164J0620m4751k4378
11828c492J1258L082L183J9488K1882L879j7261k4385l2953l8433J4857J1259
11816b7636N471J6236K5289J4867J8792j5036k6132k998n412L3467J2393j6018
11804C3283m5608j1870q370j1871K8875j3168j1364Q904Q573J7287k3298m0808
11792f9435l2781K5714Q8401j4192k6449K5141j8361L9191J7517n218K5679J0678
11780F5885l4582J9659M14R839l602k2276m7164n2530k5677J5022j7129J5877
$$ plain form
11864 16190 38043 52413 38850 10601 47726 23584 3787 -7810 -25966 -31645 -15474 -34042
11852 -34042 -72849 -62486 -36881 -10037 -3731 12544 27744 36876 38027 50746 44320 -11908
11840 -11908 -31843 4340 50195 21219 -2657 3922 -4658 6853 55017 65637 20886 -3492
11828 -3492 7766 10848 14031 33519 55401 59280 42019 17634 -15319 -53752 -38895 -27636
11816 -27636 -22165 -5929 19360 34227 53019 37983 11851 8853 3441 36908 49301 33283
11804 33283 -12325 -24195 -32565 -44436 -15561 -28729 -40093 -31189 -22616 -5329 -28627 -69435
11792 -69435 -102216 -76502 11899 -2293 -28742 -3601 -21962 17229 34746 29528 55207 65885
11780 65885 31303 50962 51376 61215 57613 35337 -11827 -64357 -90034 -75012 -92141 -76264
11768g6264J0834M877J1719j558l6370L8593L455j9748O385K8423K5272m1100
11756d5482M537j1400K4003j2585P547J8548m687K2730N1267J4898p9686j7027
11744b7337M9418l0308l7275p68M8093J4811K9037j6425O622J1053n4458l6869
11732d4406J4930K8861J9692l1438m093j4907j1103K1253p103P211L5307J5073
11720B9277O453k2115k8017K1990j566K3121R606m0317m8653J1824J4725l4499
11708e8171L3111K5751K6605j4453j651r861l2678m136J4794Q043M8398J7642
11696E3394m1347j3146J4719J916l971n325N56j4558k0120p669j9061o962K0371
11683d1203k597J5886j7394J6861R723l1959l2779j0873J7744M9834M013j8675
$$ plain form
11768 -76264 -65430 -60553 -48834 -50392 -86762 -48169 -44714 -64462 -58077 -29654 -4382 -45482
11756 -45482 -40945 -52345 -28342 -40927 -33380 -14832 -19519 3211 54478 69376 -10310 -27337
11744 -27337 22081 -8227 -45502 -46270 1823 16634 45671 29246 35868 46921 -7537 -44406
11732 -44406 -29476 -615 19077 -12361 -16454 -31361 -42464 -21211 -28314 -21103 14204 29277
11720 29277 35730 13615 -14402 7588 6022 29143 38749 -1568 -50221 -38397 -23672 -58171
11708 -58171 -25060 691 27296 12843 11192 1331 -31347 -35483 -20689 -12646 35752 53394
11696 53394 12047 -1099 13620 15536 11565 6240 6796 -7762 -27882 -35551 -54612 -61574 -41203
11683 -41203 -43800 -27914 -45308 -28447 -18724 -50683 -83462 -94335 -76591 -26757 -22744 -41419
11671d1419k7956L8871M696K0977k6676J5502J1949m8557j8231M3877N6847K0565
11659E0445m6359l8948N0456j9204k0509L043j5433j8305J9996N3244J8634k7034
11647A0026M084J2396l7719p44J222l5090m374n293M6615K1254p9370k7811N9313
11634c5491N5352k3076l2396M685l0942j252J5870M1777J7008J5964J0437k8414
11622I522J2452O358P689j827k9737j1863j1364r263K2876j2927k0242K0020J9717
11609A411l705r492j6769k0220J5439k7517K709j9890R572N7110O1127N990k3449
11596C2316o6195j1758M0462J6660k8931o613p226L175K6137K6936M540m6200
11584a6697k1643J5755J3412j7323l1544m980J2345J8351j629J413J4837L1528
$$ plain form
11671 -41419 -69375 -30504 -25808 -4831 -31507 -16005 -4056 -52613 -70844 -26967 29880 50445
11659 50445 4086 -34862 15594 -3610 -24119 -21076 -36509 -54814 -34818 18426 37060 10026
11647 10026 14110 26506 -11213 -11957 -10735 -45825 -50199 -55492 -8877 12377 -66993 -94804 -35491
11634 -35491 19861 -3215 -35611 -30926 -61868 -63120 -47250 -5473 11535 27499 37936 9522
11622 9522 21974 28332 36021 34194 4457 -7406 -18770 -28033 -5157 -18084 -38326 -18306 1411
11609 1411 -2294 -11786 -28555 -48775 -33336 -60853 -58144 -78034 -68462 -11352 49775 55765 32316
11596 32316 -33879 -45637 -5175 11485 -17446 -24059 -31285 -28110 -1973 24963 29503 -16697
11584 -16697 -38340 -22585 -9173 -26496 -58040 -63020 -50675 -32324 -33953 -32540 -17703 13825
11572A3825L6122R061l2188k6553J9705j5588k2298j3785m957L6532L6578k0211
11560A6243k8819j4464J9796J5743l2821j2985o815K9395M4413J1726l0875l947
11548F590J170J4406n391k4331k2210O723J8873J9741J522k9831j2095m642p190
11535c6665l581K4024K9530O004k6809J7866J1007j5862P017l599j1715J3421
11523A0638m4893l6435L5866N9598j6438l7199J8468J9931K1420l154L0333j6644
11511D1491n9801Q425L5867j5115k891K5715N644j8290l4503m5380N1987L2387
11499B5536n0294k2369L9703N047J557k0211p133k9656J6195n778Q98J6163J1694
11486a8648J6081k9335J0042M811J1329k4660n431K9751P641m4100l7627J7037
$$ plain form
11572 13825 49947 59008 26820 267 19972 4384 -17914 -31699 -36656 -124 36454 16243
11560 16243 -12576 -27040 -7244 8499 -24322 -37307 -44122 -14727 29686 41412 10537 6590
11548 6590 7760 22166 16775 -7556 -29766 -23043 -4170 15571 17093 -12738 -24833 -29475 -36665
11535 -36665 -40246 -16222 13308 19312 -7497 10369 21376 5514 12531 8932 -2783 10638
11523 10638 -34255 -70690 -34824 24774 8336 -28863 -10395 9536 30956 27802 58135 41491
11511 41491 -18310 -9885 25982 10867 7976 33691 39335 21045 -13458 -58838 -6851 25536
11499 25536 -24758 -47127 -7424 -2377 -820 -21031 -28164 -57820 -41625 -47403 -46505 -30342 -18648
11486 -18648 -2567 -31902 -21860 -17049 -5720 -30380 -35811 -6060 1581 -42519 -80146 -63109
11474f3109P1455J529k8658M79j6930J4J2979j3709J4773L4340K2513k9093l6786
11461c0203K2457j837r149n3585K2121J0955l5214k6560L4903P5842M1959K1431
11449G3120J6102k5290k3782j4083k4589K859k7577m571N8045j8895m5332n187
11437c9180J2253n4499k3369K3647N0177K2773L7346k3934l1021k2031l4265R351
11425g2752M1608O447J9496N906j3077n2494n0603P756L4530M4821J7362l2992
11413d3992K6636j9913r46J3606L8673j5941m3003k810L7844K6295m7386o4737
11401i5674J4791J0218k0588L4804J8555l3696n973N1326M8861j0728j7213l971
11389i288j4929k1780M674l2543J7376J4139K0576J4295o699k2912J5344j160
$$ plain form
11474 -63109 8346 9875 -18783 -18304 -35234 -35220 -22241 -35950 -21177 13163 35676 6583 -30203
11461 -30203 -7746 -9583 -18732 -72317 -50196 -39241 -74455 -101015 -66112 9730 51689 73120
11449 73120 89222 63932 40150 26067 1478 4337 -23240 -27811 30234 11339 -33993 -39180
11437 -39180 -26927 -81426 -104795 -81148 -30971 -8198 29148 5214 -25807 -47838 -82103 -72752
11425 -72752 -31144 -24697 -5201 705 -12372 -64866 -115469 -107713 -73183 -28362 -11000 -43992
11413 -43992 -17356 -37269 -38215 -24609 14064 -1877 -44880 -47690 -9846 16449 -30937 -95674
11401 -95674 -80883 -70665 -91253 -56449 -37894 -71590 -77563 -26237 22624 11896 -5317 -9288
11389 -9288 -24217 -45997 -41323 -73866 -56490 -42351 -21775 -7480 -14179 -37091 -21747 -22907
11377b2907J3338l2328k6992J0980Q905M0713m1500k6007K9443N7795L7732J0824
11365E9996n8645l5262o026l1718J2328K6294j0629q066O412r166o554j1096L4486
11352c7646L3911P174l4934J7243M607l6975L484O9046L5892M467m7185j9824
11340g40j820J7088J3099J3525j9356j9357J1667M55j4478J1990N1001l139q938
11327E0997J087l7248j1334o98l6122q214j9037L3902l140J1890L0954K7012m0500
11314d51j9931m3011o5k7423m3263L7907R0474P72j4079K6472r312K6790m575
11301B0305n6230M9200K6090k7733m5503L4687N0749J828J8734J6254L5007O003
11289A29391n0936n4415k4273k9850k4055L0218K7593k4010n0130J6826K8229
$$ plain form
11377 -22907 -9569 -41897 -68889 -57909 -49004 -8291 -49791 -75798 -46355 11440 49172 59996
11365 59996 1351 -33911 -39937 -71655 -59327 -33033 -43662 -51728 -45316 -54482 -61036 -72132 -37646
11352 -37646 -3735 3439 -31495 -14252 -9645 -46620 -43136 25910 61802 66269 19084 -740
11340 -740 -2560 14528 27627 41152 21796 2439 14106 14561 83 12073 63074 59935 50997
11327 50997 52084 14836 3502 2804 -33318 -41532 -60569 -26667 -29807 -17917 13037 40049 -451
11314 -451 -20382 -63393 -63458 -90881 -134144 -96237 -5763 -4991 -19070 7402 -1910 24880 20305
11301 20305 -35925 13275 39365 11632 -33871 816 51565 53393 72127 88381 123388 129391
11289 129391 78455 24040 -233 -30083 -54138 -23920 3673 -20337 -70467 -53641 -25412
11278b5412N984j4054Q41R55k902L5404O582l4878j2233M189J0717J7868K0162
11265A3223n1067l2517k948L9246J8484l689j5571J2511m745K1695K5566k4744
11253d556l600K6916k8472k2236J8812M9876J8731j3415k0921q087J1564o975
11241A7637k945O975Q083K8188o653m4300k8987L0314r397n64J9371j9117k6228
11228b7623m0409K2262K6034K8285M958L2654J346j8453m337n966o323L0119o246
11215C6301K608m6633l7010m300J9271N1888N3880p338j0895n6534o2767M246
11203e7283P3066L9537l9376j1325J8327j2088r100J0080J2675o501k4785o4904
11191g1677J9478M9369P812k0791q80J133J9340q666L0911L3979l5728l5578m295
$$ plain form
11278 -25412 -19428 -33482 -32641 -31686 -34588 816 7398 -27480 -39713 -35524 -24807 -6939 13223
11265 13223 -37844 -70361 -73309 -34063 -15579 -19268 -34839 -22328 -27073 -5378 20188 -4556
11253 -4556 -8156 18760 -9712 -31948 -13136 36740 55471 42056 21135 13048 24612 17637
11241 17637 14692 21667 29750 57938 51285 6985 -22002 8312 -1085 -1649 17722 -1395 -27623
11228 -27623 -68032 -45770 -19736 8549 13507 46161 47507 29054 24717 18751 12428 42547 36301
11215 36301 38909 -7724 -44734 -49034 -29763 22125 76005 68667 57772 1238 -61529 -57283
11203 -57283 15783 55320 15944 4619 22946 10858 1758 11838 24513 18012 -6773 -71677
11191 -71677 -52199 -2830 4982 -15809 -16689 -15556 3784 -4882 26029 60008 24280 -11298 -15593
11178a5593n588l6607J7830K4557J290K5657m243P843j3697O668J1533j6801j4461
11165a1612K9324l4368m7573j7443M5530O2967k6911m5282K9711J7472k9946R770
11153a8361N5257m6909o9723K049j4358J2979k612M7467N6081M496R771l524J382
11140C3995l2653K3649J4592l521m144K4041K5960n091j2494M4424J8049J5969
11128A42776L8186L2330R9284J00258J28716J52193J62900J49298Q0467K5441
11118A111849L2404N2127N8067l7059j13688j34192j34245j08642j06311j43095
11108D77215j13485l7316n4075p2545j2281n512j289j2367J1366k1456P373N364
11096A70992l9705m5201K1178J5770l774l070R429J273J6614L4252m2168m2996
$$ plain form
11178 -15593 -21181 -57788 -39958 -15401 -14111 11546 7303 15146 1449 8117 19650 2849 -11612
11165 -11612 17712 -16656 -64229 -81672 -36142 26825 -86 -45368 -15657 1815 -28131 -18361
11153 -18361 36896 -10013 -79736 -77687 -92045 -79066 -81678 -34211 21870 26366 36137 32613 33995
11140 33995 1342 24991 39583 36062 31918 55959 81919 76828 64334 108758 126807 142776
11128 142776 180962 213292 312576 412834 541550 693743 856643 1005941 1086408 1111849
11118 1111849 1144253 1196380 1254447 1217388 1103700 969508 835263 726621 620310 477215
11108 477215 363730 326414 272339 199794 187513 182001 180712 168345 179711 158255 165628 170992
11096 170992 131287 86086 107264 123034 119260 116190 125619 126892 143506 177758 135590 92594
11084I2594l8523R712k3159l482J1944m5156J9510J8738K1297k5230K073k3583
11072A6735m2899J1589K8366J0199L6505R661j8932j6146j6047J9576L561l5187
11060F981j1524l2585j5179o306J01345M6905j1704Q066l081l6402k2531j6154
11048G831O780l1329j7372m2183j02J7781K5192J6144K2922K2168K3188J3102
11036F4122p602L684J5026k9278l9104J9651L343K1377K5661j2644m9493M9186
11024F3929p203j2988Q679j1020Q508k9226R662K8599J4662l266r050j2072L0931
11011H0145J1601j4354j2854j6700k3596l1207j5560r683J7875K1250k2073j1725
10999b6881k9402j8782p591N2153O1304Q311K6677K7035j4976o0091M5K0863l4095
$$ plain form
11084 92594 54071 63783 40624 37142 49086 3930 23440 42178 63475 38245 40318 16735
11072 16735 -26164 -14575 13791 23990 60495 70156 51224 35078 19031 38607 42168 6981
11060 6981 -4543 -37128 -52307 -58613 42732 89637 77933 85999 82918 46516 23985 7831
11048 7831 14611 -16718 -34090 -76273 -76375 -58594 -33402 -17258 5664 27832 51020 64122
11036 64122 56520 60204 75230 45952 6848 26499 29842 51219 76880 64236 14743 63929
11024 63929 56726 43738 52417 41397 49905 20679 30341 58940 73602 70336 61286 49214 80145
11011 80145 91746 77392 64538 47838 24242 -6965 -22525 -32208 -14333 6917 -15156 -26881
10999 -26881 -56283 -75065 -82656 -30503 30801 39112 65789 92824 77848 17757 17802 38665 4570
10986D570j2415J3317j3459J1613K4535q277J0361j7530j9492j075K7247k2455
10974c060q078j1788O5153J873Q79m1900n285o601J3040K8566j9301k83P424K094
10960B2733K3193j2721j2471k5606l023m845K4999R294j2567R131L4923J8831
10948G1871l0246l0809P261j2349k3139l323J6742j8174J1466J9049J0811j6922
10936B238J9503k412n6770k6104K6511R085N483L7131K4728L383K823N769j2983
10923C8385k2370l0747k1866j665j1867M5913J0399J4901j2772K474R498m969
10911A5314R685L5763J7138l7406m8859k0057k0462Q855J6038j2919j7293k3091
10899g7294K307j8745o360M2949p157L1075j8474l6924j048J3624K2716L3566
$$ plain form
10986 4570 -7845 5472 -7987 3626 28161 19884 30245 12715 -6777 -7852 19395 -3060
10974 -3060 -11138 -22926 42227 44100 44979 3079 -2206 -8807 4233 32799 13498 13215 20639 22733
10960 22733 45926 33205 20734 -4872 -7895 -12740 12259 21553 8986 18117 53040 71871
10948 71871 41625 10816 18077 5728 -17411 -20734 -3992 -22166 -10700 8349 19160 2238
10936 2238 21741 19329 -37441 -63545 -37034 -27949 -22466 14665 39393 42776 45599 51368 38385
10923 38385 16015 -14732 -36598 -38263 -50130 -4217 6182 21083 8311 10785 20283 15314
10911 15314 24999 60762 77900 40494 -8365 -28422 -48884 -40029 -23991 -36910 -54203 -77294
10899 -77294 -74987 -93732 -100092 -57143 -64300 -33225 -51699 -88623 -89671 -76047 -53331 -19765
10887a9765l5950k3766j3061K5097K7416L9996N7825m2050m4648q035j7938k4748
10875g9627L8466K0608L6859j9007m1834j9562L3489m7892O361L6221J8753j4917
10863c2082r806j4475J2023J9879J3573l642L6771j0974l0409L6277K152J3379
10851C2666K6874j4813j1853j743K067l6521j8466r062j2991k1208L7300J6843
10839a0907n362K7444L9729J4468n9172n5802j018J4299J2021L908j5433K8363
10827g462J8030O67j047J5281l4380L191K4638k2727l2823J5424K5239J8353J9304
10814D1688J5504j3910n1425j0042k8300q437j7104K4448K0376j0676r80J9230
10802a9628K5130Q940K1575L1135J0227m4444l9010k3769J8260O3868K870m1074
$$ plain form
10887 -19765 -55715 -79481 -92542 -67445 -40029 -33 57792 15742 -28906 -36941 -54879 -79627
10875 -79627 -41161 -20553 16306 -2701 -44535 -64097 -30608 -78500 -72139 -35918 -17165 -32082
10863 -32082 -41888 -56363 -44340 -24461 -10888 -14530 22241 11267 -19142 17135 19287 32666
10851 32666 59540 44727 32874 31131 33198 -3323 -21789 -30851 -43842 -65050 -27750 -10907
10839 -10907 -16269 11175 50904 65372 6200 -49602 -50620 -36321 -24300 -20392 -35825 -7462
10827 -7462 10568 11235 10188 25469 -8911 -5720 18918 -3809 -36632 -21208 4031 22384 41688
10814 41688 57192 43282 -8143 -18185 -46485 -54922 -72026 -47578 -27202 -37878 -38858 -19628
10802 -19628 5502 14442 36017 67152 77379 32935 -6075 -29844 -11584 52284 55154 14080
10790A4080Q866m828j0787L3808k1475l3555j6610J6638O0439m025J958k5758
10778A8751O795k0085j5467k1279o633K0800K4158j8002M8463j8187k8613m6982
10766e6281Q277j6104j0625L2176J6422j9800J4486N279L2622K7863m1568j3392
10754b0645l6516k3069j2274l411J6154k1378K5934N0838M114J3817k5830o930
10742c9196o270k9487L3579M1000m465o3349l5219M3715J4674J1738J5527K5656
10730G903k5326k163K0249M060J2031l9395l8205R597j1217l3743j375O8584J2890
10717a6110l0682K425J5577N3815K7110J5455L959j9684l9316l2367L5423K1423
10705C7028j6730p788m1385p3409K5958N9500M6426k5484j8459J583Q730J1899
$$ plain form
10790 14080 22946 18118 7331 41139 19664 -13891 -30501 -13863 46576 42551 44509 18751
10778 18751 25546 5461 -10006 -31285 -37918 -17118 7040 -10962 37501 19314 -9299 -56281
10766 -56281 -48004 -64108 -74733 -42557 -26135 -45935 -31449 -26170 6452 34315 -7253 -20645
10754 -20645 -57161 -80230 -92504 -95915 -79761 -101139 -75205 -24367 -20253 -6436 -32266 -39196
10742 -39196 -45466 -74953 -41374 -374 -4839 -68188 -103407 -59692 -45018 -33280 -17753 7903
10730 7903 -17423 -19586 663 4723 16754 -22641 -60846 -51249 -62466 -96209 -97584 -29000 -16110
10717 -16110 -46792 -44367 -28790 25025 52135 67590 71549 51865 12549 -19818 15605 37028
10705 37028 20298 12510 -28875 -102284 -76326 -16826 29600 4116 -14343 -12760 -4030 7869
10693G869K2743J3456j5887M0000P587o26j351k5498m6984k3319L2447Q2269J1258
10680A03964p5182k6989m328J3868M744k6309O313J8472J827r907j4631j1904
10668b0062j4732L71j0691m477K7247P565K6024M397m1209j9687Q667J3008K2072
10655a507j9877J1636K1994o265k0166l044m209L1982N1540N3068k0904k9308
10643F4940L7544K5529L8524L4738J1311n0961j1784L7902K9110o2276n2885j3592
10631H8100j9430m3317k9419N121M0546M0669O229n0068j8516j0910j5315K2748
10619A6438K678j1217l3909q282K4745L6744L2920J3251L6845K464l4005m7657
10607C1015p509k0509M5242j6282m6735M3442J0273r861n560j4750L652J3316
$$ plain form
10693 7869 30612 44068 28181 68181 75768 75142 73791 48293 1309 -22010 10437 92706 103964
10680 103964 28782 1793 -2535 11333 16077 -10232 -3919 14553 16380 6473 -8158 -20062
10668 -20062 -34794 -34423 -45114 -49591 -22344 -14779 11245 15642 -25567 -45254 -36587 -23579 -1507
10655 -1507 -21384 -9748 12246 5981 -14185 -17229 -21438 10544 62084 115152 94248 64940
10643 64940 102484 128013 166537 201275 212586 161625 149841 187743 216853 154577 101692 88100
10631 88100 68670 25353 -4066 1055 41601 82270 88499 38431 19915 9005 -6310 16438
10619 16438 19116 7899 -26010 -34292 -9547 27197 60117 73368 110213 112677 78672 31015
10607 31015 23506 2997 48239 31957 -14778 28664 38937 29076 23516 8766 12418 25734
10595B5734m470m5642l0156K2709O8015N5260j6902m9062o0032l4413L018K0878
10583d5063M7543K6578J567K4611J314L4657q340j7704J4943k3511O224R907k3456
10570D9270k251n698L5631q488J0094l3699o1609j6647M4801K5835N198j883m035
10557C6519K833J219m1985M17L9009j2428j5457J9103K4134k6802k4428l4477
10545c2343J6986J0305j012k0130l307K5778m291k1896j2293m867j546M456j1594
10532e5754J5037M1468o247r565k4023k9910J6221K7617j0558k6911R044K238
10520e1343n47j530N81j4819J2762K6917L411j0157m5137q427M6983K2092m3529
10507f2743J5397M9571M5671j858m6970o145K4078R162j8325j7391j2882M924
$$ plain form
10595 25734 21264 -24378 -54534 -31825 36190 91450 74548 25486 -34546 -68959 -65941 -45063
10583 -45063 2480 29058 30625 55236 56550 91207 82867 65163 80106 56595 62819 72726 49270
10570 49270 47019 41321 76952 68464 78558 44859 -16750 -33397 11404 37239 42437 40554 36519
10557 36519 39352 40571 -1414 -997 38012 25584 10127 29230 53364 26562 2134 -32343
10545 -32343 -15357 -5052 -6064 -26194 -29501 -3723 -8014 -29910 -42203 -47070 -48616 -44160 -55754
10532 -55754 -40717 751 -5496 -15061 -39084 -68994 -52773 -25156 -35714 -62625 -53581 -51343
10520 -51343 -51890 -53420 -52839 -67658 -54896 -27979 -24568 -34725 -79862 -88289 -41306 -19214 -62743
10507 -62743 -47346 2225 47896 46038 -932 -7077 17001 26163 7838 -9553 -22435 -17511
10495a7511K7344j483k3595J7553L480j3646n109P6507L9972n3734m4069J6278
10483B1987j0496n220p197L7633M667r535l798J6670k0420m1420K5515K1944j4644
10470A5686L3219J153r0509l3525j161J7436K9597J261j5591K2283M0533N848
10458B6230K236k2764J5670k3014k4479j4897K5706N853R569J6248l0147M043
10446i746o999m029j7293o187K8749K6696o91J2717k464k3500J8241K7683k931
10433D0246p403K5279M6661P6052L5576k7176l3136M234j2359O113j1516k8964
10421A13607J2184J4806n417L903P953k0321l9511k7687j9007J5212J6104J4528
10409H6354j3452q548m0027P57J4032l6364n4244l3399L2480K1054J7203N55J2479
$$ plain form
10495 -17511 9833 8350 -15245 2308 5788 -7858 -12967 63540 103512 49778 5709 21987
10483 21987 11491 6271 -926 36707 41374 31839 28041 44711 24291 -17129 8386 30330 15686
10470 15686 48905 50058 -40451 -73976 -75137 -57701 -28104 -26843 -42434 -20151 20382 26230
10458 26230 28466 5702 21372 -1642 -26121 -41018 -15312 -9459 110 16358 -13789 -9746
10446 -9746 -16745 -20774 -38067 -44254 -15505 11191 10500 23217 20753 -2747 15494 43177 40246
10433 40246 32843 58122 104783 180835 216411 189235 156099 160333 147974 154087 142571 113607
10421 113607 125791 140597 135180 139083 147036 126715 87204 59517 40510 55722 71826 86354
10409 86354 72902 64354 24327 25084 39116 2752 -51492 -84891 -52411 -31357 -14154 -13599 -1120
10396a120m0117j4040N99N53k9611l921O8827L6571L4217J7097j6002q63L4968
10383H7158L2853N5757j8553l1440K7022J9541N9822L7743K7441P243J5799J250
10371C21636m3911n695j0512l7900q6078j5533M464K8452P790J3791m2325l9818
10359I4361n203k0227l4774R240K4945K064K0907j8981l7927k3056o027L299M751
10346A3372K5194J3363L001o725L355m586k8389j648j7107J5030J3251K3062P827
10333E9000M5643M947J8493J5898m9402m2125K6400O0830L6942j0762m6075J1272
10321A31061N2431M0951k3563l6K4190k983l1367m2178k6918L914K6973j2031
10309A40444P165j532m5585m3005N676K206J9568K7987J2182l0835j1563J5137
$$ plain form
10396 -1120 -41237 -55277 -54678 -54125 -83736 -87657 -18830 17741 51958 69055 53053 52190 87158
10383 87158 120011 175768 157215 125775 152797 172338 232160 269903 297344 304587 320386 321636
10371 321636 277725 272030 261518 223618 137540 122007 126471 154923 162713 176504 134179 94361
10359 94361 89158 68931 34157 43397 68342 70406 91313 72332 34405 11349 5322 8621 13372
10346 13372 38566 51929 54930 48205 51560 46974 18585 16937 -170 14860 28111 51173 59000
10333 59000 104643 109590 128083 143981 94579 52454 78854 139684 176626 165864 119789 131061
10321 131061 183492 224443 200880 200844 225034 222051 190684 148506 121588 125502 152475 140444
10309 140444 147609 146077 100492 57487 63163 65369 84937 112924 125106 94271 82708 97845
10297I7845j7534o625o680o276N4354Q5530R1603R6530R4402J29208J47079J09867
10285H69303R7861R9577O9812L929q9653p5547K2923K8860k8113r4729j66564
10274G37659j87606j23986p1029o9715m9897k9554K0236K2437k4888m899M181
10263B22939r163m1234n8543k3716P117j0185r365J6860M7831L2951K3724J2312
10251B11528k2535k5244j9410N485k9284J836k2865K4869M2242j5809j7084K2831
10239A56560N964K8172p531O254l711l1518q8987j4398K9506j776J8455J2879
10227A09869k0959k7460O640K7171n339j7904m548j2675q490j1768K1813R303
10215F5653o718N556k2179p037Q760M1298o8404m3564L2654M6105k0073J617M7347
$$ plain form
10297 97845 80311 73686 67006 60730 115084 200614 292217 388747 483149 612357 759436 869303
10285 869303 967164 1066741 1136553 1140482 1050829 975282 998205 1027065 998952 904223 737659
10274 737659 550053 426067 355038 285323 235426 205872 226108 248545 223657 218758 222939
10263 222939 213776 172542 113999 90283 97400 87215 77850 94710 142541 175492 199216 211528
10251 211528 188993 163749 144339 149824 120540 122376 99511 124380 166622 150813 133729 156560
10239 156560 162524 190696 183165 189419 185708 154190 65203 50805 80311 78535 96990 109869
10227 109869 88910 61450 68090 95261 89922 72018 67470 54795 46305 34537 56350 65653
10215 65653 58935 64491 42312 35275 44035 85333 16929 -26635 6019 52124 32051 33668 81015
10202H1015P511l0854p458R962k3063j6200m0737J9456Q647n168J0068k950J5265
10189B5494M1349J1743k3640K4070o297n798k3386k8754k1551k1124k3156J4958
10177c6092K9145K6065P955P666m0400n221o706J0877J9125K9737Q989k3717q342
10164A9081K143O508K0828k6366L110j4589n3324q286N0019O130j3028l3591j125
10151d2490l157j3284K7504k22n192L1905k1399k9088k5586O641J8782P798J1342
10138c6446J0711j5190K4827L9157l1905l5808k3506M798K6458K1433j302K6860
10126A0087K1343k1315K5596J1407j8806k5795n1041K128Q361j2747K5749L5888
10114A0855M04J7877J8504l9943k3997N8783K9734M2660k1424k6560J4713K0989
$$ plain form
10202 81015 88526 57672 50214 60176 37113 20913 -19824 -368 8279 3111 13179 10229 25494
10189 25494 66843 78586 54946 79016 72719 66921 43535 14781 -6770 -27894 -51050 -36092
10177 -36092 -6947 19118 27073 34739 -5661 -10882 -17588 -6711 12414 42151 51140 27423 19081
10164 19081 21224 27732 48560 22194 25304 10715 -42609 -50895 -876 5254 -7774 -41365 -42490
10151 -42490 -45647 -58931 -31427 -31649 -36841 -4936 -26335 -55423 -81009 -74368 -55586 -47788 -36446
10138 -36446 -25735 -40925 -16098 23059 -8846 -44654 -68160 -63362 -36904 -15471 -16773 10087
10126 10087 31430 10115 35711 47118 28312 2517 -48524 -46396 -38035 -50782 -25033 10855
10114 10855 11259 29136 47640 7697 -16300 42483 72217 114877 93453 66893 81606 102595
10102A02595J676J0099O115j5812L7772j732j8663k9218J1360j5199J8573M807
10090A12373o6764n2217k6807k3065L7116J7336O420L359j3400K657j0669l7687
10078e1348j4951k758Q008J7830O7739O2569P313n1738k1086J8084M6340j138
10066H4864O12J1534N0041L1120K1442K1164R5240K08593L05931L36719K45901
10055A413161J54626K21957K67506J22370m27086n66501l66159k45013j34999
10046D39862o6582m3411N626j7324m9655p4182m3860k7285J7328L8410K8203l097
10034B04033m7319m6340Q550M2682j3977n8092m014M0664l3785k3256L4161J2441
10022A15748m3691p8858J9874N0050M4615K0826n0838l8861K3450J0458K883L9169
$$ plain form
10102 102595 104271 114370 120485 104673 142445 140713 122050 92832 104192 88993 107566 112373
10090 112373 45609 -6608 -33415 -56480 -19364 -2028 4392 7751 -5649 -2992 -13661 -51348
10078 -51348 -66299 -69057 -61049 -43219 24520 87089 94402 42664 21578 39662 86002 84864
10066 84864 85476 97010 147051 178171 199613 220777 316017 524610 830541 1167260 1413161
10055 1413161 1567787 1789744 2057250 2179620 1752534 1186033 819874 574861 439862
10046 439862 373280 329869 335495 318171 268516 194334 150474 123189 140517 178927 207130 204033
10034 204033 156714 110374 118924 161606 147629 89537 85523 126187 92402 69146 103307 115748
10022 115748 72057 -6801 13073 63123 107738 128564 77726 38865 62315 72773 75656 114825
10010A14825N2589k7004n7025m3265K379J002k2435K2109L7781j5395m0470k3447
9998A644j0289L1737K5958m4120n1426J6248K6183N6575l885k5172l5003o448
9986a7998N1865L358j4420J4511J4976Q495j6914m044l4478k1678k1134J6168
9974b1293J9875O859J0261J0960L7730m659l6483j7277L2781M107k8382k6695
9962a2216j8893N2803j9554l3633K3358p452j0432K3700J8641k9104l3602j3670
9950f0054O794N4420k8930k3584J3538J0637j1797J0823J8306L2243J8977o939
9938C4434k1080Q994k985J0493L1509o981J0340k196l4036k7133M2970j0168l0654
9925C507R54J5182k5228J7297K2464q774K3851n005l6866K0712J9719K9249l9822
$$ plain form
10010 114825 167414 140410 83385 40120 42499 43501 21066 43175 80956 65561 25091 1644
9998 1644 -8645 23092 49050 4930 -46496 -30248 -4065 52510 48625 23453 -11550 -17998
9986 -17998 33867 37225 22805 37316 52292 60787 43873 39829 5351 -16327 -37461 -21293
9974 -21293 -1418 5441 15702 26662 64392 59733 23250 5973 38754 42861 14479 -12216
9962 -12216 -31109 21694 2140 -31493 -8135 -15587 -26019 -2319 16322 -12782 -46384 -60054
9950 -60054 -53260 1160 -27770 -51354 -37816 -27179 -38976 -28153 -9847 22396 41373 34434
9938 34434 13354 22348 19363 29856 61365 54384 64724 62528 28492 1359 44329 34161 3507
9925 3507 4461 19643 -5585 11712 34176 25402 49253 44248 7382 28094 47813 77062 37240
9912C7240l4710J3929N013j4395J3249K2925j5074N648m477M6954N2317R623j9454
9899A18788J0576R309k7913l990K6857r307m0364j8912k6470m0486J703J3350
9887A3141L3006M9461J4251n490n346K194n1209j406j1638m8971J6468J5070K3519
9874D3050J0736n020J3435K1509j6838j2125q461K1007P613M6703M5922K0220
9862A87751L6839j722M200l2892o1975k9019O068J0846k1647J9760L889m08m4137
9849G7553J8291L8828R582k495j665l1792l2612n9135j107J7476l3497p363N1504
9836D3568J4188n8104k6127N5669L5995j1933M0745L0077k0242l5256j8902k812
9824D6866k8554J0438L7688k8153l315k1823M5386Q4141N4090K1661K429m436
$$ plain form
9912 37240 2530 16459 21472 7077 20326 43251 28177 33825 29348 76302 128619 138242 118788
9899 118788 129364 138673 110760 106770 133627 124320 83956 65044 38574 -1912 -209 13141
9887 13141 46147 95608 109859 104369 99023 101217 50008 48602 36964 -12007 4461 19531 43050
9874 43050 53786 48766 62201 83710 66872 54747 46286 67293 74906 121609 167531 187751
9862 187751 224590 222868 227068 194176 132201 103182 109250 120096 98449 118209 122098 121690 77553
9849 77553 95844 134672 144254 141759 140094 108302 75690 16555 15448 32924 -573 -7936 43568
9836 43568 57756 -348 -26475 29194 65189 53256 94001 124078 103836 68580 49678 46866
9824 46866 18312 28750 66438 38285 34970 13147 58533 142674 196764 218425 220854 216418
9812B16418J5892N547j6820m6469p333R501j5660L5375L9632j9575k4932k1944
9800A69632o8469j7440J865K940O974j1826k9245j2145J2761k329k3786p1159
9788d2227j4371J1816J7416L3349N4221M290l9661J0184Q553M1708J7722l2968
9776G0032l0931K1136L8246n153Q235M808k2008Q495J0855q109J8642N3390J63
9763A67801n281R195k9771l6978j1066k4904j5687j9652M6962N6722l0304o1302
9751D5735J072R776j133j6499n1894j3003n742j4736j6318K3878R436K5200J3930
9738I702J3109k4453L6799j6303J944L2252l4462j6161K0591j8782K359J8128
9726B4723o4287k7516K490q20J8400O478L9616J8945k8962m0751J7735N7521J8392
$$ plain form
9812 216418 232310 237857 221037 174568 167235 176736 161076 196451 236083 216508 191576 169632
9800 169632 101163 83723 85588 88528 95502 83676 54431 42286 55047 52718 28932 -42227
9788 -42227 -56598 -44782 -27366 5983 60204 64494 24833 35017 43570 85278 103000 70032
9776 70032 39101 60237 98483 93330 101565 106373 84365 92860 103715 95606 114248 167638 167801
9763 167801 162520 171715 141944 104966 93900 68996 53309 33657 80619 137341 107037 45735
9751 45735 46807 56583 55450 38951 -12943 -25946 -31688 -46424 -62742 -38864 -29428 -4228 9702
9738 9702 22811 -1642 35157 18854 20798 53050 18588 2427 23018 4236 6595 24723
9726 24723 -39564 -67080 -64590 -65410 -47010 -40532 -916 18029 -10933 -51684 -33949 23572 41964
9713D1964J703o845j4262L279J1685M573k228j5173l7250k1918M7443O3011P327
9700H3309l1549k2714L5357m7994j6842J4668k6618m7955K8145J8329n8217j3364
9688h5445M2450L0592K7175k8608n4903j2562R652K0836M3865n275K4102l4148
9676b2269O453J9845r385j5872j6846J1372M7956j5502l4219K1331l236K6282
9664A5910k2602n9092J7072K7353K2541m6446j2209M3508R462j5534k259j6935
9652c9231p126p01N0769J0021P25q537k991M829m0252o95L0423o317k0169k336
9638c1588m1354L7740L2545k3319j1945k880O5358K0415J3329j9169k0614l9566
9626b1048k4048p425N8603n35K948k3951J696K1244K6625j5814L0638J4889L663
$$ plain form
9713 41964 43667 36822 22560 25839 37524 42097 39869 24696 -12554 -34472 12971 75982 83309
9700 83309 51760 29046 64403 16409 -433 14235 -12383 -60338 -32193 -13864 -72081 -85445
9688 -85445 -42995 -12403 14772 -13836 -68739 -81301 -71649 -50813 -6948 -12223 11879 -22269
9676 -22269 -15816 4029 -5356 -21228 -38074 -26702 21254 5752 -28467 -7136 -10372 15910
9664 15910 -6692 -65784 -48712 -21359 1182 -45264 -57473 -13965 -4503 -20037 -22296 -39231
9652 -39231 -46357 -47058 3711 13732 14457 5920 2929 7758 -32494 -33189 -2766 -9083 -29252 -31588
9638 -31588 -72942 -35202 -2657 -25976 -37921 -40801 24557 44972 58301 39132 18518 -21048
9626 -21048 -45096 -52521 6082 5547 8495 -15456 -13760 7484 34109 18295 48933 63822 67485
9613F7485q31L1551j224l4925l0777l549l0079r559k9745k768J808k2670O317
9600e8966J6823j5610q832L9077j7796j9988J0557J7864J6305M5935O2792p789
9588H0372p4779j8202J3410L7104k9648m3820M483J6463k701K7925o447m1770
9576c7610J1121J5778q720Q0k0455Q218K428j7777L7869L9265k7531l3252L2239
9563A653K4527m987R965j5810p480O376O144j0254M904j2560j2822m901K4398
9550I153L2883j3161m3313k6767n172q09J0594k4717K0655L7515M925J550j3067
9537i731J3808p422M5649O569m8579k2646L3049L431k2976l653j6162L633J2965
9524a2065n6462p39K1621K1948m258J274L6563L4796p988l3573M032K2607k8237
$$ plain form
9613 67485 66654 98205 96981 62056 31279 27730 -2349 -11908 -41653 -44421 -42613 -65283 -58966
9600 -58966 -42143 -57753 -66585 -27508 -45304 -65292 -54735 -36871 -20566 25369 88161 80372
9588 80372 5593 -12609 801 37905 8257 -35563 -31080 -14617 -17318 10607 4160 -37610
9576 -37610 -26489 -10711 -19431 -19351 -39806 -31588 -29160 -46937 -9068 30197 2666 -30586 1653
9563 1653 26180 21193 31158 15348 7868 14244 20388 10134 15038 2478 -10344 -15245 9153
9550 9153 42036 28875 -14438 -41205 -46377 -47186 -36592 -61309 -40654 -3139 1786 3336 -9731
9537 -9731 4077 -3345 42304 48873 294 -22352 10697 14128 -8848 -12501 -28663 -25030 -12065
9524 -12065 -68527 -69266 -47645 -25697 -29955 -28681 7882 42678 34690 1117 5149 27756 -481
9511d81J771m071j7707R11J2365o54k105M767M596P417n916J9733N65m5605l2578
9496e6992k2755m3899o724J5991K0864M1026N1725j4902l0375J3281O563j9977
9484d6174M134L4849J9882J7740L1295M3304m3770O825m657M446M079K2353j5937
9471G8369l678k5265k8221k2209k3851Q89K7831J5786l449J1498K207k4992j3500
9458h585r410K9916P639L1724j6374m7180L0709N5967M1960R01l8496R40k3424
9445E6287k4780L3452J0852n1288K344K0422O381l5452m1635K0657L0607n293
9433B2554j4142j087J2672R43K3296k534p236K6544k1114n0074J3909J1201L59
9420A5291k2966K8207l1448j8004J4010K4458L220j7465k3927k722j1860m470
$$ plain form
9511 -481 1290 -2781 -20488 -19577 -7212 -7866 -9971 -5204 -608 6809 893 20626 21191 -24414 -56992
9496 -56992 -79747 -123646 -130370 -114379 -93515 -52489 -764 -15666 -46041 -32760 -26197 -46174
9484 -46174 -42040 -7191 12691 30431 61726 105030 61260 68085 63428 67874 71953 94306 78369
9471 78369 74691 49426 21205 -1004 -24855 -23966 3865 19651 16202 27700 29907 4915 -8585
9458 -8585 -17995 11921 19560 51284 34910 -12270 18439 74406 116366 117267 78771 79711 56287
9445 56287 31507 64959 75811 24523 26867 47289 53670 18218 -23417 -2760 27847 22554
9433 22554 8412 7325 19997 20940 44236 41702 34466 61010 39896 -10178 3731 14932 15291
9420 15291 -7675 20532 -10916 -28920 -14910 9548 12768 -4697 -28624 -31346 -43206 -47676
9408d7676O8445R659k5419m1102j1506K2999K0374K4865l4837l8316J6780N0464
9396A4730l162J1945L7397j4070n726K7277n352r922o4353K1724R710l3459M369
9383h892L6612P51J3806R043n142N234k2630l5385l3633j856j4149k5844N2896
9370b9189L5139m964j2219o5582L6944J6195j1641J4405j5345j0867J6947l3772
9358f3949l4403J3709N8843M0153K1212l7840M942k9012J9905M2473j9854m6206
9346c0027j0738j8694j1155l5128r86O5546K3682K2868K1877o306j5925m100J4846
9333A5760j5807l0012Q808R744P293l7057O845L5109N865J5513R49k4639j277
9320b906J0175J4538l1691l5356k1302K8010J14J6241L2646K568n0206m792P717
$$ plain form
9408 -47676 20769 30428 5009 -36093 -47599 -24600 -4226 20639 -14198 -52514 -35734 14730
9396 14730 11568 23513 60910 46840 41114 68391 63039 53117 -11236 10488 20198 -13261 -8892
9383 -8892 27720 28471 42277 51320 46178 51412 28782 -6603 -40236 -42092 -56241 -82085 -29189
9370 -29189 5950 986 -11233 -76815 -39871 -23676 -35317 -20912 -36257 -47124 -30177 -63949
9358 -63949 -98352 -84643 -25800 14353 35565 -2275 2667 -26345 -6440 36033 16179 -30027
9346 -30027 -40765 -59459 -70614 -105742 -106728 -41182 -17500 5368 27245 20939 5014 914 15760
9333 15760 -47 -30059 -21251 -11507 -4214 -41271 -34426 683 6548 22061 23010 -1629 -2906
9320 -2906 7269 21807 -9884 -45240 -66542 -38532 -38418 -22177 10469 13037 -37169 -41961 -34244
9307c4244N0511O5744j0228l6010q676p310l4167k6210K2971N465p357M899L2224
9294A7612M404J46l32J968m1555l8964J3310k0666M2414p135K5934L4423j9753
9281A1806n552k1384n7852O744J0455k3449P546L9493J0491K410l0973k1670N2203
9268a9732K1210L503J6578l2619l2865J0401J8788j461l5226q952J6526L10M1824
9255a715J0680m7255L5192L475M1517K050k3519j0120j7538q790p697L8845L4623
9242D9748N360M947R648r236O759j1902j2068M6073L7955j8852m8714j9276r971
9229C0471m484j059K7319k4766l4927M5025K2781k0907J1727j2771K839J9558
9217F0806m9315k501M2133K1701j0434m4556l6005l6728J4308R197M1419N0070
$$ plain form
9307 -34244 16267 82011 71783 35773 27097 19787 -14380 -40590 -17619 -12154 -19511 -14612 17612
9294 17612 22016 22162 21830 23798 -17757 -56721 -43411 -64077 -21663 -28798 -2864 31559 11806
9281 11806 6254 -15130 -72982 -66238 -55783 -79232 -71686 -32193 -21702 -19292 -50265 -71935 -19732
9268 -19732 1478 4981 21559 -11060 -43925 -33524 -14736 -16197 -51423 -60375 -43849 -43539 -1715
9255 -1715 8965 -38290 -3098 377 41894 43944 20425 10305 -7233 -16023 -23720 15125 49748
9242 49748 55108 60055 69703 60467 67226 55324 43256 89329 127284 108432 59718 40442 30471
9229 30471 25987 24928 52247 27481 -7446 37579 60360 39453 51180 38409 41248 60806
9217 60806 11491 8990 51123 72824 62390 17834 -18171 -54899 -40591 -31394 10025 60095
9205F0095l4730k6301J6281l599J4811m771L606o201n53p851l1152J384L2855
9192A3874M0870j7841m2603k942K0737J4678j3502L0099K9786r018o134P444O838
9179G2286J6422j3400k767j3287k9718J8402o925m050l432K5825R277L3225m2054
9166E9804r053J6220m8607l528K6896K8136K221r418M0214j3412k6347j971l780
9153E7375K779K1764L7081K6572j5268j1173M7821K4596o880o106L21M1677Q045
9140B28604J7264N033j8269K8696M0421p028K9871L8826O2594M1213M7836N6699
9128E71760Q2148P0906J54268K43138K61892K25262L21015N05369Q07506J265794
9118D509058J861173K528157K801384K420325J933660J740406J246841o09516
$$ plain form
9205 60095 25365 -936 15345 11746 26557 21786 25392 19191 18638 10787 -20365 -18981 13874
9192 13874 54744 36903 -5700 -8642 12095 26773 13271 43370 73156 64138 58004 65448 72286
9179 72286 88708 75308 72541 59254 29536 47938 41013 36963 33531 59356 68633 101858 59804
9166 59804 50751 66971 18364 14836 41732 69868 72089 62671 102885 89473 63126 61155 57375
9153 57375 60154 81918 118999 145571 130303 119130 166951 191547 184667 178561 178882 220559 228604
9140 228604 245868 250901 232632 261328 301749 294721 324592 363418 426012 467225 515061 571760
9128 571760 653908 724814 879082 1122220 1384112 1609374 1930389 2435758 3243264 4509058
9118 4509058 6370231 8898388 11699772 14120097 16053757 17794163 19041004 18431488
9110A8431488l207395l816898k727723j774308j199504q53780o60401n48051m22455
9101C220973l41951k81049k71516k50800r2847r4488j46362j17269r8452r7761
9091A428478p3650n2498q244o2543k0863l780l7814k6458p1956r6018m1213j8700
9079I14741k6277m3826l1270L059l5489j0101Q347j7429l480l5162k5074p604
9067F90435l4054k6084j9506n7177n5665j3042Q642k6583l7431N821j2342m215
9055D18799j0403p794J186J7249j3520l1740J7586k710K3511k5771m5012k7657
9043C13724j0748Q207R093m395l4397K208j3240K3353J4539m4995k0264N5697
9031B98782K5773l0877l5945J0639q651R391L902J4655k2339n1200k5791J0909
$$ plain form
9110 18431488 15224093 11407195 8679472 6905164 5705660 4851880 4191479 3643428 3220973
9101 3220973 2879022 2597973 2326457 2075657 1982810 1888322 1741960 1624691 1526239 1428478
9091 1428478 1354828 1302330 1294086 1231543 1210680 1206900 1169086 1142628 1070672 974654 933441 914741
9079 914741 888464 844638 813368 816427 780938 770837 779184 761755 758275 723113 698039 690435
9067 690435 656381 630297 610791 553614 497949 484907 493549 466966 429535 435356 423014 418799
9055 418799 408396 400602 401788 419037 405517 373777 391363 388653 412164 386393 341381 313724
9043 313724 302976 311183 320276 315881 281484 283692 270452 293805 308344 263349 243085 298782
9031 298782 324555 293678 257733 268372 259721 269112 273014 287669 265330 214130 188339 199248
9019A99248l4667J8477L1891r014k9518j3298M177K530J0574j0242j2408K822
9007A60572J0222j0419j0118J6198j3213k9372j6815j9840j8793K7666n337o97
8995I0054R199j4734o656L353o663N959j0611J1196j8896l5429j849M5635k1171
8982D9387L1794L7898p732k8888n46J8457k32j2167j2596J461k748O109l7152
8969D3045k8547J7181l2014K0472M1044J0515R835n75j4512k2032J6472J3738
8957G4622J9587K752L9959k1983l4083O792l4551o2145j141j638K323L3495N1688
8944G5677P885k536j186l6440l9173K3M6445J9182k7602K0873j6459n5037n146
8931a3494K6778J5822j4285K3550K3959j5212m6903J9818P2568K6744k4423n8836
$$ plain form
9019 199248 164581 183058 214949 205935 176417 163119 167296 169826 180400 170158 157750 160572
9007 160572 170794 160375 150257 166455 153242 123870 107055 87215 68422 96088 90751 90054
8995 90054 99253 84519 77863 81216 74553 80512 69901 81097 62201 26772 24923 70558 49387
8982 49387 81181 119079 111347 82459 81913 100370 100138 87971 75375 76836 74088 80197 43045
8969 43045 14498 31679 -335 20137 61181 71696 81531 80956 66444 44412 60884 74622
8957 74622 94209 96961 136920 114937 80854 87646 53095 -9050 -10191 -11829 -9506 23989 75677
8944 75677 83562 81026 79840 43400 4227 4250 50695 69877 42275 63148 46689 -8348 -13494
8931 -13494 13284 29106 14821 38371 62330 47118 215 20033 92601 119345 94922 36086
8919C6086k2041O040l0562O1417J8897l6453m1714l0742L8434K2839j0051K3157
8907C5307L161k8347k7306P86L8190k419L2319Q094j2727l5383j1322J7482j703
8894A6132k2541r178M513K8266M5333j349J9627O46m5021k6341p263K3159J5889
8881D1872l8982q3126l2671M4139P5737L1408M467j1061n738J058J8198J5927
8869F1228K9795j7367j8195k8050m8816l4666M577J6562M5403J1236j2234L1666
8857D1139J7799J344k3689m989l9201n898m945Q304k8399J6568K1757P998l4467
8844b6679p344Q065q569j2657L312K7454L4661J6215k1426k0871K9031L4432k3792
8831C1832q498M7110J2474N416J5898n9118n7530m206K9422K7618j6118N591J4888
$$ plain form
8919 36086 14045 20085 -10477 50940 69837 33384 -8330 -39072 -638 22201 12150 35307
8907 35307 38468 10121 -17185 -16399 21791 19372 51691 59785 47058 11675 353 17835 16132
8894 16132 -6409 -15587 -11074 17192 62525 61176 80803 81449 36428 10087 2824 25983 41872
8881 41872 2890 -80236 -112907 -68768 6969 38377 42844 31783 26045 27103 45301 61228
8869 61228 91023 73656 55461 27411 -21405 -56071 -51494 -34932 10471 21707 9473 41139
8857 41139 58938 60282 36593 31604 -7597 -13495 -18440 -10136 -38535 -21967 -210 7788 -26679
8844 -26679 -34023 -25958 -34527 -47184 -43872 -16418 18243 34458 13032 -7839 21192 55624 31832
8831 31832 23334 70444 82918 88334 104232 45114 -12416 -16622 12800 40418 24300 29891 44779
8818D4779q287J27K594L605j4918q337K3781O207m5159j7947p580m528p850J8902
8804a4611m8359J5003J9873n614P44K2669j2019l0942L7065L4214K2011p0908
8792c0874l4367j2774M535M5412L6541j6175K2170L103l0675J8076L4161k0863
8780A8270K877N527k1037j0150L9753k1818l220l3325o919P155J5735K5637q885
8767I600l0042n214O2893l899j3516j5875K0609J5052J5018N969m854j18j1581
8754D4042n5092k4378K5257k3296K0623M4483L1794J4475R036n2218k529P046
8742C9243K3429P965l2068k0176J5815Q958q647k3453q245r847n328m3541l2803
8729h8698K6111J2480K341K5469j788L3460L8193j4562k1004N08p685j2798j7456
$$ plain form
8818 44779 36492 36619 39213 42818 27900 19563 43344 49551 4392 -13555 -21135 -25663 -33513 -14611
8804 -14611 -62970 -47967 -28094 -33708 -32964 -10295 -22314 -53256 -16191 18023 40034 -30874
8792 -30874 -65241 -78015 -73480 -28068 8473 -7702 14468 17571 -13104 4972 39133 18270
8780 18270 21147 26674 5637 -4513 35240 13422 10202 -23123 -30042 -22887 -7152 18485 9600
8767 9600 -20442 -25656 37237 33338 19822 3947 24556 39608 54626 60595 55741 55623 44042
8754 44042 -11050 -35428 -10171 -33467 -12844 31639 63433 77908 86944 34726 32197 39243
8742 39243 62672 70637 38569 18393 34208 43166 34519 11066 2821 -7026 -12354 -55895 -88698
8729 -88698 -62587 -50107 -47766 -22297 -24085 9375 47568 33006 12002 12510 4825 -7973 -25429
8716b5429J6308J3814p597O572o3163m6862L6187M6419J9476K366M143j8903K4402
8703G733N619l8038L6530N8418J446k4283j1457K3688j7902m5710k7034L76l2838
8690f3452L4239L9373K3704j9054k2177n574m299J4523J2078N94L666J432J8577
8677C3630m76j8170Q863l705j2481j4909J8011J4228k2786J0460R475p684n7682
8664d3226m2892K2285J5232K292L1802K2012J842l0884o715K1649j1013K9185
8652A1569l2633j8406L4193J124K4207J8474n7417j7751k5146p433M624J5346
8640d9249M4261n513m743j2051j9387K7631R886j4507O000L7146k0026r400M254
8627e698n7663K8275L0759n709K4505j7654j4941r804M4649Q047k8412q327O2225
$$ plain form
8716 -25429 -9121 4693 -2904 3668 -59495 -106357 -70170 -23751 -4275 -1909 2234 -16669 7733
8703 7733 13352 -24686 11844 70262 71708 47425 35968 59656 41754 -3956 -30990 -30614 -63452
8690 -63452 -29213 10160 33864 14810 -7367 -12941 -17240 -2717 9361 9955 13621 15053 33630
8677 33630 33154 14984 23847 20142 7661 -7248 10763 24991 2205 12665 22140 14456 -43226
8664 -43226 -86118 -63833 -48601 -46309 -14507 7505 9347 -21537 -28252 -6603 -17616 11569
8652 11569 -21064 -39470 -5277 -4153 20054 38528 -18889 -36640 -61786 -69219 -64595 -49249
8640 -49249 -4988 -10501 -15244 -27295 -46682 -19051 -9165 -23672 -17672 19474 -552 -9952 -5698
8627 -5698 -63361 -35086 -4327 -10036 14469 -3185 -18126 -27930 16719 24766 -3646 -11973 50252
8614E0252M4610k975p445k6287K2525m961j1516j0833k6645n1900p857M5310j1839
8601D39L9682O143o541M284L6232K6017l4868m1796k4266K9227k8703n3534q421
8588e6105M9649J8352L811J6934k1159l5643J6381J5778J8384o463L51K6555k8994
8575A7831q771q669J5058N4381j0085k0440J2300k1297n4584M0983J5938k8798
8563C847j4202M9084J337L6106l8126l9621N705P5902J9510l7004p2331j6227
8551b6020K6336J8769R014m8817m6369P868K0135L5768J9277P523k3779j1755
8539a2050O1056K0528r856J5998J5105k1790k2837J061j324J9763l4136M877O67
8526C7062j8918j0120p177O93m475m3438n2461L6786M5888L4240K5943J5776q24
$$ plain form
8614 50252 94862 91887 84442 58155 80680 75719 64203 53370 26725 -25175 -33032 12278 439
8601 439 40121 46264 39723 44007 80239 106256 71388 29592 5326 34553 5850 -47684 -56105
8588 -56105 -6456 11896 15707 32641 11482 -24161 -7780 7998 26382 19919 20270 46825 17831
8575 17831 9060 391 15449 69830 59745 39305 51605 30308 -24276 16707 32645 3847
8563 3847 -10355 38729 40066 76172 38046 -1575 4130 80032 99542 62538 -9793 -26020
8551 -26020 316 19085 28099 -20718 -67087 -59219 -39084 -3316 15961 23484 -295 -12050
8539 -12050 49006 69534 59678 75676 90781 68991 46154 47215 45891 65654 31518 36395 37062
8526 37062 18144 8024 847 1540 -2935 -46373 -98834 -62048 -16160 18080 44023 59799 58975
8513E8975o298l6863k4937k3134M2164N9979n624m3950J1768j7337j8543L6334
8501C2534j7518k2350j7444o090J3534J6073o512l0068J9865k8729K6731N526
8489a4448K8105n505n854o98J2998J7387K9684j9341r431k823K2014J8892p486
8476F3494j3876o236n3441n8875R448J2116L4218K5978L5394J1530l1169l5717
8464g136M7237k133j8270j3700l7081Q592L579L106J4811L9099P63k1533k5976
8451h642K7310L6049K7692k1777j8272j3132J537K5828P050R096R82j7157o9562
8438a2998m0570L4129L0065k0023K368J868J7497J0736j3612n091j0077K3025
8426A7317J1309m4292k873k0074j0885K0999N5644m664k1876R420J698K3096L0002
$$ plain form
8513 58975 52677 15814 -9123 -32257 9907 69886 64262 20312 32080 14743 -3800 32534
8501 32534 15016 -7334 -24778 -30868 -17334 -1261 -7773 -37841 -17976 -46705 -19974 -14448
8489 -14448 13657 8152 2298 1600 14598 31985 61669 42328 32897 30074 52088 70980 63494
8476 63494 49618 43382 -10059 -68934 -59486 -47370 -13152 12826 48220 59750 28581 -7136
8464 -7136 40101 37968 19698 5998 -31083 -22491 -18912 -15806 -995 38104 38867 17334 -8642
8451 -8642 18668 54717 82409 60632 42360 29228 30765 56593 63643 72739 73721 56564 -12998
8438 -12998 -53568 -19439 10626 -9397 -7029 -5161 12336 23072 9460 4369 -5708 17317
8426 17317 28626 -15666 -18539 -38613 -49498 -28499 27145 22481 605 10025 11723 34819 64821
8413F4821m9230n1589q082K9165k8148k2579J3615J4227Q269K4220O290k5738
8401b4759k6546l4715k0559K0430K4917J9569N916o019l2229L3663K8341j2822
8389b4813L347j3920K0478k6519L7792J8105q342j415j8216L2575k2267k1933
8377b5128K6113p258j5362k1583k5974l5024J8201n469l7680K344M7458K9685
8365d9677J1800K619J8779L0813k7295J9181m0264k9909J9392p900M499L6446
8353a1516l105k5004J2460J3910N8825j0081o0548o497M2280o562n2877k7215
8341g5930L2663P145m3609k5724J6470K9752M9982L0356P6n431K3893N8376L2845
8328A30864j1141j5092l2514n0455k8447l1132l6510j1197J4772J3050J1L810
$$ plain form
8413 64821 15591 -35998 -44080 -14915 -43063 -65642 -52027 -37800 -29531 -5311 979 -24759
8401 -24759 -51305 -86020 -106579 -86149 -61232 -41663 -35747 -41766 -73995 -40332 -11991 -24813
8389 -24813 -21466 -35386 -14908 -41427 -3635 14470 6128 4713 -13503 19072 -3195 -25128
8377 -25128 985 -6273 -21635 -43218 -69192 -104216 -86015 -91484 -129164 -126820 -79362 -49677
8365 -49677 -37877 -35258 -16479 14334 -12961 6220 -34044 -63953 -44561 -52461 -47962 -11516
8353 -11516 -14621 -39625 -27165 -13255 45570 35489 -25059 -31556 10724 4162 -48715 -75930
8341 -75930 -43267 -36122 -79731 -105455 -88985 -59233 -9251 21105 21181 15750 39643 98019 130864
8328 130864 119723 104631 72117 21662 -6785 -37917 -74427 -85624 -70852 -57802 -57791 -53981
8316e3981K5133K8583Q254P625k5069l1869p388J2066M884J9085J8457j7243j6730
8303b8193O591K963j9929O273O28o357M2978l40n6611j0211P088K8615L4356n600
8289B251j9472N0243K3931j3584j5837O842k2231J3247R778n8546l3453J434k5165
8276h0562P585M6903L7494J2706r34l3129l72N9901K8576k5539k1811r389J6893
8263C8322M6015J7649J3296k6831m6834n5360m05L3176L9971k949m7920l2025
8251b3895j2611J2903K4491L7513K973J6236j7749N256m1923K6722m190L0172
8239E5898r376k1846j1364L2829p8216Q218R243K8110j8091k7104l1161l5302
8227i8162j74M2813K0302J5062n941j852j2842k3787j7357K1286M4940M0524K4187
$$ plain form
8316 -53981 -28848 -265 7989 15614 -9455 -41324 -48712 -36646 -31762 -12677 5780 -11463 -28193
8303 -28193 -21602 -18639 -38568 -32295 -31667 -38024 4954 4614 -51997 -62208 -55120 -26505 7851 2251
8289 2251 -17221 33022 56953 43369 27532 34374 12143 25390 35168 -23378 -56831 -55397 -80562
8276 -80562 -72977 -26074 11420 24126 23192 -9937 -10309 49592 78168 52629 30818 21429 38322
8263 38322 84337 101986 115282 88451 41617 -13743 -14148 19028 58999 56050 8130 -23895
8251 -23895 -36506 -23603 888 38401 41374 57610 39861 45117 3194 29916 25726 55898
8239 55898 46522 24676 13312 46141 -32075 -23857 -14614 13496 -4595 -31699 -62860 -98162
8227 -98162 -98336 -55523 -35221 -20159 -26100 -27952 -40794 -64581 -81938 -60652 -15712 24812 48999
8214D8999j1744j2039r674n2647p176K0523L54Q593J8032L6886N842m5883j6142
8201a6076L2299J3126k850j657l9964j4544n994K9638M382o2936j4315j1843L9301
8188e1433M8840K2968J2513L692o849j2595j7556J5602J2041j629J8586j3502
8176C0678n3727j7303K1735l1733K0704L1637P470q708Q465J3661K3452k7926
8164A8405Q473l3594j004J7682n0558n829L1093J8453K2812L010m1685k7276j137
8151d1155J4630L3996Q034j6878O256K79L0608j8621l6122N567K2775j7631l812
8138a2074k8418J0407j566j625K0186M3936l3277L1425J903j409r593o205j1o1525
8124d7846L5560J3812L023m9700l9157M133J6575L0080L366k6701M0277K1928
$$ plain form
8214 48999 37255 25216 15542 -37105 -44281 -23758 -23404 -14811 3221 40107 45949 66 -16076
8201 -16076 16223 29349 26499 24842 -15122 -29666 -35660 -6022 -1640 -64576 -78891 -90734 -51433
8188 -51433 -2593 20375 32888 36580 29731 17136 -420 15182 27223 25594 44180 30678
8176 30678 -23049 -40352 -18617 -50350 -29646 1991 9461 753 9218 22879 46331 18405
8164 18405 26878 -6716 -7720 9962 -40596 -46425 -15332 3121 25933 28943 -12742 -40018 -41155
8151 -41155 -26525 7471 15505 -1373 4883 5162 35770 17149 -18973 -13406 9369 -8262 -12074
8138 -12074 -40492 -30085 -31651 -33276 -13090 30846 -2431 28994 30897 29488 19895 13690 13679 -47846
8124 -47846 -12286 1526 4549 -45151 -84308 -80175 -63600 -33520 -30154 -56855 -16578 5350
8112E350J5483j5123M323j8870j111p930q160r237R716Q980n235L2549N5586l5987
8098C0334j9467L1015j2894j0266p959j5014l589J8791P433j5095j6662m2812
8086e6185j7441L6112N0550r10l5786o0758O86M5234j944k281K9861L3738M995
8073B5871Q189N894O196k6542k9214m6012J7497L4189J4933l1008P105J9887l503
8060C482R474l7648k1614k6770K0148J1608K2717J2578l0731o22L6764J1217m2681
8047c2078j6844J4420J0528j1473P448N1626l8757l0150R371r39l4177j256j771
8034g4052o743L3875N9476m354j7086N384j2952j0762k300j74N689N6356M9661
8021H2018l8264l7163j9469r036M280P1894K9165o7759m3382n2054R136N5136
$$ plain form
8112 5350 20833 5710 10033 -8837 -9948 -17878 -26038 -35275 -25559 -16579 -21814 10735 66321 30334
8098 30334 10867 41882 28988 18722 10763 -4251 -7840 10951 18384 3289 -13373 -56185
8086 -56185 -73626 -37514 13036 12126 -23660 -84418 -83732 -38498 -40442 -42723 -12862 20876 25871
8073 25871 34060 39954 46150 19608 -9606 -55618 -38121 -3932 11001 -20007 -12902 6985 3482
8060 3482 12956 -24692 -46306 -73076 -52928 -41320 -18603 -6025 -36756 -37378 -614 10603 -32078
8047 -32078 -48922 -34502 -23974 -35447 -27999 23627 -15130 -45280 -35909 -36848 -71025 -72281 -74052
8034 -74052 -80795 -46920 12556 8202 -8884 -3500 -16452 -27214 -29514 -29688 -23999 32357 82018
8021 82018 43754 6591 -12878 -21914 -17634 54260 83425 15666 -27716 -79770 -70634 -15498
8009a5498m956J3025L714k6960l0159j8928J8955O8920O3209m5231k0959J4898
7997B0030K5054R533n091q844M739J5520L0046l1753q1360K2603J8329L2901K1334
7984G3041r411j6337k2286M3036R335K5743l0893j0357J7877l8670n5598Q425
7972f095P103J3280N084m3420k8776J0764N838j8102J6494P8808J7251m4149J2782
7959B6862Q1355K4686p3201k3066J9937K1882J8946n716j733L1440M639j5719
7947A10312m4369j2751m1256j6872L6409Q589R412L0325J6041o0125k7374k2404
7935a4063M4937l936j9611R362p135l2639M152J0838J1558L1900K416n86n7726
7922b0533l1033k4531R870N184J7606J3618M550j1478j8343j9872O0019O7880
$$ plain form
8009 -15498 -20454 -7429 -3715 -30675 -60834 -79762 -60807 8113 71322 26091 5132 20030
7997 20030 45084 54617 49526 40682 45421 60941 90987 59234 -22126 477 18806 51707 73041
7984 73041 63630 47293 25007 68043 77378 103121 72228 61871 79748 41078 -14520 -6095
7972 -6095 1008 14288 19372 -24048 -52824 -42060 -36222 -54324 -37830 40978 58229 14080 26862
7959 26862 108217 132903 59702 36636 56573 78455 97401 91685 89952 121392 126031 110312
7947 110312 65943 53192 11936 -4936 31473 40062 49474 79799 95840 35715 8341 -14063
7935 -14063 30874 26938 7327 16689 9554 -23085 -18933 -8095 3463 35363 37779 37193 -20533
7922 -20533 -51566 -76097 -66227 -61043 -43437 -29819 -25269 -36747 -55090 -74962 -14943 52937
7910E2937p085l2460l1879l5646j593j4686L4751L2581k1583K1432J921l021j2383
7897a6714o012O1213L4898k7903q746K2699j4470p335L0184O393J5856j6896l9393
7884C3774j6448j3731j6204m1247k7451L7065O3014j7305j6887j8294r506M4829
7872A609J5090O822j3847p680r411k1334l1371L900O816k617N693L9003j300M4474
7858C5847j7723k8780N0410J6110p946m5469n170J7484l3800k8948K3051K1785
7846c149J1252m9562l8717L1319L1243j8700m7782L4806O7828L6532m400K094
7834E2764k6415K7235j5744k1164k0687j7773j7906Q333J6762J0675O379k2774
7822b0315j3924R804j327Q494L794K3401m001N005K5859k7781k7125p956M5727
$$ plain form
7910 52937 45852 13392 -18487 -54133 -55726 -70412 -35661 -3080 -24663 -3231 -1310 -4331 -16714
7897 -16714 -22726 38487 73385 45482 36736 59435 44965 37630 67814 74207 90063 73167 33774
7884 33774 17326 3595 -12609 -53856 -81307 -44242 18772 1467 -15420 -33714 -43220 1609
7872 1609 16699 23521 9674 1994 -7417 -28751 -60122 -56222 -49406 -52023 -46330 -7327 -8627 35847
7858 35847 18124 -10656 39754 55864 47918 2449 -2721 14763 -19037 -47985 -24934 -3149
7846 -3149 8103 -41459 -80176 -48857 -17614 -36314 -84096 -49290 18538 55070 50670 52764
7834 52764 26349 53584 37840 16676 -4011 -21784 -39690 -31357 -14595 -3920 2459 -20315
7822 -20315 -34239 -24435 -25762 -17268 -13474 9927 5926 10931 36790 9009 -18116 -26072 19655
7809A9655j1449j4972j8128K1329L1753j2697m0465L4816M5870k9509l8605p939
7797b0341k3993l5201K7098J2420P483j527k4021J6762N862j1990J5565K0889
7785a0994j3908k4858L8882N1492l660n5068o872O1656M7454L0579j6844J194
7773I9053n0644n7088p755l944l699O320k47L5272q205k7476K8862K1554l3184
7760a181j62k0916n0737L0394L8729K3376l5363j6985j7688J5962L0388k2833
7748b7016k7156M3144K1297j9540J8647N1558O331m1528m4J3724m5736k1602J730
7735b6191L0615K0538j3115k7297J2489M5447M7200k9297l5658n164j3766J1155
7723A6956l3604k3913k5063M3127K9161q555L6966M5970n3338m9109J9897M8763
$$ plain form
7809 19655 8206 -6766 -24894 -3565 28188 15491 -24974 9842 55712 26203 -12402 -20341
7797 -20341 -44334 -79535 -52437 -40017 -32534 -34061 -58082 -41320 -35458 -47448 -31883 -10994
7785 -10994 -24902 -49760 -10878 40614 36954 -18114 -24986 36670 84124 114703 97859 99053
7773 99053 48409 -8679 -16434 -20378 -24077 -17757 -18004 17268 9063 -18413 10449 32003 -1181
7760 -1181 -1343 -22259 -72996 -42602 -3873 19503 -15860 -32845 -50533 -34571 -4183 -27016
7748 -27016 -54172 -11028 10269 -9271 9376 60934 67265 25737 25693 39417 -6319 -27921 -26191
7735 -26191 4424 24962 11847 -15450 -2961 42486 89686 60389 24731 19567 5801 16956
7723 16956 -16648 -40561 -65624 -22497 6664 -1891 35075 81045 27707 -21402 -1505 47258
7711D7258K0873j9980L497q395q243J0962J4467j841k5369m8054j652K3446K343
7698I312J918Q126O200N027l1322k2499k6408n1967r522m509J8654K9276K7788
7685c9926M8612J8003j2161o594K279j9950j8717Q838K0801k7692m594K9018M5904
7672D3821j1048m8588k8896K451R264l806O38l9677J9912O0290L1191j7960k2132
7659d540k7085l818j5748K0650J5212m5114n013M0924K8968j4816J0465K5020
7647B5105J1322k8857k0474L2786N3902j3006k1385m3848l2434N489j5385k701
7635d9486j2193J9794p02k1095r496P179j2772M3074P727O062L4896K8072K4443
7622F5503J8936j0815l2127l3905k9218J8539K0652M8925p658j7022J0319L664
$$ plain form
7711 47258 68131 48151 51648 43253 35010 45972 60439 58598 33229 -14825 -16477 6969 9312
7698 9312 11230 19356 25556 30583 -739 -23238 -49646 -101613 -111135 -115644 -96990 -67714 -39926
7685 -39926 8686 26689 14528 7934 10213 -9737 -28454 -19616 1185 -26507 -31101 -2083 43821
7672 43821 32773 -15815 -44711 -42260 -32996 -36802 -36164 -75841 -55929 4361 35552 17592 -4540
7659 -4540 -31625 -35443 -51191 -30541 -15329 -60443 -65456 -24532 4436 -10380 85 25105
7647 25105 36427 7570 -12904 19882 73784 60778 39393 -4455 -36889 -31400 -46785 -49486
7635 -49486 -61679 -41885 -42587 -63682 -73178 -65999 -78771 -35697 -27970 -21908 12988 41060 65503
7622 65503 84439 73624 41497 7592 -21626 -3087 17565 66490 58832 41810 52129 55793
7610E5793n8869j9815J2095J6364n1184J4248N1566l4m1734n9565n359K0509k7693
7597i3678j1063R08L8067L5455Q090k8260P619N9224J8801n4k2569o1937L6306
7584a3091q545J6708M2949K6891q288j7482l2900p3758J6766M1431J830J3168
7572E679M617j5051j6860j8240K8369M966j5591J4880l7185l5291r702Q9634J7797
7559A8022m1436k616K2327L3923j7429l4648o258J4458L3749k3724o048n211q746
7546b3637k2866k730J4818J6290K2738k1574k3425J4668K993j7469J1564J5109
7534a3521K366J603j7753K9442k619M853K5557L757J8346k427j6380r521k6431
7521b728K0231j500O568J5073j2647k798J1921k9901r676l7819M130J0278J4518
$$ plain form
7610 55793 -3076 -22891 -10796 5568 -45616 -31368 20198 20164 -21570 -81135 -86494 -65985 -93678
7597 -93678 -104741 -103833 -65766 -30311 -22221 -50481 -42862 16362 35163 35109 12540 -49397 -13091
7584 -13091 -21636 -4928 38021 64912 56624 39142 6242 -67516 -50750 -9319 -7489 5679
7572 5679 10296 -4755 -21615 -39855 -11486 -6520 -22111 -7231 -44416 -79707 -89409 225 18022
7559 18022 -23414 -26030 -3703 30220 12791 -21857 -28115 -13657 20092 -3632 -9680 -14891 -23637
7546 -23637 -46503 -49233 -34415 -18125 4613 -16961 -40386 -25718 -22725 -40194 -28630 -13521
7534 -13521 -11155 -9552 -27305 2137 -482 4371 29928 33685 52031 49604 33224 23703 -2728
7521 -2728 17503 16003 22571 37644 24997 22199 34120 4219 -5457 -43276 -39146 -28868 -14350
7508a4350N1388K166j447k8092Q739p707L6176K75l3254k7264j9127k9521J0903
7495e1115n661k7688k9306k6552K1161J8660P7756L6129R640j1172l194j271j5338
7482g951o078J0456J9337R474L0905j6515l1513o020j2173p998r722p412O2106
7469B6896L7160J4469K8281l2553m8752J0182L3871J099m5875j1275k3960r661
7457b0118j6145j7758K215J2507l6108J4492K5050N4591L1591K513q530j1963
7445C2337j4157m1915l8753j4856K3321n993J1267l2594n959k1184Q560N6569
7433d3357J9767J6631K9066j8967m3520j1810J3700m572l1304N6636J8929N55
7421A754k2539k3353m9933L695Q087L1648K8718r315K2735j6412k1416O459K3859
$$ plain form
7508 -14350 37038 39204 37757 9665 18404 10697 46873 47148 13894 -13370 -32497 -62018 -51115
7495 -51115 -56776 -84464 -113770 -140322 -119161 -100501 -22745 13384 23024 11852 8658 7387 -7951
7482 -7951 -14029 -3573 15764 25238 56143 39628 8115 2095 -10078 -18076 -27798 -35210 26896
7469 26896 64056 78525 106806 74253 25501 35683 69554 70653 24778 13503 -10457 -20118
7457 -20118 -36263 -54021 -51806 -39299 -75407 -60915 -35865 18726 50317 52830 44300 32337
7445 32337 18180 -23735 -62488 -77344 -54023 -60016 -48749 -81343 -87302 -108486 -99926 -43357
7433 -43357 -23590 -6959 22107 3140 -40380 -52190 -38490 -43062 -74366 -17730 1199 1754
7421 1754 -20785 -44138 -94071 -90376 -82289 -50641 -21923 -31238 -8503 -24915 -46331 -39872 -16013
7408a6013j6065L0936M4044n14p173l8751k8952K356j1096k5980J8287L3428P743
7395g750L3158P647j2099m8839j6159k7511r762J4850P1366K1281J7694k7652
7383A6224Q953n38m296k098l188m337R535J3323J7094j2971R741l2615r026k1245
7369a5444m5884l7592M329M9321N4797k2727L319o885L2917K0879m094o114k9139
7356b317J2086L0077L3320j3598k3955k1593j0116L2102R954L75j5693l6896l9693
7343d5947Q372R569J415J1140N0453O950q173m309j0929K148N0439N0986j9000
7330A03114n7733k0423m125N69j4709k8024M8352J0440k9848k7867k5969J1658
7318c4565M1491L121l1054k018P431k5288j6785J6883N3352N773R522L845k1504
$$ plain form
7408 -16013 -32078 -1142 42902 42388 35215 -3536 -32488 -30132 -41228 -67208 -48921 -15493 -7750
7395 -7750 25408 33055 20956 -27883 -44042 -71553 -81315 -66465 4901 26182 43876 16224
7383 16224 25177 24639 20343 18245 15057 10720 20255 33578 50672 37701 47442 14827 5801 -15444
7369 -15444 -61328 -98920 -94591 -45270 9527 -13200 -9881 -16766 16151 37030 32936 26822 -2317
7356 -2317 9769 39846 73166 59568 35613 14020 3904 36006 45960 46335 30642 -6254 -45947
7343 -45947 -37575 -28006 -26591 -15451 35002 41952 33779 29470 18541 20689 71128 122114 103114
7330 103114 45381 24958 20833 21402 6693 -21331 27021 37461 7613 -20254 -46223 -34565
7318 -34565 6926 10047 -21007 -23025 -15594 -40882 -57667 -40784 12568 18341 27863 31708 10204
7305A0204k1425j5915k8924O90K6662j2171j374L8284l0030N425L7992j6683k99
7292g564L8034k78K477J4799L6492l9873k6285l6014j9851n1653j2677L4016N0216
7279a8161K2984p848n601K6753J9978j3575m2305l1445L7612k153J9857k0974
7267a4878Q502Q376O133l406j376l1291N226K9037J5489Q799l6390j0503N1397
7254C5115k7795k7235l4141J4581J9982j0466K0520n340j0681K4220K7544n973
7242B0331K526K9607j6748k4395j984m0748k0269J7041O178k2785J6189L2838
7230b219K9412p774n4390m5425J7652j750K1445N2424j6158q8759R139L5595J9533
7217c1275J1261j3195l439J4751J3159q236J86j1679J4879K5056j4360J8862M797
$$ plain form
7305 10204 -11221 -27136 -56060 -55370 -28708 -40879 -42253 -3969 -33999 -28574 9418 -7265 -7564
7292 -7564 30470 30192 32669 47468 83960 44087 17802 -18212 -38063 -89716 -102393 -68377 -18161
7279 -18161 4823 -3025 -8626 18127 38105 24530 -17775 -49220 -11608 -13761 6096 -14878
7267 -14878 -6376 2000 8133 4727 3351 -27940 -22714 6323 21812 30611 -5779 -16282 35115
7254 35115 7320 -19915 -54056 -39475 -19493 -29959 -9439 -14779 -25460 -1240 26304 20331
7242 20331 22857 52464 35716 11321 9337 -31411 -51680 -34639 -28461 -51246 -35057 -2219
7230 -2219 27193 19419 -34971 -80396 -62744 -64494 -43049 9375 -6783 -95542 -86403 -50808 -31275
7217 -31275 -20014 -33209 -36648 -21897 -8738 -16974 -16788 -28467 -13588 11468 -2892 15970 20767
7204B0767m4242k1494o3987J5161N1677J8725k8699j86K4232K9602L5527N96j9735
7191A7944j933k1745j0395M6282J9735k5584Q91j467j090M025k3181k4715m043
7178b5276K0418J1049j2902j8483l3371k5399R243P5221M7489o262k432o656m2959
7165a0320J9556q074j4605m3009K2603P740m0912K4441N2796J8068J3703K3025
7153F5012m3819j6214K7961p906j8696K5081L9880l2128l270p712J3048O173l0224
7140A7186r419k0201o3158j1781J0844K0862J855j1840R023P300q497L6184K3414
7127A772K7344J8075N814J504l144j0084k9460l5311Q156L3420j225k4203l8443
7114d5785l2792K5097K0777J1699j6035j4830j9411J1364M9021O963k1818J9051
$$ plain form
7204 20767 -23475 -44969 -108956 -93795 -42118 -23393 -52092 -52278 -28046 1556 37083 37679 17944
7191 17944 16011 -5734 -16129 30153 49888 24304 25195 23728 22638 26663 3482 -21233 -25276
7178 -25276 -4858 6191 -6711 -25194 -58565 -83964 -74721 500 47989 41727 39295 32639 -10320
7165 -10320 9236 1162 -13443 -56452 -33849 -26109 -67021 -42580 10216 28284 41987 65012
7153 65012 21193 4979 32940 25034 6338 31419 71299 39171 35901 28189 41237 47410 17186
7140 17186 7767 -12434 -75592 -87373 -76529 -55667 -53812 -65652 -56629 -49329 -57826 -21642 1772
7127 1772 29116 47191 53005 54509 51365 41281 11821 -23490 -15334 18086 16861 -7342 -45785
7114 -45785 -78577 -53480 -32703 -21004 -37039 -51869 -71280 -59916 -10895 -3932 -25750 -6699
7102f699j2131M3010J8345n736j5830q860l1242N479l2438k4229J9974K4928l2235
7089e7664q077L1438J5479K226k1632J1728K2759N391M4301l962o498r710m1508
7076a5729K6547O3690J1653n4520p052L0894M1697l0572l0599m6607n9633J3249
7064e6982M779M4029J9498J3636j8794j1740L7171J3395k2443l7045l7448j4561
7052f6505J4027M2389k138Q481K9387l331m190k3796R847O595j3532k1472q981
7039c3219M735n752r091k8558J3361J9175j4313J8104L5711K9542k8486j3672
7027a2463j6579k7233K0613K322j6686K4432l749J0428J5404J3693Q727l463L2520
7014D7966l4628j5985K7874r823j0488J3110J6650M938m182k1680o871J9294J5696
$$ plain form
7102 -6699 -18830 24180 42525 36789 20959 12099 -19143 -13664 -46102 -70331 -50357 -25429 -57664
7089 -57664 -65741 -34303 -18824 -16598 -38230 -26502 -3743 1648 45949 41987 35489 25779 -15729
7076 -15729 10818 74508 86161 31641 24589 55483 97180 66608 36009 -10598 -70231 -56982
7064 -56982 -52203 -8174 11324 24960 6166 -5574 31597 44992 22549 -14496 -51944 -66505
7052 -66505 -52478 -10089 -12227 -3746 25641 22310 18120 -5676 4171 10766 -2766 -24238 -33219
7039 -33219 -28484 -34236 -43327 -71885 -58524 -39349 -53662 -35558 153 29695 1209 -12463
7027 -12463 -29042 -56275 -35662 -33340 -50026 -25594 -29343 -18915 -3511 10182 18909 15446 47966
7014 47966 13338 -2647 25227 15404 4916 18026 34676 39614 35432 13752 6881 26175 41871
7001D1871j3026K971O015r762k4197n514k955N746l957Q767p073J143j0030n252
6987a5253K7414j370K3978j5271j7171j746m845l3785L7501L5488L846j3668j1407
6974A3711L0044R6o579l3490l8251j6338O7450J3878N824j06n2059p560J4750
6961h630J5052J3113n206K2525L9721k0251m3532o8791j1439J1994L8625J2101
6949d718k4696k2072p808l5484m587R561K3459O013L0009n514M7732M3660k4533
6936C1022l5963j5857j9160p928J879K1828n9683j0676L7578L0490k3330M363
6924d5437J7170N0144M0192k1489o43k3749K544j889L6795j0160m169l1808m4730
6911c7229j4525k6185k7452K0826R616Q333J7724J8785L9886k7188J031N9296
$$ plain form
7001 41871 28845 31816 37831 28069 3872 -1642 -4597 1149 -2808 5959 -1114 29 -10001 -15253
6987 -15253 12161 10791 34769 19498 2327 581 -4264 -38049 -548 34940 38786 25118 13711
6974 13711 43755 43851 37272 3782 -34469 -50807 16643 30521 36345 36239 -15820 -23380 -8630
6961 -8630 6422 19535 14329 36854 76575 56324 12792 -55999 -67438 -55444 -16819 -4718
6949 -4718 -29414 -51486 -59294 -94778 -99365 -89804 -66345 -60332 -30323 -35837 11895 55555 31022
6936 31022 -4941 -20798 -39958 -47886 -46007 -24179 -83862 -94538 -56960 -26470 -49800 -45437
6924 -45437 -28267 21877 62069 40580 39937 16188 18732 16843 53638 43478 39309 7501 -37229
6911 -37229 -51754 -77939 -105391 -84565 -74949 -66616 -48892 -30107 9779 -17409 -16378 42918
6899D2918J7528k5991n7230J8800L3892m9475m2116J2731M3386J2699J7567L079
6887B7788L5957k9361j8409k187K3575K143j4284K5650m2581k1699K2607j6887
6875g688l1661n464J9753m22M9143P312o4844l4972L9228N2745p589p413J2336
6862B0464K5517J1429l2064K296r036o0512K708K4657l702k1294M007p660J0076
6849c3114R188o741J186P579j5632j5906L9183P600l3707m6815k4772K9395K8383
6836e4173J9070R474J7096J6299n606J6520N9584j4441l6671l0606J2934J2578
6824B2058P029k2107L0173j9056m7609L398K4782j5418K6958l31p008O721L0039
6811C9629L1096q61k6144j3371r003m9615l347J1132J0308j9991R068K2007L360
$$ plain form
6899 42918 60446 34455 -22775 -3975 29917 -19558 -61674 -48943 -5557 7142 24709 27788
6887 27788 63745 34384 15975 13788 37363 39506 25222 50872 8291 -13408 9199 -7688
6875 -7688 -39349 -44813 -25060 -25482 23661 30973 -33871 -68843 -29615 23130 15541 8128 20464
6862 20464 45981 57410 25346 27642 18606 -41906 -39198 -14541 -18243 -39537 -35530 -43190 -33114
6849 -33114 -23926 -30667 -29481 -21902 -37534 -53440 -14257 -6657 -40364 -87179 -111951 -82556 -54173
6836 -54173 -35103 -25629 -8533 7766 2160 18680 78264 63823 27152 -3454 9480 22058
6824 22058 29087 6980 37153 18097 -29512 -26114 -1332 -16750 10208 9877 2869 9590 39629
6811 39629 70725 69864 43720 30349 21346 -28269 -31616 -20484 -10176 -30167 -21099 908 4268
6798D268J1156O65m713J0537K0848J8078l575j4043J7132n5615j6361l678K5570
$$ plain form
6798 4268 15424 16089 11376 21913 42761 60839 57264 43221 60353 4738 -11623 -15301 10269
$$ [...]
##END NTUPLES=NMR SPECTRUM
##END=
