##TITLE=Analysis number 320651
Compound Code cc 45816
Book Reference 468/97
Project Code adrs
Chemist Name colinb
##JCAMPDX= 6.0         $$ Bruker NMR JCAMP-DX V2.0
##DATA TYPE= NMR SPECTRUM
##DATA CLASS= NTUPLES
##ORIGIN= Bruker BioSpin GmbH
##OWNER= nmr
$$ XWIN-NMR		Version 3.5
$$ Tue Jul  4 11:48:20 2006 GMT Daylight Time (UT+1h)  MAYBRIDGE\nmr@NMR_250MHZ
##.OBSERVE FREQUENCY= 250.131544655141
##.OBSERVE NUCLEUS= ^1H
##.ACQUISITION MODE= SIMULTANEOUS (DQD)
##.ACQUISITION SCHEME= undefined
##.AVERAGES= 16
##.DIGITISER RES= 18
##SPECTROMETER/DATA SYSTEM= dpx250
##.PULSE SEQUENCE= zg30
##.SOLVENT NAME= CDCl3
##.SHIFT REFERENCE= (INTERNAL, CDCl3, 0, 16.522)
##AUDIT TRAIL= $$ (NUMBER, WHEN, WHO, WHERE, WHAT)
$$ ##TITLE= Audit trail, XWIN-NMR		Version 3.5
$$ ##JCAMPDX= 5.01
$$ ##ORIGIN= Bruker BioSpin GmbH
$$ ##OWNER= nmr
$$ C:\u/data/dgb/nmr/ADRS/2190/pdata/1/auditp.txt
$$ ##AUDIT TRAIL=  $$ (NUMBER, WHEN, WHO, WHERE, WHAT)
(   1,<2006-07-04 11:47:52.26 +100>,<MAYBRIDGE\nmr>,<NMR_250MHZ>,
      <created by zg, POWCHK disabled, PULCHK disabled
       configuration hash MD5:
       E2 DF 36 D8 04 B2 41 60 5A D7 A3 38 5A 4B D0 FE
       data hash MD5: 64K
       42 EE FA D6 EC E3 B7 2F 8F 1F F0 E1 3D 7E 6E F4>)
(   2,<2006-07-04 11:48:09.20 +100>,<MAYBRIDGE\nmr>,<NMR_250MHZ>,
      <Start of raw data processing
       ef LB = 0.3 FT_mod = 6 PKNL = 1 SI = 32K 
       data hash MD5: 32K
       35 E0 56 DD 94 EC E6 87 18 4E 27 5C 85 E2 36 7B>)
(   3,<2006-07-04 11:48:11.06 +100>,<MAYBRIDGE\nmr>,<NMR_250MHZ>,
      <apk 
       data hash MD5: 32K
       3C 13 66 DE F2 97 30 ED A0 69 56 95 38 6F DE A2>)
(   4,<2006-07-04 11:48:11.90 +100>,<MAYBRIDGE\nmr>,<NMR_250MHZ>,
      <abs ABSG = 5 
       data hash MD5: 32K
       20 2F 25 78 0E 0D 2D C9 4E D0 4A 8C 1F 83 C2 D3>)
$$ ##END=
$$ 
$$ hash MD5
$$ 1C 7D 41 A8 75 52 F4 7E D9 D8 A1 EE E3 64 A4 79
##$RELAX= 
##$RELAX= 
##$RELAX= 
##$RELAX= 
##$RELAX= 
##$RELAX= 
##$RELAX= 
$$ Bruker specific parameters
$$ --------------------------
##$DU= <C:\u>
##$EXPNO= 2190
##$NAME= <ADRS>
##$PROCNO= 1
##$TYPE= <nmr>
##$USER= <dgb>
##$AMP= (0..31)
100 100 100 100 100 100 100 100 100 100 100 100 100 100 100 100 100 100 
100 100 100 100 100 100 100 100 100 100 100 100 100 100 
##$AQSEQ= 0
##$AQ_mod= 3
##$AUNM= <au_zg>
##$AUTOPOS= <19 >
##$BF1= 250.13
##$BF2= 250.13
##$BF3= 250.13
##$BF4= 250.13
##$BF5= 500.13
##$BF6= 500.13
##$BF7= 500.13
##$BF8= 500.13
##$BYTORDA= 1
##$CFDGTYP= 0
##$CFRGTYP= 5
##$CHEMSTR= <none>
##$CNST= (0..31)
1 1 145 1 1 1 1 1 1 1 1 1 1 1 1 1 1 1 1 1 1 1 1 1 1 1 1 1 1 1 1 1 
##$CPDPRG= <>
##$CPDPRG1= <>
##$CPDPRG2= <>
##$CPDPRG3= <>
##$CPDPRG4= <mlev>
##$CPDPRG5= <mlev>
##$CPDPRG6= <mlev>
##$CPDPRG7= <mlev>
##$CPDPRG8= <mlev>
##$CPDPRGB= <>
##$CPDPRGT= <>
##$D= (0..31)
0 1 0 0 0 0 0 0 0 0.06 0 0 0 0 0 0 0.0002 0 0 0 0 0 0 0 0 0 0 0 0 0 0 
0 
##$DATE= 1152010071
##$DBL= (0..7)
120 120 120 120 120 120 120 120 
##$DBP= (0..7)
150 150 150 150 150 150 150 150 
##$DBP07= 0
##$DBPNAM0= <>
##$DBPNAM1= <>
$$ [...]
##$SUBNAM7= <"">
##$SUBNAM8= <"">
##$SUBNAM9= <"">
##$SW= 20.6930455092707
##$SWIBOX= (0..15)
0 0 3 0 0 0 0 0 0 0 0 0 0 0 0 0 
##$SW_h= 5175.983436853
##$TD= 65536
##$TD0= 1
##$TE= 296.16
##$TE2= 300
##$TE3= 300
##$TEG= 300
##$TL= (0..7)
0 120 120 120 120 120 120 120 
##$TP= (0..7)
150 150 150 150 150 150 150 150 
##$TP07= 0
##$TPNAME0= <>
##$TPNAME1= <>
##$TPNAME2= <>
##$TPNAME3= <>
##$TPNAME4= <>
##$TPNAME5= <>
##$TPNAME6= <>
##$TPNAME7= <>
##$TPOAL= (0..7)
0.5 0.5 0.5 0.5 0.5 0.5 0.5 0.5 
##$TPOFFS= (0..7)
0 0 0 0 0 0 0 0 
##$TUNHIN= 0
##$TUNHOUT= 0
##$TUNXOUT= 0
##$USERA1= <user>
##$USERA2= <user>
##$USERA3= <user>
##$USERA4= <user>
##$USERA5= <user>
##$V9= 5
##$VALIST= <valist>
##$VCLIST= <CCCCCCCCCCCCCCC>
##$VD= 0
##$VDLIST= <DDDDDDDDDDDDDDD>
##$VPLIST= <PPPPPPPPPPPPPPP>
##$VTLIST= <TTTTTTTTTTTTTTT>
##$WBST= 1024
##$WBSW= 4
##$XGAIN= (0..3)
0 0 0 0 
##$XL= 0
##$YL= 0
##$YMAX_a= 338243
##$YMIN_a= -502689
##$ZGOPTNS= <>
##$ZL1= 120
##$ZL2= 120
##$ZL3= 120
##$ZL4= 120
##$ABSF1= 16.522
##$ABSF2= -4.171173
##$ABSG= 5
##$ABSL= 3
##$ALPHA= 0
##$AQORDER= 0
##$ASSFAC= 0
##$ASSFACI= 0
##$ASSFACX= 0
##$ASSWID= 0
##$AUNMP= <proc_1d>
##$AZFE= 0.1
##$AZFW= 0.1
##$BCFW= 0
##$BC_mod= 0
##$BYTORDP= 0
##$COROFFS= 0
##$CY= 12.5
##$DATMOD= 1
##$DC= 0
##$DFILT= <>
##$DTYPP= 0
##$F1P= 14.0000005364418
##$F2P= -0.99999901652339
##$FCOR= 0.5
##$FTSIZE= 32768
##$FT_mod= 6
##$GAMMA= 0
##$GB= 0
##$INTBC= 1
##$INTSCL= 1
##$ISEN= 128
##$LB= 0.3
##$LEV0= 0
##$LPBIN= 0
##$MAXI= 10000
##$MC2= 0
##$MEAN= 0
##$ME_mod= 0
##$MI= 0
##$NCOEF= 0
##$NC_proc= -3
##$NLEV= 6
##$NOISF1= 0
##$NOISF2= 0
##$NSP= 0
##$NTH_PI= 0
##$NZP= 0
##$OFFSET= 16.522
##$PC= 1
##$PHC0= 165.4755
##$PHC1= 10.07022
##$PH_mod= 1
##$PKNL= yes
##$PPARMOD= 0
##$PSCAL= 4
##$PSIGN= 0
##$REVERSE= no
##$SF= 250.13
##$SI= 32768
##$SIGF1= 0
##$SIGF2= 0
##$SINO= 400
##$SIOLD= 32768
##$SREGLST= <1H.CDCl3>
##$SSB= 0
##$STSI= 32768
##$STSR= 0
##$SW_p= 5175.98343685301
##$SYMM= 0
##$S_DEV= 0
##$TDeff= 65536
##$TDoff= 0
##$TI= <Analysis number 999999
Compound Code 99
Book Reference 9
Project Code 9>
##$TILT= no
##$TM1= 0
##$TM2= 0
##$TOPLEV= 0
##$USERP1= <user>
##$USERP2= <user>
##$USERP3= <user>
##$USERP4= <user>
##$USERP5= <user>
##$WDW= 1
##$XDIM= 32768
##$YMAX_p= 420849146
##$YMIN_p= -249351
$$ End of Bruker specific parameters
$$ ---------------------------------
##NTUPLES= NMR SPECTRUM
##VAR_NAME=  FREQUENCY,     SPECTRUM/REAL,   SPECTRUM/IMAG
##SYMBOL=    X,             R,               I
##VAR_TYPE=  INDEPENDENT,   DEPENDENT,       DEPENDENT
##VAR_FORM=  AFFN,          ASDF,            ASDF
##VAR_DIM=   32768,         32768,           32768
##UNITS=     HZ,            ARBITRARY UNITS, ARBITRARY UNITS
##FACTOR=    0.157963299565203, 1,           1
##FIRST=     4132.6476996994, 0,             0
##LAST=      -1043.33573715361, 0,           0
##MIN=       -1043.33573715361, -249351,     0
##MAX=       4132.6476996994, 420849146,     0
$$ Real data points
##PAGE= N=1
##DATA TABLE= (X++(R..R)), XYDATA
$$ [...]
18358A996751o2739q1767p1500n2322r0686K099K6088m6895n1629m418k4204n9111
18346A479667o7700n8645j1424j4694l8464n2082l2697j1088m5720j8601m2017
18335A086535m0563l24o017Q2537K6586J7983p3720j800k5504n9350m875K009
18323A003497o6783k1426l7718j9012j3877M0710m8063l1067j0713q0930L1512
18312G46130k329J2827j9505o1640K0134P4338R887j372r673r134L3355k2060
18300G70958q9005l7796K0633m5978j4160L270l1938o6499n0964J3301j0099o618
18288D55105o318n958L0036k1271l3593k0044j8855n580j6430M9835M8440k3623
18276D31744m5155N0693J8710o2392k7592j9848K7578k186k8584J4113n0634l3958
$$ y = [1996751, 1934012, 1852245, 1780745, 1728423, 1637737, 1639836, 1665924, 1619029, 1567400, 1562982, 1538778, 1479667, 1411967, 1353322, 1341898, 1327204, 1288740, 1236658, 1203961, 1192873, 1147153, 1128552, 1086535, 1045972, 1045648, 1039631, 1122168, 1148754, 1166737, 1093017, 1091217, 1065713, 1006363, 1001488, 1003497, 936714, 915288, 877570, 858558, 844681, 885391, 837328, 806261, 795548, 714618, 746130, 743801, 756628, 737123, 675483, 695617, 769955, 779842, 778470, 768797, 759663, 793018, 770958, 681953, 644157, 664790, 618812, 604652, 607922, 575984, 509485, 458521, 471822, 461723, 455105, 448787, 442829, 472865, 451594, 418001, 397957, 379102, 373522, 357092, 406927, 455367, 431744, 386589, 437282, 455992, 393600, 366008, 346160, 373738, 371552, 342968, 357081, 306447, 272489]
18264B72489L0872R5501O4797M4306K0830k1282Q102k8291L5088J4457R916j9188
18252E27597o2980l7554R990k1589p40M7489K7965K3797Q626l6129m3062Q734
18240D52144k7208L387N1580k1423K3214n311L2983M3154k7446r276J4045N1759
18228E81602J2086j1434n5863k5801K6386M3087M4173Q3068K9548r756r4011o2662
18216E60423O5377J3889n3513k3116L0379j3430Q7057J50426J4612o3722j5690
18205G52692P848j971R84N0731l0664K451n589k0215N3672M4129m3085K7128L0762
18192H68873M3127j5220R608l0936q6262K1674M1846R237L8618J33024P3727J3145
18180A120461J31036J44403N1705J00694R6187l8619j7584J8850M9103J24086
$$ y = [272489, 303361, 398862, 463659, 507965, 528795, 507513, 515615, 487324, 522412, 536869, 546785, 527597, 464617, 427063, 437053, 415464, 414724, 462213, 490178, 513975, 522601, 486472, 443410, 452144, 424936, 428323, 479903, 458480, 481694, 476383, 509366, 552520, 525074, 515798, 529843, 581602, 593688, 582254, 526391, 500590, 526976, 570063, 614236, 697304, 726852, 717096, 623085, 560423, 625800, 639689, 586176, 563060, 593439, 580009, 667066, 817492, 832104, 768382, 752692, 760540, 758569, 759553, 810284, 779620, 782071, 776482, 756267, 809939, 854068, 810983, 838111, 868873, 912000, 896780, 906388, 875452, 789190, 810864, 852710, 861947, 900565, 1033589, 1107316, 1120461, 1251497, 1395900, 1447605, 1548299, 1644486, 1605867, 1588283, 1607133, 1656236, 1780322]
18170A780322P7362M1975j2967j5972r7631n253O6254R8512k1552K3951R6665
18159B031666O3518L8441J02286J67957K49752K77677L17281K81470L74121O24085
18149D528254P54463R80878J321374J903960K910197M440535O299415P499783
18141C0638859O878961M613689R23610m043628o532873p176487o479007m280840
18133A4542284k537613j543958r82075o27368m56876k57015o3888n1970R4941
18124H116462K10073J89447K55115K93604L51177M64525O11424R73345J397877
18115A2863049K020960L348881N577752R258207J3942423J5999558J0469564p4549
18107G3405845p587852j5341591j5163971q807601m538254k262915q87894L6469
$$ y = [1780322, 1857684, 1899659, 1886692, 1870720, 1773089, 1767836, 1834090, 1932602, 1911050, 1935001, 2031666, 2095184, 2133625, 2235911, 2403868, 2653620, 2931297, 3248578, 3530048, 3904169, 4528254, 5282717, 6263595, 7584969, 9488929, 12399126, 16839661, 23139076, 30638859, 37517820, 42131509, 43055119, 39011491, 32478618, 25302131, 18823124, 14542284, 12004671, 10460713, 9478638, 8851270, 8394394, 8137379, 8073491, 8021521, 8116462, 8326535, 8515982, 8771097, 9064701, 9415878, 9880403, 10491827, 11465172, 12863049, 14884009, 18232890, 23810642, 33068849, 47011272, 63010830, 73480394, 73405845, 65817993, 50476402, 35312431, 26504830, 21966576, 19703661, 18815767, 18852236]
18099A8852236R48290K103831L511972N246441O429755O191942M974145K934963
18091E1193575O01239M28297M9934m88326j344345l988592o140814o590248o299649
18082B7421071m388349k494342j273445n27218O6146O25968J259099K119548L204408
18073B6012886M695002O534450Q156026Q679106P589523M668413L59467l915953
18065F2778920p188232q556929q163449o606996m586051k810808j532078n79314
18057B2755063J49513R45972J816351L072210M853303O843531Q621356R262467
18049E8319766Q127463N271856J119067k703066n177624n369817m020731k839613
18041E2727301k676384l373528n229666o333698n762239n039750l572696k334475
$$ y = [18852236, 19800526, 21904357, 25416329, 30662770, 37092525, 43284467, 48258612, 51193575, 51794814, 52223111, 52273045, 51784719, 50440374, 46451782, 40310968, 33720720, 27421071, 23032722, 20538380, 19264935, 18737717, 18803863, 19429831, 20688930, 22808478, 26012886, 30707888, 37242338, 45398364, 54077470, 61666993, 66335406, 66694873, 62778920, 55590688, 47033759, 38870310, 32263314, 27677263, 24866455, 23334377, 22755063, 22904576, 23850548, 25666899, 28739109, 33592412, 40435943, 49057299, 58319766, 66447229, 71719085, 72838152, 70135086, 64957462, 59587645, 55566914, 52727301, 50050917, 46677389, 41447723, 35114025, 29351786, 24312036, 20739340, 18404865]
18033A8404865j581804j109474p91927o81702n27028n53211n08736m64961m18847
18024A1767175l77996l05509k70566l49104l58056m30508m49338n00629m73346
18015H252123l57100l24130k87345j99371j57815j95668k09608k65559k84667
18006E970860k24878j46645r4386n0434n9490j11046p7880j49910k36229k32824
17996D587138k93954k29131j84015j42760j14682j43262j75729j94533j12873
17987B996199o1035j19533j3942j6578j12774k2110m4173q6290j09392p5903o1809
17976B272660k4055J269o3798j28293n9426q1440n3787k4848l1873p476p4683
17965A724250q6377l2394n7027o3668j8791o8200j01986k7967p674j7910J4429
$$ y = [18404865, 16823061, 15713587, 14921660, 14239958, 13712930, 13159719, 12650983, 12186022, 11767175, 11389179, 11083670, 10813104, 10464000, 10105944, 9675436, 9226098, 8725469, 8252123, 7895023, 7570893, 7283548, 7084177, 6926362, 6730694, 6521086, 6255527, 5970860, 5745982, 5599337, 5504951, 5454517, 5395027, 5283981, 5206101, 5056191, 4819962, 4587138, 4293184, 4064053, 3880038, 3737278, 3622596, 3479334, 3303605, 3109072, 2996199, 2935164, 2815631, 2801689, 2785111, 2672337, 2650227, 2606054, 2519764, 2410372, 2334469, 2272660, 2248605, 2249874, 2186076, 2057783, 1998357, 1916917, 1863130, 1838282, 1806409, 1798933, 1724250, 1637873, 1605479, 1548452, 1484784, 1465993, 1397793, 1295807, 1267840, 1260166, 1242256, 1256685]
17954A256685o3670q4266n2985m0132j9186Q0379j957o2806L9580Q8528O5434
17943A205604j9105o7931K4786j4683j3863k4132k7728k2190l8396n5630r1182
17932H55550n5239o3097l5176p5259J6280j5682m4457M861n4805l8332m4536n0466
17920C99642J7583J600J4832J5110n4126j2990J0414l121J8762k7112k968l4871
17908C42755p770k097n1465Q280O4941m3827n2350L8449l877k0373N063L52N6561
17895C34642N5576p533k7056k7N6976L5920r384m2183j9746j9618L4651M1197
17883D33415m8666m1448m2635p6362l2534m7657l1563N7576O7983R775l5863O143
17871B18164m8888M090M5547M7668j3958j1087J1352M3552p661o4462p1106N5506
$$ y = [1256685, 1193015, 1108749, 1055764, 1015632, 996446, 1076825, 1074868, 1012062, 1051642, 1140170, 1205604, 1186499, 1118568, 1143354, 1128671, 1114808, 1090676, 1062948, 1040758, 1002362, 946732, 855550, 800311, 737214, 702038, 626779, 643059, 627377, 582920, 587781, 532976, 494644, 450108, 399642, 417225, 418825, 433657, 448767, 394641, 381651, 392065, 388944, 407706, 380594, 377626, 342755, 334985, 332888, 281423, 289703, 354644, 310817, 258467, 296916, 293039, 272666, 277729, 278081, 334642, 390218, 382685, 355629, 355602, 412578, 448498, 439114, 396931, 377185, 357567, 392218, 433415, 384749, 343301, 300666, 224304, 191770, 144113, 112550, 170126, 238109, 247884, 212021, 218164, 169276, 173366, 218913, 266581, 252623, 241536, 252888, 296440, 288779, 224317, 153211, 208717]
17859B08717L1950n8422j795N1201L528m0874r2047m2963O3253M0746o444m7510
17847A09340k7692l7625M5327M6393R040J3269J7515j3276K521L614J293k8095
17835A41624L5125M162k6334j0968Q238L0873O8310k6294m528k3006o9562k8305
17823I9335K3312K9009j1537j1331k9058L5990j4333J249l6933j7103j0677l4317
17811B3606K6791K419N4663N0647j2584l7014o1219Q867L7328L0530L0650N7465
17799B12149j5211o8001j8517j9398K4934O6185M6734R6004N1542J1687m1456
17788C46652J064k903l217j259j0363n042K0275o8474l8640m4583n863K1379M3191
17775B52217L931n5496J7812K2254K0767M0842k2159Q908k9154J6532k4103M7062
$$ y = [208717, 240667, 182245, 180450, 231651, 235179, 194305, 102258, 59295, 122548, 163294, 156850, 109340, 81648, 44023, 89350, 135743, 144783, 158052, 175567, 162291, 164812, 168426, 169719, 141624, 176749, 180911, 154577, 143609, 151847, 182720, 251030, 224736, 220208, 197202, 127640, 99335, 122647, 151656, 140119, 128788, 99730, 135720, 121387, 122636, 85703, 68600, 57923, 23606, 50397, 52816, 107479, 158126, 145542, 108528, 47309, 56176, 93504, 124034, 154684, 212149, 196938, 128937, 110420, 91022, 115956, 182141, 228875, 324879, 376421, 388108, 346652, 347716, 344813, 341596, 340337, 329974, 324932, 345207, 276733, 238093, 193510, 187647, 209026, 252217, 256148, 200652, 218464, 240718, 261485, 302327, 280168, 289076, 259922, 276454, 252351, 299413]
17763B99413J9875n8233l5391k2632o1368l3544j6576l1894r833P9329N4955m4848
17751A39253m2943k903j9927l3920P8O731N7858l0530j0992k488M2556l0973L1165
17738A02965q337M961K6479J6474n5121l6746J8207N5085j50k0208q674l4131
17726F0804J1616r767m3146r105K5988P3313N0296L9208L8553K3927m0365l1073
17714A90249J5104j4640p0854l6710q0775k9402L9224L4580L4830q810k5894j7227
17702B9675j3858l3669J4051L223J6487M330R3191M1404p1554p2317j6109o1258
17690f6404k4995Q0507J7320k5675J1707P288k2375J5901k2188k7572p792J7430
17678d6848M8982J7590L1660j3453m0035r913m237j7623N5801L453j9356l0046
$$ y = [299413, 319288, 261055, 225664, 203032, 141664, 108120, 91544, 59650, 49817, 129146, 184101, 139253, 96310, 93407, 73480, 39560, 39638, 46369, 104227, 73697, 62705, 60217, 102773, 71800, 102965, 94628, 99589, 126068, 142542, 87421, 50675, 68882, 123967, 123817, 103609, 94935, 60804, 72420, 62653, 19507, 10402, 36390, 109703, 159999, 199207, 237760, 261687, 221322, 190249, 205353, 190713, 119859, 83149, 2374, -27028, 12196, 46776, 81606, 72796, 46902, 29675, 15817, -17852, -3801, -578, 15909, 20239, 113430, 154834, 83280, 10963, -5146, -66404, -91399, -10892, 6428, -19247, -7540, -252, -22627, -6726, -28914, -56486, -64278, -46848, 2134, 19724, 51384, 37931, -2104, -12017, -16254, -33877, 21924, 25377, 6021, -24025]
17666b4025N608k7296k1678K7246O2043L3469J5906J6973l4681Q4005P9381k8475
17654A88476m9096k0587j7781J2691Q14J03300K5433o3277l462J6394M0107K7888
17642B60900k9407n3181l8265j4207M4465L8605q867J5009J3660l1103n9380K882
17630A41111J9009l0885P81r788N1772N8751L8155J5761K3868j6776o4476m688
17618B22595n5213m1284J6163j8761N150l5191k4883J9294R798k6179j4127J0036
17606F7398q3556J1059L7262J5828K3065L0127K4761l2539j3792O357O208L3709
17594A25887j9945k9269M7646j8241L191l7596k9771l5201J1217L6620L5430m179
17582H5789J199N1163L3847K4706J573j0280k3224N7623j6852m4514j4716L8785
$$ y = [-24025, -18417, -45713, -67391, -40145, 21898, 55367, 71273, 88246, 53565, 137570, 216951, 188476, 139380, 118793, 101012, 113703, 114517, 217817, 243250, 179973, 176511, 192905, 233012, 260900, 231493, 178312, 140047, 125840, 170305, 208910, 200043, 215052, 228712, 197609, 138229, 141111, 160120, 129235, 130016, 120228, 172000, 230751, 268906, 284667, 308535, 291759, 227283, 222595, 167382, 126098, 142261, 123500, 128650, 93459, 68576, 87870, 97668, 71489, 57362, 67398, -16158, -5099, 32163, 47991, 71056, 101183, 125944, 93405, 79613, 85970, 92178, 125887, 105942, 76673, 124319, 106078, 109269, 71673, 41902, 6701, 17918, 54538, 89968, 85789, 86988, 138151, 171998, 196704, 198277, 187997, 164773, 222396, 205544, 161030, 146314, 185099]
17570A85099M412l0502Q23k9210o163K4618K7828K1029J7747M7501N5550N1677
17558C70409J30392M0401k3408j1654q153K3610o9642m5347J7642j2315q7541
17547C24394j44461o6850K06l854M5628K3350P3495Q7074R043K6836O8701N1344
17535D94906n0653r2557K2703J9432J3020l6638o1056j4707M5108o6070J9402
17524B92890K1292L8077o4082r3231K2727K1913r5544o2374m2794l3846K4464
17513B9492Q8399J9525K6676N571j2151k7288L0282m7337k9317l2800k1509j6251
17501A3292q968P801K3588Q4977K68j645L604J764k603L3528J7145L0527J17645
17488C20923P3020j9142k341L4321l7177O5583m4050j32663q9568l7675l3685
$$ y = [185099, 189511, 159009, 159832, 130622, 124459, 149077, 176905, 197934, 215681, 263182, 318732, 370409, 500801, 541202, 517794, 506140, 497987, 521597, 451955, 406608, 424250, 411935, 324394, 179933, 113083, 113289, 109435, 155063, 178413, 251908, 338982, 348025, 374861, 443562, 494906, 444253, 351696, 374399, 393831, 406851, 370213, 309157, 294450, 339558, 273488, 292890, 314182, 352259, 288177, 194946, 217673, 239586, 144042, 81668, 38874, 5028, 29492, 117891, 137416, 164092, 169663, 157512, 130224, 160506, 113169, 83852, 51052, 29543, 13292, 4324, 12125, 35713, 120690, 120958, 119313, 122917, 124681, 122078, 155606, 172751, 203278, 320923, 393943, 374801, 372460, 406781, 369604, 435187, 391137, 258474, 168906, 131231, 97546]
17477I7546l9514k6978O6297L3413m032L3327L8131L3215L7766k6307M30Q1012
17465C24306P5472L6729l8392j4078O346n4901p9138k6438n9811o1643O2353J3918
17453A84723M0387L1298l9161l1877Q766N804l2480K7745P2326O7666O6820N4364
17441D56381K3366r8068j11179J177J1473M484n3665n9141p2746k6544m3202n6228
17429b3892M9209N0111J2889L2569l5833k8678P7183O2117l9857o2012k5279o598
17417F1929P386m841J6856N4278J0828J610K776j2097O927n6134l8588q745j4794
17404B7391K2585M5848k7270Q894L3998J6894j3595M3181N2215P877m4333n6386
17392A17299L5295l327J2831j3397o6275q185N1519j306j02334j1553K7839K6844
$$ y = [97546, 58032, 31054, 97351, 130764, 126732, 160059, 198190, 231405, 269171, 242864, 243294, 324306, 399778, 436507, 398115, 384037, 390383, 335482, 256344, 229906, 170095, 108452, 170805, 184723, 225110, 256408, 217247, 185370, 194136, 199940, 167460, 195205, 267531, 335197, 402017, 456381, 479747, 381679, 270500, 271677, 283150, 287634, 233969, 174828, 102082, 75538, 32336, -23892, 25317, 75428, 88317, 120886, 85053, 56375, 133558, 195675, 155818, 93806, 68527, 61929, 69315, 64474, 81330, 135608, 146436, 148046, 150822, 138725, 145652, 89518, 50930, 42185, 27391, 49976, 95824, 68554, 77448, 111446, 128340, 114745, 157926, 210141, 218018, 173685, 117299, 152594, 149267, 162098, 148701, 82426, 74241, 125760, 124454, 22120, 10567, 38406, 65250]
17380F5250J7477j5490p787k8322K6274K7238o135O8586n24l1914k9363O6769
17368A52059k2409l5974k3037N29k2828K2278k88K659l0896r525K4542R0148K4505
17355A71763n4648K416L3487M835j3134l0880L5054J7542L3841r594j1252j7790
17343A61640M7336j8243k2672J810j1952K2061N5587k3323n4331K551M6312J3716
17331B20492m1399l4368j5180P2604l038l3653q65J8370n832J4134P675p638N9524
17318B50826L9691L64o5378L3556P7544o614j6130L0916r3861p3344N7606L1283
17306B66459L2606m1526j2296P1315j681m360J2005j2331R619K416l5491m575
17294B82160l8496R7752J20563L1492K6688l1252j0677P732J8200O686M2519o161
$$ y = [65250, 82727, 67237, 59450, 31128, 57402, 84640, 78505, 147091, 146567, 114653, 85290, 152059, 129650, 93676, 70639, 71168, 48340, 70618, 70330, 72989, 42093, 32568, 57110, 147258, 171763, 117115, 119531, 153018, 157853, 144719, 113839, 148893, 166435, 200276, 190682, 179430, 161640, 208976, 190733, 168061, 169871, 157919, 179980, 235567, 212244, 157913, 160464, 206776, 220492, 179093, 144725, 129545, 202149, 199111, 165458, 164593, 182963, 177131, 191265, 198940, 191302, 250826, 290517, 290881, 225503, 259059, 336603, 329989, 313859, 344775, 250914, 177570, 235176, 266459, 299065, 257539, 245243, 316558, 314877, 310517, 322522, 310191, 319810, 322226, 286735, 282160, 243664, 341416, 461979, 493471, 520159, 488907, 478230, 485962, 504162, 510848, 553367, 547206]
17282E47206k873P2259l2198m781K9134l582k1419l2732l3249L6390M0591J7887
17270F12633O6310K5522k4962R9737R5486P857J1421Q2559J5214R3178J11970
17259A196925J16723J01459J35719J55699J45652J33930J47984J75569J70778
17250B480438J76578J74157K34990K15380K82548M31028M26532M78793N38561
17241E439005P89434J129446J523216K147719L250532M941337O891633Q202951
17233C4315273O983323L658239O89195j089775o16917J502651J310906j578170
17225D5174725m640539p175027p136672m676423k537771j034535N6353J126287
17217A9156398K459965M301650O359002P362669N904406K560524j06547j498003
$$ y = [547206, 544333, 616592, 584394, 579613, 608747, 605165, 583746, 551014, 517765, 554155, 594746, 612633, 678943, 704465, 679503, 779240, 874726, 882583, 894004, 976563, 991777, 1084955, 1196925, 1313648, 1415107, 1550826, 1706525, 1852177, 1986107, 2134091, 2309660, 2480438, 2657016, 2831173, 3066163, 3281543, 3564091, 3995119, 4421651, 4900444, 5439005, 6228439, 7357885, 8881101, 11028820, 14279352, 19220689, 26112322, 34315273, 41298596, 44956835, 45646030, 44556255, 43939338, 45441989, 46752895, 45174725, 40534186, 33359159, 26222487, 21546064, 19008293, 17973758, 18030111, 19156398, 21616363, 25918013, 32277015, 39639684, 45544090, 48104614, 47998067, 46500064]
17209D6500064o79518J124700K01550k820533n569872p776804p198109m828179
17201A8953299k960172j898591j250333r72074p93802o51890m55055m37023n09752
17192I024607m41069l51090l42777l43901l12266l19273l17768l85008m03769
17183E807686l92391j90451j85728j71185m5571q7020j75157j74712j77118k01731
17173D006622j72620j21771j23528j21339q8613p6192j29502j90075j63719p9108
17163B740155k1996q5674q0955o9276j13015j20275r6360o6898l0524k0793q2863
17152A951526p7642n5503l6597l166m6334j2521q7586q3882n123p834j20091n9381
17140A355866l051l8454n5029n4887l0024m773o4273j8898l2333m8290L9682l7046
$$ y = [46500064, 45820546, 46945246, 47146796, 44326263, 38756391, 30979587, 23781478, 18953299, 15993127, 14094536, 12844203, 11872129, 11078327, 10426437, 9971382, 9534359, 9024607, 8583538, 8232448, 7889671, 7545770, 7233504, 6914231, 6596463, 6211455, 5807686, 5415295, 5224844, 5039116, 4867931, 4822360, 4735340, 4560183, 4385471, 4208353, 4006622, 3834002, 3712231, 3588703, 3467364, 3378751, 3302559, 3173057, 2982982, 2819263, 2740155, 2718159, 2632485, 2551530, 2482254, 2369239, 2248964, 2152604, 2085706, 2055182, 2034389, 1951526, 1873884, 1818381, 1781784, 1778618, 1732284, 1719763, 1632177, 1548295, 1543172, 1535338, 1415247, 1355866, 1352815, 1314361, 1259332, 1204445, 1174421, 1169648, 1105375, 1086477, 1054144, 1005854, 1045536, 1008490]
17128A008490j03386m1586K5188J3204l0982j7605l0721l660l5625o9187J1899
17117G26029j378j14736j5564k8366k3688K465m1997p0619m2833J6648M6018J7081
17105D69060m220J5802l7947l8532J3860O7730m0911n7684l3009r9732n4951J9085
17093B18551K1695k4233N403j0478m1783J8063o916O805m1849j5223J9959L9531
17081A89525n6096p4708o9804N49M1912O9757K1693j8919p1229o329L8327K6998
17069I1676m1037R131L1595j334j1485k4232N1957O909n2431m4887p7766J6309
17057d5595L6294j0846j7595k8429L2722P0751p983O667L1767L9799k7855l2906
17045D6791K6543k350l1395j3371k3720J9994o412K2165M4602l6530m4514q289
$$ y = [1008490, 905104, 863518, 888706, 901910, 870928, 853323, 822602, 818942, 783317, 714130, 726029, 724651, 609915, 594351, 565985, 542297, 544762, 502765, 432146, 389313, 405961, 451979, 469060, 464840, 480642, 442695, 404163, 418023, 485753, 444842, 387158, 354149, 254417, 199466, 218551, 240246, 216013, 221416, 210938, 169155, 187218, 180302, 187107, 145258, 130035, 149994, 189525, 133429, 58721, -11083, -10534, 31378, 101135, 122828, 103909, 32680, 26351, 64678, 91676, 50639, 59770, 91365, 90031, 78546, 54314, 106271, 113180, 60749, 15862, -61904, -45595, -9301, -20147, -37742, -66171, -33449, 37302, 29319, 35986, 67753, 107552, 79697, 46791, 73334, 70984, 39589, 26218, 2498, 22492, 16080, 38245, 82847, 46317, 1803, -6486]
17033f486M1174J8549K6018J6995K7543j953M196L9747M5843l780n9683j1662
17021A36501j9140k8798j6786l918P960Q246R695r339j4344m6203J5414P068k3444
17008B2912j5984J9633k9920p5454N501M6206j7734O461Q5970n0098m4133L7199
16996i441K1089j3417l0239K3086N7242N5420k7308o0277m2304J6554O4268O53
16984E5326l1033m8690j9274O0965m2032l1201L5175N1560K3091l7433j5974o4203
16972f3723n7876L7883J03048M092m8135n3625j6244L5239j2348K0490J3823k3177
16960f0553N937K2264r309O1480M1122l0135l1413p0303n5029m2948L2816M0749
16948i5322R900L4197L7173m048M5570J65J9108q222q055m9331J9422j1569J369
$$ y = [-6486, 34688, 53237, 79255, 96250, 123793, 121840, 126036, 165783, 211626, 207846, 148163, 136501, 117361, 88563, 71777, 67859, 75819, 84065, 93760, 84421, 70077, 23874, 39288, 46356, 22912, 6928, 26561, -3359, -78813, -73312, -27106, -44840, -38379, 47591, -2507, -46640, -9441, 11648, -1769, -32008, -8922, 48320, 103740, 76432, 16155, -26149, -9595, 54673, 55326, 24293, -24397, -43671, 17294, -24738, -55939, -20764, 30796, 53887, 16454, 480, -63723, -121599, -83716, 19332, 23424, -24711, -78336, -94580, -59341, -71689, -51199, -37376, -60553, -54616, -32352, -41661, 19819, 60941, 30806, -607, -70910, -125939, -168887, -136071, -95322, -85422, -51225, -14052, -18100, 27470, 27635, 46743, 38521, 30466, -18865, 557, -11012, -9643]
16935i643O0344J2516n2863m6345J0699m531j6467L6459L3950l9579r4111J9025
16923i0546L5224j6667n7672Q2942Q7799o8503k8450J9159q288J2844K8589O967
16911C398L4795K3777l9712l1516O892J01984J4998k2655J0239K397L5728P667
16899A47992q7072n2477M7398M692j6082n4377K228J1916M710J5431N2315J1706
16887H8380r791k5092o0718o951n569k227M1302l3204K8164L547j1819j5700P070
16874b608J7638N073m5271K1938L5654k3819k9754J0034m237M5446L9937m7827
16862B2204o5439n0647o7459R3638M0496K2843k5168j5410q952L3907O5318l1368
16850A3963k6776K8925P3420l1769J0149k5986m9673l2511P29J6753j82K7734
$$ y = [-9643, 50701, 63217, 10354, -35991, -25292, -29823, -46290, -9831, 24119, -15460, -109571, -90546, -55322, -71989, -129661, -46719, 41080, -27423, -55873, -36714, -45002, -32158, -3569, 3398, 38193, 61970, 22258, -9258, -2366, 99618, 114616, 91961, 102200, 104597, 140325, 147992, 60920, 8443, 55841, 60533, 44451, -9926, -7698, 4218, 8928, 24359, 76674, 88380, 78589, 53497, -7221, -14172, -19741, -21968, 19334, -13870, 14294, 17841, 6022, -9678, -2608, 15030, 20103, -25168, -3230, 32424, 8605, -21149, -11115, -15352, 30094, 70031, 22204, -43235, -93882, -161341, -67703, -27207, -4364, -29532, -44942, -53894, -19987, 45331, 13963, -12813, 16112, 89532, 57763, 67912, 41926, -7747, -40258, -39529, -22776, -22958, 4776]
16838D776k2182M437K0065J3811j8015k4868l5571l226N7533l3801Q478M2525
16826A3962p699p1198o347P885L5933n1489n0572j311O1395r210k331J7229K1460
16813d2293P8134P5045p535j2480q3118l8777N7001o570l6213M7535M1838j4839
16801E7728j7739j9140j3240J0891p3792m1321l0175L7663j355M7902k0507M39
16789f2646O0961K6922l7927j4315q1624p912O959p049L6760L6842l0490J5047
16777e8472L2966j4857k5592j8328K6698L7113j0791R803k1986j3229l1189k727
16765i0591J1116j7139N418J8030K5432M7299l9881m7878J7972k8750l5012P53
16753a33231j9879J7724m364J0029K3581l4268K951R7470J9104l0820L938R5268
$$ y = [4776, -17406, -12969, 7096, 20907, 2892, -21976, -57547, -60773, -3240, -37041, -28563, 13962, 6263, -64935, -71282, -63397, -27464, -78953, -129525, -130836, -69441, -78651, -80982, -63753, -42293, 35841, 110886, 103351, 90871, 7753, -31024, 25977, 19407, -16806, 30729, 72567, 57728, 39989, 20849, 7609, 18500, -55292, -96613, -126788, -89125, -90480, -42578, -63085, -62646, -1685, 25237, -12690, -27005, -108629, -116541, -109582, -116631, -79871, -43029, -73519, -58472, -25506, -40363, -65955, -84283, -57585, -20472, -31263, -21460, -43446, -56675, -87864, -90591, -79475, -96614, -91196, -73166, -47734, -435, -40316, -88194, -70222, -98972, -133984, -133231, -153110, -135386, -139750, -129721, -106140, -140408, -137457, -39987, -20883, -51703, -47765, 47503]
16741D7503J8936K7515l2784k9607o0901K078k396k6338j3026L1528J7669n4160
16729g3983l6174O6148m008n3490M6771N3358K6988n5018j8955O5941J9616l670
16717C3524r22L0926n2451n2524p2450k3239J4002O947K798q373Q6189q971q2432
16704a26976k9398L7582q273Q534M6212O6421L6312k3818l0026j9202j8264J4465
16692d6431K1950L9571K15p646M2241L0078J256J4720j2559p2789o4055k0386
16680g3835K2713J0980K485K0339M3917J02595M2888J595l5687J2544K8265l1712
16668A47087l3337m8839J15027R1077k7194q9996k1532p7336n0991L6906K1704
16657F2576M8900j3302o377K8205M6069N1040J264j3782k2308j5488r486r802
$$ y = [47503, 66439, 93954, 61170, 31563, -29338, -27260, -29656, -55994, -69020, -37492, -19823, -73983, -110157, -44009, -48017, -101507, -54736, -1378, 25610, -29408, -48363, 17578, 37194, 33524, 32602, 63528, 11077, -41447, -113897, -137136, -123134, -116187, -113389, -121762, -35573, -44544, -126976, -156374, -118792, -127065, -118531, -72319, -5898, 30414, 6596, -23430, -42632, -60896, -46431, -24481, 15090, 15305, 7659, 49900, 79978, 81234, 95954, 83395, 10606, -53449, -73835, -51122, -40142, -37657, -17318, 26599, 129194, 172082, 173677, 137990, 150534, 178799, 147087, 113750, 64911, 179938, 271015, 243821, 153825, 132293, 54957, 3966, 40872, 62576, 111476, 98174, 91797, 120002, 166071, 217111, 218375, 204593, 182285, 166797, 157311, 147509]
16645A47509M407L1954N3790k077o9350j4711j1050k5043p0090R321J2635r352
16633E7943l9946K0586M2470O12O688J2094j8251n5883J2159k69m2367J0658k6217
16620a9723l2137P604J4345k4354R796N552j2300k8012N4901L4862k9626l7081
16608e6173k5644O985J6586l877l6458L4781K3878m7698K7927O4258J4300q5166
16596f6301p8864J9939O7405L4378O176k910Q491n0678O794K6984K8143l4419
16584c4862J7640L1500j5160m8158l4425J9990k3872k5555J8387K1563N19P4000
16572A567j0808k4499j6469M3255L1155k4772k3321M4496o3850k5494l5388M875
16560i9253J6411L8116P8538n7367l0065J0654l1339J2414O188r089K8794O4026
$$ y = [147509, 151916, 183870, 237660, 235583, 166233, 151522, 140472, 115429, 45339, 54660, 67295, 57943, 17997, 38583, 81053, 81665, 88353, 100447, 82196, 26313, 38472, 38203, -4164, 6494, -19723, -51860, -44256, -29911, -54265, -44469, -38917, -51217, -79229, -24328, 10534, -19092, -56173, -81817, -74832, -58246, -62123, -98581, -63800, -39922, -87620, -59693, 4565, 18865, -66301, -145165, -125226, -57821, -23443, -17267, -20177, -11686, -62364, -55570, -28586, -443, -34862, -17222, 14278, -882, -49040, -83465, -63475, -87347, -112902, -94515, -72952, -72433, 1567, -9241, -33740, -50209, -6954, 24201, -571, -23892, 20604, -43246, -68740, -104128, -99253, -82842, -44726, 33812, -23555, -53620, -42966, -74305, -61891, -55703, -64792, -35998, 28028]
16548B8028J9149K07k4579l6936j757L553j9688J8170l4358L9803J3260L457k7480
16535a9171k1464j7775j1196M480m6255N6240M0202L4435l2321O449J9385K2431
16523C5440k7571o2407M1000q651J4289M8381K1413j2988n1740J5644L7931K3442
16511G4183N870o946j2059o2691j11492o0034O803M039O6011Q7065O5873L565
16499F0187l1411K1658k7042j7985m9369j0908k1966p170N5803n193l6274o228
16487g5898J3497q703m7113N5884P4737L6154L188l3121n3767M3294M3114k4980
16475B6286k8707K1334J4290k3235j248M070R5358k2870m7851m6297k4521k7183
16463f0574K3570L0926j8597K010k4571m5105m1327n347M1609K6745K5448P950
$$ y = [28028, 47177, 47384, 22805, -14131, -15888, -12335, -32023, -13853, -48211, -8408, 4852, 8309, -19171, -40635, -58410, -69606, -65126, -111381, -55141, -14939, 19496, -12825, -6376, 13009, 35440, 7869, -54538, -13538, -22189, -7900, 40481, 61894, 48906, -2834, 12810, 50741, 74183, 80053, 73107, 61048, -1643, -113135, -173169, -166366, -162327, -96316, -9251, 56622, 60187, 28776, 50434, 23392, 5407, -43962, -54870, -76836, -84006, -28203, -33396, -69670, -75898, -62401, -71104, -118217, -62333, 12404, 48558, 51746, 18625, -35142, 8152, 51266, 26286, -2421, 18913, 33203, 9968, 8720, 12790, 108148, 85278, 37427, -8870, -33391, -60574, -37004, -6078, -24675, -22665, -47236, -92341, -133668, -139015, -97406, -70661, -45213, -37263]
16451c7263n301n160l9960l4731K8412k5692J6379L1140O2870Q667L568J9227
16439B2156m0521o8608l2106P0662L5012J0074k9815n4751L0833M9624l5608n103
16427d8151J7104p441j2578J0486q003k730j4215l6199m2355j960j0723K1453
16415a35312O9922O1536l5854p388j8074L2970J7282k6638j8309L724p63j1160
16403f8064J9427J1207k384M0675J0483j2391j5950k3667o689j2756j26k0204
16391h0439J1057L3261K0789O1435M0741l5077l558k4233o6831n5295N344J3892
16379g8914Q0566N8406k5589n9398M7742J1075J8102Q973K6120m7835p2624N1407
16367A8031L1181k3409l520K0258n966m9956j1724Q122O039N1876K5583k7257
$$ y = [-37263, -42564, -47724, -87684, -122415, -94003, -119695, -103316, -72176, -9306, -639, 2929, 22156, -18365, -86973, -119079, -48417, -13405, -3331, -33146, -87897, -57064, -7440, -43048, -48151, -31047, -38488, -51066, -40580, -48583, -51313, -65528, -101727, -144082, -146042, -156765, -135312, -65390, -3854, -39708, -47096, -65170, -32200, -14918, -41556, -59865, -56141, -56904, -68064, -48637, -37430, -39814, 861, 11344, -1047, -16997, -40664, -47353, -60109, -60235, -80439, -69382, -36121, -15332, 46103, 86844, 51767, 48209, 23976, -42855, -98150, -92806, -78914, 1652, 60058, 34469, -24929, 22813, 33888, 51990, 60963, 87083, 39248, -33376, 18031, 49212, 25803, 22283, 42541, 36575, -13381, -25105, -16983, -10944, 40932, 66515, 39258]
16355C9258n8807k5246l5167O2917L4338l9763J7115k2388L2745K3444O027l2334
16343B139K3062O3299K4309l7296K1659m6129j6626l0544m4636m7078N5801N305
16331b6735L8801m09j4376k1622l05j1786J9428M5838M589n999l6019o3368R287
16318f2676M2855j8404J5170K0311J8123l069k3023J565L5708j3774o5036l3056
16306h5306R957J7590L3026R5428l224q2055l4218N3632J5409P217P647l2146
16294B957k3704o4723n0629l8913n085J26758P1194J541K8333k6336K097l6816
16282a3326n3297q53o5181k113J5871l60k739L5145N0894j9013m5213J5733l00
16269h4752K9352L5995j5274O486J589J7819M4415J0207K5488k1414m1829o0012
$$ y = [39258, -19549, -44795, -79962, -17045, 17293, -22470, -5355, -27743, 5002, 28446, 34473, 2139, 25201, 88500, 112809, 75513, 97172, 51043, 34417, 3873, -40763, -87841, -32040, -26735, 12066, 11657, -2719, -24341, -24646, -36432, -17004, 28834, 33423, 27424, -8595, -71963, -62676, -19821, -38225, -23055, -2744, 15379, 12310, -10713, -9148, 26560, 12786, -52250, -85306, -75349, -57759, -24733, 70695, 67471, -14584, -48802, 4830, 20239, 27456, 35103, 2957, -20747, -85470, -136099, -175012, -180097, -53339, 17855, 19396, 47729, 21393, 23490, -13326, -66623, -67476, -132657, -134770, -118899, -119259, -121998, -86853, -35959, -54972, -100185, -84452, -84752, -55400, -19405, -34679, -28193, -26604, -8785, 35630, 45837, 71325, 49911, 8082, -51930]
16257e1930q0329m0462L7387N3763J125K6966N6056J6944o0536n0901K910N8334
16245c0673K3847j4397J149O920m269m921L558n5099K4173K3545N790N1052L1189
16232F1864j8960m2986j8995N2682J0137l684k0455j2564L2717k7250l2873k7853
16220d8220j1749J1188N518J3874N7517R514k1300l2542l4599q8528m7950o997
16208a94274P5972L4307K3021J0910N4480k1980l1968K875R0946K1590l7647l6178
16196g946R974K4404r780O0707L878J041N4666m2190j08380j2881J1582k0699
16184c5624M548L0365O0105J6329M9575p0501p7178m7890J6993L258k0865R673
16172f1212M780L8471M7880r118p5156K76Q1954L1970o1614k8479K6620k9932
$$ y = [-51930, -132259, -172721, -135334, -81571, -80446, -53480, 2576, 19520, -41016, -91917, -89007, -30673, -6826, -21223, -20074, -13154, -17423, -22344, -18786, -73885, -49712, -26167, -20377, 30675, 61864, 42904, -82, -19077, 33605, 43742, 40058, 19603, 7039, 39756, 12506, -20367, -48220, -59969, -48781, -43263, -29389, 28128, 37642, 16342, -16200, -50799, -139327, -187277, -194274, -118302, -83995, -60974, -50064, 4416, -17564, -49532, -46657, 44289, 65879, 28232, -7946, 2028, 26432, 16652, 77359, 81237, 82278, 136944, 94754, -13626, -26507, -14925, -35624, -31076, -711, 59394, 75723, 125298, 54797, -22381, -70271, -53278, -50020, -70885, -61212, -56432, -17961, 29919, 20801, -54355, -54079, 27875, 59845, -1769, -30248, -3628, -33560]
16160c3560m7189k4071M2453l0567k1353m2327j936N4866O4187J6845M9814j5751
16148A1411K3761K6596p5518j4413Q023K6930L5105P3549L9631m4315k8400n1053
16136C1307n0145J3318K7072l4350r5689k6890J03754J8240N091L5149l2172k1101
16124b6416n764J2519J2962K007l4643j6813m1132P7847k7339j4923M2696R202
16112i797n5710K1278p020K7216j0897k5937L2963k251m2516p365L9175j0913
16100e1774M432N1097M8626J3915l4029m7014J3271J5388J3867N2622m1766n7592
16088a8957M955k5914j4708j4152K4877J2566l6694l1797N5911K5463j516J088
16076a8878O0883N3367M8042k3242j969m5358N040j5704n1091j0256m6180r789
$$ y = [-33560, -80749, -104820, -62367, -92934, -114287, -156614, -158550, -103684, -39497, -22652, 27162, 11411, 35172, 61768, -13750, -28163, -20140, 6790, 41895, 115444, 155075, 110760, 82360, 31307, -18838, -5520, 21552, -12798, -108487, -135377, -31623, -13383, -8292, 26857, -5315, -26416, -32180, -19661, -6699, -4692, -39335, -56148, -97280, -19433, -46772, -61695, -18999, -9797, -65507, -44229, -51249, -24033, -34930, -60867, -27904, -30155, -72671, -80036, -40861, -51774, -47342, 3755, 52381, 66296, 32267, -14747, -1476, 13912, 27779, 80401, 38635, -18957, -14002, -39916, -54624, -68776, -43899, -31333, -68027, -99824, -43913, -18450, -19966, -18878, 42005, 95372, 143414, 120172, 118203, 72845, 77885, 62181, 11090, 834, -45346, -55135]
16064e5135L7314P8157l1721j2673K604J3275M5883L2564j7337m3007q8517l9489
16052g8082J806q671M2134M7502l2277J2527J2505j2602j1413K7430L8531o442
16040C2948l3317j7649j3326p442K8005P130l6297J586M2727P625n57k8015M1061
16027B4479k2059j47j1522n613K019N7696k7390j4239K4113P811p807l3414L4718
16014B8645l762j863l9575K8683j3584j0217j7077M1288J3548l2583p1597L8948
16002c9146j7225p6974j0385K3733p0060L4699Q6303K2631k5004M2745l2115n9935
15990a20733k6525L1397Q1163N2660O602k3155m0858r372k8583N4076J3403L1125
15978B1200J7455M4388k6697n3232o9422j3942J4150M3910l3543m3391k753j8342
$$ y = [-55135, -17821, 60336, 28615, 15942, 18546, 31821, 77704, 110268, 92931, 49924, -38593, -78082, -76276, -84947, -42813, 4689, -27588, -15061, -2556, -15158, -26571, 859, 39390, 32948, -369, -18018, -31344, -38786, -10781, -3651, -39948, -38362, 4365, 11990, 11433, -16582, 24479, 2420, 2273, -9249, -14862, -12843, 44853, 17463, 3224, 27337, 35148, 27341, -6073, 28645, 24883, 23020, -16555, 12128, -1456, -11673, -28750, 12538, 26086, -6497, -78094, -39146, -56371, -133345, -143730, -119997, -190057, -155358, -69055, -46424, -71428, -28683, -60798, -120733, -147258, -115861, -34698, 17962, 24564, 1409, -39449, -48821, -77404, -23328, -9925, 21200, 38655, 83043, 56346, 3114, -66308, -80250, -66100, -22190, -55733, -99124, -101877, -120219]
15966a20219K9230N5873J1495M0877N2846j6371m355k8831n2620O463J6841K5054
15954A6283j4470l25n8024l8452N0069N0357p3720J0301j2056m828P2696O6094
15942F3925K575l2776k9434o155k0745P072j6830M0536L3738k8825K5746o042
15930C2785k754p3540K621J1924L5603j1831j2184o4169L6119J4331K1061L5385
15918B5351K3678l819K672n1806n1461O7848N1256k4453m5658K4202P280n2810
15906b7720R942K702J4668k7393m5194k508K9612P4484p106m5751L9114M8919
15894F3769J3903m975j5336K0819l1283k5042J8733k157l7467k311M8050M093
15882E0796n6986K727J8839m9038o9336l2397K2523R136l5641k5880L5104Q0733
$$ y = [-120219, -90989, -35116, -23621, 17256, 70102, 53731, 49376, 20545, -32075, -25612, -8771, 16283, 1813, 1488, -56536, -94988, -44919, 5438, -68282, -57981, -70037, -74865, -2169, 63925, 66500, 33724, 4290, -1865, -22610, -15538, -32368, 8168, 41906, 13081, 38827, 32785, 30031, -43509, -40888, -28964, 6639, -5192, -17376, -81545, -45426, -31095, -10034, 25351, 49029, 45210, 47882, -3924, -55385, 12463, 63719, 39266, -6392, 17810, 25090, -27720, -17778, -15076, -408, -27801, -72995, -75503, -45891, 28593, 21487, -24264, 14850, 63769, 77672, 72697, 57361, 78180, 46897, 21855, 40588, 38431, 964, -1347, 46703, 50796, -6190, -3463, 15376, -33662, -102998, -135395, -112872, -103736, -139377, -165257, -130153, -49420]
15870d9420J4295K1100K0545o1047j9141J1466J0789M7302P0615k6032j3099j2223
15858A5150l8635n737r862N5943J1290l5567R825K2763R632k9045l7216P108R6963
15845G2612R788M1212k731q3174q1338j6033L9022J5904L4493J76o9673p381N641
15832d1482L7239L1750m437k1897n3475o9960P66J00651L7276J6114K3002m2934
15820A2613o8218p7969K8549O4572J3610O28O5537N3223o4242l8783J0977p7026
15808g6529m7674j8320m154L0194Q6449N1761N6017k9397k8289k7703M914l0065
15796c2796n4492O62M7061o166j1048J663J4425K9104J8481k1411J9054j9677
15784a5140q5827l5277p890P8306O3795k0997K777O020M193m0946m250L9369K8791
$$ y = [-49420, -35125, -14025, 6520, -54527, -73668, -62202, -51413, -4111, 66504, 40472, 27373, 15150, -23485, -29222, -39084, 16859, 28149, -7418, 2407, 25170, 34802, 5757, -31459, -24351, 72612, 82400, 123612, 120881, 37707, -43631, -59664, -20642, -4738, 29755, 29931, -39742, -47123, -41482, -4243, 27507, 23070, 1173, -52302, -122262, -121496, -20845, 16431, 32545, 55547, 12613, -55605, -133574, -105025, -40453, -26843, -26215, 39322, 92545, 28303, -10480, 497, -76529, -124203, -142523, -146677, -116483, -30034, 21727, 77744, 48347, 20058, -7645, -2731, -32796, -87288, -86626, -39565, -45731, -56779, -55116, -40691, -11587, 6894, -14517, 4537, -15140, -100967, -136244, -144134, -65828, -2033, -23030, -20253, -14233, -10040, -50986, -55236, -15867, 12924]
15771A2924L0592m4763l5045k4119K748R7891M331m8284M0542J06753k5272o3409
15759E4889l3462k7026N2129K032J488l9978m7359M8043N8361m9951j5146P835
15747A1855k0282J8458J234m0210n2481l1324K7128j578j8060J4820L6994L4007
15735a9439P4113o929O893l9719K3084j0988k6046j2330j4238o391P8585N677
15723E2272o2488o6754J7944P0630j6935M4519J7714l7805j7164J6905k034k2652
15711e848J4174m954j0331L7016J1074k0623k5965n9436p1277m1296K8124L9965
15699a09377K4783N1741J156j8009N6970j1603N4182L9900l1418j0556n575k9602
15687A2592J1318J9375o4176k189K3176o802l7130K7056n18j2018K0389n2371
$$ y = [12924, 43516, -1247, -36292, -60411, -57663, 40228, 44559, -3725, 36817, 143570, 118298, 54889, 21427, -5599, 46530, 48562, 50050, 10072, -37287, 10756, 69117, 19166, 4020, 11855, -8427, 10031, 11265, -28945, -81426, -112750, -85622, -87200, -105260, -90440, -53446, -19439, 54674, 47745, 54638, 14919, 38003, 27015, 969, -11361, -25599, -31990, 46595, 52272, -10216, -76970, -59026, 11604, -5331, 39188, 56902, 19097, 1933, 18838, 16804, -5848, 8326, 3372, -6959, 30057, 41131, 20508, -5457, -64893, -136170, -177466, -149342, -109377, -84594, -32853, -31697, -49706, 7264, -4339, 49843, 89743, 58325, 47769, 42194, 12592, 23910, 43285, -20891, -23080, 96, -6706, -43836, -16780, -17298, -29316, -8927, -61298]
15675f1298l7847Q4530P0275o3724n9791l1971J8554K7956K7804j8708j2358p306
15663f3884m9962K0495K6825j469Q0016N5682J1032K6145n266k9010J2820K4690
15651A08114j5431o3750J2649M338J9602K2437n1042l5764j5064M3114j8472k0700
15639i969J7304m3281j3717L7045L452J8927K470M0647K5297l1722k4317n838
15627A6298J6229n1930j6785L6831N3643N438l8203n4095P367q475p2686Q233
15615i8135O5252l883j2229O7994L6309p9846m7776L937k9738L7975N2989K0543
15603A3392K6104J3054n2533K775K8983k1468p904L5537L4007O1295k6584j06637
15591B1M6457R185k6332k6233j1930r792J8730j2351o9126k3932N3806Q8853L8801
$$ y = [-61298, -99145, -14615, 55660, -8064, -67855, -99826, -81272, -53316, -25512, -44220, -56578, -63884, -113846, -93351, -66526, -67995, 12021, 67703, 78735, 104880, 99614, 70604, 83424, 108114, 92683, 28933, 41582, 45920, 65522, 87959, 36917, 1153, -13911, 29203, 10731, -9969, 7335, -35946, -49663, -12618, -9166, 9761, 12231, 52878, 78175, 46453, 22136, 16298, 32527, -19403, -36188, 643, 54286, 59724, 21521, -32574, -25207, -33682, -106368, -98135, -32883, -36766, -48995, 18999, 55308, -24538, -72314, -68377, -98115, -60140, -7151, 13392, 39496, 52550, 17, 2792, 31775, 10307, 2403, 37940, 71947, 133242, 106658, 21, 46478, 55663, 29331, 3098, -8832, -18624, 106, -12245, -81371, -105303, -51497, 37356, 76157]
15578G6157l0139k2290L6772K1970j1098K6498J3980K3891k9985o1058j9671n000
15566B0027l6317O254j643L7129Q631m2189K9318K1907K2444Q541l1638j8189
15554B4275R553J3025j9500O1363l4490l7106q908k0071j6281j8098O5289q115
15542A0936J9978L3271n0265K2778K2514j1623k2804J0340J9975l4126L6755j6355
15530D1374l5668L5721n304P837K3298o2716p0073k192p5O9358k8405K4125R418
15517F698o420m6667m5900K3931O3512O4737K4977q6763n3014J4237l125l0261
15505g4058m3660M2142K3490L6948J0282m9388l6817M2276K9830m4079P1359O6851
15493G5176k5096n7464J8247L590j4009L4176l389j3909k9591o105J7408j4553
$$ y = [76157, 46018, 23728, 60500, 82470, 71372, 97870, 111850, 135741, 105756, 44698, 25027, 20027, -16290, -10036, -11679, 25450, 34081, -8108, 21210, 43117, 65561, 74102, 42464, 24275, 33828, 46853, 27353, 88716, 54226, 17120, 8212, -11859, -28140, -46238, 19051, 10936, 30914, 64185, 13920, 36698, 59212, 47589, 24785, 35125, 55100, 20974, 57729, 41374, 5706, 41427, 36123, 43960, 67258, 4542, -65531, -67723, -67798, 1560, -26845, -2720, 6698, 278, -46389, -92289, -68358, -4846, 59891, 84868, -1895, -54909, -40672, -43797, -74058, -117718, -75576, -52086, -15138, -4856, -54244, -91061, -48785, -18955, -63034, 8325, 75176, 50080, -7384, 10863, 14453, 444, 34620, 31231, 17322, -12269, -18374, -966, -15519]
15481a5519K9945M9795M0610J4621K0280k4954N031k3375j3950n5164r607j790
15469A5923K6390J1362k7417P47N706M4573r110k1271N2629Q962j7866k7630m8098
15456A4900M8725K2398p2608k5636k6401K7806J3696j3875m1845k7521L8985L5247
15444f129M659l5611m2696J6650K2753M9923M6423m1146l9357J3845K9984J1737
15432C1035J5002J8401J6380o068K6319o2998K7648K1664m081J4106p1905o7151
15420d1648N2013L945m4515k0351K896M4635k9969m793j6840m8839L4733M9287
15408a9446J9637k4485o3484k531M5513L0792K7504M8984k2783k4388o511K4433
15396C3235R92q320M622J438k6441M9095j5109p4650k7860p698L8284M0166J0368
$$ y = [-15519, 14426, 64221, 104831, 119452, 139732, 114778, 119809, 96434, 82484, 27320, 17713, 15923, 42313, 53675, 26258, 27005, 32711, 77284, 68174, 46903, 99532, 108494, 90628, 62998, 14900, 63625, 86023, 13415, -12221, -38622, -10816, 2880, -10995, -52840, -80361, -41376, -6129, -1470, -37081, -79777, -63127, -40374, 9549, 55972, 14826, -24531, -10686, 19298, 31035, 46037, 64438, 80818, 74750, 101069, 38071, 65719, 87383, 83302, 97408, 25503, -41648, 10365, 14310, -30205, -50556, -47660, -3025, -32994, -37787, -54627, -103466, -68733, -19446, 191, -24294, -87778, -90309, -44796, -14004, 13500, 62484, 39701, 15313, 8802, 33235, 34227, 25907, 30529, 31967, 5526, 54621, 39512, -35138, -62998, -70696, -32412, 7754, 18122]
15383A8122l8264j7770m763O8493J1737p06j223K0009n0020k177M0923j7395m8771
15370b1805k3634l5656L8743O5002N4450m0354o4907K3026l4685Q345Q1291k5884
15358B3932o452L243N3793K6911l1670o1091k2650k6333k7195M0799K3415k250
15346e548Q183m0720K4413L6049k788p660l7957k5964R642n499m5613O65M8481
15333d4316J8198j1278j3486K4892n2664m746J6002N2770k0213O992J7851L745
15321f253k7067j4903l6193P349k263L6313N3931K8478J131l9747l1519m5361
15309g6104m3444M2116N8180k4847p3425J2259J5831L3906P1457l4380m8900k16
15297f7567j4608j002j9154K4841O4295K0465R492j8486k7145J6320J5426k4430
$$ y = [18122, -20142, -37912, -42675, 25818, 37555, 36849, 35626, 55635, 5615, 3438, 44361, 26966, -21805, -45439, -81095, -42352, 22650, 77100, 36746, -28161, -5135, -39820, -31475, 49816, 23932, 17480, 20723, 74516, 101427, 69757, 8666, -13984, -40317, -67512, -26713, -3298, -5548, 2635, -38085, -13672, 22377, 19589, 11929, -26028, -51992, -42350, -47849, -93462, -92797, -44316, -26118, -37396, -50882, -25990, -78654, -83400, -67398, -14628, -34841, -27849, -9998, -6253, -33320, -48223, -84416, -77067, -79330, -43017, 10914, 39392, 40523, 776, -30743, -76104, -119548, -77432, -19252, -44099, -117524, -105265, -89434, -55528, 15929, -18451, -67351, -67567, -82175, -83177, -102331, -77490, -13195, 7270, 16762, -1724, -28869, -12549, 2877, -21553]
15285b1553j5561j7714J1051N247l2028Q558p28M055L0650K7721M7119j3160K4147
15272E7804m124k1443o184m93M5206J1251J0326m3749m0045j8201L4350K7928
15260E2626q545n1053r047N512N931l3842m5991M0042L6622j3706l1643K4925
15248b8169L9232l7640j7786j9205k723N0027L710m587m0703o0731O0348N9026
15236G99M2443L0342j5915q0158J5598K448j8117k3964j8291l2885j2056K7396
15224h2360M960L4742k3985L3528O541k8428L2617L7095K6035o3811J8466k7452
15212c2052K5797M8323n5141m7559K3345k4506M3718J2834J2758J457q880O197
15200F291j3638l5709J1327j3146m874J3148K3147N2745M2296k8689m7336n1433
$$ y = [-21553, -37114, -54828, -43777, -38530, -70558, -62000, -62728, -58673, -28023, -302, 46817, 33657, 57804, 53680, 32237, 26053, 25560, 70766, 82017, 92343, 48594, 8549, -9652, 24698, 52626, 44081, -6972, -16019, -10507, -4576, -38418, -84409, -44367, -7745, -21451, -53094, -28169, 11063, -26577, -44363, -63568, -66291, -16264, -12554, -17141, -57844, -118575, -58227, 799, 43242, 73584, 57669, -22489, -6891, -4443, -22560, -46524, -64815, -97700, -109756, -82360, -77400, -42658, -66643, -33115, -26574, -55002, -22385, 14710, 40745, -23066, -4600, -32052, -6255, 42068, -13073, -60632, -37287, -61793, -18075, -5241, 7517, 8974, 94, 6291, -7347, -43056, -31729, -44875, -49749, -36601, -13454, 39291, 81587, 52898, 5562, -45871]
15188d5871M3874m7702k8731J4847K5347J3184O9905N7935j9326K5065m3189k0354
15176D4984K672l4066J4589q501J3762L4777J5240j0765j9829R882l3697n6780
15164b7732m6055K6972M7166L0824j5684m5252K1412N6406M6717J859K2764n7507
15152F1890n8631L4745L5137j5998o3356J0938m2223q4834Q6760N3953j0181R09
15140I109k2223M769J5797J6161O5353M1525Q913J8670n7513j874j8191k2567
15128E7929n7112n3085K6374M8498K3672l2135m6584m6889n8598J6785Q2315K1253
15116a7577j5378M7900L7965p100k6603L4315N426l6698j6745m44m6961k5391
15104f7291N9297o5013o0373Q5335K0037m023p5113M3163L5955N780M5851K1541
$$ y = [-45871, -1997, -49699, -78430, -63583, -38236, -25052, 44853, 102788, 83462, 108527, 65338, 44984, 47656, 13590, 28179, 19678, 33440, 68217, 83457, 72692, 52863, 62745, 29048, -27732, -73787, -46815, 351, 31175, 15491, -29761, -8349, 48057, 94774, 96633, 119397, 61890, 3259, 38004, 73141, 57143, -6213, 4725, -37498, -122332, -35572, 18381, 8200, 9109, -13114, -8345, 7452, 23613, 88966, 130491, 139404, 158074, 100561, 98687, 80496, 57929, 817, -52268, -25894, 22604, 46276, 14141, -32443, -79332, -137930, -121145, -38830, -17577, -32955, 14945, 52910, 45810, 19207, 53522, 58948, 22250, 5505, 5061, -41900, -67291, -7994, -73007, -133380, -48045, -28008, -32031, -107144, -63981, -28026, -22246, 23605, 45146]
15092D5146l6640k8860j1328K4736m6790q6107k6217J0118K0138L740N4713R2761
15080A5410K0930p480L2109r251o6191R8M850p611j9778J7881P361k5509k7206
15067f4387j6561L020K3888m206J16233K6999q0595o009k3168K1735q632m0087
15055e1770n3188R0973O2821n1950m2223j719J0924K0680R066K1972L8489k0186
15043C3889Q0m8961j7865n992N4424K0320j5929q4785J4414O2285R50l686r800
15030f56M3609l1706j2162n7930K1875j4269l3619J6236P3831K7315K5726m4362
15018A3888n2899k0396L3702n579J47k0603k7650L5652M1962J6970R871m8046
15006b2981m1607k3976P1699O2492J568p115m6061k1257j7481k9153J443q691
$$ y = [45146, 8506, -20354, -31682, -6946, -53736, -139843, -166060, -155942, -135804, -132064, -77351, 15410, 36340, 28860, 60969, 51718, -14473, -14375, -9525, -17136, -36914, -19033, -11672, -37181, -64387, -80948, -77928, -54040, -58246, 57987, 84986, 4391, -1618, -24786, -3051, -11683, -51770, -104958, -13985, 48836, -3114, -45337, -47056, -36132, -15452, -6386, 15586, 54075, 33889, 33969, -14992, -32857, -38849, 15575, 35895, 19966, -64819, -50405, 11880, 12830, 9144, -656, 42953, 11247, -915, -58845, -36970, -51239, -84858, -68622, 5209, 32524, 58250, 13888, -39011, -59407, -25705, -31284, -31137, -51740, -79390, -43738, -1776, 15194, 25065, -22981, -64588, -88564, -16865, 45627, 47195, 40080, -5981, -27238, -44719, -73872, -72429, -81120]
14994h1120L4073O864l3626J9115J5884l1854l2514P1763K5714M4551K5230j6272
14982D7808k5193k1636n9001q0850L8255L8905L4879l6134n2949N4041L5196N3505
14970B6826J4022n9111n7082K0727O0437K1924L2017p099k8753m4173P761K1874
14958I370J3706J3569j7677P720l4725m3694k5159N248L935N9737N0215l3535
14946H710J3654p716O388l162J9434k5119j1885m4605m4473O7601M8242j5671
14934A1398m2077M6250K7852k089k9598o0934k4669R624O7155Q517j5658k5955
14922c0184O4262J385m3001M236j6298k3894K0881l8678n8616K1539O6349K2890
14910i129K5732l7158l1365K9467K7901l2750o5375P3293M0635J9144p099n0216
$$ y = [-81120, -47047, -40183, -73809, -54694, -38810, -70664, -103178, -31415, -5701, 38850, 64080, 47808, 22615, 979, -58022, -138872, -100617, -61712, -26833, -62967, -115916, -61875, -26679, 26826, 40848, -18263, -75345, -54618, 5819, 27743, 59760, 52661, 23908, -20265, -12504, 9370, 23076, 36645, 18968, 26688, -8037, -51731, -76890, -71642, -67707, -7970, 42245, 8710, 22364, 14648, 21036, 17874, 37308, 12189, 304, -44301, -88774, -21173, 27069, 11398, -30679, 15571, 43423, 41334, 11736, -49198, -73867, -64243, 2912, 11429, -4229, -30184, 34078, 35463, -7538, -3302, -19600, -43494, -22613, -61291, -119907, -98368, -32019, -9129, 16603, -20555, -51920, -22453, 5448, -27302, -92677, -19384, 21251, 40395, 33296, -16920]
14898a6920j535K8614j2495j2813O593M4519M3887r2525q479K8928K833k4817
14886a4210o3226q971N6652l2969n3274j8178j7344K7306P2713M4280l7581k2881
14874f7683q834N7130O1523N5010J2885q3221r7601J4056K1169O2589l9056L8
14862a1995N2425J938m2631j3926q243M1395o93L950l9641k4767r545L3316J0609
14849g808J5664k7600q345k5611j0016L6181K0537o216m497K087k1733P391K7718
14836b248J046L9777J2538m8166O898N2662L0982k7260p6281o0001m6063O6901
14824d9215O7198L7187k8861K1211j9668l6440K6122L9121J4450j4951N241K4828
14812H6223q346o3880n3174J3031K6140k8075k0081j8591L2751L1484k7457L340
$$ y = [-16920, -18455, 10159, -2336, -15149, -8556, 35963, 79850, -12675, -21154, 7774, 10607, -14210, -77436, -86407, -29755, -62724, -115998, -134176, -151520, -124214, -51501, -7221, -44802, -67683, -76517, -19387, 42136, 97146, 110031, 26810, -70791, -56735, -35566, 27023, -12033, -11995, 40430, 42368, -263, -14189, -22432, 18963, 18270, 22220, -17421, -42188, -51733, -18417, -7808, 7856, -19744, -28089, -53700, -63716, -27535, -6998, -13214, -17711, -15624, -37357, -29966, -2248, -1202, 38575, 51113, 2947, 9845, 62507, 93489, 66229, -10052, -70053, -116116, -49215, 17983, 55170, 26309, 47520, 27852, -8588, 17534, 56655, 71105, 56154, 61395, 86223, 77877, 13997, -39177, -26146, -6, -28081, -48162, -66753, -34002, -2518, -29975, -26635]
14800b6635K7015l1392j05170J8658P3737O2526J287m5721K2182O87p447K3403
14788A3130m213L8640L2199k5169l7232k2565R744L796j9034n9132k6668J9227
14776g7277L1682L0648L2260k8710o3287L9371L8570k5636m2299J407M6967K5649
14764I345J5943J4165j732m1602j01665P407N7898L227J3732o0389k360P5312
14752a0719N0048k0147n9677l5875K2053K2906O842N7810K0958n2992l676R4308
14740I1839J5888m506m1788k4319J0018n4801P655K1509K4040j6306p6246k0410
14728f7427j5248N2587M8819j965k3986K2064L6872L5690k8195j2641K4738j334
14716F9974m273l1890J6424M9685k3913k6790M189K8352q116O5199J6651k7347
$$ y = [-26635, 380, -31012, -136182, -117524, -43787, 18739, 20026, -25695, -3513, -2826, -10273, 13130, 8917, 47557, 79756, 54587, 17355, -5210, 4534, 8330, -10704, -69836, -96504, -77277, -45595, -14947, 17313, -11397, -74684, -35313, 3257, -22379, -64678, -63271, -16304, 9345, 25288, 39453, 37721, -3881, -105546, -98139, -40241, -37014, -23282, -83671, -86031, -10719, 39329, 19182, -40495, -76370, -54317, -31411, -24569, 33241, 54199, 1207, -2469, 91839, 107727, 103221, 61433, 37114, 47132, -7669, -14, 21495, 45535, 29229, -47017, -67427, -82675, -30088, 18731, 16766, -7220, 14844, 51716, 87406, 59211, 46570, 71308, 69974, 65701, 33811, 50235, 99920, 76007, 49217, 53406, 81758, 73642, 138841, 155492, 128145]
14704A28145o6719k2699R046M3949N807p4361r0256o3397l339J6229j5079J3034
14692a19640L5083n3272m012L6356J6379R401L4132k5789l3308N7026Q0129m7879
14680a5394p2305m6449P2449J2577l5695L0828K4740j1349k0081j6004R113L0839
14668c6731l328n260M1081O878L9689L2739k6215l1309j8949Q179p1255n1494
14656a15975Q6252J6312k473n3367n0434j3099J15201K8419L459m7984O23L6906
14644C840k3741m6525l068L6988M0174M5503l8492p4703K7076M9975L7912j645
14632E3294n6818j8808j9030j5863L5900k8828m8724j8878q259J9307L5323p6673
14620a48057L1597J8830N800J3283o8229l3382p251N0842J8657J7023J9459J7978
$$ y = [128145, 61426, 38727, 47773, 91722, 97529, 23168, -67088, -130485, -133824, -117595, -132674, -119640, -84557, -137829, -141841, -105485, -89106, -79705, -45573, -71362, -104670, -47644, 32485, -15394, -87699, -134148, -61699, -49122, -84817, -53989, -29249, -40598, -60679, -76683, -67570, -36731, -40059, -45319, -4238, 2640, 42329, 75068, 48853, 17544, -1405, 6774, -64481, -115975, -29723, -13411, -15884, -69251, -119685, -132784, -17583, 10836, 14295, -33689, -33066, 3840, -19901, -66426, -69494, -32506, 7668, 53171, 14679, -60024, -32948, 17027, 54939, 53294, -3524, -22332, -41362, -57225, -21325, -50153, -98877, -117755, -126014, -106707, -71384, -148057, -116460, -97630, -91830, -78547, -146776, -180158, -187409, -136567, -117910, -100887, -81428, -63450]
14608f3450L1001M237j4001p760l895L3974L2264n6757n0177o295K8551N3623
14596a8685O8780j5962o9906o6542j7162K2481P2971R801L444J0510l0990l1757
14584f3017l9395N7818K9739k0061J3870N3231k0122m8151L0289J8945j5867K8827
14572B6106k5607m3981K3047k847L6491j2323J0164Q537m8780p7461l9956J8878
14560a27732N0347M2508k527m0419j6804m4202K0874j1405L5980M2215J8141L8143
14548E119j368O178O4891L3833k9221j9112K3787n4576m9755o6992j1282n9128
14536a57626j0592P5103m7688m1579j1577J5530P348Q0229L6033K0482L2456K4301
14524B2420m9606j9891R063P0121p012l6316k6272m918R547N8432K8820j4056
$$ y = [-63450, -32449, -28212, -42213, -49973, -53868, -19894, 12370, -44387, -94564, -100859, -72308, -18685, 50095, 34133, -35773, -102315, -119477, -96996, -24025, -14224, -10780, -270, -31260, -63017, -102412, -44594, -14855, -34916, -21046, 32185, 12063, -36088, -5799, 13146, -2721, 26106, 499, -43482, -20435, -23282, 13209, 886, 11050, 19587, -29193, -106654, -146610, -127732, -77385, -34877, -37404, -77823, -94627, -138829, -117955, -129360, -93380, -51165, -33024, 5119, 3751, 9929, 74820, 108653, 79432, 60320, 84107, 29531, -20224, -87216, -98498, -157626, -168218, -93115, -140803, -182382, -193959, -178429, -171081, -90852, -54819, -34337, -1881, 22420, -27186, -47077, -38014, 32107, 25095, -11221, -37493, -42411, -32864, 25568, 54388, 40332]
14512D0332K8057m283p0173p3627J6124L6244N419m7312q271l792J6616j6531
14500h1197l1221K8273Q1123N7767k0190j9035n4662o3070K3836j9338m368K3109
14488g8973K4886J5269q341J4584K0487j2587N0743L9830K1052N1212p0241m5923
14476B1998K8432K8318l4589k7444l7513j4756P8031m2513k9803l844N384n3953
14464h2252m1936m4426R981O8038j4497r7023P728N1042O7852l2946P546P8317
14452b2576J6844J8514l4806n0119K4049P7845K6573m3103j7467l7176M873j0623
14440d7172K2033L5129L5518o792l7129k6405K3319K3341Q294j1866M0023j3015
14428D5278m2941K8938n3136J1692K5165p1629m6558n6622M9079P9082j072l7721
$$ y = [40332, 68389, 64106, -6067, -79694, -63570, -27326, -21907, -69219, -77490, -81282, -64666, -81197, -112418, -84145, -3022, 54745, 34555, 15520, -39142, -102212, -78376, -97714, -102082, -78973, -54087, -38818, -47159, -32575, -12088, -24675, 26068, 65898, 86950, 138162, 67921, 21998, 50430, 78748, 44159, 16715, -20798, -35554, 42477, -36, -29839, -33683, -28299, -82252, -124188, -168614, -158633, -90595, -105092, -202115, -194387, -143345, -75493, -108439, -100893, -22576, -5732, 12782, -22024, -72143, -48094, 29751, 56324, 13221, -4246, -41422, -36549, -47172, -25139, 9990, 45508, 38716, 1587, -24818, -1499, 21842, 30136, 18270, 58293, 45278, 2337, 31275, -21861, -10169, 14996, -56633, -103191, -159813, -110734, -31652, -32724, -70445]
14416g0445m8115l8535N0839L2574L2643J6112j4556o5677m6795Q7966N7516l0503
14404c6976r418k1955O754j2074P0708P759l8414j3934L4779O841n27K5213n9498
14391d0742n9508O966L507K188j112K7026o164J106J3805O078L9094j7375j9036
14378d4167j843N4635K8273l8762l3470k9799k3053L2233L697K0242K547M7717
14366A8250O1394M7286m3563j948K3181L0270o3713l8117q1264n8405N3967m053
14354e6715J5307q400J6648O434l8386K0929j2001l1383Q1166n1585l5104O0635
14342c2455N74K3453M7337P483n1275n0810J173p1099K7297Q5197K9420K4883
14330D1178k1564j1364J7941K6194k1025K8604n3229l4285m783j0517R558K5771
$$ y = [-70445, -118560, -157095, -106256, -73682, -41039, -24927, -39483, -105160, -151955, -63989, -6473, -36976, -46394, -68349, -61595, -73669, -2961, 4798, -33616, -47550, -12771, -5930, -6457, 18756, -40742, -100250, -93284, -89777, -87589, -88701, -61675, -67839, -66733, -52928, -46850, -7756, -25131, -44167, -46010, 8625, 36898, -1864, -35334, -65133, -88186, -55953, -52256, -32014, -29467, 18250, 79644, 126930, 83367, 81419, 104600, 134870, 71157, 33040, -48224, -106629, -52662, -56715, -41408, -49808, -33160, -26726, -65112, -44183, -56184, -87567, -6401, -57986, -93090, -32455, -31881, -8428, 38909, 46392, -4883, -55693, -54520, -125619, -98322, -13125, 16295, 41178, 19614, 8250, 26191, 52385, 31360, 59964, 6735, -27550, -32333, -42850, -33292, -7521]
14318g521P0969k7719m8964j4478m225O0531r652k8249j7400J0414n288p524k9336
14305e8442K8739M8437k4595j206M7971M8996L5749p4053m9699k0312m3756N8970
14293c201J013k6926k5417M8829K3636r786o5300J0474M8135k2463P1018p667
14281D2345j5444k2121j9595M3970j3265L6194L3054m8464n5006J7741O0079l3688
14269B5800p7352l480M6498J3535m5701J4443K8776l236q510j0729j3937N985
14257b7908q288K291J1973L2260K3652J6085m2520J5712K0220l5528l737M2633
14245D6845K851l3194j2603M0726K8392p3621n2247j2505K5769O3367J4908j4869
14233B3819n2504K5169O9368M6346n6950n245J088j6404k2533l6871M53N3987
$$ y = [-7521, 63448, 35729, -13235, -27713, -31938, 28593, 18941, -9308, -26708, -16294, -21582, -29106, -58442, -29703, 18734, -5861, -7067, 40904, 89900, 125649, 51596, 1897, -18415, -62171, -3201, -2188, -29114, -54531, -5702, 17934, 8148, -57152, -46678, 1457, -21006, 50012, 42345, 26901, 4780, -14815, 29155, 15890, 52084, 85138, 36674, -18332, -591, 59488, 25800, -51552, -55032, -8534, 5001, -40700, -26257, 2519, -717, -9227, -19956, -33893, -27908, -36196, -33905, -21932, 10328, 33980, 50065, 7545, 23257, 43477, 7949, 4212, 46845, 49696, 16502, 3899, 44625, 73017, -604, -52851, -65356, -39587, 23780, 38688, 23819, -28685, -3516, 65852, 112198, 55248, 50003, 51091, 34687, 12154, -24717, -24264, 29723]
14221B9723K2091o5523Q809p714l3078q0318N1177K4197L2408J289l6625m209
14209e7773J5503N9986J8434n4864l0750k0562k190J8892p25J5084L6677k0091
14197b2379j5972q099K3549l809l6487k448K638K9878L5525J3414j2094j7737
14185a4021l796m3645l3036j7680J0876l9302R3416M2891M818N0677J3060l561
14173F0697r0696l4286N659P4336M141o9156p6672N3628K8191L3322K6503j4444
14161A223l2072M2269O5515k2195n9462o3360k8220L2878J0419k0778N6549j4933
14149c2167k8209J9451j8080k3358P7836M6725M249j7817L36j6213q0119J7538
14137d9828M8048K8539M633j458o2208l4192k3557P2982J023k8608J5564O198
$$ y = [29723, 51814, -13709, -4900, -12614, -45692, -126010, -74833, -50636, -18228, -16939, -53564, -57773, -42270, 17716, 36150, -18714, -49464, -70026, -72216, -53324, -54049, -38965, -2288, -22379, -38351, -46450, -22901, -26710, -63197, -65645, -63007, -33129, 2396, 15810, 3716, -14021, -17817, -61462, -94498, -112178, -101302, -140604, -47188, -4297, 521, 51198, 64258, 60697, -29999, -64285, -58626, 15710, 19851, -49305, -125977, -72349, -44158, -10836, 15667, 1223, -30849, 11420, 76935, 54740, -4722, -68082, -96302, -63424, -53005, -73783, -17234, -32167, -60376, -40925, -59005, -82363, -4527, 42198, 46447, 28630, 28966, 12753, -67366, -49828, -1780, 26759, 31392, 29934, -32274, -66466, -90023, -17041, -16018, -44626, -29062, -22864]
14125b2864Q697k9795q437M0134M3446n7394J491K7999M0047k3818m3737p619
14113c1850L6652m21j6937J2594k9157K620M0150N0167n7650n9747l297k1704
14101g8580k5958J031Q7918M0404l5785o6610L9673k6485J0207N1913K0274k4960
14089f958k8856J0721l404j703R377m2209k3955n2684j5069Q2816L0296J2761
14077b8867k7123J4559K1803q507p89L1529L2664K306k9595J4904k7460o0607
14065f5183O98L853L7311K3582L2486k2314L018l8854M7878L7114L1227m1225
14053D9591o3592m3817J527J1225M5034O5433o630L830p094J162j034o7137r5025
14040a06527L6231Q1724j0480l5791k7065J8521r557n4970q215P1483M0059K0221
$$ y = [-22864, -14167, -43962, -52399, -12265, 31181, -26213, -24722, 3277, 43324, 19506, -24231, -31850, 4802, 4381, -12556, 38, -29119, -26499, 13651, 63818, 6168, -53579, -56876, -78580, -104538, -103507, -15589, 24815, -10970, -77580, -37907, -64392, -54185, -2272, 18002, -6958, -35814, -25093, -28497, -30200, -20823, -63032, -86987, -139671, -154740, -71924, -41628, -28867, -55990, -41431, -19628, -28135, -28924, 2605, 35269, 37575, 7980, 22884, -4576, -65183, -64485, -60632, -23321, 261, 32747, 10433, 13451, -25403, 22475, 59589, 90816, 49591, -14001, -57818, -56291, -45066, -32, 65401, 58771, 62601, 55507, 56669, 55635, -11502, -106527, -70296, 11428, 948, -34843, -61908, -43387, -52944, -107914, -116129, -44646, -4587, 15634]
14028A5634n2770l6348K1213O7251k992j8009n765M1953j9958o5587j8047N1595
14016b1830J5179o084L188n9086k7558P6188L6633L1709m562J3103R923j5498
14004E1305n038j1018K3682m2241l5000O3213M0951k8192p6984j8803K7138J1310
13992C23J3773n2502J6041J445J3976j0857R171L0569M3561p094n5709j7831L0580
13979A5446p276m8699L5356L466j8502K0947q424j0788j6971M3106N2690K0206
13967H0557k2235j2228J0146r54l3287m1253n1532Q820N6545j2358j4918p055
13955c9752k2633P1454L5192m444P244j4598m74j8983j4436K562K663o7834m7324
13942a11363M3872K0938q310O5184J11011R490j11016l9465K6315N1617J259m8132
$$ y = [15634, -37136, -73484, -52271, 14980, 11988, -6021, -11786, 30167, 10209, -55378, -73425, -21830, -6651, -12735, -9547, -68633, -96191, -20003, 16630, 48339, 43777, 56880, 66803, 51305, 46267, 35249, 58931, 16690, -18310, 44903, 85854, 57662, -19322, -38125, -10987, 323, 14096, -38406, -22365, -20920, -6944, -17801, -8630, 21939, 65500, 58406, 2697, -15134, 15446, 8170, -40529, -5173, -1707, -20209, 738, -7686, -18474, -35445, 7661, 60351, 80557, 58322, 46094, 56240, 55286, 21999, -19254, -70786, -61966, -5421, -17779, -32697, -39752, -62385, 9069, 44261, 39817, 47061, 32463, 31989, 13006, -1430, 1132, 3795, -64039, -111363, -67491, -46553, -54863, 10321, 121332, 130822, 19806, -19659, 6656, 58273, 59532, 11400]
13930A1400n724P838k6723N326L5284O8109P808p3002n1705J9835K6230n5643
13918c0967R0249L5589l7107q81r3153n2188j5009P087P4545k736J1048J5691
13906B168j3925k5073l753j3638l0581l3119L6814j0042L3182j6088J5072O0052
13894A069O977n344J5213M2540k3094l3343l1462K4970M5656n7806l6365Q929
13882d2060L6882O3357J039j13956o5293K1960J3457k3372L8257Q0992R120o590
13870A3793J4206j5488o435J5604j2485M384P500k9431k8221k7943N3449Q492
13858b575l0923j4336j1391J8851j847J4917r564l7061p5683j147M2106O801L2213
13845f9639j5955m1661K0518M0228P698L5925J6648j94n858J4935l0735J5552
$$ y = [11400, 5676, 13514, -13209, -7883, 27401, 95510, 103318, 30316, -21389, -1554, 24676, -30967, 59282, 94871, 57764, 56883, -36270, -88458, -103467, -96380, -21835, -24571, -13523, 2168, -11757, -36830, -40583, -54221, -84802, -117921, -81107, -91149, -57967, -74055, -58983, 1069, 8046, 2702, 17915, 60455, 37361, 4018, -27444, -2474, 43182, -14624, -50989, -42060, -5178, 58179, 59218, -54738, -120031, -98071, -84614, -107986, -69729, 11263, 20383, 13793, 27999, 12511, 6076, 21680, 9195, 13579, 21079, -8352, -36573, -64516, -11067, -2575, -33498, -47834, -59225, -40374, -42221, -27304, -36868, -73929, -149612, -150759, -108653, -101852, -69639, -85594, -127255, -106737, -66509, -58811, -22886, -6238, -6432, -12290, 2645, -28090, -12538]
13833a2538k2113J78M8319P3929p029P33m944q3914m6669K551l2542m9159k3811
13820a57009K6924N4422N4765j927J584K7840o3453K178L7050Q518L858J9321
13808A4071j992J7978o922n0283j6989J3182P677l5569l143K1928L2710J5607
13796H255J8000L9601j5178n950j02330l9472P9905m079J6846L3624k4806J4995
13784A9411K8151m6367r12p418M8967k7961j8604Q879J2081J3622M8189j6338
13772F1700l8277j8196j8564m6747j0464L8540K9577j0406k9250P565j2841M766
13760d2597M0810K0641p2914n8949L7286N2654j5687J8730N451l5003Q7552M5419
13748H3393o9214m0741N9489K6679J710j2067K6725j4096m8607p7822o251K873
$$ y = [-12538, -34651, -34473, 13846, 87775, 80746, 81479, 76535, -7379, -54048, -51497, -84039, -133198, -157009, -130085, -75663, -20898, -22825, -21241, 6599, -56854, -54676, -17626, -9108, -5250, 14071, 12079, 30057, 23135, -27148, -44137, -30955, -23278, -58847, -61990, -40062, -7352, 8255, 26255, 65856, 50678, 44728, -57602, -97074, -17169, -21248, -4402, 29222, 4416, 19411, 47562, 1195, 283, -7135, 41832, 13871, -4733, 4146, 16227, 29849, 78038, 61700, 23423, 5227, -13337, -60084, -70548, -32008, -2431, -12837, -42087, -34522, -47363, -42597, -1787, 18854, -54060, -113009, -75723, -23069, -38756, -20026, -14575, -49578, 37974, 83393, 14179, -26562, 32927, 59606, 61316, 49249, 75974, 61878, 13271, -64551, -70802, -67929]
13736f7929P387N2820L7834j0726m8715o9206J0231K4586K9844J1471p7396J8965
13724h0834K2803j1617M4907J2461o261J886J8341j0651j7646P639L8887L6370
13712E6285q597j9744J972k4234o6038N9529K7531k8932p9486j7236L3103K209
13700f3638N7457M3527k7038n1031j4550L256O9540K30j3827J2082K4411M2934
13688H3353l3918q0214l7513l5119J1226k2203L4786N0852J3838P2571J2486j349
13676F8796J7845m2274p0829K8666k282J5243J7217N790o941j6463r120K7933
13664C3581l3849k0480N570o0835N4075M3447q638L0865M1534j6461m4953J06
13652B3962M7056O3192K356o2694p0854q2430j9741P3416O9019M379l7556K5677
$$ y = [-67929, -60542, -7722, 30112, 19386, -29329, -98535, -88304, -63718, -33874, -22403, -99799, -80834, -58031, -69648, -24741, -12280, -18541, -16655, 1686, -8965, -26611, -18972, 19915, 56285, 47688, 27944, 29916, 5682, -60356, -827, 26704, -2228, -81714, -98950, -65847, -63638, -6181, 37346, 10308, -40723, -55273, -52017, 17523, 17753, 3926, 16008, 40419, 83353, 49435, -30779, -68292, -103411, -92185, -114388, -79602, -28750, -14912, 57659, 70145, 68796, 86641, 44367, -26462, 2204, -78, 15165, 32382, 38172, 31231, 14768, 5648, 33581, -268, -20748, -15178, -76013, -21938, 21509, 12871, 43736, 85270, 68809, 23856, 23962, 71018, 134210, 136566, 73872, 3018, -79412, -99153, -25737, 43282, 47661, 10105, 35782]
13640C5782L2645j465n0361k9415j2462j439J2855K1536J2229j3467m7124K5594
13628a5092K9000L9246R803k1225n6672j3103R641k301Q525j9010j1495M6683
13616D000k8584R974K3120m4219l4591O5435L396l783l87j7977o7357P815K1002
13603f2156N7899l5973N349M3436M1465m1257n4374m6688K7710K9591K2867q224
13591b0355m671L5807M3122j8277Q545P518l7139m2257M4691M6742K0029k3152
13579F0603n8148k3123j4020j5325r535M1273P0091q358k8837j1083k1292O545
13567a1209r90j3976M3784j6104j455J2551K8713J6975n2819l0826n6184k1076
13555a02616J1572L320M3843J8109K8982K2274L4972J8878N909r466q946k957
$$ y = [35782, 68427, 66962, 16601, -12814, -25276, -26715, -13860, 7676, 19905, 6438, -40686, -15092, 13908, 53154, 62957, 41732, -14940, -28043, -18402, -20703, -12178, -31188, -42683, 4000, -24584, -14610, 8510, -35709, -70300, -4865, -1469, -5252, -5639, -23616, -90973, -83158, -62156, -4257, -40230, -34881, 8555, 50020, 8763, -45611, -92299, -64589, -34998, -12131, -20355, -25026, 10781, 53903, 35626, 44171, 51689, 14550, -27707, 16984, 63726, 83755, 60603, 2455, -20668, -34688, -50013, -59548, -18275, 51816, 43458, 14621, 3538, -17754, -11209, -12199, -26175, 17609, 1505, 50, 12601, 41314, 58289, 5470, -25356, -81540, -102616, -91044, -87724, -43881, -25772, 3210, 25484, 60456, 79334, 85243, 75777, 66831, 63874]
13543F3874J2207j2252j7004n9058q638o3619J7599O742M0269P4399N6464l8448
13531G2535j08544M457J6654J489p441j0660O1199K7173L319k2509L0478k4674
13519D3476n6519k2266N1283Q763j7445M3730P3873k5655n4o7817p6841n413K6929
13506b3956K031m9922k0018m1576K1911O5438J7485m097r045M0657J5997j4387
13494E18j6220K6221N5193l789l2540Q732j1237N4249o798o6369j524L3251k5801
13481A3886l3272k9464m818M1443n987q081P6706R813n5883k9007N1384l2399
13469e679j6323L1304l498N034l417L4218K0951J2141l766m8700m8274n885N7653
13456B5759M405n362j1502L052o4777o283M8426m9051k1410M1532L7569O0826
$$ y = [63874, 76081, 63829, 46825, -12233, -20871, -84490, -66891, -60149, -19880, 54519, 110983, 72535, -36009, -31552, -14898, -13409, -20850, -31510, 29689, 56862, 60181, 37672, 68150, 43476, -13043, -35309, 15974, 24737, 7292, 51022, 124895, 99240, 99186, 31369, -45472, -50885, -23956, -21925, -71847, -91865, -133441, -111530, -46092, -28607, -32704, -41749, -1092, 14905, 518, -15702, 10519, 65712, 61923, 29383, 38115, 26878, 81127, 74329, 7960, 6436, 39687, 13886, -19386, -48850, -53668, -12225, -18212, -26293, 50413, 60226, 4343, -24664, 26720, -5679, -22002, 9302, 5804, 10838, 7421, 41639, 62590, 74731, 70965, 22265, -26009, -31894, 25759, 30164, 24802, 13300, 16352, -48425, -54708, -6282, -55333, -76743, -35211, 2358, 63184]
13444F3184J1200m6161K022o6594n114L0796n0258j4698p898M9862k317j1284
13432d7260L9693p542L3066j8220j5455j3625j298M6781k2541q1502m513N9797
13420c2619P1180M9185n0165m4299J1133R133L4079O2268m0595n6033k2730n0621
13408f0084L6693M298q687L1703j84K0025Q2452j9750l6233m3642J5951K7340
13396D9882P7976K9234l1283l5101j2281m3544l7924J3348M3531j8788j5613n6513
13384c7076N1854J1855l1314n175L6063k4166L3835J9595M789J0328o1589o0510
13372e1511k4594K2421L6016K3177N1624N074m4597o1087k3893N2899M3213L3051
13360F1793j6422K7726M4069M926m1630k363k4105o6519l4730P7593L6061j1279
$$ y = [63184, 74384, 28223, 30245, -36349, -41463, -10667, -60925, -75623, -83521, -33659, -35976, -47260, -7567, -15109, 17957, -263, -15718, -29343, -30641, 16140, -6401, -87903, -92416, -32619, 38561, 87746, 37581, -6718, 4415, 13548, 47627, 109895, 69300, 13267, -9463, -60084, -23391, -19093, -27780, 3923, 3739, 23764, 106216, 86466, 50233, 6591, 22542, 49882, 127858, 157092, 125809, 90708, 78427, 34883, -3041, 10307, 53838, 35050, 19437, -37076, 14778, 26633, -4681, -9856, 26207, 2041, 35876, 55471, 60260, 70588, 8999, -51511, -76105, -53684, -17668, 5509, 57133, 62207, 17610, -43477, -67370, -14471, 28742, 61793, 45371, 73097, 117166, 122092, 80462, 78099, 53994, -12525, -47255, 30338, 66399, 55120]
13348E5120K783n3404j395J573o066k1293K2769L8313j2199K2654K4178j2751
13336F0282o5636o8790j69k312K2033O1712N5143l0302K8169L7438j4964m4314
13324C8290j7184J0009m4749q354N0891M7442k8710N242k7426l1113M3445K5433
13312F3216k72O943K0306J0204M0240q782r5817m4762N3384K1188P1676k7446
13300A10078m4633q628K7592l0069k6123k039M472M0558L4205j0228K0722j6306
13288I9601p9004L581n2069k5500k9460L7122M2370P5018P316m9219p0226j6496
13276e6966L8088K493j161r899j2161J6347J6423J0285o55J5422r583m7361J3485
13263b5243k0580K5734K6376J0213J3718K9066k8648m7863j8452J3444R9966O236
$$ y = [55120, 57903, 4499, 3104, 4677, -1389, -22682, 87, 38400, 26201, 48855, 73033, 60282, -5354, -74144, -74313, -76625, -54592, 7120, 62263, 31961, 60130, 97568, 82604, 38290, 21106, 31115, -13634, -21988, 28903, 76345, 47635, 52877, 25451, -5662, 37783, 63216, 62944, 69887, 90193, 100397, 140637, 131855, 36038, -8724, 44660, 65848, 137524, 110078, 65445, 56817, 84409, 54340, 28217, 26178, 30650, 71208, 105413, 95185, 115907, 99601, 20597, 24178, -27891, -53391, -82851, -45729, -3359, 71659, 78975, 29756, -40470, -56966, -18878, -16385, -17546, -27445, -39606, -23259, -6836, 3449, 2794, 18216, 8633, -38728, -25243, -45823, -20089, 6287, 16500, 30218, 59284, 30636, -17227, -35679, -22235, 77731, 83967]
13251H3967n3213j1118k7592j905j3931L9359j9693K4143M659K6011l6529l637
13239A0521j3596J07378M5167o4489k9425L1207J7013j9036J144j1529j7608k3365
13227C3382L4853l6767o6054L7956O6007n0340l4907J6295k7470r126O3566L1252
13215E8647l0150O274j7540L6768k0222o8872l796O077r643M6000J9443r185M7530
13202F1331J6904K193q0177o1944L8519K1180L0351K0619J9413L8172n5954J6915
13190F7522L0221n59m2804j0910o152K8679M7263J7223m7553k8982m470R340J6563
13177G5381P2947j8221q2599k352k036N3310K8260k3234l983K5919n3511k8230
13165D1651k5256P3073J00736M7242O448M0830j0945n1426J9168O7474J13423
$$ y = [83967, 30754, 19636, -7956, -9861, -23792, 15567, -4126, 20017, 24676, 50687, 14158, 10521, -3075, 104303, 149470, 84981, 55556, 86763, 103776, 84740, 85884, 74355, 56747, 33382, 68235, 31468, -34586, 3370, 69377, 19037, -15870, 425, -27045, -36171, 27395, 58647, 28497, 34771, 17231, 53999, 33777, -35095, -38891, -32814, -42457, 3543, 22986, 13801, 61331, 78235, 80428, 251, -61693, -23174, -1994, 28357, 48976, 68389, 106561, 50607, 67522, 97743, 97184, 54380, 43470, 37318, 65997, 113260, 130483, 82930, 53948, 49478, 58818, 75381, 148328, 130107, 47508, 45156, 43120, 96430, 124690, 101456, 97473, 123392, 69881, 41651, 16395, 89468, 190204, 237446, 243894, 284724, 273779, 222353, 241521, 308995, 422418]
13154D22418O3780J03725J56482K58532L76777M15870L92036Q8526j49461l24609
13144A804076m61522l38333k52893j64409j26660q1567o8862R572J8737n361l4446
13133B98332p9177k7988N6198P1066J4329n8178p1172l8325j0985M2191L3804
13122B30095K2847o4065k8538j9841J5247M7321r119l0024M1039N6045L3880j5985
13110B78902o3759M651J6418k8123l0117K8104N190j2299l7813j1838m0512k534
13098A06270N7884k1569q2905k0041p209J6645k9063R029j5617j1402j0111N364
13086b725n638L961P198L8908O824k8429l0919N8182K1430l0146o646L9346l0254
13073D1092R845N3151K6145l7018k0411j1145L2545M8497j1258n3796k4754k0365
$$ y = [422418, 486198, 589923, 746405, 1004937, 1381714, 1797584, 2189620, 2278146, 2128685, 1804076, 1342554, 1004221, 751328, 586919, 460259, 378692, 309830, 319402, 338139, 332778, 298332, 219155, 191167, 247365, 318431, 332760, 274582, 203410, 165085, 154100, 196291, 230095, 252942, 188877, 160339, 140498, 155745, 203066, 193947, 163923, 204962, 261007, 294887, 278902, 215143, 219794, 236212, 208089, 177972, 206076, 211266, 198967, 161154, 149316, 108804, 106270, 164154, 142585, 59680, 39639, 32430, 49075, 20012, 29041, 13424, 2022, -8089, -2725, -8363, -4402, 2796, 41704, 48528, 20099, -10820, 47362, 68792, 38646, 32000, 71346, 41092, 50937, 104088, 130233, 93215, 72804, 61659, 94204, 142701, 131443, 77647, 52893, 32528]
13061C2528K8493l086k2851K9091Q7672N759j10327k9825O5391K7110K8388k682
13049A35661L29j6656l7454k3660l761M7706k1323J9564L4852O0849k4961r254
13037A61892m8903q5379K5058P384l2963K7827P2643L5487k2393k8216q1386o7148
13025c6097m7191L0366M1643K0567R775r251K2734m1011l4947Q3643L1379J655
13013G3265l1079N003O3879M6385k8718k7931J4166j5363k5180J7658K7343M2466
13001A61894O684r3440m2367o1051p4735L2559Q8068K6593O7442N5540O65m7567
12989A20285j9536J8195N734j6615o8327O3981O6128K5171j086L5476O754j2965
12977B23195k946k8172J5032J950O7472N7837k0100p592k5434o893j2386L478
$$ y = [32528, 61021, 57935, 35084, 64175, 151847, 157606, 47279, 17454, 82845, 109955, 138343, 135661, 135990, 119334, 81880, 58220, 54459, 102165, 80842, 100406, 135258, 196107, 171146, 161892, 112989, 27610, 52668, 60052, 27089, 54916, 127559, 163046, 140653, 112437, 31051, -36097, -83288, -52922, -11279, 9288, 19063, 9812, 32546, -8465, -43412, 40231, 71610, 73265, 42186, 47189, 111068, 157453, 128735, 100804, 114970, 99607, 74427, 92085, 119428, 161894, 168578, 75138, 32771, -28280, -103015, -70456, 17612, 44205, 111647, 167187, 167852, 120285, 100749, 118944, 124678, 108063, 39736, 103717, 169845, 195016, 193930, 229406, 236160, 223195, 220249, 192077, 207109, 209059, 276531, 334368, 314268, 306676, 281242, 274349, 261963, 265441]
12965B65441M1842K8294l3207k2623p3674o5978l2848P205j1885j2351n4081j0650
12953B5485j2170L7181J0503N252N0999M7503K6515J2199l2915k1171o081k4302
12941A18998o823m868L0465N7008n4383k3880K5331M4955l6946k2402l9654n6947
12929C0854j969J5260J1590L9129j5235k3094P5768j604m2932K1K5807R431K3489
12916A46515L5398j11739n5155k2116l765O7392O919k3682j144O1331N6915K229
12904A59098P4009J11226N5676M3052P9687j7109l8614q9087o6690K8367j3198
12893C26417J3854j7031m5026m1117m4941P1451N7871Q1876L9370j902K0246o9345
12881C91723J5489m0718J2162p275N694p1298j8683r8160q454J3455K7666M6038
$$ y = [265441, 307283, 335577, 302370, 279747, 206073, 140095, 107247, 114452, 102567, 90216, 36135, 25485, 13315, 50496, 60999, 66251, 117250, 164753, 191268, 203467, 170552, 149381, 143300, 118998, 112175, 107307, 137772, 194780, 140397, 116517, 141848, 186803, 149857, 127455, 87801, 30854, 28885, 44145, 55735, 94864, 79629, 56535, 132303, 130699, 87767, 87788, 113595, 123026, 146515, 181913, 70174, 15019, -7097, -10862, 56530, 63449, 39767, 38623, 99954, 156869, 159098, 233107, 344333, 400009, 443061, 522748, 505639, 467025, 377938, 311248, 339615, 326417, 340271, 323240, 278214, 237097, 192156, 263607, 321478, 403354, 442724, 440822, 461068, 391723, 407212, 366494, 378656, 371381, 377075, 305777, 287094, 188934, 180480, 193935, 221601, 267639]
12869B67639k8779q8727l9797k1968K2969J2553P7371J00547J0387K592q124k0929
12857B85734k3996j14228o5173M7888O3990N9994J1668j3542O6798J6596k1288
12846C14441M5105J18942K0447L7104j7275m9889r0737j52228o6661Q692Q5035
12835B52976R0961J5810L0093J0308N9454O6667j8707m5929K4095P0622J04301
12824F60651N3081j1336J2987N4441O2322J1121R353j1940k4356q6287l1227J0632
12812G09442n2703M811P739L0294m8419k7322M7315L0283j4410K6425M8828M4600
12800H06883m6810n4609N7170J01827M6773L8659J0306j3741k3664N5485L2838
12789A011117r953p406j8841J0623K9065J1504m3929l2016N4969O0305P243L5086
$$ y = [267639, 238860, 150133, 110336, 88368, 111337, 123890, 201261, 301808, 312195, 314787, 306663, 285734, 261738, 147510, 82337, 130225, 194215, 254209, 265877, 252335, 319133, 335729, 314441, 359546, 478488, 498935, 536039, 518764, 468875, 378138, 225910, 159249, 167941, 252976, 343937, 359747, 389840, 400148, 459602, 526269, 507562, 461633, 485728, 556350, 660651, 713732, 702396, 715383, 769824, 832146, 843267, 852620, 840680, 816324, 730037, 698810, 709442, 656739, 661550, 669289, 699583, 651164, 623842, 671157, 701440, 687030, 713455, 762283, 806883, 760073, 705464, 762634, 864461, 911234, 949893, 960199, 946458, 922794, 978279, 1011117, 1001164, 993758, 974917, 985540, 1014605, 1026109, 982180, 950164, 1005133, 1065438, 1072681, 1107767]
12777A107767N4661N5076K5252J4651M1882J6536J928J06556N5230K4070O161
12766A509770J08257J49166J46536R3113M9467K993L0450R4907Q3708N1765M7206
12755B367338O0244J09839J04244Q3198O7092J00272J78958J59545J72515J39869
12745C543114J50574K50238K75001K62691K35495K84713L49085L48646K95524
12736E995081M20573M99575N50785O18022O95668P72574R51235J165493J419471
12727A3088477J705829K054587K557956L127190L881325M669165N573111O908818
12719D3566458R238581J3264102K0526027L2573303N0564906P1054393Q1550600
12712C22338370O8087883L0422893j8840108o1455658p9338051p3017543n0891659
$$ y = [1107767, 1162428, 1217504, 1242756, 1257407, 1299289, 1315825, 1317753, 1424309, 1479539, 1503609, 1509770, 1618027, 1767193, 1913729, 2006842, 2056309, 2059302, 2089752, 2184659, 2268367, 2320132, 2367338, 2427582, 2537421, 2641665, 2724863, 2791955, 2892227, 3071185, 3230730, 3403245, 3543114, 3693688, 3943926, 4218927, 4481618, 4717113, 5001826, 5350911, 5699557, 5995081, 6415654, 6915229, 7466014, 8084036, 8779704, 9552278, 10503513, 11669006, 13088477, 14794306, 16848893, 19406849, 22534039, 26415364, 31084529, 36657640, 43566458, 52805039, 66069141, 86595168, 119168471, 169733377, 240787770, 322338370, 390426253, 420849146, 402009038, 340553380, 261215329, 188197786, 137306127]
12705A37306127l0350275j7916020j1101535p573522o000056n494235n272391
12698E3598093m772318l879909k828995j894873j321704j217692j544981k009345
12690C4128276k257014k274378k115260j794079j477533j224244r40641p75222
12682B1269905o69364o39519n62233m29997k84103k30633k10450k26634k93515
12673A7723457n02985p58188p67736p70212p66523o52817n24871m39971l92272
12664A2147882l62238m33439m93250n00900m34575l97019l15753k89544l31521
12655H589643j78975j47682j80863k33300k36855k34715k79025k07339k02204
12646F688685j78015j77475j46538j72536r9277j12864j54010j95639k34005j51303
$$ y = [137306127, 106955852, 89039832, 77938297, 70364775, 64364719, 58870484, 53598093, 48825775, 44945866, 42116871, 40221998, 38900294, 37682602, 36137621, 34128276, 31871262, 29596884, 27481624, 25687545, 24210012, 22985768, 22045127, 21269905, 20600541, 19961022, 19398789, 18968792, 18684689, 18454056, 18243606, 18016972, 17723457, 17220472, 16462284, 15694548, 14924336, 14157813, 13504996, 12980125, 12540154, 12147882, 11785644, 11352205, 10858955, 10358055, 9923480, 9526461, 9210708, 8921164, 8589643, 8410668, 8262986, 8082123, 7848823, 7611968, 7377253, 7098228, 6890889, 6688685, 6510670, 6333195, 6186657, 6014121, 5914844, 5801980, 5647970, 5452331, 5218326, 5067023]
12636E067023j18445j66668o9030L0135M3197J5283R186o3551j67852j18193k11872
12625D249213j93724j17526j73507j55998j79148j30369r8888j41384j01256n4733
12615B902680o9805k1315j5012m2485p6040O949m4977p2548p3357q8834l266q431
12603B393559n3743K3983j238k5809p6770j04362q9370q6554j15534r7995m6076
12592A720091n757p4754q5696m4307j0970k2508M8141r571K528P2067R3646J25027
12580A807937J78466K32322J13514l6049j84795k42720k18015k48553k17084j18895
12570A066128n5645j21698r9348j8466j276k6407p7190k5618L2346k5101k4300
12559F23425J3452l0619J3781N3247L4449l3049j8499k9650j9343j0422k4508
$$ y = [5067023, 4948578, 4781910, 4712880, 4743015, 4786212, 4801495, 4810681, 4747130, 4579278, 4461085, 4249213, 4055489, 3937963, 3764456, 3608458, 3429310, 3298941, 3200053, 3058669, 2957413, 2902680, 2832875, 2811560, 2796548, 2754063, 2678023, 2684972, 2639995, 2567447, 2494090, 2405256, 2401990, 2393559, 2339816, 2363799, 2362561, 2336752, 2259982, 2155620, 2066250, 1979696, 1864162, 1766167, 1720091, 1714334, 1639580, 1553884, 1509577, 1498607, 1476099, 1524240, 1514669, 1517197, 1589264, 1682910, 1807937, 1986403, 2218725, 2332239, 2296190, 2111395, 1868675, 1650660, 1402107, 1185023, 1066128, 1010483, 888785, 789437, 770971, 769695, 743288, 666098, 640480, 672826, 647725, 623425, 636877, 606258, 620039, 673286, 707735, 674686, 656187, 626537, 607194, 596772, 572264]
12548E72264p914n9034k0307p888R281O622K6651M3247K6325j1372q6866l5948
12536D55061M0068l6596j15169m1097M7191K8232k8054k1965j0148l1753n9465
12525B26305j05538p1851J36O4879R2323P9305R9826J6641M1813K1442m1655m876
12513D18750L6062L3108L2033j06259o2905L427O13L1803r342m3442M5080K6931
12501D05859l2527p2335J3470R5642K2122j2052m7534m7728J2798J7139j2332
12490C42522P277j0431J6404j5916m8685p574J2826r631L0649L7901l5583m0155
12478B79604l5892m820k236N0710N5493n029L2242P21o3133m2667k470M2279j5064
12465B89738l0448K0242M2871j601j5718N417J9807j7281l6535m0629J2338p397
$$ y = [572264, 564350, 505316, 485009, 477121, 486402, 493024, 519675, 562922, 589247, 577875, 491009, 455061, 495129, 458533, 343364, 302267, 349458, 377690, 349636, 327671, 317523, 285770, 226305, 120767, 48916, 49052, 113931, 206254, 285559, 385385, 402026, 443839, 465281, 423626, 418750, 454812, 487920, 519953, 413694, 350789, 354216, 354829, 386632, 377290, 333848, 378928, 405859, 373332, 300997, 314467, 410109, 432231, 420179, 372645, 324917, 337715, 354854, 342522, 349799, 339368, 355772, 339856, 291171, 283597, 296423, 286792, 317441, 355342, 319759, 279604, 243712, 238892, 236656, 287366, 342859, 337830, 370072, 370793, 307660, 264993, 262523, 304802, 289738, 259290, 279532, 322403, 320802, 305084, 310501, 330308, 313027, 276492, 235863, 248201, 240804]
12453B40804L0421n5826l5889n9681N447l1691J6219L0953N1456M4446j7540m2189
12441A76930N8794k936n7977j5746L2208n771K402j8857l2462p4917n9405N9245
12429F1508k0379l2117n269K7615L8652L7404k9442o1327k1815L611k7338j4150
12417d3047N5068K2209k9449o694j5438j9670k8227K3871L1574P7105N8213j2445
12405A13070j6451J6536Q063j1547J8244k0209l5135j0422m1208n239L4168O7855
12393A17725M876j9572j03512l0177K5471M2009m3356l624P4345P2824N3869n0481
12381A40397o0136l3595k2427j1202K432M6785K2167q401M0601K3929k5407n4418
12369F0725L8581l9r361j6674k5q6050m7738k3588N1037K7560R887J8871M569
$$ y = [240804, 271225, 215399, 179510, 119829, 125276, 93585, 109804, 140757, 192213, 236659, 219119, 176930, 235724, 232788, 174811, 159065, 191273, 185502, 187904, 169047, 136585, 61668, 2263, 61508, 41129, 9012, 3743, 31358, 70010, 107414, 77972, 16645, -5170, -1559, -28897, -43047, 12021, 34230, 4781, -1913, -17351, -37021, -65248, -41377, -9803, 67302, 125515, 113070, 96619, 113155, 121218, 109671, 127915, 107706, 72571, 62149, 20941, 15702, 49870, 117725, 122601, 103029, -483, -30660, -5189, 36820, -6536, -10160, 64185, 137009, 190878, 140397, 80261, 46666, 24239, 13037, 15469, 62254, 84421, 76020, 116621, 140550, 115143, 60725, 99306, 99267, 89906, 73232, 73207, -12843, -60581, -84169, -33132, -5572, 4315, 23186, 27755]
12356B7755p1233l1463R0514L2090J453l3642l3799J3101J3316j7054j8149R208
12344a7903P0171M2186j5414L1356o9130m8215M7171J7271R704K7037K8113J5831
12332A38178l0325J492k4914k9068j9955l4845r966M9938P8666j3101j4887r741
12320H1472j3887J8166M1391R565R808K112J614K25n9299o9967j6591J3616m7803
12307b9578k9819K8499L6485l6970L6855O0503k426k3983J2652m3163l7657j6018
12295d4620m980L4840O6787N6971R978l8451J2673q459p857k5212J1144P0004
12283A32818N8846L9869l8139j1330r225J8625O5812Q1890M3155N1951J16369
12272E50641K76680L95644M43963L72481J51214q1824k74564m37353m43591l12329
$$ y = [27755, -43478, -74941, 15573, 47663, 49116, 15474, -18325, -5224, 8092, -8962, -27111, -17903, 52268, 94454, 79040, 110396, 41266, -6949, 40222, 57493, 67197, 94234, 122347, 138178, 107853, 109345, 84431, 55363, 35408, 563, -9403, 40535, 119201, 106100, 91213, 81472, 67585, 85751, 127142, 136707, 146515, 148627, 150241, 150466, 91167, 21200, 4609, 18225, -29578, -59397, -30898, 5587, -31383, 5472, 65975, 63549, 39566, 52218, 9055, -28602, -44620, -49600, -14760, 52027, 108998, 118976, 80525, 93198, 84739, 76882, 51670, 62814, 132818, 191664, 231533, 193394, 182064, 172839, 191464, 257276, 339166, 382321, 434272, 550641, 827321, 1222965, 1666928, 2039409, 2190623, 2108799, 1834235, 1396882, 953291, 640962]
12262F40962j28325j28919o9826j8593k3969l8513l0325L5064j8300k810k593
12251B13853k2478j4753R100K2552L7984l5228m9928p5382L502N9525L1830n5421
12239A25156r351J9904k6813l4827O2879J5294L4879P805j9716l5928p771k4144
12227A07367k2113L4524P328m9902M4825J4153l9610n2638m4996L1019Q9754j227
12215A18484k5005R977j4706k4779N746l7584j4915L9467R529N0568k5621m2843
12203D8318l3101m429m6047j6085N1129P1873R8680l5145p8437O4029J0878M907
12191A36570p878R482J6281R619o048r010q9281p6097j4483K7580L958k2917J9562
12178b662M0737J2248k6528n1403L5145K3112j1559J2590M6689Q244j6260l191
$$ y = [640962, 512637, 383718, 313892, 295299, 271330, 232817, 202492, 237556, 219256, 216446, 213853, 191375, 176622, 185722, 208274, 246258, 211030, 161102, 85720, 89222, 148747, 180577, 125156, 115805, 135709, 108896, 74069, 136948, 152242, 187121, 194926, 175210, 139282, 131511, 107367, 85254, 119778, 127106, 77204, 122029, 136182, 96572, 43934, -1062, 29957, 119711, 118484, 93479, 103456, 88750, 63971, 69717, 32133, 17218, 56685, 66214, 116782, 91161, 48318, 15217, 10788, -35259, -51344, -215, 71658, 170338, 135193, 56756, 120785, 131663, 136570, 128692, 138174, 154455, 164074, 158026, 149016, 59735, -16362, -30845, -3265, 693, -22224, -2662, 38075, 50323, 23795, -27608, 7537, 30649, 19090, 31680, 78369, 86613, 70353, 67162]
12166F7162P327K6551k7046j7289M3443L130m3834p8546L3982N9581k699j7926
12154E3836k1507j6248O199L2694K3545o1604l3644R3766k0063j929j8686l3444
12142B915n272m4228K6089Q9352p726j00429K2608l701l0393k4743j9774N4046
12130d1256M4403m0522l71l3414J089Q3868J4567m581k3144o113l9642o137J5298
12117c5955L7874J7014l4013m776j2210L6738K3979l9594k3529L5921N2815l5827
12105A8437m9359m216Q743L7592j533J9325J0374J1811j0281j5722M8661K5954
12093I9786n0475n6796l0253R61J2749j0361l5331j5155M6717L7527K8558m2055
12081a4128k6108k6893K2878K0791M6758N8832j4076r4417l1706L9690L5832K074
$$ y = [67162, 74489, 101040, 73994, 56705, 100148, 103278, 59444, -19102, 14880, 74461, 71762, 53836, 32329, 16081, 22280, 54974, 78519, 16915, -16729, 77037, 56974, 55045, 36359, 2915, -2357, -46585, -20496, 68856, 61130, -39299, -16691, -20392, -50785, -75528, -95302, -41256, 3147, -37375, -37746, -71160, -70071, 13797, 28364, 23783, 639, -5474, -45116, -51253, -35955, 1919, 18933, -15080, -19856, -32066, 4672, 28651, -10943, -34472, 1449, 54264, 18437, -30922, -35138, -26395, 11197, 9664, 28989, 39363, 51174, 40893, 25171, 73832, 99786, 49311, -7485, -37738, -36777, -24028, -34389, -69720, -84875, -38158, -631, 27927, -14128, -40236, -67129, -44251, -23460, 23298, 82130, 68054, -26363, -58069, -18379, 17453, 19527]
12069A9527K1758M4779r867j21674l7118N1520r789p781L3492N6145M9443j8679
12057G1756o9343K0289J4811J9519k3516m7781J8082l2671j5561k6533l3881K5437
12045g9392O3454o5065j6894R9762N1309K2159L8974m0522n4424Q879J3457J3112
12033E4809j8076J1010L5738l8679o5772j2902M9259O036n2863k9627p253q150
12021g6470L2890Q2352K0413J1210l8815p1255J2982L1085N9659M1049o5661n5546
12009a6107J0775K9947O4873L4200j1913p8336O636j3554K0295q985K7253L8760
11997A03844j8153m5861m533j7857k5152k4967o0644k6573N0611R252K7756N8199
11985B5922l8082o5373r48L2771O7543m8256l259n2554k6242Q5078M4699L5390
$$ y = [19527, 41285, 86064, 76197, -45477, -82595, -31075, -40864, -48645, -15153, 40992, 90435, 71756, 2413, 22702, 37513, 57032, 33516, -14265, 3817, -28854, -44415, -70948, -104829, -79392, -15938, -81003, -97897, 1865, 53174, 75333, 114307, 73785, 19361, 28240, 41697, 54809, 36733, 47743, 83481, 44802, -20970, -33872, 15387, 21423, -31440, -61067, -68320, -76470, -43580, 38772, 59185, 70395, 31580, -39675, -26693, 4392, 64051, 105100, 39439, -16107, -5332, 24615, 89488, 123688, 111775, 33439, 40075, 26521, 46816, 37831, 65084, 103844, 85691, 39830, 35297, 17440, -7712, -32679, -93323, -119896, -69285, -60033, -32277, 25922, -12160, -77533, -78481, -45710, 21833, -26423, -29682, -82236, -108478, -23400, 21299, 56689]
11973E6689n1217q1636K6493L7446J0968k8768r610K7459j4068N475l937l1437
11961e6143j5627j1689k3732K6056N5203Q714J8692R3681Q0014r4292r8613K9638
11949A1902J5362l4167M1786k8574j03721j4517L4380K6151N0884O7872j01669
11938c4311j02170K0568J1047O7796K2281M4738K2108j4980K2314r88n9055m537
11926e189M6183M2595m4429l1163n1783J7854q294p3978L2128J00905j3324n1328
11914c9823K5964M982m165N756M3390j8638q4729L6039M7434O572m941K0593L448
11901D1882Q276m3621J6480o1050O413M3626L8118l8707K314M5365J082K3484
11889H3662m9382m4447n0247o6593j1984J42102Q6294k0384m7052r6770n5746
$$ y = [56689, 5472, -76164, -49671, -12225, -1257, -30025, -39635, -12176, -26244, -20769, -24706, -56143, -71770, -83459, -107191, -81135, -25932, -17218, 1474, 95155, 175169, 80877, -17736, 11902, 27264, -6903, 34883, 6309, -97412, -111929, -77549, -51398, -514, 67358, -34311, -136481, -115913, -104866, -37070, -14789, 29949, 52057, 37077, 59391, 58403, -652, -5189, 40994, 83589, 39160, 7997, -43786, -25932, -34226, -108204, -76076, 24829, 11505, -39823, -13859, -8877, -13042, -7286, 36104, 17466, -67263, -31224, 16210, 22782, 17841, 38434, 41882, 50158, 6537, 23017, -38033, -31620, 12006, 50124, 11417, 13731, 59096, 60178, 83662, 34280, -10167, -60414, -127007, -138991, 3111, 89405, 69021, 21969, -74801, -130547]
11878a30547O0531L2951K3753j6835K4778n37N3239M4876l7671o9592m8106M5052
11866a8108N4812j3824N285q5538J204O2456O896j8438k2821m0223l0042l245
11854a01586j749K9739M3703l0337j109j7137K1305K6627L2919N2497k1509k4243
11842I120j64J4206m4691m1079J9991j1871L0389L3830L6388J9003n042m2321
11830A7759j07029J1904K8136N3220K3611K5095n806K2435J5293k543r2522k0594
11818c1041N929j6804M3418m4974o4439J954J1558K161O082K5499q90k6008L4014
11805e3541j3595M8300P666k6144K3840L5084J4798O7714r682L2423L332m5488
11793H4707p1495l6717m915P2712O5220L244n12M7407k6853o6183j8374k7578
$$ y = [-130547, -70016, -37065, -13312, -30147, -5369, -5906, 47333, 92209, 54538, -15054, -63160, -18108, 36704, 22880, 28165, -57373, -56169, 6287, 13183, -5255, -28076, -68299, -98341, -101586, -103335, -73596, -29893, -60230, -61339, -78476, -57171, -30544, 2375, 54872, 33363, 9120, 8956, 23162, -21529, -62608, -42617, -54488, -24099, 9731, 46119, 65122, 60080, 17759, -89270, -77366, -49230, 3990, 27601, 52696, 46890, 69325, 84618, 82075, -10447, -31041, -25112, -41916, 1502, -43472, -107911, -105957, -94399, -92238, -86156, -60657, -61547, -87555, -53541, -67136, -18836, -11170, -37314, -13474, 21610, 36408, 104122, 94440, 126863, 130195, 84707, 13212, -23505, -28420, 44292, 109512, 112756, 112244, 159651, 132798, 66615, 48241, 20663]
11781B0663J4785K5576M615n8097m6176R412m1702M5245K9957p375l5485L725
11769c4857J1257j4393K917J5363k2131M4800N3203O4633O3208j4145q1620o9381
11757A8854n2209l0083O8612N1702J583p9372M1251J8837k4962o759j6615L3464
11745B4303M6608R9849P6216N7550Q988n8720o2568r8630n4962n062J0661J8462
11733F2695q0078M4214L7849J4388j2393J5250n6229n9685L267J8151J2359R319
11721I107M1672k4418K9250L8467K257O847p1918k5248m0227k5488o6911p619
11709a34229M9339Q4357P4119N010p0450R491M8008J9797J0932R993k8347n2147
11697B5873m8041J3851M7708O4046K6226K7730r130r0462m615L393J7149N8926
$$ y = [20663, 35448, 61024, 65639, 7542, -38634, -29222, -70924, -25679, 4278, -3097, -38582, -34857, -23600, -37993, -35076, -19713, -41844, 2956, 56159, 120792, 184000, 169855, 88235, 18854, -33355, -63438, 5174, 56876, 58459, -20913, 20338, 39175, 14213, 7454, -9161, 24303, 70911, 170760, 246976, 304526, 313514, 254794, 192226, 93596, 38634, 33572, 44233, 62695, -17383, 26831, 64680, 79068, 66675, 81925, 25696, -33989, -30722, -12571, -212, 9107, 50779, 26361, 55611, 94078, 96335, 103182, 31264, 6016, -34211, -59699, -126610, -134229, -84890, -533, 73586, 78596, 8146, 17637, 65645, 85442, 96374, 106367, 78020, 25873, -22168, -8317, 39391, 103437, 129663, 157393, 148263, 57801, 53186, 56579, 73728, 132654]
11685A32654q5188K6338l223q1067l4717m1361m7971M1224M7127l923P251L9575
11673c281L7229J0363j6854n5435j3529m490l9090O5108K8648m5669k0486J429
11661e6057R147N1684M6687n4971L725L535k0024l5122K0505L4554K9930L873
11649C7466N5234R2761K996n9774j2641N3231j1985k7307m0057o2447K514J6632
11637D6623j8679O5464L6288m3394p60j6899m5717k1914M3923o9263m2261m2013
11625a08602j3873j4924M401R8541L2846j7580K4792N368o1823m5152k5322K0011
11613a01317N1807o314P397L3559J9923M3062J8348M2819J488k1224J7315J458
11601A08321n3523k5686k6018k7137k9970j7989J4590Q0563L3442k5875m99l1464
$$ y = [132654, 47466, 73804, 70581, -10486, -45203, -86564, -134535, -93311, -46184, -50107, -42856, -3281, 33948, 44311, 27457, -27978, -41507, -45997, -85087, -19979, 8669, -37000, -57486, -56057, -46910, 4774, 51461, -3510, 215, 3750, -16274, -51396, -30891, 3663, 33593, 37466, 92700, 185461, 188457, 128683, 116042, 169273, 157288, 129981, 89924, 27477, 29991, 46623, 27944, 93408, 129696, 86302, 85542, 68643, 22926, 1012, 44935, -24328, -66589, -108602, -122475, -137399, -132998, -34457, -1611, -19191, 5601, 10969, -50854, -96006, -121328, -101317, -49510, -55824, -48427, -14868, 5055, 48117, 66465, 109284, 110772, 89548, 106863, 108321, 54798, 29112, 3094, -24043, -54013, -72002, -57412, 23151, 56593, 30718, 30219, -1245]
11589a245M3583p663o3227J5614K8010J0411o5630J5643k4478l335O9934Q925
11577B6542J5128l5153m3972k5372L2125j0261r870J66m366K4003J4266m5591
11565f2355j0873l429P764j4501P4082J813j2564K8216j2916k4860m3138o4502
11553a37263m3559M7527R3946O8658o897k6157m2114L785M6822L763J7286K0721
11541D6518k6096j4401K6448o53L5738J2647o060j7946l2279n9595k578k8654
11529f6911K7149k3033l607k6135J6610P7371J6069L910n4102N1205j5714k7504
11517b4692N9501K4870n4498N100j8686j7828P7806O746k0831o8080j5481J4531
11505c1542O505J31703K1202j00186p0294J3594J7556k1048L4500l86n0030o569
$$ y = [-1245, 42338, 34675, -28552, -12938, 15072, 25483, -40147, -24504, -48982, -52317, 17617, 26542, 41670, 6517, -37455, -62827, -30702, -40963, -50833, -50667, -55033, -31030, -16764, -62355, -73228, -76657, -68893, -83394, -9312, -7499, -20063, 8153, -4763, -29623, -72761, -137263, -180822, -133295, -39349, 29309, 22412, -3745, -45859, -42074, 4748, 8511, 25797, 46518, 20422, 6021, 32469, 31816, 67554, 80201, 74141, 56195, 23916, -35679, -38257, -66911, -39762, -62795, -66402, -92537, -75927, 1444, 17513, 21423, -32679, 18526, 2812, -24692, 34809, 59679, 5181, 10281, -8405, -26233, 51573, 58319, 37488, -30592, -46073, -31542, -25037, 106666, 127868, 27682, -42612, -29018, -11462, -32510, 1990, 1604, -48426, -54995]
11493e4995M2220k0206N063J0791K4823M5881J2080j6844o3708k3370n4335l280
11481i5880Q2076L9974j536j3295J9732m6042j03198J465O9017K5173N745N3110
11469C6341Q111m5401l9217J7902K2517K0977L9433m8628m1392p832Q394l9081
11457f7876M8205J5321m5890m9630K4013O7266M6160j8601j9204M4149j2860j6125
11445A4928n6476M0767J9503J1557j2815j5611L5182N176m428n3345l1925p699
11433e5186k0768L4392l3612n754j2271L2220K7370m1533j7463J9298j6701o462
11421i6470J9377p104j8234M7830l4849l188P5232J898p9553L3458K5925J9746
11409a5932J7148J118K6436k3680J462j9369n4226k6028N9712N7840L2380p725
$$ y = [-54995, -12775, -32981, -27918, -17127, 7696, 53577, 65657, 48813, -14895, -38265, -92600, -95880, -13804, 26170, 24634, 11339, 31071, -14971, -118169, -116704, -47687, -22514, -16769, 36341, 44452, -949, -40166, -22264, 253, 21230, 60663, 12035, -29357, -37189, -28795, -67876, -19671, -4350, -50240, -99870, -75857, -8591, 37569, 18968, -236, 43913, 31053, 14928, -41548, -781, 18722, 30279, 17464, 1853, 37035, 42211, 37783, -15562, -47487, -55186, -75954, -41562, -75174, -80928, -93199, -60979, -33609, -75142, -92605, -73307, -90008, -96470, -77093, -84197, -102431, -54601, -89450, -92638, -17406, -15508, -95061, -61603, -35678, -15932, 1216, 2334, 28770, 5090, 6552, -12817, -67043, -93071, -33359, 24481, 56861, 49136]
11397D9136n6648m9426m5285k3233K5139K5689L2221M3962P4227K355m1851q1544
11385d5258n774M1814J0044J6599n3068K5759L9374j05245j8761K986M0380N985
11373d5165O2195K0216j271p175j9263m6721J2405J5189q96j6442J9326m2359
11361d9961l8519L4055M8551L9941r088l6694n756P08l9050r386N2678P2857K9166
11348H9502K2176l0417o2025M2528R469j2486j1017j8296m1552m2892l0914R656
11336g6268K5902R650M4097O809J1582l479n2015J866j1303k8513M1708l640J6210
11323a7394k0018q47J5966J4441o2719l9337l8598O2352M4688J6460l6591J6926
11311d4671J5722o603k9390N3046l7590r164N4800K0462J635J3691k405J9606
$$ y = [49136, -7512, -56938, -102223, -125456, -100317, -74628, -42407, 1555, 75782, 78137, 36286, -45258, -51032, -9218, 826, 17425, -35643, -9884, 29490, -75755, -94516, -91530, -51150, -45165, 17030, 37246, 35975, 28800, 9537, -37184, -24779, -9590, -10486, -26928, -7602, -49961, -88480, -54425, -5874, 34067, 24979, -11715, -17471, -16763, -55813, -65199, -12521, 60336, 89502, 111678, 81261, 19236, 61764, 71233, 58747, 47730, 29434, -12118, -55010, -85924, -76268, -50366, -40716, 3381, 10190, 21772, 18293, -33722, -31856, -43159, -71672, -29964, -33604, -17394, -37412, -38259, -22293, -7852, -70571, -109908, -148506, -86154, -41466, -25006, -61597, -44671, -28949, -35552, -64942, -11896, -49486, -58650, -3850, 16612, 18247, 31938, 29533, 49139]
11299D9139Q821p3736j7048M3601N644l0553m2238N6657l538n4475k585M5656
11287a4655M1041Q1858o915m8001O669J6959P67L0815n974l7809J7479J428K422
11274H6084m6528k1564m7426L1136L6512r907K7529J6729m890l9933l6267p3613
11262h2138k4741M1613M8218k3314K4928R2553k8443l9946L7945J8467J8374K6308
11250A09824p3145j666L0543K1832n4092L3722M990m5051m8857N8573Q2836M6199
11238A65708J5085N6732M5502J12195L9814j4584q6367l0633j09617j31426M2080
11227A04489P599J0817L684J8036M1245k0110l3893n3758l5414J1929j7738l0609
11215F277o1241R509L1515l0529j3723l5789j0779J07494L9099J7532j8829N4311
$$ y = [49139, 57960, -15776, -32824, 10777, 16421, -14132, -56370, 287, -3251, -57726, -60311, -14655, 26386, 108244, 101329, 53328, 59997, 76956, 77723, 108538, 102564, 64755, 82234, 83662, 86084, 39556, 17992, -29434, 1702, 38214, 28307, 55836, 72565, 67675, 27742, -8525, -82138, -106879, -65266, -17048, -40362, -15434, 77119, 48676, 8730, 46675, 65142, 83516, 109824, 36679, 35013, 65556, 87388, 33296, 67018, 72008, 26957, -21900, 36673, 119509, 165708, 180793, 237525, 283027, 395222, 435036, 420452, 334085, 303452, 193835, 62409, 104489, 112088, 122905, 126589, 144625, 185870, 165760, 131867, 78109, 42695, 54624, 36886, 6277, -54964, -45455, -13940, -44469, -58192, -93981, -104760, 2734, 41833, 59365, 40536, 94847]
11203I4847m0937L235O5662k3417l7633m7346n6865k6044k5653L4377J1163K9005
11191a9606J1220K3693j1680o62K3316k9214l9246n9516k6856J0917n123K3178
11179i9579J9319J2950N721L54Q3828J2557J7574O5888m581p9806l8708l6323
11167d0806k6011j7948O6520J39310O3451k2826M8586K6018K7144M2628N4564
11156C60630o4520N201O3895M7370O081n4626p7310K047L6374k8754o7712n8213
11144A70463m5684k8423n8515j0026R904l338m2136K1953M3810O7276K9025P878
11132A62187q6085r2053n122M5021N1847L714m2371J4508j7l1431K9523M1682
11120I1403l615k1257K9732j545j9365k1433m4322j316m0216k5361M8401K2848
$$ y = [94847, 53910, 57145, 122807, 99390, 61757, 14411, -42454, -68498, -94151, -59774, -48611, -19606, -8386, 15307, 3627, 2965, 26281, -2933, -42179, -101695, -128551, -117634, -122757, -99579, -80260, -67310, -61589, -61235, 22593, 35150, 52724, 118612, 114031, 34225, -4483, -40806, -66817, -84765, -18245, 121065, 184516, 161690, 210276, 236294, 263438, 306066, 360630, 296110, 301311, 365206, 412576, 418657, 364031, 286721, 288768, 325142, 296388, 228676, 170463, 124779, 96356, 37841, 27815, 37719, 34381, -7755, 14198, 58008, 125284, 154309, 162187, 76102, -15951, -21073, 23948, 75795, 79509, 37138, 51646, 51629, 20198, 49721, 91403, 87788, 66531, 96263, 94718, 75353, 53920, 9598, 8282, -31934, -57295, -8894, 13954]
11108A3954P021l3593q3872k4813N4649P178J6675K6490J610M507K6073J3126
11096B9005L0131K5577j0840J2411n8634n1202l5944L1198k126P4562J6966l0251
11084C0853n2916l0157k8974N0782L7527k1651J7456M3826M4209J4265n7199o0806
11072a2785p4518J5415R238K0391J2191L8379K324l3095M79p244L759j7938m7553
11059i0957j6095N7937N4091J105K820k2268k4508K9446j511j8195L2323j7563
11047a3375m6343j3850K7529K9711j8047l4820J0645l164J5526P8145o561k5107
11035B89K0356J600k4287l2360m1320j6171M7591J1504K0583L8163l7966k6698
11023c8716J7999L529J354k2012k7902N8106j0710N119k2457k1122P037k9382
$$ y = [13954, 20975, -12618, -96490, -121303, -66654, -59476, -42801, -16311, -14701, -10194, 15879, 29005, 59136, 84713, 73873, 86284, 27650, -23552, -59496, -28298, -30424, 44138, 61104, 30853, -22063, -52220, -81194, -30412, 7115, -14536, 2920, 46746, 90955, 105220, 48021, -12785, -87303, -71888, -62650, -42259, -30068, 8311, 10635, -22460, -21981, -29225, -25466, -43404, -90957, -107052, -49115, 4976, 6081, 8901, -13367, -37875, -8429, -9940, -28135, 4188, -13375, -59718, -73568, -46039, -16328, -34375, -69195, -58550, -61714, -46188, 31957, 25396, 289, 20645, 22245, -2042, -34402, -75722, -91893, -44302, -32798, -12215, 25948, -12018, -38716, -20717, -17188, -15834, -37846, -65748, -7642, -18352, -13233, -35690, -56812, -49775, -79157]
11011g9157J4458L1847k409l0345k2074M713k4871J7548L1820j7910L7928M8142
10999I690L893m0477m0182L2310j3517r897N0515K3907K6008J4489j2143n8933
10987a4337l0888K0438N294n4139j5085K2418n489l4751j949O9686P0302R252
10975D0752l5981m6759P032K8864O2452M705K3234n524m8980m0917L7230M5131
10963G1239O3506K1116j02658j9670J4763L088p9340n4934O1287J1991j600L9502
10951B8290M1263m4127r791l04m0804k1497N3405O8589J6188p3810p9470K6090
10939c5978L5822n3720l0850N0893K8636L701M838K0847m5272J2016K0722J263
10927A2918j7565P002J4563O5952K0324k3142m924M1913j9794q0668k4614N478
$$ y = [-79157, -64699, -32852, -35261, -65606, -87680, -82967, -107838, -90290, -58470, -76380, -38452, 9690, 13583, -26894, -67076, -34766, -48283, -58180, -7665, 16242, 42250, 56739, 44596, -14337, -45225, -24787, -19493, -73632, -88717, -66299, -71788, -106539, -108488, -38802, 31500, 40752, 4771, -41988, -34956, -6092, 56360, 61065, 84299, 78775, 29795, -11122, 26108, 71239, 134745, 155861, 53203, 33533, 48296, 51384, -27956, -82890, -21603, -9612, -11212, 28290, 69553, 25426, 15635, 15331, -25473, -46970, 6435, 75024, 91212, 17402, -62068, -35978, -156, -53876, -84726, -33833, -5197, -1496, 3342, 24189, -21083, -9067, 11655, 12918, -4647, 2355, 16918, 82870, 103194, 80052, 75128, 117041, 97247, 16579, -8035, -2557]
10915b557j7531l922L1459N649J612J3931k347o930n931n2296J336P089r308J8232
10901b1514R1339K6076L4024K8164k6558l5889m2731K1819N4390j5340j7795M3181
10889A39166M4485j3960j2674o0421M6785K8196q7337m4224k4520p3264k5071
10878h2839J7518M351O3777N6277n810J1728L3801m9024k2655L3515N1283k1874
10866I0048j04810k0775L4706M5716M1993J6014R743o4493k8506l3531o7268K2894
10854e8269M9173N5011j6553k7289K7492K3200J431K387k883O066K4935j1302
10842G3399K886n0354o3033L1001P3385K7656l8795n4304J7171j0287P5560J3766
10830I8051l3401j5310k9183m7343K4922K0244M9463N2382j3183L7556M592k6672
$$ y = [-2557, -20088, -24010, 7449, 13098, 14710, 28641, 26294, 19364, 13433, -38863, -37527, -30438, -39746, -21514, 69825, 95901, 129925, 158089, 131531, 95642, 52911, 74730, 129120, 113780, 95985, 139166, 183651, 169691, 157017, 96596, 143381, 171577, 84240, 40016, 15496, -57768, -82839, -65321, -60970, 2807, 59084, 53274, 65002, 98803, 49779, 27124, 60639, 111922, 90048, -14762, -35537, -831, 44885, 86878, 102892, 112635, 48142, 19636, -13895, -81163, -58269, -9096, 45915, 29362, 2073, 29565, 52765, 54196, 56583, 53700, 59766, 84701, 73399, 76285, 25931, -37102, -6101, 67284, 94940, 56145, 1841, 19012, 8725, 84285, 98051, 64650, 49340, 20157, -27186, -2264, 17980, 67443, 119825, 106642, 144198, 148790, 122118]
10818A22118m3039J9134J6611r334j11653J710L5031Q6703L7424K7950n3808o518
10806A22329p0263o3738J5537L6619k6675l1646J7493K5364P849m750k7369K2084
10794B2834J4816o2043O974M6938O842N3156R93j9223q1095l6797k5252p722L7885
10781d1694L9524j973j2433M6315j3841n3366K8732J1029p5235O517O588n4828
10769a14665K0206N9752K6491N0321L0082R89k863O0934q7574n6967N1848J4148
10757E2702p121K0369J3055L1851m749j6050j1933j2503k2634k462l101L1108
10745F8532o950k0754p075j3742K5707L8545j44l6457j2590J6444k7421l9140
10733a5045R314j1796j8591L1115K4248K934J2898N4719J0849j7404j4312q1288
$$ y = [122118, 79079, 98213, 114824, 105490, -6163, -4453, 30578, 117281, 154705, 182655, 128847, 122329, 52066, -11672, 3865, 40484, 13809, -17837, -344, 25020, 32869, 28119, 750, 22834, 37650, -24393, -17419, 29519, 36361, 89517, 90510, 71287, -9808, -46605, -71857, -79579, -41694, -2170, -4143, -16576, 29739, 15898, -37468, -8736, 2293, -72942, -66425, -59837, -114665, -94459, -34707, -8216, 42105, 72187, 73176, 70313, 131247, 43673, -13294, 38554, 52702, 45581, 65950, 79005, 110856, 106107, 90057, 78124, 65621, 42987, 40525, 37424, 68532, 61582, 40828, 33753, 20011, 45718, 84263, 84119, 47662, 35072, 51516, 24095, -15045, -5731, -17527, -36118, -5003, 19245, 22179, 35077, 89796, 100645, 83241, 68929, -12359]
10721a2359j683L2928k9146J5463L5524K798k6255J2746k2916L9266J5149j2981
10709D8534j5428l4012J7136J2939l7136m0604k431M265M6290L6011j6547l0975
10697a1958K1364q545J1432p143P060K2352J5970p1264q6628l7856P0354M8339
10685b6523N3137M050k5038j7678P389k1124N9852M7260K9016l0955o3142j1311
10673D933K7893O5763P15o1795j5640j8865n6347N6832L4625K7288J05258O4707
10661B35367p8290n4801R186m1018N491l6106k8267L9080J02442Q1933N0571O428
10649B92016P4907J74757J47536J28353O8284J1612m4215J7045J14590O531j5232
10638I76184l4950q7698j40709k05232j64896l5125n7961l20M1601l2395n8801
$$ y = [-12359, -14042, 18886, -10260, 5203, 40727, 43525, 17270, 30016, 7100, 46366, 61515, 48534, 33106, -906, 16230, 29169, -7967, -48571, -51002, -46737, -447, 35564, 19017, -11958, 9406, 861, 12293, 5150, 12210, 34562, 50532, -20732, -107360, -145216, -74862, -26523, 26614, 30664, 5626, -12052, -4663, -25787, 34065, 81325, 110341, 79386, 16244, 4933, 32826, 98589, 99304, 37509, 21869, 3004, -53343, 3489, 38114, 65402, 170660, 235367, 157077, 102276, 111462, 70444, 75935, 39829, 11562, 50642, 153084, 235017, 285588, 292016, 366923, 541680, 689216, 817569, 885853, 897465, 853250, 870295, 984885, 991416, 976184, 941234, 853536, 712827, 507595, 342699, 307574, 249613, 249293, 290894, 258499, 199698]
10627A99698j7412M203K7595k9866j6966j8112o0839j6344J9141K3489o0338l8467
10615A5782m0374K3408L1141K1294N6094L4695J6637l5014L5811K2583j2445n1203
10603A18409n1490o2538j0771R0762J5377m8236J638p1558J2199M92L7139K8800
10591F0223L013l2639O3190l8986J2809K0201j0674j4963m097o2877n3939N162
10579e3577O3497M0624J7339K9825o9141k1694K2650j7865m3755m0690k54l6073
10567a09114r754R0503J00404n2375L3282K4082K6202Q02o0397l2568O3457j3914
10555F0610J499j6112l8814o7505R005R35l074O8673M3004J8747J1612m8134n6122
10542a5676o4685k1986k275O612k9356o50O3720Q9137j8678K7803O0147K9214
$$ y = [199698, 182286, 186489, 214084, 184218, 167252, 149140, 88301, 71957, 91098, 114587, 54249, 15782, -24592, -1184, 29957, 51251, 107345, 142040, 158677, 123663, 159474, 182057, 169612, 118409, 66919, 4381, -6390, 84372, 99749, 51513, 53151, -18407, -6208, -5716, 31423, 60223, 63236, 30597, 93787, 54801, 67610, 87811, 77137, 62174, 58077, -4800, -58739, -53577, 9920, 50544, 67883, 97708, 28567, 6873, 29523, 11658, -32097, -72787, -73041, -109114, -118868, -28365, 72039, 19664, 52946, 77028, 103230, 104032, 43635, 11067, 74524, 60610, 62109, 45997, 7183, -60322, -51317, -50382, -53456, 15217, 58221, 76968, 88580, 40446, -15676, -80361, -102347, -104622, -98010, -127366, -128016, -64296, 24841, 6163, 33966, 94113, 123327]
10530A23327M4815J6722j02477j9072J1186M2472m7802k3659j5465k5494P3464
10519G8017K9195j0192n8496p6520l9571J7800L55R2523O6291M1767N9245k2966
10507A77448M0110L4175l0412j01596m2082j5626L7147P1740k5743p2401k6839
10496D5921M802n516k9578J7949k8254l1164J8791J2100N8130K1483J9011K5038
10484A28713k6027m6514n3483r307O5354N2034k6808m9421l8332J7822K093l9658
10472b3534L3135K0866j9089p2502m9458k5368P8885P0836n0161J0894N4251M09
10460B9164j0263P3197K1252q6723o271O3828J2322n6151m9016n3948l6890j4215
10448a13714Q848K4072M1652O0103M2963m7406k1070J6192o0952j8529n1744m05
$$ y = [123327, 168142, 184864, 82387, 63315, 74501, 116973, 69171, 45512, 30047, 4553, 78017, 107212, 97020, 38524, -37996, -77567, -59767, -59412, 33111, 99402, 141169, 200414, 177448, 217558, 251733, 221321, 119725, 77643, 62017, 99164, 170904, 145161, 72760, 45921, 50723, 45207, 15629, 33578, 5324, -25840, -7049, 5051, 63181, 84664, 103675, 128713, 102686, 56172, 2689, -6618, 58736, 110770, 83962, 34541, -3791, 14031, 16124, -23534, 9601, 30467, 11378, -61124, -110582, -135950, -57065, 13771, -36390, -25496, 28755, 29164, 18901, 92098, 113350, 26627, 20356, 84184, 96506, 40355, -8661, -62609, -99499, -113714, -104866, -80794, -39142, 20961, 63924, 16518, -4552, 11640, -49312, -67841, -119585, -119990]
10436a19990r530K1311m008O1682J9890j4667l4735n6753K3276K7303J9512R431
10424e7278N879N0152K4256r570J3085J3544P681O204m5759n0331K2719k3737
10412d3155K0658j7260m219J1987Q79N9249N1437p780j6416O181K8956J2659p188
10399I5988l1912r62J9346L2910J217m8351k9477K2778j2272k8378J1186j2413
10387A9660l5050M5337l199M042k1336j9413j6104Q311R968J04579n457m4193
10375D7145l2257n3328K0360o502l8690j9114N286K7306M3826O3737J043m4394
10363A4418o4799l9958N4658J5753m2703l3405J31402R1513n6985p6153k3033
10352b9292K86k949O7008Q1976L1080l2148l2288J1887j02334m4577l7402K4522
$$ y = [-119990, -129520, -108209, -112217, -50535, -30645, -45312, -80047, -136800, -113524, -86221, -66709, -57278, -51399, -1247, 23009, 13439, 26524, 40068, 47749, 53953, 8194, -42137, -19418, -43155, -22497, -39757, -43976, -31989, -31110, 28139, 79576, 71796, 55380, 61561, 90517, 103176, 95988, 64076, 63114, 82460, 115370, 116587, 68236, 38759, 61537, 49265, 20887, 32073, 19660, -15390, 29947, 26748, 30790, 9454, -9959, -26063, -17752, -7784, 96795, 91338, 47145, 14888, -38440, -18080, -24582, -63272, -82386, -77100, -49794, -5968, 57769, 58812, 14418, -50381, -90339, -35681, -19928, -62631, -96036, 35366, 126879, 69894, -6259, -29292, -29006, -31955, 35053, 117029, 148109, 115961, 83673, 95560, -6774, -51351, -88753, -64231]
10340f4231O7948K3880p2880L9104P0895N4949N0546N6233l207n3942L1223J1700
10328B12218l7336K1336L6341k1143q8074m4593K4240j1283n2529l6568j72J6995
10316A9432K9548J6083l5149n4047m0851l0853L3194P512J1173N5094M6831k6843
10304C1124p763l5105j9926k8228N3012P0004l969m7714J1512K5714n0338o3078
10292f4755m1770K7189M3789J3780P834J0364m2542k1155o512J9766K6422L3889
10280F299k7680O759l391K8522J6744j5162J6109J4292K2803J2963j0124m3468
10268B4666k7818j4190J0008o6232j7236N5924O0467K9025J5221J6371o5724m0172
10256a9690K9980j2927p3088j6441L4180M2386R129P2177l1965m1830J0036p846
$$ y = [-64231, 3717, 27597, -45283, -6179, 64716, 119665, 170211, 226444, 223237, 169295, 200518, 212218, 174882, 196218, 232559, 211416, 123342, 78749, 102989, 91706, 39177, 2609, 2437, 19432, 48980, 65063, 29914, -24133, -64984, -95837, -62643, -55131, -43958, 11136, 57967, 31124, 23361, -11744, -31670, -59898, -6886, 63118, 59149, 11435, 22947, 48661, -1677, -64755, -106525, -79336, -35547, -21767, -13933, -3569, -46111, -67266, -73778, -54012, -27590, 6299, -21381, -14622, -18013, 10509, 27253, 12091, 28200, 42492, 65295, 78258, 68134, 24666, -3152, -17342, -7334, -73566, -90802, -34878, 25589, 54614, 69835, 86206, 20482, -19690, 10290, -2637, -75725, -92166, -57986, -15600, -6471, 65706, 33741, -8089, 1947, -5899]
10244e899q075n710n0303k7479K6699L5723M9495l5369m9713M678Q02Q354l459
10231f0256K6895J7486K3219o65o3114o7929L6013O5923L3895j0974R451Q906
10219A8850J6410j463j2247n5039M8320N6086k1743j9146K8429l391k6962k7584
10207E20J9802N5511q729q5060o414N8345M449o0873K6805K290m2371r926J3920
10194c1731j4338J3249J9975K2514J3053j1250o9791k6936k3358l75N9652O1292
10182A1956l349L0921M806m3819p4767m4786p338K9089N7997M4651l343l2712
10170c0694p530n2686M5801J9904m6414l4382K7049J5090K1872k1986L146N461
10158e5369l0927L5819M764K8581N3636J171N0236K9849o3667j04863j0065J09019
$$ y = [-5899, -13974, -19684, -69987, -97466, -70767, -35044, 14451, -20918, -70631, -65953, -65151, -56797, -60256, -33361, -15875, 7344, 6679, -56435, -124364, -88351, -22428, 11467, 493, 9944, 18850, 35260, 33797, 21550, -33489, 14831, 70917, 49174, 30028, 58457, 55066, 28104, 520, 20322, 75833, 67104, -17956, -24370, 33975, 38424, -22449, 4356, 6646, -35725, -45651, -31731, -46069, -32820, -12845, 9669, 22722, 11472, -58319, -85255, -108613, -108988, -49336, 11956, 8607, 39528, 44334, 515, -74252, -119038, -126376, -97287, -39290, 5361, 2018, -30694, -38224, -90910, -45109, -25205, -71619, -106001, -78952, -63862, -41990, -63976, -60830, -55369, -86296, -50477, -45713, -17132, 36504, 37675, 87911, 117760, 54093, -50770, -60835, 48184]
10146D8184K7055J7546M21m4064n925K8690k6771o7909K8903k7359Q688M8105
10134C5564J0017j7996m1486J0486O3111J7035M6958n8549o1113k7362P720J5103
10122e12m91J4096N597n9590r87N8044l7683r5952K271m3184M1651N863k1797
10109a32674K5053J02296N6747k8802m9939j9807L2926O947K231r767j0713L8154
10097A2652J681k5016K7270K6849L0813k3159q292p706K3561j070N640m6982o540
10084I701p1079j2433j738J0213j1564R470P5811k6456k4169L503M5269O249k5324
10071a2547K3336n159j1580n2613l3112K4919M3613K3478K9224O821k7685P197
10059A5892j4785K2639N6922L8304l3081K4636R1886N0179L0271j6608J1488p1284
$$ y = [48184, 75239, 92785, 93206, 49142, 43217, 71907, 45136, -22773, 6130, -21229, -12541, 35564, 45581, 27585, -13901, -3415, 59696, 76731, 123689, 65140, 4027, -23335, -15615, -512, -1003, 13093, 18690, -40900, -41887, 16157, -21526, -117478, -115207, -158391, -116740, -110877, -132674, -107621, -5325, 51422, 22620, -27319, -47126, -14200, -7253, -5022, -14789, -25502, 12652, 14333, -10683, 16587, 43436, 74249, 51090, 42798, 35092, 58653, 57583, 63223, 16241, 9701, -61378, -73811, -75549, -65336, -76900, -67430, 8381, -18075, -42244, -38741, 6528, 12777, -12547, 10789, 5630, -5950, -58563, -91675, -66756, -23143, 335, 29559, 36380, 8695, 15892, 1107, 23746, 80668, 118972, 85891, 110527, 202413, 252592, 282863, 266255, 277743, 206459]
10047B06459q5995p7811O41k6342k6046N6194L2975m0663k9703P270k9343j9554
10035c1918K1191L9436N5873Q317q1629k5093O957J6233N6048j6077K4371j2509
10023F1200o7987K738K9887L9699j1521l8188m3573K056L1427m7263m518k0239
10011f6282R21j484J7016r817K2797N3741K5822q726n4955K8901j3344p6531L5538
9998d6403L1756J7825M320k131P082J4993n522M7121p2494k5703K2384n6342J387
9985f1727N7708Q154P441K1108k8034L2146l2684k0426L1255j5595r717J17j4954
9972b5208J8097k8729l0691k3211J1099j3457P432L1188k0552j2235k0377l757
9960a10401J4106L0822J15372L8580q005j1192p9658k0647k4225K0550J8934k2685
$$ y = [206459, 120464, 42653, 43294, 16952, -9094, 47100, 80075, 39412, 9709, 16979, -12364, -31918, -10727, 28709, 84582, 92899, 11270, -13823, -6866, 9367, 65415, 49338, 73709, 61200, -6787, -4049, 25838, 65537, 54016, 15828, -27745, -25689, 5738, -41525, -46043, -66282, -65361, -66845, -49829, -59646, -36849, 16892, 42714, 33988, -20967, 7934, -5410, -81941, -46403, -14647, 3178, 7498, 5367, 12449, 27442, 21920, 69041, -3453, -29156, -6772, -63114, -61727, -4019, 4135, 11576, 32684, 4650, 36796, 4112, -16314, 14941, -654, -10371, -10254, -25208, -7111, -35840, -66531, -89742, -78643, -92100, -84668, -53480, -74032, -86267, -106644, -110401, -96295, -65473, 49899, 88479, 80474, 69282, -10376, -31023, -55248, -34698, -15764, -38449]
9948c8449j4352L1413L7433j3350Q814J6895j4556k9093j3052J3771L5164R802
9936C0440j4364l9779l4188P1858N6624n7307j6858k0023j2862Q900M7548m3022
9924b3033o652o131J2465J2409J2038J3668M114L0919J8147q685m703r110k8202
9911A7244K484j3555l458m7100o494j7595k9935L5118k508J3486k6951k4395L6706
9898f6953N2460K0806k7133m7281N3031j525l9558J7714L6755L9711k7322o8915
9886e8210L4804M4192L165j0058j8814j7784N8605j9504J2100N851j1097r886
9874A3364j7830k5963l4059K6801K9453l8361k1055L4379M6551l1152l5710K2186
9862c1396N2542M6980N2272N2154n631n8068O967P5196J36840O5722R1175l6313
$$ y = [-38449, -52801, -21388, 16045, 2695, 11509, 28404, 13848, -15245, -28297, -14526, 20638, 30440, 16076, -23703, -57891, 13967, 70591, 13284, -3574, -23597, -36459, -27559, 19989, -23033, -29685, -35816, -23351, -10942, 1096, 14764, 18878, 49797, 67944, 59259, 54556, 45446, 17244, 19728, 6173, 2715, -44385, -50879, -68474, -98409, -63291, -65799, -52313, -79264, -103659, -66953, -14493, 6313, -20820, -68101, -15070, -16595, -56153, -38439, -1684, 38027, 10705, -58210, -23406, 20786, 23951, 13893, -4921, -22705, 35900, 16396, 28496, 34347, 23250, 13364, -4466, -30429, -64488, -37687, -8234, -46595, -67650, -33271, 13280, -17872, -53582, -31396, 21146, 68126, 120398, 172552, 166921, 108853, 115820, 191016, 327856, 393578, 484753, 448440]
9850D48440j18632q4006r6241o0531r354m3901R8Q0987L7092j8624k5481k1883
9838H7964J8076J6864j3144m8454j3445o359L6393L1466k7598j0938j8179p7675
9826b5029k5318o228j6469N0357M3199J8688N1168M6238N198m0163p9093M929
9814B7477L3757p3169R027M7640K9100l5944k4921J7987J475L492L8313o373m218
9801F3643j0336l6990l8771J4650M0617J1276L9197o596m3337k9814j1015K1031
9789A3555p2728j3041L2730N9471j6368K9898L2940o690N7474L7168n942k6244
9777A22223j5387o218j1827l7053r141L1369j7414k1171j4562N454j5396k8644
9765a7767J8428m0169o0321K6358O5982K3727P601K7850n415n2200n5157K4485
$$ y = [448440, 329808, 245802, 149561, 89030, 79676, 35775, 35873, 116860, 153952, 135328, 109847, 87964, 106040, 122904, 109760, 61306, 47861, 41502, 77895, 109361, 81763, 70825, 52646, -25029, -50347, -56575, -73044, -22687, 20512, 39200, 90368, 136606, 141804, 101641, 22548, 27477, 61234, -11935, -2908, 44732, 73832, 37888, 12967, 30954, 32429, 35921, 74234, 67861, 63643, 53307, 16317, -22454, -7804, 32813, 44089, 83286, 76690, 33353, 3539, -7476, 13555, -59173, -72214, -39484, 19987, 3619, 33517, 66457, 59767, 117241, 154409, 148467, 122223, 106836, 100618, 88791, 51738, 42597, 73966, 56552, 35381, 20819, 26273, 10877, -17767, 661, -39508, -99829, -73471, -7489, 16238, 23839, 51689, 46274, -5926, -61083, -36598]
9753c6598P0774o184L950m2244J2357k5369l8888n8693k3758P4815N9992l1305
9741d1151L3911j5659j2383Q8518L2133j1733l9845j5116k276p424k5510p786
9729b4321J3067P329K0857k5363O660j3600k1657l1790K0638P8414O6639M424
9717A01297n9415J3887L1031q920k1127J1452j5029l5913O811L8212p438o2602
9705g754m8319O382l12n120J2670l7294l6366K5928N2084j6642K1737K1567m257
9692a5696J0481M38O0308K1680Q655j74l7602k0281j6710o7374n839M964M0520
9679a6630n1544K5544J9411J3388j4738l8600O66L0185P6519l0536j0625L035
9667F075J9709q111n8135k29L4413j8075m9488l9340m714P9851Q2948N977j4999
$$ y = [-36598, 34176, 27992, 31942, -10302, 2055, -23314, -62202, -120895, -144653, -69838, -9846, -41151, -7240, -22899, -35282, 53236, 85369, 73636, 33791, 18675, 16399, 8975, -16535, -24321, -11254, -3925, 16932, -8431, -1771, -15371, -37028, -68818, -48180, 30234, 96873, 101297, 41882, 55769, 86800, 77880, 56753, 68205, 53176, 17263, 24074, 62286, 54848, -7754, -56073, -49691, -50003, -55123, -42453, -79747, -116113, -90185, -38101, -54743, -33006, -11439, -15696, -5215, -4777, 55531, 77211, 85866, 85692, 48090, 27809, 11099, -56275, -62114, -57150, -16630, -68174, -42630, -23219, -9831, -24569, -63169, -62503, -32318, 44201, 13665, 3040, 6075, 25784, 17673, -40462, -40691, -6278, -24353, -73841, -113181, -117895, -38044, 44904, 50881, 35882]
9654C5882k3240j964l743m8023R99n7107j9879K5159j6998K9307M185J4100O570
9641e4752m0858l8546L0629P0545R2K9282J3263m5832K3284O0121J9135J1674
9629G8037l5191j6837J1243l9769J2318P782m172j1747J0309j1849l8529K966
9617c5439J8589L9268O8602l3687k8437l5105l1839J3762l4649p182L5943M3214
9605A3040L5770j0744p8684k0309L598L5126j5504m7446L7057K8647k2175R347
9593c2277j998L5634n2813k0441K0068L9194j563K9366j626J2103k4340l5316
9581c4009q792n2547k3640j2534J7302N4481N1144m183j7708k4665m3101O3909
9569c4343O8689K8134l7515l2760m8517m6729M3541N4088j0697q566J4781O428
$$ y = [35882, 12642, 10678, 6935, -41088, -40089, -97196, -117075, -91916, -108914, -79607, -75422, -61322, -54752, -95610, -134156, -103527, -32982, -32890, -3608, 9655, -36177, -12893, 47228, 66363, 78037, 42846, 26009, 37252, -2517, 9801, 17583, 13411, 1664, 11973, 124, -38405, -35439, -16850, 22418, 91020, 57333, 28896, -6209, -38048, -24286, -58935, -66117, -30174, 13040, 48810, 38066, -40618, -60927, -57329, -22203, -37707, -85153, -48096, -19449, -41624, -32277, -34275, 1359, -51454, -71895, -51827, -12633, -14196, 15170, 13544, 25647, 1307, -34009, -42801, -95348, -118988, -131522, -114220, -59739, -8595, -12778, -30486, -55151, -98252, -34343, 34346, 62480, 24965, -7795, -56312, -103041, -59500, -5412, -16109, -24675, -9894, -3466]
9557c466R774l5248o462Q459K7953l797L4918j2076K5675M9557k4081q5676l1638
9544d6108J6989o772K5792j7592L8937O5520m8012o7582N254k3694N3979P8749
9532G5460Q2341k8141j37015o5606n4790J1484M0107P2474J5641p022k6219j9240
9520d0526J331l483j9633n851L5111M0056N3665k904j6127k6182l1902K0739j0851
9507f557r9395K4921K763L1119J8478l5708K9195J0706j0883k7654o4222o5356
9495a92593n519P0000J07835P2079K781p1160k1554M6146N4522N3495p8031m5667
9483g666L7310J4973r435l2747L210r70M382K7318m0460p111K8638J2391k1124
9470H709k6443k8005j423J164m1927K4311l3N979O40K0074K3727n1135K6013O414
$$ y = [-3466, 6308, -28940, -35402, -26943, 1010, -2787, 32131, 20055, 45730, 95287, 71206, -14470, -46108, -29119, -35891, -10099, -27691, 11246, 76766, 28754, -38828, -33574, -57268, -3289, 75460, 157801, 129660, -7355, -72961, -127751, -116267, -76160, -3686, 11955, 4933, -21286, -40526, -39195, -42678, -62311, -68162, -33051, 7005, 60670, 57766, 41639, 15457, -16445, 4294, -6557, -105952, -81031, -78268, -47149, -28671, -64379, -35184, -24478, -35361, -63015, -127237, -192593, -198112, -128112, -20277, 51802, 54583, -16577, -38131, 8015, 62537, 116032, 38001, -7666, 29644, 44617, 35182, 2435, 5645, 4675, 9057, 36375, -4085, -11196, 17442, 29833, 8709, -17734, -45739, -47162, -45998, -87925, -63614, -63647, -57668, -57028, -36954, -13227, -64362, -38349, -31935]
9456c1935L6719k0818k9180m5975l9554O8268L6208j2543q7306k1166M5590P2364
9444b9328n749p0658K2228L9835M8277m6179k7056L8267R043r024l4883q533o327
9431h0087M1139O9966N9760k5739j8786M9540M0120o0817p3977j9226M885o299
9419a9521l7763M946L3956m2908k4938J07449O5899M819k1583r562l4533k8896
9407b635K8664J7745k9761j8287J4527K4894k9064k7051j700l8231J8869J5710
9395b6320M556M293o493M5899j125K5407L1386j6096R25k9722L231n0901l6566
9382e1526M4798K2868J2394K6071K4899K1227j1039j1300J5565o0352m2586q1773
9370i0754J7794R751J9345K7391J3480L707k0003j6705O1501j6857l082l366m612
$$ y = [-31935, 4784, -16034, -45214, -91189, -130743, -62475, -26267, -38810, -126116, -147282, -101692, -29328, -35077, -105735, -83507, -43672, 4605, -41574, -68630, -30363, -21320, -30344, -65227, -73760, -80087, -38948, 31018, 90778, 65039, 46253, 95793, 135913, 75096, 1119, -18107, -13222, -19521, -57284, -52338, -18382, -61290, -86228, 21221, 87120, 91939, 70356, 60794, 26261, -2635, 26029, 43774, 14013, -4274, 10253, 35147, 6083, -20968, -22668, -60899, -42030, -26320, -21764, -17471, -23964, 21935, 20810, 46217, 77603, 61507, 62432, 32710, 35941, -14960, -51526, -6728, 16140, 28534, 54605, 79504, 100731, 89692, 78392, 93957, 33605, -8981, -90754, -72960, -63209, -43864, -16473, -2993, 714, -19289, -35994, 25507, 8650, 5568, 2202, -2410]
9357b410J9360j1944K588J1567N3454j3669J1979K7856P265p2359l8904o3181
9345f8398P12O667j4915J1772K4205N6248J7726j7190o5609J4443k1548L8161
9333a7726J946j7676j0252O080m8769j2800R534K9040k1140L3222N4782k3669
9321a7428l8454k7966L1921O0845O6736j3276J1301K4210j4179n5361j26313L694
9309i4270L7338N0456k5621m0531L3264J0541k0040K3111Q633j2908N4971N8579
9297H3523l124l0475l4788K6026L821o819l9448l0817Q5069J07949L2684j5682
9285A77919k6227N534m5151n5095m5642L3088M6233M1890L2406l7396o3959o8024
9273d424j8314j378Q4065N735m6397j0581J1306r565j1676o0576J3471L4041K975
$$ y = [-2410, 16950, 5006, 7594, 19161, 72615, 58946, 70925, 98781, 106046, 33687, -5217, -68398, -67686, -61019, -75934, -64162, -39957, 16291, 34017, 16827, -48782, -34339, -55887, -17726, -15780, -33456, -43708, -37628, -86397, -99197, -89663, -60623, -81763, -48541, 6241, -17428, -55882, -83848, -51927, 8918, 75654, 62378, 73679, 97889, 83710, 28349, -97964, -94270, -56932, -6476, -32097, -72628, -39364, -28823, -48863, -25752, -17119, -30027, 24944, 83523, 80399, 49924, 15136, 41162, 44983, 38164, -1284, -32101, 52968, 160917, 193601, 177919, 151692, 157226, 112075, 56980, 11338, 44426, 90659, 132549, 164955, 127559, 63600, -4424, -22738, -24116, 59949, 65684, 19287, 8706, 20012, 10447, -1229, -61805, -48334, -14293, -11318]
9260a1318P1887J6001J0034k3022n1450n5783L1265M7753J7852m7266m5705O34
9248c9118j5859j8798M978J9276J4727r594O096j9274J3121N3694K2844l5904
9236c811K1318J9353k5360K5436N7942M160n8313Q894Q579n4131m2830o888L7971
9223g680M6192O0639M3205m4416m4138n0723K0056J9516j6722J0509J1152K8896
9211G6486P7764J3497L1188j0938q6013Q687k560m1598j5554N3010K6292J1999
9199A42260r696r8030J2993M4176O8206k039k1144n365J0624m0379l4404N8122
9187A25324P7865m4286J775J3069n6683r137L0209k9343L4841l2572o7505l555
9175D0002J02612M5179J9075R597K3847L9447N8957M0890p6070k9308l6810K3870
$$ y = [-11318, 60569, 76570, 86604, 63582, 12132, -43651, -12386, 35367, 53219, 5953, -39752, -39118, -54977, -73775, -68797, -49521, -34794, -44388, -38292, -57566, -44445, 9249, 32093, -3811, 17507, 36860, 11500, 36936, 94878, 99038, 40725, 49619, 58198, 4067, -38763, -45651, -7680, 38512, 99151, 142356, 97940, 53802, 3079, 23135, 42651, 25929, 36438, 47590, 76486, 154250, 167747, 198935, 187997, 101984, 110671, 108111, 66513, 50959, 103969, 130261, 142260, 132564, 34534, 47527, 91703, 159909, 157870, 136726, 131361, 141985, 101606, 67202, 125324, 203189, 158903, 160678, 173747, 117064, 107927, 138136, 108793, 143634, 111062, 43557, 40002, 142614, 187793, 206868, 216465, 240312, 279759, 338716, 379606, 303536, 274228, 237418, 261288]
9163B61288K7079m2904j7014j0701Q5249K9763J3984N3495n2087n6712o8704M0477
9151B63213L6629L8382m2326r7567Q39K2049K7808P1240J29574N1397O5083J8753
9139E85074L5041P0099n06o5522n0797K1128K9777J36659N4965N9616J5707m622
9127H86619L6808J24335P8720J7771J24183J41370R2643J50730K43630J89195
9117B086004K12994K87790L42169M49038N04476N22948O25208Q70167J104827
9108G005621J503110K029287K931741M442292O726581R955088J3651571J5241563
9100F3486854J1239763K436940o108088j3101941j5150414j1427407p434363m743658
9092A9197686l088144k165707j561645j164207r08580p89429o25602n56923l19239
$$ y = [261288, 288367, 245463, 228449, 217748, 302997, 332760, 346744, 400239, 348152, 291440, 222736, 263213, 299842, 338224, 295898, 198331, 199170, 221219, 249027, 320267, 449841, 501238, 566321, 585074, 620115, 690214, 689708, 624186, 573389, 594517, 624294, 760953, 815918, 875534, 891241, 886619, 923427, 1047762, 1126482, 1144253, 1268436, 1409806, 1502449, 1653179, 1896809, 2086004, 2298998, 2586788, 2928957, 3377995, 3882471, 4405419, 5030627, 5900794, 7005621, 8508731, 10538018, 13469759, 17912051, 24638632, 34593720, 48245291, 63486854, 74726617, 77163557, 71055469, 57953528, 42803114, 31375707, 23941344, 19197686, 16109542, 13943835, 12382190, 11217983, 10309403, 9519974, 8894372, 8337449, 8018210]
9083H018210j87908k24725k03851j97263k91703l63146m92137n04586l65468l02902
9073D884521k79169k34961j83795j66763j65911j39134l0728r295m0048n1159
9063C583558p7764j12941j29490j05140k14141j58921r9534j07036q4822q4445
9053B409324j18508r2818n2078p5102r3793j16677o5041m1852o1821m6159o6887
9042A578588k5659J5737J9866j8332o9884m7128k8342n4556j8726k9073k9616
9031A292875k7783l3417l7106m4535m6211p0154n6561r7923M8823P9184k1817
9020I85375n7929q6227k9245j0657q3085j4364K010J7057m6233m0345J2001L4611
9008F82969k3115j5594q954m1706j0504m3780m2645r3716j4557M4638O2129K1458
$$ y = [8018210, 7830302, 7605577, 7401726, 7204463, 6912760, 6549614, 6057477, 5552891, 5187423, 4884521, 4605352, 4370391, 4186596, 4019833, 3853922, 3714788, 3684060, 3674765, 3634717, 3583558, 3505794, 3392853, 3263363, 3158223, 2944082, 2785161, 2685627, 2578591, 2493769, 2409324, 2290816, 2197998, 2145920, 2070818, 1977025, 1860348, 1795307, 1753455, 1691634, 1645475, 1578588, 1552929, 1568666, 1588532, 1570200, 1500316, 1453188, 1424846, 1370290, 1351564, 1322491, 1292875, 1265092, 1231675, 1194569, 1150034, 1103823, 1033669, 977108, 879185, 928008, 1007192, 985375, 927446, 841219, 811974, 801317, 718232, 703868, 705878, 722935, 676702, 636357, 648358, 682969, 659854, 644260, 635306, 593600, 583096, 539316, 496671, 402955, 388398, 433036, 495165, 516623]
8996E16623j5654j3230j8704L3235K0786l5325m3254J5396M566l1729j520M0820
8984D72010j8793k4457n8602j04242l3977P737K6340k399M00k6406j9205k716
8972B15690L7717L3848J0820P077n2559n8748q1409l265K6819k1958r694N1176
8960A55514P555l0787p538j9761j5297l3144j959R323L6294Q6965J5617p479o8236
8947A27067l3348j258K8072j8811J5086q990l6354j4233J3488R2140L1221K7303
8935B21383j309j2580K3231l1812m5450p3623r394K9587K2032N3734j9605m2387
8923A13807N2025L2580k9054k8757J5026J1440l5955m4279P716M2342j6727M211
8911A24375k635K6624m6757n2413J6645L7794J8635k9703l305J1317p022j0338
$$ y = [516623, 500969, 487739, 469035, 502270, 523056, 487731, 444477, 459873, 464439, 432710, 431190, 472010, 453217, 428760, 370158, 265916, 231939, 239676, 266016, 263617, 264017, 237611, 218406, 215690, 253407, 287255, 298075, 305152, 252593, 193845, 112436, 109171, 135990, 114032, 104338, 155514, 163069, 132282, 124744, 104983, 89686, 56542, 54583, 63906, 100200, 187165, 202782, 195303, 127067, 93719, 92461, 120533, 101722, 116808, 107818, 71464, 57231, 70719, 162859, 194080, 221383, 220074, 207494, 230725, 198913, 153463, 79840, 70446, 100033, 122065, 175799, 156194, 113807, 165832, 198412, 169358, 140601, 155627, 167067, 131112, 86833, 94549, 136891, 120164, 124375, 121740, 148364, 101607, 49194, 65839, 103633, 122268, 92565, 89260, 100577, 93555, 83217]
8899H3217R667J2911L5640M805M1802j5345j00150o5601O0629O284l3915K8884
8887F8828n0950O25P00K2757J808O8428L3380l8501k2739K7469P161l304o7676
8874D7986N0912K8967K985K2039m9569o9769m037n170l60L2082O4277K1784k3790
8861A18337n8130M9731L1027j9640l2020M1770K3570k5555r308L7528O464j804
8849A61970J4376m346R816n1634r645K4331q59k6302L5940j5769q7931j5288J9978
8836E4637n1452k8751R633M5527J2016J4155j2254k1621K4295K568n4952j6554
8824b2753L5051j5746j6788k1932M1156K6310P7046L4665L5376K7102K713n9683
8812A42517o0611j0860O6512J9074j532L7906L895l8746r852p603q5619m4581
$$ y = [83217, 92884, 105795, 141435, 146240, 188042, 172697, 72547, 6946, 67575, 73859, 39944, 68828, 17878, 18503, 19203, 41960, 43768, 112196, 145576, 107075, 84336, 111805, 118966, 115662, 47986, 98898, 127865, 130850, 152889, 103320, 33551, 29514, 24344, 23984, 56066, 120343, 142127, 118337, 60207, 109938, 140965, 121325, 89305, 131075, 154645, 129090, 119782, 157310, 163774, 161970, 176346, 172000, 181816, 130182, 120537, 144868, 144009, 117707, 153647, 137878, 49947, 34659, 54637, 3185, -25566, -15933, 29594, 41610, 55765, 43511, 21890, 46185, 48753, -6199, -22753, 12298, -3448, -20236, -42168, -1012, 25298, 102344, 137009, 172385, 199487, 202200, 142517, 81906, 71046, 137558, 156632, 155100, 193006, 196901, 158155, 148303, 140700, 55081, 10500]
8800A0500R669K8579l2985k9160Q3521R988M1284N82p9216k8269J5989R823m3472
8787c167J986J1609M7934O5129k007j4447J5525M0877j2623p102j3545J373K506
8774A34048p3363k2231n8025l3763N8207O1111n5653J9903R738m9863n2021m473
8762f6385L5454N7571L9122P998l740O7971p293j6434j7018J0590j5395N1943
8750A44384J9786n5030R141K9152j4042k3597j369K1077o3465q6907m2132L7859
8738b5143P6189n581m2231n669J9850l0936j6605L570m9731J8140K7088Q391K6369
8725C701J6369K4739m856l1378q021l73J6194K284j119k4197M728l7903J3415
8712b6417Q1009k4952l0353j9594j8431N6665K4286O4K1498m8614K393j3676L0540
$$ y = [10500, 20169, 48748, 15763, -13397, 70124, 80112, 121396, 121978, 42762, 14493, 30482, 40305, -3167, -1181, 10428, 58362, 123491, 121484, 107037, 122562, 163439, 150816, 143714, 130169, 131542, 134048, 60685, 38454, -19571, -53334, 4873, 65984, 10331, 30234, 39972, -9891, -61912, -66385, -30931, 26640, 65762, 73760, 70020, 137991, 130698, 114264, 97246, 107836, 92441, 144384, 164170, 109140, 118281, 147433, 133391, 109794, 108425, 129502, 66037, -20870, -63002, -25143, 51046, 45465, 3234, -2435, 17415, -13521, -30126, -26556, -76287, -58147, -31059, -22668, 3701, 20070, 44809, 39953, 8575, 554, 181, 16375, 18659, 17540, -6657, -1929, -39832, -26417, 54592, 29640, -713, -20307, -38738, 17927, 42213, 42277, 63775, 15161, 17554, 3878, 34418]
8699C4418K2635n2006m8463M578M3281J4716J9290N771n6421M851j0609J1810
8687f149K0588L6516l885j375m3575K2713L1552J8843k2007n8457l2479m536J0174
8674c2077K821J9295L5833j920j0857M5401R212n373J8568R318o6415o2704n2537
8661i1435J8062L4672K0414J2366m0815o0809K5923J23534R9415O8921M7122m2630
8649B14740p8406k6111J8912M4592k0786o4780l8003m9260j3607M7441M1730j4136
8637F2326O25o8912j8356R661O5976N9515k8969n5790k6880o5940k1067N6131
8625c1680Q4378L3833M098J9181j4469J632L6996P595p950K160M4783k6693L8687
8612A92551L1621o2538n7617J5457M1325Q2446L8217n2524m1159K1153J4655R288
$$ y = [34418, 57053, 5047, -43416, -38838, 4443, 19159, 38449, 44220, -12201, -7350, -17959, -6149, 14439, 50955, 47070, 45695, 2120, 24833, 56385, 75228, 53221, -5236, -37715, -42251, -32077, -29256, -9961, 25872, 23952, 13095, 58496, 67708, 62335, 80903, 90221, 23806, -38898, -91435, -73373, -38701, -18287, -5921, -46736, -107545, -81622, 41912, 141327, 210248, 257370, 214740, 136334, 110223, 129135, 173727, 152941, 88161, 50158, 898, -12709, 34732, 76462, 62326, 62951, -5961, -24317, -14656, 51320, 110835, 81866, 26076, -804, -66744, -87811, -31680, 52698, 86531, 90629, 109810, 95341, 96973, 133969, 141564, 133614, 135774, 180557, 153864, 192551, 224172, 161634, 104017, 119474, 160799, 243245, 281462, 228938, 187779, 208932, 223587, 232875]
8600B32875m0445n9856n292k5661K8059L7369o8547k4395k531j5547O7323K5880
8588A49232l5984n0585j1965l7500L0265p181j210j7107K624M642k6483j928M8176
8575D4996k0636m2782K212L5623Q603M936J1213M2594O7793m7621p0590j668j9232
8562A5441L7771M9968q023j5263l743m61N125k2728l9952k0267M298j5112l3005
8549d5951M205L6971K5902L8218J9230N8021m1076m8576J7486p1738k0383J1706
8537a5985O374K2793L508k269J6627k6947m7470q380R822Q9573J9574n7452n9775
8524e0007N891Q2879J2937k1887p8741k418J05135k2401o2185k1894O0146K7328
8512C4783p898M3912j979p1054n587M695L4778k354p130l4244j5702m4417J0399
$$ y = [232875, 192430, 132574, 127282, 101621, 129680, 167049, 98502, 74107, 71576, 56029, 123352, 149232, 113248, 62663, 50698, 13198, 43463, 36282, 35072, 17965, 20589, 25231, -1252, -3180, 44996, 24360, -18422, -16210, 19413, 28016, 32952, 44165, 86759, 154552, 106931, 36341, 34673, 15441, 53212, 103180, 95157, 79894, 76151, 75690, 80815, 58087, 18135, -2132, 2166, -12946, -45951, -41746, -4775, 21127, 59345, 78575, 136596, 95520, 46944, 64430, -7308, -27691, -15985, -9611, 13182, 16690, 14421, 31048, 4101, -43369, -51749, -41927, 47646, 67220, 9768, -50007, -44116, 38763, 51700, 29813, -48928, -51346, 53789, 31388, -30797, -52691, 7455, 34783, 26885, 70797, 68818, -2236, -7823, -3128, 31650, 29296, 22166, -12078, -27780, -72197, -61798]
8499f1798K6476K3235K6110L6559N967o3923o1563l972O7722L6357o6488j9098
8487e4416K2207l318n395j7630J4615J8941M6887K7356K1622k5580l9582j3140
8475g433Q992o503l988Q332O697l2170j2560j6496L0103L5147j1898O927j8690
8462a3540k1896R354q859N9032K2128J2841m1908q654N9060K9648o5530k6775
8450D901j9189L6478l4809m6320N2779J5500m2044j4440J3367j8140J6947J5767
8438a9203O0255L9830m3228n9185p817O7500N9321l4798m3567m9006Q4525K2770
8426G7397n3936r2751J0209N5312O163j0543l1169m9359k8320Q957K2556M3546
8414d1938J30893P4990n1143j5103n890j3917j4294N7882k6547o4833l7464K7784
$$ y = [-61798, -35322, -12087, 14023, 50582, 56549, -7374, -68937, -72909, -5187, 31170, -35318, -54416, -32209, -35527, -40922, -58552, -43937, -24996, 21891, 49247, 70869, 45289, 5707, -7433, 1559, -4944, -8932, -600, 6097, -26073, -38633, -55129, -25026, 10121, -1777, 5150, -13540, -35436, -26082, -34941, 24091, 46219, 59060, 17152, 8498, 67558, 97206, 31676, 4901, -14288, 22190, -12619, -58939, -6160, 9340, -32704, -47144, -33777, -51917, -34970, -19203, 41052, 80882, 37654, -21531, -29348, 38152, 97473, 62675, 19108, -29898, 54627, 77397, 23461, -69290, -59081, -3769, 2394, -8149, -39318, -88677, -116997, -108040, -85484, -41938, 88955, 163945, 112802, 97699, 91809, 77892, 63598, 121480, 94933, 30100, -7364, 20420]
8402B0420L3116L265j25225n8558M9664J0035k1262J8240l1115J7064N6315O5104
8390C7063K1207j0628N9232M545J5138l1609m3129o0781L6885J8304P105J3672
8378F7004l93k3940l1299k7006j6176M8776P2693L70K7865n9333j24748n7721
8366a23908O7908L3421J0594N5017M4211r354l512j7983o4935L1752M1647J4846
8354G9704m9999m5010j4457k6178M2363M4434P284J5351k014j8898k9995l4522
8342c1937q155O3754l985n0161l67K8256M2268r1373o8052k9805N305Q0289J2667
8329e1296j3736J8870L995p56O3265O7684R519n6561j1824k3700l4725j0939N096
8316c5108L7137M4410j8342K0038o984o4418l9147l7075j6449N0748Q7920O7005
$$ y = [20420, 53536, 56801, -68424, -126982, -77318, -67283, -88545, -70305, -101420, -84356, -28041, 37063, 58270, 47642, 106874, 111419, 126557, 94948, 51819, -8962, 27923, 46227, 53332, 67004, 66611, 42671, 11372, -15634, -31810, 16966, 89659, 90029, 117894, 58561, -66187, -123908, -56000, -22579, -11985, 43032, 87243, 77889, 74377, 56394, -8541, 23211, 64858, 79704, 29705, -15305, -29762, -55940, -13577, 30857, 38141, 53492, 51478, 32580, 2585, -31937, -40092, 23662, 19677, -30484, -30851, -2595, 39673, -51700, -119752, -149557, -144252, -63963, -51296, -65032, -46162, -42167, -42923, 20342, 88026, 97545, 40984, 29160, 5460, -29265, -40204, -35108, 2029, 46439, 28097, 48135, 41151, -23267, -62414, -99489, -115938, -65190, 22730, 89735]
8304H9735L6020O960k9397N5957k6404o3348k6383o0933O272P5043K549k394j1372
8291E2305k6354q3631J4117L3024N5836P1327M1176M0203J9122m1481p2251l5077
8279F8316K330n9239j07059K225J23243L2883J9958l8350J9978m343m0025R246
8267B9163J4382m6720j5310K9711j042n4147P937P36J6709N5545j9839q399m5983
8254c7257L365K3326k7289J5855N9515j4610k4374K8450j5767l5131J097N8899
8242C6079N3075L641l1301K9688l4131L3321J3628m87j3406m5982m8935P31k0097
8229b4176L2159M8250l6414m7888m574K4344q84K3095J12J1256J7795l7615k8814
8216b3354n9312J3130j851K9334J8257n9465n3971K0791J8621O7319N5299j4677
$$ y = [89735, 125755, 132715, 103318, 159275, 132871, 69523, 43140, -17793, -11521, 63522, 66071, 63677, 52305, 25951, -57680, -43563, -10539, 45297, 116624, 157800, 198003, 217125, 175644, 103393, 68316, 70646, 11407, -95652, -93427, 29816, 62699, 82657, 44307, 64285, 59942, 19917, 29163, 43545, -3175, -18485, 11226, 10184, -43963, -36026, -35290, -18581, 36964, 17125, 8726, -37257, -33892, -10566, -37855, -22000, 37515, 22905, -1469, 26981, 11214, -23917, -22820, 36079, 89154, 92795, 61494, 91182, 57051, 90372, 104000, 103513, 90107, 44125, -4810, -4079, -24176, 7983, 56233, 19819, -28069, -32643, -8299, -9183, 13912, 14024, 25280, 43075, 5460, -23354, -82666, -69536, -71387, -42053, -23796, -83261, -137232, -116441, -97820, -30501, 24798, 10121]
8204A0121n8180J8202k442m8799j3063J9147R527j253K0677R045M2795L66m165
8191A978l2101m2780L7791P1393L0346O1429m994l8153n5067N833j6778J0327
8179B9224l8979n9024k0710L513O1808N2525L1983m5196j2873R980P69j7007n1445
8166e5432j0010m2830J442M9636J2874P671P2890N5264l8213l1868m5548l0029
8154e4153L6550R2017j09843p9054r931O1316J565N7582L9741l1200k1637j419
8142a8466J9422l1102o649J8027k9143K8574N9109O3421K4315p742J0222J8932
8130A48920q688J2890o0095j00744J9943P446n4293J6861J0349k0111j5067J3140
8118b9449J1104O2023m5185n0245l9559K5009P884N4226R768J0716O17o7295J066
$$ y = [10121, -48059, -29857, -32299, -81098, -94161, -75014, -65487, -66740, -46063, -37018, 5777, 6143, 1978, -30123, -72903, -35112, 36281, 66627, 128056, 123062, 84909, 29842, 35675, 18897, 29224, -9755, -68779, -89489, -85976, -24168, 28357, 60340, 15144, 2271, 12251, 13020, -3987, -55432, -65442, -108272, -106830, -57194, -44320, -36649, 36241, 91505, 53292, 21424, -24124, -54153, -17603, 74414, -35429, -114483, -124414, -63098, -61533, -3951, 35790, 4590, -17047, -18466, 956, -30146, -36795, -18768, -47911, -19337, 39772, 103193, 127508, 119766, 129988, 148920, 140232, 153122, 93027, -7717, 12226, 19672, -34621, -17760, -7411, -27522, -42589, -29449, -18345, 43678, -1507, -51752, -91311, -66302, -58418, -4192, 5576, 16292, 16909, -50386, -49320]
8105d9320m8397l6275M2449L8973M8082k682j0268l5486K6700N3112M4117L2037
8093A03042K7582k0224l0560m5614o7933M638k8417K9048L8155j8261p29K8330
8081A9057L7435j4958m635J7928K5909M1663L486p1429k1200l4587K3087M1125
8069F2881j0477n8853n5867j4319M813j2616m6519N9512k141N8542J8547l905
8057d02k4735j1833L4546l6938o758K6511J3326m8996k4613k6851Q2061N6738
8045C2056M625k3716m2574L3855Q8747K9378k5107j8563j0633j9139r1209l3218
8033g5498j1174p703K8285R0943P7697K6853L2331m7057r1255n198J4375l4169
8021a570l5255N2732l537M2521K0449j3689K464j420m3947J0286J04894K1266
$$ y = [-49320, -97717, -133992, -91543, -52570, -4488, -7170, -17438, -52924, -26224, 26888, 71005, 103042, 130624, 110400, 79840, 34226, -33707, -29069, -57486, -28438, 9717, -8544, -9273, 19057, 56492, 41534, 36899, 54827, 80736, 122399, 125885, 54456, 33256, -1331, 21756, 62881, 52404, -6449, -62316, -76635, -71822, -84438, -130957, -71445, -73586, -15044, 3503, -402, -25137, -36970, -2424, -39362, -46120, -19609, -6283, -55279, -79892, -106743, -24682, 32056, 36681, 12965, -29609, 4246, 92993, 122371, 97264, 78701, 68068, 48929, -42280, -75498, -86672, -94375, -66090, 24853, 102550, 129403, 161734, 114677, 23422, 18224, 32599, -1570, -36825, 15907, 12370, 54891, 75340, 61651, 64115, 62695, 18748, 29034, 133928, 155194]
8009A55194o2202o4002j7594L8099O8237K3642J3713o3855p6176L1929P647p2930
7997a8298n8511L4528K8750j5537k5764J7036l3849P491Q4540J26193O5189m3206
7985A68562j25844r152L2403l0790l4242L960k7364M7837M1129p5094k9584l1674
7973f9853J0627J1957N1093L3388j4228L7480j6342M0046L2448l8267J5168l8103
7961E5414j1613K595m7089o0972L1218K9885m264p0861m61O0703M2584J0134L4608
7948G1881M1355J8728p2816o7114l1306M4637K8634q906L0183J0794p063m2928
7936A6079K5823l1588p6806M6950L8574J9363J7083o3l5125n261p8761j2380O2767
7923a3345K4448l2042m4192P665M2155P2125K4171k4765p28K0417o9874j6686
$$ y = [155194, 92992, 28990, 11396, 49495, 117732, 141374, 155087, 91232, 15056, 46985, 54632, -18298, -76809, -42281, -13531, -29068, -54832, -37796, -71645, -64154, 20386, 146579, 211768, 168562, 42718, 33566, 65969, 35179, 937, 4897, -22467, 25370, 66499, -8595, -38179, -69853, -59226, -47269, 3824, 37212, 22984, 60464, 44122, 84168, 116616, 78349, 93517, 55414, 43801, 46396, -693, -61665, -30447, -562, -4826, -75687, -76148, -15445, 27139, 37273, 71881, 113236, 131964, 59148, -7966, -39272, 5365, 33999, 25093, 55276, 66070, 59007, 16079, 41902, 10314, -66492, -19542, 19032, 38395, 55478, 55415, 20290, 15029, -63732, -76112, -13345, 11103, -20939, -65131, -57466, -15311, 56814, 80985, 56220, 55492, 75909, 6035, -10651]
7911a0651m6061J7674J620K773o4495J3737J8663j4592J0214Q700J9459J206j8971
7898f0724l4923K9421N0133l7504m9424k8553J5407J08085M2276M2397n3359j5517
7886G715L2121N8828k5920j02501n8950K255N9578L962o115K4711r254O310L0156
7873B2896J9282L860k4251k7473M1101j207o2990N045J4381l5066q392j4832L2173
7860c5473M4126r157j1317M9975j6436R877J6417p7698J6935J1273j4734J69R481
7847f562M5793k1061J3736N5442o1624p8069q585l6973j8745k8243N2991J2112
7835g9788j3971n0731L866M5494q93L8368M6585M8909j8356J6147k015L0764O4142
7822A28521j6242m1885M1615q732p9674r963L9199P2083m0541j08268q6595o956
$$ y = [-10651, -56712, -39038, -37418, -34645, -99140, -85403, -66740, -81332, -71118, -62418, -42959, -41753, -60724, -95647, -66226, -16093, -53597, -103021, -131574, -116167, -8082, 34194, 76591, 23232, 7715, 39836, 98664, 72744, -29757, -88707, -86452, -26874, -22912, -29027, -4316, -13570, -7260, 22896, 42178, 46038, 21787, -5686, 35415, 34208, -28782, -23737, -9356, -44422, -52814, -67646, -35473, 8653, -504, -11821, 38154, 21718, 31595, 48012, -29686, -12751, -1478, -16212, -16043, -6562, 39231, 18170, 31906, 87348, 25724, -52345, -60930, -97903, -116648, -144891, -91900, -79788, -93759, -144490, -140624, -95130, -96023, -57655, -11070, 37839, 19483, 35630, 33615, 64379, 128521, 112279, 70394, 112009, 103277, 23603, 13640, 52839, 124922, 84381, -23887, -110482, -117438]
7810a17438J7672N9083M7804k1423m7457k1534K1355L1731q545J7551J1757j8226
7798b7670J2836k0318K2021l5801n750M6306q03k0084J9468o5434k6517K7489
7786g4257J770k766O3118M4016P319N1717l2261m2478j3499l7099j2751j7412
7774f4583N3340O4896j2045J0024m980q1059q7600k5928L7067Q1258L6217J7574
7762B4181J0314K1528l9809L9901k5275m2603p986n3221p0968M4805J09377N8011
7750F8255J2189m3287k7075L5818k4832j0904k1217m3727K7405K2989L7570J3745
7738D6929n8906r190K12m4138l2736j5740N2563J5086J8033K6860P9701n4427
7726B4247l8126j78L5149o480q159K2201J378j0394K7905L6524J2608j13685n9834
$$ y = [-117438, -99766, -40683, 7121, -14302, -61759, -83293, -61938, -30207, -38752, -21201, -9444, -27670, -14834, -35152, -13131, -48932, -54682, -8376, -9179, -29263, -9795, -75229, -101746, -74257, -72487, -75253, -12135, 31881, 39200, 90917, 58656, 16178, 2679, -34420, -47171, -64583, -11243, 53653, 41608, 51632, 46652, -34407, -122007, -147935, -110868, -29610, 6607, 24181, 34495, 56023, 16214, 56115, 30840, -11763, -19749, -72970, -143938, -99133, 10244, 68255, 80444, 37157, 10082, 45900, 21068, 10164, -11053, -54780, -27375, -4386, 33184, 46929, -11977, -21167, -20955, -65093, -97829, -113569, -61006, -45920, -27887, -1027, 78674, 24247, -13879, -14057, 21092, 14612, 6453, 28654, 30032, 19638, 47543, 84067, 96675, -17010, -76844]
7713g6844Q568M5652k2791K2640J5181k6382q0963m2611O6640M990q147M3789
7701e0278R291k5777J2838m6938n040R1051L3019K0375o882k6204m1958k3236
7689e9739l7739L4279P803P573n5566M2383L2187k5651O722N2885m606n7329k1924
7676g8722l7249K9035k075M4784K2428P043r195j7940R26M5344K748l5975K720
7663b6128l3749J8239N1424L5420l4301o596q8L0020K6961m6168n0180J9619K5763
7650A0236J0842P824J7728o951k1197L0096k2585l7321J8805p719N0215L2109
7638H2082p541j4565k4227k3772o428k4581m4400l3753j6318N6795m7325p610
7626a11643k4856J3067N6214q48k9362K8624k2247J5847Q0217K0692l1575n6906
$$ y = [-76844, -68276, -22624, -45415, -22775, -7594, -33976, -114939, -157550, -90910, -85920, -94067, -50278, -40987, -66764, -53926, -100864, -105904, -14853, 18166, 38541, 31659, 5455, -36503, -59739, -97478, -63199, -55396, -47823, -103389, -61006, -28819, -54470, -47748, 5137, 531, -56798, -78722, -115971, -86936, -89011, -44227, -21799, -14756, -23951, -41891, -40965, 4379, 7127, -28848, -26128, -59877, -41638, 9786, 45206, 10905, 4309, 4221, 34241, 61202, 15034, -35146, -15527, 10236, 21078, 28902, 46630, 39679, 18482, 48578, 25993, -11328, 7477, -242, 49973, 82082, 74541, 59976, 35749, 11977, 5549, -19032, -63432, -97185, -113503, -56708, -104033, -111643, -136499, -123432, -67218, -68066, -97428, -68804, -91051, -75204, 5013, 25705, -5870, -62776]
7614f2776K0700K3598n878O3411L5508O434M0258J0427k2336n4075o1699r910
7602a6338K8519P8815j8725l0514o8825l6647m7229O4485L1720j0140J8368l305
7590i816J1059n634k0020l4310r270J4527J0495j973O1800p620j8283j8640J0768
7577a6917K417p197n859l1886M8740O3648l6500m3639j2556L3771K9362K661O526
7564C2571K3691j8238l0573J7953K3402K9267K8244o2185p3772N7502Q2791n5680
7552E4973l7617M334N4432k4949n9221l8050o8405M0821P5694N9532L0337P000
7540I8881p2477n0190K2340K4315p36j1868l3039K9252j3040P3720j7035r269
7528D0854o351K670p4787m128J6984J9445l003l3909N4030N1437K5972k4143m5957
$$ y = [-62776, -42076, -18478, -24356, 39055, 74563, 80997, 121255, 131682, 109346, 55271, -6428, -16338, 12181, 90996, 72271, 41757, -27068, -63715, -110944, -46459, -14739, -24879, -6511, -9816, 1243, -4391, -24411, -58721, -67991, -53464, -42969, -44942, 16858, 9238, -9045, -27685, -16917, -14500, -21697, -27556, -59442, -10702, 52946, 16446, -27193, -39749, -5978, 23384, 26045, 32571, 56262, 38024, 7451, 25404, 48806, 78073, 106317, 44132, -29640, 27862, 110653, 54973, 17356, 21690, 76122, 51173, -8048, -46098, -114503, -73682, 2012, 61544, 91881, 98881, 26404, -23786, -1446, 22869, 22133, 10265, -22774, 6478, -6562, 67158, 50123, 40854, 34503, 37173, -37614, -41742, -24758, -5313, -8316, -42225, 11805, 63242, 89214, 65071, 19114]
7515A9114M8462o437n2496l3427J8649l5988l0900j7106N5954L8607j3691n5761
7503f5020K0969m470o209O6108K3452m393N4581L9309k9500n9771p165l0695l2700
7490c5504q243k2263k044o83M5198l9821k6273L1829N9247J8336l459o8171l7868
7477h9719j2300N1795L0098J7996l6532j4834l0821n3865J443L0038J5271P4885
7465a6545L2644k4478J1195o8020l2641K9168K6390l3824K847P5800P353m615
7453E274M4669K7918j8101n3944l4193j7243M2336K5796N2881P1098n0640p9156
7441A6695m7718K855k2607J6444K2448M588m412j9234L955N6216P6703l9319o2038
7428D576m4365K2757J6656k1573M742k8827p711M2208j8302j4782N0877K1276
$$ y = [19114, 67576, 61139, 8643, -24784, -6135, -42123, -73023, -90129, -34175, 4432, -9259, -65020, -44051, -48521, -54730, 11378, 34830, 30437, 85018, 124327, 94827, 35056, 27891, -2804, -35504, -43747, -66010, -68054, -68737, -23539, -63360, -89633, -57804, 1443, 19779, 16320, -51851, -89719, -102019, -50224, -20126, -2130, -38662, -53496, -84317, -138182, -136739, -106701, -91430, -16545, 16099, -8379, 2816, -65204, -97845, -68677, -42287, -76111, -73264, 2536, 9889, 5274, 49943, 77861, 59760, 5816, -28377, -45620, -3284, 22512, 75393, 146491, 95851, 16695, -31023, -28168, -50775, -34331, -11883, -7295, -11707, -30941, -26986, 29230, 105933, 66614, 4576, -39789, -17032, -376, -21949, -17207, -46034, -53745, -11537, -29839, -44621, 6256, 27532]
7416B7532m1441k3654L4709k7860L887J7933j5700m5948N9130L6161k5204L8851
7404C8396k1815p4822j4067j9622M0898L8679M7118j1999j6230N719k1767K0180
7392A0668O2537k6413l8070n5828k753J4999k180K0867N4937j9333L1452j9612
7380C1271k0660l9877k1111J957L5895K1137m9971R884L5191Q795K4577J9144
7368E6232K0408n032o8502K95J9961l1284j2619M8390K247P180l2399n6238l8951
7355i0312m2733K5307L0320l409J0088J5155O0187J5125p7627m1235K2601L0434
7343d6099O5123M188m8188n672J5272L055m5836N580m9654J0032L5202m815J7051
7330d4761M2224L756K1504K3964K4078p5174j03050n016R879K5796M7156L0954
$$ y = [27532, -13909, -37563, -2854, -30714, -26827, -8894, -24594, -70542, -11412, 24749, -455, 38396, 16581, -58241, -72308, -91930, -51032, -12353, 34765, 22766, 6536, 12255, -9512, 10668, 73205, 46792, 8722, -47106, -49859, -34860, -37040, -16173, 38764, 19431, 50883, 31271, 10611, -29266, -50377, -48420, -12525, 8612, -41359, -31475, 3716, 12511, 37088, 56232, 76640, 71608, 3106, 3401, 23362, -7922, -20541, 27849, 30096, 37276, 4877, -51361, -90312, -133045, -107738, -77418, -80827, -70739, -55584, 4603, 19728, -57899, -99134, -76533, -46099, 19024, 23212, -24976, -30648, -15376, -12321, -58157, -52577, -102231, -92199, -56997, -61812, -44761, -2537, 1219, 22723, 46687, 70765, -4409, -107459, -112475, -102596, -76800, -29644, 1310]
7318A310j0628o0452O3245Q1713O2110l1177r5832m3811j4659j793K4358j7442
7306d3058m8159Q9790O7677L6793k8408o3733j4328j4549k353k5948K6226J0413
7294i637m7975m3158q525J6399r335l8921O9983J2875R74M9338J8844K0395L9193
7281G0450J7218J7002k0913j6956l3583o4891n9541L5770K2924j2725K7571M5410
7269B7736n4300m6124L995K793J5942j3911Q803L015p367O7355k1025p9643L5938
7256e6793o690j0827J5366J4389j3780r896o558P8917L7986k0854o7925j9403
7244f6068M3552Q9972O039p3522o520R599M5181L2765R987j06606l2336L4270
7232a3687L4927N3740m4448Q536l0323n7637o3411K8567M9759O953j2184l2503
$$ y = [1310, -9318, -69770, -6525, 75188, 137298, 106121, 10289, -33522, -48181, -49974, -25616, -43058, -91217, -1427, 66250, 103043, 74635, 10902, -3426, -17975, -20328, -46276, -20050, -9637, -57612, -100770, -109295, -92896, -102231, -141152, -71169, -58294, -57320, -7982, 10862, 31257, 70450, 87668, 104670, 83757, 66801, 33218, -31673, -91214, -55444, -32520, -45245, -17674, 27736, -26564, -72688, -68693, -65900, -49958, -63869, -55066, -52051, -59418, 7937, -13088, -92731, -56793, -63483, -74310, -58944, -44555, -58335, -68231, -74789, 4128, 42114, 21260, -46665, -66068, -22516, 67456, 73495, -27, -6547, 3052, 48233, 80998, 90985, -15621, -47957, -13687, 21240, 74980, 30532, 39068, 8745, -48892, -112303, -83736, -33977, -27024, -39208, -71711]
7220g1711l1504J1740R8062O5592o3381p708q272L2375L9846R762k6812j3529
7208C4460P939j1330p8430m5018m834J6309J5338K8762J0824o193J1717N1023
7196C0567N0390Q202j6945l2084m5742j0316M6460M5479n8415l6885j6500l984
7184c9773N2073p835j4072j0727J5810j0708k5518l314n5118n4207K3755Q7031
7172d2603M7962L1598j3090p570L7350K0958j1910j6943k2870m1826o682j5862
7160d1488K572M3852K936P219M623j08489J1446J5635M019N0975K722K533L7380
7147C5935O3889l622p0147m0415J1126J3923p7407p5296m543j117K6396P1067
7135e0211m910k2607N1710J0522L5082l4000j6438L4072M7083m251q651l6657
$$ y = [-71711, -103215, -91475, 6587, 72179, 8798, 1090, -7182, 25193, 65039, 74801, 47989, 34460, 42399, 31069, -47361, -92379, -97213, -80904, -65566, -36804, -25980, -32173, -20456, 30567, 80957, 89159, 72214, 40130, -5612, -15928, 30532, 76011, 17596, -19289, -35789, -39773, 12300, 4465, -9607, -20334, -4524, -15232, -40750, -44064, -99182, -153389, -129634, -42603, 5359, 36957, 23867, 16297, 53647, 74605, 62695, 45752, 22882, -18944, -25626, -41488, -38916, 4936, 7872, 15091, 19714, -88775, -77329, -61694, -57675, -6700, -3978, -1445, 35935, 99824, 96202, 26055, -14360, -3234, 10689, -66718, -142014, -146557, -147674, -121278, -50211, -55121, -77728, -26018, -15496, 19586, -14414, -30852, 3220, 50303, 46052, 37401, 744]
7123G44j2459l1965j6072p065Q1782j688n8591q068J9189N7849J4999L3266M5604
7110A17525k9858j05271n5543m2015L8139L2444l4287P0006M6117l8075o1809
7099f2627K8064O1598J7454M3505J832q5284r443P5240j1640p0467J2046M5669
7087D5947J7036k7454m9931m9248o0799j468j0490M3394M5174L4995M7493J1576
7075D6225M0207n926k4367J5354m872k7885l1283n2168L9855j1271l5340q327
7063e9798M9965L4017J8846M2087j6659o0504R829k1633q0723p656m090k9521
7051a25840P1310L4678k9559L5931L1384l0374n2701O0677l741P955k0734Q934
7039a2080J9820K0488j1964J1508N2395l0224j7516P617M5090m9303k0533j4315
$$ y = [744, -11715, -43680, -59752, -66817, 14965, 13277, -45314, -53382, -34193, 23656, 38655, 71921, 117525, 87667, -17604, -73147, -115162, -77023, -44579, -78866, -8860, 37257, -818, -62627, -34563, 27035, 44489, 87994, 89826, 4542, -4901, 70339, 58699, -11768, 278, 45947, 62983, 35529, -14402, -63650, -124449, -125917, -136407, -93013, -47839, -12844, 34649, 46225, 86432, 80506, 56139, 71493, 66621, 38736, 7453, -44715, -4860, -16131, -51471, -59798, -9833, 24184, 43030, 85117, 68458, 7954, 17783, -3850, -84573, -92229, -96319, -125840, -54530, -19852, -49411, -13480, 17904, -12470, -65171, -4494, -8235, -280, -21014, -12080, 7740, 28228, 16264, 27772, 80167, 49943, 32427, 40044, 85134, 35831, 15298, 983]
7027I83j1563K9296N0645n7147n1370o874L6462M4270p7079l2806K6645M1716
7015f822j7053n4562J0672N8379j7928M6365o0197m0243l8241J9439O8206P3247
7003D1262K600J9999K6806l2277l8232k0259j7604l0189m0648O6463Q8200k079
6991F4042j01170m6523K2435Q7293M91k2537J241j5130l0639l1804P2784j0458
6979i975J5888L3588L5967j5289n2731k9284N952M1858o210O582J2312j5243q5477
6966f2062m4962K1334K6021N6384Q9749J7184n1078j01577K981M6900M555l2627
6954b7198K7818J3509k3296q31j1191l1314q1622o899N8482R314N8089P9958k2704
6941D2115l0309j9930j2575m0270l2983J9597M844k9353k7829J708j8118O5835
$$ y = [983, -10580, 18716, 69361, 12214, -39156, -46030, -9568, 34702, -42377, -75183, -48538, -6822, -23875, -78437, -67765, -9386, -27314, 19051, -41146, -81389, -119630, -100191, -31985, 41262, 43862, 63861, 90667, 58390, 20158, -101, -17705, -47894, -88542, -22079, 66121, 64042, -37128, -83651, -61216, 26077, 26568, 4031, 5272, -9858, -40497, -72301, 483, -9975, 5913, 39501, 75468, 60179, 7448, -21836, -15884, 25974, 19764, 26346, 38658, 23415, -62062, -107024, -85690, -59669, -3285, 86464, 103648, 52570, -49007, -46026, 874, 5429, -27198, 620, 14129, -9167, -9998, -21189, -52503, -134125, -141024, -82542, -73228, -15139, 64819, 42115, 11806, -8124, -20699, -60969, -93952, -74355, -69511, -98864, -126693, -124985, -143103, -77268]
$$ [...]
##END NTUPLES=NMR SPECTRUM
##END=
