##TITLE=Analysis number 320666
Compound Code cc 45839
Book Reference 468/103
Project Code adrs
Chemist Name colinb
##JCAMPDX= 6.0         $$ Bruker NMR JCAMP-DX V2.0
##DATA TYPE= NMR SPECTRUM
##DATA CLASS= NTUPLES
##ORIGIN= Bruker BioSpin GmbH
##OWNER= nmr
$$ XWIN-NMR		Version 3.5
$$ Wed Jul  5 10:40:40 2006 GMT Daylight Time (UT+1h)  MAYBRIDGE\nmr@NMR_250MHZ
##.OBSERVE FREQUENCY= 250.131544655141
##.OBSERVE NUCLEUS= ^1H
##.ACQUISITION MODE= SIMULTANEOUS (DQD)
##.ACQUISITION SCHEME= undefined
##.AVERAGES= 16
##.DIGITISER RES= 18
##SPECTROMETER/DATA SYSTEM= dpx250
##.PULSE SEQUENCE= zg30
##.SOLVENT NAME= CDCl3
##.SHIFT REFERENCE= (INTERNAL, CDCl3, 0, 16.4386)
##AUDIT TRAIL= $$ (NUMBER, WHEN, WHO, WHERE, WHAT)
$$ ##TITLE= Audit trail, XWIN-NMR		Version 3.5
$$ ##JCAMPDX= 5.01
$$ ##ORIGIN= Bruker BioSpin GmbH
$$ ##OWNER= nmr
$$ C:\u/data/dgb/nmr/ADRS/2290/pdata/1/auditp.txt
$$ ##AUDIT TRAIL=  $$ (NUMBER, WHEN, WHO, WHERE, WHAT)
(   1,<2006-07-05 10:40:10.08 +100>,<MAYBRIDGE\nmr>,<NMR_250MHZ>,
      <created by zg, POWCHK disabled, PULCHK disabled
       configuration hash MD5:
       E2 DF 36 D8 04 B2 41 60 5A D7 A3 38 5A 4B D0 FE
       data hash MD5: 64K
       17 D6 AF F7 BE D7 86 8C 01 E8 32 4D 20 75 DD 17>)
(   2,<2006-07-05 10:40:24.67 +100>,<MAYBRIDGE\nmr>,<NMR_250MHZ>,
      <Start of raw data processing
       ef LB = 0.3 FT_mod = 6 PKNL = 1 SI = 32K 
       data hash MD5: 32K
       6E A3 53 43 1C 51 C5 D6 B7 B8 21 1E 0C 07 80 54>)
(   3,<2006-07-05 10:40:27.07 +100>,<MAYBRIDGE\nmr>,<NMR_250MHZ>,
      <apk 
       data hash MD5: 32K
       5B 74 6E 25 56 9F 77 A8 E8 2A DC C0 E8 4D 04 7B>)
(   4,<2006-07-05 10:40:28.42 +100>,<MAYBRIDGE\nmr>,<NMR_250MHZ>,
      <abs ABSG = 5 
       data hash MD5: 32K
       E3 83 92 9E BB 56 DC C0 85 5C E7 44 B5 1C 02 19>)
$$ ##END=
$$ 
$$ hash MD5
$$ B1 9A 26 D4 A4 C6 62 E4 9C 59 AD 75 12 AA 98 14
##$RELAX= 
##$RELAX= 
##$RELAX= 
##$RELAX= 
##$RELAX= 
##$RELAX= 
##$RELAX= 
$$ Bruker specific parameters
$$ --------------------------
##$DU= <C:\u>
##$EXPNO= 2290
##$NAME= <ADRS>
##$PROCNO= 1
##$TYPE= <nmr>
##$USER= <dgb>
##$AMP= (0..31)
100 100 100 100 100 100 100 100 100 100 100 100 100 100 100 100 100 100 
100 100 100 100 100 100 100 100 100 100 100 100 100 100 
##$AQSEQ= 0
##$AQ_mod= 3
##$AUNM= <au_zg>
##$AUTOPOS= <11 >
##$BF1= 250.13
##$BF2= 250.13
##$BF3= 250.13
##$BF4= 250.13
##$BF5= 500.13
##$BF6= 500.13
##$BF7= 500.13
##$BF8= 500.13
##$BYTORDA= 1
##$CFDGTYP= 0
##$CFRGTYP= 5
##$CHEMSTR= <none>
##$CNST= (0..31)
1 1 145 1 1 1 1 1 1 1 1 1 1 1 1 1 1 1 1 1 1 1 1 1 1 1 1 1 1 1 1 1 
##$CPDPRG= <>
##$CPDPRG1= <>
##$CPDPRG2= <>
##$CPDPRG3= <>
##$CPDPRG4= <mlev>
##$CPDPRG5= <mlev>
##$CPDPRG6= <mlev>
##$CPDPRG7= <mlev>
##$CPDPRG8= <mlev>
##$CPDPRGB= <>
##$CPDPRGT= <>
##$D= (0..31)
0 1 0 0 0 0 0 0 0 0.06 0 0 0 0 0 0 0.0002 0 0 0 0 0 0 0 0 0 0 0 0 0 0 
0 
##$DATE= 1152092408
##$DBL= (0..7)
120 120 120 120 120 120 120 120 
##$DBP= (0..7)
150 150 150 150 150 150 150 150 
##$DBP07= 0
##$DBPNAM0= <>
##$DBPNAM1= <>
$$ [...]
##$SUBNAM7= <"">
##$SUBNAM8= <"">
##$SUBNAM9= <"">
##$SW= 20.6930455092707
##$SWIBOX= (0..15)
0 0 3 0 0 0 0 0 0 0 0 0 0 0 0 0 
##$SW_h= 5175.983436853
##$TD= 65536
##$TD0= 1
##$TE= 295.16
##$TE2= 300
##$TE3= 300
##$TEG= 300
##$TL= (0..7)
0 120 120 120 120 120 120 120 
##$TP= (0..7)
150 150 150 150 150 150 150 150 
##$TP07= 0
##$TPNAME0= <>
##$TPNAME1= <>
##$TPNAME2= <>
##$TPNAME3= <>
##$TPNAME4= <>
##$TPNAME5= <>
##$TPNAME6= <>
##$TPNAME7= <>
##$TPOAL= (0..7)
0.5 0.5 0.5 0.5 0.5 0.5 0.5 0.5 
##$TPOFFS= (0..7)
0 0 0 0 0 0 0 0 
##$TUNHIN= 0
##$TUNHOUT= 0
##$TUNXOUT= 0
##$USERA1= <user>
##$USERA2= <user>
##$USERA3= <user>
##$USERA4= <user>
##$USERA5= <user>
##$V9= 5
##$VALIST= <valist>
##$VCLIST= <CCCCCCCCCCCCCCC>
##$VD= 0
##$VDLIST= <DDDDDDDDDDDDDDD>
##$VPLIST= <PPPPPPPPPPPPPPP>
##$VTLIST= <TTTTTTTTTTTTTTT>
##$WBST= 1024
##$WBSW= 4
##$XGAIN= (0..3)
0 0 0 0 
##$XL= 0
##$YL= 0
##$YMAX_a= 440980
##$YMIN_a= -462529
##$ZGOPTNS= <>
##$ZL1= 120
##$ZL2= 120
##$ZL3= 120
##$ZL4= 120
##$ABSF1= 16.43859
##$ABSF2= -4.254583
##$ABSG= 5
##$ABSL= 3
##$ALPHA= 0
##$AQORDER= 0
##$ASSFAC= 0
##$ASSFACI= 0
##$ASSFACX= 0
##$ASSWID= 0
##$AUNMP= <proc_1d>
##$AZFE= 0.1
##$AZFW= 0.1
##$BCFW= 0
##$BC_mod= 0
##$BYTORDP= 0
##$COROFFS= 0
##$CY= 12.5
##$DATMOD= 1
##$DC= 0
##$DFILT= <>
##$DTYPP= 0
##$F1P= 14.0000005364418
##$F2P= -0.99999901652339
##$FCOR= 0.5
##$FTSIZE= 32768
##$FT_mod= 6
##$GAMMA= 0
##$GB= 0
##$INTBC= 1
##$INTSCL= 1
##$ISEN= 128
##$LB= 0.3
##$LEV0= 0
##$LPBIN= 0
##$MAXI= 10000
##$MC2= 0
##$MEAN= 0
##$ME_mod= 0
##$MI= 0
##$NCOEF= 0
##$NC_proc= -2
##$NLEV= 6
##$NOISF1= 0
##$NOISF2= 0
##$NSP= 0
##$NTH_PI= 0
##$NZP= 0
##$OFFSET= 16.43859
##$PC= 1
##$PHC0= 162.9928
##$PHC1= 7.162081
##$PH_mod= 1
##$PKNL= yes
##$PPARMOD= 0
##$PSCAL= 4
##$PSIGN= 0
##$REVERSE= no
##$SF= 250.130020861975
##$SI= 32768
##$SIGF1= 0
##$SIGF2= 0
##$SINO= 400
##$SIOLD= 32768
##$SREGLST= <1H.CDCl3>
##$SSB= 0
##$STSI= 32768
##$STSR= 0
##$SW_p= 5175.98343685301
##$SYMM= 0
##$S_DEV= 0
##$TDeff= 65536
##$TDoff= 0
##$TI= <Analysis number 999999
Compound Code 99
Book Reference 9
Project Code 9>
##$TILT= no
##$TM1= 0
##$TM2= 0
##$TOPLEV= 0
##$USERP1= <user>
##$USERP2= <user>
##$USERP3= <user>
##$USERP4= <user>
##$USERP5= <user>
##$WDW= 1
##$XDIM= 32768
##$YMAX_p= 370706294
##$YMIN_p= -84401
$$ End of Bruker specific parameters
$$ ---------------------------------
##NTUPLES= NMR SPECTRUM
##VAR_NAME=  FREQUENCY,     SPECTRUM/REAL,   SPECTRUM/IMAG
##SYMBOL=    X,             R,               I
##VAR_TYPE=  INDEPENDENT,   DEPENDENT,       DEPENDENT
##VAR_FORM=  AFFN,          ASDF,            ASDF
##VAR_DIM=   32768,         32768,           32768
##UNITS=     HZ,            ARBITRARY UNITS, ARBITRARY UNITS
##FACTOR=    0.157963299565203, 1,           1
##FIRST=     4111.78463354126, 0,            0
##LAST=      -1064.19880331175, 0,           0
##MIN=       -1064.19880331175, -84401,      0
##MAX=       4111.78463354126, 370706294,    0
$$ Real data points
##PAGE= N=1
##DATA TABLE= (X++(R..R)), XYDATA
$$ [...]
15185b352L889J0223l568j2765m618R481J6296L467j6117j689p178P28K5315j0697
15171A0415j9945M705Q26J251K289J1026N88N86J146m582Q026j2144j4659R616
15157h56N352L769J0381j7971j815O530K470K103j4801O47n396j0465R706J079
15143i267N412J2336K130r316r8O651J850q240o350k420j66O571J1886P510N195
15128B3684o603N35m619j7973q270Q499J2652O356n390M675J1726j204K442N116
15114C1626r102p062k472k911r802O347O450r379l852R936p918P026J1988k1734
15100h59p022j5997N09R209L779J2551p573q686K736J1691l064m766j9964L504
15086b3952Q750K0328J1730P035n026j2059j175M707j0250J0491p041q051l640
$$ y = [-2352, 1537, 11760, 8192, -4573, -9191, 290, 16586, 20053, 3936, 2247, -4931, -4203, 21112, 10415, -9530, -4825, -3999, -2748, -459, 10567, 11155, 11741, 12887, 8305, 16331, 4187, -10472, -856, 4496, 8265, 18646, 675, -1140, 5390, 7860, 9963, -4838, -4191, -9587, -20052, -10346, -9267, -3855, 8481, 10611, 1295, 1197, 7848, 9698, 1458, -4892, -7312, -7478, -907, 10979, 18489, 23684, 17081, 17616, 12997, -4976, -13246, -4747, 7905, 14261, 8871, 13546, 25272, 24068, 26510, 31626, 22524, 15462, 12990, 10079, 277, 6624, 13074, 3695, -157, 9779, 1861, 8887, 20875, -859, -7881, -23878, -23369, -14160, -10381, 2170, -5403, -14089, -11353, 338, -2726, -7492, -27456, -23952, -15202, 5126, 16856, 23891, 18865, 6806, 5631, 10338, 88, 10579, 3538, -4513, -8153]
15073h153Q890O112J4945J0549j2238j2932j905M110K52o368O492J731K700j0233
15059C952j5249j656q340K465J5515p359J5662R793o632m53J0160M742p924J444
15045A6120m476k199j8495l826K106J4419J273j3702R594J0624j306l1849r143
15032c0860Q794j523q694J311J9026L994K136r139k3948l979P773k43J814m326
15018c7864L861J0107P406J3552p523O124O664M474P088M880r947j1845O782k023
15004A736n719j4862l244R840O116O654p328q373K4249J150j7274j629J0760k997
14990i21j7042o260J3203K2477J1914Q784j0713J078J6660m463j5993r464J0617
14977A9877k717m382k571j0537m821R997J6801j6280j7925j8195L518J7955K8118
$$ y = [-8153, 737, 6849, 21794, 32343, 20105, 7173, 5268, 9378, 9630, 3262, 9754, 11485, 14185, 3952, -11297, -12953, -21293, -18828, -3313, -10672, 4990, 14783, 8151, 7698, 17858, 22600, 14676, 16120, 11644, 9445, -9050, -12876, -10770, 3649, 4922, -8780, 814, 11438, 10132, -21717, -30860, -22066, -23589, -32283, -30972, -11946, -7952, -5816, -14955, -38903, -42882, -35109, -35352, -33538, -37864, -34003, -23896, -16490, -2938, -10461, -4337, 2327, 6801, 13889, 18769, 8822, -3023, 3759, 1736, -3983, -18845, -22089, -12249, -6133, 521, -6807, -15180, 9069, 10219, -7055, -8684, 2076, -921, -17963, -24223, -11020, 11457, 23371, 32155, 21442, 22520, 39180, 34717, 18724, 9260, 19877, 17160, 12778, 10207, -330, -5151, 4846, 21647, 5367, -12558, -30753, -27235, -9280, 18838]
14964A8838j4690m197m578j1362j5677J8429K0041j3084m398j0049j222L333J0711
14951g905P631K098j3101o208N684M7J480l952l299M869o699Q5J1504J2368j616
14936B986j4134m331P565J0685M735j1173j3855M604m375j3570O971J7414K3269
14923A6791Q895j5023j0415M889R885j3506o849j518j1168j2339K5905m754n630
14910a4837K215M932q740j2577J5269L1384n82J0120J894j0170j2800n958M908
14897E058j138j1489l308N454J6265K816r97Q849p98j3277j2835J5278J1967l277
14883A8568M88j2718j1332K636O893O498n469j2485k080j001J191k783J6057j4851
14869a0388k365J711O146N612K367j0948k1228j1840O674J589Q129R360Q670r68
$$ y = [18838, 4148, -49, -4627, -15989, -31666, -13237, 6804, -6280, -10678, -20727, -21949, -18616, -7905, -274, 1824, -11277, -17485, -11801, -11754, -10274, -14226, -17525, -12656, -19355, -19270, -7766, 4602, 2986, -11148, -15479, -7914, 2771, 7506, -3667, -17522, -12918, -17293, -30863, -23892, -6478, 16791, 25686, 10663, 248, 5137, 15022, 1516, -5333, -6851, -18019, -30358, -4453, -9207, -14837, -12622, -7690, -16430, -29007, -13738, 17646, 17064, 27184, 29078, 18908, 6108, 150, 5058, 3920, -7569, -10877, -5423, 10842, 13658, 12661, 21510, 20712, 7435, -5400, 9878, 21845, 18568, 19056, 6338, -4994, -2358, 4535, 11033, 5564, -6921, -9001, -10002, -8811, -11594, 4463, -10388, -12753, -11042, -4896, 716, 3083, -7865, -29093, -40933, -34259, -32670, -24541, -15181, -6511, -7479]
14855g479p353q58R849J3836N59j6023j0335o161J909J569R761R041j0132j0600
14841b2417q893O101J2510J7234M968j0250j1708l59J957P041K5929J558j1251
14828A2420m355j2230m464p382K058N275J886J0470O490j1193Q248J7366O681
14815C1270j1025k6340n150M46J1675J2712j6282r268L023J3438J606j74n714
14802B17p764o068K0164O866j7072j0054N825J3786j1233j2277q60P5l965J0525
14788a1835j014O08L220K697J453J023L255k594j5184n261j582J2131K847L84
14774i852K4240J4435q062j8172m228n895q209Q63J7322J863L616l505m886K319
14760A849m126l221J315p291r339r181n670Q775Q849P237J248J4584L418p473
$$ y = [-7479, -14832, -15690, -5841, 7995, 8554, -7469, -17804, -23965, -22056, -20487, -10726, -1685, -11817, -22417, -31310, -25209, -12699, 4535, 9503, -747, -12455, -12814, -10857, -3816, 22113, 23671, 12420, 8065, -4165, -8629, -16011, -13953, -8678, -6792, 3678, 10168, -1025, 7223, 24589, 31270, 20245, -6095, -11245, -10799, 876, 13588, -2694, -11962, -8939, 4499, 6105, 5931, 217, -7547, -13615, 6549, 13415, -3657, -13711, -7886, 5900, -5333, -17610, -18470, -18395, -22360, -11835, -12849, -12241, -9021, -6324, -4871, -3848, -593, -3187, -18371, -23632, -25214, -13083, -10236, -9852, 14388, 28823, 20761, 2589, -1639, -7534, -15743, -14880, 2442, 4305, 7921, 4416, -470, 1849, -2277, -5498, -4183, -11474, -20813, -29994, -35664, -26889, -18040, -10803, -9555, 5029, 8447, 974]
14746I74J499R079n62P089K249m594r052r937P605M117p626q923o664m446R22
14731a8270J2192N510N634J1595q93J53n175M709j615j9163j2957k986N243k720
14717a8743j3420K984J6723N027J478j2850M362Q382j1098O526k564p62p032J0884
14703a0103L155P429Q267j7951j6245q81P414J8991N321j4028R55J5028p148p838
14689g634r679k119j778j664o131P373J766L803N665r559r145j801J2419j013
14675a9497J783J3886l566j4082J694N02n708J9865k035J701P740r270O695J3766
14661A3474j0409K68o801l352P160J6886q922j3347P93J8286N51n53P678m214
14647A7498p804m11L78j157q565r861k067K0034J8307m022o428j3882r307J1645
$$ y = [974, 2473, 11552, 10990, 18079, 20328, 15734, 6682, -3255, 4350, 8467, 841, -8082, -14746, -19192, -18270, -6078, -568, 5066, 16661, 15768, 15921, 10746, 15455, 13840, -5323, -18280, -21266, -16023, -18743, -32163, -29179, -12456, -7429, -5951, -18801, -14439, -6057, -17155, -10629, -13193, -13955, -20987, -10103, -6948, 481, 8748, -9203, -25448, -26329, -18915, 76, 5397, -8631, -7676, 7352, 204, -7634, -17313, -19432, -21210, -22874, -29005, -21632, -19866, -16063, -10398, -19957, -29102, -30903, -18484, -19497, -17714, -3828, -7394, -21476, -19782, -19280, -24988, -5123, -7158, -5457, 2283, -6987, -292, 13474, 3065, 3333, -3468, -6820, 340, 17226, 8304, -5043, -4250, 14036, 14587, 14034, 21712, 17498, 9694, 9283, 9661, 8504, -61, -9922, -11989, 8045, 26352, 22330, 15902, 2020, -7287, 4358]
14633D358Q216N022o828j6895p145J1085M052Q322N326l668j6595m380k471N037
14619f564k271J4657j4998j0396J0347R823j0696l276j1004j583L2009K1051K30
14606B7329K069r51q57J3454R144j9485j4804j2231J0318j4655k3041j899J6141
14593i468K1365O09p731m396N601P521l720j3420q187J5420k118K524L016m827
14579B189j463Q998J9343q419l671q734j3065L773O202j0406Q143j168j7336p865
14565b3479M323O854K748Q398k361j3926k635N040o296J437J6846k284j2119P21
14551a6733p82J2490j2413O455P666o262k243J607n410L173M865k771r666O660
14537a3364J7787P743J012n607j2715K966J6844Q119j4748j1167o302O30M155
$$ y = [4358, 12574, 17596, 10768, -6127, -13272, -2187, 1865, 10187, 15513, 11845, -4750, -9130, -11601, -6564, -8835, 5822, -9176, -19572, -9225, 598, -10098, -13374, -24378, -25961, 6048, 27099, 27329, 29398, 28447, 27590, 41044, 50188, 30703, 15899, 3668, 13986, -669, -23710, -25609, -9468, 11897, 12506, 4775, 379, 5980, 13501, 9781, -3639, -11826, 3594, 1476, 4000, 7016, 2189, 726, 9724, 29067, 20648, 16977, 8243, -4822, -1049, 5153, -5253, 2890, 1722, -15614, -23479, -19156, -12302, -9554, -1156, -3517, -17443, -20078, -15038, -21334, -19897, -3051, -5335, -17454, -16733, -17515, -5025, -17438, -10983, -3317, -9579, -11822, -10215, -15625, -12452, -7587, -10358, -20024, -13364, 4423, 12166, 13178, 7571, -5144, -2178, 14666, 22785, 8037, -3130, -9432, -8802, -4647]
14524d647P049q342K560M768N328R502j1166q587M482q383L205J6886O32j6199
14510b912j6070J0473J9870j0680j1325K232l039K1172n195j4179Q31O224J743
14497h55n650j4887p650O694J9771Q684o552p643P585P29j2072k241j5739K586
14483b7240J6536J3458L586J895o08j5195m191R888L445O430j005j617O252K692
14469A4326q222k2115k850R439R689M227R5n460k626m985j4063m547J1492J6426
14455H26L969j0375l332J3522M400p352p559K151r856P575l63Q492l287l26j754
14440c269j2445J4751J3073j180L354k0754l684k142j825N625m092N336j323j6019
14426b4594P153J490R430m226r442L049N497m471J357j1942J93M304J0665N313
$$ y = [-4647, 2402, -5940, -3380, 1388, 6716, 16218, 5052, -3535, 947, -7436, -4231, 12655, 13287, -2912, -18982, -8509, 11361, 681, -10644, -8412, -11451, 9721, 4526, -9653, -8822, -2598, -855, -6505, -21392, -29042, -22348, -2577, 6107, -445, -8088, -503, 226, -11846, -14087, -29826, -27240, -10704, 2754, 6340, 8235, 7627, -7568, -11759, -1871, 1574, 8004, 6999, 5382, 11634, 14326, 6104, -16011, -18861, -9422, 267, 4494, 4589, -871, -3497, -8482, -22545, -27092, -15600, 826, 4795, -5580, -8912, 4610, 9010, 1658, -5901, -3750, -13606, -6031, -6394, 2098, -1189, -1515, -3269, -15714, -963, 12110, 10930, 14284, -6470, -10154, -12296, -14121, -8496, -12588, -7252, -8575, -24594, -17441, -15951, -6521, -10747, -20189, -17140, -11643, -16114, -14757, -26699, -26506, -22202, -11537, -6224]
14412f224j4010j288J127N761J0645R43J2616o748j092j920O120j5086l195J0800
14398a551P826o658O932Q175J0890J0718q318j6526k3179k752j5659n19J6489
14385a4132J7827L263L967J4722j2489j3696o138o43q657p499O505J0575K384
14372d011q017j1508j4138J1859J3824J5462J2084q479j3577l623M306O827n571
14359d562J0494K406j5131p095L365O853J3446P028N091k134j1550l213k666j250
14345A082j3984j3424M601M014J5635r63k353o194K737l610K130R33j6209n471
14331c1076M323j015Q831N432M96N708m253O347M435j923N133P61R916n799j3541
14316f225j1143M953Q858l187O259J2607l495p656j2066j0678J7711K0517l826
$$ y = [-6224, -20234, -21522, -20395, -14634, -3989, -3046, 9570, 2822, 1730, -190, 5930, -9156, -12351, -1551, 6275, -383, 6549, 14724, 25614, 36332, 28014, 11488, -11691, -14443, -30102, -30621, -14132, 3695, 6958, 10925, 25647, 13158, -538, -6676, -7319, -15976, -23475, -16970, -6395, -4011, -12028, -23536, -37674, -25815, -11991, 3471, 15555, 7076, -6501, -10124, -5818, 1009, -4562, 5932, 8338, -6793, -13888, -10523, -3670, 9776, 16804, 21895, 19761, 8211, 4998, 2332, 1082, -12902, -26326, -21725, -17711, -2076, -3039, -5392, -11586, -8849, -12459, -10329, -9396, -25605, -31076, -26753, -27768, -18937, -13505, -13009, -7301, -11554, -5207, -772, -2695, 2438, 3199, 13115, 7316, -6225, -17368, -12415, -3557, -6744, -485, 12122, 8627, 971, -11095, -21773, -4062, 16455, 12629]
14303A2629j1789m152k01K422J4015K351k0125n508L489J2354R623K336k0842
14290c398j0591N550L691n408J701M107n829r534o914J7236K193l863j396k206
14276a4661M296J719J0417n746j869Q872l460J2662J029q487m603j1703M396l191
14262a0329R743j903j7210Q05J3644Q19p022J0756K113l276J523O488J1447j1896
14248E702q67R283j5858o899J3698Q003j0705r442j9412L881O663l046J2138K5154
14234A8293M328j805M025l440l2999j1563J1914J0646p74q539L955J6969J2975
14221B3985j3412j6305j6577q118R324N006J2739j316l531J689L553K333o876
14208g506o361k024K293K792k902j3515j8453K1602K6234M01j4612n215O650J193
$$ y = [12629, 840, -3312, -3513, -1091, 12924, 15275, -4850, -10358, -6869, 5485, 15108, 17444, -3398, -13989, -8439, -4748, -10156, -8455, -4348, -10177, -19711, -26625, -9389, -7196, -11059, -12455, -14661, -10365, -8646, 1771, -3975, -5844, 3028, -432, 12230, 13259, 4772, 169, -11534, -7138, -10329, -586, -2489, -19699, -18894, -5250, -4431, -11453, -697, 1416, -1860, -337, 6151, 17598, 5702, 4835, 14118, -1740, -8639, 5059, 13062, 2357, -7085, -26497, -22616, -15953, -18999, -6861, 18293, 22621, 20816, 24841, 21401, -11598, -23161, -11247, -601, -1375, -9914, -5959, 11010, 23985, 10573, -5732, -22309, -30427, -21103, -16097, -3358, -4674, -8205, -6516, -2963, -630, -7506, -13867, -15891, -13598, -10806, -13708, -27223, -45676, -24074, 2160, 2561, -12051, -17266, -10616, -9423]
14194i423L197O026l369p057R850n253k884O461N547o221j7904m577j5970J0041
14180c1536R444K4649Q036K497Q966j5834j6377o740k443K0652J0821r136O397
14167I396o064N586K0457J096J040r514j2653j637l190p195j937P445L942K398
14153I170P610p281j370P354n106j0154J710M906l52q14r019M51n694K092L489
14138c008J649J355j2083p419L426J8206R52Q68j0526R72K706Q456p967l228l299
14123h940o649N381J5174q414O112L94N683m381k550K220l835p805R132M88p621
14108e611j454J4596n212k7660q211Q230M262J8878O15o301P132j0333l250J2824
14094a495M117K76P197J247R54q445j173O79j1896r049n726K350J0838K411j0155
$$ y = [-9423, -6226, -200, -3569, -10626, -776, -6029, -8913, -2452, 3095, -3126, -21030, -25607, -41577, -31536, -22092, 2557, 10593, 13090, 22056, 6222, -10155, -16895, -19338, 1314, 12135, 2999, 9396, 3332, 8918, 29375, 30471, 31511, 21997, 9344, 7707, 4517, -2678, -4615, 2830, 6772, 9170, 16780, 9499, 8129, 15483, 10377, 223, 1933, 6839, 6487, 5673, -3346, -2895, -8589, -6497, -3008, -1359, -4, -12087, -19506, -16080, 2126, 3078, 3946, -6580, -5608, -2902, 5554, -2413, -5641, -8940, -15589, -10208, 4966, -3448, 2664, 3058, 8741, 4360, 1810, 4030, 195, -7610, 1522, 2010, -5611, -7065, 7531, 2319, -25341, -33552, -25322, -21060, -2182, -1567, -7868, -736, -11069, -14319, -1495, 2622, 2898, 10095, 11342, 12296, 3851, 2678, 3357, -8539, -17588, -23314, -20964, -10126, -7715, -17870]
14079a7870j6859J3038N488O457J5500O951m872r016Q84N725R345K067m400R157
14065B1595J597k278r406j5812P29j80Q959o898j1010o949O672J6161j028p274
14051e122j2061J4160J0642q854k938J8138Q360o9r312j8992j614J1188N851q85
14037H492J352Q174Rl525k530r547R05J508o090Q702O360j3488j832j6961j0382
14022b8853J3659N318R110Q380O83n169l616J104l912P074J992l399l425q31K688
14007H03J4533P475r185p142j4803l67k152L216P817j1180p738J3232p633O939
13993f185N804L359n802k928O459k275m406j4698q113q444R585Q134M836K569
13979a2105l37O918J546N186K499K127P7n680r35j1374j0711j227Q621M40M013
$$ y = [-17870, -34729, -21691, -16203, -9746, 5754, 12705, 7833, -1183, -299, 5426, 14771, 16838, 12438, 21595, 23192, 20914, 11508, -4304, -3575, -3755, 5204, -1694, -12704, -19653, -12981, 3180, 2152, -5122, -17183, -3023, 7619, -1235, -4173, 13965, 22325, 22256, 12944, -6048, -7662, 3526, 9377, 8492, 9844, 18018, 18027, 14502, 11972, 2425, 3330, 4838, -1252, 7450, 13810, 322, -1510, -18471, -28853, -15194, -9876, -766, 7614, 8297, 3128, -488, 616, -3296, 3778, 5770, 2371, -1054, -1885, 803, 15336, 22811, 13626, 6484, -8319, -8686, -10838, -7622, 195, -10985, -18723, -5491, -13124, -6185, -381, 2978, -2824, -5752, 707, -1568, -5974, -20672, -28785, -37229, -27644, -19510, -14674, -12105, -12442, -5524, -3978, 1208, 3707, 5834, 5911, 231, -704, -12078, -22789, -24016, -15395, -14955, -10942]
13964a0942J0007J2403k269j2180O483M797q678J767j0181K71Q767N099J278p611
13950i89K145q40k070J0871K464M064k846r774Q51K452Q285j262Q31j808j0135
13935B239j1306M603O310R19N406k7o525Q195P773l850m479J558J704o360q175
13920b015n793M98J137K549J2084N09j4328J369J3996j386O073L083k6282j1596
13906b0102P647j1183L129Q000Q991q422k04J7579J4638M241p275O20j2782n510
13892f33j099q991j038L793K0440P90j1774r309j232J2279J0480j5743j244j4594
13878a7875P925J3286J7236O137k5221M666k54m297j5624N546M10K260J2388Q87
13864G470j288o843O419Q515q479j0289j719k636j0638L81J964l183M26J8398
$$ y = [-10942, -935, 11468, 9199, -2981, 3502, 8299, -379, 1388, -8793, -8522, 245, 5344, 6622, -989, 1156, 316, -1754, 9117, 11581, 15645, 12799, 3025, 3876, 6328, 14613, 13351, 14182, 12374, 2239, -9067, -4464, 1846, 2765, 8171, 8144, 1619, 9814, 17587, 13737, 9258, 10816, 12520, 6160, -2015, -7808, -7310, -6173, -3624, 8460, 8969, -5359, -3990, 10006, 8620, 14693, 17776, -8506, -20102, -12455, -23638, -20509, -12509, -3518, -11940, -12144, 5435, 20073, 24314, 17039, 17659, 4877, -633, -1732, -10723, -11761, -7968, 12472, 13262, 1488, -7821, -9053, 3226, 13706, -2037, -3281, -17875, -9950, 3336, 20572, 26709, 1488, 6154, 5900, 1603, -14021, -8475, -8065, -5805, 6583, 7470, 6182, -661, 5758, 14273, 5794, -4495, -6214, -8850, -19488, -19107, -17143, -20326, -19900, -1502]
13850a502m687j0257j468J482M140M989J5035R761r300q127k58M01j6950q029
13836b4770M758M581n191J4947l336R469O497M31Q647r637q871k413J690j1350
13822a4548J2996r627R01m388Q29R645K368l037k429k640O197j1236m07R766M622
13807i88m925n605J633J9575r432J0594J6382j3027o055k564m809J0520J0237
13794B1536j4727q436m221J3578m639r095M842n966J109r077m98J2063j4847K045
13780a6333J581l551j0451p812N661J0683J5771q46j2714O167K0291Q349l04P427
13766B3919j6842l777P43M882P427j952n108J749N17j9404r684R766L580J676
13752b508p263l894J3076Q690o005k0458r35O614K0374j2344j1556N150Q710N896
$$ y = [-1502, -6189, -16446, -17914, -16432, -12292, -7303, 7732, 17493, 8193, 66, -192, 209, -16741, -24770, -20012, -15431, -20622, -5675, -9011, 458, 6955, 7386, 16033, 6396, -2475, -4888, -3198, -14548, -1552, -11179, -10278, -14666, -13837, -4192, -1824, -4861, -7290, -9930, -3733, -14969, -15376, -5610, -988, -5913, -11518, -9885, 9690, 258, 10852, 27234, 14207, 8152, 5588, 779, 11299, 21536, 6809, -1627, -5848, 7730, 3091, -6004, -1162, -7128, -6019, -15096, -15594, -3531, -18378, -16333, -14752, -18303, -28754, -36566, -30905, -20222, -4451, -5297, -18011, -11844, 8447, 16796, 16492, 23919, 7077, 3300, 4043, 8925, 16352, 14400, 9292, 11041, 11558, -7846, -17530, -7764, -4184, -2508, -9771, -13665, -589, 8101, 2096, -18362, -19297, -12683, 7691, -4653, -16209, -11059, -2349, 3547]
13738C547M413j942L617k877n267q991k526J912K1559n139k171J8221j4770j117
13724H469O612k300K03L490J5q187j039m49k703p087K808M093l928J101P454M650
13708A3202q655j6271K565J4569J5570J69r550l439M00L433J7591p502j6763n556
13694b37J6453J4058o41k757m668r578k0711K500M332J8379N227j5159j481N182
13680A0899L739L728j6028j9080n608K205J2203J2719L065J3185N065O22j7532
13667I182k1788k285J6507L2360O282k7334j4241o087M727j3589j4057J0933J1916
13654g474L619q42N604K264j6757n542R785N891N23N652J4060L995j6448K374
13640F704j067O256O499j4818o348J5072R86K958j4109j0339q060p311J3088J6099
$$ y = [3547, 7960, 6018, 9635, 6758, 1491, -7500, -10026, -8114, 13445, 8306, 6135, 24356, 9586, 8469, 15081, 12781, 12984, 16474, 16489, 8302, 7263, 6814, 4111, -2976, -168, 3925, -3, 1098, 8552, 13202, 4547, -11724, -9159, 5410, 20980, 21149, 11599, 8160, 8560, 11993, 29584, 22082, 5319, -237, 16216, 30274, 29633, 26876, 22208, 12630, -8081, -5581, -1249, 17130, 22357, 7198, 5717, 10899, 14638, 18366, 2338, -16742, -22350, -20145, -7942, 4777, 7842, 21027, 26092, 26714, 9182, -12606, -14891, 1616, 33976, 40258, 12924, -1317, -7404, -2677, -16266, -30323, -19390, -7474, -3855, -4697, 907, 3171, -13586, -19128, -9343, -3452, -2929, 2723, 16783, 20778, 4330, 6704, 5637, 11893, 18392, 3574, -2774, 12298, 13284, 16242, 2133, -8206, -16266, -23577, -10489, 5610]
13626E610m330J4955n344p015k0320q054J6975J2533q293K010J4703j69j221P75
13612A2815n417J845r401m123K823L062k039N739M387q98M601p482P536l60j174
13597A1914J534J433j1955p20J1312M606n645n893j412j10J4202M034n709K539
13583B0130l46l883O972Q438k2362j4860J0047R049q512j2083k430l138J752J7016
13569E790M634O113q10K549q196j779j0507P934m807p3J2638L128q23j1840r531
13554e580m295M524k935n223P232L940O545J1546q049m185j03j2329j5280q880
13540c3072J0874O998n774j736O347P773K738q311N860j2906k897J3554R654O170
13526E272j044Q539j7732j4653o796J1492N343K109j2624r317N482n183m183J5397
$$ y = [5610, 1280, 16235, 10891, 3876, -16444, -24498, -7523, 5010, -3283, -1273, 13430, 13261, 12040, 12815, 7398, 9243, -158, -4281, -1458, 1604, -435, 5304, 9691, 8793, 13394, 5912, 13448, 13088, 11914, 13448, 14881, 2926, 2206, 13518, 18124, 12479, 6586, 5174, 5064, 19266, 23300, 17591, 20130, 19784, 15901, 22873, 31311, 8949, -5911, 4136, 13185, 4673, -7410, -9840, -12978, -11226, 5790, 10424, 16537, 15727, 18276, 10080, 8301, -2206, 5728, 921, 848, 13486, 16614, 15791, 3951, -5580, -9875, -5351, -8286, -13509, -6277, -2337, 4208, 15754, 7705, 3520, 3417, -8912, -24192, -33072, -22198, -15200, -20974, -22710, -16363, -8590, -5852, -14163, -8303, -21209, -24106, -10552, -898, 5272, 4228, 12767, -4965, -19618, -26414, -14922, -9579, -7470, -20094, -29411, -23929, -29112, -33295, -17898]
13512a7898K1446J207J2015p308q753j2180o44J470j6468k146R980K431K2810
13499E962r83j0985j088j7045j7028k60Q200L472J6680k45o25J6653q457q973
13485a4722K003J4087J7142m542j4927j5152K557K0803J3057J276l074o838j558
13472A0112J5287q845k1162o875J0539j742j693m596J3654J5469m648j4619J7464
13459A8345O738j0395N070J6881j9537j2892j534J0453J1663j68l736R809o356
13446B4341o798q270l701r452j23J0458J0459m433L473m245j2231O31J303m444
13432c032o128R200r333j290j3708K928J2746J4395N35K174K084n922m558p131
13418g040J293Q152R982m512j9551J4986N898M21M704q131L272Q057L675q719
$$ y = [-17898, 3548, 4755, 16770, 9462, 709, -11471, -12115, -10645, -27113, -29259, -19279, -16848, 5962, 4979, -6006, -7094, -24139, -41167, -41427, -33227, -29755, -13075, -13320, -13945, 2708, -5749, -14722, -12719, 1368, 18510, 13968, -959, -16111, -13554, 7249, 20306, 21582, 18508, 11670, 10112, 25399, 16554, -4608, -11483, -944, -2686, -4379, -8975, 4679, 20148, 15500, 881, 18345, 25083, 14688, 19758, 36639, 17102, 4210, 2676, 13129, 24792, 24624, 20888, 30697, 24341, 17543, 9273, 5572, -3880, -4003, 6455, 16914, 12481, 15954, 11709, -522, 109, 1412, -3032, -9160, 40, -9293, -10583, -24291, -21363, -8617, 5778, 6313, 8487, 10571, 4649, 91, -7040, -5747, 2405, 12387, 7875, -11676, 3310, 9208, 9629, 14333, 6202, 9474, 17531, 21206, 12487]
13404A2487j0786j6506L58L60L094J0468l845m755P423q05K194O432O203n090
13390G232j4146l355o585P138K1381R893r189N828P468l010M660O856n003q239
13376B0929k0527j6387J5500J594j2444j4721Q461J1283M288r113m536M504J2089
13363I20J0826L014J227k7479j4543J8782K9808q95j2631j741M816o279K509M518
13349A2852k1352p86J427K96J0964k100q934Q051N550R07j251j907k265P034Q996
13334A7482k4884n118O574p094J4600J8378M848J7518m962n736m569M600j1476
13321B0161j4413O991M555o767O999p996j026K190j8589l578J8238J813j3930
13308e352n923R230L027j450J0947j2102Q14q69J219N198n852n110L183j3379
$$ y = [12487, 1701, -14805, -14447, -14087, -10993, -525, -4370, -9125, -1702, -2507, -313, 6119, 12322, 7232, -6914, -10269, -16854, -9716, 11665, 21558, 12369, 18197, 25665, 22655, 27315, 34171, 29168, 20929, 402, -15985, -485, 1109, -11335, -26056, -17595, -6312, -2024, -11137, -15673, -11169, 920, 11746, 14760, 15987, -11492, -26035, -7253, 22555, 21660, 9029, 7288, 12104, 5825, 8334, 12852, -8500, -9286, -7859, -7563, 3401, 1301, -7633, 418, 5968, 6875, 5624, 3717, 1452, 8486, 17482, -7402, -12520, -5946, -13040, 1560, 19938, 24786, 42304, 37342, 31606, 27037, 31637, 20161, 5748, 12739, 17294, 10527, 17526, 9530, 8504, 10694, -7895, -11473, 6765, 8578, -5352, -11275, -2045, 982, -468, 10479, -1623, -809, -1678, -459, 4739, -1113, -6223, -3040, -16419]
13294a6419r951P266J4598n486j169j2128M192J7058J0012k602J166P812K433
13281A6782j3093j1910J9145M584K695L960n539r887j8021j0243J2783N365J0659
13268G280J4298j2428p555j115L354m271r41J1064O879p637k903p653q213N35
13254i306Q444m16j716j1961N944J3424L9J374r693O552n014N618J8985J3544
13240C5818o158l69k376r884N421k593q91j9669o744R101K2174l655L500j036
13226B2639k773J50j7438l6P397j87j3273k105o558j1780J184J2491J4226J090
13212E027L318N15M360J6050J3357p036j1469K610o457j9696N690J6850l104k221
13198A7794j0278n415J5468Q451l446j7326j2820J2279R457n439j324J2550k654
$$ y = [-16419, -26370, -19104, -4506, -9992, -11161, -23289, -19097, -2039, 7973, 5371, 6537, 14349, 16782, 3689, -8221, 10924, 15508, 18203, 22163, 16624, 6737, -11284, -21527, -8744, -3379, 7280, 21578, 9150, 1595, 480, 3834, -437, -1378, 9686, 16565, 8928, 6025, -1628, -9841, -9306, -862, -1278, -2994, -14955, -9011, 4413, 4452, 5826, -3867, 2685, -2329, 3289, 22274, 35818, 29660, 29291, 26915, 17031, 22452, 19859, 18968, -701, -7445, 1656, 23830, 20175, 23675, 22639, 19866, 20016, 2578, 2542, 9939, 9752, -3521, -5626, -12184, -23964, -22780, -10289, 3937, 5027, 8345, 8860, 13220, 29270, 42627, 35591, 24122, 26732, 20275, 579, 6269, 23119, 20015, 17794, 7516, 2101, 17569, 26020, 22574, 5248, -7572, 4707, 14164, 8725, 7401, 19951, 17297]
13185A7297j0102j390J2413L909J0102N340k547k087L682j0070r391j8975r212
13172a1031j2561q956J3514J1949L507P192J2894N583m89P678k202J138q842m991
13158A4383n782N172J557j7133R809J9604n741j2151P6Q94J720p268q530L614
13144B24j0627o701J7009Q090J1470n246j348q366p660J02J924q768L504J2577
13130F184o255P788O792j7946R084n786p589K224J2087P2M890k763l435J626J0512
13115A7485J0855j293r091j875k741r215n149L761p986l860J4339J1791L853J91
13101B1065r846m896r198O33J8182Q894N428m4k497m486L291m018L98n130k431
13086A5345Q485Q286o24p93J1417J0129L061K88J7001J7352J4793L7759M8862
$$ y = [17297, 7195, 5805, 18218, 22127, 32229, 37569, 35022, 32935, 36617, 26547, 17156, -1819, -11031, -23592, -32548, -19034, -7085, -3578, 3614, 16508, 22091, 21602, 29280, 27078, 28216, 19374, 14383, 8601, 13773, 15330, -1803, 8006, 27610, 21869, 9718, 9794, 10688, 12408, 5140, -3390, 224, -10403, -17104, -95, 7995, 19465, 14219, 12871, 4505, -3155, -3053, -1129, -9897, -6393, 6184, -71, 7717, 14509, -3437, 5647, -139, -7728, -5504, 6583, 6655, 11545, 8782, 5347, 6973, 17485, 28340, 27047, 17956, 16081, 13340, 4125, -1024, 2737, -5249, -9109, 5230, 17021, 20874, 21065, 11219, 6323, -2875, -2242, 15940, 24834, 30262, 30218, 27721, 23235, 26526, 22508, 22906, 17776, 15345, 23830, 32116, 31492, 30699, 42116, 52245, 55306, 55594, 72595, 89947, 104740, 142499, 191361]
13073A91361O5562P9843Q5698O6889M1310l3347o7094p9998p3589o3830n0690
13062A62115l5480j8786n162j0392l758M763k6j8066k0860k1111k550Q183N571
13049D4441j300k948M559n930j511m350n91o385N300M945r475K498j3340J2133
13035B8046P668j5377j3466O731J1993o096o931O29R496J664q363O020o146Q94
13021A6762L390j45J13l916m572N764P162j3588m675P737M483O551N750J4666
13007D5482m540j2320k248R88j7790m872Q271j237K6P365O888Q759k465j2484
12993A9823p133K634J69p096J0610L001L726r908p934Q510K3603n171m267j0993
12979A9574j7008K86J269q49j623m21K6205J8852q692l392l886K663k6003m799
$$ y = [191361, 256923, 336766, 422464, 489353, 530663, 497316, 430222, 350224, 276635, 212805, 162115, 126635, 107849, 102687, 92295, 88537, 93300, 93274, 75208, 54348, 33237, 30687, 38870, 44441, 43141, 40193, 44752, 38822, 37311, 32961, 32370, 25985, 31285, 36230, 26755, 29253, 15913, 28046, 35714, 20337, 6871, 13602, 25595, 19499, 12568, 13197, 22693, 24357, 15994, 22014, 15868, 16762, 20152, 20007, 20120, 16204, 11632, 17396, 24558, 10970, 6295, 14032, 18515, 25066, 30816, 45482, 40942, 28622, 26374, 27362, 9572, 4700, 12971, 11734, 11760, 19125, 26013, 34772, 32307, 19823, 12690, 15324, 15493, 8397, 19007, 22008, 25734, 15826, 7892, 16402, 40005, 34834, 30567, 19574, 2566, 2852, 4121, 3272, 1649, 1228, 27433, 46285, 37593, 34201, 30315, 32978, 6975, 2176]
12965B176Q605l242j2535N775p06M291l430j014O809J4508j0718L542J1629r19
12951B4771L262n863l826m250j1747j707p190L397K2980R654q17j5959j3385q094
12937h774K0367J2923Q460KO22k980k5665j3945j979J3315K145n351P136J4689
12923B0965K066j3606J551J0907J3102O6j7894n746L133j39J6965L744M459O732
12909D6305j3170j4625q58J0375L819K482R296n11j8013q950m799o771J3564J0256
12895B8400j294K1735K896n001k700q452K312M269l274p883R827J1878J274j373
12881E2614r748j2794p776K228o803M114K150Q512J2388Q670L702N08j4750M135
12867D7150O052m655k865n595k2980j517O806k890M120K563N273o236p809j1179
$$ y = [2176, 10781, 7539, -4996, 779, 73, 4364, 934, -80, 6729, 21237, 10519, 14061, 25690, 24771, 28033, 22170, 18344, 14094, 2347, 640, -6550, -3153, 19827, 29481, 28664, 12705, -680, -8774, 11593, 24516, 32976, 32978, 33600, 30620, 4955, -8990, -10969, 2346, 4491, -860, 6276, 20965, 23031, 9425, 10976, 21883, 34985, 35051, 17157, 11411, 14544, 14405, 31370, 35114, 39573, 46305, 33135, 18510, 17652, 28027, 31846, 34328, 43624, 43113, 25100, 16150, 11351, 4580, 18144, 28400, 27106, 48841, 51737, 46736, 44036, 35584, 37896, 42165, 38891, 31008, 40835, 52713, 53987, 52614, 42866, 30072, 22296, 24524, 17721, 21835, 23985, 32497, 44885, 53555, 57257, 57765, 43015, 47150, 53202, 48547, 45682, 40087, 17107, 15590, 22396, 19506, 23626, 26189, 31462, 25226, 17417, 6238]
12853F238p040m169j069k755L045P506n851j5052R71J6599K928m92r409k96J0440
12838A594N098O672m378J752l893o746o551j112m826j1282j6095j6117J1557J3573
12824c0754K8574L9519K2945J7374J5667j0164j6144M664k045q648j2141o378
12812D2469J2606n306k0044J3444o983q476O720J1489J4153j3132n007j0943n67
12799C0423n709K561N779m631j3605P669J1276j345Q013K638l635n347J3146J8332
12785F5565k580N676N688o303J3534N984j6226r750j542j5770K464J0712M709
12772F2161N768J6190N316K4285M132K727J0798R346q807j2524p287j5403q062
12759H8640J4539q708j7333J0564J1471R692L82m960j0739j4902m331P682Q909
$$ y = [6238, -802, -4971, -6040, -8795, -5750, 1756, -4095, -19147, -18176, -1577, 1351, 859, -8550, -8846, 1594, 6692, 13364, 8986, 10738, 6845, 99, -6452, -7564, -12390, -23672, -39767, -55884, -44327, -30754, -2180, 37339, 60284, 77658, 93325, 83161, 67017, 71681, 69636, 60988, 48847, 42469, 55075, 49769, 29725, 43169, 36186, 27710, 34430, 45919, 60072, 46940, 41933, 30990, 30423, 24714, 27275, 33054, 28423, 14818, 22487, 33763, 32418, 40431, 43069, 39434, 34087, 47233, 65565, 62985, 68661, 74349, 68046, 81580, 87564, 71338, 61588, 60046, 44276, 46740, 57452, 62161, 67929, 84119, 89435, 113720, 117852, 120579, 131377, 140723, 131916, 119392, 112105, 96702, 88640, 103179, 94471, 77138, 87702, 99173, 108865, 109247, 104287, 93548, 78646, 74315, 81997, 90906]
12746I0906k686O468O904K5271Q059j420n843J1504M501j1096J0712m626j2374
12733A26280r263r144m557J669K590p819J0725J2353J5519m591j662n17p588j2354
12719A11641j2432L393L382M021J7825K1718J5541J2717Q365M128j278j0422J548
12706A80147J4597R123Q072M244r5J68J3132K28m477J6911K2573Q818k774J1575
12692B82242J4359J9552N887L807m667p36J7301J5055K076K69J0469M682K455
12679C72751J0116N113O579N118K5877M3025L8450M7478L0397L6205N2101M4790
12667G18000L5164L9825O5253O2124Q5186R4471P8748J02637J08966J21366J48905
12656A660645J77300K03659K57786L15097L82718M59663N57074O71986Q48389
$$ y = [90906, 88220, 94688, 101592, 126863, 134922, 133502, 127659, 139163, 143664, 132568, 143280, 138654, 126280, 117017, 107873, 103316, 104985, 107575, 99756, 110481, 122834, 138353, 133762, 132100, 131583, 123995, 111641, 99209, 102602, 105984, 110005, 127830, 149548, 165089, 177806, 186171, 190299, 189021, 178599, 180147, 194744, 203867, 211939, 216183, 216088, 216256, 229388, 229616, 225139, 242050, 264623, 273441, 270667, 282242, 296601, 316153, 322040, 325847, 321180, 320444, 337745, 352800, 354876, 355145, 365614, 370296, 372751, 382867, 387980, 394559, 399677, 425554, 468579, 507029, 554507, 584904, 621109, 673210, 718000, 753164, 792989, 858242, 920366, 1005552, 1100023, 1178771, 1281408, 1390374, 1511740, 1660645, 1837945, 2041604, 2299390, 2614487, 2997205, 3456868, 4013942, 4685928, 5534317]
12647E534317J070418J365789J762405K393739L428618N227859Q325451J2757520
12639D1866116J6865540J7837766J4845273R137851J023359r397955j7912180
12632G4265770j9739503j5190216r417955n634443l589004k521814j968405j642798
12624A4561632j429055j242400j070537q82339p09189n89402m81380m13536l63018
12615G380776l12800k87726k47271k26167k24886k08748k06214k05882j88178
12606E272904k01085k20196k24313k29961k08345j85538j56349j43092j40189
12597C563836j34907j29823j35505j27774j24027j06007r2381q1596q2784q5349
12587B463683r4733r0309p7781o9093p3215p8416p2410p6447o3188n8853o3585
$$ y = [5534317, 6604735, 7970524, 9732929, 12126668, 15555286, 20783145, 29108596, 41866116, 58731656, 76569422, 91414695, 100552546, 101575905, 92177950, 74265770, 54526267, 39336051, 29918096, 24283653, 20694649, 18172835, 16204430, 14561632, 13132577, 11890177, 10819640, 9937301, 9228112, 8638710, 8157330, 7743794, 7380776, 7067976, 6780250, 6532979, 6306812, 6081926, 5873178, 5666964, 5461082, 5272904, 5071819, 4851623, 4627310, 4397349, 4189004, 4003466, 3847117, 3704025, 3563836, 3428929, 3299106, 3163601, 3035827, 2911800, 2805793, 2713412, 2631816, 2549032, 2463683, 2368950, 2278641, 2200860, 2131767, 2058552, 1980136, 1907726, 1831279, 1768091, 1709238, 1645653]
12576A645653m9025l0849j7263l6345m3350o6122n5324l1126k4624k0181l7736
12565A233708m4008l3513k8151m2733k8314l6101k7443l1671k8488l9443j8527
12554H75316P015j3811k6741k1389k5196j6285j5783k2560j2363j9060j8928j1553
12542F78662l0506k0421j4841l0457k6440j5288o214j0785k8366j7566j2359p743
12530D57676o610j090r64N086j70l993k318J1988M485m079J5312J9207j2478j0985
12516D71067j9719j3940j1499q877J2196J9189J5551K6197K601m1379m0974m6182
12504C64231n5418m6785l5708l1847j5093j9575j2695k2751J0039M084j3934l945
12492A20603n96k7822p079J5571m669m850p549l823p493K994O470q441J9265J1331
$$ y = [1645653, 1596628, 1565779, 1548516, 1512171, 1468821, 1402699, 1347375, 1316249, 1291625, 1271444, 1233708, 1189700, 1156187, 1128036, 1085303, 1056989, 1020888, 993445, 961774, 933286, 893843, 875316, 882331, 868520, 841779, 820390, 795194, 778909, 763126, 740566, 728203, 709143, 690215, 678662, 648156, 627735, 612894, 582437, 555997, 540709, 534495, 523710, 495344, 477778, 465419, 457676, 451066, 449976, 449012, 454098, 453928, 449935, 447617, 459605, 464090, 460011, 475323, 494530, 482052, 471067, 451348, 437408, 425909, 417032, 429228, 448417, 463968, 490165, 492766, 451387, 410413, 364231, 308813, 262028, 226320, 194473, 179380, 159805, 147110, 124359, 134398, 138482, 124548, 120603, 120007, 92185, 85106, 100677, 96008, 91158, 83609, 79786, 72293, 75287, 81757, 73316, 92581, 103912]
12478A03912m71J4773K4051K0002N783j5847k3904k7281r205J408p596o953j6683
12465F1989j787j0210m286r56N858J0125J2816K912j6468l0311j9884j0009J0330
12452A0119J839Q616K8740K5122P178J9893L5261N094l996j9025l1916j4570J5011
12439H7366M039p493j572j2651j4630J565K1831J418K159J8014M888K291n896
12426A01329m232l148p125k0564l261R526J76j1033l047l428n028o29j1241N91
12412C8886M535L22M214N954m670j0040K689j4318k3051j0972J0374P846J666
12399A3435J0812N084O57R722o518j8997q503Q402k85J2020J639M83M984q793
12385B4142k013j8774K39k029n32P555O557J026J0447R480l589q203P61J7047
$$ y = [103912, 103441, 118214, 142265, 162267, 168050, 152203, 128299, 101018, 91813, 93221, 85625, 78672, 61989, 60202, 49992, 45706, 44750, 50608, 60733, 73549, 76461, 59993, 29682, 9798, -211, 10119, 11958, 20574, 49314, 74436, 81614, 101507, 136768, 141862, 137866, 118841, 86925, 72355, 87366, 91405, 83912, 82340, 69689, 55059, 56624, 78455, 79873, 82032, 100046, 104934, 107225, 101329, 97097, 93949, 86824, 66260, 62999, 72525, 72701, 61668, 58621, 55193, 50165, 49536, 38295, 38886, 43421, 43743, 47957, 53911, 49241, 39201, 41890, 27572, 4521, -6451, 3923, 11769, 13435, 24247, 29331, 29988, 39710, 33192, 14195, 5692, 14094, 13809, 25829, 27468, 27951, 32935, 24142, 22129, 3355, 3594, 1565, 1033, 8588, 15145, 16171, 26618, 36098, 32509, 24306, 25067, 42114]
12371D2114N743k4800r005l941P73r500K28K6903K5183j2776q557p311j5865q884
12357C05j0094J9201n84o876j430R987j634Q30j2305N192J3353o172Q003j1128
12343F648n135j339N166M746p796m632j4078j327K2418M997l196r852j3557j0685
12329b7622k36J4243O249J201J3654L797p43k746J2286n396M227k028n812k756
12315H318O117q41m319k64j0418n886K836n464M925N572j16N122J9815J1459j2319
12300B4537q632m501j2751O674J0810l670j0658l372k131j1091K419M998j098
12287h466l820K057N155l696j613m698R307J0569r027l383p484M596N619J763
12273c121R757N056m679O013L179j87l988j0999J5094O507j0156j416J1892m332
$$ y = [42114, 47857, 23057, 14052, 10111, 10884, 1384, 1612, 28515, 53698, 40922, 32365, 25054, 9189, 305, -9789, 9412, 8828, 1952, 522, 10509, 8875, 9705, -2600, 2592, 15945, 9773, 17776, 6648, 1513, 174, 5340, 10086, 2290, -2342, -16420, -17747, 4671, 9668, 6472, -3380, -16937, -27622, -27858, -13615, -7366, -6165, 7489, 11286, 10543, 7797, 20083, 14687, 18914, 16886, 11074, 8318, 14435, 13594, 9275, 9011, -1407, -7293, -4457, -9921, -4996, 576, 460, 5582, 25397, 36856, 24537, 15905, 11404, -1347, 5327, 16137, 12467, 1809, -1563, -3694, -14785, -12366, -7368, -8466, -12286, -10229, -5074, -8770, -10383, -15081, -5774, 4795, -4232, -7615, -15099, -10503, -4884, -3121, 6636, 11692, 7013, 13026, 16205, 16018, 12030, 1031, 16125, 22632, 12476, 11060, 22952, 18620]
12259A8620m941j2793J5788L804l676J122J8352J2547j1608o920q980j1397k7585
12246a7667o485j369O42R118K0215J2659J0444p472l714m367l714J2670N484r740
12232A6704k672q54n200N743j1504j2269O278J1509L102k774R295n45k154J804
12218A6463M183j001q295j764P955L199n533P538J0188m58k270R26L58J5730J5431
12203F2650M057J8822L6048P4295Q3012R4911P7003N0958J2821m2991r2224q3094
12191B96268o0803n4981l2360j8006k8820j1122j7272p403k341k0844j3041p784
12179B1491K3756J9436J254M984Q5j8579j0875m529R854J965q579j1530j1866
12166A6867M396m06O472r157n931J170j7870n674R812J4006LP94J2850q153J787
$$ y = [18620, 13679, 886, 16674, 20478, 16802, 17924, 36276, 48823, 37215, 30295, 21315, 9918, -17667, -24152, -25521, -24879, -15761, 4454, 17113, 27557, 20085, 16371, 12004, 8290, 20960, 26444, 16704, 14032, 13178, 7978, 13721, 2217, -10052, -3774, 7735, 10837, 8063, 17358, 16813, 14659, 16463, 20646, 19645, 11350, 9586, 17541, 20740, 15207, 22745, 32933, 32475, 30205, 31131, 31489, 47219, 62650, 66707, 85529, 121577, 195872, 278884, 373795, 450798, 501756, 514577, 471586, 379362, 296268, 235465, 180484, 148124, 130118, 101298, 90176, 72904, 65501, 63160, 42316, 29275, 21491, 45247, 64683, 65937, 70921, 71006, 52427, 41552, 37023, 46877, 48842, 40263, 28733, 16867, 21263, 20857, 27329, 18172, 12241, 13411, -4459, -10133, -321, 13685, 13688, 14482, 27332, 19179, 20966]
12151B0966R104K154J312p198n946M844M356l041q525p736m457N898l948O600
12137A4383J8398q625j0462j3675K9266J3000j5052k4510j2291N552M144n83k018
12124b473M477K1461J067l779O537k952j3407j2202n270J3756J5980k79m907r936
12110H073R73J262m930o127l627K700K083J0178J1492M664J3020j254k0728j1831
12096E948P278J2973l630k1548j4928n75k407K361Q898J0697l002K91J610J2169
12082A6135l056m794P620N43R897m745j4054o446j2345N678R084O287j0025j0074
12068a0295J5848J6315j2290j3979n170r349j3073Q026J3979J5745J3411R468
12056B8636j5190n314j421j569n980R57J6036L300m774o920j5081o104K238O701
$$ y = [20966, 30070, 32224, 33536, 26338, 20392, 25236, 29592, 26551, 18026, 10290, 5833, 11731, 7783, 14383, 32781, 24156, 13694, 19, 29285, 42285, 27233, 2723, -9568, -4016, 128, -455, -2473, 2004, 23465, 24532, 20753, 27290, 24338, 10931, -1271, -6541, 7215, 23195, 22916, 18009, 8073, 9046, 10308, 5378, -749, -4376, -1676, 407, 10585, 22077, 26741, 39761, 38507, 17779, 5948, 13226, 26199, 22569, 1021, -13907, -14482, -16889, -14528, -5630, 5067, 2065, 2356, 3966, 16135, 13079, 8285, 15905, 16448, 26345, 21600, 7546, 1100, -11245, -5567, 3517, 9804, -221, -10295, 5553, 21868, 9578, -4401, -9571, -18920, -31993, -23967, -9988, 5757, 19168, 28636, 13446, 8132, 6711, 5142, -838, 119, 16155, 19455, 14681, 7761, -7320, -13424, -11186, -4485]
12042d485K2317m02j9980r901O489K231P362j5090n225m345J2637N320P925k152
12028B701j4096N462J5372K3350j3360p028j445r030l116J7622r345j7018n827
12015a5758J0107K0277J0529N297N624o46r58k4190k1857P978R935k272j1038
12002f972J371q544k475J2727J9387J5629j8026p58j2510k730L545J5943J1556
11989B8143j6806j4617l909n277J313J0997j481l103n711L938o08J2576r334n542
11975i421P081P597N537J4724K029r834r8l096N88k308j5829J821J390R171O428
11960A5780K824j4513j3418M523J6041J4262k203j2331q790p374q008N760J6242
11947H795L667j8184m219J0520j41n265j7503R854Q127j154o446l020k726M90
$$ y = [-4485, 17832, 17430, -2550, -12451, -5962, -3731, 3631, -11459, -16684, -21029, -8392, -3072, 4853, 2701, -11395, -5933, 9439, 32789, 19429, 12401, 10956, 1926, -1190, 16432, 7087, -9931, -15758, -5651, 14626, 25155, 30452, 36076, 35430, 34472, 10282, -11575, -3597, 6338, 4066, -6972, -5601, -14145, -16620, -3893, 15494, 31123, 13097, 12339, -171, -2901, 644, 16587, 28143, 11337, -3280, -7189, -12466, -11153, -156, -1637, -4740, -10451, -6513, -7121, 5455, -3879, -9421, -2340, 5257, 10794, 25518, 27547, 17713, 17615, 14519, 15107, 12799, -3030, -1209, 181, 9352, 15780, 18604, 4091, -9327, -4804, 11237, 25499, 23296, 10965, 2175, -5199, -13207, -7447, 8795, 12462, -5722, -9941, 579, 438, -4827, -22330, -12476, -4349, -5503, -11949, -14969, -17695, -17205]
11933a7205J5578R02j2708m832J2508K407n261k449Q91K885l406J2265k239J0254
11919I590P668K093Q284j539j0528j1412Q646p820j4341J0553m03k784j339o007
11905i339L426j4261n079O597O697K260J7455q335r983P77N047Q566o132j0533
11891a2837J1672O741p658m735J2218p266n954j2406J425J7790M147o461J955
11878a369k409O07j749j4541L035J0732j0444J3863j900q898j69J267r495r325
11864c0795P971P673n215O669Q732n157O712m398j8667m196N236n9k603O391K3951
11849B245J7036L372n972k0319j3321P049L159o765M743J078o097J2298J4009
11836A2515q727P611r70K175j468q532m011j7393l190J1615R090n256L158j0983
$$ y = [-17205, -1627, -725, -13433, -18265, -5757, -3350, -8611, -11060, -10169, -7284, -10690, 1575, -664, 9590, 17258, 19351, 27635, 26096, 15568, 4156, 12802, 4982, -9359, 1194, 791, -1993, -3332, -9339, -5913, -20174, -25253, -18656, -11959, -9699, 7756, -579, -10562, -9785, -4738, 3828, -2304, -12837, -1165, 5576, -2082, -6817, 5401, -1865, -7819, -20225, -18800, -1010, 3137, -3324, -1369, -3778, -3171, -4920, -19461, -16426, -5694, -16138, -2275, -4175, -13073, -13242, -11975, -21470, -30795, -22824, -15151, -20366, -13697, -4965, -10122, -3410, -7808, -26475, -30671, -25435, -25494, -28097, -21706, 2245, 19281, 22653, 16681, -3638, -16959, -9910, -6751, -13516, -8773, -7695, -13792, -1494, 12515, 3788, 11399, 10429, 12604, 11136, 2604, -1407, -18800, -21990, -10375, -1285, -6541, -3383, -14366]
11822a4366j6723J326J8016J8m198J0636l381k388p973O684p223k4846J1406K7456
11808e556J5735J315j2092j141l433j1311N598J4332j2180o56P072L235P419N726
11794A4063j1338N623M443p099m738P48q107J05L819j751O599j6061l561J8269
11780A014l91n164K008p371j0908J5552l33J073r21j692J50P908J1164k984j6875
11765g770R894P270j4574q039L276J4779J450l075M409k3364k398J0672N40M955
11751a975j6981j2617O274J3656L064K911o280q979j743L889l974O002K866j2670
11737b6557k853J3252o348J6895J4524q038j583o225L071J227n764J4450M67P779
11723A4297O56j1065m944j2128m140n687N205J906L373K955Q845Q850J559k903
$$ y = [-14366, -31089, -29763, -11747, -11729, -15927, -5291, -8672, -11060, -19033, -12349, -19572, -44418, -33012, -5556, 10179, 11494, -598, -1739, -5172, -16483, -10885, 3447, -8733, -9389, -2317, 918, 8337, 14063, 2725, 8348, 12791, 5692, 954, 1702, -6405, -6300, -2481, -4232, 2367, -13694, -17255, 1014, 623, -4541, -2533, -9904, -20812, -5260, -5593, -4520, -5441, -7133, -6983, 925, 12089, 9105, -7770, 2124, 9394, -5180, -13219, -9943, 4836, 6286, 3211, 7620, -15744, -18142, -7470, -6930, -1975, -18956, -31573, -25299, -11643, -8579, -5668, -11948, -20927, -22670, -18781, -22755, -16753, -13887, -26557, -29410, -16158, -22506, -5611, 8913, 875, -708, -6933, -3862, -2635, -8399, 6051, 6518, 14297, 14953, 3888, -1056, -13184, -17324, -23011, -17806, -15900, -12527, -9572, -727, 8123, 9682, 6779]
11709F779L81j2956K279R045p235n281O631n661l317O669p120o24J0044m756J9315
11694A4193J3225j0654k0376q869P297M647J2983J054P43m977K165P503n537j9855
11680f458P265N425K916N121k385j2891j0880j069L388M674R234k769P610k87
11666H894M091M771l513m541L252P920n713q796m246o550j2195J6273J0464j0608
11652d97j0275K934J6638l77J631K657l009m465P576N281j1285l820j0607k306
11638i924m321k3134K2175K4448J958j2753q023o069R05m736j1361j0383J773
11625c9445J8983J3845o10k227m706K347m03M53K89m064j335J191N897n160M929
11610a0016o145p368J3793P975m007O194K005n032q453L17K190r291K080J2791
$$ y = [6779, 7160, -5796, -3517, 5528, -1707, -6988, -357, -6018, -9335, -2666, -9786, -10410, -366, -5122, 14193, 27418, 16764, -3612, -12481, -5184, -537, 12446, 13500, 14243, 9266, 11431, 18934, 13397, -6458, 807, 6232, 9148, 14269, 11884, -1007, -11887, -12956, -9568, -4894, 4340, 1571, 9181, 8894, 12985, 17756, 14243, 9702, 12954, 20874, 15161, 6365, 2119, -4431, -16626, -353, 10111, -497, -10772, -7838, 8800, 8423, 10054, 12711, 9702, 5237, 12813, 18094, 6809, 2989, -7618, -9924, -14245, -37379, -15204, 9244, 11202, -1551, -9574, -15643, -14738, -19474, -30835, -41218, -39445, -20462, -6617, -7227, -9454, -14160, -11813, -12216, -11763, -11474, -15538, -16873, -15682, -9785, -14945, -10016, -16161, -23529, -9736, -1761, -5768, 426, 2431, -2601, -11054, -10737, -8547, -17838, -15758, -2967]
11596b967J3524J992k822j4156k1425K128l948K7632P940j5897o369n323Q469
11583a1222J0783J7150R997j973j029J6216j0079k2834k284M206R561j5356j3418
11570a0282R622K706k2814q28R729J0147P382L507q035l025J0446o065k214l070
11556b794n63k256j0270N421Q977p409j4298k874J1091J5411K3363j843j7624
11543D332q77o962R203J0362r171p039l42J1321o417q45R667J940o68n559j168
11528G777P98M125m590j1229k337Q754Q118o268k626q055j0575o952O341J7318
11514E99m064m342r124J979J1703k984j1787l315O5P018L164l751P561L356M0
11499c882k543q072k198p024o430k388o082P277K2052J2622l772J1030P680K357
$$ y = [-2967, 10557, 12549, 9727, -4429, -25854, -23726, -27674, -42, 7898, -7999, -14368, -19691, -11222, -439, 16711, 26708, 24735, 23706, 39922, 29843, 7009, 4725, 8931, 18492, 3136, -10282, -660, 2046, -20768, -21596, -11867, -1720, 5662, 9169, 1134, -1891, 8555, 2490, 276, -2794, -3357, -5613, -15883, -10462, -1485, -8894, -23192, -26066, -14975, 436, 23799, 21956, 4332, 3455, -3507, 5696, 16058, 6887, -152, -494, 10827, 4410, 3565, 13232, 15172, 14504, 8945, 7777, 8575, 12700, 8110, -3119, -5456, 3298, 11416, 5148, 2522, -5533, -16108, -23060, -16719, 599, -3465, -7807, -16931, -14952, -3249, -6233, -18020, -21335, -21270, -14252, -11088, -14839, -7278, -3922, -3882, -6425, -14497, -16695, -23719, -30149, -32537, -38619, -31342, -9290, 3332, -440, 10590, 18270, 20627]
11485B0627k916k0923r889O209J3385j725r485l812l333j975P302k232o553J2755
11471b565J4073n693l704j2736j1491n718q523P099J1272J3401J482k019p461
11458a2583Q52N332Q53j0017j702K190J155P460J2405J1738k473p080M679l4m737
11443H038m001J5192k07j61q198p359r364k5838n263k70M400M181p747m685P527
11428c3755J1273Q502O285J0015N865P66P482K591o815n986J995j2609j6841P021
11414a4211J4478M729Q82j2988l2929q117J2558J0407J187j5809J9896R807P5
11401a0035j0856j3014K1121J1803j1529o63R394L068J835n990l665N488j163
11388d206j5045n230m225J7696J0011M00j128j396j059J3767j115J095k218j4381
$$ y = [20627, 17711, -3212, -13101, -6892, 6493, 4768, -4717, -8529, -11862, -13837, -6535, -8767, -15320, -2565, 11508, 5815, 2111, -10625, -22116, -27834, -36357, -29258, -17986, -4585, -3103, -5122, -12583, -11731, -6399, -5546, -15563, -17265, -15075, -13920, -6460, 5945, 17683, 15210, 8130, 12809, 12775, 8038, 4037, 19229, 19022, 18861, 10663, 3304, -6060, -31898, -37161, -37431, -33031, -28850, -36597, -41282, -33755, -22482, -13980, -7695, 2320, 8185, 8951, 16433, 19024, 12209, 6223, 8218, -4391, -21232, -14211, 267, 4996, 5878, -7110, -40039, -48156, -35598, -25191, -24004, -39813, -19917, -10110, -10035, -20891, -33905, -12784, -981, -12510, -13173, -3779, -711, 1124, -4866, -8531, -3043, -4206, -19251, -24481, -28706, -11010, -999, -599, -1727, -3123, -4182, 9585, 8470, 9565, 7347, -7034]
11374g034j2660m906J4039J949P514j697N586J2151j5069J841n869o749k257L56
11360a2805P341N144p933k9100o735J7406K1353K2354r189j4117M857j901J685
11347a640J971l195j2465o301q139M572p4N822j170o82J2607J755M566M666q802
11332f509p652j418O650j0567J0080P03O56l8J1482l310K629l02N438j325j2794
11317f277j7805j451Q132J2218J711l103M088q138P656J5837J2218J54L278j4540
11303A3978K066o686j3690N393l097k501n91m97L436P184J3049j81j3818o501
11289b456M633J492k55j8682K429J6366J2201O734q174J585m060m101k218J328
11275F822K239k729j3859j3994N638K6058R897j5241n101K875N209Q98J34l365
$$ y = [-7034, -19694, -24600, -10561, -8612, -1098, -2795, 2791, 14942, -127, 1714, -4155, -10904, -13161, -12805, -5464, -320, -8253, -37353, -44088, -26682, -5329, 17025, 7836, -6281, -1424, -3325, -1640, 331, -2864, -15329, -21630, -29769, -25197, -25271, -19449, -20619, -21301, -8694, -6939, -2373, 2293, -6509, -14161, -15579, -8929, -19496, -9416, -8713, -8057, -8095, 3387, 77, 2706, 2404, 7842, 6517, -6277, -24082, -25533, -17401, -5183, -3472, -6575, -2487, -10625, -2969, 12868, 25086, 25240, 28518, 13978, 16044, 9358, -4332, 1061, -2036, -4537, -5128, -5625, -2189, 4995, 18044, 17863, 4045, -2456, 2177, 3669, 3414, -15268, -12839, 3527, 15728, 22462, 14288, 15873, 11813, 7712, 5494, 6822, 9061, 6332, -7527, -21521, -15883, 10175, 20072, 4831, -270, 2605, 7814, 8712, 8846, 5481]
11261E481M805r954j8014K89J9925J6788l619j2270j9513k616m141J2121N645
11248e073K176M441P229P637M0j2060L377L411p907l344o481j1254l16M480J1752
11233a892O613M854p656r269n60P741N841o66M994J1210R955K041n117o313J2153
11218C3929N271l076J0790k115k1257j2039j7364j4494M530L130q062j9230P291
11205c2696p74J3323N859j962J4465J2035N079j0701k0646l450P573l042K873
11192a2064J0325P719K094l616n785j5211L575J614R310L995j5061j9578j3127
11179d5810K5045L071n084L512J2499K656q32J3712M984m705k87j9365J874J1710
11165B980O838j1375L618j1868r677j0974n19m8J7536K301O522j348o22j8306
$$ y = [5481, 10286, 332, -17682, -17393, 2532, 19320, 15701, 3431, -16082, -18698, -22839, -10718, -5073, -2897, 1544, 8773, 16410, 16450, 4390, 7767, 11178, 3271, -73, -6554, -17808, -18124, -13644, -1892, 4721, 9575, 1919, -7350, -7910, -169, 5672, 5006, 10000, 21210, 31165, 33206, 28089, 21776, 33929, 39200, 36124, 46914, 44799, 23542, 11503, -5861, -20355, -15825, -12695, -20757, -39987, -32696, -33470, -20147, -14288, -16250, -1785, 10250, 15329, 4628, -16018, -19468, -11895, -14937, -12064, -1739, 5980, 8074, 4458, -1327, -16538, -12963, -11349, -2039, 1956, -13105, -32683, -45810, -20765, -17694, -22778, -19266, -6767, -4111, -4943, 8769, 13753, 9048, 8761, -10604, -8730, 2980, 9818, -1557, 2061, -9807, -19484, -30458, -30977, -31025, -13489, -11188, -4666, -6014, -6636, -24942]
11151b4942j638R828P367J043k0602l753J4274K0974K1061J520J018k269j2950
11138A0931J943K103j8320k7444J923J7586J2813K076k568r364M002L075k773
11125d017j1142Q110P875J2029q683j3978r466O073m054n381J0769N563o941n301
11111a8544J2345J2415k637r237j3709J1692K934J098R601K329N251k801j4K455
11097A3178n454J1553j048O208j8959r741Q381N424q037o096J2983N03m274R003
11083A3624K923J247L51k0160M140P429j332j4908r642P489m75L90m246j906l573
11068a8649q986R981J5190j584j530o160k1821p148J8164J7134P538k76j0015
11055h162M039l088j068R649o680r223K208n509J2396j0302j9373M412J3789P664
$$ y = [-24942, -26580, -16752, -9385, -8342, -28944, -32697, -18423, 2551, 23612, 25132, 26150, 23881, 10931, 12874, 14977, -3343, -30787, -28864, -11278, 1535, 3611, 1043, -8321, -4319, -1244, -4017, -15159, -7049, 826, 12855, 4172, -9806, -19272, -13199, -17253, -22634, -11865, -6302, -13243, -18544, -6199, 6216, 3579, -5658, -19367, -7675, -4741, -3643, 5958, 8287, 13538, 10737, 10723, 13178, 7724, 19277, 18229, 24437, 5478, -4263, 4118, 9542, 1505, -4591, 8392, 8895, 4621, 13624, 16547, 17794, 18145, -2015, 2125, 9554, 8222, -6686, -16328, -8839, -9314, -8924, -13170, -15076, -18649, -27635, -17654, -2464, -4048, -5578, -11738, -33559, -40707, -22543, -5409, 2129, 1853, -8162, -4123, -7211, -8279, 1370, -5310, -14533, -12325, -17834, -5438, -15740, -35113, -30701, -16912, -9248]
11041i248r11J0158J367r951j2043J073M156O938L481L482K96M098r240j9339
11027b5683J3182R643l444J0028m511m983j660q672l566J4916J7119o501O902
11014A2770M5p896L228J139q407j1673k193O364J818J1035J0450j3926k0020R910
11000g356J2213O172J6995P611k894j1704j0712n611q327j6518m872k075J1018
10987a6060J3976P301k48k011M464l91m09j5452k5076n178J7155K2301n009k913
10973g550J160l563L019J2474N954n772N931q707j0799K166N543J5714j0408p349
10959b187R622q4J543n176m084n343r23M542K168j5320J0739J1770j2076k768
10945g577k065m0m090j0903J3030N571n310M211j840p829r293N075J1934k0M541
$$ y = [-9248, -10159, -1, 1366, -8585, -20628, -19555, -15399, -8461, -4980, -1498, -1202, 2896, -6344, -25683, -12501, -2858, -6302, 3726, -785, -5768, -7428, -16100, -19666, -4750, 12369, 5868, 12770, 12815, 4919, 8147, 9286, 879, -10794, -12987, -6623, -4805, 6230, 16680, 2754, -17266, -7356, 4857, 11029, 28024, 35635, 32741, 21037, 10325, 4714, -3613, -20131, -25003, -27078, -16060, -2084, 5217, 4969, 2958, 7422, 7031, 6622, -8830, -33906, -39084, -21929, 372, -4637, -7550, -6390, -9953, -6934, 5540, 11494, 5722, 11653, 2946, -7853, -5687, -144, 15570, 5162, -2187, 7435, 7351, 8894, 3718, -366, -5709, -6632, -2090, 78, -15242, -4503, 7267, -4809, -7577, -9642, -9682, -13772, -24675, -11645, -6074, -11384, -7173, -9013, -16842, -26135, -21060, -9126, -9146, -4605]
10930d605J9675O156p732m910j2545o18M861p896l617j334J063M297M146J103
10916a956R640J2233j2455j1107j4468J2018J9315R027q39o216j0232L498N710
10903A4168j7302m564J8897N090j5908m268j8918m176P763p417n578J1113j492
10890b2592m560J1226J5882j889K643J6553j1037l456P502J0537l829K783n825
10877A3938p948J406R652j5325j2878m590q620J0766P188J351m983j0469l626
10864b4138J0073q981M483J3911K742K851k707p444q444J6511Q97j9045j2814
10851c2105K850J0988O988o153J0816O581r140J1811M902K432j148J384M511j4384
10837C33R205j049j4733o258l762l614l15K5093J1564n826j0220J1144J0525m783
$$ y = [-4605, 15070, 21226, 13494, 8584, -3961, -4579, 282, -7614, -11231, -12565, -11502, -7205, -3059, -1956, 7684, 19917, 7462, -3645, -18113, -6095, 13220, 22247, 21408, 15192, 4960, 8458, 14168, -3134, -7698, 11199, 16289, 381, -3887, -22805, -26981, -19218, -26635, -32213, -21100, -22592, -27152, -15926, -44, -1933, 710, 17263, 6226, 2770, 10272, 20809, 16980, 19763, 13938, 5990, 7396, 17048, 1723, -11155, -15745, -24365, -13599, -6411, -5060, -10043, -20512, -24138, -14065, -23046, -18563, -4652, -1910, 941, -1766, -9210, -17654, -1143, -246, -19291, -32105, -29255, -18267, -11279, -17432, -6616, -35, -9175, 2636, 7538, 9970, 8822, 10206, 14717, 333, 9538, 8489, -6244, -12502, -16264, -19878, -20193, 4900, 16464, 10638, 418, 11562, 22087, 17304]
10823A7304j8621p928j5478L067J3206K007j1647N712J0821j0095L914J3860J2249
10810A8371O485j0830K708O205n655j3113k2006j228j24m877J0579L258J8389
10797H162N735K404o600j0302O65R025J4033k410j1032j1784m047N096Q464n292
10783B117L269j895j611r005l864J1075J6417o519j88J1015o823r201j432n938
10769b583j5750k298P405M12N558J0883m905k01L721m719k486m709J2938n15k623
10754A28o74j4266K085J0742K545J1220j0845j879k26q610K057l170k839n625
10740a9357M723J797J1945o907N331J2056n969L632j1957j0728O87k424J7638
10727D67O090j510n97l930j1007l189P882P006R55j815J0988J10j5354j5705j3787
$$ y = [17304, -1317, -9245, -24723, -21656, -8450, -6443, -18090, -12378, -1557, -11652, -7738, 6122, 18371, 24856, 14026, 16734, 22939, 17284, 4171, -17835, -19063, -19187, -24064, -13485, -10227, 8162, 13897, 16301, 9701, -601, 64, 9089, 23122, 20712, 9680, -2104, -6151, -1055, 7409, 2117, 5386, 3491, 1880, -7125, -10989, 86, 16503, 9984, 9796, 20811, 13988, 4787, 3355, -2583, -18333, -20631, -13226, -12814, -7256, 3627, -1278, -1479, 2242, -2477, -4963, -9672, 3266, 2751, 128, -546, -14812, -12727, -1985, 560, 11780, 935, -944, -1170, -9780, -7723, -10893, -13732, -19357, -14634, -12837, -892, -7799, -2468, 9588, 3619, 7251, -4706, -15434, -14747, -17171, 467, 6557, 5047, 4450, 520, -10487, -13676, -5794, 1212, 2167, 352, 11340, 11450, -3904, -19609, -33396]
10712c3396J688P214J1038m220j34O761P858j0660J017M719j67j0423p800R181
10698a7324L171O727j342P386j0392j0765N234J3478K427L71j2132Q19K681J6917
10684G256N68j7688j812O09Q330Q198J632m127Q354M311j633l951p950k0152R434
10669h621K873L342P003P345L981j2304j1071j0514L257P850j3684p755O181L55
10655b1762k759J49N194N484M775k214K28J25j5678m024K1710O046k139J365J0406
10640F906N194k501K500m643q181n008K065p088l731o680J089P368J0189n473
10626g994P500J3769J0818j0064j3893j9869N329J2563J663O776o858j46N147
10613D741M877J067j3847l824J965j0984m915J0194K7379R18r161j7112Q76m071
$$ y = [-33396, -31708, -24494, -13456, -17676, -17810, -11049, -3191, -13851, -12834, -8115, -8282, -18705, -26505, -17324, -14153, -7426, -8768, -1382, -11774, -22539, -17305, -3827, -1400, -1029, -13161, -12342, -9661, 7256, 7824, -9864, -11676, -11067, -2737, 5461, 7093, 2966, 11320, 15631, 13998, 10047, 2097, -18055, -8621, -5748, -2406, 4597, 11942, 15923, 3619, -7452, -17966, -14709, -6859, -20543, -28298, -22117, -21762, -24521, -24372, -19178, -13694, -8919, -11133, -10905, -10780, -26458, -30482, -8772, -2726, -4865, -3500, 6906, 12100, 9599, 12099, 7456, -725, -5733, -3668, -10756, -14487, -21167, -20078, -12710, -2521, -7994, -494, 13275, 24093, 14029, 136, -19733, -14404, -1841, -178, 6598, -260, -406, 4741, 9618, 10685, -3162, -6986, -5021, -16005, -20920, -10726, 16653, 17571, 8410, -8702, -7826, -11897]
10599a1897K686N752J969J1219L928O208J366q901j0009O755K458P708L12m54
10585A9100n250j6368J412k214J497J297l569k920m963p685Q555J3951k320k783
10571b260j1156r75K170J7056P678L160q967o402j2656O90L389o606K828o24N912
10556f763j7596k612O878J236n74N539P015N309n195R02R348k547N29J1359n148
10541G680P967K321k576j3838j5866L475K3931K0125m446j9586q585Q005j2803
10528d196n114K100L744J0239P298J3802j896k110J2206L67O735L492J8573K8075
10514I3315K5123M265Q150J109o989m123J2700k909j3900j0474k1657k9236q500
10501D6874j8051j5750J889M314p428K082K355J581j1376j1295j452j240n143
$$ y = [-11897, -9211, -3459, -1490, 9729, 13657, 19865, 21231, 12330, 2321, 9076, 11534, 19242, 19554, 19100, 13850, -2518, -1106, -3320, -1823, -526, -4095, -7015, -11978, -19663, -11108, 2843, 523, -2260, -13416, -14391, -12221, 4835, 12513, 15673, 6706, 304, -12352, -11662, -8273, -14879, -12051, -12675, -6763, -24359, -26971, -20093, -18857, -19431, -13892, -6877, -1568, -6763, -5861, 3487, 940, 1469, 12828, 7680, 15647, 17968, 15392, 1554, -14312, -10837, 13094, 33219, 28773, 9187, 602, 8607, -4196, -9310, -7210, -3466, 6773, 14071, 27873, 25977, 23867, 36073, 36440, 43175, 46667, 65240, 93315, 118438, 122703, 130853, 131962, 124973, 120850, 133550, 130641, 116741, 106267, 84610, 55374, 46874, 28823, 13073, 14962, 19276, 11848, 13930, 16285, 17866, 6490, -4805, -6257, -7497, -12640]
10488a2640o244N53K1502O785M305p876j1979p85M784K671P927L778j6191l58
10474c768J4758P280q871p576o602N487j5958k261J3262J5315K124j8866o173
10461a1849K314N497j336o818J3883O269N089k966k775j8739m657J3491K8620
10448B6023m514j8414j3841j545n098N171k852J3375J2581J328j0605M488R253
10435A5350j1240j146N968J843O862J1456k756j6522J060l054j3318J8348j385
10422A1466q48k276k633J154n691q582j126o579j0606J5611K0309j8955j7312
10409b6068L923k334J6176Q991O359j5211P923Q227q854q707k638J9116R810L232
10395A9945r766j2213r604O31J4022L41k730K726P464n070J663J8887L810k632
$$ y = [-12640, -18884, -18331, 3171, 9956, 14261, 6385, -5594, -6379, -1595, 1076, 9003, 12781, -3410, -3768, 10990, 18270, 9399, 1823, -4779, 708, -15250, -17511, -4249, 11066, 13190, -5676, -11849, -9535, -4038, -5374, -12192, 1691, 7960, 13049, 10083, 7308, -11431, -16088, -2597, 26023, 21509, 3095, -10746, -12291, -17389, -12218, -15070, -1695, 10886, 12214, 1609, 6097, 15350, 4110, 2964, 8932, 10775, 17637, 29093, 26337, 9815, 10875, 7821, -5497, 12851, 11466, 10618, 8342, 5709, 6863, 1172, -7410, -8536, -15115, -25721, -10110, 10199, -8756, -26068, -22145, -24479, -8303, 688, 7047, -8164, -241, 7986, -868, -9575, -12213, 6903, 16713, 19945, 10179, -2034, -11638, -11007, 3015, 3356, 626, 3352, 10816, 5746, 7409, 26296, 30106, 27474]
10381B7474k8962j4190L308k166N089j1545j6409M395Q166p239J0393L0180m673
10368C821n355k079O282n980r187n134J6611J6964m005l837o064p205r414j2637
10354b7219J2280J5011p877p981J1761J4977m391j2274m844L753Q510m49J0126
10341A1383n80j9368J438J3348n73J0018J5173j621O82o449o742j3164O750q59
10327I436M517j3743m99n844O515J943O036J2180j0861k5155r809J3795k294J1271
10313b512K943N513l30o70n389n393j1035o144M874N430M310j5628r324O850m48
10298b6953m209N057O276Q505Q841O164O09n508J3422L345r043o733o28j0244
10284a1099P77J2266J418j4546L428J7495p782m787M85o0j6376Q235R721j528
$$ y = [27474, -1488, -15678, -12370, -14536, -9447, -20992, -37401, -33006, -24840, -32079, -21686, 8494, 3821, -1534, -3613, 2669, -3311, -12498, -17632, -1021, 15943, 11938, 8101, 2037, -5168, -14582, -27219, -14939, 72, -7805, -15786, -4025, 10952, 6561, -5713, -10557, -6804, 1706, 1257, 11383, 10803, -8565, -7127, 6221, 5648, 15666, 30839, 29218, 29900, 23451, 16709, 3545, 10295, 9436, 13953, 210, -289, -6133, 382, 2325, 8361, 20541, 9680, -15475, -25284, -11489, -13783, -2512, 431, 5944, 5614, 4944, -445, -5838, -16873, -23017, -18143, -12713, -8403, -24031, -33355, -26505, -26953, -31162, -26105, -19829, -11324, -2483, 3681, 4290, -1218, 12204, 15549, 6506, -227, -855, -11099, -10322, 1944, 3362, -11184, -7756, 9739, 1957, -2830, -2345, -2405, -18781, -10546, -825, -2353]
10270b353J457k134M693L20k3401j4791n349Q723K2401J2330R48n528M790J243
10256C349n029j4312j1663n607K1118R838J690K530M050j681j1483o211M995L860
10242d556j7592q464m067j0346P55Q666J4303K247j0130J0790J2553q866N31J5453
10228A277K510r699k1937K247J1408O413K806M990k581j4370J686j2378l992j2190
10214d3810M347L997K1741J8185P160j121j3434L190K445o398l737M574j2n789
10200h662M566m226j8165j6587J5231J6111N981J4325L597J725O279k1217o109
10187g151n152J608K808o414j122r654q163J9547K5136j944j3154n885l332M010
10173h862k567O773o656J0461R854m476N836o23j6586j2518N125J0033N744J2617
$$ y = [-2353, -896, -3030, 1663, 1983, -21418, -36209, -41558, -32835, -10434, 1896, 2844, -2684, 2106, 3349, -1680, -15992, -27655, -33262, -12144, -2306, -616, 1914, 5964, 4283, -7200, -13411, -8416, -4556, -22148, -30612, -34679, -45025, -44270, -35604, -21301, -19054, -29184, -18394, -5841, -14707, -14176, 1277, 3787, -5912, -27849, -25602, -14194, -7781, -4975, 15, -2566, -16936, -15250, -27628, -31620, -43810, -39463, -35466, -13725, 4460, 11620, 10499, -2935, 255, 2700, -3698, -7435, -2861, -2873, -8662, -4096, -8322, -26487, -43074, -27843, -11732, -5751, 8574, 12171, 13896, 20175, -1042, -7151, -12303, -10695, -7887, -14301, -15423, -25077, -33240, -13693, 11443, 9499, -3655, -9540, -12872, -8862, -11429, -4656, -11312, -851, 9003, 4527, 10363, 9740, -6846, -19364, -14239, -4206, 1538, 14155]
10159A4155m582M810J500j3481m401l658m63P906l759k643j726p712J6060J3397
10145A5403L387o543n641j7010m892J6231K4416q633n481l580p878j1713J2560
10132F26J1418Q575k0840j1970J7041J9126P83r497j005M375k389K0238J5365
10119E1846O0k2168k3846K347J6766l833j3011p417j4074j6588J1050J4203O601
10106A936J9698J031J609l432j4075o013j4218J811O909O118P52m20Q262N204
10092A5172O257j798r249l494j8212q045o270R645P127J1040m82n640O078P742
10078I871R968M402Q518O500n18J5947Q766J0573J5258J7050K2559K1823M4215
10065A94932O1158J30500K49322L70711L87361K25351J42625N7382k71931n50484
$$ y = [14155, 9573, 14383, 15883, 2402, -1999, -5657, -6120, 1786, -1973, -4616, -6342, -14054, 2006, 15403, 18790, 12247, 6606, -10404, -15296, 935, 25351, 16718, 11237, 7657, -221, -11934, 626, 12044, 20619, -221, -12191, 4850, 23976, 24759, 15262, 14257, 18632, 16243, 36481, 51846, 51906, 29738, 5892, 8239, 25005, 21172, 8161, 744, -13330, -29918, -18868, -4665, 1936, 21634, 22665, 24274, 20842, 6767, 754, -13464, -11653, -4744, 1374, 2126, 1706, 9968, 15172, 21429, 19631, 10382, 6888, -11324, -19369, -25639, -15994, -8867, 2173, 1691, -3949, 2129, 9871, 19839, 24241, 32759, 39259, 38741, 54688, 63454, 74027, 89285, 106335, 128894, 150717, 194932, 256090, 386590, 635912, 1006623, 1393984, 1619335, 1761960, 1819342, 1547411, 996927]
10055I96927l73302j85722r6220o6935k5443k2734k4398k9026k1944o969l265
10044A40969l197Q53j560r400j0064j1395J660j2884j6139j3144l671O045M300
10031G2373q675j0492K671j0474L959O890j3643j4536J0525K811k897j1695M915
10018C1732R928j2600o403P621l990m532J5979O291j931M600j91N747K835j2306
10004D2780l816L303j1486k006p987j8237N743n756J6204Q727j6576p417k3057
9991a9581j4028P909J0571K848O053J2579p173r72K2798J0036o675j9372n449
9978d56N127J2365J4581M55O569q159o937M029q787k232j5781j3252P001J5812
9964A0335q702j2578Q778K0862N08P725q156q131J009J478n339L382m09k6182
$$ y = [996927, 623625, 437903, 341683, 274748, 249305, 226571, 202173, 173147, 151203, 144234, 140969, 137772, 138625, 137065, 127665, 117601, 106206, 107866, 94982, 78843, 65699, 62028, 68073, 72373, 63698, 53206, 55877, 45403, 49362, 56252, 42609, 28073, 38598, 41409, 38512, 26817, 31732, 41660, 29060, 22657, 30278, 26288, 21756, 37735, 44026, 42095, 46695, 46504, 52251, 55086, 42780, 38964, 42267, 30781, 28775, 20788, 2551, 8294, 2538, 18742, 27469, 10893, 3476, -19581, -33609, -25700, -15129, -12281, -6228, 6351, -822, -1794, 21004, 31040, 24365, 4993, -456, 4671, 17036, 31617, 32072, 38641, 30482, 23545, 27574, 18787, 16555, 774, -12478, -5477, 10335, 1633, -10945, -2167, 18695, 19203, 26928, 18772, 10641, 11650, 13128, 7789, 11171, 10762, -15420]
9950a5420L54J3665k474M654K383N742J0712j0473M241P121p515K236J971l901
9936A3296o294j209l717N441N560q091J2566m708j603o207r085j3944q624K1582
9922e037K102j078J2855j0032k1920k787J6744J1686O420k011k014J5025j3130
9909F823o83J3741l092j985r971o219n876m249O603Q453l446o519j0979R308P996
9894i5L271j4234j0575Q312J2895L950k3P185J230M556L052r082j1292l159R01
9879c108R719L042j461p997j903n748J4687R601r90L553O674K733j6290j9417
9865f905K812J7113l329L010J381o253j2947n296K555K500j1332J3380J1376j182
9851F883n142N982J617j5170n137J0857P226P156p128r097J7915K1554O237j5356
$$ y = [-15420, -15066, -1401, -3875, 779, 3162, 8904, 19616, 9143, 13384, 20505, 12990, 15226, 17197, 13296, 7002, 5793, 2076, 7517, 13077, 4986, 17552, 12844, 11241, 5034, -4051, -17995, -26619, -5037, -2935, -4013, 8842, -1190, -23110, -25897, -9153, 2533, 8953, 6942, 4928, 19953, 6823, 6140, 19881, 16789, 14804, 4833, -1386, -7262, -11511, -4908, 3545, 99, -6420, -17399, -8091, -95, 3176, -11058, -21633, -13321, -426, 3524, 3501, 10686, 11916, 16472, 19524, 10442, -850, -4009, -3108, 6611, 9653, 8192, 195, -1708, -7456, 7231, 16832, 15842, 19395, 26069, 28802, 12512, -6905, -4093, 13020, 9691, 12701, 14082, 7829, -5118, -10414, -7859, -5359, -16691, -3311, 8065, 6883, 1741, 7723, 9340, -5830, -10967, -110, 7116, 14272, 7144, -1953, 15962, 37516, 43753, 28397]
9837B8397j2832q535R162j545r136j504J0215M8P50p347L154r836p632R32O623
9822I14j828j8099j2022J4207J4095Q312p975J791J0183R438k950p258l05K179
9808A0682j497L549r603L000k878o9j7325j2508J0657R00K904j0991L20K0749
9794b110J2627p846p324J4567J4657o760J7776R459n440l0875q535O180O277p288
9780E365l466K363K904L467N752J1164k2528k0799J235L695p148M304J1016m041
9766f717n284l171l021R909M935j1418M818M995Q860N600J5322R657o765j3235
9752A4485o795J5675K311k0468j3620O939m353j1228k986m969J6261J1526M538
9739G316o065j103l409j196p207q53M078p586M847J3470J1914N119q825M436o045
$$ y = [28397, 15565, 7030, 16192, 14647, 5511, 4007, 14222, 14270, 15020, 7673, 10827, 991, -6641, -5709, 914, -914, -19013, -31035, -16828, -2733, 5579, -2396, -605, 9578, 19016, 16066, 8808, 8503, 10682, 9185, 12734, 3131, 6131, 3253, 3184, -14141, -26649, -15992, -15092, -12188, -23179, -22859, -2110, 10517, 2671, -4653, 9914, 24571, 17811, 35587, 45046, 39606, 8731, 196, 6376, 12653, 5365, 1899, 4262, 7166, 10633, 16385, 27549, 5021, -15778, -14543, -10848, -17996, -13692, -2676, -6717, -12001, -15172, -18193, -8284, -3349, -14767, -9949, -4954, 3906, 9506, 24828, 34485, 27720, 14485, 7690, 23365, 25676, 5208, -8412, -1473, -5826, -17054, -20040, -25009, -8748, 2778, 7316, 1251, 148, -3261, -4457, -11664, -12517, -8439, -16025, -11178, 2292, 14206, 19325, 10500, 14936, 8891]
9724H891k113p98o890O601J4737j0350j1365J431P469m628J028J0085N961O691
9710B6750q498Q86Q285j6132l260J3124k74J500Q824m832q713k1394q505L345
9696h894q854J744J1569L628j7071j1611N251J4752k852l563p228k0190k525J3117
9682c2727R403R323j360J5679J2810J143p072M652N888j1j9588q698o548P908
9668i198Q961j523J398Q56p048p123O833l98j1619Q967J9982K695l62K009l983
9653A0447j5947P7r237M941J5634l729o157K1341L93p265l846P45N388J4993r20
9638B6858l272m213O137J119n252j572n813q092m058k102J1514K160k0343k6209
9624c3138R783K012J2264J3972J2931L576m234j744N280r91r851p867j0748n450
$$ y = [8891, 6778, 5980, -910, 5691, 20428, 10078, -1287, 144, 7613, 2985, 4013, 14098, 20059, 26750, 18252, 19138, 27423, 11291, 8031, 21155, 20881, 22381, 31205, 26373, 17660, -3734, -12239, -8894, -17748, -16004, -4435, -807, -17878, -29489, -24238, -9486, -12338, -15901, -23129, -43319, -45844, -32727, -23324, -14001, -15361, 318, 13128, 14271, 7199, 11851, 17739, 17728, -1860, -10558, -17106, -9198, -237, -1760, -362, 494, -6554, -13677, -6844, -7242, -18861, -9894, 10088, 12783, 12421, 14430, 10447, -5500, -5423, -14660, -9719, 5915, 2186, -3971, 17370, 17763, 10498, 6652, 7397, 12785, 27778, 26858, 23586, 19373, 25510, 26629, 21377, 19805, 13992, 5900, 1842, -260, 11254, 13414, -6929, -33138, -23355, -21343, -9079, 4893, 17824, 21400, 17166, 15422, 20702, 19711, 9860, 1993, -8755, -14205]
9610a4205M395R704P606J6482J3420j1039o315L906p756k5419j419J6433n736
9597E7m866P646O998J5957K021j4178j4706L313J0521j626q894k989K298m57o076
9582d981n227J14p330L359J5901Q615l345O548K804j4680j4367J3547J1239k547
9568I650O736k27l155m038Q497J7536J4370j531l649j5283q148J0846L744q76
9554C4472p031p310j261R963m599n069j5723j4917K4348K825q049n049q398l09
9540f107K124l146J1327r62p943J1130J2130Q087k253L553j316R760p0j0192q105
9525A8017J2654K3535N945l442q632J241r625j3293j4582o20J5122n512k388q288
9511A0132M959Q244j973N036L545J3042Q49p449j6242L396L2L912o4q861n680
$$ y = [-14205, -9810, -106, 7500, 23982, 37402, 26363, 20048, 23954, 16198, -9221, -10640, 5793, 57, -4809, 2837, 9835, 25792, 27813, 13635, -1071, 2242, 12763, 11137, 2243, -746, 1552, 1095, -4981, -10208, -10094, -17424, -14065, 1836, 10451, 7106, 13654, 16458, 1778, -12589, 958, 12197, 9650, 16386, 16159, 13004, 8966, 17463, 34999, 49369, 47838, 44189, 28906, 20758, 31604, 35348, 34472, 27441, 20131, 18870, 28833, 24234, 19165, 3442, -11475, 12873, 15698, 7649, 2600, -5798, -6107, -3983, -7129, 4198, 3236, -4707, 6423, 18553, 26640, 24387, 27940, 26624, 36384, 36314, 26122, 18017, 30671, 54206, 60151, 56709, 48077, 49318, 39693, 26400, 11818, 11198, 26320, 20808, 18420, 10132, 15091, 23335, 21362, 26398, 29943, 42985, 43834, 36385, 20143, 23539, 23571, 27483, 27419, 18558, 12878]
9496A2878R416l517L799l735j2156k081O818J4010nL936L949j115n401n965o880
9481A3951m34J1749M607r880q181j0225q235n204N390J9092P471M207q66k1896
9467A546m106J0644J8110R799k0570j5091J9884P499r827k143J3256P785q663
9454B8123n499l484l805j029l439J2794j4822R08J2514m391R026l138O019n490
9440B4287L156r426o407j700N869P154q107J3763J6450j2542K21R746r087j9344
9426A4033l414J1499q03Q40m65j0839O297j5581m300R973R061k107R308j0215
9412A3287j3728n469O899J2198L019m230M432J4302J092j84l721m45r584l623
9398A4245l653p093j176J0526q02J0429j231j1946l178r324J131j907K588J5862
$$ y = [12878, 22294, 18777, 22576, 18841, 6685, 4604, 11422, 25432, 25427, 29363, 33312, 32197, 26796, 20831, 13951, 13517, 25266, 29873, 19993, 11812, 1587, -6648, -11852, -6462, 12630, 20101, 24308, 23442, 1546, -2560, 8084, 26194, 35993, 15423, 332, 20216, 27715, 17888, 15745, 29001, 36786, 28123, 22624, 19140, 15335, 14306, 10867, 23661, 8839, 9747, 22261, 17870, 26896, 23758, 29777, 24287, 27443, 18017, 11610, 9910, 15779, 22933, 14826, 28589, 45039, 32497, 32718, 42464, 33377, 14033, 10619, 22118, 21315, 22155, 21690, 10851, 17148, 1567, -2733, 7240, 16301, 14194, 23502, 13287, -441, -5910, 989, 13187, 16206, 11976, 16408, 30710, 31802, 31618, 27897, 27452, 17868, 14245, 10592, 3499, 2323, 12849, 12047, 22476, 21245, 9299, 6121, -3203, -2072, -3979, -1391, 14471]
9384A4471K545O85J3915l463o3J246J2576p436o597q556P542J42J872o222j0663
9369A1994Q818N035J6002k56n145j1973j0282J808M466J8063l127R019O037j9157
9355C1302l069J3126O743J358Q853P78P14m487r432j0162L606o783j2876k272
9341A7399m405n236R624J6887K726P98P910j514j0198k176K489M058n424L635
9327C6573m405O711K6571P847o493r562j1784K706Q840j304k1205j4815l883O254
9313B2051J466M180k353k235N164j722j5263m946J9620o383O184K5253K119r129
9299D4006j8133j4901P513J5725J0040M522l398q77n559K544k5615k0577J0793
9286F083J8147L309j3765k435L816j498n342J326K190J0566J3066J4211n483m280
$$ y = [14471, 17016, 17701, 31616, 28153, 28090, 29336, 41912, 34476, 27879, 19323, 26865, 27007, 28879, 22657, 11994, 20812, 25847, 41849, 41593, 36448, 24475, 14193, 16001, 20467, 38530, 35403, 44422, 50459, 31302, 28233, 41359, 48102, 49460, 58313, 59091, 59805, 55318, 45886, 35724, 39330, 32547, 19671, 17399, 12994, 7758, 17382, 34269, 36995, 37793, 45703, 44189, 33991, 31815, 34304, 38362, 32938, 36573, 32168, 38879, 65450, 73297, 66804, 57242, 45458, 48164, 57004, 55700, 34495, 19680, 15797, 22051, 23517, 27697, 25344, 23109, 28273, 26551, 11288, 6342, 25962, 19579, 25763, 51016, 53135, 44006, 25873, 10972, 18485, 34210, 44250, 48772, 45374, 44497, 38938, 41482, 15867, -4710, 6083, 24230, 27539, 13774, 11339, 15155, 13657, 8315, 9641, 11831, 22397, 35463, 49674, 44191, 39911]
9272C9911N159P187J4773p477j316r133q802j3788J5880J689k131O078k000m109
9258D1921J4579R397k463K016J2896J2774J5685j0177j560m316Q50K545p122n599
9244H1426j4639r488j5973O913K8253K3253J2193J0797P969p327K824r55j76Q381
9230A33451K2728L7011K2891K0260L7782M6769O7672Q8102J08496J31224J48871
9219H65257J61512J63547J44442J01908K7968j3787n2309j15441j42697j30878
9209A009522j29659j26711j17350r3704o0012m3574m3326m0446k2880j4144l7224
9198B80492l921k1790j2772M793r938k9340j9949q646k703j1968J466j158j2200
9185A52366k001K676J2477j118p273p106j5509J854J4259n761n209q602j037r385
$$ y = [39911, 45070, 52257, 67030, 59553, 58237, 49104, 40302, 26514, 42394, 44083, 41952, 48030, 46030, 41921, 56500, 65897, 63434, 65450, 78346, 91120, 106805, 96628, 95068, 90752, 91602, 94147, 87025, 81426, 66787, 57299, 41326, 48239, 76492, 99745, 111938, 122735, 130704, 123377, 126201, 125246, 125070, 133451, 156179, 193190, 216081, 236341, 274123, 320892, 388564, 476666, 585162, 716386, 865257, 1026769, 1190316, 1334758, 1436666, 1464634, 1450847, 1398538, 1283097, 1140400, 1009522, 879863, 753152, 635802, 542098, 482086, 438512, 395186, 354740, 331860, 317716, 280492, 276571, 254781, 242009, 246802, 236864, 207524, 187575, 178929, 176226, 164258, 165724, 164566, 152366, 150365, 153041, 165518, 164400, 157127, 150021, 134512, 136366, 150625, 144864, 139655, 131053, 130016, 120631]
9171A20631j0758Q019O37k546K900p143j7847Q50m398J1312l694m127J3181j2768
9157I4249j1648j5390l419L855O299Q029j6661l453J1336J7271R241k365Q969
9144A06313L761k1472k1976R906M227q802m001J5369R314J204j942m908j6511
9131G0482l600O771J0923J8189L3994R860J719m16j0824j7673q579M527L350j0144
9117A08579L569L0472J7626N748J2084J0789m710J813J8720J9568L388L4662N2676
9104C14984M7149N1186N1786O3106R8898J46728J90783K81984M80012Q65110J580591
9093D172317K304347K123666J200063P71659Q2486k080444l113923j866787r35862
9084B657522n20634l08036k02504j58626j15776j08575j05408o9085o6198o2378
$$ y = [120631, 109873, 117892, 118529, 115983, 118883, 111740, 93893, 94743, 90345, 101657, 97963, 93836, 107017, 94249, 82601, 67211, 63792, 67647, 73946, 81975, 65314, 61861, 73197, 90468, 99709, 97344, 106313, 110074, 88602, 66626, 76532, 80759, 71957, 67956, 83325, 92639, 93843, 91901, 86993, 70482, 66882, 73653, 84576, 102765, 136759, 146619, 148338, 147922, 137098, 119425, 110846, 115373, 118723, 108579, 112148, 142620, 160246, 165994, 178078, 188867, 184157, 185970, 204690, 224258, 227646, 262308, 314984, 362133, 413319, 465105, 528211, 627109, 773837, 964620, 1246604, 1726616, 2591726, 4172317, 6476664, 8600330, 9800393, 10572052, 10654538, 8574094, 5460171, 3593384, 2657522, 2136888, 1828852, 1626348, 1467722, 1351946, 1243371, 1137963, 1068878, 1002680, 940302]
9074I40302j7376l8084l0713j3595j0502l6046l0551j9649j5065l0850j1533k4020
9062F62318j1279P11p590m2920k1433j6494j2976j4581j7867O236j1247r460j147
9049E02271n766j8561k3618j9121l7366k0448o62o266j0733k3927l7481k0325
9037B77997q353k0287k2026l1934j5554k689k2521q140j111n408j640N239J278
9024A44851j1287O020O723J4640J2087r061J573k6436k2341K215j5419l3959l3813
9011C5793k8005l4945k7433j0330K8310N6134P8920N9066N9882N7583L7817J4921
8999C27713M838K281l2375k4294k4769j6598m761K1633O19q003p244j6801j1167
8986B11072J6052N334r059n978r32j2089k2025p321L5583P916p647N776J4597
$$ y = [940302, 922926, 884842, 854129, 840534, 830032, 793986, 763435, 743786, 728721, 697871, 686338, 662318, 651039, 651750, 644160, 601240, 579807, 563313, 550337, 535756, 517889, 524125, 512878, 503418, 502271, 496505, 477944, 454326, 435205, 397839, 377391, 376729, 370463, 359730, 335803, 298322, 277997, 269644, 249357, 227331, 195397, 179843, 177154, 154633, 146493, 145382, 139974, 138334, 143573, 144851, 133564, 139584, 146307, 160947, 173034, 163973, 165546, 139110, 116769, 118984, 103565, 69606, 35793, 7788, -27157, -54590, -64920, -36610, 19524, 98444, 157510, 217392, 274975, 312792, 327713, 332551, 334832, 302457, 278163, 253394, 236796, 232035, 253668, 254287, 246284, 239040, 222239, 211072, 227124, 232458, 223399, 217421, 216489, 204400, 182375, 175054, 210637, 218553, 210906, 216682, 231279]
8973B31279Q734R223J6170J509m717R044J6960K0087R492J0597m68j0639l187
8960C14084n219Q025J3456q657M029P264K7425J9831K9272K5562J5227L3525L3660
8947E17484K6647J0200j4713l4497m8833j6986J0530J1565o337k5753l6528l0584
8935C62195k0161j2680m912J4812J0564K4231K8819K4043K9203M1108K8077K0067
8923E45366K5446J4899Q528m434k9536j4437l4066m1765k3326r517n611J01k739
8910D28909Q576N435J7270L7853L1383J0473L837R919K3676K8794L7575J0237
8898F53937O09K4548L0434L3054J3900J768J0201K2126Q895q895L2813L8779L1419
8885H93588M1334N3482N5009L4017K3323M9734L5427K9792K5513M5663L8591L8675
$$ y = [231279, 240013, 249236, 265406, 266915, 262198, 271242, 288202, 308289, 317781, 328378, 327910, 317271, 314084, 308865, 316890, 330346, 321689, 325718, 332982, 360407, 380238, 409510, 435072, 450299, 483824, 517484, 544131, 554331, 539618, 505121, 456288, 439302, 449832, 461397, 455060, 429307, 392779, 362195, 342034, 329354, 324442, 339254, 349818, 374049, 402868, 426911, 456114, 497222, 525299, 545366, 570812, 585711, 594239, 589805, 560269, 545832, 511766, 470001, 446675, 437158, 431547, 431648, 428909, 437485, 442920, 460190, 498043, 529426, 539899, 543736, 553655, 577331, 606125, 643700, 653937, 654546, 679094, 709528, 742582, 756482, 758250, 768451, 790577, 799472, 790577, 823390, 862169, 893588, 934922, 988404, 1043413, 1077430, 1100753, 1150487, 1185914, 1215706, 1241219, 1286882, 1325473, 1364148]
8873A364148K8127L9067M0033L8260L5785L0191K8737M6380N7168O6734N1833
8862A826463O8623P6075O4476P1533Q5067R5170J19108J38444J53358J68987J56972
8851C024276J85166K22182K32110K66148L09273L22380L68159M36376M77066N40671
8841F383807N96754O74697P88522R64827J169758J413951J715917K099241K496470
8832A8303944K908086L282619L678017M211061N008793O309605Q486023J2108002
8824F4296150J7871245K6981053M0567893N6221294O3751423N3693612L4118514
8817C57501184J3205110j8417273n7527088p1603070n6409126l7119580k3834670
8810A05795487j5832975j1193425q457834o653468n395964m643125m166866l660949
$$ y = [1364148, 1392275, 1431342, 1471375, 1509635, 1545420, 1575611, 1604348, 1650728, 1707896, 1774630, 1826463, 1895086, 1971161, 2035637, 2107170, 2192237, 2287407, 2406515, 2544959, 2698317, 2867304, 3024276, 3209442, 3431624, 3663734, 3929882, 4239155, 4561535, 4929694, 5366070, 5843136, 6383807, 6980561, 7655258, 8443780, 9408607, 10578365, 11992316, 13708233, 15807474, 18303944, 21212030, 24494649, 28172666, 32383727, 37392520, 43702125, 52188148, 64296150, 82167395, 109148448, 149716341, 205937635, 269689058, 323382670, 357501184, 370706294, 352289021, 294761933, 223158863, 166749737, 129630157, 105795487, 89962512, 78769087, 70311253, 63657785, 58261821, 53618696, 49451830, 45790881]
8802D5790881l192889k894372k668081k351138j999500j718087j512272j319173
8794B8135369j149210j038779r68979q83504q38300q22167q60048r23802r52452
8785A9698128r33168q62274p68391o94589o42488n81569n57175n67677n26523
8776A3564274m87457n00420m71516m26646m11982l89745l33997l39449l25944
8767I877118l04337l19902l39709l03417k78297k05934j54038q9476q5046j14336
8757G682626j50292k01418l00153l64541l19004k51159j93867j74120j64225j45328
8747E418519j65273j75804j64087j45968j34501j36027j33925j04152j07094j06424
8737D045264r5938r5342j11163j22921j16080r9753p9686q2892q0050o8123n8816
$$ y = [45790881, 42597992, 39703620, 37035539, 34684401, 32684901, 30966814, 29454542, 28135369, 26986159, 25947380, 24978401, 24094897, 23256597, 22434430, 21574382, 20650580, 19698128, 18764960, 17902686, 17134295, 16439706, 15797218, 15215649, 14658474, 14090797, 13564274, 13076817, 12576397, 12104881, 11678235, 11266253, 10876508, 10542511, 10203062, 9877118, 9572781, 9252879, 8913170, 8609753, 8331456, 8125522, 7971484, 7882008, 7796962, 7682626, 7532334, 7330916, 7030763, 6666222, 6347218, 6096059, 5902192, 5728072, 5563847, 5418519, 5253246, 5077442, 4913355, 4767387, 4632886, 4496859, 4362934, 4258782, 4151688, 4045264, 3949326, 3853984, 3742821, 3619900, 3503820, 3404067, 3324381, 3241489, 3161439, 3093316, 3034500]
8726C034500p6989p9064p3940p3418q1502q4900q5572r3517q8579p6969q2132
8715B137918p6886o1235m6745l4832q751k292j7052j1597k4162j9355N709r044
8703A831676k1664j2298l6457n9608o0233q4893q4905o8978o5298l2987k0307
8692A284048o2239j03533r4994p8487p9373o0887o4856n0393k9378k1573j9769
8681F18566k6349j1195j8025l1847j9961k7538j7570j8584l3702l2426k7754p202
8669C46413N47J4228n162j0624j028R76l800K261Q096o16J9348J1215r382j6119
8655C56353j1326o966r015j3374j772q838j4402k498l524j143l139j2010J976
8642B70322o677j2951j8546k4278l0911j2978J6207L1421M7850N7226O0936M4982
$$ y = [3034500, 2957511, 2878447, 2804507, 2731089, 2649587, 2564687, 2479115, 2385598, 2297019, 2220050, 2137918, 2061032, 1999797, 1953052, 1918220, 1909469, 1907177, 1890125, 1878528, 1854366, 1835011, 1840720, 1831676, 1810012, 1797714, 1761257, 1701649, 1641416, 1556523, 1471618, 1402640, 1337342, 1304355, 1284048, 1221809, 1118276, 1023282, 944795, 865422, 804535, 739679, 689286, 659908, 638335, 618566, 592217, 581022, 562997, 531150, 511189, 483651, 466081, 447497, 413795, 381369, 353615, 346413, 346960, 361188, 356026, 345402, 344374, 345350, 341550, 343811, 351907, 351291, 370639, 381854, 372472, 356353, 345027, 338061, 329046, 315672, 313900, 305062, 290660, 288162, 284638, 283495, 280356, 268346, 270322, 263645, 250694, 232148, 207870, 176959, 163981, 180188, 211609, 259459, 316685, 377621, 422603]
8630D22603L7855L9940L6254K1783n667m6680n3311l3071k2555j5992L831m157
8618C80833j4219k4346l719R309N380J3149J74N401L962P043J2669K164N767J0045
8604D13612o523k115k0155k9422j4362p830q751j6013J823q931N204O600L9576
8591C52713M1631L7654K0410N1k7955p4460n5356j1605k2810k2028j6402j4355
8579B07488j1233p068J2961M328Q25L713r5K111J5453J4313N05J2369n288R155
8565B59537J2920N147K1818O506k4861j9233j7891j0700j8988J061j775q042r068
8552A96431q209N159J0755j189q62J2277J6324K1434K2713K395k6178m6143l5565
8539A69342j9550j0415k820Q649m474M094J9493K5945J6970m15p214j2511j6899
$$ y = [422603, 460458, 500398, 536652, 558435, 552768, 506088, 452777, 419706, 397151, 381159, 384990, 380833, 366614, 342268, 338549, 347858, 353238, 366387, 366561, 371962, 375924, 382967, 395636, 397800, 403567, 413612, 407089, 404974, 384819, 355397, 341035, 333205, 324454, 308441, 310264, 301333, 306537, 313137, 352713, 394344, 431998, 452408, 452459, 424504, 350044, 294688, 283083, 260273, 238245, 221843, 207488, 196255, 189187, 202148, 206476, 207301, 211014, 210919, 213030, 228483, 242796, 243301, 255670, 250382, 259537, 272457, 277604, 299422, 305928, 281067, 261834, 243943, 233243, 214255, 215316, 213541, 205499, 196431, 188222, 193381, 204136, 202947, 202085, 214362, 230686, 252120, 274833, 277228, 251050, 204907, 169342, 149792, 139377, 136557, 145206, 140732, 144826, 164319, 190264, 207234, 206819, 199605, 187094, 170195]
8526A70195j8429k041j1503j9260k935j2795j0946n237J2970J6784J2883K113
8514A31799r947q634j3551q778m472o690l365k674J7386J8790j761K648Q673J605
8500A21029P461q567Q021j697M964r656j2490j3974j8369j5464q160j7987k588
8487C2523N190K2753J1516J8330J1978K083m803n827j6802l70P495N987j8181
8474G1872j0469M326j288J14R108k308R751J22j4204j2872j3423O198Q204J2899
8460F8030k353m803M026O457o861k6023j4464k815k442L758J0392J3178O370P266
8446E9716j370K393L221j4915M190L635n711J8861K5710K0350R237m339Q947R895
8432A39820K055N523J4393J3259K5838L1061K8552L7992O4516Q7698R8321J15913
$$ y = [170195, 151766, 149725, 138222, 118962, 116027, 103232, 92286, 87049, 100019, 116803, 129686, 131799, 121852, 113218, 99667, 90889, 86417, 79727, 76362, 73688, 91074, 109864, 108103, 110751, 119424, 121029, 128490, 119923, 127944, 126247, 131211, 121555, 109065, 95091, 76722, 61258, 53098, 35111, 32523, 37713, 60466, 71982, 90312, 102290, 104373, 99570, 93743, 76941, 76571, 84066, 90053, 71872, 61403, 65729, 64441, 64555, 73663, 71355, 81106, 81228, 67024, 54152, 40729, 46927, 55131, 68030, 65677, 60874, 64900, 71357, 64496, 38473, 24009, 21194, 18752, 22510, 32902, 46080, 52450, 59716, 58346, 60739, 63960, 49045, 53235, 56870, 51159, 70020, 95730, 116080, 125317, 120978, 129925, 139820, 141875, 147398, 161791, 175050, 200888, 231949, 260501, 298493, 363009, 450707, 549028, 664941]
8420F64941J37026J42494J50369J50508J18876P4744L9118l7209r7220j25021
8410A218626j41008j43756j30483j10021j02336p6890o7397n2858m0120l2332
8400C21425j5669l5848m0016j8154J783J0823j5457k7922j0558p616j4024k164
8388A46603j4398j3511n625j4230R30j3458k542J2730j7837K23O788K1377J0558
8375A17608j3309j0784j2059%r170o951R838Q487Q478O547l30m86k61p881l914
8360H5813r406k2643Q579P730J3858J2216K915R13M87o316j551q552n234p86j2662
8345F5361p184p689o957j004P958J7317L983j5473r538l125L928Q882j848j65
8331E4446J4611M07k921M116l056q405l298K976j0382j0637P485l857l661M474
$$ y = [664941, 801967, 944461, 1094830, 1245338, 1364214, 1438958, 1478076, 1440867, 1343647, 1218626, 1077618, 933862, 803379, 693358, 591022, 514132, 446735, 393877, 353757, 321425, 305756, 269908, 229892, 211738, 213521, 224344, 208887, 180965, 170407, 162791, 148767, 146603, 132205, 118694, 113069, 98839, 99769, 86311, 83769, 96499, 78662, 78885, 85673, 107050, 117608, 104299, 93515, 81456, 81456, 72286, 65335, 75173, 83660, 92138, 98685, 98355, 97869, 97608, 89727, 85813, 76407, 53764, 62343, 70073, 83931, 96147, 99062, 99975, 100462, 94146, 92595, 84043, 78809, 78023, 65361, 58177, 50488, 43531, 42527, 50485, 67802, 71785, 56312, 46774, 43649, 47577, 56459, 54611, 54446, 69057, 69464, 66543, 70659, 67603, 59198, 55900, 58876, 48494, 37857, 45342, 41485, 37824, 42298]
8317D2298j3643n007K71p709Q733J1777l955j3212M173O398n263n103k107L083
8303B0734K295J807M54k912J2084k040O058m118r674L154J3371m493l726j9533
8289A3461j3098l75n813L007P342r443M182L1081J7231k971k4436k2102m490J1229
8275D805r373l628K440j075J0853J0100N40l141J1160K869p374o597P852J5047
8261C4478j479j2443N777M142N582M289J0981j3787q346j916j2368j7953n024
8248h067Q652J7914l557p295l178O166P352j9q442P224J0843j035Q154N539p093
8233C3158J825J4269j6936j6542j9652M750K171L544J1456J5398R749n013j0043
8220B8134o852K170k060j2971j0823N741J0015n231o212n155j6379O093J1788
$$ y = [42298, 28655, 23648, 23919, 16210, 24943, 36720, 32765, 19553, 23726, 30124, 24861, 19758, 17651, 20734, 23029, 24836, 25290, 22378, 34462, 32422, 38480, 34362, 24688, 27842, 41213, 36720, 32994, 13461, 363, -12, -5825, -2818, 4524, -4919, -737, 30344, 47575, 44604, 20168, -1934, -6424, 4805, -4568, -8196, -5756, -6831, 4022, 14122, 14662, 11521, 22681, 25550, 18176, 11579, 19431, 34478, 32999, 20556, 26333, 30475, 36057, 40346, 51327, 37540, 29194, 27278, 14910, -3043, -8067, 585, 18499, 14942, 7647, 4469, 10635, 17987, 17968, 9526, 16750, 27593, 26558, 34712, 40251, 33158, 34983, 49252, 32316, 15774, -3878, 872, 3043, 6587, 18043, 33441, 43190, 38177, 28134, 21282, 23452, 21392, 8421, -2402, 3339, 13354, 8123, 1911, -3244, -19623, -13530, -1742]
8207a742L488j091J1696K75R252l041k1373j4680k624R09P582K783R032P616k665
8192E417J966J3071P1o481k138N889J827n176K946k744J1976m706n540J2785J1694
8177D0857r624j1803k453o859j0429k053J2289q902q661J5826J2493j554m735
8164A4392k902l75P97p109L888j0738N218Q197N424J0925K461P76o892j017Q895
8149C1940k0121r08P278j895K005J7908J0079q218o384L136p648l794L209K996
8135B9583J162J2203Q66j0258J076J301r489j1433j5722m674o235Q185K399L625
8121B589j354j1111j2788r482l203N892Q887R031J2947j0576O580J4569Q426k025
8107A8382j4790l982o904r550j3177N424K0764J7050r85o470R027R83l449M642
$$ y = [-1742, 1746, 655, 12351, 12626, 21878, 18837, -2536, -17216, -19840, -18931, -11349, -8566, 466, 8082, 5417, 7383, 20454, 20525, 14044, 11906, 17795, 19622, 14446, 17392, 14648, 26624, 21918, 16378, 29163, 40857, 31233, 19430, 16977, 10118, -311, -2364, 9925, 1023, -7638, 8188, 20681, 19127, 14392, 11490, 11115, 11912, 4803, 8691, -2047, 3171, 11368, 16792, 27717, 30178, 30954, 24062, 23045, 31940, 11819, 10911, 18189, 16294, 18299, 36207, 46286, 38068, 31684, 34820, 27172, 23378, 26587, 29583, 30745, 42948, 43814, 33556, 34632, 35933, 26444, 15011, -711, -5385, -11620, -3435, -1036, 2589, 1235, -9876, -22664, -32146, -35349, -29457, -20570, -11539, 1408, -9168, -2588, 11981, 20407, 18382, 3592, -390, -7294, -16844, -30021, -24597, -3833, 13217, 12232, 5762, 14789, 15772, 12323, 16965]
8093A6965K009R881j2070j6791J2398Q44o442J085R405k392J215j145J0461o87
8079B4736N861k0714j6693j975J1228l445j8547m89P264R240K1781L479j2624
8066I102k740j061j2823n727l197m212j0065J8758K0238q258k608J7598J2032
8053B7037o043k0753k963l785J3605Q239r219M230j0752j3946J1849L048P240
8040G787P700l313o422j0328k517J0769R536J904p69k289j1870m131J3031j6756
8026g668j226J8017j669L762N460K226r421K244O199K436J9732O289k2712r196
8012A4473Q476J336j5334j3022k316M310q38j672P742k015o539n018M756J6751
7998A1090q91j276j0634q86J2600j92q03r501J3031Q892J0689q042p29N376o243
$$ y = [16965, 18974, 28855, 16785, -6, 12392, 13236, 6794, 7879, 17284, 14892, 16107, 14962, 25423, 24736, 30597, 9883, -6810, -8785, 2443, -1002, -19549, -20038, -12774, -3534, 18247, 21726, 9102, 6362, 5301, -7522, -13249, -16446, -20658, -30723, -11965, 8273, 15, -2593, 15005, 27037, 20994, 241, -2722, -6507, 7098, 15337, 6118, 10348, -404, -14350, -2501, 547, 7787, 15487, 12174, 5752, -4576, -7093, 3676, 13212, 15116, 14347, 12058, 188, -3943, 9088, -7668, -8894, 9123, 7454, 11216, 16676, 18902, 9481, 11725, 17924, 20360, 40092, 46381, 23669, 14473, 22949, 24285, 8951, -4071, -6387, -2077, -2915, -4587, 3155, 1140, -5399, -10417, -5661, 11090, 10199, 8923, -1711, -2597, 10003, 9811, 9008, -493, 12538, 21430, 32119, 24077, 23348, 28724, 22481]
7983B2481n984j2959P413n049j4607m510P431J4117M103k835k403l553R070L357
7969A6072q423j1478J0853J4950j9881j8413n252J1734J1305n715m734J4140R331
7956A4489k0694j9002P559J6308o96R299J1648p079r655L530o272p498Q391J247
7942A575N782M780J2625J032n162m764N618J1263O415j3700j8095k0866l718K210
7928a5005J2000J6309P78n450j0742j4503j4378k92o21K2562J8472J0147L607
7915B2884j4538K1406J5774l615j4051l877m820q011r594m187n349N107R991P285
7901A4405p121l679J522o090k0177Q491J8649k468j6782J2570J1381j292m900
7888D509o35P047K735Q087O79j9315M070J28l129M085l07J930N947q800r453j1176
$$ y = [22481, 16497, 3538, 10951, 5902, -8705, -13215, -5784, 8333, 12436, 9601, 7198, 3645, 12715, 16072, 7649, -3829, 7024, 21974, 2093, -16320, -21572, -9838, 1467, -4248, -8982, 5158, 14489, -6205, -25207, -17648, -1340, -2036, 7263, 18911, 11832, 2177, 5707, -565, -8063, 328, 1575, 7357, 12137, 24762, 25794, 20632, 15868, 21486, 32749, 39164, 25464, 7369, -13497, -17215, -15005, -3005, 13304, 14082, 8632, -2110, -16613, -30991, -31283, -31904, -9342, 9130, 19277, 22884, 8346, 29752, 45526, 41911, 27860, 23983, 19163, 11152, 1558, -2629, -7978, -2871, 7120, 14405, 7284, 3605, 5127, -963, -21140, -12649, 6000, 3532, -13250, -680, 10701, 9409, 4509, 3874, 10921, 13656, 21743, 22422, 3107, 7177, 7305, 4176, 8261, 7954, 9884, 15831, 7031, -2422, -13598]
7872a3598o063l103J6754O682O260m706q043l802r974Q938N829M69m302P25K895
7857e039O943J6202R337j8791j2710J9453M912o032p17M248j2352l577L250r747
7843d620j2029p236n49J0730O497O636M848J2159L148J2790N571j2188j7499m350
7829C908J2818J0453j2094q959J0468k253r531p55r992O929N166Q154L41k653
7815A2000L2j0234j3597K964N79o279J188K364L220J53m832M521K2115R698j1345
7800A2547m397J940L376n995m261j2365L110Q365m761K898j0423p341N876K799
7786h632N479l179r103r464J0669J3289K34o156R873k993J372P722p401k968n202
7771f460J4020K367M008n69j2604r686R078J3025j9j5016J416J1282l185j980
$$ y = [-13598, -19661, -22764, -6010, 672, 6932, 2226, -5817, -9619, -19593, -10655, -4826, -4357, -8659, -7934, -5039, 1904, 18106, 27443, 8652, -4058, 15395, 20307, 14275, 13558, 17806, 5454, 1877, 5127, -4620, -16649, -23885, -24434, -13704, -7207, -571, 4277, 16436, 19584, 32374, 37945, 25757, 8258, 3908, 16726, 27179, 15085, 6126, 16594, 14341, 4810, 4055, -5937, 992, 6158, 14312, 14653, 12000, 12032, 1798, -11799, -8835, -8256, -14535, -13347, -10983, -7763, -7610, -12442, -7921, 14194, 23892, 12547, 8150, 10090, 13466, 7471, 3210, -9155, -6045, 2320, -2441, 457, -9966, -17307, -11431, -8632, -3153, -6332, -15435, -24899, -14230, -941, -707, -6863, 3010, 17, 1389, 9111, 1710, -1258, -6460, 7560, 9927, 13935, 13366, 762, -8924, 154, 13179, 13160, -1856, -440, 10842, 7657, 5677]
7757E677M174r149l867O499p6Q795n037j7381J1655J5911j278r056o822q13Q766
7742G998M391j1092k386j3519J4514J1412k151k343p35m414j1869m155M42J9187
7728E280Q487q23O356k487l258l406J4041p370r407j0073p846J745J4557j15j3769
7713h088N104m794k458Q636P510p377O422O60r514m577J1300j7009r823N616K0290
7698A898J6578P46J85K839o351j1704k3135J1458K5042q255j4586N665o379q448
7684a4447N804J8065N340j4528k2216l764J7196J0359L979P283J362j2583j4469
7671a2619N149j6134Q17K0535J2584N539m979J1696N67p615K585j88l788J1112
7657B5261J593j6974L117P552k2129m124J0890m060O234K5019k012Q022j0502
$$ y = [5677, 9851, 702, -3165, 3334, 3258, 12053, 7016, -10365, 1290, 17201, 15923, 6867, 45, -768, 7998, 12389, 1297, -1089, -14608, -94, 11318, 9167, 6824, 6089, 1675, -10194, -14349, -13907, 5280, 13767, 12944, 19300, 16813, 13555, 10149, 24190, 16820, 7413, -2660, -10506, -8761, 5796, 5681, -8088, -2984, -7778, -10236, -1600, 5910, -1467, 4955, 5615, -3899, -8476, 2824, -14185, -24008, -18392, 1898, 18476, 19222, 19407, 22246, 15895, 4191, -18944, -7486, 17556, 9301, -5285, 380, -5999, -14447, -8643, 9422, 14762, 234, -21982, -25746, -8550, 1809, 5788, 13071, 14433, 1850, -12619, -7470, -23604, -22787, -2252, 10332, 15871, 10892, 22588, 23155, 15540, 18125, 17937, 14149, 25261, 26854, 9880, 12997, 20549, -1580, -5704, 5186, 1126, 7360, 32379, 30367, 38389, 27887]
7644B7887j1875j0508j3851r351J1181J2156M105R090P751j1596j3616L321P5
7631D769j390J861J5214m789o146q742l562m782L244q29m096j1197J4267J4301
7617H123k384m849J8716P061l276j5954N193k825n596j1408j1713L390J0732m153
7603h943k258k182J15Q706P795N873J1183o63j3814j0089j504J106R697j835O355
7588I542n123K392n630l582J2734q797k436j2301K007J2772P90J234k423L44r625
7573h102N88K427m874J7972q0n66M760o884N928J5555j8135j5140q839R68R399
7558e023J0670Q166j3610r72j421o932m403N480k907O83p444J0632J8331k645
7544H605l234L749J290l585j3064q069m190m619k215R315J1109K3660K3080p591
$$ y = [27887, 16012, 5504, -8347, -17698, -6517, 5639, 9744, 18834, 26585, 14989, 1373, 4694, 4769, 3379, 5240, 20454, 15665, 9519, 777, -2785, -7567, -4323, -5152, -9248, -20445, -6178, 8123, 5739, 890, 19606, 26667, 23391, 7437, 12630, 9805, 4209, -7199, -18912, -15522, -4790, -8943, -11201, -13383, -13268, -4562, 3233, 9106, 20289, 19626, 5812, -4277, -5781, -4675, 5022, 3187, 9542, 4419, 6811, 1181, -2401, 10333, 1536, -900, -13201, -11194, 1578, 2368, 3602, 1179, 1523, -8102, -7514, -5087, -9961, 8011, 7931, 7365, 12125, 5241, 11169, 26724, 8589, -6551, -15390, -14422, -5023, 5647, 13813, 203, -769, -2190, -9122, -13525, -8045, -10952, -10269, -17713, -7081, 11250, 8605, 5371, 9120, 10410, 6825, -6239, -14308, -18498, -23117, -25332, -16017, -4908, 18752, 41832, 34241]
7530C4241j4611j5620r81L627M763M212j8404r351O832J8475o169j1579P65O510
7516B710P935K660K74q362j9145k1494J1110Q02J842n198j0258m548O031K4579
7502a1062J1052l218n283O44j70L550Q083l175P566j772p605L897N196K327j808
7487H222j1010j1771R668O60K8R915K757j5267q541L483Q212j689N644p977r281
7472a6947J0224O964N950M754m262j0286K768J6120N108l312o906k68q911l549
7458b553M372J3231q121p645J675R705l608p599k893L688j3784j2388R4Q927O308
7443a0591N386l049n243O878j3708J0288J391j3127K739K469N35j3506K575J7840
7429i123M644k749K964o367J0710Q706N267L855P882n609O362j6194K491r352
$$ y = [34241, 19630, 4010, 3029, 6656, 11419, 15631, -2773, -12124, -5292, 13183, 7014, -4565, -3800, 2710, 10645, 13305, 13579, 5217, -13928, -35422, -24312, -23510, -21668, -26866, -37124, -41672, -35641, -11062, -10, -3228, -8511, -7867, -8037, -4487, 3596, 421, 7987, 6215, -1390, 2507, 7703, 10030, 8222, -2788, -14559, -4891, -4231, -4203, 5712, 8469, -6798, -15339, -11856, -3644, -5333, 311, -7666, -16947, -6723, 241, 6191, 10945, 6683, -3603, -835, 15285, 20393, 17081, 10175, 9907, 996, -2553, 1819, 15050, 6929, -716, 959, 10664, 7056, -543, -3436, 252, -13532, -25920, -25826, -16899, -10591, -5205, -8254, -13497, -6619, -20327, -10039, -8648, -21775, -19036, -16567, -16032, -29538, -26963, -9123, -4479, -7228, -4264, -10631, 79, 8785, 14052, 17907, 25789, 20180, 26542, 10348, 12839, 3487]
7415C487L331o420J920J737J1675m673j6785o150L606N498J0169j440o85N372
7401A0642L926r870l92l346p158k447p192j429J2812m2q11l301m753P101J2438
7386F178O435m099n925r763l930Q304K01K109J1044N31j6646q020J0174P559r88
7371C164N180N412l281r598p71o088K254p980j5784M439P772n98k490J7820J7960
7356A7411L973Q988q869k4617n266N445n983n14k271K921J3220N386j6186P584
7342A222J3976Q655m006j3621L545j587j204L131n607Q656n642p022K79J0254
7328A1029M474o249N679j279K884P119m09j859o136M834l380m502J0685n360J069
7313A8599j083n057j1340N889R572j7437j4468J860M43r532J88P748P413o347
$$ y = [3487, 6818, 398, 2318, 4055, 15730, 11057, -5728, -11878, -8272, -2774, 7395, 5955, 5270, 10642, 14568, 4698, 4306, 960, -6198, -8645, -15837, -17266, -4454, -4496, -5307, -8608, -13361, -6260, 6178, 12613, 8514, 2589, -7174, -11104, -2800, -2599, -490, 10554, 11085, -5561, -13581, -3407, 4152, 3164, 8344, 13756, 10475, 877, 106, -5982, -3728, -11708, -27492, -23053, -15281, -15879, -18369, -549, 17411, 21384, 30372, 21503, -3114, -8380, -2935, -8918, -9432, -11703, -8782, 4438, 9824, -6362, 1222, 15198, 23853, 19847, 6226, 9771, 8184, 6980, 10111, 4504, 13160, 7518, 496, 775, 11029, 15503, 9254, 14933, 13654, 16538, 23657, 23248, 21389, 15253, 20087, 16707, 12205, 22890, 17530, 18599, 17516, 12459, 1119, 7008, 16580, -857, -15325, -13465, -13022, -22554, -22366, -14618, -7205, -13552]
7299a3552j4615M861P089o780J4929K623n626K2293M78m565o649J0030o058j1849
7285g391p842J1548J3626r160p393L409J102J370k357O053K95L60k2608o577N025
7270b0540P298M03l477J583P877j0952j134N480K651J801N404o187R018L225j47
7255B303l67j6546j3488J1936K086J7123M272j2979Q018K764j4422O381m085k705
7241i709m153j220J7115J1838L679n395l568j238R44J6416J2024j1497K139r510
7227A7865p807j561p124Q02M74m666j0684q462J940M794p01J1252j034j4800n20
7212b0232R632k377p148L749K1680k410o588k1510L615J4398l472J910R545K81
7198A073J3271N924K920l834k1835P692J3208j1187K069m22r689l464l814O727
$$ y = [-13552, -28167, -23306, -16217, -22997, -8068, -5445, -11071, 11222, 11700, 7135, 486, 10516, 4458, -7391, -15233, -3685, 9941, 781, -6612, -3203, -2101, -731, -3088, 2965, 3260, 3620, -18988, -25565, -20540, -13242, -12839, -16316, -14733, -6856, -17808, -18942, -13462, -10811, -9010, -3606, -9793, -775, 2450, 2303, 1936, -14610, -28098, -16162, -14076, 3047, 7319, -5660, 2358, 5122, -9300, -2919, -7004, -9709, -13862, -15082, 2033, 13871, 17550, 12155, 8587, 7349, 8293, 24709, 36733, 25236, 27375, 17865, 10058, 8497, 1373, 2175, 2649, -2017, -12701, -21163, -19223, -14429, -15130, -3878, -4912, -19712, -20232, -10600, -12977, -20125, -16376, 5304, 2894, -3694, -25204, -21589, -7191, -10663, -8753, 792, 1073, 14344, 20268, 23188, 19354, -2481, 5211, 18419, 7232, 9301, 8879, -810, -4274, -8088, -1361]
7184a361p380o372o687j3042n460Q543J2550J6964J7372L309k3611K59Q013L18
7170C415M097N917J2775M0q118l893n364j5975p567O723J024K151J0193Q977l081
7155A1314M84k715q030J0477M184j7613p868P904K111l583r303J8755J1158J2677
7141B9952P578j7488o087J1457J3287j1813j7036N610K769k168Q56m467l854O464
7127A5060O469J1285j4807r426J944j2177L959K0123L732J411j0185n391M066
7114A6063m006j972O097Q669j289M870k0597j3333J9183J6878K3j7016p763j7364
7100a1557j4364K810J9139J1125L215J4799K229r286j663M644J1576l846j3713
7087A5108j0766r635j5055o188o418j880J7396J5732R769K602J834p952K820P177
$$ y = [-1361, -8741, -15113, -21800, -34842, -40302, -31759, -19209, -2245, 15127, 18436, -5175, -4916, 3097, 3415, 7512, 13429, 26204, 26244, 18126, 14233, 8869, -7106, -14673, -7950, -6926, -4775, 5418, 14395, 11314, 11798, 9083, 1053, 11530, 15714, -1899, -9767, -1863, 248, -3335, -12638, 6117, 17275, 29952, 37530, 20042, 13955, 25412, 38699, 26886, 9850, 15460, 18229, 16061, 16917, 12450, 8596, 15060, 21529, 32814, 18007, 8581, 10525, -1652, 2307, 22430, 26162, 27573, 17388, 11997, 16063, 12057, 10085, 16182, 24851, 23562, 28432, 7835, -5498, 13685, 30563, 30586, 13570, 5807, -11557, -25921, -23111, -3972, 7153, 10368, 25167, 27396, 18110, 16447, 21091, 32667, 28821, 15108, 4342, -5293, -20348, -26536, -32954, -34834, -17438, -1706, 8063, 10665, 12499, 4547, 7367, 14544]
7073A4544K372n746k521n22o313r281O000M244J4991N391n539k0897j182Q208
7059C749j6076o068J5583M700l463P013J1378l250o979j4311M299O333J3327j70
7045A6065L245j2594r811o710P709M981j2509r477J0272P544p248j731m223j0429
7031b4916J1741Q215J935J8278J1390J5883j1609n773Q930j0016j6044n842N740
7018G912p253o270R039R358j0397j7381P873m745Q018J1989j0405j408l928m654
7004a2252k865r848k041O954p414K224J6118J6047q39j1525q416o475K5090K0057
6990B4815P789n332j1594m510N600l60o123p370J0622k957p629j1774K893J0252
6976D322Q956j824o626n942m025j785J8989J8336M655j0796j0742m9N299j36q575
$$ y = [14544, 16916, 11170, 8649, 8127, 1814, -7467, -1467, 2777, 17768, 23159, 17620, -3277, -4459, 3749, -12327, -18395, -2812, 1888, -1575, 5438, 16816, 13566, 6587, -7724, -3425, 2908, 16235, 16065, 19310, 6716, -3095, -9805, -2096, 2885, -9624, -19101, -8829, -1285, -8533, -10264, -14487, -24916, -13175, -4960, -3025, 15253, 26643, 42526, 30917, 25144, 34074, 24058, 8014, 2172, 7912, 659, -5611, 3428, 12786, 2389, -14992, -7119, -11864, -3846, 8143, -2262, -3670, -7598, -12252, -15117, -24965, -27006, -20052, -27466, -25242, -9124, 6923, 6084, -5441, -13857, -20332, 4758, 24815, 32604, 27272, 15678, 11168, 16768, 16408, 10285, 2915, 13537, 10580, 2951, -8823, -5930, 4322, 13278, 11454, 4828, -1114, -5139, -6924, 12065, 30401, 35056, 24260, 13518, 13469, 18768, 18632, 10057]
6961A0057j5669k284R591L660r548j5368J38J4673J4458L867p997O839J819K39
6947A4475n71J0885k00r234L78j004j0420p474J1627p704K241R46L574q986k530
6932c997j0736j2271m920R135K143K970K928M437k947N47M508k748N519J4215
6918H783J3960J0885o944k7361N279J124j1288P288J042J0591J0159r795m324
6905I399P999J5854n640j8833r300n579r137p458m124j549Q997K5180P620n021
6891H408J970j3553j1532R553K972J2544L942q206p209j137l877P746N807P316
6877A4744o610L848p03q904L34l767p072p758L382j2299j0957L508k363J1084
6863b3533J5824p64Q523J7167l433j5285m279o872j779R428j048j4302m34J1106
$$ y = [10057, -5612, -7896, 1695, 5355, -4193, -19561, -19423, -4750, 9708, 13575, 5578, 12417, 14236, 14475, 13904, 24789, 24589, 15355, 15733, 14729, 4309, -3165, 8462, 758, 2999, 3945, 7519, -1467, -3997, -14733, -27004, -31924, -22789, -20646, -17676, -14748, -10311, -13258, -12711, -8203, -10951, -5432, 8783, 22743, 33628, 26684, -677, 4602, 5726, -5562, 1726, 2768, 13359, 23518, 13723, 9399, 17398, 33252, 27612, 8779, -521, -6100, -15237, -22695, -26819, -28368, -19371, 5809, 13429, 8408, 10378, -3175, -14707, -5154, -2182, 10362, 14304, 6098, -1111, -2248, -6125, 1621, 7428, 14744, 8134, 11982, 11279, 2375, 2709, -1058, -8130, -15888, -12506, -24805, -35762, -32254, -34617, -23533, -7709, -8473, 50, 17217, 13784, -1501, -5780, -12652, -14431, -5003, -6051, -20353, -20787, -9681]
6849i681N172J577K618J1099N850n505r388J1752o522K09n309j5108k55L934J124
6834h433m394K50k059R64R653J3387r900j156Q152R778N5j8123P022J515n492
6819A219o298J4030R597q843o394K863j6796q829O849J5476j5371Q662J0340j3006
6805f501l021k471q56N857O002j766K403j43J9325R969j2761j2665j3763J892
6791h499J1624o665n845K2217p440n037L167l266P733M285O650j1898j492P214
6777A2748j768j1646O41J0188J1308n012j242P47L228P837j3775p366j594J0741
6763A5035k928p46j2786J690J9786o609j2678J324J3482J4482Q091K824k0017
6750B0950m340N581K0304J5393R966J1577K4434M1367P5348J15040J22033R7662
$$ y = [-9681, -4509, -2932, -314, 10785, 16635, 11130, 1742, 13494, 6972, 7181, 1872, -13236, -13491, -9557, -8433, -12827, -12577, -14636, -13672, -4019, 9368, -532, -1688, 6464, 16242, 16297, -1826, 5196, 6711, 1219, -5079, 8951, 18548, 9705, 3311, 6174, -10622, -19451, -12602, 2874, -12497, -3835, 6505, -6501, -9522, -11993, -12849, -6992, -990, -2756, -353, -496, 18829, 28798, 16037, 3372, -10391, -8499, 3125, -3540, -9385, 12832, 5392, 355, 3522, 256, 7989, 12274, 18924, 7026, 5534, 12748, 10980, -666, -25, 10163, 21471, 16459, 15217, 15964, 19192, 27029, 13254, 5888, 4294, 15035, 12107, 11361, -1425, 265, 20051, 13442, 764, 2088, 15570, 30052, 38143, 40967, 20950, 16610, 22191, 42495, 57888, 67854, 79431, 103865, 145232, 220580, 335620, 457653, 555315]
6738E55315O2539J3222l1487j18259j53573r9508n5068m6251k8215j0063l330
6727H5322j1613J692m518j7134r819N585R588J1313n572j4109j483N385j0377
6714D4260j8860O825n671O269P914j6559k472O23j6522n079J9075J1689m315j5354
6700A1823l719J1300R4j453j3814K221J1658J941j4413M78L714O165K78j1989
6686D284J203o183q160J2539k868p027J3335J6309m990k082M845N650K0295q801
6672C8349j6799O876j1239r057q751n995R870J6575j928P92o910j7006J3641J3366
6658B1784n704J089p345M988K177j2751L228q369J838n799K984L8o708K1429J0362
6643B3241l59j76j6045j0578q26q819n284M576J7929P349o040j4831n247K4993
$$ y = [555315, 617854, 631076, 599589, 481330, 327757, 228249, 173181, 126930, 98715, 88652, 85322, 73709, 75401, 70883, 53749, 43930, 49515, 59103, 70416, 64844, 50735, 49252, 54637, 44260, 25400, 32225, 26554, 32823, 40737, 24178, 21706, 22329, 5807, 728, 19803, 31492, 27177, 11823, 8104, 19404, 19498, 18045, 4231, 6452, 18110, 20051, 5638, 6116, 9830, 15995, 16273, 4284, 5487, -696, -8856, 3683, 815, -6212, 7123, 23432, 18442, 16360, 21205, 26855, 47150, 38349, 21550, 28426, 17187, 8130, -621, -6616, 3254, 19829, 17901, 18693, 11783, -5223, 8418, 21784, 16080, 17169, 9824, 14812, 16989, 4238, 7466, -903, 935, -4864, -1880, -1842, -8550, 12879, 23241, 22882, 22706, 6661, -3917, -4743, -13562, -18846, -14270, 3659, 11008, 4968, -9863, -15110, 9883]
6629I883R454j062k5656q339N8J5228k694p091m825K6860J6384j9320j8473j8
6615i611L434J6969m498j1188q922k426L699K791j2108p078N542J5154p57j2360
6601b1359M976J1959k098J0928j117j5431r505R406L0431K889p746L585j5455
6588A463o619O416j6008o692l76J6411P414j4046K550K66r87K775m713Q304l27
6573d169j805J366q12p280m281l824O385J2994J918k854p527J2650M735o744J922
6558B674M411N64K161L247J641K919O295M582j0047j4705q390J3692J1524Q204
6544B8772n282M998r26J0612k568j4086j5909r676q459K168N492P786j697p007
6530e782p560K138J1062R121L121J006J439L907l325j3232N872J156M757l678
$$ y = [9883, 19337, 18275, -7381, -15720, -15662, -434, -3128, -10219, -15044, 11816, 28200, 8880, -9593, -9611, -6177, 10792, 6294, -4894, -13816, -16242, -12543, -9752, -21860, -28938, -23396, -8242, -8999, -21359, -16383, -4424, -6522, 4406, 3289, -12142, -21647, -12241, 18190, 21079, 13333, 16918, 1463, -5156, 1260, -14748, -21440, -21816, -5405, 2009, -12037, -9487, -9221, -10208, -7433, -12146, -3842, -4169, -5974, -4608, -5420, -12700, -16981, -20805, -14420, -1426, 492, -2362, -9889, 2761, 7496, 752, 2674, 7085, 7649, 9810, 13057, 14698, 17617, 23912, 28494, 18447, 3742, -4648, 9044, 20568, 28772, 23490, 28488, 27562, 38174, 35606, 21520, 5611, -4065, -12524, -10356, -4864, 2922, 1225, -5782, -13342, -11204, -142, 8979, 12100, 13106, 14545, 18452, 15127, 1895, 7767, 8923, 13680, 10002]
6516A0002l859j1115l425p013j0466J2165J0865J6597K367p910j1200r326m886
6503a7204n41J5282L732q034Q28m035k831K0588J6624m733J0299k901j6089N07
6489A1492N155P037m482k0718k1619K172l961p640K0416N326J407N251J3711j352
6475A2195M828J1013k2654j8397K033K891J3349j481n965p52r266P22j6848r40
6461b9272J4530J4543J030O463J663q445L30j011N664P609j0792M74M208j0254
6447c260K190O171k407o985P833n418o710nr859O444M311R039N341M508k0829
6432i636N890r17N624q218j6146L204M51O879J9659O312p891L455p209k5020j64
6417b3727q985l397L444j11j893J7108J8466O730J4792J1690j2559L729o888N672
$$ y = [10002, 6143, -4972, -8397, -15410, -25876, -13711, -2846, 13751, 16118, 8208, -2992, -12318, -17204, -17745, -2463, 1269, -6765, -5937, -9972, -12803, 7785, 24409, 19676, 29975, 27074, 10985, 11492, 16647, 23684, 19202, -1516, -23135, -20963, -24924, -32564, -12148, -6822, -5415, -164, 13547, 12195, 17023, 28036, 5382, -13015, -10982, -8091, 5258, 3777, -2188, -2940, -12206, -11484, -28332, -29272, -14742, -199, 831, 7294, 8957, 512, 842, -169, 5495, 13104, 2312, 2786, 6994, -3260, -1070, 5101, 2694, -4291, 3542, -1876, -8586, -8591, -18450, -12006, -7695, 1344, 6685, 11193, -9636, -3746, -4663, 961, -7257, -23403, -20199, -19748, -12869, 6790, 13102, 5211, 8666, 1457, -23563, -23727, -32712, -36109, -32665, -32776, -34669, -17561, 905, 7635, 22427, 34117, 21558, 25287, 18399, 24071]
6403B4071k535j3304q412k723k461M896R552Q242L162m673k482j085L283m780
6389A0751j2248R447Q000m762j8373q794k410P97J2688J874j2044p223j294K220
6375b1371J542P185Q169M483m353j3117j998q720r36L096j864J5689K466o327
6361a6056J8468j684m225m45p043J9350J2625o157K17m936j1598o703J6263K190
6347A0266r806m427K401M882O218j2956K951j108M607l301O100J200n880p2P097
6332H172K767k451L122j1589l196L673j0251J539L840N596P258J1081M479p162
6318A6878j5555k6744k826J1502P35Q95Q147n187q783J4799J0551M761j2586j7877
6304b1290j3773m324k408K4623K4907M874J4109m903j0737k913j1240N575L725
$$ y = [24071, 21536, 8232, -180, -2903, -5364, -468, 9084, 17326, 20488, 15815, 13333, 12248, 15531, 10751, -1497, 7950, 15950, 11188, -7185, -15979, -18389, -17592, -4904, -3030, -15074, -22297, -23591, -21371, -19829, -12644, -4475, 8, -4345, -17462, -19460, -28180, -29116, -26020, -27884, -12195, -9729, -16056, 2412, 728, -3497, -3942, -10985, 8365, 20990, 14833, 15050, 10114, -1484, -8187, 8076, 10266, 460, -3967, -1566, 3316, 9534, -3422, -471, -1579, 3028, -273, 5827, 7027, 1147, 1075, 8172, 10939, 8488, 11610, 21, -3175, 498, -9753, -8214, -4374, 1222, 8480, 19561, 24040, 16878, 1323, -25421, -28247, -16745, -16010, -15115, -6968, -12155, -20938, -6139, 4412, 9173, -3413, -21290, -35063, -39387, -41795, -17172, 7735, 12609, 26718, 21815, 11078, 8165, -3075, 2500, 6225]
6291F225q289j2174J901K019l072o527K186J3855K173J441J593O997j4390m245
6277a0307n195p441j064L923J6632j3715K756Q666L412N68Q011j0652o983p577
6263a8966P743J1460m57j0312j2051p293K229j904R345M070j1267J3524O710m483
6249a1652k596J03K140j926l971N385n69L280J430O671R858K464j0719o365j3802
6234b0269K773N512R440k776m120N143l434P995k645J619l60q334n94J3631j1820
6219h239O029L748N776O475m631j7242p860j9r056R18o73N406M302R324P085Q375
6203I718L868n288O324N582o154j5779k306J3369j1055p021k036K0190M959n488
6189H883j1445P44J2972p713j5110r100O56N630m486k840J522J3503J8151k366
$$ y = [6225, -2064, -14238, -12337, -10318, -13390, -19917, -17731, -3876, -1703, -262, 1331, 8328, -6062, -10307, -15502, -22943, -24007, -20084, -3452, -17167, -14411, -5745, -2333, -1765, 6246, -4406, -11389, -18966, -11223, 237, -220, -10532, -22583, -29876, -27647, -29551, -20206, -16136, -27403, -13879, -7169, -11652, -14248, -14145, -12005, -13931, -17902, -12517, -13086, -9806, -8376, -1705, 8153, 10617, -102, -6467, -20269, -17496, -11984, -2544, -5320, -9440, -4297, -7731, 264, -2381, -762, -1122, -9456, -10050, 3581, -8239, -2210, 1538, 7314, 13789, 9158, -8084, -15944, -15963, -25019, -24101, -24774, -19368, -15066, -5742, 1343, 9718, 13586, 8298, 14622, 20204, 14050, -1729, -4035, 9334, -1721, -8742, -10778, 9412, 14371, 8883, -2562, -1818, 11154, 3441, -11669, -20769, -20113, -14483, -18969, -21809, -20287, -6784, 11367, 9001]
6175I001r181l999l754M590Q919N385J3203n808k3672n310l468j2083J345O376
6161a8456J1757N5p635P909J2319j392J1543j0737m640o601j4297l294R26J516
6147b1027R743R890M447n646j0418M584m971R160L196N979r354j0404m42J2483
6133b780M927R703m792j408j1025r813Q263J5913K063j6491j39l213J0617k433
6119f08r707l248j4335O995J1438Q286J2147J4120q437j4211o614M856L291R123
6105A3096p957L888P864j0954j6986n062o124q464K616N737k715K134j6365K046
6091c7246l551N708M516N428J40j7211O108O666l993o01J067M224J1459J0457
6077f829r226l308k394k621L796J2117R533K3271L669k1578j4701j5594N892J9564
$$ y = [9001, -180, -4179, -7933, -3343, 5576, 10961, 24164, 18356, -5316, -10626, -14094, -26177, -24832, -18456, -6699, -6644, -14279, -6370, 5949, 4557, 16100, 5363, 723, -5878, -20175, -23469, -22543, -21027, -11284, -1394, 3053, -2593, -13011, -8427, -13398, -4238, -1042, 4937, -4417, -14821, -15263, -2780, 2147, 11850, 7058, 5650, -5375, -15188, -6925, 8988, 11051, -5440, -5579, -8792, 1825, -608, -10315, -13563, -27898, -20903, -9465, -1179, 10968, 25088, 16651, 2440, -4174, 682, 3973, 13096, 5139, 9027, 16891, 5937, -11049, -16111, -22235, -30699, -28083, -22346, -25061, -22927, -39292, -37246, -40797, -35089, -30573, -25145, -25005, -42216, -36108, -29442, -33435, -34036, -32969, -28745, -17286, -6829, -16055, -19363, -21757, -24378, -20582, -8465, 1068, 24339, 28008, 6430, -8271, -23865, -17973, 1591]
6063A591J0922j809o188r664k728q05K033p235R72n381m533J0553l588N581r524
6048a9803k130K0450K2270l192j8057r693j012j3588j4315o989O236J5722J5264
6035h837n93j5818P85P564J3853r89n01j271j060j016P851M283R375j2339n632
6020d345J7088J1101R11K702j0586P304j1736q96j4302j2517J1701L33N50p490
6006a0182m527j009j2774m647m56r58J5357J2899J227N118K0045n968j2720o397
5992d992q798J234n266K098n928O210J4731l587n198L535m919P194J5027J6800
5978B8141p119m485j1526j332k949j0452K361J7515k049l995J34n288j5608O094
5964a0558r380l984J3507J915L474J8472K3487q899m634J247m336n768q399j0565
$$ y = [1591, 12513, 10704, 4516, -5148, -7876, -8681, -6648, -13883, -12911, -18292, -22825, -12272, -15860, -10279, -19803, -21933, -1483, 20787, 17595, -462, -10155, -11167, -24755, -39070, -46059, -39823, -24101, -8837, -9430, -25248, -24463, -16899, -3046, -4035, -4536, -5807, -6867, -7883, -32, 4251, 13626, 1287, -4345, 12743, 23844, 24755, 27457, 16871, 24175, 12439, 11543, -2759, -15276, -3575, -3242, -2692, -10182, -14709, -15718, -28492, -33139, -33595, -34553, -19196, -6297, -5070, 48, 20093, 14125, 1405, -4992, -13790, -12556, -17822, -15724, -21652, -15442, -711, -4298, -9496, -5961, -10880, -3686, 11341, 28141, 21022, 16537, 5011, 3679, 730, -9722, -7361, 10154, 8105, 4110, 4244, -1044, -16652, -10558, -19938, -23922, -10415, -8500, -5026, 13446, 36933, 28034, 23400, 24647, 20311, 14543, 6144, -4421]
5950d421n024l030K87R619n566j2896l118Q35J0226l046J6036M617q854K52n969
5935a0052l478q780J5602R419j4769j4861N054J5684Q968p096o20Q230N973l509
5921E765n942J941n92j4989j165M27R304l090k353m314n551M24R114j2865L209
5906b0677p858l960L972k57J2152J1053J2338K7930l527p413M506Q82j9332j0204
5892c95l839J2042R856m154J537k795m903p174O847J495P76j0650m535J9199J5666
5877B8973n432k2741j3849l596l630K743j3544L497J8878K1196O121k2439L516
5864c07K0288J1539r105j9773o635j9819K219J3075l467o95P242n110M294r513
5850a5767p61J3222j283P193J2454k986o754j9918j7076K0762J4706J1980L776
$$ y = [-4421, -9445, -12475, -12188, -2569, -8135, -21031, -24149, -23314, -13088, -16134, -98, 4519, -4335, -4083, -10052, -13530, -22310, -6708, 2711, -12058, -26919, -21865, -6181, 2787, -4309, -4929, 3301, 9274, 5765, -177, 1764, 1172, -13817, -14982, -14555, -5251, -8341, -10694, -15008, -20559, -20135, -11021, -23886, -20677, -28535, -32495, -28523, -28780, -16628, -5575, 6763, 34693, 31166, 23753, 28259, 29141, 9809, -395, -4234, 7808, 17664, 13510, 15047, 12252, 7349, 175, 7022, 8517, 9293, -1357, -5892, 13307, 28973, 23541, 800, -13049, -16645, -20275, -17532, -31076, -27579, -8701, 12495, 18616, -3823, -307, 19981, 31520, 22415, 2642, -3993, -23812, -21593, -8518, -11985, -12680, -5438, -10548, -6254, -15767, -16528, -3306, -4589, 2604, 15058, 12072, 5318, -14600, -31676, -10914, 3792, 15772, 19548]
5837A9548K056o180l213l103m592q223k174j1055j800L217k059O047Q725R613
5823F807L747J730n715l466k637O286O895j0761o123K262P674O768o377r959M43
5808b426R067J3023P843j1285m876j2551O943J4221J1941j5174q904N08r592M255
5794B993R458P157j94M181P184J186l602k290L764o357m414j5446M270J0515M293
5779B2698k040n787k0724o254J3364J0216L549M77j338K278p677l146J14j9470
5765a3740L985J4706O797J0683P72J268n24l477R490j532m145M164P744J8243
5751E4434j6748j1171j4267J0181j3020n930o118l099J3289K851p507K2323J0179
5738C5397j1480j0479r718j1789N125j2932K887K6844j4505j3718N623M508J262
$$ y = [19548, 21604, 15424, 12211, 9108, 4516, -3707, -5881, -16936, -18736, -15519, -17578, -11531, -2806, 6807, 10554, 12284, 6569, 3103, 466, 6752, 13647, 2886, -3237, -975, 6699, 13467, 7090, -2869, -2426, 6641, 19664, 27507, 16222, 11346, -1205, 5738, 19959, 31900, 16726, 7822, 8330, -1262, 2993, 12451, 19608, 19414, 23595, 30779, 31965, 28363, 26073, 29837, 23480, 19066, 3620, 7890, 18405, 22698, 20658, 14871, -5853, -12107, 1257, 11473, 15022, 15499, 14161, 16439, 8762, 5616, 5730, -13740, -9755, 4951, 11748, 22431, 23203, 24471, 23947, 20470, 29960, 28428, 24283, 28447, 36191, 54434, 37686, 26515, 12248, 22429, 9409, 3479, -2639, -5738, 7551, 10402, 2895, 25218, 35397, 23917, 13438, 3720, -8069, -2944, -15876, -12989, 13855, -650, -14368, -8745, -4237, -2975]
5725b975J592Q746m708o907m741l117J0050N507j066J0625m564L204n315j2724
5711f393q640q383K567P937R966J451j1227j1221k0943l449J1431N041R066K8969
5697F172J2946o8Q991J1166j7986k3018j3901L471O937p990K545K40O822O392
5683B719j7806k380R392r351M331J3531P216r914k707L865J0957J1922j4136m882
5669B757L964J2520m500k0258j1228Q308j3490J997J5613n015N948P99n253j210
5655i048N015J9722J4065j103m325O23j0514N44k654n494N24q603j2850L216O689
5640d193l540L451n366o197j0915P45J5639L579O314J0390M60l645L351L786m020
5625I839j648m485j5684q54J4501k445o305j0305N514K196j4187k3390J4020K3644
$$ y = [-2975, -1383, 7363, 2655, -4252, -8993, -12110, -2060, 3447, 2381, 13006, 8442, 11646, 6331, -6393, -15033, -23416, -20849, -12912, -2946, -1495, -12722, -23943, -44886, -48335, -36904, -31863, -22797, 6172, 19118, 19050, 28041, 39207, 21221, -1797, -15698, -12227, -5290, -13280, -10735, -10495, -3673, 2719, -15087, -17467, -8075, -17426, -13095, 436, 7652, -2262, -4969, -1104, 9853, 21775, 7639, 2757, 6721, 19241, 14741, -5517, -16745, -8437, -21927, -19930, -4317, -9332, -3384, -2585, -7838, -9048, -4033, 15689, 29754, 28651, 24326, 24949, 14435, 14979, 12325, 6831, 7355, -1248, -14098, -10882, -4193, -7733, -4282, -9648, -15845, -26760, -26015, -10376, -6797, -483, 9907, 10367, 6722, 10073, 13859, 9839, 8191, 3706, -11978, -12832, 1669, -776, -7081, -17386, -11872, -9676, -23863, -47253, -33233, -9589]
5611i589J9941o473j996j1193L417n127k739R711M949m574O143l939j0001K545
5597h925J4348o075O6O655J227m705K0037O196j7900L017L922O202j5975q900
5583h10j7490L818Q305j702j5915j160j805R919n379M666j596J7069M350r017
5569f747n397j632P609j0756j3783J1747J1808n615k247j2473Q719R258j0223
5556a9732k2289J142J6643P898l827j096O316q035j3028P701r350O479r3K156
5542b9115M727K0099M842l716R390j745R37k105L440l739m145J3519J141j847
5528A1683r902j6064J3410J671M18Q795l555p521M154j1829j1085J487R863Q571
5514I6M776j9193j1278N396J1859N586K852R927m963r807J4840m189J915N976
$$ y = [-9589, 10352, 3879, 1883, -9310, -5893, -11020, -13759, -4048, 901, -3673, 2470, -1469, -11470, -8925, 5423, -652, -586, 6069, 7296, 2591, 22628, 28824, 10924, 13941, 17863, 24065, 8090, -810, -18300, -14482, -6177, -7879, -23794, -24954, -26759, -16840, -22219, -17553, -19149, -2080, 2270, -6747, -12144, -13776, -6167, -16923, -30706, -18959, -7151, -12766, -15013, -27486, -18767, -9509, -19732, -42021, -40879, -24236, -16338, -20165, -21261, -14945, -22980, -36008, -28307, -37657, -31178, -31271, -29115, -24388, -4289, 553, -3163, 6227, 4482, 5419, 3314, 6754, 3015, -1130, 12389, 13530, 11683, 1781, -14283, -873, 798, 1216, 10011, 6456, -1065, 3089, -8740, -19825, -18338, -8475, 96, 4872, -14321, -25599, -20203, -8344, -2758, 94, 10021, 5058, -4749, 10091, 5902, 7817, 13793]
5500A3793j3968j6360J4674R069p364p873R323L795n658q466O941Q772M537m520
5486F695j2567p924P413Q659J2485N674r347J43p226j5557P028K2r051J048r517
5471b2022P342m109l020q013J4395O293n225N72Q664O557k122k429J2849j582
5457H150p640r55K438J3481p789j0735J51k942L732Q055J7921j528k1319j1451
5443a0431m395q392R423m433M62K361J7706N43p58m663q603n984n502q389J0283
5428b0772J9183J2682J0116N802r939j7549j0516j177j507p983o637N412J0565
5415a2320J2628l037l512N776N0J630J0876J009K199K374j0491l923k1731j9070
5401c7542J9130J3084R960M080P78j669j1313J821P897j6690N636K269Q82K094
$$ y = [13793, -175, -16535, -1861, 7208, -156, -8029, 1294, 5089, -569, -9035, -2094, 6678, 11215, 6695, -5872, -13796, -6383, 2276, 14761, 20435, 11088, 11231, 4005, -11552, -4524, -4502, -13553, -12505, -22022, -14680, -18789, -21809, -29822, -15427, -9134, -14359, -13787, -5123, 1434, -688, -3117, 9732, 8150, 510, -445, 1993, 15474, 7685, -3050, -2899, -5841, -2109, 5946, 23867, 22339, 1020, -10431, -14826, -23218, -13795, -18228, -17766, -15405, 2301, 2844, 2086, -2577, -11180, -17164, -22666, -31055, -20772, -1589, 11093, 21209, 27011, 17072, -477, -10993, -12170, -13677, -21660, -28297, -22885, -12320, 308, -2729, -6241, -465, -415, 1215, 12091, 13100, 15299, 17673, 7182, 3259, -18472, -37542, -18412, -5328, 4632, 8712, 9490, 7821, -3492, -1671, 6226, -10464, -4828, -2559, -1677, 417]
5387D17N591Q398o833k917l420n916o206R060N81M03K128q799o886j0330L475
5372b1254J0724L065l751k813j2837r961O364J0752p460J1341J3251J2044m404
5359E061O66k31p404k008n474k373j663M655j0878m605N777J3152J193O129P63
5344B760J731Q272J952j7514p424J7740k298j2890O714k134l285o093M61r043
5330b1051L840l062M30J4282Q577m629N492R515J896M61O501k1656j5622J81J016
5315a3829r171n503J5033k152l074M402j2445j1934J2051j2621R4K8500J6201
5302E552L813l787m255J108M557J3860m471k0737j156R10J39N59j0990N179M00
5287i319q652m603n239J5260j1614p71J736Q552J5205r990J580q370j187N663
$$ y = [417, 6008, 14406, 7573, 4656, 1236, -4680, -10886, -1826, -1245, -842, 1286, -7513, -14399, -24729, -21254, -10530, -7465, -11216, -14029, -26866, -36827, -30463, -19711, -27171, -15830, -2579, 9465, 5061, 5727, 5496, -1908, -3916, -9390, -11763, -13426, -8771, -19649, -24254, -18477, -5325, -4132, 1997, 2760, 4491, 12763, 14715, -2799, -10223, 7517, 5219, -7671, -957, -3091, -6376, -12469, -12008, -21051, -17211, -20273, -19843, -5561, 3016, -1613, 3879, 13394, 15290, 15751, 22252, 596, -15026, -14845, -13829, -23000, -28503, -13470, -15622, -18696, -14294, -26739, -38673, -26622, -39243, -39149, -10649, 5552, 9365, 5578, 1323, 2431, 6988, 20848, 16377, -4360, -5516, -4606, -4467, -3908, -14898, -9719, -9319, -17971, -22574, -27813, -12553, -24167, -24938, -23202, -14650, 555, -9435, -7855, -16225, -17412, -11749]
5273a1749j662m506J6496j5054M564N56Q11N179J6167K356j7710j563j734n337
5259a3186p6J928P951O913O812o039o32N588J4120o622j8340j2304p139K633R506
5244h887J3320K595j1145j9499J3325J9581m977j7913N698K046N520m823j5367
5231b0526r756P99O673K676N415J1405k067N878Q707O34k849K621l705q829l617
5216f541M921r46M725K03j4728K567J6250J1143j3113K484P846o003L6o737n516
5201c409m722O07O829j419O05P438p228L014O919K018j627J022j316L997J600
5186A4328L921j2782q579K88l486L840J1229o083o617L518m341m505j617M043
5172f843J2298P649l666K488k943l958j3766K958Q055j0190R623J0893j065M849
$$ y = [-11749, -13411, -17917, -1421, -16475, -11911, -11355, -10544, -5365, 10802, 13158, -4552, -6115, -7849, -13186, -13262, -11334, -3383, 3530, 10342, 4303, 3671, 9259, 23379, 16757, -1583, -13887, -21026, -18393, -8887, 4433, 7028, -4117, -23616, -10291, 9290, 4313, -13600, -7902, -5856, -336, -5159, -20526, -30282, -29483, -22810, -20134, -14719, -3314, -5381, 497, 9204, 9838, 6989, 9610, 5905, -2924, -6541, -1620, -2566, 2159, 2362, -12366, -9799, 6451, 17594, 4481, 6965, 14811, 8808, 8844, 2107, -3409, -8131, -7524, -695, -2114, -1509, 5929, -1299, 1715, 8634, 10652, 9025, 10047, 8731, 12728, 14328, 18249, 5467, -3112, -2824, -6310, -2470, 8759, 2676, -3941, -423, -4764, -9269, -10886, -6843, 5455, 13104, 9438, 11926, 8983, 5025, -8741, -5783, 2272, -7918, 1705, 12598, 11533, 16382]
5158A6382L9n1J191q658p459o632M631M773j130j715j734J555q342O02L527k401
5142e422K0457j503Q573n288j8263j1968K928N437R13J0860q57N053L610r118
5128E412J625N918m00m730j2151j157J1172P229j7245k797J4392j933K271k0417
5114a2811j817K099J2595J1757n737M998j5405K837P963M498L396J0557L129j1525
5100A6534j743K199Q716o975j1874m951K337Q599o328j4818j1255N783M893O693
5086b190N280K1575j6818j8535O640Q307m246k4333j1077J5862J0741J0299N179
5073F684o471K796J6988J1452j3407j4312L080Q070m726m223k872r527P494J450
5059B476r174K325J2669r687J322q236j315m949N383n885q779L114M343K970L98
$$ y = [16382, 16421, 16370, 17561, 8903, 1444, -5188, -557, 4216, 3086, 1371, -363, 1192, -7150, -6548, -3021, -5422, 15035, 13532, 22105, 16817, -1446, -13414, -10486, -5049, -4136, 6724, 5867, 10920, 14530, 5412, 7037, 12955, 12555, 7825, -4326, -5483, 5689, 12918, -4327, -7124, 7268, 5335, 7606, -12811, -14628, -12529, 66, 11823, 6086, 11084, -4321, -1484, 6479, 10977, 14373, 24930, 28059, 16534, 14791, 16990, 25706, 18731, 6857, 1906, 4243, 12842, 6514, -8304, -19559, -13776, -8883, -2190, 3090, 24665, 7847, -10688, -4048, 4259, 13, -24320, -35397, -19535, -8794, 1505, 6684, 213, 3009, 19997, 31449, 18042, 3730, 6810, 14880, 10154, 5931, 3059, -6468, 1026, 2476, -6698, -4373, 8296, -1391, -69, -8305, -9620, -14569, -9186, -15071, -23850, -20736, -16393, -13423, -13025]
5044a3025r070K531O239K6538R683R711P807k4285k8562P00J9803m423m642O188
5030E193L566K124j3748m974J1752o262K747L020k905Q656L17l464j7995q491
5016b0464L264J992K974n408K185M39j126j192M696N30N468K5930p125L082m455
5001A0790m202R692R843j084j2115j9536j0532N896R88M954J3417j0093q006O166
4987c822J4202r920L148l334j2888j350L325J8951p4j0957L020M758J609m483
4973B185k306L279m706n080Q41q329j3131J1216N617p909K5280M512m645R803
4959A6627K181j3259o589m099J0119p554L857Q317M365J901j480j0682n412j6481
4945a8189j093K605k725M101L134L348k70j3852Q149K1926J4715K503j6735k708
$$ y = [-13025, -22095, -19564, -13325, 13213, 22896, 32607, 40414, 16129, -12433, -11733, 8070, 3647, -995, 5193, 8759, 10883, -2865, -7839, 3913, -2349, 398, 3418, 513, 9169, 9486, 6022, -11973, -20464, -17200, -15208, -12234, -17642, -15457, -15018, -16144, -17336, -12640, -12110, -6642, 19288, 12163, 15245, 10790, 6588, 16280, 26123, 25039, 12924, -6612, -17144, -11248, -10260, -5306, 8111, -1982, -9988, -3822, 10380, 460, 3608, 274, -12614, -13964, -10639, 8312, 8238, -2719, 301, 5059, 6668, 2185, -121, 3158, -1548, -6628, -5787, -14116, -27247, -16031, -10414, -18323, 6957, 11469, 6824, 16627, 18808, 5549, -1040, -5139, 4980, -2574, 1283, 9600, 13965, 15866, 14386, 3704, -1708, -18189, -19282, -16677, -19402, -15301, -12167, -8819, -9089, -22941, -14792, 7134, 21849, 24352, 7617, 4909]
4931D909L380n778q266q550r54N125J2215J4654n364Q34p84l898N366o405K108
4916H592m13jJ1527J0624o6k685j4510k1597n927p47K4429L098q192q226J2287
4901H193J2624j6504j3520n389O719O101P534j156J3191p033J4148n182R534J3296
4887D2556l626j8477k0210q134j611J43p875J3881P163n666N021q506j6775j0565
4873c2681P770R556Q351P683o070k931j1635J3741R689k798j2197k959j4217J0530
4859a8168K651J1018P355O304l194k3501n485M676k969O599n09K626J0060J0100
4845G563j051p125Q577J2267j0410o760o189j3437O44p230R872J3074N552P587
4831A2934l223K928j3081p960n005m748r319l748J5466L605j6605O76J6592l950
$$ y = [4909, 8289, 2511, -5755, -14305, -15259, -10134, 2081, 16735, 11371, 12205, 11421, 7523, 12889, 6484, 8592, 8179, 8178, 19705, 30329, 30263, 27578, 13068, -8529, -14456, -15203, 9226, 12324, 4132, -4094, 8193, 20817, 4313, -9207, -14596, -7877, -1776, 5758, 4602, 17793, 10760, 24908, 19726, 29260, 42556, 38930, 20453, 243, -7891, -9502, -9359, -17234, -3353, 3810, -1856, 3165, -5341, -22116, -32681, -24911, -15355, -7004, 679, -5391, -8322, -19957, -6216, 3473, 675, -11522, -14481, -28698, -18168, -15517, -4499, 2856, 9160, 5966, -17535, -23020, -18344, -21313, -14714, -15223, -12597, -2537, 7563, 6512, -613, 7964, 20231, 9821, 3061, -3128, -16565, -15921, -23151, -13279, -205, 5347, 12934, 9711, 12639, -442, -8402, -13407, -18155, -27474, -31222, -15756, -12151, -28756, -28080, -11488, -15438]
4817a5438J9820J8382j489j3568r915j337R74J3238J7101N519n8l559m082j3702
4803A1886j6323O147R431m342m36J83m276r334m57j6168M424J2916J6528J3948
4789B4127J825M74j6707R30J989j7519j0923M575j3488J1867J3590r052o32L290
4775e654K060j1787O133O252J55n879j016Q880J0661l504J080l726j3763o95R929
4760h74p6J2718O442Q547k2303n161j545j292J1369L422M268k0337q808J937M986
4745f707Q367O626Q790J986k135q682k911p0o470k696j0453K115j437J1413J901
4730c63j1945p610N676J0197m983n099r129J0562J4205m586n628R735J4754m625
4716A1161k0180j4321L562J742J7710L885O64J1084j718l262o037o744L392o304
$$ y = [-15438, 4382, 22764, 21275, 7707, -2208, -3545, -2571, 10667, 27768, 33287, 33229, 29670, 25588, 11886, -4437, 1710, 11141, 6799, 6363, 6546, 2270, -7064, -7521, -23689, -19265, -6349, 10179, 24127, 25952, 26426, 9719, 10649, 12638, -4881, -15804, -11229, -24717, -12850, 740, -8312, -8944, -5654, -3594, -15381, -9248, -2996, -2841, -8720, -9736, -856, 9805, 6301, 7381, 3655, -10108, -10803, -874, -950, 11768, 18210, 26757, 4454, -707, -2252, -3544, 7825, 11247, 15515, -4822, -13630, -11693, -6707, 1660, 8286, 17076, 19062, 16927, 8245, 5334, 5264, -1206, -3902, -14355, -12240, -13677, -2264, -363, -12308, -19918, -14242, -4045, -9028, -14127, -23256, -12694, 1511, -3075, -8703, 1032, 15786, 11161, -9019, -23340, -19778, -18036, -326, 3559, 4223, 15307, 13589, 10327, 4290, -2454, 938, -5366]
4702e366M09J0324q391p516Q486P324q625k783m13J326J4139j286j8761J555J1494
4687A916R942J7910j4910O65R37j6965r975J0196J1566K140m153M15J3817M596
4673B8097j9245j3733K7543L958j8672M088J1714p232j0016j6302J574j0515k465
4660b1206J994j3634l192J3180J2259J7777Q083J7655k005k4408r656j0088J3470
4647B29O702j0516k746o814n567J2901R72o525j108o795K876J684r70m572J4963
4632e286O948j050N678r054n300l007q702j4065R684j186P189L432M949Q159K7676
4617B6065P998q181q241r394m599j1041l886j92P96P409o89m601J603O034o91
4602a610m312P587K547m366L927K788J450j1064R525j0208M819n07j2896l511
$$ y = [-5366, -4957, 5367, -3024, -10540, -2054, 5270, -3355, -6138, -6551, -5225, 8914, 7628, -11133, -9578, 1916, 11858, 29768, 14858, 15523, 16460, -505, -10480, -284, 11282, 13422, 9269, 9684, 23501, 28097, 8852, -4881, 22662, 26620, 7948, 12036, 23750, 16518, 6502, -9800, -8226, -18741, -21206, -19212, -32846, -36038, -22858, -10599, 7178, 15261, 32916, 30911, 6503, -3153, -13241, 229, 6931, -3585, -6331, -13145, -18712, -5811, -4839, -11364, -12472, -19267, -16391, -14707, -15677, -20249, -5286, 1662, 612, 6290, -2764, -8064, -11071, -19773, -33838, -24154, -25340, -18151, -14719, -9770, -1611, 26065, 34063, 25882, 17641, 8247, 3648, -7393, -11279, -11471, -10675, -3266, -3955, -8556, -6953, -919, -1610, -5922, 1665, 4212, -154, 3773, 6561, 8011, -3053, 6472, -3736, 1083, 576, -12320, -15831]
4588a5831R865J2731j2745n122J8169p97K642p542n106p715N63j823K080pN836
4573d802J3912j6696k2141j523J0762M201N949N680K235l361l30k278Q189K552
4559B349K513j268o055j3319M82O079K730N637n676L179L522K203J3045R277n586
4544A9112m708l264N790q438n684j2027o227O861r559O003J3867K508K473L177
4530I884J0184m600j0268l454k644Q29J2480p976n050J4002L310Q960J600r529
4516A7728q297J741K407k792O252j7394k598L305N971l376o456L838M341J0628
4502A5298q149K286j5711j946k733l252j2646L335L02O632N691k521Q93R904J7447
4487A4830j1069m05P288k21r491k2932j960P127J7759q645L41M860N795K2J6970
$$ y = [-15831, -5966, 6765, -5980, -11102, 7067, 6270, 8912, 1370, -3736, -11451, -10888, -12711, -10631, -10638, -4802, 9110, -7586, -29727, -31250, -20488, -16287, -10338, -4658, -2423, -5784, -6114, -8392, -203, 2349, 4862, 3594, -2461, -15780, -15298, -9219, -6489, -852, -6528, -3349, 173, 2376, 15421, 24698, 19112, 14404, 11140, 16930, 8492, 2808, -9219, -15446, -8585, -18144, -12141, 1726, 4234, 6707, 9884, 20068, 15468, 5200, 1746, -898, -69, 12411, 4435, -615, 13387, 16697, 25657, 27257, 17728, 9431, 11172, 13579, 10787, 17039, -355, -2953, 352, 6323, 2947, -3509, 329, 4670, 15298, 7149, 9435, -6276, -8222, -10955, -14207, -26853, -23518, -23216, -16584, -10893, -13414, -12521, -2617, 14830, 3761, 3356, 10644, 10423, 932, -22000, -23960, -16833, 926, -7719, -7378, -2518, 3277, 3299, 20269]
4472B0269o165m472R021o749j7481m506J5730J1255J922o905m583p415j4722L70
4458a4431J1395P64j3394j0649l074O793K0420J3195P940M517k0470j5436J378
4445a1052n301j534P02R568j354q151L527J7489j121n605P291n687k9J084j3372
4430a3545r599Q214l659J5723M550l1372o601J1774N878n268Q410P988j3391L991
4416a6907Q605r484K390K0686K1768j0570r294j4167r708l539K0055J6668m338
4403A2165p21q718m00N261l480j6091r459j219q331J8224J6176J637p314j0378
4389a2648j6035j5140P353J3684J2171J2162J605O525P51l612j1957p709Q97J2989
4375A036K883n730N724j1231j748J2351J0145k854p009j7755j3901J6728K7217
$$ y = [20269, 14104, 9632, 18653, 11904, -5577, -10083, 5647, 16902, 18824, 11919, 7336, -79, -14801, -14431, -3036, -2272, -15666, -26315, -29389, -22596, -2176, 11019, 18959, 23476, 3006, -12430, -11052, -16353, -17887, -17185, -7617, -8971, -17122, -13595, 3894, 2773, -2832, 4459, -1228, -1257, -173, -13545, -23144, -14930, -18589, -2866, 1684, -29688, -36289, -24515, -18637, -23905, -15495, -7507, -20898, -16907, -8302, -17786, -15396, 5290, 27058, 16488, 7194, -6973, -16681, -20220, -165, 16503, 12165, 11444, 2726, 2326, 7587, 4107, -11984, -21443, -22662, -30993, -12769, 3407, 5044, -2270, -12648, -28683, -43823, -36470, -22786, -10615, 1547, 3152, 9677, 10428, 6816, -5141, -12850, -11953, 1036, 3919, -1811, 3913, -7318, -9066, 3285, 13430, 10576, 3567, -14188, -28089, -11361, 15856]
4362A5856j0978j9569j1747J387J4811J7353L071p663m998o856O959r331q561
4349b0266J0275R903l31J188j1162L511n086L662N817Q330P692j554M846n760
4335A1065M138M311o011O025p228m421J2516o780l656K1268m33k0838j5088n514
4321a0646M990j1124J5740Q410q33J5325r823k6800k1533J811Q779J7117K4331
4308A5744j3202j4573M513l157J4718j828L870l054j3592l610L039j8087j126
4295c0345K3710j898o19R321l935n273L675m716M705J5876J6172k0619p466j925
4281c337o078J0427P621j3196l408J3043K764L069p260J497k9j187K415j4389
4267h048j0361J1079p122J2538K636J057n220J5843P118k295j0786M109r082j3471
$$ y = [15856, 4878, -14691, -26438, -25051, -10240, 7113, 10184, 2521, -2477, -9333, -2374, -11705, -20266, -9991, -88, -419, 769, -10393, -6882, -11968, -8306, -2489, 5841, 13533, 11979, 16825, 11065, 15203, 19514, 13503, 19528, 12300, 7879, 20395, 13615, 9959, 31227, 30794, 9956, -5132, -10646, -5656, -16780, -1040, 7370, 6537, 21862, 12039, -14761, -36294, -34483, -25704, -8587, 15744, 2542, -12031, -7518, -10675, 4043, 2215, 6085, 3031, -10561, -14171, -11132, -29219, -30345, -6635, -8533, -9152, 169, -3766, -9039, -5364, -10080, -5375, 10501, 26673, 6054, -1412, -3337, -9415, 1012, 8633, -4563, -7971, 5072, 7836, 10905, 3645, 5142, 5113, 3926, 6341, -8048, -18409, -7330, -14452, -1914, 722, 1779, -3441, 12402, 19520, 17225, 6439, 10548, 1466, -12005]
4253a2005n340K566J3498K99J879J430r798j06K4211J876l5858J78R467j992l320
4238a3015L51O386L068p39R9m439J545Q692J7k0641j3249Q898J6578K635n288
4223i102n62Q762N698p256N865m45M270p977p712M445J0462j4379j2537P891J9965
4208G388R879Q254l093m052j5214L236J0885r808n097n518P619o415q129J1024
4194I59K2640l219q417n308j4657L184J3526j766k520K350j0704j1760j0200j91
4180b6083J2055J0820R061k0904j561L506J0579p324O335N378l917Q330m634j1764
4166a0123R864J951J0166P14k375j0785O68J1996J1888p36j3607p849J6835J6640
4152C5247m200j5470j5480j9348l968Q939l818N297P582L0835j3704j4882P183
$$ y = [-12005, -17345, -14779, -1281, -982, 897, 2327, -7471, -7577, 16634, 18510, -17348, -17170, -7703, -9695, -13015, -12664, -6278, -3210, -3949, -3850, -8289, -6744, 1948, 1965, -18676, -31925, -23027, -6449, -3814, -9102, -9664, -902, 4796, -2460, 3405, 2960, 7230, -747, -8459, -4014, 6448, -7931, -20468, -12577, 7388, 17267, 25521, 22428, 18376, 3162, 6398, 17283, 7475, 2378, -3140, 4479, -1936, -10065, 959, 23599, 20380, 11963, 6655, -8002, -4818, 8708, 6942, 4422, 6772, -3932, -15692, -25892, -26083, -14028, -3208, 5853, -15051, -16612, -13106, -2527, -9851, -3516, 1862, -2055, 6275, 1641, -10123, -259, 1692, 11858, 12572, 10197, -588, 80, 12076, 23964, 23228, 9621, 1772, 18607, 35247, 31047, 15577, 97, -19251, -23219, -14280, -18098, -12801, -5219, 25616, 11912, -2970, 4213]
4139D213j1986K40J441O902K040J259j3880J0005m844k6675j81K176J1892N541
4125a1857k089P813j0604L279J2856J4677Q55l399k11J715j3575o020p221j7229
4111c1010P164J3366J2418J854m58J279J1101o986j2566p692j4108p257N356K0172
4097g367n007j4071J3219J6872Q259l133J1871n82R347k399l895m461r829j2329
4083c505J0742R478r943j4100j5180J5171J3321q095r453k243K495L020J5680
4070G388N954N454o636k6701J1047J5769o655p305o325r240j704J9255K93m816
4056d222o412q503O586P219M531R488j950m280r661r049r174M976K580J7720L587
4041C436j0716o012l791M531J6313K9695O497j018k2638r072j4024j963k699J680
$$ y = [4213, -7773, -7533, -6092, 810, 2850, 4109, -9771, 234, -4610, -31285, -31466, -29290, -17398, -11857, -13946, -6133, -16737, -13458, -602, 14075, 14930, 11531, 11320, 13035, -540, -6560, -13781, -31010, -23846, -10480, 1938, 3792, 3334, 4613, 15714, 8728, -3838, -11530, -25638, -32895, -27539, -7367, -12374, -26445, -13226, 3646, 11905, 8772, 20643, 20061, 29408, 27009, 23114, 18653, 8824, -3505, 7237, 16715, 6772, -7328, -22508, -7337, 5984, -2111, -11564, -13807, -11312, -8292, 7388, 13342, 18796, 12160, -14541, -3494, 12275, 5620, -1685, -8010, -17250, -18954, 301, 594, -4222, -10634, -19137, -12551, -5332, -801, 8687, 6737, 2457, -7204, -16253, -25427, -20451, -17871, -151, 3436, -7280, -13292, -17083, -12552, 3761, 33456, 39953, 38935, 16297, 7225, -6799, -8762, -11461, -9781]
4027i781J2113m65q966p905M619J0277j650J792M441j8439M373j143j0888q302
4013b9924P972J7249K3513J8933j2277j5524j3197j5321M031J5038j373M281O977
4000A0378j6477K722q69j869l859J2829J6451k791q539m797K766J993m725l875
3986f62J4634p31j848n89P665j531j7693j1832K256J2545l960p0J3750J490J044
3971A4468n589O794M798r398r363o055r813o396P509L521q752M185J5829l414
3957a676j366k18M888j0653p445J2215M76r713q94M808Q263P021J4749k70k319
3942A7866r610J859j5387j748O845K462k757p831L301J859Q771J4972L646p036
3928A7212k5244r268M216L559j1438N010n900J763J6454J2495j0404n098K793
$$ y = [-9781, 2332, 1867, -7099, -15004, -10385, -108, -1758, 34, 4475, -13964, -9591, -10734, -21622, -29924, -21952, -4703, 18810, 37743, 25466, 9942, -3255, -18576, -14545, 493, -880, 3401, 10378, -6099, -3377, -4246, -6115, -9974, 2855, 19306, 16515, 7976, 3179, 5945, 7938, 3213, -662, 13972, 13241, 11393, 10804, 18469, 16938, -755, -12587, -10331, 2214, -1746, -1816, 11934, 13424, 14468, 8879, 15673, 20471, 11073, 1710, -4345, -14158, -20554, -13045, -9524, -18276, -14091, 1738, -1676, -3042, -3260, 1628, -9025, -16470, -4255, -3779, -13492, -14386, -9578, -1315, 5706, 20455, 20185, 17866, 8256, 10115, -5272, -7020, -175, 2287, -470, -8301, -5000, -3141, 5630, 20602, 24248, 17212, -8032, -17300, -13084, -9525, -20963, -15953, -21853, -20090, -3636, 8859, -1545, -6643, -3850]
3915c850N700r6J827M588n61j1883j0359m248m078rO088J7600K3926k342o825
3900A5478j4257j4124o561J8422n57k019J2007k356m7J954P135n699r899n899
3886f422K242k861K941j491J7197K579r833j451j6976R329p600J3016O409j7258
3872a0179j3357l177K0449R050m330r630L021J2549J848o264j3506j0599j34K793
3858b1466J2933O970K843K565J3581K6l462K908j0798K335l245q065M433J0552
3844A2110r378n727k608j605R22L296K541o895L058Q110j113j2094l700q645R45
3829b0783o773q25L02j331J6282J5106M061k067O024o587j383l258K691J105q239
3814e675m678L221l597L849k087O344J1711L4m186N170j2645j4245l335m382j5918
$$ y = [-3850, 1850, 1754, 3581, 8169, 7608, -4275, -14634, -18882, -22960, -22969, -16881, 719, 24645, 22303, 15478, 1221, -12903, -19464, -1042, -1599, -3618, 8389, 6033, 5986, 7940, 15075, 9376, -523, -6422, -4180, -7041, -4100, -5591, 11606, 14185, 4352, 2901, -14075, -4746, -12346, 670, 7079, -10179, -23536, -26713, -6264, 2786, -1544, -11174, -8153, 4396, 6244, -20, -13526, -24125, -24259, -21466, -8533, -1563, 1280, 3845, 17426, 17452, 13990, 16898, 6100, 8435, 5190, -2875, 1558, 12110, 2732, -2995, -5603, -7208, -6286, -2990, -449, -7344, -4286, 3824, 2711, -9383, -13083, -21728, -20783, -27556, -28381, -28079, -29410, -13128, 1978, 6039, 3972, 9996, 3409, 2026, -1232, 1459, 2564, -5675, -10353, -7132, -10729, -6880, -8967, -2623, 9088, 9122, 4936, 10106, -2539, -16784, -20119, -24501, -40419]
3799d0419M928J6409l355N91J3723K4661k60j8247J0630M238r186k250R656K726
3785A3845M383q678m082j2457p285k249k773P364o492j226k380L720j541l844
3771b3695J7856J3641l488M751j432O687k767q625m473K871n420l935j4392J1078
3757a1343Q049Q947J9981l74n781j3764l14K979p867j6197M095J552N007Q923
3743C893o454L888K949l776k970L562N967j3365q604P076O777K111N866L204q425
3728A699m065P934P850j32J7750k933j8455K49N804l534q019O002j75J4804L120
3713B7899m138j9075j8820N123J0680J7325O466k063r968l267O709j4439p4q63
3699A495j3233Q624M437K161M794K045o825J2086m378L694O049j5160l686J4980
$$ y = [-40419, -35491, -19082, -22437, -21846, -8123, 16538, 16278, -1969, 8661, 12899, 3713, 1463, 11119, 13845, 18228, 9550, 5468, -6989, -14274, -16523, -19296, -11932, -18424, -19650, -22030, -18310, -19851, -23695, -5839, 7802, 4314, 9065, 7633, 14320, 11553, 2928, -1545, 1326, -4094, -8029, -22421, -11343, -3294, 5653, 25634, 25260, 19479, 5715, 5401, 8380, 513, -15684, -11589, -10037, -5030, 3893, -2561, 1327, 4276, 500, -2470, 1092, 7059, -6306, -14910, -7834, -1057, 1054, 6920, 10124, 1699, -2366, 5568, 13418, 13286, 31036, 28103, 9648, 9897, 15701, 12167, 4148, 10150, 9975, 24779, 27899, 23761, 4686, -14134, -9011, 1669, 18994, 25460, 23397, 13429, 10162, 16871, 2432, 2358, 1495, -11738, -3114, 1323, 3484, 8278, 10323, 3498, 15584, 11206, 14900, 20949, 5789, 2103, 17083]
3685A7083N936k365k0235j6414n321R063K69J1433K3118J2036q424r351J0236
3672B7064j81j0959k366J0039J437j4017p006r418M355Q172q718o609o479N548
3658i138k162L679N2p622L046l704p27m781J0636R161N358O706j3516j5060j3783
3643c1855k852J0258J6275j3466j6323Q365O129k51q291l939K587R010J6394O273
3629a686j235P75m918O114J4157K919R180j0813o412m752l297j477j1052L454
3615i043M594n483k790K2021K3733j455j7566k0185j3767J1443k00j720j528j2529
3601b4475Q7K098J0657J0007K0115J9388o950k5825j5906k863R639N982m42j0257
3587h745n95n337N840l016J0912M100O530m214R074K201o785j4696j5022k174
$$ y = [17083, 23019, 20654, 419, -15995, -21316, -12253, -11984, -551, 22567, 34603, 26179, 16828, 27064, 26883, 15924, 13558, 23597, 25034, 11017, 4011, -5407, -1052, 7120, -1598, -8207, -14686, -9138, -11300, -7621, -7569, -15191, -12145, -15849, -16576, -21357, -10721, -1560, 3798, 10504, -3012, -18072, -31855, -34707, -24449, -8174, -21640, -37963, -29598, -23469, -23720, -32011, -35950, -33363, -24353, -7959, -1686, -2921, -2146, -7064, -950, 13207, 16126, 25306, 14493, 8081, 3329, 32, -1445, -12497, -9043, -4449, -9932, -12722, 9299, 33032, 31577, 14011, -6174, -19941, -8498, -8698, -10418, -11946, -24475, -24388, -22290, -11633, -1626, 18489, 37877, 30927, 5102, -10804, -13667, -4028, 1954, 1512, -8745, -9340, -14677, -8837, -11853, -941, 3159, 9689, 5475, 14549, 16750, 9965, -4731, -19753, -21927]
3573b1927m891J0917J0474P603p11l79K29L032k624j021J0859k548Q424PL944
3558B1388l901J939J0584o116O09m672j5880j8077m098L39l842K572K9634M924
3544A5403j2066j3113N89j4253M85M867J0852r119N719q586k2531J1533J4831
3531a5389L3812k857p721K383j657M699M698q66L06J0261J444o066P218N087k968
3516C2384j7536k4095K097J1276L548n243m326n914R785q74M309o532p396j210
3502i727J7219J1714j3145n905L582j958q466q278O028L385P525l378r42o62o772
3487i780j965j0192j3166L309Q693R408j244n902J1451k968m327L230r768l660
3473b6881Q353j5773k42P539N881l597n513J548J3602j207j28J1072J4405j5762
$$ y = [-21927, -26818, -15901, -5427, 2176, 1465, 1086, 1315, 4347, 1723, 702, 11561, 9013, 17437, 17444, 21388, 17487, 19426, 30010, 23894, 24503, 19831, 3951, -14126, -18224, -17885, -21727, -19155, 10479, 15403, 3337, -9776, -9187, -23440, -22955, -18088, -7236, -16355, -10636, -19222, -41753, -30220, -15389, 18423, 15566, 7845, 10228, 8571, 13270, 17968, 17102, 17408, 27669, 29113, 23047, 30265, 35352, 32384, 14848, -9247, -7150, 4126, 7674, 2431, -1895, -7809, 1976, 1102, 5411, -1121, -8517, -9727, 7492, 19206, 6061, 156, 3738, 1780, -6686, -14964, -8936, -5551, 1974, -1404, -2346, -3008, -9780, -11745, -21937, -35103, -31794, -23101, -13693, -14937, -20839, -9388, -12356, -16683, -13453, -23221, -26881, -18528, -34301, -34543, -27004, -21123, -24720, -30233, -28685, -15083, -16290, -16418, -5346, 9059, -6703]
3459f703r587J6547J1732k506p155o845j1305q335j5518L37J1352J2768J6473
3446A255q27o603J734M624k2507j5656O672J6657R460o852o300r595k548J9352
3432a1134m777n337P335K645P064J869K430O11q537n22J0043J101j1839j1456
3418b0504O675O189m835j1959j2879K937J6263L86r913R385L32J4083M075l968
3404c733J0854O344O813O97l086k1078j1684j2593j165J4899J9288J940j7158
3391i662j2348N389M303o710J0124P728j2916N659j423m322M472M38m894J1763
3377b399j5584R128L365M369P508J707n44j4503j6811n419Q352M676O911J1847
3363B603O1m297O815J2599J4922p064n480j386j6293l122L646J475p735M708o18
$$ y = [-6703, -16290, 257, 11989, 9483, 2328, -4517, -15822, -24157, -39675, -39338, -27986, -15218, 1255, 428, -6175, -4441, 183, -22324, -37980, -31308, -14651, -5191, -12043, -18343, -27938, -30486, -11134, -15911, -21248, -13913, -11268, -4204, -2335, 95, 706, -7831, -8353, 1690, 2791, -9048, -20504, -13829, -7640, -12475, -24434, -37313, -34376, -18113, -17727, -27640, -18255, -17923, -3840, 235, -3733, 7121, 13465, 20278, 20975, 17889, -3189, -14873, -27466, -28631, -13732, 5556, 7496, -9662, -22010, -16621, -12318, -19028, -8904, -1176, -14092, -8433, -9856, -14178, -9706, -9268, -14162, -2399, -17983, -8855, -5490, -1121, 6387, 8094, 7550, -6953, -23764, -29183, -20831, -16155, -9244, 2603, 2664, -1633, 5182, 17781, 32703, 25639, 20159, 18773, 2480, -642, 3004, 4479, -3256, 1452, 834]
3348H34P40P445J2140l086j0656j2453k65N801K2065q8p995o049l955O119K3656
3333C4253m300j5395j2528n848J221L152K920n747k289k495L389n639j1916n567
3319b6789L512o876L664J0160K2653P2j1304j580o748q145P350R908m748p115
3305a5986j1064J379J3424J4033J7532r233j7782j254K231P991r302j4043N772
3292a6302Q568J0504J196n154p926q855j5815J2535O443N917J8239j0041j0104
3279a0795N810m315j000J3390q762l755J057L43j2543J097N71q770J0447J1245
3265e980M82N346P272R352J348L971M165r860j793j0410m748j1801L743O029O770
3250C886j2208o922L32J1702P54J3933R215q353p154p847J7034J6496k954l458
$$ y = [834, 1574, 9019, 21159, 18073, 7417, -5036, -5301, 500, 22565, 22477, 14482, 8433, 4478, 10597, 34253, 29953, 14558, 2030, -3818, -2597, 555, 3475, -2272, -4561, -7056, -3667, -9306, -21222, -26789, -23277, -30153, -26489, -16329, 6324, 6396, -4908, -6488, -13236, -21381, -14031, -4123, -8871, -15986, -27050, -25671, -12247, 1786, 19318, 10085, -7697, -8951, -6720, 1271, -8031, -22074, -16302, -7734, 2770, 3966, -1188, -9114, -17969, -33784, -21249, -14806, -8889, 9350, -691, -10795, -4985, -9300, -10300, 3090, -5672, -9427, -8370, -8027, -20570, -19473, -18902, -27672, -17225, -5980, -5498, -152, 7120, 16472, 17820, 21791, 25956, 16096, 14303, 3893, -855, -12656, -8913, -2884, 3886, -8322, -15244, -14912, -3210, -2456, 11477, 20692, 12339, 5185, -2662, 14372, 30868, 27914, 24456]
3236B4456n05r566N332O650j1726r596j1299J717J1204J0346K777k6100j4152
3223b0462R667J6491j4500m349Q680J2128K274j0323l995M494k184q588j755M858
3209g564N566J3407P247n220q867j4394j0552l579J771J0744J1270j0254L820
3196f605J5573l214M575Q891j3815j8586M922j762j34p250o952L559J9304J3577
3182A2083o285L253O518q977j1448n45K260J334m787n067K4304K0483o759j3374
3168A2993k817m994o196k200n626K038R464O634r589J485o083j592J2157K783
3154H457J2072m644j1199j0106j4488O571J0958J065J7824J6194k0179j8089M79
3141e085r52L808L090J0230K835k231j600M66m062k03N720J7738j2276k1861j1767
$$ y = [24456, 23951, 14385, 19717, 26367, 14641, 5045, -6254, -4537, 6667, 17013, 19790, -6310, -20462, -10795, 5696, -8804, -13153, -4473, 7655, 9929, -394, -4389, 105, -2079, -10667, -12422, -7564, -1998, 11409, 18656, 13436, 4569, -9825, -20377, -23956, -22185, -11441, -171, -10425, -6605, 8968, 5754, 10329, 19220, 5405, -13181, -8259, -10021, -10155, -17405, -24357, -20798, -1494, 12083, 5798, 9051, 15569, 6592, -4856, -5401, -3141, -1807, -6594, -11661, 12643, 33126, 26367, 12993, 10176, 5182, -1014, -3214, -8840, -6802, 2662, 9296, -293, 1192, -4891, -6483, 5674, 8457, 20529, 15885, 4686, -5420, -19908, -13337, -2379, -1314, 16510, 32704, 12525, -5564, -5085, -6037, -2229, 861, 11091, 13926, 11695, 10095, 10561, 6499, 6296, 12016, 29754, 17478, -4383, -16150]
3126a6150n600R102L552j0576L33J961q388k858n251K45J1216Q119K123N135Q79
3111f158j101R243K6k500J1582J1597q239J4534N893p746r155k018q133p201j0537
3096i913j1925J527J0189P168l231N919j2569R019J2555j0676N207Q431l748j847
3082F106j105Q599j1322k713j0778j5494l07J112J7980M898p258O654J8137o358
3068H151j1374k075P197o27O713K031m690q831l364O437J2011j2536j3920N226
3054i651n249q151J3061j872q00J2669R267o363j627J157n987k725Q538J3753
3040A6020R629j347j4911L798m305l409L372Q285O69M683P62q191M400p82k546
3025A6127j971J606j4655J948R966R491l03m380o277n045r78J018n507k799O11
$$ y = [-16150, -21750, -12648, -9096, -19672, -19339, -17378, -25766, -28624, -33875, -33630, -22414, -14295, -12172, -7037, -6158, -7259, 1984, 2010, -490, 11092, 22689, 14450, 28984, 34877, 27131, 17976, 15958, 7825, 624, -9913, -21838, -20311, -10122, -2954, -6185, -266, -12835, -3816, 8739, -1937, 3270, 11701, 7953, 6106, 5001, 13600, 2278, -435, -11213, -26707, -27014, -25902, -7922, -3024, -10282, -3628, 14509, 8151, -3223, -5298, 1899, 1272, 7985, 10016, 5326, -3505, -6869, -432, 11579, -957, -14877, -9651, -14900, -23051, -9990, -11862, -12662, 7, 9274, 2911, 1284, 2441, -3546, -6271, 2267, 16020, 25649, 24302, 9391, 13189, 8884, 5475, 8847, 17132, 17801, 22484, 23246, 15055, 19455, 18673, 16127, 14156, 15762, 1107, 3055, 13021, 22512, 22209, 17829, 11552, 6507, 5529, 6547, 1040, -1759, -1148]
3010a148N954j5104J6199K417m512J2081J0874m89j0112j1265o143Q570L800j1378
2996b56n448m853l550L422J4181J6914j3473j9717M248J889r900j6840j2287p230
2982e2900J0741J9328k423J6554J2895n41J8176o515l941j4631J200R15P371M621
2968A0850O592m048l789p458m990J538L798J0424j455K29j4635J777N670K468
2954F971k0275L35p88P242J489o696q868N115l036j091L65r264j0306M096J7126
2939a7585J8604P816J042m859M514J245m983p822j2172j2327j0504N508K2579
2926h944O260R963n763L837l901L699l279J191Q317k6371l725J588l412K3018
2912B478J3299j5999M981Q869k117o891Q150q042o764m231K378m281j2692J697
$$ y = [-1148, 4806, -10298, 5901, 8318, 3806, 15887, 26761, 26272, 16160, 4895, -1248, 7322, 11122, -256, -5704, -10557, -14107, -10685, 3496, 20410, 6937, -12780, -8532, -6643, -16543, -33383, -45670, -52900, -42159, -22831, -25254, -8700, 4195, 3654, 21830, 15315, 11374, -3257, -2057, -1142, 6229, 10850, 17442, 13394, 9605, 2147, -2843, -1305, 2493, 12917, 11462, 11691, -2944, -1167, 4503, 6971, -13304, -12969, -13757, -6515, -5026, -11722, -20590, -15475, -18511, -19602, -19237, -28501, -38807, -34711, -17585, 1019, 8835, 9877, 5018, 9532, 10777, 5794, -2028, -14200, -26527, -37031, -31523, -8944, -2684, 7279, 1516, 5353, 1452, 5151, 1872, 3063, 11380, -14991, -18716, -17128, -20540, 2478, 15777, -222, 4759, 13628, 11511, 4620, 12770, 4728, -2036, -6267, -3889, -8170, -20862, -19165]
2898a9165J9839J7366j4700M651J2148n635j5459n154N474K874m538k229J229
2885c299L366j362k95K959J75k625M141Q276l676R75m910J1229j0205J211j912
2870D048j6030m247N136N061p082M557J2159L537j7360N379j1425J0528J4050
2857H311K5j3464j145j215O391J8917J0960j1943j3262j8152n797o659O049n384
2843b6368J028J2194Q382k273O30J2499K976R04J2242r126k0008m945O987K083
2829b795J6074J0399k3853q564j6585R146M634l96k163Q087N441L654l298k135
2815b354K09P334J675r982J1614N236j1097k1234L90K4072j461j536j793P409
2801H482q286l713J006j7545m280k738N099N054M270J791J568J5993J4482j1964
$$ y = [-19165, 674, 18040, 3340, 7991, 20139, 14504, -955, -6109, -635, 2239, -2299, -4528, -3299, 67, -1295, -1590, 1369, 1544, -1081, 3060, 11336, 7660, 8635, 3725, 14954, 4749, 5960, 4048, -11982, -16229, -11093, -6032, -13114, -8557, 3602, 7139, -10221, -4842, -16267, -5739, 8311, 8336, -5128, -6273, -7488, -1097, 17820, 28780, 16837, 3575, -14577, -20374, -27033, -20984, -26368, -25340, -13146, -4764, -7037, -6407, 6092, 9068, 9972, 22214, 13088, -6920, -11865, -4878, -2795, 13279, 23678, -175, -8739, -25324, -16178, -11544, -11940, -14103, -6016, -575, 3079, -219, -2354, -2145, 5189, 6864, -3118, 8496, 13732, 2635, -18599, -18209, 5863, 4402, 2866, 1073, 8482, 196, -3517, -2511, -20056, -24336, -27074, -21975, -16921, -12651, -10860, -9292, 6701, 21183, 9219]
2787I219j3344J0233k56q45J334j3309n061J752O39m04p800j60q56P04k987n42
2771b1683J7881J7373O706j6055p279K068j7145j0855P477J5197P439M92K345
2758C961p99J0900N807m827j5l831N472m366k190o356P23o96r192o813o932L265
2742a5889L018o616P585J585N485P002k59j4872m620K106L760l618o390n093K823
2727b3993L544J7576J0554j415M038R927J011j1978k2285j3992Q011J3201K125
2714c676R782R407n232m547J668n941K895J1355p02q540k320o022n291R216R395
2699A1447K199M739l218O330J90j0314R33J80r834n752N315n758J1236J0724j3414
2684E003l634p282j009O839R40J0808J1680R75j2462L091R517j6813j1271J2536
$$ y = [9219, -4125, 6108, 5852, 5007, 6341, -6968, -12029, -10277, -9638, -10042, -17842, -18002, -18858, -18154, -21141, -21683, -3802, 13571, 20277, 4222, -3057, -989, -18134, -28989, -21512, -6315, 1124, 1616, 3961, 3162, 14062, 19869, 15042, 15027, 11196, 16668, 12302, 10112, 3756, 4479, 3783, -5409, -12222, -19154, -15889, -12871, -19487, -11902, -10317, -4832, 2170, 1911, -12961, -17581, -15475, -11715, -15333, -21723, -26816, -23993, -20449, -2873, 7681, 6266, 10304, 20231, 21242, 9264, -13021, -27013, -19002, -5801, -3676, 6106, 15513, 10281, 5734, 7402, 1461, 4356, 15711, 15009, 6469, 4149, -1873, -7164, 2052, 11447, 13646, 18385, 15167, 21497, 21687, 11373, 12306, 12486, 2652, -3100, 2215, -3543, 7693, 18417, 5003, 1369, -5913, -6922, -83, 857, 11665, 23345, 24320, 11858, 14949, 24466, 7653, -3618, 8918]
2670H918N122k732o73l198j261M258R382k945m412n047j164K675O368j243j2908
2655A140j3104O451K0717O475j1694j2943o978j0700N265Q890M92k188J2197l05
2641C715j2016p299K140M517M904J6512m074l678L303M580j5300M353Q719q228
2627B148m02o610L773p000J44Q895R168O798J3555J0809j1515m080k256k2753
2613F74L34K2109j873l05l859j4658j5540n63J0526J1527l392J462p676L624l741
2598a351P657m773k325k248K599k0006o706O975k016J2382J2271J42K674N332
2584A0607l967K288R80J1580P029p206O917j1976j4004R88k568j383J447J263
2570A995L110J828r109j2994p399N195j7265M491J9106K1925J0477N979j2807
$$ y = [8918, 14040, 11308, 10635, 7437, 6176, 10434, 19816, 16871, 12459, 7412, 6248, 8923, 15291, 14048, 1140, -11964, -5513, 15204, 21679, 9985, -2958, -9936, -20636, -15371, -6481, -5989, -8177, 4020, 3715, -8301, -15600, -13460, -8943, -4039, 12473, 8399, 4721, 8024, 12604, -2696, 1657, 10376, 2148, 1746, -4864, -1091, -8091, -7947, 948, 10116, 16914, 30469, 41278, 29763, 25683, 23427, 674, 1008, 23117, 21244, 20939, 17080, 2422, -13118, -13681, -3155, 8372, 4980, 6442, -1234, 2390, -1351, 6306, 1533, -792, -3040, -441, -20447, -27153, -20178, -22194, -9812, 2459, 2601, 5275, 10607, 6640, 8928, 9908, 21488, 28517, 21311, 28228, 16252, 2248, 3236, 668, -715, 732, 1995, 5105, 6933, -2176, -15170, -22569, -17374, -34639, -30148, -11042, 10883, 21360, 27339, 14532]
2557A4532j6852j0294j4039K682P422O68M30P166O639p414K200j0007k821p589
2543b7277j1127R376J1389O61J543J4494p905N817o080j716L493l817K662n902
2529a4389O062l914r686J607l77K044O031R766R049j000j741r456j3514k7959
2515d7477J980R711J4582K5095K145p7n535O718J351L140j0875p484q781J0443
2501e064J1325Q195K781r416P051O231l527o189n013J299P013P100N891r909j4973
2486B795j4208J1441j394N14K013l251j5806L381J6498L268r491l571K772J2623
2472G584K159J2995L870n725j4804L25J4157j4181k0715Q080R430J1944K34l387
2458A1966k483j4313j6684M346R981p476K518O458L616k196P652N771j3118o84
$$ y = [14532, -2320, -12614, -26653, -23971, -16549, -15881, -15451, -8285, -1646, -9060, -6860, -16867, -19688, -27277, -38404, -29028, -17639, -16978, -15435, -941, -8846, -3029, -9109, -10825, -7332, -11149, -8487, -14389, -8327, -12241, -21927, -20320, -20697, -18653, -12622, -2856, 6193, 5193, 3452, -6004, -19518, -47477, -45497, -35786, -21204, 3891, 6036, 5959, 424, 7142, 8493, 11633, 758, -6726, -15507, -5064, 6261, 14456, 17237, 7821, 14872, 21103, 17576, 11387, 6374, 7673, 14686, 21786, 27677, 17768, 2795, -11413, 28, -1366, -852, 1161, -2090, -17896, -14515, 1983, 5251, -4240, -7811, -5039, 7584, 9743, 22738, 26608, 20883, 6079, 6404, 20561, 6380, -14335, -6255, 3175, 15119, 15353, 11966, 9483, -4830, -21514, -17168, -7187, -14663, -12145, -5687, -2071, -4267, 3385, 9156, -3962, -4646]
2444d646J4658R315r13K932J787r51M220P832q724l434Q789M533m775q292p267
2429A5064j0120r804J4375k852r884j6101N888J188l429K537J0307j911M791J946
2415A995K144J0683o801j4476K988J1028J053r780l996R170J3539K059k755r223
2401G628M35n94M120j3571j870R770n227j6942n689P010J020M970j445j5437m287
2386c0109P671N861P85N813Q880o022p881r993J1887L282o815J7841P578K319
2372A1097J2444q863j8583r055R75J2930N051j0700o026J1714k640n056o217n637
2358a8566K9665L07j007K704N949M512Q252k1350M574j4765Q934J3892Q203n642
2344B5662o382r816j4177k65L496N482n167q69J1181Q599m82K321j5311j41L037
$$ y = [-4646, 10012, 19327, 18414, 21346, 23133, 22182, 26402, 34234, 25510, 22076, 30865, 35398, 30623, 22331, 15064, 4944, -4860, 9515, 6663, -3221, -19322, -13434, -12246, -15675, -13138, -2831, -4742, 49, 1995, 4139, 14822, 8021, -6455, -3467, 7561, 8614, -1166, -5162, 4008, 17547, 19606, 16851, 7628, 8063, 7469, 11589, -1982, -3852, 5918, 691, -16251, -21940, -14930, -13910, -8940, -10385, -25822, -30109, -22438, -16577, -15792, -9979, -1099, -7121, -15002, -24995, -13108, -9826, -16641, 1200, 8778, 11097, 23541, 14678, -3905, -12960, -11985, 945, 5996, -4704, -10730, 984, -1656, -6712, -12929, -18566, 11099, 11406, 10399, 13103, 19052, 23564, 31816, 10466, 15040, 275, 9209, 23101, 31304, 25662, 19280, 9464, -4713, -4978, -1482, 4000, -1167, -2036, 9145, 17744, 17262, 19583, 4272, 4131, 7168]
2329G168j6064j223M823M714J2342j728L818Q31p1L95k804o12o969q275j0744
2314a4399M3R031L607O771J5950K666o255j987N745j711j4665m751R216l21J81
2299I121M847L36o326j731j0843J412j1556Q25m517j5227N726K477P671J9836
2285B051l32j9842M50J8421O90J115L017q725j2994J1325J2644j1131j096n022
2271i429n916J2033J0192j1683k793L225j3447P518N202O391k061q493J1144R149
2257A1032m63j3880J962Q92r902n269k487J3896K8663m16j6760j3578o219K0284
$$ y = [7168, -8896, -10119, -5296, -582, 11760, 10032, 13850, 14681, 14610, 15005, 12201, 11589, 4620, -3655, -14399, -14356, -5325, -1718, 5053, 21003, 23669, 17414, 15427, 21172, 19461, 4796, 45, 9261, 8940, 9121, 13968, 14304, 7978, 6247, -4596, -3184, -14740, -13915, -18432, -33659, -27933, -25456, -17785, 2051, 1719, -18123, -17673, 748, 1438, 2553, 5570, -3155, -16149, -4824, 7820, -3311, -4407, -9429, -15345, -3312, 6880, -4803, -7596, -4371, -17818, -10300, -5098, 1293, -768, -9261, 1883, 11032, 10569, -3311, -1349, -457, -10359, -15628, -18115, -4219, 24444, 24028, 7268, -6310, -12529, 7755]
$$ [...]
##END NTUPLES=NMR SPECTRUM
##END=
