##TITLE=Analysis number 320818
Compound Code cc 49622
Book Reference 449/124
Project Code adrs
Chemist Name davee
##JCAMPDX= 6.0         $$ Bruker NMR JCAMP-DX V2.0
##DATA TYPE= NMR SPECTRUM
##DATA CLASS= NTUPLES
##ORIGIN= Bruker BioSpin GmbH
##OWNER= nmr
$$ XWIN-NMR		Version 3.5
$$ Wed Jul 12 11:47:31 2006 GMT Daylight Time (UT+1h)  MAYBRIDGE\nmr@NMR_250MHZ
##.OBSERVE FREQUENCY= 250.131544655141
##.OBSERVE NUCLEUS= ^1H
##.ACQUISITION MODE= SIMULTANEOUS (DQD)
##.ACQUISITION SCHEME= undefined
##.AVERAGES= 16
##.DIGITISER RES= 18
##SPECTROMETER/DATA SYSTEM= dpx250
##.PULSE SEQUENCE= zg30
##.SOLVENT NAME= CDCl3
##.SHIFT REFERENCE= (INTERNAL, CDCl3, 0, 16.522)
##AUDIT TRAIL= $$ (NUMBER, WHEN, WHO, WHERE, WHAT)
$$ ##TITLE= Audit trail, XWIN-NMR		Version 3.5
$$ ##JCAMPDX= 5.01
$$ ##ORIGIN= Bruker BioSpin GmbH
$$ ##OWNER= nmr
$$ C:\u/data/dgb/nmr/ADRS/2600/pdata/1/auditp.txt
$$ ##AUDIT TRAIL=  $$ (NUMBER, WHEN, WHO, WHERE, WHAT)
(   1,<2006-07-12 11:47:07.76 +100>,<MAYBRIDGE\nmr>,<NMR_250MHZ>,
      <created by zg, POWCHK disabled, PULCHK disabled
       configuration hash MD5:
       E2 DF 36 D8 04 B2 41 60 5A D7 A3 38 5A 4B D0 FE
       data hash MD5: 64K
       0D D7 F9 56 BE D2 CD E0 1B BF E6 3C 0B 7D DA 90>)
(   2,<2006-07-12 11:47:21.27 +100>,<MAYBRIDGE\nmr>,<NMR_250MHZ>,
      <Start of raw data processing
       ef LB = 0.3 FT_mod = 6 PKNL = 1 SI = 32K 
       data hash MD5: 32K
       C9 6B 9E 62 65 63 CD 7C 67 A9 10 6D CF 47 A2 C5>)
(   3,<2006-07-12 11:47:22.97 +100>,<MAYBRIDGE\nmr>,<NMR_250MHZ>,
      <apk 
       data hash MD5: 32K
       C2 F1 CC BD 05 15 70 03 E8 39 C3 5D F7 ED 10 45>)
(   4,<2006-07-12 11:47:23.71 +100>,<MAYBRIDGE\nmr>,<NMR_250MHZ>,
      <abs ABSG = 5 
       data hash MD5: 32K
       55 1E 30 C4 0E FF A3 A2 59 E3 3E 86 33 C4 F9 BA>)
$$ ##END=
$$ 
$$ hash MD5
$$ F9 5D 24 2B 40 1A 73 4A 51 AF 0A 9F F2 3C 2B A3
##$RELAX= 
##$RELAX= 
##$RELAX= 
##$RELAX= 
##$RELAX= 
##$RELAX= 
##$RELAX= 
$$ Bruker specific parameters
$$ --------------------------
##$DU= <C:\u>
##$EXPNO= 2600
##$NAME= <ADRS>
##$PROCNO= 1
##$TYPE= <nmr>
##$USER= <dgb>
##$AMP= (0..31)
100 100 100 100 100 100 100 100 100 100 100 100 100 100 100 100 100 100 
100 100 100 100 100 100 100 100 100 100 100 100 100 100 
##$AQSEQ= 0
##$AQ_mod= 3
##$AUNM= <au_zg>
##$AUTOPOS= <17 >
##$BF1= 250.13
##$BF2= 250.13
##$BF3= 250.13
##$BF4= 250.13
##$BF5= 500.13
##$BF6= 500.13
##$BF7= 500.13
##$BF8= 500.13
##$BYTORDA= 1
##$CFDGTYP= 0
##$CFRGTYP= 5
##$CHEMSTR= <none>
##$CNST= (0..31)
1 1 145 1 1 1 1 1 1 1 1 1 1 1 1 1 1 1 1 1 1 1 1 1 1 1 1 1 1 1 1 1 
##$CPDPRG= <>
##$CPDPRG1= <>
##$CPDPRG2= <>
##$CPDPRG3= <>
##$CPDPRG4= <mlev>
##$CPDPRG5= <mlev>
##$CPDPRG6= <mlev>
##$CPDPRG7= <mlev>
##$CPDPRG8= <mlev>
##$CPDPRGB= <>
##$CPDPRGT= <>
##$D= (0..31)
0 1 0 0 0 0 0 0 0 0.06 0 0 0 0 0 0 0.0002 0 0 0 0 0 0 0 0 0 0 0 0 0 0 
0 
##$DATE= 1152701226
##$DBL= (0..7)
120 120 120 120 120 120 120 120 
##$DBP= (0..7)
150 150 150 150 150 150 150 150 
##$DBP07= 0
##$DBPNAM0= <>
##$DBPNAM1= <>
$$ [...]
##$SUBNAM7= <"">
##$SUBNAM8= <"">
##$SUBNAM9= <"">
##$SW= 20.6930455092707
##$SWIBOX= (0..15)
0 0 3 0 0 0 0 0 0 0 0 0 0 0 0 0 
##$SW_h= 5175.983436853
##$TD= 65536
##$TD0= 1
##$TE= 296.16
##$TE2= 300
##$TE3= 300
##$TEG= 300
##$TL= (0..7)
0 120 120 120 120 120 120 120 
##$TP= (0..7)
150 150 150 150 150 150 150 150 
##$TP07= 0
##$TPNAME0= <>
##$TPNAME1= <>
##$TPNAME2= <>
##$TPNAME3= <>
##$TPNAME4= <>
##$TPNAME5= <>
##$TPNAME6= <>
##$TPNAME7= <>
##$TPOAL= (0..7)
0.5 0.5 0.5 0.5 0.5 0.5 0.5 0.5 
##$TPOFFS= (0..7)
0 0 0 0 0 0 0 0 
##$TUNHIN= 0
##$TUNHOUT= 0
##$TUNXOUT= 0
##$USERA1= <user>
##$USERA2= <user>
##$USERA3= <user>
##$USERA4= <user>
##$USERA5= <user>
##$V9= 5
##$VALIST= <valist>
##$VCLIST= <CCCCCCCCCCCCCCC>
##$VD= 0
##$VDLIST= <DDDDDDDDDDDDDDD>
##$VPLIST= <PPPPPPPPPPPPPPP>
##$VTLIST= <TTTTTTTTTTTTTTT>
##$WBST= 1024
##$WBSW= 4
##$XGAIN= (0..3)
0 0 0 0 
##$XL= 0
##$YL= 0
##$YMAX_a= 426560
##$YMIN_a= -588524
##$ZGOPTNS= <>
##$ZL1= 120
##$ZL2= 120
##$ZL3= 120
##$ZL4= 120
##$ABSF1= 16.522
##$ABSF2= -4.171173
##$ABSG= 5
##$ABSL= 3
##$ALPHA= 0
##$AQORDER= 0
##$ASSFAC= 0
##$ASSFACI= 0
##$ASSFACX= 0
##$ASSWID= 0
##$AUNMP= <proc_1d>
##$AZFE= 0.1
##$AZFW= 0.1
##$BCFW= 0
##$BC_mod= 0
##$BYTORDP= 0
##$COROFFS= 0
##$CY= 12.5
##$DATMOD= 1
##$DC= 0
##$DFILT= <>
##$DTYPP= 0
##$F1P= 14.0000005364418
##$F2P= -0.99999901652339
##$FCOR= 0.5
##$FTSIZE= 32768
##$FT_mod= 6
##$GAMMA= 0
##$GB= 0
##$INTBC= 1
##$INTSCL= 1
##$ISEN= 128
##$LB= 0.3
##$LEV0= 0
##$LPBIN= 0
##$MAXI= 10000
##$MC2= 0
##$MEAN= 0
##$ME_mod= 0
##$MI= 0
##$NCOEF= 0
##$NC_proc= -3
##$NLEV= 6
##$NOISF1= 0
##$NOISF2= 0
##$NSP= 0
##$NTH_PI= 0
##$NZP= 0
##$OFFSET= 16.522
##$PC= 1
##$PHC0= 162.119
##$PHC1= 8.685015
##$PH_mod= 1
##$PKNL= yes
##$PPARMOD= 0
##$PSCAL= 4
##$PSIGN= 0
##$REVERSE= no
##$SF= 250.13
##$SI= 32768
##$SIGF1= 0
##$SIGF2= 0
##$SINO= 400
##$SIOLD= 32768
##$SREGLST= <1H.CDCl3>
##$SSB= 0
##$STSI= 32768
##$STSR= 0
##$SW_p= 5175.98343685301
##$SYMM= 0
##$S_DEV= 0
##$TDeff= 65536
##$TDoff= 0
##$TI= <Analysis number 999999
Compound Code 99
Book Reference 9
Project Code 9>
##$TILT= no
##$TM1= 0
##$TM2= 0
##$TOPLEV= 0
##$USERP1= <user>
##$USERP2= <user>
##$USERP3= <user>
##$USERP4= <user>
##$USERP5= <user>
##$WDW= 1
##$XDIM= 32768
##$YMAX_p= 494550706
##$YMIN_p= -600316
$$ End of Bruker specific parameters
$$ ---------------------------------
##NTUPLES= NMR SPECTRUM
##VAR_NAME=  FREQUENCY,     SPECTRUM/REAL,   SPECTRUM/IMAG
##SYMBOL=    X,             R,               I
##VAR_TYPE=  INDEPENDENT,   DEPENDENT,       DEPENDENT
##VAR_FORM=  AFFN,          ASDF,            ASDF
##VAR_DIM=   32768,         32768,           32768
##UNITS=     HZ,            ARBITRARY UNITS, ARBITRARY UNITS
##FACTOR=    0.157963299565203, 1,           1
##FIRST=     4132.6476996994, 0,             0
##LAST=      -1043.33573715361, 0,           0
##MIN=       -1043.33573715361, -600316,     0
##MAX=       4132.6476996994, 494550706,     0
$$ Real data points
##PAGE= N=1
##DATA TABLE= (X++(R..R)), XYDATA
$$ [...]
##PAGE= N=2
##DATA TABLE= (X++(I..I)), XYDATA
17880b381921P925R074j017j9716m0309J1642J8097Q492K7098K8148k297j922
17868b336706K4087O242J6088J8156p488J466N869K959l1710J23K486P274K9391
17855b261763k5986k6509J6199J9506K2619Q062J7868k0931k3923k4470j3557
17844b312885L4755M6212p367l1389R553K536R376J2284L1761N19j7118K0091
17832b201672J7220P266J703K2294o953J7244j9j8455J7424Q02J5557J9037J8317
17819b090235K3865K7778K1546Q010p313j0406k8126j6219L4752J6973J2743j3128
17807b019760K5075k471j1778k2740j9101K9001K3478P19J4147Q349L5493k478
17795a942066j4483n84K0245P682n470P905K587m5392J0973K7554J7864K8811
$$ y = [-2381921, -2373996, -2364922, -2365939, -2385655, -2425964, -2414322, -2396225, -2387733, -2360635, -2332487, -2334784, -2336706, -2312619, -2306377, -2290289, -2272133, -2279621, -2278155, -2272286, -2269327, -2301037, -2300914, -2298428, -2291154, -2261763, -2287749, -2314258, -2298059, -2278553, -2255934, -2247872, -2230004, -2250935, -2274858, -2299328, -2312885, -2278130, -2231918, -2239285, -2270674, -2261121, -2258585, -2249209, -2236925, -2205164, -2204645, -2221763, -2201672, -2184452, -2177186, -2175483, -2153189, -2160142, -2142898, -2142917, -2161372, -2143948, -2143146, -2127589, -2108552, -2090235, -2066370, -2038592, -2017046, -2009036, -2016349, -2026755, -2054881, -2071100, -2036348, -2019375, -2006632, -2019760, -1994685, -1997156, -2008934, -2031674, -2050775, -2021774, -1998296, -1997577, -1983430, -1975081, -1939588, -1942066, -1956549, -1957133, -1936888, -1929206, -1934676, -1926771, -1924184, -1969576, -1958603, -1931049, -1913185, -1884374]
17783a884374J0574k6095J1072q864l5352m6761K518K9874J0943j9948K7307K4736
17771a904370q439J1678k4310j4701n02K7359K3193M236K2601j2289l7215k3817
17759a936576L4063L4778k644M375l213M18j6548J3350J0411Q817k607m238k1089
17746a880703L774K0912K527K2327J4440L011j7557q124M8501K5475N2714R854
17734a702849l3311k7569k9201k5967Q811J7567L599k5923q673n17l3706m9844
17722a907583O26K5498R316p107q974P942j9403J1680j462j1414O782K9740J7828
17709a846531J4873N53n010J5061K9932K7054p198j0427K8532k396m4156J34J3385
17696a786194L0110L2587K5962L452J0239K2748j1539j4483K5L3931j0483j5455
$$ y = [-1884374, -1873800, -1899895, -1888823, -1897687, -1933039, -1979800, -1977282, -1947408, -1936465, -1956413, -1929106, -1904370, -1912809, -1901131, -1925441, -1940142, -1940644, -1913285, -1890092, -1885856, -1863255, -1875544, -1912759, -1936576, -1902513, -1867735, -1870379, -1866004, -1869217, -1868799, -1885347, -1871997, -1861586, -1852769, -1855376, -1859614, -1880703, -1876929, -1856017, -1853490, -1831163, -1816723, -1813712, -1831269, -1839393, -1790892, -1765417, -1712703, -1702849, -1736160, -1763729, -1792930, -1818897, -1810086, -1792519, -1788920, -1814843, -1823516, -1824033, -1857739, -1907583, -1906957, -1881459, -1872143, -1879250, -1888224, -1880282, -1899685, -1888005, -1889467, -1900881, -1894099, -1864359, -1846531, -1831658, -1831105, -1836115, -1821054, -1791122, -1764068, -1771266, -1781693, -1753161, -1755557, -1799713, -1799579, -1786194, -1756084, -1723497, -1697535, -1694083, -1683844, -1661096, -1672635, -1687118, -1687093, -1653162, -1663645, -1679100]
17684a679100j212K6639l1009l4871k7901J3890L5002K0541j4913j9730n4948
17673a767612k6625L256r631L3316M3997L7199M460k3901m6429K0643N518K0073
17661a705736J0956j1979l1374J7327K0525K689j3117J0731N315J9244J8739M651
17649a652029M335R099l1418p533L2391L7189N75l4667J1838J6846J0556j3677
17637a616495L200o457J5436J6636K038k7277r242K5290O192J9464j7323j8274
17625a606812j0178P441J4907k496R978J7034R954L775l421J419j2996j7203J0149
17612a578449K2397O596j9752K0627K2942j0978K7697J0350k5102j7706m078J0252
17600a535204P634n301J8332O994M897J9284J4300k2485J728Q885o905j4964R789
$$ y = [-1679100, -1680312, -1653673, -1684682, -1719553, -1747454, -1733564, -1698562, -1678021, -1692934, -1712664, -1767612, -1794237, -1790981, -1800612, -1767296, -1723299, -1686100, -1681640, -1705541, -1751970, -1731327, -1725809, -1705736, -1694780, -1706759, -1738133, -1720806, -1700281, -1697592, -1710709, -1699978, -1694663, -1675419, -1656680, -1652029, -1647694, -1638595, -1670013, -1677546, -1645155, -1607966, -1607391, -1642058, -1630220, -1613374, -1602818, -1616495, -1613295, -1619752, -1604316, -1587680, -1585642, -1612919, -1622161, -1596871, -1590679, -1571215, -1588538, -1606812, -1616990, -1609549, -1594642, -1597138, -1587160, -1570126, -1560172, -1556397, -1559818, -1558399, -1571395, -1588598, -1578449, -1556052, -1549456, -1569208, -1548581, -1525639, -1536617, -1508920, -1498570, -1523672, -1541378, -1545456, -1535204, -1527570, -1532871, -1514539, -1507545, -1502648, -1483364, -1469064, -1491549, -1489821, -1480936, -1487841, -1502805, -1493016]
17587a493016k727n611L650K5150J2627J1931Q532p072j590P779K6780j05m2545
17574a456217q644j0029N12n782R780K7657L2096J2446j689R110k6668M376L383
17561a409669J7717N563K786J1480l2667k6539J4271l943K1630Q582J2329m307
17549a382767j7966N511J4932p989j8895J701K0459j861k056K5334l016N515K7667
17536a333431j327j7326j6144K893k4758L1265J9400J3689N251P47j8443K0473
17524a317711J5403k6636n394Q849J8509j4616J4015R260k0363l4677J1696L1940
17512a309725K2872O787k0309j0153K47k933j4296L315j4796K4303M3083M4387
17500a227218j973m862k387k9244l3866J915K7228k4326k5011K8126M8130P419
$$ y = [-1493016, -1495743, -1501354, -1497704, -1472554, -1459927, -1447996, -1439464, -1446536, -1448126, -1440347, -1413567, -1413672, -1456217, -1464861, -1474890, -1474378, -1480160, -1470380, -1442723, -1410627, -1398181, -1399870, -1390760, -1417428, -1413052, -1409669, -1391952, -1386389, -1383603, -1372123, -1404790, -1431329, -1417058, -1421001, -1399371, -1390789, -1378460, -1382767, -1400733, -1395222, -1380290, -1388279, -1407174, -1405473, -1385014, -1386875, -1388931, -1363597, -1366613, -1361098, -1333431, -1334758, -1352084, -1368228, -1365335, -1390093, -1358828, -1339428, -1325739, -1320488, -1319741, -1338184, -1317711, -1302308, -1328944, -1334338, -1325489, -1306980, -1321596, -1307581, -1298321, -1318684, -1353361, -1341665, -1309725, -1286853, -1280066, -1300375, -1310528, -1310281, -1313214, -1327510, -1324195, -1338991, -1314688, -1271605, -1227218, -1229191, -1234053, -1236440, -1265684, -1299550, -1297635, -1270407, -1294733, -1319744, -1291618, -1243488, -1236069]
17488a236069j1838J0141l2907j181O448K4456K8464l726K109m055j257n711n583
17475a230709p11n330m889k5486j0156M1670K9763R387J894o718O419j8154l6953
17462a249973M740k261o644K4969L1067j3107m802K3072J6099J4002q558m0396
17450a211792O899M7911K5243K7250J2901J3263J9805k6664l8345l9344l0609
17439a193482o2450k9035o642J9308j2969o980P342j782j1773J4481N4477L8903
17427a190602k149K3132O748o448k4859k0371j9279Q058K2515J4313K9566J2282
17415a147094J868O327k6381l6248J7058J1347q05j547k0697K474K8860j3577
17403a178415m66k0929J3155L4517O170q915J8531K9199l316l7503j8M2446P131
$$ y = [-1236069, -1247907, -1237766, -1270673, -1271854, -1265406, -1240950, -1212486, -1216212, -1214103, -1218158, -1219415, -1225126, -1230709, -1231420, -1236750, -1241639, -1267125, -1277281, -1235611, -1205848, -1196461, -1194567, -1201285, -1194866, -1213020, -1249973, -1245233, -1247494, -1254138, -1229169, -1198102, -1211209, -1216011, -1192939, -1176840, -1162838, -1171396, -1211792, -1204893, -1156982, -1131739, -1104489, -1091588, -1078325, -1058520, -1085184, -1123529, -1162873, -1193482, -1255932, -1284967, -1291609, -1272301, -1285270, -1292250, -1284908, -1286690, -1298463, -1283982, -1229505, -1190602, -1192751, -1169619, -1162871, -1169319, -1194178, -1214549, -1233828, -1225770, -1203255, -1188942, -1159376, -1147094, -1145226, -1138899, -1165280, -1201528, -1184470, -1173123, -1173928, -1175475, -1196172, -1193698, -1164838, -1178415, -1178881, -1199810, -1186655, -1152138, -1145968, -1154883, -1136352, -1107153, -1110469, -1147972, -1147990, -1105544, -1098413]
17390a098413M215K1022P265N987o885j9663k2875l663O432J8553j5330N361l257
17377a101251k362j340o675p697K5748Q936k1680N750J4673J5264Q683k3653o018
17364a091622n08R564K3383K3362k6033m664q32j5976k3023K9503J8869Q125k1794
17351a071646j1332N152k448J4214o80J5480K8744J8041Q876o308l9679k8840
17339a070426J722P681j1466J5100J4960K3862J7372K0072K3587k3507m3369j4971
17327a039383J0506J464K3333n95p68P163J4172k855J4870R142l5246k849K1973
17314i79073J0609K4032l424j0527N165p12r147k7422k7538J3838l68P214K5106
17301i72247K8718J0354o850K246n485j1463k9032p728J9790K4406N781J5929
$$ y = [-1098413, -1094198, -1073176, -1065911, -1059924, -1066809, -1086472, -1109347, -1113010, -1106578, -1088025, -1103355, -1097994, -1101251, -1103613, -1104953, -1111628, -1119325, -1093577, -1084641, -1106321, -1100571, -1085898, -1070634, -1061951, -1085604, -1091622, -1092130, -1082566, -1059183, -1035821, -1061854, -1066518, -1067350, -1083326, -1106349, -1076846, -1057977, -1049852, -1071646, -1082978, -1077826, -1080274, -1066060, -1066740, -1051260, -1022516, -1004475, -995599, -1001907, -1041586, -1070426, -1068704, -1061023, -1072489, -1057389, -1042429, -1018567, -1001195, -981123, -957536, -981043, -1024412, -1039383, -1028877, -1027413, -1004080, -1004675, -1005443, -998280, -984108, -986963, -972093, -962951, -998197, -1001046, -979073, -968464, -944432, -947856, -958383, -953218, -953930, -963077, -990499, -1018037, -1004199, -1004567, -997353, -972247, -943529, -933175, -940025, -937779, -943264, -954727, -983759, -991487, -971697, -947291, -941510, -925581]
17289i25581O807l4895j0443J5210K6398N929l396j4675l795P499k3697O726K6936
17276i20977j339j5102j2216o48q626L4382J5181k4407N951L2989J3100L65j4170
17263h95517m1642k8940R065j2413K3016J8318Q342R174R643M26o977K1292J3020
17250h73193k655P406n929j0802L1202M9772o696l1429k9436k322j3750j1583
17238h99415K001j2936K7604j3116k7582O097o360L7281M0572l454k0238K326
17226h67220M805N47j4658K374l426J2037K012L1680m599k6076m360J7695J4430
17213h34759L275j5107q483j401Q373j0034k8106K8588q202L906N1909j9958l4721
17200h64720k1886K0513L3734j273J6416K764r296n461Q92J5990j6446q162p984
$$ y = [-925581, -918774, -953669, -964112, -948902, -922504, -916575, -919971, -934646, -938441, -930942, -954639, -947913, -920977, -922316, -937418, -949634, -950282, -958908, -924526, -909345, -933752, -927801, -894812, -881712, -881347, -895517, -937159, -966099, -957034, -969447, -946431, -928113, -919771, -910597, -900954, -900528, -907505, -886213, -873193, -875848, -868442, -874371, -885173, -853971, -804199, -810895, -842324, -871760, -874082, -887832, -899415, -897414, -910350, -882746, -895862, -923444, -917347, -923707, -886426, -845854, -849308, -869546, -867220, -862415, -861868, -876526, -874152, -877578, -865541, -863529, -831849, -836448, -862524, -866884, -849189, -834759, -831484, -846591, -855074, -856475, -848102, -858136, -886242, -857654, -865856, -861950, -810041, -829999, -864720, -886606, -866093, -832359, -833632, -817216, -814452, -823748, -829209, -828317, -812327, -828773, -836935, -844919]
17187h44919Q071L8237K8895r672j9636J3069J9628k7434j5591J8169p259K841
17175g95601m092l1358O668J1136k023J704j0379j062L3851J2982j0916J1342
17163g77748K333m804j5808j9680J197j4703m714J7374J9173r693J6688J8904
17151g71481J081j0316q205n558K0267K7944n676j0037K66P574m286l754K3627
17138g38554K843k0884L808j4817j3525R83J0303K8462L7610L0160j4186k1239
17126g09036R370nm6338L780M0120k3042K6123K3995k675q158r620N115P773j4300
17112f96898k3800O851k3790j3007J7175j554J0192L2589k0587N120K4176l395
17100f86928j063L341k5365K052m540L095K1880J1286K5789J2590J8303J2629
$$ y = [-844919, -836848, -798611, -769716, -779388, -799024, -785955, -766327, -793761, -809352, -791183, -798442, -795601, -799693, -831051, -824383, -813247, -815270, -813566, -823945, -825007, -791156, -778174, -789090, -777748, -775415, -780219, -796027, -815707, -814510, -829213, -833927, -816553, -797380, -807073, -790385, -771481, -770400, -780716, -788921, -794479, -774212, -746268, -751944, -761981, -761715, -754141, -758427, -762181, -738554, -735711, -756595, -752787, -767604, -781129, -780146, -769843, -741381, -703771, -673611, -687797, -709036, -699666, -699671, -746009, -742229, -702109, -725151, -699028, -675033, -677708, -685866, -695486, -690371, -682598, -696898, -720698, -713847, -737637, -750644, -733469, -735023, -724831, -692242, -712829, -707709, -683533, -686928, -687991, -684650, -710015, -707963, -712503, -709408, -687528, -676242, -650453, -637863, -619560, -606931]
17088f06931r359k0636l8879k7077J92n9269L377K1093K8669K5570j1392N900
17076f88742L7635J6927l827j016j7376l6896l7745k1176N708j404J4592J6860
17064g16460J6013l3735j0936r147J4759J7424J7925k1872O692J315k2344L5182
17052g05184N1440K1395j5983j282R559Q380o066q235J522R69k1161M569L0271
17039f29806J1605J868l452L7308J5077K8763m861k1319k4483l2347l2450k7943
17027f82040j2387J3267L2433K2187j4358k747j8036k5369l3834j9812j7390L2112
17015g25974J4710P195K1880Q328j2434m024J1286J5957j3897j901R402j4132
17003f83604L1587K2410k3351j1117Q034k9121m72O270J6653J759L397L292m644
$$ y = [-606931, -616290, -636926, -675805, -702882, -702690, -761959, -758582, -737489, -708820, -683250, -694642, -688742, -651107, -634180, -638007, -639023, -656399, -693295, -731040, -752216, -746508, -747912, -733320, -716460, -700447, -734182, -745118, -754265, -739506, -722082, -704157, -726029, -719337, -718022, -740366, -705184, -653744, -632349, -648332, -649614, -640055, -631675, -637741, -645976, -644454, -643485, -664646, -660077, -629806, -618201, -616333, -619785, -582477, -567400, -538637, -543498, -564817, -589300, -621647, -654097, -682040, -694427, -681160, -648727, -626540, -640898, -643645, -661681, -687050, -720884, -740696, -758086, -725974, -711264, -704069, -682189, -673861, -686295, -690319, -679033, -663076, -676973, -678874, -669472, -683604, -652017, -629607, -652958, -664075, -656041, -685162, -685634, -679364, -662711, -660952, -657555, -654263, -658907]
16990f58907k5535K3465J9258J7186m949k1939M371O523K672j0759R854K4838
16978f13922K0876k269j2844j2645J1997l69n370m662j9941k2439J8194l0753
16966f74147j8784P648M337j4667J5132l012j212j0726P38K3059K2238J3591J1678
16953f24127m869l6993m978M8889P041j6068l529K3524K8928O310p263k250n057
16940e90442k0313J7240k095r092J9651L445j4126k223P232n755J5086j310k3842
16927f06544j7312M941K8033K9829j4590K9872N2905o93l1691q664j2618j121
16915e47653j1211j9301J3390J9098M164P218K253k2903j0400l695j57K385q508
16902e75320K7434Q600k1078j3958K828J2768N330P443N875q814K6409L5702m369
$$ y = [-658907, -684442, -660977, -641719, -624533, -629482, -651421, -647050, -640527, -637855, -648614, -638760, -613922, -593046, -595315, -608159, -620804, -608807, -609176, -614546, -619208, -639149, -661588, -643394, -674147, -692931, -685283, -680946, -695613, -680481, -683493, -684705, -695431, -694693, -671634, -649396, -635805, -624127, -628996, -665989, -670967, -622078, -615037, -631105, -634634, -611110, -582182, -575872, -583135, -585385, -590442, -610755, -593515, -595610, -604702, -585051, -581606, -595732, -597955, -590723, -596478, -581392, -582702, -606544, -623856, -618915, -590882, -561053, -575643, -545771, -492866, -493559, -525250, -533914, -546532, -547653, -558864, -578165, -564775, -545677, -541513, -534295, -532042, -554945, -565345, -569040, -569197, -566812, -575320, -547886, -539286, -560364, -574322, -571494, -558726, -553396, -545953, -540078, -548892, -522483, -486781, -491150]
16889d91150l7673k0930M371K7642j5414n419J7439m965j7441M818L0709L0721
16877d77292n86j2673k7350k2538q746p337J3484P88L6529K4727K891m3743l0842
16864e52688J9769k9324j2902J4856K8174L9302K1612O42R695k136k9428J2931
16852d79497L8509J1671o672j9199k4827k0224m103j0617N120L1469j4987K0600
16840d72757o150j8468k1588J2351L930J724J525J9547J1613m448L1881K9859
16828d10981m459k6394j4115m9510j2514N907N332K7568J1934M562n316k9466
16816d97452j6877l152J1656J8187l382O10J4696J3690J6398Q990K4211j59j4739
16803d27323k9196j2677N480j8234J5062l430o046L5189N358m4222l0202K7899
$$ y = [-491150, -528823, -549753, -545382, -517740, -533154, -538573, -521134, -526099, -543540, -538722, -508013, -477292, -477878, -490551, -517901, -540439, -549185, -556522, -543038, -542250, -505721, -480994, -478103, -521846, -552688, -532919, -562243, -575145, -560289, -532115, -492813, -471201, -470559, -460864, -463000, -492428, -479497, -440988, -429317, -435989, -455188, -480015, -500239, -504342, -514959, -509839, -478370, -493357, -472757, -478907, -497375, -518963, -506612, -502682, -500958, -499433, -479886, -468273, -472721, -440840, -410981, -415440, -441834, -455949, -505459, -517973, -512066, -506734, -479166, -467232, -462670, -467986, -497452, -514329, -517481, -505825, -487638, -491020, -490410, -475714, -462024, -445626, -436636, -412425, -412584, -427323, -456519, -469196, -463716, -481950, -466888, -470318, -476364, -441175, -435817, -480039, -510241, -482342]
16791d82342J1483j940k2910J2010J4851O356K2653J7756K1280q18k8998n637
16779d36256L705L0944K0150p082m0451j5195J59p511l875O343J0210J5602L178
16766d20079j0643k1184k9244n78K6642M3258P487k4218j8142k69J2055J5490
16754d19425N916J2558o478j9050Q149l842n901J3323J6232p66q916k5601J585
16741d32216J7321q10l0973P420J5080K1433K7212K797q630k3753j1117O7k593
16728d18762Q866N735m561q344j1667K9654O129Q271m800N948J7424J5452j2726
16715c63381j426j0566j5939k4682J3893O008j7532K230k257L6964J4982j1804
16703c73510j4937l215p224q396N256j0833p388K4293J7482r450j0940L304K7239
$$ y = [-482342, -470859, -472799, -495709, -483699, -468848, -462492, -439839, -422083, -400803, -401621, -430619, -436256, -432551, -401607, -381457, -388539, -428990, -444185, -444026, -451537, -455412, -449069, -438859, -423257, -420079, -430722, -451906, -481150, -481728, -455086, -411828, -404341, -428559, -446701, -446970, -434915, -419425, -413509, -400951, -407429, -426479, -418330, -422172, -428073, -414750, -398518, -399284, -408200, -433801, -432216, -414895, -415705, -446678, -439258, -424178, -402745, -375533, -372736, -381366, -405119, -416236, -416169, -418762, -409896, -404161, -408722, -417066, -428733, -399079, -392950, -384679, -389479, -383531, -366107, -350655, -363381, -364807, -375373, -391312, -415994, -402101, -396093, -413625, -411395, -413652, -376688, -361706, -373510, -388447, -391662, -398886, -407282, -402026, -412859, -420247, -395954, -378472, -387922, -398862, -395558, -368319]
16690c68319l682J6541J7426K9824K0976p236m3451l4196m814L1524j5021j8176
16678c78604n237j070J7286K3628Q086n836k9146J3880M152o325j2707R180K3688
16665c39025j6491k6057l604j152r023J3049L6749K227j151j1209r041L4094K5154
16652c05480j0120l4734J9092K6372L882J6801N044J0885p746L181J967k1922
16640b92778j7899N217J7065j4817j0071q06q776J8214J1048m239k6843J9515
16628c05170J4856k424m246j4526M282M477O963l409N788N191q010j5136j4027
16615c25391R38Q728J0514k0338K221J7967r016K539n525J3746j269l65k9286
16602c34537J2006j4801j3586K3964K6287j6057Q604K7639L4650O446K590o71
$$ y = [-368319, -372001, -355460, -338034, -308210, -287234, -294470, -337921, -372117, -376931, -345407, -360428, -378604, -383841, -384911, -367625, -343997, -335911, -341747, -370893, -357013, -352861, -359186, -371893, -362713, -339025, -355516, -381573, -385177, -386329, -395352, -382303, -345554, -343327, -344478, -355687, -364728, -330634, -305480, -315600, -350334, -331242, -304870, -300988, -284187, -279143, -268258, -276004, -272823, -270856, -292778, -310677, -305460, -288395, -303212, -313283, -314089, -322865, -304651, -293603, -297842, -324685, -305170, -290314, -292738, -296984, -311510, -307228, -302751, -295788, -299197, -293409, -288218, -296228, -311364, -325391, -324453, -315725, -305211, -325549, -323328, -305361, -314377, -311838, -317363, -303617, -304886, -305251, -334537, -322531, -337332, -350918, -326954, -300667, -316724, -308120, -280481, -245831, -239385, -236795, -237466]
16590b37466q24k1422l3907n695J4389l04K2833L2633J8836o073k5785P462J7725
16577b17598p094Q366J1315L57K5146q135q686m0699k3959j5329J195k6225M4
16564c01302L7665L2082j2871r862k8719r255K4570P05Q596K2800J6807n362o85
16551b24831k0112r691k5598J097L5394L935K591M430n1352m9236K045K6686L3845
16538b70797K0876j5215j3387j3888K8812M3408j1857k2764k2490p915J2290j1957
16526b84884L7712j2572k0553j2061J071J1285J4678L358K6262K9054j3761k1358
16514b41769P768j0321j4694L1874K6151K3519j2918k7698m3507l8928N721J4183
16502b80619m081R907J9927q125j2347J2858L2997K4840j0721k344M214Q911k5799
$$ y = [-237466, -238290, -259712, -293619, -299314, -284925, -285229, -262396, -229763, -210927, -217000, -242785, -235323, -217598, -224692, -216326, -205011, -204654, -179508, -187643, -196329, -237028, -260987, -276316, -275121, -301346, -301302, -263637, -231555, -244426, -254288, -283007, -292262, -267692, -266987, -258391, -235591, -218784, -224146, -224831, -244943, -254634, -280232, -279135, -243741, -239806, -237215, -232785, -284137, -333373, -331328, -304642, -270797, -249921, -265136, -278523, -292411, -263599, -220191, -232048, -254812, -277302, -285217, -272927, -284884, -247172, -259744, -280297, -292358, -291287, -280002, -265324, -261966, -235704, -206650, -220411, -241769, -234001, -244322, -259016, -227142, -200991, -177472, -190390, -218088, -261595, -300523, -294802, -280619, -284700, -274793, -254866, -262991, -275338, -262480, -229483, -204643, -215364, -217708, -213494, -204583, -230382]
16489b30382k9252N377o301j8283J2628J6111K1598K5735r648r422l0929J9653
16477b33115o09k171L3146o163l1715P254J1556m121K5602m1505j6110k0983L7208
16464b41726N3598k888n805N930p117l0175j3688J1201j3915m2453J7325M6470
16452b23243L116k9821J9559R316k4422M704J5034J4339M903k5743k037K4302
16440b09993R362J5591j5378l41P023J498Q176j4982r886J4554o589R343K851
16427a88771q774k9146K3574K0985R392J1610R303P632l2338k7771k159k229J8
16414b08674L997o654m491L4242K2097j1958j5762K3359j3530J7484J7355j2637
16402a55172l4400J0264j4878k0844P913K4122k3258Q542N953o715k68K0737j6740
$$ y = [-230382, -259634, -254257, -260558, -278841, -266213, -250102, -228504, -202769, -212417, -221839, -252768, -233115, -233724, -235895, -202749, -208912, -240627, -233373, -221817, -225938, -200336, -241841, -257951, -278934, -241726, -188128, -191016, -196821, -190891, -198008, -228183, -241871, -230670, -244585, -287038, -269713, -223243, -220127, -249948, -230389, -221073, -245495, -240791, -225757, -211418, -206515, -232258, -234295, -209993, -200631, -185040, -200418, -200759, -193736, -192238, -184062, -199044, -208930, -194376, -200965, -191622, -188771, -197545, -226691, -203117, -182132, -172740, -161130, -151827, -144195, -176533, -204304, -206463, -208692, -208674, -204677, -211331, -215822, -181580, -159483, -171441, -187203, -163844, -177374, -159890, -142535, -155172, -189572, -179308, -194186, -215030, -207117, -182995, -206253, -197711, -191758, -198473, -198741, -178004, -194744]
16389a94744j7123j030j4684j2476K7996K5273J9794j2458m3434M094L1424J8688
16377a68680K2399k31K056m2665m45M158L0813M9052q43j6177K1909P53k1066
16364a18967m2j2564J7955J6540j5898N551j4808J3385j8150r263K947k4214K5004
16351a32524K5053q49k0439J1218K352n772j2427r550P083j625n03N394J7324
16338a15265l327j9747P514J0373O724k670p12N212m049j3624n751K4943n063
16325a15442l7084p277J4020O564K3208L5740J5139j3952m4360J1713K8265K3795
16313e9671j2274l1515l8402J3237K9817J127L71L1600l1641j6829J1910J0508
16301i1762L5255J0760j2095J1278k3286l4829J0717o805N574J0924p327j3170
$$ y = [-194744, -211867, -212897, -227581, -240057, -212061, -186788, -166994, -179452, -222886, -218792, -187368, -168680, -146281, -146512, -144456, -187121, -187566, -183408, -152595, -103543, -104386, -120563, -98654, -97901, -118967, -119009, -131573, -113618, -97078, -112976, -107425, -122233, -108848, -126998, -136261, -133314, -157528, -132524, -107471, -108320, -128759, -117541, -115189, -120961, -133388, -142938, -135855, -137480, -137983, -132589, -115265, -118592, -138339, -130825, -120452, -113728, -116398, -117110, -111898, -115947, -129571, -135322, -110379, -115442, -152526, -159803, -145783, -139219, -116011, -80271, -65132, -79084, -123444, -111731, -83466, -59671, -71945, -103460, -141862, -128625, -98808, -97681, -97310, -65710, -97351, -114180, -102270, -91762, -56507, -45747, -57842, -46564, -69850, -104679, -93962, -100767, -95193, -84269, -91596, -104766]
16289a04766j3441J8264N6524J5506q018k1673l0070J692M97J2353J7753j9742
16277g5121k6635l119J2191j938L257j95o893P871P916J6568j3645R328J6035
16264e4380k0207o061m686L59J594k765P693J6487J195P045q681j8792J8358L7242
16250b5599l0039q56K5906K9505K5128k0206j5387j9124k0184Qj502K268m2332
16237i2414J1112j8919k0614M944R291J6504J8886j0738j168J5509K8630R329
16225b9648J6035L372k2306j1302k6323j1833o558m704j6131J4630j5439m708
16213a14915L1663K5684l502K137O960M949j4235j5488m885R887o088l675J3781
16200f7727k0967l5136Q205N4498K3291j4402m439q185M779J2324n9720l827M4476
$$ y = [-104766, -118207, -99943, -43419, -27913, -35931, -57604, -87674, -85982, -85485, -73132, -55379, -75121, -101756, -104875, -92684, -94622, -91365, -91560, -98453, -90582, -82666, -66098, -79743, -70415, -54380, -74587, -80648, -85334, -84975, -83381, -86146, -78453, -61966, -60771, -53726, -62407, -81199, -62841, -25599, -55638, -56494, -30588, -1083, 24045, 3839, -11548, -30672, -50856, -50848, -52350, -50082, -92414, -81302, -100221, -120835, -115891, -106600, -90096, -71210, -81948, -83116, -67607, -38977, -29648, -13613, -10241, -32547, -43849, -70172, -82005, -88563, -93267, -109398, -94768, -110207, -114915, -83252, -57568, -61070, -58933, -51973, -47024, -61259, -76747, -81632, -71745, -77833, -81508, -67727, -88694, -123830, -115625, -61127, -37836, -52238, -56677, -64862, -60083, -47759, -107479, -111306, -66830]
16187f6830J0924O317l2873j373K090j4819J4260K6674K5045L0129r201m614l2471
16174d6742k644M8546M1790o114j8353k3433k2717j9147n289P470L4594J5906
16162C867j2909q305j7191j4591K0144Q035k8492L4822J7335m253J1159P362l4049
16149a7066J4271K7930j5162N284K6304J4659p268l3477J112k4295M161M133n309
16136d723O024j7695j4938J8422p53m8123k3106K8335N2232K4715j0247j2456
16124b313o469J1326L7209J7833k2553k1511M71o576j0605R00R714m063J0730
16111A4093J4273R091k5032m074l9800o046K0851K1619K048K1363L3381j6844
16099D4923P200J1626p162p202q039k8515m882j8976J1582J1658j6308L541J2573
$$ y = [-66830, -55906, -49589, -82462, -83835, -81745, -96564, -82304, -55630, -30585, -456, -9657, -14271, -46742, -49386, -840, 40950, 34836, 16483, -6950, -29667, -48814, -54103, -46633, -12039, 3867, -9042, -17347, -34538, -49129, -28985, -20950, -49442, -14620, 2715, -1538, 9621, 16983, -17066, -2795, 25135, 9973, 15257, 41561, 56220, 48952, 15475, 16587, -7708, -3547, 586, -4723, 1301, -16394, -31332, -12910, -13663, -61786, -84892, -56557, -4325, 20390, 10143, -2313, -8782, 2544, 39753, 57586, 35033, 13522, 13993, 7417, -3188, -2288, 7426, 3363, 14093, 28366, 37457, 12425, 8351, -31449, -37495, -16644, 4975, 7023, 28386, 61767, 44923, 52123, 63749, 56587, 49385, 41346, 12831, 7949, -11027, 555, 12213, -4095, -554, 12019]
16086A2019P985P229j3908K411R29M0625R166p474K7360j4009m2359l4814L2292
16073B7452M109m591O2j1789J9501r857K064N744Q274P638r947R911K3150Q742
16059H0463l7127j2944q018j4654R250K5063Q580J4837R886j5759j6848k8577
16047A4152K6422j1473j3156K0249J3259k7292k0018j8681J1391l693j313J7442
16035G289K1278L0292J0764n499l4723l1272q65J8858q144Q393J0984j3267J1680
16022B5768J194k922k0902M824J4928J1447L6331j4738l460J7470k07P7J8717
16009H8527r002j4916Q185J7598L142m1634L966J5505O282j4755m950j2073Q914
15996E4789J781L221K9315l536L738Q707j6527j5592L6091J4097k00j7302K476
$$ y = [12019, 20004, 27233, 13325, 15736, 16665, 57290, 66456, 58982, 86342, 72333, 29974, -4840, 27452, 31561, 26970, 27032, 15243, 34744, 24887, 26951, 32695, 40969, 48607, 38660, 48571, 71721, 80463, 43336, 30392, 22374, 7720, 16970, 42033, 50613, 65450, 75336, 59577, 42729, 14152, 40574, 29101, 15945, 36194, 49453, 22161, 2143, -16538, -5147, -8840, -10153, 7289, 28567, 58859, 69623, 64124, 29401, -1871, -2736, 16122, 7978, 16371, 27355, 14088, 25768, 26962, 24040, 3138, 7962, 22890, 34337, 70668, 55930, 52470, 69940, 69733, 69810, 88527, 79525, 64609, 72794, 90392, 93534, 51900, 55866, 71371, 77653, 62898, 57948, 45875, 54789, 56570, 59791, 89106, 85570, 89308, 98015, 81488, 65896, 101987, 116084, 115884, 98582, 101058]
15983A01058p506K068L0872K2788j2657l7193k2098K764L5847p043J5218J6094
15971A40212J832m908j7698P582J5744J4332J8410k9536k5960k9618J876K8273
15959A20541J0439J4022K1440l9877j2357k8790J1132L6050J1695m399q216K5751
15947A57431n269j8761j464K743j4804k006l395m136J0637J0877J2128J3160p591
15934A49550M198k8956k8730L1809L2380k4616J6374j6295l0834p079K3207J6553
15922A37561j3694J888J0245j4984O462N647j8459j4985m724p46j433R175J4637
15909A16590j0507J2426Q705r545n216r448Q412J4118R75L423J2216P76r727p241
15895A25957P962K8412J2778m169J6410N103j2781j7217k0109m152J4534K9501
$$ y = [101058, 93552, 95620, 126492, 149280, 136623, 99430, 77332, 80096, 115943, 108900, 124118, 140212, 142044, 137136, 119438, 127020, 142764, 157096, 175506, 145970, 120010, 90392, 92268, 120541, 130980, 145002, 166442, 126565, 114208, 85418, 96550, 132600, 144295, 139896, 131680, 157431, 152162, 133401, 131937, 134680, 119876, 117870, 114475, 110339, 120976, 131853, 143981, 157141, 149550, 153748, 124792, 96062, 127871, 160251, 135635, 152009, 135714, 104880, 97801, 121008, 137561, 123867, 125755, 136000, 121016, 127478, 133125, 114666, 99681, 94957, 94211, 92778, 101953, 116590, 106083, 118509, 127214, 117669, 112453, 103005, 111417, 125535, 126510, 129933, 142149, 142925, 133198, 125957, 133919, 162331, 175109, 170940, 187350, 192453, 179672, 162455, 142346, 138194, 152728, 182229]
15883A82229M434k3572Q639P666J636q103J2619j7264P419Q603K384J6978j0107
15870A93561k7909l2419l4853P194K7037K3936K9281Q994l4085n8238O5K8154
15858A30718L0609J9634P414q064Q582n48q598P850r772j997K5437r343J122j3933
15844A79111Q342K6646j4963J889J6351j901k5250j9896J5904J9113j231l1255
15832A72860J888L4193q800q624m047J6436O401j3553j0275K5608k3979k0290
15820A67818K601L7192K5277n3584j8434J953m3092Q128N7897J8820j9248J60
15808A85488k652k8924J907J5780K3719K1935L0932M108j3657l6119q878k5497
15796A68142l0245j3780J7934K5290L5203K1893K7836j1591n339j7164M659K6313
$$ y = [182229, 186663, 163091, 171730, 179396, 181032, 172929, 185548, 168284, 175703, 184306, 186690, 203668, 193561, 165652, 133233, 98380, 105574, 132611, 156547, 185828, 194822, 160737, 102499, 102564, 130718, 161327, 180961, 188375, 180311, 188893, 188345, 179747, 187597, 177825, 175828, 201265, 191922, 193044, 179111, 187453, 214099, 199136, 201025, 217376, 215475, 190225, 170329, 186233, 205346, 204115, 172860, 174748, 208941, 200141, 191517, 187470, 203906, 210307, 196754, 186479, 212087, 188108, 167818, 170419, 207611, 232888, 179304, 160870, 162823, 119731, 127859, 185756, 204576, 185328, 185488, 182836, 153912, 155819, 171599, 195318, 217253, 248185, 252293, 238636, 202517, 193639, 168142, 137897, 124117, 142051, 167341, 202544, 224437, 252273, 240682, 235343, 218179, 222838, 249151]
15784B49151j2346n463n095j7711q766k0340J9985K1024L2935L4698k6301k8432
15772B33339n549N964J0656M286k4381M478K8116M205l869k2560J5755K2611j3343
15759B59708m9946j7547Q872J5846N665j8749l4915Q081K3976J4133p001p030
15747B01093R245Q701K7037J4429K3835N521k4860j826m706j1165R393J0017p322
15734B59392J2904J0687r069k4027K260N217o590j2521Q055K3166q791q749K0706
15721B72640J4296J8971K558j3178j2421J896R141l3119k2878j464K2640K7255
15709B86337L290J6210J3132l2064k7696j6470k1885K129j436K834M5612K2419
15697B92412O113m526j9730l2179j3632j0263R016n00K1016J5850n347J064j3891
$$ y = [249151, 236805, 231342, 226247, 208536, 199770, 179430, 199415, 220439, 253374, 288072, 261771, 233339, 227790, 233754, 244410, 248696, 224315, 228793, 256909, 261114, 257245, 234685, 250440, 273051, 259708, 209762, 192215, 201087, 216933, 222598, 203849, 168934, 177015, 200991, 215124, 208123, 201093, 210338, 219039, 246076, 260505, 284340, 289861, 265001, 263175, 258469, 247304, 256697, 266714, 259392, 272296, 282983, 273914, 249887, 252147, 257364, 250774, 238253, 246308, 269474, 260683, 251934, 272640, 286936, 305907, 308465, 295287, 282866, 284762, 293903, 260784, 237906, 236442, 259082, 286337, 289627, 305837, 318969, 286905, 259209, 242739, 220854, 222983, 221547, 224381, 269993, 292412, 298525, 293999, 274269, 242090, 228458, 218195, 227211, 226711, 247727, 263577, 258230, 259294, 245403]
15684B45403r959j4204l3236r855P691L3093K0126j6096J1753j4785L535J1949
15672B35415J1000J0202j810l896j6924J4815J0174J2082L3540r757j6076r098
15660B69667j148j1189R789M789J9843p346j9551n219l1694j8799N64M897J9656
15647B34259J6998j3385J7943J3131J3458k4961k6821j2894K768L0585J7474J6726
15635B85281P652m3692j595J0989N007Q386J0927k2416k4795J2203J435j41r170
15622B40071M222j4566K1461J2118N994J340N361j9757k5985L1908J0699J4970
15610B87836J6474O350Q989k0393m4627j298P116n386j393J7312J7371k827j9161
15597B66363J1031j5797R282l118j9281K8979L9852k0410k4325Q497J5050l569
$$ y = [245403, 235444, 221240, 188004, 178149, 185840, 218933, 239059, 222963, 234716, 219931, 223466, 235415, 246415, 256617, 254807, 250911, 233987, 248802, 258976, 271058, 304598, 294841, 278765, 269667, 268519, 257330, 267119, 271908, 291751, 284405, 264854, 259635, 227941, 209142, 209706, 214603, 234259, 251257, 237872, 255815, 268946, 282404, 257443, 230622, 217728, 220496, 251081, 268555, 285281, 292933, 249241, 247646, 258635, 263642, 272028, 282955, 260539, 235744, 247947, 249382, 249241, 240071, 244293, 229727, 251188, 263306, 269300, 270640, 276001, 256244, 230259, 262167, 272866, 287836, 304310, 310660, 319649, 299256, 254629, 253331, 260447, 255061, 253668, 270980, 288351, 285524, 266363, 277394, 261597, 270879, 267761, 248480, 277459, 317311, 296901, 272576, 281073, 296123, 292554]
15585B92554K2446j2583k4300j0190j8262R661K1786L5109R867j2125L7246N4392
15573D05601j6019m0924m4789j389J7752j2350k2071k4746r89K3890J8579M376
15561C06921K8082J8880J7342J9821j1326O403j6142j8420k6031M606k1281j0369
15549B98486k3107j3456J7074O912O845K766m921K2774L6444O36k9610j1771r401
15536B99671O409J9037K8314r261k7609J9538L1396p269j8058N827m257l5089
15524C08649K267p231l5312M765K0366J2036J1889l285J041K6282p407o350m569
15511C23141J4984k109l461J5244K076j5944J1213k2140l2219Q032L3548J6627
15499C48992l941Q138j230K2334P701j2994j005J9604j6108n189K0472L0049k3721
$$ y = [292554, 315000, 302417, 278117, 267927, 249665, 259326, 281112, 316221, 326088, 313963, 351209, 405601, 389582, 348658, 303869, 302480, 320232, 307882, 285811, 261065, 260076, 283966, 302545, 306921, 335003, 353883, 371225, 391046, 379720, 386123, 369981, 351561, 325530, 330136, 308855, 298486, 275379, 261923, 278997, 285909, 292754, 295520, 290599, 313373, 349817, 350453, 320843, 309072, 299671, 306080, 325117, 353431, 344170, 316561, 336099, 367495, 360226, 342168, 347995, 343738, 308649, 310916, 303685, 268373, 273138, 293504, 305540, 317429, 314144, 315185, 341467, 334060, 327710, 323141, 338125, 336016, 332555, 347799, 349875, 333931, 345144, 323004, 290785, 298817, 332365, 348992, 345051, 353189, 351959, 374293, 381994, 369000, 367995, 387599, 371491, 366302, 386774, 416823, 393102]
15486C93102k3066k7785l808K0005R510R306J0902k4192o219J1979k4310R192
15474C54616J5305J1304J6854K8374O013k9078k7856K187R955M162n945j7810
15462C68081j3940m026J5614M016P351j3797j7601l026L1246L9291J4048K439
15450D29696J5885J6430j3117j4384J06l1366j4892L587J337k3019J5778J9660
15438D05701k0851j5251J5096r472k1322J86L7241j9293l1861J0336j2439P270
15426C45341M0866J1496n232L176L4294j0766j1961r487J2561R709k1413m12k544
15413C95628k670J3259L719P275o302k4639n176J8737k1419k3065J795M2170J1447
15400D10759k4765P21L1940J3293r711R70L1428k6643p508j6565k4779J2960L5088
$$ y = [393102, 370036, 342251, 338443, 358448, 367958, 377264, 388166, 363974, 357755, 369734, 345424, 354616, 369921, 381225, 398079, 426453, 432466, 403388, 375532, 377719, 387674, 391836, 385891, 368081, 354141, 350115, 365729, 369745, 377096, 363299, 345698, 342672, 373918, 413209, 427257, 429696, 445581, 462011, 448894, 434510, 434616, 403250, 388358, 391945, 393282, 370263, 386041, 405701, 384850, 369599, 384695, 375223, 353901, 354087, 391328, 372035, 340174, 350510, 338071, 345341, 386207, 397703, 392471, 395647, 429941, 419175, 407214, 397727, 410288, 419997, 398584, 398172, 395628, 392958, 406217, 409936, 417211, 410909, 386270, 381094, 399831, 378412, 355347, 357142, 399312, 410759, 385994, 386715, 418655, 431948, 422237, 423207, 454635, 427992, 420484, 403919, 379140, 392100, 427188]
15387D27188q268R635r015p893K496k2495Q096R341K9126J3742J0866l419j0714
15374D48686O920k3363m1667J5145J988J7956J0883k6822k2103J7733N954M236
15362D15546J1021J9539L712k0238j5364j4439k7125l3992J4034J2514J247K5643
15350C92098R863J4840J9628R892Q262o726o726q467k9160M000J334L6647M3111
15337D88596P024J920q167j4366j2669j6972K384L4452o124j8287L903N683K2032
15324D89409k9025l0569K5385J6322j8819l4184j763J7935J8279K1876j7887j4447
15312D42512J6750O020k7006j5773K6907M0431n942K292J6549p475j7513J8601
15300D96353j587M552q691l45M4170L363j3955Q559Q183j4458Q925K0737m408
$$ y = [427188, 418920, 428555, 419540, 411647, 414143, 391648, 399744, 409085, 438211, 451953, 462819, 459400, 448686, 455606, 432243, 390576, 405721, 407709, 425665, 436548, 409726, 387623, 405356, 411310, 415546, 426567, 446106, 449818, 429580, 414216, 399777, 372652, 338660, 352694, 365208, 366455, 392098, 401961, 416801, 436429, 446321, 454583, 447857, 441131, 432664, 403504, 407504, 408838, 445485, 488596, 495620, 497540, 489373, 475007, 462338, 445366, 447750, 482202, 476078, 457791, 461694, 467377, 489409, 460384, 429815, 455200, 471522, 452703, 418519, 416756, 434691, 452970, 474846, 456959, 442512, 459262, 465282, 438276, 422503, 449410, 489841, 483899, 486191, 502740, 495265, 477752, 496353, 494766, 499318, 490627, 490282, 534452, 537815, 523860, 532419, 540602, 526144, 535069, 555806, 551398]
15287E51398k7342m125j065p513j3374k3559o766J4689m735J5240J9523n05j622
15274E10244L5308j325l6930n0940k1855J8703P355J5662J6169R514o294L71N564
15261E01546m715k9170j1170K9677K4256Q248O276k2611l3576m393L194l669J7355
15248D81248K5815k1943J2964L3023J6891j00l5578k3054P224j6188L677r617
15236D74362P901L2615K0220K800j1022j0128n288M880n307m81K9406j3886j0386
15223E15686Q288j5172O154J5518L3746R316k1086j9258j8489K9213r871l0501
15211E03544j1414o664J8182K6885L3000n128m3876o265J5646K3038O137N925
15199E59010K3482Q806j0391j7036r697m4973j5453j905L2690J1127j6624J4241
$$ y = [551398, 524056, 519931, 518866, 511353, 497979, 474420, 467654, 482343, 477608, 492848, 512371, 511866, 510244, 545552, 544227, 507297, 456357, 434502, 453205, 460560, 476222, 492391, 501905, 495611, 495982, 501546, 496831, 467661, 456491, 486168, 510424, 518672, 524948, 502337, 468761, 464368, 467562, 463893, 481248, 507063, 485120, 498084, 531107, 547998, 547898, 512320, 489266, 496490, 480302, 483979, 474362, 482263, 514878, 535098, 537898, 526876, 516748, 511460, 516340, 511033, 510552, 539958, 526072, 515686, 523974, 508802, 514956, 530474, 564220, 573536, 552450, 533192, 514703, 543916, 534045, 503544, 492130, 485466, 503648, 530533, 563533, 558405, 514529, 508264, 523910, 546948, 553085, 559010, 582492, 591298, 580907, 563871, 554174, 509201, 493748, 491843, 524533, 535660, 519036, 533277]
15187E33277J7478j8379j0559M0984N993l5184m895K2497l0266k2759J5598L5368
15175E49153M632j2816K432L65K1740L6319J7160r301J8152K7543l8383n3044
15163E63952M964K0773j967o173O042M896l324K2822J2950j3414m0890r384J1191
15150E72438J7590J2517J798l915P753j6994q286q33k4027k459K3575J0407j91
15137E89373P945J1291q298l671j8018J0419p994m9561j933K6699Q408K0024j1298
15124E73386q342j2542J0279K4257j2305q365m167K1838k440J7877J7172J346
15112F17994j5153r458j8506J2566Q554k4199J8729j0704K47j0098p350L779j4564
15099E51837Q547P464K4136R139L18j3527q061K6149J2240P065J1154J1800n429
$$ y = [533277, 550755, 532376, 521817, 562801, 568794, 533610, 528715, 551212, 520946, 498187, 513785, 549153, 553785, 540969, 543401, 543766, 565506, 601825, 618985, 609684, 627836, 655379, 616996, 563952, 568916, 589689, 587722, 581549, 587591, 592487, 589163, 611985, 624935, 611521, 570631, 561247, 572438, 590028, 602545, 604343, 600428, 608181, 591187, 582901, 582068, 558041, 555582, 579157, 589564, 589373, 597318, 608609, 600311, 596640, 578622, 589041, 581047, 531486, 529553, 556252, 564660, 584684, 573386, 565044, 552502, 562781, 587038, 574733, 566368, 562201, 584039, 581599, 599476, 616648, 617994, 602841, 593383, 574877, 587443, 595997, 571798, 590527, 579823, 580070, 569972, 562622, 566401, 551837, 560384, 567848, 591984, 601123, 601441, 587914, 579853, 606002, 618242, 625307, 636461, 648261, 642832]
15086F42832q862M999K3051p174j8811n215k6678k5467k519J5311K7436K6791
15074F45694L563k6776Q266L384k2486J8758M0241K1215j4443k3912j8396j1806
15062F23302j8749O410L087N722L5544R936p629n3483j133j8788m457R847K3842
15049F13451K4501m67j289n876j7365j7427j2102J7014K0199R314j0966m027L2670
15036F47630K2165o549q4J7311M33k1294k9560j9305J6943L561J9938l0781N227
15023F25635J3751l5109O531J9465J5819L722j3786j2168J1548J3282J9874j8108
15011F50456l8533J2282K1867k9197N205l182m34K2019J0816J6928j460j4819
14999F51948Q687J3273M056K3664O830k0555k3631K4812N458k1229r848J2831
$$ y = [642832, 633970, 638969, 662020, 654846, 636035, 630820, 604142, 578675, 576156, 591467, 618903, 645694, 649257, 622481, 630747, 634131, 611645, 630403, 670644, 691859, 677416, 653504, 635108, 623302, 604553, 610963, 614050, 619772, 655316, 665252, 657623, 604140, 603007, 584219, 579762, 589609, 613451, 637952, 637485, 636196, 630320, 612955, 595528, 583426, 600440, 620639, 629953, 618987, 614960, 647630, 669795, 663246, 663162, 680473, 680906, 659612, 630052, 610747, 627690, 631251, 651189, 620408, 625635, 639386, 604277, 610808, 630273, 646092, 649814, 636028, 623860, 635408, 648690, 668564, 650456, 611923, 624205, 646072, 616875, 622080, 618898, 618464, 640483, 651299, 668227, 666767, 651948, 660635, 673908, 677964, 701628, 708458, 687903, 664272, 689084, 694542, 673313, 663465, 676296]
14987F76296J4248j43j8148j8117p32p016N373K804n707K6264P004K929L280q327
14973F80008j4043K1766K5164k2440l4763l2764j7145N2528L5519k6898r952k3619
14961F33361k2426j5205M0894J9471j86Q236J5656J1239m05k7887J1229L199j4263
14948F62913L0736K4815k2981l0133j2723o748j6912K0757R35K4168K7108L0377
14936G32312j0751J2275k6010r804J2079M412L7752k2105k5493R926J3012j33
14924G27472m0253j2599K3232P883M796J8380j4222l2393j7597J7203Q089k6413
14912F63578L0432L1243P154J87j6119j1279K3263O800r789O913K60j265J6662
14899G48040j4397j6840K6683L125J559j7393l5245l148Q98L1015J4488j9015
$$ y = [676296, 690544, 690401, 672253, 654136, 653404, 646388, 651761, 654565, 648858, 675122, 682126, 685055, 688335, 680008, 665965, 687731, 712895, 690455, 655692, 622928, 605783, 658311, 693830, 666932, 656980, 633361, 610935, 595730, 636624, 656095, 655909, 664145, 679801, 691040, 690635, 662748, 673977, 677176, 662913, 693649, 718464, 695483, 665350, 652627, 645879, 628967, 649724, 650659, 674827, 701935, 732312, 721561, 733836, 707826, 698022, 710101, 714513, 752265, 730160, 704667, 714593, 727605, 727472, 687219, 674620, 697852, 705735, 710531, 728911, 714689, 682296, 664699, 681902, 689991, 663578, 694010, 725253, 732407, 732594, 716475, 705196, 728459, 735259, 725470, 732383, 732643, 731378, 748040, 733643, 716803, 743486, 746611, 748170, 730777, 695532, 692384, 693282, 724297, 738785, 719770]
14887G19770P323J3089M803M2269M117m4636n1281m5019m964L0807N2411M2512
14875G71201K036j7067r252m988L801J3769q398o131p430k8884L926O890k3929
14862F95544J542K3178l341K7225J7639R048m804J8736l808l5144J8848M4656
14850H09319J8454n686m029q575k6142k7014O877l193j4570m621n83o663J7835
14837G51409K0952J6822N930J3903k9494R417K0543J2813M558r001r371l718j6421
14824G88342J8928J5495l272J3955K398j9877j2041j698r931k985o173j0306k714
14811G70121J5095Q416k9829K1113L3350j1461J645p556k6632j0755K2560M5438
14799H31505j2733m1639L5828P57j9857K3056k2809m3459k382L4382M1416j3n161
$$ y = [719770, 727093, 740182, 744985, 787254, 791371, 746735, 695454, 650435, 645471, 676278, 728689, 771201, 773237, 756170, 746918, 741930, 745731, 759500, 751102, 744971, 737541, 708657, 712583, 719473, 695544, 697086, 720264, 716923, 744148, 761787, 770835, 766031, 784767, 780959, 745815, 764663, 809319, 827773, 822087, 818058, 809483, 783341, 756327, 763204, 760011, 745441, 740820, 740237, 733574, 751409, 772361, 789183, 795113, 809016, 779522, 788939, 809482, 822295, 826853, 817852, 808481, 804763, 788342, 807270, 822765, 819493, 833448, 835846, 815969, 803928, 802230, 792299, 789314, 783141, 772835, 770121, 785216, 793632, 763803, 784916, 818266, 806805, 808450, 800894, 774262, 763507, 786067, 831505, 818772, 777133, 812961, 813718, 793861, 816917, 794108, 750649, 748267, 782649, 824065, 824052, 818891]
14786H18891J0840K421N389m439k7018J209J5323P280k0045K1058P968n059K3370
14773H57188o362k5190l8742N018K4130J8474J23K807k5008j3981j5070m871j2754
14760G65762J5848K9807p512l2567P987J2418n86J4856m211j7949O908O565J0995
14747H08321K2779R081k889K0680J0308k561k0819j4988j6109J539K2616L979
14735H41937J3439L0980J8079p377P127j1700m217J4437p339j903K6669l8754
14723H81378l8018J1134L77j9669j6852M894j1824j8880m0598M16L2178K8306
14711H12842m564J2851J1727K6543j1218J1670J0185k8185q152N3222L0303k3081
14699H94143n330j6476q566J4316m377k5331j2230m689J386K2724j840J2391J9651
$$ y = [818891, 829731, 832152, 837541, 833102, 806084, 807293, 822616, 829896, 809851, 830909, 838877, 833818, 857188, 850826, 825636, 786894, 791912, 816042, 834516, 834639, 837446, 812438, 798457, 783387, 778516, 765762, 781610, 811417, 803905, 771338, 779325, 791743, 791157, 806013, 801802, 783853, 790761, 797326, 808321, 831100, 840181, 837292, 857972, 868280, 865719, 844900, 829912, 813803, 815342, 837958, 841937, 855376, 886356, 904435, 897058, 904185, 892485, 888268, 902705, 895366, 893463, 920132, 881378, 843360, 854494, 854871, 835202, 818350, 823244, 811420, 792540, 751942, 752358, 784536, 812842, 808278, 821129, 832856, 859399, 848181, 859851, 870036, 841851, 833699, 886921, 917224, 894143, 888813, 872337, 863771, 878087, 873710, 848379, 836149, 831460, 832846, 855570, 853730, 866121, 885772]
14686H85772l366R320k63O319M28O577J2949j5423k4385K6850J3149j2667l8023
14673H67237j5350J4183K4642J2665K5706j499J1540l8620n0954K6059J3519k0840
14661H68288k7433p316J2451K5402N972P250n892j9563j6134q680K7363K1748
14649H83456J9896k9632j0506l297j0703K6926K2388k535Q621K7268N455n598
14637I31739k6371q310L2864P605k088j5406J7915j7206j8437J3616K3633J2584
14625I52138P461k4459n890j765k0940k3698N513J4806Q530L26O208j5032m637
14612H98561j3344j182K2156J0344j2217J7351m976J3023O828M463o455k907l3114
14599H98531q537N042J4377P073q950Q082K817M2883j8008j2626K6037K8295K549
$$ y = [885772, 882406, 891726, 891463, 897782, 898210, 904787, 917736, 902313, 877928, 904778, 917927, 905260, 867237, 851887, 866070, 890712, 903377, 929083, 927584, 939124, 900504, 849550, 875609, 889128, 868288, 840855, 833539, 845990, 871392, 877364, 884614, 878722, 859159, 843025, 834345, 861708, 883456, 903352, 873720, 863214, 859917, 849214, 876140, 898528, 895993, 904614, 931882, 937337, 931739, 905368, 897058, 929922, 937527, 935439, 920033, 937948, 920742, 902305, 915921, 939554, 952138, 959599, 935140, 929250, 927485, 906545, 882847, 888360, 903166, 911696, 912022, 918230, 903198, 898561, 885217, 884035, 906191, 916535, 904318, 921669, 916693, 929716, 936544, 941007, 934552, 931645, 898531, 889994, 895036, 909413, 916486, 907536, 915618, 918435, 961318, 943310, 930684, 956721, 985016, 987565]
14586I87565l8025J0173N596L716L465J2096Q240L1466Q417j2039k3439q875j853
14573I86503J283Q243j5990j0152J6008J7663j4762l2170P542L0656J091J1241
14561A007156J4083P76o092j9055j6350r923J3135L597k2521n808o412o278K6398
14548I72706K3575p685K2358L170p698k4756J442Q710j2160K725n895J0252K4788
14535A011532K1419j390k7007l8049k8762L3862L1331m605K3979k4170j6822N622
14523I86940J9345K4066k1103j1373k699M27K642j5331j8957M945J8185L4145
14511A021232J2792M898j869l776j6965r1J8553p853r867q2J5683K3425J6031
14498A072111n522J0259l133k3256j9887O588J4104k1654J196K686L1070K5103
$$ y = [987565, 949540, 959713, 965309, 969025, 972490, 984586, 992826, 1024292, 1032709, 1020670, 997231, 988356, 986503, 987786, 996029, 980039, 969887, 985895, 1003558, 988796, 956626, 964168, 994824, 995915, 1007156, 1021239, 1022015, 1015923, 996868, 980518, 970595, 983730, 987327, 964806, 958998, 952586, 946308, 972706, 996281, 988596, 1010954, 1014124, 1006426, 981670, 983112, 991822, 979662, 982387, 976492, 986744, 1011532, 1032951, 1031561, 1004554, 966505, 937743, 971605, 1002936, 998331, 1022310, 998140, 981318, 986940, 1006285, 1030351, 1009248, 997875, 995176, 995603, 998245, 982914, 963957, 968902, 987087, 1021232, 1034024, 1038922, 1037053, 1033277, 1016312, 1016221, 1034774, 1026921, 1017054, 1016972, 1032655, 1056080, 1072111, 1066589, 1076848, 1073715, 1050459, 1030572, 1037160, 1051264, 1029610, 1030806, 1033492, 1064562, 1089665]
14486A089665j5432k7461p084J6049J9916j801k1013N723L19N517M241K15M281
14473A073135P788j3808j4833M107m650J7844J9348m81L785J6251J5685p419l3391
14460A083361j0126J1874m4691j6921Q449K0336P723O548k3860k5274N5733L7667
14448A110819p926r158J8112J988m779j0255J4592M632j5330q159J1660J7260
14436A123456j6734q669k5545j5311m873r96J3877k330J5951L4428Q11L035Q004
14423A125104l62k0623l2695j0509L3009J7920N225j6308j1283j7051J8953L1714
14411A123094j8315j2963j5599j5080J5108o858p308q008K2562K8879O024L073
14399A114609J2374j2663j1782K1227J6908k4853k680M055J0973J7231J4652k252
$$ y = [1089665, 1074233, 1046772, 1039688, 1055737, 1075653, 1073852, 1052839, 1058562, 1058881, 1064398, 1068639, 1068854, 1073135, 1080923, 1067115, 1052282, 1056389, 1051739, 1069583, 1088931, 1088450, 1092235, 1108486, 1124171, 1116752, 1083361, 1073235, 1085109, 1040418, 1023497, 1031946, 1052282, 1060005, 1066553, 1042693, 1017419, 1073152, 1110819, 1102893, 1093735, 1111847, 1113835, 1109056, 1098801, 1113393, 1118025, 1102695, 1094536, 1106196, 1123456, 1106722, 1098053, 1072508, 1057197, 1052324, 1051328, 1065205, 1062875, 1078826, 1113254, 1114065, 1117100, 1125104, 1124742, 1104119, 1071424, 1060915, 1093924, 1111844, 1117069, 1100761, 1089478, 1072427, 1091380, 1123094, 1104779, 1091816, 1076217, 1061137, 1076245, 1069387, 1062079, 1054071, 1076633, 1105512, 1111536, 1114609, 1126983, 1114320, 1102538, 1123765, 1140673, 1115820, 1113140, 1117195, 1128168, 1145399, 1160051, 1157799]
14387A157799k4103l3084L4361K9157k9066k8685N50K3542R386m046K2188r587
14375A148412n781K2715N228p206n440k469l6118J2283J3570P595K924L6843o621
14362A185935j1905j4527l0603O810K1990M235J7947J9064l01k044k064J265m780
14349A191022R507n813k2486J2794O016j932L30L9341K4025k4736J6337l085j0921
14336A230399K5926o743o615j6498j3547j954p86k030P746J5645J330j0515j2460
14323A209898Q982R469l8532L030K0780j3983o288k6429J3229L2795N203Q642
14311A226796k4050j5671P429m787O899J6661m166P886J282K6199J6765O292O506
14298A274041k7981l3113P815K8384k7147Q339L1002j6823r638Q58r037J1933
$$ y = [1157799, 1133696, 1100612, 1134973, 1164130, 1135064, 1106379, 1106929, 1130471, 1139857, 1135811, 1157999, 1148412, 1142631, 1165346, 1170574, 1163368, 1157928, 1155459, 1119341, 1131624, 1145194, 1152789, 1155713, 1192556, 1185935, 1174030, 1159503, 1128900, 1135710, 1157700, 1161935, 1179882, 1198946, 1198645, 1196601, 1194537, 1195802, 1191022, 1200529, 1194716, 1172230, 1185024, 1191040, 1189108, 1189438, 1228779, 1252804, 1228068, 1244405, 1241320, 1230399, 1256325, 1249582, 1242967, 1226469, 1212922, 1210968, 1210182, 1208152, 1215898, 1231543, 1232873, 1222358, 1209898, 1218880, 1228349, 1189817, 1192847, 1213627, 1199644, 1193356, 1166927, 1180156, 1212951, 1218154, 1226796, 1202746, 1187075, 1194504, 1189717, 1196616, 1213277, 1209111, 1216997, 1218279, 1244478, 1261243, 1267535, 1274041, 1246060, 1212947, 1220762, 1249146, 1221999, 1230338, 1261340, 1244517, 1234879, 1235737, 1226700, 1238633]
14286A238633j8953r684p942J0984p136M034J2626J4762J7415J4892L8879j7987
14274A290523m5620m1626o21J455j6935k566K2678R878M4091K5619j0703o584
14262A269589l098J6783J2759m594J6986P158l1860n134O5k0389r076J6110K7657
14249A292956K5437r596l0560M664j3893j8409M606P995J5899L8813L7018k1607
14237A333323l4735J214o017l2787j3811k2446J7846k307K5336K3473N993J5071
14225A310153M737r65j5921k3621L955J8394J9868j4368j5135K4614j8040l3506
14213A260165J422M0606J4353L197K1714N636k4598n269J797J6770k0808K6471
14201A341456J7145k4596j7685m090q767J363L0621K8973J5936J8372j4891k3794
$$ y = [1238633, 1219680, 1209996, 1202054, 1213038, 1205902, 1209936, 1222562, 1237324, 1254739, 1269631, 1308510, 1290523, 1244903, 1203277, 1202656, 1204111, 1187176, 1184610, 1207288, 1217166, 1261257, 1286876, 1276173, 1269589, 1266491, 1283274, 1296033, 1291439, 1308425, 1315583, 1283723, 1278589, 1278654, 1258265, 1249189, 1265299, 1292956, 1318393, 1308797, 1278237, 1282901, 1269008, 1250599, 1255205, 1263200, 1279099, 1317912, 1354930, 1333323, 1298588, 1299802, 1293785, 1260998, 1247187, 1224741, 1242587, 1240280, 1265616, 1289089, 1295082, 1310153, 1314890, 1313925, 1298004, 1274383, 1278338, 1296732, 1316600, 1302232, 1287097, 1311711, 1293671, 1260165, 1261587, 1302193, 1316546, 1319743, 1341457, 1347093, 1322495, 1317226, 1319023, 1335793, 1314985, 1341456, 1358601, 1334005, 1316320, 1312230, 1303463, 1304826, 1335447, 1364420, 1380356, 1398728, 1383837, 1360043]
14189A360043j2890k1837J0759K3314J9576m826J0191J6474j6037k4406l534j1647
14177A345180J0526K5503j0551j7346K8686K0227n045J9466m385k4705k8319L1745
14165A390982J0026n384l402j3798m1779J6893L0388m287M68k054j9100r456J2413
14152A361910J9984J2582k273k0367j6260J6764K6892Q133k655l1183k0473J3565
14140A366619L4548J0166M038K4382K0380j7788j6183m1040k3783Q166J2019J2040
14128A393564J6498r588p165k885o712K8499K9326j2728r171P524l260j3095J1517
14115A422324m413K8236j0584j4184k0697j096P169L6231K0500n594l149K6261
14103A481004k864L529m112j9644k8136J4176j7105k4008L7952K1242k6662J137
$$ y = [1360043, 1347153, 1325316, 1336075, 1359389, 1378965, 1374139, 1384330, 1400804, 1384767, 1360361, 1356827, 1345180, 1355706, 1381209, 1370658, 1353312, 1381998, 1402225, 1397180, 1416646, 1412261, 1387556, 1359237, 1390982, 1401008, 1395624, 1392222, 1378424, 1336645, 1353538, 1383926, 1379639, 1380107, 1378053, 1358953, 1349497, 1361910, 1381894, 1394476, 1392203, 1371836, 1355576, 1372340, 1399232, 1407365, 1404710, 1373527, 1353054, 1366619, 1401167, 1411333, 1415371, 1439753, 1460133, 1442345, 1426162, 1385122, 1361339, 1369505, 1381524, 1393564, 1410062, 1400474, 1393309, 1390424, 1383712, 1412211, 1441537, 1428809, 1419638, 1427162, 1423902, 1410807, 1422324, 1417911, 1446147, 1435563, 1421379, 1400682, 1399586, 1406755, 1442986, 1463486, 1457892, 1454743, 1481004, 1478140, 1481669, 1477557, 1457913, 1429777, 1443953, 1426848, 1402840, 1440792, 1462034, 1435372, 1436509]
14091A436509R592L3362J0712j9543J28j7728N899K2452J0484J3035k855l1389
14079A470658K0962L240O29j455P243J3394j8365k2221J8886R862K0054j4015
14067A508872l5667j3809K247j0467K87q769O406O6148L2240j8816m1055o876
14055A480741r095J8599L983n048J3194J3593L0718J6417M459K347J4073l6103
14043A547878k6706l0470K3427K4746Q682k9562r892l8J1386K1048J6943K4337
14031A581779j8323j1755K9726r983k1560o327k4542J1627L5371J3189j8491r326
14019A551385j0930R557L5986L597k503R491K1786l963k4527n619J8130J7840
14007A620230k142j1815m102l216k0675j7752K2719J6621j2134K3553m328J7378
$$ y = [1436509, 1446101, 1479463, 1490175, 1470632, 1470760, 1453032, 1458931, 1481383, 1491867, 1504902, 1502047, 1470658, 1491620, 1494860, 1495489, 1494034, 1501277, 1514671, 1496306, 1474085, 1492971, 1502833, 1522887, 1508872, 1473205, 1459396, 1461643, 1451176, 1451463, 1442694, 1449100, 1515248, 1547488, 1528672, 1487617, 1480741, 1471646, 1490245, 1494228, 1489180, 1502374, 1515967, 1546685, 1563102, 1567561, 1569908, 1583981, 1547878, 1521172, 1490702, 1514129, 1538875, 1547557, 1517995, 1508103, 1508065, 1519451, 1540499, 1557442, 1581779, 1563456, 1551701, 1581427, 1571444, 1549884, 1543557, 1519015, 1530642, 1566013, 1579202, 1560711, 1551385, 1540455, 1550012, 1585998, 1589595, 1587092, 1596583, 1618369, 1614406, 1589879, 1584260, 1602390, 1620230, 1618088, 1606273, 1602171, 1598955, 1578280, 1560528, 1583247, 1599868, 1587734, 1611287, 1606959, 1624337]
13995A624337p816k5100j0829K7510p424j6795j7J0514M869J8670Q489J1722J5012
13982A653142j4552j0900m762p208M3357J9910k0001k9574J0796O903J5441k852
13970A659700k3602r39J9030Q045j6161J5994r184j1383K1103K7699O821l0697
13958A666426k8687Q303K505j5195n290L9055O0k7771j0802J9965Q048j7736m752
13945A634129J5516N471k5469Q548J0720K5360l206J2820R474K4054R504R268
13933A736189k1846l4301N108J1742k4064k772J0790J7736K396k0637J048M860
13921A686249L8941l456j5967r301N33j907j1910K9086K5456q87j6626J1667r423
13908A722455K2164K4658N754q606J0335o393k4878j494K4032K5144k5539r093
$$ y = [1624337, 1616521, 1591421, 1580592, 1608102, 1600678, 1583883, 1583866, 1594380, 1599249, 1617919, 1626408, 1638130, 1653142, 1638590, 1627690, 1622928, 1615720, 1659077, 1678987, 1658986, 1629412, 1640208, 1647111, 1662552, 1659700, 1636098, 1635159, 1654189, 1662234, 1646073, 1662067, 1652883, 1641500, 1662603, 1690302, 1697123, 1666426, 1637739, 1646042, 1648547, 1633352, 1628062, 1667117, 1667177, 1639406, 1628604, 1648569, 1656617, 1638881, 1634129, 1649645, 1655116, 1629647, 1638195, 1648915, 1674275, 1671069, 1683889, 1693363, 1717417, 1726921, 1736189, 1714343, 1680042, 1685150, 1696892, 1672828, 1670056, 1680846, 1698582, 1700978, 1680341, 1681389, 1686249, 1725190, 1721734, 1705767, 1696466, 1696999, 1695092, 1683182, 1712268, 1737724, 1736837, 1720211, 1731878, 1722455, 1744619, 1769277, 1775031, 1766425, 1776760, 1770367, 1745489, 1743995, 1768027, 1793171, 1767632, 1758539]
13896A758539M756j6788j986K2402R934l358l0432O505J7497k582j4618J7711
13884A767580K2419k0883J2820L2345K3262j5238M731j6398r311j6545R21L3186
13872A818889j2361R041l3720N79J794J4713L3680J5381j1959k1074k9649o676
13860A778638r534M4223J3774k9496l949R07J3051K2871R22N19J779J530J829
13847A837064P411k4593j7950K4387K3724j219k5792J5829J3318j408N100L8018
13835A893889J071l0033J4137J4003k7239L9452K8495l843J8847J3744j1676j6841
13823A934006j5814j7874k3425K5776K5141m995k5950P088J2597j7198l348p993
13811A888011J5756M1622q636r827j9143J4044J2174Q406L5869J931J646k158
$$ y = [1758539, 1763295, 1746507, 1744521, 1766923, 1776857, 1773499, 1743067, 1749572, 1767069, 1764487, 1749869, 1767580, 1789999, 1769116, 1781936, 1814281, 1837543, 1822305, 1827036, 1810638, 1801327, 1784782, 1785703, 1818889, 1806528, 1815569, 1781849, 1782428, 1784222, 1798935, 1832615, 1847996, 1836037, 1814963, 1785314, 1778638, 1769104, 1813327, 1827101, 1797605, 1793656, 1794563, 1807614, 1830485, 1831407, 1831926, 1833705, 1835235, 1837064, 1844475, 1819882, 1801932, 1826319, 1850043, 1848824, 1823032, 1838861, 1852179, 1850771, 1855871, 1893889, 1894960, 1864927, 1879064, 1893067, 1865828, 1905280, 1933775, 1929932, 1948779, 1962523, 1950847, 1934006, 1918192, 1900318, 1876893, 1902669, 1927810, 1922815, 1896865, 1903953, 1916550, 1899352, 1896004, 1888011, 1903767, 1945389, 1936753, 1926926, 1907783, 1921827, 1934001, 1942407, 1978276, 1980207, 1981853, 1979695]
13799A979695J2900m507j0384J6231K1205k1312m3330l2550M586R078N568q829
13787A928351j3554K7705K4518k8332j6850K246J6906K7925J3504j0101k1375
13776A950943p65N8180j184k4590R843J8795q544m40j2786j4659L2353J4919o060
13763B016005j9534R123K3580R804k3416k9507J7306K7504J2139L194O671O456
13751B059325J2318k1505M575L164l8466j2428K1592q277l682L3581M4874j1241
13739B083830k5773M136M053p981l0950M844Q817M5956K9703K6040k243j266R519
13726B148685N206k4561M697L4201K1027k5766j4842J1928J0435k5280j7358K4726
13714B153098k9725L837M3929K7194q555r99j7200j4114m000J2985K5636L435
$$ y = [1979695, 1992595, 1988088, 1977704, 1993935, 2015140, 1993828, 1950498, 1917948, 1922534, 1931612, 1937180, 1928351, 1914797, 1942502, 1967020, 1938688, 1921838, 1924084, 1940990, 1968915, 1982419, 1972318, 1950943, 1950178, 2008358, 2007174, 1982584, 1992427, 2011222, 2002678, 2002238, 1989452, 1974793, 2007146, 2022065, 2016005, 1996471, 2005594, 2029174, 2038978, 2015562, 1986055, 2003361, 2030865, 2043004, 2046198, 2052869, 2059325, 2071643, 2050138, 2054713, 2057877, 2019411, 2006983, 2028575, 2020298, 2016616, 2050197, 2095071, 2083830, 2058057, 2062193, 2066246, 2058265, 2027315, 2032159, 2040976, 2086932, 2116635, 2142675, 2140432, 2139166, 2148685, 2153891, 2129330, 2134027, 2168228, 2189255, 2163489, 2148647, 2160575, 2171010, 2145730, 2128372, 2153098, 2123373, 2127210, 2171139, 2198333, 2189778, 2188779, 2171579, 2157465, 2153465, 2166450, 2192086, 2195521]
13702B195521j1832k1117O563K7501M0654j150n5502r690n295n616m240L1651
13690B187448J0455j42q115j4064K072J5087j3166Q351J5350m567k4096k4812
13678B149801K4820J0854J0024o922k5950K2627M0332J1301J5589j096k270m766
13666B244344L4375L4498l1244m5105l7128J9176L1881J877J3540L5574r390j8735
13654B273663J1371K1506m204j5513j599Q662K1106K1543j3613K467j3719K561
13642B314231J4284Q205j2027l6011J4823K5077Q276J7851O972j8497O011Q167
13630B357362P550J519k1307J5489R479J2710K6720L269K28k3379L000j425j3054
13617B378161J0757L630L2008J4431J919O984q908j1716k04O448J9838m276o098
$$ y = [2195521, 2183689, 2162572, 2169135, 2196636, 2237290, 2236140, 2180638, 2170948, 2165653, 2160037, 2155797, 2187448, 2197903, 2197761, 2189646, 2175582, 2177654, 2192741, 2179575, 2187926, 2203276, 2198709, 2174613, 2149801, 2174621, 2185475, 2195499, 2188577, 2162627, 2185254, 2225586, 2236887, 2252476, 2251380, 2249110, 2244344, 2278719, 2313217, 2281973, 2236868, 2199740, 2218916, 2250797, 2252674, 2266214, 2301788, 2292398, 2273663, 2285034, 2306540, 2302336, 2286823, 2285224, 2293886, 2314992, 2336535, 2322922, 2325389, 2311670, 2314231, 2328515, 2336720, 2324693, 2288682, 2303505, 2328582, 2336858, 2354709, 2361681, 2343184, 2349195, 2357362, 2364912, 2366431, 2345124, 2360613, 2370092, 2382802, 2409522, 2412791, 2413019, 2389640, 2392640, 2391215, 2378161, 2388918, 2392548, 2424556, 2438987, 2440906, 2447890, 2438982, 2427266, 2427062, 2433510, 2453348, 2449072, 2442974]
13604B442974p484l0247j344L2763Q701k0320J8937p051l848L5377K0105k0074
13592B468489q260r265O302j1190p881J8230J8569J6558J8882l47K360J312j9436
13579B494323M205K374J385J4851J7656L5621K0982J1065M313l0278n725K4930
13567B595702J0403J900m471j1605j7850K023L249p007j1805N727K9965K4160
13555B620391o428p127o482N2322K9553o036l610k5257n3728j807j6408j3484
13543B561899j1246J172R882J3173N222o83p283Q90J3188J6903K7777K027J3023
13530B645944K6312R879j853L6780j9181l3169J4919j8380J36m490K3927K0204
13518B701028J4868K244n994K708M8628J98j779O576r722r04K3058K2885j0350
$$ y = [2442974, 2435490, 2405243, 2403899, 2436662, 2445363, 2425043, 2443980, 2436929, 2433081, 2468458, 2488563, 2468489, 2460229, 2450964, 2457266, 2446076, 2438195, 2456425, 2474994, 2491552, 2510434, 2510087, 2512447, 2513759, 2494323, 2498528, 2500902, 2502287, 2517138, 2534794, 2570415, 2591397, 2602462, 2606775, 2576497, 2570772, 2595702, 2606105, 2608005, 2603534, 2591929, 2574079, 2576102, 2579351, 2572344, 2560539, 2566266, 2596231, 2620391, 2613963, 2606836, 2600354, 2652676, 2682229, 2676193, 2672583, 2647326, 2593598, 2591791, 2575383, 2561899, 2550653, 2551825, 2561707, 2574880, 2580102, 2579419, 2572136, 2573026, 2586214, 2603117, 2630894, 2632921, 2645944, 2672256, 2682135, 2680282, 2717062, 2697881, 2664712, 2679631, 2661251, 2661387, 2656897, 2680824, 2701028, 2715896, 2718140, 2712146, 2714854, 2763482, 2763680, 2761901, 2768477, 2758755, 2757851, 2780909, 2803794, 2793444]
13505B793444q063l2523J1253J9632r263j2796l6902l7979m203J513P374M2448
13493B733935N6k904R413L7735L8504K758P516N854k815j5542j6431k3022J2622
13480B787679L6355P706j351K5675K0394K2148L3799k9360k1716j5189N037k4407
13468B846770j8767J8593L0844P617J5613K0193Q869L639O629J7359k6751k8799
13456B901809K3739K6617j7576L81j6401j566K3426L4941j1801j5623Q801O81
13444B957428Q138K8315N246q934J6419o663r658L435J2784J9376K9833M2282
13432C098001N353k9366k0967J0992k3343l0341L402J3082Q957l3333j1183K3704
13420C014958J9520J8716L3567K916k1479O648K7532j4248j5745M4623J3106J3144
$$ y = [2793444, 2785381, 2752858, 2764111, 2783743, 2774480, 2761684, 2724782, 2686803, 2682600, 2684113, 2691487, 2733935, 2733991, 2731087, 2740500, 2778235, 2816739, 2819497, 2827013, 2832867, 2830052, 2814510, 2798079, 2775057, 2787679, 2824034, 2831740, 2830389, 2856064, 2876458, 2898606, 2932405, 2903045, 2881329, 2866140, 2871177, 2846770, 2828003, 2846596, 2877440, 2885057, 2900670, 2920863, 2929732, 2933371, 2940000, 2957359, 2930608, 2901809, 2925548, 2952165, 2934589, 2934970, 2918569, 2917003, 2940429, 2975370, 2963569, 2947946, 2956747, 2957428, 2965566, 2993881, 2999127, 2990193, 3006612, 2999949, 2990291, 2993726, 3006510, 3025886, 3055719, 3098001, 3103354, 3073988, 3053021, 3064013, 3040670, 3010329, 3013731, 3026813, 3035770, 3002437, 2991254, 3014958, 3034478, 3053194, 3086761, 3089677, 3068198, 3074846, 3102378, 3088130, 3072385, 3117008, 3130114, 3143258]
13408C143258L2361N859j7045J0156J6299J8902R388j8519k6782Q44L7161O521
13396C218403j0946J9767J9966J3004j0229O689P255j9983j8199j652j9495M399
13384C208979J5777n939M401J9456K2059O325o462J6973K094n957n850J0039M756
13371C286651r90J0090J6981N7179Q994k6089o721n710P27Q542L6938R29J4250
13358C401771K6948K3525J3285J64K2413K0943l9499l6821Q491L1575J6575j3433
13346C475937l839J0992k616R23P1987K9431l3808k7104j4087L4992L0938J1623
13334C585369J816J2389J2445o061k6580l7537P377M390p358M6148M3123J2872
13322C648393j4154J3599j0563J9325m670J7534J5680J7728M678R097L337J5001
$$ y = [3143258, 3175619, 3181478, 3164433, 3174589, 3190888, 3209790, 3219178, 3200659, 3173877, 3174721, 3211882, 3218403, 3207457, 3227224, 3247190, 3260194, 3249965, 3256654, 3263909, 3243926, 3225727, 3224075, 3204580, 3208979, 3224756, 3218817, 3223218, 3242674, 3264733, 3271058, 3264596, 3281569, 3283663, 3277706, 3271856, 3281895, 3286651, 3285661, 3295751, 3312732, 3369911, 3378905, 3352816, 3346095, 3340385, 3341112, 3349654, 3386592, 3387521, 3401771, 3428719, 3452244, 3465529, 3465693, 3488106, 3509049, 3469550, 3432729, 3441220, 3472795, 3489370, 3475937, 3472098, 3483090, 3480474, 3481397, 3553384, 3582815, 3549007, 3521903, 3507816, 3542808, 3573746, 3585369, 3587185, 3599574, 3612019, 3605958, 3579378, 3541841, 3549218, 3553608, 3546250, 3592398, 3635521, 3648393, 3634239, 3647838, 3637275, 3656600, 3651930, 3669464, 3685144, 3702872, 3707550, 3716647, 3719984, 3734985]
13310C734985m90J7808P168M4216J1287j7583k6840K802L7878L5648K6786r272
13298C864393j0836j119K7700J2311k0558j2594L1986L5700K2426j5729j3237
13287C920443L5349K7095Q873K5240k23J7053m924k7701o687M0271L1956L1592
13275D098337k0450J4714L797L068K275J7015K9393M0146k643K6611J0620J1330
13263D234213R715k7275k080J9059J2737K7117o772M950J8925L3090J9100j3792
13251D328987M7605M7068L745o910j8915L488J3884J7817J1601J9353K0369J2636
13239D500728J5938L1375N332L3450J0015p97o36M7377M177J4240Q728K2552K8363
13226D720842L4386L8566N1140L976p29J5794O2703K7203M480J1156L2034M2089
$$ y = [3734985, 3734495, 3752303, 3759471, 3803687, 3814974, 3797391, 3770551, 3773353, 3811231, 3846879, 3873665, 3864393, 3853557, 3852438, 3880138, 3892449, 3871891, 3859297, 3891283, 3926983, 3949409, 3933680, 3920443, 3955792, 3982887, 3991760, 4017000, 4016777, 4033830, 4028906, 4001205, 3994518, 4034789, 4066745, 4098337, 4077887, 4092601, 4096398, 4099466, 4101741, 4118756, 4148149, 4188295, 4185652, 4212263, 4222883, 4234213, 4243928, 4216653, 4214573, 4233632, 4246369, 4273486, 4266714, 4271664, 4290589, 4323679, 4342779, 4328987, 4376592, 4423660, 4427405, 4420495, 4401580, 4405068, 4418952, 4436769, 4448370, 4467723, 4488092, 4500728, 4516666, 4548041, 4553373, 4586823, 4596838, 4596041, 4595405, 4642782, 4646959, 4661199, 4669927, 4692479, 4720842, 4755228, 4793794, 4844934, 4848910, 4848181, 4863975, 4926678, 4953881, 4958361, 4969517, 5001551, 5043640]
13214E043640J9407K7716L7589K8965K1639J1807O4334O1128L9662M2747L5251
13203E433885M8633Q8127Q8586P2569J10182J24947R9772J26145J48970J68899
13193F510715J15137L5502r6523k52206l66630m86238m38336k47645K5579J61526
13183D960881K28550K32441K42810K15812J84392N2282j04301k47659m22032o81948
13173D661228o74938k12678J25714J79280K16538K03454J62164J42695J34358
13164D937815J38623J47051R4094Q5460J23402J09094J33702J40299J70109J73759
13154F253408K03394K53567K74999K88725L67429M04905L12121Q6069k56493o85303
13144G502821j176178j608772j677376j198362m37487J69776L75692L22830K71826
$$ y = [5043640, 5063047, 5090763, 5128352, 5157317, 5178956, 5190763, 5255097, 5316225, 5355887, 5398634, 5433885, 5482518, 5570645, 5659231, 5731800, 5841982, 5966929, 6066701, 6192846, 6341816, 6510715, 6625852, 6661354, 6564831, 6312625, 5945995, 5459757, 5021421, 4773776, 4799355, 4960881, 5189431, 5421872, 5664682, 5880494, 6064886, 6117168, 6012867, 5765208, 5343176, 4661228, 3986290, 3773612, 3899326, 4078606, 4295144, 4498598, 4660762, 4803457, 4937815, 5076438, 5223489, 5317583, 5403043, 5526445, 5635539, 5769241, 5909540, 6079649, 6253408, 6456802, 6710369, 6985368, 7274093, 7641522, 8046427, 8358548, 8444617, 8188124, 7502821, 6326643, 4717871, 3040495, 1842133, 1404646, 1574422, 1950114, 2272944, 2544770]
13135B544770K76835K03128J83258J62612J31878J08232J56400J72747J09857
13126D049717J01321J09035J57167J06789J01985P3187O5218Q0898J05175R8074
13116E048566J07373J25605J18985J20014J52139J57968J82739K27807K44779
13107F485975K42265K80808L42154L37440K59367J25130j31701n63248j077502
13098F300688j604854j777690j402132o34519O9314L47314L66326L35987L11102
13089B311536K56063K18286J48431J11559J08091J38136J22677R3578J18352J08083
13079C734792P0463P9789P1343R3831R8957O8374O4205R8587O4204L3296Q0087
13068D557928P4616M0645N7063J13070P5000O2539Q7703P7945J05209J01291J47614
$$ y = [2544770, 2821605, 3024733, 3207991, 3370603, 3502481, 3610713, 3767113, 3939860, 4049717, 4151038, 4260073, 4417240, 4524029, 4626014, 4699201, 4764419, 4845317, 4950492, 5048566, 5155939, 5281544, 5400529, 5520543, 5672682, 5830650, 6013389, 6241196, 6485975, 6728240, 7009048, 7351202, 7688642, 7948009, 8073139, 7941438, 7378190, 6300688, 4695834, 2918144, 1516012, 881493, 950807, 1298121, 1664447, 2000434, 2311536, 2567599, 2785885, 2934316, 3045875, 3153966, 3292102, 3414779, 3508357, 3626709, 3734792, 3805255, 3885044, 3956387, 4050218, 4149175, 4217549, 4281754, 4380341, 4444545, 4477841, 4557928, 4632544, 4673189, 4730252, 4843322, 4918322, 4980861, 5068564, 5146509, 5251718, 5353009, 5500623]
13057E500623J00366m589j42303k82157m69887n82385m96572k38720l960J41267
13047C521683J71813J39865J26715J03264P7535N0593O1774R8732Q5159P2969
13037D510102K025L4529N5777N9099O9135K4914J6848K2085M2556M0196M0245
13026D917511J8789N3109M3170N3462K4649L5994N4992M4022K6161P784L894J9050
13014E302587J1240J5230K4696k657L6141O9162N1793M8501M8962K3505L9287
13003E668447M3705O0191L2532J3044J3683o114J8123N2408M7529P709J8688N0887
12991F020832N9402M4362J5399N2601N0917K0568O3046M2100K7859K5191o477
12980F415800M4613N1953N4972J6979J5163L2418N6207K2615K7381K221o0733
$$ y = [5500623, 5600989, 5596400, 5454097, 5171940, 4702053, 4119668, 3623096, 3384376, 3380416, 3521683, 3693496, 3833361, 3960076, 4063340, 4140875, 4191468, 4253242, 4351974, 4437133, 4510102, 4512127, 4546656, 4602433, 4661532, 4730667, 4755581, 4772429, 4794514, 4837070, 4877266, 4917511, 4936300, 4989409, 5032579, 5086041, 5110690, 5146684, 5201676, 5245698, 5271859, 5279643, 5283537, 5302587, 5313827, 5329057, 5353753, 5351096, 5387237, 5456399, 5508192, 5556693, 5605655, 5629160, 5668447, 5712152, 5772343, 5804875, 5817919, 5831602, 5825488, 5843611, 5896019, 5943548, 5951257, 5969945, 6020832, 6080234, 6124596, 6139995, 6192596, 6243513, 6264081, 6327127, 6369227, 6397086, 6422277, 6415800, 6460413, 6512366, 6567338, 6584317, 6599480, 6631898, 6688105, 6710720, 6738101, 6740322, 6679589]
12969F679589L0152J10374O9587l938p1633o7747O9261R5201O547J2941l189L3648
12957F960793M0295N5235N0084K9584L6132M2471J583N3146P0563K1020L9717
12946G400623N1226M7614L6764L1504K3726L1376J3999K8391M4910M3031O6702
12935G819866J7750L5961O4232M2496O2254O2351L7541L7396O7076O4092K6427
12924H337442L2431L1007L9397N6244N5904J8814M1599M1940N0993P0950O8310
12913H845031M3578K9063K4820N5925Q0425P6213N8551O9716K3868P3558P5889
12902I456637Q4988R9978J08947R9857q3n6482p881K0233J6241N994O2387P9361
12890I970177O4209Q3308J03737Q8423P4539M8979N8560P4203R0007N3156O1413
$$ y = [6679589, 6709741, 6820115, 6889702, 6885764, 6814131, 6746384, 6815645, 6910846, 6917393, 6930334, 6927145, 6960793, 7001088, 7056323, 7106407, 7135991, 7172123, 7214594, 7216177, 7269323, 7339886, 7360906, 7400623, 7451849, 7499463, 7536227, 7567731, 7591457, 7622833, 7636832, 7665223, 7710133, 7753164, 7819866, 7837616, 7873577, 7937809, 7980305, 8042559, 8104910, 8142451, 8179847, 8246923, 8311015, 8337442, 8369873, 8400880, 8440277, 8496521, 8552425, 8571239, 8612838, 8654778, 8705771, 8776721, 8845031, 8888609, 8917672, 8942492, 8998417, 9078842, 9155055, 9213606, 9283322, 9307190, 9380748, 9456637, 9541625, 9641603, 9750550, 9850407, 9850324, 9793842, 9785961, 9806194, 9822435, 9828429, 9890816, 9970177, 10034386, 10117694, 10221431, 10309854, 10384393, 10433372, 10491932, 10566135, 10656142, 10709298, 10770711]
12879A0770711Q3488M7654M1537K4447K2514K7555O3186P1050Q4316J39529J42711
12868A1518698J51288J14765O0042R3984J13804J53881J96025R9448L4634j9247
12858A2517322m7217r2373j63416r6140N6443J02841J21455J07057J10387J40109
12848A2756468R7313Q9770J10800R5456K7605J8271R1830J58841J78596K01097
12838A3826047M94527O32238J40652j71303p370J10986J46154J03540J20476J11188
12828A5507135J14723R0062J46263K06677K01875J79109J94941J93308J92328
12819A7026421K02372J64354J58336K29250K11574J89553J68413K57288K27507
12810A8835068K03797K44612K37371K35757K43808K22313L12169M20552M88346
$$ y = [10770711, 10854199, 10901853, 10943390, 10967837, 10990351, 11017906, 11081092, 11152142, 11236458, 11375987, 11518698, 11669986, 11784751, 11844793, 11938777, 12052581, 12206462, 12402487, 12501935, 12536569, 12517322, 12470105, 12377732, 12214316, 12118176, 12174619, 12277460, 12398915, 12505972, 12616359, 12756468, 12853781, 12943551, 13054351, 13149807, 13177412, 13195683, 13287513, 13446354, 13624950, 13826047, 14320574, 14952812, 15093464, 14922161, 14914791, 15025777, 15171931, 15275471, 15395947, 15507135, 15621858, 15711920, 15858183, 16064860, 16266735, 16445844, 16640785, 16834093, 17026421, 17228793, 17393147, 17551483, 17780733, 17992307, 18181860, 18350273, 18607561, 18835068, 19038865, 19283477, 19520848, 19756605, 20000413, 20222726, 20534895, 20955447, 21443793]
12801B1443793N09705M18055L09246K78340K7734n56483p01043m49994p90754
12792B0488599j509791j129133J35433P27944P95845O76800N36596M57206L38681
12783B1518180K57554K98989L15046J70092Q248R9265K82933M33614M79772N14840
12773B4378533N63017N70052N48925N09757M70334M78676M95926N33194N53662
12764B9102076N69207N74234N64692O59544P05618P25151P24165P36773P66674
12755C5128134P96087Q74161R23880R63178R93837J040849J113749J208310J232652
12746D4274837J265450J265145J286264J332855J366580J420774J635768J913821
12738E5761494K214103K408117K560487K693376K848136L065453L256205L584226
$$ y = [21443793, 21953498, 22371553, 22680799, 22959139, 22986873, 22430390, 21729347, 21279353, 20488599, 18978808, 17849675, 17985108, 18713052, 19508897, 20185697, 20722293, 21179499, 21518180, 21775734, 22074723, 22389769, 22559861, 22568109, 22667374, 22950307, 23383921, 23863693, 24378533, 24941550, 25511602, 26060527, 26570284, 27040618, 27519294, 28015220, 28548414, 29102076, 29671283, 30245517, 30810209, 31469753, 32175371, 32900522, 33624687, 34361460, 35128134, 35924221, 36798382, 37722262, 38685440, 39679277, 40720126, 41833875, 43042185, 44274837, 45540287, 46805432, 48091696, 49424551, 50791131, 52211905, 53847673, 55761494, 57975597, 60383714, 62944201, 65637577, 68485713, 71551166, 74807371, 78391597]
12730G8391597L896597M186302M610895N270349N946032O503036P118347P937263
12722A23860418R383822J1929887J5116030J8754501K2976282K7054290K7143921
12715B56219151J3875563j6413019m5235876o7276364j18872036j63948544j05132991
12708b46784116o850425K8199833K8944228K3186472J8207987J4819302J2346813
12701a27929906J0395665Q758465P336869N768501M593770M313319M244619L902815
12693g8615883L740615L697622L425521K886278K247188J780538J393814J145376
12685e8298931J091312J096010J121635J166591J158316J150339J121234J057709
12677d9335785J033968J006406R11016Q39053P55146P22647P43240P82280P99104
$$ y = [78391597, 82288194, 86474496, 91085391, 96355740, 102301772, 108804808, 115923155, 123860418, 133244240, 145174127, 160290157, 179044658, 202020940, 229075230, 256219151, 270094714, 253681695, 208445819, 141169455, 22297419, -141651125, -246784116, -253634541, -225434708, -196490480, -173304008, -155096021, -140276719, -127929906, -117534241, -108775776, -101438907, -95670406, -91076636, -86763317, -82518698, -78615883, -74875268, -71177646, -67752125, -64865847, -62618659, -60838121, -59444307, -58298931, -57207619, -56111609, -54989974, -53823383, -52665067, -51514728, -50393494, -49335785, -48301817, -47295411, -46384395, -45545342, -44790196, -44067549, -43324309, -42542029, -41742925]
12668d1742925P84233P65589P68093P32111P22452P06658O79942O20932N72857
12659c5390058N66640N27546N36391N02928M91030N13105N38970N24321M54337
12650c0734790M65167M56413M02777L74729M21589M22986L76299L47422L64708
12641b7102700L61915L81087L68512L42343L17678L25397L58046L28625K59530
12632b4059567K35185K27218K65100K51291K32977K51218K54291K84479K96234
12623b1761574K64270K63799K69835K39004K28868J92810K08236K13581K25940
12614a9655231K32798K27669K60214K89717K75375K38646K06870J79956J51941
12605a7592045J73813K30242K35394J80555J78107J78072J91633K29044K36839
$$ y = [-41742925, -40958692, -40193103, -39425010, -38692899, -37970447, -37263789, -36583847, -35962915, -35390058, -34823418, -34295872, -33759481, -33256553, -32765523, -32252418, -31713448, -31189127, -30734790, -30269623, -29813210, -29410433, -29035704, -28614115, -28191129, -27814830, -27467408, -27102700, -26740785, -26359698, -25991186, -25648843, -25331165, -25005768, -24647722, -24319097, -24059567, -23824382, -23597164, -23332064, -23080773, -22847796, -22596578, -22342287, -22057808, -21761574, -21497304, -21233505, -20963670, -20724666, -20495798, -20302988, -20094752, -19881171, -19655231, -19422433, -19194764, -18934550, -18644833, -18369458, -18130812, -17923942, -17743986, -17592045, -17418232, -17187990, -16952596, -16772041, -16593934, -16415862, -16224229, -15995185, -15758346]
12596a5758346J36883L061j12257k65645m90398l63269R2057L40077K95761J76880
12586a5945196J19417J04636R738q5238J8603J61127K28236K24622J80216J98099
12576a4785740J65877J50772J39166J49636J07548J77818J73567J50083J56982
12567a3414291J63587J43868J06960J12003J33289J36693R5441J49349J12025
12558a2261076O8133Q7467Q4199R8598R2605N8663P2169O8310Q2383R3954N8158
12547a1396437N0808N8408P1082P2941L6917Q7053J04482N7624O9672R4544R1761
12536a0601145P0894N5385M4076M0517M5696P5483J14971J38144J02992R8430
12526i814557J15167O8768O0524O1568Q8494L880k7221l635O1491R2530O0978
$$ y = [-15758346, -15621463, -15618402, -15730659, -15996304, -16486702, -16849971, -16757914, -16417837, -16122076, -15945196, -15825779, -15721143, -15711405, -15796643, -15778040, -15616913, -15388677, -15164055, -14983839, -14785740, -14619863, -14469091, -14329925, -14180289, -14072741, -13894923, -13721356, -13571273, -13414291, -13250704, -13106836, -12999876, -12887873, -12754584, -12617891, -12522450, -12373101, -12261076, -12192943, -12105476, -12021277, -11922679, -11830074, -11771411, -11699242, -11630932, -11548549, -11454595, -11396437, -11345629, -11287221, -11216139, -11143198, -11106281, -11019228, -10914746, -10857122, -10787450, -10692906, -10601145, -10530251, -10474866, -10430790, -10390273, -10344577, -10269094, -10154123, -10015979, -9912987, -9814557, -9699390, -9630622, -9570098, -9508530, -9420036, -9416156, -9443377, -9447012, -9385521, -9292991, -9232013]
12515i232013Q2059N8403L4621P1802M5043L1493L1490K4144M9852L6175K5512
12504h741419O8238R4768Q5283N3940M5240J7740M4465M6528J2886M1453O3447
12493h167431J3338N0921K7362K7394J4331K1071P4507J6283K1885M6432O6944
12482g786963J7007M1515M1421K923O2479O1904J8160n857M2831K2895R625L0865
12470g441195K8890M3842O3116K5570L1808R938K7727O8316K2668L7488N6172
12459g025660J8531J3912M0007L5161n054J8798K3738K0121K5063J7992K5298
12448f792093M3133L7454M8454O1287J1044M9266M6403n151K6705M0720K7425
12437f405353K4255M1788O7339L9342k881L0268K7251L2269J8150J895J1853N2713
$$ y = [-9232013, -9149954, -9091551, -9056930, -8985128, -8940085, -8908592, -8877102, -8852958, -8803106, -8766931, -8741419, -8673181, -8578413, -8493130, -8439190, -8393950, -8376210, -8331745, -8285217, -8272331, -8230878, -8167431, -8154093, -8103172, -8075810, -8048416, -8034085, -8013014, -7938507, -7922224, -7900339, -7853907, -7786963, -7769956, -7728441, -7687020, -7684097, -7621618, -7559714, -7541554, -7547411, -7504580, -7481685, -7472060, -7441195, -7412305, -7368463, -7305347, -7279777, -7247969, -7238031, -7210304, -7141988, -7119320, -7081832, -7025660, -7007129, -6993217, -6953210, -6918049, -6923103, -6904305, -6880567, -6860446, -6835383, -6817391, -6792093, -6748960, -6711506, -6663052, -6601765, -6590721, -6541455, -6495052, -6500203, -6473498, -6432778, -6405353, -6381098, -6339310, -6271971, -6232629, -6235510, -6205242, -6177991, -6145722, -6127572, -6125677, -6113824, -6061111]
12425f061111M9865L3596N923K3187N0374K1264K6115K3785L8773q11L668L8381
12413e746991j829j6293p650L5342J4615J3763N3132P6951O3026R583j1258J5538
12401e502071K3201M1722O4039M5438j7785j8039K4871K2970L1672N6108J6807
12390e211067J1773J5779N1431J0290j0122J7890K0279M2335L631L2010N3319
12379d962452Q061J1526K4400l699j5781K0790L0243K2978L8938J7943j7616R283
12367d815386K1912K2282J0114J4659K2142J4164K6293L7398L5637J679n487L5617
12355d578976M0337K7607L4178J4932K4503Q772J6221q377j8105J3805K4685L3938
12343d366480M5784L2351J6568L1720J3984J0396J628J7263k647k1152j903J6016
$$ y = [-6061111, -6011246, -5977650, -5971727, -5948540, -5898166, -5876902, -5850787, -5827002, -5788229, -5789040, -5785372, -5746991, -5748820, -5765113, -5772763, -5737421, -5722806, -5709043, -5655911, -5578960, -5515934, -5506351, -5517609, -5502071, -5478870, -5437148, -5373109, -5327671, -5345456, -5363495, -5338624, -5315654, -5283982, -5227874, -5211067, -5199294, -5183515, -5132084, -5121794, -5131916, -5114026, -5093747, -5051412, -5047781, -5015771, -4962452, -4954391, -4942865, -4918465, -4922164, -4937945, -4917155, -4886912, -4863934, -4824996, -4807053, -4824669, -4815386, -4793474, -4771192, -4761078, -4746419, -4724277, -4710113, -4683820, -4646422, -4610785, -4609106, -4614593, -4578976, -4538639, -4511032, -4476854, -4461922, -4437419, -4428647, -4412426, -4420803, -4438908, -4425103, -4400418, -4366480, -4320696, -4288345, -4271777, -4240057, -4226073, -4215677, -4214049, -4196786, -4199433, -4220585, -4222488, -4206472]
12331d206472L3856L6805L589K193j72J8903K2531M5469q237K0081J3426q057
12319d026085K8225L2289k7893J8205M9347M6113k2744J289M1698K8271K2103
12308c809182j3606j1676J3579K4351Q817J2070K3505L6363L6596j0681k233K441
12296c689656J4036J8940K6804Q207Q953R14J8871K2419J9181K1971J6868l652
12284c516144j184L0173O129q9M5346O3770N607j9066J8117L5486K8947K7128
12272c275780K2074M891M190M534P327k491J7899O3270J8492O910L6904L3539
12260c058241L3425J5891M737O110N3178N1670M6847N4414O4112P9504Q7021P7049
12248b484283P1043J07108J18927J29127J21574M8997j37057k96243n08300p50800
$$ y = [-4206472, -4172616, -4135811, -4132222, -4130029, -4130201, -4111298, -4088767, -4043298, -4051535, -4031454, -4018028, -4026085, -3997860, -3965571, -3993464, -3975259, -3925912, -3879799, -3902543, -3901254, -3859556, -3831285, -3809182, -3822788, -3834464, -3820885, -3796534, -3787717, -3775647, -3752142, -3715779, -3679183, -3689864, -3692097, -3689656, -3675620, -3656680, -3629876, -3621669, -3612716, -3611802, -3592931, -3570512, -3551331, -3529360, -3512492, -3516144, -3517328, -3487155, -3481026, -3481115, -3435769, -3371999, -3366392, -3385458, -3367341, -3331855, -3302908, -3275780, -3253706, -3248815, -3244625, -3240091, -3232764, -3235255, -3217356, -3154086, -3135594, -3128684, -3091780, -3058241, -3024816, -3008925, -3004188, -2998078, -2944900, -2893230, -2846383, -2791969, -2727857, -2648353, -2561332, -2484283, -2413240, -2306132, -2187205, -2058078, -1936504, -1887507, -2024564, -2320807, -2829107, -3579907]
12238c579907p11809k37652J16875J46142J10745J23955J11210Q4218N7524K9806
12228c748893L5866N5311L1042K4154N0943K5698R137M0172N0277P55N4023N1690
12216c319825K3338L2964m263j7608K6939L5139r232K283j360l723J1660M7821
12204c175867J7605R787R792j4218J2366J2536L044K4386M9405J1022J0738J857
12192c027547L3639K7164O123J4318j7774J0857K7920j4009l363M3501K1829N033
12180b872309K7978J5526R260K5978O436N426n340J4070j93J2708L3390J2698
12168b714372N353J6006J8096Q897L3345Q775j4286o143m373m9723j14496k4645
12156b837566j96Q815l724L230L4755K8287K4054J6794J9979K2654K885j486r287
$$ y = [-3579907, -4291716, -4529368, -4412493, -4266351, -4155606, -4031651, -3920441, -3836223, -3778699, -3748893, -3713027, -3657716, -3626674, -3602520, -3551577, -3525879, -3516742, -3476570, -3426293, -3425538, -3371515, -3319825, -3296487, -3263523, -3267786, -3285394, -3258455, -3223316, -3232548, -3230265, -3231625, -3235348, -3223688, -3175867, -3158262, -3148475, -3138683, -3152901, -3140535, -3127999, -3124955, -3100569, -3051164, -3040142, -3029404, -3027547, -2993908, -2966744, -2960621, -2946303, -2964077, -2953220, -2925300, -2939309, -2942672, -2899171, -2877342, -2872309, -2844331, -2828805, -2819545, -2793567, -2787131, -2781705, -2787045, -2772975, -2773168, -2760460, -2727070, -2714372, -2709019, -2693013, -2674917, -2666020, -2632675, -2623900, -2638186, -2644329, -2648702, -2698425, -2812921, -2837566, -2837762, -2828947, -2832671, -2829441, -2794686, -2766399, -2742345, -2725551, -2705572, -2682918, -2680033, -2681519, -2690806]
12143b690806K4623K3565L5902Q056j6440O975M8491J4637L146O011j312o238
12131b543390N1063J4668Q918O080J7919J9922j757q358K5812K1989k1431k1317
12119b429882O012j3602R703J5676M978L051L5169K8119k0696j9769l2658J3822
12107b400077J4531O814P526L7914J5772J6510J8595n245L3612J6754j7748J0449
12095b244593K5619M660j4128j7623J8916n629K0383K6662L3201m421j9985m298
12083b181236l5976k9245O590J7439M545K8861J6606J1014N326m353K5765M244
12071b130420n046K1856K2175J2697j3274l0416J6783O9535m080m1232r706L201
12059b087927j6142K4104M1845j6503K1420M4575L718l1791L939l907k51K4276
$$ y = [-2690806, -2666183, -2642618, -2606716, -2598660, -2615100, -2608125, -2559634, -2544997, -2541851, -2535840, -2537152, -2543390, -2492327, -2477659, -2468741, -2462661, -2444742, -2424820, -2426577, -2434935, -2409123, -2387134, -2408565, -2429882, -2423870, -2437472, -2427769, -2412093, -2407115, -2404064, -2368895, -2340776, -2361472, -2381241, -2413899, -2400077, -2385546, -2378732, -2371206, -2333292, -2317520, -2301010, -2282415, -2287660, -2254048, -2237294, -2255042, -2244593, -2218974, -2214314, -2228442, -2246065, -2227149, -2232778, -2212395, -2185733, -2152532, -2156953, -2176938, -2181236, -2217212, -2246457, -2239867, -2222428, -2217883, -2189022, -2172416, -2161402, -2156076, -2160429, -2134664, -2130420, -2135466, -2113610, -2091435, -2078738, -2092012, -2122428, -2105645, -2036110, -2040190, -2081422, -2091128, -2087927, -2104069, -2079965, -2038120, -2054623, -2033203, -1988628, -1984910, -2016701, -2012762, -2016669, -2016920, -1992644]
12047a992644P603J0666j081j1055Q293L5941j1334r659M303L5673L274m167J9648
12034a904539j571Q552N479L847L0430m083K317J0339K726o845K1181J818K259
12021a828090R100J2426J0223m185L213O298j8829k1925R323N9754L8394k1487
12009a745785j7010J0136L5420K2283r284k3188k0041J8173K5865Q382j0962K805
11997a703206O229O355K1865Q701K3908k9128k9512K6490J6426l918K851R304
11985a643635K0108j6133L58K6812J75J341j7429l0990K5296q184L4402L2917
11973a574962N247p633k0817L9089L357J3032Q161k4485n595L3107J8290m3375
11961a556584j9805L5236K2231K6383j7916j0086j387J7934K846k619J595P553
$$ y = [-1992644, -1985041, -1974375, -1975456, -1986511, -1978218, -1942277, -1953611, -1963270, -1958967, -1923294, -1920020, -1924187, -1904539, -1906110, -1897558, -1892079, -1888232, -1857802, -1861885, -1859568, -1849229, -1846503, -1853348, -1832167, -1830349, -1828090, -1818990, -1806564, -1796341, -1800526, -1797313, -1791015, -1809844, -1831769, -1822446, -1762692, -1724298, -1745785, -1762795, -1752659, -1717239, -1694956, -1704240, -1727428, -1747469, -1729296, -1703431, -1695049, -1706011, -1703206, -1696977, -1690622, -1668757, -1660056, -1636148, -1665276, -1694788, -1668298, -1651872, -1655790, -1652939, -1643635, -1623527, -1639660, -1639302, -1612490, -1612315, -1610974, -1628403, -1659393, -1634097, -1642281, -1607879, -1574962, -1569715, -1577348, -1598165, -1559076, -1555719, -1542687, -1534526, -1559011, -1564606, -1531499, -1513209, -1556584, -1576389, -1541153, -1518922, -1492539, -1510455, -1520541, -1521928, -1503994, -1501148, -1503767, -1502172, -1494619]
11949a494619R863N541j8072o752K6349Q220k650j5499P314L497P618M390l6652
11936a501452Q180K9838J8690J7261j314J2256p082m237K1980o386j429J5975
11924a397720J4284m114o534n186o694P515K5899L3827M0400Q65J4049k6315l7614
11911a347338r535M8916J0611J2480N875q911l47n53o451J6915L404k0510l066
11898a298510l872Q361L2750j4303n023K5531j1320L517J0909K441K2392j21l398
11885a230646R006o370J4556J7243L1947k392k5618q295j2577J4221M3260K3185
11873a132480k3171K896k16J5009J0081o640j3960K2206j0647L331p952j5835
11861a157378L5027L9031k1372l9373j7133o460j6423M2914O079K120K2755L2449
$$ y = [-1494619, -1484756, -1479215, -1497287, -1504039, -1477690, -1469470, -1472120, -1487619, -1480305, -1476808, -1469190, -1464800, -1501452, -1493272, -1463434, -1444744, -1427483, -1428797, -1416541, -1423623, -1427860, -1405880, -1412266, -1413695, -1397720, -1383436, -1387550, -1394084, -1399270, -1405964, -1398449, -1372550, -1338723, -1298323, -1297458, -1283409, -1309724, -1347338, -1356873, -1307957, -1297346, -1284866, -1278991, -1287902, -1288249, -1288802, -1295253, -1278338, -1274934, -1295444, -1298510, -1302382, -1294021, -1261271, -1275574, -1280597, -1255066, -1266386, -1262869, -1251960, -1249519, -1227127, -1227248, -1230646, -1221640, -1228010, -1213454, -1196211, -1164264, -1166656, -1192274, -1200569, -1213146, -1198925, -1155665, -1132480, -1155651, -1152755, -1152971, -1137962, -1127881, -1134521, -1148481, -1126275, -1136922, -1133591, -1141543, -1157378, -1122351, -1083320, -1104692, -1144065, -1161198, -1167658, -1184081, -1141167, -1135088, -1132968, -1110213, -1077764]
11849a077764O512q970J098L0006J0063k40j3948l887n430K1749J9268l8364j1125
11836a071032L5956M5131L6022j9120j801j4050k8166J3706M1531K5741j1694
11825i47776J213k6154m3801o38J5627J2143J3207L0999R052j0839P835j3260
11813i52392N565o270R678n528N658K6646J0389j8071k1205K9678K3580o373J978
11800h96667P78j3848P028L861N619J2307j6053J7484L6564K5339j781j1454n2078
11787h82901j2774n61J4450J6342k3477j2686K2300M4441L4712J6483j5242m1527
11775h40440J8939K2924N334k588K750l203j0389j2215j2974o85L2461K2392J9673
11762g58021Q821l731K0036k4285k3821R170Q723l291J1306K3947P018K2076J5732
$$ y = [-1077764, -1071252, -1080222, -1079124, -1049118, -1039055, -1039295, -1053243, -1057130, -1062560, -1040811, -1021543, -1059907, -1071032, -1035076, -989945, -953923, -973043, -974844, -988894, -1017060, -1003354, -961823, -936082, -947776, -946563, -972717, -1016518, -1017156, -1001529, -989386, -976179, -945180, -936128, -946967, -939132, -952392, -946827, -953097, -943419, -948947, -943289, -916643, -906254, -924325, -945530, -915852, -892272, -898645, -896667, -895889, -909737, -902709, -898848, -893229, -880922, -896975, -879491, -842927, -817588, -819369, -830823, -882901, -895675, -896236, -881786, -865444, -888921, -901607, -879307, -834866, -800154, -783671, -798913, -840440, -821501, -798577, -793243, -795831, -793081, -796284, -806673, -818888, -831862, -832547, -800086, -777694, -758021, -749200, -752931, -732895, -757180, -781001, -771831, -763108, -766399, -755093, -731146, -724128, -702052, -686320]
11749f86320o226J2362k3963l6456n686K0712N693K987j4736N837K3272p069L0125
11736f79468K0395j8215k3598r632J3086K3652N930K0230L5121K5369j1811l2231
11724f31172r120Q509j0397q084P807q525K2448L0856o446J6001P972m971K0676
11711e64446L969N625r000j1312r786K1178J9381l7797l5729L8374M8125J7154
11699e14264N106k4974q041J5781J8589L0793p253j3142k2030k527J4150j2343
11687e20155k2618J1732L2223K3613J3903J233J0804J8531k7261k730M3643K3999
11675c93083J9452q226m1536q420L323m14n002K5501K920L6131o022k9690Q80
11662d04186K090n05K8027L5995M576J2442N049m2003l1J9512J432k1352j5223
$$ y = [-686320, -692546, -680184, -704147, -740603, -746289, -725577, -719884, -716897, -731633, -725796, -702524, -709593, -679468, -659073, -677288, -700886, -710518, -697432, -673780, -667850, -647620, -612499, -587130, -598941, -631172, -640292, -631783, -642180, -650264, -642457, -650982, -628534, -597678, -604124, -588123, -580151, -585122, -564446, -560477, -554852, -563852, -575164, -584950, -563772, -544391, -582188, -617917, -579543, -531418, -514264, -509158, -534132, -542173, -526392, -507803, -477010, -484263, -497405, -519435, -521962, -507812, -520155, -542773, -531041, -498818, -475205, -461302, -460069, -449265, -430734, -457995, -460725, -417082, -393083, -373631, -381857, -423393, -431813, -428490, -428904, -433906, -408405, -405485, -369354, -375376, -405066, -404186, -402096, -402601, -374574, -338579, -334003, -321561, -316512, -358515, -358546, -339034, -337602, -358954, -374177]
11649c74177L9208K9388k2525k4228L6654J1821k0126l7520k9489l3158M060m544
11637d24636J9722K8621P800M17L4698Q397O513J0797j2669j2756m067l840K2036
11624c18967j6961j5240K5525Q296k875n899K4662P151K1508k2947k4072J6521
11612c03298K2247J5365N824o697k1940J085N0225L9592M112k5638j6192o591
11600b41906K3300K1390J3380J675J2279p822j2285j6689k2744J9924J5429J838
11588a92231K6516q010j5838J4151L4883l2659M14M368j1304l613J2733J3255
11576a57335K4811J1466j8670M29o224J8672J0241Q747M518j0131j2673k1499
11564a47648q351J4822K280K2166K0018l0983L558K9841J2723j8804j2757Q270
$$ y = [-374177, -334969, -305581, -328106, -352334, -315680, -303859, -323985, -361505, -390994, -424152, -420092, -424636, -404914, -376293, -368493, -368076, -333378, -324981, -318468, -307671, -320340, -333096, -337163, -341003, -318967, -335928, -351168, -325643, -317347, -320222, -326121, -301459, -294308, -272800, -295747, -319819, -303298, -281051, -265686, -259862, -266559, -288499, -287414, -237189, -197597, -193485, -219123, -235315, -241906, -218606, -197216, -183836, -182161, -169882, -177704, -189989, -206678, -229422, -209498, -194069, -192231, -165715, -173725, -189563, -175412, -140529, -173188, -172774, -168406, -179710, -183323, -170590, -157335, -132524, -121058, -139728, -139299, -145523, -126851, -116610, -107863, -103345, -113476, -126149, -147648, -155999, -141177, -138897, -116731, -96713, -127696, -124138, -94297, -81574, -100378, -113135, -104865]
11552a04865K6870M470N79J5360k614j0914Q03J9934j1999L1637K6699P891J805
11539E656n395m291L5659P122k7521k4643o507K9369K8960j7123p50R29k840P452
11525B6077m504j793R36N498K7534Q411O708N800j5139o960o176K602k058q538
11511C8398J6565J3315N218m525j4918J415M6341J2741q597k7865o001r148K8115
11498I1054K3660k8491l0477K1951K9435j8571k3654J7542M0355K3097K102q430
11486A39573J426o957P780K2399k1879K3507K7618j4279r332p054M992J3321K09
11473A81324M334M004m691J6697O439J0201j6576j5380l426K5486L1435j0173
11461B29674k645L2559N1663Q543j5426j4357j1306j8058P932K8733P097K2217
$$ y = [-104865, -77995, -73525, -72946, -57586, -60200, -71114, -70311, -50377, -62376, -30739, -4040, 3851, 5656, 261, -4030, 31629, 38751, 11230, -13413, -19920, 9449, 38409, 21286, 20536, 21465, 18625, 26077, 21573, 19780, 20716, 26214, 53748, 62159, 68867, 74667, 59528, 52568, 46392, 48994, 46936, 38398, 54963, 68278, 73496, 68971, 54053, 55468, 101809, 114550, 105953, 78088, 72087, 62939, 91054, 114714, 86223, 55746, 77697, 107132, 88561, 64907, 82449, 122804, 145901, 148003, 139573, 140999, 134042, 141822, 164221, 142342, 165849, 193467, 179188, 169856, 162802, 167794, 181115, 181324, 185658, 189662, 184971, 201668, 208107, 218308, 201732, 186352, 182926, 208412, 239847, 229674, 227029, 259588, 311251, 319794, 304368, 290011, 278705, 260647, 268579, 297312, 304409, 326626]
11449C26626J4351K1280q844j8044O100J52j7691k6278j1914k1095J08M5117j42
11436C09726L0091M837J0953k503j1779L941R35k4855j2291j645K1811L6425Q093
11423C73739l854L128K324J134J3345p292L2550K5330l3481n016J5773j315p169
11410D09196O436K6708q663J43j39r05j5415P34J7830K7223L622l4168k4426K6026
11396D34202L0589K9234J9385L28j5114l734j7266j9693M539J114K846M8034K1587
11383E36051L5368p965k042k4229L884J570K2549j0701p684L046J8885L4088k5975
11370E76845l991R780P394J5331k9553k7406J4680K6424J7447J5827R532P673
11358F39983j431P587l8705k4176J8486J5575M0376m350l4405N412j5735J5007
$$ y = [326626, 340977, 362257, 353413, 335369, 341469, 341621, 323930, 297652, 285738, 264643, 264751, 309868, 309726, 339817, 344654, 355607, 353104, 341325, 345266, 346201, 321346, 309055, 307410, 329221, 365646, 373739, 369885, 373013, 375337, 376471, 389816, 382524, 415074, 440404, 406923, 401907, 417680, 416365, 409196, 415632, 442340, 433677, 433820, 433681, 432776, 417361, 418095, 435925, 463148, 466770, 432602, 408176, 434202, 464791, 494025, 513410, 513738, 498624, 494890, 477624, 457931, 462470, 463584, 466430, 514464, 536051, 571419, 563454, 561412, 537183, 541067, 542637, 565186, 554485, 546801, 549847, 568732, 602820, 576845, 572854, 582634, 590028, 605359, 575806, 548400, 563080, 589504, 606951, 622778, 632310, 639983, 638552, 646139, 607434, 583258, 601744, 617319, 657695, 653345, 618940, 624352, 608617, 623624]
11346F23624L3925j8025o933L6266O2275j5705l3526R970O1262K4730l3523m2910
11334G01430j3206P759p137J4372J1802K1873J6231L390J0295m230l2864J2434
11322G42149J4528J305J8051j1300q803J1192J7953K5682R925j7057R574o833
11310H06366L7195J2293l4399k1655o320L0836K7674K6405N54n482J4723J7453
11298I05643J1219j9462k9435o22L1885K5752l432J4306M152j1701j0974p627
11286I09704q137k7499L7388L5609K5312O052k209r802k8771k9739k5855l175
11274H78878L4281N8780M2542o684k9241J1204N594j4917O116j2514J1064M3126
11262A028229J1844M279j7173p987j2422j6547K6843N27R245J2473K4553n287
$$ y = [623624, 657549, 639524, 632591, 668857, 731132, 715427, 681901, 691871, 753133, 777863, 744340, 701430, 688224, 695983, 688846, 703218, 715020, 736893, 753124, 756514, 766809, 762579, 729715, 742149, 756677, 757982, 776033, 764733, 755930, 767122, 785075, 810757, 820682, 803625, 813199, 806366, 843561, 855854, 821455, 799800, 793480, 824316, 851990, 878395, 878949, 873467, 888190, 905643, 916862, 897400, 867965, 867343, 899228, 924980, 921548, 935854, 940006, 928305, 917331, 909704, 901567, 874068, 911456, 947065, 972377, 978429, 976220, 966418, 937647, 907908, 882053, 878878, 913159, 971939, 1014481, 1007797, 978556, 989760, 995354, 980437, 986553, 974039, 985103, 1028229, 1040073, 1044352, 1027179, 1019192, 1006770, 990223, 1017066, 1017593, 1026838, 1039311, 1063864, 1058577]
11250A058577J4044l310R817J7651K3144J0490o057J5203K637n1042K8208M3204
11238A162566K80o0j5795p141L4067Q606J7721l317j3661K0551K9510j1147j1473
11225A210707L2259q9k3538k623K278p973j8078J0244K2976J5475L609K9990q500
11212A266737J4319J7390j3554j6850p01o316K4009M1387K919L322m2883j6854
11200A272925J0284J9233K3199J0179R818N136Q77R444P791r491j1287K2958K3928
11187A394994j388J1310o652k3978r526K5836L1150J9165J1159j1984j5762m707
11175A419617k9119r93Q344J4589M5455J5622k123L2480K7451m5010N637j798
11163A490152m287o139J3987P460j1277L0240M1280K1969J0906K484j8795P986
$$ y = [1058577, 1072621, 1069311, 1079128, 1096779, 1119923, 1130413, 1124356, 1139559, 1142196, 1091154, 1119362, 1162566, 1162846, 1162786, 1146991, 1139850, 1173917, 1182523, 1200244, 1196927, 1183266, 1203817, 1233327, 1222180, 1210707, 1242966, 1242877, 1219339, 1216716, 1218994, 1211021, 1192943, 1203187, 1226163, 1241638, 1245247, 1275237, 1266737, 1281056, 1298446, 1284892, 1268042, 1267341, 1261025, 1285034, 1326421, 1329340, 1332662, 1289779, 1272925, 1283209, 1302442, 1325641, 1335820, 1345638, 1350774, 1351651, 1361095, 1368886, 1359395, 1348108, 1371066, 1394994, 1393606, 1404916, 1398264, 1374286, 1364760, 1390596, 1421746, 1440911, 1452070, 1440086, 1424324, 1419617, 1390498, 1389505, 1397849, 1412438, 1457893, 1473515, 1471392, 1503872, 1531323, 1486313, 1491950, 1490152, 1485865, 1479726, 1493713, 1501173, 1489896, 1520136, 1561416, 1583385, 1594291, 1596775, 1577980, 1585966]
11151A585966L1847J1392J1862k1724l8148O869M4086j634J2690r989m32J807
11139A634592j2754K457L2833K6525J3082n693o889P048p14n6k725J3967n150
11126A696523Q433L3591j0341j8727J2715o875K85K2400N0697R953r911J6599
11114A805342j426j3060M38J2821J0936K4299J6631J6149j3279J945K1680R804
11102A892280K1241L6509P007j1694N808J1882K310j8601P970M558j7881K6052
11090A967441k578k55J1954L5432R496J4812o635p140L1961J3609K485N528n411
11077B070699J910k2965J5608P569K228j4352j6589J1165L1771N8535J9690N517
11065B170786L609J157p730k6499k47J4228K9137J8827J9851L2942P197q200o889
$$ y = [1585966, 1617813, 1629205, 1641067, 1619343, 1581195, 1588064, 1632150, 1630516, 1643206, 1633217, 1632785, 1634592, 1621838, 1624295, 1657128, 1683653, 1696735, 1691042, 1684153, 1691201, 1690487, 1690431, 1687706, 1701673, 1696523, 1704956, 1738547, 1728206, 1709479, 1722194, 1715319, 1715604, 1738004, 1788701, 1798654, 1788743, 1805342, 1803916, 1790856, 1791294, 1804115, 1815051, 1839350, 1855981, 1872130, 1858851, 1860796, 1882476, 1892280, 1913521, 1950030, 1957037, 1945343, 1951151, 1963033, 1965343, 1946742, 1954712, 1959270, 1941389, 1967441, 1964863, 1964608, 1976562, 2011994, 2021490, 2036302, 2029667, 2022527, 2054488, 2068097, 2070582, 2076110, 2070699, 2072609, 2049644, 2065252, 2072821, 2075049, 2060697, 2044108, 2055273, 2087044, 2145579, 2165269, 2170786, 2174395, 2175552, 2167822, 2141323, 2141076, 2155304, 2184441, 2203268, 2223119, 2256061, 2263258, 2255058, 2248169]
11052B248169q054N484N084O963k4209K2818L2111Q325p876L1041O457j2551J0675
11039B324437L0339J1745L317K6466J035k6512L578J8611k314O534M4534k2141
11027B419629Q9J0114K7796J9116R241L2293K1478r043L769K1956N373k2352j4992
11014B524467r252M5773O0887M6424K9062J3423L932P14k2831L1757J387L130
11002B728873K8126o614j8668m507K0395J2381K6176J5029J6446K344M1540K8126
10990B889647j4232n780L0080M5621k3545R256M0348M2804J7480P386K6534L052
10978C068651K5304K9928J6103J9005N9878L2211J0990J9533M092M4375P1315
10967C401385K982K3890R7936L8130M1497L2695M3997Q4349J13859J13189J46734
$$ y = [2248169, 2240115, 2245599, 2250683, 2257646, 2233437, 2256255, 2288366, 2296691, 2288815, 2319856, 2326313, 2313762, 2324437, 2354776, 2366521, 2369838, 2396304, 2397339, 2370827, 2374405, 2393016, 2390702, 2397236, 2441770, 2419629, 2419718, 2429832, 2457628, 2476744, 2485985, 2518278, 2539756, 2530713, 2534482, 2556438, 2561811, 2539459, 2524467, 2515215, 2560988, 2621875, 2668299, 2697361, 2710784, 2714716, 2715430, 2692599, 2724356, 2725743, 2728873, 2756999, 2750385, 2731717, 2727210, 2747605, 2759986, 2786162, 2801191, 2817637, 2819981, 2861521, 2889647, 2875415, 2869635, 2899715, 2945336, 2921791, 2931047, 2971395, 3014199, 3031679, 3039065, 3065599, 3068651, 3093955, 3123883, 3139986, 3158991, 3218869, 3251080, 3262070, 3281603, 3285695, 3330070, 3401385, 3404367, 3428257, 3526193, 3564323, 3605820, 3638515, 3682512, 3766861, 3880720, 3993909, 4140643]
10956D140643J69798R3081Q240j36544k27922m27880p35221p74008l41785Q8959
10946A857361J17653J39218J47779J29821J05473P2488L2005K9930K6859M6125
10936B704712O0840L0465N2331N4917L8568K8572Q84j1376M065K2442N6692L9222
10924C082334J8236o310j4905N842J5912L3650L2576K8347M7328N6674J5840J8070
10912C333594m876L027J9100L3296K4475J8971J2235K4987J1436N2768J9008q029
10900C539992N762K4620j3726j4534j0479l489K5976J9403k163L5248M1854L8889
10888C687353Q302L6883L6263J3799p68m448J5372M5818J5974K7209K3709J3488
10876C918954J5836L2444K4324O111J4776J4649j864L5048M9982M1951M4235M9686
$$ y = [4140643, 4310441, 4403522, 4411762, 4275218, 4047296, 3619416, 2884195, 2110187, 1768402, 1857361, 1975014, 2114232, 2262011, 2391832, 2497305, 2569793, 2601798, 2631728, 2658587, 2704712, 2765552, 2796017, 2848348, 2903265, 2941833, 2970405, 2971289, 2959913, 2963978, 2986420, 3043112, 3082334, 3100570, 3094260, 3079355, 3085197, 3101109, 3134759, 3167335, 3195682, 3243010, 3299684, 3315524, 3333594, 3328718, 3331745, 3350845, 3384141, 3408616, 3427587, 3439822, 3464809, 3476245, 3529013, 3548021, 3539992, 3545754, 3570374, 3556648, 3542114, 3531635, 3528146, 3554122, 3573525, 3571362, 3606610, 3648464, 3687353, 3695655, 3732538, 3768801, 3782600, 3781832, 3777384, 3792756, 3838574, 3854548, 3881757, 3905466, 3918954, 3934790, 3967234, 3991558, 3997669, 4012445, 4027094, 4025230, 4060278, 4110260, 4152211, 4196446, 4246132]
10864D246132J5362j4656k9885j9415J1461J5166K4493K7517L9931M7070K9472
10853D392648J0879L1940J1674K7263l901K3062K2137K4294r006j3430M73n562
10841D512471L1825N5817O1158N9411J7560O29J2783L6271L1396P036K9913J7703
10829D873973j1717L8187M8036J1861K2153K5536L7097J5312J3142L4451M9833
10818E157864K6397K4576L2499J8961j36L7290L9668L9675N1075O7565L8110J9384
10806E552928K7502J1142J1478K8688M236o0361n9697j9868P6088P5442K7148
10795E674726n7025m6909N3239M572L317R437J2688M0649N4570L4743J9792M4568
10783E848367M6460Q791K6404J6894l829O9892O1905P0755L5690j9355J951M6645
$$ y = [4246132, 4261494, 4246838, 4216953, 4197538, 4208999, 4224165, 4248658, 4276175, 4316106, 4363176, 4392648, 4403527, 4435467, 4447141, 4474404, 4470503, 4493565, 4515702, 4539996, 4530990, 4517560, 4518033, 4512471, 4544296, 4600113, 4661271, 4720682, 4738242, 4738871, 4751654, 4787925, 4819321, 4826357, 4856270, 4873973, 4862256, 4900443, 4948479, 4960340, 4982493, 5008029, 5045126, 5060438, 5073580, 5108031, 5157864, 5184261, 5208837, 5241336, 5260297, 5260161, 5297451, 5337119, 5376794, 5427869, 5495434, 5533544, 5552928, 5580430, 5591572, 5603050, 5631738, 5635974, 5575613, 5515916, 5496048, 5572136, 5647578, 5674726, 5617701, 5570792, 5624031, 5628603, 5631920, 5641357, 5654045, 5694694, 5749264, 5784007, 5803799, 5848367, 5894827, 5903618, 5930022, 5946916, 5943087, 6012979, 6074884, 6145639, 6181329, 6161974, 6163925, 6210570]
10771F210570N9025J4326J0622L6107L8691L673M3780L2984M7358R1911P0735
10760F659782M3574P9256N8601L8905L4645K8318K5394N0302J03761K9681J2093
10749G164312K0145k855N729N7448P6514M9283K9237N7260O5484L3351M3913N9650
10737G659471N6306J7170K6612Q0586P1104Q7556J48090J45402P0335j6948o3367
10726H282317n4505K908M1832L8889L1769K8618Q4356O5200Q0275P3475M9338
10715H724472L4743L5218K406L5185O6570J00530Q8735P4813P3060O0761N6363
10704I352856M3691P3083N9300N2001O7736Q3628R9075N9183O7601Q0825O9115
10693A0108094Q4569R0230Q8731N5906M1136Q9596P8849O1946P2142Q8846Q3203
$$ y = [6210570, 6269595, 6283921, 6294543, 6330650, 6369341, 6373014, 6416794, 6449778, 6497136, 6589047, 6659782, 6703356, 6782612, 6841213, 6880118, 6914763, 6943081, 6968475, 7018777, 7122538, 7152219, 7164312, 7184457, 7181602, 7187331, 7244779, 7321293, 7370576, 7399813, 7457073, 7522557, 7555908, 7599821, 7659471, 7715777, 7732947, 7759559, 7840145, 7911249, 7998805, 8146895, 8292297, 8362632, 8345684, 8282317, 8227812, 8230720, 8272552, 8311441, 8343210, 8371828, 8456184, 8521384, 8601659, 8675134, 8724472, 8759215, 8794433, 8796839, 8832024, 8898594, 8999124, 9087859, 9162672, 9235732, 9296493, 9352856, 9396547, 9469630, 9528930, 9580931, 9648667, 9732295, 9831370, 9890553, 9958154, 10038979, 10108094, 10192663, 10282893, 10371624, 10427530, 10468666, 10558262, 10637111, 10699057, 10771199, 10860045, 10943248]
10682A0943248Q0852N8372N8404N2576O9642Q4010L0111L7387J6299K1694J11534
10671A1564129J48543J51576K18121M95946N20213R6080j82756n4111Q0299R9978
10661A3138018J06477J00237J32593J26598J28908J40025J30704J52358J45053
10652A4300971J44312J51214J39270J21983J09606J38056J67586J82305J53850
10643A5609153J26962R5553Q0801R4827J28715J54663J78191K28192K18212K09602
10633A7124871K19475J86585J88585J70266J66253J69908J82855K19016K30868
10624A8858682L04156L00845K72144K49934J92259J78100J13051J13997J94933
10615B0778101K40123K99846L16992L18175L23927L66340L76055L73772L81239
$$ y = [10943248, 11024100, 11082472, 11140876, 11193452, 11263094, 11347104, 11377215, 11414602, 11430901, 11452595, 11564129, 11712672, 11864248, 12082369, 12578315, 13098528, 13194608, 13011852, 12957741, 13038040, 13138018, 13244495, 13344732, 13477325, 13603923, 13732831, 13872856, 14003560, 14155918, 14300971, 14445283, 14596497, 14735767, 14857750, 14967356, 15105412, 15272998, 15455303, 15609153, 15736115, 15831668, 15912469, 16007296, 16136011, 16290674, 16468865, 16697057, 16915269, 17124871, 17344346, 17530931, 17719516, 17889782, 18056035, 18225943, 18408798, 18627814, 18858682, 19162838, 19463683, 19735827, 19985761, 20178020, 20356120, 20469171, 20583168, 20778101, 21018224, 21318070, 21635062, 21953237, 22277164, 22643504, 23019559, 23393331, 23774570]
10606B3774570L89645L91788M09644M37199M63822M63085M26341M25680M16866
10597B7598640M71169M93101N26260N15346N50390N80860O27721O76773O97696
10588C2737956O77783P24960P52439Q09408Q58155R24500R78646R99397J013873
10579D0477117J072444J080742J090028J090336J155256J299454J471014J640613
10571E0377004J731984J880049K080732K249254K344170K362302K382681K415535
10563F7823711K230560K319847L061138L767942M164724M627756N393120O238101
10555I9626899P011725P866049Q997180J0479563J2453766J5039255J8363052
10548A79837489K2389256K6074072K5283105J1327122j8023593m5257991o8785010
$$ y = [23774570, 24164215, 24556003, 24965647, 25402846, 25866668, 26329753, 26756094, 27181774, 27598640, 28069809, 28562910, 29089170, 29604516, 30154906, 30735766, 31363487, 32040260, 32737956, 33415739, 34140699, 34893138, 35702546, 36560701, 37485201, 38463847, 39463244, 40477117, 41549561, 42630303, 43720331, 44810667, 45965923, 47265377, 48736391, 50377004, 52108988, 53989037, 56069769, 58319023, 60663193, 63025495, 65408176, 67823711, 70054271, 72374118, 75435256, 79203198, 83367922, 87995678, 93388798, 99626899, 106638624, 114504673, 123501853, 133981416, 146435182, 161474437, 179837489, 202226745, 228300817, 253583922, 264911044, 246887451, 201629460, 132844450]
10541A32844450j19449698j56913846r6279653n995059K6138245K7192304K1829917
10534a70633340J7058972J3878607J1712458J0001438Q689309P611760O461639
10527i5219157N534590M866036M290572L872282L740743L644529L331703K642044
10519f3296658J977751J440043P79697K41229M19116R61439J189332J269248J272042
10510e3746761J209419J166218J114124J098228J034422R53204Q91236P76111
10502d5503799P24119P46577P79406Q01402P70267P78728P83293P18962P01230
10493c8699815O93066O54346O10482N60740N37215N21787N35430N51778N52922
10484c3482049N17690N19992M92552M67879M51230M27288M30086M08923L95131
$$ y = [132844450, 13394752, -143519094, -239798747, -245793806, -219655561, -192463257, -170633340, -153574368, -139695761, -127983303, -117981865, -109292556, -101680796, -95219157, -89684567, -84818531, -80527959, -76655677, -72914934, -69270405, -65938702, -63296658, -61318907, -59878864, -59099167, -58857938, -58438822, -57477383, -56288051, -55018803, -53746761, -52537342, -51371124, -50257000, -49158772, -48124350, -47171146, -46279910, -45503799, -44779680, -44033103, -43253697, -42452295, -41682028, -40903300, -40120007, -39401045, -38699815, -38006749, -37352403, -36741921, -36181181, -35643966, -35122179, -34586749, -34034971, -33482049, -32964359, -32444367, -31951815, -31483936, -31032706, -30605418, -30175332, -29766409, -29371278]
10475b9371278M12270L62249L49966L56524L59479L44339L67327L68435L45934
10466b6104755L26791L27754L31926K91052K45486K85570K86263L01811L12778
10457b3395324K33999K46238K21337K00557J16952p415L5163J48848K37553K48713
10447b1713379K58052K36082K48970K62388K69118K72812K49685K01449J79810
10438a9535013J33633J69901J83053J28699J28330J69476J39914J05740J06552
10429a8269715R3683Q4312J40258J85370J62209J50695J44676K02133K42028K12056
10419a6652295J88481J05515Q3970O6997M9200k7481r7545k6990J23504J98117
10409a5988527J86060J74368J71810J59461J45435J27005J41804J44568R9645
$$ y = [-29371278, -28959008, -28596759, -28246793, -27890269, -27530790, -27186451, -26819124, -26450689, -26104755, -25777964, -25450210, -25118284, -24827232, -24581746, -24296176, -24009913, -23708102, -23395324, -23161325, -22915087, -22693750, -22493193, -22376241, -22383656, -22348493, -22199645, -21962092, -21713379, -21455327, -21219245, -20970275, -20707887, -20438769, -20165957, -19916272, -19714823, -19535013, -19401380, -19231479, -19048426, -18919727, -18791397, -18621921, -18482007, -18376267, -18269715, -18176032, -18091720, -17951462, -17766092, -17603883, -17453188, -17308512, -17106379, -16864351, -16652295, -16463814, -16358299, -16274329, -16207332, -16158132, -16185613, -16283158, -16310148, -16186644, -15988527, -15802467, -15628099, -15456289, -15296828, -15151393, -15024388, -14882584, -14738016, -14638371]
10400a4638371J04280J54543J67174J11369J07396J14552J21176J47425R0457
10391a3519999J25137J61965J15555Q6387Q0134L8656O9824J10829J00532O5891
10381a2565089M7906P7496Q2313P2289P0701N5220N4811Q3867O9840N8608P3341
10370a1818697J08255N9407N3368J11190J14687O8223O0187K7789L8595Q1000
10360a1095996Q8021J06474R1642J17973J16837R1414Q3985N2502J12079M2099
10350a0192970m6448n4888j7602L9757N4806L7371N3332M1466M7924N6737M6198
10339i934317O1405N0207N3101M1900N7091N1666Q7285O8512M1361M7950P3883
10328i299956M8790M6728K9529N1888L3851j094L7962J424q66M0464M4607M4887
$$ y = [-14638371, -14534091, -14379548, -14212374, -14101005, -13993609, -13879057, -13757881, -13610456, -13519999, -13394862, -13232897, -13117342, -13030955, -12950821, -12912165, -12842341, -12731512, -12630980, -12565089, -12517183, -12439687, -12357374, -12285085, -12214384, -12159164, -12104353, -12020486, -11950646, -11892038, -11818697, -11710442, -11651035, -11597667, -11486477, -11371790, -11303567, -11243380, -11215591, -11176996, -11095996, -11007975, -10901501, -10809859, -10691886, -10575049, -10483635, -10399650, -10347148, -10235069, -10192970, -10239418, -10294306, -10311908, -10272151, -10217345, -10179974, -10126642, -10085176, -10037252, -9980515, -9934317, -9872912, -9822705, -9769604, -9727704, -9670613, -9618947, -9531662, -9463150, -9421789, -9373839, -9299956, -9251166, -9204438, -9174909, -9123021, -9089170, -9090264, -9052302, -9050878, -9051744, -9011280, -8966673, -8921786]
10316h921786K9474L1514L2626P7368L6337J4426N3116O1275L0595J1822O2803
10305h480430O4343L0272L481J1247K6862J4065N4374J9028Q541L0428O7554M5677
10293h104558J3080L5970O0391N9630J9941J1882j116L2609L3903L6547K4628
10282g777093Q907K1408L9315L033M2159O1592K1611J2194M3070N1421M1886K3292
10270g407205M5143M8797L9774L2668J5669K1336K8396J9500j3993M2955M5970
10259g080990J6458N5151O4941L0703L9273L1958K3182M8332L7270M5609N1550
10248f636563J2447L4172K4172j1009J1266L4196M1396j661N961j5316K2057L2041
10236f446841L6168L9795L5374K6737M9825M8082L7401N3435O1004O4740N0073
$$ y = [-8921786, -8892312, -8860798, -8828172, -8750804, -8714467, -8700041, -8646925, -8585650, -8555055, -8543233, -8480430, -8416087, -8385815, -8382334, -8371087, -8344225, -8330160, -8275786, -8256758, -8248217, -8217789, -8150235, -8104558, -8091478, -8055508, -7995117, -7935487, -7915546, -7903664, -7904780, -7872171, -7838268, -7801721, -7777093, -7768186, -7746778, -7707463, -7704430, -7662271, -7600679, -7579068, -7566874, -7523804, -7472383, -7430497, -7407205, -7362062, -7313265, -7273491, -7240823, -7225154, -7203818, -7175422, -7155922, -7169915, -7126960, -7080990, -7064532, -7009381, -6944440, -6913737, -6874464, -6842506, -6819324, -6770992, -6733722, -6688113, -6636563, -6624116, -6589944, -6565772, -6576781, -6565515, -6531319, -6489923, -6491584, -6485623, -6500939, -6478882, -6446841, -6410673, -6370878, -6335504, -6308767, -6258942, -6210860, -6173459, -6120024, -6059020, -5994280, -5944207]
10225e944207p153k5782q9197j69046j63609j18883J4030O2195O7526M3553L6663
10214f293910O8324L0061n805M7509P3912K4337M8297O3319R911K8373M0426M7055
10202e818191K7614L4946L2035L8142J9408L913N7172M0508l260j2743k4196p9090
10190e683742j24263q1735J8824N8011M2693N0053K4206J5317M4317L8135M1886
10179e556298K6382L4750N3185Q875L9867J9203J9424J5423O357K6055L6196L0824
10167e239757K0217N1279L4162R588J8553K2348P071J5993L3561L0266K2609L3226
10155d940884L3033M962J7228J7040L7980O0150M7015L6608K4471j5729J5585
10144d662541M5361N3686N6766M5637L4675N8002O9240Q3516P3591R9727J32898
$$ y = [-5944207, -5951360, -5977142, -6066339, -6235385, -6398994, -6517877, -6503847, -6441652, -6374126, -6330573, -6293910, -6225586, -6195525, -6201330, -6153821, -6079909, -6055572, -6007275, -5943956, -5934045, -5905672, -5865246, -5818191, -5790577, -5755631, -5723596, -5685454, -5666046, -5662133, -5604961, -5564453, -5567713, -5580456, -5604652, -5683742, -5808005, -5889740, -5870916, -5812905, -5770212, -5720159, -5695953, -5680636, -5636319, -5598184, -5556298, -5529916, -5495166, -5441981, -5433106, -5393239, -5374036, -5354612, -5339189, -5332832, -5306777, -5270581, -5239757, -5219540, -5168261, -5134099, -5124511, -5105958, -5083610, -5076539, -5060546, -5026985, -4996719, -4974110, -4940884, -4907851, -4902889, -4885661, -4868621, -4830641, -4770491, -4723476, -4686868, -4662397, -4678126, -4662541, -4617180, -4563494, -4506728, -4461091, -4426416, -4368414, -4299174, -4215658, -4142067, -4042340, -3909442]
10133c909442J64778J56349J16186N1305p8328k72158l54174o05089p94720n05365
10123f030658m9028J71082J75864J16939O1670M4458P6600P8216Q8572R7460O1973
10112e106852L9676M9502J5236Q905O7979M4105N0785N8309K3163K6196K1239
10101d701757l527k6359L4154K0298r851K9230M2441M0054K6682J1692K9003K6772
10089d481168J0370L4028K2972o307K5291L0327K4552l6253j1617K3856J3137
10078d350812k2883o770L7275L9490J7936j5111j9509J5184J2447L7970K6220
10067d228563L5912J7622J7751J8203L6562L3835K6815J8685J8682L044N1391
10056c950061N4102N0550L0240J2789O429J2707O4259O4174M4688J9284N2293
$$ y = [-3909442, -3744664, -3588315, -3472129, -3420824, -3499152, -3771310, -4125484, -4730573, -5525293, -6030658, -6079686, -5908604, -5732740, -5615801, -5554131, -5509673, -5433073, -5354857, -5266285, -5168825, -5106852, -5067176, -5017674, -5002438, -4993533, -4925554, -4881449, -4830664, -4772355, -4749192, -4722996, -4701757, -4705284, -4731643, -4697489, -4677191, -4687042, -4657812, -4615371, -4575317, -4548635, -4536943, -4507940, -4481168, -4470798, -4436770, -4413798, -4420105, -4394814, -4364487, -4339935, -4376188, -4387805, -4363949, -4350812, -4373695, -4380465, -4343190, -4303700, -4285764, -4300875, -4320384, -4305200, -4292753, -4254783, -4228563, -4192651, -4175029, -4157278, -4139075, -4102513, -4068678, -4041863, -4023178, -4004496, -4001452, -3950061, -3895959, -3845409, -3815169, -3802380, -3795951, -3783244, -3718985, -3654811, -3610123, -3590839, -3538546]
10045c538546P5031R3848P0679R2616J34087J38329J55292K00694J71254j5206
10035b421922k54790l35485o31710j047056q25889m7046K48447K27820J72256
10026d915375J27821Q6830P8928R2815P0944M4729N7418M7117P3321L0355K1039
10015d184058J9719K3096L2005M3528J6072J3648M1176L066k3713J7752L3684
10004c964025M2573M2803j1632J7286M2745O221R416k0011j4340L334J7879O1040
9992c766711M1579R086R578N5980J6033j4552J6114N2890J4890m7735J9041K8445
9980c565362K4214K6665R639j4904J7372L4512J2854J3401L3615J4976J5121L720
9968c374177Q923J733j250o720J37K2502L9811M3430R363M8885K4575l225J1034
$$ y = [-3538546, -3463515, -3369667, -3298988, -3206372, -3072285, -2933956, -2778664, -2577970, -2406716, -2421922, -2676712, -3012197, -3643907, -4690963, -5516852, -5563898, -5315451, -5087631, -4915375, -4787554, -4700724, -4621796, -4528981, -4458037, -4413308, -4355890, -4308773, -4235452, -4205097, -4184058, -4164339, -4141243, -4109238, -4065710, -4049638, -4035990, -3994814, -3991748, -4015461, -3997709, -3964025, -3921452, -3878649, -3890281, -3872995, -3830250, -3824029, -3814613, -3834624, -3848964, -3845630, -3827751, -3766711, -3725132, -3716046, -3706468, -3650488, -3634455, -3649007, -3632893, -3580003, -3565113, -3612848, -3593807, -3565362, -3541148, -3514483, -3504844, -3519748, -3502376, -3467864, -3455010, -3441609, -3407994, -3393018, -3377897, -3374177, -3365254, -3363521, -3364771, -3371491, -3371354, -3348852, -3309041, -3265611, -3256248, -3207363, -3182788, -3186013, -3174979]
9955c174979K3671j4119j2990M0236M5999L227P916L4341J7854N271J4740Q214
9943c000619J5500P1196K9987M56j07K0169O80l0229k72M3929M6271N4542J6105
9930b732392j4144n159J2536J9394L4709J1888K5745J1582Q919l637J1065L9689
9918b579805K9575J8228L6915N1238Q732j5999J6820J9957J0741L4204K9571M2716
9906b297107L4534M8040K9608L3490J9501K7468N3781R878J1469L2625L1844M6207
9894a918662M9265L5404J4252J5233M0801O6978K8263R968K8527O1632N2132Q3539
9882a432668N8842L0382O907L7508N0615N9468O0698M2096P5435Q8781Q5463R1482
9870g44991N3491K9919R6061J13790J09662R4813J19323J01519J16046J37776
$$ y = [-3174979, -3151308, -3165427, -3178417, -3138181, -3092182, -3088955, -3081039, -3046698, -3028844, -3023573, -3008833, -3000619, -2985119, -2913923, -2883936, -2883480, -2883587, -2863418, -2862738, -2892967, -2893239, -2849310, -2803039, -2748497, -2732392, -2746536, -2751695, -2739159, -2719765, -2685056, -2673168, -2647423, -2635841, -2626922, -2630559, -2619494, -2579805, -2550230, -2532002, -2495087, -2443849, -2435117, -2451116, -2434296, -2414339, -2403598, -2369394, -2339823, -2297107, -2262573, -2214533, -2184925, -2151435, -2131934, -2104466, -2050685, -2040807, -2029338, -1996713, -1964869, -1918662, -1869397, -1833993, -1819741, -1804508, -1763707, -1696729, -1668466, -1658498, -1629971, -1568339, -1516207, -1432668, -1373826, -1343444, -1336537, -1299029, -1248414, -1188946, -1128248, -1086152, -1010717, -921936, -836473, -744991, -691500, -661581, -565520, -451730, -342068, -247255, -127932, -26413, 89633, 227409]
9860B27409J64125J74529J95165J91804J69253J43252J62138J54294K24531K95199
9850B101699L61648M27798M26102M82792N71907O80885Q34801J000216J224078
9841H111926J488105J758019J726497R78905n56358k387528m546656p462238r187531
9832a0076859p111582k431898J026879J978121J720185J295457J023333Q44512
9824a1731852P40256O42277N28489M46833L67271L64745L14003K55836K37337
9815g834805K19895K13127J76038Q8459N6002Q7510Q4058P0628M5838Q7204R6428
9804f609618Q3873O5315P4486L8843O6863Q0819O8679Q2185M0941L8932N7512
9793e911170J9930N8601P0035O5922L9294M3867M8728M1667O1445J4459K7170
$$ y = [227409, 391534, 566063, 761228, 953032, 1122285, 1265537, 1427675, 1581969, 1806500, 2101699, 2463347, 2891145, 3317247, 3800039, 4371946, 5052831, 5887632, 6887848, 8111926, 9600031, 11358050, 13084547, 14063452, 13507094, 11119566, 6572910, -889328, -10076859, -17188441, -19620339, -18593460, -16615339, -14895154, -13599697, -12576364, -11731852, -10991596, -10349319, -9820830, -9373997, -9006726, -8641981, -8327978, -8072142, -7834805, -7614910, -7401783, -7225745, -7137286, -7081284, -6993774, -6909716, -6839088, -6793250, -6706046, -6609618, -6525745, -6460430, -6385944, -6347101, -6280238, -6199419, -6130740, -6048555, -6007614, -5968682, -5911170, -5891240, -5832639, -5762604, -5696682, -5657388, -5613521, -5564793, -5523126, -5461681, -5447222, -5420052]
9782e420052Q4525L5024M037K7644L6986O0004O2853L1299J0147M5988L7656K5275
9770d958614J5010N2718L2110L0096J9875K9755O8681K3531R509K2688M8835J6250
9758d589556K299J8847L2925K1336L532J9208L654P975M1M6560M9532J6142M3524
9745d323981o684k1610P295O770K5613J1519L6956L9727L1873M3505K6708p386
9733d129695k8288J5467L2316L5651J996l499J6662J7114q636L3217M6459K666
9721c968570J5485L1831l857l087K0256J2672J7960L2362L733K9371K2079k0943
9709c810708j0813p794K4664L267J1244L5602k914J2608Q199n578K1436L8062
9697c682725K6951J3005l8406k7955J5116L8896L0365J6636K2795J9412j3977
$$ y = [-5420052, -5335527, -5300503, -5296466, -5268822, -5231836, -5171832, -5108979, -5077680, -5067533, -5021545, -4983889, -4958614, -4943604, -4890886, -4858776, -4828680, -4808805, -4779050, -4710369, -4686838, -4677329, -4654641, -4605806, -4589556, -4587257, -4568410, -4535485, -4514149, -4510617, -4491409, -4487755, -4479780, -4479739, -4433179, -4383647, -4367505, -4323981, -4330665, -4352275, -4344980, -4338210, -4312597, -4301078, -4264122, -4224395, -4192522, -4149017, -4122309, -4129695, -4157983, -4142516, -4110200, -4074549, -4072553, -4076052, -4059390, -4042276, -4050912, -4017695, -3971236, -3968570, -3953085, -3921254, -3925111, -3928198, -3907942, -3895270, -3877310, -3844948, -3841215, -3811844, -3789765, -3810708, -3821521, -3829315, -3804651, -3801384, -3790140, -3754538, -3757452, -3744844, -3736645, -3742223, -3720787, -3682725, -3655774, -3642769, -3681175, -3709130, -3694014, -3655118, -3624753, -3608117, -3585322, -3565910, -3579887]
9686c579887K6985M755j9762K0493K3256K8187O476j8352K3192K5246J3363J3090
9674c432958l519J4184J5994j6685J4980J6841k603r190Q22L1089n084K6783J4191
9661c335155k5988R207o777m342J4444K0013J0974n169j5658j3201P67K9645M2284
9648c278956R538o787P279r784J4647K2050l126l6121k117N0597K2652k789K9264
9635c183653K159P877L0999L76N84k2415j5737K7465J7376R296J536q91o646j0795
9621c142469K4778N0001J4025k1481k2856k1652J7409J7342L055K302K0865L2113
9609c026568K9100J0959K0806j0873J71j7857Q51m537j4930J1770j6779K5334
9597b992553O278J5067M35J3910K0299K1209J7810P996K730o830j0864K437J575
$$ y = [-3579887, -3552902, -3548147, -3567909, -3547416, -3524160, -3495973, -3489497, -3507849, -3484657, -3459411, -3446048, -3432958, -3436477, -3422293, -3406299, -3422984, -3408004, -3391163, -3393766, -3402956, -3402134, -3371045, -3376129, -3349346, -3335155, -3361143, -3351936, -3358713, -3363055, -3348611, -3328598, -3317624, -3322793, -3338451, -3351652, -3350885, -3321240, -3278956, -3269418, -3276205, -3268926, -3278710, -3264063, -3242013, -3245139, -3281260, -3283377, -3232780, -3210128, -3212917, -3183653, -3181494, -3173617, -3142618, -3142242, -3141658, -3164073, -3179810, -3152345, -3134969, -3125673, -3124137, -3125028, -3131674, -3142469, -3117691, -3067690, -3053665, -3075146, -3098002, -3119654, -3102245, -3084903, -3081848, -3079546, -3058681, -3026568, -2997468, -2986509, -2965703, -2976576, -2976405, -2994262, -2993411, -2997948, -3012878, -3001108, -3017887, -2992553, -2986275, -2971208, -2970773, -2956863, -2936564, -2915355, -2897545, -2889549, -2886819, -2893649, -2904513, -2902076, -2900501]
9584b900501K5001q255j7813l7472J6569M7335J2665j7247j5448K233L7973L0847
9572b824113K4375L1980K530p444o183M784L0458j0831l1097k0187L303J3931
9560b788494J404q895J0929K6945L0647K5919Q828o52p261J8102K1595j1681o437
9547b679051J0623o481P639L083J3601k1840O731o65R192j3063k967P726L678
9534b661794p731O545J8045K4869K2017m341R979M008K1988J9694j4485m564J3967
9521b551803O771m163K4280k8208k0276Q986L082J6530L9050j4877l6791p469
9509b564888L2606L9304o558m931K983n774R003J8917O447J205J6837J6340j3238
9496b451747P383L2036j7070J6751J4423K3184j9516k1432J983j1174K015J8066
$$ y = [-2900501, -2875500, -2883755, -2901568, -2939040, -2922471, -2875136, -2862471, -2879718, -2895166, -2892933, -2854960, -2824113, -2799738, -2767758, -2765228, -2772672, -2778855, -2774071, -2743613, -2754444, -2785541, -2805728, -2802425, -2788494, -2787090, -2795985, -2785056, -2758111, -2727464, -2701545, -2692717, -2693369, -2700630, -2682528, -2660933, -2672614, -2679051, -2668428, -2674909, -2667270, -2664187, -2650586, -2672426, -2665695, -2666360, -2657168, -2670231, -2673198, -2665472, -2661794, -2669525, -2662980, -2644935, -2620066, -2598049, -2602390, -2592411, -2588403, -2566415, -2546721, -2561206, -2565770, -2551803, -2545032, -2549195, -2524915, -2553123, -2573399, -2564413, -2561331, -2544801, -2505751, -2520628, -2557419, -2564888, -2532282, -2492978, -2499536, -2504467, -2501484, -2507258, -2498255, -2479338, -2472891, -2471686, -2454849, -2438509, -2451747, -2444364, -2412328, -2429398, -2412647, -2398224, -2375040, -2394556, -2415988, -2414005, -2425179, -2423164, -2405098]
9484b405098N974n858R420Q785m353j7953r22N995K3929L966n457l1232q214J0685
9470b410333Q174J216K6774K0904K2613q72K1293J4908O606k774P121M830j6609
9457b296149J1462m386R987p97J1776R293O246l74O875P742J6578K845J1656M8324
9443b158922N241l5620j1298K7830K2787n982L006K3150K7898j0271m682P832
9431b109031k479o008j045L6749K7496P255K6119l626j5067o7147m3059l0885
9419b180728k0554J4162R411M089m490n81K0030K9313J0095J2511j3474K2458
9407b097758M5314N2300j8130k3853j0234J8422J6227l3352J133K7047L1859K2499
9395a968526o388k2316k9405j947L2388L4964J1696n66J0431J9044K947R242J9183
$$ y = [-2405098, -2399124, -2404982, -2395562, -2386777, -2391130, -2409083, -2410005, -2404010, -2380081, -2376115, -2381572, -2412804, -2421018, -2410333, -2402159, -2400943, -2374169, -2353265, -2330652, -2331524, -2310231, -2295323, -2288717, -2291491, -2284370, -2279540, -2296149, -2284687, -2289073, -2279086, -2279883, -2268107, -2258814, -2252568, -2252942, -2246067, -2238325, -2221747, -2218902, -2207246, -2158922, -2153681, -2189301, -2200599, -2172769, -2149982, -2155964, -2152958, -2129808, -2101910, -2112181, -2116863, -2109031, -2111510, -2117518, -2118563, -2081814, -2054318, -2047063, -2020944, -2024570, -2039637, -2106784, -2149843, -2180728, -2201282, -2187120, -2177709, -2173620, -2178110, -2178691, -2158661, -2129348, -2119253, -2106742, -2120216, -2097758, -2052444, -2000144, -2018274, -2042127, -2052361, -2033939, -2017712, -2051064, -2049931, -2022884, -1991025, -1968526, -1974914, -1997230, -2026635, -2028582, -1996194, -1961230, -1949534, -1950100, -1939669, -1920625, -1917678, -1908436, -1889253]
9382a889253J3917J38k3855m931L8409J1597K057l0495L9395O379k0337j0167
9370a867146P954K0770n446j0301j0673j418j9621k679K6893M0341M0270M7928
9358a733128R598J445o36N584J074J6431J6417j3715j722K0845J8948J1384J7512
9345a629963L5927M3106J9437K444L4228j5467k5114P42k7784J6191J5330K2711
9333a508212J3000J500K5170J5681j2844J9872J4554j1383J1821l376L5522J8849
9321a379846l5605r713j271K4588L8938K9828J5810J242M0734N9932K5224N419
9309a184720j0105K4209L3180j4921p419N6137K5278L511J6518L1212K1776J2686
9297i92658j160L3906M4427L0516K8971K8937N0597J1289R647M0403J3845K6711
$$ y = [-1889253, -1875336, -1875198, -1899053, -1903984, -1865575, -1853978, -1851921, -1882416, -1843021, -1836642, -1856979, -1867146, -1859192, -1838422, -1843868, -1854169, -1864842, -1866260, -1885881, -1888560, -1861667, -1821326, -1781056, -1733128, -1723530, -1722085, -1722721, -1717137, -1716063, -1699632, -1683215, -1696930, -1698652, -1677807, -1658859, -1647475, -1629963, -1594036, -1550930, -1531493, -1529049, -1494821, -1510288, -1535402, -1534660, -1562444, -1546253, -1530923, -1508212, -1495212, -1493712, -1468542, -1452861, -1465705, -1445833, -1431279, -1442662, -1430841, -1434217, -1398695, -1379846, -1415451, -1425164, -1426435, -1401847, -1362909, -1333081, -1317271, -1316029, -1275295, -1215363, -1190139, -1184720, -1194825, -1170616, -1137436, -1152357, -1159776, -1103639, -1078361, -1074850, -1058332, -1027120, -1005344, -992658, -993818, -959912, -915485, -884969, -855998, -827061, -776464, -765175, -755528, -715125, -701280, -674569]
9285f74569K5154L0296K2093L0250J3877K1147O5392N1585M8056K8375L7679N3626
9273b47039P4888P0945N2674P4966L9274L4919N4891M5698J07555J06522N1277
9262D66570N8219J03662J01703J13830J36804J69121J28238J25638J52097J53418
9252A709300J78745K07307K17760K48462K88569L04078L02800L46857L83524M02988
9242D590390M72550N08751N02423M27972K10034j71851p64975j434687k144525
9233B196082k796613l050401k684441j838459r11835k33784J15716K71151L19426
9224h613158L51809L60472L43870K83586K62811K55900K16683J70334J31575K06692
9214f029426J99454J71509J14786R4363P8332J10144J03400P7160O2973N4209
$$ y = [-674569, -649415, -619119, -597026, -566776, -552899, -531752, -466360, -414775, -366719, -338344, -300665, -247039, -172151, -101206, -48532, 26434, 65708, 100627, 155518, 201216, 308771, 415293, 466570, 524789, 628451, 730154, 843984, 980788, 1149909, 1278147, 1403785, 1555882, 1709300, 1888045, 2095352, 2313112, 2561574, 2850143, 3154221, 3457021, 3803878, 4187402, 4590390, 5062940, 5571691, 6074114, 6502086, 6712120, 6540269, 5775294, 4340607, 2196082, -600531, -3650932, -6335373, -8173832, -9085667, -9319451, -9203735, -8932584, -8613158, -8261349, -7900877, -7557007, -7273421, -7010610, -6754710, -6538027, -6367693, -6236118, -6029426, -5829972, -5658463, -5543677, -5449314, -5370982, -5260838, -5157438, -5080278, -5017305, -4963096]
9204d963096N5969P0319O3188N5286M9760K9842J8802N7559M6960O332M0330N0672
9192d418077O4526M2057N7937M7880K8257K5153J6508L6573L2794K7980N0826
9181c987586L4414N4571K7204K1919L9611Q007L2953J5511J0172K8408K0694L0887
9169c663235J8830J3228L4297J8919M392K7439M6471L5238L2161J9136J6093q706
9157c405737j4257r886J8147l652J4633O3328L0131R074k214J926L2984K0630
9145c244893L8297J8963j9158M61L8302J7209O725L7510J6251K3209j1304K9980
9133c048448N2110M0347k3069R014K9563K3809q644k7759K0948J7777j8198j5618
9121b948168k052J9671n817j2719J7950j5282L9555K5340K9261Q557J9963j7876
$$ y = [-4963096, -4907127, -4836808, -4773620, -4718334, -4668574, -4638732, -4619930, -4562371, -4515411, -4509079, -4468749, -4418077, -4353551, -4311494, -4253557, -4205677, -4177420, -4152267, -4135759, -4099186, -4066392, -4038412, -3987586, -3953172, -3898601, -3871397, -3849478, -3809867, -3801860, -3768907, -3753396, -3743224, -3714816, -3694122, -3663235, -3644405, -3631177, -3596880, -3577961, -3573569, -3546130, -3499659, -3464421, -3432260, -3413124, -3397031, -3405737, -3419994, -3429880, -3411733, -3415385, -3400752, -3337424, -3307293, -3298219, -3300433, -3298507, -3265523, -3244893, -3206596, -3187633, -3206791, -3206330, -3168028, -3150819, -3144094, -3106584, -3090333, -3067124, -3078428, -3048448, -2996338, -2955991, -2979060, -2970046, -2940483, -2916674, -2925318, -2953077, -2932129, -2914352, -2932550, -2948168, -2950220, -2930549, -2936366, -2949085, -2931135, -2946417, -2906862, -2881522, -2852261, -2843704, -2823741, -2841617]
9109b841617j5140R012K4126j1860j702L9941O542j0510L463J5609L7925K5312
9097b718899K8722J2988J3205O434j6364k0752J8253j4659l669K4060L4148N175
9085b631358n237q36K5482J3364J9705J019N509O748J8452R938q220j7631j8549
9072b581614K0208M0406m676m719J7790M429j3547l816L5126p115J1600K5605
9060b460323j0275O796K5935k0301j1999J5684L374K3238L1428k0099N410K5323
9048b385809j5560k1705K4518L5259J1642N473K81Q76k0946j1056L7484J3025
9036b326518m2131j0125K4574L6493K7099j4866l4923r188L3111K1007Q864j325
9024b287928j8115L21L411K5134l09l5643j0304R779K1697J7283Q388K2531K0080
$$ y = [-2841617, -2856757, -2847745, -2823619, -2835479, -2837181, -2797240, -2790698, -2801208, -2797745, -2782136, -2744211, -2718899, -2690177, -2677189, -2663984, -2657550, -2673914, -2694666, -2676413, -2691072, -2694741, -2670681, -2636533, -2631358, -2636595, -2637431, -2611949, -2598585, -2578880, -2577861, -2572352, -2565604, -2547152, -2537214, -2545434, -2563065, -2581614, -2561406, -2521000, -2525676, -2530395, -2512605, -2508176, -2521723, -2525539, -2490413, -2497528, -2485928, -2460323, -2470598, -2463802, -2437867, -2458168, -2470167, -2454483, -2451109, -2427871, -2396443, -2416542, -2411132, -2385809, -2401369, -2423074, -2398556, -2363297, -2351655, -2346182, -2345901, -2345025, -2365971, -2377027, -2339543, -2326518, -2368649, -2378774, -2354200, -2317707, -2290608, -2305474, -2340397, -2349585, -2316474, -2295467, -2286603, -2287928, -2306043, -2305722, -2302311, -2277177, -2277486, -2313129, -2323433, -2313654, -2291957, -2274674, -2266286, -2243755, -2223675]
9011b223675K5731M165P572l0358j2889j0337j7813j5856J4768J434K8177k88
8999b229369n155L3479l693J4332J6086J0053J211K3275p160k0120L55j70j1053
8986b177929l0936k2944K9645J3389J1982J4248J7999J1650M458m167k824j5205
8974b150634j7172K5855J5237L046j271k823J5387K8329P337j3223j0433J3519
8962b086846Q300j338K8100L1150j809j9329k4700m3644J0445K3745K2153l462
8950b057235J5206o718R122j805o770k2909K5942J0097q996K2493K4826j9954
8938b016701k1540J628K6826J855j0346N41j126q615N687K9759J6931o196j7189
8925a998486M532m999m347K0913M2169l2484j4607J2061R315O412J4584K3998
$$ y = [-2223675, -2197944, -2193779, -2186207, -2216565, -2229454, -2239791, -2257604, -2273460, -2258692, -2257258, -2229081, -2229369, -2234524, -2201045, -2204738, -2190406, -2174320, -2164267, -2163056, -2139781, -2146941, -2167061, -2166706, -2166876, -2177929, -2208865, -2231809, -2202164, -2188775, -2176793, -2162545, -2144546, -2132896, -2128438, -2132605, -2135429, -2150634, -2167806, -2141951, -2126714, -2123668, -2124939, -2127762, -2112375, -2084046, -2076709, -2089932, -2100365, -2086846, -2078546, -2079884, -2051784, -2020634, -2022443, -2041772, -2066472, -2110116, -2099671, -2075926, -2053773, -2057235, -2042029, -2048747, -2039625, -2041430, -2048200, -2071109, -2045167, -2035070, -2044066, -2021573, -1996747, -2016701, -2038241, -2036613, -2009787, -2007932, -2018278, -2017737, -2018863, -2027478, -2021791, -1992032, -1975101, -1981297, -1998486, -1993954, -1998953, -2003300, -1982387, -1940218, -1972702, -1987309, -1975248, -1965933, -1959521, -1944937, -1920939]
8913a920939K1755J9475J4441P317J3874j620o758m5681j2711K3721k1366m2556
8901a951048L28J6704N353K2654Q713K2759N384k529J549R491M250K3344K2443
8888a810605R030J4893j9548q867P840r436P865J1778M3366n245l200J440j3005
8875a773694R500L244j5849l834K5505J1342J2842j098j526k0482J369p267m801
8862a764749j142k303J2414L2847L6439K7407l5516k9540p104k5291N344j2707
8850a763901j0773L2379p374m567J0905K7425K8812K5854Q469j7863l4878K848
8838a702664L794K6451J5248k166j7538K1033L7940L6212j2043k3457J2644M730
8826a599816o377P138K4828l265o294J0980K2212p545J2453j1238l1738m6269
$$ y = [-1920939, -1899184, -1879709, -1865268, -1857951, -1844077, -1845697, -1852455, -1898136, -1910847, -1887126, -1908492, -1951048, -1950720, -1934016, -1928663, -1906009, -1897296, -1874537, -1869153, -1871682, -1870133, -1860642, -1856392, -1833048, -1810605, -1801575, -1786682, -1806230, -1815097, -1807257, -1816693, -1808828, -1797050, -1753684, -1758929, -1762129, -1760689, -1773694, -1764194, -1760950, -1776799, -1780633, -1755128, -1743786, -1730944, -1732042, -1733568, -1754050, -1752681, -1759948, -1764749, -1765891, -1768194, -1755780, -1722933, -1686494, -1659087, -1694603, -1724143, -1731247, -1756538, -1751194, -1763901, -1774674, -1742295, -1749669, -1754236, -1743331, -1715906, -1687094, -1661240, -1652771, -1670634, -1705512, -1702664, -1698870, -1672419, -1657171, -1659337, -1676875, -1655842, -1617902, -1581690, -1593733, -1617190, -1604546, -1599816, -1606193, -1599055, -1574227, -1577492, -1583786, -1572806, -1550594, -1558139, -1545686, -1556924, -1588662, -1634931]
8814a634931j059J0195j4829k4547J9732L7853O318K3299J8202N531J7122J3601
8802a523513J795k1735l0446k738L1493J7682K330J0476J9885j07q767J3869Q706
8789a481070j3101m97q407J3780R162K1735L7546L1507K1005J9044j7736J9884
8777a347148M5973K5746J8612j878n9674m9378n2034n4428p6463M918K7807l2560
8765a550507q231K1418L3165J9201L8756J9256J4089J2240L1414K783k7510N624
8753a388302L0250N514m752J3968P656O953J4444M1643K2550o863L086l5593K9069
8740a260377K1801J2937J3824L852J4932J5966k2776k4258J1599K9532J0867Q265
8728a163836j5824J7299O290k8037k4637q43L2326K2022J3472R309O629M917O048
$$ y = [-1634931, -1635990, -1625795, -1640624, -1665171, -1645439, -1607586, -1601268, -1577969, -1559767, -1554236, -1537114, -1523513, -1521718, -1543453, -1573899, -1576637, -1545144, -1527462, -1525132, -1514656, -1494771, -1494878, -1503645, -1489776, -1481070, -1494171, -1494668, -1503075, -1489295, -1480133, -1458398, -1420852, -1389345, -1368340, -1349296, -1367032, -1347148, -1301175, -1275429, -1256817, -1258695, -1318369, -1367747, -1419781, -1474209, -1550672, -1545754, -1517947, -1550507, -1558738, -1537320, -1504155, -1484954, -1446198, -1426942, -1412853, -1400613, -1369199, -1366416, -1393926, -1388302, -1358052, -1352538, -1357290, -1343322, -1335666, -1328713, -1314269, -1272626, -1250076, -1256939, -1253853, -1289446, -1260377, -1238576, -1225639, -1211815, -1207963, -1193031, -1177065, -1199841, -1224099, -1212500, -1182968, -1172101, -1163836, -1179660, -1162361, -1156071, -1184108, -1208745, -1209588, -1177262, -1155240, -1141768, -1132459, -1125830, -1120913, -1114865]
8715a114865K7528L241L5426j792j9605J5812L0456J3266J2868P128L2940K9063
8703i28534Q498k1766j2138M7498J8448J4971K1263K9610K1428j1704R37J9136
8691g92353J6339K840J1216K7629M5137L8711K5648K9010j8563k3385L6121K3718
8679e77932M486J2207M8720J3143Q114K8007K659J7342J1125J9715L2321L2219
8667c47874L5900K9364K0290L0270J3582K0960N1465Q0264R2718Q8682N5699N6645
8655B27965P8738O3791P6933N3161P4306P8995Q2430J41031J28019R9920J16760
8644A222049J52225K12519K58275L04833L49080M02381M75738L76338K2669m79720
8634C296387q68764j484957k395169k292634p60954L00954N08327M37576L81288
$$ y = [-1114865, -1087337, -1084096, -1048670, -1050462, -1070067, -1054255, -1023799, -1010533, -997665, -990537, -957597, -928534, -920036, -941802, -953940, -906442, -887994, -873023, -851760, -822150, -800722, -812426, -811489, -792353, -776014, -773174, -761958, -734329, -689192, -650481, -624833, -595823, -614386, -637771, -601650, -577932, -573446, -561239, -512519, -499376, -491262, -463255, -460596, -443254, -432129, -412414, -380093, -347874, -311974, -282610, -262320, -232050, -218468, -197508, -146043, -65779, 26939, 115621, 171320, 227965, 306703, 370494, 447427, 500588, 574894, 653889, 736319, 877350, 1005369, 1105289, 1222049, 1374274, 1586793, 1845068, 2149901, 2498981, 2901362, 3377100, 3753438, 3776107, 3296387, 2427623, 942666, -1452503, -3745137, -4506091, -4205137, -3696810, -3259234, -2877946]
8625b877946K94818K60917K10830K18467K14017K09545J50334J25667R3014R8977
8615a001360J23848J36455J24704J10241J51774J79293J35286J24458J45055J61766
8605C91520J71444J67013J94694K36099K26917K54873K90949L66040M52280N59774
8595C311603P01629Q03647R23077Q48849K40685q07441j585170k572440m560196
8586b695757n098727k207661L27106R39645Q55470O91782N36529M30620L60447
8577e860546L18031K90221K82511K08021J13338J66352J67469J72144J36058J54964
8567c851437J65906J51510J37633J25700R3972J21602R1447J01703R4831J22699
8557b644434J23756J34344J69432J78583K19227K37217K66632L10498L78580M64421
$$ y = [-2877946, -2583128, -2322211, -2111381, -1892914, -1678897, -1469352, -1319018, -1193351, -1100337, -1001360, -877512, -741057, -616353, -506112, -354338, -175045, -39759, 84699, 229754, 391520, 562964, 729977, 924671, 1160770, 1387687, 1642560, 1933509, 2299549, 2751829, 3311603, 4013232, 4816879, 5739956, 6588805, 6829490, 6022049, 4436879, 1864439, -2695757, -7794484, -10002145, -9675039, -8735394, -7879924, -7188142, -6651613, -6220993, -5860546, -5542515, -5252294, -4969783, -4761762, -4648424, -4482072, -4314603, -4142459, -4006401, -3851437, -3685531, -3534021, -3396388, -3270688, -3176716, -3055114, -2963667, -2861964, -2767133, -2644434, -2520678, -2386334, -2216902, -2038319, -1819092, -1581875, -1315243, -1004745, -626165, -161744]
8547a61744M47224K06470k38518o66607j044748j911236k489913j525173n8745
8538g442990N28232N02191L47123K68063K55837K11126J83208J67609J11149J19122
8528d749330N9656R4930J03637O7385Q0163Q3787N8642O3098K7132L6413O0194
8517d014293P2046K6440K1357J6970J6129K7174M7081N4895N0094J4274K2729
8506c645104J8159K8431K807J7314J0408R622J3994K8156J7101L5588L2256K6668
8494c404600M6341N2146M1559K1143J4657L4445k2084L0024J9732k0090K295M2291
8482c142141N7433L0802R194n349O406k0200L55J1605J3930L1038L3590o178j3084
8469b992599M701J8078K614K2747J2305J0193M315K3049J9352J0395J2311o950
$$ y = [-161744, 285480, 491950, 253432, -413175, -1457923, -3369159, -5859072, -7384245, -7442990, -6914758, -6412567, -6065444, -5797381, -5541544, -5330418, -5147210, -4979601, -4868452, -4749330, -4689674, -4594744, -4491107, -4423722, -4343559, -4259772, -4201130, -4138032, -4110900, -4074487, -4014293, -3942247, -3915807, -3894450, -3877480, -3861351, -3834177, -3787096, -3732201, -3682107, -3667833, -3645104, -3626945, -3598514, -3595707, -3578393, -3567985, -3558363, -3544369, -3516213, -3499112, -3463524, -3431268, -3404600, -3358259, -3306113, -3264554, -3243411, -3228754, -3194309, -3216393, -3186369, -3166637, -3186727, -3184432, -3142141, -3084708, -3053906, -3044712, -3050061, -3043655, -3063855, -3063500, -3051895, -3037965, -3006927, -2973337, -2979515, -2992599, -2987898, -2969820, -2967206, -2944459, -2932154, -2921961, -2917646, -2894597, -2875245, -2864850, -2852539, -2859489]
8457b859489O053J2857L2072K6784m9023K8M7242L5095J890M366N17k1118K9968
8444b732758J0521K5311j0j1879J8178L1402J6492J2192K318k5058k1363L0187
8432b644467N3232K5644j6906o747M194K3584J6734K744j2408L4660K63j2608
8420b532081K4752R707p960R578j2675J5552L707Q998K9175j629k2540J181M2981
8407b431254J1875Q258Q992j2436J4704O679K765l411L134j0411J9301R988J3145
8394b358671J6087M318o18j4109l1596J0520J0162M26L4257J7489l6635j6032
8382b364402J1707J4499N0945o788K0968j5205k223J9190r158k1905J0544m3963
8370b335791m9202J1588L6632M1256J9987K47J3032J1253K0217m470k8766j8332
$$ y = [-2859489, -2853436, -2840579, -2808507, -2781723, -2830746, -2830718, -2783476, -2748381, -2746491, -2742125, -2741608, -2762726, -2732758, -2722237, -2696926, -2696936, -2708815, -2690637, -2659235, -2642743, -2630551, -2628233, -2653291, -2674654, -2644467, -2591235, -2565591, -2582497, -2589244, -2585050, -2561466, -2544732, -2541988, -2554396, -2519736, -2519473, -2532081, -2507329, -2497622, -2505582, -2496004, -2508679, -2493127, -2489420, -2480422, -2451247, -2452876, -2475416, -2474235, -2431254, -2419379, -2411121, -2402129, -2414565, -2399861, -2393182, -2390417, -2393828, -2390694, -2401105, -2381804, -2371816, -2358671, -2342584, -2338266, -2338884, -2352993, -2384589, -2374069, -2363907, -2363481, -2329224, -2311735, -2348370, -2364402, -2352695, -2338196, -2287251, -2294039, -2273071, -2288276, -2290499, -2271309, -2280467, -2302372, -2291828, -2335791, -2384993, -2373405, -2336773, -2295517, -2275530, -2275283, -2262251, -2250998, -2230781, -2235251, -2264017, -2282349]
8358b282349J848J1632q702j1910J2965P528l908n185M4875K7142l715o038J9787
8345b196030O462J5224K1845K0806l421l6459l1015j9187P086J5206M8818m846
8333b155511J3435J7285l1559k4382k0339j177L0186L7285K1640J2990k2137r030
8321b131314k366k3721j2814M4317N53j0J995N45J1978K4645M822p633j2089J3554
8307b087538N911k9688R505J7433l757l1975M287J2679J7705R072o032J1084O653
8294b064661J3917n17K4619j3628j3674m2K1677K0960P078j0771q462j0000J3344
8281b020160M3565L4085k325L583o827l3130j5070k1007q600k6085l559J8068
8269b037462K9909L9449J6240n131J1904m1910m6215J9470J0023j0815Q01P001
$$ y = [-2282349, -2280501, -2268869, -2277571, -2289481, -2276516, -2268988, -2272896, -2278081, -2233206, -2206064, -2209779, -2215817, -2196030, -2189568, -2174344, -2152499, -2131693, -2135114, -2171573, -2202588, -2221775, -2214689, -2199483, -2150665, -2155511, -2142076, -2124791, -2156350, -2180732, -2201071, -2202248, -2172062, -2134777, -2113137, -2100147, -2122284, -2131314, -2133680, -2157401, -2170215, -2125898, -2125345, -2125355, -2123360, -2122815, -2110837, -2086192, -2081370, -2089003, -2101092, -2087538, -2081627, -2111315, -2101810, -2084377, -2088134, -2120109, -2115822, -2103143, -2085438, -2076366, -2082398, -2071314, -2064661, -2050744, -2051261, -2026642, -2040270, -2053944, -2053986, -2032309, -2011349, -2004271, -2015042, -2023504, -2033504, -2020160, -1976595, -1942510, -1944835, -1941252, -1948079, -1981209, -1996279, -2017286, -2025886, -2051971, -2055530, -2037462, -2007553, -1968104, -1951864, -1956995, -1945091, -1987001, -2033216, -2013746, -2003723, -2014538, -2013737, -2006736]
8257b006736P1151M3587q789l2696M467P121l7591o482P101R66R452J3373K2476
8244a912600K3876Q483k5287k5681m8R077J5242J6612P274l180N707K6202j2026
8231a866349k7379M861K7915k389k7936l7948m849L0783j52J5381L1462k2786
8219a879386l0061J3782R875l52L5135k587J9885p24j1444m105P945L2008J1263
8206a798766K6087M1998J4906k267j1053J2846k6096j0560P087K7531K6720N5521
8194a636046J4177j771K455k7493o3213p9792j11242n0871M239L798k2911m037
8182a972707n997l043N6144O377o787J2502P222N566L4591K1683K3220M6801k0283
8169a794711l4672m4002m4326K4534J2636n854K1596L8321N303J6494K0183Q993
$$ y = [-2006736, -1935585, -1891998, -1900787, -1933483, -1929016, -1921895, -1959486, -1965968, -1958867, -1957901, -1948449, -1935076, -1912600, -1888724, -1880241, -1905528, -1931209, -1931257, -1922180, -1906938, -1890326, -1883052, -1886232, -1880525, -1854323, -1866349, -1893728, -1888867, -1860952, -1863341, -1891277, -1929225, -1934074, -1903291, -1903443, -1888062, -1856600, -1879386, -1909447, -1895665, -1885790, -1886142, -1851007, -1853594, -1833709, -1834433, -1845877, -1849982, -1842037, -1810029, -1798766, -1772679, -1730681, -1715775, -1718042, -1729095, -1716249, -1742345, -1752905, -1745818, -1718287, -1691567, -1636046, -1621869, -1623640, -1621185, -1648678, -1711891, -1791683, -1902925, -1953796, -1949557, -1945759, -1968670, -1972707, -1978704, -1981747, -1925603, -1919226, -1926013, -1913511, -1906289, -1900723, -1866132, -1844449, -1821229, -1774428, -1794711, -1829383, -1873385, -1917711, -1893177, -1880541, -1886395, -1864799, -1826478, -1821175, -1804681, -1784498, -1775505]
8157a775505j8656Q815k7293K1911M0077L5640K7416Q902j9573n4490p3895j15785
8145a942436j04615m5138k1962K7294M3377N6487J8714j495j4439j0092K030L4645
8133a957630L0261j0457k789J5664J3600L7127L1716J2983q149o53j8392o6524
8121a923243m0671j2269J129K1556o724M0457l722j7727k1211L220L3503J4303
8109a911399r342j6875m591N465J3427J2506R667K4559k5338j5303P369j3461
8097a923316J3111k60J894J7984J9888j8012J1024K4392N820q460L344L3769M621
8084a814201k3452k9971L6306N3063J9582j6274n7897n64m4329L2260L4405L1237
8072a779835k7637l5177p061P795J1847j0577j2111R292J304L6657L5292J3233
$$ y = [-1775505, -1794161, -1785346, -1812639, -1790728, -1750651, -1715011, -1687595, -1678693, -1698266, -1752756, -1826651, -1942436, -2047051, -2092189, -2114151, -2086857, -2043480, -1986993, -1968279, -1969774, -1984213, -1994305, -1992275, -1957630, -1927369, -1937826, -1940615, -1924951, -1911351, -1874224, -1842508, -1829525, -1837674, -1838327, -1856719, -1923243, -1963914, -1976183, -1975054, -1953498, -1960222, -1919765, -1923487, -1941214, -1962425, -1959205, -1925702, -1911399, -1920741, -1937616, -1942207, -1936742, -1923315, -1910809, -1901142, -1876583, -1901921, -1917224, -1909855, -1923316, -1910205, -1910465, -1908571, -1890587, -1870699, -1888711, -1877687, -1853295, -1847475, -1855935, -1852591, -1818822, -1814201, -1837653, -1867624, -1831318, -1778255, -1758673, -1774947, -1832844, -1833408, -1877737, -1845477, -1811072, -1779835, -1807472, -1842649, -1849710, -1841915, -1830068, -1840645, -1852756, -1843464, -1842160, -1805503, -1770211, -1756978]
8060a756978j2652k2447l5548K1180J7972j8436n963K7899J747k1551k6565J6022
8048a815320p54j6337J7649r96j4997j879J2323M1959J4045L264L481r110j744
8035a768416n141P742P886K7263j440J7452j0477k1220j5948J831J2900j7547
8023a765115j5549Q216J9813l0654j2540J4803K3978J3082K581J2571J4043k0064
8011a734835O410P731K3826J9885j9813m2650j0009K2140K0866k445l3014j5021
7999a756929P769r417j7143J5352J9509M957j2382K6627K8206j8878j9371K179
7987a729521K2111k3564j9758J8618q059m4442j3946J0320j7833L4322M1611P023
7975a723118k8992r020O393k498o848L4637J8596K3586K2823k3771m8809k3397
$$ y = [-1756978, -1769630, -1792077, -1827625, -1806445, -1788473, -1806909, -1812872, -1784973, -1783226, -1804777, -1831342, -1815320, -1816074, -1832411, -1814762, -1815758, -1830755, -1832634, -1820311, -1778352, -1764307, -1761043, -1757562, -1766672, -1768416, -1773557, -1765815, -1757929, -1730666, -1732106, -1714654, -1725131, -1746351, -1762299, -1760468, -1747568, -1765115, -1780664, -1772448, -1752635, -1783289, -1795829, -1781026, -1757048, -1743966, -1741385, -1728814, -1714771, -1734835, -1728425, -1720694, -1696868, -1676983, -1696796, -1739446, -1749455, -1727315, -1706449, -1708894, -1741908, -1756929, -1749160, -1758577, -1775720, -1760368, -1740859, -1735902, -1748284, -1721657, -1693451, -1712329, -1731700, -1729521, -1707410, -1730974, -1750732, -1732114, -1740173, -1784615, -1798561, -1788241, -1806074, -1771752, -1730141, -1723118, -1752110, -1761130, -1754737, -1757235, -1764083, -1729446, -1710850, -1687264, -1664441, -1688212, -1737021, -1760418]
7963a760418l5664J3363L3424L9158J6418J0692j01k0622j3061n855N440J9242
7951a697984J0578R174j402j0268l5846O756J328j5547J984p876k852j06n079
7938a747140R534J8118J9728M830M798j0102k6536k5164l2946J2383L1638R881
7926a730978N2485l2504k1115k87p178p185J0775p509K9529J0102M325j0030k372
7913a711942K681j6153k0092M7585L7567j8929k1576J4606q395l861J6254l6243
7901a718498k8756P330j052J7752o987o09J5633R701J253J9285k2645j9309J0704
7888a716198K783l988J3236r167k6515K9910J8384K4147K995q908j134j6152k8690
7875a719297J0214J8174R945j2824j0055q864Q893Q430O727Q770j2479j0186r660
$$ y = [-1760418, -1796082, -1782719, -1749295, -1710137, -1693719, -1683027, -1683128, -1703750, -1716811, -1722666, -1717226, -1697984, -1687406, -1678232, -1679634, -1689902, -1725748, -1718992, -1717664, -1733211, -1731227, -1739103, -1741955, -1742061, -1747140, -1737606, -1719488, -1699760, -1694930, -1690132, -1700234, -1726770, -1751934, -1784880, -1772497, -1740859, -1730978, -1678493, -1710997, -1732112, -1732399, -1739577, -1746762, -1735987, -1743496, -1713967, -1703865, -1699540, -1709570, -1711942, -1709261, -1725414, -1745506, -1697921, -1660354, -1679283, -1700859, -1686253, -1694648, -1698509, -1682255, -1718498, -1747254, -1739924, -1740976, -1723224, -1730211, -1730820, -1715187, -1705486, -1704233, -1684948, -1707593, -1726902, -1716198, -1713415, -1717403, -1704167, -1713334, -1739849, -1709939, -1691555, -1667408, -1664413, -1673321, -1674455, -1690607, -1719297, -1709083, -1690909, -1680964, -1693788, -1703843, -1712707, -1703814, -1695384, -1688657, -1679887, -1692366, -1702552, -1712212]
7862a712212j0147J9027K3270J8921j9842J2512k553p71K0720j6689j9013q094
7850a694871L5012O750J4608j7564J5066J7832k9276j9075K581j5679j8143k192
7838a704951K2232J0196R365r81j098r442k671k8727j0189L647k748K3080J6690
7825a675597k4712J7029L6342r675l0623L3004O298p673K91L3676K3603j643J129
7812a598551j1417l5949q181Q859K4422k7222l6400K3623J1936M7994n876j3193
7800a619955O111j8467n069J621J607p18K4668l762P581l4708M511K9152k878
$$ y = [-1712212, -1722359, -1703332, -1680062, -1661141, -1680983, -1668471, -1671024, -1671795, -1651075, -1667764, -1686777, -1694871, -1659859, -1653109, -1638501, -1656065, -1640999, -1623167, -1652443, -1671518, -1668937, -1684616, -1702759, -1704951, -1682719, -1672523, -1663158, -1664139, -1665237, -1674679, -1677350, -1706077, -1716266, -1712619, -1715367, -1692287, -1675597, -1700309, -1683280, -1646938, -1656613, -1687236, -1654232, -1647934, -1655607, -1655316, -1621640, -1598037, -1599680, -1598551, -1609968, -1645917, -1654098, -1645239, -1620817, -1648039, -1684439, -1660816, -1648880, -1600886, -1606762, -1619955, -1613844, -1632311, -1637380, -1635759, -1634152, -1634870, -1610202, -1613964, -1606383, -1641091, -1636580, -1607428, -1610306]
$$ [...]
##END NTUPLES=NMR SPECTRUM
##END=
