##TITLE=Analysis number 320864
Compound Code cc 49746
Book Reference 423/80/3
Project Code adrs
Chemist Name bruced
##JCAMPDX= 6.0         $$ Bruker NMR JCAMP-DX V2.0
##DATA TYPE= NMR SPECTRUM
##DATA CLASS= NTUPLES
##ORIGIN= Bruker BioSpin GmbH
##OWNER= nmr
$$ XWIN-NMR		Version 3.5
$$ Fri Jul 14 09:27:05 2006 GMT Daylight Time (UT+1h)  MAYBRIDGE\nmr@NMR_250MHZ
##.OBSERVE FREQUENCY= 250.131544655141
##.OBSERVE NUCLEUS= ^1H
##.ACQUISITION MODE= SIMULTANEOUS (DQD)
##.ACQUISITION SCHEME= undefined
##.AVERAGES= 16
##.DIGITISER RES= 18
##SPECTROMETER/DATA SYSTEM= dpx250
##.PULSE SEQUENCE= zg30
##.SOLVENT NAME= CDCl3
##.SHIFT REFERENCE= (INTERNAL, CDCl3, 0, 16.522)
##AUDIT TRAIL= $$ (NUMBER, WHEN, WHO, WHERE, WHAT)
$$ ##TITLE= Audit trail, XWIN-NMR		Version 3.5
$$ ##JCAMPDX= 5.01
$$ ##ORIGIN= Bruker BioSpin GmbH
$$ ##OWNER= nmr
$$ C:\u/data/dgb/nmr/ADRS/2730/pdata/1/auditp.txt
$$ ##AUDIT TRAIL=  $$ (NUMBER, WHEN, WHO, WHERE, WHAT)
(   1,<2006-07-14 09:26:43.45 +100>,<MAYBRIDGE\nmr>,<NMR_250MHZ>,
      <created by zg, POWCHK disabled, PULCHK disabled
       configuration hash MD5:
       E2 DF 36 D8 04 B2 41 60 5A D7 A3 38 5A 4B D0 FE
       data hash MD5: 64K
       3D 9D 7D 79 FD 50 F0 E2 20 10 B2 83 F3 D7 0B 36>)
(   2,<2006-07-14 09:26:56.08 +100>,<MAYBRIDGE\nmr>,<NMR_250MHZ>,
      <Start of raw data processing
       ef LB = 0.3 FT_mod = 6 PKNL = 1 SI = 32K 
       data hash MD5: 32K
       CA 8F 42 6B DA D7 B6 94 60 2A 12 06 9A E3 90 E8>)
(   3,<2006-07-14 09:26:57.66 +100>,<MAYBRIDGE\nmr>,<NMR_250MHZ>,
      <apk 
       data hash MD5: 32K
       A1 1B 3B 49 63 BF D6 8C 2D 05 D6 1A 34 92 BA FB>)
(   4,<2006-07-14 09:26:58.39 +100>,<MAYBRIDGE\nmr>,<NMR_250MHZ>,
      <abs ABSG = 5 
       data hash MD5: 32K
       F9 20 AB A5 24 6A 0F C7 54 5F CA F4 21 D1 EF 3C>)
$$ ##END=
$$ 
$$ hash MD5
$$ 9F E9 53 4D 9C 65 A1 CD 51 4C FD CF E1 75 BB 12
##$RELAX= 
##$RELAX= 
##$RELAX= 
##$RELAX= 
##$RELAX= 
##$RELAX= 
##$RELAX= 
$$ Bruker specific parameters
$$ --------------------------
##$DU= <C:\u>
##$EXPNO= 2730
##$NAME= <ADRS>
##$PROCNO= 1
##$TYPE= <nmr>
##$USER= <dgb>
##$AMP= (0..31)
100 100 100 100 100 100 100 100 100 100 100 100 100 100 100 100 100 100 
100 100 100 100 100 100 100 100 100 100 100 100 100 100 
##$AQSEQ= 0
##$AQ_mod= 3
##$AUNM= <au_zg>
##$AUTOPOS= <50 >
##$BF1= 250.13
##$BF2= 250.13
##$BF3= 250.13
##$BF4= 250.13
##$BF5= 500.13
##$BF6= 500.13
##$BF7= 500.13
##$BF8= 500.13
##$BYTORDA= 1
##$CFDGTYP= 0
##$CFRGTYP= 5
##$CHEMSTR= <none>
##$CNST= (0..31)
1 1 145 1 1 1 1 1 1 1 1 1 1 1 1 1 1 1 1 1 1 1 1 1 1 1 1 1 1 1 1 1 
##$CPDPRG= <>
##$CPDPRG1= <>
##$CPDPRG2= <>
##$CPDPRG3= <>
##$CPDPRG4= <mlev>
##$CPDPRG5= <mlev>
##$CPDPRG6= <mlev>
##$CPDPRG7= <mlev>
##$CPDPRG8= <mlev>
##$CPDPRGB= <>
##$CPDPRGT= <>
##$D= (0..31)
0 1 0 0 0 0 0 0 0 0.06 0 0 0 0 0 0 0.0002 0 0 0 0 0 0 0 0 0 0 0 0 0 0 
0 
##$DATE= 1152865602
##$DBL= (0..7)
120 120 120 120 120 120 120 120 
##$DBP= (0..7)
150 150 150 150 150 150 150 150 
##$DBP07= 0
##$DBPNAM0= <>
##$DBPNAM1= <>
$$ [...]
##$SUBNAM7= <"">
##$SUBNAM8= <"">
##$SUBNAM9= <"">
##$SW= 20.6930455092707
##$SWIBOX= (0..15)
0 0 3 0 0 0 0 0 0 0 0 0 0 0 0 0 
##$SW_h= 5175.983436853
##$TD= 65536
##$TD0= 1
##$TE= 296.16
##$TE2= 300
##$TE3= 300
##$TEG= 300
##$TL= (0..7)
0 120 120 120 120 120 120 120 
##$TP= (0..7)
150 150 150 150 150 150 150 150 
##$TP07= 0
##$TPNAME0= <>
##$TPNAME1= <>
##$TPNAME2= <>
##$TPNAME3= <>
##$TPNAME4= <>
##$TPNAME5= <>
##$TPNAME6= <>
##$TPNAME7= <>
##$TPOAL= (0..7)
0.5 0.5 0.5 0.5 0.5 0.5 0.5 0.5 
##$TPOFFS= (0..7)
0 0 0 0 0 0 0 0 
##$TUNHIN= 0
##$TUNHOUT= 0
##$TUNXOUT= 0
##$USERA1= <user>
##$USERA2= <user>
##$USERA3= <user>
##$USERA4= <user>
##$USERA5= <user>
##$V9= 5
##$VALIST= <valist>
##$VCLIST= <CCCCCCCCCCCCCCC>
##$VD= 0
##$VDLIST= <DDDDDDDDDDDDDDD>
##$VPLIST= <PPPPPPPPPPPPPPP>
##$VTLIST= <TTTTTTTTTTTTTTT>
##$WBST= 1024
##$WBSW= 4
##$XGAIN= (0..3)
0 0 0 0 
##$XL= 0
##$YL= 0
##$YMAX_a= 325700
##$YMIN_a= -455525
##$ZGOPTNS= <>
##$ZL1= 120
##$ZL2= 120
##$ZL3= 120
##$ZL4= 120
##$ABSF1= 16.522
##$ABSF2= -4.171173
##$ABSG= 5
##$ABSL= 3
##$ALPHA= 0
##$AQORDER= 0
##$ASSFAC= 0
##$ASSFACI= 0
##$ASSFACX= 0
##$ASSWID= 0
##$AUNMP= <proc_1d>
##$AZFE= 0.1
##$AZFW= 0.1
##$BCFW= 0
##$BC_mod= 0
##$BYTORDP= 0
##$COROFFS= 0
##$CY= 12.5
##$DATMOD= 1
##$DC= 0
##$DFILT= <>
##$DTYPP= 0
##$F1P= 14.0000005364418
##$F2P= -0.99999901652339
##$FCOR= 0.5
##$FTSIZE= 32768
##$FT_mod= 6
##$GAMMA= 0
##$GB= 0
##$INTBC= 1
##$INTSCL= 1
##$ISEN= 128
##$LB= 0.3
##$LEV0= 0
##$LPBIN= 0
##$MAXI= 10000
##$MC2= 0
##$MEAN= 0
##$ME_mod= 0
##$MI= 0
##$NCOEF= 0
##$NC_proc= -4
##$NLEV= 6
##$NOISF1= 0
##$NOISF2= 0
##$NSP= 0
##$NTH_PI= 0
##$NZP= 0
##$OFFSET= 16.522
##$PC= 1
##$PHC0= 165.1397
##$PHC1= 4.265955
##$PH_mod= 1
##$PKNL= yes
##$PPARMOD= 0
##$PSCAL= 4
##$PSIGN= 0
##$REVERSE= no
##$SF= 250.13
##$SI= 32768
##$SIGF1= 0
##$SIGF2= 0
##$SINO= 400
##$SIOLD= 32768
##$SREGLST= <1H.CDCl3>
##$SSB= 0
##$STSI= 32768
##$STSR= 0
##$SW_p= 5175.98343685301
##$SYMM= 0
##$S_DEV= 0
##$TDeff= 65536
##$TDoff= 0
##$TI= <Analysis number 999999
Compound Code 99
Book Reference 9
Project Code 9>
##$TILT= no
##$TM1= 0
##$TM2= 0
##$TOPLEV= 0
##$USERP1= <user>
##$USERP2= <user>
##$USERP3= <user>
##$USERP4= <user>
##$USERP5= <user>
##$WDW= 1
##$XDIM= 32768
##$YMAX_p= 498618194
##$YMIN_p= -495715
$$ End of Bruker specific parameters
$$ ---------------------------------
##NTUPLES= NMR SPECTRUM
##VAR_NAME=  FREQUENCY,     SPECTRUM/REAL,   SPECTRUM/IMAG
##SYMBOL=    X,             R,               I
##VAR_TYPE=  INDEPENDENT,   DEPENDENT,       DEPENDENT
##VAR_FORM=  AFFN,          ASDF,            ASDF
##VAR_DIM=   32768,         32768,           32768
##UNITS=     HZ,            ARBITRARY UNITS, ARBITRARY UNITS
##FACTOR=    0.157963299565203, 1,           1
##FIRST=     4132.6476996994, 0,             0
##LAST=      -1043.33573715361, 0,           0
##MIN=       -1043.33573715361, -495715,     0
##MAX=       4132.6476996994, 498618194,     0
$$ Real data points
##PAGE= N=1
##DATA TABLE= (X++(R..R)), XYDATA
$$ [...]
16346A381783J34586K11482J84835J27244R5771L2288j0407K1495K9700R24p42
16335B208959j03202k00084j50134j28399r7161o6320p8410r6571o9811o9784
16325A149083m6042l9783k3871N4449O9657M1078K4479L9831J00535P8088Q5520
16314A533024J14121J10605R9067J11137J16299J36274J43796J80196K21691K30357
16304B996567K64436K72724L28192M63147N76213Q18771J175493J643399K305882
16295A0844824L024406L815782M437898M762819N078944N544864N917822O803486
16287E0230845P954623P474834N889349M441100J239285q22094K68724Q11949
16279G7488615R0788o89652l341428p106830p637212o898019o087965m900479
$$ plain form
16346 1381783 1516369 1727851 1912686 2039930 2135701 2167989 2157582 2179077 2208777 2209701 2208959
16335 2208959 2105757 1905673 1755539 1627140 1529979 1463659 1385249 1288678 1218867 1149083
16325 1149083 1103041 1063258 1039387 1093836 1163493 1204571 1229050 1268881 1369416 1447504 1533024
16314 1533024 1647145 1757750 1856817 1967954 2084253 2220527 2364323 2544519 2766210 2996567
16304 2996567 3261003 3533727 3861919 4325066 4901279 5720050 6895543 8538942 10844824
16295 10844824 13869230 17685012 22122910 26885729 31964673 37509537 43427359 50230845
16287 50230845 58185468 65660302 71549651 75990751 77230036 76407942 76676666 77488615
16279 77488615 77579403 76889751 73548323 66441493 58804281 51906262 45818297 40917818
16271D0917818m308918m548284m534620m052921l384439k523405j782166j220701
16263A4562364r01088o71279n05644l33148k44662j55727q0135o1575l1573o4916
16253A1512617j37650k81068k92926j99499k06943k23100k86834m27708n33476
16244H923413n48127n52871m75302m02793l91667l95219l79315l68381l57589
16235E052149k92063k56519k40756j95687j57311j46031j41100j62045j29649
16226C330988q9020j02574r9444j00848o2462p1380q9074j06826o3947o4771p8289
16215B402353o3865l8691o1838o1695r7762q5547n7109n7579n3736n8784p4475
16204A691272n9996m6361n2670n8165o1509n4490n5496m1269j6556k8966l8877
$$ plain form
16271 40917818 36608900 32060616 27525996 23473075 20088636 17565231 15783065 14562364
16263 14562364 13661276 12989997 12484353 12151205 11906543 11750816 11670681 11609106 11577533 11512617
16253 11512617 11374967 11093899 10800973 10601474 10394531 10171431 9884597 9456889 8923413
16244 8923413 8375286 7822415 7347113 6944320 6552653 6157434 5778119 5409738 5052149
16235 5052149 4760086 4503567 4262811 4067124 3909813 3763782 3622682 3460637 3330988
16226 3330988 3241968 3139394 3039950 2939102 2876640 2805260 2716186 2609360 2545413 2480642 2402353
16215 2402353 2338488 2299797 2237959 2176264 2078502 1992955 1935846 1878267 1824531 1765747 1691272
16204 1691272 1631276 1584915 1532245 1474080 1412571 1358081 1302585 1261316 1244760 1215794 1176917
16193A176917m1890l6527k7097k342j1885L130k6161k2536m3139l3855k8267m2222
16181H64126m1566j8356k1170l2484n1631j3394j0068p452L689J48j1316O521
16169F67047l4024k4632k5151l2237M397q416k5311j5115K5807m401l7513k0767
16157D69684j7335K4288j5166o012M461j0309k0617j4032n23l6905l334J6654
16145C90854n694j2108k5296l3152l8248j7344k3633j1720m137n704J5026k295
16133B26549j415q083k9102m0068r405L644j8501k8189r027k100K86k1711l399
16120E9479Q755j156K6278P521P316n393l7348k4413j1442k503j5294O722J0376
16107B8898O620Q325R890L5861o578l3854K3186K8841K8547L5282k0406j3672
$$ plain form
16193 1176917 1135027 1098500 1071403 1069061 1057176 1060306 1034145 1011609 968470 934615 906348 864126
16181 864126 822560 804204 783034 750550 698919 685525 675457 668005 671694 671842 660526 667047
16169 667047 633023 608391 583240 551003 555400 546984 521673 506558 532365 527964 490451 469684
16157 469684 452349 476637 461471 455459 459920 449611 428994 414962 414439 377534 374200 390854
16145 390854 385160 373052 347756 314604 276356 259012 235379 223659 219522 213818 228844 226549
16133 226549 225134 217051 187949 147881 138476 142120 123619 95430 86403 84303 84589 62878 59479
16120 59479 68234 67078 93356 100877 108193 102800 65452 41039 29597 27094 11800 18522 28898
16107 28898 35518 43843 53733 89594 83016 49162 72348 101189 129736 165018 144612 130940
16095A30940L7558J9078j0179J9676k0877O282R226J022K039l8665p327J3210
16083A61983j2433k4964P795k2819j2318j9554K499k9300j1959j7889j6990K420
16071F471K1411J0468J4619r505m638j4105J3755J1449n821p649j1474j6630J3754
16058B2105K0243p218m747Q367J0162K6570r271p086n173k0719j0294j9305J803
16045E437J7753L2081J9753P666j4741P857O074j069m37k1647o353n190J3169
16032F0353j0104L145J7535l445m710l928O571l2694k9284O407N116p483K2740
16019C0219p820r320M91J42J4826k38j8517J9588P669R131Q856q225r417K005
16005C9390M859j6515P170Q104k9065k9479j4836K518J1046K0159k8229j0033
$$ plain form
16095 130940 168498 187576 177397 197073 176196 182478 191704 192726 194765 156100 148773 161983
16083 161983 149550 124586 132381 109562 97244 77690 80189 50889 38930 21041 4051 6471
16071 6471 27882 38350 52969 43464 38826 24721 38476 49925 44104 36455 24981 8351 22105
16058 22105 42348 35130 30383 38750 48912 75482 66211 59125 53952 33233 22939 3634 5437
16045 5437 23190 55271 75024 82690 67949 75806 81880 80811 80374 58727 52374 47184 60353
16032 60353 50249 53394 70929 67484 62774 58846 65417 32723 3439 9846 14962 7479 30219
16019 30219 22399 13079 13570 13712 28538 28300 9783 29371 37040 46171 55027 46802 37385 39390
16005 39390 44249 27734 34904 43008 13943 -15536 -30372 -27854 -16808 3351 -24878 -34911
15993c4911K1655K385l4166j511K607p50J9748P581j6286L99K4405K2330j0919
15980B567p761j5465k1051J1023K6835o637j3843K284j5393J9090J5384j2013
15968a4980j1498l847k6189J7952M2281k4208m0199k2207Q450J3605R225N041
15956d6574J2167K2685J5909j340k2054M555J3415k2544j3718Q089K5077o102
15944a0435j5480j9794K6212J8899J7644l6414k3972Q416L5912P777j4853j3612
15932a9700K4102j5266j2662j4139k0608j7666o877L695K8230J7668R591J1887
15920a1745N133j2798j4758r088N208j0271j049R619K4821K8744P114k8555J863
15907e762J7100j9944l8365J5593Q40J3264J2352j2681k6623q553O078J5062J3897
$$ plain form
15993 -34911 -13256 -10871 -45037 -46548 -43941 -44691 -24943 -17362 -33648 -33249 -8844 13486 2567
15980 2567 -5194 -20659 -41710 -30687 -3852 -10489 -24332 -22048 -37441 -18351 -2967 -14980
15968 -14980 -26478 -30325 -56514 -38562 3719 -20489 -60688 -82895 -74445 -60840 -51615 -46574
15956 -46574 -34407 -11722 4187 2847 -19207 -14652 -1237 -23781 -37499 -29410 -4333 -10435
15944 -10435 -25915 -45709 -19497 -598 17046 -19368 -43340 -34924 988 8765 -6088 -19700
15932 -19700 4402 -10864 -23526 -37665 -58273 -75939 -82816 -79121 -50891 -33223 -23632 -11745
15920 -11745 -6612 -19410 -34168 -43256 -38048 -48319 -49368 -39749 -14928 13816 20930 -7625 -5762
15907 -5762 11338 -8606 -46971 -31378 -30538 -17274 -4922 -17603 -44226 -52779 -46701 -31639 -17742
15894a7742j1378J5395k666j7312k2843J5524R722j2795j3619j0787p600Q353
15882f7748J2964J6651P572k127k3349j881k78J174j1574j5627J8951L7983p089
15869c4378j1512P273L4467K5342j0615k0264q14p227O320J828j2683K498j4356
15856c4121j0562L786K3591l817P217o81K150j4336k0975O098L4593N7031q442
15843D1532o3395r210J6195M895L5575J2078n138j8069l0836Q464k3784k5367
15831e7060o228J6024K3563Q945j4510J8851L2291J0867J0689j2373k8755O003
15819H307J9403R45o597k2473q757O671m785J2834J6262r411k8830P787j5244
15806b3888j9757J916K6570o354k6296k99J8418L744J6716o401k540j2509Q882
$$ plain form
15894 -17742 -29120 -13725 -16391 -33703 -56546 -41022 -31300 -44095 -57714 -68501 -76101 -67748
15882 -67748 -54784 -38133 -30561 -32688 -56037 -57918 -58196 -57022 -68596 -84223 -65272 -27289 -34378
15869 -34378 -45890 -38617 -4150 21192 10577 -9687 -10501 -17728 -11408 -9580 -22263 -19765 -34121
15856 -34121 -44683 -40897 -17306 -21123 -13906 -14587 -12437 -26773 -47748 -41650 -7057 49974 41532
15843 41532 -21863 -31073 -14878 -9983 25592 37670 32532 14463 -16373 -7909 -31693 -57060
15831 -57060 -63288 -47264 -23701 -14756 -29266 -10415 21876 32743 43432 31059 2304 8307
15819 8307 27710 28655 22058 -415 -9172 -2501 -7286 5548 21810 12399 -16431 -8644 -23888
15806 -23888 -43645 -41729 -15159 -21513 -47809 -48108 -29690 -25946 -9230 -15631 -18171 -30680 -21798
15793b1798L489Q241L5451j8787J0225K490k6709N471p601k139n731K350j4331
15780b9379J3444L6531j1361j2487r858k5434m556N016k496K0020N963O830j807
15767i574J4518l261j2120l5713j5134j1937M321M1086L1229K0458j7868j0297
15755d292J6318J66j5713J3505j131p60M1388M5424J8633J7201P230K5555L6382
15742A99906N5467L5989N1791J4024r585K8100R097j0035j2443J140j395m2125
15730C19931j5851j7603j5170l9524m8794k7064k8538j7487j5011l1775k3460
15719C9654k8559N672N679j6967N204J1528m507k6918j1346L6701N406k337p615
15706A1595j407M19j62p708j0278r92J4031j1147R305K9436j9154p124R658j6814
$$ plain form
15793 -21798 -18309 -10068 25383 6596 16821 19311 -7398 -1927 -9528 -11667 -17398 -15048 -29379
15780 -29379 -15935 20596 9235 -3252 -13110 -38544 -43100 -38084 -40580 -20560 -14597 -7767 -9574
15767 -9574 4944 1683 -10437 -46150 -61284 -73221 -68900 -27814 3415 23873 6005 -4292
15755 -4292 12026 12192 -3521 9984 8853 8093 49481 94905 113538 130739 137969 163524 199906
15742 199906 255373 291362 343153 357177 347592 375692 384789 374754 362311 363451 362056 319931
15730 319931 304080 286477 271307 231783 182989 155925 127387 109900 94889 63114 39654
15719 39654 11095 16767 22446 5479 10683 22211 17704 -9214 -20560 16141 21547 19210 11595
15706 11595 10188 10607 10445 2737 -7541 -8533 5498 -5649 3656 33092 13938 6814 16472 -342
15692c42O249j8017O744J7425j8716O821K9667j0344j5781J5635m552J6213j2712
15679A8290j2692j8455J8929l836j6032m85p124L230j7570l720K9639l213k3248
15666c6287n481l913p999L133o472J7024K5667J8133J3156l2050N942Q353o490
15653g284r125K835J5605M844k5163j1292j1477P274M712j7216n067K2801L2108
15640C555J2892j81j0337o866J3510n708L319M188m361N60j9239k7758j5131P526
15626d4031P854J12J7274M9k0175j238J2450N457k139L1272J0603j6868j3283
15613a2663j5188q237k5134J0054K9111O50j7664o638K7157K6498j129o783l268
15600c234m429k2719j6891K246l661N787J142q102Q755J5348L1294J6306j4350
$$ plain form
15692 -342 5907 -12110 -5366 12059 -6657 164 29831 19487 3706 19341 14789 31002 18290
15679 18290 5598 -12857 6072 2236 -13796 -14281 -21405 -18175 -35745 -39465 -9826 -13039 -36287
15666 -36287 -41768 -45681 -53680 -50547 -57019 -39995 -14328 3805 16961 -15089 -9147 -794 -7284
15653 -7284 -16409 -13574 2031 6875 -18288 -29580 -41057 -33783 -29071 -46287 -51354 -28553 3555
15640 3555 16447 16266 5929 -937 12573 6865 10184 14372 10011 10571 -8668 -36426 -51557 -44031
15626 -44031 -36177 -36065 -18791 -18742 -38917 -40155 -27705 -22248 -24387 6885 17488 620 -12663
15613 -12663 -27851 -36088 -61222 -51168 -22057 -21407 -39071 -45709 -18552 7946 6817 34 -3234
15600 -3234 -7663 -30382 -47273 -45027 -48688 -42901 -41759 -49861 -41106 -25758 5536 21842 7492
15587G492k7880j3870j2346J3211J1690K707l0249J9402K4820p809p978K510K6419
15574H119m804n0103k9605q408P814P474J6828K1712K4385K6883K0289l4659k3036
15561a7111J7897m482j0320P295p776k5005J7329K161k2912k0124q288l004J2158
15548f2182K6769K2223J0059J2751L543m3408K618R502l0568O646P685j0859O407
15535c8814K0476J7049j7305k0403M072K4290M605J9090O160q174p42J2215l95
15522B2124k9835j2512K1048p706P733N362j2399r51o342Q685j2027j4526O610
15509b4736k3096J9355k0747j5412J3850K7210L3176j3154k4031K558j0450K738
15497c2739J4863J9331K1083j3205j7586j3J2367n3446l9614QR549K1497K7880
$$ plain form
15587 7492 -20388 -34258 -46604 -33393 -21703 -18996 -49245 -29843 -5023 -12832 -20810 -18300 8119
15574 8119 3315 -46788 -76393 -84801 -76987 -69513 -52685 -30973 -6588 20295 40584 5925 -17111
15561 -17111 786 -3696 -14016 -6721 -14497 -39502 -22173 -20012 -42924 -63048 -71336 -74340 -62182
15548 -62182 -35413 -13190 -3131 9620 13163 -30245 -27627 -18125 -48693 -42047 -34362 -45221 -38814
15535 -38814 -18338 -1289 -18594 -38997 -34925 -10635 -6030 13060 19220 11046 10304 22519 22124
15522 22124 -7711 -20223 825 -6881 852 6214 -6185 -7136 -13478 -4793 -16820 -31346 -24736
15509 -24736 -47832 -28477 -49224 -64636 -50786 -23576 9600 -3554 -27585 -25027 -35477 -32739
15497 -32739 -17876 1455 22538 9333 -8253 -8266 4101 -49345 -88959 -88951 -79402 -57905 -30025
15484c0025J4027K0572j4863m0967j6703J9563K0227J0042j8176j6224J7334L5697
15472E04J6887m551k6318o610l654p791o472l262M889k4607j343n356K0106r510
15458e7088o514j1999j0536L562J5878j2294p89K6860j3798Q647j4075K0952K5286
15445b5908J0477J2833j9691j5289J224k473p697J3395M32J3475j5257k336j6636
15432e3451m246q591K1888L0751j5885Q933l58k809k567Q900J4075K385k5518
15419b6493j2781j6053P316L051J8356r829l1760N348J3139j7356L654J6710J075
15406d5623J6301J2701j6303n759O980j144J7735n245J2282l833j5637P852K5853
15393F160j0347k6390j3497R961J7529N010N801j610m095k3708L8168L8381j6786
$$ plain form
15484 -30025 -15998 4574 -10289 -51256 -67959 -48396 -28169 -18127 -36303 -52527 -35193 504
15472 504 17391 12840 -13478 -20088 -23742 -31533 -38005 -41267 -36378 -60985 -62328 -67684 -47578 -57088
15458 -57088 -63602 -75601 -86137 -82575 -66697 -78991 -79780 -52920 -66718 -58071 -72146 -51194 -25908
15445 -25908 -15431 -2598 -22289 -37578 -36354 -38827 -46524 -33129 -32697 -19222 -34479 -36815 -53451
15432 -53451 -57697 -66288 -44400 -13649 -29534 -20601 -20959 -23768 -26335 -17435 -3360 -975 -26493
15419 -26493 -39274 -55327 -48011 -44960 -26604 -36433 -68193 -62845 -49706 -67062 -63408 -46698 -45623
15406 -45623 -29322 -16621 -32924 -38683 -31703 -32847 -15112 -20357 -8075 -11908 -27545 -19693 6160
15393 6160 -4187 -30577 -44074 -34113 -16584 -11574 -5773 -7383 -11478 -35186 2982 41363 24577
15380B4577j2852j2554p142r342J3006j4300j1669k0389p685J4262Q022o237K1126
15367b1177P640R181J4764N309l3689R371K2189N620j1314k1662Q950o547j2759
15354b4124m7342N481L5434M32K8738K6953k6899k9509j4199J5056k5251K5Q452
15341d6753l007J2932P836K838o319N487J4928N683j5989k3927r965o9Q922K6194
15327b1209O58J0457J3684M74K3612K2250k7361k9706J9921K938j5826j3937J1161
15314b884L6972R490K2684Q383J5397L6950N257m8779k3720j3567o710j5062l0048
15301e637l3354K283M541J4349J484K876R371K003L421n735L992r960l62o27k1735
15286c3090J9189p492K850J1845J7415M0126j391q599R2k067r736r902o967p849
$$ plain form
15380 24577 11725 -829 -7971 -17313 -4307 -18607 -30276 -50665 -58350 -44088 -36066 -42303 -21177
15367 -21177 -13537 -4356 10408 15717 -17972 -8601 13588 19208 7894 -13768 -4818 -11365 -24124
15354 -24124 -71466 -65985 -30551 -30119 -1381 25572 -1327 -30836 -45035 -29979 -55230 -55205 -46753
15341 -46753 -49760 -36828 -28992 -26154 -32473 -26986 -12058 -6375 -22364 -46291 -56256 -56325 -47403 -21209
15327 -21209 -20551 -10094 3590 4064 27676 49926 22565 -7141 12780 15718 -108 -14045 -2884
15314 -2884 34088 43578 66262 74645 90042 126992 132249 83470 59750 46183 39473 24411 -5637
15301 -5637 -38991 -36708 -32167 -17818 -16334 -13458 -4087 -2084 1337 -4398 -406 -10366 -10728 -11355 -33090
15286 -33090 -13901 -21393 -18543 -6698 10717 50843 49452 40853 40945 38878 29142 19240 12273 4424
15272D424J062J7584K764q860j535j3470r969O809M566P442j7042l0813M943N878
15258b6217J9556J1064l2655j1500p993L1497L2239N825j7779J930J025k9508
15246b2516o596P541J3380R42l336K8867J6777N365j1015j8242k5066j4591l731
15233c2221K1312l190k7406l704j1205j7805K6311J8780k8945j2798M380J9965
15221d6526k3993P211l218L5447M482R595n724M1171N871k7656j6299J0876M681
15208d082k2822j2581j1849J1840M460K166Q704k1310J3303j4862O958P300n624
15195c8399J2974L342J2064j2996o038P417J3922J3254o115j1430j0528j610j084
15182b5227l1349p314K40L9665k347j1403m713J9402J7041K480j7967J454L63
$$ plain form
15272 4424 5486 23070 25834 16974 15439 1969 -8000 -1191 3375 10817 -6225 -37038 -32095 -26217
15258 -26217 -6661 4403 -28252 -39752 -47745 -16248 15991 21816 4037 5967 6992 -22516
15246 -22516 -29112 -21571 -8191 -7249 -10585 18282 35059 40424 29409 11167 -13899 -28490 -32221
15233 -32221 -10909 -14099 -41505 -45209 -56414 -74219 -47908 -29128 -58073 -70871 -66491 -46526
15221 -46526 -70519 -63308 -66526 -31079 -26597 -17002 -22726 18445 24316 -3340 -19639 -8763 -4082
15208 -4082 -26904 -39485 -51334 -39494 -35034 -32868 -24164 -45474 -32171 -47033 -40075 -32775 -38399
15195 -38399 -25425 -22083 -10019 -23015 -29053 -21636 -7714 5540 -575 -12005 -22533 -24143 -25227
15182 -25227 -56576 -63890 -63650 -23985 -26332 -37735 -42448 -23046 -6005 -3525 -21492 -20038 -19675
15169a9675q854l1210J1605n505j2817k4154K1617K5178K0349M808m317J787O994
15156a4194J5286j9958J304k0550j4878M2915J6625J210k7151j2910m280J6190
15144b0391Q193L307M605j0141j991R877Q000L208l5640k6495O72J4873r094m293
15130e5310L6189l627m3883j0541L24o074K0899J2139o315J5010J730J3040k918
15117b9337q336j5861j1688N331L4479K1757M73M666l6979l5884j1002K0368O568
15104e5445K0085N940l2477J0294Q337K4631J472j2398n2772O749M4960P963m447
15091b7108L2248J2197J3403l4276l8007L246J0632O275k7655O242J351q723L0467
15078a9708N6761j5168k2249j2943J7290l013p919K0444q164k0206P81J8001q475
$$ plain form
15169 -19675 -28529 -59739 -48134 -53639 -66456 -90610 -68993 -43815 -23466 -18658 -22975 -21188 -14194
15156 -14194 1092 -18866 -17562 -38112 -52990 -10075 6550 7760 -19391 -32301 -36581 -20391
15144 -20391 -12198 -8891 -4286 -14427 -16418 -6541 1459 4667 -30973 -57468 -56796 -41923 -51017 -55310
15130 -55310 -19121 -22748 -66631 -77172 -76848 -82922 -62023 -49884 -56199 -41189 -39459 -26419 -29337
15117 -29337 -37673 -53534 -65222 -59891 -25412 -3655 -3182 1484 -35495 -71379 -82381 -62013 -55445
15104 -55445 -35360 -29420 -61897 -51603 -43266 -18635 -17163 -29561 -82333 -75584 -30624 -22661 -27108
15091 -27108 5140 17337 30740 -3536 -41543 -38297 -27665 -21390 -49045 -42803 -41452 -50175 -19708
15078 -19708 37053 21885 -364 -13307 3983 970 -6949 13495 5331 -14875 -14094 3907 -4568
15065d568n3j5901j2089K4568J5654j7124J168j426J2361p577P827J3836l690
15052A2986r328J535n117k2204m1667K5536J2432k9254k2826J7079P084J1976
15040d1768J5886N436J834K723Q695M266Q11Q077L252j1884k0019R71L875m954
15026b2799j1142K08N666J3842r750M039J2653k6356J2087o197K591J7532K1580
15013A3954Q563J0354K239k367j4510j6518n477Q364K4657n785n216j6137j9729
15000a7608r613K0448J3833J265n491J9120k149K927J4093m2919j7642P604J0445
14987e687O466k573j6967j6919J5854L5563j721l68J0882l0125k157J8115P203
14974A7566P458p239K681M738k6126j6666K736Q375K562J1296K3528K21j9073
$$ plain form
15065 -4568 -4621 -20522 -32611 -8043 7611 -9513 -8345 -9771 2590 -4987 2840 16676 12986
15052 12986 3658 5193 76 -22128 -63795 -38259 -25827 -55081 -77907 -60828 -53744 -41768
15040 -41768 -25882 -20446 -18612 -15889 -7194 -2928 -2117 5960 9212 -2672 -22691 -21720 -17845 -22799
15026 -22799 -33941 -33733 -28067 -14225 -23975 -19936 -7283 -33639 -21552 -27749 -25158 -7626 13954
15013 13954 22517 32871 35110 32743 18233 1715 -3762 4602 29259 23474 18258 2121 -17608
15000 -17608 -27221 -6773 7060 8325 2834 21954 19805 22732 36825 -6094 -23736 -16132 -5687
14987 -5687 779 -1794 -18761 -35680 -19826 15737 14016 13648 24530 -5595 -7752 10363 17566
14974 17566 25024 17785 20466 25204 -922 -17588 -14852 -6477 -3915 7381 30909 31130 12057
14961A2057P449n961j4866k4230j5525k9756L4134K1040J6373k0127m047J5851
14949g608K3437q712l7090j3103K1925L7489J0249j9688R945r465j6430J0395
14937A344j4923k2568j1540K0131K2705l155j5699p872J2969N629l378J0245L3252
14924B7140j1971m6262J173j832J2512L707n512K105n248K2892l598j8733k0491
14911d4118j6735J5019K8746K6934P816k8394m290J2598o232q627j611J1058J0261
14898B425J068O411j4793J0613K7312q563m6763M597K866K3623K573N252k0961
14885d340o919N038o9p501M635Q431j0025M174q156R515P552J9108J8805K4610
14871F4858m771j1095j4148j1446j5631k020o551M732J6956j1903j7910k829K4268
$$ plain form
14961 12057 19506 13545 -1321 -25551 -41076 -70832 -36698 -15658 715 -19412 -23459 -7608
14949 -7608 15829 7117 -29973 -43076 -21151 16338 26587 6899 16844 7379 -9051 1344
14937 1344 -13579 -36147 -47687 -27556 -4851 -8006 -23705 -31577 -18608 -12979 -16357 -6112 27140
14924 27140 15169 -31093 -29920 -31752 -19240 -15533 -21045 -18940 -24188 -1296 -4894 -23627 -44118
14911 -44118 -60853 -45834 -17088 9846 17662 -10732 -15022 -2424 -8656 -17283 -18894 -7836 2425
14898 2425 3493 9904 -4889 5724 33036 24473 -22290 -17693 -14827 8796 11369 16621 -4340
14885 -4340 -11259 -6221 -6290 -13791 -9156 -725 -10750 -6576 -14732 -5217 2335 21443 40248 64858
14871 64858 60087 48992 34844 23398 7767 5747 -804 3928 20884 8981 -8929 -11758 12510
14858A2510J9597j7428r384n37p877n842J1247K1473r161k0846k3929p345j3059
14845e0581J4979M2741P136l3535j9892R361K3897Q825m272J1362r094l9149O395
14832c1827n962j0810j0992J8714K7744M483l565O946K6142L1001J5167j9810
14820D7231n572k8881l6084N307J8858j1313j4931j7633P299K0679N142N775r026
14807a3149j2459K1073L8329J6376J4522K763k5569l7685R066K0224j4150k4532
14795e191k1128k637K1446J6232q821p930o275j3691L77l4O134J6794j7952l991
14781b6667J8553J7250M1638L1361j2980k0538P042l2655K005Q294l3363m1395
14769d1455J393K8025M1362j8871k8070o71l675K626J1884O509j50L900J5418
$$ plain form
14858 12510 32107 14679 5295 4758 -3119 -8961 2286 23759 14598 -6248 -30177 -37522 -50581
14845 -50581 -35602 7139 14275 -19260 -39152 -29791 -5894 2931 -1341 10021 927 -38222 -31827
14832 -31827 -37789 -48599 -59591 -40877 -13133 -8650 -12215 -5269 20873 51874 67041 47231
14820 47231 41659 12778 -23306 -17999 859 -10454 -25385 -43018 -35719 -15040 -9898 -4123 -13149
14807 -13149 -25608 -4535 33794 50170 64692 67455 41886 4201 13267 33491 19341 -5191
14795 -5191 -26319 -28956 -7510 8722 -99 -8029 -14304 -27995 -27618 -27652 -21518 -4724 -22676 -26667
14781 -26667 -8114 9136 50774 82135 69155 48617 55659 23004 25009 33303 -60 -41455
14769 -41455 -40062 -12037 29325 10454 -17616 -18287 -21962 -19336 -7452 -943 -1093 2807 18225
14756A8225k5592k2434L895K4641Q04L3597q218l6875j9958j2166Q887J576k858
14743c6476N621N177J4898j600n050k468J8064J8633j1230k0058j2325K1994N129
14730C09l082O85K712j1309l1883j3389J2150J7424J5397o376J5503R667j0202
14717b394Q948j8577n440L057j2559n507k2915J0813O428J092K7061J6247J4535
14704B0789m509j6988j5534j2247M844J3979J6492J8948j6211k6615m642j1656
14692c3350L525n891K9960L5967J7132m525P818m1271k5303J5387K2835L285l612
14679B1957j5951n097L2428J3345P911l0221j6473O087m669k1850j3114j0330
14667c5977j8958n462K1836K2712M7051K5825m7098m4656r173J9386L7278J1614
$$ plain form
14756 18225 -7367 -29801 -25906 -1265 -461 33136 24918 -11957 -31915 -44081 -35194 -33618 -36476
14743 -36476 -30855 -25678 -10780 -12380 -17430 -19898 -1834 16799 5569 -14489 -26814 -4820 309
14730 309 -2773 -2088 624 -10685 -42568 -55957 -43807 -26383 -10986 -17362 -1859 7808 -2394
14717 -2394 6554 -12023 -17463 -14406 -26965 -32472 -55387 -44574 -38146 -37054 -9993 6254 20789
14704 20789 16280 -708 -16242 -28489 -23645 -9666 6826 25774 9563 -17052 -21694 -33350
14692 -33350 -29825 -35716 -5756 30211 47343 42818 50636 9365 -15938 -551 22284 25569 21957
14679 21957 6006 909 33337 46682 54593 24372 7899 13986 9317 -12533 -25647 -35977
14667 -35977 -54935 -60397 -38561 -15849 31202 57027 9929 -34727 -43900 -24514 12764 24378
14655B4378j4446j2660j8749q056r992J1085P276J77J210q059j2724r089J66O325
14641d3158J2877J4245k76O491Q065J5217j3833R356j1959R854K167j3185n186
14628i325N177R210k634Q991m05r493L373L911j2415k7825j0297oK5265l686K9298
14613I139J8690m695K959j2506Q691n156r902K0206j657m272k4927j7703K1072
14600f1K213l0037j1J203K6286l518k192j6891l342p41K8547L566J4159J8554
14586C7735n17r246k0929k529L7456j8850k5200K346M623m295n842N502K5506
14573B5760K2722m859r431j9753l5504k4115J0696J5286J9825L1559m373O2q637
14560A9238n0554J2816K125L062J5082k7899k0530K8198R200K9436N211p253j2130
$$ plain form
14655 24378 9932 -2728 -21477 -29533 -39525 -28440 -21164 -20987 -19777 -27836 -40560 -49649 -49483 -43158
14641 -43158 -30281 -16036 -16312 -9821 -1756 13461 -372 8984 -2975 6879 9046 -4139 -9325
14628 -9325 -4148 5062 2428 11419 11014 1521 4894 8805 -3610 -31435 -41732 -41738 -16473 -20159 9139
14613 9139 27829 23134 26093 13587 22278 17122 7220 27426 25769 21497 -3430 -21133 -61
14600 -61 2152 -27885 -27896 -26693 -407 -3925 -6117 -23008 -26350 -27091 1456 5022 19181 37735
14586 37735 37218 27972 7043 4514 41970 23120 -2080 266 4889 594 -5248 254 25760
14573 25760 48482 43623 34192 14439 -21065 -45180 -34484 -19198 627 32186 27813 27875 19238
14560 19238 -31316 -18500 -16375 -13313 1769 -26130 -46660 -18462 -9262 20174 25385 18132 6002
14547F002J7220J2689K4550J439L915k7126q686P13k9247l3440m3938L926J7342
14534e4641L3320J7295K082J2500L550p447K5051j5843r398J037J07j0182Q671
14521F102L2037L5246k7274o0557j5216J1485q41k4867k0916j3950l104J9622
14509f2233L5643J1766j7653J0854k103R845j4092j3848L0502M552j9100J5460
14497a0407J2561o974K905j0077j5526J2193j2633J9308M9138l3620q375k895
14485d402J668L2275j4857l2915l4578J0015J8811p182O17J2666J1055K556l9889
14472d4160J7524K9440R837j6078p828k419k091K485k1667j4432j8781J6992K0284
14459c0894J1575o593L604n80j2709J0119k484q137J2973Q755K0786L325j2786
$$ plain form
14547 6002 23222 35911 60461 61900 65815 38689 30003 30716 1469 -31971 -75909 -71983 -54641
14534 -54641 -21321 -4026 -1944 10556 14106 6659 31710 15867 6469 7506 7613 -2569 6102
14521 6102 38139 73385 46111 -14446 -29662 -18177 -19018 -43885 -64801 -78751 -81855 -62233
14509 -62233 -26590 -14824 -32477 -21623 -23726 -13881 -27973 -41821 -11319 -6767 -25867 -10407
14497 -10407 2154 -4820 -1915 -11992 -27518 -15325 -27958 -8650 40488 6868 -1507 -4402
14485 -4402 -2734 29541 14684 -18231 -52809 -42794 -23983 -31165 -30548 -17882 -6827 -4271 -44160
14472 -44160 -26636 2804 12641 -3437 -11265 -13684 -15775 -13290 -34957 -49389 -68170 -51178 -30894
14459 -30894 -19319 -25912 -22308 -22888 -35597 -25478 -27962 -36099 -23126 -14371 6415 9740 -3046
14446c046Q359n070J1402K349J8944K1913q903j8734k7238j5779J8345q355K426
14433c387o200o608j554K6704j1135k4719J0177J9824M729k4786M48R919L3427
14420B6839k325k4388k4946K3362K4461J4305k3770k5738K2903L0648j0207m3256
14408a2112O772J4818Q539l0732j3794j2478p501J5462j469r443J3761J0404J999
14395a5774r213P470j2918j9014j3251Q985J5855N449J2931n069J14P372L4373
14382A7310J8343K5104k6010k8292k90Q086o461M796K1817J4500n719k0886j4985
14369G313r74j1207J6782j3313j5210P255Q70J763J6286n416K2809M438j9412
14356A1984K1047q067r263k8302l0946n729K5173J5421r207k5133J7458K5005
$$ plain form
14446 -3046 5313 243 11645 13994 32938 54851 45948 27214 -24 -15803 2542 -5813 -3387
14433 -3387 -9587 -16195 -17749 8955 -2180 -26899 -16722 3102 7831 -16955 -16507 -6588 26839
14420 26839 24514 126 -24820 -1458 23003 37308 13538 -12200 10703 41351 31144 -12112
14408 -12112 -5340 9478 18017 -12715 -26509 -38987 -46488 -31026 -32495 -41938 -28177 -17773 -15774
14395 -15774 -24987 -17517 -30435 -49449 -62700 -53715 -37860 -32411 -19480 -24549 -24435 -17063 17310
14382 17310 35653 60757 34747 6455 6165 14251 7790 12586 34403 48903 43184 22298 7313
14369 7313 6339 -4868 11914 -1399 -16609 -9354 -8484 -6721 9565 4149 26958 31396 11984
14356 11984 33031 24964 15701 -12601 -43547 -49276 -24103 -8682 -17889 -43022 -25564 -559
14344e59K3670K4007l039k7066j7779R247J0721j6334k7586k900k236L0510K2619
14331B3275J6387R061j5982k2501l563K3553M067q236k5834m7190k5965J3765
14319e9163J5703J7614L1445J0961M863r985k1867J6367k910N19r682P358M205
14306E428j9773m957j1377R113J4694j4539O456K1364k6938l918L9531K9485m834
14293C9735l2232K5455R071p872K6360l7758j1708J4110l106k7223k3211K5933
14281b446j8631N493J7400J2925O688k1630m819p360J0279j1267J9029r770p407
14268a1516j6309O173M622P798P422k24Q376j0667k2131j3827O670K0493J9963
14255F843N149j5297r291n706o002Q677Q759j2349P675K6649J3126K6828L588
$$ plain form
14344 -559 23111 47118 44079 17013 -766 8481 19202 2868 -24718 -27618 -29854 656 23275
14331 23275 39662 48723 32741 10240 6677 30230 34297 26061 227 -46963 -72928 -59163
14319 -59163 -43460 -25846 5599 16560 21423 11438 -10429 5938 3028 3547 -6135 1223 5428
14306 5428 -14345 -19302 -30679 -21566 -6872 -21411 -14955 6409 -20529 -24447 15084 44569 39735
14293 39735 7503 32958 42029 34157 60517 22759 11051 25161 22055 -5168 -28379 -2446
14281 -2446 -21077 -15584 1816 14741 21429 -201 -5020 -12380 -2101 -13368 5661 -4109 -11516
14268 -11516 -27825 -21652 -17030 -9232 -1810 -2034 6342 -4325 -26456 -40283 -33613 -13120 6843
14255 6843 11992 -3305 -12596 -18302 -24304 -15627 -6868 -19217 -11542 15107 28233 55061 58649
14242E8649j3233k0636r15J3555Q069j6082j8739k3649J6609O230j6572m522P457
14229c779l566K1668K3583r189q782l6930l0674j7123l536M1221K38K473L7976
14216A3580K0384j7156l1331L643K3410J4574J0423q402j5175N631k232o140p113
14203D096j1093J3581K528R043j0660L877J5635R300J809p087j3281j3414j7654
14190a3320Q571N2029J0389L242j9420m591j6492j2894n697K1462o357m9963l0475
14177f3516o820O049K0469K3902L0979K3680J7435M015P19N258j1145j2756j0086
14164B8183N652L7002l76k1071k6359q916J30J0753K1115k8745k3112P417K6558
14151B8231j0249j1189m072l99Q821M1326L8844J5340J9469j4734l7583m1611
$$ plain form
14242 58649 45416 24780 23865 37420 45489 29407 10668 -12981 3628 9858 -6714 -11236 -3779
14229 -3779 -7345 14323 37906 28717 19935 -16995 -47669 -64792 -68328 -27107 -26869 -24396 13580
14216 13580 33964 16808 -14523 -10880 12530 27104 37527 29125 13950 19581 17349 11209 4096
14203 4096 -6997 6584 9112 18155 7495 11372 27007 36307 38116 31029 17748 4334 -13320
14190 -13320 -4749 47280 57669 60911 41491 36900 20408 7514 1817 23279 16922 -33041 -63516
14177 -63516 -70336 -64287 -43818 -19916 11063 34743 52178 56193 56912 62170 51025 38269 28183
14164 28183 33835 70837 70461 49390 23031 14115 14245 24998 46113 17368 -5744 1673 28231
14151 28231 17982 6793 2721 2322 11143 52469 91313 106653 126122 111388 73805 32194
14139C2194k3240k954J9795k1851m02M7134j247l4936K317O961L754j6114O857
14126A8268j0829l678K6561L5704p530q709J8575j2570l5571k5482o812p269M374
14113a4968J0880p763j5995k7858Q40L8189L9158J3693r378o040J0591m883J8022
14100D4488j2178k2247J6878j6720J7577o390j0285K070j799j2964k2609Q874
14088a5305K9263R415j2487O131J2347k047m587k1001j7308J7392j0209L4897
14076B6501K9944o333m8489k0267J6779K6826K4787J6479l9008m5831M117K546
14064a1949o216K9559J8558K0059k0497r123L9053l890l9096j03K1377K818j6817
14051B3733j0284j6744m813k072L3045J1297j9966j9931P200N707O303N7M7632
$$ plain form
14139 32194 8954 6000 25795 3944 3542 50676 49429 14493 16810 23771 27525 11411 18268
14126 18268 7439 3761 30322 66026 58496 49787 68362 55792 20221 -5261 -12073 -19342 -14968
14113 -14968 -4088 -11851 -27846 -55704 -54864 -16675 22483 36176 26798 20758 31349 26466 44488
14100 44488 32310 10063 26941 10221 27798 21408 11123 13193 11394 -1570 -24179 -15305
14088 -15305 13958 23373 10886 17017 29364 27317 22730 1729 -15579 1813 -8396 26501
14076 26501 56445 50112 1623 -18644 -1865 24961 49748 66227 27219 -18612 -14495 -11949
14064 -11949 -18165 11394 29952 50011 29514 20391 59444 55554 16458 16355 37732 40550 23733
14051 23733 13449 -3295 -8108 -10180 22865 34162 14196 -5735 1465 7172 13475 13532 61164
14038F1164M301j3307o104l533J1631k5507n023O382J4427r086j0711K0849K5487
14025G0970l308N140m4k1796j0160J0657K151J9451K8364j4837l9648j3963J6503
14012D9480Q304N350J0938J1058N032R891%Q351M3411L9612M9902L9016M8889
13999C29234N0147P0225J6925L9893Q0336Q2560J75840K67787M06571O20128Q62244
13988C001890J057768J125614R41953M59712j73018o96750j051015j143576r36554
13979B586024o59617m14436k50366j70655j12030p3716r0706l2592k4961l0285
13969G26660l9427o6994l3747q4962l9344k0067k5900k3569k2555k5692k058j958
13957C40387Q417J547l6230k3755k841m416j3271j2257J1294j6834K709l4174
$$ plain form
14038 61164 65465 52158 46054 42521 54152 28645 23622 30004 44431 35345 24634 45483 70970
14025 70970 67662 72802 72758 50962 40802 51459 53610 73061 101425 86588 46940 32977 49480
14012 49480 57784 63134 74072 85130 90162 100053 100053 108404 151815 191427 241329 280345 329234
13999 329234 379381 449606 466531 506424 586760 669320 845160 1112947 1519518 2139646 3001890
13988 3001890 4059658 5185272 6127225 6586937 6413919 5717169 4666154 3522578 2586024
13979 2586024 1926407 1511971 1261605 1090950 978920 905204 814498 781906 756945 726660
13969 726660 687233 620239 586492 501530 462186 442119 416219 392650 370095 344403 342345 340387
13957 340387 348804 350351 314121 290366 287525 283109 269838 257581 268875 252041 254750 220576
13945B20576l6230p042m965M436K6958j9651J370p252k4767j6733k2854q643J3674
13932A18877P911J1853m531k3479j7943P745l255j8291J6959J4835j5473o77M018
13919I8549k1151l2935J9728K5883j745K412P535n206J8192R124o856n884k4054
13906H3592j7831k2811j7443m244L268K2691o96M530J275J1745o141L0765Q76
13893H9576j1081j4924j9706m164p178N694j5094n665j1872J6366K0973K0980
13881F3905n865j7018K0457r638l9418J8784k2718j3116J2753M793J6802J5288
13869D5009K3739M1623k7687l3334J0696k7594k3942L2503J5563J2930o006l1250
13857C2250k6714k3194J9541K8229N885r41q588O326j5251k3064o42J2037J3666
$$ plain form
13945 220576 184346 177304 172339 176775 203733 184082 185452 178200 153433 136700 113846 105203 118877
13932 118877 126788 138641 134110 110631 92688 100433 97178 78887 95846 110681 95208 94531 98549
13919 98549 77398 44463 64191 90074 88329 90741 98276 93070 111262 120386 113530 107646 83592
13906 83592 65761 42950 25507 21263 24531 47222 46526 51056 52331 64076 57935 88700 89576
13893 89576 78495 63571 43865 39701 32523 38217 23123 17458 5586 21952 42925 63905
13881 63905 58040 41022 61479 51841 12423 31207 8489 -4627 8126 12919 29721 45009
13869 45009 68748 110371 82684 49350 60046 32452 8510 41013 56576 69506 63500 32250
13857 32250 5536 -17658 1883 30112 35997 35056 26468 32794 17543 -5521 -6163 5874 19540
13844A9540K8585k0775o634N913M5m172j8348Q30k3697J9909J6583J583M705K9922
13830E3989M931j0248O692J3402k3034K498K3388J1698q569k5295j3005j8987
13818A7460J9413K517j6452k0954j3324L5995L3667k2351j8184r797k288N139
13806A0841n819K3676K282j6457l733J1588K6352k432L621l3889q446J7869N219
13793C0672j0028P620j2731k4251J293l794p217k4919L3978J5008J2049M4930
13781F2610k4225j2170R646j0479j5203J1381N625q325m366l9601k6589J9815
13769c1881K688O604K1762j2439r047L0846J636K301j2937l748p584K2904M1410
13756E2515j404q929j4787n643j5257j7081P298L4095r059j4884Q279J3134j3
$$ plain form
13844 19540 48125 27350 20716 26629 26674 22502 4154 4984 -18713 1196 17779 19362 24067 53989
13830 53989 58920 48672 55364 68766 45732 48230 71618 83316 74747 49452 36447 17460
13818 17460 36873 39390 22938 1984 -11340 24655 58322 35971 17787 7990 5702 10841
13806 10841 5022 28698 30980 14523 10790 22378 48730 46298 49919 16030 7584 25453 30672
13793 30672 20644 28264 15533 -8718 -7425 -11219 -18436 -43355 -9377 5631 17680 62610
13781 62610 38385 26215 35861 25382 10179 21560 27185 18860 14494 -25107 -51696 -31881
13769 -31881 -29193 -22589 -827 -13266 -22313 8533 10169 12470 -467 -4215 -11799 11105 52515
13756 52515 51111 42182 27395 21752 6495 -10586 -3288 30807 21748 6864 15143 28277 28264
13743B8264K2912j0553k4484P666J1115P378J2173k9295q86R623j0326l1974j4352
13730b2739J1848J6148K8723q692n1531j1345J9871K7879J4387j0625k4580r607
13718b0263J5969J2289l8395k1135J2263L8632R58J7102j2645k6677R924J6561
13706D583K5497m450O945q22R493o821j2217k5678J914J1209r277J1175j609l1192
13692b1250K1467M6675k7432j4153n006J0079J0582K895k5458k811m436P246N372
13679C770m467P012N697Q319q441Q632L539J4768l0310k5870K3310K7284J6406
13666D9649k914n955k6956K5320P072l4060l4243J4864k416J403o041j0883K2179
13653b981J5559O919j026j9852L768K1698Q900p631o645k8460k3487j770O070
$$ plain form
13743 28264 51176 40623 16139 23805 34920 42298 54471 25176 24290 33913 23587 -8387 -22739
13730 -22739 -10891 5257 33980 25288 -26243 -37588 -17717 10162 24549 13924 -10656 -20263
13718 -20263 -4294 7995 -30400 -51535 -39272 -640 318 17420 4775 -21902 -11978 4583
13706 4583 30080 25630 32575 31753 41246 34425 22208 -3470 -1556 9653 376 11551 9942 -21250
13692 -21250 217 46892 19460 5307 301 10380 20962 23857 -1601 -4412 -8848 -1602 3770
13679 3770 -697 6315 12012 20331 11890 20522 24061 38829 8519 -17351 5959 33243 49649
13666 49649 46735 40780 13824 39144 46216 12156 -22087 -7223 -9639 -8236 -14277 -25160 -2981
13653 -2981 12578 19497 18471 -1381 2387 24085 32985 25354 18709 -9751 -33238 -35008 -28938
13640b8938q828M551J3043K8941K6573O64j1241j1801k6585n184R680K6600M758
13627B2233m1091n644J2916R516l1998Q575O5875K4284j4907o267K0181J2870
13615G6543Q878j2470O259K465k1503j6674q008j2317O090Q882J2087N200k7205
13602B8227j0436k844j8046n550J2534J5535P003m566o09K5687N965R632j9044
13589D3488p213P434n68Q025L162J075j0190j0646q87r773M304J5994L948j4331
13575C3822p591l0215n463K902j1703M315J6633L5932n149o937J8838j7648k1404
13562F332L8794j8099j2430J2098k438l2811K2315N1065j9377j2802k4109o000
13550B538O058J2918p453k1479J2318K6357l970o738j2130j0105M178J1855M139
$$ plain form
13640 -28938 -37766 -33215 -20172 8769 35342 36006 24765 12964 -13621 -18805 -9125 17475 22233
13627 22233 -18858 -24502 -11586 -2070 -34068 -25493 40382 64666 49759 43492 63673 76543
13615 76543 85421 72951 79210 81675 60172 43498 35490 23173 29263 38145 50232 55432 28227
13602 28227 17791 14947 -3099 -8649 3885 19420 26423 21857 21248 46935 52900 62532 43488
13589 43488 36275 43709 43141 51166 54328 55403 45213 34567 33680 23907 28211 44205 48153 33822
13575 33822 26231 -3984 -9447 -6545 -18248 -13933 2700 38632 33483 26546 45384 27736 6332
13562 6332 45126 27027 14597 26695 24257 -8554 13761 64826 45449 32647 8538 2538
13550 2538 8596 21514 14061 -7418 4900 31257 27287 20549 8419 -1686 2492 14347 18486
13537A8486J5554J1080O948Q745q03j9909j34P703Q259p664J4394J7382j6434
13524F3607j0944n744l568j723j7324J441Q209J417j1634l195K3247J4537n968
13511E2358L413j8038j5927n611K7151l085k6498q011j1388q886R129n84K0824
13498A4847M245J4385J1764j6891o789J8315j1471j866l0801k2613K6258L0266
13486B9649J9399J2581J0629j2179k3815n735J2443n429j2368L938L7264J803
13474F8180l7168k1459M448O233J8998K95l3049Q605N332L3523k2815k589P72
13461B9306J1434M362j2741M020l67L731k1247j2047R712P530J3936K4233K9370
13448I1232q308k0919j9851j6792l835q820k123R142J2614J3688J911M312K7825
$$ plain form
13537 18486 34040 45120 52068 60813 60010 40101 39967 47670 55929 48265 62659 80041 63607
13524 63607 52663 46919 43351 41628 24304 25745 33954 35371 23737 20542 43789 58326 52358
13511 52358 55771 37733 21806 16195 43346 40261 13763 5752 -5636 -14522 -5393 -5977 14847
13498 14847 19092 33477 45241 28350 21561 39876 28405 26539 -4262 -26875 -617 29649
13486 29649 49048 61629 72258 60079 36264 30529 42972 37543 25175 29113 66377 68180
13474 68180 31012 9553 14001 20234 39232 39527 6478 15083 20415 53938 31123 28534 29306
13461 29306 40740 45102 32361 36381 36014 39745 18498 6451 16163 23693 37629 61862 91232
13448 91232 82924 62005 42154 25362 21527 12707 10584 19726 32340 46028 47939 52251 80076
13435H0076k312m1233n895O697j815M200j5140J8666K3526p447q657j8357R146
13422D1455o821l0382j6798k560k039n288J9428J4222R597O571J8584K785q782
13409C9972j1171O738j475k0043R03L599J6280L0365J0367l815k4457j6167k5056
13396F040l519L223J3380n213m75j100J0955P262J4278q241l4668J6372K6229
13383D4523K8910n95m1248Q578q218k905p409j7237j186K1002K3776n244j9623
13370B3124k1499J6145Q036q619r406j6630N331J3881K4856j5776j4223q812k662
13357f254o965K2290J7797K344k1701j0041K1488K55k6350K3242J8603L198K5085
13344F2991M621m3866l2651J7979J9703J6134L5k2883k6675k3134M735j942Q195
$$ plain form
13435 80076 77764 36531 30636 37333 35518 39718 24578 43244 66770 59323 50666 32309 41455
13422 41455 34634 4252 -12546 -15106 -17145 -22433 -3005 11217 20814 27385 45969 48754 39972
13409 39972 28801 35539 34064 14021 14924 18523 34803 65168 75535 71720 47263 31096 6040
13396 6040 2521 5744 19124 13911 13436 12336 23291 30553 44831 36590 1922 18294 44523
13383 44523 73433 72838 31590 40168 31950 29045 21636 4399 3213 24215 47991 42747 23124
13370 23124 1625 17770 25806 17187 7781 -8849 -3518 10363 35219 19443 5220 -3592 -6254
13357 -6254 -13219 9071 26868 29212 7511 -2530 18958 19213 -7137 16105 34708 37906 62991
13344 62991 67612 23746 -8905 9074 28777 44911 44946 22063 -4612 -27746 -23011 -24953 -16758
13331a6758M0847j4681j966Q109O390o329k1366O372L1377q541j5926j4875k1001
13318b8348L4076K5576L854j4745R567K3349M133n075j8778j4886K791R345J0987
13305D1846J7410K600k0111l2126j4477j294j5480q76J7739K250p98n812M195
13292d934J3732Q39j3839j8415K3598J2106J3684M258j0766K247J6318J6342k0939
13279C4231l7447r315q199P558J4545L2869k1083k9469Q645Q42J7036K628J9881
13266C2722J1601J3096J2125n554J1519p580l391j8952k4392j0055J4067j0477
13254A4729R969Q812K4885k2527l9821L3193N638j7868j2057j2373P1J0029J2340
13241A5020j0275o664j7434J0166Q225M763k993Q021O639p974o713j2617J0399
$$ plain form
13331 -16758 24089 9408 7442 15551 21941 15612 -5754 618 31995 23454 7528 -7347 -28348
13318 -28348 5728 31304 35158 20413 29980 53329 57462 52387 33609 18723 21514 30859 41846
13305 41846 59256 61856 41745 9619 -4858 -6152 -21632 -22508 -4769 -2519 -3317 -9129 -4934
13292 -4934 8798 9637 -4202 -22617 981 13087 26771 31029 20263 22510 38828 55170 34231
13279 34231 -3216 -12531 -20730 -13172 1373 34242 13159 -16310 -7665 -6823 10213 12841 32722
13266 32722 44323 57419 69544 63990 75509 67929 64538 45586 21194 11139 25206 14729
13254 14729 24698 33510 58395 35868 -3953 29240 34878 17010 4953 -7420 -7349 2680 15020
13241 15020 4745 -1919 -19353 -9187 -962 3801 808 8829 15468 7494 781 -11836 -1437
13228a437J7003K9633q208p697J2377j119j3903l5459K1454p165Q73O274K3242
13215C5868K5584j1014J7947K5418k1932j5384J9522J8110k3799J2678J3123p871
13203H8250j6550j3591j8840Q021K430j5802p809j2447j9620J5230K1523J5417
13191D6212J8223k9142l212K3474m819p088O42K4171J4343K2589j9966k365j0160
13178G2902j0373j3235J3353k7931k0642n273P979J9374J3721R492N565K894J5560
13165H3386j0580k5934k9051J8373L2666j595l639P179j4187J532K894j002K5467
13152H5509m123l9706p050l394P169L4984M325l5476j8644Q732Q489J8569P259
13139F6643q84n020n504j0300j351j4472K255K5421R912r319j1049N474k651p389
$$ plain form
13228 -1437 15566 45199 36991 29294 41671 40552 26649 -8810 12644 5479 6352 12626 35868
13215 35868 61452 50438 68385 93803 71871 56487 76009 94119 70320 82998 96121 88250
13203 88250 71700 58109 39269 47290 49720 33918 26109 13662 -5958 9272 30795 46212
13191 46212 64435 35293 32081 55555 50736 43648 44290 68461 82804 105393 85427 83062 72902
13178 72902 62529 49294 62647 34716 14074 8801 16780 36154 49875 59367 64932 67826 83386
13165 83386 72806 46872 17821 36194 68860 67265 63626 70805 56618 58150 61044 60042 85509
13152 85509 81386 41680 34630 31236 38405 73389 77714 42238 23594 32326 40815 59384 66643
13139 66643 65759 60739 55235 44935 43584 29112 31367 56788 66700 57381 46332 51806 49155 41766
13125D1766q475p760m634K1933m683o871l3077j3871L5855K577j6049J6202K0798
13112D3711j4648l4689L94L6190J0586j1385Q717j3989j7915J3851K3695k400
13100D2118N123J9157j4665J4916l1046J224J2495N587K9323o969k4616Q186q432
13087E2401N808o297k4239k0046p439J1969K8925M753K4793k0850k9350J2478
13075C2906J9412K3070o959r875J3990K129R989k0412k1325L0534l112L716j695
13062G2368O660L916M931J747J3175j5738k373k906m1155q788j5164k6996k0023
13049c0346J426K9586J0084k7041l578j5415j360J4001K5200K3969L1866J0377
13037F8769P090Q693j483k1647r529J2180K4407L699k3792l4417J1508m092m390
$$ plain form
13125 41766 33291 25531 20897 42830 38147 31276 -1801 -15672 20183 22760 6711 22913 43711
13112 43711 29063 -5626 -5232 30958 41544 30159 38876 24887 6972 20823 44518 42118
13100 42118 47241 66398 51733 66649 35603 36827 49322 54909 84232 77263 52647 60833 52401
13087 52401 58209 51912 27673 7627 188 12157 41082 45835 70628 49778 20428 32906
13075 32906 52318 75388 68429 58554 72544 74673 84662 64250 42925 73459 70347 74063 72368
13062 72368 79028 82944 87875 89622 102797 87059 84686 81780 40625 31837 16673 -10323 -30346
13049 -30346 -28920 666 10750 -16291 -19869 -35284 -36644 -22643 2557 26526 58392 68769
13037 68769 75859 84552 83069 61422 51893 64073 88480 92179 68387 33970 45478 41386 36996
13024C6996K5435l575j0966j899M785q416K495K0757j3395K0624Q006j4493O136
13011G2490J0052n431j5101K5905L304L511o22k765k2987J4020L7846p954J209
12998A13477J0285o249l8618j6087j486K3745L3115J3903M532K8808N3102R406
12986B27933k247L5087N8555P5847N5137J21387J48094J94147K02676J85492J08250
12975A410358L9013n0860j30535k02348k06152j57471j21920j08866r3637l6378
12965C41204j8375m1901j5405P025m466j5602L36J6084k6315l6937j4050L761
12953A95359J1649k428j2699J0899l2562j4127L1038O023j448J0129j3225k2342
12941A66266q434j4263j9289J2804J1978L878j4936j7646Q534q460J0975K132
$$ plain form
13024 36996 62431 58856 47890 45991 50776 42360 44855 65612 52217 72841 80847 66354 72490
13011 72490 82542 77111 62010 87915 91219 94730 94108 91343 68356 82376 120222 112268 113477
12998 113477 123762 117513 78895 62808 61322 85067 118182 132085 136617 165425 218527 227933
12986 227933 225686 260773 319328 395175 450312 571699 719793 913940 1116616 1302108 1410358
12975 1410358 1449371 1398511 1267976 1065628 859476 702005 580085 471219 377582 341204
12965 341204 322829 280928 265523 272548 268082 252480 252816 268900 242585 205648 191598 195359
12953 195359 207008 204580 191881 202780 170218 156091 187129 193152 191704 201833 188608 166266
12941 166266 157832 143569 124280 137084 149062 152940 138004 120358 128892 120432 131407 133539
12929A33539l2053j7599n44j023J0369K0657L148j1647j3534J0843J5679L0066
12917A47901j675k0187Q917K987k5884k020j9222J7927j024m242O787P87k336
12904A08716p023j2267k1554J1104n581j9976J3616L9615O188J9057K8802M103
12892A64800j7547k8481k2383J8779J5121k7364j5521L0050L4883j1522j0860
12881A29955j4538K3337J9732K8537J189l4484j8457J0014K0930l0597j9446j1729
12869A04443K227K2946j3464j8515J6885j2068M616J0646j8668j5309k8532o874
12857D8333L5185j2205J1096J719l395k7936k3218l667K2909j0791q53P730J106
12844D6013J3692K596J0352l2j721K8491n628l9295j0829j440M160M1467J6010
$$ plain form
12929 133539 101486 83887 83343 82320 92689 113346 116494 104847 91313 102156 117835 147901
12917 147901 146226 126039 134956 137943 112059 110039 90817 108744 107720 103478 110265 111052 108716
12904 108716 101693 89426 67872 78976 73395 53419 67035 106650 112838 131895 160697 164800
12892 164800 147253 118772 96389 115168 130289 102925 87404 117454 152337 140815 129955
12881 129955 115417 138754 158486 187023 188212 153728 135271 145285 166215 135618 116172 104443
12869 104443 106670 129616 116152 97637 114522 102454 107070 117716 99048 83739 55207 48333
12857 48333 83518 71313 82409 84128 80733 52797 29579 25912 48821 38030 37177 44907 46013
12844 46013 59705 62301 72653 72621 70900 99391 93763 54468 43639 42199 46359 87826 103836
12831A03836j6351k2127r104J0332J4864L5947K382l454P365q048l578O686L1839
12818A50589l939j7654J5369K2439Q183K7321L1476L2053L7964l0328k7736N235
12806B50972J5835k2327N244k1879j4363J1761J4800j2652R616K4008j9695l8580
12794B02740o930p378l4478k3713M204l66k8780j0965K4907K7875M2798j2422
12782A77492j9876L120P096K3351k7312j2706J2760K4448q413J9284J4276j4176
12770A99344j432N771N526l3473n735O463j6424l646j5949k7124m2290k1132K8822
12757G8721L7826r182l5911k1379l0641r946k7971k4572k2294l7743o3877j02594
12745b69563j03971j9000L8958P9984J00761Q2123Q5628Q4750M6824P335J3337
$$ plain form
12831 103836 87485 65358 56254 66586 81450 117397 119779 116325 123690 115642 112064 118750 150589
12818 150589 146650 128996 144365 166804 174987 202308 233784 265837 303801 273473 245737 250972
12806 250972 266807 244480 249724 227845 213482 225243 240043 227391 237007 261015 241320 202740
12794 202740 195810 188432 153954 130241 134445 134079 105299 94334 119241 147116 189914 177492
12782 177492 157616 160736 167832 191183 163871 151165 163925 188373 179960 199244 213520 199344
12770 199344 197912 203683 209209 175736 170001 176464 160040 156394 140445 113321 71031 49899 78721
12757 78721 116547 107365 71454 50075 19434 9488 -18483 -43055 -65349 -103092 -166969 -269563
12745 -269563 -373534 -392534 -353576 -273592 -172831 -90708 -5080 79670 126494 133829 147166
12734A47166Q734L5983J2033K5674J4641k301K0645j889j2901J7478m42R51K4542
12721B90314K1774P978j7913k1341m225O097k322k9256m229L3984K1617K8619
12709C31097J9397j8072n5405l8804Q501l839j0532k570P645N044J6025L3004
12697B91491k6057k3054L2711L8372K7910J3242j7390J7218O683K258R37q648
12685C55673J7551K4285J3327Q61L2319J2618K1670K5751J3201L5885k4547k3724
12673E04870o264J417j3793k0291j2869P001k0838l5224k37L5332O559K6650L4528
12660E06841N612J6218L301J8633J6627J9646L0944K9076L9951O940J0273J6135
12648G20197K1023k7579k4658R063L5271O984K3137R769j5235l4842k842j379
$$ plain form
12734 147166 155900 191883 203916 229590 244231 241930 262575 260686 247785 265263 264821 265772 290314
12721 290314 312088 320066 302153 280812 276587 282684 280362 251106 246877 280861 302478 331097
12709 331097 350494 332422 277017 238213 246714 242875 232343 229773 237418 242462 258487 291491
12697 291491 265434 242380 275091 313463 341373 354615 337225 354443 361126 363384 364321 355673
12685 355673 373224 397509 410836 411697 444016 456634 478304 504055 517256 553141 528594 504870
12673 504870 498606 500023 486230 465939 453070 460071 439233 404009 403772 439104 445663 472313 506841
12660 506841 512453 528671 531972 550605 567232 586878 617822 646898 686849 693789 704062 720197
12648 720197 741220 713641 688983 698046 733317 740301 763438 773207 757972 723130 720288 718909
12636G18909J1783J1734K9054R793j182p001k5716k4159L8986N5355L3777J2748
12624H64081J7325L8799O289J8566J4392J4164K0237J7586O1096O4635M2836M9088
12612A229094N1870N6350K7715J5690L3449N6739M2701N3328K2839R87K6056L6759
12600A653577L3232K9709K1406K8255K3032N2373O3058Q4064J19711J31989J29884
12589B370290J21895J92147J72274J37272J45519J51488J77855J57215K10779
12580C836734K71906L31713M14725M65831N74272P67559R46963J165600J437072
12571A0212375J716051J905837K006292K006700K011510K187870K670347L666928
12563B8383910N423525Q310359J2799919J9216166K7220643L5210363M0731608
$$ plain form
12636 718909 730692 742426 771480 781273 780091 773090 747374 723215 762201 817556 851333 864081
12624 864081 881406 920205 926494 945060 959452 973616 993853 1011439 1072535 1137170 1180006 1229094
12612 1229094 1280964 1337314 1365029 1380719 1414168 1470907 1513608 1566936 1589775 1590762 1616818 1653577
12600 1653577 1686809 1716518 1737924 1766179 1789211 1841584 1904642 1988706 2108417 2240406 2370290
12589 2370290 2492185 2684332 2856606 2993878 3139397 3290885 3468740 3625955 3836734
12580 3836734 4108640 4440353 4855078 5320909 5895181 6662740 7609703 8775303 10212375
12571 10212375 11928426 13834263 15840555 17847255 19858765 22046635 24716982 28383910
12563 28383910 33807435 42117794 54917713 74133879 101354522 136564885 177296493
12556A77296493M1026232L3400240J7193207l626431k2931142l6356849m1433044
12549A64568706l7871400k9296039k0493872j3838892r336323o453535m612203
12542D2666442l359510k560532k152172j988748j946188j933486j886958j768367
12534B5070481j624517j407987j195056r29184p71020o32659n67913n95242o15072
12525A6731831o25853o35113o90240o56683n95763n47906n20797n23841m87269
12516A1448366m47001l87663l89807l83476l77508l82397l95245l72044l38767
12507G974458l07912k94013l19399k50602k16257k09214k13434k24030j96318
12498E743279j93213j73097j30018j53781j20882r9360r4728j19713j23304j22908
$$ plain form
12556 177296493 218322725 251722965 268916172 265289741 242358599 206001750 164568706
12549 164568706 126697306 97401267 76907395 63068503 53732180 47278645 42666442
12542 42666442 39306932 36746400 34594228 32605480 30659292 28725806 26838848 25070481
12534 25070481 23445964 22037977 20842921 19913737 19142717 18510058 17942145 17346903 16731831
12525 16731831 16105978 15470865 14780625 14123942 13528179 12980273 12459476 11935635 11448366
12516 11448366 11001365 10613702 10223895 9840419 9462911 9080514 8685269 8313225 7974458
12507 7974458 7666546 7372533 7053134 6802532 6586275 6377061 6163627 5939597 5743279
12498 5743279 5550066 5376969 5246951 5093170 4972288 4872928 4778200 4658487 4535183 4412275
12488D412275j07597j11610j53831j12374r0516q1839q3545j11862j22337r4241
12478C342523q9569j13606j22350j08151r3550q3321o7086o4545p0932q9768j04396
12467B335249q4151o4430m0650n2822p3405o4316n8250k7127j5503m1541k9868
12456A783186k1729l0889l0354l4925o1486j8664k7671m7149n2131m0773p3100
12445A344315j5781k9228p351k410l8374l9995j9727o699l1033o7129l1058o3268
12433I92262n010J4858k2251j1563J0827o063O177K6342j5654m2034k1653j7733
12421I08505n6042n3987n1119j7125l0660j4800o393k4286k6184j4438k9931m6457
12409E37083k2837j1379j6462l0169m0004k5818j4192K74l7953o993j5370l0248
$$ plain form
12488 4412275 4304678 4193068 4039237 3926863 3836347 3754508 3670963 3559101 3436764 3342523
12478 3342523 3252954 3139348 3016998 2908847 2815297 2731976 2664890 2600345 2529413 2439645 2335249
12467 2335249 2251098 2186668 2146018 2093196 2019791 1955475 1897225 1870098 1854595 1813054 1783186
12456 1783186 1761457 1730568 1700214 1665289 1603803 1585139 1557468 1510319 1458188 1417415 1344315
12445 1344315 1328534 1299306 1291955 1289545 1251171 1211176 1191449 1184750 1153717 1086588 1055530 992262
12433 992262 987252 1002110 979859 968296 979123 973060 979237 1005579 989925 947891 926238 908505
12421 908505 852463 798476 747357 730232 699572 684772 678379 654093 627909 613471 583540 537083
12409 537083 514246 502867 486405 456236 416232 390414 376222 376496 338543 331550 316180 285932
12397B85932m0023l3252q702k60R658j3095j8268m1456l3587Q67K082K3079k7686
12384A05289m735J7282P415K9572J7678J0318p045j8354k9193k2303J524N2878
12372A60326J6304K3065M5704N9851O1437R9081J01819N0851K8973J0105l0480
12361F27036n5841j06682q0844m6090k9736k0698j4030l817j1602k6765K7697
12350B58628J1338n3865m3375k0965L759N002q389n788j5213k5535L969J7132
12338A26698j7320r663m461J3270r341M1489K8105j6520J5895L019M05L1489k0900
12325A82165j5875k3202o314K7106K005j9173j5003J0756M1003K1650J614j0349
12313A96383n4656m53K3740L5508J4311K7873K0376j7682l2763l0797k6101l0941
$$ plain form
12397 285932 245909 212657 203955 203695 213353 200258 181990 140534 106947 107814 109896 132975 105289
12384 105289 100554 117836 125251 154823 172501 182819 175774 157420 128227 105924 107448 160326
12372 160326 176630 199695 245399 305250 366687 465768 567587 618438 647411 657516 627036
12361 627036 571195 464513 383669 337579 307843 287145 273115 269298 257696 230931 258628
12350 258628 269966 216101 172726 151761 155520 160522 152133 146345 131132 105597 109566 126698
12338 126698 109378 99715 95254 108524 99183 140672 168777 152257 168152 171171 171576 203065 182165
12325 182165 166290 143088 136774 163880 165885 146712 131709 142465 183468 205118 206732 196383
12313 196383 141727 141274 165014 200522 214833 242706 263082 245400 212637 181840 155739 124798
12301A24798k3908J908K9608O792J1744n044r291q267M263k1922k7651j9438L199
12288F6791J6378L1502J8213l856j5165j341o286J9163j963K1773N157k6229P328
12275A31465M163O476k6430j7677R618J7226K4410J9824K5408J3744j2275O541
12263B02493L6806M8998L0589O7847Q3617P1545R2050Q0036O6970M1064K6899
12252H48914j3759o1664q1416q7486p7716q7301p9012o1339l4318j7854j5077
12241B31972k8862k9513j5419j4905j9032q651r940k366J4128m157k0480j8554
12229G4221j0179L376N791L707M216k202J5518j0512j1551r130N684L017k3106
12216D8850k0654J4870j8719j091K4330K1951K7252J7734L292l266j0115O825
$$ plain form
12301 124798 100890 102798 132406 139198 150942 145898 136607 128340 132603 110681 83030 63592 66791
12288 66791 83169 114671 132884 129028 113863 112522 106236 125399 123436 145209 150366 124137 131465
12275 131465 135628 142104 115674 97997 107615 124841 149251 169075 194483 208227 195952 202493
12263 202493 239299 288297 318886 386733 470350 541895 633945 713981 780951 822015 848914
12252 848914 835155 773491 692075 604589 526873 439572 360560 299221 264903 247049 231972
12241 231972 203110 173597 158178 143273 124241 115590 105650 103284 117412 113255 92775 74221
12229 74221 64042 67418 73209 76916 81132 78930 94448 83936 72385 63255 68939 71956 48850
12216 48850 28196 43066 24347 23256 47586 69537 96789 114523 117815 114549 104434 111259
12204A11259j8380k0032K215Q991o046Q479p828k1465K2679N884j7411P240K9728
12191A05313k703k5275l0633R532K5180K1934J6166K2042J8970q14Q477l4227
12179A33962k0614N809j1036j6304L0884L373j3394l9335m6270L3088M2346J3293
12167A15802J1413O643j1933J4853L1490J2089o659j0351r89R815K2725n059p999
12154A81840L5311K8514K9799L9848P0305O6877M3556J4212k6278l3820l9880
12143D10284k8326l735Q783L6646P3658J10245J26675J61169J50940R7028J3108
12132A156475k6938M2789J14330J69252K61623K45884J69362O2469o2026k69633
12122A863587l75699l27811k52747j65463j42817j00590p7583n0350j4752J6312
$$ plain form
12204 111259 92879 72847 75062 84053 78007 86486 78658 57193 79872 85756 68345 75585 105313
12191 105313 102610 77335 46702 56234 81414 103348 119514 141556 160526 159712 168189 133962
12179 133962 113348 119157 108121 91817 122701 126074 112680 73345 27075 60163 102509 115802
12167 115802 127215 133858 121925 136778 168268 180357 173698 163347 162358 172173 194898 189839 181840
12154 181840 217151 245665 275464 315312 385617 452494 496050 510262 483984 450164 410284
12143 410284 381958 378223 387006 423652 497310 607555 734230 895399 1046339 1143367 1156475
12132 1156475 1129537 1172326 1286656 1455908 1717531 1963415 2132777 2195246 2133220 1863587
12122 1863587 1487888 1160077 907330 741867 599050 498460 420877 370527 355775 372087
12112C72087k6605k1013Q42k3692j0475n533k0198k1647j3691l6573o177J4276
12100B01601J5240r158m117j0959J9297M3420j6675j4670q059j0229p407m201
12088A94083q503j6197o523J6842j373j6395j0403m634j1591k4946m711J4199
12076A19848J5274K5082J29o896k2969m2631k532J0852L63m058k2489j589p799
12063F0585j2208J4671J1891Q99K7737K2617l0123O174n508k4631j5691P430J2057
12050G5900M0329p991o435K2057o88m613O851M066Q612l0554N657j6023l6146
12037F1022j8629Q896K6682M192R218J9123l260m955P699J5480j4574n934K2715
12024A27675j5549j0405m07l187L033M4102K72j2383l4641J9531J1531o108l419
$$ plain form
12112 372087 345482 324469 325311 301619 291144 285611 265413 243766 230075 193502 187325 201601
12100 201601 216841 207683 203566 192607 211904 255324 238649 223979 215920 205691 198284 194083
12088 194083 185580 169383 162860 179702 178329 161934 151531 146897 135306 110360 105649 119848
12076 119848 135122 160204 160333 153437 130468 87837 85305 96157 96520 92462 69973 68384 60585
12063 60585 48377 63048 74939 75838 103575 126192 96069 102243 96735 72104 56413 63843 75900
12050 75900 116229 108238 101803 123860 123172 118559 125410 129476 138088 107534 113191 97168 61022
12037 61022 42393 51289 77971 82163 91381 110504 107244 102289 109988 125468 110894 104960 127675
12024 127675 112126 101721 101314 98127 101160 145262 145534 133151 98510 118041 129572 123464 120045
12011A20045k012J758j6638K242j57J1153j219J2472L9498L755k3175k578L485
11998A48629J4881J4209K0755L585L256N30k98K4361K1105L042M3672J5339K1300
11985C34366J1546L6856N6189M4684O6498J04392Q3103Q8344L5027R6042J41601
11974A098648J78549K68501M10937O02521Q22582J072569J268643J396461J344638
11965H464049J016212M60975j77762p97931j223959j360982j314714j074504p99523
11956C191861n93930l74417k30713j87787j45418j04314j8895M2748M0362M8518
11946A668015J9617M3854j0234j42815k60450k03744j27714r3284p0011l7760
11936G85474l7094j9005k7152l5304k3694l1790l1017k5611k8912l0300j6907
$$ plain form
12011 120045 118033 119791 103153 105395 105238 116391 115172 127644 167142 170897 147722 145144 148629
11998 148629 163510 177719 198474 202059 205315 205845 205547 229908 251013 254055 297727 313066 334366
11985 334366 345912 382768 438957 483641 550139 654531 737634 825978 861005 957047 1098648
11974 1098648 1277197 1545698 1956635 2559156 3381738 4454307 5722950 7119411 8464049
11965 8464049 9480261 9941236 9763474 8965543 7741584 6380602 5065888 3991384 3191861
11956 3191861 2597931 2223514 1992801 1805014 1659596 1555282 1536387 1579135 1619497 1668015
11946 1668015 1687632 1731486 1721252 1578437 1317987 1114243 986529 893245 823234 785474
11936 785474 748380 729375 702223 666919 643225 611435 580418 554807 525895 495595 478688
11925D78688q48l00l9403m578l2574o324o967j3904j4447j8295n099M281l608
11912C36622j1474l4089l9156R208j1632j2612K8641J8770j3570o85l2926m1759
11900A95338K13J1837j2887J2231j3578M590p516j3936K301l915l411k6177j6523
11887A28567m124J2875Q901L76n384k9132K7j4496l263K3842k0323k2351K8368
11874A03883J999r853Q594M523j7477j826K1462j2837k990R3j1481m6045m133
11861C3912K8244o717p166k150J750M349J6198J5126K022j5665N422K260m526
11848G3059n015M105k3230l9450J7664J6300J876P620p178m022J750q385j1914
11835B3180J002N187M416J2647M01j4241k8400j1393L3071M3004J384r754N131
$$ plain form
11925 478688 477840 477540 438137 433559 400985 394661 387694 373790 359343 341048 335949 340230 336622
11912 336622 325148 291059 251903 261111 249479 236867 265508 284278 270708 270023 237097 195338
11900 195338 195551 207388 194501 206732 193154 197744 190228 176292 178593 174678 171267 145090 128567
11887 128567 124443 137318 146219 146595 141211 112079 112106 97610 94347 118189 97866 75515 103883
11874 103883 105882 96029 104623 109146 91669 89843 111305 98468 95478 95571 84090 38045 33912
11861 33912 62156 55439 48273 46123 47873 52222 68420 83546 85568 69903 75325 77585 73059
11848 73059 68044 72149 48919 9469 27133 43433 45309 52929 45751 41729 43479 35094 23180
11835 23180 24182 29369 33785 46432 46833 32592 4192 -7201 25870 68874 70258 60504 65635
11822F5635L2406j559m635k702l3332N950K3125J7217k0350j1321L3230j7925
11810H5739m4417o510j8246Q715Q209L947j3103M708r890Q5j1200j4296J0403
11797D144J2834l2923J3885M941j9640k387L0L457K4274K9516O149j6470l5614
11784g804N473K2863L897M097K808K2521n00l0510j4943j3987R477J1831J432
11771A6655J01j7842J18K2404L2050k0824N476j861k4779j2617l708J6506J96
11758A1875j8847l5233K956L0624K0018M345O511K1738L86j6406j69J1929l776
11745C5951k657j7472o615K5434R436j6655p841J0304r829Q932k999J7196J4786
11732E7971j186o374k2708J8809J2551J7574N572o162p246j4058k0735K251j0810
$$ plain form
11822 65635 98041 96482 91847 89145 55813 61763 84888 102105 81755 70434 103664 85739
11810 85739 41322 34812 16566 25281 33490 37437 24334 29042 19152 19237 8037 -6259 4144
11797 4144 16978 -15945 -2060 2881 -16759 -19146 -19116 -15659 8615 38131 44280 27810 -7804
11784 -7804 -2331 20532 24429 28526 31334 53855 53355 22845 7902 -6085 3392 15223 16655
11771 16655 16756 -1086 -968 21436 53486 32662 38138 36277 11498 -1119 -4827 11679 11875
11758 11875 -6972 -42205 -39249 -8625 11393 15738 22249 43987 44373 27967 27798 39727 35951
11745 35951 33294 15822 9207 34641 44077 27422 19581 29885 20056 28988 25989 43185 57971
11732 57971 56785 50411 27703 46512 59063 76637 82209 76047 68801 54743 34008 36259 25449
11719B5449J3640J5172J8609n635Q785k5068j7132O730J4938k56l1144j1774L268
11706A5582J5437j13J5963J8296j7520k7526k6440o944K3176K9153J0272j0992
11694C8344o16k2600k707R548j04p902K3626o566j8958J0086j6769O095J4833
11681B6310Q979P356j0281l959p547j5347M24o511m914J2546j1183k5325P781
11668b1671K0917L5948K0923K663l2471l5942K1412J7546j0867J0855p468L2386
11656E4231L684r6J085m881k8897k3782M558l256k0118O283J0717K5403p848N728
11642B2811K334R946Q369j2674k2183K801L738k3565m490R757J0207Q217M0405
11629E5673K1044n975l3182k0981n00J2612o548l1809J118K8101K6448J0329O143
$$ plain form
11719 25449 39089 54261 72870 67235 76020 50952 33820 40550 55488 55232 24088 12314 15582
11706 15582 31019 30906 46869 65165 47645 20119 -6321 -13265 9911 39064 49336 38344
11694 38344 37728 15128 12421 21969 21865 13963 37589 31023 12065 22151 5382 11477 26310
11681 26310 35289 42645 32364 28405 20858 5511 5935 -576 -5490 7056 -4127 -29452 -21671
11668 -21671 -754 35194 56117 58780 26309 -9633 11779 29325 18458 29313 21845 54231
11656 54231 57915 57819 58904 54023 25126 1344 5902 2646 -17472 -11189 -472 24931 17083 22811
11642 22811 25145 35091 43460 30786 8603 11404 15142 -8423 -12913 -3156 7051 15268 55673
11629 55673 76717 70742 37560 16579 16079 28691 22143 -9666 -8548 19553 46001 56330 62473
11616F2473j6431J496K5262J8085k2817r855k0054P289j3078J6539K3230k1067
11604E1072j2331j7459j3449k2603r688R6J2433L1317J6500J8351n460j1935K266
11591C9110K3272M369o218k4701J154m695P584Q521l0728M930J2787j9059K0893
11578C7219n449j0535M739J0038K0890L709l9741K3024m401j9311K0792M685k6687
11565A8972p629q041k186J3429K0011J0172K0986J5532k3725l0457k60J8098k0635
11552B4267Q735K5492J3032J1599J4613o959m1285q518P348m914J3887L2323J7211
11539A06831m0737o810J3426J6147r930q306K1755J6318l0935m3221J9575K3306
11527G7419j7238j9707j883n592J051m852q431l342R722L944r9o724O990K3463
$$ plain form
11616 62473 46042 47538 72800 90885 68068 58213 38159 45448 32370 48909 72139 51072
11604 51072 38741 21282 7833 -14770 -24458 -24362 -11929 19388 35888 54239 48779 36844 39110
11591 39110 62382 66751 60533 35832 36986 32291 39875 48396 17668 22598 35385 16326 37219
11578 37219 31770 21235 25974 36012 56902 60611 20870 43894 39493 20182 40974 45659 18972
11565 18972 11343 3302 1116 14545 34556 44728 65714 81246 57521 27064 26804 44902 24267
11552 24267 33002 58494 71526 83125 97738 90779 49494 40976 48324 43410 57297 89620 106831
11539 106831 66094 59284 72710 88857 78927 70621 92376 108694 77759 34538 54113 77419
11527 77419 60181 40474 38591 32999 34050 29198 20767 17425 27147 31091 30992 24268 31258 54721
11513E4721o171J4793J6759j1434k2220j4942J4920R282n507l463K3462J1440
11501H1640l5369m185J8356j7846l2493N24J7618n116K04M801J6048J3086j7114
11488D0154k8817j7457K2212J3840n236J8052K1788J0585P801L38j1359J5379
11476H7280j7953j331L7189L3273NJ3257M7236L8733L0385N7255L4743N0540L8676
11463D49288L2948m737l135n2401o4450n9494m9810m1832m7984j5540j8189Q243
11451A32907J498j590Q549K575N018j6177l0096Q79L5492Q003r94k1443k6514
11438I8107J7283P218k4176k2823m2373K5175L9393m978j0896J7819P471o057
11426A01163k0548k8073J0324J6737J0265L0089J2631M066k4012k4986M175j0444
$$ plain form
11513 54721 48550 63343 80102 68668 46448 31506 46426 55708 50201 46738 70200 81640
11501 81640 46271 42086 60442 42596 10103 10627 28245 23129 23333 28134 44182 57268 40154
11488 40154 11337 -6120 16092 29932 24696 42748 64536 75121 82922 83260 71901 87280
11476 87280 69327 67996 105185 138458 138463 151720 198956 237689 268074 325329 360072 410612 449288
11463 449288 482236 477499 474364 421963 357513 298019 248209 206377 158393 142853 124664 132907
11451 132907 134405 132815 141364 143939 148957 132780 102684 103563 139055 147058 146064 124621 98107
11438 98107 115390 122608 98432 75609 33236 58411 97804 92826 81930 99749 107220 101163
11426 101163 80615 52542 62866 79603 89868 119957 132588 136654 112642 87656 91831 81387
11414H1387m300n651l3716J5602k347J0421K3086k089l90K1171L2818m888j5009
11401A16095k5528l1973k421N903k450J766J6995K910K8236l2038k7001o779K7268
11388G0983N415J2580n707k3853J8761l052k1971o16P350L689K1799k1583m1664
11375B2131J1965L4030K0251L300p473r125l421j9997J1583K8465K2341o987N131
11362A12194j8111j1821N695k296J3747J4863j7213j517j7100J2061l854j0109
11350G6539j4585K247J5610K6752p066R429j7723j0405K0128q19J696J784L0783
11337A34370J487k3937l2235n067j433o014k2847j2883j8685J3275K3707K0907
11325G0645O195Q066N056J1257J2091M724j203p260o638j98j2865k0936J2383
$$ plain form
11414 81387 77087 71436 37720 53322 50975 61396 84482 82393 82003 103174 135992 131104 116095
11401 116095 90567 58594 56173 62076 59626 61392 78387 81297 109533 77495 50494 43715 70983
11388 70983 76398 88978 83271 59418 78179 75127 53156 52540 59890 63579 85378 63795 22131
11375 22131 34096 68126 88377 91677 84204 75079 71658 51661 63244 91709 114050 107063 112194
11362 112194 94083 82262 87957 85661 99408 114271 97058 95541 78441 90502 86648 76539
11350 76539 61954 64201 79811 106563 99497 108926 91203 80798 100926 100107 101803 103587 134370
11337 134370 135857 111920 79685 74618 73185 67171 44324 31441 12756 26031 49738 70645
11325 70645 76840 84906 89962 101219 113310 118034 116831 109571 102933 102735 89870 68934 81317
11312H1317J3475l388N999Q089j296Q877l545q312l2582M063J2054r556J2434
11299H7629j0666K980K0450M053L092P74Q850j8818k8657N107L1759J9876j3936
11286A12493J7676K0221N100m126j8811j2732n672R719K0789R986J7434J2657
11274A84734l2664j8726q089l73r21k1337k68L2360R857j3796k6749k7870j3638
11261F2520J9519P546J5375J9893J2115J4568K6303j9675l8506j0927K2056K6741
11249A57528o088l8749r389L4822K097k2870j0171k0044k4588K573M8170J6492
11237A29783n336K1379J3446m1335p662N49o967n401J9551j6286K2O87M279l8930
11223F7779J7442J6251r005j5035K9959J6096j8002j5762k3393r550N848L3219
$$ plain form
11312 81317 94792 91404 97403 105492 104196 113073 109528 101216 68634 72697 84751 75195 87629
11299 87629 76963 79943 100393 104446 107538 108312 117162 98344 69687 74794 106553 126429 112493
11286 112493 130169 150390 155490 151364 132553 119821 114149 123868 144657 154643 172077 184734
11274 184734 152070 133344 125255 124882 123961 102624 102356 134716 144573 130777 104028 76158 62520
11261 62520 82039 89585 104960 124853 136968 151536 177839 158164 119658 108731 130787 157528
11249 157528 151440 112691 103302 138124 140221 117351 107180 87136 62548 65121 113291 129783
11237 129783 124447 145826 159272 117937 110275 110824 103857 98456 118007 101721 101743 102430 106709 67779
11223 67779 85221 101472 92467 77432 107391 123487 105485 89723 66330 56780 62628 95847
11211I5847J1453M2573R469k4210m563K8565p60j1941k0247O2p050Q979J4850
11198A43027j9097n387L868K8251p811k1861k800J6536j6994j7696m571J1259
11186A06724R561M5569o770j6899j5706J3317R929j9301J7706K6078J5309J0608
11174A96125j5365K6p707m2677j6637n289R124J0469N106n513k4156j2658K1796
11161A12644k3632j9757j1953j669p447n196K0325J4161j1804k171J6965J5284
11149I5750K9155K792j5570j9778K8375J5701j024j1453k2470k135j0233J2905
11137A02015J4805k6860l5953N570J8682K5270O573L5942N1915K315m818j4822
11125A80634k6030K473K869p252j8942r829j6440p289P990N890O262j6657k731
$$ plain form
11211 95847 107300 149873 159342 135132 130569 159134 158374 146433 126186 126248 119198 128177 143027
11198 143027 123930 118543 122411 150662 142851 120990 118190 134726 117732 100036 95465 106724
11186 106724 116285 161854 155084 138185 122479 135796 145725 126424 144130 170208 185517 196125
11174 196125 180760 180786 173079 130402 113765 108476 117600 128069 133175 127662 103506 90848 112644
11161 112644 89012 69255 57302 55633 48186 42990 63315 77476 65672 63501 80466 95750
11149 95750 124905 127697 112127 92349 120724 136425 135401 123948 101478 99343 89110 102015
11137 102015 116820 89960 54007 59577 78259 103529 110102 146044 197959 200274 195456 180634
11125 180634 154604 157077 159946 152694 133752 123923 107483 100194 108184 114074 120336 103679 100948
11112A00948r383q860j68M1979k5950j7388J4834K2670r019q186J129J0650N482
11099A18738J3924J8927J1564j6007n948o287J3909K1647j7259q833N232J4257
11087A63864J7966m552L340j766k8093L26J335n25m636L3365j0295j8455K1226
11074A73100j4826J6956L0789O983o414k3838j6450k9252J4541M9522J210o559
11062A95762k9933j1255Q959j6493j0206j1715r334M9908J2201j4017J1694l6059
11050A39512p201q06k1691M118J3548R063K3079L76P881R415j3975L710k6078
11037A40951j3924L7323J3981j7564K0559n618k2548j2961K6753K8001j4473m2305
11025A38175o685L4874J399j8207N174J9673Q135N167K3262r394O173K1535J0386
$$ plain form
11112 100948 91565 82705 82537 124516 98566 81178 96012 118682 109663 101477 102606 113256 118738
11099 118738 132662 151589 163153 147146 141198 134911 148820 170467 153208 144375 149607 163864
11087 163864 181830 177278 180618 178852 150759 151085 152420 151895 147259 180624 170329 151874 173100
11074 173100 158274 175230 206019 213002 206588 182750 166300 137048 151589 201111 202321 195762
11062 195762 165829 154574 163533 147040 136834 125119 115785 165693 177894 163877 175571 139512
11050 139512 132311 131505 109814 113932 127480 136543 159622 159998 167879 177294 163319 167029 140951
11037 140951 127027 164350 178331 160767 181326 175708 153160 140199 166952 194953 180480 138175
11025 138175 131490 166364 167763 149556 154730 174403 182538 187705 210967 201573 207746 229281 239667
11012B39667J6549p376k1249M248O461J7740J2303j8300P82j576j5886J418M687
10999B39468J3768K3644k50J1555J9236J5217J486K3036K5815M8812K7850O3013
10987E12650N9263J28207K02689L15834M08691M19332L77186K71529K198l52290
10977B345289n21113m42047k92319j87958j20389j22519r6543l1795j9321J0914
10967E22199l410l7605o0195p574Q60k3665k1871K9710M392l6093n480J8029J393
10954C80690N416j173J642j1522k4427p888J4792K3621k0512m3079l3349N371
10942B89582N7220O435k2489j2958j2397j3155p83m17j391J152j9700l2321Q35
10929B39613j0633O95Q302K1235l071j0728K8081J3122k5070J209P495K4283j5351
$$ plain form
11012 239667 256216 248840 227591 231839 238300 256040 268343 250043 250825 249249 233363 234781 239468
10999 239468 253236 276880 276630 288185 307421 322638 324124 347160 372975 421787 449637 512650
10987 512650 571913 700120 902809 1218643 1627334 2046666 2423852 2695381 2697579 2345289
10977 2345289 1824176 1382129 1089810 901852 781463 658944 562401 530606 511285 522199
10967 522199 518789 481184 420989 413415 414275 390610 368739 398449 402841 366748 361268 379297 380690
10954 380690 386106 384933 386575 375053 350626 342738 357530 381151 360639 317560 284211 289582
10942 289582 346802 353237 330748 317790 305393 292238 291455 291038 289647 290799 271099 238778 239613
10929 239613 228980 229675 237977 259212 256141 245413 273494 286616 261546 262755 270250 294533 279182
10916B79182l1601J685o025j9833m992J8037K5047P39j3233P714J012l4278n448
10903B18006L8590J6103J0563R078k309k7188j6515J9264J0412l507K6979m707
10891B94769j7181l862j3117k409L085Q428j4838N714J2854M284j5680j2298P785
10878B57534r763M23J6664K8320j7534k6082k675r795J674K2552j4833j7378P483
10865B36590K2992M096q696o832J0731j0309k7903R079J5528k3986k8546R727
10853B02471L2433k412j5091J2863M494O745P855M187N997l6749q775J5115J6498
10840B45631N425N964K3141L7238J0431m2170k2825K2584L6094j3670j1881L3064
10828C29026L4099j1149Q015J3394P681l1500M543M9448L4806N0908J3653j5703
$$ plain form
10916 279182 247581 249266 243241 223408 218416 236453 261500 262239 249006 256720 257732 223454 218006
10903 218006 256596 272699 283262 292340 290031 262843 246328 265592 276004 272497 299476 294769
10891 294769 277588 273726 260609 258200 261285 269713 254875 260589 273443 277727 262047 249749 257534
10878 257534 247771 248194 264858 293178 275644 249562 246887 237092 238766 261318 246485 229107 236590
10865 236590 259582 263678 254982 248150 258881 248572 220669 229748 245276 221290 192744 202471
10853 202471 234904 232492 217401 230264 234758 241503 249358 253545 259542 222793 214018 229133 245631
10840 245631 251056 257020 280161 317399 327830 285660 262835 285419 321513 307843 295962 329026
10828 329026 363125 351976 359991 373385 381066 349566 354109 403557 438363 489271 502924 487221
10816D87221j2616j6710p266M0594K1584m427p218k9870m5778l9947K0743L2285
10804D38595j3402m6946k5136m1256J4771L024k4389k3427k0518J672K0494M2425
10792C25907K1956n437j835J1820o805j0372O189J437L089J4142K2856L4653j8349
10779C99251l0966Q078M2591j8163j8522K1820M044J143r25j9561L134l078k0982
10766C67864l0662n7324j8514j3042P331L8414k605l7717o6150p9049r2692j06620
10754i0766r5301j36902j17456n5290N2264K32048K24906J47110J14822N0436
10744C25871L0407N8919P2552N5290k383J4361J0032L5390N1266J4416L0606L3663
10732G30390L6575Q1783J13408J79865K26012K86901L16604K60317J46581j0134
$$ plain form
10816 487221 474605 457895 450629 491223 512807 508380 501162 471292 425514 385567 406310 438595
10804 438595 425193 378247 353111 311855 326626 329650 305261 281834 261316 262988 283482 325907
10792 325907 347863 342426 340591 352411 345606 335234 341423 342860 345949 360091 382947 417600 399251
10779 399251 368285 376363 418954 400791 382269 404089 408133 409276 408351 388790 391924 388846 367864
10766 367864 337202 279878 261364 248322 255653 294067 291462 253745 187595 108546 15854 -90766
10754 -90766 -186067 -322969 -440425 -495715 -443451 -211403 13503 160613 275435 325871
10744 325871 356278 415197 487749 543039 540656 555017 565049 600439 651705 666121 696727 730390
10732 730390 766965 848748 962156 1142021 1368033 1654934 1971538 2231855 2378436 2368302
10722B368302o7282n3093q366N1173L0681j02902k83111l35284k89515k29533
10712A081070j43146o6250o9350k5501K5155k248r252j6375j5726J7370k148l3199
10700G40400p22K134p70L2451m236m4010j1790J2950K2470N4355R4030O8095K6124
10687I91481K5031M8909N8k8714k7233j4941j1310o529k7935q697j792j94r006
10674I29128j1393L5645j7537j2152J5566L9090L6191K1115L0384J1948P703N602
10662A091290L9127L8993L5155J5680M0667K2088r045o118R476L4875N2606K7704
10650A392498O682l519K0848J7849r121j2518l0024k7813J381j7972P963N9106
10638A405360K2650j33J2936N4166N4344Q1833R7279M1267j1381l9508k7978P387
$$ plain form
10722 2368302 2301020 2247927 2239561 2290734 2321415 2218513 1935402 1600118 1310603 1081070
10712 1081070 937924 871674 802324 776823 801978 799730 790478 774103 758377 775747 773599 740400
10700 740400 739678 741812 741042 773493 769257 725247 713457 726407 748877 803232 897262 965357 991481
10687 991481 1016512 1065421 1065479 1036765 1009532 994591 983281 976752 948817 940120 938328 938134 929128
10674 929128 917735 953380 935843 923691 939257 978347 1014538 1035653 1066037 1077985 1085688 1091290
10662 1091290 1130417 1169410 1204565 1220245 1260912 1283000 1273955 1267837 1277313 1312188 1364794 1392498
10650 1392498 1399180 1395661 1416509 1434358 1425237 1412719 1382695 1354882 1356263 1338291 1346254 1405360
10638 1405360 1428010 1427877 1440813 1494979 1549323 1631156 1728435 1769702 1758321 1718813 1690835 1698222
10626A698222k431L7310O3299P7116M7015O3765R5822O2688M7424N8151N6863
10615B305244P6075O8276O3337L7310L7822O4432O6809L1351O73j0318J1398M2115
10603B794524Q4106Q1886J36637J86910J95249K11242J93426K10400K08013J75904
10593D478297J93796K21040K43806K38338K68899L38808M92528O20409P44008
10584G839929Q88200J041245J127803J193494J356164J395980J285820J411241
10576A7539876J869176K473316L180031M046740N249564O978985R619561J3901226
10568F4858475K1205894L3471370N2444554P5503938Q8884453P9854408O0509776
10561D76732868K1885326n4638068j08838491r7728833o4480552m0176631k5973695
$$ plain form
10626 1698222 1695791 1733101 1796400 1873516 1920531 1984296 2080118 2142806 2190230 2248381 2305244
10615 2305244 2381319 2449595 2512932 2550242 2588064 2652496 2719305 2750656 2751329 2741011 2752409 2794524
10603 2794524 2878630 2960516 3097153 3284063 3479312 3690554 3883980 4094380 4302393 4478297
10593 4478297 4672093 4893133 5136939 5375277 5644176 5982984 6475512 7095921 7839929
10584 7839929 8728129 9769374 10897177 12090671 13446835 14842815 16128635 17539876
10576 17539876 19409052 21882368 25062399 29109139 34358703 41337688 50957249 64858475
10568 64858475 86064369 119535739 171980293 247484231 336368684 416223092 476732868
10561 476732868 498618194 443980126 335141635 237412802 172932250 132755619 106781924
10554A06781924j7711345j2787109r694453p460752n733432m393601l406795k738655
10546D2855782k219466j786514j512068j402333j480776j661733j686188j476264
10538B9630440j114209p99736o56623o80142q35085r87666j085238j113933r84968
10529B1372840q80762q48457q16437p87318p30887o55211n79530n83800n64406
10520A4926032n73384o15027o35434o10851n64072n15395n00989n01731m87560
10511I921589m49067l44379k52351j90875k19753k71143k86149k51671j77314
10502G478887r2916k6092o9384j06780j38553j21231j09905j37410j79131k02287
10492F295198j90578j82686j51152q6573q9286j21678j34108j48818j92670j47711
$$ plain form
10554 106781924 89070579 76283470 66589017 59128265 53394833 49001232 45594437 42855782
10546 42855782 40636316 38849802 37337734 35935401 34454625 32792892 31106704 29630440
10538 29630440 28516231 27716495 27059872 26379730 25544645 24556979 23471741 22357808 21372840
10529 21372840 20492078 19643621 18827184 18039866 17308979 16653768 16074238 15490438 14926032
10520 14926032 14352648 13737621 13102187 12491336 11927264 11411869 10910880 10409149 9921589
10511 9921589 9472522 9128143 8875792 8684917 8465164 8194021 7907872 7656201 7478887
10502 7478887 7385971 7359879 7290495 7183715 7045162 6923931 6814026 6676616 6497485 6295198
10492 6295198 6104620 5921934 5770782 5684209 5594923 5473245 5339137 5190319 4997649 4849938
10482D849938j19958j29001j39945j45482j28545j04439j42286j64373j22672
10473C653237j06658r7451p2385p2012o9992o4230n4710n4845p4262n9785o4510
10462B862397m2558n0142j4304l4190n9576n0253p3633p5437l5500J0738O738
10451B444280k3057K0658N3178K0506p500m6814o1939l5347n2490l3696j2969
10440B264810l5026j0783N048k5950J0760J263n0164j5993M9575j7666p5210n1646
10428B049018j03898q5849o2693m4951j2304k7106q042R997j6881l4629o541j1469
10416A644652j5641k566M0839L1162j5623k5264l9714l6968n0957n0650o1751
10405A417519m5240k4858k8019K2528k3807j4803j5800o029N561j1065j0031K5872
$$ plain form
10482 4849938 4729980 4600979 4461034 4315552 4187007 4082568 3940282 3775909 3653237
10473 3653237 3546579 3449128 3376743 3304731 3234739 3170509 3115799 3060954 2986692 2926907 2862397
10462 2862397 2819839 2769697 2755393 2721203 2661627 2611374 2537741 2462304 2426804 2437542 2444280
10451 2444280 2421223 2441881 2495059 2515565 2508065 2461251 2399312 2363965 2311475 2277779 2264810
10440 2264810 2229784 2219001 2224049 2198099 2208859 2210122 2159958 2143965 2193540 2175874 2100664 2049018
10428 2049018 1945120 1859271 1796578 1751627 1739323 1712217 1704175 1714172 1697291 1662662 1656121 1644652
10416 1644652 1629011 1626445 1667284 1698446 1682823 1657559 1617845 1580877 1529920 1479270 1417519
10405 1417519 1372279 1347421 1319402 1341930 1318123 1303320 1287520 1281491 1287052 1275987 1265956 1291828
10393A291828L1520M8194K6868j7683J1249K0384K2156O3579P3305L9046M7580
10382A658026Q9371M9182L8116O2543R4447J30626J85974K70148K98665K78215
10372C155313J54070j5916j06175j17034o4888l3681m5495m2623m73K8154O8922
10361B980174R7523Q1446Q5723J17097J35424J74786K29455K68894L14073L50177
10351D834772L59254L39024K86729K19077L79867N94856P20117P36158O72440
10342I142294M69918L54056M88699Q09123J086979J340666J561820J745879K025355
10333A9024789K614794L417063M498544O079663Q467488J2219867J8306077K7469117
10325A02097402L9043070M8645067N0407274M4980155L1703172N704060j6040566
$$ plain form
10393 1291828 1323348 1371542 1398410 1380727 1391976 1412360 1434516 1498095 1571400 1610446 1658026
10382 1658026 1747397 1796579 1834695 1897238 1991685 2122311 2308285 2578433 2877098 3155313
10372 3155313 3309383 3293467 3187292 3070258 3005370 2971689 2926194 2883571 2883098 2911252 2980174
10361 2980174 3077697 3159143 3244866 3361963 3497387 3672173 3901628 4170522 4484595 4834772
10351 4834772 5194026 5533050 5819779 6038856 6418723 7013579 7733696 8469854 9142294
10342 9142294 9612212 9966268 10454967 11264090 12351069 13691735 15253555 16999434 19024789
10333 19024789 21639583 25056646 29555190 35634853 44102341 56322208 74628285 102097402
10325 102097402 141140472 189785539 240192813 285172968 316876140 322580200 306539634
10318C06539634j2155133M097707J2386104Q077672j4174094m6461103o0587303
10311A97723484n0321862l3733738k1609169j4314723r905374p215684n572000
10304E5050934m449677l714373l154810k674026k232153j867982j468332j281869
10296C4207712j268884j142334j058684j024992r58143r37489j002951j066356
10288B5747879j087282j058543j078846j031876r47677q39852p72860p22496p15468
10279A7492979p20027o95063o49324n87244n35331n48990n35278n22701n42768
10270A2156253m54033m57975m04421l82015l27128l23144l08293k77303k75837
10261H946104k63656k37723j77596j74526j85947j71772j92656k09071j85754
$$ plain form
10318 306539634 294384501 298482208 310868312 318945984 304771890 258310787 197723484
10311 197723484 147401622 113667884 92058715 77743992 67838618 60622934 55050934
10304 55050934 50601257 46886884 43732074 41058048 38825895 36957913 35489581 34207712
10296 34207712 32938828 31796494 30737810 29712818 28754675 27817186 26814235 25747879
10288 25747879 24660597 23602054 22523208 21491332 20543655 19703803 18930943 18208447 17492979
10279 17492979 16772952 16077889 15428565 14841321 14305990 13757000 13221722 12699021 12156253
10270 12156253 11702220 11244245 10839824 10457809 10130681 9807537 9499244 9221941 8946104
10261 8946104 8682448 8444725 8267129 8092603 7906656 7734884 7542228 7333157 7147403
10252G147403j90733j72565j46777j37838j43849j85569j99692j63345j35490
10243E671545r9440r3403j01435j03320o8434n2429q5583p4769l5658j5046M1892
10232D983920M6835M3002P2567J00857J48144K52028L91985N86924Q11116J166034
10222H603412J791256K720836L927205N214341N876100N399127L735179O57762
10214C7925218l412246o243331o282006m762532l134702k025753j384995j062165
10206I617488q47147p53161o68839o05537m99456m00414l31727k78709k13096
10197E019402j76059j83522j95758j73646j62719j17823n6035o1027j20847j36488
10187C635478j35417j53440j58506j51802j37326j32503j39248j27146j39845
$$ plain form
10252 7147403 6956670 6784105 6637328 6499490 6355641 6170072 5970380 5807035 5671545
10243 5671545 5572105 5478702 5377267 5273947 5205513 5153084 5067501 4992732 4957074 4942028 4983920
10232 4983920 5030755 5073757 5146324 5247181 5395325 5647353 6039338 6626262 7437378 8603412
10222 8603412 10394668 13115504 17042709 22257050 28133150 33532277 37267456 37925218
10214 37925218 34512972 28269641 21987635 17225103 14090401 12064648 10679653 9617488
10206 9617488 8770341 8017180 7348341 6742804 6243348 5842934 5511207 5232498 5019402
10197 5019402 4843343 4659821 4464063 4290417 4127698 4009875 3953840 3892813 3771966 3635478
10187 3635478 3500061 3346621 3188115 3036313 2898987 2766484 2627236 2500090 2360245
10178B360245j24256j07527r0075o7692k1852m0377p7651r0307r5221q0791p4195
10167A490301r0866n9704k4263q8632n4631j6742m4920n6967o4454o5619n9385
10156H64118k4397l4842k4832j1682k2134o77L2346r784j4170J4537L0952M2405
10144H41840R7937J63854K22345K97716M10947M34097L98949K54848m1001l12073
10134B769459m28117l35605j98051j64363j87372j54183m3257J0258k3683j6795
10124A228291m2465q1242j09247j14923o5476m2630p7358q0901k2318l963k7640
10113E60128j3538k9133m2709k4664k1798j3743j8346j0894J987Q709j4986k1724
10101C59289j5847J3705J9576R696J9007j4778r168J1882M907r706J3743j821
$$ plain form
10178 2360245 2235989 2128462 2038387 1970695 1948843 1908466 1830815 1740508 1645287 1564496 1490301
10167 1490301 1399435 1339731 1315468 1226836 1172205 1155463 1110543 1053576 989122 923503 864118
10156 864118 839721 804879 780047 768365 746231 745554 777900 768116 753946 768483 799435 841840
10144 841840 939777 1103631 1325976 1623692 2034639 2468736 2867685 3122533 3081532 2769459
10134 2769459 2341342 2005737 1807686 1643323 1455951 1301768 1258511 1268769 1245086 1228291
10124 1228291 1185826 1104584 995337 880414 814938 772308 694950 614049 591731 587768 560128
10113 560128 546590 517457 474748 450084 428286 414543 396197 385303 387290 395999 381013 359289
10101 359289 343442 357147 376723 386419 405426 390648 381480 393362 398269 388563 402306 400485
10089D00485k6955q293O141p644j1548K2190J7358J8657m443n0604J766M4570
10077D01680K8818M979o321L2005O3621N0505M3502J9915O4431Q2104P8523K4864
10065H88626q2355r5847r2846j04487q6502r1560n3796n5370j4184P188l914j614
10053B13339j7981m6827k3069M917r44L0592J3678j7484k9470j8727l441J2337
10041A16920N975o414M9k4446J6321J2995P29o271o781o179L143j1437J1880j114
10027A05370K3728M6169L864j1892n6638k9406J9512j6094l3494k8964j4621J1916
10015A9450K6361K3899L274N237j8381j551k4458J341j5951l1145k4559j0112
10003d6595J1640j8502j045n411k1276j9057l8529P132K2505O835J0297L0095
$$ plain form
10089 400485 373530 365237 371378 363734 352186 374376 391734 410391 405948 355344 357110 401680
10077 401680 430498 435477 429156 461161 524782 575287 618789 638704 703135 785239 863762 888626
10065 888626 806271 710424 617578 513091 426589 335029 281233 225863 211679 218867 214953 213339
10053 213339 195358 148531 125462 130379 129435 160027 173705 156221 126751 108024 104583 116920
10041 116920 122895 116481 116530 92084 108405 121400 122129 115858 109077 102898 106041 94604 106484 105370
10027 105370 129098 175267 179131 167239 110601 81195 100707 84613 51119 22155 7534 19450
10015 19450 45811 69710 72984 78221 59840 58289 33831 35172 19221 -11924 -36483 -46595
10003 -46595 -34955 -53457 -54502 -59913 -81189 -100246 -138775 -131643 -109138 -102303 -92006 -61911
9991f1911r960n885N9411p486l7799J931r630K4975J7344p442j2208P691K3869
9978a7100k8852j8360J8685K1859K0879N816j3624j7595N687J2525K4740R568
9966B4228L277j6262j9986k4523l7059R699J1548K7726M108J2456j913k6642o81
9953c4024J4353M603J1357O891p062O235r982k2381p149j5415J0134K9233J3314
9940A07K37l25l981r976k2431R744J5291r869j4494J988r884k258M2549M0209
9926C6907K1602r492J8696K342J334M8660Q4062P0603J35754J91970K40281K64949
9914A107668K56357K28018J13160M16r4129n5948K3404N0614l260j25234k70318
9903A230748k84404k35158j56352j19879j06751m0224j3825J150j1269k3729k0391
$$ plain form
9991 -61911 -71871 -77756 -18345 -25831 -63630 -61699 -71329 -46354 -29010 -36452 -48660 -40969 -17100
9978 -17100 -45952 -64312 -45627 -23768 -2889 2927 -10697 -28292 -22605 -10080 14660 24228
9966 24228 27505 11243 -8743 -33266 -70325 -60626 -49078 -21352 -17244 -4788 -6701 -33343 -34024
9953 -34024 -19671 -15068 -3711 3180 -3882 2353 -7629 -30010 -37159 -52574 -42440 -13207 107
9940 107 344 19 -3962 -13938 -36369 -26625 -11334 -21203 -35697 -33709 -43593 -45851 -3302 36907
9926 36907 58509 49017 67713 70055 71389 120049 204111 274714 410468 602438 842719 1107668
9914 1107668 1364025 1592043 1705203 1705619 1611490 1555542 1578946 1629560 1626300 1501066 1230748
9903 1230748 946344 711186 554834 434955 328204 287980 274155 275305 264036 240307 219916
9892B19916l0491j4943j695j549K612j8845k2581L651k2909l2092M584q601j3629
9879F3428j9096j2872k1750q31L7031L4533j693n508K643k4071n8707l0708p53
9866c8354J0131J369J1697N137J1325j4440N525K1370K2478K081q015N715k7089
9853H930j4211J2313J542l570M991q230j8973k8946j2055J2403K0393K6144J4617
9840A5348J3855M576K228j5870j5730J9647j462k7650k9431l5987L716L4237L2212
9827c11O256K991N193n6992J8571K1130R668K208m0848j8676N673R02L9178L8170
9813C3113k0413r518j0220k213k587Q343n7638j0904L8111J5648J5831Q175K3277
9800B9005J5167M632R285M0939M569K8638P831n0051m972j2250j3115j1718k3638
$$ plain form
9892 219916 189425 174482 172787 171238 173850 155005 132424 136075 113166 81074 85658 77057 63428
9879 63428 44332 31460 9710 8879 45910 80443 78750 73242 75885 51814 -6893 -37601 -38354
9866 -38354 -28223 -26854 -15157 -10020 1305 -13135 -7610 13760 36238 38319 30304 36019 8930
9853 8930 -5281 7032 8574 5004 9995 1765 -17208 -46154 -58209 -45806 -25413 731 15348
9840 15348 29203 33779 36007 20137 4407 24054 22592 -5058 -34489 -70476 -66760 -32523 -311
9827 -311 5945 8936 14129 -42863 -24292 -3162 6506 8714 -32134 -50810 -45137 -44235 -5057 33113
9813 33113 12700 3182 -7038 -9251 -11838 -3495 -61133 -72037 -33926 -18278 -2447 5728 29005
9800 29005 44172 48804 58089 99028 103597 132235 140066 90015 85043 72793 59678 47960 24322
9787B4322j9782Qn466K0914j8157l0612j0512J4656N039R76j1405N706j132k5403
9773e0848J7670L316n766K5128k0137j8796K0067L237j9055j3640J580L8210K6766
9760G732J084j3300N216J2297r829m5522j7776J3130K7673J215m85k0303n026
9747d3894L5780L3692J3830J1241K8620M1433N6314L4222N829k2407l3488n5118
9735A06054l7388L276J343j7689j3788k0362P802k497P7p858k3772j1408n662
9722b1872L3188j1125l2842K971Q779l413O101J0094J4919M285n599q397q840
9709a1751k226n901m397j1952j2881J7777K5814K1101O719R668r732l3758k6471
9696c7990L1306K4428j7640k3592j8841L472r865m0207J0195L9972J2072M629
$$ plain form
9787 24322 4540 4548 -918 19996 1839 -28773 -39285 -24629 -19590 -18614 -30019 -24313 -25445 -50848
9773 -50848 -33178 -29862 -35628 -10500 -30637 -49433 -29366 -26129 -45184 -58824 -57244 -19034 7732
9760 7732 8816 -4484 732 13029 3200 -42322 -60098 -46968 -19295 -18080 -18565 -38868 -43894
9747 -43894 -8114 25578 39408 50649 79269 120702 177016 211238 217067 194660 161172 106054
9735 106054 68666 71942 73285 55596 41808 21446 29248 26751 26828 18970 -4802 -16210 -21872
9722 -21872 11316 191 -32651 -29680 -20901 -24314 -18213 -8119 6800 11085 5486 -2911 -11751
9709 -11751 -13977 -19878 -24275 -36227 -49108 -31331 -5517 15584 22303 31971 22239 -11519 -37990
9696 -37990 -6684 17744 104 -23488 -42329 -38857 -48722 -88929 -78734 -38762 -26690 -22061
9684b2061l087k6217k2865P712N335L4427j1609j7508P130j6147O051K8218Q025
9671b2596l036J100k4001j5991J2199o40K7683m997j4772j774j7057r380j3729
9658h6991o047N2119K5374J264k0013l1399J7129K0270M156J0297l5356K1652
9646b7545o035Q240J4679p62R669k7376l4042k2237p397J8455M4970J8909J4614
9633D142J3855k088k2879n460L2097j57j1931K4589l706j7806N105K7504j7218
9620B6047k8066J7234K5117j7985J2193p712k6967k4117j4372k3340l244J7695
9608d7517L16R675J6302J8907J633J3126Q604N768j3448p669K637n945M106k114
9594D381p52J6129k5275j6350N477q869k1369j2789M399m175J6210O417j6651
$$ plain form
9684 -22061 -25148 -51365 -74230 -66518 -61183 -26756 -38365 -55873 -48743 -64890 -58839 -30621 -22596
9671 -22596 -25632 -24532 -48533 -64524 -52325 -52965 -25282 -30279 -45051 -46825 -63882 -73262 -86991
9658 -86991 -93038 -40919 -15545 -14281 -34294 -65693 -48564 -28294 -24138 -13841 -49197 -27545
9646 -27545 -33580 -25340 -10661 -11423 -1754 -29130 -63172 -85409 -92806 -74351 -29381 -10472 4142
9633 4142 17997 15909 -6970 -12430 19667 19510 7579 32168 28462 10656 15761 43265 26047
9620 26047 -2019 15215 40332 22347 34540 26828 -139 -24256 -38628 -61968 -65212 -47517
9608 -47517 -47201 -37526 -21224 -2317 -684 12442 21046 26814 13366 5697 8334 2389 6495 4381
9594 4381 3629 19758 -5517 -21867 -16390 -25259 -46628 -59417 -55018 -59193 -42983 -36566 -53217
9581e3217j4414J3323L5162O51J8033l573k2021n286j3358L7965J9984K0434k17
9568C3466l0916m0075O462L6112J5773o374M230j0391j0453k5051m277N5211J0948
9555C4665L438l4758m0306Q790J3099k0337j9972p868K1068N529n71J0868k3450
9542d9805k7902K0056Q962l761N006J9318K6014J2877n999j4988M057j1855J634
9529a6386J1848R335j0258k1704R89o737J2140M1627l006j8020j2611j2970O492
9516a9261K2235n498K2146j2855k6886K239J985q600Q376j2985K0027K1300k7581
9503a5358l2375o274k923m396J5740L3093J7426k139l272j6207K1749j988j4641
9490a1565l223J4791n517M136k875R252r998M852R929j2818j5052j7973L1115
$$ plain form
9581 -53217 -67631 -54308 -19146 -18495 -462 -4035 -26056 -31342 -44700 -6735 13249 33683 33466
9568 33466 2550 -37525 -31063 5049 20822 14448 18678 8287 -2166 -27217 -31494 23717 34665
9555 34665 38103 3345 -36961 -28171 -15072 -35409 -55381 -63249 -42181 -36652 -37223 -26355 -49805
9542 -49805 -77707 -57651 -48689 -52450 -47444 -28126 -2112 10765 4766 -10222 -6165 -18020 -16386
9529 -16386 -4538 4797 -5461 -27165 -26176 -32913 -20773 20854 17848 -172 -12783 -25753 -19261
9516 -19261 2974 -2524 19622 6767 -20119 -17880 -15895 -24495 -16119 -29104 -9077 12223 -15358
9503 -15358 -47733 -54007 -56930 -61326 -45586 -12493 4933 2794 -478 -16685 5064 3076 -11565
9490 -11565 -14788 3 -5514 -1378 -4253 4999 -4999 -147 9782 -3036 -18088 -36061 -4946
9477d946K2731J9513k2516k9896J4802M0640j170k1181J2228Q017P372M662p605
9464D2651k0215p805k4484K4735J5992j2021p695q019j4452J3548r710O233O714
9451E472O761k4355J4671O608J2673j5055K5219j2962j8792j9267Q520K2499J07
9438A2099J0908j5563o89J577j8136O629K22j521j6245J9645K8462q312N249K4372
9424D8697K951k308O578j7094l4652k089J0757R637K967n423J9487J0609J3545
9411F3662J2859j0797k0013m910o864k0472k8190p527r184l0736j0199J3378K3918
9398c5075J4639k732L697l3359J2340M7742K3080j7622q945J5714j0717p922J4101
9385A4941J0619p813j9525K0647J4506j8529l0101j342k411J2954J5552p549k6050
$$ plain form
9477 -4946 17785 37298 14782 -15114 -312 40328 39158 17977 30205 38222 45594 50256 42651
9464 42651 22436 14631 -9853 14882 30874 18853 11158 3139 -11313 2235 -7475 -1242 5472
9451 5472 12233 -12122 2549 9157 21830 6775 31994 19032 240 -19027 -10507 11992 12099
9438 12099 23007 7444 6755 8332 -9804 -3175 -2953 -4474 -20719 -1074 27388 19076 24325 48697
9424 48697 51648 49340 55918 38824 4172 2083 12840 22477 25444 20021 39508 50117 63662
9411 63662 76521 65724 45711 40801 33937 13465 -14725 -22252 -31436 -62172 -72371 -58993 -35075
9398 -35075 -20436 -23168 -19471 -52830 -40490 7252 30332 12710 3765 19479 8762 840 14941
9385 14941 25560 17747 -1778 18869 33375 14846 -15255 -16597 -19008 -6054 9498 1949 -24101
9372b4101p133L2427J7018r634l4146l0303J7383K3427J5337k260k2159J4627
9360i517M005k3773J6253M2536J1491p495k1609k550K214O501j361J7016J9093
9347E2804M256k9437J506j786p56j012K0106k0128j2622k7378K295K8772K6677
9334D3297M1495K0089l3892m689k2328l6954o298J7027K1203K00j7615k6217n227
9321i909M928l143P137J3393p31N286k192K9318l053J7889L116n181n307j1142
9307D0409j6253K623r200l6615L1446J5779M958j2725k2990j474R384P347L3168
9294D5857K4244j2684K624j0993m124l547j3429O469J5883q641l0216J1458J7052
9281C9953K4558J5209k606k5445m0896j5181K3439J5024J918l944j563k4345k8237
$$ plain form
9372 -24101 -31234 1193 18211 8577 -25569 -55872 -38489 -15062 275 -1985 -24144 -9517
9360 -9517 -5512 -29285 -13032 29504 40995 33500 11891 9341 11555 18056 16695 33711 52804
9347 52804 57060 27623 29129 27343 26587 25575 45681 25553 12931 -14447 -12152 16620 43297
9334 43297 84792 104881 70989 66300 43972 7018 720 17747 38950 39150 21535 -4682 -9909
9321 -9909 -4981 -8124 -987 12406 11675 16961 14769 44087 41034 58923 62039 56858 51551 40409
9307 40409 24156 26779 17579 -19036 12410 28189 33147 20422 -2568 -4042 5342 12689 45857
9294 45857 70101 57417 60041 49048 44924 41377 27948 34417 50300 41659 11443 22901 39953
9281 39953 64511 79720 77114 51669 10773 -4408 19031 34055 35973 32029 30466 6121 -22116
9268b2116J0968K3833M99J6337K7773k2580J5935l461l733N791O458J2246N059
9255G3009N452l5601j4731r871J5233J5980n85l0086R949K1130m186n015j1080
9242B9598K2142K7596K6012J5382k2663j8362j8645j5300r177q083J4115L5653
9230G8268P467J0052J0307k8185j4493J8624L4918M024j3869k0922j7735j1981
9218E6475j450Q950J1238R300J1250K2203p30K577L068j3782J82J9344j122R582
9204A37085o290j6141j4612j0313m229K1138J8161K5789J9263j5680p288R694
9192A56577j8818O681L0k0490l6870j7219K7245P745r721K1794M31J3934j204
9179A30115J9332p470l8085l9702j059P260K2990J0527k6368q198J8147J7138
$$ plain form
9268 -22116 -11148 12685 13184 29521 57294 34714 50649 47188 43455 49246 55704 67950 73009
9255 73009 78461 42860 28129 18258 33491 49471 48886 18800 28749 49879 45693 40678 29598
9242 29598 51740 79336 105348 120730 98067 79705 61060 45760 36583 28500 42615 78268
9230 78268 85735 95787 106094 77909 63416 82040 116958 120982 107113 86191 68456 56475
9218 56475 55025 63975 75213 84513 95763 117966 117236 119813 122881 109099 109281 128625 127503 137085
9204 137085 130795 114654 100042 89729 85500 106638 124799 150588 169851 154171 146883 156577
9192 156577 137759 144440 144470 123980 87110 69891 97136 104881 95160 116954 117385 131319 130115
9179 130115 149447 141977 103892 64190 63131 70391 93381 103908 77540 69342 87489 104627
9167A04627K528j7467o585J0968K2644J7915k8155k3290o481J5565M049l533j6511
9154G6274K6149k058J2827J8451J2681J0364O193P141l4193j2204J3527j3084
9142A22068j7395q59Q221j528J9776K878l301k7088j7130K0779o561r192J7666
9129A08334K5107P915j2207k3985o884M19k0333k6709R658K991R091J1912l10
9116H4999l694j0752n312J849J3810P004J3471j963M014P279m722p4J386N296
9102A12591J0057j2944k1337n749J1162L0289L1341J1590j7712m2968l901o934
9090I5485P281l656Q862l1253K4334L0415L1406p277O441k0414p197k698o066
9077A25663p627K1829J4429r784k7722k273M938L957j6894l4000j7307L798J8649
$$ plain form
9167 104627 107155 89688 83103 94071 116715 134630 106475 83185 76704 92269 96318 92785 76274
9154 76274 102423 100365 113192 131643 144324 154688 160881 168022 133829 121625 135152 122068
9142 122068 104673 103814 112035 110507 130283 133161 129860 102772 85642 106421 99860 90668 108334
9129 108334 133441 141356 129149 105164 98280 98699 78366 51657 61315 64306 73397 85309 84999
9116 84999 81305 70553 65241 67090 80900 87904 101375 99412 103426 110705 105983 105909 107295 112591
9102 112591 122648 109704 88367 82618 93780 124069 155410 167000 149288 106320 102419 95485
9090 95485 102766 99110 107972 76719 101053 131468 162874 155597 162038 141624 134427 131729 125663
9077 125663 118036 139865 154294 144510 116788 114515 119453 123410 106516 72516 55209 59007 77656
9064G7656K1292L209p214J3964K2632k0679J1310L6448J3899K1469R368j1002
9052A92352r566K4692O429m3887k3245j9794l410M0163K3724j2325o042j8749
9040A50342M389K47j9113l9438j586N3286K4237p423M453j1440l4408m803J5047
9027A33790J3782j7310k51j069j4596P21n341j4500M386l887J8528L4498L1260
9014A80011K1028m97o154l93j9107k7173R646M7815J3282j7318p747N356J5481
9001B14230L4439l1413l9937Q407R677k3265k5252Q919n011K0301K5458n137j2044
8988A79372J4899m716l909L136Q751J0434R037j5287l7796j3501K9231N4157j1785
8975B22023l8804k5775O573L3127K1175j697j4359j5284J7961r56j1797J6997
$$ plain form
9064 77656 98948 102157 94943 108907 131539 110860 122170 158618 172517 193986 203354 192352
9052 192352 182786 207478 213907 170020 146775 126981 123571 163734 187458 175133 169091 150342
9040 150342 154731 154978 135865 96427 94841 148127 172364 164941 169394 157954 123546 118743 133790
9027 133790 147572 130262 130011 128942 114346 115067 109726 95226 99612 95725 114253 148751 180011
9014 180011 201039 200542 194388 193995 174888 147715 157361 205176 218458 201140 193393 198749 214230
9001 214230 248669 217256 177319 185726 195403 172138 146886 155805 150794 171095 196553 191416 179372
8988 179372 194271 189555 185646 188782 197533 207967 217004 201717 163921 150420 179651 233808 222023
8975 222023 183219 157444 164017 197144 218319 216622 202263 186979 204940 203984 192187 209184
8963B09184M3717l64K3711J1448j4381l2728k8915J582k2990j3371J0750N2067
8951B39710K2914m719l4021N711j3319j2609l545J3837j7394L524K5223K9843
8939B55155K4571J6180j4594m6477j9499J6025L361n265m529J3979K6680k5630
8927B39957O877m159L326J705j1250J1633J5660j6731l7558J1133L0172L313O531
8914B60609Q440L113J047l4493j637J2510K0083K764j7292k43J1685K9013K302
8901B97901O816l069j881J9573L0842N99r146L1666K3436K0255Q3569O6607N1332
8888F18500J8970o3410q3925m7802l3538q203l0920m0425L056J4404J8056J6973
8876C81736J0913L3306J7666r128M067j0313n711j2310m1947j9242J8070p710
$$ plain form
8963 209184 252901 252537 276248 287696 273315 240587 211672 213254 190264 176893 187643 239710
8951 239710 262624 257905 223884 229595 216276 203667 200122 213959 196565 200089 225312 255155
8939 255155 279726 295906 281312 234835 215336 231361 234722 229457 224928 238907 265587 239957
8927 239957 246834 242675 246001 247706 236456 248089 263749 247018 209460 220593 250765 254078 260609
8914 260609 269049 272162 273209 238716 237079 249589 269672 272436 255144 254901 266586 295599 297901
8901 297901 304717 301648 299767 319340 350182 350781 341635 373301 396737 416992 500561 567168 618500
8888 618500 637470 574060 490135 442333 408795 400592 369672 329247 332303 346707 364763 381736
8876 381736 392649 425955 443621 434493 438560 428247 422536 410226 368279 349037 367107 359397
8864C59397Q129K4347M627k2911j0833K882j1847J2986J9214R85J7385L215j6852
8851C90724j9164J2366L1028J5640m6587r128K9324Q784M527j0026j2756j06J578
8838C96204k37J1563k857p752K3718j9634j1257j1316K0269J2138J0241q647J8014
8825D30447L8443j589Q728j5475l1334k9870r94N46L915M195j1660J4977k3394
8812C86935J0770L0609L7796n770p082K9594K1925Q486J4976o992K1326k439l6644
8799E03490o475J8967J5558l955j512K0279R333P759Q13n451k252J3446J25J6080
8785E86205l931m914R473O363K1990m481q861L035k9255L546J6283K4403J9821
8772F39677N336K5802O478k14J612K0216J0914l098K6070J8684l0303K846l817
$$ plain form
8864 359397 367526 391873 396500 373589 362756 365638 353791 366777 385991 386976 404361 407576 390724
8851 390724 371560 383926 414954 430594 384007 374879 404203 412987 417514 407488 394732 394626 396204
8838 396204 395967 407530 404673 396921 420639 401005 389748 378432 398701 410839 421080 412433 430447
8825 430447 468890 467301 476029 460554 429220 399350 398356 398902 402817 407012 395352 410329 386935
8812 386935 397705 428314 466110 460340 453258 482852 504777 513263 528239 521247 542573 540134 503490
8799 503490 497015 515982 531540 527585 526073 546352 555685 563444 564257 558806 556554 570000 570125 586205
8785 586205 582274 577360 586833 593196 615186 610705 601844 604879 575624 579170 595453 619856 639677
8772 639677 645013 670815 677293 677079 678691 698907 709821 706723 732793 751477 721174 724020 720203
8759G20203P689J6674r868j2562O12p41J0723L9512M0052J0739N471l335J6316
8746H41485N461Q207M145L2744J9389k2918l4194n128K2494j0670L839J0978J0145
8733H85977j5494K9381N7913J0822o38K8057K2494k6061q15L1700k839J552K3020
8720A045069M7649J4903P853Q966j0598L248J1915L9819O172j1805J125J5970
8708A180286R968m685J2819K7263K3695L2856J4963Q445l1849j5634J9031K8005
8696A305163N7251L4481J4157r840K4187M6262J7752K3598M7509J7432J1324n786
8684A583490k4700K728M5484N3156M157J405M5554K8733J5615J5074L7031K5171
8672A832898N3586K427K6347L1140L4175J1602K5034N4471J7594L7395J2634K4843
$$ plain form
8759 720203 727892 744566 734698 722136 722748 722007 732730 772242 812294 823033 828504 825169 841485
8746 841485 846946 855153 859298 892042 911431 888513 854319 849191 871685 861015 864854 875832 885977
8733 885977 870483 899864 957777 968599 967961 996018 1018512 992451 991636 1023336 1020497 1022049 1045069
8720 1045069 1092718 1107621 1115474 1124440 1113842 1117090 1129005 1168824 1174996 1163191 1164316 1180286
8708 1180286 1190254 1185569 1198388 1225651 1249346 1282202 1297165 1305610 1273761 1258127 1277158 1305163
8696 1305163 1362414 1396895 1411052 1401212 1425399 1471661 1489413 1513011 1560520 1577952 1589276 1583490
8684 1583490 1558790 1561518 1607002 1660158 1664315 1665720 1711274 1740007 1755622 1770696 1807727 1832898
8672 1832898 1886484 1888911 1915258 1946398 1980573 1992175 2017209 2071680 2089274 2126669 2139303 2164146
8660B164146M1255J9666L8225O919K7060P2659L6881L2103J9510M4517L9689O159
8648B548789K9482M6629N9985N3153L8101N4916L3211K8035M8824N3119M2684
8637C036928Q614M3237P4647P0268O0351O2663Q6470N5155P7205L7844O9358P7075
8625C759815P0336L7755L1473P0895Q8369N7121P8377P5150Q9137J15056P2916
8614D546400M3790Q9975J41844J04793P2134Q0558R3521R0320O0649J04869J37177
8603E566030J22445Q9504R0453J07541J46483J30383J09754J31236J26591J39623
8593F760043J14083R6342J22358J37051J47516J42737J23367J33764J78265J47600
8583H103126J66732J88952J74537J28281J54239J52923J71174J88875J85424K03497
$$ plain form
8660 2164146 2205401 2225067 2263292 2270211 2297271 2369930 2406811 2438914 2458424 2502941 2542630 2548789
8648 2548789 2578271 2624900 2684885 2738038 2776139 2831055 2864266 2892301 2941125 2994244 3036928
8637 3036928 3045542 3088779 3163426 3233694 3294045 3356708 3443178 3498333 3575538 3613382 3682740 3759815
8625 3759815 3830151 3867906 3899379 3970274 4058643 4115764 4194141 4269291 4358428 4473484 4546400
8614 4546400 4590190 4680165 4822009 4926802 4998936 5079494 5173015 5263335 5323984 5428853 5566030
8603 5566030 5688475 5777979 5868432 5975973 6122456 6252839 6362593 6493829 6620420 6760043
8593 6760043 6874126 6970468 7092826 7229877 7377393 7520130 7643497 7777261 7955526 8103126
8583 8103126 8269858 8458810 8633347 8761628 8915867 9068790 9239964 9428839 9614263 9817760
8573I817760K07132K03414J85656J96048J59896J06918J44833J78370J42566J16187
8563A1458780J34452J74385J96249J64964J60428J53801J35475J22448J39870
8554A2840852J26156O8889N4494R6297J24390O9751N4238M2078P876L7266K9712
8543A3551999J311L2688r328l3154k2889j309l3325o3103n9428q8020p4777p1550
8531A3129115p0377q0480j00604j23058j42070j46418j34632j31649j22755j52519
8521A1924553j51036j65504j49977r7068j27533j45570j69301j70695k12729j55341
8511A0379799j36565j42015j58711j79173j48698j63789j81360j61593j38640
8502H969255j33313j65961j55936j25049j34360j61213j18075j07056j15612j39835
$$ plain form
8573 9817760 10024892 10228306 10413962 10610010 10769906 10876824 11021657 11200027 11342593 11458780
8563 11458780 11593232 11767617 11963866 12128830 12289258 12443059 12578534 12700982 12840852
8554 12840852 12967008 13035897 13090391 13186688 13311078 13380829 13435067 13477145 13485021 13522287 13551999
8543 13551999 13553310 13585998 13576670 13543516 13520627 13519318 13485993 13422890 13363462 13275442 13200665 13129115
8531 13129115 13058738 12978258 12877654 12754596 12612526 12466108 12331476 12199827 12077072 11924553
8521 11924553 11773517 11608013 11458036 11360968 11233435 11087865 10918564 10747869 10535140 10379799
8511 10379799 10243234 10101219 9942508 9763335 9614637 9450848 9269488 9107895 8969255
8502 8969255 8835942 8669981 8514045 8388996 8254636 8093423 7975348 7868292 7752680 7612845
8492G612845j23215r9052j26851j39341j28146j23885j33329j26980j09126j18330
8482F384590j07643q7814j02632r9586j10423j32778o9205p4227j02336r8905
8472E399041r8910j10197j07117o3607j02969q4312p5822p7070p3064q0205q9783
8461D435985n4928q4427j09705m0871m1797q8308n9971n8115q1729o7736m8335
8450C700063n6390m2657q2111p1877m1766k6512l2296n4285n9374l6818o2893
8439C133084p1031k6108m1027o2362k3068l5610n9390l9352j8398m6470n9924
8428B650344l7572k0566m6313k5885p1327o2455l4566j3971l4307m8101l7610
8417B217671j9459l6888m3494k0920q257j6838l6030l5186j3758l7645m5331l9467
$$ plain form
8492 7612845 7489630 7390578 7263727 7124386 6996240 6872355 6739026 6612046 6502920 6384590
8482 6384590 6276947 6189133 6086501 5986915 5876492 5743714 5674509 5600282 5497946 5399041
8472 5399041 5300131 5189934 5082817 5019210 4916241 4831929 4756107 4679037 4605973 4525768 4435985
8461 4435985 4381057 4296630 4186925 4146054 4104257 4015949 3955978 3897863 3816134 3748398 3700063
8450 3700063 3643673 3601016 3518905 3447028 3405262 3378750 3346454 3292169 3232795 3195977 3133084
8439 3133084 3062053 3035945 2994918 2932556 2909488 2873878 2814488 2775136 2756738 2710268 2650344
8428 2650344 2612772 2592206 2545893 2520008 2448681 2386226 2351660 2337689 2303382 2255281 2217671
8417 2217671 2198212 2161324 2117830 2096910 2088653 2071815 2035785 2000599 1986841 1949196 1903865 1864398
8405A864398j4925k7813Q18q614j043m4807l5562o272j5424j3914n0017l9731
8393A607094j4470k2276p422j1522j2946l5018J188k5038q391M08J578j4128l1261
8380A427796k5396j9917k0000n2029k6259K942m099l738J4069l0743j4961j9826
8368A227839l1715q845m927l6663m6507j6995m906q86j3309p608m622m4503l7639
8355I68714K0887J2019J234K255K7996j4305l4315k6703j1266k7226k1419J1470
8343I09341k3292j5188q896k7375K925k813n657L196L39k4947l975j1140J3681
8330H06199J1081l390j3161j3939q298r929j2341m21q642j4034k9303n3182J59
8317F50799M479j4877O37J3357L387K781l265N072R841r731O050K0528o730l8305
$$ plain form
8405 1864398 1849473 1821660 1822478 1813864 1812821 1768014 1732452 1726180 1710756 1696842 1646825 1607094
8393 1607094 1592624 1570348 1562926 1551404 1538458 1503440 1504628 1479590 1471199 1471607 1473185 1459057 1427796
8380 1427796 1402400 1382483 1362483 1310454 1284195 1287137 1283038 1279300 1293369 1262626 1247665 1227839
8368 1227839 1196124 1187279 1182352 1145689 1099182 1082187 1077281 1076395 1063086 1055478 1050856 1006353 968714
8355 968714 989601 1001620 1002854 1005109 1033105 1018800 984485 957782 946516 919290 897871 909341
8343 909341 886049 870861 861965 834590 837515 834702 829045 832241 832580 807633 803658 792518 806199
8330 806199 817280 813890 800729 786790 778492 768563 756222 755801 747159 733125 703822 650640 650799
8317 650799 655278 640401 641038 654395 657782 660563 657298 662370 672211 662480 668530 689058 682328 644023
8303F44023m419L6797O9089M5990N0351J01382J06341P6377N9366K4541l0347
8292A179491j25571j52203j02149q8769p5513j1802k32k4426j0092J9907j6835
8281E91806j3639M866k40r997j593j198k8816j7871J7918M433J24k3294l4473
8268D88026j7532J2665K4419L28J2028L855j1640J0557O576J3462K4122O0904
8256F27770J29162J10538R3022Q5936j7409r7487j46520j09495p1763m3672l2183
8245E27899l5559k6045L944l333K1299j980j3433n7009k4430O831j5034P835P669
8232C98654j3823K086j2984J716R930K4289K1328o089k0685k1101k2433j626l0802
8219C28460r907Q770q429o828L142o673j0985m30n018j2889J0805j3060j8994
$$ plain form
8303 644023 639604 676401 745490 791480 841831 943213 1049554 1125931 1185297 1209838 1179491
8292 1179491 1053920 901717 799568 710799 635286 623484 623252 598826 588734 608641 591806
8281 591806 578167 583033 582793 572796 571203 570005 541189 523318 541236 545669 545793 522499 488026
8268 488026 470494 483159 507578 507906 519934 523789 512149 522706 529282 542744 566866 627770
8256 627770 756932 867470 960492 1046428 1029019 931532 785012 675517 603754 560082 527899
8245 527899 492340 466295 470239 466906 488205 486225 472792 415783 391353 398184 383150 390985 398654
8232 398654 384831 386917 373933 375649 385579 409868 431196 425107 404422 383321 360888 359262 328460
8219 328460 318553 327323 318894 312066 315208 308535 297550 297120 292102 279213 290018 276958 257964
8206B57964M580J5326o973q917j430j5729n678J4115J9441J3816J3813J0785k0818
8193B90295j6612J1971K220J0989J0518R7j8457j9190j1752l6556j5646r27J7242
8180B24192M934k3304k5313k2670M0631J4757k470K745J0314K035j1759r508O181
8167B10765K0624k561j9226n753J7856k7513J5623K8808J9131j3778J3485l8944
8155B18517o3009l4836Q881J2944K4250J6616q984J3442K6268j8434k4803k3390
8143A47462k640J006m075l552P877M229J2350J5571M9137K5168l042k6552k0863
8130B02076k8583m546J078J7547N567j0488j0587j8072j4794L2883N0293N55j2488
8117B10441j9775o285n964j5761J324j5043J1711k920P120P050j9439J1467j9806
$$ plain form
8206 257964 262544 277870 270897 261980 260550 244821 239143 253258 272699 286515 300328 311113 290295
8193 290295 273683 285654 287874 298863 309381 309478 291021 271831 260079 223523 207877 206950 224192
8180 224192 229126 205822 180509 157839 198470 213227 210757 213502 223816 225851 214092 204584 210765
8167 210765 231389 228828 209602 203849 221705 194192 209815 238623 257754 243976 257461 218517
8155 218517 155508 120672 129553 142497 166747 183363 174379 187821 214089 195655 170852 147462
8143 147462 144822 145828 141753 138201 146078 150307 162657 178228 227365 252533 249491 222939 202076
8130 202076 173493 168947 170025 187572 193139 182651 172064 153992 139198 172081 222374 222929 210441
8117 210441 190666 184381 178417 162656 163980 148937 160648 157728 164848 171898 152459 163926 144120
8104A44120l6138j5028L2920M6857j1229L163o84l3005o484K3223j3309j2393
8092A22013K2123o803k4678p380O156K4424j5370p889R885K2573J5163l259q041
8079A48917o767r829J1769L0892K3642J818L1812M0232k0307k2246K372m611q971
8066B18723j8916j8478k6219l3736r721o991o639K3579Q774j0785N320k0552k463
8053A01896J8821J2144K6797R462j4706M958Q435J2250M03j8245k6514J5159J541
8040A52401l3928q276O30k788P733l2590K6415L4273j7843j927r159q000o389
8027A00552J7130k80L776K2851K7860L28r660n601o601o560r711Q701k5699j2261
8013A04825k1076k0965K6846m648j0574p608k7225j2683n542R664K7504K3877
$$ plain form
8104 144120 107982 92954 125874 172731 161502 164665 163981 130976 124492 147715 134406 122013
8092 122013 144136 137333 112655 105275 111431 135855 120485 112596 122481 145054 160217 156958 148917
8079 148917 142150 132321 144090 174982 198624 200442 232254 272486 252179 229933 232305 227694 218723
8066 218723 199807 181329 155110 121374 111653 104662 98023 121602 130376 119591 124911 104359 101896
8053 101896 120717 132861 159658 169120 154414 159372 167807 180057 180460 162215 135701 150860 152401
8040 152401 118473 110197 110827 108039 115772 83182 109597 143870 126027 124100 114941 106941 100552
8027 100552 117682 117402 121178 144029 171889 172217 162557 156956 150355 143795 134084 142785 117086 104825
8013 104825 83749 62784 89630 84982 74408 66800 39575 26892 21350 31014 58518 82395
8001H2395J5855k9608j1069J5651K1979Q487j1926J0972J3453j0024o254J5875
7989A15786j3464j5838k803J2479R776L882j2513k052J2486n388k8492N07K3676
7976I8042o343k7312K073K2471O321p785l836K5181M993k1403o883O162j7317
7963G4364j7503K558m615L644L5171L3527P017l2439k2785J3298j757j0309j122
7950G9049L6276o675m701R069j7091k6185r910K3326j9250l0324J6205K1519k9863
7937D1445m4287J8049M4883J4233j2145R388J4429J4688l7066j9701L183q789
7925C8310O769J668q592N756N157L12j224J781J1301p061m499l4923o623N0345
7911E8477K6935l9245l2506J0216K1149K865R877k033J1301k433j6546J3586K8597
$$ plain form
8001 82395 98250 68642 57573 73224 95203 103690 91764 102736 116189 106165 99911 115786
7989 115786 102322 86484 83681 96160 105936 109818 97305 95253 107739 102351 73859 74366 98042
7976 98042 91699 64387 66460 88931 95252 87467 83631 108812 113805 92402 85519 91681 74364
7963 74364 56861 59419 54804 58448 93619 127146 134163 101724 78939 92237 90480 80171 79049
7950 79049 115325 108650 103949 113018 95927 69742 59832 83158 63908 33584 49789 71308 41445
7937 41445 -2842 15207 60090 74323 62178 71566 85995 100683 63617 43916 47099 38310
7925 38310 45079 46747 38155 43911 49068 49380 48156 49937 61238 54177 49678 14755 8132 58477
7911 58477 85412 46167 13661 23877 45026 47891 57768 55735 67036 64603 48057 61643 90240
7898I0240q891p950l5118k2668m182j737q156m072L722j328K6277K6710P648L1206
7884I1701Q74m3960j2397j2791j517J733j1363K0980J5316J5208J9284L1927k0384
7871I4611j6401j5621k6904J3229J685J583K4552q760l3428l0698j419K1290k0603
7858C116m709j0481k320K6309J8157L757j832r022j2727J899r113L030j3147l5117
7844d2200l252J6222J9109J650J867J8107L2042j6413k0565m1751j2185K8337
7832a9032l920r086P74L6713J7025n36J9443k5138j5508J5138J5343j389k5038
7819D789j8564j9040K4822L1417J360j260K6549O442j7638K52q091j6742k464
7806A1832K58n086J9611L7907j2417j8724j7108l604j8881j3480Q223K6306K5764
$$ plain form
7898 90240 81349 73399 38281 15613 11431 9694 1538 -2534 1188 -140 26137 52847 60495 91701
7884 91701 92575 48615 36218 23427 21910 23643 12280 33260 48576 63784 83068 114995 94611
7871 94611 78210 62589 35685 48914 50599 52182 76734 67974 34546 3848 2429 23719 3116
7858 3116 -1593 -12074 -14394 11915 30072 33829 31997 22975 10248 12147 3034 6064 -7083 -42200
7844 -42200 -45452 -29230 -10121 -8471 -6604 11503 43545 27132 6567 -35184 -47369 -19032
7832 -19032 -22952 -32038 -31264 5449 22474 21938 41381 16243 735 15873 31216 29827 4789
7819 4789 -13775 -32815 -7993 23424 24784 23524 50073 56515 38877 39129 31038 14296 11832
7806 11832 12090 7004 26615 64522 52105 33381 16273 12669 -6212 -19692 -11469 14837 40601
7793D0601q639l7889j6395R390J1671K640j2785k9275k868O972K4299J7713m901
7780E34l3931Q216j706L4435J5285L0506j2003l422J3250j1687p991j335l156
7767B6995K524Q080R52j6568N081J8188L2969J6087m5870k6361m986j5334J4495
7754A6252J5475J4913Q883J7973l405j8946k0699J0439j1259p155k3997j637j4638
7741a7801k0000O147j3944K5052J6816J4467j1771o482J4613Q616j4283o586R859
7728D703j0650J2465k0352K756J5305K7275j8200J4694J1097k7093k5321o193
7716a9514n502O683L687j372l2205J2517J7293r843Q595O572L3579J9950j9003
7703B1437k210Q29O226j4076k8368k374K6342l352k150L0794R959l887k9376j7183
$$ plain form
7793 40601 31962 -5927 -22322 -12932 -1261 1379 -11406 -40681 -43549 -36577 -12278 5435 534
7780 534 -33397 -25181 -26887 7548 22833 53339 41336 37914 51164 39477 31486 30151 26995
7767 26995 29519 37599 38551 21983 27064 45252 78221 94308 48438 22077 17091 1757 16252
7754 16252 31727 46640 55523 73496 70091 51145 30446 40885 29626 22471 -1526 -3163 -17801
7741 -17801 -37801 -31654 -45598 -20546 -3730 10737 -1034 -7516 7097 15713 1430 -5156 4703
7728 4703 -5947 6518 -13834 -11078 4227 31502 13302 27996 39093 12000 -13321 -19514
7716 -19514 -25016 -18333 -14646 -16018 -48223 -35706 -18413 -28256 -19661 -13089 20490 40440 21437
7703 21437 19227 20056 26282 12206 -16162 -18536 7806 4454 2304 33098 43057 39170 9794 -7389
7689g389J432M0326J8142o093N682p720l1170k5493Q365K2763P248Q055J5988
7676E0136P426j9602p703j0956P649j2689J5549p23n597k6742n619J1495k9934
7663b7310j7414L0833J8005L185K0424k820k4116J3604J8898p0l799k1868j0395
7650b843j6424l5966j6521M5902J6537p800J664P877K6512j1006L843K616l651
7637A0740j6538m099L2774K0260N786l4848j9374J7263K1804R400P474j6298j1226
7624B3118M049n28q896J9407J8778k6592l1598k56J508j5398m57J5465J6254J064
7610A5918l2037K954J1574O336Q430O67o238P750n564L855K745p788m9620k4412
7596f5430Q820K4801J2846P122J1612q171J424R895j4139k4055J0806n377J9452
$$ plain form
7689 -7389 -5957 34369 52511 46418 52100 44380 13210 -12283 -3918 18845 26093 34148 50136
7676 50136 57562 37960 30257 19301 26950 14261 29810 29087 23490 -3252 -8871 2624 -27310
7663 -27310 -44724 -13891 4114 7299 27723 24903 787 14391 33289 33219 29420 7552 -2843
7650 -2843 -19267 -55233 -71754 -25852 -9315 -17115 -15451 -7574 18938 7932 11775 14391 10740
7637 10740 -5798 -9897 22877 43137 48923 14075 -5299 11964 33768 43168 50642 34344 23118
7624 23118 27167 26639 17743 37150 55928 29336 -2262 -2518 -1010 -16408 -16865 -1400 14854 15918
7610 15918 -16119 -13165 -1591 4745 13175 13842 7604 15354 9790 13645 16390 8602 -41018 -65430
7596 -65430 -56610 -31809 -18963 -11841 -229 -8400 -6976 2919 -11220 -35275 -24469 -29846 -10394
7583a0394K6642J5763j924k0756K4325m839j2107j143P297j3817k0236j0649j0820
7570c2658J1302k313j9502l340K6486K0546N948j6377k6695N495J7152J6142M160
7557F346k2255L192L395k0356J8651K4289k755R297J440j7433j0368J828j3025
7544a7754K6132K7623P08k8501k4514m247r104K6043j833k8121J9987J7863j803
7531B479J4341O913L35m770j8089l5045k3219l413M798L6112J3718J3335q825
7518a330j1626r466N197M20O237k4005J2166p192K996m45n104J3844K5657R351
7504A6700o103K5503J1536m2844j3839r391j2783j9069n9P706K9587k411l6021
7491e1488n624L1067L1046j2667p261p074P612l378K5292P606J1204j105K4913
$$ plain form
7583 -10394 16248 32011 30087 9331 33656 28817 16710 15567 22864 9047 -11189 -21838 -32658
7570 -32658 -21356 -23669 -43171 -46511 -20025 521 6469 -9908 -36603 -31108 -13956 2186 6346
7557 6346 -15909 -12717 -9322 -29678 -11027 13262 10507 19804 21244 3811 -6557 -4729 -17754
7544 -17754 8378 36001 36709 8208 -16306 -20553 -29657 -3614 -5447 -33568 -13581 4282 2479
7531 2479 16820 23733 24068 19298 1209 -33836 -57055 -60468 -55670 -19558 -5840 7495 -1330
7518 -1330 -12956 -22422 -17225 -16805 -10568 -34573 -22407 -29599 -26603 -27048 -32152 -18308 7349 16700
7504 16700 10597 36100 47636 4792 -9047 -18438 -31221 -50290 -50349 -42643 -13056 -15467 -51488
7491 -51488 -57112 -26045 5001 -7666 -14927 -22001 -14389 -17767 7525 15131 26335 25230 50143
7478E0143j1154m8726r066l260J6739J978j2392o646R191j0115j598K5445m007
7465c468r506M870Q660K435J3230M702r418j568l6612k1916M2558J7566J9033
7452C0566J4708k1825k4865K798j0863k4031K604K665r789j4583K3449N604J3901
7439i661l281K082k0237O891J3018L886J0717J3906M659j9551r127J8326K3677
7426C5305P552j7421k2775j6537k140J4619j2595j1451J7374j340k5718J1424
7414b3703n706O113j4063K2231R218m842m0080Q654K3138Q944j1569R753J2466
7401E54j232k526o707P605J3100K1844o786j8464j1106Q887k1553p827o066l69
7387c0646K3374l545j7293r898k2673J9398q00j3919J0756N4852K3067J6516r690
$$ plain form
7478 50143 38989 -9737 -18803 -22063 -5324 -3346 -15738 -22384 -13193 -23308 -24906 539 -3468
7465 -3468 -12974 -8104 556 2991 16221 20923 11505 9937 -26675 -48591 -6033 11533 30566
7452 30566 45274 23449 -1416 1382 -9481 -33512 -30908 -28243 -38032 -52615 -29166 -23562 -9661
7439 -9661 -12942 -10860 -31097 -24206 -11188 -7302 3415 17321 21980 2429 -6698 11628 35305
7426 35305 42857 25436 2661 -13876 -16016 -1397 -13992 -25443 -8069 -9409 -35127 -23703
7414 -23703 -29409 -23296 -37359 -15128 -5910 -10752 -50832 -42178 -19040 -10096 -21665 -11912 554
7401 554 -678 -3204 -9911 -2306 10794 32638 25852 7388 -3718 5169 -16384 -24211 -30277 -30646
7387 -30646 -7272 -10817 -28110 -38008 -60681 -41283 -42083 -56002 -45246 9606 32673 49189 39499
7374C9499j6945J3793k956k6487k3312j507j1469q034J7669r473M362J8503M506
7361a851M981N543o653K328j9231j013J6811P031k729n93j3862p557M175m272
7347a6892K3634J26l2154k6203j5694k3820o861K2191L8213n077J0268n81j3354
7334d6204J1583J7589K0413J9960j8749r144j7976k2787O196K0570p500l4519
7322f0568P295j925r163L842j712q521R329K3288J0776k3447q90L4209k4967j9921
7308f2375K2837L2783O729n118K251o800j9720J8992M777p315j2129R884J7541
7295B337J2961m0257k6074o558Q320Q232L765J0337L0744M9967r109l9940l767
7282I58r254R136m186J7114L0848j5087k7000J6328J6578R925j8985m4235j7284
$$ plain form
7374 39499 22554 36347 33391 6904 -16408 -17915 -29384 -37418 -19749 -29222 -24860 -6357 -1851
7361 -1851 3130 8673 2020 4348 -14883 -15896 915 7946 5217 4624 -9238 -16795 -12620 -16892
7347 -16892 6742 6868 -25286 -51489 -67183 -91003 -97864 -75673 -37460 -42537 -32269 -32850 -46204
7334 -46204 -34621 -17032 3381 23341 4592 -4552 -22528 -45315 -39119 -18549 -26049 -60568
7322 -60568 -53273 -55198 -64361 -60519 -62231 -70752 -61423 -38135 -27359 -50806 -51696 -17487 -42454 -62375
7308 -62375 -39538 -6755 -26 -5144 -2893 -9693 -29413 -10421 -5644 -12959 -25088 -15204 2337
7295 2337 15298 -24959 -51033 -57591 -49271 -41039 -37274 -26937 3807 53774 44665 4725 958
7282 958 -8296 840 -3346 13768 44616 29529 2529 18857 35435 45360 26375 -17860 -35144
7269c5144n516Q152p988K958L826J1377k065j5905j6439k6812P547J5527J5185
7256d5297K8250M729k289M031r46N37j3386j1769K618K7368l2514P40K4059K226
7242a1643K4519o761q781p478m233K0471k3874R473j453l998M557l6093j9425
7229f4719r783n436K5470K4325j4930k006j1846J4226J2094j686r345J7203M943
7216b1490r192M538K0110k503k0746k560n083k982p733k1543P009q20J9053J0217
7202c3725K4377J8172M1254k9434l8533j2880l381r476K13J2826J6550K8651j073
7189A3541j8508O952j0215J776M111k2129P108L5530k2919j4939l6980j4143L8638
7176c2177Q715k7880k1331K1709K4783K6329j7013N514J1606J5631J4568j0922
$$ plain form
7269 -35144 -40660 -32508 -40496 -37538 -33712 -22335 -24400 -40305 -56744 -83556 -76009 -60482 -45297
7256 -45297 -17047 -12318 -14607 -10576 -11522 -10985 -24371 -36140 -33522 -6154 -38668 -37928 -13869 -11643
7242 -11643 12876 6115 -2666 -10144 -14377 6094 -17780 -8307 -9760 -13758 -9201 -45294 -64719
7229 -64719 -74502 -79938 -54468 -30143 -45073 -47079 -58925 -44699 -32605 -34291 -43636 -26433 -21490
7216 -21490 -30682 -26144 -6034 -8537 -29283 -31843 -36926 -39908 -47641 -69184 -62175 -62995 -43942 -33725
7202 -33725 -9348 8824 50078 20644 -17889 -30769 -34150 -43626 -43413 -30587 -14037 14614 13541
7189 13541 -4967 1985 -8230 -6454 -2343 -24472 -17364 18166 -4753 -19692 -56672 -70815 -32177
7176 -32177 -23462 -51342 -72673 -50964 -26181 148 -16865 -11351 255 15886 30454 19532
7164A9532j8029j5217j5720P177j5505j5628K7555j956J3084Q179N448o157j4558
7151b1795L190J0692n829j1171j454m790J9840K6987O61K0861K7531l4250j8401
7138A2072k456K637j7711n119J4398k1301Q55K6060J3834l0889m4400J1377K538
7125c8105L1719N616r610l654k166j1361k0653M339J2427K7404l4676M692K6058
7112g970j9694J609J8198M651j6187M873k3726j6635J3609N410j7184M994l470
7099e1522J5609J1857K5712Q31k1401N037j5192k6883j9241K4185K203O849K109
7086c9847J759n72j653J1639N106m336n222K711j6196J2871m68j1690j1420K0344
7072c6974K8489k9228k5128j3357K846Q947K2355N1731M560j4858j8992k8525
$$ plain form
7164 19532 1503 -13714 -29434 -22257 -37762 -53390 -25835 -27791 -14707 -6528 -1080 -7237 -21795
7151 -21795 -18605 -7913 -13742 -24913 -26367 -31157 -11317 15670 16331 37192 64723 30473 12072
7138 12072 9616 12253 -5458 -10577 3821 -17480 -16625 9435 23269 -7620 -52020 -40643 -38105
7125 -38105 -6386 -770 -10380 -14034 -16200 -27561 -48214 -43875 -31448 -4044 -38720 -34028 -7970
7112 -7970 -27664 -26055 -7857 -3206 -19393 -14520 -38246 -54881 -41272 -35862 -53046 -48052 -51522
7099 -51522 -35913 -24056 1656 2487 -18914 -13877 -29069 -55952 -75193 -51008 -48805 -41956 -39847
7086 -39847 -38088 -38660 -40313 -28674 -23568 -27904 -33126 -30415 -46611 -33740 -34208 -45898 -57318 -36974
7072 -36974 -8485 -37713 -62841 -76198 -73352 -64405 -42050 9681 14241 -617 -19609 -48134
7060d8134j284K6613J9609J598k0561N222M0537K1702n625L863j4611k8453k9232
7047b8756k2549K4634J0561o339J5496k784J8663N440j8458j3314j5545J8554
7035a4397K5406L059k1317k7395r505R127r984Q7M139k4666L656J2871N9415L8709
7021D9205r308j8824k6302j6814K3642N074l1002j6485j517j914Q452q520K1279
7008b3034K0933R393q588N756N693j3074l1471k354n695j0625k18J5811K0669
6995a6804Q811P319J8090M042o082j7479R448Q119J777O84k3551n147n595k9614
6981d5982K025L516K1397L7919K4247j0283j9875l901K5268j4039j3791r187q002
6968a0688J0264m219j6042j963K5917L602M051p450n722m553L155K5519L527k2921
$$ plain form
7060 -48134 -49418 -22805 -3196 -1598 -22159 -16937 23600 45302 39677 43540 28929 476 -28756
7047 -28756 -51305 -26671 -16110 -22449 -6953 -9737 8926 14366 -4092 -17406 -32951 -14397
7035 -14397 11009 14068 -7249 -34644 -44149 -35022 -45006 -44919 -40780 -65446 -61790 -48919 10496 49205
7021 49205 39897 21073 -5229 -22043 1599 6673 -24329 -40814 -42331 -44245 -35793 -44313 -23034
7008 -23034 -2101 7292 -1296 4460 10153 -2921 -34392 -36746 -42441 -53066 -53284 -37473 -16804
6995 -16804 -7993 -674 17416 21458 15376 -2103 7345 15464 17241 17925 -5626 -10773 -16368 -45982
6981 -45982 -43957 -40441 -19044 18875 43122 32839 12964 9063 34331 20292 6501 -2686 -10688
6968 -10688 -424 -4643 -20685 -22648 3269 6871 10922 3472 -2250 -6803 -3648 21871 25398 2477
6954B477m7458l347k3711J0702R033M6403J7393j4526m0153J3381R312j5993j5749
6941e2236J9414J7638r476J6604j6587j1291K518J0264J1198q514r422N798K7716
6928C624K95j3728k7569k0575Q783L5598K2221J9173L5487l5942l7940J3427n973
6915c119l2196k6886J4084M0517J7552o079j1149l5542J400K7026l660m0940O205
6902e2787J07q404p416n089J0101K4521J3128k2298M842M214k1598K810K6498
6889c1371o332j0426J9189P081j0037n652O495K2223J0051r177J0651r721k0480
6876b7506m677m303O39n100J2214K1885Q550Q780m3367r119r49P133O112K2841
6862f867L6542j2696k5770k985k05J6332r890k1506r910K79L2427l703J852J5172
$$ plain form
6954 2477 -44981 -48328 -72039 -61337 -52304 -5901 11492 -3034 -43187 -29806 -20494 -36487 -52236
6941 -52236 -32822 -15184 -24660 -8056 -24643 -35934 -33416 -23152 -11954 -20468 -29890 -24092 3624
6928 3624 3919 -9809 -37378 -57953 -49170 -13572 8649 27822 63309 27367 -10573 2854 -3119
6915 -3119 -35315 -62201 -48117 -7600 9952 3873 -7276 -42818 -41418 -14392 -18052 -58992 -52787
6902 -52787 -52680 -61084 -68500 -73589 -63488 -38967 -25839 -48137 -43295 -39081 -60679 -57869 -31371
6889 -31371 -37703 -48129 -28940 -21859 -31896 -37548 -31053 -8830 1221 -7956 2695 -7026 -27506
6876 -27506 -32183 -36486 -35847 -40947 -28733 -6848 1702 10482 -32885 -42004 -42953 -35820 -29708 -6867
6862 -6867 29675 16979 -8791 -11776 -11981 4351 -5539 -27045 -36955 -36676 -4249 -7952 -6100 9072
6848I072N08R279K916q724r822k1640j6398K6102K1692J9894K7678k3238j2373
6835B4946j4591j5069J2841J5916j4329O28L421J7207m783N469j4305q255k1417
6822a2321J3732N49k2986j9017J5541j5639k1305N110R88k9101j686N3097k0094
6809e3132l4636l0932J2020L0179M593O6876J5600n629j7949j4989Q311p058J8920
6796g826k0477K203K1043K492n500j0450N181j8342J720J7460K38J6741p4k4112
6782a9703O917K2715j0434k3654J9847o555J6088j613n475J2186r537Q087J4141
6769B3010P814m1583k929j5424K927K5624J9274K211k073J4018k0501l3355J296
6756a9691K4249K4805k3865k2451K826P415m837K75o673j044L0866J3165L4361
$$ plain form
6848 9072 9580 18859 21775 13051 3229 -18411 -34809 -8707 12985 32879 60557 37319 24946
6835 24946 10355 -4714 8127 24043 9714 10342 13763 30970 26187 31656 17351 9096 -12321
6822 -12321 1411 1960 -21026 -40043 -24502 -40141 -61446 -56336 -55348 -84449 -86135 -33038 -53132
6809 -53132 -87768 -118700 -106680 -76501 -71908 -5032 10568 4939 -13010 -27999 -19688 -26746 -7826
6796 -7826 -28303 -26100 -5057 -2565 -8065 -18515 -13334 -31676 -29956 -12496 -12258 4483 4409 -19703
6782 -19703 -12786 9929 -505 -24159 -4312 -10867 5221 3608 -1867 10319 782 8869 23010
6769 23010 30824 -10759 -13688 -29112 -26185 -561 18713 20924 18851 32869 12368 -20987 -19691
6756 -19691 4558 29363 5498 -16953 -14127 -6712 -11549 -11274 -17947 -18991 11875 25040 59401
6743E9401J9122l295p533l4269k7974p92j0651j8109j6599q607J8885P913L2849
6730A0341P301J016l026J7697k706l1570q314K309r97k805j3525k0166J8870J4220
6716a1355M766L1880p52j8221r33j0659M044k072j2652o302o44L4814R325k0619
6702F20m0440k8234R788M716K8338K4861m62L14r391k3194j7355k514K73K9475
6688b3205J8272k8499j212n549L5036J8099p910j6555j9514l1857N120K3621K39
6675c3914k7479k0425K8842J4181n922J7304J3116J2938K4904J7522r260k9488
6663B319p540m99k2505j2842J3784L0141K6297M338l1157m7972j3198M877L1576
6650b2381K4875K9284n472l4554L5321j2910m8294k639J5521r76r032p782K463
$$ plain form
6743 59401 78523 75228 67695 33426 5452 4660 -5991 -24100 -40699 -49306 -30421 -22508 10341
6730 10341 17642 18658 15632 33329 30623 -947 -9261 -6952 -7949 -10754 -24279 -44445 -25575 -11355
6716 -11355 -6589 25291 24539 6318 5385 -5274 -1230 -3302 -15954 -22256 -22900 11914 21239 620
6702 620 -39820 -68054 -58266 -53550 -25212 -351 -813 -499 -9890 -33084 -50439 -52953 -52680 -23205
6688 -23205 -4933 -33432 -34644 -40193 -5157 12942 5032 -11523 -31037 -62894 -57774 -34153 -33914
6675 -33914 -61393 -81818 -52976 -38795 -44717 -27413 -14297 -1359 23545 41067 31807 2319
6663 2319 -5221 -5720 -28225 -41067 -27283 2858 29155 33493 2336 -45636 -58834 -53957 -22381
6650 -22381 2494 31778 26306 -8248 27073 14163 -34131 -36770 -21249 -22225 -31257 -39039 -36576
6637c6576J9103j3400k860n802J7649J4176J041L258n576K365r474J0611k8453
6624c3938j0417K6237L221L100m340j0497Q890j3674j5180K9222J4538K0370j3366
6611D166j9899K3869N128n75N189l0538n797J6511o892o082K0409J0757k4290
6598h044r546K7542J5348j5321j3443N635l422m529j0445K8074J0770k0606j2819
6585a0806k2003j7497J7373J4360n185o886j1512M295o958L945o738J045L9861
6572f706N409r175p522K1056O347m588l0288N220m374J9400J2489k4008o096J7429
6558e407J4655K6377O241p264m2332p366j1094r243M15R182J9191J263K4663j576
6544A7705r235j4323o276j4823K3206M506j3840K114J6663J2849P833L51o678
$$ plain form
6637 -36576 -17473 -30873 -33733 -39535 -21886 -7710 -6669 -3411 -8987 -6622 -16096 -5485 -33938
6624 -33938 -44355 -18118 -14897 -11797 -16137 -26634 -17744 -31418 -46598 -17376 -2838 17532 4166
6611 4166 -15733 8136 13264 12689 17878 -12660 -18457 -1946 -8838 -14920 5489 16246 -8044
6598 -8044 -17590 9952 25300 9979 -3464 2171 -1251 -5780 -16225 11849 22619 2013 -10806
6585 -10806 -32809 -50306 -32933 -18573 -23758 -30644 -42156 -37861 -44819 -40874 -47612 -46567 -6706
6572 -6706 -1297 -10472 -17994 3062 9409 4821 -25467 -20247 -24621 -5221 7268 -16740 -22836 -5407
6558 -5407 9248 35625 41866 34602 -7730 -15096 -26190 -35433 -35018 -25836 -6645 -5382 19281 17705
6544 17705 8470 -5853 -12129 -26952 -3746 760 -13080 -10966 5697 18546 26379 26730 20052
6531B0052j2381k2134j0293l2767K1424K5427K1656p595J4330P320r580l0548
6519a5089k3143Q735J5055j3689K592J9288J4770k3527M973L845j6418k3828J0463
6506c5973J028j992j8958o970K4544J8510r719j3307N451j554k011J6068P399
6493a7484Q482j942j0088l02j085O224q294O034M3037L1018l3288l1429R402K1827
6479B2112J8169l298r572k635j533j1031m8476l0647K380M237L054L968K1158
6466c2114j507k061N323R196P907M2576O382k9631j6943Q817L0357j7531r388
6453A383k4301k4752m556J674R23R35L858j9813L398K4224J5936r078k1182j5042
6439f6393J5913J5437o564R390j6132J6887J7476P295j3616j9610J8258M573j6971
$$ plain form
6531 20052 7671 -14463 -24756 -57523 -36099 -10672 10984 3389 17719 25039 15459 -15089
6519 -15089 -38232 -29497 -14442 -28131 -25539 -6251 8519 -15008 -10035 -6190 -22608 -46436 -35973
6506 -35973 -34945 -36937 -55895 -62865 -38321 -19811 -29530 -42837 -37386 -38940 -40951 -24883 -17484
6493 -17484 -9002 -10944 -21032 -21334 -22419 -16195 -24489 -18455 24582 55600 22312 -9117 285 22112
6479 22112 40281 36983 27411 24776 23243 12212 -36264 -66911 -64531 -60294 -57240 -53272 -32114
6466 -32114 -33621 -35682 -30359 -21163 -13256 29320 35702 6071 -10872 -2055 28302 10771 1383
6453 1383 -22918 -47670 -52226 -50552 -49629 -48694 -44836 -64649 -61251 -37027 -21091 -30169 -51351 -66393
6439 -66393 -50480 -35043 -41607 -32217 -48349 -31462 -13986 -6691 -20307 -39917 -21659 -17086 -34057
6426c4057j6522P236J9792L4802R840j9889p344J4375P56l4772j092M6099R136
6413B8360j8166j0706j4207R416J3692k7645m63K5838K450N490j9162j3562o687
6400b5352k3625j1922n1K8146L7852P080m488K503O762o232m606k4597l5256R741
6386d4045M901k658J1139J5658j6967k9710J0551J6108J3266L2212p718N262J8733
6373B6732n385j3594Q947Q024K8693j3520l2799k2793l8286M743R979J0988j2880
6360d1151l639L890J6678J4953L198k6205l9626K0893K6592j1292j5035M0569
6348a0175M4161J598O105q611p577j3428r908k225J4737k8206m445k9402k3302
6335g0678L860J949j4183M2149J8739J1079J0717k937k2812K3344J0474l3484
$$ plain form
6426 -34057 -50579 -43343 -23551 11251 21091 1202 -6142 8233 8989 -25783 -26875 19224 28360
6413 28360 10194 -512 -14719 -5303 8389 -19256 -19719 6119 8569 14059 -5103 -18665 -25352
6400 -25352 -48977 -60899 -60950 -32804 5048 12128 7640 10143 16905 10673 6067 -18530 -53786 -44045
6386 -44045 -39144 -41802 -30663 -15005 -31972 -61682 -51131 -35023 -21757 10455 2737 7999 26732
6373 26732 21347 7753 16700 24724 53417 39897 7098 -15695 -53981 -49238 -39259 -28271 -41151
6360 -41151 -44790 -40900 -24222 -9269 -6071 -32276 -71902 -51009 -24417 -35709 -50744 -10175
6348 -10175 33986 35584 41689 33078 25501 12073 2165 -60 14677 -13529 -17974 -47376 -70678
6335 -70678 -66818 -64869 -79052 -36903 -18164 -7085 3632 695 -22117 1227 11701 -21783
6323b1783j7989J0921L3299K2556p118k7321j870K7165L144k9670p175K2628k877
6310C910q462l210N816m666l0133k985J6973J7583j660j1387j4005Q631K85J0738
6296a2572K6466J2286r637k4636k7008N995J7279r133n007K7572k041m595q448
6283a3479O389l0846k4373J6376J7938M507J1184j82l4885O632K8313J755j9210
6270b9881R200J8763R275o46K4162n163j4718k8463l024P537l248j0926j067N1835
6256B3636L57q698q948L615M270k0719J5078j0375k5074J3304Q888l6799k4736
6243f6201J6445J5799L01M8185O359m213K646j8087j5681J6308m543l1070K5168
6230h584K1352n970K7524K306j4879o359J5596M506L576K114j1257k225R525r612
$$ plain form
6323 -21783 -39772 -28851 4448 27004 19886 -7435 -9305 17860 21004 -8666 -15841 6787 3910
6310 3910 -4552 -7762 -1946 -6612 -36745 -39730 -22757 -5174 -6834 -18221 -32226 -23595 -23310 -12572
6296 -12572 13894 26180 16543 -8093 -35101 -29106 -11827 -20960 -25967 1605 -436 -5031 -13479
6283 -13479 -7090 -37936 -62309 -45933 -27995 -23488 -12304 -12486 -47371 -40739 -12426 -10671 -29881
6270 -29881 -20681 -1918 7357 6711 30873 25710 10992 -17471 -20495 -12958 -16206 -27132 -28199 23636
6256 23636 23993 15295 6347 9962 14232 -6487 8591 -1784 -26858 -13554 -4666 -41465 -66201
6243 -66201 -49756 -33957 -33656 14529 20888 16675 19321 1234 -14447 1861 -2682 -33752 -8584
6230 -8584 12768 6798 34322 36628 21749 15390 30986 35492 39068 41182 29925 27700 37225 27613
6216B7613l2308N816k4291J859K1576L456k1184J2210K9312k968K533p272n2250
6203c5898k8661o261J2702K0534K2847O691M733l2803p010L629j8377J2671J1842
6190c3361J6797j4016K143q956L740m107K814J4906k012J4848R408l602l680J4427
6176I349P185k5476L02k3985P70Q517o221j0691K5502K0475K6781k3543j4932
6163e967j0989j5214l837J4450Q55J5388J1564j0190J2190J1372J5244J1148o551
6150C9463J0829r988k2933m979r203j0628j1369j773O876Q762J0728P09J2612
6137A9106J3676J5424k4719o627J3788J6563J1667j4663k5954k6284o596p097
6125b1716P065j8850l348J6772O171K0738M083k9043p167J1182N667j3290j1397
$$ plain form
6216 27613 -4695 1121 -23170 -21311 265 3721 -17463 -5253 24059 21091 23624 16352 -35898
6203 -35898 -64559 -70820 -58118 -37584 -14737 -8046 -3313 -36116 -43126 -39497 -57874 -45203 -33361
6190 -33361 -16564 -30580 -28437 -37393 -33653 -37760 -34946 -20040 -22052 -7204 2204 -1398 -5078 9349
6176 9349 16534 -8942 -8640 -32625 -31855 -23338 -29559 -40250 -14748 5727 32508 8965 -5967
6163 -5967 -16956 -32170 -36007 -21557 -20702 -5314 6250 -3940 8250 19622 34866 46014 39463
6150 39463 50292 40304 17371 12392 3189 -7439 -18808 -20581 -13705 -4943 5785 6494 19106
6137 19106 32782 48206 23487 16860 30648 47211 58878 44215 18261 -8023 -14619 -21716
6125 -21716 -14651 -33501 -36849 -20077 -13906 6832 10915 -18128 -25295 -14113 -8446 -21736 -33133
6112c3133K894K913j5095j723j6704K2757o755J5802J1678o947J9848J9530N311
6099B0376j1120J4718j3367j4126j5448l977J219m362k834J9973l923j3996J5221
6086a1646K3743J0412j0115p309K931o733k0898j5367J4997J8277M138j4762j3830
6073b6162O726K2660J2588J7425j5564k4075L602l1530j8047j1955K482M3773
6061a8077m361p966J2298P31j4587J1091J1120O843j5059K031P796q512K6288
6048I636q405j3205O929K5195j7705k2646Q120P053r392J7927r11q633K353J9426
6034A5742R448j668p99l0894R40J2516p500J311k7903o810K6743k102J0845p465
6020g596k1113K4048L5954J1807q075j3124j7471l0345J7006J5199L6109R912
$$ plain form
6112 -33133 -30239 -27326 -42421 -44144 -60848 -38091 -44846 -29044 -17366 -24313 -4465 15065 20376
6099 20376 9256 23974 10607 -3519 -18967 -22944 -21725 -26087 -28921 -8948 -12871 -26867 -11646
6086 -11646 12097 22509 12394 5085 8016 1283 -19615 -34982 -19985 -1708 2430 -12332 -26162
6073 -26162 -19436 3224 15812 33237 17673 -6402 -2800 -34330 -52377 -64332 -61850 -18077
6061 -18077 -22438 -30404 -18106 -17375 -31962 -20871 -9751 -2908 -17967 -15936 -8140 -16652 9636
6048 9636 1231 -11974 -5045 20150 2445 -20201 -12081 -5028 -14420 3507 2596 -6037 -3684 15742
6034 15742 25190 23522 22723 -8171 -7231 5285 -2215 -904 -28807 -35617 -8874 -10976 -131 -7596
6020 -7596 -28709 -4661 31293 43100 35025 21901 4430 -25915 -8909 6290 42399 52311
6008E2311j5693o8Q198k2184n719j1783p55J8175L960k1644r773n034j5460k3980
5994d9449Q977O61j0665O938M191q767L248L39k0486K1409L3962J5720J7735l4779
5980a0966j2886Q241J0339K031q588R834j2573o44l3636k7934K4383M7690J8651
5967A3942k6698p71l429q948L9130K7682R214J9931l1266j3527L377k5890j0163
5954g416p075L3966L4340K877l4737j7624K74K0073O465l9955j6211K1805p920
5941a1138m308R971K6457J5436j8243l6576j2056k292k2903P509J3804L4428k953
5928b864k3124J6119M952j311M902J8557N163l3723q136k64l1458j6317L0475
5915c7029Q362J5872p062r787J7096j3535k1305J8272K9513R64j1681l4974K7877
$$ plain form
6008 52311 36618 36550 44748 22564 16845 5062 4307 22482 26442 4798 -4975 -10009 -25469 -49449
5994 -49449 -40472 -39811 -50476 -43538 -39347 -48114 -44866 -44527 -65013 -43604 -9642 6078 23813 -10966
5980 -10966 -23852 -15611 -5272 -3241 -11829 -1995 -14568 -15212 -48848 -76782 -52399 -4709 13942
5967 13942 -12756 -13527 -16956 -25904 13226 40908 50122 70053 38787 25260 28637 2747 -7416
5954 -7416 -14491 19475 53815 56692 21955 4331 4605 24678 31143 -8812 -25023 -3218 -11138
5941 -11138 -15446 -5475 20982 36418 18175 -18401 -30457 -32749 -55652 -48143 -34339 89 -2864
5928 -2864 -25988 -9869 -4917 -6228 -1326 17231 22394 -11329 -19465 -19729 -51187 -67504 -37029
5915 -37029 -28667 -12795 -19857 -29644 -12548 -26083 -47388 -29116 397 1361 -10320 -45294 -17417
5902a7417L2374j5693j6485J8322k2796j4056O100j1874P430N733m310J7296j4896
5889c0272j582Q389j8079k095J4530J8766P141m691J0379J9781k3397j3799P746
5876g183j0397k937m972n338P856k147J08N954j610j2568j5192k8193M7288J4248
5862a5083M731n78K2703J4517j8494j7932Q04K796J589Q833Q151j0714p216j4178
5848b0071M568K9295J3201j4830P915K782K326J3609k5810j8862K138k7180j4944
5835d5863l888k130K551j5865J4721K0853N257P663K3215K194o267K5802J9999
5822D8242j9883o415J0276j3146L013p018o726P849K247P195j0114j3178j7310
5809a4968o698O796K401N973J2205j5724j0478L001n718j4883K041K2857P711
$$ plain form
5902 -17417 14957 -736 -17221 1101 -21695 -35751 -29651 -41525 -34095 -28362 -32672 -15376 -30272
5889 -30272 -31854 -23465 -41544 -43639 -29109 -10343 -3202 -7893 2486 22267 -1130 -14929 -7183
5876 -7183 -17580 -20517 -25489 -30827 -22971 -25118 -25010 -19056 -20666 -33234 -48426 -76619 -29331 -15083
5862 -15083 -10352 -10930 11773 26290 7796 -10136 -9332 -6536 -4947 3886 12037 1323 -5893 -20071
5848 -20071 -15503 13792 26993 12163 20078 22860 25186 38795 12985 -5877 -3739 -30919 -45863
5835 -45863 -49751 -51881 -49330 -65195 -50474 -29621 -24364 -16701 6514 8708 2441 28243 48242
5822 48242 28359 21944 32220 19074 22087 15069 8343 16192 18439 25634 15520 2342 -14968
5809 -14968 -21666 -14870 -12469 -6496 5709 -10015 -20493 -17492 -23210 -38093 -36052 -13195 -5484
5796e484J7245J7580l111o983J2465j9111j4489j7576j6266L1692J1795J5187
5784B2944j5626K416J4512j3426J1028l1461l2604K5283J556Q009l726p505K1344
5771B744P493j0991k0955l0144L2542J501j0382l808j8162p8Q518J7631J8207
5758e884j0497J156l690J6951K6274j1292q141R988j6409o220p702r417N813j590
5744b0660K9972p00l0191k378K563k017k3530p941m151R105L1496J0515o317J7241
5730C007J5084Q411j1104k2843k1562k3160J2951J4816j1822M469J345j4274o701
5717e1383q565j1646J0469K1706L1182J1029k9955N447j5844J247l544k041M671
5704c7227p949J8779K1599K016K361j437j4431n080J4015k662J1273J860k0093
$$ plain form
5796 -5484 11761 29341 26230 19247 31712 12601 -1888 -19464 -35730 -4038 7757 22944
5784 22944 7318 9734 24246 10820 21848 -9613 -42217 -16934 -15378 -7369 -11095 -18600 2744
5771 2744 10237 -754 -21709 -51853 -19311 -17810 -28192 -32000 -50162 -50240 -41722 -24091 -5884
5758 -5884 -16381 -15225 -18915 -1964 24310 13018 4877 14865 -1544 -7764 -15466 -24883 -19070 -20660
5744 -20660 9312 8612 -21579 -23957 -21394 -23411 -46941 -54882 -59033 -49928 -18432 -7917 -14234 3007
5730 3007 18091 26502 15398 -7445 -29007 -52167 -39216 -24400 -36222 -31753 -30408 -44682 -51383
5717 -51383 -59948 -71594 -61125 -39419 -8237 2792 -27163 -21716 -37560 -36313 -39857 -41898 -37227
5704 -37227 -45176 -26397 -4798 -2782 -421 -1858 -16289 -21369 -7354 -10016 1257 3117 -16976
5691a6976J5895L3723j2983l7670R278J253J2388J1455j9248k4560N248M838L6236
5678A8877L8844k0367l9866j7024K7136o12k3371P149K8205J2728J3944l5640
5666A0003m5506P504P495J3142K5340L119n680l850k7759J121J6518j8247j6088
5653c2888J3810K0533L288J3496K892k5058r095j4350J942M174l2353j3417N52
5640f6474K0480J3520J4204J4290k1509J6771l5602m0743R938N5972J7586j5273
5628a6840P758q472j1226j7093j1601L437K6370L0713j3956j4950j3012J7515
5616b1357J2990K9934J8061l0102j9340o85R355k47K643q843l2779l5778L4358
5603d1790K5361k3923N45J066j2154L793M0615P634l6368j8881K1369K6289M0439
$$ plain form
5691 -16976 -1081 32642 19659 -18011 -8733 -7480 4908 16363 -2885 -27445 -22197 -17359 18877
5678 18877 57721 37354 -2512 -19536 7600 6988 -16383 -9234 18971 31699 45643 10003
5666 10003 -35503 -27999 -20504 -7362 17978 21097 15417 11567 -16192 -15071 1447 -16800 -32888
5653 -32888 -19078 1455 4743 18239 21131 -3927 -13022 -27372 -25430 -21256 -53609 -67026 -66474
5640 -66474 -45994 -32474 -18270 -3980 -25489 -8718 -44320 -85063 -75125 -19153 -1567 -16840
5628 -16840 -9082 -17554 -28780 -45873 -57474 -54037 -27667 3046 -10910 -25860 -38872 -21357
5616 -21357 -8367 21567 39628 9526 -9814 -10499 -1144 -1391 1252 -7591 -40370 -76148 -41790
5603 -41790 -16429 -40352 -39807 -38741 -50895 -47102 -6487 1147 -35221 -54102 -32733 -6444 33995
5590C3995k920l9098l3740j6444K2392J8892P236j3654K7868L3431m669j1795
5578B1494k0198L60j2674j417O657P94n132p633j8885P961K3991n407k1507m1451
5564g3047O113L9900K028O057k5367q933N0133r658k3858L970J8693J8660N490
5551A0181m407p508j9211k9311K425n907J4700K6033j680o811j9474J2931j1518
5538c9557m983J2202M5186J3568o402m625P068m484l657j4485j4212j2647l1086
5525e8114j5669J4702R57l5707M669M2851K8541J9298J494j1808J9681J9160m287
5512B5768q708j4530k978n94j944P605p129k2037l7450j786K0344J9880L6319
5499A2760n503j9435K2892K512j9465J0676L0995M897m465k6862k143J3318N237
$$ plain form
5590 33995 31075 -8023 -41763 -58207 -35815 -16923 -9687 -23341 4527 37958 33289 21494
5578 21494 1296 1656 -11018 -12435 -5778 -4984 -10116 -17749 -36634 -28673 -4682 -10089 -31596 -73047
5564 -73047 -66934 -27034 -25006 -18949 -44316 -53249 -3116 -12774 -36632 -32662 -13969 4691 10181
5551 10181 5774 -1734 -20945 -50256 -47831 -53738 -39038 -13005 -14685 -21496 -40970 -28039 -39557
5538 -39557 -44540 -32338 12848 26416 20014 15389 22457 17973 14316 -169 -14381 -27028 -58114
5525 -58114 -73783 -59081 -58124 -93831 -89162 -46311 -17770 1528 3022 -8786 10895 30055 25768
5512 25768 17060 2530 -448 -1042 -2986 4619 -2510 -24547 -61997 -63783 -43439 -23559 12760
5499 12760 7257 -12178 10714 13226 -6239 4437 35432 40329 35864 9002 6859 20177 25414
5486B5414j4535j0039r933J6609O575K488j3287p966j9104j5640k674J6891J2653
5473a2548j8443K1621K2216k0678Q519j170L1863q141q610k627J0409J705J3750
5460C7866n003P318j8592j8394J0307k106O640l1847j8576J0517J9273K5902J3751
5447C7056q101R483k7404q755J2331j7238R370K417l0407L0911L075j7284m3821
5434d8367j7025q072K8316r094J099K1876L1445J1690N059k3232j9746J0577j0960
5421b6434K6324o010j2215l5710l865K5633L6559J9136j2736j3711k0735J7556
5409f208J0006K1795J7372l2313m0056m87J7642r764o678P301K2534J4484R383
5396B5011J148K422j8089j5415q752J7196K3486j5423k3015Q436k048j0350q964
$$ plain form
5486 25414 10879 840 -9093 7516 14091 16579 3292 -4674 -23778 -39418 -42092 -25201 -12548
5473 -12548 -30991 -9370 12846 -7832 687 -483 31380 23239 14629 12002 22411 24116 37866
5460 37866 32863 40181 21589 3195 13502 11396 18036 -13811 -32387 -21870 -2597 23305 37056
5447 37056 28955 38438 11034 2279 14610 -2628 6742 9159 -21248 9663 12738 -4546 -48367
5434 -48367 -65392 -73464 -45148 -54242 -53143 -31267 178 11868 16927 -6305 -26051 -15474 -26434
5421 -26434 -110 -6120 -18335 -54045 -57910 -32277 4282 23418 10682 -3029 -23764 -6208
5409 -6208 3798 25593 42965 10652 -29404 -29891 -12249 -22013 -28691 -21390 1144 15628 25011
5396 25011 26159 28581 10492 -4923 -13675 3521 27007 11584 -11431 -2995 -5043 -15393 -24357
5383b4357k291L1077K9997k3435J7268K170r966n563k4779r639k2266J7627P369
5370a6788j414J6625J0118o071j457J4693M720p88r76q118J3160j7533j6104J4288
5356D355j1141p764K2331K54j2726J3074M491j2796P807o549j3075k943j3364
5343b8046j3133K2927J628L099k039M793k1026o25j5452J2102J9766K0826J9125
5330B3945J3241O137J349j3888Q458n774k096j6020k4213Q927O620r486j7550
5317b0350k5173J524J0799K2389J5366J6451j0382j0699n348K4395m27q338K3106
5304C3313J5757j1322n918j9535j8374J3342j5237M873J3542j4050r338l01p660
5291b0908j0068J2716q460j2389n819r108K774J6389o072R939J6777J0192J9484
$$ plain form
5383 -24357 -26648 4429 34426 10991 28259 30429 20463 14900 -9879 -19518 -41784 -24157 -16788
5370 -16788 -18202 -1577 8541 2470 1013 15706 20426 19638 18662 10544 23704 6171 -9933 4355
5356 4355 -6786 -14550 7781 8035 -4691 8383 12874 78 7885 1336 -11739 -14682 -28046
5343 -28046 -41179 -18252 -16624 -13525 -15564 -10771 -31797 -32422 -47874 -35772 -16006 4820 23945
5330 23945 37186 43323 44672 30784 39242 33468 31372 15352 -8861 66 6686 -2800 -20350
5317 -20350 -45523 -43999 -33200 -10811 4555 21006 10624 -75 -5423 18972 18545 10207 33313
5304 33313 49070 37748 31830 12295 -6079 7263 -7974 -3101 10441 -3609 -12947 -13248 -20908
5291 -20908 -30976 -18260 -26720 -39109 -44928 -54036 -51262 -34873 -40945 -31006 -14229 -4037 15447
5278A5447K3086j2564k0277k4731J7202J8543j7927j8502Q921K359q012p964k2675
5265d7094n048J7037L0442L3219K586P41n778p346R376j7249k2270j6435ql956
5251c1783O518K6033J7658J684K3876J3900m52m8842j7866k910M808J1747K283
5238F654N717L150Q240l067j2802J0446l753O94l2163j2426k0462J1499J6826
5225b1447J7466K0162L732l508J5694j5711m8809k0433K7843J4938K1657k0547
5213h963p554J0070J9928K0452j5990P480l0484j2863L2375J2874k4823k0130
5201a7628L1988J7485n353k1860R473r970j1943M423J5092L837j6102P973P975
5188A5390q612l5919J755Q494K636N269m271J2645K8044j6828k1173J9833R871
$$ plain form
5278 15447 38533 25969 5692 -19039 -1837 16706 -1221 -19723 -10802 -8443 -16455 -24419 -47094
5265 -47094 -52142 -35105 -4663 28556 31142 31883 26105 18759 28135 10886 -11384 -27819 -27827 -31783
5251 -31783 -25265 768 18426 20110 43986 57886 57434 8592 -9274 -12184 -7376 4371 6654
5238 6654 12371 15521 23761 20694 7892 18338 14585 15279 -16884 -29310 -49772 -38273 -21447
5225 -21447 -3981 16181 19913 16405 32099 16388 -32421 -52854 -25011 -10073 11584 -8963
5213 -8963 -16517 -6447 13481 33933 17943 25423 -5061 -17924 14451 27325 2502 -17628
5201 -17628 14360 31845 26492 4632 14105 4135 -7808 -3385 11707 15544 -558 7415 15390
5188 15390 6778 -29141 -27386 -18892 -16256 -10987 -15258 -2613 25431 8603 -12570 7263 17134
5175A7134N674J2379K765k8692n6197J51L6955K0787N566q120j3671R110Q584
5162A2425k3357k6966J1251J8775L1253k44k1876o484m4064J519J9326j2099j4758
5149e5299P171J8089J4998j5137j641P959p326r221R095M1135K4946k9023k9857
5136b4111M68m933J3625Q768K6754o567l2144l2403k6745J2387L1747j832j3548
5123d8534k927L0945K8534J2320l8439k0254K7791K7917j1909j2782Q943N714
5111G319J0123Q592j5178J8770n675j652o788j8972P665K3149k7825K595k774
5098f51K962J0951o451j2034j2638J2966J4332K1465J6843r051k8344k2222n36
5085a2408K502j2012K8275K9849Q454j8484j8502j1049k2375J4687J887K662l320
$$ plain form
5175 17134 22808 35187 37952 9260 -46937 -46786 -9831 10956 16522 8402 -5269 3841 12425
5162 12425 -10932 -37898 -26647 -7872 23381 23137 1261 -5223 -49287 -47768 -28442 -40541 -55299
5149 -55299 -48128 -30039 -15041 -30178 -31819 -23860 -31186 -40407 -31312 9823 34769 5746 -24111
5136 -24111 -23643 -28576 -14951 -6183 20571 14004 -18140 -50543 -77288 -64901 -33154 -34986 -48534
5123 -48534 -51461 -20516 8018 20338 -18101 -38355 -10564 17353 5444 -7338 1605 7319
5111 7319 17442 26034 10856 29626 23951 22299 15511 -3461 4204 27353 -472 2123 -651
5098 -651 2311 13262 6811 -5223 -17861 -4895 9437 30902 47745 38694 10350 -11872 -12408
5085 -12408 -9906 -21918 6357 36206 44660 26176 7674 -3375 -25750 -11063 -9176 -6514 -9834
5072i834j4209p392k4424j774n831M6421K0174K7352J2228j9871k5171J0202L10
5059H181j1856j1093Q237o384m62K0410M190m656R046R351j6465m7394M554m403
5045c8744k784n560J8623K8964R219j4835o428j5660j1242R490K6127L3317l8639
5032h152j5466Q325J2389O55k5877N479N04R039L202j8521j5926o603J0096L191
5018c7665N806J2028J1176J1644P421j1101N505K3122o856K294R097J2824o394
5005C8901m7074k5340J6911l350j043J4779k806m7960j7492L6738J0959K5385
4993a392L375j1485P983K104k659j1881K2323M351P041j2224k4290k1881J5610
4980b3025J4049n323o731r799l795J5113K4648m504l459J0655J4368J7779k5495
$$ plain form
5072 -9834 -24043 -31435 -55859 -57633 -63464 -17043 3131 30483 42711 22840 -2331 7871 8181
5059 8181 -3675 -14768 -6531 -12915 -13377 7033 11223 6567 15613 24964 8499 -38895 -34341 -38744
5045 -38744 -41528 -47088 -28465 499 9718 -5117 -11545 -27205 -38447 -28957 -2830 30487 -8152
5032 -8152 -23618 -15293 -2904 -2249 -28126 -22647 -22143 -13104 -9902 -28423 -44349 -50952 -40856 -37665
5018 -37665 -31859 -19831 -8655 2989 10410 -691 4814 27936 21080 23374 32471 45295 38901
5005 38901 -8173 -33513 -16602 -19952 -20995 -6216 -9022 -56982 -74474 -37736 -26777 -1392
4993 -1392 1983 -9502 -1519 585 -2074 -13955 8368 12719 19760 7536 -16754 -38635 -23025
4980 -23025 -8976 -14299 -21030 -30829 -34624 -19511 5137 633 -2826 7829 22197 39976 14481
4967A4481j385N487j3461m1819q178K6189j1003P114M990k0484k7800J4044P178
4954d4647J1237J5141K3854N135q830P455N814J9932N681k0781k1026l675L851
4941h59L10J9654K4261j4934l4955n783J3843j7552p631K0024j3116O467M1741
4928C1470J4430P731O865m7534l8647q249P347R516J3989L461q994O559l5447
4915c7503M362J4975J1499O404J2638l435r429k4934j197K604j888P381J1342
4902g181K0407P682J1544p845k8304l2969J351M9688N736l2830j0359J6444L428
4889c208o732j8154l4666J4804J2643l703j0091J3111j3458J4940L0602J7055
4877A3143O811l0710k6420L2095L5543l94l0208j2193q514N694k807K4862R625
$$ plain form
4967 14481 13096 18583 5122 -36697 -44875 -18686 -29689 -22575 -17585 -38069 -65869 -51825 -44647
4954 -44647 -33410 -18269 5585 10720 1890 9345 15159 35091 40772 19991 -1035 -4710 -859
4941 -859 -549 19105 43366 28432 -6523 -12306 1537 -16015 -23646 -3622 -16738 -10271 31470
4928 31470 45900 53631 60496 12962 -25685 -33934 -26587 -17071 -3082 379 -8615 -2056 -37503
4915 -37503 -33141 -18166 -6667 -263 12375 8940 -489 -25423 -26620 -24016 -25904 -18523 -7181
4902 -7181 13226 20908 32452 24607 -3697 -36666 -35315 14373 20109 -12721 -23080 -6636 -3208
4889 -3208 -9940 -28094 -62760 -47956 -35313 -39016 -49107 -35996 -49454 -34514 -3912 13143
4877 13143 19954 -10756 -37176 -5081 30462 30068 -140 -12333 -20847 -15153 -17960 6902 16527
4864A6527j0835M788o511J518K453k1444j977J2346J3919k2792K5427J8923p616
4851B4726k6854M670J4249k6482n746J559J1973Q213R196O34j3148j9756j1867
4838b8633J9114N1466J2684p623k717j8248j7952j4764p938j975R437j0455Q969
4825h635M0944n151j7865Q595K263k357n116j0766jk2142M964l0811r345J4238
4811d1185J4084J6078K1599K7547k9516k9847K4484l180k8793k639p77j4300o250
4798e2695K8569K7235j1372n732R214o563M592K879L464k4966j4426n89j5220
4785e5610J498M6885J5494l4681j9966k148J4495J5920l182L106N8432J8683l4517
4772B4409j1910J0463N060k061k6331p467J839k5905J702M1277K7429K5105j9439
$$ plain form
4864 16527 5692 10480 3969 5487 7940 -13504 -15481 -3135 10784 -12008 13419 32342 24726
4851 24726 -2128 2542 16791 -9691 -15437 -13878 -1905 6308 15504 16138 2990 -16766 -28633
4838 -28633 -9519 41947 54631 47008 44291 26043 8091 -6673 -14611 -16586 -7149 -17604 -8635
4825 -8635 32309 27158 9293 17888 20151 17794 12678 1912 1911 -20231 -15267 -46078 -55423 -41185
4811 -41185 -27101 -11023 10576 38123 8607 -21240 3244 64 -28729 -31368 -32145 -46445 -52695
4798 -52695 -24126 3109 -8263 -13995 -4781 -11344 -6752 -3873 -409 -25375 -39801 -40390 -55610
4785 -55610 -54112 -7227 8267 -26414 -46380 -48528 -34033 -18113 -21295 -18189 40243 58926 24409
4772 24409 12499 22962 28022 25961 -370 -7837 -5998 -31903 -30201 11076 38505 63610 44171
4759D4171k7772L991l041J7476K0966l3682j6749L191J2294k7569j2786M941j9823
4746c4392j0355m989J1805K2058L6650J068q064n897J6003K7919Q180K880m3706
4733A9160M331J4776j7053k4436o179j977r25l925o290j986j8347Q423Q687J8857
4719f884K2866M598j0516k3068J7652j956k2330P005o247j2500J5940j1225p227
4706c3892k8990J5012L0377L0855N185N703k7598l4257J7969J3832o67J7788j3915
4693b598j181R291Q749j4264k5267J039K4944L780j1021J6464J9335l1537j9784
4680b2050l572J7522K4172M683k5711j6988p217j751k4327l556M1360L2293r374
$$ plain form
4759 44171 16399 20390 17349 34825 55791 22109 5360 8551 20845 -6724 -19510 -14569 -34392
4746 -34392 -44747 -49736 -37931 -15873 20777 21845 13781 7884 23887 51806 59986 62866 19160
4733 19160 23491 38267 21214 -3222 -9401 -11378 -12303 -16228 -22518 -24504 -42851 -34428 -25741 -6884
4719 -6884 15982 20580 10064 -13004 4648 2692 -19638 -12633 -18880 -31380 -15440 -26665 -33892
4706 -33892 -62882 -47870 -17493 13362 18547 24250 -3348 -37605 -19636 -5804 -6471 11317 -2598
4693 -2598 -3779 5512 14261 -3 -25270 -24231 713 4493 -6528 9936 29271 -2266 -22050
4680 -22050 -25622 -8100 16072 20755 -4956 -21944 -29161 -30912 -55239 -58795 -17435 14858 5484
$$ [...]
##END NTUPLES=NMR SPECTRUM
##END=
