##TITLE=Analysis number 321066
Compound Code cc 50404
Book Reference 461/54
Project Code adrs
Chemist Name toml
##JCAMPDX= 6.0         $$ Bruker NMR JCAMP-DX V2.0
##DATA TYPE= NMR SPECTRUM
##DATA CLASS= NTUPLES
##ORIGIN= Bruker BioSpin GmbH
##OWNER= nmr
$$ XWIN-NMR		Version 3.5
$$ Fri Jul 21 13:32:10 2006 GMT Daylight Time (UT+1h)  MAYBRIDGE\nmr@NMR_250MHZ
##.OBSERVE FREQUENCY= 250.131544655141
##.OBSERVE NUCLEUS= ^1H
##.ACQUISITION MODE= SIMULTANEOUS (DQD)
##.ACQUISITION SCHEME= undefined
##.AVERAGES= 16
##.DIGITISER RES= 18
##SPECTROMETER/DATA SYSTEM= dpx250
##.PULSE SEQUENCE= zg30
##.SOLVENT NAME= CDCl3
##.SHIFT REFERENCE= (INTERNAL, CDCl3, 0, 16.4567)
##AUDIT TRAIL= $$ (NUMBER, WHEN, WHO, WHERE, WHAT)
$$ ##TITLE= Audit trail, XWIN-NMR		Version 3.5
$$ ##JCAMPDX= 5.01
$$ ##ORIGIN= Bruker BioSpin GmbH
$$ ##OWNER= nmr
$$ C:\u/data/dgb/nmr/ADRS/3260/pdata/1/auditp.txt
$$ ##AUDIT TRAIL=  $$ (NUMBER, WHEN, WHO, WHERE, WHAT)
(   1,<2006-07-21 13:31:49.84 +100>,<MAYBRIDGE\nmr>,<NMR_250MHZ>,
      <created by zg, POWCHK disabled, PULCHK disabled
       configuration hash MD5:
       E2 DF 36 D8 04 B2 41 60 5A D7 A3 38 5A 4B D0 FE
       data hash MD5: 64K
       96 2A D8 8C BF A1 C9 B1 BC AE D0 11 68 BD 92 C5>)
(   2,<2006-07-21 13:32:02.39 +100>,<MAYBRIDGE\nmr>,<NMR_250MHZ>,
      <Start of raw data processing
       ef LB = 0.3 FT_mod = 6 PKNL = 1 SI = 32K 
       data hash MD5: 32K
       EE D5 DE 22 37 2F 16 E7 46 D7 32 A6 F3 42 28 41>)
(   3,<2006-07-21 13:32:03.94 +100>,<MAYBRIDGE\nmr>,<NMR_250MHZ>,
      <apk 
       data hash MD5: 32K
       88 64 55 AD B3 E8 DE 41 21 DD 13 A3 8A 6B 0F E7>)
(   4,<2006-07-21 13:32:04.77 +100>,<MAYBRIDGE\nmr>,<NMR_250MHZ>,
      <abs ABSG = 5 
       data hash MD5: 32K
       AC 11 7D 4F 98 79 40 FF 8A B8 A0 E2 55 8D DC 37>)
$$ ##END=
$$ 
$$ hash MD5
$$ AC B6 12 21 66 11 30 B7 6C 77 AF F5 6D 5F F0 86
##$RELAX= 
##$RELAX= 
##$RELAX= 
##$RELAX= 
##$RELAX= 
##$RELAX= 
##$RELAX= 
$$ Bruker specific parameters
$$ --------------------------
##$DU= <C:\u>
##$EXPNO= 3260
##$NAME= <ADRS>
##$PROCNO= 1
##$TYPE= <nmr>
##$USER= <dgb>
##$AMP= (0..31)
100 100 100 100 100 100 100 100 100 100 100 100 100 100 100 100 100 100 
100 100 100 100 100 100 100 100 100 100 100 100 100 100 
##$AQSEQ= 0
##$AQ_mod= 3
##$AUNM= <au_zg>
##$AUTOPOS= <23 >
##$BF1= 250.13
##$BF2= 250.13
##$BF3= 250.13
##$BF4= 250.13
##$BF5= 500.13
##$BF6= 500.13
##$BF7= 500.13
##$BF8= 500.13
##$BYTORDA= 1
##$CFDGTYP= 0
##$CFRGTYP= 5
##$CHEMSTR= <none>
##$CNST= (0..31)
1 1 145 1 1 1 1 1 1 1 1 1 1 1 1 1 1 1 1 1 1 1 1 1 1 1 1 1 1 1 1 1 
##$CPDPRG= <>
##$CPDPRG1= <>
##$CPDPRG2= <>
##$CPDPRG3= <>
##$CPDPRG4= <mlev>
##$CPDPRG5= <mlev>
##$CPDPRG6= <mlev>
##$CPDPRG7= <mlev>
##$CPDPRG8= <mlev>
##$CPDPRGB= <>
##$CPDPRGT= <>
##$D= (0..31)
0 1 0 0 0 0 0 0 0 0.06 0 0 0 0 0 0 0.0002 0 0 0 0 0 0 0 0 0 0 0 0 0 0 
0 
##$DATE= 1153485108
##$DBL= (0..7)
120 120 120 120 120 120 120 120 
##$DBP= (0..7)
150 150 150 150 150 150 150 150 
##$DBP07= 0
##$DBPNAM0= <>
##$DBPNAM1= <>
$$ [...]
##$SUBNAM7= <"">
##$SUBNAM8= <"">
##$SUBNAM9= <"">
##$SW= 20.6930455092707
##$SWIBOX= (0..15)
0 0 3 0 0 0 0 0 0 0 0 0 0 0 0 0 
##$SW_h= 5175.983436853
##$TD= 65536
##$TD0= 1
##$TE= 295.16
##$TE2= 300
##$TE3= 300
##$TEG= 300
##$TL= (0..7)
0 120 120 120 120 120 120 120 
##$TP= (0..7)
150 150 150 150 150 150 150 150 
##$TP07= 0
##$TPNAME0= <>
##$TPNAME1= <>
##$TPNAME2= <>
##$TPNAME3= <>
##$TPNAME4= <>
##$TPNAME5= <>
##$TPNAME6= <>
##$TPNAME7= <>
##$TPOAL= (0..7)
0.5 0.5 0.5 0.5 0.5 0.5 0.5 0.5 
##$TPOFFS= (0..7)
0 0 0 0 0 0 0 0 
##$TUNHIN= 0
##$TUNHOUT= 0
##$TUNXOUT= 0
##$USERA1= <user>
##$USERA2= <user>
##$USERA3= <user>
##$USERA4= <user>
##$USERA5= <user>
##$V9= 5
##$VALIST= <valist>
##$VCLIST= <CCCCCCCCCCCCCCC>
##$VD= 0
##$VDLIST= <DDDDDDDDDDDDDDD>
##$VPLIST= <PPPPPPPPPPPPPPP>
##$VTLIST= <TTTTTTTTTTTTTTT>
##$WBST= 1024
##$WBSW= 4
##$XGAIN= (0..3)
0 0 0 0 
##$XL= 0
##$YL= 0
##$YMAX_a= 543168
##$YMIN_a= -583188
##$ZGOPTNS= <>
##$ZL1= 120
##$ZL2= 120
##$ZL3= 120
##$ZL4= 120
##$ABSF1= 16.45667
##$ABSF2= -4.236502
##$ABSG= 5
##$ABSL= 3
##$ALPHA= 0
##$AQORDER= 0
##$ASSFAC= 0
##$ASSFACI= 0
##$ASSFACX= 0
##$ASSWID= 0
##$AUNMP= <proc_1d>
##$AZFE= 0.1
##$AZFW= 0.1
##$BCFW= 0
##$BC_mod= 0
##$BYTORDP= 0
##$COROFFS= 0
##$CY= 12.5
##$DATMOD= 1
##$DC= 0
##$DFILT= <>
##$DTYPP= 0
##$F1P= 14.0000005364418
##$F2P= -0.99999901652339
##$FCOR= 0.5
##$FTSIZE= 32768
##$FT_mod= 6
##$GAMMA= 0
##$GB= 0
##$INTBC= 1
##$INTSCL= 1
##$ISEN= 128
##$LB= 0.3
##$LEV0= 0
##$LPBIN= 0
##$MAXI= 10000
##$MC2= 0
##$MEAN= 0
##$ME_mod= 0
##$MI= 0
##$NCOEF= 0
##$NC_proc= -4
##$NLEV= 6
##$NOISF1= 0
##$NOISF2= 0
##$NSP= 0
##$NTH_PI= 0
##$NZP= 0
##$OFFSET= 16.45667
##$PC= 1
##$PHC0= 164.1192
##$PHC1= 5.472619
##$PH_mod= 1
##$PKNL= yes
##$PPARMOD= 0
##$PSCAL= 4
##$PSIGN= 0
##$REVERSE= no
##$SF= 250.13001634103
##$SI= 32768
##$SIGF1= 0
##$SIGF2= 0
##$SINO= 400
##$SIOLD= 32768
##$SREGLST= <1H.CDCl3>
##$SSB= 0
##$STSI= 32768
##$STSR= 0
##$SW_p= 5175.98343685301
##$SYMM= 0
##$S_DEV= 0
##$TDeff= 65536
##$TDoff= 0
##$TI= <Analysis number 999999
Compound Code 99
Book Reference 9
Project Code 9>
##$TILT= no
##$TM1= 0
##$TM2= 0
##$TOPLEV= 0
##$USERP1= <user>
##$USERP2= <user>
##$USERP3= <user>
##$USERP4= <user>
##$USERP5= <user>
##$WDW= 1
##$XDIM= 32768
##$YMAX_p= 307825741
##$YMIN_p= -500332
$$ End of Bruker specific parameters
$$ ---------------------------------
##NTUPLES= NMR SPECTRUM
##VAR_NAME=  FREQUENCY,     SPECTRUM/REAL,   SPECTRUM/IMAG
##SYMBOL=    X,             R,               I
##VAR_TYPE=  INDEPENDENT,   DEPENDENT,       DEPENDENT
##VAR_FORM=  AFFN,          ASDF,            ASDF
##VAR_DIM=   32768,         32768,           32768
##UNITS=     HZ,            ARBITRARY UNITS, ARBITRARY UNITS
##FACTOR=    0.157963299565203, 1,           1
##FIRST=     4116.30732639499, 0,            0
##LAST=      -1059.67611045802, 0,           0
##MIN=       -1059.67611045802, -500332,     0
##MAX=       4116.30732639499, 307825741,    0
$$ Real data points
##PAGE= N=1
##DATA TABLE= (X++(R..R)), XYDATA
$$ [...]
19688 808665 832440 841626 758357 758625 762388 766984 734923 668273 654929 679634 652425 651503 663117
19675 663117 659593 601412 601708 625528 633460 605740 562812 497690 431376 458269 446188 441596
19663 441596 428746 421110 384361 290987 204793 195356 200094 180760 116880 83188 108611 181381
19651 181381 154454 119509 107950 136145 193547 260574 300360 304735 280471 279089 264380 229782
19639 229782 206575 233852 202081 202426 189605 162708 130093 147565 166385 188658 177701 167510
19627 167510 198603 192369 239738 261057 205816 177485 131860 143612 137939 141711 167559 158444
19615 158444 142866 151325 159111 174957 183070 173348 192897 214684 188318 192220 237212 271765
19603 271765 223852 174014 202351 190655 172610 176552 197292 169911 161134 187016 153597 150702
19591 150702 148387 154977 167863 149662 155644 191733 200578 144899 151931 210391 236514 270782
19579 270782 243671 203458 181511 148415 129745 112518 88004 53467 48727 58217 75482 113758
19567 113758 132099 132039 92140 167168 177648 119034 68661 65380 139247 199935 215524 169008
19555 169008 99003 113080 168065 186525 134845 87885 64601 77677 68939 47358 41329 41335 41811
19542 41811 58227 49658 87579 49262 57106 87379 19465 25216 41782 36607 96694 168186
19530 168186 79987 3237 14793 16955 41285 35208 42709 70380 113007 140706 87763 66670
19518 66670 127702 206414 210571 217713 288438 351080 343456 316558 251715 194913 222503 276015
19506 276015 308694 284799 246420 168519 106805 63012 91599 89067 41498 -24664 -79666 -72632
19494 -72632 -26433 7508 51840 60065 35392 28785 120134 210070 254943 251339 225757 242813
19482 242813 282829 313929 351802 407166 423427 369446 332746 367639 373302 399229 347637 244230
19470 244230 84786 54648 121697 125241 40571 -10926 -71054 -80331 -56312 -8766 24970 45796
19458 45796 60295 76640 27767 -3885 24325 92862 80923 133838 183132 129355 124231 147912
19446 147912 117357 114339 111985 75333 12068 74096 88159 80799 108871 55132 6656 -6111
19434 -6111 16872 -35824 -31520 -12554 -4515 9161 33565 47049 98467 77208 62333 94631
19422 94631 133219 154570 155126 113178 105405 89139 121896 116346 83625 17577 40578 36803 45471
19409 45471 70081 109359 147845 95980 39117 32875 8892 -29400 -52174 -28886 4559 -54817
19397 -54817 -67394 -48239 -13822 -3323 -14399 -8742 -31430 -38606 -18278 10893 -11893 -53553
19385 -53553 18786 34675 52487 38335 20701 59543 86287 58603 35023 68896 94968 148370
19373 148370 182118 136604 68373 6696 27121 17284 23562 29908 11487 -78865 -97890 -82545
19361 -82545 -90035 -80001 -101021 -133120 -88719 -55976 -5797 1174 -7699 -44444 -70104 -98738
19349 -98738 -150932 -123951 -79535 -43230 -55265 -59652 -26762 -45864 -62181 -57505 -35755 25618
19337 25618 54819 74231 75398 35981 43896 -6448 -47313 -65822 -90106 -107408 -50981 19112
19325 19112 30278 39631 18860 -1474 13256 74167 111117 115207 72580 33889 25693 15452
19313 15452 -44279 -88230 -60809 -23894 -4410 1781 -35368 -95320 -13380 16131 -18471 -20924
19301 -20924 -44265 -79983 -74870 -45239 -17537 7652 1551 -21483 -72303 -50536 3750 -9360
19289 -9360 -854 -25195 14665 64044 14851 4351 41644 31941 81754 65233 29978 30014 71478
19276 71478 91489 118608 90063 146163 157128 122543 142901 186075 239532 209867 194086 271275
19264 271275 353223 413357 444304 475965 442725 434391 413583 412828 360148 276227 204888 173083
19252 173083 117888 82513 28107 6052 -35241 -23690 27825 81995 143112 95950 53566
19241 53566 83587 183764 208478 208884 223230 270747 286607 286671 340792 425614 433902 464286 528837
19228 528837 526872 478892 405313 400323 359967 372947 312007 210771 156085 152736 151383 145178
19216 145178 152029 138721 143013 147184 164034 151365 102682 8824 -16704 -28054 -39005 -6944
19204 -6944 38475 79311 121054 70687 46771 33049 57659 95485 134311 105498 129751 102545
19192 102545 68753 57944 1546 -11567 -8077 12170 12963 -56820 -56116 -130 63606 89650
19180 89650 100932 99051 55967 27115 -7839 -17191 43623 75588 1617 -36921 -59737 -30392
19168 -30392 16 -19505 -91507 -53467 -46755 -58854 -26040 -42914 -68099 -39667 -53204 -39066
19156 -39066 -15808 -4854 -23258 -61678 -49146 -56715 -71511 -83986 -102977 -112300 -73174 -38341
19144 -38341 -28797 -38085 -63427 -94227 -68784 -37983 -73189 -141733 -152919 -144375 -143778 -85202 -41513
19131 -41513 -2140 -15701 -65815 -129301 -131564 -108802 -63932 -48277 -8072 14665 15186 -41662
19119 -41662 -91760 -82639 -31394 10328 8671 7353 15217 -48599 -51222 -50776 -33383 -31866 -46065
19106 -46065 -43604 -43081 -53935 -46185 -11697 28146 12645 -9804 -39007 -53225 -80188 -111121
19094 -111121 -122883 -98132 -50839 12197 2706 -9629 -24611 -42861 -90474 -83790 -34182 -18491
19082 -18491 -32076 14257 67733 40442 -12642 -45025 -80965 -16253 32955 18569 -30801 30933
19070 30933 91131 65002 49608 12577 -30997 -40312 11222 -12746 -22203 -39604 -27877 -32039
19058 -32039 -36021 -5220 -337 -32522 11302 -20737 17004 -35366 -74452 -20521 28494 40587
19046 40587 -13598 -23501 -36683 -44359 -36775 -29193 -24811 -10685 17543 -23916 -20166 4596 3097
19033 3097 -8478 21207 8254 10982 -25754 -12264 2843 22323 8615 3571 13957 -22382
19021 -22382 -48605 -86577 -43640 -20832 -30216 -29703 8911 63789 91808 60569 10859 6414
19009 6414 34356 48921 45524 5646 -55007 -46025 17318 1217 -42134 -33978 -9232 -31655
18997 -31655 -54682 -51243 3932 -3113 -48265 -55100 5372 3383 31118 34399 23745 36664 -43227
18984 -43227 -71196 -35268 -55766 -42692 -3627 -8946 -51050 -21821 20786 34148 61037 123831
18972 123831 106872 73632 12294 -62669 -60609 -24405 -7806 -23993 -67441 -52447 -41036 -35959
18960 -35959 -22587 -29452 1197 -10529 -47934 -16437 36181 -52016 -121658 -88072 -84343 -124661
18948 -124661 -89805 -85138 -58940 17860 35354 8151 21384 29868 37693 -4757 -40035 -25512
18936 -25512 12728 38925 63156 55078 14461 27248 35950 26773 43697 69143 54829 65498
18924 65498 89400 75103 97263 101601 86377 41755 -8058 47697 11921 -22663 -15552 -27636
18912 -27636 -53879 -48547 -41790 -21789 -13404 2731 -11427 -21119 -20291 -22236 -53383 -58180 -81596
18899 -81596 -50588 31688 48188 24550 17363 -57267 -53655 12540 -24082 -66766 -69756 -30604
18887 -30604 8984 16548 -3676 7429 -8204 -33374 -45351 -7203 29450 52509 64247 39934
18875 39934 -1668 -42652 -9220 51902 49974 4659 -64474 -44866 -34169 -16999 -15737 -33886
18863 -33886 -49958 -18662 -53231 -81763 -32032 20969 -26437 -26962 28840 30509 12115 16785
18851 16785 77635 61104 8379 7982 14022 17570 34698 12524 5909 44183 44739 75058 96755
18838 96755 50849 26502 16552 33318 -11497 -35949 -33356 -17418 5601 30458 49820 36157
18826 36157 48673 36792 96517 126307 58645 49741 34447 37634 -8638 -12841 5396 -4397
18814 -4397 14872 6661 -16010 8661 59005 66274 -30 -34542 -18784 -22521 -27605 -33994 -21053
18801 -21053 33675 40391 76460 52267 47324 66642 13531 -70949 -113203 -114773 -60349 -44224
18789 -44224 -16338 -5876 -9385 52663 62227 27505 42031 67500 56684 63347 61666 54253 26221
18776 26221 -21791 -16660 -36035 -63646 5290 115246 156002 180531 249094 276289 246059 175000
18764 175000 109906 93945 38573 -8673 -9328 16328 -19640 18064 60761 2957 -42671 -99827
18752 -99827 -56160 29810 62958 57713 -11776 -63371 -31063 -35246 -8819 -10680 -24584 -57586
18740 -57586 -51548 -73312 -108327 -98426 -73301 -25379 2120 3505 23007 -26163 -22347 -24957 29198
18727 29198 56252 47415 31179 36236 50778 82621 42645 -5794 -12971 -56113 -64657 -16379
18715 -16379 -32879 -57649 -46079 -64049 -93626 -103206 -21409 20516 37820 33594 15904 8028
18703 8028 -40501 -112847 -72577 -12678 -19426 -92569 -81383 -61229 -101894 -75788 -16035 -2234
18691 -2234 -13544 3222 17683 -10054 -126 -5691 -20872 14966 7462 14732 2053 -11639 11080
18678 11080 53592 74140 74455 98532 117544 92800 24818 -27078 -43018 -23332 -53028 -50810
18666 -50810 -66396 -78168 -52389 -46258 -30692 -35620 -9790 16966 27476 -7127 8599 10086
18654 10086 5294 -4175 -17311 20578 42748 50745 -42174 -97958 -104898 -119812 -109853 -89719 -39222
18641 -39222 -21118 -45080 -58141 -43225 -2399 24494 -21410 3750 32196 666 -14108 -69488
18629 -69488 -58725 19700 -10300 -44678 -33877 -37310 -50270 -65934 -94086 -58637 -77369 -50661
18617 -50661 -38850 -13131 50094 96987 81435 67269 34455 48804 44456 4897 -2983 -1101
18605 -1101 -24051 -72031 -97685 -105198 -52118 22153 43162 78918 121833 100760 27405 31364
18593 31364 18353 -12679 -46726 -76096 -56768 -10025 -36442 -10369 10210 7071 -19939 -9391
18581 -9391 23259 24311 50847 35652 41392 70800 21200 -3572 2194 15898 2482 23893
18569 23893 45825 66428 15670 -6034 -5831 -26300 -34893 -1937 -10863 -27824 -37480 6748 -38538
18556 -38538 -53504 -25000 2018 -8496 -7049 20191 -15388 -60596 -81483 -9871 -22139 -117737
18544 -117737 -105759 -49165 -53580 -51493 -19860 1161 40254 57908 38379 48486 74790 -16639
18532 -16639 -61590 -28369 -63274 -2083 43986 99794 132681 50865 -29301 3833 59955 110227
18520 110227 114857 95487 55852 -12257 -23163 -3102 33673 -6119 -20636 -52818 -73181 -75723
18508 -75723 -55406 -49906 -69598 -78388 -73910 -42003 -29435 -42013 -32250 -51813 -37081 6469
18496 6469 101369 97780 81393 4495 -41155 -124423 -125908 -82620 23702 107920 112384 123875
18484 123875 133711 110815 95201 66116 73559 66185 50725 35280 45151 53016 45381 58996 31104
18471 31104 -21394 20256 65593 90056 90862 83048 77334 18868 -15074 -9969 -9436 2446 -19951
18458 -19951 -54815 -61448 8511 40876 54146 59351 457 -26787 -55593 -47328 -50397 -51974 -43612
18445 -43612 -27072 -30923 -20845 -12392 -32907 -31267 -77809 -58905 -43533 -36609 7691 -7903
18433 -7903 -17264 -9803 4050 18495 73602 80804 41106 72651 98266 101845 151069 165885 145779
18420 145779 113491 82814 79373 2761 -39159 6838 23860 66139 59597 57275 47033 66429
18408 66429 38048 14022 50905 103362 72220 46232 50167 38300 9139 17270 -1908 63990
18396 63990 64700 69707 74697 20575 12265 81230 94873 41026 2438 55099 71291 48169 38558
18383 38558 56731 99318 109566 98122 111013 144070 93195 56241 58011 86453 47103 -6162
18371 -6162 -5016 5213 69238 58224 99525 138291 144156 91032 55652 65629 85825 78900 72527
18358 72527 74090 83722 50898 96447 103547 86111 38587 9797 52614 69315 133205 111943
18346 111943 71695 50373 13036 -15872 -17935 -5857 -14497 32508 55249 23012 58258 79786
18334 79786 90962 132989 119822 138991 63889 8924 57964 95565 103617 101873 64689 75425
18322 75425 81967 57081 36961 40100 36263 42638 40514 67439 38276 61185 77745 47786 15881
18309 15881 18104 7660 37269 16401 -6906 48119 80492 134557 104798 57753 49924 4137
18297 4137 -4803 20799 24271 30499 92148 59644 69054 57322 19703 64190 159035 177228 175741
18284 175741 196902 175474 167438 179549 199777 228971 247088 253641 287200 322160 345362 310709
18272 310709 260166 225499 187967 166982 135302 112847 136617 204718 186484 123951 127119 123568
18260 123568 118229 199383 261097 267599 227077 188369 176529 229571 258462 270777 267428 230645
18248 230645 192628 144533 84016 73169 126468 209784 195424 129446 129525 171877 202459 158655
18236 158655 136164 168579 120408 68446 100603 90177 114376 127717 144104 102878 63492
18225 63492 77279 83814 48932 25894 49875 59102 26566 -4631 16349 16600 91367 122738
18213 122738 112881 180239 156300 119525 76143 103633 91774 57392 72343 57968 89202 107414
18201 107414 91587 59722 69357 100717 161887 205575 215779 228932 240394 202445 160586 130460
18189 130460 146589 136080 103993 96708 109493 85286 96611 111233 116269 93972 118687 129605
18177 129605 207166 216272 191284 171419 219632 256240 270905 248621 235742 217674 220732 229004
18165 229004 257840 235982 275014 302922 252489 226593 189955 158575 182908 223054 215521 254620
18153 254620 280831 270174 336069 390319 363936 337412 313584 301245 250496 322376 416873
18142 416873 489664 528506 560054 544340 568179 646120 682120 663382 657976 730867 809409 873504
18130 873504 922035 1006982 1162006 1274919 1408210 1617091 1821020 2047331 2406184 2867079
18120 2867079 3452818 4295170 5515204 7370238 10269728 15042560 22587101 31331437
18112 31331437 36233481 39250394 45466320 53495372 57318003 47314063 30392810 19834965
18104 19834965 14229602 11056864 9042727 7687938 6760056 6043705 5509691 5018720 4586572
18095 4586572 4275600 4011601 3846858 3757841 3640853 3524398 3364645 3183970 2984412 2859941
18085 2859941 2701113 2578183 2524240 2454719 2373901 2288633 2218431 2138646 2090491 2048858 1971081
18074 1971081 1813113 1728105 1697042 1694015 1626746 1626411 1600553 1579387 1560367 1525908 1457609 1435794
18062 1435794 1398384 1420887 1469105 1426057 1398271 1379447 1334839 1273332 1209612 1181179 1242146
18051 1242146 1246956 1219144 1110272 993574 935006 912930 947585 906777 906070 910495 899318 876631
18039 876631 861577 815562 773814 783098 824527 880386 926033 900321 878180 872255 894718 924521
18027 924521 918090 869972 851176 866850 880684 835532 853762 881367 794145 733694 705364 649967
18015 649967 632602 629351 607789 580114 576309 549932 454552 414195 453175 447841 389483 366736
18003 366736 403113 465893 465742 432505 416169 404110 374704 379860 397369 403937 339024 261255
17991 261255 250628 315977 320768 280541 244970 258175 264790 290206 326549 345222 302347 271976
17979 271976 222365 201607 146722 146906 151841 152632 134891 153200 135371 86624 75657 80158 77003
17966 77003 53771 85870 80584 95404 169753 170352 116432 81755 74439 47727 35238 41630 87457
17953 87457 153058 157954 95418 44579 58304 106982 130132 135123 145787 95101 69507 67842
17941 67842 59079 98691 132573 51734 31309 76555 52882 37685 7297 14119 54470 107774
17929 107774 83596 111833 107483 116675 123769 140370 143120 121238 86700 125613 205669 227034
17917 227034 163616 73424 21615 42816 127567 170997 146641 122963 162851 141787 124576
17906 124576 118484 129389 99679 59959 36857 20598 46751 71248 26438 15762 58161 80950
17894 80950 39367 29371 65272 88371 104573 117857 95847 35298 73806 81575 26025 96447
17882 96447 134901 109153 128854 58766 41581 39363 31531 14720 27206 73610 51390 -1529
17870 -1529 45784 41502 44354 56421 74903 118659 104623 93213 114343 94167 52901 80366
17858 80366 59498 47002 36801 20142 -31025 -25561 23537 52433 57220 75725 44346 16834
17846 16834 -1396 33709 13610 -16180 -50399 -61480 -58561 -17225 -12559 -26989 -31787 40533
17834 40533 75724 129745 189104 202166 150647 79537 51385 44546 51452 117422 127977 132359
17822 132359 82389 64122 74093 134927 165941 120149 124221 99856 61912 74879 94862 140192
17810 140192 152763 150226 148974 130102 130042 122740 155566 159801 166780 216316 179020 195115 156565
17797 156565 99126 120961 165711 151891 141510 167047 194242 194268 226183 259321 267802 259612
17785 259612 249307 226566 252714 268056 277967 310661 383426 526125 548885 531228 556726
17774 556726 666846 712116 728890 750030 765219 869423 904447 863226 835555 769869 738387
17763 738387 748170 705641 673807 655271 615458 592893 572357 525425 485048 399996 337548 308290
17751 308290 306324 313530 358261 373129 370785 374151 330334 312660 299678 293390 299569 287333 298003
17738 298003 237292 185279 144563 183547 222532 263124 305592 227534 153631 132622 172338
17727 172338 164927 164783 156769 126029 114865 146194 159340 160387 165147 192338 189721 162220 162070
17714 162070 179142 153637 146356 168414 84541 99566 151600 157504 129781 96657 153574 178895
17702 178895 210500 141421 105375 184522 246622 240811 248751 282880 272242 296507 275700 272249
17690 272249 263864 237474 181434 217500 221053 211875 255328 270254 275419 242058 232424 202035
17678 202035 201410 210871 199710 255427 264701 242367 233571 246044 251334 261757 240031 194550 119216
17665 119216 160185 198712 215446 213711 231260 239718 263474 288922 316301 327831 310587 221898
17653 221898 213286 209509 188798 225197 237836 238038 228064 212757 274367 232897 192056 203332
17641 203332 208565 250683 301122 362936 392465 379842 324600 298336 279835 305312 313226 321679
17629 321679 290551 307371 291075 358735 359994 308418 265974 297799 336915 392515 462083 460626
17617 460626 405019 402111 398118 383273 432754 486083 515976 533422 480883 454686 432543 456384
17605 456384 449312 459234 526754 545186 547564 560275 617317 622829 563624 492123 554625 593318
17593 593318 576710 542339 522692 511167 504470 548165 620727 685986 678439 717879 727611 790939
17581 790939 816730 849111 816456 772696 767564 862842 899055 921615 898096 977151 1026411 1050070
17569 1050070 1165044 1211598 1208747 1231366 1300108 1391999 1488915 1643018 1750369 1936680 2130201
17558 2130201 2322055 2512499 2740787 3010128 3329422 3719060 4192557 4617895 5118534
17549 5118534 5694137 6442837 7436247 8811721 10837693 13634190 17571228 22763763 29188953
17540 29188953 36479698 44133555 51648433 58820141 65062094 69306240 70794968 69919056
17532 69919056 68239389 67232745 67593984 69121850 70890025 71259456 68648232 62268901
17524 62268901 53167030 43433184 35028396 28805904 24652769 22058479 20491124 19532311
17516 19532311 19057218 19082682 19612839 20683475 22589577 25636875 29953491 35511487 41977389
17507 41977389 48842094 55724969 62403810 68214611 72305604 73868022 73072167 71233441
17499 71233441 69781002 69564505 70557631 72014611 72396603 70064197 64137662 55155586
17491 55155586 45112861 36085605 29189017 24335002 21088832 18912731 17335517 16021043
17483 16021043 14902894 14004408 13154428 12462435 11905322 11345466 10786482 10274606 9753723
17474 9753723 9307856 8918248 8518547 8172373 7774253 7410891 7174033 6972301 6727191
17465 6727191 6478508 6217663 6012205 5852478 5702528 5454215 5163819 4936346 4768570
17456 4768570 4636554 4467263 4288322 4156197 4021358 3873128 3746373 3723306 3656036 3593896
17446 3593896 3496070 3394035 3331017 3301468 3266327 3190576 3043733 2861922 2757919 2695548
17436 2695548 2555609 2452731 2431555 2391382 2289627 2220306 2152266 2129748 2077090 2035873 1978095
17425 1978095 1889750 1889406 1859569 1824620 1757470 1699259 1645478 1657282 1697796 1681922 1614744 1518197
17413 1518197 1438655 1407919 1386913 1380031 1337059 1310503 1257827 1239005 1216682 1211102 1235113 1254217
17401 1254217 1177226 1096777 1011875 1001794 977711 961250 962237 996950 971771 934594 876827 883565
17389 883565 887227 908997 880921 914547 938286 875441 853090 852503 801373 843847 861188 844649
17377 844649 778733 719581 709470 714179 730588 690252 661980 636108 644787 667894 634110 628802
17365 628802 620210 609187 608065 556245 491798 497926 481536 501954 502091 500394 516850 511963 530862
17352 530862 562389 555325 565308 582041 580911 596542 583390 524104 525366 563417 610478 652664
17340 652664 676783 734557 738930 737379 752714 744287 788524 809189 836298 834661 801457 764333
17328 764333 757368 779089 790709 791974 794958 783848 761279 766806 813251 819662 793373 796987 830335
17315 830335 855346 891361 915523 959139 970708 971500 979570 973679 1034872 1108843 1204145 1206589
17303 1206589 1153551 1168399 1224100 1321406 1388871 1432168 1481804 1534266 1618910 1652800 1784632
17292 1784632 1917306 2016779 2138237 2356325 2563082 2783723 3064013 3312849 3554606 3898716
17282 3898716 4322613 4770170 5259210 5748681 6318590 7031384 7836184 8818623 10001569
17273 10001569 11472179 13426282 16196196 20195494 25998929 34093820 44144695 54713899
17265 54713899 65086643 76748703 90869529 105616030 116304522 120534064 122414041
17258 122414041 127241332 134730507 140739668 142219736 139644877 134728146 126349672 114571698
17250 114571698 103897307 97549699 93559070 86987801 74966477 60325536 47806285
17243 47806285 39150660 33433155 29503743 26545178 24316288 22639016 21257920 20013340
17235 20013340 18854784 17860461 17006764 16165409 15352060 14631050 13952656 13299852 12640393
17226 12640393 12033449 11522588 11033999 10481020 10019265 9656314 9259017 8868827 8564638
17217 8564638 8274688 7931208 7637432 7372463 7045921 6708576 6482474 6292817 6031129
17208 6031129 5824639 5579135 5347048 5188962 5047105 4897556 4738869 4588537 4417688
17199 4417688 4331536 4254807 4128339 3983953 3861983 3726644 3546580 3406435 3341124 3271040
17189 3271040 3198921 3102053 2987209 2892256 2821767 2728281 2662199 2586324 2487056 2393007 2286442
17178 2286442 2207552 2213122 2224800 2170128 2107437 2055211 2018799 1932526 1908151 1855712 1787413
17167 1787413 1778774 1730395 1698688 1699663 1643348 1567563 1488154 1496853 1508905 1443158 1391767 1350244
17155 1350244 1334654 1302415 1260310 1234598 1187127 1128013 1102973 1074113 1003291 1011017 1044231
17144 1044231 1010927 966301 926233 906869 891135 866221 857460 838811 800074 729459 692908
17133 692908 634990 607657 601927 573557 544183 541258 589467 560223 475121 474633 450586 372754
17121 372754 345444 343864 319281 295021 299790 302727 273515 240978 238750 260454 247002 215817
17109 215817 173118 158939 197719 230119 225371 164635 202154 230957 177322 162886 194135 194120
17097 194120 170606 184951 193181 143803 159318 144451 137438 152419 182781 191094 209190 169671
17085 169671 189113 196328 166153 162676 102642 81159 99257 69425 113595 90976 61757 101684
17073 101684 119318 96525 28971 63203 147797 151403 145015 164735 162834 146910 131723 108401
17061 108401 123144 181729 209915 204838 173518 167265 183078 177064 171505 188151 158210 128100
17049 128100 138207 192175 158449 165367 155768 107408 68462 94086 121883 84036 76454 162031
17037 162031 188399 196879 240921 245225 232705 240075 273191 256183 235055 308969 385424 349458
17025 349458 260437 233083 236600 287798 333179 325256 212735 193119 253615 266566 242426 224379
17013 224379 225885 254107 321673 320242 369001 426117 464960 499419 530079 545857 582529 575164
17001 575164 531399 526619 562706 567289 522206 492172 497364 483650 529218 505507 462498 432281
16989 432281 400559 325083 205223 115599 125611 177833 176843 145409 172369 256085 267319 314582
16977 314582 350997 398020 419807 438724 444403 464481 478642 448524 407076 395076 385474 397967
16965 397967 425653 422882 372413 358408 351446 263087 223376 152475 136916 108891 138101 111628
16953 111628 98555 106802 118175 72338 47591 43074 3069 36087 65157 21917 23882 22174
16941 22174 -4932 3942 37545 40852 55748 32290 52008 64977 22896 32523 84933 84103 78172
16928 78172 119500 141560 125289 60047 57873 74431 84838 66311 79481 33351 35774 10813
16916 10813 -35663 -32976 9664 -31798 -69241 -79875 -82526 -54843 -107102 -153656 -151220 -115266
16904 -115266 -83057 -57786 -19551 -65846 -90017 -82339 -41276 -16103 -58734 -62757 -57487 -16038
16892 -16038 -38239 -62552 -50710 -3844 33298 74040 98904 31143 46284 98386 92432 93212
16880 93212 83617 88048 89374 76091 42768 46493 63728 86644 63462 6757 17042 31354
16868 31354 12577 -2962 -6187 1688 25280 31679 -25609 -40098 -58959 -17753 -14889 -42383
16856 -42383 -55217 -53669 -19426 -34402 24 -7841 -8666 52482 123603 151155 89358 38027
16844 38027 27044 48990 57498 35952 56004 74791 114363 172054 180170 151271 144547 129803
16832 129803 83103 94994 114909 178764 190050 199282 262255 318817 349900 304226 292964 298806
16820 298806 339284 403077 430235 411426 359167 339296 378021 357091 336143 363690 394127
16809 394127 320439 236789 189852 112036 53827 76192 93368 103025 66007 20038 25541 51797
16797 51797 19125 24579 30484 89136 123368 76996 43930 13909 -12039 29316 -4213 -60238
16785 -60238 -35764 -1302 13192 -15167 -80888 -47344 19400 -26 21737 50091 43500 -2276
16773 -2276 -29305 -50485 5851 46122 38764 -11456 -36223 -28133 595 8930 13775 79984 52170
16760 52170 -14811 -59836 -39695 33039 58728 69462 116858 154434 192081 264488 234698 219537
16748 219537 278502 373818 453991 521272 548823 597172 646907 660916 729701 780921 794691
16737 794691 814363 784110 705767 654367 617658 536065 439030 391478 332131 291182 275478
16726 275478 226107 146519 97839 126228 151402 117205 61234 53477 69837 56740 26879 13474
16714 13474 28568 -28500 -84507 -21162 25068 65719 26228 67143 65890 81830 74368 70613
16702 70613 64578 15328 -64509 -45783 44387 85995 86996 55294 34825 38927 30705 47001
16690 47001 33679 18360 50758 35070 34707 53771 81360 46247 -2983 37164 50782 40125
16678 40125 39207 75186 41497 46092 46102 -24232 -44848 -33568 -84577 -104258 -67708 -49673 -53264
16665 -53264 8652 -17054 -77320 -57077 -60096 -105397 -113628 -49452 -26859 -49431 -72079 -129507
16653 -129507 -101750 -63871 -43035 -32321 -34586 -22764 -41034 -30330 12162 30656 7324 -41722
16641 -41722 -7945 12497 8779 4147 -15332 -62372 -98844 -11787 14489 2884 12600 42884
16629 42884 78665 48999 20918 25935 31439 452 -12577 -47769 -62671 -55152 -69261 -33623
16617 -33623 1733 -10469 -42313 -52772 -76469 -69964 12420 57503 76897 32729 -9237 2543
16605 2543 25256 24296 66072 49290 21618 -29542 -39004 14919 51210 -19889 -79580 -36437
16593 -36437 -42179 -39280 -22581 7978 2803 -41935 -10868 -13360 -57619 -31204 28835 26521 7994
16580 7994 -3335 -10182 -18958 -52614 -22364 -8587 -26137 -30928 -79688 -124524 -110093 -54671
16568 -54671 -24299 10165 -3664 -11716 -18794 16051 88532 108411 108929 91327 68079 15508
16556 15508 -7171 17762 -22281 -9002 -30358 -66537 -109723 -88261 6120 17317 -26974 -40129
16544 -40129 -87209 -38144 -20633 -7798 -6301 -3117 15628 35155 16226 15503 27892 30235 -34839
16531 -34839 -61792 6801 56256 10659 -29986 -16269 36592 41212 12463 103825 177331 152388
16519 152388 87835 46534 37251 3051 -82319 -71512 -47772 -13631 47167 9291 -32539 -24945
16507 -24945 -48999 -86051 -68168 -10154 3648 11214 -37853 -17922 -17688 -32049 17167 207
16495 207 40738 74169 27763 11503 32553 -15697 -19492 17555 43141 8545 -1938 -28133
16483 -28133 -10373 5446 -1037 -15829 -15905 -11691 -9821 -32760 -29895 28049 115622 86503 76975
16470 76975 16245 12087 2660 67360 85185 30294 -10966 -18085 -30377 -95228 -139964 -75869
16458 -75869 49432 85818 68677 107226 130962 72765 81625 148283 140861 158417 128096 68274
16446 68274 41139 2775 -39140 -50574 -9444 32710 23420 8921 -12161 -15612 -14428 -39721
16434 -39721 -67633 -68595 -54776 -54989 -12954 -43580 -27082 -14825 -48003 -91924 -64966 -83253
16422 -83253 -31820 14440 -6463 -44076 -22160 -20373 -42209 -2976 60653 31421 669 -36891
16410 -36891 -39822 -22182 -2911 -18511 -51805 -29247 -52 -14768 -13498 -45535 -74649 13116
16398 13116 -21305 -26430 6724 -4373 -65919 -27539 22054 31157 19047 15358 -33508 -89335
16386 -89335 -126812 -139229 -114946 -80455 -47876 -5072 -42804 -38478 4174 -7053 -59734 -71277
16374 -71277 -34273 -46050 -41109 -32815 -63838 -76911 -60649 -22954 -42460 -71764 -45046 26861
16362 26861 34745 9927 48384 632 -81281 -37833 -12203 -78207 -78580 -56835 -47057 -37795 -29571
16349 -29571 2673 -48207 -93306 -71499 -24682 8086 -57699 -43575 -54503 -71496 -61260 -46775
16337 -46775 -24876 -41312 -96379 -63106 6043 18352 24390 27844 27168 35837 1303 -29064 -76756
16324 -76756 -115976 -78695 -39457 -51999 -74363 -94412 -125513 -110699 -101384 -50158 -34825 -40587
16312 -40587 -29124 -50066 -60339 -59400 -94850 -29152 -6915 -42768 -30650 -10667 -29236 -34846
16300 -34846 -94246 -123893 -76916 -41554 18783 109716 69433 62281 7024 10448 20685 35369
16288 35369 9589 -5683 -6068 21948 -10557 9151 21838 -16154 -56435 -772 18673 -5909
16276 -5909 809 5290 35434 53001 53983 -6356 -4550 48107 46181 14548 17569 8149 -97521
16263 -97521 -144310 -201600 -168771 -112101 -69576 -52105 -50575 -39933 -21849 -57508 -38779 -49616
16251 -49616 -65720 -85123 -75028 -55081 -26004 12817 -34941 -90568 -111794 -14963 14141 17717
16239 17717 2341 -54872 -101080 -89918 -72841 -84354 -125415 -158347 -94333 7309 9796 -18384
16227 -18384 -35322 -88367 -93783 -113636 -137123 -119538 -78484 -51239 -23858 -56075 -63465 -68238
16215 -68238 -121648 -145892 -121411 -83329 -35522 25232 64757 50781 20967 -32967 -78575 -62671
16203 -62671 -27009 -4465 -34104 -74246 -95881 -93563 -65767 -65982 -76653 -80475 -57331 -66280 -75797
16190 -75797 -71774 -93916 -90421 -37362 -27057 -80833 -54278 -19527 -17889 -38455 -59497 -80521
16178 -80521 -63559 -49192 -36613 -31009 20010 4697 -1422 17533 -26449 -83120 -74961 -311
16166 -311 11125 25330 27856 28008 -9139 11884 -15036 -13130 11922 29213 40203 57231 42437
16153 42437 24843 -48035 -89756 -84921 -126999 -125119 -102972 -71777 -67326 -67996 -105441 -93201 -97166
16140 -97166 -116409 -162844 -118981 -81307 -73769 -46929 -39471 -22680 -49033 -30508 -53212 -34836
16128 -34836 3870 55438 20658 -33098 -38668 -76504 -33320 18324 17110 -18408 -50252 -78233
16116 -78233 -58419 -71538 -82697 -93442 -74889 -72164 -38537 -41932 -65440 -55357 -13626 2628
16104 2628 29703 13094 -27472 -40550 -19595 -21548 -51259 -50995 -209 24254 65618 99120
16092 99120 103754 80879 -28908 -87343 -89365 -35142 25331 7388 -9585 -2261 -2329 -16669 -7077
16079 -7077 20302 4516 -23744 638 -18751 -57366 -28060 -22304 -25385 -30085 -11188 -9844 -95281
16066 -95281 -94736 -93815 -86176 -82247 -149677 -128544 -109996 -134307 -79180 -27657 -71204 -135032 -115582
16053 -115582 -114904 -114971 -87767 -49738 -117136 -123339 -90350 -87710 -29369 57200 86232 49573 -4455
16040 -4455 -2405 21717 20324 22489 8619 45209 34672 16334 60226 46740 4471 -27577
16028 -27577 -51105 -37653 16874 10247 -60612 -39472 -26443 -67937 -36517 -3881 -27113 -4422
16016 -4422 -13436 -59763 -49582 -72321 -80168 -56965 -17281 22456 57607 6559 -14296 91827
16004 91827 149952 162003 86456 -5332 8080 -2243 -34737 -52282 -18555 7435 -20613 5142
15992 5142 -71639 -105350 -126404 -110094 -73794 -34037 -25887 -47070 -86308 -95239 -82886 -53056
15980 -53056 -8379 14001 -33377 -9274 25771 -3053 -58421 -24012 28847 24857 31227 -12477
15968 -12477 75253 127863 91656 52623 6789 -20999 -2823 16720 -3204 11312 33639 -16222
15956 -16222 -44852 -42791 -38454 -30493 -13036 -56659 -67976 27038 86924 18408 -76172 -94903
15944 -94903 -72627 -60448 -85169 -41609 -22309 -13618 -22532 -70725 -36319 -47372 -63963 -81374
15932 -81374 -38064 6528 -21246 -87376 -85291 -68654 -41312 -17976 -37833 -42063 -7150 1125
15920 1125 5827 -50650 -75681 -21932 -5023 24003 4790 -8757 -7543 -54531 -78069 -40204
15908 -40204 -65423 -95713 -89700 -85163 -102442 -70322 -29908 -215 5042 11846 39644 52108
15896 52108 37881 19419 6947 -40206 -30227 -8620 2641 10641 14596 -6028 -760 13092
15884 13092 -34327 -19669 -12743 3188 -28009 -70692 -86038 -54686 -81772 -129647 -114237 -104562
15872 -104562 -165858 -166471 -148059 -154726 -118750 -69491 23209 -22150 -69555 -68685 -89475 -70432
15860 -70432 -5318 15043 -42738 -59611 -26543 24485 64625 42559 -20465 -50594 33068 39968
15848 39968 1152 -7967 -32595 -21186 -15127 -17617 -43183 -45593 -65131 -29303 -18200 -12945 15518
15835 15518 2816 -6286 -55625 -50796 -26824 17487 -42472 -59197 -9968 -23381 -58179 -45956
15823 -45956 -6262 32670 51441 84936 68036 -3038 -58157 -85956 -65477 -23936 -34658 -56322
15811 -56322 -77875 -35856 20770 58585 55012 24249 -18186 -28391 -78782 -82358 -43232 12563
15799 12563 -18548 -15947 -5058 9966 -8883 -18104 -15391 18608 53907 5721 -47352 -17296
15787 -17296 -17725 -82057 -13280 -5020 9897 -20553 -60978 -43518 10787 63100 21707 14254
15775 14254 21029 69885 74650 24700 -46521 -96749 -32260 25559 13490 35744 37645 6554
15763 6554 -4165 11661 12528 -26719 -51906 -67932 -64113 -44549 2908 -14324 -23073 -73224 -80015
15750 -80015 -46611 -68785 -29042 12839 -237 -1804 -19321 -44622 1457 35362 33988 21715
15738 21715 17110 37488 1177 -4197 -24484 -18925 4642 14803 7048 20666 11602 14846 -6058
15725 -6058 -42586 -33772 328 15823 5189 28819 80408 71172 67133 47880 704 -32578
15713 -32578 -52252 21005 -12401 -1464 -54698 -87504 -71327 -48266 -8203 -49449 -67051 -87620
15701 -87620 -116493 -85131 -31214 -58740 -106187 -79480 -41021 -55702 -68752 -26840 14376 36450
15689 36450 39298 56582 85616 55231 50990 33272 9399 14921 4831 24573 -16323 -73506
15677 -73506 -65851 -3619 13949 23366 26753 64173 81812 29753 11976 8609 38110 -12018
15665 -12018 -62799 -86921 -98169 -90865 -67650 -74291 -94533 -83517 -111605 -121087 -28072 -30415
15653 -30415 -26791 9783 33132 48280 32612 29750 22412 -42914 -99133 -75157 -40830 -66530
15641 -66530 -14362 -37214 -74279 -112735 -123955 -88279 -100740 -100605 -59151 -8153 -18004 -71992
15629 -71992 -133034 -124020 -95355 -97045 -79239 -47449 -14877 -83438 -113889 -92459 -27973 -6136
15617 -6136 -12594 -22293 -20542 28201 104435 158285 139122 89888 22154 36264 53970 31851
15605 31851 18244 -18799 -19873 9929 -33540 -52786 -31719 -53709 -27686 -11936 -1419 -18359
15593 -18359 22866 7291 -17103 -81232 -53659 14220 31979 -3564 -56908 -8760 12486 2000
15581 2000 -42052 -59339 2258 7900 -20538 -32353 -21099 -256 39461 81787 64460 -4285
15569 -4285 95 6001 1568 -2232 -1869 4191 13428 50036 70762 44270 9514 -53439 -108507
15556 -108507 -164573 -125384 -124164 -121708 -102705 -65571 12317 23375 -847 12387 13425 2702
15544 2702 -13982 -39175 -39765 -40834 11460 32831 84803 81055 -864 -33637 -38061 -49800 -66797
15531 -66797 -113071 -100279 -47024 -40611 -64483 -36401 -1427 -25088 -25312 -32897 -55711 -4040
15519 -4040 -46395 -78492 -60252 -4514 -16140 -50008 -22969 27851 5474 -28962 -22101 -37801
15507 -37801 -95646 -93592 -96119 -43301 -22676 -18258 57464 104569 112603 124874 121397 130997 71835
15494 71835 22246 10368 27209 45666 22045 11221 34911 31933 1171 -3038 26734 36059
15482 36059 33127 31200 63296 86692 26608 -12243 -27970 -3560 35831 70416 2773 -35305
15470 -35305 -73874 -88669 -120769 -78180 -50709 -20681 38399 60411 123348 129523 65630 13656
15458 13656 26053 32151 -24255 -37343 6880 38269 53510 40310 21256 12202 -14093 -52689
15446 -52689 -2208 17544 -21839 -68504 -83922 -99322 -57978 -52781 -53244 -79369 -58860 -30058
15434 -30058 -26978 -78969 -69468 -78972 -60832 -29965 -7214 -2628 -32139 -79678 -80893 -57782 -35080
15421 -35080 6404 25601 18339 54162 43210 22590 66507 71452 79342 23493 -33089 -33155 -31975
15408 -31975 -50614 -106553 -116226 -84361 -70010 -48601 -56324 -103000 -129272 -113922 -121020 -97938
15396 -97938 -100983 -107590 -137077 -137405 -61361 -44436 -86917 -68392 -86637 -113665 -131107 -105931
15384 -105931 -58637 -65341 -61565 -64999 -48260 10345 -23753 -93668 -109422 -108343 -11325 21651
15372 21651 27424 -10912 -18278 -16140 -86886 -88353 -60179 -45768 -50123 -61299 -47429 -8452 -35735
15359 -35735 -33652 14967 -14859 -80177 -144148 -116522 -59125 -42388 27617 43395 60308 13662
15347 13662 18471 -21110 -51606 -39515 -17671 -18492 -4029 -33904 9328 64319 71748 71217 16914
15334 16914 -42085 -13745 -19991 -58104 -16513 -1921 -41576 -42692 -9207 1096 1769 13939
15322 13939 18535 35525 90303 64459 18236 75685 60876 71743 38863 51294 55677 13771
15310 13771 -9241 283 -29703 -24659 657 -21409 -29106 1938 -11377 -54064 -97082 -113226
15298 -113226 -68023 -23470 9640 -47579 -103714 -122497 -59246 -45658 -1233 -14812 -33482
15287 -33482 -38083 17253 17162 4509 -36521 -39203 -1706 -38008 -59656 -53353 -36315 -25551 -45627
15274 -45627 -29270 -37387 -34916 -18794 -52267 -32519 -14462 -2346 -2210 15370 45292 32598
15262 32598 -37550 -75405 -68861 -102186 -66921 -63621 -53509 -62100 -49894 -19076 -27758 -16140
15250 -16140 -11284 -28631 -44851 -18969 -45220 -60423 30516 6375 -48877 -52781 -16235 25938
15238 25938 28664 -13337 -44930 -13994 -45512 -54618 -83151 -98063 -57061 -10939 24431 -24374
15226 -24374 -48765 -33868 333 -36008 -4050 -11666 -19357 -3608 19671 37187 54319 71390
15214 71390 10954 2424 9449 26482 38659 4670 -75264 -67199 -10236 497 -19525 -43132
15202 -43132 -101376 -70861 -62830 -56612 -26826 -24643 -63518 -52027 13459 45667 41461 -1462
15190 -1462 -79491 -120981 -105076 -59061 -64914 -52099 -57594 -32218 -42956 -9968 -3065 -16686
15178 -16686 -59668 -99179 -87425 -47463 3826 -12336 -3932 57416 104625 101845 58579 66380
15166 66380 90360 67393 49006 66177 52461 31179 66749 26547 42037 37693 -13244 -10825
15154 -10825 25843 12069 -21505 19746 5009 -29963 2647 29718 54426 58391 58380 55040 40622
15141 40622 13070 25219 31332 -3175 5091 27219 39454 55924 49676 83877 109763 111762
15129 111762 35115 -76880 -53831 18703 8877 -52765 -37216 -14704 -24662 -28166 -35818 -586
15117 -586 -33491 -66493 7185 50488 48177 27369 -8712 -66695 -113553 -85803 -42605 -42132 -73430
15104 -73430 -116743 -100612 -44647 -23434 -7727 14474 -568 -29151 -31894 -3684 -21649 -12756
15092 -12756 -33978 -67499 -30177 5508 15869 -12128 -56046 -55815 -49307 -18670 -5416 14762
15080 14762 -4370 -19772 -8422 19480 38195 54915 24363 14176 4927 -59621 -89582 -41873
15068 -41873 2801 28789 30938 12099 -8529 -2946 -4188 -7348 3915 52118 13097 9473 -24181
15055 -24181 -29581 -824 41106 19933 37478 47594 28037 43413 35888 -17274 11504 47400
15043 47400 -15791 -76560 -59448 -8908 -12839 47418 94554 37482 9599 4914 19066 461
15031 461 -9649 -42421 -61597 -13626 24031 45427 33498 21756 2593 20214 -22461 1073
15019 1073 25324 27086 34829 37018 41343 6881 -9528 -1970 44197 42690 -13308 -26109 -54860
15006 -54860 -21580 -6250 -25156 -64357 -23535 53909 86579 85904 78305 82549 74315 63259 98436
14993 98436 91007 51933 26116 11771 -13218 -14056 -9790 32963 74328 150988 216726 195443
14981 195443 218253 329566 386019 423434 462559 528177 584156 592722 546228 488526 407591
14970 407591 318644 335266 283064 240258 210526 144413 90770 75825 59632 26692 34371 59181
14958 59181 66011 101905 93915 90314 109530 80407 56453 49335 5734 -35298 -20971 -39935
14946 -39935 -25758 -17137 -5093 -40331 -58398 -24714 3099 5894 33644 2540 -6672 18845
14934 18845 48452 19775 34644 68915 51378 54381 57361 101723 62278 73693 48833 34668
14922 34668 57101 21055 -1697 33311 105653 52845 -12198 -57892 -65955 -90153 -118402 -134967
14910 -134967 -113678 -83566 -111287 -112083 -54664 -21885 -198 -74504 -61889 22554 57812 35626
14898 35626 -13678 -23243 -54155 2218 26509 62673 32228 -28083 -100991 -106654 -37795 -25779
14886 -25779 -45674 -80916 -60823 -68152 -5554 58383 47230 59242 47082 7588 -21063 -68634
14874 -68634 -63977 -84561 -122811 -76784 -81243 -58968 -19034 48495 85151 30767 9089 -39508
14862 -39508 -65403 -25803 -22743 -70315 -106392 -51714 14708 -3943 -36845 -51601 -39953 4792
14850 4792 38516 -25666 -113311 -98309 -53776 -17235 -31161 44742 54684 6180 42417 9827
14838 9827 -69392 -112886 -154726 -90761 -33583 -23195 -4119 4179 19449 1485 -39458 -57816
14826 -57816 -78307 -117002 -128505 -112928 -62130 10223 -16432 -7198 -14704 -62274 -96346 -136414
14814 -136414 -115757 -35311 -5781 36298 16851 -22037 -44941 -48271 -56907 -49559 -29487 11582
14802 11582 46528 9935 -1637 -12877 -48027 -93613 -75776 -45030 -55349 -82227 -22379 2884
14790 2884 3268 -23570 -20961 40084 71912 108138 59725 15748 -8380 -72019 -89579 -36609
14778 -36609 -961 29870 -4749 1504 27243 22291 32864 1998 -10172 -50680 -102138 -80190
14766 -80190 -68926 -79456 -57389 -8991 12724 -5860 -27919 -66044 -45439 -21695 4769 3059
14754 3059 22069 41286 -303 -34577 -89003 -66668 -25151 -21035 17516 -1060 -38117 -65777
14742 -65777 -36626 17234 35623 -10091 -26372 -38712 -19681 52879 82232 56076 -4634 -36258
14730 -36258 -54619 -1349 27885 71760 63944 8081 39927 -4660 31342 78305 38864 8495
14718 8495 -2712 -12329 -24686 -45048 -62579 -16458 29744 14754 27587 48500 26091 43376
14706 43376 37472 -13332 -54830 11768 -7339 -69400 -94932 -87496 -50779 -51924 918 42402
14694 42402 43222 43831 1308 -4266 -17307 -50974 -93831 -61029 -9646 -2973 -10664 -35940 -28274
14681 -28274 -45408 12295 43649 36773 38350 35482 49093 8153 -37904 -114696 -131881 -106340
14669 -106340 -80062 -86096 -77335 -53611 -39228 -51913 -35501 -25146 -43952 -7672 -20259 -53590
14657 -53590 -39712 -34674 43523 84139 60091 66880 33864 47245 77727 78558 21796 -35230
14645 -35230 -51591 -47199 -50009 -46343 -45165 -19170 37910 53150 2298 27407 22755 -13358 -53547
14632 -53547 -30636 12505 -8696 12701 23369 57644 96768 132110 84182 77353 80318 41956
14620 41956 -9448 -23892 -7195 14255 -15821 -38352 -22254 -2060 -35552 -53367 -72747 -13324
14608 -13324 -24635 -64953 -68930 -89234 -119181 -129739 -127677 -67750 -4206 -17753 -21889 -40936
14596 -40936 -68793 -63322 -63136 -87003 -64478 -73329 -80732 -40390 29950 137 -7836 -45500 -64150
14583 -64150 8944 -15202 -90789 -17443 -26165 -17794 -24081 -78363 -74709 -17597 2740 -83283
14571 -83283 -55570 -36457 -36670 17512 1608 15884 -4897 -4152 29296 16944 -35417 -21742
14559 -21742 7493 -6569 2853 11989 13887 2442 4579 -14703 37544 58357 28280 32511 68318
14546 68318 93049 54470 90609 144124 196241 206212 192031 178834 154391 143561 140115 113371
14534 113371 96780 55337 60774 45992 28725 3910 4039 26593 60440 49635 67761 29289
14522 29289 31307 36647 37887 26364 42843 10546 18340 43285 64033 22305 974 51915
14510 51915 86859 41208 -13895 -9608 -17255 -22590 570 34191 35968 24213 18329 25602 48316
14497 48316 -9100 -33981 -30798 -60806 -59620 -67048 -60250 -32100 -19242 -37828 -51387 -22207
14485 -22207 -54260 -20539 18711 6392 -44549 -63385 -85601 -123826 -64876 52857 54334 -17796
14473 -17796 -24199 -10824 13154 25139 50998 53676 64825 30815 19981 63903 90936 66921
14461 66921 39081 10326 20348 7247 27094 26821 60593 52350 23908 29543 34646 -16574 -85294
14448 -85294 -79297 -51765 -25022 -34127 -55103 -84811 -126640 -105500 -45323 20368 33534 51223
14436 51223 86598 78281 91103 75395 76409 21905 -28142 -69213 -95629 -59863 -34606 -65500
14424 -65500 -66063 -71254 -81777 -77781 -84831 -72836 -32202 -40366 -54505 -43732 -13421 22501 15265
14411 15265 -31574 -12988 7887 43263 66895 34397 -14321 -17108 30593 10950 12232 28274
14399 28274 30922 30872 3681 -12716 42028 37979 -22043 -60537 -39444 -12242 -3636 -6131 2589
14386 2589 -15043 -397 21776 5930 29580 88961 71239 -8135 -47472 -76515 -96272 -47854
14374 -47854 -41567 -54152 -44446 -67419 -58818 -26147 -4758 -3599 2653 -18975 -2919 -32899 -41505
14361 -41505 40944 60967 4090 -5710 -40370 -57201 12189 78487 107248 110268 45827 3969
14349 3969 -7545 7066 -3707 -12018 -64742 -123278 -102542 -63282 -49148 -10419 17133 22227
14337 22227 27956 -16039 -68281 -84844 -31926 29830 64099 77043 -8019 -96459 -44929 2901
14325 2901 10336 23099 22713 4768 -14305 -13976 -20449 -96530 -105645 -40428 -39871 -63971 -41438 -12923
14311 -12923 -38873 -39164 -35162 7448 26950 -5729 -39253 -40437 -11552 -47030 -74775 -43841
14299 -43841 5978 -4758 26823 37905 6398 25360 27798 9053 -21969 -3139 42206 114616
14287 114616 127112 46620 31206 64673 27322 -13127 -42716 -6074 22863 79238 23395
14276 23395 -13771 -57493 -49773 -100 15442 -7176 12710 -6855 -24448 -12030 -24326 -10359
14264 -10359 18820 -4314 -54397 -45242 -39360 -33932 -26450 -4035 -11084 -58756 -57822 -32158 -13874
14251 -13874 12540 11521 8748 2177 -1584 -13720 -25252 -61058 -102339 -108949 -57041 7954 67324
14238 67324 99724 55979 61616 55944 56449 55447 36984 9479 31052 30509 -12915 -27239 4795
14225 4795 14931 36719 11560 4458 25391 58030 103573 89383 75142 44189 12004 -17356
14213 -17356 10822 37604 25018 50704 83988 97341 88249 28743 -30551 -93921 -126855 -134478
14201 -134478 -49880 10391 -6741 19648 34299 12879 -22199 -10585 -6894 -6501 -33562 -43118
14189 -43118 -22529 -58813 -103021 -32411 -7069 -17470 16785 44895 38751 42118 888 -21387
14177 -21387 -43556 -45027 -46342 -43454 -49963 -60027 -84631 -81389 5088 42824 18833 -15491 -34314
14164 -34314 -5316 4192 -36129 -11948 31148 63826 99768 98860 60594 24426 29310 30756 16565
14151 16565 27708 -3103 -19254 -5109 34447 101382 76687 12267 -17098 33749 -2693 -13100
14139 -13100 60963 61472 19211 42298 7729 -49730 -54573 -48523 -22754 -28716 -46965 10063 12761
14126 12761 -44358 3169 13184 -32647 -15286 -39113 -72499 -75864 -41944 16824 -23520 -39251
14114 -39251 -20940 46400 53760 40857 72603 57543 873 -12222 28068 23421 -1508 -22294
14102 -22294 -21660 -73662 -84762 -33998 -1331 58303 1046 -25567 -28620 -9241 -44007 -83930
14090 -83930 -115471 -142064 -110006 -82906 -12733 -10743 8343 11859 12238 31408 56197 57199 82841
14077 82841 13828 22308 808 -19739 -39067 -52195 -23969 11272 30633 46050 40667 -4136
14065 -4136 -31425 -13945 20488 58270 50120 -29447 -24947 56297 76979 28931 53232 107852
14053 107852 98409 78381 102990 67481 14375 -2509 -33476 -23689 -6567 -7517 -33545 -53369
14041 -53369 -16988 -54488 -79014 -35500 7824 37697 80924 36049 -4485 45969 55935 11720
14029 11720 -31450 -17034 18046 61380 71909 50329 81305 69430 46498 23989 89034 98894
14017 98894 34698 10249 28597 16756 11388 -33603 -21818 27269 41830 26490 -40021 -40493
14005 -40493 467 9987 -61826 -67388 -3926 13728 11005 23334 17146 31784 31603 70497 59009
13992 59009 39740 14631 -43429 -49075 14046 37973 53595 50286 37467 -6502 9733 12768
13980 12768 895 -69058 -105835 -48765 -14840 -9103 -46059 -43411 -6631 25455 9007 -4087
13968 -4087 -48493 -60020 -16900 4096 30228 -10043 -85331 -102374 -70267 -57866 -29149 -32234
13956 -32234 6109 32874 65816 76121 82015 93098 97755 93616 72032 46956 3279 57071
13944 57071 100717 132877 92274 48320 -22945 17440 81374 96818 62521 42938 57277 2349
13932 2349 3884 5848 34054 68395 41327 34629 65383 34800 43072 69803 80877 33969 6914
13919 6914 -33026 -16013 220 10380 -17116 -22069 -27933 -30630 -30046 -35413 -28543 -5416 -23790
13906 -23790 -13150 -5089 -17154 15959 72841 65130 57276 52239 14844 17041 83202 73455 46886
13893 46886 80218 84892 35811 20663 -13447 -43685 -19863 -46280 -87274 -78750 -68139 -19748
13881 -19748 -15174 -11067 28261 21711 10410 56568 37228 -314 -51528 -29232 6029 6286 53351
13868 53351 60750 40490 54934 84261 89527 38057 9063 -9016 5275 -53869 -94169 -18337
13856 -18337 21796 9095 -37059 -39406 11913 34864 -30457 -28100 -31425 -48889 -47673 -13499
13844 -13499 -39813 -28288 -15180 -40165 -37337 -3676 -9808 -50736 -21974 32806 69823 -12179
13832 -12179 -63148 -62519 -63107 -77172 -56207 -44960 -68058 -56263 8878 16324 -35915 -40826 -95515
13819 -95515 -105011 -47147 -32936 -84004 -62655 -61760 1651 97938 98047 -6843 -48380 -27057
13807 -27057 -11240 30330 32723 23863 18442 -4365 -40284 -54144 -47020 -25773 -9813 909
13795 909 -61988 -76987 -15990 -25654 -40296 -34469 -82179 -45109 -33054 -69031 -76968 -115534 -128377
13782 -128377 -42692 -28645 -16139 -22108 -20627 7554 -16907 12409 76026 49456 18903 -2347
13770 -2347 32240 325 -49979 -24104 -52110 -37221 12304 39730 23881 11621 -9251 16699
13758 16699 51920 39637 49899 51801 74692 29816 38619 41988 -13906 -31992 -20843 -1781
13746 -1781 -26324 -8433 24262 53477 40635 39844 34571 10935 10196 57082 82290 55199 12350
13733 12350 -2570 -628 -26453 -613 19512 -2552 4821 -20639 1455 40058 58939 61884
13721 61884 62309 25295 -3464 11970 49804 16909 -35317 -56744 -62923 -79073 -103019 -83748
13709 -83748 -6776 72411 103208 89182 80346 100618 69720 43345 -19533 39436 25169 -15510
13697 -15510 -39185 -64080 -18954 53056 55489 -2392 -81255 -92838 -37253 -60252 -34212 12481
13685 12481 52430 7412 15782 13587 -31713 -62663 -85420 -48409 28100 39662 28829 45616
13673 45616 79224 112614 86339 30231 26838 181 -13443 -23188 -25450 -34602 -18876 36303
13661 36303 36744 28589 -3188 -1938 22426 27965 35224 4843 -19670 25572 41275 25531 -62123
13648 -62123 -40255 24911 -22878 -72569 -28827 -6769 50229 25527 24598 28452 5358 2450
13636 2450 -26679 -58991 28500 92983 33777 -22901 -63974 -132113 -88672 -43790 -29159 -35312
13624 -35312 9994 -2763 -16397 3923 42862 42853 20003 25474 -25818 -4244 -19942 12792 109921
13611 109921 153551 115388 42440 -17560 -27993 -57423 -62046 -28995 2211 48677 30846 -31759
13599 -31759 23960 77189 25156 48025 86884 120758 114977 91442 82151 70774 49266 37776
13587 37776 38897 18553 56391 33808 -58277 -109729 -82233 -37403 -3573 17395 8060 -30076
13575 -30076 -21491 21180 37103 48495 124231 139129 147103 99290 64656 -24194 -59466 -17885
13563 -17885 59446 118596 109271 33640 31269 53470 -11645 20331 84545 47216 52949 66671
13551 66671 93454 101198 47606 22153 69122 145125 138279 67957 22039 -4423 26121 95855
13539 95855 66115 43297 48838 35905 23679 63347 82711 67114 72682 87278 87490 74265
13527 74265 86390 66457 77462 107020 32476 -66424 -73725 -42924 -32373 -15882 32050 35880
13515 35880 36423 65390 18528 23544 28922 27298 -8888 -27667 -4161 -18808 6216 17902 42391
13502 42391 41944 5424 9739 50300 53540 45810 24708 5245 3930 -1787 -10431 -28857 -20104
13489 -20104 26177 50454 76329 47907 55014 27818 -8762 10474 11191 -11654 24126 6268
13477 6268 -14798 32209 -5437 6517 29852 86510 113009 40189 -23137 20457 28094 43862
13465 43862 50753 46878 53167 66579 90624 108416 90174 39216 7139 -35488 -37462 -54431
13453 -54431 9411 82456 51850 1891 21074 33247 57876 71335 83048 71942 70771 130472
13441 130472 128854 108737 126565 107083 50773 111045 144003 117109 38855 38709 73453 77540
13429 77540 37962 20547 56939 90645 52794 38987 6042 -23723 -5243 26207 -9716 -12788
13417 -12788 -12258 -8502 -29772 -21768 1161 11045 3128 1332 -27587 -17559 11760 -2295 3826
13404 3826 35965 79457 76929 14949 -34941 -53299 -91834 -41436 -41635 -95359 -51316 4305
13392 4305 -5094 -27914 -77198 -35919 29547 53423 94363 110514 103332 62628 55759 27795
13380 27795 60724 92998 73284 23481 29787 14874 70897 73968 44628 51079 39207 50389
13368 50389 71982 66183 1859 -21717 50258 114845 92024 120905 73382 42374 -18381 -52609
13356 -52609 -17150 -40609 23675 68269 18679 41598 46234 58493 54070 92795 94554 -4292
13344 -4292 -5561 16192 43019 49734 24328 64354 107691 90592 85194 114229 128128 81271
13332 81271 111329 90005 74318 76365 5487 -55797 -35935 -10645 7680 37813 42157 12902
13320 12902 26563 42576 23830 35589 92066 112749 120320 112456 93653 111536 128766 135147
13308 135147 84559 57837 77139 17504 5107 57892 124192 113424 176867 188724 111944
13297 111944 78929 55722 15728 44842 76766 78758 42852 42249 64599 76268 74346 35940
13285 35940 60939 68376 73362 112681 71320 16034 23177 8275 -4567 -14763 -44123 -13212
13273 -13212 16950 35395 28181 9959 18862 100814 128646 125353 158968 143170 140264 139734 162214
13260 162214 172673 85439 34768 65265 124070 148456 162734 129455 52423 65712 66202 20962
13248 20962 23512 59952 66103 98513 157210 123761 92306 93236 70349 94657 99789 74366 42160
13235 42160 10285 7401 71909 73126 32770 15900 30925 57959 43735 -9878 -40515 -7310
13223 -7310 15764 3679 -24448 -49815 -25942 -29268 -41206 -34950 -12086 13607 33723 45254
13211 45254 22076 -20682 -22971 -828 -2196 -2354 -42994 14221 68860 123215 127353 131110 146456
13198 146456 151318 94841 95252 156032 255333 326665 374289 438724 526846 549351 585789 573835
13186 573835 485391 380932 352453 283388 226369 170582 143202 111113 108049 81198 66590
13175 66590 87601 139961 130964 166874 164575 74391 42027 4763 1743 61403 81421 73270
13163 73270 104237 73287 68195 116160 155003 151497 130101 142494 198693 227991 245569 313480
13151 313480 351705 475787 671894 847929 1050689 1283598 1459671 1565048 1666383 1697775
13141 1697775 1517126 1191896 877072 641620 521424 406794 297797 270466 299290 291554
13131 291554 234786 172369 234288 261172 169921 119435 111392 117057 144253 151323 131700 125671
13119 125671 199743 220708 191726 201609 197092 295495 342563 356839 342868 378539 394324 408605
13107 408605 460584 501954 537688 679064 816690 1034405 1252472 1426051 1610996 1750676
13097 1750676 1817811 1656583 1413509 1114266 825258 670682 522645 419464 384108 343348
13087 343348 262520 246269 255031 262004 216784 219426 226049 251080 237962 235286 200358 202439 162023
13074 162023 146274 181538 223217 195611 158479 123749 133357 167987 167787 125966 145739 148422
13062 148422 128472 171579 159804 204591 280874 365124 484627 560508 609782 670705 695916
13051 695916 639095 513057 401644 338688 280543 290534 283339 238413 180786 128886 129607 137225
13039 137225 163336 162608 90644 42499 59934 92001 109329 56046 67440 62861 33848 27767
13027 27767 96373 78935 107872 116597 101708 31336 10399 4639 40862 59379 82047 129666
13015 129666 153639 97294 116462 76965 22412 37275 82811 80911 55936 56967 66901 39261
13003 39261 55934 68173 119026 147452 140909 151664 131056 129463 101006 105226 97551 77103
12991 77103 532 6818 62096 51326 47834 106821 129945 96384 79862 54012 40995 44683
12979 44683 774 -53488 -7108 88475 127442 131506 158217 103739 22743 12360 50538 73340
12967 73340 65128 26442 24507 47595 98356 79721 57679 65967 68521 93404 133164 42595
12955 42595 20196 5157 -29878 -10878 52630 56059 45795 28089 48524 43784 60420 48486
12943 48486 55897 53321 11366 66346 103931 76756 1578 31806 106373 86343 43654 63024
12931 63024 51889 63380 62610 16852 16666 43307 5546 5061 94900 104655 130866 160693 89991
12918 89991 60924 69943 54557 26324 31243 -21551 -52622 -2376 29177 69348 76570 48333
12906 48333 21413 37571 74259 112739 111303 139372 86320 23760 82724 128991 130688 155629
12894 155629 122366 91187 54564 100716 178984 165615 109423 79723 56833 50078 74039 95697
12882 95697 118035 140369 93016 82198 85657 103632 100662 113923 29671 9238 44454 52223
12870 52223 86587 93076 129517 144256 155855 132076 37463 1018 56227 166010 175862 154388
12858 154388 133086 140732 129337 90520 121720 150506 129320 148667 185884 190220 200606 214091
12846 214091 149243 99194 64806 172 36570 95726 113747 115659 146337 174184 118991 57297
12834 57297 27400 31456 17110 49440 52423 42226 -4288 63 74946 139207 141406 116559
12822 116559 124435 137848 161097 156456 152052 148950 147112 151183 167302 195631 171021 136127 131121
12809 131121 143103 120010 112120 141075 129723 175213 181431 175634 155886 155396 152236 89995 57104
12796 57104 24290 29138 88047 114298 121337 146248 166344 117968 111945 168544 141850 145244
12784 145244 152076 135143 90619 82391 91577 68054 71154 96461 214207 209668 186247 196298
12772 196298 194684 185891 182005 162593 116453 94797 83148 68608 103715 135087 157204 180024
12760 180024 173305 210298 190829 109000 84475 106728 124047 153107 103102 106649 102682 64163
12748 64163 73472 128843 102056 69908 82084 73726 117040 121723 128515 98333 39955 45345 91883
12735 91883 120715 103637 115074 112186 100624 88063 54831 57754 73114 149941 152049 145742
12723 145742 157006 190615 177820 170742 177115 221399 122479 49499 53101 96708 138773 142804
12711 142804 143733 142556 144444 192832 196766 196560 182081 159642 113485 142751 188467 205431 170534
12698 170534 105561 113278 112818 123152 161606 195878 219169 210878 192055 188488 172917 156013
12686 156013 221354 215292 194408 206979 182369 166276 172665 196426 242562 198742 189046 135449
12674 135449 137383 160769 156082 172453 195945 211067 245726 224256 174458 144903 107330 109914
12662 109914 146642 198461 239076 220412 239933 264806 269396 249397 209238 197499 226348 203048
12650 203048 182383 227545 293579 380170 381628 379114 377215 405513 451213 542789 585887 595146
12638 595146 618131 612052 576755 536869 564217 552254 497918 550735 540063 520106 525948 592922
12626 592922 611092 609529 635952 629856 635948 573858 502281 500530 546875 584855 553134 550894
12614 550894 580324 573647 595989 535429 558533 609657 623822 672541 740159 799391 895296 949991
12602 949991 1067036 1180977 1284701 1389422 1482711 1510543 1509718 1475463 1459164 1373581 1202978
12591 1202978 1087580 1033329 984389 929290 922162 910039 918414 869356 835848 777033 794640
12580 794640 808919 768652 718422 688002 725419 799072 834445 767496 666555 647724 666698
12569 666698 672512 649445 653825 655206 617682 565099 574958 608688 547659 599690 645467 659977
12557 659977 617216 686623 754894 777806 794636 795810 738816 735477 670373 617099 563000 512265
12545 512265 463649 425127 419321 461109 471353 484662 447334 361650 367590 396578 388286 366264
12533 366264 281406 254626 250885 250865 250307 221094 295043 302059 292396 296566 283531 326752 350063
12520 350063 361666 327911 281548 287380 334003 358620 305518 268258 273707 298216 311432 252077
12508 252077 176286 231957 307889 389528 373450 339734 259882 278609 280381 289766 288464 272937
12496 272937 261725 302335 362183 328814 290803 272154 262177 270929 254276 276755 254853 248451
12484 248451 248703 265118 263315 299273 312914 350394 357760 337543 343223 317773 267297 205504
12472 205504 198844 217714 252758 305029 281363 209567 192057 250056 307005 384531 389657 410028
12460 410028 404619 374963 341814 287187 277414 305290 348861 373745 346593 345280 387958 363290
12448 363290 314229 331973 356596 311335 288913 305080 311166 295910 308465 394199 386761 352116
12436 352116 351215 335483 362656 372295 380860 396447 403513 414016 366853 350891 394450 421045
12424 421045 479654 456250 397098 367212 407504 474345 500378 459198 398460 412728 500744
12413 500744 539257 526490 534079 537496 547388 547716 452280 401876 387596 386268 398892 418100 452598
12400 452598 475252 535715 573383 553219 503113 482043 454578 456866 523198 556118 596244 640779
12388 640779 621553 560979 568946 487185 485846 563251 614159 550947 534546 545286 579231 600625
12376 600625 612244 638913 630800 588189 576016 564344 566306 523183 548578 612668 625545 654644
12364 654644 625855 638249 656726 612592 613041 616976 584195 572263 510224 547556 558919 519698
12352 519698 552526 604993 646238 658971 647238 641594 648055 665572 619375 590876 632172 696219
12340 696219 715457 703865 709630 731742 783472 811132 816197 822564 840324 820867 853137 861849
12328 861849 862836 899765 901731 920827 904916 901660 898132 888939 917170 1009595 1064037 1055617 1045820
12315 1045820 1085726 1039383 988624 1016866 1016592 1058487 1074003 1077971 1090978 1112088 1118188 1135288
12303 1135288 1145939 1155410 1112731 1142985 1225548 1336469 1407014 1423442 1407357 1437364 1521486
12292 1521486 1645364 1699694 1700656 1739244 1732372 1729449 1792013 1847266 1865282 1895750 1942840 1957385
12280 1957385 1981453 2085299 2154224 2258923 2401119 2546349 2697178 2798159 2911734 3070924
12270 3070924 3248545 3379731 3422869 3426263 3472473 3522256 3550785 3565383 3631012 3675042 3690907
12259 3690907 3726985 3706525 3773040 3871773 3950248 3970464 4043338 4152457 4267539 4363724 4429937
12248 4429937 4431286 4410210 4373658 4358253 4285939 4269883 4265811 4299383 4406742 4489444 4578859
12237 4578859 4765391 4961766 5172333 5463731 5830915 6179621 6547581 6990214 7466244
12228 7466244 7915011 8432200 9000738 9502002 10014647 10550975 11067874 11743086 12443208
12219 12443208 13134535 13918751 14785085 15694740 16528456 17371861 18259801 19092210 20029196
12210 20029196 21031304 22123737 23540765 25416711 27910420 31239060 35486063 40926395
12202 40926395 47718722 55817215 64808776 74160953 83049561 90706840 96660084 100173932
12194 100173932 100404170 97280917 91511495 84600934 78219388 73374153 70264920 68880309
12186 68880309 68821507 69738070 71312744 73288951 75408622 77527358 79598421 81453331
12178 81453331 82981080 84189068 85355507 86699981 88418025 90654989 93295947 96145245
12170 96145245 98895369 101362578 103307976 104837581 106098273 107493571 109662516 113228142
12162 113228142 118889432 127357409 139254560 154846461 173626744 194386704 215485168
12155 215485168 235142421 251794824 263197703 266657783 260096540 243845893 221594753
12148 221594753 197991802 176805240 159686392 146928743 138015487 132003514 128064890
12141 128064890 125607833 124083089 122912485 121708288 120179972 118140554 115530109 112446241
12133 112446241 109164519 106179942 103780348 101999470 100466396 99215769 98036691 96616289
12125 96616289 94852164 92828318 90710165 88909424 87815423 87568558 88363806 90478062
12117 90478062 94012615 98836075 104511552 110518957 116296206 121069559 123937851 123838190
12109 123838190 119904032 112183889 101856915 90662179 79988416 70682754 63016622
12102 63016622 56949240 52341190 48832106 46161791 44086720 42432573 41066747 39835057
12094 39835057 38618556 37399969 36115299 34802428 33512507 32158139 30784047 29473929
12086 29473929 28263121 27158142 26067506 25048260 24048246 23065621 22100367 21209444
12078 21209444 20349839 19413110 18489295 17653988 16905384 16232666 15605660 15075573 14621996
12069 14621996 14150455 13739944 13302446 12918477 12663566 12334097 12054028 11859248 11727827
12060 11727827 11560993 11364402 11182241 11038998 10837819 10607493 10394497 10126383 9901655
12051 9901655 9648127 9407602 9173564 8997037 8821140 8644121 8501806 8356435 8196688
12042 8196688 8085790 7955538 7807398 7623537 7399132 7132217 6891927 6697457 6396074
12033 6396074 6108825 5830523 5640334 5432755 5238412 5061570 4881046 4682598 4534900
12024 4534900 4419270 4303959 4205559 4058758 3940245 3803690 3698555 3603005 3487510 3378927
12014 3378927 3271139 3206762 3122689 2998029 2823805 2762811 2735554 2636761 2565118 2522224 2452500
12003 2452500 2390398 2303089 2206685 2207212 2217199 2197154 2120125 2009337 1899348 1860835 1856807 1812175
11991 1812175 1774089 1726091 1613297 1520349 1495476 1504620 1511382 1496384 1449072 1390793 1366484
11980 1366484 1370417 1333554 1273338 1270259 1235997 1190642 1197489 1174718 1154472 1132147 1058322 1014500
11968 1014500 994927 1002435 1004804 1022634 1031897 985558 957909 994914 1065084 1069921 1045134 978412
11956 978412 912193 922061 904935 919370 901417 916237 931764 907055 887148 826154 824660 834089
11944 834089 833017 828391 841872 878669 869505 833624 772976 747907 738391 804587 812103 772900
11932 772900 735703 703840 707743 704269 695868 637754 555890 543640 576656 601672 571282 540417
11920 540417 512391 530940 595211 638584 623227 578298 607110 634412 629646 653109 648494 607394
11908 607394 592941 603910 647036 672800 655744 582450 511665 531540 544401 557603 547578
11897 547578 546342 540358 503519 476713 428528 433561 418413 397728 424613 496171 545555 582398
11885 582398 574322 596348 637887 628031 634131 724758 775119 902404 1132909 1402854 1849066
11874 1849066 2556687 3295169 3799194 4170857 4662734 5230029 5332749 4520562 3242478
11865 3242478 2231048 1696185 1376948 1196372 1066361 975506 906973 888896 837115 747246
11855 747246 711275 692797 724655 665005 607607 549058 551308 561294 553243 467343 405155 430039
11843 430039 525401 531691 450488 422876 396379 433885 396058 311411 322489 384144 383530 365720
11831 365720 385391 389989 313356 299280 300650 303346 327184 287266 254305 240425 184610 152162
11819 152162 257912 271184 226684 219325 276368 338040 262431 213244 216045 207863 210711 255935
11807 255935 239375 181202 125077 143593 178486 149230 123070 125992 145345 115468 202292 196705
11795 196705 182606 215122 182272 97965 80962 94276 117386 163810 181645 125070 73869
11784 73869 58290 55907 89532 120208 108990 75723 117827 149819 173755 150590 116744 142995
11772 142995 136042 153595 146524 152915 165972 161740 151129 111606 138264 223486 257194 267245
11760 267245 254876 250024 218860 172623 162486 249030 340549 345057 411490 431729 370843 420099
11748 420099 525392 609943 631315 588206 556625 514834 523141 628043 635751 577207 493310
11737 493310 437830 453009 494915 539333 474562 421106 391460 426927 488976 518535 525290 543671
11725 543671 579634 588950 596913 625743 590232 564398 576422 588907 633026 680440 685104 686788
11713 686788 680782 740225 780891 754214 804099 845690 905627 1045827 1178268 1318659 1377056
11702 1377056 1430257 1434228 1346743 1272155 1127978 1038368 951957 837380 718265 676809 658642
11691 658642 635209 586660 528363 556911 588952 604609 498397 459083 479079 506025 499300
11680 499300 455136 441783 475642 527732 540395 562175 546183 529040 581636 651862 588960
11669 588960 539897 579044 619226 595834 601993 586097 585777 619880 685605 680204 694552 672990
11657 672990 651820 671295 625229 491899 418405 345051 316683 266888 266921 291140 280262 243828
11645 243828 183605 191310 193185 174993 172236 181586 186892 162742 135141 113465 154900 153001 145671
11632 145671 61375 44775 147833 190073 147232 118125 127260 87508 79120 89655 97913 75491
11620 75491 103964 115010 91162 91739 94544 90183 117330 141245 185422 181370 146617 68499 33252
11607 33252 1383 20290 90720 126305 152918 174844 156902 95547 112496 99923 65745 133266
11595 133266 148704 108554 70387 50384 107063 109068 88981 78048 82323 76767 77200 45378
11583 45378 56379 45187 42987 54736 88285 116831 97252 77412 99181 107559 76929 24827
11571 24827 -31902 -17303 -10127 5391 -8593 -25188 28782 27120 10480 -11720 -44086 -18996
11559 -18996 -949 6044 -53758 -64001 22519 44734 2396 -52820 -44705 21692 80833 97941
11547 97941 27585 -3729 12669 22999 50126 56829 78485 78903 38524 50709 58388 39991
11535 39991 11778 -19744 13520 1600 4991 -34969 -29439 -27742 -50897 -107522 -77780 -6191
11523 -6191 34880 72774 134553 115584 72610 50937 -1542 -1773 -38657 -35468 -23824 -29740 -30911
11510 -30911 -41631 -63828 -74176 -68891 -32650 -49503 -70590 -26075 -10846 -19294 -83340 -94641
11498 -94641 -93674 -119241 -68399 25181 15284 34117 10003 -27976 -36151 -26917 -34325 -45585 -95244
11485 -95244 -78468 -57135 -49688 -20809 -22935 15376 74508 75595 11835 -63011 -85988 -70783
11473 -70783 -15780 42088 103268 86292 -3960 -3012 27850 40795 36404 -13101 3232 18724
11461 18724 6874 -2092 3949 -46209 1892 64959 36864 47141 96726 79729 39780 5229
11449 5229 -13727 -14006 -51447 -73054 -42323 -42845 -35188 -63952 -36696 -69436 -117194 -68949 15448
11436 15448 -26358 7985 26413 -10783 -15955 11008 17075 -2312 -2697 88143 130805 85092
11424 85092 -18945 -73761 -66727 -55607 -62517 -50340 25432 76613 38488 58707 63366 51068
11412 51068 15736 -50698 -49773 -46035 -60514 -43984 43230 48797 -24343 -99398 -82395 -25517
11400 -25517 39694 28589 -14780 -114394 -125969 -94990 -48007 -12483 3039 18601 -32614 -103959
11388 -103959 -98359 -36418 6777 26602 63146 79539 -5274 -51210 -46438 -9601 -13651 -51467
11376 -51467 -37122 20899 30892 20386 -34769 -71737 -49822 -35470 -51149 -70105 -17834 -14907
11364 -14907 -26372 -39404 -60698 -133185 -198211 -180643 -105910 -1366 -1642 -56290 -106350 -90305
11352 -90305 -35552 -44534 -42610 -95493 -18532 17313 16449 42881 34245 18948 11040 -34406 810
11339 810 -25508 -21566 27113 28634 -35069 -27005 -18003 -24178 -21198 -35504 -46582 -46693 -71828 -52376
11325 -52376 2938 17799 -25479 -6243 -5823 -79754 -109492 -91764 -97830 -103505 -78195 -115651
11313 -115651 -94417 -82505 -23762 15260 23169 -2005 -5678 -28720 -22523 -32030 -42194 -6557
11301 -6557 -22947 7143 -34454 -38928 5400 15558 61912 91777 79728 57679 67271 91138
11289 91138 49124 43656 72578 76132 16441 -48811 -47837 -278 12091 -7911 54238 81250
11277 81250 46499 58281 99426 147997 89623 21902 12544 21348 99864 69121 23078 53472
11265 53472 67865 24738 -5089 13613 -20178 -70264 -50301 13902 35351 38969 44512 40160
11253 40160 12320 40907 22896 -6121 55716 107123 117955 96708 44885 5482 1142 -983
11241 -983 19266 -918 -11654 -18600 4828 53236 34442 59429 46182 47739 27938 -23156
11229 -23156 -41483 -104633 -157457 -126510 -68156 -55215 -49783 -78458 -105564 -112236 -55841 20554
11217 20554 15439 -46350 -70045 -33808 -9536 -26313 23120 69051 35199 1649 43978 12180
11205 12180 -32199 -22370 -58689 -48727 -77655 -87538 -63321 -48456 -69549 -71091 -47102 -70604
11193 -70604 -54908 -34637 -53849 -51369 -456 -20045 -35478 -72845 -60528 -59726 -27701 -4180
11181 -4180 12701 6227 -35401 -67308 -65629 592 -45354 -59946 -8802 -24672 -59622 -20220
11169 -20220 51378 81613 60839 23414 -1862 -15668 12968 56561 56591 31190 34874 16763
11157 16763 7517 6258 -3522 21031 28495 89084 62334 -6373 -57346 -105998 -124590 -136021
11145 -136021 -94287 -67528 -83215 -75129 -61188 11206 71193 110283 148747 105363 90908 31371
11133 31371 -41947 -68259 -33282 3923 -43859 -57262 -32215 -58408 -85300 -86898 -34237 -40016
11121 -40016 -27428 -39845 -65939 -23274 -45934 -110390 -100758 -44543 -13009 28457 6792 17448
11109 17448 52149 44249 -19136 -34496 18692 19189 7002 8513 3820 -3090 -4771 -15165 -53672
11096 -53672 -60030 -19683 4388 15187 69043 97462 53864 20050 10418 53396 49509 43495
11084 43495 42936 25872 -16854 -55184 -10672 23555 16781 -6235 -37498 -27300 -54522 -85866
11072 -85866 -95046 -111837 -134760 -106525 -43094 47894 100148 96422 83153 20343 13611 -44020
11060 -44020 -24152 -22955 -47789 -26819 -13887 -7949 -17094 -9030 11683 -39685 -45843 -589 19929
11047 19929 6896 6188 -8293 -5027 -3666 29633 7072 3979 30125 48094 75902 63824 -3816
11034 -3816 4024 78781 125410 105609 129133 104444 58713 85903 58333 89331 60860 17416
11022 17416 -26243 -56871 -38288 22568 -9101 40707 27057 75037 63751 35567 45973 52571
11010 52571 35962 -12376 -30695 44322 65803 67226 45423 41341 26752 16335 39885 65392
10998 65392 76000 22166 706 68565 106789 84242 64270 76083 39228 48296 81700 97279
10986 97279 166174 145047 119770 80869 70520 53016 51225 97904 138917 110468 28941 24099
10974 24099 -10665 -4206 -33708 -29261 -18304 -2564 62755 54597 19215 -3178 -6244 45778
10962 45778 64375 15498 10567 54028 115275 60997 11818 18710 33829 84380 99140 120087
10950 120087 135519 159361 156816 174672 202787 248495 279083 261615 227844 165785 136674 127595
10938 127595 125100 74533 36905 609 -656 70561 91867 118814 164803 110312 115484 159282
10926 159282 97504 34372 19179 33297 55411 111709 79240 8106 16093 13342 20143 51294
10914 51294 67487 50295 57840 47584 15795 7923 -73531 -88099 -66866 2735 22296 25144
10902 25144 79240 118324 69242 57694 58564 33468 3552 -7258 20774 46186 35830 32125
10890 32125 84116 96549 127782 149214 161184 158220 137632 118299 98101 65732 30484 -1403
10878 -1403 -44073 -89221 -23670 -9021 16187 66005 53065 12034 12635 1171 -30842 1384
10866 1384 49168 59335 27405 28918 33902 44463 21181 -9836 -32837 14000 45545 43507
10854 43507 -12260 -47593 3914 13483 -12528 8041 39354 23297 21720 71174 65966 44580
10842 44580 4913 57826 89823 100246 72285 72369 41636 -8079 -42095 -71576 -8853 3842
10830 3842 34158 119252 126518 96781 81874 100533 157529 167048 117612 21238 -43183 -8013
10818 -8013 -9356 -35521 4774 9717 22725 49993 50009 21912 41231 75922 508 -36831 -22364
10805 -22364 38764 55151 12098 -10367 -81496 -110893 -103923 -62669 -27536 49794 66410 39966
10793 39966 -5106 5828 45909 65872 71887 57427 35662 24411 29300 24189 35747 56909
10781 56909 27849 80364 129371 132233 126676 135040 94054 68332 38492 31848 25162 82555 125523
10768 125523 81846 32642 7825 47585 70487 35283 5135 -33578 -12636 46668 42388 19647
10756 19647 49645 36730 12887 43017 88884 102583 77559 40552 42274 91308 86100 24777
10744 24777 -6927 23225 49325 92476 73273 12080 3052 -46968 -54858 -52069 -19358 3105
10732 3105 10104 18352 -33745 -13434 -54712 -67224 5477 75936 91808 54278 39046 29749
10720 29749 34383 27838 14970 16982 45938 39939 58301 52869 6691 71156 97592 92725 89845
10707 89845 98775 132069 107083 57742 34690 67498 64675 21560 46134 84469 77016 47598
10695 47598 20598 19444 -37424 -39077 -22795 49609 97959 72992 41962 65165 90778 145650
10683 145650 107828 93701 88525 81580 63153 58817 72168 73931 76131 78652 28806 -6403 -2400
10670 -2400 40040 75256 71725 21361 35516 46357 61980 119491 155382 159971 148435 109326
10658 109326 93027 116033 40194 62087 104918 106363 142136 111546 54776 -1311 7561 29658
10646 29658 6891 -40316 -54672 -80395 -69632 -5630 7954 -28495 17588 27716 40751 47111
10634 47111 47114 55011 67472 96748 104357 -7967 -37122 104055 135250 75770 26864 48770
10622 48770 106835 117205 98701 88092 120843 164293 183222 148519 137047 120722 103294 145787
10610 145787 162544 199021 233806 234809 203520 183434 192908 199204 186574 193502 226744 201934
10598 201934 145174 132948 157731 145698 125705 81344 53739 66874 63187 24993 55559 69779
10586 69779 67016 82840 73909 74419 8410 -63799 -58188 -31170 -40921 -25494 30863 58782 98719
10573 98719 66845 14344 -38605 -27330 -46428 -110104 -110642 -63572 -5005 37127 24709 -16538
10561 -16538 -89271 -85848 -18854 73971 112510 135744 99835 50865 57475 89278 137490 141121
10549 141121 139176 131484 94459 83710 102246 72916 67177 59929 67862 38892 38697 10751 31117
10536 31117 140201 148196 133327 119180 72850 13928 25945 40693 60728 88845 114660 77360
10524 77360 56753 88669 134075 88685 81242 134500 182403 166918 155617 204617 270141 331904
10512 331904 373450 389505 405311 439147 486731 539917 498246 381842 279933 233627 190564
10501 190564 198275 184198 146921 137185 176514 169965 193423 166534 147889 137007 196887 195732
10489 195732 172562 129965 87152 70906 123146 144163 86515 96704 131020 157247 185220
10478 185220 182792 196868 226512 240654 211870 167259 192995 205806 179475 211306 243203 179168
10466 179168 173967 186676 163869 155543 104685 80726 141484 117259 139535 177133 158638 111785
10454 111785 151240 146850 202020 220034 225659 246950 250480 199790 186600 179821 178659 161283
10442 161283 211765 229871 240373 303683 403756 505827 581314 590808 553960 494004 464831
10431 464831 365986 323212 337557 270955 205728 216668 236773 233191 193731 207058 180492 166923
10419 166923 221890 230006 163865 114483 84811 73132 136099 174031 140391 106775 187610 171885
10407 171885 109203 166473 206691 196354 159074 69670 89469 145088 146058 194819 221119 250074
10395 250074 305345 369124 422746 479342 505668 482584 514743 541461 575967 590935 541021
10384 541021 461903 346398 287563 237476 260880 267435 230544 144998 107988 113943 132027 154783
10372 154783 124223 111902 164603 211071 199500 182004 195208 235903 255061 226478 207344
10361 207344 216903 265587 306896 271269 178907 185517 221655 167550 167551 174493 156836 187096 224164
10348 224164 259061 308982 373341 448796 445563 345553 338922 424865 437289 385269 338277 291231
10336 291231 242651 212172 160961 198244 274307 302896 327487 312621 297127 258455 220315
10325 220315 246171 290286 292272 291547 297249 298475 295047 284366 272744 238356 296185 327846 322198
10312 322198 329880 342677 375646 456192 541690 594520 639080 716475 771766 804027 894770 956807
10300 956807 1008368 1036931 1021768 994136 916112 848025 750884 625434 555241 512877 447874
10289 447874 424989 448006 439200 434189 479953 464739 412868 412919 337935 335208 309311 295089 326402
10276 326402 300042 259607 270689 302936 267184 322896 358501 379972 474083 567243 614027
10265 614027 688822 776878 853954 969122 1075776 1227620 1336795 1412673 1517629 1567710
10255 1567710 1542349 1487109 1461901 1333150 1146235 1040200 916370 775234 740766 743062
10245 743062 680035 637853 640614 611889 550542 504793 451576 430773 468826 560397 542184 468086
10233 468086 482046 508187 542040 533927 485650 461401 448671 463680 460304 434625 430596 519779
10221 519779 620668 712583 809186 900926 978359 1073613 1231319 1318388 1330619 1367818 1259295
10210 1259295 1154791 1045757 910625 798326 719638 663541 652327 683178 710437 629707
10200 629707 536489 501288 469623 405472 443965 494113 457350 422732 409610 424321 415670 387977
10188 387977 395132 408129 385804 389368 371040 328916 370725 393874 396329 384804 405194 404592
10176 404592 455973 507042 503127 523067 557245 592376 643034 634687 588372 542449 520670 550404
10164 550404 510249 429230 380404 398823 370212 354109 308724 261998 276440 284294 278890 295410
10152 295410 315746 285659 278598 246504 282914 366062 383188 347534 331531 338384 380040 388201
10140 388201 431274 413250 382685 416608 419322 358009 348887 392820 394111 378594 374643 376004
10128 376004 375546 399557 383784 395074 420045 395850 426658 452483 459325 475813 485864 472419
10116 472419 457559 467053 471363 434526 429209 458088 520018 522608 568267 572553 543709 562945
10104 562945 563216 562919 558798 555868 604901 629281 652861 692494 671577 664162 650870 623983 594893
10091 594893 597064 588620 622441 583374 605642 619371 606516 574102 524322 481008 549720 559819
10079 559819 468483 505251 525975 532261 553006 521562 506153 506842 554742 559819 556319 578825
10067 578825 601710 616660 675218 679510 639850 663465 648165 617961 648295 653177 639471 691217
10055 691217 698647 736091 796014 789446 850519 878049 922426 965347 975750 1037004 1172158 1424110
10043 1424110 1779988 2222174 2950551 4299771 5649173 6191811 6675945 7682374 8882717
10034 8882717 9318964 7294370 4772522 3348176 2643199 2253937 1994916 1786297 1677021
10025 1677021 1549981 1451944 1380560 1290606 1250597 1275104 1262452 1281662 1283702 1276136 1238510
10014 1238510 1244872 1224708 1180380 1176609 1198254 1175942 1163224 1176917 1134793 1081078 1107459 1110461
10002 1110461 1141180 1139686 1143698 1145531 1137037 1160400 1194347 1191104 1203938 1191515 1195346 1203671 1247987
9989 1247987 1326562 1366938 1452027 1486150 1561163 1611451 1595475 1610192 1572622 1555720 1524979
9978 1524979 1481289 1431346 1367327 1392181 1456310 1494887 1541299 1595250 1671399 1718928 1815345
9967 1815345 1902141 1951783 2077542 2139729 2144956 2222000 2389429 2475538 2605681 2787208 2948436
9956 2948436 3049720 3217984 3456874 3720746 3889156 4042183 4192123 4361417 4563147 4758511
9946 4758511 4922029 5054760 5115687 5034191 4920258 4923013 4871011 4701155 4581206 4537127 4491738
9935 4491738 4555411 4593850 4646643 4852536 5115644 5531512 6105348 6754634 7468428 8295806
9925 8295806 9221543 10121437 10869099 11409061 11742560 11759279 11557542 11229221 10848353 10431275
9915 10431275 9973053 9534333 9134847 8818188 8615839 8453130 8354908 8350814 8463461 8642772
9905 8642772 8919056 9279757 9678719 10181895 10839695 11556484 12463207 13512233 14643630
9896 14643630 15951033 17615545 19625206 22202082 25650361 30161927 36131626 44020617
9888 44020617 54038595 66100276 79116570 90972164 101044417 109993103 116889137
9881 116889137 118481853 111737391 98313183 84124324 72604115 64274253 58780791 55845313
9873 55845313 55211783 56647607 59903343 64722052 70805366 77936547 85856421 94052687
9865 94052687 101694383 108300788 113758257 117713704 120049683 121127779 121514466 121105599
9857 121105599 119483557 116892130 113692959 109956586 105852283 102172422 100205458 100836603
9849 100836603 104520170 112034204 124493592 143119571 168520266 198913646 229016752
9842 229016752 254845763 277614085 297526508 307825741 297820988 265697295 225444640
9835 225444640 190024526 162244771 141416119 126686569 117468296 112803653 111637394
9828 111637394 112938771 115759271 119540853 123630898 127640648 131168787 133791700 135670391
9820 135670391 136726626 136348675 134118457 130357727 125850649 120733391 114484340 106733361
9812 106733361 98016264 89107669 81270649 75393378 71624905 69805734 69934900 72080992
9804 72080992 76378105 83035730 91831503 101499775 110280989 117415660 123394152 127279077
9796 127279077 126207579 117611917 102892931 87038212 73548022 62996958 54875777
9789 54875777 48728100 44112573 40539364 37657587 35326855 33448434 31914813 30552114
9781 30552114 29240110 28080943 27041555 26094726 25272198 24469452 23652739 22935286 22392547
9772 22392547 21913669 21417935 20942437 20533066 20185725 19946667 19716453 19588253 19583890 19656554
9762 19656554 19792599 19856222 19823643 19650305 19303558 18746839 18014607 17039357 15975397 14899598
9752 14899598 13976181 13126097 12396017 11849932 11354372 10936118 10560048 10227861 10037051
9743 10037051 9840855 9688235 9530893 9456359 9429669 9419268 9344000 9281754 9196583 9151978 9030023
9732 9030023 8916182 8784949 8564884 8235523 7932593 7567496 7143279 6821302 6526995 6211890
9722 6211890 5906331 5589452 5319075 5117550 4902833 4685765 4522412 4384612 4234492 4089230
9712 4089230 4012267 3909825 3789485 3605673 3432701 3263394 3175369 3062958 2900822 2786097
9702 2786097 2716297 2604502 2583537 2586385 2541840 2488430 2394134 2365174 2360761 2310660 2208253
9691 2208253 2153326 2070353 2003339 1998626 1958276 1866811 1810994 1729124 1666302 1652696 1615017 1602772
9679 1602772 1589000 1537246 1481259 1474874 1424858 1410242 1420769 1381724 1377780 1315323 1292193 1279896
9667 1279896 1233460 1236731 1154011 1176509 1161878 1048027 972842 943240 941635 884986 871898 878828
9655 878828 922633 931449 948357 945011 939741 893075 901106 884299 889043 929628 921752 907371 880736
9642 880736 888720 892373 868292 893589 899748 848726 798067 799231 778174 784761 799580 776995 722126
9629 722126 721670 730670 669304 636793 612516 608356 663385 612072 613034 622409 619468 560931 502448
9616 502448 501569 494911 501071 524163 565170 551085 539796 580472 559873 536204 525662 555972
9604 555972 589902 581221 651499 705772 705667 629956 549812 573923 595972 585811 561444 579935
9592 579935 505541 477727 520983 466642 419100 465364 450250 454220 456522 496595 481318 485950
9580 485950 463276 436860 422870 358239 326161 351763 421127 391601 380394 371219 408366 403002
9568 403002 379710 400553 332387 319621 310580 290958 300085 294026 319772 308251 269448 293177
9556 293177 278369 249102 258569 243825 277264 321615 346002 300702 274098 181139 164432 200385
9544 200385 191769 184823 176424 169450 172368 228385 247043 206685 234829 309684 308048 248017 233021
9531 233021 225107 245176 195048 221623 268460 226596 241711 229000 210947 167485 226848 246587
9519 246587 206966 201816 214584 246440 281892 275154 317753 403104 423660 409336 395179 381866
9507 381866 413113 461276 495208 504116 519729 605826 610490 556766 524196 494436 467496 482090
9495 482090 487151 501464 459515 434797 530102 564135 581597 564678 573483 494952 434606 458953
9483 458953 486337 494079 523564 511399 555512 623300 659098 667166 682768 713881 752844 806997
9471 806997 811938 845115 925791 1044105 1140462 1211712 1286202 1416554 1572471 1684695 1758294
9460 1758294 1854289 1842386 1782651 1711231 1680842 1618165 1516787 1458235 1483094 1470595 1480356
9449 1480356 1541154 1612136 1665611 1719199 1794413 1868557 1982910 2118419 2259158 2384115 2530747
9438 2530747 2716613 2943679 3209895 3507948 3847067 4119036 4509553 4922599 5344686 5910108
9428 5910108 6480809 7051673 7717298 8545408 9371736 10187810 11038326 11861261 12625519 13211292
9418 13211292 13566836 13783908 13739096 13410534 12919940 12267340 11549384 10737255 9934938 9157603
9408 9157603 8450759 7821933 7252205 6726493 6205706 5752931 5357094 5022573 4765704 4488361
9398 4488361 4188744 4000625 3849027 3648561 3462924 3325917 3166348 3000655 2858471 2764785
9388 2764785 2633565 2519838 2419398 2328318 2265296 2230416 2201837 2206904 2181956 2214302 2223446
9377 2223446 2238166 2305848 2272199 2214318 2207690 2111301 1993247 1921774 1849842 1747292 1614457
9366 1614457 1439513 1335516 1238837 1132792 1060408 1087313 1146016 1110585 1065772 1016296 996722
9355 996722 1023105 957790 889611 874596 814383 703731 708643 670442 653639 669634 647830 629228
9343 629228 663890 705621 681766 627088 633382 640225 601112 628590 618903 622064 619944 652996 681119
9330 681119 649417 610677 539692 509681 508596 511290 496047 447016 409391 425631 405344 351054
9318 351054 380315 437942 437937 348130 381765 377791 347710 307858 323130 351981 310858 249083 248106
9305 248106 263758 228362 131133 126075 190572 227844 271093 280256 304853 256875 187580 144849
9293 144849 134534 138785 189107 221249 168042 139308 132254 150810 183359 269261 235238 167799
9281 167799 175212 156583 167148 196643 231778 234445 190122 154223 107902 86034 65019 83118
9269 83118 108676 181523 198780 165843 125121 131798 96326 34983 69071 86046 109952 161709
9257 161709 141992 74488 138526 162920 119246 81751 93103 173863 150122 82592 52616 55119
9245 55119 9600 80289 124353 153728 166535 178743 166966 97206 76766 73827 71981 116593
9233 116593 155385 227128 165425 95803 124970 154641 184639 158240 111105 66890 23632 18239
9221 18239 26442 85297 90562 49373 56036 59991 53262 29911 58654 93049 49546 31733 35463
9208 35463 -5479 -8035 35730 89720 65375 7386 10066 18410 31906 109835 128755 92031
9196 92031 31409 70666 97078 39423 32408 80239 99294 91122 95010 30607 27042 50003 20293
9183 20293 -25445 -33536 50248 128151 104765 104507 72926 95178 80791 81777 83873 100969 96507
9170 96507 95305 123132 135699 131367 133428 134857 51734 -51497 -53792 -25407 17844 -24706 -29363
9157 -29363 -33551 -36947 15927 43813 15356 -41069 -32813 37595 50860 10037 18703 16948 -2467
9144 -2467 -26231 1453 68319 19324 -11460 -18196 -7676 -39761 -41269 16332 31172 24661 51526
9131 51526 32811 18563 -27647 -11710 8456 -17630 -28770 -27569 1057 -30002 -51755 -26680
9119 -26680 -19670 -366 -13157 -95611 -57958 -59658 -75319 -60709 -28688 16778 59254 62330
9107 62330 42139 8800 8113 -11584 18942 50016 27278 -20812 -80371 -61565 -22501 -29180
9095 -29180 -84887 -94273 -73258 -61046 -69608 -64566 -55915 -45639 -2530 -10714 -26923 -2604 1335
9082 1335 12765 -38995 -56328 25307 105642 66784 110549 111552 51237 46552 30774 3907
9070 3907 -46328 26864 25779 36223 -15412 -34503 -4598 13872 -44033 -80883 -88117 -102437
9058 -102437 -97649 -101016 -74534 -22572 179 76258 68030 -21292 -87519 -54999 -17797 23229
9046 23229 25657 -12579 18497 52336 19793 4697 20080 8309 9147 19424 27565 -7049 31931
9033 31931 24660 -24112 -32527 -14767 17026 45632 52439 14488 22038 26970 47145 66975 102274
9020 102274 66060 33546 39443 -49457 -76076 -32733 14259 111840 102972 72197 41478 32183
9008 32183 -64982 -111878 -96220 -50832 -21478 -20334 42012 53607 57968 -9963 -14087 -6225 -14933
8995 -14933 3046 -2374 -45654 -51744 9627 2345 -7295 -1951 12748 -17057 -26516 -1903 -2566
8982 -2566 39005 72587 84196 54373 108521 130008 114121 76008 67555 -421 -45373 -86367
8970 -86367 -61270 -29792 13487 20651 -8544 -11796 -4500 -47652 -40899 -2239 34043 33707 48698
8957 48698 37287 105960 67419 31789 61424 18496 -11284 10258 5911 13475 -3805 -30875
8945 -30875 694 2971 21514 58636 33283 -823 -6440 1118 -19215 -70240 -62690 -62493 -49313
8932 -49313 21318 23644 33245 58809 44551 30998 45270 4059 -53639 -56975 -15454 35778
8920 35778 16619 12487 33198 14579 27165 48574 69463 46601 80098 87942 72010 72406 12246
8907 12246 27808 71731 103923 14426 -25810 -43810 -36210 -72893 -43889 -23501 -23374 18475
8895 18475 32670 21507 16946 47076 39379 44636 53535 50047 28245 -3799 18887 84461 39401
8882 39401 29725 30864 15732 -19237 -15038 -9492 -68447 -73033 -28334 -18822 -8314 5834 -38947
8869 -38947 -25721 -49286 -52442 1440 20189 28425 24995 -13866 32426 59477 70453 61599 73315
8856 73315 52328 64931 55140 57813 105627 90319 83038 110763 81622 27105 2537 36362
8844 36362 32399 18791 32393 20472 58864 98008 46866 6275 11097 31302 25815 14266
8832 14266 -19865 -30566 64586 91911 88279 79034 102816 83126 63359 62842 67215 75702 108357
8819 108357 51279 8187 -30941 -36445 -28695 -1213 3590 -6297 25823 23348 8731 40797 932
8806 932 -59958 -67130 -41034 -30435 -26550 -6107 41421 3046 -59486 -19940 -18576 -17764 -7521
8793 -7521 15953 51026 33906 44035 -150 -37 29679 36286 52202 14638 -3969 -15208 6865
8780 6865 61775 104254 82045 82459 80749 65726 31090 -29803 -28457 7760 35378 29253 4154
8767 4154 -14080 -29081 -34559 -29242 -62035 -43735 33014 41212 11238 37039 28200 5178 -6999
8754 -6999 -1061 -54504 -77129 -137305 -172164 -146198 -106914 -40091 -13238 -52418 -69607 -79998
8742 -79998 -39353 44999 72215 88576 65415 46528 39886 63350 54243 26630 37477 23129
8730 23129 24252 74571 83250 57291 -15434 -38725 10595 53979 63472 72551 87786 95491 65859
8717 65859 105960 106423 43982 -25597 -3738 60810 35454 3437 1136 -22718 -29670 -17925 -25957
8704 -25957 -19885 26484 57575 19149 -9978 18858 25843 7314 24279 73153 69063 37534
8692 37534 14167 21959 70045 65480 10323 -4323 -73666 -38861 -23410 46086 105147 111831
8680 111831 71489 75170 53834 25271 52318 89680 71980 30367 7707 46402 73522 127259
8668 127259 101441 55557 40056 61499 83011 86923 70909 63039 98808 89162 18532 42116
8656 42116 52008 87512 100251 90909 64876 19788 43354 101483 172398 158625 169015 202502
8644 202502 222186 314709 393121 457529 611482 854137 1143366 1380365 1537656 1812948
8634 1812948 2098534 2172715 1897145 1405696 1016985 703090 550079 482672 387737 353019
8624 353019 300201 306721 319242 301439 287852 316585 312472 244552 251234 290088 323590 262457
8612 262457 176077 205549 266182 309028 300057 342897 366669 348180 386470 426830 441118 511681
8600 511681 492726 535304 619955 772917 974068 1266664 1765253 2375606 2826125 3064838
8590 3064838 3455866 3956279 4296503 3889091 2832641 2034833 1627494 1357068 1157378
8581 1157378 1024797 923559 822149 735621 742209 710620 660185 585737 537322 482162 445427
8570 445427 436128 423146 402829 366224 409572 461314 418949 379013 406828 418381 415885 370082
8558 370082 358322 382223 334439 348475 364494 365461 456324 560435 629936 821025 1134668
8547 1134668 1417558 1594009 1723618 1935808 2085204 1972075 1494438 1047549 735532 589691
8537 589691 503613 446351 397524 368837 356759 305673 232859 216883 227043 266632 284943 251528
8525 251528 263124 244471 251649 230026 185892 210820 217289 248080 223349 158559 233383 233222
8513 233222 213161 200718 135383 98639 135716 119031 140604 156774 121492 74723 107025 107231
8501 107231 124628 183149 193973 157333 122784 167511 192026 116811 19356 12550 59231 86255
8489 86255 97391 107928 112571 130732 205174 229660 182428 118455 20211 36312 28774 63073
8477 63073 45811 31601 15043 -28590 -10940 30562 29862 -3633 33900 58253 71528 93424
8465 93424 96240 29296 2944 13512 -18057 4495 40902 47604 70172 64194 24440 2065
8453 2065 -22887 -16456 4975 3286 30808 86113 79722 78768 117434 125616 46009 -4218 20684
8440 20684 50393 71535 58889 64144 42672 36107 53944 43839 2848 10507 -36555 -33813 -25697
8427 -25697 21511 24954 37398 70083 121706 121270 107266 112918 102459 69360 65482 80571 80469
8414 80469 97143 97374 23020 -19023 13888 63153 88610 67335 38412 -14393 -57488 -21004
8402 -21004 2777 1761 -19869 1203 83805 89353 54987 9508 64193 103876 45618 29778
8390 29778 -14102 2723 29491 57363 28746 15076 -3994 -43213 -6182 2582 8200 54323
8378 54323 69897 67647 73516 62507 54660 -12779 -13119 38551 47922 70360 30856 962 51127
8365 51127 79594 45564 35724 -1958 -62869 -62650 -64560 -35813 -28702 -59667 -57794 -12348 -24700
8352 -24700 4616 -4209 -35861 36967 28706 37728 106902 101970 51178 29054 6185 14129 14143
8339 14143 16097 12555 44362 41323 8865 2302 46756 57452 26444 666 3831 11090 68860
8326 68860 103839 122914 109155 38917 44108 59422 109633 130255 102514 82655 61944 6288
8314 6288 -29458 -77807 -77505 -780 17706 10918 -6654 -20349 -32713 14321 34735 44572 106393
8301 106393 79131 538 19930 -4162 -41599 -44638 -29723 12282 53787 84157 88071 89770
8289 89770 68085 28028 61578 61248 -9808 -33600 43655 69085 14486 44974 43085 -45082
8277 -45082 -83105 -102295 -100468 -70056 -73836 -46333 -58308 -79174 -72349 -48986 -17958 9836
8265 9836 -50994 -68455 -12168 -30795 -58792 -55242 -28350 -18119 -6585 -1407 59436 -20976
8253 -20976 -81395 -6872 33940 23335 7868 59481 46243 18051 -48639 -67103 -77624 -89989
8241 -89989 -80902 -57547 -36677 -2386 36651 53107 62573 68563 114125 69463 66438 66974 47523
8228 47523 92170 115573 64990 85847 95263 83283 -11558 70 31553 7662 77360 98553
8216 98553 37878 31453 32446 7763 43 38899 51633 65273 52901 30172 5042 -12990 -42162
8203 -42162 3088 32018 -18262 -10319 -12640 -1395 2839 2593 -28576 17271 12237 275 -33167
8190 -33167 -17428 7912 9954 12953 21426 71958 98526 73264 101077 140762 177949 137209
8178 137209 114157 86650 34860 10193 -4432 -34227 17319 19487 72631 72251 52125 13032
8166 13032 -23819 -63341 -63492 -21410 30425 8380 -27870 -89701 -97604 -106788 -126502 -46037 49969
8153 49969 125907 91151 53639 40216 1282 -19862 -19883 39890 59224 6419 60392 56078 36343
8140 36343 41584 -5306 -14615 -11004 42731 80282 168029 186459 128394 132971 137950 112313 106905
8127 106905 158797 183730 170493 111946 83176 47589 -3362 61058 124960 129375 147430 101253
8115 101253 75066 38859 36190 4798 -41252 -7615 1852 17013 39688 71914 26945 27497
8103 27497 66990 81963 85360 54195 72347 158670 142970 137444 138432 139542 168535 207282 212524
8090 212524 222870 224684 197529 116331 161785 174776 162077 190754 210151 188282 230139 255208
8078 255208 258047 207156 202135 214796 144162 82608 68551 83953 54568 25689 37814 31562
8066 31562 23751 50433 32831 22164 4350 57357 110037 86447 61689 74795 140679 175748
8054 175748 98021 34833 -4901 -8197 55892 116231 138466 159866 88304 37473 38605 18822
8042 18822 -6280 -37509 -27328 38036 118360 118928 121364 104653 138400 178108 128230 59930
8030 59930 -1045 -12827 -52962 -55595 27848 42783 43038 87673 144232 121854 104637 103707 101674
8017 101674 84761 57556 57387 51817 46818 29977 39443 97599 194564 222555 211556 166730 120287
8004 120287 147031 177230 155732 146305 189003 185470 136126 85657 102058 163306 147962 98134
7992 98134 119395 122174 133114 140417 138495 94522 49298 18804 42840 51015 99973 125731 123873
7979 123873 111352 120946 110188 100885 134924 161035 145769 82551 71979 110266 147236 70724
7967 70724 39025 68183 87288 50397 -11577 -32260 36852 109410 86320 64377 43763 31044
7955 31044 70442 84480 107399 99794 68012 50629 35482 114635 178087 172647 132001 90256
7943 90256 75410 54507 108031 110543 71752 22067 67932 74046 35190 77940 151027 135301
7931 135301 88677 114218 134371 90729 48149 41836 19995 25063 21325 55636 21760 -1936
7919 -1936 -3891 39462 21835 340 8428 -3235 71117 118138 99478 97384 99081 69624 64031
7906 64031 56101 43202 53401 10108 11202 -11760 -23273 8609 389 -10380 -20099 -22658 -22705
7893 -22705 21337 70053 99044 78614 56708 52398 43730 36219 80887 99361 110503 53892
7881 53892 19696 -4969 -40386 28208 59863 81549 50940 63804 58760 108777 68792 46081
7869 46081 74565 78595 -10996 -36142 -21382 14241 34644 1839 24270 6316 -8545 13597
7857 13597 47528 73982 21428 -20265 -27500 10978 61628 68691 69901 35173 11856 -16048
7845 -16048 -26226 33956 69980 77008 116409 109400 57017 21409 7374 13376 54094 56533 18474
7832 18474 -22426 5864 13040 -15092 -74597 -81457 -58375 -23961 -13435 -13156 -34497 18377 17167
7819 17167 -46300 -68283 -50522 -13373 42758 95363 24279 20566 -4473 -45114 -18699 -4540
7807 -4540 19581 34662 6316 -37020 -2917 38389 14736 20539 22638 19808 -23392 -21706 -53895
7794 -53895 -29049 -41134 -70322 -112392 -104561 -88745 -102025 -90441 -51651 17252 55052 58202
7782 58202 41096 9392 61527 54903 48742 7834 -12307 12981 -43891 -98976 -138228 -118388
7770 -118388 -75636 -79312 -14910 689 -25021 -20496 -10815 -9401 -25017 22366 -2533 -4120 23308
7757 23308 -42413 -36395 -29866 -7468 7097 -17869 -17704 -34558 -60554 -88280 -96010 -61128 -56906
7744 -56906 7155 24155 20097 3285 30552 42016 12796 4917 -12677 -31375 -56164 -37531
7732 -37531 -31432 -15425 201 6160 -14313 -49677 -4713 -31013 -9974 -28386 -114 -30297
7720 -30297 -37874 15723 51767 108933 91319 44292 -30510 -72127 -51477 -17289 24310 -5255
7708 -5255 -46016 -18426 53422 63271 58161 61788 12538 -38544 -108856 -133980 -117378 -111289 -47252
7695 -47252 4524 29653 53832 55037 64079 48499 7591 3009 15915 32890 46356 -18954
7683 -18954 -19829 40065 44610 24225 14972 -41034 -59123 -68433 -48205 -25970 -51583 -62275 -89368
7670 -89368 -67676 -48290 -38399 -8747 11740 -56 -10020 -15873 -50157 8991 -8269 -64776
7658 -64776 -66844 -37848 -10378 -3404 6692 4527 -24688 -20141 -31595 -8929 28367 6985 -30438
7645 -30438 7126 11360 14194 -3684 -8216 -7380 -21451 -18193 -18209 -8644 -60189 -41641 11742 -12044
7631 -12044 -46359 -49459 -39197 -50608 6528 6210 -50052 -59142 -48526 -49811 -75514 -81196 -78500
7618 -78500 -102004 -106054 -96201 -121249 -98161 -70595 -48025 -57557 -89575 -91692 -92456 -117845 -128290
7605 -128290 -56130 -1458 3262 -2824 28446 42045 132 -18141 -22120 -2482 -15793 -73537
7593 -73537 -33958 2109 27411 68301 57119 -11481 -4360 32128 9285 18742 -27268 -82397
7581 -82397 -93073 -71877 -115366 -123072 -68249 -87481 -58247 4598 46979 39279 -18900 -41718
7569 -41718 -46033 -48067 -46835 -15195 17780 51108 57871 28296 -15722 -12669 -43286 -47607 -16180
7556 -16180 -35387 -90305 -48479 -56514 -52784 -59029 -109028 -35783 39298 31179 17484 18352 17578
7543 17578 35566 28967 3819 -18365 -17219 -1497 36152 -1930 -19997 15970 39722 38010
7531 38010 28432 -1713 7199 67580 92525 40239 20586 8204 27647 62799 54304 44371 45673
7518 45673 36269 7122 -54552 -37846 -48618 -8621 27361 -34948 -78700 -54295 -48070 -61185
7506 -61185 2824 50644 2841 -61049 -66836 -72935 -30393 -28170 -35487 -50750 -80909 -71078 -32645
7493 -32645 -49436 -50359 -6760 32640 43971 66766 63748 41151 -10876 -15370 -18958 -36532 -22292
7480 -22292 -62334 -61365 -39266 -60032 -55854 30565 17169 13452 -12860 -4817 32060 -30592 -21845
7467 -21845 15343 62242 56085 23490 -21265 -7456 33860 -556 -18574 56510 57351 30816
7455 30816 -14430 -33946 -5541 31796 26260 10854 29168 32957 10495 33119 62390 70113
7443 70113 -20848 -65424 -56776 -70269 -103066 -59904 -21923 -11927 -50425 -106359 -128003 -89232
7431 -89232 -17440 7816 16548 -16009 -90270 -115551 -88100 -105327 -73161 -33542 -51006 -63126
7419 -63126 -62771 -49806 -27078 18805 29326 55641 46829 -21193 -68205 -41047 -77484 -53846
7407 -53846 -52114 -82722 -47392 20756 55748 50340 -2221 22280 47287 48366 60247 64736 66102
7394 66102 52796 49677 106147 142916 83229 103233 148823 85557 -9644 -47615 -61288 -84974
7382 -84974 -23309 -7414 13662 48862 17797 -44313 -23319 -28775 -61473 -56872 -54487 -17184
7370 -17184 31833 -3211 -122904 -110478 -52585 -6818 -14438 -386 -2159 32802 35564 12899
7358 12899 8589 -33236 -47107 -4846 28696 83863 57443 21739 -22160 14609 3286 10485
7346 10485 -19484 -42547 -52640 -90880 -98174 -97830 -127477 -172223 -136945 -48640 6768 48124
7334 48124 46819 41532 -44043 -42761 17163 -6981 -38754 -58706 -48108 -80782 -111080 -90294
7322 -90294 -56777 -54442 -20087 -6058 -37486 7288 54118 111362 54171 5908 -5444 11859
7310 11859 43277 8036 -40760 -45320 5947 -2429 -11924 -57523 8779 17554 11576 15251 9005
7297 9005 -27986 -67842 -56451 -68057 -94400 -81684 -72706 -66817 -34362 -12377 -17674 -61465 -58057
7284 -58057 -65563 -47306 -20386 -11737 -13404 3288 -46941 -74271 -1313 15192 -20077 -64150
7272 -64150 -61848 -41572 -34686 -45911 -66234 -79666 -46430 -13657 -76883 -133096 -55368 -17160
7260 -17160 -55875 -72331 -42644 -48905 -34911 -14048 -43764 -21451 21249 2752 11024 70732
7248 70732 108099 68951 -7317 -75980 -102097 -99758 -90827 -5516 -4835 -60941 -38689 -10976 45725
7235 45725 72218 87964 90401 83934 64572 16851 8700 -4732 1260 -10430 -25657 -41349 -40178
7222 -40178 -51628 -85178 -31059 41109 84362 92900 77445 51407 -10657 -50229 -16604 -30503
7210 -30503 -65229 -91266 -96370 -48009 -97346 -113889 -36337 21416 41678 11256 -24088 28931
7198 28931 53871 38236 27941 10748 -31158 -8952 -60361 -61937 -25435 -95606 -171467 -147924
7186 -147924 -126926 -89134 -52095 17336 70395 49666 8310 -22296 -70026 -52478 -29761 -2216
7174 -2216 -25627 -19844 24421 60988 81449 49767 35708 41437 66072 77100 68543 66900 3892
7161 3892 -39732 -41772 -100770 -90970 -58253 -67228 -77724 -64799 -49111 -11948 -12831 5111 -15541
7148 -15541 8380 6555 -34003 -15837 35365 63696 11037 -3378 -16165 1639 30254 29080
7136 29080 54095 31267 38960 36110 -1467 -53588 -40495 -98879 -116498 -54990 -4204 21725
7124 21725 4253 -10834 -35514 -10374 4621 7493 22573 -32591 -59901 -44560 -17863 2993
7112 2993 -13142 -52556 -71060 2508 32172 -41289 -74376 -22678 -51889 -29916 -53220 -101212
7100 -101212 -95029 -2334 38705 23208 38962 39310 17892 42617 15113 3162 -7213 15103
7088 15103 -12454 -31770 -25437 -29261 -20016 -12538 -12116 -3683 7407 -3286 -6445 -24834 -31099 -47417
7074 -47417 -53410 -32577 -86887 -113721 -94853 -14904 12427 -13017 -6555 35198 26077 -583
7062 -583 -68792 -87758 -63642 -62992 -19649 -12343 -47735 -41277 -50392 -20943 -11421 2584 30602
7049 30602 7341 -56790 -30836 -82951 -82413 -31459 -20611 32822 -32994 -63821 15601 33495
7037 33495 62072 40015 8710 -26416 -18380 -44284 -47517 -57780 -72668 -4669 -11436 -44062
7025 -44062 -10317 -9677 62040 15801 -56449 -14359 -21377 -16175 4814 1372 15387 -6919 4596
7012 4596 8667 -57473 -51332 -63668 -113471 -71947 -18935 14294 12098 -5208 43114 56038 41860
6999 41860 -3848 -23957 -17111 -72689 -100420 -107136 -119558 -111092 -84519 -38978 -19609 6235
6987 6235 54708 46811 39071 39637 52402 7903 -25509 13575 5995 23289 -37424 -37458 -30448 7143
6973 7143 35953 -36595 -59498 -37324 -73524 -87681 -75198 -54800 -55834 -28765 -6655 17456
6961 17456 40529 35818 7348 9706 11365 31543 63884 39509 -42136 -106937 -85567 -61292
6949 -61292 4115 27686 52494 58379 -4733 -64330 -97031 -144910 -151460 -87384 -36738 -3758
6937 -3758 -15747 -81851 -124295 -71418 -36758 -24191 32534 26733 -40871 -58286 1647 -14498
6925 -14498 -70201 -66258 -17127 -4503 -73859 -115880 -110057 -66897 -5096 12762 -32133 -31815 1280
6912 1280 -18756 -42059 -51143 -14805 -27770 -34305 -94828 -63698 -15308 -4599 -50760 -47670 -14997
6899 -14997 1203 28460 71865 73574 62531 45456 26527 10070 -67676 -100945 -61621 -31293
6887 -31293 -40506 -37706 -10913 47946 46672 4765 19788 8100 -20125 -46367 -63041 -64303 -40528
6874 -40528 -23139 18025 39107 21520 -11480 2216 16158 -494 23175 -5355 -71827 -68837
6862 -68837 -3969 -111 -4388 9658 -26661 -29338 7715 61183 73711 60612 80295 112984
6850 112984 88282 31657 5974 23339 85 -5938 21545 -3509 -20651 -35385 -52916 -8803
6838 -8803 16659 -24938 -20099 1062 -16227 -61742 -58456 -73229 -43934 -28336 -10825 -35143
6826 -35143 -32620 -16085 -17154 -27021 -61319 -71634 -7864 37426 26511 42422 67462 52055
6814 52055 52771 -22661 -77010 -87967 -97107 -58596 -58306 -68302 -52635 -67008 -105778 -73539 -6261
6801 -6261 27157 15477 43442 109977 132535 105099 69524 76315 14906 6548 38722 43348 35356
6788 35356 58297 53072 -7654 -1539 -13697 -60827 -25194 14505 -41961 -85165 -54497 -30238
6776 -30238 -16124 -48691 -485 71489 76231 30385 -8949 -15407 72581 84962 61652 71255
6764 71255 27123 -20687 -10090 24942 16831 -18345 13304 9633 24806 5303 -55000 -90892
6752 -90892 -76220 -25714 -29701 -18540 21857 28145 -13151 -47538 -31006 7509 15258 -23896
6740 -23896 -20169 4771 15770 21413 -12 -3022 16575 17875 10944 1291 2731 29156 16353
6727 16353 110404 180532 148175 130135 151517 146756 139486 162003 178025 207102 274855 275936
6715 275936 309742 380442 466369 585262 656490 723805 801760 794658 667396 448501 298089
6704 298089 276427 193367 135299 89815 57758 68228 74691 93767 100199 63727 -37188 -67094
6692 -67094 -22043 38573 78035 91892 81089 62354 41802 14503 7181 16865 -9551 -5905
6680 -5905 24085 46260 14745 -25877 13347 83897 100778 124253 113576 56538 -2016 -6073
6668 -6073 3172 4191 -3747 -17360 -15417 -47588 -52909 -31023 2765 22384 65016 51832 5091
6655 5091 17547 13406 2736 -37483 -50569 -39802 -27380 27012 -4341 28609 101015 54341
6643 54341 33237 38364 5644 3820 -12096 -35803 -31898 4539 10370 25788 41467 -14486 -61344
6630 -61344 -73389 -18567 8345 -16821 -37032 -81508 -68241 -63335 -100305 -111473 -100642 -84692
6618 -84692 -44685 -88699 -129455 -70549 -26142 -60771 -21011 -29858 -9988 -3068 -9269 5799
6606 5799 -23437 -6468 -19154 -44407 13668 13730 6807 3236 -18913 -4689 -17678 46174 48552
6593 48552 21960 42818 53524 4606 -7202 12243 -33319 -63041 -22327 55816 46738 9495
6581 9495 -1373 4387 -8453 5021 6985 -29739 -18381 -32740 -43610 -35047 -11652 33467 -3807
6568 -3807 -59704 -61950 -24962 -52237 -64047 4001 -5087 -32847 -43457 -9638 -7604 -28754 -64600
6555 -64600 -73549 -25676 53735 87598 73087 14522 3651 -30090 -44527 -22752 -56209 -73000
6543 -73000 -85769 -104085 -95457 -64628 -44949 27529 86336 63045 6486 -11220 -27200 9250
6531 9250 11318 -19630 -7296 53454 32202 -10629 -40830 -58831 25384 70783 7333 -51864
6519 -51864 -53267 -4486 -3982 -6411 15207 13851 4236 -50822 -72684 -55093 -44022 -52898 5166
6506 5166 -7549 -27856 -2098 -22658 -63137 -29883 12141 29777 20727 -8629 7318 -2684
6494 -2684 -12843 36393 76032 87547 91331 81758 69853 31297 38719 88667 35864 -15547 -11790
6481 -11790 11883 9130 -7087 37024 44025 -9852 -58051 -53195 7170 -22793 -28453 6142 73465
6468 73465 84711 27756 -2834 45644 31141 -14249 -37244 -10496 -14496 -26353 -12169 2237
6456 2237 25444 -3093 -29416 -64908 -28578 -46842 -77887 -34607 14578 37048 78570 24212
6444 24212 4941 -8282 3100 -47613 -86299 -52408 -35462 -31797 13289 19472 14184 7561 -37779
6431 -37779 -19731 -48361 -53287 -35828 -31603 -29339 -44144 -36702 -35426 -41551 -49890 -30440 -13913
6418 -13913 -42167 -10444 -2669 -12329 14999 -17041 -83975 -64620 -40500 26427 -495 -85802
6406 -85802 -46219 -54038 -17727 2357 -14761 -34613 29605 63819 35045 34984 37887 -10639 -71940
6393 -71940 -80406 -58887 -5325 -23734 -21466 -10077 18853 -30148 -63970 -47417 -28843 -40973
6381 -40973 -40811 -36399 -64537 -81138 -73983 10573 -5210 -29203 -63230 -99907 -75269 -19471 -3749
6368 -3749 -38335 -41625 24635 29997 466 1540 2127 53387 81697 47550 34453 32373 29970
6355 29970 14441 34670 49774 48593 41621 2176 16125 44432 42660 87307 62439 15510
6343 15510 4684 3903 -37056 -73768 -32778 -18846 -69384 -35680 40100 46470 26325 -13732
6331 -13732 -64328 -33798 -12120 -50123 -49311 -22169 -18796 3789 -13366 2044 38272 59861
6319 59861 69530 6878 -37328 1296 66295 79516 51158 14424 3067 -7379 12943 2855
6307 2855 -14043 -31717 -35399 4281 19198 3027 25222 22286 -46682 -62179 4088 52845
6295 52845 53922 11501 356 -16608 6606 14009 13737 -21260 -27378 -65952 -67132 -10062 14222
6282 14222 28955 67572 60259 34577 18625 23866 21090 10247 -13847 -14952 -85260 -122659 -109807
6269 -109807 -90146 -66690 -7448 -17154 -29346 8748 28218 43612 54377 29418 34469 48281
6257 48281 90611 133336 85669 66772 88008 60490 53336 70251 94592 96674 113644 78099
6245 78099 -7261 -60194 -49917 -29741 -79309 -74175 -62631 -93171 -29839 -8689 -27204 4275
6233 4275 53006 72050 88551 96755 66923 -9828 14050 72235 55729 9200 -60826 -49829
6221 -49829 -37025 -50684 -64125 -69553 -72058 -61882 -36854 -15529 2711 -532 21870 -35035
6209 -35035 -62791 -47332 -16487 -15840 -14025 -31429 -43839 -19190 -8721 36587 51117 53874 56945
6196 56945 68775 63780 2107 -70255 -64196 -43986 -77868 -69785 449 10544 -10014 16871
6184 16871 7587 -67173 -66507 47112 71810 13387 11248 -28021 -42408 -7444 -31978 -40638 -46467
6171 -46467 -58236 -3879 38311 33219 5528 -29966 -76473 -79740 -82054 -68227 -99927 -81924
6159 -81924 -45915 -23611 -13490 -9696 19954 44437 9573 156 -17555 -33032 -82183 -101315
6147 -101315 -104371 -25560 -11807 -25437 -15648 3889 21664 -22204 -83151 -93752 -77019 -45467
6135 -45467 -30545 -2225 -2347 -14001 1967 52166 5074 23088 3926 -22873 -34708 2566
6123 2566 61270 57743 38246 38658 33840 11693 3493 18651 49518 73418 71997 57459 37087
6110 37087 21750 18068 -8413 27658 16131 -44936 -34667 -42672 -92857 -65896 -32163 -27141
6098 -27141 -37560 -69534 -89247 -83934 -76021 -70140 -58643 -5719 -45669 -60764 -27528 -83064
6086 -83064 -155600 -132537 -62348 -10978 -9074 -21441 -18171 -40496 -44250 -9754 -11710 38882 41703
6073 41703 31746 -37145 -64767 -2891 6523 7935 -17269 7686 9788 22337 29216 19494 -36110
6060 -36110 -40581 -59770 -28706 27635 51265 13555 43313 42336 -3724 -27760 -55181 -26509
6048 -26509 5128 41229 34503 59447 82671 7160 31534 29573 -32841 -87099 -69373 -50121
6036 -50121 -81469 -86699 -53240 -33074 -80592 -12241 8387 -54926 -62130 -114525 -90390 -7828
6024 -7828 -10767 -54963 -74514 -22180 -185 1928 -24851 -40207 -85114 -57785 -67071 -29553 -24059
6011 -24059 -45616 -4773 -18096 -75245 -43277 -37604 -93557 -69128 -19752 1831 12331 13459
5999 13459 36597 54301 33705 12347 -45140 -76431 -105556 -126741 -97337 -71519 -63395 -54814
5987 -54814 -45178 -24027 2654 18986 -13917 1404 -31094 -27476 -51930 -62898 -50393 -35842
5975 -35842 -38950 -45832 -46018 -39638 -22506 -13301 3252 -41452 -82203 -67824 -30715 -4320 -19635
5962 -19635 -16761 -38456 -59972 -65811 -73698 -22661 22152 -22143 -12598 -15745 -18588 -4431 3134
5949 3134 -19976 36935 -5074 -67297 -21216 19341 -42271 -84090 -60898 -46662 -81276 -98624
5937 -98624 -74257 -66319 -53527 -9090 19648 5364 -65546 -128403 -62118 -15629 -16825 30093
5925 30093 39888 1310 -584 3414 25426 69871 37901 -29423 13197 54906 62160 12695 -43535
5912 -43535 -80186 -28747 6659 16755 -5445 911 12330 -10770 -41689 -50074 -41867 -48183 -68126
5899 -68126 -69712 -53147 -59585 -45706 -18171 7823 -31033 -37543 -17244 22014 -7955 -8948 6972
5886 6972 24161 -6798 35450 48681 48346 21046 -39649 -5980 -34019 -65973 -120278 -151966
5874 -151966 -94932 -92395 -115033 -75975 -65576 -8720 21050 -1833 7293 8055 15472 24331 1463
5861 1463 17501 36773 -13099 -52991 -38178 -1003 15132 50325 87078 54631 11282 1151
5849 1151 9081 52 65214 77421 57979 15664 30142 -6018 14255 44910 58288 124132
5837 124132 86310 27328 4378 25926 63466 32173 12156 23021 32426 46829 72092 91659
5825 91659 45466 -1095 -80688 -74131 20645 61863 74483 79841 41422 5574 17630 36578
5813 36578 35323 34056 7035 28715 17356 16740 38931 -13423 -78252 -151431 -157438 -94892 -15674
5800 -15674 -29563 -37047 -40927 -40635 -42780 -70949 -91970 -19948 75344 67262 54781 5738 -67438
5787 -67438 -66253 -69686 -107953 -63477 -22894 -54223 -74465 -116978 -162826 -132040 -83956 -86262
5775 -86262 -41002 -2892 -12349 -34467 -2794 11014 91966 87286 79588 79124 54455 42661 64393
5762 64393 28147 -9748 -26008 -44539 -40303 -57280 -19042 34922 98840 74539 38001 -32482
5750 -32482 -21667 -36089 -9131 3103 -1670 -18703 5462 7711 34945 62362 69769 73959 44536
5737 44536 40678 49568 44629 -16562 -52412 -39418 -41682 -71681 -92790 -70699 -57240 -35675 -5478
5724 -5478 34076 19750 -17843 -47081 -45679 -67223 -68326 -52751 -68898 -81045 -117454 -111354 -55236
5711 -55236 -81485 -111705 -128432 -77840 -107720 -39982 -26298 4466 47013 56398 23572 1762
5699 1762 8084 24208 20764 2925 -18325 -24789 -60803 -61105 -12386 -58101 -55008 -25683 10229
5686 10229 -24660 -98058 -137662 -96541 -42422 -2852 34810 31319 -22115 -31351 -61909 -87573
5674 -87573 -28663 -13372 -12550 -13921 19383 58816 16491 -13967 5009 16633 19660 62565 78892
5661 78892 74122 53746 14404 -2652 -5846 -22505 -31158 5921 -25262 -30531 -11444 31830 30785
5648 30785 -4714 -28298 -7371 3487 52150 48764 60879 38155 -42223 -51338 -32806 19782
5636 19782 33428 12153 -5192 29360 61910 53984 -6044 -4219 3157 7708 7873 -7646 -35589
5623 -35589 -68163 -73640 -9497 11554 -16146 -61837 -144459 -160568 -82909 -104011 -118255 -73478
5611 -73478 -56148 -49245 -32812 -12646 12586 18878 17906 -18557 -68009 -86601 -99997 -94399 -111069
5598 -111069 -98697 -35885 -16983 -28720 -49357 -66554 -36208 26171 -31186 -58500 -44974 -32153
5586 -32153 25103 36778 24644 19227 16001 -18219 -62313 -46682 -40772 -27917 -78546 -89063
5574 -89063 -23039 8494 -37970 -72260 -143301 -155518 -77395 -5397 -12923 -53409 -52742 -6072
5562 -6072 -27033 -18714 28579 64064 40865 -6010 1190 -11523 16323 17931 11522 37125 34386
5549 34386 7869 5709 29884 -2960 -28894 -42376 -69544 -63949 -24090 -49894 -51058 -14734
5537 -14734 23297 10633 -9265 -10669 -17388 -65049 -106964 11162 66474 76684 -19825 -52972
5525 -52972 -42330 -47188 7017 -8098 -12813 -81296 -110437 -85777 -77845 -95071 -51800 -43569 -78042
5512 -78042 -44236 -38619 -38781 7429 7156 22948 33526 63441 123225 158199 56582 27317 14980
5499 14980 -58445 -100440 -134714 -149603 -138277 -105718 -73784 -40741 36936 52094 60465 72846
5487 72846 74926 8989 -1883 -3464 6735 12376 17554 36021 -4346 -31689 -78783 -107186 -93963
5474 -93963 -94766 -89541 -104564 -54373 -31094 -22954 -15139 -51393 -107751 -96916 -99098 -73156 -49642
5461 -49642 -66736 -64992 -26657 -5222 37790 42414 52071 85146 74206 41037 -18918 -55209
5449 -55209 -33343 13673 9194 -30825 -44498 -36696 2349 18996 17091 -13032 -43543 -99134
5437 -99134 -103391 -47654 -33874 -43232 -62664 -22828 28347 48750 12720 59589 84351 22976
5425 22976 -31735 -55554 -16414 -22410 -22266 7443 22859 17948 27051 11412 39715 46406 -13338
5412 -13338 -16574 -35269 -4160 65938 109842 148594 173705 173949 120697 57782 -33984 -15202
5400 -15202 -2196 16614 13748 -85776 -92118 7483 7258 30227 -23849 -7906 -15818 -20400 31402
5387 31402 11868 -21425 -30935 -22823 12691 60973 60833 27241 55964 75648 2384 -589 -6298
5374 -6298 -63965 -22926 69434 165937 67675 -13967 -13735 25781 45061 31999 53416 17747
5362 17747 -20930 -39281 -38021 -51035 27982 66572 27433 -31975 -23774 -24082 -84336 -105722 -110162
5349 -110162 -71809 -19990 3106 -15477 -43110 -40876 -69914 -74882 -39328 2051 -7364 -15406
5337 -15406 36303 43147 18171 18372 -313 19109 43950 44521 62911 53462 55776 12712 -78326
5324 -78326 -127440 -92505 -60463 -51895 -35263 -60844 -54192 -39367 -30990 -5541 -7982 -56036 -50706
5311 -50706 -26182 -45078 -13033 -50042 -89479 -96747 -84591 -50270 -31046 -32806 -13782 10538
5299 10538 -6668 -32187 -15594 4123 -6316 -46362 -43507 -93372 -118567 -115279 -85727 -25849
5287 -25849 6311 6625 -2266 8229 -14218 -21951 -5633 -10331 7149 -26595 -30594 -42226 -45295
5274 -45295 -88809 -138693 -137058 -134363 -96221 -51442 -4069 8736 -5871 646 36892 34108 24475
5261 24475 42727 11160 12054 27211 -27047 -69598 -38721 -9274 -21354 -62261 -91212 -73827
5249 -73827 -8856 -6067 -33374 -18210 -52373 -58611 -60803 -58146 -79165 -105439 -84495 -75807 -52363
5236 -52363 -9342 -25922 -31980 -18550 -10450 -31396 -11921 8568 -1565 18486 20558 -35573
5224 -35573 -58403 -80266 -40532 -17976 -82551 -84055 -106882 -134314 -83442 -53292 -14701 -22785
5212 -22785 -66328 -57471 -41676 -9764 20911 -38863 -40199 -49086 -7519 52703 50558 67361 35353
5199 35353 37459 -52446 -54035 -83062 -96143 -68383 -13164 23398 38283 29647 -3091 -38117
5187 -38117 -74493 -98657 5322 68933 59881 19347 -80780 -97282 -84040 -31721 8352 14651
5175 14651 -12707 8727 31634 11543 36501 -25060 -106223 -97449 -32414 -21791 -32103 -48933
5163 -48933 -60208 -72318 -95262 -73395 -48735 15687 33604 43045 7566 9241 49790 36043
5151 36043 -9491 -15614 28120 19937 49486 27657 6463 36488 65445 24270 25264 62781 59372
5138 59372 70707 100346 79223 52447 56307 30694 -32209 -44433 -74904 -74072 -53569 -5791
5126 -5791 8266 -25984 -18637 -21240 -25122 28285 60962 88872 68329 85284 65514 -109 -46018
5113 -46018 -1806 144 -19085 -39278 -23432 -19535 -29186 -2394 -46519 -71922 -104270 -111183 -41665
5100 -41665 -5355 -39100 -59484 -48487 -12904 12393 -9950 -39497 -49225 -70885 -67817 8192
5088 8192 67614 34178 -7063 -6605 -17365 -16400 -11698 -23944 -2928 -22223 -22307 -41402 -50954 -9693
5074 -9693 9136 -22221 -72289 -74691 -26986 -9757 -16193 -60215 -81952 -61946 -49976 -48434 9571
5061 9571 11193 -10144 -7723 23597 18232 -16481 -12119 -28915 -23959 24390 31577 -1038 -22897
5048 -22897 -10556 -4826 -7632 -12644 -21956 16095 -6734 16058 -4484 -4018 1863 -6547 27994
5035 27994 32200 -12458 -22176 5246 -5187 -14139 -21530 32694 19983 -24388 -59642 -54884 -74687
5022 -74687 -73761 -74876 -41851 -48660 -24291 -50012 -40362 -11296 9991 -18431 15472 20723 -22748
5009 -22748 -4327 77648 105121 53866 -17697 18766 69079 59602 45608 4613 -13776 15532
4997 15532 25162 52612 39219 19900 19825 -8487 -8436 -18788 -30819 -20681 -51074 -54964 -31201
4984 -31201 716 23123 24995 -2926 1579 -36807 34023 28902 96092 91261 67528 53157 42139
4971 42139 28616 -4614 -56635 -64180 -34747 -13501 5952 55132 41735 49095 58004 48764 20542
4958 20542 -41626 -42269 -31072 -28692 -17115 -22766 -10736 -60319 -49292 -59009 -121060 -100463 -89815
4945 -89815 -71556 -52981 -24649 -26704 -35252 -42660 -44029 -21366 -20425 -41410 -9331 -33573 -64103
4932 -64103 -23789 -34711 -31712 -10931 -41984 -32457 -15510 -20936 -303 25058 57659 45289
4920 45289 16269 6646 -208 -20285 -14438 -47040 -65212 -63231 -51857 -83608 -41258 -27964 12
4907 12 36888 79854 63417 40539 39612 50016 56173 35225 -16483 -23813 -50870 -116994 -83818
4894 -83818 -48344 -29314 -3543 -5847 -26736 -29842 -9505 -14677 -74709 -85953 -19283 5043
4882 5043 44087 67450 -12609 -58496 -24664 -29157 -39251 -38338 -48998 983 19673 47644 51162
4869 51162 32598 29016 41293 66722 -3250 -16582 -16095 -57260 -53759 -5332 35387 32492 35193
4856 35193 45407 41134 27770 16628 -6374 43438 7264 -73787 -31328 -5750 19716 17189
4844 17189 9327 17819 -1983 -71354 -84116 -78905 -62666 -927 -29237 -48815 -29047 -25780 -58112
4831 -58112 -83085 -124011 -103236 -51498 -16890 9749 28610 27915 17480 39123 -2737 -33856
4819 -33856 -3739 17660 55316 61565 38855 68966 92804 95599 130142 87146 57525 -2912
4807 -2912 -55359 -86614 -51510 -23856 3613 -40579 -63404 -76356 -83348 -22512 16989 -10923
4795 -10923 -10716 -30488 2949 2225 -13702 -9158 -14625 -17788 -25273 25058 49977 -5087 -119493
4782 -119493 -97165 -61346 -18135 6718 -17845 -38472 -52993 -9694 -33938 -57230 -23698 -6902
4770 -6902 21398 -3073 -51712 -13966 -4643 -38957 -115420 -113788 -106732 -96796 -66219 -70972 -38963
4757 -38963 -277 -69166 -109233 -65072 -7844 -4702 -56264 -99469 -40210 45674 23997 -6241
4745 -6241 51336 50422 2832 -42566 -28311 -511 25754 53357 45036 26465 82599 85774 72776
4732 72776 85575 97397 79214 38620 89694 143090 109507 52956 2245 -7696 -39764 -84347
4720 -84347 -65827 -8453 68090 85592 51384 32085 -8915 -25460 -49943 -31898 14877 23218
4708 23218 65970 46064 14886 45020 72841 60762 56212 -233 -11052 -32782 -77637 -64046
4696 -64046 -24455 3379 -10620 -13619 -35181 -70441 -109387 -109166 -38988 15128 -1290 -40313
4684 -40313 -72984 -44613 -3511 27141 -1611 -123913 -159515 -111645 -39323 4968 -12722 -30026
4672 -30026 -14858 9350 -12112 14228 54650 55268 50012 56511 43666 -1815 6267 25681 -2147
4659 -2147 13227 53361 51450 55945 34213 966 41022 111844 136556 157495 101319 126666
4647 126666 118418 77835 12442 -32281 -75427 -29052 -20040 -62978 -73855 -32695 2726 25530
4635 25530 20171 8857 3602 -52796 -64610 -6200 -2252 2582 28643 15753 -40038 -62216 -71459
4622 -71459 -79073 -110156 -93517 -53118 -19520 -17206 35613 67147 82191 49431 59881 14611
4610 14611 -23183 28510 20450 -33789 -48192 -42255 -87790 -79553 -59302 -18778 27480 18068 -24327
4597 -24327 -29509 -43432 -42653 -20946 -73949 -67360 -76589 -67955 -47304 -66816 -58770 -13399 34387
4584 34387 9967 -5200 -14552 -13335 7950 -14407 8608 -2966 -14000 -18220 -25850 -41555 -46012
4571 -46012 -24928 6084 -28818 -36786 8647 29341 57966 17799 38399 48371 931 -27898
4559 -27898 5486 57325 26716 18076 21698 76385 140135 133636 87018 23182 13225 77867 29457
4546 29457 -60722 -84622 -76831 -83972 -63260 -45272 8723 70927 73026 -6523 -76067 -54152
4534 -54152 33242 74883 27881 19744 -5118 -5299 38965 84034 65191 26386 -4114 -43757
4522 -43757 -26581 -27874 -59323 -65388 -36107 21719 4808 29437 44259 -1524 -9058 42889
4510 42889 54232 81521 82402 59093 -5027 6265 79371 95682 54050 -9252 -15266 -20989 -48451
4497 -48451 -26643 -25959 -11503 -36298 -50930 -13965 40637 68190 68596 35826 59510 71209 28855
4484 28855 -25387 -62689 -94016 -71973 -54749 4315 59808 1725 -14359 55810 78002 35891
4472 35891 18022 28489 6529 29220 -18447 -62464 -48051 -62529 -81983 -62708 -24587 -13849
4460 -13849 18802 35933 3026 -26098 -19292 -7781 21864 68326 99605 64505 -16207 -56817
4448 -56817 -91723 -66246 -55214 -40068 4254 24808 -32721 -72338 -38267 41913 37198 9935
4436 9935 -2304 -36122 -8676 -21286 17695 -867 -23742 -5303 -5291 7517 6366 33165 43213
4423 43213 80111 60486 87011 85582 34385 -14624 -40295 6683 37723 82288 94098 11450
4411 11450 -43876 -48238 -17419 16074 110412 141959 84789 29686 -24649 -44045 -13527 24332
4399 24332 41743 69111 36767 31716 64298 52921 44500 24039 12816 2431 17439 40327
4387 40327 16719 -36911 -46358 -25095 22108 48506 96213 99958 50678 -5056 -37330 -57306
4375 -57306 -53091 -136 47159 1530 27958 90969 64750 62358 71667 71821 63693 72299 52842
4362 52842 45953 51628 78873 39407 18506 41797 8276 -41604 -39818 -59414 -57501 29299 41516
4349 41516 -18265 43353 97434 50140 25302 24038 17623 20939 35470 -13894 2464 -18888
4337 -18888 -17828 60259 35596 -12213 -78229 -59227 4773 71336 58830 -19967 -92316 -85432
4325 -85432 -63876 -47857 -24487 -48507 -8702 5481 25640 19753 33176 22658 283 -8855
4313 -8855 -54600 -87583 -44528 -16534 -15524 -13039 -39264 -39380 -2267 -13854 -6055 4016 -38890
4300 -38890 -67842 -9417 33337 49201 40055 37282 58497 49264 39992 1962 -4282 17196 12729
4287 12729 35005 78299 91464 37917 -28322 -24945 13018 29043 22142 12479 18693 6080 -25337
4274 -25337 -59367 -43025 -63826 -92538 -99603 -55168 46330 36068 69718 93753 85658 101074
4262 101074 99535 42407 -21172 6477 3848 -20639 -20780 -12680 22559 -12105 7219 8657 -12768
4249 -12768 -32266 -86434 -105653 -65400 -47072 -14875 -60782 -25826 18262 10534 -760 21145
4237 21145 28192 15926 4701 30367 8105 -427 11344 20618 -25949 -19443 -19261 -45846 -45298
4224 -45298 -38256 -10764 55185 102814 92166 50470 45204 61972 30788 -15722 -33657 -13908
4212 -13908 -15182 -23322 -43277 -40256 -47926 -6625 58760 41507 40444 6060 -28162 -13223 -3140
4199 -3140 -388 39219 24985 14107 -13501 -14148 -34307 5823 24272 23398 71300 99615 82468
4186 82468 52840 38090 4057 42728 45179 22987 18304 31726 7712 40329 68126 85233
4174 85233 48767 59576 7310 13254 57869 13627 -20479 -23677 -37865 -14391 11953 61254
4162 61254 49686 20297 7775 4103 -3985 -16256 -29840 8987 41789 47930 23234 -11201
4150 -11201 -28967 -13094 21813 25088 22301 1408 -106 -57940 -99809 -89735 -74901 -47995
4138 -47995 39659 100925 45671 -3321 -5989 5659 24353 148177 181500 133349 82999 69911
4126 69911 22444 -2381 4295 17267 -33099 -72713 -79815 -75634 -38462 49191 85673 19434
4114 19434 -12915 -3842 -23315 -54773 -50520 -26743 31555 45487 -41075 -68335 -30780 -3516
4102 -3516 -23311 -4583 -13791 15372 -17384 -41382 -43964 -104135 -50225 -5113 -14966 -61172 -50516
4089 -50516 -82211 -58103 -5306 24009 -24229 -55607 -43008 8246 30910 43377 41571 92779
4077 92779 68961 79120 46814 16568 -28461 -23420 -2264 34357 -901 -42204 -41747 -8428
4065 -8428 -10422 -9485 19760 4156 1435 6107 -41770 -61564 -80341 -22472 20300 50542 10922
4052 10922 -68946 -2110 55509 74365 62383 9427 -38053 -83906 -109125 -99944 -66360 -48070
4040 -48070 -12385 68604 139847 106954 26847 21415 -24075 -54873 -69515 -16905 10294 6023
4028 6023 -16633 -67991 -56973 -34029 -57034 -66072 -133685 -107537 -70981 -35785 42423 28056
4016 28056 -41441 -30186 -40227 -46645 -6733 -25738 1583 63493 63668 -7120 -157 -19004 -77240
4003 -77240 -33671 4242 -46985 -82536 -97237 -69526 -33214 -8322 32262 16217 -9672 -3832
3991 -3832 -27084 -6176 77362 116762 110632 49414 -18930 -59375 -58416 11442 26954 63827 49812
3978 49812 10648 -41436 -69133 -12558 38404 45890 75314 85510 5891 -114226 -77229 -6646
3966 -6646 550 -17719 10462 15461 65309 27848 59007 73160 54878 54291 76405 99746 47461
3953 47461 12746 -10122 26925 17885 15889 38076 47456 3181 -16275 -29997 -19033 -59
3941 -59 -18118 -11978 -23383 -36724 32706 42340 37276 39038 22997 8507 -6733 -26200 -67394
3928 -67394 -17812 63687 56643 33739 26163 -29660 -66573 -104701 -128787 -73850 -27447 -12341
3916 -12341 -23007 -2080 -8702 -14079 -18384 -51104 -64042 -64324 -63848 -15189 -20107 -3720 -17740
3903 -17740 -78784 -26606 -2516 39769 28938 16174 59496 18864 9000 11293 25313 60362
3891 60362 62233 51436 -7651 -34758 -18949 38430 88832 82366 40838 21129 1862 8192
3879 8192 8453 -2056 -49479 -46941 -40983 -60275 -107697 -116015 -102013 -78739 -60411 -76153 -73718
3866 -73718 13044 75290 78232 30991 -5614 -13497 -48004 -42069 -20030 17381 -17967 -51277
3854 -51277 -22796 11012 16989 -32983 -31004 -30417 9791 -7305 -53327 -38530 4348 -9222 11432
3841 11432 -25102 -41913 -53989 -37929 -51333 -46892 -12786 44671 80987 64319 82977 93044
3829 93044 99488 54619 39315 14005 1531 -28937 -64362 -61705 -101560 -94245 -86120 -58749 -49600
3816 -49600 -54800 -87620 -72582 -31794 35989 80497 61154 114392 90101 43288 -53107 -112947
3804 -112947 -126909 -108436 -70666 -12693 -21489 -8365 -12554 8791 38583 11314 34296 613
3792 613 -31760 -13923 123669 188361 142902 113533 41199 62732 65085 81066 48725 13210
3780 13210 57712 34733 -8073 21406 43607 55478 55559 4210 -7856 29208 61004 30116
3768 30116 46049 56225 16848 -16309 -5403 22094 16767 21875 5970 -89501 -144309 -123123
3756 -123123 -85570 -98150 -66227 -42113 -22256 8321 75818 73100 53662 64989 14647 4554
3744 4554 -41405 -21779 -15681 41432 72885 58091 80935 66590 31835 84936 132556 114930
3732 114930 73570 41864 -849 -19501 -3695 10507 11902 -41219 -116087 -105847 -13498 67532
3720 67532 51381 35324 62247 42560 -22802 -77186 -107048 -152095 -88833 -3504 6914 -9153
3708 -9153 31741 37449 -41562 -63285 -18096 -38551 -52451 -98972 -84556 -49547 -21330 -48447
3696 -48447 -57709 -57435 -85544 -110614 -109869 -62020 -19944 -3414 15055 -28636 -45580 -39192 -30927
3683 -30927 -55446 -91387 -100286 -72096 -52988 -34071 -22718 1301 -21481 -44096 -46230 -19804
3671 -19804 47297 94597 93522 68097 13251 -35008 -56530 -74806 -69966 -57565 -23812 41820
3659 41820 36696 32028 33563 33124 -7873 12613 54422 15661 -10404 -51847 -99755 -104785 -13454
3646 -13454 38517 75682 50814 24051 -61568 -126203 -94331 -51582 -68440 -97848 -65851 -47188
3634 -47188 -14383 -46943 -73953 -72275 -51198 -56930 -90035 -68577 16889 62514 83095 64756
3622 64756 13623 13593 -782 -391 24558 40959 97026 119616 46592 -17293 -20944 -1101 -32937
3609 -32937 -30034 -47924 -53576 5891 90357 37714 5952 -30687 3756 15717 -5001 -43835
3597 -43835 -63148 -94366 -94762 -71735 -77461 -52073 -45972 -51934 -29388 -20228 7785 -12330 -40484
3584 -40484 -16086 565 5617 -43756 -13444 17353 53027 86415 48033 5853 9391 -5347
3572 -5347 -1489 22345 71167 46344 41282 66920 84694 25872 14381 86277 54251 26615
3560 26615 16876 -6027 -41498 -84178 -101819 -74458 -56908 -36325 338 15842 -28256 -41593
3548 -41593 -23723 -63107 -71691 2974 54491 36253 28917 29161 59082 29786 -3655 -56435 7739
3535 7739 49731 19685 -51508 -64474 -59834 -56122 -16810 -8899 19480 29211 -27538 -23223 23542
3522 23542 62871 53661 26356 24932 -45671 -85330 -32572 41674 67936 74795 77844 63597 29917
3509 29917 36162 43147 -9000 10843 48316 22646 -37611 -36716 -45830 -35512 -3446 3864 45927
3496 45927 14305 19347 -37432 39329 84129 -475 -65526 -78447 2368 19631 18186 -7273
3484 -7273 -2127 28060 16138 -25207 -19994 -11370 -3888 3909 36304 53088 44818 79304 61790
3471 61790 -7769 -58206 -16312 -11886 -59010 -125026 -55871 -50012 -65957 -85597 -18272 75975
3459 75975 130168 83653 72215 51177 30280 34733 45686 13998 -16809 -24951 -38643 -19911
3447 -19911 -7001 -23622 -35484 -497 36487 65915 56985 22603 14262 -2397 -43345 -24613
3435 -24613 -15147 -14900 -25046 -104982 -63839 -90504 -101757 -125892 -118562 -97803 -74747 -48573 -10745
3422 -10745 -37663 -53889 -24738 -1857 -46979 -26144 -61907 -64158 -40114 -23201 29124 3699
3410 3699 -81443 -108685 -66150 -53175 -46865 -83614 -113678 -66633 -55124 -26073 -39392 3150
3398 3150 14551 19174 -6280 33256 35916 -17158 -54018 -22890 1579 -4584 3939 30373 5337
3385 5337 9239 29185 21442 22328 -68021 -107547 -58862 -161 11485 14299 -24522 -43684 -11707
3372 -11707 -36355 -63798 -9347 6299 40607 49926 -99 -34216 -25329 8124 33495 61645
3360 61645 78773 91172 39729 -16456 -25694 -27273 -18701 -15398 -31394 10842 59239 61128 63380
3347 63380 -12178 -54398 -67787 -49032 33283 53372 35245 42802 16780 -12752 -32189 -26140
3335 -26140 -27121 -66071 -79575 -48006 60733 105249 72030 60895 43030 19067 27287 57513
3323 57513 64108 51129 34968 -17367 19607 66319 10915 -14490 -22536 40458 106137 90937
3311 90937 54774 47869 69890 68942 61461 38672 48178 27909 54394 54990 50786 40332 43849 25043
3297 25043 -35461 -45087 -43694 -55429 -40438 8868 33865 1125 -23024 -52688 -68570 -47342
3285 -47342 -44544 -68417 -90207 -40923 13403 -22822 -45209 -24294 -3212 31253 -13979 -40763
3273 -40763 -68197 -69512 -35480 -48365 -15914 -6811 -33441 -56498 -87376 -89083 -108592 -73179
3261 -73179 -23611 -19785 1896 -6653 51018 49944 62656 88831 74213 25635 -6980 -36216
3249 -36216 5515 -1134 -35056 -22770 1891 -23775 -31228 -15024 -4583 -63169 -14104 62230
3237 62230 90768 51057 6647 -68430 -113585 -105380 -110079 -142366 -135023 -13565 21904 21460 -22715
3224 -22715 -28384 -53580 -35254 -26897 16373 72796 60784 73556 26150 -67604 -134183 -86882
3212 -86882 -30844 -36448 -25616 -44293 -60664 -23568 21206 49 22348 10366 -20010 5926
3200 5926 -12463 -6929 -12711 49028 53018 34000 6643 -45688 -21422 -24704 -36284 -45864 -13401
3187 -13401 4083 -40048 -91412 -113199 -144954 -160707 -135602 -68186 -62179 -23372 4798 -45651
3175 -45651 -79012 -17604 -4172 -13994 21584 81408 119585 51496 -20944 -12179 31 29707
3163 29707 33897 -17148 -14431 -9916 18617 -14916 33505 80501 22465 10808 11905 -17356 -32445
3150 -32445 -25036 -12421 -6234 27963 6626 -1786 42998 19918 22748 -12366 12262 27865 -2264
3137 -2264 -48591 31684 29563 19974 23738 34561 52796 52983 7701 31479 39577 30479 50142
3124 50142 30382 -35639 -56734 -99220 -77252 -15864 -34084 -14241 -31347 -66827 -85817 -52578
3112 -52578 13025 1098 -29506 -53444 -72405 -62153 -44065 -30509 13847 29956 33836 72952
3100 72952 70983 11381 1405 35422 47468 95230 70850 34047 13698 -18626 -58319 -41670
3088 -41670 -85054 -53010 27448 18591 4732 8234 -74269 -47732 32413 40726 -16380 -88681
3076 -88681 -126340 -94844 -49548 -37171 -72275 -29772 35221 69870 73178 52283 37000 49927
3064 49927 43966 -14399 -43358 -53581 -27765 25396 12394 2474 -44340 11065 70612 109727
3052 109727 126347 85126 74644 29326 23451 69506 121730 109023 71377 57899 12779 8491
3040 8491 11321 26265 65273 17802 -36047 -29521 -28613 -27127 -76466 -47453 12680 30095 58439
3027 58439 60508 49626 12690 -56480 -97839 -58321 -32536 -78549 -63950 -37339 452 -16756
3015 -16756 -3028 -1976 -13690 32668 46106 43431 60664 19883 40549 45521 -11491 11893
3003 11893 41425 51369 64663 -4423 -51208 -20133 24324 93673 43833 10551 31293 45340
2991 45340 24228 13727 -9153 -30568 -10186 53195 43838 8933 1935 7490 -11586 -49659
2979 -49659 -46980 -94808 -66560 -16174 -23019 -45120 -71330 -64111 -44747 -12787 -3127 30974 -1456
2966 -1456 -44286 -76653 -115929 -137303 -82415 -46231 -10399 -14519 -27091 12942 36069 55430
2954 55430 67473 74053 63213 11211 -3890 53292 92915 54807 75529 15772 -40598 -26049
2942 -26049 -36187 -31909 1845 16152 -35743 -86772 -91172 -41071 -22319 -11484 13531 26139
2930 26139 21624 27674 -4304 -21914 13891 19541 -19641 -20306 -30143 -28215 -25895 893 16003
2917 16003 3682 -9462 28078 56350 93009 95786 14376 -68257 -41383 783 -7920 -47567
2905 -47567 -47965 9690 27084 39360 38816 37830 44365 16347 34907 14572 702 9664 -4195
2892 -4195 8394 42189 60367 36479 -10461 1726 -30495 -39471 -3167 60902 29313 9814
2880 9814 14004 -3052 14217 -32726 -75268 -70477 -58294 -18712 -47117 -40717 -4463 37837 -1657
2867 -1657 6280 -17735 -4496 4738 6105 -34453 -116312 -127325 -77768 -69109 -23532 -16358 -39931
2854 -39931 -21700 -20940 -54578 -26444 -5362 -2436 32258 13151 36938 64558 74285 28791 37031
2841 37031 24686 3143 946 49349 45508 23595 -18308 -28548 -8834 5544 -952 -10065 -46597
2828 -46597 -28899 -16594 -27539 1396 16328 40953 62686 57671 -14421 -75072 -72666 -60075
2816 -60075 -22051 -12874 -10746 -31645 -16826 -14964 -29074 -28037 -24511 -46958 -47207 13342 37460
2803 37460 38957 33833 76813 76880 68545 81405 -776 -32562 5711 35168 27101 12897 11681
2790 11681 -12490 -64014 -17148 34004 80198 81403 16711 -15819 8802 -3792 4473 6622
2778 6622 20074 46762 9693 -13514 -12822 -26240 -97580 -113088 -22993 50172 57938 65298 30986
2765 30986 4610 -19054 -26802 20646 19695 10154 23785 32946 15281 13629 37944 54493 32434
2752 32434 37840 60940 67230 50695 35350 2864 -1384 -1461 -39937 -47242 7990 37811 34943
2739 34943 2965 39926 77790 34477 48075 27925 -18610 -352 17663 3267 -19992 -14851
2727 -14851 -34506 -21593 -29565 -23382 7989 16016 53663 64815 37137 -17450 1145 29094
2715 29094 66226 60905 24696 3229 -70201 -87292 -68655 -40891 -21443 31524 48091 15550
2703 15550 13796 18410 -3569 7268 60641 30321 26226 34836 49454 36865 59359 16196 834
2690 834 9964 13259 27103 28529 84871 89875 70078 56912 106238 97409 85449 41676 14208
2677 14208 18941 11204 -13031 -46922 -46273 -2639 43797 60586 -5255 -24557 23711 69377 87684
2664 87684 60658 33535 -13331 -21208 -11793 -18672 27697 37492 23345 11554 59972 38336 -30691
2651 -30691 -21405 -34468 -36355 16769 13310 48917 63272 76454 85268 22427 644 17872 17680
2638 17680 32031 15168 -5701 -24045 -357 5467 47648 12917 13713 34297 12626 337
2626 337 215 2642 29163 40993 70848 71383 33937 94058 80069 70282 56615 6079 45213
2613 45213 70230 59000 16955 62886 79911 51019 72474 83385 89059 77779 69636 -1417
2601 -1417 -28764 -23748 -43731 -58714 -32275 -17120 -22289 -14478 -21933 -69163 -105399 -66356 -38275
2588 -38275 3575 32441 7953 -64865 -62382 -18670 -13218 -34944 -28036 -50139 -74842 -72173 -51038
2575 -51038 -61054 -73457 -32948 -27335 -12083 19084 5463 -25651 -28900 -52124 -19976 9382
2563 9382 -20174 20538 19572 15745 -31325 -85771 -99183 -104194 -90017 -72879 -61757 -3359 48833
2550 48833 46886 423 -61337 -66896 -11988 -48451 -45499 -36672 492 -58620 -55532 -13110 3774
2537 3774 48854 83216 92859 68831 27114 -5689 4621 2497 32431 68408 -18016 -74407
2525 -74407 -65424 -34802 -48782 -51811 -35579 -40424 1632 -13077 -49669 -43945 -21411 -23178 6094
2512 6094 10391 25714 27210 -734 -400 20925 60284 73053 81548 86931 94390 51777 -4357
2499 -4357 -9955 -7974 -5836 37639 59616 107421 100828 91662 5508 16750 78443 39446 17631
2486 17631 -11023 -45808 -57639 -44153 -41784 -4986 17176 9230 -49511 -49731 4643 43540 42403
2473 42403 80530 101449 83103 59070 32362 -39575 -58191 -63568 -42018 19895 34917 37816
2461 37816 22198 -45696 -74274 -25021 -30705 -37427 -41413 -9698 18274 53919 55858 15484 -17471
2448 -17471 -33290 -30496 -21023 -22336 -65957 -70116 -76799 -97425 -91254 -83037 -35436 31408 14361
2435 14361 8326 26445 30711 12880 1493 29882 48018 1640 -34777 -22868 -22420 -64463 -38853
2422 -38853 1221 -20201 13174 64922 36667 10421 -41510 6021 68209 98205 19536 -65248
2410 -65248 -81560 -22216 -3790 -13191 5020 1638 -12359 -21748 1019 26249 -7343 -47617
2398 -47617 -39048 41946 51416 -38678 -91433 -81468 -25831 -20894 -34481 -3688 68550 82510 60910
2385 60910 54933 38186 35902 38313 30660 82076 103457 21783 -32056 -46778 -22059 25118 30877
2372 30877 24452 44379 60865 57331 93653 58754 37785 18021 -14135 -67811 -73044 -61978
2360 -61978 -34098 -43089 -27483 -27287 -1646 33988 70024 97708 95127 104052 68633 11291 8116
2347 8116 32863 24199 44809 38904 6727 -9770 -26786 5537 -2761 -47651 -48094 -17364 66460
2334 66460 56568 19018 29754 34288 -5965 -24118 13744 65558 110176 85424 78308 45677
2322 45677 -1139 11722 51423 52366 6981 -49467 -71713 -70858 -56834 13049 54023 48981 66999
2309 66999 95706 95689 82876 53811 -20958 -75704 -48076 17595 12634 33951 78709 58895 16053
2296 16053 -36664 -34846 7489 83689 60844 58200 29059 10135 38930 78718 73271 6292
2284 6292 -36346 -5716 -39134 -113542 -183559 -176482 -151516 -62355 -11289 10251 7754 76685
2272 76685 97064 86373 110930 113046 63692 71462 19697 -9471 -6577 -10854 -16327 -16624 -52079
2259 -52079 -17119 26594 -4298 7117 844 -17590 -55217 -52730 -35950 26923 9173 -45184
2247 -45184 24786 141325 164731 115965 44012 -63439 -78710 -50259 -20431 23436 25143 -42652
2235 -42652 -59247 -42537 37724 60169 3646 -36296 -10740 32259 18568 4718 -26640 -29548
2223 -29548 -13915 -12772 -25547 -20124 2663 -25889 -70842 -76421 -32878 2608 66478 88445
2211 88445 45491 -14157 -78454 -57488 -20912 6214 -39283 -31047 36917 70038 35860 41179
2199 41179 51201 29344 1522 36577 47890 -18774 -22108 -16080 7985 58454 101862 81500
2187 81500 41682 -5880 -13067 2236 17164 73736 112764 54193 32282 2785 15546 34349
2175 34349 10361 59314 114838 127303 107091 76052 29849 1949 29296 28753 -3771 -42065
2163 -42065 -51291 -44242 -26447 -38421 -11745 51351 35211 24088 -35438 -81591 -46753 10959
2151 10959 48196 61116 39763 24722 -1256 -13434 6835 30202 19255 15859 28576 66404
2139 66404 82610 54755 13542 -4015 35422 69709 43832 50522 5263 -20348 3910 -44240
2127 -44240 -60729 -12163 30866 55803 17447 -7557 -32662 -11585 19707 -6632 -54371 -75646
2115 -75646 -39783 12136 29464 43175 -2394 -16202 -37 3498 -20650 -45722 -76118 -25647
2103 -25647 33527 46345 22114 47105 14106 -6790 -33099 32767 46928 33782 26614 8132
2091 8132 -1494 6002 -10785 -55048 -31886 -9384 7171 -53116 -60805 -29131 -41227 -71600 -104181
2078 -104181 -132710 -140411 -90038 23253 -2709 -50734 -27555 -1175 25252 73946 57336 23015
2066 23015 41494 75827 25289 22582 34581 42979 22566 42086 19738 -34278 18066 52983
2054 52983 18739 -6792 15325 20878 64188 33943 24827 -18132 -38905 51386 96695 61569
2042 61569 551 -22378 -75525 -39939 11671 6870 2644 2294 -34215 -30445 -37384 -38504 9853
2029 9853 1807 -60384 -60407 -54519 -58014 -66334 -129773 -118272 -36441 11489 -23845 -50562 -18486
2016 -18486 41048 12513 -441 37920 -32122 -96293 -115804 -51797 40608 66135 51099 20449
2004 20449 -33387 -38890 -58369 -60576 -63419 -70489 -36773 -63041 -23368 -226 -12995 -30812 -33606
1991 -33606 8345 -4571 -48890 -18063 -3890 -34023 -81409 -61347 -31853 -23215 -15982 -50001
1979 -50001 -34787 18076 52367 66670 103431 121095 77691 5005 -8921 -48965 -120429 -89269
1967 -89269 -53129 17670 42250 923 -13265 -484 16171 64434 55494 35087 61090 57238
1955 57238 68663 95434 104540 59534 27624 37033 5594 -97479 -49926 50067 77221 103299
1943 103299 104890 59923 1478 -7743 -39428 -34798 -40630 6042 32945 3518 26383 22998 69167
1930 69167 120582 76567 -6166 -41232 -47382 28285 61915 58558 39480 6025 8235 -37918
1918 -37918 -38448 -20852 1605 -9808 15681 32315 26943 61501 92803 89513 26226 38338 87596
1905 87596 31885 -9697 -23222 -66416 -1158 61184 49126 -28411 -715 62878 54846 44030
1893 44030 61506 50791 -13286 -63262 -52148 -18917 15327 5365 -32779 2078 35939 49374
1881 49374 99137 87971 70098 58061 25699 16575 9829 31811 -8648 -15280 -13693 11097 35630
1868 35630 38538 61206 -8567 -49633 -34806 6897 33303 325 -14614 45196 99463 45644
1856 45644 -48831 -82499 -55880 -23667 21392 23893 18010 5115 -63959 -78983 -60634 -54405
1844 -54405 -54222 -5680 54967 73955 99661 97320 54859 29491 58605 2499 -17248 -21984 -19148
1831 -19148 -14023 430 7959 28000 18821 57502 18903 15895 29719 17302 33637 51781 53023
1818 53023 76181 59673 84259 107678 54276 61715 16531 -4766 -25928 -29659 -21233 -83205
1806 -83205 -57466 -54240 -25180 25041 61155 53771 45488 52325 1794 -21663 33271 -4365 3440
1793 3440 -41219 -41561 -33358 -42391 -60021 -35869 -21097 -30878 -4914 27221 27734 -12870 -78572
1780 -78572 -76829 -117147 -90251 -39543 -13285 24921 27585 14077 76931 93994 38790 -1453
1768 -1453 -9189 15390 -10689 -22770 -55592 -50526 -17543 44386 94876 70322 67504 104968 156723
1755 156723 142361 95330 27327 19 -18561 2905 28947 86215 119517 84776 55581 33890
1743 33890 21695 26152 -6465 -2860 21921 18168 -9168 129 54571 35958 20592 4096 -30241
1730 -30241 -21873 5857 -34593 -52021 -33826 -32691 15955 34527 10904 -5018 -12942 -31501
1718 -31501 -60905 13502 44980 3506 -91246 -117097 -99932 -47112 -19354 35725 44553 30656
1706 30656 42541 21038 57083 68829 42435 30231 70373 54137 83207 78671 70271 40690
1694 40690 38709 -13569 -13948 -17876 9336 17981 18046 57893 64989 60992 30726 2637 -31657 -17320
1680 -17320 49910 56661 49058 57229 -23442 -105850 -88577 -52037 -5290 -22987 -65207 -60755 -48322
1667 -48322 -36808 -31413 -37410 -48212 -97125 -34932 14102 -6366 -8570 9550 -10869 15168
1655 15168 46024 55005 19926 -31951 -89775 -76669 -49216 36658 22931 12895 34779 32596
1643 32596 -39152 -33197 -54396 -30491 4050 17011 11684 -18897 -46185 -66288 -70499 -9692
1631 -9692 54754 5243 8991 6091 11131 5870 21352 17196 27214 10029 -12010 -3828 47358
1618 47358 80123 43028 -6410 -12747 50730 64187 87140 91556 97614 93484 64922 51063 26466
1605 26466 43669 11685 -45266 -25474 -24316 7397 46572 3197 11057 52593 57357 16586
1593 16586 -29894 6769 14493 31716 10385 -18243 -5532 7066 47815 74040 18030 -42098
1581 -42098 -9322 27604 5514 -30019 34316 42240 49407 63041 138598 163967 125180 77064
1569 77064 55529 34855 17840 52609 58687 -20710 -65481 -4637 64942 18806 -41278 2767
1557 2767 22015 57152 92907 99006 34669 17564 15894 -36760 -40292 -14304 -4790 -1742 33630
1544 33630 16665 37651 102105 40849 28535 38400 31565 -50897 -101771 -73907 -64657 -26603
1532 -26603 32075 63485 1688 21478 29587 6344 -26449 -41567 -31143 -43575 -71346 -5379
1520 -5379 7806 24536 36279 3483 -24783 -109432 -121698 -96129 -49252 -15653 13286 9151
1508 9151 -28204 -47965 32629 66382 37356 28405 88177 96603 54730 36704 -5416 -15841
1496 -15841 35834 27514 33949 -27032 10413 34358 28674 44859 -44 -45697 -89739 -28231
1484 -28231 -1974 19438 -38076 -52377 -19796 -18949 -14839 7702 40413 95458 71551 83120
1472 83120 129030 92483 -855 4734 36861 63269 24216 37175 28373 -16544 -24658 -3591
1460 -3591 -21464 -12781 8497 21388 18799 47385 46537 -79 -23723 -32113 411 -176 -35254
1447 -35254 -75662 -66737 -74811 -91438 -24074 -4797 -6851 32634 30989 55565 81238 79811 71632
1434 71632 56167 32140 -24397 -54945 9896 -31923 -56590 -68420 -72140 -36461 -6483 -45205
1422 -45205 -7796 -7540 49434 39686 30095 20620 -8809 209 50391 39004 22340 41191 59779
1409 59779 87165 65203 -11894 -30174 -23233 -42864 -21626 4356 34657 99782 131714 121472
1397 121472 76358 70557 40116 -11916 -20871 -6348 -72485 -60909 -30473 -64298 -84553 -98288
1385 -98288 -87923 -64894 -84869 -66841 13732 5971 -23624 -41963 -60568 -55335 -36225 -39044
1373 -39044 -51973 -23813 -3265 -7746 -25131 -22310 -25345 14396 40902 10039 15652 -8099 29197
1360 29197 107940 87587 95370 93977 85963 2895 -39081 -34007 65 15476 -27169 -2495 49224
1347 49224 34142 -15093 -465 -29899 -46106 -34619 -56885 -73260 -69845 -70036 -79421 -106904 -58119
1334 -58119 -54249 -63967 -34634 15689 7841 2963 27473 42517 26311 -16033 -55312 -70120 9820
1321 9820 61192 64313 104653 82486 54656 15666 -27416 -49664 -79061 -13397 31806 45386
1309 45386 74035 92579 41273 -17531 9716 -984 36493 51568 -8839 -46375 2470 61711
1297 61711 60258 63731 31514 55753 70239 78405 61399 80462 10915 -64053 -45125 -51036 -44169
1284 -44169 -7802 -9101 -36408 -61612 -59912 -41088 -17296 -5482 -7770 2900 -39743 -72038
1272 -72038 -69257 -43501 -43237 -44818 -15328 18933 17098 1455 29988 45096 12622 40024 64317
1259 64317 44494 31757 19508 23111 6593 -19929 -47588 -42641 15461 77868 99619 66317
1247 66317 78176 97109 106057 119818 101033 75618 39376 -4592 29389 40742 71511 80183
1235 80183 99288 70746 21937 49626 37282 7336 24317 57529 76102 46851 -31086 -41310
1223 -41310 -40153 -77192 -64510 -37112 -38245 -51062 -47421 18988 80575 96727 77970 61960
1211 61960 37991 -51801 -54342 -54752 -17597 27291 53643 17942 -35525 -43606 -52486 -25273 16386
1198 16386 35206 3473 -13030 -26371 -30441 -69674 -47700 -5774 29384 9246 -22171 -63053
1186 -63053 -79304 3916 35936 -27042 -2144 -14681 -50300 -59076 -24361 -12578 34281 62447
1174 62447 56470 44317 14006 -9631 -15933 -12586 8639 38669 51525 67540 57676 -30199 -80657
1161 -80657 -33606 40167 69607 81691 66051 26457 21869 38880 50483 48434 98688 130219
1149 130219 66113 -39603 -75597 -29876 -30939 -7856 -39213 -33859 -43660 -22138 -5907 14944
1137 14944 -17934 -60585 -50056 -76056 -45980 23637 54998 -8381 -46175 -66334 -79560 -75727
1125 -75727 -66957 -39207 9930 -10634 -21476 -45627 -55723 335 28064 -39580 -124207 -138565
1113 -138565 -93686 -70415 -89085 -83403 -42207 -132 -10776 -13519 -7990 16545 33833 -6543
1101 -6543 -46800 -64629 -70411 -68982 -57553 -79482 -87040 -53416 -14329 -7806 -47055 -32744 -2486
1088 -2486 -21444 1557 -2037 32216 58952 42425 35696 21034 -18315 -35811 6000 14832 32048
1075 32048 4676 -18750 11930 -19771 -42764 32840 18892 -11771 -2518 41303 64001 90566
1063 90566 54739 15728 30230 45743 61808 24443 4406 -31787 -18541 8032 -9431 -33480
1051 -33480 -15513 28939 54458 78855 52917 72266 68789 6679 28477 38783 6512 -70476
1039 -70476 -70500 -77928 -50933 822 7232 15218 50526 86420 92370 64468 19532 13558 4224 -20574
1025 -20574 -7677 15935 17466 4991 10689 -2972 -15680 6031 18775 -10647 -66542 -11572
1013 -11572 27186 53157 26285 18376 33896 8226 -72799 -65221 -20756 10044 39689 47306
1001 47306 25306 17127 36947 40628 6976 -3691 -16249 -11155 4010 13005 -34803 -55730 -60159
988 -60159 -42178 101 11061 -41547 -54305 18382 11961 -33199 -20379 -9131 -53402 -28098
976 -28098 -6960 11233 3278 -19896 -48881 -34663 -29479 6036 26709 -52675 -138099 -159784
964 -159784 -145609 -64668 -43484 -78035 -60138 3770 35930 18478 -15995 20483 31264 57573
952 57573 64077 7755 -15318 -49453 -44337 -38732 -45084 -52718 -64579 -22519 43839 84478 83277
939 83277 25701 7679 26630 50915 77341 43899 33567 41987 32506 -11007 -17417 -27005 -13419
926 -13419 -569 -18322 572 -6474 -9456 -79615 -73307 -57762 -77820 -70019 -57047 -73084 -35161
913 -35161 8509 -22142 -39292 -4058 42304 33888 9996 16930 24199 32063 14637 5149 42879
900 42879 48171 24340 -2616 -33206 -7223 44336 -7550 7352 51906 34676 -14735 2699
888 2699 60143 65928 41852 27335 40628 35703 -1236 -3923 32408 36382 27948 13732 -15678
875 -15678 -33152 -19392 -10011 -16915 -8811 -7303 -64554 -32929 -283 52824 26242 29231 24337
862 24337 60124 120524 104808 53063 53765 80069 50298 31487 19099 -12954 -68742 -78119 -76356
849 -76356 -56134 -28301 40097 64438 49190 80090 106617 80669 30432 -30622 -77158 -46155
837 -46155 -106454 -143212 -132684 -125449 -50748 -58913 -102691 -123319 -41212 -32796 -76998 -86312 -45119
824 -45119 -34644 -31092 -25678 61 17901 -52605 5225 48344 48049 44285 -22348 -31132 -37874
811 -37874 -11104 -43074 -53286 30625 50535 47596 46029 -4526 -94050 -130147 -79892 -67708
799 -67708 -60784 -59321 -51279 -50574 -26321 -22187 -12958 -9059 13443 10176 12344 17919 11178 18495 49768
784 49768 64687 104830 100134 89203 122981 126580 101492 14413 -30613 -6700 35361 -14840
772 -14840 9968 20068 -31949 -57122 -60897 -47369 -77360 -88249 -29918 -33655 -93811 -102160 -113624
759 -113624 -113471 -84846 -37693 -34224 -3310 -1823 -8976 -42336 24985 63598 48510 53675 58069
746 58069 44866 55848 85207 91328 8485 -20229 -31247 -94599 -74819 -25311 -69867 -152439
734 -152439 -107259 -43452 8853 3711 22478 37640 -35446 -93299 -90830 -25783 -20539 -15777 -16042
721 -16042 -17904 -60792 -100557 -100538 -14849 43585 8818 -15757 -69145 -58185 -165 77715 73376
708 73376 45688 88411 41924 -9911 -25942 -70229 -63510 -11316 -31922 -19844 -13449 31905
696 31905 31869 72166 55541 -12030 -55244 -41542 -59080 32 37170 41808 41370 96759 69811
683 69811 47712 -1541 -44967 -30691 -12796 -10487 18525 53651 64241 11875 9021 38113
671 38113 -5919 -67655 -132352 -129149 -81306 -8258 7968 -24382 -73378 -35925 -13396 -41996
659 -41996 -88073 -107283 -81672 -54217 -37477 -52507 -56666 -85883 -103915 -75098 -112736 -96526
647 -96526 -47387 -12391 66941 61107 5991 41293 27406 14665 -26812 6558 -199 7296 20892
634 20892 47604 60968 29905 22557 -17043 -4314 10796 42833 74265 53798 16194 23814
622 23814 47252 41922 4719 -79351 -83266 18607 13804 -14479 7414 43374 46569 50288 69623
609 69623 29765 -6121 -80970 -70794 -84494 -103248 -53893 -37488 -43286 -36164 -24446 5342
597 5342 -4649 13666 67822 -11780 -47098 14407 22044 18133 36030 19136 27441 -8267 -36357
584 -36357 -6874 28738 17465 -27430 -92024 -138050 -120388 -64313 -23285 -27149 -26453 -4615 33834
571 33834 -78953 -146255 -93492 -68904 -58810 -35596 2692 15111 11035 -8484 26458 20142
559 20142 -38331 -80646 -14959 -7275 -25653 -51088 -67932 -72426 -43005 -21095 -58157 -13705
547 -13705 -358 -42815 -35641 -21558 -30008 -32971 -47490 -38097 -47271 -31672 -37729 -3463 37550
534 37550 21016 -46434 -66770 -57740 -34764 -35711 4501 56646 93704 69936 31856 27454 8923
521 8923 -26208 -55513 -49047 32305 49012 32587 13369 26478 25965 19017 33857 34868 5257
508 5257 -57345 -52938 2718 33470 16063 -189 23906 3919 -6435 -18325 4169 10366 13447
495 13447 29798 8759 41243 47437 48199 94358 32736 -75372 -52831 44561 97547 57069
483 57069 31573 -482 12535 13659 59842 4651 -54603 -28151 15771 -4391 -35078 4720
471 4720 38164 27136 7671 -80430 -108987 -110840 -91213 -97234 -72781 -47424 -78602 -79014 -49935
458 -49935 -32906 -9810 16848 -34234 -32861 -713 -16490 -23897 -43285 -88240 -126799 -130327 -95763
445 -95763 -62674 -30465 -3684 8341 53240 21128 -13079 -110566 -125706 -65557 -31096 -4494
433 -4494 1056 29112 47945 42054 -29343 -105300 -98121 -16776 17528 26692 8953 42159 52804
420 52804 18852 17493 12724 31264 58500 49356 16122 17483 28450 -2539 -17714 -24837 -6099
407 -6099 8718 -7460 -59216 -76198 -42722 -44455 -54018 -38340 17631 -14473 -33256 -34942 -31003
394 -31003 -4947 -26510 -105128 -70844 -70259 -19994 -551 -53769 -90845 -87912 -48935 -48405 -68679
381 -68679 -97015 -97214 -12861 -22940 -35076 -4914 -27830 -47861 -67325 -64150 -61771 -60200 -92476
368 -92476 -68696 5904 -21109 -29734 -45983 -37163 -38086 -43991 -32773 -63925 -86419 -106114 -30287
355 -30287 -28014 1041 -31458 -24370 49769 71571 73202 46604 13045 -25851 -62656 -79217 -66883
342 -66883 -52631 -8054 -31406 34938 43581 12573 11736 59289 22304 -40936 -34704 -15852 -38159
329 -38159 7238 -7031 -34044 6201 54599 38754 21565 39556 62461 66966 39907 12985
317 12985 2237 -31070 1808 12347 52607 5281 -17829 -60727 -66316 -68958 -27514 -49009
305 -49009 -1271 44326 23054 -11297 -23242 13133 137 -19754 -6157 13804 41712 67933
293 67933 11236 -36879 -10854 10049 11062 27794 29766 -27852 -29775 -39653 -14138 -22717 -21852
280 -21852 789 5303 22706 66912 74573 80791 35125 -47542 -52138 -17243 30289 27787 28674
267 28674 24963 -27270 -32387 -15060 -21808 -32150 -71087 -97395 -99445 -89806 -55509 -38100 -55318
254 -55318 -60956 -81982 -71666 -79125 -58036 -9414 44094 59425 66812 55641 -7693 -44795 -40479
241 -40479 -71261 -94018 -70119 -89878 -99429 -51075 -49558 -61858 -52599 -31860 -22880 -19134 -24265
228 -24265 -4281 -29939 -47144 -52760 -61933 -71134 -79420 -52197 -17685 -23526 -34617 -49778 -41151
215 -41151 -30702 -41004 -59117 -35881 -19382 -25846 -70222 -85545 -47647 -39062 -40064 -44900 -65528
202 -65528 -23385 -1036 11512 -2381 -2320 -2033 2529 28700 26441 -21855 -22830 -38715 -35506 -11931
188 -11931 20097 24703 11537 8877 -4432 -60084 -46302 -48313 -36101 -20950 -20530 -27768 7574
175 7574 49754 26096 -20486 -57898 -54538 -70962 -91647 -98703 -72344 -18630 64298 37065 -3140
162 -3140 3999 5648 15533 24257 -1122 -1113 -5828 -18236 -13618 -28250 -47413 -37066 -10904 -30715
148 -30715 -918 3988 7738 27620 -26180 -48900 -46332 -84627 -90713 -43172 26013 63694 69656
135 69656 77068 28366 -26345 -26409 6718 25563 5544 3692 -26398 -51717 -30524 -48447 -54860
122 -54860 -39469 -9968 28301 31135 14663 -18346 -35954 -44716 -43538 -44573 -59372 -49394 -17923
109 -17923 17904 -8501 -21756 -57549 -78138 -76601 -35236 -65343 -48750 -47766 -71873 -50560 -30061
96 -30061 -11646 -1926 -29436 -48416 -36205 -40545 -41541 -25589 10824 7817 2997 560 -24019 -60106
82 -60106 -52832 -31769 -41220 -25057 -65346 -95348 -85587 -31163 2498 14165 37343 7376 -1899
69 -1899 16906 -23396 -29058 -2507 7510 24467 31024 27329 34165 44022 -7601 -39573 -33821 21034
55 21034 920 -35953 -74403 -84286 -62722 -8997 -11468 -22329 -42787 -34450 -11329 -20722 -42798
42 -42798 -58038 -57407 -39731 -12524 -25236 -12563 -21234 -50859 -70165 -44634 -10934 -120 -14359
29 -14359 6001 -21316 -14422 -7841 -19852 -27645 -12735 -17173 -51851 -50193 -62301 -35785 -35622 -2136
15 -2136 -26783 -71860 -66236 -32323 9415 -17248 -42156 -30911 -31883 -44391 -48316 398 8788
2 8788 2167 12390
0 12390
$$ Imaginary data points
##PAGE= N=2
##DATA TABLE= (X++(I..I)), XYDATA
32767 187702 250579 254111 213931 207315 197540 167440 166231 184282 200796 200588 209090 208027 162893
32754 162893 156368 158936 154334 155639 198997 217982 233516 239731 248214 251674 233018 234287 212362
32741 212362 192987 216490 229613 184505 232207 262506 228930 215358 166891 167342 196922 217685
32729 217685 247610 308517 310312 293215 278460 300491 309298 289652 295759 283812 270015 245827
32717 245827 232218 230743 238731 259537 246400 256424 270603 328810 315793 259314 259379 289835
32705 289835 274908 258566 289501 270754 266093 289265 353669 391702 396176 390989 371234 356092
32693 356092 340957 323269 334120 380202 375047 361345 318762 339777 345837 343240 360129 355301
32681 355301 364810 375612 371675 373153 396381 422365 423161 477711 479299 455477 449059 461619 441486
32668 441486 420522 398470 361259 366816 368288 389921 381834 390864 351908 380816 389214 357466
32656 357466 316708 335726 374881 445113 454679 427723 411066 391518 368804 341932 349740 397026
32644 397026 403915 395921 397820 451680 449075 466401 519664 527241 474309 443329 442260 459651 432751
32631 432751 419717 414476 374803 377577 438230 490815 475121 491033 534713 544064 517378 575421
32619 575421 566656 518792 503044 507742 526885 563085 549680 502875 495493 471638 465721 512256
32607 512256 537308 503136 482150 462183 468899 504497 497463 461690 419595 437215 436467 451063
32595 451063 453103 460904 456340 471488 523891 545833 554027 529712 523808 536625 522565 526341 506175
32582 506175 513117 486703 492565 492963 490464 506398 499816 518741 513604 470959 461949 467097 517713
32569 517713 516801 542644 560386 548339 542324 521688 505801 515583 542757 541735 538840 563686 597621
32556 597621 628682 622618 603141 608622 628682 641761 607416 564824 521041 543806 584279 601903
32544 601903 617282 631244 625526 609301 591033 644869 681906 693013 697648 695827 649229 627449
32532 627449 670966 679633 672953 665414 646782 643000 637956 653741 644495 645639 700904 711846 667103
32519 667103 652050 660367 684955 684177 715174 676023 607007 608883 625442 646053 636547 637909 663628
32506 663628 677640 663006 664547 647982 640085 601849 616195 677777 659457 674328 727622 651994
32494 651994 601618 608535 597906 592587 637637 666478 679451 622869 622123 635009 654843 719822
32482 719822 733557 682199 647363 653592 696373 698174 715884 718499 732520 720636 698556 701655
32470 701655 749715 793960 785601 789100 773014 759394 799224 783183 727110 741860 701424 662903
32458 662903 677139 704259 716623 704758 733592 749907 755108 761832 737361 725573 758484 746223
32446 746223 740255 698171 670511 676093 688531 716155 748095 765427 792377 794606 817746 813265
32434 813265 780373 770145 767643 720019 703107 690990 715194 726625 704018 716185 718585 747568
32422 747568 794821 772260 727087 720108 753076 739576 698658 727019 783315 830580 808589 792038
32410 792038 790796 753991 774134 773964 789465 806239 790591 773879 779349 771130 760333 757964 733610
32397 733610 750264 764339 806725 847949 833986 844074 835968 821405 750192 686384 594471 613063
32385 613063 657705 690422 753020 831548 800390 779898 766009 752556 748610 806246 791506 753423
32373 753423 716309 734612 775665 760819 723256 729635 770967 748902 738091 747131 763586 768184
32361 768184 763800 755291 759715 794170 860049 832542 741418 784707 827524 749300 779279 836224
32349 836224 817137 783030 762385 744800 762450 768582 785744 803156 774568 759574 797761 795652
32337 795652 776089 748064 811831 799286 786405 801422 815547 806920 754461 731770 713950 742541
$$ [...]
##END NTUPLES=NMR SPECTRUM
##END=
