##TITLE=Analysis number 321221
Compound Code cc 50446
Book Reference 461/56
Project Code adrs
Chemist Name toml
##JCAMPDX= 6.0         $$ Bruker NMR JCAMP-DX V2.0
##DATA TYPE= NMR SPECTRUM
##DATA CLASS= NTUPLES
##ORIGIN= Bruker BioSpin GmbH
##OWNER= nmr
$$ XWIN-NMR		Version 3.5
$$ Fri Jul 28 13:50:11 2006 GMT Daylight Time (UT+1h)  MAYBRIDGE\nmr@NMR_250MHZ
##.OBSERVE FREQUENCY= 250.131544655141
##.OBSERVE NUCLEUS= ^1H
##.ACQUISITION MODE= SIMULTANEOUS (DQD)
##.ACQUISITION SCHEME= undefined
##.AVERAGES= 16
##.DIGITISER RES= 18
##SPECTROMETER/DATA SYSTEM= dpx250
##.PULSE SEQUENCE= zg30
##.SOLVENT NAME= CDCl3
##.SHIFT REFERENCE= (INTERNAL, CDCl3, 0, 16.522)
##AUDIT TRAIL= $$ (NUMBER, WHEN, WHO, WHERE, WHAT)
$$ ##TITLE= Audit trail, XWIN-NMR		Version 3.5
$$ ##JCAMPDX= 5.01
$$ ##ORIGIN= Bruker BioSpin GmbH
$$ ##OWNER= nmr
$$ C:\u/data/dgb/nmr/ADRS/3810/pdata/1/auditp.txt
$$ ##AUDIT TRAIL=  $$ (NUMBER, WHEN, WHO, WHERE, WHAT)
(   1,<2006-07-28 13:49:42.74 +100>,<MAYBRIDGE\nmr>,<NMR_250MHZ>,
      <created by zg, POWCHK disabled, PULCHK disabled
       configuration hash MD5:
       E2 DF 36 D8 04 B2 41 60 5A D7 A3 38 5A 4B D0 FE
       data hash MD5: 64K
       37 42 02 77 7A 27 4F A5 1D 18 09 B0 9B 2C 6F 70>)
(   2,<2006-07-28 13:50:00.96 +100>,<MAYBRIDGE\nmr>,<NMR_250MHZ>,
      <Start of raw data processing
       ef LB = 0.3 FT_mod = 6 PKNL = 1 SI = 32K 
       data hash MD5: 32K
       C5 C7 8A BC E6 E0 7C A2 97 3E 3D EB 6E CB DE 7E>)
(   3,<2006-07-28 13:50:02.66 +100>,<MAYBRIDGE\nmr>,<NMR_250MHZ>,
      <apk 
       data hash MD5: 32K
       BC 88 FC 6F 1B C7 D1 C4 AA 7C C0 EE 4D 3C 56 E3>)
(   4,<2006-07-28 13:50:03.46 +100>,<MAYBRIDGE\nmr>,<NMR_250MHZ>,
      <abs ABSG = 5 
       data hash MD5: 32K
       1F 5D 9C 0C AD EB 54 DA 36 91 D6 B2 FE 67 DC AA>)
$$ ##END=
$$ 
$$ hash MD5
$$ A0 AC EF 75 20 44 9C 58 AE 48 7A F8 EA 16 99 CD
##$RELAX= 
##$RELAX= 
##$RELAX= 
##$RELAX= 
##$RELAX= 
##$RELAX= 
##$RELAX= 
$$ Bruker specific parameters
$$ --------------------------
##$DU= <C:\u>
##$EXPNO= 3810
##$NAME= <ADRS>
##$PROCNO= 1
##$TYPE= <nmr>
##$USER= <dgb>
##$AMP= (0..31)
100 100 100 100 100 100 100 100 100 100 100 100 100 100 100 100 100 100 
100 100 100 100 100 100 100 100 100 100 100 100 100 100 
##$AQSEQ= 0
##$AQ_mod= 3
##$AUNM= <au_zg>
##$AUTOPOS= <16 >
##$BF1= 250.13
##$BF2= 250.13
##$BF3= 250.13
##$BF4= 250.13
##$BF5= 500.13
##$BF6= 500.13
##$BF7= 500.13
##$BF8= 500.13
##$BYTORDA= 1
##$CFDGTYP= 0
##$CFRGTYP= 5
##$CHEMSTR= <none>
##$CNST= (0..31)
1 1 145 1 1 1 1 1 1 1 1 1 1 1 1 1 1 1 1 1 1 1 1 1 1 1 1 1 1 1 1 1 
##$CPDPRG= <>
##$CPDPRG1= <>
##$CPDPRG2= <>
##$CPDPRG3= <>
##$CPDPRG4= <mlev>
##$CPDPRG5= <mlev>
##$CPDPRG6= <mlev>
##$CPDPRG7= <mlev>
##$CPDPRG8= <mlev>
##$CPDPRGB= <>
##$CPDPRGT= <>
##$D= (0..31)
0 1 0 0 0 0 0 0 0 0.06 0 0 0 0 0 0 0.0002 0 0 0 0 0 0 0 0 0 0 0 0 0 0 
0 
##$DATE= 1154090979
##$DBL= (0..7)
120 120 120 120 120 120 120 120 
##$DBP= (0..7)
150 150 150 150 150 150 150 150 
##$DBP07= 0
##$DBPNAM0= <>
##$DBPNAM1= <>
$$ [...]
##$SUBNAM7= <"">
##$SUBNAM8= <"">
##$SUBNAM9= <"">
##$SW= 20.6930455092707
##$SWIBOX= (0..15)
0 0 3 0 0 0 0 0 0 0 0 0 0 0 0 0 
##$SW_h= 5175.983436853
##$TD= 65536
##$TD0= 1
##$TE= 296.16
##$TE2= 300
##$TE3= 300
##$TEG= 300
##$TL= (0..7)
0 120 120 120 120 120 120 120 
##$TP= (0..7)
150 150 150 150 150 150 150 150 
##$TP07= 0
##$TPNAME0= <>
##$TPNAME1= <>
##$TPNAME2= <>
##$TPNAME3= <>
##$TPNAME4= <>
##$TPNAME5= <>
##$TPNAME6= <>
##$TPNAME7= <>
##$TPOAL= (0..7)
0.5 0.5 0.5 0.5 0.5 0.5 0.5 0.5 
##$TPOFFS= (0..7)
0 0 0 0 0 0 0 0 
##$TUNHIN= 0
##$TUNHOUT= 0
##$TUNXOUT= 0
##$USERA1= <user>
##$USERA2= <user>
##$USERA3= <user>
##$USERA4= <user>
##$USERA5= <user>
##$V9= 5
##$VALIST= <valist>
##$VCLIST= <CCCCCCCCCCCCCCC>
##$VD= 0
##$VDLIST= <DDDDDDDDDDDDDDD>
##$VPLIST= <PPPPPPPPPPPPPPP>
##$VTLIST= <TTTTTTTTTTTTTTT>
##$WBST= 1024
##$WBSW= 4
##$XGAIN= (0..3)
0 0 0 0 
##$XL= 0
##$YL= 0
##$YMAX_a= 535217
##$YMIN_a= -704644
##$ZGOPTNS= <>
##$ZL1= 120
##$ZL2= 120
##$ZL3= 120
##$ZL4= 120
##$ABSF1= 16.522
##$ABSF2= -4.171173
##$ABSG= 5
##$ABSL= 3
##$ALPHA= 0
##$AQORDER= 0
##$ASSFAC= 0
##$ASSFACI= 0
##$ASSFACX= 0
##$ASSWID= 0
##$AUNMP= <proc_1d>
##$AZFE= 0.1
##$AZFW= 0.1
##$BCFW= 0
##$BC_mod= 0
##$BYTORDP= 0
##$COROFFS= 0
##$CY= 12.5
##$DATMOD= 1
##$DC= 0
##$DFILT= <>
##$DTYPP= 0
##$F1P= 14.0000005364418
##$F2P= -0.99999901652339
##$FCOR= 0.5
##$FTSIZE= 32768
##$FT_mod= 6
##$GAMMA= 0
##$GB= 0
##$INTBC= 1
##$INTSCL= 1
##$ISEN= 128
##$LB= 0.3
##$LEV0= 0
##$LPBIN= 0
##$MAXI= 10000
##$MC2= 0
##$MEAN= 0
##$ME_mod= 0
##$MI= 0
##$NCOEF= 0
##$NC_proc= -5
##$NLEV= 6
##$NOISF1= 0
##$NOISF2= 0
##$NSP= 0
##$NTH_PI= 0
##$NZP= 0
##$OFFSET= 16.522
##$PC= 1
##$PHC0= 159.1849
##$PHC1= 8.951221
##$PH_mod= 1
##$PKNL= yes
##$PPARMOD= 0
##$PSCAL= 4
##$PSIGN= 0
##$REVERSE= no
##$SF= 250.13
##$SI= 32768
##$SIGF1= 0
##$SIGF2= 0
##$SINO= 400
##$SIOLD= 32768
##$SREGLST= <1H.CDCl3>
##$SSB= 0
##$STSI= 32768
##$STSR= 0
##$SW_p= 5175.98343685301
##$SYMM= 0
##$S_DEV= 0
##$TDeff= 65536
##$TDoff= 0
##$TI= <Analysis number 999999
Compound Code 99
Book Reference 9
Project Code 9>
##$TILT= no
##$TM1= 0
##$TM2= 0
##$TOPLEV= 0
##$USERP1= <user>
##$USERP2= <user>
##$USERP3= <user>
##$USERP4= <user>
##$USERP5= <user>
##$WDW= 1
##$XDIM= 32768
##$YMAX_p= 334869775
##$YMIN_p= -203560
$$ End of Bruker specific parameters
$$ ---------------------------------
##NTUPLES= NMR SPECTRUM
##VAR_NAME=  FREQUENCY,     SPECTRUM/REAL,   SPECTRUM/IMAG
##SYMBOL=    X,             R,               I
##VAR_TYPE=  INDEPENDENT,   DEPENDENT,       DEPENDENT
##VAR_FORM=  AFFN,          ASDF,            ASDF
##VAR_DIM=   32768,         32768,           32768
##UNITS=     HZ,            ARBITRARY UNITS, ARBITRARY UNITS
##FACTOR=    0.157963299565203, 1,           1
##FIRST=     4132.6476996994, 0,             0
##LAST=      -1043.33573715361, 0,           0
##MIN=       -1043.33573715361, -203560,     0
##MAX=       4132.6476996994, 334869775,     0
$$ Real data points
##PAGE= N=1
##DATA TABLE= (X++(R..R)), XYDATA
$$ [...]
$$ plain form
15779 -9801 27621 66982 74965 70624 53969 89558 33075 -26244 -36734 -30510 33866 20184
15767 20184 41022 72684 82510 4241 20759 1411 -3858 -45454 -42340 -30172 31794 64601
15755 64601 50115 32561 -12561 -21587 150 29153 -48061 -72394 -103673 -117505 -129485 -143018
15743 -143018 -145285 -66107 -32490 -62235 -96396 -98218 -39972 -71649 -77869 -44150 -38029 -86036
15731 -86036 -39212 -40162 -113220 -78990 -64407 -87733 -80429 -14783 28851 -42083 -94820 -66654
15719 -66654 -56264 -65620 -49143 -49835 23091 29414 37375 28702 -10665 -8557 19553 71733 63108
15706 63108 59630 38945 -9675 -30035 -31257 -69878 -73885 -76882 -92387 -109107 -96896 -76237
15694 -76237 -48617 -73520 -76440 -79034 -93500 -81625 -65464 -14040 53479 81112 75058 26116
$$ packed form
15779i801L7422L9361P983m341j6655L5589n6483n9319j0490O224O4376j3682
15767B0184K0838L1662R826p8269J6518j9348n269m1596L114J2168O1966L2807
15755F4601j4486j7554m5122r026K1737K9003p7214k4333l1279j3832j1980j3533
15743a43018k267P9178L3617k9745l4161j822N8246l1677o220L3719O121m8007
15731h6036M6824r50p3058L4230J4583k3326P304O5646M3634p0934n2737K8166
15719f6654J0390r356J6477o92P2926O323P961q673l9367K108K8110N2180q625
15706F3108l478k0685m8620k0360j222l8621m007k997j5505j6720J2211K0659
15694g6237K7620k4903k920k594j4466J1875J6161N1424O7519K7633o054m8942
$$ plain form
15682 26116 -11468 -60325 -65881 -87731 -109033 -62896 -35258 -25748 -47696 -44007 -129872 -135368
15670 -135368 -138442 -110285 -39133 13880 -19257 -108956 -112689 -61517 -15230 4751 10736 31948
15658 31948 46409 36679 -14614 -83519 -70448 -56066 -60687 -14959 -20777 34368 43983 -5835
15646 -5835 20740 17351 -15182 12676 52941 62381 54881 58626 28483 58893 25028 -36396 -55834
15633 -55834 -29561 7024 45538 27477 -2748 -7447 -6001 12660 -22293 -37800 -4534 13820
15621 13820 40549 7193 -99324 -119381 -75365 -6798 41249 14993 -60419 -65548 -104487 -145583
15609 -145583 -104846 -24758 -40275 -33550 -88911 -84047 -53647 -26863 12775 11260 -6916 -91957
15597 -91957 -94623 -90413 -91460 -44181 -2014 -50730 -145806 -140561 -134128 -121584 -78652 -96628 -109221
$$ packed form
15682B6116l7584m8857n556k1850k1302M6137K7638R510k1948L689q5865n496
15670a35368l074K8157P1152N3013l3137q9699l733N1172M6287J9981N985K1212
15658C1948J4461r730n1293o8905J3071J4382m621M5728n818N5145R615m9818
15646e835K6575l389l2533K7858M0265R440p500L745l0143L0410l3865o1424j9438
15633e5834K6273L6585L8514j8061l0225m699J446J8661l4953j5507L3266J8354
15621A3820K6729l3356j06517k0057M4016O8567M8047k6256p5412n129l8939m1096
15609a45583M0737Q0088j5517O725n5361M864L0400K6784L9638j515j8176q5041
15597i1957k666M210j047M7279M2167m8716r5076N245O433J2544M2932j7976j2593
$$ plain form
15584 -109221 -101021 -93756 -50096 10185 59798 106661 150215 112272 29017 1577 -10819 58580
15572 58580 45515 -42086 -67122 -97731 -80918 -51829 -44993 -15111 10827 -5048 -682 2293
15560 2293 39664 62349 -8003 -86682 -119009 -177326 -187326 -178065 -147438 -82481 -45826 -45296
15548 -45296 -6369 -33211 -55894 -26603 -12670 -67360 -98261 -92241 -68504 -29071 24832 17180
15536 17180 17300 6235 -17346 -58952 -95217 -76714 -114121 -99007 -61631 -62689 -74880 -84272
15524 -84272 -101657 -88040 -58826 -61536 -59979 -57786 -43085 33199 47332 5879 18903 47826
15512 47826 64077 54445 50430 -4524 -37918 -76119 -42935 -17568 22427 -5596 -20666 17424
15500 17424 47688 27325 13853 -7463 5005 -24994 -73709 -32693 -18631 6619 -8354 15323
$$ packed form
15584a09221Q200P265M3660O0281M9613M6863M3554l7943q3255k7440j2396O9399
15572E8580j3065q7601k5036l0609J6813K9089O836K9882K5938j5875M366K975
15560B293L7371K2685p0352p8679l2327n8317j0000R261L0627O4957L6655N30
15548d5296L8927k6842k2683K9291J3933n4690l0901O020K3737L9433N3903p652
15536A7180J20j1065k3581m1606l6265J8503l7407J5114L7376j058j2191r392
15524h4272j7385J3617K9214k710J557K193J4701P6284J4133m1453J3024K8923
15512D7826J6251r632m015n4954l3394l8201L3184K5367L9995k8023j5070L8090
15500A7424L0264k0363j3472k1316J2468k9999m8715M1016J4062K5250j4973K3677
$$ plain form
15488 15323 7896 -26507 -15961 -53529 8778 29553 31240 882 -65090 -137441 -109735 -80736
15476 -80736 -85492 -77134 -89236 -44451 -41493 -23081 50776 8244 -27170 39556 79929 50265
15464 50265 -13619 -63849 -78425 -76630 -40621 -81770 -90414 -116496 -104603 -59666 -61404 -31762
15452 -31762 33643 45657 13879 -20651 -33093 -53282 -71608 -69198 -52257 -23863 26509 33769
15440 33769 97256 63210 36807 -5107 -30795 -11425 -13147 -102102 -170079 -120409 -31598 17984
15428 17984 -22647 -22566 -38127 -50962 -25606 13259 -7882 38653 69643 49402 -38272 6664
15416 6664 36094 21954 -25011 6083 21958 16042 -39165 -11132 -26000 -68174 -65591 -54068
15404 -54068 -73395 -95551 -68591 -5464 47981 397 -36366 15138 41644 46482 -25749 -65226
$$ packed form
15488A5323p427l4403J0546l7568O2307K0775J687l0358o5972p2351K7706K8999
15476h0736m756Q358j2102M4785K958J8412P3857m2532l5414O6726M0373k9664
15464E0265o3884n0230j4576J795L6009m1149q644k6082J1893M4937j738K9642
15452c1762O5405J2014l1778l4530j2442k0189j8326K410J6941K8394N0372P260
15440C3769O3487l4046k6403m1914k5688J9370j722q8955o7977M9670Q8811M9582
15428A7984m0631Q1j5561j2835K5356L8865k1141M6535L0990k0241q7674M4936
15416F664K9430j4140m6965L1094J5875n916n5207K8033j4868m2174K583J1523
15404e4068j9327k2156K6960O3127N3445m7584l6763N1504K6506M838p2231l9477
$$ plain form
15392 -65226 -75706 -130472 -129038 -122089 -120968 -119060 -77636 -34004 6787 16694 35235 7220 -15530
15379 -15530 -1012 32429 29312 -64902 -113123 -132857 -172000 -134733 -123337 -83572 -111296 -160762
15367 -160762 -129431 -94785 -112796 -103994 -70172 24413 33647 86846 53630 11416 -11055 -26360
15355 -26360 -60500 -40015 -68202 -75981 -48161 -36522 -61963 -32621 3823 -7641 -31901 -88015
15343 -88015 -81201 -32832 2863 10690 24483 -5900 -71019 -39971 8765 -51073 -55455 -691
15331 -691 13724 -24375 -58889 -78789 -69659 -66985 -48675 -54436 -61141 -71793 -41296 -64972 -44066
15318 -44066 -53724 -65826 -36412 11184 -41390 -103267 -68977 -26965 -12159 -4813 53145 66360
15306 66360 17373 23641 -19684 1861 62992 -26534 -86420 -40533 11084 6128 -16015 -8344
$$ packed form
15392f5226j0480n4766J434O949J121J908M1424M3632M0791R907J8541k8015k2750
15379a5530J4518L3441l117r4214m8221j9734l9143L7267J1396L9765k7724m9466
15367a60762L1331L4646j8011Q802L3822R4585R234N3199l3216m2214k2471j5305
15355b6360l4140K0485k8187p779K7820J1639k5441K9342L6444j1464k4260n6114
15343h8015O814M8369L5695P827J3793l0383o5119L1048M8736n9838m382N4764
15331f91J4415l8099l4514j9900R130K674J8310n761o705j0652L0497k3676K0906
15318d4066r658j2102K9414M7596n2574o1877L4290M2012J4806P346N7958J3215
15306F6360m8987O268m3325K1545O1131q9526n9886M5887N1617m956k2143P671
$$ plain form
15294 -8344 -15426 -60406 -70682 -39188 -18384 3644 -17996 -54668 -46479 -63485 -37729 8113
15282 8113 -19503 -57975 -31271 -10834 41571 40955 39983 33150 72348 61853 50040 50479 -9373
15269 -9373 -54948 -10705 -33906 -89248 -36150 3342 -1629 -20386 -24474 -28611 -86274 -105053
15257 -105053 -62219 -58203 -27639 -33184 -38453 -3821 49773 138026 114508 67522 85977 87916
15245 87916 110842 78762 45458 -1033 -61010 -46597 17832 58901 57776 43937 41660 16070
15233 16070 20082 11891 -42256 -78735 -39681 -11752 21670 65361 81351 52402 -5241 7412
15221 7412 17463 -7674 -7618 -1286 25721 -38218 21235 59260 17304 -4459 -34926 9753 -2777
15208 -2777 -38410 7692 49083 22754 -35302 -11266 -55820 -116568 -99169 -100183 -76041 -71175
$$ packed form
15294h344p082m4980j0276L1494K0804K2028k1640l6672Q189j7006K5756M5842
15282H113k7616l8472K6704K0437N2405o16r72o833L9198j0495j1813M39n9852
15269i373m5575M4243k3201n5342N3098L9492m971j8757m088m137n7663j8779
15257a05053M2834M016L0564n545n269L4632N3594Q8253k3518m6986J8455J939
15245H7916K2926l2080l3304m6491n9977J4413O4429M1069j125j3839k277k5590
15233A6070M012q191n4147l6479L9054K7929L3422M3691J5990k8949n7643J2653
15221G412J0051k5137N6O332K7007o3939N9453L8025m1956k1763l0467M4679j2530
15208b777l5633M6102M1391k6329n8056K4036m4554o0748J7399j014K4142M866
$$ plain form
15196 -71175 -153333 -137414 -82524 -91077 -64098 7580 41963 20575 -13687 -8836 -11815 16635
15184 16635 18634 15951 11437 -12037 -29913 -33828 14686 51687 13505 -16738 -21909 14185 -26299
15171 -26299 -116532 -132122 -108495 -79722 -92497 -91604 -82252 -33429 37345 56767 86074 52935
15159 52935 6612 3983 16248 3249 -1530 -4813 -3650 7650 16894 -14771 -38037 -47244 -70414
15146 -70414 -56556 -25439 -11419 2795 -36149 -61659 -89387 -55079 -29256 9410 51059 33859
15134 33859 54967 94494 159591 115325 87950 18232 8756 24832 -6375 -31703 25424 68379
15122 68379 76536 45086 41246 21328 34312 96827 163264 120549 50695 95481 96148 76034
15110 76034 98859 74805 110572 170863 218899 211178 252602 219789 169102 114634 86752 88506
$$ packed form
15196g1175q2158J5919N4890q553K6979P1678L4383k1388l4262M851k979K8450
15184A6635J999k683m514k3474j7876l915M8514L7001l8182l0243n171L6094m0484
15171b6299r0233j5590K3627K8773j2775Q93R352M8823P0774J9422K9307l3139
15159E2935m6323k629J2265j2999m779l283J163J1300R244l1665k3266r207k3170
15146g0414J3858L1117J4020J4214l8944k5510k7728L4308K5823L8666M1649j7200
15134C3859K1108L9527O5097m4266k7375o9718r476J6076l1207k5328N7127M2955
15122F8379Q157l1450l840j9918J2984O2515O6437m2715o9854M4786O67k0114
15110G6034K2825k4054L5767O0291M8036p721M1424l2813n0687n4468k7882J754
$$ plain form
15098 88506 117979 115807 56310 16564 22054 25113 3100 19247 78746 116254 81053 19998
15086 19998 39492 47857 -8360 4468 -24615 -7637 2677 -39347 -73229 -77963 -87736 -101340
15074 -101340 -69452 -39407 -17411 -71685 -68355 -15896 852 -60922 -66272 -63145 -57914 -15796
15062 -15796 -48496 -38470 -56094 -98432 -110293 -33114 34488 -9937 -61632 -23743 6865 4992
15050 4992 24944 61101 68542 72714 43000 7395 -50398 -57827 391 77111 92601 65699
15038 65699 64860 94876 96865 82194 84040 59939 24390 28439 14619 31743 67319 85742 38089
15025 38089 30932 26449 -6826 -10902 30385 67843 27467 2459 -412 -25745 5032 45797
15013 45797 28167 13355 52773 101108 109414 135572 119166 115199 154095 147269 173095 207678
$$ packed form
15098H8506K9473k172n9497l9746N490L059k2013J6147N9499L7508l5201o1055
15086A9998J9494Q365n6217J2828k9083J6978J0314m2024l3882m734r773j3604
15074a01340L1888L0045K1996n4274L330N2459J6748o1774n350L127N231M2118
15062a5796l2700J0026j7624m2338j1861P7179O7602m4425n1695L7889L0608j873
15050D992J9952L6157P441M172k9714l5605n7793p429N8218P6720J5490k6902
15038F5699q39L0016J989j4671J846k4101l5549M049j3820J7124L5576J8423m7653
15025C8089p157m483l3275m076M1287L7458m0376k5008k871k5333L0777M0765
15013D5797j7630j4812L9418M8335Q306K6158j6406l967L8896o826K5826L4583
$$ plain form
15001 207678 221671 178647 194338 274282 221866 136908 186312 254423 350537 429574 455389
14990 455389 479819 544701 570269 642304 713039 804331 940146 1021001 1089216 1258774 1407800
14979 1407800 1543357 1752084 1961053 2188641 2470712 2749760 3043532 3391733 3717935
14970 3717935 4113405 4533919 4887109 5099782 5224692 5371692 5569565 5787254 5973192
14961 5973192 6067331 6085477 6093494 6051761 5919052 5689410 5360270 4955217 4551958 4115688
14951 4115688 3696379 3331587 3084559 2943577 2855674 2740037 2541738 2427848 2397234 2274745
14941 2274745 2143442 2083649 2021159 1900557 1810911 1724475 1698301 1625930 1574035 1531281 1467692
14930 1467692 1413018 1414022 1355574 1289117 1265561 1199700 1158863 1098339 1103024 1039903 985435 926948
$$ packed form
15001B07678J3993m3024J5691P9944n2416q4958M9404O8111R6114P9037K5815
14990D55389K4430O4882K5568P2035P0735R1292J35815Q0855O8215J69558J49026
14979A407800J35557K08727K08969K27588K82071K79048K93772L48201L26202
14970C717935L95470M20514L53190K12673J24910J47000J97873K17689J85938
14961E973192R4139J8146Q017m1733j32709k29642l29140m05053m03259m36270
14951D115688m19309l64792k47028j40982q7903j15637j98299j13890l0614j22489
14941B274745j31303n9793o2490j20602q9646q6436k6174p2371n1895m2754o3589
14930A467692n4674J004n8448o6457k3556o5861m0837o0524M685o3121n4468n8487
$$ plain form
14918 926948 915886 929591 902735 897586 851292 760623 733313 790274 794002 746367 720328 767427
14906 767427 775620 713361 667763 721392 671794 659359 663141 697421 678545 675158 669385 714430
14894 714430 664366 606247 565730 570872 604105 627084 567002 505359 540208 614830 650608 646403
14882 646403 655663 629333 622179 639364 597330 524240 502516 541752 577850 595575 623742 665683
14870 665683 690082 685380 684250 661923 641492 646803 621623 642655 709349 641692 582902 578340
14858 578340 630232 627362 637223 629779 629704 595240 509319 497093 547615 543075 495148 478622 504087
14845 504087 508452 494660 511270 512305 460979 387659 394601 408438 398035 381536 374822 389608
14833 389608 341752 295644 313350 317355 340959 344218 300631 272511 251770 226409 235144 228135
$$ packed form
14918I26948j1062J3705k6856n149m6294r0669k7310N6961L728m7635k6039M7099
14906G67427Q193o2259m5598N3629m9598j2435L782L4280j8876l387n773M5045
14894G14430n0064n8119m0517N142L3233K2979o0082o1643L4849P4622L5778m205
14882F46403R260k6330p154J7185m2034p3090k1724L9236L6098J7725K8167M1941
14870F65683K4399m702j130k2327k0431N311k5180K1032O6694o7657n8790m562
14858E78340N1892k870R861p444p5l4464q5921j2226N0522m540m7927j6526K5465
14845E04087M365j3792J6610J035n1326p3320O942J3837j0403j6499o714J4786
14833C89608m7856m6108J7706M005K3604L259m3587k8120k0741k5361Q735p009
$$ plain form
14821 228135 256592 237885 243826 292804 279182 237685 195076 187535 199138 251122 234360 291250
14809 291250 284797 215021 229687 256097 235536 223483 126728 123227 134972 137103 173403 188125
14797 188125 156235 142008 170640 187490 193464 156856 117649 82623 144661 174508 124464 75292
14785 75292 101623 130617 123242 181404 172300 174079 189070 179435 160722 182759 128863 144430
14773 144430 165951 143226 128004 87169 98750 153908 98073 37662 13145 43631 112280
14762 112280 130665 83826 100629 71362 15828 5467 53334 69828 103600 118521 104888
14751 104888 86192 58749 81545 78114 107380 127083 97239 56505 6188 1344 -18974 -20633
14739 -20633 39927 51043 26585 -6730 6246 11073 -34288 -21848 4487 41970 67842 74100
$$ packed form
14821B28135K8457j8707N941M8978j3622m1497m2609p541J1603N1984j6762N6890
14809B91250o453o9776J4666K6410k0561j2053r6755l501J1745K131L6300J4722
14797A88125l1890j4227K8632J6850N974l6608l9207l5026O2038K9847n0044m9172
14785G5292K6331K8994p375N8162r104J779J4991r635j8713K2037n3896J5567
14773A44430K1521k2725j5222m0835J1581N5158n5835o0411k4517L0486O8649
14762A12280J8385m6839J6803k9267n5534j0361M7867J6494L3772J4921j3633
14751A04888j8696k7443K2796l431K9266J9703k9844m0734n0317m844k0318j659
14739b0633O0560J1116k4458l3315J2976M827m5361J2440K6335L7483K5872O258
$$ plain form
14727 74100 73185 17136 16363 -25699 4358 57520 87570 93917 140721 159057 98994 -2595
14715 -2595 16414 12981 -21530 -50383 -51899 3331 -12766 1483 22761 -29261 -86601 -75824
14703 -75824 -77186 -47639 -62453 -26084 -1854 -33257 -13969 -46758 -54403 -5049 64715 27302
14691 27302 39154 39520 -228 -3379 -10145 -40256 -25763 -32524 -27232 -13444 -32760 -29060 -31190
14678 -31190 -19162 -31197 -34151 -21940 -29780 -47580 -14844 -22472 5638 -7125 -49943 -66721
14666 -66721 -62598 -48451 -27951 -8948 48090 49300 19423 -31141 -32791 13733 3512 34490
14654 34490 28751 15694 21173 52441 27693 48485 17956 8667 11000 -2133 12627 -997
14642 -997 -9157 -1047 51180 28155 -5073 -23073 1645 -921 14389 -16306 -278 -10427 6877
$$ packed form
14727G4100r15n6049p73m2062L0057N3162L0050O347M6804J8336o0063j01589
14715b595J9009l433l4511k8853j516N5230j6097J4249K1278n2022n7340J0777
14703g5824j362K9547j4814L6369K4230l1403J9288l2789p645M9354O9764l7413
14691B7302J1852L66l9748l151o766l0111J4493o761N292J3788j9316L700k130
14678c1190J2028j2035k954J2211p840j7800L2736p628K8110j2763m2818j6778
14666f6721M123J4147K0500J9003N7038J210k9877n0564j650M6524j0221L0978
14654C4490n739j3057N479L1268k4748K0792l0529r289K333j3133J4760j3624
14642i97q160Q110N2227k3025l3228j8000K4718k566J5310l0695J6028j0149J7304
$$ plain form
14629 6877 1597 14904 15150 -14820 1062 13027 6628 -20604 -15436 -2294 -32933 -5574 -15891
14616 -15891 -22983 -17689 -45698 -16924 7438 -13010 -55517 -37771 27052 10841 9635 93995
14604 93995 112795 104114 87399 100480 74593 18815 41560 31809 -20199 -103672 -109431 -60886
14592 -60886 -52699 -43527 -4299 -610 -49377 -27039 -19161 21075 13323 -31313 -23322 -34205 -90561
14579 -90561 -29955 -1292 -7367 -5341 -27741 2671 -61844 -147420 -112801 -19822 19723 1820
14567 1820 -7823 -50297 -81929 -121561 -83989 -61665 -103559 -114511 -127277 -66211 1342 -29846
14555 -29846 -64888 -83604 -99157 -74921 -105014 -71430 -102145 -121832 -131209 -109833 -51675 -55876
14543 -55876 -93560 -63158 -27633 -12326 -19747 -49662 -71358 -42153 -32151 -47448 -21512 -5971
$$ packed form
14629F877n280J3307K46k9970J5882J1965o399k7232N168J3142l0639K7359j0317
14616a5891p092N294k8009K8774K4362k0448m2507J7746O4823j6211j206Q4360
14604I3995J8800q681j6715J3081k5887n5778K2745r751n2008q3473n759M8545
14592f0886Q187R172L9228L689m8767K2338P878M0236p752m4636P991j0883n6356
14579i0561O0606K8663o075K026k2400L0412o4515q5576L4619R2979L9545j7903
14567A820r643m2474l1632l9632L7572K2324m1894j0952j2766O1066O7553l1188
14555b9846l5042j8716j5553K4236l0093L3584l0715j9687r377K1376N8158m201
14543e5876l7684L0402L5525J5307p421k9915k1696K9205J0002j5297K5936J5541
$$ plain form
14531 -5971 6851 27098 67299 117240 116838 59655 9191 -19144 -25335 4407 58189 52026 -7114
14518 -7114 1604 39925 -5219 -28833 -47771 -74360 -60231 -15109 5449 24474 -38268 -30142
14506 -30142 -32800 -62446 -26331 35751 21813 -48709 -27524 19785 37783 43911 63483 1677
14494 1677 -17950 48127 66982 25824 37086 -1166 205 -26958 -51111 -57016 -77713 -69867
14482 -69867 -18815 47119 16514 -37145 -60056 -22917 -3535 35666 18456 -10522 -14625 -32326
14470 -32326 1802 45734 86856 47604 23741 -1171 -58600 -96181 -121095 -100022 -101449 -86772
14458 -86772 -48878 -27154 -21280 -53367 -11208 10204 18706 -22292 -60652 -14588 6315 49726
14446 49726 102496 75303 67892 114501 79949 48270 10153 36259 30308 53450 40569 -13013
$$ packed form
14531e971J2822K0247M0201M9941m02n7183n0464k8335o191K9742N3782o163n9140
14518g114Q718L8321m5144k3614j8938k6589J4129M5122K0558J9025o2742Q126
14506c0142k658k9646L6115O2082j3938p0522K1185M7309J7998O128J9572o1806
14494A677j9627O6077J8855m1158J1262l8252J371k7163k4153n905k0697P846
14482f9867N1052O5934l0605n3659k2911L7139J9382L9201j7210k8978m103j7701
14470c2326L4128M3932M1122l9252k3863k4912n7429l7581k4914K1073j427J4677
14458h6772L7894K1724N874l2087M2159K1412Q502m0998l8360M6064K0903M3411
14446D9726N2770k7193p411M6609l4552l1679l8117K6106n951K3142j2881n3582
$$ plain form
14434 -13013 -68709 -72561 -76768 -76233 -7189 11889 -8270 -22693 322 45338 30372 -21133
14422 -21133 -63920 -48153 -29859 1779 16874 -9183 -48137 -52662 -62021 -62092 -66577 -85379 -87945
14409 -87945 -56290 -55129 -62987 -14973 12962 -1579 68540 63645 41149 98230 137818 123539
14397 123539 104525 104653 95690 28916 13153 69167 117569 165378 133783 85170 42928 -32942
14385 -32942 17986 90601 88155 94606 128014 109556 96077 54768 -48274 -65612 -12511 -10364
14373 -10364 -28946 13993 44786 36843 28773 30174 55761 48443 26679 -37293 4472 75095
14361 75095 61748 -1451 -31617 -63718 -49047 -25743 -39149 5156 85292 87653 11868 14594
14349 14594 98449 86231 69280 65037 97588 92849 26467 -10982 10701 24244 44593 86306
$$ packed form
14434a3013n5696l852m207N35O9044J9078k0159j4423K3015M5016j4966n1505
14422b1133m2787J5767J8294L1638J5095k6057l8954m525r359p1m485j8802k566
14409h7945L1655J161p858M8014K7935j4541P0119m895k2496N7081L9588j4279
14397A23539j9014J28q963o6774j5763N6014M8402M7809l1595m8613m2242p5870
14385c2942N0928P2615k446O451L3408j8458j3479m1309j03042j7338N3101K147
14373a0364j8582M2939L0793p943q070J401K5587p318k1764o3972M1765P0623
14361G5095j3347o3199l0166l2101J4671K3304j3406M4305Q0136K361p5785K726
14349A4594Q3855j2218j6951m243L2551m739o6382l7449K1683J3543K0349M1713
$$ plain form
14337 86306 65498 79575 19602 -4709 -12483 -53414 -64787 -21481 -18719 -8005 27434 15194
14325 15194 -20300 -37935 -80763 -92475 -93021 -68657 -3970 16278 -15796 -35320 -31016 -42910
14313 -42910 -59219 2341 12324 2906 -1943 -13536 5274 49996 41286 -36005 -130366 -111027
14301 -111027 -62870 -54632 -16121 5635 -44442 -18426 31566 -10435 -411 52837 46681 3759
14289 3759 21345 52942 41897 17501 46557 76748 20480 -36915 -53426 -27925 -42119 -52121
14277 -52121 -36443 8217 20115 17022 -11442 18902 54086 69035 85760 87470 56037 22489
14265 22489 2993 -16751 -15003 -7928 14991 51751 61812 66714 67639 55123 28711 -14347 8322
14252 8322 -27052 -52488 -41964 -39898 -34929 14204 29103 30034 -6164 -46437 -39154 -44240 -7725
$$ packed form
14337H6306k0808J4077n9973k4311p774m0931j1373M3306K762J0714L5439j2240
14325A5194l5494j7635m2828j1712n46K4364O4687K0248l2074j9524M304j1894
14313d2910j6309O1560R983r418m849j1593J8810M4722q710p7291r4361J9339
14301a11027M8157Q238L8511K1756n0077K6016M9992m2001J0024N3248o156m2922
14289C759J7586L1597j1045k4396K9056L0191n6268n7395j6511K5501j4194j0002
14277e2121J5678M4660J1898l093k8464L0344L5184J4949J6725J710l1433l3548
14265B2489j9496j9744J748P075K2919L6760J0061M902R25j2516k6412m3058K2669
14252H322l5374k5436J0524K066M969M9133J4899R31l6198m0273P283n086L6515
$$ plain form
14239 -7725 -16093 -65906 -52186 -64768 -51168 -18136 34598 40876 65322 10797 48364 118611
14227 118611 135470 121353 98316 73040 14554 16982 -13703 -51366 -74747 -56828 -53159 -67125
14215 -67125 -32529 -39642 -20780 -14232 -61501 -69087 -1235 -19407 -25158 -25956 13683 25023 12181
14202 12181 15260 -966 -19750 16258 10744 10279 2227 -12211 -17242 -6633 -26355 -26514 6643
14189 6643 56706 73971 41904 26210 36124 35928 -4541 -2654 121694 144263 58451 -16581
14177 -16581 -30927 -19140 -10280 14520 43457 9833 28769 46460 96314 123763 55806 64555
14165 64555 56070 107777 106707 81085 52938 62228 33270 42666 39847 4976 11087 33128 8905
14152 8905 3544 65548 91347 37675 -13843 -13734 -18366 -52490 -61648 -37721 9053 49812 79158
$$ packed form
14239g725q368m9813J3720j2582J3600L3032N2734O278K4446n4525L7567P0247
14227A18611J6859j4117k3037k5276n8486K428l0685l7663k3381J7919L669j3966
14215f7125L4596p113J8862O548m7269p586O7852j8172n751p98L9639J1340j2842
14202A2181L079j6226j8784L6008n514m65q052j4438n031J0609j9722j59L3157
14189F643N0063J7265l2067j5694R914j96m0469J887J24348K2569q5812p5032
14177a6581j4346J1787Q860K4800K8937l3624J8936J7691M9854K7449o7957Q749
14165F4555q485N1707j070k5622k8147R290k8958R396k819l4871O111K2041k4223
14152H905n361O2004K5799n3672n1518J09m632l4124r158K3927M6774M0759K9346
$$ plain form
14139 79158 41746 -12601 -5371 -9913 -7414 -32056 24386 -486 -9017 36220 23341 -37476
14127 -37476 -37312 37415 2144 -6389 56963 96876 63138 18332 51254 73742 108367 82136
14115 82136 86844 72239 21499 -37798 -1405 70142 42555 13645 4745 31607 4945 1683
14103 1683 39687 72222 116301 106128 78697 54664 5587 8412 -28516 -5200 -31426 -67109
14091 -67109 -14881 12901 14105 -20537 6981 16024 -14373 13036 70598 69377 35323 -11248
14079 -11248 -24723 622 25872 43585 66487 27365 23531 56424 29667 30945 -14594 -33503
14067 -33503 -9527 55067 98669 52987 77252 60276 -1556 60990 105785 123356 78651 15042
14055 15042 12164 68128 67406 43831 61475 123526 118601 91053 63479 35332 -18730 -65808
$$ packed form
14139G9158l7412n4347P230m542K499k4642N6442k4872q531M5237j2879o0817
14127c7476J64P4727l5271q533O3352L9913l3738m4806L2922K2488L4625k6231
14115H2136M708j4605n0740n9297L6393P1547k7587k8910q900K6862k6662l262
14103A683L8004L2535M4079j0173k7431k4033m9077K825l6928K3316k6226l5683
14091f7109N2228K7782J204l4642K7518R043l0397K7409N7562j221l4054m6571
14079a1248j3475K5345K5250J7713K2902l9122l834L2893k6757J278m5539j8909
14067c3503K3976O4594M3602m5682K4265j6976o1832O2546M4795J7571m4705o3609
14055A5042k878N5964p22k3575J7644O2051m925k7548k7574k8147n4062m7078
$$ plain form
14043 -65808 -7956 18074 28048 66383 68150 75075 26246 31722 40614 31717 17431 37627 51953
14030 51953 25153 3482 14772 53666 95849 137336 157560 140289 117553 84120 76414 74280
14018 74280 67154 55473 53917 100405 60364 48290 72002 96053 85886 98044 53958 77598
14006 77598 87537 94735 109195 214087 218683 225917 228408 197316 157110 136041 115882 151824
13994 151824 134893 159438 148569 164504 201718 231519 237773 215059 213287 291609 316113 195937
13982 195937 126383 127477 160718 90805 80770 73027 32306 23405 61525 115583 127067 122991
13970 122991 148066 165248 165030 133406 187915 178632 112001 121649 129795 126913 85262 68912 89180
13957 89180 70044 91641 144509 135046 100362 76592 95430 120905 72408 31384 26530 8644
$$ packed form
14043f5808N7852K6030R974L8335J767O925m8829N476Q892q897j4286K0196J4326
14030E1953k6800k1671J1290L8894M2183M1487K0224j7271k2736l3433p706k134
14018G4280p126j1681j556M6488m0041j2074K3712K4051j0167J2158m4086K3640
14006G7598R939P198J4460J04892M596P234K491l1092m0206k1069k0159L5942
13994A51824j6931K4545j0869J5935L7214K9801O254k2714j772P8322K4504j20176
13982A95937o9554J094L3241o9913j0035p743m0721q901L8120N4058J1484m076
13970A22991K5075J7182k18l1624N4509r283o6631R648Q146k882m1651j6350K0268
13957H9180j9136K1597N2868r463l4684k3770J8838K5475m8497m1024m854j7886
$$ plain form
13945 8644 1395 29234 83403 90107 112933 95615 119517 100744 106305 91148 16764 44134
13933 44134 99588 78959 37354 34145 51224 27289 51601 77227 127247 96760 63935 91945
13921 91945 97435 100403 114401 168194 201561 152300 112100 144894 125050 120964 131968 122202
13909 122202 117281 133009 186481 173417 209883 234854 234654 209365 223142 218428 220492 247184
13897 247184 214711 219266 229787 199913 236826 267620 256349 306814 362309 363293 399883 412893
13885 412893 316975 309608 395874 428546 438301 443185 448989 533007 574014 647862 737177 774914
13873 774914 761626 779596 825866 850746 829317 795871 834673 841008 792867 777433 762897 782897
13861 782897 760565 681490 599232 543235 524928 508505 515818 441746 367166 375238 415402 428549
$$ packed form
13945H644p249K7839N4169O704K2826j7318K3902j8773N561j5157p4384K7370
13933D4134N5454k0629m1605l209J7079k3935K4312K5626N0020l0487l2825K8010
13921I1945N490K968J3998N3793L3367m9261m0200L2794j9844m086J1004r766
13909A22202m921J5728N3472j3064L6466K4971k00k5289J3777m714K064K6692
13897B47184l2473M555J0521k9874L6913L0794j1271N0465N5495R84L6590J3010
13885D12893r5918p367Q6266L2672R755M884N804Q4018M1007P3848Q9315L7737
13873G74914j3288J7970M6270K4880k1429l3446L8802O335m8141j5434j4536K0000
13861G82897k2332p9075q2258n5997j8307j6423P313p4072p4580Q072M0164J3147
$$ plain form
13849 428549 411653 395564 347219 330870 339733 316465 306894 351229 349547 311742 285109 272405
13837 272405 282214 199634 197881 191864 170417 163594 175460 191133 177491 198977 196212 199205 231255
13824 231255 212281 219756 281583 277555 221378 157517 115460 144710 191488 240673 251145 244705
13812 244705 222592 163730 197699 259324 258390 217969 202233 156805 161482 186936 193198 167724
13800 167724 116452 120092 142730 183288 178888 203091 227938 244785 237579 211091 199264 181250
13788 181250 221145 180948 102632 77638 108121 123552 82722 100951 110152 114807 125944 159427
13776 159427 168061 160930 133197 84110 62827 63975 98616 152534 152929 141057 75283 85781
13764 85781 129340 123253 111170 78689 98102 175117 167443 151035 111205 49168 45015 46809
$$ packed form
13849D28549j6896j6089m8345j6349Q863k3268r571M4335j682l7805k6633j2704
13837B72405R809q2580j753o017k1447o823J1866J5673j3642K1486k765K993L2050
13824B31255j8974P475O1827m028n6177o3861m2057K9250M6778M9185J0472o440
13812B44705k2113n8862L3969O1625r34m0421j5736m5428M677K5454O262k5474
13800A67724n1272L640K2638M0558m400K4203K4847J6847p206k6488j1827j8014
13788A81250L9895m0197p8316k4994L0483J5431m0830J8229R201M655J1137L3483
13776A59427Q634p131k7733m9087k1283J148L4641N3918L95j1872o5774J0498
13764H5781M3559o087j2083l2481J9413P7015p674j6408l9830o2037m153J794
$$ plain form
13752 46809 50403 72884 76346 84929 119962 92907 69242 84378 132754 183037 129538 144901
13740 144901 185756 167178 138285 125776 102098 61032 42633 65590 72150 131961 163915 178321
13728 178321 152116 145456 206725 202139 152996 123766 165410 161228 157074 128934 120807 79901
13716 79901 111370 137253 119438 172490 176054 171193 187304 164240 105215 68832 28045 77667
13704 77667 83198 87574 177306 219911 217368 189737 180840 156025 160044 151053 140706 88387 56138
13691 56138 55215 66303 101929 180292 169884 128093 125508 102031 72333 59074 57776 72483
13679 72483 52696 46681 -5163 2915 72899 85640 85870 45523 13348 -10066 34595 11698
13667 11698 38766 141636 161906 141531 143017 144868 139830 154188 128300 61985 82428 119126
$$ packed form
13752D6809L594K2481L462Q583L5033k7055k3665J5136M8376N0283n3499J5363
13740A44901M0855j8578k8893j2509k3678m1066j8399K2957O560N9811L1954J4406
13728A78321k6205o660O1269m586m9143k9230M1644m182m154k8140q127m0906
13716G9901L1469K5883j7815N3052L564m861J6111k3064n9025l6383m0787M9622
13704G7667N531M376Q9732M2605k543k7631q897k4815M019q991j0347n2319l2249
13691E6138r23J1088L5626P8363j0408m1791k585k3477k9698j3259j298J4707
13679G2483j9787o015n1844Q078O9984J2741K30m0347l2175k3414M4661k2897
13667A1698K7068J02870K0270k0375J486J851n038J4358k5888o6315K0443L6698
$$ plain form
13655 119126 113336 85345 136126 157633 145848 116142 88153 89231 51185 90512 55943 38847
13643 38847 49266 82041 133335 185666 184943 159281 173834 147539 149155 126164 146472 118948
13631 118948 94245 75612 107382 116455 114003 121164 120804 133358 145801 122019 102984 100873 140952
13618 140952 142802 121898 130702 172118 148590 133176 141320 142410 131971 147273 194124 205407
13606 205407 179044 156786 133044 146271 126468 88773 37480 53540 94592 129272 90262
13595 90262 53339 31143 27504 66221 127103 122666 99431 169888 227384 268598 254974 168995
13583 168995 153705 169636 175392 177282 155108 140765 100897 63978 66453 67917 78414 128581
13571 128581 197265 200525 170315 157873 155180 157607 195208 212715 175515 234039 328480 347804
$$ packed form
13655A19126n790k7991N0781K1507j1785k9706k7989J078l8046L9327l4569j7096
13643C8847J0419L2775N1294N2331p23k5662J4553k6295J616k2991K0308k7524
13631A18948k4703j8633L1770R073k452P161l60J2554J2443k3782j9035k111M0079
13618A40952J850k0904Q804M1416k3528j5414Q144J090j0439J5302M6851J1283
13606B05407k6363k2258k3742J3227j9803l7695n1293J6060M1052L4680l9010
13595I0262l6923k2196l639L8717O0882m437k3235P0457N7496M1214j3624q5979
13583A68995j5290J5931N756J890k2174j4343l9868l6919K475J464J0497N0167
13571A28581O8684L260l0210j2442k693K427L7601J7507l7200N8524R4441J9324
$$ plain form
13559 347804 379041 373218 370982 370059 344119 359608 325783 335915 333576 299293 345634 362348
13547 362348 361105 361040 348033 325659 370363 376811 318553 280077 288273 369372 404346 400839 386624
13534 386624 372135 380534 336570 338126 325033 345332 367560 344989 358196 334948 285753 251496
13522 251496 269486 299597 303994 254599 226964 199756 173139 249317 334800 323562 289039 295236
13510 295236 365575 399867 401713 449939 472309 393683 306928 252138 286294 337735 262591 197666
13498 197666 231736 219519 216885 262353 242881 221021 194642 238302 247413 236389 148447 165003
13486 165003 194770 178002 170633 151347 140304 138478 115373 107636 131872 173733 192584 173269
13474 173269 164692 205487 231132 208414 216955 195644 197482 220154 237721 229733 209855 205324
$$ packed form
13559C47804L1237n823k236r23k5940J5489l3825J0132k339l4283M6341J6714
13547C62348j243o5j3007k2374M4704O448n8258l8476Q196Q1099L4974l507j4215
13534C86624j4489Q399m3964J556j3093K0299K2228k2571J3207k3248m9195l4257
13522B51496J7990L0111M397m9395k7635k7208k6617P6178Q5483j1238l4523O197
13510B95236P0339L4292J846M8226K2370p8626q6755n4790L4156N1441p5144o4925
13498A97666L4070j2217k634M5468j9472k1860k6379M3660R111j1024q7942J6556
13486A65003K9767j6768p369j9286j1043j826k3105p737K4236M1861J8851j9315
13474A73269q577M0795K5645k2718Q541k1311J838K2672J7567p988j9878m531
$$ plain form
13462 205324 211590 210841 222180 212772 208609 162144 171499 258830 334370 302374 267334 277685 278454
13449 278454 293738 278991 288786 334991 317876 290090 313167 264691 278527 316209 292048 314154
13437 314154 369673 354080 309664 266511 272991 282891 305607 292482 304488 306780 290832 339425
13425 339425 316639 304175 254175 251911 264172 269874 254077 242666 185613 219859 251220 293398
13413 293398 325036 356452 316987 240128 228576 222597 257537 186634 159632 219407 217004 245362
13401 245362 247039 197070 153112 185297 190903 131478 157126 232609 293289 328125 276445 233985
13389 233985 218739 214865 253539 280979 262574 273968 251717 248316 255985 265371 291436 311347
13377 311347 351036 367348 308396 330318 371594 371335 347937 340926 350101 357387 359866 361674 371228
$$ packed form
13462B05324O266p49J1339r408m163m6465R355Q7331P5540l1996l5040J0351P69
13449B78454J5284j4747R795M6205j7115k7786K3077m8476J3836L7682k4161K2106
13437C14154N5519j5593m4416m3153O480R900K2716j3125J2006K292j5948M8593
13425C39425k2786j2464n0000k264J2261N702j5797j1411n7053L4246L1361M2178
13413B93398L1638L1416l9465p6859j1552n979L4940p0903k7002N9775k403K8358
13401B45362J677m9969m3958L2185N606n9425K5648P5483O0680L4836n1680m2460
13389B33985j5246l874L8674K7440j8405J1394k2251l401P669R386K6065J9911
13377C11347L9689J6312n8952K1922M1276k59k3398p011R175P286K479J808R554
$$ plain form
13364 371228 387157 423755 403980 458390 442132 377354 353950 342788 359547 358231 373600 332592
13352 332592 295056 280714 282100 292733 289614 319877 356896 416929 368361 343349 371405 379188
13340 379188 331301 306893 353101 395756 371873 399292 457839 454153 413334 416669 445874 487837
13328 487837 494203 436872 405709 452355 508829 500623 470405 469448 516514 570168 573620 592840
13316 592840 589676 621841 654054 614320 557003 510224 525059 521778 522519 498056 545264 564782
13304 564782 530056 516336 567778 562046 556112 572342 563462 569188 568043 515070 500540 521009
13292 521009 563254 553129 541577 534598 614839 665587 694675 677804 624659 656681 713277 679798
13280 679798 650179 668011 635094 700254 750838 739665 720128 737828 748945 747566 746254 724323
$$ packed form
13364C71228J5929L6598j9775N4410j6258o4778k3404j1162J6759j316J5369m1008
13352C32592l7536j4342J386J0633l119L0263L7019O0033m8568k5012K8056P783
13340C79188m7887k4408M6208M2655k3883K7419N8547l686m0819L335K9205M1963
13328D87837O366n7331l1163M6646N6474q206l0218r57M7066N3654L452J9220
13316E92840l164L2165L2213l9734n7317m6779J4835l281P41k4463M7208J9518
13304E64782l4726j3720N1442n732n934J6230q880N726j145n2973j4530K0469
13292E21009M2245j0125j1552o979Q0241N0748K9088j6871n3145L2022N6596l3479
13280F79798k9619J7832l2917O5160N0584j1173j9537J7700J1117j379j312k1931
$$ plain form
13268 724323 727642 783479 815068 814163 798712 786664 769285 723495 743617 768844 787121 837970
13256 837970 820410 786510 792082 817421 906148 934738 925995 891062 894492 906515 903407 927312
13244 927312 955688 980742 931338 934665 966838 960097 980911 959772 921540 919595 901835 932922
13232 932922 940714 978420 981318 966242 882442 928444 976022 998814 996981 876581 839448 893501
13220 893501 936097 918860 954978 1068457 1100141 1090259 1033119 1067447 1095292 1119183 1165809
13209 1165809 1201831 1224680 1283655 1308993 1342120 1379039 1403274 1401346 1407668 1470207 1534117 1576784
13197 1576784 1611246 1613059 1661367 1690774 1746085 1764936 1775101 1765821 1744290 1758964 1808983 1807453
13185 1807453 1809237 1826675 1852795 1829491 1783857 1717916 1688464 1719158 1722953 1666245 1628041 1619165
$$ packed form
13268G24323L319N5837L1589r05j5451j2048j7379m5790K0122K5227J8277N0849
13256H37970j7560l3900N572K5339Q8727K8590q743l4933L430J2023l108K3905
13244I27312K8376K5054m9404L327L2173o741K0814k1139l8232j945j7760L1087
13232I32922P792L7706K898j5076q3800M6002M7578K2792j833j20400l7133N4053
13220H93501M2596j7237L6118J13479L1684r882n7140L4328K7845K3891M6626
13209A165809L6022K2849N8975K5338L3127L6919K4235j928O322O2539O3910M2667
13197A576784L4462J813M8308K9407N5311J8851J0165r280k1531J4674N0019j530
13185A807453J784J7438K6120k3304m5634o5941k9452L0694L795n6708l8204q876
$$ plain form
13173 1619165 1545793 1528721 1543929 1486698 1460014 1421000 1373995 1383647 1396059 1338778 1255589
13162 1255589 1237967 1226632 1186368 1137403 1130288 1143405 1128847 1109004 1114530 1123197 1090234 1072158
13150 1072158 1089878 1046136 1016783 1019469 988132 971170 954021 874229 828196 854790 915440
13139 915440 953662 946641 977242 976482 965459 972303 936315 917464 952202 1001571 1015078 1024272
13127 1024272 1000087 962755 947021 990826 1055863 1121587 1181591 1184669 1195736 1210808 1264768
13116 1264768 1289691 1321765 1341191 1326118 1332822 1427336 1516551 1578211 1629576 1717083 1778438
13105 1778438 1806702 1782403 1750736 1720309 1745142 1766941 1778930 1777848 1752615 1742029 1700755
13094 1700755 1650892 1647745 1666616 1647644 1641114 1658801 1617699 1573154 1560623 1550171 1524784 1517807
$$ packed form
13173A619165p3372j7072J5208n7231k6684l9014m7005R652J2412n7281q3189
13162A255589j7622j1335m0264m8965p115J3117j4558j9843N526Q667l2963j8076
13150A072158J7720m3742k9353K686l1337j6962j7149p9792m6033K6594O0650
13139I15440L8222p021L0601p60j1023O844l5988j8851L4738M9369J3507R194
13127A024272k4185l7332j5734M3805O5037O5724O0004L078J1067J5072N3960
13116A264768K4923L2074J9426j5073O704R4514Q9215O1660N1365Q7507O1355
13105A778438K8264k4299l1667l0427K4833K1799J1989j082k5233j0586m1274
13094A700755m9863l147J8871j8972o530J7687m1102m4545j2531j0452k5387o977
$$ plain form
13082 1517807 1531054 1500109 1386631 1384221 1377470 1286306 1247594 1226240 1163899 1067074 1099326
13071 1099326 1112318 1122896 1088128 1047853 1059909 1094584 1094204 1038063 1002410 1034184 987513 928859
13059 928859 948115 933869 936992 955703 931722 850975 853962 888996 876646 867795 846596 806927
13047 806927 778045 813282 825221 815852 818328 774398 799160 825103 787818 736338 667897 713349
13035 713349 763905 734762 711992 752583 776772 759632 699201 634464 583166 632739 723148
13024 723148 745713 688413 696470 725932 703957 655278 620234 664227 652198 653097 691872 643424
13012 643424 633943 654206 659920 692644 728393 761497 786012 753293 690706 698328 725365 689065
13000 689065 675240 668742 639602 712944 716805 665668 633293 684247 724191 774205 795572 753983
$$ packed form
13082A517807J3247l0945j13478k410o751r1164l8712k1354o2341r6825L2252
13071A099326J2992J0578l4768m0275J2056L4675l80n6141l5653L1774m6671n8654
13059I28859J9256j4246L123J8711k3981q0747K987L5034j2350q851k1199l9669
13047H06927k8882L5237J1939r369K476m3930K4762K5943l7285n1480o8441M5452
13035G13349N0556k9143k2770M0591K4189j7140o0431o4737n1298M9573R0409
13024G23148K2565n7300Q057K9462k1975m8679l5044M3993j2029Q99L8775m8448
13012F43424r481K0263N714L2724L5749L3104K4515l2719o2587P622K7037l6300
13000F89065j3825o498k9140P3342L861n1137l2375N0954L9944N0014K1367m1589
$$ plain form
12988 753983 743551 715436 680554 656704 680262 680291 649736 627429 659123 633917 617545 600864
12976 600864 588204 657781 703223 707836 670350 640809 661858 651038 656549 682790 609083 558679
12964 558679 581440 621348 618141 594478 606930 619688 659053 665009 632187 611224 623152 647631
12952 647631 655592 705144 748213 739342 761822 709393 654845 657363 743437 831917 871963 812058
12940 812058 789910 800004 808236 790611 793187 774258 741882 676274 680716 729997 797172 796065
12928 796065 773555 772230 693990 692714 742211 744362 739673 714859 726420 761680 746889 751905
12916 751905 736329 734032 727219 720224 735569 726454 725523 731572 759065 762064 714090 652518 633789
12903 633789 648804 683302 710698 707917 729305 713723 702780 741994 789193 757220 801592 801600
$$ packed form
12988G53983j0432k8115l4882k3850K3558K9l0555k2307L1694k5206j6372j6681
12976F00864j2660O9577M5442M613l7486k9541K1049j0820N511K6241p3707n0404
12964E58679K2761L9908l207k3663J2452J2758L9365N956l2822k0963J1928K4479
12952F47631P961M9552M3069q871K2480n2429n4548K518Q6074Q8480M0046n9905
12940H12058k2148J0094Q232j7625K576j8929l2376o5608M442M9281O7175j107
12928G96065k2510j325p8240j276M9497K151m689k4814J1561L5260j4791N016
12916G51905j5576k297o813o995J5345r115r31O049K7493K999m7974o1572j8729
12903F33789J5015L4498K7396k781K1388j5582j0943L9214M7199l1973M4372Q
$$ plain form
12891 801600 753278 738551 705952 654020 646465 648844 690870 721843 708606 708048 662038 682363
12879 682363 669897 723946 769688 751893 781205 743250 654060 633559 658075 695551 678796
12868 678796 661444 634761 663882 715238 673480 659394 676038 667466 605590 610087 667628 644619
12856 644619 631001 613986 619162 638454 623954 580581 560699 499449 513284 520033 575345 619177
12844 619177 662418 663323 662967 629085 669232 691314 725250 755242 731540 708327 729957 683276
12832 683276 677885 708221 754343 768101 756668 818488 869582 907168 932372 984293 1080984 1142266
12820 1142266 1191746 1207673 1225708 1259985 1287153 1310756 1343313 1443355 1557659 1617874 1632074
12809 1632074 1698281 1815808 1958324 2024866 1982840 1950526 1924053 1952617 1984125 2014651 2055137
$$ packed form
12891H01600m8322j4727l2599n1932p555K379M2026L0973j3237n58m6010K0325
12879F82363j2466N4049M5742j7795K9312l7955q9190k0501K4516L7476j6755
12868F78796j7352k6683K9121N1356m1758j4086J6644q572o1876M497N7541k3009
12856F44619j3618j7015N176J9292j4500m3373j9882o1250J3835O749N5312M3832
12844F19177M3241R05l56l3882M0147K2082L3936K9992k3702k3213K1630m6681
12832F83276n391L0336M6122J3758j1433O1820N1094L7586K5204N1921R6691O1282
12820A142266M9480J5927J8035L4277K7168K3603L2557J00042J14304O0215J4200
12809A632074O6207J17527J42516O6542m2026l2314k6473K8564L1508L0526M0486
$$ plain form
12798 2055137 2070665 2053440 1981379 1838214 1755330 1757732 1772810 1728009 1704441 1677650 1615953
12787 1615953 1557355 1500627 1447015 1414448 1374992 1353542 1361633 1353470 1345401 1281444 1257773 1286259
12775 1286259 1246883 1198944 1179078 1198619 1208935 1207277 1149777 1107378 1027793 1026456 1062213 1058918
12763 1058918 1045112 967946 959733 991288 1026480 992492 959302 946514 892357 909348 925778
12752 925778 867544 823631 865144 842387 876192 881761 834971 834896 867925 863561 816287 772259
12740 772259 801961 833372 807808 825140 777594 809467 861881 868989 863701 830711 827770 812765
12728 812765 839032 864333 883152 928139 907364 821329 748128 722084 701555 701945 759918 847051
12716 847051 861232 899130 909308 923008 883504 857326 812828 828671 906891 915620 905995 881468
$$ packed form
12798B055137J5528j7225p2061j43165q2884K402J5078m4801k3568k6791o1697
12787A615953n8598n6728n3612l2567l9456k1450Q091q163q069o3957k3671K8486
12775A286259l9376m7939j9866J9541J0316j658n7500m2399p9585j337L5757l295
12763A058918j3806p7166q213L1555L5192l3988l3190j2788n4157J6991J6430
12752I25778n8234m3913M1513k2757L3805N569m6790p5L3029m364m7274m4028
12740G72259K9702L1411k5564J7332m7546L1873N2414P108n288l2990k941j5005
12728H12765K6267K5301J8819M4987k0775q6035p3201k6044k0529L90N7973Q7133
12716H47051J4181L7898J0178J3700l9504k6178m4498J5843P8220Q729r625k4527
$$ plain form
12704 881468 895371 912804 902748 887292 880178 858035 879300 865244 917763 929963 911965 945206
12692 945206 912612 952369 1063853 1151308 1128667 1123832 1197788 1223634 1213828 1255073 1306725 1286179
12680 1286179 1315367 1361567 1405421 1450483 1487956 1515523 1497110 1556666 1589819 1590448 1658180 1694475
12668 1694475 1631569 1626667 1675819 1736220 1741547 1782115 1860248 1909193 1915916 1905537 1830419 1814480
12656 1814480 1806124 1750837 1745508 1690023 1657041 1668407 1605611 1587213 1613615 1645274 1654876 1678561
12644 1678561 1669417 1606782 1483707 1469065 1488376 1522458 1484570 1465791 1461225 1476655 1462315
12633 1462315 1432525 1419860 1430125 1496714 1469597 1430596 1420313 1385628 1339623 1285089 1291845
12622 1291845 1296943 1304764 1317299 1311150 1321614 1301613 1230043 1262154 1287591 1279872 1327327 1335951
$$ packed form
12704H81468J3903J7433j0056j5456p114k2143K1265j4056N2519J2200j7998L3241
12692I45206l2594L9757J11484Q7455k2641m835P3956K5846r806M1245N1652k0546
12680A286179K9188M6200M3854M5062L7473K7567j8413N9556L3153O29O7732L6295
12668A694475o2906m902M9152O0401N327M0568P8133M8945O723j0379p5118j5939
12656A814480q356n5287n329n5485l2982J1366o2796j8398K6402L1659R602K3685
12644A678561r144o2635j23075j4642J9311L4082l7888j8779m566J5430j4340
12633A462315k9790j2665J0265O6589k7117l9001j0283l4685m6005n4534O756
12622A291845N098P821J2535o149J0464k0001p1570L2111K5437p719M7455Q624
$$ plain form
12610 1335951 1311858 1348504 1379615 1395204 1341602 1283215 1271153 1317551 1383379 1368894 1415228
12599 1415228 1381088 1358547 1330335 1336818 1317469 1244345 1198240 1214820 1263220 1309177 1259790
12588 1259790 1258893 1320797 1371039 1343591 1289486 1277221 1333670 1364052 1343672 1413971 1458141 1418786
12576 1418786 1434517 1441435 1485092 1497972 1494025 1501695 1547461 1582942 1579645 1626108 1663198 1741787
12564 1741787 1867786 1925824 1963504 2017988 2064385 2084134 2106679 2224566 2353168 2513821
12554 2513821 2589915 2661033 2756638 2865590 2987388 3129766 3264174 3385910 3519470 3658013
12544 3658013 3850770 4027176 4147934 4307769 4501512 4641354 4838023 5056863 5247783
12535 5247783 5439216 5667456 5876976 6004745 6185770 6360636 6495344 6572592 6700610 6796107
$$ packed form
12610A335951k4093L6646L1111J5589n3602n8387j2062M6398O5828j4485M6334
12599A415228l4140k2541k8212O483j9349p3124m6105J6580M8400M5957m9387
12588A259790q97O1904N0242k7448n4105j2265N6449L0382k0380P0299M4170l9355
12576A418786J5731O918M3657J2880l947P670M5766L5481l297M6463L7090P8589
12564A741787J25999N8038L7680N4484M6397J9749K2545J17887J28602J60653
12554B513821P6094P1118R5605J08952J21798J42378J34408J21736J33560J38543
12544C658013J92757J76406J20758J59835J93743J39842J96669K18840J90920
12535E247783J91433K28240K09520J27769J81025J74866J34708P7248J28018R5497
$$ plain form
12525 6796107 6878540 6938358 7009210 7052191 7023437 6993945 7000476 6892439 6691740 6552636 6367742
12514 6367742 6203139 6005408 5828408 5603299 5339934 5087151 4878943 4709295 4611600 4471125
12504 4471125 4371136 4331436 4243789 4159558 4145429 4095739 4036496 4016748 3975527 3926312 3914535
12493 3914535 3903690 3860637 3782747 3757505 3781227 3743682 3667376 3618032 3630564 3609713 3579426
12482 3579426 3561867 3547833 3515440 3485196 3466095 3444896 3436031 3460706 3531946 3609653 3666684
12471 3666684 3646803 3611132 3565533 3525245 3509258 3586092 3622683 3687236 3689380 3667196 3675675 3700086
12459 3700086 3710750 3728098 3709348 3709986 3671080 3703154 3708421 3713493 3752305 3774372 3746050 3753733
12447 3753733 3827984 3856751 3871159 3961944 4043953 4096288 4200155 4316611 4420441 4532104
$$ packed form
12525F796107Q2433N9818P0852M2981k8754k9492O531j08037k00699j39104j84894
12514F367742j64603j97731j77000k25109k63365k52783k08208j69648r7695j40475
12504D471125r9989l9700q7647q4231j4129m9690n9243j9748m1221m9215j1777
12493C914535j0845m3053p7890k5242K3722l7545p6306m9344J2532k0851l0287
12482C579426j7559j4034l2393l0244j9101k1199q865K4675P1240P7707N7031
12471C666684j9881l5671m5599m0288j5987P6834L6591O4553K144k2184Q479K4411
12459C700086J0664J7348j8750O38l8906L2074N267N072L8812K2067k8322P683
12447C753733P4251K8767J4408R0785Q2009N2335J03867J16456J03830J11663
$$ plain form
12437 4532104 4690130 4896647 5112317 5346063 5623110 5922923 6226496 6534317 6906575
12428 6906575 7265262 7692148 8218607 8713992 9205415 9835151 10549218 11308807 12114224
12419 12114224 12980828 13969884 15140453 16361573 17681962 19224141 20929323 22862056
12411 22862056 25026256 27473100 30157064 33060258 36315023 39907826 43782928 48121291
12403 48121291 52995243 58347361 64265628 70892026 78213958 86261873 95123651 104661096
12395 104661096 114775308 125296759 135909306 146405111 156677175 166505284 175643407
12388 175643407 183877551 191144968 197456309 202659635 206638209 209337948 210520708 210157195
12380 210157195 208154548 204468354 199187468 192179686 183814952 174548948 164636007 154535469
$$ packed form
12437D532104J58026K06517K15670K33746K77047K99813L03573L07821L72258
12428F906575L58687M26886N26459M95385M91423O29736P14067P59589Q05417
12419A2114224Q66604R89056J170569J221120J320389J542179J705182J932733
12411B2862056K164200K446844K683964K903194L254765L592803L875102M338363
12403D8121291M873952N352118N918267O626398P321932Q047915Q861778R537445
12395A04661096J0114212J0521451J0612547J0495805J0272064R828109R138123
12388A75643407Q234144P267417O311341N203326L978574K699739J182760l63513
12380B10157195k002647l686194n280886p007782q364734r266004r912941j0100538
$$ plain form
12372 154535469 144673256 135323172 126691057 118978147 112157586 106242099 101161030 96673391
12364 96673391 92703112 89092257 85738820 82551298 79539294 76662830 73881289 71243853
12356 71243853 68659611 66125521 63734887 61417251 59259549 57227159 55317385 53443098
12348 53443098 51609237 49885487 48313225 46837551 45377594 43989291 42679221 41480779
12340 41480779 40319903 39184817 38076536 37076148 36223390 35329208 34447462 33655887 32921299
12331 32921299 32206104 31534553 30935209 30407731 29873089 29447801 29022590 28601246 28249624
12322 28249624 27941362 27668501 27419629 27160923 26921540 26661681 26425658 26219459 26048887
12313 26048887 25918130 25767673 25657488 25527084 25401603 25346913 25311471 25256488 25207293 25155457
$$ packed form
12372A54535469r862213r350084q632115p712910o820561n915487n081069m487639
12364I6673391l970279l610855l353437l187522l012004k876464k781541k637436
12356G1243853k584242k534090k390634k317636k157702k032390j909774j874287
12348E3443098j833861j723750j572262j475674j459957j388303j310070j198442
12340D1480779j160876j135086j108281j000388q52758q94182q81746p91575p34588
12331C2921299p15195o71551n99344n27478n34642m25288m25211m21344l51622
12322B8249624l08262k72861k48872k58706k39383k59859k36023k06199j70572
12313B6048887j30757j50457j10185j30404j25481n4690l5442n4983m9195n1836
$$ plain form
12303 25155457 25190717 25138631 25179587 25212743 25240007 25218695 25240364 25341267 25312055 25380430 25446728
12292 25446728 25537449 25516394 25495161 25487336 25457544 25373473 25274454 25305022 25359490 25324468 25187918
12281 25187918 25069619 24991123 24967836 24897340 24775856 24668686 24481454 24297762 24091378 23823221
12271 23823221 23542308 23210255 22868379 22480781 22084418 21657152 21210283 20769360 20255222
12262 20255222 19704228 19206804 18767423 18346343 17898331 17440436 17015458 16650312 16311068
12253 16311068 15983354 15663880 15413986 15161747 14954058 14789581 14688929 14547951 14410230
12244 14410230 14316693 14183936 14054528 13968807 13939422 13856700 13770569 13693148 13672768 13669733 13656505
12233 13656505 13608755 13552777 13462085 13417742 13329328 13233524 13177550 13122911 13059121 12975633 12885992
$$ packed form
12303B5155457L5260n2086M0956L3156K7264k1312K1669J00903k9212O8375O6298
12292B5446728R0721k1055k1233p825k9792q4071r9019L0568N4468l5022j36550
12281B5187918j18299p8496k3287p0496j21484j07170j87232j83692k06384k68157
12271B3823221k80913l32053l41876l87598l96363m27266m46869m40923n14138
12262B0255222n50994m97424m39381m21080m48012m57895m24978l65146l39244
12253A6311068l27714l19474k49894k52239k07689j64477j00652j40978j37721
12244A4410230r3537j32757j29408q5721k9385q2722q6131p7421k0380l035j3228
12233A3656505m7750n5978r0692m4343q8414r5804n5974n4639o3790q3488q9641
$$ plain form
12222 12885992 12862334 12813790 12797259 12740507 12725546 12652130 12673324 12697917 12657738 12578885 12656190
12211 12656190 12751875 12867642 12907806 12884375 12895037 12994299 13146029 13209861 13215381 13312714 13438710
12200 13438710 13506533 13582865 13636885 13728668 13865695 13929298 14063321 14159356 14194550 14132182 14056432
12189 14056432 13907504 13808298 13764960 13646993 13448166 13228111 13036737 12805751 12533296 12275579
12179 12275579 11982212 11727588 11538558 11392066 11269421 11076156 10936518 10871932 10767332
12170 10767332 10671313 10610590 10488715 10340717 10252757 10175845 10129131 10014805 9942475 9907702
12160 9907702 9862406 9788031 9763083 9724571 9659994 9611001 9604165 9576781 9553194 9561127 9607947 9627060
12148 9627060 9618386 9637724 9718449 9767340 9768046 9737561 9719568 9770503 9816495 9969688 10167207
$$ packed form
12222A2885992k3658m8544j6531n6752j4961p3416K1194K4593m0179p8853P7305
12211A2656190R5685J15767M0164k3431J0662R9262J51730O3832N520R7333J25996
12200A3438710O7823P6332N4020R1783J37027O3603J34023R6035L5194o2368p5750
12189A4056432j48928r9206m3338j17967j98827k20055j91374k30986k72455k57717
12179A2275579k93367k54624j89030j46492j22645j93265j39638o4586j04600
12170A0767332r6019o0723j21875j47998q7960p6912m6714j14326p2330l4773
12160I907702m5296p4375k4948l8512o4577m8993o836k7384k3587P933M6820J9113
12148I627060q674J9338Q0725M8891P06l0485j7993N0935M5992J53193J97519
$$ plain form
12137 10167207 10304821 10493787 10711594 10934235 11266146 11647227 11991250 12453306 12993059
12128 12993059 13532023 14148529 14837293 15563135 16295486 17138097 18000268 18881534 19841061
12119 19841061 20908199 22047998 23263414 24559797 25923677 27387864 29020625 30838787
12111 30838787 32831406 34982472 37331456 39891797 42660153 45674202 48916309 52294194
12103 52294194 55729271 59152939 62548013 65812257 68854523 71782537 74627925 77523465
12095 77523465 80433892 83177238 85725851 88079675 90076585 91815300 93270035 94381880
12087 94381880 95232268 95983526 96613564 97336954 98287628 99625986 101380567 103426539 105747525
12078 105747525 108302097 111055927 113918012 116876458 119911307 122976067 126086171 129262701
$$ packed form
12137A0167207J37614J88966K17807K22641L31911L81081L44023M62056N39753
12128A2993059N38964O16506O88764P25842P32351Q42611Q62171Q81266R59527
12119A9841061J067138J139799J215416J296383J363880J464187J632761J818162
12111C0838787J992619K151066K348984K560341K768356L014049L242107L377885
12103E2294194L435077L423668L395074L264244L042266K928014K845388K895540
12095G7523465K910427K743346K548613K353824J996910J738715J454735J111845
12087I4381880Q50388P51258O30038P23390R50674J338358J754581K045972K320986
12078A05747525K554572K753830K862085K958446L034849L064760L110104L176530
$$ plain form
12070 129262701 132633898 136328221 140310873 144644438 149327920 154465413 160001945 165858499
12062 165858499 172009041 178184849 184287634 190009394 194993684 199182518 202793971 206083475
12054 206083475 209262303 212256003 214801495 216803067 217996983 218267990 217602226 215850128
12046 215850128 213032115 209157113 204414081 199115495 193646195 188415457 183735628 179711084
12038 179711084 176405879 173740174 171530160 169667845 168017016 166449082 164858056 163256325
12030 163256325 161607227 159935733 158321796 156817805 155421790 154069208 152869515 151903271
12022 151903271 151131596 150531818 150098138 149687700 149259136 148707363 147974123 146946922 145679656
12013 145679656 144303597 142918510 141505901 139896992 138074343 136095227 133849944 131349510
$$ packed form
12070A29262701L371197L694323L982652M333565M683482N137493N536532N856554
12062A65858499O150542O175808O102785N721760M984290M188834L611453L289504
12054B06083475L178828K993700K545492K001572J193916K71007o65764j752098
12046B15850128k818013l875002m743032n298586n469300n230738m679829m024544
12038A79711084l305205k665705k210014j862315j650829j567934j591026j601731
12030A63256325j649098j671494j613937j503991j396015j352582j199693r66244
12022A51903271p71675n99778m33680m10438m28564n51773p33240j027201j267266
12013A45679656j376059j385087j412609j608909j822649j979116k245283k500434
$$ plain form
12005 131349510 128448558 125196760 121627530 117844941 113945589 110064377 106270246 102715695
11997 102715695 99525460 96690014 94170507 91897758 89844591 87970262 86241473 84581328
11989 84581328 82927913 81322788 79781352 78306977 76805496 75329252 73945120 72526688
11981 72526688 71129259 69770084 68406815 67115657 65939956 64788133 63701629 62652111
11973 62652111 61633078 60679996 59722755 58833965 58042607 57282714 56516813 55880809 55316732
11964 55316732 54698457 54150591 53643369 53123037 52663541 52182233 51695548 51227557 50775392
11955 50775392 50368769 49959561 49530357 49096300 48634012 48217402 47768439 47220974 46770397
11946 46770397 46366108 45893537 45421781 45009642 44595375 44139772 43708832 43264371 42765574
$$ packed form
12005A31349510k900952l251798l569230l782589l899352l881212l794131l554551
11997A02715695l190235k835446k519507k272749k053167j874329j728789j660145
11989H4581328j653415j605125j541436j474375j501481j476244j384132j418432
11981G2526688j397429j359175j363269j291158j175701j151823j086504j049518
11973F2652111j019033r53082r57241q88790p91358p59893p65901o36004n64077
11964E5316732o18275n47866n07222n20332m59496m81308m86685m67991m52165
11955E0775392m06623m09208m29204m34057m62288m16610m48963n47465m50577
11946D6770397m04289m72571m71756m12139m14267m55603m30940m44461m98797
$$ plain form
11937 42765574 42321994 41820288 41262340 40703451 40173604 39664497 39056388 38477415 37929095
11928 37929095 37403016 36871109 36302236 35768456 35341733 34925581 34399515 33850040 33383526
11919 33383526 32936722 32499323 32089060 31627762 31228464 30855418 30524699 30163273 29864473
11910 29864473 29517010 29165297 28780970 28443447 28104061 27726698 27361505 27054896 26703665
11901 26703665 26283087 25941602 25590530 25195580 24717692 24258914 23836555 23417816 22977145
11892 22977145 22534789 22105621 21685216 21315143 20940227 20571670 20256318 19900580 19532678
11883 19532678 19204075 18885778 18592943 18288620 17934743 17628948 17348811 17049308 16832565
11874 16832565 16613487 16341756 16131920 15980647 15770706 15566804 15391648 15239862 15104042
$$ packed form
11937D2765574m43580n01706n57948n58889n29847n09107o08109n78973n48320
11928C7929095n26079n31907n68873n33780m26723m16152n26066n49475m66514
11919C3383526m46804m37399m10263m61298l99298l73046l30719l61426k98800
11910B9864473l47463l51713l84327l37523l39386l77363l65193l06609l51231
11901B6703665m20578l41485l51072l94950m77888m58778m22359m18739m40671
11892B2977145m42356m29168m20405l70073l74916l68557l15352l55738l67902
11883A9532678l28603l18297k92835l04323l53877l05795k80137k99503k16743
11874A6832565k19078k71731k09836j51273k09941k03902j75156j51786j35820
$$ plain form
11865 15104042 14906281 14755812 14626489 14543707 14447830 14377645 14308256 14144114 14033835 13982538
11855 13982538 13874157 13707967 13473644 13263355 13134420 13015697 12851126 12712208 12572433
11846 12572433 12345401 12182008 11978573 11732070 11525499 11242053 10977853 10660681 10324697
11837 10324697 10003276 9752018 9417417 9136766 8909018 8704866 8479813 8313097 8096548
11828 8096548 7867073 7655785 7440762 7240794 7089283 6906548 6699657 6547919 6431975
11819 6431975 6262885 6132703 6071813 5962732 5820211 5595165 5422565 5326186 5162063 5027250
11809 5027250 4886583 4759275 4629598 4440087 4356661 4281981 4162729 4119992 4082127 3980755
11799 3980755 3869229 3722970 3640446 3539078 3503406 3461489 3384367 3309900 3252858 3248276 3311502
$$ packed form
11865A5104042j97761j50469j29323q2782r5877p0185o9389j64142j10279n1297
11855A3982538j08381j66190k34323k10289j28935j18723j64571j38918j39775
11846A2572433k27032j63393k03435k46503k06571k83446k64200l17172l35984
11837A0324697l21421k51258l34601k80651k27748k04152k25053j66716k16549
11828H096548k29475k11288k15023j99968j51511j82735k06891j51738j15944
11819F431975j69090j30182o0890j09081j42521k25046j72600r6379j64123j34813
11809E027250j40667j27308j29677j89511q3426p4680j19252m2737l7865j01372
11799C980755j11526j46259q2524j01368l5672m1917p7122p4467n7042m582O3226
$$ plain form
11788 3311502 3332046 3253541 3159369 3117928 3099887 3042064 2973463 2934130 2953126 2930124 2916390
11777 2916390 2889781 2910474 2901477 2865354 2882634 2925531 2923526 2961513 2931265 2882523 2863363 2885355
11765 2885355 2901302 2891272 2857639 2913157 2953816 2929503 2920497 2979132 2968402 2967676 2993000 3030057
11753 3030057 3060954 3079160 3078287 3045139 3068818 3086581 3050121 3070403 3132423 3151988 3174703 3122999
11741 3122999 3102822 3111205 3108286 3125542 3145698 3131888 3198656 3228005 3215103 3222169 3155138 3149151
11729 3149151 3168056 3157449 3186024 3204244 3202529 3193619 3116598 3099885 3092971 3057031 3096241 3035833
11717 3035833 3045483 3093740 3098953 3039580 2974781 2979181 2983749 2958592 2933971 2864536 2813278 2798885
11705 2798885 2803857 2866912 2830754 2751886 2750870 2772859 2727127 2666877 2628294 2625160 2610663 2562430
$$ packed form
11788C311502K0544p8505r4172m1441j8041n7823o8601l9333J8996k3002j3734
11777B916390k6609K0693q997l6123J7280M2897k005L7987l0248m8742j9160K1992
11765B885355J5947j0030l3633N5518M0659k4313r006N8635j0730p26K5324L7057
11753C030057L0897J8206q73l3148K3679J7763l6460K0282O2020J9565K2715n1704
11741C122999k0177Q383k919J7256K0156j3810O6768K9349j2902P066o7031n987
11729C149151J8905j0607K8575J8220j715q910p7021j6713o914l5940L9210o0408
11717C035833R650M8257N213n9373o4799M400M568k5157k4621o9435n1258j4393
11705B798885M972O3055l6158p8868j016K1989m5732o0250l8583l134j4497m8233
$$ plain form
11693 2562430 2527997 2482534 2459811 2437292 2385182 2324348 2260820 2218646 2245889 2235354 2126609
11682 2126609 2035947 2039439 2053773 2054695 1972343 1973508 1958456 1903283 1817259 1799906 1800017 1749183
11670 1749183 1694255 1716535 1691129 1674879 1680878 1668131 1656626 1589621 1562551 1544470 1575254
11659 1575254 1566963 1532566 1530710 1592682 1580546 1518628 1497822 1481112 1471086 1522691 1579571 1524244
11647 1524244 1480632 1427865 1483845 1493436 1477411 1476670 1457946 1477111 1478296 1437204 1412948 1342229
11635 1342229 1326975 1333728 1358320 1362500 1317554 1298288 1347168 1387998 1417000 1434226 1430873 1462869
11623 1462869 1472756 1461390 1457804 1469071 1498509 1578766 1669878 1676303 1674560 1655461 1714645 1756343
11611 1756343 1821999 1829622 1856133 1897300 1916637 1898110 1899167 1932536 1978672 2029944 2037213 2089488
$$ packed form
11693B562430l4433m5463k2723k2519n2110o0834o3528m2174K7243j0535j08745
11682B126609r0662L492J4334R22q2352J165j5052n5173q6024j7353J11n0834
11670A749183n4928K2280k5406j6250N999j2747j1505o7005k7070j8081L0784
11659A575254q291l4397j856O1972j2136o1918k0806j6710j0026N1605N6880n5327
11647A524244m3612n2767N5980R591j6025p41j8724J9165J185m1092k4256p0719
11635A342229j5254O753K4592M180m4946j9266M8880M0830K9002J7226l353L1996
11623A462869R887j1366l586J1267K9438Q0257R1112O425j743j9099N9184M1698
11611A756343O5656P623K6511M1167J9337j8527J057L3369M6136N1272P269N2275
$$ plain form
11599 2089488 2119427 2117726 2087219 2038963 2048315 2022873 1934526 1885775 1798238 1777999 1823337 1830165
11587 1830165 1796091 1798898 1836932 1820907 1797358 1837156 1891785 1856953 1827783 1807902 1750131
11576 1750131 1760102 1788485 1825468 1874356 1897083 1828139 1851347 1899591 1862035 1838341 1832317 1848220
11564 1848220 1896150 1919317 1922225 1889827 1843011 1832526 1774491 1736573 1708272 1684708 1654753
11553 1654753 1588848 1530439 1554904 1527510 1543761 1601911 1590893 1483364 1424435 1431944 1460780
11542 1460780 1462159 1418636 1375465 1337636 1248274 1220286 1210613 1220841 1234172 1195246 1128040 1048422
11530 1048422 1010018 1040622 1105755 1131572 1082899 1045901 1055732 1044560 1011488 993165 1001579 1024903
11518 1024903 1020340 1004131 950113 930221 950042 974362 912317 858940 825591 795268 829292
$$ packed form
11599B089488K9939j701l0507m8256R352k5442q8347m8751q7537k0239M5338O828
11587A830165l4074K807L8034j6025k3549L9798N4629l4832k9170j9881n7771
11576A750131R971K8383L6983M8888K2727o8944K3208M8244l7556k3694o024J5903
11564A848220M7930K3167K908l2398m6816j0485n8035l7918k8301k3564k9955
11553A654753o5905n8409K4465k7394J6251N8150j1018j07529n8929P509K8836
11542A460780J379m3523m3171l7829q9362k7988r673J0228J3331l8926o7206p9618
11530A048422l8404L0604O5133K5817m8673l6998R831j1172l3072j8323Q414K3324
11518A024903m563j6209n4018j9892J9821K4320o2045n3377l3349l0323L4024
$$ plain form
11507 829292 862179 836579 821880 840697 795004 721228 633540 644288 707639 752407 753515 715990
11495 715990 659938 639145 683481 702950 739841 692367 640445 617702 594732 549734 562135
11484 562135 571097 590492 648197 614882 600170 638362 679835 576157 493686 507376 545818
11473 545818 588698 595898 578200 554050 526684 538026 607312 629624 610098 576008 545073 568052
11461 568052 555114 553222 573046 546003 555261 589108 615224 659450 628047 593452 560410 589005
11449 589005 621845 654543 616148 570224 603878 597273 604044 584692 603514 595336 563544 525666
11437 525666 539047 562810 544794 518962 567857 622790 645046 674728 736799 744614 694987 691504
11425 691504 689370 741828 703850 658551 698914 686312 681325 712060 716087 674609 672879 727772
$$ packed form
11507H29292L2887k5600j4699J8817m5693p3776q7688J0748O3351M4768J108l7525
11495G15990n6052k0793M4336J9469L6891m7474n1922k2743k2970m4998J2401
11484E62135Q962J9395N7705l3315j4712L8192M1473j03678q2471J3690L8442
11473E45818M2880P200j7698k4150k7366J1342O9286K2312j9526l4090l0935K2979
11461E68052j2938j892J9824k7043R258L3847K6116M4226l1403l4595l3042K8595
11449E89005L2840L2698l8395m5924L3654o605O771j9352J8822q178l1792l7878
11437E25666J3381K3763j8016k5832M8895N4933K2256K9682O2071P815m9627l483
11425F91504k134N2458l7978m5299M0363j2602m987L0735M027m1478j730N4893
$$ plain form
11413 727772 736246 669266 618809 583979 592235 629828 610885 629016 649908 676765 679267 662082
11401 662082 696470 694002 709845 688007 703438 662619 661731 684005 734757 685153 681272 766670
11389 766670 821429 723081 632347 664703 665518 646175 628768 599821 568589 637883 641066 634430
11377 634430 592474 603609 639615 704324 679789 638678 627118 596878 596137 659668 710250 650694
11365 650694 660817 668340 699992 734432 667783 670597 679822 671473 697099 647164 597475 639880
11353 639880 641148 615092 647496 649553 661319 683282 689798 681074 654559 661921 671447 664595 678567
11340 678567 669804 677171 676539 673269 631623 626533 651091 631062 665666 661960 602155 603318 551191
11327 551191 544818 566225 585244 592624 565615 572140 614783 618691 602169 580580 515225 480217
$$ packed form
11413G27772Q474o6980n0457l4830Q256L7593j8943J8131K0892K6857K502j7185
11401F62082L4388k468J5843k1838J5431m0819q88K2274N0752m9604l881Q5398
11389G66670N4759r8348r0734L2356Q15j9343j7407k8947l1232O9294L183o636
11377F34430m1956J1135L6006O4709k4535m1111j1560l0240p41O3531N0582n9556
11365F50694J0123P523L1652L4440o6649K814R225q349K5626m9935m9689M2405
11353F39880J268k6056L2404K057J1766K1963O516q724k6515P362R526o852J3972
11340F78567q763P367o32l270m1646n090K4558k0029L4604l706n9805J163n2127
11327E51191o373K1407J9019P380k7009O525M2643L908j6522k1589o5355l5008
$$ plain form
11315 480217 503368 560087 571249 571314 546178 548499 532852 529831 574412 568962 479165 454025 495367
11302 495367 544609 491035 508122 487628 516159 525194 517234 505875 477180 514370 566056 669719
11290 669719 664213 640307 631041 549768 497265 522159 570020 576896 596014 611664 538459 476028
11278 476028 518189 601293 530101 530670 567532 561416 558697 605542 669707 676831 593313 549323
11266 549323 562203 597410 672284 694965 644916 656757 636180 588514 624894 600049 507823
11255 507823 466891 506749 529905 570558 599581 628697 578449 553247 556731 580886 596394 602185
11243 602185 563579 564972 561325 570396 615228 633955 591448 572051 579023 568183 560192 572654
11231 572654 510224 488775 478013 501469 487444 460694 450963 448468 450570 414651 404135 481029
$$ packed form
11315D80217K3151N6719J1162O5k5136K321j5647l021M4581n450q9797k5140M1342
11302D95367M9242n3574J7087k0494K8531R035p960j1359k8695L7190N1686J03663
11290F69719n506k3906r266q1273n2503K4894M7861O876J9118J5650p3205o2431
11278D76028M2161Q3104p1192N69L6862o116k719M6845O4165P124q3518m3990
11266E49323J2880L5207P4874K2681n0049J1841k0577m7666L6380k4845r2226
11255E07823m0932L9858K3156M0653K9023K9116n0248k5202L484K4155J5508N791
11243F02185l8606J393l647R071M4832J8727m2507j9397O972j0840p991J2462
11231E72654o2430k1449j0762K3456j4025k6750r731k495K102l5919j0516P6894
$$ plain form
11219 481029 501234 516246 509353 507055 489276 475580 439301 373623 368666 396499 452468 450979
11207 450979 463235 477898 469734 455212 484661 465398 520197 573950 562204 504631 432078 457145
11195 457145 497082 501269 493971 438475 406170 446037 470833 465393 447165 477193 505985 476022
11183 476022 454322 453493 393428 375823 417040 465732 451632 499661 546995 547022 572237 564990 538625
11170 538625 564759 587051 599136 648234 656067 632945 625902 638815 660781 663968 687915 761910
11158 761910 775062 780596 780955 767558 728365 735356 799420 858019 845103 809469 808989 839154 794212
11145 794212 812359 799393 803171 861643 883037 853424 837698 852752 795133 755942 720572 752501
11133 752501 782611 736154 710081 690568 728946 674653 592144 598486 632365 651939 690431 644150
$$ packed form
11219D81029K0205J5012o893k298j7779j3696l6279o5678m957K7833N5969j489
11207D50979J2256J4663q164j4522K9449j9263N4799N3753j1746n7573p2553K5067
11195D57145L9937M187p298n5496l2305L9867K4796n440j8228L0028K8792k9963
11183D76022k1700q29o0065j7605M1217M8692j4100M8029M7334K7K5215p247k6365
11170E38625K6134K2292J2085M9098P833k3122p043J2913K1966L187K3947P3995
11158G61910J3152N534L59j3397l9193O991O4064N8599j2916l5634m80L0165m4942
11145G94212J8147j2966L778N8472K1394k9613j5726J5054n7619l9191l5370L1929
11133G52501L0110m6457k6073j9513L8378n4293q2509O342L3879J9574L8492m6281
$$ plain form
11121 644150 600763 609382 623921 617015 616328 645592 685793 723936 711478 658572 616082 568941
11109 568941 569734 643290 665239 704507 666968 572591 552913 554816 535706 511688 497897 480924
11097 480924 485910 540262 552696 575327 554533 539309 524783 527161 585424 580918 570648 613901
11085 613901 620514 558048 582383 578043 573661 574331 552466 541445 510498 533055 538382 547894 566374
11072 566374 515692 512638 544197 529879 533735 536116 518376 443153 382269 373119 319926 351412
11060 351412 423713 485939 514973 465905 401727 394166 457079 497932 464828 418722 446486 459785
11048 459785 480327 501290 506867 450405 456233 450291 460016 498626 506413 505142 511238 490542 506426
11035 506426 490993 526116 629845 578889 535439 613356 631897 623722 676253 688422 724530
$$ packed form
11121F44150m3387Q619J4539o906o87K9264M0201L8143j2458n2906m2490m7141
11109E68941P93P3556K1949L9268l7539r4377j9678J903j9110k4018j3791j6973
11097D80924M986N4352J2434K2631k0794j5224j4526K378N8263m506j0270M3253
11085F13901O613o2466K4335m340m382O70k1865j1021l0947K2557N327R512J8480
11072E66374n0682l054L1559j4318L856K381j7740p5223o0884r150n3193L1486
11060C51412P2301O2226K9034m9068o4178p561O2913M0853l3104m6106K7764J3299
11048D59785K0542K0963N577n6462N828n942R725L8610P787j271O096k0696J5884
11035E06426j5433L5123J03729n0956m3450P7917J8541q175N2531J2169L6108
$$ plain form
11024 724530 758441 747099 771142 748432 753731 790138 798880 785494 785218 779903 779126 807444 789445
11011 789445 797636 845807 850049 838192 860780 911158 899341 847134 820769 776823 796995 798392
10999 798392 826396 877964 880127 853647 816236 845359 826057 807691 825177 810060 791210 759835
10987 759835 728141 756806 789938 801028 822169 791742 806119 808753 821845 850916 840915 819643
10975 819643 786496 787774 802816 777587 773491 731146 739539 763840 695535 623903 668831 659433
10963 659433 689058 715886 687832 621190 584478 542770 547835 586653 615982 585327 597471 593193
10951 593193 589388 634467 640388 578382 520043 552020 568454 568806 580074 602896 615252 568904
10939 568904 512353 496059 520568 532760 522007 529312 511752 501242 534614 544331 552898 549605
$$ packed form
11024G24530L3911j1342K4043k2710N299L6407Q742j3386k76n315p77K8318j7999
11011G89445Q191M8171M242j1857K2588N0378j1817n2207k6365m3946K0172J397
10999G98392K8004N1568K163k6480l7411K9123j9302j8366J7486j5117j8850l1375
10987G59835l1694K8665L3132J1090K1141l0427J4377K634J3092K9071j0001k1272
10975H19643l3147J278J5042k5229m096m2345Q393K4301o8305p1632M4928r398
10963F59433K9625K6828k8054o6642l6712m1708N065L8818K9329l0655J2144m278
10951E93193l805M5079N921o2006n8339L1977J6434L52J1268K2822J2356m6348
10939E68904n6551j6294K4509J2192j0753P305j7560j0510L3372R717Q567l293
$$ plain form
10927 549605 578007 589028 541313 484419 507459 554590 519925 571698 650526 637736 638040 608921
10915 608921 695960 771100 785908 747503 758908 788035 823088 936315 961852 930537 995133
10904 995133 1089468 1138324 1186743 1323051 1425042 1507353 1602717 1730259 1837172 1952013
10894 1952013 2095294 2228699 2376320 2430318 2482104 2590239 2625645 2666923 2688677 2695815 2726538
10883 2726538 2744223 2773158 2761685 2698027 2635405 2530322 2387155 2249838 2110861 1998910
10873 1998910 1924881 1858773 1843248 1782103 1756640 1739759 1763344 1765779 1706229 1701339 1694444 1621985
10861 1621985 1560970 1480552 1465669 1437628 1435484 1352770 1315942 1310569 1295003 1277606 1245540 1179614
10849 1179614 1099941 1094675 1080110 1088977 1042263 1029325 1015068 1025705 1008721 965719 962828 925947
$$ packed form
10927E49605K8402J1021m7715n6894K3040M7131l4665N1773P8828j2790L04k9119
10915F08921Q7039P5140J4808l8405J1405K9127L5053J13227K5537l1315O4596
10904I95133R4335M8856M8419J36308J01991Q2311R5364J27542J06913J14841
10894A952013J43281J33405J47621N3998N1786J08135L5406M1278K1754P138L0723
10883B726538J7685K8935j1473o3658o2622j05083j43167j37317j38977j11951
10873A998910p4029o6108j5525o1145k5463j6881K3585K435n9550m890o895p2459
10861A621985o1015q0418j4883k8041k144q2714l6828n373j5566j7397l2066o5926
10849A179614p9673n266j4565Q867m6714j2938j4257J0637j6984m3002k891l6881
$$ plain form
10837 925947 946542 951341 944057 922325 911953 865904 825549 797340 738824 714094 733513 749324
10825 749324 783247 772656 745291 758038 773494 739696 764456 787655 788185 737486 673084 665811
10813 665811 722076 734449 728695 735747 706551 714851 744197 732956 763538 823344 901137 895573
10801 895573 850696 901515 904246 852295 792953 758275 710112 692330 710407 725847 707071 707813
10789 707813 731604 788367 785936 786101 836466 874808 833242 857722 846835 861348 951160 956677
10777 956677 926792 967777 1024244 1087718 1135034 1156883 1144902 1166884 1212992 1265913 1277033
10766 1277033 1326566 1398548 1470212 1545443 1592419 1632288 1693982 1699594 1682896 1708773 1796404
10755 1796404 1852260 1855449 1855860 1878103 1936935 1974511 2013261 2047963 2111817 2150395 2188752 2199103
$$ packed form
10837I25947K0595M799p284k1732j0372m6049m0355k8209n8516k4730J9419J5811
10825G49324L3923j0591k7365J2747J5456l3798K4760K3199N30n0699o4402p273
10813F65811N6265J2373n754P052k9196Q300K9346j1241L0582N9806P7793n564
10801H95573m4877N0819K731n1951n9342l4678m8163j7782J8077J5440j8776P42
10789G07813K3791N6763k431J65N0365L8342m1566K4480j0887J4513Q9812N517
10777I56677k9885M0985N6467O3474M7316K1849j1981K1982M6108N2921J1120
10766A277033M9533P1982P1664P5231M6976L9869O1694N612j6698K5877Q7631
10755A796404N5856L189M11K2243N8832L7576L8750L4702O3854L8578L8357J0351
$$ plain form
10743 2199103 2179654 2156235 2114867 2070866 2125293 2192598 2201349 2187388 2143762 2085563 2054491
10732 2054491 1996245 1864541 1820228 1813313 1752103 1712382 1670484 1623100 1622297 1613961 1580630 1595524
10720 1595524 1599518 1494240 1395088 1366805 1331822 1325667 1339775 1383633 1386304 1383717 1410180 1434920
10708 1434920 1427316 1388640 1392491 1364505 1300780 1334913 1306047 1264118 1211296 1241901 1307243 1299028
10696 1299028 1261129 1223071 1150500 1111206 1106703 1070647 1121815 1166900 1166085 1137029 1124868 1091405
10684 1091405 1045497 1017083 1022583 1023946 1032555 1031027 1024772 1086516 1054681 1019962 1049270 1027797
10672 1027797 1030292 1069338 1091557 1085855 1117462 1116357 1049998 1091124 1128525 1121510 1136211 1109097
10660 1109097 1150324 1212280 1270343 1250023 1302343 1346538 1353426 1392172 1465431 1550647 1647591
$$ packed form
10743B199103j9449k3419m1368m4001N4427O7305Q751j3961m3626n8199l1072
10732B054491n8246j31704m4313o915o1210l9721m1898m7384q03q336l3331J4894
10720A595524L994j05278r9152k8283l4983o155J4108M3858K671k587K6463K4740
10708A434920p604l8676L851k7986o3725L4133k8866m1929n2822L0605O5342q215
10696A299028l7899l8058p2571l9294m503l6056N1168M5085q15k9056j2161l3463
10684A091405m5908k8414N500J363Q609j528o255O1744l1835l4719K9308k1473
10672A027797K495L9046K2219n702L1607j105o6359M1126L7401p015J4701k7114
10660A109097M1227O1956N8063k0320N2320M4195O888L8746P3259Q5216R6944
$$ plain form
10649 1647591 1746813 1826134 1925025 2014629 2095879 2122559 2240260 2296647 2345529 2449778 2605118
10638 2605118 2765636 2861299 3017106 3190473 3381970 3617318 3821862 4053170 4262808 4475742
10628 4475742 4661811 4878948 5136388 5384788 5679160 5938266 6180730 6396055 6604719
10619 6604719 6858476 7170814 7467818 7744998 8059172 8419913 8640551 8860452 9111923
10610 9111923 9292997 9439477 9570915 9638462 9657518 9628786 9574461 9435697 9233601 8981392
10600 8981392 8660795 8306933 7928412 7553078 7279000 6928688 6507217 6073168 5693220
10591 5693220 5383772 5109150 4862883 4674241 4545597 4509806 4469201 4400752 4337969 4241929
10581 4241929 4112263 3969386 3848902 3727125 3679104 3633969 3587005 3567115 3561714 3539827 3571686
$$ packed form
10649A647591R9222P9321R8891Q9604Q1250K6680J17701N6387M8882J04249J55340
10638B605118J60518R5663J55807J73367J91497K35348K04544K31308K09638K12934
10628D475742J86069K17137K57440K48400K94372K59106K42464K15325K08664
10619F604719K53757L12338K97004K77180L14174L60741K20638K19901K51471
10610I111923J81074J46480J31438O7547J9056k8732n4325j38764k02096k52209
10600H981392l20597l53862l78521l75334k74078l50312m21471m34049l79948
10591E693220l09448k74622k46267j88642j28644l5791m0605o8449o2783r6040
10581D241929j29666j42877j20484j21777m8021m5135m6964j9890n401k1887L1859
$$ plain form
10570 3571686 3536100 3456728 3405166 3384765 3387228 3423941 3456582 3401841 3374878 3389794 3387147 3335340
10558 3335340 3302006 3316387 3340715 3313969 3339872 3360292 3439075 3514494 3496580 3496429 3518684 3551250
10546 3551250 3548123 3569923 3595448 3624266 3674034 3707047 3750840 3744034 3683653 3631471 3630449 3595452
10534 3595452 3527055 3524972 3500319 3568236 3636208 3679360 3768662 3921205 4057339 4206747 4438686
10523 4438686 4661033 4952008 5250045 5561760 5920609 6351605 6679737 6991115 7370664
10514 7370664 7811480 8295257 8839292 9429953 10075948 10731984 11508466 12346193 13235101
10505 13235101 14276143 15456836 16766827 18227003 19799025 21551145 23486513 25629301
10497 25629301 28059491 30747677 33745607 37137131 40892572 45089120 49673719 54753007
$$ packed form
10570C571686l5586p9372n1562k0401K463L6713L2641n4741k6963J4916k647n1807
10558C335340l3334J4381K4328k6746K5903K0420P8783P5419j7914j51K2255L2566
10546C551250l127K1800K5525K8818M9768L3013M3793o806o0381n2182j022l4997
10534C595452o8397k083k4653O7917O7972M3152Q9302J52543J36134J49408K31939
10523D438686K22347K90975K98037L11715L58849M30996L28132L11378L79549
10514G370664M40816M83777N44035N90661O45995O56036P76482Q37727Q88908
10505A3235101J041042J180693J309991J460176J572022J752120J935368K142788
10497B5629301K430190K688186K997930L391524L755441M196548M584599N079288
$$ plain form
10489 54753007 60326019 66537832 73388678 80879078 89167917 98439902 108890831 120751381
10481 120751381 134266377 149521582 166465275 184846599 204576841 225185653 245658014
10474 245658014 263982422 278334844 288389164 296371959 304941878 314455735 323670398
10467 323670398 330894668 334668131 334869775 332485559 327535108 318775335 305465610 288130308
10459 288130308 268159159 246891617 226113883 207522217 191756840 178729506 168331324
10452 168331324 160151360 153630274 148109405 142936580 137851149 132774866 127875588 123295337
10444 123295337 119070733 115097796 111119444 107145129 103235237 99441689 95687904 92113217
10436 92113217 88798993 85761896 82918279 80247536 77700957 75275390 73007564 70775952
$$ packed form
10489E4753007N573012O211813O850846P490400Q288839R271985J0450929J1860550
10481A20751381J3514996J5255205J6943693J8381324J9730242K0608812K0472361
10474B45658014J8324408J4352422J0054320P982795Q569919R513857R214663
10467C23670398P224270L773463K01644k384216m950451q759773j3309725j7335302
10459B88130308j9971149k1267542k0777734j8591666j5765377j3027334j0398182
10452A68331324q179964o521086n520869n172825n085431n076283m899278m580251
10444A23295337m224604l972937l978352l974315l909892l793548l753785l574687
10436I2113217l314224l037097k843617k670743k546579k425567k267826k231612
$$ plain form
10428 70775952 68675471 66664116 64780938 63048533 61388128 59856634 58443854 57150893
10420 57150893 55959522 54707801 53492195 52294518 51101139 50061571 49059528 48136921
10412 48136921 47266298 46478196 45695317 44937080 44189127 43472855 42784797 42168835 41612750
10403 41612750 41053265 40565979 40090636 39727589 39321741 38952818 38722853 38493751 38214654
10394 38214654 37991060 37818722 37655194 37565132 37504385 37393919 37306800 37222828 37135678 37101221
10384 37101221 37096309 37116611 37143064 37246952 37354034 37396623 37422805 37406193 37385955 37388400 37365013
10373 37365013 37326965 37318844 37298179 37232683 37160939 37096919 37003817 36914401 36824612 36695383 36603014
10362 36603014 36464954 36282244 36070496 35809025 35587940 35214295 34762787 34330551 33885567
$$ packed form
10428G0775952k100481k011355j883178j732405j660405j531494j412780j292961
10420E7150893j191371j251721j215606j197677j193379j039568j002043r22607
10412D8136921q70623p88102p82879p58237p47953p16272o88058o15962n56085
10403D1612750n59485m87286m75343l63047m05848l68923k29965k29102k79097
10394C8214654k23594j72338j63528r0062o0747j10466q7119q3972q7150l4457
10384C7101221m912K0302K6453J03888J07082M2589K6182j6612k0238K445k3387
10373C7365013l8048q121k0665o5496p1744o4020r3102q9416q9789j29229r2369
10362C6603014j38060j82710k11748k61471k21085l73645m51508m32236m44984
$$ plain form
10353 33885567 33364341 32656342 31945032 31208029 30380261 29568284 28709654 27952983 27200449
10344 27200449 26387103 25583134 24790076 23999575 23288495 22636903 22009187 21523312 21115464
10335 21115464 20733123 20283609 19887261 19483510 19109101 18766512 18468767 18180267 17922051
10326 17922051 17694763 17484189 17210516 16973784 16734107 16549131 16409785 16216723 15947571
10317 15947571 15728222 15580090 15451510 15220700 14964959 14785819 14603164 14432087 14220193
10308 14220193 13978330 13787034 13624583 13468555 13285629 13105280 12935711 12770496 12584232
10299 12584232 12344311 12201854 12105948 11994871 11837412 11664824 11534407 11444327 11338196 11185519
10289 11185519 11031662 10913953 10824335 10763356 10707845 10664802 10565958 10558974 10586539 10643905 10655413
$$ packed form
10353C3885567n21226p07999p11310p37003q27768q11977q58630p56671p52534
10344B7200449q13346q03969p93058p90501p11080o51592o27716m85875m07848
10335B1115464l82341m49514l96348m03751l74409l42589k97745k88500k58216
10326A7922051k27288k10574k73673k36732k39677j84976j39346j93062k69152
10317A5947571k19349j48132j28580k30810k55741j79140j82655j71077k11894
10308A4220193k41863j91296j62451j56028j82926j80349j69569j65215j86264
10299A2584232k39921j42457r5906j11077j57459j72588j30417r0080j06131j52677
10289A1185519j53857j17709q9618o0979n5511m3043r8844o984K7565N7366J1508
$$ plain form
10278 10655413 10706979 10770088 10684644 10533580 10345364 10086007 9767930 9495774 9243143 8930592
10268 8930592 8662811 8399832 8157474 7945748 7667079 7383187 7177802 6993478 6773558
10259 6773558 6511804 6342490 6270455 6096056 5865246 5616267 5409497 5238047 5044237 4930683
10249 4930683 4820985 4625036 4508899 4380239 4222309 4110212 3965336 3840478 3741835 3661875
10239 3661875 3587456 3534809 3472700 3443279 3337549 3222199 3074137 2972973 2893978 2776750
10229 2776750 2701184 2638093 2573903 2515529 2454776 2414045 2394185 2323710 2293507 2238742 2198881
10218 2198881 2167851 2161263 2130956 2107152 2083909 2064701 2062601 2029414 2000989 1986988 1980692 2025484
10206 2025484 2088792 2109634 2065368 2089565 2149311 2190026 2253421 2407706 2519408 2476803 2445210
$$ packed form
10278A0655413N1566O3109q5444j51064j88216k59357l18077k72156k52631l12551
10268H930592k67781k62979k42358k11726k78669k83892k05385j84324k19920
10259F773558k61754j69314p2035j74399k30810k48979k06770j71450j93810j13554
10249D930683j09698j95949j16137j28660j57930j12097j44876j24858r8643p9960
10239C661875p4419n2647o2109k9421j05730j15350j48062j01164p8995j17228
10229B776750p5566o3091o4190n8374o0753m0731j9860p0475l0203n4765l9861
10218B198881l1030o588l0307k3804k3243j9208k100l3187k8425j4001o296M4792
10206B025484O3308K0842m4266K4197N9746M0715O3395J54285J11702m2605l1593
$$ plain form
10195 2445210 2447826 2439364 2458593 2547830 2627634 2628728 2666270 2724998 2726529 2681147 2676391 2684507
10183 2684507 2772203 2861672 2888890 2799066 2786148 2845330 2884833 2862489 2957056 2953808 2977287
10172 2977287 3073100 3220016 3267272 3359045 3528751 3615036 3654683 3710951 3771177 3890957 3963352
10161 3963352 4051736 4139118 4279263 4377152 4431673 4555491 4640373 4728790 4822826 4831920 4910214
10150 4910214 5004093 5088788 5124550 5102449 5112361 5026677 4985036 5016041 4995619 4974299 4949280
10139 4949280 4938369 4924165 4846158 4756296 4755458 4719519 4680017 4651662 4620338 4544701 4504721 4458451
10127 4458451 4412769 4377558 4366850 4364276 4325288 4248686 4221276 4236993 4181292 4174520 4177311 4097880
10115 4097880 4029075 3980460 3920222 3885217 3839209 3813522 3827409 3878797 3806438 3675683 3584941
$$ packed form
10195B445210K616q462J9229Q9237P9804J094L7542N8728J531m5382m756Q116
10183B684507Q7696Q9469K7218q9824j2918N9182L9503k2344R4567l248K3479
10172B977287R5813J46916M7256R1773J69706Q6285L9647N6268O0226J19780P2395
10161C963352Q8384Q7382J40145R7889N4521J23818Q4882Q8417R4036R094P8294
10150D910214R3879Q4695L5762k2101R912q5684m1641L1005k0422k1320k5019
10139D949280j0911j4204p8007q9862q38l5939l9502k8355l1324p5637l9980m6270
10127D458451m5682l5211j0708k574l8988p6602k7410J5717n5701o772K791p9431
10115D097880o8805m8615o0238l5005m6008k5687J3887N1388p2359j30755r0742
$$ plain form
10104 3584941 3577062 3564322 3534599 3362747 3228972 3136522 3056622 2971243 2906132 2924558 2914686
10093 2914686 2847909 2720759 2639489 2588553 2596071 2581590 2583727 2539724 2476086 2449094 2431065
10082 2431065 2424390 2374354 2332246 2286043 2280068 2284910 2299509 2268928 2266849 2267924 2268428 2267583 2231869
10069 2231869 2178841 2212322 2230307 2229947 2260609 2289455 2313176 2342009 2397032 2434272 2499057 2512636
10057 2512636 2556650 2646205 2726708 2833171 2886573 2965275 3113806 3264830 3366183 3481370
10047 3481370 3553888 3583475 3625291 3713027 3778886 3812401 3876040 3888859 3933631 3926259 3858714
10036 3858714 3786022 3736050 3706584 3638908 3568621 3427916 3320803 3269884 3237566 3231192 3232543
10025 3232543 3340355 3404998 3416636 3441709 3375557 3352472 3335997 3317065 3289548 3274757 3345415
$$ packed form
10104C584941p879j2740k9723j71852j33775r2450p9900q5379o5111J8426r872
10093B914686o6777j27150q1270n0936P518j4481K137m4003o3638k6992j8029
10082B431065o675n0036m2108m6203n975M842J4599l0581k079J075N04q45l5714
10069B231869n3028L3481J7985l60L0662K8846K3721K8833N5023L7240O4785J3579
10057B512636M4014Q9555Q0503J06463N3402P8702J48531J51024J01353J15187
10047C481370P2518K9587M1816Q7736O5859L3515O3639J2819M4772p372o7545
10036C858714p2692m9972k9466o7676p0287j40705j07113n0919l2318o374J351
10025C232543J07812O4643J1638K5073o6152k3085j6475j8932k7517j4791P0658
$$ plain form
10014 3345415 3359850 3408470 3401867 3374414 3341612 3312278 3405224 3427464 3425220 3400871 3360249 3252723
10002 3252723 3220995 3284615 3338174 3384396 3422924 3386512 3362318 3307955 3293253 3228761 3201327
9991 3201327 3224181 3181821 3152721 3164377 3187596 3161792 3175804 3162927 3182591 3144834 3132030
9980 3132030 3071694 3029472 3053270 3068373 3068004 3086756 3058241 3068097 3129798 3132629 3077899 3005476
9968 3005476 3044934 3030193 3008678 3027601 3021116 2972306 2981350 2994128 2970970 2935357 2861108 2864924
9956 2864924 2879102 2874277 2894425 2902830 2846677 2882088 2887664 2939024 2959311 2971676 2971563 2990761
9944 2990761 3024231 3037283 3042366 3105486 3130530 3103470 3144705 3212461 3226281 3229028 3361940 3414962
9932 3414962 3457769 3510438 3620351 3724844 3794324 3865136 3922954 3959943 3992426 4104792 4164250
$$ packed form
10014C345415J4435M8620o603k7453l2802k9334R2946K2240k244k4349m0622j07526
10002C252723l1728O3620N3559M6222L8528l6412k4194n4363j4702o4492k7434
9991C201327K2854m2360k9100J1656K3219k5804J4012j2877J9664l7757j2804
9980C132030o0336m2222K3798J5103l69J8752k8515R856O1701K831n4730p2423
9968C005476L9458j4741k1515J8923o485m8810R044J2778k3158l5613p4249L816
9956B864924J4178m825K0148Q405n6153L5411N576N1360K0287J2365j13J9198
9944B990761L3470J3052N083O3120K5044k7060M1235O7756J3820K747J32912N3022
9932C414962M2807N2669J09913J04493O9480P0812N7818L6989L2483J12366N9458
$$ plain form
9921 4164250 4243553 4360778 4439760 4512899 4557201 4630366 4693944 4776986 4813827 4884756 4917199
9910 4917199 4956510 5039902 5098730 5193742 5335483 5409046 5459047 5488081 5551102 5582967 5659085
9899 5659085 5726171 5827703 5918550 6006395 6108337 6237784 6353003 6405672 6488233 6609627
9889 6609627 6755676 6854898 6947887 7073503 7163003 7187818 7254856 7341023 7471126 7553756 7670281
9878 7670281 7745614 7857351 7952757 7989452 7987398 7935104 7897193 7895668 7863429 7842567 7837892 7880348
9866 7880348 7893015 7865932 7876747 7806880 7744582 7719840 7765653 7804823 7901246 7964837 8038794
9855 8038794 8113191 8251741 8419597 8597833 8699940 8776068 8847270 8855443 8930765 9030645 9126366
9844 9126366 9213115 9212527 9263140 9417650 9541085 9633347 9705429 9835073 9973586 10077389 10262572
$$ packed form
9921D164250P9303J17225P8982P3139M4302P3165O3578Q3042L6841P0929L2443
9910D917199L9311Q3392N8828R5012J41741P3563N0001K9034O3021L1865P6118
9899E659085O7086J01532R0847Q7845J01942J29447J15219N2669Q2561J21394
9889F609627J46049R9222R2989J25616Q9500K4815O7038Q6167J30103Q2630J16525
9878G670281P5333J11737R5406L6695k054n2294l7911j525l2239k0862m675M2456
9866G880348J2667k7083J0815o9867o2298k4742M5813L9170R6423O3591P3957
9855H038794P4397J38550J67856J78236J02107P6128P1202Q173P5322R9880R5721
9844I126366Q6749n88N0613J54510J23435R2262P2082J29644J38513J03803J85183
$$ plain form
9833 10262572 10458750 10666802 10923941 11186898 11457045 11690785 11954587 12222273 12502410
9824 12502410 12899976 13229758 13549703 13922066 14288412 14640177 15042029 15347576 15666975
9815 15666975 16017115 16355597 16669769 16988274 17321356 17669890 18089782 18548988 19029447
9806 19029447 19584327 20181893 20972841 21939648 22963312 24155799 25433057 26931432 28610471
9797 28610471 30431035 32431749 34689276 37219556 40003371 43062439 46352851 49923685
9789 49923685 53727671 57601219 61529600 65328076 68880470 72148919 75232672 78260980
9781 78260980 81342023 84432318 87408178 90099813 92543712 94702069 96621473 98285492
9773 98285492 99638600 100758454 101753382 102774071 103975681 105443375 107308547 109564586
$$ packed form
9833A0262572J96178K08052K57139K62957K70147K33740K63802K67686K80137
9824A2502410L97566L29782L19945L72363L66346L51765M01852L05547L19399
9815A5666975L50140L38482L14172L18505L33082L48534M19892M59206M80459
9806A9029447N54880N97566P90948R66807J023664J192487J277258J498375J679039
9797B8610471J820564K000714K257527K530280K783815L059068L290412L570834
9789D9923685L803986L873548L928381L798476L552394L268449L083753L028308
9781G8260980L081043L090295K975860K691635K443899K158357J919404J664019
9773I8285492J353108J119854R94928J020689J201610J467694J865172K256039
$$ plain form
9765 109564586 112187097 115064767 118237691 121509244 124880616 128283155 131595765 134763005
9757 134763005 137900853 140975643 144059866 147141145 150316267 153612920 157172419 161141229
9749 161141229 165554904 170351102 175546583 181050377 186596003 191725637 196086759 199649034
9741 199649034 202664076 205557415 208504293 211333423 213858559 215840410 216864212 217019421
9733 217019421 216271968 214456736 211458998 207326277 202302416 196895706 191485450 186560865
9725 186560865 182334289 178923710 176327983 174386190 172867150 171677832 170593223 169419357
9717 169419357 168050798 166498654 164683576 162787054 160836204 158672931 156380990 154046601
9709 154046601 151720835 149448083 147303213 145302802 143530094 141986677 140705519 139576890
$$ packed form
9765A09564586K622511K877670L172924L271553L371372L402539L312610L167240
9757A34763005L137848L074790L084223L081279L175122L296653L559499L968810
9749A61141229M413675M796198N195481N503794N545626N129634M361122L562275
9741A99649034L015042K893339K946878K829130K525136J981851J023802J55209
9733B17019421p47453j815232k997738m132721n023861n406710n410256m924585
9725A86560865m226576l410579k595727j941793j519040j189318j084609j173866
9717A69419357j368559j552144j815078j896522j950850k163273k291941k334389
9709A54046601k325766k272752k144870k000411j772708j543417j281158j128629
$$ plain form
9701 139576890 138399106 137099813 135707658 134298753 132943877 131706831 130438179 128956524
9693 128956524 127198925 125167354 122808451 120053150 116914787 113371349 109535976 105483769
9685 105483769 101363502 97335556 93607344 90265637 87321049 84772659 82513994 80535823
9677 80535823 78728672 77083265 75536228 74117829 72812572 71538578 70338914 69192063
9669 69192063 68159556 67208545 66230580 65348695 64473298 63660163 62921119 62108879 61346739
9660 61346739 60608399 59914559 59192266 58495616 57857801 57235941 56584162 55949115 55324739
9651 55324739 54673628 54037611 53408452 52779004 52173628 51603645 51022877 50454309 49909837
9642 49909837 49322763 48789880 48311961 47895588 47417090 46942827 46563712 46256331 45813704
$$ packed form
9701A39576890j177784j299293j392155j408905j354876j237046j268652j481655
9693A28956524j757599k031571k358903k755301l138363l543438l835373m052207
9685A05483769m120267m027946l728212l341707k944588k548390k258665j978171
9677H0535823j807151j645407j547037j418399j305257j273994j199664j146851
9669F9192063j032507r51011r77965q81885q75397q13135p39044q12240p62140
9660F1346739p38340o93840p22293o96650o37815o21860o51779o35047o24376
9651E5324739o51111o36017o29159o29448o05376n69983n80768n68568n44472
9642D9909837n87074n32883m77919m16373m78498m74263l79115l07381m42627
$$ plain form
9633 45813704 45430760 45088929 44729938 44340913 43927955 43503397 43067006 42558613 42085937
9624 42085937 41611250 41101200 40550835 39963842 39368635 38763978 38191995 37609703 37082648
9615 37082648 36526952 35900817 35282671 34677347 34156882 33631314 33131366 32704946 32253168
9606 32253168 31752156 31323145 30895290 30437007 29970444 29508262 29016473 28622860 28239884
9597 28239884 27860706 27492495 27095886 26724177 26373262 26027628 25722823 25398858 25080969
9588 25080969 24734216 24371806 24009998 23644202 23269286 22918432 22586411 22244579 21869981
9579 21869981 21488085 21115000 20779994 20439700 20122730 19828540 19475451 19146965 18799141
9570 18799141 18477600 18188183 17935925 17658070 17365396 17120909 16831200 16489182 16190987
$$ packed form
9633D5813704l82944l41831l58991l89025m12958m24558m36391n08393m72676
9624D2085937m74687n10050n50365n86993n95207o04657n71983n82292n27055
9615C7082648n55696o26135o18146o05324n20465n25568m99948m26420m51778
9606C2253168n01012m29011m27855m58283m66563m62182m91789l93613l82976
9597B8239884l79178l68211l96609l71709l50915l45634l04805l23965l17889
9588B5080969l46753l62410l61808l65796l74916l50854l32021l41832l74598
9579B1869981l81896l73085l35006l40294l16970k94190l53089l28486l47824
9570A8799141l21541k89417k52258k77855k92674k44487k89709l42018k98195
$$ plain form
9561 16190987 15950456 15693962 15465788 15249247 14989151 14756388 14551134 14374297 14201344
9552 14201344 13983552 13735296 13535453 13438891 13335111 13191424 12985657 12823700 12663657 12413164
9542 12413164 12137648 11887664 11622701 11401321 11142487 10908120 10710666 10483952 10280920
9533 10280920 10134615 9976414 9767261 9544208 9344308 9120681 8896309 8676380 8491930
9524 8491930 8383444 8270962 8122031 7900862 7747395 7599031 7409660 7269741 7152017 7050445
9514 7050445 6931670 6749927 6560414 6420166 6319568 6211793 6136042 6019942 5958177 5858455
9504 5858455 5721532 5587932 5543127 5433281 5290259 5177003 5059975 4988039 4852619 4704219
9494 4704219 4584665 4494541 4405917 4374503 4280404 4193259 4128020 4057066 3988330 3938547 3898648
$$ packed form
9561A6190987k40531k56494k28174k16541k60096k32763k05254j76837j72953
9552A4201344k17792k48256j99843r6562j03780j43687k05767j61957j60043k50493
9542A2413164k75516k49984k64963k21380k58834k34367j97454k26714k03032
9533A0280920j46305j58201k09153k23053j99900k23627k24372k19929j84450
9524H491930j08486j12482j48931k21169j53467j48364j89371j39919j17724j01572
9514G050445j18775j81743j89513j40248j00598j07775p5751j16100o1765r9722
9504E858455j36923j33600m4805j09846j43022j13256j17028p1936j35420j48400
9494D704219j19554r0124q8624l1414r4099q7145o5239p0954o8736m9783l9899
$$ plain form
9483 3898648 3839603 3768354 3710418 3699078 3633235 3588160 3539668 3538229 3540304 3569985 3541712 3504239
9471 3504239 3509653 3465154 3416180 3398066 3416653 3412592 3404023 3335606 3311895 3313896 3322222 3374549
9459 3374549 3420775 3459175 3500447 3464947 3505104 3512806 3512381 3524034 3545562 3582826 3659570 3716162
9447 3716162 3780059 3752620 3783979 3752139 3762277 3794110 3870698 3893097 3841707 3829574 3762262
9436 3762262 3727781 3806089 3843024 3861413 3894472 3931746 3964167 3926773 3932966 3914345 3897489 3956613
9424 3956613 3972269 3938821 3834679 3866514 3978587 4063786 4058076 4067216 4081476 4066318 4054245
9413 4054245 4047266 4006476 4012088 4030674 4083280 4061511 4056416 4076006 4139355 4216262 4236708 4201878
9401 4201878 4167853 4190738 4166395 4182448 4138988 4125006 4105234 4034060 3988891 4007669 4020503
$$ packed form
9483C898648n9045p1249n7936j1340o5843m5075m8492j439K075K9681k8273l7473
9471C504239N414m4499m8974j8114J8587m061q569o8417k3711K001Q326N2327
9459C374549M6226L8400M1272l5500M0157P702m25J1653K1528L7264P6744N6592
9447C716162O3897k7439L1359l1840J0138L1833P6588K2399n1390j2133o7312
9436C762262l4481P8308L6935J8389L3059L7274L2421l7394O193j8621j6856N9124
9424C956613J5656l3448j04142L1835J12073Q5199n710R140J4260j5158j2073
9413D054245o979m0790N612J8586N2606k1769n095J9590O3349P6907K0446l4830
9401D201878l4025K2885k4343J6053m3460j3982j9772p1174m5169J8778J2834
$$ plain form
9390 4020503 3963383 3961858 3973270 3913224 3898813 3898010 3874317 3870194 3832756 3791212 3756034 3809873
9378 3809873 3835407 3815041 3791876 3804975 3791449 3732725 3774136 3787096 3748782 3747607 3769381 3774957
9366 3774957 3851644 3917241 3905150 3866838 3883926 3901318 3863869 3825943 3788486 3776649 3805658
9355 3805658 3858318 3887131 3883525 3790270 3757404 3739183 3727081 3687530 3706141 3684877 3610793 3554678
9343 3554678 3586780 3691608 3684196 3732034 3761075 3775991 3783367 3783048 3789169 3847994 3873980 3975759
9331 3975759 4051621 4099862 4132994 4205525 4266618 4332809 4360320 4438917 4568396 4583250 4614919
9320 4614919 4740674 4812927 4829957 4903121 4943941 5045284 5205409 5241106 5259911 5256806 5273341
9309 5273341 5262012 5241034 5235997 5252297 5327690 5368275 5361799 5393298 5392016 5378302 5376845 5384945
$$ packed form
9390D020503n7120j525J1412o0046j4411q03k3693m123l7438m1544l5178N3839
9378C809873K5534k0366k3165J3099j3526n8724M1411J2960l8314j175K1774N576
9366C774957P6687O5597j2091l8312J7088J7392l7449l7926l7457j1837K9009
9355C805658N2660K8813l606r3255l2866j8221j2102l9551J8611k1264p4084n6115
9343C554678L2102J04828p412M7838K9041J4916P376l19O121N8825K5986J01779
9331C975759P5862M8241L3132P2531O1093O6191K7511P8597J29479J4854L1669
9320D614919J25755P2253J7030P3164M0820J01343J60125L5697J8805l105J6535
9309E273341j1329k0978n037J6300P5393M0585o476L1499j282j3714j457Q100
$$ plain form
9297 5384945 5347789 5331895 5299654 5263837 5256798 5243600 5185577 5178003 5213556 5207963 5161839 5158045
9285 5158045 5187060 5214510 5205062 5212237 5240159 5297593 5342374 5362168 5369796 5328110 5290686 5290354
9273 5290354 5326854 5373516 5367828 5332039 5363813 5392142 5487425 5478870 5403938 5437540 5518522 5565220
9261 5565220 5586472 5601772 5618577 5631408 5623753 5655809 5755763 5819936 5920952 5970698 6026282
9250 6026282 6097624 6131566 6237107 6348737 6396570 6426909 6449926 6545252 6628216 6737407 6878776
9239 6878776 6965391 6989043 7026557 7091926 7267726 7477777 7646101 7811119 7959622 8076377
9229 8076377 8194157 8362044 8562408 8776533 8951496 9124278 9341908 9588914 9893287 10178917
9219 10178917 10451571 10756132 11080682 11371139 11618993 11910919 12337899 12784843 13199615
$$ packed form
9297E384945l7156j5894l2241l5817p039j3198n8023p574L5553n593m6124l794
9285E158045K9015K7450r448P175K7922N7434M4781J9794P628m1686l7424l32
9273E290354L6500M6662n688l5789L1774K8329R5283q555p4932L3602Q0982M6698
9261E565220K1252J5300J6805J2831p655L2056R9954O4173J01016M9746N5584
9250F026282P1342L3942J05541J11630M7833L0339K3017R5326Q2964J09191J41369
9239F878776Q6615K3652L7514O5369J75800K10051J68324J65018J48503J16755
9229H076377J17780J67887K00364K14125J74963J72782K17630K47006L04373K85630
9219A0178917K72654L04561L24550K90457K47854K91926M26980M46944M14772
$$ plain form
9210 13199615 13649879 14147140 14657510 15165261 15756610 16345760 17013105 17710133 18336656
9201 18336656 19059867 19947033 20823775 21707784 22627798 23601483 24588351 25678225 26831647
9192 26831647 28062205 29367038 30723767 32168626 33712436 35266876 36859365 38565630
9184 38565630 40346066 42165312 44080509 46078575 48113440 50170373 52174862 54273299
9176 54273299 56340835 58374150 60409259 62375526 64312083 66149913 67918469 69582901
9168 69582901 70962430 72263338 73402185 74341932 75099705 75643694 76001306 76073093 75914680
9159 75914680 75567830 75041922 74332969 73479679 72428513 71303705 70102506 68825421 67489435
9150 67489435 66123172 64742965 63337649 61885183 60404568 58952793 57517171 56106359
$$ packed form
9210A3199615M50264M97261N10370N07751N91349N89150O67345O97028O26523
9201A8336656P23211Q87166Q76742Q84009R20014R73685R86868J089874J153422
9192B6831647J230558J304833J356729J444859J543810J554440J592489J706265
9184C8565630J780436J819246J915197J998066K034865K056933K004489K098437
9176E4273299K067536K033315K035109J966267J936557J837830J768556J664432
9168F9582901J379529J300908J138847R39747P57773N43989L57612P1787j58413
9159G5914680l46850n25908p08953q53290j051166j124808j201199j277085j335986
9150F7489435j366263j380207j405316j452466j480615j451775j435622j410812
$$ plain form
9142 56106359 54762316 53392363 52047318 50784707 49552589 48378360 47180130 45975775
9134 45975775 44808974 43697970 42711230 41712955 40671412 39670402 38677521 37772526 36959377
9125 36959377 36093864 35231275 34438243 33627398 32887737 32165603 31475309 30813537 30137939
9116 30137939 29496955 28926021 28319275 27783021 27219720 26730499 26258448 25821982 25350517
9107 25350517 24939641 24596201 24211596 23823334 23437242 23101053 22767673 22461870 22138813
9098 22138813 21826419 21574753 21296386 21068343 20855779 20610993 20349095 20123947 19917341
9089 19917341 19733431 19552908 19372567 19211143 19066762 18915767 18844068 18787743 18710145 18588457
9079 18588457 18456556 18352380 18237886 18122106 17975146 17798953 17677517 17548743 17449665 17342542
$$ packed form
9142E6106359j344043j369953j345045j262611j232118j174229j198230j204355
9134D5975775j166801j111004r86740r98275j041543j001010r92881r04995q13149
9125C6959377q65513q62589p93032q10845p39661p22134o90294o61772o75598
9116C0137939o40984n70934o06746n36254n63301m89221m72051m36466m71465
9107B5350517m10876l43440l84605l88262l86092l36189l33380l05803l23057
9098B2138813l12394k51666k78367k28043k12564k44786k61898k25148k06606
9089A9917341j83910j80523j80341j61424j44381j50995p1699n6325p7598j21688
9079A8588457j31901j04176j14494j15780j46960j76193j21436j28774r9078j07123
$$ plain form
9069 17342542 17205944 17076586 16970152 16863371 16722839 16606098 16542041 16452397 16238212 16045819
9059 16045819 15928759 15804658 15680779 15563896 15445275 15229984 14997306 14841871 14650356
9050 14650356 14506000 14314149 14106536 13957046 13840686 13653258 13484864 13279152 13043641
9041 13043641 12839779 12634686 12424587 12269833 12096900 11935612 11811146 11623465 11423995
9032 11423995 11219251 10983463 10737351 10564464 10446648 10277293 10137970 9981271 9872226
9023 9872226 9793754 9639777 9518878 9357548 9177035 9014060 8866462 8738108 8689459 8592412
9013 8592412 8447077 8297706 8214777 8136356 8044189 7909719 7842668 7749089 7657527 7582004 7442177
9002 7442177 7365017 7328744 7209297 7094447 7032388 6971480 6900453 6765648 6661181 6524499
$$ packed form
9069A7342542j36598j29358j06434j06781j40532j16741o4057q9644k14185j92393
9059A6045819j17060j24101j23879j16883j18621k15291k32678j55435j91515
9050A4650356j44356j91851k07613j49490j16360j87428j68394k05712k35511
9041A3043641k03862k05093k10099j54754j72933j61288j24466j87681j99470
9032A1423995k04744k35788k46112j72887j17816j69355j39323j56699j09045
9023I872226p8472j53977j20899j61330j80513j62975j47598j28354m8649r7047
9013H592412j45335j49371q2929p8421r2167j34470o7051r3579r1562p5523j39827
9002G442177p7160l6273j19447j14850o2059o0908p1027j34805j04467j36682
$$ plain form
8992 6524499 6428711 6417933 6388814 6346282 6273510 6183068 6141440 6064782 6040081 5992380 5905156
8981 5905156 5811431 5783132 5738875 5714978 5662049 5562307 5482994 5424062 5335554 5279575 5216557
8970 5216557 5126268 5073155 5036112 4952206 4853263 4769956 4720061 4652818 4546588 4471011 4438028
8959 4438028 4398653 4331693 4220044 4140927 4115934 4049816 4007889 3951022 3884103 3779234 3684697
8948 3684697 3623980 3610714 3536921 3485410 3446410 3351339 3294146 3230745 3183063 3125018 3047597
8937 3047597 3006491 2978742 2936979 2901044 2837624 2807881 2713465 2659696 2618787 2563301 2491790
8926 2491790 2455540 2422506 2402579 2331178 2313579 2331580 2366307 2375978 2325164 2262780 2144087
8915 2144087 2173499 2171438 2153299 2148622 2114965 2101913 2019110 2007073 2006177 1985384 1925834 1865610
$$ packed form
8992F524499r5788j0778k9119m2532p2772r0442m1628p6658k4701m7701q7224
8981E905156r3725k8299m4257k3897n2929r9742p9313n8932q8508n5979o3018
8970E216557r0289n3113l7043q3906r8943q3307m9895o7243j06230p5577l2983
8959D438028l9375o6960j11649p9117k4993o6118m1927n6867o6919j04869r4537
8948C684697o0717j3266p3793n1511l9000r5071n7193o3401m7682n8045p7421
8937C047597m1106k7749m1763l5935o3420k9743r4416n3769m0909n5486p1511
8926B491790l6250l3034j9927p1401j7599J8001L4727R671n0814o2384j18693
8915B144087K9412k061j8139m677l3657j3052q2803j2037q96k0793n9550o0224
$$ plain form
8903 1865610 1831674 1816629 1794616 1770831 1773990 1769838 1784642 1815882 1803612 1760490 1755125 1783335
8891 1783335 1835095 1890851 1887014 1801511 1773925 1771241 1773647 1717186 1660825 1647093 1661453 1686417
8879 1686417 1675322 1663009 1640366 1640981 1690809 1699528 1719446 1708763 1733996 1755969 1666558 1638917
8867 1638917 1648644 1632855 1653736 1670572 1636743 1601631 1609197 1593114 1567173 1609004 1653643 1617343
8855 1617343 1661129 1698279 1713156 1691773 1715095 1741774 1731704 1700591 1684222 1718884 1727397 1714371
8843 1714371 1691863 1654115 1678459 1746201 1808438 1809551 1810345 1814857 1770760 1714238 1695862 1684628
8831 1684628 1692857 1689295 1665481 1640178 1671400 1672913 1672506 1683438 1665677 1676142 1697326 1654150
8819 1654150 1671070 1626014 1600352 1593710 1586646 1585991 1571461 1566545 1615883 1664111 1685211 1653079
$$ packed form
8903A865610l3936j5045k2013k3785L159m152J4804L1240j2270m3122n365K8210
8891A783335N1760N5756l837q5503k7586k684K406n6461n6361j3732J4360K4964
8879A686417j1095j2313k2643O15M9828Q719J9918j0683K5233K1973q9411k7641
8867A638917R727j5789K0881J6836l3829l5112P566j6083k5941M1831M4639l6300
8855A617343M3786L7150J4877k1383K3322K6679j0070l1113j6369L4662Q513j3026
8843A714371k2508l7748K4344O7742O2237J113P94M512m4097n6522j8376j1234
8831A684628Q229l562k3814k5303L1222J513m07J0932j7761J0465K1184m3176
8819A654150J6920m5056k5662o642p064o55j4530m916M9338M8228K1100l2132
$$ plain form
8807 1653079 1677283 1620638 1614941 1554846 1517377 1494189 1514162 1487549 1401786 1338795 1375671 1424827
8795 1424827 1376280 1361080 1383836 1330614 1282074 1263051 1284026 1297418 1304832 1346247 1299428 1265266
8783 1265266 1232554 1234059 1240952 1212905 1137914 1133045 1101397 1122805 1105227 1106510 1091135 1067564
8771 1067564 1044980 1052778 1056799 1067745 1081964 1079089 1077770 1081770 1053229 1011957 957253 935695
8759 935695 945289 929834 950152 940731 913552 921076 927403 973994 970366 959347 1000654 948614 867738
8746 867738 862023 858449 914083 944393 929413 866250 873890 839004 805140 808847 852345 878189
8734 878189 922277 888433 877059 858292 858797 956419 975085 948283 890402 852817 890891 941886
8722 941886 1005180 997523 956029 853417 853432 859357 896762 886806 881799 925926 957651 953100 918489
$$ packed form
8807A653079K4204n6645n697o0095l7469k3188J9973k6613q5763o2991L6876M9156
8795A424827m8547j5200K2756n3222m8540j9023K0975J3392P414M1415m6819l4162
8783A265266l2712J505O893k8047p4991m869l1648K1408j7578J283j5375k3571
8771A067564k2584P798M021J0946J4219k875j319M000k8541m1272n4704k1558
8759I35695R594j5455K0318r421k7179P524O327M6591l628j1019M1307n2040q0876
8746H67738n715l574N5634L0310j4980o3163P640l4886l3864L707M3498K5844
8734H78189M4088l3844j1374j8767N05R7622J8666k6802n7881l7585L8074N0995
8722I41886O3294p657m1494j02612J5N925L7405r956n007M4127L1725m551l4611
$$ plain form
8709 918489 908950 885160 817105 859584 920629 967482 942121 892144 876813 900100 978250 1009197
8697 1009197 953658 936363 975604 998753 1024569 1055168 1062083 1035134 1023335 1026392 1045765 1045923
8685 1045923 1025566 1011106 966392 962793 961994 992400 1002721 981944 971383 983369 1021392 1038617
8673 1038617 1022430 980628 986179 978805 988487 988660 990574 979868 972631 915818 878958 823693 818991
8660 818991 875358 900448 881024 922385 910179 893470 912695 948158 959371 896663 852327 905447
8648 905447 914506 881632 856032 840794 923511 960196 920001 885759 861406 900887 884562 898891
8636 898891 946593 904124 903249 936162 855715 825998 860862 840127 830232 851178 846437 831856
8624 831856 873129 903935 905972 860665 884618 861445 822146 812781 798891 766423 724878 771002
$$ packed form
8709I18489r539k3790o8055M2479O1045M6853k5361m9977j5331K3287P8150L0947
8697A009197n5539j7295L9241K3149K5816L0599O915k6949j1799L057J9373J58
8685A045923k0357j4460m4714l599p99L0406J0321k0777j0561J1986L8023J7225
8673A038617j6187m1802N551p374R682J73J914j0706p237n6813l6860n5265m702
8660H18991N6367K5090j9424M1361j2206j6709J9225L5463J1213o2708m4336N3120
8648I05447R059l2874k5600j5238Q2717L6685m0195l4242k4353L9481j6325J4329
8636H98891M7702m2469q75L2913q0447k9717L4864k0735r895K0946m741j4581
8624H31856M1273L0806K037m5307K3953k3173l9299r365j3890l2468m1545M6124
$$ plain form
8612 771002 830414 864529 895775 903045 879257 874580 902756 900292 882371 892900 920388 913773
8600 913773 921111 907297 849961 800978 809461 811260 883115 930715 946722 936493 979468 958839
8588 958839 953799 929869 957630 1029398 1112986 1162685 1148722 1186614 1212039 1192713 1243215 1247866
8576 1247866 1243520 1248766 1278017 1343196 1362154 1391355 1480379 1518288 1573495 1600356 1573481 1602577
8564 1602577 1653152 1631035 1662354 1651667 1623563 1661572 1726084 1720487 1676978 1569310 1496099
8553 1496099 1541300 1489659 1402393 1338514 1324619 1319717 1337594 1314293 1280552 1245337 1232362 1149983
8541 1149983 1108591 1150087 1177475 1138784 1054209 980805 1003181 1032869 1025842 1010098 992362 968966
8529 968966 965751 937664 932620 948609 977781 1005839 951089 870445 887680 918702 933879 934298
$$ packed form
8612G71002N9412L4115L1246P270k3788m677K8176k464j7921J0529K7488o615
8600I13773P338j3814n7336m8983Q483J799P1855M7600J6007j0229M2975k0629
8588I58839n040k3930K7761P1768Q3588M9699j3963L7892K5425j9326N0502M651
8576A247866m346N246K9251O5179J8958K9201Q9024L7909N5207K6861k6875K9096
8564A602577N0575k2117L1319j0687k8104L8009O4512n597m3509j07668p3211
8553A496099M5201n1641q7266o3879j3895m902J7877k3301l3741l5215j2975q2379
8541A149983m1392M1496K7388l8691q4575p3404K2376K9688p027j5744j7736k3396
8529I68966l215k8087n044J5989K9172K8058n4750q0644J7235L1022J5177M19
$$ plain form
8517 934298 933096 927628 927089 869863 861092 857546 884768 917554 936543 891936 854557 871020 854341
8504 854341 849583 801386 769265 823298 884352 877450 861466 860751 850655 907028 878682 825885
8492 825885 825332 822417 840369 820845 820491 809096 733060 733001 796504 840532 794992 789834 851872
8479 851872 893912 854269 781367 786174 784159 764377 805097 820991 803269 770861 713314 687687
8467 687687 699896 730589 751005 761985 727866 725074 674451 671014 689273 728462 755148 719029
8455 719029 673274 651062 647986 702266 694488 649348 590520 558369 568328 617222 591359 554264
8443 554264 590011 635078 602130 535326 497602 467946 479896 498496 511631 560464 622331 644682
8431 644682 597371 560173 483512 459313 523585 537413 550694 531938 521867 477790 477886 473560
$$ packed form
8517I34298j202n468n39n7226q771l546K7222L2786J8989m4607l7379J6463j6679
8504H54341m758m8197l2121N4033O1054o902j5984p15j0096N6373k8346n2797
8492H25885n53k915J7952j9524l54j1395p6036n9O3503M4028m5540n158O2038
8479H51872M2040l9643p2902M807k015j9782M0720J5894j7722l2408n7547k5627
8467F87687J2209L0693K0416J0980l4119k792n0623l437J8259L9189K6686l6119
8455G19029m5755k2212l076N4280p778m5140n8828l2151R959M8894k5863l7095
8443E54264L5747M5067l2948o6804l7724k9656J1950J8600J3135M8833O1867K2351
8431F44682m7311l7198p6661k4199O4272J3828J3281j8756j0071m4077R6m326
$$ plain form
8419 473560 491755 506621 482571 464944 501408 493059 466426 501601 520384 507537 508269 531462
8407 531462 587007 513069 472602 529761 552327 473596 424568 442386 445725 511113 534434 538983
8395 538983 552024 561836 519291 488418 476969 458402 467916 423861 429082 359024 314235 333054
8383 333054 360664 388044 470629 515264 548959 572974 535180 505419 521667 432071 360718 384380
8371 384380 470136 447843 395507 394937 390466 467385 493555 468584 463993 449101 397808 394552 391331
8358 391331 389786 403879 387177 356268 356616 346497 352257 356354 346957 355720 401786 368310 346413
8345 346413 374958 357145 372071 371335 359123 343749 393489 431473 418886 377701 374809 379261
8333 379261 458958 436731 381266 363113 373147 363576 369800 364410 316194 300246 291745 320039
$$ packed form
8419D73560J8195J4866k4050j7627L6464q349k6633L5175J8783j2847P32K3193
8407E31462N5545p3938m0467N7159K2566p8731m9028J7818L339O5388K3321M549
8395E38983J3041R812m2545l0873j1449j8567R514m4055N221p0058m4789J8819
8383C33054K7610K7380Q2585M4635L3695K4015l7794k9761J6248q9596p1353K3662
8371C84380Q5756k2293n2336n70m471P6919K6170k4971m591j4892n1293l256l221
8358C91331j545J4093j6702l0909L48j0119N760M097r397Q763M6066l3476k1897
8345C46413K8545j7813J4926p36j2212j5374M9740L7984j2587m1185k892M452
8333C79261P9697k2227n5465j8153J0034r571O224n390m8216j5948q501K8294
$$ plain form
8321 320039 329006 342907 366092 374013 362847 346591 333292 349688 312786 250419 252618 278846
8309 278846 288531 302537 306222 314433 301877 334607 316688 273381 223719 278075 291643 276355
8297 276355 290506 286957 311695 289990 277842 351287 399437 399579 422506 393074 363830 345867
8285 345867 333074 303517 291258 305483 264518 221658 194069 266708 345468 351010 336043 346793
8273 346793 352510 327289 312591 317637 310729 285340 236098 238754 232664 291300 333756 321165 287993
8260 287993 350937 379116 352212 325816 277591 265951 301304 336460 338870 374712 345180 259636
8248 259636 281732 284714 279452 295740 309662 370525 391999 378415 334487 344544 328294 348481
8236 348481 344080 304037 280351 335567 371396 341448 314320 280702 302203 318980 391086 429847
$$ packed form
8321C20039Q967J3901K3185P921j1166j6256j3299J6396l6902o2367K199K6228
8309B78846R685J4006L685Q211j2556L2730j7919m3307m9662N4356J3568j5288
8297B76355J4151l549K4738k1705j2148P3445M8150J42K2927k9432k9244j7963
8285C45867j2793k9557j2259J4225m0965m2860k7589P2639P8760N542j4967J0750
8273C46793N717k5221j4698N046o908k5389m9242K656o090N8636M2456j2591l3172
8260B87993O2944K8179k6904k6396m8225j1640L5353L5156K410L5842k9532q5544
8248B59636K2096K982n262J6288J3922O0863K1474j3584m3928J0057j6250K0187
8236C48481m401m0043k3686N5216L5829k9948k7128l3618K1501J6777P2106L8761
$$ plain form
8224 429847 430270 372139 357111 304693 286099 276230 328572 341524 334908 359737 328926 344599
8212 344599 357583 354152 396070 397363 343214 279422 338491 313088 314583 327006 343808 366803
8200 366803 330010 286277 289229 308722 284542 233036 227133 257942 286208 315857 310417 318112
8188 318112 269166 259861 305538 302831 314187 347011 361704 304512 299882 309245 299787 263281 229530
8175 229530 248818 259763 279254 348911 363328 375568 371633 350870 319872 276969 276007 305697
8163 305697 349507 345137 326477 301739 289910 301818 299644 283354 248087 227958 273502 324681
8151 324681 326426 246817 181951 175571 261072 311031 302326 289411 325927 248371 247499 329412 329537
8138 329537 299437 262508 231989 308622 305017 308445 312487 288716 228487 279822 299169 242152
$$ packed form
8224D29847M23n8131j5028n2418j8594r869N2342J2952o616K4829l0811J5673
8212C44599J2984l431M1918J293n4149o3792N9069k5403J495J2423J6802K2995
8200C66803l6793m3733K952J9493k4180n1506n903L0809K8266K9649n440P695
8188C18112m8946r305M5677k707J1356L2824J4693n7192m630R363r458l6506l3751
8175B29530J9288J0945J9491O9657J4417J2240l935k0763l0998m2903r62K9690
8163C05697M3810m370j8660k4738j1829J1908k174j6290l5267k0129M5544N1179
8151C24681J745p9609o4866o380Q5501M9959q705j2915L6516p7556q72Q1913J25
8138C29537l0100l6929l0519P6633l605L428M042k3771o0229N1335J9347n7017
$$ plain form
8126 242152 213632 191420 246256 340306 311631 322383 324405 282742 292226 313337 312156 360159
8114 360159 312659 210403 132164 132120 166087 160646 190375 253508 237250 217646 269459 324386
8102 324386 338443 357385 340196 329971 315015 304479 206922 222410 222172 261006 200633 194546
8090 194546 262689 278133 247297 261533 237364 271451 260696 203152 223731 218759 235223 290289
8078 290289 275961 239259 226300 264587 316868 311266 291672 304904 287058 318250 310051 315104
8066 315104 320745 308260 341816 308599 282813 266779 265690 236026 227989 279520 312674 360445
8054 360445 371389 342772 308557 266938 308171 382219 430015 449043 373397 317698 276639 230654
8042 230654 293595 355637 392032 388703 379049 326040 293903 291792 300882 344332 300607 231376
$$ packed form
8126B42152k8520k2212N4836R4050k8675J0752K022m1663R484K1111j181M8003
8114C60159m7500j02256p8239m4L3967n441K9729O3133j6258j9604N1813N4927
8102C24386J4057J8942j7189j0225j4956j0536r7557J5488k38L8834o0373o087
8090A94546O8143J5444l0836J4236k4169L4087j0755n7544K0579m972J6464N5066
8078B90289j4328l6702j2959L8287N2281n602j9594J3232j7846L1192q199N053
8066C15104N641j2485L3556l3217k5786j6034j089k9664q037N1531L3154M7771
8054C60445J0944k8617l4215m1619M1233P4048M7796J9028p5646n5699m1059m5985
8042B30654O2941O2042L6395l329r654n3009l2137k111R090M3450m3725o9231
$$ plain form
8030 231376 238509 258616 266715 249633 269375 308257 326681 357175 339210 305078 311867 271110
8018 271110 282672 269249 257013 318048 374365 369538 325295 310253 315292 347398 427956 454260
8006 454260 393174 380682 379834 355405 306366 303938 327159 422241 349370 281413 330791 397311
7994 397311 436700 431437 424982 446692 394647 394832 375110 363654 367301 390521 409626 407273 413988
7981 413988 356718 314837 378061 443172 518281 556044 511480 373957 296852 350569 411799
7970 411799 447220 457775 443640 423971 423882 409875 391910 432286 473212 422982 365232 377671
7958 377671 360250 357943 370718 392652 398235 342627 399607 395189 419594 468858 485231 496714
7946 496714 524030 467781 453034 466006 456763 403801 429402 489206 468044 448549 444548 459909
$$ packed form
8030B31376P133K0107Q099j7082J9742L8882J8424L0494j7965l4132O789m0757
8018B71110J1562j3423j2236O1035N6317m827m4243j5042N039L2106Q0558K6304
8006D54260o1086j2492q48k4429m9039k428K3221R5082p2871o7957M9378O6520
7994C97311L9389n263o455K1710n2045J85j9722j1456L647K3220J9105k353O715
7981D13988n7270m1881O3224O5111P5109L7763m4564j37523p7105N3717O1230
7970D11799L5421J0555j4135j9669q9j4007j7965M0376M0926n0230n7750J2439
7958C77671j7421k307J2775K1934N583n5608N6980m418K4405M9264J6373J1483
7946D96714K7316n6249j4747J2972r243n2962K5601N9804k1162j9495m001J5361
$$ plain form
7934 459909 523899 525483 586479 588290 573428 553855 582271 557636 511557 508457 508047 465573 474463
7921 474463 468086 430149 391639 449180 528558 508698 521654 455161 436529 457469 505214 485155
7909 485155 447324 447166 479198 492652 509195 537968 524213 489448 490223 539592 496608 444204
7897 444204 553053 531749 505918 505829 523548 531149 538784 475827 478273 501512 516132 522549 497014
7884 497014 492466 416635 400294 456500 447105 489968 489385 439814 468427 519494 523910 578211 567702
7871 567702 516126 481653 467614 433624 391416 383497 428835 419017 427202 420010 446433 422390
7859 422390 362697 403073 438039 418261 364723 379540 440620 424717 377300 368786 340307 346754
7847 346754 349416 351157 315940 271429 308606 381783 383153 353171 380205 436865 442483 372724
$$ packed form
7934D59909O3990J584O0996J811j4862j9573K8416k4635m6079l100m10m2474Q890
7921D74463o377l7937l8510N7541P9378j9860J2956o6493j8632K0940M7745k0059
7909D85155l7831j58L2032J3454J6543K8773j3755l4765P75M9369m2984n2404
7897D44204J08849k1304k5831q9J7719P601P635o2957K446K3239J4620O417k5535
7884D97014m548p5831j6341N6206r395M2863n83m9571K8613N1067M416N4301j0509
7871E67702n1576l4473j4039l3990m2208p919M5338r818Q185p192K6423k4043
7859D22390n9693M0376L4966j9778n3538J4817O1080j5903m7417q514k8479O447
7847C46754K662J741l5217m4511L7177P3177J370k9982K7034N6660N618o9759
$$ plain form
7835 372724 312470 266151 303962 276236 301140 321476 339803 328441 341850 364550 356965 387619
7823 387619 341509 280652 240699 287547 308814 295014 289241 300776 305128 329256 329930 339899 291062
7810 291062 336693 378709 382258 362712 348263 289042 236572 208604 219060 213535 141892 175364
7798 175364 236104 239815 264303 281820 267042 276973 237669 230977 238842 252183 231599 213209
7786 213209 197469 189336 201858 223715 179043 132600 174561 168733 128149 77043 114848 162882
7774 162882 188211 191208 196484 174325 134146 54522 33117 102592 201841 219806 203531 154118
7762 154118 92559 84201 65092 53317 110562 96261 133208 180149 178356 138768 166853 206730
7750 206730 276227 245517 185040 132784 133374 148504 187597 217486 213065 153572 65697 55921
$$ packed form
7835C72724o0254m6319L7811k7726K4904K0336J8327j1362J3409K2700p585L0654
7823C87619m6110o0857l9953M6848K1267j3800n773J1535M352K4128O74R969m8837
7810B91062M5631M2016L549j9546j4449n9221n2470k7968J0456n525p1643L3472
7798A75364O0740L711K4488J7517j4778R931l9304o692P865J3341k0584j8390
7786B13209j5740q133J2522K1857m4672m6443M1961n828m0584n1106L7805M8034
7774A62882K5329K997N276k2159m0179p9624k1405O9475R9249J7965j6275m9413
7762A54118o1559q358j9109j1775N7245j4301L6947M6941j793l9588K8085L9877
7750B06730O9497l0710o0477n2256N90J5130L9093K9889m421n9493q7875r776
$$ plain form
7738 55921 81624 103800 61801 61688 36716 66344 102962 64905 43569 31807 82885 85615
7726 85615 103246 94190 104045 96021 99941 43390 18625 26475 46652 75846 172730 157204 81375
7713 81375 62404 97439 127118 39305 -4576 33228 142825 122707 117271 137848 95841 70559
7701 70559 101304 113402 104388 57445 110441 162370 119272 69390 58975 42576 101578 120202
7689 120202 86861 70906 79147 81012 79695 83892 98142 18072 -47742 -30126 -21794 43959 55018
7676 55018 27583 53274 11105 -29316 -9724 65049 96736 57444 61458 70494 54361 85450
7664 85450 70886 60545 64495 65209 66429 45916 7632 35019 24049 9649 27539 44558 39111
7651 39111 67965 83467 79566 111433 133225 122762 77771 73537 72970 68603 567 4451 41493
$$ packed form
7738E5921K5703K2176m1999j13k4972K9628L6618l8057k1336j1762N1078K730
7726H5615J7631r056R855q024L920n6551k4765P850K0177K9194R6884j5526p5829
7713H1375j8971L5035K9679q7813m3881L7804J09597k0118n436K0577m2007k5282
7701G0559L0745J2098r014m6943N2996N1929m3098m9882j0415j6399N9002J8624
7689A20202l3341j5955Q241J865j317M197J4250q0070o5814J7616Q332O5753J1059
7676E5018k7435K5691m2169m0421J9592P4773L1687l9292M014R036j6133L1089
7664H5450j4564j0341L950P14J220k0513l8284K7387j0970j4400J7890J7019n447
7651C9111K8854J5502l901L1867K1792j0463m4991m234n67m367o8036L884L7042
$$ plain form
7638 41493 89795 108464 93066 54159 68586 34079 46563 63727 105308 54317 66251 89104
7626 89104 87162 118462 142593 88823 61368 69309 85532 96009 38678 33176 68929 60271 59001
7613 59001 106798 70334 60 -4786 16293 2578 50788 93975 80041 69417 101823 85570
7601 85570 91381 76841 66571 64948 60284 19577 -40715 -1977 20349 70850 100206 70509
7589 70509 -21218 -73870 -63066 -24066 55798 98456 100865 45450 -25558 -67517 -19019 48391
7577 48391 76668 128476 178652 180425 123212 57952 33864 42110 36126 46210 36382 6846 52440
7564 52440 70887 64473 48247 74642 16930 -10829 26854 49950 52512 61084 60802 72726 104702
7551 104702 64948 18653 -67451 -71383 -49792 26904 50887 89505 141755 82446 56625 88482
$$ packed form
7638D1493M8302J8669j5398l8907J4427l4507J2484J7164M1581n0991J1934K2853
7626H9104j942L1300K4131n3770k7455P941J6223J0477n7331n502L5753q658j270
7613E9001M7797l6464p0274m846K1079j3715M8210M3187j3934j0624L2406j6253
7601H5570N811j4540j0270j623m664m0707o0292L8738K2326N0501K9356k9697
7589G0509r1727n2652J0804L9000P9864M2658K409n5415p1008m1959M8498O7410
7577D8391K8277N1808N0176J773n7213o5260k4088Q246n984J0084r828k9536M5594
7564E2440J8447o414j6226K6395n7712k7759L7683K3096K562Q572k82J1924L1976
7551A04702l9754m6295q6104l932K1591P6696K3983L8618N2250n9309k5821L1857
$$ plain form
7539 88482 63393 49387 42326 6 -19981 -80016 -86620 -124981 -113677 -82736 -43761 10165
7527 10165 17815 -1869 42098 48389 7834 -38074 -51906 -38067 -29911 -52492 -71124 -84155
7515 -84155 -59437 -33494 -27094 -14008 11430 26664 4032 -34689 -64404 -35938 28275 35637
7503 35637 40854 10836 -26082 -18317 21040 -26900 -4009 -8991 -26201 32710 -2291 -21303
7491 -21303 10422 58905 99057 67541 32859 12714 21854 101697 152279 146607 131578 122711
7479 122711 96009 57494 20031 -31380 -30668 19087 73131 83905 45078 -13841 -31280 -20293
7467 -20293 25916 63722 70242 46530 -3627 13638 -8959 -52050 -84117 -26102 -34014 -33365 -18317
7454 -18317 -60177 -64405 2622 41750 8008 -10518 -32513 -45046 -48333 -73382 -61679 -35214
$$ packed form
7539H8482k5089j4006p061m2320j9987o0035o604l8361J1304L0941L8975N3926
7527A0165P650j9684M3967O291m0555m5908j3832J3839Q156k2581j8632j3031
7515h4155K4718K5943O400J3086K5438J5234k2632l8721k9715K8466O4213P362
7503C5637N217l0018l6918P765L9357m7940K2891m982j7210N8911l5001j9012
7491b1303L1725M8483M0152l1516l4682k0145R140P9843N0582n672j5029q867
7479A22711k6702l8515l7463n1411P12M9755N4044J0774l8827n8919j7439J0987
7467b0293M6209L7806O520k3712n0157J7265k2597m3091l2067N8015p912O49J5048
7454a8317m1860m228O7027L9128l3742j8526k1995j2533l287k5049J1703K6465
$$ plain form
7442 -35214 -66639 -15936 675 -2033 -3491 16055 6944 633 -21349 -4187 20073 59332 37248
7429 37248 24454 -6960 -11223 -18629 -38019 -39630 -61191 -90383 -33052 6549 31233 38528 -14057
7416 -14057 -19740 -24200 -12849 -6038 -8996 -39398 -70359 -57211 -93464 -101106 -70540 -26056 -51162
7403 -51162 -112710 -68971 26705 41038 59780 136236 132408 110847 78511 63700 97759 86158
7391 86158 50019 60661 78957 40920 -15691 -74530 -26195 -19625 -27707 -10281 -36213 -13964
7379 -13964 -1616 -18348 12392 47757 69396 60860 22225 26893 27510 12634 20092 35649 24126
7366 24126 13109 3320 2868 48961 60830 -964 -49234 -78516 -38465 46832 17221 576
7354 576 21539 17919 14328 55481 52304 -12306 -36492 -36764 -18246 -57244 -58058 -53922 -63464 -71891
$$ packed form
7442c5214l1425N0703J6611k708j458J9546r111o311k1982J7162K4260L9259k2084
7429C7248j2794l1414m263p406j9390j611k1561k9192N7331L9601K4684P295n2585
7416a4057n683m460J1351O811k958l0402l0961J3148l6253p642L0566M4484k5106
7403e1162o1548M3739R5676J4333J8742P6456l828k1561l2336j4811L4059j1601
7391H6158l6139J0642J8296l8037n6611n8839M8335O570q082J7426k5932K2249
7379a3964J2348j6732L0740L5365K1639q536l8635M668O17j4876P458J5557j1523
7366B4126j1017r789m52M6093J1869o1794m8270k9282M0051Q5297k9611j6645
7354E76K0963l620l591M1153l177o4610k4186k72J8518l8998q14M136r542q427
$$ plain form
7340 -71891 -64037 -25664 2393 -49 58047 34878 -30001 8738 47151 26197 13254 36574
7328 36574 -11511 -47492 3195 34459 -18531 -75738 -60998 9980 26573 22529 23925 9014
7316 9014 -8171 20850 21112 -38545 10819 49390 10580 -9914 12774 -4456 -2562 19674 8213
7303 8213 -43219 -77535 -61558 -26781 89866 126053 63366 34831 32466 18769 -31994 -50354
7291 -50354 -26164 50171 19212 -2668 -58891 -76297 -53582 83008 146875 119454 63424 18443
7279 18443 -46984 -40081 -50137 -34882 -9726 -242 -69746 -68086 -57732 -37570 -56485 -107690
7267 -107690 -148143 -170660 -168984 -123501 -93013 -125009 -118748 -75152 -63806 -32276 -34204 -8300
7255 -8300 -3654 1653 6601 38996 36250 5856 -17982 -44986 -100525 -107003 -47795 -24026 -65203
$$ packed form
7340g1891P854L8373K8057k442N8096k3169o4879L8739L8413k0954j2943K3320
7328C6574m8085l5981N0687L1264n2990n7207J4740P0978J6593m044J396j4911
7316I014j7185K9021K62n9657M9364L8571l8810k0494K2688j7230J894K2236j1461
7303H213n1432l4316J5977L4777J16647L6187o2687k8535k365j3697n0763j8360
7291e0354K4190P6335l0959k1880n6223j7406K2715J36590O3867k7421n6030m4981
7279A8443o5427O903j0056J5255K5156R484o9504J660J0354K0162j8915n1205
7267a07690m0453k2517J676M5483L0488l1996O261M3596J1346L1530j928K5904
7255h300M646N307M948L2395k746l0394k3838k7004n5539o478N9208K3769m1177
$$ plain form
7242 -65203 -76952 -6657 74349 106993 61193 59758 44817 35190 28417 -9848 -37909 -61159
7230 -61159 -91099 -59196 -24914 -37140 -4083 -2145 -32581 -30120 -54849 21916 13163 -32120
7218 -32120 -59190 -85130 -123365 -84746 -27221 -31819 -23244 -9913 51669 30698 34249 27898 33119
7205 33119 -15224 -5464 42123 46011 48610 63933 -2199 -42982 -103145 -78647 -26994 43443
7193 43443 43864 5253 36108 50891 67978 63143 80886 116305 156907 122621 98505 122066
7181 122066 88004 51136 24672 -9420 -1162 6644 -5318 39639 44368 63448 55231 65372
7169 65372 26134 20333 22616 12768 -1166 3515 14744 20440 8704 -10995 -21891 -52935 -67810
7156 -67810 -53827 7590 24217 -22443 -68665 -80072 -16257 14277 24624 21841 17284 -2913
$$ packed form
7242f5203j1749P0295Q1006L2644m5800j435j4941r627o773l8265k8061k3250
7230f1159k9940L1903L4282j2226L3057J938l0436K461k4729P6765q753m5283
7218c2120k7070k5940l8235L8619N7525m598Q575J3331O1582k0971L551o351N221
7205C3119m8343R760M7587L888K599J5323o6132m0783o0163K4498N1653P0437
7193D3443M21l8611L0855J4783J7087m835J7743L5419M0602l4286k4116K3561
7181A22066l4062l6868k6464l4092Q258P806j1962M4957M729J9080q217J0141
7169F5372l9238n801K283r848j3934M681J1229N696j1736j9699j0896l1044j4875
7156f7810J3983O1417J6627m6660m6222j1407O3815L0534J0347k783m557k0197
$$ plain form
7144 -2913 -26097 -49233 -113154 -118902 -79747 -64932 -68657 -45097 -12735 23848 20160 38028 20788
7131 20788 -30120 -68214 -72675 -39797 -11914 -64256 -110489 -87721 -59365 -23937 -12474 -26331
7119 -26331 -2150 -19412 10144 23760 82425 52802 41925 7865 -11570 -23776 33563 4947
7107 4947 7290 29936 52331 96353 65430 25871 -5920 -41324 -62264 -66529 -31754 47527
7095 47527 64100 33652 -11228 -13456 -25126 3994 20144 -40275 -1406 1688 -10357 12945
7083 12945 32921 13730 38093 42927 27257 15564 -12956 -15722 -15770 -13864 1756 1070 -30887
7070 -30887 -43501 -21440 26337 -21571 -22403 -22090 -44767 -55269 -38651 -55201 -72497 -80780 -62491
7057 -62491 -17553 -27258 27267 34518 40410 65156 60203 49247 9143 -47099 -38330 -11692 8845
$$ packed form
7144b913k3184k3136o3921n748L9155J4815l725K3560L2362L6583l688J7868j7240
7131B0788n0908l8094m461L2878K7883n2342m6233K2768K8356L5428J1463j3857
7119b6331K4181j7262K9556J3616N8665k9623j0877l4060j9435j2206N7339k8616
7107D947K343K2646K2395M4022l0923l9559l1791l5404k0940m265L4775P9281
7095D7527J6573l0448m4880k228j1670K9120J6150o0419L8869L094j2045K3302
7083A2945J9976j9191K4363M834j5670j1693k8520k766m8J906J5620o86l1957
7070c0887j2614K2061M7777m7908q32L13k2677j0502J6618j6550j7296q283J8289
7057f2491M4938r705N4525P251N892K4746m953j0956m0104n6242Q769K6638K0537
$$ plain form
7044 8845 -214 -49087 -37015 2175 36045 35079 8091 -7207 -16083 -30548 1341 21068 30347
7031 30347 -25332 -47229 -55020 -11767 271 54908 55524 66099 28605 453 -31465 1740
7019 1740 -14213 -40831 -57751 -27506 9800 -8721 -30338 -73355 -67568 -56329 -38322 -15451
7007 -15451 -16001 6783 -9958 21139 11332 15326 -18873 -90440 -86539 -52527 -23634 -22299 -56628
6994 -56628 -57781 -78955 -102375 -38529 -7531 9994 -37173 -67683 -120230 -142976 -104235 -47227
6982 -47227 -49453 -76664 -104531 -79393 -76942 -37698 -13396 -38096 -20902 4590 -13355 8236
6970 8236 74947 71935 43655 25131 48163 62844 4234 -74136 -86753 -66415 -40471 23919
6958 23919 63009 63222 35383 -16064 -6587 29124 -844 -50201 -53232 -25463 -3745 12622 5732
$$ packed form
7044H845r059m8873J2072L9190L3870r66k6988j5298q876j4465L1889J9727R279
7031C0347n5679k1897p791M3253J2038N4637O16J0575l7494k8152l1918L3205
7019A740j5953k6618j6920L0245L7306j8521k1617m3017N787J1239J8007K2871
7007a5451n50K2784j6741L1097r807L994l4199p1567L901L4012K8893J335l4329
6994e6628j153k1174k3420O3846L0998J7525m7167l0510n2547k2746L8741N7008
6982d7227k226k7211k7867K5138K451L9244K4302k4700J7194K5492j7945K1591
6970H236O6711l012k8280j8524K3032J4681n8610p8370j2617K0338K5944O4390
6958B3919L9090K13k7839n1447R477L5711k9968m9357l031K7769K1718J6367o890
$$ plain form
6945 5732 24997 -11948 -47220 -35486 -17018 -6684 -14273 10153 7381 -25385 -18798 -13125 9610
6932 9610 -8649 20333 17718 3842 -22974 -45141 -45815 -23652 -3252 919 5433 -12958 -5252
6919 -5252 36103 7033 -30716 -32367 -43611 -48289 -43177 -46149 -74393 -40938 17033 59528 52146
6906 52146 7934 -5889 12223 13549 25125 23661 44312 84395 35459 12650 75288 71421
6894 71421 92315 111390 121046 164234 167354 116597 33164 17302 -15717 2887 23080 -19644
6882 -19644 -57609 -21219 20559 -42280 -125852 -86517 43982 69826 -1154 2128 36659 16793
6870 16793 2760 91857 87729 89909 3727 -14677 -30639 -3016 3803 -5157 -42202 -44358 -73204
6857 -73204 -98244 -68197 -31162 -58950 -69637 -50266 -43220 -68980 -71084 -50821 -16095 -23711
$$ packed form
6945E732J9265l6945l5272J1734J8468J0334p589K4426k772l2766O587N673K2735
6932I610j8259K8982k615j3876k6816k2167o74K2163K0400M171M514j8391P706
6919e252M1355k9070l7749j651j1244m678N112k972k8244L3455N7971M2495p382
6906E2146m4212j3823J8112J326J1576j464K0651M0083m8936k2809O2638l867
6894G1421K0894J9075R656M3188L120n0757q3433j5862l3019J8604K0193m2724
6882a9644l7965L6390M1778o2839q3572L9335J30499K5844p0980L282L4531j9866
6870A6793j4033Q9097m128K180q6182j8404j5962K7623O819q960l7045k156k8846
6857g3204k5040L0047L7035k7788j0687J9371P046k5760k104K0263L4726p616
$$ plain form
6845 -23711 -62210 -112236 -110043 -104124 -92696 -82533 -26189 -27324 -7626 -23120 -49331 17920
6833 17920 51782 21165 -6142 -44294 -65691 -82787 -65811 -86198 -67493 -71277 -59980 -57070
6821 -57070 -113829 -150392 -110447 -85635 -37447 -54488 -24734 -49513 -39625 -29597 -38099 -37341 -26846
6808 -26846 -33142 -31539 -57104 -20725 38143 7305 -49437 -28891 -37614 -63939 -63868 -49209 -85158
6795 -85158 -38377 -32044 -55139 -71411 -15924 13427 4514 -42035 -83227 -73600 -13793 39225
6783 39225 30493 -3325 -19756 -75773 -83596 -76476 13006 77624 9179 -55470 -60376 -22087 58448
6770 58448 57705 74285 33357 21269 5903 -38461 -34228 -30092 -88219 -135701 -87080 -25674 5262
6757 5262 -45650 -93923 -87039 -101267 -61352 -102704 -131131 -139800 -69048 23339 90385 38740
$$ packed form
6845b3711l8499n0026K193N919J1428J0163N6344j135J9698j5494k6211O7251
6833A7920L3862l0617k7307l8152k1397j7096J6976k0387J8705l784J1297K910
6821e7070n6759l6563L9945K4812M8188j7041K9754k4779R888J0028q502P58J0495
6808b6846o296J603k5565L6379N8868l0838n6742K0546q723k6325P1J4659l5949
6795h5158M6781O333k3095j6272N5487K9351q913m6549m1192R627N9807N3018
6783C9225q732l3818j6431n6017p823P120Q9482O4618o8445o4649m906L8289Q0535
6770E8448p43J6580m0928j2088j5366m4364M233M136n8127m7482M8621O1406L0936
6757E262n0912m8273O884j4228L9915m1352k8427q669P0752R2387O7046n1645
$$ plain form
6745 38740 25482 33279 45477 59565 92707 130954 95775 -25897 -62794 -34881 -4078 -59721
6733 -59721 -101349 -89075 -29533 21477 -3822 -57256 3889 37169 -6558 -7939 44003 41206
6721 41206 -16809 -8637 -13388 -1752 -10108 -27943 -20230 37158 29565 30479 -20314 -37068 -6823
6708 -6823 -14783 -23171 -30834 -39797 33479 59489 71831 41199 -11345 -8064 6918 38382 80299
6695 80299 74201 57932 49617 3514 66348 103443 133012 149662 158204 144945 86199 16210
6683 16210 -31912 -72202 -52547 -3610 -19247 -60943 -35872 14303 26240 23747 17001 7449
6671 7449 -5970 39238 85086 48136 54004 52309 30808 32403 19549 10622 -51971 -66958 -92744
6658 -92744 -106700 -44586 10957 79142 74084 24363 27770 52533 12135 -49153 -45326 -74742
$$ packed form
6745C8740j3258P797J2198J4088L3142L8247l5179j21672l6897K7913L0803n5643
6733e9721m1628J2274N9542N1010k5299n3434O1145L3280m3727j381N1942k797
6721D1206n8015Q172m751J1636q356j7835P713N7388p593R14n0793j6754L0245
6708f823p960q388p663q963P3276K6010J2342l0632n2544L281J4982L1464M1917
6695H0299o098j6269q315m6103O2834L7095K9569J6650Q542j3259n8746o9989
6683A6210m8122m0290J9655M8937j5637m1696K5071N0175J1937k493o746r552
6671G449j3419M5208M5848l6950N868j695k1501J595j2854q927o2593j4987k5786
6658i2744j3956O2114N5543O8185n058m9721L407K4763m0398o1288L827k9416
$$ plain form
6646 -74742 -61257 -71756 -138916 -156224 -107228 -93568 -105669 -81787 -18511 -47200 -103239 -85306
6634 -85306 -10952 29909 56600 30018 -19786 -58385 -3758 15221 49542 91926 72851 41336
6622 41336 18883 -20435 -38142 -13199 -6079 62064 56520 10959 848 -35603 -15579 35336
6610 35336 98148 93640 107804 80861 -3601 -17546 -40226 -61530 -43171 -103238 -63057 12690
6598 12690 70608 86979 68782 40374 8694 14626 12473 40039 72917 77546 50328 45305 -153
6585 -153 -23791 -18575 -5954 14003 58684 52418 32243 14260 -51137 -86926 -66445 -46300 -2847
6572 -2847 -4741 -18921 -8854 50341 39711 15680 -19722 -69691 -119502 -127898 -122703 -61599 -78834
6559 -78834 -88755 -76540 -68317 -52660 -29056 41547 41463 -1232 31392 -14058 -28246 -12742 -664
$$ packed form
6646g4742J3485j0499o7160j7308M8996J3660j2101K3882O3276k8689n6039J7933
6634h5306P4354M0861K6691k6582m9804l8599N4627J8979L4321M2384j9075l1515
6622D1336k2453l9318j7707K4943P120O8143n544m5561j0111l6451K0024N0915
6610C5336O2812m508J4164k6943q4462j3945k2680k1304J8359o0067M0181P5747
6598A2690N7918J6371j8197k8408l1680N932k153K7566L2878M629k7218n023m5458
6585a53k3638N216J2621J9957M4681o266k0175j7983o5397l5789K0481K0145M3453
6572b847j894j4180J0067N9195j0630k4031l5402m9969m9811q396N195O1104j7235
6559g8834r921J2215Q223J5657K3604P0603q4m2695L2624m5450j4188J5504J2078
$$ plain form
6546 -664 -683 -42784 -58982 -68643 -27365 -34609 -66323 -120396 -104720 -122987 -72777 1737 18161
6533 18161 5109 -72001 -48958 -5755 23071 39224 14836 -9056 32747 53481 13247 -3097
6521 -3097 -68999 -119801 -186842 -134359 -96033 -79250 -111974 -96392 -46120 -40427 -25736 -4703
6509 -4703 -3838 -25686 -56535 -28332 -14758 7970 55308 40589 13112 20204 2384 3908 -10825
6496 -10825 -39366 -53284 -25189 9140 -29361 -42037 -14900 4292 -26763 -28202 -54900 -47930
6484 -47930 -37387 -42722 -30992 7742 27966 -6174 -12409 -243 -21517 -25565 10209 34819
6472 34819 71621 73350 47306 36599 26673 -18952 9567 18614 -10244 -65580 -84606 -36095
6460 -36095 19208 -14671 -45222 -114355 -92288 -76594 -104706 -43626 -16023 -90653 -123794 -88811
$$ packed form
6546f64j9m2101j6198r661M1278p244l1714n4073J5676j8267N0210P4514J6424
6533A8161j3052p7110K3043M3203K8826J6153k4388k3892M1803K0734m0234j6344
6521c097o5902n0802o7041N2483L8326J6783l2724J5582N0272N693J4691K1033
6509d703Q65k1848l0849K8203J3574K2728M7338j4719k7477P092j7820J524j4733
6496a0825k8541j3918K8095L4329l8501j2676K7137J9192l1055j439k6698O970
6484d7930J0543n335J1730L8734K0224l4140o235J2166k1274m048L5774K4610
6472C4819L6802J729k6044j0707r926m5625K8519R047k8858n5336j9026M8511
6460c6095N5303l3879l0551o9133K2067J5694k8112O1080K7603p4630l3141L4983
$$ plain form
6448 -88811 -31374 -25315 33182 -2137 -10797 12432 -20420 7104 86728 121940 90852 91019 55635
6435 55635 -42811 -55431 -31698 38221 64473 16137 -7880 37856 32847 -18232 -33191 -35502
6423 -35502 -22002 56351 56086 36609 30623 -42264 -45031 -73139 -92085 -67086 -8189 1321 -36475
6410 -36475 -15834 14146 14044 19995 66508 86648 70192 70407 26024 25697 2819 3186 -3013 2334
6396 2334 -43525 -54284 39471 109900 86003 101390 41325 12009 -12999 -48871 -99060 -19537
6384 -19537 28143 16620 -5020 -29702 -34060 10165 -1015 42285 15403 24156 40502 70597
6372 70597 36057 -6784 -36574 -91804 -67437 -15920 -40251 -99038 -105981 -51056 -39896 -64818
6360 -64818 -32767 21084 -3273 -19439 -31116 1503 6607 -54869 -75739 -57693 16168 14465
$$ packed form
6448h8811N7437O059N8497l5319q660K3229l2852K7524P9624L5212l1088J67l5384
6435E5635r8446j2620K3733O9919K6252m8336k4017M5736n009n1079j4959k311
6423c5502J3500P8353k65j9477n986p2887k767k8108j8946K4999N8897R510l7796
6410c6475K0641K9980j02N951M6513K0140j6456K15m4383l27k2878L67o199N347
6396B334m5859j0759R3755P0429k3897J5387o0065k9316k5008l5872n0189P9523
6384a9537M7680j1523k1640k4682m358M4225j1180M3300k6882Q753J6346L0095
6372G0597l4540m2841k9790n5230K4367N1517k4331n8787o943N4925J1160k4922
6360f4818L2051N3851k4357j6166j1677L2619N104o1476k0870J8046P3861j703
$$ plain form
6348 14465 19316 78107 61883 38233 -15061 -28524 -26848 -8785 27836 33199 11743 -25763
6336 -25763 9558 49628 44969 24681 19223 51747 74757 13187 -66231 -76112 -53047 -26828
6324 -26828 4531 56220 65006 55305 31621 8199 2940 -2663 -9865 -43180 -51632 -31010 -58683
6311 -58683 -65539 -23215 -12846 -25111 -4293 62260 94264 20764 -24476 6327 28849 -16489
6299 -16489 -15181 36163 61157 30839 -19193 11301 13571 41406 18062 -34902 -25577 -71013
6287 -71013 -52035 -40261 3932 33919 6154 -5703 -18636 -33597 -8591 -53060 -13036 -15338
6275 -15338 5712 -10740 -19891 -21106 -46874 -46941 -96983 -127053 -86111 -75910 -39220 -37510 1695
6262 1695 19874 -5361 -31376 -8288 12709 54493 81750 102658 82954 63622 26128 -285
$$ packed form
6348A4465M851N8791j6224k3650n3294j3463J676J8063L6621N363k1456l7506
6336b5763L5321M0070m659k0288n458L2524K3010o1570p9418r881K3065K6219
6324b6828L1359N1689Q786r701k3684k3422n259n603p202l3315q452K0622k7673
6311e8683o856M2324J0369j2265K0818O6553L2004p3500m5240L0803K2522m5338
6299a6489J308N1344K4994l0318n0032L0494K270K7835k3344n2964R325m5436
6287g1013J8978J1774M4193K9987k7765j1857j2933j4961K5006m4469M0024k302
6275a5338K1050j6452r151j215k5768o7n0042l0070M0942J0201L6690J710L9205
6262A695J8179k5235k6015K3088K0997M1784K7257K0908j9704j9332l7494k6413
$$ plain form
6250 -285 -71802 -107506 -67462 -5258 25712 11793 -51596 -76674 -5214 3724 -47302 -91567
6238 -91567 -72522 -48602 -55006 -67984 -87662 -54221 -11027 -25221 -83517 -105753 -9922 94364
6226 94364 58462 15228 26263 7021 1203 -5810 -43306 -40347 -7523 49012 32459 -56269
6214 -56269 -59119 -67759 -39780 19191 49104 73284 67836 39157 11544 -1962 21085 46869
6202 46869 54980 82076 114732 53234 55213 75715 8148 -24660 36931 24390 29893 43407
6190 43407 5380 35412 92220 59649 38055 31375 38832 68413 61782 54028 8333 -24977 2930
6177 2930 15049 -18369 -33430 -90234 -83961 -38881 -85495 -90241 -96500 -79983 -47212 -62590 -65409
6164 -65409 -84411 -100941 -152934 -170072 -103894 -110671 -134063 -134343 -105658 -5760 47688 61781
$$ packed form
6250b85p1517l5704M0044O2204L0970j3919o3389k5078P1460Q938n1026m4265
6238i1567J9045K3920o404j2978j9678L3441M3194j4194n8296k2236R5831J04286
6226I4364l5902m3234J1035j9242n818p013l7496K959L2824N6535j6553q8728
6214e6269k850q640K7979N8971K9913K4180n448k8679k7613j3506K3047K5784
6202D6869Q111K7096L2656o1498J979K0502o7567l2808O1591j2541N503J3514
6190D3407l8027L0032N6808l2571k1594o680P457K9581o631p754m5695l3310K7907
6177B930J2119l3418j5061n6804O273M5080m6614m746o259J6517L2771j5378k819
6164f5409j9002j6530n1993j7138O6178o777k3392k80K8685R9898N3448J4093
$$ plain form
6152 61781 83733 122427 67125 44409 32846 21262 10630 45865 113752 108059 148918 145976
6140 145976 135214 120960 68908 36750 13340 -27366 -24840 12686 -7606 -55380 -28566 -39463
6128 -39463 -19131 -31007 -68699 -57748 6959 31037 -4446 -31038 -4001 7414 37097 75238
6116 75238 84979 54983 -14320 -54472 -62360 -58143 -30679 -2107 -13510 -49469 -49888 -35456 -24810
6103 -24810 -53945 -38084 -63872 -86869 -76725 -97585 -122821 -103213 -7430 2814 -23382 -30323
6091 -30323 -24671 -2452 -15865 -51194 -12328 47601 23304 -2146 -27173 -30814 -21774 -45183
6079 -45183 -18872 -49471 -20409 5755 -26237 -18683 -15330 -26102 10456 88484 112704 46126
6067 46126 44939 81802 79146 -3093 16986 104549 94597 1945 -20676 -40734 -54234 -70528
$$ packed form
6152F1781K1952L8694n5302k2716j1563j1584j0632L5235O7887n693M0859k942
6140A45976j0762j4254n2052l2158k3410m0706K526L7526k0292m7774K6814j0897
6128c9463K0332j1876l7692J0951O4707K4078l5483k6592K7037J1415K9683L8141
6116G5238R741k9996o9303m0152p888M217K7464K8572j1403l5959m19J4432J0646
6103b4810k9135J5861k5788k2997J0144k0860k5236J9608R5783J0244k6196o941
6091c0323N652K2219j3413l5329L8866N9929k4297k5450k5027l641R040k3409
6079d5183K6311l0599K9062K6164l1992P554L353j0772L6558P8028K4220o6578
6067D6126j187L6863k656q2239K0079Q7563r952r2652k2621k0058j3500j6294
$$ plain form
6055 -70528 -37957 -26095 -18061 628 -58623 -50820 -39104 -9025 20518 52912 30582 15792
6043 15792 61300 93334 105217 52454 29269 24806 38163 34157 64631 -10528 -38390 -8810
6031 -8810 -5632 -721 44769 36679 -11315 15119 79729 61522 -535 -26640 -19391 -58391 -28651
6018 -28651 406 -1032 8439 -23534 -67892 -85661 -63747 -27571 -38319 -112893 -95928 -61914
6006 -61914 -63965 -43308 -7895 -44435 -79750 -49466 -38700 -34063 -14168 -21570 -64718 -103663
5994 -103663 -36952 -27949 -80156 -59756 7233 34513 37131 20592 -10538 -52551 -82765 -55501
5982 -55501 -69193 -79939 -88288 -72811 -26685 -22502 -24339 -65156 -89338 -24333 35006 68117
5970 68117 45837 5207 -9451 6573 26975 -10725 -70838 -71083 -28640 -19078 -42161 -26681
$$ packed form
6055g0528L2571J1862Q034J8689n9251P803J1716L0079K9543L2394k2330j4790
6043A5792M5508L2034J1883n2763k3185m463J3357m006L0474p5159k7862K9580
6031h810L178M911M5490q090m7994K6434O4610j8207o2057k6105P249l9000K9740
6018b8651K9057j438R471l1973m4358j7769K1914L6176j0748p4574J6965L4014
6006f1914k051K0657L5413l6540l5315L0284J0766M637J9895p402m3148l8945
5994a03663O6711R003n2207K0400O6989K7280K618j6539l1130m2013l0214K7264
5982e5501j3692j0746q349J5477M6126M183j837m0817k4182O5005N9339L3111
5970F8117k2280m0630j4658J6024K0402l7700o0113k45M2443R562k3083J5480
$$ plain form
5958 -26681 -31777 -10953 -5349 -14830 -24614 -60235 -105365 -103553 -24401 11695 -33162 -37849 -46668
5945 -46668 -68200 -79721 -105332 -78236 -17569 549 -15987 -44148 -39620 110 45848 63067
5933 63067 29633 -28203 -38912 11495 11070 -24749 -54470 -83440 -38873 -15759 -25682 -99300
5921 -99300 -144733 -79294 17219 62547 -41297 -72149 -56311 -74969 -58149 -55529 -51937 -40971
5909 -40971 -38229 7973 34072 -27416 -19621 -34769 -36692 4971 -21282 -27410 -2454 -15053 -17523
5896 -17523 -44565 -93843 -40613 -18793 -65584 -106164 -100288 -86019 -102877 -91493 -54446 -61176
5884 -61176 -63554 -62535 -58999 -41990 -45464 6568 -10565 -38665 25410 35808 359 -7670 -15184
5871 -15184 -29485 -22455 -7095 1471 -45100 -89263 -116084 -94782 -84759 -44706 4254 71855
$$ packed form
5958b6681n096K0824N604r481r784l5621m5130J812P9152L6096m4857m687q819
5945d6668k1532j1521k5611K7096O0667J8118j6536k8161M528L9730M5738J7219
5933F3067l3434n7836j0709N0407m25l5819k9721k8970M4567K3114r923p3618
5921i9300m5433O5439R6513M5328j03844l0852J5838j8658J6820K620L592J0966
5909d0971K742M6202K6099o1488P795j5148j923M1663k6253o128K4956j2599k470
5896a7523k7042m9278N3230K1820m6791m0580N876J4269j6858J1384L7047o730
5884f1176k378J019L536J7009l474N2032j7133k8100O4075J0398l5449q029p514
5871a5184j4301P030J5360Q566m6571m4163k6821K1302J0023M0053M8960O7601
$$ plain form
5859 71855 63779 8218 -8047 26928 8068 -25828 -89758 -104063 -81497 -55569 -2625 63711
5847 63711 51238 2671 -31732 -28598 -28255 -39521 -8087 -17497 -33073 -36308 -19685 -19635 -21088 -59247
5833 -59247 -107838 -99708 -100660 -95067 -60997 -1057 13755 29842 -7391 -30805 9541 36162 94617
5820 94617 128721 70698 -7423 -37029 -52706 -42780 -42716 -45233 -82836 -51643 29720 90806 51027
5807 51027 -41080 -43323 -5866 -19335 -28614 -39733 -8502 42345 15073 -54179 -59533 -28427
5795 -28427 -52152 -92934 -128830 -142744 -114884 -65583 -73593 -65488 -31059 -47920 12780 19953
5783 19953 14550 1071 37769 79802 98338 101642 65873 37256 64850 69626 79315 73635 19612
5770 19612 41782 12016 -15683 -43242 -40517 -51277 -34164 -37815 -3211 -20498 -4235 -27377
$$ packed form
5859G1855q076n5561j6265L4975j8860l3896o3930j4305K2566K5928N2944O6336
5847F3711j2473m8567l4403L134L43j1266L1434r410j5576l235J6623N0j453l8159
5833e9247m8591Q130r52N593L4070N9940J4812J6087l7233k3414M0346K6621N8455
5820I4617L4104n8023p8121k9606j5677R926O4k517l7603L1193Q1363O1086l9779
5807E1027r2107k243L7457j3469r279j1119L1231N0847k7272o9252n354L1106
5795b8427k3725m0782l5896j3914K7860M9301q010Q105L4429j6861O0700P173
5783A9953n403j3479L6698M2033J8536L304l5769k8617K7594M776R689n680n4023
5770A9612K2170k9766k7699k7559K725j0760J7113l651L4604j7287J6263k3142
$$ plain form
5758 -27377 -17697 30116 14754 13252 -5384 -27818 -34217 -15898 40499 11210 -42297 4243
5746 4243 -7034 -28398 9463 105 22931 13941 70274 77196 45896 64128 25271 20088 15887
5733 15887 55870 45362 -15723 -44488 -73720 -88881 -59596 -1860 -1234 -40910 -48213 -40049 -31766
5720 -31766 10496 45465 -18181 -56681 -73605 -13273 5045 -34378 -23600 -19270 -47224 -47711
5708 -47711 -40305 -23333 4152 -28097 -28559 10010 40692 54580 52364 105582 92108 72118 44202
5695 44202 60319 76752 64065 35860 70289 102353 66236 56885 71247 34172 1167 -4424
5683 -4424 -57820 -77201 -44220 25496 -1121 51892 63939 54316 67989 102648 81866 49539
5671 49539 33474 6343 -48124 -66035 -104832 -129869 -84160 -67123 -42838 -40873 -13834 58737
$$ packed form
5758b7377R680M7813j5362j502j8636k2434o399J8319N6397k9289n3507M6540
5746D243j1277k1364L7861r358K2826q990N6333O922l1300J8232l8857n183m201
5733A5887L9983j0508o1085k8765k9232j5161K9285N7736O26l9676p303Q164Q283
5720c1766M2262L4969o3646l8500j6924O0332J8318l9423J0778M330k7954m87
5708d7711P406J6972K7485l2249m62L8569L0682J3888k216N3218j3474j9990k7916
5695D4202J6117J6433j2687k8205L4429L2064l6117r351J4362l7075l3005n591
5683d424n3396j9381L2981O9716k6617N3013J2047r623J3673L4659k0782l2327
5671D9539j6065k7131n4467j7911l8797k5037M5709J7037K4285J965K7039P2571
$$ plain form
5659 58737 73729 10293 -19122 -8250 35243 53300 36696 40657 76364 122458 110450 44188
5647 44188 54917 74211 42773 -26930 -69942 -55505 -68618 -64332 -14897 30268 15624 -51382
5635 -51382 -67274 -62478 -72248 -64906 -53813 -29403 23947 19100 -17141 -7907 46380 46963 21276
5622 21276 -7159 -45430 -70525 -43867 -8363 48811 75417 71345 16166 -18988 -2007 -2953
5610 -2953 654 -42402 -54631 -55020 -87020 -65968 -78846 -57156 -75530 -150633 -115774 -67926 -2047
5597 -2047 34930 56808 81976 67444 53146 67909 22002 11264 1161 -6695 32549 69337
5585 69337 77433 41425 13036 23327 -11443 -15737 -1759 -5187 -34690 -66976 -27702 26192
5573 26192 21904 8947 14138 -25541 -49731 -44844 -32268 -30203 -42803 -77243 -69726 18467 13931
$$ packed form
5659E8737J4992o3436k9415J0872M3493J8057j6604L961L5707M6094j2008o6262
5647D4188J0729J9294l1438o9703m3012J4437j3113M286M9435M5165j4644o7006
5635e1382j5892M796r770P342J1093K4410N3350m847l6241R234N4287N83k5687
5622B1276k8435l8271k5095K6658L5504N7174K6606m072n5179l5154J6981r46
5610b953L607m3056j2229l89l2000K1052j2878K1690j8374p5103L4859M7848O5879
5597b047L6977K1878K5168j4532j4298J4763m5907j0738j0103p856L9244L6788
5585F9337Q096l6008k8389J0291l4770m294J3978l428k9503l2286L9274N3894
5573B6192m288j2957N191l9679k4190M887J2576K065j2600l4440P517Q8193m536
$$ plain form
5560 13931 -46055 -76566 -46192 -34306 -50279 -17974 24022 -2909 7770 14293 656 -7866
5548 -7866 -12696 -26113 30880 65089 74066 49638 25447 45890 56014 17475 26994 -6755 -62881
5535 -62881 -64003 -72391 -71702 -74831 -38216 -42733 -15530 -47451 -11839 20487 10124 -11090 -7149
5522 -7149 -62732 -61142 -40579 -29058 -38195 -22521 -28762 -71736 13437 58811 37054 60632 45232
5509 45232 38703 9219 -2852 -5017 -55698 -50614 -40683 -51600 -72310 -60863 -9798 22581 -4819
5496 -4819 -40834 -42995 -69238 3282 48170 29070 -5057 7090 -16390 -108878 -163875 -146066
5484 -146066 -126334 -88487 -62552 -86168 -67673 26541 44234 32942 36253 52151 89743 27680
5472 27680 -2148 -12685 -51537 -84615 -77901 -94363 -62705 -66493 -51320 -68761 -57149 -62392
$$ packed form
5560A3931n9986l0511L0374J1886j5973L2305M1996k6931J0679O523j3637q522
5548g866m830j3417N6993L4209Q977k4428k4191K0443J0124l8539R519l3749n6126
5535f2881j122q388O89l129L6615m517K7203l1921L5612L2326j0363k1214L941
5522g149n5583J590K0563J1521r137J5674o241m2974Q5173M5374k1757K3578j5400
5509D5232o529k9484j2071k165n0681N084R931j0917k0710J1447N1065L2379k7400
5496d819l6015k161k6243P2520M4888j9100l4127J2147k3480r2488n4997J7809
5484a46066J9732L7847K5935k3616J8495R4214J7693j1292L311J5898L7592o2063
5472B7680k9828j0537l8852l3078O714j6462L1658l788J5173j7441J1612n243
$$ plain form
5460 -62392 -44877 -642 15395 62602 43619 16390 38980 48049 26455 45126 7145 11757
5448 11757 -3422 -28769 -18628 -13740 24801 52592 -6275 -15517 714 58480 119874 39985
5436 39985 -56169 -73783 -88382 -122723 -118618 -67794 -34197 -45113 -51868 -51521 -44970 -69051 -59425
5423 -59425 -31808 -7583 -25487 -17103 -54388 -94856 -47063 -12286 25549 64131 28189 17286
5411 17286 -7788 -6668 21182 25949 -26671 -39156 -42104 -93210 -32727 26761 -9078 -45017
5399 -45017 7806 -2605 -43036 -62651 -34471 4514 53872 44345 30805 40275 55624 113719
5387 113719 82537 -43306 -71457 -40894 -10465 -22470 -34614 -23959 8550 -10914 -7249 62887
5375 62887 26104 -32914 -20355 -42248 -73642 -43388 -46828 -74741 -60841 -57149 -52425 -4328
$$ packed form
5460f2392J7515M4235J6037M7207j8983k7229K2590R069k1594J8671l7981M612
5448A1757j5179k5347J0141M888L8541K7791n8867r242J6231N7766O1394p9889
5436C9985r6154j7614j4599l4341M105N0824L3597j0916o755L47O551k4081R626
5423e9425K7617K4225j7904Q384l7285m0468M7793L4777L7835L8582l5942j0903
5411A7286k5074J120K7850M767n2620j2485k948n1106O0483N9488l5839l5939
5399d5017N2823j0411m0431j9615K8180L8985M9358r527j3540R470J5349N8095
5387A13719l1182j25843k8151L0563L0429j2005j2144J0655L2509j9464L665P0136
5375F2887l6783n9018J2559k1893l1394L0254l440k7913J3900L692M724M8097
$$ plain form
5363 -4328 80313 90782 67415 35972 9569 -33068 -11418 6449 -36628 -37098 -36756 -20620 -39109
5350 -39109 -25946 -19176 -64574 -31696 -3344 -39511 -56152 -100415 -141241 -102986 -90575 -101091
5338 -101091 -94647 -83970 -30686 29994 -12959 -95726 -122292 -79475 -38712 -23375 -12466 11215
5326 11215 39922 -9744 -56406 -52379 -50145 -71578 10352 44772 23837 6312 -3346 -3049 -15114
5313 -15114 -17240 73400 72907 17193 -30373 -44314 -50118 -30813 -30230 -41785 -47019 -74470 -42853
5300 -42853 -16002 -13004 16946 37272 17280 -62497 -38407 15328 2228 11221 45121 80531
5288 80531 64521 65305 36702 -25949 -10925 31595 2936 -5199 -36878 -76621 -42351 24305
5276 24305 66116 53645 14907 -42428 -74543 -91605 -19920 -9705 -68047 -71537 -40282 9127
$$ packed form
5363d328Q4641J0469k3367l1443k6403m2637K1650J7867m3077m70L42J6136j8489
5350c9109J3163O770m5398L2878K8352l6167j6641m4263m0826L8255J2411j0516
5338a01091O444J0677N3284O0680m2953q2767k6566M2817M0763J5337J0909K3681
5326A1215K8707m9666m6662M027K234k1433Q1930L4420k0935j7525r658K97j2065
5313a5114k126R0640m93n5714m7566j3941n804J9305N83j1555n234k7451L1617
5300d2853K6851K998K9950K0326j9992p9777K4090N3735j3100Q993L3900L5410
5288H0531j6010P84k8603o2651J5024M2520k8659q135l1679l9743L4270O6656
5276B4305M1811j2471l8738n7335l2115j7062P1685J0215n8342l490L1255M9409
$$ plain form
5264 9127 -14585 -3472 -28317 5815 -9744 -67167 -82957 -100314 -84171 -64805 -55000 -62119
5252 -62119 -27489 -13160 13673 8973 -45468 -68763 -47904 -34806 -74154 -127623 -115610 -39750
5240 -39750 7264 25305 63534 58181 54870 63630 -5371 -883 20579 12801 -20090 -65612 -106126
5227 -106126 -93625 -44782 -22642 -19909 7796 -947 -73181 -83228 -87983 -74421 -61279 -85489
5215 -85489 -95891 -60056 -61306 -70033 -87435 -70160 -35397 -29939 -22476 -4973 64920 65489 70667
5202 70667 12682 -7559 -16200 18487 14480 15192 7759 -16445 -19438 -20062 -11987 7843 -12973 -25163
5188 -25163 -11669 -27732 -21228 6732 -4800 -24225 -12482 -5512 -15628 -28669 -44785 -26667
5176 -26667 -13815 36099 26631 -1378 -11345 7075 -481 -43762 -12212 61438 23677 49303
$$ packed form
5264I127k3712J1113k4845L4132j5559n7423j5790j7357J6143J9366R805p119
5252f2119L4630J4329K6833m700n4441k3295K0859J3098l9348n3469J2013P5860
5240c9750M7014J8041L8229n353l311Q760o9001M488K1462p778l2891m5522m0514
5227a06126J2501M8843K2140K733K7705q743p2234j0047m755J3562J3142k4210
5215h5489j0402L5835j250q727j7402J7275L4763N458P463J7503O9893N69N178
5202G0667n7985k0241q641L4687m007P12p433k4204k993o24Q075J9830k0816j2190
5188b5163J3494j6063O504K7960j1532j9425J1743O970j0116j3041j6116J8118
5176b6667J2852M9914r468k8009r967J8420p556m3281L1550P3650l7761K5626
$$ plain form
5164 49303 71038 54606 95081 122710 107624 53374 40243 1009 -4025 -9957 -42306 12059
5152 12059 81178 85960 98197 21222 10267 31376 26210 49561 34303 3142 -22378 -85185
5140 -85185 -114962 -95663 -48290 22245 51589 74176 51158 10535 -19427 -44263 -24446 29524
5128 29524 17889 24948 -35591 -62673 -32789 -34014 6105 15754 -13268 -49053 -11477 -10667 19544
5115 19544 -12005 -30553 -61672 -76092 -44604 -33241 -2002 -22819 -40251 -9979 6007 -43194
5103 -43194 -49553 28299 102799 104100 -2249 -70984 -101640 -86154 -31414 -628 -18529 -19510
5091 -19510 -45725 -35956 -15764 -29197 -23671 -24806 -50006 -42821 -49914 -16946 -12844 -17009 -45666
$$ packed form
5164D9303K1735j6432M0475K7629j5086n4250j3131l9234n034n932l2349N4365
5152A2059O9119M782J2237p6975j0955K1109n166K3351j5258l1161k5520o2807
5140h5185k9777J9299M7373P0535K9344K2587k3018m0623k9962k4836J9817N3970
5128B9524j1635P059o0539k7082K9884j225M0119R649k9022l5785L7576Q10L0211
5115A9544l1549j8548l1119j4420L1488J1363L1239k0817j7432L0272J5986m9201
5103d3194o359P7852P4500J301j06349o8735l0656J5486N4740L0786j7901r81
5091a9510k6215R769K0192j3433N526j135k5200P185p093L2968M102m165k8657
$$ [...]
##END NTUPLES=NMR SPECTRUM
##END=
