##TITLE=Analysis number 321186
Compound Code cc 51301
Book Reference 494/36
Project Code adrs
Chemist Name craigr
##JCAMPDX= 6.0         $$ Bruker NMR JCAMP-DX V2.0
##DATA TYPE= NMR SPECTRUM
##DATA CLASS= NTUPLES
##ORIGIN= Bruker BioSpin GmbH
##OWNER= nmr
$$ XWIN-NMR		Version 3.5
$$ Thu Jul 27 12:55:11 2006 GMT Daylight Time (UT+1h)  MAYBRIDGE\nmr@NMR_250MHZ
##.OBSERVE FREQUENCY= 250.131544655141
##.OBSERVE NUCLEUS= ^1H
##.ACQUISITION MODE= SIMULTANEOUS (DQD)
##.ACQUISITION SCHEME= undefined
##.AVERAGES= 16
##.DIGITISER RES= 18
##SPECTROMETER/DATA SYSTEM= dpx250
##.PULSE SEQUENCE= zg30
##.SOLVENT NAME= CDCl3
##.SHIFT REFERENCE= (INTERNAL, CDCl3, 0, 16.522)
##AUDIT TRAIL= $$ (NUMBER, WHEN, WHO, WHERE, WHAT)
$$ ##TITLE= Audit trail, XWIN-NMR		Version 3.5
$$ ##JCAMPDX= 5.01
$$ ##ORIGIN= Bruker BioSpin GmbH
$$ ##OWNER= nmr
$$ C:\u/data/dgb/nmr/ADRS/3730/pdata/1/auditp.txt
$$ ##AUDIT TRAIL=  $$ (NUMBER, WHEN, WHO, WHERE, WHAT)
(   1,<2006-07-27 12:54:40.63 +100>,<MAYBRIDGE\nmr>,<NMR_250MHZ>,
      <created by zg, POWCHK disabled, PULCHK disabled
       configuration hash MD5:
       E2 DF 36 D8 04 B2 41 60 5A D7 A3 38 5A 4B D0 FE
       data hash MD5: 64K
       71 A0 8B 4D 1F 47 4A AB 23 DF 61 6E 29 2D 0E E7>)
(   2,<2006-07-27 12:54:58.79 +100>,<MAYBRIDGE\nmr>,<NMR_250MHZ>,
      <Start of raw data processing
       ef LB = 0.3 FT_mod = 6 PKNL = 1 SI = 32K 
       data hash MD5: 32K
       82 4A 5A C2 2B B6 99 F5 6A 96 86 7F B7 55 B2 30>)
(   3,<2006-07-27 12:55:00.58 +100>,<MAYBRIDGE\nmr>,<NMR_250MHZ>,
      <apk 
       data hash MD5: 32K
       83 ED 57 8C 48 20 3A A6 D5 9D 04 04 E8 51 95 3A>)
(   4,<2006-07-27 12:55:01.44 +100>,<MAYBRIDGE\nmr>,<NMR_250MHZ>,
      <abs ABSG = 5 
       data hash MD5: 32K
       D3 38 03 A2 A0 A2 37 1A D8 D3 60 AF 89 44 00 85>)
$$ ##END=
$$ 
$$ hash MD5
$$ CD 8C 25 53 35 8E 4A 7B 89 04 20 28 22 31 3C EE
##$RELAX= 
##$RELAX= 
##$RELAX= 
##$RELAX= 
##$RELAX= 
##$RELAX= 
##$RELAX= 
$$ Bruker specific parameters
$$ --------------------------
##$DU= <C:\u>
##$EXPNO= 3730
##$NAME= <ADRS>
##$PROCNO= 1
##$TYPE= <nmr>
##$USER= <dgb>
##$AMP= (0..31)
100 100 100 100 100 100 100 100 100 100 100 100 100 100 100 100 100 100 
100 100 100 100 100 100 100 100 100 100 100 100 100 100 
##$AQSEQ= 0
##$AQ_mod= 3
##$AUNM= <au_zg>
##$AUTOPOS= <31 >
##$BF1= 250.13
##$BF2= 250.13
##$BF3= 250.13
##$BF4= 250.13
##$BF5= 500.13
##$BF6= 500.13
##$BF7= 500.13
##$BF8= 500.13
##$BYTORDA= 1
##$CFDGTYP= 0
##$CFRGTYP= 5
##$CHEMSTR= <none>
##$CNST= (0..31)
1 1 145 1 1 1 1 1 1 1 1 1 1 1 1 1 1 1 1 1 1 1 1 1 1 1 1 1 1 1 1 1 
##$CPDPRG= <>
##$CPDPRG1= <>
##$CPDPRG2= <>
##$CPDPRG3= <>
##$CPDPRG4= <mlev>
##$CPDPRG5= <mlev>
##$CPDPRG6= <mlev>
##$CPDPRG7= <mlev>
##$CPDPRG8= <mlev>
##$CPDPRGB= <>
##$CPDPRGT= <>
##$D= (0..31)
0 1 0 0 0 0 0 0 0 0.06 0 0 0 0 0 0 0.0002 0 0 0 0 0 0 0 0 0 0 0 0 0 0 
0 
##$DATE= 1154001279
##$DBL= (0..7)
120 120 120 120 120 120 120 120 
##$DBP= (0..7)
150 150 150 150 150 150 150 150 
##$DBP07= 0
##$DBPNAM0= <>
##$DBPNAM1= <>
$$ [...]
##$SUBNAM7= <"">
##$SUBNAM8= <"">
##$SUBNAM9= <"">
##$SW= 20.6930455092707
##$SWIBOX= (0..15)
0 0 3 0 0 0 0 0 0 0 0 0 0 0 0 0 
##$SW_h= 5175.983436853
##$TD= 65536
##$TD0= 1
##$TE= 295.16
##$TE2= 300
##$TE3= 300
##$TEG= 300
##$TL= (0..7)
0 120 120 120 120 120 120 120 
##$TP= (0..7)
150 150 150 150 150 150 150 150 
##$TP07= 0
##$TPNAME0= <>
##$TPNAME1= <>
##$TPNAME2= <>
##$TPNAME3= <>
##$TPNAME4= <>
##$TPNAME5= <>
##$TPNAME6= <>
##$TPNAME7= <>
##$TPOAL= (0..7)
0.5 0.5 0.5 0.5 0.5 0.5 0.5 0.5 
##$TPOFFS= (0..7)
0 0 0 0 0 0 0 0 
##$TUNHIN= 0
##$TUNHOUT= 0
##$TUNXOUT= 0
##$USERA1= <user>
##$USERA2= <user>
##$USERA3= <user>
##$USERA4= <user>
##$USERA5= <user>
##$V9= 5
##$VALIST= <valist>
##$VCLIST= <CCCCCCCCCCCCCCC>
##$VD= 0
##$VDLIST= <DDDDDDDDDDDDDDD>
##$VPLIST= <PPPPPPPPPPPPPPP>
##$VTLIST= <TTTTTTTTTTTTTTT>
##$WBST= 1024
##$WBSW= 4
##$XGAIN= (0..3)
0 0 0 0 
##$XL= 0
##$YL= 0
##$YMAX_a= 257414
##$YMIN_a= -423026
##$ZGOPTNS= <>
##$ZL1= 120
##$ZL2= 120
##$ZL3= 120
##$ZL4= 120
##$ABSF1= 16.522
##$ABSF2= -4.171173
##$ABSG= 5
##$ABSL= 3
##$ALPHA= 0
##$AQORDER= 0
##$ASSFAC= 0
##$ASSFACI= 0
##$ASSFACX= 0
##$ASSWID= 0
##$AUNMP= <proc_1d>
##$AZFE= 0.1
##$AZFW= 0.1
##$BCFW= 0
##$BC_mod= 0
##$BYTORDP= 0
##$COROFFS= 0
##$CY= 12.5
##$DATMOD= 1
##$DC= 0
##$DFILT= <>
##$DTYPP= 0
##$F1P= 14.0000005364418
##$F2P= -0.99999901652339
##$FCOR= 0.5
##$FTSIZE= 32768
##$FT_mod= 6
##$GAMMA= 0
##$GB= 0
##$INTBC= 1
##$INTSCL= 1
##$ISEN= 128
##$LB= 0.3
##$LEV0= 0
##$LPBIN= 0
##$MAXI= 10000
##$MC2= 0
##$MEAN= 0
##$ME_mod= 0
##$MI= 0
##$NCOEF= 0
##$NC_proc= -5
##$NLEV= 6
##$NOISF1= 0
##$NOISF2= 0
##$NSP= 0
##$NTH_PI= 0
##$NZP= 0
##$OFFSET= 16.522
##$PC= 1
##$PHC0= 150.4803
##$PHC1= 34.05441
##$PH_mod= 1
##$PKNL= yes
##$PPARMOD= 0
##$PSCAL= 4
##$PSIGN= 0
##$REVERSE= no
##$SF= 250.13
##$SI= 32768
##$SIGF1= 0
##$SIGF2= 0
##$SINO= 400
##$SIOLD= 32768
##$SREGLST= <1H.CDCl3>
##$SSB= 0
##$STSI= 32768
##$STSR= 0
##$SW_p= 5175.98343685301
##$SYMM= 0
##$S_DEV= 0
##$TDeff= 65536
##$TDoff= 0
##$TI= <Analysis number 999999
Compound Code 99
Book Reference 9
Project Code 9>
##$TILT= no
##$TM1= 0
##$TM2= 0
##$TOPLEV= 0
##$USERP1= <user>
##$USERP2= <user>
##$USERP3= <user>
##$USERP4= <user>
##$USERP5= <user>
##$WDW= 1
##$XDIM= 32768
##$YMAX_p= 389097779
##$YMIN_p= -931811
$$ End of Bruker specific parameters
$$ ---------------------------------
##NTUPLES= NMR SPECTRUM
##VAR_NAME=  FREQUENCY,     SPECTRUM/REAL,   SPECTRUM/IMAG
##SYMBOL=    X,             R,               I
##VAR_TYPE=  INDEPENDENT,   DEPENDENT,       DEPENDENT
##VAR_FORM=  AFFN,          ASDF,            ASDF
##VAR_DIM=   32768,         32768,           32768
##UNITS=     HZ,            ARBITRARY UNITS, ARBITRARY UNITS
##FACTOR=    0.157963299565203, 1,           1
##FIRST=     4132.6476996994, 0,             0
##LAST=      -1043.33573715361, 0,           0
##MIN=       -1043.33573715361, -931811,     0
##MAX=       4132.6476996994, 389097779,     0
$$ Real data points
##PAGE= N=1
##DATA TABLE= (X++(R..R)), XYDATA
$$ [...]
19080 28513115 28309932 27991936 27761071 27383034 27049554 26621465 25954156 24786780 23680631
19071 23680631 22097872 20515612 19008212 17858866 16952007 15820553 14821249 13776970
19063 13776970 12880439 11980602 11404707 10931965 10473345 9783644 9096233 8497555 8069494
19054 8069494 7760290 7620478 7535694 7283429 6890011 6795645 6641132 6688357 6555461 5997804
19044 5997804 5679753 5619132 5497627 5497903 5198879 5087517 5140894 5278665 5476942 5597541
19034 5597541 5513174 5305289 5206436 5249946 5078815 5186729 5300356 5184138 5157196 5094871
19024 5094871 5171971 5195462 5295507 4989364 4818704 4698837 4676725 4774307 4788435 4827975
19014 4827975 4582057 4598453 4778206 4594697 4508093 4599689 4569801 4367651 4283116 4160243
19004 4160243 4183972 4132270 4160289 4138157 4197335 4026148 4087223 4038190 3798038 4058645 4037338
18993 4037338 3909107 3838583 3773506 4034478 4108580 3967634 3692654 3715956 3897710 3923151
18983 3923151 4041114 3788050 3795307 3855689 3863235 3792588 3632217 3556255 3493910 3454474 3582029
18972 3582029 3546504 3399915 3207537 3348961 3360621 3273891 3396769 3418539 3445992 3203728
18962 3203728 2989334 2708816 2657496 2840892 2867365 2856423 2633197 2796752 3016165 3020830
18952 3020830 2908850 2627928 2501118 2268760 2137310 2337551 2561395 2545447 2534580 2372362
18942 2372362 2163625 2233458 2213622 2170328 2127368 1900023 1978458 2105443 2059093 1826821
18932 1826821 1782120 1926646 1952468 1958373 1901639 1778129 1781339 1829187 1531614 1562412 1598584
18921 1598584 1508417 1528199 1404599 1333481 1264150 1301521 1305289 1102709 1166653 1158976 1210677
18910 1210677 1455356 1544456 1587175 1571529 1655577 1492442 1327881 1466009 1420767 1283250
18900 1283250 1404582 1727518 1758050 1743377 1875128 1869887 1512650 1305695 1359279 1408570
18890 1408570 1162594 1170803 1066729 1116379 1049675 835067 806699 845695 784506 769971 1005683
18879 1005683 1253607 1273407 1428635 1414781 1119653 964972 1140872 1073552 1311392 1238078
18869 1238078 1095263 1069347 988667 1064457 1006102 805983 802624 1066039 1069889 848357 832149
18858 832149 890810 997591 1209711 1154115 1260947 1346022 1395992 1620686 1773836 1550754
18848 1550754 1570438 1644798 1601862 1523378 1393368 1523372 1586576 1420351 1524477 1551050
18838 1551050 1383321 1178937 835465 743312 872584 1224220 1483525 1475551 1411081 1174574
18828 1174574 933219 985422 1182539 1376717 1363047 1395160 1302143 1141332 1292851 1401784
18818 1401784 1353478 1433323 1588334 1313706 1307067 1637578 1560012 1254853 1261612 1437912 1551694
18807 1551694 1529845 1404225 1613220 1831448 2029204 2037520 1951421 1896455 1774028 1560059
18797 1560059 1575315 1692457 1787525 1912662 1779529 1749707 1822294 1960823 1810248 1584291
18787 1584291 1927730 2149983 2205405 1840597 1623662 1491489 1418210 1550525 1847300 1914995
18777 1914995 1770255 1571994 1687499 1807516 2006459 2006376 1817589 1558252 1356653 1634428
18767 1634428 1782496 1776475 1766825 1836091 2001320 2002678 1823211 1693733 1634430 1531225 1355492
18756 1355492 1171140 1099564 1093847 1213320 1113176 1312837 1390519 1212641 1251864 1353229
18746 1353229 1220214 1094339 1062318 1047148 1047729 1220591 1218506 1266678 1240074 1411225 1359236
18735 1359236 1291012 1269079 1149951 1056679 957934 933235 1033447 1097044 1235119 1402630
18725 1402630 1280678 1419523 1575241 1471056 1546113 1550616 1501226 1636469 1687755 1505086
18715 1505086 1294653 1047848 948740 906505 1093835 1256694 1474509 1258896 1043900 976719
18705 976719 1087593 1155789 1041546 1446076 1504558 1455902 1621077 1478773 1287138 1130573
18695 1130573 930281 955295 905574 736384 859733 1016680 958600 846250 713465 693641
18685 693641 736546 791303 816878 856723 943585 700677 721130 763973 819651 1178443 1399722
18674 1399722 1363609 1149174 1040066 1166953 1400106 1663953 1357172 938183 878062 913863
18664 913863 998329 1038893 1058230 1218455 1282735 1341801 1593731 1735251 1336658 1121159
18654 1121159 1041653 856760 828072 741286 844589 932165 1083680 1087776 1022310 1005651 992617
18643 992617 1021701 1120536 1320774 1430407 1665997 1581942 1388505 1223258 1288800 1149323
18633 1149323 1108299 916517 862465 894118 825737 950483 957964 969013 986998 1133753 1314325
18622 1314325 1440093 1541035 1581010 1277923 1020716 827625 992585 1047648 1007551 998910
18612 998910 1374872 1498540 1451128 1359712 1196693 1184064 1380494 1138069 949942 1127234
18602 1127234 1316296 1550213 1645682 1393414 1112465 1195217 1140372 1361962 1506451 1347550
18592 1347550 1194927 1203314 1200109 1239287 1007740 1097875 1324014 1333128 1296044 1247583 1519874
18581 1519874 1671649 1507161 1358160 1212435 1227303 1424357 1275676 1147935 1475366 1580759
18571 1580759 1532091 1685263 1693186 1662518 1702988 1698995 1427960 1405717 1515623 1540589 1502745
18560 1502745 1455929 1457386 1603674 1658770 1630828 1571905 1341621 1243443 1356257 1663254 1710940
18549 1710940 1430425 1360905 1368251 1290253 1348909 1547062 1530906 1408922 1476380 1758280 1676816
18538 1676816 1620164 1838159 2140611 1950895 1904407 1909650 1895898 1949738 1972773 2024701 2008485
18527 2008485 1743854 1808750 1856179 1858964 1853788 1811875 1928230 1963360 1822053 1901928 2095889
18516 2095889 2063902 2152271 2341015 2295223 2334208 2364847 2415702 2610933 2667112 2658051 2708761
18505 2708761 2437231 2307061 2190491 2117883 2034749 1757865 1747391 1913238 2106963 2182341
18495 2182341 2153220 1964136 1877288 1913832 1964434 2163380 2381168 2422870 2213840 2279303
18485 2279303 2240008 2109998 2166759 2269772 2398210 2346277 2392806 2567651 2737583 2941217
18475 2941217 2960399 3198244 3256912 3177249 3029868 2997443 3261666 3381283 3300641 3577942
18465 3577942 3705774 3734440 3729830 3786218 4003447 4041034 3963555 3732038 3937555 4359011
18455 4359011 4566590 4640056 5027667 5289242 5559528 5867749 6284717 6864111 7140020 7625963
18445 7625963 8142662 8532310 8760260 9079151 9581391 10209738 10734897 11443952 12330445
18436 12330445 12825595 13171073 13321656 13332955 13387732 13360502 13200131 13394020 13395953 13169851
18426 13169851 13097359 13159897 13126853 12926858 12390515 12160998 11922675 11433883 10968601 10686508
18416 10686508 10450838 10397373 10171375 9764179 9504404 9649909 9750515 9840339 10097284 10312295
18406 10312295 10532793 10947907 11231178 11640666 12340147 13169224 14078532 14877863 15667266
18397 15667266 16417026 17203552 18175789 19440582 20594054 21571760 22813608 24074876 25024865
18388 25024865 25722985 26379228 26769336 27232147 27841173 28073308 28000610 27995001 28108239 27763294
18378 27763294 26978341 26684800 26355966 25855745 25254016 24633378 23756004 22735249 21741360
18369 21741360 20782887 19501640 18516683 17508851 16538601 15701525 15038815 14471094 13956667
18360 13956667 13294389 12969021 13008679 12927654 12783009 12542977 12466086 12601400 12750058 12927450
18350 12927450 12886373 13211725 13760597 14366716 14920276 15504678 15932063 16400769 16963851
18341 16963851 17584546 18230440 19148115 19841054 20259318 20775977 20953423 20487310 20109059
18332 20109059 20059093 19905703 19566151 19265796 19256631 19115709 18775023 18368307 17763262 17090982
18322 17090982 16493745 15595555 14567238 13887309 13455891 12951161 12384254 11753858 11149535
18313 11149535 10563545 10219715 9874498 9505817 8993915 8679065 8433576 8026321 7654639
18304 7654639 7472647 7277759 6843702 6777972 6753782 6862550 6910754 6799514 6788934 6827233
18294 6827233 6839250 6711748 6677430 6491040 6535253 6462514 6347936 6231176 6328484 6263546
18284 6263546 6004479 6223428 6267541 5953179 5930195 6015989 6021141 6032408 6044213 5998690 6217235
18273 6217235 6425940 6304957 5958654 6159790 6478011 6471759 6198086 5912618 5751655 6031214
18263 6031214 6501920 6608970 6502169 6550002 6400545 6127932 6541422 6844585 6648066 6435043
18253 6435043 6368994 6385153 6347850 6169291 5960640 5875765 5814889 5898767 5872882 5808215 5826451
18242 5826451 5628921 5567286 5702716 5836816 5979117 5686838 5400536 5316262 5054927 4967178
18232 4967178 5025538 5001304 5039058 5103879 4978755 4695629 4471007 4636052 4757707 4632281
18222 4632281 4776031 4603392 4548698 4655493 4746127 4766681 4797757 4632063 4583035 4379953
18212 4379953 4419490 4335663 4207148 4250889 4245045 4295348 4679356 4710202 4632311 4595105 4414092
18201 4414092 4390723 4530578 4452379 4159623 4204421 4072933 4151758 3950633 3879385 4004383
18191 4004383 4068103 3907849 3760934 3806661 3937769 4121216 3989521 3959745 4048335 4218016
18181 4218016 4284103 4467678 4504991 4472878 4472155 4206358 4029274 4081936 4165128 4081656 4108483
18170 4108483 4396078 4695177 4767443 4696750 4536917 4756054 4980119 5081529 5179457 5251591
18160 5251591 5371325 5272908 5309256 5467762 5395411 5115792 5546501 5945001 6060181 6338919
18150 6338919 6712345 7082205 7284279 7338233 7600459 7745870 8011624 8502918 9044751 9620700
18140 9620700 10161072 10556584 11346128 12048915 12696800 13219200 14205532 15268927 16767026
18131 16767026 18438082 19838947 21218297 22606016 24574577 27332874 30070778 33097108
18123 33097108 36907265 41065173 45402728 49604094 53226425 55614132 57724711 60075122
18115 60075122 62751095 66363935 71494076 77212723 81405027 83029605 82050522 78847812
18107 78847812 73998457 68863806 64184314 59508119 54698235 50034387 45541077 41122023
18099 41122023 37152868 33746596 30783811 28274430 26143753 24358991 22388684 20738471
18091 20738471 19525865 18515394 17729318 16889772 15823050 14827147 14207788 13774072 13308759
18082 13308759 12740595 12447278 11967164 11753471 11485274 11231292 10857044 10587195 10123218
18073 10123218 9771630 9679586 9578551 9652439 9598467 9483728 9311717 9193526 8912782 8942601
18063 8942601 8889211 8794974 8717508 8706717 8862560 8599014 8601919 8477881 8319419 8219047
18053 8219047 8085833 8180481 8188525 7888197 7882563 7889765 7831179 7742514 7898552 7815120 7567015
18042 7567015 7604642 7608236 7765398 7931698 7840687 7636247 7510417 7537751 7559453 7548891 7470712
18031 7470712 7697826 7549147 7373077 7593993 7661442 7959469 8145468 8068341 7941224 7912692
18021 7912692 8023943 8118408 8063430 8264235 8171316 8077913 8123597 8090354 8000184 8152723 8320747
18010 8320747 8432413 8550610 8374595 8509058 8657780 8760071 8634419 8620692 8785664 8589320
18000 8589320 8490241 8525599 8389500 8440853 8466108 8642777 8611350 8347003 7897015 7287123
17990 7287123 7158569 7157448 7140695 6919013 6860057 6870779 6960675 6907955 6717591 6692059 6592594
17979 6592594 6363954 6340001 6348232 6200373 6221916 6141164 6115378 5746824 5815487 6098568 6273767
17968 6273767 6427045 6120652 5872420 5997003 6173610 6193840 6302188 6392266 6263893 6213019
17958 6213019 6302245 6170725 5997521 6257897 6335874 6182329 6234018 6403481 6622409 6933646
17948 6933646 6903357 6834205 6722377 6770429 6957592 6771794 6764310 6752926 6547727 6658143
17938 6658143 7058003 7292875 7590213 7694833 8048889 7903507 7793796 7978892 8573160
17929 8573160 8953751 9224159 9595487 10126206 10684770 11178390 11540369 11925112 12715289
17920 12715289 13468402 14351675 15095085 15993976 16759751 17561219 18664072 19593930 20351400
17911 20351400 20871409 21361093 21639277 21939215 21855316 21646960 21738605 21926298 21268795 20380578
17901 20380578 19773214 19115899 18109608 17501715 16761473 15909431 15250425 14635264 13933893
17892 13933893 13550886 13559202 13416960 13316425 13280084 13129773 12884825 12902542 13008497 13347588
17882 13347588 13947033 14439204 14984461 15451756 15946625 16402874 17266680 18282919 19425516
17873 19425516 20720580 21509876 22590163 23896604 25053048 26465732 27847850 29221813
17865 29221813 30724826 32061964 33117016 33931454 34355499 34506676 34671844 34751677 34525739
17856 34525739 34082532 33492233 32520586 30980526 29066666 27394611 25971018 24642707
17848 24642707 23591258 22719287 21736881 20738182 19763072 19035197 18455558 17940373 17773480
17839 17773480 17582808 17387223 17256233 17172425 17317825 17598172 17582695 17719384 18164844 18623748
17829 18623748 19373043 20130126 20856715 21987432 23086578 23961406 25040849 26415856 27944854
17820 27944854 29437345 31291967 33176712 35153628 37101454 38837437 40159412 41634367
17812 41634367 43079532 44556403 46135403 47662486 49007404 49739967 50135043 49750613
17804 49750613 49174244 48678915 47966355 46988350 45713441 44351599 42762325 41072720 39357870
17795 39357870 37305406 35132258 33151767 31373482 29558079 28142421 26855312 25339894
17787 25339894 24035736 23156675 22457514 21611300 21116424 20760297 20539263 20029825 19713718
17778 19713718 19556355 19438676 19459907 19523401 19657677 19890142 20284320 20759924 21264724 21820292
17768 21820292 22406884 23155592 23806536 24814843 25879034 26742096 28144390 29226163 30156059
17759 30156059 30928774 32021895 33502845 34537490 35365948 36057709 36544916 36791758 37133466
17750 37133466 37117660 36908832 36503978 35852709 34792676 33616933 32423894 30879342 29242969
17741 29242969 27597914 26158472 24933234 23609464 22367245 21422497 20317688 19533976
17733 19533976 19014712 18611385 18056891 17235382 16558555 16033665 15653361 15551319 15246300
17724 15246300 14974418 14700463 14310261 13880139 13763499 14043993 13746260 13395531 13453679
17715 13453679 13557154 13246584 13061005 13255201 13140510 12858885 12683949 12753955 12870697
17706 12870697 12983353 12865326 12980633 12956705 12709557 12561068 12463822 12327974 12469538 12532451
17696 12532451 12473995 12422610 12162210 11884413 11985186 11821715 11584934 11538710 11544364 11631703
17686 11631703 11656368 11437799 11423903 11702615 11629470 11602433 11140028 10612554 10503836 10622491
17676 10622491 10904521 10933223 10978531 11026923 10662570 10651623 10800388 10736397 10759963 10855470
17666 10855470 10822264 10920000 11078725 11088607 10823232 10823038 10851260 11014387 10853800 10525838 10400270
17655 10400270 10190927 10409058 10664584 10794639 10886425 10969783 10898596 10902284 10892348 10457982
17645 10457982 10488915 10733078 10835163 10908811 10983877 11116461 10965771 10853825 10813781 10964168
17635 10964168 11076714 10913423 10841762 10807438 10773934 10891512 10858851 10731939 10693050 10846239
17625 10846239 10645735 10289309 9944775 9981653 10061943 10013141 9938263 10066717 10446557 10459293
17615 10459293 10204071 9826854 9878551 10129610 10133170 10022369 9942293 10115741 10140132 10005588
17605 10005588 10030316 10175408 9958358 10032635 10185627 10067483 9828060 9864119 10034677 10212058
17595 10212058 10219514 10128210 10052487 9922287 9914897 10178196 10213897 10343786 10620588 10628509 10711179
17584 10711179 10718966 10527059 10344934 10399790 10516477 10624900 10686730 10601315 10542931 10552513 10575630
17573 10575630 10607181 10720310 10607468 10638929 10727784 10877288 10977326 11009905 11246532 11222949
17563 11222949 11257062 11358562 11352999 11215328 11048196 11047320 11042805 11100396 11308808 11525805 11695156
17552 11695156 11565135 11467261 11354909 11123086 11051088 11173662 11482606 11227961 11123128 11285834
17542 11285834 11443154 11477025 11639017 11645204 11423703 11336949 11257323 11368542 11411732 11244546
17532 11244546 11287320 11523655 11699342 11826720 11708702 11513254 11619942 11879247 12255471
17523 12255471 12185022 12129903 12236919 12325506 12501021 12546204 12429993 12588750 12641114 12678372
17513 12678372 12658429 12569851 12448436 12499678 12396443 12393555 12522127 12469024 12402067 12280007
17503 12280007 12422613 12663869 12902369 12993809 13001470 12856724 12680539 12664045 12718829 12855367
17493 12855367 12826727 12676259 12769738 12688845 12533967 12476791 12389467 12467987 12561722 12576071 12507536
17482 12507536 12865571 13005710 13073914 12834455 12811470 12710281 12569472 12590746 12678739 12664570
17472 12664570 12781735 12654186 12759402 12865204 12788502 12663815 12907373 12882309 12603129 12674324
17462 12674324 12694757 12791554 12842601 12915573 12853904 12731604 12848856 12862506 12864092 12949113 13160689
17451 13160689 13449511 13513981 13463270 13092951 13029166 13030048 13013309 12893534 12961819 12731727 12743021
17440 12743021 12842495 12877278 12770594 12642725 12531189 12491548 12421439 12242257 12190154 12156743
17430 12156743 12190194 12434412 12439162 12509831 12369451 12395181 12467444 12367787 12269946 12181002 12075244
17419 12075244 11934322 12042878 12004812 12088924 12006614 11932630 11945916 12093621 12065588 12004080
17409 12004080 11764446 11583321 11590751 11495217 11599689 11694074 11525487 11450603 11512870 11691274
17399 11691274 11823810 11771689 11874123 12047879 12093778 12022063 11708616 11675725 11621845 11155908
17389 11155908 10940194 11053418 11190417 11256099 11191267 10969834 11108049 11180018 11074928 11100222
17379 11100222 11153286 11295356 11294400 11218054 11235068 11163866 10814204 10631715 10664019 10656665 10532731
17368 10532731 10680470 10744461 10914920 11052003 10968100 10862623 10635752 10413178 10386083 10300146
17358 10300146 10283028 10342782 10326659 10442556 10371337 10280541 10266947 10330143 10315902 10383469 10548791
17347 10548791 10537097 10335312 10124988 9904051 9670283 9686993 9816756 9908338 9795362 9787696
17337 9787696 9786099 9742290 9807372 9614031 9538146 9698329 9792099 9749419 9635143 9610747 9567924
17326 9567924 9540461 9507367 9665703 9706222 9466123 9255517 9107272 9145355 9204148 9316672
17316 9316672 9241378 9125221 8935473 8932814 9175372 9181263 8939806 8993327 8867600 8929883 8759724
17305 8759724 8594408 8661522 8821547 8796235 8797219 9029054 9073000 8880975 8475823 8290208
17295 8290208 8348044 8041526 7875460 7930002 8236558 8290231 8115687 8027564 8055693 7941288
17285 7941288 7702237 7608051 7527707 7498986 7828187 7931810 7888857 7794930 7838914 7774876 7710308
17274 7710308 7442404 7397799 7398621 7511237 7478064 7158480 6968964 7079928 7079496 7152643 7227051
17263 7227051 7204823 7181707 7260744 7212367 7362013 7367338 7332053 7322724 7334793 7423151 7352119
17252 7352119 7247622 7302449 7408585 7179898 6845476 6760323 6649157 6669919 6704256 6645989
17242 6645989 6445449 6151349 6126914 6161681 6078860 6047102 5959986 6173255 6239274 6238516 6180490
17231 6180490 6226233 6312986 6159047 5943182 5837233 5729580 5650519 5526460 5531232 5699352
17221 5699352 5617778 5436645 5520675 5654219 5766921 5860487 5910434 5747538 5637977 5361233
17211 5361233 5334481 5501064 5232866 5224356 5526496 5564596 5564395 5366562 5233941 5107799 5007088
17200 5007088 4961015 4826252 4756518 5016197 5066866 5067428 4997458 5099850 5055086 4829712 4715582
17189 4715582 4667319 4594276 4274909 4054524 4064655 4245216 4311193 4364549 4523127 4569631
17179 4569631 4427332 4278357 4202003 4259988 4416268 4718506 4876000 4591759 4274611 4539087
17169 4539087 4419585 4249475 4143016 4098202 4243160 4336944 4326872 4400773 4372277 3991902
17159 3991902 3826469 3965050 3989868 3902295 3863479 3844676 3768035 3584652 3548372 3493072 3550027
17148 3550027 3544686 3405644 3570785 3758836 3819437 3733000 3765206 3659411 3431166 3653536
17138 3653536 3895585 3795614 3627751 3504486 3383586 3292674 3338937 3362688 3476708 3520761
17128 3520761 3229935 3191292 3180345 3106957 3212299 3305483 3437590 3534901 3384985 3412162
17118 3412162 3423572 3403457 3405691 3527212 3351623 3122722 2947442 2935447 2942009 2913154 2998924
17107 2998924 2934317 2953183 3096714 3010177 3038902 3008762 2915859 2864328 2594061 2625318 2839646
17096 2839646 2925325 2829925 2726401 2528481 2690838 2681666 2518682 2457822 2329178 2160872
17086 2160872 2262660 2359956 2463757 2437222 2294786 2375869 2323147 2173159 1898481 2027461
17076 2027461 2120386 2165811 2151761 2273065 2259464 2301677 2374403 2195842 1964093 1875856 1708004
17065 1708004 2056973 2270999 2203964 2067696 2138139 2113339 1922857 1779472 1840622 1794119
17055 1794119 1527260 1745931 1874998 2071973 2104253 2192239 2083765 2240471 2129854 2082767
17045 2082767 1899206 1929283 1968533 1876532 1591068 1373943 1662800 1713402 1633383 1539326
17035 1539326 1647928 1887112 1784341 1968901 1935481 2061920 1998756 1909801 1567744 1685402
17025 1685402 1766758 1961174 2007211 1760290 1582723 1396222 1559606 1655142 1577677 1568260
17015 1568260 1439495 1290325 1348795 1298214 1352222 1396194 1444648 1525433 1488952 1434483 1411115
17004 1411115 1413309 1108981 1252234 1246129 1093643 1057775 1297221 1593328 1568649 1537231 1430999
16993 1430999 1536625 1624758 1559930 1450401 1164253 1194540 1258770 1156028 1048504 1154488
16983 1154488 1263369 941904 896014 1079163 987146 880418 880440 1077287 1059241 1344735 1316535
16972 1316535 1100042 1058203 1101163 1075476 1067718 986498 1121634 1304514 1261539 1172725 1092609
16961 1092609 1049768 1193903 1168692 1023370 1209916 1248656 1160426 1229773 1305961 1209189 1181604
16950 1181604 1159748 1244862 1197249 1260495 1285477 1016132 947829 1060910 1051732 1041072 945533
16939 945533 917764 615829 560364 622275 848508 1004745 1311424 1325253 1297703 1268778 1255990
16928 1255990 1292208 1304818 1393160 1563527 1604900 1509096 1495821 1367892 1037573 656180
16918 656180 879047 1093277 1090788 771797 877352 832513 990738 1053913 1067037 865615
16908 865615 966875 1162238 1264349 996156 810562 810585 761685 954437 1088166 837872
16898 837872 613503 602297 953871 1257754 968186 729383 664309 783602 843952 955192
16888 955192 1103962 883353 698890 777331 892470 740512 770824 927131 749426 545193
16878 545193 672191 780250 876464 830788 765570 759686 676456 630826 483870 378567 364728
16867 364728 514140 611624 423131 321345 363363 229829 263514 389711 621983 549011
16857 549011 172816 287933 632461 857598 806325 556457 527510 695157 626484 347944
16847 347944 316010 302060 281699 397633 597777 564367 701111 728995 693150 717122 639337
16836 639337 497953 514101 443546 251518 185533 210583 473216 675198 483868 236129
16826 236129 169619 478609 549951 487463 493626 402058 476562 370508 283540 457265 460003
16815 460003 599521 477799 384346 356597 247973 141556 280731 256210 80782 139940
16805 139940 155067 374106 586407 451961 424506 474093 616733 776443 737276 411883
16795 411883 44108 183309 428626 400489 500846 630640 673070 458735 251128 92770
16785 92770 128635 50076 14197 9466 79317 212872 249535 264164 297769 343963 542549
16774 542549 528229 498426 444760 68724 -345222 -138214 227801 561892 437072 220830
16764 220830 384559 526836 234537 -6635 57903 133265 209116 204728 231455 352417 559648
16753 559648 477826 356152 285549 150502 357342 363615 300424 117471 -68079 -7145 135753
16742 135753 154930 284651 288567 349885 93564 -3588 200490 241186 155245 186022 328528
16731 328528 561181 392203 346038 242346 898 -12003 331064 500493 371074 394441
16721 394441 398603 377219 308650 242342 250672 126063 152228 332804 264195 173246 98868
16710 98868 48091 -3174 -39667 -70470 -233529 -153714 -221666 85865 453461 510954 335120
16699 335120 73279 157394 116384 150569 184185 110727 223079 180238 -3795 -80224 -195772
16688 -195772 -337643 -269199 -237773 -43799 202579 -31644 15352 -9368 -7012 27958 -8686
16677 -8686 132896 336244 562476 379509 79652 -176149 -110098 53588 120205 -33636
16667 -33636 113086 155819 154844 125145 172626 34211 -193842 -71360 -172890 -232288 -119778
16656 -119778 -36125 61159 223558 300136 121537 93064 -82905 -160592 -107915 -28477 135832
16645 135832 297000 136162 -120651 -20909 41500 -124485 -378795 -376134 -126020 -161620
16635 -161620 -176579 -278903 -502056 -556891 -511709 -537734 -556906 -493479 -517961 -223986 90716
16624 90716 169389 65084 -51355 -186355 -237667 -293908 -287583 -115154 38773 28140 267855
16613 267855 269727 128033 -158753 -417240 -249784 -88793 -157202 -153702 -147919 -128483 6768
16602 6768 31429 71834 241466 21538 -159169 -299061 -447453 -346785 -57946 2223
16592 2223 -801 -267462 -403574 -403298 -329355 -414152 -429508 -435593 -589894 -319948 -377 -26962
16580 -26962 34077 -181140 -289644 -212787 53932 216563 408022 208054 131834 -15860
16570 -15860 -132208 50251 187932 -95956 -227278 79022 219437 154560 82234 -41090
16560 -41090 -182829 -140307 155433 99048 -124459 -110728 -227707 -400461 -389308 -322368 -197137
16549 -197137 11871 -108808 -215883 -139625 -37984 -121477 -18199 -47802 -126477 -67259
16539 -67259 -64942 -36060 -50213 122987 -37975 -57517 -14424 -33100 -88379 75870 -70267
16528 -70267 -147348 -157804 -318336 -252544 -217161 -64213 -36121 -65330 91313 27297 -199226
16517 -199226 -212700 -110703 -131899 -127656 -33420 -81568 -54383 79722 121562 86565 -15766
16506 -15766 136728 111408 99488 135299 -6889 -158576 -165392 -387510 -431464 -123803 31536
16495 31536 230275 229029 131181 68941 -41090 -210143 -129371 208455 225934 -10377 -301870
16484 -301870 -454317 -607638 -509325 -372108 -234735 -353222 -493990 -426197 -271600 -373718
16474 -373718 -576574 -536495 -384826 -242411 161468 -11290 -153809 -248561 -223540 -429320
16464 -429320 -622875 -457197 -262250 -304623 -148788 -181536 -255744 -295566 -164294 -62909
16454 -62909 -176588 -33531 -16134 59083 102145 -23668 -86296 118674 93233 37848 -203917
16443 -203917 -457851 -358889 -7323 -70152 -20573 -40890 -7717 167156 275376 73023
16433 73023 -189612 -240504 -90534 -195388 -264604 -79499 -38304 -30024 -73713 -107726 -192507
16422 -192507 -141695 -44234 -33811 -93415 -168577 -264674 -285425 -312682 -395452 -310605 -90393
16411 -90393 -36107 -183053 25861 -39638 -357206 -419094 -332066 -184062 -316984 -361881 -225175
16400 -225175 -290636 -342550 -448642 -249311 7444 116561 68060 -81468 -3530 -8367 52395
16389 52395 -9545 102282 -31588 -426412 -372700 -123320 -112121 -281704 -337477 -554267
16379 -554267 -719405 -534792 -546226 -509964 -176078 -75214 -79707 -98226 34361 45540 -90557
16368 -90557 -121040 -8872 85898 -130270 -368963 -752805 -735699 -568922 -238546 -198133
16358 -198133 -378509 -545387 -516735 -497275 -642591 -484249 -376840 -339260 -406143 -386518
16348 -386518 -311089 -242668 -448017 -574849 -431105 -325665 -186061 -71086 -111973 -168224
16338 -168224 -253565 -323140 -339974 -206921 -25427 -107793 -278200 -355421 -173283 -45521
16328 -45521 -240077 -315002 -309111 -197375 -9936 46866 94593 187359 281128 237634 64291
16317 64291 -55756 -53850 -211903 -273479 -301890 -411104 -71902 73140 -166472 -284830
16307 -284830 -107010 9850 24587 283339 222396 139850 162376 -159398 -263797 -144765
16297 -144765 -99747 -141144 -262914 -392224 -295172 -257125 -322905 -553686 -626232 -293792 -277084
16286 -277084 -328624 -430826 -493917 -401826 -468027 -697524 -691043 -311310 -273530 -294711 -236390
16275 -236390 -300484 -321863 -357673 -300295 -375182 -287996 -267690 -423015 -333503 -272905 -357823
16264 -357823 -280587 -363897 -196189 -51389 -170289 -310787 -382835 -485477 -469271 -405421
16254 -405421 -352641 -263170 -239684 -143191 -191419 -258363 -294118 -439021 -597982 -692487 -385062
16243 -385062 -151349 -233888 -221099 -97432 122856 383301 474504 170146 -189909 -407353
16233 -407353 -383200 -488339 -512181 -418563 -378816 -350452 -75195 32722 54590 -102277 -151687
16222 -151687 -309489 -411369 -497305 -530622 -501171 -237992 -231800 -374421 -380598 -339824 -441138
16211 -441138 -491803 -355608 -334552 -323784 -391967 -473287 -374370 -522160 -784647 -641489 -262636
16200 -262636 -17716 70739 40521 42662 -75829 -15777 -201504 -133733 -234313 -307862 44797
16189 44797 131741 151977 43403 -117257 115121 173898 -17320 -128709 -260296 -287081
16179 -287081 -78032 -125122 -221103 -196249 -194156 -388551 -433035 -407672 -142289 -87632 -361489
16168 -361489 -303368 24395 -184050 -470938 -453820 -565048 -305124 -245815 -280218 -480491
16158 -480491 -396466 -454928 -232022 -256050 -244106 -181676 4111 95427 -125012 -204640 -195488
16147 -195488 -113426 -105309 19025 178286 -106668 -271529 -558468 -498438 -455247 -502771 -703269
16136 -703269 -563443 -683217 -500481 -156644 45016 60367 -89381 -236733 -351855 -397232
16126 -397232 -493983 -423109 -362984 -344534 -313873 -380620 -714807 -868354 -790227 -625998 -255727
16115 -255727 36736 -102377 -196798 -322292 -263163 -144091 -376560 -531119 -567833 -207857
16105 -207857 32407 30817 218824 170651 54100 -82202 -160828 -254092 -222524 -87767 -71475
16094 -71475 -134969 -214940 -417002 -409464 -206291 -76922 -94192 -407557 -449084 -445156 -550361
16083 -550361 -434020 -267006 -346863 -349753 -300896 -245701 -360676 -328005 -235599 -439907 -495548
16072 -495548 -311950 -378432 -200686 -337622 -561592 -591059 -579272 -393619 -85927 -47921
16062 -47921 -28451 111407 91901 -154551 -202909 -190452 -150718 145521 257133 32220 -31992
16051 -31992 -50434 -11240 -135393 -107007 102009 149903 -122270 -257435 -255665 -188127 -149633
16040 -149633 -170283 -191125 -565024 -595843 -398247 -469567 -298807 -122736 -84205 80217
16030 80217 -71972 -88101 -28326 -59272 -165460 -249498 -161519 -225346 -241864 -119083 -231555
16019 -231555 -231555 -341994 -288813 -224602 -465406 -382064 -165961 -267238 -202214 -17975 -23987
16008 -23987 -152757 124738 201695 102462 -124201 8785 236045 43091 -32020 -101011
15998 -101011 -166596 -294708 -54217 191856 248535 356137 400965 347560 402924 314290 323225
15987 323225 449136 645696 685517 904923 997244 911625 951174 1088089 1047409 1012382 1024256
15976 1024256 1068483 1018626 844104 1041170 884678 678618 658586 621636 555767 445576
15966 445576 319182 288465 561426 597785 571165 493955 359663 424392 606262 494318
15956 494318 310395 120023 247447 406785 409365 385063 367878 178796 -6265 143456
15946 143456 -73916 -103078 -207322 -371459 -509406 -283473 -225752 -143945 30059 -31327
15936 -31327 -38704 71059 -130003 -169352 5490 74693 308960 -16832 -152518 -115830 -42909
15925 -42909 59072 -187774 -219762 -287408 -445617 -536856 -477775 -399884 -381820 87620 216519
15914 216519 206421 219890 33260 -217050 -288625 -276987 -288373 -406009 -218166 -321129
15904 -321129 -196085 -25831 -194323 -405531 -185641 214955 285968 251123 14610 94845
15894 94845 424294 341388 184621 241489 286957 138127 54908 61403 -100351 -162846 -163639
15883 -163639 -164660 -413319 -186895 -33092 -171783 -420711 -596515 -522420 -315871 -379063
15873 -379063 -405769 -390723 -389899 -357260 -127733 -207136 -253672 -411489 -417148 -188623 -10167
15862 -10167 -12671 -166303 -34904 10445 -44458 -367396 -391453 28214 368726 230415 49170
15851 49170 106038 191698 213955 25993 14860 154418 154412 172852 30113 62502 -17998 -56656
15839 -56656 -43380 -22907 166341 -49393 -187182 125355 -154018 -177289 -148661 -239312 -256234
15828 -256234 -158088 -12813 -32783 36767 24938 -98510 -155636 188345 269493 54751 -221474
15817 -221474 -218378 -273179 -147025 -188408 -386321 -380499 -434687 -312871 -146328 -162101 -68156
15806 -68156 37637 -222516 -474958 -421565 -330477 -174039 -359269 -513439 -536414 -616170
15796 -616170 -472011 -370634 -488975 -567089 -578223 -465035 -561890 -923297 -673800 -635867
15786 -635867 -741020 -546333 -273831 -111496 105914 -67840 -208025 -153544 -442418 -452138
15776 -452138 -253214 -312491 -171556 -49567 -70041 -78289 43872 -71962 -45389 -263326
15766 -263326 -507737 -665600 -735568 -701318 -560849 -696785 -491236 -334861 -350123 -312167
15756 -312167 -58391 -40333 -252104 -557207 -533564 -199848 -138486 -345664 -345621 -142860 -120627
15745 -120627 13810 202914 91121 -82188 -92957 -232248 -431867 -320817 -142022 60352
15735 60352 248140 353753 116826 -98560 6611 178765 43196 -186113 -135411 -96137
15725 -96137 -139030 -116706 -135567 -25705 -180886 -315832 -459339 -421902 -181710 -123626 -83396
15714 -83396 -99970 -384025 -403614 -212481 33290 59728 -245640 -242892 43770 134112 -263892
15703 -263892 -523186 -704323 -722835 -662273 -658560 -599706 -480899 -542118 -547153 -479985 -329051
15692 -329051 -169251 26006 2016 -171524 -568020 -906915 -802767 -417601 -127017 -84283
15682 -84283 -364941 -593672 -536961 -457691 -294172 -321136 -380495 -286843 -194154 -385773 -307036
15671 -307036 -387415 -262292 -136396 -72939 103269 -63376 -308937 -283661 -115464 -72529
15661 -72529 27353 -137780 -216416 -307755 -422671 -568213 -627498 -601334 -697324 -476705 -211714
15650 -211714 -152936 -73432 -50597 -192018 -374699 -393544 -114248 54430 163063 -31327
15640 -31327 -393112 -461902 -464151 -194203 -24906 -56553 24535 -21121 40369 -127301 -416450
15629 -416450 -473129 -530997 -457668 -238644 -221355 -282829 -156198 -144247 -239019 -402108 -314604
15618 -314604 -220025 -407933 -335449 -357575 -424984 -439288 -330845 -216455 -260572 -170005 -323237
15607 -323237 -260719 -330707 -425540 -296692 -226672 -475403 -488783 -306849 -236040 -443373 -610459
15596 -610459 -351623 -298309 -371906 -196748 -273169 -213778 11844 -44809 23581 31645 82064
15585 82064 59074 -13692 -38042 -188296 -230346 -90444 -44621 80972 137920 48991 130145
15574 130145 187745 176437 -270231 -569700 -530954 -348316 -221573 -142661 -11782 255558
15564 255558 225887 42379 34903 140188 191489 -54420 -84402 -1522 -8248 64 199150
15553 199150 81229 39919 25050 -11870 -121187 -161153 -278573 -279057 -295418 -474714 -528575
15542 -528575 -149925 -233503 -373521 -341549 -67771 -31400 -299912 -328706 -12253 42392
15532 42392 95831 258201 28322 -166932 -263695 -218142 -332315 -409868 -533295 -568149 -294680
15521 -294680 -142307 -140080 -331109 -329208 -139799 -341238 -376204 -307670 -271090 -238272 -148420
15510 -148420 -371644 -536643 -451260 -323097 -478205 -424228 -322704 -293891 -151955 -175616
15500 -175616 -395143 -368910 -302487 -175918 -166174 -75956 -43375 -21255 -396413 -501274 -661149
15489 -661149 -521090 -434573 -25347 142432 230670 308871 233829 -38677 -251637 -313830
15479 -313830 -542389 -439102 -389530 -387028 -385550 -492983 -530932 -547663 -490131 -223533 -248269
15468 -248269 -246495 -150513 -154537 38639 234808 13831 47701 94850 -166381 -257558 -163805
15457 -163805 111564 79363 170350 53949 35276 80071 -204189 -339715 -211654 -16943
15447 -16943 -102105 -352514 -333157 -384613 -320074 -399137 -336636 -69271 4977 -123138 4543
15436 4543 132864 125586 162962 135144 7433 -76004 12029 158700 64697 157365 200104
15425 200104 98291 5476 -85199 -305744 -249115 -55072 -75888 43802 -258743 -510352
15415 -510352 -427468 -382649 -410828 -303976 -104799 -186466 -444433 -598002 -463781 -499121
15405 -499121 -422758 -179679 -257613 -275903 -233482 -202684 -193266 -177062 -218229 -151404 -153472 -243586
15393 -243586 -223871 -207637 -334607 -515602 -416560 -331048 -69580 39240 -87314 -109115
15383 -109115 -134383 -118646 -138572 -44783 36208 170026 107971 12625 -32885 191425 197883
15372 197883 84609 20162 95906 -135515 -145022 2694 48344 -2175 38258 -118250 -4868
15361 -4868 146920 106064 -60814 -136641 -51704 81733 107991 229877 274320 64238 -74392
15350 -74392 88163 175148 -111441 -163850 -273071 -442386 -672993 -622974 -364296 -74114
15340 -74114 177495 245048 -6942 -42063 -123043 -6954 -119001 -308918 -282261 -217868 -214919
15329 -214919 -120187 74213 208294 330093 556322 453310 185867 44760 -23455 271073
15319 271073 331045 529466 377893 377167 311384 426765 250865 169321 211632 145189 104141
15308 104141 98458 105517 160831 33288 25665 94342 134209 55758 -4240 109335 76573 175092
15296 175092 163079 281338 434269 290841 157056 60229 195224 126829 114880 256361
15286 256361 256529 449552 350778 162334 220109 13922 -193051 -331572 -7419 -9050 25340
15275 25340 -64645 -278207 6554 263994 374163 435201 346983 179662 -24567 90900
15265 90900 161499 -81828 -52745 44098 266654 440433 346920 180951 63330 158962 365614
15254 365614 425969 97403 71338 187768 254617 330767 331197 178045 202823 251622 162249
15243 162249 27638 -82351 52382 -16768 -251636 -72954 240685 356447 190173 163815
15233 163815 -114492 -39567 -163083 -228378 175834 543257 690512 605113 596074 521235 227913
15222 227913 88373 85987 131760 71817 368194 587869 538735 314229 291948 433191 462460
15211 462460 611354 335071 -20193 -212716 -170625 33364 286058 358554 558058 608089
15201 608089 352921 122612 236740 452490 458508 540514 357592 532627 845921 709297
15191 709297 683355 630175 425244 207469 -90529 -142646 233026 406549 350034 450906
15181 450906 427496 455425 237274 -119394 106939 372474 333031 325809 367479 457525 507973
15170 507973 264494 34590 -3137 293022 407033 482622 326073 189951 172933 -109936
15160 -109936 -275972 -137455 -63266 16470 91961 127560 268060 388657 445553 501255 714708
15149 714708 609734 439852 577738 574709 482240 477589 341722 -69473 -86982 -87514 95034
15138 95034 301944 269868 184572 301038 650257 749142 673803 336828 340001 580501 585859
15127 585859 9958 -1646 157026 63530 452009 617649 713665 914378 893484 785927
15117 785927 536866 314618 288220 335552 277436 250609 575348 477370 302230 86871
15107 86871 15002 -10497 47389 78122 253874 373970 385250 416187 507342 148236 -145849
15096 -145849 -177036 193851 424767 517092 248556 196906 311884 466366 429937 330140
15086 330140 289914 129129 239226 442103 411916 430114 316634 362853 394743 514075
15076 514075 491643 361986 561090 791985 774352 878224 1003129 1010146 968135 978160 942931
15065 942931 770694 790074 654366 708656 662906 459008 254405 285848 384809 92350
15055 92350 222037 406141 580595 606590 321338 498584 685203 537927 441874 603584
15045 603584 530012 301709 425195 490145 710188 818255 745075 743529 684777 578436 514835
15034 514835 683161 802340 680307 725069 772680 616893 545890 596449 681836 678053 622463
15023 622463 645642 576244 567695 564642 844183 874082 789678 663730 825378 976684 847311
15012 847311 764283 978356 1035896 881291 888445 1004237 1008395 1187687 1159763 1262945 1215092
15001 1215092 1073402 1016691 1063604 951352 914247 692213 392054 454668 894488 884986
14991 884986 641615 395773 476638 470664 468893 507956 428793 529989 631250 937743 1167313
14980 1167313 1089096 929161 944208 944636 925979 1135350 1123049 1243377 1038948 970937 1106104
14969 1106104 1038671 1130688 1099522 915284 776369 780955 843572 1144222 1181265 967880 923747
14958 923747 842488 756722 1006221 815551 589727 606388 806839 873701 946785 953252 835508
14947 835508 885324 939644 1008869 879571 929630 930566 919741 1187224 1139894 1224103 1159103
14936 1159103 867295 905497 939849 787655 937304 971937 941756 1043865 1196495 1065996
14926 1065996 1127120 1421036 1625663 1486180 1410087 1511456 1688582 1819627 1767976 1587094
14916 1587094 1392509 1247360 1098822 1140107 1312860 1196273 1433631 1393994 1291843 1366374
14906 1366374 1291755 1269620 1263709 1054544 777715 676576 725461 740481 757386 723140 999485
14895 999485 1082144 993062 988337 1156616 1130216 1048369 1099231 1103653 1079462 1391880 1441075
14884 1441075 1227082 1179061 970018 1036155 1063310 1047223 1115196 1108839 1142273 1038610 1172823
14873 1172823 1120455 1078656 1116686 1032601 1227391 1322073 1185256 1092299 1185192 1168776 1092097
14862 1092097 1090059 1175223 1289635 1488926 1498142 1244830 1054157 1149472 1341940 1491866
14852 1491866 1544826 1372022 1260710 1033877 837298 873017 954669 1110817 1199516 1043741
14842 1043741 1003719 984327 913056 962626 961049 1048765 1129926 922268 695615 1030529 1260283
14831 1260283 1037002 857097 932271 913412 1173786 1395880 1242712 1094310 743493 690775
14821 690775 518092 671191 923744 795148 608959 597486 818961 844905 739522 571446
14811 571446 859546 861622 998964 991585 861323 622455 438145 526856 628792 691752 1025152
14800 1025152 1280827 1154251 1071831 905068 637955 659817 657946 729770 934939 844615
14790 844615 729521 554748 654679 861092 685755 594048 785198 1076363 1120074 1113833
14780 1113833 1108652 897033 842188 804215 852616 883549 725168 652855 832997 891334 941895
14769 941895 936628 587271 459349 374654 626531 899885 1042039 1204641 1307818 1134322
14759 1134322 722930 405531 458686 584141 445025 559856 569653 735504 644469 456075
14749 456075 396239 355517 347653 443422 294020 327698 517911 722471 427671 237155 161362
14738 161362 201668 125246 425008 573639 484866 274435 236919 322518 492573 542996 511880
14727 511880 489048 326390 269311 410392 447675 572593 606376 755384 899179 603575
14717 603575 693840 802650 850419 714638 528406 437199 376513 365564 174551 201169 263449
14706 263449 347502 263213 480074 893013 1170428 914328 482628 371909 595772 722425
14696 722425 731094 664971 599576 562101 463632 259371 47636 366134 495844 196683 15039
14685 15039 -167643 -128332 149190 315868 286113 -39120 23223 28428 88731 273731 411402
14674 411402 329158 459587 474930 403492 266279 109768 129397 -94585 -47854 9833 -40693
14663 -40693 251362 472276 475749 664383 633527 455652 337897 334751 241570 165766 167591
14652 167591 380913 416512 330441 61730 -52389 -38080 -152390 -87965 252589 452971
14642 452971 231334 386221 411601 133679 111306 57059 289641 320615 253895 187016 135249
14631 135249 84038 163231 129240 85868 144069 321040 289179 211164 249667 87625 37396
14620 37396 23035 124207 300103 163775 13693 118221 119371 85829 71826 -123866 -140373
14609 -140373 -97948 54954 83315 147843 181762 261752 85844 74413 221309 336644 363868
14598 363868 493165 251561 89665 105049 102175 97757 344335 381877 344914 259522 185786
14587 185786 212893 112197 96626 -5629 -233137 -356376 29021 206807 24258 -54435
14577 -54435 37424 175180 165575 102729 -51908 -189231 109033 288573 123996 -109300
14567 -109300 -22726 225284 131340 8770 -270254 -445144 -367779 -137386 144970 93445
14557 93445 -43252 -18632 94297 80410 59703 221801 20811 -324175 -365306 -259062
14547 -259062 -231029 -239188 -126689 -19572 -102652 -255538 -308237 -360146 -345664 -50489 77729
14536 77729 168466 43358 -29122 63201 130138 41865 -99530 -3468 261076 186204 109686
14525 109686 107665 156428 341817 254037 312940 -115814 -407110 -408788 -376235 -232848 -141839
14514 -141839 -333569 -485482 -461380 -213013 -96252 -40359 -169670 -318352 -338381 -384991
14504 -384991 -383374 -284799 -164966 -55738 -200216 29137 458731 417936 103127 -69997
14494 -69997 -117992 -128508 -242995 -169380 -154562 -519755 -222102 126508 235914 346890
14484 346890 562607 784075 785635 706196 907369 923821 637837 390684 243660 305467
14474 305467 305995 340511 188553 177352 147718 76350 8064 95584 69447 -43762 -112590
14463 -112590 156054 380813 281333 139519 106482 76961 -219535 -371148 -81308 131678
14453 131678 69484 -134876 -250935 -282920 -368048 -181062 -178045 25771 146506 151820 221668
14442 221668 270348 178489 58596 -204537 -256378 -222834 -152312 -246652 -238796 -257349 -84528
14431 -84528 -9249 -57992 -129937 -406414 -445939 -420375 -217240 -160258 -154467 -173847 -229778
14420 -229778 -328547 -403923 -416159 -396455 -260664 -231254 -297837 -359979 -497036 -331686 -348636
14409 -348636 -292941 -350680 -171819 -187909 -124587 -83393 -147899 -214052 -293160 -352624 -170241
14398 -170241 -42327 104675 200395 207355 156690 -30809 -295823 -535891 -329073 -57540
14388 -57540 16762 -72266 76722 -78375 -323805 -275978 -183456 -162632 -157257 -94635 -249677
14377 -249677 -173317 -101564 -233044 -163504 204763 295951 25715 16001 23136 -123880 -227239
14366 -227239 38500 276071 194439 2414 -68498 -354384 -181293 19907 -142141 -416306
14356 -416306 -368465 -407792 -355376 -237033 -56808 64921 162824 35348 -129084 -126542 70600
14345 70600 55640 137925 254241 391272 193446 26346 63809 34956 9730 171276 141534
14334 141534 -23352 -101002 -225056 -422367 -545793 -448309 -325913 -150945 -119337 -56001
14324 -56001 -50670 -125773 67160 106027 -132440 -226118 -20206 233208 316701 122034 21698
14313 21698 56573 208554 158579 50345 -150484 -335178 -82883 118637 -17204 -93667
14303 -93667 -173157 -342313 -392809 -71046 4350 66996 36402 -70734 -39437 -8319 91000
14292 91000 112311 89656 -2424 -112895 -120422 -146085 -96365 -163693 -185617 -124463 -56118 -66394
14280 -66394 72664 -45479 -424496 -379270 -415242 -480126 -514190 -475163 -514848 -399861 -297561
14269 -297561 -492351 -454942 -326138 -179499 -173176 25193 257762 144533 -251925 -431931
14259 -431931 -298845 -384266 -564689 -385553 -306584 -219539 -295316 -302824 -527657 -605917 -305815
14248 -305815 -221531 -287568 -77489 825 -113793 -125363 17741 68875 -9495 93610 117270
14237 117270 -13518 -84540 -220685 -245358 -496351 -587400 -582677 -310838 -134870 -10080
14227 -10080 54533 -130366 -324266 -327666 -202507 -354215 -358620 -290418 -112118 24588 -158445
14216 -158445 -340472 -94082 136897 135962 101963 60535 -141316 -256182 -169103 -97066 -358535
14205 -358535 -277084 -239766 -190264 -509947 -617297 -598558 -674049 -614406 -492381 -344591 -335455
14194 -335455 -289017 -215262 -83459 -140587 -279219 -303179 -299354 -299859 1044 181714 -224090
14183 -224090 -375786 -333685 -265814 -230827 -391705 -461985 -309465 -143766 -271776 -460355
14173 -460355 -483696 -229032 -145566 -423768 -250491 -140588 -51952 -51888 -128284 -54872 13109
14162 13109 -107386 -230123 -125909 57036 -75901 27742 -96784 -407040 -412411 -311599
14152 -311599 -148894 -13885 -107660 -57562 -135970 139423 231591 1965 -51815 76054
14142 76054 56911 -67734 -67845 -19035 160634 9225 30888 -122921 -239259 -398543 -280884
14131 -280884 -313344 -202517 -43747 -130850 -273818 -93295 -9453 -37993 -33438 19205 52951
14120 52951 -8234 -129707 -188293 -251386 -146747 -7200 40687 7087 -90537 68691 -65313
14109 -65313 -274159 -259853 -206243 40908 302249 250503 75815 -74949 -93122 -130197 23930
14098 23930 98323 -28274 -102062 -139424 -495694 -479579 -176268 -232295 -359808 -226735 116665
14087 116665 -105814 -54554 204476 317106 162327 -51161 -173419 -214016 -275213 -172853
14077 -172853 119730 282474 190078 212366 217625 135905 8953 -212195 7235 145514
14067 145514 35255 211404 157697 145750 171451 57893 14860 -5507 235550 257365 319205
14056 319205 342935 372519 246841 -19339 -107990 -75308 -23075 78556 61274 21538 -125867
14045 -125867 -164835 -207398 -187304 -101225 -149282 -212841 -260065 -346597 -245566 -14855 -19286
14034 -19286 45136 -9358 -63272 -260679 -400402 -205285 -92230 41414 104993 32280 -23609
14023 -23609 116929 276680 492598 775274 661128 495683 243122 208682 56921 -29978
14013 -29978 -64908 57053 121241 167820 183357 199440 -80440 6902 98821 184552 224465
14002 224465 126556 -140646 -75475 328247 283523 320388 169056 246137 521037 713556
13992 713556 727334 315388 265324 169108 88563 237547 241606 274670 354537 414574 380527
13981 380527 202115 126192 25895 41592 16501 344922 667165 602066 257629 108113
13971 108113 213774 265372 -141179 -258031 12848 142834 84765 -138173 -277924 -384294
13961 -384294 -356981 -161732 -292245 -158325 219 57877 141507 -102913 -227570 -350299
13951 -350299 -240459 -331088 -355721 -65620 140493 144722 127883 307788 410329 431817 355233
13940 355233 467579 219387 -17856 150983 216033 -56005 -210945 -189839 -338550 -343178
13930 -343178 -197358 7142 54817 25247 430644 462921 336072 285122 375594 177334
13920 177334 -211391 -335763 -358370 -275882 -229387 -132854 -251927 -464696 -476284 -398004 -181412
13909 -181412 139881 158403 141164 -121205 89665 208268 -53737 -311230 -242055 138964
13899 138964 213578 23364 -96553 -203769 -137088 -171267 -368566 -380840 -76201 -150904
13889 -150904 -63865 100990 245252 214879 222833 295651 469614 362353 235673 241861 127117
13878 127117 194705 347104 300406 382468 494504 624996 540290 546195 556987 124698 -129595
13867 -129595 -111759 163335 118167 25488 199193 433006 596189 537408 414418 601629
13857 601629 797298 661843 339073 236558 228817 106260 134944 269814 230648 280226
13847 280226 136446 316992 616621 529427 347823 371868 167029 113032 49846 112216
13837 112216 324691 62567 -133983 -42320 224824 182952 297652 315279 267849 114808
13827 114808 27201 -66692 -44433 147869 601920 612890 465694 439575 367899 560932 381736
13816 381736 219418 136260 -1797 255737 492101 547338 562331 483146 438438 349256 234120
13805 234120 72145 3991 -56284 -58098 156733 314657 283333 136365 336401 667538
13795 667538 571503 246969 55775 167803 186239 33333 261707 223718 -29208 57839
13785 57839 97681 115247 82366 170848 128981 -29725 127305 75378 210680 273494 171171
13774 171171 -82729 -80033 37244 356606 618349 450848 191506 151685 142625 151279 308343
13763 308343 504126 323049 290112 458691 535829 424639 299025 234570 140021 292288
13753 292288 111032 58724 224082 401709 435241 609366 770432 442587 345080 482385
13743 482385 732336 588185 680789 825008 742997 567289 626249 773374 858509 944811
13733 944811 942453 843442 1041011 1270477 1186178 1272781 1313629 1305086 1247463 1228310 1271939
13722 1271939 1307927 1368389 1574148 1580246 1655054 1448158 1323542 1398515 1480930 1477858 1553529
13711 1553529 1502556 1144198 1047248 1369876 1772921 2159859 1979928 1798295 2088945 2268855
13701 2268855 2455428 2327660 2174853 2230466 2563290 2536536 2320804 2098152 1962819 2032977
13691 2032977 2233830 2250467 2210518 1995750 2252922 2666547 2640831 2506367 2571299 2514942
13681 2514942 2617990 2781947 2677193 2503675 2542494 2466646 2590842 3093425 3049120 3101269
13671 3101269 2911860 2771125 2611492 2547201 2580434 2583679 2544988 2511883 2330597 2519836
13661 2519836 2726678 2813868 2857075 2940641 3177546 3225109 3237486 3359730 3321270 3374955 3302892
13650 3302892 3082884 2960083 3054587 3056039 3106242 3362364 3443935 3563713 3786548 3779383 3624228
13639 3624228 3597967 3550790 3492401 3444252 3700044 3899278 3833392 3707043 3960202 4027145
13629 4027145 3944358 3943514 3933373 4179948 4470766 4693405 4780242 4765581 5060800 5241303 5392882
13618 5392882 5824022 6044848 6280667 6709547 6995675 7297696 7812463 8512814 9105633
13609 9105633 9672173 10526375 11639701 12459797 13511189 14533411 15811822 17296111 18809557
13600 18809557 20488154 21998500 23464147 24939687 26426496 27703643 29090080 30640029
13592 30640029 32600340 34304983 35511621 36325310 36642555 36275205 35732232 35219892 34463773
13583 34463773 33501549 32377095 31718545 31103510 30737759 30782115 30726442 30876490 31274739
13574 31274739 31816598 32901720 34298532 35841557 37296150 38773008 40442070 42546495
13566 42546495 44322565 46072179 47805748 49165715 50619680 52165791 53760249 55127815
13558 55127815 56381227 57326501 57861851 57816262 57201261 56198959 55088489 54121727 53213962
13549 53213962 51958866 50381007 48613782 46983627 45275663 43661163 42461764 41401649
13541 41401649 40115127 38990450 37919043 37126165 36720376 36606053 36660710 36991061 37473867
13532 37473867 38029738 38514884 38779688 39081461 39384769 39755767 40229180 41433323 42741996
13523 42741996 43602295 43775705 43325348 42608665 41301691 39656886 37746286 36018085 34138511
13514 34138511 32298261 30615745 28702659 26730182 25138540 23491825 22113074 21012452
13506 21012452 20198189 19323707 18518592 17556125 16669385 15869320 15468782 15279464 14824934
13497 14824934 14280737 13828815 13424678 13056293 12923903 12528053 12252777 12158983 12052647
13488 12052647 11852014 11482708 11226220 11244178 11156143 11304391 11226189 11076576 10763049 10555382
13478 10555382 10273600 10040849 9960530 10144838 10180580 10154364 9737906 9520633 9612387 9582225
13468 9582225 9647362 9305834 9151493 9032990 8857598 8785295 9023604 9125301 9244357 9133848
13458 9133848 8965335 9076780 9248755 9200455 9155235 8840806 8835260 9007915 8947156 8921825
13448 8921825 8819156 8815400 8881469 8905652 8708050 8383443 8122666 8030521 8066671 8003463 7645330
13437 7645330 7574542 7748343 7575672 7566577 7712960 7677826 7460647 6996782 6897075 6972997
13427 6972997 7153049 7141521 7064826 6780675 6632220 6720724 6942364 6578234 6389559 6267683
13417 6267683 6293655 6377433 6224121 6053680 5779824 5620196 5612844 5668892 5686687 5569555
13407 5569555 5224165 5187177 5108442 5172753 5065481 4801897 4994242 5096660 4832538 4767028
13397 4767028 4741015 4748936 4738205 4759676 4461726 4045409 4028877 4086021 4033268 4019255 4117680
13386 4117680 3920176 3604456 3533722 3452574 3357415 3251784 3266395 3171664 3053766 2902328
13376 2902328 2921820 2974887 2925615 2869990 2742398 2677931 2238450 2007279 2310571 2369059
13366 2369059 2476919 2283961 2318309 2332726 2159207 1769850 1578502 1608022 1773517 1683079
13356 1683079 1801620 1874190 1811614 1821746 1890161 1838728 1658572 1567166 1516427 1326970 1015850
13345 1015850 1019412 1354772 1423553 1395849 1573910 1594464 1534728 1557439 1648107 1499162 1296854
13334 1296854 1056749 914360 656647 658314 783028 737230 814752 718042 565882 487637
13324 487637 428082 380154 405319 302398 445447 620567 589199 538823 579670 568630 505936
13313 505936 358844 489319 646025 655455 663822 569347 279347 111615 -120049 -232479
13303 -232479 -93727 88190 175551 113886 -56564 132151 82481 105595 3680 -98698
13293 -98698 -1285 192475 177245 98854 18544 260953 429463 386275 264372 169872 228580
13282 228580 119884 62130 79243 99443 204620 437941 261850 269986 272562 119393 54007
13271 54007 -64735 -185492 -82613 212127 450994 340094 444593 410569 236839 116723
13261 116723 -23631 115433 228944 96718 255551 359304 294230 118919 171 7246
13251 7246 270452 344397 458496 360429 348509 376540 430899 844796 799124 440082 179260
13240 179260 429496 423292 514221 536197 341211 432900 378705 291238 238411 446222 635307
13229 635307 765779 715723 636608 337699 381485 696585 648094 393372 388275 608009 571204
13218 571204 528043 531623 414631 550276 667656 476139 555139 271867 222927 387286
13208 387286 432252 554401 662142 654731 567096 514042 305107 186036 317891 322641 140583
13197 140583 162231 300467 372323 384979 199329 -43446 -170498 128036 319215 318651 133905
13186 133905 8109 -136723 -179697 -242083 -196741 -59534 29667 -182386 -250113 -398568
13176 -398568 -506707 -447842 -389027 -33588 123937 209264 160010 222802 449417 527055 212476
13165 212476 121150 304415 472543 523580 206070 8193 -26381 299796 142194 1523
13155 1523 -84421 144284 176832 -18727 119212 409035 51916 -175743 -298334 -171002
13145 -171002 -70275 76764 44338 204354 189886 226190 301516 175192 112612 157078 131322
13134 131322 -129785 -358348 -217819 -103334 -88811 61954 123615 -15823 78376 -15777
13124 -15777 -131554 -107482 -134180 -165583 -218567 -103143 -258549 -218932 16189 114228 94165
13113 94165 107586 233730 284050 189624 18645 -194613 -119150 3453 -301700 -376405 -310991
13102 -310991 -347945 -239490 -27614 68393 106300 163889 99374 -70395 -10661 296665 65671
13091 65671 -83469 -157396 -219169 -116535 -91431 21817 401413 448896 298929 4390
13081 4390 -34212 -225888 -430968 -253845 445 113881 97117 -61900 20757 98731 -103857
13070 -103857 -12009 260711 186891 235108 249715 208570 149503 46558 191708 282480 308135
13059 308135 288413 43430 -33564 -155372 -225141 -143260 13276 249199 455552 294250
13049 294250 55795 12323 167395 -672 185283 204828 189787 180814 82002 184310 217048
13038 217048 185584 44167 -35208 36802 69825 98184 257057 61833 69670 239902 7518
13027 7518 -60056 -64979 -167060 -169146 -159713 -154936 41399 -50325 -311849 -206179 111601 259006
13015 259006 156517 -45030 -30066 142142 285425 129035 -32543 -186231 -385085 -9817
13005 -9817 434724 363467 -163430 -389144 -93381 -25231 -22102 -163888 64630 153373 -136801
12994 -136801 -402335 -223978 -299105 -403774 -443833 -424713 -396147 -188241 -194081 -55310 -17129
12983 -17129 -33562 -53700 -175259 -27090 -18740 -392715 -409881 -99717 104130 -124702 -108915
12972 -108915 -84156 101088 227370 104544 127210 137060 59279 99755 33125 -73253 -279942
12961 -279942 -90762 40753 -153567 -424548 -497024 -426414 -522246 -338980 -143755 -373913
12951 -373913 -365802 -377471 -366715 -108442 -93679 -216444 -85239 -245239 -50305 -24157 -279303
12940 -279303 -622336 -657590 -572481 -609493 -349904 87047 56251 29497 -184736 -115619 -12507
12929 -12507 82844 -76146 -158185 -56989 -196796 -286789 -160516 -199200 -125928 -111507 -221158
12918 -221158 -295066 -233917 -244769 -273493 -160851 -266501 -403489 -352178 -303537 -344957 -614808
12907 -614808 -467056 -396151 -463519 -295395 -273485 -115476 -253474 -608782 -487201 -353618
12897 -353618 -407040 -69325 -32769 -95978 -53645 -222710 -443043 -702700 -804812 -626245
12887 -626245 -522533 -358250 -134926 -4483 -126683 -324947 -345816 -159160 179265 306306
12877 306306 -113500 -227084 -208828 -139159 -70777 137479 129964 124390 -66509 99211 -21440
12866 -21440 -93836 -102929 -53936 24108 10844 -143797 -157340 -12397 214986 232291 119978
12855 119978 325773 549694 704563 694465 587222 258898 228079 219291 85401 138921
12845 138921 462971 712746 688414 397265 426129 519643 498035 222873 -122637 84703
12835 84703 326491 117488 -11681 -31857 140627 328839 435429 344031 377330 371233 145969
12824 145969 42066 -11802 -49647 28497 93977 116383 227532 282879 190623 246462 411802
12813 411802 451641 417839 357467 143035 109182 38447 237316 150972 332579 162003 86842
12802 86842 155737 288172 307670 280622 557939 333509 166358 292692 369720 345052 237546
12791 237546 193141 53506 -72554 103444 264478 104405 192940 312840 -16677 -307549
12781 -307549 -194798 137530 137931 60922 117313 100873 -164495 -131047 -86449 -27690 -250972
12770 -250972 -206377 -65649 -72980 -45320 214862 379591 498878 448917 140661 -87981
12760 -87981 -207664 -243616 -54879 -86818 -126016 -72256 -57743 -50767 -228643 -291500 -485058
12749 -485058 -258490 -162260 -447467 -571253 -436233 -344590 -291677 -143098 -242465 -353487
12739 -353487 -214578 -139752 -208616 -179836 31902 6029 -145552 -99795 48843 158269
12729 158269 -50121 -254494 77540 13100 -33998 -162467 -334538 -10637 346631 406202
12719 406202 206741 174350 -129091 -372251 -444539 -417163 -262292 -180059 -186504 -104992 17810
12708 17810 -96548 -274756 -498408 -457405 -228524 -189564 -439227 -436343 -179788 104929
12698 104929 293647 106131 69661 86168 141808 147469 351218 610297 530022 533483 333725
12687 333725 182476 249076 61803 -154279 -422228 -355727 -251487 -286290 -144180 15635
12677 15635 87375 357175 336059 153004 66180 131668 136608 183158 303212 357754 299632
12666 299632 144912 242656 406169 361954 146252 -45531 -139210 -52144 153846 204685
12656 204685 124559 96252 -39236 -132381 -73677 -104586 -99400 -6610 158492 254902 181579
12645 181579 165488 395250 291918 166972 174645 79481 66202 152409 141829 116155 190694
12634 190694 95075 -116035 -85253 29501 246444 332482 482630 398228 283874 215039
12624 215039 -52905 60951 64949 183331 242208 241451 199779 266966 433262 213047 68424
12613 68424 -88340 -68843 17933 170942 141644 96576 -74489 -19593 12503 -162593 74444
12602 74444 225539 60879 -171232 -274824 37754 84573 143952 224990 27136 -151630
12592 -151630 -252003 -414478 -393817 -266237 -117356 -213966 -180653 -64197 -8907 76548
12582 76548 4430 -136490 -229950 -146545 -233375 -211442 -19747 107217 48182 -64961 83477
12571 83477 174699 -257673 -516517 -625076 -658522 -800027 -697752 -632419 -464378 -237475
12561 -237475 -126725 -382909 -350646 -337310 -513742 -509180 -270398 -130527 -2235 -17192
12551 -17192 -153502 -193788 -124714 48904 105134 -111138 -150052 89310 259263 69170
12541 69170 -282218 -503148 -412819 -320969 -228360 -126037 -244863 -485984 -600790 -462909
12531 -462909 -541868 -573037 -650515 -579570 -257955 196950 139508 217007 115118 -203764 -187961
12520 -187961 -42023 -181039 -170062 -267344 -328591 -313933 54020 158676 -71716 -195532
12510 -195532 -371291 -332920 -374179 -281436 -259816 -403232 -605015 -662572 -330959 -114174
12500 -114174 -116980 -390675 -347546 -74129 -52829 10495 11146 101059 -147408 -294384 -381839
12489 -381839 -135922 -87915 -82284 -144899 -329427 -393784 -434433 -624677 -547493 -448613 -449518
12478 -449518 -690252 -613861 -208675 16808 -146453 -107004 62715 107842 -61149 -353163
12468 -353163 -276171 -160241 -181784 -88640 -242340 -110175 276446 339566 396191 356449 206488
12457 206488 -30378 -217848 -366454 -257357 -439838 -545170 -557312 -163509 -177112 -326696
12447 -326696 -354047 -342652 -460122 -534437 -650204 -855212 -668448 -422364 -336865 -370997
12437 -370997 -237414 -404124 -453196 -710878 -771517 -777688 -650138 -702266 -525148 -513061 -434132
12426 -434132 -459164 -321066 -375165 -325670 -93576 -57460 -270477 -367356 -404459 -371393 -227031
12415 -227031 -219359 -247196 -175496 -286758 -386837 -519293 -455382 94533 348113 132267
12405 132267 100493 -90335 -250876 -431888 -757069 -631305 -485464 -429198 -595110 -344808
12395 -344808 -53879 -46482 -182292 -206331 61779 -109156 -392499 -501978 -353613 -263188
12385 -263188 -62044 8992 -155689 -39433 60102 27488 -210807 -423957 -510030 -415100
12375 -415100 -148599 -121668 -223281 -141591 -160320 -72813 63506 -39004 -295421 -268069
12365 -268069 -189252 -31640 -61208 -197681 -76850 24453 -110881 -223224 -212003 -42673
12355 -42673 -10019 -62341 -79196 29983 -148666 -332504 -166987 -55135 -38601 -86406 -91
12344 -91 187714 218261 274013 237876 144196 208088 430987 588056 673602 480486 528041
12333 528041 598616 553167 583397 499206 534545 706195 672393 741380 889135 1161897 1189850
12322 1189850 1297652 1494690 1683927 1719719 1721763 1805927 2004388 1963583 2046908 2608343
12312 2608343 2959717 2696199 2542756 2872683 3142260 3286101 3410620 3415112 3278466 3310462
12302 3310462 3184223 2768936 2505237 2400403 2455566 2539542 2528768 2226960 2124743 2085957
12292 2085957 1945496 1796777 1793878 1611326 1673382 1396755 1236602 1393430 1247477 1087024
12282 1087024 974490 870717 727627 776641 939433 1051746 1082530 825368 541789 591807
12272 591807 542917 173600 224741 471173 620431 405195 399147 292676 273663 57306
12262 57306 1122 -90762 107279 288161 140024 120582 192686 258226 278028 246722 145657
12251 145657 261035 341304 340488 408767 487819 460240 622822 686310 531488 299079 213054
12240 213054 361227 238643 182839 89738 93694 266279 198368 42076 190760 124014 89887
12229 89887 106522 102106 295761 247886 155189 122845 174840 424718 145859 -107797 -40076
12218 -40076 74444 -17921 191838 236376 382704 165475 12096 -60751 57448 217222
12208 217222 335691 173754 198172 323466 274963 268729 284631 170865 262103 242047 90763
12197 90763 65518 194095 136610 -117047 -197309 -176897 -283495 13435 118433 149398 80503
12186 80503 -181384 -287183 -21328 243914 201199 87489 143499 236531 287620 101033
12176 101033 38636 -77240 -269172 -240838 -215772 -285033 42461 195899 26595 -142600
12166 -142600 53458 110782 237043 162832 193276 231536 257921 262226 71829 -264312 -601712
12155 -601712 -561337 -185079 -40158 91676 74387 -25650 -155605 -82063 -192576 -143043
12145 -143043 -87961 11776 -22977 -88348 -116436 -92591 26365 -11566 -343475 -69247 243260
12134 243260 -71320 -225781 -123278 -66672 -64284 27547 20185 -111729 -174619 -82451 -156514
12123 -156514 -357756 -491901 -371688 -262322 -77100 41523 237917 174517 63003 16943
12113 16943 -179522 -116876 42449 13958 -52232 -355120 -426923 -224094 69670 194657
12103 194657 332218 403894 41695 144851 130369 154716 103919 -33657 -82250 -27246 153575
12092 153575 444859 524311 319610 210808 273721 284118 317770 47112 -164374 -255032
12082 -255032 75090 206775 481479 582845 539390 857316 1195886 1083174 769266 725679
12072 725679 983464 1246095 1174372 918680 883198 1098860 1536987 1846441 1993423 2230019
12062 2230019 2462131 2549311 2430236 2587029 2737275 2949170 3252679 3259637 3396264 3522347
12052 3522347 3633585 3736983 3665413 3570459 3441945 3002183 2737902 2698918 2662777 2697016
12042 2697016 2502615 2342047 2177462 2174416 2290379 1981659 1601875 1425073 1387701 1421752
12032 1421752 1107915 1020448 914967 1119937 1216110 1018524 964159 967327 797572 904760
12022 904760 954730 1020179 1068050 914893 804681 797219 631611 409596 415412 492598 149927
12011 149927 24424 293959 357186 365997 433737 227701 215755 402257 404207 341641 354123
12000 354123 264422 208095 419591 698611 372677 -12294 52908 150754 201406 301217 133406
11989 133406 37691 52715 180253 261145 345053 609567 368448 129348 212573 438272
11979 438272 344626 368571 243718 266747 278873 276535 520086 406711 265287 229482 301720
11968 301720 459369 149409 -83646 -63989 210480 192602 117682 -50564 -63607 -9611
11958 -9611 26877 187482 273218 297808 140530 225661 312022 270114 163857 188301 137915
11947 137915 57760 155683 297580 401320 563414 469644 337556 246373 197555 117354 80141
11936 80141 147083 234182 181445 155759 219437 87263 83588 -73085 -93924 8705 282302
11925 282302 230583 357548 492017 438446 559850 248081 196841 132440 81052 -142389
11915 -142389 -409447 -509696 -408668 -349048 -233949 -204943 -57735 -12720 6944 122092
11905 122092 26275 67479 23468 -230481 -231852 -13141 47325 100241 -2446 -251247 -82552
11894 -82552 87524 -128791 -174238 -255252 -353946 -390824 -286424 45938 99471 -187327 -151065
11883 -151065 -163810 -227965 -85593 213652 261672 129505 3609 -72963 -182634 -111579
11873 -111579 -8880 145436 80273 -165548 -171286 -294300 -320138 -239345 -465749 -397864 -482702
11862 -482702 -564551 -344962 -227978 -68836 -23845 -15099 -17719 129836 22826 -276796 -272416
11851 -272416 -138959 -405000 -359332 -291927 -123506 38699 183271 247224 137993 40343
11841 40343 -86943 -60310 -42613 -43518 -112311 -139049 -207566 -175325 2470 23337 -2119 98184
11829 98184 -88751 -316497 -261901 -315618 -97255 -1497 -68454 -231329 -155769 -65041 -57684
11818 -57684 -188093 -391064 -179895 -229627 -249060 -258528 -216496 -195579 97356 -44436 -169223
11807 -169223 -258173 -290250 -246628 -51078 17158 -195754 -353762 -191366 -247331 -363422
11797 -363422 -301234 -205357 -42978 121625 83566 37688 16940 46209 129248 -84234 -211215
11786 -211215 -250596 -190911 -269321 -426582 -425894 -438216 -305893 -109759 -197110 -313420 -362007
11775 -362007 -607951 -442571 -246896 -159375 -37300 -104583 -274667 -443976 -285496 -69856
11765 -69856 -81456 -172136 -177327 -302327 -368094 -215567 -170518 -102883 -85177 -397618 -576316
11754 -576316 -485033 -261626 43006 273986 314870 158231 -215359 -240134 -201137 -337942
11744 -337942 -506959 -386740 -159326 -246863 -274904 96857 -59986 -254492 -306448 -493294
11734 -493294 -623157 -626393 -705781 -484669 -451285 -706664 -540785 -241563 -217584 -333402
11724 -333402 -563432 -555289 -354326 -50461 13536 312848 435694 176030 117350 96569
11714 96569 171843 -33873 -310232 -251334 -242086 -352532 -448870 -364397 -39337 -7109 -35284
11703 -35284 -279780 -460257 -305912 -197131 -57658 12453 44596 -164116 -356693 -516137
11693 -516137 -444111 -181395 24601 -186662 -330134 -418929 -311260 -217257 -240268 -28561
11683 -28561 237366 97270 -83468 -22450 -142413 -128422 86552 377675 461017 64965
11673 64965 -128187 97216 -250136 -439549 -219792 -55331 78955 -51036 -218182 -246662
11663 -246662 -208545 -329416 -513569 -489280 -265434 -323147 -343981 -236160 -157901 -156076 -350168
11652 -350168 -303065 -66441 -93555 -32474 4752 -101271 1321 65740 273115 301158 276699
11641 276699 180380 26641 -271477 -326740 -223504 -46043 81242 -198074 -314533 -353308
11631 -353308 -390891 -117421 80304 -43750 -196348 -249627 -18441 118692 188521 -44587
11621 -44587 -196556 -253701 -163407 39585 13367 -24805 -14137 -58242 -103306 110095 172530
11610 172530 400383 195788 82243 -145127 -92734 -117738 -45158 -8321 -270385 -480341
11600 -480341 -427317 -119406 79526 191969 198343 157216 173780 4151 -84021 -235592 -264904
11589 -264904 -217057 118822 108124 -184317 -182367 -264681 -158012 37067 38333 -173569 -113943
11578 -113943 -199632 -112247 32427 -111696 -96278 -33083 -118005 -106217 -110209 90508 208255
11567 208255 236656 225141 163127 430564 646379 566605 565447 313468 268194 240711 149442
11556 149442 312321 560237 866887 750072 472766 345971 422820 507688 499656 476588
11546 476588 379652 440672 595408 755933 920525 812458 722756 640848 831457 824659 767615
11535 767615 846111 1096521 1191819 1131092 1040320 884124 794607 747327 804593 811859 928829
11524 928829 1267508 1393085 1169188 792384 697841 597751 751550 824444 689733 656945
11514 656945 683528 637336 733453 954623 903928 1030641 1164733 1195098 969677 782053
11504 782053 832802 1099832 1008268 801553 710923 703905 899091 995614 753346 708585 679524
11493 679524 739514 1076703 942228 696188 578535 498306 586275 650875 765561 723744
11483 723744 766282 896367 867897 923945 943641 708039 494648 599774 539245 442053 261583
11472 261583 292247 213342 235084 268637 491466 587826 382580 353544 438424 382789 348113
11461 348113 214803 341661 323258 129553 40142 91186 179443 297636 485747 535049
11451 535049 503345 335444 176656 180022 212220 310267 565681 660697 412632 36729 154242
11440 154242 70599 69567 173839 283172 131571 107164 223095 540093 649432 483525
11430 483525 422935 633079 618361 427445 334216 518285 520184 306060 51667 -1117 120249
11419 120249 94872 422306 599980 787843 685571 449772 543992 639489 219076 -1716
11409 -1716 72437 397108 660128 787556 822283 762800 575403 454406 584960 772665
11399 772665 924853 1080650 816730 864142 984884 923501 766529 870176 820816 798758
11389 798758 598261 652359 658038 725237 807382 740219 742354 605319 428473 445357 616559
11378 616559 483014 383792 589966 660070 481199 530891 678463 590146 642766 685691 543349
11367 543349 724867 690762 519436 485378 378348 510808 530185 662345 575208 488048
11357 488048 515332 704894 598515 451754 359119 56120 -118618 -137048 277369 437435
11347 437435 395932 471947 523700 502519 393358 449907 639675 671928 538234 506774 282925
11336 282925 183752 235496 74762 44002 257500 308810 247023 351325 275365 196965 209811
11325 209811 157977 274923 371595 244802 148021 217772 241543 210678 132250 353799 500834
11314 500834 323739 378195 478326 314460 263614 355667 290938 228112 183056 197597 333159
11303 333159 258549 396912 430327 462567 147484 -5695 41286 150218 235817 267573 504494
11292 504494 508372 256738 143956 281479 436871 551607 521326 274471 126083 172644
11282 172644 334059 390738 183449 117498 445264 490434 454413 304880 212509 180542 167614
11271 167614 286677 159742 271957 645168 688287 687138 592182 702570 635860 534521
11261 534521 525708 666266 775206 912344 720420 812961 954171 721316 410748 393885
11251 393885 425356 504684 623527 514602 334485 239304 129725 108346 214751 264634
11241 264634 362703 295177 302715 246045 255024 239643 338535 249493 235728 528758 723379
11230 723379 630153 436171 198493 311764 403225 568910 546252 737870 861399 1007753
11220 1007753 1079628 827915 706028 529371 511551 735921 754080 460365 250950 464652
11210 464652 618991 535694 435477 451533 518774 522525 507324 656638 668805 465439 349242
11199 349242 275693 609878 693405 808798 948047 771789 752980 826199 798499 800364 805099
11188 805099 683196 644739 594331 576471 613600 543863 489934 687398 764173 970896 1046630
11177 1046630 1073240 1175794 802324 574580 439680 449748 366219 253853 457381 610128
11167 610128 619042 705879 531369 649612 743923 851695 1127042 1425656 1159873 985810
11157 985810 1060530 1071204 969369 1086968 1114665 1015549 870043 837000 838087 801613 892113
11146 892113 911577 825277 1355490 1870146 1610225 1451896 1448994 1507065 1433259 1206213 989658
11135 989658 804532 701070 614128 798195 1007605 1109198 1076492 1062065 1082936 1331980
11125 1331980 1597263 1656860 1592996 1497593 1501813 1431793 1424699 1386111 1471824 1855469 2012551
11114 2012551 2167250 1988460 1730464 1656950 1687802 1621064 1878071 2012462 1872496 1801417
11104 1801417 1591768 1484844 1559163 1720425 1899030 1868400 1811030 1659485 1682413 1683276 1685209
11093 1685209 1510939 1507966 1457701 1467770 1418201 1447531 1372162 1464134 1468675 1533978 1413352
11082 1413352 1235619 1125890 1048284 1086062 1161710 1228087 1288614 1092437 1091753 1330905 1412989
11071 1412989 1080168 958254 1152545 1291334 1445988 1292162 1091814 1073916 1255995 1260580
11061 1260580 1528947 1664285 1496082 1411039 1320380 1284442 1075781 1131443 1117241 1106111
11051 1106111 1320028 1719008 1749998 1707162 1689883 2066171 2312700 2434443 2608819 2457611
11041 2457611 2535539 2676223 2920840 3174156 3423399 3457740 3740405 4134901 4521813 5004661
11031 5004661 5279933 5800658 6476374 7088396 7482474 8087707 8954380 10200803 11140710
11022 11140710 12113282 13364257 14835170 16574441 18255498 20199358 22047964 23500720
11014 23500720 24857715 26178133 27663014 29195808 31020354 33016828 34946545 36269471
11006 36269471 36642690 36800335 36383599 35677362 34995913 34454226 33698479 32728479 31843589
10997 31843589 31313723 31181827 31013740 31226569 31303570 31771084 32647926 33644235 34934307
10988 34934307 36320351 37707685 39029618 40397778 42190798 44283138 46171897 47806133
10980 47806133 49258272 50536112 51435543 52683646 54171373 55608324 56834237 57409673
10972 57409673 57519430 57339870 56609654 55669062 54433416 53243270 51935991 50365229 48837009
10963 48837009 47143176 45252087 43886948 42378084 40978479 39736559 38866890 38390801
10955 38390801 37708010 37085483 36798046 36521439 36688912 37266373 37519244 37891805 37983903
10946 37983903 38438651 38960632 39504150 40296387 40981786 41668608 42362948 42898152 42506844
10937 42506844 41314240 39790043 38198921 36540045 34507021 32757367 31102935 29569046
10929 29569046 27817125 26154469 24814226 23479166 22243853 21077398 20247523 19639897
10921 19639897 18856756 18028530 17148846 16628758 16006448 15385828 14890843 14561735 14440862
10912 14440862 14184220 13908052 13491628 13119601 13008556 12901103 12729475 12635655 12239123
10903 12239123 11934035 11822682 11650334 11288607 11314834 11343041 11094838 10731644 10460931 10392726
10893 10392726 10551808 10712257 10891608 10932665 10849340 10640751 10344966 10127956 10078277 9937475
10883 9937475 9663133 9707938 9872234 9884322 9827150 9799035 9722870 9672226 9453542 9312924
10873 9312924 9398343 9264728 9021557 9110742 9116073 9305955 9193396 8930441 8875197 8894824
10863 8894824 8865377 8649116 8447419 8710595 8687504 8469531 8184483 8500853 8629244 8458344
10853 8458344 8417107 8476828 8360971 8208954 7961583 7745077 7619520 7636012 7776804 7829346
10843 7829346 7837550 7745206 7435470 7217043 7258020 7260972 7251006 7390127 7447505 7294339 7191919
10832 7191919 7068785 7081453 7206566 7306758 7536008 7605366 7205013 7037298 7290186 7690532
10822 7690532 7849905 7624502 7641951 7677786 7628553 7309761 7335762 7451569 7431762 7185126
10812 7185126 6691691 6486838 6347325 6178758 6077695 5918303 5804540 5737140 5704277 5648588
10802 5648588 5616382 5511587 5408888 5215997 5040039 4862375 4712450 4897048 4759208 4579648
10792 4579648 4359247 4374843 4530187 4298876 4221029 4044111 4158402 4281057 4189859 4025761
10782 4025761 3802675 3668049 3481350 3352507 3404503 3532125 3735575 4110176 3962867 3799905
10772 3799905 3690752 3871669 3891010 3967923 4097583 4152704 4219318 3923581 3767034 3818862
10762 3818862 4218507 4507989 4393794 4437464 4509074 4441563 4516115 4686024 4550987 4498055
10752 4498055 4302493 4257311 4058403 3871485 3650277 3503142 3444560 3388986 3207625 3027182
10742 3027182 2822376 2737210 2328685 2243400 2428653 2246664 2081719 1973712 1964670 1890702
10732 1890702 1828009 1982868 1976660 1915018 1574831 1633221 1723583 1654253 1434438 1201689 1382722
10721 1382722 1491615 1438944 1361436 1283066 1326950 1312105 1155377 1174205 1203846 1083778 1037962
10710 1037962 1159789 1091361 1019997 968240 1187545 1021892 1123452 1483122 1621065 1660611
10700 1660611 1470851 1386673 1475894 1735712 1504883 1279208 1076940 1163144 1276126 1432835
10690 1432835 1374738 1047704 1224950 1641311 1778848 1541974 1203256 1037898 1094872 1107270
10680 1107270 1155423 1374424 1806446 1798164 1499032 1698453 1814673 1950012 2137038 2228983
10670 2228983 2114899 1875172 1960619 2111010 2264530 2346631 2317207 2145641 2234125 2243214
10660 2243214 2084071 2309171 2391748 2345048 2313867 2085735 1958221 1864661 1967144 2046310
10650 2046310 1929597 1965058 1926239 1888481 1953462 2000201 2160205 2050564 2031899 2086457 1893675
10639 1893675 1812095 1802989 1802522 1772021 1897385 1844544 1647045 1591701 1611501 1430062 1390208
10628 1390208 1553889 1577925 1274799 1407175 1618162 1711458 1686803 1452462 1193530 1293329
10618 1293329 1412138 1399042 1191925 1217356 1411792 1272599 1154095 1269887 1143412 955263
10608 955263 875988 778173 438491 609070 630239 602569 591028 567617 550447 339888 370301
10597 370301 382296 351278 580121 670626 683298 430654 706152 918647 929292 713358
10587 713358 719283 712424 687026 607906 506897 541950 517905 575515 571229 539923 624227 646805
10575 646805 776698 1008111 992530 886440 780695 960779 1149784 1363597 1544370 1564443
10565 1564443 1474931 1576272 1738755 1866734 1870964 1893593 1987838 2095092 2386749 2475096
10555 2475096 2454417 2490993 2546290 2621430 2884121 2984515 3251729 3649862 4030056 4246671
10545 4246671 4409868 4636440 4733265 4813049 5134728 5353627 5605817 5816219 6203761 6439976
10535 6439976 6538087 6485643 6772453 7276541 7584758 7790980 7961658 8365483 8382190 8092134
10525 8092134 7821087 7543619 7277702 7175983 6991865 6597279 6407971 6102505 6045509 6003383
10515 6003383 5787732 5484898 5266627 5269555 4919506 4710454 4522716 4644557 4493006 4176944
10505 4176944 3847574 3624818 3537090 3175384 3003720 2883919 2887618 2654616 2513331 2288748
10495 2288748 2461612 2677692 2647739 2401916 2404071 2438605 2405723 2523518 2637295 2783318
10485 2783318 2672128 2293026 2273686 2249195 2263137 2151501 2156873 2045257 2079582 2057019 2208345
10474 2208345 2481680 2446301 2230345 2051095 2097331 2329860 2323498 2314015 2381651 2571756 2732387
10463 2732387 2598625 2812227 2481457 2328451 2250214 2275738 2574356 2480855 2719766 2858508
10453 2858508 2869576 2726808 2621660 2759448 3005497 3107483 3133383 3057421 3437650 3719719
10443 3719719 3937016 4083156 4567292 4815344 5092318 5538096 5869942 6202135 6877179
10434 6877179 7344364 8091339 9062774 9700346 10359062 11212219 12277081 13556836 14811766
10425 14811766 15987704 17223584 19152877 21284651 23302997 25516524 28127177 30782907
10417 30782907 33563705 36756708 40380059 44694966 49374194 54873342 60692111 67353317
10409 67353317 74780880 82647204 91439538 101157433 112353965 125487847 140414205 157666030
10401 157666030 176520979 196649767 216845176 235303908 251450597 266255501 280222278
10394 280222278 295067086 313608423 335377912 358161491 376890432 387721379 389097779
10387 389097779 381515485 367194644 349009909 329671167 310077093 290381660 270491021
10380 270491021 250200736 230193879 211132146 193454330 177469341 163347584 150575728
10373 150575728 139397619 130035827 121987604 114633942 107990410 102144172 96759010 91440930
10365 91440930 86423301 81634097 77270875 73242868 69634562 66633503 64057466 61868189
10357 61868189 59575942 57640153 56018216 54556115 53332857 52067148 50565941 49204768
10349 49204768 47749939 46453017 45262757 44185832 42943587 41950880 41341229 40662930
10341 40662930 39779335 39221645 38669543 38086787 37589622 37011054 36117487 35561871 35180546
10332 35180546 34738156 34197677 33758549 33117631 32847621 33139474 33241265 33188538 33043554
10323 33043554 32759909 32431572 32204926 32016011 31788907 31381170 30972522 30661283 30460164
10314 30460164 30222352 30365877 30479385 30255746 30305931 30243107 30209884 30212990 30080466 30191992
10304 30191992 30469501 30832998 31040544 31003398 31086429 31156943 31103656 31250081 31505637 31727878
10294 31727878 31850465 31907380 32166286 32320426 32353192 32603889 32773583 32827291 32899010 32878890
10284 32878890 32827905 32791178 32703861 32601012 32315057 31895018 31625362 31541224 31372033 30813124
10274 30813124 30251793 29754355 29187370 28669533 28159697 27769082 27416096 27041687 26570005
10265 26570005 25997321 25440200 25064811 24543290 23770283 22903234 22332542 21978439 21738726
10256 21738726 21352578 20910142 20292845 19868309 19544499 19223220 19063471 19078927 19067687 18747255
10246 18747255 18261395 18002257 17740288 17470997 17161757 16743462 16390592 16429248 16341356 16074702
10236 16074702 15832405 15465075 15393289 15177135 14784071 14550655 14310442 14194337 14216425 14192036
10226 14192036 13962893 13700267 13447617 13164283 12802990 12584321 12411180 12252970 12170700
10217 12170700 11895943 11560213 11434816 11654428 11550177 11250030 11121150 11107622 11134838 10961120
10207 10961120 10768085 10921049 10987514 10905103 10760287 10629313 10609502 10417489 10193571 9940622
10197 9940622 9907549 9855311 9891588 9764409 9511191 9315946 9011879 8733772 8485703 8142949
10187 8142949 7935797 7758070 7387206 7200216 7100669 6991037 6933685 6991700 6725940 6258060
10177 6258060 5858628 5546665 5260502 5353597 5117540 4778848 4520930 4415530 4439862 4400438
10167 4400438 4190961 3968503 3755102 3631273 3390802 3458794 3506593 3348576 3180293 3026535
10157 3026535 3151603 3112613 3066718 3067245 3118548 2844567 2698667 2817514 2736164 2565687 2414153
10146 2414153 2314913 1974083 2031545 2214959 2192596 2256186 2416823 2334338 2116631 2110744 2100234
10135 2100234 1890883 1868967 1943328 2013204 2030083 2041849 2150109 2158845 2076245 2070222 2197829
10124 2197829 2098118 1918003 1750848 1695655 2025682 2051787 1961437 1938525 1838055 1924730
10114 1924730 2104016 2176466 2004583 1920786 1969503 1883725 1971278 2275259 2237352 2021976
10104 2021976 2132123 2277801 2223505 2273067 2170935 2019866 2071174 2201937 2389282 2469329
10094 2469329 2213241 2236082 2335286 2302219 2429857 2344160 2218208 2119798 2293037 2425386
10084 2425386 2419919 2589180 2684370 2553577 2605992 2800885 2994224 2899707 3028602 3158854
10074 3158854 3049543 3013007 3087814 2864433 2648864 2575234 2609782 2719625 2785406 2871790
10064 2871790 2640941 2460499 2656750 2968524 3032494 2934436 2717999 2670395 2953253 2985179
10054 2985179 2899158 2784039 2701559 2686110 2718099 2628150 2519543 2476774 2352420 2371098 2325344
10043 2325344 2416931 2501306 2524555 2535191 2571116 2377399 2419756 2473821 2357147 2154932 2201363
10032 2201363 2012106 2170105 2183285 1958489 1876046 1892048 2001751 1850617 1812125 1901999
10022 1901999 2024577 1919009 1854970 1869992 1965808 1840855 1698518 1505058 1360550 1307582
10012 1307582 1382876 1316369 1281720 1130453 1060944 1120124 1286579 1259761 1292689 1516753 1348740
10001 1348740 1064063 958047 1081636 1218545 1375699 1295293 1094660 1298220 1521606 1258470
9991 1258470 1127101 1111297 1000103 1027016 1111591 957381 1154082 1386090 1277270 1068492
9981 1068492 1130941 1103095 1153447 1004580 846714 1030500 1059813 1159563 1390155 1610936
9971 1610936 1619887 1785911 1955740 1915354 1836363 2144372 2297616 2241922 2316044 2614186 2669434
9960 2669434 2531684 2266465 2350572 2633863 2831299 2794713 2781737 2849330 3011301 2693317
9950 2693317 2570975 2539320 2566112 2392264 2420711 2136942 1854255 1623096 1503824 1540063
9940 1540063 1924616 1833274 1659728 1558161 1456199 1488628 1553711 1344130 1286904 1403464
9930 1403464 1450304 1228319 1457488 1512753 1368031 1219238 1231982 1201091 1083387 1158606
9920 1158606 1250360 1313774 1633317 1663489 1444083 1248080 1155544 1175683 1232396 1295773 1252691
9909 1252691 1262090 1497887 1561974 1508077 1631605 1586036 1459679 1601475 1518170 1600441 1923612
9898 1923612 1831698 1811354 1833969 1948859 1759907 1675300 1576646 1242594 1049602 1203938
9888 1203938 1392524 1525469 1306377 1135131 1345397 1526429 1640736 1860632 1964217 1802625
9878 1802625 1814284 1634183 1555607 1709191 1942057 2173553 2125861 2007678 1975468 2225565
9868 2225565 2529452 2610128 2665540 2865807 2919337 3050467 3228751 3574341 3765619 3916109
9858 3916109 4319365 4601255 4868882 5200486 5961626 6509719 6898546 7228890 7601405 8163775
9848 8163775 8731760 9317547 10243442 11130808 11925711 12711296 13454823 13924643 14670174 15527297
9838 15527297 16014212 16405712 16860375 17164478 17250585 16983917 16416861 15694729 14922812 14098930
9828 14098930 13337775 12471297 11753035 10995656 10153742 9522956 8979011 8487327 8028876
9819 8028876 7486765 7070894 6955100 6906032 6572555 6325656 6062413 5619232 5183689 4966702
9809 4966702 4531554 4309635 4243463 4199566 4046643 4210137 4095173 3737557 3362250 3422762
9799 3422762 3336064 3216451 3212412 3215865 2814507 2480895 2498501 2697236 2518404 2384296 2550558
9788 2550558 2450841 2415361 2451822 2544849 2598939 2572430 2673230 2795493 2745410 2528775 2432761
9777 2432761 2378653 2259530 2298167 2143246 2170138 2372639 2504900 2171708 2048352 2291209
9767 2291209 2437914 2502130 2379111 2254712 2155988 2240080 2418935 2263251 2199345 2188683
9757 2188683 2046427 1990696 1895425 1973838 2289433 2373538 2397648 2304083 2312086 2394459 2063028
9746 2063028 1825550 2016323 2197369 2289523 2169944 2032637 1983016 2138581 2324243 2207319
9736 2207319 2457986 2334563 2210399 2472057 2457077 2328490 2511512 2652791 2637613 2526048
9726 2526048 2633887 2590555 2527713 2559578 2567710 2437883 2204077 1997027 2018635 2055851 1734838
9715 1734838 1616636 1583685 1723106 1959708 2206972 2472631 2412831 1994908 1723332 1719795
9705 1719795 1795167 1554067 1264586 1071189 1126971 1112671 1024271 889952 978977 1264556
9695 1264556 1501750 1425627 1444005 1510965 1371244 1330316 1447891 1549386 1521087 1379827
9685 1379827 1367136 1346237 1062243 834761 1091480 1249963 1411976 1439240 1220250 1242226
9675 1242226 1313965 1179118 1085974 1064800 1113112 1254700 1140579 925830 829579 841730 895417
9664 895417 849438 726150 803350 1100683 1202161 1115401 1253154 1096177 997938 1051055 1122587
9653 1122587 950529 699785 734357 772582 790232 1083616 1195891 1049440 977945 865410
9643 865410 796972 743820 549498 370791 532956 588888 692357 619256 854872 1011189
9633 1011189 1056658 985751 802588 724243 687339 656152 564241 358536 401560 720329 866672
9622 866672 688309 555055 648866 659211 771279 557701 606191 665572 586582 436120 328068
9611 328068 410106 717189 735009 529065 496963 387869 428082 499503 415787 515793 607802
9600 607802 407078 375694 373609 395886 429468 749142 922040 979758 1119610 1003979 984626
9589 984626 670426 495593 592689 622624 827340 719916 294568 268716 528260 657848
9579 657848 582899 603110 756023 739357 661968 794048 721886 413317 483094 360528 316238
9568 316238 369474 552267 664522 657723 816741 889205 691491 661054 731762 696308 707721
9557 707721 688051 563420 407031 321659 302743 495878 646294 887451 903761 862551 545680
9546 545680 468369 574108 665716 815639 1097877 1167629 1100586 973062 816846 664139
9536 664139 711067 806522 884345 850972 631987 535613 664163 549418 554083 670726 787269
9525 787269 932094 937847 721902 697114 646043 856494 858693 838484 777164 510707 571492
9514 571492 469558 233983 373370 508605 539894 680923 797117 896348 913932 489029
9504 489029 512915 466807 472615 498079 720040 731779 714219 688936 853449 746583 435407
9493 435407 557185 775849 862019 960827 1087205 879688 594435 315614 408582 718091
9483 718091 845538 1130182 1075942 957008 815953 817202 737269 693481 582418 546251 645812
9472 645812 520675 480451 494682 496908 549989 538503 545625 817713 826964 739300 534651 305954
9460 305954 176806 114895 88685 309971 526300 742785 639153 606788 574917 483366 445502
9449 445502 295580 175197 300439 355311 645716 1088153 1030377 756706 645740 668264
9439 668264 816137 941558 853896 934026 1020780 784508 1056275 1030022 1012163 1149873 1015533
9428 1015533 993366 1007248 987165 940606 644601 790433 820794 762277 827535 976752 1176100
9417 1176100 934353 663728 744905 767519 802197 837792 1112319 1216120 1085372 952779
9407 952779 807616 611535 741541 946383 1055951 1028202 907941 843174 988827 1085214
9397 1085214 1001796 1218110 1366881 1233915 841879 756969 741614 948805 1042268 979371
9387 979371 774273 910429 1113840 1322399 1464388 1309661 1251018 1312766 1090624 1144775
9377 1144775 1101356 941266 875361 752697 844300 1075601 1069367 1295447 1736472 1449944
9367 1449944 1213867 1339502 1253322 1153038 1197438 1324958 1275600 1147252 1181413 1363509
9357 1363509 1512289 1464419 1579801 1549500 1513847 1753859 1803677 1574577 1388798 1417967
9347 1417967 1550641 1538011 1586788 1771641 1617210 1827488 1709357 1149181 1070529 1330930
9337 1330930 1511525 1414881 1323770 1537412 1355174 1356764 1734092 1773975 1569702 1628552 1911333
9326 1911333 2096717 2007469 1860536 1608018 1689296 1517098 1486722 1404775 1290924 1125204
9316 1125204 1266761 1170584 1187543 1310258 1519695 1522165 1444390 1552991 1641271 1350803 1324004
9305 1324004 1700319 1684840 1529215 1529067 1705208 1783599 2070177 2042156 1782393 1739754 1572009
9294 1572009 1623800 1552306 1698747 1836001 1827151 1602466 1367153 1408175 1744428 1747014 1800553
9283 1800553 1910002 1709071 1519440 1365049 1396824 1650708 1760026 1540985 1586548 1865025
9273 1865025 2056468 2130194 2040130 1773057 1465610 1396911 1273209 1163473 1423092 1757254
9263 1757254 1782632 1550545 1181587 899157 930368 1191020 1180356 1172246 1307733 1564871
9253 1564871 1573221 1600832 1587885 1689685 1644313 1554932 1271090 1408669 1448585 1479477 1439689
9242 1439689 1451603 1630713 1350338 1056630 1063620 923084 1048010 1275506 1217414 1302480
9232 1302480 1229120 1059878 1194031 1412238 1213358 1116673 1130884 1105266 1112491 1169297 1075617
9221 1075617 847806 1007406 1225823 1287555 1259535 1215660 1355622 1387145 1152015 927829
9211 927829 740516 806569 1062065 1006397 818301 919497 1038963 1350342 1129058 955994
9201 955994 853485 885858 919550 951397 833699 733751 1072828 1210278 1184124 932074 803370
9190 803370 934218 952953 869815 804462 699035 854068 906953 993733 817294 799607 783136
9179 783136 701683 825634 1084550 1215565 1338578 1258339 1240206 1138702 1249276 1304587
9169 1304587 1133034 1015284 891561 855698 789924 628704 435327 764829 936469 859269
9159 859269 710530 592306 672252 811499 1029700 973714 872808 847634 944486 1000122 772839
9148 772839 774667 838732 841489 737632 783723 824994 679030 663679 895905 909471 875639
9137 875639 607080 544522 455464 264268 307219 396519 431680 439101 506216 597636 597411 703662
9125 703662 628670 653002 652541 413696 639546 533445 372391 289764 245138 372805 534052
9114 534052 642698 697479 804277 1036628 1107609 1025203 891009 843189 763018 779655 831198
9103 831198 970289 887558 730711 496079 362338 383383 609772 782721 671663 488602
9093 488602 328938 249476 330951 477184 443463 272165 382308 553601 635036 442727
9083 442727 424619 564976 707987 708696 875956 955378 935868 874528 1003715 1067377 1145600
9072 1145600 868776 558945 256291 47975 78295 129151 11125 43233 366289 459706
9062 459706 434809 548542 536520 312083 264182 355455 303335 373637 680050 556885 505751
9051 505751 545083 383957 150277 115912 560774 681755 775532 634866 427118 405971
9041 405971 293934 51332 195618 566112 538916 402611 206706 212701 220756 369376 427406
9030 427406 614904 700030 615343 529084 682013 792489 783337 657255 354929 377579 282284
9019 282284 116144 294405 505288 540794 554973 507671 334861 428753 726974 1056881
9009 1056881 1085838 961906 714057 425686 564499 610905 690130 653770 708106 681945 463336
8998 463336 527251 495287 241997 142969 148028 234598 111206 -18871 379355 728117 664778
8987 664778 398930 173823 72669 -77389 37037 87917 -124165 -179110 -53601 128550
8977 128550 293050 323448 279420 238441 -64336 80541 321571 308150 286015 264244 393102
8966 393102 404384 303163 268013 32034 71360 190816 174175 70725 129123 158279 292647
8955 292647 132199 9367 155188 327851 380274 63761 144080 366902 404738 468686
8945 468686 566314 319737 169494 415881 341229 215549 170118 72255 -35771 50633 342881
8934 342881 459243 283028 134400 77265 164613 171633 34392 58650 214348 -18088 -198991
8923 -198991 -3872 90295 17179 -115603 -186861 64898 90121 215169 344705 391654 259515
8912 259515 195241 223955 352695 266386 20841 -74946 -22503 209942 287854 543863 433028
8901 433028 258983 379127 493787 537468 413446 355783 134797 -31264 -95102 -24729
8891 -24729 -73132 -52439 79683 372173 612643 561672 205972 216100 136258 -114668 -380272
8880 -380272 -342050 -140664 64483 207354 391523 146620 -2049 -100873 -82009 -171169
8870 -171169 -82526 149040 326273 419719 416237 453467 315722 54338 37159 67237 29532
8859 29532 216674 692742 889070 590014 596792 564811 405600 491314 252518 9832 99552
8848 99552 81521 1962 153639 299434 323253 148408 -86707 -77188 57065 9160 122255
8837 122255 207556 137329 222432 271834 180665 222934 457551 553046 615608 680421 642661
8826 642661 590384 545630 361691 138786 130494 -54926 -48841 40374 -56360 141340 176783
8815 176783 -76 193404 346197 328709 163345 22420 -291703 -299396 -67020 227726
8805 227726 309804 213061 -11843 75828 128453 204193 140708 15916 4127 120827 167983
8794 167983 -36850 12220 50795 -102429 -45250 300168 387516 160252 44383 95249 270430
8783 270430 398837 327876 294637 205280 69872 187407 384040 244441 445953 412692
8773 412692 321953 330752 214746 331911 360003 380527 182279 172166 159349 315451 400075
8762 400075 168828 231587 241598 151731 164639 251292 133390 192720 240509 281170 194305
8751 194305 253414 141467 128518 67197 4094 -26662 37833 79281 237653 334191 260473
8740 260473 410754 337171 82140 7268 28179 -71613 -60426 193591 301566 356227 477193
8729 477193 510848 628168 548989 615853 608368 593259 338784 158745 -173691 -397645 -137264
8718 -137264 357485 546895 531674 520429 484958 533156 538465 447422 509089 234177 360495
8707 360495 496364 476711 454075 510078 677453 608796 114918 88389 189800 70858 -1954
8696 -1954 207328 325789 396671 481047 84292 63147 161121 166483 256874 321990 333148 282133
8684 282133 471867 347622 319156 578763 678155 414189 345906 156171 340454 520386
8674 520386 655651 680186 326927 227191 377513 215584 68908 143478 277813 362541
8664 362541 277521 30564 -235971 -259410 -2365 413521 367400 394238 402905 633683 762602
8653 762602 736192 664134 407509 464972 864287 1009415 892807 730280 653415 494128
8643 494128 566337 785878 1062277 1030013 820041 667086 721462 876628 731531 488057
8633 488057 353841 345967 580273 764420 1154313 1069090 899354 849942 873628 916320 885707
8622 885707 947582 1025146 1166059 1132311 1172332 1212075 1175983 1313839 1308905 1302379 1195958
8611 1195958 1216173 1319968 1293817 1370797 1520823 1750670 1775232 1598115 1413104 1088361
8601 1088361 1103800 1594414 1801605 1710940 1781897 1956430 1976268 1853246 1793089 1892367 1918099
8590 1918099 1979457 1871597 1761107 1667288 1541746 1297814 1284778 1247501 1268945 1227565 1405384
8579 1405384 1489296 1402750 1272832 1272901 1243847 1224958 1040105 785389 608357 579314 753629
8568 753629 866532 996217 844405 683244 538856 558867 798750 890805 965584 1063943
8558 1063943 846991 1066855 1135157 950231 1083935 1203309 1168376 1054458 1041526 963001
8548 963001 711951 554164 485089 535114 479584 349630 551581 543820 586368 526185 354407
8537 354407 467174 496601 233699 182680 264224 510129 540221 507979 531778 498826 430310
8526 430310 415581 659147 601208 617490 648037 367436 514293 500138 557026 594105 572279
8515 572279 645666 462131 582370 671514 558736 393186 67001 41052 39740 173365 292766
8504 292766 456305 296292 348501 297610 365417 414212 224690 71390 172144 415016
8494 415016 375882 269024 238656 387314 239162 254737 357860 321691 359854 430018 644286
8483 644286 610170 399259 501530 629337 712175 774908 407440 326130 304527 444352 766138
8472 766138 837846 691314 633726 485425 406226 271356 185570 115104 150315 305849 515823
8461 515823 420615 281499 161662 323887 254263 104309 114981 5404 27170 -9346 214410
8450 214410 486851 367388 147560 251388 461558 480243 362576 294410 353382 373132
8440 373132 138669 98936 248533 349437 81465 -90866 -41948 436046 729238 654501
8430 654501 562810 327403 82540 -205017 -4640 13815 85284 5086 98021 335655 547369
8419 547369 558394 506169 393779 211636 245990 278277 538396 762796 487818 335471
8409 335471 456801 375538 290173 -72022 -130611 272748 306401 290654 406311 357530 451533
8398 451533 498116 393385 361234 501908 553517 357801 153281 17153 -113845 -302118
8388 -302118 -65605 274982 215643 -71481 46910 269759 380448 148513 -40587 -31482
8378 -31482 20628 122093 96090 54897 317972 300376 70853 -167712 -71277 -56154 51809
8367 51809 268606 397882 281429 369883 113270 -24304 38602 -35240 -88681 111712 209285
8356 209285 266169 -45403 -245949 -12551 136310 120362 -13489 -163027 -164357 -86770 92957
8345 92957 192482 304190 323023 141059 60085 -206225 -214935 -96666 -141291 -275803 -173804
8334 -173804 135331 182824 104337 49236 124665 21290 4158 176405 104872 -101214 -218282
8323 -218282 -107684 -117326 -96367 -60628 -161300 -31498 -526 -81981 -186574 -251148 -126207
8312 -126207 -22787 27357 156405 287701 331776 190762 231168 261025 -44228 -35453 340630
8301 340630 510724 330847 194337 263293 272022 42456 -235021 -88041 10484 -38454 28572
8290 28572 224861 349371 258033 19329 33206 148220 321354 95395 -3012 35587 105147
8279 105147 298975 195355 240332 240768 146063 176394 -68062 -128088 42990 242892 223372
8268 223372 -83825 -172743 -109181 -8940 138059 -24817 -71689 -42240 -33572 -246211 -64918
8257 -64918 187645 273586 167563 165107 202072 238048 280295 131674 40529 57395 265583
8246 265583 174984 417584 629969 564980 622690 518957 507757 516286 367746 46081 147081
8235 147081 27103 33881 57180 -19994 24777 36839 103383 377484 393387 222818 151478
8224 151478 139714 50131 -191427 -336233 -104006 58768 126934 221286 393287 486292 318270
8213 318270 139546 287564 184872 145250 168982 -155651 -155330 94068 164565 216741 -21655
8202 -21655 -100728 -89938 -13449 77330 207553 150460 -49516 -232437 -331411 -263833 -184636
8191 -184636 -173242 -241496 -9979 -1346 104763 183153 121533 198484 380980 502108 374335
8180 374335 117354 51616 102055 20896 53957 140289 187553 19646 -44964 -138737 -132824
8169 -132824 -33713 -71220 -22580 109544 288286 249998 40776 -59658 218872 385387
8159 385387 336151 229889 79424 -10779 -75802 -222887 -119067 156351 222772 31112
8149 31112 68077 91607 -87236 -64394 -120019 97276 159199 -23443 -64085 -114230 -174810
8138 -174810 -233052 -146466 -26670 116451 115044 93373 194657 71023 -287545 -474374 -584454
8127 -584454 -421551 86685 217122 175936 39319 -74232 -200738 -250693 -130188 -29636
8117 -29636 108705 40364 -45764 164170 93884 137127 223499 325332 242113 102404 175202
8106 175202 167047 173546 130267 -3689 -62649 212461 535116 352603 188636 -68380 -227009
8095 -227009 -245806 -382357 -297897 -186751 -264793 -130185 -111597 88671 151669 117328 142189
8084 142189 -65294 138389 303666 435687 605707 489809 77519 -155080 -125706 -179145
8074 -179145 -199066 -255859 -292254 117296 365821 468182 552748 369593 394302 218206 272755
8063 272755 217565 314203 411231 375145 252061 369929 418490 400367 441909 328419 250110
8052 250110 -42756 -113103 -141265 -209559 -201557 -105342 -177379 161366 375988 514314 252717
8041 252717 241966 388691 575035 553601 676082 840588 789624 634631 511633 429072
8031 429072 618519 658994 454378 496481 657673 704475 482545 325380 524150 651064
8021 651064 576446 464107 401538 399174 365816 467726 595480 312902 30949 -9610 -16650
8010 -16650 167948 237830 363416 478638 547972 620042 538192 494226 438029 597771 526553
7999 526553 453377 488783 462860 315964 203796 272718 261685 482380 515159 518552 623531
7988 623531 603852 548003 640556 510899 608121 759437 644902 557543 673245 705616 480717
7977 480717 240547 349462 436726 411227 381013 419111 525169 570636 804977 639062 471016
7966 471016 589735 446314 523640 572834 546198 671071 786439 905091 1036876 869521
7956 869521 879095 651487 526922 194150 231567 274668 355916 603433 912246 835652 806648
7945 806648 847244 845978 1014157 943360 1039336 1095378 1160549 866263 727644 760685 915680
7934 915680 901992 788520 805980 998834 858022 767357 960274 989153 1120878 1085728 989774
7923 989774 931030 863928 917028 980822 927990 874673 854220 677431 817669 972835 804295
7912 804295 714069 905186 778458 734998 813197 672802 767693 833610 945516 1109982 1163506
7901 1163506 1106158 1046034 865028 840472 548817 325408 516606 881514 702175 636746
7891 636746 908585 1037047 1014367 984567 808686 612966 528749 466611 533422 709335 737497
7880 737497 870464 901703 997282 769954 667746 508899 536718 650176 746075 664518 445506
7869 445506 318342 238221 298372 393530 566088 230855 82273 227259 497280 926865
7859 926865 880269 643155 492462 460853 551279 825734 908549 884076 750893 570238 294025
7848 294025 345897 502597 717796 701804 502981 447995 595299 669395 715389 766005 673318
7837 673318 491332 229076 174574 302406 272578 251209 306919 254150 576152 541951 458702
7826 458702 519441 474361 646426 723785 707917 596807 404033 177042 278489 404628
7816 404628 438973 314449 97844 171241 349170 355595 362694 422729 669906 671465 412580
7805 412580 446061 536777 304690 24317 -43014 222419 435940 449053 383853 247714 173286
7794 173286 45669 -97797 -199420 -222549 22747 177665 275892 397448 204796 130931
7784 130931 172305 199241 518946 538690 217185 92985 130083 202538 313388 264469 487275
7773 487275 717450 627678 571758 479079 443633 483713 363306 326583 257141 211728 226582
7762 226582 93961 141221 306933 138463 -30177 -183931 -164804 -98185 -93937 178468 158035
7751 158035 204540 286937 31862 16487 13740 272276 287099 168997 19003 18829 -71613
7740 -71613 -79031 -92326 -1508 -324070 -341132 -174315 -178268 -36846 91043 225582 363329
7729 363329 381076 289281 226288 288209 94250 -53163 58220 88882 300810 272227 412133
7718 412133 341331 153760 278146 308970 393937 389307 551140 542443 467171 688670 658723
7707 658723 392122 51036 -124014 7678 -141760 -81145 123939 448524 334285 272265
7697 272265 396767 564529 240339 -39762 31548 138144 117162 -106958 -178680 -250524
7687 -250524 -218394 -346443 -218558 21180 181615 -64027 -91334 -9386 329296 239224
7677 239224 27709 -69742 214 -216970 -511127 -414123 95526 125990 -70616 168831
7667 168831 244932 473708 516508 438789 393333 397399 276676 159523 109352 275347 144551
7656 144551 76526 -63 -304149 -114129 -24335 -20258 -279714 -300656 -287692 -159874 27912
7645 27912 -99559 -99765 144869 115980 74598 191233 14368 -284166 -488450 -360756 -170172
7634 -170172 74489 -7975 -30770 37890 42339 -22582 -285530 -383995 -430472 -138108 -66540
7623 -66540 9158 -145041 -193464 -292745 -412121 -323192 -199458 -243304 -116962 -30769 -21185
7612 -21185 48815 164458 58925 -117427 -112825 -89378 -196603 -230133 -211897 -209221 -137295
7601 -137295 -209189 -435642 -282259 -54358 -27233 -189327 -409698 -461894 -351929 -325783
7591 -325783 -375992 -539708 -344775 -285121 -148783 -208767 -302592 -248211 -22452 102407 -59673
7580 -59673 -46337 -28632 97386 240286 71302 26470 195701 221257 249069 245765 165527
7569 165527 133598 216654 259334 275188 108044 -89157 -243198 -395882 -397738 -37011 136357
7558 136357 -21573 -185297 -103229 73060 232293 6587 -312945 -343994 -372405 -474940
7548 -474940 -378656 -48586 63444 69295 -300801 -512415 -597933 -474151 -466768 -254159 -334104
7537 -334104 -292396 -159627 -94121 -3520 14950 14770 88783 177763 -15499 29261 134915
7526 134915 411487 340490 -49235 -248389 -265518 -193957 -237424 -165786 -120256 -67001 66839
7515 66839 -15978 -73664 -198069 -191030 -225271 -435555 -362386 -106652 -81022 -200767 -371888
7504 -371888 -402810 -311053 -312249 -514746 -591912 -425574 -289075 -209583 -292459 -456795 -581123
7493 -581123 -493076 -226981 -112787 -221250 162834 60261 -55314 -196977 -82819 78648
7483 78648 -231630 -523669 -471350 -290717 -129509 -150437 -345607 -215317 -262217 -238188 -225348
7472 -225348 -148974 -172581 2111 59590 323566 356188 332217 87493 -53422 -216046 -181888
7461 -181888 -186127 -283236 -220532 -37448 101115 56315 31518 -13628 -119089 -195851 -176169
7450 -176169 -180221 -212012 67578 -20610 122739 382231 396644 311430 187391 106327 127269
7439 127269 363288 234757 -140069 -502053 -524574 -236672 -4016 -59408 -22032 181521
7429 181521 261292 201452 14784 -63115 -38221 26140 259688 351075 246003 322808 373682
7418 373682 287638 370315 342942 354234 121577 -36668 5488 73882 60124 47625 188016
7407 188016 70659 -25394 -9668 -61189 -144848 -68640 -191126 -259367 -131679 -23112 -113294
7396 -113294 -167996 -196073 193915 297265 281481 232955 117260 -108194 -193391 -199346 -430154
7385 -430154 -219862 -15638 -106264 -27570 -121337 -231429 -278425 -243143 -213020 -180219 -29135
7374 -29135 98604 102066 75787 -31130 -460888 -441293 -148350 66083 -26434 -237889 -157096
7363 -157096 -419486 -538209 -473752 -497169 -515493 -405084 -339607 -302375 60396 34422 -138122
7352 -138122 -219409 -56905 -99326 -165537 -252197 -169127 -137207 -155862 -611 71568 -99045
7341 -99045 -194344 -28081 270351 398177 326576 116936 21928 282698 456467 68476
7331 68476 -240950 -213099 -138897 45023 95451 -145441 -321651 -181318 216603 78408
7321 78408 64314 99344 83760 118888 31449 -57857 15273 -54224 -170782 -281924 -339384
7310 -339384 -346424 -211240 -26143 28599 191826 365572 512405 460456 222254 125555 -10074
7299 -10074 -5037 -6132 -136220 -88924 -79301 5564 42474 -225399 -258390 14575 213742 168099
7287 168099 229893 189988 146342 96111 52871 -139128 -353759 -478328 -464682 -296617 7695
7276 7695 24929 -353354 -479893 -352295 -282276 -228954 -20880 124260 114759 -8917 15639
7265 15639 208254 284580 324627 170926 229543 137035 141563 139497 32023 99630 105707 116918
7253 116918 -627 -126380 -135387 31159 -196266 -367772 -338421 -46841 64230 -14026
7243 -14026 -210970 -188400 -118841 -158914 -272068 44449 -16007 -248933 -171142 -82063 -160760
7232 -160760 -330259 -308790 -186581 14762 -177572 -340874 -91342 274095 338616 103618
7222 103618 14315 9041 -175281 -119418 -115788 -300318 -288480 4000 -162776 -74671 218751
7211 218751 224771 120054 -108603 -96587 31868 52200 100889 -119596 -50348 156041 -18777
7200 -18777 55709 -109798 -329850 -326298 -242645 -359555 -388746 -593800 -610480 -370165 -133003
7189 -133003 39264 -97478 -255845 -155050 -34018 -15346 -136018 204997 314030 208028
7179 208028 254351 297481 301943 156991 157243 101280 136231 -21621 -205860 -176755 -25074
7168 -25074 62902 -30337 -59358 -168717 -206153 -57993 74370 -59324 -311016 -444993 -432119
7157 -432119 -158827 -157579 -456771 -531456 -404675 -27380 -2669 -91173 -260898 -303707 -182737
7146 -182737 -177493 -141303 -54811 -7194 8992 -105924 -80069 -138484 -233685 46316 222445
7135 222445 284230 24375 -133598 -92116 -144123 -44231 -10384 -15190 54569 142762 1709
7124 1709 -209276 -359588 -350347 -207793 -95690 -257414 -348932 -202498 -70258 -102264 20963
7113 20963 287099 98547 -80914 25609 97094 167080 142778 123421 156231 -249834 -247735
7102 -247735 -388276 -354006 -310014 -295682 -122554 -392 -17067 -20278 -94409 -38418 -108558
7091 -108558 -24130 -75162 -279582 -280643 -77656 89507 356100 518896 224857 20253
7081 20253 -56253 -114201 -381451 -363464 -218008 -27733 -34667 -155960 -230978 -246253 -233976
7070 -233976 -237709 -375681 -209264 -152158 -130118 50463 -56480 -2759 -25968 20098 319314
7059 319314 300810 -59336 -126647 29054 44009 85081 162803 162030 104529 -180108 -150441
7048 -150441 217068 451313 712424 648983 266196 107214 -120614 -196405 -346493 -257155
7038 -257155 -125455 -49158 75871 -1410 -127443 -3794 96421 -107178 -469448 -471966
7028 -471966 -350947 -403711 -407243 -487125 -635700 -374448 -38746 130785 84117 -51342 -39470
7017 -39470 36974 60192 -158440 -126601 5035 -132458 -179124 -50904 78883 215364 403609
7006 403609 443400 98746 105196 322931 490001 508715 410309 288624 74478 42730 76849
6995 76849 66724 -94168 -374019 -550466 -354176 -305790 -236542 -341823 -305123 46391 183105
6984 183105 76296 -110556 -252271 -315331 -239928 -87881 -199767 -119058 -57192 -101120 -45347
6973 -45347 -180519 -91427 -115323 -5911 53289 155300 140222 43967 -113189 -155385 -197899
6962 -197899 -211101 -214893 -47688 -62990 -259099 -271914 -259685 -116452 -223742 -187085 -218833
6951 -218833 -246785 -191906 -204395 -384745 -310729 -27478 -207325 -151753 -360828 -350825 -7823
6940 -7823 43399 -6810 -204052 -268585 -80705 -39997 -5612 -36132 -5009 -85000 -210666
6929 -210666 -230536 -239666 -92600 -79456 -72941 167305 285025 301117 199476 2118 -107249
6918 -107249 -49928 -229262 -216960 -139196 -416896 -298003 -268824 -393246 -516570 -331264
6908 -331264 -19661 -53088 -42202 -58236 -174654 -384672 -450758 -498986 -365639 -252403 -211532
6897 -211532 -354598 -339628 -479456 -528388 -252306 -162046 -77604 59202 -161356 -298746
6887 -298746 -246683 -28641 23101 -59276 52318 262309 475353 515492 239874 5547
6877 5547 -288240 -317831 -267327 -300957 -187937 -303553 -525375 -593457 -515663 -450221 -393842
6866 -393842 -204593 -256310 -261592 -313940 -345410 -206312 -193442 12863 -48681 -43175 -318935
6855 -318935 -531992 -656411 -625031 -564916 -524093 -367431 -366801 -354155 -220167 -109670 -113332
6844 -113332 113897 306468 397526 620309 443874 411003 445040 487296 469334 411358 251741
6833 251741 181379 86362 -24214 -133243 69438 85894 -31343 -196657 -137769 66989
6823 66989 -51897 12670 -97122 -190384 -135020 -94743 -27408 -343956 -494910 -329214 -171970
6812 -171970 -19722 -69672 -99743 100427 48964 21304 46342 67588 346768 402968 241240
6801 241240 -81503 -239328 -407435 -315517 -18178 233227 343685 466897 303786 -301
6791 -301 -73055 79301 -33674 -108776 -323398 -603539 -507410 -422759 -77344 -23596 -28342
6780 -28342 7835 59850 -251155 -242448 -249126 -66839 -16649 54512 11651 -85847 -98869 -101576
6768 -101576 117886 217304 107946 234011 239526 131601 -209630 -461945 -381454 -386095 -279926
6757 -279926 -90456 -194288 -404954 -337448 -197188 -249298 -284011 -421275 -720141 -615531
6747 -615531 -269828 -285118 -363129 -289975 -155722 -185609 -159405 66024 158294 49709 133318
6736 133318 125944 93539 236238 214763 149977 283257 395745 454239 159205 -215023 -278042
6725 -278042 -77530 -138135 -175560 19310 72486 4712 -150006 -216925 -65869 101027 178785
6714 178785 -96183 -190530 -178146 -283608 -177719 -178647 -72076 89632 186069 -60264 -260880
6703 -260880 -232643 -118226 -28433 65192 -6458 55687 202570 110813 154376 89653 -37163
6692 -37163 -138509 -322153 -173812 118042 -60972 -44234 -86902 -221456 -112997 -88968
6682 -88968 -100597 -131340 -228857 -409498 -568103 -442419 -343523 -316283 -176428 33331 -252912
6671 -252912 -405127 -250862 32737 -49858 -123505 -129996 12755 215024 -131424 -461000
6661 -461000 -278222 -288625 -323447 -131808 56214 129894 -111904 -129285 -126570 -290762 -317752
6650 -317752 -309457 -351405 -240807 -161073 -346999 -509512 -417790 -113022 -50726 -172803 -61881
6639 -61881 74681 -174623 -309386 -107601 220378 355290 178111 -35270 -383012 -580137
6629 -580137 -563260 -499650 -457178 -748153 -728622 -162398 -15950 -184333 -108768 -279336 -326972
6618 -326972 -221409 -185396 9922 44787 -138413 -250438 -305641 -317906 -300202 -680 152351
6607 152351 108056 13250 93747 -102910 106778 301559 325414 69523 -84961 -73788 149146
6596 149146 216478 -18042 89287 205331 -91152 -475529 -377282 -353965 -380187 -353856 -333069
6585 -333069 -213669 -248721 -40233 186820 -10827 36310 -129960 -305106 -358261 -114271
6575 -114271 -132261 -17783 -63456 -86522 84434 44041 -288881 -391050 232347 193025 -276061
6564 -276061 -251998 -191651 -207461 -134895 -136700 -190525 -121161 -288489 -283875 -172010 -52399
6553 -52399 -259402 -219525 -12125 -46656 -18547 -32503 -239783 -147065 -113202 -265461 -141056
6542 -141056 -116558 -394263 -539255 -240264 -90908 -78107 -234526 -253891 -252498 -274231 -534027
6531 -534027 -602827 -488871 -171883 69849 240279 297683 151541 -14651 -150727 -70048
6521 -70048 26583 -75034 -218185 -194479 -225186 -343987 -300908 -402763 -327159 -260287 -259643
6510 -259643 -167275 -173413 -328242 -591011 -383287 -174895 -184254 -69979 -247919 -355491 -334659
6499 -334659 -198122 -216669 -394599 -276892 -316303 -289559 -426753 -268687 -71733 200514
6489 200514 -34983 -140247 -184292 -160359 -202848 10 183130 48235 -79422 -394863
6479 -394863 -441370 -264889 -342346 -320353 -145797 141384 116130 333948 336926 65471 164601
6468 164601 -24145 -129243 -212372 -177011 -126588 -170867 -190826 23219 -94537 60490 124361
6457 124361 -16980 -103395 -211495 -267745 -204890 -355482 -480215 -296332 -337640 -313452 -205127
6446 -205127 -74197 33915 -60485 -292124 -403990 -252975 -420209 -202015 168432 310950
6436 310950 43866 -48513 -13389 269326 266241 138741 -71525 -214310 -222678 -93851 -145025
6425 -145025 -166016 -36673 -116162 -130836 69407 -107471 -77625 33269 -7546 164908 72128
6414 72128 -80381 -220962 -179092 -323297 -434763 -209913 -9822 96883 138348 -17000
6404 -17000 -466575 -612142 -276130 -145481 -272063 -307814 -260230 -278684 -112531 57091
6394 57091 64103 96619 156808 133350 -178205 -308322 -150363 -186618 -295197 -34202 -49239
6383 -49239 -120591 -36349 52444 -77779 -223460 -1200 -235961 -231872 -430869 -772117 -931811
6372 -931811 -532076 -115406 28436 75086 184213 71807 -78530 -10471 34418 -48937
6362 -48937 -24859 -184058 -110682 79094 94054 -47118 -28656 -80920 -96336 -304253 -352897
6351 -352897 -151939 136922 158542 59124 10161 93197 -93010 181095 186220 218973 55884
6340 55884 -171148 -310536 -120052 -83780 -16418 163226 210598 310775 319116 272810 71961
6329 71961 141234 185861 297464 418856 101376 -176160 -197447 -261499 -287463 -47971 -192728
6318 -192728 -292179 -195442 -153665 -193807 -313725 -243152 -228547 -303803 -466545 -215678 -61493
6307 -61493 -165589 -362944 -221260 -249555 -154675 -49143 -42469 -191894 -113770 -215983 -164395
6296 -164395 -318212 -481187 -582836 -556669 -615557 -274029 -197158 -158391 -117320 -311704 -291377
6285 -291377 -249109 -87314 34633 2982 189179 242055 -34893 -120022 -8252 -150206
6275 -150206 -204668 -61741 -21961 57755 122983 -29256 -196417 -318718 -181495 -30818
6265 -30818 87951 89970 48253 -51286 36161 144067 5332 -109683 152788 340237 248131
6254 248131 -119884 -401727 -439711 -305446 -230405 -134959 58632 56417 -229339 -389391 -220441
6243 -220441 -105031 -242269 -192461 -88339 -65983 -312664 -328758 -87790 164419 161837 305430
6232 305430 315299 52572 -181399 -146510 -22263 61124 91714 -19500 -234111 -270628 -307086
6221 -307086 -106961 214810 190093 -6983 -2723 -57833 -65307 233888 247862 214126 249440
6210 249440 319691 375642 203092 244867 48278 -125055 -77777 23628 89986 41850 134217
6199 134217 152061 29421 -53895 -16186 126930 155723 27816 -146897 -177630 23779 81617
6188 81617 123045 345440 233284 2531 70025 340568 207434 -7821 -59402 -3101 -69428
6177 -69428 54782 67383 -148789 -38742 82819 -183134 -251912 -76960 -222946 -366087
6167 -366087 -110478 7479 -52313 -96575 -217967 -248067 -197982 -68651 115344 -139679
6157 -139679 -250004 -316549 -280544 -167144 58290 291247 399749 264744 115567 -17146
6147 -17146 38871 267593 210504 118912 -1622 -141635 -172092 -137649 -312569 -235515 -180196
6136 -180196 -33566 41573 22464 128316 893 -252166 -400767 -349250 -184167 -193939 -206064
6125 -206064 -127872 -144152 -174534 -215757 -261668 24063 9653 44683 96327 -272613 -257991
6114 -257991 -375813 -213763 -56067 149600 172310 228306 118054 -4551 -258386 -198643
6104 -198643 -190233 -75944 -55182 -123613 -48322 51986 41360 189441 181532 -60540 -242680
6093 -242680 -227146 -339883 -346543 -328146 -199805 -94650 -146733 -116355 -44675 -105372 -56386
6082 -56386 67151 -72828 -197289 -371906 -201362 -205198 -330946 -227829 10623 188604
6072 188604 218132 -114116 -340577 -305717 -152978 -95935 -11865 314873 535142 390976
6062 390976 151161 -156667 62767 131994 52123 -67978 -59959 -198948 -158776 -70573 -203037
6051 -203037 -376734 -462991 -380630 -90113 -142826 -209242 -359698 -520837 -350428 -137951
6041 -137951 93268 180137 258340 411504 221061 -22955 -285956 -119088 -240586 -226631
6031 -226631 161646 30703 -190847 2468 176090 171904 218567 237086 323206 145588 67767
6020 67767 29201 203367 248529 202628 3492 -117407 11083 -58057 -260143 -158865 -145566
6009 -145566 -2965 -17423 135913 87949 45927 42504 21649 -192562 -119528 -112520 -37343
5998 -37343 116040 98276 -47000 -248174 -346210 -240582 -433395 -480254 -384100 -547014 -140133
5987 -140133 91508 -167352 -457723 -247180 -45534 81805 75641 -81216 -203732 -230502
5977 -230502 35374 -5360 104099 194995 42837 -20924 -181942 -271090 -175691 -47014 59109
5966 59109 4358 -427015 -393638 -247629 -34363 75118 -152371 -237780 -305804 -308053 -508868
5955 -508868 -491112 -143463 -173415 -251618 -322251 -277563 -20512 -42619 131629 184480 375982
5944 375982 524569 325786 201687 2564 41340 256332 200833 -21799 -247884 -173322
5934 -173322 141488 118594 155840 263633 94435 -94787 -185123 -131273 -65153 -138691 -117345
5923 -117345 41471 -117577 -123962 -138351 -261319 -426036 -442591 -331527 -329992 -364174 -134584
5912 -134584 -167429 -176268 -212566 -260277 -347804 -359695 -272728 -515986 -611704 -334114 -39935
5901 -39935 114099 331171 191040 -19654 34627 286694 358718 359944 405813 257919 274515
5890 274515 37942 -67348 -219746 -22189 29577 -159966 -311984 -190553 -356971 -351591
5880 -351591 -388837 -207263 -112594 -8519 -18100 -344609 -286304 -225158 -254211 -127067 78848
5869 78848 244465 32833 -10983 -58616 -44081 26242 -76838 -48790 -85797 -340512 -359428
5858 -359428 -269797 159770 190073 -13992 -27629 181396 245331 357378 222293 389109
5848 389109 295902 -52987 -277053 -77440 193037 213823 100290 -272053 -135046 26478
5838 26478 265213 246087 55593 -69911 -121580 -180175 -325161 -466734 -171734 -92162 -182359
5827 -182359 -25610 -132143 -94971 143752 240489 227460 34301 -31362 -30427 -92174 73521
5816 73521 540175 455785 146957 69940 79280 188035 149482 7048 -198807 -487733 -383556
5805 -383556 -176241 -229152 -292502 -247968 -267512 -271909 -110596 -85387 -127939 -41597 -80966
5794 -80966 -54922 -18868 102246 -3317 20950 103112 -76675 -182517 -157565 -104835 109066
5783 109066 287702 152390 39758 75214 56985 -51344 23680 46994 80300 199204 81300
5772 81300 32333 149332 414034 315996 -40063 -103304 125974 223725 110606 -346183 -367817
5761 -367817 -348394 -209554 -99699 9571 90401 90356 -76707 -284136 -376258 -289612 -232984
5750 -232984 -134347 -56067 -220469 -169265 166348 327044 390365 214496 -1889 -196918
5740 -196918 -317078 -355630 -336899 -435635 -227055 26730 56239 -67670 -110342 -73392 -36780
5729 -36780 -171332 -130350 -90322 -224220 -487081 -366773 -445939 -442140 -329862 -155459 -132346
5718 -132346 -40898 139118 204404 284889 290677 253867 157399 61318 186458 136547 -52760
5707 -52760 -120915 -229453 -288217 -350572 -219238 -164902 67187 -343451 -484328 -371438 -171089
5696 -171089 173574 -67741 -351652 -317770 -1893 221539 20762 -123701 10462 109673
5686 109673 -67736 -223177 -329741 -457917 -327343 -294703 -380097 -374024 -16734 100760
5676 100760 105130 115235 -77394 -97546 55773 -120200 -231543 -431175 -407290 -382356 -340838
5665 -340838 -270441 -365744 -206882 -210725 -264842 -588529 -494991 -409508 -459762 -297402 -71907
5654 -71907 -87876 -227139 -203243 -207897 -249616 -34585 15640 83748 128919 51619 -140920
5643 -140920 -309224 -395766 -325619 -335893 -208472 -203163 -133916 -262951 -314079 -148741 -143084
5632 -143084 40772 147164 56759 134456 134027 203994 142173 64404 97430 -22333 60085
5621 60085 -48756 -106814 195466 318611 318530 318153 332787 402563 287044 161309 -1499 34282
5609 34282 91515 286364 181951 22519 79236 126732 162530 134048 36349 -251565 -516208
5598 -516208 -394946 -136959 -143137 78039 306220 312939 89541 7319 -213648 -447223 -390779
5587 -390779 -407812 -389260 -119099 -244003 -124405 36461 25228 -87580 -267849 -260569 -91501
5576 -91501 -21196 160331 164689 -45872 130957 260302 230453 213835 268203 164383 181747
5565 181747 238422 248513 140558 -145172 -20512 218201 157049 -28920 -199615 -471182
5555 -471182 -344295 -149230 -135480 -387789 -396141 -118686 238642 246152 48620 -211601 76552
5544 76552 151307 -24807 -12156 92666 170433 40623 14088 313623 12050 -30021 102890
5533 102890 119193 -87526 -234886 -108108 -130160 -148615 -228091 -46179 -54650 3208 95286
5522 95286 42858 40962 -140267 -166056 -114801 35056 98819 136942 -20087 67643 -3193
5511 -3193 247530 404938 102795 -484827 -339896 -101590 18132 192981 398476 334421
5501 334421 227887 14759 -36362 -20227 -156085 -68377 108944 -64952 -184113 -43962
5491 -43962 168306 298727 274381 92556 -9263 37171 208537 158449 97428 171242 123086
5480 123086 116008 -6946 52772 -19337 -132892 -38689 210383 429018 158968 55793 79557
5469 79557 176860 360236 319578 210552 291171 302443 410439 382581 256614 -77939 -147023
5458 -147023 -54293 80864 126337 126722 242910 396199 320490 -71018 -124782 100648 273669
5447 273669 160481 -74891 59909 95705 -36160 -172585 -310709 -101288 -36686 -32535
5437 -32535 -164155 -185105 -334469 -158881 -106331 -204674 -259397 -161376 -18220 145163 286945
5426 286945 286324 468816 388362 186928 94818 222134 456623 395944 171555 86687 64745
5415 64745 -236470 -497986 -546612 -601494 -482854 -206476 -12917 69729 -106014 -72393 -3043
5404 -3043 -35734 -128617 -47790 312572 324851 308036 125603 -144360 -160669 -198379 -113789
5393 -113789 -70175 -85568 70442 50047 -285436 -164651 -35120 -31183 62450 108110 -8495
5382 -8495 -154 406 187943 205345 120069 -35274 -103959 -264105 -149588 -55858 75606 -145298
5370 -145298 -120263 -64953 -2172 -181468 -24078 -66115 -664 107958 93968 -58799 -289519
5359 -289519 -285082 -197618 -168842 -112307 -36857 108628 57671 39119 188869 165033 110229
5348 110229 -32460 -102282 -189635 -156801 -33219 -121967 -288524 -385640 -270971 -132702 -6858
5337 -6858 -67748 -63610 -122550 -37114 265084 200727 -71138 -144566 -354188 -344052 -127139
5326 -127139 -341043 -497784 -334971 -233282 -184844 -367169 -329272 -381369 67989 301778
5316 301778 135282 -149268 -92706 -193530 -283069 -412040 -332438 -264557 -277999 -162929 16720
5305 16720 -284312 -333541 -202913 -112149 -258453 -352532 -481564 -408000 -250099 -84760 163221
5294 163221 184796 283271 348684 338683 254852 266216 311331 199780 89582 195373 -16873
5283 -16873 -104144 -185670 -318648 -432045 -440037 -352133 -375373 -159153 -25956 -215026 -273602
5272 -273602 -107691 -84604 -181429 -325464 -285950 -223025 -321376 -358279 -274744 -545 131047
5261 131047 57704 14416 -59668 -137055 -53104 71211 -89235 -274235 -358100 -172917 -144096
5250 -144096 -157314 -206667 -102392 -126250 -162180 -195599 -236823 -278771 -115162 163948 27105
5239 27105 -104541 -23768 117357 -78652 -145399 -53317 -32144 -32576 93436 91331 61238 23597
5227 23597 11863 55680 -120758 -206414 -192618 -107327 -1837 -149615 -379590 -344307 -331665
5216 -331665 -261793 -178868 13363 -104605 -293348 -214075 -217141 -38612 97110 40729 -3840
5205 -3840 -184262 -263880 -317864 -362616 -321870 -389564 -451760 -375408 -333231 -491185 -256288
5194 -256288 -383591 -616638 -542366 -361884 -396770 -349167 118825 502669 528164 291299
5184 291299 269320 252550 256273 246134 208550 -28287 -226014 -233167 -322611 -401948 -182182
5173 -182182 -29933 -64770 -151875 23764 -158164 -149806 -156894 -254849 -214842 -115476 -54742
5162 -54742 100807 -4495 -356093 -628500 -377043 -274440 -380128 -316232 -199854 52370
5152 52370 -33997 -276872 -197189 -182367 -214342 -365129 -570345 -401325 -215567 -120791 -144201
5141 -144201 -33305 -235288 -291704 -437732 -374904 -176278 -197597 -172037 220143 406059
5131 406059 188168 46891 -6025 12963 102329 -92845 -273095 -241135 -175367 -224302 -320730
5120 -320730 -377629 -325521 -107872 120270 183521 5791 -231838 -266487 -272890 -325134 -322983
5109 -322983 -445781 -276461 -135719 -255790 -223533 -159824 -326372 -540622 -653935 -445914
5099 -445914 -104559 21764 185123 17164 -193925 -124716 30714 51085 154912 374296
5089 374296 263245 167126 -39276 -246198 -311105 -573766 -653556 -510004 -394399 -180918
5079 -180918 34986 12377 -40611 310584 351547 141155 278097 583287 378735 151380
5069 151380 -3408 -219993 -296711 -315824 -414877 -223244 60073 -19889 -380810 -195802
5059 -195802 234705 161123 83065 -102163 -210589 -296955 -202684 -309761 -204567 -332131
5049 -332131 -449072 -503913 -468281 -19093 25530 -215542 -290362 -100503 89047 231313
5039 231313 403972 321615 238389 -17960 -138411 47586 61531 13599 -113348 -116243 -77997
5028 -77997 -242367 -77830 -12026 -195852 -200266 -84798 -12761 89537 179821 176789 76386
5017 76386 46593 -155052 -388238 -499826 -445098 -235690 -205484 85797 62679 122706 228939
5006 228939 -108197 -303236 -99849 27242 113341 133413 70350 89756 -122935 -155337 -130180
4995 -130180 -163579 -425878 -61509 34753 78132 -123152 7238 52919 156247 167110 -106619
4984 -106619 -63146 -95402 -59580 -66371 -258540 -277557 -388458 -389634 -368417 -232137 -6247
4973 -6247 -10101 -62062 228717 474438 474370 193546 58405 -35883 -74789 -5349 -95364 74002
4961 74002 -85072 -109272 -115014 22356 10628 109611 110956 136300 175107 127548 -89927 32449
4949 32449 234467 112511 -13912 -159105 -177541 -246355 -346907 -184304 -125184 -50561 -174986
4938 -174986 -305852 -118619 27923 66588 -64 -25106 96240 158207 65769 127641 229575
4927 229575 331855 204974 -37131 -246973 -230132 -172625 -261133 -243493 -448788 -390508 -73545
4916 -73545 148964 -68305 -99696 -122998 -19013 -17031 16677 119554 108774 -113384 -164315
4905 -164315 -62062 -156347 -43384 41849 -110181 -234235 -287904 -357536 -387271 -216159 -260004
4894 -260004 -68675 112246 221150 298419 146094 -87896 -125364 27399 -9779 -85384
4884 -85384 73885 190940 185264 -65027 -1548 268599 243421 130412 120046 -42600 -167633
4873 -167633 94387 88101 -36945 -135391 -40656 -216263 -114257 -268153 -286089 -196837 -298248
4862 -298248 -342564 -258097 115860 191023 175505 56427 -28657 -81221 202601 158915 -56685
4851 -56685 -173092 -180014 -209555 -209905 -41829 80351 -49084 -188121 -164083 117229 98575
4840 98575 11752 -215492 -459513 -467269 -114462 71091 90599 191136 173731 84030 -82635
4829 -82635 -125776 -69424 -118331 -363523 -363123 -250322 -261473 -209536 -202447 -40125 -6771 124728
4817 124728 214581 130444 136590 305374 319768 22692 10992 -85700 -117938 -112257 -219453
4806 -219453 -272228 -188304 -215928 -215043 -251801 33074 168952 87649 -38284 -248615 -255757
4795 -255757 -87288 33286 -27362 -192387 -490931 -222496 62439 170383 -56285 -190095
4785 -190095 -86099 -83701 32707 81876 -147338 -143510 86647 98737 142707 49301 -290863
4774 -290863 -278583 58732 169973 30369 23814 136563 149903 20604 -162449 -325789
4764 -325789 -239079 -120731 -215017 -369662 -509515 -558157 -238098 -324818 -244974 -157328 74491
4753 74491 72945 -46203 -182348 -202832 933 31295 -28604 -214154 -282458 -383321 -475386
4742 -475386 -409047 -292133 -67379 -117788 -339699 -425370 -363843 -233000 -27488 -98697 -88915
4731 -88915 8494 -123401 -51745 211436 278652 -48926 -167 119471 -77222 -238311 -110683
4720 -110683 -71815 -205322 -93033 45319 28979 82071 77723 213507 203544 56560 215269
4709 215269 343107 -79841 -345092 -273847 -225585 -223948 -64935 88286 122499 86532 -13779
4698 -13779 -131357 -94673 146144 273670 272117 160472 153267 73280 181283 420286 491058
4687 491058 330160 185587 182510 123067 34094 188361 217241 36212 81892 7638 399187
4676 399187 547820 585656 522880 354865 107642 25712 -38359 -126178 -344227 -375451 -528537
4665 -528537 -443966 -382704 -294244 -435973 -640220 -589625 -326462 -56566 160122 445107
4655 445107 206748 -99963 -309953 -230976 -210515 -49204 -256862 -286714 -234830 -385369
4645 -385369 -235176 72572 22605 -264406 -142203 -2571 -119135 -151922 71073 138423
4635 138423 -130642 -322306 -441454 -443889 -228428 -175202 -321625 -428987 -329166 -165815
4625 -165815 -220441 -232760 -307959 -202652 130574 339358 297695 136433 25899 -43874 227124
4614 227124 170553 -31272 19739 69602 26745 -61623 3138 -25732 68326 45808 591
4603 591 94744 110838 104072 -132106 -262132 -144508 -118584 -40130 -75233 -241617 -223837 -456503
4591 -456503 -313842 -139922 18849 462550 488154 157078 78330 143876 64953 105636 80318
4580 80318 174826 101807 -87416 -107866 -430020 -426640 -631374 -561700 -260377 -63770 207724
4569 207724 145711 187368 130650 150670 14929 34922 74278 15444 -140573 8554 -238122
4558 -238122 -376585 -184287 51818 -21574 1476 149351 204088 -206725 -199779 -31952 203557
4547 203557 360003 123381 -238266 -177388 9033 89079 57091 -50945 -44683 -13401 98051
4536 98051 24197 -5073 72427 214558 203514 -21256 -145640 6556 73529 86053 22133
4525 22133 -37135 88867 188872 84760 49607 -117816 -282323 -172377 217882 362079
4515 362079 275157 151057 91171 -229569 -108905 44090 -177507 -225947 14129 158462
4505 158462 149744 -31748 -199675 -158035 61858 -23546 -197366 -18758 -248694 -255193 -55386
4494 -55386 -125482 -42666 6539 65181 63925 -22863 -34290 -103654 -206228 -151597 10968 163622
4482 163622 161414 45679 148552 343872 209964 44437 -30536 -94677 59774 290913
4472 290913 462657 577583 465605 316801 228764 235532 -18443 -84158 -49870 -80661 -28330
4461 -28330 76195 306640 317061 137157 -146637 -29654 -10509 -158905 -304892 -80511
4451 -80511 126744 -12597 -29017 41280 -122479 -180158 -278408 -335706 -60177 96328 -119346
4440 -119346 -70878 135034 319932 196022 46848 66815 398057 244957 -107112 -379841
4430 -379841 -372463 -241913 -78677 163565 -21730 142609 1559 -14372 141112 173225
4420 173225 -162470 -491108 -124710 235793 297768 127612 -8722 23914 -2366 -277554
4410 -277554 -135505 -105857 -67736 160699 172787 156938 319332 -24174 -215860 -164779 35892
4399 35892 245693 253226 388766 376495 155404 179262 173195 258031 241540 -170378 -356681
4388 -356681 -417222 -94979 144467 401156 650352 568224 371738 187431 221007 288340
4378 288340 128137 97085 62076 72379 145002 211652 137534 273421 275498 191564 123777
4367 123777 104232 40826 132052 60604 -87458 -290441 -298977 -240989 -124753 -320437 -269589
4356 -269589 -452054 -213073 -54523 -206854 -330858 -432965 -483995 -354870 -220611 -91588
4346 -91588 -136052 -251942 -344210 -89161 77324 18509 84866 128232 174941 219027 196984
4335 196984 92430 174823 55795 -73515 8486 -41743 132893 108757 226043 63474
4325 63474 -214 116873 210649 59096 50788 -3310 89743 181383 -2828 39613 272910
4314 272910 367597 46610 -402384 -279822 -229729 -263818 -263755 -265287 74323 43086 -116025
4303 -116025 -175025 -241784 -120792 67158 -51496 -59561 167532 462520 442714 161480 12141
4292 12141 37667 163005 288589 313722 310679 428667 491217 486370 533049 574559 462388
4281 462388 207373 -15980 -32212 30229 -156401 -346765 -485562 -243030 46518 -36237
4271 -36237 -1361 114502 149154 165104 292287 533316 472525 215571 -546 -359074 -429162
4260 -429162 -89822 32911 31082 220738 226534 8465 -110683 -15498 -190223 -349322 -321918
4249 -321918 -412227 -246655 -20557 67379 331987 223359 -119924 -189455 -89188 -291004
4239 -291004 -259286 -213546 -141866 -357037 -456978 -202778 -77225 32653 -52988 -205258 -194636
4228 -194636 -51322 -138620 -88341 -147224 -104535 53790 95175 66982 -14445 -96222 -169856
4217 -169856 -379168 -433795 -366631 -162203 -171498 -329818 -249430 -55062 236441 279351 163695
4206 163695 -1046 -85245 -80709 137562 194120 -148072 -193191 -165766 24542 144221 114557
4195 114557 -176369 -318113 -102947 128566 87724 -69535 -20055 55603 160410 50440
4185 50440 -80720 -245910 -317498 36132 303389 137535 39897 -76545 -125606 -10832
4175 -10832 -199890 -19086 -173528 -335607 -140462 -71177 -223700 -168187 -25916 -45587
4165 -45587 -358687 -448589 -345123 -216661 -563803 -576738 -285139 87840 227993 419270
4155 419270 438051 169806 -36130 13694 93643 181514 171618 258572 278627 214852 10018
4144 10018 -66474 -141121 26801 310333 181214 164655 112265 67065 -46650 -109324 201805
4133 201805 359811 317482 72775 31848 -58344 113383 245779 349748 177023 -177275
4123 -177275 -67889 101663 50259 -166926 -246964 -138413 -111174 -70748 -99058 60623 392891
4112 392891 332622 76603 12764 -18233 22511 -25653 -88434 19851 8737 -82405 7417
4101 7417 -3102 -119913 -169801 -106057 -324866 -265159 -28532 107287 -120113 -258909 -250498
4090 -250498 -83046 146208 -226188 -269404 -376956 -461374 -400535 -215784 9250 6734 -114586
4079 -114586 21823 78319 86994 153004 64979 -45942 -183979 -118816 104936 340820 491277
4068 491277 358096 108346 -99690 -456319 -419308 -277093 -64451 14598 109885 6893
4058 6893 -8698 105121 49742 26749 57659 -212042 -150016 -184660 -369313 -421211 -107391
4047 -107391 143610 67468 -15161 -34651 10352 38567 85177 213505 402519 679632 736775
4036 736775 537190 533962 305779 132012 259549 290309 27200 -219614 -320533 -236150
4026 -236150 -5513 50523 266616 396016 380807 226150 322300 324282 316755 197851 157399
4015 157399 -14213 22023 1719 -26169 123231 100905 -140100 -248256 -408798 -398587 -165456
4004 -165456 135414 140308 117002 189779 98726 16676 234019 67592 -215828 -190922 23811
3993 23811 -195719 -388376 -378742 -376967 -166327 -22764 92182 97907 -102105 58457 212783
3982 212783 336338 171984 -76801 48810 238258 157059 -39362 -33344 -104161 -216547
3972 -216547 -203720 112079 218351 98664 -29631 42640 -34830 60534 -931 67623 155332
3961 155332 168120 265715 10782 -225502 -202402 -321780 -323461 -142038 59763 -117304 -112595
3950 -112595 -23375 171665 97191 -106273 -304181 -530725 -303857 -173156 -278515 -81867
3940 -81867 -90040 84471 194991 55036 197793 227823 23851 -82303 190666 53865
3930 53865 -113857 61916 116406 181599 214991 79346 -18664 71185 17156 42092 68896
3919 68896 230478 292659 236540 304533 223790 187965 -48836 -93291 166067 143006 140982
3908 140982 292244 244743 93782 160143 176974 158203 225883 170333 221571 368396 567566
3897 567566 629013 441573 234352 186681 139662 70725 -56559 -85856 -244153 -117670 11103
3886 11103 20821 -156529 -319766 -306161 -361579 -396983 -365111 -489693 -406863 102574 237638
3875 237638 240970 126283 229267 290311 331317 359643 216477 20034 78802 275516 170009
3864 170009 -106905 -346009 -278661 -78383 26278 -51071 -63717 -97295 -116269 32340 330799
3853 330799 100305 -112432 -233422 -227764 -95519 -53398 -22578 56258 -131462 -157873 32213
3842 32213 275278 255490 270314 -39820 17950 357624 638110 423870 166832 -28852
3832 -28852 55325 224181 236856 155850 218 1531 -182096 -140325 -92576 6335 -233107
3821 -233107 -495506 -474268 -301908 123497 61990 -173457 -271732 -227847 -221559 -181026 -81393
3810 -81393 14092 130446 -36840 -48664 -63350 -289369 -470930 -296070 -406061 -435831 -239642
3799 -239642 -285797 -429238 -450391 -437579 -505053 -721869 -718188 -512957 -526853 -425319 -199261
3788 -199261 -202162 -167558 -212085 -320490 -446069 -192977 2862 -33011 52693 121591 18216
3777 18216 14372 318469 310443 394096 321621 374175 541880 489721 156667 -52471 -102341
3766 -102341 -48613 -166352 -202381 -199742 -121536 -82760 8007 385417 371820 126151 -127914
3755 -127914 -193411 -194509 -320066 -429834 -411793 -457696 -404952 -179420 -77726 -162307 -5416
3744 -5416 84037 239715 372306 289129 332383 441832 275869 287376 256416 394630 213433
3733 213433 141869 16196 -154692 -517030 -387869 -126992 -160567 -146750 -49631 61043
3723 61043 64188 -73363 -450198 -377137 -187995 -94834 -100161 132140 336820 448332 264989
3712 264989 119775 -65675 -16868 -92394 -518421 -487298 -365981 -369331 -276300 -157776 -61973
3701 -61973 63919 139535 249022 30844 -59686 66691 -63737 -96947 189522 246479 81990
3690 81990 4402 -59251 -119428 -162715 -298599 -375456 -194734 -24161 151483 265379 117928
3679 117928 -118359 -155111 -145872 -100326 -61467 -113474 -232103 -231046 -116583 -80337 -94085
3668 -94085 121038 217335 -41889 -142776 23293 78781 -86024 -169149 -268378 -456647 -349477
3657 -349477 14146 132521 120064 142248 217631 -10983 -153976 -21718 131837 91486
3647 91486 161628 -13007 -193699 -107950 142517 184663 186031 152859 296001 530601 523462
3636 523462 230489 75638 -91868 28946 -107421 -160989 -39713 42656 313535 368718
3626 368718 287731 197897 187602 173267 327444 291008 269005 92973 178221 162554 76655
3615 76655 -187635 -400516 -644576 -401878 -250092 -69206 -48727 -113915 -91862 -161967 -130028
3604 -130028 -55038 10496 -55669 -29000 -16189 -102343 -288961 -149972 -40334 -118707 2798
3593 2798 -31893 105818 2466 -159857 -60318 -52928 -80261 31379 50943 20079 -22501
3582 -22501 37577 -158 106290 189859 137285 72614 91024 145272 159715 131880 -48388
3571 -48388 -405905 -283937 184167 343340 362895 389846 267747 110558 87188 108988 -34653
3560 -34653 -215955 -30409 -7759 -214434 -360867 -268077 -366082 -324344 -153896 -124378 -44163
3549 -44163 -200845 -170487 119365 233400 382265 431813 338856 96123 276567 547155
3539 547155 319727 -42521 -76209 146198 279244 198526 172940 39364 95736 94431 8831
3528 8831 3627 -119004 -299644 -229719 -277017 -186766 135707 325201 459360 483607 433723
3517 433723 415891 197273 -229998 -166607 -46840 -68067 139470 172609 239445 222492 183360
3506 183360 125127 60430 -137652 -10698 -58059 -53739 41909 26446 134306 72076 324290
3495 324290 320841 452929 470270 383800 257030 107274 22997 -63968 -67441 -14760 -110336
3484 -110336 5000 56789 21163 -52044 -223773 -424230 -157627 197499 163551 85705 -21776
3473 -21776 134145 91283 29824 -65 -17978 129029 233955 60346 16234 22647 2218
3462 2218 -128643 73216 179024 22150 -149997 -53640 134635 59430 52321 88951 -27452
3451 -27452 -178937 -42520 -26453 -186318 -151731 120560 536693 384382 100620 80541
3441 80541 233658 241507 567266 474929 300746 127322 200487 162221 -5455 49362 57632
3430 57632 -68349 -61693 -5098 21688 217967 226034 65608 -98709 7690 389512 197603
3419 197603 64028 49165 132356 124205 98752 121380 260371 325639 232887 17268 -23369
3408 -23369 57150 -22747 17119 142637 -10599 -254252 -412437 -286472 -23623 140992
3398 140992 507986 448836 140456 -99626 -51954 -152787 -313316 -144727 -80974 -81215 -115747
3387 -115747 -229865 -302910 -91042 83903 203724 260047 23558 -160200 2199 153623
3377 153623 29087 92069 248356 328178 175180 -52671 -116030 -48178 -227841 -41339
3367 -41339 179317 206519 -47370 -347989 -278608 53175 214046 322792 226292 -64715
3357 -64715 -56634 -19726 57772 -239419 -167376 -27231 -284747 -230447 32909 198781 81298
3346 81298 15929 -55304 -338322 -394850 -333757 -145432 20939 -12231 3319 -45702 127435
3335 127435 135216 170248 -51797 -405408 -482471 -375762 -247538 54853 16282 -68163 -135406
3324 -135406 -162840 -13930 189739 228539 -88090 -328121 -276612 -141552 203847 284469
3314 284469 131706 -34504 -80175 10239 101753 71403 42426 307188 351129 184982 198237
3303 198237 370477 318493 118830 -37136 31246 28150 117574 163790 -28453 -88996 442051
3292 442051 535845 113926 -56956 -61106 35582 339923 348969 158080 260713 112656 -27912
3281 -27912 -56684 10085 237992 279720 175972 -78470 7825 -38845 29502 153348 289082
3270 289082 486790 499287 362535 90235 -9811 -284094 -88521 -94576 -10820 -10073 34227
3259 34227 158323 165044 77017 14670 -78289 -152681 -190304 -183136 -246653 -188672 -146982 87108
3247 87108 211317 239544 364071 373517 383738 103734 -174912 -237838 -190607 -180429 -96558
3236 -96558 -193704 -37817 -191825 -163546 29711 -70576 179061 543592 588675 456279
3226 456279 514361 533517 544971 463366 214566 84201 198384 106322 45548 -127265 -71524
3215 -71524 107848 52041 2150 194308 203294 79811 -126041 -133475 -77947 45654 181604
3204 181604 176986 331811 194673 271337 114653 -163300 -279310 -483600 -567218 -380001
3194 -380001 -97396 75151 93214 24332 22887 -50793 -255830 -236912 -62999 7395 -172106
3183 -172106 15207 146872 71815 -12570 -12235 -75267 7584 -64413 -127501 -122733 -70519 32486
3171 32486 104006 176721 390847 169230 137719 228595 216123 256464 369726 321724 338295
3160 338295 280361 101578 121646 -135974 1371 97448 51220 104614 104812 248542 452414
3149 452414 132059 -139237 -265159 -170212 285264 430244 192803 -2723 -180746 -103700
3139 -103700 118207 144194 58095 19480 -161704 -17754 61774 -88426 -276909 -209363 91162
3128 91162 30095 -2728 -63733 -201947 -305298 -184299 -183810 30892 137522 282100 82834
3117 82834 608 -64414 -156932 -345998 -427459 -404612 -336253 28529 277232 164664 -46153
3106 -46153 -224580 -128432 -6205 179861 208739 120094 169695 355110 165167 -160669 -337118
3095 -337118 -105407 139948 -67730 -230406 -285893 -270259 -65007 323772 362834 77489
3085 77489 -83670 -380846 -150207 126880 47802 -144806 -109843 -172846 -40335 -28791 -272827
3074 -272827 -255472 -98884 90119 210689 142852 282370 270921 154203 77887 123204 15570
3063 15570 37170 -6763 -157557 -128007 -123820 -70691 -153845 -26217 -132210 -23903 268329
3052 268329 383657 447124 260699 -9546 -241107 -217322 -156432 21894 329996 215297
3042 215297 -50035 -116721 -303950 -228393 97287 60545 83943 63318 43232 207705 57340
3031 57340 92600 -83362 -161588 -185085 111679 157010 106690 198701 185103 202766 99181
3020 99181 48312 77789 238098 206977 227259 360827 227828 -17827 -102483 -232551 -129080
3009 -129080 -3505 -54308 -65051 -31859 3588 -92435 -141295 24075 47772 158182 187440
2998 187440 -9392 -89742 -114763 11891 215520 135845 -92689 -105003 -341870 -612414
2988 -612414 -516674 -128846 70444 32834 293337 414319 322920 245907 387246 271894
2978 271894 227018 161725 93282 74565 189824 504769 581483 488583 352044 362830 176395
2967 176395 -111321 -39955 -90469 -35628 47996 406329 385073 204233 257443 217328 -15501
2956 -15501 73448 -151726 -330877 -116970 135611 213502 -37132 -288976 -421715 -372790
2946 -372790 51749 242711 445919 308457 47014 -190628 -117337 466 198214 413411
2936 413411 152481 -18522 216855 352968 341142 457027 433918 396784 372627 321549 108832
2925 108832 -235205 -272805 -262628 -194959 115554 -6623 -189404 134561 184705 242779 463264
2914 463264 376752 318583 396583 501803 593091 481441 160384 65289 75488 133326 178809
2903 178809 165295 167922 5325 50328 236440 87147 115959 55779 -140581 -288809 -341753
2892 -341753 -216124 -81963 265239 183217 276503 467333 452643 494829 414714 482491 432288
2881 432288 274774 418897 327274 271857 119007 104728 -22475 53296 225845 422984
2871 422984 305123 169189 95857 -73362 -198397 -85093 -9210 60822 130708 152136 -17553
2860 -17553 -85147 50101 93173 -105667 -216451 -88490 -25597 -71299 -324776 -303277 -345448
2849 -345448 -390256 -152430 -120117 -49370 24638 113493 129443 265651 410325 310977 155024
2838 155024 68076 -115301 -56411 112634 257157 98849 47318 -34694 -123787 -12951 80919
2827 80919 140343 308585 425541 60494 8753 28983 -77193 -133594 149467 -159 33765
2816 33765 113597 130536 -97162 -457765 -700633 -741915 -425923 -27965 87390 -52042
2806 -52042 -161758 -94836 138565 198538 270104 148186 1148 -157393 -452726 -569625
2796 -569625 -180217 87376 -89147 -144642 -263549 -211027 -171851 12202 348936 248318
2786 248318 112295 -101738 -139452 10983 234187 220786 -75216 151774 283692 120225
2776 120225 360904 540998 466461 286867 99901 -140887 40693 136911 276050 457496
2766 457496 286384 133333 251482 303974 326466 431518 409270 121924 -9075 112424
2756 112424 28119 -44679 -342381 -287356 -11210 64848 16771 -104858 44371 145708 -88799
2745 -88799 -4703 2580 -91374 -257825 -11726 54945 -140217 -25519 -192514 -131112 118871
2734 118871 338298 339862 212291 183988 3885 -68834 -63759 -32799 -102491 -221846 -223296
2723 -223296 -58913 123887 137152 -31859 -278791 -79943 217895 369647 346716 224988
2713 224988 -2725 120080 254621 67733 -53295 34032 60918 11393 -89841 -341846
2703 -341846 -374857 -100814 -7452 62026 -75438 -853 181038 102947 173972 307042 6256
2692 6256 -221174 -157370 79930 222583 9170 85905 214572 118252 181820 318356 236898
2681 236898 273999 116564 161757 146937 138753 131953 -263569 -271004 -166241 -75510 58953
2670 58953 104101 97280 -64368 26740 30653 -95848 -177385 -212418 -222989 -265047 -265213 -67104
2658 -67104 45766 146623 -4942 -62950 -77045 -137834 -545292 -531826 -636368 -435706 -301214
2647 -301214 -125514 -156645 -179309 -96669 -290497 -130396 126231 108730 86998 114943 69518
2636 69518 -38330 76689 99088 -9227 117742 170467 51396 -63423 -149934 -66004 112627
2625 112627 -26672 -171237 -102220 -93036 -96280 -203933 -288272 -49725 30898 -39188 145945
2614 145945 223412 92120 71295 78502 276588 361667 105720 -96721 -169402 -87912 -39445
2603 -39445 -151754 -154688 58351 254515 232986 46175 -17635 170876 -8190 -103204 -96480
2592 -96480 49565 188650 206624 168376 64026 172827 314367 487589 300736 -78373
2582 -78373 36502 99307 5459 -21988 209073 250922 159216 -211540 -436948 -133002 73021
2571 73021 223372 204363 170103 59695 -103073 -11970 20848 -78616 71638 258185 347362
2560 347362 248086 212754 213888 91672 -160119 -9097 199016 271836 28787 150993 272550
2549 272550 134476 65724 76611 117746 227280 4139 -270434 -395825 -423001 -485263 -447593
2538 -447593 -206894 -63368 -223075 -321933 -261846 -127881 -32973 62184 -21345 -339420 -191794
2527 -191794 152992 499601 305058 170630 86199 85029 -3654 -6611 158355 90427 -44482
2516 -44482 86642 123996 -26243 -186443 -80165 -15749 22560 162649 370326 281768 159379
2505 159379 280235 254893 333174 109278 28006 -37418 -32186 7492 -36329 23864 -91475
2494 -91475 -10878 -39146 -14685 208919 244322 149228 -20049 13583 163219 303046 1466
2483 1466 -52112 109546 145501 198912 90229 210587 145447 207385 120435 23022 -234696
2472 -234696 -265064 -286200 -295991 -49451 39700 68096 56045 -93559 -175849 6028 298915
2461 298915 166733 30289 109456 86192 -206599 -43394 198471 362598 88162 -385710
2451 -385710 -548528 -483341 -362819 -473866 -382017 -298943 -430715 -297950 -34341 -135567
2441 -135567 -92045 1347 202328 419471 378773 42201 -6900 27011 358589 320957 -7204
2430 -7204 -61109 -156958 -293996 -179442 -107930 101657 454587 627958 265492 -60884 -251786
2419 -251786 -479733 -537667 -314396 3408 167441 211779 149305 67416 -28680 -69590 -52485
2408 -52485 -97449 -179486 -173994 -215468 -129390 -217853 -231273 80863 298741 311115 228359 130693
2396 130693 32998 254226 41477 168441 160963 93920 -83947 -23940 -22585 -39291 90135
2385 90135 -4093 43424 56673 -92058 -217956 -100926 128606 203944 -43811 -171343 201365
2374 201365 260569 221256 298701 163570 138684 170600 160654 155259 127924 171304 265498 166983
2362 166983 324813 359681 112974 -127319 -273350 -302773 -216539 -361279 -88762 252892
2352 252892 80591 -130564 -383251 -470611 -540793 -511347 -447405 -326772 -312089 -345090 -358950
2341 -358950 -340185 -171875 14948 -103018 88582 119395 -114275 -133546 -145986 -66695 -107872
2330 -107872 -240647 -163428 -330967 -501926 -304585 -105004 -300933 -588152 -630498 -402189
2320 -402189 -168534 -64878 -22112 78814 416364 347084 143367 4162 -122680 142367
2310 142367 171341 89027 -93239 -162207 92570 405251 214643 145805 228628 303329 321232
2299 321232 138859 200883 135385 225963 355403 216741 212196 211222 18436 -152455 -184541
2288 -184541 -121333 -54048 87186 32446 63392 268016 192115 36503 -34378 48424 97815
2277 97815 114023 171399 98866 164729 17976 -186086 -192224 -34576 5510 148290 57588
2266 57588 202744 252071 44490 -194594 -260849 88609 223852 122057 -157038 -317832
2256 -317832 -441891 -321582 -178617 -304285 -241200 -107675 -264248 -180572 -124405 -193040
2246 -193040 -137982 36666 159960 117159 11755 -172506 -129366 6831 -66969 -291858
2236 -291858 -286689 -326430 -469625 -346858 -95630 57444 16385 -45560 -95277 144524 208342
2225 208342 -49377 -234323 -295046 -142833 -95351 -168319 10463 98848 -132424 -36706 111559
2214 111559 103828 190743 256332 141142 169 -7734 108909 319069 147945 -14474 70676
2203 70676 200302 -82045 -150733 -155763 90635 229523 199466 103224 98635 -207272 -286809
2192 -286809 -167031 -232464 -75184 -5527 -381360 -548405 -498570 -294017 -66728 131643
2182 131643 425682 401164 340257 -88328 -161589 -106009 -100389 22426 168622 165080 200483
2171 200483 326953 294823 128004 72015 119182 53414 106007 141037 320198 431316 301456
2160 301456 -2106 -127263 -251024 -221870 -225324 -223074 -194903 -234877 -89249 179791 335484
2149 335484 31804 -131580 -250831 -75591 -22158 -140657 65542 327112 546926 561914
2139 561914 320267 201587 267711 199819 123440 4604 -55672 62292 228187 250325 -110391
2128 -110391 -284 158594 -2894 -9228 22718 186826 154491 129661 201750 101084 -145622
2117 -145622 -304929 -209561 67573 73165 -66621 -129131 -27952 -271850 -313636 -188244 60260
2106 60260 234799 408232 264006 137296 168855 182072 60680 -70773 -333483 -554010
2096 -554010 -421173 -313136 -320922 -272440 -85561 76557 160380 14402 -175228 -246808 -188084
2085 -188084 -148835 -2529 185884 254081 235869 75029 32654 18143 -147933 -151394 -103568
2074 -103568 -33255 -121311 -172017 -187922 -169497 -247213 -203685 -203937 -281002 -367044 -255149 -170010
2062 -170010 -98380 -7593 -100804 -117149 -84010 -142735 -313342 -267949 -287396 -151694 -129966
2051 -129966 41161 124977 133592 131997 186371 99947 -17072 -38066 5587 -60229 -97650 -43464
2039 -43464 -60309 -71255 -18793 -25714 -119374 -20978 25163 -84049 -289585 -360618 -260449
2028 -260449 -148137 -261699 -423280 -549754 -486265 -174209 61965 396090 288355 184666
2018 184666 -4201 -145580 -25920 -1030 -105019 -101681 -125346 -204941 -240218 -131093 -113438
2007 -113438 -17638 12014 102114 369158 278371 -91877 -54008 56450 -114153 -209470 -444657
1996 -444657 -518665 -308892 -335895 -178857 -13157 73550 139174 343202 469077 320159
1986 320159 205296 -173474 -348628 -175279 -56444 9295 88909 93718 256842 300056 74285
1975 74285 149 297616 160350 -108289 -138423 77335 98084 3814 117443 39202 -128104
1964 -128104 54804 227573 138839 248379 190703 -30462 -119223 -225079 -73645 110112
1954 110112 -9027 -20145 213762 113047 48260 -212478 -380790 -369494 -638075 -479034
1944 -479034 -358293 -42821 -85836 -126443 133278 213895 135458 48626 -91057 -264763 -44166
1933 -44166 -110186 -260526 -13465 95971 25147 -140166 -133283 -182645 -93386 -118631 -111829
1922 -111829 90654 -50993 73250 -135436 -119210 17321 -78790 -201689 -284640 -286562 -68278
1911 -68278 -168453 -302089 -172510 296268 431448 350754 282464 263574 341756 418112 274988
1900 274988 179037 43727 -238707 -359073 -372213 -244637 -88896 -55705 -125843 -122265 -218669
1889 -218669 -135731 -38349 -147715 27703 68228 34609 230561 191769 54181 -156284 -231782
1878 -231782 -242666 36672 223611 298627 40222 -105081 -225228 -60161 -78345 -97972
1868 -97972 -54562 125917 416224 453995 298265 350536 -31655 -544180 -560280 -216902 48915
1857 48915 -29790 -157822 -59122 65681 -164323 -42581 -82038 -110137 -48362 -196871 -205151
1846 -205151 -47416 155398 474672 599657 476441 249366 37108 -91870 -236809 -157779
1836 -157779 22193 79558 -107970 -139879 -70481 31981 200831 -6924 -25951 -156495
1826 -156495 5960 -98651 -69725 124552 36785 -219133 -112253 -21931 -50131 39575 -7149
1815 -7149 -148675 -194406 -272212 -96646 178827 230572 405649 236251 -103745 -132052 -244131
1804 -244131 -227711 -167557 18169 171124 338506 502174 395564 159544 -286011 -497183
1794 -497183 -608903 -544761 -534700 -665349 -533573 -342024 -377972 -393565 -146202 -16102
1784 -16102 -28951 -75764 51180 120593 134651 117473 197956 110048 29222 -141138 -289465
1773 -289465 -124885 -288279 -367015 -27986 170815 274925 334385 508217 418111 212054
1763 212054 141584 -43270 -87191 -58306 -133987 -89366 -26412 163182 369470 228880 -50864
1752 -50864 -26415 -53882 35738 63332 -65593 -30865 117042 275581 182308 219542 197537
1741 197537 -8654 -256634 -388565 -288471 -50795 -80645 96395 381225 442930 406738
1731 406738 334940 224461 117940 -52265 -24776 113159 188211 67466 32639 -62572 -50996
1720 -50996 -157816 -194173 -387799 -474010 -386312 -208649 -16596 -174810 -284983 -351817 -38139
1709 -38139 9618 -215506 -91310 -45803 -33363 103164 56583 82696 218708 -41540 -81305
1698 -81305 81702 442373 469897 237445 -120836 -288256 -451459 -514979 -398416 -391119 -132006
1687 -132006 -173468 94225 331283 495028 417244 238560 230820 228754 175123 332598 42951
1676 42951 -38994 -69190 -115285 -429138 -323029 -60705 43387 -5858 -45287 53954 -49120
1665 -49120 65098 154022 91293 252530 456080 442806 315137 376881 294323 96311 -54093
1654 -54093 -123064 -58715 187855 194167 144165 196768 383683 540122 315524 191364 80945
1643 80945 -125970 -127852 -55438 -125406 -165341 -113299 -112264 -178662 -242072 -385725 -474926 -199661
1631 -199661 182255 364134 330856 124318 261409 163755 155582 308259 286534 183600 213843
1620 213843 165544 -12265 -100893 36707 4394 -76482 23313 87728 5082 16253 -120027
1609 -120027 33336 56139 3387 -190451 -214037 -100402 -132563 -132519 -45196 -117568 -308212
1598 -308212 -212236 8435 184986 367480 412153 156332 -185574 -288717 -437377 -633405
1588 -633405 -533438 -360701 -175252 -164011 30927 49869 -172360 -171363 -20272 50703 292641
1577 292641 316488 234893 327169 357002 247826 23394 -99931 -337627 -574726 -519491 -221348
1566 -221348 -100372 -98963 8008 -26148 -89384 -12059 181490 259410 398731 452619 478659
1555 478659 366895 227356 174260 1061 -6241 35522 -41139 -159757 -254156 -365714 -392288
1544 -392288 -274749 -279518 -125713 -188811 70945 172734 31357 -184573 -81803 -92818
1534 -92818 -98735 -161716 -99139 4560 254037 341340 113845 -79392 50965 -119609 -417104
1523 -417104 -492478 -393115 -178773 -105640 -357086 -314398 -134917 -213294 -204439 -312698 -363096
1512 -363096 -452270 -206951 -174123 -152666 -283572 -319534 -216823 -76277 160901 97033 -15652
1501 -15652 138451 155185 251750 453926 298568 233573 203086 286798 139998 55288 -46483
1490 -46483 -218678 -11201 57353 -42375 42506 105522 -64710 -290196 -360571 -79004 332998
1479 332998 270497 177267 28404 -48031 -10325 -221401 -392187 -357502 -364353 -251543 148409
1468 148409 420743 430712 223541 298303 204698 100841 133458 185039 175887 257902 6897
1457 6897 -265729 -234629 145145 252308 59820 -95570 -286607 -350821 -237447 -229672 -232555
1446 -232555 -219162 -120225 25025 -87323 -69178 19695 99589 -25673 -91301 292486 326965
1435 326965 221043 292569 174737 165389 14702 -348728 -129811 173483 261289 216039 138630
1424 138630 286692 495124 398974 189338 198174 165072 10431 113411 107413 -121080 -184757
1413 -184757 -159601 -171837 -286841 -444415 -268198 -263440 -277799 -60453 -62794 -153617 -166959
1402 -166959 -87737 -199650 -392141 37004 432822 37723 -513187 -544359 -273410 -11002
1392 -11002 140718 39807 143414 257389 230367 65506 124581 37427 -94818 -174454 -103428
1381 -103428 70740 20095 159265 353519 245761 80141 -101465 -91041 -607 72946
1371 72946 191166 159326 121679 -38982 37448 169486 383475 250619 128743 105121 -27827
$$ [...]
##END NTUPLES=NMR SPECTRUM
##END=
