##TITLE=Analysis number 318946
Compound Code mo 07794
Project Code adrs
Chemist Name fudan
##JCAMPDX= 6.0         $$ Bruker NMR JCAMP-DX V2.0
##DATA TYPE= NMR SPECTRUM
##DATA CLASS= NTUPLES
##ORIGIN= Bruker BioSpin GmbH
##OWNER= nmr
$$ XWIN-NMR		Version 3.5
$$ Tue Apr 25 14:05:53 2006 GMT Daylight Time (UT+1h)  MAYBRIDGE\nmr@NMR_250MHZ
##.OBSERVE FREQUENCY= 250.131544655141
##.OBSERVE NUCLEUS= ^1H
##.ACQUISITION MODE= SIMULTANEOUS (DQD)
##.ACQUISITION SCHEME= undefined
##.AVERAGES= 16
##.DIGITISER RES= 18
##SPECTROMETER/DATA SYSTEM= dpx250
##.PULSE SEQUENCE= zg30
##.SOLVENT NAME= CDCl3
##.SHIFT REFERENCE= (INTERNAL, CDCl3, 0, 16.522)
##AUDIT TRAIL= $$ (NUMBER, WHEN, WHO, WHERE, WHAT)
$$ ##TITLE= Audit trail, XWIN-NMR		Version 3.5
$$ ##JCAMPDX= 5.01
$$ ##ORIGIN= Bruker BioSpin GmbH
$$ ##OWNER= nmr
$$ C:\u/data/dgb/nmr/ADRS/3090/pdata/1/auditp.txt
$$ ##AUDIT TRAIL=  $$ (NUMBER, WHEN, WHO, WHERE, WHAT)
(   1,<2006-04-25 14:05:21.41 +100>,<MAYBRIDGE\nmr>,<NMR_250MHZ>,
      <created by zg, POWCHK disabled, PULCHK disabled
       configuration hash MD5:
       84 BC 41 DB A1 6E 1D 46 DA 25 12 A5 C1 ED C5 3A
       data hash MD5: 64K
       34 B8 6E F5 D4 B4 E0 B2 3C E2 45 D3 F9 2D 8D 55>)
(   2,<2006-04-25 14:05:43.70 +100>,<MAYBRIDGE\nmr>,<NMR_250MHZ>,
      <Start of raw data processing
       ef LB = 0.3 FT_mod = 6 PKNL = 1 SI = 32K 
       data hash MD5: 32K
       56 83 B5 93 54 2A AE 54 2D 8A 33 29 89 0F 48 14>)
(   3,<2006-04-25 14:05:45.39 +100>,<MAYBRIDGE\nmr>,<NMR_250MHZ>,
      <apk 
       data hash MD5: 32K
       B7 D2 A2 CC E9 05 64 B7 2B 3E DA C2 A4 D8 66 50>)
(   4,<2006-04-25 14:05:46.25 +100>,<MAYBRIDGE\nmr>,<NMR_250MHZ>,
      <abs ABSG = 5 
       data hash MD5: 32K
       C8 6D 1B E2 2D AA 2A 7A 23 6A 1C 44 C8 44 BF 15>)
$$ ##END=
$$ 
$$ hash MD5
$$ 62 3D 52 3F DF 99 DB AB 8D BF 31 ED 63 C9 C7 7C
##$RELAX= 
##$RELAX= 
##$RELAX= 
##$RELAX= 
##$RELAX= 
##$RELAX= 
##$RELAX= 
$$ Bruker specific parameters
$$ --------------------------
##$DU= <C:\u>
##$EXPNO= 3090
##$NAME= <ADRS>
##$PROCNO= 1
##$TYPE= <nmr>
##$USER= <dgb>
##$AMP= (0..31)
100 100 100 100 100 100 100 100 100 100 100 100 100 100 100 100 100 100 
100 100 100 100 100 100 100 100 100 100 100 100 100 100 
##$AQSEQ= 0
##$AQ_mod= 3
##$AUNM= <au_zg>
##$AUTOPOS= <40 >
##$BF1= 250.13
##$BF2= 250.13
##$BF3= 250.13
##$BF4= 250.13
##$BF5= 500.13
##$BF6= 500.13
##$BF7= 500.13
##$BF8= 500.13
##$BYTORDA= 1
##$CFDGTYP= 0
##$CFRGTYP= 5
##$CHEMSTR= <none>
##$CNST= (0..31)
1 1 145 1 1 1 1 1 1 1 1 1 1 1 1 1 1 1 1 1 1 1 1 1 1 1 1 1 1 1 1 1 
##$CPDPRG= <>
##$CPDPRG1= <>
##$CPDPRG2= <>
##$CPDPRG3= <>
##$CPDPRG4= <mlev>
##$CPDPRG5= <mlev>
##$CPDPRG6= <mlev>
##$CPDPRG7= <mlev>
##$CPDPRG8= <mlev>
##$CPDPRGB= <>
##$CPDPRGT= <>
##$D= (0..31)
0 1 0 0 0 0 0 0 0 0.06 0 0 0 0 0 0 0.0002 0 0 0 0 0 0 0 0 0 0 0 0 0 0 
0 
##$DATE= 1145970319
##$DBL= (0..7)
120 120 120 120 120 120 120 120 
##$DBP= (0..7)
150 150 150 150 150 150 150 150 
##$DBP07= 0
##$DBPNAM0= <>
##$DBPNAM1= <>
##$DBPNAM2= <>
$$ [...]
##$SUBNAM7= <"">
##$SUBNAM8= <"">
##$SUBNAM9= <"">
##$SW= 20.6930455092707
##$SWIBOX= (0..15)
0 0 3 0 0 0 0 0 0 0 0 0 0 0 0 0 
##$SW_h= 5175.983436853
##$TD= 65536
##$TD0= 1
##$TE= 295.16
##$TE2= 300
##$TE3= 300
##$TEG= 300
##$TL= (0..7)
0 120 120 120 120 120 120 120 
##$TP= (0..7)
150 150 150 150 150 150 150 150 
##$TP07= 0
##$TPNAME0= <>
##$TPNAME1= <>
##$TPNAME2= <>
##$TPNAME3= <>
##$TPNAME4= <>
##$TPNAME5= <>
##$TPNAME6= <>
##$TPNAME7= <>
##$TPOAL= (0..7)
0.5 0.5 0.5 0.5 0.5 0.5 0.5 0.5 
##$TPOFFS= (0..7)
0 0 0 0 0 0 0 0 
##$TUNHIN= 0
##$TUNHOUT= 0
##$TUNXOUT= 0
##$USERA1= <user>
##$USERA2= <user>
##$USERA3= <user>
##$USERA4= <user>
##$USERA5= <user>
##$V9= 5
##$VALIST= <valist>
##$VCLIST= <CCCCCCCCCCCCCCC>
##$VD= 0
##$VDLIST= <DDDDDDDDDDDDDDD>
##$VPLIST= <PPPPPPPPPPPPPPP>
##$VTLIST= <TTTTTTTTTTTTTTT>
##$WBST= 1024
##$WBSW= 4
##$XGAIN= (0..3)
0 0 0 0 
##$XL= 0
##$YL= 0
##$YMAX_a= 466583
##$YMIN_a= -489742
##$ZGOPTNS= <>
##$ZL1= 120
##$ZL2= 120
##$ZL3= 120
##$ZL4= 120
##$ABSF1= 16.522
##$ABSF2= -4.171173
##$ABSG= 5
##$ABSL= 3
##$ALPHA= 0
##$AQORDER= 0
##$ASSFAC= 0
##$ASSFACI= 0
##$ASSFACX= 0
##$ASSWID= 0
##$AUNMP= <proc_1d>
##$AZFE= 0.1
##$AZFW= 0.1
##$BCFW= 0
##$BC_mod= 0
##$BYTORDP= 0
##$COROFFS= 0
##$CY= 12.5
##$DATMOD= 1
##$DC= 0
##$DFILT= <>
##$DTYPP= 0
##$F1P= 14.0000005364418
##$F2P= -0.99999901652339
##$FCOR= 0.5
##$FTSIZE= 32768
##$FT_mod= 6
##$GAMMA= 0
##$GB= 0
##$INTBC= 1
##$INTSCL= 1
##$ISEN= 128
##$LB= 0.3
##$LEV0= 0
##$LPBIN= 0
##$MAXI= 10000
##$MC2= 0
##$MEAN= 0
##$ME_mod= 0
##$MI= 0
##$NCOEF= 0
##$NC_proc= -3
##$NLEV= 6
##$NOISF1= 0
##$NOISF2= 0
##$NSP= 0
##$NTH_PI= 0
##$NZP= 0
##$OFFSET= 16.522
##$PC= 1
##$PHC0= 164.5883
##$PHC1= 5.490382
##$PH_mod= 1
##$PKNL= yes
##$PPARMOD= 0
##$PSCAL= 4
##$PSIGN= 0
##$REVERSE= no
##$SF= 250.13
##$SI= 32768
##$SIGF1= 0
##$SIGF2= 0
##$SINO= 400
##$SIOLD= 32768
##$SREGLST= <1H.CDCl3>
##$SSB= 0
##$STSI= 32768
##$STSR= 0
##$SW_p= 5175.98343685301
##$SYMM= 0
##$S_DEV= 0
##$TDeff= 65536
##$TDoff= 0
##$TI= <Analysis number 999999
Compound Code 99
Book Reference 9
Project Code 9>
##$TILT= no
##$TM1= 0
##$TM2= 0
##$TOPLEV= 0
##$USERP1= <user>
##$USERP2= <user>
##$USERP3= <user>
##$USERP4= <user>
##$USERP5= <user>
##$WDW= 1
##$XDIM= 32768
##$YMAX_p= 377453222
##$YMIN_p= -120224
$$ End of Bruker specific parameters
$$ ---------------------------------
##NTUPLES= NMR SPECTRUM
##VAR_NAME=  FREQUENCY,     SPECTRUM/REAL,   SPECTRUM/IMAG
##SYMBOL=    X,             R,               I
##VAR_TYPE=  INDEPENDENT,   DEPENDENT,       DEPENDENT
##VAR_FORM=  AFFN,          ASDF,            ASDF
##VAR_DIM=   32768,         32768,           32768
##UNITS=     HZ,            ARBITRARY UNITS, ARBITRARY UNITS
##FACTOR=    0.157963299565203, 1,           1
##FIRST=     4132.6476996994, 0,             0
##LAST=      -1043.33573715361, 0,           0
##MIN=       -1043.33573715361, -120224,     0
##MAX=       4132.6476996994, 377453222,     0
$$ Real data points
##PAGE= N=1
##DATA TABLE= (X++(R..R)), XYDATA
$$ [...]
23947B4448J9509k5875j2761J1211J2684L525J0147J6090J0524L282k2291l5392
$$ 24448 43957 18082 5321 16532 29216 32741 42888 58978 69502 72784 50493 15101
23935A5101j1443o030j112L173J4203o670Q184L895M835J7261N653n421k3230
$$ 15101 3658 -2372 -3484 -311 13892 7222 15406 19301 24136 41397 47050 41629 18399
23922A8399k0130j0902L3992k576o731J1198L902m862k6565j0553J9811J2276
$$ 18399 -1731 -12633 21359 18783 12052 23250 27152 22290 -4275 -14828 4983 17259
23910A7259L029j8687k088R960K333j1671Q61O263n162k7759o909o146j383J5942
$$ 17259 20288 1601 -487 9473 11806 135 996 7259 2097 -25662 -32571 -38717 -40100 -24158
23896b4158J3854q523P744J5863K1137p287N652K1967q018k1234j0659k6769K751
$$ -24158 -10304 -18827 -11083 4780 25917 18630 24282 46249 38231 16997 6338 -20431 -17680
23883a7680l46Q051K9291R879q341j6387l0309r968m963k6158K1744L4053K0617
$$ -17680 -18026 -9975 19316 29195 20854 4467 -25842 -35810 -40773 -66931 -45187 -11134 9483
23870I483r928J8088R008k984j8455j0284J3731O968o2l7360N41M3188L7080j3474
$$ 9483 -445 17643 26651 23667 5212 -5072 8659 15627 15565 -21795 -21254 21934 59014 45540
23856D5540k8798p564j230m207R85o56J961k3730l486J318p646J9874K6199L245
$$ 45540 16742 9178 7948 3741 4726 4070 6031 -17699 -21185 -19867 -27513 -7639 18560 21805
23842B1805k5882N440o358J2467J7299j4875Q322o833r339j4209P084j5775M0653
$$ 21805 -4077 1363 -4995 7472 24771 9896 18218 11385 2046 -12163 -5079 -20854 19799
23829A9799J5077k4453j0149j0060K3520q106l693j7108r010N1667J2307j2658
$$ 19799 34876 10423 274 -9786 13734 5628 1935 -15173 -24183 27484 39791 27133
23817B7133j3525J3091J093p371k5388J3126J8082j2168M18k8068K621J495m476
$$ 27133 13608 26699 27792 20421 -4967 8159 26241 14073 14491 -13577 -10956 -9461 -13937
23804a3937p836K3620K9853j7832k9223o7J683q647K1562M0840l2487K58J3718
$$ -13937 -21773 1847 31700 13868 -15355 -15422 -13739 -22386 -824 40016 7529 7787 21505
23791B1505j4397j0618J4558J9088j3198l675j2794J6918j1009j647L196k7214
$$ 21505 7108 -3510 11048 30136 16938 13263 469 17387 6378 4731 7927 -19287
23779a9287o869j1890O690J1418M2740J9915k4011j0928r366k840q259n344Q07
$$ -19287 -26156 -38046 -31356 -19938 22802 42717 18706 7778 -1588 -4428 -12687 -18031 -17224
23766a7224J7160K819J0065L4860j1250Q76K4261q175l3883k0888j0700J9115
$$ -17224 -64 2755 12820 47680 36430 37306 61567 53392 19509 -1379 -12079 7036
23754G036L0826J664k5710j9004k9889q849L3777Q763J57k0005k0925K7155K0980
$$ 7036 37862 39526 13816 -5188 -35077 -43926 -10149 -1386 -1229 -21234 -42159 -15004 5976
23741E976p701j2861k0554n263J9205m3Q972j6836m105R48J0536M2067L3548k6929
$$ 5976 -1725 -14586 -35140 -40403 -21198 -21241 -12269 -29105 -33210 -32262 -21726 20341 53889 26960
23727B6960N075k2043J1214o637k4113j3557L022J1043J9983Q06p592J1271p850
$$ 26960 32035 9992 21206 14569 -9544 -23101 -20079 -9036 10947 11753 4161 15432 7582
23714G582j7625j3684r48N625l5547j4432J4208K512J9948J1874j8457k2008j2336
$$ 7582 -10043 -23727 -24675 -19050 -54597 -69029 -54821 -52309 -32361 -20487 -38944 -60952 -73288
23701g3288Q89K2386n655K1708p998M211j5666j2948P491M2507K1633l2916j9910
$$ -73288 -72399 -50013 -55668 -33960 -41958 -37747 -53413 -66361 -58870 -16363 5270 -27646 -47556
23688d7556N16M6552J911k5566j5019J5729J0330J6922l101N058m495J833k9748
$$ -47556 -47040 -488 1423 -24143 -39162 -23433 -13103 3819 718 5776 1281 3114 -26634
23675b6634l8012l0441J9576M8461L514P630l0383r616L525J1683L1915K3162
$$ -26634 -64646 -95087 -75511 -27050 -23536 -15906 -46289 -55905 -52380 -40697 -8782 14380
23663A4380J070j7145k9957j0221k030j2437J4279R972J563J8653J2626K4025
$$ 14380 15450 -1695 -31652 -41873 -43903 -56340 -42061 -32089 -30526 -11873 753 24778
23651B4778M664j210o393Q31O19j5646k6716n388L7378k1180j4040l986L703n371
$$ 24778 29442 28232 21839 22670 23289 7643 -19073 -24461 12917 -8263 -22303 -26289 -22586 -27957
23637b7957K717K1512O907Q292J2434j2899k4500L5209k1295j6434o591K0353
$$ -27957 -25240 -3728 3179 11471 23905 11006 -13494 21715 420 -16014 -22605 -2252
23625b252J9335o903J0619O707J755j9210j6898K1504K4530p716l6111j3557j2112
$$ -2252 17083 10180 20799 27506 29261 10051 -6847 14657 39187 31471 -4640 -18197 -30309
23612c0309n166J5798m584k8091k4394K815J4865K6879J8933L3087L0982L190
$$ -30309 -35475 -19677 -24261 -52352 -76746 -73931 -59066 -32187 -13254 19833 50815 54005
23600E4005k3231p921P464R47j6815k2032j6610J924J2007m141j6216j959R023
$$ 54005 30774 22853 30317 31264 14449 -7583 -24193 -22269 -10262 -14403 -30619 -32578 -23555
23587b3555N89j877K5793J1085J6352j2553k6273j1121J2248K941L663l045n296
$$ -23555 -22966 -24843 950 12035 28387 15834 -10439 -21560 -9312 -6371 -2708 -5753 -11049
23574a1049l185l3484P540J9665M080n697J9678L1463J0688k0715k8982k0653
$$ -11049 -14234 -47718 -40178 -20513 -16433 -22130 -2452 29011 39699 18984 -9998 -30651
23562c0651J8390K7295l1999L099J6659J1824J4954J4737k720j3984j5428p831
$$ -30651 -12261 15034 -16965 -13866 2793 14617 29571 44308 41588 27604 12176 4345
23550D345j0344J805N324j3976O432J8113k6055K1199J1638L668r074k8915q35
$$ 4345 -5999 -4194 1130 -12846 -6414 11699 -14356 6843 18481 22149 13075 -15840 -16675
23537a6675L1819j5819j0232j4369l3036j7482J3719P5330K2853k9353k3186j9732
$$ -16675 15144 -675 -10907 -25276 -58312 -75794 -62075 13255 36108 6755 -16431 -36163
23525c6163O362M193J9910j2475R707k2466N766N952P560K7174L0179k7823n796
$$ -36163 -29801 -25608 -5698 -18173 -8466 -30932 -25166 -19214 -11654 15520 45699 17876 12080
23512A2080J4402j1122k0622l348R593L3210K0405k4069j4318j6521P50O77L187
$$ 12080 26482 15360 -5262 -8610 983 34193 54598 30529 16211 -310 440 1117 4304
23499D304n696n53Q916j622j4612N650N242j0762j8902O981J0110N527J8171j6500
$$ 4304 -1392 -1945 6971 5349 -9263 -3613 1629 -9133 -28035 -21054 -10944 -5417 12754 -3746
23485c746K586j2430J0002L9828J8850j0006l0175j6626k2220j3160n42K2525
$$ -3746 -1160 -13590 -3588 36240 55090 45084 14909 -1717 -23937 -37097 -37639 -15114
23473a5114J0498K7184P335k1365k4475J0100J6126k1996q900J8480M491o824
$$ -15114 -4616 22568 29903 8538 -15937 -5837 10289 -11707 -20607 -2127 2364 -4460
23461d460q811J6056j874P923J191j6912k8670K8317L7933k0163p260n053k6175
$$ -4460 -13271 2785 911 8834 10025 -6887 -35557 -7240 30693 10530 3270 -1783 -27958
23448b7958J4035K8955j1149j6567k4474J0475K4764N483k898R144n476l11M92
$$ -27958 -13923 15032 3883 -12684 -37158 -26683 -1919 3564 666 9810 4334 4023 4515
23435D515J3271j2796J3265K205k439m752j6019k417n943N114J3192L1k5109j1388
$$ 4515 17786 4990 18255 20460 18021 13269 -2750 -5167 -11110 -5996 7196 7227 -17882 -29270
23421b9270K6926n128k3003j6286j7186L4714K0562l407J0208J3557p08R275r381
$$ -29270 -2344 -7472 -30475 -46761 -63947 -29233 -8671 -12078 -1870 11687 10979 20254 10873
23408A0873k2353L304J9647J1315J564l1018k6116P899J9067o812J9738J5054
$$ 10873 -11480 -8176 11471 22786 24350 -6668 -32784 -24885 -5818 -12630 7108 22162
23396B2162r625J4191J0141p073J2207j4763l0699k4077K4836K1606o577j5598
$$ 22162 12537 26728 36869 29796 42003 27240 -3459 -27536 -2700 18906 12329 -3269
23384c269o159n918j217P899n596j386J5593r385J9888K3126m287k0344L975j4891
$$ -3269 -9428 -15346 -16563 -8664 -14260 -15646 -53 -9438 10450 33576 29289 8945 12920 -1971
23370a971l2865J6684J2634Q307j988J6422j9160j10r954l3265M170K1143j3277
$$ -1971 -34836 -18152 -5518 2789 801 17223 -1937 -2047 -12001 -45266 -41096 -19953 -33230
23357c3230J4017K7377m36p521J2809r508j2199R682J714j3629q693r31Q578K8677
$$ -33230 -19213 8164 7728 207 13016 3508 -8691 991 2705 -10924 -19617 -20548 -11970 16707
23343A6707p48L3981j7712j7984J4984N694k4037j1334J0100K1427q145j5313
$$ 16707 15959 49940 32228 14244 29228 34922 10885 -449 9651 31078 22933 7620
23331G620k733j9841o779L26L6225j0986k0636j677K9282J7399m41J6226K257
$$ 7620 4887 -14954 -21733 -21407 14818 3832 -16804 -18481 10801 28200 27759 43985 46242
23318D6242j3128N691j0182M212J1975j0490k1420J5753J298r606q081j8515j6047
$$ 46242 33114 38805 28623 32835 44810 34320 12900 28653 29951 20345 12264 -6251 -22298
23305b2298m1536k713J8986J5145l737j1638J1503K2131j0681k728K8160j1238
$$ -22298 -63834 -66547 -47561 -32416 -36153 -47791 -36288 -14157 -24838 -27566 594 -10644
23293a0644j3834M004L6557K3841k227J9616Q002l4866k6631j859m4742M442m03
$$ -10644 -24478 -20474 16083 39924 37697 57313 65315 30449 3818 1959 -42783 -38341 -38744
23280c8744j0549j806L757K3817j4260j6872O078L2337l4265j6037P245J2609
$$ -38744 -49293 -51099 -47342 -23525 -37785 -54657 -48579 -16242 -50507 -66544 -59299 -46690
23268d6690K9319K4188N788M942j69J6263J3133J775N921l5331j2465P97J8180
$$ -46690 -17371 6817 12605 17547 17378 33641 46774 48549 54470 19139 6674 7471 25651
23255B5651L394l627r861P2J7094J8354l3373j0722M714m347J5628K532K1364
$$ 25651 29045 25418 15557 15629 32723 51077 17704 6982 11696 7349 22977 25509 46873
23242D6873j8250m8184k5258M422M4970l9659j0075L7218L374j7131j3357J9345
$$ 46873 28623 -19561 -44819 -40397 4573 -35086 -45161 -7943 -4569 -21700 -35057 -15712
23230a5712J7875r380j6793o721M373J9075k9068M128j825k5574L3413L7497J7543
$$ -15712 2163 -7217 -24010 -30731 -26358 -7283 -36351 -32223 -34048 -59622 -26209 11288 28831
23217B8831j7356L367j0270k9486K1344M3879M024j9995k6889j9007j0097J9926
$$ 28831 11475 14842 4572 -24914 -3570 40309 44333 24338 -2551 -21558 -31655 -11729
23205a1729K980K304j1657j7189j0567o27j2906L1319J2356K5590J6306j2764
$$ -11729 -8749 -6445 -18102 -35291 -45858 -46485 -59391 -28072 -15716 9874 26180 13416
23193A3416j8879R81J5595p716j1437O850r009R264J8372J506m587k4552j4316
$$ 13416 -5463 -4482 11113 3397 -8040 -1190 -10199 -935 17437 18943 14356 -10196 -24512
23180b4512J5383P424P327k7179l4017J1742K8253r858J9432R769j2407O613L4468
$$ -24512 -9129 -1705 5622 -21557 -55574 -43832 -15579 -25437 -6005 3764 -8643 -2030 32438
23167C2438K4744j6526l937j8370l5958j2424P544J8271O018J999K1849j7695
$$ 32438 57182 40656 36719 18349 -17609 -30033 -22489 -4218 1800 3799 25648 7953
23155G953J4427r743K375J6867J6280p944m6388j01L7678L5729l7125l1652J5622
$$ 7953 22380 12637 15012 31879 48159 40215 -6173 -6274 31404 67133 30008 -1644 13978
23142A3978J0323J4558j7977j6933J4800r215M919O366m996j1077j5124K415L1640
$$ 13978 24301 38859 20882 3949 18749 9534 14453 20819 15823 4746 -10378 -7963 23677
23129B3677j9533k7435m568L5580J4397r098r826M406N334L542l763k3498M118
$$ 23677 4144 -23291 -27859 7721 22118 13020 3194 7600 12934 16476 12713 -10785 -6667
23116f667K0802k0059n142J4381k4197k8931k014M558J891K6357L3066K0516l4103
$$ -6667 14135 -5924 -11066 3315 -20882 -49813 -51827 -47269 -45378 -19021 14045 34561 458
23103D58L422K960K2236j1100N413k3713r367n283J9948J320n4059l6505J6217
$$ 458 3880 6840 29076 17976 23389 -324 -9691 -14974 4974 6294 -47765 -84270 -68053
23090f8053L5874M6426J540j5949K1434q770k0716J4804P027J8309j1233j9823
$$ -68053 -32179 14247 15787 -162 21272 12502 -8214 6590 13617 31926 20693 870
23078H70M5776m067l5987k1291j2493P303q025J2428o447P372j0998L098M0159
$$ 870 46646 42579 6592 -14699 -27192 -19889 -27914 -15486 -21933 -14561 -25559 -22461 17698
23065A7698L2598j4134k7047j6972j1167j6850O704M188K5971J5210J6345J4200
$$ 17698 50296 36162 9115 -7857 -19024 -35874 -29170 -24982 989 16199 32544 46744
23053D6744l681O376k9641k779j7311L1143l2298j9608q733M521J0633P844O715
$$ 46744 43063 49439 19798 17019 -292 30851 -1447 -21055 -29788 -25267 -14634 -6790 -75
23040g5k457J3080L116l3204l7873J2067K3033J5706j1952J9244k8066J5881L4211
$$ -75 -2532 10548 13664 -19540 -57413 -45346 -22313 -6607 -18559 685 -27381 -11500 22711
23027B2711K4063R808j6584Q433K543k7951K0304J1910l095p790j5294k7727l4885
$$ 22711 46774 56582 39998 48431 50974 23023 43327 55237 52142 44352 29058 1331 -33554
23014c3554J1764P701P6J4098J216k2274P493k2636k5391k505L376K3919R873
$$ -33554 -21790 -14089 -14013 85 1301 -20973 -13480 -36116 -61507 -64012 -60636 -36717 -26844
23001b6844l587J1014k3435J4405J2115K7074j678m975Q251k1133j9734j5479
$$ -26844 -30431 -19417 -42852 -28447 -16332 10742 9064 4089 12340 -8793 -28527 -44006
22989d4006L874j3140J1939M2933M417p413L1093j8924k9224r500J4577k578n676
$$ -44006 -40132 -53272 -41333 1600 6017 -1396 29697 10773 -18451 -27951 -13374 -15952 -21628
22976b1628k985J4389P408l0834j9743J6405Q303j0798J4699L6708j0622p130
$$ -21628 -24613 -10224 -2816 -33650 -53393 -36988 -28685 -39483 -24784 11924 1302 -5828
22964e828l8277J9164K6311o776N754j7575P681J7560k2802j4066l4809R733J1120
$$ -5828 -44105 -24941 1370 -5406 348 -17227 -9546 8014 -14788 -28854 -63663 -53930 -42810
22951d2810M610m169L4836J4479j0560j0870k0074r45J725J339Q657R489M112
$$ -42810 -38200 -42369 -7533 6946 -3614 -14484 -34558 -35503 -33778 -32439 -23782 -14293 -10181
22938a0181J0899m306n496j1047K3171K7543j8458n216n039m0J1729j7012j6297
$$ -10181 718 -3588 -9084 -20131 3040 30583 12125 6909 1870 1830 13559 -3453 -19750
22925a9750L608R250j0612L1784J911k6067j2638n507L013M1325n57P647q902
$$ -19750 -16142 -6892 -17504 14280 16191 -9876 -22514 -28021 -25008 16317 15760 23407 14505
22912A4505P122q283J0456o343k9543j9725j2604J082J6722L422K7127k0506l3718
$$ 14505 21627 13344 23800 17457 -12086 -31811 -44415 -43333 -26611 -23189 3938 -16568 -50286
22899e0286N105K8691Q234j4077j2558k116K3738J3395J0651N699j4813q455m21
$$ -50286 -45181 -16490 -8256 -22333 -34891 -37007 -13269 126 10777 16476 1663 -6792 -7213
22886g213k0235K0354l15l4020j7017m254J7363Q759N978j5749j6931K9225M8406
$$ -7213 -27448 -7094 -7409 -41429 -58446 -62700 -45337 -36578 -30600 -46349 -63280 -34055 14351
22873A4351K5585Q605q029m3348o722J8435o078j3745k2921J6225J8436j0963
$$ 14351 39936 48541 40512 -2836 -9558 8877 2799 -10946 -33867 -17642 794 -10169
22861a0169L538J4099J6233P171Q110P565M381P400n939k7105k2443O110N550
$$ -10169 -6631 7468 23701 30872 38982 46547 50928 58328 52389 25284 2841 8951 14501
22848A4501k4265j9305K5306K4985J4653J4262r596q677l363l0455j6806j0816
$$ 14501 -9764 -29069 -3763 21222 35875 50137 40541 31864 28501 -1954 -18760 -29576
22836b9576J8655L4273k6855j2085J2923J6593J2585J542k1671k0234O729Q878
$$ -29576 -10921 23352 -3503 -15588 -2665 13928 26513 28055 6384 -13850 -7121 1757
22824A757j3515k4189o256L6421J0810L733o098j2505j0071Q879J2744m467r661
$$ 1757 -11758 -35947 -42203 -5782 5028 8761 2663 -9842 -19913 -11034 1710 -2757 -12418
22811a2418K8730P707o454j7928Q442j2923l49k9017n84K4587J0437K2244j6940
$$ -12418 16312 24019 17565 -363 8079 -4844 -5193 -34210 -34794 -10207 230 22474 5534
22798E534j0578k1320N914k806k0314j5587R505J4128P786m039l049K117J743
$$ 5534 -5044 -26364 -20450 -23256 -43570 -59157 -49652 -35524 -27738 -31777 -34826 -32709 -30966
22785c0966J4680K9174J3294O481Q272p660q225j5131k339p667J3550K8225K1374
$$ -30966 -16286 12888 26182 32663 40935 33275 25050 9919 7580 -87 13463 41688 63062
22772F3062J493K877k7876j8882J0603j1892j0392k0820n489k1273J6070K5183
$$ 63062 64555 67432 39556 20674 31277 19385 8993 -11827 -17316 -38589 -22519 2664
22760B664N937l216L0450m433j5594p993Q359O662k2087k8448K5108J7611k200
$$ 2664 8601 5385 35835 31402 15808 7815 16174 22836 749 -27699 -2591 15020 12820
22747A2820K4371J6466l3685r58J3129k9168q625L2729j5012r151L8235Q220j3065
$$ 12820 37191 53657 19972 19014 32143 2975 -5650 27079 12067 2916 41151 49371 36306
22734C6306j5148l4956j1014J6574M773J7700k2608J6173K4057R030J160l6439
$$ 36306 21158 -13798 -24812 -8238 -3465 14235 -8373 7800 31857 40887 42047 5608
22722E608j7044N92j7878n656K0039K383J3010p908l6663o959L7378L6790l158
$$ 5608 -11436 -10844 -28722 -34378 -14339 -11956 1054 -6854 -43517 -50476 -13098 23692 20534
22709B0534m576J1230R841k1030Q979J7564o829o230J5234L2515J2752m6296j8317
$$ 20534 15958 27188 37029 15999 24978 42542 35713 29483 44717 77232 89984 43688 25371
22696B5371r175k0728j1163J6366k5522j0948J7806Q420J7940j3099j598J1071
$$ 25371 16196 -4532 -15695 671 -24851 -35799 -17993 -9573 8367 -4732 -6330 4741
22684D741J2925O404O371J7786O488j8286l5154k6119N84K6409N0871J2452N305
$$ 4741 17666 24070 30441 48227 54715 36429 1275 -24844 -24260 2149 53020 65472 70777
22671G0777l3210k5277q033l1624J288j7646n303M4249M883j7675K49j0543j0672
$$ 70777 37567 12290 4257 -27367 -26079 -43725 -49028 -4779 104 -17571 -17322 -27865 -38537
22658c8537N094O62k43L204J6535j0309j3201R878j521J0027O6631J3537l758
$$ -38537 -33443 -32781 -33024 -29820 -13285 -23594 -36795 -26917 -28438 -18411 48220 61757 57999
22645E7999j3848l8162m261k8880m683o307J0480O833L3915M047J327L941K874
$$ 57999 44151 5989 1728 -27152 -31835 -38142 -27662 -20829 13086 17133 18460 22401 25275
22632B5275k3425j7386N980M763m999j3863K9282K0713J8319J7064L1015k6228
$$ 25275 1850 -15536 -9556 -4793 -9792 -23655 5627 26340 44659 61723 92738 66510
22620F6510q283l0904k0704J7284n619R60L758J1848j1221j3437k208l49J7012
$$ 66510 58227 27323 6619 23903 18284 19244 23002 34850 23629 10192 7984 7635 24647
22607B4647j7031k8131N116j2199J315j945j6346J5394Q704l074M684q863J7371
$$ 24647 7616 -20515 -15399 -27598 -26283 -28228 -44574 -29180 -20476 -23550 -18866 -27729 -10358
22594a0358K7014k4217k16J0621l8431k0255R59o999K1773l26J0747K6624j6934
$$ -10358 16656 -7561 -7777 2844 -35587 -55842 -54883 -61882 -40109 -40435 -29688 -3064 -19998
22581a9998q54L872k336j6216K5292O562R777p425K4733k286k1784j409p04j2675
$$ -19998 -20852 -16980 -19316 -35532 -10240 -3678 6099 -1326 23407 21121 -663 -2072 -2776 -15451
22567a5451q575j8697J7102R974k1861J8572l2901j5345Q182J5631J862r006j788
$$ -15451 -24026 -42723 -25621 -15647 -37508 -18936 -51837 -67182 -59000 -43369 -41507 -50513 -52301
22554e2301R606K939J6120P282J846J254r176j0900J8585J2614L68N989r258l0308
$$ -52301 -42695 -39756 -23636 -16354 -14508 -13254 -22430 -33330 -14745 -2131 -1763 4226 -5032 -35340
22540c5340K4518K8037j2619j6695n674K55j4448p531J2896M846k34k3069m33
$$ -35340 -10822 17215 4596 -12099 -17773 -17518 -31966 -39497 -26601 -21755 -21989 -45058 -45491
22527d5491N983N422J7860K1512p856J1390j4383j3652n411P703m006P713L0413
$$ -45491 -39508 -34086 -16226 5286 -2570 8820 -5563 -19215 -24626 -16923 -20929 -13216 17197
22514A7197j7846p211n151q473K8108J1313j8621K1202L3990J8049N831k2128
$$ 17197 -649 -7860 -13011 -21484 6624 17937 -684 20518 54508 72557 78388 56260
22502E6260m6548o845j7751K1739L0560l665j7598k5821J0245Q73j4731k613p585
$$ 56260 9712 2867 -14884 6855 37415 33750 16152 -9669 576 1449 -13282 -15895 -23480
22489b3480K6538J4179n8364j2244J6484J2906r663k1431k0215K079M1531j0155
$$ -23480 3058 17237 -41127 -53371 -36887 -23981 -33644 -55075 -75290 -73211 -31680 -41835
22477d1835k3743J0532K8916J6792M631R191q65J0102J2320k7428l5939K2853
$$ -41835 -65578 -55046 -26130 -9338 -4707 4484 3619 13721 26041 -1387 -37326 -14473
22465a4473m432P691K2470J1253j0029L4377j1703k8794k0565q985j1463K9851
$$ -14473 -18905 -11214 11256 22509 12480 46857 35154 6360 -14205 -23190 -34653 -4802
22453d802L532n059L710j1038j1393M605k4288q512j5931R990M3748L9222j8073
$$ -4802 -1270 -6329 -2619 -13657 -25050 -20445 -44733 -53245 -69176 -59186 -15438 23784 5711
22440E711j129O268R81k6515J5475R562j0445j0170J4971j0660K775O409j3213
$$ 5711 4582 10850 11831 -14684 791 10353 -92 -10262 4709 -5951 -3176 3233 -9980
22427i980M266O713K2637P452k5929k1018k1885j6429j265L8878K5236J5457N421
$$ -9980 -5714 999 23636 31088 5159 -15859 -37744 -54173 -55438 -16560 8676 24133 29554
22414B9554k3261k3341J9434K793p253o436o462k5901K4755K5131M464k1484N942
$$ 29554 6293 -17048 2386 5179 -2074 -8510 -14972 -40873 -16118 9013 13477 -8007 -2065
22401b065Q224J034r644J7715r727k050R091J1523k4326j8091k8512k9918J7979
$$ -2065 6159 7193 -2451 15264 5537 3487 12578 24101 -225 -18316 -46828 -76746 -58767
22388e8767J3736m458K1904m073n280J9198L467k0248R785J9295r766J4863j6177
$$ -58767 -45031 -49489 -27585 -31658 -36938 -17740 -14273 -34521 -24736 -5441 -15207 -344 -16521
22375a6521O423L0387P028k2936K982R694Q874m615l6434J1131J789j8184K5879
$$ -16521 -10098 20289 27317 4381 7363 17057 25931 21316 -15118 -3987 -2198 -20382 5497
22362E497J782O354n139k546L824O413o078j5351n958J3011O687j2670j3052j0298
$$ 5497 7279 13633 8494 5948 9772 16185 10107 -5244 -11202 1809 8496 -4174 -17226 -27524
22348b7524r264J8322j6566k5741N920P089M0411J556j4987L870l559k7431l6522
$$ -27524 -36788 -18466 -35032 -60773 -54853 -47764 -7353 -5797 -20784 -16914 -20473 -47904 -84426
22335h4426j489L0687L5820M8475J0070J3687l5198l849j076J9598k7931j9436
$$ -84426 -85915 -55228 -19408 29067 39137 52824 17626 13777 12701 32299 4368 -15068
22323a5068o714j2733J7355M3017L791k9127r195M5491q256j6553k9554p795M446
$$ -15068 -21782 -34515 -17160 25857 29648 521 -8674 36817 28561 12008 -17546 -25341 -20895
22310b0895J411P068K3688J4693k267n008p355P062J6254j1440j5750n1761k3053
$$ -20895 -19484 -12416 11272 25965 23698 18690 11335 18397 34651 23211 7461 -44300 -67353
22297f7353J1547L4149K1663J5065l373j4185j1390l1801K2077J0032l246J8877
$$ -67353 -55806 -21657 6 15071 11698 -2487 -13877 -45678 -23601 -13569 -16815 2062
22285B062J8044j0176J1613J707j07L058J0255J6481j4847j1728J604j6854R378
$$ 2062 20106 9930 21543 23250 23143 26201 36456 52937 38090 26362 27966 11112 20490
22272B0490J0685k8239l8593l1381K4957J2463P494K799K444K9514k355j7973
$$ 20490 31175 2936 -35657 -67038 -42081 -29618 -22124 -19325 -16881 12633 10278 -7695
22260g695M555m884R001K1396K2728q264n0682j2824J1474P634K4211Q892l4025
$$ -7695 -3140 -8024 977 22373 45101 36837 -13845 -26669 -15195 -7561 16650 25542 -8483
22247h483J0573K722M007r134k2265m765K5039M1869j8113j9771J5182j3230k4457
$$ -8483 2090 4812 8819 -315 -22580 -27345 -2306 39563 21450 1679 16861 3631 -20826
22234b0826J454L767J068p403j512j2424n616J2724Q581j3636J6297J8172q201
$$ -20826 -19372 -15605 -14537 -21940 -23452 -35876 -41492 -28768 -20187 -33823 -17526 646 -7555
22221g555p404K543J5266K6756L481j1111j1592k0322q514J6042K9663k8757M518
$$ -7555 -14959 -12416 2850 29606 33087 21976 10384 -9938 -18452 -2410 27253 -1504 3014
22208C014L6369K4351k4966l899L23Q393j0809l8300j3738J0934K5223k0578k0191
$$ 3014 39383 63734 38768 34869 35192 43585 32776 -5524 -19262 -8328 16895 -3683 -23874
22195b3874q658L642r755J5610M33K7545K3521K5703j2314k8559j3656L698J8961
$$ -23874 -32532 -28890 -38645 -23035 -22602 4943 28464 54167 41853 13294 -362 3336 22297
22182B2297l19j8955J1519j6917j2565L439l0040K4061Q470Q17J4195J119j071
$$ 22297 21978 3023 14542 -2375 -14940 -11501 -41541 -17480 -9010 -8193 6002 7121 6050
22169F050J4956P180j9901r439j3787k35J9312J155J6168k355j8402L2470R225
$$ 6050 21006 28186 8285 -1154 -14941 -15176 4136 5291 21459 19104 702 33172 42397
22156D2397j4158l3196k7178j6516R671j5618l140L1529J1520l25K5632L42q941
$$ 42397 28239 -4957 -32135 -48651 -38980 -54598 -57738 -26209 -14689 -15014 10618 10960 2019
22143B019j9722L552k157J5636r541J7006n793k5569L40J2139K9585k676j3604
$$ 2019 -17703 -14151 -16308 -672 -10213 6793 1000 -24569 -24229 -12090 17495 14819 1215
22130A215n621l488J1074J3838j6973r727P45k7856J4778O108Q444j7338j4935
$$ 1215 -4406 -7894 3180 17018 45 -9682 -8937 -36793 -22015 -15907 -7463 -24801 -39736
22117c9736K9192K0631P999j6519j8897J4901Q123n937j984J5730R340j4877l0463
$$ -39736 -10544 10087 18086 1567 -17330 -2429 5694 -243 -2227 13503 22843 7966 -22497
22104b2497Q053J4973p324j1196J5880o791J7695j0107j7137j7840J9960J4048
$$ -22497 -14444 529 -6795 -17991 -2111 -8902 8793 -1314 -18451 -36291 -16331 -2283
22092b283j4386J1877k752R448j2369J9638j7996k0979J1750J0769R095m736K0760
$$ -2283 -16669 -4792 -7544 1904 -10465 9173 -8823 -29802 -18052 -7283 1812 -2924 17836
22079A7836J6176m633L411p041J7655l212O044j1997k9264k3985R900K502j2518
$$ 17836 34012 29379 32790 25749 43404 40192 46236 34239 4975 -19010 -9110 -6608 -19126
22066a9126L5116M771j3861l5631l8796k563L3085M3980l819R428O535M687j741
$$ -19126 15990 20761 6900 -28731 -67527 -70090 -37005 6975 3156 12584 19119 23806 22065
22053B2065M37L441n216N238r356m486L25k0314J894M4318N7152K478j0565k0756
$$ 22065 22502 25943 20727 25965 16609 12123 12448 -7866 -5972 38346 95498 97976 87411 66655
22039F6655m7544o644k819k9735k1653J959K0284J5019O902K269l2696N401j0676
$$ 66655 19111 12467 9648 -20087 -41740 -39781 -19497 -4478 2424 4693 -28003 -22602 -33278
22026c3278J8368M0560J8369L4028m391m5325l431P972j2545N723k3467o166Q093
$$ -33278 -14910 25650 44019 78047 73656 28331 24900 32872 20327 26050 2583 -3583 4510
22013D510p741J2748Q480n251k9400j2461J1004k891O377k1856j497K6461Q538
$$ 4510 -3231 9517 17997 12746 -16654 -29115 -18111 -21002 -14625 -36481 -37978 -11517 -2979
22000b979Q55J4920J8653k2452O008k58j6911q092k5964L705K5008K9289K3323
$$ -2979 -2124 12796 31449 8997 15005 14747 -2164 -10256 -36220 -32515 -7507 21782 45105
21987D5105l331j6028j234J8051q53k7252l1580l644p336J4076L3564l391P60
$$ 45105 41774 25746 24512 42563 41710 14458 -17122 -20766 -28102 -14026 19538 16147 16907
21974A6907j4813j2351j9983j3284m013J6324J8929q491r169P261L4624J6431
$$ 16907 2094 -10257 -30240 -43524 -47537 -31213 -12284 -20775 -29944 -22683 11941 28372
21962B8372K502k027K0920J6100Q053k9595o297k0955j2549L0066m5348l2807
$$ 28372 30874 28847 49767 65867 73920 44325 38028 17073 4524 34590 -10758 -43565
21950d3565P411J1283J8915J2620o439O832J6649J1968J4030j6044k9154l2184
$$ -43565 -36154 -24871 -5956 6664 225 7057 23706 35674 49704 33660 4506 -27678
21938b7678r415K2086K6788L623k531j2109j7215q54J6237j4236j2494j1356O929
$$ -27678 -37093 -15007 11781 15404 12873 764 -16451 -17305 -1068 -15304 -27798 -39154 -32225
21925c2225p105K6686k3314l778J8834K3473j3351m075M207J2022K153k1751L472
$$ -32225 -39330 -12644 -35958 -39736 -20902 2571 -10780 -14855 -10648 1374 3527 -18224 -14752
21912a4752L679k2505k9128L866M1883J9769k4102n273J4753L8020l849l2111
$$ -14752 -11073 -33578 -62706 -58840 -16957 2812 -21290 -26563 -11810 26210 22361 -9750
21900i750M795J8500k579l1647j3179m46j5081k8732J4274M0422r632Q732J1207
$$ -9750 -4955 13545 10966 -20681 -33860 -34306 -49387 -78119 -63845 -23423 -33055 -24323 -13116
21887a3116q175j3619Q530k822J6002K3044l471j7778m502L3886K5271J7144l670
$$ -13116 -21291 -34910 -26380 -29202 -13200 9844 6373 -11405 -15907 17979 43250 60394 56724
21874E6724k4435Q79l365o583o693o705j6982n0708M41J7015M849L0360J9365
$$ 56724 32289 33168 29803 23220 16527 9822 -7160 -57868 -57427 -40412 -35563 -5203 14162
21861A4162r54J4472P436l4228l8651k0616K2171K4126n764K511K0364R695J3489
$$ 14162 13208 27680 35116 888 -37763 -58379 -36208 -12082 -17846 -15335 5029 14724 28213
21848B8213M1994j3420k4817j4263j2928l9613Q510L4304j4753j4408o721j5956
$$ 28213 70207 56787 31970 17707 4779 -34834 -26324 7980 -6773 -21181 -27902 -43858
21836d3858L91K2249r294n625Q326J3689K0768l198l3134J0902N32P79M107j1876
$$ -43858 -43467 -21218 -30512 -36137 -27811 -14122 6646 3448 -29686 -18784 -18252 -17473 -13366 -25242
21822b5242O1540K5779j7524j1485Q571k3481k2469j3140L7286P097o96M763n651
$$ -25242 36298 62077 44553 33068 41639 18158 -4311 -17451 19835 26932 26236 30999 25348
21809B5348j9145j82J8806M75r747j4284J514K061J5441K1699p207j6583l4441
$$ 25348 6203 6021 24827 25302 15555 1271 2785 4846 20287 41986 34779 18196 -16245
21796a6245J8903J8751j7701n988J7363O514k0353L322l4289l405R358k077K2528
$$ -16245 2658 21409 3708 -2280 15083 21597 1244 4566 -29723 -33128 -23770 -25847 -3319
21783c319j636N309K2593J2942j3670l9947J0911J4205L838J256j5161k1220K0950
$$ -3319 -4955 354 22947 35889 22219 -17728 -6817 7388 11226 12482 -2679 -23899 -2949
21770b949r36K364K253j2998j6562q736J1919K2918k559j9244J0047L8816j1436
$$ -2949 -3885 -1521 732 -12266 -28828 -37564 -25645 -2727 -5286 -24530 -14483 24333 12897
21757A2897l1433n510P674K4364L6415j489l5707j3609J1402L07l7324k3618J6391
$$ 12897 -18536 -24046 -16372 7992 44407 42918 7211 -6398 5004 5311 -32013 -55631 -39240
21744c9240J9642r30K932K4929k3889q920J4843j3188o039M0898K8026j5691k3565
$$ -39240 -19598 -20528 -17596 7333 -16556 -25476 -10633 -23821 -29860 11038 39064 23373 -192
21731a92k9015K8341J0212k4582q89K1244k076k7576m124r921k0254L188L6571
$$ -192 -29207 -866 9346 -15236 -16125 5119 3043 -24533 -28657 -38578 -58832 -55644 -19073
21718a9073K4007K6498l6133p965l857j1309k7171o247L9647l987L944K1844o794
$$ -19073 4934 31432 -4701 -12666 -16523 -27832 -55003 -61250 -21603 -25590 -21646 198 -6596
21705f596j0746N141J1072K5688r176j2951j6363k1448R236K1825J5454k2506
$$ -6596 -17342 -12201 -1129 24559 15383 2432 -13931 -35379 -26143 -4318 11136 -11370
21693a1370o639K3556K462j6892K9375j1934j49l24m250L883O536n122j1690L1180
$$ -11370 -18009 5547 8009 -8883 20492 8558 8409 8085 3835 7718 14254 9132 -2558 28622
21679B8622M153o266l2211m8694l4137M0471K4181J6729q5l100k2099j2418q317
$$ 28622 32775 26509 -5702 -54396 -88533 -48062 -23881 -7152 -7237 -10337 -32436 -44854 -53171
21666e3171p668L5250K4055j8261o643K1535J8328p6k0165J1413K2910J9077M65
$$ -53171 -60839 -25589 -1534 -19795 -26438 -4903 13425 13349 -6816 4597 27507 46584 47049
21653D7049k7687k067L69j2516K6659k6427j3802k03l161j2732K0424L7350k3293
$$ 47049 19362 17295 17664 5148 31807 5380 -8422 -8625 -11786 -24518 -4094 33256 9963
21640I963j8017j2030Q472K2568n903j7156L8727K5442m961m537j7432q746l4792
$$ 9963 -8054 -20084 -11612 10956 5053 -12103 26624 52066 47105 42568 25136 16390 -18402
21627a8402j4458j6571j0822j1090L252K8784m722P225J2343N928m448Q709N705
$$ -18402 -32860 -49431 -60253 -71343 -68091 -39307 -44029 -36804 -24461 -18533 -22981 -14272 -8567
21614h567K9883p348J6206J1233j6018k3913l8614k0358J2878L7719o679q292
$$ -8567 21316 13968 30174 41407 25389 1476 -37138 -57496 -44618 -6899 -13578 -21870
21602b1870K1852L364q582k132J3691J0134j8273m274K0114R928K0762J3918p483
$$ -21870 -18 3346 -5236 -7368 6323 16457 -1816 -6090 14024 23952 44714 58632 51149
21589E1149m3972m709k486L3071J8354j421j9509L2705j9308l4289l2411K0686
$$ 51149 7177 2468 -18 33053 51407 49986 30477 63182 43874 9585 -22826 -2140
21577b140K6839R184O551j3091j0136j4413j3491m369k0260J7937M2879Q799m511
$$ -2140 24699 33883 40434 27343 17207 2794 -10697 -15066 -35326 -17389 25490 34289 29778
21564B9778k5158J950J7936j6134m1697j9109K3616L3833J412J1417j6288K421
$$ 29778 4620 6570 24506 8372 -33325 -52434 -28818 5015 6427 17844 1556 3977
21552C977J549N378J813L6276k0763k4320P34N036j2086o719Q202K3526P883J0821
$$ 3977 5526 10904 12717 48993 28230 3910 4644 9680 -2406 -9125 -923 22603 30486 41307
21538D1307j8365p928N437J6063j1362l936o466L21k017J4268p178j9379l7215
$$ 41307 22942 15014 20451 36514 25152 21216 14750 15071 13054 27322 20144 765 -36450
21525c6450k0135J2318J9206L9728M1219K133m3756l0235J1055L5542j3311k7194
$$ -36450 -56585 -44267 -25061 14667 55886 58019 14263 -15972 -4917 30625 17314 -9880
21513i880m595R57k7026j4989Q275P245J1441J0095p289J1506p901J7063K5519
$$ -9880 -14475 -13518 -40544 -55533 -47258 -40013 -28572 -18477 -25766 -14260 -22161 -5098 20421
21500B0421q916o542m945q584N972K4280m550o569k7699j3601K7004J9750m1696
$$ 20421 11505 4963 18 -8566 -2594 21686 17136 10567 -17132 -30733 -3729 16021 -25675
21487b5675j289O756L4778K0975q837k2699M988q051j941j9272k5196K277J9757
$$ -25675 -26964 -20208 14570 35545 26708 4009 8997 946 -995 -20267 -45463 -43186 -23429
21474b3429m430K4924J7607N862K340R596j9238j9444k4003P645J9010j25K2827
$$ -23429 -27859 -2935 14672 20534 22874 32470 13232 -6212 -30215 -22570 -3560 -3685 19142
21461A9142J3827j6774l7963J925L1171K8336k387j7243j8244L2991j2687l9553
$$ 19142 32969 16195 -21768 -19843 11328 39664 37277 20034 1790 34781 22094 -17459
21449a7459j0660K0989L982r825k0250l5356N846Q344J3877J2674J7914R286k8130
$$ -17459 -28119 -7130 -3148 -12973 -33223 -68579 -62733 -54389 -40512 -27838 -9924 -638 -28768
21436b8768j7782K3678J3555R117j3708j9918l066m77J1277K7784J7506q668L1346
$$ -28768 -46550 -22872 -9317 -200 -13908 -33826 -36892 -37369 -26092 1692 19198 10530 41876
21423D1876n805l1108q900J9553j7140k6667k092J9210K3631j3995m6257j5463
$$ 41876 36071 4963 -3937 15616 -1524 -28191 -30283 -11073 12558 -1437 -47694 -63157
21411f3157J3465j1660r21J396L2467O468j1437K6878J7475o599q023j8717O653
$$ -63157 -49692 -61352 -62273 -60877 -28410 -21942 -33379 -6501 10974 4375 -3648 -22365 -15712
21398a5712J0291L919j006Q504J6837l136j2047m7491k0542O850J8675j5216k757
$$ -15712 -5421 -1502 -2508 5996 22833 19697 7650 -39841 -60383 -53533 -34858 -50074 -52831
21385e2831L5260N893J4445j7068j3244k873M508l933k7827J0478J9312J4653
$$ -52831 -17571 -11678 2767 -14301 -27545 -30418 -25910 -29843 -57670 -47192 -27880 -13227
21373a3227n604K7883K2102J498j5211P130p888j71k5856k4017r310k2850J3312
$$ -13227 -18831 9052 31154 32652 17441 24571 16683 16512 -9344 -33361 -42671 -65521 -52209
21360e2209K5701L9767N152N435l0177l0898j2767L5224K7505J9364M638k9968
$$ -52209 -26508 13259 18411 23846 -6331 -37229 -49996 -14772 12733 32097 36735 6767
21348F767o912J5185J489j7520k92p458J3438N958J2602j648Q007j8295m892j9498
$$ 6767 -145 15040 16529 -991 -1283 -8741 4697 10655 23257 21609 29616 11321 6429 -13069
21334a3069j0139K0473l423O633J6662j7260j0229J3970N248K0497K0479M76k6815
$$ -13069 -23208 -2735 -6158 475 17137 -123 -10352 3618 8866 29363 49842 50318 23503
21321B3503j3555K112J4490j2102n419j444J7499K5240j1775j6468l6069K831
$$ 23503 9948 12060 26550 14448 9029 7585 25084 50324 38549 22081 -13988 -11157
21309a1157K878n029J7019J8277k3661k3775K5890J0761K663j9481k284J0306
$$ -11157 -8279 -13308 3711 21988 -1673 -25448 442 11203 13866 -5615 -7899 2407
21297B407j4616j290K3406q12L223Q359l0277J543j819L137p747j383J2536k2003
$$ 2407 -12209 -13499 9907 9095 12318 20677 -9600 -8057 -9876 -6739 -14486 -15869 -3333 -25336
21283b5336k1074p706L1270K4067J5895j4337m546j6040J5822j0548j8992j2955
$$ -25336 -46410 -54116 -22846 1221 17116 2779 -1767 -17807 -1985 -12533 -31525 -44480
21271d4480O017J484Q999M3548J082j2334j3349j4757K1856l117j40K8835K5266
$$ -44480 -38463 -36979 -27980 15568 16650 4316 -9033 -23790 -1934 -5051 -5191 23644 48910
21258D8910k8502L393J5569q083k1848m560N906m982J8326L4866j1866m2045l354
$$ 48910 20408 23801 39370 31287 9439 4879 10785 5803 24129 58995 47129 5084 1730
21245A730j1697L348L3432k5829k517J1732l3085p746q940p920J0617n272j121
$$ 1730 -9967 -6619 26813 984 -1533 10199 -22886 -30632 -39572 -47492 -36875 -42147 -43268
21232d3268j9752J7175K8331J6884J7554K1511Q319p808O731J2133O568k2087
$$ -43268 -63020 -45845 -17514 -630 16924 38435 46754 38946 45677 57810 64378 42291
21220D2291m0888p051P32J5630L7981J2679M34k3025j6821k2428l2851m076O409
$$ 42291 1403 -5648 -4916 10714 48695 61374 61808 38783 21962 -466 -33317 -37393 -30984
21207c0984K1083N9598P19m3914k3341l252J9576J1269R116J0870l7743p960L880
$$ -30984 -9901 49697 50416 6502 -16839 -20091 -515 10754 19870 30740 -7003 -14963 -11083
21194a1083j2557P928J3446J1916j1392N844M703J8255N396n706M1j7300k8828
$$ -11083 -23640 -15712 -2266 9650 -1742 4102 8805 27060 32456 26750 26791 9491 -19337
21181a9337k6394K5647J2966j8604k1796L7529J0099k6407j0919Q38r857R127
$$ -19337 -45731 -20084 -7118 -25722 -47518 -9989 110 -26297 -37216 -36378 -46235 -37108
21169c7108O236o465k1811j960k062o005K0013K7044j0125L4147k503P134q995
$$ -37108 -30872 -37337 -59148 -61108 -63170 -69175 -49162 -22118 -32243 1904 -599 6535 -2460
21156b460J080p610k0502j9259J1968J0597K8151N652q98M0218K0652j3921J733
$$ -2460 -1380 -8990 -29492 -48751 -36783 -26186 1965 7617 6719 46937 67589 53668 55401
21143E5401m615j1711K380J3168L342q828k6607k4398k4568O818m818k904K1226
$$ 55401 50786 39075 41455 54623 57965 49137 22530 -1868 -26436 -19618 -24436 -27340 -6114
21130f114J0627j590P75K4K9762M134l4675k5841J7034K4941O519J6106k6075
$$ -6114 4513 2923 3698 3722 33484 37618 2943 -22898 -5864 19077 25596 41702 15627
21117A5627k0335R277J0806R56n4722k0853J9662L5587M1266p762l3863k576J6013
$$ 15627 -4708 4569 15375 16331 -38391 -59244 -39582 -3995 37271 29509 -4354 -6930 9083
21104I083k6958J0291k1633j6944j3062j7048j1264R709L52L9455Q191k4035J1818
$$ 9083 -17875 -7584 -29217 -46161 -59223 -76271 -87535 -77826 -77474 -38019 -29828 -53863 -42045
21091d2045J6698K151O467k1608L080L3933l520K4218n02o935Q414j189j790M986
$$ -42045 -25347 -23196 -16729 -38337 -35257 -1324 -4844 19374 18872 11937 20351 19162 17372 22358
21077B2358j7585j8815P85n329L0253L0062l3074k5732K1737L1720j546j3450
$$ 22358 4773 -14042 -13257 -18586 11667 41729 8655 -17077 4660 36380 34834 21384
21065B1384r190k5878N074M493K1175M0430L202k9524l0531n440k0234q300L2277
$$ 21384 12194 -13684 -8610 -4117 17058 57488 60690 31166 635 -4805 -25039 -33339 -1062
21052a062K1727O009k5093J3413r2k5492J322J3110o743n279K2099M8140k2113
$$ -1062 20665 26674 1581 14994 14902 -10590 -9268 3842 -2901 -8180 13919 62059 39946
21039C9946k8506k6084n620J6061J2935j617j2804P134j1012q862l899j9137J3015
$$ 39946 11440 -14644 -20264 -4203 8732 7115 -5689 1445 -9567 -18429 -22328 -41465 -28450
21026b8450J0482J1151k3006O086N164l361q908N506j386R284m624J6793J1442
$$ -28450 -17968 -6817 -29823 -23737 -18573 -21934 -30842 -25336 -26722 -17438 -22062 -5269 6173
21013F173M277j7578J7404q716Q36K678l2207o335j6971K3880Q309J5645P107
$$ 6173 10450 -7128 10276 1560 2396 5074 -27133 -33468 -50439 -26559 -18250 -2605 4502
21000D502p789l2738k1791M117J7378J3954m103j099K7391J9071l7611k7984J5649
$$ 4502 -3287 -36025 -57816 -53699 -36321 -22367 -26470 -27569 -178 18893 -18718 -46702 -31053
20987c1053J2903o004J0376p499J2300J4444j3048J4094j3114k3753P562j061
$$ -31053 -18150 -24154 -13778 -21277 -8977 5467 -7581 6513 -6601 -30354 -22792 -23853
20975b3853o725J6463l70l1905K0878J9065J7145q849o841R859l3086J0380K1544
$$ -23853 -30578 -14115 -14485 -46390 -25512 -6447 10698 1849 -4992 4867 -28219 -17839 3705
20962C705k5768k6925k9693L1594J1612O591K6869L2j7408p747j0829N012K703
$$ 3705 -22063 -48988 -78681 -47087 -35475 -28884 -2015 -1983 -19391 -27138 -37967 -32955 -30252
20949c0252j2613k0537o559K1236K7371j233j319k5069L540m189M3308K9886J2799
$$ -30252 -42865 -63402 -69961 -48725 -21354 -22587 -23906 -48975 -45435 -49624 -6316 23570 36369
20936C6369j2521m2388N513K225k8145j6952K943K315J4968J9655L465K375J7365
$$ 36369 23848 -18540 -13027 -10802 -38947 -55899 -52956 -50641 -35673 -16018 -12553 -10178 7187
20923G187J2928J2637k7899k2048j1533R624J7515r036J94k4250N133M5434m22
$$ 7187 20115 32752 4853 -17195 -28728 -19104 -1589 -10625 -10431 -34681 -29548 15886 15464
20910A5464q795J8403L339j0815m8766J7231O976M694K4450j4954K5832J5506
$$ 15464 6669 25072 28411 17596 -31170 -13939 -6963 -2269 22181 7227 33059 48565
20898D8565j3179k106q004j9968K366q50Q077j9881m2043J4568J2271K436j1794
$$ 48565 35386 33280 25276 5308 7674 6824 14901 -4980 -47023 -32455 -20184 -17748 -29542
20885b9542K6240Q676R463j07k3888j3114m856p260K228J0309P245j5675P844
$$ -29542 -3302 5374 14837 14730 -9158 -22272 -27128 -34388 -32160 -21851 -14606 -30281 -22437
20872b2437J3662R783K2520l2949p712l0389J0879L0449j1924L1103j3069o932
$$ -22437 -8775 1008 23528 -9421 -17133 -47522 -36643 -6194 -18118 12985 -84 -7016
20860g016K3507q049o794J9257n82j3705k9082m2866k0555K8597J4084n184J078
$$ -7016 16491 8442 1648 20905 20323 6618 -22464 -65330 -85885 -57288 -43204 -48388 -47310
20847d7310K6666K2733j263j1233M741J780k0041j2533M445j5925K7325L9867
$$ -47310 -20644 2089 826 -10407 -5666 -3886 -23927 -36460 -32015 -47940 -20615 19252
20835A9252j9341O741R204P432q152j7569J5971R87K3178L927m7226k691J7192
$$ 19252 -89 6652 15856 23288 15136 -2433 13538 14525 37703 41630 -5596 -8287 8905
20822H905k218k0163K0408J1942k3516l6041o431Q068k803J0530O439J6879Q21
$$ 8905 6687 -13476 6932 18874 -4642 -40683 -47114 -39046 -41849 -31319 -24880 -8001 -7180
20809g180J1984N833j647j5608j9744k2635p804J5514M7506L4224Q206j3071j0295
$$ -7180 4804 10637 8990 -6618 -26362 -48997 -56801 -41287 6219 40443 48649 35578 25283
20796B5283j2631L036J0410n86K465m241j0819j5202j6443K5062N944O871k0408
$$ 25283 12652 15688 26098 25512 27977 23736 12917 -2285 -18728 6334 12278 19149 -1259
20783a259k0764R63K6531J4417K5242k351k0660r974J0506J9k1959J1021q0k2808
$$ -1259 -22023 -21060 5471 19888 45130 42779 22119 12145 22651 22670 711 11732 11652 -11156
20769a1156p654J7671K0583k8978j7874l171P2445J9779m1462m283J9172J2772
$$ -11156 -18810 -1139 19444 -9534 -27408 -30579 41866 61645 20183 15900 35072 47844
20757D7844l1174k6287K900L7561o159l9437j0292J5698n670j0510J6421Q457
$$ 47844 16670 -9617 -6717 30844 24685 -14752 -25044 -9346 -15016 -25526 -9105 -648
20745f48j3749J1701K0671n052k3936j1468K0310j2184j880L6328j0032j853R513
$$ -648 -14397 -2696 17975 12923 -11013 -22481 -2171 -14355 -16235 20093 10061 8208 17721
20732A7721J772k1680m319l027o348l5055k7461L1351L7225j5851o983K6383j0291
$$ 17721 19493 -2187 -6506 -9533 -15881 -50936 -78397 -47046 -9821 -25672 -32655 -6272 -16563
20719a6563k0069K785K1105j6740j3859j4142J325K163j991o088J9036J7191K1257
$$ -16563 -36632 -33847 -12742 -29482 -43341 -57483 -56158 -53995 -55986 -62074 -43038 -25847 -4590
20706d590Q040J1005K286R9l9940k4365K2184P728J5718l076j3388R823j7062
$$ -4590 3450 14455 16741 16840 -23100 -47465 -25281 -17553 -1835 -4911 -18299 -8476 -25538
20693b5538Q014J4930j4506q246J124J7615j6001j8753K0199J3657K7849n803
$$ -25538 -17524 -2594 -17100 -25346 -24222 -6607 -22608 -41361 -21162 -7505 20344 14541
20681A4541k6502p594O192j3073j6529j2128N739J2856J6830O952L2925J4294
$$ 14541 -11961 -19555 -13363 -26436 -42965 -55093 -49354 -36498 -19668 -12716 20209 34503
20669C4503m5949k5319J2871n71k288k4956n007K7140M5381p12r129m214L231
$$ 34503 -11446 -36765 -23894 -24465 -26753 -51709 -56716 -29576 15805 15093 5964 1750 4981
20656D981J0963N873K381j5964R734o013J4466L1728l997m356j3164k6338l009
$$ 4981 15944 21817 24198 8234 17968 11955 26421 58149 54152 49796 36632 10294 7285
20643G285l617r341N141j2486l1573K1009K9317M847M724o537j0372j7164m471
$$ 7285 3668 -5673 -532 -13018 -44591 -23582 5735 10582 15306 8769 -1603 -18767 -23238
20630b3238j660J7677J5367j813m915m176K4897R73n040K862k7304k1268k5668
$$ -23238 -24898 -7221 8146 6333 1418 -2758 22139 23112 18072 20934 -6370 -27638 -53306
20617e3306J0093J6370L7442K4976m353J6316L907l154l9232n302m038l185O530
$$ -53306 -43213 -26843 10599 35575 31222 47538 51445 48291 9059 3757 -281 -3466 3064
20604C064Q930J2965j1599j1887j5717k001p705lJ3837K1511K794j8339l975R37
$$ 3064 11994 24959 13360 1473 -14244 -16245 -23950 -23953 -10116 11395 14189 -4150 -8125 -7188
20590g188j6617K7481N715k8219Q763j5977p431J1964J7717q844l2754J9290K2493
$$ -7188 -23805 3676 9391 -18828 -10065 -26042 -33473 -21509 -3792 -12636 -45390 -26100 -3607
20577c607m07J6006J3378m145M097l564j0377p573O707J4903K1412j0632k8760
$$ -3607 -4014 11992 25370 21225 25322 21758 11381 3808 10515 25418 46830 36198 7438
20564G438k4675q965j0671j1997j7718N018J7932K7251O548j0992J8435K1950
$$ 7438 -17237 -26202 -36873 -48870 -66588 -61570 -43638 -16387 -9839 -20831 -2396 19554
20552A9554l3940K7820L9164k9764q032K3618j5982l2021j0093L0714O923j0540
$$ 19554 -14386 13434 52598 22834 14802 38420 22438 -9583 -19676 11038 17961 7421
20540G421L860J0704j7099q178j7905J3706L4478M595j4985J734R282j8567r550
$$ 7421 11281 21985 4886 -3292 -21197 -7491 26987 31582 16597 18331 27613 9046 -504
20527e04j0893J6465J4393o96p138O392J02j3929l280J43K8434K1914l7331k3726
$$ -504 -11397 5068 19461 18765 11627 18019 18121 4192 912 1055 29489 51403 14072 -9654
20513i654K9756j1034K5524L6631J2177n809n0236m482Q331j7735l234l6699j2743
$$ -9654 20102 9068 34592 71223 83400 77591 27355 22873 31204 13469 10235 -26464 -39207
20500c9207R514k1372K6705J2682K4019l563K1651l553J4344k4100j0875j202
$$ -39207 -29693 -51065 -24360 -11678 12341 8778 30429 26876 41220 17120 6245 5043
20488E043j2441m6358J7153J9060P003K2069j3740j5505L564k831M038P973J636
$$ 5043 -7398 -53756 -36603 -17543 -10540 11529 -2211 -17716 -14152 -16983 -12945 -4972 -3336
20475c336N955p165J7998o658Q968J1619j5199O443k1220K4428J0838k0647m0380
$$ -3336 2619 -4546 13452 6794 15762 27381 12182 18625 -2595 21833 32671 12024 -28356
20462b8356J348K3013K9789j57j3994Q263j1296K9594r031j3029O055k0987n418
$$ -28356 -27008 -3995 25794 25637 11643 19906 8610 38204 29173 16144 22199 1212 -4206
20449d206j3232J1625r243K595J3153k4450J1803K9222J275k176l5336l6526K4009
$$ -4206 -17438 -5813 -15056 -12461 692 -23758 -11955 17267 18542 16366 -18970 -55496 -31487
20436c1487K7485K0695j0312K55J4415R158n883k2461N945L439P315J0200M805
$$ -31487 -4002 16693 6381 6636 21051 30209 24326 1865 7810 11249 18564 28764 33569
20423C3569n538m699J0002k3406j8354o892o384j761j0267p586L4059Q026k1332
$$ 33569 28031 23332 33334 9928 -8426 -15318 -21702 -23463 -33730 -41316 -7257 769 -20563
20410b0563j1783K6526K8154n371k248N767q771Q347P584j0001P944p923J7692
$$ -20563 -32346 -5820 22334 16963 14715 20482 11711 20058 27642 17641 25585 17662 35354
20397C5354P295J2864L447k9872n5933l254L1813Q711q479Q037J0354J0667r419
$$ 35354 42649 55513 58960 29088 -26845 -30099 1714 10425 1946 9983 20337 31004 21585
20384B1585R564j6211K721O763j0021k6406J2613q681L29J1443j164O732R545
$$ 21585 31149 14938 17659 24422 14401 -12005 608 -8073 -7744 3699 2535 9267 18812
20371A8812K0233l5856o192j4015k4799O856J3258L8838J7574O698r445p644j2602
$$ 18812 39045 3189 -3003 -17018 -41817 -34961 -21703 17135 34709 41407 31962 24318 11716
20358A1716j5462q675l317k1433j0631R914K0815J1624K775l547P938J4552k6192
$$ 11716 -3746 -12421 -15738 -37171 -47802 -37888 -17073 -5449 -2674 -6221 1717 16269 -9923
20345i923j0165J4311K7846k7039j7606j7311M4681L3701l5096J3786M304j5956
$$ -9923 -20088 -5777 22069 -4970 -22576 -39887 4794 38495 3399 17185 21489 5533
20333E533j6951J5615R302k1847k6208j5955J8116M976n170j4291J985M0048M1051
$$ 5533 -11418 4197 13499 -8348 -34556 -50511 -32395 -27419 -32589 -46880 -44895 -4847 36204
20320C6204L3547k6085m355P484O666J404P757l1820J4583o977k6907j9370J3923
$$ 36204 69751 43666 39311 46795 53461 54865 62622 30802 45385 38408 11501 -7869 6054
20307F054r831J5596K1915j2650R37l0197j4205j4898N551R552R418R87J5309
$$ 6054 -3777 11819 33734 21084 22021 -8176 -22381 -37279 -31728 -22176 -12758 -11771 3538
20294C538p194J0048k7057l450n948k3173L0441L6494J8492r402j9657J423n595
$$ 3538 -3656 6392 -20665 -24115 -30063 -53236 -22795 13699 32191 22789 3132 4555 -1040
20281a040J040L537J0207o10O955P815N387J2265K292k6665l9589j9333N56L4773
$$ -1040 0 3537 13744 13134 20089 27904 33291 45556 47848 21183 -18406 -37739 -37183 -2410
20267b410J3119K773N578r118j4021J8125J7606O968j7200L039J6952J7134M902
$$ -2410 10709 13482 19060 9942 -4079 14046 31652 38620 21420 24459 41411 58545 63447
20254F3447m3399m2880j5665J5447K5246k1186j7482K055K9199O858N819M366
$$ 63447 20048 -22832 -38497 -23050 2196 -18990 -36472 -34417 -5218 1640 7459 11825
20242A1825j7315l5453J3556L3946M681L510L038j853j0114N007J9499o190r921
$$ 11825 -5490 -40943 -27387 6559 11240 14750 17788 15935 5821 10828 30327 24137 14216
20229A4216k3026k853K341K961J0328K190k6139l8720J2042M2693J2729Q764q457
$$ 14216 -8810 -11663 -9322 -6361 3967 6157 -19982 -58702 -46660 -3967 8762 17526 9069
20216I069k3212J4254m998k0065K4502J1513l1900o071J2275M7172L2174K30m9040
$$ 9069 -14143 111 -4887 -24952 -450 11063 -20837 -26908 -14633 32539 64713 64943 15903
20203A5903k4124j148l1284o431J4540K7595K125J4048K1277P459R855K0227j6744
$$ 15903 -8221 -9369 -40653 -47084 -32544 -4949 -2824 11224 32501 39960 49815 70042 53298
20190E3298n29k2150k1015j9132J4545J5898J8894q655j5786k9318L5472J0203
$$ 53298 52769 30619 9604 -9528 5017 20915 39809 31154 15368 -13950 21522 31725
20178C1725Q342J5908n544m0241l5431K0930K3557r090j4715K3244p079N109J2651
$$ 31725 40067 55975 50431 10190 -25241 -4311 19246 10156 -4559 18685 11606 16715 29366
20165B9366j1459L503K0034J839K172j5491k8087j6523K2459J1725j2992P789
$$ 29366 17907 21410 41444 43283 45455 29964 1877 -14646 7813 19538 6546 14335
20153A4335M770J462k500K1579m417m116K978O962K044k3147k1502j5537K9610
$$ 14335 19105 20567 18067 39646 35229 31113 34091 41053 43097 19950 -1552 -17089 12521
20140A2521L0939k3807m2526o924L2487J0667K1592o036j81l80Q845N484l3198
$$ 12521 43460 19653 -22873 -29797 2690 13357 34949 28913 28732 28352 37197 42681 9483
20127I483k9728J9490L851j953Q460k969L229J9372M054m0339q057K300j64j1725
$$ 9483 -20245 -755 3096 1143 9603 6634 9863 29235 33289 -7050 -15107 -12807 -12971 -24696
20113b4696j5563J9296M1915L3709k227n264m686l9924k910J0952j4296j7290
$$ -24696 -40259 -20963 20952 54661 52434 47170 42484 2560 -350 10602 -3694 -20984
20101b0984q350k397O445J6994K3020L4343k217l5663o436J882J0013L980j959
$$ -20984 -29334 -31731 -25286 -8292 14728 49071 46854 11191 4755 6637 16650 20630 18671
20088A8671j4435l3600qL1034M0039L72l9965l2943k5654k131P6800L630o945
$$ 18671 4236 -29364 -29372 1662 41701 42073 2108 -30835 -56489 -58620 18180 21810 14865
20075A4865j1783j3576K4547J9088m584J5803O74j1224l1845J489K8459L023O796
$$ 14865 3082 -10494 14053 33141 28557 44360 45034 33810 1965 3454 31913 34936 41732
20062D1732L297j7619Q645J4292k0393k4267Q165J3943N399K79k0727R076j9058
$$ 41732 45029 27410 36055 50347 29954 5687 13852 27795 33194 33473 12746 21822 2764
20049B764J2602K3829m424k8755K202K2010K3687M295m820N22j5532j4261k5753
$$ 2764 15366 39195 34771 6016 8218 30228 53915 58210 53390 53912 38380 24119 -1634
20036a634K2798L075J5472p95r352o934j2964k4923M933M2560k0364r507J7988
$$ -1634 21164 24239 39711 38916 29564 22630 9666 -15257 -10324 32236 11872 2365 20353
20023B0353k3275l5442Q226l3310q656K6576L2206P335L8980m589k5355o953J2975
$$ 20353 -2922 -38364 -30138 -63448 -72104 -45528 -13322 -5987 32993 28404 3049 -3904 9071
20010I071J9975K2075J6031k4961k4863J0740K1530n231l2067r465r450j4572
$$ 9071 29046 51121 67152 42191 17328 28068 49598 44367 12300 2835 -6615 -21187
19998b1187J8672j5903p082K5895P312j0964j2875J5767L067n153J7280K4959
$$ -21187 -2515 -18418 -25500 395 7707 -3257 -16132 -365 2702 -2451 14829 39788
19986C9788K119j9024j784j020k6822l7520J782O0519M337K327M882o418k0596
$$ 39788 41907 22883 21099 20079 -6743 -44263 -42481 18038 22375 24702 29584 23166 2570
19973B570q990j007o824O94l954k4596L876n2299k6015M4419M7239L5588J775
$$ 2570 -6420 -7427 -14251 -13557 -17511 -42107 -38231 -90530 -116545 -72126 -24887 10701 12476
19960A2476J5501j5552j0241N528N583j9616j5538J2327o735Q481M289k0203L6530
$$ 12476 27977 12425 2184 7712 13295 -6321 -21859 -9532 -16267 -7786 -3497 -23700 12830
19947A2830K2070o193r206N90p171r508m356j0075l557K3630J2749k2251j0629
$$ 12830 34900 28707 19501 20091 12920 3412 -944 -11019 -14576 9054 21803 -448 -11077
19934a1077k0179j9820K7448M5925r471j9729J2214J7050j3768k575k40l0006
$$ -11077 -31256 -51076 -23628 22297 12826 -6903 5311 22361 8593 6018 5778 -24228
19922b4228o159J9054r706r782K6875k1126k7142n34p027J7739L4494j736K767
$$ -24228 -30387 -11333 -21039 -30821 -3946 -25072 -52214 -52748 -59775 -42036 -7542 -9278 -6511
19909f511J7623J0813m065j0462j3633p188K398Q267k4770k15J1231P164j751
$$ -6511 11112 21925 17860 7398 -6235 -13423 -11025 -2758 -27528 -27743 -16512 -9348 -11099
19896a1099L15J3144L1289K3292J0507l3627l2050k5348J8338L3347k649k0064
$$ -11099 -10784 2360 33649 56941 67448 33821 1771 -23577 -5239 28108 25459 5395
19884E395k8829m057L921p302J7822L153O241K1236k3424P79J8930k533K0572
$$ 5395 -23434 -27491 -23570 -30872 -13050 -9897 -3656 17580 -5844 -5065 13865 11332 31904
19871C1904O548l3309q299J6296J9604j6260O698P646j1702k4461J7023n664M41
$$ 31904 38452 5143 -3156 13140 32744 16484 23182 30828 19126 -5335 11688 6024 6465
19858F465k402K2679j9284J1851J24K372J5147n935L710L903n330j613q685O812
$$ 6465 4063 26742 7458 19309 19433 21805 36952 31017 34727 38630 33300 31687 23002 29814
19844B9814J7374l393k8354n01L042K994l509K06N363J4689L5980K3247k8316
$$ 29814 47188 43795 15441 14940 17982 20976 17467 17673 23036 37725 73705 96952 68636
19831F8636m6183J4691O854l7474k0309n338J1072J3419P999Q384L498J534L8386
$$ 68636 22453 37144 43998 6524 -13785 -19123 -8051 5368 13367 21751 25249 26783 65169
19818F5169J8847P28l5321P961m935k767o318j50j6830k7902j8879K1731J7617
$$ 65169 84016 84744 49423 57384 52449 49682 43364 43214 26384 -1518 -20397 1334 18951
19805A8951k1946K1032K3842j814j4426k5544k4034L8865L5045j2012J6770j4531
$$ 18951 -2995 18037 41879 40065 25639 95 -23939 14926 49971 37959 54729 40198
19793D0198J0937n514j0446k2930q205M7L546j3458K5841K2276K5570n512Q94
$$ 40198 51135 45621 35175 12245 4040 4087 7633 -5825 20016 42292 67862 62350 63244
19780F3244k5381J0936j1131j9407p243m160o499K0201L1272K3285o187j8598
$$ 63244 37863 48799 37668 18261 11018 6858 359 20560 51832 75117 68930 50332
19768E0332p258R707O808k904m3882l8443j175J9948l93J8628M482p501N827N916
$$ 50332 43074 52781 59589 56685 12803 -25640 -26815 -6867 -7260 11368 15850 8349 14176 20092
19754B0092j1744R595K4519j239r164p203j5389L509J0653j7291j1639K6551o111
$$ 20092 8348 17943 42462 41223 32059 24856 9467 12976 23629 6338 -5301 21250 15139
19741A5139L749j0608M103p609J7868m702m414J8521P295j4685j36P797O356k1066
$$ 15139 18888 8280 12383 4774 22642 17940 13526 32047 39342 24657 24521 32318 38674 17608
19727A7608k0227k2131K4198L3962J8018K908o04n407o663l2250j7397j0503K5335
$$ 17608 -2619 -24750 -552 33410 51428 54336 53732 48325 41662 9412 -7985 -18488 6847
19714F847J1263j9007j55J9928J1747k1651J358J7754j6095r46N3097j3236j6194
$$ 6847 18110 -897 -1052 18876 30623 8972 10330 28084 11989 11043 64140 50904 34710
19701C4710m287J4376j5102J3116J2243K1426l762r170k8455j7774J413J5566
$$ 34710 30423 44799 29697 42813 55056 76482 72720 63550 35095 17321 18734 34300
19689C4300n394j6662j224K097P667J8008j587k990J7959k6527l686J9641N643
$$ 34300 28906 12244 11020 13117 20784 38792 37205 34215 52174 25647 21961 41602 47245
19676D7245l4651K3807q133p895o293L893J0819k0285j3412o64j3176J9785K6665
$$ 47245 12594 36401 28268 20373 14080 17973 28792 8507 -4905 -5569 -18745 1040 27705
19663B7705L2258M437r953j851k3152j8058K6080L7464J0539l3793j1685R002
$$ 27705 59963 64400 54447 52596 29444 11386 37466 74930 85469 51676 39991 48993
19651D8993N142k4121o58j8076k937J6328o956J4831Q538j5900L8486K3131l2978
$$ 48993 54135 30014 29356 11280 8343 24671 17715 32546 41084 25184 63670 86801 53823
19638E3823K291q419n402p202j0220n824M2994k2024m7260j6082k4143M504J0158
$$ 53823 56114 47695 42293 35091 24871 19047 62041 40017 -7243 -23325 -47468 -42964 -32806
19625c2806j368N609N740Q292J8759J1758J2328J1912J3098o173j815n725l1366
$$ -32806 -34174 -28565 -22825 -14533 4226 15984 28312 40224 53322 47149 45334 39609 8243
19612H243l400L0946R948j8000L027q055k2677J6017K5583j7286K3094r155j4023
$$ 8243 4843 35789 45737 27737 30764 22709 32 16049 41632 24346 47440 38285 24262
19599B4262L211J8421R820k5661j1496M185J5684m2069j7013N461O575R388k9970
$$ 24262 27473 45894 55714 30053 18557 22742 38426 -3643 -20656 -15195 -8620 768 -29202
19586b9202j3562K531L1968r520j0221J1174j4078o079L0687M0312L5615j9271
$$ -29202 -42764 -40233 -8265 -17785 -28006 -16832 -30910 -36989 -6302 34010 69625 50354
19574E0354j4773m065J7355j2326m613M028O976m730j2401l6158n520J9052K6631
$$ 50354 35581 31516 48871 36545 31932 35960 42936 38206 25805 -10353 -15873 3179 29810
19561B9810J249l3107J9299R890l466j4124J1593K1334j8492K55P999L1962M4783
$$ 29810 31059 -2048 17251 27141 23675 9551 21144 42478 23986 24241 32240 64202 108985
19548A08985N456j7589l4669k0374L5980J0272k1274j3110j9320j0340j279J350
$$ 108985 114441 96852 62183 41809 77789 88061 66787 53677 34357 24017 22738 24088
19536B4088L83J267K2512j1410j8663k8131j28J9261L0923j571j5051k0724N938
$$ 24088 24471 25738 48250 36840 18177 -9954 -10082 9179 40102 38531 23480 2756 8694
19523H694J767J8439K5967j7627j4214j9999J4940R709J881P559l68k1128k1506
$$ 8694 10461 28900 54867 37240 23026 3027 17967 27676 29557 37116 36748 15620 -5886
19510e886N233k2928J4626M8896L3503K2727k0252l3444p969j8699J5661o214
$$ -5886 -653 -23581 -8955 39941 73444 96171 75919 42475 34506 15807 31468 25254
19498B5254J6647K0269K1296k7501k1566j5023l0939O928L0002L1472K0755l5035
$$ 25254 41901 62170 83466 55965 34399 19376 -11563 -4635 25367 56839 77594 42559
19486D2559p530N520J7655P17R998J4792k2734j8217j3411j8477N49l155J9170
$$ 42559 35029 40549 58204 58921 68919 83711 60977 42760 29349 10872 11421 8266 27436
19473B7436J7229m162j4624j4970l073k363L0051J9066J4255r727M169P052l0607
$$ 27436 44665 40503 25879 10909 7836 5473 35524 54590 68845 59118 63287 70339 39732
19460C9732j3900K5546P449p492k1598M859M4238R287N385P059M498L563j770
$$ 39732 25832 51378 58827 51335 29737 34596 78834 88121 93506 100565 105063 108626 106856
19447A06856J801R918Q4450J40530J60299L7085r6059j19966q3491n5602j514
$$ 106856 108657 118575 203025 343555 503854 540939 444880 324914 241423 185821 184307
19436A84307p278m1577k3474j5302j6645j4980J3952j1804q807Q861r028m198
$$ 184307 177029 135452 111978 96676 80031 65051 79003 67199 58392 67253 58225 54027
19424E4027j4191M900q141M724q492k7343L094L0549J7653l273k5344j1299N128
$$ 54027 39836 44736 36595 41319 32827 5484 8578 39127 56780 53507 28163 16864 21992
19411B1992K2805J5645j3036j4507J3497J1214L886J4715K0490p226k925k267
$$ 21992 44797 60442 47406 32899 46396 57610 61496 76211 96701 89475 86550 84283
19399H4283j6737l3333p319k1719J3732J2337K4399K4277N358M445r966l835k889
$$ 84283 67546 34213 26894 5175 18907 31244 55643 79920 85278 89723 79757 75922 73033
19386G3033n23l5122O308J6049j42k1738j0997J7786K181J7606O545J555O861
$$ 73033 72510 37388 43696 59745 59603 37865 26868 44654 46835 64441 70986 72541 79402
19373G9402l433K7408M726l7132k1969q320j6064L3434K3469J8213O445j7224
$$ 79402 75969 103377 108103 70971 49002 40682 24618 58052 81521 99734 106179 88955
19361H8955J869M1236j9659m5963j6336j1747k4699M3721L571l103K1871K7148
$$ 88955 90824 132060 112401 66438 50102 38355 13656 57377 60948 57845 79716 106864
19349A06864j2262k7591m2352o265j356Q976p218k6489l2318J6319m454K2114
$$ 106864 94602 67011 24659 18394 17038 26014 18796 -7693 -40011 -23692 -28146 -6032
19337f032K1643J9320Q365r458n960J5562L2746L867l2235j7315L0327K0705k2636
$$ -6032 15611 34931 43296 33838 27878 43440 76186 80053 47818 30503 60830 81535 58899
19324E8899J3432K7661J8410k239l3100o091k2234j6877K1383R463K3234R828
$$ 58899 72331 99992 118402 116163 83063 76972 54738 37861 59244 68707 91941 101769
19312A01769m269J3694K7035n1679n5256r162M515Q451N8634M8282k8552l9320
$$ 101769 97500 111194 138229 86550 31294 22132 26647 35098 93732 142014 113462 74142
19300G4142k8469n367K3245Q648j0807k3995j5277J6504J9575K1196j6225m9304
$$ 74142 45673 40306 63551 72199 61392 37397 22120 38624 58199 79395 63170 13866
19288A3866n405L17K2542M1807n595j9248j740M466j7616L372K5414o032j0512
$$ 13866 8461 8778 31320 73127 67532 48284 46544 51010 33394 36766 62180 56148 45636
19275D5636K811J8479O276m625J0706j8728m231L494L7285p03q003P996m421j2426
$$ 45636 48447 66926 73202 68577 79283 60555 56324 59818 97103 96400 88397 96393 91972 79546
19261G9546L101L6335Q208j0884m285n10j8526q477l2110K3440K5654J5929k6642
$$ 79546 82647 118982 127190 116306 112021 111511 92985 84508 52398 75838 101492 117421 90779
19248I0779m9624k3738J3379O845M0700K3291l3790q110L6165O345j1502j1015
$$ 90779 41155 17417 30796 37641 78341 101632 67842 59732 95897 102242 90740 79725
19236G9725K9015l979m7023K512K9199N753o922Q518k7894n390m256J9174K7320
$$ 79725 108740 104761 57738 60250 89449 95202 88280 96798 68904 63514 59258 78432 105752
19223A05752j2139K6916J5298M259K0798M148J5108r671k8765j8031N964L0431
$$ 105752 93613 120529 135827 140086 160884 165032 180140 170469 141704 123673 129637 160068
19211A60068J2012L1319L0975J4293J8106M1622O1101P4414Q7220J43670J22087
$$ 160068 172080 203399 234374 248667 266773 308395 369496 443910 531130 674800 796887
19200G96887J41409J23257R2225k2529j29435j41164j06111p5083q1811j4875
$$ 796887 938296 1061553 1153778 1131249 1001814 860650 754539 679456 597645 582770
19190E82770l3592n3339j4404j1723j8007K1205M0412M1803J8773P3714J01869
$$ 582770 549178 495839 481435 469712 451705 472910 513322 555125 573898 647612 749481
19179G49481R5751J35413J41725J22195O1297k8786j31494j60483j63848j09350
$$ 749481 845232 980645 1122370 1244565 1305862 1277076 1145582 985099 821251 711901
19169G11901q0398o7766o0783m4320k9991n7325l7870L276l1706m0219J739j343
$$ 711901 631503 563737 502954 458634 428643 371318 333448 336724 305018 264799 266538 265195
19157B65195j8000q812M409k9280K6161K0787J4115J782N449p168M25k1926j1146
$$ 265195 247195 238383 242792 213512 239673 260460 274575 276357 281806 274638 275063 253137 241991
19144B41991J5550k3374j199n996l8560j4534l598K5532m99L8307L6469k4925
$$ 241991 257541 234167 232968 226972 188412 173878 170280 195812 195313 233620 270089 245164
19132B45164k571L6280L5532M3127K9162j2560o2001n5758m3930k4441l1850j0474
$$ 245164 242593 278873 314405 357532 386694 374134 312133 256375 212445 188004 156154 145680
19120A45680j3779K1483K6486j6200m0569J5817K1024J6364K7526j804k639k8140
$$ 145680 131901 153384 179870 163670 123101 138918 159942 176306 203832 202028 199389 171249
19108A71249k4341L825J3512K9061l657L143k5421m784J8380P174O866j6942n245
$$ 171249 146908 150733 164245 193306 189649 192792 167371 162587 180967 188141 195007 178065 172820
19095A72820j4896P201k2537Q295N432l267j7693J6792L4233P536K5764N390l9983
$$ 172820 157924 165125 142588 150883 156315 153048 135355 152147 186380 193916 219680 225070 185087
19082A85087j1800l659q717k0130p732p730J0792J2051J3662j2772m292J9196
$$ 185087 173287 169628 160911 140781 133049 125319 136111 148162 161824 149052 144760 163956
19070A63956M635j658k60l4298j205K982j2515j120J7184L847j445j3148K1016
$$ 163956 168591 166933 166673 132375 131170 134152 121637 120517 137701 141548 140103 126955 147971
19057A47971j8305k672J0021p329j4028J0019j0493L1346J8588J0971j3589j5896
$$ 147971 129666 126994 137015 129686 115658 125677 115184 146530 165118 176089 162500 146604
19045A46604l0576p659O159j6851J4542o704O987J6360j0400J991Q082K0041l3168
$$ 146604 116028 108369 114528 97677 112219 105515 112502 128862 118462 120453 128535 148576 115408
19032A15408o274K5140K9730P762j1075o256R273J0242n478q807k4304J4305K0929
$$ 115408 109134 134274 164004 171766 160691 154435 163708 173950 168472 159665 135361 149666 170595
19019A70595P427l4113m6242l2734J87k088p308K5858M5844K932k8209k1567M2729
$$ 170595 178022 143909 97667 64933 65120 63032 55724 81582 127426 130358 102149 80582 123311
19006A23311M0692k781j3319j3578l774L848m1596Q271L6608K6148j1361J8009
$$ 123311 164003 161222 147903 134325 130551 134399 92803 101074 137682 163830 152469 170478
18994A70478j1452k2827l5852m9669m276L3650O444l43J8873K4680O09q629j4948
$$ 170478 159026 136199 100347 50678 46402 80052 86496 86153 105026 129706 130315 121686 106738
18981A06738j1808j183n61n39J4713L773Q952j0075J981K3555J4337J5157k551
$$ 106738 94930 93747 93186 92647 107360 111133 120085 110010 111991 135546 149883 165040 162489
18968A62489k163M447j530J5816K8016Q757O056l4087k8789K2564k8055m0056
$$ 162489 160326 164773 163243 179059 207075 215832 221888 187801 159012 181576 153521 113465
18956A13465L378J8368J9419p81J2511k991j0462p207J8277N665J9689J3941K8595
$$ 113465 116843 135211 154630 153849 166360 163369 152907 145700 163977 169642 189331 203272 231867
18943B31867L844K0259l390k1600k6021j8150k3373m1668M296j9371K0526P091
$$ 231867 235711 255970 252580 230980 204959 186809 163436 121768 126064 106693 127219 134310
18931A34310q177k1993j768M2245K4166N525j945J8735r258r991J0004K3791Q83
$$ 134310 126133 104140 102372 144617 168783 174308 172363 191098 181840 171849 181853 205644 206527
18918B06527k8031l984J3389K756J6090p331j2793j4046j6931j795L0889r194
$$ 206527 178496 174512 187901 190657 206747 199416 186623 172577 155646 153851 184740 175546
18906A75546N12O328L4819N400p198o821k2788j743j5073O111J5840P000J4646
$$ 175546 176058 182386 217205 222605 215407 208586 185798 184055 168982 175093 190933 197933 212579
18893B12579K4905J7899j6294l1557N962J920n691j6675J324m079J0022J8109
$$ 212579 237484 255383 239089 207532 213494 215414 209723 193048 194372 190293 200315 218424
18881B18424K7630R939J3726o312l3331J062J3124j0867L166K1769J5124Q212
$$ 218424 246054 255993 269719 263407 230076 231138 244262 233395 236561 258330 273454 281666
18869B81666m535J4330J0707N146J639K0743M870m073k481j6373q005J2244L279
$$ 281666 277131 291461 302168 307314 308953 329696 334566 330493 328012 311639 303634 315878 319157
18856C19157k5344m734J5144R596L5541J5098j9900l7018K0377M1143J4666k1338
$$ 319157 293813 289079 304223 313819 349360 364458 344558 307540 327917 369060 383726 362388
18844C62388j5585j6933P328M5457j1472j5150J2999l1855j6475l408R857k476
$$ 362388 346803 329870 337198 382655 371183 356033 369032 337177 320702 317294 327151 324675
18832C24675J2697j7299m1257J9820K061L934O670j0425j76L711K6942j597j0479
$$ 324675 337372 320073 278816 298636 300697 304631 311301 300876 300700 304411 331353 329756 319277
18819C19277j3442j5452m50J1497j0066O533j9812J1681L8619j0480J43J3563
$$ 319277 305835 290383 289933 301430 291364 297897 278085 289766 328385 317905 318048 331611
18807C31611K0650K4514k5742k3171L4148P397r537R980j4036m925J4789K7067
$$ 331611 352261 376775 351033 327862 362010 369407 359870 369850 355814 350889 365678 392745
18795C92745J4816K2430J6447M4621M0389k7756l6436l9610n0849n9150q5147
$$ 392745 407561 429991 446438 491059 531448 503692 467256 427646 376797 317647 232500
18784B32500o4813k4406k7521k8331J0913M1291P3125m361k9021N2437M3167L6781
$$ 232500 167687 143281 115760 87429 98342 139633 212758 208397 179376 231813 274980 311761
18772C11761O0656N5329K9393L8474J3157M439k7326l2024r470l2332o3757j00097
$$ 311761 372417 427746 457139 495613 508770 513209 485883 453859 444389 412057 348300 248203
18760B48203q8580l3888N061L3236K5463K0167J7817J1568J7235J4627N588L5050
$$ 248203 159623 125735 130796 164032 189495 209662 227479 239047 256282 270909 276497 311547
18748C11547K3271n296r201J2999K3255L8620L2774L8660K8592r971K1632N9353
$$ 311547 334818 329522 320321 333320 356575 395195 427969 466629 495221 485250 506882 566235
18736E66235J3903K0601O4826O8165P2678R6080J12357O8900M8237K6318M3846
$$ 566235 580138 600739 665565 733730 806408 902488 1014845 1083745 1131982 1158300 1202146
18725A202146L2259L058R7l154N329Q911k2324l4149l8386j5257K4373L3428P511
$$ 1202146 1234405 1237463 1237560 1234406 1239735 1248646 1226322 1192173 1153787 1138530 1162903 1196331 1203842
18712A203842L4187M1729M6635M2974Q2460P3710P3633N5836L9258J2637K5610
$$ 1203842 1238029 1279758 1326393 1369367 1451827 1525537 1599170 1655006 1694264 1706901 1732511
18701A732511L4856N2599n6178q657l5689l9358m8099l2751n6465l0287J0466
$$ 1732511 1767367 1819966 1763788 1755131 1719442 1680084 1631985 1599234 1542769 1512482 1522948
18690A522948Q821k8104m4731j0548K4434J1385J2149N5269O5915N2745J14502
$$ 1522948 1531769 1503665 1458934 1448386 1472820 1484205 1496354 1551623 1617538 1670283 1784785
18679A784785J34333J65517J37126L2509p4044j16880q7996l6271q296K7451K4949
$$ 1784785 1919118 2084635 2221761 2254270 2180226 2063346 1975350 1939079 1930783 1958234 1983183
18668A983183K6614L9730O6659J04608Q9872J08504K05228K50050K94848K91710
$$ 1983183 2009797 2049527 2116186 2220794 2310666 2419170 2624398 2874448 3169296 3461006
18658C461006L20695M25816N87975O07046L23768j09907n66410o53287m37558
$$ 3461006 3781701 4207517 4795492 5402538 5726306 5616399 5049989 4396702 3959144
18649C959144k37759o2412l217N3605J65722K47332L15589L79377L91047L76294
$$ 3959144 3721385 3658973 3655756 3709361 3875083 4122415 4438004 4817381 5208428 5584722
18639E584722L09803J76851Q3336J9821J3324M4900N5532Q6373K7666j05348j66959
$$ 5584722 5894525 6071376 6154712 6174533 6187857 6232757 6288289 6374662 6402328 6296980 6130021
18628F130021o3273Q1336J70345K20147K59329L57754M52037N71853O87677P69478
$$ 6130021 6066748 6148084 6318429 6538576 6797905 7155659 7607696 8179549 8867226 9636704
18618I636704Q88253R72066J014444J123231J288443J522860J818023K230432
$$ 9636704 10524957 11497023 12511467 13634698 14923141 16446001 18264024 20494456
18610B0494456K779739L367282M099090N072362O448631Q615512J1609996J5501948
$$ 20494456 23274195 26641477 30740567 35812929 42261560 50877072 62487068 77989016
18602G7989016K0293600K5120885K7734993K4917188J5374881J059875j3041891
$$ 77989016 98282616 123403501 151138494 176055682 191430563 192490438 179448547
18595A79448547k1518928k2926595k0010655j5766757j1756671q464456n938995
$$ 179448547 157929619 135003024 114992369 99225612 87468941 79004485 73065490
18588G3065490l979809k264331p02506Q08162K535092M587780P189002J0567794
$$ 73065490 69085681 66821350 66118844 66927006 69462098 74049878 81238880 91806674
18580I1806674J5008677K0383384K5683617K8485166K5426405J5016459n80205
$$ 91806674 106815351 127198735 152882352 181367518 206793923 221810382 221230177
18573B21230177j5901266k5146715k6718890k3581313j9036081j4852736j1503232
$$ 221230177 205328911 180182196 153463306 129881993 110845912 95993176 84489944
18566H4489944r008097p147828n728680m748699m049481l574745l236319k822008
$$ 84489944 75481847 68334019 62605339 57856640 53807159 50232414 46996095 44174087
18558D4174087k407938k100630j827337j596612j392248j219693j085662j000206
$$ 44174087 41766149 39665519 37838182 36241570 34849322 33629629 32543967 31543761
18550C1543761r55624r50777r76535r86336r97698r36108q33973p31609n97825
$$ 31543761 30588137 29637360 28660825 27674489 26676791 25740683 24906710 24175101 23577276
18541B3577276m40815l61124l71791m56264o34443o70175o45831o23218n68088
$$ 23577276 23136461 22775337 22403546 21947282 21312839 20642664 19996833 19373615 18805527
18532A8805527n27517m34810l66074k84310k65828k96571l33469l71113m19952
$$ 18805527 18278010 17843200 17477126 17192816 16926988 16630417 16296948 15925835 15505883
18523A5505883m62114m19824l89147l38388k79376k29956j83300j35135j62871
$$ 15505883 15043769 14623945 14234798 13896410 13617034 13387078 13203778 13068643 12905772
18514A2905772k11286k62531l37911l85045m07412l92486l72817l00082k65264
$$ 12905772 12694486 12431955 12094044 11708999 11301587 10909101 10536284 10236202 9970938
18505I970938k66273k53085k27054k43431k05323k00247j99908j70424j93385
$$ 9970938 9704665 9451580 9224526 8981095 8775772 8575525 8375617 8205193 8011808
18496H011808j53188j75846j96778j59150j01785j06794j74548j65252j45169
$$ 8011808 7858620 7682774 7485996 7326846 7225061 7118267 6943719 6778467 6633298
18487F633298j35254r7504r0780j07793q8678n4676l5387n4725o1500o3274m2725
$$ 6633298 6498044 6400540 6309760 6201967 6113289 6058613 6023226 5968501 5907001 5843727 5801002
18476E801002j0707m2852j7078j1232l6073l6771k2087k3031p0938p2348o9965
$$ 5801002 5790295 5747443 5730365 5719133 5683060 5646289 5624202 5601171 5530233 5457885 5387920
18465E387920o6141q8764q5744m4669m1704n9023p0687n4930P052j9061l6244
$$ 5387920 5321779 5233015 5147271 5102602 5060898 5001875 4931188 4876258 4883310 4864249 4828005
18454D828005k3439m283J2562n803m1632n5141n7953n1798j6416r421l734p4580
$$ 4828005 4804566 4800283 4812845 4807042 4765410 4710269 4652316 4600518 4584102 4574681 4570947 4496367
18442D496367q3293l2609l9716r8046p8660r2932r2365r2953q8833r8017q2863
$$ 4496367 4413074 4380465 4340749 4242703 4164043 4071111 3978746 3885793 3796960 3698943 3616080
18431C616080q3364m4018n5035n9813m0060l9907m9045q0369r1707p9796o9319
$$ 3616080 3532716 3488698 3433663 3373850 3333790 3293883 3244838 3164469 3072762 2992966 2923647
18420B923647m6239q260p931m2024m6148m4524l7651j203j5646p8595p4929o8968
$$ 2923647 2877408 2869148 2861217 2819193 2773045 2728521 2690870 2689667 2674021 2595426 2520497 2451529
18408B451529j03326j05817o0113o0541k3555l3296o8136j5364j2833l828K5312
$$ 2451529 2348203 2242386 2182273 2121732 2098177 2064881 1996745 1981381 1968548 1964720 1990032
18397A990032J1405J512m6093m2862O229P094l1696m4291k3918l2824m6733p2249
$$ 1990032 2001437 2002949 1956856 1913994 1920223 1927317 1895621 1851330 1827412 1794588 1747855 1675606
18385A675606r4285j04108m6022n0256p400n0087l1098j0418K9319J3716k0412
$$ 1675606 1581321 1477213 1431191 1380935 1373535 1323448 1292350 1281932 1311251 1324967 1304555
18374A304555k6910r108n325k5706k4554j9096j0887k4318j7045j1517o075j9317
$$ 1304555 1277645 1268537 1263212 1237506 1212952 1193856 1182969 1158651 1141606 1130089 1124014 1104697
18362A104697K556L7162J2937n667l8418j8129j5404k8271r9J8154J494m2354
$$ 1104697 1107253 1144415 1157352 1151685 1113267 1095138 1079734 1051463 1051364 1069518 1071012 1028658
18350A028658q8q099k1021j4864J7863J729l1988r97J426K245P633K844n1626
$$ 1028658 1028570 1020471 999450 984586 1002449 1004178 972190 971193 972619 974864 982497 985341 933715
18337I33715l8231j8363m2997J4517N6664l329l3788k656j0277j1585l7109k4058
$$ 933715 895484 877121 834124 848641 905305 901976 868188 865532 855255 843670 806561 782503
18325G82503J3546l277J1902q025m528k2058r677L1377K0168K748m8135l9197
$$ 782503 796049 792772 804674 796649 792121 770063 760386 791763 811931 814679 766544 727347
18313G27347k7952j6943J1430K1805K9638k5416m3436m4397n4644m7521l418J0358
$$ 727347 699395 682452 693882 715687 745325 719909 676473 632076 577432 529911 526493 536851
18301E36851n999O016o504K555j6042J4976k9327l1514j7186r905j473j8603n364
$$ 536851 530852 536868 530364 532919 516877 531853 502526 471012 453826 443921 442448 423845 418481
18288D18481q830j8381L4878K1808p212j9111K3419L5537K9450l081m0165l3060
$$ 418481 409651 391270 426148 447956 440744 421633 445052 480589 510039 506958 466793 433733
18276D33733j9319L739n111P452J7547o412M0400Q2153P4182M0858N3827L1644
$$ 433733 414414 418153 413042 420494 438041 431629 472029 554182 628364 669222 723049 754693
18264G54693K3956l6046k05569k43843k68142r6212M1146M6614N6027J0108K4281
$$ 754693 778649 742603 537034 293191 25049 -71163 -30017 16597 72624 82732 107013
18253A07013L5920L4373N5324N1495L2656K4716M9195M0650K7470K7695K4825
$$ 107013 142933 177306 232630 284125 316781 341497 390692 431342 458812 486507 511332
18242E11332M5177O6392k2759j27875j65625k15352j24273J6608K9726L7616L1454
$$ 511332 556509 622901 600142 472267 306642 91290 -32983 -16375 13351 50967 82421
18231H2421K2989O1404J03741Q1427M4594j2765k1273k0497m6068o7221j8276
$$ 82421 105410 166814 270555 351982 396576 383811 362538 342041 295973 228752 210476
18220B10476j2187j0583L1028M8223L5766M6708K3111R555k9577j890J3433M6774
$$ 210476 198289 187706 218734 266957 302723 349431 372542 382097 352520 350630 364063 410837
18208D10837Q6665R8634R0286N5511K11718K09291L9357R722M2747k6743m0403
$$ 410837 497502 596136 686422 741933 953651 1162942 1202299 1212021 1254768 1228025 1187622
18197A187622M8761O7906k4159q3003o4932j03671j57914p2626M9957O2150L1974
$$ 1187622 1236383 1304289 1280130 1197127 1132195 1028524 870610 797984 847941 910091 942065
18186I42065J1102P2591O5742J8201P2548K17940J41594l0794l0242M4431r927
$$ 942065 953167 1025758 1091500 1109701 1182249 1400189 1541783 1510989 1480747 1525178 1515251
18175A515251j4702O3512N7964k2677j24815j69654j25930r4532l4496p766j615
$$ 1515251 1500549 1564061 1622025 1599348 1474533 1304879 1178949 1084417 1049921 1042155 1040540
18164A040540j4895m7710J4930J2402J0924K2658J6124j2628l7492m9904m7793
$$ 1040540 1025645 977935 992865 1005267 1016191 1038849 1054973 1042345 1004853 954949 907156
18153I07156l4551J7514K4559L5435Q617K0919n082L179J3190L8216N2407j2271
$$ 907156 872605 890119 914678 950113 958730 979649 974567 977746 990936 1029152 1081559 1069288
18141A069288n4568k9487k3399J9754L9585p843R759n819K0555N430k9620k6399
$$ 1069288 1014720 985233 961834 981588 1021173 1013330 1023089 1017270 1037825 1043255 1013635 987236
18129I87236J9921N3726L8007M3482L3189M0503P5137N4036K2625L6769P1544
$$ 987236 1007157 1060883 1098890 1142372 1175561 1216064 1291201 1345237 1367862 1404631 1476175
18118A476175J60266K09347K74074L40728L68404M44237O00519Q16317J280809
$$ 1476175 1636441 1845788 2119862 2460590 2828994 3273231 3873750 4690067 5970876
18109E970876K335001M489499Q217749J0310191O988483J765241p343615r925814
$$ 5970876 8305877 12795376 21013125 31323316 38311799 40077040 32733425 22807611
18101B2807611o127986l375240k287332j752716j095196n21938k19191k1713J89247
$$ 22807611 16679625 13304385 11017053 9264337 8169141 7647203 7428012 7406299 7595546
18092G595546L15210N35957Q01807R41511Q67828O87424L44703M42170J102352
$$ 7595546 7910756 8446713 9248520 10190031 11057859 11745283 12089986 12532156 13634508
18083A3634508J756474K356298L315877M769480O966933J0449118J7130715L0627364
$$ 13634508 15390982 17747280 21063157 25832637 32799570 43248688 60379403 91006767
18075I1006767N7793927R2543758Q8804848M7303922j8712512r5451102q7612392
$$ 91006767 148800694 241344452 330149300 377453222 358740710 263289608 175677216
18068A75677216n1556007k8750575j6891634j0480950o937001n247526m001136
$$ 175677216 124121209 95370634 78479000 67998050 61061049 55813523 51812387
18061E1812387k707798j527407n10553Q47801K485016M645306P944131J4218195
$$ 51812387 49104589 47577182 47066629 47914430 50399446 55044752 62988883 77207078
18053G7207078K6839356N2116746Q4108701Q0537400M2205462j8324308q9096768
$$ 77207078 104046434 156163180 240271881 320809281 363014743 344690435 255593667
18046B55593667q1601068m8148157k7205048j6529835j0870759p884036o115684
$$ 255593667 173992599 125844442 98639394 82109559 71238800 63354764 57239080
18039E7239080m791138l857421l130606k609447k041683j524877j343141j383631
$$ 57239080 52447942 48590521 45459915 42850468 40808785 39283908 37940767 36557136
18031C6557136j652495j897691j653644j209293r86113q84794q54455p95718o84612
$$ 36557136 34904641 33006950 31353306 30144013 29157900 28273106 27418651 26622933 25938321
18022B5938321n38343m04096m81233o65047j058474j062827q75427p75797o04373
$$ 25938321 25399978 24995882 24514649 23849602 22791128 21728301 20852874 20077077 19472704
18013A9472704n75351n46682m88129m92957m53912m18203l92969l50833l39341
$$ 19472704 18897353 18350671 17862542 17369585 16915673 16497470 16104501 15753668 15414327
18004A5414327l06616l12328l14524l49576l42066l43479l13606k28043k21016
$$ 15414327 15107711 14795383 14480859 14131283 13789217 13445738 13132132 12904089 12683073
17995A2683073k07583j88204j81037j39818r2403n7718m1407q3503j83221l26641
$$ 12683073 12475490 12287286 12106249 11966431 11874028 11816310 11774903 11691400 11508179 11181538
17985A1181538l81006l84582l55120l08135k97893k90376k47851k33659k19040
$$ 11181538 10800532 10415950 10060830 9752695 9454802 9164426 8916575 8682916 8463876
17976H463876j72972k00820j87773j26167j28562j04144j18382o7248l5542n1388
$$ 8463876 8290904 8090084 7902311 7776144 7647582 7543438 7425056 7357808 7322266 7270878
17966G270878q5805r7561j15427j89696j82306j70328j81837j57641j74467j30528
$$ 7270878 7185073 7087512 6972085 6782389 6600083 6429755 6247918 6090277 5915810 5785282
17956E785282j11494p7346r2472m1438k2443o881J6935R684J8953J8953o5289
$$ 5785282 5673788 5596442 5503970 5462532 5440089 5433208 5450143 5459827 5478780 5497733 5432444
17945E432444q0718R0723M1479o5259o5387J1900k9840j20019j16929j02048j33150
$$ 5432444 5351726 5442449 5483928 5418669 5353282 5365182 5335342 5215323 5098394 4996346 4863196
17934D863196j24859n6505l0921n4954k4630J8886L4384K9350N093m309J938j08153
$$ 4863196 4738337 4681832 4650911 4595957 4571327 4590213 4624597 4653947 4659040 4654731 4656669 4548516
17922D548516j07421N8759J1890p2496n3367K2777o5298j36726j25959j15871
$$ 4548516 4441095 4499854 4511744 4439248 4385881 4408658 4343360 4206634 4080675 3964804
17912C964804j18891j02995r3466j09423j18852j02503m6381n7683j7593k5616
$$ 3964804 3845913 3742918 3649452 3540029 3421177 3318674 3272293 3214610 3197017 3171401
17902C171401o1312o4410l7076n5831j12889j17608p8913k5295j4888K2351M909
$$ 3171401 3110089 3045679 3008603 2952772 2839883 2722275 2643362 2618067 2603179 2625530 2630439
17891B630439k238p78k9663j5250K4546L8740l6011j30000k48039l04708k44364
$$ 2630439 2628201 2627423 2597760 2582510 2607056 2645796 2609785 2479785 2231746 1927038 1682674
17880A682674o6658O074q070l1722l3108j484M4448M0251M0745j630P380J8218
$$ 1682674 1616016 1622090 1614020 1582298 1549190 1547706 1592154 1632405 1673150 1671520 1678900 1697118
17868A697118J4294k1294k1773K3889M1291L7239j2256j32139k15658k74162j78505
$$ 1697118 1711412 1690118 1668345 1692234 1733525 1770764 1758508 1626369 1410711 1136549 958044
17857I58044n0872j5737J4793J3532J6514J5441M8641n511j6967n235k5490K1950
$$ 958044 907172 891435 906228 919760 936274 951715 1000356 994845 977878 972643 947153 969103
17845I69103J6061m7688n6083J1827L8428R154j8113l7412j4099l7735k7291k1994
$$ 969103 985164 937476 881393 893220 931648 940802 922689 885277 871178 833443 806152 784158
17833G84158K0825j4469k8731j8152j9104L450j0810j6980k0888J2140J2874n308
$$ 784158 804983 790514 761783 743631 724527 727977 717167 700187 679299 691439 704313 699005
17821F99005K8001L8261l8601l8784r797Q435k1430m3434l6548p152J2019K9447
$$ 699005 727006 765267 726666 687882 678085 686520 665090 621656 585108 577956 589975 619422
17809F19422L4350j2241o4165k4564l1955j2628j0300j7078j3656O530K869J6294
$$ 619422 653772 641531 577366 552802 520847 508219 497919 480841 467185 473715 476584 492878
17797D92878K201j9610j5389l6894n9559j1639K2944O827J722N1953K3494M887
$$ 492878 495079 475469 460080 423186 363627 351988 374932 381759 383481 435434 458928 463815
17785D63815l4344m7046j9563l1281k8435J9969j1322l0469r668J1161m494l1166
$$ 463815 429471 382425 362862 331581 303146 323115 311793 281324 271656 282817 278323 247157
17773B47157l0807j4465J3868J7600n235Q007K150j8415l3501O4j9439m9J43r394
$$ 247157 216350 201885 215753 233353 228118 236125 238275 219860 186359 186423 166984 166935 167078 157684
17759A57684K8835J8027j6296j6372K507p112j0920J8429R593L84J3253m476k7182
$$ 157684 186519 204546 188250 171878 174385 167273 156353 174782 184375 184759 198012 193536 166354
17746A66354l9476k5797J6560J1235j3462J1167l3509q282J7864j0085K4012K1810
$$ 166354 126878 101081 117641 128876 115414 126581 93072 84790 102654 92569 116581 138391
17734A38391J8836P896k7726J2272J0226n4705Q020K4957N316j942l4855Q30N199
$$ 138391 157227 165123 137397 149669 159895 105190 113210 138167 143483 141541 106686 107516 112715
17721A12715o536k0893K4559L4074k0837p052l9989R024J4962K1135l6283k7269
$$ 112715 106179 85286 109845 143919 123082 116030 76041 85065 100027 121162 84879 57610
17709E7610j2297L5868K3632J1666L127j6299P093k1386j6548J1672J5733N255
$$ 57610 45313 81181 104813 116479 119606 103307 110400 89014 72466 84138 99871 105126
17697A05126j2960p425J7900q539j6860K6980J9605Q338q146p621j7793n746l0268
$$ 105126 92166 84741 102641 94102 77242 104222 123827 132165 124019 116398 98605 92859 62591
17684F2591l0036Q046k7573J5478K0359l4321J094K4808N737L8183M0326k9615
$$ 62591 32555 40601 13028 28506 48865 14544 15638 40446 46183 84366 124692 95077
17672I5077k9742k4213p93l631j1813j9938m020K114K4904L7750K1076j3723J0490
$$ 95077 65335 41122 40329 36698 24885 4947 927 3041 27945 65695 86771 73048 83538
17659H3538K4834r885L672r837k6357j7353j2532n382N205J2883n454j3086J558
$$ 83538 108372 98487 102159 92322 65965 48612 36080 30698 35903 48786 43332 30246 31804
17646C1804l636K5100Q518j4683j2872j7863R620K1063M1312K8707K0999O077
$$ 31804 28168 53268 61786 47103 34231 16368 25988 47051 88363 117070 138069 144146
17634A44146o390q520j7351q017j3729k9556O572m509j1627L445k2743J68j1698
$$ 144146 137756 129236 111885 103868 90139 60583 67155 62646 51019 54464 31721 31889 20191
17621B0191K969o287k591J7431j2690j2835k8277J0140K989K3767K699k2625m392
$$ 20191 23160 16873 14282 31713 19023 6188 -22089 -11949 -8960 14807 17506 -5119 -9511
17608i511J6481O884n34j1548K094k2554l7952J2306K7365k1951j6255K4859N5303
$$ -9511 6970 13854 13320 1772 3866 -18688 -56640 -44334 -16969 -38920 -55175 -30316 24987
17595B4987J827l54k3445J6567R97j4298l8481O923K5759K049L2076o239j8897
$$ 24987 26814 26460 3015 19582 20579 6281 -32200 -25277 482 2531 34607 28368 9471
17582I471j7950l6921J7817L297O861L0932J6056n144O562J4104l2221j2004o430
$$ 9471 -8479 -45400 -27583 -24286 -17425 13507 29563 24419 30981 45085 12864 860 -5570
17569e570k5938j6221j0477p568N698K5211j4098k5923K9545N4149K508L124J1458
$$ -5570 -31508 -47729 -58206 -65774 -60076 -34865 -48963 -74886 -45341 8808 11316 14440 25898
17556B5898p625j0071J4907L360n93J6814K0426r496o967J6211K6725p1m1863
$$ 25898 18273 8202 23109 26469 25876 42690 63116 53620 46653 62864 89589 89518 47655
17543D7655r226k5773j151l185j7628K1665K4971Q891j8195r59O77q921l0688
$$ 47655 38429 12656 11505 8320 -9308 12357 37328 46219 28024 27065 27742 18821 -11867
17530a1867j6456p714Q473J6696J0360K9313L6689K0098k4200k9824P476k1022
$$ -11867 -28323 -36037 -27564 -10868 -508 28805 65494 85592 61392 31568 39044 18022
17518A8022j6102n383K700R664k5474q001n073L126Q081J0871o757j6744j5531
$$ 18022 1920 -3463 -763 8901 -16573 -24574 -29647 -26521 -18440 -7569 -14326 -31070 -46601
17505d6601R876O041j8426l0601j105L1444J9462M039L0424K5735J4869k5197
$$ -46601 -36725 -30684 -49110 -79711 -80816 -49372 -29910 -25871 4553 30288 45157 19960
17493A9960k3510J1200J2374q598m045j0541K2643O78J1837Q741j871p028P831
$$ 19960 -3550 7650 20024 11426 7381 -3160 19483 20161 31998 40739 38868 31840 39671
17480C9671J5385L066j0774J093j0036N777N4425K4692M445J167N4271J15219
$$ 39671 55056 58122 47348 48441 38405 44182 98607 123299 127744 128911 183182 298401
17468B98401J31156J74118L64350N35486M03317J54671l29549n58965l98516k39193
$$ 298401 429557 603675 968025 1503511 1906828 2061499 1731950 1172985 774469 535276
17458E35276j22958o8609k9215k2284k0080K2459q95k1653q919K3165L3743M4864
$$ 535276 412318 343709 314494 292210 272130 294589 293694 272041 263122 286287 320030 364894
17446C64894N7678N8965J92281M18159N26750L92364J56609k18127n12403m09250
$$ 364894 422572 481537 673818 1091977 1618727 2011091 2167700 1949573 1437170 1027920
17436A027920k59189j80185j09088j02376m9378l4336m4156k0676n865k6365j504
$$ 1027920 768731 588546 479458 377082 327704 293368 249212 228536 222671 196306 194802
17425A94802L0461j5210j8740Q301j5668j7186L7404p835m7022l7373j5369K5831
$$ 194802 225263 210053 191313 199614 183946 166760 204164 196329 149307 111934 96565 122396
17413A22396M5183Q476j3124r748k1865m0672o826p994R319K3349J5193j4885
$$ 122396 167579 176055 162931 153183 131318 90646 83820 75826 85145 108494 123687 108802
17401A08802o603L497K6412L184p867j8334m0760k5427j5944J770R887J1365j8763
$$ 108802 102199 105696 132108 135292 127425 109091 68331 42904 26960 28730 38617 49982 31219
17388C1219K4369M755l8099j3017J3284J1079k012J1827L068K3871j4300r661
$$ 31219 55588 60343 22244 9227 22511 33590 31578 43405 46473 70344 56044 46383
17376D6383J8813j8570l4955O589k2313k1215j4947J4310M3962l266j8844j1874
$$ 46383 65196 46626 11671 18260 -4053 -25268 -40215 -25905 18057 14791 -4053 -15927
17364a5927J0995J7847r192M883J3270j0668k2693l918q313K0536K2947k1257
$$ -15927 -4932 12915 3723 8606 21876 11208 -11485 -15403 -23716 -3180 19767 -1490
17352a490k6670K2894L5462j6564j833l601L2731K5680J3681k7112l2581r879
$$ -1490 -28160 -5266 30196 13632 11799 8198 40929 66609 80290 53178 20597 10718
17340A0718j6851R587J2755J0608K7914l553k2968j2396l1644j185J9571n783
$$ 10718 -6133 3454 16209 26817 54731 51178 28210 15814 -15830 -17015 2556 -3227
17328c227J8847J3686J4429J4283j1184r200k0026j6249p801J9875M979j1362
$$ -3227 15620 29306 43735 58018 46834 37634 17608 1359 -6442 13433 18412 7050
17316G050K7876j486P052k5492J3920k310l8258j2233K1329L6258n88j495j0005
$$ 7050 34926 33440 40492 15000 28920 26610 -11648 -23881 -2552 33706 33118 31623 21618
17303B1618K1368P565j94j689J1677k2153k944j6166j5199j5205r201n825J5546
$$ 21618 42986 50551 50357 48668 60345 38192 35248 19082 3883 -11322 -20523 -26348 -10802
17290a0802J0632j9971L134N770J5858J0232K6962K8539Q988m1045j6028O990
$$ -10802 -170 -20141 -17007 -11237 4621 14853 41815 70354 79342 38297 22269 29259
17278B9259k671j5371L4143K69l7181k0288o303j2398K3653P028N131o638j2838
$$ 29259 26588 11217 45360 45629 8448 -11840 -18143 -30541 -6888 140 5271 -1367 -14205
17265a4205R79j4877J7918J0657P168j2942J2434J1538R531M577k8788l6430l2975
$$ -14205 -13226 -28103 -10185 472 7640 -5302 7132 18670 28201 32778 3990 -32440 -65415
17252f5415L8753L1438m781l051J6814q670k0259j7355k3641K1395L1542J0143
$$ -65415 -26662 4776 -5 -3056 13758 5088 -15171 -32526 -56167 -34772 -3230 6913
17240F913p77j1981M863o15j3526q838n017N194m475o210O91J1281J6064j5397
$$ 6913 6136 -5845 -982 -1597 -15123 -23961 -28978 -23784 -28259 -34469 -33778 -22497 -6433 -21830
17226b1830l48p19p345M710N04K2125K0891M071n334M092k1711j4721R213K2706
$$ -21830 -22178 -22897 -30242 -25532 -25028 -2903 17988 22059 16725 20817 -894 -15615 -6402 16304
17212A6304k5546l8288N82J9732K018O287J363J814J3700J7310j1011Q200l81
$$ 16304 -9242 -47530 -46948 -27216 -25198 -18911 -17548 -15734 -2034 15276 4265 12465 12084
17199A2084O122j4623J0410j0063L4602M969k8570L315O391k183r102m2549O940
$$ 12084 18206 3583 13993 3930 38532 43501 14931 18246 24637 22454 13352 -29197 -22257
17186b2257K076r751K9064P03n127R901K6000J6207n675l0485k6760K356p048
$$ -22257 -20181 -29932 -868 -165 -5292 4609 30609 46816 41141 10656 -16104 -13748 -20796
17173b0796R826m195l3250k5203O854M9319N0047j2276j7031N654l992j3287j015
$$ -20796 -10970 -15165 -48415 -73618 -66764 -17445 32602 20326 3295 8949 4957 -8330 -9345
17160i345p840j7811j9040J493J023K7573L4923J7309l329j6450K345n102J6789
$$ -9345 -17185 -34996 -54036 -52543 -51520 -23947 10976 28285 24956 8506 10851 5749 22538
17147B2538J9656k4345q123J6278j0257l2083J941r262j006L0692L617M539L780
$$ 22538 42194 17849 9726 26004 15747 -16336 -14395 -23657 -24663 6029 9646 14185 17965
17134A7965m054p726j2031R820k5240k002L070j8811j6954J0129J3988J7109j4198
$$ 17965 13911 6185 -5846 3974 -21266 -23268 -20198 -39009 -55963 -45834 -31846 -14737 -28935
17121b8935N257j4292k0503K1297L9684j0406j0427j5811J1151j3341j1830j685
$$ -28935 -23678 -37970 -58473 -37176 2508 -7898 -18325 -34136 -22985 -36326 -48156 -49841
17109d9841J880J688K3796J1129Q728J604k6075m152K4482n017j0163R19j2347
$$ -49841 -47961 -46273 -22477 -11348 -2620 -1016 -27091 -31243 -6761 -11778 -21941 -21022 -33369
17096c3369k299K6973J0737l8779j5645M4681J7390M059J50j0174k4990j5715
$$ -33369 -35668 -8695 2042 -36737 -52382 -7701 9689 13748 13898 3724 -21266 -36981
17084c6981L3550K3117j0111k2668K4958K3367k2718j0455l8490k9276j149J2974
$$ -36981 -3431 19686 9575 -13093 11865 35232 12514 2059 -36431 -65707 -66856 -53882
17072e3882M5266j515O761J5723n851L81q713r214O464J292J0811j314M361N050
$$ -53882 -8616 -10131 -3370 12353 6502 6883 -1830 -11044 -4580 -3288 7523 6209 10570 15620
17058A5620K1356j4458k4733l5128K6791k051l5947j9845P608K9126N4183P702
$$ 15620 36976 22518 -2215 -37343 -10552 -12603 -48550 -68395 -60787 -31661 22522 30224
17046C0224j7237j6607m0040r740J6599k623j6742m391L0302J3315K8175K9452
$$ 30224 12987 -3620 -43660 -53400 -36801 -39424 -56166 -60557 -30255 -16940 11235 40687
17034D0687n434j2512R693K86l0461k412L1458L445J812j1002m3421o6079j8986
$$ 40687 35253 22741 32434 32720 2259 -153 31305 34750 36562 25560 -17861 -83940 -102926
17021a02926K9588n226k6429j0342m095L2350K8673J3490L7811r083l045j8407
$$ -102926 -73338 -78564 -104993 -115335 -119430 -87080 -58407 -44917 -7106 -16189 -19234 -37641
17009c7641j3121K6243j8462j7134N375J1019l8308J8391L6266J7276J8105k1317
$$ -37641 -50762 -24519 -42981 -60115 -54740 -43721 -82029 -63638 -27372 -10096 8009 -13308
16997a3308k1840l1174m549K7602k360J29K8572j0021M226R304O882j3629j8371
$$ -13308 -35148 -66322 -70871 -43269 -45629 -45500 -16928 -26949 -22723 -13419 -6537 -20166 -38537
16984c8537N725J4733J0631K2165J2943J2749K1695Q120l9036N923K9542n3784
$$ -38537 -32812 -18079 -7448 14717 27660 40409 62104 70224 31188 37111 66653 12869
16972A2869m1041J1827J0299k2690O252K7095Q418n761J5108k9967r494M2813
$$ 12869 -28172 -16345 -6046 -28736 -22484 4611 13029 7268 22376 -7591 -17085 25728
16960B5728K6698J579l2767j1915P431l624j5144j1616L5237r349j380J250j5492
$$ 25728 52426 54005 21238 9323 16754 13130 -2014 -13630 21607 12258 10878 12128 -3364
16947c364k2738j5747j62K424j916o401j5453J2775J3476O700l96j605j6786j2889
$$ -3364 -26102 -41849 -42011 -39587 -41503 -47904 -63357 -50582 -37106 -30406 -30802 -32407 -49193 -62082
16933f2082K2535J0575j2556R833K6169o454k249n366L378K1531k0306L1117O907
$$ -62082 -39547 -28972 -41528 -31695 -5526 -11980 -14229 -19595 -16217 5314 -14992 16125 23032
16920B3032m0477j3493k1589l863l229k658J9072K1530K1648r834J6848o6J248
$$ 23032 -17445 -30938 -52527 -56390 -59619 -62277 -43205 -21675 -27 -9861 6987 6921 8169
16907H169K3807k7295k1765j0616M25k3963j355J5616J8487j0178M726J9287J708
$$ 8169 31976 4681 -17084 -27700 -27275 -51238 -52593 -36977 -18490 -28668 -23942 -4655 -2947
16894b947j9334J2655K2433o513l1033l301J3400j1646m1306n298K1131K042P380
$$ -2947 -22281 -9626 12807 6294 -24739 -28040 -14640 -26286 -67592 -72890 -51759 -49717 -42337
16881d2337M9631K7726k7556j3141K5663J4420r76j5386j2236r984j6642J1684
$$ -42337 7294 35020 7464 -5677 19986 34406 33430 18044 5808 -4176 -20818 -9134
16869i134K3128M487j7711j5034N716q29J694J3840q976n0847k8374K9541M1871
$$ -9134 13994 18481 770 -14264 -8548 -9377 -7683 6157 -2819 -53666 -82040 -52499 -10628
16856a0628J664J798j0879l0880j0487l870K359J098j4115n247J0457O716k2958
$$ -10628 -8964 -7166 -18045 -48925 -59412 -63282 -60923 -59825 -73940 -79187 -68730 -62014 -84972
16843h4972R120Q574L7332M181J9858r78j9775k6242R579L8142M491k203j1124
$$ -84972 -75852 -67278 -29946 -25765 -5907 -6885 -26660 -52902 -43323 -5181 -690 -2893 -14017
16830a4017L630J6781j8406j5359k3549R952J8071M430j89J7821K3449J117o200
$$ -14017 -10387 6394 -12012 -27371 -50920 -40968 -22897 -18467 -18656 -835 22614 23731 17531
16817A7531j8106j1624J5559k8557J4537o791P242K9908k5501k0733o46N500k705
$$ 17531 -575 -12199 3360 -25197 -10660 -17451 -10209 19699 -5802 -26535 -27181 -21681 -24386
16804b4386K935K5671J0520O489j7421n384m8732r026K1631M5314K6618j4553
$$ -24386 -21451 4220 14740 21229 3808 -1576 -50308 -59334 -37703 7611 34229 19676
16792A9676k8146l8558K8703M985r882K661r153o358k194r116m412P865L3100
$$ 19676 -8470 -47028 -18325 -13340 -23222 -20561 -29714 -36072 -38266 -47382 -51794 -43929 -10829
16779a0829m405K8977L9644l9588m9848m624q598K3600J706o997J299J9974N740
$$ -10829 -15234 13743 53387 13799 -36049 -40673 -49271 -25671 -23965 -30962 -29663 -9689 -3949
16766c949M261L690N853K4234j3360m0868m0231L569J3936k0980K97j3622Q062
$$ -3949 312 4002 9855 34089 20729 -20139 -60370 -56801 -42865 -63845 -63548 -77170 -69108
16753f9108M0953J1860r254M620j1210J1203J2554K7723K6828j3116j5028k1476
$$ -69108 -28155 -16295 -25549 -20929 -32139 -20936 -8382 19341 46169 33053 18025 -3451
16741c451O660J5910o096p453J219K458Q661k8415L791k292j4561n304O569J2619
$$ -3451 3209 19119 13023 5570 6789 9247 17908 -10507 -6716 -9008 -23569 -28873 -22304 -9685
16727i685M572M068Q399N596j4342j6048k0024M0640R397k8972j0932K2371K1051
$$ -9685 -5113 -1045 7354 12950 -1392 -17440 -37464 3176 12573 -16399 -27331 -4960 16091
16714A6091r332k2504O570J0653j1329j0207R734K2901j6052j864k0204k586j1609
$$ 16091 6759 -15745 -9175 1478 -9851 -20058 -10324 12577 -3475 -5339 -25543 -28129 -39738
16701c9738P262M870j0098o80l266l070J5818J0250o213K3854J815k5506m285
$$ -39738 -32476 -27606 -37704 -38384 -41650 -44720 -28902 -18652 -24865 -1011 804 -24702 -28987
16688b8987J6814K3717L987J0684J2686l1374O488J5997j1000m2787r287J0239
$$ -28987 -12173 11544 15531 26215 38901 7527 14015 30012 19012 -23775 -33062 -22823
16676b2823j4288j1878K1958N658p67J6131n833k3307J4938M137j0121l567K4001
$$ -22823 -37111 -48989 -27031 -21373 -22140 -6009 -11842 -35149 -20211 -16074 -26195 -29762 -5761
16663e761J1836N497k7052k1484j4110K217J1720Q793P909j4055J3469r750j590
$$ -5761 6075 11572 -15480 -36964 -51074 -48857 -37137 -28344 -20435 -34490 -21021 -30771 -32361
16650c2361m454k4109J5240J5750J3158M976j7108j1818K0104J9704m460q163
$$ -32361 -36815 -60924 -45684 -29934 -16776 -11800 -28908 -40726 -20622 -918 -5378 -13541
16638a3541J0365q795L1656l0969l220P559k6700l2Q544J9729L9894P486l5438
$$ -13541 -3176 -11971 19685 -11284 -14504 -6945 -33645 -33677 -25133 -5404 34490 41976 6538
16625F538n1832J3002J8291n616K00j4909j1229k632O665Q648J2100l648J9965
$$ 6538 -45294 -32292 -14001 -19617 -19417 -34326 -45555 -48187 -41522 -32874 -20774 -24422 -4457
16612d457J0789L651k8308J4365J442j0029J5523R253L135k7210m152K1015K389
$$ -4457 6332 9983 -18325 -3960 -2518 -12547 2976 12229 15364 -11846 -15998 5017 7406
16599G406m589K4954r78j147j5621j9223j4125p106M0347P233J8891j0380k0256
$$ 7406 2817 27771 26793 25646 10025 -9198 -23323 -30429 9918 17151 36042 25662 5406
16586E406Q63j298M473K82J4739o863k5069R96j4393J9818j1684k5481k8113j7642
$$ 5406 6269 4971 9444 9726 24465 17602 -7467 -6471 -20864 -1046 -12730 -38211 -66324 -83966
16572h3966R783M651J9981K0190K4474k6941j4432N9o073J0949J2503K6254J9001
$$ -83966 -74183 -69532 -49551 -29361 -4887 -31828 -46260 -46201 -52274 -41325 -28822 -2568 16433
16559A6433j0764m818r102K3656K0763j3047j1458O24k7676M583J8874m106k8721
$$ 16433 5669 851 -8251 15405 36168 23121 11663 12287 -15389 -10806 8068 3962 -24759
16546b4759Q920K2872J1921j8834l0595m3005k7234K5836J9570M2139K5712J294
$$ -24759 -15839 7033 18954 120 -30475 -73480 -100714 -74878 -55308 -13169 12543 13837
16534A3837k9729P65n043j2252L8159J3150J9372k2415n5717R848J5715J4541
$$ 13837 -15892 -15127 -20170 -32422 5737 18887 38259 15844 -39873 -30025 -14310 231
16522B31r91j9841p969L0431L485n650m0032j6919J7186j1033J3133L8872L7903
$$ 231 -760 -20601 -28570 1861 5346 -304 -40336 -57255 -40069 -51102 -37969 903 38806
16509C8806L3265j8452k9824J318M564k0484r762n341M069P768R457J1798k133
$$ 38806 72071 53619 23795 25113 29677 9193 -569 -5910 -1841 5927 15384 27182 25049
16496B5049n523K8466r639l0265j9987K7370J0582j2845K858k341j5368p608j8492
$$ 25049 19526 47992 38353 8088 -11899 15471 26053 13208 16066 13725 -1643 -9251 -27743
16483b7743O371L3892k1100j1131o409L1285K3990Q29k2282K4601k7257J6097
$$ -27743 -21372 12520 -8580 -19711 -26120 5165 29155 29984 7702 32303 5046 21143
16471B1143K6230l522q602k3234k5548j0028L3173J2065o992K570j0644J0803
$$ 21143 47373 43851 35249 12015 -13533 -23561 9612 21677 14685 17255 6611 17414
16459A7414J3855l5110K386J2231N941j2466Q614k2436l3699J452J1779k6156
$$ 17414 31269 -3841 -1455 10776 16717 4251 12865 -9571 -43270 -41818 -30039 -56195
16447e6195m1065k2964P654K1438J5705J1770K9393l949k3591k53P707K4730K2192
$$ -56195 -97260 -120224 -112570 -91132 -75427 -63657 -34264 -38213 -61804 -62057 -54350 -29620 -7428
16434g428P367J1357R949R732J0980k60k5832k3182N745L2917l411j1678O640
$$ -7428 -61 11296 21245 30977 41957 41697 15865 -7317 -1572 31345 27934 16256 22896
16421B2896j5236l329j0250j7751k0846j5409R737K3116M055m206j6284k1538
$$ 22896 7660 4331 -5919 -23670 -44516 -59925 -50188 -27072 -23017 -27223 -43507 -65045
16409f5045J0475n348O959J4389L1901J7734L215j2323Q383j526M139j0659j8828
$$ -65045 -54570 -59918 -52959 -38570 -6669 11065 14280 1957 10340 8814 12953 2294 -16534
16396a6534K894Q199k4776M325j0677L6552L4489R887j0409k4882n401K4042k0627
$$ -16534 -13640 -5441 -30217 -25892 -36569 -17 34472 44359 33950 9068 3667 27709 7082
16383G082K750L138o892k2821m769J9576R739R822j3297k7699J9189J9709j1215
$$ 7082 9832 12970 6078 -16743 -21512 -1936 7803 17625 4328 -23371 -4182 15527 4312
16370D312j3630M816j2292K0882L443q88M443O498j2093k2491J1312J9300P817
$$ 4312 -9318 -4502 -16794 4088 7531 6643 11086 17584 5491 -17000 -5688 13612 21429
16357B1429k4589j789k5975J1913L397r566J012j737L862L834L84K2484J3786
$$ 21429 -3160 -4949 -30924 -19011 -15614 -25180 -24168 -25905 -22043 -18209 -17825 4659 18445
16344A8445j4656R275q095j8911p053m148n551l944J086K9248K5313j0789j9070
$$ 18445 3789 13064 4969 -13942 -20995 -25143 -30694 -34638 -33552 -4304 21009 10220 -8850
16331h850k2950k2922k1661J947J9220K634J3120q883K752P229J1312K4678K8787
$$ -8850 -31800 -54722 -76383 -74436 -55216 -52582 -39462 -48345 -45593 -38364 -27052 -2374 26413
16318B6413j0147l7846j1976K47L5673M5653j0738r858k227k0246j2153m039j0632
$$ 26413 16266 -21580 -33556 -33309 2364 48017 37279 27421 25194 4948 -7205 -11244 -21876
16305b1876j69K481K1799K8158K963N119K0102j644l8004l2432j5214l5560N10
$$ -21876 -22045 -19564 2235 30393 33356 38475 58577 56933 18929 -13503 -28717 -64277 -63767
16292f3767M6105J3841m361o942k2773J9481J3867j4542j4933q400m242L5612
$$ -63767 -17662 -3821 -8182 -15124 -37897 -18416 -4549 -19091 -34024 -42424 -46666 -11054
16280a1054o894P495N210P482K760P934j690j6416k0088p429o369k653k645M8668
$$ -11054 -17948 -10453 -5243 2239 4999 12933 11243 -5173 -25261 -32690 -39059 -41712 -44357 4311
16266D311J4245k1989K0352K7813j4736j4865j9262J5265l1529J4140J2884j5731
$$ 4311 18556 -3433 16919 44732 29996 15131 -4131 11134 -20395 -6255 6629 -9102
16254i102q326p089O804l939m533J1840P65J0009K8442K9928j2480J8167j6772
$$ -9102 -17428 -24517 -17713 -21652 -26185 -14345 -13580 -3571 24871 54799 42319 60486 43714
16241D3714l7907l7171k5416Q568J7588J7814j5808j947J1653l1304J605K5962
$$ 43714 5807 -31364 -56780 -48212 -30624 -12810 -28618 -30565 -18912 -50216 -48611 -22649
16229b2649K7099j7035j4407K876r571J9094p95R234J0491P738Q747q437k898
$$ -22649 4450 -12585 -26992 -24116 -33687 -14593 -15388 -6154 4337 12075 20822 12385 9487
16216I487n271j635k686r961q237K6078r655J7086J1510m166K222k5744j3034
$$ 9487 4216 2581 -105 -10066 -18303 7775 -1880 15206 26716 22550 24772 -972 -14006
16203a4006m901k2266j1131L4667K8181K90O904j4237M191q84l6960k2987R53
$$ -14006 -18907 -41173 -52304 -17637 10544 10834 17738 3501 7692 6808 -30152 -53139 -52186
16190e2186P137K5963L928O297j0820P900M775o641j3615j844J6680R423j9296
$$ -52186 -45049 -19086 -15158 -8861 -19681 -11781 -7006 -13647 -27262 -29106 -12426 -3003 -22299
16177b2299j1586J618R689N741J4216k5232o282L650K1466j5977l2676M118J3266
$$ -22299 -33885 -32267 -22578 -16837 -2621 -27853 -34135 -30485 -9019 -24996 -57672 -53554 -40288
16164d0288L4342j2736o43L0880o964M343m788j3049m402j2860O250M5717n43
$$ -40288 -5946 -18682 -19325 11555 4591 8934 4146 -8903 -13305 -26165 -19915 25802 25259
16151B5259k9256O77j3221r145K1114K1869J0216j5820j529J9363J387j9985r425
$$ 25259 -3997 -3320 -16541 -25686 -4572 17297 27513 11693 10164 29527 30914 10929 1504
16138A504k0929k5042J0368K6805L3274J0393N302p696k135M989l7999m2117j0866
$$ 1504 -19425 -44467 -34099 -7294 25980 36373 41675 33979 31844 36833 -1166 -43283 -54149
16125e4149K0828K8211J5340Q236j7760r209j8185O522J8782l603j3787J9187
$$ -54149 -33321 -5110 10230 18466 706 -8503 -26688 -20166 -1384 -4987 -18774 413
16113D13K0731J5277k3541j5846r557j4515K1603Q978N857j587j7356j5907J0166
$$ 413 21144 36421 12880 -2966 -12523 -27038 -5435 3543 9400 7813 -9543 -25450 -15284
16100a5284k37L048l580j0332Q557J6235O327j6766j5760q69N607L3542K3866
$$ -15284 -15521 -12473 -16053 -26385 -17828 -1593 4734 -12032 -27792 -28661 -23054 10488 34354
16087C4354l6286j7572J6017L0170j65r357L8438m329j9411l2632Q341J8509R885
$$ 34354 -1932 -19504 -3487 26683 26518 17161 55599 51270 31859 -773 7568 26077 35962
16074C5962l0123j6004l3517k1643k0235L959M2460K4072K4505J2382J4800J1200
$$ 35962 5839 -10165 -43682 -65325 -85560 -81601 -39141 -15069 9436 21818 36618 47818
16062D7818j257l1347n2825j690j0824J0871J082R421K379J1058j1427j4202J6854
$$ 47818 46561 15214 -37611 -39301 -50125 -39254 -38172 -28751 -26372 -15314 -26741 -40943 -24089
16049b4089K4623q931l5283k5154K3391J3021J5629K4434j912o952L644K272J1948
$$ -24089 534 -8397 -43680 -68834 -45443 -32422 -16793 7641 5729 -1223 2421 4693 16641
16036A6641p581l7807R976J8316j3209j1018l5745j0646K8144J5067L655k1009
$$ 16641 9060 -28747 -18771 -455 -13664 -24682 -60427 -71073 -42929 -27862 -24207 -45216
16024d5216P544O606J8163L3320j2347k2830n262J5968J1612K0178j7836k6927
$$ -45216 -37672 -31066 -12903 20417 8070 -14760 -20022 -4054 7558 27736 9900 -17027
16012a7027j4698m701K1261L2782j5903n548j4696j1872O717l598P478R899J502
$$ -17027 -31725 -36426 -15165 17617 1714 -3834 -18530 -30402 -23685 -27283 -19805 -9906 -8404
15999h404K867J3667J7272K2656M502j2335m8039k5519K1611L3807j0604k9496
$$ -8404 -5537 8130 25402 48058 52560 40225 -7814 -33333 -11722 22085 11481 -18015
15987a8015P24Q360n603k5233j9292j4085J9854L2568j3200J8953K2132L177l514
$$ -18015 -17291 -8931 -14534 -39767 -59059 -73144 -53290 -20722 -33922 -14969 7163 10340 6826
15974F826l5231m5323L2511K4396M759l80k987J8609l247M012j4163k4748K0111
$$ 6826 -28405 -73728 -41217 -16821 -12062 -12442 -15429 3180 -67 3945 -10218 -34966 -14855
15961a4855K4975J7817K8076n1207n0707j5890J472K4582q353O567K0378m00j4172
$$ -14855 10120 27937 56013 4806 -45901 -61791 -60319 -35737 -44090 -37523 -17145 -17545 -31717
15948c1717j8350K2984K2861Q878L790j2845J2688j1001n098k3723J9662K4601
$$ -31717 -50067 -27083 -4222 4656 8446 -4399 8289 -2712 -7810 -31533 -11871 12730
15936A2730j0604q351J294J8799K7692n999k3352j4951J2832p533P923K5396r240
$$ 12730 2126 -6225 -4931 13868 41560 35561 12209 -2742 10090 2557 10480 35876 26636
15923B6636j9484k5674q168L0337O850j0710j4269K1561J4455k5944k2890K5088
$$ 26636 7152 -18522 -26690 3647 10497 -213 -14482 7079 21534 -4410 -27300 -2212
15911b212J7580j1169r378pJ0688n8N796K7999K667k0165m0604L588j0321K812
$$ -2212 15368 4199 -5179 -5186 5502 5444 11240 39239 41906 21741 -18863 -15275 -25596 -22784
15897b2784L5125J36n5167j9367K7996M0184j0079J1177k5851j9282j376N1072
$$ -22784 12341 12477 -42690 -62057 -34061 6123 -3956 7221 -18630 -37912 -39288 11784
15885A1784L6020J333r961k2902k51J0910K1805j7181m3048K4452m825k2449J6481
$$ 11784 47804 49137 39176 16274 16023 26933 48738 31557 -11491 12961 8136 -14313 2168
15872B168L727N758M662J9416j8518k5811p119M497n95j2608j4928J9147J5361
$$ 2168 5895 11653 16315 35731 17213 -8598 -15717 -11220 -11815 -24423 -39351 -20204 -4843
15859d843P801J0413L490k6258l7529k6593L6609J3245r370j3641l761J0656P253
$$ -4843 2958 13371 16861 -9397 -46926 -73519 -36910 -23665 -33035 -46676 -50437 -39781 -32528
15846c2528R673J0165O984n127N478m288k6083J7338L0252j8287K4186l369J551
$$ -32528 -22855 -12690 -5706 -10833 -5355 -9643 -35726 -18388 11864 -6423 17763 14394 15945
15833A5945o778l5488k125J4602j0415R125J5610k1978p589J1185J1497Q335O673
$$ 15945 9167 -26321 -28446 -13844 -24259 -15134 476 -21502 -29091 -17906 -6409 1926 8599
15820H599j8811j6141M2878K2026k6280k2354K9463K9746l7543l5509l360l989
$$ 8599 -10212 -26353 16525 38551 12271 -10083 19380 49126 11583 -23926 -27286 -31275
15808c1275K8855J3565r673j4628K9646Q176j7059j2013j2125j0103j8260L7561
$$ -31275 -2420 11145 1472 -13156 16490 24666 7607 -4406 -16531 -26634 -44894 -7333
15796g333M1389r863m7090J2345k00O805k1229l7843k3104J8800K4298L422K2903
$$ -7333 34056 24193 -22897 -10552 -10752 -3947 -25176 -63019 -86123 -67323 -43025 -39603 -16700
15783a6700k5600J6848m411J199r797l77p808j1669J42J8478j1582p299J7625
$$ -16700 -42300 -25452 -29863 -28664 -38461 -38838 -46646 -58315 -58173 -39695 -51277 -58576 -40951
15770d0951K8547k921n004k1054J7347N530j7394M639K0081j4103J122K0043J3779
$$ -40951 -12404 -15325 -20329 -41383 -24036 -18506 -35900 -31261 -11180 -25283 -24161 -4118 9661
15757I661J1187l4358k0003J6265P621J7177L3987k397j3386j2248k8843k065
$$ 9661 20848 -13510 -33513 -17248 -9627 7550 41537 39140 25754 13506 -15337 -17402
15745a7402m694m291J9649K149k917m300o271m781R177k911J1552j0522J874K7450
$$ -17402 -22096 -26387 -6738 -4589 -7506 -11806 -18077 -22858 -13681 -16592 -5040 -15562 -13688 13762
15731A3762j2285j4563o983Q125J8780R522j862k6297j5435k9696j1183K0329
$$ 13762 1477 -13086 -20069 -11944 6836 16358 14496 -11801 -27236 -56932 -68115 -47786
15719d7786K2344K8685K7137J1450l4114R087K6303J823k0643p533K4675J1273
$$ -47786 -25442 3243 30380 41830 7716 16803 43106 44929 24286 16753 41428 52701
15707E2701j6400l7141J0529K1608p389J7283K38k9182j8729k102l117m86n905
$$ 52701 36301 -840 9689 31297 23908 41191 41429 12247 -6482 -8584 -11701 -12187 -18092
15694a8092M867m045j8860N849Q405J9593j4345P61J8320J9551J998l6094k8831
$$ -18092 -13225 -17270 -36130 -30281 -21876 -2283 -16628 -15867 2453 22004 24002 -12092 -40923
15681d0923M92J3949J9889J4535j1287k1340k4018k6671j3826K7136L1196J7598
$$ -40923 -40431 -26482 -6593 7942 -3345 -24685 -48703 -75374 -89200 -62064 -30868 -13270
15669a3270J6705j0114M973j014k8831J1548L2242J5214P813J0484j7329k2539
$$ -13270 3435 -6679 -1706 -2720 -31551 -20003 12239 27453 35266 45750 28421 5882
15657E882j5679k5563Q296M824j0880K0522j951j697K0805K7259j7145j8032P402
$$ 5882 -9797 -35360 -27064 -22240 -33120 -12598 -14549 -16246 4559 31818 14673 -3359 4043
15644D043R15j2849j7950K9090L3899j8261j3204J6647l315q589p268J1603j765
$$ 4043 4958 -7891 -25841 3249 37148 18887 5683 22330 19015 10426 3158 14761 12996
15631A2996J5997k7243k2541j5254P089J0177L524J8424K4518M402j8185o40l917
$$ 12996 28993 1750 -20791 -36045 -28956 -18779 -15255 3169 27687 32089 13904 13264 9347
15618I347R10q061p154m519R877n213j6018J4918O878J5294k2496k4692r961P004
$$ 9347 10257 2196 -4958 -9477 400 -4813 -20831 -5913 965 16259 -6237 -30929 -40890 -33886
15604c3886p279K1870q353j2135m7J2567l784j495R561J5525J4574J6156j64j2035
$$ -33886 -41165 -19295 -27648 -39783 -39830 -27263 -31047 -32542 -22981 -7456 7118 23274 23110 11075
15590A1075j4644q234M563O618K009J8225l0508n532J8874q255q086r738Q15K266
$$ 11075 -3569 -11803 -7240 -622 1387 19612 -10896 -16428 2446 -5809 -13895 -23633 -22818 -20552
15576b0552L2428p02M906M448l355k3290q587r408k333n383J3966M3940m24j541
$$ -20552 11876 11174 16080 20528 17173 -6117 -14704 -24112 -26445 -31828 -17862 26078 25654 24113
15562B4113K2141o174j0495J0264J0417p626j6731k4158j5022L8282J7148o4651
$$ 24113 46254 40080 29585 39849 50266 42640 25909 1751 -13271 25011 42159 -22492
15550b2492l2970J7134j0291j3517J2649P839K0333K4359J0296k3896K528M6916
$$ -22492 -55462 -38328 -48619 -62136 -49487 -41648 -21315 3044 13340 -10556 -8028 38888
15538C8888K5333l9037k4176j7019j7189M438N026k1505J8590R448J705K6387
$$ 38888 64221 25184 1008 -16011 -33200 -28762 -23736 -45241 -26651 -17203 -15498 10889
15526A0889K3148K4350J6906m4740j3565k52R89j5466l2898J1305K5496J4177
$$ 10889 34037 58387 75293 30553 16988 16736 17725 2259 -30639 -19334 6162 20339
15514B0339J8384J2474k8267j8106j5383J8407J2302O759N818p423j3417k2545
$$ 20339 38723 51197 22930 4824 -10559 7848 20150 26909 32727 25304 11887 -10658
15502a0658m7187j171O7816K2183l6934k2160J633J7817K897M281J0947k132L0602
$$ -10658 -57845 -59016 8800 30983 -5951 -28111 -26478 -8661 -5764 -1483 9464 7332 37934
15489C7934j1550j7666P665j2471j3961m778L2221K2649J2735k5306Q421J3320
$$ 37934 26384 8718 16383 3912 -10049 -14827 17394 40043 52778 27472 35893 49213
15477D9213o866k1243R732n240m733N516K31J5915j5904L015k7189l8452M059
$$ 49213 42347 21104 30836 25596 20863 26379 26610 42525 26621 29636 2447 -36005 -31946
15464c1946J5856M5037p200n4157j8184J2282K3481N201k2278P412q633K9983
$$ -31946 -16090 28947 21747 -32410 -50594 -38312 -14831 -9630 -31908 -24496 -33129 -3146
15452c146M4038O707l5225k6586M73J771R957J0216j9131K1203j4359J2889K1800
$$ -3146 40892 47599 12374 -14212 -13739 -11968 -2011 8205 -10926 10277 -4082 8807 30607
15439C0607j3215l8249j3720R688J2064J7426j216J0930J3488m46P838q827K380
$$ 30607 17392 -20857 -34577 -24889 -12825 4601 3385 14315 27803 27357 35195 26368 28748
15426B8748j123k5723k9733l7088J4274R037O503K472p57M614J2006R8j2130O569
$$ 28748 27625 1902 -27831 -64919 -50645 -41608 -35105 -32633 -33390 -28776 -16770 -16672 -28802 -22233
15412b2233R154K5120k2210P969M833J0721J4726o12K406j105k4497K26K6784
$$ -22233 -13079 12041 -10169 -2200 2633 13354 28080 27468 29874 28769 4272 4498 31282
15399C1282j227P190k960j8165j742J3528J0111j8653n859J4620j1517k6247K657
$$ 31282 30055 37245 34285 16120 14378 27906 38017 19364 13505 28125 16608 -9639 -6982
15386f982J1778R09J0748J438j6417m047J9372J0352k9225k8171J4927M0973R880
$$ -6982 4796 5705 16453 17891 1474 -2573 16799 27151 -2074 -30245 -15318 25655 35535
15373C5535L290l173m1550o917J7587J8987J7481j4510r718j6506j5055j62J0694
$$ 35535 38825 35652 -5898 -12815 4772 23759 41240 26730 17012 506 -14549 -14711 -4017
15360d017J0528o484J7333j419k4750j9782K8560L4780j8741k1184J203j1278
$$ -4017 6511 27 17360 15941 -8809 -28591 -31 34749 16008 -5176 -3973 -15251
15348a5251m380J6682J9666K5209k6197N010M454l4808L839q846k1239k4803r486
$$ -15251 -19631 -2949 16717 41926 15729 20739 25193 -9615 -5776 -14622 -35861 -60664 -70150
15335g0150J0688J6139K1244l498j2564L6683N119j8851J0132J166j2377m762
$$ -70150 -59462 -43323 -22079 -25577 -38141 -1458 3661 -15190 -5058 -3892 -16269 -21031
15323b1031J4952L740R700j5670n439N850m207J154J1844J4735j1466j1029p832
$$ -21031 -6079 -2339 7361 -8309 -13748 -7898 -12105 -10951 893 15628 4162 -6867 -14699
15310a4699k2886M3498L2040l4774n1769K3501J8972j5984K5886j2098n2211K555
$$ -14699 -37585 5913 37953 3179 -48590 -25089 -6117 -22101 3785 -8313 -60524 -57969
15298e7969L1163L3321j3879N763J2163K2205k8721J477Q65l4904K833R549m2525
$$ -57969 -26806 6515 -7364 -1601 10562 32767 4046 5523 6388 -28516 -25683 -16134 -58659
15285e8659k232N260P062M289K2113M3643J3523p946m687J9704J1479m0635l8319
$$ -58659 -60891 -55631 -48569 -44280 -22167 21476 34999 27053 22366 42070 53549 12914 -25405
15272b5405M4972N420r369n763r007k9050k0215K4900L7266O3678K5608j4844
$$ -25405 19567 24987 15618 9855 848 -28202 -48417 -23517 13749 77427 103035 88191
15260H8191k9729J4217J0602j6196k4887k5171o619J3440k5939m6211m205K1296
$$ 88191 58462 72679 83281 67085 42198 17027 10408 23848 -2091 -48302 -52507 -31211
15248c1211J75J1162j8597n100K2139K5546J4887j187k083p985k7285l911j4313
$$ -31211 -31036 -19874 -38471 -43571 -21432 4114 19001 17814 15731 7746 -19539 -23450 -37763
15235c7763L940J6794K3319Q433K065k7589J111M0484J8377j1235k2576l3438
$$ -37763 -33823 -17029 6290 14723 16788 -10801 -9690 30794 49171 37936 15360 -18078
15223a8078K1917J7648k399j6406r483n273N946r930N603L976r247j1154j4034
$$ -18078 3839 21487 19088 2682 -6801 -12074 -6128 -16058 -10455 -6479 -15726 -26880 -40914
15210d0914O289L7190j662j9015p413j1638K174K6584J2502J839k372R517n42
$$ -40914 -34625 2565 903 -18112 -25525 -37163 -34989 -8405 4097 5936 3564 13081 12539
15197A2539p635l4551l4000L39K0502L1868o432L2326J5951l4086L847o322m265
$$ 12539 4904 -29647 -63647 -63308 -42806 -10938 -17370 14956 30907 -3179 668 -5654 -9919
15184i919J1067j6612k4258Q66K9231J8380n351j3118j0960q675J8942J4877j187
$$ -9919 1148 -15464 -39722 -38856 -9625 8755 3404 -9714 -20674 -29349 -10407 4470 3283
15171C283J7398K3598k6833l1231o95L4602l450k8468k0986L0699L5291k235j4695
$$ 3283 20681 44279 17446 -13785 -14480 20122 16672 -11796 -32782 -2083 33208 30973 16278
15158A6278k027L9856M206r601m2477l2788K0572K541K401J126J6983L519j0013
$$ 16278 14251 54107 58313 48712 6235 -26553 -5981 -3440 -1039 87 17070 20589 10576
15145A0576l834K7527P151l5837k0033O558M0988K4090r176n2422k5149L4547
$$ 10576 6742 34269 41420 5583 -14450 -7892 33096 57186 48010 -4412 -29561 4986
15133D986M591k0853L5045M1345P026l5555k0811q190k4113j2903K459J574J4463
$$ 4986 9577 -11276 23769 65114 72140 36585 15774 7584 -16529 -29432 -26973 -25399 -10936
15120a0936K2475J0705o67j4900P353k6348L161J7447Q503j7126O974K1062J7325
$$ -10936 11539 22244 21577 6677 14030 -12318 -9157 8290 16793 -333 6641 27703 45028
15107D5028j696j6601l2402j2524J6749j319o78J2253k5884l4676l195J5952q929
$$ 45028 43332 26731 -5671 -18195 -1446 -2765 -3443 8810 -17074 -51750 -54945 -38993 -47922
15094d7922P159J3900J6783J5561J4951k0683r675L0321Q534k728j4210p938k4686
$$ -47922 -40763 -26863 -10080 5481 20432 -251 -9926 20395 28929 26201 11991 4053 -20633
15081b0633k7843N080P322J8562L3632J770j5102L087J6764n518k0315k176k6056
$$ -20633 -48476 -43396 -36074 -17512 16120 17890 2788 5875 22639 17121 -3194 -5370 -31426
15068c1426j3402L1646J3299j0906J8882N057l39j1012J4149j723l1642j2332
$$ -31426 -44828 -13182 117 -10789 8093 13150 12811 1799 15948 14225 -17417 -29749
15056b9749M571l1711j2886J0357J6117J0984Q423Q253j7094k3016k784K6436
$$ -29749 -25178 -56889 -69775 -59418 -43301 -32317 -23894 -15641 -32735 -55751 -58535 -32099
15044c2099K1107J3267n764j0345J661k191K1720L1126k5573m3715j6801K8882
$$ -32099 -10992 2275 -3489 -13834 -12173 -14364 7356 38482 12909 -30806 -47607 -18725
15032a8725L5336j221j9370M012j7274p797L5927J1011k9322k2512K3086J6575
$$ -18725 16611 15390 -3980 32 -17242 -25039 10888 21899 -7423 -29935 -6849 9726
15020I726L994L9253K2396k2583j983j238j0925k425R233j5643l1566j6248J9478
$$ 9726 13720 52973 75369 52786 50803 49565 38640 36215 45448 29805 -1761 -18009 1469
15007A469P369M566L3331l3674l0820o260J9641O054L451J2845o98m180q10J849
$$ 1469 8838 13404 46735 13061 -17759 -24019 -4378 1676 5127 17972 17274 13094 12284 14133
14993A4133j8704p270J3915j1727K4581J8874j5329j3253J2690k3358k1987J1218
$$ 14133 -4571 -11841 2074 -9653 14928 33802 18473 5220 17910 -5448 -27435 -16217
14981a6217J3892O854j929N903k6684l607Q102K3623K5938j8516k8394L610J4684
$$ -16217 -2325 4529 2600 8503 -18181 -21788 -13686 9937 35875 17359 -11035 -7425 7259
14968G259O776N557k0999k8602m498L2722J7175m909o123j2079k1072J9169k32
$$ 7259 14035 19592 -1407 -30009 -34507 -1785 15390 10481 4358 -7721 -28793 -9624 -9856
14955i856j3219Q275Q651j7859j846k3142K0648L561J195j0071j8383L1421K4677
$$ -9856 -23075 -14800 -6149 -24008 -25854 -48996 -28348 -24787 -23592 -33663 -52046 -20625 4052
14942D052j04O888j1513k4879P190J9541r684k9190O115K4576n469l5197N537
$$ 4052 3948 10836 -677 -25556 -18366 1175 -8509 -37699 -31584 -7008 -12477 -47674 -42137
14929d2137K418J1068J8343L185j1812n731k040J9309o037n371K3540o555O167
$$ -42137 -39719 -28651 -10308 -7123 -18935 -24666 -26706 -7397 -13434 -18805 4735 -1820 4347
14916D347m558j5595j1872N503J9043n731j6413j1671J0376J8443K5309o709J6570
$$ 4347 -211 -15806 -27678 -22175 -3132 -8863 -25276 -36947 -26571 -8128 17181 10472 27042
14903B7042J1786m1472k6328m361J2476k0874k3789K407K3128j0601o648L3573
$$ 27042 38828 -2644 -28972 -33333 -20857 -41731 -65520 -63113 -39985 -50586 -57234 -23661
14891b3661n335j4621K5783K7713J4408j1265j5601J0606r800k9039k0777P937
$$ -23661 -28996 -43617 -17834 9879 24287 13022 -2579 8027 -1773 -30812 -51589 -43652
14879d3652K6784K2037r00j4113j2888j0788m361j0988J9954J4389R432O414J2846
$$ -43652 -16868 5169 4269 -9844 -22732 -33520 -37881 -48869 -28915 -14526 -5094 1320 14166
14866A4166K252k1380J3038J0893J7125j3772l7094l0994m344J2116J4493j018
$$ 14166 16418 -4962 8076 18969 36094 22322 -14772 -45766 -50110 -37994 -23501 -24519
14854b4519M217O958k0238J1513N097J2188J3538r495j61P754j4831k0788J5982
$$ -24519 -20302 -13344 -33582 -22069 -16972 -4784 8754 -741 -902 6852 -7979 -28767 -12785
14841a2785O808j0166j2670K1676J2091j2471P240q837L4601J9218l5834k5250
$$ -12785 -5977 -16143 -28813 -7137 4954 -7517 -277 -9114 25487 44705 8871 -16379
14829a6379Q294j1127K4456j0936R036R043m812L079L8185J8578j6045p800m744
$$ -16379 -8085 -19212 5244 -5692 3344 12387 7575 10654 48839 67417 51372 43572 38828
14816C8828l4456q141L8457L155k009R770M713l266k6570m054R882j0748J3634
$$ 38828 4372 -3769 34688 37843 35834 45604 50317 47051 20481 16427 26309 15561 29195
14803B9195j1479r067J9938j1800J431k784k9860r165K8411j013j8960j3145j233
$$ 29195 17716 8649 28587 16787 18218 15434 -14426 -23591 4820 3807 -15153 -28298 -29531
14790b9531K5129k4317j0462R75j0281M908l863l484L5082J0773L984M5219J1895
$$ -29531 -4402 -28719 -39181 -38206 -48487 -43579 -47442 -50926 -15844 -5071 -1087 44132 56027
14777E6027l3520j5981l5603P237K535J1681N130J8385K602K0633j5089k3581
$$ 56027 22507 6526 -29077 -21840 -19305 -7624 -2494 15891 18493 39126 24037 456
14765D56j5367j9156J3843K1491J284J4728J6104q625j4350r761k8573o541L1078
$$ 456 -14911 -34067 -20224 1267 2551 17279 33383 24758 10408 647 -27926 -34467 -3389
14752c389K7034N949J1596o345j9492k9304m267Q201m12J7473o049k3622q933
$$ -3389 23645 29594 41190 34845 15353 -13951 -18218 -10017 -10429 7044 995 -22627 -31560
14739c1560j9414j2275N667L196Q286m5258N568J8854L2875K2597r137o806L571
$$ -31560 -50974 -63249 -57582 -54386 -46100 -91358 -85790 -66936 -34061 -11464 -20601 -27407 -23836
14726b3836l836J6885J3398l621k2627n293q106j5011Q390N1590q630p896m021
$$ -23836 -27672 -10787 2611 -1010 -23637 -28930 -37036 -52047 -43657 7933 -697 -8593 -12614
14713a2614J0565j2935j0603K2886j0220j6080J0230J5621N890L834l5403k198
$$ -12614 -2049 -14984 -25587 -2701 -12921 -29001 -18771 -3150 2740 6574 -28829 -31027
14701c1027Q541K0757J6603q415q232j1546k3278J7890N0080k0850l1269N210
$$ -31027 -22486 -1729 14874 6459 -1773 -13319 -36597 -18707 31373 10523 -20746 -15536
14689a5536p114j3827J1116K1664k859J3006p899m428O26M307p274M741Q61q16
$$ -15536 -22650 -36477 -25361 -3697 -6556 6450 -1449 -5877 -5251 -944 -8218 -3477 -2616 -3432
14675c432k8680J1663j2923P290K2341r173l213M492K0715p842j9645o782n322
$$ -3432 -32112 -20449 -33372 -26082 -3741 -12914 -16127 -11635 9080 1238 -18407 -25189 -30511
14662c0511K0589Q562J4628L897r026k6550O360J056K7442j7158K126J7999R295
$$ -30511 -9922 -1360 13268 17165 8139 -18411 -12051 -10995 16447 -711 1415 19414 28709
14649B8709l0418j0983l0022m763K508O161J5150j8850o354j2899J7040k0693
$$ 28709 -1709 -12692 -42714 -47477 -44969 -38808 -23658 -42508 -48862 -61761 -44721 -65414
14637f5414j0222K4818K6575o458k489J0830M903L721J8662L377j2466j6148p80
$$ -65414 -75636 -50818 -24243 -30701 -33190 -22360 -17457 -13736 4926 8303 -4163 -20311 -21091
14624b1091K5269K628k2112k7457r710N065r984M6821P597k2970k4519m866J3369
$$ -21091 4178 6806 -15306 -42763 -52473 -47408 -57392 -10571 -2974 -25944 -50463 -55329 -41960
14611d1960L1500J2170P5L940L046J4383j5617k9669J1094R2j3268j1870o229
$$ -41960 -10460 1710 1785 5725 8771 23154 7537 -22132 -11038 -10946 -24214 -36084 -42313
14598d2313r684j3410J6541K6671J8916q622J9271L1760O211j4585J6513N483
$$ -42313 -51997 -65407 -48866 -22195 -3279 -11901 7370 39130 45341 30756 47269 52752
14586E2752k4011k4420k8422j1654K2669R669p542j0987q937O010J9468J7365
$$ 52752 28741 4321 -24101 -35755 -13086 -3417 -10959 -21946 -30883 -24873 -5405 11960
14574A1960J505j7434J0115j309J1952n397k4413k0677L244K481P099n294M18
$$ 11960 13465 -3969 6146 4837 16789 11392 -13021 -33698 -30454 -27973 -20874 -26168 -25750
14561b5750j854l487M887J8437n68K0164J5413Q705K2908O67K1282j7210k9364
$$ -25750 -27604 -31091 -26204 -7767 -8335 11829 27242 35947 58855 59522 80804 63594 34230
14548C4230j2242m2368k4106K2288L3344j8794j5754j5744j4021K4715K7541M8052
$$ 34230 21988 -20380 -44486 -22198 11146 -7648 -23402 -39146 -53167 -28452 -911 47141
14536D7141o140Q007k3672k4266k2171j3678O674L1373K7091k4980J654r198q104
$$ 47141 41001 49008 25336 1070 -21101 -34779 -28105 3268 30359 5379 7033 -2165 -10269
14523a0269R214L8108M2364j6730l0105k1052o134R21j3819n19K7732o016k7686
$$ -10269 -1055 37053 79417 62687 32582 11530 5396 6317 -7502 -8021 19711 13695 -13991
14510a3991k1219M3884L5107Q569m58P90l5306k3687K4623J5738k3069o388L0949
$$ -13991 -35210 8674 43781 52350 51892 52682 17376 -6311 18312 34050 10981 4593 35542
14497C5542q12l6586J0238L4997j3190K0621K6773k6753k6510n820p340j3381
$$ 35542 34730 -1856 8382 43379 30189 50810 77583 50830 24320 18500 11160 -2221
14485b221j0682n557P617k1933R104J2860j2973m523K2074J2929j6405l35M156
$$ -2221 -12903 -18460 -10843 -32776 -23672 -10812 -23785 -28308 -6234 6695 -9710 -10045 -5889
14472e889k133n35j147j9032K0054j0741q82K2442J7303j7034k3636K3907K0290
$$ -5889 -8022 -8557 -9704 -28736 -8682 -19423 -20305 2137 19440 2406 -21230 2677 22967
14459B2967J0269L72j7906j7249J6761L3587o373o498j5883l6352J8777J7581
$$ 22967 33236 33608 15702 -1547 15214 48801 42428 35930 20047 -16305 2472 20053
14447B0053l0986j533j4168m574J8726J0024j2115j665L323Q576L062r05N575
$$ 20053 -10933 -12466 -26634 -31208 -12482 -2458 -14573 -16238 -12915 -4339 -1277 -2182 3393
14434C393J087K5403j6947j1754m990P818L033j7897j6222M745j3657r865M014
$$ 3393 4480 29883 12936 1182 -3808 4010 7043 -10854 -27076 -22331 -35988 -45853 -41839
14421d1839R610K1644M654l568j8988p310N020J9460K6597m968k3321K4335L5346
$$ -41839 -32229 -10585 -5931 -9499 -28487 -35797 -30777 -11317 15280 10312 -13009 11326 46672
14408D6672j6476j9177k9020n592L1675J2527j866j2022L37q487J0619j2071j5342
$$ 46672 30196 11019 -18001 -23593 8082 20609 18743 6721 7058 -1429 9190 -2881 -18223
14395a8223j0860k968m45L4192L4978n700lR009l654n0770Q995J8310o56M8186
$$ -18223 -29083 -32051 -32496 1696 36674 30974 30971 39980 36326 -14444 -5449 12861 12205 60391
14381F0391K2556k2741j7927k922j8941O87J0624Q160j8062l7900o080o934j786
$$ 60391 82947 60206 42279 39357 20416 21103 31727 39887 21825 -16075 -22155 -29089 -30875
14368c0875o20m858K8718L4436J1843j2652k6166j6777j5550M221n470O204R987
$$ -30875 -31495 -36353 -7635 26801 38644 25992 -174 -16951 -32501 -28280 -33750 -27546 -17559
14355a7559K887J3966k9445J1879m906m356q57o829j3235r394M2254J0830n224
$$ -17559 -14672 -706 -30151 -18272 -23178 -27534 -28391 -35220 -48455 -57849 -15595 -4765 -9989
14342i989J4517j373K4888K1065J4275m1876j7535Q909k7418o369m986J685Q126
$$ -9989 4528 3155 28043 49108 63383 21507 3972 12881 -14537 -20906 -25892 -24207 -16081
14329a6081m627n307L7636J9451q362n1152L476J8953J0529r173J1315N807q516
$$ -16081 -20708 -26015 11621 31072 22710 -28442 -24966 -6013 4516 -4657 6658 12465 3949
14316C949r556J6809j7944l7306j220K9312j934J2406J5501k850l4827m783k0008
$$ 3949 -5607 11202 -6742 -44048 -45268 -15956 -17890 -5484 10017 7167 -27660 -32443 -52451
14303e2451o736j0484K2368L5526K2493M142J262r080j0804L971L536K7883q059
$$ -52451 -59187 -69671 -47303 -11777 10716 14858 16120 7040 -3764 207 3743 31626 23567
14290B3567j8099r759r50J2213J3312o290Q334J2559N114j5529l3512k0761J4546
$$ 23567 5468 -4291 -5241 6972 20284 13994 22328 34887 40001 24472 -9040 -29801 -15255
14277a5255p7j5825M471J7425J7318J9786j693l6492j1026j0410J5874L3927k3709
$$ -15255 -15332 -31157 -26686 -9261 8057 27843 26150 -10342 -21368 -31778 -15904 18023 -5686
14264e686k595N048Q781J0943l4758j9892J3432L5638k0112J27R985K6606j1426
$$ -5686 -8281 -3233 5548 16491 -18267 -38159 -24727 10911 -9201 -9074 911 27517 16091
14251A6091J8313o460j1449K455p623l6508l4279J9017o072n579j6206J2714M214
$$ 16091 34404 27944 16495 18950 11327 -25181 -59460 -40443 -46515 -52094 -68300 -55586 -51372
14238e1372K2987N2039K2413K6573n862l011k2344P671l0841k1243j5234j321
$$ -51372 -28385 23654 46067 72640 66778 63767 41423 49094 18253 -2990 -18224 -19545
14226a9545J1862j3191r183L186m946J2912J5307K8652k4378n589M454J5108q138
$$ -19545 -7683 -20874 -30057 -26871 -31817 -18905 -3598 25054 676 -4913 -459 14649 6511
14213F511j624L682l734j7139N056J7275R825p771j6501j4977O986K654L8596
$$ 6511 4887 8569 4835 -12304 -7248 10027 19852 12081 -4420 -19397 -12411 -9757 28839
14200B8839o208o278k8811l5768M811q249o341J0776K1033N632Q717J2793j5499
$$ 28839 22631 16353 -12458 -48226 -43415 -51664 -58005 -47229 -26196 -20564 -11847 946 -14553
14187a4553j3167P125k2378j3112N251K5068j170k4777Q324k980m559K6144j3829
$$ -14553 -27720 -20595 -42973 -56085 -50834 -25766 -26936 -51713 -43389 -46369 -50928 -24784 -38613
14174c8613k3691K7606J6806k286k5613k1399m66J6170j4267N903J7204L2796
$$ -38613 -62304 -34698 -17892 -20178 -45791 -67190 -67656 -51486 -65753 -59850 -42646 -9850
14162i850J964l168L2882J3349q263j8978k5644k0444Q552M878j647q744K8655
$$ -9850 -7886 -11054 21828 35177 26914 7936 -17708 -38152 -29600 -24722 -26369 -35113 -6458
14149f458M0020J3880k7362j4299j5901j5759O934K586K3305J0433J9543K724
$$ -6458 33562 47442 20080 5781 -10120 -25879 -18945 -16359 6946 17379 36922 39646
14137C9646j1229k2933j6505J5924K640R456R327j8015m199r236J2901K5127j0895
$$ 39646 28417 5484 -11021 4903 7543 16999 26326 8311 4112 -5124 7777 32904 22009
14124B2009k8858j1481K5426o49r127Q673J2441J0373j4136j3950k0455k7764
$$ 22009 -6849 -18330 7096 6447 -2680 5993 18434 28807 14671 721 -19734 -47498
14112d7498J3462k14j0012j2999J6014K7929L3487K4342j893j3426N038k5208
$$ -47498 -34036 -34250 -44262 -57261 -41247 -13318 20169 44511 42618 29192 34230 9022
14100I022k448p740m860j3968K3401M7919l555j8209n035o94K5318J755j0806
$$ 9022 6574 -1166 -6026 -19994 3407 51326 47771 29562 24527 23833 49151 50906 40100
14087D0100j1778M488k3576L620j6284l984O437N20J6199j5156J6229l2116j7338
$$ 40100 28322 32810 9234 12854 -3430 -7414 -977 -457 15742 586 16815 -15301 -32639
14074c2639k221k6843J5272K8117Q379Q68J1167k2555N312J2466p237J4198k504
$$ -32639 -34860 -61703 -46431 -18314 -9935 -9067 2100 -20455 -15143 -2677 -9914 4284 1780
14061A780O877l8771k2254L4115J3539J7841N110J6937J1705m3198l4324K8991
$$ 1780 8657 -30114 -52368 -18253 -4714 13127 18237 35174 46879 3681 -30643 -1652
14049a652J5427J2285k0046m84K3125J0064j4131j1108R543Q376r1r869j5251
$$ -1652 13775 26060 6014 5530 28655 38719 24588 13480 23023 31399 31308 21439 6188
14036F188K6612j8516k4221O370l484k0755j0766K0420R637j020k4971j9172M730
$$ 6188 32800 14284 -9937 -3567 -7051 -27806 -38572 -18152 -8515 -9535 -34506 -53678 -48948
14023d8948O471k431K4439L1690m998L130J714j8491k6290m230Q889K7261M474
$$ -48948 -42477 -44908 -20469 11221 6223 9353 11067 -7424 -33714 -37944 -29055 -1794 2680
14010B680J8824Q082k4189j9227K4125o295k1966J7473J8762j3815k5789p012
$$ 2680 21504 29586 5397 -13830 10295 4000 -17966 -493 18269 4454 -21335 -28347
13998b8347j4453r224j9580K5600M5703K639Q185J8604k3465n3936j2680K3397
$$ -28347 -42800 -52024 -71604 -46004 -301 2338 10523 29127 5662 -48274 -60954 -37557
13986c7557n160P202K5971j2539q441n486K5639L1067K9872j8584k566M111J578
$$ -37557 -42717 -35515 -9544 -22083 -30524 -36010 -10371 20696 50568 31984 29418 33529 35107
13973C5107k7411M63O170j9584j0979K462J984l811p144P656j1772n195K5440
$$ 35107 7696 8159 14329 -5255 -16234 -13772 -11788 -15599 -22743 -15087 -26859 -32054 -6614
13960f614K4473P765j9229J9984K258k7966J9115J3687J0894P979j4116k8830
$$ -6614 17859 25624 6395 26379 28637 671 19786 33473 44367 52346 38230 9400
13948I400K608l152k7363r889M6790J4968L325N978j3442j721m3004j4806K487
$$ 9400 12008 8856 -18507 -28396 18394 33362 36687 42665 29223 27502 -15502 -30308 -27821
13935b7821K8227L4398j340j7286r679j0491j231M258l650J1938M508j8703j9265
$$ -27821 406 34804 33464 16178 6499 -3992 -5223 -965 -4615 7323 11831 -6872 -26137
13922b6137M197L7313L6472J4222j0824k5217m0914K3310j8814L4368P494k3861
$$ -26137 -21940 15373 51845 66067 55243 30026 -10888 12422 -6392 27976 35470 11609
13910A1609j5157J1712R372L660j3318k3674P986j6651j8218P86r096K0171L1665
$$ 11609 -3548 8164 17536 21196 7878 -15796 -7810 -24461 -42679 -41893 -50989 -30818 847
13897H47J8922j1154l1762K2641K0106o363O489Q621m113q28k1399l4770Q677
$$ 847 19769 8615 -23147 -506 19600 13237 19726 28347 24234 23406 2007 -32763 -24086
13884b4086k3950J656J2308O158L3469M517j0433J309l5715J759K0730K928M8226
$$ -24086 -48036 -46380 -34072 -27914 5555 10072 -361 948 -34767 -33008 -12278 -9350 38876
13871C8876K6641j8497m0042l3284k996J8764J5026J4243J3382J471j383K0716
$$ 38876 65517 47020 6978 -26306 -29302 -10538 4488 18731 32113 33584 32201 52917
13859E2917m5496l1767K210K0411J5660k7860k4811o907k1544N0480K3230K9319
$$ 52917 7421 -24346 -22136 -1725 13935 -13925 -38736 -45643 -67187 -16707 6523 35842
13847C5842L2820k1496j5189k9927k5298K4438L4164J0286N55k6350Q919l5702
$$ 35842 68662 47166 31977 2050 -23248 1190 35354 45640 46195 19845 28764 -6938
13835f938J8762L5487k41n9256j3191J0300k834J4849K2067M206J247o327K745
$$ -6938 11824 47311 47070 -12186 -25377 -15077 -17911 -3062 19005 23211 24458 18131 20876
13822B0876P593l203k8097k8056O904r326j8490K0645K360N139Q40K1752J8257
$$ 20876 28469 25266 -2831 -30887 -23983 -33309 -51799 -31154 -28794 -23655 -22815 -1063 17194
13809A7194O443M411P287M276K967k9606j425K2889Q354j7275m0787m054K0789
$$ 17194 23637 28048 35335 39611 42578 12972 11547 34436 42790 25515 -15272 -19326 1463
13796A463m295p358k362O550L4948r791j1419J143O171R639j1147j2981j1216
$$ 1463 -2832 -10190 -12552 -6002 28946 19155 7736 8879 15050 24689 13542 561 -10655
13783a0655j3013j185L1656K1475m614k240O805K6543l826l2230j4260m773j5408
$$ -10655 -23668 -24853 6803 28278 23664 21424 28229 54772 50946 18716 4456 -317 -15725
13770a5725k9990J2265M4190k536L0090K174k9368k8081J4997J1516j8100j4355
$$ -15725 -45715 -33450 10740 8204 38294 40468 11100 -16981 -1984 9532 -8568 -22923
13758b2923R194J5277j7882J5390l149l4307L998K3306J9431M382j6474q675j1292
$$ -22923 -13729 1548 -16334 -944 -4093 -38400 -34402 -11096 8335 12717 -3757 -12432 -23724
13745b3724l111L1363M1951j5692k4815p857j4987j2001M208J5920L752j4964
$$ -23724 -26835 4528 46479 30787 5972 -1885 -16872 -28873 -24665 -8745 -4993 -19957
13733a9957j5379K0491l735q08O142K7352m05l0960k1810N893L064K6278j4834
$$ -19957 -35336 -14845 -18580 -19388 -13246 14106 13701 -17259 -39069 -33176 -30112 -3834 -18668
13720a8668J0942J3349J5366J2404k3185j8988J6187N168J3787l289k5354J2533
$$ -18668 -7726 5623 20989 33393 10208 -8780 7407 12575 26362 23073 -2281 10252
13708A0252K2782j0728p200K1408l898k4106o501j8852N873J7777l2506k4547
$$ 10252 33034 22306 15106 36514 32616 8510 2009 -16843 -10970 6807 -25699 -50246
13696e0246K7187j7069o507L4134k0368m771l977n626J3484j701n845j994J5935
$$ -50246 -23059 -40128 -46635 -12501 -32869 -37640 -41617 -47243 -33759 -35460 -41305 -43299 -27364
13683b7364L1299K5376r023j6727k0486p959q734L628M476L9651q939j9648K2797
$$ -27364 3935 29311 20288 3561 -16925 -24884 -33618 -29990 -25514 14137 5198 -14450 8347
13670H347L3632j2132l0295j1044J0890J6552N963P480k0506K3348P140o364r956
$$ 8347 41979 29847 -448 -11492 -602 15950 21913 29393 8887 32235 39375 33011 23055
13657B3055j3217j8234K6825J6611N792J67J3530j2500j4096l3298k6249k684
$$ 23055 9838 -8396 18429 35040 40832 40999 54529 42029 27933 -5365 -31614 -34298
13645c4298m723K8765K5426J3622k2448l0541j0252Q308K1081j5907R344J0301
$$ -34298 -39021 -10256 15170 28792 6344 -24197 -34449 -26141 -5060 -20967 -11623 -1322
13633a322j1621R079k3756J0268P165J9909N711k7964j7680j1432K8715K4881
$$ -1322 -12943 -3864 -27620 -17352 -10187 9722 15433 -12531 -30211 -41643 -12928 11953
13621A1953j2199j3130Q77L979J399K5393J542N227K6086o516n2357J536L2932
$$ 11953 -246 -13376 -12499 -8520 -7121 18272 19814 25041 51127 44611 -7746 -6210 26722
13608B6722J0938R338o609l7963o609K6704j871j2349k4882n2188p110J9107K3319
$$ 26722 37660 46998 40389 2426 -4183 22521 20650 8301 -16581 -68769 -75879 -56772 -33453
13595c3453K9567j8723l3291P937N4990j2928m5672l74m531J0018J2509K9299
$$ -33453 -3886 -22609 -55900 -47963 7027 -5901 -51573 -51947 -56478 -46460 -33951 -4652
13583d652M5329M7430n566m6726j0738m3823n4016l8200L5382L2867o776j5668
$$ -4652 40677 88107 82541 35815 25077 -18746 -72762 -110962 -75580 -42713 -49489 -65157
13571f5157Q672L8594K6292m948Q769P780R158K324k815n875l4175j5333L6451
$$ -65157 -56485 -17891 8401 3453 12222 20002 29160 31484 28669 22794 -11381 -26714 9737
13558I737J2989n434N798N745M709j7480j4531K1657q487j5186O545N843L733
$$ 9737 22726 17292 23090 28835 33544 16064 1533 23190 14703 -483 6062 11905 15638
13545A5638K3573R50j7756j1657j4302k456K4830N4377J6596j9416l3679N553
$$ 15638 39211 40161 22405 10748 -3554 -6010 18820 73197 89793 70377 36698 42251
13533D2251L35m8516k914P788k4392K2878K8374l449k3074N445J3858j4862j0625
$$ 42251 42586 -5930 -8844 -1056 -25448 -2570 25804 22355 -719 4726 18584 3722 -6903
13520f903q480K89K7763J3978j6607N596K2755j7628N821l2251m0359j8170k1217
$$ -6903 -15383 -15094 12669 26647 10040 15636 38391 20763 26584 -5667 -46026 -64196 -85413
13507h5413Q191J1539J0702L8112L4944j7278j8582k902q761q083L6648L1623
$$ -85413 -77222 -65683 -54981 -16869 18075 797 -17785 -20687 -29448 -37531 -883 30740
13495C0740m2378p19J1317L044K2752L708J03j8116k6406K357J3888l7952n931
$$ 30740 -11638 -12357 -1040 2004 24756 28464 28567 10451 -15955 -13598 290 -37662 -43593
13482d3593L9510J1208k1944k4930J5498N3105O786K0404p409j8606j1244k0858
$$ -43593 -4083 7125 -14819 -39749 -24251 28854 35640 56044 48635 30029 18785 -2073
13470b073k991K7241Q432j2838r989k4162p757J6982p734O63L677o85K3658P325
$$ -2073 -5064 22177 30609 17771 7782 -16380 -24137 -7155 -14889 -14226 -10549 -11234 12424 19749
13456A9749j0806J439J1190L2669J7709o752k8829j7124Q515k2600l5447j814
$$ 19749 8943 10382 21572 54241 71950 65198 36369 19245 27760 5160 -30287 -32101
13444c2101l3895R726r249j183O531L4729K0974J741k2719P348M9J9345l1120
$$ -32101 -65996 -56270 -65519 -66702 -60171 -25442 -4468 -2727 -25446 -18098 -18049 1296 -29824
13431b9824k52r095K1427P833r135j3599J7766j9450l0592J4722L7727L3331j7148
$$ -29824 -30076 -39171 -17744 -9911 -19046 -32645 -14879 -34329 -64921 -50199 -12472 20859 3711
13418C711J44L2846n485k3786j9096K0772P875m384J5670J7835O636m921k4113
$$ 3711 3855 36701 31216 7430 -11666 9106 16981 12597 28267 46102 52738 47817 23704
13405B3704k2520R830l856l5899j6829O490J8574R790M2971J7799o3904k2092
$$ 23704 1184 11014 7158 -28741 -45570 -39080 -20506 -10716 32255 50054 -13850 -35942
13393c5942J9732P427J0219K172n036L010m566k7749l11O118j8201L2705J7036
$$ -35942 -16210 -8783 1436 3608 -1428 1582 -2984 -30733 -31044 -24926 -43127 -10422 6614
13380F614K0840J0060o476J0382k7217k07L002q334k8127j4383J9609L7922O428
$$ 6614 27454 37514 31038 41420 14203 13996 16998 8664 -19463 -33846 -14237 23685 30113
13367C0113q964j4622j031R845r600J246l7J0901Q378L4686M847l6036k3932j5325
$$ 30113 21149 6527 5496 15341 5741 6987 6950 17851 26229 60915 65762 29726 5794 -9531
13353i531J1380j437l3673L219O505j2594N384M502J4102J5368l3o727K5100o043
$$ -9531 1849 412 -33261 -30042 -23537 -36131 -30747 -26245 -12143 3225 3192 -3535 21565 15522
13339A5522L648P108j5856j431j4306o062j2937K319K6192J1278p001k1004n228
$$ 15522 19170 26278 10422 8991 -5315 -11377 -24314 -21995 4197 15475 8474 -12530 -17758
13326a7758N557M95m990J7330j2907o717K7976j3504r367J7O222K1061p067J0263
$$ -17758 -12201 -11706 -16696 634 -12273 -18990 8986 -4518 -13885 -13868 -7646 13415 6348 16611
13312A6611k792M539j6892J4348J4486J4075p911j4599l044J1017l710j8781q901
$$ 16611 13819 18358 1466 15814 30300 44375 36464 21865 18821 29838 26128 7347 -1554
13299a554K0548J8742J5073J6567R858L958j1254l4503Q991M926j6314J816J3396
$$ -1554 18994 37736 52809 69376 79234 83192 71938 37435 46426 51352 35038 36854 50250
13286E0250k4831j2216j4080P253J3372k9070k359K9136P052L756j8166n054k220
$$ 50250 25419 13203 -877 6376 19748 -9322 -11681 17455 24507 28263 10097 5043 2823
13273B823J0349r251N0o23K3324K1673J3693k9283k4262j3228k8181Q735ok8667
$$ 2823 13172 3921 3971 3348 26672 48345 62038 32755 8493 -4735 -32916 -24181 -24187 -52854
13259e2854M448K3648l3132N467O6271N3550J8664k865k8376j3488l2442k1698
$$ -52854 -48406 -24758 -57890 -52423 13848 67398 86062 83197 54821 41333 8891 -12807
13247a2807O327R254j379j4663J1579N747L598j2753q376l056J9274j7677j7100
$$ -12807 -6480 2774 1395 -13268 -1689 4058 7656 -5097 -13473 -16529 2745 -14932 -32032
13234c2032j2556Q088J3482L3153k7415k5833J227J3557l187J556l601j1239J7687
$$ -32032 -44588 -36500 -23018 10135 -17280 -43113 -41886 -28329 -31516 -29960 -33561 -44800 -27113
13221b7113N882M422K9330J4529j6841l9462j4308K0087J4392j1129K5986J915
$$ -27113 -21231 -16809 12521 27050 10209 -29253 -43561 -23474 -9082 -20211 5775 7690
13209G690k1470l1590J9898J9516P85k2635k3967K444K711o870K2291o16O533
$$ 7690 -13780 -45370 -25472 -5956 -5171 -27806 -51773 -49329 -46618 -53488 -31197 -31813 -25280
13196b5280L2292j5257J397J5989J8922j717k9768j4129j0119k2562K5782O6951
$$ -25280 7012 -8245 -6848 9141 28063 26346 -3422 -17551 -27670 -50232 -24450 42501
13184D2501j1554j8726K1104K942j21J0909l1922j9052L88p08j1208P623K82j5381
$$ 42501 30947 12221 33325 36267 36146 47055 15133 -3919 -3531 -4239 -15447 -7824 -7542 -22923
13170b2923l569l376k8876P553L7124J1706Q300N417l3804j84R985P153o594M36
$$ -22923 -26492 -29868 -58744 -51191 -14067 -2361 5939 11356 -22448 -22632 -12647 -5494 -12088 -11652
13156a1652M082N989P982M516l800P472K1699n155J2524Q114l5063j6267K2777
$$ -11652 -7570 -1581 6401 10917 7117 14589 36288 31133 43657 51771 16708 441 23218
13143B3218K5453k8391l1029j5273J0774K9888N427m982J590p977j3139j0235
$$ 23218 48671 20280 -10749 -26022 -15248 14640 20067 15085 16675 8698 -4441 -14676
13131a4676L192M133L0509J9557j1554k1273J7792k4663r285J0629m019J9083
$$ -14676 -11484 -7351 23158 42715 31161 9888 27680 3017 -6268 4361 342 19425
13119A9425K1975N514j5960k1866j8898j2845j1018J3115L0242J4785j3311n526
$$ 19425 41400 46914 30954 9088 -9810 -22655 -33673 -20558 9684 24469 11158 5632
13107E632j5032m308o166Q864J4910j480K9960J6756P219k3799m6852j0441K2586
$$ 5632 -9400 -13708 -19874 -11010 3900 2420 32380 49136 56355 32556 -14296 -24737 -2151
13094b151J2926N573M853k2225j6539j2621p391K419N994L4459M3730j8730j8618
$$ -2151 10775 16348 21201 -1024 -17563 -30184 -37575 -35156 -29162 5297 49027 30297 11679
13081A1679k4894L7622K8512Q75m2862k1004j0629J2990L4373N138k9922q396
$$ 11679 -13215 24407 52919 53794 10932 -10072 -20701 -7711 26662 31800 1878 -6518
13069f518K5549K7709j1429k4076j1667J2702Q536m310k3575l039J3239K7996
$$ -6518 19031 46740 35311 11235 -432 12270 20806 16496 -7079 -10118 3121 31117
13057C1117l205j462L1800n56l032k2448l9107j8210K3856p889p41K5981P981
$$ 31117 27912 26450 58250 57694 54662 32214 -6893 -25103 -1247 -9136 -9877 16104 24085
13044B4085l4760Q588J2074J6548J133o796j2504J3295l294k6127m86k398J4588
$$ 24085 -10675 -2087 9987 26535 27668 20872 8368 21663 18369 -7758 -8244 -10642 3946
13031C946k3858l4252J3351J2367P564q066N86J2220k571l161J7963k382L750
$$ 3946 -19912 -54164 -40813 -28446 -20882 -28948 -28362 -16142 -18713 -21874 -3911 -6293 -2543
13018b543j7426L1324L6833K0615M032p078m95j9014M291j2735Q13j7742M239
$$ -2543 -19969 11355 48188 68803 72835 65757 65262 46248 50539 37804 38617 20875 25114
13005B5114m526J759K1655J1112n08j0092J0185M165q204r255j5529k4692j8488
$$ 25114 20588 22347 44002 55114 54606 44514 54699 58864 50660 41405 25876 1184 -17304
12992a7304Q5l2619k7075P067J3917P628N110K4360R056P004q590m7044j0392
$$ -17304 -17219 -49838 -76913 -69846 -55929 -48301 -43191 -18831 -9775 -2771 -11361 -58405 -68797
12979f8797N0616O4565J7418n7460k4390j1918j1492M7640k091l5199R558P757
$$ -68797 -18181 46384 63802 6342 -18048 -29966 -41458 6182 4091 -31108 -21550 -13793
12967a3793J7511p26R939M3762j3203l9274J975j5239m424j9569j348J6303M118
$$ -13793 3718 2992 12931 56693 43490 4216 6191 -9048 -13472 -33041 -34389 -18086 -13968
12954a3968p86j1388L7640J1697l4003q763n552L401j0137l6366J6117J302L2677
$$ -13968 -14754 -26142 11498 23195 -10808 -19571 -25123 -21722 -31859 -68225 -52108 -50806 -18129
12941a8129J4611j182R839Q384j4610n2277j4423K3640K4376J5531M378o541J4558
$$ -18129 -3518 -4700 5139 13523 -1087 -53364 -67787 -44147 -19771 -4240 138 -6403 8155
12928H155L9780K6044L941n02k3080Q794k9369l8896K0780J4798l7011k6850j0126
$$ 8155 47935 73979 77920 77418 54338 63132 33763 -5133 15647 30445 -6566 -33416 -43542
12915d3542j4877O672J7204K3383Q403k9155J4067L8020l104r314j5568j2111
$$ -43542 -58419 -51747 -34543 -11160 -2757 -31912 -17845 20175 17071 7757 -7811 -19922
12903a9922J2142O794M078J7348P631j4860J2893O210p790k2633r309J5395J3285
$$ -19922 -7780 -986 3092 20440 28071 13211 26104 32314 24524 1891 -7418 7977 21262
12890B1262k9452j6271J8911O700J710K3434j2235J4601k232n294r399P541J4485
$$ 21262 -8190 -24461 -5550 1150 2860 26294 14059 28660 26428 21134 11735 19276 33761
12877C3761p845L059J3453j2548k3972k4913k2969J9428N132J8581J2353l0345
$$ 33761 25916 28975 42428 29880 5908 -19005 -41974 -22546 -17414 1167 13520 -16825
12865a6825k703N633J045K3897j0244r681p710l4441k824o988K6632K2861J2551
$$ -16825 -19528 -13895 -12850 11047 803 -8878 -16588 -51029 -53853 -60841 -34209 -11348 1203
12852A203K4197J8553Q834o03l2233P844R770L89k0576O331K9892L0145r582l8829
$$ 1203 25400 43953 52787 52184 19951 27795 37565 37954 17378 23709 53601 83746 74164 35335
12838C5335k2333J5153j8081j8741n382J7895K2553k1071p0J3386P990l6661K290
$$ 35335 13002 28155 10074 -8667 -14049 3846 26399 5328 5258 18644 26634 -10027 -7737
12825g737K069R066j8497j5353O349j0198j4949Q329K6884j7989R12M2882Q909
$$ -7737 -5668 3398 -15099 -30452 -24103 -34301 -49250 -40921 -14037 -32026 -31114 11768 20677
12812B0677J5794K5644j2084k7574N412R925j0914O516k0525l6528j653K1115
$$ 20677 36471 62115 50031 22457 27869 37794 26880 33396 12871 -23657 -25310 -4195
12800d195j5492L4933L555m3707j2752J5211l879J1290N226K6456N567o428J4202
$$ -4195 -19687 15246 18801 -24906 -37658 -22447 -26326 -15036 -9810 16646 22213 15785 29987
12787B9987J1894k9600k3904J9530J1481k4785o101R07J7297K274J9737o269j0730
$$ 29987 41881 12281 -11623 7907 19388 -5397 -11498 -10591 6706 8980 28717 22448 11718
12774A1718J3705R08O678j0804J9861q811j1891L454q84j0734l028L4645K3641
$$ 11718 25423 26331 33009 22205 42066 33255 21364 24818 23934 13200 10172 44817 68458
12761F8458J2352j8k0642k2360K9572M5153M7940M1212M2341M8559O8310J5964
$$ 68458 80810 80792 60150 37790 67362 112515 160455 201667 244008 292567 360877 376841
12749C76841L826J7559J2882l1008p6195o5992j8541n637k0035m1192l3433L588
$$ 376841 380667 398226 411108 380100 303905 237913 219372 213735 193700 152508 119075 122663
12737A22663k2517o765k2606k1765O046K4133J8577Q795J634j7469j0998k9576
$$ 122663 100146 93381 70775 49010 55056 79189 97766 106561 108195 90726 79728 50152
12725E0152R81m252J8869L9333J219J652j9174l7418j8238J1036k832J1473M300
$$ 50152 51133 46881 65750 105083 106302 107954 88780 51362 33124 44160 41328 52801 57101
12712E7101r024J2250q910q796J3771j0991j6975j0489k6083k62R799P965J7956
$$ 57101 48077 60327 51417 42621 56392 45401 28426 17937 -8146 -8408 1391 9356 27312
12699B7312n733j8918m2970R032K1219M7946K2882r35j9696k8457j0826J4193
$$ 27312 21579 2661 -40309 -31277 -10058 37888 60770 59835 40139 11682 856 15049
12687A5049j3046p368l323N055M2078K130p011m459j496K962m749L0524J3411
$$ 15049 2003 -5365 -8688 -3633 38445 40575 33564 29105 27609 30571 25822 56346 69757
12674F9757Q187k4727r642j7904k7223k142Q612k1316l1967k606L4747K8602K4546
$$ 69757 77944 53217 43575 25671 -1552 -3694 4918 -16398 -48365 -50971 -16224 12378 36924
12661C6924J2942K716J776k5477j6858J0839r481k508j0489l0039o184L7338K4545
$$ 36924 49866 52582 54358 28881 12023 22862 13381 10873 384 -29655 -35839 1499 26044
12648B6044p52r283l1921j078P627m753L6603J0010J914m816l5232j1342N173
$$ 26044 25292 16009 -15912 -16990 -9363 -14116 22487 32497 34411 29595 -5637 -16979 -11806
12635a1806M1381l168k0488r693k5459j1492P930J6598j129o08j0186J4745K219
$$ -11806 29575 26407 5919 -3774 -29233 -40725 -32795 -16197 -17326 -17934 -28120 -13375 -11156
12622a1156M5860j9379k4154J1844k0628k0286J9233M3868K8793J943n1662J0450
$$ -11156 34704 15325 -8829 3015 -17613 -37899 -18666 25202 53995 55938 4276 14726
12610A4726L99l160N652l3614J430J8349L532k9926k6188J8255Q16k8172R521
$$ 14726 15125 11965 17617 -15997 -14567 3782 7314 -22612 -48800 -30545 -29729 -57901 -48380
12597d8380N3756l836M028p316j8457J2469M9365M314k2955j5718r729Q139l844
$$ -48380 5376 1540 5568 -1748 -20205 -7736 41629 45943 22988 7270 -2459 5680 1836
12584A836L254J8797J1336j1841J8117J8302k0356k6715p13k348J4815J0402k3243
$$ 1836 5090 23887 35223 23382 41499 59801 39445 12730 12017 9669 24484 34886 11643
12571A1643l3278j3710k808K6088K7785j5867M782P201K966J5240k0213j2320
$$ 11643 -21635 -35345 -38153 -12065 15720 -147 4635 11836 14802 30042 9829 -2491
12559b491K428M78j217P937K8110J3308q725m6866k1718l6081K4600J0453l773
$$ -2491 -63 415 -802 7135 35245 48553 39828 -7038 -28756 -64837 -40237 -29784 -33557
12546c3557K4277L7328M9943M7379M9451J8094m0419m8931m9812j6075j7734p434
$$ -33557 -9280 28048 77991 125370 174821 192915 152496 103565 53753 37678 19944 12510
12534A2510r054J6010O2662O0474m297k949k0470K7518o6J5769J0450l8508m5692
$$ 12510 3456 19466 82128 142602 138305 135356 114886 142404 142338 158107 168557 130049 84357
12521H4357n0690q945J9172r196o828n247N3598o130j8781N187R961j8628m0950
$$ 84357 33667 24722 43894 34698 27870 22623 76221 70091 51310 56497 66458 47830 6880
12508F880O452k531J7833J4574l125n962J6091K3973Q6011J15894J45953R2066
$$ 6880 13332 10801 28634 43208 40083 34121 50212 74185 160196 276090 422043 514109
12496E14109R898q4208j32608j02874n0322R491n6120m2059K1862l237k553k5552
$$ 514109 524007 439799 307191 204317 153995 163486 107366 65307 87169 83932 81379 55827
12484E5827O564j1535R325Q185l9293l7880q469K8154K9777P044J6469Q662P795
$$ 55827 62391 50856 60181 68366 29073 -8807 -17276 10878 40655 47699 64168 72830 80625
12471H0625k274k7048O590l90m668J5760k2641N74j0334q390K344R567J1087P308
$$ 80625 78351 51303 57893 57503 52835 68595 45954 46528 36194 27804 30148 39715 50802 58110
12457E8110N4442N0553J02325J56572R1105K5210k4957j10468j29359o9329l8921
$$ 58110 112552 163105 265430 422002 513107 538317 513360 402892 273533 204204 165283
12446A65283q969k7794m41l1986k6972k1083j4185K7047J2835m717l1642j4057
$$ 165283 156314 128520 128079 96093 69121 48038 33853 60900 73735 69018 37376 23319
12434B3319J068m218j3084J0139L4231K9384J8171R646n7598J3751J7489l5646
$$ 23319 24387 20169 7085 17224 51455 80839 99010 108656 51058 64809 82298 46652
12422D6652m5596N173j5387k1887L6709J9844K0841j4169o27L7745L3519K6643
$$ 46652 1056 6229 -9158 -31045 5664 25508 46349 32180 31553 69298 102817 129460
12410A29460J0621K6389l600j495j0925n0017m0671o644j4000p926J2708K7676
$$ 129460 140081 166470 162870 161375 150450 100433 59762 53118 39118 31192 43900 71576
12398G1576k4118l4890j7253L363R270j6887M452Q714M050P017j6582j278p760
$$ 71576 47458 12568 -4685 -1322 7948 -8939 -4487 4227 8277 15294 -1288 -2566 -10326
12385a0326k365K615q12J2907J2858j1535N852k780j6710N916J8222J9670M669
$$ -10326 -12691 -10076 -10888 2019 14877 3342 9194 6414 -10296 -4380 13842 33512 38181
12372C8181o911l536o677J7180N868l846K5154J8480o428l9073l7728k919N137
$$ 38181 31270 27734 21057 38237 44105 40259 65413 83893 77465 38392 664 -2255 2882
12359B882K8112K279P280q262j0619J8403k4134k6749j8035J837k208J4346L6411
$$ 2882 30994 33273 40553 32291 21672 40075 15941 -10808 -28843 -27006 -29214 -14868 21543
12346B1543L653Q02Q494J0723j6283j4373r515R81j0094q081k659K1058o668j2223
$$ 21543 25196 25998 34492 45215 28932 14559 5044 6025 -4069 -12150 -14809 6249 -419 -12642
12332a2642o64r512K8837K7174l1476j5252K0247K8492J2768j7949j275q864k9635
$$ -12642 -13306 -22818 6019 33193 1717 -13535 6712 35204 47972 30023 28748 19884 -9751
12319i751k7362l9760J1709L8503J6312r31J8808o602l4692k9579L594J6872r704
$$ -9751 -37113 -76873 -65164 -26661 -10349 -11280 7528 926 -33766 -63345 -59751 -42879 -52583
12306e2583K1267L4794j9140j0266j38J0991o796j9367K2586L700l5870r370o84
$$ -52583 -31316 3478 -15662 -25928 -26066 -15075 -21871 -41238 -18652 -14952 -50822 -60192 -60876
12293f0876O970R633j6618J5883M9556M467J9797n802r918k4843j4189k622j1050
$$ -60876 -53906 -44273 -60891 -45008 4548 9015 28812 23010 13092 -11751 -25940 -28562 -39612
12280c9612K9452J4813l171j26J1466q925k8498o932M984Q796p047J5106m007
$$ -39612 -10160 4653 1482 1356 12822 3897 -24601 -31533 -26549 -17753 -24800 -9694 -13701
12267a3701L873q509J6609K8363J4002r816n2152J3981L98j0098M5355K9118N065
$$ -13701 -9828 -18337 -1728 26635 40637 30821 -21331 -7350 -6952 -17050 28305 57423 62488
12254F2488k8116k3999Q577K16j217L866J6400R685L6j6875j6845k0686k5518
$$ 62488 34372 10373 18950 19166 17949 21815 38215 47900 47936 31061 14216 -6470 -31988
12241c1988q463J7245J6270M902Q930N562k366l4056k6874M630K2837L9505J6108
$$ -31988 -40451 -23206 -6936 -2034 6896 12458 10092 -23964 -50838 -46208 -23371 16134 32242
12228C2242j1023n794k0657j3273J2862Q477K9084R913j9302l6880j2525J2288
$$ 32242 21219 15425 -5232 -18505 -5643 2834 31918 41831 22529 -14351 -26876 -14588
12216a4588J5216j805n472k7777q111K3187P592J9552P925J7597J8158R59o973
$$ -14588 628 -1177 -6649 -34426 -42537 -19350 -11758 7794 15719 33316 51474 52433 45460
12203D5460n113J1078J5829m0917l8923l002K8188m68l728K284P868N012j7282
$$ 45460 40347 51425 67254 26337 -12586 -15588 12600 12132 8404 10688 18556 23568 6286
12190F286j4831L1339m898j2418K168K415m026R993K0195J5830k2445j6882J3388
$$ 6286 -8545 22794 17896 5478 7646 10061 6035 16028 36223 52053 29608 12726 26114
12177B6114N571L738J0798n046m1002m1069k0924M4545L2715J8060k4400n246
$$ 26114 31685 35423 46221 41175 173 -40896 -61820 -17275 15440 33500 9100 3854
12165C854J1924L821l8981k6222m679O902K1216J3533J0666K4874m1419J83L2281
$$ 3854 15778 19599 -19382 -45604 -50283 -43381 -22165 -8632 2034 26908 -14511 -14328 17953
12152A7953r091k3011k5091k1627j2037J8517J4159k121O53N096K2514j6847r482
$$ 17953 8862 -14149 -39240 -60867 -72904 -54387 -40228 -42349 -41696 -36600 -14086 -30933 -40415
12139d0415J2059r438Q294L6846K3266j5204j9522j0312K452q79j98j9203j0968
$$ -40415 -28356 -37794 -29500 7346 30612 15408 -4114 -14426 -11974 -12853 -13051 -32254 -43222
12126d3222L4322L8983k6136j9215J2990j867J5746M2M712J9137n947K0962L4933
$$ -43222 -8900 30083 3947 -15268 -2278 -4145 11601 11643 16355 35492 29545 50507 85440
12113H5440l418j5243J5766J4570L3286J6953J6714N6972J74499L19071M78725
$$ 85440 82022 66779 82545 97115 130401 147354 164068 221040 395539 714610 1193335
12102A193335L98820J83171j94242n12584l77537j87963j30212r9771m4342k0658
$$ 1193335 1592155 1775326 1581084 1068500 690963 503000 372788 273017 228675 208017
12092B08017m8778m0603L7566N217k0916p794n994m454o251j9986j5918j8626
$$ 208017 159239 118636 156202 161419 140503 132709 126715 122261 116010 96024 80106 61480
12080F1480j2963R263M035N60R623j7895l863K0932n5m0068N204K3223p446k1021
$$ 61480 48517 57780 61815 62375 71998 54103 50240 71172 71117 31049 36253 59476 52030 31009
12066C1009K288O481K2637l5043k4761O319R244K0863j6771N827J7101J6221L3805
$$ 31009 33297 39778 62415 27372 2611 8930 18174 39037 22266 28093 45194 61415 95220
12053I5220j4530m0345m370J9384K8316j5779l9182j6294J8988k5184l5826k791
$$ 95220 80690 40345 35975 55359 83675 67896 28714 12420 31408 6224 -29602 -32393
12041c2393N0459K0541N281p404k2840j99J1354J3154k7253j4981r057p963j1545
$$ -32393 18066 38607 43888 36484 13644 13445 24799 37953 10700 -4281 -13338 -21301 -32846
12028c2846N064J0804j6467l952K7034N5107K167l4000m2971k6823L4148J4867
$$ -32846 -27782 -16978 -33445 -37397 -10363 44744 46911 12911 -30060 -56883 -22735 -7868
$$ [...]
##END NTUPLES=NMR SPECTRUM
##END=
