##TITLE=Analysis number 318397
Compound Code mo 07801
Book Reference 444/116
Project Code adrs
Chemist Name howarde
##JCAMPDX= 6.0         $$ Bruker NMR JCAMP-DX V2.0
##DATA TYPE= NMR SPECTRUM
##DATA CLASS= NTUPLES
##ORIGIN= Bruker BioSpin GmbH
##OWNER= nmr
$$ XWIN-NMR		Version 3.5
$$ Tue Mar 28 09:07:52 2006 GMT Daylight Time (UT+1h)  MAYBRIDGE\nmr@NMR_250MHZ
##.OBSERVE FREQUENCY= 250.131544655141
##.OBSERVE NUCLEUS= ^1H
##.ACQUISITION MODE= SIMULTANEOUS (DQD)
##.ACQUISITION SCHEME= undefined
##.AVERAGES= 16
##.DIGITISER RES= 18
##SPECTROMETER/DATA SYSTEM= dpx250
##.PULSE SEQUENCE= zg30
##.SOLVENT NAME= CDCl3
##.SHIFT REFERENCE= (INTERNAL, CDCl3, 0, 16.522)
##AUDIT TRAIL= $$ (NUMBER, WHEN, WHO, WHERE, WHAT)
$$ ##TITLE= Audit trail, XWIN-NMR		Version 3.5
$$ ##JCAMPDX= 5.01
$$ ##ORIGIN= Bruker BioSpin GmbH
$$ ##OWNER= nmr
$$ C:\u/data/dgb/nmr/ADRS/1530/pdata/1/auditp.txt
$$ ##AUDIT TRAIL=  $$ (NUMBER, WHEN, WHO, WHERE, WHAT)
(   1,<2006-03-28 09:07:30.44 +100>,<MAYBRIDGE\nmr>,<NMR_250MHZ>,
      <created by zg, POWCHK disabled, PULCHK disabled
       configuration hash MD5:
       84 BC 41 DB A1 6E 1D 46 DA 25 12 A5 C1 ED C5 3A
       data hash MD5: 64K
       0F 8A 9E C5 22 6A 64 36 5B 4F CD A2 41 07 F1 87>)
(   2,<2006-03-28 09:07:42.91 +100>,<MAYBRIDGE\nmr>,<NMR_250MHZ>,
      <Start of raw data processing
       ef LB = 0.3 FT_mod = 6 PKNL = 1 SI = 32K 
       data hash MD5: 32K
       77 95 A6 B8 E3 0D 54 53 F5 27 21 1F 69 2A 8A A2>)
(   3,<2006-03-28 09:07:44.42 +100>,<MAYBRIDGE\nmr>,<NMR_250MHZ>,
      <apk 
       data hash MD5: 32K
       CA 01 44 D4 43 C1 CE AF 93 EA D4 80 F0 5C 38 C6>)
(   4,<2006-03-28 09:07:45.14 +100>,<MAYBRIDGE\nmr>,<NMR_250MHZ>,
      <abs ABSG = 5 
       data hash MD5: 32K
       32 57 A7 21 53 C6 A7 84 35 AC 2F 95 B2 76 54 96>)
$$ ##END=
$$ 
$$ hash MD5
$$ 3F 3E 1A 94 F4 04 87 C0 C4 92 CE 7D AD AE AF 8E
##$RELAX= 
##$RELAX= 
##$RELAX= 
##$RELAX= 
##$RELAX= 
##$RELAX= 
##$RELAX= 
$$ Bruker specific parameters
$$ --------------------------
##$DU= <C:\u>
##$EXPNO= 1530
##$NAME= <ADRS>
##$PROCNO= 1
##$TYPE= <nmr>
##$USER= <dgb>
##$AMP= (0..31)
100 100 100 100 100 100 100 100 100 100 100 100 100 100 100 100 100 100 
100 100 100 100 100 100 100 100 100 100 100 100 100 100 
##$AQSEQ= 0
##$AQ_mod= 3
##$AUNM= <au_zg>
##$AUTOPOS= <3 >
##$BF1= 250.13
##$BF2= 250.13
##$BF3= 250.13
##$BF4= 250.13
##$BF5= 500.13
##$BF6= 500.13
##$BF7= 500.13
##$BF8= 500.13
##$BYTORDA= 1
##$CFDGTYP= 0
##$CFRGTYP= 5
##$CHEMSTR= <none>
##$CNST= (0..31)
1 1 145 1 1 1 1 1 1 1 1 1 1 1 1 1 1 1 1 1 1 1 1 1 1 1 1 1 1 1 1 1 
##$CPDPRG= <>
##$CPDPRG1= <>
##$CPDPRG2= <>
##$CPDPRG3= <>
##$CPDPRG4= <mlev>
##$CPDPRG5= <mlev>
##$CPDPRG6= <mlev>
##$CPDPRG7= <mlev>
##$CPDPRG8= <mlev>
##$CPDPRGB= <>
##$CPDPRGT= <>
##$D= (0..31)
0 1 0 0 0 0 0 0 0 0.06 0 0 0 0 0 0 0.0002 0 0 0 0 0 0 0 0 0 0 0 0 0 0 
0 
##$DATE= 1143533249
##$DBL= (0..7)
120 120 120 120 120 120 120 120 
##$DBP= (0..7)
150 150 150 150 150 150 150 150 
##$DBP07= 0
##$DBPNAM0= <>
##$DBPNAM1= <>
$$ [...]
##$SUBNAM7= <"">
##$SUBNAM8= <"">
##$SUBNAM9= <"">
##$SW= 20.6930455092707
##$SWIBOX= (0..15)
0 0 3 0 0 0 0 0 0 0 0 0 0 0 0 0 
##$SW_h= 5175.983436853
##$TD= 65536
##$TD0= 1
##$TE= 294.16
##$TE2= 300
##$TE3= 300
##$TEG= 300
##$TL= (0..7)
0 120 120 120 120 120 120 120 
##$TP= (0..7)
150 150 150 150 150 150 150 150 
##$TP07= 0
##$TPNAME0= <>
##$TPNAME1= <>
##$TPNAME2= <>
##$TPNAME3= <>
##$TPNAME4= <>
##$TPNAME5= <>
##$TPNAME6= <>
##$TPNAME7= <>
##$TPOAL= (0..7)
0.5 0.5 0.5 0.5 0.5 0.5 0.5 0.5 
##$TPOFFS= (0..7)
0 0 0 0 0 0 0 0 
##$TUNHIN= 0
##$TUNHOUT= 0
##$TUNXOUT= 0
##$USERA1= <user>
##$USERA2= <user>
##$USERA3= <user>
##$USERA4= <user>
##$USERA5= <user>
##$V9= 5
##$VALIST= <valist>
##$VCLIST= <CCCCCCCCCCCCCCC>
##$VD= 0
##$VDLIST= <DDDDDDDDDDDDDDD>
##$VPLIST= <PPPPPPPPPPPPPPP>
##$VTLIST= <TTTTTTTTTTTTTTT>
##$WBST= 1024
##$WBSW= 4
##$XGAIN= (0..3)
0 0 0 0 
##$XL= 0
##$YL= 0
##$YMAX_a= 554276
##$YMIN_a= -562050
##$ZGOPTNS= <>
##$ZL1= 120
##$ZL2= 120
##$ZL3= 120
##$ZL4= 120
##$ABSF1= 16.522
##$ABSF2= -4.171173
##$ABSG= 5
##$ABSL= 3
##$ALPHA= 0
##$AQORDER= 0
##$ASSFAC= 0
##$ASSFACI= 0
##$ASSFACX= 0
##$ASSWID= 0
##$AUNMP= <proc_1d>
##$AZFE= 0.1
##$AZFW= 0.1
##$BCFW= 0
##$BC_mod= 0
##$BYTORDP= 0
##$COROFFS= 0
##$CY= 12.5
##$DATMOD= 1
##$DC= 0
##$DFILT= <>
##$DTYPP= 0
##$F1P= 14.0000005364418
##$F2P= -0.99999901652339
##$FCOR= 0.5
##$FTSIZE= 32768
##$FT_mod= 6
##$GAMMA= 0
##$GB= 0
##$INTBC= 1
##$INTSCL= 1
##$ISEN= 128
##$LB= 0.3
##$LEV0= 0
##$LPBIN= 0
##$MAXI= 10000
##$MC2= 0
##$MEAN= 0
##$ME_mod= 0
##$MI= 0
##$NCOEF= 0
##$NC_proc= -3
##$NLEV= 6
##$NOISF1= 0
##$NOISF2= 0
##$NSP= 0
##$NTH_PI= 0
##$NZP= 0
##$OFFSET= 16.522
##$PC= 1
##$PHC0= 169.3178
##$PHC1= 8.085313
##$PH_mod= 1
##$PKNL= yes
##$PPARMOD= 0
##$PSCAL= 4
##$PSIGN= 0
##$REVERSE= no
##$SF= 250.13
##$SI= 32768
##$SIGF1= 0
##$SIGF2= 0
##$SINO= 400
##$SIOLD= 32768
##$SREGLST= <1H.CDCl3>
##$SSB= 0
##$STSI= 32768
##$STSR= 0
##$SW_p= 5175.98343685301
##$SYMM= 0
##$S_DEV= 0
##$TDeff= 65536
##$TDoff= 0
##$TI= <Analysis number 999999
Compound Code 99
Book Reference 9
Project Code 9>
##$TILT= no
##$TM1= 0
##$TM2= 0
##$TOPLEV= 0
##$USERP1= <user>
##$USERP2= <user>
##$USERP3= <user>
##$USERP4= <user>
##$USERP5= <user>
##$WDW= 1
##$XDIM= 32768
##$YMAX_p= 467152245
##$YMIN_p= -108633
$$ End of Bruker specific parameters
$$ ---------------------------------
##NTUPLES= NMR SPECTRUM
##VAR_NAME=  FREQUENCY,     SPECTRUM/REAL,   SPECTRUM/IMAG
##SYMBOL=    X,             R,               I
##VAR_TYPE=  INDEPENDENT,   DEPENDENT,       DEPENDENT
##VAR_FORM=  AFFN,          ASDF,            ASDF
##VAR_DIM=   32768,         32768,           32768
##UNITS=     HZ,            ARBITRARY UNITS, ARBITRARY UNITS
##FACTOR=    0.157963299565203, 1,           1
##FIRST=     4132.6476996994, 0,             0
##LAST=      -1043.33573715361, 0,           0
##MIN=       -1043.33573715361, -108633,     0
##MAX=       4132.6476996994, 467152245,     0
$$ Real data points
##PAGE= N=1
##DATA TABLE= (X++(R..R)), XYDATA
$$ [...]
$$ plain form
20075 -18494 -39504 -29148 -9832 -24681 -28051 -13819 -19109 -42419 -58371 -64924 -67685 -62522 -34184
20062 -34184 -21565 -15639 -21251 2616 27446 26075 12727 13201 19408 8662 5162 -8252 -16138
20049 -16138 -42432 -4922 6501 1182 6618 -501 -27619 -66982 -84895 -58350 -21168 -8458
20037 -8458 959 7719 5521 3217 -21976 -17852 25877 52986 70684 63461 74537 77705 80525
20024 80525 68744 40283 27138 31702 51297 28878 331 11169 47736 52475 22401 36932
20012 36932 38545 8370 -21656 -30671 -4392 13054 26829 -5950 -21794 -36355 -19599 -12388
20000 -12388 -13375 -13287 -4219 -7031 -9110 -24316 -36677 -10552 10163 -1513 14138 22284 18412 -5630
19986 -5630 -25341 -3471 15037 21641 45507 46839 45785 51171 45857 26826 5703 -12825 -5990
$$ packed form
20075a8494k1010J0356J9316j4849l370J4232n290k3310j5952o553k761N163K8338
20062c4184J2619N926n612K3867K4830j371j3348M74O207j0746l500j3414p886
20049a6138k6294L7510J1423n319N436p119k7118l9363j7913K6545L7182J2710
20037h458R417O760k198k304k5193M124M3729K7109J7698p223J1076L168K820
20024H0525j1781k8461j3145M564J9595k2419k8547J0838L6567M739l0074J4531
20012C6932J613l0175l0026r015K6279J7446J3775l2779j5844j4561J6756P211
20000a2388r87Q8R068k812k079j5206j2361K6125K0715j1676J5651Q146l872k4042
19986e630j9711K1870J8508O604K3866J332j054N386n314j9031k1123j8528O835
$$ plain form
19973 -5990 -1989 -3219 -1840 16980 66011 45462 55174 25224 13241 7174 -14631 260 20178
19960 20178 -6587 -39773 -30933 -29669 -5113 45578 53534 52475 32224 -10746 744 8910 -19845
19947 -19845 -4430 9014 5246 -1682 9714 9471 10732 27514 13692 20504 46023 42536 46316
19934 46316 58132 50056 36494 22825 15092 -10819 -36472 -41639 -21592 962 19914 21049
19922 21049 7997 -2825 -18721 -20415 -41831 -56281 -50683 -36796 -48952 -37219 -11218 -18294
19910 -18294 28571 39452 8664 -2542 12040 13770 17859 21499 37336 5590 -19740 -24948
19898 -24948 -19020 4993 32973 38116 4504 -23073 -15675 9708 -492 -14916 -49074 -72310
19886 -72310 -40169 -21499 -5070 -13428 -45674 -5510 -11385 -32986 -28653 -5686 5568 11499
$$ packed form
19973e990M001j230J379J8820M9031k0549R712k9950j1983o067k1805J4891J9918
19960B0178k6765l3186Q840J264K4556N0691P956j059k0251m2970J1490Q166k8755
19947a9845J5415J3444l768o928J1396k43J261J6782j3822O812K5519l487L780
19934D6316J1816q076j3562j3669p733k5911k5653n167K0047K2554J8952J135
19922B1049j3052j0822j5896j694k1416j4450N598J3887j2156J1733K6001p076
19910a8294M6865J0881l0788j1206J4582J730M089L640J5837l1746k5330n208
19898b4948N928K4013K7980N143l3612k7577P398K5383j0200j4424l4158k3236
19886g2310L2141J8670J6429q358l2246M0164n875k1601M333K2967J1254N931
$$ plain form
19874 11499 8445 12355 12868 8940 15029 -8011 -4652 11224 1046 29638 43815 21347 7914
19861 7914 -9148 -8427 -8410 -30638 -3588 24588 17244 -13888 -30449 -40482 -43745 -44355 -56762 -40752
19847 -40752 -14544 18027 6006 -14327 -9850 477 -7256 -16594 -3330 9755 37431 6183
19835 6183 -34662 -59696 -60830 -27497 7453 32024 82419 89935 49877 37433 15598 19259
19823 19259 -18875 -28696 47 12648 18737 20262 -11125 -46 9445 5363 -4070 -18296 -23786
19810 -23786 -11077 -13300 -16142 24026 36390 26417 19213 21263 1684 -25383 -33863 -27606 -19887
19797 -19887 -50838 -51425 -24956 -7822 21477 -6336 -27712 -34466 -17881 7191 10200 -19575
19785 -19575 -18149 2027 -11400 -44988 -20860 16910 14315 2784 3766 8038 33322 21296 -4067
$$ packed form
19874A1499l054L910N13l928O089k3040L359J5876j0178K8592J4177k2468j3433
19861G914j7062P21J7k2228K7050K8176p344l1132j6561j0033l263o10j2407J6010
19847d0752K6208L2571j2021k0333M477J0327p733r338J3264J3085K7676l1248
19835F183m0845k5034j134L3333L4950K4571N0395P516m0058j2444k1835L661
19823A9259l8134r821K8743J2601O089J525l1387J1079R491m082r433j4226n490
19810b3786J2709k223k842M0168J2364r973p204K050j9579k7067q480O257P719
19797a9887l0951n87K6469J7134K9299k7813k1376o754J6585K5072L009k9775
19785a9575J426K0176j3427l3588K4128L7770k595j1531R82M272K5284j2026k5363
$$ plain form
19772 -4067 2619 27833 20404 20511 9720 32398 19330 15066 43637 41889 -3142 1375 -3764
19759 -3764 -33613 -62018 -63639 -32705 -11119 5329 27824 20518 -11159 -24926 -8706 -3209
19747 -3209 20734 23500 11941 26761 19363 6887 -28871 -38641 -30673 -36505 -9692 13397 -30513
19734 -30513 -40229 -16441 -25705 -45945 -25915 -17752 -32117 -40941 -55758 -42240 -28843 -5314
19722 -5314 28037 24207 21064 32074 24633 -6658 -60739 -68036 -32764 -4725 -22260 -10562 -21586
19709 -21586 -10820 3336 23193 17516 5139 -22920 -42434 -36543 -43138 -54206 -60733 -48212
19697 -48212 -26266 -5159 14027 20339 17716 2755 1875 4679 -709 -9731 -34439 -24555 -11538
19684 -11538 -23199 -35390 -43792 -21653 -9963 6727 -14764 -26317 -28370 3155 48905 41852
$$ packed form
19772d067O686K5214p429J07j0791K2678j3068m264K8571j748m5031M517n139
19759c764k9849k8405j621L0934K1586J6448K2495p306l1677j3767J6220N497
19747c209K3943K766j1559J4820p398j2476l5758r770P968n832K6813K3089m3910
19734c0513r716K3788r264k0240K0030Q163j4365q824j4817J3518J3397K3529
19722e314L3351l830l143J1010p441l1291n4081p297L5272K8039j7535J1698j1024
19709b1586J0766J4156J9857n677j2377k8059j9514N891o595j1068o527J2521
19697d8212K1946K1107J9186O312k623j4961q80K804n388r022k4708R884J3017
19684a1538j1661j2191q402K2139J1690J6690k1491j1553k053L1525M5750p053
$$ plain form
19672 41852 13134 6055 2119 8246 39973 22467 -12793 -12859 14251 -15153 5756 -5255 -36537
19659 -36537 -24135 -31110 -30405 -19233 -4127 -14234 3142 6349 -14875 -12550 -5687 20737 42848
19646 42848 41667 38826 25283 -875 5199 -7900 -7156 13642 32764 53400 46657 29405 16044
19633 16044 -154 -23177 -42368 -43937 -28674 -28402 -23698 -39298 -23448 -3381 -20338 -10638 25638
19620 25638 54543 51222 7078 -13382 -10331 -16058 -13137 26057 66046 53538 26173 30468 34112
19607 34112 18604 17164 25007 -212 -2940 19504 23133 690 -12422 3379 -28082 -19782 10186
19594 10186 8058 6109 24155 47299 28219 -3873 2565 17388 -4353 -31643 -16903 7264
19582 7264 12071 130 1285 28644 42030 57270 47253 22595 19056 46906 31745 13612
$$ packed form
19672D1852k8718p079l936O127L1727j7506l5260o6K7110k9404K0909j1011l1282
19659c6537J2402o975P05J1172J5106j0107J7376L207k1224K325O863K6424K2111
19646D2848j181k841j3543k6158O074j3099P44K0798J9122K0636o743j7252j3361
19633A6044j6198k3023j9191j569J5263K72M704j5600J5850K0067j6957R700L6276
19620B5638K8905l321m4144k0460L051n727K921L9194L9989j2508k7365M295L644
19607C4112j5508j440P843k5219k728K2444L629k2443j3112J5801l1461Q300K9968
19594A0186k128j949J8046K3144j9080l2092O438J4823k1741k7290J4740K4167
19582G264M807j1941J155K7359J3386J5240j0017k4658l539K7850j5161j8133
$$ plain form
19570 13612 -4383 -22631 3965 25858 20835 39490 59452 50719 53400 48419 63786 40144
19558 40144 16343 11565 7837 -3587 -10813 7601 8477 7637 29715 -1209 -4388 3671 -10132
19545 -10132 -14596 -15203 8347 30626 5034 7523 -5110 -11113 43007 12167 -22110 -16890 13962
19532 13962 15583 3435 2329 -3242 -15671 -8996 -6360 -5932 -26688 -10581 20353 49989 48863
19519 48863 43556 46460 23899 -26215 -15323 9021 12225 7424 1011 -4345 31245 42515 40992
19506 40992 35489 50371 29439 17015 -6883 6790 4662 14556 -12874 -39321 -24577 -32571
19494 -32571 -28859 -18105 -20650 -4047 -2548 39370 54310 48977 47498 39295 27498 34985 38032
19481 38032 54552 51060 33670 -29495 -64658 -17281 19040 15962 22081 -2590 4485 16232
$$ packed form
19570A3612j7995j8248K6596K1893n023J8655J9962q733K681m981J5367k3642
19558D0144k3801m778l728j1424p226J8414Q76q40K2078l0924l179Q059j3803
19545a0132m464o07K3550K2279k5592K489j2633o003N4120l0840l4277N220L0852
19532A3962J621j2148j106n571j2429O675K636M28k0756J6107L0934K9636j126
19519D8863n307K904k2561n0114J0892K4344L204m801o413n356L5590J1270j523
19506D0992n503J4882k0932j2424k3898J3673k128R894k7430k6447J4744p994
19494c2571L712J0754k545J6603J499M1918J4940n333j479q203j1797P487L047
19481C8032J6520l492j7390o3165l5163M7377L6321l078O119k4671P075J1747
$$ plain form
19469 16232 30471 49544 57985 47340 15709 -4616 15141 19446 11873 49557 70479 80723
19457 80723 61170 59315 50977 39903 25688 27338 4653 -27763 -23831 -473 922 213 -13298
19444 -13298 -52096 -47929 -13657 3971 11541 27613 45933 69135 74372 57596 38439 35365
19432 35365 36043 34587 28216 23648 21625 21078 36798 35860 32882 28934 44622 49293 50596 37353
19418 37353 37706 46887 32022 31640 54082 52599 62111 55164 42292 63730 32788 36007 58242
19405 58242 60670 51548 43347 -1943 -40148 -23452 -15582 -16357 -32140 -29427 -16501 -4369 6429
19392 6429 9154 16908 34922 44133 69140 14507 26297 39241 -3789 -9798 -3809 -652 16852
19379 16852 5217 -2096 15619 1317 -21729 -33857 -26002 -18558 -11546 -37257 -11392 9814
$$ packed form
19469A6232J4239J9073Q441j0645l1631k0325J9757M305p573L7684K0922J0244
19457H0723j9553j855q338j1074j4215J650k2685l2416L932K3358J395p09j3511
19444a3298l8798M167L4272J7628P570J6072J8320K3202N237j6776j9157l074
19432C5365O78j456o371m568k023n47J5720r38k978l948J5688M671J303j3243
19418C7353L53R181j4865l82K2442j483R512o947j2872K1438l0942L219K2235
19405E8242K428r122q201m5290l8205J6696P870p75j5783K713J2926J2132J0798
19392F429K725P754J8014R211K5007n4633J1790J2944m3030o009N989L157J7504
19379A6852j1635p313J7715j4302k3046j2128P855P444P012k5711K5865K1206
$$ plain form
19367 9814 23137 44062 65166 109622 109479 66175 8985 -32590 -12301 10758 16700 7513 12182
19354 12182 -9088 -12301 98 25858 32775 47055 35791 2679 -1856 26178 59532 69520
19342 69520 54150 50022 4769 -19027 -18694 -9399 -859 -17206 -14244 -6541 -13904 -15775 -3278
19329 -3278 -1936 -31200 -57600 -39596 -16602 -20477 -13714 -10243 1354 14813 9284 -9590 -41268
19316 -41268 -46950 -39097 -22409 -3546 -2646 -2141 20875 25360 49745 78562 74559 39528 37554
19303 37554 30883 10467 -10169 -5212 6688 12648 2748 -17606 18710 29975 2484 15484
19291 15484 13922 -8927 -10255 -27741 -7842 -23882 -23745 9229 27173 47182 68226 67714 68140
19278 68140 59762 43235 34062 33126 45078 23147 13955 -5325 -22956 -4665 -6968 8709 12121
$$ packed form
19367I814J3323K0925K1104M4456j43m3304n7190m1575K0289K3059N942r187M669
19354A2182k1270l213J2399K5760O917J4280j1264l3112m535K8034L3354R988
19342F9520j5370m128m5253k3796L33R295Q540j6347K962P703p363j871J2497
19329c278J342k9264k6400J8004K2994l875O763L471J1597J3459n529j8874l1678
19316d1268n682P853J6688J8863R00N05K3016M485K4385K8817m003l5031j974
19303C7554o671k0416k0636M957J1900N960r900k0354L6316J1265k7491J3000
19291A5484j562k2849j328j7486J9899j6040J37L2974J7944K0009K1044n12M26
19278F8140q378j6527r173r36J1952k1931r192j9280j7631J8291k303J5677L412
$$ plain form
19265 12121 -255 -7054 41234 63516 39660 32060 4569 -12092 -3967 27012 23497 5068
19253 5068 -8260 -13640 -23996 -6557 21211 22343 13119 7862 12938 34602 52947 32527 7528
19240 7528 -3241 5481 32535 44798 32395 38425 38845 33927 36560 36740 26852 31954 9014 21538
19226 21538 52664 65821 36923 1287 17094 46671 40509 34630 36489 8570 4335 13 3619
19213 3619 7991 1542 -20807 -20671 -3639 4131 16897 34973 22019 -1717 9483 15217 33027
19200 33027 26528 -14010 -12413 17567 10597 34084 24480 29274 26690 11317 -2245 -7352 16028
19187 16028 35186 49993 63036 82984 52144 15449 16392 12499 16782 28104 -69 4157 -6822
19174 -6822 1739 19259 25362 16449 24524 35112 60937 90171 66703 44082 42901 57236 65690
$$ packed form
19265A2121j2376o799M8288K2282k3856p600k7491j6661Q125L0979l515j8429
19253E068j3328n380j0356J7439K7768J132r224n257N076K1664J8345k0420k4999
19240G528j0769Q722K7054J2263j2403O030M20m918K633J80r888N102k2940J2524
19226B1538L1126J3157k8898l5636J5807K9577o162n879J859k7919m235m322L606
19213C619M372o449k2349J36J7032P770J2766J8076j2954k3736J1200N734J7810
19200C3027o499m0538J597K9980o970K3487r604M794k584j5373j3562n107K3380
19187A6028J9158J4807J3043J9948l0840l6695R43l893M283J1322k8173M226j0979
19174f822Q561J7520O103q913Q075J0588K5825K9234k3468k2621j181J4335Q454
$$ plain form
19161 65690 79953 79003 76532 57480 19640 -8295 -3466 7146 10184 4741 19428 44610 50111
19148 50111 30567 27315 30681 29592 38033 46066 45043 22925 -32042 -39542 -24920 -41190 -52998
19135 -52998 -28770 -12337 21634 27677 21985 65671 72294 58719 29884 13681 33326 60199
19123 60199 51899 48109 60239 32519 49104 57831 77018 78660 47280 22278 20028 44289 32877
19110 32877 15213 2644 22790 25662 24461 17833 49856 42985 31244 15043 28553 3577
19098 3577 -20856 -6982 1044 10758 33485 17031 34248 25410 45175 53241 37153 28323 33549
19085 33549 29756 34139 24965 33184 47458 49972 60958 78250 68181 58682 52322 42638 43258 73075
19071 73075 69535 63140 57009 37017 48739 57530 66949 38915 26734 59777 81035 44967 28864
$$ packed form
19161F5690J4263r50k471j9052l7840k7935M829J0612L038n443J4687K5182N501
19148E0111j9544l252L366j089Q441Q033j023k2118n4967p500J4622j6270j1808
19135e2998K4228J6433L3971O043n692M3686O623j3575k8835j6203J9645K6873
19123F0199q300l790J2130k7720J6585Q727J9187J642l1380k5002k250K4261j1412
19110C2877j7664j2569K0146K872j201o628L2023o871j1741j6201J3510k4976
19098C577k4433J3874Q026R714K2727j6454J7217q838J9765Q066j6088q830N226
19085C3549l793M383r174Q219J4274K514J0986J7292j0069r499o360r684O20K9817
19071G3075l540o395o131j9992J1722Q791R419k8034j2181L3043K1258l6068j6103
$$ plain form
19058 28864 24306 20227 11001 9078 25778 64699 77369 88532 105649 109878 101375 94832 83312
19045 83312 67429 25165 -11541 11365 42107 66353 56461 52787 29627 59999 57765 42245
19033 42245 59113 85689 76309 42153 6985 -20253 -11141 -9075 3600 31922 55943 68005
19021 68005 66754 89494 113839 96696 91956 125311 175668 255366 290241 288791 264945 261439
19009 261439 248456 223207 228208 238611 238279 265643 288194 312538 335755 326524 344516 333984
18997 333984 316493 331246 311859 265473 246403 244352 220637 224571 235654 240338 277213 294479
18985 294479 283174 277612 287164 322746 336228 342935 328071 310775 306770 301340 292945 282806 289411
18972 289411 300963 308579 323361 339590 372662 427650 455228 471788 479561 459136 412695 388377
$$ packed form
19058B8864m558m079r226j923J6700L8921J2670J1163J7117M229q503o543j1520
19045H3312j5883m2264l6706K2906L0742K4246r892l674k3160L0372k234j5520
19033D2245J6868K6576r380l4156l5168k7238R112K066J2675K8322K4021J2062
19021F8005j251K2740K4345j7143m740L3355N0357P9698L4875j450k3846l506
19009B61439j2983k5249N001J0403l32K7364K2551K4344K3217r231J7992j0532
18997C33984j7491J4753j9387m6386j9070k051k3715L934J1083M684L6875J7266
18985B94479j1305n562R552L5582J3482O707j4864j7296m005n430q395j0139O605
18972B89411J1552P616J4782J6229L3072N4988K7578J6560P773k0425m6441k4318
$$ plain form
18960 388377 401284 392361 389116 402821 438281 440568 422907 424699 412374 423770 428115 409724
18948 409724 382582 340797 308203 284340 301391 299542 283373 301474 317991 318858 335624 354352
18936 354352 330080 311487 313990 306862 278968 263349 243606 228127 250335 250698 239443 250909
18924 250909 285553 294231 296020 299821 316599 318727 325748 336215 339467 341468 322450 273516 236928
18911 236928 236808 224748 243514 256303 278575 294575 291370 287032 239641 204247 184295 199291
18899 199291 195768 188942 162735 146761 147889 116267 89439 109019 101875 89634 68771 76609
18887 76609 111361 87809 77710 45368 39441 61650 57312 45089 74461 63312 34190 20526
18875 20526 4600 13394 27265 10063 2748 4812 23922 42669 72253 70038 69961 58549 80063
$$ packed form
18960C88377J2907q923l245J3705L5460K287j7661J792j2325J1396M345j8391
18948D09724k7142m1785l2594k3863J7051j849j6169J8101J6517Q67J6766J8728
18936C54352k4272j8593K503p128k7894j5619j9743j5479K2208L63j1255J1466
18924B50909L4644Q678J789L801J6778K128P021J0467L252K001j9018m8934l6588
18911B36928j20j2060J8766J2789K2272J6000l205m338m7391l5394j9952J4996
18899A99291l523o826k6207j5974J128l1622k6828J9580p144j2241k0863P838
18887G6609L4752k3552j0099l2342n927K2209m338j2223K9372j1149k9122j3664
18875B0526j5926Q794J3871j7202p315K064J9110J8747K9584k215p7j1412K1514
$$ plain form
18862 80063 90727 89729 81836 38421 59841 70053 63268 43289 80560 79515 87771 75145 88825
18849 88825 87727 81788 71123 55582 58467 50147 25165 49307 93173 102601 101746 95568 91169
18836 91169 104270 75805 72725 95006 104144 93030 79372 100314 113851 118786 114798 104149
18824 104149 102299 117122 113299 129808 135835 95905 82571 71414 114620 124425 137120 162201
18812 162201 140560 123559 120680 118904 92345 57087 26539 9420 52445 61129 79877 77424
18800 77424 78989 82115 96164 101540 94022 114584 124027 98210 92090 92952 104615 80795 74818
18787 74818 76655 89873 81456 60942 82413 99144 102941 127532 143718 150084 149583 130492 118308
18774 118308 101853 111962 127357 143509 140552 136302 139291 160475 228132 308210 368403 360872
$$ packed form
18862H0063J0664r98p893m3415K1420J0212o785j9979L7271j045Q256j2626J3680
18849H8825j098n939j0665j5541K885q320k4982K4142M3866R428q55o178m399
18836I1169J3101k8465l080K2281R138j1114j3658K0942J3537M935l988j0649
18824A04149j850J4823l823J6509O027l9930j3334j1157M3206R805J2695K5081
18812A62201k1641j7001k879j776k6559l5258l0548j7119M3025Q684J8748k453
18800G7424J565L126J4049N376p518K0562R443k5817o120Q62J1663k3820n977
18787G4818J837J3218q417k0514K1471J6731L797K4591J6186O366n01j9091j2184
18774A18308j6455J0109J5395J6152k957m250K989K1184O7657Q0078O0193p531
$$ plain form
18762 360872 341978 276303 229954 200114 172469 156686 128270 108075 123165 134101 142286 133902
18750 133902 136412 159006 182079 163504 168208 181539 170669 160983 178496 162620 97650 92998
18738 92998 119941 133007 136642 138042 134402 147675 144451 105624 124829 126205 137562 104116 104960
18725 104960 105818 106720 122237 118278 132272 150924 171319 170232 149562 144111 141531 138686 141815
18712 141815 133549 123823 116338 118385 155484 161803 147569 138647 176539 181878 193921 189042 175108
18699 175108 170069 193605 224616 221326 217402 168377 183960 203832 219485 238289 226482 206381
18687 206381 202422 211121 181394 174392 153777 132315 136171 168709 141518 107643 127023 133795
18675 133795 130482 127545 134314 133729 120619 141810 169321 190816 181917 151319 151402 171577 173743
$$ packed form
18762C60872j8894o5675m6349k9840k7645j5783k8416k0195J5090J0936Q185q384
18750A33902K510K2594K3073j8575M704J3331j0870r686J7513j5876o4970m652
18738I2998K6943J3066L635J400l640J3273l224l8827J9205J376J1357l3446Q44
18725A04960Q58R02J5517l959J3994J8652K0395j087k0670n451k580k845L129
18712A41815q266r726p485K047L7099O319j4234q922L7892N339J2043m879j3934
18699A75108n039K3536L1011l290l924m9025J5583J9872J5653J8804j1807k0101
18687B06381l959Q699k9727p002k0615k1462L856L2538k7191l3875J9380O772
18675A33795l313k937O769n85j3110K1191K7511K1495q899l0598Q3K0175K166
$$ plain form
18662 173743 170333 198610 210055 220976 223738 223399 220881 186111 190382 201827 191189 180700 166454
18649 166454 158484 164029 128593 114601 120884 119221 112460 105932 72401 95216 113156 124031 145028
18636 145028 143283 129801 125081 116965 126520 122394 128517 156316 149024 130552 114625 148577 156176
18623 156176 136775 101578 90865 115448 146884 164535 172427 150878 148460 160121 150520 134715
18611 134715 112610 126450 153173 191693 196557 222314 242804 259351 250955 233546 223552 228642
18599 228642 214807 251408 254759 263314 272548 267852 245758 251107 230318 185882 171265 174390 146343
18586 146343 152260 170135 202243 224196 215720 231539 269024 277703 281015 258080 250940 248266 245196
18573 245196 256390 279858 265578 248017 252237 261189 270498 250957 263676 291071 329393 325914
$$ packed form
18662A73743l410K8277J1445J0921K762l39k518l4770M271J1445j0638j0489j4246
18649A66454p970N545l5436j3992O283j663o761o528l3531K2815J7940J0875K0997
18636A45028j745j3482m720q116R555m126O123K7799p292j8472j5927L3952P599
18623A56176j9401l5197j0713K4583L1436J7651P892k1549k418J1661r601j5805
18611A34715k2105J3840K6723L8520M864K5757K0490J6547q396j7409r994N090
18599B28642j3835L6601L351Q555R234m696k2094N349k0789m4436j4617L125k8047
18586A46343N917J7875L2108K1953q476J5819L7485Q679L312k2935p140k674l070
18573B45196J1194K3468j4280j7561M220Q952R309j9541J2719K7395L8322l479
$$ plain form
18561 325914 342829 366464 410883 461621 459486 429248 389973 336860 341341 373305 398929 418366
18549 418366 488233 522291 533602 560809 590021 610612 636032 631638 643349 687163 715776 760662
18537 760662 782053 833291 893780 973651 1055892 1197417 1338320 1469779 1607161 1723464
18527 1723464 1846927 1937942 2001306 2044680 2092270 2197887 2369356 2685696 3194882 3936500
18517 3936500 4881956 5930752 7039999 8017955 8568180 8731976 8532070 8052330 7549447
18508 7549447 7203618 7052351 7171430 7621999 8482938 9785307 11775378 14844724 19755002
18499 19755002 27340107 37580756 49370652 62352960 74670324 82384877 84899366
18492 84899366 82557186 75407293 65574096 55244208 45791017 38437889 33901529 32202023
$$ packed form
18561C25914J6915K3635M4419N0738k135l0238l9275n3113M481L1964K5624J9437
18549D18366O9867L4058J1311K7207K9212K0591K5420m394J1711M3814K8613M4886
18537G60662K1391N1238O0489P9871Q2241J41525J40903J31459J37382J16303
18527A723464J23463R1015O3364M3374M7590J05617J71469L16340N09186P41618
18517C936500R45456J048796J109247R77956N50225J63796j99906m79740n02883
18508G549447l45829j51267J19079M50569Q60939J302369J990071L069346M910278
18499A9755002P585105J0240649J1789896J2982308J2317364P714553K514489
18492H4899366k342180p149893r833197j0329888r453191p353128m536360j699506
$$ plain form
18484 32202023 32818239 34816353 37470645 39783874 40339083 39029008 36182294 32154932
18476 32154932 27897075 24139363 21214070 19337685 18484165 18484436 19283862 21040268 24368650
18467 24368650 30113189 38876223 49902424 62228414 75375838 85895328 91086152
18460 91086152 91647083 87533285 80000946 71771119 64653671 59522526 57065171 57070404 58064169
18451 58064169 59006643 59668860 59756495 59047091 57692288 56724721 57102567 59683662 65679400
18442 65679400 75626229 87674536 99524410 109903559 115055812 112123525 103158657 89716458
18434 89716458 73860899 59053424 46720979 37355065 30967213 26853790 24288377 22943927
18426 22943927 22814329 24152238 27016849 31188818 35943590 40821982 44918153 46667859
$$ packed form
18484C2202023O16216J998114K654292K313229N55209j310075k846714m027362
18476C2154932m257857l757712k925293j876385q53520K71P99426J756406L328382
18467B4368650N744539Q763034J1026201J2325990J3147424J0519490N190824
18460I1086152N60931m113798p532339q229827p117448n131145k457355N233R93765
18451E8064169R42474O62217Q7635p09404j354803r67567L77846K581095N995738
18442F5679400R946829J2048307J1849874J0379149N152253k932287q964868j3442199
18434H9716458j5855559j4807475j2332445r365914o387852m113423k565413j344450
18426B2943927j29598J337909K864611M171969M754772M878392M096171J749706
$$ plain form
18418 46667859 46098785 43827434 40373509 37120189 35351045 35969042 39677004 46788115
18410 46788115 57626841 71243991 84848131 97036561 106021572 107700000 101957379
18403 101957379 91091933 76268955 60648624 46797220 35530457 27312749 21749422
18396 21749422 18055169 15525568 13808084 12718267 12176880 12182533 12558067 13158333 13851533
18387 13851533 14356988 14245125 13541291 12359238 10750701 9106722 7669054 6447680
18379 6447680 5510081 4867353 4404710 4086073 3870621 3690597 3505762 3341645 3157116
18370 3157116 2950266 2677463 2443122 2237136 2038548 1903621 1787078 1656262 1584286 1534786
18360 1534786 1462678 1427454 1371330 1323236 1268391 1180711 1118188 1059857 1005481 946216 885011
$$ packed form
18418D6667859n69074k271351l453925l253320j769144O17997L707962P111111
18410D6788115J0838726J3617150J3604140J2188430Q985011J678428n742621
18403A01957379j0865446j4822978j5620331j3851404j1266763q217708n563327
18396B1749422l694253k529601j717484j089817n41387N653L75534O00266O93200
18387A3851533N05455j11863p03834j182053j608537j643979j437668j221374
18379F447680r37599o42728m62643l18637k15452j80024j84835j64117j84529
18370C157116k06850k72803k34341k05986j98588j34927j16543j30816p1976m9500
18360A534786p2108l5224n6124m8094n4845q7680o2523n8331n4376n9265o1205
$$ plain form
18349 885011 878082 871185 859708 816364 782236 768337 750125 742138 739292 717400 703655 721992
18337 721992 738830 753085 740088 732542 705951 685291 648624 608620 595504 577920 547533 533298
18325 533298 551782 577394 582155 588022 562865 504186 476758 456299 480001 499575 508010 539560
18313 539560 544549 553081 530816 498393 474805 437073 398175 419736 462865 463351 464259 465265 429295
18300 429295 384698 348395 348128 350232 339786 349350 376943 364286 337224 325088 333841 338953 358678
18287 358678 345264 323168 300342 300360 325009 345378 340300 323410 306752 280080 247981 246262
18275 246262 231722 217754 197786 206562 224929 216287 199924 197226 201785 188753 200828 212671
18263 212671 235314 246880 262039 275377 273553 243976 229092 232601 209574 191100 186957 210888
$$ packed form
18349H85011o929o897j1477m3344l4128j3899j8212p987k846k1892j3745J8337
18337G21992J6838J4255j2997p546k6591k0660l6667m0004j3116j7584l0387j4235
18325E33298J8484K5612M761N867k5157n8679k7428k0459K3702J9574Q435L1550
18313E39560M989Q532k2265l2423k3588l7732l8898K1561M3129M86R08J006l5970
18300D29295m4597l6303k67K104j0446R564K7593j2657k7062j2136Q753N112J9725
18287C58678j3414k2096k2826J8K4649K0369n078j6890j6658k6672l2099j719
18275B46262j4540j3968j9968Q776J8367q642j6363k698M559j3032J2075J1843
18263B12671K2643J1566J5159J3338j824k9577j4884L509k3027j8474m143K3931
$$ plain form
18251 210888 191506 177270 175883 147542 133064 113630 113716 142272 167704 189919 222941 225704
18239 225704 209433 185116 191117 232724 245726 210568 216192 214888 174777 147992 165221 151840
18227 151840 173917 221728 184065 178865 192957 203464 195517 165219 156852 158612 156965 162634 175731
18214 175731 170256 127755 118966 145257 165179 165965 183094 158340 142532 153679 150158 156503 152355
18201 152355 180426 210698 216264 207530 224492 211802 186539 185031 174010 164588 174318 198658
18189 198658 234822 290516 316077 346706 369989 345595 301660 288918 257055 266445 262494 241944
18177 241944 214080 197958 194937 233461 257701 247121 263036 271755 245882 215786 218508 206980
18165 206980 211022 209749 197978 211073 235622 243289 246079 224769 226229 264387 304046 328959
$$ packed form
18251B10888j9382j4236j387k8341j4478j9434Q6K8556K5432K2215L3022K763
18239B25704j6271k4317O001M1607J3002l5158N624j304m0111k6785J7229j3381
18227A51840K2077M7811l7663n200J4092J0507p947l0298q367J760j647N669J3097
18214A75731n475m2501q789K6291J9922P86J7129k4754j5808J1147l521O345m148
18201A52355K8071L0272N566q734J6962j2690k5263j508j1021r422R730K4340
18189A98658L6164N5694K5561L0629K3283k4394m3935j2742l1863R390l951k0550
18177B41944k7864j6122l021L8524K4240j0580J5915Q719k5873l0096K722j1528
18165B06980M042j273j1771J3095K4549P667K790k1310J460L8158L9659K4913
$$ plain form
18153 328959 312662 295098 287234 335806 364831 377322 383205 404234 397491 385973 367822 342330
18141 342330 321828 295159 290344 304124 327957 344654 396072 443040 491844 515989 544272 542415
18129 542415 558531 531234 522944 590632 633622 630574 679647 732055 799350 912960 1079143
18118 1079143 1238733 1437550 1705613 2012529 2390593 2935458 3743242 4894795 6603798
18109 6603798 9357806 14215085 23267368 37216383 48506722 49186660 42145157 30966035
18101 30966035 20441950 13760480 9832833 7392715 5816698 4733581 3982811 3437945
18093 3437945 2981555 2609162 2342971 2099347 1875123 1678839 1534324 1404993 1275995
18084 1275995 1158914 1085173 1024643 985717 932478 852928 813755 793265 761661 705525 671409
$$ packed form
18153C28959j6297j7564p864M8572K9025J2491N883K1029o743j1518j8151k5492
18141C42330k0502k6669m815J3780K3833J6697N1418M6968M8804K4145K8283j857
18129E42415J6116k7297q290O7688M2990l048M9073N2408O7295J13610J66183
18118A079143J59590J98817K68063L06916L78064N44865Q07784J151553J709003
18109F603798K754008M857279R052283J3949015J1290339O79938p041503j1179122
18101C0966035j0524085o681470l927647k440118j576017j083117p50770n44866
18093C437945m56390l72393k66191k43624k24224j96284j44515j29331j28998
18084A275995j17081p3741o0530l8926n3239p9550l9173k0490l1604n6136l4116
$$ plain form
18073 671409 660951 621469 598493 607223 605878 600439 617189 599818 566586 538390 489431 443187
18061 443187 414843 403887 424992 453336 454296 441722 463230 494355 489618 506204 500765 453001
18049 453001 441786 458115 472167 462914 475795 504701 526718 557005 592555 591165 595674 626912
18037 626912 637144 624215 663359 718706 756097 780945 788202 787408 832873 886202 928337 984075
18025 984075 1050771 1137691 1250384 1385479 1515608 1668086 1886641 2162312 2499136 2892749
18015 2892749 3357485 3912808 4681035 5862502 7556617 9631005 11682830 12977204 13093699
18006 13093699 12209819 10873797 9691641 8931463 8654107 8794319 9293666 10160957 11478138
17997 11478138 13485378 16560610 21323781 28893367 40985270 58887754 81180095 102721114
$$ packed form
18073F71409j0458l9482k2976Q730j345n439J6750j7371l3232k8196m8959m6244
18061D43187k8344j0956K1105K8344R60j2574K1508L1125m737J6586n439m7764
18049D53001j1215J6329J4052r253J2881K8906K2017L0287L5550j390M509L1238
18037F26912J0232j2929L9144N5347L7391K4848P257p94M5465N3329M2135N5738
18025I84075O6696Q6920J12693J35095J30129J52478K18555K75671L36824L93613
18015B892749M64736N55323P68227J181467J694115K074388K051825J294374J16495
18006A3093699q83880j336022j182156p60178k77356J40212M99347Q67291J317181
17997A1478138K007240L075232M763171P569586J2091903J7902484K2292341K1541019
$$ plain form
17989 102721114 116456426 118562812 109630550 93741301 75819730 59466196 46384811
17982 46384811 36985694 30955481 27867176 27396783 29309601 32879074 36639923 38596352
17974 38596352 37509655 33614865 28164224 22774356 18422433 15331548 13303848 12049248
17966 12049248 11380228 11094195 11072218 11218206 11408963 11724238 12250060 13161372 14666283
17957 14666283 16704085 18878406 20565436 21424854 21683956 22042064 23447335 26606009
17949 26606009 31402958 36798909 41089158 42932678 42520023 41137490 40758783 43136134
17941 43136134 49977960 63311454 84943724 114297266 146945483 175404425 193833164
17934 193833164 199173025 190584945 169947723 141940084 112319343 86322231 66789815
$$ packed form
17989A02721114J3735312K106386q932262j5889249j7921571j6353534j3081385
17982D6384811r399117o030213l088305m70393J912818L569473L760849J956429
17974C8596352j086697l894790n450641n389868m351923l090885k027700j254600
17966A2049248o69020k86033k1977J45988J90757L15275N25822R11312J504911
17957A4666283K037802K174321J687030Q59418K59102L58108J405271L158674
17949B6606009M796949N395951M290249J843520m12655j382533l78707K377351
17941D3136134O841826J3333494K1632270K9353542L2648217K8458942J8428739
17934A93833164N339861q588080k0637222k8007639k9620741k5997112j9532416
$$ plain form
17927 66789815 54030651 47090311 44619887 45304806 47394398 48659719 47341525 43273046
17919 43273046 37571776 31883073 27477990 24720583 23232393 22204395 20992662 19404824
17911 19404824 17535455 15632192 14052896 12871949 12014888 11472639 11087912 10735800 10412600
17902 10412600 10266227 10387131 10914137 12121991 14290114 17766990 22584269 27907505
17894 27907505 32154994 33760551 32522546 29428016 26058819 23794299 23368120 25209245
17886 25209245 29670437 36992218 47327510 60304922 74821880 88044909 95768591
17879 95768591 94340354 83995615 68242945 51747951 38076848 28205569 21590709
17872 21590709 17210418 14253128 12215530 10787400 9757899 9051612 8667133 8669791 9079803
$$ packed form
17927F6789815j2759164o940340k470424O84919K089592J265321j318194m068479
17919D3273046n701270n688703m405083k757407j488190j027998j211733j587838
17911A9404824j869369j903263j579296j180947q57061n42249l84727l52112l23200
17902A0412600j46373J20904N27006J207854K168123L476876M817279N323236
17894B7907505M247489J605557j238005l094530l369197k264520m26179J841125
17886B5209245M461192P321781J0335292J2977412J4516958J3223029P723682
17879I5768591j428237j0344739j5752670j6494994j3671103r871279o614860
17872B1590709m380291k957290k037598j428130j029501p06287l84479K658M10012
$$ plain form
17863 9079803 9865631 10809347 11445154 11366779 10484083 9071934 7574708 6283090 5321954
17854 5321954 4630716 4078046 3641757 3229259 2872094 2609242 2412193 2230656 2068082
17845 2068082 1956372 1862118 1723251 1602798 1502615 1410361 1334039 1270210 1253364 1242115
17835 1242115 1219129 1183985 1125731 1082167 1041674 977587 921545 854739 779172 715028 692648
17824 692648 683936 675134 642418 612423 581864 567806 589919 569290 530141 540443 545375 553741
17812 553741 565085 565818 584527 620546 623018 607467 584400 533164 484952 450298 413160 384087
17800 384087 392049 372771 355892 361961 371051 364362 395659 415526 392850 368817 373156 388239
17788 388239 374111 364030 345254 349089 321948 297241 295044 289458 266745 256543 250107 249539 257600
$$ packed form
17863I079803P85828R43716O35807p8375q82696j412149j497226j291618r61136
17854E321954o91238n52670m36289m12498l57165k62852j97049j81537j62574
17845B068082j11710r4254j38867j20453j00183r2254p6322o3829j6846j1249
17835A242115k2986l5144n8254m3564m0493o4087n6042o6806p5567o4144k2380
17824F92648q712q802l2716k9995l0559j4058K2113k0629l9149J0302M932Q366
17812E53741J1344P33J8709L6019K472j5551k3067n1236m8212l4654l7138k9073
17800C84087P962j9278j6879O069R090o689L1297J9867k2676k4033M339J5083
17788C88239j4128j0081j8776L835k7141k4707k197n586k2713j0202o436n68Q061
$$ plain form
17775 257600 263807 297201 246441 234865 228284 221713 169396 159592 151466 191727 213234 189855
17763 189855 173626 195461 199672 196999 221963 229474 236012 256707 261584 240569 252746 239665
17751 239665 222816 210216 154465 110054 81511 73609 61419 58756 34564 41581 83583 96539
17739 96539 80358 59830 62952 99941 126332 144480 149103 154150 189941 174348 151162 132330
17727 132330 96918 48806 37973 52898 77455 84942 61778 68930 72873 62676 61154 53835
17715 53835 57657 73486 96321 75454 89221 76885 69253 67147 66062 85634 113233 102390
17703 102390 46954 38097 60543 79339 58589 12598 12 -5227 -13589 -15190 -2933 24656
17691 24656 39356 41099 32476 18980 21347 25573 37347 57910 107674 132727 127105 80175 66863
$$ packed form
17775B57600O207L3394n0760j1576o581o571n2317r804q126M0261K1507k3379
17763A89855j6229K1835M211k673K4964P511O538K0695M877k1015J2177j3081
17751B39665j6849j2600n5751m4411k8543p902j2190k663k4192P017M2002J2956
17739I6539j6181k0528L122L6989K6391J8148M623N047L5791j5593k3186j8832
17727A32330l5412m8112j0833J4925K4557P487k3164P152L943j0197j522p319
17715E3835L822J5829K2835k0867J3767j2336p632k106j085J9572K7599j0843
17703A02390n5436q857K2446J8796k0750m5991j2586n239q362j601J2257K7589
17691B4656J4700J743q623j3496K367M226J1774K0563M9764K5053n622m6930j3312
$$ plain form
17678 66863 81981 84735 77988 65561 83159 108523 112727 110330 67446 34723 34343 27116 16094
17665 16094 1596 14129 12471 8259 1810 15002 34419 9286 -17124 -17867 12406 30650 43052
17652 43052 42588 40030 24101 -8222 -11579 -14144 7851 42498 80615 84787 71908 46690 40355
17639 40355 22163 9233 27483 51507 56819 49709 76347 64454 52739 72894 84778 100959
17627 100959 86849 109815 131052 134157 106624 74078 50785 60885 63666 64410 42192 10378
17615 10378 -2205 4821 -2791 -13486 2884 16674 17815 21449 -25665 -18821 -8818 -30820 -30680
17602 -30680 -15630 -5986 26899 5223 -35878 -36082 -36990 -63610 -49035 6126 21187 38836 46065
17589 46065 27470 -4350 -12325 -29534 -32546 -17585 -16278 -56408 -50560 -35351 -18543 -1919
$$ packed form
17678F6863J5118K754o747j2427J7598K5364M204k397m2884l2723l80p227j1022
17665A6094j4498J2533j658m212o449J3192J9417k5133k6410p43L0273J8244J2402
17652D3052m64k558j5929l2323l357k565K1995L4647L8117M172j2879k5218o335
17639D0355j8192j2930J8250K4024N312p110K6638j1893j1715K0155J1884J6181
17627A00959j4110K2966K1237L105k7533l2546k3293J0100K781P44k2218l1814
17615A0378j2583P026p612j0695J6370J3790J141L634m7114O844J0003k2002J40
17602c0680J5050R644L2885k1676m1101k04r08k6620J4575N5161J5061J7649P229
17589D6065j8595l1820p975j7209l012J4961J307m0130N848J5209J6808J6624
$$ plain form
17577 -1919 -9139 -12954 28190 39062 5340 7453 32508 31333 9876 -5149 -17864 -35242 -16466
17564 -16466 -28615 -35443 -16724 -10938 -19706 -12519 -24226 -19474 -16603 -2382 -11367 -18090 -10558
17551 -10558 5036 17161 22044 -16873 -44410 -24419 -3625 9513 8026 -30153 -32307 -38712
17539 -38712 -19020 -40357 -34729 -915 30233 31963 24047 8124 -26211 -15522 -12002 -1099
17527 -1099 -1356 6571 17481 -6964 -35327 -34244 -12450 -8333 -11856 -22215 -42466 -16735 21402
17514 21402 30400 17749 2864 8484 28393 7146 -30788 -26123 -14780 -9806 2814 256 14578
17501 14578 4895 -12247 -7763 7612 -1602 -7136 -23989 -26468 -36851 -29199 -11785 21923 51349
17488 51349 39285 15036 32512 61994 62137 46095 20422 18155 44576 69087 64342 97453
$$ packed form
17577a919p220l815M1144J0872l3722K113K5055j175k1457j5025j2715j7378J8776
17564a6466j2149o828J8719N786q768P187j1707M752K871J4221q985o723P532
17551a0558J5594J2125M883l8917k7537J9991K0794J3138j487l8179k154o405
17539c8712J9692k1337N628L3814L1148J730p916j5923l4335J0689L520J0903
17527a099k57P927J0910k4445k8363J083K1794M117l523j0359k0251K5731L8137
17514B1402Q998j2651j4885N620J9909k1247l7934M665J1343M974J2620k558J4322
17501A4578r683j7142M484J5375r214n534j6853k479j0383P652J7414L3708K9426
17488E1349j2064k4249J7476K9482J43j6042k5673k267K6421K4511m745L3111
$$ plain form
17476 97453 149160 215035 278176 292684 289499 286379 274638 266226 238131 231660 219529 214277 194883
17463 194883 183562 190189 232451 246833 262011 282369 308536 326937 331472 253680 175017 184287
17451 184287 171539 128341 123040 131763 115641 99403 91933 110715 169518 175221 217627 269811
17439 269811 339419 348599 305187 257969 223322 157267 138667 129348 145795 136558 135468 166575
17427 166575 180107 185717 219363 265501 360479 434842 480272 513254 536172 540999 548364 533183
17415 533183 526459 499061 452096 402171 372487 376190 357874 286736 282857 322827 363888 396909
17403 396909 403939 401748 409473 428385 423967 418539 409510 358416 273702 201642 169581 152688 168952
17390 168952 150840 131846 124872 123361 111063 120761 134977 125131 54375 18087 18330 29343 56722
$$ packed form
17476I7453N1707O5875O3141J4508l185l120j1741q412k8095o471j2131n252j9394
17463A94883j1321O627M2262J4382J5178K0358K6167J8401M535p7792p8663R270
17451A84287j2748m3198n301Q723j6122j6238p470J8782N8803N703M2406N2184
17439B69811O9608R180m3412m7218l4647o6055j8600r319J6447r237j090L1107
17427A66575J3532N610L3646M6138R4978P4363M5430L2982K2918M827P365j5181
17415E33183o724k7398m6965m9925k9684L703j8316p1138l879L9970M1061L3021
17403C96909P030k191P725J8912m418n428r029n1094q4714p2060l2061j6893J6264
17390A68952j8112j8994o974j511j2298R698J4216r846p0756l6288K43J1013K7379
$$ plain form
17377 56722 45044 43066 46047 53360 106391 161153 188626 216427 218722 242016 254829 274075
17365 274075 295108 308660 291482 260744 237560 232896 188142 155187 145959 132449 143507 136292
17353 136292 115071 118077 124816 146260 171013 169693 169423 185374 223934 219440 185951 185819 160282
17340 160282 113875 93825 45748 30867 38400 31973 9105 -23272 -51409 -51628 10378 28425
17328 28425 6056 10722 38150 48857 7068 -9638 -4840 9521 5962 -8420 20961 40841
17316 40841 54541 37486 59794 78495 61500 47233 -3938 -27151 -25352 -35617 -15961 -9148
17304 -9148 -26694 -23400 -830 -11826 -4696 29692 35662 12906 -1375 -19736 -14608 -7003 -4736
17291 -4736 -13941 14961 25712 27643 15839 6987 28876 11503 -14477 19543 19778 -19210 -48509
$$ packed form
17377E6722j1678j978K981P313N3031N4762K7473K7801K295K3294J2813J9246
17365B74075K1033J3552j7178l0738k3184m664m4754l2955r228j3510J1058p215
17353A36292k1221L006O739K1444K4753j320k70J5951L8560m494l3489j32k5537
17340A60282m6407k0050m8077j4881P533o427k2868l2377k8137k19O2006J8047
17328B8425k2369M666K7428J0707m1789j6706M798J4361l559j4382K9381J9880
17316D0841J3700j7055K2308J8701j6995j4267n1171k3213J799j0265J9656O813
17304i148j7546L294K2570j0996P130L4388N970k2756j4281j8361N128P605K267
17291d736r205K8902J0751J931j1804q852K1889j7373k5980L4020K35l8988k9299
$$ plain form
17278 -48509 -60824 -61233 -60881 -79493 -58914 -29829 -2972 -9184 8217 -14003 -16640 -48100 -33754
17265 -33754 -36262 -54786 -44995 -33400 -14284 -19140 -31234 -22277 -37542 -18000 -50859 -76411
17253 -76411 -75638 -85238 -61910 -43369 -34567 -37557 -32848 -14324 -6962 -30653 -21884 8039 25475
17240 25475 43978 39851 33759 18749 24887 22163 -18657 -6197 -23361 -25816 -33728 -55369 -37211
17227 -37211 -19686 -18587 -26401 -38940 -24817 -24499 4324 13421 30526 46369 30812 47842 40882
17214 40882 29720 31631 37097 11901 2116 20524 16427 -5009 -9954 1261 5770 14067 9705
17201 9705 -13151 -22730 -1559 -2079 -13991 -8886 -32516 -22720 -18599 8099 32636 10962 -19200
17188 -19200 -19643 19608 24800 13071 -7586 -28044 -37268 -41475 -51321 -36304 -50322 -42971 -11632
$$ packed form
17278d8509j2315m09L52j8612K0579K9085K6857o212J7401k2220k637l1460J4346
17265c3754k508j8524R791J1595J9116m856j2094Q957j5265J9542l2859k5552
17253g6411P73r600K3328J8541Q802k990M709J8524P362k3691Q769K9923J7436
17240B5475J8503m127o092j5010O138k724m0820J2460j7164k455p912k1641J8158
17227c7211J7525J099p814j2539J4123L18K8823R097J7105J5843j5557J7030o960
17214D0882j1162J911N466k5196r785J8408m097k1436m945J1215M509Q297m362
17201I705k2856r579K1171n20j1912N105k3630R796M121K6698K4537k1674l0162
17188a9200m43L9251N192j1729k0657k0458r224m207r846J5017j4018P351L1339
$$ plain form
17175 -11632 -16668 -9250 15692 30757 9905 12981 23588 17043 -8367 -45989 -61976 -24786
17163 -24786 -4424 12710 20247 3014 8999 21231 13363 -11964 -15202 8960 29836 22361 -14013
17150 -14013 -1969 -13361 -13099 -17715 -29550 -19419 -65283 -55662 -2084 27165 10414 -16737
17138 -16737 -16063 -16881 17316 30661 21940 11165 -20936 -23787 -12436 -23691 -39174 -18022 -20799
17125 -20799 -44111 -51655 -1174 9009 -95 5268 13479 11855 9164 -4231 -18310 -5092 -6192
17112 -6192 2389 1123 -14844 -39922 -42557 -13223 -2423 25328 24901 16119 11361 -12418 -38712
17099 -38712 -39838 -36185 -27612 -27123 -6874 24846 18606 -14667 -64447 -57608 -30360 -28700 -41444
17086 -41444 -25250 -23770 -29322 -62096 -64828 -56415 -47443 -16946 19115 20389 17977 9650 32215
$$ packed form
17175a1632n036P418K4942J5065k0852L076J0607o545k5410l7622j5987L7190
17163b4786K0362J7134P537j7233N985J2232p868k5327l238K4162K0876p475l6374
17150a4013J2044j1392K62m616j1835J0131m5864R621N3578K9249j6751k7151
17138a6737O74q18L4197J3345q721j0775l2101k851J1351j1255j5483K1152k777
17125b0799k3312p544N0481J0183r104N363Q211j624k691j3395j4079J3218j100
17112f192Q581j266j5967k5078k635K9334J0800K7751m27q782m758k3779k6294
17099c8712j126L653Q573M89K0249L1720o240l3273m9780O839K7248J660j2744
17086d1444J6194J480n552l2774k732Q413Q972L0497L6061J274k412q327K2565
$$ plain form
17073 32215 54940 41293 2219 -37314 -27356 -18741 -41429 -23288 -17529 -578 16253 -9147
17061 -9147 -7302 -26066 -38498 -34939 2227 11093 754 -12242 -5045 -33881 -55183 -68879 -57722
17048 -57722 -33080 -25341 9131 11192 -6444 -6265 -3004 -23402 -59126 -52771 -42728 -42721 -12283 -18919
17034 -18919 -41947 -41226 -43391 -62790 -89163 -79051 -48352 -32547 -17375 10593 -21857 -26879
17022 -26879 -13623 1218 -12565 -2193 15878 14981 11211 25291 26788 4201 -48100 -80789
17010 -80789 -86578 -69163 -85862 -95348 -64854 -74882 -83174 -61294 -40938 -49234 -43175 -37038 -13017
16997 -13017 9456 9625 -5909 6774 9035 -4113 -25539 -44980 -38412 -29833 -48986 -56754 -9185
16984 -9185 -921 -10766 7085 3490 -7966 -12465 10057 -3702 -862 23964 13038 16170 -7166
$$ packed form
17073C2215K2725j3647l9074l9533R958Q615k2688J8141N759J6951J6831k5400
17061i147J845j8764j2432L559L7166Q866j0339j2996P197k8836k1302j3696J1157
17048e7722K4642P739L4472K061j7636J79L261k0398l5724O355J0043PL0438o636
17034a8919k3028P21k165j9399k6373J0112L0699J5805J5172K7968l2450n022
17022b6879J3256J4841j3783J0372J8071q97l770J4080J497k2587n2301l2689
17010h0789n789J7415j6699r486L0494j0028q292K1880K0356q296O059O137K4021
16997a3017K2473J69j5534J2683K261j3148k1426j9441O568Q579j9153p768M7569
16984i185Q264r845J7851l595j1456m499K2522j3759K840K4826j0926L132k3336
$$ plain form
16971 -7166 -9779 -32038 -22727 -12731 1255 1974 4348 1491 -2424 2400 13894 5246 8289 2566
16957 2566 16945 6798 16267 37300 368 -13897 -3580 5598 9559 23435 7006 -21928
16945 -21928 -25010 -2963 15007 20000 19597 9298 -1750 -13291 -13847 25318 48424 39897 11124
16932 11124 -10095 -1194 4798 -6647 -32381 -49084 -60215 -55225 -28387 -19479 -28621 -18406 2323
16919 2323 7588 41029 55463 44601 38671 28273 -1284 3047 36538 18152 19444 41947 64924
16906 64924 62910 29317 -4650 -6333 -3331 12679 16089 2543 30362 52487 63888 82697
16894 82697 56075 40365 28353 24074 4705 -27092 -16356 10542 -20210 -38028 -21981 300
16882 300 5761 24817 7605 -20042 -44940 -41319 -31850 2 -1457 -19066 -7020 10157 -11228
$$ packed form
16971g166k613k2259R311R996J3986P19K374k857l915M824J1494q648L043n723
16957B566J4379j0147R469K1033l6932j4265J0317R178L961J3876j6429k8934
16945b1928l082K2047J7970M993m03j0299j1048j1541n56L9165K3106q527k8773
16932A1124k1219Q901N992j1445k5734j6703j1131M990K6838Q908r142J0215K0729
16919B323N265L3441J4434j0862n930j0398k9557M331L3491j8386J292K2503K2977
16906F4924k014l3593l3967j683L002J6010L410j3546K7819K2125J1401J8809
16894H2697k6622j5710j2012m279j9369l1797J0736K6898l0752j7818J6047K2281
16882C00N461J9056j7212k7647k4898L621R469L1852j459j7609J2046J7177k1385
$$ plain form
16869 -11228 -33146 -55013 -38096 -11359 -11693 -52626 -50174 -39625 -38765 -4453 -1731 1749 10565
16856 10565 -12808 -29554 -55356 -57619 -59881 -66701 -37725 -29405 -42576 -11704 -14416 -56128 -64379
16843 -64379 -52563 -28154 -27144 -43380 -37844 -27100 -29935 -28114 -63715 -63018 -44722 -45234 -42824
16830 -42824 -41121 -38627 -9928 -8695 -24773 -32078 -11670 -33786 -44774 -25839 -10388 -3847 5363
16817 5363 581 -39591 -45296 -25102 -11795 -33947 -30392 -46665 -33157 -16611 -11222 5214 -5525
16804 -5525 -9667 -30807 -11584 37592 27119 -19309 -29707 -40213 -37471 -14593 14722 8875
16792 8875 -14281 -4604 -5033 -45278 -41430 -33225 -21419 -37300 -30529 -31805 -37073 -25883 -23474 -14302
16778 -14302 -17057 6455 24890 37928 19858 2961 24349 13285 -34726 -24516 -6799 1708
$$ packed form
16869a1228k1918k1867J6917K6737l34m0933K452J0549Q60L4312K722L480Q816
16856A0565k3373j6746k5802k263k262o820K8976Q320j3171L0872k712m1712q251
16843f4379J1816K4409J010j6236N536J0744k835J821l5601O97J8296n12K410
16830d2824J703K494K8699J233j6078p305K0408k2116j0988J8935J5451O541R210
16817E363m782m0172n705K0194J3307k2152L555j6273J3508J6546N389J6436j0739
16804e525m142k1140J9223M9176j0473m6428j0398j0506K742K2878K9315n847
16792H875k3156R677m29m0245L848Q205J1806j5881O771j276n268J1190K409R172
16778a4302k755K3512J8435J3038j8070j6897K1388j1064m8011J0210J7717Q507
$$ plain form
16766 1708 -325 -31075 -41794 -47052 -6452 -1262 -4497 26500 26607 -27564 -29262 -11078 -10819 -15642
16752 -15642 -14537 -15761 -18898 -4230 -5291 -29549 -27908 -20853 -21339 -41280 -50198 -32340 -17049
16739 -17049 -22203 -20198 -5542 -2009 15617 35941 34047 40099 28175 -15398 -18646 -7258 4286
16726 4286 -4814 -34951 -58693 -62258 -48728 4993 21784 -1365 -28708 -24196 -44143 -62744
16714 -62744 -57360 -52557 -50521 -28929 -22104 -9569 -16544 -11090 -8992 -22227 -25426 -23673 -30521 -34504
16700 -34504 -40653 -18338 -8868 -46956 -46633 -34234 -27378 -12175 -4642 -26858 -22653 -1262 -8877
16687 -8877 -50357 -50021 -65718 -55519 -35432 -33545 -38794 -16106 20702 3745 3879 37143 30917
16674 30917 -9147 10397 18423 23487 7397 -20642 -11627 8705 -17193 -40140 -33439 -31590 -11176
$$ packed form
16766A708k033l0750j0719n258M0600N190l235L0997J07n4171j698J8184K59m823
16752a5642J105j224l137J4668j061k4258J641P055m86j9941q918J7858J5291
16739a7049n154K005J4656L533J7626K0324j894O052j1924m3573l248J1388J1544
16726D286r100l0137k3742l565J3530N3721J6791k3149k7343M512j9947j8601
16714f2744N384M803K036K1592O825J2535o975N454K098j3235l199J753o848l983
16700c4504o149K2315R470l8088L23J2399O856J5203P533k2216M205K1391p615
16687h877m1480L36j5697J0199K0087J887n249K2688L6808j6957J34L3264o226
16674C0917m0064J9544Q026N064j6090k8039R015K0332k5898k2947O701J849K0414
$$ plain form
16661 -11176 9945 11740 27391 35696 1835 -17690 1851 21382 -8892 6635 45461 50555
16649 50555 48233 58820 44765 34162 18151 -818 -17160 -35319 -45109 -15673 -5294 24288
16637 24288 44534 15365 -12567 -13248 -14588 -6558 -29098 -30385 -19885 -41960 -26078 -10674 -45321
16624 -45321 -24058 19003 8302 2097 -23573 -53768 -45447 -20599 -35488 -46826 -31894 -14034
16612 -14034 -5696 -34365 -48039 -34942 -23661 27843 49730 28934 8000 792 2302 -27550
16600 -27550 -3575 -14333 -23279 23387 32666 52128 57846 71221 56892 37970 34432 10002
16588 10002 12296 -6873 -15382 -3389 17441 3194 -14964 -25874 -38024 -26146 11265 50567
16576 50567 61082 51731 12880 9863 36955 37973 18692 -12379 -14289 -29060 -48255 -24229
$$ packed form
16661a1176K1121J795J5651Q305l3861j9525J9541J9531l0274J5527L8826N094
16649E0555k322J0587j4055j0603j6011j8969j6342j8159r790K9436J0379K9582
16637B4288K0246k9169k7932o81j340Q030k2540j287J0500k2075J5882J5404l4647
16624d5321K1263M3061j0701o205k5670l0195Q321K4848j4889j1338J4932J7860
16612a4034Q338k8669j3674J3097J1281N1504K1887k0796k0934p208J510k9852
16600b7550K3975j0758q946M6666R279J9462N718J3375j4329j8922l538k4430
16588A0002K294j9169q509J1993K0830j4247j8158j0910j2150J1878L7411L9302
16576E0567J0515r351l8851l017K7092J018j9281l1071j910j4771j9195K4026
$$ plain form
16564 -24229 -12117 -3253 16495 39443 35124 32620 -4583 -29640 -23739 -35188 -65243 -89590
16552 -89590 -62378 -61606 -47655 -23194 -6262 16770 62843 13140 2215 3363 15339 25668
16540 25668 -5189 -24705 -37048 -22592 -19935 -28705 -17942 -25406 -19311 -17225 -39897 -41598 -30331
16527 -30331 -4857 13010 25869 6542 -17573 -12068 15956 29270 12883 25593 -11365 -2366
16515 -2366 554 3228 2391 963 -7997 -4715 33555 21937 -6349 11069 21177 40452 20452
16502 20452 14753 -12412 -15096 -9283 -19275 12686 10653 -6185 -1551 -18964 -1191 -4836 -22619
16489 -22619 -27198 -29050 -14412 303 -16570 -25960 -7317 -30883 -25037 485 2168 11238 -11435
16476 -11435 -43015 -76684 -64103 -60358 -18090 20420 1877 -5111 5123 -4253 -32237 -37446
$$ packed form
16564b4229J2112Q864J9748K2948m319k504l7203k5057N901j1449l0055k4347
16552h9590K7212P72J3951K4461J6932K3032M6073m9703j0925J148J1976J0329
16540B5668l0857j9516j2343J4456K657q770J0763p464O095K086k2672j701J1267
16527c0331K5474J7867J2859j9327k4115N505K8024J3314j6387J2710l6958Q999
16515b366K920K674q37j428q960L282L8270j1618k8286J7418J0108J9275k0000
16502B0452n699k7165k684N813r992L1961k033j6838M634j7413J7773l645j7783
16489b2619m579j852J4638J4715j6873r390J8643k3566N846K5522J683R070k2673
16476a1435l1580l3669J2581L745M2268L8510j8543o988J0234r376k7984n209
$$ plain form
16464 -37446 -26538 -26508 -15883 -14250 -18549 -11819 -12521 -32842 -24410 -43656 -28080 -18261 17940 19970
16450 19970 12465 -13477 -42001 -43596 -48401 -15208 -3590 -30888 -30866 -26715 -34892 -17739 -38709
16437 -38709 -55268 -60524 -41045 -50211 -24953 11769 37278 34791 65457 56722 9930 -11008
16425 -11008 18385 61070 54363 51439 28167 176 10851 38318 46365 51756 13052 12289 -7010
16412 -7010 -1135 -7292 -13318 -592 14032 -25511 -51880 -53808 -13671 34563 49248 53474 34206
16399 34206 8404 -3211 -18058 -30812 -49180 -39344 -33278 -31785 -42598 -48173 -43868 -33187 -40649
16386 -40649 -20655 6746 29026 7445 -13262 -5869 31836 52244 28239 36151 53630 41828
16374 41828 1435 -22253 -33585 -17007 -38418 -22424 18528 43437 48813 28525 579 -17707
$$ packed form
16464c7446J0908L0J0625J633m299O730p02k0321Q432j9246J5576R819L6201K030
16450A9970p505k5942k8524j595m805L3193J1618k7298K2M151q177J7153k0970
16437c8709j6559n256J9479r166K5258L6722K5509k487L0666q735m6792k0938
16425a1008K9393M2685o707k924k3272k7991J0675K7467Q047N391l8704p63j9299
16412g010N875o157o026J2726J4624l9543k6369j928M0137M8234J4685M226j9268
16399C4206k5802j1615j4847j2754j8368R836O066J493j0813n575M305J0681p462
16386d0649J9994K7401K2280k1581k0707P393L7705K0408k4005P912J7479j1802
16374D1828m0393k3688j1332J6578k1411J5994M0952K4909N376k0288k7946j8286
$$ plain form
16362 -17707 -12278 3465 11263 31189 20966 40425 20962 18036 1059 -13663 -2851 7392
16350 7392 378 -14725 -15756 10978 32657 62875 48461 14694 7460 -10457 -8631 -4607 -21299
16337 -21299 -20537 -16899 1116 -2293 -26434 -16394 -4061 -13305 690 -11274 -32785 -17712 -16609
16324 -16609 834 -2210 3933 5634 12174 22274 12148 -15177 -29026 -26625 -20195 -19271 -16653
16311 -16653 -14258 -49620 -51184 -52926 -52591 -55381 -37856 -35768 -51272 -28688 -8277 -14617 -19258
16298 -19258 -6738 -1292 -23964 -31648 21165 21120 6169 -8021 -8125 1139 9090 12333 -5530 -1627
16284 -1627 -28106 -60848 -71407 -61379 -16219 -22080 -35463 -48620 -63985 -58662 -57928 -35710 -26927
16271 -26927 -32832 -36053 -40075 -13366 4731 6137 -16122 -12336 -27690 -52331 -43858 -51145 -22467
$$ packed form
16362a7707N429J5743P798J9926j0223J9459j9463k926j6977j4722J0812J0243
16350G392p014j5103j031K6734K1679L0218j4414l3767p234j7917J826M024j6692
16337b1299P62L638J8015l409k4141J0040J2333r244J3995j1964k1511J5073J103
16324a6609J7443l044O143J701O540J0100j0126k7325j3849K401O430R24K618
16311a6653K395l5362j564j742L35k790J7525K088j5504K2584K0411o340m641
16298a9258J2520N446k2672p684N2813m5j4951j4190j04R264P951L243j7863L903
16284a627k6479l2742j0559J0028M5160n861j3383j3157j5365N323P34K2218Q783
16271b6927n905l221m022K6709J8097J406k2259L786j5354k4641Q473p287K8678
$$ plain form
16258 -22467 9819 10332 -6473 -18009 -6878 -7045 2173 49610 64131 32320 20237 31169 13770
16245 13770 -32282 -49770 -34508 -9867 -7501 -26768 -30293 -36043 -13414 -20730 -313 -4549 -40470
16232 -40470 -54788 -41064 -39114 -44577 -59402 -65289 -44963 -23194 6569 -30055 -43096 -25964
16220 -25964 -25864 -32570 -2172 -4973 -4243 -1067 -7788 -17569 -14116 -33322 -53909 -52477 -27467 -12952
16206 -12952 -14696 -17129 -17134 -30262 -40569 -20583 -13916 -22076 -46679 -37646 -43246 -62023 -81355 -79093
16192 -79093 -44986 -17916 -26649 -51634 -41884 -17338 18754 16439 1716 3040 -19279 -60927
16180 -60927 -55142 -46696 -32581 -26170 -5325 -17725 -23646 -21656 -15477 -29740 -39721 -35228 -8947
16167 -8947 26595 32906 20751 15707 15008 8443 -4569 -19855 -37841 -84 -21756 -42544 -32770
$$ packed form
16258b2467L2286N13j6805j1536J1131j67R218M7437J4521l1811j2083J0932j7399
16245A3770m6052j7488J5262K4641K366j9267l525n750K2629p316K0417m236l5921
16232d0470j4318J3724J950n463j4825n887K0326K1769K9763l6624j3041J7132
16220b5964J00o706L0398k801P30L176o721r781L453j9206k0587J432K5010J4515
16206a2952j744k433nj3128j0307J9986O667q160k4603R033n600j8777j9332K262
16192g9093L4107K7070q733k4985R750K4546L6092k315j4723J324k2319m1648
16180f0927N785Q446J4115O411K0845j2400n921J990O179j4263r981M493K6281
16167h947L5542O311j2155n044o99o565j3012j5286j7986L7757k1672k0788R774
$$ plain form
16154 -32770 -39813 -48840 -52932 -24889 -8194 -7526 -6755 9799 -14617 -33391 -21703 -32944 -61952
16141 -61952 -54569 -49600 -46976 -33112 -36444 -28958 -31786 840 11009 23686 5408 15532 8595
16128 8595 -26810 -34151 -11768 17429 43619 32751 44145 48212 61324 74828 67478 39511
16116 39511 29843 25380 -8103 -34787 -32272 -47875 -63534 -65203 -80550 -58820 -60484 -51456 -32880
16103 -32880 -17679 -10287 -6996 -25426 -34279 -21106 -29095 -6976 6558 -7362 -28644 -32433 -23019
16090 -23019 -24425 -42065 -36444 -39506 -25377 -33727 -45221 -52552 -39026 -33313 -6267 5994 -1134
16077 -1134 4698 22723 30526 25393 32119 38120 6224 9273 -10173 -41525 -21616 -20213 -3833
16064 -3833 33493 19035 -2879 -21600 -9198 15844 2912 -51687 -74925 -50953 306 26803
$$ packed form
16154c2770p043r027m092K8043J6695O68P71J6554k4416j8774J1688j1241k9008
16141f1952P383M969K624J3864l332P486k828L2626J0169J2677j8278J0124o937
16128H595l5405p341K2383K9197K6190j0868J1394M067J3112J3504p350k7967
16116C9511r668m463l3483k6684K515j5603j5659j669j5347K1730j664R028J8576
16103c2880J5201P392L291j8430q853J3173p989K2119J3534j3920k1282l789R414
16090b3019j406j7640N621l062J4129q350j1494p331J3526N713K7046J2261p128
16077a134N832J8025P803n133O726O001l1896L049j9446l1352J9909J403J6380
16064c833L7326j4458k1914j8721J2402K5042j2932n4599k3238K3972N1259K6497
$$ plain form
16052 26803 24132 4102 -15385 -16588 -17879 -12050 834 38358 40939 38290 28192 37054 25532
16039 25532 38073 31113 20321 -8937 -4139 17229 4683 4980 -14925 -29490 -23902 -36572 -17655
16026 -17655 -35165 -29654 -22589 -30692 -49849 -58502 -57397 -49026 -17386 8773 -7161 -25761 -24323
16013 -24323 -33909 -31075 -3796 15563 -9242 -22737 -11630 -1092 -2693 7903 -12616 -19658
16001 -19658 -17557 -10925 -11439 -15834 -9873 -7152 -10382 -6324 3897 3746 -8102 -189 -20783 -21152
15987 -21152 5236 -23470 -29476 -8038 -40121 -72566 -64965 -42755 -63562 -78142 -53237 -29126
15975 -29126 -21781 -4182 19938 51690 31718 -2673 -19620 -31478 -66891 -61525 -26797 -17722
15963 -17722 -4073 6448 8281 -3371 17076 9308 26711 31683 6897 3015 55885 53311 53352
$$ packed form
16052B6803k671k0030j9487j203j291N829J2884L7524K581k649j0098Q862j1522
16039B5532J2541o960j0792k9258M798K1368j2546K97j9905j4565N588j2670J8917
16026a7655j7510N511P065q103j9157q653J105Q371L1640K6159j5934j8600J438
16013b4323r586K834K7279J9359k4805j3495J1107J0538j601J0596k0519p042
16001a9658K101O632n14m395N961K721l230M058J0221j51j1848P913k0594l69
15987b1152K6388k8706o006K1438l2083l2445P601K2210k0807j4580K4905K4111
15975b9126P345J7599K4120L1752j9972l4391j6947j1858l5413N366L4728R075
15963a7722J3649J0521J833j1652K0447p768J7403M972k4786l882N2870k574M1
$$ plain form
15950 53352 27865 23804 18179 -24901 -56016 -71166 -67902 -32219 -18681 -21306 8271 21695
15938 21695 11868 14677 -3473 -14715 -45671 -43474 -40649 -18175 -13863 -7629 -10287 -30301 -19795
15925 -19795 -6976 -13831 -32997 -62081 -42426 -1704 -16157 -37545 -48926 -51828 -37469 -11422
15913 -11422 9040 -1314 -24037 -51127 -47159 -31320 3319 25855 49907 45384 11122 9197
15901 9197 947 -13623 -5715 2538 -8223 17652 28010 11409 -13753 -23045 -25268 -9668 1701
15888 1701 12580 10423 -11691 -6335 -17948 -23964 -25652 -52498 -53218 -70045 -49573 -32706 -46248
15875 -46248 -63953 -72869 -65162 -14973 6924 7187 2391 9216 19003 26568 4756 -9713 12909
15862 12909 33192 22360 28821 10011 -20610 -588 9005 20537 27637 19099 10806 5490 17789
$$ packed form
15950E3352k5487m061n625m3080l1115j5150L264L5683J3538k625K9577J3424
15938B1695r827K809j8150j1242l0956K197K825K2474M312O234k658k0014J0506
15925a9795J2819o855j9166k9084J9655M0722j4453k1388j1381k902J4359K6047
15913a1422K0462j0354k2723k7090L968J5839L4639K2536K4052m523l4262j925
15901I197q250j4570P908Q253j0761K5875J0358j6601k5162r292k223J5600J1369
15888A701J0879k157k2114N356j1613o016j688k6846p20j6827K0472J6867j3542
15875d6248j7705q916P707N0189K1897K63m796O825R787P565k1812j4469K2622
15862A2909K0283j0832O461j8810l0621K0022R593J1532P100q538q293n316J2299
$$ plain form
15849 17789 -5955 -10354 14451 24919 21388 22597 19158 36216 44692 21026 12130 -3169 12598
15836 12598 19881 29670 17162 5838 -12650 -34027 -25821 -26110 -49437 -27717 -18629 -31453 -50188
15823 -50188 -29856 -8129 -4406 -23610 -48959 -31662 -20864 -10871 20671 19722 31864 28545 5227
15810 5227 -18250 -1947 -2192 -13162 -4018 21568 30160 31369 40688 32112 17022 32767 8271
15797 8271 7143 3753 -19260 -43274 -27762 -39189 -63353 -63440 -69716 -57552 3201 -12105 -29458
15784 -29458 -24809 -36601 -39094 -48224 -24558 -14260 15729 25726 24367 -15424 4663 24811 1278
15771 1278 16127 16045 -13776 -19405 -6024 16829 24215 27151 23263 17122 23378 19053 6946 -31116
15757 -31116 -43499 4550 3543 -18547 -9443 -3264 -24011 -38567 -42956 -44381 -20374 40352 57754
$$ packed form
15849A7789k3744m399K4805J0468l531J209l439J7058Q476k3666q896j5299J5767
15836A2598P283R789j2508j1324j8488k1377Q206k89k3327K1720R088j2824j8735
15823e0188K0332K1727L723j9204k5349J7297J0798R993L1542r49J2142l319k3318
15810E227k3477J6303k45j0970R144K5586Q592J209R319q576j5090J5745k4496
15797H271j128l390k3013k4014J5512j1427k4164q7o276J2164O0753j5306j7353
15784b9458M649j1792k493r130K3666J0298K9989R997j359l9791K0087K0148k3533
15771A278J4849q2k9821n629J3381K2853P386K936l888o141O256m325j2107l8062
15757c1116j2383M8049j007k2090R104O179k0747j4556m389j425K4007O0726J7402
$$ plain form
15744 57754 67738 47719 30471 4082 19250 33052 21844 -15537 -7533 10965 14707 39695
15732 39695 46422 27210 11897 25087 52814 14738 -10120 -14026 -28744 -31749 -13523 -13492 -17578
15719 -17578 -38430 -27209 -5669 116 -9928 5090 10527 24125 18070 -10038 -23807 -33028
15707 -33028 -27027 -17848 -28043 -46884 -66925 -85284 -89512 -79313 -85974 -65597 -54802 -38350
15695 -38350 -29869 -21717 -21335 -21992 -41317 -80481 -66511 -48535 -26624 -15033 1362 18124 40631
15682 40631 11408 21036 52225 55142 36821 1562 -6582 19306 48881 50641 28852 30648 31462
15669 31462 24021 1355 15819 12225 16600 27178 24043 12309 -9000 -20205 -220 -7378 -38242
15656 -38242 -63979 -43149 -1221 6436 10872 19785 10600 10024 25895 23686 6035 9543 -3358
$$ packed form
15744E7754R984k0019j7248k6389J5168J3802j1208l7381Q004J8498L742K4988
15732C9695O727j9212j5313J3190K7727l8076k4858l906j4718l005J8226L1m086
15719a7578k0852J1221K1540N785j0044J5018N437J3598o055k8108j3769r221
15707c3028O001R179j0195j8841k0041j8359m228J0199o661K0377J0795J6452
15695c8350Q481Q152L82o57j9325l9164J3970J7976K1911J1591J6395J6762K2507
15682D0631k9223R628L1189K917j8321l5259q144K5888K9575J760k1789J796Q14
15669C1462p441k2666J4464l594M375J0578l135j1734k1309j1205J9985p158l0864
15656c8242k5737K0830M1928P657M436Q913r185n76J5871k209j7651L508j2901
$$ plain form
15643 -3358 13068 17841 16169 -1725 -8687 4222 -540 -19724 -20795 7867 -26917 -46142 -33008
15630 -33008 -14795 -28295 -40946 -11041 715 -896 2696 -19372 -5159 625 4216 -3788 -8885
15617 -8885 -15218 -14860 2059 -2143 -686 1511 18933 -2279 4896 2634 -11143 -2598 762 -6868
15603 -6868 14842 20708 33204 52207 84452 104818 80678 44389 17626 3800 -15425 -12781
15591 -12781 -2792 3525 24761 27067 30910 24525 -2211 -9924 -2905 -2980 1854 12059 28305 5623
15577 5623 27341 17515 15019 21809 24401 33362 36352 44205 5752 19802 7193 -13044 -24595
15564 -24595 -34787 -50918 -58521 -36024 -34624 -19751 -19319 -31345 -30874 -30298 -14752 40449 56103
15551 56103 42288 61299 71933 25132 -4946 -19951 -40966 -19796 -10601 -16239 -21740 -33046
$$ packed form
15643c358J6426M773j672j7894o962J2909m762j9184j071K8662l4784j9225J3134
15630c3008J8213j3500j2651K9905J1756j611L592k2068J4213N784L591q004n097
15617h885o333L58J6919m202J457K197J7422k1212P175k262j3777Q545L360p630
15603f868K1710N866J2496J9003L2245K0366k4140l6289k6763j3826j9225K644
15591a2781R989O317K1236K306L843o385k6736p713P019p5M834J0205J6246k2682
15577E623K1718r826k496O790K592Q961K990P853l8453J4050j2609k0237j1551
15564b4595j0192j6131p603K2497J400J4873M32j2026M71N76J5546N5201J5654
15551E6103j3815J9011J0634m6801l0078j5005k1015K1170R195n638n501j1306
$$ plain form
15539 -33046 -50302 -56861 -79189 -64800 -48669 -47408 -43213 -16798 -15850 -11007 -18659 -23890 -41783
15526 -41783 -38945 -38997 -29302 -18728 13704 31509 -12484 -23856 -1132 -1266 -3743 -10038 -35643
15513 -35643 -47507 -52770 -67340 -54058 -25677 -9342 -11806 28960 85728 77534 32858 -22500
15501 -22500 -51253 -40728 -62117 -36714 -43983 -57323 -28480 -2379 -16046 -19934 -16251 -4356
15489 -4356 -16873 -31710 -20606 2667 -40576 -51278 -17627 -17471 -31295 -51375 -40105 -36144
15477 -36144 -18105 22024 20314 12416 16328 15443 -9689 943 3542 21766 28578 12976 9743
15464 9743 20944 8109 4951 20168 35986 140 -11185 -17542 -25957 -39518 -26263 -17121 -21969
15451 -21969 -7035 30411 39147 7219 -28754 -37040 -16849 -2408 -4661 -14280 -20345 -26189 -27793
$$ packed form
15539c3046j7256o559k2328J4389J6131J261M195K6415R48M843p652n231j7893
15526d1783K838n2R695J0574L2432J7805m3993j1372K2724j34k477o295k5605
15513c5643j1864n263j4570J3282K8381J6335k464M0766N6768q194m4676n5358
15501b2500k8753J0525k1389K5403p269j3340K8843K6101j3667l888L683J1895
15489d356j2517j4837J1104K3273m3243j0702L3651J56j3824k0080J1270L961
15477c6144J8039M0129j710p898L912q85k5132J0632K599J8224O812j5602l233
15464I743J1201j2835l158J5217J5818l5846j1325o357q415j3561J3255R142m848
15451b1969J4934L7446Q736l1928l5973q286K0191J4441k253r619o065n844j604
$$ plain form
15438 -27793 5513 19636 15637 17738 35102 35437 -4982 2158 23584 21593 14309 25301 41954
15425 41954 15517 -2952 6347 9693 6648 -15222 -241 25617 30482 9453 -4053 3216 -16558
15412 -16558 -26079 -7564 -14546 -13030 9085 490 11528 -27032 -44773 -53862 -34034 -19047 -37957
15399 -37957 -44369 -54310 -74561 -43607 -32625 -11717 -20659 -6788 -1678 4206 1728 -9589 15650
15386 15650 22765 15305 -4728 -37493 -36603 16992 55429 48174 38501 -5080 4042 6417 -345
15373 -345 -3312 -9330 -7117 -1931 -17340 -18013 6771 11083 -3933 27795 27173 18708 27566 19458
15359 19458 -12615 -29109 -19251 -6282 -8101 8351 -20499 -33712 -48033 -36328 -2168 20100
15347 20100 21235 -16538 -25516 -42817 -46267 -38631 -30094 -12891 -7255 7867 33598 34243 10310
$$ packed form
15438b7793L3306J4123l999K101J7364L35m0419P140K1426j991p284J0992J6653
15425D1954k6437j8469R299L346l045k1870J4981K5858M865k1029j3506P269j9774
15412a6558r521J8515o982J516K2115q595J1038l8560j7741r089J9828J4987j8910
15399c7957o412r941k0251L0954J0982K0908q942J3871N110N884k478j1317K5239
15386A5650P115p460k0033l2765Q90N3595L8437p255r673m3581R122K375o762
15373c45k967o018K213N186j5409o73K4784M312j5016L1728o22q465Q858q108
15359A9458l2073j6494R858J2969j819J6452k8850j3213j4321J1705L4160K2268
15347B0100J135l7773q978j7301l450P636Q537J7203N636J5122K5731O45k3933
$$ plain form
15334 10310 22981 36691 19412 16824 25220 11367 -3126 -4393 2613 -2470 2557 -2730 -15988
15321 -15988 -53524 -63951 -56154 -12896 6796 25512 24470 16981 3372 17125 27622 344
15309 344 -16040 -19255 9922 11108 6562 37297 44623 65110 57845 25515 9378 -10905 27847
15296 27847 59171 54975 23722 -4463 -28385 -42195 -39983 -13452 -28020 -8265 23369 27328
15284 27328 367 -24001 1646 22899 23174 8582 337 -3106 15351 -4651 -5511 1669 15085
15271 15085 5515 -28380 -6496 17850 5923 -16628 -8897 -8045 -13122 -10807 -1738 3519 12934
15258 12934 23991 59744 42569 14033 -12027 -18240 -8654 -32453 -29750 10247 21090 -13490
15246 -13490 -28567 -7869 18688 32638 67734 82582 57622 17181 22009 -5383 -30330 24299
$$ packed form
15334A0310J2671J3710j7279k588Q396j3853j4493j267P006n083N027n287j3258
15321a5988l7536j0427P797M3258J9692J8716j042p489j3609J3753J0497k7278
15309C44j6384l215K9177J186m546L0735P326K0487p265l2330j6137k0283L8752
15296B7847L1324m196l1253k8185k3922j3810K212K6531j4568J9755L1634L959
15284B7328k6961k4368K5647K1253K75j4592q245l443J8457k0002q60P180J3416
15271A5085r570l3895K1884K4346j1927k2551P731Q52n077K315R069N257R415
15258A2934J1057L5753j7175k8536k6060o213R586k3799K703L9997J0843l4580
15246a3490j5077K0698K6557J3950L5096J4848k4960m0441M828k7392k4947N4629
$$ plain form
15234 24299 39133 16716 16774 43267 20342 -1036 5686 10832 12696 12905 -12107 -32658 -18062
15221 -18062 -14647 -14934 -32562 -46884 -22321 -13370 -16055 5977 19854 24544 24453 30894 42326 39580
15207 39580 15502 29253 16586 16223 29194 -11594 -46423 -33381 1826 -22095 -29819 -7865
15195 -7865 -12089 -3793 20629 22215 2295 -10815 5779 36495 41517 21493 17352 20513 17075
15182 17075 28870 44818 37959 44732 42935 35004 21963 -708 -13115 7884 24249 15520 42046
15169 42046 45952 22312 22600 23650 3605 -2156 3483 4014 -14177 -14742 13914 26558 60344 66522
15155 66522 67104 58987 52642 52784 57745 41408 32385 32822 10198 20551 7734 -2772 1967 20278
15141 20278 23709 21341 30603 51336 59152 50300 46044 68750 38636 -14603 -59461 -44407 -32831
$$ packed form
15234B4299J4834k2417N8K6493k2925k1378O722N146J864K09k5012k0551J4596
15221a8062L415k87j7628j4322K4563Q951k685K2032J3877M690r1O441J1432k746
15207C9580k4078J3751j2667l63J2971m0788l4829J3042L5207k3921p724K1954
15195g865m224Q296K4422J586j9920j3110J6594L0716N022k0024m141L161l438
15182A7075J1795J5948o859O773j797p931j3041k2671j2407K0999J6365q729K6526
15169D2046L906k3640K88J050k0045n761N639N31j8191n65K8656J2644L3786O178
15155F6522N82q117o345J42M961j6337r023M37k2624J0353j2817j0506M739J8311
15141B0278L431k368R262K0733P816q852m256K2706l0114n3239m4858J5054J1576
$$ plain form
15128 -32831 -33202 -7855 -3374 -22411 -18207 11832 11469 -8227 20163 76 -25265 -9387 -9431
15115 -9431 -16256 -9127 -7985 9292 23626 -5241 -765 -15844 -26046 -23038 5667 32539 -1570
15102 -1570 -24675 -31411 -20083 9324 9569 6456 -4657 16147 40283 47321 18077 37838 24147
15089 24147 30104 28312 2879 28902 21749 3056 -5891 -29732 -45392 -24586 13016 38194
15077 38194 12976 -21691 -9576 20684 10794 -24173 -45645 -46592 -19065 -4402 -11317 20866
15065 20866 13022 19616 3650 -15478 -36840 -43324 -45741 -29594 -34290 -36387 -5065 12506 -8850
15052 -8850 19459 28488 23340 25950 31776 1235 6879 23356 19715 24503 17159 21969 30582 32361
15038 32361 23721 28352 26962 26323 29257 57631 50184 29727 52407 34818 8852 -15026 -35294
$$ packed form
15128c2831l71K5347M481j9037M204L0039l63j9696K8390k0087k5341J5878m4
15115i431o825P129J142J7277J4334k8867M476j5079j0202L008K8705K6872l4109
15102a570k3105o736J1328K9407K45l113j1113K0804K4136P038k9244J9761j3691
15089B4147N957j792k5433K6023p153j8693q947k3841j5660K0806L7602K5178
15077C8194k5218l4667J2115L0260r890l4967k1472r47K7527J4663o915L2183
15065B0866p844O594j5966j9128k1362o484k417J6147m696k097L1322J7571k1356
15052h850K8309R029n148K610N826l0541N644J6477l641M788p344M810Q613J779
15038C2361q640M631j390o39K934K8374p447k0457K2680j7589k5966k3878k0268
$$ plain form
15025 -35294 -13637 11836 6424 -20384 -44683 -28691 -7613 155 8571 31585 40722 38159 63341
15012 63341 58668 30257 11169 12799 5013 -17766 -34588 8886 17507 2083 21851 37244
15000 37244 33102 13722 -7457 -10360 -12251 -16096 7990 41381 36619 18964 11888 -3481 -42264
14987 -42264 -68110 -27108 -7279 -12096 -6157 -27088 -36320 -23919 -1844 27482 35505 48262
14975 48262 56706 16803 3652 10485 50889 55114 56199 70986 37923 30470 33820 14686 -6504
14962 -6504 -21221 4487 20378 51284 47881 13309 -14783 -2833 4590 -3091 -2493 -22805 -52648
14949 -52648 -44523 -24744 10302 -21872 -30060 20989 -2287 -8865 30922 17708 31806 72885
14937 72885 66937 39209 7321 -16770 23 8315 5484 -14829 -12971 19661 3074 -7904
$$ packed form
15025c5294K1657K5473n412k6808k4299J5992K1078P768Q416K3014R137k563K5182
15012F3341m673k8411j9088J630p786k2779j6822M3474Q621j5424J9768J5393
15000C7244m142j9380k1179k903j891l845K4086L3391m762j7655p076j5369l8783
14987d2264k5846M1002J9829m817N939k0931r232J2401K2075K9326Q023J2757
14975D8262Q444l9903j3151O833M0404M225J085J4787l3063p453L350j9134k1190
14962f504j4717K5708J5891L0906l403l4572k8092J1950P423p681N98k0312k9843
14949e2648Q125J9779L5046l2174q188N1049k3276o578L9787j3214J4098M1079
14937G2885n948k7728l1888k4091J6793Q292k831k0313J858L2632j6587j0978
$$ plain form
14925 -7904 -14585 1495 45261 35294 6235 -26904 -33452 -24938 -31476 -32731 -34497 -22043 -7022
14912 -7022 -29864 -33692 -37785 -31490 29113 42244 37477 35768 12275 40830 88329 78781 43796
14899 43796 50103 43482 38344 46015 64111 64782 82369 85188 80047 65619 33877 31623 41021 49809
14885 49809 68536 55608 42736 34836 26110 28814 2373 13429 27829 19617 13391 8140 -595
14872 -595 -27923 7968 31979 25017 -211 -10885 7898 549 16881 14756 -3372 15007 27839
14859 27839 2042 20119 36925 38811 25416 20170 17153 34760 18445 -19725 -13516 5747
14847 5747 30524 20272 36521 53769 68449 27185 17252 32264 24664 14013 12017 44478
14835 44478 53514 49055 39985 48438 8331 -17887 -20464 -17092 11908 16882 22762 -18381 -51125
$$ packed form
14925g904o681J6080M3766r967k9059l3139o548Q514o538j255j766J2454J5021
14912g022k2842l828m093O295O0603J3131m767j709k3493K8555M7499r548l4985
14899D3796O307o621n138P671J8096O71J7587K819n141j4428l1742k254R398Q788
14885D9809J8727j2928j2872p900q726K704k6441J1056J4400q212o226n251q735
14872e95k7328L5891K4011o962k5228j0674J8783p349J6332k125j8128J8379J2832
14859B7839k5797J8077J6806J886j3395n246l017J7607j6315l8170O209J9263
14847E747K4777j0252J6249J7248J4680m1264r933J5012p600j0651j996L2461
14835D4478R036m459r070Q453m0107k6218k577L372K9000M974N880m1143l2744
$$ plain form
14822 -51125 -51416 -20135 -27658 -54035 -37974 -15527 8288 14840 25337 8795 -9589 26239
14810 26239 50662 49609 29878 18772 15883 3810 817 31545 4440 -9140 10800 34045
14798 34045 14488 8395 -11839 -3971 4578 254 -13332 -18950 19587 17585 -573 14370 51300
14785 51300 54872 20444 903 -1516 35215 38527 26110 62629 82365 29640 -151 13388
14773 13388 22716 26052 37697 38284 25896 -10968 -8268 7600 23143 16528 4773 4242 35437
14760 35437 48047 61198 49872 38146 46700 28537 25369 10695 -15264 -646 18795 48062
14748 48062 95824 97769 71045 62384 75957 97213 75692 94610 118898 120222 127452 158834
14736 158834 172609 197697 279539 396012 516901 675642 874169 1131655 1450675 1830184
$$ packed form
14822e1125k91L1281p523k6377J6061K2447K3815O552J0497j6542j8384L5828
14810B6239K4423j053j9731j1106k889j2073k993L0728k7105j3580J9940K3245
14798C4045j9557o093k0234P868Q549m324j3586n618L8537k002j8158J4943L6930
14785E1300L572l4428j9541k419L6731L312j2417L6519J9736n2725k9791J3539
14773A3388R328L336J1645N87j2388l6864K700J5868J5543o615j1755n31L1195
14760C5437J2610J3151j1326j1726Q554j8163l168j4674k5959J4618J9441K9267
14748D8062M7762J945k6724q661J3573K1256k1521J8918K4288J324P230L1382
14736A58834J3775K5088Q1842J16473J20889J58741J98527K57486L19020L79509
$$ plain form
14726 1830184 2125756 2380921 2518758 2500788 2336304 2103811 1809806 1478914 1189407 951690
14716 951690 737669 577868 409397 288986 259090 237554 236269 227905 228808 210189 169798
14705 169798 149743 157346 166636 149009 114996 84871 78146 77414 80496 76399 86551 38719 21082
14692 21082 22499 32215 53899 51914 76913 84562 36991 44641 73744 71962 48616 58095 56221
14679 56221 54869 68608 70301 72574 54969 58293 81130 95484 96587 110795 92453 99554 83710
14666 83710 103258 135085 126994 124912 106188 77735 89040 78702 105205 97122 94655 89301 58577
14653 58577 36552 44155 27201 13662 20141 44057 50567 55962 69074 76314 50406 63615 70442
14640 70442 67179 62883 44320 16301 32386 30393 33709 39826 47535 65463 95297 120518 110306
$$ packed form
14726A830184K95572K55165J37837j7970j64484k32493k94005l30892k89507k37717
14716I51690k14021j59801j68471j20411k9896k1536j285q364R03j8619m0391
14705A69798k0055P603R290j7627l4013l0125o725p32L082m097J0152m7832j7637
14692B1082J417R716K1684j985K4999P649m7571P650K9103j782k3346R479j874
14679E6221j352J3739J693K273j7605L324K2837J4354J103J4208j8342P101j5844
14666H3710J9548L1827q091k082j8724k8453J1305j0338K6503q083k467n354l0724
14653E8577k2025P603j6954j3539O479K3916O510N395J3112P240k5908J3209O827
14640G0442l263m296j8563k8019J6085j993L316O117P709J7928K9834K5221j0212
$$ plain form
14627 110306 93223 59277 38969 42452 41959 26696 60681 82949 69209 50603 31316 27700
14615 27700 55700 72314 26635 15025 54158 80171 77752 53207 42895 72903 89777 103997
14603 103997 68762 58355 58536 41967 61500 68959 62787 54743 53521 70660 51878 39780 46302
14590 46302 20675 -14394 -49590 -77036 -95614 -95993 -83160 -65873 -58187 -37984 -24938 4714
14578 4714 18709 67875 86020 45634 32767 25815 7489 2139 1846 12460 22879 26089 48050
14565 48050 55818 104191 142375 132174 107394 65934 84444 120808 102890 108313 113412 109080
14553 109080 78624 65594 60213 41837 60559 53369 68879 80186 78289 108960 128896 108484
14541 108484 100299 136315 163019 165175 165877 211426 229622 230300 296786 359954 412425 490736 525424
$$ packed form
14627A10306j7083l3946k0308L483m93j5263L3985K2268j3740j8606j9287l616
14615B7700K8000J6614m5679j1610L9133K6013k419k4545j0312L0008J6874J4220
14603A03997l5235j0407J81j6569J9533P459o172q044j222J7139j8782j2098O522
14590D6302k5627l5069l5196k7446j8578l79J2833J7287P686K0203J3046K9652
14578D714J3995M9166J8145m0386j2867o952j8326n350k93J0614J0419L210K1961
14565D8050P768M8373L8184j0201k4780m1460J8510L6364j7918N423N099m332
14553A09080l0456j3030n381j8376J8722p190J5510J1307j897L0671J9936k0412
14541A08484q185L6016K6704K156P02M5549J8196O78O6486O3168N2471P8311L4688
$$ plain form
14528 525424 532707 520654 473319 414494 345395 286303 227604 190790 205111 190050 154924 126014
14516 126014 89052 86659 79248 95056 126681 123156 96204 67088 33710 33031 16281 35306
14504 35306 38421 47539 65062 68437 68291 88692 107203 102682 79983 73289 75317 46454 50255
14491 50255 51440 34271 37145 42111 41047 24574 19751 29509 51748 59279 19894 -13239 5035
14478 5035 64449 64317 87243 131769 179892 240663 269336 284534 257201 221116 185512 192810
14466 192810 187258 157180 143982 144375 153915 147140 151211 152628 168055 161330 158770 156124 141523
14453 141523 164218 184003 195423 187084 151212 178514 165650 155515 176605 205810 231330 229787
14441 229787 235030 254559 265943 307016 328168 323974 327402 349297 301948 277437 255421 220702
$$ packed form
14528E25424P283j2053m7335n8825o9099n9092n8699l6814J4321j5061l5126k8910
14516A26014l6962k393p411J5808L1625l525k6952k9116l3378o79j6750J9025
14504C5306L115R118J7523L375j46K0401J8511m521k2699o694K028k8863L801
14491E0255J185j7169K874M966j064j6473m823R758K2239P531l9385l3133J8274
14478E035N9414j32K2926M4526M8123O0771K8673J5198k7333l6085l5604P298
14466A92810n552l0078j3198L93R540o775M071J417J5427o725k560k646j4601
14453A41523K2695J9785J1420q339l5872K7302j2864j0135K1090K9205K5520j543
14441B29787N243J9529J1384M1073K1152m194L428K1895m7349k4511k2016l4719
$$ plain form
14429 220702 178890 135032 93265 56721 33605 41022 15802 -21254 -33033 -6166 48278 84214
14417 84214 105398 122236 126726 131139 113728 120361 144277 135679 123147 75793 72910 100137 68215
14404 68215 40605 8145 25812 84217 163668 278648 389156 493704 599976 730480 801546
14393 801546 817762 775598 696916 633426 557540 436799 389721 367351 318658 279259 258341
14382 258341 275001 260826 253317 250573 262045 278098 303116 303704 314300 284760 293329 309043
14370 309043 287306 285344 301784 270449 284194 288852 302455 289347 286332 266035 278516 255932
14358 255932 274899 317375 343326 327736 337006 353865 382347 390906 384255 398034 440164 478792
14346 478792 509543 547415 584747 667153 744949 785615 779804 770488 755155 744472 728858 747416
$$ packed form
14429B20702m1812m3858m1767l6544k3116P417k5220l7056j1779K6867N4444L5936
14417H4214K1184J6838M490M413j7411O633K3916q598j2532m7354k883K7227l1922
14404F8215k7610l2460J7667N8405P9451J14980J10508J04548J06272J30504P1066
14393H01546J6216m2164p8682o3490p5886j20741m7078k2370m8693l9399k0918
14382B58341J6660j4175p509k744J1472J6053K5018N88J0596k9540Q569J5714
14370C09043k1737j962J6440l1335J3745M658J3603j3108l015k0297J2481k2584
14358B55932J8967M2476K5951j5590R270J6859K8482Q559o651J3779M2130L8628
14346D78792L0751L7872L7332Q2406P7796M0666n811r316j5333j0683j5614J8558
$$ plain form
14334 747416 803188 848254 912022 1043121 1154029 1299183 1424674 1541825 1609965 1613718 1603305
14323 1603305 1557166 1525597 1517082 1514711 1603475 1704774 1752253 1824505 1930821 2056554 2145052
14312 2145052 2314777 2513622 2710371 2946748 3171601 3416449 3699960 3985445 4274954
14303 4274954 4590275 4981721 5473277 6100189 6926312 7968466 9286510 10913279 12844934
14294 12844934 15017909 17360760 19792361 22287611 24878385 27767833 31293606 36025458
14286 36025458 42818898 53045053 68926743 93304902 128367977 175256038 233081736
14279 233081736 297519861 361534688 416198602 453230722 467152245 455428136 420486711
14272 420486711 368442365 307432344 246136596 190889032 145487998 111103427 86595031
$$ packed form
14334G47416N5772M5066O3768J31099J10908J45154J25491J17151O8140L753j0413
14323A603305m6139l1569q515k371Q8764J01299M7479P2252J06316J25733Q8498
14312B145052J69725J98845J96749K36377K24853K44848K83511K85485K89509
14303D274954L15321L91446M91556O26912Q26123J042154J318044J626769J931655
14294A2844934K172975K342851K431601K495250K590774K889448L525773M731852
14286C6025458O793440J0226155J5881690K4378159L5063075M6888061N7825698
14279B33081736O4438125O4014827N4663914L7032120J3921523j1724109l4941425
14272D20486711n2044346o1010021o1295748n5247564m5401034l4384571k4508396
$$ plain form
14265 86595031 69865643 58610723 50875296 45357478 41204523 37803280 34636346 31510587
14257 31510587 28384208 25276958 22334708 19652300 17341023 15390087 13782060 12461440
14249 12461440 11357231 10413931 9591872 8856203 8236572 7719796 7239281 6814904 6429065
14240 6429065 6061817 5743881 5447992 5117847 4840466 4573020 4283511 3990886 3707535
14231 3707535 3464267 3234610 3018422 2817293 2642123 2518445 2389953 2225288 2081083
14222 2081083 1956376 1861040 1807363 1753860 1674367 1616362 1556486 1453852 1379791 1288509 1231895
14211 1231895 1184629 1143475 1094755 1038161 1010936 1039518 1035509 1025001 1043184 1047256 1061078 1025847
14199 1025847 1000316 1001623 999794 969735 956117 912520 876074 857192 818506 770471 736043 700157
$$ packed form
14265H6595031j6729388j1254920p735427n517818m152955l401243l166934l125759
14257C1510587l126379l107250k942250k682408k311277j950936j608027j320620
14249A2461440j104209r43300q22059p35669o19631n16776m80515m24377l85839
14240F429065l67248l17936k95889l30145k77381k67446k89509k92625k83351
14231C707535k43268k29657k16188k01129j75170j23678j28492j64665j44205
14222B081083j24707r5336n3677n3503p9493n8005n9876j02634p4061r1282n6614
14211A231895m7266m1154m8720n6594k7225K8582m009j0508J8183M072J3822l5231
14199A025847k5531J307j829l0059j3618m3597l6446j8882l8686m8035l4428l5886
$$ plain form
14187 700157 664747 638786 613851 586135 572052 598749 594111 582380 568033 524925 497726 507796
14175 507796 548467 555519 571849 602663 591984 566383 542872 522660 500022 500074 503361 503434 480392
14162 480392 480762 513340 511413 516436 555662 581312 634215 649136 667759 722811 740904 816258
14150 816258 850995 825493 794056 768592 699001 604988 508058 410753 361057 300445 298250 307169
14138 307169 298818 283472 292355 305205 313400 322558 340631 378955 407132 404842 416358 424756 379336
14125 379336 361506 339362 313972 277983 217059 137984 104448 87036 45939 41927 67857 78534
14113 78534 86835 118902 139639 139361 130226 140306 139012 118977 116350 161475 170984 207841 196432
14100 196432 173531 186929 217461 204675 194391 175731 147049 162897 154971 165639 202003 193794
$$ packed form
14187G00157l5410k5961k4935k7716j4083K6697m638j1731j4347m3108k7199J0070
14175E07796M0671P052J6330L0814j0679k5601k3511k0212k2638N2L287P3k3042
14162D80392L70L2578j927N023L9226K5650N2903J4921J8623N5052J8093P5354
14150H16258L4737k5502l1437k5464o9591r4013r6930r7305m9696o0612k195Q919
14138C07169q351j5346Q883J2850Q195R158J8073L8324K8177k290J1516Q398m5420
14125C79336j7830k2144k5390l5989o0924p9075l3536j7412m1097m012K5930J0677
14113G8534Q301L2067K0737k78r135J0080j294k0035k627M5125R509L6857j1409
14100A96432k2901J3398L0532j2786j0284j8660k8682J5848p926J0668L6364q209
$$ plain form
14088 193794 187595 146082 160252 182836 151241 125149 148565 148272 109322 122396 170403 192662
14076 192662 218755 227246 238034 257188 247364 218324 197615 201076 204566 194128 172169 173048 174903
14063 174903 167633 176880 180295 212549 218836 185319 149164 151274 198784 232643 233473 231350 218754
14050 218754 219167 200345 184181 180525 192098 192319 172010 159891 131504 96659 101734 132744 111292
14037 111292 87725 79619 83468 92965 96483 85849 96196 87583 92033 70249 58404 82475 97301
14024 97301 90380 107446 115321 122225 116603 91808 75336 63964 72506 82849 76175 81558 76053
14011 76053 80278 78094 64615 64003 70019 89452 103690 104133 116401 120837 127824 106745 90733
13998 90733 88455 84343 40732 46214 54239 74589 86527 79720 57651 42633 58325 57367 72579
$$ packed form
14088A93794o199m1513J4170K2584l1595k6092K3416k93l8950J3074M8007K2259
14076A92662K6093Q491J0788J9154r824k9040k0709L461L490j0438k1959Q79J855
14063A74903p270R247L415L2254O287l3517l6155K110M7510L3859Q30k123j2596
14050B18754M13j8822j6164l656J1573K21k0309j2119k8387l4845N075L1010k1452
14037A11292k3567q106L849R497L518j0634J0347q613M450k1784j1845K4071J4826
14024I7301o921J7066P875O904n622k4795j6472j1372Q542J0343o674N383n505
14011G6053M225k184j3479o12O016J9433J4238M43J2268M436O987k1079j6012
13998I0733k278m112m3611N482Q025K0350J1938o807k2069j5018J5692r58J5212
$$ plain form
13985 72579 116218 151032 171705 161113 156847 152851 115783 83728 89223 101627 80493 82728
13973 82728 122592 149013 161424 167367 170507 186321 197687 223966 214111 178469 171691 161064
13961 161064 137060 89713 38958 47876 63862 42691 28346 3250 13806 19612 12232 21076
13949 21076 28066 36532 38801 17804 12328 39493 38330 25079 13296 12474 11672 10317 20077 20124
13935 20124 13195 24702 10665 27027 87821 97342 75452 49697 27819 18185 1813 12709
13923 12709 -4148 -3398 12688 38838 18099 19910 11151 35012 25163 4914 7821 24584 66904
13910 66904 39621 36038 20697 5257 -6372 18031 51544 73493 87892 70148 55013 78455
13898 78455 95603 66485 57771 78343 79772 40799 16657 6530 6497 7106 -7502 -959 26263
$$ packed form
13985G2579M3639L4814K0673j0592m266l996l7068l2055N495J2404k1134K235
13973H2728L9864K6421J2411N943L140J5814J1366K6279r855l5642o778j0627
13961A61064k4004m7347n0755Q918J5986k1171j4345k5096J0556N806p380Q844
13949B1076O990Q466K269k0997n476K7165j163j3251j1783q22q02j355R760M7
13935B0124o929J1507j4037J6362O0794R521k1890k5755k1878r634j6372J0896
13923A2709j6857P50J6086K6150k0739J811q759K3861r849k0249K907J6763M2320
13910F6904k7283l583j5341j5440j1629K4403L3513K1949J4399j7744j5135K3442
13898G8455J7148k9118q714K0572J429l8973k4142j0127l3O09j4608O543K7222
$$ plain form
13885 26263 21532 19671 17593 11598 34908 59041 29094 -10525 -15320 -14573 -9673 6656 -2018
13872 -2018 -27 -12771 2829 13244 25111 27037 -7749 -33920 -33414 -16477 315 30439 54354
13859 54354 70441 66102 50609 37739 47062 56047 74931 61229 51021 41760 42135 73670 66216
13846 66216 32962 17006 33376 35851 78448 130504 161220 147508 152228 158010 156891 179954
13834 179954 204928 215177 224625 242870 315325 372262 494863 685221 950853 1292737 1657499
13823 1657499 1977224 2271694 2459757 2535137 2468954 2271047 2002625 1722126 1423782 1128669
13813 1128669 881676 693572 555528 432643 336200 292860 285466 258555 220098 244004 257621
13802 257621 212239 194634 191849 154553 124613 135515 127868 119386 98990 81684 67193 55610
$$ packed form
13885B6263m731j861k078n995K3310K4133k9947l9619m795P47M900J6329q674
13872b018J991j2744J5600J0415J1867J926l4786k6171N06J6937J6792L0124K3915
13859E4354J6087m339j5493j2870R323Q985J8884j3702j0208r261L75L1535p454
13846F6216l3254j5956J6370K475M2597N2056L0716j3712M720N782j119K3063
13834A79954K4974J0249R448J8245P2455N6937J22601J90358K65632L41884L64762
13823A657499L19725K94470J88063P5380o6183j97907k68422k80499k98344k95113
13813A128669k46993j88104j38044j22885r6443m3340p394k6911l8457K3906J3617
13802B57621m5382j7605k785l7296k9940J0902p647q482k0396j7306j4491j1583
$$ plain form
13790 55610 82450 85531 67227 60173 37053 -4671 -10782 15339 59962 95918 87489 55133
13778 55133 71374 86683 69073 54951 48619 37806 47550 73115 71922 97467 98251 73393 46638
13765 46638 44095 30716 39502 38817 38590 58462 65557 72260 66965 32348 29771 32729 25116 12720
13751 12720 7328 24716 24057 67377 72996 63480 56130 37956 53172 57759 56839 35620 30465 40646
13737 40646 58103 56838 65193 53042 59665 36020 13769 14706 11392 9077 39981 35918 38887
13724 38887 34688 10553 15866 25238 29258 28519 8889 -10776 1543 22946 17701 12063 -17756
13711 -17756 -34184 -16748 15792 34226 44650 51128 21448 30020 36137 31613 7099 -11482
13699 -11482 -1792 17861 8721 6944 -7098 -1999 19 6729 6575 10042 4106 29746 34561 36103
$$ packed form
13790E5610K6840L081j8304p054k3120m1724o111K6121M4623L5956q429l2356
13778E5133J6241J5309j7610j4122o332j0813R744K5565j193K5545P84k4858k6755
13765D6638k543j3379Q786o85k27J9872P095O703n295l4617k577K958p613j2396
13751A2720n392J7388o59M3320N619r516p350j8174J5216M587r20k1219n155J0181
13737D0646J7457j265Q355j2151O623k3645k2251R37l314k315L0904m063K969
13724C8887m199k4135N313R372M020p39j9630j9665J2319K1403n245n638k9819
13711a7756j6428J7436L2540J8434J0424O478k9680Q572O117m524k4514j8581
13699a1482R690J9653r140j777j4042N099K018O710j54L467n936K5640M815J542
$$ plain form
13685 36103 63622 52943 46436 28988 7824 8426 12313 11263 23631 26607 37529 29176 12588
13672 12588 4222 9368 21709 24622 30215 8067 -3162 7648 -12365 -20200 -15420 -4576 19216
13659 19216 37365 42372 1940 9449 37804 18057 13924 -17207 -32447 -29329 -26888 -23125 -26799
13646 -26799 15303 28992 32182 19799 26021 40521 30713 37908 41886 47436 16020 15496 18751
13633 18751 30417 48895 52709 33315 12679 2756 12264 -22942 -19342 6810 -2585 9874 11860
13620 11860 26952 33192 17398 -4799 -25654 -7449 7603 -452 161 26069 28739 17526 -30235
13607 -30235 -22837 -29775 -9066 44327 12372 12738 31372 31743 2925 -15268 20790 9979 -8010
13594 -8010 -20163 -43888 -46524 -15517 -1324 -8395 5157 30717 54960 46816 29868 20480 43675
$$ packed form
13685C6103K7519j0679o507j7448k1164O02L887j050J2368K976J0922q353j6588
13672A2588q366N146J2341K913N593k2148j1229J0810k0013p835M780J0844K3792
13659A9216J8149N007m0432P509K8355j9747m133l1131j5240L118K441L763l674
13646b6799M2102J3689L190j2383O222J4500r808P195L978N550l1416n24L255
13633A8751J1666J8478L814j9394k0636r923R508l5206L600K6152r395J2459J986
13620A1860J5092O240j5794k2197k0855J8205J5052q055O13K5908K670j1213m7761
13607c0235P398o938K0709N3393l1955L66J8634L71k8818j8193L6058j0811j7989
13594h010j2153k3725k636L1007J4193p071J3552K5560K4243q144j6948r388K3195
$$ plain form
13581 43675 57214 44181 42719 61178 51883 9047 -24177 -13617 11134 14433 17940 -796
13569 -796 -4605 3610 13403 9252 13142 46701 14340 -7753 -591 3985 8659 20811 32977 21335
13555 21335 20085 13139 5154 -11229 -2699 11598 13709 35400 43699 62871 79300 78732 74971
13542 74971 61409 63673 64975 75008 59334 52931 36691 6925 -24108 -31284 -14196 5723
13530 5723 15036 -2919 -9754 -3702 22970 18610 2328 1809 -4293 -23621 -4738 11124 -12268
13517 -12268 -50900 -46182 -4801 22698 29080 12970 59470 86075 84422 78715 42739 28755
13505 28755 19927 30070 20136 16611 26858 47968 69587 84457 111218 151856 197356 253712
13493 253712 341681 414815 454815 474873 472626 474372 463358 437690 386169 359991 300277 210279
$$ packed form
13581D3675J3539j3033j462J8459r295m2836l3224J0560K4751L299L507j8736
13569g96l809Q215R793m151L890L3559l2361k2093P162M576M674J2152J2166j1642
13555B1335j250o946p985j6383Q530J4297K111K1691Q299J9172J6429n68l761
13542G4971j3562K264J302J0033j5674o403j6240k9766l1033p176J7088J9919
13530E723R313j7955o835O052K6672m360j6282n19o102j9328J8883J5862k3392
13517a2268l8632M718M1381K7499O382j6110M6500K6605j653n707l5976j3984
13505B8755q828J0143r934l525J0247K1110K1619J4870K6761M0638M5500N6356
13493B53712Q7969P3134M0000K0058k247J746j1014k5668n1521k6178n9714q9998
$$ plain form
13481 210279 154901 149052 135848 123944 94695 43428 55697 76232 85941 83424 85566 135582
13469 135582 151575 133629 122196 157742 158035 132069 138218 135791 90389 43718 13382 4987
13457 4987 32407 30622 23947 25753 41163 26004 8668 38504 63198 33958 14106 15533 15159
13444 15159 4715 17231 38495 71207 69541 47759 56371 25452 -25885 -30804 -24911 -35238
13432 -35238 -19622 -10824 -1491 36686 47557 38582 12649 6111 -25206 -26307 -23167 -1164 12835
13419 12835 44885 49004 36747 23369 -7240 -9159 1842 541 1866 15819 49838 49832 14159
13406 14159 16176 10695 -5213 -15863 -12325 -49849 -12585 25107 51280 92588 59514 22594
13394 22594 -220 4208 16540 30325 23865 13060 -1265 24492 40764 59211 76703 59577
$$ packed form
13481B10279n5378n849j3204j1904k9249n1267J2269K0535R709k517K142N0016
13469A35582J5993j7946j1433L5546K93k5966O149k427m5402m6671l0336q395
13457D987K7420j785o675J806J5410j5159j7336K9836K4694k9240j9852J427l74
13444A5159j0444J2516K1264L2712j666k1782Q612l0919n1337m919N893j0327
13432c5238J5616Q798R333L8177J0871q975k5933o538l1317j101L140K2003J3999
13419A2835L2050M119j2257j3378l0609j919J1001j301J325J3953L4019ol5673
13406A4159K017n481j5908j0650L538l7524L7264L7692K6173M1308l3074l6920
13394B2594k2814M428J2332J3785o460j0805j4325K5757J6272J8447J7492j7126
$$ plain form
13382 59577 53102 42587 14996 6758 -8819 -28655 -14339 4300 13061 23893 39228 23570
13370 23570 20932 49746 72682 76181 70325 52885 30462 -6626 -14072 -5215 28387 42674 3799
13357 3799 -8667 11671 28442 11213 -13089 -22083 -25107 -11128 -4166 27216 1771 -41803
13345 -41803 -42844 -36661 -23555 -15082 -17555 16734 12866 -15760 1338 32144 40349 62366 44853
13332 44853 6490 -5337 18283 12630 12498 2944 876 14023 6411 -13695 -15182 16679 23663
13319 23663 32301 40837 30427 44519 4128 -13036 -8124 2959 6072 22197 43347 47606 32255
13306 32255 7361 -20202 -16418 28869 7974 -269 -41232 -56636 -17902 44821 50902 44279
13294 44279 45696 47849 74291 45221 22690 18588 28458 30146 12656 20802 -4831 -27691 -1169
$$ packed form
13382E9577o475j0515k7591q238j5577j9836J4316J8639Q761J0832J5335j5658
13370B3570k638K8814K2936L499n856j7440k2423l7088p446Q857L3602J4287l8875
13357C799j2466K0338J6771j7229k4302q994l024J3979O962L1382k5445m3574
13345d1803j041O183J3106Q473k473L4289l868k8626J7098L0806Q205K2017j7513
13332D4853l8363j1827K3620n653j32r554k068J3147p612k0106j487L1861O984
13319B3663Q638Q536j0410J4092m0391j7164M912J1083L113J6125K1150M259j5351
13306C2255k4894k7563L784M5287k0895q243m0963j5404L8734O2723O081o623
13294D4279J417K153K6442k9070k2531m102R870J688j7490Q146k5633k2860K6522
$$ plain form
13281 -1169 -4896 -24630 -21101 11746 16542 32677 48990 21259 -2590 20848 38231 16753
13269 16753 275 -3946 4762 -7788 -21067 -33178 -13872 -10305 10876 2277 -20391 -35998
13257 -35998 -13989 17930 36870 11230 -13935 -17590 -34095 -16144 19877 -1501 -43180 -48622
13245 -48622 -31306 -4794 -6006 -6769 -13160 -26095 -47335 -24236 5620 17864 13697 13273 -9301
13232 -9301 -16714 -14575 -21984 -44415 -40553 -27562 -19615 -22241 -22725 -14316 3293 -26585 -27938 -6133
13218 -6133 -17077 -20446 25027 62934 33500 24326 28895 33698 37167 43824 41461 28910 35847
13205 35847 39722 26744 25243 30063 22569 8418 16605 21648 11543 35329 43821 26643 16505
13192 16505 1074 -14646 -22384 -28785 -40482 -47794 -60837 -64906 -42933 -22899 -20482 -48749 -47985
$$ packed form
13281a169l727j9734L529L2847M796J6135J6313k7731k3849K3438J7383k1478
13269A6753j6478m221Q708j2550j3279j2111J9306L567K1181q599k2668j5607
13257c5998K2009L1919J8940k5640k5165l655j6505J7951L6021k1378m1679n442
13245d8622J7316K6512j212p63o391j2935k1240K3099K9856J2244m167m24k2574
13232i301p413K139p409k2431L862J2991P947k626m84Q409J7609k9878j353K1805
13218f133j0944l369M5473L7907k9434r174M569M803L469O657k363j2551O937
13205C5847L875j2978j501M820p494j4151Q187N043j0105K3786Q492j7178j0138
13192A6505j5431j5720p738o401j1697p312j3043m069K1973K0034K417k8267P64
$$ plain form
13179 -47985 -4967 21617 -2800 -30059 -40057 -11685 10178 1493 -1856 30895 57268 29716
13167 29716 -8291 -20122 -7666 -9973 20956 21584 40075 31458 56871 61735 45439 37183 36127
13154 36127 24864 19570 5256 3831 -8996 11385 29626 -17623 -22450 -1689 21923 32253
13142 32253 15424 -7620 -3050 -6215 -22908 -24322 -8558 -3900 11118 21485 32319 48436
13130 48436 55128 39549 27114 12503 9263 26609 -1973 13075 5405 8937 15078 27108 59397
13117 59397 54752 2325 -28674 -15714 36717 44315 43643 74901 88291 48723 40777 21108 -18300
13104 -18300 -30670 -35046 -45893 -22343 -45877 -52574 -10830 2492 -12000 781 -3415 5330
13092 5330 11299 61194 72174 59211 44509 72227 49190 42331 30369 49473 61782 54143
$$ packed form
13179d7985M3018K6584k4417k7259r998K8372K1863q685l349L2751K6373k7552
13167B9716l8007j1831J2456k307L0929O28J8491q617K5413M864j6296q256j056
13154C6127j1263n294j4314j425j2827K0381J8241m7249m827K0761K3612J0330
13142C2253j6829k3044M570l165j6693j414J5764M658J5018J0367J0834J6117
13130D8436O692j5579j2435j4611l240J7346k8582J5048p670L532O141J2030L2289
13117E9397m645n2427l0999J2960N2431P598o72L1258J3390l9568p946j9669l9408
13104a8300j2370m376j0847K3550k3534o697M1744J3322j4492J2781m196Q745
13092E330N969M9895J0980j2963j4702K7718k3037o859j1962J9104J2309p639
$$ plain form
13080 54143 70132 54982 31688 46053 36809 26092 18618 -310 -4458 8798 -22526 -40685
13068 -40685 -35155 -30013 646 27098 25744 26021 53252 53439 19047 -512 20213 -2207 -19862
13055 -19862 2884 14165 -18361 -8757 -2351 4356 46170 50263 35052 12777 36148 42845 38549
13042 38549 23455 20052 26092 26998 23559 20693 14993 8953 -8527 -29137 -39845 -13078 19755
13029 19755 8139 -2458 -8325 -14943 -660 -2356 -26951 -24549 14064 55613 53943 43057 22196
13016 22196 -9482 -23136 -1099 54990 46084 59606 48085 29969 30182 35675 47021 77143
13004 77143 68019 53953 27040 29568 38387 45708 19752 -33649 -32099 3429 13759 2730 -9487
12991 -9487 -15660 3696 26592 41504 45980 24058 9578 17714 33071 34736 14144 20602 33048
$$ packed form
13080E4143J5989j5150k3294J4365r244j0717p474j8928m148J3256l1324j8159
13068d0685N530N142L0659K6452j354K77K7231J87l4392j9559K0725k2420j7655
13055a9862K2746J1281l2526R604O406O707M1814M093j5211k2275K3371O697m296
13042C8549j5094l403O040R06l439k866n700o040j7480k0610j0708K6767L2833
13029A9755j1616j0597n867o618J4283j696k4595K402L8613M1549j670j0886k0861
13016B2196l1678j3654K2037N6089q906J3522j1521j8116K13N493J1346L0122
13004G7143r124j4066k6913K528Q819P321k5956n3401J550L5528J0330j1029j2217
12991i487o173J9356K2896J4912M476k1922j4480Q136J5357J665k0592O458J2446
$$ plain form
12978 33048 26856 18892 21631 11003 -10595 -17580 -24954 -31379 -1069 17083 22376 27734 32780
12965 32780 52996 51178 19513 17918 35988 11039 -30918 -49711 -3623 -13404 7481 33535
12953 33535 49566 50889 57346 59947 70994 56168 31235 725 -18085 -25582 -10978 -22423
12941 -22423 -40146 -38941 -37782 -30118 -45998 -45841 -20374 16881 32712 4909 -35164 -43642 -3512
12928 -3512 18612 10147 10983 -10827 -16076 -24362 -14919 -22595 -41794 -39578 -33516 -44557 -20552 -13417
12914 -13417 4047 -11213 -9027 4719 -2625 -16920 2386 28560 39363 16667 11841 27434
12902 27434 28629 5333 -5466 20605 31710 30994 39401 32591 -11613 -83900 -55749 8079 26879
12889 26879 3664 1690 20384 41949 22446 33784 58567 26707 -7675 -16773 -22763 -29087
$$ packed form
12978C3048o192p964K739j0628k1598o985p374o425L0310J8152N293N358N046
12965C2780K0216j818l1665j595J8070k4949m1957j8793M6088r781K0885K6054
12953C3535J6031J323O457K601J1047j4826k4933l0510j8810p497J4604j1445
12941b2423j7723J205J159P664j5880J57K5467L7255J5831k7803m0073q478M0130
12928c512K2124q465Q36k1810n249q286R443p676j9199K216O062j1041K4005P135
12914a3417J7464j5260K186J3746p344j4295J9306K6174J0803k2696m826J5593
12902B7434J195k3296j0799K6071J1105p16Q407o810m4204p2287K8151O3828J8800
12889B6879k3215j974J8694K1565j9503J1338K4783l1860l4382r098n990o324
$$ plain form
12877 -29087 -50452 -37016 -4475 41037 58346 26633 -9713 -16003 -22750 -27491 9636 15487
12865 15487 25956 44337 45752 4512 -21515 -28762 -10968 11019 15036 20145 -7580 -24102
12853 -24102 -6614 13570 24990 25637 18197 -13237 -33524 -41834 -24065 8150 11721 -10765 -37171
12840 -37171 -48700 -30430 -37725 -60710 -74254 -52438 -3328 -17282 -33609 -13964 18912 25245
12828 25245 48860 34640 40237 25902 15244 -1886 -182 18312 34586 19159 26743 37898
12816 37898 31605 13704 -19688 -25147 -23560 -24287 -13164 5609 -828 -3643 -7231 -5492 29329
12803 29329 46458 57884 30433 27932 43000 54048 46007 29420 23291 3035 -4060 12605
12791 12605 50241 34300 21260 25861 -7704 -17652 -27522 -44260 -32664 -9137 13625 4207
$$ packed form
12877b9087k1365J3436L2541M5512J7309l1713l6346o290o747m741L7127N851
12865A5487J0469J8381J415m1240k6027p247J7794K1987M017N109k7725j6522
12853b4102J7488K0184J1420O47p440l1434k0287q310J7769L2215L571k2486k6406
12840c7171j1529J8270p295k2985j3544K1816M9110j3954j6327J9645L2876O333
12828B5245K3615j4220N597j4335j0658j7130J704J8494J6274j5427P584J1155
12816C7898o293j7901l3392n459J587p27J1123J8773o437k815l588J739L4821
12803B9329J7129J1426k7451k501J5068J1048q041j6587o129k0256p095J6665
12791A2605L7636j5941j3040M601l3565r948r870j6738J1596K3527K2762r418
$$ plain form
12779 4207 2446 24409 40337 32770 20346 14067 6754 9195 3855 127 -3181 -13792 2750
12766 2750 2282 9337 -4387 9496 30028 55593 44235 9954 -11887 -25312 -28346 -22207 -16202
12753 -16202 3675 14156 11981 16479 -24386 -32678 -22250 -12870 -9988 -676 30027 54060 86359
12740 86359 83206 64304 57617 37199 26570 11149 21001 20520 22842 31956 44607 38340 -662
12727 -662 -1215 3958 19917 11150 -12021 -31419 -56591 -30964 2237 5241 30972 59961 48069
12714 48069 18602 17237 2675 -8653 -17005 17180 29725 30451 12572 5773 -2436 -2183 8389
12701 8389 8123 11438 20410 26331 19829 21432 16179 27906 11205 6979 18884 44326 47455 35591
12687 35591 16709 -219 -15223 -31990 -40923 -27696 -20660 27970 15850 5033 28307 32304
$$ packed form
12779D207j761K1963J5928p567j2424o279p313K441n340l728l308j0611J6542
12766B750m68P055j3724J3883K0532K5565j1358l4281k1841j3425l034O139O005
12753a6202J9877J0481k175M498m0865q292J0428R380K882R312L0703K4033L2299
12740H6359l153j8902o687k0418j0629j5421R852m81K322R114J2651o267l9002
12727f62n53N173J5959q767k3171j9398k5172K5627L3201L004K5731K8989j1892
12714D8069k9467j365j4562j1328q352L4185J2545P26j7879o799q209K53J0572
12701H389k66L315Q972N921o502J603n253J1727j6701m226J1905K5442L129j1864
12687C5591j8882j6928j5004j6767q933J3227P036M8630j2120j0817K3274L997
$$ plain form
12675 32304 9178 -263 1957 17902 22300 -4267 -31282 -44706 -24510 -1398 6036 16152
12663 16152 7764 -4139 -29065 -34294 -20127 -29629 -35531 -24338 -28709 -24671 14859 50071 63067
12650 63067 63748 47642 13895 -22409 9132 34323 41624 14515 17226 35890 23728 -749
12638 -749 -1523 -11122 33328 53450 31235 3744 -18965 -11210 -8272 17450 36978 29461 2661
12625 2661 -14423 2778 15113 673 -25382 -4224 26260 52010 -4166 -31073 -29565 -23173
12613 -23173 7900 23718 62902 128531 215866 269394 260255 242445 180215 114889 79232 47523
12601 47523 23015 40544 36226 13732 -20624 -37343 -32600 -72516 -64368 -14260 -26228 3624
12589 3624 28714 589 -18333 -11330 -3644 6491 -1571 -710 -28738 -35754 -34864 -21439 -19557 -12251
$$ packed form
12675C2304k3126r441K220J5945M398k6567k7015j3424K0196K3112P434J0116
12663A6152q388j1903k4926n229J4167r502n902J1193m371M038L9530L5212J2996
12650F3067O81j6106l3747l6304L1541K5191P301k7109K711J8664j2162k4477
12638g49p74r599M4450K0122k2215k7491k2709P755K938K5722J9528p517k6800
12625B661j7084J7201J2335j4440k6055K1158L0484K5750n6176k6907J508O392
12613b3173L1073J5818L9184O5629Q7335N3528r139j7810o2230o5326l5657l1709
12601D7523k4508J7529m318k2494l4356j6719M743l9916Q148N0108j1968K9852
12589C624K5090k8125j8922P003P686J0135q062Q61k8028p016Q90J3425J882P306
$$ plain form
12575 -12251 6822 26435 17965 6368 -3307 -31848 -26084 -25570 -8531 19518 10701 10942 3735
12562 3735 42381 44941 48382 47780 33496 46242 51013 37337 11417 -13821 -9223 -27026 -46955
12549 -46955 -47010 -65124 -56392 -27928 -25590 9729 5545 16906 12813 -2575 -10672 -30757 -16310
12536 -16310 23429 39132 46781 -3514 -29246 -19801 -7 23894 26327 1574 -28280 -17372
12524 -17372 -9884 7416 18791 25469 57995 29632 -2812 12041 15275 -1860 5068 -16740
12512 -16740 -27413 -36048 -45024 -48476 -58860 -31766 -27609 -25257 -14604 -35292 -6945 3975 6604
12499 6604 -274 -132 -829 -9936 1125 11402 1339 -14835 -37380 -18053 11125 21271 27780
12486 27780 27313 19726 18839 47675 41897 13911 -2889 -28789 -24854 4857 8162 -27244 -35536
$$ packed form
12575a2251J9073J9613q470j1597r675k8541N764N14J7039K8049q817K41p207
12562C735L8646K560L441o02j4284J2746M771j3676k5920k5238M598j7803j9929
12549d6955n5j8114Q732K8464K338L5319m184J1361m093j5388q097k0085J4447
12536a6310L9739J5703P649n0295k5732R445J9794K3901K433k4753k9854J0908
12524a7372P488J7300J1375O678L2526k8363l2444J4853L234j7135O928k1808
12512a6740j0673q635q976l452j0384K7094M157K352J0653k0688K8347J0920K629
12499F604o878J42o97r107J1061J0277j0063j6174k2545J9327K9178J0146O509
12486B7780m67p587q87K8836n778k7986j6800k5900L935K9711L305l5406q292
$$ plain form
12473 -35536 -45733 -28264 -21282 -7058 19312 -18676 -27274 -13541 -18300 -24959 -769 5129 -16237
12460 -16237 -23204 -11250 -23144 -25926 -46803 -66877 -47581 -34715 -27901 1600 22968 19080
12448 19080 -4392 -21917 -31215 -10452 -11181 -23027 -34004 424 11449 15494 12285 -15442 -12490
12435 -12490 -5961 -5578 -729 -6768 -30638 -16850 -12579 2850 16215 2674 -33330 -15074 7370
12422 7370 10900 33628 57970 57139 63220 86243 48731 21856 4868 -20310 -14539 -14167 17723
12409 17723 12991 -16446 -13050 27146 43745 19845 11988 20023 32824 30291 61359 36314 -16603
12396 -16603 -37164 -35501 -45869 -25079 -36714 -23243 -2841 -19850 -20036 5848 -3865 9636
12384 9636 52481 53227 30796 11271 -18925 -15449 -25401 -34646 -4992 -10574 -25714 -5177 6564
$$ packed form
12473c5536j0197J7469O982J4224K6370l7988q598J3733m759o659K4190N898k1366
12460a6237o967J1954j1894k782k0877k0074J9296J2866O814K9501K1368l888
12448A9080k3472j7525r298K0763p29j1846j0977L4428J1025M045l209k7727K952
12435a2490O529L83M849o039k3870J3788M271J5429J3365j3541l6004J8256K2444
12422G370L530K2728K4342q31O081K3023l7512k6875j6988k5178N771L72L1890
12409A7723m732k9437L396M0196J6599k3900p857Q035J2801k533L1068k5045n2917
12396a6603k0561J663j0368K0790j1635J3471K0402j7009j86K5884r713J3501
12384I636M2845P46k2431j9525l0196L476r952r245K9654n582j5140K0537J1741
$$ plain form
12371 6564 -30115 -29216 -27958 -4677 18624 14568 554 -14414 -10452 14900 40208 19226 15110
12358 15110 31845 12654 10764 495 -3240 -22145 -52040 -19874 -3179 4121 6577 -23929
12346 -23929 -14920 -2370 5731 -6121 -16481 -29762 -16588 -10986 -16846 313 28341 15133
12334 15133 5030 -3997 -9739 -17771 -18426 -15799 -8271 3959 -469 5907 23480 25043 31327 30348
12320 30348 9805 -31451 -36681 1723 19610 29980 41163 26932 16180 -22101 -26164 -4986
12308 -4986 22014 16519 1528 23793 6877 -10832 19697 35381 7001 4421 31728 38942
12296 38942 9384 23948 30863 22397 27422 45133 30119 22633 47305 22216 14703 -14421 -11413
12283 -11413 -771 5946 -9192 -4845 11839 1185 -23906 -54793 -41516 -28446 -45120 -9803
$$ packed form
12371F564l6679Q99J258K3281K3301m056j4014j4968L962K5352K5308k0982m116
12358A5110J6735j9191j890j0269l735j8905k9895L2166J6695P300K456l0506
12346b3929R009J2550Q101j1852j0360j3281J3174N602n860J7159K8028j3208
12334A5133j0103r027n742q032o55K627P528J2230m428O376J7573J563O284r79
12320C0348k0543m1256n230L8404J7887J0370J1183j4231j0752l8281m063K1178
12308d986K7000n495j4991K2265j6916j7709L0529J5684k8380k580K7307P214
12296C8942k9558J4564O915q466N025J7711j5014p486K4672k5089p513k9124L008
12283a1413J0642O717j5138M347J6684j0654k5091l0887J3277J3070j6674L5317
$$ plain form
12271 -9803 8286 3564 7424 7760 2012 34268 61228 60319 65214 22039 9216 14324 -326 -11232
12257 -11232 -14948 20714 48519 32478 16292 35502 65894 72260 60877 25321 28658 12793
12245 12793 -17510 -13190 1270 9548 18102 8477 9559 27195 18810 15222 11333 22455 -7704
12232 -7704 -46340 -49148 -44093 -51036 -45521 -31242 -4981 12115 8807 7715 15125 6950 27793
12219 27793 17897 9206 5280 6530 15404 27428 29989 46903 56174 46773 47376 34780 2092 346
12205 346 -6726 -13630 -18645 -14535 -29030 -27676 -2594 12255 13194 -9061 -19266 -21648 1622 10397
12191 10397 25010 31715 20438 2941 -24298 -29232 -6919 -26585 2124 43516 25439 23160
12179 23160 16666 29667 19801 -39323 -24935 -1074 -6131 16983 44656 48702 37290 37893 24939
$$ packed form
12271i803J8089m722L860L36n748L2256K6960r09M895m3175j2823N108j4650j0906
12257a1232l716L5662K7805j6041j6186J9210L0392O366j1383l5556L337j5865
12245A2793l0303M320J4460Q278Q554r625J082J7636q385l588l889J1122l0159
12232g704l8636k808N055o943N515J4279K6261J7096l308j092P410q175K0843
12219B7793r896q691l926J250Q874J2024K561J6914R271r401O03j2596l2688j746
12205C46p072o904n015M110j4495J354K5082J4849R39k2255j0205k382K3270Q775
12191A0397J4613O705j1277j7497k7239m934K2313j9666K8709M1392j8077k279
12179B3160o494J3001r866n9124J4388K3861n057K3114K7673M046j1412O03j2954
$$ plain form
12166 24939 17657 48325 41256 25174 35260 29466 25930 14981 22332 27377 5013 -17563 -17282
12153 -17282 2164 7475 7245 -14993 -51750 -40656 -21362 -57742 -72360 -50279 -3498 25422
12141 25422 36847 24270 14321 34602 9962 -23527 -31483 -2591 592 34270 64053 67298
12129 67298 41691 29683 35098 39763 34817 35718 9065 34244 57212 46840 35621 43435 59184
12116 59184 53861 41403 -6771 -9277 -8265 -26298 -33195 -24666 -36849 -7762 22996 52099 42489
12103 42489 16428 23210 11015 -1158 -9602 9322 4765 17265 33869 2114 -25418 -17475
12091 -17475 -32504 -42472 -27989 -27153 -7367 10800 7779 -16028 9047 18339 12132 4307 593
12078 593 19372 30251 39704 28321 11872 -11496 -20377 5792 27767 43144 51591 848 -43564
$$ packed form
12166B4939p282L0668p069j6082J0086n794l536j0949P351N045k2364k2576K81
12153a7282J9446N311k30k2238l6757J1094J9294l6380j4618K2081M6781K8920
12141B5422J1425j2577r949K0281k4640l3489p956K8892L183L3678K9783L245
12129F7298k5607j2008N415M665m946R01k6653K5179K2968j0372j1219P814J5749
12116E9184n323j2458m8174k506J012j8033o897Q529j2183K9087L0758K9103r610
12103D2489k6061O782j2195j2173q444J8924m557J2500J6604l1755k7532P943
12091a7475j5029r968J4483Q36J9786J8167l021k3807K5075R292o207p825l714
12078E93J8779J0879R453j1383j6449k3368q881K6169K1975J5377Q447n0743m4412
$$ plain form
12065 -43564 -52737 -35554 -8255 -30910 -49837 -27887 -6577 8136 -4969 -29053 -44789 -37175
12053 -37175 -47916 -21312 -16029 -16307 -2813 -27095 -47129 -43386 -37291 -28546 -23848 -39868 -2287
12040 -2287 2762 -51462 -50119 -22165 43 -13104 -14994 -42775 -55533 -6116 18371 -8916
12028 -8916 3881 18476 4843 -12881 -44291 -58868 -34871 10143 36466 39814 46260 36257
12016 36257 6601 -13902 -15118 -49648 -64679 -71470 -78316 -67738 -49912 -53900 -43835 -30635
12004 -30635 -36933 -36268 -19059 -16467 -12548 18909 -3701 -921 15931 25886 5297 2641 7290
11991 7290 11451 37604 6334 7149 23362 17496 -20414 -64647 -52796 -30375 -1320 10499 7121
11978 7121 6451 -3914 -19481 7136 10768 -18398 -29861 -52218 -43491 -20030 15630 11643 -11503
$$ packed form
12065d3564r173J7183K7299k2655j8927K1950K1310J4713j3105k4084j5736P614
12053c7175j0741K6604N283k78J3494k4282k0034L743O095Q745M698j6020L7581
12040b287N049n4224J343K7954K2208j3147j890k7781j2758M9417K4487k7287
12028h916J2797J4595j3633j7724l1410j4577K3997M5014K6323L348O446j0003
12016C6257k9656k0503j216l4530j5031o791o846J0578J7826l988J0065J3200
12004c0635o298O65J7209K592L919L1457k2610K780J6852R955k0589k656M649
11991G290M161K6153l1270Q15J6213n866l7910m4233J1851K2421K9055J1819l378
11978G121o70j0365j5567K6617L632k9166j1463k2357Q727K3461L5660l987k3146
$$ plain form
11965 -11503 -7849 -32128 -33577 -29999 -22194 -47081 -66136 -53176 -28229 -8176 31518 23318 -1438
11952 -1438 30748 37775 23404 12612 2576 -34417 -57765 -26240 -12050 -13696 -11662 -5013 2335
11939 2335 -1834 -29077 -15275 -5739 -38 -8382 -15933 -16132 1530 20704 17205 4382 5456 36056
11925 36056 52139 30768 29439 28461 25401 28557 6574 -16171 -12399 -12604 -10235 -30649 -50563
11912 -50563 -46058 -60831 -54079 -24226 -7092 -7599 -537 32176 46586 25912 -6491 -16034 -33212
11899 -33212 4233 -24429 -51844 -16901 23228 16584 -4747 11471 10290 11914 -3528 -9383
11887 -9383 15304 21437 7059 7319 -19711 -35540 -20468 921 8048 14512 26266 7445 8648
11874 8648 31509 23233 31800 63148 60722 47655 36932 23540 -4171 -36159 -34446 -11258 -5806
$$ packed form
11965a1503L654k4279j449L578P805k4887j9055J2960K4947K0053L9694q200k4756
11952a438L2186P027j4371j0792j0036l6993k3348L1525J4190j646K034O649P348
11939B335m169k7243J3802R536N701q344p551j99J7662J9174l499j2823J074L0600
11925C6056J6083k1371j329r78l060L156k1983k2745L772k05K369k0414j9914
11912e0563M505j4773O752K9853J7134n07P062L2713J4410k0674l2403r543j7178
11899c3212L7445k8662k7415L4943M0129o644k1331J6218j181J624j5442n855
11887i383K4687O133j4378K60k7030j5829J5072K1389P127O464J1754j8821J203
11874H648K2861q276Q567L1348k426j3067j0723j3392k7711l1988J713K3188N452
$$ plain form
11861 -5806 25356 35750 13774 12438 -15733 -18887 6944 8129 2020 12320 20767 31030 27216
11848 27216 13320 -24586 -42387 -33340 -28168 -32275 -16216 -23369 -42767 -62065 -62512 -38428 -737
11835 -737 24791 54091 48204 10006 18565 10465 -13425 -33385 -31500 -18258 11675 41352 51992
11822 51992 47247 39002 19934 -6007 -31782 -19456 4752 940 -7094 -13774 -19873 -4206 849
11809 849 36341 48646 -7614 -34064 -50349 -37573 -51348 -67361 -54786 -6501 22797 -8568
11797 -8568 -29094 13814 45076 33337 18177 6011 -8417 -18325 -42513 -40571 -21807 -23148
11785 -23148 -35741 -19685 14762 -2708 -18228 -3658 -11641 -11303 8947 -39302 -81637 -77763
11773 -77763 -34461 -18637 -32439 -6777 9927 8783 881 -16107 -68910 -55196 4368 27221
$$ packed form
11861e806L1162J0394k1976j336k8171l154K5831J185o109J0300Q447J0263l814
11848B7216j3896l7906j7801R047N172m107J6059p153j9398j9298m47K4084L7691
11835g37K5528K9300n887l8198Q559q100k3890j9960J885J3242K9933K9677J0640
11822E1992m745q245j9068k5941k5775J2326K4208l812q034o680o099J5667N055
11809H49L5492J2305n6260k6450j6285J2776j3775j6013J2575M8285K9298l1365
11797h568k0526M2908L1262j1739j5160j2166j4428r908k4188J942J8764j341
11785b3148j2593J6056L4447j7470j5520J4570p983L38K0250m8249m2335L874
11773g7763M3302J5824j3802K5662J6704j144p902j6988n2803J3714N9564K2853
$$ plain form
11761 27221 20600 25101 19368 8646 33724 34215 21663 39007 43119 22286 -7793 -31672 -54012
11748 -54012 -66917 -29632 6653 19484 3001 37328 37743 -9755 -45223 -39823 -36972 11253
11736 11253 20051 15946 -9457 -24038 -42731 -7701 12083 -19374 -34915 -17964 -2105 -21000
11724 -21000 -24298 -7305 994 -417 12832 9329 7552 16955 -8080 -24650 -22520 -15991 -15062 884
11710 884 31018 23231 33972 22485 47628 59245 78724 61139 20985 -22098 -52310 -40755
11698 -40755 -22463 -9615 -129 9792 5982 22667 25383 28514 13155 442 23068 35119 20293
11685 20293 9152 9497 23423 6745 7903 53155 49585 29614 -6187 -28134 -45722 -58022
11673 -58022 -38310 -34433 -37096 -6278 -4923 -7387 -21379 -1850 32727 23922 6192 -9760 -24273
$$ packed form
11761B7221o621M501n733j0722K5078M91j2552J7344M112k0833l0079k3879k2340
11748e4012j2905L7285L6285J2831j6483L4327M15m7498l5468N400K851M8225
11736A1253Q798m105k5403j4581j8693L5030J9784l1457j5541J6951J5859j8895
11724b1000l298J6993Q299j411J3249l503j777R403k5035j6570K130O529R29J5946
11710H84L0134p787J0741j1487K5143J1617J9479j7585m0154m3083l0212J1555
11698d0755J8292J2848R486R921l810J6685K716L131j5359j2713K2626J2051j4826
11685B0293j1141L45J3926j6678J158M5252l570j9971l5801k1947j7588j2300
11673e8022J9712L877k663L0818J355k464j3992J9529L4577q805j7730j5952j4513
$$ plain form
11660 -24273 7233 37747 39932 32870 25276 20850 10950 26408 37175 15971 12267 13510 1079
11647 1079 -20771 -9443 8296 882 6544 27292 31279 49011 20412 -7908 -10080 -6044 2420
11634 2420 41600 38888 17737 4870 6531 38059 45518 21547 37349 29665 14388 5679 13755
11621 13755 18618 6584 9241 6676 947 17674 -1333 -26471 -33609 -62217 -57689 -29577 -15629
11608 -15629 -12812 -25268 -57673 -50064 -45143 -14222 36531 30936 -26848 -34347 -8142 -27548 -29368
11595 -29368 9386 17877 -13554 8753 33787 38838 50039 48347 28600 7697 -13692 -15661
11583 -15661 -13266 -3347 -1073 5012 21020 16348 -10463 -48389 -31020 880 25538 41032 45981
11570 45981 34664 36326 41331 38031 20383 22209 31115 16427 1187 10265 -7422 2992 3098
$$ packed form
11660b4273L1506L0514K185p062p594m426r900J5458J0767k1204l704J243j2431
11647A079k1850J1328J7739p414N662K0748L987J7732k8599k8320k172M036Q464
11634B420L9180k712k1151j2867J661L1528P459k3971J5802p684j5277q709Q076
11621A3755M863j2034K657k565n729J6727j9007k5138p138k8608M528K8112J3948
11608a5629K817j2456l2405P609M921L0921N0753n595n7784p499K6205j9406j820
11595b9368L8754Q491l1431K2307K5034N051J1201j692j9747k0903k1389j969
11583a5661K395R919K274O085J6008m672k6811l7926J7369L1900K4658J5494M949
11570D5981j1317J662N005l300j7648J826Q906j4688j5240R078j7687J0414J06
$$ plain form
11557 3098 -11918 -14380 12291 20607 15147 52288 58900 33728 -5132 -23611 -16853 -8384 -11296
11544 -11296 -25994 -6230 -23266 -15842 -5844 -23249 -59577 -91388 -85372 -44621 -11025 -25809
11532 -25809 -34106 -23655 -12003 5285 -11382 -5045 11993 11469 -3282 3481 22923 55216 35930
11519 35930 7949 -7249 7905 18909 -31146 -29581 -2799 -2338 -2753 -19639 -4734 20808 20649
11506 20649 28095 24981 20495 12663 12448 -6160 4775 12809 -1931 -43173 -53403 -29863 -16414
11493 -16414 -20799 -18107 -36149 -17713 12926 -9911 -14540 -19899 -14095 -31012 -60317 -39948 -13737
11480 -13737 -15988 -10307 12221 -4991 -7458 -5895 38596 33391 15399 20836 9244 -731 -6909
11467 -6909 30742 62657 66832 34713 47113 62501 59800 64273 50532 16303 21304 13815 -35711
$$ packed form
11557C098j5016k462K6671Q316n460L7141O612k5172l8860j8479O758Q469k912
11544a1296j4698J9764j7036P424R998j7405l6328l1811O016M0751L3596j4784
11532b5809q297J0451J1652J7288j6667O337J7038n24j4751O763J9442L2293j9286
11519C5930k7981j5198J5154J1004n0055J565K6782M61m15j6886J4905K5542j59
11506B0649P446l114m486p832k15j8608J0935Q034j4740m1242j0230K3540J3449
11493a6414m385K692j8042J8436L0639k2837m629n359N804j6917k9305K0369K6211
11480a3737k251N681K2528j7212k467J563M4491n205j7992N437j1592r975o178
11467f909L7651L1915M175l2119J2400J5388k701M473j3741l4229N001p489m9526
$$ plain form
11454 -35711 -59530 -58865 -18909 -638 -9524 -12161 -6064 8235 -2645 6117 30358 32353 34328
11441 34328 31646 -4479 18024 33858 23325 41022 21680 -16899 -10847 9801 19084 12521
11429 12521 21101 2151 3045 -4427 -15729 -27313 -31961 -3951 -10414 -22227 -20428 -4168 26342
11416 26342 -1041 -9485 -14772 17122 59607 60379 24123 15749 11455 4721 30318 65626 90152
11403 90152 57006 21323 27742 32445 5738 -15904 -26670 -27805 -69897 -47337 -10378 11277
11391 11277 19721 4537 -12560 4466 38828 25812 31516 40899 10914 -16325 -48125 -54911
11379 -54911 -50621 6380 39519 24770 9383 -32029 -31423 -41438 -63562 -58127 -34839 -12308
11367 -12308 8543 -10357 -50535 -63102 -27976 -13147 -31298 -59384 -47385 -36384 -16979 -24546
$$ packed form
11454c5711k3819O65L9956J8271q886k637O097J4299j0880Q762K4241J995J975
11441C4328k682l6125K2503J5834j0533J7697j9342l8579O052K0648R283o563
11429A2521Q580j8950Q94p472j1302j1584m648K8010o463j1813J799J6260L0510
11416B6342k7383q444n287L1894M2485P72l6256q374m294o734K5597L5308K4526
11403I0152l3146l5683O419M703k6707k1642j0766j135m2092K2560L6959K1655
11391A1277Q444j5184j7097J7026L4362j3016N704R383k9985k7239l1800o786
11379e4911M290N7001L3139j4749j5387m1412O06j0015k2124N435K3288K2531
11367a2308K0851j8900m0178j2567L5126J4829j8151k8086J1999J1001J9405p567
$$ plain form
11355 -24546 -4970 -8701 -37430 -23246 -32189 -25016 -29114 -29893 -30300 -6228 28623 29350 20753 14231
11341 14231 5774 -1389 11930 4122 -16063 -36232 -24144 17797 22621 -4381 -15352 -11260 19669
11328 19669 12384 25783 51142 50161 50542 34463 46492 51036 52325 36022 32519 39551 37072 23610
11314 23610 22937 -2946 -28777 1001 13706 10238 -12481 -14086 121 -12333 -10241 -37093 -65062
11301 -65062 -29797 446 -5158 -9823 -35698 -30195 2867 33136 17069 -796 2533 9279 24927
11288 24927 46044 30426 36552 37758 15269 12997 21315 21909 6793 -22237 -8043 -9263 13169
11275 13169 -16357 -15751 -10310 -46122 -56287 -53066 -29062 12977 31155 28897 -7450 -21491 -46836
11262 -46836 -56442 -12221 8201 1804 -8821 -19612 -7410 -29953 -29196 -30768 -42449 -2384 12510
$$ packed form
11355b4546J9576l731k8729J4184q943P173m098p79m07K4072L4851P27q597o522
11341A4231q457p163J3319p808k0185k0169J2088M1941M824k7002j0971M092L0929
11328A9669p285J3399K5359r81L81j6079J2029M544J289j6303l503P032k479j3462
11314B3610o73k5883k5831K9778J2705l468k2719j605J4207j2454K092k6852k7969
11301f5062L5265L0243n604m665k5875N503L3062L0269j6067j7865L329O746J5648
11288B4927K1117j5618O126J206k2489k272Q318N94j5116k9030J4194j220K2432
11275A3169k9526O06N441l5812j0165L221K4004M2039J8178k258l6347j4041k5345
11262d6836r606M4221K0422o397j0625j0791J2202k2543P57j572j1681M0065J4894
$$ plain form
11249 12510 -2156 -2881 6985 37461 21387 -2165 -4648 26899 24612 4574 -46945 -51969 -54670
11236 -54670 -62179 -53590 -25428 -14661 -48691 -59050 -31932 -28625 -23440 -21941 -8243 34645 24051
11223 24051 8436 11633 -32844 -47623 -6445 22570 62348 49346 9362 -16801 -23882 -17051
11211 -17051 8763 -5325 -23566 -22655 -28736 5726 37150 50540 28136 19970 11693 -32232 -44555
11198 -44555 19697 21256 6512 6977 4134 -1265 22796 23271 10324 -11830 -52712 -46965 -43490
11185 -43490 -33169 5557 24925 46684 34059 5416 6789 -7784 1858 2439 -14322 -26581
11173 -26581 -61 5243 -1071 -2387 -13077 -11121 9974 28070 -28021 -40370 -16577 -37445
11161 -37445 -68073 -84779 -53512 -27464 -7745 -22097 -37797 -12678 -28434 -20552 -14094 -7631
$$ packed form
11249A2510j4666p25R866L0476j6074k3552k483L1547k287k0038n1519n024k701
11236e4670p509Q589K8162J0767l4030j0359K7118L307N185J499J3698M2888j0594
11223B4051j5615L197m4477j4779M1178K9015L9778j3002l9984k6163p081O831
11211a7051K5814j4088j8241R11o081L4462L1424J3390k2404q166q277m3925j2323
11198d4555O4252J559j4744M65k843n399K4061M75j2947k2154m0882N747L475
11185d3490J0321L8726J9368K1759j2625k8643J373j4573R642N81j6761j2259
11173b6581K6520N304o314j316j0690J956K1095J8096n6091j2349K3793k0868
11161c7445l0628j6706L1267K6048J9719j4352j5700K5119j5756P882O458O463
$$ plain form
11149 -7631 6566 -8828 -5273 3560 -8300 -23250 -23232 -30563 7947 11432 28164 31112 32111 21410
11135 21410 17312 7194 -1511 -3009 -13017 17013 7596 -15667 -10116 5962 -14690 -43636 -21804
11122 -21804 -2008 11188 6519 -3363 22797 41238 21149 -12798 -32280 -19337 -32120 -41836
11110 -41836 -50633 -40543 -25362 -5440 3066 -29568 -47816 -29956 -19088 -12380 -11857 8515 56989
11097 56989 51168 22467 48619 37846 29915 -6204 -8980 42822 36854 1942 -7639 -17297 11348
11084 11348 31619 26595 47609 19011 1883 -1916 24891 47533 35694 2472 -5668 -37926
11072 -37926 -51955 -34489 -47679 -29071 -16477 -5405 -5896 -5565 -3223 21277 41378 53215 42177
11059 42177 38278 59581 57786 30615 12202 16269 3762 -13973 26931 39819 31477 19942
$$ packed form
11149g631J4197j5394L555Q833j1860j4950J8p331L8510L485J6732K948R99j0701
11135B1410m098j0118q705j498j0008L0030r417k3263N551J6078k0652k8946K1832
11122b1804J9796J3196m669r882K6160J8441k0089l3947j9482J2943j2783r716
11110d1836q797J0090J5181J9922Q506l2634j8248J7860J0868O708N23K0372M8474
11097E6989n821k8701K6152j0773p931l6119k776N1802n968l4912r581r658K8645
11084A1348K0271n024K1014k8598j7128l799K6807K2642j1839l3222q140l2258
11072c7926j4029J7466j3190J8608J2594J1072m91L31K342K4500K0101J1837j1038
11059D2177l899K1303j795k7171j8413M067j2507j7735M0904J2888q342j1535
$$ plain form
11047 19942 24125 20311 38767 25140 18632 4364 35887 -443 -30287 1841 2236 -31956 -56124
11034 -56124 -66087 -59032 -52793 -65111 -46973 -31265 -60885 -63925 -29506 -21413 -36755 -28791 -7337
11021 -7337 14108 22611 10700 -28512 -62401 -37460 -4876 -36867 -68951 -45800 -37053 -54507
11009 -54507 -25282 -11971 -31432 -24103 1743 -10444 -13225 -4406 2476 -7101 7887 11105 -34802
10996 -34802 -67192 -39271 -33064 -8410 45937 68588 36588 -3028 -557 20525 31473 9765
10984 9765 -2343 487 18868 4537 9406 25315 53663 35405 -2861 -33819 -78062 -71776
10972 -71776 -23505 -20053 -7293 -239 -12721 -24958 -19552 -6454 -5586 -35357 -50907 -74408 -43748
10959 -43748 -19335 -23968 -17042 -4092 11286 8675 -1920 -11813 -31171 -36817 -9839 8503 -3452
$$ packed form
11047A9942M183l814J8456j3627o508j4268L1523l6330k9844L2128L95l4192k4168
11034e6124r963P055O239j2318J8138J5708k9620l040L4419Q093j5342P964K1454
11021g337K1445Q503j1911l9212l3889K4941L2584l1991l2084K3151Q747j7454
11009e4507K9225J3311j9461P329K5846j2187k781Q819O882r577J4988L218m5907
10996c4802l2390K7921O207K4654N4347K2651l2000l9616K471K1082J0948k1708
10984I765j2108K830J8381j4331M869J5909K8348j8258l8266l0958m4243O286
10972g1776M8271L452J2760P054j2482j2237N406J3098Q68k9771j5550k3501L0660
10959d3748K4413m633O926J2950J5378k611j0595r893j9358n646K6978J8342j1955
$$ plain form
10946 -3452 6302 12251 -490 7856 -1858 -8420 -2085 -17994 -55453 -48606 -34340 -56835 -15799
10933 -15799 -2970 -14167 -13346 -35055 -34193 -38548 -49027 -21572 -37427 -43091 -51841 -64968 -51324
10920 -51324 -33395 -32091 -23756 -38708 -47689 -41009 -49399 -23342 6674 -9496 -18455 3637 8579
10907 8579 -4459 -21968 -58513 -29758 -6205 -4714 -22098 -25900 -27078 -28963 -27441 -18822 25450
10894 25450 13047 9118 11467 -1465 -4909 18805 21332 814 19213 40469 35958 11611 -2594
10881 -2594 6410 19191 -1910 -26112 -21223 -6443 -12778 -27793 -58758 -24391 -11490 -23922
10869 -23922 -24108 -42252 -56018 -61493 -52759 -32781 -30171 -13632 -5319 -10795 -4536 10957 3365
10856 3365 -2921 24486 27999 -11538 -20325 -3569 14407 19886 36974 28189 28611 20247 8783
$$ packed form
10946c452R754N949j2741Q346r714o562O335j5909l7459O847J4266k2495M1036
10933a5799J2829j1197Q21k1709Q62m355j0479K7455j5855n664q750j3127J3644
10920e1324J7929J304Q335j4952q981O680q390K6057L0016j6170q959K2092M942
10907H579j3038j7509l6545K8755K3553J491j7384l802j178j885J522Q619M4272
10894B5450j2403l929K349j2932l444K3714K527k0518J8399K1256m511k4347j4205
10881b594R004J2781k1101k4202M889J4780o335j5015l0965L4367J2901j2432
10869b3922j86j8144j3766n475Q734J9978K610J6539Q313n476O259J5493p592
10856C365o286K7407L513l9537q787J6756J7976N479J7088q785M22q364j1464
$$ plain form
10843 8783 1829 28951 34255 39838 37262 22765 16100 -7701 -7630 -4124 -8973 4681 435 -20036
10829 -20036 -29144 -7446 -952 -16484 -47087 -63953 -31458 -27210 -22107 -24698 -32194 -17443 6343
10816 6343 -7411 -28988 -35765 -37488 -13748 29011 -3801 -21710 13679 25505 20324 -5596
10804 -5596 -30850 -10650 -20656 -13801 3006 -1564 12810 5166 -28134 -43381 -10753 -1978 18322
10791 18322 -1361 -9469 5543 7532 -5518 -21348 -38441 -43935 -43816 -35766 -33666 -25615 -848
10778 -848 15774 10256 201 5065 17413 30733 57529 47665 11505 1744 1155 -1809 -23474
10765 -23474 -33265 -30307 -35654 -20083 2816 28966 27809 -15514 -23781 -21502 -3709 -5641 -6700
10752 -6700 -21322 -16492 -14279 -22498 -34056 -41737 -41945 -25601 6906 25617 -807 -33058 -22423
$$ packed form
10843H783o954K7122N304N583k576j4497o665k3801P1L506m849J3654m246k0471
10829b0036r108K1698O494j5532l0603j6866L2495M248N103k591p496J4751K3786
10816F343j3754k1577o777j723K3740M2759l2812j7909L5389J1826n181k5920
10804e596k5254K0200j0006O855J6807m570J4374p644l3300j5247L2628Q775K0300
10791A8322j9683q108J5012J989j3050j5830j7093n494J19Q050K100Q051K4767
10778h48J6622n518j0055M864J2348J3320K6796r864l6160r761n89k964k1665
10765b3474r791K958n347J5571K2899K6150j157m3323q267K279J7793j932j059
10752f700j4622M830K213q219j1558p681k08J6344L2507J8711k6424l2251J0635
$$ plain form
10739 -22423 -38997 -51432 -45198 -30819 -46588 -28568 -17514 7191 28106 25733 23865 50970
10727 50970 67833 58985 21911 20536 33648 50558 40881 9 -35496 -10786 10779 12372
10715 12372 3416 -6284 9071 -19974 -51461 -43512 -5245 3382 -2820 -28442 -45357 -51023 -23481
10702 -23481 7131 10636 6406 23272 44616 46839 42812 31702 47130 24066 2903 -8630
10690 -8630 -19749 -15457 19965 25745 19161 12930 -2304 864 3818 15135 -955 12979 27045
10677 27045 13165 -14217 -7294 3930 2670 44761 54733 58595 45695 55301 57413 46815 51948
10664 51948 -3860 -37646 -28444 -34617 -41216 -11847 18009 20832 17986 15116 2685 -13765 -10830
10651 -10830 7095 29176 -112 -29016 -30032 -25827 -16788 3646 12820 -8216 3263 10540 -3131
$$ packed form
10739b2423j6574j2435O234J4379j5769J8020J1054K4705K0915k373j868K7105
10727E0970J6863q848l7074j375J3112J6910r677m0872l5505K4710K1565J593
10715A2372q956r700J5355k9045l1487P949L8267Q627o202k5622j6915n666K7542
10702b3481L0612L505m230J6866K1344K223m027j1110J5428k3064k1163j1533
10690h630j1119M292L5422N780o584o231j5234L168K954J1317j6090J3934J4066
10677B7045j3880k7382O923J1224j260M2091R972L862j2900R606K112j0598N133
10664E1948n5808l3786R202o173o599K9369K9856K823k846k870j2431j6450K935
10651a0830J7925K2081k9288k8904j016M205R039K0434R174k1036J1479P277j3671
$$ plain form
10638 -3131 -24612 -43478 -48413 -33241 3553 7215 -8681 -16065 -9677 -44204 -35082 -26707 -27045
10625 -27045 -947 30473 40923 16115 33301 52949 61215 74815 34660 5939 -4950 -22771
10613 -22771 -59929 -22583 -10211 -7116 21313 15688 -42234 -77411 -64876 -18386 7788 19664
10601 19664 1820 -21115 -20887 -28114 -12847 -6915 -9361 16542 -12107 -15902 8124 28200 44310
10588 44310 32873 30520 20583 -33871 -61360 -44282 -24205 10642 30548 10874 -13470 -20528
10576 -20528 -20966 -27830 -26214 -7794 8569 10390 10808 -29626 -65844 -42187 -5612 34368 44230
10563 44230 61124 38379 14354 7379 8418 3006 -4628 -31432 -13114 -7161 -29500 -39053 -32393
10550 -32393 -7756 -11387 -30188 -31010 -44369 -47048 -35318 -31240 -60767 -75570 -53156 -32207 -28982
$$ packed form
10638c131k1481j8866m935J5172L6794L662j5896p384O388l4527R122Q375l38
10625b7045K6098L1420J0450k4808J7186J9648Q266J3600m0155k8721j0889j7821
10613b2771l7158L7346J2372L095K8429n625n7922l5177J2535M6490K6174J1876
10601A9664j7844k2935K28p227J5267N932k446K5903k8649l795K4026K0076J6110
10588D4310j1437k353r937n4454k7489J7078K0077L4847J9906j9674k4344p058
10576b0528m38o864J616J8420J6363J821M18m0434l6218K3657L6575L9980R862
10563D4230J6894k2745k4025o975J039n412p634k6804J8318N953k2339r553O660
10550c2393K4637l631j8801q22j3359k679J1730M078k9527j4803K2414K0949L225
$$ plain form
10537 -28982 2985 23644 2795 14122 19522 30440 -934 9946 -10674 -36534 -26350 -31624
10525 -31624 -34713 -7618 27993 78630 81159 54152 34299 5059 -17147 -42993 -59578 -43388
10513 -43388 6464 18971 27279 -1905 -47259 -24649 -26220 -4774 10103 3474 -19176 -21472
10501 -21472 -35913 -71002 -55245 -48484 -935 27075 32225 29467 25440 38444 11284 -53528
10489 -53528 -66789 -37894 -20834 -5975 -13791 -7239 5495 -8892 -35000 -30148 -40050 -29389
10477 -29389 -34336 -44087 -15220 -16922 -27853 -10122 -1558 16307 6563 -5295 -11471 -2884 -33888
10464 -33888 -35508 -2657 35226 20562 16392 3906 -29270 -48844 -50627 -60684 -50775 -37973
10452 -37973 -32829 -17521 -10224 -11872 -4055 4963 32496 36033 18267 21870 41702 38981 13549
$$ packed form
10537b8982L1967K0659k0849J1327N400J0918l1374J0880k0620k5860J0184n274
10525c1624l089K7095L5611N0637K529k7007j9853k9240k2206k5846j6585J6190
10513d3388M9852J2507Q308k9184m5354K2610j571K1446J4877o629k2650k296
10501b1472j4441l5089J5757O761M7549K8010N150k758m027J3004k7160o4812
10489e3528j3261K8895J7060J4859p816O552J2734j4387k6108M852r902J0661
10477b9389m947r751K8867j702j0931J7731Q564J7865r744j1858o176Q587l1004
10464c3888j620L2851L7883j4664m170j2486l3176j9574j783j0057R909J2802
10452c7973N144J5308P297j648P817R018K7533L537j7766L603J9832k721k5432
$$ plain form
10439 13549 -586 -12923 8274 17341 21180 14554 -667 18356 29125 20648 -293 -21469
10427 -21469 -13321 4042 19821 37401 39281 24792 5273 -3579 5584 32952 60606 57873 49773
10414 49773 43282 35564 11436 5566 -10783 -17171 -8759 34933 61370 14866 -19878 -24296 -17940
10401 -17940 -35321 -19142 -22499 -43969 -36791 -6891 17484 -18142 -77973 -79464 -45557 -37092
10389 -37092 -26676 4297 6469 10372 47057 56143 40842 32594 14374 -3231 7856 -15840
10377 -15840 -6696 -16052 -18917 -20050 -44628 -35337 -24076 -26289 -20657 -21685 -31977 -30610 -19885
10364 -19885 1531 4000 -21730 -39234 -22489 19921 13461 -20417 -37233 -46449 -64127 -63596 -58212
10351 -58212 -39426 -18272 -21937 -5499 16853 25784 10242 -873 -10880 -38943 -33759 -24551
$$ packed form
10439A3549j4135j2337K1197R067L839o626j5221J9023J0769q477k0941k1176
10427b1469Q148J7363J5779J7580J880j4489j9519q852R163K7368K7654k733q100
10414D9773o491p718k4128n870j6349o388Q412M3692K6437m6504l4744m418O356
10401a7940j7381J6179l357k1470P178K9900K4375l5626n9831j491L3907Q465
10389c7092J0416L0973K172L903L6685R086j5301q248j8220j7605J1087k3696
10377a5840R144r356k865j133k4578R291J1261k213N632j028j0292J367J0725
10364a9885K1416K469k5730j7504J6745M2410o460l3878j6816r216j7678N31N384
10351e8212J8786K1154l665J6438K2352Q931j5542j1115j0007k8063N184R208
$$ plain form
10339 -24551 -26707 11266 61777 59726 25549 20189 20336 21251 49819 40622 32905 1204 8482 31417
10325 31417 22207 1098 -37896 -21762 -24515 -1520 13780 -257 -31350 -36100 -15943 -6781
10313 -6781 3685 -2068 24445 28519 11790 1671 1232 -2236 -32445 -54961 -69022 -65797 -33910
10300 -33910 1401 1259 -39125 -37404 -1348 -16061 -1707 -15013 -23548 -24886 -15397 -5735 -19155
10287 -19155 -34832 -36707 -32898 -9905 -1968 -17447 -26320 -17073 -24304 -31817 -17559 -26078 -50263
10274 -50263 -20587 -33268 -60791 -46322 -23116 -486 4503 -439 -7585 -6897 -28297 -52243 -40391
10261 -40391 -10387 10323 27799 30183 24200 -7967 -20953 -22360 -43217 -15189 -10950 -14314 -31529
10248 -31529 -23497 3736 36385 1596 -12986 -12884 21691 51957 31492 8138 -8948 -27693
$$ packed form
10339b4551k156L7973N0511k051l4177n360J47R15K8568r197p717l1701P278K2935
10325C1417r210k1109l8994J6134k753K2995J5300j4037l1093m750K0157R162
10313f781J0466n753K6513M074j6729j0119m39l468l0209k2516j4061L225L1887
10300c3910L5311j42m0384J721L6056j4713J4354j3306q535j338R489R662j3420
10287a9155j5677j875L809K2993P937j5479q873R247p231p513J4258q519k4185
10274e0263K9676j2681k7523J4469K3206K2630M989m942p146O88k1400k3946J1852
10261d0391L0004K0710J7476K384n983l2167j2986j407k0857K8028M239l364j7215
10248c1529Q032K7233L2649l4789j4582J02L4575L0266k0465k3354j7086j8745
$$ plain form
10236 -27693 -22927 -20185 -3740 3366 5597 4714 1983 5870 -12580 -11137 -22267 -15240 17853 37334
10222 37334 13141 24951 28782 12318 -630 26482 19853 42046 26762 -8524 -7886 29234
10210 29234 45433 45411 38563 34876 31966 33888 42406 43353 16713 -3144 -21472 -54353 -61485 -41691
10196 -41691 -33225 -34480 -14740 -15611 1407 33202 16856 -15324 -25642 -31888 -60015 -43476 -20712
10183 -20712 -17196 -34168 -32508 -47898 -28364 4306 1328 -14061 -16360 -26007 -26128 -25427 -44692
10170 -44692 -38853 -21422 -22487 -17078 -47792 -42171 -28638 -13877 6947 1071 -13941 -21606 -32232
10157 -32232 -30528 -18993 -27810 -34690 -33737 -11310 20535 29749 28495 33127 34428 27195 18508 -21040
10143 -21040 -29540 -9818 -24202 -5118 17008 35847 36651 38196 33715 34248 319 3421 -4792
$$ packed form
10236b7693M766K742J6445P106K231q83k731L887j8450J443j1130P027L3093J9481
10222C7334k4193J1810L831j6464j2948K7112o629K2193j5284l5286O38L7120
10210B9234J6199k2o848l687k910J922Q518R47k6640j9857j8328l2881p132J9794
10196d1691Q466j255J9740q71J7018L1795j6346l2180j0318o246k8127J6539K2764
10183b0712L516j6972J660j5390J9534L2670k978j5389k299r647j21P01j9265
10170d4692N839J7431j065N409l0714N621J3533J4761K0824n876j5012p665j0626
10157c2232J704J1535q817o880R53K2427L1845R214j254M632J301p233q687l9548
10143b1040q500J9722j4384J9084K2126J8839Q04J545m481N33l3929L102q213
$$ plain form
10130 -4792 -27021 -25197 -14113 -3940 20785 54398 64956 56484 33829 24091 -2804 -44763
10118 -44763 -36086 6427 12301 5551 -2625 -11311 -20073 -37812 -33732 -15160 -10939 -12373 -10813 16216
10104 16216 8334 7756 -3911 -20424 8802 -682 -27295 -49686 -36192 -31029 -24353 -3728 -2155
10091 -2155 386 -20988 -19924 2591 13202 -6673 -1835 3060 -13633 -48554 -26389 -118 8220
10078 8220 -8119 -4074 -535 -34701 -36151 -10487 5451 -15913 -47640 -7695 34720 46452
10066 46452 39794 31655 28909 15836 8589 27580 28744 26614 30427 3546 623 17064 33099
10053 33099 29576 23551 40841 24969 18123 41474 85321 73786 54983 20963 -21567 -25625
10041 -25625 -44784 -66444 -67290 -60640 -42642 -45225 -58974 -19969 9563 27855 18849 -19330 -22639
$$ packed form
10130d792k2229J824J1084J0173K4725L3613J0558q472k2655r738k6895m1959
10118d4763Q677M2513N874o750q176q686q762j7739M080J8572M221j434J560K7029
10104A6216p882n78j1667j6513K9226r484k6613k2391J3494N163O676K0625J573
10091b155K541k1374J064K2515J0611j9875M838M895j6693l4921K2165K6271Q338
10078H220j6339M045L539l4166j450K5664J5938k1364l1727L9945M2415J1732
10066D6452o658q139k746j3073p247J8991J164k130L813k6881k923J6441J6035
10053C3099l523o025J7290j5872o846K3351M3847j1535j8803l4020m2530m058
10041b5625j9159k1660q46O650J7998k583j3749L9005K9532J8292r006l8179l309
$$ plain form
10028 -22639 -33269 -34358 -13522 -4315 4709 10386 2637 -397 18102 11769 -22172 -34696 -27313
10015 -27313 -8840 22303 58955 66187 59084 76008 63437 22515 9540 10620 -7661 -12617
10003 -12617 -8492 -1223 18307 31075 28765 29381 -4051 -6190 6592 -10206 -7311 13784 24968
9990 24968 31313 12776 23606 17062 -4087 -9934 8753 49474 41241 15292 -11894 5187 895
9977 895 -8629 -19815 7948 22006 -16081 -37613 -24500 5624 16853 13136 173 -9442 8689
9964 8689 15960 29007 32801 39973 32428 39528 24838 14491 2615 -19191 -30237 -30638 -35476 -32101
9950 -32101 -904 24825 19836 7030 -16438 -52971 -62189 -50587 -38892 -50218 -34952 6171
9938 6171 20070 16866 19606 -6195 -7518 816 -772 -16692 -32524 -17665 -23888 -36232 -19206
$$ packed form
10028b2639j0630j089K0836R207R024N677p749l034J8499o333l3941j2524P383
10015b7313J8473L1143L6652P232p103J6924j2571m0922j2975J080j8281m956
10003a2617M125P269J9530J2768k310O16l3432k139J2782j6798K895K1095J1184
9990B4968O345j8537J0830o544k1149n847J8687M0721q233k5949k7186J7081m292
9977H95r524j1186K7763J4058l8087k1532J3113L0124J1229l717j2963r615J8131
9964H689P271J3047L794P172p545P100j4690j0347j1876k1806j1046m01m838L375
9950c2101L1197K5729m989j2806k3468l6533r218J1602J1695j1326J5266M1123
9938F171J3899l204K740k5801j323Q334j588j5920j5832J4859o223j2344J7026
$$ plain form
9925 -19206 25729 16970 5194 -16366 -45872 -26487 -8739 14508 -10613 -22116 9071 42549
9913 42549 43188 10696 -16589 -9864 -19524 17381 61542 48215 34157 34261 3215 10906 19663
9900 19663 64261 96692 102105 92063 53011 35666 53780 24963 -27447 -52178 -39718 -31066
9888 -31066 -11593 -6618 -45920 -64135 -67867 -23507 1475 4730 5220 -19907 -27961 -41107 -66098
9875 -66098 -54015 -4366 8377 5192 39275 62606 33332 18885 28640 15324 4477 -16132
9863 -16132 2080 629 -798 -2255 15938 14781 4135 22488 27794 19748 -12611 -20652 -32136
9850 -32136 -35760 -42806 -20819 -9287 -16966 -22339 -18151 -2317 -2687 28101 25671 26824 41333 34274
9836 34274 21945 41837 58621 87194 79344 77084 65002 47520 54181 53411 72163 41477 41229
$$ packed form
9925a9206M4935q759j1776k1560k9506J9385J7748K3247k5121j1503L1187L3478
9913D2549O39l2492k7285O725r660L6905M4161j3327j4058J04l1046P691Q757
9900A9663M4598L2431N413j0042l9052j7345J8114k8817n2410k4731J2460Q652
9888c1066J9473M975l9302j8215l732M4360K4982L255M90k5127q054j3146k4991
9875f6098J2083M9649J2743l185L4083K3331k9274j4447R755j3316j0847k0609
9863a6132J8212j451j427j457J8193j157j0646J8353N306q046l2359q041j1484
9850c2136l624p046K1987J1532p679n373M188J5834l70L0788k430J153J4509p059
9836C4274j2329J9892J6784K8573p850k260j2082j7482O661p70J8752l0686k48
$$ plain form
9823 41229 54278 77413 51289 12650 -4259 -9439 -6894 19040 9647 -23825 -50373 -50990 -35780
9810 -35780 -21750 -37210 -45983 -60110 -29401 -2261 36762 51323 43968 49678 11933 -11537
9798 -11537 -19702 -20627 8997 19381 45601 53625 11831 -16796 1594 -5751 -19841 10299 7490
9785 7490 -15127 -5265 -6620 -21046 -44243 -69917 -75929 -24840 8680 5132 -2875 -3807 -5184 -14663
9771 -14663 -29023 -27624 -15670 -8684 -5009 7458 5467 -16124 -24494 -33157 -43571 -46087 -12345
9758 -12345 -14046 -3722 2372 23693 25450 25653 47149 56006 30216 6714 18547 31514 5376
9745 5376 6630 54244 70499 59877 26202 10998 35131 41164 13943 27001 54647 41303
9733 41303 23165 8863 -20530 -23287 -22318 1892 12846 1524 -14299 6553 2859 21991 2831
$$ packed form
9823D1229J3049K3135k6124l8639j6909n180K545K5934r393l3472k6548o17J5210
9810c5780J4030j5460q773j4127L0709K7140L9023J4561p355N710l7745k3470
9798a1537q165r25K9624J0384K6220Q024m1794k8627J8390p345j4090L0140k809
9785G490k2617R862j355j4426k3197k5674o012N1089L3520l548q007r32j377r479
9771a4663j4360J399J1954O986L675J2467j991k1591q370q663j0414k516L3742
9758a2345j701J0324O094K1321J757K03K1496Q857k5790k3502J1833J2967k6138
9745E376J254M7614J6255j0622l3675j5204K4133O033k7221J3058K7646j3344
9733D1303j8138j4302k9393k757R69K4210J0954j1322j5823K0852l694J9132j9160
$$ plain form
9720 2831 -10979 -14658 9325 19824 13857 7146 -13141 -7639 -10727 -35374 -2695 22190 40913
9707 40913 27937 -628 -5734 4764 24416 32682 51679 40062 14387 4714 -8074 -13451 9098
9694 9098 -815 1699 -8842 -17314 -17548 -9408 8611 20002 18671 33624 29709 40741 41047 34560
9680 34560 23391 46133 47635 42595 14441 9572 22094 8467 -4000 -10373 -14548 -3190 32942
9667 32942 51612 49850 36592 52050 69579 55173 36096 58746 76128 63539 12327 -20147
9655 -20147 11096 -4141 -3746 36670 38594 18926 15980 22715 -3616 -91 14578 18121 24215
9642 24215 1005 -11247 -15597 -6151 -2356 -4645 -1248 8912 44388 43965 51276 40448 53309
9629 53309 56097 52074 53006 50368 54638 35656 37561 21507 26080 53520 60266 47175 10145 16656
$$ packed form
9720B831j3810l679K3983J0499n967o711k0287N502l088k4647L2679K4885J8723
9707D0913j2976k8565n106J0498J9652Q266J8997j1617k5675r673j2788n377K2549
9694I098r913K514j0541q472k34Q140J8019J1391j331J4953l915J1032L06o487
9680C4560j1169K2742J502n040k8154m869J2522j3627j2467o373m175J1358L6132
9667C2942J8670j762j3258J5458J7529j4406j9077K2650J7382j2589n1212l2474
9655b0147L1243j5237L95M0416J924j9668k946O735k6331L525J4669L543O094
9642B4215k3210j2252m350R446L795k289L397J0160L5476m23P311j0828J2861
9629E3309K788m023R32k638M270j8982J905j6054M573K7440O746j3091l7030O511
$$ plain form
9615 16656 71802 54093 76029 83959 76805 56291 45083 86437 87234 56255 40604 76443 108570
9602 108570 148292 159504 123894 94264 81214 69426 61398 80664 111847 143788 166402 197834
9590 197834 172292 165047 129807 111351 157619 195579 202829 193224 179301 214640 272236 283873
9578 283873 294505 307392 317489 359407 421627 449658 460278 485487 539326 582633 636973 700974
9566 700974 843230 1002194 1146469 1282842 1468866 1727520 2024325 2407832 2893926 3488100
9556 3488100 4207435 5018020 5899692 6721363 7354683 7673948 7655962 7273286 6631558 5816703
9546 5816703 4977020 4226513 3562343 3007260 2579261 2208970 1875823 1601934 1419198 1284049
9536 1284049 1141942 1007063 919121 839213 770686 696466 623410 569093 529069 479974 435637
$$ packed form
9615A6656N5146j7709K1936P930p154k0514j1208M1354P97l0979j5651L5839L2127
9602A08570L9722J1212l5610k9630j3050j1788q028J9266L1183L1941K2614L1432
9590A97834k5542p245l5240j8456M6268L7960P250r605j3923L5339N7596J1637
9578B83873J0632J2887J0097M1918O2220K8031J0620K5209N3839M3307N4340O4001
9566G00974J42256J58964J44275J36373J86024K58654K96805L83507M86094N94174
9556C488100P19335Q10585Q81672Q21671O33320L19265j7986l82676o41728q14855
9546E816703q39683p50507o64170n55083m27999l70291l33147k73889j82736j35149
9536A284049j42107j34879q7942p9908o8527p4220p3056n4317m0024m9095m4337
$$ plain form
9525 435637 438102 423089 381852 346608 362084 358985 318220 289784 265554 235300 224885 232818
9513 232818 204007 206616 215100 198908 170870 164144 159266 148308 140084 127682 133985 148420 152525
9500 152525 113338 67351 71722 93353 97574 85954 66634 95282 126003 134645 133480 115552
9488 115552 77655 61521 33860 42458 44618 57373 26102 3241 2108 -2468 22140 24306 6051
9475 6051 15923 37913 45809 24939 9533 5256 -4885 -43169 -46856 -24162 1790 -4646 -29652
9462 -29652 -54711 -36863 13470 33808 -1981 12298 14508 38186 57785 42664 60577 68730
9450 68730 52977 50656 25036 46135 24343 -10015 -24621 -22653 31671 78956 110683 129124
9438 129124 134574 63465 38260 48665 48589 36232 85793 80528 49681 72412 83985 67879 14946
$$ packed form
9525D35637K465j5013m1237l5244J5476l099m0765k8436k4230l0254j0415P933
9513B32818k8811K609Q484j6192k8038o726m878j0958q224j2402O303J4435M105
9500A52525l9187m5987M371K1631M221j1620j9320K8648L0721Q642j165j7928
9488A15552l7897j6134k7661Q598K160J2755l1271k2861j133m576K4608K166j8255
9475F051R872K1990P896k0870j5406m277j0141l8284l687K2694K5952o436k5006
9462b9652k5059J7848N0333K0338l5789J4279K210K3678J9599j5121J7913Q153
9450F8730j5753k321k5620K1099k1792l4358j4606J968N4324M7285L1727J8441
9438A29124N450p1109k5205J0405p6j2357M9561n265l0847K2731J1573j6106n2933
$$ plain form
9425 14946 6799 29020 51921 35854 4840 -17198 -32030 -58351 -55085 -66824 -28468 4376
9413 4376 13253 -3375 -30841 -25046 20882 27730 19265 29526 52546 34066 6648 -16057 8269
9400 8269 -9176 -31367 -68759 -66975 -14552 7865 55772 42839 25780 12547 6110 -6384
9388 -6384 27239 32743 34141 -22165 -19684 4468 12958 32626 29431 59124 67905 38653 -482
9375 -482 7621 11974 19835 31676 30976 32338 22703 2351 -8205 -22744 128 -8538 18498 19040
9361 19040 3381 -5626 -34345 -36627 -43699 -18309 -867 2797 10508 26038 65919 60475 7455
9348 7455 -6851 10379 36043 31744 24752 16379 12336 5395 -1629 8779 9298 7331 28540 49066
9334 49066 71859 43315 29980 6359 -8459 -2944 27668 38058 39944 43748 42916 33191 11113
$$ packed form
9425A4946q147K2221K2901j6067l1014k2038j4832k6321L266j1739L8356L2844
9413D376Q877j6628k7466N795M5928O848q465J0261K3020j8480k7418k2705K4326
9400H269j7445k2191l7392J784N2423K2417M7907j2933j7059j3233o437j2494
9388f384L3623N504J398n6306K481K4152Q490J9668l195K9693Q781k9252l9135
9375d82Q103M353P861J1841p00J362r635k0352j0556j4539K2872q666K7036N42
9361A9040j5659r007k8719k282p072K5390J7442L664P711J5530L9881n444n3020
9348G455j4306J7230K5664m299o992q373m043o941p024J0408N19j967K1209K0526
9334D9066K2793k8544j3335k3621j4818N515L0612J0390J886L804q32r725k2078
$$ plain form
9321 11113 28051 43826 33232 35154 15157 13839 37119 43104 31138 8298 -9539 -5517 -12379
9308 -12379 10574 11418 -6140 -6828 3256 10851 -8977 -23335 -41536 -44438 -47562 -41669 -12833
9295 -12833 -11949 -16188 -14299 -12875 -51340 -46475 -23484 -11457 -25142 -13517 12059 26134 51310
9282 51310 56893 26523 21651 31272 26724 32890 43876 21823 1881 -1603 565 19486 16145
9269 16145 42368 48233 39544 15737 -467 -7776 -11364 7202 21978 6057 31479 53770 19584
9256 19584 -1157 10584 32858 20075 18716 29650 54195 74235 54794 26641 -13752 -15318
9244 -15318 3111 -17576 11359 23995 22898 12835 -4784 10827 4537 7292 -8554 -31321
9232 -31321 -32493 -38711 -33854 -23154 1985 8704 -9557 -19052 -16508 -12605 12485 9637 7522 2
$$ packed form
9321A1113J6938J5775j0594J922j9997j318K3280N985j1966k2840j7837M022o862
9308a2379K2953Q44j7558o88J0084P595j9828j4358j8201k902l124N893K8836
9295a2833Q84m239J889J424l8465M865K2991J2027j3685J1625K5576J4075K5176
9282E1310N583l0370m872R621m548O166J0986k2053j9942l484K168J8921l341
9269A6145K6223N865q689k3807j6204p309l588J8566J4776j5921K5422K2291l4186
9256A9584k0741J1741K2274j2783j359J0934K4545K0040j9441k8153m0393j566
9244a5318J8429k0687K8935J2636j097j0063j7619J5611o290K755j5846k2767
9232c1321j172o218M857J0700K5139O719j8261r495K544L903K5090k848k115p520
$$ plain form
9218 2 -27804 -11596 27701 39662 4917 5355 15070 26069 14970 19075 -11620 -12986 -31204 -33177
9204 -33177 -24264 -12546 823 1750 1181 -17677 -28820 -8960 2792 15011 10920 -6809 10590
9191 10590 25907 67 -25027 23157 29389 -5666 -37100 -45532 -50035 -51352 -45288 -57411 -31818
9178 -31818 -24383 -23595 -9614 -4268 -28167 -9850 40019 57210 69427 63708 50323 18464 9350
9165 9350 255 -17069 -19483 -7551 -11911 -13376 178 6534 16709 4554 5833 36723 37856
9152 37856 18507 27108 3678 -7310 20775 39983 50894 47827 38565 25134 30163 36493 6723
9139 6723 -25196 -2093 29845 33552 14598 9939 31600 7865 -1902 -1319 12308 27967 34595
9126 34595 23578 7511 -27046 -47420 -52387 -56811 -49256 -51605 -34479 -26232 -51672 -33231 3840
$$ packed form
9218Bk7806J6208L9297J1961l4745M38R715J0999j1099M105l0695j366j8218j973
9204c3177Q913J1718J3369R27n69j8858j1143J9860J1752J2219m091j7729J7399
9191A0590J5317k5840k5094M8184O232l5055l1434q432m503j317O064j2123K5593
9178c1818P435P88J3981N346k3899J8317M9869J7191J2217n719j3385l1859r114
9165I350r095j7324k414J1932m360j465J3554O356J0175j2155J279L0890J133
9152C7856j9349Q601k3430j0988K8085J9208J0911l067r262j3431N029O330k9770
9139F723l1919K3103L1938L707j8954m659K1661k3735r767N83J3627J5659O628
9126C4595j1017j6067l4557k0374m967m424P555k349J7126Q247k5440J8441L7071
$$ plain form
9113 3840 15491 -43559 -60362 -24756 4919 3143 -21717 -38822 -31563 -18055 -25150 -29513 -38181
9100 -38181 -32155 -23861 -17536 12498 30287 29918 21693 -5163 -20945 -29652 -10404 -13946 -64828
9087 -64828 -92409 -87771 -68245 -30305 -37266 -52802 -28144 -17586 -19166 5054 18656 29107
9075 29107 17702 4971 13624 32640 33240 34548 30237 -7658 -46172 -49783 -41181 -48087 -30404
9062 -30404 -23361 -21728 -36422 -36929 -62545 -39873 -17577 -30542 -34093 -35639 -22253 2469 21323
9049 21323 10428 -13999 -19373 -21592 -16921 -14361 -3984 -6482 -9476 -29671 -22852 -8172 38589
9036 38589 34797 11528 -798 -23478 -16196 7525 -10348 37545 47060 -735 8095 8452 4513
9023 4513 2381 15555 -11932 -12371 4119 15564 18423 29377 63123 96059 96095 37180 20146
$$ packed form
9113C840J1651n9050j6803L5606K9675j776k4860j7105P259J3508p095m363q668
9100c8181O026Q294O325L0034J7789l69q225k6856j5782q707J9248l542n0882
9087f4828k7581M638J9526L7940o961j5536K4658J0558j580K4220J3602J0451
9075B9107j1405j2731Q653J9016O00J308m311l7895l8514l611Q602o906J7683
9062c0404P043J633j4694n07k5616K2672K2296j2965l551j546J3386K4722J8854
9049B1323j0895k4427n374k219M671K560J0377k498k994k0195O819J4680M6761
9036C8589l792k3269j2326k2680P282K3721j7873M7893R515m7795Q830L57l939
9023D513k132J3174k7487m39J6490J1445K859J0954L3746L2936L6n8915j7034
$$ plain form
9010 20146 141 16337 8352 4976 19786 8783 1602 7846 17634 10000 29458 23425 525
8997 525 8337 -4984 24407 43175 56071 46043 61256 49834 59315 49541 35133 28175 24427
8984 24427 18780 21990 36487 53689 60042 32785 -8852 -27455 -48765 -55575 -35771 -3138 13473
8971 13473 6389 40982 78721 31465 4603 -13758 -37454 -34337 -24066 -23592 -16807 -7792 -4300
8958 -4300 -25991 -7784 11284 29035 26034 13869 -3876 -5008 19095 25722 6719 24828 17668
8945 17668 93 3701 -9351 -2224 5665 -3419 11518 36301 33166 23810 47847 64546 73790
8932 73790 72258 55821 49594 54680 58099 42341 59713 66203 61989 51905 49730 23528 34747
8919 34747 65302 70000 42333 42584 42000 45293 60723 53129 48374 65325 47625 40833 61314 82167
$$ packed form
9010B0146k0005J6196p985l376J4810j1003p181O244R788p634J9458o033k2900
8997E25P812j3321K9391J8768J2896j0028J5213j1422R481r774j4408o958l748
8984B4427n647L210J4497J7202O353k7257m1637j8603k1310o810J9804L2633J6611
8971A3473p084L4593L7739m7256k6862j8361k3696L117J0271M74O785R015L492
8958d300k1691J8207J9068J7751l001j2165j7745j132K4103O627j9003J8109p160
8945A7668j7575L608j3052P127P889r084J4937K4783l135r356K4037J6699R244
8932G3790j532j6437o227N086L419j5758J7372O490m214j0084k175k6202J1219
8919C4747L0555M698k7667K51n84L293J5430p594m755J6951j7700o792K0481K0853
$$ plain form
8905 82167 99494 105875 105423 95219 85495 95545 145560 148740 132899 163148 165580 174437 183416
8892 183416 232497 276126 288474 287455 321148 350586 381895 423308 497360 549265 630719 746381
8880 746381 863147 946138 1066301 1234366 1437043 1674905 1966728 2409246 3035084 3865453
8870 3865453 5028008 6776341 9479914 13530198 18644878 22884618 24050702 22047491
8862 22047491 18076139 13654207 10081200 7573422 5853792 4673798 3823009 3183120
8854 3183120 2693412 2355409 2057938 1845403 1658017 1498012 1355888 1212374 1111578 1024721
8844 1024721 951675 854723 807325 766323 707108 607274 551345 525209 519096 498959 454898 400743
8832 400743 343261 341493 312637 286188 285172 260827 257366 254717 258380 256789 220147 215683 189444
$$ packed form
8905H2167J7327O381m52j0204r724J0050N0015L180j5841L0249K432Q857Q979
8892A83416M9081M3629J2348j019L3693K9438L1309M1413P4052N1905Q1454J15662
8880G46381J16766Q2991J20163J68065K02677K37862K91823M42518O25838Q30369
8870C865453J162555J748333K703573M050284N114680M239740J166084k003211
8862B2047491l971352m421932l573007k507778j719630j179994q50789o39889
8854C183120m89708l38003k97471k12535j87386j60005j42124j43514j00796q6857
8844A024721p3046r6952m7398m1002n9215r9834n5929k6136o113k0137m4061n4155
8832D00743n7482j768k8856k6449j016k4345l461k649L663j591l6642m464k6239
$$ plain form
8819 189444 196462 210096 197373 160980 155284 155227 139842 130589 101159 87760 89990 97553 73429
8806 73429 43061 46140 47905 76648 70184 64588 35112 27257 34541 45770 34655 51371 47523
8793 47523 48733 63670 90166 77718 57026 63959 50404 54024 71984 87501 76217 65225
8781 65225 50848 95380 104188 78590 69276 69476 71991 49495 26896 32092 63136 90079 43357
8768 43357 35884 42838 23296 -11250 1401 27336 55489 44487 16967 25051 53591 38115
8756 38115 19603 13784 29470 59539 32576 43290 46129 22546 -2980 -12885 -9519 13217 27347
8743 27347 24372 47472 43998 59387 78042 76674 67437 58768 53074 29235 24122 10086 28033
8730 28033 -1057 -22338 -49924 -36289 -6646 -27503 -18130 6733 7091 4802 29528 51503 31912
$$ packed form
8819A89444P018J3634j2723l6393n696n7j5385r253k9430j3399K230P563k4124
8806G3429l0368L079J765K8743o464n596k9476p855P284J1229j1115J6716l848
8793D7523J210J4937K6496j2448k0692O933j3555L620J7960J5517j1284j0992
8781F5225j4377M4532Q808k5598r314K00K515k2496k2599N196L1044K6943m6722
8768D3357p473O954j9542l4546J2651K5935K8153j1002k7520Q084K8540j5476
8756C8115j8512n819J5686L0069k6963J0714K839k3583k5526r905L366K2736J4130
8743B7347k975K3100l474J5389J8655j368r237q669n694k3839n113j4036J7947
8730B8033k9090k1281k7586J3635K9643k0857R373K4863L58k289K4726K1975j9591
$$ plain form
8717 31912 -11204 -17332 -15079 -4357 3714 21869 35621 4494 -12191 -11246 -22973 -38193 -34023
8704 -34023 6460 20280 27896 42999 46155 9392 2954 16660 6886 -11914 -4078 21478 18633
8691 18633 23326 346 -12151 -2047 11149 5322 -18889 -17597 -22478 -36856 -21941 -8798 7561
8678 7561 14779 17461 10022 20633 17707 13594 -38656 -33682 -8316 25763 44177 51847 46258 54291
8664 54291 68672 66835 49072 56322 76176 62856 42026 24037 35148 40423 -10099 -17421 -17663
8651 -17663 -2755 -4672 -17041 -14271 -28672 -11889 18732 22918 25258 45418 43694 14084 5435
8638 5435 -12069 1492 23763 29583 14067 20157 19023 -8026 16107 20366 16542 12647 -19491
8625 -19491 -32429 -31691 -27384 -33575 -33057 -17149 -4048 -30882 -46156 -19484 -26117 -2854 9231
$$ packed form
8717C1912m3116o128K253J0722Q071J8155J3752l1127j6685R45j1727j5220M170
8704c4023M0483J3820P616J5103L156l6763o438J3706r774j8800P836K5556k845
8691A8633M693k2980j2497J0104J3196n827k4211J292m881j4378J4915J3143J6359
8678G561P218K682p439J0611k926m113n2250M974K5366L4079J8414P670n589Q033
8664E4291J4381j837j7763P250J9854j3320k0830j7989J1111N275n0522p322k42
8651a7663J4908j917j2369K770j4401J6783L0621M186K340K0160j724k9610q649
8638E435j7504J3561K2271N820j5516O090j134k7049K4133M259l824l895l2138
8625a9491j2938P38M307o191N18J5908J3101k6834j5274K6672o633K3263J2085
$$ plain form
8612 9231 -595 3873 27212 38180 16243 27805 45668 48656 25666 39648 39072 21250 24742
8599 24742 -1527 -7372 23526 34390 26759 61742 59745 61153 70727 50071 19172 9154 27811
8586 27811 31375 15157 14039 19292 13435 745 5547 29064 25762 707 3908 -4350 905 18796
8572 18796 50711 47082 55428 48011 37916 26582 40297 50496 33798 3036 1789 15171 -9139
8559 -9139 -13874 -20393 -26267 -6398 9195 23308 5028 -15206 -35097 -44911 -43422 -5465 72
8546 72 -6919 -1305 30964 26116 18322 24967 14216 14444 36554 57899 54186 56103 36111 36743 54786
8531 54786 35155 47482 46038 17456 29156 25496 7888 -9184 -7068 -1866 -23180 -5443 20615
8518 20615 -2751 -8906 -5852 -18736 -5455 21850 56154 9772 -23311 -35989 -32657 -305
$$ packed form
8612I231r826M468K3339J0968k1937J1562J7863K988k2990J3982n76j7822L492
8599B4742k6269n845L0898J0864p631L4983j997J408R574k0656l0899j0018J8657
8586B7811L564j6218j118N253n857j2690M802K3517l302k5055L201q258N255J7891
8572A8796L1915l629Q346p417j0095j1334J3715J0199j6698l0762j247J3382k4310
8559i139m735o519n874J9869J5593J4113j8280k0234j9891r814J489L7957N537
8546G2o991N614L2269m848p794O645j0751K28K2110K1345l713J917j9992O32J8043
8531E4786j9631J2327j444k8582J1700l660j7608j7072K116N202k1314J7737K6058
8518B0615k3366o155L054j2884J3281K7305L4304m6382l3083j2678L332L2352
$$ plain form
8506 -305 18167 39768 35946 36842 22655 31858 12082 11089 22247 15846 17543 -23681 -40275 -34656
8492 -34656 -36365 -14291 -933 -709 -39267 -17047 2879 9139 20742 14321 18381 -4324 4148
8479 4148 23115 22439 31474 29643 11279 4891 9162 22194 35913 25972 -14179 20599 50948
8466 50948 57937 25220 40346 52085 51616 30688 26819 38302 14756 -2916 -8957 94 12022
8453 12022 4295 25993 62274 36964 4643 24620 30315 29186 34780 12520 13906 17727 24772
8440 24772 26272 44285 64991 55480 11121 -10367 -6240 6683 42313 66692 10454 -2415
8428 -2415 -514 -29952 -40430 -2737 307 -28114 -28348 -27523 -54519 -27616 6367 33300 42597
8415 42597 13798 -15065 -47686 -54155 -68604 -71596 -62596 -54099 -14510 -3412 5784 -3994 -28163
$$ packed form
8506c05J8472K1601l822Q96j4187R203j9776r93J1158o401J697m1224j6594N619
8492c4656j709K2074J3358K24l8558K2220J9926O260J1603o421M060k2705Q472
8479D148J8967o76R035j831j8364o388M271J3032J3719r941m0151L4778L0349
8466E0948O989l2717J5126J1739m69k0928l869J1483k3546j7672o041R051J1928
8453A2022p727K1698L6281k5310l2321J9977N695j129N594k2260J386L821P045
8440B4772J500J8013K0706r511m4359k1488M127J2923L5630K4379n6238j2869
8428b415J901k9438j0478L7693L044k8421k34Q25k6996K6903L3983K6933R297
8415D2597k8799k8863l2621o469j4449k992R000Q497L9589J1098R196r778k4169
$$ plain form
8402 -28163 -19193 945 18639 7495 -22996 -1391 -822 10025 14622 8791 2172 31207 25684
8389 25684 10946 9569 14927 48641 20994 -16759 -1723 -2359 -8340 13790 26074 35544 4154
8376 4154 -16349 -33040 -44908 -15580 -8195 3352 35159 21596 8465 10902 29888 2128
8364 2128 6076 -15097 -38545 -44921 -71336 -55918 -39997 -31069 -19758 -14014 -22741 -25600 -30143
8351 -30143 7717 12253 25828 53461 54096 38950 35959 28815 -3025 -8176 12210 -6231 -27444
8338 -27444 -22602 -1258 18867 27076 28231 11113 -1226 11474 18054 16216 33920 64217 42579
8325 42579 4103 -19020 -15273 -11487 -1920 4613 10350 -22049 -36911 -31022 -45274 -35173 12372
8312 12372 35617 8108 -2918 -9627 -30818 -33475 -29377 -13200 -6766 -45251 -83406 -90030 -62921
$$ packed form
8402b8163Q970K0138J7694j1144l0491K1605N69J0847M597n831o619K9035n523
8389B5684j4738j377N358L3714k7647l7753J5036o36n981K2130J2284R470l1390
8376D154k0503j6691j1868K9328P385J1547L1807j3563j3131K437J8986k7760
8364B128L948k1173k3448o376k6415J5418J5921Q928J1311N744q727k859m543
8351c0143L7860M536J3575K7633O35j5146k991p144l1840n151K0386j8441k1213
8338b7444M842K1344K0125Q209J155j7118j2339J2700O580j838J7704L0297k1638
8325D2579l8476k3123L747L786R567O533N737l2399j4862N889j4252J0101M7545
8312A2372K3245k7509j1026o709k1191k657M098J6177O434l8485l8155o624K7109
$$ plain form
8299 -62921 -24495 -8454 2344 -32803 -52222 -44439 -26017 -16637 -6961 5167 18647 30615
8287 30615 43560 58244 52220 66279 34130 -3321 21874 34949 47335 29020 32950 50376
8275 50376 21480 10845 -6927 -20807 -5780 -17512 -29236 -24156 -30239 -6207 6264 32048
8263 32048 19341 -18278 -17922 -4438 -4437 3148 1428 -6627 12285 230 -12657 -6692 -6913 3349
8249 3349 22382 39232 44369 28232 36371 49390 4944 -23301 -10151 2043 37706 46080 8668
8236 8668 2616 -20 20506 14721 15685 -1254 -13698 623 8269 935 -12784 -25273 -9790
8223 -9790 1041 4102 -1594 -35205 33484 58243 27521 29585 68454 75777 60287 18190 -8702
$$ packed form
8299f2921L8426J6041J0798l5147j9419P783J8422R380R676J2128J3480J1968
8287C0615J2945J4684o024J4059l2149l7451K5195J3075J2386j8315L930J7426
8275E0376k8896j0635j7772j3880J5027j1732j1724N080o083K4032J2471K5784
8263C2048j2707l7619L56J3484JP585j720q055J8912j2055j2887N965k21J0262
8249C349J9033J6850N137j6137Q139J3019m4446k8245J3150J2194L5663Q374l7412
8236H668o052k636K0526n785R64j6939j2444J4321P646p334j3719j2489J5483
8223i790J0831L061n696l3611O8689K4759l0722K064L8869P323j5490m2097k6892
$$ [...]
##END NTUPLES=NMR SPECTRUM
##END=
