##TITLE=Analysis number 319526
Compound Code mo 07869
Book Reference 489/22
Project Code adrs
Chemist Name alim
##JCAMPDX= 6.0         $$ Bruker NMR JCAMP-DX V2.0
##DATA TYPE= NMR SPECTRUM
##DATA CLASS= NTUPLES
##ORIGIN= Bruker BioSpin GmbH
##OWNER= nmr
$$ XWIN-NMR		Version 3.5
$$ Thu May 18 08:32:17 2006 GMT Daylight Time (UT+1h)  MAYBRIDGE\nmr@NMR_250MHZ
##.OBSERVE FREQUENCY= 250.131544655141
##.OBSERVE NUCLEUS= ^1H
##.ACQUISITION MODE= SIMULTANEOUS (DQD)
##.ACQUISITION SCHEME= undefined
##.AVERAGES= 16
##.DIGITISER RES= 18
##SPECTROMETER/DATA SYSTEM= dpx250
##.PULSE SEQUENCE= zg30
##.SOLVENT NAME= CDCl3
##.SHIFT REFERENCE= (INTERNAL, CDCl3, 0, 16.522)
##AUDIT TRAIL= $$ (NUMBER, WHEN, WHO, WHERE, WHAT)
$$ ##TITLE= Audit trail, XWIN-NMR		Version 3.5
$$ ##JCAMPDX= 5.01
$$ ##ORIGIN= Bruker BioSpin GmbH
$$ ##OWNER= nmr
$$ C:\u/data/dgb/nmr/ADRS/4680/pdata/1/auditp.txt
$$ ##AUDIT TRAIL=  $$ (NUMBER, WHEN, WHO, WHERE, WHAT)
(   1,<2006-05-18 08:31:55.50 +100>,<MAYBRIDGE\nmr>,<NMR_250MHZ>,
      <created by zg, POWCHK disabled, PULCHK disabled
       configuration hash MD5:
       84 BC 41 DB A1 6E 1D 46 DA 25 12 A5 C1 ED C5 3A
       data hash MD5: 64K
       BF 79 00 6A 97 13 ED 1F A4 A5 31 7F 15 AD 79 4E>)
(   2,<2006-05-18 08:32:08.16 +100>,<MAYBRIDGE\nmr>,<NMR_250MHZ>,
      <Start of raw data processing
       ef LB = 0.3 FT_mod = 6 PKNL = 1 SI = 32K 
       data hash MD5: 32K
       63 55 EB C9 93 8F 81 86 BD 53 CC E2 D0 21 8E 10>)
(   3,<2006-05-18 08:32:09.86 +100>,<MAYBRIDGE\nmr>,<NMR_250MHZ>,
      <apk 
       data hash MD5: 32K
       2B 95 18 31 1B E2 75 02 3E 67 3C FA F8 5A 0C 2B>)
(   4,<2006-05-18 08:32:10.59 +100>,<MAYBRIDGE\nmr>,<NMR_250MHZ>,
      <abs ABSG = 5 
       data hash MD5: 32K
       F5 BA 75 CE A4 32 06 23 0B 7E B4 59 4F 49 CB A2>)
$$ ##END=
$$ 
$$ hash MD5
$$ 18 C5 B9 AD 8E B9 86 DA F5 84 5B 09 4A 72 FF 8B
##$RELAX= 
##$RELAX= 
##$RELAX= 
##$RELAX= 
##$RELAX= 
##$RELAX= 
##$RELAX= 
$$ Bruker specific parameters
$$ --------------------------
##$DU= <C:\u>
##$EXPNO= 4680
##$NAME= <ADRS>
##$PROCNO= 1
##$TYPE= <nmr>
##$USER= <dgb>
##$AMP= (0..31)
100 100 100 100 100 100 100 100 100 100 100 100 100 100 100 100 100 100 
100 100 100 100 100 100 100 100 100 100 100 100 100 100 
##$AQSEQ= 0
##$AQ_mod= 3
##$AUNM= <au_zg>
##$AUTOPOS= <2 >
##$BF1= 250.13
##$BF2= 250.13
##$BF3= 250.13
##$BF4= 250.13
##$BF5= 500.13
##$BF6= 500.13
##$BF7= 500.13
##$BF8= 500.13
##$BYTORDA= 1
##$CFDGTYP= 0
##$CFRGTYP= 5
##$CHEMSTR= <none>
##$CNST= (0..31)
1 1 145 1 1 1 1 1 1 1 1 1 1 1 1 1 1 1 1 1 1 1 1 1 1 1 1 1 1 1 1 1 
##$CPDPRG= <>
##$CPDPRG1= <>
##$CPDPRG2= <>
##$CPDPRG3= <>
##$CPDPRG4= <mlev>
##$CPDPRG5= <mlev>
##$CPDPRG6= <mlev>
##$CPDPRG7= <mlev>
##$CPDPRG8= <mlev>
##$CPDPRGB= <>
##$CPDPRGT= <>
##$D= (0..31)
0 1 0 0 0 0 0 0 0 0.06 0 0 0 0 0 0 0.0002 0 0 0 0 0 0 0 0 0 0 0 0 0 0 
0 
##$DATE= 1147937514
##$DBL= (0..7)
120 120 120 120 120 120 120 120 
##$DBP= (0..7)
150 150 150 150 150 150 150 150 
##$DBP07= 0
##$DBPNAM0= <>
##$DBPNAM1= <>
$$ [...]
##$SUBNAM7= <"">
##$SUBNAM8= <"">
##$SUBNAM9= <"">
##$SW= 20.6930455092707
##$SWIBOX= (0..15)
0 0 3 0 0 0 0 0 0 0 0 0 0 0 0 0 
##$SW_h= 5175.983436853
##$TD= 65536
##$TD0= 1
##$TE= 295.16
##$TE2= 300
##$TE3= 300
##$TEG= 300
##$TL= (0..7)
0 120 120 120 120 120 120 120 
##$TP= (0..7)
150 150 150 150 150 150 150 150 
##$TP07= 0
##$TPNAME0= <>
##$TPNAME1= <>
##$TPNAME2= <>
##$TPNAME3= <>
##$TPNAME4= <>
##$TPNAME5= <>
##$TPNAME6= <>
##$TPNAME7= <>
##$TPOAL= (0..7)
0.5 0.5 0.5 0.5 0.5 0.5 0.5 0.5 
##$TPOFFS= (0..7)
0 0 0 0 0 0 0 0 
##$TUNHIN= 0
##$TUNHOUT= 0
##$TUNXOUT= 0
##$USERA1= <user>
##$USERA2= <user>
##$USERA3= <user>
##$USERA4= <user>
##$USERA5= <user>
##$V9= 5
##$VALIST= <valist>
##$VCLIST= <CCCCCCCCCCCCCCC>
##$VD= 0
##$VDLIST= <DDDDDDDDDDDDDDD>
##$VPLIST= <PPPPPPPPPPPPPPP>
##$VTLIST= <TTTTTTTTTTTTTTT>
##$WBST= 1024
##$WBSW= 4
##$XGAIN= (0..3)
0 0 0 0 
##$XL= 0
##$YL= 0
##$YMAX_a= 439998
##$YMIN_a= -495864
##$ZGOPTNS= <>
##$ZL1= 120
##$ZL2= 120
##$ZL3= 120
##$ZL4= 120
##$ABSF1= 16.522
##$ABSF2= -4.171173
##$ABSG= 5
##$ABSL= 3
##$ALPHA= 0
##$AQORDER= 0
##$ASSFAC= 0
##$ASSFACI= 0
##$ASSFACX= 0
##$ASSWID= 0
##$AUNMP= <proc_1d>
##$AZFE= 0.1
##$AZFW= 0.1
##$BCFW= 0
##$BC_mod= 0
##$BYTORDP= 0
##$COROFFS= 0
##$CY= 12.5
##$DATMOD= 1
##$DC= 0
##$DFILT= <>
##$DTYPP= 0
##$F1P= 14.0000005364418
##$F2P= -0.99999901652339
##$FCOR= 0.5
##$FTSIZE= 32768
##$FT_mod= 6
##$GAMMA= 0
##$GB= 0
##$INTBC= 1
##$INTSCL= 1
##$ISEN= 128
##$LB= 0.3
##$LEV0= 0
##$LPBIN= 0
##$MAXI= 10000
##$MC2= 0
##$MEAN= 0
##$ME_mod= 0
##$MI= 0
##$NCOEF= 0
##$NC_proc= -4
##$NLEV= 6
##$NOISF1= 0
##$NOISF2= 0
##$NSP= 0
##$NTH_PI= 0
##$NZP= 0
##$OFFSET= 16.522
##$PC= 1
##$PHC0= 165.8972
##$PHC1= 5.915836
##$PH_mod= 1
##$PKNL= yes
##$PPARMOD= 0
##$PSCAL= 4
##$PSIGN= 0
##$REVERSE= no
##$SF= 250.13
##$SI= 32768
##$SIGF1= 0
##$SIGF2= 0
##$SINO= 400
##$SIOLD= 32768
##$SREGLST= <1H.CDCl3>
##$SSB= 0
##$STSI= 32768
##$STSR= 0
##$SW_p= 5175.98343685301
##$SYMM= 0
##$S_DEV= 0
##$TDeff= 65536
##$TDoff= 0
##$TI= <Analysis number 999999
Compound Code 99
Book Reference 9
Project Code 9>
##$TILT= no
##$TM1= 0
##$TM2= 0
##$TOPLEV= 0
##$USERP1= <user>
##$USERP2= <user>
##$USERP3= <user>
##$USERP4= <user>
##$USERP5= <user>
##$WDW= 1
##$XDIM= 32768
##$YMAX_p= 534736117
##$YMIN_p= -313222
$$ End of Bruker specific parameters
$$ ---------------------------------
##NTUPLES= NMR SPECTRUM
##VAR_NAME=  FREQUENCY,     SPECTRUM/REAL,   SPECTRUM/IMAG
##SYMBOL=    X,             R,               I
##VAR_TYPE=  INDEPENDENT,   DEPENDENT,       DEPENDENT
##VAR_FORM=  AFFN,          ASDF,            ASDF
##VAR_DIM=   32768,         32768,           32768
##UNITS=     HZ,            ARBITRARY UNITS, ARBITRARY UNITS
##FACTOR=    0.157963299565203, 1,           1
##FIRST=     4132.6476996994, 0,             0
##LAST=      -1043.33573715361, 0,           0
##MIN=       -1043.33573715361, -313222,     0
##MAX=       4132.6476996994, 534736117,     0
$$ Real data points
##PAGE= N=1
##DATA TABLE= (X++(R..R)), XYDATA
$$ [...]
20296a9851n644K8681N535j1680M3421j0355P2242M9607J011j16862n0751j2991
20284b7637O6464L2549j5838K5721j5311r3315l1235O5422O7728J6915r9129o6413
20272g4079k7236j6256l3919M2081L0490O3347j5065K1449J2071m6711l8216L3847
20260d8197l7681j8711L9860R0382k0738o7147L4211J1698r398J3537N8580K4994
20248G1390l843k9942j38061m7395L97o1974l6764O7040N7534k4474j8463M3474
20236a21081l294K6068L9344O647N3828R7109j6048o9526k5802p694Q931M1765
20224C0247J7364K6517n3150k0672J4788j9246p1868q007K1297P7204k6783k7652
20212c9961J892n743M1137K3776k4737k8236l117k3527j6668P021M9629K7232
$$ y = [-19851, -25495, 3186, 8721, -2959, 40462, 30107, 102349, 151956, 152967, 36105, -14646, -27637, 38827, 71376, 55538, 81259, 65948, -27367, -58602, 6820, 74548, 91463, -7666, -74079, -101315, -117571, -151490, -109409, -78919, -15572, -30637, -9188, 2883, -43828, -82044, -48197, -85878, -104589, -64729, 25653, 4915, -62232, -28021, -16323, -25721, -12184, 46396, 71390, 67547, 37605, -100456, -147851, -147454, -209428, -246192, -179152, -121618, -146092, -164555, -121081, -124375, -98307, -58963, -52316, 1512, 98621, 82573, 13047, -12755, -20449, -11518, 30247, 47611, 74128, 20978, 306, 15094, -4152, -76020, -84027, -62730, 14474, -12309, -39961, -38069, -43812, -2675, 21101, -3636, -31872, -34989, -58516, -75184, -68163, -18534, 8698]
20200H698L444m1375L619J3783L1499J6837l9122j3451P1729k1398j9570O0311
20188G5004j6889p9105Q328n3060o2632R5784K274L6239q19n6295j8452P216L2813
20175b9594k565K9246M9316L6516q2923l0859N947j291m2483j4155K4427L1240
20163b7178M4779l7517j2811o50K64J6474N6294J0880O0913Q756k7179m638o1475
20150B6912k9629L3110l3864q4202L7617J00887K119j6394J11055P465n2014N764
20138A08826J6245r317k1394o5282L3494l0127J1943J1570l8035L73M9768l046
20126F5018l6917m2K1214o539k9721l4035l2173Q499O9988m3396N218O8912q022
20113D8004j8228M8506k6504J9594l9189r926J1230m6735m4376R0246N6606p738
$$ y = [8698, 12142, -29233, -25614, -11831, 19668, 36505, -2617, -16068, 55661, 34263, 14693, 75004, 58115, -20990, -12662, -65722, -128354, -32570, -30296, 5943, 5124, -51171, -69623, -62407, -29594, -32159, -2913, 46403, 82919, -4, -30863, -24916, -26207, -68690, -82845, -58418, -27178, 17601, -19916, -32727, -33377, -33113, -16639, 39655, 50535, 111448, 120204, 93025, 88387, 26912, -2717, 30393, -3471, -87673, -50056, 50831, 52950, 36556, 147611, 155076, 103062, 108826, 125071, 115754, 94360, 29078, 62572, 32445, 44388, 55958, 17923, 18296, 68064, 65018, 28101, 28059, 49273, 42734, 13013, -21022, -53195, -44696, 25292, -18104, -12886, 56026, 48004, 29776, 78282, 51778, 71372, 32183, 22257, 33487, -13248, -57624, 32622, 89228, 81490]
20101H1490o9456n063K4233n5949j08590k7610R1179J23573K2383J180J5594M7250
20089A40214R610k0107p1274o1062j0751l8735r11j1221K646J6811L5736O3970
20077E4926p263J1403N5341Q282l2146m7406k0627k6322K1779J03828k7740L3749
20065A27804j1915q9806L1618L3959k2788k9694L014n315N7185J1691p5131m447
20053B6175L1644K6444L6230M3700m4611o0063n266P057m90l965l4962k1023K1743
20040B2613j270n6294k2114n5491L763K7072L5248P0917P2492L1699p775m5300
20028G5560k7952o0615k5391m5896J4174L4425L9679l1116o1507q541M6106k7312
20016g8386j0024K3625J9063M5049J0839k891m6049n1633j6685L609L3613L4577
$$ y = [81490, 12034, 6971, 31204, -24745, -133335, -160945, -69766, 53807, 76190, 77370, 92964, 140214, 149824, 129717, 58443, -2619, -13370, -52105, -53016, -64237, -61591, -44780, -9044, 54926, 47663, 59066, 114407, 122689, 90543, 43137, 22510, -3812, 17967, 121795, 94055, 127804, 115889, 26083, 57701, 91660, 68872, 39178, 42192, 36877, 94062, 105753, 30622, 26175, 57819, 84263, 120493, 164193, 119582, 59519, 54253, 61310, 60820, 56855, 21893, 870, 22613, 21343, -34951, -57065, -112556, -108793, -81721, -46473, 24444, 96936, 128635, 120860, 75560, 47608, -13007, -38398, -84294, -70120, -35695, 3984, -27132, -88639, -97180, -51074, -78386, -88410, -64785, -45722, -673, 10166, 7275, -38774, -90407, -107092, -103483, -69870, -35293]
20004c5293k0998K2259N6322L510N569R593K0738l730K3901p7162j0182J9984
19992A4511J0424L5956O5575M897o2752k9277M1703K4336j9709m6607m9423Q8034
19980G7668K3722J0606o3238r8684n9734k8941K7771L6140P565K9835O5143m517
19968B3336J3667n4844L0815O1678l9400j6834J6625N005j0697j4416K0303K9121
19956F4359L4160m9818n4261j5098O4071r122k5486M5707O5453j4282j6233n085
19944H4365J4499k508m2391J064o2389L788L4152k6842l6223N9672M839k7336
19932D690J722j1198P575l852L7209L5447o0612m4604K9643M3230Q1093K8451
19920A48794l8429J243j5579l6952O991L3257l7354k9691L7987m8488p903J0181
$$ y = [-35293, -56291, -34032, 22290, 25800, 31369, 40962, 61700, 57970, 81871, 4709, -5473, 14511, 24935, 60891, 126466, 131363, 68611, 39334, 81037, 105373, 85664, 39057, -10366, 77668, 101390, 111996, 48758, -49926, -109660, -138601, -110830, -74690, -67125, -37290, 27853, 23336, 37003, -17841, 12974, 74652, 35252, 18418, 35043, 40048, 29351, 14935, 35238, 64359, 98519, 48701, -5560, -20658, 43413, 34291, 8805, 54512, 119965, 105683, 89450, 84365, 98864, 96356, 53965, 55029, -7360, -3572, 30580, 3738, -32485, 27187, 32026, 4690, 6412, -4786, 2789, -1063, 36146, 71593, 10981, -33623, -3980, 39250, 120343, 148794, 110365, 111608, 96029, 59077, 66068, 99325, 61971, 32280, 70267, 21779, 13876, 24057]
19908B4057l003M1821j4691k141J0803N0877M1103l658J3852l6105o7732l7533
19896A7650l3991L421J5734o3780l9197R6738J20886m0306m1137J3031R0491k7586
19884A11954m8517P122K9127J156r26k4880p5756k2342m2150n3536N9342P4674
19872A5268k208L1764O0938k5420k4458p3863l69L5739m1595J0397M2151M6013
19860G4357q689j3782j11666o2012N6128J6654j6200M8062j5872k995k7410Q0192
19848A6767M6629p0190o0606n9488l5687O7193K4683K4011j8150k753O115J604
19836e9872j4248l5K3020k6229m4817j9580J3361O9486R0219J3520O9711j1452
19824A03084L5357K0220p0818r3794j17388k877j5366j141R899R0822N6465k0031
$$ y = [24057, 21054, 62875, 48184, 46043, 56846, 107723, 148826, 145168, 159020, 122915, 55183, 17650, -16341, -12920, 2814, -60966, -100163, -3425, 117461, 77155, 36018, 49049, 139540, 111954, 63437, 70559, 99686, 100842, 99916, 75036, -720, -23062, -65212, -118748, -59406, 15268, 13060, 44824, 105762, 80342, 55884, -17979, -18348, 17391, -24204, -13807, 28344, 74357, 65668, 51886, -59780, -121792, -65664, -49010, -65210, -17148, -33020, -36015, -63425, 16767, 63396, -6794, -67400, -126888, -162575, -95382, -70699, -46688, -64838, -67591, -61476, -59872, -74120, -74155, -51135, -77364, -122181, -141761, -128400, -58914, 31305, 44825, 114536, 103084, 138441, 158661, 87843, -5951, -123339, -126216, -141582, -142723, -132824, -42002, 14463, -5568]
19812e568m0345k682J3907J6048n5429K6133M5022M4941K6440K4677k8785J9252
19800H3611m2250m1846P5401M4929L841l2410j2669k2385j4023N6200O6856m475
19788A60780o4422l0506J7806k5952k0783j2463M6531M4932K57K0524j00151l9361
19776b808O0849L2175n7924o3150r817j3656P62J0896J2876N252L5563Q5353o29
19763I5742l3148n975l3188r3051J9381N2155J1210J8793o6772m0070m5137j8925
19751a38985J6637Q5584k6034l2661j3083P0576K9365k8805k9749P924M9827Q6781
19739G7377l670n472o0561j458l9259m2350l1469R1624J02377K3489k6584J2470
19727I6514Q850j3224K6253L5279o0750p2255n8657j5278L3065O0881O4077J5976
$$ y = [-5568, -45913, -48595, -34688, -18640, -74069, -47936, -2914, 42027, 68467, 93144, 64359, 83611, 41361, -485, 74916, 119845, 123686, 91276, 78607, 56222, 42199, 98399, 165255, 160780, 96358, 65852, 83658, 57706, 36923, 24460, 70991, 115923, 116180, 136704, 36553, -2808, 58041, 90216, 32292, -30858, -40675, -54331, -53569, -42673, -29797, -24545, 11018, 96371, 95742, 62594, 56619, 23431, -69620, -50239, 1916, 13126, 31919, -34853, -74923, -120060, -138985, -122348, -36764, -62798, -95459, -108542, -37966, -8601, -37406, -67155, -59231, -9404, 77377, 73707, 68235, 7674, 6216, -33043, -75393, -106862, -15238, 87139, 110628, 84044, 96514, 105364, 92140, 118393, 153672, 92922, 20667, -37990, -53268, -20203, 40678, 104755, 120731]
19715A20731k1627k8128k6575o362k6687O278O524J9434N110Q720m132q1288m3390
19702g1392l897p315k1300j0244j2952M5953J1535M6500J9880K0069K4524m8771
19690g410n1478K1810M8015j6981N3248r5833k5682R6405M751m687K0483q955
19678C3686L8128L2144J7332m8619n9797n5957m0647K3199M6297Q5036P4205k855
19666A42152j02592j02387N5990N7207r339l8723K5059j7674J2029M1435M2978
19655A06135J1174N033m3446o2121p5707m8369J4337m9298N7314P0892q367K0277
19643b146k9361k360n3687j9962J1366N6988L5658j1827r864m0366q712J3416
19631f0857P9230n359n8385k9356J5805K8554N1593L6480j2939k9893l0823L7215
$$ y = [120731, 99104, 70976, 44401, 38039, 11352, 17630, 24154, 43588, 48698, 57418, 53286, -28002, -71392, -75289, -82604, -103904, -114148, -127100, -81147, -69612, -23112, -3232, 16837, 41361, -7410, -58888, -37078, 10937, -6044, 47204, -48629, -74311, 22094, 26845, 22158, 42641, 33686, 71814, 103958, 121290, 72671, 12874, -43083, -83730, -60531, -14234, 70802, 145007, 142152, 39560, -62827, -6837, 50370, 41031, 2308, 27367, 9693, 21722, 63157, 106135, 117309, 122342, 78896, 16775, -58932, -107301, -92964, -142262, -84948, -14056, -22423, -2146, -31507, -33867, -87554, -107516, -96150, -39162, -3504, -15331, -25195, -65561, -74273, -60857, 18373, 13014, -45371, -74727, -58922, -30368, 21225, 57705, 44766, 14873, -15950, 21265]
19619B1265M470n4866N723m7008l4793r1078l7589M2491R6628M8582J3125m9522
19607h2572M5559k256L664N3958k5404q08L8136m375k6871j8012Q8627q753m2728
19594A8165k432P5355Q705m0596j4394m1752n3588N8124O4788j375n8647l5408
19582b3055Q0942L565o5940n7700N7623R812L5062j6328j8991o2373J9549J1287
19570b6547l2026M3460o050n6031J0857Q4433k6964m6152Q0409M6573l001n2372
19558A6589p0690n0620m073K3968N1570r873j2695P4424N7171J6599n4375o6189
19546b8194n422K5672N494P2943J6695l9936j7246m2430j7278L1988J6193l0484
19534a2005n4564N5397J05434K6844p481L8168K9880k236K1142J702m1654l9617
$$ y = [21265, 25735, -29131, -23408, -70416, -105209, -196287, -233876, -191385, -94757, -46175, -33050, -82572, -37013, -39269, -35605, 18353, -7051, -7859, 30277, 25902, -969, -18981, 69646, 60893, 18165, 15733, 91088, 99793, 59197, 44803, 3051, -50537, 7587, 72375, 71000, 12353, -23055, 57887, 61452, -4488, -62188, -4565, 5247, 40309, 23981, 4990, -57383, -37834, -26547, -58573, -15113, -21163, -77194, -66337, 18096, -8868, -55020, 25389, 71962, 68961, 16589, -54101, -104721, -108794, -84826, -33256, -43129, -55824, 18600, 75771, 92370, 37995, -28194, -33616, -7944, -2450, 70493, 87188, 47252, 30006, -12424, -29702, 2286, 18479, -12005, -66569, -11172, 94262, 121106, 113625, 151793, 181673, 179437, 200579, 202281, 160627, 121010]
19522A21010n1196n9860m5860j4817N9963M8336l5517l4577m4727k1860N3022
19511b6083J07350J0626j2647l6901m1668L3240M2073N697r0536L813j1532K3091
19499F523J7179l3513O2544p418n2802J6425L3940J2751O926o8216R058j2837
19487i440p1930k9213N3438L7388P1820M2180o8169m5428O4683O2856p1997o1717
19475b5529L4921P4161l2094k686k851L4668m9199j4562n6013m0492K7406K6996
19463b5274M8724l036o1060Q710K1594O4553R0982j6746J2224k0035k8388k0775
19451G1473r7564k837n01l6543k29M9882Q8154J2582m1114R125L1290m020k8491
19438E1207L62J6252m4778m6086L3557K2064l3489k8402M9844J1224j218n4250
$$ y = [121010, 69814, 9954, -35906, -50723, 9240, 57576, 22059, -12518, -57245, -79105, -26083, 81267, 91893, 79246, 42345, 677, 33917, 75990, 81687, -8849, -5036, -16568, 6523, 23702, -9811, 52733, 45315, -7487, 8938, 42878, 55629, 62555, -5661, 3397, -9440, -81370, -110583, -57145, -19757, 52063, 94243, 26074, -19354, 45329, 108185, 36188, -25529, 9392, 83553, 51459, 48773, 45922, 80590, 31391, 16829, -39184, -79676, -52270, -25274, 23450, 20414, -40646, -31936, -10342, 54211, 145193, 128447, 140671, 120636, 92248, 71473, -26091, -28928, -29429, -65972, -66201, -16319, 71835, 84417, 43303, 52428, 83718, 79698, 51207, 51569, 67821, 23043, -23043, 10514, 32578, -911, -29313, 20531, 31755, 30537, -23713]
19426b3713k2779o024K112n1880K9710N9772o482p4141M6865J01800K9728m3203
19414D1765o3254n8380J9767p751M3972J13321J03174m2793l4755m6399M6198
19403A14865L1895N319m1369q3212q364O4361M7083n4070o5679J6096J6539O1562
19391A05026O0346j1037K1793o1350j22581J935P114O7502N0345o3512l6839K8408
19379D7150O573J8537J125n3975l6407J9590R9646j2108K940k3960K5079L1214
19367A25404m0796K0787N8737K203j7404j1333j8775n1531l4902l6640m1603O0437
19355A4584M9719K4747K4521n3736M487K4794Q294l4753p618j0779l9473L1466
19343C6253p322J7989k1854J2939M4461J9585p1806n5931M1328R2618k6525r4586
$$ y = [-23713, -46492, -52516, -50404, -102284, -72574, -12802, -19284, -93425, -46560, 55240, 84968, 41765, -21489, -79869, -60102, -67853, -23881, 89440, 192614, 149821, 115066, 68667, 114865, 146760, 152079, 110710, 27498, 19134, 83495, 130578, 76508, 10829, 26925, 43464, 105026, 165372, 154335, 176128, 114778, -7803, -5868, 1246, 68748, 119093, 55581, 18742, 47150, 53723, 72260, 73385, 19410, -16997, 2593, 102239, 90131, 93071, 69111, 94190, 125404, 84608, 105395, 164132, 166335, 148931, 137598, 118823, 67292, 32390, -4250, -45853, 14584, 64303, 89050, 113571, 59835, 64322, 89116, 97410, 62657, 55039, 44260, 4787, 36253, 28931, 46920, 25066, 38005, 82466, 102051, 30245, -25686, 15642, 108260, 81735, -12851]
19331a2851K4171M2726n9825p486O9444J506j2658q4006m1437N4680M4025K4254
19319D2543k6652p1983j7943L2169Q8548J1547Q623K8003J8314j6485k722j6354
19307G7608J8914M935n2382m7116n4784p1508L4699J3816K6757L0331K7329k3971
19295a5372N518L1408M1521L9053N009K1816q660M742m9339N3236O1496j9152
19283A71276n0996n2282k1704K9540j9503o8114k9811j4849L7025P6121k007M5363
19271A00059M7058R28l2412k8087p5878o2441R256K0578M317M172K018m9842m0738
19258a01012q678P9617J27791Q0547k9547o8764R359l0261l7275N0564N8820K1709
19246A52870p5445l1578M8664P1059J1904Q091j0775k0573o8142p1535L2965N2248
$$ y = [-12851, 11320, 54046, -5779, -13265, 56179, 57685, 45027, -38979, -80416, -25736, 18289, 42543, 15891, -56092, -74035, -41866, 46682, 58229, 66852, 94855, 113169, 96684, 93962, 77608, 96522, 101457, 49075, 1959, -52825, -124333, -89634, -75818, -49061, -18730, 8599, -15372, -9854, 21554, 63075, 102128, 107137, 128953, 120293, 125035, 75696, 128932, 190428, 171276, 120280, 67998, 46294, 75834, 56331, -11783, -41594, -56443, -19418, 56703, 54696, 100059, 147117, 148045, 115633, 87546, 11668, -50773, -41517, -20939, -16622, -12450, -10432, -60274, -101012, -109690, -30073, 97718, 178265, 148718, 79954, 89313, 59052, 21777, 72341, 131161, 152870, 77425, 45847, 94511, 165570, 177474, 185565, 174790, 154217, 86075, 14540, 47505, 99753]
19234I9753l1062M4361J9574r050l1690p3382l5231M2324k7118p918N0102L0213
19222G0876p709L6381j4951N5659N8185j08476r1787m755k5456O174P5073j9197
19210C0017J6643N1769L1299n909n5607l3517j9174K7306P916J6225m5211J8714
19198D0471l9813j3302M3836j5119j563K6266J1744L8622M2464K450k0965n839
19186A09252k3195k6286P3181j9933o0905j422M3119Q3878k2081j10006j6131
19175B9471L9508M172k5817j7698N3579K3159m2976j3748O6135k2568o2904M6651
19163G6964M1055o4563J6557j3647K5973K42j6045j8137k7201R576K4000l1891
19151B2883K4184N2436K9237M8941m0559l8319j3133J5130L2720M8596N8725M9671
$$ y = [99753, 68691, 113052, 132626, 123576, 91886, 18504, -16727, 25597, -1521, -9439, 40663, 70876, 63167, 99548, 84597, 140256, 198441, 89965, -1822, -6577, -32033, -25859, 49214, 30017, 46660, 98429, 129728, 123819, 68212, 34695, 15521, 42827, 50743, 66968, 21757, 40471, 658, -12644, 31192, 16073, 14510, 40776, 52520, 91142, 133606, 136056, 115091, 109252, 86057, 59771, 132952, 113019, 52114, 50692, 93811, 177689, 155608, 45602, 29471, 68979, 73151, 47334, 29636, 83215, 106374, 63398, 49650, 115785, 93217, 30313, 76964, 118019, 53456, 70013, 56366, 82339, 82581, 66536, 48399, 21198, 30774, 54774, 22883, 47067, 99503, 128740, 177681, 137122, 98803, 85670, 100800, 133520, 182116, 240841, 290512]
19139B90512j6094J24793O0170Q3158O2429k5454o3891J5894L0350j16804j13385
19128C31678l8509p390o2010j0201K8290j9385N3325K0017M1065J7653N7512J6918
19116D28963m1405N6782N7321J13827R5367J14982Q2463k8161j33999q9183o4786
19105E92171j5460J6200o2477r323q6892o9977k9990q4946l6807j518j4822M8174
19093B44333n023j6025l5738j0507O7167L1203m0346P185N5727r2814o5991p449
19081A31722N8269M5151P0647L147o7182o791J7893k3891n4088k5885j3245q4065
19069E1682K0013R0174k5049m7105N0901M8501m2208j12331K3347Q9651K569o2931
19057H7214m1894l6960K8772N6569o0154K9546j7404l8628k4038M89O425P913
$$ y = [290512, 274418, 399211, 459381, 542539, 604968, 579514, 515623, 531517, 561867, 445063, 331678, 293169, 285779, 223769, 213568, 241858, 222473, 275798, 295815, 336880, 354533, 412045, 428963, 387558, 444340, 501661, 615488, 710855, 825837, 908300, 880139, 746140, 656957, 592171, 576711, 592911, 530434, 521111, 434219, 364242, 334252, 249306, 212499, 210981, 196159, 244333, 239310, 223285, 187547, 177040, 244207, 275410, 235064, 242249, 297976, 205162, 139171, 131722, 189991, 235142, 305789, 308936, 241754, 234963, 252856, 228965, 174877, 148992, 135747, 51682, 71695, 161869, 136820, 89715, 140616, 189117, 146909, 34578, 57925, 147576, 150145, 87214, 45320, 8360, 37132, 93701, 33547, 63093, 45689, 7061, -16977, -16488, -10063, -2150]
19045b150J24134R2548K5450J6970P396o9743q729l6009l5597J1304K7263l20
19033A52517l9069L1982N208N911l1442l4829L9719N6510L9403J7197j4786k3572
19021B04749K4225j02039r5824J2616J36167k6490K572k3340k2677J7381L37j5756
19009A11921K0385N068L7619J9724K2950J4627o4023m4181l0132n7917p284m2741
18997a3984L9893n612m8994O8463J19133L1304L9175l09q5385o0169k260k4734
18985E6521L1324K4183o5420N5689J5376R368J1118j9440k5272o136M28k7218
18973F0521M4854O7926o254L8353l7148n3888n7117k4920M3978Q6026J2182j944
18961A72569n8740m3016M9222O6428J7357l1513j04316l7986L2740L1846j1347
$$ y = [-2150, 121984, 214532, 239982, 256952, 264348, 194605, 185876, 149867, 114270, 125574, 152837, 152517, 113448, 145430, 150638, 156549, 125107, 90278, 129997, 186507, 225910, 243107, 228321, 204749, 228974, 126935, 31111, 43727, 179894, 153404, 155976, 132636, 109959, 127340, 127677, 111921, 132306, 137374, 174993, 194717, 217667, 232294, 168271, 124090, 93958, 36041, 28757, -13984, 25909, 20297, -28697, 39766, 158899, 190203, 229378, 229069, 143684, 83515, 81255, 56521, 87845, 112028, 46608, 102297, 117673, 127041, 138159, 118719, 93447, 87311, 87739, 60521, 105375, 173301, 167047, 205400, 168252, 114364, 57247, 32327, 76305, 162331, 174513, 172569, 113829, 70813, 120035, 186463, 203820, 172307, 67991, 30005, 62745, 94591, 83244]
18950H3244J6332J0206q9967r619K1377J7852R3622k9326j8649M5481L4586p9250
18938I5889p2224Q2879N4940k4102j7911l8081l0916Q8345L466L2189N5538j6449
18926B13563m8038q1611N8687J01967p461j15394L5514M1642j9207l8320Q3538
18915B24880J5182J4197l9651r4525j2851j3595o7734k2094L6196L0860k397Q734
18903G7202M0934L6417l730q7955l1914P4007N4290P2030O881p2534k5692O4190
18891B04126K7915j9485Q120O903j3642j1246K3359J0446m766L2423k7502k9456
18879B07195q076M2023L8505R8766N9953N2680L4087n5079m8320m5138K0296n3642
18867C43250m2265L7528N7177O112J1383L4583M8763L2807m666j316l1679n3204
$$ y = [83244, 99576, 109782, 19815, 10196, 31573, 49425, 143047, 113721, 95072, 140553, 175139, 95889, 23665, 106544, 161484, 137382, 119471, 81390, 50474, 138819, 142285, 174474, 230012, 213563, 165525, 83914, 142601, 244568, 237107, 121713, 157227, 198869, 179662, 141342, 224880, 240062, 254259, 214608, 120083, 107232, 93637, 25903, 3809, 40005, 70865, 68468, 77202, 118136, 154553, 150823, 62868, 30954, 104961, 159251, 231281, 238162, 165628, 139936, 204126, 232041, 212556, 220676, 227579, 213937, 202691, 226050, 236496, 231730, 264153, 236651, 207195, 199119, 241142, 279647, 378413, 438366, 491046, 525133, 470054, 421734, 376596, 396892, 343250, 300985, 338513, 395690, 401802, 413185, 447768, 496531, 529338, 524672, 523356, 491677, 438473]
18855D38473K749J8217m1301K1660m8778n6004L4303M1878M1968M1045k5205m5526
18843D23479j3990M409L4543O8762m925K0293R2864N0141N3527Q1624M2863j00222
18831G53368L2041K3492n8069n7313l725L6820J8821N8071P7761J1266j1414O8727
18819I49846N5185J7011l4949j9509r6688j07573n7860o3892k848K8682N6996
18808G24401K6001K1096M2533J01806n4320r7553l802J553n6489J5992P1455k1866
18796G70807l9482M997K159M8972o811j7548M2680J0218P557r715O5924L7511
18784I17269K2224m4438M5476J4837M9870m2085L704k226r0338n0039J7222J09329
18772I50805Q0897P584j1989O7543M3092L9005O750j7382j51343j34863r0011
$$ y = [438473, 441222, 459439, 418138, 439798, 391020, 335016, 369319, 411197, 453165, 494210, 469005, 423479, 409489, 413898, 448441, 517203, 512278, 532571, 625435, 675576, 729103, 810727, 853590, 753368, 785409, 808901, 750832, 693519, 689794, 726614, 745435, 803506, 881267, 892533, 881119, 949846, 1005031, 1022042, 987093, 967584, 870896, 763323, 705463, 641571, 638723, 667405, 724401, 750402, 771498, 814031, 915837, 861517, 763964, 760162, 761715, 705226, 721218, 792673, 770807, 731325, 736322, 738481, 787453, 780642, 763094, 805774, 815992, 823549, 813834, 879758, 917269, 939493, 895055, 940531, 955368, 1005238, 963153, 966857, 964631, 874293, 824254, 841476, 950805, 1031702, 1039286, 1027297, 1094840, 1137932, 1176937, 1183687, 1166305, 1014962, 880099, 790088]
18761G90088o0374o8147l038K3095k3263p9864J7238L5383r5339k5413n0290J8075
18749D78151L2824O6705P2811N5041R323J0171n1369j01590o7997M1480Q7800
18738F33350Q7865m1579r9360j114P3645J9700j3289l0648o260L599M2440P769
18726F76118o351j6185k4811p9191j04792M6603Q6900L1660N5196M5630O3237
18715G74014L4299j9787l6795p6194j6989O402n9157j0701Q7428L6365m0636q4137
18703E94112L6764J36651J14338N7511M723N1689n3440m9023j8544n9671o9492
18692G45618j3834j8484J6328j2981J2467N1000R5845M8603j0711j5949Q1360
18681I79262l0991J3153M0048K4192o4217p7877k0856n2590m0313j2030J4307
$$ y = [790088, 729714, 661567, 658529, 681624, 658361, 578497, 595735, 631118, 535779, 510366, 460076, 478151, 510975, 577680, 650491, 705532, 714855, 725026, 673657, 572067, 504070, 545550, 633350, 721215, 679636, 580276, 579162, 652807, 672507, 659218, 628570, 622310, 625909, 668349, 676118, 669767, 653582, 628771, 549580, 444788, 491391, 578291, 609951, 665147, 710777, 774014, 808313, 788526, 751731, 675537, 658548, 664950, 605793, 595092, 682520, 718885, 678249, 594112, 630876, 767527, 881865, 939376, 944099, 995788, 942348, 893325, 874781, 815110, 745618, 731784, 713300, 729628, 716647, 729114, 780114, 875959, 924562, 913851, 897902, 979262, 948271, 961424, 1001472, 1025664, 961447, 883570, 862714, 810124, 769811, 757781, 772088]
18670G72088M2355O7003Q7216P3129L160J4012r42l1554q0686l1610l5487n8544
18658H20140k4194j5515J0039N887J507Q027M2221o0481p8288m3524Q206n5800
18646F18225o3563O0842O4906q897j06924m9867L871k06j0983M1783L9951J1330
18634F00468o0241m9823M045M2233r328m8806m8679p3797n5556k108P6445j1012
18622C63841J2510O248K02r907k1750R867m553M2588M0722m0384r8575l0466J9939
18609B90282O3997O849N029L561J6272M9563J6973p0194l8256K7834J6033j3042
18597C74901M3724k0944k1759p847n0533j2133j2398m5509J3077l844K0051q07
18585B75979J16437O9929j4930M875n9838j7798J532R9487n505m8137o560k3490
$$ y = [772088, 814443, 881446, 968662, 1041791, 1044951, 1058963, 1058021, 1026467, 945781, 914171, 878684, 820140, 795946, 780431, 790470, 796357, 797864, 805891, 848112, 787631, 709343, 665819, 674025, 618225, 554662, 615504, 680410, 671513, 564589, 514722, 518593, 518387, 507404, 549187, 589138, 600468, 540227, 490404, 494449, 536682, 527354, 478548, 429869, 356072, 300516, 298408, 374853, 363841, 376351, 382599, 382801, 372894, 351144, 361011, 356458, 399046, 439768, 399384, 300809, 270343, 290282, 354279, 361128, 366157, 369718, 385990, 435553, 452526, 382332, 344076, 371910, 387943, 374901, 418625, 397681, 375922, 368075, 317542, 305409, 293011, 247502, 260579, 256735, 276786, 275979, 392416, 462345, 447415, 452290, 392452, 374654, 376186, 475673, 470168, 422031, 415471, 391981]
18573C91981J5004l6720k3037k0258r1581m9336L4607P3713N7598J3804N3756
18562D19531l9510m6147j813N5286l8430k963R4013L1356N6605J00793K3598N3680
18550G05999k3584r5256R194N929j7330R73K1167k934l677k6897o6817N3521Q6478
18537F46766J0830M233q3565m4267p13N723O599k8102K7317k0140j5270K4432
18525E33843P107l0885m0179l3941j9766P8825k5879n100K4106m822j7801K2148
18513D87656J5548L4256K3532J4728K9720Q372K3271m061J295L5233L3475o4313
18501F38712q8792M4179Q5795J9063J0860L4089m9673J8679K8933l607l4575m6171
18489F57492m4832n5107o0891M0514K0896M0624p9541M2790n1415j863O0974O2339
$$ y = [391981, 406985, 370265, 347228, 326970, 235389, 186053, 220660, 294373, 351971, 365775, 419531, 380021, 333874, 332061, 387347, 348917, 345954, 439967, 471323, 527928, 628721, 652319, 705999, 682415, 587159, 596353, 602282, 584952, 585925, 607092, 604158, 600481, 573584, 506767, 560288, 646766, 657596, 661829, 578264, 533997, 533284, 539007, 545606, 517504, 544821, 524681, 509411, 533843, 540950, 510065, 469886, 435945, 416179, 495004, 469125, 464025, 488131, 483309, 465508, 487656, 503204, 537460, 560992, 575720, 605440, 613812, 637083, 633022, 634317, 669550, 703025, 638712, 549920, 594099, 679894, 698957, 709817, 743906, 694233, 712912, 741845, 738238, 703663, 657492, 612660, 557553, 496662, 537176, 558072, 598696, 519155, 561945, 510530, 508667, 569641, 631980]
18477F31980M2811J5416l3514K3577L2539P6900O1921n8833M9539L2995m7400
18466H27931j8420k6646j1649j9709N6217P6459o363k8945n0364M8609l9134n1447
18454G56539M2011L0447L6191L0477M0865k6125r385M3563l5817j3021n381n114
18442H85250R7849L5615p1205Q447j0368k0303o3056O9025J8720L0563m5918O8656
18430A003275J2425j0230k9916l0528r185O5184M677N341M3211P4939L1991N8627
18418A219811O6171n8271l6927K4317J4810L367j102k60L7206R3800R3319J26949
18406A583190J58253J73251R7780R9260O9439Q6950P3471N0182P7418j0969O0996
18395B519221N5562J33709K82227M63940R09052J257786J322577R78378O62319
$$ y = [631980, 674791, 690207, 656693, 680270, 712809, 789709, 851630, 792797, 842336, 875331, 827931, 809511, 782865, 771216, 751507, 807724, 884183, 877820, 848875, 798511, 847120, 807986, 756539, 798550, 828997, 865188, 895665, 936530, 910405, 901020, 944583, 908766, 895745, 890364, 885250, 983099, 1018714, 947509, 955956, 945588, 925285, 862229, 931254, 949974, 980537, 934619, 1003275, 1015700, 1005470, 975554, 945026, 935841, 1001025, 1005702, 1011043, 1054254, 1129193, 1161184, 1219811, 1285982, 1227711, 1190784, 1215101, 1229911, 1233278, 1232176, 1231916, 1269122, 1362922, 1456241, 1583190, 1741443, 1914694, 2012474, 2111734, 2181173, 2268123, 2341594, 2391776, 2469194, 2458225, 2519221, 2574783, 2708492, 2990719, 3454659, 4363711, 5621497, 6944074, 7922452, 8584771]
18386H584771J87111m47845n30898m65085n85837p95771n81421k51107J55434
18377E269352M71974Q39141R26104M17734n901n11894p25225n00974j98415m25
18367E981471P7905K54909M06994P24806J097315J426265J883639K349728K615437
18358A6818469K606874K078224J163626M48715l09650n73210o05354m01928k60763
18349B0965003k26215j56647k68548o36135j089901j171883o57804K36509J447568
18340A8441947K683049L200274K887864K758984L142132M853362R379984J5173354
18332F2520950J8698451J6981979R482866j143947j0066275j3697590r964096
18325G2812338j578177N456565R095746J0356797J0556101J0119970Q225614L546200
$$ y = [8584771, 8771882, 8324037, 7793139, 7328054, 6742217, 5946446, 5365025, 5113918, 5269352, 5741326, 6580467, 7506571, 7924305, 7918404, 7406510, 6681285, 6180311, 5981896, 5981471, 6059376, 6314285, 6721279, 7446085, 8543400, 9969665, 11853304, 14203032, 16818469, 19425343, 21503567, 22667193, 23115908, 22806258, 22233048, 21627694, 21225766, 20965003, 20738788, 20582141, 20313593, 19677458, 18587557, 17415674, 16757870, 16994379, 18441947, 21124996, 24325270, 27213134, 29972118, 33114250, 37967612, 47347596, 62520950, 81219401, 98201380, 107684246, 106540299, 96474024, 82776434, 72812338, 71234161, 76690726, 85786472, 96143269, 106699370, 116819340, 125044954, 128591154]
18317A28591154k865439r869668j4824251j4925870j1673760q144326n328320
18310F0959520l059372j159237Q24768L375360P291622J3342761K1794230K9386849
18302A32756501L2356652L2047243K6895898J6649120O341466K58828k542767
18295B44762941r286850j3766583j4322341j7396794j3074944L291227K2899620
18288B03106276L6970004M1262348L4471624J9255004K219510j8248411l2466061
18281B86570294l7790396m2772471l7284260k3881728j2926300p097148n042296
18274A19775695m464992m393036l529765K136M710717P767177O052434O84617
18266A26604983n648406j1185244j2141330q495140l899831j01520K139522J451260
$$ y = [128591154, 125725715, 115856047, 101031796, 86105926, 74432166, 66287840, 60959520, 57900148, 56740911, 57565679, 60941039, 68232661, 81575422, 103369652, 132756501, 165113153, 197160396, 224056294, 240705414, 247046880, 247305708, 244762941, 235476091, 221709508, 207387167, 189990373, 176915429, 180206656, 203106276, 240076280, 281338628, 315810252, 335065256, 337284766, 319036355, 286570294, 248779898, 206007427, 168723167, 144841439, 131915139, 124817991, 119775695, 115310703, 110917667, 107387902, 107390038, 112100755, 119867932, 125920366, 126604983, 120956577, 109771333, 97630003, 89134863, 85235032, 85133512, 87273034, 88724294]
18258H8724294j122441m253562p203117p979163o294617m221512k648285j344954
18250E3656643l63987N331j28046p09325j474390k174632k490805k314510j930905
18241D2075374j331996n91476J69857R62140J798910K666574L011869L137984
18233E1899236L246790K566226J732383P65301l77400j342496j601443p39936
18225E6148661R67931L494969O534400R877069J3343039J6128088J7357798J6987129
18217A40839084J5055516J0394293N392513J145216l859759p568853r441816j0959584
18209A40996610j2122456j1433573j0033296q632818n825709k921124l83513K106073
18201I1750194M006785N435033O308795O507943O399048N453132L712353K113111
$$ y = [88724294, 87601853, 83348291, 76145174, 68166011, 61871394, 57649882, 55001597, 53656643, 53292656, 53297987, 53169941, 52460616, 50986226, 48811594, 46320789, 44006279, 42075374, 40743378, 40151902, 40321759, 41283899, 43082809, 45749383, 48761252, 51899236, 55146026, 57712252, 59444635, 60209936, 59832536, 58490040, 56888597, 56148661, 57116592, 60611561, 67145961, 77023030, 90366069, 106494157, 123851955, 140839084, 155894600, 166288893, 171681406, 172826622, 168966863, 161398010, 151956194, 140996610, 128874154, 117440581, 107407285, 98774467, 92948758, 90027634, 89644121, 91750194, 95756979, 101192012, 107500807, 114008750, 120407798, 125860930, 129573283, 131686394]
18193A31686394N52371j190359k463596l566669m749804n313367n036737m252308
18185A05665925l387571l181295l470701m198481m871863n133295m981348m291246
18177G2150125l433353k403405o08533J234785K968330N011481O466298O770644
18169H8156372O570133N645812K628241o62834k987599n869229p636068p237452
18161G8607376o498206m791842j905894Q31736L117667M445521M350720L274152
18153H1431230R73113k119691m272943o219375p450030p230727o544080n528271
18145D3039226m175068l086123k333048j731138j353478j204030r97232q00760
18137B7358349o64555n46997m34799m58423l53509n01504p25263q79940q50260
$$ y = [131686394, 132238765, 131048406, 128584810, 125018141, 120268337, 114954970, 109918233, 105665925, 102278354, 99097059, 95626358, 91427877, 86556014, 81422719, 76441371, 72150125, 68716772, 66313367, 65704834, 66939619, 69907949, 74919430, 81385728, 88156372, 94726505, 100372317, 103000558, 102337724, 99350125, 93480896, 85844828, 78607376, 72109170, 67317328, 65411434, 66243170, 69360837, 73806358, 78157078, 81431230, 82404343, 80284652, 76011709, 69792334, 62342304, 55111577, 48567497, 43039226, 38864158, 35778035, 33444987, 31713849, 30360371, 29156341, 28159109, 27358349, 26693794, 26146797, 25711998, 25253575, 24900066, 24398562, 23673299, 22793359, 21943099]
18128B1943099q22331p01745o33903o71682o05440m40368l56318l53955k95139
18119A7062218j69071o6319K24010N49955R84125J805882L398376O944355J4134482
18110D4868013K1476814J6340097N449180l269116j7826310k0915478j2343123
18103C3780077o536297l842475k559798j790584j312684j063239q90442p62102
18095A5022456o78193n95268n70872m49042m36606m57815m13947l78942l84668
18086A0657103l41683l40906k78987k07015j63750k36338k62767l26856k88536
18077H210265j77903k55166l09536k38228k03203k12958j39115r3923j51001k13765
18067F215467j72455r1234j91921j40434k06980j85047q5472r7815j37014j31555
$$ y = [21943099, 21120768, 20419023, 19785120, 19113438, 18507998, 18067630, 17711312, 17357357, 17062218, 16893147, 16826828, 17050838, 17600793, 18584918, 20390800, 23789176, 30733531, 44868013, 66344827, 82684924, 88134104, 84864988, 67038678, 46123200, 33780077, 27243780, 23401305, 20841507, 19050923, 17738239, 16675000, 15784558, 15022456, 14344263, 13748995, 13178123, 12729081, 12292475, 11834660, 11420713, 11041771, 10657103, 10315420, 9974514, 9695527, 9488512, 9324762, 9088424, 8825657, 8498801, 8210265, 8032362, 7777196, 7467660, 7229432, 7026229, 6813271, 6674156, 6580233, 6429232, 6215467, 6043012, 5951778, 5759857, 5619423, 5412443, 5227396, 5141924, 5044109, 4907095, 4775540]
18057D775540j48727j07049l9641j31666j62424j25339j56713n5613o3969o2370
18047C722029r3286j65321j00156m8993j23963j56507o8357j0938L156k9460q0428
18036B847776j38673o2784R140p5146r2701j13508P142Q1140n5215p6349l6199
18025B294623n4583o2085l8712l631m7329q8786o9936r4722q5397j6798L6652
18014A769296m2391j09345n1815m2491l0608M896j3197m4245j7673m1332m5552
18003A335543k2427k8073p9234j01144n916j9302n1881l7967k6384k2294J0593
17992I51514m828L2342j6056n0504j8716L5441K2161N854K8194m6689n8317r7013
17980G83383Q938M6041j1390o8016K8623o9936p3198l4811k6359l2324o000O4217
$$ y = [4775540, 4626813, 4519764, 4480123, 4348457, 4186033, 4060694, 3903981, 3848368, 3784399, 3722029, 3628743, 3463422, 3363266, 3314273, 3190310, 3033803, 2965446, 2954508, 2957664, 2928204, 2847776, 2709103, 2646319, 2655459, 2580313, 2487612, 2374104, 2381246, 2462386, 2407171, 2330822, 2294623, 2240040, 2177955, 2139243, 2135612, 2088283, 1999497, 1929561, 1834839, 1749442, 1732644, 1769296, 1726905, 1617560, 1565745, 1523254, 1492646, 1497542, 1484345, 1440100, 1422427, 1381095, 1335543, 1313116, 1285043, 1205809, 1104665, 1098749, 1079447, 1027566, 989599, 963215, 940921, 951514, 946686, 979028, 962972, 912468, 893752, 929193, 951354, 957208, 985402, 938713, 880396, 783383, 792321, 838362, 826972, 758956, 787579, 717643, 644445, 609634, 583275, 550951, 544951, 609168]
17968F09168j9673n3229j9308M4009L8985K9022m0325J4781k9407N0020L7978
17957F62021j24113j23303n0746j7645J22624N6195m2859k0320L633m2802p0519
17946C52166J4132N4445M8653M9657p1923p8253r81k9572K718M4352L7240n662
17934D16972r4818o4989q898L0331J0857K0987m430m7765p627l817n2131n5234
17922A39438K7822R0956M2881k4985k4137j5250K6328k507n9789J844L0114M25
17910B33140j6995L7484l7468J9595K746l2663M2567M4454k2836L708J9766K9178
17898C22676j13727n0383M4777l9604l1945J352j03207N997P5795N7118J8981
17887A87830q7695p210O4641Q1559N0859k9615o9724o1862l3334k4969K0247j0585
$$ y = [609168, 589495, 536266, 516958, 560967, 599952, 628974, 588649, 603430, 574023, 624043, 662021, 537908, 414605, 363859, 346214, 468838, 525033, 482174, 461854, 465487, 422685, 352166, 366298, 420743, 469396, 519053, 447130, 368877, 367896, 338324, 341042, 385394, 422634, 416972, 322154, 257165, 248267, 278598, 289455, 310442, 306012, 258247, 250620, 246803, 194672, 139438, 167260, 258216, 301097, 276112, 251975, 236725, 263053, 260546, 200757, 202601, 232715, 233140, 216145, 253629, 216161, 235756, 238502, 205839, 248406, 292860, 270024, 273732, 293498, 322676, 208949, 158566, 203343, 163739, 131794, 133146, 29939, 35936, 111731, 168849, 187830, 100135, 92925, 157566, 239125, 289984, 260369, 190645, 128783, 95449, 70480, 90727, 80142]
17875H0142l0173R60L3605L8042L2343j5961l7553L561L5667m019k9659J5115
17863A22070k6997j1643k3595K5776L4406k4568P5385N8802N2075J04072J01150
17852D86933j4108n394J6915k2598q0039J4335l2278j5181j7084o1343m932K5167
17840B90393P2255k874k1686O3644L1598J5549j11325l7832p2557o6227L5616
17829A96554R0677Q7621M6216J40889J2713k0706M1923N9553L7400j0222l4186
17818F48432n6400j7498O0398J1647M4681K4659l094J9858o2196j0282j9480l9512
17806F01213n2060o7918k9067O2362P8236M3596M7655P0043P4091L6817m7976
17795H16992n7319l6957n2624p6018o9629q8676l0809j8216N2537L9124L7616
$$ y = [80142, 49969, 50929, 84534, 122576, 154919, 138958, 101405, 104966, 140633, 136614, 106955, 122070, 95073, 83430, 59835, 85611, 120017, 95449, 170834, 229636, 281711, 385783, 486933, 472825, 467431, 484346, 461748, 381709, 396044, 363766, 348585, 331501, 270158, 265226, 290393, 362648, 359774, 338088, 401732, 433330, 448879, 337554, 299722, 227165, 160938, 196554, 287231, 374852, 421068, 561957, 574670, 553964, 595887, 655440, 692840, 682618, 648432, 592032, 574534, 634932, 646579, 691260, 715919, 712825, 732683, 670487, 660205, 640725, 601213, 549153, 481235, 452168, 514530, 592766, 636362, 684017, 754060, 828151, 864968, 816992, 759673, 722716, 670092, 594074, 524445, 435769, 404960, 386744, 439281, 478405, 516021]
17784E16021n031L0820j2710r5888N079P756N988m728L6837J27828N0825O3713
17772G26510P7173l0487M684N3648N5037k2124r6082o4655K6538Q70j517m1506
17760F88089o5080q6800p260p0819j8295K9046j3857J5032p934m7331l2252L3463
17748D16002L9245j4329o463n0378l4734N1746q025o1714m6355o914l1944J08700
17736C54837k9621K0769O2544k1971m7705J95l2715j7155J8156N0360K6258Q9369
17724D73321k026J9726O4461J0039N2207p328L1237k682m3643L9348l423k7814
17712F03423N9214R9951N3710m2022p5720O1193O7259K9794n2043o0957J3891
17701G57693m3439k9658m178o3611p6109p551k2077q6780m5860j8879Q560k0552
$$ y = [516021, 510990, 541810, 529100, 433212, 438291, 446047, 452035, 447307, 484144, 611972, 662797, 726510, 803683, 773196, 777880, 831528, 886565, 864441, 768359, 703704, 730242, 731112, 729595, 688089, 623009, 536209, 528949, 458130, 439835, 468881, 455024, 470056, 462122, 414791, 382539, 416002, 455247, 440918, 434455, 384077, 349343, 401089, 393064, 331350, 284995, 278081, 246137, 354837, 325216, 345985, 408529, 386558, 338853, 339048, 306333, 289178, 307334, 357694, 383952, 473321, 471295, 491021, 555482, 565521, 617728, 610400, 641637, 638955, 595312, 634660, 631237, 603423, 662637, 762588, 816298, 774276, 698556, 759749, 827008, 856802, 804759, 743802, 757693, 714254, 684596, 680418, 616807, 540698, 533147, 511070, 424290, 378430, 359551, 368111, 347559]
17689C47559J9162J19661J3190k7805n4211K8176N9586M0432L0174j8614k0412
17678E36898j5329o8132L11m203O4558O0875j78k4945M456k3462K3740K5477o835
17665E73231m2846m3062k5864P2286J07391o081m518m0210r4633p5416j3040J6637
17653D23875j5515n5639l8989q279o0617p0213k1772Q7879J17670L5041r371n9697
17641C24373n9146m7984K860J8331k4656m6396m644n9052k3002M3763J3181J7416
17629A55044N8598n0238l0142L480J6707j3638p0504M47P2686o055o427k0640
17617A09318j4934J2734k476o3677j0707N0352J7563j6407L9485N369k6961J2517
17605A12176l9516o577k5958J2779k8945k1275J1033M2056K8373J6494q6818n1966
$$ y = [347559, 366721, 486382, 499572, 471767, 417556, 445732, 505318, 545750, 575924, 557310, 536898, 521569, 453437, 453748, 449545, 514103, 574978, 574800, 549855, 554311, 530849, 554589, 580066, 573231, 530385, 487323, 461459, 533745, 641136, 635055, 630537, 590327, 495694, 420278, 407238, 423875, 408360, 352721, 313732, 305453, 244836, 174623, 152851, 240730, 358400, 393441, 384070, 324373, 265227, 217243, 220103, 238434, 213778, 167382, 162738, 103686, 80684, 124447, 137628, 155044, 213642, 163404, 133262, 136742, 153449, 139811, 69307, 69754, 142440, 136385, 129958, 109318, 94384, 107118, 104642, 40965, 30258, 80610, 98173, 81766, 121251, 126620, 99659, 112176, 72660, 66083, 40125, 52904, 23959, 2684, 13717, 55773, 84146, 100640, 13822, -38144]
17593c8144n5404k8330M8760P2985l3743j05390K4266Q1916p704J8751k6697N1768
17581C034J7956J3312j2625n7530J1059Q4961J8815k2140k6505o0738N8610Q683
17569C6892P896n5377J733q1158J0405L1406J706J0533Q6989M5204k8563J0369
17557G8035l6177l9097r1106M8695O8625m758m8191l9398r915k6969k7310N5539
17545g2027j520M2658m2285M25j2773J846m4246j1720M2138L8896P8358P0439
17533I0189j3060m3547m0677o4586m0262j4803K1825N0728R2178M6039l9859m8591
17521d426j9403p1331q3183m1587j1304Q4707Q2694p472p1604k1430M6297L7984
17509h0058J2601K5862o8087q4778J4658M5659Q9921J066M022L5790L8496L9691
$$ y = [-38144, -93548, -121878, -73118, -133, -33876, -139266, -115000, -33084, -40788, -22037, -48734, 3034, 20990, 34302, 21677, -35853, -24794, 60167, 78982, 56842, 30337, -30401, 28209, 36892, 44788, -10589, -8856, -90014, -79609, -48203, -46497, -35964, 51025, 96229, 67666, 78035, 41858, 2761, -88345, -39650, 28975, 24217, -23974, -63372, -73287, -100256, -127566, -72027, -73547, -30889, -73174, -72749, -85522, -83676, -127922, -139642, -97504, -58608, 19750, 90189, 77129, 33582, -7095, -71681, -111943, -126746, -104921, -54193, 37985, 84024, 44165, -4426, -23829, -95160, -178343, -219930, -231234, -146527, -63833, -71305, -142909, -164339, -118042, -80058, -67457, -41595, -109682, -194460, -179802, -134143, -44222, -43156, -39134, -3344, 35152, 74843]
17497G4843j5892p6131j1415m7372K8893j8854m0657O4499N3161p5873j3281L6475
17485d1604O5144N0338J8428r0067n8771L3616P0718p815k146p10O9780l6109
17473G0802J2934j8749j26636j25713M7887Q1125L219o4967n6756L3702M0643
17462a02509J0835J4185Q805K7802l2526K0964l3608m3678J8738K2180L0445M2766
17450a5601M854j6835n4481J8003M9714O8773J27017J76106J9883r4653n5435
17439B27345p0287n2591l6958j3792p5704K5040J8281m8111L2156Q083j3386k401
17427b325j4139l6583q460R4689q6617L483n0819j9366K749K0671R771Q1623L3790
17414B8467n2234N2n5109Q809O505l72q198l155j9446O2715j0383m5332j3883
$$ y = [74843, 58951, -17180, -28595, -75967, -47074, -65928, -106585, -42086, 11075, -64798, -78079, -41604, 23540, 73878, 92306, 2239, -56532, -22916, 47802, 39987, 37841, 37131, 106911, 70802, 83736, 64987, -61649, -187362, -139475, -58350, -55131, -120098, -176854, -143152, -102509, -91674, -77489, -68684, -40882, -73408, -52444, -86052, -129730, -110992, -88812, -58367, -15601, -10747, -27582, -82063, -64060, -14346, 54427, 181444, 357550, 377433, 282780, 227345, 157058, 104467, 67509, 53717, -21987, 3053, 21334, -26777, 5379, 13462, 76, -2325, -16464, -53047, -61507, 33182, -53435, -49952, -100771, -120137, -117388, -96717, -86946, -5323, 28467, -23767, -23715, -78824, -70015, -63510, -63882, -72080, -75235, -94681, -31966, -42349, -87681, -101564]
17401a01564R854m5148m044L9579L9927M8375k6497j8822P2541P792j5503Q642
17389A5132l0481O642O4967n2155k9674P796M4899j9475m7964m8121N5295R4516
17377F1377l054L229p2858p0391n1022K7616J6682Q7120M152l5941M4116n619
17365E407P0500l328k0868Q915k0758m3582n5888o6711L8906N7481m6214L5779
17353d0361M0341j072k7347l9606J9303J8447j3062m5891o0793o9659L5114M772
17341a79814O965R5495M6824o8735K4776Q6096M8448O99m1720m9383k317m1072
17329g3738J4969o8728Q7731Q5644N044j12788M063L3740L2281L2648l8515J7081
17317A9432L653n4539m0749P725o277K7422o2312o623P2874K8099k5634J6498
$$ y = [-101564, -91710, -136858, -140902, -101323, -61396, -13021, -39518, -58340, 14201, 21993, 6490, 15132, -15349, -8707, 56260, 4105, -25569, -17773, 27126, 7651, -40313, -88434, -33139, 61377, 58323, 61552, -11306, -81697, -132719, -105103, -88421, -1301, 2851, -33090, 11026, 5407, 75907, 72579, 51711, 60626, 39868, -3714, -59602, -126313, -87407, -29926, -76140, -40361, -20, -1092, -28439, -68045, -48742, -30295, -43357, -89248, -150041, -219700, -184586, -179814, -172849, -77354, -30530, -99265, -74489, 11607, 60055, 60754, 19034, -30349, -32666, -73738, -58769, -127497, -39766, 45878, 50922, -61866, -57803, -24063, 8218, 40866, 2351, 19432, 23085, -31454, -72203, -64478, -70755, -43333, -105645, -112268, -39394, -11295, -36929, -20431]
17305b0431K662K187L9174R437l2866k9947L2196o7503p3122Q0985P0149J4826
17293B7747k7250L4068o5762l0012O040j9249l0125r062l007J08775O2806r699
17281D5270p1326k6223J511P4149N6146n0769n9170o4563N709J4637K6571N8450
17269A0392N3030J3233K1602j33384p0863J7313P7752P63p4526Q908M2424R7067
17257F3711m2781m6091K775o477k1162j0983K5146J1401R5059k2265n5085n9169
17245f5921J6209K3479j8056j0903K9565l7400p960L8472n427l6470k3757O983
17233i1186M597k3191R5881J43148k2421j02121j09699o3751k3311O6472J04354
17222b1228O3492p9130m1121P2562k990p4932J000l9376J364n28N1298n0806M0981
$$ y = [-20431, -17769, -15582, 23592, 33029, 163, -29784, 2412, -65091, -138213, -57228, 12921, 27747, 497, 34565, -31197, -61209, -55169, -74418, -104543, -113605, -116612, -7837, 54969, 45270, -26056, -52279, -50768, 23381, 79527, 28758, -30412, -94975, -89266, -74629, -48058, 10392, 63422, 76655, 98257, -35127, -105990, -88677, -10925, -10162, -84688, -75780, -33356, 63711, 20930, -25161, -22386, -28863, -50025, -61008, -35862, -24461, 70598, 48333, -6752, -65921, -49712, -26233, -44289, -55192, -25627, -63027, -70987, -32515, -37942, -74412, -98169, -91186, -86589, -109780, -13899, 129249, 106828, 4707, -104992, -168743, -192054, -125582, -21228, 42264, -36866, -77987, -5425, -8415, -83347, -82347, -121723, -120359, -120887, -69589, -120395, -79414]
17209g9414k564Q812P2525K5458J1899l8655k5505K4291n3332o4733k1398R611
17197a33005M6688j6298K1011J9019n5022K9579O7341J7376J8977p636j4952J9212
17185A2290J200m2004o2007j6459L4772m9168J5782M5263N5974L6050r9419o7915
17173a35641L2348R3079K3639j3425j3883M3580l6332l3873J3271J7570J9391
17162I724J745o0292k9989k9508j7764N2467N3999Q372l916j4435M441k0721O6814
17149B0937k6218k4703j0003m1294K6645M9116J9275p0854n0639Q9633N9378K586
17137D3859m8413j8124K4367J1053M1385N8819o2321j4699N2192L892m0751q8233
17125c6974p6897l3235L7128N7870J4751J9526l026o0416N5371N3749n6266K3003
$$ y = [-79414, -81978, -73166, -641, 24817, 36716, -1939, -27444, -3153, -56485, -121218, -142616, -133005, -86317, -102615, -81604, -62585, -117607, -88028, -20687, -3311, 15666, 8030, -6922, 12290, 13490, -28514, -90521, -106980, -72208, -121376, -105594, -60331, -4357, 31693, -67726, -135641, -103293, -10214, 13425, 0, -13883, 29697, -6635, -40508, -27237, -9667, 9724, 11469, -48823, -78812, -108320, -126084, -73617, -19618, -11246, -15162, -29597, -25156, -45877, 20937, -5281, -29984, -39987, -81281, -54636, -5520, 13755, -57099, -107738, -18105, 41273, 43859, -4554, -22678, 1689, 12742, 54127, 112946, 50625, 35926, 88118, 92010, 51259, -36974, -113871, -147106, -109978, -52108, -37357, -17831, -20857, -81273, -25902, 27847, -28419, -5416]
17113e416m476k1131J6590k0348N5097q039n9612r4114m3006q279Q1311M3903
17101f7520J7938k2479k0638j0073J3751k2742j7494K2810j3771l7297P837Q4649
17089f5029J7267L2730J2982J631K3983j5258O461j195k9299n1516k0413k2273
17077a09929N2347j8723k4031N957N3958K2697l0869K2851M3393O727j8072j0503
17065d197L698M7156j1088p1687Q3337j2752m6303k2597m2982l0975J1399J2410
17053h4581N1890o1546L9493P7324j835k7202p6504m0933K7092J0651K443k1092
17041a04800p126M6908J2749O0718l4367j447n913M844K1429K5021k8383m9570
17029e9937j7031J7401P143P1990p025p6647k4790N8401J7349J0567l8189o510
$$ y = [-5416, -9892, -31023, -14433, -34781, 20316, 12277, -47335, -141449, -184455, -192734, -111423, -67520, -49582, -72061, -92699, -102772, -89021, -111763, -129257, -106447, -120218, -157515, -149678, -65029, -47762, -15032, -2050, -419, 23564, 8306, 14767, 13572, -15727, -67243, -87656, -109929, -57582, -76305, -100336, -94379, -40421, -17724, -48593, -25742, 17651, 24378, 6306, -4197, -499, 46657, 35569, -36118, 47219, 34467, -11836, -34433, -77415, -108390, -96991, -84581, -32691, -94237, -54744, 22580, 20745, -6457, -82961, -123894, -96802, -86151, -83708, -104800, -111926, -65018, -52269, 8449, -25918, -27365, -33278, -28434, -7005, 18016, -10367, -59937, -76968, -59567, -52424, 19566, 12541, -64106, -88896, -30495, -13146, -2579, -40768, -47278]
17017d7278J5867M2617L3756k5503P780m5223o0213K9782M3385Q128k7214n622
17005b9738m4518m3252m5903j6999J23085M4792K6668l1794l9093J1231N3601
16994H080N0805j0756m509l7531j080J820R710n2107N5378J8421o1005l5400L000
16981e5174O0456j3306n2746n9761j4788M1793N7176k4101L5201Q8134r794p6967
16969b3877k1281O2903Q0344R500k0117o6994k741K2982k1904r4195k6437L4913
16957f6904N4879j8358q3189o6103R428O3434M8985L8612j8906Q891R9511P4576
16945A44856M6019l1469n9899o5322q792j0789j2325m7267n9018R800K2587L2653
16933c8966L6254m5085P95j6133m5521K5406k695Q3545L8716n4743r267l9871
$$ y = [-47278, -31411, 11206, 44962, 19459, 27239, -17984, -78197, -48415, -5030, 3098, -24116, -29738, -74256, -117508, -163411, -180410, -57325, -12533, 14135, -17659, -56752, -45521, 8080, 58885, 48129, 43620, 6089, 5009, 6829, 16539, -35568, 19810, 38231, -22774, -58174, -55174, 5282, -8024, -60770, -120531, -135319, -93526, -36350, -60451, -25250, 62884, 53090, -23877, -45158, 17745, 98089, 107589, 87472, 20478, 17737, 40719, 18815, -75380, -101817, -66904, -12025, -30383, -113572, -179675, -170247, -106813, -57828, -19216, -38122, -29231, 70280, 144856, 190875, 159406, 99507, 34185, 25393, 14604, 2279, -44988, -104006, -94206, -71619, -38966, -2712, -47797, -47002, -63135, -108656, -83250, -85945, -2400, 36316, -18427, -27694, -67565]
16921f7565J525L5013J1198p2548J0730R615J5379q533J01825M9426l388o3607
16909A9070p9333K2741M9248m553L7755L863q5062q3986n2393N6048L8399j443
16897g9646K3549M596Q987l6600K5881K6120q6879P76O1607K8669M1745O1127
16885G9932l3961m7036k5127L6587L2562K3470m3219j0390M5526L4831m3719n4240
16873d784J0926M9604K2443k0004K1258M1580o3641o5579k0042j0849k5051O6552
16861B413o674j1274k5094O240K7158m713n3321M5959N5017n645N264k5935l6393
16848b6998N047N0859k230k5470l7513k9566K8950n76K9822P6532l1210j40695
16836a03048m9172P3455L5088L0051j0452N5959j2845j309n8343j872M8126K9071
$$ y = [-67565, -66040, -31027, -19829, -92377, -81647, -72032, -56653, -65186, 36639, 86065, 82677, 19070, -60263, -37522, 11726, 7173, 44928, 48791, -36271, -120257, -172650, -116602, -78203, -79646, -56097, -51501, -42514, -79114, -53233, -27113, -113992, -113216, -51609, -22940, 18805, 79932, 45971, -1065, -26192, 10395, 42957, 66427, 23208, 12818, 58344, 93175, 49456, -4784, 6142, 55746, 78189, 58185, 79443, 121023, 57382, -8197, -28239, -39088, -64139, 2413, -4261, -15535, -40629, -34389, -7231, -11944, -65265, -19306, 35711, 30066, 35330, 9395, -26998, -21951, 28908, 26678, 1208, -36305, -65871, -36921, -37497, -7675, 68857, 37647, -103048, -152220, -78765, -43677, -13626, -24078, 31881, 19036, 17727, -40616, -42488, 5638, 34709]
16824C4709r948m5441j7376K521O3924k1450m875k5682p192l496r377N534M0306
16811B157Q2119O582l6474n9240j5835R305n2783j6662J1581J2392K6137O0620
16799B9899K3273r7813N26k2649L4688J675k1369k8344p107J0522J1217n038j428
16786g1948M8800M2604N182l7266O444j284J0810k855P276n692L3502K578q1290
16773d3139n2972k0566n049Q498j7549P5277k548j2348j1166N5121K2221k6463
16761c0683M2915M6812j04225j2108K0515j7101l001j6303K9024L5530j5523J458
16749b2690O586o0521m4115k5113K5846M5629L2454l6442K3884L8012n0011j7358
16737h3839M9412J6674j7292P137n7667k2779N1839O0448O1921M3622n6150j8027
$$ y = [34709, 24761, -20680, -38056, -35535, 28389, 6939, 2064, -23618, -30810, -34306, -43683, -38149, 2157, 84276, 90858, 54384, -4856, -20691, -11386, -64169, -80831, -69250, -56858, -30721, 29899, 53172, -44641, -44115, -66764, -32076, -30401, -51770, -80114, -87221, -76699, -65482, -70520, -71948, -23148, 19456, 24638, -12628, -6184, -7468, 3342, 487, 7763, 2071, 35573, 38151, -43139, -96111, -116677, -121726, -113228, -130777, -55500, -58048, -70396, -81562, -26441, -4220, -30683, 12232, 59044, -45181, -57289, -36774, -53875, -56876, -73179, -44155, -8625, -24148, -22690, -16104, -76625, -120740, -145853, -120007, -74378, -41924, -78366, -54482, -16470, -66481, -83839, -34427, -17753, -35045, -27908, -85575, -108354, -56515, 3933, 65854, 109476, 53326, 35299]
16725C5299m6928o1887l927M4214J9981L3032q1636l2874L5854P6911N481N0333
16713G3853J01j4654M944n221l2714k2568J3613M3598L1812p095q9496k7272J4819
16700a6280K0415J7036J7828l2447P978o5230L3569j7749k906N0964M3519J2982
16688F9679l9861m5330m0720l8681K8402J2490L2560k742K600r605n3427p3573
16676a58208K0134K3239N317P4172k0871j1840N1950m5067N6696N2527q9693p7987
16664a19631L910R791O5060O3164K7479p1919q992N056K7931k7007n1568l8046
16652a14772O34O1673J9347K1028l7710m1824k9715n619k9400M3921L7506O3438
16640a1493M632J7714J8499j6413M703m6928J4802Q4735l4665j30494n5447K0664
$$ y = [35299, -11629, -73516, -77443, -33229, -13248, 19784, -61852, -94726, -58872, 18039, 23520, 73853, 73954, 59300, 64244, 59023, 26309, 3741, 17354, 60952, 92764, 85669, -3827, -31099, -16280, 4135, 21171, 38999, 6552, 14530, -50700, -17131, -34880, -37786, 13178, 56697, 69679, 29818, -15512, -56232, -94913, -66511, -54021, -21461, -24203, -21603, -31208, -84635, -158208, -138074, -114835, -109518, -35346, -56217, -68057, -16107, -61174, -4478, 48049, -41644, -119631, -115721, -105930, -40870, 22294, 49773, -22146, -31138, -26082, 1849, -25158, -76726, -114772, -114138, -52465, -33118, -12090, -49800, -91624, -121339, -126958, -156358, -112437, -74931, -11493, -6861, 10853, 29352, 12939, 17642, -29286, -14484, 70251, 35586, -94908, -150355, -129691]
16628a29691L4195O5960N555O0103J5065o6925o6272N9956N5059M8592j6473l4530
16616C0594m1185n6765k7391L4145L5136m2013n4105O6237K8675o204M5959l9538
16604b6455N868K8138Q874k5064l1826m8456M205M3005K1633J3759K2906N9738
16592G6325k7622j3307o4321O30K8834m4507Q251j5190q763N7770J1443Q511p2074
16579e4020k7240J6198k3323J8150n75N2641k3420q1348J8800N1349P5878N3452
16567G6542k8392r174m6997J2599j9295M0051K436N254M3994l6922o1659K6193
16555D630J5652m0101J3953j2407K3166L8377k9075l2761K7737J9896m423j8557
16543F087R922J1525l3226n0835K463J00394l7926r8344N1739L9357M951Q1480
$$ y = [-129691, -95496, -29536, -23981, 36122, 51187, -15738, -82010, -22054, 33005, 81597, 65124, 30594, -10591, -67356, -94747, -60602, -25466, -67479, -121584, -55347, -26672, -32876, 13083, -26455, -20587, 7551, 16425, -8639, -40465, -88921, -84716, -41711, -20078, -6319, 16587, 76325, 48703, 35396, -28925, -28295, 539, -43968, -35717, -50907, -59670, -1900, 9543, 18054, -54020, -81260, -65062, -88385, -70235, -70810, -18169, -41589, -122937, -104137, -52788, 23090, 76542, 48150, 38976, -8021, 4578, -14717, 25334, 27770, 33024, 77018, 40096, -21563, 4630, 20282, -19819, -5866, -18273, 4893, 43270, 14195, -18566, 9171, 29067, 24644, 6087, 16009, 27534, -5692, -56527, -54064, 46330, 8404, -89940, -38201, 1156, 6107, 87587]
16531H7587R382m861l2359n8022n5702l6200L7417P0835Q519q5560j5146k7062
16519a01172J2033P8894N6430j5781k9217k6836N2906m0791L0754M3073l0588
16508B9705J2540O7974Q625j6556n8063q2134J0764j9567K9357J6414K3594k9133
16496f480k7475n4517K6227N2640L7370N832L150k4387N3565n6099j6450p4151
16484h0775o4688M2594Q7413O791k8868J7041N9563L8481r577l5593O6443O3117
16472A61942J1875j04765j18045M1520O9665K6798k9131M942m4444k2477m633
16461f753L6235R153l5972n3125K9267l0553Q7195L3439J8406L1498j40901q2948
16449a05059N341q027L9572J02532J6159L1609l7341q1199m264K3322Q3556k1758
$$ y = [87587, 96969, 92108, 59749, 1727, -53975, -90175, -52758, 18077, 26596, -58964, -74110, -101172, -89139, -10245, 46185, 30404, 1187, -25649, 27257, -13534, 17220, 60293, 29705, 42245, 110219, 118844, 102288, 44225, -37909, -27145, -46712, -17355, -941, 22653, -6480, -33955, -88472, -62245, -9605, 27765, 33597, 36747, 12360, 65925, 9826, -6624, -80775, -145463, -102869, -15456, -8665, -37533, -20492, 39071, 77552, 67975, 32382, 98825, 161942, 173817, 69052, -48993, -7473, 62192, 88990, 59859, 64801, 20357, -2120, -6753, 29482, 38635, 2663, -50462, -21195, -51748, 35447, 68886, 87292, 118790, -22111, -105059, -99718, -107745, -68173, 34359, 50518, 82127, 44786, -36413, -40677, -17355, 66201, 44443]
16437D4443j00840K314J4679n818q5613M6583M8582J2506j9526n2067j3249P6242
16425c1764J5489J1038J2723P0213j708l1007m3210j15230l2182M6580R4802Q535
16413D279O5559q693m0482N0479j6J8875N8971l3448p2113J2286l1391O578L2081
16400F2965l852n9438j1480p567M345J3146K0344K4786J0696J0318J3349n8257
16388A9355l4010M3802J724L945M1733P9969l6153J574n8203n8965N576n2987
16376d2640j9669m2739m2012l1722M8933O3427M7867J6911M1681Q3762M116p9042
16364D8873O277n1450m2031p908M8665J5506j2310k1184P1318L682J2248K3491
16352I5177o4205l1540l692j2101k2774J25l2397j8024J4438M9158j0700L6223
$$ y = [44443, -56397, -54083, -39404, -45222, -130835, -84252, -35670, -23164, -42690, -94757, -108006, -31764, -16275, -5237, 7486, 77699, 75991, 44984, 1774, -113456, -145638, -99058, -4256, 4279, 69838, 61145, 20663, 71142, 71126, 90001, 148972, 115524, 43411, 55697, 24306, 30884, 62965, 59113, -325, -11805, -19372, -15027, -1881, 18463, 43249, 53945, 64263, 77612, 19355, -14655, 29147, 30871, 34816, 76549, 156518, 120365, 121939, 63736, 4771, 10347, -42640, -62309, -105048, -147060, -178782, -129849, -66422, -18555, -1644, 40037, 123799, 127915, 48873, 55150, 3700, -38331, -46239, 2426, 17932, 5622, -15562, 55756, 59438, 71686, 95177, 30972, -568, -4260, -16361, -39135, -39010, -71407, -89431, -74993, -25835, -36535, -312]
16340c12K7207j2418n613k5550M2373O790L7164Q4295m8715m3383L3887p5083
16328B0642o3296K425n4496R0169L0089K8807L3215L492K135j0606q585l4348
16316C9643l4306l3345L2394L4135k8122r006J2923K6678o6040o7814j1233M4559
16304e9534Q3323M7562o2628n6349n198R0399r585Q512K3952k6053p2579k9975
16292f8153M151J1024R979O0291P039q7303p0202J4045N6243L7578l7069L4391
16280b7986O6529j1051j6642k9915J6642O9058Q669m0728K8504K7563n5532O1725
16268I6836K0194p4747l8853N355q473r505q231P7525o3944p8553K5765K3138
16256c3493J00751j1553j7794k7896r518P226O0531l6120k1345o84o323p8717
$$ y = [-312, 26895, 14477, 8864, -16686, 25687, 32477, 69641, 153936, 105221, 61838, 95725, 20642, -42654, -40229, -94725, -4556, 25533, 54340, 87555, 91047, 93182, 82576, 73991, 39643, 5337, -28008, 4386, 38521, 10399, 1393, 14316, 40994, -25046, -92860, -104093, -59534, 23789, 71351, 8723, -47626, -52824, 37575, 27990, 36502, 60454, 34401, -38178, -68153, -64002, -52978, -42999, 17292, 24331, -62972, -133174, -119129, -62886, -25308, -62377, -27986, 38543, 27492, 10850, -19065, -2423, 66635, 75304, 34576, 63080, 90643, 35111, 96836, 117030, 42283, 3430, 8785, 312, -9193, -17424, 60101, -3843, -82396, -56631, -33493, 67258, 55705, 37911, 10015, 497, 7723, 68254, 32134, 10789, 10105, 3782, -74935]
16244g4935O0517M8205N886l6821n3444J4468O6153l284q1164m4261M4012P8245
16232B3577K4339j9245L119J6164l5108l5565N8444K7593j7981K8039P0604k2643
16220A21337q0408k2567K8013j2679q5704m7756j7112L1492J0316O5911m442J2538
16208a061k7461P107j4046N687K8416j8015M6132O0087K702q4084n936j1613K0121
16195H036m7982R145O4890M286o8964r561K9205n1723q855K5202P0546L4571o1774
16182b978o0091O837J40725J4060q1899j200K2308L5399M2783o267m4631r8718
16170c3672r16Q2210M7984m7363o1797m5610M8665p341K1538j8658q3454K9043
16158f9371K3306o57o23Q4886j034N263j9090m4861j3120J6737O7772k1418o759
$$ y = [-74935, -14418, 33787, 39673, 2852, -50592, -36124, 30029, 26745, -54419, -98680, -54668, 23577, 47916, 28671, 31790, 47954, 12846, -22719, 35725, 63318, 45337, 73376, 143980, 121337, 40929, 18362, 46375, 33696, -52008, -99764, -116876, -85384, -75068, -9157, -13599, -1061, -28522, -21415, -35461, -29774, -1358, -19373, 26759, 86846, 89548, 5464, -472, -12085, 8036, -39946, -30801, 34089, 38375, -30589, -40150, -10945, -62668, -71523, -46321, 24225, 58796, -2978, -63069, -56232, 84493, 98553, 16654, 15454, 37762, 73161, 115944, 109677, 65046, -33672, -34588, 47622, 95606, 48243, -13554, -59164, -10499, -17840, 3698, -14960, -98414, -69371, -46065, -46722, -47345, 37541, 36507, 41770, 22680, -22181, -35301, -18564, 49208, 27790, 21031]
16145B1031O0185M8328k8803r413j3066j9044l7514L33l9526l571J7287M6005
16133D2232M042L188k9207n9306n710M3709q4342m4063O1649M1544L4027M9079
16121E6842q344o8069K0415Q9945j5802n6807n8647N2385J8401l7732K7413J136
16109B1136l2901n7729k0894K0289L7722O0682L0687J9305n0710m3134J5880K4356
16097B4689k906m6209r5154o1526P0541J13874O148l312M548k6788K7395R855
16085B1155O9383j6942l896k4443m6011j819L611N42Q192j9407J563O7668m154
16072E5442k7108n0018j1654N5644O6348O2732l6713r3277l5330j9650L0864N0749
16060D8029N5548l4789o9702k3964j3740O8260k4665J5597k3798q6812j612L8392
$$ y = [21031, 81216, 129544, 100741, 91328, 78262, 59218, 21704, 22037, -17489, -21060, -3773, 42232, 46274, 49462, 20255, -39051, -44761, -1052, -85394, -129457, -67808, -26264, 7763, 56842, 48498, -19571, 844, 90789, 74987, 18180, -40467, 11918, 30319, -7413, 20000, 21136, -11765, -69494, -90388, -70099, -32377, 28305, 58992, 78297, 27587, -15547, 333, 24689, 21783, -24426, -119580, -181106, -110565, 3309, 9457, 6145, 10693, -16095, 11300, 21155, 90538, 73596, 69700, 45257, -754, -2573, 1038, 1580, 9772, -9635, -8072, 59596, 55442, 28334, -21684, -33338, 22306, 88654, 151386, 114673, 21396, -13934, -33584, -2720, 48029, 103577, 68788, -914, -24878, -38618, 29642, 4977, 20574, -3224, -90036, -91648, -53256]
16048e3256J7407p561l0285k560p486j5167L9698Q0229l095o6884n488N1236P80
16035b432l9744j1254J6763r5315M3393J24241j7815j04037p961O4701k0577K1721
16023b8316K3214J4149m4838K2127L0378N2889O252j4574L2805m6514k1423N699
16011C1848O0129m3089m2098K2490l950n1064j9846K3342o5901P541m2126j706
15999a24430M9046O3671K8443L3831j1143O381Q4222M3237o1443j4426J2717n6100
15987E4006r5992k0392P9824O7419m9353J4850K4745m9898k3635l0442P1776J14241
15975A57149l6781j06975j5870M2042N038J4053j0723m4584Q016K2M6322L8895
15963I6604j7781O535k4012r536k4532J7466M8023K6726J6060l9392k9909l2101
$$ y = [-53256, -35849, -43410, -73695, -76255, -83741, -98908, -59210, 21019, 17924, -48960, -54448, -3212, -2432, -42176, -53430, -36667, -131982, -88589, 35652, 17837, -86200, -94161, -29460, -50037, -28316, -5102, 9047, -35791, -13664, 16714, 69603, 75855, 61281, 94086, 47572, 26149, 31848, 91977, 48888, 6790, 29280, 25330, -25734, -45580, -22238, -88139, -80598, -122724, -124430, -75384, -11713, 16730, 50561, 39418, 45799, 130021, 173258, 111815, 97389, 110106, 54006, -41986, -62378, 17446, 84865, 35512, 50362, 75107, 25209, 1574, -28868, 42908, 157149, 120368, 13393, -2477, 39565, 44603, 58656, 47933, 3349, 11365, 11387, 57709, 96604, 78823, 85358, 61346, 51810, 27278, 44744, 92767, 119493, 135553, 96161, 66252, 34151]
15951C4151j7690O7174M4614m0636n3898K4088k46r811J693Q837j4061J6285n3655
15938F845k0191Q0056L1257J8433J8939k8190K7902J2360N7833m6174l5186o6184
15926E7700n4297l5542j1536M506O9975Q642l6030j05905N7687N5454l2563j9436
15914d1345M1616O6466m559n8949q9026L805Q1380R940J3712l2100m0168J1527
15902c7701L7464J3343o598R56m613k2833M7326O794o3391k1693J3651K9354J3757
15889E816m430Q342l3978p0508P583K3074L0394m869M7815K8005Q466j6711L2962
15876F1961O122J2336J4338L2013l2093m7167o0312k7837J8735O0123O202m9163
15864d742K6878M2074k4157j3480j1496Q417m6265k1290M5500O8637n485n2573
$$ y = [34151, 16461, 83635, 128249, 87613, 33715, 57803, 57557, 47746, 49439, 58276, 44215, 60500, 6845, -13346, 66710, 97967, 116400, 135339, 107149, 135051, 147411, 205244, 159070, 123884, 57700, 3403, -32139, -43675, -39169, 30806, 39448, 3418, -102487, -44800, 10654, -21909, -41345, 271, 66737, 62178, 3229, -85797, -81992, -612, 9328, 23040, -9060, -49228, -37701, -237, 13106, 6508, 7464, 2851, -19982, 27344, 34138, -29253, -50946, -37295, -7941, 5816, 1386, 9728, -24250, -94758, -87175, -64101, -33707, -38576, 9239, 37244, 45710, 28999, 61961, 68083, 80419, 94757, 126770, 94677, 47510, -12802, -40639, -21904, 38219, 44421, -4742, 22136, 64210, 40053, 26573, 15077, 23494, -22771, -44061, 1439, 70076, 64591, 12018]
15852A2018o3014K9591K6789K7366k5497j6530K4642J1146M5282p8410o2265N961
15840f2921R738L3138K975K7124K7707J0870p277j7197K7048l0141K5276J0221
15828E6561M9862k3728o3838p3299P584J22793P977m8961M99j6378l9791m9187
15816f9906Q8362K1601m5592L8609J6048n542J1449j4704j708j5988J3043p357
15804B8315K8930J7507k231l9381l5341n2942L6792M2368J4933L5602J7468O253
15792I8273o3639l7757N2737k5490n0778k6821J5817K0269J1301M1579J04040
15781A39531j673p0542j3721p50N8980L1170k3206k2211K281J7709n4827r01k3005
15768C8835j5910M4559j07230j7724P4845N0287l2224m2271p5071q1526J0968
$$ y = [12018, -50996, -21405, 5384, 32750, 7253, -9277, 15365, 26511, 71793, -6617, -68882, -62921, -53183, -20045, -17070, 10054, 37761, 48631, 41354, 24157, 51205, 21064, 46340, 56561, 106423, 82695, 18857, -54442, -46858, 75935, 83912, 34951, 35450, 19072, -20719, -69906, 18456, 40057, -5535, 33074, 49122, 43580, 55029, 40325, 38617, 22629, 35672, 28315, 57245, 74752, 72521, 33140, -2201, -55143, -18351, 24017, 38950, 74552, 92020, 98273, 34634, -3123, 49614, 24124, -26654, -53475, -37658, -17389, -6088, 35491, 139531, 137858, 67316, 53595, 52845, 111825, 142995, 119789, 97578, 99859, 117568, 62741, 61840, 38835, 22925, 67484, -39746, -57470, 17375, 67662, 35438, -6833, -81904, -163430, -152462]
15757a52462M3174P5901P1875m6518j9244Q4254L5097n6995n8395P923j3714n2395
15745h1499J8975J1089K6393N5006j8884o9011m3407O301J5862Q160Q1934k427
15733H492l0357K9353L1367k0535J01943K9816j9929q441m6199n7654m2625l8495
15721f3264K5057L0929q591K5525J1524n424N482n4219J4827J5886J3652p554
15709C830O223K0664N1306n0748m3190O1695M7088l7666p3895l7990r838P105
15697e5416K2591Q517l5923N275L6332k2423l2557M753J9616M9824K0067k6294
15685e638K0253J3791O2096J4000j6833j646r314j6284m1181J4019L0530j8201
15673D5592l6939M1325O4258P1777n2380r5932k8348n199n260m698k9088j9197
$$ y = [-152462, -109288, -33387, 38488, -8030, -27274, 56980, 92077, 35082, -23313, -15390, -29104, -81499, -62524, -51435, -25042, 29964, 11080, -57931, -101338, -95037, -79175, -71015, 10919, 8492, -21865, 7488, 38855, 18320, 120263, 150079, 130150, 121709, 75510, 17856, -24769, -63264, -38207, -7278, -15869, 9656, 21180, 15756, 21238, -32981, -18154, -2268, 11384, 3830, 10053, 30717, 82023, 31275, -11915, 49780, 96868, 59202, -14693, -52683, -62521, -55416, -32825, -24308, -60231, -54956, -18624, -41047, -73604, -68851, -49235, 589, 20656, -5638, 14615, 28406, 90502, 104502, 87669, 86023, 76709, 60425, 19244, 33263, 63793, 45592, 8653, 49978, 114236, 186013, 133633, 37701, 9353, 4154, -1106, -5804, -34892, -54089]
15661e4089O9751O2706l8051j87m3403j9875J0763k3550k6937K66M7268P1139
15649E5801L4726m4592o8741j3367K2093J4972M906L7012l5492j00611m6236P5791
15637f3738J02642K2853O751J9112L3997n7221J027k2981K338L3371j4973o5331
15625b153K152q2109p2808J6240M6266Q5856K3631L4833J6778L9667n2590o8384
15613a2621n0651L357l4417K6083O1961O408l6534Q033K976N3497Q4827j4849
15601I8070J4440n5705p5358m0845P949M6298N7876o0912j4051Q5108m6238n241
15589A1391M9322J4753q304N4608n6581j0078l2488N7805O9254j15646k3776n170
15577E090j6709j2830m5402M1569M8082J4319j887K0687P2498L9716p1310o7572
$$ y = [-54089, 15662, 78368, 40317, 40130, -3273, -23148, -12385, -35935, -62872, -62606, -15338, 55801, 90527, 45935, -22806, -36173, -14080, 892, 5798, 42810, 7318, -93293, -139529, -63738, 38904, 61757, 68508, 87620, 121617, 64396, 65423, 42442, 44780, 78151, 63178, -2153, -1, -82110, -154918, -138678, -92412, -6556, 17075, 51908, 68686, 108353, 55763, -12621, -63272, -59915, -94332, -68249, -6288, 120, -36414, -28381, -25405, 28092, 112919, 98070, 112510, 56805, -18553, -59398, -51449, -5151, 52725, -8187, -22238, 62870, 16632, 11391, 60713, 75466, 67162, 121770, 65189, 55111, 22623, 80428, 149682, 34036, 10260, 5090, -11619, -24449, -69851, -28282, 19800, 34119, 32232, 52919, 125417, 165133, 93823, 26251]
15565B6251M0655K4588j598l6283n2213p108L4908l4638k9391Q4467j1267q240
15553C0131l8411N7943R1171J2274J8441p3404J0073j903K7691j1215L8635q231
15541A53195m4680M751j6294K4429L688k8817O7418o6849j26895k2378R224L6666
15529f542K2810J6458O8379K235m4962q1196j37m0968j4876J7133P4150J8869
15517C1353k9297l7239j7764O3556J32458O9344L847m9155n2537N3509K1253k5544
15505A63784j9330r4272l4292M4148P0442r969o8060L5441O8836p781Q164j9280
15493A37831J7947N1312p3231L4175k047o9405q585k6099k3451o4957P5913L5785
15481H5188n7182k2396N1413m7315L196M2992l4051R5831K5192n7219j3529R618
$$ y = [26251, 66906, 91494, 89896, 53613, 1400, -5708, 29200, -5438, -34829, 49638, 38371, 30131, -8280, 49663, 140834, 153108, 171549, 98145, 108218, 106315, 134006, 122791, 161426, 153195, 108515, 113266, 96972, 121401, 125089, 96272, 163690, 96841, -30054, -52432, -43208, -6542, 16268, 32726, 101105, 103340, 58378, -22818, -22955, -63923, -78799, -61666, 12484, 31353, 2056, -35183, -52947, 10609, 143067, 212411, 216258, 167103, 114566, 168075, 189328, 163784, 144454, 50182, 15890, 60038, 130480, 120511, 52451, 87892, 156728, 148947, 157111, 137831, 155778, 207090, 133859, 168034, 165987, 96582, 87997, 61898, 38447, -26510, 49403, 85188, 28006, 5610, 57023, 9708, 12904, 55896, 21845, 117676, 142868, 85649, 72120, 81738]
15469H1738m0119j4251J0442l0156L1329M8157o5672o048N9796L4401K7526m3024
15457I4119q0205L2038N2029J6246J0186L4483l4748m7286n2912r579J7427O4134
15445I5932N4581l7708m2972j7358K9065M6168P3992o0745o9626N4951M0721m4767
15433A22234o0829P079M8424r1580l1737O3169l3608l8932p397Q9366O2954R811
15421A38954l2492p5196L7951k8475M1280K9205n1995J6522k0531j8738J8992
15410E5477r331l184l097l0258p5794k1354L6977R404K3547J9732j1806M5041
15398C5354K8499R577P0348k3931m2663m7621j301N5485K7139J4270K6884L1004
15386A83044j9139o1124o3732l6868L4598M0289K271O791L3130l2104L9698J00573
$$ y = [81738, 41619, 27368, 37810, 7654, 38983, 87140, 21468, 15420, 75216, 109617, 137143, 94119, 13914, 45952, 97981, 114227, 124413, 158896, 124148, 76862, 23950, 14371, 31798, 95932, 150513, 112805, 69833, 52475, 81540, 127708, 201700, 140955, 71329, 126280, 167001, 122234, 61405, 68484, 116908, 25328, -6409, 56760, 23152, -15780, -23177, 66189, 129143, 138954, 106462, 31266, 69217, 40742, 82022, 111227, 59232, 75754, 55223, 36485, 55477, 46146, 42962, 39865, 9607, -66187, -87541, -50564, -41160, -17613, 2119, -9687, 35354, 63853, 73430, 143778, 119847, 77184, 29563, 28262, 83747, 110886, 125156, 152040, 183044, 163905, 102781, 39049, 2181, 36779, 77068, 79339, 86130, 119260, 87156, 126854, 227427]
15374B27427J8280q6419n3199l4628J319K8429L2719N8243Q223m8910l1832n7260
15362F2392m3435Q137m6157J7973R727m943J1627K3025j8603Q700j3160M377j5748
15349C912J3526L2250J1985n3287m6865J6923j8750N434P029l1287M5239L4327
15337B0436j0478O2565p2610j8039Q5656J7106k9887K7069r284j3926N573K4458
15325H8639j0135q377O1278Q87Q757N456k484j8063q5643N1652K4623J4293L9720
15312A70603M8787k608k5144p588N7124k5197q1158j3165j7882m6827Q615j584
15300F3976p081K2102j0267l5791J1026q296k1551o6083j8305K5662J5322L1217
15288A931J1996l8166k7271M4483O9720J0514k3415Q8354j3291r379P6221J30452
$$ y = [227427, 245707, 159288, 106089, 71461, 72780, 101209, 133928, 192171, 200394, 151484, 119652, 62392, 18957, 27094, -19063, -1090, 8637, 3694, 15321, 38346, 19743, 28443, 15283, 19660, 3912, 17438, 49688, 61673, 8386, -38479, -21556, -40306, -34872, -27843, -59130, -13891, 20436, 9958, 72523, -87, -18126, 67530, 84636, 54749, 81818, 72534, 58608, 64181, 88639, 78504, 70127, 131405, 132292, 141049, 146505, 144021, 125958, 40315, 91967, 116590, 130883, 170603, 219390, 216782, 191638, 184050, 241174, 215977, 134819, 121654, 103772, 56945, 65560, 63976, 56895, 78997, 68730, 32939, 43965, 35669, 14118, -51965, -70270, -44608, -29286, 1931, 13927, -24239, -51510, -7027, 62693, 73207, 49792, 138146, 124855, 115476, 191697, 322149]
15276C22149p0482j38417l9453J3340r653q4552K5919L8902K9994M6882N9972
15265A94601l2849o981M7527n012r7867k2549O622J0932K8133M8250k5005l8577
15253A07225J2060L032r895P560J6856j2817l4159J6926N9999j226J228O824J8650
15240A92263m879o4918p6164L1918P0376L3216M6978m2380l6116j04700K4014
15229F9608Q4728N7728l734r312o372K1915j4379J0914J13711J05382Q7682J30447
15217F48318K18255K97650K60508L50976M00351K88097K53770J17734l3316j28487
15207B673856k83501l82474l46600k12230k53885k25770j22713r1061p2256q8152
15197E95214q1481r5417j5218N2578q848k4283q158m7473m3363q1644p5128N3470
$$ y = [322149, 251667, 113250, 73797, 87137, 77484, -7068, 18851, 57753, 87747, 134629, 194601, 161752, 154771, 202298, 197286, 99419, 76870, 83492, 94424, 122557, 170807, 145802, 107225, 119285, 122317, 112422, 119982, 136838, 124021, 89862, 106788, 166787, 165561, 166789, 173613, 192263, 187384, 122466, 46302, 78220, 148596, 181812, 228790, 186410, 150294, 45594, 69608, 154336, 212064, 208330, 199018, 192646, 214561, 200182, 211096, 324807, 430189, 517871, 648318, 866573, 1164223, 1424731, 1775707, 2176058, 2464155, 2717925, 2835659, 2802343, 2673856, 2390355, 2007881, 1661281, 1449051, 1195166, 969396, 846683, 755622, 683366, 595214, 513733, 418316, 403098, 455676, 446828, 422545, 414387, 366914, 323551, 241907, 166779, 220249]
15185B20249P0407K2578l974n5364N2098l9999p8683m8168q732M6678L5513K0556
15173B33159m9501l0340l508O1931n960K487O3918j4672r2103N4304m999k2374
15161A92342r840K4216n050L306k390l6300k6345k1423l399o0056M0609P4284
15149A69954J6258j040K8806p007N7293L0747L8941M857m2884K2679l1932K3467
15137C10139p6541o0739K0275M0864M3437k0614m0832q5828n10M4200P577j187
15125A80241k6410r7380j795M2208R5574K7620M1589J241M0274Q2118o6834r8557
15113B19889j8149O8106L03l9002k0928P9522M5732L334M1098O912L7628J00825
15101E25270M4624O3583N4765L5539J09781Q2107q766n1387j30419j23727p2972
$$ y = [220249, 290656, 313234, 309260, 253896, 305994, 265995, 187312, 139144, 130412, 177090, 212603, 233159, 183658, 153318, 149810, 211741, 205781, 208268, 272186, 257514, 165411, 219715, 214716, 192342, 182502, 206718, 201668, 204974, 202584, 166284, 139939, 118516, 115117, 55061, 95670, 169954, 186212, 185172, 213978, 206971, 264264, 295011, 333952, 338809, 295925, 318604, 286672, 310139, 233598, 172859, 193134, 233998, 277435, 256821, 215989, 130161, 129651, 173851, 181428, 180241, 153831, 56451, 54656, 96864, 192438, 220058, 261647, 262888, 303162, 385280, 318446, 219889, 201740, 269846, 270149, 231147, 210219, 289741, 335473, 338807, 379905, 386817, 424445, 525270, 569894, 633477, 688242, 723781, 833562, 915669, 906903, 855516, 725097, 601370, 528398]
15090E28398J538m7448r6750m8361q790q3825P5712K0308o07O9920J4015o1194
15078C62916K805q507p5088l8846K503m0991N6792M8730l5138o0655k2902Q2484
15066B74103l9450j12654m1391o1160n265L2412l7958O5466M7836K0833Q9315
15055B32087L890o1320k7976K6975M6218J5362J0479m3292L0569J4277R2318N5506
15043C95093O044k5795j6429O0401J37105N6325J2830K2795R6431J81811K63806
15032A190417N23568O23246P09695Q23014P34409N78415L81304P0795k73320n55941
15022D805602o94512o29398n90231m78756l53952k17341j33366j10233r6207m9817
15012A451789n7329K0942r2084j09641m6164k5202l8928j42J54109J13101J60210
$$ y = [528398, 529936, 482488, 385738, 337377, 328587, 244762, 320474, 340782, 340175, 410095, 424110, 362916, 365721, 357214, 282126, 243280, 245783, 204792, 261584, 310314, 275176, 214521, 191619, 274103, 234653, 121999, 80608, 19448, 14183, 46595, 8637, 74103, 121939, 142772, 232087, 235977, 174657, 146681, 173656, 219874, 235236, 245715, 202423, 232992, 247269, 339587, 395093, 401137, 375342, 358913, 419314, 556419, 612744, 625574, 648369, 744800, 926611, 1190417, 1713985, 2337231, 3046926, 3869940, 4604349, 5182764, 5564068, 5634863, 5361543, 4805602, 4111090, 3481692, 2891461, 2412705, 2058753, 1841412, 1708046, 1597813, 1501606, 1451789, 1394460, 1415402, 1323318, 1213677, 1167513, 1142311, 1103383, 1103241, 1257350, 1370451, 1530661]
15001A530661J89864J53791J47724L7697J0527K6818R560n8313k00342k13474
14991A634513k65876j74383j03002m0145p4208p3261k2758o5645j25537j18529
14981E71169K7748N3831k7213l6599J3624J1113m069m000p616o9375j03169K4190
14969D49634J8949L8136L658l0168p5294m0019J6761Q0044l3147o0791P8205J01448
14957E47416l7956K208j2384L6806M4033J11246o2741p5368m0572j7828M7676
14946E42536L0481k76p419k3655M7738n1068n9705M5593N3598J2358L3175l5679
14934E87677r3073q4575m4173L9827P8677j3371m0349o1838m6095K7100J7352
14923C67159J0329J305m5860J7465M6767K67n3003o9119q9791m3853J9187M4556
$$ y = [1530661, 1720525, 1874316, 2022040, 2059737, 2070264, 2097082, 2106642, 2048329, 1847987, 1634513, 1368637, 1194254, 1091252, 1051107, 976899, 903638, 880880, 815235, 689698, 571169, 598917, 652748, 625535, 588936, 602560, 613673, 609604, 605604, 597988, 528613, 425444, 449634, 468583, 506719, 510377, 480209, 404915, 364896, 381657, 461701, 428554, 367763, 445968, 547416, 509460, 511668, 499284, 536090, 580123, 691369, 628628, 553260, 512688, 494860, 542536, 573017, 572741, 565322, 541667, 589405, 538337, 478632, 524225, 577823, 590181, 623356, 587677, 494604, 410029, 365856, 405683, 484360, 470989, 430640, 368802, 322707, 349807, 367159, 377488, 378793, 332933, 350398, 397165, 397432, 344429, 275310, 185519, 141666, 160853, 205409]
14911B05409l3372K5623L3896K6749L0349P7962J2153k1214l2207k7153j196L6656
14899C33655P8349J1587l6248k1528j7562O7969J4766k9054j3402p0842j1039
14888C06651R7780J27449J13189J09154N233L4428J4093o4300q7964J6858M2024
14877G14595N2996l3286n3879L4126L4703K4033J0577n9861P1131l5456p3393
14866F86286P779L998N2148N8103K0886J8934L5748L5567P2337M3806O7655P276
14854A110523L8180m13L1725M1933O4753Q448m5013p6190J0961K3183k0355o5555
14842A122180l1081M8763J2471j2009O3348Q8421M3613L9550J8646k9410P800
14831A372292R7044J09693M6321l1098k2456q625P1461P1745j6988m9242L5360
$$ y = [205409, 172037, 197660, 231556, 258305, 288654, 366616, 378769, 357555, 325348, 298195, 296999, 333655, 412004, 423591, 387343, 365815, 348253, 416222, 430988, 401934, 388532, 317690, 306651, 404431, 531880, 645069, 754223, 759456, 793884, 807977, 743677, 655713, 672571, 714595, 767591, 734305, 680426, 714552, 749255, 773288, 783865, 724004, 795135, 759679, 686286, 694065, 698063, 750211, 808314, 829200, 848134, 883882, 919449, 991786, 1035592, 1103247, 1110523, 1148703, 1148290, 1180015, 1221948, 1286701, 1295149, 1250136, 1173946, 1184907, 1208090, 1187735, 1122180, 1091099, 1139862, 1152333, 1140324, 1203672, 1292093, 1335706, 1375256, 1393902, 1364492, 1372292, 1469336, 1579029, 1625350, 1594252, 1571796, 1563171, 1634632, 1706377, 1689389, 1640147, 1675507]
14820A675507R1433L5593L8820l3672J7659P5224M2923J0845J7984K4026P9433
14809B075775O5903M8468K0357Q0975J22847J79764J88719J78140J35007K00157
14799C296112J86907J57721K30620J71446J30253J89128K39038L47768M31654
14790E380647M40326N12191N88921O69759Q77367J197834J520994J801575K183569
14781A5173183K513623K903641L113797L307089L472486L990150N128605P165748
14773D6768322J0791566J7221775K7334455M0025744N3140059O6410146P5657411
14766C37349478P4142655O4132542M5406881J3704561j7689131m1314393o0197745
14759D15534848o5877871o1190661n3377637m3199358l2400864k3294309j6289333
$$ y = [1675507, 1766940, 1802533, 1841353, 1807681, 1825340, 1900564, 1943487, 1954332, 1972316, 1996342, 2075775, 2141678, 2190146, 2210503, 2291478, 2414325, 2594089, 2782808, 2960948, 3095955, 3296112, 3483019, 3640740, 3871360, 4042806, 4173059, 4362187, 4601225, 4948993, 5380647, 5820973, 6333164, 6922085, 7591844, 8469211, 9667045, 11188039, 12989614, 15173183, 17686806, 20590447, 23704244, 27011333, 30483819, 34473969, 39602574, 46768322, 57559888, 74781663, 102116118, 142141862, 195281921, 261692067, 337349478, 411492133, 475624675, 521031556, 534736117, 517046986, 475732593, 415534848, 349656977, 288466316, 235088679, 191889321, 159488457, 136194148, 119904815]
14752A19904815j1581744q664387p055464o154660n520031n164979m933171m616206
14744F6214173m257755l818332l389199k983667k535994k176887j989096j772863
14736D3290380j663660j472183j456041j492671j428556j368008j279347j267509
14728C1862405j172786j143649j068541r81721r64665q43980p54053o93463o26872
14719B3612675o34296o41004n69845n81665n76983n56706n39113n32642n51050
14710A8429371n45733m37151m47958m42105m46921m09822m43297m42626l50715
14701A4463043m34986m47105l39372m13704l79290l26283l20769k96363k48778
14692A1256393k59050k99061k37112k31048k83487k82679k00184j41635j55613
$$ y = [119904815, 108323071, 99658684, 92603220, 86448560, 80928529, 75763550, 70830379, 66214173, 61956418, 58138086, 54748887, 51765220, 49229226, 47052339, 45063243, 43290380, 41626720, 40154537, 38698496, 37205825, 35777269, 34409261, 33129914, 31862405, 30689619, 29545970, 28477429, 27495708, 26531043, 25687063, 24933010, 24239547, 23612675, 22978379, 22337375, 21767530, 21185865, 20608882, 20052176, 19513063, 18980421, 18429371, 17883638, 17446487, 16998529, 16556424, 16109503, 15699681, 15256384, 14813758, 14463043, 14028057, 13580952, 13241580, 12827876, 12448586, 12122303, 11801534, 11505171, 11256393, 10997343, 10698282, 10461170, 10230122, 9946635, 9663956, 9463772, 9322137, 9166524]
14683I166524j67015j57346j36963k10020j09755k5560n6609j05631k58833k58963
14673G679829j56955j84048k04410j59210o1648j22393j81390k15728k63425k19201
14663E911421k03239j86603j23441j25963k17075k58716j54644j49381j14070
14654D378289j38471j60634j42856j9792j25289j37625p7231j06199j00238r4396
14644C275558j16990j45101p2547j8453Q8L8362J31187O8881M2216j9628k5212
14633C158361l8054j06157o3785j01882j44485j15135n4982n9238l7675k7540
14623B409428j04450k2670P8865p8208j59797n2911j7667q9250Q180l8642j18566
14612A814312j59826r6516p3322n0621o3170q1044j14281k8355j0279K9792j1197
$$ y = [9166524, 8999509, 8842163, 8705200, 8495180, 8385425, 8359865, 8303256, 8197625, 7938792, 7679829, 7522874, 7338826, 7134416, 6975206, 6913558, 6791165, 6609775, 6394047, 6130622, 5911421, 5708182, 5521579, 5398138, 5272175, 5055100, 4796384, 4641740, 4492359, 4378289, 4239818, 4079184, 3936328, 3916536, 3791247, 3653622, 3576391, 3470192, 3369954, 3275558, 3158568, 3013467, 2940920, 2922467, 2922555, 2960917, 3092104, 3160985, 3203201, 3183573, 3158361, 3120307, 3014150, 2950365, 2848483, 2703998, 2588863, 2533881, 2474643, 2436968, 2409428, 2304978, 2282308, 2361173, 2282965, 2123168, 2070257, 2052590, 1963340, 1971520, 1932878, 1814312, 1654486, 1557970, 1484648, 1434027, 1370857, 1289813, 1175532, 1147177, 1136898, 1166690, 1155493]
14601A155493n0520n9175O5203J05866M0512l5864O1309O222p6035l0792j35411
14590A046808j61480l8374j02709j58270J8171j2143k5313r8108j51627N084p035
14579C15004j3978k476K0158L0330K9261M4797M0299M9124L0196L2738J1256n2326
14567E34383m0223L1877O0438O680m7547l8537m3841k4707m5993l8628L1353Q4960
14555D70215L8873L0372l647m7860n1677o899m8082m0037o3674q777M2244L2944
14543C43995l5369k0006m7495l2212j7386l550L0674N3524M6756M3373L3404J0168
14531D05876l0750n593m453m3310o5201J0640j3556N5956J1889k9699J0457N9848
14519C62104n3732r6211J0859P9409J7967n2223J4427O6919M7472m7231k4663
$$ y = [1155493, 1104973, 1045798, 1111001, 1216867, 1257379, 1221515, 1282824, 1289046, 1213011, 1182219, 1046808, 885328, 846954, 744245, 585975, 604146, 592003, 566690, 468582, 316955, 322039, 315004, 301026, 298550, 318708, 349038, 378299, 423096, 463395, 512519, 542715, 575453, 586709, 534383, 494160, 526037, 586475, 593155, 545608, 507071, 463230, 438523, 392530, 353902, 385255, 470215, 509088, 539460, 535813, 487953, 436276, 429377, 381295, 341258, 277584, 268807, 311051, 343995, 308626, 288620, 241125, 208913, 191527, 187977, 218651, 272175, 318931, 362304, 395708, 405876, 375126, 369533, 365080, 321770, 256569, 267209, 253653, 309609, 321498, 291799, 302256, 362104, 308372, 212161, 223020, 302429, 320396, 268173, 282600, 349519, 396991, 349760, 325097]
14508C25097j0710L543j7397P1083n67k2852k9715k5216L1596N6076J1805M9626
14496D42369p0048l6022R424M7027k9912m1545M2972L5799j6654p3794l085k3457
14484B83074K31j1179k9780l1298N9980k0054M769m3840j3247p4078r5303p9593
14472e0318O3733M0606Q6339Q170N7566J2792j3082K5547m0813m9686n0330l7946
14460E2578N9402N7223N9582J3178O747j5876K3349P6392L0543N5475R0112J87972
14448F96677K40639J78593R0620p7011m1224k0355o8315j06850j42043j00794
14438F49937o5707j35818j30512p7073O682j91M2915j5301k5234M7836R03o4681
14426B33756n6836k0758n5296n0712K6439R345p7657l1811M9364L7976k452k8563
$$ y = [325097, 314387, 317930, 300533, 371616, 371049, 348197, 318482, 293266, 324862, 380938, 392743, 442369, 372321, 336299, 345723, 392750, 362838, 321293, 364265, 400064, 383410, 309616, 306531, 283074, 283305, 272126, 242346, 211048, 271028, 250974, 255743, 211903, 198656, 124578, 29275, -50318, 13415, 54021, 140360, 148530, 206096, 218888, 205806, 231353, 190540, 140854, 90524, 52578, 111980, 169203, 228785, 241963, 248710, 232834, 256183, 332575, 363118, 418593, 508705, 696677, 937316, 1115909, 1206529, 1129518, 1088294, 1067939, 999624, 892774, 750731, 649937, 584230, 448412, 317900, 240827, 247509, 247318, 290233, 274932, 249698, 297534, 298437, 233756, 176920, 156162, 100866, 50154, 76593, 85938, 8281, -23530, 25834, 63810, 61358, 32795]
14414C2795K8744O0516L2800k9829j20525l9274l1595J338O0382O5143J7853N0401
14402A28749J7753q711k1825P378n5223l3382K092N6722K3322K7311j9002O745
14390A31929l8530k8189k2797j1527K353J5747P1351P79m0531r640J2886M0751
14378A24582j1185n9542K7383N4712j6503o1859J5871L6099L798k6566m900n382
14366G6508P74n3363j5645j576L8872Q5439r217n9375R92k9462K1028K0059N3104
14353A28138P0959n2419k2324o5929K2351K6101N8270k3659K0455k4068M816j6355
14341A26336m0671n600n787m040l1980J2095L5778K8564l3965r846l922l9159
14329B7803Q220J09524R7941J1100n9179n8954Q8353O6158j4688L6851J36244
$$ y = [32795, 61539, 122055, 154855, 125026, 4501, -34773, -66368, -65030, -4648, 60495, 78348, 128749, 146502, 137791, 115966, 123344, 68121, 34739, 36831, 93553, 116875, 144186, 125184, 131929, 93399, 65210, 42413, 30886, 33239, 48986, 120337, 121116, 80585, 70945, 83831, 124582, 113397, 53855, 81238, 135950, 119447, 57588, 73459, 109558, 113356, 86790, 81890, 76508, 77282, 23919, 8274, 6698, 45570, 131009, 121792, 62417, 63409, 33947, 54975, 75034, 128138, 199097, 146678, 124354, 58425, 80776, 106877, 165147, 141488, 161943, 137875, 142691, 126336, 85665, 80065, 74278, 70238, 38258, 50353, 86131, 114695, 80730, 70884, 66962, 27803, 36023, 145547, 243488, 254588, 195409, 136455, 224808, 290966, 276278, 313129, 449373]
14318D49373J69461J78312K11587K17290K77914L83722M08217L00720J92894j3859
14308B775631j28004k12969k64778k81959l62359l00791k06447j62782p8861m4645
14298G32036o2456n2875n5924o4442j12906m4163j8922j1433P581K1442O586l489
14286C41035J991o5533n3728m4159k4469j3231K7739K0040J8459l2820m2200l2184
14274A00940K8965K2835M026j8034j8046L0491J5692K6613m8861K0055k4148m9385
14262I1143o7352J5758K4315K6676l9417k3097M87o4497J7734O4551K9768p6450
14250c81j8980j234J9226l4178l6899R096L4460M4599Q6297N8311N012r4747m8715
14237B1867O8008Q7383k3317q6003q5981q7738j1431O5296J32004K9169n8863
$$ y = [449373, 618834, 797146, 1008733, 1226023, 1503937, 1887659, 2295876, 2596596, 2789490, 2775631, 2647627, 2434658, 2169880, 1887921, 1525562, 1224771, 1018324, 855542, 776681, 732036, 669580, 616705, 560781, 496339, 383433, 339270, 320348, 308915, 316496, 337938, 344524, 341035, 343026, 277493, 223765, 179606, 155137, 141906, 169645, 189685, 208144, 175324, 133124, 100940, 129905, 152740, 156766, 138732, 120686, 151177, 166869, 193482, 144621, 164676, 140528, 91143, 23791, 39549, 63864, 90540, 51123, 28026, 28513, -35984, -18250, 46301, 76069, -381, -19361, -20595, -1369, -35547, -72446, -63350, -28890, 15709, 102006, 160317, 165329, 70582, 21867, 89875, 177258, 153941, 67938, -18043, -105781, -117212, -51916, 80088, 109257, 50394]
14226E0394l8147J4237n523r165p2075l339l3178J6O2185L9179K7640J6690o704
14213D2210l3848m4497q747N1730O0858K0125K7593L3839L876j1114j8360n3144
14201G0521j7953k8184K7802j4580j9577p8714k6972o981J514K7422j1635K3201
14189e4136k8520l4703O7805J5599k0628k0872k0690J6524K6442j1147N2189Q1988
14177F9851k5995k3897J5602K0496l0403o2457L2145N8572l0388l3851q457K7296
14165H514M703n1616l1302m589J00672j1032L411L3551K6325n9115O580K1954
14153D8056Q866L9007j0019N044m5728p9939p3739M5799m2576L0818P8415N9389
14141F3393J0257k1565O2449O9354P008n5554o9690M3959L6739J1612j3102j5840
$$ y = [50394, 12247, 26484, 20961, 11796, -60279, -63618, -96796, -96780, -34595, 4584, 32224, 48914, 42210, 8362, -36135, -44882, 6848, 67706, 87831, 115424, 149263, 153139, 142025, 123665, 70521, 52568, 24384, 52186, 37606, 18029, -60685, -87657, -94638, -93124, -65702, -77337, -54136, -82656, -117359, -49554, -33955, -54583, -75455, -96145, -79621, -53179, -64326, -12137, 69851, 43856, 19959, 35561, 56057, 25654, -36803, -4658, 53914, 23526, -10325, -18782, 8514, 13217, -38399, -69701, -74290, 26382, 15350, 18761, 52312, 78637, 19522, 26102, 48056, 56922, 95929, 85910, 90954, 45226, -34713, -108452, -62653, -105229, -74411, 4004, 63393, 73650, 52085, 114534, 183888, 190896, 135342, 65652, 109611, 146350, 157962, 144860, 129020]
14129A29020m582J0684O808q9927j00261j9172N495k2616J4057Q3943L6813l9302
14117A0960l159M1163L6434L0893k2421n0139m0774M664q016j8050j6423k7028
14105f1896M7954P0343j0826n2004p0791J8745N7253P0704P57l941L1322o4181
14093C3439n7799j6213N8811J4014m0301n4478P6845l341j9101o2443n1981J0572
14081a11976N3718M3931o3679r7757M8439R8491M3882m8100k6428q060n702N2066
14069b1175j7031l2711k4306N6635K8230M7842P5701j1119l0962m5689P70j7674
14057H511q3795j4343p6966K6794N5225Q6001k2984m7158k9837P0407O8694J8205
14045E8754m3831l7875O1601L4650o8527K6351j2614J2082L4616o4938o3433l0111
$$ y = [129020, 124438, 135122, 141930, 52003, -48258, -67430, -61935, -84551, -70494, 13449, 50262, 10960, 7801, 48964, 85398, 116291, 93870, 43731, 2957, 7621, -395, -18445, -34868, -61896, -13942, 56401, 45575, -6429, -77220, -58475, -1222, 69482, 70239, 66298, 97620, 33439, -24360, -40573, 18238, 32252, -8049, -62527, 14318, 10977, -8124, -70567, -122548, -111976, -58258, -14327, -78006, -175763, -127324, -28833, 15049, -33051, -59479, -67539, -73241, -21175, -38206, -70917, -95223, -38588, -10358, 37484, 113185, 102066, 71104, 25415, 26185, 8511, -75284, -89627, -166593, -139799, -84574, 1427, -21557, -68715, -98552, -28145, 40549, 58754, 14923, -22952, 38649, 73299, 4772, 31123, 18509, 30591, 65207, 269, -63164, -93275]
14033i3275k0498K1310K5321l6241N7617K5385J5442K4689j9828Q1932j6808o6277
14021a231j01154M312L4524P1476O9388L3060r458j33674r183Q4855K7382M7k3231
14008D7113J7663l773N266K485Q108K192o1421n3999n1510k3506J03659l1512
13996c9235l3368m1412k2788L1600n615O5377N1904k4771Q9115L9159q524p2355
13984B9087p9094q5111L1697R8869K2051k6113K7939j05233p7611O9910J18552
13973B4943J4007L382j3894o8494J6606j03J1622N703K5547l7701l1824P7051
13961B6845K3335n2843p0810p6309J8506M1860O6120j461M623J1412m6009J21724
13949F6993j31K1864j3558p946l3797p4871m7016J5766K8119p599N9557K3438
$$ y = [-93275, -113773, -92463, -67142, -103383, -45766, -20381, -4939, 19750, -78, 81854, 65046, -1231, -102385, -98073, -63549, 7927, 77315, 110375, 100917, -32757, -41940, 42915, 70297, 70344, 47113, 64776, 61003, 66269, 68754, 76862, 79054, 17633, -36366, -87876, -111382, -7723, -39235, -72603, -114015, -136803, -105203, -110818, -45441, 6463, -18308, 70807, 109966, 101442, 29087, -50007, -135118, -103421, -4552, 17499, -8614, 19325, -85908, -163519, -93609, 24943, 38950, 42332, 28438, -40056, -23450, -23553, -11931, -6228, 19319, -18382, -50206, 26845, 50180, -2663, -73473, -149782, -131276, -89416, -23296, -24757, -20134, -8722, -54731, 66993, 66862, 88726, 75168, 67222, 33425, -41446, -88462, -72696, -44577, -52176, 7381, 30819]
13937C0819j168m6076k2591n9811n110L7397N2580r827l2595J2877M8388K6891
13925C1774J3530P5523k3531l7016J6316m5323j9400L1183O0684j7131J4849j10845
13913i387o4165P27Q261L2331K5514k7791M3107J8753m8162k0973L5252J9838
13901A3305o1759n3383N3480J931l4995M7035K5007k0885j3776M746l3797M9704
13889b3387J2221K4395p718M530O399K8162J137j9098j4027M8713l3778L2318
13877E9867P897o5272J0931L2031M7368l5156Q18K0405O183m3163j3645k5104
13865C160k6856n1444M0324M9655M6897P744L8027j3070K4219J5074l4464r6114
13853C152r9165o7732L4784N5007Q936L1672p529j3276k7624m6339N6760K6554
$$ y = [30819, 29651, -16425, -39016, -98827, -103937, -66540, -13960, -23787, -56382, -43505, 4883, 31774, 45304, 120827, 97296, 60280, 76596, 31273, 11873, 43056, 103740, 86609, 101458, -9387, -73552, -72825, -64564, -32233, -6719, -34510, 8597, 27350, -20812, -41785, -6533, 13305, -48454, -101837, -48357, -46426, -81421, -34386, -9379, -30264, -44040, -39294, -73091, -23387, -11166, 13229, 5511, 10041, 16440, 44602, 45739, 26641, 12614, 61327, 27549, 59867, 67764, 2492, 13423, 45454, 92822, 57666, 58484, 78889, 85072, 41909, 28264, 3160, -23696, -75140, -34816, 14839, 61736, 69480, 107507, 94437, 118656, 133730, 99266, 3152, -96013, -163745, -128961, -73954, -65018, -33346, -40875, -54151, -81775, -128114, -71354, -44800]
13841d4800O5142L7109m5028K1042J5211L3113N9236r015p4805j323l2106j9354
13829D422K2806l8315j9652M1704M0742m8146k6724K690J3021k2106j21Q9411
13817E9732j4699k3085P8565j3918o3406R973P9504L0557o4206j4435l0392n7232
13805b3042j2285n499J2260l0430n63J7636j0588j7286M573M9505J759l5920m84
13792e0364K8157p955k4775J5127J2977N0239l8936R460l2496r040L4143N1956
13780C8493n5410k4051J7770M9708K0161r043r230J1036k9738m1275j643J7680
13768a5542j0408k782K8486p796N0939m4975l4862J3736O5796p156j9095l447
13756A2894N4064n1259o6722K5619O749k4416j2636m952M0113K5704l6156M9811
$$ y = [-44800, 20342, 57451, 12423, 33465, 48676, 81789, 141025, 132010, 57205, 55882, 23776, 4422, 27228, -11087, -30739, 10965, 51707, 3561, -23163, -20473, -7452, -29558, -29679, 59732, 45033, 21948, 100513, 86595, 23189, 33162, 112666, 143223, 79017, 64582, 34190, -23042, -35327, -40826, -28566, -58996, -59559, -41923, -52511, -69797, -65224, -15719, -13960, -49880, -50364, -22207, -30162, -54937, -39810, -26833, 23406, -15530, -6070, -38566, -47606, -13463, 38493, -16917, -40968, -23198, 26510, 46671, 37628, 28398, 39434, 9696, -31579, -33222, -15542, -25950, -28732, -246, -8042, 42897, -2078, -36940, -23204, 42592, 35436, 16341, 12894, 66958, 15699, -51023, -25404, -18655, -43071, -55707, -60659, -20546, 5158, -30998, 18813]
13744A8813K5788m6676l6945k0249J7824o204J8465J9032m115L768k9413M0909
13732I97J7888K1844j0316K712K7395k5974l646N4857o7142r2919l2797n8124
13720a65225o2357L943O5841O8537K1304j6369L9203K0996M156Q4187K7546k4389
13708F7373l2241q779l8081j2130P833M30n7723m1837k4888r935J6220K8650R4123
13695a0985j896l8531K947Q8697K3760j6258J3227j1367n4576n6199l8061O6902
13683c2340K8074M185K7800l0746k5828K4811M6675l4135q6092J4385O1383M8591
13671D6763q619q1360Q382o6k6615j2261J5836n976K2595M0569m2751k1750O2250
13658c003k1953k3003k372n956k9575R4138l1084k0856K5884O7380k4615n5522
$$ y = [18813, 44601, -2075, -39020, -59269, -41445, -47649, -29184, -10152, -14267, -10499, -39912, 997, 18885, 40729, 30413, 33125, 60520, 34546, 30900, 85757, 18615, -74304, -107101, -165225, -227582, -223639, -157798, -89261, -67957, -84326, -45123, -24127, -19971, 64216, 91762, 67373, 35132, 26353, -11728, -23858, -16025, -15595, -73318, -115155, -140043, -149978, -133758, -105108, -10985, -12881, -51412, -48465, 40232, 63992, 47734, 60961, 49594, -4982, -61181, -99242, -32340, -4266, -81, 27719, -3027, -28855, -4044, 42631, 8496, -77596, -63211, -1828, 46763, 38144, -43216, -34834, -34900, -61515, -73776, -57940, -63916, -41321, -752, -43503, -65253, -3003, -24956, -47959, -50331, -56287, -85862, 8276, -22808, -43664, -17780, 49600, 24985, -30537]
13646c0537L9805L6290J9887n5546n2169O673j4796p494M2711p712k8257Q322
13634d2823M9622j6889N7642J155N199k9593k8545o7450K6619M6213J0074r126
13622B098K1614Q3418n0701r2698m4905L7794j4152M9591R7750N3100m2069n1814
13610D9026J2977k8559k2958R438j3138p8301K3561J07492q130k2237Q637N2744
13598I0552N9844J569p0449j9345o1707p7580J4467J3489L284L3421M1298M7751
13586G6594L9387o2297k5112J5023M0094K1587k9022O787o2532o7386m361L1019
13574b0219J9633J5249o1839K9433J9464j9503k6983j2185J008J607M85L7836
13562a6014O8459o670n5488m9872O9065O9626k8294r009o4051n7796j0211N6929
$$ y = [-30537, 9268, 45558, 65445, 9899, -42270, -35597, -50393, -57887, -15176, -22888, -51145, -42823, 6799, -10090, 47552, 48707, 53906, 24313, -4232, -71682, -45063, 1150, 11224, 2098, 23712, 107130, 56429, -36269, -81174, -43380, -57532, -7941, 89809, 142909, 100840, 49026, 62003, 33444, 10486, 19924, 6786, -71515, -47954, 59538, 51408, 29171, 37808, 90552, 150396, 151965, 81516, 62171, 464, -77116, -62649, -49160, -45876, -12455, 28843, 76594, 115981, 53684, 28572, 43595, 83689, 105276, 76254, 83041, 20509, -46877, -51238, -20219, -586, 14663, -47176, -17743, 1721, -17782, -44765, -56950, -55942, -54335, -53850, -16014, 52445, 45775, -9713, -59585, 9480, 79106, 50812, 41803, -22248, -80044, -90255, -33326]
13550c3326L1986j9743J3061J5225n5552m2673Q4633j7320O2944Q7347l7362p7405
13538A1815j0260M9356k3213o7263l0182k8893j3293K3399L0494j3653j873R641
13526f3925n4191K4968K8964m7923q975L7673J9066P505L4372k9474J8554P5992
13514D2606J00100j0023j4894J0098l7881n9647q4888J0032j7093k991J4558P7117
13502B7094J8012l7748k9232N712L692j3682o821o6288J3167J20245J4860l1468
13490A7543l0253J2613K7148L8820k8288J4489J0866m8808l40R2965M4344q0434
13478G0665m2339n8377j6662O4046K8536L2638p5781j17937n0307M0656N4325
13467g0537M3152P3039n0498l803m4211K2617M269m309p829k2248M5741L0228
$$ y = [-33326, -1340, -21083, -8022, 7203, -48349, -91022, -6389, -23709, 39235, 126582, 89220, 11815, 1555, 50911, 27698, -39565, -69747, -98640, -111933, -88534, -58040, -71693, -73566, -63925, -118116, -93148, -64184, -112107, -121082, -83409, -64343, -56838, -22466, -51940, -33386, 42606, 142706, 132683, 117789, 127887, 90006, 30359, -54529, -44497, -61590, -64581, -50023, 27094, 45106, 7358, -21874, -16162, -12470, -26152, -32973, -99261, -86094, 34151, 49011, 17543, -12710, -97, 27051, 65871, 37583, 52072, 62938, 14130, 13790, 106755, 151099, 70665, 28326, -30051, -46713, 17333, 45869, 78507, 2726, -115211, -165518, -124862, -70537, -27385, 45654, -4844, -8647, -52858, -30241, -25972, -30281, -38110, -60358, -14617, 15611]
13455A5611q6774K8681o1297l6320O5161R3858O295j9540L102K5189L8458J4455
13443H6879k1501o7000m9784k3590L2724P241k3264N3969K7605K460l313P6593
13431I9019L8733l046j7073m8012l7642p2439m2148j2915r907O989M7199l7399
13419h8641K4518J4854O1740L209N1145k5715o6447j9937j4251o5479o569J21975
13407i598P5160k4310j6321l8267l9275j2936L8991k2080P3344M3659K8375r766
13395H6976m3301M906P268l3704J2045K6740L181q2280J8419K2804k4838J2395
13383A0611R3019k074m4354j9876m1038j691p251p2037l2240J08894M6307k6048
13371A2222j7084P1133Q506m6486J120q575r4373K3930K2102n8092p735j4856
$$ y = [15611, -71163, -42482, -103779, -140099, -74938, 18920, 25215, 5675, 8777, 33966, 72424, 86879, 65378, -1622, -51406, -74996, -42272, -35031, -58295, -4326, 23279, 25739, 22426, 99019, 137752, 134706, 117633, 69621, 31979, -40460, -82608, -95523, -105430, -98441, -51242, -88641, -64123, -49269, 12471, 15680, 66825, 41110, -25337, -45274, -59525, -125004, -131573, -9598, 65562, 41252, 24931, -13336, -52611, -65547, -26556, -48636, 24708, 68367, 96742, 86976, 43675, 48581, 55849, 22145, 34190, 60930, 64111, -18169, 250, 23054, -1784, 10611, 103630, 101556, 57202, 37326, -3712, -5403, -12654, -84691, -116931, -8037, 38270, 12222, -4862, 66271, 74777, 28291, 29411, 20836, -73537, -49607, -27505, -85597, -93332, -108188]
13359a08188L4632M7006m6413J1422N3803l018p1971p6057L0334M1616p340N827
13347h8347N2322R3050R0417k3098l1927l2808m9009l6129M1667L4019l2102K2444
13335D0499N3482M5674m688k1779l7704l878l2837m4808l7115j1378J6592J6534
13323b1406J8623j5776n656K2922l4740j09251m098N3198K4124L6J2788N1049
13311h187J3119J0744P6601j3444o9962k0018n0090K4936N7590k4889N3524K5508
13299G5432l6833l1101l2526K292j2588n220k0917L3948N9078M3027K5792m518
13287I5866n3030J6231q4952l1959O4755L8629j5920j2443m8219l379L4655O1032
13275F1266K3205p5533r429o927n567K4357N3985N315j6759l5990l9232j3265
$$ y = [-108188, -73556, -26550, -72963, -61541, -7738, -10756, -82727, -158784, -128450, -86834, -94174, -88347, -36025, 57025, 147442, 124344, 92417, 59609, 10600, -25529, 16138, 50157, 18055, 40499, 93981, 139655, 134967, 113188, 75484, 71606, 38769, -6039, -43154, -54532, -37940, -21406, -2783, -18559, -24215, -1293, -36033, -145284, -149382, -96184, -72060, -72024, -59236, -8187, 4932, 15676, 92277, 78833, 8871, -11147, -61237, -36301, 21289, -3600, 49924, 75432, 38599, 7498, -25028, -22736, -35324, -40544, -61461, -27513, 31565, 74592, 100384, 95866, 42836, 59067, -25885, -57844, 6911, 45540, 29620, 17177, -31042, -34421, 234, 61266, 84471, 8938, -491, -7418, -12985, 11372, 65357, 70672, 53913, 17923, -21309, -34574]
13263c4574k3622j939J1913P7555N1242p23p8292R694o51j92q202J9625K6931
13250D8765k377K2817J0195k3840j3452R827j9504J6073k725n3400J0478N4519
13238E7376j6337J6048m1424m5021k8699R4219j1946m6777J2171J6710J2771K0314
13226C9405o372J6996K7761P4086M8305o7220p6369j6243L6825n5805J0291j9691
13214A1969j0241n08N0401L3320j0805J4864o5105n9554K595J6052j0822n1168
13202g9002k5093K5947Q3482J3141k2663k2448j8511K1568J9137K236L0548K3697
13190E2039k6243p2902k756j3636l4439J2408M3489N8485l950j7119K4174l9181
13178a9631l3254J4206n3277l1163J2803k7072p699Q9678Q8003n1132N469R0865
$$ y = [-34574, -58196, -60135, -48222, 29333, 80575, 79852, 1560, 11254, 10603, 10411, 2209, 21834, 48765, 46388, 69205, 79400, 55560, 42108, 51935, 32431, 48504, 45779, -7621, 2857, 57376, 41039, 57087, 15663, -29358, -58057, 36162, 24216, -22561, -10390, 6320, 19091, 39405, 33033, 50029, 77790, 151876, 200181, 132961, 56592, 40349, 77174, 21369, 31660, 11969, 1728, 1220, 51621, 84941, 74136, 89000, 23895, -35659, -33064, -17012, -27834, -79002, -104095, -78148, 5334, 18475, -4188, -26636, -45147, -23579, -4442, -2206, 28342, 52039, 25796, -47106, -49862, -63498, -97937, -85529, -42040, 16445, 12495, -4624, 19550, -19631, -52885, -38679, -91956, -123119, -110316, -137388, -145087, -55409, 32594, -18538, -13069, 77796]
13166G7796l0568k7220n1854O3097L9113j98m8321o9596K3028M3521m63o2509
13154d4174k3462K5347L1413l4270l3605j514J5123l3853p304M0504K1758K0097
13142b3940K9804o958k0639L0519J2736K1785j5833k3350l1156K3546L4653j7966
13130A3201j1336M9860l1638n1808M4608O1485J3003l2744l4701j4200m7141n766
13118d7177k817M6456K697K1727R3946L0355l1767k2813l2340Q173N3784q0475
13106C9749n0491L2056q77n731k1502j07222P342J69310N1982k4900k0639l7699
13094C1378L0745O8380k8867L378Q39q2633k9891l607k0110j5976o2380K7969
13082h0775M8794O3446K6765R814o5883j1180K209M9381M2073M190o4202n3178
$$ y = [77796, 47228, 20008, -31846, 31251, 70364, 70166, 21845, -47751, -24723, 18798, 18335, -44174, -67636, -42289, -10876, -45146, -78751, -80265, -65142, -98995, -106299, -65795, -44037, -23940, 5864, -1094, -21733, 8786, 21522, 43307, 27474, 4124, -27032, -3486, 31167, 13201, 1865, 51725, 20087, -31721, 12887, 74372, 87375, 54631, 19930, 5730, -41411, -47177, -49994, -3538, -841, 20886, 114832, 145187, 113420, 90607, 58267, 66440, 120224, 39749, -10742, 21314, 20437, 14706, -6796, -114018, -106676, 62634, 114616, 89716, 69077, 31378, 62123, 130503, 101636, 105014, 105853, 23220, -6671, -10278, -30388, -46364, -108744, -80775, -31981, 31465, 58230, 68044, 2161, -9019, -6810, 42571, 84644, 88834, 24632, -28546]
13070b8546l0738l6995k3827O0722K0665K5394k2316J7948J2947n9567k4950N203
13058h4060K9193O3516k669l3926m9556n9290Q376l7254K8030J5548M0130M8286
13046c3676K217L850M8417j266j4960J1001p293K0381O5367N8466p317j6808l27
13033A28052m013n0918o4102k1010M979K0742Q255J548q349m3445k4508L5040
13021a7729R442J1668N3079M4451m7141p1473K133L883J9784m693J15165P7839
13009A96408p8712o469R636o5140q6642p8626k9481P7781R7565K9599J3085l2448
12997D6556m6011j1405k5374L0298k0268N0038K6155L838P450j0370n1937k0765
12985b1795J044m5333P3421L6351l0060l4468K9812M6504l0739O518k5716j846
$$ y = [-28546, -59284, -96279, -120106, -59384, -38719, -13325, -35641, -17693, -4746, -64313, -89263, -84060, -54867, 8649, 5980, -27946, -77502, -136792, -128416, -165670, -137640, -122092, -81962, -33676, -31459, -27609, 20808, 19542, 4582, 15583, 8290, 28671, 94038, 152504, 145187, 128379, 128052, 124039, 73121, 9019, -11991, -7012, 13730, 21985, 23533, 15184, -28261, -52769, -17729, -8287, 3381, 56460, 100911, 53770, -17703, -15570, -11687, 8097, 3404, 118569, 196408, 117696, 111227, 120863, 55723, -30919, -109545, -139026, -61245, 36320, 65919, 79004, 46556, 545, -10860, -36234, -5936, -26204, 23834, 49989, 53827, 61277, 50907, -1030, -21795, -20751, -66084, 7337, 43688, 13628, -20840, 8972, 55476, 24737, 31255, 5539, 3693]
12973C693k5135L923N4577O645M4910j8903M305o1628o2105N667M4683J5214k7723
12960a1877J6311K1368j7522J0852J7206J3065N3464l0877m8912l9303R665M9657
12948D3097l2071l7745O7178J622m0933n1319K95n9025K6932Q1506K7193M0870
12936F7600N1896o6818p3381R520J4894L5791j4315q168j2340m4224l7858N3652
12924b3751K7236l4303K8169n4841m2002O3525N4920n0825M7528L9076l2155J4403
12912C6980k3227p0913J0567K8229Q6255L1203o6467o3603m5076j0110K2205l1337
12900i5294N4133N2691m502L0061m7706K9667l3102r5388R71R5758O490m9592
12888e5813N860L1443m3721J0739O0478n3884r1102n075K8934J7553K3913L1097
$$ y = [3693, -21442, -17519, 37058, 43703, 88613, 69710, 74015, 12387, -49718, -44051, 632, 15846, -11877, 4434, 25802, 8280, 19132, 36338, 49403, 102867, 71990, 23078, -16225, -6560, 43097, 11026, -26719, 40459, 42081, 1148, -50171, -49876, -108901, -81969, -463, 26730, 67600, 119496, 52678, -20703, -11183, 3711, 39502, 25187, 17019, 4679, -39545, -77403, -23751, 3485, -30818, -2649, -57490, -99492, -35967, 18953, -31872, 15656, 54732, 22577, 36980, 13753, -57160, -46593, -18364, 67891, 99094, 32627, -30976, -76052, -86162, -63957, -95294, -41161, 11530, 7028, 37089, -10617, 19050, -14052, -109440, -108469, -12711, -6221, -55813, -49953, -18510, -62231, -51492, 8986, -44898, -136000, -141075, -112141, -94588, -70675, -39578]
12876c9578M0932J2825k2862N1087p6011l6184j3798j8698O4083P8776N1706J4305
12864A06583q3280n5133j0768K22K4550j0523n49O0689J2399l5735n2930j6052
12852f0527J16096K1798m7302J995J8207R869m5103m8751k7358N776L4000j4875
12840c6175o4998J9916K1194N1907O2258R498k9600m7936o358n902q3908k0292
12828a30396N9235O242N3572J2783p1071K51j505n2239J0480M4014N8114K3226
12816A2706m1775N2711m0607k0027o3117j2912j9847J2558M3660J5336M816n666
12804f2164J079o8258p338N2416K5915k825P004L3612J1920n4550j3385m2540
12792a19114K3313M9082p096L046J0730j5375K3878O4166M6125L8810j7452n9927
$$ y = [-39578, 1354, 14179, -8683, 42404, -33607, -69791, -83589, -102287, -38204, 40572, 92278, 106583, 23303, -31830, -42598, -42376, -17826, -28349, -28898, 31791, 44190, 8455, -44475, -60527, 55569, 77367, 30065, 32060, 50267, 60136, 15033, -33718, -61076, -55300, -21300, -36175, -101173, -81257, -60063, -8156, 54102, 63600, 34000, -13936, -20294, -26196, -110104, -130396, -71161, -64919, -11347, 1436, -69635, -69384, -70889, -123128, -112648, -68634, -10520, 12706, -29069, 23642, -16965, -36992, -100109, -113021, -132868, -120310, -76650, -61314, -56498, -62164, -61085, -129343, -136681, -84265, -58350, -61175, -54171, -20559, -8639, -63189, -76574, -119114, -95801, -46719, -53815, -50769, -40039, -55414, -31536, 32630, 78755, 117565, 100113, 40186]
12780D0186K4121j5474K2740k9255k7018q8903J887k0141L0858M805k4203j7828
12768i8225O0K7465P8867q68K210k4692K2205j8721l1706m4904K28M3676O4601
12755B0196k4938J2635m9307K3806M4770k2318p1744k8333L1782L4119n4632p612
12743i1576O3508K0226p4225L4700K5848J1731K7884N3194R15r237m4495m1590
12731b3117k0191L2879M8576J7445n9408m433K4588M2041N5629k934l4580J8072
12719I4567J2282r4006l5281l715M1829O5267J7387j3458n5376n9218q568q263
12707d6553K3964k4659J6113Q5263K5275j3450m0794k9068p637J6127N6482J2414
12695G3477J3346K9504m3384l5213j5542n9407p0923j3058K2354P7857N2398p5759
$$ y = [40186, 64307, 48833, 71573, 42318, 15300, -73603, -71716, -91857, -60999, -56194, -80397, -98225, -98165, -70700, 8167, 7299, 9509, -15183, 7022, -11699, -43405, -88309, -88081, -44405, 20196, -4742, 7893, -41414, -17608, 27162, 4844, -66900, -95233, -63451, -29332, -83964, -91576, -28068, -7842, -82067, -47367, -21519, -9788, 18096, 71290, 72205, 62968, 18473, -23117, -43308, -10429, 38147, 55592, -3816, -8249, 16339, 58380, 114009, 111075, 76495, 94567, 106849, 12843, -22438, -26153, 15676, 80943, 98330, 84872, 29496, -29722, -38290, -46553, -22589, -47248, -31135, 54128, 79403, 65953, 25159, -3909, -11546, 4581, 61063, 73477, 86823, 116327, 72943, 37730, 22188, -37219, -108142, -121200, -98846, -20989, 31409, -44350]
12683d4350n993L948J7303M4118J8361l3067l4526j209k4143l3897J6151L3377
12671d3927l2852j616J4788j6834j455N6917J03166m0306j20526P815L7665O7679
12659C0514l4866L380J4847q29j7635m1527m8456J3942K8219J6438L9561K0249
12647B3837N9643K2216K921j21213n3527k7323k7560M7932O0004O0616k1898j03052
12635g7404j1902L25K1467p87q2616m1152Q2814O9679K2097K2195m9723l6779
12623h1786K9198j1780l2932J2899K1412j6623m2095L6086O3025j450j0628L625
12611c1049l283L175M4755N7519L9035j0064K8122k399j29450j9809k0665m3219
12599h7332m288N0805K799L000L8871L1056k4490L608k7232r241L4181Q267j6954
$$ y = [-44350, -50343, -46395, -29092, 15026, 33387, 320, -34206, -35415, -59558, -93455, -77304, -43927, -76779, -78395, -63607, -80441, -81896, -24979, 78187, 37881, -82645, -74830, -37165, 30514, -4352, -972, 13875, 13046, -4589, -46116, -94572, -80630, -52411, -35973, 3588, 23837, 83480, 105696, 108617, -12596, -66123, -93446, -121006, -73074, -13070, 47546, 25648, -77404, -89306, -88981, -67514, -68301, -150917, -192069, -109255, -39576, -17479, 4716, -45007, -81786, -52588, -64368, -97300, -84401, -62989, -79612, -121707, -85621, -22596, -24046, -34674, -31049, -34332, -31157, 13598, 71117, 110152, 100088, 128210, 125811, -3639, -23448, -44113, -87332, -91620, -40815, -38016, -35016, 3855, 34911, 10421, 14029, -13203, -22444, 11737, 20004, 3050]
12586C050k5886k5891r096L2366L9585L490N8013k3521n6477j3171j6359J8496
12574a5401K2572J9681j7535O1701l209l4659j6616N965L3689q245l0529M829
12562B2243L8643K4564L707m1932m1450L1389M399k6284q0030N0957N0163J3523
12550D9892m4852m5456k8883k7739N7312R2013N3693l7091j8346j8313K6922J5084
12538G4236k8990n4079l1450K4168k368J344j4850L5584j0801L363k2349p461
12526c3653J4787k8519n447N6985J3169J043J5188J9500L7909M7429k8433o7850
12514D2108Q844P275o0322m3522N5119J8344K504n8279q4359K375j6966P5743
12502e1136R048K0874N065l4432m3323k5285L5444M9097l4958K232j5680M7590
$$ y = [3050, -22836, -48727, -57823, -25457, 14128, 17618, 75631, 52110, -4367, -17538, -33897, -15401, 7171, 26852, 9317, 71018, 67809, 33150, 16534, 22499, 56188, 47943, 17414, 22243, 60886, 85450, 89157, 47225, 5775, 37164, 41563, 15279, -64751, -13794, 36369, 49892, 5040, -40416, -69299, -97038, -39726, 52287, 105980, 68889, 50543, 32230, 59152, 74236, 45246, -8833, -40283, -16115, -18483, -17139, -31989, 3595, -7206, -3843, -26192, -33653, -18866, -47385, -52832, 4153, 17322, 18365, 33553, 53053, 90962, 138391, 109958, 42108, 50952, 58227, -2095, -45617, 9502, 27846, 30350, -27929, -112288, -109913, -126879, -51136, -42088, -21214, -16149, -50581, -93904, -119189, -83745, -34648, -69606, -67374, -83054, -35464]
12490c5464N6379l245J2997r264P2416m1148q1012p3958m147J9640O964K532k7607
12477a04917o364n29K7400P9849j3026J0085L1057J0087q293j2510J9679L057
12465C5575j1681M2485j511J3888M851p357K4760n3603m6749k8230j9627q6071
12453a33270M355O6330N9288n6944o4209M549L2824R5506J2741l2591M0916O8032
12441I7527m214Q0510J8959j16614o9354k502K895N724l1237J4398n0091n7534
12429a11533j4847L0721M3483n76K6303Q3823M9393k4758K1705J2050k2228m2666
12417E0870j0934J2544L470o4614J4850J5016N882o6929L425m1772K4187j3973
12405f7978l8377M0372O0773j8248L7993N6138m1238n2175j5060J6503K7648K2480
$$ y = [-35464, 20915, 17670, 30667, 21403, 93819, 52671, -28341, -102299, -106446, -86806, -79842, -77310, -104917, -111281, -111810, -84410, -4561, -17587, -7502, 23555, 33642, 25349, 12839, 32518, 35575, 23894, 66379, 64868, 78756, 83607, 76250, 101010, 47407, 658, -27572, -47199, -133270, -128915, -62585, -3297, -60241, -124450, -119901, -87077, 8429, 21170, -11421, 29495, 97527, 93313, 173823, 192782, 76168, 6814, 4312, 7207, 12931, -18306, -3908, -53999, -111533, -126380, -95659, -52176, -52752, -26449, 57374, 106767, 82009, 103714, 115764, 93536, 50870, 39936, 52480, 55950, -8664, 6186, 21202, 27084, -39845, -36420, -78192, -54005, -67978, -106355, -65983, -5210, -23458, 14535, 70673, 29435, -22740, -37800, -21297, 6351, 28831]
12393B8831j7013l0640l0439K5582j5109J3796P8420M5413k7317k1546P1834k5417
12381I6395r8552j257K7275J4826J191l0033K8613j3487J9767L3512j8654p0125
12369a0529p237J0842j4100l6408L9481R520M5763l4887J0425K9048k0111k0717
12357A090k442P576p925k8443k9668O527k1257l2076j2242L6643k2190K6461M5928
12344c2018J6149m763R557m094q4988K8239M1413R1024J15200o5085j32694j0693
12332c2753K339j955K1036K4359L9849J3636J7304j7038m1619k3856n2N9614M846
12319F5710k4462j07934p390J23619k6321n2276k8447K1107N8644M1828J5653
12308G9731j1738j6874m7837m2858r784n3436k152O1623N6788J9392O5643l8206
$$ y = [28831, 11818, -18822, -49261, -23679, -38788, -24992, 53428, 98841, 71524, 49978, 121812, 96395, -2157, -3414, 23861, 38687, 39878, 9845, 38458, 24971, 44738, 78250, 59596, -10529, -17766, -6924, -21024, -57432, -17951, -8431, 37332, 2445, 12870, 41918, 21807, 1090, -1352, 6224, -1701, -30144, -59812, -53285, -74542, -106618, -118860, -82217, -104407, -77946, -32018, -15869, -20632, -11075, -15169, -100157, -71918, -30505, 60519, 175719, 110634, -22060, -32753, -30414, -32369, -11333, 13026, 52875, 66511, 83815, 66777, 25158, 1302, 1250, 60864, 65710, 41248, -66686, -74076, 49543, 23222, -29054, -57501, -36394, 22250, 64078, 79731, 67993, 51119, 3282, -39576, -49360, -102796, -104948, -43325, 13463, 32855, 98498, 60292]
12296F0292j301K1597k5934j5722m4703l2237L9624j095m8224n1735Q1608K9050
12284A1220j7801o9859k6764M9726L4704O8521K5238J4056M0565r5536o6527j5100
12272d7557K3711Q515O6564p172P888k9571o8339n5172J3826N4646k2786q228
12260f3675O9465O9478k8427p2100K0424N4300L202o5792n8072j4403k8306M1633
12248g2273L0221Q2106N4199n3055k3693j505k8102K665O965l6121J8131K4905
12236D443J3067r068j2048O9875M9278l4346m8959k8794P94K6437J1778j4690
12224B7767Q055Q0455l595j5360n9203o3044j749M9656J0788J1257l8641m5271
12212c8885M2005j614M1917K783l0774r676l2386q562L8716L0453n657K5177j08655
$$ y = [60292, 58991, 80588, 54654, 38932, -5771, -38008, 1616, 521, -47703, -99438, -17830, 11220, -6581, -76440, -103204, -53478, -18774, 49747, 74985, 89041, 129606, 34070, -32457, -47557, -23846, -15331, 51233, 44061, 51949, 22378, -45961, -101133, -87307, -32661, -55447, -63675, 5790, 75268, 46841, -25259, -4835, 49465, 52667, -13125, -71197, -85600, -113906, -72273, -42052, 40054, 94253, 41198, 17505, 16000, -12102, -9437, -2472, -38593, -20462, 4443, 17510, 8442, -3606, 66269, 115547, 81201, 32242, 3448, 4242, 30679, 42457, 27767, 35822, 116277, 112682, 97322, 38119, -24925, -26674, 22982, 33770, 45027, 6386, -38885, 3120, 1506, 43423, 46206, 15432, 5756, -26630, -35192, 3524, 33977, 28320, 53497, -55158]
12199e5158l7055j4331K5005N3582N3607K8035J5808J6689m7413l9122n8113l8161
12187i6627j9345P2166M8948J0484m1326K5723k2716r346J3791j6807J1496K3378
12175a81k6048k0971o3270j3014J06500J63M8969L7252r022j0823o0986n6376
12163f7807j9394J3733K3628N207M8527L0091l1033o220R094l486o630k5741L8716
12150H685K963k9077m4805r3112O1356M4144L8235l091J4901J9423J446n2730
12138c1662j8998K0805K665N0938M6128J8399n6933l2791l0546k7752m7546R967
12126i7326R8974M3188p1067k8276l6026l4190Q8953N4157k2592J9558N0212O8706
12114A34271k4365k1664r0031j4930J7009M2794Q8424M927p9372J669o821J2003
$$ y = [-55158, -92213, -106544, -81539, -27957, 25650, 53685, 69493, 86182, 38769, -353, -58466, -96627, -115972, -43806, 5142, 15626, -25700, 23, -22693, -32039, -18248, -35055, -23559, -181, -26229, -47200, -110470, -123484, -16984, -16821, 32148, 69400, 60378, 49555, -11431, -67807, -87201, -73468, -49840, -44633, 3894, 33985, 2952, -3268, 5826, 2340, -4290, -30031, 8685, 11648, -17429, -62234, -155346, -93990, -49846, -11611, -14702, 199, 19622, 21068, -31662, -50660, -29855, -27190, 23748, 69876, 88275, 31342, -1449, -31995, -59747, -107293, -97326, 1648, 44836, -26231, -54507, -90533, -124723, -35770, 18387, -4205, 15353, 65565, 134271, 109906, 88242, -1789, -16719, 290, 43084, 131508, 136435, 57063, 58732, 51911, 63914]
12102F3914p962K4411p6012n4341k9744k2491J0291r144J4174J02273m2517n3606
12090h0754M452L8320P6779Q3949m984o9633p3125j3664K3739L7125M0136k9479
12078C2861m3819m2639k8716j6368K8448l214L6351l336j0707J484m6181l1538
12066a27374O4651M3698q534J0231N4782J8494r7109K9106k6685p389p661Q8558
12054C4768Q1335p841j1605l3136l4056J5326N355o6605l8996m1187M2389J1110
12042d3143l9356m61M7338l9178q724N7269O8640K1059j8108p2707k7234N2368
12030b237N6127j6546j9077k5965P5367L7328k687k4878k8692J5449M0422j0045
12018I4566j9086j1289n2050R8008K4508p8326p9588l7844O247J7284R232j0207
$$ y = [63914, 55952, 80363, 4351, -49990, -79734, -102225, -91934, -101078, -86904, 15369, -27148, -80754, -76302, -37982, 38797, 122746, 117762, 48129, -24996, -38660, -14921, 22204, 62340, 32861, -10958, -53597, -82313, -98681, -70233, -73447, -37096, -40432, -51139, -49655, -95836, -127374, -62723, -19025, -27559, -17328, 37454, 55948, -41161, -12055, -38740, -46129, -53790, 34768, 116103, 108262, 96657, 63521, 29465, 44791, 50146, -16459, -55455, -96642, -54253, -43143, -82499, -82960, -35622, -74800, -83524, -26255, 42385, 63444, 45336, -27371, -54605, -2237, 53890, 37344, 18267, -7698, 67669, 104997, 102310, 77432, 48740, 64189, 104611, 94566, 75480, 64191, 12141, 110149, 134657, 56331, -23257, -61101, -54854, -37570, -28338, -38545]
12006c8545l0863J1160m8270l8433m4808P3154M1903P1755P5515l5138j4796K2448
11994D5082J2945l3803k7968J693l876q2128j2206l4465j2911J046L1586O6244
11982d8761Q3333K141k1981p966Q372N6482K916J9818k0434p7210l8945l8938
11970h1173N0721O4865l157J2580l7310o6666n1326K4757P4888P2460l3317k3055
11958D267k6343O1454K9781p0169q0417q512K4328k6231k6252q3286M465J33898
11946f3017J50960N8805n6513n5625L35o307M6607J2815J220M19N6009N6426q756
11933A93378r1889j27441m1599J3087K0029J3518k1965n0496J0212L9194K0612
11922b3360L689j1177k3839L9691O233L8390k4231j8842j1757L1459m4111j08098
$$ y = [-38545, -69408, -58248, -106518, -144951, -189759, -116605, -74702, -2947, 72568, 37430, 22634, 45082, 58027, 24224, -3744, -2051, -5927, -88055, -100261, -134726, -147637, -146591, -115005, -48761, 34572, 36713, 14732, 6766, 15138, 71620, 74536, 94354, 73920, -3290, -42235, -81173, -30452, 34413, 31256, 43836, 6526, -60140, -111466, -86709, -11821, 60639, 27322, 4267, -22076, 39378, 69159, -1010, -81427, -89939, -65611, -91842, -118094, -201380, -196915, -63017, 87943, 146748, 90235, 34610, 34945, 28638, 75245, 88060, 89280, 89699, 145708, 202134, 193378, 101489, -25952, -67551, -54464, -34435, -20917, -42882, -93378, -83166, -43972, -23360, -19671, -30848, -54687, -14996, -8763, 29627, 5396, -13446, -25203, 6256, -37855, -145953]
11910a45953L9426M4935N2884N3123L4665L416L2072k9890o5696j11554j3348
11899a05920L2832L0164L1688j5418k7432M0344l5700o5804J5592R2393J20533
11888A13272J6201q4864n6765J3411L2985j0415l179J581N933m817L67k7223k8880
11875c2393O2785p4780j35829L1663N1175J11L0625N5346M7480K8971Q490l3754
11863C9890p9365n0831N9661M4070K2392J5865k356q313K3963k4039L0561J971
11851G3469n8562p0988n5480L4027J8622m836O6031j5544j2737Q4415p781m8033
11839B603J0150J5890n117j7843J312K4704J4560k8917J669l5314M327K3218L3045
11826D4287O168m3999j456J6812O7121L1890J4555m6787j43937j7407J3385L1585
$$ y = [-145953, -106527, -61592, -8708, 44415, 79080, 82496, 114568, 84678, 18982, -92572, -105920, -73088, -42924, -11236, -26654, -54086, -13742, -49442, -115246, -99654, -7261, 113272, 129473, 44609, -12156, 1255, 34240, 23825, 20646, 22227, 28160, 23343, 23710, -3513, -32393, 30392, -44388, -180217, -148554, -97379, -97268, -66643, -11297, 36183, 65154, 73644, 39890, -39475, -90306, -30645, 13425, 35817, 51682, 49326, 41013, 64976, 40937, 71498, 73469, 14907, -56081, -111561, -77534, -58912, -63748, 2283, -13261, -25998, 58417, 50636, 2603, 12753, 28643, 23526, 5683, 6995, 31699, 46259, 17342, 19011, -16303, -11976, 11242, 44287, 50455, 6456, 5000, 21812, 88933, 120823, 135378, 88591, -55346, -72753, -59368, -27783]
11814b7783L7894J326m0281k8459K005M1695Q9736j6153j2015q3872k0156O0472
11802D409L7964J2101j35396k0561N753k4217j1268J454M53m0552K7277j8268
11790a60851N261N9711N3670K7973L9127J3975m085o6495o6781k9612N5254K5319
11778d7534m3375j3911P3775N1831k5955l2784k8043L8083P1732N021M1369l7596
11766E2613p8007O9568O8152o692k6224K639N7231R420n0846M7698j5305o7115
11754F3132l2599J8553k9221q833n7485j4234J4940j1731N9383O7344N1142k828
11742A17563j07359O193k9461m1914k6133O0658M1044l6129K1850M083m1856j0390
11730d1851L903L846m9232k5889K4807m6205P0149J45723j6969k98m861p6068
$$ y = [-27783, 10111, 11437, -28844, -57303, -55298, -13603, 76133, 59980, 47965, -35907, -56063, 4409, 42373, 54474, -80922, -101483, -95730, -119947, -131215, -129761, -129308, -169860, -142583, -160851, -155590, -95879, -42209, -14236, 24891, 38866, 34781, -31714, -98495, -128107, -72853, -47534, -90909, -104820, -31045, 20786, -5169, -37953, -65996, -27913, 43819, 48840, 90209, 52613, -25394, 44174, 112326, 105634, 79410, 82049, 139280, 148700, 97854, 145552, 130247, 63132, 30533, 49086, 19865, 11032, -46453, -60687, -45747, -57478, 1905, 69249, 120391, 117563, 10204, 16397, -13064, -54978, -81111, -20453, 20591, -15538, 6312, 10395, -31461, -41851, -37948, -34102, -83334, -109223, -84416, -130621, -60472, 85251, 68282, 67984, 63123, -12945]
11718a2945n9140L4342o144j8962l6334l3147N7830L3511M5327L8550L816P1892
11706A18596j2670j1568j3775n8278K2772m078M0691J5705m5857k8229j4141l635
11694E533p6119l0006L0512P4663j6480l356K0700l133K8311J0955l1901j6161
11682f482l7356n9131N2780J2294K3963j3831K7710q0207M0641L8863J9206J2268
11670C0718j7632K5777j9638O29L5330M0375j1476q175j0803J6273l1176r8159
11658d7957m7129O6431L4616L7691J3602j4059m7324o581K9031K9422O3836M9245
11646A60824j0008m68r7909j1877j957P168k3828o1359K7508M6053J3411n0307
11634b749K4083r7955j03358Q8122Q5236L4954J470J4181M6417k5313o7414L8200
$$ y = [-12945, -72085, -37743, -43887, -62849, -99183, -132330, -74500, -40989, 4338, 42888, 46704, 118596, 105926, 94358, 80583, 22305, 45077, 40999, 81690, 97395, 51538, 23309, 9168, 5533, -70586, -100592, -70080, 4583, -11897, -15253, 5447, 2314, 30625, 41580, 9679, -6482, -43838, -102969, -50189, -37895, -13932, -27763, -53, -80260, -39619, -756, 18450, 30718, 13086, 38863, 19225, 19854, 55184, 95559, 84083, 75908, 65105, 81378, 50202, -47957, -95086, -28655, 5961, 43652, 57254, 43195, -4129, -10710, 18321, 47743, 111579, 160824, 150816, 150348, 52439, 40562, 38605, 45773, 21945, -39414, -11906, 34147, 47558, -2749, 21334, -76621, -179979, -91857, -6621, 28333, 29803, 43984, 90401, 65088, -2326, 35874]
11622C5874k9051q1736k1472P7280J30975L7211n1548k0538j10l2898m6566k3118
11610b5697K1540O1834P6980l1746o9795o2984l2973r109P493O4273J5674p2925
11598e7435r731o887P6764K4043R370m0248k4893K338L330n266N7229J2264n9199
11585a8321j9177M4652P7143j0015r092K9556p4182l1458M8767J3732k7577K7458
11573E1486l0638L577j4321j8178j8881M7940M5057p3030o0171j9788M1273J9272
11561b6402L062O4694O816o9224p5816j8395Q0478M6931k6773o038K3126N9327
11549F1786M1365l824k6763L5126j912o6315O020K1897l2389K6899l8407p247
11537A6236J6675n9148l4476K3289J737J0010n4467J8887P0528M1380L4990J6545
$$ y = [35874, 6823, -74913, -96385, -19105, 111870, 149081, 97533, 76995, 76885, 43987, -2579, -25697, -4157, 57677, 134657, 102911, 33116, -29868, -62841, -71950, -64457, -184, 15490, -57435, -67166, -74053, 2711, 26754, 36124, -4124, -29017, -26679, -23349, -28615, 28614, 40878, -18321, -37498, 7154, 84297, 74282, 65190, 94746, 20564, -10894, 37873, 51605, 24028, 51486, 20848, 24425, 10104, -8074, -26955, 20985, 66042, -6988, -67159, -86947, -45674, -26402, -23340, 41354, 48170, -21054, -96870, -115265, -34787, 12144, -14629, -20667, 2459, 61786, 103151, 99327, 72564, 107690, 105778, 39463, 45483, 67380, 34991, 61890, 23483, 16236, 32911, -26237, -60713, -37424, -35687, -25677, -80144, -61257, 9271, 50651, 85641, 102186]
11525A02186k3717k8292l0912K4685n9258l7550J5021k7132J6831K8825K4936
11514E623M8253K7633k7526n8391j2575m9883K9802P2243m7318p9657n630K7747
11502f9679N1510K3714l6460m5743M0369N4040N7352J0994J7331o7731l7810K4643
11490B2530P1724J3196M0490n8512n7116p3375N5233Q0050q935K367j01798k109
11478a6255p316j3063K6777l2308m5458q495M5452p638k1806L7122O1565r00m7202
11465b9525l5868l6571m403J5783M2855P9615K3599K5208n3796m3304N411J3550
11453B554L8519Q6099L7814r0661o8356l0902k8996j4277p331J6402l9634n5871
11441a54640k8401L7719M813m5154j6230N0512R0654K7204k9257j4365L7886Q204
$$ y = [102186, 78469, 50177, 19265, 43950, -15308, -52858, -37837, -64969, -48138, -19313, 5623, 53876, 81509, 53983, -4408, -16983, -66866, -37064, 35179, -12139, -91796, -97426, -69679, -18169, 5545, -30915, -76658, -36289, 17751, 75103, 86097, 103428, 35697, -2113, 22530, 94254, 107450, 147940, 89428, 32312, -41063, 14170, 94220, 85285, 87652, -14146, -16255, -23571, -36634, -9857, -42165, -87623, -96118, -50666, -58304, -80110, -42988, 18577, 17677, -29525, -65393, -101964, -106367, -90584, -47729, 31886, 55485, 80693, 26897, -16407, -10996, 2554, 41073, 127172, 164986, 74325, 5969, -24933, -53929, -68206, -75537, -59135, -98769, -154640, -183041, -145322, -140509, -185663, -201893, -151381, -60727, -33523, -62780, -77145, -39259, -31055]
11429c1055L332K6818k1351L9413O8439O932j85P95n1260J9615N4419q0372N8247
11416I3787k5758K2958J290L2629K5219k2144o6947J6606k5278n1455N4085p885
11404D7107l8899j6100R669m0358m3594j3320L1941K1763l0969Q25J5673K867
11392e3395J9834k6489Q9692L4125n4245m6532J4111j2640j0958r980K8179N5396
11380B7098j5816R89m0600M5766n2754r3890K4177L7272P5548o0355j3309P778
11368e8096L9796L1364K7235J4898l6391k6623l0566K7858M5472k9951l5684l546
11356c4234M926K1040j2274m781J8638j9303k8419J2555M3637L9305m9108n4199
11344f2217K5717M9895N739k9370M5578J7724L6979k5055j8426J7044L0778o2874
$$ y = [-31055, -27723, -905, -22256, 17157, 85596, 92528, 92343, 93138, 41878, 61493, 115912, 35540, 93787, 68029, 90987, 92277, 124906, 150125, 127981, 61034, 77640, 52362, 907, 54992, 47107, 8208, -7892, 1777, -38581, -82175, -95495, -63554, -41791, -72760, -71935, -56262, -53395, -33561, -60050, 29642, 63767, 9522, -37010, -22899, -35539, -46497, -56477, -28298, 27098, 11282, 12271, -28329, 17437, -35317, -129207, -105030, -67758, 7790, -52565, -65874, -58096, -18300, 13064, 40299, 55197, 18806, -7817, -38383, -10525, 34947, 4996, -30688, -34234, -29308, -8268, -20542, -25323, -6685, -25988, -54407, -41852, 1785, 41090, -8018, -62217, -36500, 13395, 19134, -10236, 35342, 53066, 90045, 64990, 46564, 63608, 94386, 31512]
11332C1512m5115L515M8444k7881N7873l3878p9423j1106K9088L99o551K6332
11320f791k5492O4474M4423K1516j2755n7742q0435k0922K2567O9592l5220n6295
11308g3080O428J9120j8770m642K0854L6694N8651K8175l306l0131Q2636L1553
11296A54182r0271q956j0377n9756r209l4704r6362O18J6829J6076r080K2495
11284a08515j1268k5403j4951P9788L6911L725l8398q0116N0116j0606M2508L9649
11272c6560l9355j8077N1034N023L0101k9816J8497J1318k245m6837M9439o792
11260a4270j3722J075l8977k254l3926L0640N3931n7147N315Q826m9242r527K6035
11247i3243P4302K7255J9103J0961N0372M3568j8574m1133M5779n2854r5013k3217
$$ y = [31512, -13603, -10088, 38356, 10475, 68348, 34470, -44953, -56059, -26971, -26572, -33123, -6791, -32283, 32191, 76614, 98130, 85375, 27633, -52802, -73724, -51157, 18435, -16785, -73080, -66652, -47532, -66302, -70944, -50090, -13396, 45255, 73430, 70124, 39993, 122629, 154182, 63911, 54955, 44578, -15178, -24387, -59091, -155453, -154835, -138006, -121930, -131010, -108515, -119783, -145186, -160137, -80349, -43438, -39713, -78111, -158227, -108111, -118717, -76209, -36560, -75915, -93992, -42958, -37935, -7834, -37650, -19153, -7835, -10080, -56917, -7478, -14270, -27992, -26917, -65894, -68148, -102074, -71434, -17503, -74650, -69335, -60509, -109751, -119278, -93243, -18941, 8314, 27417, 38378, 88750, 132318, 113744, 72611, 118390, 65536, -29477, -52694]
11235e2694J6965J825m8154m928J8676k4099k2880o1543n36P9181J36287J1093
11223D9193l1818J3336L4829k7294j4374j2106o123J0250q9070o4366N1650J00338
11211A4445K8114l3308K2900Q0724M790K506j8371r8699K4266O3548K3306L5697
11199A49918k2181j1640m9364m918k7709m4465j7447L9177l4819p3147j6423l9091
11187a52109J4707J09796O3874J6495k9191l46J1745L4217L6926L8980j6598n8399
11175G0097q5642l7493R387L6913M015l1840q112m7686q5487k744N4793J0781
11163a13018K2347l4281l3402M0904R2333o6743J1866J1476q33m6597l8721J6176
11151a38493J6193P4240N1625n9510l9505j0782M3502N2287k0038l094j7832j9707
$$ y = [-52694, -35729, -33904, -82058, -86986, -68310, -92409, -115289, -176832, -177368, -98187, 38100, 49193, 17375, 30711, 65540, 38246, 23872, 11766, 5643, 15893, -73177, -137543, -85893, 14445, 42559, 9251, 32151, 112875, 117665, 120171, 101800, 3101, 27367, 90915, 114221, 149918, 127737, 116097, 66733, 61815, 34106, -10359, -27806, 11371, -23448, -96595, -113018, -152109, -137402, -27606, 36268, 52763, 23572, 23226, 34971, 69188, 106114, 145094, 128496, 70097, -15545, -53038, -43651, -6738, -2723, -34563, -42675, -90361, -175848, -178592, -123799, -113018, -90671, -124952, -158354, -117450, -25117, -91860, -79994, -68518, -69351, -115948, -154669, -138493, -122300, -48060, 3565, -55945, -95450, -106232, -62730, -10443, -30481, -33575, -51407, -71114]
11139g1114M6235J3435j0541J038K6812r700j06264r5083O7969N7526N1994J15287
11127H7594n126j18420j6728J08621K224l0074m0992k6007J2588n9702l547j802
11115i1371J9127M3416P703r132q950l2190J317M0751o735K9167K6952m7811j5019
11102d2775N1630l2481n1008J2572K8590N001K2309P5966o220l2089K1705J3666
11090F6866l0547j597J2772j8161j00191j0361n8758Q7156J00958m5344p557k4629
11078b9393k8783m5075N6690J9192J7197J2926l7806K9406O1114o4651r1172k6992
11066a27347J3157P7231L9767n9308N0597P8120N396k8289n3624m61j875j3583
11054b0219r47m4410M25M8473M0960M9645K0928n0909l4151M4886P6779J8348
$$ y = [-71114, -24879, -11444, -21985, -20947, 5865, -3835, -110099, -205182, -137213, -79687, -27693, 87594, 82468, -35952, -52680, 55941, 58165, 28091, -12901, -38908, -26320, -86022, -89569, -91371, -72244, -28828, -21125, -30257, -39207, -71397, -70080, -29329, -36064, -6897, 20055, -27756, -42775, 8855, -23626, -74634, -62062, -33472, -28471, -6162, 69804, 63584, 31495, 53200, 66866, 36319, 34722, 47494, 29333, -70858, -81219, -139977, -52821, 48137, 2793, -4764, -29393, -58176, -103251, -46561, -27369, -10172, 2754, -35052, -5646, 55468, -9183, -100355, -127347, -114190, -36959, 2808, -56500, -5903, 72217, 77613, 49324, -4300, -4761, -6636, -20219, -21166, -65576, -65151, -16678, 24282, 73927, 94855, 43946, 9795, 54681, 131460, 149808]
11042A49808l6470k8271j3445m0860O2032L2497o4727q757N7705J626n5638k5930
11030B9570J4039L1770o2284N0535K206j1029K0686l6550N2421k2447o3966m7366
11018d2415P60K1212M2414P748j2261L197o1274m0564M7414N3253m1207j9165
11006d0888J865K5809N6424K9100M998K497j1076k5188l7112j0535r5040L3467
10994f5679N2116k3011M617M8208n800n7701J3072k1554n5574l5174r322M2860
10982a12942P4753Q9375J9383k9621j4284N989r185J0302o1105p326o461N1646
10970A0524R572o829L3232M5941p642n6159k7627l6633p7305N2887N4946J3873
10958H780j8382O5110P6610j8277q589k1047n6451n520N7173m9079p1627n7235
$$ y = [149808, 113338, 85067, 71622, 30762, 92794, 125291, 60564, 51807, 109512, 111138, 55500, 29570, 43609, 75379, 13095, 63630, 65836, 54807, 75493, 38943, 91364, 68917, 4951, -42415, -41655, -20443, 21971, 29719, 17458, 20655, -40619, -81183, -33769, 19484, -21723, -40888, -39023, -13214, 43210, 72310, 77308, 79805, 68729, 43541, 6429, -4106, -99146, -65679, -13563, -36574, -31957, 16251, 10451, -47250, -34178, -55732, -111306, -146480, -155802, -112942, -38189, 51186, 70569, 40948, 26664, 32653, 23468, 33770, -27335, -34661, -41122, 10524, 20096, 13267, 46499, 92440, 84798, 28639, 1012, -35621, -112926, -60039, -5093, 8780, -9602, 55508, 132118, 113841, 105252, 84205, 27754, 22234, 79407, 30328, -41299, -98534]
10946i8534K549K4094J5688K9290M6106M9658k7528O5480j692J763Q684l2755
10934H2803j5490o8393J1904K5595l5859r199J9904K2956j05762k4871J0577k1471
10922a07306L1866k731j1953K078J5379M0586l8492K6239L6307J3278J1587l9652
10910b2814J2624k5218j8577J7035M3317k1672K2221M0248q1517q2670m008K9104
10898i1927P0455K3351l2045P286r277m9521J0429N4099K5879j5207p633l390
10886a7501K0633K687K5101L1652O049N714l455k181K5660o4602n7642M1011N34
10873A3660m4817l3793N5729m302q575M8563n7940j8696O731L5000L1024j200
10861B1384m217Q828j4498m6471K7873K774j8009k0692N1352O9662K5660l816
$$ y = [-98534, -95985, -71891, -56203, -26913, 19193, 68851, 41323, 106803, 105111, 106874, 115558, 82803, 67313, -1080, 10824, 36419, 560, -8639, 11265, 34221, -71541, -96412, -85835, -107306, -75440, -78171, -90124, -88046, -72667, -32081, -70573, -44334, -8027, 5251, 16838, -22814, -10190, -35408, -53985, -36950, 6367, -15305, 6916, 47164, -34353, -117023, -121031, -91927, -21472, 1879, -30166, -22880, -32157, -81678, -71249, -17150, 8729, -6478, -14111, -17501, 3132, 5819, 30920, 62572, 68621, 74335, 70880, 68699, 94359, 29757, -27885, 13126, 13660, -31157, -64950, -9221, -13523, -22098, 26465, -31475, -50171, -43440, -8440, 22584, 21384, 17167, 25995, 11497, -34974, -7101, -4327, -22336, -43028, 8324, 77986, 103646, 99830]
10849I9830O97J25306J56032K03946j1515j18443k13426j16455k0062o3438O529
10838D9001m960M258M9833k1907n4745l5066N7173N834l9926M175Q2682k8859
10826F7493q9718l0345K9455j4498q898N130L1730j569O5466L0482O0037j3940
10814A30825m917K9870O4859N1693m765k1630q8457p1981L036N783l3878j9290
10802D1148k3146m2277N7464J9251L0276k1266l869J7689l7711r500M7983K4265
10790A00307k8629q3736k031N7052J0260N988n2061N9636N5481q1859k3012N4001
10778G1397k2408k7483J7863q700m5892j00880k4642J16039J07650m2424j07043
10767f6523L9857P4397L0271j8971n5660l5047M2776L6507K5820m5720N82p7206
$$ y = [99830, 100527, 225833, 381865, 585811, 574296, 455853, 242427, 125972, 105910, 42472, 49001, 44041, 48299, 98132, 76225, 21480, -13586, 43587, 49421, 9495, 13670, 96352, 67493, -22225, -52570, -23115, -37613, -46511, -41381, -9651, -11220, 54246, 84728, 144765, 130825, 125908, 155778, 220637, 272330, 267565, 245935, 157478, 85497, 88533, 94316, 60438, 41148, 18002, -24275, 33189, 52440, 82716, 61450, 57581, 75270, 37559, 28059, 76042, 100307, 71678, -12058, -14089, 42963, 53223, 59211, 7150, 66786, 122267, 40408, 17396, 71397, 48989, 21506, 39369, 30669, -15223, -116103, -140745, -24706, 82944, 40520, -66523, -26666, 47731, 78002, 59031, 3371, -31676, 11100, 47607, 73427, 27707, 28289, -48917]
10755d8917J5755R9425O5334P5856J79445N6706M2250j03547j31554q9405o7660
10744I3688n6584L8996K3983r2104o0025Q7747M4795J5239P428L3277J988p4808
10732F3620J2631j8369j9271j9690l6488n1789J2343Q242m352J7812M7389K1065
10720C3143R08k5047l5608L156L413j2642n3240K4682M5386J7853l9508L403M6392
10707A2291l6430k0540M8986m3780j4613K8365r4615m829O5663O1317l1000Q676
10695b0509K7948N3924l7961j0619K1248k9003J9967m5968k7949n0456K7028Q1273
10683H923l3896K6960l443K2669m1703J3544q078j5919J2608J0176L2768M5188
10671F9797n1235q173P5519J3325o4172l9016O814K0822k8416m6752J0063Q496
$$ y = [-48917, -33162, 66263, 131597, 207453, 386898, 443604, 485854, 382307, 250753, 161348, 93688, 37104, 76100, 100083, 7979, -52046, 35701, 80496, 95735, 103163, 136440, 138428, 63620, 76251, 57882, 38611, 18921, -17567, -69356, -57013, -48771, -53123, -35311, 12078, 33143, 34051, 9004, -26604, -23448, -20035, -32677, -85917, -61235, -15849, 2004, -37504, -34101, 12291, -24139, -44679, 4307, -39473, -54086, -25721, -120336, -125165, -59502, 1815, -29185, -20509, 7439, 61363, 23402, 12783, 34031, 5028, 24995, -20973, -48922, -99378, -72350, 8923, -24973, 1987, -1456, 21213, -20490, -6946, -15024, -30943, -18335, -8159, 24609, 69797, 18562, 10389, 85908, 99233, 35061, -3955, 2859, 23681, -4735, -51487, -41424, -32928]
10659c2928O61j0053L3579P3732J9903l2129k2170p8366j0430P6946J8706K4578
10647F2029k1429n9110N3320K1346l6427n770R79j5917K0022Q446l4091j6265
10635b2867k807J5814j0467j04938n5576O0534J07008N0699p393l2770J5575J3612
10623B6424m5231K4391L7066N555k7808n9057n7424L8947Q7624L3753p2862l179
10611a1801J5010K672o2957K7634Q682k3706O718L3606j2965P01k5988n8943P796
10598i3541L0404N6532k0259N813M5673K9450R6588j7671n6000l7140m6569N4549
10586D7829O1752p0398r223K7643m4748l8957J9761O4096Q654p0225j0763J06846
10574I2267l2512n3751j8005o2194n993M0912o1278O9668K6259P093k6448o2725
$$ y = [-32928, -32267, -42320, -8741, 64991, 84894, 52765, 30595, -47771, -58201, 18745, 37451, 62029, 40600, -18510, 34810, 56156, 19729, 13959, 14938, -979, 19043, 27489, -6602, -22867, -25674, -9860, -20327, -125265, -180841, -120307, -13299, 37400, 30007, -2763, 12812, 26424, -18807, 5584, 42650, 48205, 20397, -38660, -96084, -57137, 30487, 64240, -8622, -11801, 3209, 5881, -57076, -29442, -20760, -44466, -37748, -4142, -17107, -16406, -42394, -101337, -93541, -63137, -6605, -26864, -21051, 24622, 54072, 150660, 132989, 76989, 39849, -6720, 47829, 109581, 39183, 29960, 57603, 12855, -26102, -6341, 57755, 66409, -3816, -14579, 92267, 59755, 6004, -12001, -74195, -80188, -39276, -100554, -30886, -4627, 2466, -23982, -86707]
10562h6707l6862O9146N7857k0198p375M2036N2013p7125j3990M3924m6850J092
10550b3039j8089L498N3925M9084N1233O5506N575k8149m6321m1445J7919O3248
10538A52945P5537m4177p5833r5099o6284K4571K1902L7524j448p8722p2232M2819
10526g8497J0001K4654K5305j3252j8026o6973N4197N9305m3962m9460R933j2208
10514i8983K0748K7986j9467m4103K3876J0111L0259R0336l7466M271j3918N8670
10502E2320O4110j6389n8695j3147K6549k4896n1191j01352l8087n180K2199R6616
10490d7143L6511m1034J4051Q726L7119J3309K6539N409M2406L70k7845K4017
10478I2435q2295j4055P7001K0588J5398J6542o8004n9753j9251M8879k075P659
$$ y = [-86707, -123569, -54423, 3434, -16764, -24139, 17897, 69910, -7215, -21205, 22719, -24131, -23039, -41128, -37630, 16295, 65379, 116612, 182118, 187693, 159544, 113223, 71778, 89697, 152945, 228482, 184305, 108472, 13373, -52911, -28340, -6438, 31086, 29638, -49084, -121316, -78497, -68496, -43842, -18537, -31789, -49815, -116788, -62591, -3286, -47248, -96708, -86775, -98983, -78235, -50249, -69716, -113819, -89943, -79832, -49573, 40763, 3297, 7568, -6350, 52320, 116430, 100041, 41346, 28199, 54748, 29852, -21339, -122691, -160778, -165958, -143759, -47143, -10632, -51666, -37615, -28889, 8230, 21539, 48078, 53487, 95893, 96263, 68418, 92435, 10140, -3915, 73086, 93674, 109072, 125614, 57610, -2143, -21394, 27485, 25410, 33069]
10466C3069L5378j6169p1857k9493n8067m534O5801k4960q434K0267K529L6175
10454b0295M8566K3564n1739j5535N1718L5312o4561o195J0958p9094n2805M1956
10442g8150J18449K0806r4160r4897m620J45876P0642J7166j889o9024o689N7253
10430H0763L0715L4127K5509k9772l1196o5763o7785K052j8801L182N4397J0730
10418B8158k0307l3527K1257K3865J361n2154J2541j6239M9195M079J6602m9748
10406a4917k1168k2940O3567L30l4621L9399M8950P0607j8403N57p6098q2896
10394d7633R668j6514K1519K1516l3348N8696L5542J5539l7211n044O5918m3630
10382D5018p2650k6028l2985R0694P1951p486n281n1278p8746k2640N5087L9193
$$ y = [33069, 68447, 52278, -19579, -49072, -107139, -111673, -45872, -70832, -79266, -58999, -56470, -20295, 28271, 51835, 96, -15439, 36279, 71591, 7030, 835, 11793, -67301, -120106, -78150, 40299, 61105, -33055, -127952, -132572, 13304, 83946, 101112, 99223, 30199, 23510, 80763, 111478, 145605, 171114, 141342, 110146, 44383, -23402, -21350, -40151, -36969, 17428, 28158, 7851, -25676, -4419, 19446, 20807, -31347, -18806, -35045, 14150, 18229, 34831, -14917, -36085, -59025, 4542, 4872, -29749, 9650, 58600, 129207, 110804, 111361, 35263, -47633, -37965, -54479, -32960, -11444, -44792, 13904, 49446, 64985, 27774, 22730, 88648, 45018, -27632, -53660, -86645, 4049, 76000, 68514, 63233, 11955, -66791, -89431, -34344, 4849]
10370D849O1108q3234o2044J05749J12032K2735p6391K3747q8019o4139j8984
10359f2591j2295n7055Q1984J54179k4695o4884l2402J0285M6298O1910k6217
10348G4517l7700J1937m6852J0589j417J3248J7287k6717O7303L9535l1972k4576
10336F5182j5735p3755k1934l5450q3972K2384P6770J2506q786n4485j4697R5490
10324c6482L9067m1282K6381L9508k1992M6644L2666J3018m4841n8576k7070N2663
10312A9704m9354j3298O681L9817L2972m3972j14547L613R1716R369O0548k3025
10300B0224n714n3527k4703j1061P6792m8018l9785k1327q324R3104P4218O6539
10288A18418l4164j4335M8729j6446m5176j0670L0502L760p0584l3528o1250P82
$$ y = [4849, 65957, -17277, -79321, 26428, 138460, 161195, 84804, 108551, 20532, -43607, -62591, -74886, -131941, -49957, 104222, 79527, 14643, -17759, -7474, 38824, 100734, 74517, 36817, 48754, 1902, 12491, 11074, 24322, 41609, 14892, 82195, 121730, 89758, 65182, 49447, -24308, -46242, -81692, -165664, -143280, -66510, -54004, -62790, -117275, -131972, -36482, 2585, -38697, -12316, 27192, 5200, 51844, 84510, 97528, 52687, -5889, -32959, 19704, -29650, -42948, -36267, 3550, 36522, -7450, -121997, -118384, -26668, -17299, 43249, 20224, 14510, -39017, -63720, -74781, 2011, -46007, -85792, -107119, -115443, -22339, 51879, 118418, 84254, 69919, 118648, 102202, 57026, 46356, 76858, 80618, 10034, -23494, -84744, -83962]
10276h3962M7515L7911m6537k5056N9299L6242j8406J0234J124N4330K6122K1835
10264A20651o6560j7728J1572l6332l3547J3499L5544K8074j1893k4200l612k0742
10252e274l3744m2201M8626n600J9272O3634N423n1757O1065N4277n9295j13213
10240e8787O1436K4100r9430o0162K1339J065l0299M2317J06354l1250m824K6594
10228a547K3184l2860j2738M6404L0793r819J2488k0590l6750q3631k8036n5399
10216a68501k692N8673K2387K8857K4126m8509k7830Q9859q521M484M0216Q377
10204B0926M977j2086o0120l3433p332O0270o84R529r368m2024m1041l305L4456
10191g9235J3103J764n586O491K1180l4740j8184k0755n6632j435J04566Q2789
$$ y = [-83962, -36447, 1464, -45073, -70129, -10830, 25412, 7006, 17240, 18364, 72694, 98816, 120651, 54091, 36363, 47935, 11603, -21944, -8445, 27099, 55173, 43280, 19080, 15468, -5274, -39018, -81219, -32593, -38193, -18921, 44713, 50136, -1621, 59444, 113721, 54426, -58787, 2649, 26749, -72681, -132843, -111504, -110439, -140738, -98421, 7933, -23317, -28141, -1547, 21637, -11223, -23961, 22443, 53236, 43417, 55905, 35315, -1435, -85066, -113102, -168501, -171193, -112520, -90133, -61276, -37150, -85659, -113489, -23630, -32151, -27667, 12549, 20926, 25903, 13817, -46303, -79736, -87068, -26798, -27482, -17953, -27321, -69345, -110386, -113691, -79235, -66132, -64368, -69954, -63463, -42283, -77023, -95207, -115962, -172594, -174029, -69463, 13326]
10179A3326k7172n4227n1476O795Q0430K919j0038K4523J2315K8102k6359O084
10167E222l4228k7018L4902K8844j5713K3553n6664P051M3479K2345L7807K3517
10155I3097N455l6801Q563O4348j541n4540o3159Q6410n6020k6588J7996O512
10143D3732j2497J0220O259j4193O932j5498L911l6199j4203K5885k2052p6118
10131i3821K4765K3306M6038J12k7659O116q4132j3074P0264L2401J3879J0117
10119H312n972m1822k3060J4521M5245j1574l1077n0250L0659m2n3905N6683L3392
10106b8890K6396j6448m6455N215M2512M3060J0685o6670J5458P35l5771J2098
10094c8075M6404n6112k6876J1942N123j9610P841l7981J7394N2592J3824N179
$$ y = [13326, -13846, -68073, -119549, -112754, -32324, -29405, -39443, -14920, -2605, 25497, -862, 5222, -29006, -56024, -21122, 7722, -7991, 15562, -41102, -34051, 9428, 31773, 69580, 93097, 98552, 61751, 70314, 134662, 133121, 78581, 15422, 101832, 45812, 19224, 37220, 43732, 31235, 41455, 47714, 33521, 40453, 24955, 28866, -7333, -21536, 4349, -17703, -93821, -69056, -45750, 288, 400, -27259, -21143, -105275, -118349, -48085, -15684, -1805, 8312, 2340, -39482, -62542, -48021, -2776, -14350, -45427, -95677, -65018, -65060, -118965, -62282, -28890, -2494, -18942, -65397, -60182, -17670, 25390, 36075, -30595, -15137, -14402, -50173, -38075, 8329, -47783, -74659, -62717, -57594, -77204, -69363, -107344, -89950, -37358, -23534, -18355]
10082a8355J846n0243l5522J7711M7343L5983J0049k0457k9632K6726L8556O7340
10070I1345M02N3552k829j3910o2403l2565l7048M1186n0954n1889K9006o239
10058d2346n1487L3251l1207J524P210N3257Q20M2132P9967K2422o683l8820l1687
10045C8353k9817m1478P482k9215N7061p781q8621L225O944J8971R8351L3592
10033F7067M1731N8489m0241j27358n3336l6665O8094Q6854j3413K0074L1055
10022A02351m7415m4992m9383J7073K2346P1101L7815j832n5611K0274J104o5212
10010G619m2991k5768m7451J1964J7457l1298M1515J9975l0599j51R735L0515
9998c9478q0472J4441M0749j9407m5486l1712M6282R9655L0059k031l8065l0427
$$ y = [-18355, -16509, -66752, -102274, -84563, -37220, -1237, 8812, -11645, -41277, -14551, 24005, 91345, 91747, 145299, 142470, 128560, 66157, 33592, -3456, 37730, -13224, -65113, -36107, -42346, -93833, -60582, -91789, -90265, -83055, -29798, -28978, 13154, 93121, 115543, 108860, 70040, 38353, 8536, -32942, -25460, -54675, 2386, -5395, -94016, -90791, -83847, -64876, 33475, 67067, 108798, 167287, 127046, -312, -53648, -90313, -22219, 64635, 51222, 71296, 102351, 54936, 9944, -39439, -22366, -20, 71081, 108896, 107064, 51453, 71727, 72831, 7619, -35372, -61140, -108591, -96627, -79170, -110468, -68953, -48978, -79577, -79728, -69993, -39478, -119950, -105509, -64760, -84167, -129653, -161365, -115083, -15428, 14631, 12600, -25465, -55892]
9986e5892j7529N0172O9769j6619n0522n0558j5242J070N7418o024K7442j4946
9974b1461j0661K4994M7068P824r1516k063J6138M0276M0185k7035n4652J2007
9962a8896O6252j9149o0139L9273R666l6122L500M7361J1469o6536m7109L2865
9950c7565J2327k4923N0474l3875j3700q080m7934J9322N1683o4912m1657k0462
9938a59302O1609P6911l6483L1269O2290J8214m1869n2085k8731n569M4652M6084
9926A6990m6226l9945N945L9604O8287N4797K4986l4345m983L9438O777m8375
9914H2950o1281m1919k0261O4284L4197L4380r5209r770N1953L1877K6700r3946
9902C955q9691l1631M3760R1755j4669J1461O9065N7991J6248l7809k0032n1910
$$ y = [-55892, -73421, -23249, 46520, 29901, -20621, -71179, -86421, -85351, -27933, -33957, -6515, -21461, -32122, -7128, 39940, 47764, -43752, -45815, -29677, 10599, 50784, 23749, -30903, -18896, 47356, 28207, -31932, 7341, 17007, -19115, -15615, 31746, 43215, -23321, -70430, -37565, -25238, -50161, 313, -33562, -47262, -55342, -103276, -83954, -32271, -97183, -138840, -159302, -97693, -20782, -57265, -25996, 36294, 54508, 12639, -39446, -68177, -73746, -29094, 16990, -29236, -69181, -63236, -23632, 44655, 99452, 124438, 90093, 85110, 124548, 131325, 82950, 21669, -20250, -40511, 23773, 57970, 92350, -2859, -12629, 39324, 71201, 97901, 3955, -85736, -117367, -73607, 18148, 3479, 14940, 84005, 141996, 158244, 120435, 100403, 48493]
9890D8493m7481K9897K3835n7886n4365O5938J1377l32k9230n2412j7361J9552
9878e9975q579j4967N9515M7818j5970q0761n7103P520K3373k4798J6099L9053
9866f8775j2017q173Q1650R675r555J2665j7981k3314j3520L0054L3471L2373
9854D6553J1399l866j7701O368j6298M4949m8071q4079N9716K0999q3118l0674
9842i3823R905P1929m0243m0433J2510j7858M2317J05799K3021p3218n475J5500
9830I931Q443K3645p5635m0150Q2003P5718L9521j6894n2486j64K0274J6762q331
9817H2637P91J0708Q205k9924k2992m5314J3021R88r5476l7246K5209K678Q3715
9804c000Q0606r192n4923l7028k1946J8652l3709M8940J0259n0510O527J8587
$$ y = [48493, 1012, 30909, 54744, -3142, -57507, 8431, 19808, 19476, -9754, -62166, -79527, -59975, -68554, -83521, -24006, 23812, 7842, -72919, -130022, -122502, -99129, -123927, -107828, -68775, -80792, -88965, -7315, 2360, -7195, 5470, -12511, -35825, -49345, -19291, 14180, 46553, 57952, 54086, 36385, 42753, 26455, 71404, 23333, -60746, -1030, 19969, -63149, -93823, -83918, -11989, -52232, -92665, -80155, -98013, -55696, 50103, 73124, -94, -5569, 9931, 18374, 42019, -33616, -73766, 8237, 83955, 123476, 106582, 54096, 53932, 74206, 90968, 82637, 83428, 94136, 102341, 72417, 49425, 4111, 17132, 18120, -77356, -114602, -89393, -86715, -3000, 77606, 68414, 13491, -23537, -45483, -26831, -60540, -11600, -1341, -51851, -45324, -26737]
9792b6737j6104O418J05264J345p6525n6729K9185K7573K5453o6408M9812p27
9780A820J6868p646J3556j763P4922K3838n9294p3663m7065M0745l0210m9925
9768i7817N2416j2855k2970Q5708o5742l5207m8818L5437M8321L8251L092J803
9756a8381K4466K5382J6520M1857j7901r269q8184p811j130M464j2213M812N7298
9743A9910K5561k2530K9172P0585K963n0798j2674j2263j24088N049R5088o89
9731B5286O274L0024p598M4333K1466j1551K0513K5451J3816n0084r0990l902
9719B3038j5452m1888L6308n1294L2399M912K3842R440j5139k9069M5596M1930
9707F4623r683m2599o6600L5252J9098K0480o3511n1137K7998J4165K4329O7652
$$ y = [-26737, -42841, -36423, 68841, 70186, -6339, -63068, -33883, -6310, 19143, -47265, 2547, 1820, 18688, 11042, 24598, 22835, 97757, 121595, 62301, -11362, -58427, -17682, -47892, -97817, -45401, -58256, -81226, 4482, -61260, -96467, -145285, -109848, -61527, -23276, -20184, -18381, 6085, 31467, 47987, 89844, 71943, 62674, -25510, -33321, -34451, -29987, -42200, -37388, 19910, 45471, 22941, 52113, 122698, 125661, 74863, 62189, 49926, -74162, -69113, 25975, 25286, 31560, 61584, 53986, 98319, 119785, 108234, 128747, 154198, 168014, 117930, 26940, 23038, 7586, -34302, 2006, -49288, -16889, -11977, 11865, 21305, 6166, -22903, 22693, 64623, 54940, 12341, -54259, -19007, 91, 20571, -42940, -94077, -66079, -51914, -27585, 40067]
9695D0067N9502M7132p912K6775j341j8527o880j22141L181J852k6922l173l273
9682a1660M7813K2008k3977L0736j8888m8718k8432j3920J4297M3021j7540k5070
9670c0330K5909J5848k5753m7296P5385L0637m7710K6107K3840J2608M4413j6731
9658H6927n9725o9722p2166K4248n362K7744j867l8795N7694l9037l5275J2342
9646a12994R5090M1459k4385j5999j2764P4678N514q1240L4743J30026L6730J1416
9634A82274l9350r4483p0187j4706L3646M108M020J7469n2872M8599N8591R501
9622H6610l3398j17069m278O7539L0319K3823R605n9070k7735K6023O1360L0747
9610I4476L7656j701o5437k7237j3899m6341K0661J4062J5750n6684J6377l425
$$ y = [40067, 99569, 146701, 138789, 165564, 164223, 145696, 138816, 16675, 19856, 21708, -5214, -8387, -11660, 36153, 58161, 34184, 64920, 46032, -2686, -31118, -45038, -30741, 12280, -5260, -30330, -4421, 11427, -14326, -61622, 13763, 44400, -3310, 22797, 46637, 59245, 103658, 86927, 27202, -42520, -114686, -90438, -95800, -68056, -69923, -108718, -51024, -90061, -125336, -112994, -17904, 23555, -830, -16829, -29593, 45085, 50599, -30641, 4102, 134128, 170858, 182274, 142924, 48441, -21746, -36452, -2806, 1302, 5322, 22791, -30081, 18518, 77109, 86610, 53212, -63857, -68135, -596, 29723, 53546, 63151, 4081, -23654, 2369, 63729, 94476, 132132, 130431, 64994, 37757, 23858, -22483, -1822, 12240, 27990, -28694, -12317, -15742]
9598a5742m5725j0834k9929m3138N4455Q7399N3637j0383m3564j6682k530j6563
9586c9599K4434M1146L7391m4126p2305J0574P567k4404L1717j9408M4532L4196
9574C1715k9200n3503j5697L0147m7285N0387P1815p940q1409O873L1298n669
9562a8468k1269o8743l1006N4007M9903r420J6962l6046l2931k6859L3137O026
9550h4707m3159J2607O4978L0703J9093R207m5213N070L8037o7696n2333M1376
9538g2037R8664M412q0360m292k2644M1864M4822N3951K8893m5301l1425j5887
9526F60l4349L6362N2834m2168n4341k7078L5250q201Q1360O6161o5252q5352
9514d4114m1548j8598O0320j9566k191m217L3521J13711j4328m7295n6676J9124
$$ y = [-15742, -61467, -72301, -102230, -145368, -90913, -3514, 50123, 39740, -3824, -20506, -23036, -39599, -15165, 25981, 63372, 19246, -53059, -42485, -34918, -59322, -27605, -47013, -2481, 31715, 2515, -50988, -66685, -36538, -83823, -33436, 38379, 30439, -50970, -44097, -12799, -18468, -39737, -108480, -139486, -85479, -35576, -44996, -28034, -64080, -97011, -123870, -90733, -84707, -127866, -115259, -50281, -19578, -485, 8722, -36491, -31421, 6616, -61080, -113413, -72037, 26627, 31039, -49321, -53613, -76257, -34393, 10429, 64380, 93273, 47972, 16547, 660, -33689, 2673, 55507, 13339, -41002, -68080, -32830, -41031, 40329, 106490, 41238, -44114, -85662, -104260, -43940, -63506, -65697, -69914, -36393, 77318, 62990, 15695, -40981, -21857]
9502b1857r783o302P902M6739M2952l4005O823r451M0024n1458j3471Q395K0696
9489B7204M7967k7218K8556M832l5807j19054j4319L2709Q2753K396J4427l1674
9477A2772n6220K5250j9825J1246N8828n228k7667M912j195k4324L4101k5176
9465a2526M2263M7822O0320L077l3117r1247n5354J01696O6171j8124R756J8467
9453A39204K7665L3223j01802l9956j6767j3387L921l8626L429J2730N0822L3947
9441I4403J8869k8595m4598J4927l6862m8679J7651M6754N6451M5516J2651j5379
9429A33109m1823j02839n9979j535L2838L1287k1780l7903K931J5319K3879L1360
9417D864O324k5700M4336P988l4034p5307m8194M6051k2065j973K0066O6602M410
$$ y = [-21857, -31640, -37942, -30040, 16699, 59651, 25646, 32469, 23018, 63042, 11584, -1887, 6508, 27204, 75171, 47953, 76509, 81341, 45534, -73520, -87839, -55130, 27623, 30019, 44446, 12772, -43448, -18198, -38023, -26777, 32051, 26823, -844, 4068, 2873, -21451, 12650, -12526, 29737, 77559, 137879, 140956, 107839, 16592, -38762, 62934, 129105, 110981, 120737, 139204, 166869, 200092, 98290, 58334, 41567, 28180, 32101, -6525, -3096, 9634, 60456, 94403, 113272, 84677, 40079, 55006, 18144, -30535, -12884, 33870, 90321, 135837, 148488, 133109, 91286, -11553, -71532, -73067, -40229, -8942, -30722, -68625, -65694, -50375, -26496, 4864, 11188, -14512, 29824, 37812, 3778, -71529, -119723, -73672, -95737, -97710, -77644, -11042, -6632]
9404f632k0800O1836J5533J9940j0597K0199J9965j3327j0689m2664n8231o2324
9392h7791J5326M2448J5406k6619K4666K5631J3779K9421O6089j7183m283N059
9380A01949l3334r758m545M9460O4699j3313j01742n9015l5790L116J3166J3556
9368a1551K0104N2397L3456n1705m2332J7183K5025k0244l0172k781L0881K360
9356B2621o2500j6562M8972O1216L8200K2551J1544k9470P054o6040o4697K3368
9344c743J8814k0553j1714n3497l2258P310M4452O6132K8253m2627o303m3906
9332d9640P3111m97o8908k378J1841N6935M393m3872M6855J00687n609j6213n7508
9319D9197o3361p354L1424k06K7712l081k1057k5801J2058K8131j3694L8288L3049
$$ y = [-6632, -27432, 34404, 49937, 69877, 59280, 79479, 99444, 86117, 75428, 32764, -25467, -87791, -72465, -30017, -14611, -41230, -16564, 9067, 22846, 52267, 118356, 101173, 96890, 101949, 68615, 58857, 54312, 103772, 168471, 155158, 53416, -5599, -41389, -38273, -25107, -11551, 8553, 60950, 94406, 42701, 369, 17552, 42577, 22333, -7839, -10620, 20261, 22621, -39879, -56441, -7469, 53747, 91947, 114498, 126042, 96572, 103626, 37586, -27111, -3743, 15071, -5482, -17196, -70693, -102951, -95641, -51189, 14943, 43196, 569, -5734, -49640, 23471, 22974, -45934, -48312, -36471, 20464, 24857, -19015, 27840, 128527, 122918, 106705, 49197, -14164, -21518, 9906, 9700, 37412, 34331, 13274, -12527, -469, 27662, 13968, 52256, 85305]
9306H5305l7399q9378K3434O129K8974l9734o1634Q120j2039Q466L0001j6401
9294f6156j41128k5834J01701O0415Q6955l7039J1785L859N7535Q4615k1506o5862
9282D9340m4706q0807m058P2922P8971k7250n3076k3215K1751P4269N3162m5989
9270G1314K3622J6861r0545J7252L8103L8394k630N350m5596K9204k9426o0997
9258A0906n6609p703k1303K6500K1704K5347K5377k0122J4403L5905J4303O7221
9246A35929r382l7360P397l0578M4039j6688r9150n84N0772O7516n9255j912N0116
9233A00860K3525o9268L832K3215m1914k7237n4791m7727M0263K0349N2980M1944
9221F6031n9957j07486O9562J06314J7890j7063K6985j3218M0631l8233r8963
$$ y = [85305, 47906, -41472, -18038, -11909, 17065, -22669, -84303, -76183, -88222, -79756, -49755, -66156, -207284, -233118, -131417, -71002, 15953, -21086, -9301, -5442, 52093, 136708, 115202, 49340, 4634, -76173, -80231, -7309, 71662, 44412, -8664, -31879, -10128, 64141, 117303, 71314, 94936, 111797, 21252, 38504, 76607, 115001, 112371, 117721, 72125, 101329, 71903, 10906, -45703, -53406, -74709, -48209, -26505, -1158, 24219, 4097, 18500, 54405, 68708, 135929, 126547, 89187, 96584, 66006, 110045, 93357, -5793, -6377, 44395, 111911, 52656, 50744, 100860, 124385, 55117, 58949, 82164, 40250, 13013, -41778, -89505, -49242, -28893, 24087, 66031, 6074, -101412, -31850, 74464, 92354, 75291, 102276, 89058, 129689, 91456, -7507]
9210g507m4331N5102L1443M326M6917j7242L3618N7796l7516r4794m6569M8509
9198B9752K972J0854J1535Q803l4506L8381M3584J2590o08m4378j6430O0980L7084
9185A60613l8285K5283L8908m9489J1489R0931M9371j00474O4731L1130m0387
9174B43821l9084L3856M9138L6761j0006l5112L3235J09028r575P9625P5117J05945
9162F72749P7051Q7485M3037M6846R0904J14689K07221K59298L05364M89884P40973
9151C135501J073624J519152K553235M885621Q914983J2063370Q720359K889779
9143D5755624k816199j0209805j0769796o645330l771011k208374j430120j044391
9135F860598p39791n68812m42834l56992l23455k93257k00017k01401j81926j86785
$$ y = [-7507, -51838, 3264, 34707, 39033, 85950, 68708, 102326, 160122, 122606, 27812, -18757, 29752, 32724, 43578, 55113, 63916, 29410, 67791, 111375, 123965, 123357, 78979, 62549, 123529, 160613, 122328, 147611, 186519, 137030, 148519, 239450, 288821, 188347, 253078, 284208, 243821, 204737, 238593, 287731, 324492, 314486, 279374, 312609, 421637, 412062, 491687, 566804, 672749, 749800, 837285, 880322, 927168, 1018072, 1132761, 1339982, 1599280, 1904644, 2394528, 3135501, 4209125, 5728277, 8281512, 13167133, 22082116, 34145486, 42865845, 45755624, 42939425, 32729620, 21959824, 15314494, 11543483, 9335109, 7904989, 6860598, 6120807, 5551995, 5109161, 4752169, 4428714, 4135457, 3935440, 3734039, 3552113, 3365328]
9125C365328j78892k01385j81966r1025r7819j29099j24809n1066r8209q9792
9115B121266p7802k2747j26013j48110m7119m8023j8368j0028j8364p5487p0445
9104A458760q4638n09L6852k2594j01808p0945j8548n3367o6374k0520J0421m5973
9092A020757k9510K9353l9519k4335k0112m834n4440o211l0692m2815n1105r9983
9080F46554J1291K1647l6734m0760m3729J270O5569M41k9779R915j9559o1552
9068E24574p7405J2946N8071n1178r8021L0677N7006l8937M774m1559k9480J3689
9056C65157M1721k0076R212J1107m4761j8568j277n1906J1694K5661K9236P288
$$ y = [3365328, 3186436, 2985051, 2803085, 2712060, 2614241, 2485142, 2360333, 2309267, 2211058, 2121266, 2043464, 2020717, 1894704, 1746594, 1699475, 1651452, 1633084, 1623056, 1604692, 1529205, 1458760, 1374122, 1373613, 1410465, 1387871, 1286063, 1215118, 1196570, 1143203, 1076829, 1056309, 1066730, 1020757, 991247, 1020600, 981081, 956746, 936634, 931800, 877360, 871149, 840457, 797642, 746537, 646554, 657845, 679492, 642758, 601998, 558269, 559539, 625108, 625549, 595770, 605685, 586126, 524574, 447169, 460115, 518186, 467008, 368987, 399664, 456670, 417733, 422507, 380948, 351468, 365157, 406878, 386802, 396014, 407121, 362360, 343792, 342515, 290609, 302303, 327964, 357200, 364488]
$$ [...]
##END NTUPLES=NMR SPECTRUM
##END=
