##TITLE=Analysis number 316845
Compound Code mwp 00078
Project Code adrs
Chemist Name endeavour
##JCAMPDX= 6.0         $$ Bruker NMR JCAMP-DX V2.0
##DATA TYPE= NMR SPECTRUM
##DATA CLASS= NTUPLES
##ORIGIN= Bruker BioSpin GmbH
##OWNER= nmr
$$ XWIN-NMR		Version 3.5
$$ Mon Jan 30 08:29:47 2006 GMT Standard Time (UT+0h)  MAYBRIDGE\nmr@NMR_250MHZ
##.OBSERVE FREQUENCY= 250.131544655141
##.OBSERVE NUCLEUS= ^1H
##.ACQUISITION MODE= SIMULTANEOUS (DQD)
##.ACQUISITION SCHEME= undefined
##.AVERAGES= 16
##.DIGITISER RES= 18
##SPECTROMETER/DATA SYSTEM= dpx250
##.PULSE SEQUENCE= zg30
##.SOLVENT NAME= CDCl3
##.SHIFT REFERENCE= (INTERNAL, CDCl3, 0, 16.522)
##AUDIT TRAIL= $$ (NUMBER, WHEN, WHO, WHERE, WHAT)
$$ ##TITLE= Audit trail, XWIN-NMR		Version 3.5
$$ ##JCAMPDX= 5.01
$$ ##ORIGIN= Bruker BioSpin GmbH
$$ ##OWNER= nmr
$$ C:\u/data/dgb/nmr/ADRS/15330/pdata/1/auditp.txt
$$ ##AUDIT TRAIL=  $$ (NUMBER, WHEN, WHO, WHERE, WHAT)
(   1,<2006-01-30 08:29:19.53 +000>,<MAYBRIDGE\nmr>,<NMR_250MHZ>,
      <created by zg, POWCHK disabled, PULCHK disabled
       configuration hash MD5:
       62 19 C7 07 E1 42 D1 B7 37 6C 3D D0 77 39 F9 E6
       data hash MD5: 64K
       19 BD CF 47 AB 75 31 F1 94 C4 D9 35 6E 48 0A 51>)
(   2,<2006-01-30 08:29:37.22 +000>,<MAYBRIDGE\nmr>,<NMR_250MHZ>,
      <Start of raw data processing
       ef LB = 0.3 FT_mod = 6 PKNL = 1 SI = 32K 
       data hash MD5: 32K
       28 08 32 9E CF A9 60 16 AB E0 41 F3 9A 23 F4 A2>)
(   3,<2006-01-30 08:29:39.27 +000>,<MAYBRIDGE\nmr>,<NMR_250MHZ>,
      <apk 
       data hash MD5: 32K
       52 77 84 E7 43 8B 66 64 C0 6A 11 44 AB 5C A4 2E>)
(   4,<2006-01-30 08:29:40.27 +000>,<MAYBRIDGE\nmr>,<NMR_250MHZ>,
      <abs ABSG = 5 
       data hash MD5: 32K
       84 93 ED E2 80 E6 F2 1F 69 80 54 79 49 18 79 5C>)
$$ ##END=
$$ 
$$ hash MD5
$$ 76 D9 DE 16 92 3F EB 46 24 FC EB C9 5B ED D8 CC
##$RELAX= 
##$RELAX= 
##$RELAX= 
##$RELAX= 
##$RELAX= 
##$RELAX= 
##$RELAX= 
$$ Bruker specific parameters
$$ --------------------------
##$DU= <C:\u>
##$EXPNO= 15330
##$NAME= <ADRS>
##$PROCNO= 1
##$TYPE= <nmr>
##$USER= <dgb>
##$AMP= (0..31)
100 100 100 100 100 100 100 100 100 100 100 100 100 100 100 100 100 100 
100 100 100 100 100 100 100 100 100 100 100 100 100 100 
##$AQSEQ= 0
##$AQ_mod= 3
##$AUNM= <au_zg>
##$AUTOPOS= <2 >
##$BF1= 250.13
##$BF2= 250.13
##$BF3= 250.13
##$BF4= 250.13
##$BF5= 500.13
##$BF6= 500.13
##$BF7= 500.13
##$BF8= 500.13
##$BYTORDA= 1
##$CFDGTYP= 0
##$CFRGTYP= 5
##$CHEMSTR= <none>
##$CNST= (0..31)
1 1 145 1 1 1 1 1 1 1 1 1 1 1 1 1 1 1 1 1 1 1 1 1 1 1 1 1 1 1 1 1 
##$CPDPRG= <>
##$CPDPRG1= <>
##$CPDPRG2= <>
##$CPDPRG3= <>
##$CPDPRG4= <mlev>
##$CPDPRG5= <mlev>
##$CPDPRG6= <mlev>
##$CPDPRG7= <mlev>
##$CPDPRG8= <mlev>
##$CPDPRGB= <>
##$CPDPRGT= <>
##$D= (0..31)
0 1 0 0 0 0 0 0 0 0.06 0 0 0 0 0 0 0.0002 0 0 0 0 0 0 0 0 0 0 0 0 0 0 
0 
##$DATE= 1138609758
##$DBL= (0..7)
120 120 120 120 120 120 120 120 
##$DBP= (0..7)
150 150 150 150 150 150 150 150 
##$DBP07= 0
##$DBPNAM0= <>
##$DBPNAM1= <>
##$DBPNAM2= <>
$$ [...]
##$SUBNAM7= <"">
##$SUBNAM8= <"">
##$SUBNAM9= <"">
##$SW= 20.6930455092707
##$SWIBOX= (0..15)
0 0 3 0 0 0 0 0 0 0 0 0 0 0 0 0 
##$SW_h= 5175.983436853
##$TD= 65536
##$TD0= 1
##$TE= 293.16
##$TE2= 300
##$TE3= 300
##$TEG= 300
##$TL= (0..7)
0 120 120 120 120 120 120 120 
##$TP= (0..7)
150 150 150 150 150 150 150 150 
##$TP07= 0
##$TPNAME0= <>
##$TPNAME1= <>
##$TPNAME2= <>
##$TPNAME3= <>
##$TPNAME4= <>
##$TPNAME5= <>
##$TPNAME6= <>
##$TPNAME7= <>
##$TPOAL= (0..7)
0.5 0.5 0.5 0.5 0.5 0.5 0.5 0.5 
##$TPOFFS= (0..7)
0 0 0 0 0 0 0 0 
##$TUNHIN= 0
##$TUNHOUT= 0
##$TUNXOUT= 0
##$USERA1= <user>
##$USERA2= <user>
##$USERA3= <user>
##$USERA4= <user>
##$USERA5= <user>
##$V9= 5
##$VALIST= <valist>
##$VCLIST= <CCCCCCCCCCCCCCC>
##$VD= 0
##$VDLIST= <DDDDDDDDDDDDDDD>
##$VPLIST= <PPPPPPPPPPPPPPP>
##$VTLIST= <TTTTTTTTTTTTTTT>
##$WBST= 1024
##$WBSW= 4
##$XGAIN= (0..3)
0 0 0 0 
##$XL= 0
##$YL= 0
##$YMAX_a= 456360
##$YMIN_a= -488078
##$ZGOPTNS= <>
##$ZL1= 120
##$ZL2= 120
##$ZL3= 120
##$ZL4= 120
##$ABSF1= 16.522
##$ABSF2= -4.171173
##$ABSG= 5
##$ABSL= 3
##$ALPHA= 0
##$AQORDER= 0
##$ASSFAC= 0
##$ASSFACI= 0
##$ASSFACX= 0
##$ASSWID= 0
##$AUNMP= <proc_1d>
##$AZFE= 0.1
##$AZFW= 0.1
##$BCFW= 0
##$BC_mod= 0
##$BYTORDP= 0
##$COROFFS= 0
##$CY= 12.5
##$DATMOD= 1
##$DC= 0
##$DFILT= <>
##$DTYPP= 0
##$F1P= 14.0000005364418
##$F2P= -0.99999901652339
##$FCOR= 0.5
##$FTSIZE= 32768
##$FT_mod= 6
##$GAMMA= 0
##$GB= 0
##$INTBC= 1
##$INTSCL= 1
##$ISEN= 128
##$LB= 0.3
##$LEV0= 0
##$LPBIN= 0
##$MAXI= 10000
##$MC2= 0
##$MEAN= 0
##$ME_mod= 0
##$MI= 0
##$NCOEF= 0
##$NC_proc= -3
##$NLEV= 6
##$NOISF1= 0
##$NOISF2= 0
##$NSP= 0
##$NTH_PI= 0
##$NZP= 0
##$OFFSET= 16.522
##$PC= 1
##$PHC0= -108.4003
##$PHC1= 5.755192
##$PH_mod= 1
##$PKNL= yes
##$PPARMOD= 0
##$PSCAL= 4
##$PSIGN= 0
##$REVERSE= no
##$SF= 250.13
##$SI= 32768
##$SIGF1= 0
##$SIGF2= 0
##$SINO= 400
##$SIOLD= 32768
##$SREGLST= <1H.CDCl3>
##$SSB= 0
##$STSI= 32768
##$STSR= 0
##$SW_p= 5175.98343685301
##$SYMM= 0
##$S_DEV= 0
##$TDeff= 65536
##$TDoff= 0
##$TI= <Analysis number 999999
Compound Code 99
Book Reference 9
Project Code 9>
##$TILT= no
##$TM1= 0
##$TM2= 0
##$TOPLEV= 0
##$USERP1= <user>
##$USERP2= <user>
##$USERP3= <user>
##$USERP4= <user>
##$USERP5= <user>
##$WDW= 1
##$XDIM= 32768
##$YMAX_p= 414225889
##$YMIN_p= -194884
$$ End of Bruker specific parameters
$$ ---------------------------------
##NTUPLES= NMR SPECTRUM
##VAR_NAME=  FREQUENCY,     SPECTRUM/REAL,   SPECTRUM/IMAG
##SYMBOL=    X,             R,               I
##VAR_TYPE=  INDEPENDENT,   DEPENDENT,       DEPENDENT
##VAR_FORM=  AFFN,          ASDF,            ASDF
##VAR_DIM=   32768,         32768,           32768
##UNITS=     HZ,            ARBITRARY UNITS, ARBITRARY UNITS
##FACTOR=    0.157963299565203, 1,           1
##FIRST=     4132.6476996994, 0,             0
##LAST=      -1043.33573715361, 0,           0
##MIN=       -1043.33573715361, -194884,     0
##MAX=       4132.6476996994, 414225889,     0
$$ Real data points
##PAGE= N=1
##DATA TABLE= (X++(R..R)), XYDATA
$$ [...]
$$ plain form
16384 14153 -18733 14722 20668 28291 2164 11490 31494 -18071 -47937 -42970 -31466 -29148 -35671
16371 -35671 -28550 -49896 -73792 -67944 -27796 -60757 -57259 -11545 -14205 -27007 -360 38266
16359 38266 15492 12077 9138 5948 30517 23973 35255 -4066 -45193 -70700 -52810 -85616
16347 -85616 -81797 -105059 -48817 -31322 -46828 -91127 -116964 -76150 -105607 -130484 -53202 -36346
16335 -36346 -51567 -51788 -68701 -362 73938 67720 3849 -13860 -18749 411 -11178 1715
16323 1715 37859 -5183 -70973 -82990 -62147 -59296 -93734 -59094 19566 2628 -10155 -31254
16311 -31254 -38397 -28293 -21943 -33636 -63739 -75425 -32364 17718 10647 -2946 -1314 22444
16299 22444 29492 42741 127 -8880 11305 5986 33044 73451 51150 27076 51343 90118
$$ packed form
16384A4153l2886L3455N946P623k6127R326K0004m9565k9866M967J1504K318o523
16371c5671P121k1346k3896N848M0148l2961L498M5714k660j2802K6647L8626
16359C8266k2774l415k939l190K4569o544J1282l9321m1127k5507J7890l2806
16347h5616L819k3262N6242J7495j5506m4299k5837M0814k9457k4877P7282J6856
16335c6346j5221k21j6913O8339P4300o218o3871j7709m889J9160j1589J2893
16323A715L6144m3042o5790j2017K0843K851l4438L4640P8660j6938j2783k1099
16311c1254p143J0104O350j1693l0103j1686M3061N0082p071j3593J632K3758
16299B2444P048J3249m2614r007K0185n319K7058M0407k2301k4074K4267L8775
$$ plain form
16287 90118 98937 73280 77195 108586 87482 64089 12959 -10438 1267 13627 84316 95359
16275 95359 99874 44439 12179 3333 -57635 -93575 -57572 -19182 25813 22726 -1995 -12895
16263 -12895 -26255 -22626 13873 58354 33411 -17914 1893 8425 34793 18266 -12567 -23069
16251 -23069 12009 -1019 -5795 -31087 11813 10401 29084 70637 71070 36923 52507 34762
16239 34762 2005 8503 34870 37278 26950 24696 15174 -7666 29642 14405 -50571 -34702
16227 -34702 -21819 -77299 -68473 -32118 1129 42611 74323 66215 32881 9961 -6738 24556
16215 24556 51902 402 -38038 -67779 -29756 -42186 -44899 -10525 -5924 -23889 -59816 -102798
16203 -102798 -45033 -19441 -2998 -15466 4651 36086 55860 75769 69011 31055 30089 25115
$$ packed form
16287I0118Q819k5657L915L1391k1104k3393n1130k3397J1705J2360P0689J1043
16275I5359M515n5435l2260q846o0968l5940L6003L8390M4995l087k4721j0900
16263a2895j3360L629L6499M4481k4943n1325J9807O532K6368j6527l0833j0502
16251b3069L5078j3028m776k5292M2900j412J8683M1553M33l4147J5584j7745
16239C4762l2757O498K6367K408j0328k254r522k2840L7308j5237o4976J5869
16227c4702J2883n5480Q826L6355L3247M1482L1712q108l3334k2920j6699L1294
16215B4556K7346n1500l8440k9741L8023j2430k713L4374M601j7965l5927m2982
16203a02798N7765K5592J6443j2468K0117L1435J9774J9909o758l7956r66m974
$$ plain form
16191 25115 12632 -5730 -34267 -35357 -26354 -32351 -35435 -4782 -25016 -18899 -57789 -48649 -28680
16178 -28680 -1048 29055 33734 -8452 3289 -36768 -56127 -69698 -120559 -125300 -80207 -20154
16166 -20154 22232 42455 16452 1564 58103 53586 37212 75111 54232 21788 37663 54846
16154 54846 47756 33608 48204 16403 -12517 -9100 26217 -8074 -55536 -54928 -32351 -23735 29767
16141 29767 -2368 -479 -4189 -15405 30788 37340 32230 40937 44952 23649 -5728 -21797 12364
16128 12364 -3349 49443 90912 82453 32908 -49061 -20810 18001 35264 31748 -13599 -5436
16116 -5436 22703 22391 27843 71258 105356 92592 91272 66986 -2998 -28308 -61386 -37194 -28699
16103 -28699 -56586 -19830 -15120 -14494 -5167 -17330 -34517 -4701 15636 3665 28374 47293
$$ packed form
16191B5115j2483j8362k8537j090R003n997l084L0653k0234O117l8890R140J9969
16178b8680K7632L0103M679m2186J1741m0057j9359j3571n0861m741M5093O0053
16166b0154M2386K0223k6003j4888N6539m517j6374L7899k0879l2444J5875J7183
16154E4846p090j4148J4596l1801k8920L417L5317l4291m7462O08K2577Q616N3502
16141B9767l2135J889l710j1216M6193O552n110Q707M015k1303k9377j6069L4161
16128A2364j5713N2792M1469q459m9545q1969K8251L8811J7263l516m5347Q163
16116e436K8139l12N452M3415L4098j2764j320k4286o9984k5310l3078K4192Q495
16103b8699k7887L6756M710O26R327j2163j7187K9816K0337j1971K4709J8919
$$ plain form
16091 47293 60281 63091 39227 -294 -48014 -41069 -39374 -23796 10453 4264 10420 -34307 -3972
16078 -3972 15498 751 -1547 -4301 13781 -212 -44995 -12148 24469 33275 14856 -30861
16066 -30861 -32683 -29754 9627 41731 19583 -11776 -44678 -44919 -58792 -44153 -32376 -17244
16054 -17244 -14454 -65449 -55555 -73224 -100939 -28945 14561 29552 38740 23649 7415 21256
16042 21256 12789 49374 116555 129867 113070 91840 77539 45218 22560 38363 8200 -7825
16030 -7825 8306 89008 107638 63726 47655 58402 33514 48269 63507 56745 50322 41720
16018 41720 42766 26078 -68299 -75339 -45470 -41731 -45070 -35126 -32875 8810 68667 84011 60798
16005 60798 45731 10284 -3557 11375 32188 7797 33063 30672 19012 47470 100925 66688
$$ packed form
16091D7293J2988K810k3864l9521m7720O945J695J5578L4249o189O156m4727L0335
16078c972J9470j4747k298k754J8082j3993m4783L2847L6617Q806j8419m5717
16066c0861j822K929L9381L2104k2148l1359l2902k41j3873J4639J1777J5132
16054a7244K790n0995R894j7669k7715P1994M3506J4991R188j5091j6234J3841
16042B1256q467L6585O7181J3312j6797k1230j4301l2321k2658J5803l0163j6025
16030g825J6131Q0702J8630m3912j6071J0747k4888J4755J5238o762o423q602
16018D1720J046j6688r4377p040K9869L739l339R944K251M1685N9857J5344k3213
16005F0798j5067l5447j3841J4932K0813k4391K5266k391j1660K8458N3455l4237
$$ plain form
15993 66688 -2621 -14526 7696 -16785 -92478 -98565 -129718 -131324 -120477 -73536 -65049 -90537
15981 -90537 -76440 -20347 53522 41266 35102 11613 15953 12416 28794 37219 22790 63307
15969 63307 45457 9339 55535 79401 61565 27084 7205 -38201 -15223 -12987 -15856 -56780
15957 -56780 -31154 -4384 -53854 -24725 24652 26655 -384 -1960 -42754 -58002 -16991 36592
15945 36592 19158 -31453 -80360 -107841 -104683 -83405 -72323 -55146 -41331 -32262 -44359 -20715
15933 -20715 -18293 -19572 -26008 -10454 -35308 -55434 -41845 -21229 21755 50164 48831 3901
15921 3901 30260 43863 23295 49424 59650 50785 16546 26124 29339 -35745 -52881 -62594 -43481
15908 -43481 -20255 3383 -32140 -29282 6732 60646 49883 52941 58171 54514 8142 -5536
$$ packed form
15993F6688o9309j1905K2222k4481p5693o087l1153j606J0847M6941Q487k5488
15981i0537J4097N6093P3869j2256o164k3489M340l537J6378Q425j4429M0517
15969F3307j7850l6118M6196K3866j7836l4481j9879m5406K2978K236k869m0924
15957e6780K5626K6770m9470K9129M9377K003k7039j576m0794j5248M1011N3583
15945C6592j7434n0611m8907k7481L158K1278J1082J7177J3815R069j2097K3644
15933b0715K422j279o436J5554k4854k0126J3589K0616M2984K8409j333m4930
15921C901K6359J3603k0568K6129J0226q865l4239R578L215o5084j7136r713J9113
15908d3481K3226K3638l5523K858L6014N3914j0763L058N230l657m6372j3678
$$ plain form
15896 -5536 9357 27857 25860 -28984 -18778 4856 14334 -27447 -24578 27249 5963 -53442
15884 -53442 26667 39476 -6235 -29560 -1954 -11899 -8662 12939 31435 92244 74395 20603
15872 20603 -66698 -91038 -104276 -86406 -63120 -53680 -56345 -57863 -48102 -12658 37053 47492
15860 47492 16396 -7523 8717 8409 48972 47273 21916 2302 26119 34188 9508 -7653
15848 -7653 -30171 3140 25889 35445 1227 -23544 -19023 -37388 -38485 6707 83140 69242
15836 69242 593 -55640 -89578 -102014 -89611 -71167 -97968 -115418 -48436 26627 33848 37628
15824 37628 59328 32165 23024 33369 -22566 -37295 27345 20228 6929 37873 27798 14764
15812 14764 76495 95159 67299 78404 78146 16776 -37558 -22630 1155 -47423 -110004 -133610
$$ packed form
15896e536J4893J8500j997n4844J0206K3634R478m1781K869N1827k1286n9405
15884e3442Q0109J2809m5711k3325K7606r945L237K1601J8496O0809j7849n3792
15872B0603q7301k4340j3238J7870K3286R440k665j518R761L5444M9711J0439
15860D7492l1096k3919J6240l08M0563j699k5357j9614K3817Q069k4680j7161
15848g653k2518L3311K2749R556l4218k4771M521j8365j097M5192P6433j3898
15836F9242o8649n6233l3938j2436J2403J8444k6801j7450O6982P5063P221L780
15824C7628K1700k7163r141J0345n5935j4729O4640p117j3299L0944j0075j3034
15812A4764O1731J8664k7860J1105k58o1370n4334J4928K3785m8578o2581k3606
$$ plain form
15800 -133610 -105656 -72128 -43098 -46890 -33807 3128 28559 24606 22343 53735 28612 15920
15788 15920 -22472 -73190 -73776 -48210 -50341 -17994 -48198 -63778 -74541 -53764 -49389 -63637
15776 -63637 -48039 -35436 -53448 -8039 3235 -40637 -20230 28012 27997 14709 11715 35641
15764 35641 -419 -26077 -21922 -22705 -12687 -1730 -1021 -17745 -41128 -14606 -14754 -39110 -44276
15751 -44276 -28807 -804 23539 10498 -35689 7177 -17960 -55965 -34355 23145 81031 32522
15739 32522 -39760 1119 57507 88760 83513 92005 77225 62521 17428 -27930 1418 -13736
15727 -13736 18168 13862 24196 -13679 -38761 -43872 -23327 -53385 -65037 -75314 -64955 -54891
15715 -54891 -51012 -22038 104 -28407 8562 38706 16816 -39965 -58608 -34530 -51925 -46481
$$ packed form
15800a33610K7954L3528K9030l792J3083L6935K5431l953k263L1392k5123j2692
15788A5920l8392n0718n86K5566k131L2347l0204j5580j0763K0777M375j4248
15776f3637J5598J2603j8012M5409J1274m3872K0407M8242j5j3288k994K3926
15764C5641l6060k5658M155p83J0018J0957P09j6724k3383K6522j48k4356n166
15751d4276J5469K8003K4343j3041m6187M2866k5137l8005K1610N7500N7886m8509
15739C2522p2282M0879N6388L1253n247Q492j4780j4704m5093m5358K9348j5154
15727a3736L1904m306J0334l7875k5082n111K0545l0058j1652j0277J0359J0064
15715e4891L879K8974K2142k8511L6969L0144k1890n6781j8643K4078j7395N444
$$ plain form
15703 -46481 -55039 -72491 -82675 -123924 -108936 -106261 -84665 -102839 -55310 -51172 -45433 -36164 -35119
15690 -35119 -42176 -52393 -4051 791 10877 41443 43179 17339 29462 -1237 -49795 -59416
15678 -59416 -84738 -74577 -40487 -26173 6956 98270 146856 93307 77066 76540 74813 72420
15666 72420 57666 39439 47846 -19986 -83583 -63064 17906 4688 -53644 -34631 6501 -17920
15654 -17920 -70307 -60800 -33984 6983 1270 -2744 -9665 -9862 16920 54143 32218 15888 7036
15641 7036 19139 -1314 -6036 -65623 -47602 -36821 -32034 -38586 -40328 -3510 13610 12363 39661
15628 39661 43375 8712 -36506 -9173 21381 59619 10221 2202 88 -6906 2170 13271 39045
15615 39045 29453 27158 51776 71694 65040 82036 36142 -23398 -32903 -15400 6839 80042
$$ packed form
15703d6481q558j7452j0184m1249J4988K675K1596j8174M7529M138N739R269J045
15690c5119p057j0217M8342M842J0086L0566J736k5840J2123l0699m8558r621
15678e9416k5322J0161L4090J4314L3129R1314M8586n3549j6241n26j727k393
15666G2420j4754j8227Q407o7832o3597K0519Q0970j3218n8332J9013M1132k4421
15654a7920n2387R507K6816M0967n713m014o921j97K6782L7223k1925j6330q852
15641G036J2103k0453m722n9587J8021J0781M787o552j742L6818J7120j247K7298
15628C9661L714l4663m5218K7333L0554L8238m9398q019k114o994R076J1101K5774
15615C9045r592k295K4618J9918o654J6996m5894n9540r505J7503K2239P3203
$$ plain form
15603 80042 85308 36907 -49031 -69432 -46155 2015 32924 52868 71609 18153 -6616 8884
15591 8884 -23317 -12313 -13477 -6770 -31992 -14950 -30790 -11553 -428 -595 -18167 -66591 -72792
15578 -72792 -77728 -68599 -3818 25895 41234 55196 47031 74680 97104 87388 44418 12485
15566 12485 20948 56523 44613 13105 13865 -16855 -51212 -81788 -36876 -19175 1111 28706
15554 28706 43216 50139 41299 28237 20293 12643 33975 28079 33319 51357 37548 31184 30039
15541 30039 1499 16843 6382 -24110 -42205 -37862 -25735 8763 8206 56009 26610 -22119
15529 -22119 -32532 -10390 -9906 -30214 22908 61968 61078 35676 3541 8675 49085 74185 50772
15516 50772 -18478 -1338 12885 41430 39944 -4485 -9333 3918 21371 68672 97815 46255
$$ packed form
15603H0042N266m8401q5938k0401K3277M8170L0909J9944J8741n3456k4769J5500
15591H884l2201J1004j164O707k5222J7042j5840J9237J1125j67j7572m8424o201
15578g2792m936R129O4781K9713J5339J3962q165K7649K2424r716m2970l1933
15566A2485Q463L5575j1910l1508P60l0720l4357l0576M4912J7701K0286K7595
15554B8706J4510O923q840j3062p944p650K1332n896N240J8038j3809o364j145
15541C0039k8540J5344j0461l0492j8095M343J2127L4498n57M7803k9399m8729
15529b2119j0413K2142M84k0308N3122L9060q90k5402l2135N134M0410K5100k3413
15516E0772o9250J7140J4223K8545j486m4429m848J3251J7453M7301K9143n1560
$$ plain form
15504 46255 7570 44794 45322 33218 99340 98379 66547 51751 13859 17411 40770 18860 18151
15491 18151 76077 109627 102799 115409 84406 58568 12080 696 -4593 28679 21819 -6694
15479 -6694 -13937 -16414 -30096 -38777 3341 9723 43396 51411 75615 37809 -17906 -25638 19659
15466 19659 36027 -1752 -2634 -15215 30420 38279 27936 35752 88815 71070 36767 -6515
15454 -6515 -60397 -56865 -46997 -29293 -46687 -18524 9075 -27131 -20725 -34092 -43100 -38955 -37493
15441 -37493 -28330 12146 13203 -30055 -44091 -47095 -24637 20534 -5515 -68968 -65191 -40523
15429 -40523 -29716 -46774 -35977 15313 52604 74381 24899 1318 1671 -410 52468 41244
15417 41244 42318 60594 87412 50965 92768 81618 27631 21630 9471 36510 -659 -5931
$$ packed form
15504D6255l8685L7224N28j2104O6122r61l1832j4796l7892L552K3359k1910p09
15491A8151N7926L3550o828J2610l1003k5838m6488j1384n289L3272o860k8513
15479f694p243k477j3682q681M2118O382L3673Q015K4204l7806n5715p732M5297
15466A9659J6368l7779q82j2581M5635P859j0343P816N3063j7745l4303m3282
15454f515n3882L532R868J7704j7394K8163K7599l6206O406j3367r008M145J462
15441c7493R163M0476J057m3258j4036l004K2458M5171k6049o3453L777K4668
15429d0523J0807j7058J0797N1290L7291K1777m9482k3581L53k081N2878j1224
15417D1244J074J8276K6818l6447M1803j1150n3987o001j2159K7039l7169n272
$$ plain form
15405 -5931 -48169 4705 20150 -11060 45966 66054 1960 -8383 -39220 -83183 -28653 65105
15393 65105 76986 33582 11125 14641 39979 33369 -7441 7524 41785 47631 39229 -6477
15381 -6477 23188 4719 12243 29060 -10909 -36507 -19294 16751 23117 30329 39787 27055 10906
15368 10906 4248 9723 -16912 -63075 -61614 24762 76113 68527 51060 14137 -63028 -44669
15356 -44669 959 46796 36161 -11930 16372 1670 -34067 4824 19935 23966 33352 51627
15344 51627 55241 33202 4673 -24678 18059 49927 82931 84733 87373 98212 136975 69521
15332 69521 -6065 -26410 -19349 12234 15664 6696 50411 69269 96758 66964 14019 5078
15320 5078 23708 37448 3142 -53040 -18767 3792 -1740 22763 13057 35606 92793 85810
$$ packed form
15405e931m2238N2874J5445l1210N7026K0088o4094j0343l0837m3963N4530R3758
15393F5105J1881m3404k2457L516K5338o610m0810J4965L4261N846q402m5706
15381f477K9665j8469P524J6817l9969k5598J7213L6045O366P212R458j2732j6149
15368A0906o658N475k6635m6163J461Q6376N1351p586j7467l6923p7165J8359
15356d4669M5628M5837j0635m8091K8302j4702l5737L8891J5111M031R386J8275
15344E1627L614k2039k8529k9351M2737L1868L3004J802K640J0839L8763o7454
15332F9521p5586k0345P061L1583L430q968M3715J8858K7489k9794n2945q941
15320E078J8630J3740l4306n6182L4273K2559n532K4503r706K2549N7187o983
$$ plain form
15308 85810 17542 -421 -6143 3764 20249 22363 17843 -23573 6688 89524 101117 42638
15296 42638 -52383 -53014 -30657 -10079 -44828 -22275 -15298 -45915 -8344 -11568 -4341 -11518 11762
15283 11762 38197 71736 62776 79511 81395 56315 34318 -28387 -4820 5955 11944 14997
15271 14997 17121 14983 -14470 20982 15596 19776 4832 -68202 -84123 -23259 -11433 -38410
15259 -38410 -25401 -669 47134 66169 -5880 -33918 -28236 -9031 -8285 -34541 -51659 -65852
15247 -65852 -35993 -21166 -28954 -24680 -5389 16702 28279 34679 2830 16426 12324 -3281
15235 -3281 -8724 -8138 7644 1713 -7728 -15721 -16162 -1122 13815 24965 -31249 -48618 -42162 14840
15221 14840 17194 50973 85982 62071 -18279 -67822 -32372 1297 60949 91095 78105 14646
$$ packed form
15308H5810o8268j7963n722R907J6485K114m520m1416L0261Q2836J1593n8479
15296D2638r5021o31K2357K0578l4749K2553O977l0617L7571l224P227p177K3280
15283A1762K6435L3539q960J6735J884k5080k1997o2705K3567J0775N989L053
15271A4997K124k138k9453L5452n386M180j4944p3034j5921O0864J1826k6977
15259c8410J3009K4732M7803J9035p2049k8038N682J9205P46k6256j7118j4193
15247f5852K9859J4827p788M274J9291K2091J1577O400l1849J3596m102j5605
15235c281n443N86J5782n931r441p993m41J5040J4937J1150n6214j7369O456N7002
15221A4840K354L3779L5009k3911q0350m9543L5450L3669N9652L0146j2990o3459
$$ plain form
15209 14646 29611 39678 52857 81078 78215 41313 32900 30534 304 -7407 6685 -47684
15197 -47684 -91484 -91806 -61182 -31503 -1998 -17012 -50126 -57723 -87277 -68806 -59938 14213
15185 14213 74010 35423 -13163 -28432 -58254 -102912 -99502 -82386 -46483 9780 1006 -3780
15173 -3780 932 60602 55245 31596 44032 28842 -43141 -44876 15812 201 -15367 -11897 -21923
15160 -21923 16540 15627 9003 -15372 3801 83556 91627 44573 41844 72774 78543 44831 46897
15147 46897 69148 97962 50784 -22979 -10099 5329 7499 -4658 14322 2711 -26312 -53706
15135 -53706 -49986 -41161 -12983 -46043 -53871 -36940 -54709 -48607 -21225 31512 27153 -9432 -51362
15122 -51362 -38362 -34806 -59752 -87506 -37637 -13119 -37251 -22751 11445 -12826 3285 15895
$$ packed form
15209A4646J4965J0067J3179K8221k863l6902q413k366l0230p711J4092n4369
15197d7684m3800l22L0624K9679K9505j5014l3114p597k9554J8471Q868P4151
15185A4213N9797l8587m8586j5269k9822m4658L410J7116L5903N6263q774m786
15173c780M712N9670n357k3649J2436j5190p1983j735O0688j5611j5568L470j0026
15160b1923L8463r13o624k4375J9173P9755Q071m7054k729L0930N769l3712K066
15147D6897K2251K8814m7178p3763J2880J5428K170j2157J8980j1611k9023k7394
15135e3706L720Q825K8178l3060p828J6931j7769O102K7382N2737m359l6585m1930
15122e1362J3000L556k4946k7754M9869K4518k4132J4500L4196k4271J6111J2610
$$ plain form
15110 15895 -28683 -57051 -47566 -89364 -57147 -54965 -21844 -7413 31110 74490 67616 23369
15098 23369 -3932 -8953 -4534 -26465 -10407 -20847 -23764 7490 -4945 -47715 -33053 -20828
15086 -20828 -16284 -9293 20506 -1244 27056 -12263 -47719 4497 14693 25496 35780 11278
15074 11278 14378 23999 42859 33198 10694 4456 -21393 -18432 -23073 -29579 -42315 -3481 -36653
15061 -36653 -72951 -42338 8565 21272 57634 27893 43137 11848 -15315 3835 9147 -12495
15049 -12495 28141 18630 18060 7220 -5543 17158 11629 17595 38227 40624 55311 20581 -27506
15036 -27506 -1805 360 -6090 22630 -7442 -20495 -9871 -20397 -3051 9142 14442 3808
15024 3808 43540 -20593 -30774 -1648 -5493 -14174 -22979 -15225 1090 11539 72216 101915 107891
$$ packed form
15110A5895m4578k8368R485m1798L2217K182L3121J4431L8523M3380o874m4247
15098B3369k7301n021M419k1931J6058j0440k917L1254j2435m2770J4662J2225
15086b0828M544O991K9799k1750K8300l9319l5456N2216J0196J0803J0284k4502
15074A1278L100R621J8860r661k2504o238k5849K961m641o506j2736L8834l3172
15061c6653l6298L0613N0903J2707L6362k9741J5244l1289k7163J9150N312k1642
15049a2495M0636r511n70j0840j2763K2701n529N966K0632K397J4687l4730m8087
15036b7506K5701K165o450K8720l0072j3053J0624j0526J7346J2193N300j0634
15024C808L9732o4133j0181K9126l845q681q805P754J6315J0449O0677K9699N976
$$ plain form
15011 107891 91922 29595 29161 6796 15743 -17053 -9139 6277 -34707 -63934 -85532 -78491
14999 -78491 -45984 -75699 -31425 -37750 35764 101177 114816 67861 13306 9871 -23546 -9549
14987 -9549 50635 56006 83642 46907 36524 39796 17165 -5164 -22657 2321 25135 -21792
14975 -21792 -74562 -32009 -34185 -20650 -6865 18568 51371 73138 46863 18166 7047 36101
14963 36101 50173 49914 37771 1410 -42364 -47696 -58851 -51561 -103297 -67567 -19719 -32306
14951 -32306 -42337 -50497 -79037 -85785 -44429 -38208 -51140 -45520 -35008 6561 -13605 16350
14939 16350 21688 21244 36191 -4426 -4938 9811 -10161 59203 52137 86793 56678 -1511 -43512
14926 -43512 -35209 -15295 60012 83592 19482 -2041 -7517 21592 59709 48694 6191 -16106
$$ packed form
15011A07891j5969o2327m34k2365Q947l2796P914J5416m0984k9227k1598P041
14999g8491L2507k9715M4274o325P3514O5413J3639m6955n4555l435l3417J3997
14987i549O0184N371K7636l6735j0383L272k2631k2329j7493K4978K2814m6927
14975b1792n2770M2553k176J3535J3785K5433L2803K1767k6275k8697j1119K9054
14963C6101J4072k59j2143l6361m3774n332j1155P290n1736L5730M7848j2587
14951c2306j0031q160k8540o748M1356O221j2932N620J0512M1569k0166K9955
14939A6350N338m44J4947m0617n12J4749j9972O9364p066L4656l0115n8189m2001
14926d3512Q303J9914P5307K3580o4110k1523n476K9109L8117j1015m2503k2297
$$ plain form
14914 -16106 -35850 -68352 -79122 -25117 19313 64758 77526 81602 77329 12266 -12947 -10859
14902 -10859 28661 26735 -22572 -7751 31094 56214 108373 156201 141903 71074 -2711 -41568
14890 -41568 -41824 -43802 -36097 475 33461 45081 64907 41735 32632 10540 -13113 -38164 -80193
14877 -80193 -61539 -80716 -72606 -19882 -20289 -24804 -11767 -6592 -3950 -34403 -64857 -43282 -30057
14864 -30057 -24718 -21534 -47666 -31680 17662 69630 88898 79886 66404 -9021 -18310 27299
14852 27299 35198 10777 -39516 -4532 7032 35047 36213 58744 102908 108457 103768 81286
14840 81286 79658 85960 66417 454 -49945 -7362 63376 61759 15646 -50751 -91267 -31346
14828 -31346 16574 11798 -25842 10439 76681 81518 57298 87431 68585 29943 4085 2898
$$ packed form
14914a6106j9744l2502j0770N4005M4430M5445J2768M076m273o5063k5213K088
14902a0859L9520j926m9307J4821L8845K5120N2159M7828j4298p0829p3785l8857
14890d1568k56j978P705L6572L2986J1620J9826k3172r103k2092k3653k5051m2029
14877h0193J8654j9177Q110N2724m07m515J3037N175K642l0453l0454K1575J3225
14864c0057N339L184k6132J5986M9342N1968J9268r012j3482p5425r289M5609
14852B7299P899k4421n0293L4984J1564K8015J166K2531M4164N549m689k2482
14840H1286j628O302j9543o5963n0399M2583P0738j617m6113o6397m0516N9921
14828c1346M7920m776l7640L6281O6242M837k4220L0133j8846l8642k5858j187
$$ plain form
14816 2898 -11232 -59101 -85458 -68318 -75305 -71166 -63918 -35058 -52031 -66803 -85245 -102679
14804 -102679 -121775 -68035 -39162 -86835 -96803 -31316 4324 22075 12798 13088 -5886 18281
14792 18281 -17292 -28630 -15105 -25858 -17253 20674 3064 -6243 -32453 -67284 -52351 -44842
14780 -44842 -51551 73 51177 46929 30779 61071 66796 41526 19508 20146 35137 28703 34345
14767 34345 25163 6112 13630 -6705 14524 12085 -42594 -10799 30556 29056 3232 3454 -26646
14754 -26646 -47309 -36426 -27652 -44968 -78348 -91764 -40237 -42956 -84038 -75118 -12894 7148
14742 7148 7235 -34401 -89897 -110987 -92248 -98994 -43219 5655 5338 2308 23418 -37658 -60473
14729 -60473 -32598 -14292 1063 -4553 -29120 -92181 -90182 -81357 -81775 -65161 -38824 -51292 -65728
$$ packed form
14816B898j4130m7869k6357J7140o987M139P248K8860j6973j4772j8442j7434
14804a02679j9096N3740K8873m7673r968O5487L5640J7751r277K90j8974K4167
14792A8281l5573j1338J3525j0753Q605L7927j7610r307k6210l4831J4933P509
14780d4842o709N1624N1104m248j6150L0292N725k5270k2018O38J4991o434N642
14767C4345r182j9051P518k0335K1229k439n4679L1795M1355j500k5824K22l0100
14754b6646k0663J0883Q774j7316l3380j3416N1527k719m1082Q920O2224K0042
14742G148Q7m1636n5496k1090J8739o746N5775M8874l17l030K1110o1076k2815
14729f0473K7875J8306J5355n616k4567o3061J999Q825m18J6614K6337j2468j4436
$$ plain form
14716 -65728 -26115 -9429 29377 73408 82980 83231 85675 34504 7063 -59012 -32402 -34125 -68865
14703 -68865 -42682 -47518 -6279 37404 18815 16830 31830 -42024 -72633 -62515 -17356 47221
14691 47221 61008 22154 -53789 -63297 -34173 4979 56481 62257 94372 55125 34745 25606
14679 25606 7256 20268 28205 22219 23839 35450 25146 41854 22821 -8020 6546 7531 24875
14666 24875 -19459 -62600 -56779 -73680 -98676 -115499 -64064 -56176 -47449 -84225 -114791 -110701
14654 -110701 -86756 -85736 -25721 -10766 -52399 -49382 -27380 -18717 -19682 -21864 -12755 22926 60285
14641 60285 51669 21294 15192 -16837 -21800 -66910 -68010 -6524 45573 11561 -18847 -56383
14629 -56383 -70168 -56103 -16906 -18949 5667 7329 53901 54149 21033 -5040 -6932 -11867 -28883
$$ packed form
14716f5728L9613J6686L8806M4031R572K51K444n1171k7441o6075K6610j723l4740
14703f8865K6183m836M1239M3683j8589j985J5000p3854l0609J0118M5159O4577
14691D7221J3787l8854p5943r508K9124L9152N1502N776L2115l9247k0380r139
14679B5606j8350J3012P937n986J620J1611j0304J6708j9033l0841J4566R85J7344
14666B4875m4334m3141N821j6901k4996j6823N1435P888Q727l6776l0566M090
14654a10701K3945J020O0015J4955m1633L017K2002Q663r65k182R109L5681L7359
14641F0285q616l0375o102l2029m963m5110j100O1486N2097l4012l0408l7536
14629e6383j3785J4065L9197k043K4616J662M6572K48l3116k6073j892m935j7016
$$ plain form
14616 -28883 -10671 25457 4944 -43943 -87653 -95916 -92474 -82161 26046 53972 52107 87263
14604 87263 74217 112077 66496 54750 59577 69016 93422 54975 4494 31389 73100 106614
14592 106614 105059 85609 44557 50797 68036 68691 84491 61918 7066 27681 72786 74487
14580 74487 52559 62933 36249 -20701 -3528 110137 83282 21576 -22707 -21310 21772 145
14568 145 -27749 -45326 -50542 -70369 -25941 38299 74929 56297 -15093 -33000 -37203 8851
14556 8851 68227 7514 -31866 -12820 -16873 1814 75357 95712 -8863 -10995 53126 50075
14544 50075 15347 43171 34428 -40972 -1654 74722 87229 23674 158 -59128 -93474 -73862
14532 -73862 -35484 -52309 -14706 30026 60365 29653 31371 34132 -13808 -59429 -87857 -124075
$$ packed form
14616b8883J8212L6128k0513m8887m3710q263L442J0313J08207K7926j865L5156
14604H7263j3046L7860m5581j1746M827R439K4406l8447n0481K6895M1711L3514
14592A06614j555j9450m1052O240J7239O55J5800k2573n4852K0615M5105J701
14580G4487k1928J0374k6684n6950J7173J13665k6855o1706m4283J397M3082k1627
14568A45k7894j7577n216j9827M4428O4240L6630j8632p1390j7907m203M6054
14556H851N9376o0713l9380J9046m053J8687P3543K0355j04575k132O4121l051
14544E0075l4728K7824q743p5400L9318P6376J2507o3555k3516n9286l4346J9612
14532g3862L8378j6825L7603M4732L0339l0712J718K761m7940m5621k8428l6218
$$ plain form
14520 -124075 -126191 -118538 -76481 -26273 -36899 -42401 -59221 45309 103410 83500 48528 21816
14508 21816 -28795 -30172 8787 56691 34021 -25974 -56490 -53042 -654 16839 30080 -27890
14496 -27890 -8792 49864 47685 13041 -16204 -73993 -109085 -74958 8644 7214 -19211 -25068
14484 -25068 -15559 1829 19084 -14765 -17107 -47715 -20286 -50420 -36090 3491 -45805 -51333
14472 -51333 4476 56242 49523 49216 20647 45687 62566 68618 47145 34057 41621 -24829 8166
14459 8166 22095 5649 5287 -3244 -9215 22422 44621 -17632 -51074 -86197 -102737 -104328 -106329
14446 -106329 -83726 -8604 10050 -9435 -35664 -59143 -50020 -29334 -2512 30574 22109 36627
14434 36627 47803 -14965 -75504 -95686 -57139 30001 28854 30416 36889 26488 30107 15547
$$ packed form
14520a24075k116P653M2057N0208j0626n502j6820J04530N8101j9910l4972k6712
14508B1816n0611j377L8959M7904k2670n9995l0516L448N2388J7493J3241n7970
14496b7890J9098N8656k179l4644k9245n7789l5092L4127Q3602j430k6425n857
14484b5068R509J7388J7255l3849k342l0608K7429l0134J4330L9581m9296n528
14472e1333N5809N1766o719l07k8569K5040J6879O052k1473j3088P564o6450L2995
14459H166J3929j6446l62q531n971L1637K2199o2253l3442l5123j6540j591k001
14446a06329K2603P5122J8654j9485k6229k3479R123K0686K6822L3086q465J4518
14434C6627J1176o2768o0539k0182L8547Q7140j147J562O473j0401L619j4560
$$ plain form
14422 15547 -17123 -55402 -110136 -87925 -26108 15243 40223 8484 -75308 -122243 -76891 -11269
14410 -11269 1648 28545 66957 59077 72175 104047 110677 107593 106022 43115 -30536 -59790
14398 -59790 -228 -36799 -64044 -42521 -58374 -23662 8458 -7449 42631 64531 52694 34895
14386 34895 12624 32081 26012 -20787 -65424 -78380 -40389 15919 44078 -28833 -59135 9638
14374 9638 33549 26549 -3967 -26927 -25497 -20173 -51812 -32557 -41980 2211 -12264 -10505 16841
14361 16841 12654 -9922 -43939 -42233 -46094 -74299 -87533 -19074 42660 86342 147786 129110
14349 129110 88906 64148 56005 9465 -10661 10563 17037 49293 80660 77683 87160 43392
14337 43392 46132 40778 30256 -23618 -7008 30656 33177 -19666 7285 5168 10518 61303 58804
$$ packed form
14422A5547l2670l8279n4734K2211O1817M1351K4980l1739q3792m6935M5352O5622
14410a1269J2917K6897L8412p880J3098L1872O630l084j571o2907p3651k9254
14398e9790N9562l6571k7245K1523j5853L4712L2120j5907N0080K1900j1837j7799
14386C4895k2271J9457o069m6799m4637j2956L7991N6308K8159p2911l0302O8773
14374I638K3911p000l0516k2960J430N324l1639J9255r423M4191j4475J759K7346
14361A6841m187k2576l4017J706l861k8205j3234O8459O1734M3682O1444j8676
14349A29110m0204k4758q143m6540k0126K1224O474L2256L1367k977R477m3768
14337D3392K740n354j0522n3874J6610L7664K521n2843K6951k117N350N0785k499
$$ plain form
14324 58804 12841 -15589 19851 10675 -35498 -55061 -68022 -62043 -79103 -29791 -27709 -9310
14312 -9310 11146 9887 5783 34377 69834 90621 69991 -7645 -29584 450 61190 46401
14300 46401 49342 34691 17510 76093 56031 -4698 -16168 -57182 11757 27643 8100 24763
14288 24763 52271 67197 98639 66911 41070 52104 74041 41076 8129 12186 25232 21183
14276 21183 35515 83508 81384 47360 54282 41342 1689 5409 75235 97120 60572 4436
14264 4436 -5773 -39875 -46981 -75910 -93833 -64461 -3955 24073 34988 -9386 28455 48615
14252 48615 23988 9274 12512 12918 32843 58240 31150 14442 41481 56574 53126 53677 72649
14239 72649 23836 -21581 -13145 -13127 -66950 -57116 -32634 -1025 11370 41203 84536 24039 -11513
$$ packed form
14324E8804m5963k8430L5440r176m6173j9563j2961N979j7060M9312K082J8399
14312i310K0456j259m104K8594L5457K0787k0630p7636k1939L0034O0740j4789
14300D6401K941j4651j7181N8583k0062o0729j1470m1014O8939J5886j9543J6663
14288B4763K7508J4926L1442l1728k5841J1034K1937l2965l2947M057J3046m049
14276B1183J4332M7993k124l4024O922j2940l9653L720O9826K1885l6548n6136
14264D436j0209l4102p106k8929j7923K9372O0506K8028J0915m4374L7841K0160
14252D8615k4627j4714L238M06J9925K5397k7090j6708K7039J5093l448N51J8972
14239G2649m8813m5417Q436J8n3823R834K4482L1609J2395K9833M3333o0497l5552
$$ plain form
14226 -11513 -14004 -27261 -26889 -50717 -35090 14870 44837 76172 45809 1098 185 44792 28466
14213 28466 21146 65346 95049 73571 21724 22260 37869 32831 -6801 2257 58719 49674 30253
14200 30253 -12322 26480 -10079 -101530 -102231 -31051 17319 21997 22660 78930 107758 75722 28911
14187 28911 12469 -12381 -15028 46276 36149 20884 43042 57365 24385 -13018 -73326 -87148
14175 -87148 -20930 -10406 69314 52940 20976 -2620 33670 24633 -28707 -74013 -96861 -101916
14163 -101916 -87148 -13544 -21641 -25904 -11987 32608 18490 5247 -32543 -53577 -37385 10574
14151 10574 -5288 13629 19829 3406 2251 -2136 7317 17205 40661 57253 42569 -6946 -48137
14138 -48137 -61757 -71650 -99587 -83263 -64288 23700 41520 16398 20875 20426 84685 97641
$$ packed form
14226a1513k491j3257L72k3828J5627M9960K9967L1335l0363m4711r13M4607j6326
14213B8466p320M4200K9703k1478n1847N36J5609n038l9632R058N6462r045j9421
14200C0253m2575L8802l6559r1451p01P1180M8370M678O63N6270K8828l2036m6811
14187B8911j6442k4850k647O1304j0127j5265K2158J4323l2980l7403o0308j3822
14175h7148O6218J0524P9720j6374l1964k3596L6290r037n3340m5306k2848n055
14163a01916J4768P3604q097m263J3917M4595j4118j3243l7790k1034J6192M7959
14151A0574j5862J8917O200j6423j155m387R453R888K3456J6592j4684m9515m1191
14138d8137j3620r893k7937J6324J8975Q7988J7820k5122M477m49O4259J2956
$$ plain form
14126 97641 37345 40412 6564 -33870 -24418 -58414 -43019 26712 33670 -44975 -34242 -14530
14114 -14530 -3335 -22800 -39608 17431 39354 37398 34273 10014 -21784 -46820 -60709 -44638
14102 -44638 -11070 -46159 -50933 -23924 -10700 -8913 -29644 -47289 -69176 -43153 -37734 -43270
14090 -43270 -89768 -114017 -75435 -54762 28921 35407 -12942 -46342 -99918 -92864 -88281 -81298
14078 -81298 -130545 -149077 -126992 -108184 -49936 -15506 -10341 -41391 -17553 41168 74626 100560
14066 100560 112569 116564 131681 54864 11361 -45396 -60345 34438 113271 133715 82074 53699
14054 53699 -26937 -39435 -58323 -51512 -31224 -34249 -11113 -30771 -27725 -56325 -47044 -22544
14042 -22544 -10097 19539 20711 27859 73481 65452 61729 44248 21872 -18593 -39832 -44895 -63051
$$ packed form
14126I7641o0296L067l3848m0434R452l3996J5395O9731O958p8645J0733J9712
14114a4530J1195j9465j6808N7039K1923j956l125k4259l1798k5036j3889J6071
14102d4638L3568l5089m774K7009J3224J787k0731j7645k1887K6023N419n536
14090d3270m6498k4249L8582K0673Q3683O486m8349l3400n3576P054M583O983
14078h1298m9247j8532K2085J8808N8248L4430N165l1050K3838N8721L3458K5934
14066A00560J2009L995J5117p6817m3503n6757j4949R4783P8833K0444n1641k8375
14054E3699q0636j2498j8888O811K0288l025K3136j9658L046k8600R281K4500
14042b2544J2447K9636J172P148M5622q029l723j7481k2376m0465k1239n063j8156
$$ plain form
14029 -63051 -70579 -75875 -40939 -14361 -47586 -62399 -35541 -11525 2364 6278 6368 -19142 -30433
14016 -30433 -12824 -3295 -16333 -35527 5180 -1788 -24376 61893 87806 36417 -19135 -43523
14004 -43523 -37526 -71164 -141531 -101916 -47501 1792 21040 44646 36949 25248 -4505 -28273
13992 -28273 -49531 -75587 -70703 -18763 -6400 -12476 -38388 -58810 -57272 -24671 23295 67810
13980 67810 53305 12244 -7199 -17504 -29225 -30501 5087 33516 99668 87263 35249 14240
13968 14240 30371 71393 65059 51959 66132 67448 77323 79376 47107 43681 88793 92184 61756
13955 61756 15928 -23523 -61114 -47199 -7400 38528 60656 47923 44720 23159 27492 50827
13943 50827 63578 10891 -28396 -1864 56094 32325 1188 -17728 -26627 20156 33519 -20595
$$ packed form
14029f3051p528n296L4936K6578l3225j4813K6858K4016J3889L914R0k5510j1291
14016c0433J7609R529j3038j9194M0707o968k2588Q6269K5913n1389n5552k4388
14004d3523N997l3638p0367L9615N4415M9293J9248K3606p697j1701k9753k3768
13992b8273k1258k6056M884N1940J2363o076k5912k0422J538L2601M7966M4515
13980F7810j4505m1061j9443j0305j1721j276L5588K8429O6152j2405n2014k1009
13968A4240J6131M1022o334j3100J4173J316R875K053l2269l426M5112L391l0428
13955F1756m5828l9451l7591J3915L9799M5928K2128j2733l203k1561M333K3335
13943E0827J2751n2687l9287K6532N7958k3769l1137j8916q899M6783J3363n4114
$$ plain form
13931 -20595 3353 23013 21072 -6867 -27455 -64651 -68606 -50578 -12479 33790 41195 3465
13919 3465 -16716 10553 -48825 -87322 -80552 -68418 -2064 39847 42248 22386 47731 22327
13907 22327 27389 15615 38243 50636 26547 -2071 -4484 10251 2694 -66860 -50766 -41531
13895 -41531 -51835 -87357 -71321 -31158 10002 16825 5448 12310 15838 36080 15066 -1234
13883 -1234 -47188 -50848 -45914 -7716 -34446 -5361 -3088 23561 19965 -25859 -35267 -25969 -1714
13870 -1714 22576 -5635 -44352 26591 56307 -2238 3060 13401 -7702 15203 -26683 -40138
13858 -40138 -28890 1763 -869 -20435 -27260 -27418 -41034 -24001 11348 10299 5170 47883 27376
13845 27376 32475 55208 58777 63352 70860 65778 81706 91868 51274 16107 8621 34812 -11644
$$ packed form
13931b0595K3948J9660j941k7939k0588l7196l955J8028L8099M6269P405l7730
13919C465k0181K7269n9378l8497O770J2134O6354M1911K401j9862K5345k5404
13907B2327N062j1774K2628J2393k4089k8618k413J4735p557o9554J6094R235
13895d1531j0304l5522J6036M0163M1160O823j1377O862L528K0242k1014j6300
13883a234m5954l660M934L8198k6730K9085K273K6649l596m5824r408R298K4255
13870a714K4290k8211l8717P0943K9716n8545N298J0341k1103K2905m1886j3455
13858d0138J1248L0653k632j9566o825j58j3616J7033L5349j049n129M2713k0507
13845B7376N099K2733L569M575P508n082J5928J0162m0594l5167p486K6191m6456
$$ plain form
13832 -11644 -47630 -49748 -17102 5156 5783 35675 12699 -22861 11133 49122 25450 1759
13820 1759 -4487 891 35630 38738 70495 71736 36871 34052 -15288 -71515 -41549 -18523 4395
13807 4395 1337 40576 61999 42985 -11633 -13229 -61672 -47921 -26422 -4620 -24561 -17175
13795 -17175 -13223 -20437 -39996 -6136 41058 68680 110497 108160 94478 83586 47565 58185
13783 58185 66226 66965 554 -9848 44669 22498 3956 5513 596 2908 42492 60544 76578
13770 76578 57624 -3555 -26783 -10565 -45 -14549 -51349 -60557 -65729 -86929 -75215 -49853
13758 -49853 -41074 18711 54709 97102 126991 73159 5174 3633 -5702 -22948 -19944 -13217 -9085
13745 -9085 -26018 -65624 -99494 -113264 -71503 -23903 13175 23660 2855 36854 -466 -15231
$$ packed form
13832a1644l5986k118L2646K2258O27K9892k2976l5560L3994L7989k3672k3691
13820A759o246N378L4739L108L1757J241l4865k819m9340n6227K9966K3026K2918
13807D395l058L9239K1423j9014n4618j596m8443J3751K1499K1802j9941P386
13795a7175L952p214j9559L3860M7194K7622M1817k337j3682j0892l6021J0620
13783E8185Q041P39o6411j0402N4517k2171j8542J557m917K312L9584J8052J6034
13770G6578j8954o1179k3228J6218J0520j4504l6800r208n172k1200J1714K5362
13758d9853Q779N9785L5998M2393K9889n3832o7985j541r335j7246L004O727M132
13745i085j6933l9606l3870j3770M1761M7600L7078J0485k0805L3999l7320j4765
$$ plain form
13733 -15231 -2966 15295 11109 9816 33588 45930 87825 86188 104525 83663 112747 83374
13721 83374 101930 58165 -21561 -51412 -54367 -4664 7979 -7524 -24779 6582 33856 -2563
13709 -2563 -8582 -6285 -35558 -53971 -34429 -64697 -80833 -49524 -34238 3839 -33998 -35989
13697 -35989 -45792 -60153 -21361 -26685 -43769 -38362 8189 -49280 -69739 -30418 -7605 2714
13685 2714 -14190 -50789 -64286 -68342 -27096 -15462 2239 55970 122494 108059 85084 45188
13673 45188 3182 29248 1819 3374 12021 57903 54271 37989 13836 -15695 -48182 -30287
13661 -30287 -28875 -36360 -41005 -18757 50786 34706 27533 -13064 -37966 23592 21007 5137 1993
13648 1993 -2622 38522 1963 -28753 13659 495 -14380 -33961 -11873 -16507 -13157 -23879
$$ packed form
13733a5231J2265J8261m186j293K3772J2342M1895j637J8337k0862K9084k9373
13721H3374J8556m3765p9726k9851k955M9703J2643j5503j7255L1361K7274l6419
13709b563o019K297k9273j8413J9542l0268j6136L1309J5286L8077l7837j991
13697c5989r803j4361L8792n324j7084N407M6551n7469k0459L9321K2813J0319
13685B714j6904l6599j3497m056M1246J1634J7701N3731O6524j4435k2975l9896
13673D5188m2006K6066k7429J555Q647M5882l632j6282k4153k9531l2487J7895
13661c0287J412p485m645K2248O9543j6080p173m0597k4902O1558k585j5870l144
13648A993m615M1144l6559l0716M2412j3164j4875j9581K2088m634L350j0722
$$ plain form
13636 -23879 -65540 -93500 -65320 -75935 -100912 -100205 -93439 -78784 -1877 -22242 14896 86199
13624 86199 91486 76156 28904 -40499 -38240 -51847 1274 -12403 1885 3217 -36566 -86420
13612 -86420 -85954 -71258 -53572 -47520 5510 18602 11491 -2537 -37498 -49517 -62359 -58049 -17322
13599 -17322 -10082 4307 51983 78355 95517 114066 74028 87899 82183 22934 -17439 -15992
13587 -15992 -23434 6065 -1344 -61328 -59665 -40175 -75911 -58920 -48374 -88652 -123031 -33200
13575 -33200 37858 23931 32098 -4525 -64764 -63079 -56391 -32641 -10340 14013 56506 86872
13563 86872 74907 38640 74068 65045 60030 -21081 -50799 -102999 -104633 -90757 -27640 26137
13551 26137 33611 61274 53554 37824 53034 57764 41719 4927 -30895 -66610 -56668 -70965
$$ packed form
13636b3879m1661k7960K8180j0615k4977P07O766J4655P6907k0365L7138P1303
13624H6199N287j5330m7252o9403K259j3607N3121j3677J4288J332l9783m9854
13612h6420M66J4696J7686O052N3030J3092p111j4028l4961j2019j2842M310M0727
13599a7322P240J4389M7676K6372J7162J8549m0038J3871n716n9249m0373J447
13587a5992p442K9499p409n9984J663J9490l5736J6991J0546m0278l4379Q9831
13575c3200P1058j3927Q167l6623o0239J685O688K3750K2301K4353M2493L0366
13563H6872j1965l6267L5428r023n015q1111k9718n2200j634J3876O3117N3777
13551B6137P474K7663p720j5730J5210M730j6045l6792l5822l5715R942j4297
$$ plain form
13539 -70965 -87735 -104715 -130022 -119962 -71479 -33205 16102 45295 54705 403 -17110 -9703
13527 -9703 42583 52080 14352 -34305 -75539 -3326 29999 31021 22439 -1204 -68601 -47434
13515 -47434 -42222 -39613 -2176 20568 27618 -13522 -86212 -82248 -36256 -1011 -15847 -100459
13503 -100459 -163501 -123729 -93737 -72535 -67853 -72709 -35453 -72454 -52187 -7904 -35303 -66018
13491 -66018 -78941 -94311 -99645 -36072 -736 2656 -10530 -18654 -27463 -37006 -90453 -43763 -58541
13478 -58541 -5823 11398 33925 35597 61237 46587 -18686 -17404 18990 54259 65758 62642
13466 62642 72708 101966 99327 40915 14774 -4642 34587 85964 109832 40259 29195 21510
13454 21510 2650 53627 49926 43599 21399 5895 57598 47853 -24223 -52029 -1577 37504
$$ packed form
13539g0965j6770j6980k5307J0060M8483L8274M9307K9193R410n4302j7513P407
13527i703N2286R497l7728m8657m1234P2213L3325J022q582k3643o7397K1167
13515d7434N212K609L7437K2744P050m1140p2690L964M5992L5245j4836q4612
13503a00459o3042L9772K9992K1202M682m856L7256l7001K0267M4283k7399l0715
13491f6018j2923j5370n334O3573L5336L392j3186q124q809r543n3447M6690j4778
13478e8541N2718J7221K2527J672K5640j4650o5273J282L6394L5269J1499l116
13466F2642J0066K9258k639n8412k6141j9416L9229N1377K3868o9573j1064p685
13454B1510j8860N0977l701o327k2200j5504N1703r745p2076k7806N0452L9081
$$ plain form
13442 37504 50753 36583 66208 84923 14823 21263 81091 85684 49211 -1486 -7861 21027
13430 21027 29807 59689 75067 58135 36588 70483 32583 -30809 -49348 -20368 -17789 -25904
13418 -25904 13484 46195 23921 46522 33899 30687 32915 -435 -3691 31825 48083 33852
13406 33852 23310 -6477 38788 49337 41937 37944 9309 -4487 15800 1526 -46437 -84488
13394 -84488 -28634 -20191 -42604 -45603 -35132 -14567 44410 78021 155337 152163 61461 -6380
13382 -6380 -22915 54783 56157 17693 23666 31442 62734 45813 31145 3729 25005 62333
13370 62333 7617 -67863 -84615 -96398 -67703 -54987 -39351 -35166 -86798 -70614 -7818 31633
13358 31633 -11482 -53958 -32932 -6361 19977 33491 20611 4792 73 -30276 -34056 7211
$$ packed form
13442C7504J3249j4170K9625J8715p0100O440N9828M593l6473n0697o375K8888
13430B1027Q780K9882J5378j6932k1547L3895l7900o3392j8539K8980K579q115
13418b5904L9388L2711k2274K2601j2623l212K228l3350l256L5516J6258j4231
13406C3852j0542k9787M5265J0549p400l993k8635j3796K0287j4274m7963l8051
13394h4488N5854Q443k2413k999J0471K0565N8977L3611P7316l174r0702o7841
13382f380j6535P7698J374l8464N973P776L1292j6921j4668k7416K1276L7328
13370F2333n4716p5480j6752j1783K8695J2716J5636M185n1632J6184O2796L9451
13358C1633m3115m2476K1026K6571K6338J3514j2880j5819m719l0349l780M1267
$$ plain form
13346 7211 1781 -23449 -87785 -81427 -63795 -83455 -68292 -23396 15748 18573 19470 24185 -7532
13333 -7532 37909 115562 96229 40751 9664 75250 137605 85258 33504 -16526 -2145 -15265
13321 -15265 25994 65995 22982 -58108 -95497 -108833 -142731 -86751 -40633 -5499 22316 2644
13309 2644 -59413 -124806 -82267 -15903 -20644 -50013 -31645 -57023 -45589 -10148 47446 94388
13297 94388 83160 54740 31383 28175 6868 11515 -44487 -55326 -61086 -944 28393 -4456
13285 -4456 -59907 -39080 -115438 -131542 -46340 -16797 -3212 21877 -32846 -33971 -6669 12619
13273 12619 16827 -7451 -55888 -44641 -45086 -33264 -28403 -8210 -35704 -15636 -7721 -48295 -53780
13260 -53780 -29268 -27035 -23354 -65678 -73833 -121237 -94636 -45704 -67836 -87201 -76502 -35026
$$ packed form
13346G211n430k5230o4336O358J7632j9660J5163M4896L9144K825Q97M715l1717
13333g532M5441P7653j9333n5478l1087O5586O2355n2347n1754n0030J4381j3120
13321a5265M1259M0001m3013q1090l7389j3336l3898N5980M6118L5134K7815j9672
13309B644o2057o5393M2539O6364m741k9369J8368k5378J1434L5441N7594M6942
13297I4388j1228k8420k3357l208k1307M647n6002j0839n760O0142K9337l2849
13285d456n5451K0827p6358j6104Q5202K9543J3585K5089n4723j125K7302J9288
13273A2619M208k4278m8437J1247m45J1822M861K0193k7494K0068P915m0574n485
13260e3780K4512K233L681m2324q155m7404K6601M8932k2132j9365J0699M1476
$$ plain form
13248 -35026 2532 54112 5482 -13561 7386 -22447 -48256 -51244 -48580 -47759 -60693 -47207
13236 -47207 -83774 -110171 -58965 3642 88066 108842 175721 202809 181814 165536 157328 62374
13224 62374 30983 37248 33268 7789 107190 126773 84054 75335 128323 102965 18513 -15712
13212 -15712 -21993 -16555 -8173 -35677 -48073 909 49748 67059 118897 101513 49793 29064
13200 29064 84330 107919 115403 122363 77428 77303 77758 19390 3204 72462 112844 83973 56837
13187 56837 194718 419783 637875 785890 808205 627456 444934 378582 374126 350342 316639
13176 316639 249840 310949 326703 257841 193094 211602 225528 254882 250390 159493 99211 92781
13164 92781 32214 23848 94516 142790 179203 146602 71685 43216 38766 15910 20417 37417
$$ packed form
13248c5026L7558N1580m8630j9043K0947k9833k5809k988K664Q21j2934J3486
13236d7207l6567k6397N1206O2607Q4424K0776O6879K7088k0995j6278q208r4954
13224F2374l1391O265l980k5479R9401J9583m2719q719N2988k5358q4452l4225
13212a5712o281N438Q382k7504j2396M8982M8839J7311N1838j7384n1720k0729
13200B9064N5266K3589P484O960m4935j25M55n8368j6186O9258M0382k8871k7136
13187E6837J37881K25065K18092J48015K2315j80749j82522o6352m456k3784l3703
13176C16639o6799O1109J5754o8862o4747J8508J3926K9354m492r0897o0282o430
13164I2781o0567q366P0668M8274L6413l2601p4917k8469m450k2856M507J7000
$$ plain form
13152 37417 -9652 -25901 -9231 -5452 -2463 78706 118049 130983 127886 177252 320787 500258
13140 500258 699578 807997 790685 700914 668355 752066 824049 757860 592328 426523 359762
13129 359762 351518 325126 278397 252997 224781 192438 160131 78539 80841 136146 132695 54506
13117 54506 51934 70971 93384 92904 33272 28502 29405 34720 -18959 -23879 -48251 -62382 -49133
13104 -49133 19920 88405 102136 84968 46850 63875 76682 130081 207713 290287 383609 443369
13092 443369 431890 502817 660212 743410 664015 522407 376092 264862 226463 168587 142599
13081 142599 183950 200220 182916 143758 95173 85299 52254 34848 15779 11159 20558 3529
13069 3529 -23475 -4237 -43150 -42685 -37867 -18987 26557 18238 -5949 -22741 -97711 -93701 -37914
$$ packed form
13152C7417m7069j6249J6670L779K989Q1169L9343J2934l097M9366J43535J79471
13140E00258J99320J08419j7312q9771l2559Q3711P1983o6189j65532j65805o6761
13129C59762q244k6392m6729k5400k8216l2343l2307q1592K302N5305l451p8189
13117E4506k572J9037K2413m80n9632m770R03N315n3679m920k4372j4131J3249
13104d9133O9053O8485J3731j7168l8118J7025J2807N3399P7632Q2574R3322N9760
13092D43369j1479P0927J57395Q3198p9395j41608j46315j11230l8399n7876k5988
13081A42599M1351J6270j7304l9158m8585r874l3045j7406j9069m620R399j7029
13069C529k7004J9238l8913M65M818J8880M5544q319k4187j6792p4970M010N5787
$$ plain form
13056 -37914 -64994 -47428 -18801 -11998 2551 12307 27144 76969 107466 131829 183207 215160
13044 215160 259633 259192 217179 144783 76658 -4751 8850 71252 98348 84011 89763 108747
13032 108747 114070 41027 -3010 29068 50736 28784 24785 9550 22783 42322 67955 78534
13020 78534 94048 37253 -2474 -5230 -1490 14312 -35594 -31153 -46597 -41866 -3607 31049
13008 31049 63249 66958 46439 21515 -32060 -41265 -59601 -80988 -85360 -58700 -37010 -11521
12996 -11521 27464 55239 91710 183792 160095 79607 -26981 -91674 -65357 -53285 -42918
12985 -42918 -10604 4513 54766 58875 -17997 -74486 -55571 -46539 -30099 -30579 -67810 -89893
12973 -89893 -93921 -96587 -68067 -53061 -65625 -52160 -56777 -87536 -38395 9330 26797 51890
$$ packed form
13056c7914k7080J7566K8627O803J4549R756J4837M9825L0497K4363N1378L1953
13044B15160M4473m41m2013p2396o8125q1409J3601O2402K7096j4337N752J8984
13032A08747N323p3043m4037L2078K1668k1952l999j5235J3233J9539K5633J0579
13020G8534J5514n6795l9727k756L740J5802m9906M441j5444M731L8259L4656
13008C1049L2200L709k0519k4924n3575r205j8336k1387m372K6660K1690K5489
12996a1521L8985K7775L6471R2082k3697q0488j06588o4693K6317J2072J0367
12985d2918L2314J5117N0253M109p6872n6489J8915R032J6440m80l7231k2083
12973h9893m028k666K8520J5006j2564J3465m617l0759M9141M7725J7467K5093
$$ plain form
12961 51890 32153 35973 31648 6533 23809 3602 753 -338 5937 4872 423 7491 4370
12948 4370 67106 78807 53581 39353 -5901 -14615 13910 18646 -1943 8944 -2921 -17746
12936 -17746 314 -90333 -151814 -112238 -86815 -36930 -32208 -52822 -40955 1223 -27468 -6858
12924 -6858 38123 35831 -45007 -54309 -11715 -605 -3924 7470 -10287 5621 -6399 -41372
12912 -41372 -29921 30464 77984 47898 39221 45093 8306 -45133 -95641 -61263 26331 30800
12900 30800 -14065 -43816 -47923 -48332 -12016 35299 -15811 -98656 -112948 -53755 -26297 -36286
12888 -36286 -28446 18180 -44513 -37769 32386 18531 -3975 -3858 -7581 17300 12234 -33729 -105865
12875 -105865 -59398 7378 76370 27504 18985 33460 11612 18700 28924 54727 25375 17238
$$ packed form
12961E1890j9737L820m325k5115J7276k0207k849j091O275j065m449P068l121
12948D370O2736J1701k5226j4228m5254q714K8525M736k0589J0887j1865j4825
12936a7746J8060r0647o1481L9576K5423M9885M722k0614J1867M2178k8691K0610
12924f858M4981k292q0838r302M2594J1110l319J1394j7757J5908j2020l4973
12912d1372J1451O0385M7520l0086q677N872l6787n3439n0508L4378Q7594M469
12900C0800m4865k9751m107m09L6316M7315n1110q2845j4292N9193K7458r989
12888c6286P840M6626o2693O744P0155j3855k2506J17l723K4881n066m5963p2136
12875a05865M6467O6776O8992m8866q519J4475k1848P088J0224K5803k9352q137
$$ plain form
12863 17238 30925 22990 69608 73224 106463 93760 46199 3113 -14959 -7312 -25075 -55904
12851 -55904 -65238 -89284 -50611 -39827 -38141 -53818 -72596 -40757 -6257 -65468 -48778 -52615
12839 -52615 -11607 1480 -26360 -25046 59285 58266 21911 -27458 -18037 24393 20112 34879
12827 34879 18947 32517 29381 -11731 18947 -10066 1411 4474 -16675 570 31139 36993
12815 36993 6602 30171 54579 47391 58344 24464 9637 -57317 -76916 -47756 -47146 -41680
12803 -41680 -4467 13607 -17384 -17328 3899 29941 34306 37901 8676 15951 23215 -17182 -45038
12790 -45038 -35436 -64434 -63957 -89465 -111213 -140666 -70617 -84066 -83565 -50808 -73694 -75721 -35257
12777 -35257 -2149 -47792 -30894 4311 12177 73320 32348 -55559 -39960 -67003 -46445 -22959
$$ packed form
12863A7238J3687p935M6618L616L3239j2703m7561m3086j8072P647j7763l0829
12851e5904r334k4046L8673J0784J686j5677j8778L1839L4500n9211J6690l837
12839e2615M1008J3087k7840J314Q4331j019l6355m9369R421M2430m281J4767
12827C4879j5932J3570l136m1112L0678k9013J1477L063k1149J7245L0569N854
12815C6993l0391K3569K4408p188J0953l3880j4827o6954j9599K9160O10N466
12803d1680L7213J8074l0991N6K1227K6042M365L595k9225P275P264m0397k7856
12790d5038R602k8998M77k5508k1748k9453P0049j3449N01L2757k2886k027M0464
12777c5257L3108m5643J6898L5205P866O1143m0972q7907J5599k7043K0558K3486
$$ plain form
12765 -22959 -9480 -31960 -50752 13807 28244 28899 40601 45663 54030 58113 66121 30130 -34951
12752 -34951 -91708 -48087 -10927 -949 -57632 -84286 -58849 17254 68081 14496 -15778 -8773
12740 -8773 -12322 -61318 -50289 -31151 -10506 10710 27362 65234 75140 15261 -21973 -23435
12728 -23435 -73287 -74515 -49333 11649 45457 38635 6436 -20483 2964 33053 17998 -4471
12716 -4471 40525 14000 -47982 -61614 -104457 -111944 -50612 -17882 -29460 -48496 -88761 -51957
12704 -51957 -29853 -47985 -75604 -36787 -24969 -14864 -13715 16566 -25908 -64317 -69624 -38909
12692 -38909 -18616 11700 59798 52292 48063 55443 25862 26117 56631 58084 62911 81507 49798
12679 49798 12979 -20356 -60972 -61694 22400 29832 -28116 -72292 -37147 28015 92056 73272
$$ packed form
12765b2959J3479k2480j8792O4559J4437O55J1702N062Q367M083Q008l5991o5081
12752c4951n6757M3621L7160R978n6683k6654K5437P6103N0827n3585l0274P005
12740h773l549m8996J1029J9138K0645K1216J6652L7872R906n9879l7234j462
12728b3435m9852j228K5182O0982L3808o822l2199k6919K3447L0089j5055k2469
12716d471M4996k6525o1982j3632m2843p487O1332L2730j1578j9036m0265L6804
12704e1957K2104j8132k7619L8817J1818J0105J149L0281m2474l8409n307L0715
12692c8909K0293L0316M8098p506m229P380k9581K55L0514J453M827J8596l1709
12679D9798l6819l3335m0616p22Q4094P432n7948m4176L5145O5162O4041j8784
$$ plain form
12667 73272 50974 73263 103870 95430 79740 48057 26160 44334 26620 -35782 -49903 -4027
12655 -4027 -34414 -89857 -52746 -13929 -6539 9760 6626 40542 854 5696 18424 24915 10555
12642 10555 -3309 -44081 -86136 -55780 10361 69059 85239 94270 40467 -2008 -5930 -13087
12630 -13087 18937 25233 1724 -30101 -17162 -31611 -25452 -63092 -112416 -45787 -27698 -48937
12618 -48937 -5572 -246 43893 67300 41628 2444 -39841 -110878 -116595 -121246 -97885 -56054
12606 -56054 -3408 42755 3893 -10551 -30689 -35075 9159 44073 82781 104499 64379 35120
12594 35120 13271 -1213 -837 -23604 -29883 -75162 -94582 -42337 -21424 -7517 -21164 -61200
12582 -61200 -80957 -60616 -30024 -35619 -56254 -95111 -93121 -88907 -46632 -64476 -72484 -92362
$$ packed form
12667G3272k2298K2289L0607q440j5690l1683k1897J8174j7714o2402j4121M5876
12655d027l0387n5443L7111L8817P390J6299l134L3916l9688M842J2728O491j4360
12642A0555j3864m0772m2055L0356O6141N8698J6180R031n3803m2475l922p157
12630a3087L2024O296k3509l1825J2939j4449O159l7640m9324O6629J8089k1239
12618d8937M3365N326M4139K3407k5672l9184m2285p1037n717m651K3361M1831
12606e6054N2646M6163l8862j4444k0138m386M4234L4914L8708K1718m0120k9259
12594C5120k1849j4484L76k2767o279m5279j9420N2245K0913J3907j3647m0036
12582f1200j9757K0341L0592n595k0635l8857J990M214M2275j7844q008j9878
$$ plain form
12570 -92362 -66482 -28832 4361 13745 63705 33158 -5267 23645 49894 88275 121745 114989
12558 114989 60031 54664 55946 71646 34899 57631 81928 71550 80204 101731 111656 38734
12546 38734 -31701 1860 10412 7109 -31635 -30635 -40900 -45728 4152 3888 26691 65983 46280
12533 46280 30816 16683 -7803 -35978 -7788 -44797 -43994 -427 -19978 -46056 -50147 -58868
12521 -58868 -29993 -2970 -10855 -4675 3420 55717 64303 3677 9825 31980 34987 -36878 -84957
12508 -84957 -73091 -28291 -10584 17468 -10415 -3044 27915 8824 30279 21915 17636 12724
12496 12724 2828 15554 12173 46050 49719 24684 45774 69256 -1821 -58963 -54000 -13154
12484 -13154 -13631 4547 -8273 -17819 -9038 39853 28670 -29934 -46651 -39219 -46014 -35845 -40082
$$ packed form
12570i2362K5880L7650L3193R384M9960l0547l8425K8912K6249L8381L3470o756
12558A14989n4958n367J282J5700l6747K2732K4297j0378Q654K1527R925p2922
12546C8734p0435L3561Q552l303l8744J000j0265m828M9880k64K2803L9292j9703
12533D6280j5464j4133k4486k8175K8190l7009Q03M3567j9551k6078m091q721
12521e8868K8875K7023p885O180Q095N2297Q586o0626O148K2155L007p1865m8079
12508h4957J1866M4800J7707K8052k7883P371L0959j9091K1455q364m279m912
12496A2724r896J2726l381L3877L669k5035K1090K3482p1077n7142M963M0846
12484a3154m77J8178j2820r546Q781M8891j1183n8604j6717P432o795J0169m237
$$ plain form
12471 -40082 -29461 -27970 -30152 7954 4008 5788 11780 65443 100256 32151 -21405 37994 49363
12458 49363 46333 57293 102489 94353 2664 -18951 16436 -17074 -38084 -10094 20328 -19294
12446 -19294 -23373 -22863 -38462 -3482 -11800 -54596 -45347 818 29800 54454 36101 36673 61021
12433 61021 38106 -26301 -50694 -22602 -16778 -5618 -43942 -61240 -53900 -65495 -58657 -18911
12421 -18911 -13897 -14784 4141 9621 2398 50136 73928 44888 39347 48738 55323 33523 -7607
12408 -7607 14008 43668 35282 13147 -32445 -20072 -4643 21631 46914 37014 7215 -21928
12396 -21928 -32633 36514 13301 4021 -655 -29325 -65007 -83260 -80858 -100493 -67618 -739
12384 -739 15327 -54781 -55226 -49596 -33554 -4321 2982 -13040 964 -9148 -42519 51914 68932
$$ packed form
12471d0082J0621J491k182L8106l946J780N992N3663L4813o8105n3556N9399J1369
12458D9363l030J0960M5196q136r1689k1615L5387l3510k1010K7990L0422l9622
12446a9294m079N10j5599L4980q318m2796R249M6165K8982K4654j8353N72K4348
12433F1021k2915o4407k4393K8092N824J1160l8324j7298P340j1595O838L9746
12421a8911N014q87J8925N480p223M7738K3792k9040n541R391O585k1800m1130
12408g607K1615K9660q386k2135m5592J2373J5429K6274K5283r900k9799k9143
12396b1928j0705O9147k3213r280m676k8670l5682j8253K402j9635L2875O6879
12384g39J6066p0108m45N630J6042K9233P303j6022J4004j0112l3371R4433J7018
$$ plain form
12371 68932 25593 -36032 21841 18230 22764 -3308 31640 45603 25418 50360 32871 8981
12359 8981 -13662 8832 -12005 -49395 -22162 24888 32001 12423 -22551 -36739 3313 -1849
12347 -1849 9843 62085 68913 107599 137922 69433 28581 45819 60870 4288 4862 91830
12335 91830 119814 90353 94441 102591 88993 48610 2848 -63677 -80904 -21658 1714 -14018
12323 -14018 -23693 -2690 10336 16577 41853 74976 87232 72464 15113 -31095 -35634 -8046
12311 -8046 -16656 -64280 -72529 1386 4626 15600 35718 -17883 -34976 -66571 -76025 -102616 -69117
12298 -69117 1759 14273 -28239 -45337 -29812 28176 40263 -33093 -69626 -14958 -33095 -8158
12286 -8158 48019 38834 -6455 -6661 26694 22514 -3603 -33717 -68969 -101500 -115385 -95193 -84122
$$ packed form
12371F8932m3339o1625N7873l611M534k6072L4948J3963k0185K4942j7489k3890
12359H981k2643K2494k0837l7390K7233M7050P113j9578l4974j4188M0052n162
12347a849J1692N2242O828L8686L0323o8489m0852J7238J5051n6582N74Q6968
12335I1830K7984k9461M088Q150j3598m0383m5762o6525j7227N9246K3372j5732
12323a4018r675K1003J3026O241K5276L3123J2256j4768n7351m6208m539K7588
12311h046q610m7624q249P3915L240J0974K0118n3601j7093l1595r454k6591L3499
12298f9117P0876J2514m2512j7098J5525N7988J2087p3356l6533N4668j8137K4937
12286h158N6177r185m5289k06L3355m180k6117l0114l5252l2531j3885K0192J1071
$$ plain form
12273 -84122 -72173 -33310 -6143 11887 -38195 -23315 24089 57763 50558 42578 14337 -19557
12261 -19557 -8001 6120 9460 16115 818 9084 -27442 -46861 9585 35972 -26718 -10893
12249 -10893 -28453 2928 77043 101190 49629 70063 65795 28497 -3334 20271 16258 2339
12237 2339 -514 565 16127 7273 -9456 -58764 -23602 7473 76796 101263 75426 44014
12225 44014 39918 10843 -43694 -91696 -104927 -116719 -135452 -86819 -142 60623 9135 -26045
12213 -26045 -10134 -46144 -72771 -105896 -77395 -55426 -69693 -86454 -61961 -64081 -47318 -23602
12201 -23602 10527 15445 27093 -5329 -22675 -41318 -27218 -18368 -2908 8231 44817 92058
12189 92058 98018 109486 161378 110755 75816 50563 4464 -9330 -3519 -39533 13124 -10279
$$ packed form
12273h4122J1949L8863K7167J8030n0082J4880M7404L3674p205p980k8241l3894
12261a9557J1556J4121L340O655j5297Q266l6526j9419N6446K6387o2690J5825
12249a0893j7560L1381P4115K4147n1561K0434m268l7298l1831K3605m013j3919
12237B339k853J079J5562q854j6729m9308L5162L1075O9323K4467k5837l1412
12225D4014m096k9075n4537m8002j3231j1792j8733M8633Q6677O0765n1488l5180
12213b6045J5911l6010k6627l3125K8501K1969j4267j6761K4493k120J6763K3716
12201b3602L4129M918J1648l2422j7346j8643J4100Q850J5460J1139L6586M7241
12189I2058N960J1468N1892n0623l4939k5253m6099j3794N811l6014N2657k3403
$$ plain form
12177 -10279 13139 -6179 11676 13975 -22238 34062 129470 114348 63534 71289 55729 78369
12165 78369 70706 68337 60028 51058 -23832 -4485 -3339 -22719 -48618 -81948 -82611 -77661 -76048
12152 -76048 1326 6593 -14324 -92952 -99927 -16304 -5351 -39746 -3301 -5229 -6550 32399
12140 32399 -11446 -38059 -86568 -94695 -94109 -41463 21932 60058 5633 15466 7324 8296 25333
12127 25333 39966 24664 -4707 -8069 -46013 -28034 -39306 -38305 25760 51307 16656 36091
12115 36091 27834 -27871 -25408 69448 62331 50202 37555 34213 43549 44309 47694 38180 76697
12102 76697 106008 80272 51841 22346 14571 -13896 -53351 -35847 4622 67273 30837 55154
12090 55154 66929 117830 120695 112498 75405 55853 40680 14208 -55495 -63404 -32942 2140
$$ packed form
12177a0279K3418j9318J7855K299l6213N6300R5408j5122n0814P755j5560K2640
12165G8369p663k369q309q970p4890J9347J146j9380k5899l3330o63M950J613
12152g6048P7374N267k0917p8628o975Q3623J0953l4395L6445j928j321L8949
12140C2399m3845k6613m8509q127N86N2646O3395L8126n4425R833q142R72J7037
12127B5333J4633j5302k9371l362l7944J7979j1272J001O4065K5547l4651J9435
12115C6091q257n5705K463R4856p117j2129j2647l342R336P60L385r514L8517
12102G6697K9311k5736k8431k9495p775k8467l9455J7504M0469O2651l6436K4317
12090E5154J1775N0901K865q197l7093j9552j5173k6472o9703p909L0462L5082
$$ plain form
12078 2140 59202 29581 -25021 -45744 -43008 -58433 -25377 -23636 -62693 -68639 -18589 -6208
12066 -6208 4280 -40401 5412 38295 51015 60952 52287 -2278 -32713 -31239 6540 45381
12054 45381 5598 -6900 8846 -393 -27345 -2067 -18786 -15010 -4057 28634 24698 6293
12042 6293 39564 113448 115531 96327 34273 -10111 16258 24048 34305 53224 52084 49706 -21338
12029 -21338 -48735 -72507 -77680 -30930 -19671 7555 35264 13027 32045 22046 8893 42025
12017 42025 95668 123925 125889 87160 40488 47982 46438 -25985 -77575 -94409 -98644 -87009
12005 -87009 -91638 -87400 11713 37062 57482 28308 21941 30842 15900 24523 26010 -53768 -85804
11992 -85804 -7538 37408 75490 114893 71682 58614 119627 134895 180238 242605 283579 408347
$$ packed form
12078B140N7062k9621n4602k0723K736j5425L3056J741l9057n946N0050J2381
12066f208J0488m4681M5813L2883J2720R937q665n4565l0435J474L7779L8841
12054D5381l9783j2498J5746r239k6952K5278j6719L776J0953L2691l936j8405
12042F293L3271P3884K083j9204o2054m4384K6369P790J0257J8919j140k378p1044
12029b1338k7397k3772n173M6750J1259K7226K7709k2237J9018r999j3153L3132
12017D2025N3643K8257J964l8729m6672P494j544p2423n1590j6834m235J1635
12005h7009m629M238R9113K5349K0420k9174o367Q901j4942Q623J487p9778l2036
11992h5804P8266M4946L8082L9403m3211j3068O1013J5268M5343O2367M0974J24768
$$ plain form
11980 408347 658133 879095 1084755 1322088 1457445 1498499 1479698 1403117 1251016 1060093
11970 1060093 797371 528856 389938 301091 234159 184260 176870 173587 105320 71396 56363
11959 56363 76862 63346 19863 9757 83702 145620 119064 77201 69365 75771 83313 55347
11947 55347 10702 25889 73830 68416 3975 -29351 1930 -26543 -2677 7438 -31637 -15032
11935 -15032 33414 24879 1789 -23017 -46159 -67210 -31286 -22508 -23022 -22739 17069 -1085 5018
11922 5018 20167 2518 -32078 -27926 -11441 -37056 -43579 -4345 4341 -41360 -28278 -2924
11910 -2924 60966 122876 106140 102452 90838 55420 24323 28914 -42726 -80128 -116118 -46876
11898 -46876 47381 75381 65310 5511 -43950 -137043 -165830 -108048 -70918 -61209 -95915 -71794
$$ packed form
11980D08347K49786K20962K05660K37333J35357M1054j8801p6581j52101j90923
11970A060093k62722k68515j38918q8847o6932m9899p390l283o8267l3924j5033
11959E6363K0499j3516m3483j0106P3945O1918k6556m1863p836O406P542k7966
11947E5347m4645J5187M7941n414o4441l3326L1281k8473K3866J0115l9075J6605
11935a5032M8446q535k3090k4806k3142k1051L5924Q778n14K83L9808j8154O103
11922E018J5149j7649l4596M152J6485k5615o523L9234Q686m5701J3082K5354
11910b924O3890O1910j6736l688j1614l5418l1097M591p1640l7402l5990O9242
11898d6876R4257K8000j0071n9799m9461r3093k8787N7782L7130R709l4706K4121
$$ plain form
11886 -71794 -66835 -95271 -120485 -130988 -131423 -133922 -121199 -109011 -85952 -38239 -11297 -73617
11874 -73617 -91199 -96529 -70973 -44863 -58172 -34427 15989 36769 14835 -26003 -79376 -103043
11862 -103043 -101807 -97518 -16811 30693 57186 -22661 -19951 745 -10774 -47492 -67474 -36778
11850 -36778 33970 42257 -8191 -7070 21607 60312 107001 99557 47836 61965 49350 108421
11838 108421 74871 22856 50820 46255 45450 47916 -10777 -41075 -26634 2189 35351 42266
11826 42266 54729 44000 28609 24560 -14429 15593 84856 133156 151784 135837 33860 -12705
11814 -12705 1317 -15238 -14277 -1459 22112 46118 20759 54570 50357 3528 15759 61201
11802 61201 73385 58001 36411 12935 11827 24935 24798 1440 -10287 12368 5759 -15788
$$ packed form
11886g1794M959k8436k5214j0503m35k499J2723J2188K3059M7713K6942o2320
11874g3617j7582n330K5556K6110j3309K3745N0416K0780k1934m0838n3373k3667
11862a03043J236M289Q0707M7504K6493p9847K710K0696j1519l6718j9982L0696
11850c6778P0748Q287n0448J121K8677L8705M6689p444n1721J4129j2615N9071
11838A08421l3550n2015K7964m565q05K466n8693l0298J4441K8823L3162O915
11826D2266J2463j0729j5391m049l8989L0022O9263M8300J8628j5947j01977m6565
11814a2705J4022j6555R61J2818K3571K4006k5359L3811m213m6829J2231M5442
11802F1201J2184j5384k1590k3476j108J3108j37k3358j1727K2655o609k1547
$$ plain form
11790 -15788 -11974 46897 77085 48119 -15951 1618 82059 119908 85493 35870 21090 32408
11778 32408 10121 -12437 -10184 -13753 -29251 13686 5258 -17837 -22841 -9478 44315 -12542
11766 -12542 -67292 -24698 -13523 -6627 38160 66057 52363 53313 48049 2110 -36551 -41306 -34717
11753 -34717 30047 27499 35859 11261 -22584 -42206 -10988 7430 30860 22408 38740 34809
11741 34809 50785 29111 40360 32909 19612 1902 2362 7369 23724 31522 -25245 -76697 -4956
11728 -4956 26030 37238 -9158 -14040 25356 -491 30485 -19311 -13770 -24211 -3272 23976
11716 23976 25373 49605 17557 -21244 -3066 47092 31254 -34809 -18955 10484 -8730 -20329
11704 -20329 -88400 -113078 -89071 -46184 -8230 33647 59021 1864 -59245 -55919 -52174 -1701
$$ packed form
11790a5788L814N8871L0188k8966o4070J7569Q0441L7849l4415m9623j4780J1318
11778C2408k2287k2558K253l569j5498M2937q428k3095n004J3363N3793n6857
11766a2542n4750M2594J1175O896M4787K7897j3694R50n264m5939l8661m755O589
11753c4717O4764k548Q360k4598l3845j9622L1218J8418K3430q452J6332l931
11741C4809J5976k1674J1249p451j3297j7710M60N007J6355P798n6767n1452P1741
11728d956L0986J1208m6396m882L9396k5847L0976m9796N541j0441K0939K7248
11716B3976J397K4232l2048l8801J8178N0158j5838o6063J5854K9439j9214j1599
11704b0329o8071k4678K4007M2887L7954M1877K5374n7157o1109L326L745N0473
$$ plain form
11692 -1701 -2739 3711 -45387 -23290 4514 48965 21942 -20300 -36298 -15552 -42766 -51553
11680 -51553 -39746 -1077 -2122 -12373 9766 25311 56864 68958 69793 53099 23509 -12112
11668 -12112 2622 -25921 -73583 -38887 1361 -16120 -18184 -21269 -23149 -1364 -7523 -14059 29905
11655 29905 24951 27583 13707 18527 25909 8385 3979 -10163 -9454 35139 80983 85835 40813
11642 40813 33450 7671 -8777 -22723 -18012 -36724 -59197 -68975 -41595 -36698 -120501 -140924
11630 -140924 -107785 -81228 -58891 -70009 -15908 31665 67863 -4045 -3687 -1189 -38698 -78152
11618 -78152 -67493 -21619 -58377 -69513 -60975 -71410 -65921 -48105 -83378 -80490 -107237 -69743
11606 -69743 -87696 -59799 -36469 -37586 -36000 -24771 -26260 -69681 -43026 -15424 -76065 -95418
$$ packed form
11692a701j038O450m9098K2097K7804M4451k7023m2242j5998K0746k7214q787
11680e1553J1807L8669j045j0251K2139J5545L1553J2094Q35j6694k9590l5621
11668a2112J4734k8543m7662L4696M0248j7481k064l085j880K1785o159o536M3964
11655B9905m954K632j3876M820P382j7524m406j4142P09M4593M5844M852m5022
11642D0813p363k5779j6448j3946M711j8712k2473r778K7380M897q3803k0423
11630a40924L3139K6557K2337j1118N4101M7573L6198p1908L58K498l7509l9454
11618g8152J0659M5874l6758j1136Q538j0435N489J7816l5273K888k6747L7494
11606f9743j7953K7897K3330j117J586J1229j489m3421K6655K7602o0641j9353
$$ plain form
11594 -95418 -58165 -64442 -19872 -33445 -48937 -69103 -83988 -82012 -34294 -40586 -56043 -50743
11582 -50743 -68642 -75924 -11974 38746 27286 -28249 -20071 -65763 -62417 -26522 7852 6764
11570 6764 -21277 -12562 -27598 -80411 -54528 -19548 2809 27019 -17068 -69298 -29938 1102
11558 1102 24422 8240 -32065 -67183 -76114 -69450 -47975 -2952 -9696 -38437 -45066 -22425 2873
11545 2873 -6563 -14013 -14584 -42992 -15055 20630 31500 -36214 -62686 -58277 -100006 -82308 -72905
11532 -72905 -69127 -61164 -102679 -95226 -31939 -16772 -24600 -13747 1832 7665 -6482 -6056 756
11519 756 11103 -16589 34101 26623 4508 -7641 -44661 -36613 -59425 -19261 -9201 1797
11507 1797 5106 60665 48584 -12213 -3252 26151 56898 46626 -16100 -42358 -77116 -49992
$$ packed form
11594i5418L7253o277M4570j3573j5492k0166j4885J976M7718o292j5457N300
11582e0743j7899p282O3950N0720j1460n5535Q178m5692L346L5895L4374j088
11570F764k8041Q715j5036n2813K5883L4980K2357K4210m4087n2230L9360L1040
11558A102K3320j6182m0305l5118q931O664K1475M5023o744k8741o629K2641K5298
11545B873r436p450n71k8408K7937L5685J0870o7714k6472M409m1729J7698R403
11532g2905L778P963m1515P453O3287J5167p828J0853J5579N833j4147M26O812
11519G56J0347k7692N0690p478k2115j2149l7020Q048k2812M0164J0060J0998
11507A797L309N5559j2081o0797Q961K9403L0747j0272o2726k6258l4758K7124
$$ plain form
11495 -49992 -17578 -29461 -33506 -17930 21667 7383 2385 -29639 -35649 -15850 -30336 -47212
11483 -47212 -47252 -62516 -65415 5181 25211 13203 90626 62048 19735 6945 -42381 -23778
11471 -23778 7477 -27634 45858 49651 36633 13601 21047 55779 64926 24439 -24301 -43531
11459 -43531 -55676 -50078 -57387 -75003 -78521 -62333 -61438 -29252 20960 37198 -7303 -35314 -48230
11446 -48230 -37921 -40045 -49991 -39742 -47222 -47823 -50450 -53202 -34928 -56769 -37409 -30613 46152
11433 46152 99853 108691 120701 81508 -5752 19200 48529 -19212 -87219 -77770 -13694 14910
11421 14910 20110 48597 81644 80429 40551 2201 -20362 -44622 -85588 -44104 -29175 25397
11409 25397 52332 -12736 -35454 2840 30586 40461 39535 30738 42594 41213 39727 23188 -53023
$$ packed form
11495d9992L2414j1883m045J5576L9597j4284m998l2024o010J9799j4486j6876
11483d7212m0j5264k899P0596K0030j2008P7423k8578m2313j2790m9326J8603
11471b3778L1255l5111P3492L793j3018k3032P446L4732R147m0487m8740j9230
11459d3531j2145N598p309j7616l518J6188Q95L2186N0212J6238m4501k8011j2916
11446d8230J0309k124r946J0249p480o01k627k752J8274k1841J9360O796P6765
11433D6152N3701Q838J2010l9193q7260K4952K9329o7741o8007R449O4076K8604
11421A4910N200K8487L3047j215l9878l8350k2563k4260m0966M1484J4929N4572
11409B5397K6935o5068k2718L8294K7746R875r26q797J1856j381j486j6539p6211
$$ plain form
11396 -53023 -58804 28670 64778 28112 19487 41769 7767 -37764 -36666 -27792 -18296 -58517 -66367
11383 -66367 -62123 -64878 -90577 -62812 18764 60284 1649 26793 75883 55589 -5832 -4085
11371 -4085 20825 56803 36895 8700 14928 17773 -26127 -83658 -99619 -57900 -52658 -38733
11359 -38733 -35789 -23205 -45046 -56099 -42950 -20176 -12707 -364 21429 -15086 -26043 42400
11347 42400 1457 -31655 -32036 -31077 340 52917 48780 12091 40046 61377 74100 118132 75949
11334 75949 31018 -2119 -11545 7065 8210 -6007 -41726 -59464 -78966 -16717 2099 -48415
11322 -48415 -71814 -61234 -89295 -71396 -27637 -23789 -12574 11523 37959 33917 2577 18073
11310 18073 31311 -16790 -54532 -74799 -38154 22845 -11030 -83043 -141072 -134746 -54396 -6049
$$ packed form
11396e3023n781Q7474L6108l6666q625K2282l4002m5531J098Q874R496m0221p850
11383f6367M244k755k5699K7765Q1576M1520n8635K5144M9090k0294o1421J747
11371d085K4910L5978j9908k8195O228K845m3900n7531j5961M1719N242J3925
11359c8733K944J2584k1841j1053J3149K2774P469J2343K1793l6515j0957O8443
11347D2400m0943l3112l81R59L1417N2577m137l6689K7955K1331J2723M4032m2183
11334G5949m4931l3137r426J8610J145j4217l5719j7738j9502O2249J8816n0514
11322d8415k3399J0580k8061J7899M3759L848J1215K4097K6436m042l1340J5496
11310A8073J3238m8101l7742k0267L6645O0999l3875p2013n8029O326Q0350M8347
$$ plain form
11298 -6049 12144 41504 31457 -9034 -6651 28630 20058 78810 103054 85662 64806 29059
11286 29059 -5317 62751 97070 143551 138356 98100 71672 130837 157831 114492 92125 53123
11274 53123 57971 23377 3400 32113 24958 -15083 -57642 -37075 20434 23971 -3280 -22609
11262 -22609 24581 37636 18735 -2369 27170 24739 46239 36843 -23751 -43083 -30679 4378
11250 4378 -29565 -29330 -57912 -59068 -30218 -16203 -38154 -9401 43130 88140 140388 168242
11238 168242 295749 433040 467176 411401 279212 229365 163842 101835 69554 1681 29854
11227 29854 92072 88143 5367 -51343 -61092 -79000 -82644 -67189 -58626 -75369 -68815 -21730 -33250
11214 -33250 15574 37277 27336 85226 140850 113901 138572 99716 54256 61034 54294 81298
$$ packed form
11298f049J8193K9360j0047m0491K383L5281q572N8752K4244j7392k0856l5747
11286B9059l4376O8068L4319M6481n195m0256k6428N9165K6994m3339k2367l9002
11274E3123M848l4594j9977K8713p155m0041m2559K0567N7509L537k7251j9329
11262b2609M7190J3055j8901k1104K9539k431K1500r396o0594j9332J2404L5057
11250D378l3943K35k8582j156K8850J4015k1951K8753N2531M5010N2248K7854
11238A68242J27507J37291L4136n5775j32189m9847o5523o2007l2281o7873K8173
11227B9854O2218l929q2776n6710r749j7908l644J5455Q563j6743O554M7085j1520
11214c3250M8824K1703r941N7890N5624k6949K4671l8856m5460O778o740K7004
$$ plain form
11202 81298 58962 -2213 59666 56315 -7453 -27291 48625 72926 124405 195854 313775 421591
11190 421591 488773 476291 347123 255099 126323 30074 -13878 20311 61002 93110 153321
11179 153321 136053 76486 76343 122460 92532 71368 56641 7035 -5355 56027 100071 71925
11167 71925 -6017 -14415 -36624 -36819 593 920 1322 6231 -18617 -76998 -50011 -53748 -39868
11154 -39868 -28969 -22555 -40442 -38248 -25413 2112 64710 81228 72591 63212 92657 161144
11142 161144 178564 124093 133930 85487 69260 54632 46349 97174 122511 108725 96179 66120
11130 66120 74030 61958 33175 39520 -2028 -42802 -45595 -54551 -30005 -53967 14789 26529
11118 26529 -14017 -10236 26574 68482 14922 15097 29121 102468 76347 7793 -28813 -85785
$$ packed form
11202H1298k2336o1175O1879l351o3768j9838P5916K4301N1479P1449J17921J07816
11190D21591O7182j2482j29168r2024j28776r6249m3952L4189M0691L2108O0211
11179A53321j7268n9567j43M6117k9928k1164j4727m9606j2390O1382M4044k8146
11167G1925p7942q398k2209j95L7412L27M02M909k4848n8381K6987l737J3880
11154c9868J0899O414j7887K194J2835K7525O2598J6518q637r379K9445O8487
11142A61144J7420n4471R837m8443j6227j4628q283N0825K5337j3786j2546l0059
11130F6120P910j2072k8783O345m1548m0774k793q956K4546k3962O8756J1740
11118B6529m0546L781L6810M1908n3560J75J4024P3347k6121o8554l6606n6972
$$ plain form
11106 -85785 -106332 -82792 -61572 -59424 -71996 -63817 -13965 -6349 -10414 -21519 57200 60333 39570
11093 39570 52107 8647 -10414 -15497 -85192 -60188 -55655 -22713 -10295 -24668 -28312 -45889
11081 -45889 -2871 -12622 -20997 -35627 -12126 27453 63666 58704 36705 -14009 -41676 -73757
11069 -73757 -68816 -26976 18287 71692 89119 41197 -15108 50690 68077 36063 -23024 -20195
11057 -20195 -4322 -67 9793 2680 -5333 26620 36849 1562 -20929 -81833 -99319 -14196
11045 -14196 -678 -34341 15429 54710 30184 3799 48570 42472 25768 53723 63208 4058
11033 4058 -48055 -14072 -25935 -22070 -998 24493 42891 87384 39422 19494 19570 -10807 -44481
11020 -44481 -72383 -75240 -35716 -9851 -15997 38540 49423 -75631 -92232 -73232 -68429 -46866
$$ packed form
11106h5785k0547K3540K1220K148j2572Q179M9852P616m065j1105P8719L133k0763
11093C9570J2537m3460j9061n083o9695K5004M533L2942J2418j4373l644j7577
11081d5889M3018r751q375j4630K3501L9579L6213m962k1999n0714k7667l2081
11069g3757M941M1840M5263N3405J7427m7922n6305O5798J7387l2014n9087K829
11057b0195J5873M255R860p113q013L1953J0229l5287k2491o0904j7486Q5123
11045a4196J3518l3663M9770L9281k4526k6385M4771o098j6704K7955R485n9150
11033D058n2113L3983j1863L865K1072K5491J8398M4493m7962j9928P6l0377l3674
11020d4481k7902k857L9524K5865o146N4537J0883j25054j6601J9000M803K1563
$$ plain form
11008 -46866 -79524 -104460 -97079 -88778 -67083 -49225 -15714 -15468 -21951 9568 39578 37911 20111
10995 20111 -6184 -4500 28658 50638 43929 41317 59434 23075 -40860 -66451 -40718 -73422
10983 -73422 -75682 -24130 -2794 61741 51830 25948 10273 -76604 -62807 -69976 -37186 13040
10971 13040 12560 -21122 -43140 -55767 -41212 -8454 996 23646 9419 -12220 5501 53032
10959 53032 80455 90890 92672 118136 187749 201989 152186 129887 99888 97858 106398 96432
10947 96432 134164 175401 206030 245307 196888 237462 364686 556922 796192 1054335 1311243
10936 1311243 1526977 1733863 2000725 2194788 2335524 2261619 2075543 1850318 1628173 1357960
10926 1357960 1105044 847531 584637 455272 379341 329019 315124 285350 242173 182517
$$ packed form
11008d6866l2658k4936P381Q301K1695J7858L3511K46o483L1519L0010j667j7800
10995B0111k6295J684L3158K1980o709k612J8117l6359o3935k5591K5733l2704
10983g3422k260N1552K1336O4535r911k5882j5675q6877J3797p169L2790N0226
10971A3040m80l3682k2018j2627J4555L2758R450K2650j4227k1639J7721M7531
10959E3032K7423J0435J782K5464O9613J4240m9803k2299k9999k030Q540r966
10947I6432L7732M1237L0629L9277m8419M0574J27224J92236K39270K58143K56908
10936A311243K15734K06886K66862J94063J40736p3905j86076k25225k22145k70213
10926A357960k52916k57513k62894j29365p5931n0322j3895k9774m3177n9656
$$ plain form
10916 182517 177475 182859 161214 166095 156462 119183 114249 104691 67855 70896 69848 77004 111908
10903 111908 116149 97517 86938 53564 44618 83608 85323 105261 149971 163307 138489 143924
10891 143924 124062 98629 69878 66899 112976 90213 37410 434 50573 78845 77308 75373
10879 75373 46608 -8068 -7607 31927 47621 44130 65464 137219 65046 70281 64525 54071 122322
10866 122322 95415 43686 64132 44525 20047 -19106 -53660 -36090 -26010 -47232 -11965
10855 -11965 45541 59422 18320 35422 73603 47633 34092 81488 131624 149246 159613 85784
10843 85784 79973 120820 138090 141379 172788 137202 120825 127708 89463 120182 122050 85073
10831 85073 50735 93781 105378 99037 74187 59278 58354 25999 -23481 26500 68497 107638
$$ packed form
10916A82517n042N384k1645M881r633l7279m934r558l6836L041j048P156L4904
10903A11908M241j8632j0579l3374q946L8990J715J9938M4710J3336k4818N435
10891A43924j9862k5433k8751k979M6077k2763n2803l6976N0139K8272j537j935
10879G5373k8765n4676M61L9534J5694l491K1334P1755p2173N235n756j0454O8251
10866A22322k6907n1729K0446j9607k4478l9153l4554J7570J0080k1222L5267
10855a1965N7506J3881m1102J7102L8181k5970j3541M7396N0136J7622J0367p3829
10843H5784n811M0847J7270L289L1409l5586j6377O883l8245L0719J868l6977
10831H5073l4338M3046J1597o341k4850j4909r24l2355m9480M9981M1997L9141
$$ plain form
10819 107638 104520 72737 28656 10415 -13997 -50164 -35093 24268 13660 -32705 -44691 -17073
10807 -17073 37074 95898 84458 75121 62019 31373 25879 8613 10373 15225 47310 122625
10795 122625 177629 251400 276821 290355 290819 307195 327757 386282 387796 405862 418355 410277
10783 410277 425843 384179 425958 378143 355595 358982 340784 273783 254860 231352 259623 199097
10771 199097 82555 82182 79570 57483 1535 16352 40846 70494 8856 7629 29168 42778
10759 42778 48369 66746 75301 68559 10386 -2565 -24830 -21987 -21070 -20192 -20467 -13512 -23185 -16332
10745 -16332 -542 -16330 1117 -38934 -31596 -60819 -67496 -17616 62125 154275 229089 201610
10733 201610 107057 73869 89815 148985 185264 195435 200841 229313 287584 304972 330804 402124
$$ packed form
10819A07638l118l1783m4081j8241k4412l6167J5071N9361j0608m6365j1986K7618
10807a7073N4147N8824j1440r337j3102l0646n494j7266J760M852L2085P5315
10795A22625N5004P3771K5421J3534M64J6376K0562N8525J514J8066J2493q078
10783D10277J5566m1664M1779m7815k2548L387j8198o7001j8923k3508K8271o0526
10771A99097j16542l73k612k2087n5948J4817K4494K9648o1638j227K1539J3610
10759D2778N591J8377Q555o742n8173j2951k2265K843R17Q78k75O955r673O853
10745a6332J5790j5788J7447m0051P338k9223o677M9880P9741R2150P4814k7479
10733B01610r4553l3188J5946N9170L6279J0171N406K8472N8271J7388K5832P1320
$$ plain form
10721 402124 532556 782248 1023415 1357395 1692193 1944027 2210789 2461443 2637391 2626455
10711 2626455 2474322 2271502 2041862 1855353 1626103 1294790 929220 694319 603101 522325
10701 522325 476727 418112 387626 385742 421004 387228 412627 392695 383100 421177 411390 399080
10689 399080 416438 355624 310877 282531 225301 172148 171849 240804 294156 280143 199455 146062
10677 146062 58757 92162 129812 65215 127514 217781 207490 192672 204803 248906 233231
10666 233231 230673 285154 313974 270906 299950 350906 392619 441314 412085 414848 499185 505454
10654 505454 460364 399789 367043 379436 344737 340759 349049 372179 329248 283984 316993 345672
10642 345672 349686 333549 332916 333288 351962 395447 391614 351653 355434 318317 273834 328031 339038
$$ packed form
10721D02124J30432K49692K41167L33980L34798K51834K66762K50654J75948j0936
10711B626455j52133k02820k29640j86509k29250l31313l65570k34901r1218q0776
10701E22325m5598n8615l0486j884L5262l3776K5399j9932r595L8077r787j2310
10689C99080J7358o0814m4747k8346n7230n3153k99O8955N3352j4013q0688n3393
10677A46062q7305L3405L7650o4597O2299R0267j0291j4818J2131M4103j5675
10666B33231k558N4481K8820m3068K9044N0956M1713M8695k9229K763Q4337O269
10654E05454m5090o0575l2746J2393l4699l978Q290K3130m2931m5264L3009K8679
10642C45672M014j6137o33L72J8674M3485l833l9961L781l7117m4483N4197J1007
$$ plain form
10629 339038 346318 311453 287323 291026 311193 300184 332060 363573 353949 366736 386227 321118
10617 321118 282598 341375 371618 371980 373760 354833 296569 294807 349685 444531 526850 565602
10605 565602 520954 499392 531032 560402 556746 622438 669512 610422 584515 546787 569603 582963
10593 582963 619308 626104 611583 614408 683320 725784 724780 773389 874507 954022 1013935 1112387
10581 1112387 1175342 1233880 1288038 1381742 1453845 1622402 1771793 1877877 2039298 2163620
10571 2163620 2327834 2428945 2553231 2682837 2833736 2981828 3229701 3505181 3801861
10562 3801861 4214330 4820167 5683787 6684014 7928673 9252722 10669273 12187762 13687909
10553 13687909 15135682 16671962 18271528 19932819 21908368 24448298 27985253 33333053
$$ packed form
10629C39038P280l4865k4130L703K0167j1009L1876L1513r624J2787J9491o5109
10617C21118l8520N8777L0243L62J780j8927n8264j762N4878R4846Q2319L8752
10605E65602m4648k1562L1640K9370l656O5692M7074n9090k5907l7728K2816J3360
10593E82963L6345O796j4521K825O8912M2464j004M8609J01118P9515N9913R8452
10581A112387O2955N8538N4158R3704P2103J68557J49391J06084J61421J24322
10571B163620J64214J01111J24286J29606J50899J48092K47873K75480K96680
10562C801861M12469O05837Q63620J000227J244659J324049J416551J518489J500147
10553A3687909J447773J536280J599566J661291J975549K539930L536955N347800
$$ plain form
10545 33333053 41739560 55859972 80440195 121175591 174690995 231040357 284705807
10538 284705807 328514077 366336101 398189128 414225889 414024933 395660919 364180045
10531 364180045 327073637 282507392 228596362 173622173 123043149 87194936 65523499
10524 65523499 52301917 43782608 37883464 33566914 30244706 27478180 25060322 22898862
10516 22898862 20937510 19065389 17201976 15351152 13634357 12130280 10773900 9698090
10508 9698090 8794269 7988944 7324140 6756589 6239093 5757256 5337941 4992195 4647467
10499 4647467 4321192 3950068 3639691 3381123 3135263 2874730 2729628 2548333 2405585
10490 2405585 2276609 2157090 2080397 1950174 1837941 1756254 1706132 1706205 1708392 1660740 1636820
$$ packed form
10545C3333053Q406507J4120412K4580223M0735396N3515404N6349362N3665450
10538B84705807M3808270L7822024L1853027J6036761k00956j8364014l1480874
10531C64180045l7106408m4566245n3911030n4974189n0579024l5848213k1671437
10524F5523499j3221582q519309n899144m316550l322208k766526k417858k161460
10516B2898862j961352j872121j863413j850824j716795j504077j356380j075810
10508I698090r03821q05325o64804n67551n17496m81837m19315l45746l44728
10499D647467l26275l71124l10377k58568k45860k60533j45102j81295j42748
10490B405585j28976j19519p6693j30223j12233q1687n0122P3K187m7652k3920
$$ plain form
10479 1636820 1617324 1540592 1539136 1554163 1531222 1459996 1385030 1334152 1305010 1220813 1132248
10468 1132248 1071869 989803 889527 833614 784515 737977 780710 774882 785030 775278 763613
10457 763613 746311 766723 714510 683932 623141 603545 633039 638671 609441 571148 526787 530498
10445 530498 498774 511246 509131 494864 486002 450710 418274 407748 412343 386399 383135 405871
10433 405871 429006 380155 311861 238828 259798 302392 281396 288240 308989 262506 268632 299636
10421 299636 277085 261977 232874 289666 341505 345719 309214 244595 196387 199848 265301 269536
10409 269536 208119 144813 190310 210088 239362 235107 298345 347854 372301 343980 351199 319387
10397 319387 330337 322013 345184 364729 392375 407835 449028 484539 484425 363220 267370 212552
$$ packed form
10479A636820j9496p6732j456J5027k2941p1226p4966n0878k9142q4197q8565
10468A132248o0379q2066j00276n5913m9099m6538M2733n828J0148r752j1665
10457G63613j7302K0412n2213l0578o0791j9596K9494N632k9230l8293m4361L711
10445E30498l1724J2472k115j4267q862l5292l2436j0526M595k5944l264K2736
10433D05871K3135m8851o8294p3033K0970M2594k0996O844K0749m6483O126L1004
10421B99636k2551j5108k9103N6792N1839M214l6505o4619m8208L461O5453M235
10409B69536o1417o3306M5497J9778K9274m255O3238M9509K4447k8321P219l1812
10397C19387J0950q324K3171J9545K7646J5460M1193L5511j14j21205r5850n4818
$$ plain form
10385 212552 250852 275327 289432 298142 250077 210445 152115 116800 132080 173983 200036 204714
10373 204714 177962 128030 99105 80698 62012 115285 178360 140520 80219 85520 114476 111146
10361 111146 96626 98600 144631 175032 167567 121710 63358 42023 83848 108753 158728 205030
10349 205030 223930 205799 195095 191958 230070 217371 169387 188439 225826 213297 169956 156795
10337 156795 176880 194115 198067 227513 217317 203734 210794 234775 242476 220014 242263 261354
10325 261354 254321 254137 239849 260239 289934 306029 308717 250649 190836 158527 189526 243147
10313 243147 192477 143269 158277 161101 159062 187750 215205 226759 247528 240742 232681 218485
10301 218485 214779 249992 341302 429236 528628 680111 847047 1057957 1191766 1292849 1340252
$$ packed form
10385B12552L8300K4475J4105Q710m8065l9632n8330l5315J5280M1903K6053M678
10373B04714k6752m9932k8925j8407j8686N3273O3075l7840o0301N301K8956l330
10361A11146j4520J974M6031L0401p465m5857n8352k1335M1825K4905M9975M6302
10349B05030J8900j8131j0704l137L8112j2699m7984J9052L7387j2529m3341j3161
10337A56795K0085J7235L952K9446j0196j3583P060K3981P701k2462K2249J9091
10325B61354p033j84j4288K0390K9695J6095K688n8068n9813l2309L0999N3621
10313B43147n0670m9208J5008K824k039K8688K7455J1554K0769o786q061j4196
10301B18485l706L5213R1310Q7934R9392J51483J66936K10910J33809J01083M7403
$$ plain form
10290 1340252 1316212 1312308 1295428 1235808 1136126 981241 854514 748252 679365 559640 401260
10279 401260 341477 357278 330592 317979 295326 296613 308147 309633 286052 335778 383132 417524
10267 417524 527989 632734 758111 1034308 1434386 1829855 2266963 2739960 3162490 3626013
10257 3626013 3913662 4100181 4054701 3914485 3622443 3180842 2710036 2212564 1767906 1353409
10247 1353409 1023177 819029 628489 528701 449261 335348 207230 176783 204080 183044
10237 183044 195045 223151 203506 181570 188558 182391 160707 168250 180561 157897 94816 53563
10225 53563 60012 96065 128392 159357 164438 186582 189361 183675 153632 145552 101948 118437 112232
10212 112232 109968 82415 99051 105219 61492 104788 148093 160221 161227 134831 93136 106212
$$ packed form
10290A340252k4040l904j6880n9620r9682j54885j26727j06262o8887j19725j58380
10279D01260n9783J5801k6686j2613k2653J287J1534J486k3581M9726M7354L4392
10267D17524J10465J04745J25377K76197M00078L95469M37108M72997M22530M63523
10257C626013K87649J86519m5480j40216k92042m41601m70806m97472m44658m14497
10247A353409l30232k04148j90540r9788p9440j13913j28118l0447K7297k1036
10237A83044J2001K8106j9645k1936O988o167k1684P543J2311k2664o3081m1253
10225E3563O449L6053L2327L0965N081K2144K779n686l0043q080m3604J6489o205
10212A12232k264k7553J6636O168m3727M3296M3305J2128J006k6396m1695J3076
$$ plain form
10200 106212 101638 93240 56020 71183 111287 86295 64930 16442 -1246 27854 35884 57096
10188 57096 70415 55435 50860 54132 46884 22377 25578 14693 14478 16823 22614 49824 73669
10175 73669 48059 43078 100063 145894 123203 95336 39033 -16076 4205 -20525 -30069 -51620
10163 -51620 -29532 -826 -1504 -29185 -35780 8324 51241 53680 38871 46832 66129 84824 112714
10150 112714 153065 190254 169369 173073 180608 169608 176760 216595 289497 356874 513373 775431
10138 775431 1044509 1348811 1673621 1890936 2053484 2195403 2288606 2325379 2181851 2016754
10128 2016754 1822748 1545173 1313841 1064463 838611 650562 471430 323065 276215 250635
10118 250635 185553 138565 207205 228652 231928 218048 162183 169450 142496 119935 126978 109074
$$ packed form
10200A06212m574q398l7220J5163M0104k4992k1365m8488j7688K9100Q030K1212
10188E7096J3319j4980m575L272p248k4507L201j0885k15K345N791K7210K3845
10175G3669k5610m981N6985M5831k2691k7867n6303n5109K0281k4730r544k1551
10163e1620K2088K8706o78k7681o595M4104M2917K439j4809P961J9297J8695K7890
10150A12714M0351L7189k0885L704P535j1000P152L9835P2902O7377J56499K62058
10138G75431K69078L04302L24810K17315J62548J41919R3203L6773j43528j65097
10128B016754j94006k77575k31332k49378k25852j88049j79132j48365m6850k5580
10118B50635o5082m6988O8640K1447L276j3880n5865P267k6954k2561P043j7904
$$ plain form
10106 109074 121661 149236 88243 48877 26198 20600 31873 11477 37493 75123 97660 55065
10094 55065 59730 116967 99527 93798 21978 -37644 -8108 -52577 -67346 -55918 -51577 -34915
10082 -34915 -31856 -7392 21506 60216 66572 59561 81867 104248 62408 40531 46946 56292 56146
10069 56146 40273 49188 1628 -14835 3815 62670 75637 61683 65565 53014 55171 75651
10057 75651 68735 53337 60919 76416 59844 105187 125113 116093 54570 6886 -27357 -18532
10045 -18532 -5146 -1992 -20040 27331 37676 -22751 -30463 -37799 -8280 56351 85809 42298
10033 42298 24742 2984 -444 -14425 9528 -20016 -45736 -86405 -108443 -97434 -49400 -32056
10021 -32056 -59580 -83020 -41888 -33343 -58144 -45048 17121 6299 15557 -12973 -477 -19589
$$ packed form
10106A09074J2587K7575o0993l9366k2679n598J1273k0396K6016L7630K2537m2595
10094E5065M665N7237j7440n729p1820n9622K9536m4469j4769J1428M341J6662
10082c4915L059K4464K8898L8710O356p011K2306K2381m1840k1877O415R346j46
10069E6146j5873Q915m7560j6463J8650N8855J2967j3954L882j2551K157K0480
10057G5651o916j5398P582J5497j6572M5343J9926r020o1523m7684l4243Q825
10045a8532J3386L154j8048M7371J0345o0427p712p336K9519O4631K9458m3511
10033D2298j7556k1758l428j3981K3953k9544k5720m0669k2038J1009M8034J7344
10021c2056k7524k3440M1132Q545k4801J3096O2169j0822R258k8530J2496j9112
$$ plain form
10009 -19589 -19103 7717 39126 91534 80522 18528 -22682 -33759 8500 54167 34696 -13262
9997 -13262 -14267 -7311 -11523 -5091 -31474 -40107 -73670 -101630 -55251 -36472 -11759 -21435 -23422
9984 -23422 -53045 -20704 9636 1922 12697 305 51363 97052 29199 -3748 -4897 -4361 -44494
9971 -44494 -18279 9810 23870 3885 -17730 -41210 -46903 -45564 18207 36441 26839 81931
9959 81931 95028 77127 65355 50483 37692 36979 47513 71800 84205 116900 113168 64699
9947 64699 16902 3507 26221 53333 45546 23726 33856 94872 132444 84770 48463 38898
9935 38898 392 -54853 -49677 -17439 23969 -10251 -21030 -44352 -52485 -54772 -37623 -51801
9923 -51801 -78724 -57693 -7243 4613 -38076 -55353 -25772 42968 70403 112263 135293 99451
$$ packed form
10009a9589M86K6820L1409N2408j1012o1994m1210j1077M2259M5667j9471m7958
9997a3262j005O956m212O432k6383q633l3563k7960M6379J8779K4713r676j987
9984b3422k9623L2341L0340p714J0775j2392N1058M5689o7853l2947j149N36m0133
9971d4494K6215K8089J4060j9985k1615k3480n693J339O3771J8234r602N5092
9959H1931J3097j7901j1772j4872j2791p13J0534K4287J2405L2695l732m8469
9947F4699m7797j3395K2714K7112p787k1820J0130O1016L7572m7674l6307r565
9935C8898l8506n5245N176L2238M1408l4220j0779k3322q133k287J7149j4178
9923e1801k6923K1031N0450J1856m2689j7277K9581O8740K7435M1860K3030l5842
$$ plain form
9911 99451 28711 2240 18834 28818 -404 -43900 -54761 -20911 26238 53468 58521 42899
9899 42899 44760 72209 82523 68472 71936 90656 78258 59672 37118 7127 23360 62573
9887 62573 78594 96202 31196 13437 18991 48403 53405 63975 45438 2753 -18693 -12332
9875 -12332 -58006 -33470 -13404 25042 59338 111573 96202 65294 49595 15580 1665 16122
9863 16122 31642 30251 -7569 -15476 74895 189986 222635 139492 83585 65796 -15406 -3118
9851 -3118 5777 8241 11950 -15467 -14451 -21248 -70088 -44736 -45953 -45857 -65679 -61069 -23637 37644
9837 37644 68041 26904 -23949 -10001 22263 13255 -14450 -24333 -35529 -30567 -56526 -121520
9825 -121520 -78181 8568 26409 65870 93160 75932 40456 77142 122619 127650 98233 91771
$$ packed form
9911I9451p0740k6471J6594R984k9222m3496j0861L3850M7149K7230N053j5622
9899D2899J861K7449J0314j4051L464J8720j2398j8586k2554k9991J6233L9213
9887F2573J6021J7608o5006j7759N554K9412N002J0570j8537m2685k1446O361
9875a2332m5674K4536K0066L8446L4296N2235j5371l0908j5699l4015j3915J4457
9863A6122J5520j391l7820p907R0371J15091L2649q3143n5907j7789q1202J2288
9851c118Q895K464L709k7417J016o797m8840K5352j217R6j9822M610L7432O1281
9837C7644L0397m1137n0853J3948L2264r008k7705r883j1196M962k5959o4994
9825a21520M3339Q6749J7841L9461K7290j7228l5476L6686M5477N031k9417o462
$$ plain form
9813 91771 23219 26513 59377 96084 95523 78418 33765 18358 39505 68776 49079 15084
9801 15084 -37583 -12915 19858 13687 -3245 -2189 10728 19980 24743 14940 -27232 -80441 -119599
9788 -119599 -48035 23348 50522 -3138 -7779 -37609 -44118 -56287 -11320 40784 -3466 2909
9776 2909 41161 37362 -6512 -39739 -35839 31464 33277 8439 50036 39503 13971 32243 -6606
9763 -6606 33394 38781 30224 14582 3046 -5973 21180 35319 -2908 -17745 -4561 9114 10680
9750 10680 -7143 -31736 -63195 -94822 -71287 -47653 -32454 -29777 -14908 -18203 -74105 -59972
9738 -59972 -55570 -19524 32424 3270 -19052 -30358 -52790 17212 27247 5835 33884 83356
9726 83356 69029 41884 37966 20886 -8661 -40557 -65017 -58551 -89254 -105274 -118634 -61256
$$ packed form
9813I1771o8552L294L2864L6707n61j7105m4653j5407K1147K9271j9697l3995
9801A5084n2667K4668L2773o171j6932J056J2917R252M763r803m2172n3209l9158
9788a19599P1564P1383K7174n3660m641k9830o509j2169M4967N2104m4250O375
9776B909L8252l799m3874l3227L900O7303J813k4838M1597j0533k5532J8272l8849
9763f606M0000N387q557j5642j1536r019K7153J4139l8227j4837J3184J3675J566
9750A0680j7823k4593l1459l1627K3535K3634J5199K677J4869l295n5902J4133
9738e9972M402L6046N1948k9154k2322j1306k2432P0002J0035k1412K8049M9472
9726H3356j4327k7145l918j7080k9547l1896k4460O466l0703j6020j3360N7378
$$ plain form
9714 -61256 -10609 12330 -7287 -31749 -45018 -74162 -91590 -93516 -26543 28109 31192 16338
9702 16338 -3659 -32277 -52963 -87146 -63424 24670 35229 13880 -44656 -57875 -38661 -64213
9690 -64213 -60848 -46196 -51970 -38363 -13300 -11889 -4469 66623 83444 57706 46877 59310 -15022
9677 -15022 -25912 -21480 26009 52227 40571 28461 16454 -7423 -9643 19210 8724 33753
9665 33753 15664 60444 79333 80530 57562 5016 36194 51275 65919 78411 136294 150415
9653 150415 122324 95827 32253 41784 64222 7938 -40101 -40757 38165 21397 -20222 -56600
9641 -56600 -37962 -39257 -59672 -48922 -5704 19673 10415 14009 16724 -30895 -41551 4649 -3272
9628 -3272 11569 54281 69096 21047 606 -10000 7770 63804 35130 56879 66177 52067
$$ packed form
9714f1256N0647K2939j9617k4462j3269k9144j7428j926O6973N4652L083j4854
9702A6338j9997k8618k0686l4183K3722Q8094J0559k1349n8536j3219J9214k5552
9690f4213L365J4652n774J3607K5063J411P420P1092J6821k5738j0829J2433p4332
9677a5022j0890M432M7489K6218j1656j2110j2007k3877k220K8853j0486K5029
9665C3753j8089M4780J8889J197k2968n2546L1178J5081J4644J2492N7883J4121
9653A50415k8091k6497o3574R531K2438n6284m8039o56P8922j6768m1619l6378
9641e6600J8638j295k0415J0750M3218K5377r258L594K715m7619j0656M6200p921
9628c272J4841M2712J4815m8049k0441j0606J7770N6034k8674K1749R298j4110
$$ plain form
9616 52067 80710 39340 4344 -35716 -36533 -20191 19534 47728 7829 -16007 -14741 -14564 -26928
9603 -26928 -23602 -24952 -49572 -51219 -23974 12355 12563 -8380 -26578 -32338 -41778 -75489 -47052
9590 -47052 -50340 -36158 14318 9103 -35340 -32352 -6452 36783 45585 78023 103240 74619 52981
9577 52981 40771 -27508 -50657 -28013 -20821 -56297 -61272 -56226 -59635 -20416 -9333 30905 32182
9564 32182 -14658 9995 30502 5235 18585 -2568 -44856 -76719 -67016 -28562 2594 -47341
9552 -47341 -72528 -58638 -38069 -5728 26852 57125 45623 53498 36245 1539 1952 -10089
9540 -10089 4217 27843 36514 57128 21260 20474 13522 -6956 -42592 -34924 43665 44396 579
9527 579 -4966 11923 5300 -35853 -27739 -28882 -23851 -32835 -73173 -86944 -82125 -16259 11357 18898
$$ packed form
9616E2067K8643m1370l4996m0060q17J6342L9725K8194l9899k3836J266J77j2364
9603b6928L326j350k4620j647K7245L6329K08k0943j8198n760r440l3711K8437
9590d7052l288J4182N0476n215m4443K988K5900M3235Q802L2438K5217k8621k1638
9577E2981j2210o8279k3149K2644P192l5476m975N046l409L9219J1083M0238J277
9564C2182m6840K4653K0507k5267J3350k1153m2288l1863R703L8454L1156m9935
9552d7341k5187J3890K0569L2341L2580L0273j1502P875j7253l4706M13j2041
9540a0089J4306K3626Q671K0614l5868p86o952k0478l5636P668P8589P31m3817
9527E79n545J6889o623m1153Q114j143N031q984m0338j3771M819O5866K7616P541
$$ plain form
9513 18898 44541 -11722 -33432 43236 46059 66882 29866 17839 41215 64176 113515 110332
9501 110332 57367 24481 38549 52145 35209 2377 -4337 -13985 -26287 -55437 -59708 -45786
9489 -45786 -65536 -84788 -53295 -60490 -33374 3928 7037 45302 17751 -15442 2062 -16435
9477 -16435 -25721 -50088 -8388 67135 69429 28116 -56469 -96634 -34449 24268 44568 48540
9465 48540 8795 -21896 -68764 -41974 217 -19295 -47547 -74544 -97007 -91072 -81577 -58716
9453 -58716 -48430 -52440 -44762 -39510 -20876 21398 36918 32009 -46080 -62019 -10139 32407 11592
9440 11592 20409 7596 -45648 1609 -2300 -17284 28787 51661 40095 -26885 -44086 -17257
9428 -17257 65318 72911 8961 -29248 -9620 8214 29738 54881 42349 29450 71880 57161
$$ packed form
9513A8898K5643n6263k1710P6668K823K0823l7016j2027K3376K2961M9339l183
9501A10332n2965l2886J4068J3596j6936l2832o714r648j2302k9150m271J3922
9489d5786j9750j9252L1493p195K7116L7302L109L8265k7551l3193J7504j8497
9477a6435r286k4367M1700P5523K294m1313q4585m0165O2185N8717K0300L972
9465D8540l9745l0691m6868K6790M2191j9512k8252k6997k2463N935R495K2861
9453e8716J0286m010P678N252J8634M2274J5520m909p8089j5939N1880M2546k0815
9440A1592Q817j2813n3244M7257l909j4984M6071K2874j1566o6980j7201K6829
9428a7257Q2575P593o3950l8209J9628J7834K1524K5143j2532j2899M2430j4719
$$ plain form
9416 57161 41666 70039 114961 114592 50535 60802 125309 140649 107254 49001 80770 113476
9404 113476 138967 86727 26131 93247 161723 131174 87352 96740 96660 45281 25880 38631
9392 38631 62684 127206 162292 136235 138745 69877 62403 126398 118504 73484 70999 86835 60658
9379 60658 32721 25073 39942 26981 35791 31032 70267 62872 82354 98619 113356 100177 24429
9366 24429 8613 307 -22590 -16877 -37740 -21504 92328 184616 188157 171735 173424 151077
9354 151077 139880 112671 99564 110843 142574 113802 65980 123396 206252 229989 244384 263288
9342 263288 252735 187517 152373 168832 273319 325130 290259 258722 245848 268206 239101
9331 239101 281492 330003 363971 386804 398976 424812 434293 472241 495804 518514 501241 472197
$$ packed form
9416E7161j5495K8373M4922l69o4057J0267O4507J5340l3395n8253L1769L2706
9404A13476K5491n2240o0596O7116O8476l0549m3822R388q0n1379j9401J2751
9392C8631K4053O4522L5086k6057K510o8868p474O3995p894m5020k485J5836k6177
9379F0658k7937p648J4869j2961Q810m759L9235p395J9482J6265J4737j3179p5748
9366B4429j5816q306k2897N713k0863J6236J13832R2288L541j6422J689k2347
9354A51077j1197k7209j3107J1279L1731k8772m7822N7416Q2856K3737J4395J8904
9342B63288j0553o5218l5144J6459J04487N1811l4871l1537j2874K2358k9105
9331B39101M2391M8511L3968K2833J2172K5836R481L7948K3563K2710j7273k9044
$$ plain form
9319 472197 489588 534513 621135 660691 663020 732366 805029 839426 871569 924817 1000778 1041190
9307 1041190 1074103 1115237 1172662 1223921 1256399 1357454 1434475 1504790 1627023 1728532 1785702
9296 1785702 1881725 1956480 1979027 1979791 1996967 2050955 2113634 2141931 2172327 2155863 2106214 2075780
9284 2075780 2078839 2040423 1984969 1956834 1915524 1819584 1719150 1608156 1538792 1540287 1508948
9273 1508948 1401906 1272946 1201424 1116941 1018829 998845 949082 890829 865446 850744 841515
9262 841515 868038 804704 757802 695665 663969 707249 664357 594985 563567 520127 524310 478352
9250 478352 446878 421174 357996 362769 319953 302487 337432 349297 305649 284607 299254 286293
9238 286293 238455 205760 196924 260188 282805 253145 258159 292805 292088 292051 249025 209665 236092
$$ packed form
9319D72197J7391M4925Q6622L9556K329O9346P2663L4397L2143N3248P5961M0412
9307A041190L2913M1134N7425N1259L2478J01055P7021P0315J22233J01509N7170
9296A785702R6023P4755K2547P64J7176N3988O2679K8297L0396j6464m9649l0434
9284B075780L059l8416n5454k8135m1310r5940j00434j10994o9364J495l1339
9273A508948j07042j28960p1522q4483r8112j9984m9763n8253k5383j4702r229
9262H41515K6523o3334m6902o2137l1696M3280m2892o9372l1418m3440M183m5958
9250D78352l1474k5704o3178M773m2816j7466L4945J1865m3648k1042J4647j2961
9238B86293m7838l2695q836O3264K2617k9660N014L4646p17l7m3026l9360K6427
$$ plain form
9225 236092 216114 217896 195073 186838 221783 184989 191765 174807 165337 137197 96432 89274 80256
9212 80256 82808 101038 74117 54486 69339 94253 79934 74705 54752 81237 93029 86439
9200 86439 94180 90227 60595 27012 26446 69349 63022 39258 52247 84916 48306 49555 84094
9187 84094 102477 84223 60119 72321 73306 86554 92878 121729 119620 99154 115498 100596 84471
9174 84471 72257 94953 95141 93863 86759 98089 109867 145191 160413 112743 120094 114368 99406
9161 99406 113501 99708 90300 37368 -6099 -13757 10697 55989 56783 22991 41010 40496 58283
9148 58283 58474 78531 98412 80579 76152 80252 90925 98371 51871 25530 66850 81730 50259
9135 50259 -2499 4892 67366 106048 58141 16108 -25584 25286 13265 -7652 302 -10461
$$ packed form
9225B36092j9978J782k2823q235L4945l6794O776j6958r470k8140m0765p158r018
9212H0256K552J8230k6921j9631J4853K4914j4319n229j9953K6485J1792o590
9200H6439P741l953k9632l3583n66M2903o327k3764J2989L2669l6610J249L4539
9187H4094J8383j8254k4104J2202R85J3248O324K8851k109k0466J6344j4902j6125
9174H4471j2214K2696J88j278p104J1330J1778L5324J5222m7670P351n726j4962
9161I9406J4095j3793r408n2932m3467p658K4454M5292P94l3792J8019n14J7787
9148E8283J91K0057J9881j7833m427M100J0673P446m6500k6341M1320J4880l1471
9135E0259n2758P391O2474L8682m7907m2033m1692N0870j2021k0917P954j0763
$$ plain form
9123 -10461 -10568 -23329 9189 62986 112185 100889 41090 68407 76931 25509 -12103 -32051
9111 -32051 -28027 -9878 -41621 -13285 448 25401 53456 -13939 -13954 -16340 -8682 -542 14411
9098 14411 78889 96038 94885 66216 87191 85372 69709 97194 129013 76765 66553 89887
9086 89887 73063 48876 58462 89299 82674 72060 52982 22723 -5183 -25637 8450 18110
9074 18110 85544 100990 53124 61999 102484 142602 126883 110525 65009 66988 60153 65440 71966
9061 71966 41695 49944 66628 39158 -791 40520 38607 7439 3296 -26629 -35638 -10269 2316
9048 2316 6721 12093 -14865 -14163 29857 47899 80502 100852 104519 87477 67811 62316 36231
9035 36231 34157 33302 30076 39833 22290 -3686 -13639 22872 13240 -3317 6610 -9229 -44088
$$ packed form
9123a0461j07j2761L2518N3797M9199j1296n9799K7317Q524n1422l7612j9948
9111c2051M024J8149l1743K8336J3733K4953K8055o7395j5k386P658Q140J4953
9098A4411O4478J7149j153k8669K0975j819j5663K7485L1819n2248j0212K3334
9086H9887j6824k4187R586L0837o625j0614j9078l0259k7906k0454L4087R660
9074A8110O7434J5446m7866Q875M0485M0118j5719j6358m5516J979o835N287O526
9061G1966l0271Q249J6684k7470l9949M1311j913l1168m143k9925r009K5369J2585
9048B316M405N372k6958P02M4020J8042L2603K0350L667j7042j9666n495k6085
9035C6231k074q55l226R757j7543k5976r953L6511r632j6557R927j5839l4859
$$ plain form
9022 -44088 -40257 -43685 -41241 -18405 -23265 -26593 -15240 -17579 -86659 -80970 -38905 -53081 -16645
9009 -16645 7174 49767 67647 112354 153705 102006 44383 22635 84153 123386 98693 86880
8997 86880 79154 77279 97969 74144 59163 59786 28438 26107 23912 -10396 -31040 -10274 -31828
8984 -31828 -47640 -32492 -17727 -60896 -50203 5040 -21192 -34118 -4141 12552 10823 36584
8972 36584 64174 78128 62888 18148 -14280 11599 50903 1934 -2718 21176 12993 73665
8960 73665 83303 97808 113541 97558 77600 36210 64405 74571 44519 -29978 -89532 -107440
8948 -107440 -102872 -90965 -60242 -22115 -28256 -67546 -75989 -23630 4211 -33667 -61980 -45661
8936 -45661 -51753 -59813 -36789 -50190 4820 57333 70534 46833 17940 -7895 -12946 12134
$$ packed form
9022d4088L831l428K444K2836m860l328J1353k339o9080N689M2065j4176L6436
9009a6645K3819M2593J7880M4707M1351n1699n7623k1748O1518L9233k4693j1813
8997H6880p726j875K0690k3825j4981O23l1348k331k195l4308k0644K0766k1554
8984c1828j5812J5148J4765m3169J0693N5243k6232j2926K9977J6693j729K5761
8972C6584K7590J3954j5240m4740l2428K5879L9304m8969m652K3894q183O0672
8960G3665R638J4505J5733j5983j9958m1390K8195J0166l0052p4497n9554j7908
8948a07440M568J1907L0723L8127o141l9290q443N2359K7841l7878k8313J6319
8936d5661o092q060K3024j3401N5010N2513J3201k3701k8893k5835n051K5080
$$ plain form
8924 12134 36880 23181 -18844 7587 18451 23133 -27145 -2940 26917 -17910 -27880 -19713
8912 -19713 -10195 -17996 -54702 -37738 -35065 -15692 -6869 -12724 9951 32840 14074 -35176 -64428
8899 -64428 -36383 -14204 -27614 -16849 -15929 -10786 -2702 -3813 -205 -10822 -84723 -141059 -109972
8886 -109972 -86806 -43432 -40076 -56585 -33188 -16897 -29105 -15876 -47274 -23429 -41596 -43658
8874 -43658 -41647 15218 69380 56963 40664 67225 55783 29239 9868 28116 29019 67141
8862 67141 89669 55375 2986 -39624 -35181 -35502 -78706 -29802 -19790 13562 10599 -5589 -14282
8849 -14282 12948 -25273 -49886 -48250 -14205 61684 76981 31784 13342 -4873 -24714 -39785
8837 -39785 -72098 -98352 -93772 -96797 -134567 -61398 19791 47970 -1727 13717 21260 49545
$$ packed form
8924A2134K4746j3699m2025K6431J0864M682n0278K4205K9857m4827r970Q167
8912a9713R518p801l6706J6964K673J9373Q823n855K2675K2889j8766m9250k9252
8899f4428K8045K2179j3410J0765R20N143Q084j111L608j0617p3901n6336L1087
8886a09972K3166M3374L356j6509K3397J6291j2208J3229l1398K3845j8167k062
8874d3658K011N6865N4162j2417j6299K6561j1442k6544j9371J8248R03L8122
8862F7141K2528l4294n2389m2610M443l21m3204M8904J0012L3352k963j6188q693
8849a4282K7230l8221k4613J636L4045P5889J5297m5197j8442j8215j9841j5071
8837c9785l2313k6254M580l025l7770P3169Q1189K8179m9697J5444P543K8285
$$ plain form
8825 49545 40417 24441 52923 26660 -49116 17498 66178 45691 66204 101585 73735 42450
8813 42450 39837 45068 80625 74799 47710 68472 166658 188464 244126 218556 251264 254088 286153
8800 286153 268893 248022 323967 399071 447340 637730 886812 988749 895275 740892 639875
8789 639875 624338 767532 847081 796119 626712 423125 277901 214648 127163 95185 95069
8778 95069 104178 123206 113687 106059 136646 155517 133945 125541 126726 124589 88030 25298 29488
8765 29488 79588 129288 157989 182001 217558 264164 342597 379747 444898 481720 496470 456539
8753 456539 475431 627880 905195 1332976 1700246 1751347 1548387 1229392 1107544 1330452
8743 1330452 1640188 1706271 1558395 1120190 738426 493834 391112 337194 288043 254461
$$ packed form
8825D9545r128j5976K8482k6263p5776O6614M8680k0487K0513L5381k7850l1285
8813D2450k613N231L5557n826k7089K0762R8186K1806N5662k5570L2708K824L2065
8800B86153j7260k0871P5945P5104M8269J90390K49082J01937r3474j54383j01017
8789F39875j5537J43194P9549n0962j69407k03587j45224o3253q7485l1978j16
8778I5069R109J9028r519p628L0587J8871k1572q404J185k137l6559o2732M190
8765B9488N0100M9700K8701K4012L5557M6606P8433L7150O5151L6822J4750l9931
8753D56539J8892J52449K77315M27781L67270N1101k02960l18995j21848K22908
8743A330452L09736O6083j47876m38205l81764k44592j02722n3918m9151l3582
$$ plain form
8733 254461 183562 148789 70523 15844 51760 86544 96747 91559 40022 69833 62054 66824
8721 66824 59047 45646 28181 72847 68099 112426 186468 235741 255740 281528 246569 219072
8709 219072 258269 331792 424527 568329 752089 951790 1031973 976332 931436 1100092 1263232
8698 1263232 1343045 1233078 945043 680987 476032 313026 274919 257609 248922 207903 145644
8687 145644 138054 142692 143347 82916 63305 103932 50518 -6491 -14945 59076 33455 9373 -18936
8674 -18936 -59092 -53916 15465 45813 53834 51282 33400 76738 68391 56431 70314 85368 93134
8661 93134 110067 134387 140861 120112 183501 289912 474240 790261 1036222 1053205 826446
8650 826446 561832 337434 214001 204683 185080 141012 147371 108131 72109 52867 14464
$$ packed form
8733B54461p0899l4773p8266n4679L5916L4784J0203n188n1537K9811p779M770
8721F6824p777j3401j7465M4666m748M4327P4042M9273J9999K5788l4959k7497
8709B19072L9197P3523R2735J43802J83760J99701Q0183n5641m4896J68656J63140
8698A263232P9813j09967k88035k64056k04955j63006l8107j7310q687m1019o2259
8687A45644p590M638O55o0431j9611M0627n3414n7009q454P4021k5621k4082k8309
8674a8936m0156N176O9381L0348Q021k552j7882M3338q347j1960J3883J5054P766
8661I3134J6933K4320O474k0749O3389J06411J84328L16021K45961J6983k26759
8650H26446k64614k24398j23433r318j9603m4068O359l9240l6022j9242l8403
$$ plain form
8639 14464 5894 37965 68107 44976 69455 99510 115673 88647 -2094 -11093 16541 41081
8627 41081 61328 78462 48938 39145 40655 51084 96607 94006 142318 190449 218206 223014 247367
8614 247367 230923 223743 254793 301407 350636 341218 422840 600604 659046 651539 517281 328596
8602 328596 261171 259165 203297 151159 153930 91177 54465 90912 106143 83368 83952 34372
8590 34372 -5251 -59498 -53584 -67404 -33625 8165 63677 56739 46268 -378 908 -31578
8578 -31578 -45532 -48321 -32809 3543 27365 60730 72386 67579 -19801 12038 51583 19658
8566 19658 13934 -11618 9534 46851 42797 40106 23267 -22198 -27628 16181 44707 19408 6303
8553 6303 -6805 -35446 -53537 -47196 -26036 9603 14988 -26516 -5555 22354 -3967 -3765 15953
$$ packed form
8639A4464q570L2071L0142k3131K4479L0055J6163k7026r0741q999K7634K4540
8627D1081K0247J7134k9524r793J510J0429M5523k601M8312M8131K7757M808K4353
8614B47367j6444p180L1050M6614M9229r418Q1622J77764N8442p507j34258j88685
8602C28596o7425k006n5868n2138K771o2753l6712L6447J5231k2775N84m9580
8590C4372l9623n4247N914j3820L3779M1790N5512o938j0471m6646J286l2486
8578c1578j3954k789J5512L6352K3822L3365J1656m807q7380L1839L9545l1925
8566A9658n724k5552K1152L7317m054k691j6839m5465n430M3809K8526k5299j3105
8553F303j3108k8641j8091O341K1160L5639N385m1504K0961K7909k6321K02J9718
$$ plain form
8540 15953 -40475 -48014 -49192 -27979 -41330 -13529 -2783 29648 -5764 -62497 -55489 -40522
8528 -40522 -34042 -18913 16875 44810 -21521 -14266 -14685 -23936 -23078 -43054 -20220 35589 46535
8515 46535 26633 -5824 -4934 25326 32308 68484 105883 134891 162629 174224 164899 58953
8503 58953 21036 30802 45187 38873 6230 -2303 46874 42828 64234 79859 90726 59417 5821
8490 5821 -13593 -45010 -5908 7358 -6273 -324 50155 55151 116725 62382 39309 26895
8478 26895 -25012 -8302 -48415 -33219 -14078 -2323 -32989 32392 90182 112784 57268 107811
8466 107811 101822 44701 58530 40670 -31464 -49167 5295 57510 97990 99515 51536 15561
8454 15561 -631 1135 49835 32615 -26129 -50736 4305 17050 20973 5981 18848 96182
$$ packed form
8540A5953n6428p539j178K1213j3351K7801J0746L2431l5412n6733P008J4967
8528d0522O480J5129L5788K7935o6331P255m19r251Q58j9976K2834N5809J0946
8515D6535j9902l2457Q90L0260O982L6176L7399K9008K7738J1595r325j05946
8503E8953l7917R766J4385o314l2643q533M9177m046K1406J5625J0867l1309n3596
8490E821j9414l1417L9102J3266j3631N949N0479M996O1574n4343k3073j2414
8478B6895n1907J6710m0113J5196J9141J1755l0666O5381N7790K2602n5516N0543
8466A07811n989n7121J3829j7860p2134j7703N4462N2215M0480J525m7979l5975
8454A5561j6192J766M8700j7220n8744k4607N5041J2745L923j4992J2867P7334
$$ plain form
8442 96182 121712 94615 58736 66147 55477 26394 11011 48665 76456 86154 68518 37380
8430 37380 31759 26280 13906 53933 82620 70091 64597 23438 -11775 -28481 3093 22732
8418 22732 -17359 -56792 -25891 24673 -2683 -46348 -16344 27042 8240 -1878 6713 29820
8406 29820 6733 -12415 -330 -12155 18801 64869 39479 30871 -15669 -19745 -13088 -87973
8394 -87973 -134960 -137884 -69544 19638 21972 23461 32174 34857 46541 42059 -30157 -69 54628
8381 54628 58105 27675 -10454 -40656 -56129 -61704 -65108 -86951 -85052 -36238 -26137 146 48202
8368 48202 6324 -19209 2697 -63883 -59820 -31709 -44410 -41229 -15948 -6315 -42029 -8330
8356 -8330 29413 40321 12992 -29926 -100149 -134768 -106635 -92420 -48584 -38093 -57332 -35986
$$ packed form
8442I6182K5530k7097l5879P411j0670k9083j5383L7654K7791R698j7636l1138
8430C7380n621n479j2374M0027K8687j2529n494m1159l5213j6706L1574J9639
8418B2732m0091l9433L0901N0564k7356m3665L0004M3386j8802j0118Q591K3107
8406B9820k3087j9148J2085j1825L0956M6068k5390q608m6540m076O657p4885
8394h7973m6987k924O8340Q9182K334J489Q713K683J1684m482p2216L0088N4697
8381E4628L477l0430l8129l0202j5473n575l404k1843J899M8814J0101K6283M8056
8368D8202m1878k5533K1906o6580M063K8111j2701L181K5281R633l5714L3699
8356h330L7743J0908k7329m2918p0223l4619K8133J4215M3836J0491j9239K1346
$$ plain form
8344 -35986 -20720 -51415 -54021 -75573 -77828 -38952 20994 24336 51094 71382 15784 -37
8332 -37 -33342 -66474 -103838 -95178 -43090 2233 3710 38947 -1048 -42009 -93779 -115280 -89335
8319 -89335 -62626 -65460 -38592 1273 9097 -32496 -726 20930 22816 25391 30299 48550 54527
8306 54527 52108 -1716 -49152 -59274 -46787 -54652 -73681 -19601 27890 18127 48673 36533
8294 36533 -31765 -7132 1856 13440 44945 43761 -237 -30682 -38891 -5875 33198 9007
8282 9007 10952 -13124 25184 55928 35835 35475 22773 -24716 -32803 18831 45646 -12552 -7003
8269 -7003 -12513 -37098 -46320 -13285 18889 62072 16046 8784 10747 -31198 -75804 -98934 -90386
8256 -90386 -82478 -32416 25755 -2664 -12960 26680 61961 30388 -6073 6382 1132 -12519
$$ packed form
8344c5986J5266l0695k606k1552k255L8876N9946L342K6758K0288n5598j5821
8332c7l3305l3132l7364Q660N2088M5323J477L5237l9995m0961n1770k1501K5945
8319h9335K6709k834K6868L9865P824m1593L1770K1656J886K575M908J8251N977
8306E4527k419n3824m7436j0122J2487p865j9029N4080M7491r763L0546j2140
8294C6533o8298K4633Q988J1584L1505j184m3998l0445q209L3016L9073k4191
8282I007J945k4076L8308L0744k0093l60j2702m7489q087N1634K6815n8198N549
8269g003n510k4585r222L3035L2174M3183m6026p262J963m1945m4606k3130Q548
8256i0386P908N0062N8171k8419j0296L9640L5281l1573l6461J2455n250j3651
$$ plain form
8244 -12519 -9328 2746 -34438 592 26023 -48387 -58456 -45659 -40680 -19352 -45599 -110578
8232 -110578 -114584 -134370 -78646 -25100 -29060 -51346 -7194 268 14419 51498 32614 -5688
8220 -5688 11132 45133 84413 -9369 -34197 -10927 -41941 -28892 4520 3319 -55026 -61723
8208 -61723 -31326 8181 1290 -45574 -60977 -43799 -26308 4741 59284 72914 63068 29576
8196 29576 -13325 4074 34829 6417 15505 -660 31889 17297 35538 26122 -15094 -11698
8184 -11698 -981 -7859 39367 82260 94260 71267 104244 77463 45985 53576 88574 116485
8172 116485 84363 50098 65967 22416 45401 63014 63778 26989 26068 11568 17704 19857 -16655
8159 -16655 -22718 10520 92329 87882 73739 46551 46343 73101 42394 -14042 -41199 -73886 -79319
$$ packed form
8244a2519L191J2074l7184L5030K5431p4410j0069J2797M979K1328k6247o4979
8232a10578m006j9786N5724N3546l960k2286M4152P462J4151L7079j8884l8302
8220e688J6820L4001L9280r3782k4828K3270l1014J3049L3412j201n8345o697
8208f1723L0397L9507o891m6864j5403J7178J7491L1049N4543J3630r846l3492
8196B9576m2901J7399L0755k8412R088j6165L2549j4592J8241r416m1216L396
8184a1698J0717o878M7226M2893J2000k2993L2977k6781l1478P591L4998K7911
8172A16485l2122l4265J5869m3551K2985J7613P64l6789r21j4500O136K153l6512
8159a6655o063L3238Q1809m447j4143k7188k08K6758l0707n6436k7157l2687n433
$$ plain form
8146 -79319 -40011 -12622 186 -12366 4411 12957 -36653 -4084 -20408 -19292 -11847 6472
8134 6472 29618 62286 71061 7005 12273 296 -42016 -38462 17455 78383 72145 12496 16024
8121 16024 61502 35704 44858 84455 46659 53009 27592 40583 17144 3546 -18387 -7957
8109 -7957 50031 49192 2119 -38686 -41373 -3842 -46294 -60820 -64575 -60111 -15484 18699 12449
8096 12449 44218 43601 10346 14100 -590 36065 63329 74536 72183 36128 15569 67663 92399
8083 92399 50872 65334 106463 90620 77218 125188 148772 81536 72901 33282 11144 -13924
8071 -13924 33889 37736 1447 5712 -7426 -4209 1822 -7467 3805 6279 42316 24749 28303
8058 28303 32647 -38383 -67930 -41946 9721 16381 -24560 -36978 -39066 12276 101033 126802
$$ packed form
8146g9319L9308K7389J2808j2552J6777Q546m9610L2569j6324J116P445J8319
8134F472K3146L2668Q775o4056N268j1977m2312L554N5917O0928o238n9649L528
8121A6024M5478k5798R154L9597l7796O350k5417J2991k3439j3598k1933J0430
8109g957N7988q39m7073m0805k687L7531m2452j4526l755M464M4627L4183o250
8096A2449L1769o17l3255L754j4690L6655K7264J1207k353l6055k0559N2094K4736
8083I2399m1527J4462M1129j5843j3402M7970K3584o7236q635l9619k2138k5068
8071a3924M7813L847l6289M265j3138L217O031r289J1272K474L6037j7567L554
8058B8303M344p1030k9547K5984N1667O660m0941j2418k088N1342Q8757K5769
$$ plain form
8046 126802 85112 104479 115035 63957 45393 102566 72093 5526 -14915 23974 58085 80012
8034 80012 52849 22890 19140 -19804 -18857 -11623 10506 30325 53785 81435 84196 46168 48904
8021 48904 40982 949 -21818 9952 13203 79454 125783 99549 54567 75115 49185 19824
8009 19824 7736 -9939 1804 16805 28509 39431 37172 41388 40728 73469 110885 118605 107738
7996 107738 86385 58887 52899 87691 98031 56203 21826 20058 15077 20752 -18147 7775
7984 7775 -16188 -34379 -31468 -31830 -32719 -29043 -43114 -49200 -45602 -64502 -43439 18757 25635 96862
7970 96862 148491 130223 85362 61439 48791 25789 10247 7826 30431 26482 15134 37109
7958 37109 62809 54472 51624 57354 7757 -14230 -15363 -54889 -47578 -42182 -18538 11308 24818
$$ packed form
8046A26802m1690J9367J0556n1078j8564N7173l0473o6567k0441L8889L4111K1927
8034H0012k7163k9959l750l8944R47P234K2129J9819K3460K7650K761l8028K736
8021D8904p922m0033k2767L1770L251O6251M6329k6234m4982K0548k5930k9361
8009A9824j2088j7675J1743J5001J1704J0922k259M216o60L2741L7416P720j0867
7996A07738k1353k7498n988L4792J0340m1828l4377j768m981N675l8899K5922
7984G775k3963j8191K911l62q89L676j4071o086L598j8900K1063O2196O878P1227
7970I6862N1629j8268m4861k3923j2648k3002j5542k421K2605l949j1348K1975
7958C7109K5700q337k848N730m9597k1987j133l9526P311N396K3644K9846J3510
$$ plain form
7945 24818 -9615 -29181 -43733 -29768 -57988 -29066 -6576 -25599 -20487 420 55750 9544
7933 9544 -26316 -65447 -92845 -89451 -85082 -52175 4741 -11933 1810 55814 79295 116196
7921 116196 117859 94997 50369 -6598 -2185 34375 34157 33082 26484 -12529 -15175 -11889 -2424
7908 -2424 -30050 -64824 -37672 -7818 38788 -20428 -45567 -6596 4245 -27315 -9537 -12162
7896 -12162 -26223 8158 10833 27301 89802 55615 -29891 -43234 -25930 2110 43279 76248
7884 76248 58726 41002 6832 7563 52916 76620 109419 157569 73420 49303 11396 8176
7872 8176 29661 20744 -7860 -24489 -23801 -10517 -10982 -22346 -33157 -5014 55916 43792 54702
7859 54702 66146 52624 25516 4300 6084 56281 89886 66613 50696 46109 2047 -13288
$$ packed form
7945B4818l4433j9566j4552J3965k8220K8922K2490j9023N112K0907N5330m6206
7933I544l5860l9131k7398L394M369L2907N6916j6674J3743N4004K3481L6901
7921A16196J663k2862m4628n6967M413L6560k18j075o598l9013k646L286R465
7908b424k7626l4774K7152K9854M6606n9216k5139L8971J0841l1560J7778k625
7896a2162j4061L4381K675J6468O2501l4187q5506j3343J7304K8040M1169L2969
7884G6248j7522j7724l4170P31M5353K3704L2799M8150q4149k4117l7907l220
7872H176K1485q917k8604j6629O88J3284m65j1364j0811K8143O0930j2124J0910
7859E4702J1444j3522k7108k1216J784N0197L3605k3273j5917m587m4062j5335
$$ plain form
7847 -13288 -53594 -40713 -23564 -25508 -4788 16239 -22286 -32101 -28698 41404 43884 -13265 -37822
7834 -37822 -25859 23270 5057 6948 30478 13969 -7211 -35192 31094 81017 60981 -3541
7822 -3541 -43456 -19266 10003 -10529 -19040 22003 11906 -11173 -22298 -8002 -32366 -89049
7810 -89049 -73760 6714 38462 46304 -4370 -29717 -34553 -5998 2844 -30815 -61941 -63260 -45847
7797 -45847 -28976 -77662 -71321 -51098 -64775 -28868 8086 -757 5033 2245 -12915 -43379 -75050
7784 -75050 -78579 -97634 -78789 -44796 57982 131023 79812 35026 37521 -55240 -118393 -137154
7772 -137154 -105435 -101197 -56588 -90522 -100428 -88095 -62497 -66588 -37600 13675 -6305 -39957
7760 -39957 -20847 -27217 -37938 -43238 -54007 -29606 -6437 3562 -32081 -38945 -4462 47983 62928
$$ packed form
7847a3288m0306J2881J7149j944K0720K1027l8525r815L403P0102K480n7149k4557
7834c7822J1963M9129j8213J891K3530j6509k1180k7981O6286M9923k0036o4522
7822c541l9915K4190K9269k0532q511M1043j0097k3079j1125J4296k4364n6683
7810h9049J5289Q0474L1748P842n0674k5347m836K8555Q842l3659l1126j319J7413
7797d5847J6871m8686O341K0223j3677L5907L6954q843N790k788j5160l0464l1671
7784g5050l529j9055J8845L3993J02778P3041n1211m4786K495r2761o3153j8761
7772a37154L1719M238M4609l3934r906J2333K5598m091K8988N1275j9980l3652
7760c9957J9110o370j0721n300j0769K4401K3169R999l5643o864L4483N2445J4945
$$ plain form
7747 62928 30221 -22478 -68177 -85397 -111578 -135078 -133739 -77359 -58719 -89233 -47706 -12965
7735 -12965 2715 -13155 -51830 -42533 -13838 -24615 -42662 41428 39964 13610 55205 42935
7723 42935 -43124 -79028 -95563 -99755 -94781 -91710 -85389 -24189 -17698 -34393 -26469 -10637 -34176
7710 -34176 -10913 37922 20759 67497 84746 45614 38032 -37438 -57110 -80131 -38743 -53407
7698 -53407 -79282 -33788 -37857 -52142 -66333 -42715 -45634 -1448 19286 14690 21280 -1055 -10921
7685 -10921 -23684 -2854 15385 -13869 -55676 -70753 -83433 -25284 40124 64888 39817 -36443
7673 -36443 -72184 -79482 -102900 -87991 -34257 -43136 -18187 3471 -22018 34221 27495 -6807
7661 -6807 32606 43001 43575 17568 1563 68960 40600 740 28028 38347 52441 52190 40614
$$ packed form
7747F2928l2707n2699m5699j7220k6181k3500J339N6380J8640l0514M1527L4741
7735a2965J5680j5870l8675R297K8695j0777j8047Q4090j464k6354M1595j2270
7723D2935q6059l5904j6535m192M974L071O321O1200O491j6695P924J5832k3539
7710c4176K3263M8835j7163M6738J7249l9132p582p5470j9672k3021M1388j4664
7698e3407k5875M5494m069j4285j4191K3618k919M4186K0734m596O590k2335r866
7685a0921j2763K0830J8239k9254m1807j5077j2680N8149O5408K4764k5071p6260
7673c6443l5741p298k3418J4909N3734q879K4949K1658k5489N6239o726l4302
7661f807L9413J0395N74k6007j6005O7397k8360l9860K7288J0319J4094k51j1576
$$ plain form
7648 40614 26236 9741 -11116 5034 -3747 -15790 13687 42420 51973 21287 -65264 -61202
7636 -61202 3239 15123 -27976 -7732 13414 -20540 -29605 7590 26163 9994 -4010 20395
7624 20395 54429 35127 -36765 -27284 20083 28882 -40802 -89819 -58367 -42963 15253 10240
7612 10240 -59950 -126780 -156040 -139988 -116552 -101737 -53618 30259 15565 -32086 -12240 -35734
7600 -35734 4840 26893 22654 12758 17973 8280 -44108 -3189 -20058 -45297 -10161 -11978 -10458
7587 -10458 9657 48796 20179 -35945 -46961 -39436 -52082 -47936 -32132 -6265 -22920 -9860
7575 -9860 -5275 -29782 -46352 -24292 -4068 3413 -1661 -1587 -7449 -62503 -89667 -51852 7027
7562 7027 13108 55519 28511 -29368 -37546 -5772 31993 55491 48100 32545 2433 -4654 -11731
$$ packed form
7648D0614j4378j6495k0857J6150q781j2043K9477K8733R553l0686q6551M062
7636f1202O4441J1884m3099K0244K1146l3954r065L7195J8573j6169j4004K4405
7624B0395L4034j9302p1892R481M7367Q799o9684m9017L1452J5404N8216n013
7612A0240p0190o6830k9260J6052K3436J4815M8119Q3877j4694m7651J9846k3494
7600c5734M0574K2053m239r896N215r693n2388M0919j6869k5239L5136j817J520
7587a0458K0115L9139k8617n6124j1016P525j2646M146J5804K5867j6655J3060
7575i860M585k4507j6570K2060K0224P481n074P4n862n5054k7164L7815N8879
7562G027O081M2411k7008n7879q178L1774L7765K3498p391j5555l0112p087p077
$$ plain form
7549 -11731 6390 -24113 -25781 -20101 -49886 -46523 27208 49933 51383 55343 55527 11506 -25751
7536 -25751 -46779 -59261 -95732 -24501 7489 9902 7185 7106 -23373 -47612 -37304 -96542 -52917
7523 -52917 40801 67678 -50941 -100661 -119230 -113951 -37875 17113 37436 -25652 -21152 -5941
7511 -5941 -1417 -32936 12667 69881 29879 44947 20033 2552 -796 -10115 -6742 -10772 4555
7498 4555 3173 9665 21204 8684 -71314 -84194 -37328 -18415 -7014 4898 35192 63465
7486 63465 44467 12298 -1497 37165 52027 39718 41439 50644 96304 71964 66720 99626
7474 99626 98040 75742 34781 1968 -496 -28086 2986 -5083 -50844 -18061 -11072 -10506 -11399
7461 -11399 25813 -10181 -34992 -41963 -37020 2709 -20785 -87966 -77378 -50451 -48068 -71033
$$ packed form
7549a1731J8121l0503j668N680k9785L363P3731K2725J450L960J84m4021l7257
7536b5751k1028j2482l6471P1231L1990K413k717p9l0479k4239J0308n9238M3625
7523e2917R3718K6877j18619m9720j8569N279P6076N4988K0323o3088M500J5211
7511e941M524l1519M5603N7214m0002J5068k4914j7481l348r319L373m030J5327
7498D555j382O492J1539j2520p9998j2880M6866J8913J1401J1912L0294K8273
7486F3465j8998l2169j3795L8662J4862j2309J721R205M5660k4340n244L2906
7474I9626j586k2298m0961l2813k464k7590L1072q069m5761L2783O989N66q93
7461a1399L7212l5994k4811o971M943L9729k3494o7181J0588K6927K383k2965
$$ plain form
7449 -71033 -47704 -33036 -58545 -70895 -30761 27093 18733 -28973 -71514 -77632 -33162 -8
7437 -8 13854 9215 7550 7012 18007 79456 99218 104367 94806 13082 -10457 14656 36089 57588
7423 57588 63410 77497 70338 59088 56305 15398 7631 11162 -33792 -86295 -104204 -99926 -78601
7410 -78601 -61145 -50172 -20716 5436 7056 37570 -139 28633 14281 -69323 -71130 -61224
7398 -61224 -38264 6375 16633 -18611 -44858 -41325 -13307 448 20022 -4398 -39000 -1182
7386 -1182 -7233 -10041 19188 7542 3199 23136 -12846 -9349 -28531 -41426 -63611 -85680 -78243
7373 -78243 -117324 -109501 -43478 -23382 7007 34643 62156 24984 41804 15693 -43185 -12201
7361 -12201 -6373 -34574 -65019 -54946 -37903 -51330 -74408 -24944 15778 5326 21420 45316
$$ packed form
7449g1033K3329J4668k5509j2350M0134N7854q360m7706m2541o118M4470L3154
7437hJ3862m639j665n38J0995O1449J9762N149r561q1724k3539K5113K1433K1499
7423E7588N822J4087p159j1250k783m0907p767L531m4954n2503j7909M278K1325
7410g8601J7456J0973K9456K6152J620L0514l7709K8772j4352q3604j807R906
7398f1224K2960M4639J0258l5244k6247L533K8018J3755J9574k4420l4602L7818
7386a182o051k808K9229j1646m343J9937l5982L497j9182j2895k2185k2069P437
7373g8243l9081P823O6023K0096L0389K7636K7513l7172J6820k6111n8878L0984
7361a2201N828k8201l0445J0073J7043j3427k3078M9464M0722j0452J6094K3896
$$ plain form
7349 45316 8900 -20194 -13956 -21104 -29296 -42979 -33886 20879 -4238 33508 68877 78987 38965
7336 38965 773 -40522 -73444 -45150 51195 63952 -3199 -68707 -128253 -149862 -116338 -75147
7324 -75147 -15805 21013 -37844 -106685 -115122 -48274 -4500 -22943 -17577 -19067 -32803 -61001
7312 -61001 -86196 -122359 -155187 -83615 -5984 28115 13259 -53399 -36071 28954 25712 -34889
7300 -34889 -94591 -97668 -64151 -19655 3025 -32767 -54012 -38824 -10927 -58447 -69927 -53953
7288 -53953 -88335 -78988 -94081 -78369 -23416 37571 3307 -30782 -70914 -31009 -8885 -20127
7276 -20127 -25571 -28747 -76468 -141753 -145442 -93632 -39645 -29448 -7249 4779 -6736 -1713 29640
7263 29640 -14582 -64288 -54021 -43405 -42903 -12984 7356 -34545 -74361 -69013 -70893 -66030 -52630
$$ packed form
7349D5316l6416k9094O238p148q192j3683R093N4765k5117L7746L5369J0110m0022
7336C8965l8192m1295l2922K8294R6345J2757o7151o5508n9546k1609L3524M1191
7324g5147N9342L6818n8857o8841q437O6848M3774j8443N366j490j3736k8198
7312f1001k5195l6163l2828P1572P7631L4099j4856o6658J7328O5025l242o0601
7300c4889n9702l077L3517M4496K2680l5792k1245J5188K7897m7520j1480J5974
7288e3953l4382R347j5093J5712N4953O0987l4264l4089m0132L9905K2124j1242
7276b0127n444l176m7721o5285l689N1810N3987J0197K2199J2028j1515N023L1353
7263B9640m4222m9706J0267J0616N02K9919K0340m1901l9816N348j880M863J3400
$$ plain form
7250 -52630 -56788 -49138 -49681 -64436 -111034 -102670 -89841 -116671 -83393 -10044 -23228 -7576 -19293
7237 -19293 -9019 -41487 -67392 -84756 -52563 -19143 -29552 -24530 25760 16315 -10782 -5638
7225 -5638 -2896 18529 56984 -17870 -66286 4162 15842 -5787 24409 77443 72347 41742
7213 41742 -1298 22813 55354 56159 36118 -9683 -6177 23300 -18915 -57838 -99597 -58490
7201 -58490 4808 21138 -15863 -52055 -48295 20612 32693 75108 51651 43723 41711 75648
7189 75648 118232 132751 93390 23444 -19883 -22976 -66849 -87854 -84786 -44547 -28668 -75700
7177 -75700 -19344 -1102 -11914 22754 74748 95765 71486 50672 -3980 -37055 -55345 -77113
7165 -77113 -89378 -47824 -40040 -47271 -38087 -102893 -96781 -56812 -42657 -38778 -26863 -21806 -22363
$$ packed form
7250e2630m158P650n43j4755m6598Q364J2829k6830L3278P3349j3184J5652j1717
7237a9293J0274l2468k5905j7364L2193L3420j0409N022N0290r445k7097N144
7225e638K742K1425L8455p4854m8416P0448J1680k1629L0196N3034n096l0605
7213D1742m3040K4111L2541Q05k0041m5801L506K9477m2215l8923m1759M1107
7201e8490O3298J6330l7001l6192L760O8907J2081M2415k3457p928k012L3937
7189G5648M2584J4519l9361o9946m3327l093m3873k1005L068M0239J5879m7032
7177g5700N6356J8242j0812L4668N1994K1017k4279k0814n4652l3075j8290k1768
7165g7113j2265M1554P784p231R184o4806O112L9969J4155L879J1915N057n57
$$ plain form
7152 -22363 -71400 -84638 -37014 -49128 -74055 -65459 -60565 -47228 -5207 15984 45392 54252
7140 54252 36824 -20054 -70935 -49253 -5612 18991 9325 -79985 -124658 -80757 -57254 -26513
7128 -26513 -3258 -24337 -25171 -17470 19285 -15429 3354 12235 9428 7459 12811 -10699 -94379
7115 -94379 -126969 -87581 -24513 -27503 -21997 11781 -35121 1511 57788 76010 13728 -74914
7103 -74914 -60865 -50942 -29702 -38724 -8062 4252 5602 19083 17286 11996 43227 80698 26229
7090 26229 -27553 -37619 -18777 -15800 39137 3635 5731 61024 43199 -12896 -77451 -110378
7078 -110378 -85256 -117808 -91643 -58895 -32827 -57798 -55012 -48415 -29024 30771 105615 102465
7066 102465 111594 36282 -25595 -42301 -27961 29176 9517 -4092 38363 48929 30153 19254
$$ packed form
7152b2363m9037j3238M7624j2114k4927Q596M894J3337M2021K1191K9408Q860
7140E4252j7428n6878n0881K1682M3641K4603r666q9310m4673M3901K3503L0741
7128b6513K3255k1079q34P701L6755l4714J8783Q881k807j969N352k3510q3680
7115i4379l2590L9388O3068k990N506L3778m6902L6632N6277J8222o2282q8642
7103g4914J4049R923K1240r022L0662J2314J350J3481j797n290L1231L7471n4469
7090B6229n3782j0066J8842K977N4937l5502K096N5293j7825n6095o4555l2927
7078a10378K5122l2552K6165L2748K6068k4971K786O597J9391N9795P4844l150
7066A02465R129p5312o1877j6706J4340N7137j9659j3609M2455J0566j8776j0899
$$ plain form
7054 19254 -14971 -71060 -99994 -97982 -75776 -40066 -39345 13984 7745 48051 88608 141909 141940
7041 141940 127623 80803 74417 14062 -48200 -2053 18125 -31740 -86149 -62220 -15091 -6737
7029 -6737 -51481 -35503 41155 37264 14086 6342 -10741 -16543 9245 16901 -77128 -84357 -4624
7016 -4624 50997 30184 31192 -218 -47218 -22721 12418 49977 45492 46427 44280 38769 31014
7003 31014 10611 -64664 -134578 -164501 -120999 -50472 -11574 14102 29529 -21433 -53758 -48542
6991 -48542 -11132 30479 21240 -33576 -17254 17124 11177 33409 13344 -15242 -30370 -33339
6979 -33339 -25487 -33808 -50544 -28180 20175 86611 20652 -19738 -59301 -127746 -125780 -109069
6967 -109069 -76490 -21445 -5531 6454 20818 22977 -20990 -22400 -2178 29443 45083 38550
$$ packed form
7054A9254l4225n6089k8934K012K2206L5710P21N3329o239M0306M0557N3301L1
7041A41940j4317m6820o386o0355o2262M6147K0178m9865n4409K3929M7129Q354
7029f737m4744J5978P6658l891k3178p744j7083n802K5788P656r4029p229P9733
7016d624N5621k0813J008l1410m7000K4497L5139L7559m485R35k147n511p755
7003C1014k0403p5275o9914k9923M3502P0527L8898K5676J5427n0962l2325N216
6991d8542L7410M1611r239n4816J6322L4378n947K2232k0065k8586j5128k969
6979c3339P852q321j6736K2364M8355O6436o5959m0390l9563o8445J966J6711
6967a09069L2579N5045J5914J1985J4364K159m3967j410K0222L1621J5640o533
$$ plain form
6955 38550 -16068 -392 35800 -34049 -26549 -329 18960 22683 12968 4217 22475 55737 35391
6942 35391 -15252 21603 40788 39272 -23675 -48675 20477 36053 22993 35378 51781 89964
6930 89964 98975 41082 -21262 -35303 -29229 -23518 -63178 -37548 -26359 -9017 44859 20156
6918 20156 18449 64506 91896 48997 79784 55744 53461 11118 -39944 -74284 -48634 -16629
6906 -16629 -25717 -18566 -54657 -103558 -76007 -71909 -122699 -120283 -48925 -17540 -33751 -15474 -4653
6893 -4653 -33536 17868 -10276 -25816 -34086 -19695 -67141 -106754 -128717 -127040 -108284 -85680
6881 -85680 -85792 -109592 -97860 -71680 -33710 -4359 43555 50466 33519 -143 -261 -50675 -14241
6868 -14241 -38711 -13318 25594 15905 37527 35236 8008 33795 76696 114703 152077 133149
$$ packed form
6955C8550n4618J5676L6192o9849P500K6220J9289L723r715q751J8258L3262k0346
6942C5391n0643L6855J9185j516o2947k5000O9152J5576j3060J2385J6403L8183
6930H9964R011n7893o2344j4041O074N711l9660K5630J1189J7342N3876k4703
6918B0156j707M6057K7390m2899L0787k4040k283m2343n1062l4340K5650L2005
6906a6629r088P151l6091m8901K7551M098n0790K416P1358L1385j6211J8277J0821
6893d653k8883N1404k8144j5540q270J4391m7446l9613k1963J677J8756K2604
6881h5680j12k3800J1732K6180L7970K9351M7914O911j6947l3662j18n0414L6434
6868a4241k4470K5393L8912r689K1622k291k7228K5787M2901L8007L7374j8928
$$ plain form
6856 133149 30361 -58159 -104106 -104270 -100283 -86168 -57531 -1515 15483 -42841 -7304 12492
6844 12492 15111 341 -9393 -9759 15161 -63635 -97693 -55362 -29002 -40879 -28618 -24495 16406
6831 16406 52498 21433 11628 -2047 -35559 -23969 -5456 -3041 41263 49577 41187 32360 3161
6818 3161 -18778 -17755 -65782 -38974 -37103 -15369 46433 93967 75171 -2981 -10663 -8139 -21823
6805 -21823 -11712 22909 -17070 -10713 23352 27157 34341 66523 74410 98836 124507 90225 45670
6792 45670 -11314 -63586 -70050 -51826 -15112 -31922 9670 37895 19527 46816 104641 121755
6780 121755 121740 72774 30765 1794 -14609 -19637 -42831 -60086 -40111 -11292 -662 -17635
6768 -17635 -27364 -31037 -29168 -22471 -39172 -30840 -22484 -44597 -22485 4357 -31454 14206 2301
$$ packed form
6856A33149j02788q8520m5947j64L987J4115K8637N6016J6998n8324L5537J9796
6844A2492K619j4770r734l66K4920p8796l4058M2331K6360j1877J2261M123M0901
6831A6406L6092l1065r805j3675l3512J1590J8513K415M4304Q314q390q827k9199
6818C161k1939J023m8027K6808J871K1734O1802M7534j8796p8152p682K524j3684
6805b1823J0111L4621l9979O357L4065L805P184L2182P887K4426K5671l4282m4555
6792D5670n6984n2272o464J8224L6714j6810M1592K8225j8368K7289N7825J7114
6780A21755j5m8966m2009k8971j6403n028k3194j7255J9975K8819J0630j6973
6768a7635r729l673J869O697j6701Q332Q356k2113K2112K6842l5811M5660j1905
$$ plain form
6755 2301 -34338 -64475 -87893 -74219 -23475 -22962 -61092 -100446 -60290 -14607 -53943 -122591
6743 -122591 -102911 -73364 -48754 -49721 41118 8867 -18086 -22061 -41525 7677 34308 44953
6731 44953 39387 16428 -8541 -33507 -273 -3723 -43757 -111815 -89086 -90738 -134306 -90946
6719 -90946 -84979 -77626 -40720 -15804 -65942 -145290 -98875 -38836 -65814 -98638 -108439 -140002
6707 -140002 -116256 -109593 -97166 -76720 -99439 -43865 13237 -20836 -76943 -98198 -90831 -62821
6695 -62821 -47934 -32990 -34036 21538 1547 -2836 -16069 -19587 11963 2312 -43991 -40099 30226
6682 30226 25018 -37169 -45879 -5277 3745 -16397 -13994 18823 -9756 10364 68502 49426 18395
6669 18395 -6560 2785 38156 16698 -6527 54279 64125 31649 -33300 -55247 -42568 -12341
$$ packed form
6755B301l6639l0137k3418J3674N0744N13l8130l9354M0156M5683l9336o8648
6743a22591J9680K9547K4610r67R0839l2251k6953l975j9464M9202K6631J0645
6731D4953n566k2959k4969k4966L3234l450m0034o8058K2729j652m3568M3360
6719i0946N967P353L6906K4916n0138p9348M6415O0039k6978l2824r801l1563
6707a40002K3746O663J2427K0446k2719N5574N7102l4073n6107k1255P367K8010
6695f2821J4887J4944j046N5574j9991m383j3233l518L1550r651m6303L892P0325
6682C0226n208o2187q710M0602R022k0142K403L2817k8579K0120N8138j9076l1031
6669A8395k4955R345L5371k1458k3225O0806R846l2476o4949k1947J2679L0227
$$ plain form
6657 -12341 15865 56095 11077 -40205 -12389 -45938 -47026 -20937 -4160 -35342 -27982 -17187
6645 -17187 -24205 -21465 45677 123460 105658 61218 31741 -3197 21516 26900 18314 -2658 -31441
6632 -31441 -39348 -77265 -84988 -84787 -48210 -49713 -51795 -33358 -12162 -4399 23934 69720 50097
6619 50097 -6033 -40255 -8290 -38650 -62887 -26761 -4809 12080 39449 7703 29408 45846
6607 45846 59575 71649 34674 15762 38943 92883 128745 89378 65777 39223 13886 17162
6595 17162 38589 44794 42015 34355 22961 -21092 -5788 5489 27516 54173 20686 -14037
6583 -14037 -48781 -49887 -26678 -30624 -46844 -38136 -30329 24345 28642 -861 -10710 11414 -22811
6570 -22811 -13120 2541 57613 98196 83225 69472 46607 -20417 -44532 -59085 -22987 40292
$$ packed form
6657a2341K8206M0230m5018n1282K7816l3549j088K6089J6777l1182P360J0795
6645a7187p018K740O7142P7783j7802m4440k9477l4938K4713N384q586k0972k8783
6632c1441p907l7917p723K01L6577j503k082J8437K1196P763K8333M5786j9623
6619E0097n6130l4222L1965l0360k4237L6126K1952J6889K7369l1746K1705J6438
6607D5846J3729J2074l6975j8912K3181N3940L5862l9367k3601k6554k5337L276
6595A7162K1427O205k779p660j1394m4053J5304J1277K2027K6657l3487l4723
6583a4037l4744j106K3209l946j6220Q708P807N4674M297k9503r849K2124l4225
6570b2811R691J5661N5072M0583j4971j3753k2865o7024k4115j4553L6098O3279
$$ plain form
6558 40292 59948 35460 29833 28617 17544 32245 55328 39747 -24447 -50340 -51947 37940
6546 37940 86333 73454 24658 23607 7115 -29189 5260 9906 -27132 -87174 -52074 -53082
6534 -53082 -49096 29747 51182 48321 32367 21496 413 -56341 -34829 -29996 -63935 -59188 -56765
6521 -56765 -109091 -75215 -6768 22452 53951 45228 60583 35625 -1377 -11524 -25223 -74842
6509 -74842 -90152 -73360 -55208 -47881 -60489 -57791 -48382 -19430 -23334 -68082 -58049 -68583 -33424
6496 -33424 -40235 6683 -23942 -63469 11394 -24890 1362 30231 3866 -1064 -35530 -86253
6484 -86253 -89322 -72822 -70281 -81911 -49955 -32406 -44780 -17123 19090 -28080 -48282 -26332
6472 -26332 -2257 -50973 -51084 -72625 -78102 -6092 29291 40291 32782 7867 22361 -8047 -50237
$$ packed form
6558D0292J9656k4488n627j216j1073J4701K3083j5581o4194k5893j607Q9887
6546C7940M8393j2879m8796j051j6492l6304L4449M646l7038o0042L5100j008
6534e3082L986P8843K1435k861j5954j0871k1083n6754K1512M833l3939M747K423
6521e6765n2326L3876O8447K9220L1499q723J5355k4958l7002j0147j3699m9619
6509g4842j5310J6792J8152P327j2608K698R409K8952l904m4748J0033j0534L5159
6496c3424o811M6918l0625l9527P4863l6284K6252K8869k6365m930l4466n0723
6484h6253l069J6500K541j1630L1956J7549j2374K7657L6213m7170k0202K1950
6472b6332K4075m8716j11k1541n477P2010L5383J1000p509k4915J4494l0408m2190
$$ plain form
6459 -50237 -83263 -89549 -79969 -43203 -2614 26777 11817 34899 61234 17666 -61709 -46326
6447 -46326 -16132 -51939 -53197 395 64627 41822 -18559 -13688 -50846 -43991 20731 5302
6435 5302 -50307 -75148 -2589 17557 -24046 -58535 -97279 -90803 -78741 -80782 -11504 22666
6423 22666 3730 1743 26846 58390 15012 10162 20922 45200 34701 24278 64554 115856
6411 115856 95394 68273 16751 -18403 -5876 38226 25651 -15005 -37450 -38797 -13500 -31102
6399 -31102 -22299 -36211 -58824 -29841 -42933 -76022 -31658 -44129 -30832 -5138 14393 8374
6387 8374 31936 38709 -2696 -51843 -83824 -88411 -96855 -79075 -32282 -2853 -5834 -9746 11183
6374 11183 -2173 -7234 -15092 -6944 71563 69080 41538 -40824 -95657 -69163 -67792 -63411 -24060
$$ packed form
6459e0237l3026o286R580L6766M0589K9391j4960K3082K6335m3568p9375J5383
6447d6326L0194l5807j258N3592O4232k2805o0381M871l7158O855O4722j5429
6435E302n5609k4841P2559K0146m1603l4489l8744O476J2062k041O9278L4170
6423B2666j8936j987K5103L1544m3378m850J0760K4278j0499j0423M0276N1302
6411A15856k0462k7121n1522l5154J2527M4102j2575m0656k2445j347K5297j7602
6399c1102Q803j3912k2613K8983j3092l3089M4364j2471J3297K5694J9531o019
6387H374K3562O773m1405m9147l1981m587q444J7780M6793K9429k981l912K0929
6374A1183j3356n061p858Q148P8507k483k7542q2362n4833K6494J371M381L9351
$$ plain form
6361 -24060 -74 60988 62649 73899 91972 81355 18023 -7365 -28532 -54659 -99345 -66993
6349 -66993 -47276 -30153 13203 -10989 21985 31507 -27036 -110697 -102067 -60976 -26253 31779
6337 31779 62659 58172 43154 55110 70966 41607 56255 56228 41138 56027 57629 45863 22788
6324 22788 41130 28932 14679 59449 57853 50119 18999 -2517 -2060 5303 27464 56792 -634
6311 -634 -11434 -12696 -25410 -283 3557 -42650 -81925 -62224 -55032 -61641 -45979 -17908 16456
6298 16456 -14649 -23911 -21264 -51275 -22430 -17067 7034 10702 -2901 -29722 8239 44570 13083
6285 13083 25427 18000 39294 36133 29764 42272 64494 14440 -7347 3431 72137 73173 46068
6272 46068 31820 23442 50459 68830 72025 75506 52974 27538 3601 27283 47907 25602
$$ packed form
6361b4060K3986O1062J661J1250J8073j0617o3332k5388k1167k6127m4686L2352
6349f6993J9717J7123M3356k4192L2974R522n8543q3661Q630M1091L4723N8032
6337C1779L0880m487j5018J1956J5856k9359J4648k7j5090J4889J602j1766k3075
6324B2788J8342j2198j4253M4770j596p734l1120k1516M57P363K2161K9328n7426
6311f34j0800j262j2714K5127L840m6207l9275J9701P192o609J5662K8071L4364
6298A6456l1105r262K647l0011K8845N363K4101L668j3603k6821L7961L6331l1487
6285A3083J2344p427K1294l161o369J2508K2222n0054k1787J0778O8706J036k7105
6272D6068j4248q378K7017J8371L195L481k2532k5436k3937K3682K0624k2305
$$ plain form
6260 25602 14891 -22237 -5964 -33198 -67626 -31401 -42008 -44006 -22283 2674 -26348 -91188
6248 -91188 -76555 -21363 -1728 -40499 -24994 40589 28133 9801 46279 56553 59685 78825
6236 78825 57907 49797 8714 17039 -6813 37918 59204 63482 64339 34439 1705 -55978 -55984 -78901
6222 -78901 -82717 -12919 23646 13304 40225 29842 18070 8319 -34982 -14237 34245 21329
6210 21329 -51276 -65458 -46541 11003 46940 36727 34131 24396 65660 19735 44724 130015
6198 130015 118881 81582 74668 81755 30575 19150 39212 32953 -19743 -82007 -92597 -52708
6186 -52708 -10626 14811 -6040 -342 8116 -14935 -1952 29625 37615 18186 30909 19026
6174 19026 10470 6508 17220 -28180 -19711 -9195 52127 16812 1437 47413 38569 21291 43869
$$ packed form
6260B5602j0711l7128J6273k7234l4428L6225j0607j998K1723K4957k9022o4840
6248i1188J4633N5192J9635l8771J5505O5583j2456j8332L6478J0274L132J9140
6236G8825k0918q110m1083Q325k3852M4731K1286M278Q57k9900l2734n7683ok2917
6222g8901l816O9798L6565j0342K6921j0383j1772r751m3301K0745M8482j2916
6210B1329p2605j4182J8917N7544L5937j0213k596r735M1264m5925K4989Q5291
6198A30015j1134l7299o914P087n1180j1425K0062o259n2696o2264j0590L9889
6186e2708M2082K5437k0851N698Q458k3051J2983L1577P990j9429J2723j1883
6174A9026q556l962J0712m5400Q469J0516O1322l5315j5375M5976q844j7278K2578
$$ plain form
6161 43869 55501 45352 26070 31252 28009 14085 47591 6174 -62308 -51746 -21405 -61309
6149 -61309 -38935 27515 53703 11917 -21619 -49354 -29800 14184 -5046 7825 -33010 -17361
6137 -17361 3310 469 -37301 -91805 -83366 -11912 21004 -12789 -4399 -21093 -22093 7838 9232
6124 9232 -27361 12150 11685 3976 12850 21591 18949 -29630 -13115 -48359 -54619 -64261 -103123 -125651
6110 -125651 -115203 -56926 -6158 12413 39266 20895 -8694 -3945 38266 28889 25443 7334
6098 7334 -44413 -62969 -42795 9254 -13573 4837 -15301 -45398 -34507 -35753 -17673 12139
6086 12139 44905 85317 86190 74583 90515 121405 99093 119439 119976 69115 28988 17085 35089
6073 35089 -13234 3865 1860 -9460 2355 3476 -9603 -33613 -5651 -13278 -69587 -65449 -13966
$$ packed form
6161D3869J1632j0149j9282N182l243j3924L3506m1417o8482J0562L0341l9904
6149f1309K2374O6450K6188m1786l3536k7735J9554M3984j9230J2871m0835J5649
6137a7361K0671k841l7770n4504Q439P1454L2916l3793Q390j6694j000K9931J394
6124I232l6593L9511m65p709Q874Q741k642m8579J6515l5244o260r642l8862k2528
6110a25651J0448N8277N0768J8571K6853j8371k9589M749M2211r377l446j8109
6098G334n1747j8556K0174N2049k2827J8410k0138l0097J0891j246J8080K9812
6086A2139L2766M0412Q73j1607J5932L0890k2312K0346N37n0861m0127j1903J8004
6073C5089m8323J7099k005j1320J1815J121j3079k4010K7962p627n6309M138N1483
$$ plain form
6060 -13966 11992 -1467 5720 32432 3992 -54177 -58254 -22968 21083 85260 89747 49336
6048 49336 41693 58509 6165 -18025 22954 49211 -17659 11947 21892 -42551 -73456 -67175
6036 -67175 -41740 -39600 -59464 -49557 -36559 -80564 -59762 -54900 -32527 -63691 -67908 -31998 20586
6023 20586 48729 28799 13615 28003 28112 32779 36440 33922 20432 13915 25845 -24418 -24261
6010 -24261 -21146 -87951 -58225 14424 7420 -49070 -64105 -106387 -78742 -40272 6048 27777
5998 27777 -1189 -19913 4804 24761 1914 -36190 -13870 10065 11747 18144 3451 30275
5986 30275 14599 -29427 -85505 -51700 34480 52079 37419 44321 2824 8210 75635 36684
5974 36684 -15729 -21452 -55119 -55962 -5722 -43530 -67310 10722 3796 3737 -71706 -131378 -95135
$$ packed form
6060a3966K5958j3459P187K6712k8440n8169m077L5286M4051O4177M487m0411
6048D9336p643J6816n2344k4190M0979K6257o6870K9606R945o4443l0905O281
6036f7175K5435K140j9864R907J2998m4005K0802M862K2373l1164m217L5910N2584
6023B0586K8143j9930j5184J4388J09M667L661k518j3490o517J1930n0263J57
6010b4261L115o6805K9726P2649p004n6490j5035m2282K7645L8470M6320K1729
5998B7777k8966j8724K4717J9957k2847l8104K2320K3935J682O397j4693K6824
5986C0275j5676m4026n6078L3805Q6180J7599j4660O902m1497N386O7425l8951
5974C6684n2413n723l3667q43N0240l7808k3780P8032o926n9p5443n9672L6243
$$ plain form
5961 -95135 -49098 -68086 -39833 -11143 24485 46967 28351 -27497 -10117 -872 60610 28936
5949 28936 -39647 -73011 -50874 -35399 4323 26369 -19865 -20153 -12893 -20039 -128202 -96819
5937 -96819 12917 31595 -46455 -65343 -20477 61240 28531 8229 27278 3176 -17101 -30436
5925 -30436 8315 48945 20309 35760 45347 32399 2961 -6491 36380 63361 82133 40555
5913 40555 -17702 -17451 -13816 -33965 -49420 -14199 29874 42862 29174 -1101 -2951 10534 -41966
5900 -41966 -13977 -15509 -31081 -19902 -25511 -46064 -4857 15783 -26147 -38870 -13833 11008
5888 11008 5405 25093 11835 -7216 24717 37504 40191 43675 57825 66079 84952 96126 96634
5875 96634 83240 83772 101723 60466 29011 19293 4328 90178 78741 9357 -59293 -68676 -58536
$$ packed form
5961i5135M6037j8988K8253K8690L5628K2482j8616n5848J7380R245O1482l1674
5949B8936o8583l3364K2137J5475L9722K2046m6234k88P260p146j08163L1383
5937i6819J09736J8678p8050j8888M4866Q1717l2709k0302J9049k4102k0277j3335
5925c0436L8751M0630k8636J5451R587j2948k9438r452M2871K6981J8772m1578
5913D0555n8257K51L635k0149j5455L5221M4073J2988j3688l0275j850J3485n2500
5900d1966K7989j532j5572J1179n609k0553M1207K0640m1930j2723K5037K4841
5888A1008n603J9688j3258j9051L1933J2787K687L484J4150Q254J8873J1174N08
5875I6634j3394N32J7951m1257l1455r718j4965Q5850j1437o9384o8650r383J0140
$$ plain form
5862 -58536 -18064 36370 50298 43811 25769 60969 80473 102945 81787 57070 -8113 -52362
5850 -52362 -26034 -21443 14523 43399 -14174 -23225 -83844 -100479 -31165 58574 119275 90703
5838 90703 23132 -20476 -5513 900 -6639 13619 -7920 -65443 -77860 -36714 21529 69321
5826 69321 98632 9599 -42280 -75266 -111586 -91547 -64210 -36006 -45592 -23680 -14970 -56170
5814 -56170 -66849 -24979 -5477 -1178 16473 5648 26039 44406 45939 56679 89627 79933
5802 79933 29503 25598 15956 -10541 -56981 -60928 -57896 -64374 -42988 -72858 -164837 -130216 -71331
5789 -71331 -39475 -9714 -29945 -47070 -34454 -10746 63080 114160 48822 -20229 -53777 -94119
5777 -94119 -56909 -46102 3864 20359 -30237 -50596 -59503 -78422 -56788 -65488 -52450 -725
$$ packed form
5862e8536M0472N4434J3928o487j8042L5200J9504K2472k1158k4717o5183m4249
5850e2362K6328M591L5966K8876n7573r051o0619j6635O9314Q9739O0701k8572
5838I0703o7571m3608J4963O413p539K0258k1539n7523j2417M1146N8243M7792
5826F9321K9311q9033n1879l2986l6320K0039K7337K8204r586K1912Q710m1200
5814e6170j0679M1870J9502M299J7651j0825K0391J8367J533J0740L2948r694
5802G9933n0430l905r642k6497m6440l947L032o478K1386k9870r1979L4621N8885
5789g1331L1856K9761k0231j7125J2616K3708P3826N1080o5338o9051l3548m0342
5777i4119L7210J0807M9966J6495n0596k0359q907j8919K1634q700J3038N1725
$$ plain form
5765 -725 65710 62958 15718 10884 27811 32080 13651 14527 -36463 -79599 -44063 -16818 -34010
5752 -34010 -1555 -20026 1119 12519 -8892 -9528 603 -3044 -4548 -22572 -39681 -22873 7519
5739 7519 14028 23836 64516 71987 22335 -5560 -56013 -104507 -56984 -41599 -55473 -100558 -90701
5726 -90701 -120906 -105825 -84940 -59401 -9109 4045 1087 13541 37175 47421 12721 16161
5714 16161 -24201 -73139 -29460 -9795 18373 5174 54023 72750 10307 -67411 -92599 -72577
5702 -72577 -41735 -41533 -4551 21249 3558 1364 11321 -5643 -36106 -34206 -34938 -16978 -27930
5689 -27930 -58721 -68563 -39101 -7926 1203 47868 78784 88324 31702 318 -16652 -31993
5677 -31993 -63360 -69671 -11252 18777 24122 28776 17130 36822 81331 85524 65238 45362 11609
$$ packed form
5765g25O6435k752m7240m834J6927M269j8429Q76n0990m3136L5536K7245j7192
5752c4010L2455j8471K1145J1400k1411o36J0131l647j504j8024j7109J6808L0392
5739G519O509R808M0680P471m9652k7895n0453m8494M7523J5385j3874m5085R857
5726i0701l0205J5081K0885K5539N0292J3154k958J2454K3634J0246l4700L440
5714A6161m0362m8938M3679J9665K8168j3199M8849J8727o2443p7718k5188K0022
5702g2577L0842K02L6982K5800j7691k194R957j6964l0463J900p32J7960j0952
5689b7930l0791r842K9462L1175R129M6665L0916R540n6622l1384j6970j5341
5677c1993l1367o311N8419L0029N345M654j1646J9692M4509M193k0286j9876l3753
$$ plain form
5664 11609 -1443 -14539 -53431 -71032 -101759 -94688 -2394 -9922 -14971 7336 15558 28951 12628
5651 12628 10458 -35523 -17030 67155 127283 61949 75087 86360 11431 2715 19651 -23840
5639 -23840 -1841 37805 72099 65391 73156 76608 27848 -780 10760 25708 60478 25416
5627 25416 -19990 -26119 4985 -26006 -53472 -28948 -18214 -32158 -22755 -39236 -70081 -56899
5615 -56899 -72009 -63615 -69175 -32312 14423 44664 91092 95972 48827 10288 -15586 -1122
5603 -1122 2585 -8481 -24530 6543 44470 60640 3347 -28156 5732 -7876 -1046 -15436
5591 -15436 -46285 -58526 -109628 -87286 -63403 -23618 -25559 -11469 10783 21586 -38326 -46513
5579 -46513 2537 27145 31205 -42164 -15993 13521 60460 56661 29700 -17595 -35388 -40506
$$ packed form
5664A1609j3052j3096l8892j7601l0727P071R2294p528n049K2307Q222J3393j6323
5651A2628k170m5981J8493Q4185O0128o5334J3138J1273p4929q716J6936m3491
5639b3840K1999L9646L4294o708P765L452m8760k8628J1540J4948L4770l5062
5627B5416m5406o129L1104l0991k7466K4524J0734j3944R403j6481l0845J3182
5615e6899j5110Q394n560L6863M6735L0241M6428M880m7145l8539k5874J4464
5603a122L707j1066j6049L1073L7927J6170n7293l1503L3888j3608O830j4390
5591a5436l0849j2241n1102K2342K3883L9785j941J4090K2252J0803n9912q187
5579d6513M9050K4608M060p3369K6171K9514M6939l799k6961m7295j7793n118
$$ plain form
5567 -40506 -75210 -87321 17426 52118 44494 -12234 19704 7335 2941 50700 3383 -53724
5555 -53724 -52067 -80870 -79518 -94787 -119969 -53797 27931 38043 17554 -15982 -8898 12393
5543 12393 40930 64363 53018 33294 11660 -13505 -5568 -53962 -57487 14358 37103 -42498
5531 -42498 -67479 -41896 6021 11517 13774 32285 64625 79059 82618 29738 -34255 -9564
5519 -9564 97987 108462 71064 28041 -2250 25843 21949 -49752 -46580 -9614 4962 -23075
5507 -23075 -66128 -90060 -52823 7189 58372 76601 68341 75106 64812 29792 43636 32294
5495 32294 5287 10082 1004 9986 -14646 22217 29872 25490 -62689 -115989 -52280 1966 30487
5482 30487 -6408 9843 67031 73256 53882 36730 -78363 -91466 -111298 -109447 -73086 -32069
$$ packed form
5567d0506l4704j2111J04747L4692p624n6728L1938j2369m394M7759m7317n7107
5555e3724J657k8803J352j5269k5182O6172Q1728J0112k0489l3536P084K1291
5543A2393K8537K3433j1345j9724k1634k5165P937m8394l525P1845K2745p9601
5531d2498k4981K5583M7917N496K257J8511L2340J4434L559n2880o3993K4691
5519i564J07551J0475l7398m3023l0291K8093l894p1701L172L6966J4576k8037
5507b3075m3053k3932L7237O0012N1183J8229q260O765j0294l5020J3844j1342
5495C2294k7007M795r078Q982k4632L6863P655m382q8179n3300O3709N4246K8521
5482C0487l6895J6251N7188O225j9374j7152j15093j3103j9832J851L6361M1017
$$ plain form
5470 -32069 -27552 -12691 37826 70849 68081 69380 17520 20054 -9356 646 8019 -14962 -77853
5457 -77853 -79568 -45777 -58630 -60153 -60315 -57607 -7786 1088 -8740 18819 36463 39081 25675
5444 25675 2345 -19183 -11774 -24264 -60870 -68023 -55532 -55991 -92507 -123827 -100848 -39579 -55979
5431 -55979 -72105 -46652 12550 6089 31784 45910 1084 -4378 -55362 -81042 -34435 30882
5419 30882 122643 106704 34347 -5029 45174 75066 18061 -16515 -13535 11009 69494 67065
5407 67065 -3415 -47028 -47101 -45293 5279 22878 9631 5587 -10821 -40989 -56509 -11405 -10348
5394 -10348 -34457 -15731 -3039 22160 11337 -44602 -55914 -84692 -88162 -111630 -144885 -134304
5382 -134304 -72196 -24899 -10627 17217 25388 12036 -15719 -45148 -79273 -62499 -95019 -86082
$$ packed form
5470c2069M517J4861N0517L3023k768J299n1860K534k9410J0002P373k2981o2891
5457g7853j715L3791j2853j523j62K708M9821Q874r828K7559J7644K618j3406
5444B5675k3330k1528P409j2490l6606p153J2491m59l6516l1320K2979O1269j6400
5431e5979j6126K5453N9202o461K5695J4126m4826n462n0984k5680M6607O5317
5419C0882R1761j5939p2357l9376N0203K9892n7005l4576K980K4544N8485k429
5407F7065p0480m3613p3J808N0572J7599j3247m044j6408l0168j5520M5104J057
5394a0348k4109J8726J2692K5199j0823n5939j1312k8778l470k3468l3255J0581
5382a34304O2108M7297J4272K7844Q171j3352k7755k9429l4125J6774l2520Q937
$$ plain form
5370 -86082 -55897 -32262 -31569 24060 29844 39710 71549 33338 13180 -24318 2161 32105 3976
5357 3976 48804 108582 80365 -9818 -22802 -55665 -94257 -58051 6479 36426 11858 -47487
5345 -47487 -74456 -80435 -54015 -33529 -14553 16126 -12336 -56607 -30056 46579 101108 70188
5333 70188 18410 -17543 -11555 37806 -16111 21185 72687 32825 7849 64715 97704 104547
5321 104547 95478 26047 -35369 -50645 -1295 73520 74408 15625 12358 -30101 4925 56649
5309 56649 43113 -21462 -42821 -19712 -12596 -48593 -63441 -76203 -54907 -30295 -49790 -38358
5297 -38358 -26780 -42840 -79484 -89711 -84360 -128170 -123059 -60928 891 -12101 -59679 -48869
5285 -48869 -37725 -71145 -84328 -20113 -46713 -82764 -93840 -47759 7187 -16968 -53189 -46200
$$ packed form
5370h6082L0185K3635O93N5629N784R866L1839l8211k0158l7498K6479K9944k8129
5357C976M4828N9778k8217r0183j2984l2863l8592L6206O4530K9947k4568n9345
5345d7487k6969n979K6420K0486J8976L0679k8462m4271K6551P6635N4529l0920
5333G0188n1778l5953N988M9361n3917L7296N1502l9862k4976N6866L2989O843
5321A04547r069o9431o1416j5276M9350P4815Q88n8783l267m2459L5026N1724
5309E6649j3536o4575k1359K3109P116l5997j4848j2762K1296K4612j9495J1432
5297c8358J1578j6060l6644j0227N351m3810N111O2131O1819j2992m7578J0810
5285d8869J1144l3420j3183O4215k6600l6051j1076M6081N4946k4155l6221O989
$$ plain form
5273 -46200 -90394 -60895 3654 35718 10049 -31298 -18083 -35665 -7680 364 4722 2738
5261 2738 12004 -31176 -102832 -96904 -81872 -62299 -68111 -72014 -35098 -13223 -11488 24133 10457
5248 10457 -68802 -79111 -44198 -756 53263 39305 -18428 -75899 -100516 -81082 -82445 -77512
5236 -77512 -37655 -53987 -72380 -46069 -9410 -25671 -99297 -80367 -69501 -40783 -14728 6783
5224 6783 30052 29225 -8531 -24349 -61543 -16831 8369 -1079 -26245 -25331 -20379 -21962 4408
5211 4408 38664 71626 15405 29389 33381 2667 -16418 7741 51221 68737 26164 18710
5199 18710 7165 -8446 27351 71700 83004 48899 -18840 -34643 21182 32055 12513 29190
5187 29190 55647 66383 72147 37639 -3170 -17605 12999 65813 29911 25124 45975 25766
$$ packed form
5273d6200m4194K9499O4549L2064k5669m1347J3215j7582K7985Q044M358j984
5261B738R266m3180p1656N928J5032J9573n812l903L6916K1875J735L5621j3676
5248A0457p9259j0309L4913M3442N4019j3958n7733n7471k4617J9434j363M933
5236g7512L9857j6332j8393K6311L6659j6261p3626J8930J0866K8718K6055K1511
5224F783K3269q27l7756j5818l7194M4712K5200r448k5166R14M952j583K6370
5211D408L4256L2962n6221J3984L992l0714j9085K4159M3480J7516m2573p454
5199A8710j1545j5611L5797M4349J1304l4105o7739j5803N5825J0873j9542J6677
5187B9190K6457J0736N764l4508m0809j4435L0604N2814l5902m787K0851k0209
$$ plain form
5175 25766 -5018 -23064 13198 11351 1628 -6769 -6273 -36841 -9750 -3631 36969 109610 124548
5162 124548 84225 128 -22172 40284 46970 21166 73285 70504 64664 24165 24880 -1395 6879
5149 6879 2834 -12255 11001 13583 -275 -7461 -13902 8970 18201 -5081 -31873 -42047 -79520
5136 -79520 -85549 -55385 -51882 -35821 -27926 -47093 -84246 -58144 -12090 -33271 -31135 28472 -31468
5123 -31468 -78837 -80578 -88578 -101468 -105595 -89551 -55145 -65785 -27017 -20560 -65076 -69647 -19520
5110 -19520 -31980 -76257 -55642 -34912 -30849 -83851 -76571 -23325 -11860 -1377 16360 27922
5098 27922 38981 7015 8427 -42350 -92196 -77730 -8412 6623 25984 27843 -77 -18058
5086 -18058 14260 21807 -6683 -52192 -14616 -19337 -73329 -73685 -6447 10466 -6740 -27411 -26865
$$ packed form
5175B5766l0784j8046L6262j847r723q397M96l0568K7091O119M0600P2641J4938
5162A24548m0323q4097k2300O2456O686k5804N2119k781n840m0499P15k6275Q274
5149F879m045j5089K3256K582j3858p186o441K2872R231k3282k6792j0174l7473
5136g9520o029L0164L503J6061P895j9167l7153K6102M6054k1181K136N9607n9940
5123c1468m7369j741q000j2890m127J6044L4406j0640L8768O457m4516m571N0127
5110a9520j2460m4277K0615K0730M063n3002P280N3246J1465J0483J7737J1562
5098B7922J1059l1966J412n0777m9846J4466O9318J5035J9361J859k7920j7981
5086a8058L2318P547k8490m5509L7576m721n3992l56O7238J6913j7206k0671N46
$$ plain form
5073 -26865 -48206 -1675 1899 -53044 -60131 -6123 -7210 3387 -4762 -19765 -13536 25824 -6833
5060 -6833 -33656 -11291 13828 -7752 29420 52124 5960 -26496 -40757 -66035 -74246 -70039
5048 -70039 -35313 -25915 -10526 44697 -25312 -36417 3805 16394 -35478 -39877 -6588 1929
5036 1929 -20498 -61878 -7843 9384 -34460 -44707 -45197 -65963 -66568 -40028 -19237 -42686 -69235
5023 -69235 -105028 -56560 21179 17503 -24475 27790 44645 3134 46767 38665 47665 76498
5011 76498 65906 340 -44323 -34683 21516 54235 4133 -52488 -8842 37413 59487 58998
4999 58998 66860 57240 37943 76329 44201 -8763 -24848 -51904 -19904 23734 38954 54415
4987 54415 90294 108314 98693 127923 103600 117076 104523 52225 28071 25867 12322 -25258
$$ packed form
5073b6865k1341M6531L574n4943p087N4008j087J0597q149j5003O229L9360l2657
5060f833k6823K2365K5119k1580L7172K2704m6164l2456j4261k5278q211M207
5048g0039L4726R398J5389N5223p0009j1105M0222J2589n1872m399L3289Q517
5036A929k2427m1380N4035J7227m3844j0247m90k0766o05K6540K0791k3449k6549
5023f9235l5793M8468P7739l676m1978N2265J6855m1511M3633q102R000K8833
5011G6498j0592o5566m4663R640N6199L2719n0102n6621M3646M6255K2074m89
4999E8998P862r620j9297L8386l2128n2964j6085k7056L2000M3638J5220J5461
4987E4415L5879J8020r621K9230k4323J3476j2553n2298k4154k204j3545l7580
$$ plain form
4975 -25258 -20242 12965 32573 11759 6389 -810 -20180 11822 73918 77275 6788 -13984 -38885
4962 -38885 -61775 -7208 33155 26305 44310 41102 -1355 -29957 -14401 -32631 -11872 -20598
4950 -20598 -1570 -6780 -90 69 -12488 -5753 4695 -24671 -30971 -11803 -3377 -22619 118
4937 118 88782 110697 51053 35881 -21749 -32611 -51832 -57532 -90024 -49824 -9403 -58171
4925 -58171 -52298 -37070 -42252 -60808 -54023 29339 41901 -16519 -56627 -79919 -66272 1419
4913 1419 1439 -22066 -14852 13182 25091 38510 66869 26434 14899 -6401 -2338 -33197 -56858
4900 -56858 -82877 -79460 -56566 -20701 19949 -12375 -38516 -9987 6451 13041 11615 30399
4888 30399 18960 -15603 -85373 -89247 -52348 -11629 11882 -24123 17050 20932 -23835 -10589
$$ packed form
4975b5258N016L3207J9608k0814n370p199j9370L2002O2096L357p0487k0772k4901
4962c8885k2890N4567M0363o850J8005l208m2457k8602J5556j8230K0759q726
4950b0598J9028n210O690J59j2557O735J0448k9366o300J9168Q426j9242K2737
4937A18Q8664K1915n9644j5172n7630j0862j9221n700l2492M0200M0421m8768
4925e8171N873J5228n182j8556O785Q3362J2562n8420m0108k3292J3647O7691
4913A419K0k3505P214K8034J1909J3419K8359m0435j1535k1300M063l0859k3661
4900e6858k6019L417K2894L5865M0650l2324k6141K8529J6438O590j426J8784
4888C0399j1439l4563o9770l874L6899M0719K3511l6005M1173L882m4767J3246
$$ plain form
4876 -10589 15491 36631 60556 45461 1941 46457 48847 -14806 -32028 -40267 -36779 -14221
4864 -14221 -1527 -40740 -44415 -52358 -43073 -57107 -76783 -75595 -109424 -63242 1680 18923 12781
4851 12781 -13179 -47460 32778 81247 64287 43741 30728 15858 7302 23160 32449 39002
4839 39002 41651 -13269 -38242 -37457 -10528 -2681 4045 6802 30511 29782 39131 25002 -14477 -20358
4825 -20358 32925 36707 18370 -3456 -41526 -95991 -65788 -25166 -29831 -54495 -89297 -68602
4813 -68602 -25146 -1865 -26528 -35936 -56701 -66924 -65794 -35081 8387 12941 -31112 -34532 -33548
4800 -33548 -41337 -35059 -15071 5546 -8368 -11386 -12057 -38337 -8912 -38312 -66059 -64258 -116356
4787 -116356 -153155 -128232 -91783 -67200 -58773 -89182 -80988 -74988 -90226 -76274 -55877 -49772
$$ packed form
4876a0589K6080K1140K3925j5095m3520M4516K390o3653j7222q239L488K2558
4864a4221J2694l9213l675p943R285j4034j9676J188l3829M6182O4922J7243o142
4851A2781k5960l4281Q0238M8469j6960k0546j3013j4870q556J5858R289O553
4839C9002K649n4920k4973P85K6929P847O726K757K3709p29R349j4129l9479n881
4825b0358N3283L782j8337k1826l8070n4465L0203M0622m665k4664l4802K0695
4813f8602M3456K3281k4663r408k0765j0223J130L0713M3468M554m4053l420R84
4800c3548p789O278J9988K0617j3914l018o71k6280K9425k9400k7747J801n2098
4787a16356l6799K4923L6449K4583Q427l0409Q194O000j5238J3952K0397O105
$$ plain form
4775 -49772 -31035 -4520 25864 64299 38925 23662 24913 7420 -9481 4078 -69590 -128381
4763 -128381 -94229 -81186 -98229 -30983 2231 40320 45385 29790 1115 -20197 -2820 -46251
4751 -46251 -67645 -54882 10480 27496 35580 33325 -3946 889 -97994 -141388 -127647 -69887
4739 -69887 -34661 -17373 -8546 -3842 11242 -5417 -9512 -44861 -82137 -91257 -62316 -26044 -26184
4726 -26184 -414 11900 12850 5468 -28996 -32886 -52175 -41835 8268 18731 49083 52611 29016
4713 29016 -4890 -25116 -38046 -29454 -56563 -52374 10051 63784 91238 58312 63464 58141 37608
4700 37608 33893 4461 -14132 23076 9939 -14916 -17110 -15215 -15662 -17800 28971 30427 10478
4687 10478 14118 -65338 -73569 -8418 43458 4877 -9711 -12738 -12313 7205 17295 38205 60319
$$ packed form
4775d9772J8737K6515L0384L8435k5374j5263J251j7493j6901J3559p3668n8791
4763a28381L4152J3043j7043O7246L3214L8089N065j5595k8675k1312J7377m3431
4751d6251k1394J2763O5362J7016Q084k255l7271M835r8883m3394J3741N7760
4739f9887L5226J7288Q827M704J5084j6659m095l5349l7276r120K8941L6272j40
4726b6184K5770J2314R50p382l4464l890j9289J0340N0103J0463L0352L528k3595
4713B9016l3906k0226j2930Q592k7109M189O2425N3733K7454l2926N152n323k0533
4700C7608l715k9432j8593L7208j3137k4855k194J895m47k138M6771J456j9949
4687A0478L640p9456q231O5151N1876l8581j4588l027M25J9518J0090K0910K2114
$$ plain form
4674 60319 41195 23083 28100 27657 19807 19151 7357 658 10831 16757 -33815 5382 45803
4661 45803 14115 980 -10230 -17927 -60989 -91747 -38442 37590 10915 -30164 -55145 -11119
4649 -11119 42345 49501 31168 38963 -17431 -36761 -6241 -8061 -8955 -2921 -56679 -65177 -4642
4636 -4642 51047 17045 29788 46336 17579 -7698 20446 41748 17743 -2732 -34851 -42790
4624 -42790 -80867 -99084 -55371 -32819 -35909 -54527 -9902 -18919 -27503 22774 64354 69080 63179
4611 63179 51278 39200 16775 3437 -30197 -8200 -1654 -23834 -27764 -14160 52635 99581
$$ packed form
4674F0319j9124j8112N017m43p850o56j1794o699J0173N926n0572L9197M0421
4661D5803l1688j3135j1210p697m3062l0758N3305P6032k6675m1079k4981M4026
4649a1119N3464P156j8333P795n6394j9330L0520j820q94O034n3758q498O0535
4636d642N5689l4002J2743J6548k8757k5277K8144K1302k4005k0475l2119p939
4624d2790l8077j8217M3713K2552l090j8618M4625r017q584N0277M1580M726n901
4611F3179j1901j2078k2425j3338l3634K1997O546k2180l930J3604O6795M6946
$$ [...]
##END NTUPLES=NMR SPECTRUM
##END=
