##TITLE=Analysis number 317220
Compound Code nrb 01917
Project Code adrs
Chemist Name cyclan
##JCAMPDX= 6.0         $$ Bruker NMR JCAMP-DX V2.0
##DATA TYPE= NMR SPECTRUM
##DATA CLASS= NTUPLES
##ORIGIN= Bruker BioSpin GmbH
##OWNER= nmr
$$ XWIN-NMR		Version 3.5
$$ Mon Feb 13 08:48:29 2006 GMT Standard Time (UT+0h)  MAYBRIDGE\nmr@NMR_250MHZ
##.OBSERVE FREQUENCY= 250.131544655141
##.OBSERVE NUCLEUS= ^1H
##.ACQUISITION MODE= SIMULTANEOUS (DQD)
##.ACQUISITION SCHEME= undefined
##.AVERAGES= 16
##.DIGITISER RES= 18
##SPECTROMETER/DATA SYSTEM= dpx250
##.PULSE SEQUENCE= zg30
##.SOLVENT NAME= DMSO
##.SHIFT REFERENCE= (INTERNAL, DMSO, 0, 16.522)
##AUDIT TRAIL= $$ (NUMBER, WHEN, WHO, WHERE, WHAT)
$$ ##TITLE= Audit trail, XWIN-NMR		Version 3.5
$$ ##JCAMPDX= 5.01
$$ ##ORIGIN= Bruker BioSpin GmbH
$$ ##OWNER= nmr
$$ C:\u/data/dgb/nmr/ADRS/15880/pdata/1/auditp.txt
$$ ##AUDIT TRAIL=  $$ (NUMBER, WHEN, WHO, WHERE, WHAT)
(   1,<2006-02-13 08:47:13.20 +000>,<MAYBRIDGE\nmr>,<NMR_250MHZ>,
      <created by zg, POWCHK disabled, PULCHK disabled
       configuration hash MD5:
       84 BC 41 DB A1 6E 1D 46 DA 25 12 A5 C1 ED C5 3A
       data hash MD5: 64K
       66 34 B6 00 D6 2A 44 62 2C 3C 47 F6 76 A4 F6 96>)
(   2,<2006-02-13 08:47:44.56 +000>,<MAYBRIDGE\nmr>,<NMR_250MHZ>,
      <Start of raw data processing
       ef LB = 0.3 FT_mod = 6 PKNL = 1 SI = 32K 
       data hash MD5: 32K
       A5 6B DB 26 09 B6 76 E7 91 60 0A 2D D1 9B D2 6E>)
(   3,<2006-02-13 08:47:48.79 +000>,<MAYBRIDGE\nmr>,<NMR_250MHZ>,
      <apk 
       data hash MD5: 32K
       C1 2A B3 11 04 C8 07 30 15 C1 E2 FA 8D 7E 42 9E>)
(   4,<2006-02-13 08:47:51.73 +000>,<MAYBRIDGE\nmr>,<NMR_250MHZ>,
      <abs ABSG = 5 
       data hash MD5: 32K
       9C 24 E6 6B B6 94 76 E8 E3 A8 62 5E F0 C2 E8 65>)
$$ ##END=
$$ 
$$ hash MD5
$$ 8F BE 43 6E DF 94 6B C3 8F 16 B8 04 20 70 08 D9
##$RELAX= 
##$RELAX= 
##$RELAX= 
##$RELAX= 
##$RELAX= 
##$RELAX= 
##$RELAX= 
$$ Bruker specific parameters
$$ --------------------------
##$DU= <C:\u>
##$EXPNO= 15880
##$NAME= <ADRS>
##$PROCNO= 1
##$TYPE= <nmr>
##$USER= <dgb>
##$AMP= (0..31)
100 100 100 100 100 100 100 100 100 100 100 100 100 100 100 100 100 100 
100 100 100 100 100 100 100 100 100 100 100 100 100 100 
##$AQSEQ= 0
##$AQ_mod= 3
##$AUNM= <au_zg>
##$AUTOPOS= <3 >
##$BF1= 250.13
##$BF2= 250.13
##$BF3= 250.13
##$BF4= 250.13
##$BF5= 500.13
##$BF6= 500.13
##$BF7= 500.13
##$BF8= 500.13
##$BYTORDA= 1
##$CFDGTYP= 0
##$CFRGTYP= 5
##$CHEMSTR= <none>
##$CNST= (0..31)
1 1 145 1 1 1 1 1 1 1 1 1 1 1 1 1 1 1 1 1 1 1 1 1 1 1 1 1 1 1 1 1 
##$CPDPRG= <>
##$CPDPRG1= <>
##$CPDPRG2= <>
##$CPDPRG3= <>
##$CPDPRG4= <mlev>
##$CPDPRG5= <mlev>
##$CPDPRG6= <mlev>
##$CPDPRG7= <mlev>
##$CPDPRG8= <mlev>
##$CPDPRGB= <>
##$CPDPRGT= <>
##$D= (0..31)
0 1 0 0 0 0 0 0 0 0.06 0 0 0 0 0 0 0.0002 0 0 0 0 0 0 0 0 0 0 0 0 0 0 
0 
##$DATE= 1139820422
##$DBL= (0..7)
120 120 120 120 120 120 120 120 
##$DBP= (0..7)
150 150 150 150 150 150 150 150 
##$DBP07= 0
##$DBPNAM0= <>
##$DBPNAM1= <>
##$DBPNAM2= <>
$$ [...]
##$SUBNAM7= <"">
##$SUBNAM8= <"">
##$SUBNAM9= <"">
##$SW= 20.6930455092707
##$SWIBOX= (0..15)
0 0 3 0 0 0 0 0 0 0 0 0 0 0 0 0 
##$SW_h= 5175.983436853
##$TD= 65536
##$TD0= 1
##$TE= 294.16
##$TE2= 300
##$TE3= 300
##$TEG= 300
##$TL= (0..7)
0 120 120 120 120 120 120 120 
##$TP= (0..7)
150 150 150 150 150 150 150 150 
##$TP07= 0
##$TPNAME0= <>
##$TPNAME1= <>
##$TPNAME2= <>
##$TPNAME3= <>
##$TPNAME4= <>
##$TPNAME5= <>
##$TPNAME6= <>
##$TPNAME7= <>
##$TPOAL= (0..7)
0.5 0.5 0.5 0.5 0.5 0.5 0.5 0.5 
##$TPOFFS= (0..7)
0 0 0 0 0 0 0 0 
##$TUNHIN= 0
##$TUNHOUT= 0
##$TUNXOUT= 0
##$USERA1= <user>
##$USERA2= <user>
##$USERA3= <user>
##$USERA4= <user>
##$USERA5= <user>
##$V9= 5
##$VALIST= <valist>
##$VCLIST= <CCCCCCCCCCCCCCC>
##$VD= 0
##$VDLIST= <DDDDDDDDDDDDDDD>
##$VPLIST= <PPPPPPPPPPPPPPP>
##$VTLIST= <TTTTTTTTTTTTTTT>
##$WBST= 1024
##$WBSW= 4
##$XGAIN= (0..3)
0 0 0 0 
##$XL= 0
##$YL= 0
##$YMAX_a= 490155
##$YMIN_a= -388871
##$ZGOPTNS= <>
##$ZL1= 120
##$ZL2= 120
##$ZL3= 120
##$ZL4= 120
##$ABSF1= 16.522
##$ABSF2= -4.171173
##$ABSG= 5
##$ABSL= 3
##$ALPHA= 0
##$AQORDER= 0
##$ASSFAC= 0
##$ASSFACI= 0
##$ASSFACX= 0
##$ASSWID= 0
##$AUNMP= <proc_1d>
##$AZFE= 0.1
##$AZFW= 0.1
##$BCFW= 0
##$BC_mod= 0
##$BYTORDP= 0
##$COROFFS= 0
##$CY= 12.5
##$DATMOD= 1
##$DC= 0
##$DFILT= <>
##$DTYPP= 0
##$F1P= 14.0000005364418
##$F2P= -0.99999901652339
##$FCOR= 0.5
##$FTSIZE= 32768
##$FT_mod= 6
##$GAMMA= 0
##$GB= 0
##$INTBC= 1
##$INTSCL= 1
##$ISEN= 128
##$LB= 0.3
##$LEV0= 0
##$LPBIN= 0
##$MAXI= 10000
##$MC2= 0
##$MEAN= 0
##$ME_mod= 0
##$MI= 0
##$NCOEF= 0
##$NC_proc= -5
##$NLEV= 6
##$NOISF1= 0
##$NOISF2= 0
##$NSP= 0
##$NTH_PI= 0
##$NZP= 0
##$OFFSET= 16.522
##$PC= 1
##$PHC0= 87.87633
##$PHC1= 6.437992
##$PH_mod= 1
##$PKNL= yes
##$PPARMOD= 0
##$PSCAL= 4
##$PSIGN= 0
##$REVERSE= no
##$SF= 250.13
##$SI= 32768
##$SIGF1= 0
##$SIGF2= 0
##$SINO= 400
##$SIOLD= 32768
##$SREGLST= <1H.DMSO>
##$SSB= 0
##$STSI= 32768
##$STSR= 0
##$SW_p= 5175.98343685301
##$SYMM= 0
##$S_DEV= 0
##$TDeff= 65536
##$TDoff= 0
##$TI= <Analysis number 999999
Compound Code 99
Book Reference 9
Project Code 9>
##$TILT= no
##$TM1= 0
##$TM2= 0
##$TOPLEV= 0
##$USERP1= <user>
##$USERP2= <user>
##$USERP3= <user>
##$USERP4= <user>
##$USERP5= <user>
##$WDW= 1
##$XDIM= 32768
##$YMAX_p= 341773573
##$YMIN_p= -567645
$$ End of Bruker specific parameters
$$ ---------------------------------
##NTUPLES= NMR SPECTRUM
##VAR_NAME=  FREQUENCY,     SPECTRUM/REAL,   SPECTRUM/IMAG
##SYMBOL=    X,             R,               I
##VAR_TYPE=  INDEPENDENT,   DEPENDENT,       DEPENDENT
##VAR_FORM=  AFFN,          ASDF,            ASDF
##VAR_DIM=   32768,         32768,           32768
##UNITS=     HZ,            ARBITRARY UNITS, ARBITRARY UNITS
##FACTOR=    0.157963299565203, 1,           1
##FIRST=     4132.6476996994, 0,             0
##LAST=      -1043.33573715361, 0,           0
##MIN=       -1043.33573715361, -567645,     0
##MAX=       4132.6476996994, 341773573,     0
$$ Real data points
##PAGE= N=1
##DATA TABLE= (X++(R..R)), XYDATA
$$ [...]
18705 631 -52775 -124682 -92781 -176888 -137826 -45130 4653 -133520 -89894 49507 78337 71228
18693 71228 -61871 -131589 -82593 64328 207990 171142 121307 142482 133033 -52614 -158552
18682 -158552 -103483 -127744 -177913 -186963 -53688 -11364 -4716 -21181 -63158 -201680 -242745
18671 -242745 -192771 -110898 -218756 -75956 15618 -115009 -190708 -254383 -173015 -45091 75935
18660 75935 16658 -4128 -35177 34634 139973 174443 114837 62573 131651 181302 143382
18649 143382 158357 168744 117572 -19412 -161688 -210059 -130489 -65998 -6733 -74738 -11560
18638 -11560 -51838 -182090 -168631 -71035 -52509 -32470 -80918 4694 147089 38128 36120
18627 36120 -16606 -52058 -135808 -52647 23273 -28494 88878 186516 94453 49250 -56595
18616 -56595 -71193 46447 145240 29609 -87062 -134439 -98639 -32852 70685 60027 -23979
18605 -23979 122740 196820 162253 -38319 -116684 -130139 -42880 -48949 -3757 32923 -9812
18594 -9812 66643 11468 -89731 -31472 70878 19887 -32527 -92251 48505 62439 24338
18583 24338 -20844 -113898 -119511 29416 129215 16753 -88887 -10154 60042 35716 -66391
18572 -66391 -152239 -170623 -98919 -17252 -79992 -299535 -332661 -235918 -67645 18360 66939
18561 66939 54282 38598 71174 98637 163202 77251 134513 176635 129797 -30541 -56013
18550 -56013 -108448 -110931 -126256 -99115 -18231 32711 39412 77087 51139 -57027 -67679 -127408
18538 -127408 -100069 -71295 56898 -11035 -235719 -232222 -225609 -243663 -242333 -125708 -39297
18527 -39297 66128 79739 97765 90203 17563 17609 -85359 -23506 -15925 44920 134562 122185
18515 122185 32189 -127717 -109591 -2763 54724 112795 127979 39116 33704 24866 -65819
18504 -65819 -313023 -400319 -223030 -114979 -35158 50993 1091 -43438 -106502 -78442 -86553
18493 -86553 -116986 -134352 -22226 118840 176037 154112 106521 -56894 -180376 -98384 -92305
18482 -92305 28309 -3275 -130800 -76915 -128452 -11342 42928 -76307 3483 9498 -25363
18471 -25363 -47752 -62845 3045 71010 17764 -102435 -133112 -151998 -52815 -66442 4605
18460 4605 -45294 -113443 -104595 -101549 -48365 105667 147216 81224 86517 4215 47088 -13362
18448 -13362 -134530 -154523 -174815 -128041 -147795 -154720 -146143 -50309 75125 222329 127351
18437 127351 -1557 64089 64171 -45334 -37224 -83655 -33360 -33694 -17002 -20343 12457 98361
18425 98361 36126 -4082 -101569 -125128 -194136 -285024 -117972 -80105 10973 8598 -164446
18414 -164446 -163024 -69795 -78707 -46898 80132 77065 11193 142227 126615 -14409 51869
18403 51869 7905 50444 73067 -21858 58763 138516 90022 71493 109937 227761 307701
18392 307701 259957 218133 148505 -3208 10382 100809 74809 74328 14802 -93371 -76295
18381 -76295 -79131 -34247 3887 43978 -22777 -49700 -121762 -87854 62501 122565 116079 24128
18369 24128 -69064 -100115 -21608 -74758 -108647 -190557 -72031 114414 122016 82082 38161
18358 38161 111184 172415 109232 23271 -110202 -132286 -25785 -42909 -4022 -58686 -15417
18347 -15417 67439 -4420 9820 -10716 51975 214976 189542 111969 87422 -30933 -122274
18336 -122274 16079 85948 48934 -9289 -16598 9327 9429 -30891 7907 126693 50262 3414
18324 3414 -117401 -140728 -57312 -20344 -172340 -206406 -293493 -289218 -225159 -155294 -10881
18313 -10881 90244 77997 83768 80551 186581 65792 -36083 -104334 -42067 49854 9851
18302 9851 -95226 -228418 -203680 -120754 -46203 -57585 -167635 -37648 -54878 -60123 -85882
18291 -85882 -44497 -31746 -80356 -138396 -96932 -125834 -193872 -161484 -73957 -146310 -145410 -100302
18279 -100302 -48794 51765 148821 76053 -16156 136215 151519 172556 197589 96741 -70697
18268 -70697 -258261 -375774 -317667 -329089 -295920 -302465 -315526 -160763 -114955 -33744 24017
18257 24017 -11140 -107255 -69362 60984 124888 -35529 -95280 -100873 -104354 -81946 -147143 -159845
18245 -159845 -188458 -203386 -167083 -66680 -43780 -149657 -181372 -63535 -28527 27671 26117
18234 26117 -53518 -57903 -11527 89749 -2336 -254562 -119540 39949 142735 135744 138745
18223 138745 180363 190980 86775 -29210 34999 96008 57697 41465 -38687 -84950 -103171
18212 -103171 -76683 -42177 -71777 -53912 -62619 -50556 98555 136411 146804 124928 34447
18201 34447 -78024 -28313 -69452 -231944 -199655 7106 73038 200042 241565 103870 11213
18190 11213 -159654 -192399 -176872 -139172 -64677 -45035 77431 -21159 126 -85178 -120259
18179 -120259 -159984 -147462 -137237 -166610 -194345 -181280 -71245 -65473 -92057 -133803 -273453
18168 -273453 -267976 -105682 -120945 -109417 -42019 22541 -12364 -210026 -324505 -269921 -276791
18157 -276791 -229737 -92368 -4181 -9457 -20554 -22641 -96176 -158195 -95592 103787 193204
18146 193204 212287 113426 -171058 -167059 -161190 -214899 -140692 -4436 -60123 -187322 -119688
18135 -119688 -73064 -55552 -49453 -112481 -237842 -225624 -237239 -227579 -64215 -124037 -159098
18124 -159098 -104402 -41632 14257 13683 149906 132512 189240 278840 202462 122238 27098 -66203
18112 -66203 7756 123392 144288 158344 4833 54694 93588 46253 69054 167093 1094
18101 1094 -6955 148142 166452 7364 -44398 -163055 -141499 -13205 99419 72073 -15146
18090 -15146 68550 68043 24673 -30050 89846 21793 -47486 19811 176769 83543 7265 38228
18078 38228 9369 -55537 -180457 -127365 -1414 -15247 -45062 -47766 -33357 50195 -36641
18067 -36641 66469 -13696 38477 91541 123078 135142 40851 107886 172909 89009 67686
18056 67686 13082 -87336 -103340 -91374 47936 91404 -65954 -9019 25408 13821 33852
18045 33852 72044 -3254 -46367 -180686 -85053 25838 32433 -34157 -16918 62340 13185
18034 13185 104601 142692 106235 -73251 -256279 -225913 -75006 19145 166180 141157 10152
18023 10152 -108767 93556 135755 140955 86666 75925 15031 -58889 -177778 -176753 -196225
18012 -196225 -241205 -97314 25648 152099 191097 134672 -10649 -59026 -77799 -162546 -102098
18001 -102098 -55735 -66757 109568 118877 13477 -43543 -118474 -74146 -49943 35540 11282
17990 11282 24301 69139 91384 -8602 26479 115632 164498 69932 -59706 -195182 -227585
17979 -227585 -229570 -105387 -24211 -160233 -100261 -61249 1354 86112 34311 81538 18930
17968 18930 55421 139264 77189 96671 85980 135216 292503 245773 95463 -152350 -314176
17957 -314176 -389385 -428559 -231483 -63515 11396 -8719 -74891 -87504 -50403 4970 154766
17946 154766 93612 -28090 -79816 -65810 -28347 -104363 -24871 -39003 -162157 -99946 10595
17935 10595 -28713 -78953 -10380 65557 99779 115359 -43206 -103862 -89156 93755 100375
17924 100375 136202 95303 144296 87528 26670 -19697 -126819 -42426 33641 196120 165399
17913 165399 177432 148862 132129 114375 91158 71032 146161 161041 129977 55522 13632
17902 13632 -22875 1439 64894 89876 22141 -26545 -40629 -126059 -168018 -115536 -56786 37330
17890 37330 79694 64195 -95400 -127566 -152683 -17950 80664 148757 150157 128603 35948
17879 35948 111866 114684 -2591 -79855 -112765 -125303 -147115 -137399 -156745 -81973 -9600 67721
17867 67721 64722 67228 39087 9985 -65977 -110939 -200091 -271097 -284271 -253239 -274199 -213588
17855 -213588 -91713 18800 24602 -8347 -7643 -17761 75496 132043 127533 178872 100205 -25645
17843 -25645 -102950 -120761 -37607 -18070 1441 -35352 -88882 -54730 -13360 7690 204978
17832 204978 284998 264971 212970 71224 -168248 -200322 -195668 -216147 -211761 -166928 -147563
17821 -147563 -93708 53761 64438 6236 -29382 13833 118383 70691 -14501 -179888 -225685
17810 -225685 -164424 -87867 26933 131078 83649 212792 99107 38975 22736 -77473
17800 -77473 -265169 -306600 -349174 -301284 -182849 -40658 61459 46816 16535 -17102 33821
17789 33821 51768 7850 -154166 -72882 97430 48304 -13390 12224 163828 281349 254141
17778 254141 164059 106954 -26850 -7579 110884 69433 -46839 -146289 -120735 -149891 -63323
17767 -63323 -97049 -176246 -224867 -254264 -191649 -195096 -180027 -11643 72800 83018 32195 25612
17755 25612 71820 91338 9712 -107687 -52870 -94625 -40351 -53337 14460 136847 120700
17744 120700 69063 44247 -67629 -93040 -130599 -71596 -163177 -230396 -167017 -32259 3781
17733 3781 132699 168053 104547 -52905 -139339 24214 206158 285193 206951 172217 130043
17722 130043 164306 144897 77645 147088 163943 104145 2165 -81546 -75128 -19463 10054
17711 10054 -49883 -140700 -129061 -67918 -146193 -96180 -149058 -40110 34972 -157970 -223552
17700 -223552 21719 79241 61040 118388 48899 15096 -82706 -59608 -118086 -189451 -65030
17689 -65030 18915 133331 270126 74481 -58175 -78798 -9348 59292 80314 53731 138331
17678 138331 26976 -9222 50867 115921 148814 21209 7248 147631 84403 73758 43383
17667 43383 4364 147930 373296 353271 400703 245223 109634 30122 -4158 -27564 1932
17656 1932 -21792 -70300 -109300 -17405 -2325 -351 -90863 -90338 -44231 59745 -72515 -53353
17644 -53353 -70701 -243328 -260961 -113532 35579 112233 158042 242223 214201 261473 276518
17633 276518 140755 220185 225950 64732 -2912 -72393 -45941 20951 -52127 -28587 -88315
17622 -88315 -162154 -80454 14479 78063 39934 -50003 -58588 -69174 -76940 -118476 -113157 -139870
17610 -139870 -71218 4064 -130695 -215112 -186323 -187354 -176309 -112274 -84258 -2040 63801
17599 63801 101907 62296 14044 -124944 -267855 -362634 -292480 -211951 -43333 163391 152823
17588 152823 37601 -95033 -162228 -46535 -11457 -19964 40951 122763 136756 140288 96712
17577 96712 10195 137377 246838 172350 118285 54485 -37854 -64316 -51009 -96781 -91902
17566 -91902 -4316 2058 80703 236061 246291 101313 110468 12406 -21053 -21577 -505 84415
17554 84415 46089 -33670 -47117 -24679 54984 170552 288160 256819 196639 193354 207271
17543 207271 190114 18590 -90775 -89419 -173411 -244140 -214775 -41751 -7888 9133 -106348
17532 -106348 -167657 -83075 -7657 -35311 -117082 -127004 -179048 -186459 -207365 -273950 -209609 -75904
17520 -75904 -30600 56738 -9890 -45537 31752 67235 4282 -78004 -119925 -15770 7637
17509 7637 8131 183827 249686 226608 243720 147595 125762 206745 262571 233213 146593 124553
17497 124553 59411 59094 62406 -46808 -152629 -203587 -139416 -91375 -141849 -197103 -108169 -67751
17485 -67751 -133072 -27182 60193 -102832 -114988 -134412 -76714 -64986 -262710 -240096 -100411
17474 -100411 7511 -30648 -56064 -8733 -4382 8924 100691 124719 -20156 -32035 149981
17463 149981 350239 245141 231807 171973 67441 87144 87708 -22520 -34374 -55191 -152793
17452 -152793 7990 35797 -16668 -29947 -16564 -46723 -34898 -119336 -193841 -97658 33014
17441 33014 122042 152631 -31180 -227692 -276516 -188014 -180838 -278888 -264106 -157310 -123919
17430 -123919 -82458 119947 156237 46804 -15028 -113367 -93627 -48286 -77508 -57454 -36120
17419 -36120 40684 30659 -46525 -35298 -11659 4726 30834 -9908 36232 66544 20128 -145332
17407 -145332 -240508 -249603 -212146 64539 102876 2229 -116154 -131474 -213540 -257763 -111633
17396 -111633 -173992 -136789 -71249 -99362 -157003 -42464 65172 135383 23803 -49170 -75575
17385 -75575 23256 14064 39051 -30102 -140480 -184898 15044 52618 13537 9324 -96853
17374 -96853 -177396 -60453 48112 160442 173800 6341 -33649 123949 217017 234896 221094
17363 221094 248796 136134 262 53325 93337 14035 34077 -15874 -50180 -181351 -200025
17352 -200025 -223649 -124077 -107323 -109456 -199219 -186847 -90370 -133794 -141327 378 19214 7484
17340 7484 -14030 -96592 -193303 -118640 59552 144184 212954 262715 200579 151905 -40815
17329 -40815 -13075 41665 -40684 20641 121722 98765 104923 195565 225346 234796 35352 -50672
17317 -50672 -2719 40286 -44783 -7316 43076 -107396 -228623 -250947 -217811 -95935 49291
17306 49291 12940 -83465 -182828 -151313 -117775 -66617 -4164 -66346 -123595 -160452 -12607
17295 -12607 63893 98346 13197 -39327 8151 -177257 -208665 -99844 -43710 -59141 -104673
17284 -104673 2080 53732 -5945 67710 47225 -43380 -147779 -144021 2153 59662 -20317
17273 -20317 17169 103018 95661 75317 20050 116878 47422 52990 -52922 -167335 -181253 -98564
17261 -98564 -39241 -37848 -106787 -129484 -59119 39590 -12749 -16607 21833 34899 113726 45469
17249 45469 -22164 48395 20021 -54637 -154230 -115431 -11870 6725 31859 46868 41375 -84913
17237 -84913 -115838 -129343 -280875 -305416 -166788 -124255 -143914 23590 117258 25470 117785
17226 117785 35527 -14303 10024 129379 285116 93741 -37442 -71858 -174092 -244478
17216 -244478 -167710 -50199 -164863 -214186 -236445 -222131 -38972 126127 130909 114190 88031
17205 88031 49269 37324 56124 111427 31850 -68790 -191389 -160766 -83641 21727 35048
17194 35048 -27837 -230803 -275427 -137974 -59535 7049 37967 -14292 10794 143257 190538
17183 190538 137243 -35018 -94753 37824 -72913 -85769 -63831 -33663 -45286 -67818 57080
17172 57080 65950 -9654 16195 -41781 67003 223273 111619 1801 -24686 147159 93900
17161 93900 11634 46416 73214 179905 256566 258696 119148 6500 -50122 -111955 -161380
17150 -161380 -185050 -112705 14421 103673 144948 82746 -51625 -12158 -111735 -214231 -320733
17139 -320733 -319372 -267799 -265693 -208812 -168999 -168047 -175100 -123688 -146461 -9894 37381 -90709
17127 -90709 -173878 -189757 -159319 -139374 -81563 -23576 81268 60346 50045 46656 108430 261431
17115 261431 173301 36676 -6200 -36812 -66364 -73956 -76482 -93837 -34883 -14401 195977
17104 195977 248656 76991 -14075 -113211 -144447 -188283 -206885 -248182 -296735 -234273 -131071
17093 -131071 -102115 -61866 42197 5982 91897 71872 41426 39013 -13880 -100140 -177504
17082 -177504 -125065 -84762 -46375 -61676 -16248 -79132 -36980 101127 123729 102387 176691
17071 176691 326691 328614 247378 18756 20033 120373 5990 4056 162187 104133 -100312
17060 -100312 -194378 -102748 -17697 -112991 -189273 -44071 -2345 -40304 -22752 633 -83204
17049 -83204 -120238 -72161 -68864 -32455 3739 42005 26443 -79961 -83088 33496 58909 17477
17037 17477 110204 88762 -3694 -4762 58414 55778 -36008 -104021 -146821 -105523 54123 82788
17025 82788 56911 37821 26708 -28965 -10720 118971 188802 59395 4704 59169 -29530
17014 -29530 -119912 -75622 185982 220678 96276 -76353 -47974 -112374 -124793 -38021 29504
17003 29504 3899 -79843 -20475 99215 124161 26638 -29300 -51509 21668 -35306 -28305 -29380
16991 -29380 -117920 -67770 27356 -53759 -36496 -99657 -159073 -223221 24199 153514 106689
16980 106689 -6790 -70860 -157878 -203559 -178700 -242588 -286402 -227448 -118402 -21024 -3069
16969 -3069 11 -44762 -163298 -150357 16491 53678 170336 277306 165031 -81687 -263037
16958 -263037 -317652 -255343 -164335 -29019 91262 -29860 -15889 -53591 -8845 128128 62492
16947 62492 129413 38740 -39297 45990 -62358 -180922 -60521 44786 -53174 -94033 -50172
16936 -50172 8410 -26073 -84427 -69731 -37787 -91519 -45013 -112123 44923 97753 258870
16925 258870 248655 187734 184990 121623 -53215 46376 88496 74081 55676 168829 208433
16914 208433 124123 64144 82565 200642 124541 -817 67881 86463 88704 32841 -119386
16903 -119386 -203099 -203119 -62837 79365 179926 23305 -32761 -41439 24396 118373 -11467
16892 -11467 -61849 -152261 -130339 -200012 -75389 -8276 29206 17694 173828 246149 207924
16881 207924 111530 4466 -64570 -86571 -181160 -173194 -37167 51837 -32964 -117380 -104533
16870 -104533 -83651 -64079 -104229 -170452 -163242 -153707 -94305 62868 185214 46261 5554
16859 5554 -5362 73923 117383 122773 116000 52043 126737 202134 222632 280883 178635 58266
16847 58266 30813 -54343 -88543 -53933 75208 146521 87175 56477 -30690 18387 -19583
16836 -19583 -26411 19329 125681 142063 157488 290716 106129 -108887 -237091 -261397 -133774
16825 -133774 -89345 -50390 -85921 -10882 75115 69132 -7949 -4109 -50487 -44531 -101382 -85432
16813 -85432 -15406 6296 -69733 7317 43379 68795 44648 35273 77628 149423 168303 12047
16801 12047 -141939 -139853 -53528 27851 3952 -90132 -229917 -326348 -157574 -160676 -218588
16790 -218588 -162748 -26005 65380 154200 142967 -20311 -121470 21228 162660 27555
16780 27555 -250262 -279848 -145990 2037 -54099 -113618 40512 281501 208857 146589 35834
16769 35834 72116 14531 -86323 -112159 -183559 -81928 27666 12891 36322 -28498 101221
16758 101221 133621 98107 172328 57822 -40337 -47854 93726 146140 154299 107919 100189 44358
16746 44358 -109483 -198546 -100269 -77172 -103737 -89560 -117964 -131394 -131469 -139257 -75285 27796
16734 27796 82149 29968 -15959 54437 190054 169540 16607 -195550 -302268 -214468 -58869
16723 -58869 -60147 -130460 -12003 109833 146127 46339 100202 -10556 -40540 6309 -55771
16712 -55771 -105154 -74364 -28823 -104286 -28331 64939 142668 90490 -15527 56612 160393
16701 160393 225057 347586 340204 305882 225776 107259 86676 126395 130226 165859 25286
16690 25286 -65003 -25686 97865 105717 -35543 -103135 -86641 -39932 -124293 -232122 -325631
16679 -325631 -281722 -173364 -55876 -49669 13536 51558 -127278 -144378 31826 4003 37665
16668 37665 76118 -57829 -89809 -141476 -170398 -160769 -192361 11726 172254 300316 269815
16657 269815 273593 330424 194570 122246 35844 1112 -75481 -39069 23286 29847 82420 -1142
16645 -1142 -95406 -156969 -15399 36179 40222 -4321 -71358 -136976 -194103 -166110 -34811 29572
16633 29572 28463 107649 93593 -112106 -267353 -246568 -55095 -155866 -158666 -126863 -189585
16622 -189585 -206921 -149239 -92334 57484 71699 75428 116812 154316 125227 155068 123002
16611 123002 91043 107234 138270 404 -100981 -154233 -140074 -108154 -32040 11974 19809
16600 19809 -32866 -97048 -40474 -75898 -69580 -118168 -92174 -44220 96826 17104 -62644 -24021
16588 -24021 -45405 -87645 -215025 -138547 -3548 109040 33589 -22325 -191442 -283532 -322512
16577 -322512 -258561 -222402 -140544 -32548 58198 30451 -7342 -13470 29544 64182 30244
16566 30244 -15868 -118380 -186134 -98854 85285 72707 97950 150809 140593 6417 -62554
16555 -62554 -155205 -187884 -108712 10866 -12942 -90556 2511 -8313 8792 57184 53764 77535
16543 77535 -59234 24731 32325 -22170 120607 162064 152804 25984 -43212 52989 77032
16532 77032 -5088 -129198 -210566 -280129 -248105 -238406 -82294 -81742 -115626 -176288 -135900 -75979
16520 -75979 -151589 -72136 48961 198225 197134 113581 33455 32429 -41343 -4820 26837 90619
16508 90619 113830 139504 148078 89660 -30785 -32099 73816 96267 158193 80417 60891 26950
16496 26950 23686 -108464 -18784 25080 97157 13243 24813 129102 273379 175610 -26848
16485 -26848 -132821 -152649 -134644 28537 117416 7620 69204 172013 89657 108878 132377
16474 132377 115779 106490 137950 126118 189269 225846 90991 -16045 -218875 -246456 -32373
16463 -32373 118952 54915 -18243 3199 35303 109331 287585 203137 99758 269362 247401
16452 247401 226634 318379 255388 197113 46189 123966 156712 205855 315644 216052 307097
16441 307097 234675 -17827 -27631 -16994 68396 152694 138747 114165 75440 91180 79201
16430 79201 -32963 -8835 81381 129975 216151 179133 66323 100219 173001 -35738 -220065
16419 -220065 -186901 -151966 -19781 -77462 -117818 -60628 -21673 -5166 -98733 -256839 -159866
16408 -159866 -79179 -48854 -39193 -58599 -64915 -15464 -5513 -88609 -198728 -221121 12275 185976
16396 185976 74670 114065 61632 -29334 -35416 -147297 -128444 -70624 -133727 -114507 -100405
16385 -100405 -187063 -292254 -248967 -304676 -274353 -120571 38075 56214 22866 -6540 -131946
16374 -131946 -286047 -209136 -208284 -276221 -186039 -64781 -67280 -4763 136240 187850 101226
16363 101226 4445 -15757 24578 41981 9108 -42036 -132386 -80748 -247692 -225816 -63691
16352 -63691 26708 -70951 -83993 -133732 -323443 -255878 -161948 -132494 -116476 2941 2368 -172865
16340 -172865 -220944 -97426 -78904 -92274 -151773 -144855 81343 152765 42936 51330 7940
16329 7940 -83299 -38834 127970 225900 139541 -101208 -157572 -148233 -119822 -159761 -112711 -30781
16317 -30781 45827 4506 48730 -43261 -58210 -10101 -19248 7120 138909 123494 83533 154236
16305 154236 255275 294797 209241 46572 -23252 117681 186958 153071 47845 -39405 -50965
16294 -50965 -178890 -236631 -127372 40084 117884 233620 99106 166688 267064 308659
16284 308659 253694 130421 -112496 -61863 -29687 25492 -67099 -124977 56046 27958 -165870
16273 -165870 -187113 -159092 -123868 -35791 45755 47587 -3879 -141004 -93834 -8496 22298
16262 22298 28234 139287 182698 191470 250841 191451 165066 153529 146724 147063 63646 27894
16250 27894 -19783 -32144 41420 80882 109655 -18295 52294 26976 -71278 19926 41066
16239 41066 -9078 -57033 99799 121414 -155886 -244617 -252336 -201874 -105795 -81406 -170630
16228 -170630 -220865 -125947 -59719 -42693 34245 -24397 -76832 -50955 63374 48581 -145729
16217 -145729 -340531 -356153 -220547 -103189 -48731 17358 12040 75829 -41532 -199656 -156390
16206 -156390 -59569 -74798 -41629 -22054 63088 163947 202029 139688 78750 30305 -22797
16195 -22797 -5880 -54557 -29212 -3503 -137865 -197348 14024 -41050 -134168 -27106 33101
16184 33101 115829 82014 98263 187248 78415 -18956 39007 192117 99996 -15876 2758
16173 2758 50015 83598 122445 424 -80032 -2726 -17397 -24501 -44457 -55913 -45165 -81937
16161 -81937 -184872 -350107 -320908 -172281 -40341 107068 256573 147037 106038 -1078
16151 -1078 -10719 -3336 34272 16248 77556 41107 1912 -24997 109490 611 -134109 -102435
16139 -102435 -40564 -45971 -31940 133549 168200 71725 101426 174874 -82907 -118438 -137609
16128 -137609 -248113 -214388 -89677 198946 264163 172845 189666 141912 -17234 12086 -71069
16117 -71069 -132591 96774 130677 31176 -106034 -111437 -59977 4539 11801 -52032 37916 122908
16105 122908 145596 104287 228668 308173 120816 6943 -82443 -125331 -64812 -97243 -172826
16094 -172826 -212554 -280363 -145563 -262118 -195257 79308 170658 198882 97279 -4306
16084 -4306 -5337 118840 177116 54280 -83071 -69833 -95677 -154207 -238359 -8545 132135
16073 132135 145799 102718 8537 -64791 -160065 -156621 -5629 126841 187710 133554 76835
16062 76835 88759 44054 126528 186790 61602 35832 99607 103711 80476 11771 -78769 -44743
16050 -44743 -157737 -221944 -184627 -25968 -13375 -4366 21258 104283 137489 108654 -94146
16039 -94146 -95418 -138263 -100000 -16567 -69101 -201666 -186685 -188509 -155488 -133519 -208509 -189855
16027 -189855 -196404 -102423 -12511 123596 133521 133507 186623 273538 261090 205667 130985 88117
16015 88117 -12972 -60042 -79284 -113397 -69801 -72996 -46735 2484 138771 187468 82145
16004 82145 29848 -68843 -210604 -242732 -225774 -287785 -343724 -292479 -351225 -311611 -192324
15993 -192324 -103701 -80622 -135112 -65432 -95198 -145429 -13571 155358 178128 233831 206601
15982 206601 40379 -100778 -207550 -136762 -53048 122600 142222 179681 163509 35050
15972 35050 -116250 -93674 -54069 -56219 40345 4792 -135859 -120640 -179384 -197709 -164001
15961 -164001 -105598 1769 -43770 -32606 -44300 -8945 16989 -85019 -34785 199 30413
15950 30413 -11150 -91098 -67296 -59797 -43476 6681 -32916 -44675 -107335 -22175 -60585 -234611
15938 -234611 -331358 -297274 -253775 -174934 -7925 117422 253683 132499 101317 164102 140905
15927 140905 10929 -12202 -33108 66508 59119 -82774 -141677 -157628 -176282 -147177 -137072
15916 -137072 -176284 -164262 -119636 -220324 -431896 -334693 -178049 -167991 -124092 -63382 -157573
15905 -157573 -192080 -144980 -95983 -52357 -52818 -88650 -181030 -111909 -5991 -83693 -163946 -110074
15893 -110074 -50080 -120578 -80026 -151712 -107255 -49969 -89132 -90608 6939 35559 -48121 -63683
15881 -63683 -207972 -248060 -63745 -48995 -39643 -88331 -141982 -44293 -20999 -6615 -39790
15870 -39790 18233 107420 149583 98700 23804 19477 3237 60183 127209 189371 217275 135866
15858 135866 229617 435393 366558 162589 88331 -41458 -169440 -265443 -195134 11018
15848 11018 163730 173861 214562 238036 117369 53103 -28593 -22820 17643 -97077 -37515
15837 -37515 70070 126988 90678 -35008 -11325 122684 204584 228077 166182 164893 -73846
15826 -73846 -239793 -82889 21256 81333 118689 186387 93545 -60091 -20726 4198 6401
15815 6401 16070 -99676 -164418 -63158 -126534 -278628 -156447 -34536 -30137 20467 46564
15804 46564 5236 -55849 -68930 -45701 -24531 -11521 -98793 -159524 -239709 -241538 -132767 -59311
15792 -59311 -86839 -59776 -33836 16002 136147 82612 -17843 -99526 -128960 -38687 -151074
15781 -151074 -301835 -276072 -207534 -134506 -194507 -186674 -74968 6032 71409 28432 37934
15770 37934 86938 108948 25364 70772 96186 36476 442 -87888 -117460 -89810 -72836 51877
15758 51877 58487 -71617 -215376 -81324 -19948 15634 -12719 -30238 44046 58022 98789
15747 98789 75267 144749 128991 38372 -65304 -42500 28328 -73737 -50865 785 48666
15736 48666 -45144 -134242 -167720 -89894 -27889 -114082 -27340 117166 189701 228429 292661
15725 292661 256371 83043 -74016 -100014 -177622 -174395 -80113 -15142 48210 -59928 -77975
15714 -77975 13614 47454 82622 110385 184002 173961 53889 17617 40073 187226 2593
15703 2593 -101288 -121723 -12418 11000 53230 52244 104173 12486 -121375 -118803 -191765 -274678
15691 -274678 -327294 -340429 -244055 -80302 -102680 -74847 -91005 1517 -6294 47906 119165
15680 119165 144649 92791 -29253 -136087 -126931 -20909 81935 25643 -84506 -16759 -60746
15669 -60746 -45961 -92083 -240169 -337648 -108810 8041 -107906 -97818 -58067 29996 97602
15658 97602 -496 -156832 -141641 -499 101894 132205 41751 -59803 -50008 32324 193891
15647 193891 133789 15432 24613 31023 -5683 113748 233512 177645 125403 120307 85310
15636 85310 148802 155994 236588 227273 172245 100750 41267 52127 55846 -21257 -143402 -100336
15624 -100336 -226 22415 -57817 -86017 -38339 32674 168051 117928 49811 63229 69005
15613 69005 -29268 22446 120679 35369 43301 2177 45210 6629 -41206 2604 8174 23761
15601 23761 54321 55939 20548 13566 -40958 -67892 -45039 -58454 -124202 -118828 43025 146385
15589 146385 169536 192424 284987 272909 317094 393672 234730 125556 48122 34364 -73718
15578 -73718 -93782 -230323 -369279 -389624 -275373 -170199 -102970 89927 192164 90896
15568 90896 -95556 -100050 15530 2061 33852 219632 188393 116792 68733 23485 -27870
15557 -27870 -5822 -1000 9459 93318 172699 32043 -2067 21753 105408 262309 210195
15546 210195 174224 329387 347938 321262 168996 1760 29284 -130844 -215772 -189221 -71243
15535 -71243 -66457 -203036 -248919 -278057 -344586 -239380 -99294 -84623 -73437 -7342 -68602
15524 -68602 -108161 -198211 -38633 111870 123312 77068 -3761 -26061 -141919 -119731 -29791
15513 -29791 74875 120435 128696 59797 -63272 -130281 26100 189132 116628 163056 198595
15502 198595 198346 227170 198898 89949 56628 67505 38203 57528 24157 -72742 22787 111878
15490 111878 125490 86689 91748 105120 5025 -162860 -236146 -166807 9325 84430 124386
15479 124386 206335 264573 282047 281774 240002 81666 28814 -44356 -49169 38362 106544 147214
15467 147214 73626 -47807 -46331 -121606 -122740 -90015 -111152 -163061 -194257 -283222 -243571 -307732
15455 -307732 -347811 -199817 -157522 -69642 -38435 5009 -6052 -30478 -113915 -96382 15342
15444 15342 57257 73802 57581 -162809 -201861 -162387 -46895 88430 50419 142628 67026
15433 67026 -44958 -175722 -259079 -190183 8520 5122 -139080 -164193 -107677 -1431 -50628
15422 -50628 -105767 18288 10530 70357 7442 -56285 -130814 -118633 -45379 44862 119398 156567
15410 156567 97857 108360 122305 183508 98453 10174 -49738 -84978 -44674 -67176 -129449
15399 -129449 13741 129194 121927 40613 18396 68011 97955 67087 12258 67045 26261
15388 26261 47718 205575 124331 143045 202993 280125 357278 333330 198180 -24306 3817
15377 3817 -34818 23591 54525 22058 64233 31761 -5149 -16160 61172 13888 85149 108336
15365 108336 134900 82037 -178668 -140962 -25425 35796 100864 202972 180114 121399 92314
15354 92314 59205 120968 38321 -166764 -190499 -53281 64347 70916 73997 -62922 -49207
15343 -49207 -39828 -104649 -188285 -185289 -99512 44905 88989 -8612 -176842 -265728 -222273 -196365
15331 -196365 -149834 -84064 15024 107272 13163 -17022 -152720 -63225 1439 24047 81621
15320 81621 -10589 -39522 -81285 -152489 -68448 -15405 -30726 -130788 -74623 -48405 -10963
15309 -10963 -61977 -44441 -49076 -108977 -23056 22309 21212 57902 -11744 -76965 51679 95141
15297 95141 134390 94961 31383 114361 79074 65947 44602 100669 217841 172695 85354
15286 85354 90547 121024 9320 -81036 -43716 -68667 -215864 -250414 -352809 -211502 11700
15275 11700 -41979 -53401 56141 -34197 -34023 -39855 -151590 -105307 -69735 -111767 -230753 -165904
15263 -165904 -188225 -152780 -5300 -99272 -40704 -2628 -18196 -109136 -196620 -269311 -233649
15252 -233649 -105009 162902 206945 120429 5163 -80249 -115634 -103785 -45909 -22506 -53726
15241 -53726 -86718 60998 59956 91270 170909 27743 -22244 22257 106077 92350 109374
15230 109374 200870 196549 263286 137220 70258 71286 162199 255131 164608 82345 94935 181413
15218 181413 85123 -1776 -93679 -102526 -37807 -34896 -117777 20359 61347 154583 90297 98630
15206 98630 87125 18764 83737 223311 362831 355963 385027 252972 131844 24843 -38568
15195 -38568 63874 92102 32963 -25271 -54130 -42316 43732 44431 69497 29732 -49692 -43383
15183 -43383 81636 288019 154486 -57913 58173 136987 155902 147368 84152 -4725 -113390
15172 -113390 88955 50311 34762 144580 229503 245831 146045 -58822 -140267 -145144 -215049
15161 -215049 -174260 -47596 6441 140342 160695 36982 -143612 -64868 29067 -30929 -81315
15150 -81315 70051 112990 -35356 6297 109926 136775 135340 104211 6929 13124 83052
15139 83052 -18647 -10438 103898 -9217 -103446 -4105 67661 135401 49682 -146113 -207892
15128 -207892 -153 -45976 -295983 -213915 -115943 -203438 -77985 -23375 -91862 -79777 -100340
15117 -100340 -67695 -49427 -128675 -193707 -164988 -103756 -36248 4205 -78478 -159896 -145288
15106 -145288 -59170 -91347 -141766 -39193 151565 188946 17422 37663 25228 30523 81231
15095 81231 70687 196698 151389 123488 130891 18110 106622 54223 -136698 -130325 40144
15084 40144 128264 187062 97606 96703 209769 207867 155775 35516 -174882 -256557 -76583
15073 -76583 -14233 -54155 -16896 26146 65787 -15635 -47352 -104409 -91320 -43480 -108924 -118779
15061 -118779 -11570 44478 -7819 -21979 161712 292148 364461 408769 376697 176098 99715
15050 99715 53046 15675 -15427 43617 93541 72217 5643 -8091 -24141 -54068 -135022 -131103
15038 -131103 -137456 -183066 -131451 -180563 -334106 -328529 -194206 -166578 -101646 27188 113826
15027 113826 -79786 -125769 -12642 -118042 -139214 -104676 -16277 17336 107390 193296 37906
15016 37906 -189887 -133297 -5772 35108 76705 181702 147412 8997 17199 89757 86592
15005 86592 -15594 -97219 -178673 -50850 10213 -703 97458 44788 -50002 -130029 -105264
14994 -105264 -79120 -67591 -100765 -117 9103 -7443 119977 -20184 -185600 -161191 -135433
14983 -135433 59210 184502 142629 651 -43292 -19436 -17508 38144 -28876 -58465 81391
14972 81391 145567 -45518 -119402 -49937 42040 87356 72523 264122 196790 -15469 80514
14961 80514 353961 442203 304666 204123 88302 76272 75002 115345 110124 131714 13260
14950 13260 73105 159440 111022 81019 96986 -14359 -11796 125329 98729 49916 -22061
14939 -22061 -19792 -243921 -287162 -241857 -221125 -198011 -121118 -149636 -82280 -21 79219 104899
14927 104899 90637 142659 40736 -53128 -12054 -18140 -41474 16387 144145 74649 50180
14916 50180 -16867 87288 61559 -17842 -21437 -18682 -61922 -115772 -67980 -102337 3658 14467
14904 14467 30887 22373 114052 160623 67472 39258 -82310 -181989 -322886 -209670 -84273
14893 -84273 -163973 -186009 -91617 5521 43469 -21624 -148829 -230046 -92815 -1501 -58686
14882 -58686 -90362 -215958 -377213 -220923 -86499 -78820 -202598 -160460 7515 35018 3155
14871 3155 71110 78837 231382 91938 -111023 -121257 -88203 -63967 -80855 -107205 -85109
14860 -85109 -147046 -138194 -134390 -337259 -337463 -165449 -239558 -102425 -30853 1639 -750 -80162
14848 -80162 -39534 79819 124214 129247 4109 -87728 -49725 -183895 -109851 61024 58438
14837 58438 41336 88317 137698 63067 92203 174870 89792 -41121 702 -18347 -137125
14826 -137125 -143758 -140908 17815 5095 3368 130455 54761 -122812 -116583 7550 79076
14815 79076 28158 75297 131078 59006 40332 -16144 13562 21451 -116384 -168550 -168767 -197048
14803 -197048 -81221 -110608 -152498 -162070 -237873 -216604 -98727 22970 84841 4311 -38876
14792 -38876 -1532 -51409 -202858 -178623 -120977 -165307 -170383 -211708 -208100 -123124 -28947 61625
14780 61625 141809 236922 268347 144603 48951 -71263 -42990 46038 98514 63676 52852
14769 52852 -33890 -44236 30375 -2807 -26199 69552 179522 242582 145438 -41346 -168328
14758 -168328 -195710 -95256 -113337 -100549 -108360 -105729 -65697 -73360 -99318 24222 154490
14747 154490 -41162 -111174 -135079 -2473 98729 10801 -123841 -107119 9581 -23281
14737 -23281 -11291 71290 -69392 -111309 -155634 -165644 -229125 -174924 -232336 -72562 -19518
14726 -19518 -25156 -16381 52004 50342 104531 47120 44528 141331 209245 92739 85136 80429 29574
14713 29574 64464 57135 -14384 -126776 -133829 -95886 -154901 -74315 -28814 -87738 -39192 -78661
14701 -78661 -177390 -61935 -118795 -186099 -251531 -254470 -234108 -153155 -28033 42369 114591
14690 114591 147600 77244 3971 -51699 85936 213884 219136 159394 83977 -74177 -93668
14679 -93668 38443 150661 12973 -15337 92482 136874 -35521 30040 127660 216175 316240
14668 316240 163915 119524 175283 156275 141665 64315 64039 -75037 -62909 -39285 -14330
14657 -14330 77752 118311 182866 154540 173654 138220 48732 38176 203513 248750 122431
14646 122431 137800 254458 305231 151445 58014 -27408 -4292 72301 89194 73599 131176
14635 131176 67263 -227112 -411990 -331145 -120956 -53509 -69695 -51457 -40859 -90150 -130302
14624 -130302 -275228 -295782 -185015 -141541 -152380 -149624 -134563 12443 -57055 -135160 -143893
14613 -143893 -103514 48414 130835 87353 30041 185511 139627 2859 128819 261354
14603 261354 256661 253344 154729 40036 -39888 -103263 -174534 -210415 -180573 -158691 -178880 -208151
14591 -208151 -80606 64794 -55317 -195704 -127827 -111363 851 57445 132258 78425
14581 78425 26380 122968 76288 91551 -14332 -131882 -267491 -200484 -115305 -52217 -111143
14570 -111143 -97700 -86447 -74199 9293 71349 12787 22083 -127356 -90220 -80721 -21282 53534
14558 53534 28281 -48192 -52966 45955 -36840 -93464 49288 -60707 -54064 -1923 35088 116649
14546 116649 59795 36375 -27204 -98482 -15840 32107 110251 130717 49543 36658 -6390
14535 -6390 -27645 -66893 -4992 -94162 -45654 -81191 -200143 -32844 105843 99671 -11966
14524 -11966 -26864 -88673 -96786 -33343 -43162 -5778 -19301 -15204 -103154 -131904 -59390 23981
14512 23981 49771 3244 104929 21472 10538 106378 105533 65379 11673 -28218 -11552 14376
14500 14376 51936 32624 -8025 -89627 -130288 -154143 22942 143259 104731 75282 119563
14489 119563 90975 128776 290723 180518 53864 -60716 33193 87118 83544 29321 -132699
14478 -132699 -16336 82561 91312 39559 -15744 -34563 -101347 -96687 -64563 -27611 -32534 -132260
14466 -132260 -66998 -1330 55483 -66216 -50666 -69512 -98715 24114 -22566 -74407 -54328
14455 -54328 -24858 -161323 -18700 117013 194782 136639 149163 84027 928 -124416 -35937
14444 -35937 103259 202306 151200 163539 191168 207028 103499 -57679 -43502 73780 131804
14433 131804 101585 38597 -16857 -105956 -118267 61496 109574 91923 165704 18389 -218566
14422 -218566 -227875 -215191 -121688 -157482 -252883 -208596 -762 7606 19947 100995 -34694
14411 -34694 -157046 -258478 -230153 -123223 -62973 -2018 -57481 -105572 -231124 -155737 -90572
14400 -90572 -260823 -345436 -169581 341 25234 170502 178517 146795 137508 161331 226454
14389 226454 143952 -32272 -111188 -81364 579 -26346 -55658 91630 127400 137561 160047
14378 160047 273773 195087 21184 23366 205837 204846 163806 25468 -79066 -195187 -257670
14367 -257670 -234244 -254362 -363174 -314364 -230055 -170835 -63362 18735 26182 48656 74461
14356 74461 39218 -3456 72589 153413 -21103 -49252 11205 -81848 -211401 -75912 86007
14345 86007 115939 95858 98039 87753 608 -175661 -123366 33615 60342 13432 -19097
14334 -19097 42161 26937 51003 -43078 -190137 -167798 -36288 62305 83643 213416 222909
14323 222909 200569 162230 -37251 -83695 -130607 -110624 -89558 -276374 -252328 -122009 -31267
14312 -31267 -78791 -145028 -204042 -148033 -104793 10233 49196 79890 44596 -80014 -294936
14301 -294936 -294656 -78682 75127 33853 -20845 -117384 -8080 119576 -67469 -116532 -154777
14290 -154777 -238218 -359311 -326223 -215955 -26664 159109 152611 237952 147117 22526 30675
14279 30675 21071 -96521 -101246 -138614 -87841 62188 34247 -99005 -115187 -50083 49052
14268 49052 281284 370867 288759 164197 64301 16143 -82572 -150128 -67644 -53672 -203253
14257 -203253 -177198 24454 111408 183249 247022 75491 63574 146907 112923 19465 144535
14246 144535 275007 250226 106114 53606 205664 211855 187920 114168 -1363 -167641 -166508
14235 -166508 -24445 43325 -26277 -63564 -95686 18024 66531 -9418 59361 140094 220101
14224 220101 109324 -2390 -80569 -33358 65146 61565 50299 114723 54195 -52416 -218776
14213 -218776 -188351 -125185 40801 123468 195009 90277 8710 27916 -99432 -43211 13824
14202 13824 120792 192753 212456 169736 179958 235892 332127 196504 -56113 -140083 -62321
14191 -62321 72863 192535 119332 96689 -79226 -200826 -105114 -143048 -254591 -130356
14181 -130356 -9819 9640 48351 -69375 -92487 -3165 71992 61089 111605 32636 -32499
14170 -32499 -132700 -149031 -92321 58173 80226 91119 83844 -13683 -180758 -134937 -13459
14159 -13459 109958 211267 274286 85498 -13038 56132 137385 179245 242288 218261 103836
14148 103836 74536 142011 165893 144772 139362 152066 44665 -60647 -106186 -59855 -105406
14137 -105406 -230807 -284755 -231017 -80594 49015 32115 -22212 -66028 68827 11158 -173074
14126 -173074 -49259 127948 82817 -95910 -193607 -210527 -194272 -126190 -10376 -1706 -73910
14115 -73910 -65169 -68105 -54022 -65391 -24221 -81098 -213148 -190120 -197586 -135477 -29528 -75892
14103 -75892 -58849 -59139 -30913 -49204 19589 10709 -80236 -50680 2901 -82622 -236724 -281849
14091 -281849 -368196 -259751 -113213 5988 -105256 -108777 -132812 -73241 105252 134433 -17771
14080 -17771 -53211 -75069 -77660 89108 110700 -966 38398 52198 147610 219017 101883
14069 101883 127158 99763 -98511 -85368 -59232 -40304 -69560 -106237 -80610 27446 -62546
14058 -62546 -178954 -184896 -30123 4445 -73990 7291 98258 49358 -48425 -60160 -55887 2114
14046 2114 35937 3940 44695 35382 -70268 -45985 13276 -67940 -221041 -268798 -194055 -111652
14034 -111652 -98787 -59614 -28616 -29795 -55331 -159918 -230255 -226636 -115162 -65116 -99084
14023 -99084 -108963 -156923 -149175 -141019 -77881 -53995 -85252 -137943 -109164 -164209 -171090 -176561 -206541
14010 -206541 -72993 60034 5398 -57309 -112326 -190215 -117682 -26187 -54205 -105965 -211464
13999 -211464 -195343 -144560 -113996 -118679 -135440 -21557 20983 -13849 -53592 -168063 -119583
13988 -119583 -105666 -149769 -39693 8489 15824 -25601 -21136 -30307 -101502 -169223 -72737 -130037
13976 -130037 -228943 -81888 36055 7195 -8330 62868 -80310 -115287 -2756 120221
13966 120221 102175 6939 -215627 -306505 -308328 -326893 -220489 -112379 -132728 -113660 61125
13955 61125 58595 8290 -90275 -176387 -196323 -102923 25096 22300 4560 30042 -54688 -92610
13943 -92610 -42192 21023 67740 24060 20588 77700 189487 209078 107422 90840 96770 53324
13931 53324 130431 220895 269986 278704 160337 -82617 -121167 -51247 -138740 -168735 -91788
13920 -91788 -63919 86456 87520 -70318 11028 -19140 103380 108801 -4297 -186845 -154745
13909 -154745 -182798 -188500 -44506 20047 -65627 -166506 -161117 -191615 -212612 -313083 -315896
13898 -315896 -94283 92276 106472 -45673 -23180 -35301 -15137 24546 22150 108308 -10262
13887 -10262 -113821 -264036 -81281 8228 -21820 76662 86736 35739 -26071 -180997 -250372
13876 -250372 -59167 76675 14998 -49821 -107498 -182596 -51596 -41899 -191361 -236402 -80967
13865 -80967 -10034 -19137 -38058 -25745 12688 30590 28241 -26270 -107004 138588 292110 274041
13853 274041 234875 274040 154516 65211 24208 65167 62153 153895 83380 -32406 -27222
13842 -27222 6508 -45010 -23425 -49366 -59334 -13373 -44881 2439 -30302 -116759 -147828 -160647
13830 -160647 -241330 -146845 -85128 -100912 -48044 -72518 -82741 -197032 -104598 32055 126517
13819 126517 115033 4781 131524 54832 -13482 -389 -27517 5061 1469 22855 102638
13808 102638 144022 154204 122261 -37579 -212875 -191026 -218993 -268618 -131350 51615 133453
13797 133453 86351 -85279 -222211 -247248 -222444 -181771 -107769 -146066 -137805 -92132 -118403
13786 -118403 -165728 -278286 -216242 -172296 -164248 -128384 -148857 -74688 88852 75715 31725
13775 31725 23502 96682 34974 -34324 -52284 86177 -269 -2747 38199 44241 81153 175238
13763 175238 154112 10162 -51044 -43896 -74850 -28129 23422 86305 241324 151308 -24660
13752 -24660 -64464 15191 110189 90986 -15830 -81896 -127772 -272223 -191601 -75518 -47608
13741 -47608 -68585 -61117 -55862 -14949 34108 -4375 -33339 37579 174022 112423 79019 107302
13729 107302 54488 90288 102851 -7224 -117847 -157443 -108656 -179438 -208314 -176870 -30711
13718 -30711 -32207 -33749 -37155 -207152 -238869 -134180 -20561 152700 173160 38370 81621
13707 81621 44749 -11208 -109805 -63086 22836 111334 182457 120464 40703 -119855 -264421
13696 -264421 -224540 -124290 34838 73026 96023 103550 -33564 -12065 59055 12705 -41498
13685 -41498 1841 6830 -22137 55937 93166 88913 41965 -53379 -123052 -125628 23495 59852
13673 59852 -79361 -208039 -153050 96704 91933 665 -58840 -115569 -89951 -88156 -74712
13662 -74712 49340 162928 61496 30385 105106 8915 -32049 -11032 -95777 -85564 -13938
13651 -13938 -30142 -126838 -224390 -163727 -108922 -26154 -24464 -47403 39665 27124 110444 105677
13639 105677 94491 -34299 -39128 48085 108665 94805 68587 149138 64949 -23382 -38599
13628 -38599 4278 43171 93602 95218 71626 -50381 -65511 -66696 94827 117624 101276 144023
13616 144023 198858 56577 -13244 -91507 -15038 -12327 -113747 -111170 20400 -8048 -50202
13605 -50202 -63790 33201 156627 184943 4424 -26715 81466 11402 -72515 -63544 -27856
13594 -27856 85822 192912 134851 82945 -26422 -50877 61339 36183 15526 -41242 -28248
13583 -28248 -33781 50454 108038 75939 -45795 -113416 20840 184767 72015 -29422 -52727
13572 -52727 -116801 -59034 68149 161932 200387 129899 77009 -40784 23909 57923 -27311
13561 -27311 -69686 -45682 158421 154796 38357 31935 -33171 -88327 74824 94979 32328
13550 32328 2046 -61475 35402 56536 -49357 -133413 -130661 -100745 -150715 -221424 -61692
13539 -61692 93510 211105 145920 104919 105475 39051 -5571 -1783 -48401 -127212 -195157 -212615
13527 -212615 -149681 -41118 22257 45349 -63982 -202136 -7603 -4906 70735 135148 77491
13516 77491 17849 130402 120869 -40550 -191351 -173295 -236578 -216536 -193763 -296297 -291887
13505 -291887 -281838 -276141 -118816 -48435 -111362 -34794 -55811 -100733 -108693 -98554 -47038 -21252
13493 -21252 -3866 25152 69254 70840 24548 8564 66010 221314 337521 324659 298028
13482 298028 204410 82861 147555 233221 347875 259417 145725 49272 25195 36472 52586
13471 52586 118074 206875 207571 221701 303471 256807 109092 26768 12682 34841 47114 47147
13459 47147 132458 42393 52108 83993 47109 -4472 -97150 -82993 -3307 -9341 -73452 20172
13447 20172 33290 -1934 80379 24339 -139082 -92860 -124441 -138034 35598 56669 24164
13436 24164 35096 200581 224425 211873 117376 42328 -2717 40041 -40588 -156525 -73174
13425 -73174 128267 316441 244171 148951 102037 53904 -130073 -63129 87664 -43856 -167959
13414 -167959 -68906 20410 148035 148431 72170 199334 213514 178096 202551 174463 199066
13403 199066 171831 248987 194661 189906 186866 191885 103520 -55131 30944 36966 -36495 21389
13391 21389 -61051 -136278 -128415 -136344 -49482 -9447 -56467 -149175 -159889 -233331 -179573 -151197
13379 -151197 -71631 154393 166108 102528 96609 163705 197269 232000 307998 203216 135669
13368 135669 108876 67730 88768 19176 56755 124751 87160 -92439 -35996 656 -124370
13357 -124370 -26639 180045 168930 43299 -143808 -54665 -15047 55450 76947 -1586 19295
13346 19295 116607 75400 21880 -31224 62611 29061 -11367 14736 171990 130444 134291 114619
13334 114619 137913 70252 112777 73961 -149377 -194128 -144575 -213591 -196179 -138034 -120059
13323 -120059 -231636 -59535 -18159 -175081 -198719 -108146 27406 45848 -35352 -105452 -193119
13312 -193119 -150516 -251612 -221827 40279 159778 266952 355667 137156 -1545 -113130
13302 -113130 -86079 -34084 -179559 -157412 8950 141793 126454 -98407 -65553 -2675 32858
13291 32858 -55929 -87292 13395 87639 41752 -64764 -62307 94395 141080 -60937 -130486
13280 -130486 -103698 -70306 12678 72546 -22312 -47332 21703 87983 79534 120043 171895 120146
13268 120146 84734 34157 -73942 -83555 -28955 -10431 -67430 -99091 -158378 -190146 -69581
13257 -69581 1529 13784 26103 71547 -5076 -233061 -251531 -53732 61321 201948 207897
13246 207897 162099 236379 246784 170453 110141 33921 5313 -31534 -47477 1065 133325
13235 133325 229977 153675 123989 6124 -4962 19651 10012 15425 146384 223250 231629 149093
13223 149093 51096 111497 50799 -37251 -36367 -11570 13149 -41857 -35281 88095 153814 63495
13211 63495 93148 217183 152862 167294 77593 -39667 7573 143092 271924 186323 -40624
13200 -40624 -241543 -280262 -228762 -221330 -38669 62055 -43236 -117528 -77285 39877 20804
13189 20804 51255 -50752 -128601 -43949 83580 142412 122353 72749 45470 233099 249986
13178 249986 55797 -127473 -106139 -73397 -72449 -50668 31118 223672 180881 102586 50317
13167 50317 -93647 -214563 -57916 32998 -57635 -79765 -65342 -60603 -48386 -132739 -62497
13156 -62497 9828 126622 187721 170382 278988 173465 -27887 -45632 -31681 -125708 -208942
13145 -208942 -115579 -42539 -5432 3891 -47506 -188364 -128475 8844 80324 -9914 -88972
13134 -88972 -27221 34468 94568 78884 -45093 -18310 94251 180740 48141 -95691 -54176
13123 -54176 -100130 -160471 -87444 -132819 -210412 -148719 -22155 -6489 -130397 -180197 -53487
13112 -53487 -57616 -194698 -204008 -141325 -30007 50967 66137 -23567 -19841 -143038 -133879 -1017
13100 -1017 72106 -90764 -142125 -103157 -28688 37955 95420 176201 174175 118904 166169 124102
13088 124102 224803 208775 239752 177581 5815 -83165 44548 189943 230496 166171 -18097
13077 -18097 -178696 -61929 103458 21357 -38855 169550 194146 201061 93698 81384 192616
13066 192616 206949 50192 11887 -6662 -4032 16972 19498 -100734 23287 53885 12710
13055 12710 -93121 -135870 -118682 -116313 -216899 -145748 -24133 48789 50958 5003 -9158
13044 -9158 -14169 -2161 -115792 -20995 36904 -54813 -36844 -43840 78773 127970 -22550 -117447
13032 -117447 -127263 -23153 118690 201066 224254 176887 17666 -58808 -61685 -32394 -88103
13021 -88103 -190665 -163093 -153241 -125802 26045 78034 -76348 -119650 -10921 21531 116755
13010 116755 11232 -70998 -215753 -281494 -213634 -124793 -137345 -104948 -68141 -39716 -108881
12999 -108881 -112138 -92945 -28465 -11698 49352 77189 -38202 -12392 -14280 92307 144331
12988 144331 -71539 -224231 -194184 6005 88480 35934 -120285 -182852 -78108 -79382 -38568
12977 -38568 -13095 -87305 -206707 -131647 -55666 68989 71700 47049 70599 -38940 -82873
12966 -82873 -81493 -8856 116994 6973 -88362 -130268 -200085 -176486 -104320 -183666 -130194
12955 -130194 -12543 13457 -34162 -80544 -19665 120928 265352 248028 69676 -112158
12945 -112158 -245385 -238012 -117042 -7416 -45104 -121321 -173982 -78966 -118116 -118249 -35822
12934 -35822 -37875 -43910 -51385 -119563 -94790 -78429 -14739 120879 165879 100631 105607 110926
12922 110926 17687 -91745 -61683 -34844 -87284 -157206 -116416 -15068 48120 -20129 -245775
12911 -245775 -273253 -105824 -137937 -103163 -32907 119463 125968 31343 -126841 -191697 -209971
12900 -209971 -77658 13978 115171 23221 -184791 -158197 -166375 -163813 -30902 -19224 -122454
12889 -122454 -3673 -72668 -112327 -187686 -105127 111441 194438 247691 209249 95942 -110028
12878 -110028 -291880 -240586 -73138 -9880 -29654 9150 24193 -74777 -43660 -94686 -249941
12867 -249941 -286368 -207812 -187396 -261449 -180024 -86557 -59345 39537 88279 157696 195497
12856 195497 221884 183652 93086 92402 178852 294949 214409 127480 168650 229382 170789 75925
12844 75925 57519 100251 126554 73449 -28013 -19898 138711 87884 89831 -7263 -155911
12833 -155911 -216156 -43990 35879 -34105 -110546 -136870 -95813 -66274 -120849 -85500 -39127
12822 -39127 -105735 -237738 -243077 -76289 -1738 113268 122591 29851 -90851 -176393 -249996
12811 -249996 -212547 -100729 4621 74140 160162 185228 86727 -69960 -122932 -145733 -133445
12800 -133445 91632 256584 349972 216684 68683 -67279 53776 183004 196353 173451
12790 173451 50116 50333 33246 81600 38440 26887 -984 143563 113449 80467 156063
12779 156063 101880 168605 146955 172165 89322 -19970 50835 29040 -57462 -83272 -35055
12768 -35055 177525 166965 169473 152702 162615 90742 121348 254591 288899 333123 393007 350329
12756 350329 211058 16185 -9872 30643 -24506 -52825 -64789 21473 56892 99339 190721
12745 190721 190929 149330 57553 61314 129296 105537 -56712 -229155 -125298 -75323 89916
12734 89916 68874 -4572 26757 28448 18928 -136421 -93632 -88093 -74686 55182 -83531 -97225
12722 -97225 -72398 -125361 -246658 -192261 -47925 35638 10205 -60608 -120759 -157900 -119000
12711 -119000 -108487 -107649 -37880 90953 96678 -80888 -266768 -228491 -161005 -218912 -266927
12700 -266927 -263872 -160941 -64152 9765 -31321 56519 47662 -146387 -298734 -319529 -298993
12689 -298993 -260955 -291516 -165809 -7967 19462 40728 38999 95517 -20918 -109929 165899
12678 165899 352063 222914 217521 319828 263208 70833 2860 1055 -2292 175185 318234
12667 318234 274871 182637 237346 142078 9286 -44732 46101 204830 196021 136381 80004
12656 80004 -47049 -52637 -47927 -1652 -62361 -67546 69278 9632 -55018 -67496 -74509 -118320
12644 -118320 -237986 -230912 -162791 -98622 -122385 -157695 -309599 -294493 -119827 143067 61260
12633 61260 -117353 -37585 -7697 -14346 -29236 -861 757 -37401 -92861 -98269 -128739 -195383
12621 -195383 -255643 -115265 -17992 -2070 13133 77347 124289 38427 55735 -46544 -113679
12610 -113679 -12962 -48840 -26400 -61409 -95175 113161 155701 31484 -38013 34197 25608
12599 25608 30765 75858 -57097 -322401 -349046 -384235 -321004 -222853 -352679 -262620 -91341
12588 -91341 -146724 -201225 -181099 -200104 -122808 -32246 104914 186327 155116 194854 167323
12577 167323 177454 182591 20759 -62011 -63430 -127613 -88738 -79053 9273 185988 129285 109133
12565 109133 -21617 -126084 -87343 18946 -114666 -198993 -68047 -56787 -61863 -98740 -170518
12554 -170518 -153816 -155743 -128684 21994 44802 -108128 -139611 -299642 -320006 -255542 -226636
12543 -226636 33024 -30244 1609 -19701 -135392 -176271 -54833 16696 -53891 -57747 1221
12532 1221 129693 133712 97037 19080 -30413 -110529 -183888 -67853 109465 17227 62176
12521 62176 250821 265392 145622 -47869 26656 125359 -23045 -98854 -3993 11339 -86713
12510 -86713 -140048 3065 88744 -8744 71590 -100604 -33879 17563 27538 47243 79118
12499 79118 89416 88480 51698 2995 -17031 -46974 -34444 -56660 -32214 -188841 -266414 -379512
12487 -379512 -388198 -316402 -147194 27635 -102455 -187591 -80930 162194 197050 84428
12477 84428 -67765 -162631 -185585 -116559 -102870 42399 77060 80979 18766 -152164 -221716
12466 -221716 -246643 -318799 -147726 55120 56529 173410 203843 110244 61008 154427 113664
12455 113664 53775 -88274 -35796 147607 217741 189527 194344 118653 -73859 -45461 33980
12444 33980 -68803 -164867 -115265 71 186433 316753 114234 -177561 -117063 50409
12434 50409 145503 197606 45908 -37840 13469 29927 66160 -8026 -25752 -70229 3971
12423 3971 10607 22854 34102 45911 65512 226081 223266 178288 19318 6495 155833 138646
12411 138646 42341 123543 151722 152483 154595 200569 140197 65243 31415 -142908 -253661 -151053
12399 -151053 15330 77869 162219 161817 -26884 -204169 -189303 30752 112688 -37516 -119773
12388 -119773 11133 14482 84177 165009 61964 -36201 -15996 -51690 -97212 -84535 -205573
12377 -205573 -195366 -239448 -157433 -77957 -40560 28785 -11654 -25503 -21791 -82749 -68397 -135740
12365 -135740 -200026 -35043 106602 161526 106879 70973 18952 26065 130515 95658 100077
12354 100077 240600 166397 -9674 -29341 -88732 -136634 -233067 -92381 156373 185279 51498
12343 51498 191991 156752 90713 64487 56724 96403 77137 130159 152094 72363 -31838
12332 -31838 41761 294913 286811 224874 148000 30750 49431 32521 -121291 -1263 114387
12321 114387 72381 -72977 -109245 -106018 68220 -23739 -70055 -150012 -204143 -277056 -223279
12310 -223279 -217077 -353152 -312063 -294642 -242040 -194025 -132889 -50172 45233 58899 34389
12299 34389 138841 103058 42823 62911 79348 144816 195902 61153 -18405 -116236 -126371
12288 -126371 -155056 -200276 -63903 -92892 -160750 -123197 58341 12949 33862 247934 244575
12277 244575 201891 249911 134399 181639 244380 203727 227739 358549 421435 391740 266736
12266 266736 293408 297901 252650 168508 239330 398640 290916 215224 73704 147835 238255
12255 238255 91571 -1557 -66740 38178 144375 120583 33171 11950 61505 47537 -18914
12244 -18914 -122832 -60138 -45041 -144973 19972 74658 -80752 -242745 -150812 -15760 47418
12233 47418 55276 31753 27231 82121 168391 203719 216138 248108 250859 322758 380555 453586
12221 453586 483664 370923 396518 259517 153030 188835 198576 290464 250541 270684 362565
12210 362565 240600 139938 187880 21870 -116467 -81799 53244 86762 104766 116446
12200 116446 231465 200527 -26874 6851 190299 172332 227526 204494 116794 116968 77643
12189 77643 4316 54906 79919 -24401 -105293 39383 50898 104207 203806 296100 447367
12178 447367 384100 346059 313899 262258 370937 368157 99304 84494 212210 155608 177258
12167 177258 313820 363076 312637 245862 210411 272581 303626 522261 578649 456957 327136
12156 327136 271349 300215 285030 352140 484600 532153 538040 579560 595363 514511 311392
12145 311392 205097 190103 214117 224616 91814 107003 123016 91252 77970 109947 108362
12134 108362 215607 179162 84913 -24989 -12802 85152 161309 157572 147644 115538 177147
12123 177147 165993 204779 155448 110137 194316 294158 198215 212880 302646 316913 255769
12112 255769 145628 221676 429317 502377 491589 354067 275555 229938 252736 276631 366511
12101 366511 400991 561869 600377 633310 521500 523269 494341 321703 215461 252341 301197
12090 301197 319341 465080 422741 415096 522378 680487 702677 585786 530171 462780 520076
12079 520076 511306 572422 606295 683796 709152 563141 458072 569637 737603 801762 696435
12068 696435 736658 693251 680302 656314 661573 675650 745631 712120 615687 608423 650899 697077
12056 697077 580857 516847 484154 645149 767993 776032 847271 916911 985146 923691 739008
12045 739008 633655 756974 819648 779910 820202 774742 862858 842060 744755 865354 971283
12034 971283 974367 934907 953314 1139495 1207904 1174476 1229773 1194091 1164285 947362 836502
12023 836502 967666 1122454 1209472 1289534 1293736 1202355 1231915 1279416 1301219 1272583 1285511
12012 1285511 1314105 1463524 1602398 1552045 1575547 1636787 1616101 1587122 1620264 1627191 1588093
12001 1588093 1584031 1661532 1737768 1688564 1765154 1830884 1882800 1959346 1924568 1914077 1955275
11990 1955275 2078813 2191439 2248337 2239944 2165189 2134970 2319933 2552918 2725551 2926450
11980 2926450 3097725 3203502 3244739 3170367 3276545 3330013 3453385 3641328 3761940 3884180
11970 3884180 3892123 4132367 4231892 4299296 4320277 4489842 4736063 4819743 5009604 5247407
11960 5247407 5494390 5721421 5967608 6265706 6574254 6783063 6900483 7178603 7540682
11951 7540682 7832388 8194879 8666620 9189050 9620884 10108163 10591067 11149777 11674237
11942 11674237 12332668 13102196 13826408 14505284 15350983 16299097 17193070 18110001 19428113
11933 19428113 20697051 21954377 23354595 24960074 26572659 28408053 30406109 32455882
11925 32455882 34448233 36706297 39131892 41565412 44182249 46891213 49449691 52031947
11917 52031947 54536254 56723479 58575383 60193081 61461806 62142887 62389374 62209331
11909 62209331 61307913 59856292 58290173 56532836 54351222 51990167 49544060 47008281
11901 47008281 44564199 42159511 39944908 37647005 35470562 33578409 31588062 29658311
11893 29658311 27820535 26205779 24719354 23160172 21805291 20692582 19658881 18748219
11885 18748219 17710524 16585405 15575467 14787172 14005220 13252687 12504988 11960646 11471000
11876 11471000 10937256 10512827 10108414 9666357 9331809 8913705 8512175 8141155 7767208
11867 7767208 7534899 7234098 6744989 6481784 6374036 6171323 6000434 5828984 5661387
11858 5661387 5442007 5217015 5051442 4969542 4822161 4680979 4533229 4391431 4199202 3998526
11848 3998526 4020114 3947787 3751146 3510623 3354816 3313857 3234561 3152517 2928081 2854263
11838 2854263 2891488 2875892 2785535 2641436 2591807 2585113 2584031 2516133 2427415 2385786 2408116
11827 2408116 2352097 2107493 2100943 2085322 1991658 1838538 1843615 1786806 1764812 1695417 1590856
11816 1590856 1533732 1522419 1563053 1596196 1504366 1295671 1256233 1290036 1304001 1290314 1266676
11805 1266676 1193751 1248342 1252333 1103295 1138569 1146905 1071756 1131894 1113008 1062292 939479
11794 939479 868892 1041067 1148137 1094447 1007835 1081085 1057952 1016585 948670 905553 818892
11783 818892 717110 851673 982877 1042405 1086082 1078509 964564 804179 785121 872053 733547
11772 733547 657345 640051 751063 735669 655837 579234 582777 550686 570508 695660 692386
11761 692386 561207 493759 454724 373836 489152 566168 548827 600334 513917 530976 469864
11750 469864 477238 453547 550649 640314 526266 435671 376899 412002 527595 437441 368735
11739 368735 412237 426125 374453 358883 326986 229468 242234 307781 429403 430986 475903
11728 475903 476224 446008 323491 338892 319824 274370 278257 429403 563381 506398 397935
11717 397935 493397 600458 558711 419921 286026 449219 491316 518324 421757 226592
11707 226592 142534 141410 248758 267610 216411 361778 602731 634187 622173 601237 540156
11696 540156 472313 382760 269838 344831 312364 167562 108881 238923 314749 152880 112725
11685 112725 200010 198134 256745 168928 146234 300161 435830 393613 263793 175415 83259
11674 83259 148068 254265 133092 261438 197101 124887 230276 450763 503061 354329
11664 354329 230213 136598 209800 251478 275932 211735 243406 225775 298210 208852 168398
11653 168398 160077 145398 196647 281085 196415 56185 62332 43063 -22389 129927 216211
11642 216211 195081 130966 56348 -2822 -79402 -91909 -139905 -15087 201144 219387 106864
11631 106864 81605 86208 68176 208718 214530 109529 180912 279675 201701 226141 206437
11620 206437 153008 132578 81682 71664 -96866 -119759 -19758 43973 182791 345541 395069
11609 395069 333368 286382 221685 143837 207512 184570 197407 80744 -31260 20440 126978
11598 126978 199756 207127 88871 22988 148390 249978 185876 139596 117927 42380 77725
11587 77725 191302 212900 160149 112924 129878 174049 194745 178777 119628 95922 43344
11576 43344 -614 53485 136543 -37519 -43245 143407 252913 278754 179090 61467 36284
11565 36284 39893 -82523 -173621 -93518 -37662 -9361 -41062 47443 197744 102367 -384
11554 -384 80550 143561 98412 126291 89192 -10016 31445 22747 -34886 -93920 -51805 69221
11542 69221 119811 50269 84426 36395 17609 57881 -37406 -37126 20206 -18892 53056 118391
11530 118391 126891 144532 30146 -1985 -29241 -3685 37674 197260 237401 300391 251897
11519 251897 31567 -170411 -59755 124583 153723 135687 104271 138870 154262 25584
11509 25584 -28278 -38421 -57315 43709 10696 -7397 -33694 13466 43367 51074 209476
11498 209476 326074 286161 177579 105249 113764 37339 -33620 -45053 -162932 -82556 19672
11487 19672 71345 107545 94217 -27926 -74043 83994 212145 194901 123626 31571 41927
11476 41927 75451 90984 84996 -33026 23476 10863 -11366 -24461 -108900 485 -11544
11465 -11544 -26989 97444 92221 -25816 -42012 -111305 -154900 -148185 -53228 -3297 -19318 -17822
11453 -17822 19783 -19328 38051 4442 -70572 -128225 -146615 -142823 -131155 -84103 14439 111447
11441 111447 170535 118085 88635 90509 79531 101888 51627 -57131 -31030 -17400 8164
11430 8164 -38498 -65477 -147486 -110609 -74072 -27738 52656 -8751 71672 149010 92237 160677
11418 160677 228242 274010 246010 212067 205444 179612 235738 173277 131912 133790 135079 174001
11406 174001 78832 39930 19104 14155 -107845 -12774 66706 167300 211545 153823 44595
11395 44595 -44678 -156651 -117005 -135459 -78794 81314 62394 42219 -28759 11226 48728
11384 48728 66377 91209 204142 214688 222216 223980 111271 58956 8362 -57625 -91705 -77884
11372 -77884 -101203 -133565 -179966 -154931 -57674 -127124 -29041 186055 129712 179269 124652
11361 124652 43958 125528 181594 95524 32245 -6104 -34777 -65720 -97023 -150914 -101862
11350 -101862 -7780 -49290 -49484 38301 25788 -47587 -54258 -75789 13894 157693 55494 7515
11338 7515 -38257 -125411 -98215 -58354 39447 -76795 -166159 -120597 -243198 -277534 -257421
11327 -257421 -131175 -147049 -210743 -132900 -123482 -163293 -70119 10118 -49952 1055 -86991
11316 -86991 -210634 -137412 -87134 -39991 -59734 -66467 -97146 -48335 34879 -37523 -166143
11305 -166143 -266893 -294037 -133143 50363 -85562 -238449 -252744 -163100 -66226 -216291
11295 -216291 -106636 5171 176199 233559 185646 187439 204850 41229 51651 27730 127165
11284 127165 209137 202319 223998 322136 262745 189031 163540 74049 27437 12696 -11453 -53448
11272 -53448 -41731 52472 250666 285576 258039 -730 -85615 -76865 3800 -106817 -27904
11261 -27904 143592 203989 81532 -8166 55069 121219 45952 42531 -53168 -114675 -149603
11250 -149603 -182421 -105623 -76646 -140370 -78635 -34834 -18141 140620 156734 87560 57728
11239 57728 -3707 24502 32133 18154 -49025 -53527 -119532 -215780 -221603 -197953 -181739 -134789
11227 -134789 -65813 -240258 -241946 -113497 -26877 13385 -100090 -246272 -257381 -183497 -207310
11216 -207310 -215014 -196319 -224152 -173769 23621 65737 48650 38617 -44397 -125492 -11945
11205 -11945 78532 10899 37860 139407 168459 116106 -90996 -54735 38254 -108849 -219746
11194 -219746 -190071 -149774 -68342 64210 127044 106129 109145 114572 121630 110800 97571 45175
11182 45175 21498 -106255 -203442 -176716 -66933 119440 196111 91555 36441 -45889 -42779
11171 -42779 -180808 -291884 -398515 -361654 -143256 -63820 -150691 -214891 -248000 -124418 7892
11160 7892 -44601 -47653 -54940 -249729 -250411 -126349 -101369 -55638 56390 101075 100748 40234
11148 40234 9061 -51119 -52250 58104 65275 -44214 -206205 -225189 -109615 -46777 150324
11137 150324 184561 230154 200077 172481 191073 190845 153924 207767 109060 117668 111435 27571
11125 27571 20340 17998 68460 11756 -110345 -93777 13494 17522 4780 -30956 -40159 -57319
11113 -57319 39444 172322 197198 119669 -43115 -69067 -8762 17159 22823 12284 -15901
11102 -15901 14341 65968 -47191 -84669 -140788 -205577 -93816 -74585 -16240 -33864 -88323
11091 -88323 -161675 -176357 -42484 9991 55075 24827 17078 9382 10239 -22616 -47652 -65097
11079 -65097 -138945 -187970 -158508 -186227 -147080 -50168 -151554 -233731 -125024 -56421 25582
11068 25582 60685 123008 196667 213248 109962 62108 -29976 -4419 27757 172011 157925
11057 157925 99855 138350 183035 269518 252275 246722 220031 59148 -24044 37087 233350
11046 233350 159692 19412 93194 227442 157206 212484 381191 403098 338672 389181 585866
11035 585866 594128 583297 503822 311581 248098 322437 434171 450327 581283 647475 755106
11024 755106 714336 596257 657673 574433 654212 607682 562011 707518 891342 986421 1068366
11013 1068366 1208213 1287440 1125064 1069560 1017256 889952 789548 738546 703373 793255
11003 793255 892111 960373 965252 917978 878561 858217 806289 712913 751553 685737 615464 582320
10991 582320 481963 347555 239568 346360 531808 534707 452544 233522 179930 190331
10981 190331 209732 154858 171975 145308 -63232 -69656 132653 35707 66957 60990 37137
10970 37137 -73297 -113106 -18919 176818 177725 118804 52630 -30228 -79932 -28521 -78059 -18459
10958 -18459 -9981 59801 154442 81631 2809 6483 68359 -16912 -76827 -12933 120953 53609
10946 53609 -67123 57971 -7585 -28636 -93578 -86953 60550 78166 38243 46951 18858
10935 18858 -18221 24981 46244 88820 35803 -23426 -127332 -116644 -82227 -47271 10616
10924 10616 41255 11087 -11226 -46021 28347 54441 50179 63721 39937 -87896 -108550 19451
10912 19451 97425 31961 -82416 -115310 -65109 -6180 70960 64682 103504 168839 89887 45247
10900 45247 11379 -63140 -98799 -6401 64428 16806 27372 -26710 -26473 11999 -48039 101817
10888 101817 201126 61288 -71048 -6898 -20214 -19201 56046 36463 -72129 -77115 -10973
10877 -10973 15563 70310 184289 221252 255416 252974 264765 213933 172692 -42665 -119415
10866 -119415 -155470 -102994 59954 235194 254559 200634 138058 107791 149547 34826 -42911
10855 -42911 -1725 25615 -19064 49278 -49031 -63636 48903 136199 131066 27699 37946
10844 37946 67250 149520 107726 217014 310020 194681 75439 49676 91501 83270 116345
10833 116345 130416 94657 161408 198410 128769 134249 70391 90215 106633 112930 135402 171553
10821 171553 240880 58848 -3882 -99983 832 192605 228143 93212 61718 42736 43299
10810 43299 -3150 -42726 34326 186291 327534 452887 448126 423654 503106 688258 941807
10799 941807 1000846 961964 907981 1015857 1171437 1226854 1190933 1163366 1088471 1046216 994782
10788 994782 1154568 1230589 1191017 1149866 1055634 891732 747861 680976 692960 783288 710403
10777 710403 620293 482669 412062 425221 452185 260656 188874 216182 90178 68709 43633
10766 43633 14388 57513 86089 123589 220380 369519 392294 459403 592362 405854 181419
10755 181419 84578 189622 198390 94290 78775 67783 37689 151304 252222 237623 377062
10744 377062 286457 91025 187834 113932 -44568 -98046 -209091 -200815 -88383 76425 132943
10733 132943 293235 276355 231898 127057 211753 376495 244535 245446 336933 300930 399755
10722 399755 386476 368249 318981 359685 281729 196455 173901 306397 342822 369532 405185
10711 405185 355807 243775 264431 308885 505200 535865 429276 460610 471733 442690 588950
10700 588950 792483 716244 633461 496076 453804 279844 251278 321605 264161 340755 392128
10689 392128 364098 270549 256692 373500 469360 289119 266614 231572 139537 231756 244755
10678 244755 230354 330744 328556 348120 451377 334221 153938 59806 157356 297103 490664
10667 490664 482955 328967 375666 538361 532298 444023 494531 619252 595140 611190 714908
10656 714908 749308 880252 650501 549513 756195 883461 895025 1017396 1061233 1245117
10646 1245117 1454407 1706890 1877137 2006923 2293123 2725773 2984499 2889891 2652755 2669016
10636 2669016 2608276 2532199 2681333 2930140 3169156 3341879 3429962 3741706 4085673 4585983
10626 4585983 5056179 5460245 5960876 6450867 6748351 7072558 7605374 8131590 8931071
10617 8931071 9743297 10992020 12850212 15177323 18314970 22630713 28352922 35849222
10609 35849222 45300534 55398325 64413077 70708947 73850842 74489292 73350939 72032407
10601 72032407 72418287 75938127 83503566 96224440 114033827 134027340 150564240 159245368
10593 159245368 160161900 154904135 145846488 136761473 131070610 131355078 139091896 154835511
10585 154835511 177577210 202036220 219602687 224959582 218545457 203380264 183232855
10578 183232855 162851873 146870232 137535758 135672203 140804549 151214311 162531848
10571 162531848 168698361 166370018 156466947 141462164 124089155 107303308 93722932
10564 93722932 84796713 80419856 79670589 81093858 82798947 82257867 78431505 71692345
10556 71692345 62991064 53495521 44162905 35989654 29660753 24963761 21422385 18514606
10548 18514606 16312256 14626050 13208375 12074503 10994865 10080549 9204178 8387562
10540 8387562 7690745 7148622 6716726 6381564 6056969 5677598 5416861 5079259 4822779
10531 4822779 4582651 4323743 4090418 3835772 3799467 3649248 3436121 3310039 3265030 3107623
10521 3107623 3018954 2871645 2686259 2527837 2380432 2344671 2277796 2128529 1967634 1969015
10511 1969015 1889772 1780022 1750234 1775565 1882361 1941083 1980987 1869410 1941594 1786780
10501 1786780 1607903 1445488 1457340 1374569 1339753 1448116 1468916 1385162 1402916 1419297 1507263
10490 1507263 1461730 1356955 1283389 1192278 1130287 1300062 1391391 1294950 1230132 1212039 1325371
10479 1325371 1357695 1449565 1394912 1502291 1551180 1538195 1558608 1561782 1576803 1612910 1481645
10468 1481645 1479867 1552604 1599827 1550868 1545853 1626557 1745524 1874697 1990421 2227626 2359419
10457 2359419 2277261 2458066 2562155 2590526 2593719 2591086 2558538 2656458 2750215 2752106 2866596
10446 2866596 2926624 2868662 2767445 2770348 2708548 2669903 2701059 2780204 2661449 2761939 2888857
10435 2888857 3063614 2984117 2812894 2845850 2816846 2756235 2694083 2800961 2874775 2893554 2926420
10424 2926420 2972172 2913349 2830027 3037821 3187778 3276918 3307511 3318959 3470763 3617602
10414 3617602 3819741 4092589 4200402 4277490 4468920 4736567 5063468 5497603 5625143 5796302
10404 5796302 6279080 6739940 7266737 8048930 8972164 9918230 10906292 11889379 13247581
10395 13247581 14820150 16599049 18731004 21188462 24091106 27334913 31198386 35795528
10387 35795528 41167040 47570358 55067643 63983164 74475915 86669235 100598755 116076045
10379 116076045 133287267 151990571 171811266 192177077 212050831 230808174 247509156
10372 247509156 261458496 271783203 277967022 279448985 276288045 268716199 257179074
10365 257179074 242300482 225075444 206199215 186518481 167063577 148418961 131103708
10358 131103708 115636611 101840537 89576452 78924556 69718714 61779418 54999482
10351 54999482 49029911 43984025 39530260 35829798 32503700 29665180 27189595 24917188
10343 24917188 22946315 21042603 19186702 17792386 16553533 15440489 14405100 13465304
10335 13465304 12507304 11616046 10880332 10091028 9519675 9211084 8788910 8346857 8150093
10326 8150093 7713481 7550696 7370804 7127131 7036862 6941606 6853617 6881991 6838433 6766248
10316 6766248 6812143 6819998 7047260 7428380 7681133 7986700 8300780 8831671 9347570 9890757
10306 9890757 10568421 11169767 11835534 12440678 13042404 13697324 14378627 14707981 15144312
10297 15144312 15449796 15531951 15514682 15248411 15128497 15035266 14896634 14528163 14185933 13976797
10287 13976797 13896769 13830960 13732670 13703638 13727491 13610319 13651254 13922774 14163431 14394307
10277 14394307 14587010 14636843 14542120 14336941 14015442 13499645 12920865 12505630 11951179 11376830
10267 11376830 10705201 9993533 9546788 9248550 8927718 8531216 8184379 7960204 7900484
10258 7900484 7967068 8087111 8172851 8433652 8612261 8615803 8873292 9353796 9883961 10226122
10248 10226122 10908742 11683723 12396416 13256351 14301425 15523492 16796701 18234417 19891204
10239 19891204 21966978 24430332 27404328 30876254 34785428 39182473 44427438 50593063
10231 50593063 57473355 65026787 73442878 82655067 92544242 103250815 114726544 126444220
10223 126444220 138433704 150686023 162956402 175009215 186829597 198050265 208373077
10216 208373077 217581039 225603599 232463629 238193206 242845475 246460774 249761095 253003602
10208 253003602 256257357 260048125 264288194 268503330 272742314 277026010 281438671 285752492
10200 285752492 290029067 294027878 297630683 300467871 302176646 302299705 300212692 295419645
10192 295419645 287820318 277549896 264969982 250513725 234934434 218592036 201871549
10185 201871549 185283349 168954714 153141336 138204035 124124025 111274355 99375491
10178 99375491 88555611 78966294 70378843 62912418 56529115 50972705 46287254 42320740
10170 42320740 38595262 35300619 32255002 29534440 27269434 25469757 23784031 22161287
10162 22161287 20728994 19592219 18605967 17646521 16752309 16043590 15287199 14635273 14123424
10153 14123424 13606268 13234560 12880781 12503112 12262838 12268619 12282816 12141966 12195276 12186220
10143 12186220 12166927 12026847 12093311 12284987 12578795 12748089 12831599 12924410 13116413 13262173
10133 13262173 13353468 13224229 13045361 12987296 12841655 12653843 12507568 12529365 12493286 12592963
10123 12592963 12711667 12976713 13372013 13573840 13821035 13881967 13769136 13733129 13739737 13718245
10113 13718245 13525410 13184280 12657950 11956735 11195172 10530810 9841756 9389379 8997186
10104 8997186 8451497 8001455 7475309 7022750 6568495 6116373 5899455 5754644 5610228
10095 5610228 5696387 5711581 5689326 5694937 5666720 5561901 5550493 5444449 5542540 5513793 5319692
10084 5319692 5270989 5402757 5421089 5290231 5246672 5393441 5594692 5889333 6126945 6205587
10074 6205587 6539415 6904350 7371735 7850866 8389930 8656021 8938800 9399247 9896903
10065 9896903 10376994 10746539 11209361 11667225 12092902 12812259 13443331 14060318 14677844
10056 14677844 15428784 16356713 17405561 18570246 19749736 21059489 22353560 23916748
10048 23916748 25639474 27414856 29237848 31060584 32911802 34756866 36493847 37976084
10040 37976084 39414691 40839592 42387344 43933351 45412933 46821226 48369483 50186784
10032 50186784 52179069 54343725 57026781 60310097 63701594 67288795 71162213 75003601
10024 75003601 78619304 81994582 84926284 87351532 89109264 90560979 91503809 91838883
10016 91838883 91872044 91857687 91724432 91579467 91662162 92109547 93079599 94581616 96434685
10007 96434685 98492386 100505455 102433756 104183667 105685645 106668429 106873647 106327232
9999 106327232 105151133 103350304 101222838 98736218 96175616 93802834 91436795 89223123
9991 89223123 87643687 86438409 85516042 84937135 84595862 84362524 83959000 83607505 82867003
9982 82867003 81567445 79860542 77745237 75258538 72422677 69338149 66213858 63087671
9974 63087671 60093547 57344706 54702376 52249756 49991470 48036782 46375217 44871588
9966 44871588 43437752 42044610 40702171 39314885 37864235 36181147 34562518 33044250
9958 33044250 31311073 29646496 27826430 26119677 24602870 23129523 21756583 20500071
9950 20500071 19410808 18394412 17323752 16318400 15421292 14521237 13884330 13182994 12420444
9941 12420444 11786616 11209385 10643778 9971452 9390089 8804046 8192425 7699357 7263955
9932 7263955 6768512 6223242 5699007 5195643 4946673 4727466 4484068 4144229 3910844 3690114
9922 3690114 3479392 3402579 3336052 3302022 3124347 2832727 2657148 2579568 2452339 2358162
9912 2358162 2332561 2343326 2442165 2492483 2320736 2118495 1999539 2053065 1981075 1829667 1843982
9901 1843982 2056721 2261442 2130282 2011714 2031744 2030667 1956732 2015854 2072264 2111295 2164212
9890 2164212 2305062 2461431 2744503 2882238 3135454 3433575 3670778 4078298 4645346 5306214
9880 5306214 5712640 6008047 6548757 6929722 7350312 7815720 8350354 8881917 9213259 9442187
9870 9442187 9618654 9705755 9628279 9664190 9602122 9476860 9457370 9355316 9302128 9276317 9138719
9859 9138719 9120477 9049280 8927235 8839452 8713221 8550235 8543259 8589511 8577647 8365836 8085092
9848 8085092 7778891 7376931 7164746 6807801 6324087 5920137 5527742 5053772 4725977 4449838
9838 4449838 4104557 3555605 3240394 3020933 2860268 2693880 2578049 2427479 2260123 2044726
9828 2044726 1768457 1627974 1565445 1431005 1400620 1307448 1245616 1247980 1270675 1284757 1237635
9817 1237635 1324447 1209498 1152138 1292377 1364606 1274943 1413566 1459145 1311801 1405978 1539224
9806 1539224 1525816 1581688 1772343 1839748 2003861 2221918 2219659 2277582 2354447 2283598 2172186
9795 2172186 2126596 2186702 2199556 2198564 2233896 2324961 2291240 2320734 2354689 2284977 2218602 2246152
9783 2246152 2246234 2242203 2300108 2336664 2421622 2592650 2471496 2310348 2216885 2163155 2003004
9772 2003004 1928486 1933466 1928728 1884183 1707336 1595603 1527667 1440515 1430916 1448107 1437750 1450720
9760 1450720 1413755 1289353 1183882 1018461 958800 966905 916537 930266 977116 919422 895536
9749 895536 885741 971580 901197 910124 836005 783773 792481 769657 740075 654289 644976 709072
9737 709072 711536 814218 835388 739413 670865 730944 694832 609809 545213 682001 709959
9726 709959 555603 515481 655275 693308 522025 512787 650433 642859 651092 651256 723165 839102
9714 839102 844742 833605 820611 799501 749537 747447 743387 583706 630030 723554 815857 823020
9702 823020 748570 812553 792131 814076 976065 970590 809502 687178 784818 997559 1033328
9691 1033328 984556 1028960 1056419 987772 922370 955025 987719 783112 667322 676875 780913
9680 780913 744113 691355 684212 523541 708362 865128 842852 723706 843119 860529 736516
9669 736516 644571 765696 750815 660631 625598 605337 592481 578933 670253 810144 853500
9658 853500 811581 792332 636254 576882 618351 621166 689346 691692 738121 612512 511820
9647 511820 635233 736528 763818 976808 1145525 1110896 1111033 1141366 1104682 1029387 864325
9636 864325 905383 956317 798473 726979 837669 940682 1057304 1043173 1061197 1024996 1001961
9625 1001961 1092743 1010087 941610 966959 913886 1076743 1101805 1185040 1301248 1328839 1360961
9614 1360961 1390324 1481510 1630136 1668710 1704092 1537589 1453863 1336500 1204296 1291853 1328471
9603 1328471 1207724 1196678 1286341 1518930 1662787 1685184 1689403 1637780 1396150 1407030 1665700
9592 1665700 1631885 1591829 1676924 1755887 1756079 1721388 1786772 1941995 1815394 1801164 1770455
9581 1770455 1751467 1704021 1815373 1774716 1607387 1588208 1555122 1594793 1604876 1832288 1998050
9570 1998050 2067508 2027328 2010260 1943679 1913190 1954101 1887917 1852941 1850814 1885577 1904990 1939576
9558 1939576 2020438 2017222 1979081 2068848 2256071 2212963 2174645 2321444 2427615 2506106 2571301
9547 2571301 2607500 2661161 2636744 2771743 2883214 2767880 2993448 3165615 3097089 2959717
9537 2959717 2873101 2934110 2976114 2992005 3022208 3060500 3000001 2964597 3045680 3177780 3160886
9526 3160886 3251162 3426403 3336648 3312791 3325242 3468139 3545458 3746937 3748642 3747417 3898537
9515 3898537 3880608 3768972 3926955 4114002 4171705 4191289 4187939 4164711 4342158 4438891 4650981
9504 4650981 4880352 5006769 5228683 5443229 5689808 5949352 6249388 6570563 6848216 7205502
9494 7205502 7656731 8090248 8647393 9312354 9999984 10759772 11611873 12783142 13992219
9485 13992219 15323767 16780770 18348467 20255731 22506268 25139662 28109903 31510934
9477 31510934 35675484 40654426 46422520 53188979 61070609 70476585 81610710 94928514
9469 94928514 110644565 129160629 150403818 174083142 199761090 226151223 252402969
9462 252402969 277194627 299157142 317189163 330712560 338880628 341773573 339769629
9455 339769629 333579286 324635803 314276014 303815580 294721620 287839885 283773111 282844833
9447 282844833 285102721 290291986 297699093 306527067 315614631 323720708 329409036 331790128
9439 331790128 330113406 323529533 312322660 296677760 277375751 255359054 231737032
9432 231737032 207769555 184308524 162415253 142545865 124850914 109481172 96369233
9425 96369233 85250524 75737337 67557215 60483948 54558080 49324269 44639389 40582731
9417 40582731 37040049 33861519 31039861 28672628 26572548 24677378 22939597 21461745
9409 21461745 20159100 19037080 17963235 17069693 16263746 15664953 15023385 14335501 13778396
9400 13778396 13348208 13025463 12698294 12528805 12372124 12206322 12206298 12186375 12386256 12790249
9390 12790249 13130948 13450351 13895387 14247422 14584729 14755499 14909323 15037331 14996143 14844348
9380 14844348 14664042 14333824 13995638 13552171 13299294 12928528 12737981 12536390 12429278
9371 12429278 12454640 12503901 12595863 12735662 12899600 12881557 12798785 12733241 12655284 12442695 12114113
9360 12114113 11735744 11271725 10733712 10225371 9637211 8966628 8375866 7932231 7633886
9351 7633886 7401519 7081777 6884448 6930060 7052729 7253190 7506897 7826112 8164213 8561855
9341 8561855 8901863 9223065 9549927 9798906 10017786 9979817 9828174 9710804 9736604 9745503
9331 9745503 9598450 9563028 9608838 9531137 9589451 9829884 10414022 11121526 11665114 12249611
9321 12249611 12809674 13309093 13549883 13707401 13733750 13613411 13423136 13034060 12457389 11779797
9311 11779797 11099447 10356285 9849696 9521639 9108662 8900996 8869176 8866110 8842210 8909135
9301 8909135 8941240 8955397 8921754 8798272 8751067 8637021 8289067 7913708 7523896 7276417
9291 7276417 7021201 6795376 6364085 5972824 5905857 5950890 5799368 5635831 5677640 5803522
9281 5803522 5967916 6028910 6186071 6437520 6695483 7028100 7466726 8104374 8857354 9599300
9271 9599300 10574486 11899938 13351401 14912032 16538264 18505322 20764766 23272289
9263 23272289 25912586 28416887 30991988 33733582 36391523 38799557 40801584 42350496
9255 42350496 43569274 44336997 44844841 45176932 45423187 45842871 46602755 47638235 49176308
9246 49176308 51202126 53772546 56953994 60507461 64249845 68003811 71891712 75795214
9238 75795214 79431844 82417683 84773286 86422185 87374431 87778596 87805974 87556952 87037231
9229 87037231 86359634 85402798 84350165 83198464 82149228 81396269 80908896 80780658 81042632
9220 81042632 81529998 82164276 82990190 83868958 85010989 86077458 87160261 88123237 88954477
9211 88954477 89666586 90095930 90081878 89064328 87217109 84751539 81659978 78228176 74735499
9202 74735499 71304776 67948904 64750704 61758613 59036753 56450441 54080183 52095252
9194 52095252 50519899 49390635 48475000 47757537 47003212 46145546 44963439 43508456 41656751
9185 41656751 39549053 37428319 35170832 32918831 30839580 28574406 26376430 24324883
9177 24324883 22290977 20124764 18149590 16385017 14676219 13394136 12339252 11307321
9169 11307321 10687897 10240208 9782428 9256080 8873839 8623234 8426451 8324820 8259522 8224064
9159 8224064 8153054 8359400 8532401 8630221 8798823 8970051 9226536 9521333 9928652 10326249
9149 10326249 10600981 10770547 10845340 10881757 10961000 10991520 10909641 10790123 10700360 10675040 10630002
9138 10630002 10660596 10930546 11270242 11753535 12197980 12756480 13308417 13819475 14311075 14747622
9128 14747622 14846784 14736343 14406932 14048661 13771995 13255007 12683855 12272951 11673925 10920142
9118 10920142 10316047 9879122 9425158 9151360 8971571 8795913 8720544 8676974 8706223 8635747
9108 8635747 8384172 8192542 7959667 7602623 7230626 6891475 6550220 6053675 5611879 5233063
9098 5233063 4733264 4396147 4090887 3787229 3514829 3311595 3034035 2743868 2499893 2289256
9088 2289256 2060109 2110913 2052790 1779515 1598513 1577495 1689137 1713866 1716279 1733764 1778362
9077 1778362 1868154 1917750 1904868 1674867 1622846 1630021 1613831 1591868 1539554 1659587 1767486
9066 1767486 1828549 1709854 1805364 1815153 1887315 1904522 1893354 1758088 1893197 2064878 2116923
9055 2116923 2084466 2083535 2152217 2163759 2287982 2553493 2614406 2650159 2812613 2850705 2782692
9044 2782692 2683296 2705516 2738171 2654264 2657822 2698605 2643775 2497982 2397975 2469850 2413433
9033 2413433 2430873 2453266 2519685 2587418 2545142 2463999 2473298 2420654 2246496 2093582 2074852
9022 2074852 2304921 2238650 2151159 1976816 1915508 1881206 1652385 1448077 1370161 1299949 1134426
9011 1134426 1138440 1125712 1022536 906724 857465 799605 774555 865632 895387 924391 871590
9000 871590 638287 430661 436595 545027 688847 887412 931632 891813 836002 735919 698865
8989 698865 675288 519307 562682 594417 488745 579440 505428 517471 473252 411541 472145
8978 472145 560935 530332 615646 653494 534297 405819 475220 520568 434766 595864 641566
8967 641566 576805 451592 382302 372044 378802 463927 411682 323706 452243 574592 549002
8956 549002 600031 611635 565189 564312 523254 580371 570433 538495 629682 630861 581341 504794
8944 504794 542032 371537 138625 216276 349538 534603 524211 408380 358617 467942
8934 467942 432084 422710 501193 573388 552849 451787 411545 392986 393602 306147 282192 458314
8922 458314 574413 565195 485009 511676 517291 403176 630626 699462 680265 608344 536669
8911 536669 576419 621794 606715 471100 368098 404197 385304 351258 411346 418310 268383
8900 268383 358480 460133 313075 295089 465521 580720 536424 401425 368991 352674 491902
8889 491902 388323 389202 491274 520668 352531 280856 247038 315185 367574 346504 337672 347147
8877 347147 369344 414432 384835 495380 536700 509625 527355 537073 461797 429972 362293 364067
8865 364067 424013 343938 226807 189822 382052 568838 586854 504493 606309 629858 506470
8854 506470 558653 575202 669788 669559 658169 704615 792462 880052 932920 803874 779191 851062
8842 851062 871058 1030396 1194128 1433228 1509771 1877180 2607408 3732654 5284478 6522217
8832 6522217 6866374 6554686 5920117 5083650 4058957 3210633 2594707 2215664 2061659
8823 2061659 1814292 1573978 1453085 1182334 1066917 1094603 1259649 1288449 1170799 994949
8813 994949 965137 921395 820963 741444 785374 711854 717350 852357 785286 725801 810896
8802 810896 761414 772629 688764 655669 606948 552417 681275 670732 534688 479747 520052
8791 520052 554936 471822 524862 567721 610784 639138 644531 469761 274511 214107 376842
8780 376842 412238 356937 327377 328744 345959 336101 353831 365742 322088 361426 324879 377374
8768 377374 243685 160849 180951 196969 439594 513038 521480 465748 391258 288077 243934
8757 243934 372822 414247 294885 259132 207669 135781 80532 133924 192627 125381 223534
8746 223534 181105 270119 295946 214203 195720 278683 360292 306939 223962 291375 321588 253287
8734 253287 277275 306833 294108 335018 348193 301514 356356 356591 427945 441499 470570 450187
8722 450187 405425 360499 426523 522253 457465 412093 340515 200282 340479 305092 333215
8711 333215 347553 362787 328644 433464 386283 327283 286627 298924 279426 204833 292386
8700 292386 411786 420640 522524 524523 541715 472522 311915 174669 66450 130698 64062
8689 64062 175043 320137 419753 423552 396605 325967 207697 197507 189663 164013 170465 245433
8677 245433 212283 306605 319617 305046 230800 307142 377746 332569 237730 247819 302375 334861
8665 334861 146632 105174 255578 273876 158749 43670 84582 68375 228274 108677
8655 108677 96558 181265 119775 72794 90466 -3874 91272 265533 51492 -105724 67938
8644 67938 51325 -41566 33885 81786 103344 164643 329494 375682 392967 328489 245989 209771
8632 209771 144050 214050 177149 44724 -2480 -61504 122726 25932 -64327 -26522 158347
8621 158347 216590 144933 96527 5819 36897 195953 472009 412274 305805 212824 163680
8610 163680 171713 183854 217450 201302 232947 215451 168966 227859 182788 2529 -38033 -16540
8598 -16540 -60994 -69467 115186 282950 318233 331288 243437 327660 361674 304165 322399 259079
8586 259079 118265 88369 17484 97562 -34705 -31243 72252 30026 -156 -28783 23206
8575 23206 118340 293111 320337 208545 198112 86390 1612 94044 187012 263807 197793
8564 197793 216660 236248 312300 311282 285983 300541 247162 226605 200433 221731 160399 68593
8552 68593 115042 78531 -46441 46377 131671 215192 258640 108200 23422 44530 60389
8541 60389 52311 33807 33210 9523 18202 10231 26265 163238 192641 128898 185475 90472 61774
8528 61774 -22590 -36947 104947 89443 23170 146566 409589 341217 165194 81983 111346
8517 111346 116769 192380 164792 168802 76539 123433 225012 170404 117918 113585 204607 194897
8505 194897 189850 210495 223543 292814 289003 190901 181885 257862 330500 265070 286074 306055
8493 306055 313230 142793 88777 138045 30677 85246 168267 128078 102149 217937 240964
8482 240964 130576 129787 70836 58564 172349 138962 -5760 -40726 -78663 95399 91101
8471 91101 50677 31056 1932 -13025 -41231 27848 213149 263275 280368 301736 202269 64577
8459 64577 -20131 -96108 -29112 -7638 13736 81546 191598 317642 300495 348365 316204
8448 316204 195612 283597 397659 338918 144285 83318 113286 133846 249252 188077 51483
8437 51483 76882 142215 258398 262958 342626 441396 439534 344418 256360 220798 361767 360334
8425 360334 332611 286249 112887 -10772 46438 234491 235148 112553 91108 284813 348052
8414 348052 184094 -12537 -30968 51892 88854 184217 174754 88123 -23436 102853 40674
8403 40674 -8243 -15343 36732 201940 292586 282474 181216 90297 -4524 -95993 -108407 -13258
8391 -13258 -1281 103354 108830 161425 192021 226875 270848 187632 68848 -57546 -102328
8380 -102328 -49755 -14687 -108028 -122376 -235931 -146407 -125203 -115918 -120369 -70632 5455 123226
8368 123226 130634 -37826 7232 -40924 -55856 83789 192309 224609 302200 407510 245366
8357 245366 68073 51077 162986 240597 170603 -148358 -275932 -75108 -53792 35478 -9391
8346 -9391 -57328 4897 88847 159693 125791 79833 121235 -6963 2582 59354 38947 61020
8334 61020 155225 132378 -111594 -128287 -38389 -26316 67344 37566 55606 36438 150559
8323 150559 179470 9600 -84512 -68168 -17778 67887 120627 21124 24169 157209 281591
8312 281591 283490 194586 261853 62109 395 -66287 -51057 -118364 -143933 41922 25930
8301 25930 -19680 138174 232968 133643 86133 45374 528 95664 89856 110554 23112 123456
8289 123456 333398 332198 186927 115205 178645 136015 100840 236512 168196 149616 269560
8278 269560 294076 175980 123349 141083 59453 30733 121490 179598 139021 192012 195407 11821
8266 11821 128557 222138 196174 310939 348259 359097 294304 73785 -84231 -104785 15983
8255 15983 90746 -20792 -52634 -30995 11284 64621 29332 33942 62961 2535 -15252 40096
8243 40096 78327 41862 42134 -12638 -32476 34148 75028 48478 107556 272961 254584 180994
8231 180994 74059 94404 81477 101214 122264 137541 160578 177831 167939 177166 264883 92855
8219 92855 63348 20858 -14015 7188 -19118 -95850 -70368 86619 224556 230076 244612 127337
8207 127337 139636 52418 31082 104399 73308 -106533 -228462 -140892 25975 171347 140973
8196 140973 124034 138753 70625 78438 236886 212475 127206 207162 226417 87883 -20284
8185 -20284 -37840 9546 46267 51444 -19016 -67193 -123137 -90666 79779 124898 187606 300876
8173 300876 92368 110984 218147 302716 225733 44240 -48741 -6957 153805 203956 190224
8162 190224 127379 59450 103854 109759 176385 127007 31122 23385 44548 80910 -25295 -168608
8150 -168608 -132483 -159123 -129778 -96110 19170 148152 99700 60259 149772 172381 150481
8139 150481 65940 63239 59098 63644 96915 38847 -130112 -48559 13855 20729 45797 162490
8127 162490 267854 63714 -15480 91327 289458 330791 173269 75906 92190 79951 90548
8116 90548 220951 169783 86288 -964 71858 154334 252375 230719 305353 240697 198254 271241
8104 271241 397351 289890 -90707 -95219 -21586 -127099 -125479 591 14439 69801 -88308
8093 -88308 -226314 -154524 -35287 -50970 -45584 -10464 39742 73832 25957 73807 195443
8082 195443 270971 233599 142301 23805 5945 109878 62980 90768 67406 17701 -59094
8071 -59094 -103921 -114278 50547 123598 118645 14164 132301 162947 -56482 -74784 -84289
8060 -84289 -47973 72761 183525 214912 92173 20523 120623 132482 170800 63803 9866
8049 9866 212874 395448 307955 181691 159714 97674 -57533 112538 166554 151783 55749
8038 55749 11480 178447 302885 431567 292137 131999 35724 22125 187819 151501 210824
8027 210824 180276 216500 210028 127220 111561 142307 62479 101220 1770 -10809 -48818 109094
8015 109094 212560 42843 84395 59011 27080 -22579 -132865 -29635 -13925 -76916 -87446
8004 -87446 -142117 -175137 -55077 18816 -31224 148006 67372 68004 256554 186490 231225 430406
7992 430406 453965 303193 165029 152080 120352 60450 35995 101904 162522 185813 54670
7981 54670 -31305 -44869 -78140 -84789 10327 183192 299198 243460 182318 196103 243176 402576
7969 402576 353582 206247 177267 219080 255966 348007 323249 340740 325111 296652 205009
7958 205009 -10789 -2073 5833 -107386 -32896 5551 -44408 63679 188754 158887 203192
7947 203192 250535 177228 17929 1933 13791 57938 65006 -4137 55775 28042 -19173 6189
7935 6189 9999 -113922 -105690 -6546 18421 110681 36169 -13332 117783 102707 106975 47616
7923 47616 143111 116431 173445 187394 141294 137164 80245 -80207 -128726 19551 66687 50782
7911 50782 81198 144014 125366 154965 127358 264874 262584 139345 187173 202618 71293
7900 71293 36195 136732 59523 160263 92225 -37065 -41627 33727 28744 -7449 20542 115395
7888 115395 40691 73261 7355 71776 129576 110254 89997 7263 59423 -14438 -80454 -148437
7876 -148437 -92799 -27129 78604 225070 188286 41562 13324 35238 141175 266558 129648
7865 129648 33616 -17436 -57086 -99054 27770 167199 228290 280110 118084 24525 -15554
7854 -15554 25402 56512 95530 125259 87218 80772 179444 364756 375143 230736 151129 34807
7842 34807 -134124 -229628 -79613 -13919 30587 97823 177915 170482 84994 77702 53961 42232
7830 42232 7007 87800 15542 -67188 -136495 -143153 -84774 -51146 -120893 -119857 -109071 -5629
7818 -5629 6403 -16090 -14042 -10276 -86937 -113920 3609 34414 1767 155886 231569 275250
7806 275250 311046 295978 280679 183994 139757 135350 63907 55226 108456 113545 -30645 -57894
7794 -57894 75129 235748 190424 69669 -13638 -11600 -106662 6334 197640 292654 266773
7783 266773 103676 -64557 -279665 -182217 -120162 -84312 19644 -97321 -225769 -163462
7773 -163462 -117085 -63682 -1055 84945 136483 76765 -63082 -83013 -10893 9264 -61980
7762 -61980 -84615 -388 7057 -59155 -103139 -181223 -119487 93856 49504 -17241 -96511 -185041
7750 -185041 -49175 -38389 -1390 -41705 -23580 21246 -46413 72012 109031 47296 33761
7739 33761 105030 107137 -67105 -84376 20129 128013 183892 61324 -14630 5938 1118
7728 1118 -81633 -59329 95303 108784 90198 172661 285360 245515 177937 1359 -123886
7717 -123886 -143870 -45739 39421 110621 138870 -20544 -73129 2192 112194 109427 76839
7706 76839 -17928 -15052 118061 120167 93704 112833 143336 133412 122017 38768 -104479 -55843
7694 -55843 -84201 -124370 -175021 -241486 -187989 13085 119156 28788 -37621 -9476 57507
7683 57507 184441 331021 303353 179075 33535 -51996 -91568 -121985 -151486 -72748 -72819 -160646
7671 -160646 -159475 -109195 -30549 46 -16199 -75144 -24226 47037 28237 54135 27741 54367
7659 54367 -47769 -24886 -39306 -38884 -43767 15786 192802 318927 285025 141755 -71486
7648 -71486 -129500 -174541 -38913 124683 59530 -32411 47485 40921 2966 -81922 -160595 -54339
7636 -54339 -71184 -69975 73663 -33685 -53596 -85937 -149216 -99107 -11210 -97508 -133594 -110701
7624 -110701 -151768 -148152 -179240 -239300 -115639 -213202 -86733 -72009 -124162 -122865 -64497 -143994
7612 -143994 -258948 -73977 -44983 99112 255143 191987 183634 87715 29786 26641 -34459
7601 -34459 78811 140999 130492 88959 125873 180695 259128 298119 241510 185948 137087 148063
7589 148063 199592 87453 42555 164733 155198 -23110 -122314 -267266 -150822 -88210 23875
7578 23875 363 -95195 -169124 -246662 -224540 -125708 -95866 -108989 -234926 -251945 -257072 -272851
7566 -272851 -197094 -263497 -296689 -307199 -253453 -133618 -115148 -166664 -142558 -203450 -94149
7555 -94149 62379 33374 17547 -28270 70466 133385 82691 63297 10582 36061 164605
7544 164605 184022 183615 98770 -134416 -137285 -118063 -142465 -35994 72117 145059 110554 -5688
7532 -5688 -66657 -140846 -58644 69265 34014 29232 64934 73162 62125 106560 11413 -51546
7520 -51546 1291 70157 64524 36086 57312 99378 131092 61917 -83269 33873 93304 99918
7508 99918 144622 152423 148373 200623 155097 171388 80989 92827 229953 403414 371270 240458
7496 240458 126899 161701 73214 18982 64164 92814 147785 77977 100422 76138 134789
7485 134789 192177 132939 106636 191783 290125 299032 114454 127488 100731 121103 216335 229118
7473 229118 279643 240945 295412 212963 96577 123491 139120 106183 39257 72698 204128
7462 204128 285587 219232 -23835 -160641 -14993 165132 160009 121066 177059 253996 424105
7451 424105 409013 277308 270420 201036 6810 -34867 112461 64601 -160408 -202422 -181113
7440 -181113 -135409 -67250 -106582 -88300 8537 -27254 24846 24388 -4659 40103 32002 24535
7428 24535 -11904 39228 115146 62663 -8478 36991 162612 253681 318959 336761 278612 174946
7416 174946 93362 102434 205392 269980 244109 151192 112649 187637 116246 108636 -66228 -146925
7404 -146925 46888 -23661 -177331 -176539 -61320 31161 52753 125805 279303 194589 173598
7393 173598 224448 315258 237998 64692 37600 1108 -78966 -97127 64908 205935 224800
7382 224800 165899 61525 181333 123153 52545 -9943 -142580 10203 53233 -45 70239
7371 70239 23292 73365 12948 138413 366018 314305 133668 -38772 -41814 -94717 -106629
7360 -106629 -108582 -184091 -55194 86531 105151 109333 128154 126444 73068 94793 129975 77316
7348 77316 74110 5408 136777 141743 10594 68906 100459 32095 32621 90105 9338 -4216
7336 -4216 -31779 -62802 64280 -21331 -123759 -112685 -24195 5636 -51964 -162094 -257935
7325 -257935 -219370 -103553 32564 94962 180502 134499 89696 67293 127920 149219 91534
7314 91534 -80734 -141771 -69819 44327 80107 24632 132073 223110 344274 227284 79760
7303 79760 75011 47657 76247 -109277 -264591 -220830 -48524 144713 63262 -15546 -23136
7292 -23136 -54779 -10891 -44528 -68556 -21253 192809 273731 244376 181001 87028 119656 -11934
7280 -11934 -227419 -210011 -43001 21321 29076 54587 65349 17895 32063 17076 -28612 -186524
7268 -186524 -233924 -75286 45834 123119 205598 249019 79919 32216 71550 190516 239432
7257 239432 200749 97785 107129 90792 106139 144147 11227 -73248 56006 98168 46340
7246 46340 -137914 -102098 -83235 -139817 -176972 -62553 -59405 97800 240284 336405 285441
7235 285441 106883 -143283 -188428 -184814 -117009 -57373 -60337 -74738 -105008 -64755 100323
7224 100323 94882 4367 -55154 -70072 -165398 -220392 -226982 -155992 -70720 -130137 -10092 107737
7212 107737 35224 -57952 29639 12654 -76403 -151396 -22380 30036 -14848 -20039 16224 76219
7200 76219 106986 84532 103719 108046 56049 -38099 65541 207398 190581 92450 104290 83250
7188 83250 103716 10546 -146202 -225164 -174477 -136988 -29453 -45345 -52709 96595 109732
7177 109732 66034 134391 159950 168983 143402 113999 -15386 -117446 -138590 -211053 -225099
7166 -225099 -139047 -20886 95471 94744 -65074 -43948 19362 56738 106312 104029 -2029
7155 -2029 -45007 34097 75812 -58048 -117093 -85341 -113084 -13247 21010 55590 51041 -13483
7143 -13483 9026 62581 -18082 -48485 -84370 -156664 50561 44808 -83836 -142688 -200700 -171032
7131 -171032 -202530 -217550 -227425 -276097 -166553 -143433 -149930 -126223 82007 127955 127549 191494
7119 191494 174246 66338 -9740 -174935 -193531 28716 28198 -60471 27692 64876 -15691
7108 -15691 -74277 -42813 -38291 -102978 -219923 -228373 -154372 -144479 75979 88321 -51431 -140125
7096 -140125 -88151 56123 77832 41041 37730 -76194 -137201 44602 218296 171743 132597
7085 132597 83776 -35692 -42159 12633 -11595 110441 215946 230877 170695 147788 105440
7074 105440 65942 -102371 -162369 -179694 -136059 -27212 -13940 -69276 -106211 -176006 6187
7063 6187 142917 170852 81614 34403 -7416 -33699 5068 11849 77848 151092 106531 223665
7051 223665 169539 94693 191438 169256 128505 31672 27525 178186 267773 142868 11921
7040 11921 -17795 -6679 56127 101089 104457 51724 -32333 -41486 25026 73185 116428 107457
7028 107457 252410 296429 188768 34401 -30284 14755 241251 342414 373941 312968 137375
7017 137375 52122 137343 179773 110695 87231 125793 -1466 46837 85583 85480 -28221 84037
7005 84037 130307 159287 215814 249156 243816 229614 80530 -48732 -72730 -18854 -81408 26496
6993 26496 85904 48192 -34867 29115 34086 -11292 -36102 -129098 -208860 -158274 21536 52173
6981 52173 58798 70475 78975 137473 29946 -47690 -47972 -38856 -17045 -23217 33311 140588 167551
6968 167551 66800 -1205 -84834 -175806 -136546 -213276 -151896 27134 138886 100309 -65184
6957 -65184 -128482 -156662 -195235 -69131 42708 34739 216359 216886 41968 -22912 5578 -48890
6945 -48890 -56370 -116363 -166524 -245561 -116259 -89707 13131 -23369 -60797 72754 62889 41173
6933 41173 1634 19204 87435 58603 171 72572 243504 220063 110399 25320 108219
6922 108219 119570 -124812 -172015 -3015 -118802 -250034 -229295 -212093 -179654 -111994 100916
6911 100916 133096 77217 19884 -100286 -188569 -78638 -118096 -58038 -55736 50051 155547
6900 155547 214195 88730 -80158 -103305 -12469 69832 128206 104390 -14545 -109589 -161375
6889 -161375 -63022 -40378 75487 146527 198199 256467 209306 2379 -88716 -150527 -296288
6878 -296288 -222338 -149438 -102307 -19393 -130178 -155959 -6059 3882 80218 159753 57414
6867 57414 50191 31010 -97902 -170958 -194867 -91153 -17726 126681 48438 -58963 -50799
6856 -50799 -60354 12461 123415 114233 67512 39041 -91408 -178396 -137440 -13539 -36127 95918
6844 95918 263574 152706 -46886 -82761 -74403 -93479 -154773 -109391 -60404 54772 105435
6833 105435 17431 289 109867 213777 88571 47798 17459 4388 63068 182202 271638
6822 271638 228944 80570 81933 137555 198305 196608 145176 108605 -18792 -132421 -61366
6811 -61366 -4340 115580 190648 110465 114904 141651 159791 152085 166646 145373 222977 132646
6799 132646 36745 -41644 -15166 4379 -166970 -95990 -85391 -52526 -47931 33323 30975 9968
6787 9968 39974 -51972 -114794 -193563 -144841 -45738 -7430 80910 13683 -66691 -94135 -188632
6775 -188632 -257634 -226329 -133426 -38686 -51180 -70357 77163 -29917 -110301 -29094 -64598
6764 -64598 -182054 -212938 -34110 18282 -17687 -24738 4135 -20420 -7130 -1630 -15099 -26783
6752 -26783 -4189 -31412 -199229 -187853 -62350 6960 -97514 -37736 -73216 -73389 -170871 -199850
6740 -199850 -127867 7693 -88127 -62657 910 -23119 -56370 -43563 43352 40888 73699 51765
6728 51765 -91331 -59762 -83567 -165591 -172602 1428 81051 143726 157804 37503 -14095
6717 -14095 -37392 -189286 -318720 -250816 -104991 -51016 -132475 -214748 -247292 -160596 -23414
6706 -23414 -1291 61132 16163 -106752 -90562 -35216 -16074 1177 -123972 -138486 -58247
6695 -58247 10347 18653 37592 36056 66716 37126 15344 -50082 -91530 -4200 56585 -28684
6683 -28684 6403 100426 34356 135482 197583 147671 134715 56400 22518 -54046 -116054 -168497
6671 -168497 -176992 -44277 -50818 -163370 -90817 58104 66815 -47731 5811 12092 -62767 -155354
6659 -155354 -251212 -247226 -133041 3662 71775 154830 289298 343149 234716 45729 -72155
6648 -72155 -143219 -36197 -29863 -14499 -55524 -71640 -35601 62836 132884 96341 10502 -34994
6636 -34994 -97095 -75784 66136 168108 142131 110462 169973 5834 -39694 -11117 99313
6625 99313 137986 268455 252760 176221 43404 33795 17776 -55140 -65029 49961 25944 8835
6613 8835 77904 172605 144738 145702 80511 90000 56888 61875 96197 126367 47855 31633 34009
6600 34009 41760 -38519 -112928 -118112 -181916 -195676 -80970 -60348 55522 -7298 -121464 -141870
6588 -141870 -110107 -132273 -30424 -27902 6865 -23210 25102 103874 203146 84571 -27074
6577 -27074 -134089 -141917 -77999 -42577 -106472 -294014 -278401 -244299 -150713 -52620 -3806 24414
6565 24414 -18976 -42959 70671 65760 179483 185132 211994 123151 21319 83587 3369 -97426
6553 -97426 -29454 38712 67683 -24110 -135404 -90248 -94124 -98290 -107602 -96319 -8459 -92010
6541 -92010 -82203 -24471 -107651 6082 109175 80247 137207 56720 -32783 -150389 -88688
6530 -88688 -51546 21733 83148 -74520 -74789 -77836 -122262 -196537 -154036 -3440 -535 -24802
6518 -24802 -73654 -37633 75349 9964 40451 72399 -51525 23601 106158 30204 -50838
6507 -50838 -1192 82749 28515 -149372 -206388 -151583 -51830 4416 -83190 -132230 -106900 -46158
6495 -46158 -106899 -138759 -237955 -203895 -117413 -45949 -127298 -180736 -216324 -160850 -53192 -109836
6483 -109836 -103007 -141978 -211000 -158560 17969 -60146 29342 81405 -1443 -10594 99618 124481
6471 124481 64147 155071 325091 317073 136065 45133 70877 34531 99854 -29903 -37134
6460 -37134 95175 44130 -60967 -134379 -56232 134679 218979 145388 96266 75979 16775
6449 16775 -35229 -109220 -158270 -186732 -58860 20574 -65736 -52545 -8241 -16721 -11556 94392
6437 94392 104852 176141 192761 57884 15865 16083 102653 171403 107567 83610 -4795 -51524
6425 -51524 -151500 -110699 -105791 -88676 -86881 -73268 185286 205689 136669 77621 120704 297835
6413 297835 264844 50208 26508 96246 215818 107024 1983 6125 -45347 -121792 -153984
6402 -153984 -217765 -191549 -123470 -53176 -3992 30830 65081 -72463 -165615 40775 243345
6391 243345 175636 104304 78214 59840 -46670 99779 98772 -9546 -161975 -218598 -65466
6380 -65466 -73191 -42460 -10305 27162 -19993 -60446 9772 3661 -56639 -144732 -73601 112553
6368 112553 227850 147830 37608 -24060 -63963 28031 -20206 -94313 -3291 99018 -11582
6357 -11582 -101643 -42550 67934 20431 -70581 -30888 68654 -72576 -176329 -59001 -61080
6346 -61080 -126863 -17342 124790 135712 258015 172297 118088 5348 20907 96009 196290
6335 196290 96344 46790 72036 -63546 -249332 -174996 -20212 -7953 -121273 -91585 -30681
6324 -30681 -38973 -37067 -32560 3301 39211 -38384 5091 16906 56856 156435 226086 255824
6312 255824 158224 192361 134783 80563 89915 92468 234459 227271 285998 180420 -44184 -280324
6300 -280324 -280870 -136789 -16195 112303 74386 -56517 -240 100340 96823 118000 138372
6289 138372 192403 218201 251771 247480 88357 -137517 -133481 -175131 -182647 38079 133614 101820
6277 101820 100491 177753 121053 -41603 -152443 -163824 -78738 11612 -9322 -117204 -79742
6266 -79742 -140754 -82332 -12909 24983 -19126 -106199 48192 96002 73148 162042 149486 135856
6254 135856 200818 144842 165815 174467 184867 272540 244445 206874 233491 168992 87847 204412
6242 204412 137404 8376 8061 -44226 79239 114329 63095 62483 46877 -36424 -89897 -77245
6230 -77245 -122213 -64441 -193025 -215852 -199571 -192620 -76511 -75959 -95288 20282 -57709 -86825
6218 -86825 29169 24847 -57813 -50935 -126045 -118619 28977 69985 69681 114767 120718 34698 -26163
6205 -26163 1073 50744 -60262 -57024 42842 82582 32404 30156 -69605 46543 27767 54869
6193 54869 158436 147217 -14213 50968 68751 -64922 -160351 -88619 5494 73940 197646
6182 197646 222824 113353 -31451 -67057 -116033 -230641 -123271 -148203 -85909 25969 41141
6171 41141 12437 54801 -8719 -60128 637 109507 176553 205339 104966 72231 118107
6160 118107 164580 167046 100099 207412 49722 -211361 -219717 -244746 -144520 28507 21814
6149 21814 -59107 -129066 -240658 -179484 -170899 -144271 -166503 -162404 -140904 -43956 49244 35718
6137 35718 -74540 -134791 -155345 -110712 -75448 -15843 -12704 -83362 -110928 -11524 63354 129054
6125 129054 102332 102397 32881 126047 167317 205082 215263 193925 97286 89996 49234 -105874
6113 -105874 -131515 -43895 -130886 -160827 -66296 -27792 -6088 60095 74299 -55510 -79243
6102 -79243 -138558 -271670 -147338 -33483 -111562 -68541 65541 135260 148919 146024 -40258
6091 -40258 -40472 -4823 -2847 32465 -77135 -12282 68778 -49623 -171822 -99878 -31361 41670
6079 41670 67011 122863 154092 152638 243598 163561 33294 -89836 23985 101041 95747 20164
6067 20164 -66898 12696 31523 68072 60711 -16645 -47754 -53691 50301 -91701 -31773 47388
6055 47388 17624 26724 -23566 -42537 -147909 -266177 -184461 -70800 68781 107604 12009
6044 12009 -68663 -36266 -14561 31408 -64140 -93565 -58505 -111685 -77377 27925 -80416
6033 -80416 -177880 -180151 -142215 -63857 -67448 -144734 -159385 56606 36833 2459 -56948 -26003
6021 -26003 29452 61554 -61264 78422 114338 56657 39753 79033 135975 196524 113925
6010 113925 196520 193574 31468 -3783 28634 -8616 -19431 -57900 -51159 -64491 -86579 -17520
5998 -17520 -193637 -217104 -134926 -157788 -122129 -149460 -163295 -133946 -200195 -195216 -96293 102085
5986 102085 102604 88240 -8979 -113638 -104749 -25300 44392 -13419 -110587 -114843 24257 111972
5974 111972 155334 42425 -13366 17311 45839 172592 295690 274649 204190 -26285 -93696
5963 -93696 -62647 -163497 18014 126211 165894 145697 160644 108138 -101145 -95179 111296
5952 111296 142010 127822 11067 -136794 -237770 -183878 -116094 18599 -34801 -5286 37936
5941 37936 -94975 -212300 -98452 25695 132844 192870 145397 14690 -3700 43982 -32719
5930 -32719 -71294 10533 121776 119736 -37759 -42760 48424 -23580 38285 99311 39079 -19282
5918 -19282 52945 104640 54115 -28917 63566 75184 50160 188953 213871 322640 448815
5907 448815 315274 162500 98889 154134 164314 32705 88111 172761 187704 107221 152855
5896 152855 124238 -12737 -62114 67080 84814 58813 -45152 -180069 -230582 -215551 -331859
5885 -331859 -165957 -50298 -58338 -33856 -45169 -46700 -98697 -101015 -185810 -154739 -39266 -104293
5873 -104293 -68673 -48715 1366 13456 -81364 -52628 81851 86534 11636 -59407 -100165 -140098
5861 -140098 -191589 -111062 27707 87522 133152 221199 106537 8041 116293 116563 27588
5850 27588 175457 173705 52734 140923 74322 -91627 -197298 -172351 -129540 -57853 -81378
5839 -81378 -178434 -191815 -207892 -316465 -251656 -99686 -35512 142590 213689 116671 100813
5828 100813 175058 -4528 -119320 -72509 23320 100152 118225 23731 3584 -78269 -150063
5817 -150063 -189043 -188134 -149744 -214307 -198601 -30393 14933 -85559 -143177 -111859 10743
5806 10743 16334 47437 151851 202068 147717 86789 25884 -60361 -8584 15295 7159 10380
5794 10380 30028 47247 22708 -60759 8276 131168 163657 71121 153198 228999 77384
5783 77384 -24046 67444 97039 56290 47130 90011 171356 233907 189030 85474 69086 73406
5771 73406 80054 149879 179361 91582 156898 50451 -123127 -24579 -24298 -93912 -117546 -192740
5759 -192740 -140021 37692 127281 49206 176290 313148 208958 154375 139333 80985 5539
5748 5539 60938 56130 46339 205403 132058 82578 80527 -3711 -17763 36474 -58 21360
5736 21360 144448 190242 117198 -6274 -51014 -67004 58916 119636 5903 -46847 -19429
5725 -19429 -8347 19209 45829 -8855 -55200 -59130 -40009 -85981 -136385 -54406 -48316 205451
5713 205451 252673 108486 7710 -97379 -209188 -233204 -147414 -74582 -110460 -96089 -110148
5702 -110148 -42049 73908 171081 233946 81679 -142963 -219022 -87662 34924 28929 128682
5691 128682 -25489 -66603 40925 227226 225745 87573 81346 111889 30848 48626 32862
5680 32862 41131 -52407 -5747 9775 -157262 -145189 15700 80828 19835 31662 13543 73714
5668 73714 89220 144496 88803 -4378 7594 -107188 -284442 -198312 -69360 -3821 -12797
5657 -12797 20618 -64911 -46637 12678 110605 168459 82249 -66977 -85761 -92509 47059 155226
5645 155226 164200 164858 109744 208713 241164 207633 24619 -66565 -10876 -101023 -117415 -201791
5633 -201791 -331327 -246036 -61325 -83724 -102766 -18945 -48313 -150402 -258769 -254950 -328739
5622 -328739 -237639 -211032 -101117 -58044 -66807 -60569 -37137 -76099 -51142 64368 125164 113374
5610 113374 165431 39287 2499 -165686 -211585 -296452 -355978 -312694 -254429 -10012 194042
5599 194042 243292 240171 282647 232981 140352 44279 -2695 -16851 117906 81669 -72022
5588 -72022 -78289 49774 4138 186491 287168 211505 104326 73891 64057 62297 58881 21916
5576 21916 -137562 -64019 -16392 -143712 -241980 -93458 85834 59334 2939 11982 9205
5565 9205 92502 121117 123072 115325 -14819 100153 200421 220512 134849 137388 280292 197329
5553 197329 87244 134517 107096 -106013 -354531 -255434 -121304 -169884 -87185 -86699 -49241
5542 -49241 30231 -73915 -117351 -165587 -146282 -198176 -186613 -76913 -78060 -11180 80783 34360
5530 34360 -3365 -43057 -127247 -61835 -37486 -169649 -158988 -170725 -193726 -292233 -318978 -271388
5518 -271388 -187104 -159844 -160513 -96179 -159337 -87683 14164 -2766 -60282 15083 -26762 -151141
5506 -151141 -163289 -102005 -114097 -34619 40118 -1469 -45126 24914 34423 14788 2255 87120
5494 87120 85983 48383 985 145535 79517 17895 50318 22204 88207 200663 187225 341
5482 341 1365 66520 5155 -37449 -20643 -9204 41337 95164 69439 -18034 -81872 76092
5470 76092 113141 54644 120830 155077 -59698 -223447 -104787 -87966 -94117 -47450 -55893 26951
5458 26951 151422 -19962 -84362 -110011 119852 74815 118124 210215 -14923 -226104 -24281
5447 -24281 155295 141933 210697 14991 -61381 3885 -39859 -9929 2523 -32101 -45370
5436 -45370 -163136 -147217 -256826 -275586 -116255 5031 -36799 -22559 -3563 5250 -13911
5425 -13911 -72866 -14259 -4473 -86239 -150760 -167904 -183909 3413 -15955 -23600 18822 -24060
5413 -24060 -169439 -63389 48335 -42064 -88459 -42804 -58005 -30590 -91828 -103007 41983
5402 41983 51497 72263 1488 -78043 -158737 -12884 -20732 -83738 -127342 -37337 7953 35208
5390 35208 50125 20346 -22885 -16467 -133410 -158630 -194987 -205739 -156767 -105128 -140065 -146701
5378 -146701 -175379 -204573 -84295 -53853 -95912 -77622 -6488 -58866 -15857 35224 -38126
5367 -38126 -138966 -102029 128914 319998 205932 -64785 -144652 -123657 -101060 -73103 -15689
5356 -15689 -37887 -34114 -42196 -68035 -55024 -5241 -48966 -72101 -13651 160267 133559 13913
5344 13913 -42379 17523 81100 46540 -20063 -128430 -212873 -234855 -159640 -46659 -4584
5333 -4584 -86585 -110993 -32866 -37987 -116384 -95733 -14912 -39869 26482 6736 -169816 -196975
5321 -196975 -86430 -28875 -79638 -149990 -299779 -365460 -409843 -247699 -140662 24424 29306
5310 29306 -35395 -214966 -325232 -183304 -120726 -76016 39839 58550 119249 55309 -34613
5299 -34613 50265 141363 113140 258269 134855 125193 129120 159507 219840 261352 252453 119436
5287 119436 209391 189657 69317 57263 -15643 43542 116257 147838 158729 40339 -51385
5276 -51385 -53658 25016 92959 156124 152265 25893 -77493 -17537 -6030 -114483 -139032 -159523
5264 -159523 -74988 -32990 -57266 -145557 -242034 -283163 -274742 -186221 -198681 -308635 -504968
5253 -504968 -453186 -214150 -96589 -50604 -13726 -1937 140053 245371 311992 294897 151609
5242 151609 66426 -8585 84029 167701 172677 29808 -44353 -119840 -29510 69107 3282 -118631
5230 -118631 -81221 75726 76184 103495 223587 191735 -1260 -144297 -136097 -113944 -149802
5219 -149802 -159696 -53751 -83960 -44835 -104769 -83860 -169040 -140494 -82918 -52705 -35798 29195
5207 29195 156191 227440 250300 256612 212398 91262 -42201 -89847 -58064 -11868 55432
5196 55432 -149629 -242637 -228011 -195061 -221684 -234009 -157091 -126350 -28963 -31588 5369 3300
5184 3300 -71400 -93452 -116940 -191874 -141807 -22199 -57890 -15089 -27720 -33577 2372 -42013
5172 -42013 -172938 -186975 -142082 -49975 -5316 20302 -5579 76590 141391 156994 -61368
5161 -61368 -168271 -10721 -4835 -44154 56454 180021 95477 61085 109828 16674 -82988
5150 -82988 -180288 -55886 -54421 60655 5766 -140008 -129267 -35656 -107553 -116630 -17385 111109
5138 111109 43784 78168 44391 -53841 -131322 -16075 112353 189840 128374 76326 47891
5127 47891 -12580 38463 16421 -94962 -182417 -206519 -119829 -60969 -25187 -128239 -297202
5116 -297202 -303384 -305021 -295526 -193472 -180075 886 60640 37130 -146847 -174427 -133880 -177559
5104 -177559 -251813 -356911 -358146 -318435 -96684 -26354 60052 173930 257478 188769 104217
5093 104217 57870 -46784 -21946 -72187 -168398 -176224 -199685 -56269 96922 22617 -136775
5082 -136775 -179278 -122373 -72911 181677 147213 -113552 -183785 -224952 -119207 -183665 -205342
5071 -205342 -212978 -174836 -32252 -21714 80381 -19334 -28075 18897 27009 8664 -108396 -94244
5059 -94244 -18510 7062 -81919 -180079 -157819 -106301 -79688 86973 -18786 22368 -67692
5048 -67692 -93901 -209428 -182468 -139419 -92077 -136869 -158259 -165213 -186440 -192260 -170199 -114194
5036 -114194 -99475 -128996 -176078 -29090 30340 10879 12817 81209 23939 -66770 -120916 -132823
5024 -132823 -129838 -234015 -122376 79981 285420 164655 -45339 -132743 -56469 17408 -7424
5013 -7424 -95488 -159625 -178504 -173638 -2221 -47320 -223527 -296325 -205847 -49374 -23472 -77188
5001 -77188 -87315 -158815 -72554 -4999 -106847 -167560 -75084 -71190 -165151 -127801 -112751 -54747
4989 -54747 111626 221489 145109 43184 -77377 -218468 -26482 129643 289196 323172
4979 323172 326204 230081 170086 180174 149916 47945 77715 92389 -18943 -19749 -63474 142531
4967 142531 163671 86793 39353 -48564 -144554 -52530 13019 -18687 -120849 -132051 -92444
4956 -92444 -93477 -124386 -23155 69105 100936 37046 -30476 -105568 -69049 -80618 -118517 -106753
4944 -106753 -149450 -158095 -148249 -169611 -33985 40516 37319 -45908 -163446 -221840 -224947 -268477
4932 -268477 -227629 -290129 -237548 -75033 66372 33654 6276 -19389 -2345 6844 -28351
4921 -28351 14700 -102502 -204021 -74900 76467 51191 -3451 -44145 -12149 60012 70591
4910 70591 -98985 -297804 -297990 -221576 -71091 91577 145497 34821 -49900 43188 75629
4899 75629 118068 147424 169137 139402 89241 3607 -105777 -158153 -193247 -166547 -176177 -202556
4887 -202556 -107792 -72065 -185071 -228579 -163327 -68113 -206 37046 23157 120820 337749
4876 337749 290460 121608 89732 -40360 -127137 -22556 127143 103655 57168 16556 72010
4865 72010 43529 -24797 40031 197689 186681 89127 -5876 -15458 57977 45428 77813 6742
4853 6742 125902 223883 155400 44102 -79300 -39460 -30764 -12224 -124024 -134597 -106715
4842 -106715 143022 184737 46895 -30298 -46239 -17892 -143384 -299864 -290211 11055 132260
4831 132260 99197 77622 138408 7843 -112803 -57615 -128276 -127100 -150310 -90378 133050
4820 133050 162044 122840 46295 56653 92320 56935 -60392 -73727 -154083 -182302 -157093
4809 -157093 -86594 -44179 -63933 117309 223969 122561 -144256 -175760 -27730 142273
4799 142273 177644 36145 -52220 -66760 -96680 -59751 -34158 56679 118086 153717 119654
4788 119654 -58043 -172290 -158499 -51505 55928 82432 16221 56511 3104 -38807 -71351
4777 -71351 -102784 -154657 -162328 10382 339 -14814 -71988 -152781 -190393 -171535 -186266 -129511
4765 -129511 -20381 -114177 -146869 -129188 -122708 -149891 -204079 -170120 -228990 -180525 -170071 -206146
4753 -206146 -245070 -244785 -155931 -107453 -17966 -28709 -46929 155718 193229 60335 56092 111074
4741 111074 76668 -100515 2379 87759 93217 214022 285956 295133 125052 47637 126242
4730 126242 84793 -77937 -153218 -79219 8341 114872 84455 3407 45820 62895 49841
4719 49841 154547 167468 51442 86285 146709 107879 58643 -38794 -111468 -114103 -90367 -89380
4707 -89380 -58759 -134191 -148472 -139490 28044 37770 -77461 -207643 -306078 -229119 -190608 -186216
4695 -186216 -157258 -136810 -73312 23029 67017 12743 -2600 -3311 21961 -17180 46279 116389
4683 116389 233090 172056 128676 115629 132973 39102 -44755 -45275 -61739 -69382 38771 159928
4671 159928 140806 8481 -24470 -54926 -62467 -97309 -85281 -95890 -166791 -171939 -157890 -96792
4659 -96792 -53589 -31928 -6010 63983 56403 28112 12069 -8249 -36445 -123506 37107 -65462
4647 -65462 -97193 -108706 -85251 -39869 20385 76922 6286 -4775 108114 3967 -143736
4636 -143736 -98868 37033 162937 145226 151001 68038 -90766 -29964 6420 46623 130757
4625 130757 82217 -24057 -73491 -127704 -103667 59736 169135 93382 118158 -513 -100128
4614 -100128 -267935 -292816 -156385 -67500 -113603 -77829 -132126 -255839 -276357 -243170 -55957
4603 -55957 59682 90738 47109 108370 -1566 -41802 9876 -2058 77353 -9612 -138003
4592 -138003 -136123 -86472 -67813 88118 110417 -53559 -91982 -56350 -14945 -4302 -43837
4581 -43837 -26751 -31452 50193 -7666 -171152 -58722 -94893 -169291 -209976 -81664 -12124
4570 -12124 76095 41996 -18307 -36042 -104126 -30241 15757 90612 34479 16160 130448 146642
4558 146642 112478 -24818 8650 140022 100002 124719 106097 70727 90821 -58569 -91670
4547 -91670 -55331 -18687 22626 7525 -91155 -3461 77135 153301 176928 215276 94164 -20902
4535 -20902 -84485 -108490 -32643 -33068 -39492 -42898 -84498 -10233 17849 -27130 -146861 -98299
4523 -98299 -261158 -200987 15539 93865 -8654 -52439 -28897 28160 52025 35561 59734
4512 59734 80466 163590 113620 -90012 -121411 -115756 -274492 -324453 -233856 -183790 -122982 -113912
4500 -113912 -205243 -102037 39055 -55719 -218131 -117063 113828 -15461 -160215 -241194
4490 -241194 -290445 -112726 -139059 -113115 -48499 -120285 -89230 82 -49335 -109402 -49242
4479 -49242 56177 152283 171245 117226 9250 109570 94732 61246 85381 97171 95607
4468 95607 102523 164163 200557 198603 44739 -53034 103114 201586 223429 182536 87877 132238
4456 132238 4971 1789 -147 12442 54046 -101890 -109743 36111 -16961 -128370 -42267
4445 -42267 72911 49259 -17148 -122307 -155044 -160815 20483 -66860 -150967 -124503 -211672
4434 -211672 -238695 -193685 -69155 -76025 -133904 -109810 -55282 -155448 -239873 -118764 17871
4423 17871 139426 143399 119615 151442 137091 130872 70969 12782 -31819 -88557 -113076 -115797
4411 -115797 -113780 -8663 87195 86784 83563 65522 -17128 6482 64346 23550 -12077 46512
4399 46512 11208 94995 35124 -78706 -43171 -44532 45611 100462 38979 22623 22373 -110316
4387 -110316 -203553 -57190 12585 80488 141716 99809 141134 -30859 -186428 3867 37095
4376 37095 -43382 -26539 -69051 -149102 -291785 -357270 -203755 -117312 -108575 -163121 -242751 -408548
4364 -408548 -425963 -179714 -134542 -239640 -260889 -191154 -164738 -176703 -173435 -186746 -93019
4353 -93019 67715 55078 75662 109552 34695 4707 91627 -1962 -59000 -127196 -96301 -122534
4341 -122534 -151764 -30487 -84031 -28717 -95391 -241157 -265002 -175145 -262993 -183855 -112340
4330 -112340 -40730 -148294 -127525 -25477 82898 30098 -39876 -40177 -40650 -148268 -197525 -206827
4318 -206827 -111510 108016 220865 221316 86548 -81266 -112431 -85286 -81767 -53639 -99628
4307 -99628 -75125 -69570 14638 3658 -201332 -277296 -209306 -138811 -78670 -13922 70547 25503
4295 25503 -96923 -8603 13447 -75260 -125582 -76326 -89072 -102798 -21401 56418 -7810 -142205
4283 -142205 -231267 -253167 -231802 -237911 23009 54459 -50950 -28603 70501 93256 113515
4272 113515 92696 -124913 -141816 -125421 -58471 -48781 -55574 -43058 59790 48973 99652 178795
4260 178795 260595 298604 203316 14253 72811 437 -144728 -277068 -236140 -38921 61723
4249 61723 167523 252724 169538 62578 -67349 -31870 -63046 -144098 -208671 -80847 -42458
4238 -42458 11929 90507 87462 -37345 -91377 -39802 -89340 -56024 -145232 -69717 -11294 -12386
4226 -12386 -117140 -101114 -69417 83566 184364 88426 11716 11345 -96262 -252750 -238580
4215 -238580 -178087 -155073 -78037 24442 -42175 -45411 63499 -15409 -102062 -84791 -25005
4204 -25005 -80521 -157534 -143812 -110569 3149 128174 62348 -48771 -77727 -79040 -206000
4193 -206000 -327794 -201374 -68711 54071 46105 36164 47921 42804 -14099 57628 20891
4182 20891 -128376 -27172 -71175 6287 91502 108939 -42240 -125380 -182637 -70863 -48170
4171 -48170 -64835 -75059 -90893 -105600 -82698 -256024 -346021 -170573 -123415 -57781 25710
4160 25710 49049 -96654 -51176 96169 42403 31748 -34663 7603 63628 -86849 -88642
4149 -88642 -47289 -8970 -72140 -184062 -87735 -87608 -104404 -64152 62446 156927 152948 -70706
4137 -70706 -181484 -91569 -159181 -126075 -170247 -230417 -70664 15168 185944 282633 348811
4126 348811 262980 -67336 -180794 -144007 -131138 -147320 -127722 -65233 -49868 -25736 3011
4115 3011 -56368 175319 83592 -56249 -85741 -11674 -91081 -80456 -54836 13330 77157 105602
4103 105602 41339 41263 59240 -22969 -70450 -158802 -153437 -78696 -148667 -159951 -85129 26288
4091 26288 26760 22569 86259 101066 114150 -5606 15369 79602 6988 -73225 18651 -47145
4079 -47145 -169381 -257842 -254069 -228412 -266377 -222078 -166752 -226189 -139127 -26961 -31757 -109027
4067 -109027 220394 253751 210139 66960 67867 54163 164600 137129 -14744 49952 219313
4056 219313 263581 160677 -21599 -76427 125849 239593 169132 30089 -40750 -27580 -3955
4045 -3955 264 -48949 -57172 -31971 -183 -46878 -171346 -287914 -170444 -180206 -151624 -169022
4033 -169022 -192034 -151641 13386 -37855 -162448 -102490 -105247 -20261 -28977 -121302 -102758 -139735
4021 -139735 -88080 -124635 -63860 -62957 -62325 -177700 -150182 -87008 -105391 -72482 -42461 -26365
4009 -26365 3602 48452 -35761 63554 130403 -14136 -85390 -160302 -186274 -226434 -243092 -144981
3997 -144981 -21382 -122213 -163537 -146942 -183490 -114049 -77187 -38169 23470 104540 201997
3986 201997 83947 7773 140290 215188 158829 88930 58805 -43846 -121648 -166814 55342
3975 55342 112979 -25124 -86710 -211208 -264704 -269229 -272887 -357971 -218593 30781 37659 -6107
3963 -6107 -25280 -40652 -45160 -42421 -55374 -125004 -122535 -128116 -191030 -191343 -146310 -128998 -23904
3950 -23904 17298 121040 105146 104300 65966 13238 -15821 6031 39317 -6983 -106023 -132380
3938 -132380 -40570 55634 59625 80186 203299 128225 149825 203614 260701 239359 133484
3927 133484 82612 136395 120539 71968 -10590 -128936 -88856 -68464 -53570 85 40479
3916 40479 7856 -97621 29275 164448 104058 50466 29440 -79554 -135384 -153000 -104021
3905 -104021 -28984 -43585 -83735 -74282 -95357 -10614 8890 -69143 -12682 7661 -29419 -34569
3893 -34569 7111 51668 65030 33043 22226 94319 99414 16026 -90687 -195658 -162737 -213010
3881 -213010 -20096 46627 29291 122108 23823 -178447 -189911 -100602 -12849 113503 45705
3870 45705 -94898 -147211 -83656 17252 23657 -95842 -73492 -80858 -37414 23064 -64542 11031
3858 11031 188521 348988 397941 129121 51368 21350 107718 171528 216434 241440 182399
3847 182399 177925 64723 -192018 -145811 -133367 -170493 -184222 -124110 11092 11619 -39798 -32913
3835 -32913 -123804 -71971 109120 184244 237937 144818 111518 167413 167642 89582 9764 -2775
3823 -2775 118202 60072 -13889 -43656 -93695 -136159 -115713 -53476 -118394 -157221 -76635 -71754
3811 -71754 16304 63897 18078 -23212 -164774 -83291 -49770 -220200 -282895 -225095 -312222
3800 -312222 -300647 -98069 36812 9269 -128678 -232087 -233171 -153446 -42181 -14000 -40655
3789 -40655 -6937 -24240 35999 134074 96026 -58587 -64026 -17723 -3127 -5857 -115127 -57133
3777 -57133 97121 88507 91747 124248 67052 -55782 -152435 -57089 -50908 -123365 -150380 -26248
3765 -26248 70613 98467 18926 5273 124540 49103 13954 45237 51306 8574 -89441 -101142
3753 -101142 -18116 -43372 -76898 31781 99976 80274 100135 210053 235920 104351 -132347
3742 -132347 -125151 -105353 -119902 -99372 -197027 -106630 -103132 -29210 122519 130432 93795 40364
3730 40364 -5992 -36766 -72359 -18475 5923 -120712 -184558 -234955 -259388 -228364 -89943
3719 -89943 23486 -32409 -32657 -95217 -199360 -191050 -116202 -165885 -195181 -192139 -210096 -219774
3707 -219774 -143616 -266466 -252168 -52982 -76636 -166716 -216592 -268952 -302024 -355027 -261547
3696 -261547 -188728 -295228 -320841 -212139 -194038 -71131 -50607 -77948 -121105 -235168 -253281
3685 -253281 -182451 -66584 27321 19354 -44361 -113783 -160378 -48446 158419 172032 83355
3674 83355 73224 102112 104168 176065 186061 32814 -21343 -30818 -19582 71188 32610 -41429
3662 -41429 588 46154 100223 14092 8408 -77412 -179346 -82569 46481 216070 131178
3651 131178 -34588 -116715 -25184 16152 -31575 -249605 -364336 -317221 -198805 -74077 66781
3640 66781 96125 80846 37949 -45836 -98717 822 47319 34440 55657 187089 136358 109285
3628 109285 52398 108060 178460 103312 166393 142343 151466 193610 101513 33962 46583 50624
3616 50624 99910 118105 90263 35702 -13748 -28614 -112812 -219984 -117475 17162 150339
3605 150339 207904 235 56173 63440 95560 291286 286294 231374 75238 -81835 -56936
3594 -56936 31163 60131 58736 53178 -150243 -235836 -238665 -93473 149677 33148 -107342
3583 -107342 -163195 -220869 -337838 -469860 -215356 -10684 -21575 -68371 43098 8091 -27897
3572 -27897 -177117 -300583 -203627 -90140 -80210 -37314 -101759 -132197 -39272 -64592 26210
3561 26210 74630 76260 -30393 2578 30465 -35847 22118 16799 -34949 -83307 -208964 -268393
3549 -268393 -227038 -217964 -187734 -120863 -106899 54127 94040 -101244 -252441 -263351 -127480
3538 -127480 -7420 -18360 -93195 -109455 12354 56446 27359 -19616 -120982 -172458 -129885
3527 -129885 -66219 -32786 -8585 -155368 -182706 -173736 -46116 508 31471 18049 -41048
3516 -41048 -102614 -17072 -134721 -285966 -269458 -214627 -308886 -376954 -308537 -239344 -228106
3505 -228106 -220107 -208449 -61187 100625 239609 194580 151550 89522 -17607 40509 29417
3494 29417 21007 57022 150089 119349 8659 79146 262087 95298 156632 293221 289345
3483 289345 87292 -122074 -217491 -255750 -133199 -11554 95382 -10518 -72885 -40290
3473 -40290 17114 -140568 -272324 -274843 -296093 -348102 -168953 -93992 -73978 -79034 -43885 -25516
3461 -25516 68392 155392 231052 311080 287012 188288 55926 -1101 12587 27493 27337 -97188
3449 -97188 -153636 17583 126619 102982 112789 180905 33190 -122406 -159977 -78662 126029
3438 126029 257313 176238 129652 210259 104855 142693 125699 -43962 -36203 -18007 -37770
3427 -37770 -29357 155813 127017 79806 -9928 -95979 -77991 117173 132380 54534 101034 60862
3415 60862 10405 -101875 -22814 97723 -130644 -342729 -314066 -228047 -196692 -123101 -86086
3404 -86086 -215144 -319769 -298901 -319741 -258757 -188248 -162475 -108453 -214374 -282252 -179845
3393 -179845 -153447 -95555 745 29971 -580 -156326 -139872 -223998 -175902 -180187 -142276 -174792
3381 -174792 -246100 -69740 100579 -32852 -37220 -43231 -19141 -29443 -68886 -151675 -322147
3370 -322147 -253176 -155609 -116557 -96991 -63475 73526 35232 -39882 -134717 -236323 -147570
3359 -147570 3299 68174 -46893 -143 -22105 -7781 -32173 32822 37979 -87934 -131370
3348 -131370 -89663 -65365 -13396 -56575 32313 185674 199857 94614 -33775 -15427 16712
3337 16712 38846 -9641 -119981 -210304 -177973 -131151 -263839 -201393 -54421 -76722 -40303
3326 -40303 -87484 70111 -39879 -53301 -64290 -100555 -132842 -51906 159444 -14207 -130790
3315 -130790 -82789 -40961 44910 65862 45380 62140 -76564 -5603 -9162 -250452 -377618
3304 -377618 -363482 -301272 -285968 -360828 -368016 -298641 -376536 -338674 -221394 -134902 -61418 -37152
3292 -37152 35152 147914 87263 26811 -97606 -159908 -85075 -62618 -202327 -66713 25938
3281 25938 -91619 -176346 -43182 21673 -76097 -175601 -169027 -94285 -32636 -157784 -223696
3270 -223696 -131429 -77118 -22476 -42036 -170579 -175582 130123 246198 283854 157014 70020
3259 70020 -37052 12355 61863 -23568 -92892 -36761 -94868 -190420 -56872 6189 -13471
3248 -13471 3194 41509 13041 78337 101317 51474 -5334 -67263 -449 -121469 -254229
3237 -254229 -258473 -158700 -94614 -88102 -77234 -33105 -25538 28398 97383 94663 194492 299824
3225 299824 146463 44849 126442 207432 140538 65971 1952 -83094 -111180 -84621 -29310
3214 -29310 25391 81255 178195 189728 212401 194401 237685 169223 136946 166831 97754 76153
3202 76153 15510 28352 29280 -85520 -264290 -125600 -66621 -39465 -96591 -82127 -21984 -61949
3190 -61949 -48632 -88797 -128301 -122457 -70017 135820 187469 118809 1596 81861 75316 -53802
3178 -53802 20282 147635 113078 144232 316722 262861 361996 346934 212983 181113 181933 20717
3166 20717 -63720 -45679 -75787 -95768 -140289 -115744 -186763 -252379 -15076 80222 53451 -32131
3154 -32131 -87540 -72026 20314 -52627 -166789 -154823 -81330 -55143 -44673 -55760 -74479 -93699
3142 -93699 -83939 -72568 -37010 -163950 -169817 -151035 -122327 -48607 -167421 -154009 19420 82535
3130 82535 67985 108858 161095 170499 74226 -73913 -285082 -245322 -155177 -93002 -24161 -168767
3118 -168767 -243036 -224618 -192504 -140443 -151484 -134702 -158359 -63188 -70638 -27613 -125132 -73399
3106 -73399 12228 40360 81310 109557 100686 126804 2026 -95762 -135557 -222895 -300389 -297937
3094 -297937 -148575 -33624 -22042 18828 159811 163932 168459 169247 281144 278095 208990 215425
3082 215425 222966 125834 -20607 -65638 -80980 -59235 -112908 -176496 -125869 -102213 -83872 -120720
3070 -120720 -181193 -219904 -181478 -200896 -164519 -108775 -205482 -289690 -232747 -94399 -74736
3059 -74736 -99514 -153739 -137925 -96822 208728 309459 21457 -75710 -52520 -74658 -165205
3048 -165205 -61324 -8922 30219 67845 145192 158345 12378 -92149 -104301 -194264 -99017
3037 -99017 38072 219880 312819 88145 -22089 -57234 -169891 -109784 -71505 13549 29282
3026 29282 64077 35089 -62740 -212557 -222033 -282307 -346993 -283247 -220349 -81685 -3412 37896
3014 37896 72318 88160 26066 -4339 89589 193830 182171 208653 290017 134731 -13306
3003 -13306 -155404 -140721 -108065 -93619 -149365 -258114 -207483 -99039 -109908 -67858 -27476
2992 -27476 -23777 -19957 31153 -66096 -50119 -47582 50004 132633 35833 -167163 -112067 -56954
2980 -56954 -109121 -57794 113973 130237 50063 -56810 18076 174564 81202 82087 44492 59947
2968 59947 8941 -95057 -123076 -102475 -136186 -120690 -200750 -169225 -83685 -35206 -130256 10786
2956 10786 55344 60058 58029 80630 94656 39937 -40081 -54419 -10354 62641 228279 193993
2944 193993 172418 -52923 -144791 -56171 -90720 -108395 28293 77227 26597 -47107 -60716
2933 -60716 -51660 -101116 27978 140658 42628 74418 79115 76176 175792 93386 -78451 -144707
2921 -144707 -166396 -194077 -170968 -72176 36634 30496 -16711 10223 40152 61334 59431 135509
2909 135509 157145 122032 20414 -34645 -46058 -71362 -91075 12083 99583 18938 43402
2898 43402 5463 -46827 117693 200962 221891 226155 272100 258380 298095 289358 278475 225919
2886 225919 130338 53686 -3480 -37122 -9222 26206 -53119 -60005 -168365 -218767 -129363 -71178
2874 -71178 -74680 23818 106659 131453 193386 164130 154285 134167 240986 297978 254671 58896
2862 58896 -56340 -115496 -106510 -57955 57010 -51151 -202655 -167608 -95873 4322 90126
2851 90126 155227 36040 139577 175030 160410 77779 -80721 -138557 -203648 -222976 -243447
2840 -243447 -146965 -84851 -27393 67823 77864 45925 106982 103452 69701 111399 201436 125459
2828 125459 77139 77406 -11812 33513 190847 -6897 -104261 -139644 -66172 57295 -898
2817 -898 28053 191175 209639 69711 38089 65384 -9187 -72368 -95353 -133199 -45813 49598
2805 49598 87180 92883 -88909 -167153 -78902 -107067 -164392 -49783 76874 93593 88345 -41419
2793 -41419 -55405 30065 190357 216368 236296 261629 132974 -226822 -163963 -94136 -115349
2782 -115349 -45580 39564 88435 56480 81071 -10764 -17940 40128 76807 150369 251025 217373
2770 217373 193986 230642 141644 -18134 -119128 -108851 -163399 -124318 -38849 28025 143525
2759 143525 193295 186253 80210 9037 -33614 -160914 -219031 -131127 -87322 6909 -16693
2748 -16693 55292 229797 236292 48539 23040 65720 79265 -31809 -26400 -145401 -209412
2737 -209412 -174217 -116399 -119063 -165130 -57879 -38638 -212649 -136842 -88580 -182606 -147695
2726 -147695 -127546 -148540 -17852 65063 -73426 -50445 -41342 49910 93247 -27465 -39601
2715 -39601 12905 32715 14152 46436 -33378 -852 -44524 -112569 -88136 -116309 -118539 -58534
2703 -58534 -45908 -58904 -87099 -107873 -25531 -112658 -170526 -60359 -62133 -79866 2150 18288
2691 18288 17340 59447 12700 3370 50871 -3381 -119868 -111671 127743 318202 274630 193730
2679 193730 -12413 -209508 -177316 23827 166313 129117 130362 66515 77373 95388 99480
2668 99480 -17165 -56667 24057 118008 263729 273301 176923 -42393 -72178 138638 81865
2657 81865 19285 49306 -82812 -183431 -207130 -103789 18113 -46679 -208934 -151330 -99118
2646 -99118 -84399 -84221 -92398 -27220 -28539 -154658 -138867 -164276 -48124 14415 61575 88956
2634 88956 92053 38089 -89618 -130189 -124360 -89296 -127356 -34113 7305 -112909 -102769 -78007
2622 -78007 -93995 -25703 -11717 -62559 65175 150485 83273 43280 -64879 -265418 -207095
2611 -207095 -150389 -219686 -228659 -171565 -42371 4334 71186 87180 68031 102291 114684 99258
2599 99258 -3959 -22901 -96775 -226100 -356517 -284333 -161368 -51815 47006 8974 -20969
2588 -20969 114055 172361 191736 125061 46479 -13791 -163654 -41008 158229 59081 67238
2577 67238 208053 136715 146896 44584 -109554 20155 -70962 -75874 -141759 -112414 -40431
2566 -40431 92377 22166 -86418 -108353 -75229 -13526 -67268 -16554 -215701 -140752 -139696
2555 -139696 -146046 -153993 -139918 26179 46641 117121 112687 -141903 -307046 -201806 -11455
2544 -11455 122246 112928 98626 182909 110677 -11729 -189692 -164420 -211420 -112446 52488
2533 52488 63558 51418 -98605 -46996 28467 -18637 -95589 -114585 -149891 -127461 -161306 -14385
2521 -14385 -17530 -7131 156110 256600 337654 359524 345279 203182 212637 248275 233401 54676
2509 54676 -57550 -30624 -680 -80154 -97825 16492 77689 58145 2564 -75698 -124576
2498 -124576 -55181 -169962 -157877 -79517 -144212 -91637 18833 -55494 -141539 -109364 -62514
2487 -62514 29505 83207 119965 118961 97522 121197 203483 139974 216843 218781 159094 167193
2475 167193 10960 67250 -92160 -226139 -91977 -59947 -8329 -12141 39917 -34436 -17480
2464 -17480 36022 -58213 56808 190133 191832 32391 98198 56008 -12751 14462 -136328
2453 -136328 -323546 -268533 -89722 -55939 -77079 -143985 -118430 -72105 -42091 -103448 -63194
2442 -63194 -55784 -31082 -26766 -145283 -148136 -66811 -90547 6609 33893 14348 -111206 -22085
2430 -22085 17444 -21554 -48142 -110376 -155457 -189310 -87388 -2809 -55757 -206103 -202564 -67603
2418 -67603 16198 -50527 -8793 7010 27774 -46744 -56159 -67485 -16510 49384 8621 -74586
2406 -74586 -124430 -14385 91522 12793 -46263 -66403 -29146 29706 79080 38351 -41712
2395 -41712 -32434 47935 11727 -56662 -129777 59643 95111 61615 -20444 -16684 -35903 -16930
2383 -16930 96440 142372 113644 164000 130740 -54656 -101420 5757 37408 49250 86470
2372 86470 16700 68366 100522 121511 119289 94353 -42743 -33258 -6754 -65530 -1021 185718
2360 185718 154526 164142 14073 37056 2832 -80318 21415 76057 64622 102150 -32518
2349 -32518 -144952 -61856 16445 126402 130537 147211 133325 77843 35901 -2968 103201
2338 103201 -6206 -176923 -206119 -137647 -62032 -116483 -59878 152408 197822 61712 -15947
2327 -15947 -108977 -84603 -78599 -56085 -95249 -163391 -169807 -159591 -174430 -110905 -16620 139585
2315 139585 180527 231777 279883 78695 43590 79775 71487 -18808 -113294 -157906 -112501 16916
2303 16916 58244 -33475 -39917 -913 13997 -45991 -224382 -173593 -43548 9754 135421
2292 135421 162285 170781 75599 43942 42017 -42072 -16830 17603 21759 42636 -77721 -128440
2280 -128440 -16398 -42306 -54236 31739 46639 -16015 -155965 -167929 -136746 -83366 -27123
2269 -27123 -160543 -171135 -167465 -162828 -62532 -14323 -37605 -29656 11370 208226 116944 156528
2257 156528 60104 36956 21589 158281 315900 181466 29473 12170 -60107 1774 21109
2246 21109 -34640 -120588 -79184 125752 277939 146780 47551 -52424 33731 65409 179288
2235 179288 167045 84321 23884 65736 51974 77438 -32988 -128574 -227043 -236866 -58868
2224 -58868 34332 111430 105663 -65054 -45796 -16639 47972 47867 37263 -8670 -56120 -138213
2212 -138213 -100383 -32624 -22107 -92263 -132443 -87476 64442 165007 144373 58299 7586
2201 7586 -36524 -30178 -42820 -45499 7832 134943 158482 106726 88295 125320 230014 237371
2189 237371 222009 -5092 -93669 -29414 -86307 -88346 -4123 -69617 -172743 -239347 -206071
2178 -206071 -373 220264 251988 259740 230054 164680 174586 97494 151113 179134 244863 259568
2166 259568 292688 210395 217843 79756 19949 68812 28710 -3278 -32859 -51840 128860
2155 128860 270714 464998 372181 185192 149062 34883 -30561 20501 -9422 48877 96621
2144 96621 133729 197524 160826 92450 -31767 -79028 12139 -8322 -82020 47798 45160 69958
2132 69958 109007 22538 -56148 -103249 -72777 -114780 -39740 19284 82758 154299 -35024 -222387
2120 -222387 -250051 -179528 -70410 -118766 -230600 -275823 -182151 539 9933 -44625 -38340
2109 -38340 2823 2355 -36234 -31677 -22899 24645 45080 42059 44041 113620 -1518 -50807 -104133
2096 -104133 -137023 -87992 23849 73717 188543 362784 198378 36627 34843 10528 38530
2085 38530 87244 36654 -133487 -147365 9119 127740 48814 -49091 -90010 -96204 -115961
2074 -115961 -119274 -111794 -72600 114991 162122 116003 -92440 -187928 -141410 -18242 51346
2063 51346 14746 37345 22507 -59884 -113010 -212996 -283693 -260479 -147476 -63580 -201364
2052 -201364 -99759 -80489 -171429 -157500 -244427 -173104 -159775 -148730 -130353 -68206 -159637
2041 -159637 16618 262941 120947 48844 -5264 78618 134165 62058 153079 141144 110292
2030 110292 -67986 -47036 -153008 -156026 -171672 -61437 18705 153537 184174 195608 198328
2019 198328 119205 22316 -8256 79179 223084 266333 98245 13990 -104068 -146789 -141685
2008 -141685 -87905 -124886 -135107 -184963 -123973 -98639 -167929 -251967 -110776 250286 249367 58255
1996 58255 59206 128874 95056 -71497 -121554 -90968 -88607 13300 33431 143124 127057 167375
1984 167375 178495 61942 -35065 -67144 -38994 -150953 -65755 -36514 93800 16327 -67338
1973 -67338 -80005 -74269 -179069 -127511 -29472 99835 163271 257757 185489 18769 -5951
1962 -5951 -30162 -79825 33401 70221 85827 16448 -51275 -99523 -169535 -61431 -42788 -100053
1950 -100053 -109235 -105996 54821 82575 -301 69384 38021 -98163 -78839 -72907 -40645 9362
1938 9362 90129 99554 161735 153512 22512 133037 164724 233632 216245 146416 133505 15759
1926 15759 39549 218277 327783 226022 195765 120217 87716 87372 105912 180015 234134 81929
1914 81929 -20294 28442 21152 -24231 -12408 4125 -44108 -82547 -87426 -129153 -144819 -117882
1902 -117882 22770 76848 35811 -13813 -25794 -35049 -50920 -97276 -40937 149908 -4908
1891 -4908 -52995 29924 106621 117658 57790 1171 13082 75272 83541 31360 59841 23230
1879 23230 -77437 -54195 -68923 -98666 -46992 36318 117343 122136 158862 206669 186211 168930
1867 168930 191064 85528 -51303 -157390 -256809 -243256 -166035 -90197 89217 30062 37030
1856 37030 89186 94933 143455 66952 36319 -3700 -54986 36624 77880 24433 -115597 -132345
1844 -132345 -17475 -1233 92628 32473 -41903 -35597 9011 -22661 -11339 -17749 -70926 -55034
1832 -55034 -14905 -48136 134536 218822 242869 91884 53141 180214 65105 -82370 -153452
1821 -153452 -156505 -178553 -62078 -80607 45747 123105 241517 206532 114075 53197 -13557
1810 -13557 23159 9697 -4085 32696 -20699 -11895 -102550 -190189 -279024 -205390 -94872 -111913
1798 -111913 -88987 -36480 -101032 -59812 -44245 -14150 -62402 -182094 -191573 -127277 -21930
1787 -21930 -172423 -297852 -220166 -144929 -129332 -137048 -60375 -95029 -161020 -197505 -214631 -200130
1775 -200130 -38534 -7960 -183425 -128374 -21744 52110 81099 142830 68228 1546 88519
1764 88519 2193 4707 -51572 -149553 -49871 35005 80126 38060 -13881 -67619 -130243 16548
1752 16548 104936 25155 46904 54296 13648 -18188 57437 159683 225190 97716 29792 -2750
1740 -2750 -114803 -119346 -233693 -274710 -233299 -147369 -110072 -120594 -47851 78810 70676 128715
1728 128715 -16579 -236045 -147142 -16212 61751 4860 -41510 -36007 -8588 -3112 -45685
1717 -45685 129501 186800 158050 32274 -146274 -223118 -188184 -194613 -134122 -99304 -31441
1706 -31441 -55768 -240124 -223314 -230727 -205343 -168525 -35442 -109536 -105035 101199 164750 220865
1694 220865 282706 200792 -14003 -190135 -225148 -179503 30108 77968 -98246 -134845 -118055
1683 -118055 -147679 -98468 -73780 -19741 58701 153202 183028 72352 41358 2798 -15865
1672 -15865 -16061 -60901 -59565 80069 77694 -79217 -134589 83238 148153 -102123 -3905 95490
1660 95490 3405 8949 66347 31107 83383 143900 17405 -11907 -52746 -37487 -69924 -117529
1648 -117529 -47165 73349 126227 60418 -8765 -36574 -37953 70299 117543 85843 32171
1637 32171 122146 41736 34074 96916 39018 97921 92665 134894 138158 146290 111552 46409 -24254
1624 -24254 78840 75722 -154147 -236914 -121518 3651 5595 2572 95528 141193 143495 171647
1612 171647 32904 9603 -2129 -38905 10230 78171 162994 240307 183634 158262 234939
1601 234939 295493 113431 -33013 -43880 -73113 94246 209785 116024 161707 212392 237222
1590 237222 93073 -8384 -25232 -101499 -42227 -123746 -131654 -105689 -60838 2042 34853
1579 34853 -73422 -53075 5947 115410 215246 172955 -9628 -177633 -231600 -176575 92935
1568 92935 71042 -34980 -225060 -216459 -93821 -19517 -23500 -37471 113998 150988 54796
1557 54796 27239 21643 -76187 9232 38982 166073 224540 155819 -43188 -92377 -3383 72196
1545 72196 45282 -65516 -80185 -97919 79896 202638 252222 256772 236217 188771 158655
1534 158655 121838 130790 67188 112860 142653 54074 -16979 -59847 -35203 88776 223079
1523 223079 295227 161363 78648 87482 128729 164411 -51670 -97821 -143909 -164906 -107044
1512 -107044 65598 46831 -68075 -49978 128353 243078 210973 168582 48021 -15079 -34785
1501 -34785 -98149 70951 271151 317189 195695 -10945 -37062 -47894 -162478 -197312 -226330
1490 -226330 -248724 -187017 -133859 6838 90173 125020 223984 246432 338321 243310 119050
1479 119050 88479 159248 178395 34910 -68469 -120052 16129 94320 141379 61282 64462
1468 64462 25842 24373 16687 62505 94636 246566 278222 256969 175712 166851 290448 262399
1456 262399 279786 220783 88859 66052 124105 43097 -80861 -30597 -59037 -99092 24312
1445 24312 102732 37897 -6699 -125682 -85433 -30098 77 -111133 -169293 -222986 -210559
1434 -210559 -171682 -260944 -249459 -98492 -22027 3560 -99668 -99471 -44477 23513 52010 100385
1422 100385 69008 98695 57048 47157 123983 133454 2827 -21787 94399 107621 76209 146687
1410 146687 282914 351318 343664 229535 153983 91630 41402 86413 44417 24664 139521
1399 139521 208745 228063 176985 106982 198884 253236 285195 209437 31341 -43062 -29183
1388 -29183 -90300 -40452 161186 202994 172078 230414 139417 159073 223891 319181 179889
1377 179889 -4218 -15275 -70601 -15309 65155 -64231 -56390 -85225 -34581 111972 282677
1366 282677 181743 164504 91943 -62933 -86431 -33289 -140195 -184254 -150716 -163225 -79647
1355 -79647 -3633 5418 -13174 121127 262685 306576 190495 63806 -135775 -108658 25767
1344 25767 42114 122675 123525 -33164 -188680 -238759 21468 56988 -177478 -112785 -81040
1333 -81040 25955 31711 -27458 -58580 -5272 -18376 116439 293052 198020 97359 -16228
1322 -16228 98718 226135 221797 212433 262803 278764 125682 -30005 -139532 -201336 -179163
1311 -179163 -140504 -185101 -336989 -237515 -72955 91788 167257 161526 -34411 -91144 -102322
1300 -102322 41885 50553 -5781 18931 63897 74938 72259 22510 -54128 -121104 -213534 -335363
1288 -335363 -311938 -154342 -101596 27581 90603 18708 -31343 29152 78609 21015 77405
1277 77405 16172 -208118 -279968 -86256 99818 188682 228596 378013 282482 131131 73058
1266 73058 147485 179048 212286 142818 67052 112977 162203 29005 -139044 -181963 -244493
1255 -244493 -193602 -50378 65394 -88215 -4083 54520 131489 171362 73359 29240 47792
1244 47792 160514 171439 98304 46746 63543 107340 36432 -52800 66202 160208 26967
1233 26967 -97886 16433 174955 175481 47338 49813 115265 138523 89488 152230 194905 80003
1221 80003 218679 169369 105770 -10506 -59371 -271046 -133668 -23298 37835 127933 167664
1210 167664 133191 241251 390774 285786 199442 117022 157162 232044 250879 109804 15100
1199 15100 86587 161613 72554 -62560 -54961 -114949 -87761 -62493 -66552 -145498 -70207 -49570
1187 -49570 -46548 -40165 20779 -30612 -63574 -64095 -90973 -134020 -56432 27599 25653 48624 38942
1174 38942 -21533 9942 12330 112905 170540 151941 86760 170112 298254 236706 264705 217417
1162 217417 111204 -25277 -112173 6931 61416 -81411 -245085 -160837 447 -30053
1152 -30053 -14902 24103 -21319 -3996 111331 -64102 -167751 -126796 -92054 -43859 20100
1141 20100 94179 233050 174437 39039 39500 72763 123869 164522 -1487 -149092 -114437
1130 -114437 -114979 -84766 24627 164718 19385 -86434 -87369 -32661 51819 97511 65779 -27178
1118 -27178 -44188 22301 51333 39715 9982 -13234 -81675 -76899 -124037 -64592 23967 -116552
1106 -116552 -95921 -68741 -11788 6737 61817 84706 68058 52046 18495 -49982 -70335 71585
1094 71585 -29160 -4798 47587 -43395 -150239 -163184 -273977 -367216 -389982 -377441 -253785
1083 -253785 -234146 -150423 -15117 -119662 -130187 57886 149007 100737 -35794 -121633 -82572
1072 -82572 -80490 -94600 -99587 64737 81107 117679 54436 35367 42268 68394 26334 10536
1060 10536 -24316 -31979 117467 101819 -59200 -78227 50941 82098 24739 -22081 -7291
1049 -7291 92429 159238 204894 334981 366901 217646 107831 69820 34577 -29917 -141282
1038 -141282 -127920 -42128 -64999 -63794 -100715 69763 184071 203957 149347 -10550 -73089
1027 -73089 23607 20521 70932 196608 200313 155532 -5017 41045 132836 210896 174395 201011
1015 201011 134601 -47293 17708 235485 69012 -31938 15224 46956 -27892 24497 65420
1004 65420 60807 112999 168044 214587 113036 50812 26497 78845 109233 161742 213602 216139
992 216139 83590 63861 249751 299803 287977 86941 -40044 -12486 75968 146198 107515
981 107515 34225 2947 -58441 -27088 5183 37490 5857 -66218 165948 157649 186812 202912
969 202912 66864 -87281 -103698 68927 217181 299210 259736 129083 31537 57897 59102
958 59102 152793 178710 -773 -140518 -179613 -96700 625 152713 222501 139331 -89334
947 -89334 -159819 -160901 -93765 27474 210369 163497 -36840 -67290 -34125 -97377 -124979 -21234
935 -21234 80513 73784 88610 29958 37107 247418 397264 416134 377591 311961 269603 236018
923 236018 194688 144257 91121 66560 -35244 107240 57786 -42442 34765 12564 -63069
912 -63069 -88018 2821 34483 27604 48261 163289 357330 320227 199691 103702 40165 -37428
900 -37428 -54150 -91102 -70462 -116542 -88469 -102011 -39425 2886 67503 -29482 -40213 -46191
888 -46191 120811 293086 359033 262239 135915 12765 -10209 70091 69431 3097 37228 8136
876 8136 -66468 -133267 -70561 -18134 33953 126657 103635 -6350 42960 107912 141416 296768
864 296768 275021 80253 -134403 -158376 -23521 59045 -4823 109776 167866 162119 -12798
853 -12798 -37119 -41433 -17222 115232 155417 125154 88647 27498 -28849 3161 53538 162984
841 162984 135137 116256 187130 187059 75192 -54069 -55824 67956 128785 145189 266961 264895
829 264895 137089 73728 62483 61549 118785 125047 43272 187637 170777 132000 155870 139884
817 139884 157244 84056 -18517 -13436 100199 51556 53388 95409 41987 33700 -53864 -215710
805 -215710 -98527 5265 9361 92482 122426 35466 -35003 102844 21763 62475 98697
794 98697 119214 47831 94991 44318 74834 14862 -58655 -84805 -98286 13087 -12856 56128
782 56128 61082 227831 257057 206145 105639 22087 -104749 -58333 -55668 -149028 -230801 -165570
770 -165570 -108815 97739 139241 190066 56125 112708 188443 165834 185133 140542 124350
759 124350 34354 37926 -13423 -20741 5128 92915 6171 -87949 -101786 -81868 106777 236384
747 236384 209592 55043 -72508 49110 78922 98584 180609 221864 45541 34638 62714
736 62714 97445 87636 138531 135118 66769 -81806 30261 -78573 -234267 -261812 -166160 19968
724 19968 87556 103436 170798 265865 176137 43606 -39421 -51719 -57062 -15283 126673 193525
712 193525 35494 23880 -74002 -72301 -13408 -30900 -65229 149027 142223 54019 43830 15625
700 15625 20427 138418 228894 253996 62700 -96877 -18375 39005 -40566 -76011 -199377
689 -199377 -149122 3967 129263 143859 178398 64373 150643 146742 140430 121641 137705 144908
677 144908 114759 157740 102160 -40685 -69427 75149 191419 223818 301078 268021 137326
666 137326 118812 -43985 -113562 -34413 -14578 5097 128568 53843 -90932 -93383 -114438
655 -114438 -6872 -60231 -18195 24605 -45764 -100511 -46699 212317 204184 -12261 -56250
644 -56250 -39029 -26910 69600 138243 20401 27858 46947 -185362 -261183 -81607 46645
633 46645 65664 109613 45475 -25628 -55326 -147581 -56962 -128627 -131511 -103200 19735 57699
621 57699 -33280 29699 112634 127439 25074 -11906 4929 114176 101980 117347 88474 69077
609 69077 76186 138371 203538 202800 199414 211668 193352 77925 -39210 34036 186982 395025
597 395025 417088 211842 96882 2723 838 -9084 -6495 -22931 -53717 -157712 -79097 25203
585 25203 24289 83042 281070 354528 280391 194203 77603 45758 52698 55422 81845 163635
573 163635 108460 104658 114647 69479 -44634 -79127 -74652 10516 -4504 60750 137819 122144
561 122144 167019 194607 97713 5263 81601 218384 271046 176571 141454 60291 137875 201872
549 201872 151962 -77540 -145895 20249 133504 105271 31913 -42595 80183 119253 78832
538 78832 56506 -22170 -54383 -91031 54487 116163 12973 -29694 53704 91054 106386 42044
526 42044 -149282 -211033 -109421 -47528 -7462 15788 44624 -69178 -40133 -2465 4223 82985
514 82985 67302 111983 148385 32879 59774 228942 51857 -161566 -166736 -112815 2748
503 2748 26698 7247 58932 -21382 -33232 37383 49165 -95268 -231567 -103508 31142
492 31142 -111204 -140564 -69505 -102606 -111083 -104920 -33121 133220 139571 86441 176228 308160
480 308160 237105 176063 148468 184355 264369 269348 190618 161060 136428 77623 24796 38170
468 38170 147439 156078 152096 113853 80250 101908 1159 -39780 -39504 42454 98910 55363
456 55363 80039 63818 -1573 -31286 43653 35858 62757 199744 242660 226368 202835 101601
444 101601 66555 74982 34825 50384 13279 -35484 26259 -25009 -80154 -55591 -124214 -55349
432 -55349 49806 83518 132531 174545 228904 192245 84459 -9082 28517 86764 147741 165923
420 165923 119305 22576 10457 1995 -32946 5718 -50794 -58947 -9835 -78747 -139913 -62651
408 -62651 20923 47238 46305 99798 132990 126197 122502 121245 196613 172955 71292 69366 258486
395 258486 200658 -4707 -132499 -109552 -114180 -164059 -181819 -138075 -72240 -35712 -4422 -6289
383 -6289 83058 139428 184472 170857 -9643 -31657 16403 71108 171260 171645 185662 125685
371 125685 52944 96784 42110 -11291 30361 18512 42512 36190 14750 72 78727 13229
359 13229 63223 83631 57372 74422 108221 101593 164834 153648 35568 -81438 -99413 40118
347 40118 8315 56187 106707 9092 -56441 7890 135238 183247 143380 86776 192854 151818
335 151818 68299 51895 75326 55640 81945 82012 104668 127988 100216 8160 -76765 -172113
323 -172113 -52362 101441 160542 212765 244215 252514 166286 127098 125776 86272 130696 117536
311 117536 59607 -43789 11182 -60433 -20969 -65150 -103250 -114792 -189926 -77757 -5352
300 -5352 -109817 -6002 60885 -67359 -164166 -236561 -74620 -155377 -11231 -52547 -88984
289 -88984 -112835 -199993 -229319 -140180 -99444 -39446 -61635 -234134 -208096 -29426 50675 -20156
277 -20156 -62139 83224 98166 58121 128076 160093 244245 287457 266837 189162 110800 98511
265 98511 77763 23199 40122 120072 164718 133767 172572 152309 100189 145767 148442 176557
253 176557 200832 139797 128044 86197 75330 89908 142585 240488 121212 1036 -47577
242 -47577 -15232 45357 81200 55613 -100542 -217883 -199922 -124018 -37430 62471 94884 70193
230 70193 -7199 14819 34397 85031 229698 229279 236054 229735 186693 243879 207905 -794
218 -794 -14992 7356 -50454 17872 64071 71277 149895 39650 17627 92178 145109 116965
206 116965 125352 197078 263010 310573 320721 303284 172555 153017 82441 201657 299206 310730
194 310730 175841 130199 55126 36868 169863 142655 47013 6841 84896 142795 96796
183 96796 -27972 -45943 -12002 -29404 -87115 -14271 21302 -54257 52682 153146 147799 104263
171 104263 26049 -12916 96462 261168 364688 434674 300096 209302 161940 118455 158966
160 158966 143323 -27750 -138448 -111202 -61816 14809 91803 119526 64988 48318 -39496
149 -39496 -42073 -100119 -115888 -25100 17359 13355 -70618 -119781 -126167 -3744 86679 61793
137 61793 7841 113172 169265 113919 47977 29340 154087 74454 -108666 -210502 -75034
126 -75034 21606 108521 183302 202474 187027 285948 199756 154922 124233 170445 228015 173622
114 173622 123212 72851 125702 128107 71714 78640 100723 65264 84771 94352 59955 -23623
102 -23623 -90274 -128713 -149657 -7938 89232 94513 -32955 -131588 -153437 -103565 -27571 -10747
90 -10747 99973 123690 34849 -42418 -86313 -100159 -76074 -31437 5458 -19127 -84900 -24626
78 -24626 5897 -69531 -76593 -48062 -21918 18556 -2230 69233 153822 89092 71056 81788
66 81788 110477 109838 121143 71548 -11484 -98 131559 100959 -2309 -72956 -32479 -33481
54 -33481 -65332 -48151 12319 118975 165117 94419 48667 87216 -743 -96426 -20266 34623
42 34623 45105 54845 134998 223160 272825 148899 105687 48283 -38410 -59317 74584 124944
30 124944 82068 186583 242890 155559 115667 208062 109630 25454 26674 23080 95198 103089
18 103089 16328 34599 1498 -8193 -27708 -90835 -13862 46889 26560 55903 152262 161683
6 161683 161391 222305 149343 180671 166051 89280
0 89280
$$ Imaginary data points
##PAGE= N=2
##DATA TABLE= (X++(I..I)), XYDATA
32767 104377 156804 150464 78889 79310 32199 103071 127397 190408 221189 262300 303601 279926
32755 279926 236528 145206 94875 95622 115344 150361 183519 282628 264858 217787 104407 208901
32743 208901 333799 357078 270676 182526 197216 189453 134788 105858 105692 142642 188559 221496
32731 221496 185004 117045 144905 277300 267096 276428 283825 339992 369401 334038 202870
32720 202870 208675 271585 276332 241315 217916 242111 237996 222058 204831 226749 265083 169589
32708 169589 155818 161726 278398 352715 390744 428915 401959 453148 425164 346762 277350
32697 277350 303282 349689 356836 369397 349370 372371 424143 439857 473859 468808 471843 483528
32685 483528 592826 567946 411005 409728 473246 428059 439062 482624 455180 435774 317635
32674 317635 283916 340212 435898 482029 540514 637123 632781 539793 451062 452362 588602 565596
32662 565596 469074 430886 431304 371595 454825 500499 403324 259372 272054 281288 401141 463339
32650 463339 491627 524807 513196 495065 535486 500232 501689 565490 619492 599047 640487 645599
32638 645599 559232 519200 585291 661082 675824 619543 630564 683361 562546 598686 589095
32627 589095 563254 557679 512363 498037 582277 624856 481339 443217 436205 434786 438607 592804
32615 592804 691064 682734 667987 745845 698530 695669 733168 709296 649746 583084 669348 655569
$$ [...]
##END NTUPLES=NMR SPECTRUM
##END=
