##TITLE=Analysis number 319579
Compound Code rf 00407
Book Reference b
Project Code adrs
Chemist Name avocado
##JCAMPDX= 6.0         $$ Bruker NMR JCAMP-DX V2.0
##DATA TYPE= NMR SPECTRUM
##DATA CLASS= NTUPLES
##ORIGIN= Bruker BioSpin GmbH
##OWNER= nmr
$$ XWIN-NMR		Version 3.5
$$ Fri May 19 10:09:09 2006 GMT Daylight Time (UT+1h)  MAYBRIDGE\nmr@NMR_250MHZ
##.OBSERVE FREQUENCY= 250.131544655141
##.OBSERVE NUCLEUS= ^1H
##.ACQUISITION MODE= SIMULTANEOUS (DQD)
##.ACQUISITION SCHEME= undefined
##.AVERAGES= 16
##.DIGITISER RES= 18
##SPECTROMETER/DATA SYSTEM= dpx250
##.PULSE SEQUENCE= zg30
##.SOLVENT NAME= CDCl3
##.SHIFT REFERENCE= (INTERNAL, CDCl3, 0, 16.522)
##AUDIT TRAIL= $$ (NUMBER, WHEN, WHO, WHERE, WHAT)
$$ ##TITLE= Audit trail, XWIN-NMR		Version 3.5
$$ ##JCAMPDX= 5.01
$$ ##ORIGIN= Bruker BioSpin GmbH
$$ ##OWNER= nmr
$$ C:\u/data/dgb/nmr/ADRS/4740/pdata/1/auditp.txt
$$ ##AUDIT TRAIL=  $$ (NUMBER, WHEN, WHO, WHERE, WHAT)
(   1,<2006-05-19 10:08:48.70 +100>,<MAYBRIDGE\nmr>,<NMR_250MHZ>,
      <created by zg, POWCHK disabled, PULCHK disabled
       configuration hash MD5:
       84 BC 41 DB A1 6E 1D 46 DA 25 12 A5 C1 ED C5 3A
       data hash MD5: 64K
       D9 24 8D F3 FF B5 85 45 60 45 7F 0D A1 F4 83 A4>)
(   2,<2006-05-19 10:09:00.56 +100>,<MAYBRIDGE\nmr>,<NMR_250MHZ>,
      <Start of raw data processing
       ef LB = 0.3 FT_mod = 6 PKNL = 1 SI = 32K 
       data hash MD5: 32K
       1B 5F 12 B3 23 FA 65 0B 04 D7 4F 11 44 D6 E5 02>)
(   3,<2006-05-19 10:09:02.16 +100>,<MAYBRIDGE\nmr>,<NMR_250MHZ>,
      <apk 
       data hash MD5: 32K
       D9 CD C8 29 B8 52 FF A5 9E 49 94 3E 90 86 4D 32>)
(   4,<2006-05-19 10:09:02.97 +100>,<MAYBRIDGE\nmr>,<NMR_250MHZ>,
      <abs ABSG = 5 
       data hash MD5: 32K
       1F DF E9 16 25 EE CD 34 8A DC E7 25 CD 6F 06 9A>)
$$ ##END=
$$ 
$$ hash MD5
$$ 4E F9 EF 11 67 89 7B 76 7A F3 45 E2 3D 0A 37 E9
##$RELAX= 
##$RELAX= 
##$RELAX= 
##$RELAX= 
##$RELAX= 
##$RELAX= 
##$RELAX= 
$$ Bruker specific parameters
$$ --------------------------
##$DU= <C:\u>
##$EXPNO= 4740
##$NAME= <ADRS>
##$PROCNO= 1
##$TYPE= <nmr>
##$USER= <dgb>
##$AMP= (0..31)
100 100 100 100 100 100 100 100 100 100 100 100 100 100 100 100 100 100 
100 100 100 100 100 100 100 100 100 100 100 100 100 100 
##$AQSEQ= 0
##$AQ_mod= 3
##$AUNM= <au_zg>
##$AUTOPOS= <9 >
##$BF1= 250.13
##$BF2= 250.13
##$BF3= 250.13
##$BF4= 250.13
##$BF5= 500.13
##$BF6= 500.13
##$BF7= 500.13
##$BF8= 500.13
##$BYTORDA= 1
##$CFDGTYP= 0
##$CFRGTYP= 5
##$CHEMSTR= <none>
##$CNST= (0..31)
1 1 145 1 1 1 1 1 1 1 1 1 1 1 1 1 1 1 1 1 1 1 1 1 1 1 1 1 1 1 1 1 
##$CPDPRG= <>
##$CPDPRG1= <>
##$CPDPRG2= <>
##$CPDPRG3= <>
##$CPDPRG4= <mlev>
##$CPDPRG5= <mlev>
##$CPDPRG6= <mlev>
##$CPDPRG7= <mlev>
##$CPDPRG8= <mlev>
##$CPDPRGB= <>
##$CPDPRGT= <>
##$D= (0..31)
0 1 0 0 0 0 0 0 0 0.06 0 0 0 0 0 0 0.0002 0 0 0 0 0 0 0 0 0 0 0 0 0 0 
0 
##$DATE= 1148029727
##$DBL= (0..7)
120 120 120 120 120 120 120 120 
##$DBP= (0..7)
150 150 150 150 150 150 150 150 
##$DBP07= 0
##$DBPNAM0= <>
##$DBPNAM1= <>
$$ [...]
##$SUBNAM7= <"">
##$SUBNAM8= <"">
##$SUBNAM9= <"">
##$SW= 20.6930455092707
##$SWIBOX= (0..15)
0 0 3 0 0 0 0 0 0 0 0 0 0 0 0 0 
##$SW_h= 5175.983436853
##$TD= 65536
##$TD0= 1
##$TE= 295.16
##$TE2= 300
##$TE3= 300
##$TEG= 300
##$TL= (0..7)
0 120 120 120 120 120 120 120 
##$TP= (0..7)
150 150 150 150 150 150 150 150 
##$TP07= 0
##$TPNAME0= <>
##$TPNAME1= <>
##$TPNAME2= <>
##$TPNAME3= <>
##$TPNAME4= <>
##$TPNAME5= <>
##$TPNAME6= <>
##$TPNAME7= <>
##$TPOAL= (0..7)
0.5 0.5 0.5 0.5 0.5 0.5 0.5 0.5 
##$TPOFFS= (0..7)
0 0 0 0 0 0 0 0 
##$TUNHIN= 0
##$TUNHOUT= 0
##$TUNXOUT= 0
##$USERA1= <user>
##$USERA2= <user>
##$USERA3= <user>
##$USERA4= <user>
##$USERA5= <user>
##$V9= 5
##$VALIST= <valist>
##$VCLIST= <CCCCCCCCCCCCCCC>
##$VD= 0
##$VDLIST= <DDDDDDDDDDDDDDD>
##$VPLIST= <PPPPPPPPPPPPPPP>
##$VTLIST= <TTTTTTTTTTTTTTT>
##$WBST= 1024
##$WBSW= 4
##$XGAIN= (0..3)
0 0 0 0 
##$XL= 0
##$YL= 0
##$YMAX_a= 397845
##$YMIN_a= -478515
##$ZGOPTNS= <>
##$ZL1= 120
##$ZL2= 120
##$ZL3= 120
##$ZL4= 120
##$ABSF1= 16.522
##$ABSF2= -4.171173
##$ABSG= 5
##$ABSL= 3
##$ALPHA= 0
##$AQORDER= 0
##$ASSFAC= 0
##$ASSFACI= 0
##$ASSFACX= 0
##$ASSWID= 0
##$AUNMP= <proc_1d>
##$AZFE= 0.1
##$AZFW= 0.1
##$BCFW= 0
##$BC_mod= 0
##$BYTORDP= 0
##$COROFFS= 0
##$CY= 12.5
##$DATMOD= 1
##$DC= 0
##$DFILT= <>
##$DTYPP= 0
##$F1P= 14.0000005364418
##$F2P= -0.99999901652339
##$FCOR= 0.5
##$FTSIZE= 32768
##$FT_mod= 6
##$GAMMA= 0
##$GB= 0
##$INTBC= 1
##$INTSCL= 1
##$ISEN= 128
##$LB= 0.3
##$LEV0= 0
##$LPBIN= 0
##$MAXI= 10000
##$MC2= 0
##$MEAN= 0
##$ME_mod= 0
##$MI= 0
##$NCOEF= 0
##$NC_proc= -2
##$NLEV= 6
##$NOISF1= 0
##$NOISF2= 0
##$NSP= 0
##$NTH_PI= 0
##$NZP= 0
##$OFFSET= 16.522
##$PC= 1
##$PHC0= 166.9217
##$PHC1= 5.573414
##$PH_mod= 1
##$PKNL= yes
##$PPARMOD= 0
##$PSCAL= 4
##$PSIGN= 0
##$REVERSE= no
##$SF= 250.13
##$SI= 32768
##$SIGF1= 0
##$SIGF2= 0
##$SINO= 400
##$SIOLD= 32768
##$SREGLST= <1H.CDCl3>
##$SSB= 0
##$STSI= 32768
##$STSR= 0
##$SW_p= 5175.98343685301
##$SYMM= 0
##$S_DEV= 0
##$TDeff= 65536
##$TDoff= 0
##$TI= <Analysis number 999999
Compound Code 99
Book Reference 9
Project Code 9>
##$TILT= no
##$TM1= 0
##$TM2= 0
##$TOPLEV= 0
##$USERP1= <user>
##$USERP2= <user>
##$USERP3= <user>
##$USERP4= <user>
##$USERP5= <user>
##$WDW= 1
##$XDIM= 32768
##$YMAX_p= 314513736
##$YMIN_p= -28820
$$ End of Bruker specific parameters
$$ ---------------------------------
##NTUPLES= NMR SPECTRUM
##VAR_NAME=  FREQUENCY,     SPECTRUM/REAL,   SPECTRUM/IMAG
##SYMBOL=    X,             R,               I
##VAR_TYPE=  INDEPENDENT,   DEPENDENT,       DEPENDENT
##VAR_FORM=  AFFN,          ASDF,            ASDF
##VAR_DIM=   32768,         32768,           32768
##UNITS=     HZ,            ARBITRARY UNITS, ARBITRARY UNITS
##FACTOR=    0.157963299565203, 1,           1
##FIRST=     4132.6476996994, 0,             0
##LAST=      -1043.33573715361, 0,           0
##MIN=       -1043.33573715361, -28820,      0
##MAX=       4132.6476996994, 314513736,     0
$$ Real data points
##PAGE= N=1
##DATA TABLE= (X++(R..R)), XYDATA
$$ [...]
19263B0399l819J722L971Q963K558n634p964l00m727j057N118k613l258L604L
19248A6966N78n654l918M575J524p15l198L590M885N98k540n628k024O436k498
19233A2977o777k716J805P169J632J953K982P273j191p647J426k225n291J054
19219A2424k93n195j877Q556J2208J441j0554k067J792j784O197j006k172n42
19205A7128k007Q163N421l184k889K04N706l599m765J63j011J946j1121R77O508
19190A7640M403k924L323K192m333p327p71N859O541j36m509l748q43Q692O129
19175C0188J085j350j013J505k368n082k036o787q285L029N763k50j188P233J0753
19160C1197N286j195j210N922R358Q927J4417J7013K4897M3867N1454M7592J9342
$$ y = [20399, 16580, 18302, 22273, 31236, 33794, 28160, 20196, 19896, 15169, 14112, 19230, 16617, 13359, 16963, 16966, 17544, 11890, 7972, 12547, 14071, 13356, 10158, 13748, 18633, 19231, 16691, 11063, 9039, 15475, 12977, 6200, 3484, 5289, 12458, 14090, 16043, 19025, 26298, 25107, 17460, 18886, 16661, 11370, 12424, 12131, 6936, 5059, 13615, 25823, 27264, 16710, 14643, 16435, 14651, 20848, 19842, 17670, 17128, 15121, 23284, 28705, 25521, 22632, 22836, 28542, 24943, 20178, 20341, 19330, 21276, 10155, 11132, 17640, 22043, 19119, 22442, 24634, 20301, 12974, 12203, 18062, 24603, 24467, 19958, 16210, 15367, 24059, 30188, 31273, 29923, 28910, 30415, 28047, 22965, 20929, 14142, 5857, 8886, 14649, 14399, 13211, 20444, 31197, 36483, 35288, 34078, 40000, 49358, 58285, 72702, 89715, 114612, 158479, 209933, 257525, 276867]
19147B76867j3830m2905n1282m2823k7489j7459j2091q835K054l491p552l452
19135D7712O439M35L343j218n522l347p323o292K330l399M784J1077M901m562
19121D9358l691M30j823k226k02q493j25R622m622J2M776O807r97o812N495K019
19105D9528n37K964j105Q061N886Q091J5342J5208J8257L5310N6428P1216O1320
19092C45969L3433P973k831k524N049m969l0107m9663n6755m7905l3959k6795
19080A36916j0798j3272m211K490J895O653J0082J4648K4308M0319N3136N3045
19068C15211K2610j1160l3220m8005m6804l8913j6437j2578l681j4021j4634q339
19056I0029o580k732l21M964R456j908m801r641o666M958n521n668j9o114r72
$$ y = [276867, 263037, 220132, 168850, 126027, 98538, 81079, 68988, 60153, 62207, 58716, 51164, 47712, 54151, 54586, 57929, 56711, 51189, 47842, 40519, 34227, 36557, 33158, 37942, 49019, 53920, 49358, 45667, 46097, 44274, 42048, 41846, 33353, 33228, 42850, 38228, 38240, 43016, 49823, 48826, 42014, 47509, 49528, 48991, 51955, 50850, 58911, 64797, 72888, 88230, 103438, 121695, 157005, 213433, 284649, 345969, 379402, 387375, 384544, 382020, 387069, 382100, 351993, 302330, 245575, 197670, 163711, 136916, 126118, 112846, 108635, 111125, 113020, 119673, 129755, 144403, 168711, 209030, 262166, 315211, 337821, 326661, 293441, 245436, 198632, 159719, 143282, 130704, 127023, 113002, 98368, 90029, 83449, 80717, 80396, 85360, 94816, 92908, 88107, 78466, 71800, 76758, 71237, 65569, 65550, 59436, 58464]
19041E8464J1210r4m371n451k518q54M420n230n212O469R38j640o40p887m893
19026D2711m095m910j473M752j810o15M311J204L486J725l750l278l131n43l413
19011C1171l755p17K57p55p43M462M150qP0K516l530l887m489m78m130k828L763
18994B1069m3M053K672P75K926j056J065k572m64K48o22k869L870k490j0528p36
18978A5298P138O394j721k008l139L019J146l848k613m279o66m165L519J0820
18964B4895O907k127r84J087k032O796k927p8l485j533L171k741J4J784m254j263
18948B3230K038k63O268M401L360K602l907o073r178J467M886l804l705M805j16
18933B6011l838o389m363M649O452M315L101m16m05J844K782l361n340l953N793
$$ y = [58464, 69674, 69580, 65209, 59758, 57240, 56386, 60806, 55576, 50364, 56833, 57771, 56131, 55491, 47604, 42711, 38616, 33706, 32233, 36985, 35175, 34560, 38871, 40075, 43561, 45286, 41536, 38258, 35127, 34584, 31171, 27416, 26699, 26956, 26201, 25458, 29920, 34070, 34062, 34132, 36648, 33118, 29231, 24742, 24264, 20134, 17306, 21069, 21026, 25079, 27751, 28526, 31452, 30396, 31461, 28889, 28425, 28673, 28051, 25182, 29052, 26562, 16034, 15298, 22436, 28830, 27109, 25101, 21962, 24981, 26127, 22279, 19666, 15387, 14721, 10556, 14075, 24895, 31802, 29675, 28691, 29778, 27746, 34542, 31615, 31537, 28052, 26519, 29690, 26949, 26963, 28747, 24493, 23230, 25268, 25005, 31273, 35674, 39034, 41636, 37729, 31656, 22478, 23945, 28831, 25027, 21322, 26127, 26011, 22173, 15784, 11421, 16070, 22522, 26837, 29938, 29522, 29117, 30961, 33743, 30382, 25042, 21089, 26882]
18918B6882K655m18O56K199j583o607K408n32K630j112q27l74J994j291J032L219
18902C0931k337l533L674J0363o12K09m08l416p1n950O495J3846j556m503J701
18887D4833K281P931O725k871j852L465K788o89J2091P739L399L730N15R772n007
18872I4850p478l485L762M549k21m988j1898k056n794l455p641p442l602L08M280
18857D9689o255o112K848J1437l600o877l944P369J1263R93L968J091n034J108
18843E7944k71N632J1245P390M669Q02R423k748Q360N290J989O952N938L073L534
18828A29222K389N06J1409K0510K6939K3972M0954P3907R1079Q2719N3814k2890
18816E34530o9947q9659p6414m5335k9613j9275j8915j9530j8282j2301j1765
$$ y = [26882, 29537, 29119, 29775, 31974, 30391, 23784, 26192, 25660, 28290, 27178, 26351, 25977, 27971, 26680, 27712, 30931, 28594, 25061, 28735, 39098, 38486, 38695, 38287, 34871, 34800, 28850, 35345, 49191, 47635, 43132, 44833, 47114, 55045, 61770, 58899, 57047, 60512, 63300, 62611, 74702, 82441, 85840, 89570, 90085, 99857, 94850, 87372, 83887, 87649, 92198, 91977, 86989, 75091, 73035, 67241, 63786, 56145, 48703, 45101, 45409, 49689, 43434, 37322, 40170, 51607, 48007, 41130, 37186, 44555, 55818, 56811, 60779, 61870, 56836, 57944, 57673, 63305, 74550, 81940, 86609, 87411, 96834, 94086, 102446, 107736, 109725, 116677, 122615, 125688, 129222, 131611, 132117, 143526, 164036, 190975, 214947, 255901, 329808, 420887, 503606, 557420, 534530, 464583, 374924, 298510, 253175, 223562, 204287, 185372, 165842, 147560, 135259, 123494]
18805A23494o112p030o607L095m028R55o843L72L205M056J770N388M140N788O60
18790A22303p222Q185k931n185l229l306M264K845n489K519O055l481J465L571
18776A20364L364J3677K8132L7076M7421P2835J16842J83611K38652K41661K00502
18765A304137K5455j37796k01668k47201j91751j13114n9162l4878k8669k2911
18755B92442k6758k9575j8681j7158r045j0063l951M60N371P994O898j277r302
18742A87355j0180j3686j4591k080J929m175q623l523p626M60Q823O925J05L718
18728A44831O036M449l555N173R379K197J2423J7994J2982K1688M5235P9323J20669
18715D78824J61563J19068L2161p5820j53814j14898n3398k9328k538K0369N4850
$$ y = [123494, 117382, 110352, 103745, 106840, 102812, 103767, 96924, 97296, 100501, 104557, 106327, 111715, 115855, 121643, 122303, 115081, 123266, 120335, 115150, 111921, 108615, 112879, 115724, 110235, 112754, 118809, 115328, 116793, 120364, 123728, 137405, 165537, 202613, 250034, 322869, 439711, 623322, 861974, 1103635, 1304137, 1329592, 1191796, 990128, 742927, 551176, 438062, 378900, 344022, 315353, 292442, 265684, 236109, 217428, 200270, 191225, 181162, 177211, 177671, 183042, 191036, 197934, 196657, 187355, 177175, 163489, 148898, 146818, 148747, 144572, 135949, 132426, 124800, 125260, 134083, 141008, 141113, 144831, 150867, 155316, 151761, 156934, 166313, 168510, 180933, 198927, 211909, 233597, 278832, 358155, 478824, 640387, 759455, 791616, 715796, 561982, 447084, 393686, 364358, 361820, 382189, 437039]
18704D37039J04320J53987J48146O9485k8729j52249j58947r4985m9827k6720
18694D01520j8331j0360j0343k035q867j5590j6247j5483o989N014R34R044O537
18681C18804j282j135O36N808K004K291J0326N812K727P354Q067J0805K3027K4049
18667D19293K9128L6142O7378Q3736J03025Q6956J7147l2110q1194p6343m4289
18656F08869j0505J6301L3445O2859J06307J20653J20602O9514J0770m9077o6198
18645A023540K132O1436P5207O6458L4920J3179K807J8882M2391N9660Q2365J01667
18633A584644J46555K17133K94810L96473N14561O53974Q50149J163544J690694
18624G512537K685407M485095P470506J0244390J0192509P101725o11223p004910
$$ y = [437039, 541359, 695346, 843492, 912977, 884248, 731999, 573052, 478067, 428240, 401520, 383189, 372829, 362486, 360451, 351584, 335994, 319747, 304264, 297275, 302289, 303223, 312267, 318804, 317522, 316387, 317023, 322831, 324835, 327126, 337452, 343264, 345991, 353345, 361412, 372217, 395244, 419293, 448421, 484563, 551941, 635677, 738702, 825658, 842805, 810695, 729501, 653158, 608869, 598364, 614665, 648110, 710969, 817276, 937929, 1058531, 1128045, 1138815, 1089738, 1023540, 1025672, 1087108, 1162315, 1228773, 1263693, 1276872, 1279679, 1298561, 1340952, 1400612, 1482977, 1584644, 1731199, 1948332, 2243142, 2639615, 3154176, 3808150, 4658299, 5821843, 7512537, 10197944, 14683039, 22153545, 32397935, 42590444, 49692169, 49080946, 42076036]
18616D2076036j0187451r369221n841088l399056k089876j356272r42816p06344
18608H183912n75718n07859m53984m41150l97511l25094k53665j78621j05850
18599D944460m8560j4485J7161N2706M0533J1675l4400m9938k4526J2188P1473
18588D978287R1356P6750O8792O9723J26363K19122L31608M63921O27466Q64075
18578G917463J263358J944486L099948M984758P571984R849487J0220511P638704
18570E4490699K410922k917097n355338l548699J909338P136879R009331N805519
18562F8941554k280507q435347j2037068r756416n005684j458269J545892M754714
18554C6268869P789070Q981082P094696K037122m401555q854963r870891q213325
$$ y = [42076036, 31888585, 22519364, 16678276, 13279220, 11189344, 9833072, 8890256, 8183912, 7608194, 7100335, 6646351, 6205201, 5807690, 5482596, 5228931, 5050310, 4944460, 4895900, 4881415, 4898576, 4951282, 4991815, 5003490, 4969090, 4919152, 4894626, 4906814, 4978287, 5069643, 5146393, 5215185, 5284908, 5411271, 5630393, 5962001, 6425922, 7053388, 7917463, 9180821, 11125307, 14225255, 19210013, 26781997, 36631484, 46851995, 54490699, 56901621, 53984524, 48629186, 45080487, 46989825, 54126704, 63136035, 68941554, 66661047, 58225700, 46188632, 36432216, 31426532, 29968263, 31514155, 36268869, 44057939, 53039021, 60133717, 62170839, 57769284, 48914321, 39043430, 30830105]
18546C0830105n591189l516305k312595j655471j301796j115915r53069q33683
18538A3550082p06409n88500n02778m18519l74140l71715l95483m32179m28831
18529I331528m05764l64974l25489k89079k66562k44023k59989k89795l15577
18520F570276l20413k97660k57650k18955j78928j61141j56670j52729j44340
18511D681790j39960j30468j25894j14360j06384p8497n5093m5572n1919q9209
18501C744434j19582j36698j28177j23241j18067j00762r0131q5725p8332q4147
18491B679572q0174p2682o9574p5234o8234o4043o1818n2545l4701k2100p931
18480B070536j9697m5445q0734j00509q0038o8650o3615m9916n1401n2655m1387
$$ y = [30830105, 25238916, 21722611, 19410016, 17754545, 16452749, 15336834, 14383765, 13550082, 12843673, 12255173, 11752395, 11333876, 10959736, 10588021, 10192538, 9760359, 9331528, 8925764, 8560790, 8235301, 7946222, 7679660, 7435637, 7175648, 6885853, 6570276, 6249863, 5952203, 5694553, 5475598, 5296670, 5135529, 4978859, 4826130, 4681790, 4541830, 4411362, 4285468, 4171108, 4064724, 3986227, 3931134, 3885562, 3833643, 3744434, 3624852, 3488154, 3359977, 3236736, 3118669, 3017907, 2927776, 2842051, 2763719, 2679572, 2599398, 2526716, 2457142, 2381908, 2313674, 2249631, 2187813, 2135268, 2100567, 2078467, 2070536, 2050839, 2005394, 1924660, 1824151, 1744113, 1675463, 1611848, 1561932, 1510531, 1457876, 1416489]
18469A416489l8925l1242l6338l9991m0051k9907l0201l0134l2946k6057k0357
18458A060340j9021j7585j1731j5719j2987j8889k6258l1518j6430j8936k3736
18447H47530j7467k7374k2387j1581q283j7763j1269j7582k0844k2592j8305j4739
18435F37344o968j3798k6390k0200j7904k5989k5723k6842k6693k9805k6708k0213
18423C70111j2694l358o182j0280j9841j7161l123m633p579j0644q980K530P474
18410B75640M920j82j0547j0705n671q965j936Q354J0339l89l474l19m195j3889
18396B38981j1650o043r212l883o025K996P549M318K54m996J84k534l029p21N98
18381B06787r356j412j987n992m185k448k016l070r220n843J407j648K457P949
$$ y = [1416489, 1377564, 1346322, 1309984, 1269993, 1229942, 1200035, 1169834, 1139700, 1106754, 1080697, 1060340, 1041319, 1023734, 1012003, 996284, 983297, 964408, 938150, 906632, 890202, 871266, 847530, 830063, 802689, 780302, 768721, 760438, 742675, 731406, 713824, 692980, 670388, 652083, 637344, 630376, 616578, 590188, 569988, 552084, 526095, 500372, 473530, 446837, 417032, 390324, 370111, 357417, 354059, 347877, 337597, 317756, 300595, 297472, 292839, 285260, 274616, 265636, 268166, 275640, 280560, 280378, 269831, 259126, 253455, 244490, 242554, 250908, 261247, 260858, 257384, 257065, 252870, 238981, 227331, 221288, 212076, 208193, 202168, 205164, 212713, 217031, 217285, 212289, 212473, 209939, 206910, 206189, 206787, 197431, 196019, 194032, 188040, 183855, 181407, 179391, 176321, 167101, 161258, 162665, 161017, 163474, 171423]
18367A71423K016K345n262p101k291l452r924j5048Q68M579m034M609P236J0755
18353A56719J4323J6752J1080P130J0044K004j0963j8235j9766j3651j0070j3116
18341A32251l568n496p55L94o338m021J439m101m599J104L311k122M936K996j540
18326A13891M87P135J264n253m259K745l265Q21J913M99j832M506J94l359j235
18311A14252j360k96M38K870K912L092j075l843k636J0194O305Q069J1360M970
18297A55252r883j2740j7891k2078j1683o470p350J706k089M191q10q679r079
18284E2397k135k999P561n36r302n931J990J150K170l074l967q640r39J297J908
18269C0950P147n88o765L002k274K178P811m008m480k764L874O990N363R97j0459
$$ y = [171423, 173439, 175784, 170522, 163421, 161130, 157678, 147754, 132706, 133574, 138153, 134119, 138728, 145964, 156719, 171042, 187794, 198874, 206004, 216048, 218052, 207089, 188854, 169088, 155437, 145367, 132251, 128683, 123187, 122432, 122826, 116488, 112467, 113906, 109805, 105206, 106310, 109621, 107499, 112435, 115431, 113891, 114378, 121513, 122777, 117524, 113265, 116010, 112745, 113566, 115479, 115978, 114146, 118652, 118846, 115487, 114252, 112892, 112596, 113034, 115904, 118816, 121908, 120833, 116990, 114354, 124548, 130853, 138922, 150282, 155252, 145369, 132629, 114738, 92660, 80977, 74507, 67157, 68863, 66774, 70965, 70155, 61476, 52397, 50262, 47263, 54824, 54288, 44986, 39055, 41045, 42195, 44365, 41291, 37324, 28684, 27745, 29042, 30950, 38097, 37509, 30744, 33746, 31472, 33650, 41461, 37453, 32973, 30209, 34083, 41073, 46436, 47433, 36974]
18254C6974m131M853k391n768K242M042L336Q431k56m099L052J309o65k838l793
18239D0298l267j069Q657K167q981r188O758J078q986M317K390n363P309J0144
18225D6264j251n363k328j882m732K323K709N042R950K95J229P637K497J1463
18211G3853J6201K3519L2256L4957J6351r551k2307k8672k2754k2466j6355p779
18199F7253K909J754l698J959N596m702R920J3077J2752K9152K6643J3678J926
18186A78219k1736k3676j7317j7254p337o177o184q097k541K550N943m021j0922
18173F1450l266M917n408M58L444Q100K114l933k167o919n836K544R83J0510N510
18158G2501P864M975O70M404J2243K0630K8538J8594L947q685k1501j9214j3977
$$ y = [36974, 32843, 37696, 35305, 29537, 31779, 35821, 39157, 47588, 47332, 43233, 46285, 47594, 46929, 44091, 40298, 37031, 35962, 44619, 46786, 37805, 28617, 35375, 36453, 27467, 31784, 34174, 28811, 36120, 46264, 45013, 39650, 37322, 35440, 30708, 33031, 35740, 40782, 50732, 51027, 52256, 59893, 62390, 73853, 90054, 113573, 145829, 180786, 197137, 187586, 165279, 136607, 113853, 91387, 75032, 67253, 70162, 71916, 68218, 70177, 75773, 71071, 80991, 94068, 106820, 135972, 162615, 176293, 178219, 156483, 132807, 115490, 98236, 90899, 84722, 78538, 70441, 67900, 70450, 76393, 72372, 61450, 58184, 63101, 57693, 58151, 61595, 69695, 71809, 67876, 65709, 58790, 52954, 55498, 56481, 66991, 72501, 80365, 85340, 86010, 90414, 102657, 123287, 151825, 170419, 174366, 165681, 144180, 124966, 110989]
18145A10989j0429n354o459o38n20J322P186K480M567J2485K0308L1448L0263
18132A97648K1629M135r021j5323j8465j2852J618O350J1308N791J9512K1180
18120B33510K3618L3836M6902O8410R4203J43998K10108L29079N59807R94893
18110B738364J715239J944998J033672K2421j612011k044342j205176o49464l86856
18101A556845k48369j57001j11962r1310q1341p1451n7872m5086l2574l3433k4288
18090F02158j6549q083M582J1617J8716K3075K693l5489m2140n7676m9281l3245
18078D20378k1354m177J057p033j1854j3733j1393j2363p574n380r126j6474k2680
18065B78294o823m001p852o374N533J2047M34M266k895n868Q999L0650M3134M1852
$$ y = [110989, 100560, 95206, 88747, 88109, 87589, 88911, 96097, 98577, 103144, 115629, 135937, 167385, 197648, 219277, 223412, 214391, 199068, 180603, 167751, 169369, 175719, 187027, 192818, 212330, 233510, 257128, 290964, 337866, 406276, 500479, 644477, 854585, 1183664, 1743471, 2738364, 4453603, 6398601, 7432273, 7454694, 5842683, 3798341, 2593165, 1943701, 1556845, 1308476, 1151475, 1039513, 948203, 866862, 795411, 737539, 692453, 659879, 626446, 602158, 585609, 577526, 582108, 593725, 612441, 635516, 638209, 602720, 560580, 502904, 453623, 420378, 399024, 394847, 395904, 388871, 377017, 363284, 351891, 339528, 331954, 326574, 317448, 300974, 278294, 271471, 267470, 259618, 253244, 258777, 270824, 271258, 275524, 272629, 266761, 275760, 306410, 349544, 391396]
18051C91396L3734J3413j0137k3154m1458n2411l3160k7631j9125r731j375l755
18039B16606j582o233N262J8411L2455N1308P3567R1961R4898P5749L1442l6593
18027F47251q0227r3273q3413n5408l8845l2323k2744j2847j1286m850r565n782
18015A96688q468j0018q442j1997o865j1154r43J776m54o921p79j566n679K489
18001A27667k910j386j518j6164q767j595j752J145N7q16l685J001J983m783q104
17986H0373k401m008o037o153m825J213p38n0J690k912j530l77n198n800n239
17971C8008p183N030P427M31P24j717m870m646J167p76l49M159j26m523R19j901
17955C1774N222K856P300O490j829O546n933n92j823q148K356J070M871m199j2123
$$ y = [391396, 425130, 438543, 428406, 405252, 363794, 311383, 278223, 250592, 231467, 221736, 220361, 216606, 215024, 208791, 214053, 232464, 264919, 316227, 389794, 481755, 576653, 652402, 683844, 647251, 567024, 473751, 390338, 334930, 296085, 263762, 241018, 228171, 216885, 212035, 202470, 196688, 188220, 178202, 169760, 157763, 150898, 139744, 138801, 140577, 140123, 133202, 132423, 130857, 125178, 127667, 124757, 123371, 121853, 105689, 96922, 95327, 93575, 94720, 94777, 93961, 90276, 91277, 93260, 88477, 80373, 77972, 73964, 67927, 61774, 56949, 58162, 57424, 57374, 59064, 56152, 54622, 54245, 49047, 43247, 38008, 30825, 35855, 43282, 43713, 44437, 42720, 37850, 33204, 34371, 33595, 33246, 37405, 37279, 32756, 33675, 31774, 36996, 39852, 47152, 53642, 51813, 58359, 52426, 51834, 50011, 41863, 44219, 45289, 50160, 45961, 33838]
17940C3838m588M901O342p01l46m850K70m27J495L494K842O718l610n231k029
17925C8118N89k467o487m893k168M52J353K900K087J882n950l720P160L531j897
17910C0490k726j116L885k376J523o14j1320j206K091L711P151M022M647N330
17896D3492J1209P59n758n819m110m582Q05N45L387J133o81n841q476l027K50
17881B3286j901J500J584n47j274K565R350M078m907r19K422K856K26L515M284
17866D6118j846p868j0191q882L057K374l181l111n778j062K200O037M615j737
17852B0745k261M133J963M448K832J105M012q881j019k800n436J952L971K799
17838B7563o47K941l642K059L751M051K414m169K0o41J53k183k331L68P186P629
$$ y = [33838, 29250, 34151, 40493, 39792, 39446, 34596, 34866, 34439, 35934, 39428, 42270, 48988, 45378, 40147, 38118, 38707, 36240, 29753, 24860, 22692, 23144, 24497, 27397, 29484, 31366, 25416, 21696, 28856, 32387, 30490, 27764, 26648, 30533, 28157, 29680, 29066, 17746, 16540, 18631, 22342, 29493, 33515, 38162, 43492, 54701, 55460, 49702, 43883, 39773, 35191, 35996, 36541, 39928, 41061, 40380, 34539, 26063, 23036, 23286, 21385, 22885, 24469, 23922, 22648, 25213, 34563, 38641, 33734, 32815, 35237, 38093, 38319, 41834, 46118, 44272, 36404, 26213, 17331, 20388, 22762, 19581, 16470, 10692, 9630, 11830, 17867, 22482, 20745, 18484, 22617, 24580, 29028, 31860, 32965, 36977, 28096, 27077, 24277, 18841, 20793, 24764, 27563, 26916, 29857, 26215, 28274, 32025, 36076, 38490, 34321, 34341, 33700, 33853, 31670, 29339, 29707, 36893, 44522]
17822D4522p3K657Q596M185L288o220l887j699N021Q482O521m490q021j0247r815
17807C8820J153J0562L106N376L077n95N847K277n052p692L790J61J842p87q992
17792E2893R51j261M880J029O79K247Q492l2j18M970K861j298J348k9q57K818
17776G9573l062j491j686O2n81k14K734M776J2991J2314O308j469k623r56K492
17761A09168N726L474o061o91k08L343j395n697m994L218N196J6702J7711J0660
17747A56152O390M859R478M302j307m02M466P081J8315R222k823k717P881J4233
17733B35130P502K0547M0298M8152L7331J9507N592r032j0984q533q78K1706J4472
17720D20810K6554L5614L8093M6037M6968N3721O8679Q6799J09920J18779J14640
$$ y = [44522, 44449, 47106, 55702, 59887, 63175, 56955, 53068, 51369, 56390, 64872, 71393, 66903, 58882, 48635, 38820, 39973, 50535, 53641, 59017, 62094, 61499, 67346, 69623, 64571, 56879, 60669, 60830, 62672, 61885, 52893, 53844, 52583, 57463, 58492, 59171, 61418, 69910, 69878, 69760, 74730, 77591, 76293, 77641, 77612, 76755, 79573, 76511, 75020, 73334, 73396, 72815, 72601, 75335, 80111, 93102, 105416, 111724, 110255, 107632, 106676, 109168, 114894, 118368, 112307, 111616, 111408, 114751, 113356, 107659, 102665, 105883, 111079, 127781, 145492, 156152, 162542, 167401, 176879, 181181, 179874, 179472, 183938, 191019, 209334, 218556, 215733, 213016, 220897, 235130, 242632, 263179, 303477, 351629, 388960, 408467, 414059, 405027, 394043, 385510, 384632, 406338, 420810, 447364, 482978, 521071, 567108, 614076, 667797, 736476, 823275, 933195, 1051974, 1166614]
17709A166614J07166R2358R0794J12760J67214K46503L53354M79520O84696J040200
17699D541179J639693K698458M409406O256410O326058L768894l64318m772290
17691B4503490o327626m831427k966134j740031j016022n84625l43235j75951
17683F518439p931K02069N00589J002234J815264L139719M945544O034950M693077
17674B8843954J378852k926786o010668n655250l769476k320186j452236r38000
17666G150204o33622m77513l83211l26787k69805k12249j72792j40844j33724
17657D399657j38011j24361j08543q3613n9200l6748j8145J9652P7387J54895
17647D082970K66257L97154O08681R66502J593201K664278M268566N678713N139049
$$ y = [1166614, 1273780, 1366138, 1456932, 1569692, 1736906, 1983409, 2336763, 2816283, 3500979, 4541179, 6180872, 8879330, 13288736, 19545146, 25871204, 29640098, 29275780, 24503490, 18175864, 13344437, 10378303, 8638272, 7622250, 7037625, 6694390, 6518439, 6510508, 6712577, 7213166, 8215400, 10030664, 13170383, 18115927, 24150877, 28843954, 30222806, 27296020, 21285352, 15630102, 11860626, 9540440, 8088204, 7150204, 6516582, 6039069, 5655858, 5329071, 5059266, 4847017, 4674225, 4533381, 4399657, 4261646, 4137285, 4028742, 3945129, 3885929, 3849181, 3831036, 3850688, 3928075, 4082970, 4349227, 4746381, 5355062, 6321564, 7914765, 10579043, 14847609, 20526322, 25665371]
17638B5665371K432152j422817m950619n533929l910606k372454j423874q45897
17630G637327m81792k52338r1541N6576K35198N23414J016399J828632L141324
17621A3613199M776704N344383L565644K56866l618162n704070m757162l028485
17613A0448917j848142j167527p81469n51221m27648l64506l16773k77665k37320
17604D476646k03492j85764j97636k04268k07239j98175j68501j52365j29201
17595B830005j05998r0005q4492p6771p3573p7913p0752n4655m6467k8601l6393
17584B084385n8760o4951o9976p1719o4556n7753o0814n9005n1995n1403m5199
17573A428254n1167m2108l1242k7901l4137l2026k9179l2319l3861l3945l8056
$$ y = [25665371, 28097523, 26674706, 21724087, 16190158, 12279552, 9907098, 8483224, 7637327, 7155535, 6903197, 6811656, 6868232, 7103430, 7626844, 8643243, 10471875, 13613199, 18389903, 23734286, 27299930, 27556796, 23938634, 18234564, 13477402, 10448917, 8600775, 7433248, 6651779, 6100558, 5672910, 5308404, 4991631, 4713966, 4476646, 4273154, 4087390, 3889754, 3685486, 3478247, 3280072, 3111571, 2959206, 2830005, 2724007, 2634002, 2549510, 2472739, 2399166, 2321253, 2250501, 2195846, 2149379, 2120778, 2084385, 2025625, 1960674, 1890698, 1818979, 1754423, 1696670, 1635856, 1576851, 1524856, 1473453, 1428254, 1377087, 1334979, 1303737, 1275836, 1241699, 1209673, 1180494, 1148175, 1114314, 1080369, 1042313]
17562A042313k3861k2665l1361k3434k2030k8006k9496l0075k9088k7021j8689
17551G56587k3100j3422j0989k3057j8087k0928j8440k7899j6854j5141j2916
17540E55754j2558j1397k1523j8863j7319j6657j5195j4172j4757j5487j0302
17529C87524j0163r396J056M73r950q894p102m332n625p368J414K592m336j8350
17515C07543j5761j2903j0313L655k614o583l100n633p29L504R23K603M902m650
17501B60844J0707L3666K6760J4623K352j4964k2564l2985k9258k1629j0978j5757
17489B00817j3611l421p138M61p893j3566j7850p493m554o291l123p450p967o339
17475I4582m384j134j907N501J624m48N983Q74m942n345L357l590o924k109J95
$$ y = [1042313, 1018452, 995787, 964426, 940992, 918962, 890956, 861460, 831385, 802297, 775276, 756587, 733487, 720065, 709076, 686019, 667932, 647004, 628564, 600665, 583811, 568670, 555754, 543196, 531799, 510276, 491413, 474094, 457437, 442242, 428070, 413313, 397826, 387524, 377361, 367965, 369021, 369494, 359544, 350650, 343548, 339216, 333591, 326223, 327637, 330229, 325893, 307543, 291782, 278879, 268566, 272221, 269607, 263024, 259924, 254291, 253562, 257066, 257989, 260592, 265494, 260844, 271551, 305217, 331977, 346600, 348952, 333988, 311424, 278439, 249181, 227552, 216574, 200817, 187206, 183785, 176647, 177108, 169215, 155649, 137799, 130306, 125752, 119461, 116338, 108888, 100921, 94582, 90198, 89064, 87157, 92658, 94282, 93834, 99817, 100691, 95749, 90404, 93761, 90171, 83247, 81138, 81333]
17460H1333m250l451O141N992n31L568R633J953k110j699L158N692o1Q735J5500
17445A29603J8588K7762M7610K5096J6145m732k7466l0518l3724k8290j4061r570
17433A16443r444k558J152P598o324r298m901n266j0523o364r582N68L145j63
17419F4483n780n583k636K383k703J352k942J431N539L326K765m462R36k303j766
17404E4040l916j0628l755l961J0395P138r299j955L322K023J848j59m689J259
17390D1663L580N223m88j1975l333m380O10K347m455M254J868J158k835J70J24
17375C3531r73j444p98R77K110J834K427p47j871l880j0794m727K036P750j909
17360B3522l087p13n39m344r97K805k4P15k958k917L475N123N162p93k786j212
$$ y = [81333, 77083, 73632, 79773, 85765, 85234, 88802, 98435, 100388, 98278, 96579, 99737, 105429, 105368, 114103, 129603, 148191, 175953, 223563, 248659, 264804, 260072, 232606, 202088, 168364, 140074, 126013, 116443, 106999, 104441, 105593, 113191, 106867, 97569, 92668, 87402, 76879, 70515, 60933, 61501, 64646, 64483, 58703, 53120, 50484, 52867, 50164, 51516, 48574, 50005, 55544, 58870, 61635, 57173, 58109, 55806, 54040, 50124, 39496, 35741, 31780, 42175, 49313, 40014, 38059, 41381, 43404, 45252, 45093, 40404, 41663, 45243, 50466, 49978, 38003, 34670, 30290, 30900, 33247, 28792, 33046, 34914, 36072, 33237, 33407, 33531, 32558, 31114, 30316, 31293, 33403, 35237, 37664, 36917, 35046, 31166, 20372, 15645, 17681, 25431, 23522, 20435, 19722, 19183, 14839, 13842, 16647, 16623, 17338, 14380, 11463, 14938, 20061, 25223, 24430, 21644, 20432]
17344B0432m888n138o565j742j796p474K485K617j480m56K49P52N752N523k650
17329E621k49O171j426j421o325J995J4389M689j1047L64Q451k93r993j032K057
17314A1951O5m870l021n952r32J0318L789K306m952m54k331k22j916M237L811
17299A1827k207m314m058N05K760k663j829J649O855k27m11O422K810O11K93P31
17283A8754J649n95N220N76n737o714K169P20K98n019m638N11o692l33K541L314
17267F024o786k836N39K327j625k654M362Q325o01k39K227l666Q02O689J523n202
17251I209j264m51k946o170p030O856P907k117q648N744K071M295L172q258o220
17236c850K819P51N24R335J099k542P42l39p782k641l422J5n47k66K569J0206
$$ y = [20432, 15544, 10406, 3841, 2099, 303, -7171, -4686, -2069, -3549, -4005, -3756, -3004, 2748, 8271, 5621, 5372, 11543, 10117, 8696, 2371, 4366, 18755, 23444, 12397, 12761, 21212, 20919, 10926, 9894, 11951, 12016, 7146, 4125, -1827, -2759, 7559, 11348, 13654, 8702, 8248, 5917, 5695, 3779, 8016, 11827, 9620, 5306, 1248, 1753, 4513, 1850, 21, 1670, 8525, 8298, 7887, 14309, 17119, 17730, 18023, 18754, 20403, 19808, 25028, 25604, 19867, 13153, 15322, 16042, 16340, 11321, 6683, 7194, 502, 169, 2710, 6024, -762, -3598, -3059, -732, -2357, -5011, -649, 7676, 7075, 6836, 9063, 5397, 6199, 12888, 14411, 9209, 7945, 7494, 4548, -1622, -8652, -1796, 6111, 3994, -4654, 1090, 3161, 7456, 10628, 2370, -3850, -1031, -280, 244, 9579, 10678, 8136, 8878, 8539, 757, -1884, -5306, -5291, -5838, -6104, -3535, 6671]
17220F671M821n042k955O845N978m22r708j470l768n263k769m769l168N23Q409
17205f087Q716l521o34K427O041p56p716j670J488J528L007J122J143J931L361
17190A0380j0287n57K961J938J2671J0390M176n617L365O97M213J1072J8160L3744
17176I7306L7336J6982K191j7145l3571l0167j7840j0143r934o540O193J760O086
17163D2514J1261m2L600N832Q852K2083K8151K4256J6006o824k4433k9601k3376
17150G8279j1720q547j1447j4287rJ167L756j757j652j0471n724n93l50K966j573
17135A8038q4k979J411k448K792R70J496k747N207K957M603J1289J8715J9625
17121G8845K8237K2448J8934L557j8821l2032k8965j2185q700n263l641m493M092
$$ y = [6671, 11492, 6450, 3495, 10340, 16318, 15896, 6188, 4718, 950, -4313, -7082, -11851, -15019, -14496, -6087, 2629, -892, -1526, 901, 6942, 6186, -1530, -3200, -1712, -184, 2823, 3945, 5088, 7019, 10380, 93, -464, 2497, 4435, 17106, 27496, 31672, 26055, 29420, 30117, 34330, 45402, 63562, 97306, 134642, 151624, 153815, 136670, 103099, 72932, 55092, 44949, 35015, 28475, 34668, 36428, 42514, 53775, 53733, 57333, 63165, 72017, 94100, 122251, 146507, 162513, 155689, 131256, 101655, 78279, 66559, 58012, 46565, 32278, 32269, 33436, 37192, 35435, 33783, 23312, 17588, 16995, 16645, 19611, 18038, 17954, 14975, 16386, 13938, 16730, 17700, 19196, 16449, 21656, 24613, 29216, 40505, 59220, 78845, 107082, 129530, 148464, 152021, 133200, 101168, 72203, 60018, 51318, 46055, 42414, 37921, 42013]
17108D2013J800m207M321J1449P423J0988J6364K2901K3280J5077j4692k3302
17096A13415k9602k1638j5098m734j158Q71o266o858n892j686L026o954j653Q434
17082B4207j678p462o23m875J697M41k385o081J601O710q62M549J006m417r578
17067B250J291L541j176m437K73K853j82n295K800J165L016j733r696l472o22
17052i424K140J2511j884p67M70k188r23j36l317o64n90M709K679p190n753r10
17036a1237M46R43N69L552J4691k225l388m37k318l336j467k350k471n6K306P913
17020A135q62l955j412j217L694k92j53J381r70K409k504M742J0621o927j816
17005C874j240p578l878N511K094j7l247j992J730P15R056K4o076l496q53O453
$$ y = [42013, 43813, 39606, 43927, 55376, 62799, 73787, 90151, 113052, 136332, 151409, 136717, 113415, 83813, 62175, 47077, 42343, 41185, 42056, 35790, 28932, 23040, 21354, 24380, 17426, 15773, 24207, 22529, 15067, 14444, 9569, 11266, 11707, 9322, 3241, 4842, 11552, 10690, 15239, 16245, 11828, 2250, 3541, 7082, 5906, 1469, 1742, 4595, 4413, -882, 1918, 3083, 6099, 4366, -5330, -8802, -9424, -7284, 5227, 3343, 2576, 3046, 858, -65, -201, -3518, -4182, -4772, -63, 2616, -4574, -10327, -11237, -10791, -9848, -9279, -5727, 8964, 6739, 3351, 2914, 596, -2740, -4207, -6557, -9028, -9084, -6778, 1135, 273, -3682, -5094, -6311, -2617, -2909, -3062, -1681, -2651, -242, -2746, 1996, 12617, 5690, 3874, 2634, -4944, -8822, -3311, -1217, -1234, -4481, -6473, -4743, -4028, 5028, 5052, -1024, -4520, -5373, 1080]
16989A080K188j0076j316M556j608p557M32q72j006o82P212K878J979n056j097
16974h945O354M989M495j401m331q643L012P087o15m611j411O17M179k124O59
16959f89M730p688k845K362M737O656l656p894j573j901j512n51O50m217k970
16944a6361J806k029l229N204P506P72k870j064L958R910l739r496k902k629K867
16929a2296Q344Q112j18j1082j336J118J337K011l83l189L836P001l569n906m124
16914a0244K09K629l27k956N20K248m57o00K728M310J637Q60Q521K729o111j255
16898D441r41k086j563o104j826N226K029J119N857k338o088k690L918M39l604
16883d211n932k28O581L28L94M038J688k738m502o418O092R794M19m226n792j965
$$ y = [1080, 3268, -6808, -8124, -3568, -5176, -12733, -12301, -13173, -14179, -14861, -7649, -4771, -2792, -7848, -8945, -2591, 2398, 6893, 5492, 1161, -7482, -4470, 2617, 2002, -2609, -4020, -3403, 776, -1348, -689, 4041, -3647, -6492, -4130, 607, 7263, 3607, -4287, -5860, -7761, -9273, -9824, -9174, -13391, -16361, -14555, -16584, -19813, -14609, -7103, -6331, -9201, -10265, -6307, 3603, -136, -9632, -12534, -15163, -12296, -3952, 4160, 4042, -7040, -8376, -7258, -5921, -3910, -4293, -7482, -3646, 3355, -214, -6120, -10244, -10035, -7406, -7733, -10689, -10169, -7921, -8378, -8978, -6250, -1940, -303, 557, 9078, 11807, 5696, 4441, 3500, 1414, -149, -6253, -8079, -2853, -824, 295, 6152, 3814, -2274, -4964, -1046, -607, -4211, -10143, -10371, -3790, -3462, -3068, 970, 2658, -80, -4582, -11000, -4908, 4886, 5305, 1079, -4713, -6678]
16867f678L94J794M04M247M382n099j0769R5K667N364qq67n07M665K070m371L517
16850A300l81n174j976l359L416k605p20N242J089j818J287j615K916j410M953
16835A145J311o246m503L82l575m332N487O262m267j266M057K595N266l10K421
16820D427J610n499j932j910O35j818K8K158K667k307o615k720J589O548K659
16805d80n050o54q120j404q09M531K153M45O073P685K415l307m024m643k942R52
16789g179Q34P561K557m468l178l202k235M672J277O566l288k576p81J526K18
16774a696n995J919P067J0138j230o005M11n026p855p857K778J1018l269l392
16760h994M01K145j564Q610Q570M33K984j266m772o011n765L570M42q74K518L553
$$ y = [-6678, -6284, -4490, -4086, 161, 4543, -556, -11325, -11230, -8563, -3199, -3207, -4074, -4581, 84, 2154, -2217, 1300, 919, -4255, -6231, -9590, -6174, -8779, -9499, -4257, -3168, -4986, -3699, -5314, -2398, -3808, 1145, 2456, -3790, -8293, -7911, -11486, -15818, -10331, -4069, -8336, -9602, -5545, -2950, 2316, 2006, 4427, 6037, 538, -1394, -3304, -2669, -4487, -4459, -2301, 366, -1941, -8556, -11276, -9687, -3139, -480, -5530, -6184, -14304, -15708, -16517, -11986, -9833, -9388, -3315, 4370, 6785, 3478, -546, -5189, -8131, -7179, -6345, 1216, 3773, -695, -3873, -7075, -9310, -4638, -3361, 3205, -83, -2659, -3440, -1914, -1696, -7691, -5772, 1295, 11433, 10203, 4198, 4609, -417, -8272, -16129, -13351, -2333, -5602, -8994, -8593, -6448, -8012, 598, 9168, 9601, 12585, 11319, 6547, 536, -5229, -1659, -1217, -2091, 427, 3980]
16744C980N865Q42J8M81k633p760N98l789j303l059N85L878L830L69m106p57l957
16727f918m99O367J1550O489n044l876m365k290p572N739J2204J950r883m447
16713e95l959M557R73n152m214K721M097k230o360O522N725K29o265m1k885J965
16697d912K610J575L951j197p738K513l152l73N249k42n136L318N954n703j210
16682d493J620j369l6k838O892Q5q834K826L885N072L81j207J870j895J385j1157
16666g813m506L128M749j407p89M205K658M232M13n447m779j3420P386M546L607
16651c237J168M4Q333O598k390r905o310J186O139O548m779n799j605k312M662
16636a659K418n530m293k477L016p57L915n746r54K529L972j534m106l007m08
$$ y = [3980, 9845, 10687, 10705, 11186, 8553, 793, 1391, -2398, -3701, -6760, -6175, -2297, 1533, 1902, -2204, -2961, -6918, -7417, -1050, 10500, 16989, 11945, 8069, 3704, 1414, -6158, -419, 11785, 13735, 3852, -595, -4554, 3, 976, -4176, -8390, -5669, -1572, -3802, -10162, -3640, 2085, 2314, -3951, -3992, -6877, -4912, -2302, -727, 3224, 2027, -5711, -3198, -6350, -6723, -1474, -1716, -6852, -3534, 2420, -3283, -4493, -2873, -4242, -4278, -7116, -224, -139, -8973, -6147, -2262, 2810, 3191, 1984, 3854, 1959, 3344, -7813, -12319, -9191, -4442, -5849, -6638, -2433, 225, 4457, 4870, -577, -5356, -18776, -11390, -6844, -3237, -2069, -2025, 6308, 12906, 10516, 611, -5699, -4513, 1626, 8174, 3395, -2404, -4009, -6321, -1659, 759, -4771, -9064, -11541, -8525, -9282, -5367, -11113, -12067, -9538, -5566, -7100, -11206, -14213, -14621]
16621a4621O452N240L041O42n124j48J448m806J189N094Q23p80o58J804L100j640
16605A056m405N03j699K689j933N925M2K663n540q006L131M245M042k860O78O94
16589A225j321r39l145R8O856k515k861L74N070P375l560l174q513k558K935N324
16573F71J637L191o751K559o515k746K403M409k371N312m263j902K075j079L821
16558D51l583K858M163l867O080r41J362J613m86l064j630m421o780K257L874
16543b114k076K068K842P99j806J203N37m601p976l879K15K508P161J601K72M675
16527A429O711m678l146J803n195L6L85q8m260m262K082N384K965l673j473L058
16511b922p0j555N87L733j426k025j265M12J358q22Q691L05q33nl098o539j055
$$ y = [-14621, -8169, -2929, 112, 754, -4370, -4518, -3070, -7876, -6687, -1593, -770, -1550, -2208, -404, 2696, 1056, -3349, -2846, -4545, -1856, -3789, 2136, 2178, 4841, -699, -8705, -5574, -1329, 2713, -147, 531, 1225, -96, -1035, -4180, -4082, 2774, 259, -2602, -2228, 2842, 10217, 6657, 3483, -5030, -7588, -4653, 671, 2308, 5499, -1252, 1307, -5208, -7954, -5551, -1142, -3513, 1799, -2464, -4366, -2291, -3370, 451, -3132, -274, 3889, 22, 6102, 5161, 6523, 8136, 7650, 4586, 2956, -1465, -8245, -5988, -2114, -4190, -2122, 720, 1519, -287, 916, 1453, -3148, -11124, -15003, -14788, -12280, -5119, -3518, -3246, 1429, 8140, 3462, 316, 2119, -3076, -3040, -2655, -2743, -7003, -11265, -9183, -3799, -834, -4507, -5980, -2922, -2992, -4547, -3960, -227, -1653, -3678, -4943, -4531, -3173, -3995, 4696, 5001, 4168, 4163, 1065, -5474, -6529]
16494f529J811k636Q09m74K253k433p146N74M625R818L151q438j1120K246N277
16479h212J307L128j924p928M717K402l271J751J0285J2276J926j6743r692M906
16465e072j406j693M237M42j928P97k742m523N180M762k305N89K045j950m383
16450g950L851J495j34K122L763k54k339n276Q49r63L97r26L743L872J45l673
16434a278m081J0070k756L425p324r2O813O35l436j788L235K198K262p61r42m549
16418A631m93n565J545P306o016q563J100L495Q82L52M213K797l93k838k388M183
16402A248m95L33r67K969J530M053r49l03m345n644L640k27j1185J13R626j608
16386b211M942K296m097n509N802R256m628q985p9L559L154n330j777K820m197
$$ y = [-6529, -4718, -7354, -6545, -7019, -4766, -7199, -14345, -13771, -9146, 672, 3823, -4615, -15735, -13489, -8212, -6905, -3777, -5701, -13629, -8912, -6510, -9781, -8030, 2255, 14531, 16457, -286, -9978, -5072, -6478, -8171, -3934, -3492, -5420, -4623, -7365, -11888, -6708, -1946, -4251, -3662, -1617, -3567, -7950, -4099, -2604, -2738, -616, 3147, 2893, 554, -4722, -3873, -4836, -4439, -5365, -1622, 2250, 2395, -1278, -5359, 4711, 1955, 5380, -1944, -2036, 4777, 5412, 1976, 188, 3423, 5621, 7883, 7122, 6180, 1631, 1138, -4427, -2882, 4424, -1592, -10155, -9055, -5560, -4678, -4326, -113, 2684, 2291, -547, -2935, 1248, 753, 1086, 119, 3088, 4618, 8671, 7722, 7419, 3074, -2570, 1070, 843, -10342, -10229, -603, -2211, 2731, 5027, 930, -4579, 1223, 10479, 5851, -3134, -3213, 346, 3500, -1830, -3607, -787, -4984]
16371d984p941Q68j439L023L836j076J763j007k363N454Q278j89m973N06m879
16356e123j1641L094K752M289J6054M258q803n251N834L005n964j121J801p53
16342B431p175l945J421p349n015o8Q762N344l091J467J636k854J864L953q89
16327c508O91Q541J634o230l696J106l631k649J998J164J883O12M866L908l701
16312B988j529k340l205N98j47J46J130N976k408k307m48L610L461J763k001o866
16296a579j488R26L42m148M460m36l55K61J307n42l38O26o860j347L014N999N218
16279E060j841l837K239M483j048r488k690J918p06L386k238R27O907K541J51
16264E764M124O843j045q65k108o214K322l083m229L322k434k715p215P31J561
$$ y = [-4984, -12925, -12057, -13496, -10473, -6637, -7713, -5950, -6957, -9320, -3866, 4412, 4223, -750, -244, -5123, -16764, -13670, -10918, -6629, 9425, 13683, 4880, -371, 5463, 8468, 2504, 1383, 3184, 2431, -4744, -8689, -7268, -14617, -19632, -19700, -10938, -5594, -8685, -7218, -5582, -8436, -6572, -2619, -3508, -2817, 5724, 7358, 1128, -2568, -1462, -5093, -7742, -5744, -4580, -2697, -2085, 2781, 6689, 2988, 1459, -881, -4086, -3488, -3635, -3489, -2359, 3617, 1209, -1098, -1546, 2064, 5525, 7288, 5287, -1579, -3067, -2141, -1799, -5947, -1487, -1923, -2278, -2017, -710, -1252, -1590, -964, -7824, -9171, -6157, -158, 5060, 3219, -618, 1621, 6104, 5056, -4432, -7122, -5204, -5910, -2524, -4762, -3835, 3072, 5613, 5764, 9888, 16731, 15686, 14821, 12713, 6499, 8821, 5738, 1509, 4831, 2397, -318, -7533, -6802, -5241]
16249e241l265J223R30L480l711j285K74o908r50k952L102J0163L246j894J540
16234b248N160J179K611l596p93J998N323m814p924o853p388L645N080K722Q791
16219B893K483j900j028O86k070n849l332K981O1R979Q04m824m504J460l275L525
16203a910K695k644n579n66l615O577M593K228k846m271j904O307P969N586o12
16188A2008K114o571r338p644M326K858R98j698l38j878m608O197M598l972n403
16173h351j808L071n71j086N545N122j560j133q431n0O821P069J8J105k450j555
16157A756j83k31L402K636m547k879K030J594j389k815J711KJ066P025k543l123
16141C512O167l537n415k061k737K243J1456L872j373j0308n849n968m238M521
$$ y = [-5241, -8506, -7283, -6353, -2873, -6584, -7869, -7595, -14503, -15453, -18405, -15303, -5140, -1894, -3788, -2248, 2912, 4091, 6702, 3106, 2313, 4311, 9634, 4820, -3104, -9957, -17345, -13700, -8620, -5898, 2893, 5376, 3476, 2448, 3134, 1064, -4785, -8117, -5136, -5075, 4904, 5708, 884, -3620, -2160, -5435, -1910, 785, -1859, -7438, -8004, -11619, -5042, -449, 1779, -1067, -5338, -7242, -935, 7034, 12620, 12008, 14122, 7551, -1787, -9431, -5105, -2247, -1249, -2947, -3285, -5163, -9771, -3574, 1024, -2948, -8351, -10159, -7088, -7659, -8745, -3200, 1922, 362, -771, -9202, -9252, -2431, 4638, 4656, 5761, 3311, 1756, 1573, 1342, 4744, 7380, 2833, -46, 1984, 3578, 2189, -626, 1085, 1087, 2153, 9178, 6635, 3512, 9679, 6142, 727, -1334, -4071, -1828, 9628, 13500, 12127, 1819, -4030, -9998, -14236, -9715]
16127i715K54j81p87N329L215Q79K108M289J263p872l50j937j495R305O153m74
16111I984p657p208Ol487l961O272N21K29L263J218j890m393j45P204Q449J187
16095I592m334q570j082m61n435l782q33j161Q864K722j95k519j668R32L515J1468
16079G053L306o740o550O687j594r872l80N377m853L466K934L215K269j990k13
16064B115m940m554l45Q348J1898l898n831k072J29M056Q27o874k739j28j154
16049e162n98P19J566L871O655j373P66K298n586p038j071O183J532J43r70k914
16033i79k896J869j166j3508l112N663P15L182j107j674M073O38R9l436n520N020
16017a2139Q800L816L722k522l133J283M588k758p447j764L541O862l990l542
$$ y = [-9715, -9461, -9642, -10429, -5100, -1885, -1006, 1102, 5391, 6654, -1218, -1568, -3505, -5000, 4305, 10458, 9984, 2327, -4881, -4875, -8362, -12323, -6051, -5530, -5301, -2038, -820, -2710, -7103, -7248, -44, 8405, 9592, 5258, -3312, -4394, -4855, -10290, -14072, -14905, -16066, -7202, -4480, -4675, -7194, -8862, -7930, -4415, 7053, 10359, 3619, -2931, 3756, 2162, -7710, -8090, -2713, -7566, -4100, -1166, 2049, 4318, 2328, 2115, -2825, -7379, -7724, 624, 12522, 8624, 2793, 721, 850, 4906, 5733, -1141, -3880, -4008, -5162, -5760, -5041, -3475, 396, 7051, 5678, 6444, 8742, 3156, -3882, -4953, 1230, 2762, 2905, 1935, -979, -3875, -2006, -3172, -16680, -19792, -14129, -13414, -10232, -11339, -13013, -8940, -8302, -8203, -11639, -17159, -12139, -3339, 477, 4199, 1677, -1456, -173, 4415, 1657, -5790, -7554, -4013, 2849, -1141, -4683]
16003d683L836k38M457j49p585m109M711j002J321R03k900r11l25L174L473J432
15987A405J076L017L863l866q870l62N44p7n85M208K120n726l492O361J46k125
15971b363K211L671n71o783k146J749k551J817j203J935N305n524p615l979L446
15956a2601L466k313L612j819m383Q346K931l304j196Q72n71R04k69m133L537
15941f921K36r77j246L261M192Q060J835j36q67m805j398n92k922j835k270L687
15925b698N87P55m669o442L144O421l053l913m104l294l17L53P361l060L850o02
15909i681n521m55R021O575L242j0005K364j61k929k408J062j63l878m734M218
15894a3453j239q10R045N301N119o791o251j71j737P641j842M273K159M049Q59
$$ y = [-4683, -847, -1085, 3372, 3223, -4362, -8471, -3760, -4762, -3441, -2538, -5438, -6349, -6674, -3500, -27, 1405, 2481, 5498, 9361, 5495, -3375, -3737, -3193, -3270, -3855, 353, 2473, -3253, -6745, -384, -238, -2363, -152, 3519, 2948, -3835, -5981, -4232, -6783, -4966, -6169, -4234, 1071, -4453, -12068, -16047, -12601, -9135, -11448, -7836, -9655, -14038, -5692, -2761, -6065, -7261, -6389, -6960, -6056, -6325, -10458, -6921, -6685, -7662, -8908, -5647, -1455, 6605, 8440, 8304, 7437, 2632, 1234, 642, -2280, -4115, -6385, -2698, -2111, -1356, -6025, -12467, -9323, -2902, -5955, -9868, -13972, -17266, -17583, -17230, -9869, -12929, -9079, -9681, -15202, -15657, -6636, -61, 3181, -6824, -4460, -4621, -7550, -9958, -8896, -9059, -12937, -17671, -13453, -14692, -15502, -6457, -1156, 3963, -2828, -9079, -9250, -10987, -3346, -5188, -915, 1244, 5293, 6152]
15879F152p443l296m55N436J27o35J729m345K121J735l862l477L17O0J645k482
15863f673j76Q52K46K291k093l615P693K640M308K494K856m891r214L60J996K338
15847A412n13n387K398J789J543P210N215m344P07j066L770q978j1792P055N100
15832D119p92j1761r52K398L707K234n12l966k502N217K784r5j937j0566P754
15817d870J2135O659j989m925o831m180J840p64k141j226k85r63j303N98M96j093
15801h842O08K435K724l292p96M341k2q558n760L767M47p36J188N840N699R024
15785H067R170p7l807k032m306m752Q46m76m95n637l165J787j61l298Q330O02
15769E96L64k942n828K731M429M55k670P13K558j631p072L522K235k034l488J287
$$ y = [6152, -1291, -4587, -5042, 394, 521, -114, 1615, -2730, -609, 1126, -2736, -6213, -5896, -5836, -4191, -6673, -6849, -5997, -5751, -3460, -5553, -9168, -1475, 1165, 5473, 7967, 10823, 5932, -3282, -2922, -926, 1412, 899, -4488, -2090, -301, 1242, 8452, 13667, 9323, 10030, 8964, 12734, 3756, -8036, -981, 4119, 3327, -8434, -9386, -6988, -3281, -1047, -1559, -5525, -8027, -2810, -26, -121, -2058, -12624, -4870, 7265, 13924, 11935, 7010, 179, -4001, -2161, -2925, -5066, -6292, -6577, -7540, -8843, -8245, -7749, -8842, -8234, -5799, -3075, -6367, -7163, -2822, -2844, -11402, -17162, -13395, -12948, -13684, -12496, -6656, -957, 8067, 17237, 17160, 13353, 11321, 7015, 2263, 3109, 2633, 2138, -3499, -6664, -4877, -5038, -8336, -6, 596, 960, -1982, -7810, -5079, -650, -195, -2865, -2152, 406, -1225, -8297, -4775, -2540, -4574, -8062, -6775]
15753f775Q420K628q97j190J805J929o051N95M981l456M802j49J711m803m400
15738h50l401p517n16O295L929j257l662k050L534J822O602j430m515N066Q35
15723B885j841N052N162o960q887J864o52K977O57M6l580P611N688O469J386q195
15707I682p986J035m34K641q788l390R814N400l242p479l652M35M946N822m132
15692F72l096J94L852O79O110L422k695J29Q74m154o301K809J21M983o21J883
15676H861k611p697j0479l906N042K064l840N853M175L212M310j414m639Q18r89
15661a240N168J544l704k897K52Q009m717m318K682M566K67q156l407j12m962
15646a1025j025K398L334P373P53k411o435M556O904n518q511K107K600m59J413
$$ y = [-6775, 1645, 4273, 3376, 2186, 3991, 5920, -131, 464, 5445, 1989, 6791, 6642, 8353, 3550, -850, -4251, -11768, -12284, -5989, -2060, -3317, -6979, -9029, -5495, -3673, 2929, 1499, -3016, 2050, 2885, 1044, 6096, 11258, 4298, -4589, -2725, -3377, -400, 257, 303, -3277, 4334, 10022, 16491, 17877, 9682, 1696, 2731, 2297, 4938, -3850, -7240, 2574, 7974, 4732, -2747, -6399, -5964, -1018, 4804, 672, -2424, -2230, 1622, 2301, 8411, 11833, 9138, 9267, 10141, 5987, -314, 2495, 2616, 7599, 6978, 8861, 6250, -1447, -11926, -15832, -10790, -8726, -12566, -6713, -2538, 674, 4984, 3570, -1069, -251, -1240, 3928, 5472, 1768, -1129, -877, 7132, 2415, -1903, 779, 5345, 5612, -2544, -5951, -6063, -11025, -12050, -9652, -6318, 1055, 1808, -603, -7038, -2482, 4422, -1096, -9607, -7500, -4900, -5359, -3946]
15631c946k531k63J732L96K497K945J694n515n993R494P258m661k9m105o033L032
15615d028J992M335O594K625l36l881q416K734R429N766j70r375r061M56j813
15600c149O144Q152L301q313m048k694O190p258p548R215P06J686M659m731n424
15585c112q906k920K450J642k383Q288N729L560k581l783N354m956l933k046k067
15570i664J076R435p00k267j464j394N07M983j563J051q33q85l050K275O65l675
15554e503J450K530l932j139L257k352k454P367N52j1085j901P519P934J125p76
15539B592l487R49L853J609K373Q87n990p814J99n620L847J0504N040J94n784
15524C352k355m550K929n01R04L403j607K385j0660m442M143N410L386o893l423
$$ y = [-3946, -6477, -6740, -5008, -4612, -2115, 830, 2524, -2991, -8984, 510, 7768, 3107, 3078, -1027, -7060, -4028, -2036, 2299, 8893, 11518, 11182, 7301, -1115, 1619, 11048, 16814, 16644, 7269, -1792, -1336, -3149, 2995, 11147, 14448, 6135, 2087, -607, 5583, -1675, -9223, -8, 698, 2384, 7043, 2312, -3112, -12018, -14938, -12488, -10846, -13229, -4941, 788, 4348, 1767, -2016, 3338, -1618, -5551, -7597, -9664, -8588, 847, 147, -2120, -3584, -4978, -4471, 512, -1051, 0, -833, -1718, -4768, -2493, -1828, -5503, -4053, -1523, -5455, -6594, -3337, -5689, -8143, -776, -224, -11309, -13210, -5691, 2243, 3368, 2592, -895, 54, 3907, 5516, 7889, 8776, 2786, -5028, -4829, -10449, -6602, 3902, 8942, 9136, 3352, 997, -3553, -624, -1125, -221, 3182, 1575, 3960, -6700, -11142, -6999, -1589, 1797, -5096, -8519]
15509h519K166J02J573P358O87o038l007k746J480J661j630l98M764O796j460
15494B789p481J473j177j092O600O088J90r44P27n597j220L253J08K811l656j91
15478B681J84j260k525m241k007R744O25q39m272l010l510J248K128K71K625K590
15462D32K797j5m863k242L866J386l09l69r581p58J9q985L092P776J909K039j911
15445e717j636J1812P295j0990l87j093K303M45p549k992J014L620K600p315o968
15430a5558R928Q13k583q575N145O087j631n682L764O528l984J29j491J161L624
15415b325j196Q81J25M661o78n047m27l911n75J934L636J1196J129k369k75o494
15399B65l672n47N086j300M65Q16m644l34M344K777j442n121j71P39M85p6o381
$$ y = [-8519, -6353, -6251, -4678, 2680, 3367, -2671, -5678, -8424, -6944, -5283, -6913, -7311, -2547, 4249, 2789, -4692, -3219, -4396, -5488, 1112, 7200, 7390, 6446, 7173, 1576, 356, 3609, 3717, 6528, 2872, 2681, 2865, 1605, -920, -5161, -7168, 2576, 3201, 2362, -1910, -4920, -8430, -7182, -5054, -4783, -2158, 432, 3229, 3214, -1649, -3891, -25, 1361, 1052, 683, -8898, -9656, -9637, -18622, -15530, -7754, -5845, -3806, -5717, -7353, 4459, 11754, 764, 377, -716, 1587, 2032, -5517, -8509, -7495, -3875, -1275, -8590, -15558, -5630, -4817, -7400, -15975, -10830, -4743, -6374, -12056, -8292, -1764, -5748, -5619, -7110, -5949, -2325, -3521, -2640, -2515, 2146, 1468, -3579, -4006, -7917, -8492, -6558, -2922, 8274, 9403, 7034, 6759, 265, -3407, -3954, 1132, -168, 297, 1113, -3531, -3865, 479, 3256, 1814, -3307, -3478, -2739, -2254, -2330, -8711]
15382h711L70M732M650k465L851m944M162P076l357n665q402m095p16J782k314
15367a4046k885Q295Q115K927q277m795J758J0276l396O1k950j0099J410K250
15353a1356K506N079k095K708N687L635o600k309l940J865O945m07n050j494J662
15338c164Q448J270N994N238p178p657N55j317m224m598K118k564k590j244K823
15323h090L584J724k666j4K163J175o10J098O584M594r456k796O878K785m903
15308B050r114p14J0420K40r985l59k587K471N083J54j3246m533N049P722K579
15293d770N650j027q935m780J346M925N740j030Q05J315j2393l299L118N034L091
15278e210K914K782o39o58j784N12j458K868M03j308j115J261M040L609j096j951
$$ y = [-8711, -8341, -3609, 1041, -1424, 2427, -2517, 1645, 8721, 5364, -301, -8703, -12798, -13514, -11732, -14046, -16931, -8636, -521, 2406, -5871, -10666, -8908, 1368, -2028, -1967, -4917, -15016, -13606, -11356, -8850, -3771, -5866, -3158, 2529, 6164, -436, -2745, -6685, -4820, 2125, 1718, -3332, -4826, -3164, 5284, 6554, 12548, 17786, 10608, 2951, 3506, 2189, -2035, -6633, -4515, -7079, -9669, -10913, -8090, -4506, -2782, -5448, -5462, -3299, -2124, -2734, -1636, 4948, 9542, 86, -2710, 4168, 6953, 2050, -7064, -7778, 2642, 2882, -7103, -7462, -10049, -7578, -2495, -2341, -15587, -20120, -15071, -7349, -4770, 880, -147, -9082, -13862, -12516, -7591, -1851, -2881, -2076, -761, -13154, -16453, -13335, -8301, -5210, -2296, 486, -153, -811, -2595, -2083, -3541, -673, -270, -1578, -2693, -1432, 2608, 6217, 5121, 3170]
15262C170L428K429l032k617q461k541P271m29n079n714M884L873n631O047K363
15247c9K696j702l70M881k478J995M333L18m547K717j199n40K433m236p476P024
15231C810m25j306J948k684k124K201L957j08m129M154J202j37l319o936l618
15216g514J710L124l440l367J423N141J94R475N28k052j336l428j766q40J928
15201b20j356m063M634P696O595j183K101o281k663J690J298K74L731k998k375
15186F880p006L532Jp527j1035k877Q572J2005Q476O76j0034J095N947j197m300
15171C208k212J677m15l806O87o011k637P864J444j513J357n885p68Q441N946
15156G377m064n353j578N345L395M522o620k912O775n939q205k342L036N517O57
$$ y = [3170, 6598, 9027, 5995, 3378, -5083, -7624, -353, -782, -5861, -11575, -6691, -2818, -8449, -2402, -39, 2657, 955, 585, 5466, 2988, 4983, 9316, 9634, 5087, 7804, 6605, 6065, 8498, 4262, -3214, 3810, 3385, 2079, 4027, 1343, -781, 1420, 5377, 5269, 1140, 5294, 6496, 6359, 3040, -3896, -7514, -5804, -2680, -6120, -9487, -8064, -2923, -2729, 6746, 7274, 5222, 3886, 458, -1308, -2148, -220, -1576, -5639, -1005, 6691, 13286, 12103, 14204, 7923, 5260, 6950, 8248, 8522, 12253, 9255, 6880, -126, 3406, 3407, -4120, -15155, -18032, -9460, 2545, 11021, 11697, 1663, 2758, 8705, 7508, 3208, 996, 2673, 2258, -1548, -861, -6872, -9509, -1645, -201, -1714, -357, -6242, -7010, 1431, 7377, 3313, -2040, -3618, 1727, 5122, 9644, 3024, 112, 6887, 948, -7257, -9599, -6563, -1046, -389]
15141c89j635n49q702N881K412k525K080j903J654O275p601j121K264K897n946
15126f908k322K119K971o65k285M598L017R93l56p349L765M600K91k120l67J392
15110A374J535M252k715M728K116j715j992o509o657l846J133K046P693l91k934
15095a882k46m196P20O675r91K92n276j065J062J264N069m407k658L466j704n517
15079i394k544M563J542P606M699m725LM031k929l572o522P34j897p144J457l646
15063a7738J635J1854M805l718r003O45K114K005N876K019N855J197Jl821J369
15048E095l429q18o961l510M057M950P134N812r12j811j487p246K216J935l355
15033A670L33L83j807J953j520k416p88N950L28m302O5L646K987q26m022k069
$$ y = [-389, -2024, -2573, -11275, -5394, -2982, -5507, -3427, -5330, -3676, 2599, -5002, -6123, -3859, -962, -6908, -9230, -7111, -4140, -4805, -7090, -2492, 525, 1518, 1162, -6187, -2422, 2178, 2469, 349, -18, 1374, 2909, 7161, 4446, 9174, 11290, 9575, 7583, 1074, -5583, -9429, -8296, -6250, 1443, 1052, -1882, -2128, -6324, -5604, 1071, 80, 372, -4904, -5969, -4907, -3643, 1426, -2981, -5639, -2173, -3877, -9394, -11938, -7375, -5833, 1773, 6472, 1747, 1750, 5781, 2852, -720, -7242, -6508, -8405, -15549, -14092, -17738, -16103, -4249, 556, -3162, -12165, -11520, -9406, -7401, -1525, 494, 6349, 7546, 7547, 3726, 5095, 1666, 848, -6113, -9623, -5566, -616, 6518, 12330, 11418, 9607, 8120, 874, 3090, 5025, 1670, 2003, 2386, 579, 2532, 1012, -1404, -2192, 3758, 4086, -216, -151, 3495, 6482, 5656, 1634, -435]
15017d35m801n218J631M466R263l007n722n734n845j544J685M247N397j326O708
15002b35O847o57k241J741l054k856m593L159J0549K138r237p372L316O134k321
14987A318j0240M276M311K78p958l531O702K924N631q654k318O46j69k625L97
14972i012P643K565k113J923l368j995L293l406l485L55n124N248J50M523M018
14957A215n369j762j138l847N522Q856N60L44N59n273l287j071R700K434j968
14942E475K026n615j1922j43P808j793K412L183M267Q2p64l817q172n294L729
14927h538K363j453L180N557L339l134j921J303o63O04K133P35p216J69Q12l503
14911f233k469M866l473L678K736k858p712K039K937J2015M783j927l626N782
$$ y = [-435, -5236, -10454, -8823, -4357, 4906, 1899, -3823, -9557, -15402, -16946, -15261, -11014, -5617, -6943, -235, 6612, 5955, 3714, 5455, 2401, -455, -5048, -1889, 8660, 10798, 1561, -5811, -2495, 3639, 1318, -8922, -4646, -335, -57, -8015, -11546, -4844, -1920, 3711, -4943, -7261, -6615, -6784, -9409, -9012, -1369, 1196, -917, 1006, -2362, -4357, -1064, -4470, -7955, -7600, -12724, -7476, -7326, -2803, 1215, -4154, -5916, -7054, -10901, -5379, 3477, 4037, 4381, 4940, -333, -3620, -4691, 5009, 7443, 5475, 7501, 1886, -10036, -10179, -2371, -4164, -1752, 1431, 5698, 5780, 5016, 1199, -6973, -12267, -8538, -6175, -7628, -4448, 1109, 4448, 1314, -607, 696, 33, 637, 2770, 3505, -3711, -3542, -2730, -6233, -8702, -3836, -7309, -3631, -895, -3753, -11465, -9426, -6489, 5526, 10309, 8382, 4756, 10538]
14897A0538Q14J379l473m451R46O357m114k72m061L45O092K850l109n021J194
14882F014n036o928l955J859J3098J046j685M323j770l999J624l884L530N560
14868I797P35q849j72L217J720j824k920m759M722Q408n224M205L73l772l852
14853A805k44K313J796L73K443n691o395l753K923L081L098o60M529j649o86N37
14837C820M09m544J733P44n685r751J509O372J537L547j187L05L118k991J755
14822F91l34L860n874q213o623n473j459N011M965R65O37L170k547r71K635K266
14806g294p188J4110M033p667N940J371p74P016o609m078l613L375p536q498P238
14791a0174J2860N771J196Q46m389j650p055n737K35N409J224k048J443K560j615
$$ y = [10538, 11352, 12731, 9258, 4807, 5753, 12110, 7996, 7724, 3663, 4008, 10100, 12950, 9841, 4820, 6014, 978, -5950, -9905, -8046, 5052, 6098, 4413, 8736, 6966, 2967, 4591, 707, 4237, 9797, 10532, 1683, 1511, 4728, 6448, 4624, 1704, -3055, 1667, 10075, 4851, 9056, 9429, 5657, 1805, 1561, 3874, 5670, 6043, 8486, 2795, -3600, -7353, -4430, -1349, 1749, 1089, 5618, 3969, 3283, 3820, 4229, -315, 1418, 2162, -3523, -13274, -11765, -5393, -3856, -309, -1496, -1191, 1927, -1064, 691, 357, 4217, -1657, -9870, -16493, -21966, -23425, -18414, -13449, -12484, -11847, -8677, -11224, -12195, -9560, -7294, -14482, -372, 3661, -4006, 1934, 3305, 2531, 9547, 2938, -1140, -4753, -1378, -8914, -17412, -10174, 2686, 8457, 9653, 10499, 6110, 4460, -2595, -8332, -8097, -2688, -1464, -3512, -2069, 491, -1124]
14776a124j201o232K901O574q093l329J458N173N447K827m144j718L937j643k993
14761b160Q594N124p022q060j0435o96O793N706O243k742l710k023j690P068k382
14746a392q178J993L087K774N281M031J884N68P07r039q308L4j609j902j830K417
14730i482K955M153j470K323m812j615K375J229L678j807k222q220m343J897P747
14715g614l061K065M524k901o413L94R460O678M747P52l791K206j844p29j557
14700B916n901j017R068J913j1439j303P651K698m491l477M121K718m133P461
14686F785K819l323M85K263l252o62J340j061J020k170j748J378M522q458K625
14671B563L286l789p717K277K317q928J286J0355L790O335J07l686n503m57K677
$$ y = [-1124, -2325, -8557, -5656, 918, -7175, -10504, -9046, -3873, 1574, 4401, 257, -1461, 2476, 833, -2160, 6434, 11558, 4536, -3524, -13959, -14655, -7862, -2156, 4087, 1345, -2365, -4388, -6078, 990, -1392, -9570, -7577, -4490, -1716, 3565, 7596, 9480, 10048, 10755, 1716, -6592, -6558, -8167, -10069, -11899, -9482, -6527, -2374, -3844, -1521, -6333, -7948, -5573, -4344, -666, -2473, -4695, -12915, -17258, -15361, -7614, -10675, -8610, -4086, -6987, -13400, -13006, -3546, 3132, 7879, 8631, 4840, 7046, 5202, 4473, 2916, -2985, -4002, 5066, 6979, -4460, -5763, 1888, 4586, 95, -3382, 739, 3457, -676, 6785, 9604, 6281, 6766, 9029, 5777, 5115, 6455, 5394, 6414, 4244, 2496, 3874, 8396, -62, 2563, 5849, 2060, -5657, -3380, -1063, -9991, -8705, 1650, 5440, 11775, 11882, 8196, 2693, 2236, 4913]
14656D913m622p442o40J878K925P4k735l790L148P99J433J727L919L589N495j529
14640I142k854L97j96q93N30L995l570l322q242K200N102K441k447m502k818R51
14624d086L731R302L774m561R48m139k009K640k998j265j257Q37n256q463k979
14609a5781P843J032Q084R64O706k714n016K22L392j794J425j077l253N523q47
14594D709n741K372P59j902M52K002j879m211M370K324L71N464n527n911J967
14579c81j63l040q45J241j037k485m109J538N331J241l593L175N790j510L039
14564D192N206k165J171n342l56P791j184Q02k467j378m666k28l330L344Q014
14549I404J647M27n317N38L17K374r83l877p961m794M273J45J71k869R90M601
$$ y = [4913, 291, -7151, -7791, -5913, -2988, -2914, -5649, -9439, -6291, -5492, -4059, -2332, 1587, 5176, 10671, 9142, 6288, 6685, 6489, 5596, 6126, 10121, 6551, 3229, -5013, -2813, 2289, 4730, 2283, -2219, -5037, -4086, -355, 8947, 12721, 8160, 9108, 4969, 2960, 5600, 2602, 1337, 80, 917, -4339, -12802, -15781, -7938, -6906, 1178, 2142, 8848, 6134, 1118, 1340, 4732, 2938, 4363, 3286, 33, 5556, 4709, -1032, 1340, 2099, 197, 649, 2651, 772, -3439, 931, 3255, 3626, 9090, 3563, -2348, -381, -544, -3584, -4429, -3188, -4225, -6710, -10819, -9281, -3950, -2709, -6302, -3127, 2663, 1153, 4192, 9398, 7233, 8404, 3062, 2706, 10497, 9313, 10115, 7648, 6270, 1604, 1376, -1954, 1390, 9404, 11051, 11478, 6161, 6699, 7016, 9390, 8407, 4530, -3431, -8225, -3952, -3807, -3636, -6505, -5515, -914]
14533i14l327K241Q969j07j373j914K0L314n472R64L78J584J234J538k512l190
14517A433K82k531N05J513j056m651k585m555N285Q71J242O031j966O861J932
14502H611l69m872K319M438j740j0198m882N188L735j591j540K500J927o380M238
14487A384l091o968K524O975K090k170J100l373J978K584m890N206N30k431M244
14472E692K015l330q531q094M423O941m06o113P013K266j3682r439N474K230J647
14457a1894O644M139j467K875R24o098o29K730M331L990j224P668L171p662o852
14442F46J924O36K971m516j021M734J272j0445o933k172L310M541Q695K374n366
14427F50n056J128n32Q70p300p311O130O995l5N477M185o505l254N365M175l090
$$ y = [-914, -4241, -2000, 6969, 6862, 5489, 3575, 3595, 6909, 1437, 2401, 2779, 4363, 5597, 7135, 4623, 1433, 1715, -816, -311, 1202, 146, -4505, -7090, -11645, -6360, -5489, -4247, 1784, -182, 6679, 8611, 8242, 3370, 5689, 10127, 8387, -1811, -6693, -1505, 2230, 639, -901, 1599, 3526, -2854, 1384, -1707, -8675, -6151, 824, 2914, 744, 1844, -1529, 449, 3033, -1857, 3349, 3879, 1448, 5692, 7707, 4377, -4154, -12248, -7825, -884, -1290, -7403, -390, 1876, -11806, -21245, -15771, -13541, -11894, -5250, -1111, -2578, 297, 1221, -4877, -5506, -2776, 1555, 5545, 4321, 11989, 15160, 7498, 646, 2570, 3206, 6177, 1661, 640, 5374, 6646, -3799, -10732, -12904, -9594, -5053, 3642, 6016, 650, -4406, -3278, -3810, -2940, -10240, -17551, -11421, -4426, -4461, 1016, 5201, -1304, -4558, 807, 4982, 1892]
14411A892p393k149j363j540r61N951J2914L424j784O42j546o154N10k686o779
14396g022o01l803j33M645M702n19j056Q18L249M58n215L641Q390K69K622j699
14380H746m7j663j120m924j436j239M609m888o08O105j801k090m098l228j678
14365i360N497M977J994o482p60m40k170R44K248O099J372P838O478q558m751
14350D926k929j072J788l214j528n890J629K193J467k227m1K040j176k756M282
14335b508l153l883J026j578m087N804J0521K797K022j64M126K059p003j153M46
14320E272J139J884O06j478m131R84j072l510M206L420J622J277j462j952q370
14305a565o632L706K745J707O456j749n307l20M976J346l120K007n330m84R905
$$ y = [1892, -5501, -7650, -9013, -10553, -11514, -5563, 7351, 10775, 8991, 9633, 8087, 1933, 2443, -243, -7022, -7623, -11426, -11559, -6914, -2212, -2731, -3787, -2969, 280, 738, -4477, -836, 7554, 7823, 10445, 8746, 8699, 7036, 5916, 992, -444, -1683, 2926, -1962, -2570, 3535, 1734, -356, -4454, -7682, -9360, -3863, 1114, 3108, -3374, -4134, -4574, -6744, -5800, -3552, 2547, 3919, 11757, 18235, 9677, 4926, 1997, 925, 2713, -501, -2029, -7919, -6290, -4097, -2630, -4857, -4898, -2858, -4034, -6790, -2508, -5661, -9544, -8518, -10096, -14183, -8379, 2142, 4939, 6961, 6797, 10923, 12982, 5979, 4826, 5272, 6411, 8295, 8901, 7423, 3292, 4276, 3204, -306, 3900, 7320, 8942, 10219, 8757, 6805, -1565, -8197, -4491, -1746, -39, 6417, 4668, -639, -959, 4017, 5363, 2243, 4250, -1080, -1564, 8341]
14290H341Q358n902m681l058O02j852m255J814l67J511L641K553m480L410K72
14275E907l085p088J920J0886j749p225P17J88J530M722n267k183M940N207q112
14260A308k9l598l314j294l493J78R855O913k656K941O656k24K27m507q847n68
14244d52N216K642K425m352p852j3096N939Q411N766J319j031M057K50o439j221
14229A582l49n772L883L230j506o434k243K578L833j348m255J364j17O174N56
14214A176m474k586L278L95N13L454J825M050M626m14j853l759q3L350K305q164
14198C639j189L037K638j356J033O011n875j1610L673J0914J31q649o648M695
14184D44K19o327K84J556J922L878J707o710J612l828l80M874O64N34K291j349
$$ y = [8341, 16699, 10797, 6116, 3058, 3660, 1808, -2447, -633, -1000, 511, 4152, 6705, 2225, 5635, 5907, 2822, -4266, -2346, 8540, 6791, -434, 283, 471, 2001, 6723, 1456, -727, 4213, 9420, 1308, 1279, -2319, -5633, -6927, -10420, -10242, -387, 6526, 3870, 6811, 13467, 13243, 13470, 8963, 116, -452, 4764, 7406, 9831, 5479, -2373, -15469, -9530, -1119, 4647, 5966, 4935, 8992, 9242, 2803, 1582, 1233, -4539, -656, 2574, 1068, -5366, -7609, -5031, -1198, -2546, -6801, -5437, -5554, 620, 1176, -3298, -5884, -2606, -2211, -1698, 1756, 3581, 7631, 12257, 11843, 9990, 6231, 6148, 9498, 11803, 3639, 2450, 5487, 8125, 6769, 7802, 13813, 7938, -3672, 1, 10915, 11046, 2397, -4251, 444, 663, -5664, -5380, -3824, -1902, 1976, 3683, -3027, -1415, -5243, -5623, -749, -85, 449, 2740, 1391]
14168A391r744n087J1335P950q07J910m24m278K552K896j941K104j921k200j319
14153B417M340K117M022J901m666j0186k389p57O847j175j975K162L022n309n449
14138e078J506P287K217L136k196r342R40M598N098n228m800m618n29j794K999
14123e804K668K147Q284L63m033m916K473m257j458O21M419K125j684J797Q505
14108A1250k240l423j1784o917L646P561R073P290m393p229k038N84j205l452
14094c277p332K990k78l53n586O278q17k587j742r57N769Q165l497j434J0211
14079E553P072j455L104k671M092j1919r281L135k159K452L558q538k228k90L274
14064f301J651J512l138l150N491O62M295L612k041K966n09j002N74l99j776k531
$$ y = [1391, -8353, -13440, -2105, 5845, 5038, 6948, 6524, 2246, 4798, 7694, 5753, 7857, 5936, 3736, 2417, 6757, 8874, 12896, 14797, 10131, -55, -2444, -3201, 3646, 2471, 496, 2658, 5680, 371, -5078, -3572, 3715, 5932, 9068, 6872, -2470, -1530, 3068, 8166, 2938, -1862, -6480, -7009, -8803, -5804, -3136, -989, 7295, 7658, 3625, -1291, 1182, -3075, -4533, -3912, 507, 2632, 948, 2745, 11250, 9010, 5587, -6197, -13114, -9468, -1907, 7166, 14456, 10063, 2834, 796, 1380, 175, -3277, -10609, -7619, -7897, -8250, -13836, -7558, -8375, -10962, -12704, -13661, -7892, 273, -3224, -4658, 5553, 12625, 11170, 14274, 11603, 15695, 3776, -5505, -2370, -4529, -2077, 1481, -7057, -9285, -9575, -6301, -4650, -3138, -6276, -9426, -3935, -3273, 1022, 4634, 2593, 5559, 5050, 4048, 4622, 4223, 2447, -84]
14048h4N74L731k848N960R494j28P56p379j386J342K816m91l449o185R354K000
14032A4077n375K446L926p863j0688J116P166M130m129p87K976N101L762m388
14018A1470Lj566l047k469k532K332L721L243o056m393J470r84K024m667l844
14003e295J527M433j904K380K01M772K202L86P81o46J201k374l064o256K378L736
13987D458n95r7k370M497n698N928N117K807k264Q57M32l787n330j704P893m02
13971I742m963l065O218N218q038j75N771p866n072P8Q61P111K858l797k166Q77
13955C592K703m065k004r00m483M066q66o0J033n862J862Q81j538J305Q812M302
13939H778k182j947p277j034K822J843Q33N700j28j430l492K704M187K975r74
$$ y = [-84, 490, 4221, 1373, 7333, 16827, 16699, 17455, 10076, 8690, 10032, 12848, 12357, 8908, 2723, 12077, 14077, 8702, 11148, 15074, 7211, -3477, -2361, 4805, 8935, 4806, 4019, 6995, 12096, 15858, 11470, 11473, 9907, 6860, 4391, 1859, 4191, 7912, 11155, 5099, 706, 2176, 1192, 3216, -1451, -5295, -3768, 665, -1239, 1141, 1342, 6114, 8316, 8702, 9483, 8837, 10038, 7664, 4600, -1656, 722, 4458, 3863, 3766, 1396, 5893, 195, 6123, 11240, 14047, 11783, 12640, 13072, 9285, 3955, 2251, 10144, 9742, 4779, 1714, 7932, 13150, 5112, 4937, 10708, 2842, -2230, -2152, -1291, 5820, 8678, 4881, 2715, 3592, 6295, 2230, 226, -674, -5157, -1091, -1957, -2017, -984, -6846, -4984, -4103, -5641, -4336, 4476, 8778, 6596, 4649, -2628, -3662, -840, 1003, 1836, 7536, 7408, 5978, 2486, 5190, 9377, 12352, 11378]
13924A1378p33J687j342n81M674o389o053k323o203N84K56k117N754L238o750
13909d920l146J808L520k843n652L368L772O862J2216Q396l254l942m743n802
13895E640N949O736m256q101K527j19o183M870Q585k350l987l35n4N87p665k567
13879g23k437M384J912K509K899N56l098k723m520L315N144j293j801L493k427
13864E190o957L418K020j966n7o552k17P724L357k441m167r96K553o42O619Q321
13848A5207J451N563l564m951p1m027M2L09k731q64N924K857m899m048o670L016
13832B544J085O575J718m458N55k689M31J260o267l124m83J773M443r68n221q3
13816b909k952k201O012M307K477j627J222N165l994J209m580j335j30J935J511
$$ y = [11378, 10645, 12332, 10990, 10409, 15083, 8694, 2641, 318, -5885, -5301, -5045, -7162, -1408, 1830, -4920, -8066, -6258, -2738, -5581, -11233, -7865, -4093, 2769, 14985, 23381, 20127, 16185, 11442, 5640, 11589, 18325, 14069, 5968, 8495, 8376, 2193, 7063, 15648, 13298, 9311, 8976, 8922, 9509, 1844, -723, -3160, 1224, 3136, 5645, 8544, 9100, 6002, 3279, -1241, 2074, 7218, 5925, 4124, 7617, 5190, -1767, 1651, 3671, 1705, 1648, -4904, -5121, 2603, 5960, 3519, -648, -1644, 909, 267, 6886, 15207, 16658, 22221, 18657, 13706, 13635, 9608, 9650, 9959, 7228, 6364, 12288, 15145, 10246, 6198, -472, 2544, 3629, 10204, 11922, 7464, 8019, 5330, 5761, 7021, 754, -2370, -2853, -1080, 3363, 2395, -2826, -2909, -5861, -8062, -2050, 2257, 4734, 3107, 4329, 9494, 5500, 6709, 2129, 794, 664, 2599, 4110]
13801D110m902l864J021K429J460K800L950K823L116K46k250k03P563k983k501
13786A2815m301l940J836K062l609J302k36O65K777p351j667k20K553j50L956
13771F492l081K387L19l968M941M844J012j737l093K401R81l025J746o934n691
13756b406O981M191n050j2573M830L299L067m7M457L543P460o87k466j920R20
13741A3599o14o623o698m33M001n037L263Q10J436l727o7P332J145l120P114l295
13725I086m813l541M441K280R41l497o411K54J653m411P785P222L97J877K635
13710A5898r54m098l610k915k204K693L483J400l535j762N071L977j287k34K818
13695A4741J447j176K82p75k604j652j73K259J274N351O40j46m755k870k805q97
$$ y = [4110, -792, -4656, -3635, -1206, 254, 3054, 7004, 9827, 12943, 13189, 10939, 10736, 18299, 15316, 12815, 8514, 4574, 6410, 8472, 4863, 6165, 5929, 6594, 9371, 2020, 353, 133, 2686, 2536, 6492, 3411, 5798, 6117, 2149, 7090, 11934, 12946, 11209, 8116, 10517, 11498, 8473, 10219, 3285, -2406, 4575, 8766, 3716, -8857, -4027, -728, 2339, 2292, 6749, 10292, 17752, 17065, 14599, 12679, 13599, 12985, 6362, -336, -769, 3232, -1805, 1458, 2268, 3704, -23, -90, 7242, 8387, 5267, 12381, 9086, 4273, 732, 5173, 7453, 8394, 4897, -1514, -1260, 393, -4018, 3767, 10989, 11386, 13263, 15898, 14944, 10846, 7236, 4321, 2117, 4810, 8293, 9693, 6158, 4396, 9467, 13444, 12157, 11923, 14741, 16188, 15012, 15294, 14519, 11915, 10263, 10090, 12349, 13623, 18974, 19614, 19468, 14713, 11843, 9038, 8141]
13679H141L123l641K564L377N269N802L181q725m386o181o553p322k870J29M561
13664c531O70Q5J662M299J534j89L520N686j068l754l251l516j732j529L337K857
13648E080j804J083P709L957n426j611Q79j0064m640O45L214M167M693N679m853
13633H708q383n900J825J730N216j664K866M72N659N134M177o738q212J719Q270
13618A4879K029k869L686m284k852j611o78R40N5q248p87M424o62L348j863p736
13602b229k41R535Q428K12m967K745O090K421j726k614p069k724k483j144M408
13587H642m63K001J323m568L876j706M628M410n644m529K185q82j703l223L095
13572G442L189M822o972m341O280K165K149m472L236M084j655m144R083N579j944
$$ y = [8141, 11264, 7623, 10187, 13564, 18833, 24635, 27816, 19091, 14705, 8524, 1971, -5351, -8221, -8092, -3531, -2861, -2776, -1114, 3185, 4719, 4530, 8050, 13736, 12668, 8914, 5663, 2147, 415, -1114, 2223, 5080, 3276, 4359, 12068, 16025, 10599, 8988, 9867, -197, -4837, -4192, -978, 3189, 7882, 13561, 8708, 325, -5575, -3750, -2020, 3196, 1532, 4398, 4870, 10529, 15663, 19840, 13102, 4890, 6609, 14879, 16908, 14039, 17725, 13441, 10589, 8978, 8300, 9240, 9295, 1047, 260, 4684, 4022, 7370, 5507, -2229, -2470, 7065, 15493, 15705, 10738, 13483, 19573, 21994, 20268, 17654, 10585, 7861, 5378, 4234, 8642, 8179, 10180, 11503, 6935, 10811, 9105, 13733, 18143, 12499, 7970, 10155, 9273, 7570, 4347, 7442, 10631, 15453, 8481, 4140, 10420, 12585, 14734, 10262, 13498, 17582, 15927, 11783, 20866, 26445, 24501]
13557B4501J07m37L629j616l311Q77m004o641n66l691n317O246n319n73N261J862
13541A1008J968J19j166r78o84K460K160K637k295k306k486o443N844R984k43
13526A9579q866p557k173j649k120L534M162N524O629L232k036j308o426m919
13512E606j223j335j548p11R740K761o647m454O641L990j200J907n73L813l436
13497A3331m55K061j130Q18l44l328j961J0799l334p919k74L024j325r86K221
13482A1198P87j885o278Q60L968j093p368O34L152O6J235N451J0328l591l858
13467A3606k591l382k099M77N86J809M827L456K635o61l406l215J287o53k316
13452A0360k561j515L116L848m87m315j028N645l28J439P32o187l037n002j928
$$ y = [24501, 24608, 24171, 27800, 26184, 22873, 23750, 19746, 13105, 12539, 8848, 3531, 9777, 4458, 3885, 9146, 11008, 12976, 13095, 11929, 10951, 10267, 12727, 14887, 17524, 15229, 12923, 10437, 3994, 9838, 19822, 19579, 10713, 3156, 983, -666, -2786, 748, 4910, 10434, 17063, 20295, 18259, 16951, 10525, 5606, 4383, 3048, 1500, 789, 10529, 13290, 6643, 2189, 8830, 12820, 11620, 13527, 12954, 16767, 13331, 12876, 14937, 13807, 14625, 14281, 10953, 8992, 19791, 16457, 8538, 8264, 11288, 9963, 8977, 11198, 11985, 10100, 3822, 4682, 8650, 7557, 189, 823, 3975, 4041, 5276, 10727, 21055, 17464, 13606, 11015, 7633, 5534, 6011, 6597, 8406, 13233, 16689, 19324, 18663, 15257, 12042, 13329, 12676, 10360, 7799, 6284, 9400, 13248, 12761, 8446, 7418, 13063, 12735, 14174, 14906, 8719, 5682, 680, -1248]
13437a248K063J891K926l759M142m395O01N427Q534o277m319K653P250K606k522
13422A5573j0208K16J0081N723j636l883j050N481J012L864k768L32J162m13j291
13407B2195J667N345j295j1530l004O431l373k943M419J432K259O476j115m53
13393B6511k224j0631j591N293O764M226k673j590j443m096J225q31k211L363
13379B0092L273n109l83O970l75K203R88l330J028M539k05q81M688O544j926m365
13363C3751n304n63k03P901N946N322P400K174L604J3136m001n125p281j3290
13349D3467m685K512k157o991K43J551k675n285k555J318N071l616K238j465j416
13334B5555J659L595o071j190j197j182o330K602J0273J2065K638j288q903p824
$$ y = [-1248, 815, 2706, 5632, 1873, 6015, 1620, 2221, 7648, 16182, 9905, 5586, 8239, 15489, 18095, 15573, 5365, 5581, 15662, 21385, 19749, 15866, 14816, 20297, 21309, 25173, 22405, 22737, 23899, 23486, 22195, 23862, 29207, 27912, 16382, 13378, 19809, 16436, 13493, 17912, 19344, 21603, 28079, 26964, 26511, 24287, 13656, 12065, 17358, 24122, 28348, 25675, 24085, 22642, 18546, 19771, 18940, 16729, 20092, 23365, 18256, 17873, 24843, 24468, 26671, 27659, 24329, 25357, 29896, 29691, 28810, 33498, 40042, 38116, 33751, 28447, 27884, 27681, 35582, 41528, 46850, 54250, 56424, 60028, 73164, 69163, 64038, 56757, 43467, 38782, 41294, 39137, 32146, 32389, 33940, 31265, 25980, 23425, 24743, 29814, 26198, 28436, 26971, 25555, 27214, 30809, 24738, 23548, 22351, 21169, 14839, 17441, 27714, 39779, 42417, 41129, 32226, 24402]
13320B4402o249K403K125J482o60N370n265m537k255j378p050L949M466J90P527
13305B4520J583J787k85j650k364k023j635J207J213j044M884n559K268K060n387
13290A9575L254N523j837j18Q441j084l165K961m900m544o18M194L443R85n11
13275C1599k335K256q16K36o174n308L181k922j550N708O28k825N415k189J748
13260B6652R86r59P38n321o672J032Q510J985j0259k681J826n80M300N70J0076
13245C0203L592p568K303M693J0579O531o552j5284m002N989l787p062j88p63
13231A8684O549P053o61o81j139L687O200P838K781m422k670j154k558N19p27
13216C9299p37m230j13j921M717P75l433K253K559K737O642L364J336j179n373
$$ y = [24402, 18153, 20556, 22681, 24163, 23503, 28873, 23608, 19071, 16816, 15438, 8388, 12337, 16803, 16993, 24520, 26103, 27890, 27605, 25955, 23591, 21568, 19933, 21140, 22353, 21309, 26193, 20634, 22902, 24962, 19575, 22829, 28352, 26515, 26397, 34838, 33754, 30589, 33550, 28650, 24106, 23488, 27682, 31125, 32110, 31599, 29264, 31520, 30704, 30940, 24766, 19458, 22639, 19717, 18167, 23875, 24503, 21678, 27093, 24904, 26652, 27638, 26679, 27417, 22096, 15424, 16456, 24966, 26951, 16692, 14011, 15837, 15257, 19557, 20127, 30203, 33795, 26227, 28530, 33223, 43802, 50333, 43781, 28497, 24495, 30484, 26697, 19635, 19447, 18684, 25233, 32286, 31625, 30944, 29805, 33492, 39692, 47530, 50311, 45889, 43219, 42065, 39507, 40026, 39299, 38562, 34332, 34219, 32298, 37015, 37790, 34357, 36610, 39169, 41906, 48548, 51912, 53248, 52069, 46696]
13201D6696o61J4790P18J054O458p97q101o613k160n95l138J0356J4050P377J2322
13186I1756J4193J0042J1397J0157J3685N520N289J4669K9349O0669J08458J61159
13174E36343K61787L32527L07728J77397l9614k58512l28962k63761j65964j03695
13164D55274o6132n0281m0611k2709j9885j4895j1579j7186j5988j6347k0299
13153A59362j2492j0016j812K268n376o097m71o163K085L132o175P28J863n531
13139A15305l039l811r564j1089m014K814L708k555q8m893M23K348j079k088M665
13124H7043n963K348Q786m960j2956j233O414j30l03k738K604n18n335j0938m359
13109E7762k762k894K982L628J555l682l960O42l552O887K94m850n064n574j062
$$ y = [46696, 46035, 60825, 61543, 62597, 69055, 68258, 60157, 53544, 51384, 50789, 47651, 58007, 72057, 79434, 91756, 105949, 115991, 127388, 137545, 151230, 156750, 162039, 176708, 206057, 266726, 375184, 536343, 798130, 1130657, 1438385, 1615782, 1576168, 1317656, 988694, 724933, 558969, 455274, 389142, 338861, 298250, 275541, 255656, 240761, 229182, 211996, 196008, 179661, 159362, 146870, 136854, 135042, 137310, 131934, 125837, 125366, 119203, 121288, 124420, 118245, 118973, 120836, 115305, 112266, 108455, 98891, 87802, 83788, 86602, 90310, 87755, 87667, 82774, 83197, 85545, 84466, 82378, 87043, 81080, 83428, 92214, 87254, 74298, 73065, 79479, 79349, 79046, 76308, 78912, 78394, 73059, 62121, 57762, 55000, 52106, 55088, 58716, 60271, 56589, 52629, 53271, 49719, 56606, 56900, 52050, 46986, 41412, 40350]
13094D0350l387O936N786k358M632O764n012l101L860Q845l821n574J05L182j726
13079E5481j2561r560R587P463k382P028O075j813m871N771L916n694n939L309
13065E5810k192L455L561m058l789J093M251j935l471l506m423M156M891p736
13051D6107j6140k444M489Q576O593R087j17l088k252L939N249j246J794k947
13037E7600q779L988p08j1313q500m583l05k136l545P594L873p11p368q269l890
13022A2948Q578J6589M217J28M218L474J146M460J554Q580R194K542m398j674
13008G1556p874L27k712K013Q585K503J676K855P707J0021M330O51m409p759o977
12993H2493j1232o700l780j324o181q57K873o12l344L155q701p492N431J1659
$$ y = [40350, 36963, 43899, 49685, 47327, 51959, 58723, 53711, 50610, 54470, 63315, 59494, 53920, 54025, 57207, 55481, 42920, 33360, 42947, 50410, 48028, 55056, 61131, 59318, 54447, 60218, 64134, 58440, 52501, 55810, 53618, 57073, 60634, 56576, 52787, 53880, 58131, 56196, 52725, 49219, 44796, 48952, 53843, 46107, 29967, 27523, 32012, 40588, 47181, 56268, 56151, 53063, 50811, 54750, 59999, 58753, 60547, 57600, 48821, 52809, 52101, 40788, 32288, 27705, 27400, 25264, 21719, 29313, 33186, 32475, 25107, 16838, 12948, 21526, 38115, 42332, 42460, 46678, 50152, 51298, 55758, 57312, 65892, 75086, 77628, 73230, 71556, 63682, 64009, 61297, 63310, 71895, 74398, 76074, 78929, 86636, 96657, 100987, 101638, 97229, 89470, 82493, 71261, 64561, 60781, 59457, 53276, 52419, 55292, 54680, 51336, 54491, 45790, 38298, 43729, 55388]
12979E5388K1913K4580J7008N863O293J3957J6640J7240Q627q028p056O80m880
12966A68225j7792j3402n448j3441j1374M503l890J339J6569P273PQ850P908j0433
12952A38894j5266q199m984Q261J231L601P375J2922O901r175n888J232L271R317
12938A49493P705J3616J4695L586j0080k373L124j0701j0229J405k576m803q313
12925A44549J456R028P340O642M113J3742J6971K0781K1284J5088K0007K3695
12913C04696K7333K9961L3949J6985J6483J0745K9974N9322J11444J99020L27654
12902A167566N27683Q08737R73200R03513N70656j39576o30486q97273q83451
12893B400569o00567l70651k22103j47927j11486r4726p0698m9128m1677l0784
$$ y = [55388, 77301, 101881, 118889, 124752, 131045, 145002, 161642, 178882, 187509, 179481, 172425, 173105, 168225, 150433, 137031, 131583, 118142, 106768, 111271, 107381, 108720, 125289, 132562, 132569, 141419, 149327, 138894, 123628, 115429, 110445, 118706, 119937, 123538, 130913, 143835, 150736, 141561, 135673, 136905, 140176, 149493, 157198, 170814, 185509, 189095, 179015, 176642, 179766, 169065, 158836, 160241, 157665, 152862, 144549, 146005, 155033, 162373, 169015, 173128, 186870, 203841, 224622, 245906, 260994, 281001, 304696, 332029, 361990, 395939, 412924, 429407, 440152, 470126, 529448, 640892, 839912, 1167566, 1695249, 2503986, 3477186, 4380699, 4951355, 4811779, 4181293, 3284020, 2400569, 1800002, 1429351, 1207248, 1059321, 947835, 853109, 782411, 733283, 691606, 660822]
12883F60822l5187l6040l9532m5521l1307k7020k9406j9768k0189k1996j8935
12872C35921p354k432l140k537O198R85o813j540J79p25l314k582m313r97P569
12857C15105J0540J1175M727O068m50k999P65Q423R65J2660K1332K5645L9223
12844D53179M2986J8389l595j8426m0535l5735k6040j2345m501L501j0508j4312
12832C52058Q507J2714K1542J9271L996J8453K4143K7476L3302L4804L8280N1509
12820F46055P4608J06931J63331K01030J91141J16973k1364j27315j90338j92572
12810I68480j31998p3034l3510k2560j7767j7619j3106j7777l0041k7173j8749
12799E65146j7229j8098J156J3569J4903K0769L3809L4407L1531J7253M399j7929
$$ y = [660822, 625635, 589595, 550063, 504542, 473235, 446215, 416809, 397041, 376852, 354856, 335921, 328567, 326135, 322995, 320458, 326656, 327641, 320828, 319288, 319467, 318742, 315428, 312846, 308533, 307536, 315105, 325645, 336820, 341547, 347615, 347165, 344166, 344931, 353354, 354319, 366979, 388311, 413956, 453179, 496165, 514554, 510959, 492533, 451998, 416263, 390223, 377878, 373377, 376878, 366370, 352058, 360565, 373279, 394821, 414092, 418088, 436541, 460684, 488160, 521462, 556266, 594546, 646055, 720663, 827594, 990925, 1191955, 1383096, 1500069, 1478705, 1351390, 1161052, 968480, 836482, 763448, 729938, 707378, 689611, 671992, 658886, 641109, 611068, 583895, 565146, 547917, 529819, 530975, 544544, 559447, 580216, 614025, 648432, 679963, 697216, 701615, 683686]
12787F83686l2654j7933r14J3084K6375K5155J5315L813N554M828J194n919Q900
12774G30484K1869J8958K5644K0318L4356M4314N2776O8048P1320P1942O1481
12763A221510N1232M9223M6896M3872K7899K2605K7143K0158K6548L7690O6635
12752A641411R9512J20471J23189J18948J27047J52095J80722K25681K69465L10194
12742C368735L43017L72714M20851M78233N64133O42416P32736Q33730R01260
12733H657825R89375J104079J202449J326635J492685J818906K524652L681895
12725B2798501N294971P670326J1401906J7545338K7935582M4500082O2813792
12718A99960498O5814180M3907065M831993l9178884o5030303n9088293l9369487
$$ y = [683686, 651032, 633099, 632185, 645269, 671644, 696799, 712114, 715927, 721481, 726309, 727503, 721584, 730484, 752353, 771311, 796955, 817273, 851629, 895943, 948719, 1016767, 1088087, 1160029, 1221510, 1272742, 1321965, 1368861, 1412733, 1440632, 1463237, 1490380, 1510538, 1537086, 1574776, 1641411, 1740923, 1861394, 1984583, 2103531, 2230578, 2382673, 2563395, 2789076, 3058541, 3368735, 3711752, 4084466, 4505317, 4983550, 5547683, 6190099, 6922835, 7756565, 8657825, 9647200, 10751279, 11953728, 13280363, 14773048, 16591954, 19116606, 22798501, 28093472, 35763798, 47165704, 64711042, 92646624, 137146706, 199960498, 265774678, 309681743, 314513736, 275334852, 210304549, 151216256, 111846769]
12711A11846769k4259511j5346025j0158005p157359n437765m324969l482048
12704D1681087k862391k510368k351680k291799k199329j985409j719791j529126
12696B4231194j357028j156473r44788p50514o11149n43524n08404m80900m21967
12687A7456447l52191l57742m61586o30321p55321p38126o20693n27689m86107
12678A2526671m77219m71103m61798m21822l78553l51452l31054l18497l14734
12669I000439k92332k62504k32209k07993j96868j92261k07174k16322k09934
12660F982842k04775j83389j73724j67480j50555j46638j48841j48558j54844
12651E504038j41549j28192j23251j19774j44955j60950j58765j57756j47223
$$ y = [111846769, 87587258, 72241233, 62083228, 54925869, 49488104, 45163135, 41681087, 38818696, 36308328, 33956648, 31664849, 29465520, 27480111, 25760320, 24231194, 22874166, 21717693, 20772905, 20022391, 19411242, 18867718, 18359314, 17878414, 17456447, 17104256, 16746514, 16284928, 15654607, 14899286, 14161160, 13540467, 13012778, 12526671, 12049452, 11578349, 11116551, 10694729, 10316176, 9964724, 9633670, 9315173, 9000439, 8708107, 8445603, 8213394, 8005401, 7808533, 7616272, 7409098, 7192776, 6982842, 6778067, 6594678, 6420954, 6253474, 6102919, 5956281, 5807440, 5658882, 5504038, 5362489, 5234297, 5111046, 4991272, 4846317, 4685367, 4526602, 4368846, 4221623]
12642D221623j28466j03092j00088r6147r6137r1218r8234j02009j07221j17454
12632C181557j18875j08258r4459q6301q1369p2137o4300o0147n0654l8727n1704
12621B354626n6146o2007o4169o9139o9440o4229n9853o3004n5461m5154l8505
12610A707519k3653k2148j3517l136r185j3052q361k042k327j0984j4064l2830
12598A552220m2974m6694m9987n5582o2837n2426m7425n2673m9262l9266m7710
12587A005384n7129n2840n2758m2516m8507m3608m1100l7045m8345m0003l9274
12576E02259k4536j1153j4653j3136r221j2594j1152n506q255j1650p515K635
12564C75523N50l401O378k814r457j4458q476N99M163n580r686j2047p335k365
$$ y = [4221623, 4093157, 3990065, 3889977, 3793830, 3697693, 3606475, 3508241, 3406232, 3299011, 3181557, 3062682, 2954424, 2859965, 2773664, 2692295, 2620158, 2555858, 2495711, 2445057, 2406330, 2354626, 2298480, 2236473, 2172304, 2103165, 2033725, 1969496, 1909643, 1846639, 1791178, 1746024, 1707519, 1683866, 1661718, 1648201, 1645065, 1635880, 1622828, 1614467, 1612425, 1610098, 1599114, 1585050, 1552220, 1509246, 1462552, 1412565, 1356983, 1294146, 1241720, 1194295, 1141622, 1092360, 1053094, 1005384, 948255, 895415, 842657, 800141, 751634, 708026, 666926, 629881, 581536, 541533, 502259, 477723, 466570, 451917, 438781, 429560, 416966, 405814, 400308, 392053, 380403, 372888, 375523, 376073, 372672, 379050, 376236, 366779, 352321, 343845, 344444, 348607, 343027, 333341, 321294, 313959, 311594]
12550C11594p043P614J0782l65n759p399j6809p343M119P973M564P583J3298J4306
12536C37115J3843J9712J9029J0774j102q605j1659q838j6389j5952l4195n6046
12524B47687n2622k1725l907J2008L599K507Q92M886J0883J0960j0365J653J700
12511B08156P079L481K124m093l889l742j0480j0754j1114j5915q088k217p942
12498A42606m098J078K455L606R635R803J190l41j736K58Q612P577R178L365m759
12483A88429j6094j7747k649L848L098L497j942m158M466L813L6L377L839L589
12469A75402M444L691j313L013k550l693r332J685o276r024k970K251k192j753
12455A51383k898K064M562K163J932l670j5510j2110r680J924n02m897j3468j6175
$$ y = [311594, 304551, 312165, 322947, 322582, 316823, 309424, 292615, 285272, 289391, 297364, 301928, 309511, 322809, 337115, 350958, 370670, 389699, 400473, 399371, 390766, 379107, 370269, 353880, 337928, 303733, 247687, 195065, 173340, 169433, 181441, 185040, 187547, 188439, 193325, 204208, 215168, 204803, 206456, 208156, 215235, 218716, 220840, 216747, 212858, 209116, 198636, 187882, 176768, 160853, 152765, 150548, 142606, 138508, 139586, 142041, 145647, 155282, 165085, 166275, 165934, 164198, 164456, 173068, 180645, 189823, 193188, 188429, 172335, 154588, 151939, 155787, 158885, 162382, 160440, 156282, 160748, 164561, 164597, 167974, 171813, 175402, 179846, 183537, 182224, 185237, 182687, 178994, 169662, 171347, 165071, 156047, 153077, 155328, 153136, 151383, 148485, 150549, 155111, 157274, 159206, 155536, 140026, 127916, 118236, 120160, 119658, 114761, 101293, 85118]
12441H5118r003n336j0666j4731l971L442j418N046J0020l138k224m336j039J865
12427D9629k027q384m550l399l48m696j3652m922Q347J1862M656O56o22P286J0376
12412E0212O631N309O88l434m741j4586L340J893m68q33M62n444j2928q900n89
12397A6612N07K007o85l337m615L47J934N717r32N194R533N288J059M506O991
12382E0126j761p721o694q541j877K066P267N373J263k299J277J128l697r597
12368B6313p579l003p76M840N547j639k707L373L979k892k255n071M087L318p02
12353B4833n348Q0j010j772k35K552p58K628l011M888k818K312O028l33k058P286
12337C3264l072k711K064K32L27K16k752m279q224k373L193J330J683L594J618
$$ y = [85118, 76115, 70779, 60113, 45382, 41411, 44853, 43435, 48481, 58501, 55363, 53139, 48803, 47764, 49629, 47602, 39218, 34668, 31269, 30921, 26225, 12573, 7651, 15998, 27860, 32516, 33172, 32550, 39836, 50212, 56843, 62152, 62840, 59406, 54665, 40079, 43419, 45312, 44844, 44011, 44473, 39029, 26101, 17201, 16612, 17119, 19126, 18441, 15104, 10489, 10836, 12770, 18487, 17555, 22749, 32282, 37570, 38629, 43135, 50126, 48365, 40644, 33950, 25409, 23532, 25598, 32865, 38238, 39501, 37202, 38479, 39607, 35910, 26313, 18734, 15731, 14955, 19795, 25342, 23703, 20996, 24369, 28348, 25456, 23201, 18130, 22217, 25535, 24833, 19485, 19565, 18555, 16783, 16548, 19100, 18342, 20970, 17959, 22847, 20029, 22341, 28369, 28036, 25978, 33264, 30192, 27481, 29545, 29777, 30104, 30320, 27568, 23289, 15065, 12692, 15885, 17215, 18898, 22492, 24110]
12322B4110R72p25m217J464J869P94k493K591j587l455p877q762K83M65K077P653
12306A3162J738n68k742L027N940L230M844Q440p618r762J230R52l303J920P24
12291B1214P544j739o629L085K25O57Q672M183R341J077P10k321m163k561l770
12276C5525R24J0184P815L669N809J0712P966L216O921L178Q432J5157K5437K6873
12262A71818L7363O4467Q3901J32816K13346L05528L44843K39489K9091j98900
12252A423762l34802l12804k12162j23835p0579m3189m0677k9071j7694k1653
12242B17296j3113r938j1347j6133j7569m128n544j8318k0505n930n061J0611
12230A00321j96r53q554o42M143l798l438L01l405l610l829o076o152j858n70
$$ y = [24110, 25082, 24357, 20140, 21604, 23473, 24267, 21774, 24365, 22778, 19323, 11446, 2684, 2967, 3432, 5509, 13162, 14900, 14332, 11590, 14617, 20557, 23787, 28631, 37071, 29453, 19691, 20921, 21873, 18570, 20490, 21214, 28758, 27019, 20390, 23475, 23700, 24357, 33029, 37212, 46553, 47630, 48340, 46019, 41856, 39295, 35525, 36449, 46633, 54448, 58117, 63926, 74638, 82604, 85820, 92741, 95919, 104351, 119508, 144945, 171818, 209181, 273648, 357549, 490365, 703711, 1009239, 1354082, 1593571, 1622662, 1423762, 1088960, 776156, 563994, 440159, 369580, 326391, 285714, 256643, 238949, 217296, 204183, 194245, 182898, 166765, 149196, 145068, 139524, 121206, 100701, 94771, 89710, 100321, 100125, 99172, 90618, 89976, 94119, 90321, 86883, 87184, 83779, 80169, 76340, 70264, 64112, 62254, 61684]
12215F1684M596J829l209k719k152p818q315n128O015J887L743M154k835l778
12201D7954l503M994k049p01q346l030k907j685j59K724L585p224m133L002L391
12186C1913R123J488n964k18q17n588p788l083M078j109n4L502K21J100M172J190
12170C2166m645J209p401l486k916p619Q18O134J00M212O079j324k631j17K630
12155B3209L657k363n43k753j264R9l634n796K679O55k958l356m857k747N380
12140E408P250J704J664J249L359o937r569j865Q106r74n372m765l580Q47N134
12125A659M693K855l75M710l260j731M061n692n018Q196M401J540r123j3101n571
12110a1756m48J819K276J753k374k83L956K515n02m430O751q57J466q803Q51N076
$$ y = [61684, 66280, 68109, 64900, 62181, 60029, 52211, 43896, 38768, 44783, 46670, 50413, 54567, 51732, 47954, 44451, 49445, 47396, 46695, 38349, 35319, 32412, 30727, 30568, 33292, 36877, 29653, 25520, 28522, 31913, 41036, 42524, 36560, 36342, 35525, 29937, 22149, 19066, 23144, 22035, 21981, 25483, 25704, 26804, 30976, 32166, 27521, 28730, 21329, 17843, 14927, 7308, 8126, 14260, 14360, 18572, 24651, 23327, 20696, 20579, 23209, 26866, 24503, 23960, 21207, 19943, 20042, 16408, 10612, 13291, 13946, 10988, 7632, 2775, 28, 5408, 12658, 14362, 16026, 17275, 20634, 13697, 4128, 2263, 10369, 9395, 4023, -742, -4322, -3475, 1659, 6352, 9207, 8832, 13542, 10282, 8551, 12612, 6920, 1902, 10098, 14499, 16039, 6916, -6185, -11756, -12204, -10385, -8109, -6356, -8730, -9013, -5057, -2542, -3044, -7474, -723, -1580, -114, -8917, -8066, -2990]
12094b990R55m447l1m91N430O79N20j831L979l08J063m870j1495k97K472l807
12078a5469k122P531N220q032n544Q035J515K621R453j759l221q154J411P034
12064a481M943O14k641m965q789L187N792O461j63j067L648k923k512L862L322
12049G288n029K055O495m261p484L978O658M32k835O12m226m65J758n037J168
12034A107M758J658M10J39o197k694K05p82M759K159M773k597o801p122P75P430
12018A980R108m741o188J175M05N769j004m858o84l221O3K482R901M147j3477
12003H57l209k36M594L272N434j345j477K914j582k081k932o493P93J639k603
11988b455n600N891O716N1j235n96K17O738N379q485n874J42O998M33l27l087
$$ y = [-2990, -2035, -6482, -6513, -7004, -1574, -895, -375, -2206, 1773, 1465, 2528, -2342, -13837, -14134, -11662, -15469, -17591, -10060, -4840, -12872, -18416, -10381, -8866, -6245, 3208, 1449, -1772, -9926, -8515, -1481, 3462, 4076, 1435, -3530, -12319, -9132, -3340, 3121, 2958, 1891, 5539, 2616, 104, 3966, 7288, 2259, 4314, 10809, 6548, -936, 3042, 9700, 10132, 7297, 7909, 3683, 3218, 4976, -61, 1107, 5865, 7523, 7933, 8072, 1875, -819, -614, -1396, 3363, 5522, 10295, 7698, 897, -6225, -5450, 1980, 11088, 6347, 159, 1334, 1739, 7508, 6504, 1646, 962, -2259, -2196, 286, 10187, 14334, 857, -2352, -2588, 2006, 5278, 10712, 9367, 7890, 10804, 9222, 7141, 4209, -2284, -1491, 148, -2455, -8055, -2164, 4552, 4603, 3368, 2772, 2989, 9727, 15106, 6621, 747, 889, 7887, 8320, 7993, 4906]
11972D906o821q469j21O63P811k024j468p612K632m141K93O202J175K161J1746
11957F933O191l847k132j0834q373J2111J0674k65m777m354j2052r095m27N263
11943a4984L738l164J198K257K463N784M159K150l213j083q6M522l85k862k059
11928a565j769m008M4N503J790K160M504K735L675m423n396M403k447o577o895
11913h266J411N613L576N033P95l62K065L707q17Q94r093j2551j527L493O39N167
11897b23m739n808J722R212O575N013m724j0488p349m144O180M167J927K103l222
11882c798j655L100J274o844l177R004O649J482r570r156m09L050O125O815l530
11867f40M506J899j0336N419J438K233m130q855o42P10L071r21K870L796K845
$$ y = [4906, -1915, -10384, -10505, -9842, -2031, -4055, -5523, -13135, -10503, -14644, -14351, -8149, -6974, -4813, 6933, 13124, 9277, 7145, -3689, -12062, 49, 10723, 10458, 5681, 1327, -10725, -19820, -20247, -14984, -11246, -14410, -13212, -10955, -8492, -2708, 1451, 3601, 388, -695, -781, 3741, 3356, 494, -1565, -3334, -7342, -7298, -1795, -5, 2155, 6659, 9394, 13069, 8646, 3250, 7653, 5206, -1371, -8266, -6855, -1242, 2334, 7367, 8162, 7800, 9865, 13572, 12755, 13649, 4556, -7995, -9522, -6029, -5390, -223, -4962, -10770, -9048, 164, 6739, 11752, 7028, -3460, -10809, -14953, -8773, -4606, -2679, -576, -3798, -5453, -2353, -1079, -7923, -11100, -2096, 4553, 6035, -3535, -12691, -13100, -10050, -3925, 2890, -640, 3866, 5765, -4571, 848, 2286, 4519, 389, -8466, -9108, -8398, -5327, -6248, -3378, 418, 3263]
11852C263l217m761J619l843M722K095j100J847J96m881n748l669J861R600L977
11837A961o955o560K169j769K572M165K36L731p955o160J0082P300R443O203o129
11822A2334r708J900J031r23j886l608K172N205l52o92m249n170k962k800O474
11807c234R284K562J519j556K86p290m734N741Q037j732M389k442k986k116j701
11792D027L117M350j948k544N26n958P55L742J244k043m901o403l95Q536J459
11777C564P619q50j521K75l35q777o93p659l639Q671k333K082O104J768J033M82
11761E791k083r673j1157J726J1409Q67o166n521K198R13N302k559K43O946j889
11746c653p65L103L608P19j529K506J77k162O32j570m211o56J902L212L540m890
$$ y = [3263, 46, -4715, -3096, -6939, -2217, -122, -1222, 625, 821, -4060, -9808, -13477, -11616, -2016, 1961, -4994, -11554, -9385, -11154, -8582, -4417, -4181, -450, -8405, -14565, -4483, 2817, 12260, 18463, 12334, 2626, 4526, 5557, 4634, 2748, -860, 1312, 6517, 6165, 5473, 1224, -3946, -6908, -9708, -3234, 6050, 8612, 10131, 8575, 8861, 1571, -3163, 2578, 10615, 8883, 13272, 10830, 7844, 5728, 4027, 7144, 11494, 9546, 7002, 7528, 1570, 2325, 6067, 7311, 5268, 367, -6036, -6431, 2105, 3564, 11183, 10333, 8812, 9087, 8752, -25, -718, -8377, -12016, -3345, -5678, -3596, 2508, 4276, 5309, 5791, 3708, -5965, -17122, -15396, -3987, -3120, -9286, -14807, -12609, -11696, -6394, -8953, -8710, -1764, -3653, -4418, -1315, 2293, 3012, 1483, 3989, 4166, 2004, 2636, 1066, -3145, -3801, -1899, 1313, 4853, -37]
11730c7k838j933J764K54j522n589J753K361K092N608k449m826k107p36N423J388
11714a394j887m091l340m62P399L319q54j098O98l539O670K016p572j885J267
11699d753N068K008j146j07K445N034M046p360o128R6M277L575k98p842J840L367
11683D122L465M538J823j988q346q684L701N383r23R31k285k86n432M257r82L64
11667c42M3k007l786N214m338m551K02N103J319l395k224L510O058l863o14j837
11651e508n473j848N931L26P70J835J159K128k637M253K769j853n343K736N385
11636D630N94L49j284q460O4j88l391N642K749k014o28m797L349L037P14J276
11620A642Q95m948L517k96r135M40L707L141m95o006p307l04L183K297O062q76
$$ y = [-37, -2875, -4808, -3044, -2790, -4312, -9901, -8148, -5787, -3695, 1913, -536, -5362, -7469, -8205, -2782, -1394, -3281, -7372, -10712, -11174, -3775, -456, -1310, -2408, -1710, -5249, 1421, 3437, -4135, -6020, -4753, 315, 2323, 1177, 1070, 3515, 8549, 12595, 5235, -893, -797, 3480, 7055, 6757, -1085, 755, 4122, 7587, 12125, 13948, 11960, 3614, -5070, -1369, 4014, 3091, 4022, 1737, 1451, -3981, 276, -706, -342, -299, -2306, -6092, -878, -5216, -9767, -9565, -4462, -3143, -6538, -8762, -5252, 806, -3057, -3671, -5508, -10981, -12829, -6898, -6572, -5802, -3967, -2808, -680, -3317, 936, 3705, 1852, -3491, -755, 4630, 5224, 5573, 4289, -4171, -4107, -4295, -7686, -2044, 705, -1309, -1937, -6734, -3385, -348, 366, 1642, 2537, -2411, 1106, 810, -8325, -7885, -4178, -1037, -1532, -7538, -14845, -15149, -11966, -9669, -3607, -4483]
11604d483m173k995L051J886L832M802l236j0056l957P248P739O00J547M681n337
11589A149m655L028N305l747m344Q610J332k384l516l252M76K164M18p31O04o659
11573f202p026M080Q000R367m662K690K214j549K686l677k765m613l25j701J598
11558a885P07o08K59J351L248P3j938K622J885K4L80k604m433j992N810L623l390
11541C132Q38o37n721o554K780N743k269n293p948J642P552M263P298l172J682
11526C336j782p671n510Q188N017q78j554p055k042O162O206O347n400l751M837
11511D450j240j774o056N38P086M881r672q511j487K121K495K455O301L555n165
11496b3j0174m311L66M704P065k680k706O542L265L357j348p10K079L456J952
$$ y = [-4483, -8656, -11651, -8600, -6714, -2882, 1920, -1316, -11372, -15329, -8081, -342, 258, 1805, 6486, 1149, -3506, -478, 4827, 1080, -3264, 5346, 6678, 4294, 778, -2474, -1998, 166, 584, -147, 457, -6202, -13228, -9148, -1148, 8219, 3557, 6247, 8461, 6912, 9598, 5921, 3156, -1457, -1782, -3483, -1885, -1178, -1786, -1527, -176, 3072, 3145, 1207, 3829, 5714, 5738, 6118, 3514, -919, -2911, 2899, 6522, 3132, 3970, 3333, -2388, -8942, -6162, -419, -2688, -7981, -15929, -14287, -6735, -2472, 4826, 1654, 3336, 1554, -6117, -11627, -3439, 1578, 700, -854, -7909, -9951, -3789, 2417, 8764, 3364, -387, 4450, 3210, 1436, -4620, -4082, 3004, 7885, -1787, -10298, -11785, -9664, -7169, -4714, 1587, 5142, -23, -10197, -14508, -14142, -9438, -2373, -5053, -7759, -1217, 2048, 5405, 4057, 3347, 5426, 8882, 10834]
11481A0834K506m826l654p57m590n240p045L516O251k320j650k416l804k610L254
11466a2551R211L343o309P6P295o245p781J463O912O652m151j657N871L194l260
11451B063k544k198j558K251n713n70q68J080M446Q10l502o818j80L120K512J061
11435f608N640K7L471k690k565P55o605m939J0643J641l208l635K567O431K806
11420C731J207P472j191j1594j603m69m011k844j219j549J947N949l232j994J688
11405g712J0194K351p014p798O5r89N119O605L765K428L857j2l56K18J410k855
11389I276n885l655k771j720J35J061k920m288L185R980M889q097n661l46P105
11374B88n8k307q39l56l607k563k357O315P346N779n48j208o03n58n673l504Q03
$$ y = [10834, 13340, 8514, 4860, 4103, -487, -5727, -12772, -9256, -3005, -5325, -6975, -9391, -13195, -15805, -12551, -3340, 3, -6306, -6230, 1065, -5180, -12961, -11498, -4586, 2066, -2085, -3742, 2129, 5323, 2063, -481, -2679, -4237, -1986, -7699, -8269, -9137, -8057, -3611, -2801, -6303, -13121, -13301, -10181, -7669, -6608, -968, -941, 2530, -160, -2725, -1970, -8575, -13514, -2871, -1230, -4438, -8073, -5506, 925, 3731, 4938, 12410, 11219, -375, -1978, -2447, -6458, -9302, -10521, -12070, -10123, -4174, -7406, -9400, -7712, 2482, 4833, -2181, -9979, -9914, -10903, -5784, 821, 4586, 7014, 10871, 10859, 10503, 10721, 12131, 9276, 3391, -264, -3035, -4755, -4620, -3559, -6479, -10767, -7582, 2398, 7287, -810, -6471, -6817, 288, 230, -2077, -2916, -3272, -6879, -9442, -11799, -5484, 1862, 7641, 7093, 5885, 5282, 4724, -949, -4453, -3650]
11357c650k346N461L138o670R42R939n12J288K642o736o855j13M338J057J311
11342C234p83k442l7m334j903N670P903K350j009l890j598L96o903L328K795P67
11326C544p041M149j023K524J076m565L232P950O16n298l505j425k678p89M742
11311A509j301j679M426q04n90j196o235L393K601Q58m507j311K752m073j890
11296h047L232K236M512l167j72K759q62n694m630J1110L950p128m598l002N712
11281c789M089M35M834k514p195K500N825m788q702Q66R62j864J232N238o08N075
11265A596K449o43j191q82m401j1291m383R059R099L766J104m035kK194J218J933
11249E590L06l376K701J282k861p067k11l656K442Q546O280n049o259l272O975
$$ y = [-3650, -5996, -535, 2603, -4067, -3125, 6814, 6302, 7590, 10232, 3496, -3359, -3472, 866, 1923, 3234, 2451, 9, -28, -4362, -6265, -595, 7308, 9658, 8649, 4759, 3161, 3557, -3346, -18, 2777, 3544, -3497, 652, -371, 2153, 3229, -1336, 1896, 9846, 10462, 5164, 1659, 234, -2444, -3233, 1509, 208, -1471, 2955, 2151, 1561, 365, -5870, -2477, 124, 982, -3525, -4836, -2084, -6157, -8047, -4815, -2579, 1933, -1234, -1406, 1353, 491, -5203, -9833, 1277, 5227, -1901, -6499, -9501, -3789, 300, 735, 5569, 3055, -4140, -1640, 4185, -603, -9305, -8439, -7477, -9341, -8109, -2871, -3479, 1596, 4045, 3402, 2211, 1329, -3072, -14363, -18746, -9687, -588, 3178, 4282, 247, 245, 2439, 3657, 5590, 5896, 2520, 5221, 6503, 3642, -3425, -3636, -7292, -4850, 3696, 9976, 4927, -1332, -4604, 2371]
11234B371L695k753j946l357L531O91k368J923N921j892p541o940k320j619L69
11219a2235Q276M150M394o55k601r683j795O464M292l400k571K584m14P6L373
11204B55K164R36P28m150J341m492R14K697K940j616n827j513j92O096n445o013
11188a1177O03o903k022K000J3221M965j056n882n437O605P684O519J934r73l363
11173F718m462j514k472m204P8n387O708N588l683k76j378k84L29M691Q17j344
11157g5K972j022j835j93Q1K971J462P09M28j818l142K85n712r367L669O587n082
11140i082M65L103M877k570m815l757M247j65K873N276M65M692J948o422l061
11125a926N238J172j028m282N232J328l283k98K529l105L96L60l826l174J65J541
$$ y = [2371, 6066, 3313, 1367, -1990, 1541, 2232, -136, 1787, 7708, 5816, -1725, -8665, -10985, -12604, -12235, -3959, 191, 4585, 3930, 1329, -8354, -10149, -3685, 607, -2793, -5364, -2780, -3194, -3118, 255, 2419, 3355, 4083, -67, 1274, -3218, -2304, 393, 3333, 1717, -4110, -5623, -5815, 281, -5164, -11177, -10574, -17477, -19499, -17499, -4278, 687, -369, -6251, -11688, -5083, 2601, 9120, 11054, 10081, 6718, 2256, 742, -1730, -5934, -5856, -11243, -4535, 1053, -2630, -2906, -4284, -4568, -4239, 452, 1269, -75, 2897, 1875, 40, -153, -72, 2899, 4361, 5070, 5498, 3680, 538, 823, -4889, -14256, -10587, -4000, -9082, -8617, -5514, -637, -3207, -8022, -11779, -7532, -7697, -4824, 452, 917, 5609, 7557, 1135, -1926, 3312, 4484, 3456, -826, 4406, 5734, 2451, 2153, 4682, 1577, 1973, 2333, -1493, -4667, -4502, -2961]
11109b961j296p581l379M025Q51M303O522P685j70n102m252R79O680p83j445M511
11093H587M076l113q879j1144K272L248Q0l665l278J895N657K106J184R51Q852
11078H829K83n979r286m136r36O344N605O19O215k245n331k95Q56o828j1746p105
11062b5136O845J1366J695K594N622N756n763j463m055J4K047k000k357k012k102
11047h949J022L030N663M034J802J280l647o90J505l647j957m346K32l80P59p768
11031a2057r06P045p10R34J625L57Q068Q171K675m601q190l528L42L136o35l886
11015b160j1636p06K386J1019J2929K26J790L768q968o520l99n740l277p470K134
11000a2624L827M142P075J493k159k761R645j56j579k835j759k226j456m35K724
$$ y = [-2961, -4257, -11838, -15217, -11192, -10341, -6038, 484, 8169, 7999, 2897, -1355, -376, 6304, 5521, 4076, 8587, 12663, 9550, 671, -10473, -8201, -4953, -4873, -8538, -11816, -9921, -4264, -2158, -974, -23, 8829, 9112, 3133, -6153, -10289, -11225, -4881, 724, 1343, 7558, 5313, -18, -313, 543, -6285, -18031, -25136, -18291, -6925, -5230, -2636, 2986, 8742, 2979, 1516, -2539, -2525, -478, -2478, -4835, -6847, -8949, -7927, -4897, 766, 4800, 6602, 7882, 4235, 3545, 5050, 1403, -554, -4900, -4668, -5048, -4289, -12057, -12963, -5918, -6628, -5694, -4069, -3712, 4356, 12527, 15202, 10601, 2411, -1117, -775, 2361, 1726, -2160, -13796, -14502, -12116, -1097, 11832, 12058, 13848, 17616, 8648, 2128, 1729, -4011, -7288, -14758, -12624, -8797, -4655, 2420, 3913, 1754, -1007, 8638, 8482, 6903, 4068, 2309, 83, -1373, -1808, 916]
10985I16p31N783k090j982j65m210L102O512J203n73o042n015N01o60L44J267
10969a840L098M220l115p684L88M696N530J100j0454q94P231N031k564n845l40
10954a442J629K30o028o293L559J556J635q27K738J0o661L120L225l149k027l556
10938a2281M807L721J077j366k097K755J029P981R60m316l484k986K48N196N934
10923G178M87k395j079n880R05j721l735n471l240M227Q48k605N036K112l345
10908h678j754L772j855j734j401O430O090j435M569k925m509k973L630J123M920
10893C270n201j0886K235O747M229L742N067j624j760N68q921l737O520R066O23
10878I938o404M076o453j684q52J004J931K567l85l192m989R12l249q337j391
$$ y = [916, 185, 5968, 3878, 1896, 1731, -2479, 623, 7135, 8338, 7765, 1723, -3292, -2791, -3451, -3107, -1840, 1258, 5478, 2363, -5321, -4933, -237, 5293, 6393, -4061, -4955, 2276, 7307, 4743, -1102, -1442, 187, 417, -5611, -11904, -8345, -6789, -5154, -5981, -3243, -3233, -9894, -6774, -3549, -6698, -8725, -12281, -7474, -3753, -2676, -4042, -6139, -3384, -2355, 5626, 6586, 2270, -1214, -4200, -3952, 1244, 7178, 7665, 5270, 4191, -1689, -784, -2505, -6240, -11711, -14951, -10724, -9876, -12481, -7445, -5333, -8678, -10432, -6660, -8515, -10249, -11650, -5220, 870, -565, 4004, 1079, -3430, -6403, -2773, -1650, 3270, -1931, -12817, -10582, -3835, 394, 4136, 9203, 7579, 5819, 6387, -2534, -6271, 249, 9315, 9938, 3534, 7610, 1157, -527, -1379, -375, 1556, 4123, 3738, 546, -4443, -3531, -6780, -15117, -16508]
10863a6508P533K216P03n290p88R887P632J056m888m429n433L048J847L542o19
10848d91l319J46r52N567n613J125L954k518l282l94J65j653J1228K830K546k436
10832F903k407J704K812k964k056l192M808N219K690J826j0705j722M984k536
10818E364n114m14k13l500n570J966J766J517K311m181p16J448J295Q918L14r3
10802E098k031m151J130k024m903k430n77n890m115K370R691P220m130J425O056
10787B739p618p318K43r21L697K466j276n29l426K829L777l599m627M783K847
10772e933M394j557j841m659k031l696L761Q322Q651j821k714l408M97l434q122
10757a3591k262k530J927K826j150L342j286Q756P075k222j411j690Q10o508K036
$$ y = [-16508, -8975, -6759, -6056, -11346, -12134, -2247, 5385, 6441, 1553, -2876, -8309, -5261, -3414, 128, -491, -3810, -3664, -4616, 951, -4662, -3537, 417, -2101, -5383, -5777, -5612, -7265, 3963, 6793, 9339, 6903, 4496, 6200, 9012, 6048, 3992, 800, 5608, 10827, 13517, 15343, 4638, 2916, 7900, 5364, 250, -164, -377, -3877, -9447, -7481, -5715, -4198, -1887, -6068, -6784, -5336, -4041, 4877, 5191, 5098, 3067, -1084, 46, -1978, -6881, -9311, -9888, -15778, -19893, -17523, -7832, -612, -4742, -3317, 2739, -4879, -12197, -11954, -12875, -9178, -6712, -7988, -8517, -11943, -9114, -5337, -8936, -13563, -8780, -5933, -1539, -3096, -4937, -9596, -11627, -15323, -11562, -3240, 5411, 3590, 876, -2532, -2035, -5469, -13591, -15853, -18383, -16456, -13630, -14780, -11438, -12724, -3968, 3107, 885, -526, -2216, -1406, -7914, -5878]
10742e878Q018K337m205l215k70L620k608K775J007k386l163q10K577j538n104
10727h843k221j908M5K416L184K095L282j644q665k396J2567Q241k790J431l402
10712A392p921l789k023K962N737j435m726m128l561R10R036J0344j410P47M298
10697F433J717k539m477l650L427J549k908P402J239j714n759n679o812j864O827
10682f808R009L143k139k4K892k31k204N581j096l18j006l887m367P595K722n805
10666C057M825Q385O90o771r004p645r46O809P746K918l987r492k453O92J730
10651c446L267j159p18k76K649j913j285Q56Q303J058l082M901l264l820J860
10636C931l721l785j595K355k64J435N551N252r159m475O26J737P540L243l032
$$ y = [-5878, 2140, 4477, 272, -2943, -3213, 407, -2201, 574, 1581, -805, -3968, -4778, -2201, -3739, -8843, -11064, -12972, -12927, -10511, -7327, -5232, -1950, -3594, -12259, -14655, -2088, 6153, 3363, 4794, 1392, -6529, -10318, -12341, -9379, -3642, -5077, -9803, -13931, -17492, -16582, -7546, 2798, 1388, 2135, 6433, 8150, 5611, 1134, -2516, 911, 2460, -448, 6954, 8193, 6479, 720, -4959, -11771, -13635, -6808, 2201, 5344, 3205, 3181, 6073, 5842, 3638, 9219, 8123, 7805, 6799, 2912, -1455, 6140, 8862, 3057, 7882, 16267, 16957, 10186, 1182, -6463, -7409, -600, 7146, 10064, 6077, -3415, -5868, -5176, -3446, -179, -1338, -2056, -2332, 317, -1596, -2881, -2025, 6278, 7336, 4254, 9155, 5891, 2071, 3931, 210, -3575, -5170, -2815, -3079, -1644, 3907, 9159, 0, -4475, -3849, -2112, 5428, 8671, 5639]
10621E639o663r3M750J428j355j452o38n314J545K995P211K15l770m733m264o972
10605a1471j0867J585J8103P608J243p223j022J864J843O73m134j012J12P53M292
10590B347o886M356k98J424o73N4M45j111K581J140K270K593j517o735o141O850
10574F99j620J011N50J223l857k071j832m737q52K012N147R734j968j598n062
10559c221O990M240m792r23k811k463j658m316R156K224J235N141N0n676p787
10544d611K193p26l9L088R241J478l574o09Q81J301j178L851j609j796m073m358
10528e40j961L030p56L765J807l420K631K136j51k0L812m311N793K127j4688j0974
10512a1720N150j61m733j228O354R67n483j705J1070O358J616n234J437m823K843
$$ y = [5639, -1024, -1117, 3633, 5061, 3706, 2254, 1616, -3698, -2153, 842, 8053, 8268, 4498, -235, -4499, -11471, -22338, -20753, -2650, 4958, 6201, -1022, -2044, -180, 1663, 2336, -1798, -2810, -2698, -1945, 2347, -4539, -183, -481, 943, 270, 324, 769, -342, 2239, 3379, 5649, 8242, 6725, -10, -6151, 699, -921, 90, 640, 1863, -1994, -4065, -5897, -10634, -11486, -9474, -4327, 5407, 3439, 1841, -3221, 3769, 8009, 3217, 2294, -517, -2980, -4638, -8954, 202, 2426, 3661, 8802, 8852, 3176, -4611, -2418, -3144, -3183, -95, 9146, 10624, 7050, 6441, 7322, 8623, 7445, 11296, 9687, 7891, 3818, -540, -2501, 529, -227, 3538, 5345, 1925, 4556, 6692, 6541, 6521, 10333, 6022, 11815, 13942, -746, -11720, -6570, -6731, -11464, -12692, -6338, -5371, -10854, -12559, -1489, 4869, 6485, 1251, 2688, -2135, 708]
10497G08J746n636J669n552J080L042N486N522J339o427l660k700k608m310r37
10482a1238K856N353N086O657k694j654n775n548k580k056k200L124K7P358Q325
10467E041j251o338k118j463J804L401N459m146p392M58l522M4l862L395O773
10452c717J64L187n91L75n12k171l313Q67J965Q731R19l915L277L609q880p665
10436g670N366N499k648m35n290O343P216o433l593J793N719l198N66M050l255
10421D030k444M942K049k644l34n791r85K472k572m160l084P062k582K054L072
10406A085o608k31L070P426K994m538k270J685P024m579j1763m82P300J722K947
10391D782K67k031K972q53l198j965J395o913P55J924q76n760n484m22J0628O316
$$ y = [708, 2454, -3182, -1513, -7065, -5985, -2943, 2543, 8065, 9404, 2977, -683, -3383, -5991, -10301, -11238, -8382, -3029, 2057, 8714, 6020, 4366, -1409, -6957, -9537, -11593, -13793, -10669, -10642, -3284, 5041, 3790, -2548, -4666, -6129, -4325, -924, 4535, 389, -7003, -6545, -10067, -10023, -13885, -10490, -3717, -3553, -366, -957, -582, -1094, -3265, -6578, -5711, -3746, 4985, 5904, 1989, 5266, 8875, -5, -7670, -2304, 3195, 547, 112, -5178, 1165, 8381, 1948, -1645, 148, 5867, 2669, 3235, 7285, 4030, 1586, 6528, 8577, 5933, 5599, -192, -1177, 1295, -1277, -5437, -8521, -1459, -4041, -1987, 1085, -5523, -5754, -2684, 4742, 7736, 3198, 928, 2613, 9637, 5058, -6705, -7187, 113, 1835, 4782, 5049, 3018, 5990, 5137, 1939, -26, 1369, -5544, -4789, -2865, -3741, -9501, -14985, -15407, -4779, 1537]
10375A537j696n981K982J1716q5p871j064L924j20j0356k268N276k055M139K845
10360I23l70L235n50r068k104N333K591l81J018J070o609r12J597Q074j876l887
10344a916m175o76k968l091J0712J0928K739n464l356J48K114L948K803q383j6192
10329a2829j246N384N426k345n025Q95N509j134k00K606K124j187j391m734n158
10314a3305N69J971J910J808K907K494k58l141L184j145j2737P608J3414p177
10300a898k063L737j625k413J0901M63j1028j349l24m766k530K008L093J415N680
10285f99M34L376k580l811J368O898L498o801R95J714j487K006J497K470m748
10270D130k480k450p607l49l62m32N73N386N573K409l111o2L885l293r740l568
$$ y = [1537, -159, -6140, -3158, 8558, 8473, 602, -462, 3462, 3342, -7014, -9282, -4006, -6061, -1922, 923, 553, 3788, 3238, -5830, -7934, -2601, -10, -391, 627, 1697, -4912, -5824, -4227, 3847, 1971, -1916, -6091, -6767, -9735, -12826, -2114, 8814, 11553, 6089, 2733, 2881, 4995, 8943, 11746, 3363, -12829, -14075, -8691, -3265, -5610, -10635, -9740, -4231, -5365, -5565, -2959, -835, -2022, -3413, -8147, -13305, -12736, -10765, -8855, -7047, -4140, -1646, -1904, -5045, -1861, -3006, -15743, -8135, 5279, -1898, -3961, -224, -1849, -4262, 6639, 7102, -3926, -5275, -5599, -10365, -12895, -10887, -7794, -6379, -699, -265, 3111, 531, -3280, -1912, 4986, 8484, 1683, 2678, 4392, 2905, 4911, 6408, 8878, 4130, 1650, -800, -8407, -8756, -9118, -9550, -8977, -3591, 1982, 4391, 1280, 1218, 5103, 1810, -7930, -11498]
10254a1498K022J875j536M59M410M851q296j093P649M871k5p731M041l3m739Q903
10238D130l493j417p64n351n16P034J738q825l160O445M656R5l140j744q947j788
10222a5047J0957M093M520l957o328m846K473J2351k891n139L831o467o743N054
10208h139J0737N040P50m412o50j350m446l439R55Q55L441M328l875k877p686
10193a0768j059k79K52N339N793N980N122l761k944l47n761O57K675O03J158k228
10177D32J005O44n854k079m002K208j84m98j298k710m570J640m961k361P318P752
10161g518J071N150K776L884l37J0o018m580K996J407M606k643k391N147J265
10146D825k187p421r3N373p151k551K393L605l300K362L78K664O159K596k289
$$ y = [-11498, -9476, -7601, -9137, -8678, -4268, 583, -7713, -8806, -1157, 3714, 3689, -4042, -1, -34, -4773, 4130, 637, -780, -1544, -6895, -7411, -377, 1361, -7464, -10624, -4179, 477, 572, -2568, -4312, -13259, -15047, -4090, 3, 4523, 566, -5762, -10608, -8135, 4216, 1325, -3814, 17, -6450, -13193, -8139, 2598, 7638, 8388, 3976, 3326, 1976, -2470, -5909, -4954, -4099, -658, 3670, -205, -3082, -10768, -11827, -12106, -11854, -6515, -722, 5258, 10380, 6619, 3675, 3328, -2433, -1776, 899, 1502, 2660, 432, 1437, 2081, -3773, -5852, -9854, -7646, -7830, -8328, -9626, -12336, -16906, -15266, -20227, -22588, -15270, -7518, -6447, -1297, 1479, 5363, 5026, 5036, -982, -5562, -2566, -1159, 3447, 804, -1587, 3560, 4825, 2638, -4783, -4876, 497, -6654, -9205, -6812, -3207, -6507, -4145, -3767, -1103, 5056, 7652, 5363]
10131E363j0833j99K992p644r590L955N590K127m158k459M059j128P386K492k671
10116d718M521k435L514J0830l841N17j132l272n084r173m851M778O834p067m519
10101a5098j01N073N270M351J420L562j409j190o728n912L81P68M11l553N509
10086g246M187R746J1571n399j1165q785O6P360N78n364k461q32N542J0648j1773
10071c327n061M364K357n04n95o242n689M39K214O675M142o191J851L332J322
10056i13M786l642p242p92M51K654N848m388k923j67J0663K61o10l786n004P83
10040d021K60K192L06Q373K898n948j331o47l80q51p205L047L263M21m322M208
10024B63M602n29n194p57r34O479m938K457N110l216k721q96N25J316K369k281
$$ y = [5363, -5470, -5669, -2677, -10321, -19911, -15956, -10366, -8239, -12397, -14856, -10797, -11925, -4539, -2047, -4718, -197, -2632, 882, 11712, 7871, 8388, 7256, 3984, -1100, -10273, -15124, -10346, -3512, -10579, -15098, -15199, -10126, -4856, -505, 915, 4477, 3068, 1878, -4850, -10762, -10381, -9613, -9202, -12755, -7246, -3059, 6687, 18258, 12859, 1694, -7091, -7025, 335, 913, -4451, -6912, -7744, -2202, 8446, -3327, -8388, -4024, -1667, -2171, -2766, -9008, -14697, -14258, -12044, -5369, -1227, -7418, -5567, -2235, -913, 3873, 231, -7011, -7803, -7352, -4698, 1150, -3238, -6161, -6328, 4335, 4596, 3986, 200, -4804, -4021, -3761, -1569, -1263, 7110, 10008, 4060, 2729, 2082, 1702, 851, -6354, -3307, -44, 377, -3945, 263, 4865, 4336, -858, -1615, -2549, 3930, -1008, 1449, 6559, 3343, 622, -274, 251, 1567, 3936, 1655]
10008A655j608k95j576P07P88o692r60Q150n506k753M640l73N131K639o55r43
9992B349P468Q20o653j309l40J573M80m096L117J726p33j858l864n430n33o14
9976g897J59O391J249l55n369k809J770J23p95l0k760P748R896l924l59l437o243
9959f642J889K816j861K938m058L032P857j142n686J2971L414j0856j3105K224
9945f209J75L349J617m030K890R309P805k845k561k799j922l23O387J062o19R06
9929A2192n33o321n331L138N24n755q524r33M480M147M514L802o088j063M311
9914B560j287K66k147L07L170j404k404O044N532K56R07k748j687j993p09j370
9898C293K454m590m974k712O97j06J654N071L984J80l217L697l890m932K648O984
$$ y = [1655, 47, -248, -1824, -1117, -329, -7021, -7981, 169, -5337, -8090, -3450, -3823, 1308, 3947, 3292, 2349, 9817, 10637, 3984, 2675, 2335, 3908, 4388, 292, 3409, 5135, 4402, 2544, -1320, -6750, -7283, -7897, -7738, -1347, -98, -453, -5822, -8631, -6861, -6738, -7533, -7563, -10323, -2575, 7321, 3397, 3038, -399, -6642, -4753, -1937, -3798, -860, -4918, -1886, 5971, 4829, -857, 12114, 15528, 4672, -8433, -6209, -6034, -2685, -1068, -5098, -2208, 7101, 14906, 12061, 9500, 6701, 4779, 4456, 10843, 11905, 11286, 12192, 11659, 5338, 7, 3145, 3669, -2086, -10610, -11543, -7063, -2916, 1598, 5400, -688, -1751, 2560, 1273, 1539, -608, -301, 2869, 1465, -939, 5105, 10637, 10893, 11800, 9052, 7365, 5372, 4663, 3293, 5747, 1157, -3817, -6529, -5832, -5938, -4284, 787, 4771, 4951, 1734, 5431, 1541, -3391, -743, 6241]
9882F241n492j191Q65k344N031N368m84q703p486k424o7N120N569M816k974r99
9866H46M430o548l234O621L882l175p573M779P60p5p187n208J620L541M469J2535
9850A0483M498m302m715K573P742j952P80k613l660l559o48l512k344N85P357
9835F713m239L106P909K944p910m392J258L78J023K762L903m802m694J577o317
9820g81j545J124J238L346K195J025R83L268m97m885o448o61N864p37l230l504
9804c245l062m109o349M846K461J856m341Q245M172M10K044j638M48K202k729
9789A211L234O187j737k124o987o937N171O134k269k969l73k556M179m746M481
9774a01L41O577P113n784j3316L230j006l759M999M555j115J974o94m82J063J110
$$ y = [6241, 749, -442, 423, -1921, 3110, 8478, 7994, -709, -8195, -10619, -10686, -5566, 3, 4819, 1845, 846, 5276, -1272, -4506, 2115, 5997, 2822, -4751, 28, 788, 713, -6474, -11682, -10062, -6521, -2052, 10483, 14981, 10679, 5964, 8537, 16279, 14327, 15107, 12494, 8834, 5275, 4627, 1115, -1229, -644, 6713, 2474, 5580, 13489, 16433, 8523, 4131, 5389, 5767, 6790, 9552, 13455, 8653, 3959, 5536, -781, -2326, -1202, 36, 3382, 5577, 6602, 7585, 10853, 10356, 5471, -977, -1638, 4226, 3489, 259, -3245, -6307, -10416, -16765, -11919, -9458, -7602, -11943, -3698, 474, 884, 2928, 1290, 1738, 3940, 1211, 4445, 10632, 8895, 6771, -216, -7153, -1982, 4152, 1883, -1086, -1459, -4015, 164, -4582, -101, 240, 6817, 13930, 8146, -5170, -1940, -2946, -6705, -1706, 2849, 1734, 3708, 3014, 2532, 3595, 4705]
9758D705p242o866K81N356m458M372k321l934N50r38k55J886P491J420N44K011
9742B602n731q142J548M568M041l142o469j625M25L828N104K532j803n258p738
9727a5260L710L412O764O99k405K57j981L962Q171J174k66l014n867J269j956
9712a331j028J565K445K851M307j131k670n824r89o70N581L022j173j49P75j400
9696D181m836J02r42K68N922M179l033o265m854L901M807O022j673r719k404m077
9680h421N255Q593j094J115K208j536q265l277K850L377l849M159K384n43k585
9665C71J86p70J262K107m349n274p115l216k110K807J462J1681Q34j677L026O524
9649E749n299r037k736M254J677p80K515O084L598o55l27K489p87n915l49N34
$$ y = [4705, -2537, -9403, -9122, -3766, -8224, -3852, -6173, -10107, -9557, -10495, -10750, -8864, -1373, 47, 591, 2602, -3129, -11271, -9723, -5155, -1114, -4256, -10725, -12350, -11925, -8097, -2993, -461, -2264, -7522, -15260, -11550, -8138, -1374, -675, -3080, -2823, -4804, -842, 7329, 8503, 8237, 5223, -644, 625, -1331, -2359, -794, 1651, 4502, 8809, 7678, 5008, -816, -1805, -2475, 3106, 6128, 4955, 4806, 5581, 4181, -655, -553, -1495, -1227, 4695, 8874, 5841, -424, -5278, -1377, 3430, 9452, 7779, -1940, -4344, -8421, -3166, 5427, 4333, 5448, 7656, 6120, -2145, -5422, -2572, 805, -3044, 1115, 3499, 2956, 371, 557, -213, 1049, 3156, -1193, -6467, -13582, -16798, -18908, -16101, -14639, -2958, -2124, -3801, -775, 5749, 450, -8587, -11323, -7069, -5392, -6172, -3657, 2427, 6025, 5370, 5043, 7532, 6745, 830, 481, 1015]
9633A015j270m497K811M947L051n140J477L914k937l026j411l94m018M817J108
9618D47n574l294P110M709J967N81l130k289Q2K016K04r26m759M014N233j586
9602D805K929n173L00O164k230o94M93K029M59l858l548k627l193n672L797Q665
9586B646l353l440N246M118N52K737r77l594k30O565l145n644J493l685M576m671
9570h06k167M279N107p056k004N066j705J621J603p016J861O712K767p179m190
9555c107k874J840M140L388N39P156K391m38j052m109k319M339J199m027k613
9540D453k395l883n957k061L853R708J745K102j429o872n119J985N319j474j078
9525a103L130j582M216M746r93l004N411j168K80j346m962p085k531L410N947
$$ y = [1015, -255, -4752, -1941, 3006, 6057, 917, 2394, 6308, 3371, 345, -1066, -1460, -5478, -661, 447, -5127, -8421, -1311, 3398, 5365, 5946, 2816, 527, 609, 2625, 2829, 1903, -2856, 1158, 6391, 4805, 7734, 2561, 2861, 9025, 6795, 6101, 6594, 8623, 9082, 5224, 1676, -951, -4144, -9816, -6019, 2646, -707, -4147, 1099, 5217, 5769, 8506, 7529, 3935, 3705, 10270, 7125, 1481, 2974, -711, 3865, -806, -2973, 1306, 6413, -643, -2647, 2419, 714, 2335, 3938, -3078, -1217, 5495, 8262, 1083, -3107, -5981, -4141, -1, 3387, 3926, 11082, 13473, 13035, 11983, 7874, 5555, 9894, 11093, 7066, 4453, 2058, -1825, -7782, -9843, -5990, 3718, 5463, 7565, 6136, -736, -5855, -3870, 1449, -25, -1103, 2027, 445, 4661, 9407, 8414, 5410, 10821, 9653, 9933, 8587, 3625, -3460, -5991, -2581, 3366]
9510C366L787j404m086o660L203M900O911J335m597m547N158N202n957o435l530
9495c354J934J896M361J777J301O361J599n675n967n684q74n461l509N267M270
9480a758L532j627m64M244M425k427l790J752k594k599L112O266M010N80m474
9465H188n957J625O628N887m484m490k134L396P9L543j707j969L60J880O42R94
9449A2481l864p085j572m786p00P855Q554K44Q48M214n114q305m927m10k830p42
9433f139J741j620M955J587L171R05n262j190O213J305J139k314j325P794R019
9418A9979J545l727o279k272n557O291K180J134L222k127r829l120P254M805j011
9403A2488Q5j381k536j671j074k365j0635O240M788N963L042K519k474l531o56
$$ y = [3366, 7153, 5749, 1663, -4997, -1794, 3106, 10017, 11352, 6755, 2208, 7366, 12568, 6611, 176, -3354, -1420, 476, 4837, 6614, 7915, 14276, 15875, 10200, 4233, -1451, -2325, -7786, -11295, -6028, -1758, 1774, 147, -317, 3927, 8352, 5925, 2135, 3887, 1293, -1306, 1806, 8072, 12082, 12662, 8188, 2231, 3856, 10484, 16371, 11887, 7397, 5263, 8659, 8738, 12281, 10574, 8605, 8965, 10845, 11487, 12481, 8617, 1532, -40, -4826, -5526, 2329, 10883, 11127, 11975, 16189, 11075, 2770, -2157, -2567, -5397, -6139, -4398, -6018, -1063, 524, 3695, 4600, -662, -1852, 4361, 5666, 6805, 4491, 3166, 10960, 19979, 21524, 17797, 11518, 9246, 3689, 9980, 12160, 13294, 16516, 14389, 4560, 1440, 8694, 13499, 12488, 12573, 11192, 8656, 6985, 5911, 3546, -7089, -849, 3939, 9902, 12944, 15463, 12989, 9458, 8802]
9388H802m785J679L041J630K773o273k920L482l291m676M941N104R440J931m843
9373A6035l47L345L923n166j275k82l20l025M351M672O695p51j3733p338M290
9358A1074K844L208n168n147k298M826j817j052M079Q74j548j280K376R50K52
9343A2173M281L108O107m18J763l587o833L549k12j0553P2P902O062R1k948j490
9327A9067K410J283J60k950j13M469k634o437k843K170M136k613K096K254k090
9312A8365J78M398K057Q15k477l148k080j118M294P400J26j755k136L034L388
9297C1341j105J241j596k070J0524R29n287l902l819M259J4513k560l474o62k289
9282C6043k670J468o512M741r75j792J235L746L171N65l677n664Q379R05l956
$$ y = [8802, 4017, 5696, 8737, 10367, 13140, 6867, 3947, 7429, 4138, -538, 4403, 9507, 18947, 20878, 16035, 15688, 19033, 22956, 17790, 16515, 16233, 15913, 12888, 17239, 21911, 28606, 27855, 14122, 6784, 11074, 13918, 17126, 11958, 6811, 4513, 9339, 7522, 6470, 10549, 11423, 9875, 8595, 10971, 11921, 12173, 16454, 19562, 25669, 25251, 27014, 23427, 16594, 20143, 19931, 9378, 9450, 17352, 23414, 23505, 20557, 19067, 21477, 22760, 22920, 19970, 19857, 24326, 21692, 15255, 12412, 14582, 18718, 16105, 18201, 20455, 18365, 18543, 22941, 24998, 25813, 23336, 20188, 18108, 16990, 21284, 28684, 28810, 27055, 24919, 27953, 31341, 30236, 31477, 29881, 27811, 38335, 39264, 33977, 30075, 26256, 30515, 45028, 42468, 38994, 38332, 36043, 33373, 34841, 28329, 33070, 32095, 30303, 31538, 35284, 38455, 39020, 35343, 29679, 38058, 38963, 35007]
9267C5007o264N717P758k875p498j578M632L125k484p512K96Q734P425O396M92
9252E1371m537l365n133Q528N881Q62N244J225n65r679j284P711J561n825M550
9237E6545L414Q473J896r173o719K531J0317q4m190J92r97M147j24k022K654N149
9221G2009Q3k033r42N018Q50M726O053Q75J880M416M287K836l727l124l40P640
9205A00507l52p3L025m92N613N080q340n804J3697J1639O08m317J656J324K854
9190A26625K402M027J0171j561r39j082k473n137O300O214n89L993M304R328R363
9175A70946R439J983p556m58Q093O104J587P065l044l508K807Q359L520J0651
9161B15988P987k095O62J885N304M491L139J683J1071N600j999M735J756R198
$$ y = [35007, 28743, 34460, 42218, 39343, 31845, 30267, 34899, 38024, 35540, 28028, 28324, 37058, 44483, 50879, 51371, 46834, 43469, 38336, 46864, 52745, 53607, 58851, 60076, 59511, 49832, 48548, 56259, 57820, 51995, 56545, 59959, 68432, 70328, 61155, 54436, 56967, 67284, 67200, 63010, 63202, 62205, 66352, 66228, 64206, 66860, 72009, 72092, 70059, 69117, 74135, 74985, 79711, 85764, 86639, 88519, 92935, 97222, 100058, 96331, 93207, 92867, 100507, 100155, 100082, 103107, 102615, 108228, 113308, 104968, 99164, 112861, 124500, 125108, 120791, 122447, 123771, 126625, 129027, 133054, 143225, 141664, 140725, 139643, 137170, 132033, 138333, 144547, 143958, 147951, 152255, 161583, 170946, 180385, 182368, 174812, 174354, 182447, 188551, 190138, 197203, 194159, 190651, 193458, 201817, 205337, 215988, 223975, 221880, 222542, 224427, 229731, 234222, 237361, 239044, 250115, 255715, 253716, 258451, 260207, 269405]
9147B69405Q326r74n049l429K811O237J884J756L005O27M314k399m519P571M345
9132B93911J502k30m50k276l881K822M556L17o183j157Q337O619j907o752n817
9117B89411m048o326j745j228J04J976m197m244l025k017p483M947k091q789J406
9102B52651j765m617O54j146k020K964k107m468k332m090q603p840m441o821l926
9087B02093j602K772k921n085n535j420j282n488O01K026k464p261O57q54l144
9072A71093m020n935j098k202j736m750l467r96J316j775K898l201m139p947r797
9057A24244N43P570j370k793j60l337J388q962r576k556k263k265p875L06M635
9042I7529M826N993q86j555k201k390J348j1187k349l26n578K695M814j451j762
$$ y = [269405, 277731, 276757, 271708, 268279, 271090, 277327, 279211, 280967, 283972, 284599, 288913, 286514, 281995, 289566, 293911, 295413, 295183, 294733, 292457, 288576, 291398, 295954, 296271, 290088, 288931, 297268, 303887, 301980, 295228, 289411, 285363, 279037, 277292, 276064, 276168, 278144, 273947, 269703, 266678, 264661, 257178, 262125, 260034, 251245, 252651, 250886, 246269, 246923, 245777, 243757, 246721, 244614, 240146, 237814, 233724, 225121, 217281, 212840, 206019, 202093, 200491, 203263, 200342, 195257, 189722, 188302, 187020, 181532, 182133, 184159, 181695, 174434, 175091, 174237, 171093, 167073, 161138, 160040, 157838, 156102, 151352, 147885, 146889, 148205, 146430, 149328, 146127, 141988, 134041, 124244, 124787, 132357, 130987, 128194, 128034, 124697, 126085, 117123, 107547, 104991, 102728, 100463, 92588, 92894, 97529, 102355, 108348, 107462, 105907, 103706, 101316, 102664, 91477, 89128, 88802, 83224, 85919, 90733, 89282, 87520]
9027H7520j312k667r019n099O73l175N170l188n012M067l567m463K542K528K859
9012F7857j634R62k177Q15k348o698J006M041N726n524l605N658o352n116K254
8997E4865J184K857N158L813l597o929n317m810Q22k222m911P61p80m892L508
8982C9510k695n643M400L406l369M725j6o537J0Q317Q59l135n331j251M001j189
8966C6062j93j979K304n833p957K773M129P448K827q35l623m409J591N553L891
8951D1749l43p403L729L736r551r15O437J7q339j553J499l852J204p76j205m195
8935B0239m87O538L716l314J016J932L32r029K170M888J353J093j12r100l096
8920A8139J579P701L23Q61k918m504P60k765r684N730l89L9j329j667m562M379
$$ y = [87520, 86208, 83541, 74522, 69423, 70096, 66921, 72091, 68903, 63891, 67958, 64391, 59928, 62470, 64998, 67857, 66223, 67185, 65008, 65823, 63475, 56777, 57783, 61824, 67550, 62026, 58421, 64079, 57727, 52611, 54865, 56049, 58906, 64064, 67877, 64280, 57351, 52034, 47224, 48046, 45824, 40913, 41674, 40894, 36002, 39510, 36815, 31172, 35572, 38978, 35609, 40334, 40318, 33781, 33791, 42108, 42967, 39832, 34501, 33250, 37251, 36062, 35869, 33890, 36194, 30361, 22404, 25177, 29306, 36754, 39581, 38746, 35123, 30714, 32305, 37858, 41749, 41406, 34003, 37732, 41468, 31917, 31002, 37439, 37456, 29117, 27564, 29063, 25211, 26415, 25639, 24434, 20239, 19752, 26290, 30006, 26692, 27708, 29640, 29972, 20943, 23113, 28001, 29354, 30447, 30335, 21235, 18139, 19718, 27419, 27742, 28603, 25685, 21181, 21941, 19176, 9492, 15222, 14833, 14872, 13543, 11876, 7314, 11693]
8904A1693N934K488N136O28j08n547l637K590K962k644j320k324n078L69N100
8889A6242n565O50N980N477j339j0103j050K198l483J94M597J368j7M845L461
8874B3455k660m56n371m993O47J645J057L622m989K003J429K780R39j297k353
8859A5458q305o202n27M250O888l695l904j567K298J0921Q18K523O31m296n630
8844I661J374L520m39q179K509k967n403k070M310o7O873K375l893R39O378L497
8828A8418j280m236J368K066M184m581n929N129N784m870r471p870k02R281M147
8813A1938q236n590L884L70j757K201K917K221M840J677j922l206n008k595J845
8798C579J039K097o50n573J777K044n407O634J232n16o209L666J1626l784j0722
$$ y = [11693, 17627, 20115, 25251, 25879, 25771, 20224, 16587, 19177, 22139, 19495, 18175, 15851, 10773, 11142, 16242, 10677, 11327, 17307, 22784, 21445, 11342, 10292, 12490, 9007, 9201, 13798, 15166, 15149, 19994, 23455, 20795, 20339, 14968, 9975, 10622, 12267, 13324, 16946, 11957, 13960, 15389, 18169, 19108, 17811, 15458, 7153, 951, 424, 4674, 11562, 7867, 3963, 2396, 4694, 15615, 16433, 18956, 19587, 15291, 9661, 11035, 14555, 14116, 5937, 8446, 5479, 76, -1994, 2316, 2249, 9122, 11497, 7604, 8543, 14921, 18418, 17138, 12902, 14270, 16336, 20520, 15939, 10010, 15139, 20923, 16053, 6582, -1288, -1490, 7791, 11938, 3702, -1888, 1996, 2366, 609, 2810, 5727, 7948, 12788, 14465, 12543, 9337, 4329, 1734, 3579, 4618, 6715, 6065, 492, 2269, 4313, -1094, 5540, 6772, 6256, 47, 3713, 15339, 11555, 833]
8783H33J627k308J943M538L476m713l342J2204M774l706p44l139J65L793k674
8768A2727K949N358j475l34o489n019m139j775L905j834L87K409l512j009L216
8753E365L645R37K940L735l294l024k469k716J067m617Q39K169K226K903l506
8738F200l504O446K205O52k863l557j979k539J676L957P298M147q850k860j391
8723E038n207M367M142K94J456j752n72j208J0570P069n788o183M075j846n914
8708H541k568k614O249J901m883K208L081p368K170n864M23L107j900J090O109
8693I682K327l265O16k336m860Q34M58n766R26K472M923N248k08q85j834r926
8677a594o724O607R846n86k471P453K758k030l859L05L395m749j066K63j221j334
$$ y = [833, 2460, 152, 2095, 6633, 10109, 5396, 2054, 14258, 19032, 15326, 14582, 11443, 11608, 15401, 12727, 15676, 21034, 19559, 19225, 12736, 7717, 3578, 1803, 5708, 3874, 4261, 6670, 3158, 2149, 5365, 9010, 9947, 12887, 16622, 13328, 10304, 7835, 5119, 6186, 1569, 2408, 4577, 6803, 9706, 6200, 2696, 9142, 11347, 11999, 9136, 5579, 3600, 1061, 2737, 6694, 13992, 18139, 9289, 6429, 5038, -169, 4198, 8340, 8634, 10090, 8338, 7766, 6558, 17128, 24197, 18409, 12226, 16301, 14455, 8541, 5973, 3359, 9608, 11509, 6626, 8834, 11915, 4547, 6717, 853, 1276, 4383, 2483, 3573, 9682, 12009, 8744, 9360, 7024, 2164, 2998, 3456, -2310, -1384, 1088, 6011, 11259, 11051, 10166, 8332, -1594, -8318, -1711, 8135, 7549, 5078, 12531, 15289, 13259, 9400, 9705, 13100, 8351, 7285, 7548, 6327, 4993]
8661D993M743N312r004O19N279M343m835o685J45m3O775L503l397m583r97o0j804
8644D304o464m272N591P609l628J335L313L86l022M322M33l128J009Q53j298M369
8628A1712L743j260k311J99j490R91l219J017j132q35o070l519j731J523P951
8613E569J895J166L393J298k990K08o385m448J319R019M777O630k522p181O79
8598A2427J467j270m039K70O14J535K15k72o486J392K991k889M006L806n334K540
8582A0973L572l327q95J232J451N71l025k971n917k587J499L53L922N46l855j30
8566A412R33p646N421j389K71Q240M595j75p639p102o562L494O188L895L169Q01
8550G906m410j114m764J264j807r263K198k941R031Q358M829r3L424q22r211p887
$$ y = [4993, 9736, 15048, 6044, 6663, 11942, 16285, 11450, 4765, 4910, 4867, 11642, 15145, 11748, 7165, 6168, 6108, 4304, -2160, -6432, -841, 6768, 3140, 4475, 7788, 8174, 5152, 9474, 9907, 6779, 7788, 8641, 7343, 11712, 15455, 14195, 11884, 12083, 10593, 11584, 8365, 9382, 8250, 7415, 1345, -2174, -3905, -2382, 5569, 7464, 8630, 12023, 13321, 10331, 10539, 4154, -294, 1025, 10044, 14821, 21451, 18929, 11748, 12427, 13894, 12624, 8585, 8855, 9469, 11004, 11219, 10947, 4461, 5853, 8844, 5955, 9961, 13767, 8433, 10973, 14545, 11218, 10323, 11555, 13006, 13577, 10552, 7581, 1664, -923, 576, 929, 4851, 5397, 1542, 1412, 2345, -5301, 120, -1269, -998, 7242, 11837, 11662, 4023, -3079, -9641, -6147, 41, 3936, 7105, 7906, 3496, 2382, -2382, -1118, -2925, -12188, -9990, -12931, -3900, 4458, 9287, 9194, 12618, 11796, 2585, -5302]
8534e302O08M309J710K26k314R21P090l535k098N116P045n40q752p64P276m390
8518F606n524l474p043k124M940K504n526k844N968Q794J219M001P997m501m508
8503F485n396o72M060N9m070m87M371J146j957L436m527r644m669Q547Q002J787
8487F471r64j575J285m375p029L137Q243L439J509J46j723O225L655q227p689
8472B528L100r81m666k434K78n06N2M021p273k437J854O538N96K587o477J06R689
8455F575j895k577M741o758l173K667j82p146o50J1398n419k307j185M45K990
8440b476m835j771J084k929l884P795M568O0P248N21j916J323O119l177L37J164
8424I231n205K058k136m722k976M650LO810L555l4n967J267m96J244l54k954j396
$$ y = [-5302, -4694, -385, 1325, 1551, -763, 158, 7248, 3713, 1615, 6731, 13776, 13236, 4484, 3720, 10996, 6606, 1082, -2392, -9435, -11559, -6619, -4115, -9641, -12485, -6517, 2277, 3496, 7497, 15494, 10993, 6485, 1089, 417, 4477, 4536, 466, -21, 4350, 5496, 3539, 6975, 2448, -7196, -11865, -3318, 4684, 6471, 5507, 3932, 5217, 842, -6187, -3050, 5193, 8632, 10141, 10287, 8564, 14789, 18444, 10217, 2528, 5628, 4647, -19, -2453, -2175, -2681, -2629, 1392, -5881, -8318, -6464, 74, 670, 3257, -3220, -3114, 6575, 4680, 2103, 6844, 86, -3087, -420, -602, -7748, -8398, 3000, -2419, -4726, -5911, -5466, -2476, -7311, -9082, -7998, -10927, -14811, -7016, -2448, -2388, 4860, 5381, 3465, 4788, 10907, 7730, 8067, 9231, 4026, 6084, 3948, -774, -3750, 900, 903, 7713, 11268, 11234, 5267, 6534, 6038, 7282, 6928, 3974, 2578]
8407B578q48P327K670r716l49L596l89M23m337n052M470R204P955L351o233p211
8391G439m392n314l141J389K086J702L859K597R25k04J011m610j185O762k08n556
8375C160o224J608l775M116M630K781L045j606j393j674p024j717K362J296p735
8360h150n682O430q80N051o82j364M627p81l105J672j991p41M76L200O570l18
8344D332M367m114l577m376N968K448q904K071J223J5k410M009M131j834M613
8329G962P809m228l190j16q55j810J430K347O351m633q162k372o194J236r562
8314a3987L12M698N55M866M734m47J372n405r367k11K811Q704J211m511J06O075
8298A516j499m5J1340M679n084o8j041p563m747q435r77O670Q081J351k678M363
$$ y = [2578, 1730, 9057, 11727, 2011, 1662, 5258, 4869, 5292, 955, -4097, 373, 9577, 17532, 20883, 14650, 7439, 3047, -2267, -5408, -4019, -1933, -231, 3628, 6225, 7150, 6946, 7957, 3347, 2162, 8924, 8716, 3160, -3064, -1456, -5231, -1115, 3515, 6296, 9341, 7735, 6342, 4668, -2356, -4073, -1711, -415, -8150, -13832, -7402, -8282, -3231, -3913, -5277, -650, -1431, -4536, -2864, -4855, -5596, -5120, -1920, 4650, 4332, 8699, 4585, 1008, -3368, 2600, 5048, -3856, -1785, -562, -547, -2957, 1052, 5183, 3349, 7962, 15771, 11543, 8353, 8237, 7382, 5572, 7002, 9349, 15700, 11067, 2905, 533, -5661, -4425, -13987, -13675, -8977, -8422, -3556, 1178, 731, 2103, -3302, -12669, -12880, -10069, -1365, -154, -4665, -4559, 1516, 17, -28, 11312, 15991, 10907, 10839, 9798, 2235, -2512, -10947, -11924, -5254, 2827, 4178, 1500, 5863]
8282E863r7j0298l315k688M936M426K985j017L28m18K14O391L20n838m579O925
8266D138n897l10K504L643l483p239n324m040k386j182j151O325J925j439J1395
8251b521L556n30J682j130M439L299N710J828P77j0747l052k576J311L043m286
8236H03m277m88O113l241L88J515J633j074n70M546K188J959m34q297n195P496
8220C065M398J699N76n821o241k569j712O457L141l337q33R30P152k579j622L589
8204F293M043K060j296J684m725j0738j455J1207M048j260N755M051l159l211
8190A3297k952k587k019J347l180k564l966k972K087J0341N797m440n625P10K891
8175F165o450n642l046L220R854L827M786K935p218j076J846j629l323L010n1
$$ y = [5863, 5766, -4532, -7847, -10535, -5599, -1173, 1812, 795, 1123, 705, 919, 7310, 7630, 1792, -2787, 4138, -1759, -2069, 435, 4078, 595, -6644, -11968, -16008, -18394, -19576, -20727, -14402, -12477, -13916, -2521, 1035, 505, 2187, 1057, 5496, 8795, 14505, 16333, 17110, 6363, 3311, 735, 2046, 5089, 803, -3474, -3962, 2151, -1090, -702, 813, 2446, 1372, 802, 5348, 7536, 9495, 9061, 764, -4431, 3065, 7463, 9162, 9738, 3917, -2324, -4893, -6605, -148, 2993, -344, -1177, -247, 6905, 4326, 2704, 6293, 10336, 12396, 11100, 12784, 8059, -2679, -4134, 7073, 11121, 9861, 15616, 19667, 16508, 13297, 10345, 7758, 5739, 7086, 3906, 1342, -2624, -5596, -3509, 6832, 12629, 8189, 2564, 3274, 6165, -285, -5927, -8973, -5753, 4101, 7928, 12714, 15649, 8431, 7355, 9201, 7572, 4249, 7259, 7208]
8160G208o248K11J174n258k293L739r273L19K461K423O214K689O598m160j0623
8145d819p300j263N565L97J398J876J512j373N227J277J609K25N285n752q316
8130d452N253J390M058n722j0982o150J0998J3096J492k628m122q944o042O982
8116e773N970L250j787o817K808L240J458j44N748j082o777k164k042k214N349
8101i77O225R01J068L425q806o117j070n358M370K395L340J00J457l463q75J715
8085a670j442k181R51j053k560j344m088r67L236J187L194J111O25l646L004Q400
8069B757O60k711n22K084j06L695J593o105o520k597L550O873Q218p671n979k537
8053e318K518N273n41M16N365m90p371O437J914r60K266k892L62L072j371p103
$$ y = [7208, 960, 1171, 2345, -2913, -5206, -1467, -10740, -10421, -7960, -5537, 677, 3366, 9964, 5804, -4819, -12119, -13382, -7817, -7420, -6022, -4146, -2634, -4007, 1220, 2497, 4106, 4331, 9616, 3864, -4452, 801, 2191, 6249, 527, -10455, -16605, -5607, 7489, 8981, 6353, 2231, -6713, -12755, -5773, 197, 3447, 1660, -5157, -2349, 891, 2349, 2205, 7953, 6871, 94, -2070, -4112, -6326, -977, 5248, 6149, 7217, 10642, 1836, -4281, -5351, -10709, -6339, -3944, -604, -504, 953, -2510, -3385, -1670, -3112, -5293, -4342, -5395, -7955, -9299, -13387, -14354, -11118, -9931, -6737, -5626, -5001, -8647, -5643, 2757, 3417, 706, 184, 2268, 2162, 5857, 7450, 1345, -5175, -7772, -4222, 2651, 10869, 3198, -2781, -5318, -2800, 2473, 1932, 2348, 7713, 7223, -148, 6289, 8203, 7243, 9509, 6617, 6979, 10051, 8680, 1577]
8037A577o621J556O951M099m486L096K255l591J938p91r612j874R891l89K541
8022F540R81o145j593J193m662j787Q46J577J670j106j775J585j423J892l58P470
8006D905N085j331L31o623m360k456J660P428O194M101n072o773J30K433k022
7991C630J010L245j191l211J146R07l936n854m814N871O679k904j399K137L385
7976D701L14L920J308m220M635k444q427m617j320Q283L196J364q22N380p62l959
7960F530l264K18N393m439m783M880M182M701o360O77L259P595j241o07k835N657
7944A9563J196l417n970q46l750n032L652P613k904o276L341L559L998j339q68
7929A2520l220p311p753K119J2108L344k730L781k353o130l140q91O06k532l466
$$ y = [1577, -5044, -3488, 3463, 7562, 3076, 6172, 8427, 4836, 6774, 5983, -3629, -5503, 4388, 3999, 6540, 7521, 1376, -217, 976, -3686, -5473, -4627, -3050, -1380, -2486, -4261, -2676, -4099, -2207, -2565, 4905, 9990, 8659, 8990, 2367, -1993, -4449, -2789, 4639, 10833, 14934, 9862, 3089, 3219, 5652, 3630, 4640, 7885, 6694, 3483, 4629, 5536, 1600, -4254, -9068, -3197, 3482, 578, -821, 1316, 4701, 5015, 8935, 10243, 6023, 10658, 8214, -213, -4830, -6150, 2133, 5329, 6693, 5871, 11251, 10489, 6530, 3266, 3484, 8877, 4438, -345, 4535, 8717, 13418, 7058, 7735, 10994, 18589, 17348, 16741, 13906, 19563, 20759, 17342, 11372, 10526, 6776, 1744, 5396, 13009, 10105, 3829, 7170, 10729, 14727, 13388, 12520, 9300, 1989, -5764, -3645, 8463, 11807, 9077, 12858, 10505, 4375, 1235, 344, 950, -1582, -5048]
7914e048J873M560k960o10n270K492N363M764n88l589k262p848M036K040M92j588
7898d143Q509J2678N551n884p106k577O99k864l136J457m273K959J0236J711m022
7883I795o409qk810k745L139O058l066J254O4j934r61j015l902J809L484L464
7867F217K912j198k240j494j876K202p117l654Q92j684J997M841m915J154O936
7852B973K21n585l337j476l166k06L840P720M056j350J57n316l434J936l29J095
7836b201M692N545M771K368q688L7J456p323L73Q284q273m489r30k968L059l442
7820g729p014j617P695R862P166R006Q09k187o310p187J96k603j37p199o091j324
7804a4664Q531M363N79j394Q36L509r04p90O346k749M577k490l587o066J890K357
$$ y = [-5048, -3175, 1385, -1575, -2185, -7455, -4963, 400, 5164, 4576, 987, -1275, -9123, -5087, -3047, -2555, -4143, 4366, 17044, 22595, 16711, 9605, 7028, 7727, 4863, 1727, 3184, -1089, 1870, 12106, 13817, 9795, 3386, 3378, 568, -2177, 962, 7020, 3954, 5208, 5272, 3338, 2377, 1362, -2540, -731, 2753, 6217, 9129, 7931, 5691, 4197, 2321, 4523, -2594, -6248, -5356, -7040, -5043, -202, -5117, -3963, 2973, 3194, -2391, -5728, -7204, -10370, -10576, -6736, 984, 5040, 3690, 3847, -1469, -4903, -2967, -3296, -2201, 2491, 8036, 12807, 15175, 6487, 6524, 7980, 657, 1030, 9314, 1041, -3448, -4378, -7346, -4287, -7729, -14743, -16360, -8665, 1197, 8363, 17369, 18178, 15991, 9681, 2494, 2690, 87, -50, -7249, -13340, -14664, -6133, -1770, -1191, -2585, -1749, 1760, 856, 66, 6412, 3663, 8240, 5750, 2163, -3903, -2013, 344]
7788C44N212m256j2576r195K490O006N970Q141L972k192o10p046j016k868N56
7773g068n522N089O659P892p827r590R92K94q909k782R154J4804O174n599L579
7758G340p3m492k727j516R47k750k245j124r9N737J872q414j262K563K173o704
7742a0774P223N830K207J982n568o425K421P71l071j186j618M090N501K864n089
7727h42l489N230k104o60l849L037j613k34k034L305R466k996j672k708l113J608
7711b668K705j443l4Q67k562m859R27J465j007l485j881N332L507P28K734L556
7695C882m363j146N745K301j29j847K267j227m87r45J233O477q09q137m093k152
7679c430p250j988O385j985K406J957r64m595P71J914Q538P849L025L661n174
$$ y = [344, 5556, 1300, -11276, -20471, -17981, -11975, -6005, 2136, 6108, 3916, 3306, -3740, -4756, -7624, -7068, -12590, -7501, -842, 7050, -777, -10367, -9375, -9081, -17990, -20772, -11618, 3186, 9360, 3761, 7340, 7267, 2775, 48, -1468, -521, -3271, -5516, -6640, -6739, -1002, 870, -7544, -8806, -6243, -4070, -10774, -3551, 2279, 4486, 6468, 900, -5525, -3104, -2333, -5404, -6590, -8208, -4118, 1383, 4247, -842, -4331, 899, -1205, -1865, -5714, -2677, -4290, -4524, -6558, -3253, 6213, 3217, 1545, -1163, -4276, -2668, 37, -1406, -1440, -573, -3135, -7994, -7067, -5602, -6609, -10094, -11975, -6643, -3136, -2408, 326, 3882, -481, -1627, 4118, 6419, 6290, 4443, 6710, 5483, 4996, 4051, 5284, 11761, 10952, 2815, -1278, -3430, -10680, -12668, -6283, -8268, -5862, -3905, -4869, -9464, -8693, -6779, 1759, 9608, 12633, 16294, 11120]
7664A1120n758m177j274M603J398l001n909M489N769J333p438L805O480J77l72
7649A1245m933j656M357p375P99k079j404P71k028M390k142L815M878o292M68
7634B814O64K267J296l918o147k622r85K233P430J901n13n252l6O799J744m782
7618B893M63M664k911l620l392Q67k279N386L119j875N624J98r406k945j518j696
7602f428m914j015K63N583r91k28J0753K450p895n175k993m037L44K958P05L805
7586f815O38J113O21Q698N145k496j3689k771K641m493j546R30J395m446l061
7571a8136L723M65m252K587q29K832L917j702K016J406k755m524L293K333P847
7556a779k36j676L938j208l024R89J570l9N118l258r000J791L443L069L060N238
$$ y = [11120, 5362, 1185, -89, 4514, 5912, 2911, -2998, 1491, 7260, 8593, 1155, 4960, 11440, 11617, 11245, 6312, 4656, 9013, 1638, 2437, 358, -1046, -275, -2303, 2087, -55, 3760, 8638, 2346, 2814, 3478, 5745, 7041, 3123, -3024, -5646, -6631, -4398, 3032, 4933, 4420, -832, -868, 5931, 7675, 2893, 3356, 8020, 5109, 1489, -1903, -1036, -3315, 2071, 5190, 3315, 8939, 9137, -269, -3214, -4732, -6428, -11342, -12357, -12094, -6511, -7502, -7730, 3023, 5473, -2422, -7597, -10590, -14627, -14283, -11325, -10620, -6815, -6177, -5064, -4443, 4255, 9400, 6904, -6785, -9556, -6915, -11408, -12954, -12024, -10629, -15075, -18136, -14413, -13948, -18200, -15613, -16442, -13610, -9693, -11395, -9379, -7973, -10728, -15252, -11959, -9626, -1779, -2015, -3691, 247, -961, -3985, -2996, -1426, -1465, 3653, 395, -8605, -6814, -3371, -302, 2758, 7996]
7540G996K688k677k96L78l566o214Q71p602J921O244M36q570o201M622Q759q40
7524b051o5l049O31L249m782K40N985M25l724p34J664m47L947K343n292k741M225
7507a76J558m58k280k187j036J740k000r94k47K606J287j775L604N860k636q015
7491e149k158l427o11O056J589m6o27J460k224j722P728r39o719l495N252P613
7475B581l719n517p092N083P705K418j094k476Q58L415K256r72o002p631O984
7460c203O892K818L498l389n288l850n696n772J0235K350L548K370O305m832n532
7445D54m204O349L824J368l760L797l478j292j11M67k009j777K31K32p11N44M093
7428D017j212k603J367j515l875l645j798L157r46L538m93n66Q24K142k088p643
$$ y = [7996, 10684, 8007, 7711, 8089, 4523, -1691, -820, -8422, -6501, -257, 179, -8391, -14592, -9970, -1211, -2051, -2116, -5165, -4534, -1285, -6067, -5827, 158, 583, -3141, -3875, -2211, -2658, 1289, 3632, -1660, -4401, -176, 1382, 924, -1356, -3543, -4579, -2839, -4839, -5833, -6080, -3474, -2187, -3962, -358, 5502, 2866, -5149, -7307, -10734, -11345, -5289, -3700, -3746, -4373, -2913, -5137, -6859, 869, -70, -6789, -10284, -5032, 2581, -1138, -6655, -13747, -8664, -959, 1459, 365, -2111, -1253, 2162, 4418, 3446, -2556, -10187, -3203, 3689, 6507, 10005, 6616, 1328, -2522, -8218, -13990, -3755, -1405, 2143, 4513, 10818, 5986, 454, -3750, 2599, 6423, 7791, 4031, 7828, 4350, 3058, 2947, 3414, 1405, -372, -141, 91, -620, -76, 4017, 2805, 202, 1569, 54, -3821, -7466, -9264, -6107, -7053, -3515, -4008, -4574, -3750, -1608, -3696, -11339]
7412a1339O043K536m676J133O751p25K957N3J334n612n925M727J0080O390K117
7397A5844l017n047K958n628o174j649K864J179j271n021l125l987n821O422P806
7382c667l93L361O531j863k279J605m191k099M804O553j250n00j0588m110k728
7367a0814L52Q168L71M609j962o663k836M184N839J245m588J35p97r012m919N924
7351a0764R93R170N038l754m052o440l240j485Q768K301N56l9L560L715N66q94
7335C999k797K917K855J91o120m841Q095L504K934k349N856O09q692p651k788
7320d278n321k119L47N266l27l897o56J767M904k424j501R479R400K741m516j3274
7304d409o964P09N517M073J419n105M415k242l513J728k248k26N033o336m664
$$ y = [-11339, -5296, -2760, -7436, -6303, 448, -277, 2680, 2733, 4067, -1545, -7470, -2743, 7337, 13727, 15844, 12827, 7780, 10738, 5110, -1064, -2713, 151, 1330, 59, -4962, -8087, -12074, -17895, -11473, -3667, -4060, -699, 5832, 3969, 1690, 3295, -896, -2995, 1809, 8362, 7112, 6612, -3976, -8086, -10814, -10462, -2294, -1923, 2686, 724, -5939, -8775, -4591, 1248, 2493, -2095, -1960, -2757, -11769, -16688, -10764, -9771, -601, 4437, 683, -3369, -9809, -13049, -14534, -5766, -3465, -2909, -2948, 612, 4327, 4893, 3999, 1202, 4119, 6974, 7165, 1045, -3796, 4299, 7803, 10737, 8388, 14244, 14853, 6161, -1490, -4278, -9599, -11718, -11371, -6105, -6432, -10329, -10985, -9218, -4314, -6738, -8239, 1240, 10640, 13381, 8865, -4409, -11373, -10664, -5147, -1074, 345, -4760, -345, -2587, -6100, -4372, -6620, -6846, -1813, -8149, -12813]
7289a2813L602Q57K577K578M324q530P167N184M05j352o713J204n398O598K659
7274B349p495j901J04m090Q508O670J735J72O514M584J719p740j1877l327P455
7259C380M280q006m072o869l367P624O124m24L872K639m1M959K268k954j925K249
7243I737N58K490q782r311n742m766Q799l85q68N968P155J317j671J142j711l4
7227C896l630j569k650N242N31m172L902L626J628L350Q94N25J475q943p83o56
7211B666l423K41J025q73m600Q793N300o123j589q99l25k240n330M488Q327p277
7195a839o81P393J453q642R30L772j053K91P788M386m00n145q511n172K812L564
7179I46Q62k541J824J438n939l762Q240J614K074n577q303j452j305J446k356
$$ y = [-12813, -9211, -8354, -5777, -3199, 1125, -7405, -238, 4946, 5351, 3999, -2714, -1510, -6908, -310, 2349, -5146, -7047, -6943, -11033, -2525, 4145, 5880, 6052, 12566, 17150, 18869, 11129, -748, -4075, 3380, 7660, -346, -4418, -11287, -14654, -7030, -906, -1330, 2542, 5181, 5140, 10099, 12367, 9413, 7488, 9737, 10295, 12785, 4003, -5308, -11050, -15816, -7017, -7402, -8270, -2302, 4853, 6170, 4499, 5641, 3930, 3896, 266, -1303, -3953, 1289, 1820, -2352, 1550, 5176, 6804, 10154, 11048, 11573, 13048, 4105, 3322, 2666, -757, -516, 509, -364, -4964, 3829, 9129, 3006, 1417, 518, 193, -2047, -7377, -2889, 5438, -1839, -2520, 4873, 6326, -2316, -1386, 2386, 1333, 1624, 9412, 13798, 13398, 8253, -258, -5430, -2618, 946, 1808, -733, 1091, 2529, -3410, -7172, 1068, 2682, 4756, -821, -9124, -10576, -11881, -10435, -12791]
7164a2791n530J663J1168M227j426O243M157m184m63k120m366L856m232k208J096
7149d910N182r330J656M658L147n79N73L772L773p38O199m432l973j393P56o397
7133b036p983K755Q340J426Q54m683k586J448l541Q73j771k555L102L076K953
7118c28J552K392p07o981l27R93j092o23k47l234P11M228o821N455J3460N719
7102A4150k464J821j943k364k035M661q114j609n057n501k822N360j184j967p56
7087i824M47m171M112P739J494K053J869m87J27l414M363L230R062j990l028n213
7071F369q656k919J575j203Q364M333J577m41j064n82m064p9K037l574L830N428
7055A0931k224l397l222M702J097o988Q14l57n077m296L389Q775N004J963M46
$$ y = [-12791, -18321, -16658, -5490, -1263, -2689, 3554, 7711, 3527, 3064, 944, -3422, 434, -3798, -6006, -4910, 272, -9058, -7402, -2744, 403, -176, 397, 4169, 7942, 7204, 13403, 8971, 4998, 3605, 4361, -2036, -10019, -7264, 1076, 2502, 3356, -1327, -3913, -2465, -6006, -5133, -6904, -9459, -6357, -3281, -328, 1224, 3616, 2909, -4072, -4399, -3406, -4498, -5121, -5368, -8602, -7891, -3663, -10484, -5029, 8431, 14150, 11686, 13507, 11564, 9200, 7165, 11826, 3712, 2103, -2954, -8455, -11277, -5917, -7101, -9068, -9824, -9377, -13548, -9436, -1697, -203, 1850, 3719, 3232, 3359, -55, 4308, 7538, 16600, 14610, 11582, 6369, -2287, -5206, -3631, -4834, 3530, 7863, 9440, 8999, 7935, 7353, 3289, 3210, 5247, 1673, 5503, 10931, 8707, 5310, 2088, 6790, 7887, 899, 1713, 1356, -3721, -8017, -4628, 4147, 9151, 11114, 11560]
7040A1560n390k417k02l118k413m638J193k510K013n98K897k967l473K815R359
7025B111N664k671m463j339n748K008L908K156N23L078Q298o227k435p594J498
7010a233P59m554M53J073j043m298m887O30J364K985K557P666k39m669l093q0
6994f609R26o14j380J278O165m381o847m125L95J0265J851j041j805k523q90J272
6978h063j294L194J509j705L290M626M229m780m401L512L285m186J401K946p167
6963c604j212k903j824K760J538j289k540p457n13M736M650j048J451J1055j076
6948B724j0780M729L309j247k34n750l617M846l21j269j246M466M624j441l600
6933d807k856q782k451N398P436O633m799K525l350k791j743k73M914LJ455j662
$$ y = [11560, 6170, 3753, 3551, 433, -1980, -6618, -5425, -7935, -5922, -6520, -3623, -6590, -10063, -7248, 2111, 7775, 5104, 641, -698, -6446, -4438, -530, 1626, 2149, 5227, 13525, 7298, 4863, -2731, -1233, -474, -5028, -4575, -3502, -4545, -8843, -13730, -13100, -11736, -8751, -6194, 1472, 1233, -3436, -6529, -6609, -5683, -6297, -7677, -6399, -234, -4615, -11462, -15587, -15192, -4927, -3076, -4117, -5922, -8445, -9335, -8063, -9357, -6163, -4654, -6359, -3069, 1557, 5786, 1006, -3395, 117, 3402, -784, 617, 3563, -3604, -4816, -7719, -9543, -6783, -5245, -6534, -9074, -16531, -17044, -12308, -7658, -8706, -7255, 3800, 2724, -8056, -3327, -18, -1265, -1499, -7249, -10866, -6020, -6341, -7610, -8856, -4390, 234, -1207, -4807, -7663, -16445, -18896, -13498, -6062, 571, -4228, -1703, -5053, -7844, -9587, -9860, -4946, -4943, -3488, -5150]
6917e150k118J228N657m969m647M063O358O749j019k143n501j859J98N303K230
6902D380l234l300M121L551l396K47p33L050L789J607n430J757l828n462J558
6887a323l393K369J3869Q351n770m357n787l809l067k871k516m990r01O455J2097
6872D357J3021J1949N061q007j4649k755k473o30L760L559k496j1046j1592J045
6858a0896L562N69L631k548M215J0452l187l448J572k23j8J57L486l766m637j70
6842a249K765o73L403o71n96N24N31j820q482m025j423Q214O704q35j716j242
6826e91Q710P33n047k354N769J525q615o340o1J2780P771L183l928q569r774l493
6810h301N152n4j661J654M316l949k527l85N191Q72j259j163L0j128P35O993J0503
$$ y = [-5150, -7268, -6040, -383, -5352, -9999, -5936, 422, 7171, 6152, 4009, -1492, -3351, -3153, 2150, 4380, 1146, -2154, 1967, 5518, 2122, 2369, 1636, 4686, 8475, 10082, 4652, 6409, 2581, -2881, -1323, -4716, -2347, 11522, 19873, 14103, 9746, 3959, 150, -2917, -5788, -8304, -13294, -14195, -7740, 4357, 17378, 29327, 34388, 26381, 11732, 8977, 6504, 5874, 9634, 13193, 10697, -349, -11941, -10896, -7334, -6765, -3134, -5682, -1467, 8985, 5798, 2350, 3922, 3699, 3681, 3838, 7324, 3558, -1079, -1249, 1516, 843, 4246, 3575, 2979, 3503, 4034, 2214, -6268, -10293, -11716, -3502, 3202, 2367, 651, -591, 8119, 8852, 3805, 1451, 7220, 8745, 130, -6210, -6271, 6509, 14280, 17463, 13535, 4966, -4808, -8301, -3149, -3203, -4864, -3210, 1106, -2843, -5370, -5755, -564, 308, -951, -2114, -2084, -3212, -2477, 4516, 15019]
6793A5019m787J815n606q401m441j676n613M12M015K968J305J424o344L656J395
6778d859N62k886K785p154P025R361N803J781r78j0014j0743r06N983O308L745
6763E813N088p312J254L887K436J705k37n732l294J716L059L466K267n785n990
6748B341J545k306j651R36L297j753K303k421m461J36M283Q11r964k971R49K729
6732f197Q894M538j041j342j1241j2203P9N855Q504P892k677m216k289n288l17
6717a1049p268M936N455P292K364k429k224j767k701O921K69j741q96O92L48m325
6701f123M066l660k106M925n08l669n67O97J373L403Q755r69l298l618M906M688
6685H295m374K153m516M82Q963M329m279m966j574J297j897k573k231r38l191
$$ y = [15019, 10232, 12047, 6441, -1960, -6401, -8077, -13690, -13278, -9263, -6295, -4990, -3566, -9910, -6254, -4859, -4297, -7183, -4398, -11552, -4527, 4834, 10637, 12418, 11440, 1426, -9317, -10223, -4240, 2068, 5813, 10901, 3589, 4843, 8730, 11166, 12871, 12634, 6902, 3608, 5324, 8383, 11849, 14116, 8331, 2341, 3886, 1580, -71, 865, 4162, 2409, 4712, 2291, -2170, -2034, 2249, 3060, -6904, -9875, -8926, -6197, 2697, 7235, 6194, 4852, -6389, -18592, -18513, -12658, -4154, 3738, 1061, -3155, -5444, -10732, -11049, -18317, -13381, -7926, -634, 1730, -699, -2923, -4690, -7391, -470, -201, -1942, -2838, -2146, -1798, -6123, -2057, -5717, -7823, -2898, -3406, -7075, -7642, -6945, -5572, -2169, 6586, 5617, 2319, -1299, 3607, 8295, 3921, 6074, 1558, 2040, 11003, 15332, 11053, 6087, 4513, 5810, 3913, 1340, -891, -1829, -5020]
6670e020Q17P177M587k256o690j518K743M736J012K405o19m448R69p575l732k770
6654a0182M696O169j662K912l743k61M90k936j914M185l9N556L925o800n929l330
6638h863j1680n636P628j051k32J2344O243j305L967M449o496j715l842k679J636
6623g232P88k123r11J092J287J292K95K439k854q732K864k54O376J2930P403K750
6607A7410p473r619j537K758n49j650L976K197j870P75r4J213j567M68K266m582
6591B122K884J082j053l616J96K966l091m970J263K005o369l603K060P944l289
6576c469j46K479m59k499m364m572l336N591j314J67j836M097Q262k535k49J844
6560b339M643j02J729m76l271O631j752l934j320k478l318l460n352L221Q853
$$ y = [-5020, -4203, 2974, 7561, 5305, -1385, -2903, -160, 4576, 5588, 7993, 7374, 2926, 3895, -3680, -7412, -10182, -5486, 683, -979, 1933, -1810, -2071, -1581, -4517, -6431, -2246, -2285, 3271, 7196, 396, -5533, -8863, -20543, -26179, -18551, -19602, -19834, -7490, -1247, -2552, 1415, 5864, -632, -2347, -6189, -8868, -7232, -6444, -8567, -9478, -8386, -7099, -5807, -5512, -3073, -5927, -14659, -11795, -12049, -5673, 7257, 14660, 17410, 9937, 318, -1219, 1539, 990, -660, 3316, 5513, 3643, 4418, 4324, 5537, 3970, 4438, 6704, 2122, 5006, 6088, 5035, 1419, 1615, 4581, 1490, -3480, -2217, -212, -6581, -10184, -8124, -180, -3469, -3615, -1136, -1595, -4094, -8458, -13030, -16366, -10775, -12089, -11922, -13758, -9661, -1399, -3934, -4183, -2339, 2304, 2202, 3931, 3455, 184, 6815, 5063, 1129, -191, -2669, -5987, -9447, -14799, -11578, -2725]
6545b725m412K059P19k567p150o513R62R043J710j727k410R130n26J250R399L538
6529I780l524N174K626p798j713j545N636j930K422n271j771q13J778K664l120
6514B595k348j231j548K928k203j800K831J455k582j0952l309N418Q641m038K730
6499c413R26k288P40N623k875j313K538o77M812J389j0932q543L09N286j740L084
6483g074k17K431M633o37l263j729m260n514k32Q344O264M612k667o84L1m980
6467d942J225Q46j642J43Q25l225N742O128R28m661j109J15O253j228r332l68
6451d302j477l916N927L969J763p249J088j923n211N724L001m493l262K879J0104
6436B622O275j048l050j478n295O53R48K532q86n523q24j70L798M498j499k113
$$ y = [-2725, -7137, -5078, -4359, -6926, -14076, -20589, -19627, -10584, -8874, -10601, -13011, -3881, -4407, -3157, 6242, 9780, 6256, 11430, 14056, 6258, 4545, 3000, 8636, 6706, 9128, 3857, 2086, 1273, 3051, 5715, 2595, 247, -984, -2532, 396, -1807, -3607, -776, 679, -1903, -12855, -16164, -10746, -2105, -6143, -3413, -2487, -4775, -4035, 1588, -1287, -2600, -62, -739, 4073, 5462, -5470, -14013, -13704, -8418, -10158, -7074, -7291, -4860, -227, -864, -4127, -5856, -10116, -15630, -15862, -7518, -1254, 3358, 691, 7, 38, -4942, -3717, -2871, -4513, -4370, -3545, -6770, -1028, 5100, 6028, 1367, 258, 373, 6626, 5398, -3934, -4302, -5779, -9695, -3768, 201, 1964, -5285, -4197, -6120, -11331, -5607, -2606, -7099, -10361, -7482, 2622, 8897, 7849, 4799, 3321, -1974, -1321, -373, 2159, 1273, -4250, -5074, -5244, -1446, 3052, 1553, -560]
6420e60k964o234K436P745K517k206M330M892k027l534n1K121k963j666N218K573
6404I627k507o271J354j779L438R232n245j2078m975l657O176K481j165L01K780
6389b288J045m457K288L82K769k781j0035n36M280N919N875J939j195n31o391
6374c717o66L059K510o03K327k949o087j766j265J468Q167M506m097o517J422
6359d208K254J1581k241k814k414m657k935J546J163K88R08N20P309L697q270
6344A727q83J72j0216J814N564K48L167L896P5k769l187K231K292n066l581K298
6328b218M842K310l881o59J095M263j017o87o066j692M611P136n295l704P57j572
6312a777n158O963J0104l338n605j775N68n864j482K1L043M960l573J072l157
$$ y = [-560, -3524, -9758, -7322, 423, 2940, 734, 5064, 9956, 7929, 4395, 4344, 6465, 3502, 1836, 7054, 9627, 7120, 849, 2203, 424, 3862, 13094, 7849, -4229, -9204, -12861, -6685, -4204, -5369, -5068, -2288, -1243, -5700, -3412, -3030, -261, -3042, -13077, -13613, -9333, -3414, 2461, 4400, 3205, 2674, -3717, -4383, -1324, 1186, 583, 2910, -39, -6126, -7892, -9157, -7689, 478, 4984, 887, -5630, -4208, -1954, 9627, 7386, 4572, 2158, -2499, -5434, -3888, -2725, -2437, -1529, -1009, 6300, 9997, 1727, 844, 1016, -9200, -7386, -1822, -1574, 1593, 5489, 5564, 2795, -392, 1839, 4131, -935, -4516, -2218, 2624, 4934, 1053, 394, 1489, 5752, 4735, 4048, -2018, -3710, 901, 8037, 2742, -962, -205, -1777, -6935, 28, 10132, 6794, 1189, -586, -18, -5882, -7364, -7343, -4300, 660, -2913, -1841, -4998]
6297d998l030l600K696R343K365m576L97J1492J845m220l425J372N48o178q99
6282h68J50J68m718J360O757L078l006m695j400K902k840q561R813L123K500N381
6266I144P21o300o394l296K101n679M291J1906J33n417j741K284k72Q087J598
6251A1166k367k171n115o822j119K944M278l724j303j21J987P17l801r13K787
6236c577P616m997j1526l824L243L926J282o319L123K274L35P893o23J085L702
6221C613n359j376K803Q879M02r691m471O87O521O73M004n097q689K210N382n19
6205b8n97m619K651J710L52M298q247J922j034P1o324J24P722O736j133P404K03
6188A1211o310J659J006j120n861l743r11j971L69M246M735K859J984r43m980
$$ y = [-4998, -8028, -11628, -8932, 411, 2776, -1800, -1403, 10089, 11934, 7714, 4289, 5661, 6209, 31, -868, -718, -550, -5268, -3908, 2849, 5927, 2921, -1774, -3174, -272, -3112, -11673, -1860, 1263, 3763, 9144, 9865, 3565, -2829, -6125, -4024, -9703, -5412, 6494, 6627, 1210, -531, 1753, 1481, 9568, 11166, 8799, 6628, 1513, -5309, -6428, -3484, 794, -2930, -4233, -4354, -2367, -1650, -5451, -6364, -3577, 4039, -958, -12484, -16308, -13065, -9139, -7857, -14176, -11053, -8779, -8444, -551, -1174, -89, 3613, -1746, -3122, -319, 8560, 8962, -729, -5200, -4513, 2008, 2681, 6685, 1588, -7101, -4891, 491, -28, -625, -5244, -2593, -883, -531, 3767, -4480, -2558, -3592, -3521, -9845, -9721, -1999, 4737, 3604, 11008, 11211, 4901, 6560, 7566, 6446, 585, -3158, -4069, -6040, -5671, -1425, 3310, 6169, 8153, 7210, 2230]
6173B230M266m08L437R071J627l281J186L590q55j5082o410j287P3L662k022m373
6157d576K479K191Q327n173m462J840n80o392l786K366M452J506J828J818k342
6142e04N9M905o44m614R14m463p043j8j570J668M232k842r54R994L577k136Q72
6125A433j218j470K432J884n902l11K191N817j185M665J734n395J375Q75n442
6110A483L080o020n45k123N901J770m821K099J940K879n664Q36M342o076j930
6095b849l870p058J018O864p54M870l342n695j881j798J875M839N20j106L130
6080e237R597K284K544l315q085p499K676O499j364m548m980N845M697K115O613
6065G842O18L39k133J515K77l282p641m479R4N536R74M217L05J074j730j219k383
$$ y = [2230, 6496, 6088, 9525, 18596, 20223, 16942, 18128, 21718, 20863, 5781, -629, -1916, -1843, 1819, -203, -4576, -2097, 94, 8421, 3248, -1214, 626, 46, -6346, -10132, -7766, -3314, -1808, 20, 1838, -504, -445, 4460, 3816, -798, 116, -4347, -11390, -11408, -12978, -11310, -7078, -9920, -10874, -880, 2697, 561, 1433, 215, -1255, 1177, 3061, -2841, -3152, -961, 4856, 3671, 8336, 10070, 4675, 6050, 6925, 1483, 4563, -1457, -2002, -4125, 1776, 3546, -1275, 824, 2764, 5643, -21, 815, 5157, -919, -2849, -6719, -13777, -12759, -5895, -6649, -1779, -5121, -10816, -12697, -14495, -12620, -7781, -7261, -8367, -5237, 4360, 6644, 9188, 5873, -2212, -9711, -7035, -536, -1900, -6448, -11428, -5583, -886, 1229, 7842, 8460, 8799, 6666, 8181, 8458, 5176, -2465, -6944, -6850, -1314, -340, 3877, 4182, 5256, 3526, 2307, -76]
6048g6m69n479j641k946M193K724j482M760k702o379K241k873K408R013K463q722
6032d967M72K692j671k882L78n98K422n72K084K701L282l40l342m196j403L486
6016b454L879R04j790O61Q750J050j0552l966Q63o569M244N47K220l467j867N616
6000a931j0837M468N029j288M562J925J005O27o193l452m796N591L847j94m630
5985f267Q689M602l088j818N43J599M571o954r252Q85M871l005m493k153k502
5970a3772J535j219J632J959j252J293K630L951L153N023L138q023o302O842O437
5955G025O80n941j1363o851j430O8L16R664P840j950m069M579J42Qo21k123j962
5938e988K890R17L583n718j2083J936R308N738P88j606o805m92O235Q690J607
$$ y = [-76, -545, -6024, -7665, -10611, -6418, -3694, -5176, -416, -3118, -9497, -7256, -10129, -7721, 1292, 3755, -4967, -4495, -1803, -3474, -6356, -5978, -6576, -4154, -4726, -2642, 59, 3341, 3001, -341, -4537, -5940, -2454, 1425, 2329, 539, 1200, 9950, 11000, 448, -3518, -2655, -9224, -4980, -4433, -2213, -5680, -7547, -1931, -12768, -8300, -3271, -4559, 3, 1928, 2933, 3560, -2633, -6085, -10881, -5290, -1443, -1637, -6267, 2422, 7024, 3936, 2118, 2661, 4260, 8831, 1877, -7375, -6490, -1619, -4624, -9117, -11270, -13772, -12237, -13456, -11824, -9865, -11117, -9824, -7194, -3243, -90, 4933, 8071, 48, -6254, 588, 7025, 7705, 1764, -9599, -16450, -17880, -17812, -17496, -7832, 8, -1942, -6011, -1432, -1290, -1282, -1903, -4026, -5988, -3098, -2181, 1402, -4316, -16399, -14463, -5155, 583, 1371, -235, -7040, -7532, -1297, 7393, 9000]
5923I000p883r85j361r806q86N801J930J412N633j373m713n021K6k431r58P15
5907a0900K71K51N664R938M643k811O334l026K802N868j105r805l108K62l238
5892B040j310O056r424n42K180n274n542N011L518r82m31o937k05O073N471p616
5876g914M684J151l529J931O078j992M135L359K430r628o941L494k225j802m131
5861a0900M200J906k512M154j160l024J267O31P363M970j623m254k366J873L145
5846C670r99l248k67Q59J023k994j109N62J589P93m888O44J990K29r678k09L046
5829h987L403L503K895p870j713k753K185M505o69M942O350J502m260l03k60K888
5813E358j813L137p04j913n950M168J022k958p909k605N358n48J364K646j225
$$ y = [9000, 1117, 132, -1229, -11035, -11921, -6120, -4190, -2778, 2855, 1482, -3231, -8252, -8226, -10657, -11615, -10900, -10629, -10378, -4714, 5224, 9867, 7056, 13390, 10364, 13166, 19034, 17929, 8124, 5016, 5278, 2040, 730, 6786, -2638, -3180, -1000, -6274, -11816, -6805, -3287, -4269, -4700, -11637, -11842, -5769, -298, -7914, -3230, -2079, -5608, -3677, 2401, 409, 4544, 7903, 10333, 705, -6236, -2742, -4967, -6769, -10900, -6700, -4794, -7306, -3152, -4312, -7336, -6069, -5438, 1925, 6895, 5272, 1018, -1348, 525, 3670, 2671, -577, -844, 15, 1038, -1956, -3065, -2503, -914, -121, -5009, -4365, -2375, -2146, -11824, -12033, -8987, -5584, -2081, 814, -7056, -8769, -11522, -9337, -4832, -5501, -559, 5791, 7293, 3033, 2730, 2470, 5358, 3545, 6682, 5978, 4065, -1885, 2283, 3305, 347, -7562, -10167, -4809, -5357, -3993, -1347, -2572]
5798b572o616J004k588N566k613m892K010k732J83R82P049l734n918Q954L154
5783b763j245O023K177J898l359o532j247m29J783O333R05P1k377n756K944p085
5767h659k159K768p31K326L644O631O966n829l967k744J569m38m31J24O33M132
5751C835K141o10o1J899N004N993J118l937m701r912n922r92j720K817j317M122
5735b243J0799P895k170q96k587n715k817o669k094o041N755J93k383k397J97
5720a1173O103M197L480J822j016l741R53K602j121k96L386l793j578M40L758
5705D023l688m119J315p5k005N710P348K057N438o567l484p22j223m397k194J468
5689a115m154N103K563k792K867L077m540n35j860M279L098o52m283M492M342
$$ y = [-2572, -9188, -8184, -10772, -5206, -7819, -12711, -10701, -13433, -13250, -12268, -5219, -8953, -14871, -5917, -2763, -4008, 2015, 4192, 6090, 2731, -3801, -5048, -5477, -3694, 2639, 3544, 3615, 1238, -4518, -1574, -8659, -10818, -8050, -8781, -6455, -2811, 3820, 10786, 4957, 990, -1754, -185, -623, -1054, -930, -297, 3835, 5976, 5366, 5305, 7204, 12208, 18201, 19319, 15382, 10681, 769, -5153, -6145, -7865, -5048, -6365, -2243, 8556, 16451, 14281, 13385, 10798, 5083, 2266, -4403, -6497, -12538, -6783, -6590, -8973, -11370, -11173, -5070, -873, 2607, 4429, 3413, -328, 625, 3227, 2106, 1810, 5196, 1403, -175, 265, 4023, 335, -3784, -2469, -2544, -4549, 1161, 8509, 10566, 16004, 9437, 5953, 5231, 4008, -389, -2583, -1115, -5269, -166, 2397, -395, 2472, 5549, 1009, 474, -1386, 2893, 5991, 5339, 1056, 5548, 9890]
$$ [...]
##END NTUPLES=NMR SPECTRUM
##END=
