##TITLE=Analysis number 319786
Compound Code rf 03948
Book Reference b
Project Code adrs
Chemist Name hixia
##JCAMPDX= 6.0         $$ Bruker NMR JCAMP-DX V2.0
##DATA TYPE= NMR SPECTRUM
##DATA CLASS= NTUPLES
##ORIGIN= Bruker BioSpin GmbH
##OWNER= nmr
$$ XWIN-NMR		Version 3.5
$$ Tue May 30 10:25:18 2006 GMT Daylight Time (UT+1h)  MAYBRIDGE\nmr@NMR_250MHZ
##.OBSERVE FREQUENCY= 250.131544655141
##.OBSERVE NUCLEUS= ^1H
##.ACQUISITION MODE= SIMULTANEOUS (DQD)
##.ACQUISITION SCHEME= undefined
##.AVERAGES= 16
##.DIGITISER RES= 18
##SPECTROMETER/DATA SYSTEM= dpx250
##.PULSE SEQUENCE= zg30
##.SOLVENT NAME= DMSO
##.SHIFT REFERENCE= (INTERNAL, DMSO, 0, 16.522)
##AUDIT TRAIL= $$ (NUMBER, WHEN, WHO, WHERE, WHAT)
$$ ##TITLE= Audit trail, XWIN-NMR		Version 3.5
$$ ##JCAMPDX= 5.01
$$ ##ORIGIN= Bruker BioSpin GmbH
$$ ##OWNER= nmr
$$ C:\u/data/dgb/nmr/ADRS/5360/pdata/1/auditp.txt
$$ ##AUDIT TRAIL=  $$ (NUMBER, WHEN, WHO, WHERE, WHAT)
(   1,<2006-05-30 10:24:57.45 +100>,<MAYBRIDGE\nmr>,<NMR_250MHZ>,
      <created by zg, POWCHK disabled, PULCHK disabled
       configuration hash MD5:
       B5 A6 C7 38 BA 16 E7 09 FD 8C 39 C2 85 6D FD 14
       data hash MD5: 64K
       97 33 00 56 97 27 7B 5E 92 33 1F DC 67 42 4F 6D>)
(   2,<2006-05-30 10:25:09.11 +100>,<MAYBRIDGE\nmr>,<NMR_250MHZ>,
      <Start of raw data processing
       ef LB = 0.3 FT_mod = 6 PKNL = 1 SI = 32K 
       data hash MD5: 32K
       4D FE A5 F9 47 88 0F BE 0D A5 2C 89 C4 6C 78 71>)
(   3,<2006-05-30 10:25:10.62 +100>,<MAYBRIDGE\nmr>,<NMR_250MHZ>,
      <apk 
       data hash MD5: 32K
       19 61 78 09 7F 00 D5 38 AD 0E 40 FF B6 72 29 C2>)
(   4,<2006-05-30 10:25:11.33 +100>,<MAYBRIDGE\nmr>,<NMR_250MHZ>,
      <abs ABSG = 5 
       data hash MD5: 32K
       6E D8 00 92 39 38 D8 21 92 FD F4 25 D3 08 CB 0A>)
$$ ##END=
$$ 
$$ hash MD5
$$ 3D 38 96 76 3B 46 D2 07 CD 9B E1 41 48 13 30 40
##$RELAX= 
##$RELAX= 
##$RELAX= 
##$RELAX= 
##$RELAX= 
##$RELAX= 
##$RELAX= 
$$ Bruker specific parameters
$$ --------------------------
##$DU= <C:\u>
##$EXPNO= 5360
##$NAME= <ADRS>
##$PROCNO= 1
##$TYPE= <nmr>
##$USER= <dgb>
##$AMP= (0..31)
100 100 100 100 100 100 100 100 100 100 100 100 100 100 100 100 100 100 
100 100 100 100 100 100 100 100 100 100 100 100 100 100 
##$AQSEQ= 0
##$AQ_mod= 3
##$AUNM= <au_zg>
##$AUTOPOS= <7 >
##$BF1= 250.13
##$BF2= 250.13
##$BF3= 250.13
##$BF4= 250.13
##$BF5= 500.13
##$BF6= 500.13
##$BF7= 500.13
##$BF8= 500.13
##$BYTORDA= 1
##$CFDGTYP= 0
##$CFRGTYP= 5
##$CHEMSTR= <none>
##$CNST= (0..31)
1 1 145 1 1 1 1 1 1 1 1 1 1 1 1 1 1 1 1 1 1 1 1 1 1 1 1 1 1 1 1 1 
##$CPDPRG= <>
##$CPDPRG1= <>
##$CPDPRG2= <>
##$CPDPRG3= <>
##$CPDPRG4= <mlev>
##$CPDPRG5= <mlev>
##$CPDPRG6= <mlev>
##$CPDPRG7= <mlev>
##$CPDPRG8= <mlev>
##$CPDPRGB= <>
##$CPDPRGT= <>
##$D= (0..31)
0 1 0 0 0 0 0 0 0 0.06 0 0 0 0 0 0 0.0002 0 0 0 0 0 0 0 0 0 0 0 0 0 0 
0 
##$DATE= 1148981096
##$DBL= (0..7)
120 120 120 120 120 120 120 120 
##$DBP= (0..7)
150 150 150 150 150 150 150 150 
##$DBP07= 0
##$DBPNAM0= <>
##$DBPNAM1= <>
##$DBPNAM2= <>
$$ [...]
##$SUBNAM7= <"">
##$SUBNAM8= <"">
##$SUBNAM9= <"">
##$SW= 20.6930455092707
##$SWIBOX= (0..15)
0 0 3 0 0 0 0 0 0 0 0 0 0 0 0 0 
##$SW_h= 5175.983436853
##$TD= 65536
##$TD0= 1
##$TE= 294.16
##$TE2= 300
##$TE3= 300
##$TEG= 300
##$TL= (0..7)
0 120 120 120 120 120 120 120 
##$TP= (0..7)
150 150 150 150 150 150 150 150 
##$TP07= 0
##$TPNAME0= <>
##$TPNAME1= <>
##$TPNAME2= <>
##$TPNAME3= <>
##$TPNAME4= <>
##$TPNAME5= <>
##$TPNAME6= <>
##$TPNAME7= <>
##$TPOAL= (0..7)
0.5 0.5 0.5 0.5 0.5 0.5 0.5 0.5 
##$TPOFFS= (0..7)
0 0 0 0 0 0 0 0 
##$TUNHIN= 0
##$TUNHOUT= 0
##$TUNXOUT= 0
##$USERA1= <user>
##$USERA2= <user>
##$USERA3= <user>
##$USERA4= <user>
##$USERA5= <user>
##$V9= 5
##$VALIST= <valist>
##$VCLIST= <CCCCCCCCCCCCCCC>
##$VD= 0
##$VDLIST= <DDDDDDDDDDDDDDD>
##$VPLIST= <PPPPPPPPPPPPPPP>
##$VTLIST= <TTTTTTTTTTTTTTT>
##$WBST= 1024
##$WBSW= 4
##$XGAIN= (0..3)
0 0 0 0 
##$XL= 0
##$YL= 0
##$YMAX_a= 333486
##$YMIN_a= -275469
##$ZGOPTNS= <>
##$ZL1= 120
##$ZL2= 120
##$ZL3= 120
##$ZL4= 120
##$ABSF1= 16.522
##$ABSF2= -4.171173
##$ABSG= 5
##$ABSL= 3
##$ALPHA= 0
##$AQORDER= 0
##$ASSFAC= 0
##$ASSFACI= 0
##$ASSFACX= 0
##$ASSWID= 0
##$AUNMP= <proc_1d>
##$AZFE= 0.1
##$AZFW= 0.1
##$BCFW= 0
##$BC_mod= 0
##$BYTORDP= 0
##$COROFFS= 0
##$CY= 12.5
##$DATMOD= 1
##$DC= 0
##$DFILT= <>
##$DTYPP= 0
##$F1P= 14.0000005364418
##$F2P= -0.99999901652339
##$FCOR= 0.5
##$FTSIZE= 32768
##$FT_mod= 6
##$GAMMA= 0
##$GB= 0
##$INTBC= 1
##$INTSCL= 1
##$ISEN= 128
##$LB= 0.3
##$LEV0= 0
##$LPBIN= 0
##$MAXI= 10000
##$MC2= 0
##$MEAN= 0
##$ME_mod= 0
##$MI= 0
##$NCOEF= 0
##$NC_proc= -5
##$NLEV= 6
##$NOISF1= 0
##$NOISF2= 0
##$NSP= 0
##$NTH_PI= 0
##$NZP= 0
##$OFFSET= 16.522
##$PC= 1
##$PHC0= 169.0329
##$PHC1= 9.142268
##$PH_mod= 1
##$PKNL= yes
##$PPARMOD= 0
##$PSCAL= 4
##$PSIGN= 0
##$REVERSE= no
##$SF= 250.13
##$SI= 32768
##$SIGF1= 0
##$SIGF2= 0
##$SINO= 400
##$SIOLD= 32768
##$SREGLST= <1H.DMSO>
##$SSB= 0
##$STSI= 32768
##$STSR= 0
##$SW_p= 5175.98343685301
##$SYMM= 0
##$S_DEV= 0
##$TDeff= 65536
##$TDoff= 0
##$TI= <Analysis number 999999
Compound Code 99
Book Reference 9
Project Code 9>
##$TILT= no
##$TM1= 0
##$TM2= 0
##$TOPLEV= 0
##$USERP1= <user>
##$USERP2= <user>
##$USERP3= <user>
##$USERP4= <user>
##$USERP5= <user>
##$WDW= 1
##$XDIM= 32768
##$YMAX_p= 371623260
##$YMIN_p= -1218151
$$ End of Bruker specific parameters
$$ ---------------------------------
##NTUPLES= NMR SPECTRUM
##VAR_NAME=  FREQUENCY,     SPECTRUM/REAL,   SPECTRUM/IMAG
##SYMBOL=    X,             R,               I
##VAR_TYPE=  INDEPENDENT,   DEPENDENT,       DEPENDENT
##VAR_FORM=  AFFN,          ASDF,            ASDF
##VAR_DIM=   32768,         32768,           32768
##UNITS=     HZ,            ARBITRARY UNITS, ARBITRARY UNITS
##FACTOR=    0.157963299565203, 1,           1
##FIRST=     4132.6476996994, 0,             0
##LAST=      -1043.33573715361, 0,           0
##MIN=       -1043.33573715361, -1218151,    0
##MAX=       4132.6476996994, 371623260,     0
$$ Real data points
##PAGE= N=1
##DATA TABLE= (X++(R..R)), XYDATA
$$ [...]
15578a28912P4602k41402j92088L5979m3820J3026M95758K5475l32333K21240
15568g2475J88470L7992l7984j16145k29435k15124K21735J32284o9842r9844
15558b60368k26875j56500K04803K39442M316J75903j4136m7845p8569j33067
15548b92896j98448l2965j2164J33351J57009O0083j50386L55O6503J8302R7955
15537a53301Q6341J24508N7163n4128l0209O0817N8635J96483k21980m60245l14145
15526f50061j35783J30398P5243K67519j6385p7933M90589K97362l49593k25718
15516a94362k07127j81795K14906J38850J48084J26738n3572j91980l8981j5550
15506b54789L23879l0124n6508l5730l83079Q6052J03993j3913l24180j2667K7167
$$ y = [-128912, -54310, -295712, -487800, -451821, -495641, -482615, 13143, 38618, -293715, -72475, 115995, 153987, 116003, -142, -229577, -444701, -222966, -90682, -160524, -260368, -487243, -643743, -438940, -199498, -195182, -19279, -33415, -81260, -159829, -292896, -491344, -524309, -536473, -403122, -246113, -186030, -336416, -336061, -269558, -251256, -153301, -66960, 57548, 114711, 60583, 30374, 91191, 149826, 346309, 124329, -335916, -650061, -785844, -655446, -580203, -312684, -329069, -407002, 83587, 380949, 31356, -194362, -401489, -583284, -368378, -229528, -81444, 45294, -8278, -200258, -239239, -254789, 69090, 38966, -17542, -53272, -436351, -350299, -246306, -260219, -584399, -597066, -569899]
15495e69899M049K46858J73822j47028k3904n2331l38k4118q107J28863j5525
15484b87658K07256l6910k7877L7738j18052j04389j11594O9068K69312l5608
15474a38714k15719R2112J5994J99256O1841J11238J10691k76375l72324O8882
15464c43118L90289K03424J35040l07580k88235J73698n467K35042r249j49490
15454C4354k7262m7234j81523R3446R2430r8762P6417l3547k15746r889M17051
15443I9735J35346N6784r7045j23142j8080j0180j15590R9620O1489o0747Q8184
15432A16374J10769l38502j10949j484K2307M6214J44590J97893j99586m5034
15422e7408k00301n1443k2816m7592R095L6245J30856r3799j0360J83197J39986
$$ y = [-569899, -565850, -318992, -145170, -292198, -316102, -368433, -368771, -392889, -400996, -272133, -287658, -80402, -117312, -145189, -107451, -225503, -329892, -441486, -372418, -103106, -138714, -354433, -262321, -246327, -47071, 14770, 126008, 236699, -39676, -412000, -343118, 47171, 250595, 385635, 78055, -210180, -36482, -41949, 193093, 183844, 34354, 7092, -40142, -221665, -128219, -35789, -134551, -58134, -91681, -307427, -317316, 99735, 235081, 291865, 194820, 71678, 53598, 43418, -72172, 27448, 88937, 28190, 116374, 227143, -111359, -222308, -223792, -201485, -155271, -10681, 187212, -12374, -57408, -257709, -309152, -331968, -379560, -370465, -334220, -203364, -297163, -307523, -124326, 15660]
15411A5660r6141p517K35988M898J50250n2021k96790k28366J00815J20277j20149
15400a73096r1917J53416J37034Q2564j22706j69832l63639m2593L09813J7917
15390b63039j40743o5853J43958J29499O586k6939l6323J76343Q5076l12449k58486
15379e62370K89663K32617K18799L93225k09800O8381R5911m5801k00153r4081
15369A86391j05126k30873Q5083M4495K75990J51975N6146k84143k8970k41636
15359i0668J68888r4418M256m555k80406O9300L45514r5382k5386j10958P55k1625
15347a34685n6055j52169J08704p5703q5489p3822m5300K25072J42143q1925M51969
15336B22740j79983l29681n9476l1063K45110L41192J72942l2311q67o7216j39225
$$ y = [15660, -80481, -87998, 147990, 152888, 303138, 251117, -45673, -274039, -173224, -52947, -173096, -265013, -111597, 25437, 108001, -14705, -184537, -548176, -590769, -280956, -263039, -403782, -469635, -325677, -196178, -189592, -216531, -252854, -76511, 8565, -303884, -562370, -272707, -40090, 178709, 571934, 362134, 430515, 526426, 480625, 280472, 186391, 81265, -149608, -64525, -20030, 255960, 407935, 464081, 179938, 150968, -90668, 78220, -16198, -11942, -16497, -296903, -227603, 117911, 22529, -2857, -113815, -113060, -134685, -190740, -342909, -234205, -309908, -395397, -469219, -514519, -289447, -147304, -229229, 222740, 42757, -286924, -346400, -377463, -132353, 208839, 381781, 349470, 348603, 281387, 142162]
15325A42162k13245k74815j03611o0627K46860M50950l831k05284M7377m2569
15315a6633j25021P884J730K41133J61614j12662r3705j47381k33914n7146K4867
15304c49234l9721K1636l0862J28533j822J52395n690k8062l0615L7834J09144
15293c6464K57012J39410m0467j40622j00564l03077j51060K7914l6819K43544
15283a41193q0954J58543J18967m9240j32664M3679K22351k9845k30862l80294
15273e01512r1041M2624R6740J34614J55236N7571j20370k783j8201Q0574K06508
15262C9960Q5360o5922K4793J34964k970m6028j47024p2148n5648m8869J4076
15251a39456K14461J70548k21505k46417o4786n6154K94299K39615J53407R6417
$$ y = [142162, -71083, -345898, -449509, -510136, -263276, 187674, 183843, -21441, 25936, -16633, -141654, -133770, -132040, 109093, 270707, 158045, 64340, -83041, -316955, -374101, -349234, -388955, -367319, -398181, -269648, -271470, -119075, -124765, -152827, -183442, -145608, -36464, 220548, 359958, 319491, 178869, 78305, -224772, -375832, -347918, -384737, -141193, -222147, -63604, 55363, 6123, -126541, -82862, 139489, 109644, -121218, -501512, -592553, -549929, -453189, -318575, -163339, -105768, -226138, -228921, -247122, -166548, 39960, 125320, 59398, 84191, 219155, 216185, 170157, 23133, -49015, -104663, -153532, -139456, 75005, 245553, 24048, -222369, -287155, -343309, -49010, 190605, 344012, 440429]
15241D40429n36604j57171J48124j10605j29162P4521K57104q5327k98994l2107
15231d29792J76718L43897J01245j52185k73719j9923N9092m440q4127M5186J83858
15220e4190K46105R1407r1541n9478q6024j31889j61123j22053j41992Q1475J45112
15209b84191K69609J46677Q6016j62379k42283P7952P6032L859K1050q3476K8689
15198f2445J20026K51532n6735j44976N9800r5138r0549L12316r2472j6338j54707
15187C0314j84283q3908N8388Q3375M8274j06597k3167L50268K71650m14115k27749
15176a97550q0269j2979P8828K8877l2837O4901j4905O4297L0285o5965l1991
15165a69308k22575l74089J2180M69263L16632J12002n0417J37185K73941l9766
$$ y = [440429, -96175, -253346, -105222, -215827, -344989, -270468, -13364, -98691, -397685, -429792, -253074, 90823, 192068, 39883, -233836, -253759, -194667, -199107, -283234, -238048, -54190, 191915, 283322, 191781, 132303, 46279, -85610, -246733, -368786, -510778, -429303, -284191, -14582, 132095, 218111, 55732, -186551, -108599, -32567, -28708, -7658, -91134, -62445, 57581, 309113, 252378, 107402, 167202, 72064, -18485, 293831, 201359, 185021, 30314, -153969, -237877, -179489, -96114, -47840, -154437, -177604, 172664, 444314, 30199, -197550, -277819, -290798, -211970, -183093, -215930, -151029, -165934, -101637, -71352, -137317, -169308, -391883, -765972, -753792, -284529, 32103, 144105, 93688, 230873, 504814, 465048]
15155D65048L8939J38325k0296j64857m03481q6127j28248O2982J73432p8016
15145b299k54413J94060N088l6425L7841j83991l3167k8108K15364M1415Q9542
15134D4907k2642J02241K6283j26573K2986k0917j12537N8390J2966J07256K15494
15123C07854j10611j27629J05192j10622M9825R2837k60695j32908j65347o6720
15113d18824J35580K08897r9711j06292J64672l2605J72070Q6609j62613J99529
15103A47312P3546K4052k8741j26283l04289l97539j7243K84732J69430p4021
15093b49044j56581K69265J89767Q0894j42372j40903K8065p2409j04434n8831
15083c56583J27053n8820j34164j4361J5872P2218J83922l3986k58952j28008
$$ y = [465048, 503987, 642312, 622016, 457159, 53678, -32449, -160697, -97715, 75717, -2299, -256712, -62652, -57564, -93989, -56148, -240139, -273306, -301414, -86050, -44635, 44907, 22265, 124506, 150789, 24216, 47202, 26285, -86252, -27862, -14896, 92360, 307854, 197243, 69614, 174806, 64184, 114009, 206846, -53849, -186757, -352104, -418824, -283244, -74347, -174058, -280350, -115678, -148283, 23787, 110396, -52217, 147312, 220858, 244910, 216169, 89886, -214403, -611942, -629185, -344453, -175023, -249044, -405625, -136360, 53407, 134301, -8071, -148974, -120909, -193318, -297752, -356583, -229530, -288350, -422514, -436875, -421003, -348785, -164863, -198849, -457801, -585809]
15073e85809J41644J5010J4871j07040L27639O1839l44269L03353L26122l05151
15063a51791k15854J81713j8901J70802M7235j67033J80920L15765j84714k07041
15053d8899j03923J70082J71616o5276R7062j52296l01375q5562l255J47333K33072
15042E8579M9386j34738j5619q0098k14333K85954K35002M9993j82981N8450J43098
15031B52693k44997j24196j04080K54354K33483P1984j66090N6077n7824N3771
15021B25175N484j61526q7196r9208l01655j40797j19718L36724J84386J67296
15011H965k10830Q988L56122K14005n6545m87787Q1836K01682L6577k42598l51844
15000d41429j88006L89205J01267J1789J41962J48577p2097j5909l36183r3156
$$ y = [-585809, -444165, -429155, -414284, -521324, -193685, -131846, -476115, -172762, 153360, -151791, -367645, -185932, -204833, -34031, 13204, -153829, 27091, 342856, 158142, -48899, -152822, 17260, 188876, 123600, 220662, 68366, -233009, -318571, -321826, -174493, 58579, 107965, -26773, -42392, -122490, -336823, -50869, 184133, 234126, 51145, 109595, 252693, 7696, -116500, -220580, 33774, 267257, 339241, 173151, 229228, 171404, 225175, 230659, 69133, -18063, -117271, -418926, -559723, -679441, -342717, -158331, 8965, -201865, -192877, 163245, 377250, 320705, -167082, -85246, 116436, 153013, -89585, -441429, -629435, -240230, -138963, -127174, 14788, 163365, 91268, 75359, -260824, -353980]
14990c53980K19344J44336j375L9216o5934k49724L82623J28741J45950J01045
14980D90242l12439k78937R9485j06680j32979M17244O2850R4707Q2142J46198
14970E61833N7430P576J10687k82041r5361j05020k71593j99502L014K30917M52868
14959D70808J514j70431p0170j45739j67347r8010N4533K3084j76117k01891K40951
14948b38815K20689j21897J9611O7146k3551P5669j15337j37507m2699J35828
14938a60863R7768Q4825r8786N7357k0353k1359J57202k54119j01310k47021j46172
14927f52831L64986M291j4184j18896O0495r173O9546m2068j22467O8316K3332
14916c68653J03396K522J43585j25160J22660j0880j83382j4877l9795j706J80514
$$ y = [-353980, -134636, 9700, 8325, 47541, -18393, -268117, 114506, 243247, 389197, 490242, 177803, -101134, -1649, -108329, -241308, 175936, 238786, 333493, 415635, 561833, 619263, 626839, 737526, 455485, 360124, 255104, -16489, -215991, -212977, 17940, 470808, 472322, 301891, 231721, 85982, -81365, -179375, -124842, -101758, -277875, -479766, -238815, -18126, -140023, -120412, -53266, -76817, -1148, -116485, -253992, -296691, -160863, -63095, 21730, -77056, -19699, -40052, -61411, 95791, -158328, -259638, -506659, -652831, -287845, -283554, -297738, -416634, -356139, -365312, -295766, -337834, -460301, -391985, -368653, -265257, -262735, -119150, -244310, -121650, -132530, -315912, -330789, -370584, -372290, -191776]
14905a91776J95917r3840K10185L67870o4649k39777j66077M16428J21167k82840
14895B72608o4189K45788R4815k90503l09452l8675m4853j05773j26433r027K76782
14884i8912K668k39912j63421P4954J22951q301J55416P4999J80186Q2570N0287
14873B33485R071K70946j45154j04924o3155j48713m18233l61797K49060J79449
14863b99965o4414j3511K31715M13773n951k80356k07889Q8176k72891o9010J75145
14852c05178J05303j61864j7405L49641J38691K97534k89480j86957j14221l46297
14842e30233O6513K9735j27544q0414J42518o5893K17641K51007p2932p3424J43716
14831i9310p4797J3033k6929J15430K53952j8758k17699M609R6178J66415J01109
$$ y = [-191776, 4141, -89699, 120486, 488356, 423707, 183930, 17853, 434281, 555448, 272608, 208419, 454207, 549022, 258519, -50933, -89608, -134461, -240234, -366667, -375694, -98912, -96244, -336156, -499577, -424623, -301672, -309973, -154557, -79558, 100628, 183198, 233485, 242556, 513502, 368348, 263424, 200269, 51556, -366677, -728474, -479414, -299965, -364379, -377890, -146175, 267598, 261647, -18709, -226598, -138422, -411313, -480323, -305178, -199875, -361739, -379144, -29503, 109188, 406722, 117242, -69715, -183936, -530233, -463720, -433985, -561529, -641943, -499425, -565318, -347677, -96670, -169602, -243026, -99310, -174107, -161074, -188003, -72573, 181379, 162621, -55078, -50469, 45709, 212124, 313233]
14820C13233j98810j02789l30224K1265K3386j31983j93554K16281J25483J03932
14810a53780n1411R7852N3913L00930k03542j08768K96915O7474l26726K19875
14800A92732M25347K1336k50460l98423j8819J5508R0066J43012o5275j912m5181
14789A07931k52811k0577J16720Q5324P8903O90k41955l8537L75095L43899K03702
14778G58384P5855k20062m92891j7357J49986K1661j45562r0473J95760j87644
14768D7657j89621P5541j84128j9552n4387K13650K73459j47824j45362n467j84412
14757c20446J8867J32553K02931j03517j71412L280K88677K23262J6962L3697
14747C24854M1400n2700N5006j30972j11389k88069j67650p3266L8008Q0847q0306
$$ y = [313233, 114423, 11634, -318590, -297325, -273939, -405922, -599476, -383195, -257712, -153780, -205191, -107339, -53426, 247504, 43962, -64806, 232109, 299583, -27143, 192732, 618079, 639415, 388955, -9468, -28287, -12779, 77287, 220299, 155024, 153112, 107931, -144880, -165457, -48737, 36587, 115490, 116180, -125775, -164312, 210783, 554682, 758384, 834239, 614177, 121286, 103929, 253915, 275576, 130014, 39541, 235301, 47657, -141964, -66423, -250551, -270103, -324490, -110840, 162619, 14795, -130567, -136034, -320446, -301579, -169026, 33905, -69612, -241024, -237744, 50933, 274195, 291157, 324854, 366254, 313554, 368560, 237588, 126199, -161870, -329520, -402786, -364778, -283931, -364237]
14736c64237P4098J74637j65274K63078K0118o4900k10620j65039J84672L24963
14726G1496O7879p9681p8549j636J3265j57566j52939L07433J433n3305l3150
14715i5320j72166l46582L3608J44280m8585K33684N6768L82708R5146n32887
14705b49346l78023n105M25055K18529l087J45767O3370N8969n7683l08706q0044
14694a70304J13651J66890j02798M424J92535Q5163r693n8525k06225j30993K21308
14683A05433Q8786q4778r2435k1150M6222r6361l6327m9582J29397q1712M2307
14672e0200K95927O5972J05039j46374j98428j20063j06785L1499o159n6740j7953
14661b04265K21478L9179j69900j39913J8632L2286k07103K44516K39268k6368
$$ y = [-364237, -290139, -115502, -280776, -17698, 2420, -62480, -273100, -438139, -253467, 71496, 139375, 59694, -18855, -20491, -7226, -164792, -317731, -10298, -8865, -62170, -95320, -267486, -614068, -580460, -436180, -484765, -251081, -194313, 188395, 283541, -249346, -627369, -632474, -207419, 11110, 8023, 153790, 217160, 276129, 218446, -90260, -170304, -56653, 110237, 7439, 11863, 204398, 289561, 279868, 221343, 15118, -115875, 105433, 194219, 109441, 17006, -4144, 42078, -54283, -90610, -140192, -10795, -92507, -50200, 245727, 311699, 416738, 270364, 71936, -48127, -154912, -123413, -129572, -186312, -204265, 17213, 56392, -113508, -253421, -234789, -202503, -409606, -165090, 74178, 47810]
14651D7810l1561J5947Q8998R8845j86606J03525o3739l2392j757n2799r0432
14640a04161l00182o0691M2003J366p7136M0345K93764K1925Q5085L0010R3119
14629F5447j20814J57760K08590j72421m4918l09596r9449J49083O1110j32228
14619b37436O993K12706J9183P454J01568j86550n2535j16625r1672o3782J12495
14608b88201K21729M7925J49178o8804J17900J36491O5457k7968J17884l8781
14598D32810j59665j07347r8241k22245J2789k27619m6545L09072K52287J20713
14588B66009l0879l26421j34261J00002R1814o5237K46636r386k18695M4461J47198
14577A11241K3133j56285N8493O1534j27182j63680j07290j01200Q8022J32450
$$ y = [47810, 16249, 32196, 121194, 220039, 33433, 136958, 73219, 40827, 39070, -13729, -104161, -404343, -465034, -423031, -421665, -498801, -458456, -164692, -142767, -57682, -27672, 65447, -55367, 102393, 310983, 138562, 93644, -215952, -315401, -166318, -105208, -237436, -230443, -17737, 1446, 8900, 110468, -76082, -128617, -245242, -336914, -400696, -288201, -66472, -18547, 130631, 61827, 179727, 316218, 381675, 353707, 471591, 432810, 273145, 165798, 67557, -154688, -141899, -369518, -416063, -106991, 145296, 266009, 235130, -91291, -225552, -125550, -33736, -98973, 147663, 138277, -80418, -35957, 111241, 134374, -21911, 36582, 98116, -29066, -192746, -300036, -401236, -313214, -180764]
14567a80764N81r9147K89475r767J46430J16843L7723j63933P8823j30341j93626
14556a07703K5060k669j06570k26062Q687P7378J84126N2310J4108J12855p2502
14545d0982j59086j49368L4271J83446M02345K1647j33754j40122K00249K02886
14535D21532j03694j55211L3138j1958k79471k08865q3314K33484L20899J52069
14525C18609J31389j03497J6973j04215L7704j12644k6141J45461K5130Q3040
14515D11809j08660l68342p1178K9184P4441M9331j68760Q6080r2670k13428J79933
14504a92260J74426K43013Q4880j40349k74494j3523J11431K73280K341l56714
14494h7969j94225j5619K02816n4029m2316q2821k30903l7991K61444J24193k96616
$$ y = [-180764, -180183, -279330, 10145, 378, 146808, 263651, 301374, 137441, 216264, 85923, -107703, -82643, -85312, -191882, -417944, -409257, -331879, -147753, -95443, -81335, 31520, -40982, -200068, -349436, -315165, -131719, 270626, 292273, 158519, 18397, 218646, 421532, 317838, 162627, 195765, 183807, -95664, -304529, -387843, -154359, 166540, 318609, 449998, 346501, 363474, 259259, 296963, 184319, 158178, 303639, 328769, 411809, 303149, -65193, -136371, -107187, -32746, 16585, -152175, -66095, -158765, -372193, -192260, -17834, 225179, 310059, 169710, -104784, -118307, -6876, 266404, 268745, -87969, -282194, -297813, -94997, -149026, -191342, -274163, -505066, -543057, -281613, -157420, -454036]
14483d54036L07576M10495K57511k0798p9868k52306k58802k16344q9537K31288
14473a64821J49115K38278l26465l51996j08653L334K69804K84700j60788L4832
14463a32660k7677j76007K41356J13596J18403N6700l49847k27454r8659K6167
14453d56082L60056O720K34376J68644o1720k9422m84345r5557o3767J50062j8400
14442b89435j11430k22795P8357J12071M6671l3146K48363K06316j27162o4566
14432a56756J30826P7672L33234K6641n7360j09631R2284J86508k58504m91123
14422b26209m4547J622n2225j01562K10861J05898p2641O3144j70547O8142L01396
14411H3332K56043O8400k25537K7476k61863j33667K22328K30350j16922k53077
$$ y = [-454036, -146460, 264035, 521546, 500748, 420880, 168574, -90228, -306572, -396109, -164821, -15706, 222572, -103893, -455889, -564542, -561208, -291404, -6704, -167492, -132660, -160337, -336344, -94988, 18608, 137011, 193711, -156136, -383590, -482249, -456082, -96026, -89306, 145070, 313714, 251994, 222572, -261773, -357330, -421097, -271035, -289435, -400865, -623660, -545303, -433232, -386561, -419707, -171344, 34972, -92190, -156756, -25930, 51742, 384976, 411617, 354257, 244626, 336910, 523418, 264914, -226209, -270756, -269134, -321359, -422921, -212060, -106162, -178803, -115659, -286206, -218064, 83332, 339375, 407775, 182238, 209714, -52149, -185816, 36512, 266862, 149940, -103137]
14401a03137J51699m5438k26537k81596Q6879J76412r55J56596J00270k2350J57168
14390A49011P4473R1584j81501j97428j043j28159J53140j84566Q4425J00812
14380c9252K52221m5139k76781j33829P4722k12909J40383o0863M4106q9260l73301
14369g19902J04428M66692m3792m2626J096j198L58597J02076j39544k82761Q355
14358a88579m2972j94045K08519J5478j27295J12515l5542k96582J65131J43730
14348b39642p7767p6562K45213J61636j14774j57697l27139K83681O2234R88l8393
14337b78222N0487M61496p3281k80683J64601j39935j22200K3044J13333j7161
14327i8521K19466N404j09809k4743m1444L7807P6331J61112Q9870P2785q967
$$ y = [-103137, 48562, 3124, -223413, -505009, -418130, -241718, -242673, -86077, 14193, -8157, 149011, 223484, 315068, 133567, -63861, -64904, -193063, -39923, -224489, -140064, -39252, 212969, 167830, -108951, -242780, -168058, -380967, -240584, -301447, -257341, -346601, -719902, -615474, -148782, -192574, -235200, -234104, -235302, 123295, 225371, 85827, -196934, -188579, -231551, -425596, -217077, -201599, -328894, -216379, -251921, -548503, -383372, -239642, -317409, -393971, -148758, 12878, -101896, -259593, -586732, -303051, -240817, -239829, -278222, -227735, 233761, 160480, -120203, 44398, -95537, -217737, -194693, -81360, -98521, 120945, 126349, 16540, -8203, -49647, -11840, 64491, 225603, 315473, 388258, 379291]
14316C79291l50697l39754k5392J97507n6789N2656j32971Q8388K0051k9293M21844
14305B24841Q8408k90983j84099J22381l5990j44470J31660N0249j1620L2585
14295a7038L41613J91595P6094k36436j92676P0360j0702l8520J46511l2659k32360
14284F5782q4099M2450P3712M5020M5969k90934J56377L6506j32462K98687J24904
14273C81912j99444k45690k1645J05271O605l5935O2576n4583j27330m8003j25119
14262c01385l1057J74016J79191q2017k95393O358P5473J16104J44937k81229
14252b95002n2549M6613K7695J31635J66373J66980K58398n9164l30791k4734
14242C5454q0267j688j43172k30037L2453K47450K35813j07724o9096R3607K27088
$$ y = [379291, 28594, -311160, -336552, -139045, -195834, -143178, -276149, -187761, -167710, -197003, 224841, 313249, 22266, -161833, -39452, -75442, -219912, -88252, -38003, -49623, -17038, 324575, 516170, 592264, 355828, 163152, 233512, 222810, 184290, 330801, 298142, 65782, -18317, 24133, 97845, 142865, 188834, -102100, 54277, 90783, -41679, 257008, 381912, 182468, -63222, -84867, 20404, 27009, -8926, 53650, -933, -128263, -176266, -301385, -332442, -158426, 20765, -61252, -356645, -350287, -274814, -158710, -13773, -295002, -347551, -300938, -273243, -141608, 24765, 191745, 450143, 390979, 60188, 35454, -44813, -46501, -189673, -419710, -387257, -139807, 96006, -11718, -80814, 12793, 239881]
14231B39881R4808k13811j51080l5214M452J00422q8641n9288J91127j58089k33910
14220c09343j791J94259o3757r4277J2458j32158q7876k63645J19032R0448Q2823
14209d53827L97732Q6744q2388K12673j10360r0027k4888K8754l1660k48259p431
14198c22937r3461N6506K8477j94726J27773K42163J45570k12054n1527r7502
14188c71718N7507j6968J30789j40944Q0658K19909J04869j5995R6351J47327
14178B91785k69331r8534j07278j07456M360L3485J38512K30282J73799r5468
14168A94156k17675j6695J16818L08698J69074l00022j78518J09136P4659K38514
14158D98145J34305l5341l11896m11885k67248q0440K28952J67043L35365J32189
$$ y = [239881, 334689, 120878, -30202, -65416, -60964, 39458, -49183, -108471, 82656, -75433, -309343, -311134, -116875, -180632, -274909, -262451, -394609, -482485, -746130, -627098, -536650, -453827, -56095, 30649, -51739, 160934, 50574, -39453, -64341, -35587, -67247, -315506, -322937, -416398, -359892, -331415, -526141, -398368, -156205, -10635, -222689, -274216, -371718, -314211, -331179, -200390, -341334, -260676, -40767, 64102, 48107, 144458, 291785, 22454, -76080, -183358, -290814, -286454, -252969, -114457, 115825, 289624, 194156, -23519, -40214, 76604, 385302, 554376, 254354, 75836, 184972, 259631, 498145, 632450, 597109, 285213, -126672, -393920, -474360, -245408, -78365, 257000, 389189]
14148C89189p0252r2895j86287o2246m1763k3626J64822j6878k72335P2800R7344
14137d2127Q5279m51907k99012m4636J7853K25640K27719K86751l7857J21516
14127H9219J08981j41523j81271r1649J30331M06451K43216J43955j43636j99473
14117C64601k6652j2857m1106l21562n8077k4438N1526M8417J28765k45354q1614
14106b18351J11707M3046p5251J03875K4253j38523K1778J9945O8819J02020R1205
14095A54523j10106j99472n798K4708N7893k35187J65216J67472k14899J29871
14085f5779J90322j64183j56210k7487K09277M8656K08582L15008j71863k74483
14075A11840J35334J52958P3266p1402L540j09435m87635j73556P0467J14753
$$ y = [389189, 318937, 226042, 39755, -22491, -64254, -87880, 76942, 60064, -212271, -139471, -42127, 43152, -408755, -707767, -752403, -734550, -508910, -281191, 5560, -32297, 89219, 198200, 56677, -124594, -216243, -85912, 320539, 563755, 707710, 564074, 364601, 337949, 325092, 283986, -37576, -95653, -120091, -68565, -20148, 108617, -136737, -218351, -106644, -63598, -138849, -34974, -10721, -149244, -127466, -107521, -38702, 63318, 154523, 44417, -155055, -160853, -136145, -78252, -313439, -148223, 19249, -195650, -65779, 124543, -39640, -195850, -223337, -14060, 34596, 243178, 558186, 386323, 111840, 247174, 400132, 473398, 401996, 405536, 296101, -191534, -365090, -294623, -179870]
14065a79870j20911j40074j69988p4880K6877J21387M5697L33918m3934J72312
14055b9466L40372k23641k33407l41565K17726J86985k5809J63069J57063M5260
14045B56587k05510o2044n1663j0439j25252K4889J03388k5781J57249p3550k99073
14034c11199n4013j36660O633K78175k5833l7983m0943J67501J49614J27643J71033
14023B93968j64851r5439q9446K67140k43442M9570j8134j70359j73197J02811
14013b41379J74932K12446J85897j43385j78366J05359j17770k32562O8457J61015
14003e356k2760o4250J51346N5201O419p0059J24608k37940m7766n5166j95936
13992c61659j0940J50659j55595p8335K45720J85244Q5438j58629J45378k2227
$$ y = [-179870, -300781, -440855, -610843, -685723, -658846, -537459, -491762, -157844, -201778, -29466, 310906, 87265, -146142, -487707, -269981, -82996, -108805, 54264, 211327, 256587, 51077, -10967, -62630, -73069, -198321, -173432, -70044, -95825, 61424, -12126, -311199, -365212, -501872, -495239, -217064, -242897, -280880, -321823, -154322, -4708, 122935, 293968, 129117, 33678, -55768, 211372, -32070, 17500, -634, -170993, -344190, -241379, -66447, 145999, 331896, 188511, 10145, 115504, -2266, -234828, -166371, -5356, -28116, -92366, 58980, 114181, 120600, 50541, 175149, -62791, -110557, -165723, -361659, -372599, -221940, -377535, -455870, -210150, -24906, 60532, -98097, 47281, 25054]
13982B5054j38581r568J96110r7209j7225k55631J5270L70722n3989j50535k8743
13971a44325J93464P4007K0136l4501j02418k85546j46737j83418p9008K07722
13961d80624J95493J13295p0820k04020j9474Q9344K21210J57150K72381K55284
13951E29219k91359m42898j78085J75656J52800j7154J76072R8843j48127L002
13941E7969l49164o3714J61655K63397Q9150J47626J08683j77880j55580K6002
13931A08144J57585j2777N3871j0285O2008q0011P2649N1672J19111j26847o1771
13920C33349M4203N003k9858j33117O8377j64481P2371J56882l2789j83431j45256
13909h747Q5300r8664J8619K21353Q5835l8202k00969j24351j97263r7635j68949
$$ y = [25054, -113527, -123095, 73015, -24194, -41419, -297050, -281780, 88942, 34953, -115582, -144325, 49139, 123146, 143282, 108781, 6363, -279183, -425920, -609338, -688346, -480624, -285131, -171836, -242656, -446676, -466150, -376806, -155596, 1554, 273935, 529219, 237860, -205038, -383123, -207467, -54667, -71821, 104251, 203094, 54967, 57969, -291195, -354909, -193254, 70143, 159293, 306919, 415602, 237722, 82142, 108144, 265729, 252952, 306823, 296538, 358546, 278535, 351184, 402856, 521967, 395120, 333349, 377552, 382555, 352697, 219580, 287957, 123476, 195847, 352729, 319940, 136509, -8747, 76553, -22111, -3492, 217861, 303696, 265494, 64525, -59826, -257089, -354724, -523673]
13898e23673J36067K86197L26994K54496R9562j38772l49219r2060R5115N6965
13888A51672j88606j11637J56080J78853R366J45305L2796j04859j66619k66845
13878a64494p3733n8254j97386L69788K71217j08419L9460K02333j27372k65068
13868a11928J22286k20909J09279J19495j34027Q5947J03977j57519j32897K276
13858b14020M83438l0939l42097k02841J07302J88746P2790K82455p7101L7631
13848C05364k56808O4663K46994O5900j24219j24449j26182K39651K930M2462
13838C36306j93341k16675K616J35289O7382j83643k52796m5343K43223K40286
13828A33304K9039j57936J59942K89261K94585n7495j53907J9170j08667j54763
$$ y = [-523673, -387606, -101409, 225585, 480081, 579643, 440871, 91652, -408, 94707, 151672, -36934, -148571, 7509, 186362, 195728, 341033, 373829, 268970, 102351, -164494, -238227, -296481, -493867, -124079, 147138, 38719, 78179, 280512, 153140, -111928, 10358, -210551, -101272, 18223, -115804, -29857, 74120, -83399, -216296, -214020, 269418, 238479, -103618, -306459, -199157, -10411, 62379, 344834, 267733, 305364, 48556, 113219, 360213, 426113, 301894, 177445, 51263, 290914, 293844, 336306, 142965, -73710, -71094, 64195, 131577, -52066, -304862, -350205, -106982, 133304, 162343, 4407, 164349, 453610, 748195, 690700, 536793, 555963, 447296, 292533]
13818B92533k3867k81577l02548n9124j83597l256J74972Q2866J08706j3793n3692
13807b62377j60723M0525K64055K03511J90003k37502j0418L5410j64017p8771
13797a80304j77140l7310M9459K8600K40610P5077o3745Q6907J43703M0142J9887
13786B25886o4985j17654M7185r1288j10868j28986j09002J56123K18783j14412
13776h9218P8527R039K61119k9016r5931k18376k37226n7629R5457L16936J10883
13765A44565k04566O532J6297k91628R13K76336K3616j14017p8263L059L02625
13754H5469j2414j40024r376k8278j8686K780R2361m6471n5863k37197J40678
13743b27021J58761J66672Q5645q7179k44697J07060J40559j79262k40159J20152
$$ y = [292533, 268666, -12911, -315459, -374583, -558180, -561436, -386464, -303598, -194892, -208685, -262377, -423100, -382575, -118520, 84991, 274994, 37492, 27074, 62484, -101533, -180304, -357444, -394754, -345295, -316695, -76085, -1008, -64753, 22154, 165857, 205999, 225886, 160901, 43247, 90432, -856, -111724, -240710, -349712, -193589, 25194, -89218, -10691, -1652, 259467, 230451, 134520, -83856, -321082, -378711, -283254, 33682, 144565, -60001, -53469, -37172, -328800, -327887, -51551, -27935, -141952, -220215, -217156, 85469, 73055, -66969, -76345, -104623, -123309, -120529, -28168, -74639, -130502, -367699, -227021, -68260, 98412, 184057, 96878, -147819, -40759, 99800, -79462, -319621, -199469]
13733a99469Q819k19499P4365J25952l80231M2713J74055M70347J52415n0450
13723A99017j06919j31199m6138l3241l49250J0604M28062M65182M914m8829j88143
13712B04060j39279J65498j40246J565J91662o4658K25519J25305j035k34670
13702C33721K7575K90273L9213n3533k30839k57310k64436l0551m727J40615o1441
13691g1440j86346L7946J17209o3524j15527J09302J3972j75368M4191M81106
13681A91521k1055J51307J74799l10978k15727L1651p3535m8758P5118J7425K5019
13670c213j48009j5252K17175L71597Q0910k26280l33374r5080j50384J12362
13660a89548O3351j51421k2773P0689K55158j34736K05643J56409k5110J1741
$$ y = [-199469, -190650, -410149, -335784, -209832, -590063, -547350, -373295, 97052, 249467, 199017, 92098, -39101, -85239, -118480, -467730, -457126, -29064, 436118, 441032, 392203, 204060, 64781, 230279, 90033, 91598, 283260, 218602, 444121, 569426, 568391, 333721, 361296, 651569, 690782, 637249, 406410, 149100, -115336, -145887, -150614, -9999, -71440, -257786, -219840, -102631, -166155, -281682, -172380, -158408, -333776, -289585, 191521, 170466, 321773, 496572, 185594, -30133, 1518, -72017, -120775, -45657, -28232, -3213, -151222, -166474, 50701, 422298, 503208, 276928, -56446, -151526, -301910, -189548, -126197, -277618, -300391, -229702, 25456, -109280, 96363, 252772, 227662, 239403]
13650B39403R5174o636k09957k20081k5183L82783J30983j4636j22096j45274
13640A04480m5858j98222m2559L78051k24957k7826n1707O1739J89746R8059L28116
13629E69062N3095k43435k35589k29751J72188M8700l19512k800j27561J48567
13619a67036K10303n1174K74175N8927k22023j77066j56151j60477J7020Q1109
13609b92393m6273M6811K53421J30473k12210J85365J52845J54329j30757j95952
13599D5659K6767j10738Q5852J87808O376q786K26664J01828J12588k67906j99540
13588B06572Q91j9213M526p6211l9264k8048k15278N7377N7568K36080j91476
13577f476J69224J39717k44670m18477j30653p8195K12302K33811j07827m0753
$$ y = [239403, 334577, 327941, 117984, -102097, -127280, 255503, 386486, 371850, 249754, 104480, 58622, -139600, -182159, 195892, -29065, -56891, -108598, -46859, 142887, 240946, 569062, 622157, 378722, 143133, -86618, 85570, 134270, -185242, -188042, -315603, -167036, 43267, -7907, 266268, 325195, 103172, -73894, -230045, -390522, -373502, -292393, -338666, -291855, -38434, 92039, -120171, 65194, 218039, 372368, 241611, 45659, 72426, -38312, 47540, 235348, 241724, 232938, 459602, 561430, 674018, 406112, 206572, 207463, 188250, 192776, 116565, 77301, 49253, -166025, -108648, -51080, 185000, -6476, 162748, 302465, 57795, -360682, -491335, -569530, -357228, -123417, -231244, -271997]
13567b71997J24035J43231n1194n4719K53121J74882l6145j70321Q5651j45265
13557E1279j26765j01689L3263J50490P2856m1367J72727P4312k26707k20474
13547a62075J9981M6659o3911Q6954J73493N4049P0852j34236k26345l3075j3604
13536a81258k85226p258p9479K95164L66798O3801k0974k83068m3442k00896J57970
13525b17868J32912j0697m6546j58344O4191m7282j6984j29035K0870K12405L41861
13514A45483p2792N4431o1498k84439l37791L0199J36003K95315N2206J13610
13504G0727K6461l02981J65851K32776j65636l18486j17494k0807j24375Q5380
13494d68584j44420M18738L07430l64855M7862N6282J15702J41439K0283k00593
$$ y = [-271997, -147962, -4731, -55925, -110644, 142477, 317359, 281214, 110893, 196544, 51279, -75486, -177175, -143912, 6578, 79434, 38067, 210794, 285106, 58399, -162075, -142094, -95435, -159346, -72392, 101101, 155150, 226002, 91766, -134579, -167654, -181258, -466484, -473742, -553221, -258057, 108741, 172542, 151568, -131500, -174942, -375838, -217868, -84956, -95653, -142199, -300543, -236352, -283634, -300618, -429653, -408783, -196378, 145483, 72691, 127122, 65624, -218815, -556606, -526407, -390404, -95089, -42883, 70727, 97188, -205793, -39942, 192834, 27198, -291288, -408782, -429589, -553964, -468584, -613004, -194266, 113164, -251691, -203829, -147547, -31845, 109594, 129877, -70716]
13484g0716k16073k33852k49849J7183M07071K81537j02864M3745K90195j36192
13474C0185k84185J41574k7264j17782l9516j91242m3938J19103L01395K54599
13464A42929K25460N2694p6805l56681K31224j37012K12259K22046j65945k13500
13454A36669q157q5546J25284J9735l24058k65303N0172K21864n9784R8275R1853
13443A004j17095J11901K04845J7440o6288j35644O7489L23748l01363m58317
13433c52280N0203k37932M62353M01948J39314j64431l38149R2951n8206M6330
13423D2101j90638l38826J53967j451N7717K89434j4828j28727J65925O3829r1822
13412F681k90685k59266N05159L52667J42423Q0771k37985j74270k45667j80384
$$ y = [-70716, -286789, -520641, -770490, -753307, -346236, -64699, -167563, -123818, 166377, 30185, -254000, -112426, -139690, -257472, -296988, -488230, -532168, -413065, -111670, 142929, 368389, 421083, 344278, -12403, 218821, 81809, 294068, 516114, 350169, 136669, 128512, 42966, 168250, 187985, -136073, -401376, -351204, -129340, -189124, -90849, 1004, -116091, -4190, 200655, 218095, 151807, 16163, 83652, 407400, 106037, -352280, -302077, -540009, -77656, 324292, 463606, 299175, -38974, 53977, -4229, 42101, -148537, -487363, -333396, -334847, -277130, 12304, -2524, -131251, 34674, 98503, 6681, -284004, -543270, -38111, 314556, 456979, 537750, 299765, 125495, -120172, -300556]
13402c00556K15932K27819K0071l6552M7234j1488m4259j07513K374j62137N1653
13391i7422J16989j00978K0224O2503J01793n1709J72440j73602j60684J42874
13381C2428J78785j97687j78627r8528p4544K26510K05592l10441k36141k22518
13371f75171J99702K54332Q8959j7136J36530N6137j46379j23830l61496p7294
13361f65646P0563L07630J42520L53064L450r8042J5119N6276m2898J41881N7842
13350C41759l43194N4992j84317O5172K0948L33517J94226j31212m6613p276j32941
13339A65061r0902K92437J73621j9434j60478j6479p5854k51014K5971l1417j64493
13328a52981m3493J20614n1955j60025L36756K5533J48823P7095j29421k42193
$$ y = [-300556, -84624, 143195, 163266, 126714, 173948, 162460, 118201, 10688, 13062, -149075, -97422, 19567, -81411, -61187, 1316, 103109, 51400, 223840, 50238, -110446, 32428, 211213, 13526, -165101, -263629, -338173, -111663, 93929, -216512, -452653, -675171, -475469, -221137, -132178, -149314, -12784, 43353, -103026, -226856, -588352, -665646, -595083, -287453, -144933, 208131, 211581, 113539, 128658, 184934, 142036, 283917, 341759, -1435, 53557, -130760, -65588, -44640, 288877, 483103, 351891, 305278, 298002, 165061, 74159, 366596, 540217, 520783, 360305, 343826, 267972, 16958, 42929, 11512, -152981, -196474, -75860, -127815, -287840, 48916, 74449, 223272, 300367, 170946, -71247]
13318g1247m6409J79379P6960q7013j72824k19896J19047K70403L12684j23616
13308B37468j37992n3877j79167l0276L9755o458R8624L02551o0270k95160J14046
13297B9244K51123J70160n281m3277k4192Q708p3493K8894J5075j40164k90008
13286g3211J36757J5542J38069K2034J46172K773l8812N6019l15592j29981q8098
13275a28328p4303j50689J33706K05102K06798J96747J033p7578m1562k94508
13265b3582O7418J74785K6537j33902J42828N7847j77188q2720J31881N2481j65856
13254G0529j02528O3717k33319L05536o6135k07305p5809K11179p4055j30441
13244b38631j0603j08756P9364O3688o3301p8392J05632L35693K05178j36251
$$ y = [-71247, -117656, 61723, 138683, 51670, -121154, -341050, -222003, 48400, 361084, 237468, 99476, 45599, -133568, -163844, -124089, -130547, -31923, 270628, 210358, -84802, 29244, 280367, 450527, 445246, 401969, 377777, 386485, 312992, 341886, 356961, 216797, -73211, 63546, 79088, 217157, 239191, 385363, 388136, 349324, 405343, 89751, -40230, -128328, -202631, -353320, -219614, -14512, 192286, 389033, 390066, 312488, 270926, -23582, 43836, 218621, 245158, 111256, 254084, 311931, 134743, 52023, 183904, 236385, 70529, -31999, 31718, -201601, 103935, 37800, -169505, -245314, -34135, -108190, -238631, -249234, -357990, -278626, -214938, -278239, -356631, -250999, 84694, 289872, 153621]
13234A53621j95457k02788l3921p4956k46965R6332L70169L10250j754k00168
13224b5637m02373j87066K0409P7636L01586J65128J72835J04443j38509j46709
13214e8257k21652o7396L4172J78935K37749r4467N6573j54594k68613j90024
13204e47574n740K81079J10431j62437n1036J10408j4864J27469K45603j32698
13194c9359j65416q832M26479j44503k22871J47300l5291k0728J21748j06170
13184d7643N0470j39601P368J33358O3917m9787k42092j51529L87129J82776K7194
13173B21560J84218o2589k90517j81142K1855O9519J05254o9003j11502L0993
13163h1354R4618N2956K03308j57555Q37O4400M2563l4663j36502k00480J02650
$$ y = [153621, -41836, -244624, -278545, -353501, -600466, -504134, -133965, 176285, 174531, -25637, -428010, -615076, -594667, -517031, -215445, -50317, 122518, 226961, 88452, -58257, -279909, -347305, -313133, -134198, 103551, 9084, 65657, -88937, -357550, -547574, -553314, -272235, -161804, -324241, -375277, -264869, -279733, -152264, 93339, -39359, -204775, -213607, 212872, 68369, -154502, -7202, -42493, -63221, 58527, -47643, 2827, -136774, -129406, 3952, 67869, 18082, -224010, -375539, 11590, 194366, 221560, 405778, 343189, 52672, -128470, -106615, -37096, 68158, -845, -112347, -81354, 13264, 66220, 269528, 111973, 112810, 177210, 219773, 185110, 48608, -151872, -49222]
13152d9222J27882o1568J11981O4529j30147j27984p4121j3383m3336J13496m0586
13141a22459J30367J06342M3641o1692o6118k22045q5880J92625J89950K06493
13131C11224m0134R7962q9212L12707j78857j45536L69349Q3313j38172k45148
13121C37496o26360k81777L03183J20184N122r6472J74889n5167j81397m566o4332
13110c69197M54896L12561j19199k51247K81237K7961j98942J32064K9946j15249
13100A84831l96645J66574J18647o3181O9685j55964Q4704K00714J03070J59108
13090D71543L9903k44446j8068J58435k30268m9178n1346j09130j09094J17952
13080b3697l9690k21146J59802K9701L6369j04766k23605o1428K10876R8205J32063
$$ y = [-49222, 78660, 17092, 129073, 193602, 63455, -64529, -138650, -152033, -195369, -81873, -122459, 7908, 114250, 157891, 96199, 30081, -191964, -277844, -85219, 104731, 311224, 271090, 369052, 279840, 592547, 413690, 268154, 637503, 720816, 582644, 337496, -288864, -570641, -267458, -147274, -142152, -238624, -63735, -118902, -300299, -304865, -369197, 85699, 398260, 279061, 27814, 309051, 337012, 138070, 270134, 300080, 184831, -211814, -45240, 73407, 10226, 79911, -76053, 8651, 209365, 312435, 471543, 511446, 267000, 248932, 407367, 177099, 127921, 76575, -32555, -141649, -23697, -63387, -284533, -124731, -95030, -58661, -163427, -387032, -448460, -237584, -139379, -7316]
13069g316j54966K22537J84178j47204m4120N3298j7531n5053r9115j22649j72006
13058c59947m6087K62422P5497J46853p3989R0709j316K128M5012K275o0494J22559
13046B05622K63156j3776j89941l22153k14407q3455q6928J53728J68823O8665
13036e0666J86056M882q9266k3047j3106Q390q2507r3590r2318K14375Q6006j44977
13024h9768j12429J64365J74393J20972M4358J3053j98996q2248l606n6259R0438
13013F4273J10913J87224p618P2162j35041O7047o7260K39978p1439j27330j28685
13002B04224J20653r2m380M2297Q2996k19154j50241k69232M3139Q7235L94601
12991C32046j01065j36567q6317Q8094n5993K81963j69038j63423K3677Q7948
$$ y = [-7316, -162282, 60255, 244433, 97229, 53109, 106407, 88876, 33823, -65292, -187941, -359947, -406034, -143612, -68115, 78738, 4749, 95458, 94142, 96270, 141282, 143557, 83063, 205622, 468778, 455002, 265061, -57092, -271499, -354954, -441882, -288154, -119331, -50666, 135390, 140272, 51006, 27959, 14853, 23243, -59264, -152854, -245172, -30797, 55209, -89768, -202197, -37832, 136561, 257533, 301891, 314944, 115948, 33700, 30094, -26165, 64273, 175186, 362410, 354792, 426954, 291913, 358960, 291700, 531678, 460239, 332909, 204224, 324877, 324785, 320405, 362702, 445698, 226544, 76303, -192929, -149790, -62555, 332046, 230981, 94414, 8097, 96191, 40198, 322161, 153123, -10300, 13377, 101325]
12981A01325k5257N2457J40411n412L7488m7553J68756k31726j34824K686P732
12970F6083M6861L8412j59226o3391j81133R6168j32772J38805K41818j18820
12960b7195m34272j41741L71695N85052p6370l73492q0441j86119R7571L29402
12950F4090J44434k27306J23071O3420k57031J00178J45634J07984K75402r2027
12940D47849l07372l05213j39264j10348K22954L17202K18772M15806K8221k60677
12930E27930l63147P9674N0109n8475j72656J18196J2833j34570K6901J37937
12920B24732J2499p7345k06173k24081J80887j18392k39294K74393J31130m2050
12910h3694K42924L1857j81285j72006K90713J13465j86765O2977L11211j62578
$$ y = [101325, 76068, 128525, 268936, 263524, 301012, 253459, 422215, 190489, 55665, 58351, 66083, 112944, 151356, -7870, -71261, -252394, -156226, -288998, -150193, 91625, -27195, -461467, -603208, -231513, 353539, 277169, -96323, -176764, -362883, -265312, 64090, 208524, -18782, 104289, 167709, -89322, 10856, 156490, 264474, 539876, 447849, 140477, -164736, -304000, -414348, -191394, 125808, 344580, 760386, 788607, 527930, 164783, 244457, 294566, 236091, 63435, 181631, 194464, 59894, 86795, 224732, 237231, 159886, -46287, -270368, -89481, -207873, -447167, -172774, -41644, -83694, 159230, 191087, 9802, -162204, 128509, 241974, 55209, 118186, 429397, 266819]
12900B66819n7300J60235J62284O9229k39652k27861N7519k84689l03404j16705
12890e13525J576K68082J04056J40618l22974j88927L19283L55309m6644k32653
12880a15799k15169j00288J30026N05140J96724O6490n339l58750k44268M19870
12870B78637K9772j15893j12704R0360J06411k8644k39981O3061J71690J00818
12860C43527o3411P0171j59739m02006k02657J0056J28461L22444K76834Q2421
12850D06101l7078j65711j70349l59378K68550K37020M58018J23250L3285k81951
12840E11757l91034j22244j64861q8829J25045J91141j87855l63321k8384N4148
12830d64437K15468R6994l16121K97665L05316l4667k1680L44360M6153r4962
$$ y = [266819, 209519, 369754, 532038, 601267, 361615, 133754, 191273, -93416, -396820, -513525, -511949, -243867, -139811, 807, -322167, -511094, -191811, 163498, 116854, -115799, -330968, -431256, -301230, 203910, 400634, 467124, 461785, 103035, -141233, 278637, 308409, 192516, 79812, 170172, 276583, 247939, 7958, 71019, 242709, 343527, 280116, 350287, 190548, -211458, -414115, -404059, -275598, 46846, 323680, 406101, 369023, 203312, 32963, -326415, -57865, 179155, 637173, 760423, 793708, 511757, 120723, -1521, -166382, -255211, -130166, 60975, -126880, -490201, -518585, -464437, -248969, -151975, -468096, -170431, 134885, 100218, 78538, 422898, 469051, 374089]
12820C74089q2873J98801J12256k69479N4114K87182j27888m29104j87289J04084
12810C3893K26284M9004j39435r7787o2529P3761k54771J4118J5251P9003L36971
12799B73763J28308q1486K35425j18361k65242j75180n8484l3755p388j00977
12789b03377k92667o4184Q9986K86181O9016p209K50846k27616k60207j41554
12779e00785J85625L4296q9258K45470L76081J94535K2705l23271j87562M5680
12769C516J48801K33302j22286k66910m3965M00786K02835j43937p8935J74731
12759E07938k3932n5682p5236m9251m3234j1703m06853j91113L60311N11947m5338
12748D77854m30082k24062q6549o2922j45984J12068J25207J25168K2027m6956
$$ y = [374089, 291216, 490017, 602273, 332794, 386908, 674090, 546202, 117098, -70191, 33893, 260177, 309181, 169746, 71959, 9430, 83191, -171580, -157462, -142211, -63208, 273763, 402071, 320585, 556010, 437649, 172407, -2773, -61257, -95012, -102400, -203377, -496044, -560228, -470242, -184061, -115045, -122254, 128592, -99024, -359231, -500785, -315160, -280864, -370122, -124652, 251429, 445964, 468669, 145398, -42164, 3516, 152317, 385619, 263333, -3577, -47542, 353244, 556079, 412142, 333207, 507938, 484006, 428324, 353088, 303837, 260603, 248900, -157953, -349066, 11245, 523192, 477854, 47772, -176290, -262839, -325761, -471745, -359677, -234470, -109302, -87275, -134231]
12738a34231M737j11166k11860J85241K37797J67387q116J1840r7540k05716J13782
12727d7845J3928P6614K30491j17663O012J26860J34758j63766l03121j60096
12717b03828J55192K83054K3627n5885j36900k3186n7267m71422k66828N4435
12707f99008M15409K81032J42174j34167K17873L28678k07586j68627k7037M3333
12697A92074R9331N2404J72921J09412K06133j81254k59386j67564J55447J22940
12687E02458O683k41597j55519j36525J70472L24852J8981J38456O4493l99528
12677B93226j30881K82522j28646k06795j34675P4525K74897J87644j05783j85523
12667B20511M9175l8311q5574R1676O0934N0310j55707k06174j32312J02859O2541
$$ y = [-134231, -129494, -240660, -452520, -267279, -29482, 137905, 129789, 141629, 44089, -161627, -47845, -33917, 42697, 273188, 155525, 161537, 288397, 423155, 259389, -43732, -203828, -48636, 234418, 258045, 202160, 65260, 42074, -15193, -486615, -753443, -699008, -283599, -2567, 139607, 5440, 223313, 551991, 344405, 175778, 148741, 192074, 291405, 343809, 516730, 626142, 832275, 651021, 391635, 224071, 379518, 502458, 509141, 267544, 112025, -24500, 145972, 470824, 489805, 628261, 692754, 293226, 162345, 444867, 316221, 109426, -25249, 49276, 324173, 511817, 406034, 220511, 269686, 231375, 145801, 237477, 298411, 348721, 193014, -13160, -145472, -42613, 19928]
12656A9928L97540J29784j21011R7060j92802l08741j0959n0660j05510J2823
12646a32548J07245K17920J93473j64622q217k50002r8685O7499j8082j63373
12636b49392J96923L75305q3291J78816J35388k91523m26497j31537M24463Q3752
12626B12407J88696K58845j38077L0886k97770j12620q4461J6597n3998J1616
12616C2121N0808J84374j38096k2514K35529K52585Q5795R6508K98147l4292o54496
12605C86469m47170J8468j12582K30746K18532o9860O9341N8468n4174l9257k14344
12594D4637K19865M8926L3259o0325k66987k60618n8073J55535j8041J55802J8153
12583A2133k35000K5352M14893N0422j6417m4628J64990m0141k72265j83459l0277
$$ y = [19928, 417468, 547252, 426241, 523301, 330499, 21758, 10799, -39861, -145371, -132548, -25303, 192617, 386090, 221468, 213251, -36751, -135436, -67937, -86019, -249392, -52469, 322836, 239545, 418361, 553749, 262226, -164271, -295808, 128655, 212407, 401103, 659948, 521871, 552757, 254987, 142367, 57906, 74503, 20505, 32121, 82929, 267303, 129207, 106693, 342222, 594807, 680602, 777110, 1075257, 1040965, 386469, -60701, -42233, -154815, 75931, 294463, 224603, 293944, 352412, 298238, 258981, 44637, 264502, 313428, 346687, 286362, 19375, -241243, -299316, -143781, -161822, -6020, 12133, -222867, -197515, 217378, 267800, 251383, 206755, 371745, 331604, 59339, -124120, -154397]
12572a54397J15913J72445J54192L06169j94624l06292n8649l9609o2156j08402
12562a75410j4046p6889K10735K38609j19386l36550j84092R0040J69854O28574
12552D31439K24958n0956j77946j16702O9130K40656o6399k98649q5416J01319
12542B71434M0053J25527j7280K1157O547l8122O8373M5201o4461n5894j28000
12531B74535P5077k26125j22676J71070K54012P9557o1187j48159j58301j89552
12521e1749j2303j27288K04395L30634L12634j50228k77948n7075Q3589M12713
12511F67374p2203j71239k00446o2847Q94j08757O3205J33612p0932L47507J82856
12500G09024p2439q6928k43711M7951j3938M9165J84460K91459J43835k28416
$$ y = [-154397, -38484, 133961, 288153, 594322, 399698, 93406, 34757, -4852, -67008, -175410, -189456, -266345, -55610, 182999, 63613, -272937, -457029, -366989, -197135, 431439, 656397, 605441, 427495, 310793, 379923, 620579, 554180, 255531, 170115, 271434, 311487, 437014, 419734, 440891, 447438, 409316, 477689, 522890, 458429, 402535, 274535, 349612, 123487, 811, 171881, 425893, 505450, 444263, 296104, 137803, -51749, -64052, -191340, 13055, 343689, 656323, 506095, 228147, 171072, 254661, 667374, 595171, 423932, 223486, 160639, 161533, 52776, 115981, 249593, 178661, 526168, 709024, 636585, 549657, 305946, 353897, 339959, 389124, 573584, 865043, 1008878, 780462]
12490G80462q9798l1589K34524l1276p2130k50233j41268m1780j23230J0679J36877
12479C81238l11638j72637J33011R8509K62732K35401j57431k51371J9857j2642
12469B25029j21374P9543J58528k6076L3421J5220K2919K52219p7571l85025j58000
12458A8833K34101Q8691q5492j42445J6711N2149J22274J64393J3002j13835m4412
12447C23970O2988R2867l567k6136j68526L0771j67787J3755J19157J72827J11876
12436E62195l80575m6888L06028P8568j84115j53260j06638Q4133J16893K42159
12426E18500K51082o1802m0242j80534J41586n49711k66254L50873L64045m2947
12416D84596k34544M8328j01078j4019L45092K69370N7700r7385l59096o1398
$$ y = [780462, 690664, 659075, 893599, 862323, 790193, 539960, 398692, 356912, 233682, 244361, 381238, 69600, -103037, 29974, 128483, 391215, 626616, 469185, 217814, 237671, 225029, 103655, 183198, 341726, 315650, 349071, 364291, 387210, 639429, 561858, 176833, 18833, 252934, 341625, 256133, 113688, 130399, 182548, 304822, 469215, 482217, 368382, 323970, 386958, 479825, 476258, 450122, 281596, 312367, 144580, 158335, 277492, 450319, 562195, 181620, 134732, 440760, 519328, 335213, 181953, 75315, 159448, 276341, 518500, 769582, 707780, 667538, 487004, 628590, 78879, -187375, 163498, 527543, 484596, 250052, 298380, 197302, 183283, 528375, 797745, 855445, 758060, 398964, 337566]
12406C37566m0254N654q5868J33292K6227K13724J48486l6902l20099J10573j6457
12395D75942j07543K3949J36398J19423J1643o9372J05506j87801K4068K08573
12385G40786j44157j03054J76178k77683j64757K94370p1647j04244M2898J9464
12375D08154K24526J08381k7039J02164O4433J58099j51861k26682L06432J25011
12365A091618k20749k65139J04410L44711J59887j66792j42937j26442L20045
12356A098612P0446q4207J70827O1797p6062k83797m71782k23218j29754K63560
12346C96422L20711j40226k51444m9858R4033J86785J88355J8292L12166J58171
12336A233407j18814l31405j09590j29318j8785q0315O6953j6842R3778K94974
$$ y = [337566, 297312, 302966, 217098, 350390, 376617, 590341, 738827, 701925, 381826, 492399, 475942, 368399, 392348, 528746, 648169, 659812, 590440, 695946, 508145, 532213, 740786, 596629, 493575, 669753, 392070, 227313, 521683, 450036, 345792, 388690, 408154, 632680, 741061, 714022, 816186, 880619, 1038718, 886857, 660175, 966607, 1091618, 870869, 605730, 710140, 1054851, 1214738, 1047946, 905009, 778567, 1098612, 1169058, 1084851, 1255678, 1317475, 1241413, 957616, 485834, 262616, 132862, 396422, 717133, 576907, 325463, 275605, 369638, 556423, 744778, 763070, 1075236, 1233407, 1114593, 783188, 673598, 544280, 525495, 445180, 512133, 495291, 589069, 884043]
12326H84043J19412j76877m2998K16607L20301j81775K9294l82560K6080K38859
12316A050386J87520j69675r5007p9781J03q8281j0299O768L1964K96170N9475
12305A189343r2597k74586j49176q0067J96468J04306j40185j2997k95743r3965
12295C50801J28022K23545l3933N0738O4666O5468q222q4296j8547P1113R3628
12284I02983N6254J33451j60256q4811J31199R0370j68185J7945J45762K25149
12274A289861j8111j04983P5132m2257K87531n9241m40703k62555M0452K9821
12264G94947M0048J98102n2649j40859J64751k7894m6287j3283L3691q194J64465
12253A106838R7306l8057J5929j09335j51024m744j0602M84143J59213p0455l90779
$$ y = [884043, 1003455, 826578, 783580, 1000187, 1320488, 1138713, 1168007, 785447, 811527, 1050386, 1237906, 1068231, 973224, 893443, 893546, 805265, 794966, 801734, 833698, 1129868, 1189343, 1096746, 822160, 672984, 592917, 789385, 893691, 753506, 740509, 444766, 350801, 478823, 702368, 668435, 719173, 783839, 849307, 841085, 756789, 738242, 809355, 902983, 959237, 1092688, 932432, 847621, 978820, 1069190, 901005, 918950, 1064712, 1289861, 1271750, 1166767, 1241899, 1199642, 1487173, 1427932, 987229, 724674, 765126, 794947, 834995, 1033097, 980448, 839589, 1004340, 976446, 930159, 916876, 950567, 942373, 1106838, 1204144, 1166087, 1182016, 1072681, 921657, 916913, 906311, 1390454, 1549667, 1479212, 1088433]
12242A088433K01841L78982m7996o8010o5971l9320K11139J36045k94507j77047
12232A323589j07725R248J30324J88332J42419L56168O9835l16012j66262k42042
12222A387874j42828k35821O8247K07496K84016p3108M5527M5537k22078j0316
12212A354546P5545j18288n8905K60499M43930L4612j24961j32016J03504K30180
12202B068646Q9369j14267K1978J44630J8771n4665j02449o9885k61745j06379
12192A634004J77295J76185J6136R8314k47923j08257r4086M05438K95748K25
12182B353079J94779K7287p2085k30763l98102r7237J73628L415O9842J15285
12172B139128K58411K22112K53371j6924o1171K31894k92343k34435R013p1906
$$ y = [1088433, 1290274, 1669256, 1621260, 1553250, 1487279, 1447959, 1659098, 1795143, 1500636, 1323589, 1215864, 1225112, 1355436, 1543768, 1686187, 2042355, 2112190, 1796178, 1629916, 1387874, 1245046, 1009225, 1077472, 1284968, 1568984, 1495876, 1541403, 1586940, 1364862, 1354546, 1430091, 1311803, 1252898, 1513397, 1957327, 1991939, 1866978, 1734962, 1838466, 2068646, 2158015, 2043748, 2065726, 2210356, 2229127, 2174462, 2072013, 2002128, 1740383, 1634004, 1811299, 1987484, 2003620, 2101934, 1854011, 1745754, 1651668, 2057106, 2352854, 2353079, 2547858, 2575145, 2503060, 2272297, 1874195, 1776958, 1950586, 1954001, 2023843, 2139128, 2397539, 2619651, 2873022, 2856098, 2794927, 3026821, 2734478, 2500043, 2509056, 2437150]
12162B437150J56051q9841q9128N634J2148n6587j67474J55322M33550K71852
12152C068677J06757K30581L37506m86150m07283l30684k58609J50865M07237
12143B818897Q4381k27721j31524J2306J64049K01510k9048J78379j47457j33491
12133B790281j14316K68429K64032r8506J26096n7734L1052J46994J50040j30506
12123C375862j31746J39638R7009L6980K33452Q6591n959k79750j61826K13732
12113C603983K64170l25373j66045m3266R1353K58181J81810K1110M8958j71047
12103C763834J21033P0318N8437J04728R6114j01404n2268j10793J59725K29740
12093D339464J75189n6359P4593l2250J73839P1972K3615M0678j4717J462K17144
$$ y = [2437150, 2593201, 2503360, 2414232, 2419866, 2432014, 2375427, 2207953, 2363275, 2796825, 3068677, 3175434, 3406015, 3743521, 3257371, 2850088, 2519404, 2260795, 2411660, 2818897, 2903278, 2675557, 2544033, 2556339, 2720388, 2921898, 2892850, 3071229, 2923772, 2790281, 2675965, 2944394, 3208426, 3109920, 3236016, 3178282, 3209334, 3356328, 3506368, 3375862, 3244116, 3383754, 3480763, 3517743, 3751195, 3837786, 3831827, 3552077, 3390251, 3603983, 3868153, 3542780, 3376735, 3333469, 3424822, 3683003, 3864813, 3885923, 3934881, 3763834, 3884867, 3955185, 4013622, 4118350, 4214464, 4113060, 4060792, 3949999, 4109724, 4339464, 4514653, 4458294, 4532887, 4500637, 4674476, 4746448, 4770063, 4810741, 4796024, 4797486, 5014630]
12082E014630q7507L7687J70565L02016J6811K5129M44956K57290j01648k33099
12072E846830r1867L13629r5358q3783r095L2939O2160L08474J71667p4318M740
12061F386018p4771l82732K35277N35998K81551p0911m5438N3813O7171J66165
12051G152141l355j3894P7482J69871k7194j61606K30190L55977J42249K01097
12041H122958J73780N9319J02794J76734R9375J18641J02937O2845j07169m6444
12031H865770K23048O2355K35307o2103L77740L54196R8698k24556r2475K92965
12021A0130945Q8242L30636M63344J73884L9752k00606J51606M30063M14420L06241
12011A2328527J07633K02292K12781N3445J55026K89440L02886J32758Q2713L00374
$$ y = [5014630, 4927123, 4964810, 5135375, 5437391, 5454202, 5479331, 5924287, 6181577, 6079929, 5846830, 5754963, 6068592, 5973234, 5889451, 5880356, 5913295, 5975455, 6283929, 6455596, 6381278, 6386018, 6311247, 5928515, 6163792, 6699790, 6981341, 6910430, 6864992, 6918805, 6985976, 7152141, 7148786, 7134892, 7212374, 7382245, 7355051, 7193445, 7423635, 7779612, 7921861, 8122958, 8296738, 8356057, 8458851, 8635585, 8734960, 8853601, 8956538, 9019383, 8912214, 8865770, 9088818, 9151173, 9386480, 9324377, 9702117, 10056313, 10155011, 9930455, 9837980, 10130945, 10219187, 10549823, 11013167, 11187051, 11226803, 11026197, 11177803, 11607866, 12022286, 12328527, 12436160, 12638452, 12851233, 12904678, 13059704, 13349144, 13652030, 13784788, 13867501, 14167875]
12001A4167875L28409J99193l3453J00383l1387P7951K59814K54085J56390K06266
11991A5685526N4445J44705M78087M31584K31221J16836K62459q4164K53961N57199
11981A8131859N38434K54207N2403J60460M30382K07686n5753N55537L32532J37155
11971B0744902K21690N51736O54303M50846N3748j39951K94864M67069L60440
11962B3659647K38921L17535L1704J40597L66479N03706N02962N48713J74689
11953B6484953L50877M15152J91100L7232L13371L20106M85620M52977J24136
11944B9175524N5392L08496L48099J14572K28418J71793K71274N07403J75849
11935C1356820R0763L39423K17756J58006O7380m4573M516J45542L32126M87566
$$ y = [14167875, 14496284, 14695477, 14662024, 14762407, 14731020, 14808971, 15068785, 15322870, 15479260, 15685526, 15739971, 15884676, 16362763, 16794347, 17025568, 17142404, 17404863, 17320699, 17574660, 18131859, 18670293, 18924500, 18976903, 19137363, 19567745, 19775431, 19719678, 20275215, 20607747, 20744902, 20966592, 21518328, 22172631, 22623477, 22677225, 22537274, 22832138, 23299207, 23659647, 23898568, 24216103, 24247807, 24388404, 24754883, 25258589, 25761551, 26310264, 26484953, 26835830, 27250982, 27442082, 27479314, 27792685, 28112791, 28598411, 29051388, 29175524, 29230916, 29539412, 29887511, 30002083, 30230501, 30402294, 30673568, 31180971, 31356820, 31447583, 31787006, 32004762, 32162768, 32230148, 32185575, 32190091, 32335633, 32667759, 33155325]
11925C3155325P0409j11495r3838o1463K11282J25884k9090L9405j26821k3467
11915C3156131J61729o9051j54633l08150L44636J23420l23726p9505J4703M2754
11905C2908308l21904m71690j10570j22181k10600k32252j12163j68793j45604
11896C1012551k53781k32464j84829j94786j61936j50814k05792k88707j54434
11887B9185008j07789j75757l71390k85399m33995l196l09444n31559n91726m28967
11877B5945786k36748k59354k66866l04273j81332l63123j10140j93255m44771
11868B3585924k41735p3287J8055k49867m57450k06020j51513k83701l34626j21684
11858B1484096k98664j63759q2621m20726j96480m6131m43246k5856k30868k96331
$$ y = [33155325, 33225734, 33114239, 33020401, 32958938, 33170220, 33296104, 33267014, 33306419, 33179598, 33156131, 33317860, 33248809, 33094176, 32786026, 33130662, 33254082, 32930356, 32850851, 32865554, 32908308, 32586404, 32114714, 32004144, 31881963, 31671363, 31439111, 31326948, 31158155, 31012551, 30758770, 30526306, 30341477, 30146691, 29984755, 29833941, 29628149, 29339442, 29185008, 29077219, 28901462, 28530072, 28244673, 27810678, 27807482, 27498038, 26966479, 26374753, 25945786, 25709038, 25449684, 25182818, 24878545, 24697213, 24334090, 24223950, 24030695, 23585924, 23344189, 23270902, 23288957, 23039090, 22581640, 22375620, 22224107, 21940406, 21605780, 21484096, 21185432, 21021673, 20939052, 20518326, 20321846, 20275715, 19832469, 19806613, 19575745, 19279414]
11848A9279414k09684k44252l76781p0357k43441p62589j14821r2414k28418k02524
11838A6734133j45421j49883j82882m54532o22700k05045J2250k12888k10118
11829A4562914j47158o437j084j7033j44994o7248k29478l21581o33636j73551
11819A2820714J18669q9113Q7742l89219l62109J59954k21138l47776k33295J66095
11809A1710524M9861j56907R1704n6953l80678k02178l70169k60992j88069q4818
11799A0151325j22751m6292j16644j75354r7466j12561j10122l9464j12357k18666
11789H999648j29438l39687j91259p1448L82789K5049m02276m65886j54799K01281
11779G853974R4460M4107M3998J00560Q174l60343j95140K08943N2138l74782
$$ y = [19279414, 19069730, 18825478, 18448697, 18378340, 18134899, 17372310, 17257489, 17165075, 16936657, 16734133, 16588712, 16438829, 16255947, 15801415, 15178715, 14973670, 14985920, 14773032, 14562914, 14415756, 14409319, 14408235, 14391202, 14246208, 14178960, 13949482, 13627901, 12994265, 12820714, 12939383, 12850270, 12938012, 12548793, 12186684, 12346638, 12125500, 11777724, 11544429, 11710524, 11760385, 11603478, 11695182, 11638229, 11257551, 11055373, 10685204, 10424212, 10236143, 10151325, 10028574, 9982282, 9865638, 9690284, 9592818, 9480257, 9370135, 9330671, 9218314, 8999648, 8870210, 8530523, 8339264, 8267816, 8650605, 8675654, 8273378, 7807492, 7652693, 7853974, 7948434, 7992541, 8036539, 8137099, 8145273, 7784930, 7589790, 7798733, 7850871, 7476089]
11769G476089j37230M1075k26134j81046R7013J34962j65786p1610k26179k11318
11759F529836J56902j9655k20526l5269l69005j92923K59229M43995R7498k89514
11749F360568j012J11879k93154l18683l6805J5520r58o6534L9189k31629J14243
11738E692624j47408m2827L3823k55522j76469J80401q5821j13885j96557k81521
11728D606838m2115M10698L44573j07947j29562k99909k59617N2942q5117J17469
11718D608253j23318L1326k5953r6785j58220k65048K8011J92785m8514Q9026
11708D231563J44689m5928P1101j21733k57125Q591j56858k40500J47834K7164
11698C808798k25572J6789K46780j9073q5708j04488k08422j63370k38197k65872
$$ y = [7476089, 7338859, 7379934, 7153800, 6972754, 7069767, 7204729, 7038943, 6967333, 6741154, 6529836, 6686738, 6667083, 6446557, 6411288, 6042283, 5849360, 6108589, 6552584, 6650082, 6360568, 6359556, 6471435, 6178281, 5859598, 5822793, 5838313, 5837355, 5770821, 5810010, 5578381, 5692624, 5545216, 5502389, 5536212, 5280690, 5104221, 5284622, 5198801, 5084916, 4888359, 4606838, 4564723, 4975421, 5319994, 5212047, 5082485, 4782576, 4522959, 4575901, 4490784, 4608253, 4484935, 4516261, 4490308, 4393523, 4235303, 3970255, 3998266, 4191051, 4142537, 4231563, 4376252, 4330324, 4401425, 4279692, 4022567, 4031158, 3874300, 3633800, 3781634, 3808798, 3583226, 3600015, 3846795, 3827722, 3742014, 3637526, 3429104, 3265734, 3027537, 2761665]
11688B761665J25508O6888l3777N2603K36215L10381j31066j93963k82518k7468
11678B884468Q9227m6143P6241N5524l1540q7912q106L2754M5492r5492j4504
11667B900009j11892O1632q3252k81127J41116K67381P1972J2654j34399p9980
11657B764114k50303j63079K62464j52399k48875Q1054J02461K11833m507l1058
11647B571705N1533q9682J53975J29070o0809l97293l44991J85645L50405L2484
11637B582042N7741k49287j19754q866j78587p9218J17775J18198k02441p4516
11627A963087Q7236q3771n5653j5551R7026l814l7353J90386K32512P1478j09099
11616B336484m0603J32474O4188o2083j51735k91527k73083L36465j38875m5364
$$ y = [2761665, 2887173, 2954061, 2920284, 2972887, 3209102, 3519483, 3388417, 3194454, 2911936, 2884468, 2973695, 2927552, 3003793, 3059317, 3027777, 2939865, 2931759, 2964513, 3010005, 2914513, 2900009, 2788117, 2849749, 2766497, 2485370, 2626486, 2893867, 2965839, 2978493, 2844094, 2764114, 2513811, 2350732, 2613196, 2460797, 2211922, 2292976, 2395437, 2607270, 2602763, 2571705, 2623238, 2533556, 2687531, 2816601, 2755792, 2358499, 2013508, 2199153, 2549558, 2582042, 2639783, 2390496, 2270742, 2261876, 2083289, 2004071, 2121846, 2240044, 2037603, 1963087, 2050323, 1966552, 1910899, 1895348, 1992374, 1988560, 1951207, 2141593, 2374105, 2445583, 2336484, 2295881, 2428355, 2492543, 2430460, 2278725, 1987198, 1714115, 2050580, 1911705, 1866341]
11606A866341J4444j73627j79730k560n0425j5082j04654K13560K776N1833O2462
11595A685338Q7300P4063J28591J55637m0813m7618l38408k64101L07589J35738
11585A883316O8954k39563k38731J5712o4966k911K43445k60412j81356j30856
11575A092632J40797R9356j52816M9350J08585j64121q2554L5943M05074J20452
11565A652698k84103j62984j4864J24273M870m055J07307j08158k83892k98421
11555G32671K88180J65019M124K67054j5572j26597p3040j88955r5701K60506
11545A217689j84508K48092J25063K0058J98692l8914J24883j3657q2147k29574
11535A385677l01609p1952K62884j43938l43063J16365K14876J8302j7346J29059
$$ y = [1866341, 1880785, 1707158, 1527428, 1524868, 1474443, 1459361, 1354707, 1568267, 1571043, 1622876, 1685338, 1772638, 1846701, 1975292, 2130929, 2090116, 2042498, 1704090, 1439989, 1747578, 1883316, 1952270, 1712707, 1473976, 1489688, 1424722, 1421811, 1665256, 1404844, 1223488, 1092632, 1233429, 1332785, 1179969, 1229319, 1337904, 1173783, 1091229, 1127172, 1532246, 1652698, 1368595, 1205611, 1190747, 1315020, 1319890, 1315835, 1423142, 1314984, 1031092, 732671, 1020851, 1185870, 1189994, 1457048, 1441476, 1314879, 1241839, 1052884, 957183, 1217689, 1033181, 1281273, 1406336, 1426394, 1625086, 1586172, 1711055, 1697398, 1615251, 1385677, 1084068, 1012116, 1275000, 1131062, 787999, 904364, 1119240, 1137542, 1120196, 1249255]
11525A249255j17061j46169J37699L07949m2772j69021j10512P8041j25448l08295
11515G53666j04878J99062Q0308J76526L34390o4791m16440l76593k0752q9423
11505D71075j42224K53998L01175P8019M5342N1279q4436l02681l99350o8536
11495B03661L99645L32517K78341k96206k52700O4509L2940O2916n4784n186j190
11484G64463J3179J68962l5538j9082J04109n5276K9575J89942j64660J13156
11474A108830j79661l45314R3703K12487O6494M1246J21955K48124j31167j88301
11464A048396j67433Q3230r7860K07201J19875J98200l09154k35506j66318m15553
11454B65078J48868J68427j07677k47840L45048L50039p1533M0393J02861M7509
$$ y = [1249255, 1132194, 986025, 1123724, 1431673, 1388901, 1219880, 1109368, 1187409, 1061961, 753666, 648788, 847850, 928158, 1104684, 1439074, 1374283, 957843, 581250, 560498, 471075, 328851, 582849, 884024, 962043, 1007385, 1058664, 974228, 671547, 272197, 203661, 603306, 935823, 1214164, 917958, 665258, 729767, 762707, 825623, 770839, 765653, 764463, 777642, 946604, 911066, 891984, 996093, 940817, 970392, 1160334, 995674, 1108830, 929169, 583855, 677558, 890045, 956539, 997785, 1119740, 1367864, 1236697, 1048396, 880963, 964193, 866333, 1073534, 1193409, 1391609, 1082455, 846949, 680631, 265078, 413946, 582373, 474696, 226856, 571904, 921943, 850410, 890803, 993664, 1041173]
11444A041173n44960k81582O1998P7470K90760P6100q9879j07063J28392J18198
11434G70607K53610q6558o9355k48019n6633l92862q2614K04592J70757q9959
11424C73566J81856R0182L14288r650k01875m4038O9507j78521n7381J19298M1073
11413F98305j82376j50713j07883K34550Q3739L89898O9776l6097l01341j14351
11403E83507q6385k8362k3723r586M9183J48876l4486J05009O6985j49211m2519
11392E79288P9134J4172j22226J33673k74066j3269J43014J39755j79689l05545
11382A94241L4052J86981k02555k49500o9713L46475j78299J73063J97063l63421
11372F8387P9402K96676K82581L79656l7166p4638m2336j68200q6416p389k54770
$$ y = [1041173, 496213, 214631, 276629, 354099, 644859, 720959, 631080, 524017, 652409, 770607, 1024217, 937659, 868304, 620285, 563652, 170790, 88176, 292768, 463525, 373566, 555422, 645604, 959892, 950242, 748367, 704329, 773836, 595315, 537934, 657232, 698305, 515929, 365216, 257333, 491883, 575622, 965520, 1035296, 999199, 697858, 583507, 497122, 468760, 445037, 435451, 484634, 633510, 599024, 704033, 771018, 621807, 579288, 658422, 672594, 550368, 684041, 409975, 396706, 539720, 679475, 499786, 194241, 228293, 415274, 212719, -36781, -106494, 239981, 61682, 234745, 431808, 68387, 147789, 444465, 727046, 1106702, 1069536, 994898, 952562, 784362, 697946, 690557, 435787]
11361D35787L2300j37031l83408Q651M85052K55987j57314l4515l3061k9936l14439
11350A28073j72929K02784K28282L37453n7928m1834l7582j0082k84921J22319
11340D13635l3110q4233k77639j30288K4865L17909K26654J15350j55145L1867
11330D49865j8237k25906j05834j31843K18802L23747J37291N4808k53827J31013
11320E79879j05246k86161j10153k54901O752J48896L37237J56241j59378k33682
11310G9484p3409M4391j25205J57968K4787N2619N0335J08674R546K91303L01341
11299I21834k19291m52538L1053j43205k59923o8340J55212L622K01691J35844
11289C05959L3801r4886k45146r9650l5900K47844J02866j04576j83674K55270
$$ y = [435787, 468087, 331056, -52352, -43701, 441351, 697338, 540024, 505509, 472448, 442512, 128073, -44856, 157928, 386210, 723663, 665735, 623901, 586319, 576237, 291316, 413635, 380525, 296292, 18653, -111635, -86770, 231139, 457793, 573143, 417998, 449865, 431628, 205722, 99888, -31955, 186847, 510594, 647885, 702693, 448866, 579879, 474633, 188472, 78319, -176582, -169830, -20934, 316303, 472544, 313166, 79484, 6075, 50466, -74739, 83229, 108016, 160635, 210970, 319644, 329190, 620493, 921834, 702543, 250005, 281058, 137853, -122070, -190410, -35198, -31576, 170115, 305959, 339760, 244874, -272, -99922, -135822, 112022, 214888, 110312, -73362, 181908]
11279A81908K14080j85449K55826L21646q184j21295k79131l35517Q7846K89084
11269D20814K17192j78896o9541j55192j05257k293K24458j59491k36016j34101
11259a78323K20277Q1226q5264J55835K52538J71953j06044M2239k28717m27733
11249a02013P2224K87946k04430M7615L01656j2591r4951o4060J50960o6956N3227
11238C68627p0751j83915M339Q9134j34180k44024J87250k9228L4379l5412J79625
11227A65844o2715J3196J92969J95073q6592n5941L37m1728p9686k72949K24473
11216A92281K1111k08170k74401J59931P1372J91124K40528K17764q5087o8491
11206D57962N5568J39923K7258J12426J33735J68656j32745N77668M00606R2656
$$ y = [181908, 395988, 210539, 466365, 788011, 779827, 658532, 379401, 43884, 131730, 420814, 638006, 459110, 389569, 234377, 129120, 126827, 351285, 191794, -44222, -178323, 41954, 123180, 37916, 193751, 446289, 618242, 512198, 554437, 325720, -102013, -29789, 258157, 53727, 101342, 402998, 390407, 295456, 231396, 382356, 315400, 368627, 297876, 113961, 118300, 207434, 73254, -170770, 16480, -12748, 21631, -13781, 165844, 103129, 116325, 309294, 504367, 417775, 361834, 362171, 320443, 240757, -32192, 192281, 213392, 5222, -269179, -109248, -37876, 153248, 393776, 611540, 526453, 457962, 513530, 653453, 680711, 793137, 926872, 1095528, 962783, 1540451, 1941057, 2033713]
11196B033713J70696J11405J85977o3318r7697q5454l42229n48255m52894K9360
11186I41304J61597P865j19312M588L7771l00459j61949k19213j9072k5429j94386
11175A13305L090K15456j11069j31159J51417p381O3278k17200j38423j13309
11165a71995M1089L07720M08796l05036m61966l5939L90930K07081j78127q5939
11155A16614K16515J16134J89420L1418o513l88937k53332K4721j97L4556J90026
11144B70425q3403j17417J39558K2504L8300J3473l67527j73953k62300J00263
11134d20077L76674K36167K03399J00530l55182l44925J43504N84351J59971k01380
11124D83032k52227O2346j369l13666J290k12500k36611J2728L38617J05081K26346
$$ y = [2033713, 2204409, 2315814, 2501791, 2438473, 2340776, 2255322, 1913093, 1364838, 911944, 941304, 1102901, 1110766, 991454, 996042, 1033813, 733354, 571405, 352192, 333120, 307691, 113305, 116395, 331851, 220782, 89623, 241040, 233659, 296937, 79737, -58686, -171995, -130906, 176814, 585610, 280574, -181392, -217331, 173599, 380680, 202553, 116614, 333129, 449263, 638683, 670101, 663588, 274651, 21319, 46040, 45843, 80399, 270425, 187022, 69605, 209163, 231667, 269967, 283440, -84087, -258040, -520340, -420077, -43403, 192764, 396163, 496693, 141511, -203414, -59910, 524441, 684412, 483032, 230805, 293151, 291782, -21884, -20594, -233094, -469705, -456977, -118360, -13279, 213067]
11113B13067M24879k53349l13353K15984P3518j24571k44914P9180K27715r3730
11103B04426J36767K83908p9862M1105j25596k09847p9557m4043J32005l91904
11093a32598j96477l6404J61308j39341p3200M3395K7369J34059L7118o8502J91568
11082e1705J00728J23063k77741l40950J73055q560k0447l8385j20872k21J29105
11071c32930J43898K04826J37290j176p3389k62298M9377K25839j04632k45319
11061b58514J20946K82825o9004l31973p3273j47955J45461M59175L2119O9475
11051B29282j97828n17676K70843L79975j33793k18173q5880P5764K62581l4798
11041C0297M6536J44198J1812K07803L16031L67574m3202j64998q0504k02995
$$ y = [213067, 637946, 384597, 71244, 287228, 360746, 236175, -8739, 70441, 298156, 204426, 341193, 625101, 545239, 586344, 460748, 250901, 171344, 127301, 259306, -132598, -329075, -365479, -204171, -343512, -416712, -373317, -345948, -211889, -174771, -243273, -51705, 49023, 172086, -105655, -446605, -273550, -282110, -302557, -340942, -461814, -462035, -332930, -189032, 15794, 153084, 151908, 78519, -183779, -134402, 91437, -13195, -258514, -137568, 145257, 76253, -255720, -328993, -476948, -331487, 127688, 159807, 229282, 31454, -486222, -215379, 164596, 30803, -187370, -273250, -197486, 65095, 30297, 76833, 221031, 232843, 440646, 756677, 1124251, 1081049, 916051, 835547, 632552]
11031F32552k2199K76580O6759L9845q6075J77702K73153j35243j62029P9012
11021A140057K10455j25898O7110R9120n9170J16770M24624L63470k31533j28159
11011A876846o6533J23455l855m48728k47137j16798J41510K90600J50699J92057
11001A892116k76554k00904L0383K53891r8102m26489k75131j1936O6693l8941
10991I15026Q4265K57624k1166l46952k8398o6247j04391j97702Q1395o2165j29867
10980C81422l15638j43598l6451M7860J70199K49868J55941j67154j91909J5788
10970A66328j2480o1184l18406j08363k606J72883M61868j9863k2607k42805P8422
10959I1187J52002K67314j1207m45841k05558K66534J07095K33965J62646J81536
$$ y = [632552, 610353, 886933, 953692, 993537, 907462, 1085164, 1358317, 1223074, 1061045, 1140057, 1350512, 1224614, 1291724, 1390844, 1331674, 1448444, 1873068, 2236538, 2005005, 1876846, 1810313, 1933768, 1929913, 1481185, 1234048, 1117250, 1258760, 1549360, 1700059, 1892116, 1615562, 1414658, 1445041, 1698932, 1600830, 1174341, 899210, 887274, 953967, 915026, 999291, 1256915, 1235749, 888797, 860399, 794152, 689761, 492059, 573454, 511289, 381422, 65784, -77814, -114265, -66405, 103794, 353662, 509603, 342449, 150540, 166328, 153848, 92664, -225742, -334105, -336711, -163828, 298040, 278177, 255570, 12765, 91187, 243189, 510503, 499296, 53455, -152103, 114431, 221526, 455491, 618137, 799673]
10949G99673K4375K59070L73692k10199P371L04811N64843K18467j46451k41678
10939A953974j63026n4714l01459k85553k57103k24660j18883K980k58909q0531
10929B12116N3500k75903k83239k6945L83860K54918J07318j57287k47573K4636
10919D5401J64911q3639j63340k29389J51709J22249k01760J9249L60370k56285
10909g0524j42463J48944o7526J56310L427k16581j11226J76973j88098J13416
10899a97348J32058L8768l6466R500p057K16969J97721N6106l54517q4212K55919
10888B27441J41429o1850l9318L20702K19137j45589j28714k42559R3050J55558
10878E39287j59212o434k84612j50693j10529l1375J29575M17394M86374j24272
$$ y = [799673, 824048, 1083118, 1456810, 1246611, 1253982, 1558793, 2123636, 2342103, 2195652, 1953974, 1790948, 1736234, 1434775, 1149222, 892119, 667459, 548576, 551556, 292647, 212116, 265616, -10287, -293526, -320471, 63389, 318307, 425625, 268338, 20765, 45401, 210312, 126673, -36667, -266056, -114347, 7902, -193858, -174609, 185761, -70524, -212987, -64043, -131569, 24741, 28168, -188413, -299639, -122666, -310764, -197348, -65290, -26522, -62988, -53488, -60545, 156424, 354145, 410251, 55734, -28478, 227441, 368870, 307020, 267702, 588404, 807541, 661952, 533238, 290679, 383729, 539287, 380075, 373641, 89029, -61664, -172193, -203568, -73993, 343401, 829775, 705503]
10868G05503l44010k01754Q3842j36999k64919q7888l7533j53865j2528K06656
10858b43495L1941J33923J8850M9063L5563K61898r8786j7927j38957j27700K1009
10847g4618R0445P1376J17413j70821J5617J90842j24202l17649J93255O8800
10837F0458j07322k24289n7480J83320k6041J83648O8478J27063j59262k07447
10827a58874P7347p9058j7178L3293J44505n6138P6569K49161p5461O1893J33008
10816C89067k48544m33432k33087j67842j352L19706L05002j85411J51812M19774
10806C15693r4340m39230q4152J76899R4370J12959j8986j79226j81466R666j02458
10795c90271q137J52837P1926j65959k38629J97388J12350r4850j31887K03070
$$ y = [705503, 361493, 159739, 243581, 106582, -158337, -246225, -283758, -437623, -450151, -243495, -211554, -77631, -58781, -9718, 25845, 287743, 188957, 171030, 32073, -95627, -74618, 15827, 87203, 204616, 33795, 49412, 240254, 116052, -201597, -8342, 60458, -46864, -271153, -328633, -145313, -171354, 12294, 80772, 207835, 48573, -158874, -81527, -160585, -177763, -144470, 35, -56103, 20466, 269627, 194166, 256059, 389067, 140523, -292909, -525996, -693838, -695190, -375484, -70482, -255893, -104081, 315693, 221353, -217877, -302029, -125130, -30760, 82199, 63213, -116013, -297479, -287813, -390271, -398408, -245571, -173645, -339604, -578233, -380845, -268495, -363345, -495232, -292162]
10785b92162M20837M28935k99237k54035q0682j61400L02481K63666j76986k56093
10775a04676r3182p3164J93611l5657k82119L9814k5773m6090K38615p2748k07038
10764d68407j5940N1323k19291J34929J86167R332L1059Q8888m5557R1876L13673
10753A58052L89062k05077k13967q7284J69888j31706j39378M2435R3602k06556
10743a30929j545J83911q3902l40615K21371K29558j22311j00009j30799K44053
10733c1217J55090P3134L83853Q4445k52406k7639k16784k65742J74164N0340
10723A27238l31029o9444K8756J2542j99472K31348K21585q8975J63795J56490
10713B52834N1591L0290J01210k74989k17969l83369o966o3314o4710j50113K26022
$$ y = [-292162, 128675, 557610, 258373, 4338, -76344, -237744, 64737, 328403, 151417, -104676, -197858, -271022, -77411, -113068, -395187, -355373, -381146, -427236, -188621, -261369, -468407, -484347, -433024, -652315, -517386, -331219, -321887, -290828, -201940, -247497, -155621, 158052, 547114, 342037, 128070, 40786, 210674, 78968, -60410, -17975, 75627, -130929, -132474, 51437, -32465, -373080, -151709, 77849, -44462, -144471, -275270, -31217, 123873, 197007, 580860, 665305, 412899, 385260, 168476, -97266, 76898, 127238, -203791, -273235, -244479, -231937, -431409, -200061, 21524, -67451, 96344, 252834, 304425, 334715, 435925, 160936, -57033, -440402, -447368, -510682, -575392, -725505, -499483]
10702d99483K85334M662K14745j81101m9729l6312J62808R1662j19966L3175k9892
10691a24097j2124k9646P8807K71240Q4136j58132j73022J44950N8595n1055J87697
10680B77349j68457k66913j42053k0676K11426Q6023j44330k01894j52510k64796
10670g86831k45684o239J94886j13276k61007J5209J82839K75366L25201J00026
10660c19510n0139j52284J18134K44957J8553j88315R6690K83935O6526o043K54290
10649C66794N38697J61446K29125K22239K16518l8345J10851R104o0188l06234
10639A450007k72737q0388k7232j9774j14519J69275K10735K70907q4050L92597
10629A894821P38505N05583O98419R46006P99143O36119M90806M36645P85609
$$ y = [-499483, -214149, -209487, 5258, -175843, -225572, -261884, -99076, -7414, -127380, -94205, -124097, -136221, -165867, -87060, 184180, 268316, 110184, -62838, 82112, 140707, 89652, 277349, 108892, -158021, -300074, -320750, -109324, -23301, -167631, -369525, -522035, -786831, -1032515, -1038754, -843868, -957144, -1218151, -1202942, -1020103, -744737, -419536, -319510, -369649, -521933, -403799, -158842, -140289, -328604, -231914, 52021, 118547, 112504, 366794, 905491, 1066937, 1296062, 1518301, 1734819, 1696474, 1807325, 1816429, 1756241, 1450007, 1177270, 1096882, 1069650, 1049876, 935357, 1104632, 1315367, 1586274, 1502224, 1894821, 2633326, 3138909, 3837328, 4783334, 5582477, 6218596, 6709402, 7146047, 7931656]
10620G931656O66918Q58782J847565K608134L654869M491652N708050P789058
10612C5556684J0264287J2361949J2810013J2270188J0912230R648728Q996756
10605A12820835P414436M827928K584486L256671Q025802J4596300J9972317K1912213
10597A95410988J9651734J6369130J4650478J2438551Q156845J73063o591924
10590B60258865o252457K129593J3607342K2099180K3985171K0254999J5510081
10583C51592774J2124305P906181n34595j3739781k5782314k6477990j7190065
10576B87898515n831144K610664N742252M462938K107730O12282k377290q687128
10568B86538819j7934778k4892957k4423149j7864628j1122754n892686l549939
$$ y = [7931656, 8598574, 9457356, 11304921, 13913055, 17567924, 22059576, 27767626, 35556684, 45820971, 58182920, 70992933, 83263121, 94175351, 103824079, 112820835, 120235271, 125063199, 127647685, 130904356, 138930158, 153526458, 173498775, 195410988, 215062722, 231431852, 246082330, 258520881, 266677726, 266850789, 260258865, 254006408, 256136001, 269743343, 291842523, 315827694, 336082693, 351592774, 363717079, 371623260, 371088665, 357348884, 331566570, 305088580, 287898515, 282067371, 284678035, 290420287, 294883225, 296990955, 297603237, 295225947, 286538819, 268604041, 243711084, 219287935, 201423307, 190300553, 184407867, 180857928]
10561A80857928l432337l864018m613223o411669q930877j2377705j4917467j4998620
10553A11312012j3172469j0523410p925402o264617n259766m347925l426399k853539
10545E7538485k876289k727835k464073k134213j838934j627611j728266j352482
10537D0788782j087095j238347j167759j135604j155287r59952q86682j159841
10529C1998215j073312o42163q73839p84541r44550q29627n84878o54379o73271
10520B4937655n10258o89040n78310o10435n48029n37849n22190p01150n51555
10511A9688839m92081n40722m54725n46168m29632l12569m81585l74889j66227
10502A5890241l33099l15678k98361n49307q63367m62818R478q9000l34966m04533
$$ y = [180857928, 177425591, 173561573, 168948350, 162536681, 153605804, 141228099, 126310632, 111312012, 98139543, 87616133, 79690731, 73426114, 68166348, 63818423, 60392024, 57538485, 54662196, 51934361, 49470288, 47336075, 45497141, 43869530, 42141264, 40788782, 39701687, 38463340, 37295581, 36159977, 35004690, 34044738, 33158056, 31998215, 30924903, 30282740, 29408901, 28624360, 27679810, 26850183, 26265305, 25610926, 24937655, 24427397, 23738357, 23160047, 22549612, 22001583, 21463734, 20941544, 20240394, 19688839, 19196758, 18656036, 18201311, 17655143, 17225511, 16912942, 16431357, 16056468, 15890241, 15557142, 15241464, 14943103, 14393796, 13530429, 13067611, 13077089, 12988089, 12653123, 12248590]
10492A2248590j43031l51661k06495m22127k10070l06742j85524j23295k66898
10483A0032747k02166j20902j70414j55831l12084k56172l0029m5847l9455n0248
10473H649599k91103j19362l2170p4323l17362l06275j68373j49587k50434m15121
10463F525489j05731r3995j20239J03624p9966j68512j22626J36605j84508j96263
10453E693878j97653j24261j93785n5719j23831k28024k003Q6617l98238n71959
10443C885022j8838O9276Q2290J00280j94036J29419J5549j24394M9291o2721
10433C931138j11922l64154k36075K37122K33381k8322r1949J05262k31547k29071
10423C213863j00824l29289k76897m4887J07293K77756O6997r8007r1920j59683
$$ y = [12248590, 12105559, 11753898, 11547403, 11125276, 10915206, 10608464, 10422940, 10299645, 10032747, 9830581, 9709679, 9539265, 9383434, 9071350, 8815178, 8785149, 8739302, 8699847, 8649599, 8358496, 8239134, 8206964, 8132641, 7815279, 7509004, 7340631, 7191044, 6940610, 6525489, 6419758, 6325763, 6205524, 6309148, 6229182, 6060670, 5938044, 6074649, 5890141, 5693878, 5496225, 5371964, 5178179, 5122460, 4998629, 4770605, 4768602, 4855219, 4456981, 3885022, 3866184, 3935460, 4017750, 4118030, 3923994, 4053413, 4068962, 3944568, 3993859, 3931138, 3819216, 3455062, 3218987, 3456109, 3689490, 3661168, 3569219, 3674481, 3442934, 3213863, 3113039, 2783750, 2506853, 2461966, 2569259, 2847015, 2914012, 2816005, 2724085, 2564402]
10413B564402m78577n3044J4970J88806j46366k53373r5537L23034p5874j89697
10403A798744L104K37790l262r160l16742k34321J23303J89493n6222P2836K75586
10392B081149r3950l06654l38108k37804K81678K9845L5208O8618m0725O0528
10382A539785J83784K69884J73228k59196l05537Q9239k32001O8071q0108K0970
10372A468119J58869j32978R961l53999k73995L0123L96053K34726m2098P2356
10362A567137J47544m7193j27610k29805j72949R7218O6539J38029k5189K84818
10352A698539O5714l97848j20617k67207j25496K6728j04229J05288K67717j20826
10342A027763K01254P4194j58860k38890r3697Q7135J25044q944M04394K09839
$$ y = [2564402, 2085825, 2032781, 2047751, 2236557, 2090191, 1836818, 1741281, 2064315, 1988441, 1798744, 1801848, 2039638, 2036376, 2027216, 1710474, 1476153, 1599456, 1788949, 1732727, 1805563, 2081149, 1987199, 1680545, 1342437, 1104633, 1386311, 1416156, 1451364, 1519982, 1479257, 1539785, 1723569, 1993453, 2166681, 1907485, 1601948, 1691187, 1459186, 1527257, 1447149, 1468119, 1626988, 1494010, 1503971, 1149972, 875977, 906100, 1302153, 1536879, 1494781, 1567137, 1714681, 1667488, 1539878, 1310073, 1137124, 1234342, 1300881, 1438910, 1413721, 1698539, 1764253, 1366405, 1245788, 978581, 853085, 879813, 775584, 880872, 1148589, 1027763, 1229017, 1303211, 1144351, 905461, 811764, 898899, 1023943, 1014999, 1419393, 1629232]
10332A629232j28463l56397J41758j1697O8142k7377m07190k24873K2721p9949
10322F25907K43010J69760J82722J78938k6196l37661l7922J69515k38510L7486
10312I67049q4607P0877l4682m7034R1410J38304L8817L4323k06216j55242j70505
10301F42494q9021M0034j8259M28147K36765r1568k19407o3577j98776k37056
10291D29776K79910M12562l67754m06862k52034K84961q8064M735K25273M6561
10281E69064k93485K11719L00781P8457J62206k43495l25995j41209M11503j8684
10271G10862l20269r3046O2353q6673N3340J95422J94903Q8489J91491r8993j67752
10260G30127J3061Q0829k04765m19143R3455L12196J83517M8295j63193j81291
$$ y = [1629232, 1500769, 1144372, 1286130, 1274433, 1342575, 1315198, 908008, 683135, 705856, 625907, 868917, 1038677, 1221399, 1400337, 1374141, 1036480, 998558, 1168073, 929563, 967049, 882442, 953319, 918637, 871603, 963013, 1101317, 1140134, 1174457, 968241, 812999, 642494, 553473, 593507, 575248, 1003395, 1240160, 1148592, 929185, 865608, 666832, 429776, 709686, 1122248, 754494, 347632, 95598, 380559, 292495, 297230, 522503, 569064, 275579, 487298, 788079, 866536, 1028742, 785247, 459252, 318043, 729546, 710862, 390593, 297547, 359900, 273227, 326567, 521989, 716892, 805381, 996872, 897879, 730127, 743188, 824017, 619252, 200109, 293564, 605760, 789277, 837572, 674379, 493088]
10250D93088j86007J5866Q6811k2181L2987m29669j00952J8979J35310M720J76916
10239B25868L0479J24613J78729M759j37035j86701Q1405j12466K60824q5445
10229C85030l1405J98896j7057k77237j41996J00213K24528J96172L049j67591
10219D72602q6699J33793O581O7370l38260j24581O4442J30217j35651j2444J51626
10208C28996J40576K22581L8080j80206k38631j15756J64585R1015J87809j78736
10198D60313j13780Q5263L30468q1599j73710r1533L00336O0912K5203m28711
10188C73162j87647j00487l4134M06602J8114k0580p0219O2185p842q484K66334
10177F97004O3289p3312j1004J88578K64499K1596n0103j2592k54875k43746R4268
$$ y = [493088, 307081, 322947, 409758, 387577, 420564, -9105, -110057, -91078, 44232, 48952, 225868, 256347, 380960, 559689, 564448, 427413, 240712, 322117, 209651, 470475, 385030, 353625, 552521, 535464, 258227, 116231, 216444, 440972, 637144, 640193, 472602, 385903, 519696, 526277, 593647, 255387, 130806, 195248, 325465, 189814, 177370, 328996, 469572, 692153, 730233, 550027, 311396, 195640, 360225, 451240, 639049, 460313, 346533, 431796, 762264, 680665, 506955, 415422, 715758, 776670, 801873, 373162, 185515, 85028, 50894, 457496, 475610, 455030, 384811, 446996, 439154, 430670, 697004, 760293, 686981, 675977, 864555, 1129054, 1150650, 1100547, 1087955, 833080, 589334, 683602]
10166F83602L15023K44966j24187l48203N0904J58700O3829K82236N28182J13855
10156A968907K11967n6561k50190k26917R3490M76358K34472J05138r5692K7096
10146B488068J94127l6216j7431K12839j23989k78601k25159k48942J71107j09551
10136B026252j59935o6003Q3622L8491k96371N5674J48759k47975l69496j02930
10126A110088J3199K65596o5633k9233J12546r8522k58608l57944l54053j55957
10116A81479L68428L76362l7923j80924R8336K56012K33911p9910j75441l8421
10106A001909j7975Q3651j72412n7042j22013q1423m3995L52589R085J18003M3929
10095A114306j45770k79402j11262j10955o2308k2701J20807j0589J07765J10938
$$ y = [683602, 998625, 1243591, 1119404, 771201, 822105, 980805, 1044634, 1326870, 1855052, 1968907, 2180874, 2124313, 1874123, 1647206, 1740696, 2217054, 2451526, 2556664, 2460972, 2488068, 2682195, 2645979, 2628548, 2841387, 2717398, 2438797, 2213638, 1964696, 2135803, 2026252, 1866317, 1800314, 1883936, 1922427, 1626056, 1681730, 1830489, 1582514, 1213018, 1110088, 1123287, 1388883, 1323250, 1294017, 1406563, 1308041, 1049433, 691489, 337436, 181479, 549907, 926269, 888346, 707422, 805758, 1061770, 1295681, 1215771, 1040330, 1001909, 983934, 1067585, 895173, 838131, 716118, 634695, 590700, 943289, 952374, 1070377, 1114306, 968536, 689134, 577872, 466917, 404609, 381908, 502715, 492126, 599891, 710829]
10085G10829j31203p1162K64492K5253k28698j80374l06538P5821J68289N489
10075C32198J01534K77501k71729r8261q7340L8272k154q3668j14699M47508R8770
10064F37932l90699p6879l2301J52230K72675J6152l51203o5234Q9427k10602
10054D1498J21006M71833k08298j07825J46536J42221k7425l06818M0200r9526
10044B13402j29337J30278K31245k36305O9416p7925k47908j73679L57213J26826
10034B63226K2861j07569j08770O8225n4136k64464j53528L15368L36665J48956
10024D66834j51173j76216j51984L5655K52080r4415j84374J87162K55652n4866
10014C84355j87085J39551K06530J87136M2124k14660l06835J6091K54570R4518
$$ y = [710829, 579626, 508464, 772956, 798209, 569511, 389137, 82599, 158420, 326709, 332198, 433732, 711233, 439504, 341243, 253903, 292175, 290021, 206353, 91654, 539162, 637932, 247233, 170354, 138053, 290283, 562958, 579110, 227907, 162673, 252100, 41498, 162504, 634337, 426039, 318214, 464750, 606971, 579546, 272728, 312928, 213402, 84065, 214343, 445588, 209283, 278699, 200774, -47134, -220813, 136400, 263226, 286087, 178518, 69748, 137973, 83837, -180627, -334155, -18787, 317878, 466834, 315661, 139445, -12539, 23116, 275196, 180781, -3593, 183569, 439221, 384355, 197270, 336821, 543351, 730487, 772611, 557951, 251116, 267207, 521777, 616295]
10004F16295j90990j46061r5117j52045R4081J58410J05904J72237K30329M3724
9994H36767l9129j59359k57395l06235O5466J14040J97499r2601j2324K3550L1125
9983D01404j40755J60594J63132r926J58401n0940k85814q0773k3789K47060J50685
9972F89279l14948j57077J35417J67885L37753J67856P5966k50412j62256r6079
9962E93384n6935L3967p8734r0828J86433J24732k43591r7931j77224J33704J5449
9951C42426J05474l4604J91351r5164l02107k21130R6114J57059N351N1571J15126
9940D11467r9656k33235K8107J89899k89079q9778P0879j41119J87581p4074j62753
9929b01761J60710K21373K2101L38696R4711j59266q2038j23206L2575L81285
$$ y = [616295, 425305, 279244, 184127, 32082, 126163, 284573, 390477, 562714, 793043, 836767, 797638, 638279, 380884, 74649, 140115, 254155, 451654, 359053, 346729, 370279, 401404, 260649, 421243, 584375, 574449, 732850, 681910, 396096, 315323, 291534, 538594, 689279, 374331, 217254, 352671, 520556, 858309, 1026165, 1102131, 851719, 689463, 593384, 536449, 570416, 491682, 400854, 587287, 712019, 468428, 370497, 193273, 326977, 342426, 447900, 413296, 604647, 509483, 207376, -13754, 82360, 239419, 244770, 296341, 411467, 311811, 78576, 106683, 296582, 7503, -82275, -11396, -152515, 35066, -39008, -201761, -41051, 180322, 202423, 541119, 635830, 476564, 394526, 271320, 303895, 685180]
9919F85180p8420j26666Q7348j44j54398j61796j77731O6893K1911M672K17727
9908C84576K3623l3310J32940j37084j76640j00236P9445j47904j30863J75095
9898F9642r1096K3500M00696J39944K6198j29574j971k25451n029J96098m7434
9887C55523j69513j38204M2448K1130J12225q2028K06766K0661o7179M5143l5617
9876C11355J07034L3260q1394m51093j94390J67580J41192l11477K45004M10562
9866C77633J35313j18046J34461o9386o8207N0958k27599J603j03815n5706J02099
9855A59308k1194o4586J19114M6448K34232J6766l12261l4299P0448p5405K95606
9844D34177K67848o9937j69390p3276L8675J24866k06689l9369j56713q3481k01202
$$ y = [685180, 606760, 480094, 567442, 567298, 412900, 251104, 73373, 140266, 162177, 166849, 384576, 408199, 374889, 507829, 370745, 194105, 93869, 173314, 25410, -105453, 69642, -21454, 2046, 402742, 542686, 568884, 439310, 437339, 211888, 206859, 402957, 355523, 186010, 47806, 90254, 111384, 223609, 141581, 348347, 369008, 301829, 346972, 311355, 418389, 451649, 370255, -80838, -275228, -107648, 33544, -277933, -32929, 377633, 512946, 394900, 529361, 459975, 391768, 442726, 215127, 216730, 112915, 57209, 159308, 138114, 73528, 192642, 239090, 473322, 490088, 177827, 143528, 213976, 138571, 434177, 702025, 632088, 462698, 389422, 428097, 552963, 346274, 306905, 150192, 66711, -134491]
9833a34491p3909M1936K08755K38829O0933j41380p8698J21184M01336J12858
9823G57353M9920j42817l02210O3727N5009j4804m92487J21350J02033r4412j15497
9812a2835K48803p2203j81439k9988K46659P2386k24161K9651J05184N3410Q8231
9801C23698J23580J44084K8838k94643o2906m492k74579J59628J40818J12656
9791C96682n8889K7390J8717k40793j98356m03046j85386J59821K79599J60975
9781d3286J37990k18975N9099J41340j02229J76328K02908r314N3129J21760j26565
9770C92185k02502m7520j41361J44695n8824l70759k38296J77612L63358P5367
9760I3955L9219j25819J57325J0350m2776j26911j11947o4555m0018P6742L54514
$$ y = [-134491, -208400, -166464, 42291, 281120, 342053, 200673, 121975, 243159, 644495, 757353, 807273, 664456, 362246, 425973, 480982, 466178, -26309, 95041, 197074, 102662, -12835, 235968, 163765, -17674, -47662, 198997, 271383, 47222, 76873, 182057, 235467, 323698, 447278, 591362, 620200, 325557, 262651, 258159, -16420, 143208, 284026, 396682, 337793, 365183, 383900, 143107, -55249, -458295, -643681, -483860, -204261, -43286, 94704, -124271, -65172, 76168, -26061, 150267, 353175, 343861, 396990, 518750, 392185, 189683, 142163, 802, 145497, 86673, -284086, -522382, -344770, 18588, 93955, 133174, 7355, 164680, 175030, 132254, 5343, -106604, -171159, -211177, -134435, 220079]
9749B20079q5044q9307k582L1611J02534k32897p9411O4368N2925L17433P4690
9738C74399r1882k50964j91376J32826o7117O0553L70170J15479j14890j47502
9728A89696j3388m5280l27500l25005R6328J55879K57406J92756m6370o589Q4646
9717B12579q2476Q9279K11529j23135M3588J68337M5072j78457k64839K01745
9707C23222k19186n43674L04016L08797O43773r0604l12847j01233R3635O5218
9697D71117J64686j24201l02205k75247j782j36933L8661J61821J32322j39846
9687a1607N5461J0879J20025j00920R8648K70715k04967J86756k354n7692q1299
9676B83645P1335J48336O9952j21273R642P3760p1869j80983J03006n9830J11787
$$ y = [220079, 135035, 45728, 43146, 74757, 177291, -55606, -135017, -70649, -17724, 299709, 374399, 282517, 31553, -159823, -26997, -94114, -33561, 336609, 452088, 337198, 189696, 176308, 131028, -196472, -521477, -425149, -269270, -11864, 180892, 134522, 127933, 212579, 130103, 219382, 430911, 307776, 351364, 519701, 564773, 386316, 121477, 323222, 104036, -439638, -135622, 173175, 816948, 726344, 413497, 312264, 405899, 471117, 635803, 511602, 209397, -65850, -67632, -204565, -165904, -4083, 128239, -11607, 43854, 54733, 174758, 73838, 172486, 443201, 238234, 424990, 422636, 364944, 283645, 354980, 503316, 573268, 451995, 461637, 535397, 463528, 282545, 385551, 325721, 437508]
9665D37508j32608q0233L20737m2528q9375j63705j85818K55452k0050K4114j5731
9654C07763k6032p139L1197L72132M8754l3578j57627J12547L57544j32177L1436
9643I04820Q0253j0155K78629n4526l50125k10688l50525j6424J70078j41056
9633C00281k09465r8779L24300K61991Q9411j19095j85190q2874k26526R4647
9623A48701K23508j91159J47441P6770J78671j2671R0650J5217o3775p1800k19837
9612C21716j30841J4153j67433l0071K66756k20074l54411J77858J65680k2268
9602B1065k54071N9296k38111M64187L87192J05847l06260j01598O3296j20721
9592H0122J85210J45906K66728q6395l01804j49335l43639M7923K86189J2818
$$ y = [437508, 304900, 224667, 545404, 502876, 413501, 249796, 63978, 319430, 299380, 323494, 307763, 281731, 274592, 305789, 677921, 726675, 693097, 535470, 648017, 1005561, 873384, 904820, 985073, 974918, 1253547, 1199021, 848896, 638208, 287683, 271259, 441337, 300281, 90816, -7963, 316337, 578328, 667739, 548644, 363454, 280580, 54054, 148701, 372209, 181050, 328491, 405261, 583932, 571261, 661911, 677128, 613353, 541553, 321716, 190875, 205028, 37595, 7524, 274280, 54206, -300205, -122347, 43333, 21065, -233006, -173710, -411821, 52366, 439558, 545405, 239145, 137547, 200843, 80122, 265332, 411238, 677966, 591571, 289767, 140432, -203207, -155284, 130905, 143723]
9582A43723N3276R8740q1937m42897o3560K95635P0819K41669j60021k91538j07747
9571b43838M3227R94K75803R3974L6173r4679j98624J71534L1558j02029j50118
9560a36025K1116J97127J85938Q8128j596K1574L16769p3655l87508j61523J6924
9549H7269J99172j66189q5118J68007q2258j70529K81632J22990M0860q4032m24991
9538a13187r4964J68657q4683K24729q0606J44065J7949l0211l8259J419k05174
9527i0265j62565L5343J73753J3543k18116K53707j01162j58104N852K83161L3685
9516F8832j36724M7054K39458j42809J0676n773j68902L6436j1553j55704p7811
9505b96820P1336k401m0981L86611q70j72561k0666J44912n4127M3287J57123
$$ y = [143723, 196999, 295739, 213802, -229095, -292655, 2980, 73799, 315468, 155447, -136091, -243838, -200611, -199617, 76186, 170160, 206333, 111654, -86970, 84564, 116122, 14093, -136025, -114909, 82218, 268156, 356284, 354688, 376262, 693031, 619376, 231868, 70345, 87269, 286441, 120252, 35134, 203141, 120883, -49646, 231986, 354976, 395836, 311804, -113187, -208151, -39494, -124177, 100552, 19946, 164011, 181960, 151749, 113490, 114909, -90265, -252830, -217487, -43734, -30191, -248307, 5400, -95762, -253866, -248014, 35147, 68832, -67892, -20838, 218620, 75811, 86487, 80714, -88188, -51752, -63305, -219009, -296820, -225484, -227885, -268866, 117745, 116875, -55686, -76352, 68560, 14433, 57720, 214843]
9494B14843K8314j56281j34120j92493k4650R2643J24409Q8526Q8813O4446j2842
9483A81608Q764j23014r0651J05662J27718j12239k84659n5409L1875m1701L38874
9472H6828M09110j59339k19230o9602k05500O7377J34273J08105O8301J3773O4399
9461B98495o0197k2328K35824K60385k3863k45144j138K1581j48319k72843k18739
9450a76286R4524k49160J28210R0099k35632p7513L08256J08435n6086k84381
9440c49534j37435J86670j82936N4237p75n7995K28806J99987L20219L52151j97929
9429D15466M1402j43551m80143j82658j709M20350J02231j28634K09734M9155
9419C01643n5982k09365j05309k67841q5836L32342K36953N6694j99402P9866
$$ y = [214843, 243157, 86876, -47244, -239737, -264387, -171744, -47335, 41191, 130004, 194450, 181608, 190372, 67358, -23293, 82369, 210087, 97848, -186811, -242220, -210345, -252046, 86828, 495938, 336599, 117369, 47767, -157733, -90356, 43917, 152022, 220323, 234096, 298495, 238298, 215970, 451794, 712179, 688316, 443172, 442034, 463615, 315296, 42453, -176286, -81762, -330922, -202712, -112613, -348245, -425758, -117502, -9067, -65153, -349534, -486969, -300299, -483235, -428998, -429773, -487768, -258962, -58975, 261244, 613395, 415466, 456868, 313317, -166826, -349484, -351193, 69157, 171388, 42754, 252488, 301643, 245661, 36296, -69013, -336854, -422690, -90348, 146605, 203299, 3897, 83763]
9409H3763M6047j1762j28851J29032K38724L1414k06347l96076J5035J68854J98898
9398A68731J5347j12577K89558k0589k74716j94640k1308m5690k38486m1932J32862
9387c43440K86634K11402j27732l37747K73879K27299l12059j11656K15093Q5544
9377F7217J49242k47979m1822M4978r3151J36423M6672J60767j13072N6278K86478
9366D52031j89086m03262j25708P0900L6661r4025l4156K0153P1688J26039q7536
9355a56301j20761N4569j51567J15849L14774K26235j41273n9569J37031Q436
9345B27423O2795K47606J18995j42014k10554k55874j91606M6467k55318J33385
9335b18695J3543J54305J8685j31971J89085j54821k84422J3231P2971M05428
$$ y = [83763, 129810, 118048, -10803, 118229, 356953, 388367, 182020, -214056, -199021, -30167, 168731, 184078, 71501, 361059, 340470, 65754, -128886, -150194, -195884, -434370, -476302, -343440, -56806, 154596, 26864, -310883, -37004, 190295, -121764, -233420, -18327, 67217, 216459, -31520, -73342, -28364, -121515, 14908, 61580, 222347, 109275, 165553, 452031, 262945, -140317, -266025, -195125, -158464, -252489, -286645, -266492, -194804, -68765, -156301, -277062, -222493, -374060, -258211, 56563, 282798, 141525, 81956, 218987, 227423, 290218, 537824, 656819, 514805, 304251, 48377, -143229, -96762, -352080, -218695, -205152, -50847, -32162, -164133, 24952, -129869, -414291, -401060, -328089, 77339]
9325G7339j35816k1721K67005K35323K07048j42363l19020l64583R0242K96273
9315A89727O5171j18150K78973o9731j27313m3006j36418j82052k77527p19M38333
9304A7288L22918j01408j57305N2080m7113j61522M1821J69999P2767K0889n6319
9293A74095j5417Q0926q5750J60021k006j55416K45042m1494r5742k72984M5106
9282C6381K24355p0355l13738k58848J70396R382J0796O4700J57343j93564j76442
9271c39594J28954R0643R3654J49021O9877j94665j940J89248Q3787q9047r515
9260A70423R8381j62126k32622K31739L20811J9602j51310j1278n0396j88396
9250D4828j47875J14248R5996N359Q7536j49261j47458j56081k0839n2498N2273
$$ y = [77339, -58477, -80198, 186807, 422130, 629178, 486815, 167795, -196788, -106546, 189727, 254898, 136748, 415721, 345990, 218677, 175671, 39253, -142799, -420326, -421045, 17288, 340206, 238798, 81493, 133573, 86460, -75062, -33241, 136758, 209525, 230414, 174095, 158678, 239604, 153854, 313875, 311869, 156453, 401495, 360001, 264259, -8725, 36381, 260736, 190381, -123357, -382205, -211809, -202427, -191631, -126931, 30412, -163152, -339594, -210640, -119997, -26343, 122678, 192555, -2110, -4050, 185198, 268985, 179938, 170423, 268804, 106678, -125944, 105795, 426606, 446208, 294898, 283620, 233224, 44828, -103047, 11201, 107197, 112556, 200092, 50831, -96627, -252708, -273547, -326045, -273772]
9239b73772P1224j77658n2722J19246K12147L67754K35116j08319P4829j94012
9229B73833j96662J83410J15312R4419l7448k27040q6187j86421L0458K91098
9219B54772J81816k34182J07524l97k40989j21253O170J41924l28983n5404K11116
9208g7886M21080J5515j66270O3134K0237l68682k13596J95410K45815k32416
9198i7659k73703j158J38089M06962N0534l7447k02113M9661J51002j20226j7394
9187D6548n5844K9836J67988q623k29386m0484k01450J6738j6879J51026K7848
9176a12682j4143O7465J67130K36250J21177j79809j25106k71580k82680j19382
9166e13360m8899j277J10480Q8025J98485J59282L05312L57829m31233j74995
$$ y = [-273772, -202548, -380206, -432928, -313682, -101535, 266219, 501335, 393016, 467845, 273833, 77171, 260581, 375893, 470312, 432864, 205824, 119637, -66784, -36326, 254772, 436588, 202406, 309930, 309533, 68544, -52709, -46539, 95385, -233598, -289002, -77886, 343194, 358709, 192439, 255573, 275810, -92872, -306468, -111058, 134757, -97659, -371362, -372520, -234431, 172531, 223065, 185618, -16495, 33166, 184168, 63942, 46548, -9296, 20540, 188528, 179905, -49481, -89965, -291415, -274677, -291556, -140530, -112682, -126825, -59360, 107770, 344020, 465197, 285388, 160282, -111298, -393978, -513360, -562259, -563536, -453056, -365031, -166546, -7264, 298048, 655877, 224644, 49649]
9156D9649j32244j53602P3894Q7316K37093J53976J03005n3699J59141L6783m50338
9145A10974j51630L0624N5633L62227O4015j55813k9908j60034p7024j07342J25535
9134F7257K29779k02960J22505j61370l54857j77775L12416n7771o9914L21602
9124B8912K7158k61166o6673L3413n7970J21632M9963K17074l3948j59322l63199
9113d64126J50204M16574o795j2406L1625K14151L0489J7053k4714m8856j67875
9102A35324k43671K69697R5609o135k28965j11966p9882m9175L7500m3942N2720
9091a72886R8681j36532P2853j69194q1101j00162L24345K72952K44587k37814
9081A15729k83750l55105K59380K51226Q747J9315k8187O4724o2002k85825J68354
$$ y = [49649, -82595, -236197, -162303, -74987, 162106, 316082, 419087, 365388, 524529, 561312, 110974, -40656, -10032, 45601, 407828, 471843, 316030, 286122, 126088, 49064, -58278, 67257, 297036, 94076, 216581, 55211, -299646, -477421, -165005, -222776, -292690, 28912, 56070, -205096, -271769, -238356, -296326, -174694, -124731, 92343, 58395, -100927, -464126, -313922, 102652, 95857, 83451, 115076, 329227, 359716, 376769, 352055, 303199, 135324, -108347, 161350, 256959, 250824, 21859, -90107, -169989, -219164, -181664, -225606, -172886, -74205, -210737, -137884, -307078, -388179, -488341, -163996, 108956, 353543, 115729, -168021, -523126, -263746, -12520, -3773, 15542, -12645, 52079, -9923, -295748, -127394]
9070a27394K06648k9658k16112m5718J29701O747n5262J1587k98228O6582J71891
9059a79216J78028j84556j35920P1041K42855J16521J64595k0242L6866k90274
9049c02j26469m3848r2110L66653p5139R4K0687k32436j41429L3457J37367j6510
9037a69985k0320K8884k1853m6760J56927J39117j85875L876J55556o3162j22435
9026a46030o8499P9146J05812K71833j9058k39718K27000J60683J36079k94549
9016B12699k60157R9462R5899j07973r7440j68122K8181K24018K41793j97525
9006G0835j82450K97367j44909k05409n481J93624P181K05600J72021k08113j83663
8995A6603J19380j99087l52150J21162L86927R7027L9744j10328j1957R285k28894
$$ y = [-127394, 79254, 49596, -166516, -212234, -82533, -75786, -131048, -119461, -417689, -351107, -179216, -1188, -185744, -321664, -250623, -7768, 108753, 273348, 253106, 289972, -302, -126771, -170619, -262729, 103924, 28785, 28879, 49566, -182870, -324299, -290842, -153475, -169985, -190305, -161421, -183274, -230034, -73107, 66010, -119865, -115989, 39567, -23595, -146030, -214529, -135383, -29571, 242262, 223204, -16514, 210486, 371169, 507248, 212699, -47458, 52004, 147903, 39930, -57510, -225632, -197451, 26567, 268360, 70835, -111615, 185752, 40843, -164566, -170047, 23577, 30758, 236358, 408379, 200266, 16603, 135983, -63104, -415254, -294092, 92835, 189862, 229606, 119278, 107321, 116606, -112288]
8984a12288j5402M01002K0345j42183N5285n0374N7611J08627j49370k3776N8661
8973B08138L5993J74191Q1821p4037l27330J34389k2097P8820o8079k24696p5775
8962g8662j7402M6759R5077j32509J02854j04616m96910L5411N85904J60751J16759
8951C13416J64037j78581j93386J00497L38277M3157j35095l71338j80025J66616
8941F7575j10287j64185j14816J62409j04252L3961K03005K67860k03654j79073
8931a41457j29055l4099p9301J01237K09668j73819M8204K09833j33145j97491
8921c19425R2321L11776J5914M9564l25125n2872L38647L82785j82380l95751
8911h4546j32327J54988N1837K7577j46675J75091L61455k73317O5161r7115k02954
$$ y = [-112288, -127690, 273312, 293657, 151474, 206759, 156385, 213996, 322623, 173253, 149477, 208138, 244131, 418322, 500143, 426106, 98776, 233165, 211068, 289888, 221809, -2887, -78662, -96064, -49305, 45772, -86737, 16117, -88499, -585409, -549998, 35906, 196657, 313416, 477453, 298872, 105486, 205983, 544260, 587417, 452322, 80984, -99041, 67575, -42712, -206897, -321713, -159304, -263556, -229595, -26590, 241270, 37616, -141457, -270512, -304611, -383912, -282675, -73007, -246826, -198622, 11211, -121934, -319425, -227104, 84672, 100586, 150150, -174975, -227847, 110800, 493585, 311205, -84546, -216873, -61885, -10048, 17529, -129146, 45945, 407400, 134083, 199244, 102129, -100825]
8900a00825j25854k18034q1011K34997M84584J70018n2629j06748o8876j53936
8890a8314K47452n4978n1014j10712j0863J45257k68148J67359J23008K8512p587
8879A89972N0682k4250J67215L95156R3577K3133J00824j81138r5804J22910j63448
8868F78829j51046P5352l22005k68758K59071k39085j21316J26744j05043m66610
8858e33867k7554L80182K55233J01787o9054j64324L0447O1123j04379j36504
8848b06910L82329K96464l8600L1025K00349j61393N8779P850k28936l55221m73559
8837d87823J79232L24710K52711j03880r5853J0735j04222r682j36005r1411O2974
8826a98514O7818J08342k4827r5688p5063R4596J53498J44559K94430K16622j981
$$ y = [-100825, -226679, -444713, -525724, -290727, 193857, 363875, 311246, 204498, 135622, -18314, 229138, 174160, 123146, 12434, 1571, 146828, -121320, 46039, 169047, 197559, 189972, 240654, 216404, 383619, 778775, 872352, 895485, 996309, 815171, 719367, 842277, 678829, 527783, 603135, 281130, 12372, 271443, 32358, -88958, 37786, -67257, -533867, -561421, -181239, 73994, 175781, 106727, -57597, -27150, 33973, -70406, -206910, 175419, 471883, 433283, 464308, 664657, 503264, 562043, 569893, 340957, -14264, -487823, -308591, 16119, 268830, 164950, 69097, 79832, -24390, -34072, -170077, -261488, -198514, -130696, -22354, -47181, -142869, -217932, -123336, 30162, 174721, 469151, 685773, 683792]
8815F83792R596j97816k63305k61997J43346K74922j37926J72585l4005J38748
8805E27940m04866j42527Q073k48340j42J63421K99706K09086q7548k52608j29513
8794e7318O4259j81516J37988O3660J37259l814j1108p3125j29015k31974J25171
8783a59533J97365Q4434k20484j9850K01915L7739k03860K25836L97604k78787
8773B62379p8833m2125J53723j24077l07516K4373K32423M074p591J8408P6386
8762B11624K08256k36009j64563j40025M3130K87959J38447q6329J25853Q9243
8752D77586o2686o579J4227m9407k8387j18136m7343P9856j80319j5522K89582
8741C52872O9769J0310J51088k65327l97719j46418K01041J53015l09623J3064
$$ y = [683792, 693388, 495572, 232267, -29730, 113616, 388538, 250612, 423197, 389192, 527940, 123074, -19453, -11380, -259720, -259862, -96441, 203265, 412351, 324803, 72195, -57318, 6941, -174575, -36587, 27073, 164332, 160518, 149410, 76285, -52730, -284704, -159533, 37832, 122266, -98218, -118068, 83847, 121586, -82274, 143562, 541166, 262379, 183546, 141421, 295144, 171067, -136449, -112076, 120347, 124421, 116830, 135238, 211624, 419880, 183871, 19308, -120717, -77587, 210372, 348819, 262490, 388343, 477586, 414900, 408321, 422548, 373141, 344754, 226618, 179275, 259131, 78812, 63290, 352872, 422641, 432951, 584039, 318712, -79007, -225425, -24384, 128631, -180992, -167928]
8731a67928p4785j41334L7498J74130K25968J40388L6687j64981j97702j33930
8721b65989J03617K84512j37541j72943J7743L51103L22320J36276k63406k93579
8711H2113j12936j37243J41324P3171O6400J92999L3309l8262o21Q4574j93013
8700A91815j60971J21509m3895P1505N7586J1964j90549j92442L0241J26720P3939
8689I7422l55J6573j38697K6907M5983j7370r0980k84759q9314K50369K01276
8678A7055n0349L20266k7773j72657r7898p4848r9366o1853J05094P0717k49567
8667c21179n1311K55888J85173j68659M0269Q4849N557o4568r8963j20575p9038
8656c32557K2629J82888m4491j22854P924J86394k733k1657J23366L8221L1611
$$ y = [-167928, -242713, -384047, -346549, -172419, 53549, 193937, 230624, 65643, -132059, -265989, -162372, 122140, -15401, -188344, -170601, 180502, 502822, 639098, 375692, 82113, -30823, -168066, -26742, 46429, 112829, 305828, 339137, 300875, 300254, 384828, 191815, 30844, 152353, 108458, 179963, 237549, 249513, 58964, -133478, -103237, 23483, 97422, 97067, 113640, -25057, 1850, 47833, 30463, -60517, -345276, -434590, -184221, 17055, -33294, 286972, 259199, 86542, -11356, -86204, -185570, -247423, -142329, -71612, -321179, -372490, -116602, 68571, -100088, -59819, 25030, 30587, -33981, -132944, -253519, -332557, -309928, -127040, -171531, -294385, -286461, -100067, -102800, -124457, -1091, 37130, 68741]
8645F8741J88444Q7684k78619J25687Q1059k2160j25074k96128j8756J75917O5391
8634E2186J0433j41749p2986N5686J09301j34212K8865J46316J08040J1583p6672
8623I6791m2513j99109K12740P7155L36N2905R8039P0830M1393J25328n4001k6448
8611D53446j56727l7526p2398j56592k08701p2824P4196J07016m2564k9724P2772
8600f9626J41576j77134K30663j05182m11935k10429J84084L30971O4637o8800
8590i1175m6940j06441j64147j41699P8579M7783R1468Q0794K15546P6638m9895
8579i489q4755P0250K07570o3138j72814j83882l2489j27187K42605J82344J3074
8568D2089k41778k5771K18552K53613J99725j82527k26741j80674k52457J42898
$$ y = [68741, 257185, 344869, 66250, 191937, 272996, 250836, 125762, -170366, -189122, -13205, 52186, 62619, -79130, -152116, -96430, 12871, -121341, -92476, 53840, 161880, 173463, 96791, 54278, -144831, 67909, 145064, 145400, 198305, 296344, 367174, 408567, 533895, 479894, 453446, 296719, 259193, 186795, 30203, -178498, -251322, -177126, -70110, -112674, -142398, -69626, 71950, -105184, 125479, 20297, -391638, -602067, -417983, -87012, -22375, -91175, -138115, -244556, -408703, -550402, -471823, -424040, -332572, -251778, -36232, 40406, -9489, -94244, -23994, 183576, 120438, -52376, -236258, -268747, -395934, -153329, 29015, 42089, -199689, -225460, -6908, 246705, 446430, 263903, 37162, -143512, -395969, -253071]
8558b53071K85605J53586J47959j10730l71214q5059J02111j35803O4837l8784
8548b40563K91798j13979L6945J58959L5976l52181L34021N1168k26281j80999
8538b05136L29338K46164k05450P7200K566o1218o2632K8449j60870J11011N835
8527A05257L4854j78591k67802J16144K27547J11771p1285J20891J35184J43799
8517D77769m01161j77354J23744p0119j84634q9178K9038j62327r6728P2419L47658
8506a30873J69596J1645m5545N1784O8044Q4921J80044m1587k34398l12876J48467
8495e0778n9567j58296P8282n3342L2589M42345j50570m54224k44653p4217K60016
8484d32415L20987O2298k6801L02978J72009p7875J05473K81866k73620m89222
$$ y = [-253071, 32534, 186120, 334079, 223349, -147865, -232924, -130813, -266616, -201779, -240563, 51235, -62744, -25799, 133160, 169136, -183045, 150976, 202144, -24137, -205136, 124202, 370366, 164916, 242116, 244682, 183464, 120832, 149281, -11589, 99422, 105257, 140111, -38480, -306282, -190138, 37409, 149180, 77895, 198786, 333970, 477769, 76608, -100746, 22998, -47121, -231755, -320933, -291895, -454222, -550950, -478531, -130873, 38723, 50368, 4823, 56607, 124651, 209572, 389616, 348029, 113631, -199245, -50778, -110345, -268641, -190359, -243701, -211112, 231233, 80663, -373561, -618214, -692431, -432415, -111428, -49130, -75931, 227047, 399056, 321181, 426654, 708520, 434900, -54322]
8474e4322k13490p4352J37135M3356K40551O1986j78597m8967R4924J53305j55535
8463E994m1619K7801R1892j63909k14401q7728J42510K35230J95412J34855p3805
8452B52232j93167J3767O5242L43392M6507k79740j46411J64031k62323L0548
8442C4078J77955N0124P7883k69292J06767J61864j65109k91120k3496J15558
8432b4788K51211J75723O0043L9410N5098j5596m47799J43282J04177k71731j27081
8421e8051K01900l6787O9013k10467K1553J47068K53464n9828r3692M87798j23908
8410E98063m49667j79347J17391k42427k29763m8615Q8861j11820j6527K16557
8400b57294J81313N6325j96693K69646M88321p0114k50739j82164l4745j58038
$$ y = [-54322, -267812, -342164, -205029, -161673, 78878, 140864, -37733, -86700, 8224, 161529, 5994, -35625, -7824, 84068, -79841, -294242, -381970, -239460, -4230, 191182, 326037, 252232, 59065, 72832, 138074, 481466, 527973, 248233, 101822, 265853, 3530, 34078, 212033, 262157, 340040, 70748, 177515, 339379, 174270, -116850, -140346, -24788, 226423, 402146, 462189, 501599, 556697, 541101, 93302, 236584, 340761, 69030, -58051, 143849, 107062, 176075, -34392, -12839, 134229, 387693, 327865, 234173, 721971, 598063, 148396, -30951, 86440, -155987, -385750, -434365, -345504, -457324, -473851, -257294, -75981, -19656, -216349, 53297, 541618, 471504, 220765, 38601, 3856, -154182]
8390a54182k82476J08858L83763L06476J55242k54464j55833K14053n3621k78703
8380a0887p3628J55656K03401L5134K9782k37408l10466m636l5828o5821k61336
8369e76037K5596P9751K30734L52979J49163j81795k1823k10558l24584j97085
8359f73659J27095L71970J22985j1154J74471J77674m1335j26705J27412K36651
8349D85405J1322k66629p8212j26648M768j11431j01441J40024j80616m2251K24547
8338d1162J67226J74212R9909q9708j88504m8141J7444N4708o8913k33463J5420
8327a40972j90781j40723J60535K40992J20343R3499q9034j83134l7043J56777
8317i541K20570l40519j48K23009j6720o3497K56174K08412k78211k79146m74845
$$ y = [-154182, -436658, -327800, 55963, 362439, 517681, 263217, 107384, 321437, 267816, -10887, -84515, 71141, 274542, 309676, 339458, 102050, -208416, -213052, -248880, -314701, -576037, -550441, -470690, -239956, 113023, 262186, 80391, 58568, -151990, -476574, -673659, -546564, -174594, -51609, -62763, 111708, 289382, 248047, 121342, 248754, 485405, 496727, 230098, 151886, 25238, 30006, -81425, -182866, -42842, -223458, -265709, -41162, 126064, 300276, 400185, 310477, 121973, 73832, 91276, 145984, 77071, -156392, -140972, -331753, -472476, -311941, -70949, 49394, 142893, 53859, -129275, -166318, -9541, 211029, -129490, -129638, 93371, 76651, 13154, 269328, 477740, 199529, -79617, -554462]
8306e54462j6190J70572L750L05433J30104k72598M9127j49574L8457J79815J47731
8295C2165M9440m50546K5320K58694J28540j56543q1087j36180k3045j62451L03668
8284b12025L98662j61265j66716O0889o020q967n3000N830M3235J1573l981k7604
8272a19389r1204J06961P5394j65675K22193J49235R5680j61116j56518K59045
8262B14606l2175J16440J5043l45866l31880K34581K68977k71717K4524K30968
8252A23501L15118m3623P6631J00347k56200n59502j52222J14098n6515J44035
8242a94332L55035J43747J05522k08977r0284J70335J20335k29997r0824J29132
8232B09692J75929K6390N21j39912O257L8662Q6722K28966m2160k39488p1961
$$ y = [-554462, -570652, -400080, -396330, -90897, 39207, -233391, -184264, -333838, -295381, -115566, 32165, 81605, -368941, -343621, -84927, 43613, -112930, -194017, -330197, -353242, -515693, -212025, 186637, 25372, -141344, -80455, -86475, -95442, -148442, -142612, -99377, -87804, -91785, -119389, -210593, -103632, -28238, -193913, 28280, 177515, 273195, 112079, -44439, 214606, 182431, 298871, 313914, -31952, -363832, -129251, 139726, -131991, -107467, 123501, 438619, 394996, 471627, 571974, 315774, -243728, -395950, -281852, -338367, -194332, 160703, 304450, 409972, 200995, 110711, 281046, 401381, 171384, 80560, 209692, 385621, 412011, 412532, 272620, 278877, 317539, 404261, 633227, 591067, 351579, 279618]
8221B79618K22243j12910k9730J04506j1225k88700J82096N222J3420l53349j91413
8210a80222K54604J1316R9593k363l418j50264n738k05323l983K7414P4531M6643
8198c7210L22159j96429L120n7220j018L25291j94205k2734J1245J795k79042
8187a24248n8246J6197K02824N653j29157J2618j22504k01486q3166j24243K73469
8176c32289J16113J93650J94322j83116k43880n6269L8765K10232L04283R4168
8166C35979l2571J6827l14235p1103j79781J4340O0919j59143m4969J99840K36235
8155F2338J12671q4271l6034r8010P5089j4363J22889J01448k60491j62040J0427
8144a70347K23204L24029J97288l02979r3032k29280j80535j49078Q230q6398
$$ y = [279618, 501861, 388951, 359221, 463727, 452502, 163802, 345898, 351120, 364540, 11191, -180222, 74382, 85698, 185291, 182928, 179510, 29246, 23508, -181815, -185798, -158384, -83853, -37210, 284949, 88520, 91640, 34420, 33402, 358693, 164488, 141754, 152999, 154794, -124248, -182494, -166297, 36527, 42180, -86977, -74359, -196863, -398349, -481515, -605758, -332289, -216176, -22526, 171796, -11320, -255200, -311469, -272704, -62472, 241811, 335979, 303408, 320235, 6000, -65103, -244884, -230544, -169625, -328768, -373737, -173897, 62338, 175009, 90738, 54704, -43306, 31783, 17420, 140309, 241757, -18734, -180774, -170347, 52857, 376886, 574174, 271195, 178163, -51117, -231652, -380730, -372500, -458898]
8134d58898J73096j65956j61576K41506K51261j97217P9738K01225K54681Q7329
8124C05189j22828r4252j39904o6868k0392K40487K22315k89375j30674j92066
8114b88368k26945j25857J39651j76856J46748L03612K53676n4686k2742j29271
8104a81038m8460J92123J15664j70897j39740K32870J84686P441M842J66814j10659
8093B53646o566k36071p166k79457K22367l5018J02669J6402n3576n7259k90247
8082c70276J93313K04913q500l52656l8191R7703j06863K1019q678J39003J27016
8071a02197j64485J6926R7860J23232j79254n4305P3493M516J0320j04600k7291
8060c05785j24243j67163R3799K27516K8829j50746J06028k2705J80565R159K02434
$$ y = [-458898, -285802, -451758, -613334, -371828, -120567, -317784, -238046, -36821, 217860, 305189, 182361, 88109, -51795, -118663, -139055, 101432, 323747, 34372, -96302, -288368, -515313, -641170, -501519, -678375, -531627, -228015, 25661, -29025, -51767, -181038, -229498, -37375, 78289, -92608, -232348, 522, 185208, 192649, 197491, 364305, 253646, 247080, 11009, 3843, -275614, -53247, -88265, 14404, 30806, -22770, -80029, -370276, -176963, 27950, 19450, -333206, -371397, -273694, -380557, -359538, -368216, -229213, -102197, -266682, -249756, -151896, -28664, -207918, -262223, -188730, -184214, -173894, -278494, -305785, -430028, -597191, -503392, -275876, -247047, -397793, -291765, -314470, -133905, -124746, 77688]
8049G7688R4664j79123N030P1947R3891j58143J4607j82367j1366J15157k88262
8038c46277j4855K49301q6551p4187N8410L85341O6262k30603k16315R9553M0019
8027f9902J5380J4469j01187j44554K26583K50447J9448N944j0537r1093q5388
8016B9610q1447j99666n7627l28812J04635M10052J98847k50122j13490K03995
8006h4025K03370k06693L8573N0715k03438k3841J46088K50903L9540l10385m6720
7995a45913j71411K04306J88275p860K26004K14561k359q5617R1198j18880j06862
7984B85442k52739m475j1211K0787M2090p3547L1196m8681k66157k3942J17870
7973a83367L34782k69018j54431K08947m4062j49511j10562J67158j68520K1464
$$ y = [77688, 172352, -6771, -1741, 70206, 164097, 5954, 20561, -161806, -173172, -58015, -346277, -361132, -111831, -198382, -272569, -214159, 171182, 237444, 6841, -209474, -109921, -69902, -54522, -40053, -141240, -285794, -59211, 191236, 210684, 216628, 206091, 114998, 29610, -51837, -251503, -309130, -637942, -533307, -123255, 75592, -174530, -288020, -84025, 119345, -87348, -48775, 1940, -201498, -225339, -79251, 171652, 211192, -99193, -145913, -317324, -113018, 75257, 67397, 293401, 507962, 505603, 419986, 511184, 392304, 285442, 32703, 28228, 17017, 37804, 79894, 6347, 37543, -11138, -277295, -301237, -183367, 151415, -117603, -272034, -63087, -107149, -256660, -367222, -200064, -368584, -347120]
7963c47120L03l9718K25764J24630p0310j41292l8512L32660j08001l8705j04135
7952b04436J39940K33245J05794k25707o7481k9807J87346j55600K0918m3990
7942c9778q8407o5938J26619m5196L28122J03792o1530j80035j87337k95280k64571
7931f69539r6689j1725J64714M04607R1976j32143J65449N6310J61667O2881j49375
7920D8133k47065k69039K50043J3916J60158J11662j70503L1145j59861j17974
7910c49385j3724j87827j51701Q9012L6241L42560Q1490J03935Q2595p9335j31092
7899a77231j11316j7665L0835Q1436K39494L23881n0989j94377M9375j28328l22022
7888b76907J31437K98734L73j30267j66785M8055K92060J02391R6449r4248k579
$$ y = [-347120, -346817, -386535, -160771, -36141, -106451, -247743, -286255, 46405, -61596, -100301, -204436, -64496, 168749, 274543, 48836, -18645, -48452, 138894, -16706, 4212, -39778, -128185, -194123, -67504, -112700, 215422, 319214, 257684, 77649, -109688, -404968, -669539, -766228, -777953, -613239, -208632, -116656, -248799, -83350, -27040, 134627, 197508, 48133, -198932, -467971, -217928, -204012, -43854, 67808, -102695, -71550, -231411, -349385, -363109, -550936, -702637, -613625, -577384, -234824, -153334, -49399, 33196, -46139, -177231, -288547, -306212, -275377, -193941, 45553, 369434, 318445, 124068, 173443, 45115, -276907, -145470, 153264, 153637, 23370, -143415, -95360, 196700, 299091, 395540, 301292, 298713]
7877B98713J61855q2014r930J29989Q906j59356l9968J71297k29556m10308m706
7866a65078L80365K12532k27125k05751Q0711j16581J26122L54879j00018k32687
7856A07369l35305p1940j92788k73667L05044M79637J82473j8322j04524J7181
7846I5158L1197j32198j6690k26971k42319L69175K58483J4511K16749j11309
7836B55786j24429k51792k12631J89391K04173k26509j78216K93618J81310K18883
7826C49584O8616l57539j13793R419j39786l3490L00978K28362j09381m27284
7816b24314J72934j60414o1316L60302K56175k88853r9786K40401K29057m6870
7806C77316Q444l23270p32R6313j13070p1481j48815m6505L3747l8807J62958
$$ y = [298713, 460568, 378554, 368624, 498613, 507519, 348163, 308195, 479492, 249936, -160372, -165078, 215287, 427819, 200694, -5057, 75654, -40927, 85195, 440074, 340056, 107369, -227936, -299876, -492664, -766331, -461287, 18350, 200823, 182501, 77977, 95158, 126355, -5843, -22533, -249504, -491823, -122648, 135835, 150346, 367095, 255786, 131357, -120435, -333066, -143675, 60498, -166011, -344227, -50609, 130701, 349584, 418200, 60661, -53132, -43713, -183499, -216989, 83989, 312351, 202970, -224314, -51380, -211794, -273110, 87192, 343367, 54514, -45272, 195129, 424186, 377316, 385760, 62490, 61758, 158071, 45001, -26480, -175295, -221800, -188053, -226860, -63902]
7795f3902L07764l3778j43766J92779K42913k46734L7116j63173k46946n3637
7785a71364M24352J00633j97145j34633J16558J40420J01960k04393J58478l7639
7775B97227r7168j69883l78923k9106J09093K41568M870k36342q4312K82615K32019
7764A71658J89697K38917j34430l67612k65957j4414j71331J2922L51674K44132
7754B55256k62848L4998J49372J07182P8968k35181j0890N1591P8334k32501j30605
7743a16324r8294j40830J53713K2445O6435l2154m2539L97254K37406J94474p5216
7732E66370j30015k05360j41264J00301J7488K46164n9376j45148J97438j62474
7722B84124J8052k49419q1723j0373j00498K8870J61374k97433k10802R1176Q676
$$ y = [-63902, 243862, 210084, 66318, 259097, 502010, 255276, 292392, 129219, -117727, -171364, 252988, 353621, 156476, 21843, 138401, 278821, 380781, 176388, 334866, 297227, 200059, 30176, -348747, -377853, -268760, -27192, -22322, -258664, -342976, -60361, 171658, 361355, 600272, 465842, 98230, -167727, -182141, -353472, -340550, 11124, 255256, -7592, 27406, 176778, 283960, 362928, 127747, 116857, 168448, 246782, 14281, -116324, -214618, -355448, -201735, -179290, -112855, -145009, -187548, 209706, 447112, 641586, 566370, 436355, 230995, 89731, 190032, 207520, 453684, 394308, 249160, 446598, 284124, 302176, 52757, -28966, -39339, -139837, -110967, 50407, -247026, -457828, -366652, -357976]
7711c57976K41516J73563k7099n3823P040L4864Q2565O6083J55194O6779j52564
7700B36142O1137j84804k5448J40467j06083J7382K69794L9937l56985k58585
7690a67046J51100K32119P3426P6541J83141l5184r0904M8692j82468j93758l5388
7679F0271Q5422j53471r5973r8694L01323m09012j06922L26966J17528J03016
7669A30454p6849k33158K0764l6818N4113j11638j96967J915m8120K33426L25639
7658F2761J12419k23338j12609K1835J85120K04202m37164l30854Q8434M95170
7648F5976K06647k62519k22868k42532J66685M44133R3867Q271j2860j15711k81633
7637a52544j32711l52437j55706R6572L70955L6771o883J30380Q8527K78736j7677
$$ y = [-357976, -116460, 57103, 30004, -23819, -16779, 18085, 100650, 166733, 321927, 388706, 236142, 297279, 112475, 87027, 227494, 121411, 138793, 408587, 448524, 91539, -167046, -15946, 216173, 289599, 366140, 549281, 514097, 423193, 471885, 289417, 95659, 60271, 145693, -7778, -103751, -202445, 98878, -310134, -417056, -90090, 27438, 130454, 53605, -179553, -158789, -195607, -141494, -253132, -450099, -448184, -496304, -262878, 62761, 175180, -48158, -160767, -138932, 46188, 250390, -186774, -517628, -429194, 65976, 272623, 10104, -212764, -455296, -288611, 155522, 249389, 257660, 244800, 129089, -152544, -285255, -637692, -793398, -696826, -325871, -289100, -295983, -165603, -77076, 201660, 183983]
7626A83983k1079r6340J42302j27280r7094k1028N9229R0441J06265j19444m9691
7615E0264l03279J52895L77172j07470j10691L7957k7236j13988j98535K22506
7605b0405Q3954j11538k22760M144Q6841J60272J13190Q0067k9706R1303K39687
7594D75049j24089m664k56406k63885J18746j47144k18234o4846P3170K89340
7584a22963J17199J66326K4165L9237j13002l2953J30116J1491r0118k41900m84429
7573e96831k03727M34116M99283K4768l68360o4846j03339L02515P2696m11909
7563d15634r9519J58069j6243M2705n5238P0096J39824J68853K49914j87826N4282
7552A09283N3101M9044J62517k79607j48317N879L41480p5102r7048m3523M4988
$$ y = [183983, 162904, 66564, 208866, 81586, -15508, -36536, 22693, 113134, 219399, 99955, 50264, -253015, -100120, 277052, 169582, 58891, 96848, 69612, -44376, -242911, -20405, 63549, -47989, -270749, -266605, -179764, -19492, 93698, 173765, 144059, 235362, 475049, 350960, 346296, 89890, -173995, -55249, -202393, -420627, -485473, -412303, -122963, -5764, 160562, 184727, 223964, 110962, 78009, 208125, 219616, 129498, -112402, -596831, -800558, -366442, 132841, 157609, -210751, -275597, -378936, -76421, -3725, -415634, -515153, -357084, -373327, -330622, -385860, -315764, -175940, -7087, 242827, 55001, 109283, 162384, 211428, 373945, 94338, -53979, -48100, 293380, 218278, 121230, 77707, 122695]
7541A22695j30697k35779J47358k295n9992j49081M2846K448J05119J30776q5097
7530a11699M833k17345J57669L99520K40128j58886l87571j22863q7220J02587
7520a80847l1924j61313J2257m852n9864J77879J43762K8526p8674K55674J74570
7509B75194q2284Q6807q0328m9266J74270N5302j0663K0422j71434k88758k54692
7498c25430J11404J4250L41029N9170j67099k21654k2875J35334M1602R1525O7397
7487A24653k67096R2487P2619j02844J38978k3314j6466k07950j2551p9240K81672
7476I48O1394j55386j01263J82601L7223J86227J98572k22097q3188K07244N5923
7465C68198N1459k06324k21391o0047J77606n5998J08R5432j75129k59265j11962
$$ y = [122695, -8002, -243781, -96423, -98718, -158710, -307791, -264945, -262497, -157378, -26602, -111699, -106866, -324211, -166542, 232978, 473106, 314220, -73351, -196214, -283434, -180847, -212771, -374084, -361827, -366679, -426543, -248664, -104902, -76376, -155050, 100624, 275194, 192910, 279717, 199389, 150123, 324393, 379695, 369032, 389454, 218020, -70738, -325430, -214026, -199776, 141253, 200423, 33324, -188330, -211205, -75871, -34269, 57256, 124653, -142443, -49956, 22663, -80181, 58797, 35483, 19017, -188933, -201484, -280724, 948, 62342, -93044, -194307, -11706, 25517, 211744, 410316, 188219, 105031, 312275, 368198, 419657, 213333, -8058, -68105, 109501, 53503, 53611, 149043, -26086, -285351, -397313]
7454c97313J82631j95585j09580l2141k24275J61685K00547K71521r1646k0959
7444b55115n4097P6831p4122J13918O5274J00790l9460L82055m8426j65389l95041
7433b92782K29535R5001j51425k9335P5127k8986q5286J16793J68740p8543k08449
7422a89610J99273K25239j82618P2966J77759k06756R3955M39855J12113n11543
7412B30633l04078J07580j26806K7791L41350K84181L0749l69431n3396p6016
7402I2557L5363q7239l41285j28544J14525K27864j7956k2619j14149l9730L06526
7391B5313J3196J47224M7541j39489k41684K43134J86181Q3755j3931j64175j85424
7380A641q282K21413J44749J14776j63441k86881K31650Q3151j89921Q038J5815
$$ y = [-397313, -214682, -410267, -519847, -551988, -776263, -614578, -414031, -142510, -234156, -255115, -309212, -232381, -306503, -192585, -127311, -26521, -65981, 316074, 267648, 102259, -292782, -63247, 31754, -119671, -149006, -73879, -102865, -188151, -71358, 97382, 18839, -189610, 9663, 234902, 52284, 125250, 303009, 96253, 190208, 630063, 742176, 230633, -73445, 34135, -92671, -64880, 276470, 560651, 591400, 221969, 168573, 92557, 127920, 40681, -300604, -429148, -314623, -86759, -104715, -127334, -241483, -281213, 25313, 38509, 185733, 233274, 93785, -147899, 95235, 281416, 365171, 351240, 187065, 1641, -6641, 214772, 359521, 474297, 310856, 23975, 255625, 338776, 148855, 156893, 172708]
7369A72708k21342k44259k05397J84761J87194n4252J99823k6724j26785k66351
7359d00624j30638K35194j6630K88360M24564L0431j89252l66064j65422o195
7349b96276J24155L92929J97480k9911l29748j38258j62082j58904j51464j34592
7339f86671J70626O80613n6243k37836N0236J91073n1220P5264k3460j60855L71277
7328C22804P6392j22711q35J46924j41904j91026o8470R8931l4793j58331j30749
7317b03768k1330K24288P1822p2657j23902n2791j70015k09923j44907K1824j05833
7306g87192J2014j32795l0595K15948M63030j91089Q7471J52470N3739l26068
7296d83067l0018J89061K18696j78002j54571Q7089R0406O9634J67582j15188
$$ y = [172708, -48634, -292893, -498290, -313529, -126335, -180587, 19236, -7488, -134273, -400624, -531262, -296068, -312698, -24338, 400226, 430657, 241405, -124659, -290081, -296276, -172121, 220808, 418288, 388377, 58629, -79629, -241711, -400615, -552079, -686671, -516045, 164568, 108325, -129511, -79275, 111798, 60578, 135842, 112382, -48473, 322804, 399196, 276485, 275650, 422574, 280670, 89644, 21174, 120105, 85312, -73019, -203768, -225098, -810, 71012, -1645, -125547, -178338, -348353, -558276, -703183, -681359, -787192, -775178, -907973, -938568, -722620, -259590, -450679, -363208, -210738, -156999, -483067, -513085, -324024, -105328, -283330, -437901, -350812, -260406, -190772, -23190, -138378]
7286a38378o1182R8641R8606K47868K70728k7566k0968m2248l11915j81951R606
7275e8759L7466L54247K77869l13955j16696k8059k74062J52412L6340k61768
7265a94965j56105J23583K51765K13259k09523q2555J35673k7509J24643O5720
7255B43986K4848j21751k71777j21799q1717m0869J45404n6561m5956j20062K47061
7244a99193R4801j8313j99973j48320J71323K3783J11439J34799j34414k31112
7234c95180j12381J40349K34475O7931k37446m3813O9282M7498j7939J10695K10478
7223G3949j29106P5584L2581L157l07577l0878K41002K46318K45119N9313r6003
7212D13459n1069j68288n6541N2234j61944k20723n9964J06669J1133q5760L96893
$$ y = [-138378, -199560, -100919, -2313, 245555, 516283, 488717, 467749, 425501, 113586, -68365, -58759, -21293, 332954, 610823, 296868, 180172, 152113, -121949, 30463, 66803, -194965, -351070, -227487, 24278, 237537, 28014, -54541, 81132, 53623, 178266, 243986, 268834, 147083, -124694, -246493, -328210, -369079, -223675, -280236, -326192, -446254, -199193, -104392, -122705, -322678, -470998, -299675, -275892, -164453, -29654, -164068, -395180, -507561, -367212, -132737, -64806, -302252, -346065, -276783, -229285, -247224, -136529, 73949, -55157, 20427, 53008, 56165, -251412, -282290, -41288, 205030, 450149, 509462, 413459, 362390, 194102, 137561, 189795, 27851, -192872, -252836, -146167, -135034, -220794, 176099]
7201A76099K97383l01170j51854p928k58379J4703K74430M7221p5738k30230p2399
7190b87862Q8232P8107O9568J22555j25113j10377K07910N4544j22168n1739O8834
7179g509J96448r0779m2695j75042j6968L6826p506J42167J63886J6439j52588
7168F2679j64131K67913K21151j89001l20505l51807J80540J33734J5270J30295
7158a3862L03656K32093j65398o0443K47875m13K772N5525N918J07152l41189
7147C73686k32219q0266n1497M4161j03244n272J0144K55308m7927j554l5987
7136A25333j09867j97999k08380L0422L16025K3484j38503j9916k0462r9490L20804
7125B1451O1532k01176j02969K82594k04088r2521J74764j22156r1394M1787J22796
$$ y = [176099, 473482, 172312, 20458, 12530, -245849, -231146, 43284, 90505, 14767, -215463, -287862, -199630, -121523, -51955, 70600, -54513, -164890, 43020, 97564, -24604, -76343, -7509, 188939, 98160, 55465, -119577, -136545, -99719, -107225, 34942, 198828, 215267, 62679, -101452, 166461, 387612, 198611, -121894, -473701, -293161, -159427, -144157, -13862, 289794, 521887, 356489, 296046, 543921, 543508, 546280, 601805, 607723, 714875, 373686, 141467, 61201, 9704, 53865, -49379, -54651, -44507, 210801, 162874, 161320, 125333, 15466, -182533, -390913, -360491, -44466, -20982, -159485, -179401, -199863, -299353, 21451, 82983, -118193, -221162, 61432, -142656, -235177, -60413, -182569, -273963, -232176, -109380]
7114a09380m2320J17708J26678J37055j18545j87124Q9875K79657J07046k11341
7104A89309m7960N1356j15336m75106j88635J57255r4251M0459K26728m80K6871
7093b29790J25904N5883j94984l04509K1361J55785Q9974J8404k9222k28854Q9201
7082d30847j7683J80611K2486j29842o6068K51656l6947J38775K0130r5002q4510
7071b47241R0032J53452J66212Q6233p1805j67915N1365p010k10227k85063j46410
7060e88377J2542K70089J51291l13115P6253J80195N3214j70163l0325k7077K26093
7049a59380K73193j11699l20718K33296K78003q0755o0146m1186J4339p9025J42216
7038H8138j33699o2021M6351P7841j26779l1947o8874j40954J61474N0646o1434
$$ y = [-109380, -151700, -33992, 92686, 229741, 111196, -75928, 13947, 293604, 400650, 189309, 141349, 192705, 77369, -397737, -586372, -429117, -523368, -482909, -256181, -256661, -229790, -103886, -48003, -242987, -547496, -526135, -370350, -280376, -261972, -291194, -520048, -430847, -448530, -267919, -245433, -375275, -441343, -189687, -226634, -87859, -67729, -162731, -247241, -157209, -3757, 162455, 248688, 176883, 8968, 60333, 53323, -156904, -441967, -588377, -575835, -305746, -154455, -467570, -391317, -211122, -157908, -328071, -358396, -385473, -159380, 113813, 2114, -318604, -85308, 192695, 111940, 51794, 10608, 24947, -54078, 88138, -45561, -107582, -61231, 16610, -110169, -142116, -210990, -351944, -190470, -139824, -201258]
7027b01258j0354K47212K66857L3632K38143Q513l15508j64365J53822K40669
7017D97363l8339n5326o911k81214j14038R2105k87617l55005M730R6324J35038
7006c12890J78344P6884J29893J31389j55867K33279n658j78926n485j42310q3237
6995a34584K75858O7842j69496p4579j2665O6158J57506K43893L57551j05717
6985F71767j63411j38585k66061j65129k608j9860J23781K3929k13584M7288Q6963
6974a5510n2026k89k67513j88423Q4190L60477J28344K52442J04489k47912k89194
6963a30925k89907Q335J55845j1659K16318R6635k48684j42098J90762J18570
6953c6808j61648J39129O6952m4365K8464k3836R8708J83257J9733j60336J9761
$$ y = [-201258, -211612, 35600, 302457, 336089, 574232, 582745, 267237, 102872, 256694, 497363, 459024, 403698, 396787, 115573, 1535, 93640, -193977, -548982, -544252, -447928, -312890, -134546, -57662, 72231, 203620, 47753, 281032, 275374, 96448, 90963, -51347, -134584, 141274, 209116, 39620, -34959, -47624, 18534, 176040, 419933, 777484, 671767, 508356, 369771, 103710, -61419, -64027, -83887, 39894, 63823, -149761, -102473, -15510, -67536, -67825, -335338, -523761, -439571, -79094, 49250, 301692, 406181, 158269, -130925, -420832, -412497, -256652, -268311, -51993, 44642, -204042, -346140, -155378, -36808, -198456, -59327, 7625, -36740, -8276, -32112, 66596, 249853, 269586, 109250, 129011]
6942A29011j44834N5989J15518l0544j92232O8670K51095q3106k48882J47103
6932F7788P9354J79788J37820J43487o337l21059q1448m243l8887J14039j00064
6921A70238k41741j05710M0808O745j42289m3078j65375J58136o1477k74837q3483
6910g42063p0158J95217K87108J02703J2374K03682j32551k11090J48383q3467
6900b89862m56430n8510J23116J12874J67580J54306P9921K51571Q5850Q310p6416
6889A02310r2664k55628L2757K88401Q520k36007j85347L7378N5973L46129j04990
6878c168j48551k6837P5256k18518K2313k8716J90175K0148O2954j02221o0722
6867b17887j28517L10015L33759o424J444l70114k51288n9107J01952J80303M0885
$$ y = [129011, -15823, 40166, 155684, 125140, -67092, 1578, 252673, 169567, -79315, 67788, 147142, 326930, 464750, 608237, 601900, 280841, 199393, 195150, 156263, 270302, 170238, -71503, -177213, -136405, -129660, -271949, -315027, -480402, -322266, -383743, -658580, -742063, -812221, -617004, -329896, -227193, -214819, -11137, -143688, -354778, -206395, -289862, -746292, -804802, -681686, -568812, -401232, -246926, -167005, 84566, 170416, 178726, 102310, 9646, -245982, -213225, 75176, 83696, -152311, -337658, -300280, -244307, 101822, -3168, -151719, -178556, -103300, -321818, -299505, -328221, -138046, -117898, -54944, -157165, -217887, -346404, -36389, 297370, 290946, 292390, -77724, -329012, -388119, -286167, -105864, -64979]
6856f4979m0570j89598j69860L14545k8870K3207M3040J99130P9715p8269q6928
6845E63k25066j84984K29338j86701M2995J34188J39031J64845K70040P5874k22114
6834B38009n8042j60168Q7485J30787J3602K17834M15077j86122k15535k6650
6824D56277m21308k24681j60061P0639J48237j70703J09321J30423K54719n0333
6814A42530l51957R87J90731j25251J04493J22368N5911k68245K87670K66023
6804D25260n1399l41814j50438j26042j31985K16533K4388n9801M6865J06497
6794d1936j45629k02892R1537J08831j366K70569j32273j1109N79350J07066m16595
6783B05553m68387J15101j8458K00689J23797n1612l33116k28489m8949K27656
$$ y = [-64979, -105549, -295147, -465007, -150462, -179332, -156125, -113085, 86045, 165760, 87491, 563, -224503, -409487, -180149, -366850, -323855, -189667, -50636, 114209, 384249, 460123, 238009, 179967, 19799, 107284, 238071, 251673, 469507, 884584, 698462, 482927, 456277, 34969, -189712, -349773, -279134, -130897, -301600, -192279, -61856, 192863, 142530, -209427, -208440, -17709, -142960, -38467, 83901, 139812, -128433, 159237, 425260, 373861, 32047, -118391, -244433, -376418, -159885, -135497, -195298, -148433, -41936, -187565, -390457, -298920, -190089, -191455, 79114, -53159, -64268, 515082, 622148, 205553, -262834, -147733, -166191, 34498, 158295, 106683, -226433, -454922, -503871, -276215]
6773b76215J39500j6811j04487J82664K84214j78091k54526M7777j7606l4886
6763b28467k25297J08052R3770K11j66816j94965J98722J46434R9747r5344K14552
6752d9401J998k64470J5304L4894N8465J55315J18949O2383Q4852J84362K5454
6741D28105n8623k44949r208l3598N217k71041K6180K2397J20753L0925j72484
6730a56326M2413Q6827R3979K5392J28715O768l1034k34764l54504n0728m7684
6719d90946K3584O8351M02571J69299K985J74813P9832Q635M4426j72020k0678
6708B90852j43644l55110j58235K48504J0113J7854J7298p3802J53693L1786L5469
6697G4778m87108j73277K92221K73162n9511q8190j6406J34428K49902J89548
$$ y = [-276215, -136715, -153526, -258013, -75349, 208865, 30774, -223752, -175975, -193581, -228467, -453764, -345712, -251942, -251731, -418547, -613512, -414790, -268356, -168609, -263953, -49401, -47403, -311873, -296569, -261675, -203210, -47895, 71054, 133437, 218289, 402651, 428105, 369482, 124533, 115325, 81727, 86944, -184097, -157917, -135520, -14767, 16158, -156326, -113913, -27086, 66893, 92285, 221000, 227768, 196734, -38030, -392534, -443262, -490946, -467362, -399011, 3560, 172859, 175844, 350657, 430489, 439124, 483550, 311530, 290852, 147208, -207902, -366137, -117633, -107520, -89666, -72368, -146170, 7523, 39309, 74778, -412330, -585607, -293386, -20224, -79735, -167925, -184331, -49903, 199999, 389547]
6687C89547j14716p2741K62886p0483k92429l2289j03655J58559P8138k66967
6677f4150j0220K7982o305O2255l2462p2857P3152j39268M7631L39490J31469
6666C56717o0350r3507n3029k01671J83622N7234j38882r9273J43894L28313O4378
6655D87446m60271k33944P9744J23482j08580o6789K54448P0872o2681P6767k36879
6644g6385l40637j9505J357K08710R2631j06362M3861M8625k7202q1781N2891
6633b03797M34838J37457j83449m16283p3838O0523k53333K2120L11268L4569
6623a29925J43486J48623k51422j33638K33032P5823M3476j5448k03577P67L42109
6612B53306j82728l2008O547j52015L7307P4068j3632J51158K79230Q7613J00604
$$ y = [389547, 274831, 202090, 464976, 394493, 102064, 69775, -33880, 124679, 202817, -64150, -74370, -46388, -52693, 9562, -22900, -95757, -22605, -161873, -114242, 225248, 356717, 296367, 202860, 149831, -51840, 131782, 189016, 50134, -49139, 94755, 423068, 487446, 27175, -206769, -127025, -3543, -112123, -178912, 75536, 146408, 83727, 160494, -76385, -417022, -436527, -435170, -226460, -133829, -240191, -196330, -147705, -174907, -256688, -203797, 231041, 368498, 185049, -231234, -305072, -244549, -497882, -475762, -164494, -129925, 13561, 162184, -89238, -222876, 10156, 85979, 129455, 114007, -89570, -88803, 253306, 70578, 38570, 45117, -106898, -69591, 4477, -9155, 142003, 421233, 508846, 609450]
6601F09450j98777k21316r0831N2741m5015m6631j45477k0749j02590O0737K38141
6590H9683J98074q2641l63747k395J65918q9589J21504K21230k39968k29919J06255
6579a05595J05657j32182k61110k64843r8176J64500J20903p2207M25928K07311
6569I0186k46061k94920J76298L60495M2721p6654j22169K64874k2321j08449
6559F4000k711j08377p7226j14557j67120Q7629J58366p646m00430Q7082N0331
6548d30659N0186J65877j4692l1445R3341m5018K24721O1126N4042K46323l11095
6537F2707l93851j71013J05428M08776J2690l1830p9267p3896r7500N3682J68200
6526c5874Q7539J07056j87089k34698J46619J20513k49015r2227p979K19283P5011
$$ y = [609450, 410673, 189357, 98526, 151267, 106252, 59621, -85856, -106605, -209195, -148458, 89683, 287757, 205116, -158631, -161026, 4892, -84697, 36807, 258037, 18069, -211850, -105595, 62, -132120, -393230, -658073, -756249, -591749, -470846, -543053, -117125, 90186, -155875, -450795, -274497, 85998, 128719, 52065, -70104, 194770, 172449, 64000, 61289, -47088, -124314, -238871, -405991, -318362, -159996, -167642, -568072, -480990, -430659, -380473, -214596, -229288, -260733, -167392, -212410, 12311, 73437, 127479, 373802, 62707, -331144, -502157, -396729, 12047, 24737, -7093, -86360, -160256, -257756, -204074, -35874, 51665, 158721, -28368, -263066, -116447, 4066, -244949, -337176, -345155, -125872, -50861]
6515e0861R1072J774k9010l13845l03633m0947K90513L18368j81354j23117P7191
6504b63849K7363n46J18316J07524k4198j10564j05528k25342j85277J28901K24866
6493c08334j5993n5914j25405p2923N00020J73522r4575N2558j84767j20068K31940
6482a9939j08039L3146M60398k22761l9835J50188j10603j51851R3316J41755
6472B25775k20469k41614j62800j28328J48131K59447l6592J06744M2178j227
6462h755R8568J12006L50616N1213j73540m01299m81214N9322K01097J50096o815
6451d8705L30330j75214J3756O2907j83197n0549k32409J42306K29745m6418k65074
6440b22522R8566j17735o4678m1358j2107K77876Q5603l5139J95584K09190J35209
$$ y = [-50861, 40211, 41985, 12975, -300870, -604503, -645450, -354937, -36569, -217923, -341040, -263849, -236486, -237032, -118716, -11192, -35390, -145954, -251482, -476824, -662101, -533200, -308334, -324327, -380241, -505646, -578569, -78549, 94973, 398, 52956, -131811, -251879, -19939, -127978, -94832, 365566, 142805, 102970, 253158, 142555, -9296, 84020, 225775, 5306, -236308, -399108, -527436, -379305, -119858, -156450, -49706, -7528, -8755, 89813, 201819, 552435, 603648, 430108, 28809, -452405, -393083, -191986, -41890, -48705, 281625, 106411, 120167, 183074, -123, -50672, -283081, -140775, 88970, 42552, -222522, -123956, -241691, -306369, -347727, -359834, -81958, 3645, -31494, 164090, 373280, 508489]
6429E08489l35185k61903k3656K04991k79844k62605K15666J02860M00577J06604
6419C75994j77405j79715k39959K65917K97386o8733P1208k85085Q83K10562j10533
6408A60520j95302o8270M5838J79301J93863n7429P2659n8256K25982K11221j48726
6397E61401k05822j22126l32253M9522l5023J10291P7766r5898L6076J53102L4795
6386B31831p3126l02920K2345j62155r8372o9029P1759Q3045k25353q389K43952
6375b86412K82485O5221l29829j5296j53386j4589M86652K13507j15214o9987
6365F3152k48003N8549J04663q6915l9591o5389O6228q8362Q1236J74102K20609
6354B40279L42752N1868j10913r3696Q9961n8624j29818j06255k79195J35400
$$ y = [508489, 173304, -88599, -112255, 92736, -187108, -449713, -234047, -131187, 269390, 375994, 198589, 18874, -221085, 44832, 342218, 273485, 344693, 59608, 60491, 271053, 160520, -34782, -103052, -57214, 122087, 315950, 258521, 331180, 272924, 498906, 710127, 561401, 355579, 233453, -98800, -49278, -84301, 25990, 103756, 7858, 43934, 197036, 231831, 158705, -144215, -121870, -284025, -382397, -451426, -379667, -296622, -521975, -530364, -286412, -3927, 61294, -268535, -283831, -437217, -451806, 34846, 248353, 133139, 63152, -184851, -126302, -21639, -108554, -148145, -213534, -147306, -235668, -154432, 19670, 240279, 583031, 634899, 523986, 430290, 520251, 461627, 331809, 225554, -53641, 81759]
6344H1759M6559k08901k44497Q1961M1697K24165K13475r8656j69926j2674k43190
6333b88228N0791L83203K4014R386j34057j13771k69294J31057K35481M25650
6323D54232J57577p3883l00547k8655j6928n1350K6767J93050j31078j0841J7409
6312B35753j24848K65090J12612n4390j02053r1338n5889L5553j04757o7735j45345
6301i7347k13640J12716j17717k2593j06390K35983K00949k06884j39544k09100
6291e63567j30320j05437q7236M2267o7098K07382j69782N5200N56230J54400
6281a07961J28943K74395L61024L969k32503j93699j32665k08256o3837K4582
6271a46008J13853k6951j86853J99516J14747o4453k7819P3487K22635j5435k0283
$$ y = [81759, 128318, -80583, -325080, -243119, -201422, 22743, 236218, 137562, -32364, -45038, -288228, -237437, 145766, 169780, 179166, 45109, -68662, -337956, -206899, 28582, 454232, 611809, 537926, 237379, 208724, 191796, 140446, 167213, 360263, 229185, 218344, 235753, 110905, 375995, 488607, 434217, 332164, 240826, 184937, 220490, 115733, 47998, -97347, -310987, -198271, -315988, -338581, -444971, -208988, -8039, -214923, -354467, -563567, -693887, -799324, -886560, -844293, -911391, -704009, -873791, -818591, -262361, -107961, 20982, 295377, 656401, 660370, 427867, 234168, 101503, -106753, -170590, -146008, -32155, -59106, -245959, -46443, 68304, 3851, -23968, 49519, 272154, 256719, 236436]
6260B36436l99175J16365J4311R750L2347L4128j3083l220j39581k34524J53283
6249a92963j9342L99171L37233l17088k13535j40589o3664j50560J06141J67752
6239h7444l02445p6756J78520K17133r220K32742P7650k26836L7551K40149K96176
6228E77220m1990l29235l956N3423J00261p4617k51115l42058l97456K9446R0098
6217e89979J1003j4508N4544J60735m6848K16136M26454j96535J09448R832j65976
6206b5694k20432K29233J50664Q402o3657j31738j25252j73748J37349K90642
6196G5769Q3200J23233K0333j81567j34329Q0024j58288j12364J26588L9112j79704
6185b17993o1280J11333M6121m0942j0492L31627q3568l09536j34367K14800j50510
$$ y = [236436, -162739, -46374, -32063, -22313, 10034, 44162, 31079, 27859, -111722, -346246, -192963, -212305, 186866, 524099, 207011, -6524, -147113, -210777, -361337, -255196, -87444, -389889, -466645, -288125, -70992, -80212, 152530, 230180, 3344, 40895, 281044, 577220, 535230, 205995, 202039, 255462, 355723, 281106, 29991, -312067, -709523, -680077, -589979, -578976, -593484, -538940, -378205, -425053, -208917, 217537, 21002, 130450, 140282, -25694, -246126, -16893, 133771, 142173, 78516, -53222, -178474, -352222, -214873, 75769, 158969, 282202, 302535, 120968, -13361, 66663, -91625, -203989, -77401, -38289, -217993, -279273, -167940, -121819, -162761, -173253, 158374, 74806, -234730, -369097, -154297, -304807]
6174c04807M7953K0582o7006J1635N2560k825O0861J09325J15257O9645l95629
6163b82449n276K35943p598J32603L817k29882n3502l8957P7415M16808J84715
6152D33637l40683J0681L1855l40568j90111J91062J73102J63687j24314K5626
6142C3974n519n1183p5553k31246O1732L65992L28140k96m01113j24879J30566
6131C0615j72506j02640N0560L56978K48490R9491J76680j24117k8738k49456
6121B85357j55356J70032k5543Q9029j79075j20579J51734M4066P3386J01161
6111D34212j05048j09435k02703k37119Q9721L33749L752j5599K85248j35692
6101C41086j78962P7749j96809J14792j45850j32293m9876j5829j7930J81401
$$ y = [-304807, -256854, -236272, -303278, -291643, -239083, -241908, -181047, -71722, 43535, 113180, -282449, -287725, -51782, -59380, 73223, 77040, -152842, -206344, -245301, -167886, 248922, 433637, 92954, 103635, 135490, -205078, -395189, -204127, -31025, 132662, 8348, 33974, 28455, -22728, -98281, -329527, -267795, 98197, 426337, 426041, 24928, -99951, 30615, -141891, -244531, -193971, 163007, 411497, 510988, 687668, 563551, 534813, 285357, 130001, 300033, 274490, 363519, 184444, 63865, 215599, 259665, 333051, 434212, 329164, 219729, 17026, -220093, -130372, 203377, 207129, 191530, 476778, 341086, 162124, 239873, 43064, 157856, 12006, -120287, -170163, -185992, -203922, -22521]
6091b2521J26294o588R588l08450j5375J37816K30846J64864j89379n6415L26466
6080C97146r4233m12283j17977k45054l1756J45813N6702N1271J47688R1488j59687
6069a70882l6638l44225j45848Q4187J57940L78027N371o5266L18790J71824k12757
6058A40523J9953J64216j82064l39889k07237K40293J19650j90079R1460p57L36551
6047A92620K37244l868j97177m38641J3094K28488p1588P6594J72196k65492j87498
6036b44028J98868J18455J22113q7410O9715p6065j85916p0797l6362j27780K42336
6025g6871m6760Q540k12857j03361K58685J52974K3482J27627j2852j26002k56102
6014b63497j45098l2283j40124l2949J83000J48003o4628Q9580j8032J06428R7259
$$ y = [-22521, 103773, 97185, 106773, -201677, -217052, -79236, 151610, 316474, 127095, 70680, 397146, 302913, -109370, -227347, -472401, -504157, -358344, -301642, -250371, -102683, -11195, -170882, -207520, -551745, -697593, -613406, -455466, -77439, -72068, -137334, 181456, 353280, 140523, 160476, 324692, 142628, -197261, -404498, -164205, -44555, -234634, -143174, -143931, 192620, 429864, 425996, 228819, -209822, -196728, 31760, -39828, 36766, 208962, -56530, -244028, -45160, 73295, 195408, 107998, 177713, 101648, -84268, -155065, -191427, -319207, -76871, -123631, -115091, -327948, -431309, -172624, -19650, 3832, 131459, 118607, -7395, -263497, -408595, -440878, -581002, -613951, -430951, -282948, -347576, -257996, -276028, -169600, -72341]
6003g2341j0420Q9424L92417r2581k43535K943j1191P1321R8623Q1040M8115N7887
5991D11702o6671M7657L19207J36716J80864m5890l20040l05523k74395K77405
5981C61032m6271K2943j31133o7481j75818q6130K9621J58016K61143K2208k51454
5970I6676N771o4347p8345m3607j56421o4687k899o7987J44928Q9228L15359J04614
5958B78283k28687r2735j75781l58459j17757J99018L83073K66736R4950j88104
5948F0537J35788k2409j24214n31118j45159J93974J67897n813j95411K59932
5938b05996M85644P7853k11608J56786J9980j26739n329J53344k10309O2003k2127
5927A73502j94475m1530R4251j15561l5496l71071j73374o7152J50184K30243
$$ y = [-72341, -82761, 6663, 399080, 306499, 62964, 65907, 54716, 126037, 224660, 305700, 353815, 411702, 345031, 392688, 711895, 848611, 1029475, 983585, 663545, 358022, 83627, 361032, 314761, 337704, 206571, 139090, -36728, -122858, -93237, 64779, 325922, 348130, 96676, 102447, 38100, -40245, -83852, -240273, -304960, -307859, -375846, -230918, -141690, 173669, 278283, 49596, -43139, -218920, -577379, -695136, -496118, -113045, 153691, 248641, 60537, 196325, 173916, 49702, -481416, -626575, -432601, -264704, -270517, -465928, -205996, 279648, 357501, 145893, 302679, 322659, 195920, 190591, 343935, 133626, 195629, 173502, -20973, -62503, 31748, -83813, -119309, -490380, -663754, -730906, -580722, -350479]
5917c50479K07826J93372J15670K42487o4503l86970K67948L27139P5038k29162
5907C98366l06872n5452k2443j01539r678J37245n9647j33120P5033L9964j038
5896c9181k50816K81788L5775p3222l52410M6286N0110L4131L8230p9433P9750
5885b28992J36487Q3926l32117j01032K73569J82040J37868k03996j67424j46504
5875c66175L24784L10838j92256o3359R2421q8298j31244k3759k0416N3760j2539
5864a16243Q1645K62974k7151k82702j42168q7290R8658j30903j66043K43663
5854b65560L52201K59067N4874j54658k39885j44791j17104M6288q0102K4457
5844b65213J49250j20863p9921Q5081L70435Q4032l30139k22400m5405k6523L6512
$$ y = [-350479, -142653, 50719, 166389, 408876, 344373, -42597, 225351, 552490, 627528, 398366, 91494, 36042, 13599, -87940, -97618, 39627, -20020, -153140, -78107, -38143, -39181, -289997, -8209, 27566, -45656, -398066, -351780, -301670, -267539, -229309, -308742, -228992, -92505, -8579, -340696, -441728, -168159, 13881, 151749, -52247, -219671, -366175, -41391, 269447, 77191, 13832, 106253, 17955, -113289, -137048, -157464, -103704, -116243, -34598, 228376, 201225, -81477, -223645, -310935, -212277, -343180, -509223, -265560, 86641, 345708, 400582, 245924, 6039, -138752, -255856, -209568, -289670, -265213, -115963, -236826, -316747, -231666, 138769, 222801, -107338, -329738, -375143, -401666, -365154]
5833c65154J70013M4320J21623K5296K29389m7703J0062j31994N9740J3651k64465
5822a35222q6559L7765r762K15777p5885k18668j917J90492J50716o3544M4034
5811D7227j04797j79290j6411J65899O2481j13305r1366k68626O2042j92047P9590
5800e48603L82827K76559J19214l88082j47830J75805K66719Q5877J49365J41090
5790E12941k74820P5732p7479J35583n10357k46944J66035K59222J25835k51066
5780h5318j2794O3696j17652R2867M20219J71176j65149k629j30432l5720L5137
5769B33401K4808j29617R4978j0498r4340k07379J24565o846Q7039j25979n2765
5758f2633R5639Q7566N7105j9260L0372P6136j74142J59953J81921j09445J7775
$$ y = [-365154, -195141, -150821, -29198, -3902, 225487, 177784, 187846, 55852, 115592, 129243, -135222, -221781, -184016, -193778, 21999, -53886, -272554, -274471, -83979, 66737, 3193, 47227, -57570, -236860, -253271, -87372, -24891, -138196, -229562, -498188, -436146, -628193, -548603, -165776, 110783, 229997, -158085, -305915, -130110, 136609, 222486, 371851, 512941, 238121, 313853, 236374, 371957, -138400, -385344, -219309, 39913, 165748, -85318, -98112, -34416, -152068, -59201, 361018, 532194, 367045, 364416, 233984, 198264, 233401, 258209, 128592, 223570, 213072, 118732, -88647, 35918, 29072, 116111, -9868, -62633, 33006, 120572, 177677, 158417, 188789, 264925, 90783, 250736, 432657, 323212, 340987]
5747C40987l62582l23845k08586K2544j5634j93668K14743J47571N0991K7118
5737c00361J63187q5070o428j7332j90832N6704J07968N5817K3197J28090j42236
5726b07296J34844J07483n4134M0896J5983k74502m17787L2548K29633J69872
5716b22460J05521q8801J06832J2921j64928J29853J31830j51900n34713j03928
5706g79773J43292k0492K7085L89645K76086l24312k95624j62504J60409L77489
5696b08699L26031J08459L5599k80597k08752J21093n9353L5815L2522j2207O5832
5685d4257M9603j65196K06826L10740K10029L3421l82790k87783Q4690R0392j68243
5674f2568O919p457N1718K64380j5529n89087j40210K87828O7685R9573N8528
$$ y = [340987, -21595, -345440, -554026, -531482, -547116, -740784, -526041, -378470, -327479, -300361, -137174, -222244, -228672, -246004, -436836, -380132, -272164, -216347, -193150, -65060, -207296, -72452, 35031, -19103, 21793, 37776, -236726, -654513, -621965, -392332, -222460, -116939, -205740, -98908, -85987, -250915, -121062, 10768, -141132, -675845, -779773, -636481, -656973, -629888, -240243, 35843, -288469, -584093, -746597, -586188, -208699, 117332, 225791, 261390, -19207, -227959, -106866, -166219, -130404, -97882, -110089, -44257, 5346, -159850, 46976, 357716, 567745, 601166, 218376, -69407, 15283, 105675, -62568, -55649, -63106, -11388, 252992, 237463, -351624, -491834, -204006, -136321, -36748, 21780]
5663B1780j65319j11966l23884M88765M33723K4365j04835k10607l95651k55118
5653e98747R1002M6165L07937R7480r5300J0526p3234r5405L8031n1362o4688
5642c87595N8991k84916n0056J72806J52761K40417K4538m2420J44304K43661
5632B72491J45696l02471k22738R0101k6982Q983J81537m000O4133K01752J02944
5621E11446j49446k47419j92137k58610m2177K80701L07329j41111k32046N2850
5611a10620j63814j00768q3833R8596m4734j8163N0914K184L03151J07260j4822
5600B5351j40648n7431r0216r5632Q703J19040j23740K9878K70653p5492o2496
5589a92030L05396J52443l90117m07540J8251r4858L81417L37245K64319j48177
$$ y = [21780, -143539, -255505, -579389, -90624, 343099, 367464, 262629, 52022, -343629, -598747, -507745, -461580, -153643, -56163, -151463, -140937, -214171, -309576, -271545, -322907, -387595, -328604, -613520, -663576, -490770, -338009, -97592, -73054, -115474, 28830, 272491, 418187, 115716, -107022, -16921, -43903, -34920, 146617, 142617, 206750, 408502, 511446, 362000, 114581, -77556, -336166, -378343, -97642, 209687, 68576, -163470, -110620, -274434, -375202, -459035, -360439, -405173, -423336, -372422, -370238, -67087, 40173, 25351, -115297, -172728, -262944, -358576, -349873, -230833, -354573, -324695, -54042, -129534, -192030, 113366, 265809, -124308, -531848, -513597, -608455, -227038, 110207, 374526, 226349]
5579B26349j34434P8159q9149p8054l3378j29158O9786j15031j79198J8458k5737
5568c91387o3219K7758K79960P3732K27768K58491M4701k22792m5730J50542j13370
5557B26454m15649l0258J27956J49181j43553K62885J18086m0945j88467J18647
5547A84337L2757j75072Q8425k33054k60528K1435J52502l5661J77802R6299j64892
5536a15650l1967j40049j44896j47265O3430J41103K61810K39680j69305p5661
5526a18770j12560Q6776O15L9807Q1976j42941K63198P2154j81064j11110J52242
5515C0323j09468j02743R5323q2470J39987j53506J41549k31283J58840J94441
5505H0993K5779q5163j04437j04097O3289r2919J93327j07294j47351k34918o3675
$$ y = [226349, 91915, 170074, 80925, 2871, -30507, -159665, -89879, -204910, -384108, -365650, -391387, -454606, -426848, -146888, -73156, 154612, 413103, 457804, 235012, 189282, 339824, 226454, -189195, -219453, -91497, 57684, -85869, 177016, 295102, 254157, 65690, 184337, 217094, 42022, 130447, -102607, -363135, -341700, -189198, -224859, -47057, 49242, -115650, -147617, -287666, -432562, -579827, -516397, -375294, -113484, 126196, -43109, -118770, -231330, -144554, -143939, -104132, -22156, -165097, 98101, 170255, -10809, -121919, 30323, -79145, -181888, -86565, -169035, -29048, -182554, -41005, -272288, -113448, 80993, 106772, 21609, -82828, -186925, -123636, -216555, -23228, -130522, -277873, -512791, -576466]
5494e76466k7940L3245N7771N27758J43576j98417K2276j13021L0469o3369k0638
5483a84756L15775p2590p1434J52625R4200Q596j1855j69721j02603K55600r3840
5472A19997k86307o6058O7021r8988r1191J75457J9723k53819m3803q6644K47190
5461b97422L83645j5089M4672n9723l55141J8762m8886J5219j00024J88785P6900
$$ y = [-576466, -604406, -571161, -513390, 14368, 157944, -40473, -18197, -131218, -100749, -164118, -184756, 131019, 58429, -13005, 139620, 233820, 242416, 230561, 60840, -41763, 213837, 119997, -166310, -232368, -165347, -264335, -355526, -180069, -160346, -414165, -457968, -544612, -297422, 86223, 71134, 115806, 56083, -299058, -280296, -329182, -313963, -413987, -225202, -148302]
$$ [...]
##END NTUPLES=NMR SPECTRUM
##END=
