##TITLE=Analysis number 319640
Compound Code rf 04027
Project Code adrs
Chemist Name new century
##JCAMPDX= 6.0         $$ Bruker NMR JCAMP-DX V2.0
##DATA TYPE= NMR SPECTRUM
##DATA CLASS= NTUPLES
##ORIGIN= Bruker BioSpin GmbH
##OWNER= nmr
$$ XWIN-NMR		Version 3.5
$$ Tue May 23 08:10:12 2006 GMT Daylight Time (UT+1h)  MAYBRIDGE\nmr@NMR_250MHZ
##.OBSERVE FREQUENCY= 250.131544655141
##.OBSERVE NUCLEUS= ^1H
##.ACQUISITION MODE= SIMULTANEOUS (DQD)
##.ACQUISITION SCHEME= undefined
##.AVERAGES= 16
##.DIGITISER RES= 18
##SPECTROMETER/DATA SYSTEM= dpx250
##.PULSE SEQUENCE= zg30
##.SOLVENT NAME= CDCl3
##.SHIFT REFERENCE= (INTERNAL, CDCl3, 0, 16.522)
##AUDIT TRAIL= $$ (NUMBER, WHEN, WHO, WHERE, WHAT)
$$ ##TITLE= Audit trail, XWIN-NMR		Version 3.5
$$ ##JCAMPDX= 5.01
$$ ##ORIGIN= Bruker BioSpin GmbH
$$ ##OWNER= nmr
$$ C:\u/data/dgb/nmr/ADRS/4900/pdata/1/auditp.txt
$$ ##AUDIT TRAIL=  $$ (NUMBER, WHEN, WHO, WHERE, WHAT)
(   1,<2006-05-23 08:09:48.71 +100>,<MAYBRIDGE\nmr>,<NMR_250MHZ>,
      <created by zg, POWCHK disabled, PULCHK disabled
       configuration hash MD5:
       84 BC 41 DB A1 6E 1D 46 DA 25 12 A5 C1 ED C5 3A
       data hash MD5: 64K
       5B 25 FA 43 B8 FE 0A 6F F7 BA 57 55 FB 7D 4B B3>)
(   2,<2006-05-23 08:10:02.71 +100>,<MAYBRIDGE\nmr>,<NMR_250MHZ>,
      <Start of raw data processing
       ef LB = 0.3 FT_mod = 6 PKNL = 1 SI = 32K 
       data hash MD5: 32K
       3C D6 4D BE 6C B4 C8 2D E0 33 2D 53 86 D6 BD 51>)
(   3,<2006-05-23 08:10:04.19 +100>,<MAYBRIDGE\nmr>,<NMR_250MHZ>,
      <apk 
       data hash MD5: 32K
       6E 90 A2 F2 D9 44 FB 8D 6E 80 12 CB 15 7D 10 49>)
(   4,<2006-05-23 08:10:04.91 +100>,<MAYBRIDGE\nmr>,<NMR_250MHZ>,
      <abs ABSG = 5 
       data hash MD5: 32K
       2A EB 05 24 A4 9D EB BF 3D 81 FC 05 72 B1 81 43>)
$$ ##END=
$$ 
$$ hash MD5
$$ 6E 98 74 9E 9F 5C 6D 76 D0 3B C6 78 2A 5E D2 2D
##$RELAX= 
##$RELAX= 
##$RELAX= 
##$RELAX= 
##$RELAX= 
##$RELAX= 
##$RELAX= 
$$ Bruker specific parameters
$$ --------------------------
##$DU= <C:\u>
##$EXPNO= 4900
##$NAME= <ADRS>
##$PROCNO= 1
##$TYPE= <nmr>
##$USER= <dgb>
##$AMP= (0..31)
100 100 100 100 100 100 100 100 100 100 100 100 100 100 100 100 100 100 
100 100 100 100 100 100 100 100 100 100 100 100 100 100 
##$AQSEQ= 0
##$AQ_mod= 3
##$AUNM= <au_zg>
##$AUTOPOS= <2 >
##$BF1= 250.13
##$BF2= 250.13
##$BF3= 250.13
##$BF4= 250.13
##$BF5= 500.13
##$BF6= 500.13
##$BF7= 500.13
##$BF8= 500.13
##$BYTORDA= 1
##$CFDGTYP= 0
##$CFRGTYP= 5
##$CHEMSTR= <none>
##$CNST= (0..31)
1 1 145 1 1 1 1 1 1 1 1 1 1 1 1 1 1 1 1 1 1 1 1 1 1 1 1 1 1 1 1 1 
##$CPDPRG= <>
##$CPDPRG1= <>
##$CPDPRG2= <>
##$CPDPRG3= <>
##$CPDPRG4= <mlev>
##$CPDPRG5= <mlev>
##$CPDPRG6= <mlev>
##$CPDPRG7= <mlev>
##$CPDPRG8= <mlev>
##$CPDPRGB= <>
##$CPDPRGT= <>
##$D= (0..31)
0 1 0 0 0 0 0 0 0 0.06 0 0 0 0 0 0 0.0002 0 0 0 0 0 0 0 0 0 0 0 0 0 0 
0 
##$DATE= 1148368187
##$DBL= (0..7)
120 120 120 120 120 120 120 120 
##$DBP= (0..7)
150 150 150 150 150 150 150 150 
##$DBP07= 0
##$DBPNAM0= <>
##$DBPNAM1= <>
##$DBPNAM2= <>
$$ [...]
##$SUBNAM7= <"">
##$SUBNAM8= <"">
##$SUBNAM9= <"">
##$SW= 20.6930455092707
##$SWIBOX= (0..15)
0 0 3 0 0 0 0 0 0 0 0 0 0 0 0 0 
##$SW_h= 5175.983436853
##$TD= 65536
##$TD0= 1
##$TE= 294.16
##$TE2= 300
##$TE3= 300
##$TEG= 300
##$TL= (0..7)
0 120 120 120 120 120 120 120 
##$TP= (0..7)
150 150 150 150 150 150 150 150 
##$TP07= 0
##$TPNAME0= <>
##$TPNAME1= <>
##$TPNAME2= <>
##$TPNAME3= <>
##$TPNAME4= <>
##$TPNAME5= <>
##$TPNAME6= <>
##$TPNAME7= <>
##$TPOAL= (0..7)
0.5 0.5 0.5 0.5 0.5 0.5 0.5 0.5 
##$TPOFFS= (0..7)
0 0 0 0 0 0 0 0 
##$TUNHIN= 0
##$TUNHOUT= 0
##$TUNXOUT= 0
##$USERA1= <user>
##$USERA2= <user>
##$USERA3= <user>
##$USERA4= <user>
##$USERA5= <user>
##$V9= 5
##$VALIST= <valist>
##$VCLIST= <CCCCCCCCCCCCCCC>
##$VD= 0
##$VDLIST= <DDDDDDDDDDDDDDD>
##$VPLIST= <PPPPPPPPPPPPPPP>
##$VTLIST= <TTTTTTTTTTTTTTT>
##$WBST= 1024
##$WBSW= 4
##$XGAIN= (0..3)
0 0 0 0 
##$XL= 0
##$YL= 0
##$YMAX_a= 439056
##$YMIN_a= -476828
##$ZGOPTNS= <>
##$ZL1= 120
##$ZL2= 120
##$ZL3= 120
##$ZL4= 120
##$ABSF1= 16.522
##$ABSF2= -4.171173
##$ABSG= 5
##$ABSL= 3
##$ALPHA= 0
##$AQORDER= 0
##$ASSFAC= 0
##$ASSFACI= 0
##$ASSFACX= 0
##$ASSWID= 0
##$AUNMP= <proc_1d>
##$AZFE= 0.1
##$AZFW= 0.1
##$BCFW= 0
##$BC_mod= 0
##$BYTORDP= 0
##$COROFFS= 0
##$CY= 12.5
##$DATMOD= 1
##$DC= 0
##$DFILT= <>
##$DTYPP= 0
##$F1P= 14.0000005364418
##$F2P= -0.99999901652339
##$FCOR= 0.5
##$FTSIZE= 32768
##$FT_mod= 6
##$GAMMA= 0
##$GB= 0
##$INTBC= 1
##$INTSCL= 1
##$ISEN= 128
##$LB= 0.3
##$LEV0= 0
##$LPBIN= 0
##$MAXI= 10000
##$MC2= 0
##$MEAN= 0
##$ME_mod= 0
##$MI= 0
##$NCOEF= 0
##$NC_proc= -2
##$NLEV= 6
##$NOISF1= 0
##$NOISF2= 0
##$NSP= 0
##$NTH_PI= 0
##$NZP= 0
##$OFFSET= 16.522
##$PC= 1
##$PHC0= 170.5203
##$PHC1= 5.756332
##$PH_mod= 1
##$PKNL= yes
##$PPARMOD= 0
##$PSCAL= 4
##$PSIGN= 0
##$REVERSE= no
##$SF= 250.13
##$SI= 32768
##$SIGF1= 0
##$SIGF2= 0
##$SINO= 400
##$SIOLD= 32768
##$SREGLST= <1H.CDCl3>
##$SSB= 0
##$STSI= 32768
##$STSR= 0
##$SW_p= 5175.98343685301
##$SYMM= 0
##$S_DEV= 0
##$TDeff= 65536
##$TDoff= 0
##$TI= <Analysis number 999999
Compound Code 99
Book Reference 9
Project Code 9>
##$TILT= no
##$TM1= 0
##$TM2= 0
##$TOPLEV= 0
##$USERP1= <user>
##$USERP2= <user>
##$USERP3= <user>
##$USERP4= <user>
##$USERP5= <user>
##$WDW= 1
##$XDIM= 32768
##$YMAX_p= 325190853
##$YMIN_p= -57258
$$ End of Bruker specific parameters
$$ ---------------------------------
##NTUPLES= NMR SPECTRUM
##VAR_NAME=  FREQUENCY,     SPECTRUM/REAL,   SPECTRUM/IMAG
##SYMBOL=    X,             R,               I
##VAR_TYPE=  INDEPENDENT,   DEPENDENT,       DEPENDENT
##VAR_FORM=  AFFN,          ASDF,            ASDF
##VAR_DIM=   32768,         32768,           32768
##UNITS=     HZ,            ARBITRARY UNITS, ARBITRARY UNITS
##FACTOR=    0.157963299565203, 1,           1
##FIRST=     4132.6476996994, 0,             0
##LAST=      -1043.33573715361, 0,           0
##MIN=       -1043.33573715361, -57258,      0
##MAX=       4132.6476996994, 325190853,     0
$$ Real data points
##PAGE= N=1
##DATA TABLE= (X++(R..R)), XYDATA
$$ [...]
23680 6043 11595 9666 5801 8485 -5704 -12542 -14532 -9755 -7845 4219 10629 6211 11520 14345
23666 14345 20994 17801 17924 3808 -8806 -13536 -18806 -19363 -12944 -16108 -15285 -26341 -17007 -1088
23652 -1088 11144 16421 2665 -15484 -9933 10679 2706 4235 9262 1690 1380 5172 1911 9764
23638 9764 22750 1611 -1397 -3854 940 4897 10052 14059 -2271 -10239 -104 510 -2601 -14181
23624 -14181 -27234 -19949 -22800 -32232 -30080 -16242 -7214 7136 -4670 -21572 -19290 -13810 2033
23611 2033 815 -2954 -6834 -5821 -20411 -34900 -21361 -10338 -7164 -3540 -12274 5824 12384
23598 12384 4363 5466 -1461 -754 -1380 -1446 1852 5457 6361 6347 8577 3888 9806 4834 8870 19222
23582 19222 12247 -940 2970 1716 8737 -2160 -14181 -2687 -1073 5882 4364 -8974 -19110
23569 -19110 -23403 -22576 -9829 -10655 -5000 -1542 -36 -891 -4076 -22498 -33630 -15106 -4087 -2287
23555 -2287 -5789 -3995 4196 331 -1318 4935 10284 884 -5821 -1936 5684 9783 704 6546 15704
23540 15704 10490 13875 15790 16349 8515 -7830 -10390 511 7337 17178 3880 -7732 7583
23527 7583 13924 21419 30888 29925 30840 19504 8 3997 2392 13694 27982 25713 18690 24834
23513 24834 26011 11487 2592 16290 14273 15403 1351 -1079 -7404 7421 18708 20825 18043
23500 18043 9842 -2940 1269 2563 -5408 -8127 -13698 -10482 -10460 -12996 -8996 -11720 -5075 5993
23486 5993 1344 -8495 -13937 -2149 -6350 -13730 -6869 -1620 -8714 -13515 -9059 -1733 8596 23036
23472 23036 15368 -573 -6884 -5946 -12643 -10827 -13532 3387 19471 21280 -7387 -32148 -19029
23459 -19029 -19898 -18786 -12355 -8765 -12163 -10437 -6749 -7168 -19578 -27761 -18311 -13847 -18432 -20286 -26185
23444 -26185 -1360 1989 6911 14061 26005 12023 -6881 -4971 3887 -4354 -12052 -15666 -12711
23431 -12711 -9046 -426 1174 -1497 3780 4739 9621 12114 2328 80 -2913 -9093 -3622 5041 12697
23416 12697 30760 16154 8909 16294 4365 -5083 -11367 2043 268 -17847 -32025 -45156 -26207
23403 -26207 -5696 2397 1975 14061 16162 -902 -3259 -9605 -11031 -13928 -14123 -19710 -27161 -21519
23389 -21519 2243 23159 26762 17202 -1212 -917 5839 2655 4999 19605 23238 27249 15554
23376 15554 -4939 -3389 4048 2198 -19457 -18414 -5218 9026 18481 11590 -13946 -23122 -13504
23363 -13504 -18481 -23340 -12187 -11483 -9884 5190 -7232 -22582 -628 11493 6311 1827 1690
23350 1690 -3760 3492 -3050 -10679 -16543 -8661 -15460 -15815 2682 14876 4054 9936 2952 6748
23336 6748 112 709 12019 21546 6963 2991 1936 -10311 -12341 619 19727 23996 21001 4642
23322 4642 -8308 -9783 -11624 -15157 -5952 -15738 -22682 -16729 -29660 -27953 -2328 881 -11071 -1648
23308 -1648 -1677 -1298 7948 9811 17404 16519 12023 11909 18685 22509 22166 21741 25700 18042 3145 -8443
23292 -8443 -9209 -3292 -6572 1745 11106 2850 -6069 -17938 -30903 -16553 -10093 -17823 -25563 -20601
23278 -20601 -27720 -34893 -31793 -11156 320 -6808 -4598 3670 8815 4364 -4750 942 6291 -1311
23264 -1311 -15207 -14870 -13380 -8519 5027 17515 3619 3717 -3156 -17980 -19907 -8353 1208 -4244
23250 -4244 -1146 -10823 -1924 12657 8638 -2178 -10244 -16018 -17603 -28308 -23393 -9389 -6215 -7196
23236 -7196 -2330 -3411 -21081 -23631 -19140 -4624 4146 14381 27616 19400 2924 -9842 -11461
23223 -11461 -6257 -6662 17555 34034 25692 16884 21780 15366 5805 -16340 -11990 -16502 -499 19735
23209 19735 4614 -4003 4932 4089 22042 26525 15254 11473 -9848 -1313 12975 15649 1302
23196 1302 543 14176 14811 9123 5597 5005 6935 -314 -3946 -7731 -10917 -6709 -11531 -12041 -1350
23181 -1350 21005 20569 12564 3172 -6001 -16230 -17085 -23978 -21377 -7504 3265 6159 11271 16813
23167 16813 14484 -3303 -6918 -5483 -2175 8160 2035 -12898 -12748 -8650 -4678 -3591 -30492 -24808
23153 -24808 -8130 762 -371 1278 22998 42528 40330 8178 -11294 -8976 -3574 -8365 -5871
23140 -5871 -3338 -7416 -27128 -30892 -22622 -15645 -16612 -12735 -20721 -37324 -53517 -43666 -28908 -25215
23126 -25215 -21701 -10749 -1109 14527 3745 -8897 -8425 -9685 -11584 -5244 -11117 -9646 -12688 -21982
23112 -21982 -30264 -23642 -13235 4694 16403 14255 9426 2291 -9752 -9398 -11 -10320 -24363
23099 -24363 -25034 -29058 -30594 -22457 -3863 7383 -3674 -23177 -41378 -39230 -9320 -2379 -8939
23086 -8939 -11525 -16281 -22752 -26469 -24987 -15841 -6066 -3116 7303 10462 8902 -6517 -3108 -2278
23072 -2278 -12574 -25294 -26136 -17787 4794 11199 -87 -6410 8205 6592 -8568 -8759 -6873 -17022
23058 -17022 -25087 -35110 -16927 -18800 -29466 -16820 -12008 -17697 -18730 2312 15738 3707 -7610
23045 -7610 -7939 -6871 -13610 -12180 -5781 12409 18720 4388 -9028 -12696 -28687 -35019 -34832 -28640
23031 -28640 -19339 -20249 -7682 -7306 -16191 -14401 -10537 -8259 -4601 3034 2174 17013 10792 8463 12633
23016 12633 6497 1666 4954 3302 15261 17434 3157 6087 10884 13649 14187 14450 15273 6329 -11071
23001 -11071 -24961 -27644 -25067 -14969 -12573 -17997 -17518 4874 22439 14782 19329 21744 19125 4804
22987 4804 8651 17677 9194 7666 19909 12558 -1184 -1493 -2120 -12631 -2743 19095 23692 22645
22973 22645 26543 24458 8974 5647 -2894 -14311 -17713 -8598 -4371 -4307 1984 608 8851 8526 -411
22958 -411 -163 908 -11209 -8901 366 5710 1955 -523 634 -5705 1082 2736 3850 7697 12383
22943 12383 26426 36635 6733 9934 16803 9479 13594 13226 11732 15402 19348 13338 7682 -950
22929 -950 11116 8483 2349 8915 10121 9426 11924 22206 26317 26308 7368 -9238 -4411 -3202 5115
22914 5115 -1214 -1782 -293 -5813 -22238 -24447 -12913 8303 2068 -4866 -5446 3923 -10008 -21849
22900 -21849 -22869 -19241 -5480 7879 11352 2952 6235 14584 8032 6016 5528 5872 9634 603
22886 603 -2027 -3521 -11967 -9986 -2336 -1325 -11490 -1620 8351 8304 -5670 -23870 -7472 4838
22872 4838 815 -7468 -1150 8471 9042 13151 9900 -3612 -8492 -2829 -12253 -6651 -11462 -24526
22858 -24526 -23028 -18130 -12386 -14444 -11380 3511 7241 -1373 -13141 -32593 -46489 -42914 -32662
22845 -32662 -20967 -12684 -6062 -17197 -26113 -21604 -21694 -24498 -29433 -18474 715 10869 6470 23373
22831 23373 27374 19879 8782 -12803 -31713 -25210 -14404 -4949 -8641 -17011 -25026 -36624 -37489
22818 -37489 -34863 -21640 -13995 -2429 18592 24804 13041 2111 12361 12093 7472 -42 -16410
22805 -16410 -35651 -28271 -22033 -18541 -14112 -29466 -39189 -32467 -22424 -21268 -15498 -20180 -22983 -20549
22791 -20549 -16638 -14640 -19472 7410 5433 13465 31160 32938 12284 15551 18941 20924 9969
22778 9969 7063 9575 1189 -5047 -2083 -1998 -7755 -4560 -1008 469 -4764 -17488 -24388 -17661 -8722
22763 -8722 -1122 3934 -4475 -14769 -8512 -4389 2454 -11386 -22230 -34977 -35279 -29956 -22040 -17101
22749 -17101 -10198 -25481 -17223 -11673 -28269 -32935 -15762 -8082 -13924 -19905 -20735 -17388 -19601 -12301
22735 -12301 -3315 -5872 -10676 -12709 -5089 384 8365 -5379 -26898 -13644 -4781 6339 17440
22722 17440 11856 4767 3823 3600 -16775 -27708 -4037 -7182 -8984 -9455 -6451 -4699 -6374 -22625
22708 -22625 -7924 14085 3029 10408 5797 7001 -517 10740 -8122 -26517 -22668 -15337 2362
22695 2362 7631 3433 344 -12686 -16179 -14271 -18048 -13144 -9366 -24437 -29276 -10536 -11845 -17905
22681 -17905 3803 11112 7384 1213 -11245 -17662 -23060 -19060 -3371 2635 5624 11779 8038 3021
22667 3021 10584 6414 -4947 -4913 -6424 -3783 -6648 -14045 -13239 7228 8060 1127 5870 10006 -7159
22652 -7159 -22442 -29918 -34883 -24772 -23930 -14416 2038 12485 4221 -10098 14123 31831 29985
22639 29985 8815 -14022 -22153 -28128 -22446 -11200 -6109 5690 -3161 -16582 -15955 -6653 -8806
22626 -8806 -6908 4363 3536 10628 27727 14995 3316 2841 -3892 3335 19593 17329 3632 10312
22612 10312 11406 -1333 -18205 -22435 -7715 7603 8443 12010 20590 24932 29778 32530 30648 35298
22598 35298 29070 7130 -9653 -30064 -34519 -30844 -15977 -9782 -19510 -23262 -14867 -14159 -14154 -15234
22584 -15234 -14718 -16750 -12257 -9692 634 10019 11170 10125 -6716 -10496 -1599 341 10892 16293
22570 16293 938 -1761 6798 2756 -266 -6689 -11333 5334 11407 11412 9325 3017 -18507 -21388
22556 -21388 -20688 -18027 -18715 -169 7804 -332 -5055 -41 989 3853 -9348 2807 27320 25769
22542 25769 23469 16658 14846 19360 21672 7545 1651 -1879 -4799 -11001 -3300 1608 10243 5090
22528 5090 -2250 -3053 -12304 -30849 -29989 -10737 2123 -1050 -17396 -15760 -20819 -14784 10051 22167
22514 22167 10558 14254 21209 8659 -6325 -4349 2874 6706 13112 29069 16026 -525 1462
22501 1462 -12943 931 16322 13175 4616 -7043 -12408 -570 -4740 -8359 -2346 -16048 -24229
22488 -24229 -14207 -1661 5259 9405 -3721 -19428 -25816 -21372 -7180 -17266 -15085 -14541 -21037
22475 -21037 4397 1583 -12781 -20568 -25052 -25995 -10446 -8134 -25111 -23879 -14655 -468 -4955
22462 -4955 -4457 -15865 -35728 -36384 -16933 9614 5506 -1373 618 6013 2478 -10656 -15661 -16176
22448 -16176 -17405 -16766 -17997 -7635 5969 11460 13611 9475 -10276 -24460 -14187 8612 6596
22435 6596 6036 928 13935 20246 4178 -9690 -19543 -10341 -12141 -28612 -9514 3946 -7917
22422 -7917 -457 -3786 8880 8580 13019 5730 -10608 -20056 -16297 -15620 -22072 -17666 -2493 9405
22408 9405 16335 19371 27406 19208 10290 3157 -14705 -15689 -12293 -18425 -21804 -15071 -10555 1764
22394 1764 -2836 4506 23695 21665 -1110 -5629 3982 19180 7487 -1538 6317 3709 -8343
22381 -8343 -14870 -370 10819 11018 11085 17292 19207 17918 13936 2053 -6773 -17975 -4911 -7681
22367 -7681 -8879 -10624 -5663 16995 29530 24748 10575 18921 10049 -4162 -16195 -13405 -7210
22354 -7210 -10721 -17481 -20108 7575 20933 32629 34651 29949 28591 22145 20211 19952 15654 8113
22340 8113 9119 10643 -5241 -14171 -8237 -3445 14850 11623 8942 10377 3078 -20474 -14387 3910
22326 3910 5258 -7455 -23826 -46155 -57258 -45928 -25047 -17286 -11105 -13114 -23252 -10943 -6007
22313 -6007 -5566 5224 3187 -9741 -17031 6372 -2777 -10450 -8637 -10184 456 6570 2080 -7248
22299 -7248 -23722 -22353 -3467 -3016 -8990 -9416 6606 17173 -5223 -12911 -1335 9815 7614
22286 7614 13235 12025 11618 7899 5252 -6554 -11611 -6851 -14433 -6303 1729 4929 10693 6018 15846
22271 15846 10153 10067 16857 13136 10780 10880 11301 -1252 -6062 -16347 -7374 3656 -3017 -11317 -8151
22256 -8151 -16932 -30491 -47355 -42179 -34245 -30459 -21398 -16581 -8353 -8595 -11486 -13555 -23479 -13599
22242 -13599 -7392 -14887 -20056 -6976 -5999 -5948 5606 -13633 -26844 -21268 -28957 -32954 -25838 -14549
22228 -14549 -5541 -8757 -16870 -29933 -21565 -5121 -5665 -6716 3261 831 -4787 -13679 -14551 -4528
22214 -4528 -5522 -1128 -4357 -11417 -14476 -1882 4981 -9358 -1522 9615 18933 32887 30681 25566
22200 25566 10240 -5794 -11416 -26385 -38327 -6830 -5292 -23930 -37101 -36019 -31477 -24580 -22547
22187 -22547 -17603 -1951 -859 21014 19314 16092 6627 9810 1683 11069 6446 -994 19686 12659
22173 12659 5878 8497 -365 -10358 -1765 -1190 -2412 9360 7447 -8770 6794 23642 11830
22160 11830 3617 -9236 -20138 -25011 -24514 -26019 -19411 -3538 7750 -3533 -11381 -27273 -41046
22147 -41046 -35920 -22837 -20209 -13263 -24604 -34177 -24006 -5535 12093 20477 10834 -1317 -17493
22134 -17493 -7497 14634 5342 -22441 -31648 -18596 -7035 -10250 -10400 -9716 -8616 -8281 -14407 4571
22120 4571 2351 -15445 -15779 -1540 7610 16491 12591 10273 3512 5521 15090 -3022 -3895 -3612 609
22105 609 -9360 -29037 -35294 -27668 -23466 -15446 -19976 -16297 -8177 -9399 -13313 -7449 -4954 17867
22091 17867 22867 18677 17103 7215 -1340 5743 11368 18371 12293 11858 -2099 -12663 -19564 -24846
22077 -24846 -18135 -12610 -10628 4412 6115 2451 231 6536 -483 -9779 -9066 -16814 -16065 -16565 -14445
22062 -14445 -8423 -11538 -7089 97 10443 -9027 -14503 -13070 -16091 -16706 -14079 -8812 -20958 -9934
22048 -9934 4204 14611 23849 8411 -1830 -9784 2764 -9657 -9727 -4043 1466 7172 -2280 -14885
22034 -14885 -6918 -16125 -17279 -12173 -11957 -6628 -3540 -9465 -22226 -20049 -17198 -24563 -30571 -19554
22020 -19554 -14650 -11547 -11828 -12801 -15732 -9581 -9120 14961 17218 139 -7233 -6367 1509 9505 -4343
22005 -4343 -11049 -13960 -23371 -28928 -35663 -25408 -6652 -7107 -7261 -15693 -26648 -31076 -37131 -27360
21991 -27360 -4340 1895 3639 6865 1472 -4342 -758 436 4650 8554 7677 8508 4105 11498 -1768
21976 -1768 -6893 12306 11798 11903 9157 4700 4143 -2406 -13631 -1385 -13111 -10941 5076 13993
21962 13993 17100 14337 -4901 -21534 -18034 -7018 -11362 -13689 -23059 -12416 -15816 -4292 3601
21949 3601 5638 -523 -6035 -8996 -24557 -25148 -20035 -29042 -35564 -31376 -22518 -14765 2783 11657
21935 11657 19050 20788 14240 -5600 -17557 -25584 -29212 -25037 -21263 -7592 890 -5276 -13481 -12044
21921 -12044 -18899 -19572 -27342 -22583 -15300 -22861 -23473 -16165 -14913 -17052 -21125 -24294 -14195 -2246
21907 -2246 -12950 -6906 -7221 -26306 -24177 -29051 -6169 9891 9983 2141 -16730 -19864 -2616 21
21893 21 1203 2048 -2832 1445 18761 12028 2122 1800 6002 1822 2954 794 -4288 -8501 -2771
21878 -2771 9864 9739 -9764 5684 17732 10603 2827 10639 15156 1972 -5584 -3175 8887
21865 8887 14147 16459 3333 -5493 -8263 2042 15555 5825 1634 -798 -2134 -7784 1100 -10129
21851 -10129 5620 11657 959 -8900 -147 -6042 -8003 -2041 7396 -7213 -7326 -4284 7101 6407
21837 6407 6694 -7588 -6668 -5412 -7669 -130 -5958 -11406 -16772 -12712 -17067 -21474 -25301 -22610 -11782
21822 -11782 287 -1257 1249 -11057 -22018 -16059 -6734 -9792 -28774 -31055 -26353 -29487 -23006
21809 -23006 -21095 -8871 -19218 -32952 -37380 -39323 -36759 -12676 -12340 -19904 -18071 -12679 -11178 -11207
21795 -11207 1283 -2790 -24952 -33468 -34848 -38386 -34116 -35281 -39464 -24665 -1702 593 -19187
21782 -19187 -24604 -14207 -2049 -8873 -19232 -17971 -10113 -5337 -2567 -1918 -5963 -12099 -9191 -12840
21768 -12840 -8368 -5431 -13844 -26449 -22119 -19065 -6092 -3920 -932 4335 -419 -4036 -11400 -27549
21754 -27549 -22008 -25137 -25683 -24063 -25731 -26132 -21125 -5824 -10234 -9281 -3116 -4441 -11132 -8644 -9848
21739 -9848 -11623 -821 5530 11317 8891 3150 7343 3247 -497 2985 7321 -4387 -8582 -11410
21725 -11410 -5861 11705 18256 24498 15186 4224 18675 17315 19386 12705 7253 9018 9834 8207
21711 8207 -1014 -5498 -4640 -4744 1951 7017 4762 -6263 -8353 -12503 -28473 -25570 -4136 3398
21697 3398 5115 -2768 -31361 -27791 -15543 -7261 -2284 4478 -5624 -10988 -1029 4624 -4451 -10362
21683 -10362 -11390 -15671 -20309 -28140 -28033 -12953 -7517 3418 4518 3924 -14630 -9929 -9136 881
21669 881 800 5896 21138 26304 26827 17635 6340 8060 -4929 -9236 1933 -2574 -4016 -10520 -16991
21654 -16991 -16958 -6132 -1052 -4227 -5655 -7538 -14649 -18102 -24465 -40100 -49395 -31359 -11029 4027
21640 4027 7425 6686 8810 -777 -8088 -23801 -22753 400 -2475 -923 -2978 1625 12828 7131
21626 7131 4915 4543 31045 23258 24804 23609 7825 -2769 -20712 -15004 -19148 -22713 -2412 15008
21612 15008 15598 20216 13345 -5949 -8549 8433 24119 32972 17953 4748 743 2518 2667 -4179
21598 -4179 2087 3513 8852 -1028 -27863 -9605 17658 29977 7927 3450 -2177 -1180 9860
21585 9860 11298 8698 5619 4650 6054 7612 -3643 -14050 -16263 -22638 2173 19591 17657 14615
21571 14615 7005 -400 1192 10724 23210 9813 -4417 7874 23307 16097 -1121 -12247 2147
21558 2147 -206 -1982 -4072 -4631 6389 25191 14275 -2052 2707 4534 3783 329 -6773 -6151
21544 -6151 9538 3709 -1606 -1965 -4907 -7085 -12214 -6326 -8940 -10563 -22765 -6883 15120 18339
21530 18339 8932 -5385 -11429 -7135 -17587 -2138 13295 14878 15120 15669 10428 12363 9272 341
21516 341 -22 -2485 4481 18434 24745 7447 1675 5568 3104 5863 1566 -6971 -3377 9634
21502 9634 6949 10043 12609 3825 -3743 -4874 -8569 6497 6624 2758 -1337 -9064 -5563 2430 30
21487 30 -670 1610 1078 -14419 -25563 -25327 -3506 16324 24373 4855 14493 14831 16023 20941 29255
21472 29255 26338 40835 28957 19760 19419 23119 13684 3767 8240 -450 12597 23443 37183
21459 37183 37779 39595 34936 31522 20055 32823 41872 51896 45108 47460 75109 101596 129044
21446 129044 161561 175802 196696 224166 234309 213626 194725 193057 188201 171478 154131 154551
21434 154551 146629 152167 183665 208847 226245 226031 237580 244486 232880 219897 216029 209194 181130
21421 181130 157121 146849 108368 86486 80733 83785 66702 55118 45362 47622 61691 53439
21409 53439 48189 44163 36275 30144 28215 30911 27655 29826 42543 56108 70513 75913 42329
21396 42329 21101 32409 40433 36002 35457 33841 35848 28429 16632 10693 11100 10336 10921 14811 7341
21381 7341 13095 14980 15416 19303 16324 15951 16282 17676 13394 17480 27711 26001 36649 50793 49746
21366 49746 28598 5101 1972 14779 22120 24075 15568 13777 29186 35572 18300 9007 14442
21353 14442 31390 23399 10716 -4100 -575 4511 -837 4833 -1240 -13784 3434 15657 13014
21340 13014 6057 11133 8966 12494 13300 6561 2379 196 5223 22952 29333 31036 19689 19022
21326 19022 12755 13156 12154 11794 8074 4093 8386 15707 22051 6793 -3174 1389 13629 16399
21312 16399 15334 12709 12926 6433 -1919 -5190 -7947 -13855 -22309 -24140 -16024 -5756 -3382 259
21298 259 3028 3557 14292 13966 6408 8327 1275 -1934 8174 26055 26680 13624 8430 -4673
21284 -4673 -6608 2015 19791 20390 18488 16411 14750 11747 11529 11865 19995 26228 27573 16262 15345
21269 15345 15706 15750 23986 11680 7553 17640 25623 18551 9691 21118 39974 44184 60663 68257
21255 68257 58864 45645 38030 34799 21218 17814 14055 12880 14465 17645 12105 25248 26765 17097
21241 17097 -6151 -7074 -373 16260 14506 20599 12221 -3717 4022 9541 12392 8957 7779 7564
21227 7564 17329 24576 18971 21664 33541 13083 -7785 9426 5537 207 6347 16216 21660 14742
21213 14742 7234 10895 21957 9586 4875 11490 -3473 -7142 -1927 14622 18739 7554 15173
21200 15173 22533 17788 17744 33901 37470 31551 30446 27738 38808 33808 16710 12634 16358 22372
21186 22372 31455 28804 31552 17881 3991 3116 22994 37638 37235 38472 34399 26530 24510 20848
21172 20848 14915 15472 15849 17441 15477 3223 -5630 -2559 693 -810 8209 20221 18033 22895
21158 22895 14862 6610 2405 18157 24355 23022 25350 25276 26521 21095 15505 19328 22330 23678 26863
21143 26863 21071 7561 9345 20003 23689 14834 14759 24341 38759 45893 42177 38649 16656 17341
21129 17341 22601 11005 25160 30857 16373 -1997 3321 25891 44199 30220 32185 41237 42286
21116 42286 35709 36680 38327 33048 31186 27655 34124 50206 68677 68462 54251 44365 36745 31331
21102 31331 26097 49627 54484 64577 71123 52823 46662 36483 33798 43019 62013 68092 45744
21089 45744 38972 44095 62784 69591 54963 49944 43271 28238 35821 47283 34168 34565 34303 35143
21075 35143 27505 26403 12450 8797 13461 22268 32863 29275 19288 9848 4330 15352 25396
21062 25396 33846 49239 42477 29125 22667 33078 30256 32959 41396 46760 37208 29105 39360
21049 39360 48728 59892 67715 72907 83039 85665 76901 69466 59399 59160 55347 44461 33429
21036 33429 35167 42915 59201 60882 66717 68685 67120 67071 66306 54634 31416 26215 40517 49643
21022 49643 59232 49749 49269 57742 58330 64218 74053 76545 78333 82745 101325 97597 86397 72632
21008 72632 80515 80742 79451 79534 79350 89169 94778 108305 119270 125374 127832 144485 152162 164651
20994 164651 198178 222275 237267 262979 268870 273308 301806 354514 422589 507286 580013 649267
20982 649267 748978 837784 873449 847462 830345 831543 834651 787125 725901 679861 664207 687343
20970 687343 738405 771058 824834 888365 946506 965274 933640 885325 843788 797996 712985
20959 712985 618957 537206 484330 459795 421894 389410 346607 318779 301392 295355 298369 300141
20947 300141 290148 280142 273676 265518 264069 269742 263391 254593 266380 251874 240763 235520 236717
20934 236717 239121 244361 247303 233743 234651 243309 243435 250675 254143 251316 252012 265627 276395 276668
20920 276668 276415 277232 284349 292398 309258 313685 307178 310910 316308 321205 320082 332148 333486 334274
20906 334274 348351 378210 406190 428709 452480 480761 506066 539366 589309 621943 650483
20895 650483 669640 667861 677013 696010 707321 726218 731498 768370 814358 842763 895732 950473
20883 950473 1019217 1083398 1135758 1180127 1242147 1320850 1414911 1514897 1626262 1763968 1920685
20872 1920685 2083234 2255428 2446702 2650996 2877691 3173141 3541392 3995022 4626824
20863 4626824 5510549 6776882 8637705 11366810 15084773 19338850 23350988 27322253
20855 27322253 31942904 36556550 38916468 37941990 36058713 35163223 34319221 31776807
20847 31776807 27750613 24645206 23784654 25117019 27815950 30676509 33612992 37314358
20839 37314358 41297461 43336383 41832186 38939035 36972390 35284852 31923020 26507598
20831 26507598 21174968 17300135 14681305 12838412 11464239 10411862 9553494 8820611
20823 8820611 8201654 7705543 7279342 6906054 6578581 6274132 6006849 5764628 5538509
20814 5538509 5300687 5068226 4849927 4661780 4473115 4277063 4079882 3905997 3766605
20805 3766605 3632570 3497647 3361303 3248807 3163837 3085588 3003146 2938121 2868968 2809077
20795 2809077 2748043 2645552 2547956 2451996 2355240 2261206 2165023 2068918 1988995 1915896 1844588
20784 1844588 1784875 1731594 1674598 1616685 1558606 1512256 1454527 1399020 1372909 1327959 1281513
20773 1281513 1245211 1211903 1157310 1099466 1060429 1017104 999217 972271 943111 918266 902554
20762 902554 872174 848241 846298 829670 802024 768165 752179 740953 722064 719373 706310 684584
20750 684584 657894 637673 600537 559823 533588 526154 534678 520851 499731 499437 476806 448123
20738 448123 426431 405488 385761 362106 329821 310499 305539 295043 283643 282934 278970 252762
20726 252762 236316 233617 232922 224092 210793 197290 194872 190540 179234 151422 133742 144697 149977
20713 149977 145565 156768 149396 148425 141795 145684 153770 130784 117953 118648 130910 128093 116636
20700 116636 123530 141746 150911 146051 132658 121155 123373 127260 115556 108407 109439 114661 116196
20687 116196 114932 126653 116591 103794 102563 93489 76282 76256 65797 53947 70551 87710 84693
20674 84693 83930 93358 81299 77968 93078 95488 115410 137205 151854 139295 120544 102221 96898
20661 96898 92526 93175 101191 97849 93561 87468 89541 101143 102821 95184 78765 53926 50428 71332
20647 71332 74725 73691 69920 64172 64805 76862 85523 78765 60360 64721 60766 56033 68350 81752
20633 81752 70134 70238 66665 77941 82671 73435 80924 79215 67271 61021 57469 70688 58176
20620 58176 61367 79766 86785 83583 65271 61542 60301 51572 56283 63846 66250 50331 50606 65790
20606 65790 64242 63581 54489 46542 39453 44552 66345 73396 49030 34453 40301 45431 41256 25616
20592 25616 36242 32883 38291 26101 13235 6841 -3487 12346 23353 21703 19743 29531 38477
20579 38477 33103 20159 28912 31177 21530 13000 -4954 -6212 16891 24209 23858 39275 46718 37608
20565 37608 24470 44074 26733 10942 -7373 -4500 8721 7187 8753 17746 18413 62 -10495
20552 -10495 -1122 3889 6006 -3356 -16048 -22016 -18521 -13003 -11899 -3791 -2209 -697 -416 -687 4608
20537 4608 2615 10796 16886 4827 288 -4924 -2028 3953 7955 28297 43186 31703 -1733
20524 -1733 -564 -723 5820 9388 3363 2078 6560 10951 23758 39247 38197 33250 24557 13145
20510 13145 10346 6645 8153 13822 10659 11111 -488 -6688 1082 -5046 -12484 -18101 -14946 -6391
20496 -6391 6402 11677 9710 354 -5952 -21404 -18605 -1781 8018 15570 22397 13188 12065 5119
20482 5119 17781 7771 -16567 -27906 -37365 -27684 -11094 5097 29050 21445 -7337 -2198 13521
20469 13521 12800 14398 20404 23405 34503 39296 37789 25249 26466 29063 14460 12364 23591 24857
20455 24857 28059 28405 21340 16078 16506 17665 39689 39124 15249 -2959 -8118 -4832 -8944 4363
20441 4363 10593 5197 -11399 -16384 -20428 -15146 -11343 -17546 -10414 -4970 -9563 -23790 -19297 -14042
20427 -14042 -6668 4372 4690 3226 3091 1847 774 4374 952 1893 10167 18198 16262 9135 429
20412 429 -607 3710 14598 9316 6696 6119 12201 6943 -11984 -18981 -4365 -8795 -3045 2846
20398 2846 2105 15254 28009 21103 20070 15096 1808 -7681 -12795 -15916 -424 18892 32339
20385 32339 20413 14806 22697 9223 2317 4785 7776 20976 39224 46638 34329 26318 19430
20372 19430 25983 38563 33213 20664 3518 4224 -3323 -7394 6240 2433 3702 12980 9247 4846
20358 4846 -7564 -16841 -16236 -11112 5730 1712 5776 18245 21657 15892 18533 13931 29892 32893
20344 32893 20788 15415 14338 1735 -16055 -12974 -6789 6799 13568 8348 11299 18401 14692
20331 14692 3919 -7359 2467 13292 9325 3531 -667 6770 6030 6272 6469 -8392 -1237 16836
20317 16836 27224 42237 19410 13436 14398 784 18658 23202 12293 1090 -622 5664 -8177
20304 -8177 -11825 -3605 13040 19812 20721 27957 21322 9593 3855 714 4483 9645 11881 5788
20290 5788 12311 24281 32394 36028 21308 16139 5186 12672 15649 23396 15687 7172 9059 6008
20276 6008 10462 16871 26029 40182 40703 40881 29428 21962 16696 36883 58037 68681 79033 98485
20262 98485 112885 135340 171866 195417 213106 214740 227784 221709 221343 209529 208835 192715 171339
20249 171339 162590 160022 171244 181888 217087 241884 239975 255315 254183 250849 235295 213307
20237 213307 187414 167851 137951 125568 120607 102656 95547 101237 98181 92593 84820 91651 100535
20224 100535 112855 119456 125394 134263 166115 180309 180366 144677 116970 98878 89565 86087 79647
20211 79647 69892 87321 97006 112224 132966 148503 153488 172251 179416 143335 110190 87647
20199 87647 66865 68375 87630 81143 58600 56099 52355 48896 36946 46607 47820 47062 39198 29132
20185 29132 27473 39967 38600 41528 35922 27140 22303 6540 -5330 16455 32338 34047 55327
20172 55327 78280 104151 122743 134272 142620 160513 151450 133999 105435 78921 77962 70590 71552
20159 71552 78561 88323 100779 123396 148412 154073 151160 172947 206722 191150 150566 114952
20147 114952 78253 59541 57426 42442 35033 53314 59482 46078 36921 45404 51481 55604 53977
20134 53977 35532 36761 37353 40757 46382 44259 46054 41159 40807 58763 85823 97473 112002 111240
20120 111240 113912 107643 90439 95523 93294 92627 108395 120218 111950 127137 134575 133510 132889 135641
20106 135641 119788 115956 104609 79929 77695 54754 45134 38135 44951 49886 42922 70170 109047
20093 109047 136421 138791 133414 123519 107582 106996 100163 92405 84194 89070 86442 97372 93860 100197
20079 100197 113652 121989 115949 110762 83354 56998 57130 49779 51939 64749 58121 52362 39380
20066 39380 29060 13562 3821 1314 -5914 18194 28698 41349 38901 23182 22338 20355 23058
20053 23058 33002 35266 37047 47871 48324 41489 44206 45099 41357 32659 22402 25038 20082 27397
20039 27397 25771 9527 20272 22825 21512 24143 34941 39487 44687 26669 28101 21086 16400
20026 16400 12614 13758 17209 6846 8551 9615 15733 19273 43294 52048 56258 35584 29733 17712
20012 17712 12795 8539 -851 -23141 -24522 -14713 21572 34165 31503 21344 27791 33654 15900
19999 15900 1643 9608 29463 43304 27953 17841 8894 16329 14786 3253 -4685 -1278 -11410
19986 -11410 -10111 -4769 1871 4177 7310 16260 21414 21353 23263 15694 12848 29001 26802 15784
19972 15784 16363 11442 4687 1108 17457 24221 9665 703 13249 23391 9278 4309 10187
19959 10187 2330 10751 21863 18722 30020 40981 31945 29925 29318 34671 25208 10626 9093 11308
19945 11308 14257 27384 36300 36707 30805 29296 32950 35894 32222 21782 16732 31913 50425 44088
19931 44088 25313 22330 26764 15633 17132 8793 15027 26106 33559 29226 35487 47991 51175
19918 51175 49297 43214 32974 36035 37301 38402 19962 29454 27945 12623 19691 17168 11105 19790
19904 19790 21984 27514 29160 39484 54279 47791 38005 43086 42527 40944 34928 27630 37369 46812
19890 46812 41025 35817 46056 33738 22374 39878 42462 30884 30184 19837 13188 12905 25970
19877 25970 31720 2001 -13794 3258 24083 31799 33351 26400 27682 42141 25688 32500 32590
19864 32590 29593 27245 33987 33953 25959 35021 39083 41022 34778 21016 18289 33064 35559 31668
19850 31668 39346 47649 37545 34335 36365 37954 41675 45481 52584 41684 47728 59301 62114 59557
19836 59557 50594 61724 79906 69851 64178 64103 78470 88567 84810 71053 75276 74828 74513 81405
19822 81405 81754 75943 75227 75440 74512 80253 85995 100208 104485 90254 96254 104734 102485 110996 134921
19807 134921 149307 153221 163670 180195 226290 297110 356876 435285 491286 531670 580523 633990
19795 633990 607381 507439 409336 339996 299963 272564 257057 276532 330965 402296 482403
19784 482403 527611 573719 624186 648193 620286 522654 421316 346142 288502 248609 229318
19773 229318 216891 209639 213899 215644 207248 197674 202184 198569 209630 219372 210306 213496 224936
19760 224936 225993 230766 224325 243391 266154 272957 276845 305738 334944 362090 404969 472697
19748 472697 566378 643226 689612 731475 775018 776834 718516 635833 556593 501099 471668 465210
19736 465210 479906 506766 548184 623187 722515 792483 837127 878817 914846 896950 813638
19725 813638 741236 695145 672793 642617 607675 590349 588695 599309 645660 689523 729874 793441
19713 793441 869755 949004 1021033 1081964 1150292 1221373 1273420 1313873 1392825 1534432 1723444
19702 1723444 1951653 2223289 2594877 3170427 4045906 5441225 7790369 11534802 16108912
19693 16108912 19461978 21669046 24373904 26922886 26385717 20912504 14954887 11406301
19685 11406301 9599336 8793337 8714342 9382083 11008837 14017790 18079466 21255664 23105855
19676 23105855 25279232 27563858 27312518 22222861 15870011 11773475 9436023 7984206
19668 7984206 7002364 6319509 5820537 5416785 5076467 4791633 4584484 4425647 4284992
19659 4284992 4174668 4110265 4089381 4061342 3985394 3888423 3830571 3828386 3891319 4007954 4175231
19648 4175231 4413175 4789858 5437350 6508360 8271772 11230951 15696215 20380854 23311625
19639 23311625 25662276 28678769 30641365 28129246 21315019 15657685 12521889 10929026
19631 10929026 10297627 10441705 11443134 13617337 17340680 21639613 24417795 26313177
19623 26313177 28813527 30711319 28709431 21924851 15618882 11878811 9730517 8353553
19615 8353553 7411561 6732924 6190611 5725558 5329089 4995676 4700222 4436415 4191571
19606 4191571 3982890 3823269 3673872 3550292 3401238 3217596 3063618 2934678 2810510
19597 2810510 2708347 2616313 2523814 2445843 2397288 2366447 2323192 2282318 2234519 2181262 2111697
19586 2111697 2029513 1949305 1874419 1804044 1742258 1699521 1642237 1590335 1548538 1514694 1500065
19575 1500065 1487439 1458013 1424318 1418322 1394863 1348919 1289061 1216442 1140748 1092172 1037854
19564 1037854 989184 949265 920807 890955 856836 827286 809809 773136 733540 701994 656163
19553 656163 612400 618760 619856 603630 586532 572426 558221 536872 523369 507885 497217 474975
19541 474975 457670 449747 444612 430445 418901 406591 395219 356277 340830 348085 348122 354943 339868
19528 339868 322654 320971 335649 358752 368111 367087 373610 355515 316429 291970 251291 211717
19516 211717 224049 223706 218387 224853 246677 256611 255973 273120 252656 209028 186597 172376 170389
19503 170389 168223 148397 135473 125723 109088 104112 107102 117928 134908 132781 122815 115882 117814
19490 117814 120758 120713 114177 109728 100487 87909 93980 93642 92221 98976 98023 100908 101818 99958 94367
19475 94367 76132 69380 68598 76401 76484 76437 90417 98291 88962 89197 100463 88248 74012 70186 60776
19460 60776 64195 74554 78714 88320 89490 96128 82504 55224 38073 60113 69290 64727 70024
19447 70024 73108 67509 59845 60725 46595 51719 59925 51252 41651 40718 43018 47451 47865 45672 49811
19432 49811 65496 55248 22310 9923 20317 26246 48802 72326 68771 54450 39778 35498
19420 35498 41105 40167 31699 31695 37539 50838 46703 39653 36529 36512 37281 27577 24229 21359 24405 26702
19404 26702 35889 34770 38110 48000 38854 26512 30513 27111 31363 38140 33718 37984 41533 34432
19390 34432 27641 23243 11275 -1666 14773 27716 21396 17325 25187 34738 23310 15884 13396
19377 13396 13084 5493 5761 24154 46069 35186 8108 -9102 4770 17914 15143 3072 12359
19364 12359 18622 17462 20546 5490 16088 25164 26378 16579 23898 30195 34991 31721 27591 25593
19350 25593 13032 21714 12635 3592 7803 3618 -10211 -15483 -20512 -20678 -11579 1156 1895 -5929
19336 -5929 5636 20692 10666 9083 14057 2836 4646 11889 16756 20715 12433 7827 3244 13639
19322 13639 414 -9925 -5336 -10271 -6302 -18750 -18677 -17121 -13842 -2694 -20282 -28719 -20199 -9804
19308 -9804 11961 34264 33019 36532 28257 18978 15155 -7188 1662 9827 8540 3638 -9104 -11028
19294 -11028 -18564 -19590 -10141 -9069 -9362 -6157 -6667 -18292 -7322 15590 15263 26242 34614 26229
19280 26229 26358 5566 -19332 5830 9459 -1826 -5350 4642 6053 18631 36277 32263 27153
19267 27153 15515 8971 7143 11730 21902 24547 5917 -10982 -21325 -15132 -9012 -5895 -5909 -14130
19253 -14130 1411 2091 -5717 -1046 4502 7306 12926 10126 12652 6425 9860 475 357 -5341 2743
19238 2743 15150 9515 3228 3566 9491 6867 710 -3821 -2246 -19501 -16700 -18388 -14228 -4973
19224 -4973 -1463 -383 5308 -1141 -5499 -12157 -5347 -651 -3502 -11055 -11439 4745 20287 17608
19210 17608 16580 16377 5874 -8608 -1398 -3549 2136 -5045 2353 12972 23446 26982 25851 33765
19196 33765 28429 18949 6433 2309 -9739 -11937 -11019 -15039 -6837 5295 1846 2689 2561 8595
19182 8595 9227 -3774 -6878 -6642 267 -1846 -13048 -14637 -6030 7102 21640 23519 21685 16307
19168 16307 6964 17600 21107 24434 15886 8104 3106 22804 51235 72588 82365 78072 98367
19155 98367 123500 127883 110562 83506 74200 74568 59713 52623 42312 72299 79708 90916 95968
19142 95968 107162 127541 132256 134680 135614 106000 78191 66668 49923 40945 34066 26630 14551
19129 14551 3930 10078 13942 25859 26225 21999 21670 27518 37392 24882 29364 39476 49699 52800
19115 52800 48556 53373 45672 33842 21543 19284 41076 77613 93505 113386 115821 116757 141271
19102 141271 161286 175437 165757 133045 103479 81534 61790 47025 60181 81799 80910 99784
19090 99784 122576 133750 149193 169784 163928 146768 122561 91000 77341 82597 93074 106458
19078 106458 121277 132427 132588 121031 140123 148560 138904 120852 103940 83101 65710 48283
19066 48283 65153 79007 86311 92719 103395 127720 142455 153534 157779 146684 138441 116494
19054 116494 100892 72629 55358 34660 23675 26155 29529 36890 34762 27960 16354 14753 15527
19041 15527 7879 92 15349 29971 46041 40135 35244 33210 27638 17631 22379 27999 25795
19028 25795 29322 41010 48535 41532 38122 35380 29168 29606 38308 58435 75856 91324 111051
19015 111051 115968 111588 106000 104478 86326 64308 63088 61374 57216 56860 67677 76305 90792
19002 90792 110907 118618 122930 133839 159148 166288 153188 125460 101637 94696 80057 63370
18990 63370 62027 59720 67540 59717 54057 74214 64929 46773 48280 37060 27076 24307 20150 23923
18976 23923 31166 39845 32249 15555 249 8265 2986 -17758 -10915 1742 7890 25177 23587
18963 23587 26060 29244 27861 27791 16489 1339 -14746 -8424 5362 17345 30768 33307 19790
18950 19790 23938 19096 16357 2273 6799 21683 24223 18579 22453 17375 15877 21326 34270 28302
18936 28302 25648 40938 37518 40964 52321 65272 84505 109728 122920 153927 198807 232613
18924 232613 246976 249611 224121 211579 208236 195645 151108 119373 98216 87390 75369 75825
18912 75825 78458 63469 44190 44943 60218 66096 57308 47394 52055 50509 40623 30756 31831 41150
18898 41150 50851 44059 45343 52246 44494 40810 34444 44620 51690 29766 8943 16182 21160 36224
18884 36224 45659 43908 46822 42421 30824 41255 67095 95207 113456 133473 151332 168657
18872 168657 197828 219076 204342 185270 181223 181281 166865 127124 97623 86009 73680 58579
18860 58579 54160 49215 35431 30210 33270 41141 39295 41771 24472 19912 27243 20124 12215 12020
18846 12020 19240 20866 25923 35048 37332 30829 27745 15352 9121 -8684 -5251 -8668 3364 15441
18832 15441 25577 21632 19773 25983 20370 7163 19058 44283 50325 46641 35630 22783 12455
18819 12455 18283 23229 28847 34186 23340 13172 4775 11116 16063 10965 5735 6346 9330 4702
18805 4702 11762 11982 25199 14171 14311 13106 5597 3290 -11884 -9486 -14536 -24471 -27547 -22774
18791 -22774 -17191 304 12775 2668 5398 9931 7315 15235 6905 13992 11371 12454 21640 24958
18777 24958 26726 32869 31152 34697 18768 17113 43634 64846 79306 84224 78600 89876 105366
18764 105366 100024 68612 44411 45243 54103 40045 21504 28590 47330 37374 31270 38525 44618
18751 44618 33229 15823 16200 18945 18790 14225 30584 21208 642 12426 23214 7351 -4253
18738 -4253 -12576 -2145 2999 -6797 -5932 -4875 -13121 -14521 -8309 5031 12963 1463 -17050 -30510
18724 -30510 -27700 -9215 9266 3102 -11546 -13464 -15981 -12682 -9198 -19430 -12537 -12517 -20119 -28103
18710 -28103 -17425 -7950 2366 6667 -9579 -16886 -11599 -13739 -12211 -1725 15 10238 10429
18697 10429 22360 31328 29100 17569 21627 26353 16125 13365 27947 32495 36557 33483 27465
18684 27465 27847 32528 20906 11548 1488 2502 3264 13853 20882 9564 6678 11651 12591 25673
18670 25673 27192 28415 13021 11337 12197 2566 -1457 3155 7739 -4042 612 1398 -12727 -26918
18656 -26918 -20807 -8143 -7230 -17191 -17274 -5150 -715 -4060 -7365 -9616 -10953 -10956 -1658 17039 29214
18641 29214 30649 38212 40829 44568 25181 6633 14354 20912 18259 5512 20293 46166 45874
18628 45874 33430 37537 46129 38215 33952 12050 2571 8119 11552 27144 31397 34010 28099 37202
18614 37202 40117 26732 16740 11231 27789 45529 26802 32145 40547 30815 18210 13813 12281
18601 12281 16166 13222 21551 27359 32790 33102 30714 28252 26910 27663 17701 12755 22252 30744 39619
18586 39619 19770 12254 15473 29070 30622 34325 28800 23726 42929 56544 50298 47225 55551
18573 55551 50950 50818 73288 83630 53391 50536 38137 29021 29899 21859 11914 6451 -11268 -5453
18559 -5453 7074 15376 13475 25009 28201 35260 37230 37707 30504 32903 14652 8444 -1838 14134
18545 14134 26802 36179 42385 33006 31627 19508 17815 24772 46155 63555 65846 59279 67216
18532 67216 63492 63164 74925 94202 116486 135096 141068 141671 133914 123978 115164 105744 110828 120010
18518 120010 96555 82369 77074 81731 76311 76046 85037 90261 91576 97162 111022 117167 101903
18505 101903 120491 132422 113525 98225 91738 93102 80425 86039 84603 69426 69314 79803 98986
18492 98986 104973 110652 98533 102449 101303 91988 88358 97844 106041 122390 122446 108259 89943 75946
18478 75946 96704 112041 112957 135557 158214 168475 191756 219981 226827 215911 213082 223252
18466 223252 207217 184628 165095 167716 156670 156057 158351 148497 161027 163101 169524 176103 181375
18453 181375 191663 193484 185943 181647 173429 165196 175994 178979 175810 198771 197112 189517 197872
18440 197872 197205 203064 207705 214225 210804 220897 220131 218955 219985 237742 272889 294985 300581 304392
18426 304392 325286 373457 421190 468745 539472 633041 709810 804476 930127 1030244 1095564
18415 1095564 1113208 1090288 1083117 1077779 1022417 929663 874855 862922 889319 924162 963199 1022225
18403 1022225 1081275 1151448 1241340 1335505 1410756 1501993 1620185 1771556 1915841 2097667
18393 2097667 2365222 2722954 3227153 3951086 5030090 6733964 9489842 13834539 19431742
18384 19431742 24279158 28401033 33983929 40940196 45375225 42992415 38545458 36972671
18376 36972671 36587133 33340525 25704184 18600729 14279709 11730382 10083954 8951382
18368 8951382 8137175 7516679 7028534 6621242 6280053 5943992 5601756 5330812 5136607
18359 5136607 4929786 4655382 4394328 4203076 4050232 3907832 3771956 3639906 3552032 3496108
18349 3496108 3475481 3465467 3430234 3403492 3424850 3479275 3551983 3661199 3808291 4028121 4348876
18338 4348876 4824584 5527640 6610852 8370447 11304291 15793354 20888411 24877085
18330 24877085 28888825 34590631 40780425 42915666 39118673 35629595 34828533 33990632
18322 33990632 29424197 21882370 16140660 12745068 10640868 9213643 8181388 7387027
18314 7387027 6753299 6228538 5803354 5416574 5074741 4781645 4559020 4366300 4154092
18305 4154092 3942183 3770275 3614592 3450041 3258181 3093952 2946775 2802002 2682036
18296 2682036 2578769 2475691 2392558 2310037 2229924 2164347 2095442 2030831 1968048 1919050 1878919
18285 1878919 1826633 1762779 1712967 1675089 1621990 1567110 1501755 1430671 1376218 1333871 1295708
18274 1295708 1260139 1227723 1188960 1148383 1114422 1077027 1039623 1006865 958333 918323 886907
18263 886907 852330 811212 781665 758434 733228 719440 714432 707166 701117 701270 704183 688161 644642
18250 644642 604669 570615 546731 519044 505076 498355 480607 458471 447609 432830 426155 421977
18238 421977 419250 419190 424690 436025 447550 454451 430650 402649 392934 400433 408313 412107 421930 420235
18224 420235 412501 408887 396071 361368 310243 274969 261848 244919 225326 218097 219312 211309
18212 211309 204425 215991 216378 214243 217686 209514 194368 197677 217440 227842 207579 179118 172114
18199 172114 168364 157238 156060 153999 164965 167822 158012 150592 153469 153647 164873 174385 165680 158285
18185 158285 157839 154204 145091 147645 158871 158371 153933 168074 185315 189978 193342 190057 179286 152934
18171 152934 134004 119831 119641 116243 115840 120628 133341 139234 130244 128611 118341 100739 91156
18158 91156 96356 97625 97970 120467 116241 111061 119478 132503 140290 152152 150418 149659 150748 128678
18144 128678 121385 108015 92415 112089 144220 171842 190106 195493 202711 207738 232031 249780
18132 249780 260353 268278 294609 311990 330283 353352 383465 415865 455496 487871 514880 575400
18120 575400 648154 754097 906568 1096855 1376016 1832940 2570780 3865547 6105992
18111 6105992 9058812 11120007 12251908 13901511 15724639 15582051 11756509 7559464
18103 7559464 5166734 3916025 3217445 2775346 2440090 2190325 2004335 1819863 1657555
18094 1657555 1518117 1413799 1334564 1247427 1175734 1123486 1079426 1051187 1036776 1018770 999389
18083 999389 954539 908880 862327 828031 793728 757852 738905 714682 694303 677513 660997
18072 660997 645986 644618 638472 609140 572366 550831 524167 496605 467052 442688 426311 416389
18060 416389 399445 391405 379366 353349 335685 351041 351163 341335 308784 299146 308576 290685 276858
18047 276858 272185 278273 264301 257540 256126 275552 313000 350330 369660 375982 389976 392909 397410
18034 397410 383982 346853 313602 298268 283274 270992 239197 218867 214070 210102 201071 175459
18022 175459 163858 159389 150530 134668 137529 142260 127870 134111 133725 137053 115596 100063 108429
18009 108429 116006 107922 101835 98907 84038 72127 86999 91895 96795 98100 102717 90456 76519
17996 76519 78799 93272 96219 102995 105315 72712 62496 57864 47033 54855 53822 52501 57138
17983 57138 68344 73057 91456 122576 135913 145214 170071 208434 222969 243582 275163 296782
17971 296782 316328 333312 340860 355855 360691 369693 353762 346275 329476 282825 243150 240804
17959 240804 212116 177421 159561 144931 142157 128151 132256 124892 123683 107762 104235 98703 109719
17946 109719 99309 74689 78231 86716 84326 70018 80017 106185 114338 116784 128330 146014 147801
17933 147801 139753 139630 159517 170680 161053 175112 181667 191713 194050 211207 210434 211237 211939 198150
17919 198150 208212 208620 206367 200205 175114 158505 136577 132862 136919 125600 106551 84828 64821
17906 64821 63733 71751 90221 93384 79016 57528 55688 60061 52098 64586 70754 63299 45983
17893 45983 33390 31322 33220 28755 14151 13156 20057 34283 33892 16919 2919 -295 25177
17880 25177 50487 45546 40680 42394 31028 24725 24862 19902 30355 34718 36324 16028 4603
17867 4603 5882 14818 20285 19546 17274 10477 20195 20346 27391 34762 27940 10665 8044 -4071 3978
17852 3978 10313 8760 -9992 -8627 2397 9246 17941 26877 23607 26377 38742 41350 51238 54924
17838 54924 55029 57580 65413 108159 147611 177571 197193 211418 233167 240985 230760 219219 210692
17825 210692 190754 161981 116327 75102 48049 42635 29308 4353 1967 5965 19280 31492
17813 31492 34559 31879 32070 21871 7210 18746 29524 37962 39415 30900 30620 30731 32728 15224
17799 15224 -165 5788 11600 22299 17453 27677 24907 17155 20148 19563 24398 24306 19799 20415 40764
17784 40764 48454 63845 95115 121858 148777 177556 196432 212657 198776 197341 193212 207663
17772 207663 196154 147004 121137 100888 80557 73260 54273 36088 15951 -4170 4017 26232
17760 26232 12524 12233 5616 -2299 1210 15834 15265 6570 2927 -10791 -6556 7065 5401 26580
17746 26580 22593 13058 4306 6206 14336 14139 5865 7750 13153 7745 7020 6589 -448 -13605 -13787
17731 -13787 -11437 -10518 -6646 13884 19988 30573 22754 798 -9769 -4945 -19729 -21718 -5963
17718 -5963 13954 14933 8980 -7674 -8512 -2047 -8687 -12709 -20695 -17710 -5971 -4986 -1505 11955
17704 11955 11326 10723 10496 25397 27633 24919 -8215 -21160 -11261 -12896 -15759 -11677 -9468 -15222
17690 -15222 -16857 -219 -5026 -6937 -10667 -18651 -14815 -17793 -15471 -21649 -25300 -28681 -11372 -2583
17676 -2583 -12742 -21170 -30522 -30430 -29551 -11626 -807 -9057 -5346 -5598 -6227 -537 -2148 -7107 -14931
17661 -14931 -25170 -28345 -20835 6629 23839 33198 30017 21056 7951 4528 -2682 -22025 -8578
17648 -8578 -11423 -33136 -21844 -17127 -1805 -1544 -6543 -4162 -4612 -12663 -25504 -19688 -27882 -27344
17634 -27344 -3264 11150 -3663 -9958 83 12602 -11171 -16110 -18068 -21574 -20978 -771 4167
17621 4167 7761 13106 -13823 -27153 -23583 -27457 -25275 -22641 -18478 -16245 -20328 704 13771 4515
17607 4515 -358 -10731 -11402 -20059 -25800 -19495 -18399 -5407 13256 14606 10852 6620 4642 -3627
17593 -3627 -216 -3494 -7749 -14112 -28815 -32053 -14553 -1788 -6944 -6643 -5878 1082 -2803 -12336
17579 -12336 -15249 -9554 2597 -4623 -14258 -17895 -26168 -17639 -9992 -16836 -17687 -15444 -10977 -11629 202
17564 202 7169 15956 11247 10536 10656 854 -7127 -13405 -4521 3604 7788 5525 13093 11385 15247
17549 15247 12544 -2571 -8944 -7534 -1767 -12760 -17286 -1970 4465 -2675 -5758 -16878 -10525
17536 -10525 -15448 -29405 -43037 -44152 -27999 -9196 -19784 -22885 -10667 -4319 -4940 6667 17544
17523 17544 6676 -15506 -21984 -19385 -25570 -23346 -20307 -28075 -32296 -32938 -33311 -21736 -11088 -14384
17509 -14384 -21981 -19007 -19798 -23311 -24189 -29019 -20907 -1718 5200 16818 35423 43455 29514 9281
17495 9281 -11374 -22407 -29446 -20444 316 19348 36479 27381 -2457 -5114 -5044 8063 15534
17482 15534 14090 3493 -2609 -12776 3872 -6021 -12850 -11469 -14400 -20783 -9284 2038 -9908
17469 -9908 -24047 -32322 -14302 -2781 -9685 -5228 11400 11504 -729 2552 9815 -2004 1619
17456 1619 1164 6138 5474 2574 5651 6005 16277 10210 19848 33280 28750 32374 42263 59468 68535
17441 68535 80704 81258 59251 34126 26534 24321 10085 3118 -2084 -11039 -5049 -5911 1792 4024
17427 4024 19708 22983 32279 24833 6278 5620 13063 34 -2446 5615 4996 3979 -1454 -16949
17413 -16949 -9671 -16278 -23294 -24109 -9746 -1674 -4111 -1899 1840 -5629 -11729 -14802 -32258 -34161
17399 -34161 -16203 -20488 -19263 -11348 3096 16263 9168 -6473 -18982 -36908 -26397 -8429
17387 -8429 -242 6575 21733 23197 17434 -6464 -30817 -23049 -10185 -4139 747 -20 -7885 -15799
17373 -15799 -34551 -36254 -22271 -12261 -17124 -19060 -6345 6100 6175 7762 17688 -1336 -7036
17360 -7036 -21033 -26749 -5065 2628 7125 19132 -335 -10503 -5805 -3486 -3093 -7998 289 11205
17346 11205 20555 25111 22201 24057 19257 2849 -7558 3999 -847 -17133 -16575 -10096 -16726 -26485
17332 -26485 -41133 -43080 -31263 -20381 -22921 -24755 -27093 -18365 -28832 -29413 -15558 -6138 -10611
17319 -10611 -3265 -964 -16999 -17112 -15036 -27314 -39065 -28667 -24237 -17796 -18311 -11857 -3769 -957
17305 -957 -8929 -7815 1096 -25746 -27603 -34564 -16973 -11611 -16270 -11274 -4741 -4184 -18694 -33962
17291 -33962 -40117 -37226 -24367 -10034 -8137 4210 8018 -433 -2420 658 4044 -3260 -21557
17278 -21557 -32247 -26885 -31881 -22189 -5174 3966 4901 -7801 -6983 -4277 3259 -2415 -5912 -4596
17264 -4596 -6485 -8437 -11954 -21618 -30809 -29056 -25383 -22916 -5874 2837 1894 -17825 -18366 -22668 -37809
17249 -37809 -24223 -16862 -19340 -23493 -21883 -11918 -11791 -11772 -17656 -26409 -8992 -8066 2617 16892
17235 16892 11798 9324 -816 -18948 -18407 -15475 -35733 -27075 -3302 2707 -4947 -5014 -8037 -25068
17221 -25068 -33006 -31492 -23154 -13628 -4466 -5561 -8123 -13052 -17178 -17510 -25294 -8669 7410 12111
17207 12111 3390 -11370 -22347 -18902 2469 5422 5799 13373 20040 3385 -9498 -3993 -1043
17194 -1043 5943 9650 2108 -6522 3579 2342 -7812 -5479 -1598 -21483 -31379 -18488 -12515 -9089
17180 -9089 10984 18876 6841 -8968 -22485 -7380 7346 -5686 -7284 10772 4124 -7400
17168 -7400 -16360 -5125 -3362 -4288 -4567 -2914 -12888 -24422 -24511 -3146 -11068 -20012 -1081 -652 -15051
17153 -15051 -12628 -1598 -1103 -2130 -680 -1860 -9965 -8128 -1412 5646 15288 9545 12848 30743
17139 30743 38454 39753 36567 5369 -8555 3254 -4236 -16908 -18349 -6468 -4927 -573 -6665
17126 -6665 -4698 -3959 -2574 -1757 -2570 -5465 -9919 -4987 2949 6218 -10106 -18708 -6842 -6019 -7476
17111 -7476 7108 7165 4476 -15498 -10261 10197 14032 5841 13623 16992 2281 -12500 -3512 7620
17097 7620 7902 -2526 -10828 -13572 -26378 -24715 -7241 -6771 -22316 -24039 -24721 -13165 6630 23007
17083 23007 32154 26218 970 -3185 9281 20098 33631 40754 39326 46802 31071 11490 2018
17070 2018 3447 6065 7276 4890 1553 14155 1275 -1261 -1543 -1152 -9262 -6249 -24531 -26127
17056 -26127 -21635 -13786 -17343 -20615 -23608 -23926 -14985 -2543 12460 11790 5274 2865 2830 987 -11386
17041 -11386 -1528 8034 -2799 -4640 4648 17781 12432 18267 10412 -5032 -20806 -23339 -16676
17028 -16676 -3352 19865 34718 32242 13680 8668 1362 -2334 3757 25462 30581 19218 35369
17015 35369 60550 86543 119790 139922 143014 160388 172162 195165 184319 163824 151042 144838
17003 144838 125048 105843 93707 72446 34900 22605 34927 47312 47897 38218 41643 38790
16991 38790 32029 42098 24685 13490 -3025 -4914 13550 29749 34144 11056 8246 29205
16979 29205 28581 12245 285 -19632 -15504 -25953 -29803 -23465 -9782 -3077 -8598 4306 21091
16966 21091 11483 16601 18228 24049 36047 21930 16464 23825 30033 32559 34806 50187 83822
16953 83822 99505 123793 156256 178128 174013 168563 169334 157591 134719 119651 119509 97556 66435
16940 66435 62113 54927 29353 12224 12487 -4281 -4218 4538 -869 -1474 5835 11993 14209 9259 10846
16925 10846 38338 42874 25289 21046 3905 -6433 1659 14005 18883 23870 20576 6972 935
16912 935 1929 -10491 -11109 -1978 -30 8652 15119 -3905 -10751 -2042 -5704 -15764 -16134 -3452 -688
16897 -688 -4423 -4009 11605 15397 -1718 -4774 3932 4312 -4718 8181 2031 1909 -7026 -13819 2462
16882 2462 10788 27 -5872 -3730 -11857 -18381 -7437 3484 -166 -7451 -14503 -23616 -15662 -17957
16868 -17957 -23943 -16626 -7214 -7 7155 3874 11003 1795 16221 22408 10776 8906 -7820 -22348
16854 -22348 13912 37943 31991 11075 11823 16699 2002 -10900 -11873 -5877 -7304 -9245 -16516 -11970
16840 -11970 -21230 -28250 -19937 -11535 2133 5475 -4209 677 3791 9010 8499 -1626 -10452 -11938
16826 -11938 -3424 1910 1701 6186 23812 17988 -7422 -26298 -36007 -29185 -23775 -17669 -18910 -24597
16812 -24597 -24609 -23777 -24434 -16422 -10337 -5680 -13492 -3897 -7401 -12873 -37435 -41866 -32246 -23173 -20019
16797 -20019 -23959 -9481 -6679 -8748 -5050 -10850 1507 -4740 -5258 -8762 -17143 -7445 -10703 -2879
16783 -2879 4799 -3291 -29048 -27364 -21841 -21167 -16535 -12518 -28312 -45699 -23712 -9785 -8449 -30077
16769 -30077 -28916 -14900 -23920 -28564 -33703 -18873 -3275 -7607 -16144 -20935 -31402 -23668 -18940
16756 -18940 -11467 -16220 -21038 -20692 -25979 -30036 -29102 -21736 -21806 -3898 14848 4773 4712 -10651 -24269
16741 -24269 -19101 -18949 -30194 -22797 -13522 -17336 -26188 -25474 -26557 -37819 -22981 -3005 -10049 -18223
16727 -18223 -15986 -8546 4090 3839 -611 -15290 -15720 -9148 -2995 1828 -10605 -10030 2225 10062
16713 10062 3141 -9263 -6088 -1029 -12236 -25580 -41002 -40039 -31022 -20612 -19315 -25392 -15924
16700 -15924 -11514 -20599 -31200 -23697 -15328 -11810 3432 -2235 -8760 -16670 -15325 -12950 -21162 -16948
16686 -16948 -14558 -15863 -10856 -1066 -6177 -12493 -13127 -13984 -18213 -18600 467 15661 28584 16927
16672 16927 12454 -4037 -18434 -21007 -23335 -19509 -26718 -27447 -7987 -3616 10075 21545 26461
16659 26461 22536 30394 31698 22489 16099 4443 -11169 -15613 -19319 -15623 -15550 -28628 -26482 -14330
16645 -14330 -3204 12613 10158 -1426 10373 17645 14413 11949 -6956 -13676 -13165 -24086 -28780
16632 -28780 -23053 -1464 9302 16146 7251 -2883 -4461 651 7699 1706 6054 24565 14681
16619 14681 -1093 -5163 1550 7239 6180 3496 -17241 -16544 -19238 -27366 -15751 -27117 -34720 -16285
16605 -16285 -11286 -13606 1151 14093 17301 5609 2529 2676 6649 10893 19384 13436 12206 2758
16591 2758 6767 9497 10879 3312 1562 -1769 5277 12549 8571 6366 4232 -3773 11163 7328
16577 7328 333 -7208 986 15417 -16532 -29361 -19654 -15014 -4250 1084 16722 20106 4898
16564 4898 5433 -6442 -19330 -24361 -10098 1579 -581 -10730 261 -9663 -20344 -20281 -20575 -13233
16550 -13233 10648 23624 18812 12158 14895 20456 12108 -1183 4217 6825 4577 -2407 -3509 9785
16536 9785 11394 9923 -2652 -3182 8504 239 -10352 -2867 -10474 -15471 -19457 -19848 -2467 -3365
16522 -3365 -14448 -20650 -19139 -11633 -4880 -9288 -21655 -11645 -13978 -7643 205 4121 4906 2920
16508 2920 3688 -4546 -13041 -13958 -5404 408 4621 -1820 5897 20301 36707 20945 -4558 53
16494 53 12768 5558 -6527 -1944 -2532 -1649 -5306 170 -9792 -20379 -14114 -726 6095 -6538
16480 -6538 -4886 -8932 -4627 -9164 -11259 -8225 -7535 -9525 725 -1627 2334 855 -888 9946
16466 9946 8598 5584 820 -4431 -8064 -9175 22 11623 12735 12821 4577 -2492 485 14902 22289
16451 22289 6730 -3554 -3413 -8281 -17002 -36450 -45470 -33844 -16524 87 20248 19132 17220
16438 17220 12771 -5602 -3053 -10669 -8957 4843 5660 16335 19934 -6114 -16260 440 4674
16425 4674 2936 -19219 -17385 -15916 -23168 -21447 -19198 -3843 -3167 -22053 -23642 -15317 -26041 -17955
16411 -17955 -31817 -37438 -27400 -34104 -39041 -20727 -18075 -2505 -1403 -9558 -16361 -17575 -10832
16398 -10832 -4911 -2632 -8772 -29511 -29417 -26668 -11862 -7421 -17720 -3468 4407 5394 9752 18971
16384 18971 34332 37824 24958 12766 11799 5462 408 -2280 -3960 -11332 -2886 -3954 4734 7597
16370 7597 -10081 -32642 -29993 -13762 -13921 -12012 -2746 1530 -10678 -20085 -18474 -690 -3646 -17033
16356 -17033 -12209 -4532 -11012 -10271 -10491 -5561 -14547 -12554 -7118 -4574 -12580 -24129 -22736 -7710
16342 -7710 5813 7639 3153 -5663 2701 2776 9519 13475 11505 11677 -2640 -17234 -15258 2246
16328 2246 2847 -7151 -20611 -12932 -16091 -28686 -27434 -26875 -15375 -17876 -35983 -43066 -20229 -10692
16314 -10692 6940 7537 6848 3650 -5936 -14763 -21540 -31853 -26970 -21145 -15468 -17953 -8569 -6230
16300 -6230 -9424 -32247 -29332 -16081 -14158 -28906 -21453 -14752 -17174 -16748 -11982 -13614 -10357 -22097
16286 -22097 -24795 -23901 -25218 -14291 -14198 -10516 -8670 -12717 -5098 -8269 -1377 5692 11530 5175 7743
16271 7743 5445 -3254 699 18696 9402 8366 14185 12640 -10372 -14848 -19391 -28941 -26633 -21189
16257 -21189 -15694 -11215 -694 12992 12349 6574 -3170 -10015 1858 10157 5931 -1088 -3732 -17614
16243 -17614 -13584 8825 4702 16083 939 2229 5537 6913 3948 21634 19193 -659 -7022
16230 -7022 -10922 -9594 -10161 -9769 -10402 -8586 1011 -2210 -14573 -16306 -14528 -19164 -18684 -2148 -1845
16215 -1845 -12982 -15976 -15490 -6364 -9810 -2755 -5454 -16934 -21157 -15163 -7504 -10170 -6768 -8153
16201 -8153 -12419 -20067 -19063 -17243 -17185 -14662 -1821 18148 22417 18780 21869 6081 -7125 -6828
16187 -6828 -14296 -18168 -16463 -24230 -20846 -9529 -4909 -20086 -26314 -19747 -6559 7232 1918 7477
16173 7477 10896 8504 521 -9542 -27407 -28370 -29301 -17893 -12736 -17970 -17782 -11572 -6987 -11538 -5468
16158 -5468 6282 10367 19863 16585 2878 -3875 -5390 13 -3692 -12477 -26357 -18877 -24016 -29805
16144 -29805 -31093 -21797 6351 10163 2397 -5026 -8654 -18521 -18501 -14199 -14611 -8438 -7310 -10151 -2938
16129 -2938 -7587 -9776 -18627 -4181 -9215 -25319 -18606 2556 680 -14101 -14691 -12854 -30169 -28236
16115 -28236 -27744 -29501 -30022 -24787 -24809 -15389 -17822 -4779 -163 1648 6597 -10069 -14806 -20983 -33272
16100 -33272 -14662 -6461 -17155 -14992 973 1 -7437 -21457 -16582 -21863 -19141 -27468 -28610 -32026
16086 -32026 -40349 -25022 -21081 -13252 -4564 -10374 -12000 -10793 -5869 -12306 -20424 -23451 -27720 -15229
16072 -15229 -10649 -7499 -16503 -19056 -22906 -15893 -19430 -18580 -3714 6780 -957 3619 9070 9822
16058 9822 12238 8554 -1136 -8264 8423 14006 -14779 -36025 -28688 -24285 -20069 -14292 -14375 -8372
16044 -8372 -8946 -8798 -1627 -2884 8174 10246 -17710 -15759 -1777 3098 -13550 -21156 -27681 -31771
16030 -31771 -35994 -14907 -1990 -1903 -3682 -14886 -31525 -28476 -9390 3700 -6953 -15166 -1372
16017 -1372 -13636 -15460 -15669 -20046 -26133 -29196 -13819 -6818 -23573 -24220 -26428 -22850 -21372 -23875
16003 -23875 -11458 -11867 -5037 -8826 -26254 -16818 -7226 -10777 -4969 -20924 -23314 -15484 -19004 -22292
15989 -22292 -9222 -7544 5762 23824 20916 10565 19277 13920 8660 -2303 -5903 -8180 -226
15976 -226 -13966 -22224 -8295 -15678 -15532 -20333 -18978 -16204 -4560 -9927 10516 9388 3525 2161
15962 2161 4344 7842 13961 20197 -1472 8347 12149 -13990 -22943 -27512 -25014 -24957 -16568 -24063 -28763
15947 -28763 -12711 -15061 -21210 -8076 6576 7254 -8356 -29210 -36683 -29188 -23645 -12125 -19875
15934 -19875 -38784 -36586 -32735 -25929 -16299 -11283 -109 -4566 -1463 6446 -8761 -14407 -9894 -9771
15920 -9771 -5630 -18873 -5401 16223 29890 20887 -1406 -13611 -9717 -4382 -6640 -6543 -6441 -10558
15906 -10558 -14988 -16909 -15297 -11962 -4599 5788 1756 -7714 -15751 -19203 -9568 -2394 3457 -2740
15892 -2740 -10915 -5826 -2897 -15813 -26355 -28044 -7413 5108 7707 2969 -3558 -12074 131
15879 131 4479 -974 -1222 5881 14812 5266 -6935 -3519 -10398 -22288 -14848 -14306 -19889 -24148 -25890
15864 -25890 -11268 -4700 1590 -370 -593 5485 9881 5682 13396 7787 -1271 -18305 -22438 -18132
15850 -18132 -13409 -18991 -28126 -13010 -5111 1973 7984 -4134 -1351 -3964 -11888 -19395 -6104 -2541
15836 -2541 -3039 4851 10577 1573 -15753 -32810 -25782 -26044 -19613 -6946 -213 602 -180 -6892 -9478
15821 -9478 -9250 -26224 -31841 -21029 -25727 -23954 -29525 -16975 1332 9305 16507 18347 5960 -14519
15807 -14519 -18099 -27291 -27367 -13835 -12828 -20984 -11564 -12122 -29195 -22959 -14382 -12762 -15293 -19412 -14024
15792 -14024 -16880 -26175 -41680 -21569 -9292 -16022 -22582 -22493 -10980 2441 -1220 -16584 -3662
15779 -3662 18307 7585 -1226 -4402 -2939 -2448 6476 18481 24001 17006 -843 -1214 -5516 -18497
15765 -18497 -23932 -12987 -5015 1416 -10685 -10737 -2092 -7995 -27673 -32097 -14179 -21217 -25789 -9198
15751 -9198 -5701 -5740 13053 11203 9494 3236 -10457 495 3901 -1640 -7070 -5589 -9204 -19479
15737 -19479 -24478 -17193 -10460 -14557 -7751 -14723 -20091 -25474 -27475 -15246 -19246 -11801 -9229 -31236
15723 -31236 -29113 -14895 -6664 -25660 -34461 -18875 -5477 -9993 -6663 2697 5702 -7922 -9867
15710 -9867 -3827 8930 9686 21184 17311 6133 3858 -2343 -24660 -31951 -21483 1737 -5211
15697 -5211 -17324 -7095 -306 -7862 -13945 -25712 -15876 5796 3960 359 7137 6492 1688 6271
15683 6271 -2993 -1312 -11930 -19150 -13254 -22004 -18119 -12658 -13549 -25170 -27890 -19723 -16607 -17308 -11597
15668 -11597 -1669 3593 12803 13400 3393 -9300 -7486 -6256 -10049 -5931 -1499 -20654 -22293 -32159
15654 -32159 -26555 -30565 -16223 -7308 -27005 -26819 -16608 -6658 1436 2627 11861 15374 23722 32314
15640 32314 18347 -1390 -13456 -14275 -13938 -14143 -10959 -3361 -4227 -6960 -15102 -8350 940 -189 2471
15625 2471 -5408 -18904 -14884 -1612 4516 -14386 -17384 -5532 -14200 -17848 -8286 -3550 -2366 -4947
15611 -4947 -1655 7034 4526 8109 -14658 -18210 -15686 -24642 -29094 -30273 -26829 -31146 -24861 -24086 -13315
15596 -13315 -4484 -11058 -11267 -9889 -26868 -20251 -19401 -37730 -32564 -26514 -15249 -26921 -28432 -27504
15582 -27504 -28433 -23387 -1979 8328 -8931 -17516 -13459 -19551 -12938 -7160 -1788 10751 23515
15569 23515 39738 30966 -1573 -12796 -11983 -6016 -7977 -17012 -14348 -4029 -1269 -9968 -9695 2905
15555 2905 -10654 -14496 -18345 -15470 -4805 4252 11283 13023 15254 17050 8966 839 -13662 -9692
15541 -9692 6532 15426 25383 28285 20721 6703 -8676 -6214 -7091 -22700 -19603 -28764 -29161 -30074
15527 -30074 -36750 -44554 -46372 -38086 -20131 -21279 -29530 -25825 -7300 7531 7422 -5418 -14511 -17073
15513 -17073 -16881 -16312 -4159 6488 -3311 -12214 -10099 -430 -3260 5996 11664 1496 -3203 503
15499 503 -2627 9532 18489 23958 14012 7577 7439 -3519 908 3032 -3104 -5290 5423 -9347
15485 -9347 -15859 -24913 -27592 -28634 -21070 -14179 -9181 -2091 13544 29971 34403 29496 34695 24654
15471 24654 14027 23547 28160 24008 26373 11495 4182 5600 -864 -12644 -6385 -2540 -6953 -8023
15457 -8023 -11512 -10376 -6334 2900 7420 9320 9335 6957 13988 7054 -11555 -21328 -8947 275 -17872
15442 -17872 -20657 -16908 -15994 -8472 -9187 -12698 -22067 -29325 -23843 -22757 -3100 -3618 -11601 -663 -2410
15427 -2410 -21961 -11707 -15887 -14971 -10953 -11231 -19115 -18410 -13851 -22679 -14877 -18676 -7971 -4726 -7854
15412 -7854 6879 29328 24019 9575 -6046 -11508 -16883 -15190 -13885 -3647 -9224 -12410 -8011
15399 -8011 369 17999 35561 25011 12681 13870 13376 5222 6212 7999 2147 2934 -2087 -1689 9621
15384 9621 -6476 -11308 -3205 -6252 -17797 -16913 -10167 -6267 -6672 -11704 -16002 -15601 -12321 -15407 -23114
15369 -23114 -23104 -11676 -9185 -10290 -24297 -27065 -25195 -25223 -23925 -22167 -23282 -19374 -10399 8328 15075
15354 15075 7673 2852 -7327 -6717 -9530 -13599 -84 17808 18967 -6737 -20483 -13568 -31062
15341 -31062 -17322 -3874 -5722 -4263 -5352 -11242 2866 -2753 -9929 292 146 -2513 -15408
15328 -15408 -14976 -22945 -21908 -24808 -21695 -16009 1216 16498 21162 7816 -10318 -7121 -8398 -10037
15314 -10037 -24623 -31161 -26713 -16897 -10689 -21511 -26026 -10147 12584 14851 9389 12713 20537
15301 20537 13827 6364 -9730 -11296 -13871 -20734 -11725 -16828 -19526 -8165 -3313 -11245 -5418 -3269
15287 -3269 4699 7152 14414 -187 3525 20969 24749 14646 2079 -653 -12333 -14518 -1592
15274 -1592 -3404 -6234 -2218 -2280 -2938 15368 24686 23016 14473 1784 -2161 -6350 -12187 -2665 12393
15259 12393 3716 -7516 -11758 -3632 6838 12439 15092 10154 14919 19303 10337 -13437 -2562
15246 -2562 8798 -13536 -13986 4124 4013 -8018 -1043 2827 -3342 -6820 12239 20101 15430 2542
15232 2542 3248 18630 13923 7991 5951 -2889 -20031 -27693 -34688 -14631 -5560 -3839 -12858 -27793
15218 -27793 -11932 583 -8637 -9980 -24731 -36097 -29636 -27246 -18131 -11645 -9877 -14052 -10465
15205 -10465 -5954 -9326 -2296 1509 -7810 -11507 1763 4996 -8571 -10792 2701 12278 9352 -8031
15191 -8031 -14663 -3177 12853 -12889 -21466 -1909 2059 7843 -5236 -13824 -9509 -6160 -3765
15178 -3765 6251 -932 -4888 8136 4855 1070 -9466 -11064 -14509 -13699 -11366 -1847 9419 13237
15164 13237 21760 20822 9938 -4379 2072 28170 12943 10757 6657 17177 30100 27442 20988
15151 20988 2924 6127 10827 7908 1670 2012 -2943 -14695 -20854 -15761 -7744 -13557 2353 10088
15137 10088 13456 -1592 -10220 16189 25125 21061 5768 -3678 -6160 -10856 -18367 -19166 -16987 5965
15123 5965 24715 7388 829 -737 -9787 -17548 -7336 5212 10321 10149 -661 -4531 -1795 -2696
15109 -2696 -5128 -10913 -24911 -22566 -15098 -6068 -4266 -11846 -19379 -9336 -2244 -10222 -8199 2034
15095 2034 10772 16370 18518 9244 110 -3035 -8154 -6414 -12354 -8221 5673 10222 -5685 -8182
15081 -8182 3232 1071 7684 -9202 -26991 -27771 -27608 -17350 -21276 -9097 -437 -4137 -5985 544
15067 544 -270 -3600 -4859 -14720 -10344 -7105 -6941 -3476 -6834 -5841 -69 142 4440 -9501 -19508
15052 -19508 -16765 -5908 1963 -322 -15197 -22228 -26370 -29714 -19469 1719 3049 1710 -3158
15039 -3158 -13909 -18240 2163 -900 -13518 -14895 -14703 -26798 -22738 -89 -483 -11481 -19165 -6078
15025 -6078 -2282 -3652 -4768 7012 10008 11339 15678 28964 42163 43405 24821 5336 -10980
15012 -10980 -4992 -4006 -1155 -19196 -8305 -1308 -3795 13712 13327 26709 38598 34193 29105 16807
14998 16807 7485 927 4361 13967 20861 16254 15295 5107 20003 19774 13287 24282 20175 11211
14984 11211 7664 11587 728 2043 -10246 -16440 6344 9993 9673 7346 809 -1119 -6431 -7869
14970 -7869 -43 6979 18626 15634 12541 12771 3875 10692 12134 21230 29344 19246 12494 14298
14956 14298 13358 13650 -79 677 -8222 -6930 -19034 -22944 -2006 -6688 -10238 -19263 -22888 -10001
14942 -10001 13317 17408 18831 11693 11929 12731 14128 15576 14695 468 -8785 -7225 -8072 15030 23290
14927 23290 5724 10403 15670 32025 37040 26751 -4817 -15219 1048 13582 29232 21721
14915 21721 2113 -13435 -1605 5473 -8461 -14194 -12200 -18978 -11379 589 3795 -9020 -18873
14902 -18873 -11927 -7243 -11104 -7153 -5191 -11045 -17656 -19974 -8573 -5432 10071 2847 -10746 -14829
14888 -14829 -10435 -831 18041 21137 4506 -11784 -21890 -16928 -12252 -16038 -14640 -12923 638
14875 638 3568 7512 11816 1677 -6684 -740 5041 12710 2001 -2008 -10918 -24170 -13438 -17479
14861 -17479 -3531 1407 6099 6245 5720 4576 8306 10898 8424 12149 9918 11311 -10926 -13471
14847 -13471 -16259 -23757 -25655 -8718 -7691 -4831 -4413 -13606 -10841 -1573 -4510 -17073 -10948 6265
14833 6265 -1834 2759 7347 11403 18104 16498 19459 24357 13195 8544 1151 13664 14435 230
14819 230 -13005 -5517 11231 -682 5120 456 -8826 -15144 -21546 -17982 -18268 -20047 -6852 355
14805 355 -9559 -10795 -22139 -35868 -24812 -14016 -1208 -1480 8347 14590 -188 -4035 3516 15259
14791 15259 18458 17722 8387 -6486 -13481 -13364 -9450 -11257 -6215 -363 -3547 -10612 -12602 -7156 -9797
14776 -9797 -7242 -3455 -10467 -7254 -11085 -16413 -6832 1389 8482 1464 4467 19168 11429 -7886
14762 -7886 -16138 -16196 -2149 -8803 13212 21330 18194 38464 22201 3086 -5058 -4266 10928 25018
14748 25018 24129 11883 7866 677 11342 16463 16132 5665 -162 -13324 -10290 -7228 -1306 17766
14734 17766 12498 18308 20978 10757 -6351 -2848 1699 -4123 -23948 -25280 -26071 -21275 -7011 -11939
14720 -11939 -12816 -21298 -18650 -10929 -21651 -33235 -26491 -17837 -12766 6351 11151 -3415 -22321
14707 -22321 -23589 -12202 -13189 -20496 -32601 -28891 -26198 -22170 -15754 -21658 -20412 -3680 2872 -1333
14693 -1333 -2707 2412 9004 5830 2597 -3357 -2010 -8116 -15619 -16805 -9865 -4901 5019 6583 6757
14678 6757 8129 5453 13973 34281 20822 4136 -10332 -7312 8484 9198 11486 12937 20537 7809
14664 7809 -6041 -24552 -32029 -17183 -5213 -2252 3673 14944 26071 26853 11977 8388 10802
14651 10802 -2252 -11713 -15665 -12346 -16663 -2160 7549 15528 15094 23912 19654 9852 157 6596
14637 6596 27098 36417 27246 14885 6784 -6961 -22434 -20816 -19412 -23729 -24947 -16108 -7339 -4588
14623 -4588 2291 7042 4312 11018 13662 8831 331 -4707 -11114 -2062 1048 11264 8439 8351 24360
14608 24360 14229 11457 11457 5544 15533 16346 15908 26419 26526 10802 -2441 -11793 -25568 -18435 -12473
14593 -12473 52 17044 8528 -17960 -24079 -18102 -9322 -5109 -5039 8266 7035 5570 5191 -2219
14579 -2219 -9867 -3432 8415 -333 -13991 -14178 -3368 -976 -241 7816 1509 -5830 -1043 5212
14565 5212 12475 6360 -10829 -24858 -28883 -18524 -8957 -17825 -20383 -6747 10022 13196 -1966
14552 -1966 4449 8501 7707 -7217 -15226 71 9701 9394 11589 14149 3620 -16828 -21953 -11927
14538 -11927 -21538 -15654 -348 7295 12083 13179 -804 -11656 -5951 -17354 -22775 -26029 -11631
14525 -11631 -7093 5712 -3761 -15421 -18676 -5481 7614 21742 22025 14864 7678 -11484 -14235
14512 -14235 -27303 -28020 -22183 -14301 -5376 -7186 -2882 17572 13548 5184 9081 8126 -9953 -11270
14498 -11270 -13579 -12411 -10180 9723 19644 27290 31707 28904 26925 21307 14836 9269 9496 4379
14484 4379 8133 15242 11858 13133 8556 8338 3594 3020 -7088 -8294 -26213 -25247 -16595 -8321 6175
14469 6175 22290 25248 19889 -4621 -27315 -26383 -19744 -10503 -10872 408 14670 1451 -3610 -5685
14455 -5685 -6262 -5821 -19727 -1084 6199 13090 17355 -2179 -8418 -3771 11865 11189 4957 21910
14441 21910 19609 -785 2576 -599 5933 5693 -5792 -1693 -4009 -19126 -25742 -17779 -18337 -3704
14427 -3704 -4709 277 1967 -4075 -10697 -3681 9490 10198 16068 8921 18589 26204 19227 7675
14413 7675 -4601 8643 12470 15568 -6736 -19415 -13504 -29115 -14941 -51 10554 27655
14401 27655 18219 3449 -3966 -2086 3835 8168 9334 10731 388 2685 4599 4230 -497 1798
14387 1798 24964 13548 1679 14801 3983 2173 8293 -2023 5830 -1334 1379 9743 9250
14374 9250 17135 17457 -817 -11491 -3003 7436 18430 11270 -1537 -13352 -4802 904 3494
14361 3494 1692 -8363 -12190 -171 18096 15598 14980 7868 144 459 9355 10174 12763 18931 15550
14346 15550 -2867 -15034 -20476 -21736 -2993 9434 14014 17199 3945 11887 5888 6651 2735
14333 2735 5350 22977 11721 -5221 -16352 -20866 -9686 12469 13067 17564 5061 -17716 -23644
14320 -23644 -10367 3695 13382 15961 6708 4237 -6786 -11296 -14316 -30173 -32467 -25395 -21362
14307 -21362 -6808 9384 8856 5907 7940 11803 10723 8661 999 -6428 -14774 -16745 -10824 4952
14293 4952 8181 12937 1170 -6725 -9774 4634 6059 -10778 -19723 -8876 2791 5489 -7384
14280 -7384 -1475 18761 23006 27000 8923 543 474 -3008 4623 -8610 -18751 -7708 4847 20174
14266 20174 29067 24691 22346 13475 3204 -5603 -27866 -36673 -14330 258 2650 11182 8886
14253 8886 6756 8325 2654 938 5939 11024 8987 24861 36070 24802 21135 30086 38547 37399
14239 37399 27425 12706 9033 9337 7310 10156 14995 15922 14360 5412 -4933 -2180 3236 7358
14225 7358 10757 6365 -8576 -24157 -27124 -14512 -8766 -11745 3293 4364 3697 9111 11638 17851
14211 17851 18174 2774 8970 8914 9531 12893 5209 12045 26874 35486 31151 20113 19834 25249 24203
14196 24203 15510 10860 -4690 386 -6652 -16906 -11267 -4304 -6834 6591 19597 4896 14501
14183 14501 38065 15931 -4062 -6680 15507 26660 10448 -2573 -2936 -14173 -11747 -2597 3186
14170 3186 10035 13542 7886 -789 -6860 -5972 -6144 1097 9457 1828 -16441 -4541 5488 21998
14156 21998 23579 5908 -17687 -7698 3738 10639 32999 34490 14826 8622 20024 24002 24647
14143 24647 23995 13591 2826 -1603 754 -6097 -4498 7042 537 4855 2689 -5116 2941 -866
14129 -866 -9246 -4751 -6700 -2653 2904 16199 13755 12448 21535 19560 10470 6079 847 9083 10127
14114 10127 3907 -1988 6422 3814 3773 5061 9087 14706 14695 12517 7421 -3661 2070 5516 -4186
14099 -4186 8359 -437 2030 -1760 -7663 481 9514 18268 33127 47669 36057 25348 28092
14086 28092 33632 25430 15653 6596 15698 24219 32145 33056 31636 19025 15767 14239 7030 -6053
14072 -6053 -6821 -15505 -8063 -16801 -32022 -31860 -32048 -7216 9703 16379 9674 4903 -8222 -28028
14058 -28028 -36220 -36933 -35369 -25661 1747 29901 14332 4494 12943 -1183 -1075 8980 8373 10546
14044 10546 16854 11388 -7682 -31082 -30843 -11040 -13110 -9500 -10738 -5083 -4155 7337 -2834 -1245
14030 -1245 862 -1528 -10010 -3882 -3537 11646 23072 24594 -2154 -16237 -8126 194 -2532 -6627
14016 -6627 -3644 -12490 -20367 -19791 -13743 -8981 -3938 -1637 641 83 15525 15912 3057 7170 4822
14001 4822 4895 11188 13282 -1783 -8573 3105 12277 21278 11276 -1047 -515 -3875 2909 8703
13987 8703 14368 12554 3673 -5004 2151 18083 10612 -2446 -1471 -11901 -12608 -10896 -9882 3176
13973 3176 8878 10525 3195 -9217 -4688 -3122 -735 -8546 5439 15322 23836 10597 6348 3445
13959 3445 9287 11109 3963 -3667 5220 9298 4803 2840 2013 9958 22186 34226 21291 21981
13945 21981 13574 9213 14455 4958 -1240 -4037 8351 -7739 -15362 -10794 7758 15377 1495
13932 1495 10597 3894 -4057 -1537 4637 -6107 -8234 8377 1516 5284 12663 4844 10998 1955
13918 1955 -977 3876 5553 6769 633 -11672 -18837 -1030 9976 -2315 -3907 8580 11926
13905 11926 6897 4248 8174 11183 -4282 -10661 -18194 -23437 -27382 -16097 -11529 -12173 -5619 7069
13891 7069 26188 27318 16179 24362 30300 17080 4490 14188 15022 12644 17893 11314 9761 10280
13877 10280 -384 -8124 -3569 -1595 -1324 -5598 844 -4536 -24961 -32934 -14919 -1593 -12477
13864 -12477 -7673 -5197 -8722 -6791 -4429 -2678 -15778 -7205 -1553 10477 13104 10634 16595 21888
13850 21888 17571 17996 11966 -9293 -1891 3479 450 213 1379 -4579 18379 19279 928 -3493
13836 -3493 8676 4122 5045 15222 21195 5907 -4825 1745 3835 9737 7841 15303 24936 27921
13822 27921 29128 36184 46098 37880 29405 41793 35499 18594 22149 16050 8882 -5799 8459
13809 8459 2793 -6632 -15139 507 21309 23279 15041 2112 -7326 -4676 7921 12652 8556 -938
13795 -938 568 7109 16574 6977 -9329 -3772 16 378 18545 15181 7456 14236 24847 22371
13781 22371 -2682 -17231 -19520 -26232 -12633 1365 3863 2124 1917 -2173 1431 4306 14713
13768 14713 -970 5872 13411 31975 29648 22491 11139 5375 -9896 2106 29708 23049 13042
13755 13042 15139 6007 -12212 -16525 -11633 614 13336 1015 -2698 1615 11590 8292 -16638
13742 -16638 -14323 -11169 -2658 -2605 4346 -10715 -16288 -16663 -15968 -18101 -23828 -30513 -25196 -2683 11529
13727 11529 20537 26987 25316 22245 18645 8423 11164 13570 28385 36898 44309 29757 28563 36735
13713 36735 13376 3311 13334 21938 24300 27216 24303 21940 9730 21444 38278 40996 31721
13700 31721 37798 44463 37876 21560 8041 14972 12648 13655 19733 24188 1536 -6620 -1821 7502
13686 7502 6989 -4719 -5780 1086 -3664 -2273 8346 9104 -701 2878 2977 15388 23578 29947 42192
13671 42192 33826 22356 20734 27975 28455 28960 10381 12977 12332 1732 5064 13727 25674 27802
13657 27802 25377 38815 30273 20588 17283 13366 8432 17714 22432 16951 13240 5698 -4657 4498
13643 4498 8937 10982 7437 12387 25777 19910 18847 26135 34573 34396 34103 21425 13733 16713 19031
13628 19031 4208 4135 14396 18118 12103 8033 11832 18726 21112 18280 5955 2468 19131 22274
13614 22274 24208 32812 31807 30581 14061 2514 15421 19260 17407 25732 21055 18874 8441
13601 8441 15532 24465 34893 28817 27074 18075 -1238 -10726 -12056 -14071 8748 27081 30189 28269
13587 28269 23037 24243 23906 20039 25475 23740 14030 19011 35072 22513 -610 -6110 13855 15820
13573 15820 8291 -6036 -13986 -5578 2553 15805 19993 16497 24246 26244 30672 43914 29030
13560 29030 15912 18288 10628 15602 13572 6768 15364 17540 23174 32071 27822 21969 9729 20618
13546 20618 19958 11788 3282 4275 20290 13721 -777 17547 38727 39710 33030 27442 26865 15714
13532 15714 -119 -2463 8685 24823 30238 17534 16741 6320 19702 32919 39426 29314 20299
13519 20299 2093 7228 21507 37144 33917 20924 25608 34203 38084 38354 30174 35352 35217 33726
13505 33726 26762 21341 23102 29971 51737 67140 60202 41058 30479 25996 26506 25981 30111 31961
13491 31961 30773 25291 40691 24540 22261 31995 41031 34744 23797 6652 9123 18952 27977
13478 27977 35449 24141 10890 204 9387 24963 19138 14755 11338 15096 5205 9119 25395
13465 25395 28822 39112 50966 43667 38702 41929 49820 47041 45844 38284 48590 49892 60899
13452 60899 55875 50231 48350 56242 44693 13881 -4289 -10318 -5239 650 -5998 1899 560 -22
13438 -22 10920 2637 1728 9288 2235 11883 6241 16650 18131 23367 21312 14853 19872 31347 42884
13423 42884 40875 43841 52530 30145 42182 41627 31753 24821 33556 21886 22940 27786 43817 49864
13409 49864 41428 38342 35462 26427 23883 19318 23195 10176 19130 33455 46959 46530 35212 24680
13395 24680 33619 38457 40108 51842 48781 47394 40756 20094 17284 36787 42229 27581 10199
13382 10199 15468 23626 21316 10021 12347 9847 19688 31223 44458 49891 38129 28862 36105
13369 36105 40632 43165 43862 46510 56898 68748 58253 57183 49129 44686 44290 47891 53710 59837
13355 59837 72998 65405 47790 34177 34503 20718 11203 29863 32343 31622 44321 66377 78681
13342 78681 91005 105476 119659 132044 154478 188120 249520 328649 429140 612457 881740
13331 881740 1151940 1342024 1483766 1655378 1750480 1588912 1187909 819935 602505 477444
13321 477444 405380 359529 323890 293148 262208 238591 214770 208449 206473 175270 160378 167488
13309 167488 183072 169277 157651 154179 151996 136246 118900 119779 127534 124717 125315 109299 94510
13296 94510 88778 93929 105279 104548 100228 105975 100714 97776 96879 99691 93932 87070 68238 56897
13282 56897 50860 61291 80051 81172 82793 88804 84100 101368 107365 99950 98979 95454 88883 90909
13268 90909 92555 68303 58179 75777 62943 52491 40092 37947 44966 48134 37057 36858 48544
13255 48544 66395 67870 62066 55636 41902 42293 57065 68919 78032 95310 97149 82718 87266
13242 87266 87452 75089 75129 84015 84322 62300 42500 36742 44701 48115 40000 46832 53580 50018 43109
13227 43109 47242 56904 45225 36951 40086 36912 41024 45729 59576 62464 52148 68688 84608
13214 84608 82874 73124 71127 57362 40298 39099 43082 34034 28220 23263 29684 35305 25982 28146
13200 28146 35308 32612 24096 20035 24137 33081 28502 17822 17254 18591 15449 22513 30520 31742
13186 31742 21876 11866 20162 36033 21564 3010 22350 33488 30213 38406 49768 62665
13174 62665 84318 83850 70629 70081 76276 81771 95806 101456 114299 106182 100864 91326 80132 75449
13160 75449 70598 61908 54951 66623 76081 75707 58993 55025 53992 49847 45612 40827 35431 34958
13146 34958 46255 55271 59457 77674 84141 85213 87805 85316 91459 85456 81099 87575 80588 84714
13132 84714 107935 101880 98278 115274 127047 136285 157061 169580 188947 229455 254187 246765
13120 246765 201532 160668 181549 195799 177314 152681 140681 158750 153556 157253 148202 149093
13108 149093 130167 122084 123157 133168 122262 107094 86297 76964 82204 99002 114727 96921
13096 96921 77872 55441 61686 79012 92695 105697 99250 93456 81624 65150 62239 63700 54370
13083 54370 49675 50082 61520 70932 61724 59236 74176 77225 76674 78728 82461 89960 99175 127211
13069 127211 133594 125722 133937 146791 138123 130792 125579 125487 140104 155688 163754 150552 137627
13056 137627 138819 144119 154764 163306 163172 153118 128090 103589 106868 103574 102210 98812 108798
13043 108798 110658 119966 130200 129206 141127 146542 150122 159924 169109 179942 175664 166939 155985
13030 155985 159091 163266 186854 221450 232796 236108 246057 240747 242410 235616 213007 208357 191363
13017 191363 150268 101810 85026 88773 97801 99435 94038 77660 72288 73638 87222 102174 94287
13004 94287 100384 110530 113789 113018 119300 124400 162148 223067 258592 295180 348801 390520 451051
12991 451051 549654 616297 604231 540907 485262 461241 450425 436661 436703 450165 450673 441575 422298
12978 422298 415090 409547 403959 412680 430605 451372 453863 456762 453657 445081 426587 428115 421099
12965 421099 407870 380883 394267 412790 413643 418140 420207 446764 462997 471575 482721 489769 505387
12952 505387 522187 550535 561583 564677 592567 595359 601663 629470 655914 648945 660008 668203
12940 668203 671058 655979 627499 604642 605692 611448 640121 672086 702785 737226 772169 800063
12928 800063 831743 839178 824783 825780 850660 859825 861197 875059 894908 908541 916077 930251 995063
12915 995063 1054564 1102677 1136772 1160051 1214720 1291955 1355925 1404171 1444586 1498802 1543903
12904 1543903 1563266 1574708 1637873 1729236 1811321 1919320 2071808 2255636 2445715 2646107
12894 2646107 2848668 3064357 3299557 3548668 3822950 4166004 4565789 5008431 5475359
12885 5475359 5997493 6610587 7364826 8277943 9360085 10677055 12251881 14108836 16376888
12876 16376888 19154802 22522118 26698506 32307598 40751090 54027286 76083189 113189429
12868 113189429 166900646 218094573 248174326 275024118 308619793 325190853 286395947
12861 286395947 204398007 139757576 102439551 81153891 68103462 59450957 53246928
12854 53246928 48295503 43970127 40152040 36850385 33929370 31089369 28501530 26403001
12846 26403001 24654136 23190229 22012965 21054143 20207978 19387049 18520695 17615035 16718103
12837 16718103 15875517 15098228 14399822 13739298 13161982 12659271 12216662 11832940 11502141
12828 11502141 11189036 10900840 10601795 10276237 9945570 9619606 9296947 8962513 8620780
12819 8620780 8304834 7992237 7691768 7409528 7152640 6931333 6735347 6553057 6393763
12810 6393763 6246278 6115200 5995533 5857033 5673138 5485609 5279044 5070966 4837550
12801 4837550 4632595 4471877 4334733 4196396 4079290 3967936 3849557 3719274 3586273
12792 3586273 3452135 3322596 3204947 3104888 3015441 2916779 2800373 2705321 2627333 2547357
12782 2547357 2491309 2443723 2394922 2327835 2260673 2203316 2140441 2080725 2046220 2029876 1993470
12771 1993470 1976234 1948212 1944939 1944192 1927213 1872286 1807929 1750169 1668868 1592930 1530141 1441700
12759 1441700 1345963 1257531 1193221 1134571 1086092 1035133 991585 972464 940229 902699 866011
12748 866011 837175 798013 727326 637001 542121 470859 438019 418794 403979 404089 420392 469922
12736 469922 514647 537423 529051 475833 428787 424049 440657 467438 466567 467510 468644 476569 478097
12723 478097 493756 530892 570572 601228 657951 743644 878387 1104476 1385803 1588557 1718065
12712 1718065 1864872 1971829 1849167 1440144 1036243 803300 667991 584460 552288 528768
12702 528768 506287 484004 475533 454336 437759 439977 435529 416354 395492 403412 411115 394527
12690 394527 375950 356355 346756 341500 348976 342372 338031 349838 334245 335659 328993 295970 276760
12677 276760 284397 285904 280931 271460 261912 245690 227636 219281 217706 207548 206225 211747 209257
12664 209257 197805 193117 201511 210620 213908 207751 203413 211318 217964 229974 232934 245506 235972
12651 235972 223071 224298 236856 246393 258138 261555 272632 266808 258824 250345 233232 196676 190297
12638 190297 196452 201505 212647 219252 223636 239284 222457 209322 207556 199017 203298 206243 211342
12625 211342 219675 215081 194404 179770 167033 155881 152103 143301 137034 138286 144848 142717 150029
12612 150029 150162 149520 134161 109350 86277 88468 89238 85343 77665 84104 76588 69694 60112 54082
12598 54082 64753 67134 60527 59072 60603 38172 21945 17391 27266 31140 23255 26490 24761 27604
12584 27604 30447 44704 55203 58801 59804 56313 49216 37947 39403 33833 24816 27756 45918
12571 45918 34613 16199 39755 32212 13535 7324 4223 1539 -12055 -13517 10241 21060 16691
12558 16691 -2158 9333 4765 19511 37189 36197 40806 27807 18494 33509 44544 40974 60150
12545 60150 60260 58539 59463 49740 49335 47498 63492 59750 52105 57277 62435 64828 64738 55431 35050
12530 35050 35049 42901 50463 28037 12365 22661 21857 19599 33014 47022 40858 35564 21882 12753
12516 12753 14954 1270 304 19727 26559 25069 31139 60783 67897 67060 53775 40186 30659 24133
12502 24133 19906 24373 27904 32606 36329 36566 41604 39067 24321 35986 47567 30630 20254
12489 20254 18778 17282 15889 14848 31585 35273 11772 7740 3254 4405 16131 29705 16630
12476 16630 21982 10385 20462 31421 30305 43575 52768 41534 27859 17086 23360 33762
12464 33762 32706 21158 13851 16505 19465 21115 22480 24043 17299 17102 8671 9168 18978 12108 24152
12449 24152 47733 58267 45872 35985 26145 28244 24544 34797 30508 34444 34299 27024 16712
12436 16712 18840 16490 14914 21298 19456 31301 31077 33269 35282 36859 31820 27476 35248 30171
12422 30171 12107 12076 29012 62154 77054 68954 50104 40576 31211 44139 57545 69755 85360
12409 85360 84339 79036 86929 107301 124116 144877 175785 201870 220008 261289 357668 493287
12397 493287 695141 974837 1221881 1387511 1547892 1716460 1760678 1490500 1075079 766894
12387 766894 577096 456693 390358 341638 315867 290325 270859 258088 247550 226414 202340
12376 202340 184781 171897 162345 156683 150858 151243 141026 132782 121006 103682 86656 83026 85515
12363 85515 80266 85678 89937 96734 111516 112450 92574 98406 90834 83630 88909 90386 88507 78717
12349 78717 69354 63638 77570 82089 75222 81249 76759 73377 71220 81042 85857 100831 109132 114205
12335 114205 115172 87306 67092 61232 62153 73116 80713 81962 79298 75509 89915 97652 108302
12322 108302 111648 111224 115857 128303 134961 143833 140895 156653 199631 269163 357648 484901 664529
12309 664529 857859 1074735 1270803 1405729 1469063 1436585 1312208 1103357 842421 645747
12299 645747 538504 455493 390393 344667 303462 267143 242350 226759 200686 187281 176795
12288 176795 171727 153476 149407 146231 134094 120111 114677 117219 120953 112653 107424 98228 98453 93187
12274 93187 65027 70671 77773 82956 80506 70011 62077 59415 69521 71949 68393 68795 66058 53408
12260 53408 49620 47282 43725 46239 52315 63015 66664 69396 61752 61007 55533 41994 43281 23841
12246 23841 4729 43 15059 28459 29252 25707 32222 22040 10021 -744 17622 46738 30969
12233 30969 23043 28873 32618 24871 22365 -1272 -13768 4835 13977 30955 31375 31283 43167 45272
12219 45272 36599 30785 14554 9963 12254 11326 4036 2261 9230 25662 38387 33324 23919 31017
12205 31017 39179 22281 6552 8625 19273 26740 20380 9171 7022 22328 28898 27405 15106
12192 15106 9144 15176 11179 1195 17181 15651 5259 11358 13056 16099 20405 23506 22108 19887
12178 19887 10251 14584 18247 13637 14802 7432 -7306 -15940 6096 9796 5043 6861 20154 6979
12164 6979 5072 12595 21465 23014 23730 19344 15073 25911 20302 6176 352 -4691 -3681 -2071
12150 -2071 2328 -7437 15711 27343 26895 23501 20140 13056 10484 22439 29747 16831 15581 3409
12136 3409 2237 6833 11469 14613 28924 26767 18357 27140 15141 20261 47244 65650 65491 48990
12122 48990 42211 33730 26867 25558 13554 1599 4693 578 -9825 9136 31952 24741 18337
12109 18337 14027 19751 27207 7491 3787 636 -3257 -9498 -15915 -15136 -12938 -9619 9303 22481
12095 22481 13602 11824 7182 5656 14560 11002 9011 6127 16017 3213 232 -425 999 8280
12081 8280 21645 21290 6993 7698 5309 8012 14788 10183 11771 18082 17987 7656 9115 18721 24826
12066 24826 19265 12831 12174 15892 11209 -911 -16643 -15314 -7643 3187 9468 14013 23883 23085
12052 23085 26383 29567 36047 24379 6021 3132 -1571 -13916 -8118 1671 11719 16032 17513
12039 17513 16808 18497 10365 -20472 -23205 -11121 5812 8468 17183 15785 6160 -1641 -12474 -26014
12025 -26014 -17792 -23007 -32362 -13773 1658 -4964 -11975 -2732 7598 12889 20005 1925 -3395
12012 -3395 12436 26476 24347 285 -107 8563 13961 -4699 16342 18436 11958 27147 38393
11999 38393 30228 32978 21435 -3192 -4749 12722 11252 2937 -2583 14019 18570 1199 956
11986 956 -1615 -10532 -8175 4060 10492 16969 30955 22941 15546 6808 -4455 -5176 -6096 -13993 -6455
11971 -6455 3904 17092 22520 15676 23806 27066 19626 457 -6202 -1379 13948 14992 1680
11958 1680 1877 16115 32291 32908 32662 19828 14783 4817 -3643 -10677 -17515 -14810 1959 6419
11944 6419 -606 -4913 -5227 3337 12733 15696 4938 10340 27588 24535 17944 3913 8661 23303
11930 23303 32878 38532 34698 15630 13989 17284 14086 26467 16578 4257 2280 7633 18781
11917 18781 28747 28136 21355 23111 8961 -816 -19871 -23526 -15689 -12342 -24102 -18294 -10346 -11888
11903 -11888 -5854 -8324 -31564 -26047 1385 19268 13076 23226 23992 27576 31367 32143 16541 -7556
11889 -7556 -18772 -7084 114 -1036 -226 -3837 5081 13268 14321 11795 9990 2887 -13705 -15687
11875 -15687 -2272 10384 20892 11316 -2278 6496 8677 15772 9205 4015 11319 13953 12872
11862 12872 10640 18917 24775 28869 23291 16181 -4396 896 -1926 1456 12614 11166 -346 16559
11848 16559 23752 15132 -241 2649 7214 6046 22372 19296 11725 1210 11644 24031 13363
11835 13363 2028 3240 1847 -12410 -14454 -3895 -6304 -6511 12157 15186 3534 1534 -3173
11822 -3173 -5848 -5167 7268 13021 22056 21500 12783 11670 21646 15416 -13375 -33636 -19901 -2940
11808 -2940 15819 6464 -4564 -7908 -2703 -17932 -24098 9585 28502 22328 17305 1486 -13314
11795 -13314 -13404 -9904 -12618 -6377 7488 19197 24233 25136 12686 15538 27982 27546 27456 10772 14087
11780 14087 22509 13888 19481 25053 14821 13450 -1287 2245 9406 7811 14369 12801 -4576 -14163
11766 -14163 -4704 12688 15364 3591 -10543 -535 16218 15354 11986 2931 584 -1497 -11333
11753 -11333 -11028 -5188 -5512 -5535 -15720 -9006 -9678 -5336 7374 13908 10341 -8865 -13333 -12830 -13702
11738 -13702 -19756 -17777 3948 19579 26585 14531 9990 7283 12793 23353 27249 12890 -4938
11725 -4938 4106 15857 15628 26311 18001 16474 15057 7680 -4026 7300 20716 14695 5187 -1825
11711 -1825 -3892 4401 6475 4805 1759 -115 -9257 7674 12064 7110 6186 3387 -6740 -5524
11697 -5524 -1767 -3890 -132 18849 16145 9909 15265 15696 2308 -12970 -12736 -15833 -22610 -8923
11683 -8923 7820 6608 16232 6292 -18515 -24251 -19563 -7512 1946 -12005 -10773 -9820 -12657 -5752
11669 -5752 -19092 -23008 -12536 -8040 480 3565 5328 13429 7818 5873 -3231 -4841 -13444 -6505
11655 -6505 7594 19411 27243 19326 -291 -6783 -3639 3032 11898 -1553 -31318 -36674 -33448
11642 -33448 -20683 -16645 -28035 -17598 -15807 -17307 -18681 -8449 -5295 -16321 -20143 -18301 -12983
11629 -12983 -5154 6665 13630 19462 13390 4402 756 8012 17824 9568 7454 3391 -9499 -21948
11615 -21948 -8059 -9500 -2549 16370 5545 -18063 -35580 -32806 -10481 5342 4100 -2742 -5841
11602 -5841 -7323 -1061 3811 -3911 5365 5716 11813 5241 12501 25079 25445 13620 12056 24270
11588 24270 25179 2921 -20573 -30773 -29129 -18707 -6465 2446 5562 -14012 -19416 -15710 -1409
11575 -1409 -2520 -4784 4640 15192 15780 11388 8816 10732 14746 17147 11373 14682 15064 -981 4491
11560 4491 14799 33792 30047 28388 31505 25376 19520 17690 26814 25367 25516 33349 51924 68386
11546 68386 58452 37280 34437 44190 53812 30695 10057 2861 9419 24215 27343 37116 24087
11533 24087 21881 28269 25985 28050 30137 35794 35675 18155 2649 4300 16075 29484 26547 27503
11519 27503 23959 18772 6850 -9773 -10042 3490 8837 2177 -4769 15577 25765 12483 22595
11506 22595 42034 50343 41640 35738 41243 47710 33807 12984 11049 9440 19054 39391 49795
11493 49795 36450 13086 6878 18649 22547 11944 -6492 -15176 -2497 5240 16430 26774
11481 26774 36106 31861 705 -12190 -4994 1656 10122 25464 12482 -1086 -6703 6205 24382
11468 24382 45165 36671 20697 18375 7756 3293 21032 17241 13850 5466 793 -4048 -552
11455 -552 5153 -5155 -4043 -8470 -3893 -13505 -13765 -5286 -1499 -8270 -8731 -1751 -1941 -8567 -11183
11440 -11183 -14935 -14484 -14418 -4379 -1544 14073 19237 22365 27896 26846 23450 26659 28332 44630
11426 44630 32453 15930 3523 4476 10929 3360 2185 9643 24971 16630 13614 21922 29950 17823
11412 17823 11375 18641 17232 16867 30808 51261 42480 33807 19591 17732 24053 22064 12109 6334
11398 6334 5789 19419 30210 23602 17441 10009 19267 47329 46311 21172 -6903 -19694 -10520
11385 -10520 -228 24135 26314 9283 -2759 1660 19993 17834 7349 8083 20926 57175 47579
11372 47579 28142 27038 24745 19237 15808 12211 5807 15779 23697 31951 28654 33382 36837 29769
11358 29769 34958 30651 26597 36638 43710 23851 8621 -7730 -1551 22454 26833 27547 15604
11345 15604 1266 -1935 -4780 5715 1318 -2629 310 10854 3244 6688 6062 9599 18597 4073
11331 4073 -9334 6100 11597 36236 53768 52056 28144 13438 12614 18774 16557 -4915 -3388
11318 -3388 293 8366 12041 -3394 -1822 2163 3074 -6395 -3438 8325 29948 35580 34877 22788
11304 22788 14657 19007 12053 -2958 -17127 -5848 9192 13045 11397 13274 9532 -1714 939
11291 939 -14138 -23407 -19070 3510 21290 34802 37112 23889 11494 1817 -762 -7943 -14563
11278 -14563 -35370 -27861 -10569 6615 9186 1103 5914 9139 -6155 -1962 -4953 -14827 -17672
11265 -17672 -9222 -13839 -7323 8739 12062 16092 12689 16450 20189 14495 2289 -221 8315 1638
11251 1638 6446 4212 21640 29849 10769 5634 8064 7340 -5517 -26229 -36254 -27210 -26022 -25552
11237 -25552 -34236 -26530 -15579 -5919 2451 7807 15296 7405 7998 4491 17792 32940 26881 26458
11223 26458 19429 20199 28472 21270 25770 16562 8747 6632 8443 7059 -60 6074 -7598 -20174
11209 -20174 -21392 -7067 -4632 -3312 3102 -4053 -21317 -21569 -11304 -343 24533 25793 23709
11196 23709 26984 30716 24313 7872 -563 -6521 -3136 4510 12681 12026 9475 18855 20210 10545
11182 10545 7134 11666 12994 13669 -3706 -19608 -9978 -1146 1928 8870 25085 17063 12433 11062
11168 11062 27818 29604 20135 6159 -2929 -1844 8565 7209 21934 29202 23616 15520 -994
11155 -994 -2811 6960 3734 -11116 -16466 -17232 7127 8921 -5881 -23837 -24781 -20969 -20025 -20831 -21806
11140 -21806 -12601 -14134 -18487 -17822 -13110 -22968 -24028 -16661 -2000 3874 -4497 -15230 -6755 -11668
11126 -11668 -6086 10355 34834 47729 33777 40287 35567 12771 -5985 574 8035 5360 17629
11113 17629 30755 18163 -4895 -8752 1529 5952 15032 15538 12785 15886 24903 18655 -811
11100 -811 -1515 -1021 6342 6241 8305 10235 4324 11021 5009 5145 14861 26854 25411 7792 -518
11085 -518 4695 5300 -4562 -15702 -22453 -14380 368 13987 1852 -5200 -14447 -21721 -21600 -29821
11071 -29821 -34357 -29215 -13267 10071 23210 16618 6867 18105 26605 22300 20709 7080 6138
11058 6138 6762 1763 -11684 -12122 -14389 -27739 -12902 -2416 -6530 -8013 2464 16589 16035 23882
11044 23882 31774 18880 17792 1537 -8735 -8446 -13744 -15845 -8829 -8545 -3895 -8135 -4041 5404
11030 5404 7265 4058 -13402 -30751 -27061 -13241 -15785 -13271 2369 15974 21190 31541 22401
11017 22401 9150 -1002 -4287 -9598 -13419 -18970 -23182 -8707 2329 6223 6245 3741 3823 21772
11003 21772 22532 22188 11454 11700 17809 13052 8662 12342 8212 -12621 -24231 -4086 7635 8513
10989 8513 10796 1800 -1968 2677 6467 -2567 438 3662 -4862 -15241 -20336 -24970 -21390 -11174
10975 -11174 -1752 10966 17050 14516 -5018 -4089 1381 8761 8936 576 -4472 -12345 -10359 790
10961 790 8676 18366 22972 1220 -18065 -17429 4843 7545 6614 1085 1678 -5517 -563 -2625 -3440
10946 -3440 -3181 -9241 -12823 -15797 -16652 -17249 -16742 -11348 2367 -5932 -4809 -17763 -20795 -16782 -12241
10931 -12241 -23551 -6111 -4551 -727 12465 10738 11744 18507 -6437 -15798 -12407 -16389 -2816
10918 -2816 7918 14049 6087 -4073 -8858 3067 24575 26708 29933 24218 15186 4030 6896
10905 6896 13401 9163 7705 21343 37775 29613 13517 17622 16307 8359 -4494 -2018 -13551
10892 -13551 -15381 -6641 6056 10664 14128 17810 9869 -2595 9721 17833 3962 -12926 -21448
10879 -21448 -11480 -11220 -8510 -6740 -10214 3180 -1501 -5369 4952 15078 9492 -8555 -23557
10866 -23557 -20644 -10638 -10220 -12184 -11656 -16253 -42392 -51242 -30690 -23004 -17357 -12021 -10119 -17800
10852 -17800 -21480 -20973 -14160 -6347 -21045 -32057 -37371 -30372 -27637 -34775 -29723 -23782 -21541 -25678
10838 -25678 -12245 -18195 5829 17238 4 -8140 -3908 -4371 -14017 -10982 -545 4635 -1999
10825 -1999 -8915 -7605 -5773 -5527 -13260 -14319 -20831 -13676 -17346 -28940 -11349 5337 20550 15710
10811 15710 9345 3645 -2088 4688 8636 -1246 -163 3146 11271 4566 5570 20700 34434 29445
10797 29445 6710 -9577 -11424 -4405 8558 8950 7336 10884 11653 18189 14759 5773 18604 23106
10783 23106 31793 28880 14692 -2186 -103 15030 18547 17659 7096 2606 5345 652 1908 4537
10769 4537 -7745 2557 7388 5914 5005 -2799 1025 9695 3430 -8208 -8988 -14513 -13234 -5575
10755 -5575 8826 12680 14471 10867 2746 -19242 -25864 -20127 -23658 -13761 2791 -12453 -17722 -737
10741 -737 5614 3822 3812 4718 -4675 -2138 12292 14963 19590 22358 12417 -5168 -15222 -21065 -21220
10726 -21220 -24282 -9323 -3685 9617 -3248 -11247 4307 19424 9267 4948 -2781 2694 11441
10713 11441 12318 20163 17937 14130 13248 15717 11065 2352 12990 23126 19298 17201 7000 5653
10699 5653 12174 13677 -37 11176 24468 14439 -1284 -16777 -14777 -12334 -10843 -2181 -13761
10686 -13761 -25132 -17175 -6403 -8174 -15776 -17361 -16779 -8902 5144 7427 -802 -18519 -21060 -34785
10672 -34785 -55440 -50121 -35076 -35121 -19311 -4585 -360 10601 -1662 -12570 -2441 11784 11935
10659 11935 10117 494 10919 20095 7171 -4191 -11088 -16043 -4184 -1404 7102 662 -991
10646 -991 80 6147 3299 5216 4111 5081 -8886 -13703 -12818 -18410 -13907 9102 14303 420 -10379
10631 -10379 -6982 3714 16902 10492 11374 -653 -10818 -21917 -29475 -28505 -16430 -14540 -1702
10618 -1702 2159 -3879 -4676 -3011 7875 20432 20305 14679 6750 3678 -7545 -10446 -5720 -7928
10604 -7928 -7375 -7698 -11047 -27736 -17078 -9102 -7082 8521 10539 2360 4088 13442 12858 4781 4975
10589 4975 -5091 -9515 -7467 -7483 -1975 -9739 -19595 -13964 -12798 -18146 -15079 -10228 -11534 381 -8172
10574 -8172 -19114 -18394 -24962 -25390 -19686 -10517 -9738 12533 18031 6757 2393 -800 9240 17102
10560 17102 24397 24870 10040 -650 -4872 14571 8411 5667 -4713 -14410 -240 -2276 -16340
10547 -16340 -21296 -19659 -16632 -11952 -16413 -17481 -15986 -13148 11496 16757 15178 9927 5145 17649
10533 17649 7645 1708 6932 6856 -2728 -9560 2089 18611 14688 13693 3385 7005 3527 -6742
10519 -6742 -3829 6578 4984 -13362 -15064 -698 -2161 18361 27468 27734 25042 20960 26390 17127
10505 17127 -1627 -1324 -6362 -11708 -12823 -1469 2646 10786 8046 3549 8 16953 13206 11780
10491 11780 15950 19262 20802 22032 11501 5197 -1193 -5673 -14360 -26999 -28549 -26466 -4015 -972
10477 -972 -8220 -2675 -760 -18108 -34348 -29925 -15196 -3842 -10514 -14084 -1602 11940 8313
10464 8313 5008 6359 12637 3168 -2186 6479 -1740 -10631 -4443 -6325 -2864 7882 8994 -1550
10450 -1550 -977 -2608 11281 9762 -3600 -14989 -8617 -13444 -16329 -28985 -18075 -9711 -6850 -3335
10436 -3335 -3239 16263 29213 16858 10750 1066 -8870 -2090 6756 6581 8943 8412 18350 26198 30482
10421 30482 30940 27509 26184 24485 6472 -430 -3554 -5655 2635 3014 2654 -1420 -10489 -4698 4080
10406 4080 7272 -7308 -18562 -16862 8806 8342 -14219 -14875 -7600 -3254 -3172 3339 13067 8677 8076
10391 8076 12294 -3828 -20289 -22332 -28924 -23025 -21458 -17199 -13493 -6708 1079 -22221 -20527 -3062
10377 -3062 10139 25086 26084 22032 17220 13325 26864 8831 -2215 -2697 593 -14113 -18907 -23771
10363 -23771 -15216 -11332 -16574 1620 13195 11145 9357 1071 18904 32327 40086 15362 5078
10350 5078 16581 16667 9323 -6987 -9262 2510 11608 13176 8574 5352 13929 18124 24116 40975
10336 40975 44170 26861 27836 42017 70105 81443 86941 89632 94986 130541 172819 240140 321375
10323 321375 403129 495054 587658 678826 763919 819689 843631 835801 810276 766550 693964 614645
10311 614645 523936 425605 355351 307390 254032 208904 186000 170969 163016 137087 113723 114553
10299 114553 111272 108041 107464 124817 105962 77702 76412 70495 67605 71768 65622 51835 62311
10286 62311 62760 48486 48372 36159 34241 51301 56457 41382 36890 32050 26842 35321 38881 50254
10272 50254 31878 15190 15082 18450 26205 25398 11573 12240 16214 15655 12979 7208 -3331 510
10258 510 23528 20812 19565 33717 34463 30249 23579 8847 14726 43274 47547 33775 27101 22535
10244 22535 17752 6299 3479 1287 3458 2071 -6419 -8024 -3234 -4744 5538 19213 15461 14969
10230 14969 11056 -10597 1520 19554 13200 18122 16123 12622 23362 17035 20187 11056 19690
10217 19690 18184 3396 -8951 4115 12861 21169 21966 7787 10622 6049 6713 8211 -2331 -1194
10203 -1194 8061 10958 14390 10198 4707 11767 -7382 -11172 1395 3933 -6906 -8735 -12721 -3202
10189 -3202 -735 11479 -8829 -15744 2844 7109 -10201 -16317 -3470 -29 1202 -12422 -11437
10176 -11437 -7094 3390 26941 15330 2118 8664 6170 1189 178 -10777 -9970 1950 6769
10163 6769 15238 18875 18894 10254 3609 -9571 -23993 -13994 1354 -3358 -9391 -9491 -19908 84
10149 84 22955 9832 -528 8751 19033 17485 11837 2011 24882 22370 15453 1919 -4816 5719
10135 5719 1957 6868 5228 -4054 -11023 -12238 -1892 -347 1567 5171 15128 12129 8754 672
10121 672 -3703 513 4092 5247 -1370 2031 -1391 -3071 -19718 -28306 -15920 -8533 -2565 2198
10107 2198 4406 6691 1521 -18723 -21549 -20019 -19678 -15900 -17298 -12342 -607 -7477 -11093 -8042
10093 -8042 -14168 -14849 -22651 -24155 -17538 -8784 -11288 -15688 -12982 -9012 2735 9270 -2531 -16405
10079 -16405 -21728 -23467 -26529 -23167 -38729 -16286 -3309 -3708 3282 634 14777 12247 -3020
10066 -3020 -1899 1559 -7815 -25833 -34672 -16124 -970 8407 8144 -8136 -20488 -17452 -4730
10053 -4730 14996 20656 689 1354 464 -3591 -7355 -8105 -4838 1192 14823 15165 7625 2233 2595
10038 2595 12192 19293 19457 14243 -1560 -8820 -11557 -17921 -380 -9384 -26494 -32401 -31300 -8515
10024 -8515 2983 -3557 -5732 222 -1186 3265 2311 -7921 -3110 1617 -394 5032 2067 -5544
10010 -5544 2225 4057 15944 14 8435 670 -5615 -4496 1911 -861 3898 -8463 -9595 -14787
9996 -14787 -14055 -21605 -31696 -31425 -35520 -20583 -19804 -19547 -25062 -22812 -20318 -18575 -17870 -22966 -14217
9981 -14217 -7763 -1922 3575 11935 -34 -17220 -19151 5768 15403 13673 23261 19808 13617 7656
9967 7656 19 4736 4359 -12069 -16045 -18410 -19114 -16717 -17376 -9157 -631 -12749 -10413 -2946 -21058
9952 -21058 -22346 -2255 14907 23702 26594 26132 20168 441 -18851 -39065 -33765 -12634 -5462
9939 -5462 -4763 -3514 -6561 -8688 5150 4985 -437 4335 10549 22357 12923 -3911 3205 5626 6810
9924 6810 19939 17322 9260 11075 15822 22946 21023 6358 10889 24450 22068 22084 21468 13818 1835
9909 1835 13948 8694 3951 10345 5246 -4952 -17677 -15302 -12864 -9457 -6791 -4594 9185 1865
9895 1865 -20626 -33133 -27299 -8425 2564 8105 -6660 -10783 -18720 -1479 2255 4162 -7255
9882 -7255 -16848 -15090 -12312 -4427 9457 16118 6074 8306 18448 27155 24665 21577 11821 -6702
9868 -6702 -24865 -20908 -22132 -8154 8268 -5152 -9514 -7398 3349 -2807 11582 22210 6709
9855 6709 -6378 -15830 -23881 -20499 -10668 -3198 -9995 -14311 -4986 9617 7223 10655 17146 13254
9841 13254 17609 21749 15280 16566 22544 28700 20826 24663 24686 20362 11445 26290 19116 11139 5903
9826 5903 2729 9214 3893 -9274 -3316 10722 16476 -221 -452 17546 18260 10397 -118 20452
9812 20452 21555 6101 -2290 -4405 -2170 535 -10989 -11939 -9376 -1088 -8862 -18401 -12638 -4176
9798 -4176 4348 1788 -256 14959 3800 -774 8300 -11389 -11424 -4462 15820 11311 -619 -9552
9784 -9552 -28864 -28727 -25369 -8669 -9549 -12174 -18915 -15791 -11788 334 1561 -6016 -2379 1191 346
9769 346 -4438 -15476 -20435 -12489 -16044 -22523 -18912 -24779 -23454 -20226 -18482 -9738 -19747 -26924 -21203
9754 -21203 -3889 10969 11361 -2199 -15262 -29569 -28369 -30804 -26895 -13204 -18968 -16745 -25939
9741 -25939 -38678 -28533 -20819 -14708 -14136 3726 3198 -17410 -37109 -32610 -29885 -5640 2787 2477
9727 2477 8982 12162 7650 3017 6001 -396 -7480 -14098 -20551 -33267 -22843 -7793 -12489 -10152
9713 -10152 -3808 3778 -4996 -26619 -31986 -36267 -32157 -26385 -28835 -27246 -3473 6807 1082 10220
9699 10220 11973 -3224 3280 3403 -12198 -16694 -18673 -18093 -15495 -4677 -2659 -8024 -10314 -3510
9685 -3510 -15827 -18090 -9891 -6786 -3172 4020 -4409 -4790 -6770 -19231 -8630 165 2083 -5878
9671 -5878 -4329 10993 10322 3486 12672 6098 -6096 -7350 5358 -8493 -3734 -13041 -17447 -8202
9657 -8202 -13224 -10980 4252 -5425 -1505 -1587 8815 11054 17 -16288 -18580 -13226 -1980 -8528
9643 -8528 -912 11293 4357 -11746 -12722 -7462 -5222 12770 29954 30060 18913 1666 -3078 12816
9629 12816 16591 10101 -3433 -12130 -6364 -7308 -12721 -1035 709 5344 8582 395 11315 16230
9615 16230 9070 8836 20325 6713 -17433 -21216 -20345 -11197 -378 22671 20999 16989 17881 27443
9601 27443 25893 10132 7102 -461 -22793 -17947 -20964 -25901 -19141 -16496 -16496 -16775 -11445 4678 -2887
9586 -2887 -506 8560 8116 4745 -3596 8264 21057 1218 -14115 -3286 6401 -4966 -17678
9573 -17678 -20547 -20564 -12022 -18016 -14855 -15938 -28815 -27120 -13192 -15625 -1049 5023 19465 20866
9559 20866 6929 4332 7752 10507 1986 7928 7205 8447 13338 2408 -8485 -4610 -13812 -26526
9545 -26526 -21443 -16315 -12087 -17911 -20158 -7370 -4846 6188 20381 31874 19027 13570 566
9532 566 -2084 -15032 -14163 -13862 -16438 -15113 -13717 -11225 -8393 4390 6407 -3120 -11077 -6470 -13912
9517 -13912 -29377 -22845 -8290 1426 4992 -10627 -14942 -2799 -6848 -9155 -8010 -6431 -12799 -8691
9503 -8691 7088 14684 -1579 -12502 -19714 -28940 -21472 -16896 -25026 -18049 -21241 -32555 -20319 -11596
9489 -11596 -10853 -1638 1670 5353 -889 3609 7650 -18128 -17387 -13410 -8232 -10539 -12903 -180 3469
9474 3469 11696 11570 11559 2040 7072 8002 -1560 3133 -10275 -24570 -41026 -49800 -33964 -9567 2226
9459 2226 -1107 -4746 -11801 -16739 -14537 -6127 9728 4270 -1614 3195 -3295 9091 16703 13660
9445 13660 -2832 -3231 9445 17142 17726 11170 15098 27879 19861 7882 -8459 -17640 -16138 4559
9431 4559 -3769 3767 9361 4600 8640 2002 -3902 -4616 7417 2916 -12968 -6493 -468 14417
9417 14417 23712 11552 10206 3662 -1226 3524 2574 -3701 -10768 -2703 -6610 -17074 -12943 663
9403 663 -7671 825 5435 583 -14567 -25059 -24516 -22561 -4197 534 -15133 -29103 -21855 5493
9389 5493 14347 25870 21525 17794 14547 12293 5633 3797 2183 11172 26174 40240 47134 31328
9375 31328 22476 16155 10245 11101 2101 -640 10328 6803 3645 17101 25698 6260 7554 6417
9361 6417 1348 7211 2120 -1836 -6781 -5175 8647 1187 -9788 -21058 -18488 -16374 -10572 -3452
9347 -3452 1662 6485 -2427 -9323 -2070 4095 3602 -1372 -7720 -2119 2132 3775 2010 -2593 3
9332 3 326 4584 4643 1388 5416 -1615 5651 6466 8605 15820 5471 -12899 -18078 -10185 962 4521
9316 4521 12843 20481 26859 12957 13673 15387 7082 11556 17448 10197 -5370 854 6387 15705 7099
9301 7099 5977 7975 13373 29989 45802 20530 11019 10752 9922 9173 9363 7370 8600 1836 -6201
9286 -6201 -11074 -2626 -5105 -5549 -16321 -7011 12341 12203 -6076 -8202 489 -5856 15428 25778
9272 25778 13001 -9866 -22143 -17992 -6570 6610 16886 4349 -3387 -20655 -19195 -16672 -5410
9259 -5410 -930 -3569 -1718 11532 7254 -2132 -16008 -12118 -7759 -28301 -30730 -12674 -635 -770
9245 -770 3212 2373 1167 -86 -1861 -11745 -28177 -14222 1185 -2483 -13062 -28760 -34718 -27047
9231 -27047 -20077 -18076 -25610 -25135 -17040 2163 9241 4294 -6714 -13064 -8787 -17672 -14633 9883
9217 9883 28015 28918 18516 3733 -4638 -4453 -8525 -3684 8938 6757 1462 -16844 -33731 -24966
9203 -24966 -6033 -2770 -1437 585 -3978 -20466 -20520 -15609 -22298 -17763 -24823 -34260 -17186 -3544
9189 -3544 -6189 -23247 -11865 975 10406 9279 19657 31123 36189 31486 17932 3390 -2016
9176 -2016 -16681 -8491 -3958 4646 29975 28463 13095 -5492 -22290 -9706 9937 5128 15228
9163 15228 11493 13163 8397 -2815 -3321 -11923 -19983 -14527 -9043 -9727 -9470 -6704 -8294 -6457 -13129
9148 -13129 -12213 -7413 -1285 -4481 -16464 -24413 -23780 -539 26589 20157 12188 23581 26356 27067
9134 27067 16649 12506 23256 32238 38635 28513 31247 28925 12623 7600 14874 16215 3595
9121 3595 -3900 8793 12398 -1412 461 2961 10992 3648 1574 4100 465 3930 6955 -5168
9107 -5168 -305 5203 6802 -9228 139 6320 -3187 -8003 -8163 -12029 -7022 -688 -10841 -5999 8480
9092 8480 9891 18218 16665 13327 -2100 -13213 -17510 -23766 -32432 -43220 -32006 -26576 -21628 -30271
9078 -30271 -29556 -19629 -7726 -2208 1787 -2112 -9288 -17482 -4985 -4167 -1830 5049 23295 22641 9572
9063 9572 19592 14127 -30 2761 10484 2699 -866 -22533 -40533 -26435 -26137 -16998 -6900 1745
9049 1745 5599 7117 3080 12818 32926 39938 28628 13809 23484 14889 -7737 -12986 -18470 -15850
9035 -15850 -9084 -2746 10322 10650 5737 2131 -14318 -21233 -26447 -28276 -30487 -34802 -38804 -44144
9021 -44144 -24745 -3673 4205 -17369 -24811 -9673 129 5564 2657 3792 5861 23247 29014
9008 29014 32191 13140 25608 27906 19815 3795 9310 15466 12509 295 -12805 -21632 -20238
8995 -20238 -11376 -14575 1971 20259 26950 18452 2941 460 5111 256 -6533 -10260 -16343 -25900
8981 -25900 -18635 -7850 2895 -2065 162 468 883 11089 4279 171 7607 15558 23461 16246
8967 16246 -1887 -14411 221 3914 -8538 -6782 1344 -3808 -5635 9049 8549 2868 11933 5407
8953 5407 19675 24761 30465 14734 -99 -8466 -60 9002 18901 19776 23353 26434 18414 4023
8939 4023 -3391 -9435 -16644 -11009 -4724 7263 -7065 -22980 -12983 182 8875 -163 -11083 -4766
8925 -4766 16291 31854 29537 31742 32864 27843 30971 23679 15790 14856 16272 4686 -5988 -9051
8911 -9051 -11177 -16971 -9717 -5811 -6993 -15797 -15938 -4867 -12446 -17376 -21661 -10488 -3159 -9673 -9870
8896 -9870 -6301 -2584 -4871 3871 -3625 -610 4104 3770 -3723 1717 8907 1013 -6007 -10010 -6577
8881 -6577 -9326 -26251 -19240 -4634 -7364 -6567 -10444 -12193 -14965 -3876 6624 10859 4857 -169
8867 -169 -521 -5905 -5277 -22250 -32374 -11990 -7812 -7559 33 7966 4343 1838 11826 4000 -9186
8852 -9186 -4619 -7837 -9706 -5998 -13309 -16822 -1368 18795 19253 25307 21401 19723 8302 17056
8838 17056 26010 26715 22002 20634 9262 11797 20387 12703 9587 7196 7143 4035 -1380 -1371 6247 -1811
8822 -1811 -1464 15186 21 -22229 -23632 -19070 -18879 -14669 -22588 -35290 -38604 -4161 6413 -4950
8808 -4950 -2886 7997 -2665 -10446 -3935 -17623 -15717 -9687 -23928 -19121 1673 5801 17345
8795 17345 22746 28187 20906 6178 19908 21396 26181 32752 21920 27763 25159 26733 22809 19329
8781 19329 -1622 -8222 -19742 -11503 -4913 -2584 -14461 -11346 -14290 -18683 -19541 -7552 4473 12391
8767 12391 10550 8547 1515 8088 -1140 4402 7100 -1297 7030 12085 7784 -11643 -26317 -13935
8753 -13935 9149 -3614 -8229 -5336 1960 5648 2461 -2569 3719 8114 7609 11030 16118 6371
8739 6371 642 15418 5590 -5282 3454 -11680 -7624 10970 21157 10462 -5501 -15129 -16253
8726 -16253 -23114 -36088 -35090 5510 24519 42664 38951 15868 -3616 -6023 -10548 4065 3648
8713 3648 2557 -9147 -5939 8406 3512 -5157 -11476 -17283 -21989 -1871 7645 2981 -9739 -26088
8699 -26088 -30939 -30708 -21021 -14548 -12179 -15715 -20786 -18919 -7921 9464 19613 17016 -632 -14626
8685 -14626 -14334 -22837 -32270 -20659 -11444 -9988 -13046 -12378 -3416 4000 -1525 -8215 -13472 -9205 -5163
8670 -5163 -6539 6554 5673 -4346 -5707 -3869 -11478 -10270 -2309 -1240 -9828 -7803 -3090 14003
8656 14003 11279 3795 12723 16119 19417 15969 -229 6751 2417 -3742 -5984 -1049 -8178 -2301
8642 -2301 2804 10162 17911 18082 20474 16179 16741 21418 18851 18177 14186 -2830 -19501 -1613 13142
8627 13142 12079 6451 13428 18332 22908 31282 22261 20394 22514 17635 21679 27220 21950 23667 31822
8612 31822 30157 19591 8353 -7719 -2869 2741 -2913 2425 20086 25550 29930 22793 12852 12507
8598 12507 3857 -7517 -17610 -15284 -6445 -3652 -19506 -25424 2500 8638 11723 10027 -617
8585 -617 1355 8154 2386 6100 16572 11216 21659 31082 39152 45610 55499 58983 52826 63852
8571 63852 65516 60963 50805 44266 43714 24612 32152 27496 20659 20939 16179 18761 31245 27451
8557 27451 26865 40674 40437 19064 22346 32958 35871 38305 31224 31719 33775 12512 796 15725
8543 15725 30515 32235 14537 5624 8697 12131 12822 11995 13008 20028 11150 -5248 -9973 -422
8529 -422 6867 11405 5151 2876 9539 11048 11791 -4368 -17751 -28063 -22133 -419 20344 31204
8515 31204 24833 21159 16170 13538 10776 5914 19746 20660 15813 22125 42923 47160 47051 47412 41956
8500 41956 15674 2129 6899 12312 16178 15022 23548 14662 -13581 -15529 -7220 -11944 -23475 -14317
8486 -14317 -1686 11344 8938 -186 3362 -1335 -6664 -11473 -20254 -15225 -826 3452 407 -1316
8472 -1316 -9868 -15256 -21242 -37473 -35375 -2179 10909 7543 -3748 -3036 10118 15061 5493 -12839
8458 -12839 -11697 -1200 1075 -7941 -8071 6020 13029 6890 7739 5819 18816 17862 -5437 5089
8444 5089 22913 33628 33195 42685 51851 40079 16505 4794 -3505 -17223 -27007 -7871 -2423
8431 -2423 -4409 9575 19615 7805 356 3154 -11152 -4263 -1786 1473 7037 2604 8650 17272
8417 17272 25902 12018 -1934 -3526 6247 6751 6276 14412 2512 -8334 -10365 -17246 -11522 -2068
8403 -2068 7071 12328 2747 -11463 -23780 -20747 -15026 -18487 -17858 -13133 1543 7199 2317 -7646
8389 -7646 -21739 -19121 -19817 -3690 17304 16910 23116 22980 -8607 -17278 -1077 6299 18009 13908
8375 13908 9350 17610 14536 -81 5115 -126 -5727 2561 11493 3245 3775 1551 1013 -962 -418
8360 -418 -2092 -6099 -14443 -5839 9735 15730 11923 4379 -4659 -1976 -17664 -21615 -11422 11999
8346 11999 15974 19027 28990 30050 24498 10300 21669 15111 -6441 -22405 -23762 -20372 -15563 -19582
8332 -19582 -22218 -24025 -20542 -15763 -17255 -8635 -1969 -13417 -7678 -4428 -579 -12874 -12218 -13102 -14572
8317 -14572 -6019 6601 13649 7721 1261 12945 16455 34145 19201 8284 6325 20007 23771
8304 23771 11464 -4965 -14665 -25399 -14489 -12958 -9004 2869 15203 18617 9084 -4869 -22585
8291 -22585 -12623 245 18787 18252 18084 5600 -10184 -16395 -16172 -15945 -14057 -17899 -14485 -1231
8277 -1231 5322 460 -11940 -5347 -4703 -11565 -8940 -9239 -1779 2037 4720 14900 13033 4879 -6021
8262 -6021 -9411 -10420 -7558 2197 -4387 2730 -4817 -3740 6643 9529 8169 -397 -2468 -14964
8248 -14964 -1680 -570 -3571 -11833 -5394 -1366 16975 23661 24687 23876 10504 -7109 -11640 -3218
8234 -3218 1132 10423 -7652 -13719 -8029 -7993 7941 7180 -2954 9966 23502 29146 6413 -8142
8220 -8142 -3482 -12038 -8191 7316 16463 30501 22123 11392 16841 9565 -258 -10916 -18184 -14477
8206 -14477 -12138 1263 12598 12282 14059 19503 15861 -4000 -23412 -27469 -25767 -33617 -40242 -45470
8192 -45470 -33579 -19007 -18690 -20040 -21530 158 9345 -12807 -16602 -22529 -20550 -23754 -19310 -8203
8178 -8203 -5809 3871 6123 9379 887 2360 8967 5148 4533 9292 2967 -6903 1125 4683 4644 -5720
8162 -5720 -10501 -6479 -18672 -24689 -12349 -4187 2541 7770 7152 7911 11048 9691 21784 9906
8148 9906 -22343 -35283 -22026 -15908 -12252 -5149 -8103 -27126 -20493 -2584 -7855 -4104 3879 27857
8134 27857 15201 -5281 -12541 -5039 -9080 -16419 -25682 -16575 -12089 -10512 -6399 1383 -4682 -6846
8120 -6846 -4168 -153 2800 5673 -2252 5263 2855 2866 5816 8950 1808 -564 -7968 -299 6706
8105 6706 -547 -8963 -28871 -28617 -28861 -21986 -12463 -5212 709 -2323 796 3391 14282 6688 -1622
8090 -1622 3395 3949 4477 -4825 -5013 -861 -11200 2975 24763 16673 3597 788 1172 4872 3188
8075 3188 -1945 -473 9552 -9401 -16768 -6661 12169 16155 4509 4604 13143 8578 5029 2965
8061 2965 -5466 9670 13323 5730 2910 13365 3546 6117 -13640 -18070 -14141 -15570 -11728 -30502
8047 -30502 -25180 -10149 -19342 -17685 -10163 1312 26118 19136 11035 -2707 -4337 -5305 -8318 -7872
8033 -7872 6805 14416 12794 14409 19980 38355 29564 6760 -6333 -9552 -5693 -8955 1268 3704
8019 3704 -8717 -7178 -19795 -25774 -21877 -13241 -16897 -17868 -13758 -14148 -13785 -11197 -13303 -7806 7730
8004 7730 4216 8589 20302 11665 13836 9888 4111 10355 3674 8382 14595 17872 5523 90
7990 90 2348 8896 1218 -2898 12911 8339 9586 10066 19331 38785 29056 6027 3159 4071 -36
7975 -36 -11563 -11281 305 15491 23551 20133 8634 4112 -3967 -16829 -9825 1765 -1158 11773
7961 11773 18749 26972 20130 3466 3793 24860 31978 28580 20642 12108 6436 2464 2365 15766 25410
7946 25410 29400 35855 15248 3065 8486 20944 7226 -182 4532 3460 9355 14271 8892 9150
7932 9150 16439 6811 12599 13576 10689 -376 -1752 -4861 604 -2515 6759 -1511 -13503 -7396 -1337
7917 -1337 724 -4767 -15083 -6345 7430 7963 8616 9090 16033 21232 20178 23779 33696 38875 36594
7902 36594 30610 31922 33553 23616 8547 7398 8119 9647 -801 -8456 -4389 9745 25393 25488
7888 25488 7140 -1341 -7664 -3175 9216 15929 5118 -12226 -20737 -32218 -25854 97 12115
7875 12115 -1917 5236 11331 2670 4593 3999 9446 11679 10623 11581 1477 3165 3495 2262 -3031
7860 -3031 -10164 -5493 7621 10706 -8674 -19153 -12914 -9011 -5137 7985 8965 6730 -4004 -16120
7846 -16120 -7993 -8189 -8624 -4114 10149 16019 4101 2832 15377 25620 20808 20273 3666 -6016
7832 -6016 -10363 -6711 -5684 -8070 -5259 -10279 -6006 -3662 -17792 -15698 -9415 -6228 -8842 -9646 -2503
7817 -2503 8882 6315 3875 18147 28976 34918 17055 11713 12449 1152 -12181 -13364 -10606 6723
7803 6723 18186 4408 4234 2407 -10852 -6467 -6354 -8491 -15313 -10337 -6317 -2385 6687 -3337
7789 -3337 -7413 3804 13372 14746 8721 -4248 -10512 -347 9544 11588 5033 -4689 -10419 -8227
7775 -8227 -5619 -18168 -19294 -11822 2829 -1480 -7770 -10949 -8442 9998 18082 7453 6348 -110
7761 -110 -11791 -1529 13172 7836 5397 1172 -3095 -5445 -12469 -11398 -7945 -16727 -24898 -43739
7747 -43739 -28744 -11868 -458 991 10680 19014 16825 10841 -3201 9602 13692 7386 11820
7734 11820 16227 13163 4914 -9225 6860 13546 5155 -1672 -2857 -16878 -7212 19457 4333
7721 4333 -2751 3019 14359 12149 16387 -2945 -4492 2559 6237 5039 -4143 -320 4578 10112
7707 10112 -13062 -15830 -10042 -1800 945 -8149 -9085 252 17420 17087 14426 12557 22581 24972
7693 24972 13767 2424 10033 8745 -2468 -4043 1698 13226 3514 5481 7551 5269 442 987
7679 987 9744 11802 -490 -2150 5972 8167 -7210 -15875 -13467 -15908 -10897 -7885 -7674 12089 -6201
7664 -6201 -24825 -28780 -17580 -8676 -4063 5553 1076 -4747 -20014 -40389 -38093 -25255 -258
7651 -258 7180 3932 -910 3133 7789 6352 -4982 -11356 -27786 -22223 -2320 -849 -2959 -11302
7637 -11302 -29208 -11371 1072 -2483 -14012 -6643 -13768 -16005 -6469 -5844 -1178 615 2789 26645
7623 26645 25063 14358 171 -2404 -3740 -8060 -13948 -13278 -6562 -6356 -8522 -7154 -8240 -13465 -29299
7608 -29299 -42607 -26878 -20019 -9814 -1097 -4784 -7278 -5017 -7968 -2449 7125 -6987 -21567
7595 -21567 -17013 -17075 -24513 -33287 -41186 -21550 -3943 -6927 -7692 464 6931 -710 6494 6175 -10778
7580 -10778 -15866 -13336 -21174 -26100 -10188 -12684 -21558 -31883 -34661 -28693 -16865 -6020 -7054 -19105
7566 -19105 -28159 -27219 -35499 -40434 -35582 -27091 -11171 -2447 -6286 -11019 -4124 -1928 7908 9648 9294
7551 9294 2197 5966 -2648 -11633 -13616 -4359 -11736 212 4185 5777 -7487 -9140 -11237 -12978
7537 -12978 -8827 -9202 -4152 17649 9676 -16470 -20029 -5993 5235 12942 8774 6788 5045 -11190
7523 -11190 -13710 -4589 -2490 -6954 -31969 -42348 -36326 -19747 -1357 -747 5735 731 -1835 3726
7509 3726 5482 5757 2006 -4855 -3064 13204 28227 11720 1807 -23519 -13911 -8985 9177 19474
7495 19474 17369 5666 4947 -2089 -13944 -14927 -14899 -11475 -8641 -1437 9284 25874 10803 -9315
7481 -9315 -25798 -40071 -22281 -8171 -2834 -1954 -9673 -23154 -24881 -29325 -22998 -24224 -26354 -16616
7467 -16616 -15668 -9532 -1221 4315 7613 5826 5250 -8512 -20856 -11295 -7806 -18165 -36786 -40786
7453 -40786 -41085 -21656 -15670 -2753 3184 -14254 -16551 -9674 -9249 -8283 278 -14112 -14411 -16084 -2673
7438 -2673 -1163 1688 9769 7780 6906 3725 9569 2721 12401 35274 24760 14495 14099 -1751
7424 -1751 -18346 -15487 -23977 -7293 -18786 -26854 -23367 -17083 -25651 -21418 -17914 -15894 -10551 -17233
7410 -17233 -18830 -4177 14641 7108 4456 12065 27399 31429 32022 14633 1139 -1077 -7744 -9135
7396 -9135 -3430 -1860 -6407 -17512 -1946 -3002 1514 10963 10408 7315 4588 -18376 -22206 -30067
7382 -30067 -21047 -11011 932 9291 21369 23426 7247 -7534 -4101 -4715 4243 4207 -1338 -3919
7368 -3919 -9513 -9094 -10653 -2969 11087 -2788 -17263 -16557 1132 13264 11708 -1465 -3166 -7299
7354 -7299 -19823 -20333 -4934 12817 15421 11804 19239 25789 13962 7921 13882 2483 2972 26044
7340 26044 8288 -18557 -26000 -26931 -41524 -46564 -29296 -9661 5090 2407 1008 6424 14205
7327 14205 9738 7583 -5401 -3848 -7332 2086 4711 1533 6253 4479 -7598 -3839 9769 25161
7313 25161 34998 19603 19990 25096 19260 2390 -3528 -2443 -1544 -14950 -9458 5731 10610 5468
7299 5468 5901 15503 693 -8302 -6975 1478 10796 2724 -8632 -21289 -26914 -21711 -3768 8292
7285 8292 -6697 -12278 -11125 -3716 -5226 -11422 -22295 -20385 -17462 -23635 -23787 -12858 -3928 -6046
7271 -6046 187 -409 -12736 -7865 -9209 -2117 -4706 -5648 2573 14886 14175 -1505 -3653 -18819 -31743
7256 -31743 -45085 -38794 -24454 -18549 -22613 -28775 -30272 -31301 -27397 -4727 7208 6514 -11277 -17989
7242 -17989 -25712 -7156 -255 5491 485 -15420 -21508 -16670 -2499 -2613 7090 25426 26959 11931
7228 11931 12588 -980 -8118 -6573 9487 27984 40609 28881 5711 65 7925 7015 21645
7215 21645 24592 22756 20907 19362 16863 13667 -2892 -9366 -8229 -295 11628 5506 -685 20925
7201 20925 4257 -17244 -25385 -15223 -8322 4572 15903 3610 5382 -1707 -8696 8453 10819
7188 10819 -6411 -6803 -7394 -17427 -16706 -21608 -19686 -8262 685 -1541 12960 18166 9991 24422
7174 24422 32739 23917 29079 17621 -9552 -24627 -34010 -22223 -19421 -23749 -13434 -15854 -13420
7161 -13420 -7811 -4395 -12167 -19661 -23875 -16696 -7637 5349 5993 -3818 -1475 16873 22321 14135
7147 14135 1798 3930 749 14955 21411 20925 4550 -11293 -9384 3560 5444 -999 -4505 -6976
7133 -6976 -11408 -166 15376 14827 4752 -5327 770 11325 23796 14911 22137 25312 21718 18856
7119 18856 16167 13531 15963 16108 7604 -2160 5069 -1852 -19112 -14728 -13336 -8564 -4331 -8281 -911
7104 -911 5486 -839 -13196 -6948 -9053 -5461 6919 -7483 -6403 -14424 -32045 -43205 -48495 -42356
7090 -42356 -36451 -25688 -16843 -10075 -8182 -5355 4186 -2898 -2665 544 -8147 -11878 -2899 13863
7076 13863 11126 5941 3502 17245 18771 10311 11501 343 -5336 -8929 -14602 -6006 -7692 -13745
7062 -13745 -24588 -22576 -17739 -14442 -8624 -7694 1334 -18157 -27616 -20358 -17025 -12354 8680 8784
7048 8784 13524 17992 12864 4857 2097 -1460 1641 13938 22249 22316 299 -10850 -8819 -10573 1003
7033 1003 -6298 -24335 -23847 -24367 -31910 -15195 -7274 -2402 6182 8326 -4202 -23678 -22419 -24400
7019 -24400 -11673 5728 4564 -10454 -12253 -9773 -12577 -23437 -26160 -3636 4775 8856 4190
7006 4190 -14347 -33522 -34970 -29028 -14568 4593 -4822 -15564 -17209 -23091 -14195 -8490 -15066 -19478
6992 -19478 -17421 -193 -1069 -10687 -21920 -12889 -7775 -16831 -16072 -8651 -2114 -681 -13950 -15861
6978 -15861 -2326 5805 20682 23433 14856 7847 3603 -2966 -7936 -9199 -14373 -27492 -19655 -9757
6964 -9757 -4552 -8756 2536 11971 3231 -8694 -5660 -4007 -8079 9114 20512 21976 10967 5072
6950 5072 -3489 -16521 -19051 -19605 -24836 -12019 -6749 -4902 -8354 -8494 -4962 -5668 -570 8676 6684
6935 6684 687 6668 16265 958 -13220 -16681 -21212 -9954 -1485 -6719 -9381 -5841 -10389 -8595
6921 -8595 -2025 480 -12139 -7327 6155 7770 2699 -15507 -22694 -26056 -35919 -30086 -24506 -26191
6907 -26191 -10720 7324 22479 19104 2427 -141 -9204 -12323 1814 11868 12512 2649 -17971
6894 -17971 -22491 -22401 -13759 1525 18899 19218 1790 -8247 5288 12407 5535 -2771 -4761 -12380
6880 -12380 -14157 -24785 -47381 -32159 -24321 -9423 -10072 -1865 3610 -6647 -14676 -7558 2003 12224
6866 12224 22333 31019 8222 -5723 -7146 2844 -4635 -30861 -26961 -11062 -6861 -3645 -1716
6853 -1716 10776 16740 15704 11704 -6961 -11520 -11360 -20620 -10575 450 2311 -1429 -20341 -29774
6839 -29774 -14703 -6244 10994 16022 13711 13276 -4217 -11506 3674 7416 17101 24615 8207 7256
6825 7256 -3018 4174 5740 -774 -1166 13202 5933 -22450 -21734 -1451 3249 363 -1301 6299
6811 6299 2671 5768 6172 1087 -9637 -411 5534 4793 1674 -9839 -21854 -25495 -12880 140
6797 140 1691 -1031 6838 7131 -318 -23414 -20246 -28656 -28101 -15830 -11693 -6514 -6008 -2075 -5458
6782 -5458 -13089 -4947 8442 15988 17748 4579 -5737 3420 946 4116 84 -2800 -11645 -11686 6989
6767 6989 10681 -675 -6759 392 8436 13544 20682 6242 -7520 -5180 3527 325 2602 4948
6753 4948 13922 21578 23949 20095 5560 21131 19084 14479 5510 9801 6938 -13855 -18863 -13428
6739 -13428 9260 24064 23742 13772 9503 7164 -1875 76 14934 14023 9911 11675 20436 16381
6725 16381 30405 21519 6849 -5789 -7853 1788 3555 -9991 -14266 -6869 -5303 -18859 -16011
6712 -16011 -8920 -694 1720 -1283 -11315 -14414 -21267 -18038 -11032 -9859 8707 6096 -3039 -828
6698 -828 -18439 -31123 -29498 -34183 -3722 804 -11633 -8249 -10303 -3147 -15930 -10234 2226 15518
6684 15518 -3340 -13308 -5341 -5961 -7835 -13902 -10696 -9549 -5936 -3770 2573 5871 -5216 -8832
6670 -8832 -16842 -19697 -30731 -19601 -7112 6722 12906 11073 9380 17571 9612 83 3009 4613
6656 4613 3707 -10505 -11929 1013 15915 -10768 -10509 -2338 -371 -10434 -13034 -5191 2332 8505
6642 8505 23998 22564 6168 176 -2839 -6506 -2358 79 10605 10866 -13533 -19440 -21859 -10188
6628 -10188 -11238 -1057 -3924 -22691 -23573 -21581 -17787 -14359 -10851 -11555 -3003 -13529 -20855 -20517 -5884
6613 -5884 6980 5736 -3368 -1788 4357 13185 8590 7065 -688 4260 -8977 -25380 -21204 -13199
6599 -13199 -4968 2169 4794 -3722 -19594 -16996 -15374 -23460 -22249 -19394 -22572 -18961 -2828 -15807
6585 -15807 -48489 -38337 -29870 -15769 -6572 -2480 -10157 -16205 -9199 7668 7327 8421 8302 7015
6571 7015 6122 -1260 -15459 -22313 -30677 -29486 -17962 32 2481 2402 21120 27933 16100 7467
6557 7467 15140 11339 7172 1822 -17137 -17350 -7235 328 4050 13659 16679 17977 11330 15407 11709
6542 11709 -3778 780 -4355 -16965 -20079 -17034 -14874 -7071 1489 -9104 -5213 1692 -2987 -18919
6528 -18919 -15995 9840 22159 26504 33883 23562 20348 11198 4095 3304 4511 1021 -2778 -14044
6514 -14044 -14814 -5425 -15854 -18377 -3445 7696 -548 -15492 -20851 -13428 -5055 13075 34605
6501 34605 37518 24404 129 -11183 -11720 -18470 -19675 -13335 -6190 -11597 -7819 4221 14619 12666
6487 12666 2833 -1236 -942 4068 4651 4537 19115 23827 14072 10452 14448 9693 1600 -1043 -2267
6472 -2267 2514 12507 3717 -3253 -9398 -13123 -28036 -19192 -8327 -16136 -18948 -1066 -1361 3597
6458 3597 3680 1978 6783 8419 -5037 -14913 -4137 -3632 -14938 -15056 -1872 3099 12967 12641 5237
6443 5237 3022 6183 9950 10006 3039 4413 11991 5166 -11058 -15473 -28516 -38485 -34754 -29355 -27114
6428 -27114 -13334 -2378 595 -4231 3471 3350 -10311 -273 2805 -6624 321 9061 11763 16380
6414 16380 21207 14563 15007 -6432 -3874 928 -6712 5576 29870 14256 -9732 -20530 -8737
6401 -8737 2871 -17394 -24878 -14137 -12618 546 -424 -1771 3878 5876 6139 16103 14678 -4862
6387 -4862 -17094 4724 5960 9105 6038 -20455 -29143 -8228 -8941 -12194 -3776 4948 -4652 -7838
6373 -7838 15931 4916 -5605 -9168 -17929 -25301 -13077 -2190 -6114 -1022 6265 5623 10053 11173
6359 11173 3817 -9584 -2988 994 7734 9906 7994 11837 2303 -1626 -13120 -13472 2850 -1474
6345 -1474 -12473 -6960 8927 -1174 -11991 -10170 -7112 2662 7372 1772 -7553 -13879 -10376 -25156
6331 -25156 -20022 -15250 -5445 -3692 3121 9988 9728 12191 13610 9114 19946 9787 1117 -12038
6317 -12038 -20595 -25059 -28600 -36561 -25888 -401 24175 9904 -3644 -18690 -39322 -40511 -16085
6304 -16085 -7264 -5098 -12325 -15422 -7609 2669 -1998 4858 10627 6131 11360 15504 11990 5575
6290 5575 1372 7152 10241 16510 21647 13687 14710 11199 16602 3800 -5029 1441 -981 -3916 -1576
6275 -1576 6043 9850 7888 18818 25764 12811 -6929 -17165 -21464 -12381 -207 1575 -7518 -18188
6261 -18188 -14392 1817 10652 5395 2631 -14853 -18500 -23394 -10962 -5822 9269 5208 4265 -9190
6247 -9190 -24193 -11644 -3992 7641 7450 13733 12930 4640 -3156 -1754 4010 2311 -3118 -1574 -219
6232 -219 12158 12592 10109 10628 7982 13225 28249 25139 14881 13244 13571 -7009 10117 20827
6218 20827 5698 -13009 -12705 -13121 -8356 -4719 -6961 8871 8882 15366 21317 13954 -8095 -8318 7437
6203 7437 -7264 -14569 -6200 -1177 -13172 -16587 -18376 -1870 6290 3657 -12672 -26455 -40687
6190 -40687 -25355 -9949 -10335 -4831 7894 6775 12111 20206 22927 21269 6635 10256 21873 22168
6176 22168 15908 17694 26811 37068 12719 -6660 -13795 -9675 -21466 -22941 -24126 -13552 -36
6163 -36 4463 5725 -3495 -874 6929 5013 -15728 -19139 -7191 -9412 -9178 -15326 -17373 -11871 -26029
6148 -26029 -17928 -5311 -12980 -22409 -9713 -3732 -15200 -27794 -17155 -2233 698 7376 5583
6135 5583 -11518 -21898 -23626 -31400 -35156 -24039 -8681 -2939 7241 -5650 -3664 7167 1861
6122 1861 7938 5835 10916 10945 1535 4714 -2190 -15250 -9723 -4561 -1881 -4632 6065 10474 8544
6107 8544 -4696 -1247 -1621 -8646 -22530 -24003 -13507 -9123 -21756 -33511 -34999 -30682 -21677 -29529
6093 -29529 -29567 -23854 -17334 -6218 3227 -3521 -10831 -14157 -22335 -18364 -9223 -6845 -3506 8579 -2226
6078 -2226 -7870 -4872 -3658 -1347 13107 7480 -3924 -5270 -4079 -9508 -9244 -4665 6689 20613
6064 20613 7578 -10602 -663 5922 9971 630 -795 -1757 -2203 -3480 -12670 -7443 9524 15800
6050 15800 11907 3781 3164 10124 6493 -4438 -5919 -6330 -4896 -6115 7749 6358 -1484 3164 16615
6035 16615 10790 -6498 -12852 -2960 4549 13257 10280 -3513 -6560 -230 6151 1778 1402 -11715
6021 -11715 -24521 -17741 -6053 -22561 -24621 -14596 -14032 -10601 14745 17646 4588 -6886 -11923
6008 -11923 2968 19018 25435 22420 5467 -8455 4108 7356 17517 23236 10443 18231 18472
5995 18472 14783 6394 5188 -2567 -5272 3052 2512 6437 9680 5554 -14007 -14048 -21984 -17920 -2920
5980 -2920 -2 -2473 -6216 -8853 -17505 -26762 142 23143 23295 15026 -6851 -7066 1400 12102
5966 12102 15542 6203 -1283 2914 11049 8102 6743 7253 15371 7610 2241 8557 -1072 2554 14217
5951 14217 8480 -2379 7830 13314 4428 9039 16820 19846 21718 2752 11880 20451 31224 33326
5937 33326 18717 10147 -5554 -15896 -23323 -22600 -10099 -9257 -4792 1230 -12619 -25345 -12920
5924 -12920 4256 14082 -3244 -10725 -4951 -58 -6457 -5065 193 24176 28512 23569 7194 4919
5910 4919 -8099 -10040 -10652 6249 8228 18930 26613 18717 3869 -1218 -4300 -6103 -4412 2384
5896 2384 4246 -679 5726 12816 5597 12604 14661 14595 7682 1015 7150 7923 13006 13848 21503 8244
5880 8244 2560 -2148 3637 17603 13611 13582 4263 -12503 -11093 -15526 -18716 -11660 -7066 -2506 -10440
5865 -10440 1122 14987 12545 93 339 -202 2266 9641 3260 1857 10043 -5323 -6029 -10692
5851 -10692 -4839 3399 17893 12208 8496 449 -6838 8201 17881 16873 8761 3446 14831 14726
5837 14726 23216 11032 -12650 -17491 -12623 -2610 8490 25279 6834 -8688 -16099 -11795 -14304
5824 -14304 -20074 -13168 -2910 2981 706 -8654 -10795 -25465 -32491 -36897 -44219 -28040 -11032 -12962
5810 -12962 -23816 -35994 -37557 -14000 3690 -8342 -1915 -5645 -5614 2099 10309 13247 13427 12493
5796 12493 6401 -10747 -13068 1707 -7456 -17488 -17408 -9013 -13323 -10659 5437 18854 13888 1426
5782 1426 -1597 -9796 -19159 -14979 -9361 -26526 -17348 464 25615 31909 10235 -3272 -3591 1934
5768 1934 6531 -3980 -14127 -17515 -8151 7637 11563 16033 12011 6694 11080 6849 -3351 2004
5754 2004 12414 1532 -14682 -25100 -36466 -29472 -16430 -15080 -1745 11887 16133 5546 689
5741 689 -9330 -4315 -1319 -945 -14968 -14204 -10703 5639 12609 771 -9276 -7081 -17378 -28366
5727 -28366 -26797 -5613 8860 3998 -11841 -9279 -4886 14583 13784 861 761 6962 7438 13224
5713 13224 13501 10579 4777 5930 6177 13830 26944 14804 332 758 -4940 -4027 99 -3817 -6640
5698 -6640 -8703 -12890 -3417 12653 3189 7032 -4915 -12654 -371 4415 -6362 369 16146 23562
5684 23562 7032 -2663 -4258 -4487 10468 14181 5983 -2026 -13752 -18069 -17165 -5460 8590 6352
5670 6352 -5089 -996 -2151 -1314 -8353 -18951 -6690 -8270 6562 15955 12321 10775 9669 -6448
5656 -6448 -12148 -9450 -11754 1736 12508 1947 5066 10011 7817 9141 12265 13069 11569 13115
5642 13115 18992 23598 29910 22375 23848 23793 25158 14106 15893 2015 -7166 -2599 -9644 -16777 -8025
5627 -8025 8668 5475 1247 -3757 -7124 4220 19233 5834 7494 7359 21202 13709 1259 13453
5613 13453 6776 966 -9882 -21543 -25721 305 11060 9266 23181 12427 6654 10710 7898
5600 7898 6717 9084 -1729 -8033 -11118 -12388 -12466 -1172 19186 36202 42462 29863 291 2967
5586 2967 11550 3328 -668 -2413 -6257 -12795 -4572 4812 2872 530 5343 3558 19838 11759 10161
5571 10161 3739 2772 3281 -3263 -2429 -7035 -2237 15546 12165 11004 22429 17562 5150 9213 -22603
5556 -22603 -31203 -17043 -12101 -12997 -8840 -14675 -13967 -23803 -20606 -17107 -12496 -18428 -27165 -8098 -710
5541 -710 3547 -5330 -24709 -30161 -31353 -9246 9036 11280 -4595 379 13503 1433 -4257 -8486
5527 -8486 -17567 -17185 -6050 6978 -6976 -22119 -19676 -23818 -12040 2310 17886 26902 39798
5514 39798 26466 8821 -6380 -6087 174 -2593 -22522 -32650 -30038 -28467 -14464 420 9698
5501 9698 4046 -16757 -8450 -13930 -21747 -17872 -16930 -1395 8236 14923 -358 14879 35986 31205
5487 31205 16402 10184 13386 19623 33458 40996 16332 1263 9789 10337 27238 28433 10878
5474 10878 -698 -3071 -14914 -21345 -15814 -13454 2798 23823 16103 5335 -4234 -2146 9922
5461 9922 -234 -14653 -1966 12921 8317 -12514 -23215 -16865 -5762 11678 8272 -837 5204
5448 5204 -3350 -7335 -3145 18716 23834 26197 9054 -13448 -26036 -25923 -15807 -3888 -21775
5435 -21775 -42471 -36883 -42615 -48392 -31789 -20740 -14100 -9819 -8838 -14508 -18242 -13734 -12598 -2602
5421 -2602 289 -6397 15137 23156 30022 18880 -8452 -8159 9992 15312 29649 31370 20271 -1076
5407 -1076 -2441 3364 5313 -3296 -5125 554 10974 11563 -2886 -9531 4135 11499 28081 25904
5393 25904 22405 25235 19046 18723 13930 5246 5755 1475 -18586 -26410 -23166 -1591 -8935 -20076
5379 -20076 -24084 -18768 -6714 6224 13787 17279 2594 -12556 -4956 6990 -7724 -20069 -24758
5366 -24758 -20763 -6884 -1637 -13974 -18417 -4341 14446 7928 3663 -318 -5240 10478 13319
5353 13319 -4401 -3145 13246 2108 3607 15808 10588 7907 10753 914 -1274 11767 15071
5340 15071 17445 18027 13564 12500 5285 829 10669 6334 -8351 -16289 -18255 -16324 -4480 -3364
5326 -3364 -18497 -19724 -13092 -3816 1308 -7552 -26839 -32338 -6873 1047 1055 22036 27319 16148
5312 16148 13058 14524 13815 18370 16024 8655 7445 -1497 -4236 4783 5361 9525 11517 -1657 1490
5297 1490 -14983 -12683 -3300 -9543 2554 14416 13792 6054 6346 2178 5457 521 -12676 -11774 -11000
5282 -11000 -14940 -9587 -23365 -26356 -25543 -17932 -4009 -13757 -13670 -1122 -10456 -4596 -7398 -16437 -12744
5267 -12744 -20117 -18891 -12200 539 3784 7768 7967 14168 2897 -8443 -15840 -15616 -15831 -15392 -10978
5252 -10978 -3433 -9748 -14904 -5354 -197 1661 -1324 -5372 -12205 7239 17208 9653 14548 15728
5238 15728 192 -14445 -21240 -26756 -30331 -30172 -27903 -22651 -10056 2872 11499 3766 -439 5974
5224 5974 2853 4099 -954 -13491 -25052 -22840 -28479 -23324 -9537 -8377 -17491 -21823 -26460 -34209
5210 -34209 -27423 -20590 -20937 -30877 -33014 -37014 -26370 -6113 -9713 -13337 6327 15897 16537 1364
5196 1364 -11139 -1639 9966 -4845 -13452 -19295 -13583 -11445 -6169 -10665 -837 20470 7866 -1548
5182 -1548 -21 2873 -5148 -9558 -5776 -9534 -16214 -12796 -4679 -8473 -10716 -3456 -2771 -2117 -7538
5167 -7538 -14322 -23357 -11304 2988 28180 25172 13104 -4105 -5691 -9204 -18568 -33028 -24313
5154 -24313 -5442 -4896 -15618 -19002 -16874 -7384 1789 -3625 -13947 -21858 -8970 3326 5691 4310
5140 4310 -4165 2581 9561 14539 9305 10545 15755 9402 7442 1177 1277 3020 10624 17182 17814
5125 17814 18108 18466 17500 12188 12959 3236 7761 11577 10992 6185 1390 11926 12422 15949 18176 16086
5109 16086 12635 13383 17111 20569 19624 32381 19389 5471 -9249 -14482 -21147 -18781 -9795 -5977
5095 -5977 -8348 -10928 -15339 -2134 -4241 -4830 -5147 -7504 -19993 -28945 -14672 -12029 -14126 -3782
5081 -3782 10504 -1201 867 14949 11583 -7912 -24498 -32957 -24784 -16305 -16296 -28793 -23789 -13764
5067 -13764 -5045 6632 5359 -4501 -7974 -19429 -17659 -2600 5592 16656 16279 3455 -12071
5054 -12071 -3535 -2457 -584 -3245 -2979 -7605 -1259 4543 14315 27279 24141 20227 20276 18303 22971
5039 22971 23794 16933 -6817 732 18191 21481 16969 1612 5288 -10 -14312 -16922 -30326 -39014
5025 -39014 -28026 -14024 -10979 -14088 -18698 -15806 -10270 -8981 -3019 1029 1919 4988 4133 24655
5011 24655 24021 2017 3294 16537 25473 25487 27107 10327 -257 -125 -2447 9808 15151 -2498
4997 -2498 -9946 -2347 -11947 -4482 5333 5369 9674 1649 -524 6570 3026 -14360 -12767 12120 12914
4982 12914 -3671 2515 2395 -9618 -14670 -24162 -31279 -29187 -8955 -14720 -16117 -13601 -20341 -2802
4968 -2802 -7506 -23913 -30593 -27478 -8720 6329 -2986 -8411 -8410 -9640 -9313 -5348 -361 -12589 -17308
4953 -17308 -11650 -6649 -17385 -8243 -9941 -10795 -10194 -17523 -24022 -16730 -6211 -7806 -9266 -29964
4939 -29964 -34027 -33848 -31389 -35334 -35543 -24550 -16961 -13956 -13679 -12710 -5982 8801 8329 9063 2908 -2815
4923 -2815 3059 6444 5487 183 11803 17514 4621 -2784 -1879 -12470 -15795 -22985 -11065 1727
4909 1727 743 10889 13440 6602 8054 11280 12651 6345 -7073 -17475 -11822 -4755 11954 9567
4895 9567 11856 12629 12170 20945 24348 16018 7968 3205 3566 9532 1943 4204 2466 -15119 -10985
4880 -10985 -22311 -23473 -21041 -23113 -8456 4834 -4987 -20670 -23300 -8831 -7109 -8476 -6448
4867 -6448 -9921 -9435 -3252 1402 971 17529 20731 26159 18223 9539 20999 34035 19376 10400
4853 10400 16120 12775 -7375 -30748 -24842 -13852 -12488 -10606 -13374 -24940 -15125 -738 -4072
4840 -4072 15351 23164 21107 11211 -7377 -29821 -26036 -7221 -12196 -11023 -7838 -11087 -7733 -8048
4826 -8048 -7161 -2668 8258 -699 9698 745 3545 2747 -1714 -3506 -10236 -11463 -8115 -2822 16640
4811 16640 10261 7605 25156 35790 30070 673 -7433 -18180 -3731 -2744 -13623 -2168 -3622
4798 -3622 -6464 -4544 -12330 -16384 -18527 11308 20384 7557 20548 34048 26281 25720 17124 48
4784 48 -11338 -9757 -3182 191 5299 4628 10442 9980 8273 2520 -4764 -175 -2885 1190 15416
4769 15416 12681 289 6921 -4246 -19072 -16321 -6316 -6313 6712 23142 26554 12955 3095 -1142
4755 -1142 -6961 -6115 8927 -178 -14367 -10745 -2400 9411 3972 -5689 -9611 -21601 -28975 -12705
4741 -12705 -6954 -3237 465 -14235 -12419 -16663 -25520 -20751 1816 20572 30823 7595 -2555
4728 -2555 6394 27229 37917 23650 19663 25655 11686 1514 -3029 -3972 -6463 -99 7201 -8292
4714 -8292 -34475 -24847 4486 18617 9107 -6552 -16027 -18904 -22112 -23599 -16395 -16572 -16399 -406
4700 -406 818 4332 8674 9954 2409 -5863 -11122 -11466 1451 11544 -3685 -19754 -15906 -10933
4686 -10933 -23208 -19534 -1997 4014 -6328 -5354 2217 3913 18679 30493 34121 28713 18090
4673 18090 16885 20610 10095 -6796 -19065 -18477 -18428 -18854 -17329 -10343 -9035 -3280 6238 -3733 -4185
4658 -4185 9253 17857 1675 -11177 -29435 -39554 -33244 -32322 -24727 -16366 -2357 -11544 -20106 -16875
4644 -16875 -6978 -4300 -5532 -21964 -29433 -27564 -29184 -23648 -10661 603 -7930 -18796 -20446 -27359
4630 -27359 -37215 -25087 -19341 -15411 -28715 -21177 -16953 -21991 -16612 -11535 -22736 -28138 -15731 -4098
4616 -4098 -11065 -19467 -24057 -30919 -16446 5568 16302 14744 5435 2983 6254 -5568 -5920 -11601
4602 -11601 -2099 11411 2359 -9143 -6015 7086 8901 10698 22301 19297 8901 4602 6722
4589 6722 24193 15014 5684 1964 -2852 -24717 -26400 -16522 -10050 -25164 -17376 -16890 -14979 -3159
4575 -3159 -9242 -22875 -19061 -11491 7180 13357 -498 -5469 -9241 -11617 -2270 -3919 -13765 -2858
4561 -2858 5056 5155 -11826 -25568 -21711 -16137 -25003 -26414 -21315 -23923 -5314 11043 1034 -7466
4547 -7466 -13454 -19625 -11699 -15322 -8143 8926 8837 -6749 -10590 -9495 -8643 4780 13327 5517 -10654
4532 -10654 -3918 -10897 -7824 -7769 -6972 -4045 1372 1356 5549 1872 12053 25044 35802 44221 51001
4517 51001 33706 18325 3747 12833 19098 16463 6949 3851 25598 19619 12442 13320 3996 -206
4503 -206 -4675 -19187 -21384 -15355 -15988 -14168 -8827 -7149 -5696 2481 431 1283 16428 14387 1192
4488 1192 -3554 -18075 -24033 -18677 -16019 -13050 -7830 4154 -3454 3066 8727 7183 5860 12352
4474 12352 2591 7016 11520 -8364 -15257 1398 4008 2023 -10003 -1889 10966 24202 11092
4461 11092 -6810 -3604 11822 6104 4784 12806 18254 8865 -17413 -21430 -16179 5991 23208
4448 23208 14718 6201 3490 5060 -5025 -4968 -13662 -7232 8663 19828 16406 13238 16127 28160
4434 28160 22229 1726 -4994 -10547 -16857 -23465 -20192 -7691 835 15815 6121 -13533 -10171 -2421
4420 -2421 -4114 -8235 -18659 -23698 -21113 -18540 -24179 -16078 8947 21683 6532 -11246 -13760 -14013
4406 -14013 -12208 -11038 -6538 2931 8595 15531 20055 6146 2259 -879 -8046 -15710 -23417 -10952
4392 -10952 5736 -898 -4778 -10687 -14741 -5318 7108 573 -16735 -22518 -24654 -19549 -7189 -2951
4378 -2951 4849 -5082 -15620 -16971 -10249 -13624 -12182 -10471 -6760 -6891 -12543 -4896 -6845 -3240 3994
4363 3994 2580 1936 -6308 -7725 -4878 715 -7339 4113 6980 2534 625 -17139 -12006 -3520 4299
4348 4299 3801 -5602 -15961 -13661 -10854 8008 11586 4273 11969 3083 -1542 -17971 -21745 -10820
4334 -10820 5322 3071 3623 8568 11433 643 7961 10554 6399 17573 26189 21267 11583 1697
4320 1697 -5210 -5532 -3156 2016 7353 7131 7422 17856 32744 46293 39717 30147 33638 18535 3880
4305 3880 10748 7909 16159 15070 12575 11137 12224 19310 14746 13923 -823 -24074 -12831 -1444
4291 -1444 -9252 -20316 -27135 -15907 -20098 -29551 -16604 -11762 -13820 -14236 -2665 5885 -465 9176
4277 9176 -11476 -24331 -21167 -16465 -7634 -6508 -12754 -12154 -24020 -22059 -2850 7091 -11981 -12043
4263 -12043 -6639 -13077 -4520 7719 14744 11111 -6853 -3276 -10671 -10314 -9600 -8424 -8641 -5437 -13048
4248 -13048 -4040 24233 15011 -128 6065 12030 18959 3394 -6299 2416 5272 1525 -11768 -751
4234 -751 -104 -6118 -8647 -10023 -12773 -14068 -12472 -11091 -12201 -18107 -17593 -13084 -11760 -29207 -27031
4219 -27031 -18029 -21810 -11052 -24106 -30440 -16470 911 5661 6241 -1238 -12998 -9031 -6670 2186
4205 2186 11802 18038 843 1037 13841 10871 1282 -10625 -10147 -5808 -5228 -5271 -6122 -19544 -4137
4190 -4137 13536 -17 6537 10064 -475 -10526 -12858 -25235 -18933 2384 -3850 9429 23236
4177 23236 23573 11974 -2665 5328 2174 2471 2452 -10380 -14404 2831 26943 30424 14843 7162
4163 7162 6934 16563 10811 4944 13807 5416 -513 -3086 114 11657 19260 34078 17761 10863
4149 10863 15682 13354 15378 17333 18211 20891 12853 5064 -4110 -19583 -27571 -15120 -8030 1303
4135 1303 -3300 8469 9793 -3153 -4641 -2602 580 1489 2031 3338 8857 6280 10343 -3091 -15148
4120 -15148 -11885 3943 11682 18755 5992 2234 417 8089 12087 15543 836 -4509 -3348 -15094
4106 -15094 -24191 -8255 11197 12713 20526 14187 9293 1924 -16 -4064 -8766 -5741 2035 2958
4092 2958 -11293 -3401 6293 7104 13251 24064 15843 1631 -2623 -7849 -22152 -15421 -3556 -8920
4078 -8920 -724 -4764 -5266 -1702 -8575 -20070 -33619 -15919 4867 4622 2683 14223 20290 15885
4064 15885 7575 -15133 -11292 -7965 2305 7115 3594 10376 10352 16848 23714 19685 11178 13414 15852
4049 15852 1782 13372 6445 -9583 -26097 -29896 -16526 -14990 -18869 -921 2053 1467 -6347
4036 -6347 15374 33536 33389 12622 12152 3797 -4987 -14781 -15310 6768 31710 36295 27623 14067
4022 14067 9875 27747 29344 25820 20845 8358 3136 404 -6533 -4317 -3937 4010 13337 23114
4008 23114 28317 23709 29884 23116 -2060 -1130 1715 -1061 -562 -2936 -9790 4138 13670 19714 20737
3993 20737 14498 2175 -3250 -4633 -5064 1576 13635 27257 27333 19599 20060 9484 -164 12022
3979 12022 21081 12838 20607 7749 -3479 -13386 -9989 -7395 3678 4982 9018 -584 10381 24631
3965 24631 7233 -4306 -14511 -7598 1543 6410 7731 12978 13215 15402 -8292 -20478 -18735 -20896
3951 -20896 -12148 1098 -1673 -2832 -2034 -6026 -21306 -20348 -5083 -6488 -8270 -204 5576 17272
3937 17272 7698 12774 20612 32616 22806 17537 3375 1510 12312 31603 37523 39199 35339 24461
3923 24461 10932 9128 -2439 -21859 -14363 -12504 342 15052 22079 27687 24464 12300 9367
3910 9367 5677 1475 -2269 -3494 4232 4255 2281 3747 2492 3369 -7184 -1009 14073 17228 12611
3895 12611 -8558 -26055 -10017 11924 26065 18242 15491 -825 -16579 -16351 -17353 -15884 10929
3882 10929 19707 17535 19961 22664 13636 3652 -11779 -10852 20988 27890 11699 21576 22729 7435
3868 7435 -12994 -18287 -7427 1709 8334 -12001 -26785 -29621 -17545 2143 8504 13172 13348 15963
3854 15963 15364 10780 7439 9790 -2857 -12195 -14304 -7559 -1312 3570 6109 7763 12623 12271 2649
3839 2649 6363 2565 727 4799 4301 6908 4347 5622 -474 -16275 -26148 -34382 -27004 -12313 -559
3824 -559 3095 16419 25377 10931 16527 10721 -5431 -15158 -10821 -13134 1781 10185 16930 20773
3810 20773 12069 -2362 -2697 -7647 -19640 -21453 -9967 -4141 -2619 -4306 -8721 -10394 -28760 -28135
3796 -28135 -6117 -4481 -13569 -21877 -15236 -4207 -779 -11605 -20752 -8081 22159 33476 20232
3783 20232 9836 6436 14323 16305 7419 2473 577 -2921 12188 24022 11695 3277 -5205 -14907
3769 -14907 -12676 -27421 -14597 -7362 -3302 6377 6765 4620 1171 717 187 -7212 -8237 -6021 -3812
3754 -3812 -7534 -10603 -18113 -15609 -4324 -1236 -3888 -10194 -1575 7183 19242 17966 26084 12048
3740 12048 178 -1829 2086 -8164 -11990 -4632 2645 12232 10567 5320 9432 2514 7323 23996
3726 23996 19173 10746 4240 7090 19206 8857 -11183 -26845 -19316 -14403 -4596 6018 15479
3713 15479 6796 -9965 -6930 -3056 3536 14883 14110 4913 -2481 14105 11720 2912 8542 -287
3699 -287 634 206 -9834 -6532 6641 6964 9458 -3909 -5253 -1196 -8616 -6176 -469 1602 -7286
3684 -7286 3008 9808 3005 -5541 4336 18505 40880 51301 36248 27278 17302 2259 -2310
3671 -2310 -4385 4847 19224 25192 24238 15282 7009 16210 31605 25964 15475 28743 32529 25925
3657 25925 15451 16191 20071 17529 25761 22076 34561 35670 30898 25240 21434 21950 5954 2356
3643 2356 -10685 -8659 -10820 -5634 1997 -2835 -7417 4753 377 -15476 -17773 -9681 -3268 -2869
3629 -2869 -2401 32 4130 -7350 -1457 1313 -3524 -15576 -11512 -3396 -4301 -7848 -9847 -12490 -8715
3614 -8715 1993 8875 12687 10019 11274 60 -4107 61 17514 24206 12016 3198 5272 6916
3600 6916 3505 9040 -5406 -5339 4043 7897 8432 -4074 -9570 -13473 -25233 -16791 1643 13675
3586 13675 578 -6791 2559 24106 32765 26577 18620 16121 24574 20833 5147 -1201 14082 21099
3572 21099 13517 7520 14807 19027 12080 9951 11416 457 -10385 -7402 3083 145 -10355 3535
3558 3535 3572 7044 7251 -6085 -16341 -10494 -4967 9066 5438 -8214 -21187 -24884 -10473 -8666
3544 -8666 -3636 -3818 -174 -8496 -7111 -5188 -6364 -15093 -20709 -19064 -25596 -23314 -6625 12143 14860
3529 14860 14347 4850 2992 -86 -9683 -24695 -20909 -5496 3789 -8197 -6992 -7870 -9530 -4322
3515 -4322 4075 -341 6167 15738 -1193 -8515 -2352 18230 28531 5171 -14051 -13065 -20976 -13765
3501 -13765 2937 8248 9385 6881 3165 -5678 -174 -10163 1669 8290 7830 15647 5445 -3807
3487 -3807 16640 22178 10146 548 4409 21621 28566 10716 9482 303 1644 -2718 -9264 -2163
3473 -2163 -1798 9278 7605 14747 26829 35801 19887 6209 -10423 -8355 5639 11363 9922 13363
3459 13363 18221 7445 4914 1396 -13019 -15219 -6471 -6777 6955 6432 -10566 -13695 -15072 -17207
3445 -17207 -9135 -8338 -11357 -12232 -17148 -22924 -11280 -3573 7420 5187 -839 -3872 -18782 -16696
3431 -16696 -21058 -15215 -7874 -13464 -2068 -9610 -2364 10384 4850 10484 22649 25247 20384 1511
3417 1511 -13415 -9055 24108 32666 23992 12184 -5458 -6112 11188 25621 15751 -5617 -3053
3404 -3053 -10033 -6573 2388 6316 19591 30845 21404 4943 20971 31127 18952 3587 5934
3391 5934 -1910 -17118 -21924 -5369 14424 23817 23419 19861 4491 -10171 -11138 -10782 2444 20041
3377 20041 26205 16393 7432 -13611 -7167 638 16876 23836 22900 19816 11365 25226 21215 3959
3363 3959 -545 -1844 11621 14028 9535 7620 14251 19849 15894 -2294 3498 7405 5005 7369
3349 7369 16588 27686 14401 10748 15521 5046 1046 -3884 -8099 -18480 -20488 -9326 3282
3336 3282 16698 8238 10748 13160 -1027 373 -1748 5379 17227 14888 -1962 -2947 6076 4634
3322 4634 -11543 -12456 -12973 -10724 7249 112 -2315 -14880 -12978 -1188 -4973 -9133 2892 6184
3308 6184 14566 3827 -5884 -3280 -12141 -17309 -19683 -16231 -6254 -11249 -20454 -16604 -10155 -11757 -10782
3293 -10782 -7991 -8031 -5535 -760 4478 21299 24382 26500 15558 14974 3171 -22653 -26726 -19562
3279 -19562 -19645 -21339 -19831 -9076 1576 -2241 1652 8548 10078 6566 10292 2315 -2110 -2880 2755
3264 2755 5898 24303 20910 400 9394 25870 23272 16163 22487 21028 18412 22878 26930 16548
3250 16548 11627 6010 -3840 -8161 -10439 1577 5810 13357 6622 -267 2420 6091 7981 -110
3236 -110 6331 23011 18889 21285 30287 40226 36041 14670 -4466 -13199 -7666 8234 14184 627
3222 627 -21869 -32056 -21908 -3400 21290 31411 18679 11747 987 -5891 -10177 -4967 2170
3209 2170 -3023 -8668 -19431 -11289 6583 23190 19398 -5713 -10106 2959 -6885 -30112 -36602
3196 -36602 -27168 -26643 -26837 -12910 15514 22169 11143 1093 1756 11214 560 -22133 1913 19194
3182 19194 3770 932 -8240 -9887 3901 16116 12429 20351 20485 3949 -1464 3674 -3017 -1579
3168 -1579 18796 10352 -751 3797 11861 11234 17201 436 -6721 -15333 -14230 -6389 249 -3055
3154 -3055 -11048 -4594 -8015 -8771 4069 14876 13127 5683 -6384 -12101 -10172 -8280 -8206 -17556 -18560
3139 -18560 -9489 9780 10363 4727 6962 4414 -9146 -8243 6489 13585 7768 4095 1696 -15320
3125 -15320 5324 11434 -7001 -22081 -30570 -22983 -5938 -2696 -6722 -11774 -12261 -6968 2140 1946
3111 1946 16766 13456 3669 -1860 5208 2032 1442 -2183 3543 -4181 -19234 -10656 -51 4904
3097 4904 11418 488 -18521 -28651 -10860 -2942 14106 12455 10149 -1394 -5002 -13925 -17409
3084 -17409 -4284 4866 11728 15738 13970 14715 10444 10605 -2482 1893 12996 16064 4303 -5747
3070 -5747 3584 16743 27363 22056 16089 5129 -2929 3358 13310 1161 -26517 -31894 -22279 1618
3056 1618 19952 16792 6266 -2665 508 -1571 -7790 -7511 2263 12462 10347 5742 -7747 -26618
3042 -26618 -23650 -12149 -15428 2642 10973 8770 6575 15233 19867 10840 -3667 -15034 -10242 1497
3028 1497 1723 2108 -4039 -18834 -33283 -35076 -28125 -27515 -24300 -25284 -28242 -27934 -26807 -23601 -11811
3013 -11811 1830 6122 7691 -6712 -13027 -14399 -4121 5124 -3129 240 3046 6740 12342 16436
2999 16436 19720 11672 -2591 -17554 -9334 -14324 -10898 8935 19930 24413 14434 16975 19211 16193
2985 16193 21368 2722 -8376 -14618 -15755 -12036 4428 9100 -8703 -35047 -43423 -20754 8090
2972 8090 5623 3700 -6799 -20157 -15290 -13093 -11040 -11539 -15075 -26605 -28916 -5704 5690 8018
2958 8018 17095 9686 4612 4204 10111 4668 1818 -4102 -9542 -9245 -13384 -2049 -1079 8188 5238
2943 5238 -1007 -7050 -5243 13140 6560 -1029 -9724 -10812 -9243 -21611 -18418 -23563 -28052 -26260
2929 -26260 -20001 -6467 5126 7350 4673 8029 -2972 -2700 5183 1833 -2297 -9249 -15179 -11076
2915 -11076 -18879 -13078 -1564 10395 12273 12593 -778 -22320 -30595 -26915 -29446 -25896 -30676 -35276
2901 -35276 -17009 -10330 -2518 -10516 -1027 10119 2885 -5137 -140 689 999 -1042 -18757 -11165
2887 -11165 4763 4087 -9017 -7587 5914 25066 24960 1797 -14082 -16776 -5478 -291 -6442
2874 -6442 -5451 2413 11342 1608 -14638 1263 7483 10471 15484 23804 12809 -3988 -6577 -13370
2860 -13370 -7614 13299 31958 43885 46462 37346 17431 9084 9034 1878 7473 23258 17947 5066
2846 5066 -1497 2928 14453 13988 9323 -5303 -6778 -7073 -18262 -17445 -362 4552 12281 17463 1963
2831 1963 -4339 7282 3440 75 11557 6727 8646 4257 3373 20744 29323 18742 16390 20116
2817 20116 11710 6411 969 -8866 2835 7741 -4984 -16394 -335 9686 3274 -852 -4385
2804 -4385 -2647 -3671 -8120 -8955 -15034 -15886 -6382 -22251 -32990 -28798 -18088 -14221 -9164 -3658 -1718
2789 -1718 4382 4319 7225 381 -12119 -18363 -17707 -18158 -24989 -24421 -28155 -26468 -10750 -6983 8820
2774 8820 14826 783 -6807 1926 1711 13061 3121 -13446 -20478 -24934 -27663 -37383 -33540 -20024
2760 -20024 -15795 -4466 7365 16891 -3279 -2649 -2683 7950 15772 3486 -343 11552 -5120 -14665
2746 -14665 -30528 -18063 -11515 -7009 -816 -1798 -6060 3784 -2629 -2661 13188 17718 16104 14336 13601
2731 13601 11241 -8734 -9384 5103 -285 -23628 -32111 -28277 -37480 -32801 -24474 -12180 -17089 -29990
2717 -29990 -15053 -1028 -10814 -2556 2373 2509 8151 4870 -6222 -6710 -12008 -10691 -2436 2193
2703 2193 3966 11015 8354 3720 6587 8636 -230 -496 691 748 -9258 -19987 -10466 11880 18091
2688 18091 2509 5954 5508 10890 2337 -8766 -186 11663 16841 6324 233 -17768 -25692 -10815
2674 -10815 -17482 -10856 1540 -7268 -17499 -13346 -17193 -8409 -4544 -16198 -9352 7377 3519 -10143
2660 -10143 -24451 -29398 -24541 -24495 -25515 -13064 -3629 1831 -560 16164 9697 -12168 -12698 9118
2646 9118 6685 6946 1167 -6437 -3708 -8702 -9939 3825 -2068 -9708 -7221 -262 3539 -874 -5727
2631 -5727 5252 3593 -8286 -18541 -23987 -18056 -22219 -31694 -38443 -30635 -32049 -35560 -40101 -26875
2617 -26875 -24917 -15637 -14668 -19457 -17537 -7752 -7448 -20734 -30689 -26229 -17050 -8829 -22910 -32850 -24402
2602 -24402 -2054 1697 4280 7209 2394 -1559 10124 7028 846 -1701 -562 -3326 -5644 4807
2588 4807 13527 9484 6908 3313 9957 9132 17420 13417 8123 11380 19654 3874 -20282 -24638 -8852
2573 -8852 -1152 -3158 20557 19001 20831 18508 18775 21487 10616 13607 19364 21041 19608 -6338
2559 -6338 -11583 -13234 -7847 -9986 -9567 -5078 -16068 -21981 -9010 -7696 -6036 -5568 -3304 -19884 -44958
2544 -44958 -35941 -14033 -5281 -1836 -257 16473 7877 13578 21098 -688 -13466 -15432 2545
2531 2545 15591 5345 -3210 -49 15123 18024 1684 11770 19639 2861 -2134 4136 16612
2518 16612 -467 -8143 1117 -5774 -14824 -13810 -4606 15877 3647 -8008 -3204 -4956 -12101 -16828
2504 -16828 -13921 -913 12400 7109 967 6194 13879 11404 4116 2703 -5922 -1092 13880 13681
2490 13681 -12600 -14557 -7499 6362 9466 2673 10513 21144 17650 2115 3338 20242 34371
2477 34371 27480 5155 5915 5142 -8944 -10031 -8450 -12375 -13253 -13707 -11885 -11480 -4648 -19609 -27193
2462 -27193 -5809 7292 1640 -2675 -2496 3876 5346 2021 3051 -10985 -539 13351 18377 21550
2448 21550 22731 3978 880 -8463 -18831 -9695 -5023 -11703 -19746 -7924 -4500 -12703 -21714 -19312
2434 -19312 -8489 7673 17269 16302 26192 36665 24673 9896 9792 16298 31307 21801 785
2421 785 -13810 7108 28981 22391 11826 2701 16578 15910 -4356 -424 1491 5685 -12469 -11585
2407 -11585 -2867 10333 3302 -2193 9057 9992 4852 8399 4253 -8596 -15718 -13263 -23611 -17459
2393 -17459 -13990 -13494 9252 17885 13715 18593 13161 6380 -3371 -20 4530 3236 7851 6050 -4291
2378 -4291 -8894 -2837 2971 5426 12220 12630 28279 34365 25683 19115 21759 27700 13511 6150 -251
2363 -251 -1874 1111 11483 18527 17264 3790 3370 9450 -792 -5014 -6830 -11112 2223 13198
2349 13198 28027 43819 30547 15824 4684 -142 1623 8577 14756 16995 3100 -2700 -6987
2336 -6987 -29297 -41356 -32715 -28226 -8702 15330 16743 6421 7479 18001 26003 4339 -4016
2323 -4016 7598 8630 7971 2941 8775 7650 9289 18439 5779 5331 -6668 -907 14847 4784
2309 4784 -11828 -10114 -8363 -1335 2276 -4239 -12230 -9087 519 1893 8887 18434 17584 13347 19878
2294 19878 21772 5557 -2105 -3194 -7574 -7105 859 6977 12125 -1962 -8759 -7670 1615 4245
2280 4245 -2410 -11223 -5628 -5428 -6997 -1839 12870 10646 1254 22550 33817 18589 17079 19800
2266 19800 8174 7689 6644 -3540 -2570 -2070 -20671 -11320 1447 -2253 1020 15714 16874 12338
2252 12338 17079 17859 12317 2603 -12878 -15417 -4988 662 -3342 -985 2923 -2105 -20022 -14629
2238 -14629 -18105 -29128 -32380 -28243 -23641 -22398 -2073 -860 -5643 -11187 -5423 -2915 7140 9463
2224 9463 2516 5238 10984 4046 -3913 466 9478 13919 13910 9101 10484 9038 12626 21503 25691 26612
2208 26612 31973 30675 18310 13587 -533 9370 15804 -4478 -22124 -19683 -16210 -9502 -4370 -8880
2194 -8880 -26781 -2704 8926 -2507 3879 15929 22936 1204 -11762 -10740 -12649 -23714 -25859
2181 -25859 -24523 -16447 -4302 950 -10493 -22807 -30010 -20404 -1821 -2260 -3236 -5606 -3571 -20980
2167 -20980 -23758 -20960 -19238 -14545 -13633 -5069 -1614 8657 11945 -701 -13456 -9833 -1392 13675
2153 13675 16014 8618 11960 4418 2769 11108 -1507 -3191 -2510 -4517 -12747 -18311 -5260 -950
2139 -950 -14074 -23485 -14306 -16448 -7219 4384 2504 -28 -10326 -4288 12603 22863 14493 10527
2125 10527 -2600 2713 9813 1314 8585 11054 16809 13081 12915 7810 -6451 802 8300 5923
2111 5923 22169 23833 19789 17348 23917 15081 -11139 -19480 -1035 -8642 -7720 -5974 9702 13527
2097 13527 6855 3490 8490 13782 7653 -12095 -20774 -23089 426 7153 23049 15614 2876 -3354
2083 -3354 587 -9116 -8778 -9409 6822 -9704 -23629 -15595 -8169 3583 11985 3165 -224 -3867
2069 -3867 -15887 -25428 -15646 -6681 -3678 -18830 -25982 -17690 -18177 -28859 -23478 -4786 -5791 -15425
2055 -15425 -4994 7020 1407 3845 -10272 -18503 2773 21715 33138 33925 19140 658 3166
2042 3166 -2084 -6831 -13922 -16125 -11820 -8825 1599 16704 1483 -7771 -14770 -8982 -13110 -15749
2028 -15749 -10124 -157 4231 11280 17102 18465 8795 12272 6235 -6247 -11147 -16965 -18422 -12150
2014 -12150 -10143 -14740 6172 15100 12517 -972 -2212 -9383 -14206 -15501 -18208 -8016 -8962 -10711
2000 -10711 -23709 -16375 -5758 -90 -1274 1754 -2091 -4172 10112 21580 24704 16294 -4104
1987 -4104 1035 8083 6543 11791 16833 21371 7168 6123 5531 4517 -5671 -1308 -1605 1880 -3737
1972 -3737 -5872 -6047 -15197 -12415 -7113 427 12634 8802 11736 7889 2438 -11795 -20581 -22556 -34366
1957 -34366 -22244 -14524 -19974 -20028 -2693 6314 12032 7174 -5941 -20809 -21132 -22572 -5057 5655
1943 5655 13368 8154 -4067 -14536 -34133 -25575 -27675 -28336 -11457 629 -10278 -11444 -6945 -17965
1929 -17965 -19311 -28541 -33685 -24502 -16017 -21563 -25642 -12903 1396 19315 35094 27799 5663
1916 5663 1637 -7319 3198 17328 14008 1328 -6405 2017 -7078 -6941 8224 24292 17797 17614
1902 17614 23853 26570 4046 -15426 -18185 -11307 -9348 -7026 43 -1605 -16288 -28186 -20591 -5793
1888 -5793 5872 1631 -3682 3980 25440 19669 9878 8605 10209 14546 10095 -1958 -9025 -597
1874 -597 8181 19785 29077 9036 3568 7011 -1304 13247 11305 9862 20023 24766 26690 14785
1860 14785 7313 2398 -3726 7314 5121 -2521 -9500 -12550 -14475 -9614 4520 6756 2281 3968
1846 3968 17792 15121 20969 21635 26358 26524 26722 21125 16562 14454 1057 7660 4550 -5983 -4926
1831 -4926 3299 -5399 -15673 -9934 -4295 2614 17592 20640 635 17244 15792 -7982 -2348 11590
1817 11590 6022 -8768 -11959 -11905 -1234 -1297 -4313 -2648 -12179 -14160 -18466 -15732 -18617 -11528 6577
1802 6577 22662 13580 -6292 -4007 -7958 -16520 -32022 -31329 -20641 -10948 10868 14184 13416 15705
1788 15705 22507 18160 7563 502 5681 -12416 -12181 -2381 -12228 -40990 -43965 -31595 -27223 -20979
1774 -20979 3525 7475 3024 -10282 -20974 -19825 -13126 -12172 1150 -1512 -819 1 16015 11451
1760 11451 -4923 -13023 -26130 -22352 -1649 6420 1944 15528 22198 15964 13650 12333 17521 1265
1746 1265 -772 9513 6269 -3546 -1787 6386 669 -340 3538 -2276 303 -1057 4163 6204 11857
1731 11857 -751 -20208 -8584 8717 18045 22363 8341 -2525 -708 -3900 -5742 -5637 -5145 -12959
1717 -12959 -18958 -8444 -6057 -6269 -5856 -1212 -506 10517 20208 31259 11592 -5034 -4250 18336
1703 18336 7361 1759 13403 16795 694 -3665 5173 -5303 -4311 3994 8411 6756 4765 -2917
1689 -2917 -10092 11172 34829 25643 28221 25117 22506 24369 17579 15241 8606 10578 3445 -463
1675 -463 1787 790 -144 4953 19548 17516 22409 8775 -7687 -4139 5643 22631 25259 19887 9590
1660 9590 7957 -1367 3247 15051 14403 -13232 -20168 -22684 -16576 4611 15281 9724 5603 3228
1646 3228 16073 32641 29452 22593 18000 7429 410 -3876 -2688 12075 17848 3895 -1737 3784
1632 3784 15316 13321 -2968 6260 -1372 -7194 -312 5758 17956 16151 23067 18712 22590 35653
1618 35653 22502 14367 6591 -6953 -5365 2403 -4571 -3935 9034 32901 35744 14958 -6241
1605 -6241 4092 13169 15198 16506 6083 7758 8025 7707 13323 29255 16205 6941 2100 -1261
$$ [...]
##END NTUPLES=NMR SPECTRUM
##END=
