##TITLE=Analysis number 319773
Compound Code rf 04994
Project Code adrs
Chemist Name fudan
##JCAMPDX= 6.0         $$ Bruker NMR JCAMP-DX V2.0
##DATA TYPE= NMR SPECTRUM
##DATA CLASS= NTUPLES
##ORIGIN= Bruker BioSpin GmbH
##OWNER= nmr
$$ XWIN-NMR		Version 3.5
$$ Fri May 26 11:38:28 2006 GMT Daylight Time (UT+1h)  MAYBRIDGE\nmr@NMR_250MHZ
##.OBSERVE FREQUENCY= 250.131544655141
##.OBSERVE NUCLEUS= ^1H
##.ACQUISITION MODE= SIMULTANEOUS (DQD)
##.ACQUISITION SCHEME= undefined
##.AVERAGES= 16
##.DIGITISER RES= 18
##SPECTROMETER/DATA SYSTEM= dpx250
##.PULSE SEQUENCE= zg30
##.SOLVENT NAME= DMSO
##.SHIFT REFERENCE= (INTERNAL, DMSO, 0, 16.522)
##AUDIT TRAIL= $$ (NUMBER, WHEN, WHO, WHERE, WHAT)
$$ ##TITLE= Audit trail, XWIN-NMR		Version 3.5
$$ ##JCAMPDX= 5.01
$$ ##ORIGIN= Bruker BioSpin GmbH
$$ ##OWNER= nmr
$$ C:\u/data/dgb/nmr/ADRS/5300/pdata/1/auditp.txt
$$ ##AUDIT TRAIL=  $$ (NUMBER, WHEN, WHO, WHERE, WHAT)
(   1,<2006-05-26 11:38:03.22 +100>,<MAYBRIDGE\nmr>,<NMR_250MHZ>,
      <created by zg, POWCHK disabled, PULCHK disabled
       configuration hash MD5:
       84 BC 41 DB A1 6E 1D 46 DA 25 12 A5 C1 ED C5 3A
       data hash MD5: 64K
       FC 36 A2 E8 50 53 B0 27 30 04 CA D1 3D DC 07 37>)
(   2,<2006-05-26 11:38:18.56 +100>,<MAYBRIDGE\nmr>,<NMR_250MHZ>,
      <Start of raw data processing
       ef LB = 0.3 FT_mod = 6 PKNL = 1 SI = 32K 
       data hash MD5: 32K
       5A FC 7E AE 45 66 7C 6C 2F 80 9F D6 B3 4E EF 99>)
(   3,<2006-05-26 11:38:20.25 +100>,<MAYBRIDGE\nmr>,<NMR_250MHZ>,
      <apk 
       data hash MD5: 32K
       F1 05 E9 16 EF 35 7E 36 C8 AF 11 A2 16 20 9A AB>)
(   4,<2006-05-26 11:38:21.03 +100>,<MAYBRIDGE\nmr>,<NMR_250MHZ>,
      <abs ABSG = 5 
       data hash MD5: 32K
       D2 4A 51 04 CC 1B A7 A3 87 79 DC 5F A2 7F 73 1D>)
$$ ##END=
$$ 
$$ hash MD5
$$ 9B 73 69 50 3B F4 EE 82 5B B5 7C 20 8F 0E 03 6F
##$RELAX= 
##$RELAX= 
##$RELAX= 
##$RELAX= 
##$RELAX= 
##$RELAX= 
##$RELAX= 
$$ Bruker specific parameters
$$ --------------------------
##$DU= <C:\u>
##$EXPNO= 5300
##$NAME= <ADRS>
##$PROCNO= 1
##$TYPE= <nmr>
##$USER= <dgb>
##$AMP= (0..31)
100 100 100 100 100 100 100 100 100 100 100 100 100 100 100 100 100 100 
100 100 100 100 100 100 100 100 100 100 100 100 100 100 
##$AQSEQ= 0
##$AQ_mod= 3
##$AUNM= <au_zg>
##$AUTOPOS= <19 >
##$BF1= 250.13
##$BF2= 250.13
##$BF3= 250.13
##$BF4= 250.13
##$BF5= 500.13
##$BF6= 500.13
##$BF7= 500.13
##$BF8= 500.13
##$BYTORDA= 1
##$CFDGTYP= 0
##$CFRGTYP= 5
##$CHEMSTR= <none>
##$CNST= (0..31)
1 1 145 1 1 1 1 1 1 1 1 1 1 1 1 1 1 1 1 1 1 1 1 1 1 1 1 1 1 1 1 1 
##$CPDPRG= <>
##$CPDPRG1= <>
##$CPDPRG2= <>
##$CPDPRG3= <>
##$CPDPRG4= <mlev>
##$CPDPRG5= <mlev>
##$CPDPRG6= <mlev>
##$CPDPRG7= <mlev>
##$CPDPRG8= <mlev>
##$CPDPRGB= <>
##$CPDPRGT= <>
##$D= (0..31)
0 1 0 0 0 0 0 0 0 0.06 0 0 0 0 0 0 0.0002 0 0 0 0 0 0 0 0 0 0 0 0 0 0 
0 
##$DATE= 1148639882
##$DBL= (0..7)
120 120 120 120 120 120 120 120 
##$DBP= (0..7)
150 150 150 150 150 150 150 150 
##$DBP07= 0
##$DBPNAM0= <>
##$DBPNAM1= <>
##$DBPNAM2= <>
##$DBPNAM3= <>
$$ [...]
##$SUBNAM7= <"">
##$SUBNAM8= <"">
##$SUBNAM9= <"">
##$SW= 20.6930455092707
##$SWIBOX= (0..15)
0 0 3 0 0 0 0 0 0 0 0 0 0 0 0 0 
##$SW_h= 5175.983436853
##$TD= 65536
##$TD0= 1
##$TE= 295.16
##$TE2= 300
##$TE3= 300
##$TEG= 300
##$TL= (0..7)
0 120 120 120 120 120 120 120 
##$TP= (0..7)
150 150 150 150 150 150 150 150 
##$TP07= 0
##$TPNAME0= <>
##$TPNAME1= <>
##$TPNAME2= <>
##$TPNAME3= <>
##$TPNAME4= <>
##$TPNAME5= <>
##$TPNAME6= <>
##$TPNAME7= <>
##$TPOAL= (0..7)
0.5 0.5 0.5 0.5 0.5 0.5 0.5 0.5 
##$TPOFFS= (0..7)
0 0 0 0 0 0 0 0 
##$TUNHIN= 0
##$TUNHOUT= 0
##$TUNXOUT= 0
##$USERA1= <user>
##$USERA2= <user>
##$USERA3= <user>
##$USERA4= <user>
##$USERA5= <user>
##$V9= 5
##$VALIST= <valist>
##$VCLIST= <CCCCCCCCCCCCCCC>
##$VD= 0
##$VDLIST= <DDDDDDDDDDDDDDD>
##$VPLIST= <PPPPPPPPPPPPPPP>
##$VTLIST= <TTTTTTTTTTTTTTT>
##$WBST= 1024
##$WBSW= 4
##$XGAIN= (0..3)
0 0 0 0 
##$XL= 0
##$YL= 0
##$YMAX_a= 412798
##$YMIN_a= -308878
##$ZGOPTNS= <>
##$ZL1= 120
##$ZL2= 120
##$ZL3= 120
##$ZL4= 120
##$ABSF1= 16.522
##$ABSF2= -4.171173
##$ABSG= 5
##$ABSL= 3
##$ALPHA= 0
##$AQORDER= 0
##$ASSFAC= 0
##$ASSFACI= 0
##$ASSFACX= 0
##$ASSWID= 0
##$AUNMP= <proc_1d>
##$AZFE= 0.1
##$AZFW= 0.1
##$BCFW= 0
##$BC_mod= 0
##$BYTORDP= 0
##$COROFFS= 0
##$CY= 12.5
##$DATMOD= 1
##$DC= 0
##$DFILT= <>
##$DTYPP= 0
##$F1P= 14.0000005364418
##$F2P= -0.99999901652339
##$FCOR= 0.5
##$FTSIZE= 32768
##$FT_mod= 6
##$GAMMA= 0
##$GB= 0
##$INTBC= 1
##$INTSCL= 1
##$ISEN= 128
##$LB= 0.3
##$LEV0= 0
##$LPBIN= 0
##$MAXI= 10000
##$MC2= 0
##$MEAN= 0
##$ME_mod= 0
##$MI= 0
##$NCOEF= 0
##$NC_proc= -5
##$NLEV= 6
##$NOISF1= 0
##$NOISF2= 0
##$NSP= 0
##$NTH_PI= 0
##$NZP= 0
##$OFFSET= 16.522
##$PC= 1
##$PHC0= 163.4016
##$PHC1= 12.68533
##$PH_mod= 1
##$PKNL= yes
##$PPARMOD= 0
##$PSCAL= 4
##$PSIGN= 0
##$REVERSE= no
##$SF= 250.13
##$SI= 32768
##$SIGF1= 0
##$SIGF2= 0
##$SINO= 400
##$SIOLD= 32768
##$SREGLST= <1H.DMSO>
##$SSB= 0
##$STSI= 32768
##$STSR= 0
##$SW_p= 5175.98343685301
##$SYMM= 0
##$S_DEV= 0
##$TDeff= 65536
##$TDoff= 0
##$TI= <Analysis number 999999
Compound Code 99
Book Reference 9
Project Code 9>
##$TILT= no
##$TM1= 0
##$TM2= 0
##$TOPLEV= 0
##$USERP1= <user>
##$USERP2= <user>
##$USERP3= <user>
##$USERP4= <user>
##$USERP5= <user>
##$WDW= 1
##$XDIM= 32768
##$YMAX_p= 370928839
##$YMIN_p= -946364
$$ End of Bruker specific parameters
$$ ---------------------------------
##NTUPLES= NMR SPECTRUM
##VAR_NAME=  FREQUENCY,     SPECTRUM/REAL,   SPECTRUM/IMAG
##SYMBOL=    X,             R,               I
##VAR_TYPE=  INDEPENDENT,   DEPENDENT,       DEPENDENT
##VAR_FORM=  AFFN,          ASDF,            ASDF
##VAR_DIM=   32768,         32768,           32768
##UNITS=     HZ,            ARBITRARY UNITS, ARBITRARY UNITS
##FACTOR=    0.157963299565203, 1,           1
##FIRST=     4132.6476996994, 0,             0
##LAST=      -1043.33573715361, 0,           0
##MIN=       -1043.33573715361, -946364,     0
##MAX=       4132.6476996994, 370928839,     0
$$ Real data points
##PAGE= N=1
##DATA TABLE= (X++(R..R)), XYDATA
$$ [...]
25431B070K7181Q5171j57779J10011L72338k0212j13475j735K19746J65474k3493
25420F65297j86572k86201J39632M35738j86320m31475j88322J20046P5106J13661
25410B70590m9358j82906k17729j23462J56922J32714K62668j46730k5590J08618
25400A85737j1813k49005K35327J90849k83038L7994r5382k47349l87721J16701
25390e07700J60249J08119O8890L10610M8446j54175l2400q6567j46650P3151
25380a58027m9374P560J6381N9508m626M038K43845Q4993l6281p9727q2968j93527
25368a88205n7751K03770J48123j22097l7246R3006J20154j57353R7532L29980
25358D29913M4985Q661m03478q8483n861R5576J10758j34662n1702J6818J02656
$$ plain form
25431 2070 29251 114422 -43357 66654 438992 418780 305305 303570 523316 688790 665297
25420 665297 478725 192524 332156 767894 581574 150099 -38223 81823 156929 270590
25410 270590 221232 38326 -179403 -302865 -145943 -13229 249439 102709 77119 185737
25400 185737 173924 -75081 160246 351095 68057 106051 10669 -236680 -624401 -507700
25390 -507700 -347451 -239332 -170442 140168 188614 34439 2039 -84528 -231178 -158027
25380 -158027 -207401 -199841 -183460 -123952 -128578 -124540 119305 204298 168017 88290 5322 -188205
25368 -188205 -245956 -42186 105937 -16160 -53406 39600 159754 2401 99933 429913
25358 429913 474898 483559 80081 -8402 -14263 81313 192071 57409 5707 22525 125181
25347A25181p2635J8907Q9455j35142j61764J20636l76619j16186J78065m716
25337c34818K27300j21062j35375R3273J93445J72634J26990k7069j77322o9662
25327e1666J6661j8449n8335J80319J14308l58815l17674K06802K74870J41664
25317A29685p5424J96910J55186J2609o7664j63308j06835L5253n8200J48330
25307B06542L0789r2378M4967K25154j24911k55515N9370j046j22513p2873Q438
25296i3976J64098j08281j88140K01138P8724j09629j12871N2414j5887N3541
25286g8869J22723P3223O0471j01742J37316p0273k261J74078o8950j76770m043
25275F4903J15448j61409k19916P4481q074P9440J30033k09119o0536j26372k25254
$$ plain form
25347 125181 52546 71453 160908 25766 -135998 -15362 -391981 -508167 -330102 -334818
25337 -334818 -107518 -228580 -363955 -270682 -77237 95397 222387 195318 17996 -51666
25327 -51666 -35005 -53454 -111789 68530 182838 -175977 -493651 -286849 -11979 129685
25317 129685 54261 251171 406357 418966 351302 187994 81159 116412 58212 206542
25307 206542 237331 144953 189920 415074 290163 34648 94018 92972 -29541 -102414 -93976
25296 -93976 70122 -38159 -226299 -25161 53563 -56066 -168937 -116523 -132410 -78869
25286 -78869 43854 117077 177548 75806 213122 142849 140588 314666 245716 68946 64903
25275 64903 180351 18942 -200974 -126493 -134567 -55127 74906 -134213 -194749 -321121 -546375
25264e46375p4768J52463K21826J14454J23994J45705j10639p9588J38576N4101
25254A39749j71885j13056L09868R1202k42390K234j43416j4642m4851L8756j69185
25243c17616J8822J72009r6966p2607m1451p8881J88357J98174J46310n1805k7193
25232C7153K9623M5504j77510Q2645n165p3934p8985J69360R1180Q1547n8267
25221A43151j57572q9711m5863P6987j50104M3372L425N8028K46884k5762n6919
25210D5916L2182L2891M5269o9909j20811n8597j03559L0933L00877L01880k33624
25199B03448j02293l23530k51146K58437K57100J55975P0633N8776M3676Q9773
25189D60849k89394k33492q476M1672n1867l2196N4268J52253K30997K72523Q1338
$$ plain form
25264 -546375 -621143 -468680 -246854 -132400 -8406 137299 26660 -52928 85648 139749
25254 139749 -32136 -145192 164676 255878 13488 15722 -127694 -142336 -187187 -148431 -317616
25243 -317616 -298794 -126785 -223751 -296358 -337809 -416690 -228333 -30159 116151 64346 37153
25232 37153 66776 112280 -65230 17415 12250 -61684 -140669 28691 119871 201418 143151
25221 143151 -14421 -104132 -149995 -73008 -223112 -179740 -176315 -118287 128597 102835 45916
25210 45916 78098 110989 156258 86349 -34462 -93059 -196618 -165685 135192 437072 203448
25199 203448 101155 -222375 -473521 -215084 42016 197991 268624 327400 371076 460849
25189 460849 171455 -62037 -70513 -28841 -80708 -112904 -58636 93617 324614 597137 678475
25178F78475k98914K8802r9589l10111k73199K577J6246N2101n4070k07800N9199
25167d06283K12700q1419J09124J39062m3307l14418k17020O1942L24164N0706
25157a64749J25932P3910J3920k7453k1936q3176J38603M71927K26k04273j27367
25146A95564L1016j7712k21224n7780k132q0892j07052l9569k47869l17296q1418
25135i46364K33689M36929K91658R6335J63347J47589l05996k52828K02850M00614
25125D67823n6390q2181j37615j44918J72718K32791j51513l6562Q4766j46778
25115B02141k44917n3574k15597q4746J48796L50741q835M7434k01264k32294
25105b92115J34257K252l4785R4184j09336j30135L31385J47598j14787p7542
$$ plain form
25178 678475 379561 408363 308774 -1337 -274536 -271959 -255713 -203612 -257682 -465482 -406283
25167 -406283 -193583 -275002 -165878 -26816 -70123 -384541 -601561 -539619 -215455 -164749
25157 -164749 -38817 35093 49013 21560 -376 -83552 55051 526978 527204 322931 195564
25146 195564 226580 208868 -12356 -70136 -72268 -153160 -260212 -299781 -547650 -864946 -946364
25135 -946364 -712675 -275746 15912 112247 275594 423183 117187 -135641 67209 467823
25125 467823 411433 329252 191637 46719 219437 452228 300715 264153 348919 202141
25115 202141 -42776 -96350 -311947 -396693 -247897 102844 94009 141443 -59821 -292115
25105 -292115 -157858 -155606 -190391 -96207 -205543 -335678 -4293 143305 28518 -49024
25095d9024J81363K2408m3891L6948p5777M42261J26232l70362j61203L1340K41141
25084C81436J52855j53437k51107j87622Q9738j63467j70501J9971K92104j46215
25074a36245J14344J92883k6120k93407P140J3193j35718j70203K4865P8841L40848
25063A0421R4534q3308J53951P463j2135N9207J5016J31741p9459j28419K408
25052A71420j90593l2942P6106K01974r247J14016K07483j91833j62198L9171
25042B23357L2545k82437j45776K08671K48119J8979n1282J13093k76108k34163
25032a45002J12069J47595n732r76k9562R7412J5131J27999J27572p1007j13281
25021B62218k81074o8907J45100K36452K12152j35701k17273k5603k67202P3916
$$ plain form
25095 -49024 132339 154747 110856 147804 72027 514288 640520 270158 108955 140295 381436
25084 381436 534291 380854 129747 -57875 31863 -131604 -302105 -282134 9970 -136245
25074 -136245 -21901 170982 144862 -148545 -141405 -128212 -263930 -434133 -409268 -330427 10421
25063 10421 104955 21647 175598 183061 170926 230133 245149 376890 297431 169012 171420
25052 171420 -19173 -52115 23991 225965 216718 330734 538217 346384 184186 223357
25042 223357 255902 -26535 -172311 36360 284479 303458 252176 365269 89161 -145002
25032 -145002 -32933 114662 108930 107954 78392 175804 190935 318934 446506 375499 262218
25021 262218 -18856 -87763 57337 293789 505941 370240 152967 127364 -139838 -65922
25011f5922R1485N8965k8020K15598k0201j84922j51162j96305k09024M98161
25001H653K26645K1287j13404j84708j32393M2275P1947J76833K0031L204j9556
24990A20814l01706l1645m5979j50907J0402K62004J86913q0365j10788j14495
24980b55752M3712J40097K7551q1976R9675J47076R2943O5936N4688J56340N824
24969D96114j95337n0786j33700l26227J10645J06805n0997k3281J37182L52263
24959D22681K7981n1310J7929l9759J2617j47964j59708K2436n6172P2692O3295
24948A84718k6549j16466r0216j77608j27650K60526Q9807J97256r4277O1415
24938A60956J37591M4712l73754k1862J48345j05329q7384j18155j32407r7411
$$ plain form
25011 -65922 25563 84528 56508 272106 251905 66983 -84179 -280484 -489508 8653
25001 8653 235298 256585 143181 -41527 -173920 -131645 -59698 117135 137166 140370 120814
24990 120814 -180892 -212537 -258516 -409423 -399021 -137017 49896 -30469 -141257 -255752
24980 -255752 -212040 -71943 -44392 -126368 -26693 120383 213326 279262 333950 490290 496114
24969 496114 300777 249991 116291 -209936 -99291 7514 -43483 -66764 70418 422681
24959 422681 450662 399352 417281 377522 390139 242175 82467 104903 48731 121423 184718
24948 184718 158169 41703 -48513 -226121 -353771 -93245 -3438 193818 99541 160956
24938 160956 298547 343259 -30495 -52357 95988 -9341 -96725 -214880 -347287 -444698
24928d44698n524L15462L02720J76154o8344j61084k2383n8623P3266L9847q72
24917A45921k61004k43288O5185J26288L26427K75013j41455l30811O523r6486
24907a27687J02636N9953Q2851j64729L6559Q0768l202j59198r7374l6780l3151
24896b59354K07409P8617l14757N6037J88862K20188J29470J67274N1341l22891
24886B02196k32093k34212K2792J56255K77524j02775k19056K2386K11571J32803
24876B37391M1828j98710p6617q0205l2732r6081k0858n59J39073J0576o2478
24865a39372O8687N4219J31388J33572L3705j53448j19833M14503K26030j63424
24855D86027j73011k40245j22371K818j54320l0717r9114J28673J89525J55613
$$ plain form
24928 -444698 -450222 -134760 167960 344114 275770 114686 92303 33680 106946 146793 145921
24917 145921 -115083 -358371 -293186 -166898 159529 434542 293087 -37724 -31201 -127687
24907 -127687 -25051 34902 117753 -46976 -10417 70351 67149 -92049 -189423 -226203 -259354
24896 -259354 -51945 26672 -288085 -232048 -43186 177002 306472 473746 525087 202196
24886 202196 -29897 -264109 -241317 -85062 192462 89687 -129369 -106983 104588 237391
24876 237391 279219 80509 3892 -76313 -109045 -205126 -225984 -226543 -87470 -76894 -139372
24865 -139372 -70685 -16466 114922 248494 282199 128751 8918 423421 649451 486027
24855 486027 313016 72771 -49600 -46782 -201102 -231819 -330933 -202260 -12735 142878
24845A42878K592l12938k30536k74326J39374K02399K27283J49467K3840l26375
24835b56342J04254J92799p8930j00542M3613j22992k0591J89715N4398J3824
24825A9206J06752q6743N3975J71148M8417r9090k29641P3315K80518M7560P4936
24814D60353N0195m793j80699k45364P0789j54167P0010R7916M1103J60211O4584
24803D30138j6291n5530j20040j97822k03624L1323J12252Q9366l5191j24869
24793i0288q2161P1818r5281j34184r8842L12516K61145j15467K2194q5554r0918
24782a25022j6552R8640J51583j72676J01796k34661J31153m9777n5552q8056
24772b59124q4824J45708J47663j29614K20296J24357l312P24k72597l43490K12921
$$ plain form
24845 142878 145470 -167468 -398004 -672330 -532956 -330557 -103274 46193 70033 -256342
24835 -256342 -152088 40711 -38219 -138761 -95148 -218140 -238731 -49016 5382 19206
24825 19206 125958 39215 93190 264338 312755 213665 -15976 57339 337857 385417 460353
24814 460353 510548 505755 325056 79692 150481 -3686 66324 164240 205343 365554 430138
24803 430138 413847 358317 238277 40455 -163169 -131846 -19594 69772 34581 -90288
24793 -90288 -172449 -100631 -195912 -330096 -428938 -116422 144723 29256 51450 -34104 -125022
24782 -125022 -141574 -42934 108649 -64027 37769 -196892 -65739 -115516 -171068 -259124
24772 -259124 -343948 -198240 -50577 -180191 40105 164462 161150 161874 -110723 -454213 -241292
24761b41292M5793o7298K19848L08231k98217k37007O771k05378J5062K31699
24751b21788P7576L3310Q508J95488J22582m3581l291n8048j9761O2125l5344
24740A17776m4425K9193j02780j4623K51830J19875j34085j50352k03908m7903
24730a79402O9851m4005m6415j39419O8109R0316j61385R285J55841k2822j13464
24719c13510O203K19220o6635J41965J95984n7649o342N6625J72552k20956j82427
24708e4970J16919m1315J68778k2848M5365k08258k0176J61595r9202j39457Q569
24697h5000J41184j50968N3937O7834j90874O2103n7599k35610j14763L4918M27577
24686d7261K6887J209j13055j45353N5040J17324j48207j43187J2207J56457J93494
$$ plain form
24761 -241292 -195499 -262797 -42949 265282 -32935 -269942 -263171 -468549 -453487 -221788
24751 -221788 -144212 -110902 -102394 93094 215676 172095 168804 110756 90995 153120 117776
24740 117776 73351 102544 -236 -14859 236971 356846 222761 72409 -131499 -179402
24730 -179402 -109551 -153556 -199971 -339390 -271281 -180965 -342350 -333065 -177224 -200046 -313510
24719 -313510 -307307 -88087 -154722 -12757 183227 125578 119236 175861 348413 127457 -54970
24708 -54970 61949 20634 189412 166564 211929 3671 -16505 145090 45888 -93569 -85000
24697 -85000 56184 -94784 -40847 26987 -163887 -101784 -159383 -394993 -509756 -474838 -47261
24686 -47261 -20374 -19165 -132220 -277573 -222533 -105209 -253416 -396603 -384396 -227939 -34445
24675c4445j53331l7187R8528M9942O503J48722Q2847k32930J19557M80860P9628
24664F08694l78056l09739r7830K08136R3800k74055j24390M6599J85639J04821
24654F3619K10193J19883l8185K4430m80465l20698K81462K49117j23047M708
24644h983n9039J62205Q525l9919L4171l3000M3983j52953j4788M7752N063M7715
24632D0732J02372Q3415J1660p7725k6600j72033k8036j61919r8996k1088J99261
24621a48957J05279J74207j85985o3478O79k57616J89129L95710r9287k01615
24611i1934K34685l7467k07405j83796O1386K46700Q1931l26487k04396J41047
24601b85736R8846M670J49960L7210J18606r7406j09841j03196k10004P5790Q9952
$$ plain form
24675 -34445 -187776 -224963 -126435 -76493 -69990 78732 161579 -71351 48206 529066 608694
24664 608694 230638 -79101 -176931 31205 125005 -149050 -273440 -226841 -41202 63619
24654 63619 273812 393695 355510 379940 -100525 -421223 -139761 109356 -13691 -8983
24644 -8983 -68022 94183 102708 62789 96960 63960 107943 -45010 -59798 -12046 -6983 40732
24632 40732 143104 226519 238179 160454 133854 -38179 -66215 -228134 -327130 -348218 -148957
24621 -148957 -43678 130529 -55456 -118934 -118255 -375871 -186742 208968 109681 -91934
24611 -91934 142751 105284 -102121 -285917 -224531 22169 104100 -222387 -426783 -285736
24601 -285736 -186890 -182220 -32260 4950 123556 26150 -83691 -186887 -396891 -321101 -231149
24590b31149R3003O7190J29457k9199R4320R4321k4763k83571k7815k06929j54481
24579d79616O9060R5969o1720j07079O3409j30029K13673J71133r442k15562O1491
24568c28713J78088J08859K01320J07225j31982K3975n4433Q5946J42717j3461
24558C19541j71748l09643k8321K7943J78799q4629j97615k7077Q8318J65581
24548c8851M6161k643j54723p189K9130p3276K1190l2697j28643J28060J86745
24537b6736n156N3353j11817k73357K65381J48002M6141J39785l807j16291k87985
24526a72487j35342N2256m9852K04059k09366j73233l4033P3645J41857K85523
24516a6973J88956r5548j22357j79116k77226j4941J67748P2353J32133L76180
$$ plain form
24590 -231149 -138146 -70956 58501 29302 123622 217943 193180 -90391 -118206 -325135 -479616
24579 -479616 -410556 -314587 -376307 -483386 -419977 -550006 -336333 -165200 -174642 -390204 -328713
24568 -328713 -150625 -41766 159554 266779 134797 158772 104339 190285 333002 319541
24558 319541 147793 -161850 -190171 -162228 16571 -68058 -265673 -292750 -204432 -38851
24548 -38851 7310 4667 -150056 -157245 -128115 -201391 -180201 -212898 -341541 -213481 -26736
24537 -26736 -31892 21461 -90356 -363713 -98332 49670 95811 235596 231789 115498 -172487
24526 -172487 -307829 -255573 -305425 -101366 -310732 -483965 -517998 -444353 -302496 -16973
24516 -16973 171983 76435 -45922 -225038 -502264 -517205 -349457 -277104 -144971 231209
24506B31209J1425k55729M476j66657Q4052K3936k12648k61693L8376O5880Q3094
24495c54279J58825K30180P9345J86135Q2399j40734j91272j22017M4P6775R8845
24484A04246K47089K7462r2845r995L2889m0262j14638j7000j55941m462m8822
24473g2279K7835J59640n7393j14170p4549l196p2522J38063m046k22962l125
24462b98704J30946k20543o4306K30660K59822M6419o421j4031O9998J77485P8843
24451C90168J8968M3809j03244j2822j84608j301J10055l5299k2858j71561l2497
24440a190K66435Q5437k27525r674j54560j16786k8247l8091K122k1658K64390
24429B0653M6853J07057J12536M5434j73732k59356L7799l3337J8440J27520N0498
$$ plain form
24506 231209 242634 -13095 -8619 -175276 -91224 -67288 -279936 -541629 -503253 -437373 -354279
24495 -354279 -195454 34726 114071 300206 382605 241871 50599 -71418 -71374 5401 104246
24484 104246 351335 378797 285952 275957 308846 268584 153946 136946 -18995 -23457 -72279
24473 -72279 -44444 115196 57803 -56367 -130916 -134112 -206634 -68571 -72617 -295579 -298704
24462 -298704 -167758 -388301 -452607 -221947 37875 84294 77873 63842 133840 311325 390168
24451 390168 409136 452945 349701 336879 152271 150970 261025 225726 202868 31307 -1190
24440 -1190 265245 350682 123157 113483 -41077 -157863 -186110 -224201 -222079 -243737 20653
24429 20653 67506 174563 287099 332533 158801 -100555 -62756 -96093 -77653 49867 100365
24418A00365J80335L07819k69579j13412J54041r2209l404j9424M2339Q6075R995
24407C82941K0254j02351J97135K27894J77505j46484n2171K84263K38125J33167
24397A360278O3364R3390j41619k06177P7664J86980q3628M7117J14453J65331
24387A677153M7379j27896J720k0528j53091P2658k41687k72485k23933j85849
24377E73441l863M17859J08074k68994j45077j36584k7370k21623o5390j813j64356
24366F4304J3166J25807P590K53640l0785j1130q3251k77104j6685K85597M16884
24355G48033k4988m27267k37308q8086J7367J49530P1820j05704j78994L5745
24345c9852L16384k2656o3039k8238J25873j87317r4848k3140j31182J49858P1086
$$ plain form
24418 100365 280700 588519 318940 205528 359569 267360 263956 244532 286871 372946 382941
24407 382941 403195 300844 497979 725873 903378 756894 704723 988986 1227111 1360278
24397 1360278 1423642 1517032 1375413 1169236 1246900 1433880 1350252 1397369 1511822 1677153
24387 1677153 1724532 1596636 1598356 1577828 1424737 1497395 1255708 983223 759290 573441
24377 573441 569578 987437 1095511 826517 681440 544856 517486 295863 230473 228660 64304
24366 64304 77470 203277 210867 464507 433722 422592 339341 62237 45552 331149 748033
24355 748033 723045 295778 58470 -29616 -12249 137281 209101 103397 -75597 -39852
24345 -39852 276532 253876 190837 162599 288472 101155 6307 -16833 -148015 1843 72929
24334G2929j13193q4425J77456K2086j64647j41809J70239N9472k36790j23648
24324c62330J14739o2138Q0219K6972J79249j58872k94933K3785k1026J77745
24314b96590K29656q1299J7847J80846L8833j19184P8924J22105J52334j28819
24304A94653j13288m1851k46065J0989K26396Q4682M1301k5944q2227j90452r3709
24293b35515n3452N3749J0653J82837L3074R3870J35703P113p2978l3638l9586
24282H1830n3426k12249j24995r7976o5465J19968J0403K50008N3817k3462j08827
24271a70374J46133j17206J32133q7118k92168q8851L8622r2120M9287R93l6432
24260e17101o2039R7279J44555J43526N3333l51034r3231J61995K13785r1400
$$ plain form
24334 72929 -40264 -124689 52767 74853 -89794 -231603 -61364 -1892 -238682 -362330
24324 -362330 -247591 -309729 -229510 -202538 -23289 -182161 -477094 -453309 -474335 -296590
24314 -296590 -66934 -148233 -130386 50460 89293 -29891 49033 171138 323472 194653
24304 194653 81365 39514 -206551 -195562 30834 115516 156817 130873 48646 -141806 -235515
24293 -235515 -288967 -235218 -224565 -41728 -8654 85216 220919 228032 155054 121416 81830
24282 81830 28404 -183845 -308840 -406816 -472281 -352313 -341910 -91902 -38085 -61547 -170374
24271 -170374 -24241 -141447 -9314 -96432 -388600 -477451 -438829 -530949 -481662 -480669 -517101
24260 -517101 -579140 -481861 -337306 -193780 -140447 -491481 -584712 -422717 -208932 -300332
24250c00332o630J31170K25947J47178J45596k11411k96206k05455J73179L3786
24240a63178r4639j68849l5467r5865N2426N9216K66638J98219J53673K29913
24230D02087P2583k35433l34287j29573m4723m2974P0343N8772J44779J65613
24220A27187j50337j39916J49323j78874r2427K30255P6439m4941J94992o8217
24210A03484L880q115o6487j24852L3356k1742q1393j63865N6927P5009r0896
24199b84694k8947o01J44493L33818K07680o6344j61439J79633J35973l48626
24189A10946j38106j59806q1160K21428M2130j72115k92591j01744Q6041J24762
24179c60215o0141k9226k6898K84993K7531J90940J03862k0053k1191j76201K52372
$$ plain form
24250 -300332 -306962 -175792 50155 197333 342929 131518 -164688 -370143 -196964 -163178
24240 -163178 -257817 -426666 -462133 -557998 -505572 -446356 -179718 18501 172174 402087
24230 402087 474670 239237 -95050 -224623 -269346 -312320 -241977 -183205 -38426 127187
24220 127187 -23150 -163066 -13743 -192617 -285044 -54789 21650 -23291 171701 103484
24210 103484 107364 99249 32762 -92090 -58734 -80476 -161869 -325734 -268807 -193798 -284694
24199 -284694 -313641 -314242 -169749 164069 371749 305405 143966 323599 459572 110946
24189 110946 -27160 -186966 -268126 -46698 -4568 -176683 -469274 -571018 -484977 -360215
24179 -360215 -420356 -449582 -476480 -191487 -163956 26984 130846 110793 89602 -86599 165773
24168A65773J42188k09991J00220Q2014j94733J78090Q6727o5780p2800j03144
24158A08564J0400K34030J73014N571o3079k70074m1557J25570K7868k80304o8359
24147c8356j10760n5854J58232J12894J55063k74148k44957L4286M9760J65559
24137d8281K32350j01954n6922m3198J55937L1109j59146M71P9633L4846m9740
24126G5105m0484j84267l8163J21146j4911n367P8907Q7083j94437k54684k3411
24115c93483J60587q5032k23280j7063J38695K58296j49243N6843K08523k48961
24105b94118j69018J39075J97320J7974l5833N457J86828L3141J05121O7850j88758
24094F5039l869k66682K1617Q1817J39841M9368n0257k2528Q4174p5942j92803
$$ plain form
24168 165773 307961 97970 198190 280204 85471 263561 350288 284508 211708 108564
24158 108564 118964 352994 526008 531579 468500 198426 156869 282439 310307 30003 -38356
24147 -38356 -149116 -204970 -46738 66156 221219 -52929 -297886 -263600 -213840 -48281
24137 -48281 184069 82115 25193 -18005 137932 169041 9895 10366 89999 124845 75105
24126 75105 34621 -149646 -187809 -66663 -81574 -86941 -8034 79049 -115388 -370072 -393483
24115 -393483 -232896 -317928 -541208 -558271 -419576 -161280 -310523 -253680 -45157 -294118
24105 -294118 -463136 -324061 -126741 -108767 -144600 -139143 47685 80826 185947 253797 65039
24094 65039 61170 -205512 -183895 -102078 37763 87131 36874 14346 98520 22578 -170225
24083a70225r8748J61793P6479j62757j15274N0857j4417j10675K06444J38525
24073c7998J89284k9189l3763Q8143k71372j03322K58178J21110j92506j62438
24063a73873K41898j8770j98924J04081Q9410R0188P6152j04187l4509K126K8578
24052A02170r9939j60924Q9662O2693O8019O7469M4977k40158j73227q967J87117
24041f1108K38103J65828O0849k20390k33144k1259P6280q6361M5028k149k39297
24030b77620k21467j15085j27345K12968L26537O7044k8848K46514k10471j03373
24020b31146R1500r8088k5310J53552L41165J1825j49280k1727j55996O5618N1950
24009C4063k28945o0340L4704P9247K76932M2548k22825j22072j7497J57071m2891
$$ plain form
24083 -170225 -268973 -107180 -30701 -193458 -308732 -257875 -272292 -382967 -176523 -37998
24073 -37998 151286 122097 88334 176477 -94895 -198217 59961 181071 -11435 -173873
24063 -173873 68025 49255 -149669 -45588 43822 134010 210162 105975 71466 73592 102170
24052 102170 2231 -158693 -69031 -6338 61681 129150 174127 -66031 -239258 -248225 -61108
24041 -61108 176995 342823 403672 183282 -49862 -71121 5159 -81202 -36174 -38323 -277620
24030 -277620 -499087 -614172 -741517 -528549 -202012 -134968 -163816 82698 -127773 -231146
24020 -231146 -139646 -237734 -263044 -109492 231673 243498 94218 72491 -83505 -17887 34063
24009 34063 -194882 -255222 -220518 -141271 135661 178209 -44616 -166688 -184185 -27114 -70005
23998g0005Q7459L48046J61801J8129n4992M2014N4070m03685l30236j08757J09467
23987a46689K09127j01133j84614K52694K6814j37701Q0873L4795q948k8807r3670
23976i7259m8506j9301J37778L34377j48271j81749p2215j40975k26960R3046
23966c70035J73197J94189j53754j06409L69702J35598J0193k83202m47384J49854
23956c28051K59826J20884K8895L6617J3898n1155j22814M622n0414J94339K52613
23945C59260k28361k12296r1911j15199J62350O7598j16157N7755J28784K22747
23935B34570p9053k15007j48874J03433J23882J51085P3076N535j92433K12726
23925B68940K95769j66692k83648k30607k75575K9089p1760Q9188K81754O6330
$$ plain form
23998 -70005 17454 365500 527301 545430 490438 532452 586522 182837 -147399 -256156 -146689
23987 -146689 62438 -38695 -223309 29385 56199 -81502 -629 34166 25218 -3589 -97259
23976 -97259 -145765 -165066 -27288 307089 158818 -22931 -95146 -236121 -463081 -370035
23966 -370035 -196838 -2649 -156403 -262812 106890 242488 252681 -30521 -477905 -328051
23956 -328051 -68225 52659 81554 118171 132069 80914 -41900 -37278 -87692 106647 359260
23945 359260 130899 -81397 -173308 -288507 -126157 -58559 -174716 -116961 11823 234570
23935 234570 155517 -59490 -208364 -104931 18951 170036 243112 248647 56214 268940
23925 268940 564709 398017 114369 -116238 -391813 -362724 -434484 -345296 -63542 2788
23915B788J34813p3163L7974R925o3388q8419j29409o0138N5742K51955J17808
23904A96488j38257K741O5592N4642j7121j8439M4172O5030j16519q0267j2599
23893D5463p1249R4620k3559l3700l2581j27661m2869l9934n6987q2013K47733
23882a22737J92937j58887l2526n7597R6614K6345R766J51645m6670J00008J63868
23871C22766l07693m1746j37097J18319J53063l853P8624j0880j11176J05202
23861A65529Q5928N1398k90029k29777K08247o8672q9925J50684O3529j42864
23851i5952K38692J02936k33795l12297J68858K29469K4500l46147J01757K93460
23841A71481P2726J34004l798k45942k5323M9592L124P7508M9512p6745j46043
$$ plain form
23915 2788 137601 64438 102412 112337 48949 -39470 -168879 -229017 -173275 78680 196488
23904 196488 58231 60972 126564 181206 164085 145646 189818 254848 138329 58062 45463
23893 45463 -25786 68834 45275 11575 -21006 -148667 -191536 -231470 -288457 -370470 -122737
23882 -122737 70200 -88687 -121213 -178810 -82196 -55851 -46085 105560 58890 158898 322766
23871 322766 15073 -26673 -163770 -45451 107612 103759 182383 171503 60327 165529
23861 165529 251457 302855 12826 -216951 -8704 -77376 -167301 -16617 46912 -95952
23851 -95952 142740 245676 11881 -300416 -131558 97911 122411 -223736 -121979 171481
23841 171481 244207 378211 374413 128471 103148 152740 155864 233372 282884 206139 60096
23830F0096p4910K21026J95040j24500j36115l41768k37904R5126J39767O25j07769
23819c11286k6531K07533J09920j77504Q4342R4517Q1233r3091n8321K8765p2822
23808a33245L72006K4369o5701l0175j82484Q9809K1224k08941m1316J1120R0023
23797e3311j27003j1221p132K67539J09123j27488P3760K9748J55833N3917R3572
23786D57337j68673j35465L7611k52603k8615J65345L3003j47037k1363k02622
23776b63082R906J04783R0645j82788o4240P5743R3476k4566J43005j89417l6964
23765b43499q9481N4677K49031N8615r3666j06876l63836J0998L57682L71402
23755B05047o6355k08379M1557p3949J4167j24852J09788k5658j71098J65257
$$ plain form
23830 60096 -14814 206212 401252 276752 140637 -201131 -439035 -343909 -204142 -203517 -311286
23819 -311286 -337817 -130284 -20364 -197868 -113526 -19009 62224 -30867 -89188 -60423 -133245
23808 -133245 238761 263130 197429 167254 -15230 74579 95803 -113138 -154454 -143334 -53311
23797 -53311 -180314 -191535 -198667 68872 177995 50507 124267 154015 309848 363765 457337
23786 457337 288664 153199 190810 -61793 -90408 74937 107940 -39097 -60460 -263082
23776 -263082 -253176 -148393 -57748 -240536 -304776 -229033 -135557 -160123 -17118 -206535 -243499
23765 -243499 -332980 -278303 -29272 29343 -64323 -171199 -535035 -524037 -166355 205047
23755 205047 138692 -69687 -28130 -102079 -87912 -212764 -102976 -128634 -299732 -134475
23745a34475J69284J90622k21234j34955L612k67893j8028K17048K45675J23176
23735A72832N8601L1917j85947J20953k19196n9812K11907j50584k19491j4080
23725b52900o7565J34692j01562j55639J38874L17261L83605M6149l59957q3455
23715d97K25794n2276j13281M3548l7580K54476j48652o92675j26679L02036K02946
23704a42840j11956j76179R154n9555K49187K42951p6308j16248J2550J58133
23694a1111q4122K416M8385K9093l9813J61841m6089j80469m3413j32255k5987
23683c21524n1421K21836Q6379n2707P1206R6311K5355l495p5724J4582k33690
23672b22892j5833L272j36676j5564M7160j73210q0426l4194K10284P3399j35191
$$ plain form
23745 -134475 34809 225431 4197 -130758 -127146 -395039 -413067 -196019 49656 172832
23735 172832 231433 263350 77403 198356 -20840 -80652 131255 -19329 -238820 -252900
23725 -252900 -320465 -185773 -287335 -442974 -304100 13161 396766 442915 82958 -497
23715 -497 225297 173021 59740 103288 65708 320184 171532 -521143 -647822 -345786 -142840
23704 -142840 -254796 -430975 -421821 -481376 -232189 10762 -65546 -181794 -169244 -11111
23694 -11111 -95233 -92817 -44432 -15339 -55152 106689 60600 -119869 -163282 -295537 -321524
23683 -321524 -372945 -151109 -64730 -117437 -46231 50080 75435 71940 -3784 10798 -222892
23672 -222892 -238725 -235453 -372129 -387693 -340533 -513743 -594169 -628363 -418079 -344680 -479871
23661d79871K35999L40425l4765o7870J75323P3202L6892n4135j36324l22630
23651b33754J50220K38319P6607j44848N6689n8553j34345R0432J6922m1292j16589
23640a00192j95965Q8625L19946j99286R4003K70437j4353j71590k42833j0009
23630a61217R7353j2872L0329K22493M5011o5995j11047p1343N0813l4577o4651
23619g5703R0021J55809k60581l01683p9907L80022m212j22426J22638N2252j454
23608d5224J02392l9785p6196J0863r5404K45774J02488j36253J09909o29o5110
23597A12825k61277k57131n3703R7004P6369m9928m8462p9024J90780K23180R8298
23586D8931p6956R2293j91973r4573K14703J39052L1459M7325l37174J1105L54002
$$ plain form
23661 -479871 -243872 96553 61788 -6082 169241 242443 279335 225200 88876 -233754
23651 -233754 -83534 154785 231392 86544 143233 84680 -49665 40767 57689 16397 -100192
23640 -100192 -296157 -207532 112414 -86872 7131 277568 263215 91625 -151208 -161217
23630 -161217 -63864 -76736 -46407 176086 221097 155102 44055 -27288 23525 -11052 -75703
23619 -75703 14318 170127 -90454 -392137 -472044 -92022 -96234 -218660 -96022 -43770 -45224
23608 -45224 57168 17383 -58813 -47950 -143354 102420 204908 68655 178564 177935 112825
23597 112825 -148452 -405583 -459286 -362282 -285913 -335841 -384303 -463327 -272547 -49367 48931
23586 48931 -28025 64268 -127705 -222278 -7575 131477 162936 210261 -126913 -115808 238194
23575B38194J01561j63801o2384J26618q4789q8186l66710l4526J85003q0958
23565b29978m455K41151O5114k15562o4111p0094j82361n2298Q757N6912J58947
23554b87978K98158j29508j76034o6250J60767Q6587K71181k1470j1976J66405
23544B89882J14578l77061o6335K44499m7034n53j15014l2625k28095o8304o0397
23533c46459O1749K55689L0321k06581r5976J63682l5534J29688Q6251k42117
23523a99287L6069J71728n1638k13689p0672J50787K89816j02704L3828K69577
23513C13815j22614n2188l2697j45399j92238k13325J37539Q1470m2419r806j043
23502b78905K49990O2914m0855K90082J2458Q9482q0776j40255K32759Q7194l47001
$$ plain form
23575 238194 339755 175954 113570 240188 155399 67213 -299497 -334023 -149020 -229978
23565 -229978 -234433 6718 71832 -143730 -207841 -277935 -460296 -512594 -503837 -446925 -287978
23554 -287978 10180 -119328 -295362 -361612 -200845 -114258 156923 135453 123477 289882
23544 289882 404460 27399 -38936 205563 158529 157976 42962 10337 -217758 -286062 -346459
23533 -346459 -284710 -29021 1300 -205281 -301257 -137575 -173109 -43421 42830 -199287
23523 -199287 -163218 8510 -43128 -256817 -327489 -176702 113114 10410 44238 313815
23513 313815 191201 139013 106316 -39083 -231321 -444646 -307107 -225637 -268056 -277862 -278905
23502 -278905 -28915 33999 -6856 283226 295684 385166 304390 164135 396894 484088 137087
23491A37087R508K27491o7921k37042j9951J2573j59459j25141n4021J816l4293
23480c09353N7712p1934Q3086J54792q9419j25550j43825N1807N4734K38954l5977
23469a34973M0539L12087N8857k03451j56847j86012r0384Q5391J92594j27937
23459b10136p5496J70789m2644K5607m9170J32214p1719K65336K6169k90049j64323
23448b83422L15887J60158q4689j30030j0940K5480r6129j8108L0977J4364K13549
23437A37097L6672j31582J3569m6463q0315j56760J29593J15286k48195N6779
23427a74319J11007J21219j18731J5696j10426m2284j02565M824L60047N0351
23417A14819j48528j55767M1689J31471K8055j18345j68158j03023K84363L22272
$$ plain form
23491 137087 146595 374086 306165 69123 49172 61745 -97714 -222855 -276876 -275060 -309353
23480 -309353 -251641 -323575 -240489 -85697 -175116 -300666 -444491 -392684 -337950 -98996 -134973
23469 -134973 -94434 217653 276510 73059 -83788 -269800 -360184 -274793 -82199 -210136
23459 -210136 -285632 -114843 -157487 -131880 -181050 -48836 -120555 144781 170950 -119099 -283422
23448 -283422 32465 192623 107934 -22096 -33036 -7556 -103685 -121793 -90816 -76452 137097
23437 137097 173769 42187 55756 9293 -71022 -227782 -98189 17097 -231098 -174319
23427 -174319 -63312 57907 -60824 -45128 -155554 -197838 -300403 -295579 64468 114819
23417 114819 -33709 -189476 -147787 -16316 11739 -106606 -274764 -377787 -93424 228848
23407B28848L0636j48951j69558J68242L46762n2711O2866r1964j95124r4630
23397H4416r8957j43035p5162P4542Q2904k2360R723j99968M5706K56879L3782
23386D8470J02364j84531j29853k8396j28108k13918J45450O9095K54424K40022
23376A75019J86010j67195k0420m3840k99809M8301J75907p3589R8295J1874O1060
23365A51613n8369l9278p1058m9497j15629P6834l1951j85269O3941L66720J43794
23354B51851j18152l77296Q5663m6953j26794L5287J81487j61225l4157K6276
23344b84013K45525K31579k96519j7843K15962N2926k88334o2779j16769l8759
23334c59024J11570P3795K60380K80500j29473k05026j12996j9655m3142J5912
$$ plain form
23407 228848 259484 110533 -59025 109217 455979 403268 466134 374170 179046 84416
23397 84416 -14541 -157576 -232738 -158196 -75292 -97652 -87929 -287897 -242191 14688 48470
23386 48470 150834 -33697 -163550 -191946 -320054 -533972 -388522 -319427 -65003 175019
23376 175019 361029 193834 173414 129574 -170235 -121934 53973 -19616 78679 90553 151613
23365 151613 93244 53966 -17092 -66589 -182218 -105384 -137335 -322604 -258663 108057 251851
23354 251851 133699 -243597 -157934 -204887 -331681 -296394 -114907 -276132 -310289 -284013
23344 -284013 -38488 193091 -103428 -121271 94691 147617 -140717 -203496 -320265 -359024
23334 -359024 -247454 -173659 86721 367221 237748 32722 -80274 -99929 -143071 -127159
23324a27159o3475l52769J19696J69q6927L19821L60473k52117m0525K64435J01560
23313B43182q841J13553k39919j83807j41963R4247J7742J26655N6980O976n1489
23302C3316J53724J68750j3818q0810o6958N1161l17997p7675J22606j35667K92254
23291A28886N9657J8984J02230j74265k48214j8977K81160J36030q9369j06701
23281H9421k83222j90889j531l9373n1059K72363J71961j2453l8572k82854k02590
23270e68798K77493K36352p6867R3211k4557J37189J46711k23448m4253r7913
23260a44880o8087J25459l2995R3342n2165j42876L6649M8148r3069N4051K02497
23249B6074R7474j91695O2146j3695r311m2490l5927M5415N2105R2875p0841o0976
$$ plain form
23324 -127159 -190634 -543403 -423707 -423538 -510465 -190644 169829 -82288 -122813 141622 243182
23313 243182 234341 347894 107975 -75832 -217795 -123548 -105806 20849 77829 84805 33316
23302 33316 187040 355790 341972 261162 194204 245365 -72632 -150307 -27701 -163368 128886
23291 128886 188543 207527 309757 135492 -112722 -131699 149461 285491 196122 89421
23281 89421 -193801 -384690 -386221 -425594 -476653 -204290 -32329 -44782 -83354 -366208 -568798
23270 -568798 -291305 -54953 -131820 -38609 -63166 74023 220734 -2714 -46967 -144880
23260 -144880 -212967 -87508 -120503 -27161 -79326 -222202 -185553 -137405 -230474 -176423 26074
23249 26074 123548 -68147 -6001 -19696 -29007 -71497 -107424 -62009 -9904 82971 12130 -48846
23237d8846J94941j29959j66046p9794K83690q7005O5862q8136m2274P8050j56470
23226a75987L2652L29812K76873k52694m44136j50219o8344Q96p4797J14846L24260
23215h6838L54769L1080l24691l7679N7488j98787J48944J13051j58072P2578
23205b8157J1994j00077O3751M439J447J26927l172r7950M6837J04872q5701j72933
23193a27723M8371K46476K0508j66907j10408j19751j27445j30143j73203J54381
23183d85844o6806J9022L33686J09545k71418L0588K12846N236J41746m6184N9504
23172D1921j06715j11394P4607K57667k584l06626p1319Q589N3846M5381K37232
23161A20605J01560q5628q6461l8949m536q2967J2372o0255p1610J83998R7464
$$ plain form
23237 -48846 146095 16136 -149910 -229704 53986 -33019 32843 -55293 -97567 -19517 -175987
23226 -175987 -143335 186477 463350 210656 -233480 -383699 -452043 -451147 -525944 -411098 -86838
23215 -86838 267931 299011 -25680 -63359 -5871 -204658 -55714 57337 -100735 -28157
23205 -28157 -16163 -116240 -52489 -48050 -46603 80324 77152 -20798 26039 130911 45210 -127723
23193 -127723 -79352 167124 187632 20725 -89683 -209434 -336879 -467022 -640225 -485844
23183 -485844 -552650 -533628 -199942 -90397 -361815 -331227 -118381 -113145 28601 -17583 41921
23172 41921 -64794 -176188 -101581 156086 153502 -153124 -224443 -215854 -162008 -116627 120605
23161 120605 222165 136537 50076 11127 6591 -76376 -64004 -124259 -195869 -11871 85593
23150H5593P1763j12070j17616P6602k09648J5987j6587j34383J95021L6602J76703
23139F7967j4890j01906L4957j78938o092j71038k2073J82328K568M7227K5184
23128a34706R7240j16566q1909j47501J97149K05322q5809k80868j58245J25671
23118c80222L28393J44804P6534J81930J8979p7521j57433L3249R1895m1672j95732
23107B3204r5726K58n7943P8856k35496j8780R1067P7659K44924L14034J54689
23096E76746j97538m45634m50667L0723k8958O6272K45206Q0540N6568J44069
23086G7327K84773P25J64229K9171k40486j26379j39686j54574m7625l7790j306
23075a91621q4927k05076J3910J4556O2959J82112J86080L3832j04428J14323
$$ plain form
23150 85593 157356 45286 -72330 4272 -205376 -189389 -205976 -340359 -145338 -108736 67967
23139 67967 53077 -48829 -13872 -192810 -198902 -369940 -392013 -209685 -207117 -159890 -134706
23128 -134706 -37466 -154032 -235941 -383442 -186293 19029 -66780 -347648 -505893 -380222
23118 -380222 -51829 92975 169509 351439 370418 292897 135464 168713 260608 218936 23204
23107 23204 -72522 -72264 -130207 -51351 -286847 -305627 -214560 -136901 108023 422057 576746
23096 576746 379208 -66426 -517093 -486370 -515328 -449056 -203850 -123310 -66742 77327
23086 77327 362100 362825 527054 556225 315739 189360 49674 -104900 -152525 -190315 -191621
23075 -191621 -276548 -481624 -467714 -453158 -390199 -208087 -22007 11825 -92603 21720
23065B1720k04631J0160j34569j43541M4593Q2113O9773O8570n8240j74313K65048
23054a53317Q8159j05287J22377Q1018L8411l1287j17591j00871o4502k97311
23044e40201J05707K37482J39486J07610j26175J07386J27839k00289P394K24799
23034A91038j3327k42097j71385R5631J20881J46473J04718K25280J3852j70918
23024C00146j93965j65791O6590M9033j78052M2150Q4617q2912l6881P7905J57902
23013A20742K34k7313P535k61040n4089J52378j03502j12004J47172k4419J38691
23002a5615K96949k319j79139J5548j40855m1703K8216o979j31229L9006J85147
22991D7027K8039L1657o8960q0154o1180J23050K52844Q4831j0443j39404k56323
$$ plain form
23065 21720 -182911 -172751 -307320 -450861 -406268 -324155 -254382 -185812 -244052 -418365 -153317
23054 -153317 -65158 -170445 -48068 32950 71361 40074 -77517 -178388 -242890 -540201
23044 -540201 -434494 -197012 -57526 50084 -76091 31295 159134 -41155 -33761 191038
23034 191038 177711 -64386 -235771 -140140 -19259 127214 231932 457212 471064 300146
23024 300146 106181 -59610 6980 56013 -122039 -79889 4728 -78184 -115065 -37160 120742
23013 120742 120976 93663 101198 -159842 -213931 -61553 -165055 -277059 -129887 -154306 -15615
23002 -15615 281334 279015 99876 115424 -25431 -67134 -38918 -45897 -177126 -138120 47027
22991 47027 75066 106723 37763 -42391 -103571 19479 272323 357154 346711 207307 -49016
22980d9016l6467Q7984J31753l14624j29933j07370O4247K33403K26624l8892
22970F7709j42121n5926k15643j42263M6763J91187M5164M2939l16597P2493J11241
22959b95054r3242Q9344J12311P6780o4997j33566Q6780K47244P4746p9455o3444
22948d2553m5833O7560r7860r703K91395O966o3717Q9378j76029J02826j55332
22937c2902k0622J89450L28398J1543j85323J20693k413j47839o6340k2802J39224
22926C11067L4617k33550j09352j27824j98327n5292J30256j41879j42803P7867
22916d55220R3098K75480q7666P5963J12313j53092r4397K07133m9150j99899
22906b75437j62932m683l1035j20445L09953J00032O1901O8365m6675J53025m37884
$$ plain form
22980 -49016 -85483 2501 134254 -180370 -310303 -417673 -353426 -120023 106601 67709
22970 67709 -74412 -130338 -345981 -488244 -441481 -250294 -205130 -162191 -478788 -406295 -295054
22959 -295054 -388296 -298952 -186641 -109861 -174858 -308424 -221644 25600 100346 20891 -42553
22948 -42553 -88386 -20826 -118686 -128389 163006 169972 106255 195633 19604 122430 -32902
22937 -32902 -53524 135926 464324 475867 290544 411237 408824 260985 194645 171843 311067
22926 311067 345684 112134 2782 -125042 -323369 -378661 -248405 -390284 -533087 -455220
22916 -455220 -362122 -86642 -174308 -98345 13968 -139124 -233521 -26388 -75538 -275437
22906 -275437 -438369 -443052 -474087 -594532 -284579 -184547 -122646 -54281 -100956 52069 -385815
22895c85815j27593K90333M2875k7043O4254j1568R3625K35129J25726k30911
22885F9012l96090N7223K07504K51o6450j15889l4656j71036j0349n4183N4818
22874d59845J40303K04733q5972q4746O9845J94432q1750k16512j34481K44092
22864b09901m9334N1948K9294K53367L51995j5895k18153j35128l07270j57809
22854d06886K24679J48980n0306k00578J21447M850k7727k22640p0483P9979J67445
22843b31240J69010J19641R739n4275k29480J7313N5396K4133L6712J37289M0457
22832I4695J42866J31746O0197k48388l89314Q3454j29469r2001P8442K05738
22822f2034r5745k34281m0772P3911K20246J53652j22637J71773O2128J48210
$$ plain form
22895 -385815 -513408 -223075 -180200 -207243 -142989 -154557 -60932 174197 299923 69012
22885 69012 -327078 -269855 -62351 -62100 -128550 -244439 -279095 -450131 -460480 -514663 -459845
22874 -459845 -319542 -114809 -200781 -285527 -215682 -21250 -103000 -319512 -453993 -209901
22864 -209901 -259235 -207287 -177993 75374 427369 411474 193321 58193 -249077 -406886
22854 -406886 -182207 -33227 -83533 -284111 -162664 -157814 -185541 -408181 -478664 -398685 -231240
22843 -231240 -62230 57411 67150 12875 -216605 -199292 -143896 -119763 -83051 54238 94695
22832 94695 237561 369307 429504 181116 -208198 -124744 -254213 -346214 -267772 -62034
22822 -62034 -157779 -392060 -432832 -358921 -138675 14977 -107660 64113 126241 274451
22812B74451K99108o6133p6500J06860k00095k52263k14820j60701O7630K11387
22802a1076q7934j08782J47451J6819L7261k1563p056j20605j26543l8510r5447
22791d15985k6786l7210L02793K65613K5850K6705j90519Q5268k88742j33558
22781c86571N0904R5489m3355k61877R7440J00960n6398J62852J91450p4095J95449
22770G2248J675O0673l7485j95144P8229K81962J30085r9104q2332j48806n7658
22759D343J8937k64281k54968J36612M31895R9326j22425p4616R8621L6352L4121
22748A43917j04403L1376J49121M2779J60036l3062k51613l9992K10221j20543
22738A87837j63205K04729k20713j05145k253k5499k9312j5393J2322o5686n2445
$$ plain form
22812 274451 573559 507426 430926 537786 337691 85428 -129392 -290093 -222463 -11076
22802 -11076 -99010 -207792 -60341 -43522 -6261 -27824 -34880 -155485 -282028 -320538 -415985
22791 -415985 -442771 -479981 -177188 88425 114275 140980 -49539 35729 -253013 -386571
22781 -386571 -335667 -240178 -283533 -545410 -447970 -347010 -403408 -240556 -49106 -123201 72248
22770 72248 73923 134596 97111 -98033 -19804 262158 392243 293139 210807 62001 4343
22759 4343 23280 -241001 -495969 -359357 72538 171864 49439 -25177 73444 109796 143917
22748 143917 39514 70890 220011 262790 422826 389764 138151 98159 308380 187837
22738 187837 24632 229361 8648 -96497 -98750 -124249 -153561 -168954 -156632 -222318 -274763
22727b74763K6035m0651L9811J77639N3008k2747J35597l0362j54798K0617M2708
22716b7906j60372l55902J19021P6368m9639J69596J99328k04291N4162j04791
22706b84426q9855k42768j5100K45445r5487J33500J1566k469J09565R9865k5198
22695a55362r1422R0153M4032k00019J2040K62026K25329j90230j73896J46490
22685c0859J48110j15482q092O2182J7265j08075J49043R9757k38263n0454k85411
22674c60279l16859R7480K14556N7178j20110M859j01484j07099J40219J79639
22664c11900j09336k51993P8922K95080j26387k92539J59649K1683j49201J55294
22654e30728N01221l8545j45835Q7020K25861J25726P5862J49414k99261l11847
$$ plain form
22727 -274763 -248728 -289379 -249568 -71929 -18921 -41668 93929 63567 -91231 -70614 -27906
22716 -27906 -188278 -544180 -425159 -348791 -398430 -228834 -29506 -233797 -179635 -284426
22706 -284426 -374281 -617049 -632149 -386704 -482191 -348691 -337125 -339594 -230029 -130164 -155362
22695 -155362 -246784 -156631 -112599 -312618 -300578 -38552 186777 -3453 -177349 -30859
22685 -30859 117251 1769 -6323 55859 73124 -34951 114092 213849 -24414 -74868 -360279
22674 -360279 -677138 -579658 -365102 -307924 -428034 -423175 -524659 -631758 -491539 -311900
22664 -311900 -421236 -673229 -594307 -299227 -425614 -718153 -558504 -536821 -686022 -530728
22654 -530728 -29507 -68052 -213887 -126867 98994 224720 300582 449996 150735 -161112
22644a61112j14744P6616o192q6244J76748K73642J53831n3744m12179j33861
22634b87239j50561J2997L0701L1720m4681J44379K33483j32956k29210j18484
22624e09851P6991P0672J00640P8635R1243j41639j81489j87573j98146R0506
22614g10011K61494K22988p44K15631K75881j92071k90415Q9817J63096k8768
22604F898L8784P2569r6982N3363j29388j87126P3479o5586k32301K3236L69560
22593g3494m6434j7787J17067j71730k55481M9469K43235K34117M3759p0110l6184
22582A6427L1941J18Q0355N6669j09179J6821m9233j43788J77625J54095n3597
22571A78254j88182J4149m6442j25520M5544j72505j17795K70679Q219n6591m4497
$$ plain form
22644 -161112 -275856 -199240 -205432 -291676 -114928 158714 312545 258801 -153378 -287239
22634 -287239 -437800 -424803 -394102 -362382 -407063 -262684 -29201 -162157 -391367 -509851
22624 -509851 -432860 -362188 -261548 -182913 -91670 -233309 -414798 -602371 -800517 -710011
22614 -710011 -448517 -225529 -226273 -10642 265239 73168 -217247 -127430 35666 6898
22604 6898 45682 118251 21269 74632 -54756 -241882 -168403 -233989 -466290 -443054 -73494
22593 -73494 -119928 -137715 -20648 -192378 -447859 -398390 -155155 78962 122721 52611 16427
22582 16427 48368 48486 128841 185510 76331 93152 43919 -99869 77756 231851 178254
22571 178254 -9928 4221 -42221 -167741 -122197 -294702 -412497 -141818 -133599 -190190 -234687
22560b34687K74537J72687j80044k25078l19299q424J58986O1437J48102q0706
22550b32489M5141l5515j45188p2942K74508P2203J85381P7120j31002r4500J84915
22539A27632J73142N926j559J65075j00955l45349j31579k1521k6698K78289J62891
22528B85294j21052k19362j39623j92505k29707p9354J3413J63300j1363Q2915
22518d48044P2604K7005N6386n118Q1434K1555J19837n7164o0687J74220J22375
22507A04403j06016J91630N9426o0717k10117j60875k7329l4892n2687J97544
22497i9630J84804J03798j56045o8383J153o6514L9019N0715R571J28334J3347
22486A40169N6536l5302l90374m6495J32651J7057p3431J79432K76321l6574j91445
$$ plain form
22560 -234687 39850 212537 32493 -192585 -511884 -520308 -361322 -299885 -151783 -232489
22550 -232489 -187348 -222863 -368051 -440993 -166485 -94282 91099 168219 37217 -57283 127632
22539 127632 300774 306700 305141 470216 369261 23912 -107667 -129188 -155886 122403 285294
22528 285294 164242 -55120 -194743 -387248 -616955 -696309 -682896 -519596 -530959 -448044
22518 -448044 -375440 -348435 -292049 -297167 -215733 -194178 -74341 -131505 -192192 -17972 104403
22507 104403 -1613 190017 249443 188726 -21391 -182266 -209595 -244487 -297174 -99630
22497 -99630 85174 188972 32927 -35456 -34303 -100817 -61798 -11083 -1512 126822 140169
22486 140169 196705 161403 -228971 -275466 -142815 -125758 -199189 -19757 256564 219990 28545
22475B8545q0908q875p972J32190j02266J8842Q550R1470q7819L71J76387M2084
22463B10599J0700J52076p0338j69972k55478J31543K05353j75039k19723m7294
22453b27573m14501o6722K72333J36092L09724J17233j47430k55832j6226J10027
22443a82875L19072k5720k75549L6935j31099M8489J76459J72492J78208N7272
22433C73684p3921n6473J8531P8706n9953r9751k14651l0628J39348O9445k94848
22422a50511j51867k15362k5455K40410k5475m2714j25766K01234J73383O0171
22412f1952J10723l18478k13582J34926J22731K6888K1181o2482j10447N5760
22402b94732N6102L21093r9120N1226j54077k02778P7209j4868r1236L74924J36663
$$ plain form
22475 28545 -52363 -61238 -69210 62980 -39286 -20444 -11894 79576 -8243 -7872 168515 210599
22463 210599 221299 373375 303037 133065 -122413 9130 214483 39444 -180279 -227573
22453 -227573 -642074 -708796 -436463 -300371 9353 126586 -20844 -276676 -292902 -182875
22443 -182875 136197 110477 -165072 -128137 -259236 -210747 -34288 138204 316412 373684
22433 373684 299763 243290 261821 340527 280574 180823 -33828 -64456 74892 144337 -150511
22422 -150511 -302378 -517740 -543195 -302785 -328260 -370974 -496740 -295506 -122123 -61952
22412 -61952 48771 -269707 -483289 -348363 -225632 -198744 -177563 -240045 -350492 -294732
22402 -294732 -238630 82463 -16657 34569 -119508 -322286 -245077 -259945 -351181 23743 160406
22391A60406j18471j18242j94077L7191J16441J22281J03447N6776O7905n0735
22381A82922m2309R4137j06783M1719K45579J34301j14686j7918k05179l3934
22371A77849J24620N2337n6260l97473j54796L15963J66262j80943j87496R4333
22361d5604l6275o738J8192j08135o4027J17584L06551n599j11394K07820J81286
22350D53661J497j11074J01687J33022n1192l81900k60808p1084J0396P9846J7979
22339g7970j28682J34026r9724l29138k9823K21507K60079m9576j47926j94204
22329d41431K20114j50883J4190J11733m3861J18655J46855j37470p3955N6001
22319a80052J58225N3925J54987k7659j60352o654K6928k99474o2412J32268j37949
$$ plain form
22391 160406 41935 -76307 -270384 -233193 -116752 5529 108976 165752 233657 182922
22381 182922 140613 234750 127967 169686 415265 549566 434880 416962 211783 177849
22371 177849 302469 354806 298546 -98927 -253723 62240 228502 47559 -139937 -45604
22361 -45604 -81879 -88617 -70425 -178560 -242587 -125003 181548 175949 64555 272375 453661
22350 453661 455158 344084 445771 578793 527601 145701 -115107 -186191 -175795 -95949 -77970
22339 -77970 -206652 -72626 -172350 -501488 -531311 -309804 -49725 -99301 -247227 -441431
22329 -441431 -221317 -372200 -358010 -246277 -290138 -171483 -24628 -162098 -236053 -180052
22319 -180052 -21827 32098 187085 159426 -926 -7580 19348 -280126 -342538 -210270 -348219
22308c48219j5870J38999j58323O7400K74396j06917k23140o0526K25119M9339
22298a57742Q4207r6621j03365O3972o1909j31850j1815j33896J47719J71272
22288b30028m3465l6326L047J28794K2130O686J2818p1097j60762Q3428L10128
22277B5353O3832P2513J53905j98481n4366Q2673o6614j97360L7511P1734J10978
22266A01678J1478J9735k9235R3985o3644j4613J17481j58881k37629j56617J85132
22255a31130O009n0172l6607K13738l4791j82906j13297j08614J23258K93244
22245b1268j02235o1584j7083O189j6856J47143K05795k61412J26843j2656j67842
22234a74966k23183k0069l184k134M41J76241J11753Q4482K26682j0202m45887
$$ plain form
22308 -348219 -364089 -225090 -383413 -316013 -41617 -148534 -371674 -432200 -207081 -157742
22298 -157742 -73535 -170156 -273521 -209549 -271458 -403308 -415123 -549019 -401300 -230028
22288 -230028 -273493 -309819 -306772 -177978 -155848 -149162 -136344 -207441 -368203 -284775 25353
22277 25353 89185 161698 315603 117122 62756 145429 78815 -118545 -81034 -9300 101678
22266 101678 113156 132891 103656 197641 133997 119384 236865 77984 -159645 -316262 -131130
22255 -131130 -125121 -175293 -211900 1838 -32953 -215859 -329156 -437770 -314512 -21268
22245 -21268 -123503 -185087 -202170 -195981 -212837 -65694 140101 -121311 5532 -7124 -174966
22234 -174966 -398149 -418218 -421402 -423536 -423095 -246854 -135101 -50619 176063 165861 -280026
22223b80026l22229m6629K83934J47446k2503J66327J62566j34509J20358j18870
22213d4135k05154J69800j3564k05698Q3203M8380p6796j73480p2149R5487k8327
22202d22433L7678J73633L17152j64157j14208k17239K33670K20060K6357j93615
22192a03102K59906L00959m2065l51556j27868J10989q9823j09243J74396j04712
22182h2119J74251J91133j85342j38967O6455k34935r2310r3981M9213J91328
22172a55274q5049j70030P7011J25436P8168j21891j8247K4614Q460K39984J11825
22161A15007j16890Q5073K20394J07708r035k05268j92552M910p7976k0156J87454
22150I8669J25709j56550j6171K17043n1642k68012m3004J82259J78571P2610
$$ plain form
22223 -280026 -602255 -648884 -364950 -217504 -240007 -73680 88886 -45623 74735 -44135
22213 -44135 -249289 -79489 -93053 -298751 -215548 -167168 -243964 -417444 -489593 -394106 -422433
22202 -422433 -384755 -211122 106030 -58127 -172335 -389574 -155904 64156 90513 -103102
22192 -103102 156804 457763 415698 64142 -63726 47263 -42560 -151803 22593 -82119
22182 -82119 92132 283265 97923 -41044 25411 -209524 -301834 -395815 -346602 -155274
22172 -155274 -240323 -410353 -333342 -207906 -129738 -251629 -269876 -245262 -236802 3182 115007
22161 115007 -1883 83190 303584 411292 402257 196989 4437 9347 -68629 -88785 98669
22150 98669 224378 67828 51657 268700 217058 -50954 -93958 88301 266872 339482
22140C39482j91241p1946j00856k36538J36253l608m1717J78179Q4274J0158q4577
22129A7863Q3917n5202k70034K21747K00335k29216j00777N227N9973j39012m8848
22118b54027J15025K52693K17170J723L9374k03707o8276m08895m989J58306l0286
22107a85889K68883J7389j55698J93629J26564j58942p1842K5289k12365k68076
22097d21058n4777J01013K31202Q8683j05976j11825K41937k05232j69978O5110
22087c40901K92716R5414j81540j85284J5232N013N3289l0971K75367J81788j8003
22076A62120l23492j09324J7058K36927K19333j38985k80760j48542p5811P5926
22066c65550K22865J57852Q1262l29959n1529K80905J8051l0748p593L6903j15699
$$ plain form
22140 339482 148241 76295 -24561 -261099 -124846 -128454 -170171 8008 92282 102440 17863
22129 17863 101780 46578 -223456 -1709 198626 -30590 -131367 -126140 -66167 -205179 -254027
22118 -254027 -139002 113691 330861 332584 371958 168251 99975 -308920 -313909 -155603 -185889
22107 -185889 82994 100383 -55315 138314 264878 105936 34094 59383 -152982 -421058
22097 -421058 -475835 -374822 -143620 -54937 -160913 -272738 -30801 -236033 -406011 -340901
22087 -340901 -48185 47229 -134311 -319595 -304363 -299350 -246061 -277032 -1665 180123 162120
22076 162120 -161372 -270696 -253638 -16711 202622 63637 -217123 -365665 -441476 -365550
22066 -365550 -142685 15167 96429 -233530 -285059 -4154 13897 -16851 -24444 12459 -103240
22055a03240K17034K50558q204j21915n3706J20127Q7492K63957J26221q0400
22045F97924j72658k20702j22696l08399j20637L41199K12452J05196L5891O9841
22035E17411J0678k74279m9028J28800j68525Q122k1582r56K00197P9739J3991
22024D44568k57980j00695M8926J72116j31763l0607J73134j20921k03521m5551
22014e2294k35786m3841P6168J70396J21564j27749m451K5389p1413R1895R7281
22003D7159j10410J02061j64708j78197l284P9290q9392K92668K56509M6543k31746
21992D6493K2442J05623q2215l41294k48849K68580L08832j84372k7314J50472
21982A8398P9899J00395k35936q0532j45189L0507P8545j08437j03871l028K3856
$$ plain form
22055 -103240 113794 364352 356148 234233 180527 300654 388146 652103 778324 697924
22045 697924 525266 304564 181868 -126531 -247168 94031 306483 411679 447570 517411
22035 517411 528089 253810 204782 333582 165057 173179 151597 150641 350838 430577 444568
22024 444568 186588 85893 134819 306935 175172 144565 317699 196778 -6743 -52294
22014 -52294 -288080 -331921 -255753 -85357 36207 -91542 -95993 -70604 -142017 -50122 47159
22003 47159 -63251 38810 -125898 -304095 -307379 -228089 -317481 -24813 231696 278239 46493
21992 46493 68935 174558 92343 -248951 -497800 -229220 79612 -104760 -132074 18398
21982 18398 98297 198692 -37244 -117776 -262965 -232458 -153913 -262350 -366221 -369249 -345393
21971c45393L53807J90042j85927J51374K17386L4753r2270n9780o4140o4657
21961A35195N3048Q4084j77041j85773o5355J18413l7982n8094J61873P7750p2368
21950C3750j39593J29333P4823p6420j49350r2036M41016L00847J0245q0425k21067
21939B31123l92566k67818Q5360R4660K0596J07921n3373n9404J07110J09200
21929a7191k98078o6551K30038j25676r3967M7742R7860J14988J87362K80350
21919C56877q5312k13630m8146j03291K9162K02703K24131q2743k56322j98760
21909a75331k2092K8930m2001j54379N7761L38387j48881k46851M6332k3399o4308
21898d05832J09848K06904l5900J15490j04524j80108k4479J0076J90150j68971
$$ plain form
21971 -345393 8414 198456 12529 163903 381289 416042 323772 263992 199852 135195
21961 135195 188243 272327 95286 -90487 -155842 -37429 -75411 -133505 28368 106118 33750
21950 33750 -105843 23490 98313 21893 -127457 -219493 221523 522370 532615 452190 231123
21939 231123 -161443 -429261 -343901 -249241 -228645 -120724 -174097 -233501 -126391 -17191
21929 -17191 -315269 -381820 -151782 -277458 -371425 -323683 -225823 -110835 76527 356877
21919 356877 271565 57935 9789 -93502 -64340 138363 362494 279751 23429 -175331
21909 -175331 -197423 -168493 -210494 -364873 -307112 31275 -117606 -364457 -318125 -341524 -405832
21898 -405832 -295984 -89080 -124980 -9490 -114014 -294122 -318601 -308525 -118375 -287346
21888b87346j7684J66441K67543J2480o2213k1946l16141k5391J46755k49005
21878c86507J30949L584j52745O5880J17338m9439M5438K4664K27286K33336j54042
21867A05742q6114R4085N1538N0349o7244j83775P238o7016j31195l4201m1008
21856c01601o9414L68965L37946j55499k22482j05510J64391J50857J85670R4507
21846D47830l6720j25215k30771K4263N5700K17971O965k09977l41996J79391
21836a2559J85992j09983j0534l9035l2039K31269J31615k21755r4813J03415
21826A31573L13682j01547l36649n831J76148j13964K5201j47663j4227j02453
21816a75730J9021j9587J677o3128J79387Q9899j60263k18805j38634J48383J77227
$$ plain form
21888 -287346 -305030 -138589 128954 141434 79221 57275 -258866 -284257 -137502 -386507
21878 -386507 -255558 -251974 -404719 -338839 -221501 -270940 -225502 -200838 26448 259784 105742
21867 105742 19628 113713 165251 215600 148356 -35419 -28181 -95197 -226392 -260593 -301601
21856 -301601 -371015 -2050 335896 180397 -42085 -147595 16796 167653 353323 447830
21846 447830 411110 285895 55124 79387 135087 353058 360023 150046 -191950 -12559
21836 -12559 173433 63450 52916 13881 -18158 213111 344726 122971 28158 131573
21826 131573 445255 343708 7059 1228 177376 63412 88613 -59050 -73277 -175730
21816 -175730 -156709 -176296 -174619 -237747 -58360 31539 -128724 -347529 -486163 -337780 -160553
21805a60553J18877k7011j7759M8606p337K593j10276J9602J38699l21960o2058
21794c78577P8144j33823K28457J0917O5807L03437J10020J16293n1810k77082
21784G1783J3851K10424N2065k43379P4004o1653k15034j73528J75050L13458
21774B17041M6405j84155l6680N2813K9843K05932L34748q2247k18611j73068
21764A92021k19417L7910j64968k35910k44525r8012L16893Q954L06168J87391
21754H6505q5375l55285K345J80029j44187J54255J89396r0605j85952J89548
21744e9326L01548O0328l14765L9605J01313k63839q0260j9512j34037k34217
21734f03162K30318K63699K78171n6766q7065j90718Q8294l1850k40242L32145
$$ plain form
21805 -160553 -41676 -68687 -86446 -37840 -45177 -42584 -152860 -133258 5441 -316519 -378577
21794 -378577 -300433 -434256 -205799 -194882 -129075 174362 284382 400675 348865 71783
21784 71783 85634 296058 348123 104744 178748 117095 -97939 -271467 -96417 217041
21774 217041 263446 79291 42611 95424 125267 331199 665947 583700 365089 192021
21764 192021 -27396 10514 -154454 -390364 -634889 -732901 -416008 -407054 -100886 86505
21754 86505 1130 -354155 -351810 -171781 -315968 -161713 27683 -62922 -248874 -59326
21744 -59326 242222 302550 -12215 27390 128703 -135136 -215396 -234908 -368945 -603162
21734 -603162 -372844 -109145 169026 112260 25195 -165523 -77229 -109079 -349321 -17176
21724a7176n3043k85614o0400k0626Q6231J64438k161J75003r172J57952Q5493
21713B20925P036K78872j80250p3307j97655j08474K79717L5496j79020l0081
21703E3259j51398J24637P2488m8125j88572J76557J14078k28066k60533p9810
21693d15485J4683O8616J61348M2436K12946J08678j00114m7010J33556k00996
21683b1342J9659l0106R6915m5002l16730r3515J27755K35637j1004O1915j47143
21672a22961k120j79019J82612J65855K16102L4248r1052k99054l0971j64902
21662b91262J35165L27173Q0931j34937O3818J61943j70170j26520m9271L1054
21652B7924J46005K70118O7246l03549l32293Q7084K84033n8968m8602l9935k27076
$$ plain form
21724 -17176 -70219 -355833 -416233 -436859 -350628 -186190 -188351 -13348 -22520 135432 220925
21713 220925 227961 506833 326583 253276 55621 -52853 226864 262360 83340 53259
21703 53259 -98139 26498 98986 50861 -137711 38846 152924 -75142 -335675 -415485
21693 -415485 -400802 -332186 -170838 -128402 84544 193222 93108 46098 179654 -21342
21683 -21342 -1683 -31789 65126 20124 -296606 -390121 -262366 -26729 -37733 24182 -122961
21672 -122961 -125081 -304100 -121488 44367 260469 294717 203665 -95389 -126360 -291262
21662 -291262 -156097 171076 252007 117070 180888 342831 172661 46141 -3130 27924
21652 27924 173929 444047 511293 207744 -124549 -37465 246568 187600 138998 99063 -128013
21641a28013l9262K62366K1186q1931l6492j48888J55930J18622r7812L2511k54106
21630a95889n7158Q437J02730J16823l4394p3438K35001K35153j52083k45150
21620e9968j80136p8037L12513N33078j03310l28072J14652Q5040O7577J53416
21610E16753Q1862m7921k29348k51394j88966j23597N601J38524K79612Q9755
21600B70881K7060j2795L3674Q8322l545L1339R2698L9042l66509l57929k05650
21589c63412n3557m0475K7728J23338L32022J23437L868p4934k94840j64521L689
21578c77657k1215K76085J11930M5400k05037q7914J24508K2108J38445M2435
21568F9088m7134j66048Q2633K192k01588J08819L12465K1780n7221k24535L1681
$$ plain form
21641 -128013 -167275 95091 116277 34346 -2146 -151034 4896 123518 25706 58217 -195889
21630 -195889 -253047 -244610 -141880 -25057 -59451 -132889 102112 337265 185182 -59968
21620 -59968 -240104 -318141 -5628 527450 424140 96068 210720 295760 363337 516753
21610 516753 598615 550694 321346 69952 -119014 -242611 -237010 -98486 181126 270881
21600 270881 297941 285146 318820 407142 403597 434936 527634 566676 200167 -157762 -363412
21589 -363412 -416969 -457444 -429716 -306378 25644 149081 152949 78015 -216825 -381346 -377657
21578 -377657 -398872 -122787 -10857 34543 -170494 -258408 -133900 -111792 26653 69088
21568 69088 21954 -144094 -61461 -59269 -260857 -152038 160427 182207 124986 -99549 -67868
21557f7868l7423J66070J55799M314r3193l74878K638j929j15086L58705J34280
21546A31429k3667l5793J67973N9922M6980r7837J15215q0331j22185k36342k75452
21535c50088j9216p0476K24434n0200J05607P6137J5747J28829M229l493J85014
21524B46524q2110p5224J02503o6474j30561j12501m9136L6762Q3380k6650k52459
21513c25946l4751K3142Q9897P0602k55088j21805j85663K27080K30180l07219
21503e89571j15466Q6352J29843J72043O774j62856N9454R4738Q19K54706p7146
21492a40310n4549L5972M5021O8367r5826K8463M6179L94367K17323k79321l71576
21481a05890j63840O9728J03747J22235j53606R8534K5282r5430J73010J74322
$$ plain form
21557 -67868 -105291 60779 216578 220892 127699 -247179 -244541 -246470 -361556 -2851 131429
21546 131429 107762 71969 239942 299864 346844 249007 364222 283891 161706 -74636 -350088
21535 -350088 -369304 -439780 -215346 -265546 -159939 -83802 -68055 60774 65003 61510 246524
21524 246524 164414 89190 191693 125219 -5342 -117843 -166979 -130217 -46837 -73487 -325946
21513 -325946 -360697 -337555 -247658 -177056 -432144 -553949 -739612 -512532 -282352 -589571
21503 -589571 -705037 -618685 -488842 -316799 -310025 -472881 -413427 -318689 -317870 -63164 -140310
21492 -140310 -194859 -158887 -113866 -45499 -141325 -112862 -66683 327684 545007 265686 -105890
21481 -105890 -269730 -200002 -96255 25980 -127626 -29092 -3810 -99240 73770 248092
21471B48092J14137j46791k41338j02838j19838q4737l570j6250J31108O6148
21461a55877R4399L21920Q9883r37k15064l39856j07617r38Q8142Q3737Q1123
21450f1085j55426j99532L7128j11027L13587O466j25180J45563L7906R2819J59814
21439A41033J0604j54277j37528P8977k14081k01708J75271P5756k84344m6697
21429e56994K21904j47024p0571O8748M52884J73754N233n6533n489K04576m3560
21418B46928j67298q6076j13947J6297j14809J2564P6025J50781N793k25511j8791
21407b18044m8776l241J08541m7494M6798j39166l1482L7642k060N4874j00227
21396c42635P9092N4354p0515n656J07341j17510K08045K04285j13769k5323J03619
$$ plain form
21471 248092 362229 215438 -25900 -128738 -248576 -333313 -336883 -353133 -222025 -155877
21461 -155877 -61478 260442 350325 349388 134324 -205532 -313149 -314087 -225945 -142208 -61085
21450 -61085 -216511 -416043 -378915 -489942 -176355 -169889 -295069 -149506 -111600 -18781 141033
21439 141033 151637 -2640 -140168 -61191 -275272 -476980 -301709 -225953 -510297 -556994
21429 -556994 -335090 -482114 -552685 -483937 -31053 142701 147934 91401 85912 290488 246928
21418 246928 79630 -6446 -120393 -104096 -218905 -206341 -130316 20465 26258 -199253 -218044
21407 -218044 -266820 -270061 -161520 -209014 -162216 -301382 -332864 -295222 -297282 -242408 -342635
21396 -342635 -263543 -209189 -279704 -285360 -178019 -295529 -87484 116801 3032 -22291 81328
21385H1328j31352m6045j23510L18050p9329k16399M9326J55772j72370K42424
21375G7895K12424l00576k67657J17295J53511r296k2187Q8858J34022L9609l69311
21364a45413N9647M70467J65768j94819l12860m6317K3705p9207l4316k11570
21354c04915j09844J7144Q1643j19503Q786K67018K002k45088J11092J16712J6617
21343a58336o3323j91599J83780J80107J13090N5893N3050j2102j73835k45228
21333b58503Q8471J90399R880n7908L08701J76215j13234m87061j28297Q2489
21323a88848k31698q2902J65633l9532n3314J78898L13205L39303N4362q9840
21313C65267j86064k04239J00392K7752k52567K04168j43174o1187Q5372j07653
$$ plain form
21385 81328 -50024 -96069 -219579 98471 19142 -197257 -147931 7841 -164529 77895
21375 77895 290319 -10257 -277914 -160619 -7108 -16404 -38591 50267 184289 223898 -145413
21364 -145413 -85766 384701 550469 355650 42790 -3527 20178 -59029 -93345 -304915
21354 -304915 -414759 -397615 -315972 -435475 -426689 -159671 -157669 -402757 -291665 -174953 -158336
21343 -158336 -221659 -413258 -229478 -49371 63719 119612 172662 160560 -13275 -258503
21333 -258503 -170032 20367 30247 -27661 281040 457255 344021 -143040 -271337 -188848
21323 -188848 -420546 -503448 -337815 -377347 -430661 -251763 61442 400745 455107 365267
21313 365267 179203 -25036 75356 103108 -149459 54709 -88465 -149652 -64280 -171933
21303a71933k13495j1682P2030R8815j11339J82769K59147J65264O4739n1793
21293B82522k76098j09317M5505J95184K42602O372k36256j52362J62504r042
21283A51614Q3859K07548m4307j90572k78893m9092J65463K42966O3020J05329
21273D56935J35508K53919n4080n07958l65709N365K99691R7909J56201j78321
21263B99460n20742j6030M0345K11050K41316N2670j17281J2739J79292J31523
21253E14342l56977l44036q7298N3767L3595J11233j08771O1085K32722m3069
21243F6593M8160k11904k42621J92380R7551j46810K58334Q6292j51518K2928
21233A9385M2952o7588K5823J8066k05607j59342L5665O0203N1274R0325J67748
$$ plain form
21303 -171933 -385428 -397110 -325080 -226265 -337604 -154835 104312 269576 334315 282522
21293 282522 6424 -102893 -57388 137796 380398 386770 150514 -1848 160656 151614
21283 151614 235473 443021 398714 208142 -70751 -119843 45620 288586 351606 456935
21273 456935 592443 846362 792282 284324 -81385 -76020 223671 321580 477781 299460
21263 299460 -221282 -237312 -196967 14083 255399 308069 190788 203527 382819 514342
21253 514342 157365 -186671 -273969 -220202 -186607 -75374 -184145 -123060 109662 66593
21243 66593 114753 -97151 -339772 -147392 -49841 -196651 61683 147975 -3543 19385
21233 19385 62337 -5251 20572 38638 -166969 -326311 -290646 -230443 -179169 -88844 78904
21222G8904j8784k70200p0367j13560J55524p5793k20975J0105K66551K25173
21212c3422n7489p954O8820j4207l1373J5643O2000O4093m9277L7906J37453J35
21200A92328k42926m5667r4003J02500N1775q3773j15461J05572r322J10179J16082
21189H7284j31120j44666K62830L04974q2361l39657J14032P5830n824m1070R6964
21178A97216n8456j51511n9177o7211k96163J55729J95201o1783q3129K90483
21168F1199J05102M7645j47578K5445j21453J02341p1278R1019j62291j53965
21158b23814J6109N3773J96418L33526J34792j93341k52608J84609r7269p9767
21148G2428k790K00989N4101j72528K8898j04919L52741J27845n4830j78631j31323
$$ plain form
21222 78904 60120 -210080 -280447 -394007 -238483 -314276 -535251 -525146 -258595 -33422
21212 -33422 -90911 -98865 -30045 -44252 -75625 -59982 2018 66111 16834 54740 192193 192328
21200 192328 -50598 -96265 -190268 -87768 -35993 -119766 -235227 -129655 -138977 -28798 87284
21189 87284 -43836 -188502 74328 379302 296941 -42716 71316 147146 141322 100252 197216
21178 197216 138760 -12751 -71928 -139139 -435302 -279573 -84372 -146155 -229284 61199
21168 61199 166301 213946 66368 91813 -29640 72701 1423 92442 -69849 -223814
21158 -223814 -207705 -153932 42486 376012 510804 317463 64855 249464 152195 72428
21148 72428 69638 270627 324728 152200 181098 76179 428920 556765 501935 323304 191981
21137A91981n9965j42131o8759j49105k08331N983J79613J6263m1625K2960Q6301
21126a66815k9101j75632j26266P1083J00842j33548n9737O5622K67795N0592
21116a35165J45788n2010q9413p6288k1690O8107k0331L5210J8586l2416J56488
21105c134m0351R2074N3180n8452K61501o286j02628j30782j03226J4883K7456
21094D235l7226Q3078Q2277J22187j54771k21687L0418N3575o3637N6980j85574
21083b30145Q2491R8417n7820J82215K00493l5098M9610L5273k50572o6486R9964
21072A08342M7806j03556Q4981p3913j23781l0157J19896L2545N7604j38330j55483
21061a74046J53679K03623L1732j19818j80883J53529j3043j28749j96021k55986
$$ plain form
21137 191981 132016 -10115 -78874 -227979 -436310 -430327 -250714 -234451 -276076 -253116 -166815
21126 -166815 -195916 -371548 -497814 -426731 -325889 -459437 -519174 -453552 -185757 -135165
21116 -135165 10623 -41387 -130800 -207088 -228778 -160671 -181002 -145792 -127206 -159622 -3134
21105 -3134 -43485 48589 101769 43317 304818 298532 195904 65122 -38104 -23221 4235
21094 4235 -32991 50087 132364 254551 99780 -121907 -91489 -37914 -101551 -44571 -230145
21083 -230145 -147654 -49237 -107057 75158 275651 240553 290163 325436 74864 8378 108342
21072 108342 156148 52592 137573 63660 -60121 -90278 29618 62163 119767 -18563 -174046
21061 -174046 -20367 183256 214988 95170 -85713 67816 54773 -73976 -269997 -525983
21051e25983j84419P898L57310K44316L26163N1200j74109j28358J17544k07604
21041a16042j05933O9763J09582j402q8082p9011O3536o813J16801J04249j00344
21030c3696j09704j15919R7884J41590Q4775j13757l52376j52793K75473L12045
21020C3522K58959L8394j419l7748m4591j9319R4787k4526j39421J45015k7873
21009B75780K2225j21692k2157j12865L00111K3240q3278o4923J63005J548L7764
20998D18758j41007j14874J57948K92497L00185K35632K36226P1308r1025k76073
20988A089575l57169k04894k50700j51895K7304L0732n8284K41304J01656k38429
20978B29200M5336J75749r9546J1580K07671M7223J92571k8030Q6703K78316L94412
$$ plain form
21051 -525983 -710402 -702504 -345194 -100878 225285 276485 102376 -25982 91562 -116042
21041 -116042 -221975 -152212 -42630 -44032 -132114 -211125 -147589 -154402 -37601 66648 -33696
21030 -33696 -143400 -259319 -161435 -19845 64930 -48827 -401203 -553996 -278523 33522
21020 33522 292481 330875 329456 291708 247117 227798 322585 298059 158638 303653 275780
21009 275780 298005 176313 154156 41291 341402 364642 281364 216441 379446 380994 418758
20998 418758 277751 162877 320825 613322 913507 1149139 1385365 1456673 1365648 1089575
20988 1089575 732406 527512 276812 124917 152221 182953 124669 365973 467629 229200
20978 229200 274536 450285 350739 362319 569990 617213 809784 781754 868457 1146773 1541185
20967A541185k30614l06214l23009j41583K1332j3260k02563j12942K9847R646
20957B71825J11613J68842j22630j76204l2440Q1285J95193K68855j65000k2402
20947E78937j31931j11840J12704J57367m8310j71310j64275j74136J03540M3067
20937A93813q4141Q4172n2097l07057J50878J87957k69481L2534R638J04914O004
20926E7134p0628N9844O007j12571J44783k3254m5242J88404j01139j15037K4682
20915A2983l3805j26407Q8792j9301j1523Q0256K85344r661j87855q1912o698
20904i787j06558K60614M17386p8210l06480k61806k8904P4975J897K51089K06662
20893D20878J26325N519P5097M9029K51116K97806K08498R0594J5535j7909j07601
$$ plain form
20967 1541185 1310571 1004357 681348 539765 561097 547837 345274 232332 262179 271825
20957 271825 383438 552280 429650 253446 221006 302291 497484 766339 601339 578937
20947 578937 447006 335166 447870 605237 556927 385617 221342 47206 150746 193813
20937 193813 109672 193844 141747 -165310 -14432 173525 -95956 -63422 -53784 51130 57134
20926 57134 -13494 46350 52357 -60214 84569 61315 16073 204477 103338 -11699 12983
20915 12983 -20822 -147229 -58437 -77738 -89261 -9005 276339 266678 78823 -3089 -9787
20904 -9787 -116345 144269 561655 483445 176965 -84841 -113745 -38770 -36873 214216 420878
20893 420878 547203 552722 627819 676848 927964 1225770 1434268 1524862 1540397 1522488 1414887
20882A414887n9363m8437j93148j96377J18289J35051j80754l3709J81943J15153
20872A253535j74066O8696J06733K9272L66467L81617m3887k03988m07897k28360
20862A148122k87052k0237n0349j97043l46730r9437K44950J60755J12819j68959
20852D96839J23543L75147K76680R0787l5467R5809k28591j17774k26j57756P4479
20841I93470k69054l33274o2873P1338m6834R542R9534J79393J98553Q5755J51307
20830A076857J15175j02894K22949P7645J81439j24726n10332m00300j69263l0026
20820C36524J16146j71988k70071r9048K24190Q8661m0738r8715L6487j23707
20810b259J28462Q4325Q4850r6470L6483k36375k07995j07804p60R0387K02450
$$ plain form
20882 1414887 1355524 1307087 1113939 917562 1035851 1170902 990148 956439 1138382 1253535
20872 1253535 1079469 1148165 1254898 1284170 1650637 2032254 1988367 1784379 1376482 1148122
20862 1148122 861070 840833 790484 593441 246711 147274 392224 552979 665798 496839
20852 496839 620382 995529 1272209 1362996 1327529 1423338 1194747 1076973 1076747 918991 993470
20841 993470 724416 391142 328269 399607 352773 362315 461849 641242 839795 925550 1076857
20830 1076857 1192032 1089138 1312087 1389732 1571171 1446445 936113 535813 366550 336524
20820 336524 452670 280682 10611 -88437 135753 224414 183676 84961 121448 -2259
20810 -2259 126203 210528 295378 198908 235391 -984 -208979 -316783 -317543 -227156 -24706
20799b4706j2828O3450k0915l4252L0622K13509K48095J81895j31843j55820j99032
20788A58175k4708M0450q4224p3595J20504K1108J47475P5826j43296j80431q1895
20777b4611Q3143J24869m3941p7139j6472q3881j55405k05715L7379L77794P3222
20766H9243R7038k27796j72304L64p4219k4100J49906k0331J05051m6380q7792
20755b11320J48591J72130Q9298J01225m9384j59166l4571j49698j51599J81596
20745f2898l9222L0211m8178M5394J08338k8356l9766J78419K22679k14464q8986
20734F3171j00353n4449o8858R2575K06960l2162Q6666O3035k2658j03648K0530
20723A50809K63032K27555j54397j29625N5133n7r3582j64840l0270M1546j35535
$$ plain form
20799 -24706 -37534 25916 5001 -29251 1371 214880 462975 644870 513027 357207 158175
20788 158175 133467 173917 89693 16098 136602 157710 305185 381011 237715 57284 -24611
20777 -24611 58532 183401 139460 62321 45849 -38032 -193437 -399152 -361773 16021 89243
20766 89243 186281 -41515 -213819 -213455 -287674 -311774 -161868 -182199 -77148 -123528 -211320
20755 -211320 -62729 109401 198699 299924 250540 91374 56803 -92895 -244494 -62898
20745 -62898 -102120 -71909 -120087 -74693 33645 5289 -34477 143942 366621 152157 63171
20734 63171 -37182 -91631 -160489 -67914 139046 106884 193550 256585 233927 130279 150809
20723 150809 413841 641396 486999 357374 412507 412450 318868 154028 123758 165304 29769
20712B9769N6268P1867P5757j33196J36598J68258n8378O9129q4750j23183P8653
20701B86792K46304j48727J1655j15593K8207J22479p2581m0238m3171j38575
20691A36552m9641n0848J64242J95098l7139J09077K8388j14508k20731Q9604
20681B50094J56011J09138n1922k00872j34058m1711l5258M6304K4897j06096
20671A6527J39600K22007L67803O7371j17501n8190j13215j13420j7822k62189
20661A30971O1121K6187J91207k0686q1841J09385l5889r637j11002J444j12223
20650A49037j80493J59578k30194J45790J19613k43718K3738J62670N6624L0185
20640A92830J66910n488J94821j854l19672q6407J33423J9147m624k7325o8964
$$ plain form
20712 29769 86037 157904 233661 100465 237063 405321 346943 416072 331322 208139 286792
20701 286792 533096 384369 396024 280431 308638 431117 358536 318298 275127 136552
20691 136552 86911 36063 200305 395403 358264 467341 495729 381221 160490 250094
20681 250094 406105 515243 463321 262449 128391 86680 51422 97726 122623 16527
20671 16527 156127 378134 745937 813308 695807 637617 524402 410982 393160 130971
20661 130971 192092 218279 409486 388800 306959 416344 380455 370818 259816 261260 149037
20650 149037 -31456 128122 -102072 43718 163331 -80387 -56649 106021 162645 192830
20640 192830 359740 354252 549073 547219 227547 141140 274563 293710 289086 261761 192797
20629A92797M3986K16861J05531M0151J19316l7804J13483J8899J09894p2149
20619H50965l314R5531j07851j93483L72489M56376J2369k9610J01858L4586r3143
20608A496773J76399M2154k2289J08102n8762k9400q8545r2669n616J54032M2824
20597A723003l65344j68006J72725K5326q3229p8555m210K41200K58821J45494
20587A867225N473j94678k58356l54191j05547J91552j44599p0272k64386k01403
20577D70818M6602J9768J13589J48172j19794l6686J06579m3072m0180n8579p7951
20566E29266l4048j57602J78173k2053K52997J52655m3770J62731L1847Q4972
20556A135168k54415l40094j80040J87681R7745K9458J44535J89335j26298n6676
$$ plain form
20629 192797 236783 453644 559175 599326 718642 680838 794321 813220 923114 850965
20619 850965 847651 943182 835331 641848 1014337 1470713 1483082 1453472 1555330 1589916 1496773
20608 1496773 1673172 1715326 1693037 1801139 1742377 1712977 1624432 1531763 1526147 1680179 1723003
20597 1723003 1357659 1189653 1362378 1387704 1304475 1225920 1221710 1462910 1721731 1867225
20587 1867225 1872698 1678020 1419664 1065473 959926 1151478 1006879 936607 672221 470818
20577 470818 517420 537188 650777 798949 679155 642469 749048 705976 665796 607217 529266
20566 529266 495218 337616 515789 493736 746733 899388 855618 1018349 1050196 1135168
20556 1135168 880753 540659 360619 548300 646045 675503 820038 1009373 883075 826399
20546H26399k1486l63572K821j0405J36475O4902M5500o1101q4937j1720j16515
20535D06361j47410j64176j67196M0000J72112K5688K26027M7208k59150J717
20525A81181J54798K17576j76467o5827K28043K11853k28733k80668L5087K89073
20515E65916K16145j90489k9077r6070j84215j03855M5839j5584j1947N6577N7746
20504C10986K94854L8230k02448J19300J92459j32549j07544J47677m1245J56675
20494G76395M5305N7159J32843l5902N567o9319J05064N2225r4967R8911J56839
20483A230120Q7980N6165j58357k2065k04934M8156J5394l30791r4352J09588
20473G36904K23588J95167n1011j7547K7321M8855p3710K30408J89917k736P36
$$ plain form
20546 826399 804913 441341 444162 433757 570232 635134 680634 619533 534596 522876 406361
20535 406361 258951 94775 -72421 -32421 139691 165379 391406 438614 179464 181181
20525 181181 335979 553555 377088 311261 539304 751157 522424 241756 276843 565916
20515 565916 782061 591572 562495 466425 282210 178355 224194 208610 196663 253240 310986
20504 310986 605840 644070 441622 560922 753381 620832 513288 660965 619720 776395
20494 776395 821700 878859 1011702 975800 981367 912048 1017112 1069337 974370 1073281 1230120
20483 1230120 1318100 1374265 1215908 1193843 988909 1037065 1052459 721668 627316 736904
20473 736904 960492 1155659 1104648 1087101 1114422 1163277 1089567 1319975 1509892 1507156 1507892
20462A507892N7602k2642m20194k18579j004j0513O5784m8121j85376K23960J97908
20451A146717K6548j8006J92529O2312k18502q8931j09132R0790P0107j31343
20441A023089r5323M7102p1976k38491Q3191k0825K02112K09063k57285N363K34904
20430A120924K77312N1059j34065J7698k16521L3342N4514K58543J77442k81354
20420A358894k45257J01945K56392j00970K21146O3593R0654j16479K0713o6075
20410A584556j24536K65354L18013l7696k97438k6759J45847J63313K4787Q0362
20400B095803J70354J61901J25662J9884J3701k24436j3558J38139O8559L10314
20390B866323L3457j02723K18521N19566K92555j3231K95923M13914L33396L51840
$$ plain form
20462 1507892 1565494 1542852 1122658 904079 903075 892562 958346 910225 724849 948809 1146717
20451 1146717 1173265 1155259 1347788 1410100 1191598 1102667 993535 1084325 1154432 1023089
20441 1023089 927766 974868 902892 664401 747592 726767 928879 1137942 880657 886020 1120924
20430 1120924 1398236 1449295 1315230 1332928 1116407 1149749 1204263 1462806 1640248 1358894
20420 1358894 1113637 1215582 1471974 1371004 1592150 1655743 1746397 1629918 1650631 1584556
20410 1584556 1460020 1725374 2043387 2005691 1708253 1681494 1827341 1990654 2015441 2095803
20400 2095803 2266157 2428058 2553720 2573604 2587305 2362869 2349311 2487450 2556009 2866323
20390 2866323 2899780 2797057 3015578 3535144 3827699 3814468 4110391 4524305 4857701 5209541
20380E209541M31372P36144J097983J258253J262943J053772Q86227J216315J158261
20371A4310811J394397J409782J916879J920332K351698L199692M560202O786198
20363C7849991J0454056J4884704K0726059K7380992L5384453L9745190L8689079
20356B25114524L7565013L1099137J9083603P236386j0690048k2880954k8324313
20349B58203348l6332071l4235086k4934211j4445615k526929Q753436J9398649
20342A73881521K9903546L7433911L8429439L7431377L0987689J7578479N282877
20335C70928839j3285123k9602635l5986970m5463897m7310679l9761297l0849560
20328A28668678k2239970j5197684j0745709p681536o022976m522498l566392
$$ plain form
20380 5209541 5640913 6377057 7475040 8733293 9996236 11050008 11936235 13152550 14310811
20371 14310811 15705208 17114990 19031869 20952201 23303899 26503591 31063793 37849991
20363 37849991 48304047 63188751 83914810 111295802 146680255 186425445 225114524
20356 225114524 262679537 293778674 312862277 320098663 309408615 286527661 258203348
20349 258203348 221871277 187636191 162701980 148256365 145729436 154482872 173881521
20342 173881521 203785067 241218978 279648417 317079794 348067483 365645962 370928839
20335 370928839 357643716 328041081 292054111 246590214 199279535 159518238 128668678
20328 128668678 106428708 91231024 80485315 72803779 66780803 62258305 58691913
20321E8691913l149155k296347k156172k207847k093224j962548k077057j984211
20313D0765352k272853k075459k081592j939336j407457j207754j269406j007988
20305B7503507r48026r20391p05717o99004q78680q62837n17545o07451m90551
20296B0873305n73644p63672m84583p09816m81596l07200m62385m90630n68562
20287A6031217m91227n33947m20551j77358j45564l43331k93816m70864n73285
20278A2581274m88309k09700l27394k85661k65922m20478m87796m18945k56713
20269I420356j89313j55931j07110j82715l25933k72218q4378r6767p8456m45197
20259G482338k1940l3385l15185m9484j03704l76683k78619k33367j79496R9256
$$ plain form
20321 58691913 55542758 53246411 51090239 48882392 46789168 44826620 42749563 40765352
20313 40765352 38492499 36417040 34335448 32396112 30988655 29780901 28511495 27503507
20305 27503507 26555481 25635090 24929373 24230369 23351689 22488852 21971307 21363856 20873305
20296 20873305 20299661 19535989 19051406 18341590 17859994 17552794 17090409 16599779 16031217
20287 16031217 15539990 15006043 14585492 14408134 14262570 13919239 13625423 13154559 12581274
20278 12581274 12092965 11883265 11555871 11270210 11004288 10583810 10096014 9677069 9420356
20269 9420356 9231043 9075112 8968002 8785287 8459354 8187136 8102758 8005991 7927535 7482338
20259 7482338 7460398 7427013 7111828 7062344 6958640 6581957 6303338 6069971 5890475 5989731
20249E989731j89387n11601j85314p2386l0620J12655L7066k38680j88155j91633
20239D531676J27516K1640p8679m80263p4888K9578j75906N9064J00891k15517
20229C845112j50388k02336j39630j84560O981l4015m5541k99571j48419k887
20219B644746K52175P8381K8395j3409j33635j24169L8893J9477j27745j31519
20209B531590M4343k62359m66402j68039J8585l9241K7214j23178L3341k17982
20199A377872P8431J44615J4432J36840l3323k70159K0061J45223J21813j49683
20189A586122p9341J13163J1465R3362Q7584Q2810m56904j02867J71413l1806
20179A475001r573K22164K42559j05281k55166r4096R6552J04536p5825j22312
$$ plain form
20249 5989731 5800344 5288743 5103429 5031043 5000423 5113078 5150144 4911464 4723309 4531676
20239 4531676 4659192 4680832 4602153 4121890 4047002 4076580 3900674 3959738 4060629 3845112
20229 3845112 3694724 3492388 3352758 3168198 3175179 3141164 3095623 2796052 2647633 2644746
20219 2644746 2896921 2975302 3003697 2990288 2856653 2732484 2771377 2790854 2663109 2531590
20209 2531590 2575933 2313574 1847172 1679133 1697718 1658477 1685691 1562513 1595854 1377872
20199 1377872 1456303 1600918 1615350 1752190 1718867 1448708 1468769 1613992 1735805 1586122
20189 1586122 1506781 1619944 1631409 1724771 1812355 1895165 1438261 1335394 1506807 1475001
20179 1475001 1465428 1687592 1930151 1824870 1569704 1475608 1572160 1676696 1600871 1478559
20169A478559J15520K65462J90585p5387l27707j55457n8842M1929L15317M6404
20159A836383j41182o2575R2891J64351J46322J59942k862k30794j67214P3206
20149A868468L9038J96314j25987j99861j74957p4146p7992j4734P6281L02788
20139A815212j32818k29845R384r2234J50840J54220j85996O8716l3565k42207
20129A281707L2344r0301K16584n2808k28763o5787R3470j18404l4907J09334
20119A142469j61013j43954Q0377J18833J59079J82923R9712m2242j83607K78673
20109A531250p2502m3131L44751p6303j60908j29758N3338N2298j33203k5773
20099A340059K51807k2767k37799m4563J05726K39942j01374j71516p7676L34959
$$ plain form
20169 1478559 1594079 1859541 2050126 1974739 1647032 1491575 1432733 1474662 1789979 1836383
20159 1836383 1695201 1632626 1725517 1889868 2036190 2196132 2193270 1962476 1795262 1868468
20149 1868468 1907506 2103820 1977833 1777972 1603015 1528869 1450877 1436143 1512424 1815212
20139 1815212 1682394 1452549 1461933 1369699 1520539 1674759 1488763 1557479 1523914 1281707
20129 1281707 1314051 1223750 1440334 1387526 1158763 1092976 1186446 1068042 1033135 1142469
20119 1142469 981456 837502 917879 1036712 1195791 1378714 1478426 1436184 1252577 1531250
20109 1531250 1458748 1415617 1760368 1684065 1523157 1393399 1446737 1499035 1365832 1340059
20099 1340059 1591866 1569099 1331300 1286737 1392463 1632405 1531031 1359515 1281839 1616798
20089A616798J22122l82869K8091K24800J67235L09395K77831Q9460R4586k84236
20079B263213q4493m3189J6198l1301K25538J88971m6220Q2546J59316K08379
20069B938958L20891K5658l9064L49640L68885R87J0930O78981P79743L32513
20059E768122J09811K78696O04769J053436Q87023P15684P65374J126984Q34087
20050A2143986R70343J514873K021364K314792L306078M129273N715838P803979
20042C9920526R732635J0157834R808190J0697572J2772271J5849492J8970552
20035A27909072J9474826J6506539J2831365J3111663J5737925J6821394J2570867
20028B34963651K775318k533123n87492M958118R117496Q022285M70117r770554
$$ plain form
20089 1616798 1738920 1356051 1384142 1608942 1776177 2085572 2363403 2452863 2547449 2263213
20079 2263213 2178720 2135531 2151729 2120428 2345966 2534937 2488717 2571263 2730579 2938958
20069 2938958 3259849 3285507 3246443 3596083 3964968 3965955 3976885 4655866 5435609 5768122
20059 5768122 5877933 6156629 6761398 7814834 8701857 9417541 10182915 11309899 12143986
20050 12143986 13114329 14629202 16650566 18965358 22271436 26400709 32116547 39920526
20042 39920526 49653161 59810995 69619185 80316757 93089028 108938520 127909072
20035 127909072 147383898 163890437 176721802 189833465 205571390 222392784 234963651
20028 234963651 237738969 235205846 234618354 239576472 248693968 256716253 257186370 247415816
20020B47415816j0225241k916821L565837M582671J592242J12288R32664K980500
20012B48039956K260445m946254j0795154j0718594o903009l104163k449931p638580
20004B03744716j8373972k2784418j9065455j4248428j0940267r787216j0001601
19997I8543359j0665950j0300913q699982o839782n045879l970098l630061k930979
19989D6459715k560964k327318j963046j693153j617378j463101j506006j397339
19981C1931410j047987j165199j084058j013285j149764q19151n44917p38064
19973B4368985j096855j224521q06980o56793o43851o76412m65768l69327l93835
19964A8034643n46606n72807o88931n13308k06859l98824m19638l46041m37067
$$ plain form
20020 247415816 237190575 234273754 237839591 242422262 244014504 244126792 245059456 248039956
20012 248039956 250300401 245354147 234558993 223840399 216937390 213833227 211383296 203744716
20004 203744716 185370744 162586326 143520871 129272443 118332176 108544960 98543359
19997 98543359 87877409 77576496 68876514 62036732 56990853 53020755 49390694 46459715
19989 46459715 43898751 41571433 39608387 37915234 36297856 34834755 33328749 31931410
19981 31931410 30883423 29718224 28634166 27620881 26471117 25651966 25107049 24368985
19973 24368985 23272130 22047609 21240629 20583836 19939985 19263573 18797805 18428478 18034643
19964 18034643 17488037 16915230 16226299 15712991 15506132 15107308 14687670 14341629 13904562
19955A3904562l76966l27255m33401n18842l67813j66137k60807j21995m92095
19946A0839251m44727k76950k90546m29722l42074k33680r2521k63396l84245
19937H081390l44519N5566j03813l58956l51321j74742k4603j20313N0066j931
19927F706824k50466j96308m7714k22828k79188n0702j68633k63262J71398k18184
19917E180937l27268k82599j03632R9290p3880k46964j24465k73133J08658J60427
19907D117371l9695q5879j70124p5983j71833j31227O8001J77163j21165p9021
19897C487608l99621m01819P3294J71449o3669K2949j31315j96117j1516P3235
19887B624478p0772k10406j44451J0898L7837J9584J44730j88331p3563J74910
$$ plain form
19955 13904562 13527596 13200341 12766940 12248098 11880285 11714148 11453341 11331346 10839251
19946 10839251 10394524 10117574 9827028 9397306 9055232 8821552 8729031 8465635 8081390
19937 8081390 7736871 7792437 7688624 7329668 6978347 6803605 6779002 6658689 6708755 6706824
19927 6706824 6456358 6260050 6212336 5989508 5710320 5659618 5490985 5227723 5399121 5180937
19917 5180937 4853669 4571070 4467438 4566728 4492848 4245884 4121419 3848286 3956944 4117371
19907 4117371 4077676 3991797 3821673 3745690 3573857 3442630 3510631 3687794 3566629 3487608
19897 3487608 3087987 2686168 2759462 2930911 2867242 2890191 2758876 2562759 2551243 2624478
19887 2624478 2553706 2343300 2198849 2209747 2247584 2267168 2411898 2223567 2150004 2324914
19877B324914J2374m3720j30264j54669p3603j73577j34032j07205J06108J98020
19867A824346O648k15248l2033J04500r2174L4909P9928j487j0364j56835J11405
19856A653595N1231j89701j03843L4261k03129j73562m4570R5582K18178N7392
19846A395434j54830k3044J3410k48365j6444n7N6040k82792j52583J9944J06877
19835G13590k06304K861K84986O2873j89949l4152m5711j31621k8110j04565J89659
19824E13557K48014J32632K04569K69110K71541J66170L65624K92759j27239N7910
19814B394647R8362k96867J04486k09223k97249p492q7723j38465j51029J69922
19804A579369J24386j22871P5314K71628p1234l0853M793j55057Q9727k52831
$$ plain form
19877 2324914 2337288 2293568 2163304 2008635 1935032 1761455 1627423 1520218 1626326 1824346
19867 1824346 1830994 1615746 1583713 1688213 1596039 1630948 1710876 1709389 1699025 1542190 1653595
19856 1653595 1704826 1515125 1411282 1445543 1242414 1068852 1024282 1119864 1338042 1395434
19846 1395434 1240604 1217560 1230970 982605 966161 966104 1022144 739352 586769 606713 713590
19835 713590 507286 510147 795133 858006 668057 633905 588194 456573 428463 323898 513557
19824 513557 761571 894203 1098772 1367882 1639423 1805593 2171217 2463976 2336737 2394647
19814 2394647 2493009 2196142 2300628 2091405 1794156 1786664 1698941 1560476 1409447 1579369
19804 1579369 1703755 1580884 1656198 1927826 1856592 1825739 1830532 1675475 1765202 1512371
19794A512371q8965k00804k88200k63j90462j1439L54383M8214r9281l18429j00400
19783F16725L3821M5747J6491q1251M7691j00145q5156J77636J37789J66183K2259
19772I97790k57682m10183j27082o8787N9458P0556j45586O0330L47303J81732
19762G07849J65651m7386m03943j49502N4828K2987k11780j27529J6272J39395
19752A66842q9950j10652N2392J11693K35401J4475k14222j99941J30687L44806
19742D41531k566m8044q5313J29082O5777j42742k09566l18929M1968L89J2100
19731a16313L5232M2138q8756J8974J53648O8036j0354j99161l51149L09902K57120
19720A19317k15106R8323L4345P54J01630l18996j53632p2958J62043K96414L09959
$$ plain form
19794 1512371 1423406 1222602 934402 934139 743677 732238 1086621 1134835 1035554 717125 616725
19783 616725 650546 696293 712784 631533 679224 579079 493923 671559 809348 975531 997790
19772 997790 740108 329925 202843 134056 193514 264070 118484 178814 526117 707849
19762 707849 873500 826114 422171 272669 327497 350484 138704 11175 27447 166842
19752 166842 76892 -33760 18632 130325 365726 380201 165979 -33962 96725 441531
19742 441531 438965 390921 305608 434690 500467 357725 148159 -170770 -128802 -128413 -116313
19731 -116313 -81081 -38943 -127699 -108725 44923 112959 102605 -96556 -447705 -137803 119317
19720 119317 -95789 2534 36879 37633 139263 -179733 -333365 -406323 -244280 52134 362093
19709C62093j24342Q1091K09415j90157j82837k3278J6505J51287j23748j90548
19699a4519n1405O9779O6619K9213k39155k98943J62725R0794P4482R4109O7o9113
19687h5347j67539k0994J19892o1830m501R707J4004R0163k2312J57637K97196
19676C26076l18085j98334K5434k84570J09097K32622J46442P9614o7893k0334
19666C0069k65005m4259J51702N192l272j46746K56806J87419k02863k01257J05873
19655a26341j8267q820R8903j50206j73074P5895P0447L02619j36455k2636K26422
19644A38487L65141N3767l45372j15888P5186J45815q2399l8894j62303r319r4625
19633g0404k1531L5692r300J00032m9291k20707J35117k5369Q575J7977K3234
$$ plain form
19709 362093 237751 318842 528257 338100 155263 131985 148490 299777 176029 -14519
19699 -14519 -65924 3855 70474 99687 -139468 -438411 -275686 -184892 -110410 -16301 -16234 -85347
19687 -85347 -252886 -273880 -153988 -215818 -220319 -210612 -196608 -106445 -128757 28880 326076
19676 326076 7991 -190343 -164909 -449479 -340382 -107760 38682 118296 50403 30069
19666 30069 -234936 -279195 -127493 -122301 -125573 -272319 -15513 171906 -30957 -232214 -126341
19655 -126341 -144608 -153428 -54525 -204731 -377805 -301910 -231463 71156 -65299 -87935 138487
19644 138487 503628 557395 212023 96135 171321 317136 234737 195843 33540 24221 -70404
19633 -70404 -91935 -56243 -65543 34489 -14802 -235509 -100392 -125761 -117186 -99209 -75975
19622g5975K5456K81385k33073k02274k96253m9505O0669M21119J75752J11527
19612B18828m7193l3227j50195j4073J28876J05597P0732J20700N7704p8935L671
19601C82485l67788n2815L39826K42693r823j13208m25792j77090P8823J80250
19591G7561j0372l2820J44483l5684k38462P6120J67047q1856k88587J25069M5515
19580e1986K5495K47768K55995J1425j29553K13181J65136l2747j39023J11899
19570F77590j76991k08336l9448K1614j39874q8702l8716n4426n0513L0594j28880
19559a96088J00724L25846J38912j1518j51283j10595J47032l026J07755m5947
19549C01812j0315j92529K00729j81199N6408k9992K42741R8359j52445J11712
$$ plain form
19622 -75975 -50519 230866 -2207 -204481 -500734 -550239 -489570 -68451 107301 218828
19612 218828 171635 138408 -11787 -25860 103016 208613 279345 400045 457749 378814 382485
19601 382485 14697 -38118 301708 544401 534578 421370 -4422 -181512 -102689 77561
19591 77561 67189 34369 178852 143168 -95294 -19174 147873 66017 -222570 -97501 -51986
19580 -51986 -26491 221277 477272 488697 359144 572325 737461 704714 565691 677590
19570 677590 500599 292263 252815 274429 134555 45853 7137 -47289 -97802 -67208 -196088
19559 -196088 -95364 230482 369394 357876 206593 95998 243030 240004 347759 301812
19549 301812 291497 98968 299697 118498 174906 144914 387655 486014 333569 445281
19539D45281K9556j35242j3964m1345l9453J08819L7843k11838j2474j80493m0386
19528e3696J69083k65956o5103J37865K62063l6528n6957K4562j09304j95989
19518a89960o6441R597J54488J16863J90503j1599j03908M1980k9170j26249L12765
19507B98869M6546j52755J3788J52980K58631J57508K81187N8513m5973Q1611
19497A150905n8024n0217P5556j92091j19186k11961m22651K1208J35346L17486
19487F46371q6216J02742j31811P7086J73144k0525k05662j08355k64413n3764
19477A28597P3759m7821j76981j630K47679M7030l7297j73341j68493J0834R5405
19466b259R4499p6106Q192r4972l1418J8882J18722R9052J5657k7159j10821q9347
$$ plain form
19539 445281 474837 339595 325631 284286 244833 353652 391495 179657 167183 -13310 -53696
19528 -53696 115387 -150569 -215672 -77807 184256 147728 90771 115333 6029 -189960
19518 -189960 -256401 -246804 -92316 24547 215050 203451 99543 141523 112353 -13896 298869
19507 298869 345415 192660 206448 359428 618059 775567 1056754 1115267 1069294 1150905
19497 1150905 1092881 1042664 1118220 926129 806943 594982 172331 193539 328885 646371
19487 646371 560155 662897 531086 608172 781316 760791 555129 446774 182361 128597
19477 128597 202356 154535 -22446 -24076 223603 270633 233336 59995 -108498 -97664 -2259
19466 -2259 92240 16134 24326 -70646 -102064 -83182 35540 134592 150249 123090 12269 -77078
19454g7078Q7284n3971J63600j2753N8714J71350J51554n0688K26188l2572K0546
19443F52174m6198j78311Q1649M75556K46434k9490j50423N1492J74081J00543
19433A377507l6278r1885j42898J18815K94387n0737o1427O7628j51700N1308
19423A374720o8604O6316J14428M5274K3108k66479n6533R650L2391j88846k03640
19412H81785j92009j01893J80013r2296o8814J97353R9480l81019l44134R3502
19402B71968M6103J33474K92322o5476m27745L6294K32171j15899j86405j1169
19392B05638J2914j03145N3137j73383o2624k03326k54845J76010K81747M7061
19382b0816J69058K02947P781K7037J62903l2055k74887j79836l0519j1814L7956
$$ plain form
19454 -77078 10206 -43765 119835 107082 165796 337146 488700 438012 664200 631628 652174
19443 652174 605976 427665 509314 984870 1231304 1201814 1051391 1102883 1276964 1377507
19433 1377507 1341229 1249344 1106446 1225261 1519648 1468911 1407484 1475112 1323412 1374720
19423 1374720 1306116 1372432 1486860 1532134 1555242 1288763 1232230 1241880 1274271 1085425 881785
19412 881785 689776 587883 767896 675600 606786 804139 903619 522600 178466 271968
19402 271968 318071 451545 743867 678391 250646 286940 519111 403212 216807 205638
19392 205638 218552 115407 168544 -4839 -67463 -270789 -525634 -349624 -67877 -20816
19382 -20816 148242 351189 358970 386007 548910 516855 241968 62132 31613 19799 57755
19371E7755j51440L6536k4801J02091J03945K9516L049j21523Q3482j78191j44921
19360b04502P5121Q545N0810k876k99607j58418O2997J23738P728J80885K27340
19349G1761L1956j4251J91735K76403j91480m12102j09178M5952p270K37214J57519
19338B78259k47715p5606m9000K7338p0958Q3989j07521J5844J57924J22938L0527
19327A66019j51590r0384j11241j9361J22313q0082k1822J48449J19029r5110
19317a3780j46912k02356j7374K3058L07339j34195j38693K44472K17160J46399
19307B85118Q996k97061q6846m6967j61108j34441q5781K58196L14293K32102
19297B86501J93934j48020j50939q7495o634O7426j67899j58461J77481n3360
$$ plain form
19371 57755 -93685 -57149 -81950 20141 124086 153602 156651 35128 118610 -59581 -204502
19360 -204502 -129381 -120836 -70026 -72902 -372509 -530927 -467930 -344192 -336464 -155579 71761
19349 71761 103717 89466 281201 557604 366124 -45978 -155156 -109204 -116474 120740 278259
19338 278259 30544 -45062 -94062 -66724 -137682 -53693 -161214 -145370 12554 135492 166019
19327 166019 14429 -75955 -187196 -206557 -84244 -164326 -186148 -37699 81330 -13780
19317 -13780 -160692 -363048 -380422 -357364 -50025 -184220 -322913 -78441 138719 285118
19307 285118 294114 -2947 -89793 -136760 -297868 -432309 -518090 -259894 54399 286501
19297 286501 480435 332415 181476 93981 87347 154773 -13126 -171587 5894 -47466
19287d7466P5546n0238j20850K332J29523J50999k26020K10412J02342q2063J09647
19276B54164J47913r3868j49441j75261l35975J7005j11283O5408L10451J81165
19266A10278j70541j18357q5941j76216j92276q5397K2396m884K65427K06694
19256b28817j60900j04127R6098R9764L0458o9235J53812q0167j39930L34160
19246f8884L06792L64714r3477k32062k85805j31862J07133j46938r7729J18817
19236a59301R9220R2149o340j91584k9212J14114K16079j88009K2552k3566K0991
19225c2907P6469J09206M0709l03079j75297o4209J09356O5677L6221J16371K98580
19214B77097l158k45826j4405L3106n4915l39886J55427K70985j94913j37874
$$ plain form
19287 -47466 28080 -22158 -143008 -140676 -11153 139846 -86174 124238 226580 144517 254164
19276 254164 402077 308209 158768 -16493 -352468 -335463 -446746 -381338 -70887 110278
19266 110278 -60263 -178620 -264561 -440777 -633053 -718450 -696054 -700938 -435511 -228817
19256 -228817 -389717 -493844 -397746 -297982 -267524 -336759 -182947 -263114 -403044 -68884
19246 -68884 237908 602622 509145 277083 -8722 -140584 -33451 -180389 -278118 -159301
19236 -159301 -60081 32068 25728 -165856 -195068 -80954 135125 -52884 -30332 -53898 -32907
19225 -32907 43562 152768 193477 -109602 -284899 -349108 -239752 -174075 -137854 -21483 277097
19214 277097 273939 28113 13708 46814 -8101 -347987 -192560 78425 -116488 -254362
19204b54362M7689J30000O5343o0055k27706P7976K47404j3539j90184J0383K47577
19193H0526P2218j36705N7845k2756l8786K5884P4348J0100p7882j41204O7183
19182b9229J38715J26937j08932j57178n4053n2502J03857n2661k74084j14866
19172d73996n2755R3454N5208K44426N9007j32303J3692L37L1213k03779j36453
19161e01949P7920K06404J09992M7180j28639p4848J44378K04728k4552k78136
19151b17522l9730K42943J55481j93907R5167J65775J08237r9574j41300q6769
19141a1199p5155j84821j1057J5511J99527N8089j38769J50908k814n0784p4302
19130a24866Q6886k60325j17064j72022J11028j1449L05632J64400n8163o3130
$$ plain form
19204 -254362 -206673 -76673 -11330 -71385 -299091 -221115 26289 12750 -177434 -167051 80526
19193 80526 152744 16039 73884 51128 12342 38226 112574 122674 44792 -96412 -29229
19182 -29229 109486 236423 127491 -29687 -83740 -136242 -32385 -85046 -359130 -473996
19172 -473996 -526751 -433297 -378089 -133663 -74656 -206959 -193267 -192930 -161717 -365496 -501949
19161 -501949 -424029 -217625 -107633 -60453 -189092 -263940 -119562 85166 60614 -217522
19151 -217522 -257252 -14309 141172 -52735 42432 208207 316444 216870 75570 -11199
19141 -11199 -86354 -271175 -282232 -266721 -67194 -9105 -147874 3034 220 -50564 -124866
19130 -124866 -37980 -298305 -415369 -587391 -476363 -487812 -182180 -17780 -75943 -139073
19120a39073J37988j9286n2416J50026O1345k61763K71170J74146n8627j91277
19110G2233m7600K23234P063j44021J47923J7139k54743O772Q0648q3481J1338
19099C6505P8497m5066J13758l10707k9030M04n8695K28864J34439q4580k28147
19088a63758K00725K96461j86820l35766j76623J8296j13144K71683J85137J77636
19078A73827K3187N2267J80841m2357l29912p4186j11723P5907p8907K60003L49398
19067D78345M3466j49861k25662K9721J52355j41533j06530K17412J84944r225
19057D73432j44756M7736J18158j18655N9397N7548j50496J56596O9459n176k85161
19046B78082j24745j75662J7455J97658k94098P8123J99090J75514K51592j31063
$$ plain form
19120 -139073 -1085 -20371 -72787 77239 138584 -123179 147991 322137 263510 72233
19110 72233 24633 247867 254930 110909 258832 275971 21228 28000 108648 25167 36505
19099 36505 115002 69936 183694 -127013 -156043 -155639 -214334 14530 148969 64389 -163758
19088 -163758 36967 333428 146608 -189158 -365781 -347485 -460629 -188946 -3809 173827
19078 173827 197014 249281 430122 387765 57853 -16333 -128056 -52149 -131056 128947 478345
19067 478345 521811 371950 146288 176009 328364 186831 80301 297713 482657 473432
19057 473432 328676 376412 494570 375915 435312 492860 342364 498960 568419 563243 278082
19046 278082 153337 -22325 -4870 192788 -101310 -23187 175903 351417 603009 471946
19036D71946j02597J19641j43144Q1141j9297K5330p9001J17053j86401K5333
19026C10004j80697K41103K49415j39804j10737n8115j15800p022Q7937J04215
19016C80499k6156K0486j10189k0703l0095K04197k742j56557k54861l2581k423
19005c1125R8043K16435l0129r7488J21262J78188o5092L063L8632r9442K5052
18994C57399J71442J07988j87230J1383k29284o4129o1039j30254L0189N4996
18984F1461K74485j07265j42124J7513j48902Q6511m2151M0184N3527L0159O121
18973A29519J13559m1776k05923k82925k79392J4535K94731R6714J4976L884J17660
18962b4438K21712J46910j01541N1546k0142l76878j70287r3059J13288Q3212
$$ plain form
19036 471946 369349 488990 345846 426987 407690 433020 354019 471072 284671 310004
19026 310004 129307 370410 619825 480021 369284 311169 195369 188347 276284 380499
19016 380499 354343 374829 264640 243937 213842 418039 415297 258740 3879 -28702 -31125
19005 -31125 66918 283353 253224 155736 276998 455186 390094 393157 431789 332347 357399
18994 357399 528841 636829 449599 460982 231698 167569 106530 -23724 6465 61461
18984 61461 335946 228681 86557 104070 -44832 41679 -472 39712 93239 123398 129519
18973 129519 243078 201302 -4621 -287546 -566938 -552403 -257672 -160958 -145982 -142098 -24438
18962 -24438 197274 344184 242643 294189 274047 -102831 -273118 -366177 -252889 -169677
18952a69677K47093P0038j07176k41975K22614K61584N1827k07459k25220p3117
18942a71468K61404K85289j87366j80674N2650J55684L05715J73754j60035m94357
18932D0596k70756k219J75964P8555k3648j22319L2801J26545K34070j44766N0397
18921A75220j1298N9962M9604J7658P7175R4559j42883J25138j87514j24050K6810
18910A60381P4435N815k35909p4994J44426J17843n9227j5938j54458r3868l0730
18899a62224K10482J91536j774L8047n842R5286Q757m3097j05686r9526k4890
18888A01069J76551r0133k13032P0056J49906K7610j47325r2910P5268K25105
18878B82165L5919o8304N1927j55420K8678m3751L7385j32400q7890P2091m8231
$$ plain form
18952 -169677 77416 147454 40278 -201697 20917 282501 334328 126869 -98351 -171468
18942 -171468 89936 375225 187859 7185 59835 215519 521234 694988 534953 40596
18932 40596 -230160 -232379 -56415 22140 -1508 -123827 -91026 35519 269589 124823 175220
18921 175220 163922 223884 273488 291146 368321 462880 319997 445135 257621 133571 160381
18910 160381 234816 240631 4722 -70272 74154 191997 132770 116832 -37626 -131494 -162224
18899 -162224 48258 239794 238020 276067 270225 365511 374268 331171 225485 125959 101069
18888 101069 277620 187487 -25545 44511 194417 222027 74702 -18208 57060 282165
18878 282165 318084 249780 301707 146287 174965 131214 168599 36199 -51691 20400 -27831
18867b7831M7711q8814n682L1520O6431o5984j68939Q7287K54784P4681k81845
18856g6681p8373J70135L28808J83867j92001k74224J67045J93462k7925j01825
18846B92288j38836j42250j30290n3436j27200P9035o1756J7701J78101p6210
18836a62853r3712p2930r001J75339J9839O1328N1571k6584M1018k02882L0556
18825a88311R1006j14468l50187j24585K08385K07864Q2158n5070j41979J19518
18815b65669P9196o1142J77894l0697L8948K22944J09528m4242L1498m7778k31285
18804b0805K545K03381o1864j63659l7262l9851L61638J44871J46819k2864k14869
18793B98080k56718N166k54169k80352Q0574K30235M1073l3248J71482J72032
$$ plain form
18867 -27831 19880 -68934 -74616 -43096 23335 -42649 -211588 -124301 130483 205164 -76681
18856 -76681 -155054 15081 343889 527756 335755 61531 228576 422038 394113 292288
18846 292288 153452 11202 -119088 -172524 -299724 -220689 -282445 -264744 -86643 -162853
18836 -162853 -256565 -329495 -338496 -163157 -143318 -81990 -30419 -57003 -15985 -218867 -188311
18825 -188311 -97305 -211773 -561960 -686545 -478160 -270296 -188138 -243208 -385187 -265669
18815 -265669 -186473 -247615 -69721 -100418 -61470 161474 271002 226760 258258 210480 -20805
18804 -20805 -18260 185121 123257 -40402 -77664 -117515 244123 388994 535813 512949 298080
18793 298080 41362 46528 -207641 -487993 -407419 -177184 -136111 -169359 2123 174155
18783A74155K05754M5240j67777j36072P803J4649j78236O7306K87073J50966
18773D70861k80275q8759o5217M6741j07337M0160N2151j1715Q0712J33639p2419
18762A98542k12770P093j9162J09729j05004N7529J48045o6499K14744J09371
18752D41618p5193l37608n3011L1015J15538N9979J32110K09571k44149l34427
18742e4557m6826k2862M9459p773J28667J69716o5234L0382o1247j5184j03269
18731A272k68202j95687J00708L26756j66213q734K90934Q6092q030p139o7131
18720H4626j67337l2903j22276k0966L85075L45081j21752o9398k64225k77584
18710b61659m1641N8551Q8090K48427K31500J21674p6648k48527k04424n3833
$$ plain form
18783 174155 379909 425149 257372 121300 129103 143752 -34484 32822 319895 470861
18773 470861 190586 101827 36610 83351 -23986 16174 68325 56610 137322 270961 198542
18762 198542 -14228 -7135 -26297 83432 -21572 35957 184002 117503 332247 441618
18752 441618 366425 28817 -24194 6821 122359 182338 314448 524019 279870 -54557
18742 -54557 -101383 -124245 -74786 -82559 46108 215824 150590 180972 119725 104541 1272
18731 1272 -266930 -462617 -361909 -35153 -201366 -210100 80834 166926 158896 151757 84626
18720 84626 -82711 -115614 -237890 -258856 126219 471300 349548 280150 15925 -261659
18710 -261659 -303300 -244749 -156659 91768 323268 444942 368294 119767 -84657 -138490
18700a38490J85557J48441q8347J22193K3331j86758q360J45236r5100j15095
18690g392J55115J02747J28487N2900j64241m9444J94361r2550j8000k04636J78873
18679B76220J00459r8794R6017j3129j4344k90289k81618M0958J20941q6990n178
18668a55747K65732N7276j40991J37965P5230l1938j25202k17361p6478O0236
18658a51278o3650j47811J19745J43170j09889k4870J18177m2477P9578J75715
18648I6410R9153O9808j49924j03266o1635k43517K32611J45286n0751L4891k4970
18637D4096j24565L3836O9257j49574j20304J60178L9750P2813J7070j82413l1194
18626a71050r580J47788N8995J92453K23721J9172j94470j13014j69011O2038
$$ plain form
18700 -138490 47067 195508 107161 229354 252685 65927 57567 202803 107703 -7392
18690 -7392 147723 250470 378957 431857 267616 218172 412533 319983 301983 97347 276220
18679 276220 376679 277885 373902 360773 346429 56140 -225478 -184520 -63579 -150569 -155747
18668 -155747 109985 167261 26270 164235 239465 207527 82325 -135036 -211514 -151278
18658 -151278 -214928 -362739 -242994 -99824 -209713 -234583 -116406 -158883 -79305 96410
18648 96410 195563 265371 115447 12181 -49454 -292971 -60360 84926 34175 69066 44096
18637 44096 -80469 -46633 22624 -126950 -247254 -87076 -47326 25487 42557 -139856 -171050
18626 -171050 -180630 -32842 26153 218606 442327 461499 267029 154015 -14996 47042
18616D7042J82984k35753l12874J03235K33289K17298J35636k742k10806O365
18606A63674J53920J06129j56325l50418j58569n4391J08886j22590N8192K92140
18596D0648L2498l782J61996N5911J41056N9427n9466j17846P6801j8455Q4201
18585D52989j89803j95051n7052O2921r528k0124J77337p9288j22403K00095q8128
18574A31965j69033j76290l7392K51138l8887j50449M3064L36432K81101J39728
18564F11377j54842j00332q3419n3579j43307j21048N756J81378j44950o3279
18554f6245K6905K2899R7239K1847j59177N8220J80372R5656K557L7488K41299
18543E59060j27404j71028Q840N2845l3309k6278l97416j2974K3217k29955j59068
$$ plain form
18616 47042 230026 -5727 -318601 -215366 17923 235221 370857 368115 157309 163674
18606 163674 317594 423723 267398 -83020 -241589 -295980 -187094 -309684 -251492 40648
18596 40648 73146 69364 231360 287271 428327 487754 428288 310442 387243 368788 452989
18585 452989 263186 68135 11083 74004 64476 44352 221689 142401 19998 220093 131965
18574 131965 -37068 -213358 -250750 388 -38499 -188948 -145884 190548 471649 611377
18564 611377 456535 356203 272784 219205 75898 -45150 -39394 141984 -2966 -66245
18554 -66245 -39340 -16441 80798 102645 -56532 1688 182060 277716 280273 317761 559060
18543 559060 431656 260628 269468 322313 289004 262726 -134690 -147664 -124447 -354402 -513470
18532e13470o4572J65330K62416p6973j27808J2400J70660K15234J5787Q1594
18522A40598J73966M8242j02646k16740K1277J81694J48199j60559k39541o0760
18512f6270m20J12196O2174J31108j24294k59260n6731K3429J12549k3160J20559
18501C1880J47481J14490j23894k15315J48953J61138j1484l36792j99067J04382
18491a78228K74564O8122k30054k15763j13746J60884J18238l0499J95908r3215
18481d3789O6533J46014J31019k8609k24425k43270j39326J49129J43410K63525
18471B20211K15547j90590l41300N4687P6907l684k2586n5812J32546q5838o5187
18460f5099m9705l1091k7627k50r5964J49847Q1796k20248J48368M9367l0126
$$ plain form
18532 -513470 -578042 -412712 -150296 -227269 -355077 -342677 -172017 43217 59004 140598
18522 140598 314564 362806 260160 43420 64697 246391 394590 234031 -5510 -66270
18512 -66270 -66690 45506 107680 238788 114494 -144766 -201497 -178068 -65519 -88679 31880
18501 31880 179361 293851 169957 -45358 103595 264733 253249 -83543 -282610 -178228
18491 -178228 96336 164458 -65596 -281359 -395105 -234221 -115983 -146482 49426 -43789
18481 -43789 22744 168758 299777 271168 46743 -196527 -335853 -186724 -43314 220211
18471 220211 435758 245168 -96132 -41445 35462 31778 9192 -46620 85926 88 -65099
18460 -65099 -114804 -145895 -173522 -173772 -269736 -119889 -38093 -258341 -109973 -60606 -90732
18449i0732J35455P0486j03958K9396P4016o5851o0713k0657k19208R8562Q1830
18438g1374p8639j84938J31466J76994J4861k56833Q4937r2795j27605J49209
18428b54717J09140N3266J39028J54166r2929j81802l03302n9309J68634j3035
18418b80860J0059J39560J668K18889R2618k10506k86791j2637q831K25793P9315
18407c1723j91430N0637J70044J84136L43367j18748l32526j64400q8971K63391
18397H3777o6298j58726J43921J78195l04093j13449j2738L7295M6608J54706
18387a0802k9143k94381K088K93530P5328k0576j5371M9211N7809M5858j05168
18376D8383k44563J11408L09741n2388j90670k54691J04051J05561k4507J13293
$$ plain form
18449 -90732 44723 115209 11251 40647 114663 48812 -11901 -32558 -251766 -153204 -71374
18438 -71374 -150013 -334951 -203485 -26491 -11630 -268463 -183526 -276321 -403926 -254717
18428 -254717 -145577 -92311 46717 200883 107954 -73848 -377150 -436459 -267825 -280860
18418 -280860 -270801 -131241 -129573 89316 181934 -28572 -315363 -328000 -336831 -111038 -31723
18407 -31723 -223153 -172516 -2472 181664 525031 406283 73757 -90643 -179614 83777
18397 83777 17479 -141247 2674 180869 -123224 -236673 -249411 -212116 -165508 -10802
18387 -10802 -39945 -334326 -332238 -38708 36620 16044 673 49884 107693 153551 48383
18376 48383 -196180 -84772 224969 172581 -18089 -272780 -168729 -63168 -87675 25618
18366B5618K7833L8161K38570R4447k31196k9978j5931J3546K06043R3370j43952
18355C16531l5653j0308k24296j70584k9643n2897k78035R3421K17097j08576
18345b82943P2781P5857j78155n9246N5488j374k3184J06704J70127J18355n955
18334D8455m5124k02779j11449M3255J14454J4797K05946M1965j54898l3005n2692
18323a31075P5733O7066m8786P6590j66024l14904J01715L13537J20310o3702
18313C0460K52945J906j48401J0279k68656m7551j02825K9128P1715j9239J41408
18302d8831J64090K08393J37854j25026k03987j35518j37376j43410j71634J75400
18292b80045q188L589J00825Q790L2955n931q276n7324l5019R9530K47691J11545
$$ plain form
18366 25618 53451 91612 330182 424629 193433 163455 147524 161070 367113 460483 316531
18355 316531 280878 270570 46274 -124310 -153953 -206850 -484885 -391464 -174367 -282943
18345 -282943 -210162 -134305 -312460 -371706 -316218 -317592 -340776 -234072 -63945 54410 48455
18334 48455 3331 -199448 -310897 -267642 -153188 -138391 67555 109520 -45378 -78383 -131075
18323 -131075 -55342 11724 -37062 39528 -126496 -441400 -339685 -26148 94162 30460
18313 30460 283405 285311 136910 147189 -121467 -169018 -271843 -242715 -171000 -190239 -48831
18302 -48831 115259 323652 461506 336480 132493 -3025 -140401 -283811 -455445 -280045
18292 -280045 -288233 -284644 -183819 -175029 -142074 -148005 -156281 -213605 -248624 -149094 98597 210142
18280B10142P1812J11032k43759j42879j06873l88819J50788J94134L7594J74480
18270F7652j72468k30828j69772M2110K63212J61100j94568k31408N7867j128
18260d08231J54988K30373p8377K30640O5544o5881q418k8662k8005n37j45080
18249h1646j43524m3109K42498N0182L68522M8916k8366j44800k4612M1809o423
18238B79447j20609j13628J66574J49083k62168q8505K22069j5929j91043k30472
18228b05181r601K01089p1068l5031J6062K9297J24338o9649k9282j47662l16943
18217e13631J30299o4129k0306J47868K77274J81404J60987m5374k23437J19018
18207A49973j179j17741r722J80013r820k69801o6388o9907j25565L7005K21834
$$ plain form
18280 210142 281954 392986 149227 6348 -100525 -489344 -338556 -144422 -106828 67652
18270 67652 -104816 -335644 -505416 -463306 -200094 -38994 -233562 -464970 -407103 -408231
18260 -408231 -253243 -22870 -101247 129393 194937 129056 120638 91976 63971 63434 -81646
18249 -81646 -225170 -268279 -25781 24401 392923 441839 413473 268673 244061 285870 279447
18238 279447 158838 45210 211784 360867 98699 10194 232263 216334 25291 -205181
18228 -205181 -214782 -13693 -84761 -119792 -103730 -74433 49905 -19744 -49026 -196688 -513631
18217 -513631 -383332 -447461 -467767 -319899 -42625 138779 299766 254392 30955 149973
18207 149973 148794 31053 21331 201344 191524 -78277 -144665 -214572 -340137 -303132 -81298
18196h1298K80853j74735J39807k2486j3813k43333K54255Q3413j27349j34297
18186c8983j43651j55645J09441L10729R1836j17920K97422J30637P2299p3925
18176D82240k66606r9515Q0154j7346j77558m2400j6253k8760j65675J32412N6550
18165f2757o0J41457K87436K54918k1171n8372q8468J53497M88240K77036r800
18154A361956j299L06154L02866Q347j30483J72305o1390k00323P5584J4952k84156
18143A564513l82199j61567o4268q7455j01853l5935k55914j75759k5289K21645
18133D95919n9168p7419N1882P8570K82669K1556l06744l77705k95320m2411K32785
18122D614p1613J78872J59229j46828j03439o454N4122K8725j41208K23588L51044
$$ plain form
18196 -81298 199555 24820 164627 142141 128328 -115005 139250 222663 95314 -38983
18186 -38983 -182634 -338279 -228838 81891 173727 55807 353229 483866 556165 482240
18176 482240 215634 116119 196273 178927 1369 -41031 -57284 -86044 -251719 -119307 -62757
18165 -62757 -62817 78640 366076 620994 599823 541451 452983 606480 1094720 1371756 1361956
18154 1361956 1360657 1666811 1969677 1978024 1847541 2019846 1958456 1758133 1833717 1848669 1564513
18143 1564513 1182314 1020747 956479 869024 767171 731236 475322 299563 274274 495919
18133 495919 436751 359332 411214 489784 772453 794009 487265 109560 -185760 -228171 4614
18122 4614 -66999 111873 271102 124274 20835 14381 68503 97228 -43980 179608 530652
18111E30652K18603j98502k88253k25654K53359o9427j38185n0344J27774J60778
18101C20801K0422j23825K5732j46687q4283J35092L47813r580L8476n7088k60014
18090B06859O5138K24897J18061k04100J94357R9214r8922o690O206J25271O8182
18079G98473K5332r502k01868p5750J86908m8883j00037K51070N0434j22906P7799
18068H31070q6983j11707j11322J1754O0751j39816J16743J17028L4871N1594
18058G73983K3925m2048n3474J3895N2440L9880l3703j43725O4789k2063j35385
18047E38514o3801K16541N2883n0204j30131K5670j36138k80792N0347R0659N9860
18036C73408J64226m1006j6248r9514j27389k88003q8086J66974n8174N3595O5929
$$ plain form
18111 530652 749255 550753 262500 36846 290205 220778 82593 32249 160023 320801
18101 320801 341223 217398 243130 96443 12160 147252 495065 485485 523961 466873 206859
18090 206859 271997 496894 614955 410855 605212 704426 605504 598814 605020 730291 798473
18079 798473 823805 814303 612435 536685 723593 674710 574673 825743 876177 753271 831070
18068 831070 744087 632380 521058 532812 593563 453747 570490 687518 722389 773983
18058 773983 797908 755860 702386 716281 768721 808601 774898 631173 695962 673899 538514
18047 538514 474713 691254 744137 693933 563802 589472 453334 172542 222889 313548 373408
18036 373408 537634 496628 480380 380866 253477 -34526 -122612 44362 -13812 39783 105712
18025A05712J30569J86074n9460L3785P1481j4561J14049K75672O2982j07752
18015G98551k64812k00120n7457L9351K61203j22023j44601j63028k39718J16761
18005B4107K62682r1789j87540J75082o411R6377J5052K7220k7911p3247j25856
17994H7766K1543K27876p5607k70063J89388K6903j81744r1111j745J99298L9582
17983A72086N6323k50910j06415K37805q6106k73110j11942J11423P3964M2069
17973a34813j92679J99393q1596k36638J60239J8303K08553N6542O0497j4502
17963D3299j55474k65052J12433J27553J07358J88537J13589j92804j34523K431
17953e2653P621n3909k1775P8679J95394J75684Q1379k47962j75439N3770Q4202
$$ plain form
18025 105712 236281 422355 362895 396680 468161 453600 567649 843321 906303 798551
18015 798551 533739 333619 276162 315513 576716 454693 310092 147064 -92654 24107
18005 24107 286789 195000 7460 182542 176131 272508 287560 314780 286869 213622 87766
17994 87766 109309 337185 261578 -8485 180903 207806 26062 -65049 -66794 132504 172086
17983 172086 228409 -22501 -128916 108889 22783 -250327 -362269 -250846 -176882 -134813
17973 -134813 -327492 -128099 -209695 -446333 -286094 -267791 -59238 -2696 57801 43299
17963 43299 -112175 -377227 -264794 -137241 -29883 158654 272243 79439 -55084 -52653
17953 -52653 -45032 -98941 -120716 -42037 153357 329041 410420 162458 -12981 40789 124991
17942A24991M3083O7042j50720l2793L7740r8492j01795P390Q3208L19877J94809
17931D94340r4799j78614K40348p1496k09696r4928j06312l0067J17958j82314
17921a15580k77311J66086L05921N2492j82968j71858r943n8125N4515J20173
17911a16598J73220K36448q4151k90875k45034q4285J19649K18438O3581J60109
17901A50502j07210k21846N9517R0593J29532k18437j73246j64657K37775J29921
17891h7556K12513L47732J44966k39637k27149p7160j77845J34858K32000l9798
17881B22924N2278j82161q3309k6239J53170M3633J0488M3210m0924j03257o164
17870H3649J6404p4219j23323j38960J18377L0630j68275o1810J40324J83059
$$ plain form
17942 124991 168074 235116 84396 51603 89343 -9149 -110944 -103554 -20346 299531 494340
17931 494340 399541 220927 461275 389779 180083 85155 -21157 -51224 66734 -115580
17921 -115580 -392891 -226805 79116 131608 -51360 -223218 -233161 -291286 -236771 -116598
17911 -116598 56622 293070 208919 -81956 -326990 -411275 -291626 -73188 -9607 150502
17901 150502 43292 -178554 -119037 -28444 101088 -117349 -290595 -455252 -217477 -87556
17891 -87556 124957 472689 617655 378018 150869 73709 -104136 30722 262722 222924
17881 222924 275202 93041 9732 -16507 136663 180296 190784 233994 193070 89813 83649
17870 83649 100053 25834 -97489 -236449 -118072 -87442 -255717 -317527 -177203 5856
17860E856K65082J74854k0218j16298K90480j42698k43982n3862j2253P6729J35144
17849C58834J1127l1977M3554p3482j39710m0736p4403k15451J3472o4000K31115
17838A8343K18032J39980J00659n0370J06381M54822L53512M40846K29678J62108
17828B173991P8103O2331j45456l41389j03226k08737k01899K1731k12558n3855
17818A069036j638r9668N3492k19403k55539j58184j97915J21803J41845J4843
17808D68672j30556j01440J28548K02459L5221q3677j22244k52534l04107j02889
17798b62547K46896r0165k46350M0688P5690J02099J27328N717m3940N6650J04179
17787A16245n5163P0988k9617L4775P0183p1127k7524j68182l3996J14713J57494
$$ plain form
17860 5856 270938 445792 425574 309276 599756 457058 213076 159214 146961 223690 358834
17849 358834 369961 337984 381538 308056 168346 127610 53207 -162244 -148772 -212772 18343
17838 18343 236375 376355 477014 426644 533025 987847 1341359 1782205 2011883 2173991
17828 2173991 2252094 2314425 2168969 1827580 1724354 1515617 1313718 1335449 1122891 1069036
17818 1069036 1067398 967730 1021222 801819 546280 388096 190181 311984 453829 468672
17808 468672 338116 236676 365224 567683 602904 519227 396983 144449 -159658 -262547
17798 -262547 -15651 -105816 -352166 -311478 -235788 -133689 -6361 -644 -44584 12066 116245
17787 116245 61082 132070 102453 137228 207411 136284 108760 -59422 -93418 21295 178789
17776A78789J40175k2132k78613Q7208P0563m5034m20267k03713J45928J85571
17766a61525r7503k63717j03746J25951J47993R6833k1474M9120J33539J34205
17756C9676j1674j52872o7073Q2051O2493n0704N6187J58449N0478J78549J9995
17745C65555j07610j11578j29770Q3541j59j30349r2234j65178j56525J46111
17735b98196L02862K33882o9135r0065J1491j26716J28350K31174Q6646j79492
17725B30801L901j08491k82797L7100L4965O8814P3209j15230j22152j62685M0464
17714c02101l2540J70762L0511M4555K20335P8612j24167j54010o9464J70986
17704C3479L07220O8815l36086r2557J3550R8986N0226Q464j18873J95193J63493
$$ plain form
17776 178789 318964 296832 18219 105427 175990 130956 -289311 -493024 -347096 -161525
17766 -161525 -259028 -522745 -626491 -500540 -352547 -255714 -277188 -228068 -94529 39676
17756 39676 28002 -124870 -191943 -109892 -47399 -98103 -41916 116533 167011 345560 365555
17745 365555 257945 146367 16597 100138 99979 -30370 -122604 -287782 -444307 -298196
17735 -298196 4666 238548 169413 79348 90839 -35877 92473 323647 410293 230801
17725 230801 234702 126211 -156586 -119486 -84521 -15707 57502 -57728 -179880 -342565 -302101
17714 -302101 -334641 -163879 -133368 -88813 131522 210134 85967 -68043 -137507 33479
17704 33479 340699 409514 73428 -19129 -5579 93407 143633 152097 33224 228417 391910
17693C91910k14317k56445n3875l5529K36389K00510r6784k87579k34199k3584
17683c73503J57641R921J15242J46015m048K00628k9597r0390n5084n4294J34758
17672A57289L72010m2612k46n0077j24994J10511j05535q2938J5098j71491k37771
17661a60756Q471k5891J43892O6889J58061R8904K05029P7954p8663k50734j96393
17650D6763k8775j59276J50272M5953M1954j3108Q2865J0537J25564P402l22015
17639a1864Q7843J19234L1709k17014j13284l8817J43013k0591r6326k8235n608
17628a49940o7224Q9558O6965J10612J1544j6221N3221Q0751j13150K03892L7168
17617C07176k03538k64308j59620j3442R0100K8789K10425J04325K04786K49403
$$ plain form
17693 391910 177593 -78852 -132727 -168256 68133 268643 171859 -115720 -349919 -373503
17683 -373503 -215862 -205941 -90699 55316 51268 251896 222299 131909 76825 22531 157289
17672 157289 529299 486687 486441 436364 311370 421881 316346 233408 248506 77015 -160756
17661 -160756 -152285 -178176 -34284 32605 190666 289570 494599 572553 493890 243156 46763
17650 46763 17988 -141288 8984 54937 96891 83783 166648 177185 302749 310151 -11864
17639 -11864 75979 195213 226922 9908 -103376 -142193 820 -19771 -116097 -144332 -149940
17628 -149940 -217164 -127606 -60641 49971 61515 45294 98515 179266 66116 270008 307176
17617 307176 103638 -160670 -320290 -333732 -243632 -214843 -4418 99907 304693 554096
17607E54096j30564j94678j22182J2457J08464k4209j1026J8856k555j599q4245
17596A22815N4144K428Q7479L21539J9922l07062o985J6508r0638J19897K57721
17585E97768p2172k51840l97065Q5348n8532p1203O2792R4842N2476l5006J27283
17574A34691K61393J314p8272k1846p4683L7511J57386l14681k69747N7045n5384
17563a65273J99649K79116P24j44292l8780k5132J74424j6864k02329K71375K95556
17552F28174k00144j50852o1359J13332J42392K50812K97806r8608k09877k64831
17542D46845l88263l7640K44702p6025K9775K36000Q0656q7767k00233j43416
17532A04634l96795L117M36451K19789k65766j05841J52133j36885K38137J6778
$$ plain form
17607 554096 423532 228854 106672 119129 227593 203384 192358 211214 208659 207060 122815
17596 122815 176959 179387 266866 588405 608327 301265 294280 310788 220150 340047 597768
17585 597768 525596 273756 -123309 -37961 -96493 -167696 -104904 -10062 42414 7408 134691
17574 134691 396084 397398 319126 297280 222597 260108 417494 102813 -166934 -109889 -165273
17563 -165273 34376 313492 314216 169924 131144 106012 280436 263572 61243 332618 628174
17552 628174 428030 277178 215819 329151 471543 722355 1020161 921553 711676 446845
17542 446845 58582 20942 265644 189619 219394 455394 536050 448283 248050 104634
17532 104634 -292161 -289044 147407 367196 101430 -4411 147722 10837 248974 265752
17522B65752K55980L0990l50562n0601O9429R1913l4036j76652J57268K25211
17512D84692J85595J5963P8934R9211L06894O52753q2373J1249L27639L08321
17502B388878J10332l44970k76134j19269j1671k81554k08348k75100L733J4497
17492A000394R75j0429O0233j87888j87571K1680J98469p4038o3084k69556l11561
17481A77624j06080R0832l300J9852l1092J9013J26849j14444k9020l4834J25801
17470B41201r9369l9467P0831k66014j16645K16139R7672Q9656j88923O5014K6539
17459I6634J32370j66847M6320J83341J3783J7264r9568J15774l8324N5209O4683
17448D20639k55063r7977j74536J01906J12862k2696k2325J83047J76621l9580
$$ plain form
17522 265752 521732 552722 202160 151559 220988 312901 278865 102213 259481 484692
17512 484692 670287 686250 765184 864395 1171289 1824042 1741669 1752918 2080557 2388878
17502 2388878 2499210 2154240 1878106 1758837 1747166 1465612 1257264 982164 985897 1000394
17492 1000394 1001369 990940 1051173 863285 675714 697394 895863 821825 758741 489185 177624
17481 177624 71544 162376 159076 178928 147836 166849 293698 179254 150234 115400 241201
17470 241201 141832 102365 173196 -92818 -209463 6676 104348 194004 5081 70095 96634
17459 96634 229004 62157 108477 291818 305601 322865 223297 339071 300747 355956 420639
17448 420639 165576 67599 -106937 -5031 107831 85135 62810 245857 422478 382898
17438C82898j24673j59700o7088k90564n7784K05959L06014J7507j85930q8121
17428f1482J55029K11408k05655Q3751J04513L0332k08375j91837K04146J88732
17418C10562P3573m3843K16494j60177J0712L9490n17176j94956K04267L9276
17408b1778l55572j30119J13607J69162J01579J62281P6124o0368M4302P8099
17398A77317K09441J08393o0209k27263K5002Q8916k21897o3374P9417J32576
17388B48319J6386J61r628j58227j23792j979o3673P5974Q6987O9808j67054K49747
17376B23029L6859j63067J60183M9562l42130j25621K40887O0412Q7852l2910
17366A95056n4210j51624j78759P2346J69264j68971j21075P2515o474p7868n1511
$$ plain form
17438 382898 258225 98525 31437 -259127 -316911 -110952 195062 212569 26639 -61482
17428 -61482 93547 304955 99300 183051 287564 317896 109521 -82316 121830 310562
17418 310562 384135 340292 556786 396609 407321 446811 -70365 -265321 -61054 -21778
17408 -21778 -377350 -507469 -393862 -224700 -123121 39160 115284 54916 99218 177317
17398 177317 386758 495151 434942 207679 232681 321597 99700 36326 115743 248319
17388 248319 264705 264866 255238 97011 -26781 -28760 -92433 -16459 70528 140336 -26718 223029
17376 223029 259888 96821 257004 306566 -35564 -161185 79702 140114 227966 195056
17366 195056 140846 -10778 -189537 -117191 52073 -116898 -237973 -165458 -171932 -249800 -301311
17355c01311L2056J7607O3731n5118K56386J47238k21456q2785m9639M3124J24140
17344b6027R6530r5634J96354J10128P8664k28043j83399j51018j38698l1023
17334c72166J44135L01533J60340R4917J01420p1011k47113J23186j05457q7467
17324D2317k07284q9543o4753R3864K1602J67387n5035R5087J59053M1154k06083
17313b234l46399K09738L73758K90724N4610O5293n9887k67719l5241O6345p1790
17302B77198j11156r3188J25460J70035j48862j29367Q0649m2793k15493l08234
17292c95751J94944J38972K05626K09931J03115j74665j68389r3271O2877N9021
17282A42410N1400L7185j9643l20468j66011K42407p0995l0348o3323J52474K85445
$$ plain form
17355 -301311 -269255 -251648 -187917 -243035 13351 160589 -60867 -143652 -193291 -150167 -26027
17344 -26027 70503 -25131 171223 281351 360015 131972 -51427 -202445 -341143 -372166
17334 -372166 -228031 73502 233842 328759 430179 359168 112055 235241 129784 42317
17324 42317 -164967 -254510 -319263 -225399 -203797 -36410 -91445 3642 162695 203849 -2234
17313 -2234 -348633 -138895 234863 525587 580197 645490 585603 317884 282643 348988 277198
17302 277198 166042 72854 198314 368349 219487 90120 170769 127976 -87517 -395751
17292 -395751 -200807 -61835 143791 353722 456837 282172 113783 20512 83389 142410
17282 142410 193810 230995 211352 -109116 -275127 -32720 -103715 -134063 -197386 -44912 240533
17271B40533L30325k6549l51996L7772P3121j49014l01939l4076K9851J54724
17261B752Q8352n457Q4045r394j12931M2339J19592L0179k01293K7291j49864
17250h4389r5099l9520M7587K5992J408r8296O5010R9052L43036M6679o3160m3800
17238B04500K15357k6118j64526k39860j38271o5897p6372J25251L4386J35433
17228C883J61274k45849k74554j16839J69199P1790L0638o3314L64041k3356p6526
17217C87J6224j66643K29827J68747j36296P7246M9224P1888p8264j52430q1130
17206a220j47862j62291J64014O5363k0606N3289Q7357j35739P9878r674P6750
17195D9259O6793Q7548j22852P8604J04955N8356j85794l149l347Q5725l18344
$$ plain form
17271 240533 570858 544309 192313 230085 303206 154192 -147747 -181823 -151972 2752
17261 2752 91104 85647 169692 160298 47367 89706 209298 239477 38184 65475 -84389
17250 -84389 -179488 -219008 -171421 -145429 -144021 -242317 -177307 -78255 264781 311460 248300 204500
17238 204500 419857 393739 229213 -10647 -148918 -214815 -291187 -165936 -131550 3883
17228 3883 165157 -80692 -355246 -472085 -302886 -231096 -200458 -263772 100269 76913 387
17217 387 16611 -150032 79795 248542 112246 189492 238716 310604 232340 79910 -1220
17206 -1220 -149082 -311373 -147359 -81996 -102602 -49313 38044 -97695 -17817 -27491 49259
17195 49259 116052 203600 80748 159352 264307 322663 136869 133720 130373 216098 -102246
17184a02246n956J82080j9138l97296k98768K04961K36450J09482j52147q4334
17174c26912O5301J02582O8784j0433k86611k34988p7623K3109L57625K82413
17164c6753j42774k12350j18675K15642q4169j91195k4373J64520m8376J67029
17154c11474J99301K3070j88163j67278k7954M00458K83740k5619p3684j36069
17144b3672n2419k5064n6014P4450k06247o4864k6917n450K86781k6231O6672
17133e8975j10775q8798k1690j76884J2906J32771j03187l8655K41183J20633
17123i1471l0673r763j4893j1279n1756Q2566J21084j950j45657J89397J41095
17112A76700j27321l057j80669J9974P10O0804j31251J53997J91527j69229l8892
$$ plain form
17184 -102246 -108202 73878 54740 -342556 -641324 -436363 -199913 -90431 -242578 -326912
17174 -326912 -261611 -159029 -90245 -100678 -387289 -622277 -699900 -676791 -319166 -36753
17164 -36753 -179527 -391877 -510552 -294910 -379079 -570274 -594647 -430127 -478503 -311474
17154 -311474 -112173 -89103 -277266 -444544 -472498 -72040 211700 186081 112397 -23672
17144 -23672 -76091 -101155 -157169 -82719 -288966 -353830 -380747 -386197 -99416 -125647 -58975
17133 -58975 -169750 -258548 -280238 -457122 -444216 -311445 -414632 -453287 -212104 -91471
17123 -91471 -122144 -131907 -146800 -158079 -209835 -127269 -6185 -8135 -153792 35605 176700
17112 176700 49379 46322 -134347 -114373 -113663 -52859 -184110 -30113 161414 -7815 -46707
17101d6707n5626j20436O9993J64795m2535L127Q8982Q6339m5116j99853L6303
17090f0734j0156l54271j12098R7323j64496O0955K69681K16310p7971j27403
17080b62860n2015n034J49998j9612L07117j01961j9330j09560K962K04416M1106
17069A35227l6604j79931k8389n2406m15987Q946J33505m016O7286K75830K67110
17058A70571M9018j10066k8356P0073m0455k05856r4627R7892J6926P0044N8908
17047E4072Q8064q5657K8983p5998Q6117J66173m8680k67568J8656o46q6253j61727
17035b84464r9178K8429K74687J586o0190K23262K32863j15114k07940l5603J17602
17024G5940n2329N917Q1098n2394R8165j37080P6394Q7148j17053j28780J433
$$ plain form
17101 -46707 -102333 -222769 -152776 12019 -30516 -27389 61593 147932 102816 -97037 -60734
17090 -60734 -70890 -425161 -537259 -439936 -604432 -543477 -273796 -57486 -135457 -262860
17080 -262860 -314875 -319909 -169911 -189523 117594 15633 -3697 -113257 -110295 94121 135227
17069 135227 98623 -81308 -109697 -162103 -578090 -569144 -435639 -439655 -372369 -96539 170571
17058 170571 219589 109523 81167 151240 110785 -95071 -189698 -91806 -74880 -4836 54072
17047 54072 142136 56479 85462 9464 95581 261754 213074 -54494 -35838 -36484 -122737 -284464
17035 -284464 -383642 -355213 -80526 -78940 -139130 84132 316995 201881 -6059 -41662 75940
17024 75940 23611 29528 110626 58232 156397 19317 95711 182859 65806 -62974 -61541
17013f1541K31017M32j20053J62251k60248o5453M0976K4218l2510j5302K5392
17002g0821M7473l03282k0653L40217J85929r576j73217j09109L4979K0758J05049
16991D7747l451K29239L3171j49198j56626M4814J19455J4744j32974J42485k7602
16980A61804P2647J36625N5358l3989j79218j25179j2494N1155J72892N5019r1327
16969B63293k6329J5236J6866R7395j10642q4926m1711P6063o4405k85527j05865
16958b50552j05195L8759J2281N507J55213n7024O5370M998l3897N2381r5714
16947b07873j24893K93115J7621n4412k3707k62141k04276J50187j8353q4749
16937e19481J11014K53596K02679J38503O7540K80993k5446j46405l36725l7725
$$ plain form
17013 -61541 169476 169908 49855 212106 -48142 -113595 -72619 -48401 -80911 -96213 -70821
17002 -70821 -23348 -326630 -347283 -7066 178863 169287 -3930 -113039 -78060 -57302 47747
16991 47747 44296 273535 306706 157508 882 45696 165151 179895 46921 189406 161804
16980 161804 234451 371076 426434 392445 213227 88048 75554 126709 299601 354620 263293
16969 263293 236964 252200 269066 366461 255819 170893 129182 205245 140840 -144687 -250552
16958 -250552 -355747 -316988 -304707 -299200 -143987 -201011 -135641 -130643 -164540 -112159 -207873
16947 -207873 -332766 -39651 -22030 -76442 -100149 -362290 -566566 -416379 -434732 -519481
16937 -519481 -408467 -154871 47808 186311 253851 534844 509398 362993 26268 -11457
16927a1457j6901L0505o5935P215j56473q684m1659J13912J81134m3187Q9509
16916G7979j27798K0962J04123k14547J50082J39132k4022K53786O5298p7429
16906C67566j20415k3120L3609k53172r242k23694k39866J58330J06574J81120
16896b2310Q4404m9582P7514K6561j01704O1924M6723J470J39096J78347k02646
16885B39797j63187K526j2623o1342k4050J64420J01730k65360j31095J29312
16875a9872Q9029k29524n6996K57953p5863l1615q0410q9688k2066q2650K665
16864c39037J35212K45706J93852j90561p1742M0700j98620p203l564J02302J07760
16853A4805O0314k8529n4436j4792j81383R3304M3083n3018j67977J52720L59850
$$ plain form
16927 -11457 -28358 2147 -63788 -56573 -213046 -221730 -263389 -149477 31657 -11530 77979
16916 77979 -49819 -28857 75266 -139281 10801 149933 125911 379697 444995 367566
16906 367566 247151 224031 257640 4468 -4774 -228468 -468334 -310004 -203430 -22310
16896 -22310 62094 12512 90026 116587 14883 76807 123530 125000 264096 442443 239797
16885 239797 76610 79136 66513 5171 -18879 145541 247271 -18089 -149184 -19872
16875 -19872 69157 -160367 -217363 40590 -35273 -66888 -147298 -236986 -259052 -341702 -339037
16864 -339037 -203825 41881 235733 45172 -26570 14130 -184490 -191693 -195257 -92955 14805
16853 14805 75119 46590 -7846 -22638 -204021 -110717 -67634 -120652 -288629 -135909 223941
16842B23941j03912p5707J62328m4744P9398J00314j74943k98714m563j398J09175
16831b8825j83690p7822Q8089K23261M883l6416m3478k17416O696Q1728J17768
16820f5222K4241M6133J58086J19744N9853j68822q6381J04869j29889j89672
16810a27060Q7895J2035Q6360j51996O3818r649m3103R9684j67883M5002r2992
16799a97889p3262o2962j36476k80397K03721M35087Q4660J2505J19322L1675
16789A35984m7190k1962j45840k13117P5373o87k1926L88026J10491q2017J29172
16778C06307j05753k97472o2703j22099P8271j8660m9968J63798M78453l0422
16768C39752l47009j61927L9975O7005K21468o1609J60695M0178j93295m6835
$$ plain form
16842 223941 120029 44322 206650 161906 241304 341618 166675 -132039 -136602 -138000 -28825
16831 -28825 -212515 -290337 -202248 21013 25896 -10520 -53998 -271414 -264718 -182990 -65222
16820 -65222 -40981 5152 163238 282982 342835 174013 87632 192501 62612 -127060
16810 -127060 -39165 -27130 59230 -92766 -28948 -38597 -81700 17984 -149899 -104897 -197889
16799 -197889 -271151 -334113 -470589 -750986 -547265 -112178 -27518 -15013 104309 135984
16789 135984 88794 66832 -79008 -292125 -216752 -217439 -239365 148661 259152 177135 306307
16778 306307 200554 -96918 -159621 -281720 -203449 -222109 -272077 -108279 370174 339752
16768 339752 -7257 -169184 -129209 -62204 159264 97655 258350 298528 105233 58398
16758E8398K09417q641j28125Q9042j27392j53938K3185J12995r4017m2781J05470
16747D3613J16370k26002N4219J83668j78082J239l3474j21844o6805J30825N0672
16736d5601J2530j4495l0258J15571q485j1820k2845K3852j3504l2756M4222P2747
16724H9158m5583K2944k43537k9099O7652J50978P9181q5647o9943O3065j5539
16713a6370J0634J40776j66022k39232q8477P5573P829r2948J51154Q6894m4610
16702a74799j53668j01364M8810o9688J2690J66886K96432J35823L1335K1788
16692B14245j02901k98694m1907J35313j60387j54817J81293k98452Q8315L67744
16682g0248K10264K11865n9892r2919k39846q6758J61155n1242j90094N1175L76676
$$ plain form
16758 58398 267815 259174 131049 220091 92699 -61239 -38054 74941 -19076 -61857 43613
16747 43613 159983 -66019 -11800 171868 -6214 -4975 -38449 -160293 -227098 -96273 -45601
16736 -45601 -33071 -47566 -77824 37747 29262 17442 -5403 18449 4945 -27811 16411 89158
16724 89158 43575 66519 -177018 -206117 -138465 12513 91694 6047 -63896 -831 -16370
16713 -16370 -5736 135040 -30982 -270214 -358691 -283118 -275289 -368237 -217083 -130189 -174799
16702 -174799 -328467 -429831 -381021 -450709 -438019 -271133 25299 161122 192457 214245
16692 214245 111344 -187350 -229257 -93944 -254331 -409148 -227855 -526307 -437992 -70248
16682 -70248 140016 351881 291989 199070 -40776 -127534 33621 -17621 -207715 -156540 220136
16671B20136M16j38556k42405R0440J82231N5379j46488p7309J15214l17062J40958
16660a17046K32293j6673N1685q2733n1678J78467L22136j93195n44312q3149
16650c04205K06101j31332k35328M2527K34887K29986o6200J463M2751j30016
16640a09366k4062j30063j88341K92053J7789J34871k37809K5510Q7304j7386
16630a49500j222o7004J933r0408k5430J37431j3426L5244N643J01635n591n8535
16618a29230R4142N1221p0998J67730J68997J38460l1286k12864l9736k35520
16608i9084p3844J15332j03311j26381R2455j08218m59718k4558L30890K55967
16598b00470J90622N5827N5691P2199j17253m4416k01677j34508O2005K7420J11169
$$ plain form
16671 220136 220552 81996 -160409 -69969 112262 167641 21153 -56156 59058 -258004 -117046
16660 -117046 115247 98574 150259 67526 15848 194315 516451 323256 -221056 -304205
16650 -304205 -98104 -229436 -464764 -422237 -187350 42636 -23564 -22101 20650 -109366
16640 -109366 -133428 -263491 -451832 -159779 -141990 -7119 -244928 -219418 -132114 -149500
16630 -149500 -150722 -217726 -215793 -306201 -331631 -194200 -207626 -172382 -166739 -65104 -70695 -129230
16618 -129230 -35088 16133 -54865 112865 281862 420322 389036 176172 136436 -99084
16608 -99084 -172928 -57596 -160907 -287288 -194833 -303051 -762769 -787327 -456437 -200470
16598 -200470 -9848 45979 101670 173869 56616 12200 -189477 -323985 -261980 -234560 -123391
16587a23391p1214j61757j78498K31202J83983J03816J27516o4142J37860o7779
16577A17596L4783l8788k25601P1599J25330j30057r6637j12755P7955K60982
16567H4407J83251K7035j51751j86895j9823J50765N5813k46501l7738J93811
16557E2374J34988j28654j78315p0202Q2847n3924k0850J44932J25092j47835
16547e9547K6684M08883J61314j85163k8057J42060L0166l24145l13469K01300
16537F0026K48027q4155j2791r9162j56477L032J49207q3512J22228j09770j99275
16526a62622L59080K10418m27095j12849J36414j39342m1484P6934J02188k19729
16516b18087k19832M7968q898o883K17229K461J63169K88092R3955N9115o5711
$$ plain form
16587 -123391 -194605 -356362 -534860 -303658 -119675 -15859 111657 47515 185375 117596
16577 117596 152379 113591 -112010 -40411 84919 -45138 -141775 -254530 -176575 84407
16567 84407 267658 294693 142942 -43953 -63776 86989 142802 -103699 -141437 52374
16557 52374 187362 58708 -119607 -189809 -106962 -160886 -181736 -36804 88288 -59547
16547 -59547 -32863 376020 537334 352171 324114 466174 496340 172195 -141274 60026
16537 60026 308053 223898 211107 111945 -44532 -41500 107707 24195 146423 36653 -162622
16526 -162622 196458 406876 -20219 -133068 3346 -135996 -177480 -100546 1642 -218087
16516 -218087 -437919 -389951 -398849 -405732 -188503 -186042 -22873 265219 359174 418289 352578
16505C52578l11498k08373O935j91073O5805K28779k15478k82576J67551K11237
16495a76113j69225j08402L13820K8562J35129J7490Q253J60332L4869j31257
16485A13458p6775j52293k36846J43390o0019J14076N8401j43883J64308J16122
16475C9939q7035j89983J01362O7223n8886P1060Q5120Q7236m1972j49554j55820
16464b31310O0664R6208p2396K66163K52465j0680j85168k10364q4081j21186
16454b39685j0397Q1776J37456n8290r3779p8029k5026R6405J57440N4904K07861
16443B30636l05582j99930L8947J37607J17036j7390J03647l9197k14783m442
16433a53451J55445J37386j30258J50981J09333j68552N5896q9513l28344j33244
$$ plain form
16505 352578 41080 -167293 -160358 -351431 -285626 -56847 -272325 -554901 -387350 -176113
16495 -176113 -345338 -453740 -139920 -111358 23771 41261 49514 209846 244715 113458
16485 113458 36683 -115610 -352456 -209066 -269085 -155009 -96608 -240491 -76183 39939
16475 39939 -47096 -237079 -135717 -68494 -127380 -56320 28800 116036 74064 -75490 -231310
16464 -231310 -170646 -74438 -146834 119329 371794 361114 175946 -34418 -118499 -239685
16454 -239685 -250082 -168306 -30850 -89140 -182919 -260948 -285974 -189569 -32129 22775 230636
16443 230636 -74946 -274876 -235929 -98322 18714 1324 104971 65774 -149009 -153451
16433 -153451 1994 139380 9122 160103 269436 100884 156780 67267 -261077 -394321
16423c94321M6020J50569L4792l685j661J73613M3817l25316K0029M7655K95738
16412H7250R615l74200J17438M3241j14752l953j07816r9902M0782o0599N9944
16401d02952K11637L39470Q3278j57703j55245L4662P339M5043O9680j81435j07771
16390b13997j10564J6706j20239k66371J76353K36387J35266K8726r4999q8424
16380c01156j0906j39635n9395J23875J58653L13714L84044l4821l47904o6669
16370A9800K02878L7041J1207K6374K49798k8370N212j53845m781O3299p7782
16359C50831J13905P140M3606P093p6035j60446l8415N2204j1763Q417k05613
16348I0924J0226l4032Q2767J57224Q3040J9763j09613l31723L23727L7807k28857
$$ plain form
16423 -394321 -348301 -197732 -162940 -166625 -168286 5327 49144 -276172 -256143 -208488 87250
16412 87250 96865 -277335 -159897 -116656 -231408 -235361 -343177 -443079 -402297 -462896 -402952
16401 -402952 -191315 148155 231433 73730 -81515 -46853 -39514 5529 75209 -106226 -213997
16390 -213997 -324561 -307855 -428094 -694465 -518112 -281725 -146459 -117733 -212732 -301156
16380 -301156 -312062 -451697 -511092 -387217 -228564 85150 469194 434373 86469 19800
16370 19800 222678 259719 270926 297300 547098 518728 523940 370095 365314 428613 350831
16359 350831 464736 471876 515482 522575 446540 286094 247679 299883 288120 296537 90924
16348 90924 101150 67118 149885 307109 390149 409912 300299 -31424 292303 330110 101253
16337A01253j81060M5628J05243N5532k2595N0071J98601m2260L3978J08080K46059
16326F98530r1024l37707j49451J32272P2492L5501P602M8430p1651q9306r5603
16315A60085J9311m2676J93135m9518j3441M4307o9159p9403j9332p3245N8083
16304A28147o2188J09604R6865j03853j68245K48669P6679j5596n1346j64129
16294I4607J74687P8016l3555k43808N104k24282K29968Q0715J46309J08576q9474
16283C26863P743j7186k00545m2764j33120j79421J64423N1964M0470j18225O507
16272i3291j38797j97487K54649J63081q5183k23162M6863K04433J27645p6058
16262a7307J4732K06461j38721J3496O3685J53719j14872k84601j04648J14406
$$ plain form
16337 101253 -79807 -34179 71064 126596 104001 154072 352673 310413 344391 452471 698530
16326 698530 607506 269799 120348 252620 325112 360613 368215 416645 344994 255688 160085
16315 160085 179396 136720 329855 280337 266896 311203 242044 162641 143309 70064 128147
16304 128147 65959 175563 272428 168575 330 248999 325678 310082 258736 94607
16294 94607 269294 347310 313755 69947 75051 -149231 80737 161452 307761 416337 326863
16283 326863 334606 317420 116875 74111 -59009 -238430 -74007 -22043 18427 -99798 -93291
16272 -93291 -232088 -429575 -174926 -11845 -97028 -320190 -273327 -68894 58751 -17307
16262 -17307 -2575 203886 65165 78661 142346 296065 181193 -103408 -208056 -93650
16252i3650O0882j07586r150P2768j64340j82808J15258K32467j97690m11817
16242f85666n0357L07560J95674j04088J69744K46987J91827J50227j08973j06594
16232B06341j72674l0421n5593m9939J60085j06170n419L0312N6072J04876L2173
16221A69643o9539j98151O9936R7810o4427l17696N6565O021j34127J38434k3763
16210b69294j13010J28156K58386J86886p5893k61325m5747j59638n683K20780
16200a36382j10464M6032K32232J99773l03776k27436P793J33568L33263J30524
16190C05127k54405k48050n8147J67697P6060K604K0072J94891O6225j98563O464
16179G9975L2601Q8283J42150M9914p7183q3840q9538j33593o2138J69001J54288
$$ plain form
16252 -93650 -32768 -140354 -149504 -76736 -241076 -423884 -308626 -76159 -273849 -685666
16242 -685666 -736023 -428463 -232789 -336877 -167133 79854 271681 421908 312935 206341
16232 206341 33667 3246 -52347 -102286 57799 -48371 -53790 -23478 32594 137470 169643
16221 169643 100104 -98047 -28111 69699 5272 -312424 -255859 -249838 -383965 -245531 -269294
16210 -269294 -382304 -254148 4238 191124 115231 -146094 -191841 -351479 -357162 -136382
16200 -136382 -246846 -200814 31418 231191 -72585 -300021 -292228 -158660 174603 305127
16190 305127 50722 -197328 -255475 -87778 -11718 -9114 10958 205849 272074 73511 79975
16179 79975 112576 200859 343009 392923 315740 231900 142362 8769 -53369 115632 269920
16168B69920j06422L8301q6473L1716R88j39322k08801J72699K05044k2066R8621
16157B54205k3762l32633J4918J80183O9903r5311k58278l08938L0363K98253
16147a71097L53282L42907o7858m7217P5054r1420j22572j05572O2418M4349n0018
16136B22256k809n5179o1213j19443N1262o7833l176J66736k52759j73224P7242
16125b18140n3657l3580K15307J32329P9911K06538p1192k99023k42467j00943
16115c84917l2073K14687J3934k43798j71564K94472N7763R4174o8312N8893Q6361
16104h0380P8479j05395J17177k2752j28651l85098K747K19738q3850p4377J42450
16093c19912K04243K3594M4895k28315k73574k8589K92741R1816q6750o7915L23830
$$ plain form
16168 269920 163498 201799 115326 147042 148030 8708 -200093 -27394 177650 155584 254205
16157 254205 230443 -102190 -87272 92911 162814 67503 -190775 -499713 -469350 -171097
16147 -171097 182185 525092 457234 410017 485071 393651 271079 165507 227925 272274 222256
16136 222256 219447 164268 103055 -16388 34874 -32959 -36135 130601 -122158 -295382 -218140
16125 -218140 -271797 -305377 -90070 42259 122170 328708 257516 -41507 -283974 -384917
16115 -384917 -416990 -202303 -188369 -432167 -603731 -309259 -251496 -157322 -225634 -166741 -80380
16104 -80380 -1901 -107296 9881 -12871 -141522 -526620 -523873 -304135 -387985 -462362 -319912
16093 -319912 -115669 -92075 -47180 -275495 -549069 -577658 -284917 -193101 -279851 -347766 -23936
16082b3936K17077K6498j32922j49977k473J91932R4292J01210m9481l41798j96271
16071b65849K38336K51834J05106k44693k11969P8136J54722J39948j31217L7757
16061A52111l0459p1291Q8927Q1772K92879K1920l37549j93868M0970J58938o8232
16050A36118j0525O5266R6469R7699l48425l40689J22600O8284k04066P1033N3285
16039a92951r3820r9227J26801J12077P292j01697J75561j02399k7184O0004j59541
16028b95084j98797J2424P1641N3844L55540n335M5139p2502P9011j94176j82283
16017c30578Q8157q0437J60300O6994k23560j6067n8000q707O019J47799O8887
16006a79193l74146j35528J25949m8134M7218K14099J48824j08055M131J49793
$$ plain form
16082 -23936 193141 219639 86717 -63260 -65733 126199 220491 321701 272220 -69578 -265849
16071 -265849 -27513 224321 329427 84734 -127235 -49099 105623 245571 114354 152111
16061 152111 121652 50361 139288 221060 513939 535859 198310 4442 45412 204350 136118
16050 136118 125593 190859 287328 385027 36602 -304087 -181487 -113203 -317269 -246236 -192951
16039 -192951 -286771 -385998 -259197 -147120 -139828 -241525 -65964 -168363 -195547 -135543 -295084
16028 -295084 -493881 -481457 -409816 -355972 -432 -5767 39372 -33130 45881 -148295 -330578
16017 -330578 -242421 -322858 -162558 -95564 -319124 -335191 -393191 -401898 -395879 -248080 -179193
16006 -179193 -553339 -688867 -562918 -611052 -563834 -349735 -200911 -308966 -304835 -155042
15996a55042N7897j41050j87112n6818l2571p880J09654l6360j03732j19591J7175
15985f55430K42954R3377j5118K21138j13387K01635K2590Q671K4679m5842J43553
15974A28820J83704j64552k33934m0498J33701q7506j00922n9082j49637J78498
15964b11408J54852J16668k12110p2177M855M676K03986j003j4757N3256k6349
15953D89n0808N2549j45986J69158K15469l70881l05614Q7431J91165j47486J27225
15942a77289j8730J08038J92509l6976j76091l9202n9537m0459j03404r7567n8555
15931e07263L4924K87982L11721J50338l4271k09002l26578J34780P5233L0885
15921e1251o2806l6052J13970K02106j04010l18750j62333J10848R4534L423j28456
$$ plain form
15996 -155042 -97145 -238195 -425307 -482125 -514696 -522576 -412922 -449282 -553014 -672605 -655430
15985 -655430 -412476 -319099 -334217 -113079 -226466 -24831 -2241 6430 31109 -14733 128820
15974 128820 312524 147972 -85962 -126460 7241 -80265 -181187 -240269 -389906 -211408
15964 -211408 -56556 60112 -151998 -224175 -219320 -214644 -10658 -11661 -26418 26838 489
15953 489 -50319 2230 -143756 25402 240871 -130010 -435624 -348193 -157028 -304514 -177289
15942 -177289 -196019 -87981 104528 67552 -108539 -147741 -207278 -247737 -351141 -448708 -507263
15931 -507263 -472339 -184357 127364 277702 243431 34429 -292149 -157369 -82136 -51251
15921 -51251 -114057 -150109 -36139 165967 61957 -256793 -419126 -308278 -213744 -210321 -338777
15910c38777j43031K39073P9845N2930J24303j93279J37776P5592J4557J63404
15900B12393J9725j73482j48001J03413j25690r8789P7807J80839k31230k1119
15890b04134N9806l4984r6794r8962L2754r328K08915l9407J3967J92494J53376
15879A77703j09900j45125O2600j33595K30550K07036j85241k76001j74777m3835
15869c90585L59084K01613O7582j30742k0860j31707j16057K0712j17647k8142
15859b86749O14m1864J59433K20399q9775j24891p2097k18016o4699K6933l82683
15848h73395j1581L25252K03358J69154n3016O5462Q596j14075q3876J30188K22877
15837a1056K93485M0733k64567j37709k985q7727J52141j30186j04338L5153J8446
$$ plain form
15910 -338777 -481808 -242735 -162890 -109960 14343 -178936 -41160 34432 48989 212393
15900 212393 232118 58636 -89365 14048 -111642 -210431 -132624 48215 -183015 -204134
15890 -204134 -144328 -179312 -276106 -375068 -342314 -351642 -142727 -182134 -168167 24327 177703
15879 177703 67803 -77322 -14722 -148317 82233 289269 104028 -171973 -346750 -390585
15869 -390585 -31501 170112 237694 106952 86092 -45615 -161672 -140960 -258607 -286749
15859 -286749 -286135 -327999 -168566 51833 -37942 -162833 -234930 -452946 -517645 -490712 -873395
15848 -873395 -884976 -559724 -356366 -187212 -240228 -174766 -166170 -280245 -364121 -233933 -11056
15837 -11056 282429 323162 58595 -79114 -82099 -169826 -17685 -147871 -252209 -217056 -198610
15826a98610p0316j34684J95907K03813j36588P4673j09937K7647J52461P1729
15816G6095M7945k04933r500l7835K895k55240o1411n1624J20658K2663K7611
15805c22676J50708k8120J10390K13361j23947j88270n9297O9618j74700k61756
15795f14689M3742J25368j10027l3963K03132M9067J0235J02825J15205N7124
15785e1981j30349k61556p9284J56867J48374j52203L4673J74383J61804J88093
15775A88821l80870j87161J51055J21844K43751R5146j52178m1234k5846o418
15765F910k8259K4620K57403j41916l25900j12248j0100m0710J10330o8182O8514
15754b59538J26366J6964J60711J75301P7969k29950k56353O9326J9926j74237
$$ plain form
15826 -198610 -268926 -403610 -207703 -3890 -140478 -65805 -175742 -148095 4366 76095
15816 76095 124040 -80893 -90393 -128228 -125333 -380573 -441984 -493608 -372950 -350287 -322676
15805 -322676 -171968 -200088 -89698 123663 -284 -188554 -247851 -178233 -352933 -614689
15795 -614689 -570947 -445579 -555606 -589569 -386437 -337370 -327135 -224310 -109105 -51981
15785 -51981 -182330 -443886 -523170 -366303 -217929 -370132 -335459 -161076 728 188821
15775 188821 -192049 -379210 -228155 -106311 137440 232586 80408 39174 13328 6910
15765 6910 -21349 3271 260674 118758 -207142 -319390 -329490 -370200 -259870 -328052 -259538
15754 -259538 -133172 -116208 44503 219804 297773 67823 -188530 -119204 -99278 -273515
15744b73515j0457j87968l5238J39515J28119K0445n3655n6951k53739n1379j7805
15733f52628J40327J76269Q6418q2044O9594K18965j74173l04567p3984R7132
15723d98691K76665J55023k2218K7019k5420J3025j91063m4951j48162J76152
15713b82621k2769j29982J05435K25083K01437j32686k40497m07784P9247P5691
15703e29446N7442O3381J00048P394j34133j96985P1940j3532R9301J97446k7232
15692c04376K3853m813Q1991K3288j82625j17929K56219J46119j61332k23861
15682d63466J55828J55161k25476R1162J12874j55563J71690k9280J63346j04274
15672a27998q4654K01250J45179k597K4158J3548P8199O1170j50947L9894r22
$$ plain form
15744 -273515 -283972 -471940 -507178 -367663 -239544 -219099 -272754 -329705 -583444 -634823 -652628
15733 -652628 -512301 -336032 -249614 -331658 -262064 -43099 -217272 -521839 -595823 -498691
15723 -498691 -222026 -67003 -89221 -62202 -87622 -74597 -265660 -310611 -458773 -282621
15713 -282621 -305390 -435372 -329937 -104854 96583 -36103 -276600 -684384 -605137 -529446
15703 -529446 -472004 -408623 -308575 -301181 -435314 -632299 -560359 -573891 -474590 -277144 -304376
15692 -304376 -280523 -285336 -203345 -180057 -362682 -480611 -224392 -78273 -239605 -463466
15682 -463466 -307638 -152477 -377953 -286791 -173917 -329480 -157790 -187070 -23724 -127998
15672 -127998 -212652 -11402 133777 131180 155338 168886 247085 308255 157308 197202 196280
15661A96280j55815R6627o1236k68175j00725q1961l3881R5003Q3355k9557J02869
15650a57216J35013j2773k0604L8436K1392M6732J03115O6274j96128j48371j12202
15639b36332j36279J69219j48687k00282J67630M40205L00914j18130k11437k00334
15629a73513j74632k1546J54200r557j46232O2684J92440r9338P8034J42755K5122
15618C0417j76205J13642q5070n1251j2801O0329l3068j66840j53225K6778K40923
15607b06371L49283O8484K384j49382r7034k4826P4301R6867l39638N5129J89273
15596A8470J46683q90m3797m2354k24843k65006J50915K53890M1802Q4693J05555
15585B25118N658J73485J01700j40760L4871j58308P9700J0122O400N0336k61787
$$ plain form
15661 196280 40465 137092 75856 -192319 -293044 -375005 -408886 -313883 -230528 -260085 -157216
15650 -157216 -22203 -34976 -55580 -17144 4248 50980 154095 220369 24241 -124130 -236332
15639 -236332 -372611 -203392 -352079 -552361 -384731 55474 356388 238258 26821 -173513
15629 -173513 -348145 -369691 -215491 -225048 -371280 -308596 -116156 -215494 -137460 5295 30417
15618 30417 -145788 -32146 -117216 -168467 -181268 -120939 -154007 -320847 -474072 -447294 -206371
15607 -206371 142912 211396 213780 64398 -32636 -57462 16839 113706 -225932 -170803 18470
15596 18470 165153 164263 120466 78112 -146731 -411737 -260822 -6932 34870 119563 225118
15585 225118 230776 404261 505961 365201 400072 241764 321464 331586 337986 388322 126535
15574A26535j78856k27067n2725K21240O6109J6415k87540P8250K61891J63343
15564A87595l06315n4364J05479k5411j03591K49840j00977R5097l316N6227J37186
15553B37450l1047k41242n9859J77016l20590L7816M5660k10959q4822j3000l9631
15542e03208K33526L07017n8321q4033K78566l7096j19525J5626K03468k48912
15532a2892M922j24509J38343K0632J38981J61104L1139o1372j50572m4540L5246
15521A36482j1383Q9083R6264q0165k76827m29217r1793J12468J14162M0587J80293
15510a20046J95798L3345o6260N6497j42463P4605k2420q1667J13580K6622j22385
15499e4794J58305j25322j83777J754j11158n1285N1726J07492J58017J02076
$$ plain form
15574 126535 -52321 -279388 -332113 -110873 -44764 -28349 -315889 -237639 24252 187595
15564 187595 -118720 -173084 -67605 -93016 -196607 53233 -47744 47353 44037 100264 237450
15553 237450 206403 -34839 -94698 82318 -238272 -200456 -154796 -365755 -450577 -463577 -503208
15542 -503208 -269682 37335 -20986 -105019 173547 136451 16926 32552 236020 -12892
15532 -12892 -7970 -132479 5864 26496 165477 326581 357720 296348 145776 101236 136482
15521 136482 125099 214182 310446 230281 -46546 -475763 -567556 -455088 -340926 -300339 -120046
15510 -120046 75752 109097 42837 99334 -43129 31476 9056 -72611 40969 67591 -54794
15499 -54794 103511 -21811 -205588 -203834 -314992 -366277 -314551 -207059 -49042 53034
15489E3034M3402N8177m2193o1377r3832j46235m616p603J7783l8054L6213J06026
15477g9275J89064j2941l00638k43510J47166j7821P0008j54362J14146K463p2857
15466c58557J72084O0049K26763R8242O6508K37936q0803j02537j49658l5198
15456A34829J37845K5998j31720l34101P2065q8051r9900J5242Q7353J73796K20472
15445B13828j7920j78155k30657r3730Q5597N7367J5798K3288j58760k3917J46106
15434a61155p9529j19848M9599m1418J94515J18647j89066J23056J4466P2436
15424a8297L3153M0637K40616J60710k42199k06076J44404o4937p2938j3240k6190
15413b4357J9966k2813P0478p4239J28758l6900k45460j39183J07754K7728K6190
$$ plain form
15489 53034 96436 154613 112420 51043 -42789 -189024 -193640 -201243 -183460 -221514 -185301 -79275
15477 -79275 109789 96848 -203790 -447300 -300134 -317955 -247947 -402309 -288163 -285700 -358557
15466 -358557 -186473 -126424 100339 198581 265089 503025 422222 319685 170027 134829
15456 134829 272674 298672 166952 -167149 -95084 -183135 -283035 -267793 -180440 -6644 213828
15445 213828 195908 17753 -212904 -306634 -221037 -163670 -147872 -124584 -283344 -307261 -161155
15434 -161155 -240684 -360532 -310933 -352351 -157836 -39189 -228255 -105199 -90733 -18297
15424 -18297 14856 55493 296109 456819 214620 8544 152948 88011 15073 1833 -24357
15413 -24357 -4391 -27204 43274 -30965 97793 60893 -184567 -323750 -215996 -188268 -162078
15402a62078J43263J23090l11665m90721K44167N20272M0497j29099k97736J36794
15392a83216J39833j10820J50414K57008K25717j40321k15309O2823p13j41178
15382D4238m6615m7319J04203K6111k73221l48896J35130L55506N0774J25211
15372A25122m2625k4744J29575l92988R971J53691J87538O611j5021J45390J28307
15361D10827j24581K63147Q2155l36957m61451j8663J83832m9757L0273L3286
15351A2111j44968j29192K22001R418j96133j04006J85826n6524m9182J10797
15341a39852J48271J17944j02690R3437n3765j78861j54621n1245Q3590J71259
15331f6533J5737p8401N8362R1144R7579r49j38319k24551k21191J8483O6605
$$ plain form
15402 -162078 -18815 104275 -207390 -698111 -453944 66328 106825 -22274 -320010 -183216
15392 -183216 -43383 -154203 -3789 253219 478936 338615 123306 186129 185416 44238
15382 44238 -2377 -49696 54507 80618 -192603 -541499 -406369 -50863 -89 125122
15372 125122 82497 57753 187328 -205660 -195689 -41998 145540 152151 137130 282520 410827
15361 410827 286246 549393 631548 294591 -166860 -185523 -1691 -51448 -21175 12111
15351 12111 -132857 -262049 -40048 -30630 -226763 -330769 -144943 -201467 -250649 -139852
15341 -139852 8419 126363 23673 117110 63345 -115516 -270137 -321382 -237792 -66533
15331 -66533 -50796 -129197 -70835 20309 117888 116939 -21380 -245931 -467122 -448639 -382034
15320c82034j8832j39691P7008Q3762n5207J04395N5465j34672j02012k7767J53047
15309c86538M4221l6905j31873K9573L01958M5209J10347N1737Q606j3553q342
15298A4440L4716K04446j12494m6672m6594K745j33332Q7053R6920P7094k11129
15287c2807j65116L6372k5461P5483K35910k3295k8397l3137o0462J06112j93232
15276a08030j63924O376J42136J09615M2845j78976o5278r8081K11661O5004o5362
$$ plain form
15320 -382034 -400866 -540557 -463549 -379787 -434994 -330599 -275134 -409806 -511818 -539585 -386538
15309 -386538 -342317 -379222 -511095 -481522 -179564 -134355 -24008 27729 36335 22782 14440
15298 14440 49156 253602 141108 94436 47842 50587 -82745 4308 101228 178322 -32807
15287 -32807 -197923 -161551 -187012 -111529 124381 101086 72689 39552 -20910 85202 -108030
15276 -108030 -271954 -265578 -123442 -13827 29018 -149958 -215236 -313317 -101656 -36652 -102014
$$ [...]
##END NTUPLES=NMR SPECTRUM
##END=
