##TITLE=Analysis number 314392
Compound Code rh 00465
Project Code adrs
Chemist Name prosynth
##JCAMPDX= 6.0         $$ Bruker NMR JCAMP-DX V2.0
##DATA TYPE= NMR SPECTRUM
##DATA CLASS= NTUPLES
##ORIGIN= Bruker BioSpin GmbH
##OWNER= NMR
$$ XWIN-NMR		Version 3.5
$$ Tue Oct 18 08:26:37 2005 GMT Daylight Time (UT+1h)  MAYBRIDGE\NMR@NMR_250MHZ
##.OBSERVE FREQUENCY= 250.131544655141
##.OBSERVE NUCLEUS= ^1H
##.ACQUISITION MODE= SIMULTANEOUS (DQD)
##.ACQUISITION SCHEME= undefined
##.AVERAGES= 16
##.DIGITISER RES= 18
##SPECTROMETER/DATA SYSTEM= dpx250
##.PULSE SEQUENCE= zg30
##.SOLVENT NAME= DMSO
##.SHIFT REFERENCE= (INTERNAL, DMSO, 0, 16.522)
##AUDIT TRAIL= $$ (NUMBER, WHEN, WHO, WHERE, WHAT)
$$ ##TITLE= Audit trail, XWIN-NMR		Version 3.5
$$ ##JCAMPDX= 5.01
$$ ##ORIGIN= Bruker BioSpin GmbH
$$ ##OWNER= NMR
$$ C:\u/data/dgb/nmr/ADRS/10890/pdata/1/auditp.txt
$$ ##AUDIT TRAIL=  $$ (NUMBER, WHEN, WHO, WHERE, WHAT)
(   1,<2005-10-18 08:26:16.55 +100>,<MAYBRIDGE\NMR>,<NMR_250MHZ>,
      <created by zg, POWCHK disabled, PULCHK disabled
       configuration hash MD5:
       62 19 C7 07 E1 42 D1 B7 37 6C 3D D0 77 39 F9 E6
       data hash MD5: 64K
       37 C0 F1 8C 16 26 72 07 42 D1 48 F3 73 F7 EA ED>)
(   2,<2005-10-18 08:26:28.35 +100>,<MAYBRIDGE\NMR>,<NMR_250MHZ>,
      <Start of raw data processing
       ef LB = 0.3 FT_mod = 6 PKNL = 1 SI = 32K 
       data hash MD5: 32K
       78 13 35 F4 65 05 AD C7 27 9D 92 D0 8A 9B 2B 34>)
(   3,<2005-10-18 08:26:30.32 +100>,<MAYBRIDGE\NMR>,<NMR_250MHZ>,
      <apk 
       data hash MD5: 32K
       C2 D4 4E CA E9 F4 D7 AA 28 33 D7 9F 56 98 DA 40>)
(   4,<2005-10-18 08:26:31.03 +100>,<MAYBRIDGE\NMR>,<NMR_250MHZ>,
      <abs ABSG = 5 
       data hash MD5: 32K
       89 F3 1E F5 32 AE AE 19 A3 58 EB C0 67 AB FA DF>)
$$ ##END=
$$ 
$$ hash MD5
$$ 82 8A C5 ED D9 AF 4E 3B F2 33 64 E8 1F 20 40 17
##$RELAX= 
##$RELAX= 
##$RELAX= 
##$RELAX= 
##$RELAX= 
##$RELAX= 
##$RELAX= 
$$ Bruker specific parameters
$$ --------------------------
##$DU= <C:\u>
##$EXPNO= 10890
##$NAME= <ADRS>
##$PROCNO= 1
##$TYPE= <nmr>
##$USER= <dgb>
##$AMP= (0..31)
100 100 100 100 100 100 100 100 100 100 100 100 100 100 100 100 100 100 
100 100 100 100 100 100 100 100 100 100 100 100 100 100 
##$AQSEQ= 0
##$AQ_mod= 3
##$AUNM= <au_zg>
##$AUTOPOS= <1 >
##$BF1= 250.13
##$BF2= 250.13
##$BF3= 250.13
##$BF4= 250.13
##$BF5= 500.13
##$BF6= 500.13
##$BF7= 500.13
##$BF8= 500.13
##$BYTORDA= 1
##$CFDGTYP= 0
##$CFRGTYP= 5
##$CHEMSTR= <none>
##$CNST= (0..31)
1 1 145 1 1 1 1 1 1 1 1 1 1 1 1 1 1 1 1 1 1 1 1 1 1 1 1 1 1 1 1 1 
##$CPDPRG= <>
##$CPDPRG1= <>
##$CPDPRG2= <>
##$CPDPRG3= <>
##$CPDPRG4= <mlev>
##$CPDPRG5= <mlev>
##$CPDPRG6= <mlev>
##$CPDPRG7= <mlev>
##$CPDPRG8= <mlev>
##$CPDPRGB= <>
##$CPDPRGT= <>
##$D= (0..31)
0 1 0 0 0 0 0 0 0 0.06 0 0 0 0 0 0 0.0002 0 0 0 0 0 0 0 0 0 0 0 0 0 0 
0 
##$DATE= 1129620375
##$DBL= (0..7)
120 120 120 120 120 120 120 120 
##$DBP= (0..7)
150 150 150 150 150 150 150 150 
##$DBP07= 0
##$DBPNAM0= <>
##$DBPNAM1= <>
##$DBPNAM2= <>
$$ [...]
##$SUBNAM7= <"">
##$SUBNAM8= <"">
##$SUBNAM9= <"">
##$SW= 20.6930455092707
##$SWIBOX= (0..15)
0 0 3 0 0 0 0 0 0 0 0 0 0 0 0 0 
##$SW_h= 5175.983436853
##$TD= 65536
##$TD0= 1
##$TE= 294.16
##$TE2= 300
##$TE3= 300
##$TEG= 300
##$TL= (0..7)
0 120 120 120 120 120 120 120 
##$TP= (0..7)
150 150 150 150 150 150 150 150 
##$TP07= 0
##$TPNAME0= <>
##$TPNAME1= <>
##$TPNAME2= <>
##$TPNAME3= <>
##$TPNAME4= <>
##$TPNAME5= <>
##$TPNAME6= <>
##$TPNAME7= <>
##$TPOAL= (0..7)
0.5 0.5 0.5 0.5 0.5 0.5 0.5 0.5 
##$TPOFFS= (0..7)
0 0 0 0 0 0 0 0 
##$TUNHIN= 0
##$TUNHOUT= 0
##$TUNXOUT= 0
##$USERA1= <user>
##$USERA2= <user>
##$USERA3= <user>
##$USERA4= <user>
##$USERA5= <user>
##$V9= 5
##$VALIST= <valist>
##$VCLIST= <CCCCCCCCCCCCCCC>
##$VD= 0
##$VDLIST= <DDDDDDDDDDDDDDD>
##$VPLIST= <PPPPPPPPPPPPPPP>
##$VTLIST= <TTTTTTTTTTTTTTT>
##$WBST= 1024
##$WBSW= 4
##$XGAIN= (0..3)
0 0 0 0 
##$XL= 0
##$YL= 0
##$YMAX_a= 240775
##$YMIN_a= -242777
##$ZGOPTNS= <>
##$ZL1= 120
##$ZL2= 120
##$ZL3= 120
##$ZL4= 120
##$ABSF1= 16.522
##$ABSF2= -4.171173
##$ABSG= 5
##$ABSL= 3
##$ALPHA= 0
##$AQORDER= 0
##$ASSFAC= 0
##$ASSFACI= 0
##$ASSFACX= 0
##$ASSWID= 0
##$AUNMP= <proc_1d>
##$AZFE= 0.1
##$AZFW= 0.1
##$BCFW= 0
##$BC_mod= 0
##$BYTORDP= 0
##$COROFFS= 0
##$CY= 12.5
##$DATMOD= 1
##$DC= 0
##$DFILT= <>
##$DTYPP= 0
##$F1P= 14.0000005364418
##$F2P= -0.99999901652339
##$FCOR= 0.5
##$FTSIZE= 32768
##$FT_mod= 6
##$GAMMA= 0
##$GB= 0
##$INTBC= 1
##$INTSCL= 1
##$ISEN= 128
##$LB= 0.3
##$LEV0= 0
##$LPBIN= 0
##$MAXI= 10000
##$MC2= 0
##$MEAN= 0
##$ME_mod= 0
##$MI= 0
##$NCOEF= 0
##$NC_proc= -4
##$NLEV= 6
##$NOISF1= 0
##$NOISF2= 0
##$NSP= 0
##$NTH_PI= 0
##$NZP= 0
##$OFFSET= 16.522
##$PC= 1
##$PHC0= -76.19989
##$PHC1= 8.603141
##$PH_mod= 1
##$PKNL= yes
##$PPARMOD= 0
##$PSCAL= 4
##$PSIGN= 0
##$REVERSE= no
##$SF= 250.13
##$SI= 32768
##$SIGF1= 0
##$SIGF2= 0
##$SINO= 400
##$SIOLD= 32768
##$SREGLST= <1H.DMSO>
##$SSB= 0
##$STSI= 32768
##$STSR= 0
##$SW_p= 5175.98343685301
##$SYMM= 0
##$S_DEV= 0
##$TDeff= 65536
##$TDoff= 0
##$TI= <Analysis number 999999
Compound Code 99
Book Reference 9
Project Code 9>
##$TILT= no
##$TM1= 0
##$TM2= 0
##$TOPLEV= 0
##$USERP1= <user>
##$USERP2= <user>
##$USERP3= <user>
##$USERP4= <user>
##$USERP5= <user>
##$WDW= 1
##$XDIM= 32768
##$YMAX_p= 318320413
##$YMIN_p= -320889
$$ End of Bruker specific parameters
$$ ---------------------------------
##NTUPLES= NMR SPECTRUM
##VAR_NAME=  FREQUENCY,     SPECTRUM/REAL,   SPECTRUM/IMAG
##SYMBOL=    X,             R,               I
##VAR_TYPE=  INDEPENDENT,   DEPENDENT,       DEPENDENT
##VAR_FORM=  AFFN,          ASDF,            ASDF
##VAR_DIM=   32768,         32768,           32768
##UNITS=     HZ,            ARBITRARY UNITS, ARBITRARY UNITS
##FACTOR=    0.157963299565203, 1,           1
##FIRST=     4132.6476996994, 0,             0
##LAST=      -1043.33573715361, 0,           0
##MIN=       -1043.33573715361, -320889,     0
##MAX=       4132.6476996994, 318320413,     0
$$ Real data points
##PAGE= N=1
##DATA TABLE= (X++(R..R)), XYDATA
$$ [...]
23144a28819N5608l918K2996o0060m1871j2737k5058k8265J45515L9150j0850
$$ -128819 -73211 -77129 -54133 -114193 -156064 -168801 -193859 -222124 -76609 -37459 -48309
23133d8309P1830J22441M2573j01470n3523k0395p8813n0646K4431P7020j2189
$$ -48309 23521 145962 188535 87065 33542 13147 -65666 -116312 -91881 -14861 -27050
23122b7050r404L8708o103k7388J4010q2597N6571L2823p1991O1622M0739k698
$$ -27050 -36454 2254 -3849 -31237 -17227 -99824 -43253 -10430 -82421 -20799 19940 17242
23110A7242J1732k7538j4893J5571p2744p0975j6520K7561K7844N7243l8068j12770
$$ 17242 28974 1436 -13457 2114 -70630 -141605 -158125 -130564 -102720 -45477 -83545 -196315
23098a96315q186J13O181j5868P0339J66156Q8449m0646q2024m0066j3910j7121
$$ -196315 -204501 -204388 -198207 -214075 -143736 22420 110869 70223 -11801 -51867 -65777 -82898
23086h2898q677M891Q4298N443K8047n055n8509p3988K9538L1870j2918L0955
$$ -82898 -91575 -86684 -2386 3057 31104 26049 -32460 -106448 -76910 -45040 -57958 -27003
23074b7003L7626M0189J0386j6454l4254J8421L1812o8242l8717J0112l9000J101
$$ -27003 10623 50812 61198 44744 10490 28911 60723 -7519 -46236 -36124 -75124 -74023
23062g4023M5035k0885k7696L4418L4107J112n5667k0416O8861P1203O6934p0039
$$ -74023 -28988 -49873 -77569 -43151 -9044 -7932 -63599 -84015 -15154 56049 122983 52944
23050E2944p8095l7416K8212J3170P8707L7288j01393J199L9022m0739K0093m4445
$$ 52944 -25151 -62567 -34355 -21185 57522 94810 -6583 -5384 33638 -7101 12992 -31453
23038c1453n7272M6421L2043O382q9999q2047N9870J0611l9423n4735J0772R662
$$ -31453 -88725 -42304 -10261 -3879 -93878 -175925 -116055 -105444 -144867 -199602 -188830 -179168
23026a79168L8322J18968N4807n7685j9358m3320P3369Q526j39452n246J41176
$$ -179168 -140846 -21878 32929 -24756 -44114 -87434 -14065 -5539 -144991 -150237 -9061
23015i061R5015r8211m1986k1358O690l4934o045n0042j0065N5014L2742R3674
$$ -9061 85954 -12257 -54243 -75601 -68911 -103845 -109890 -159932 -169997 -114983 -82241 11433
23003A1433Q2633p9388j06057j286j5689J7840M1065N5890L042j00029n0643O1349
$$ 11433 94066 14678 -91379 -92665 -108354 -90514 -49449 6441 9483 -90546 -141189 -79840
22991g9840O9378k8118o2561J8945O4637p4351j1368M6676J1066q4182k7603K8471
$$ -79840 -10462 -38580 -101141 -82196 -17559 -91910 -103278 -56602 -45536 -129718 -157321 -128850
22979a28850n2859J8886O2335J2276J5429M7852j3839Q910o724n2297l8396M2346
$$ -128850 -181709 -162823 -100488 -88212 -72783 -24931 -38770 -29860 -36584 -88881 -127277 -84931
22967h4931K5272R9313J1603q3428q8220n652k5615m6197O5019j4581j5905M639
$$ -84931 -59659 39654 51257 -32171 -120391 -126043 -151658 -197855 -132836 -147417 -163322 -158683
22955a58683p2845N1282J47423l0396k8332J3407l3842J0864N5115L2005P6334
$$ -158683 -231528 -180246 -32823 -63219 -91551 -78144 -111986 -101122 -46007 -14002 62332
22944F2332j9193j26466n0832L8963J1526m292j667k5541o212k9851k0537q1677
$$ 62332 43139 -83327 -134159 -95196 -83670 -87962 -89629 -115170 -121382 -151233 -171770 -253447
22932b53447K9341J04911Q2753R701L2133N178o7631o6130k3982L889j5388M9829
$$ -253447 -224106 -119195 -36442 -26741 5392 10570 -57061 -123191 -147173 -143284 -158672 -108843
22920a08843J8249L085M6381L3214j2281l5913q5158r610Q9907j8639n7163k6505
$$ -108843 -90594 -87509 -41128 -7914 -20195 -56108 -141266 -150876 -60969 -79608 -136771 -163276
22908a63276j2180L149K1673P793M5447K2409m4812R8923R8181p784O8951k9491
$$ -163276 -175456 -172307 -150634 -142841 -97394 -74985 -119797 -20874 77307 69523 138474 108983
22896A08983j30978q2989P938L3663k4943M5598K8746L8220m7189J0949K9129
$$ 108983 -21995 -104984 -97046 -63383 -88326 -42728 -13982 24238 -22951 -12002 17127
22885A7127m5705r1177l843K4266r753n7158j8487Q422J22868L7374n9319k1219
$$ 17127 -28578 -119755 -123598 -99332 -109085 -166243 -184730 -176308 -53440 -16066 -75385 -96604
22873i6604m4989P2662L0478M726O0727M4939p4741r7971l5702J8458m77k1149
$$ -96604 -141593 -68931 -38453 -33727 27000 71939 -2802 -100773 -136475 -118017 -118494 -139643
22861a39643j3498P8271L6477K3101n095m4084r6825q2136L8720Q2432Q9538l3196
$$ -139643 -153141 -74870 -38393 -15292 -20387 -64471 -161296 -243432 -204712 -122280 -32742 -65938
22849f5938j35868j1509O5393l700k377O3399N1697N6314p3314q7936L4171P5301
$$ -65938 -201806 -213315 -147922 -151622 -153999 -90600 -38903 17411 -55903 -143839 -109668 -34367
22837c4367k3549N6450j8861p464N7545l7393m9646O9967J133j479N4775j5470
$$ -34367 -57916 -1466 -20327 -27791 29754 -7639 -57285 12682 13815 12336 67111 51641
22825E1641j36883M402M9140L3743M0707k1137k1486J5885p9792j1736R658q9118
$$ 51641 -85242 -80840 -31700 2043 42750 21613 127 16012 -63780 -75516 -65858 -154976
22813a54976p619N5662k6469J6597N8799l5767o912J28308l9138j4396O1557J1990
$$ -154976 -162595 -106933 -133402 -116805 -58006 -93773 -100685 27623 -11515 -25911 35646 47636
22801D7636P281M0788k5513o4080M7979O2467l7684l6124j3837k2366J4879M5068
$$ 47636 54917 95705 70192 6112 54091 116558 78874 42750 28913 6547 21426 66494
22789F6494k27j5424o8753J2009L3153o721k9788r0703K6491N5904P65O2681k8606
$$ 66494 66267 50843 -17910 -5901 27252 20531 -9257 -99960 -73469 -17565 -16800 45881 17275
22776A7275n748j7652n2424j12084k5414L1885L1835R503M2083K0932N1485L0881
$$ 17275 11527 -6125 -58549 -170633 -196047 -164162 -132327 -122824 -80741 -59809 -8324 22557
22764B2557l3556l484k8880k3286K8718l7726p1804l7124N3317J08520O2673K3502
$$ 22557 -10999 -14483 -43363 -66649 -37931 -75657 -147461 -184585 -131268 -22748 39925 63427
22752F3427J9165o6581r4329M3813Q8478M1960j0010J9186N3333r3524j7966k4409
$$ 63427 82592 16011 -78318 -34505 53973 95933 85923 105109 158442 64918 46952 22543
22740B2543J4510r1975m2800r3933J14875J27312J0273l8789k3377j6140j783
$$ 22543 37053 -54922 -97722 -191655 -76780 50532 60805 22016 -1361 -17501 -19284
22729a9284o8926l1724J876n0414L2729L9992J1656J0732j9976N5284M0317k1623
$$ -19284 -88210 -119934 -118058 -168472 -135743 -95751 -84095 -73363 -93339 -38055 2262 -19361
22717a9361j02467l2430N9456Q2926K5187l9951k257O5649Q1982j9234J7684k4063
$$ -19361 -121828 -154258 -94802 -11876 13311 -26640 -28897 36752 118734 99500 117184 93121
22705I3121n7281m7085q2412n8626M3142k476L4969J7479j854q5790K0239R9721
$$ 93121 35840 -11245 -93657 -152283 -109141 -111617 -76648 -59169 -61023 -146813 -126574 -26853
22693b6853L8396j13872m255L8334J6205k601L538J433J638M8828o4642j09424
$$ -26853 11543 -102329 -106584 -68250 -52045 -54646 -51108 -49675 -48037 791 -63851 -173275
22681a73275q5515J10682J46167M3977O2483o4751q3083n6043R535K9448j4837
$$ -173275 -258790 -148108 -1941 42036 104519 39768 -43315 -99358 -89823 -60375 -75212
22670g5212q7777n6967P5302M0390l4818N739l4823j6152J46777J15285P164q2121
$$ -75212 -162989 -219956 -144654 -104264 -139082 -133343 -168166 -184318 -37541 77744 84908 2787
22658B787j09501q3805K762K0423M6004K5022J08499M9866j15507m8583n597O5393
$$ 2787 -106714 -190519 -187757 -167334 -121330 -96308 12191 62057 -53450 -102033 -107630 -42237
22646d2237L348p5134k5770L2270N0694K914l3379l0673M2488M8360n25j9531
$$ -42237 -38889 -114023 -139793 -107523 -56829 -53915 -87294 -117967 -75479 -27119 -27644 -47175
22634d7175p9007L7321J9144K7689K871n3138k5114L0451p387k0105K3481n0912
$$ -47175 -126182 -88861 -69717 -42028 -39157 -92295 -117409 -86958 -94345 -114450 -90969 -141881
22622a41881j6528J25388Q982j12203J1107n1847l2167K0888L6393P750n0011
$$ -141881 -158409 -33021 -24039 -136242 -125135 -176982 -209149 -188261 -151868 -144118 -194129
22611a94129j2479M2639P0907Q631m795Q139J7166j7650K9786j2694q526n3703
$$ -194129 -206608 -163969 -93062 -84431 -89226 -81087 -63921 -81571 -51785 -64479 -73005 -126708
22599a26708q3527J27354M5694p1232l6127n1433j4738J0276P5543N7792K6387
$$ -126708 -210235 -82881 -37187 -108419 -144546 -195979 -210717 -200441 -124898 -67106 -40719
22588d0719Q951q6281j535P4338R2935k6430o1812M6061L472k9554J2775p7599
$$ -40719 -31768 -118049 -119584 -45246 47689 21259 -40553 5508 8980 -20574 -7799 -85398
22576h5398n5624M4659o6628j2001L4722J7609m3203J2268Q7609P674k5454N3126
$$ -85398 -141022 -96363 -162991 -174992 -140270 -122661 -165864 -153596 -65987 -58313 -83767 -30641
22564c0641J9980m1066l3002k6632J35705J7538l6228q1594q901m929j2780k6298
$$ -30641 -10661 -51727 -84729 -111361 24344 41882 5654 -75940 -84841 -89770 -102550 -128848
22552a28848m5581L0010J45892M0662k6408k6517P1035m6748p3406m7979J8287
$$ -128848 -174429 -144419 1473 42135 15727 -10790 60245 13497 -59909 -107888 -89601
22541h9601J04856l3811p9559L5739J3896m7056k7560p6305M8527M6222L7935
$$ -89601 15255 -18556 -98115 -62376 -48480 -95536 -123096 -199401 -150874 -104652 -66717
22530f6717j050o9467p7450n6952K5122J03312P8018M5525k7711J5277l5628J15923
$$ -66717 -67767 -137234 -214684 -271636 -246514 -143202 -65184 -19659 -47370 -32093 -67721 48202
22518D8202J1431n2978o5152k9272L5259L7557M1588j479n0410n0211o4614L9068
$$ 48202 59633 6655 -58497 -87769 -52510 -14953 26635 25156 -25254 -75465 -140079 -101011
22506a01011J02963L2645n4546p0383j25988L8441J02160O4017k9492j08104l0736
$$ -101011 1952 34597 -19949 -90332 -216320 -177879 -75719 -11702 -41194 -149298 -180034
22495a80034J3593j3353j5662l2255L9276N1642J29195P298n7578J1788J7491
$$ -180034 -166441 -179794 -195456 -227711 -188435 -136793 -7598 -300 -57878 -46090 -28599
22484b8599l428J4047n1010n0328o180O1346J2662O2623M162j30753K1137L1488
$$ -28599 -32027 -17980 -68990 -119318 -125498 -64152 -51490 11133 15295 -115458 -94321 -62833
22472f2833K9751j09677k8146j4182O6338R539j3384j6560j2230k9827L9108M1062
$$ -62833 -33082 -142759 -170905 -185087 -118749 -109210 -122594 -139154 -151384 -181211 -142103 -101041
22460a01041M6434K3442R145M376K4552n1628m8328j4471R840M0059j3512l8165
$$ -101041 -54607 -31165 -22020 -17644 6908 -44720 -93048 -107519 -97679 -57620 -71132 -109297
22448a09297k2148q3753O587M8128J08775O0361M2752k1537m8317k2375L4227
$$ -109297 -131445 -215198 -208611 -160483 -51708 8653 51405 29868 -18449 -40824 -6597
22437f597M7585n3484j26502Q4818J3541j6843N6358r101r5953p865M6677M5438
$$ -6597 40988 -12496 -138998 -54180 -40639 -57482 -1124 -10225 -106178 -114043 -67366 -21928
22425b1928K3897k4600l6448k1513M9778M5822l1376o7664k2301J05367J0175
$$ -21928 1969 -22631 -59079 -80592 -30814 15008 -16368 -84032 -106333 -966 9209
22414I209j13639K8715M2858l454m2616o5993K8581M2372l4963R9481J5015j56189
$$ 9209 -104430 -75715 -32857 -36311 -78927 -144920 -116339 -73967 -108930 -9449 5566 -150623
22402a50623k1197Q4204Q9602j475q7484L8267J2593j4432R0157m1068n1562m9541
$$ -150623 -171820 -87616 1986 511 -86973 -48706 -36113 -50545 39612 -1456 -53018 -102559
22390a02559l4356R428M9816Q3730n1686n4708j4272J2145O0974P4173n787j26146
$$ -102559 -136915 -127487 -77671 6059 -45627 -100335 -114607 -102462 -41488 32685 26898 -99248
22378i9248j13324j3733P948k4942L4135M9104M3787J9374n7325q0416K8820M3648
$$ -99248 -212572 -226305 -218357 -243299 -209164 -160060 -116273 -96899 -154224 -234640 -205820 -162172
22366a62172p8902j7439j0183L5881L2968J04739J9711m9175M352O6937m1833
$$ -162172 -241074 -258513 -268696 -232815 -199847 -95108 -75397 -124572 -120220 -53283 -95116
22355i5116j5910m601N0790J3388j713M1036r8363M6728R6750m0939m6735m0777
$$ -95116 -111026 -115627 -64837 -51449 -53162 -12126 -110489 -63761 32989 -7950 -54685 -95462
22343i5462m6613J1731l4566o4337L3609Q8499K8295j7297N8112k0929o3002l9396
$$ -95462 -142075 -130344 -164910 -229247 -195638 -107139 -78844 -96141 -38029 -58958 -121960 -161356
22331a61356k2789M2946L7881j6443N6597N7120l7509p6815P695N3744q236n355
$$ -161356 -184145 -141199 -103318 -119761 -63164 -6044 -43553 -120368 -112673 -58929 -67165 -72520
22319g2520J743J7239o4384N5660P1215k6687k5754o1417l1986j7261k8324K4650
$$ -72520 -70777 -53538 -117922 -62262 8953 -17734 -43488 -104905 -136891 -154152 -182476 -157826
22307a57826O2625m0469J01831P3487j4614l4642M6705R8669k2804p1535N661
$$ -157826 -95201 -135670 -33839 39648 25034 -9608 37097 135766 112962 41427 47088
22296D7088l3997j5603P5240k2878p9163o4378k5575M9576K9831K2401L6238L4499
$$ 47088 13091 -2512 72728 49850 -29313 -93691 -119266 -69690 -39859 -17458 18780 53279
22284E3279o8020j09033R414m1604j2443j257P655N2920j434M3969N2021m207
$$ 53279 -14741 -123774 -114360 -155964 -168407 -169664 -162009 -109089 -110523 -66554 -14533 -18740
22272a8740n9903l6053R1118o2859p7770N3502R0754M0173K5039r117o6571r0825
$$ -18740 -78643 -114696 -23578 -86437 -164207 -110705 -19951 20222 45261 36144 -30427 -121252
22260a21252P1620L6739J102M663M3532J2643L819o3072q4514m1220k4468q4971
$$ -121252 -49632 -12893 -11791 -7128 36404 49047 52866 -10206 -94720 -135940 -160408 -245379
22248b45379n182k4822J8651O3634K3293P2993K7536m1174J1986O4801J9212j9001
$$ -245379 -250561 -275383 -256732 -193098 -169805 -96812 -69276 -110450 -98464 -33663 -14451 -33452
22236c3452M1611L4329k0300M3271n8131r6524m4201j5221j2281Q55M0493j2961
$$ -33452 8159 42488 22188 65459 7328 -89196 -133397 -148618 -160899 -160044 -119551 -132512
22224a32512M3040r392K9477l5790j4389K0623M8849N3965J3319O4387o821q2462
$$ -132512 -89472 -98864 -69387 -105177 -119566 -98943 -50094 3871 17190 81577 74756 -7706
22212g706j03744k5968L4920J2088j5087L2518K2262o6562M5882j6846n651O4863
$$ -7706 -111450 -137418 -102498 -90410 -105497 -72979 -50717 -117279 -71397 -88243 -93894 -29031
22200b9031o0292k488j274M080R595O5431L0259R173j5899l1471p3150k9229K2969
$$ -29031 -89323 -91811 -93085 -89005 -79410 -13979 16280 25453 9554 -21917 -95067 -124296 -101327
22187a01327L0705R4244l2236q7884o8316l7140M1878J24863L0775J5150P6299
$$ -101327 -70622 23622 -8614 -96498 -164814 -201954 -160076 -35213 -4438 10712 87011
22176H7011Q949r0134j72035k8076K7609P2830o0700N5713q055j02255J8593J22914
$$ 87011 95960 5826 -166209 -194285 -166676 -93846 -154546 -98833 -106888 -209143 -190550 -67636
22164f7636R391m1101m3744M5767j4325L3492N8949M3781q4413j09484j2571m3435
$$ -67636 -58245 -99346 -143090 -97323 -111648 -78156 -19207 24574 -59839 -169323 -181894 -225329
22152b25329q9899R83Q7604J48310j5542n6598m3978m880L1527k1218M77L8632
$$ -225329 -315228 -314245 -226641 -78331 -93873 -150471 -194449 -199329 -167802 -189020 -188543 -149911
22140a49911j5629L0484k3290K7311N9404J5775M7706k9004R551Q733n0539k471
$$ -149911 -165540 -135056 -158346 -131035 -71631 -55856 -8150 -37154 -27603 -18870 -69409 -71880
22128g1880k2411k956j4028r1022L2284N4643L6766k444O602J7651K6225R839
$$ -71880 -94291 -97247 -111275 -202297 -170013 -115370 -78604 -81048 -74446 -56795 -30570 -20731
22116b0731l8373l4230l0830P9995N8211J374m9948j9814m7365L1287N7114M9804
$$ -20731 -59104 -93334 -124164 -44169 14042 15416 -34532 -54346 -101711 -70424 -13310 36494
22104C6494n3595j4032J5957M8528j28182l7077K59o6830K9449P3209J12212o7705
$$ 36494 -17101 -31133 -15176 33352 -94830 -131907 -131648 -198478 -169029 -95820 16392 -51313
22092e1313R803M8754k6321N9755p4280j16537O375j09608n4779J12394R8105
$$ -51313 -41510 7244 -19077 40678 -33602 -150139 -143764 -253372 -308151 -195757 -97652
22081i7652m5650m5792L9354k8443M0433N6272M567L2189r086K8185j5298P8633
$$ -97652 -143302 -189094 -149740 -178183 -137750 -81478 -76911 -44722 -53808 -25623 -40921 37712
22069C7712Q203R910m1173q3954r5411k4450R1095N7744p2552r7130M4384R4849
$$ 37712 45915 55825 14652 -69302 -164713 -189163 -98068 -40324 -112876 -210006 -165622 -70773
22057g0773N6170L6640r4903l5551L8479q993l3222O8669P1448l1984m1021q123
$$ -70773 -14603 22037 -72866 -108417 -69938 -78931 -112153 -43484 27964 -4020 -45041 -53164
22045e3164M3616M6509k7545r0531m3953l7153R8525L0122l0893k4837J6497m4824
$$ -53164 -9548 36961 9416 -81115 -125068 -162221 -63696 -33574 -64467 -89304 -72807 -117631
22033a17631k1560K4443q2600j1671J28808j5084J2652L7419K4720o4338l0705
$$ -117631 -139191 -114748 -197348 -209019 -80211 -95295 -82643 -45224 -20504 -84842 -115547
22022a15547O0948j9862n3105J6378M1637J3823L7282m6564n8045J9147o5535
$$ -115547 -54599 -74461 -127566 -111188 -69551 -55728 -18446 -65010 -123055 -103908 -169443
22011a69443K0225j65K9169K4223N4932j7297m4368l0486k2387R1142K2145r1061
$$ -169443 -149218 -149383 -120214 -95991 -41059 -58356 -102724 -133210 -155597 -64455 -42310 -133371
21999a33371j1600R1653O1774p026n8484j4486Q6533K5863m778j8744k6963m0317
$$ -133371 -144971 -53318 8456 1430 -57054 -71540 14993 40856 36078 17334 -9629 -49946
21987d9946K9669l3733Q2594L7278m9981j2437M7080l4793o2331J6863M4006m8147
$$ -49946 -20277 -54010 28584 65862 15881 3444 50524 15731 -46600 -29737 14269 -33878
21975c3878l0507Q048O4266O2812q3995r0485k5812N609j3621O434j4253K1524
$$ -33878 -64385 -56337 7929 70741 -13254 -103739 -129551 -123942 -137563 -131129 -145382 -123858
21963a23858P9866O0259j6471M597m4850k8695p5705m1718J9916N3180R9559J9026
$$ -123858 -43992 16267 -204 4393 -40457 -69152 -144857 -186575 -166659 -113479 -13920 5106
21951E106N4655J12069m2026j22715j05777L5950O404m1762Q969N3950N0118o0603
$$ 5106 59761 171830 129804 7089 -98688 -62738 -56334 -98096 -89127 -35177 14941 -45662
21939d5662J211J0099o9725N537K6459r1859m7545j4519Q6326j8596k3965N908
$$ -45662 -44451 -34352 -104077 -98540 -72081 -163940 -211485 -226004 -139678 -158274 -182239 -176331
21927a76331P5397O7548O2025L9457R319n5421q9072L5917P1149M142j15339l3408
$$ -176331 -100934 -33386 28639 68096 77415 21994 -67078 -31161 39988 44130 -71209 -104617
21915a04617K2392K8072M2952r0382o3419k81J7831L2615O5415N101q5894p5753
$$ -104617 -82225 -54153 -11201 -101583 -165002 -165283 -147452 -114837 -49422 -44321 -130215 -205968
21903b05968N5053L0006L0079L9231k2159j2280k0079j9252q705J7577o1329K3781
$$ -205968 -150915 -120909 -90830 -51599 -73758 -86038 -106117 -125369 -134074 -116497 -177826 -154045
21891a54045M7903J6585k9028m4181Q2396L2600q5305o9012l3854J17080J04856
$$ -154045 -106142 -89557 -118585 -162766 -80370 -47770 -133075 -202087 -235941 -118861 -14005
21880a4005k0596k0795m7598k7456L8791j5892n1932M1646N0103N0848M16r0419
$$ -14005 -34601 -55396 -102994 -130450 -91659 -107551 -159483 -117837 -67734 -16886 -16470 -106889
21868a06889M3989J09865m2063n4229j6709m8051p619m0750J04467L7400l8351
$$ -106889 -62900 46965 4902 -49327 -66036 -114087 -121706 -162456 -57989 -20589 -58940
21857e8940P5810J7525k4592q9414o9285m2416j198Q8175J61336P6232j17467
$$ -58940 16870 34395 9803 -79611 -148896 -191312 -192510 -104335 57001 133233 15766
21846A5766l3054K3504n4326l9610J5477N6191N3556k4268M9005m4041j17033
$$ 15766 -17288 6216 -48110 -87720 -72243 -16052 37504 13236 62241 18200 -98833
21835i8833q9386N1609L0471K5044K1025J6693m553k6218r4491k8455L7608J1538
$$ -98833 -188219 -136610 -106139 -81095 -60070 -43377 -47930 -74148 -168639 -197094 -159486 -147948
21823a47948l9307M8707J31035J04426J4406j16972m7435K441L7723L933j9263
$$ -147948 -187255 -138548 -7513 96913 111319 -5653 -53088 -50647 -12924 -8991 -28254
21812b8254L823M1770j20780j01879N9674J12909R490p0432k5890L1877O5453
$$ -28254 -24431 17339 -103441 -205320 -145646 -32737 -23247 -93679 -119569 -87692 -22239
21801b2239l5045o3762p3526K6531J9867N9241p779O237n2176m8267M525J5592
$$ -22239 -57284 -121046 -194572 -168041 -148174 -88933 -96712 -90475 -142651 -190918 -186393 -170801
21789a70801L0610k4844o990K077M3063Q7250K7931l3997o4438L5906M993k659
$$ -170801 -140191 -165035 -172025 -169948 -126885 -39635 -11704 -45701 -110139 -74233 -69240 -71899
21777g1899k2010l2184p832M3302O861K3984o424M8787j23791k9034R2426J00949
$$ -71899 -93909 -126093 -133925 -90623 -83762 -59778 -66202 -17415 -141206 -170240 -77814 23135
21765B3135K0171p1298J5211l5432r170j5748n762r122J5938j9265l3965J9077
$$ 23135 43306 -27992 -12781 -48213 -57383 -73131 -78893 -88015 -72077 -91342 -125307 -106230
21753a06230Q27q6818L3068J1324j2490P1914K9267l7975L372M763m086P661l7288
$$ -106230 -105403 -192221 -159153 -147829 -160319 -88405 -59138 -97113 -93741 -88978 -93064 -85403 -122691
21740a22691p2824R7972P5983l774L5505l6910r2029m2056O2656l4110n6128K0452
$$ -122691 -195515 -97543 -21560 -25334 10171 -26739 -118768 -160824 -98168 -132278 -188406 -167954
21728a67954l0149o6847P532N8724L0028l826p5314j6179J08739P7542L0215j11303
$$ -167954 -198103 -264950 -257418 -198694 -168666 -172492 -247806 -263985 -155246 -77704 -47489 -158792
21716a58792J8828J4806m7599J4975P9287M5130L3769K033L6657l6339j0100p314
$$ -158792 -139964 -125158 -172757 -157782 -78495 -33365 404 2437 39094 2755 -7345 -14659
21704a4659m8440q7340j9468Q7170O0949J0655O0034l0684q6236l2594K4057M3944
$$ -14659 -63099 -150439 -169907 -82737 -21788 -11133 48901 18217 -68019 -100613 -76556 -32612
21692c2612K5875n5645m9286M4208O516m2870K9235J933p4079n5194l3650L6985
$$ -32612 -6737 -62382 -111668 -67460 -60944 -103814 -74579 -72646 -146725 -201919 -235569 -198584
21680a98584R0141M8970N0748Q6852j5981k561m0646m8384K0155q4837n3662M2255
$$ -198584 -108443 -59473 -8725 78127 62146 59585 18939 -29445 -9290 -94127 -147789 -105534
21668a05534O4579r7102j25469m415j0517P1190J7797J54534O3733j4368k6813
$$ -105534 -40955 -138057 -263526 -267941 -278458 -207268 -189471 -34937 28796 14428 -12385
21657a2385o7177l428N1401N610j14627n9835M4315L3373n6801L1142N1421O9755
$$ -12385 -79562 -82990 -31589 -25979 -140606 -200441 -156126 -122753 -179554 -148412 -96991 -27236
21645b7236K5816l1817j44503j4323P4490p206M3564m50l343K0666m9215j1734
$$ -27236 -1420 -33237 -177740 -192063 -117573 -124779 -81215 -81665 -85008 -64342 -113557 -125291
21633a25291j1905M526k1287k0599L9438Q0351M4816j06267N0090r347j5665m501
$$ -125291 -137196 -132670 -153957 -174556 -135118 -54767 -9951 -116218 -66128 -75475 -91140 -95641
21621i5641p8589K8110p6450k9720Q4332M1703O1069J6418L4304K1050o5022n0752
$$ -95641 -174230 -146120 -222570 -252290 -167958 -126255 -65186 -48768 -14464 6586 -58436 -109188
21609a09188l6388O2331K9440n3935m7192J2778k6181P6407P3896l4593n2684
$$ -109188 -145576 -83245 -53805 -107740 -154932 -142154 -168335 -91928 -18032 -52625 -105309
21598a05309K1559m3205J2552m631m2648P24L1088k6222J3964J4645R6064N3388
$$ -105309 -83750 -126955 -114403 -119034 -161682 -160958 -129870 -156092 -142128 -127483 -31419 21969
21586B1969o82q9199p8771J5319l5605L660L2230o0301k2658O0448O1926K1145
$$ 21969 21287 -67912 -146683 -131364 -166969 -163309 -131079 -191380 -214038 -153590 -91664 -70519
21574g0519n1180M5322P5014m2375J1751J9355k2705m0429o1755K676P0582J0215
$$ -70519 -121699 -76377 -1363 -43738 -31987 -12632 -35337 -75766 -137521 -134845 -64263 -54048
21562e4048j3555q96K6701K5515k1896Q9350n1817l0018Q244j9855j9469l9461
$$ -54048 -67603 -68499 -41798 -16283 -38179 51171 -646 -30664 -22420 -42275 -61744 -101205
21550a01205n0672J8535Q4017K2334l2606l1518N3977O3596o7201R461N5300l4668
$$ -101205 -151877 -133342 -49325 -26991 -59597 -91115 -37138 26458 -40743 -31282 24018 -10650
21538a0650p3145l8952j5484J5164J3766O7479j4163n0173q8279k0453M1947O5644
$$ -10650 -83795 -122747 -138231 -123067 -109301 -41822 -55985 -106158 -194437 -214890 -172943 -107299
21526a07299M9486o722J8976J5120k7365k6974L740M3037N3256J5540L5287k8343
$$ -107299 -57813 -64535 -45559 -30439 -57804 -84778 -81038 -38001 15255 30795 66082 37739
21514C7739m4286J9011L8732M8672o2355q4424J0552n8576n3948O9590j6957p4256
$$ 37739 -6547 12464 51196 99868 37513 -46911 -36359 -94935 -148883 -79293 -96250 -170506
21502a70506M4003J38025M0197q9468m2516q4867k5567N9802N5392J8198k7381
$$ -170506 -126503 11522 51719 -37749 -80265 -165132 -190699 -130897 -75505 -57307 -84688
21491h4688j2084o828L3318J5381K7723J4454q102M0871p6987n6169Q191O475
$$ -84688 -96772 -103600 -70282 -54901 -27178 -12724 -20826 20045 -56942 -113111 -104920 -98445
21479i8445O7018l8666n2195k334k711J5707k4329N6472j7514K6057K7849K3082
$$ -98445 -31427 -70093 -122288 -124622 -127333 -111626 -135955 -79483 -96997 -70940 -43091 -20009
21467b0009l8264L8398J8151j28886l103N0350n6277J5676j3966M4089Q0107j247
$$ -20009 -58273 -19875 -1724 -130610 -133713 -83363 -139640 -123964 -137930 -93841 -13734 -14981
21455a4981m1969L1371o259q3186Q261r764R801O4046R0784j1654o0415k3708
$$ -14981 -56950 -25579 -31838 -115024 -106763 -116527 -106726 -42680 48104 36450 -23965 -47673
21443d7673N1044L7238l8867p9391o0775L8713L2946j7525J2902J789o3352j21410
$$ -47673 3371 40609 1742 -77649 -138424 -99711 -66765 -84290 -71388 -69599 -132951 -254361
21431b54361P4451P1218l6112J828K2832L0952n2J3715L3656J7897m1748k0415
$$ -254361 -179910 -108692 -144804 -142976 -120144 -89192 -89244 -75529 -41873 -23976 -65724 -86139
21419h6139M7288L2826M0390L8204K6113L7199j08895q1722O0771j2959m2378
$$ -86139 -38851 -6025 34365 72569 98682 135881 26986 -54736 6035 -6924 -49302
21408d9302N1987O1857m023l3803o1747m8486j154m9457M389J82141o22n2016
$$ -49302 2685 64542 60519 26716 -35031 -83517 -84671 -134128 -129739 52402 51780 -236
21396b36p2532k3720L2685M0661n1428k3982L1308O0382k4802J6852L1848j11197
$$ -236 -72768 -96488 -63803 -23142 -74570 -98552 -67244 -6862 -31664 -14812 17036 -94161
21384i4161j9026K7250M0637N6190K4713M9699n41l6304m9844n1825o9331m0859
$$ -94161 -113187 -85937 -45300 10890 35603 85302 84761 48457 -1387 -53212 -122543 -163402
21372a63402K8278m1831r4594O4530N3976M4894M8260l4180m0085J2599K4065
$$ -163402 -135124 -176955 -271549 -207019 -153043 -108149 -59889 -94069 -134154 -121555 -97490
21361i7490P6972O086m8137N755r9599R835N2696L7358O0170m0094l8845J728
$$ -97490 -20518 -14432 -62569 -56814 -156413 -146578 -93882 -56524 3646 -36448 -75293 -73565
21349g3565J8011J04762l7025n4883R048P1899M9757k192j9795J8348k3781j8238
$$ -73565 -55554 49208 12183 -42700 -33652 38247 88004 85812 66017 84365 60584 42346
21337D2346j2553K0534L6149J1533n5549k4757m9421j9391L0059m9391N06M6907
$$ 42346 29793 50327 86476 98009 42460 17703 -31718 -51109 -21050 -70441 -69935 -23028
21325b3028J00815l0620p3972p2277Q7631j6149n4905j2995o6795n5152j5904
$$ -23028 77787 47167 -26805 -99082 -11451 -27600 -82505 -95500 -162295 -217447 -233351
21314b33351Q7385Q7083K9989J5816r296K9975L2555q701j44632l6779N5759L6101
$$ -233351 -145966 -58883 -28894 -13078 -22374 7601 40156 31455 -113177 -149956 -94197 -58096
21302e8096J468m223K3734k1142n5939n8629j5455l0537r147J9182p084j037m425
$$ -58096 -56628 -60851 -37117 -58259 -114198 -172827 -188282 -218819 -227966 -208784 -215868 -216905 -221330
21289b21330L118M3428O7582o7566m5922m6720Q6901R6370J03516n8328k2459
$$ -221330 -218212 -174784 -107202 -174768 -220690 -267410 -180509 -84139 19377 -38951 -61410
21278f1410q3944o5362M3813P9943Q1973l3524o3509L3879Q0062M2599j10539
$$ -61410 -145354 -210716 -166903 -86960 -4987 -38511 -102020 -68141 11921 54520 -56019
21267e6019j20375M2569R646M5281M8465L3988M3029J2245m9414m6234O9708R615
$$ -56019 -176394 -133825 -124179 -78898 -30433 3555 46584 58829 9415 -36819 32889 42504
21255D2504n858j30020o0511o4343L0174J44741J26283j30232q6798L6065M6146
$$ 42504 36646 -93374 -153885 -218228 -188054 -43313 82970 -47262 -134060 -97995 -51849
21244e1849J5990K6660J0598k125o627L846L6510J7396n900r974l1537l3224N85
$$ -51849 -35859 -9199 1399 -726 -7353 -3507 33003 50399 44499 34525 2988 -30236 -29651
21231b9651j6698J5459l4379j02003j7826L2823j0931J10324j6253j13306Q7647
$$ -29651 -46349 -30890 -65269 -167272 -185098 -152275 -163206 -52882 -69135 -182441 -94794
21220i4794P7858K1399n6449p1686l7180j00137J02578J38424M0260r5745m0716
$$ -94794 -16936 4463 -51986 -123672 -160852 -260989 -158411 -19987 20273 -75472 -116188
21209a16188M6505O1330l7016k6417K6730o2554k4683Q46M618m12p5152J4080
$$ -116188 -69683 -8353 -45369 -71786 -45056 -107610 -132293 -131447 -126829 -127241 -202393 -188313
21197a88313k3195J8930L5634J9948Q014m8796p8311R6456L6465n26M6486j2088
$$ -188313 -211508 -192578 -156944 -136996 -128982 -177778 -256089 -159633 -123168 -123694 -77208 -89296
21185h9296K0439j8791j00031K2533M0566J1410k0841J276K9013j1102M4916N9584
$$ -89296 -68857 -87648 -187679 -165146 -124580 -113170 -134011 -132735 -103722 -114824 -69908 -10324
21173a0324J4581M7033M9060m9372o4137k4905j4343O1126p1077q728Q7049R0214
$$ -10324 4257 51290 100350 50978 -13159 -38064 -52407 8719 -62358 -71086 15963 106177
21161A06177N866p1017j12738j0147L5748o9529m4114J9680M329r906L539q257
$$ 106177 112043 41026 -71712 -81859 -46111 -115640 -159754 -140074 -135745 -145651 -142112 -150369
21149a50369L4926J4463m805L0599M1434K0840M5202l9740J881M8263m882q7884
$$ -150369 -115443 -100980 -105785 -75186 -33752 -12912 32290 -7450 -5569 42694 37812 -50072
21137e0072k6971l4883k3248j0467O293J9578J24386j4617r323m3305K1969K7383
$$ -50072 -77043 -111926 -135174 -145641 -139348 -119770 4616 -10001 -19324 -62629 -40660 -13277
21125a3277j02485k9611k2856O0794o547M8124R100j082n7430j6098j1077j2267
$$ -13277 -115762 -145373 -168229 -107435 -113982 -65858 -56758 -57840 -115270 -131368 -142445 -154712
21113a54712l2422O2633M8608Q0039j04844p2960K6254N0697J24888l3795q8722
$$ -154712 -187134 -124501 -75893 4146 -100698 -173658 -147404 -96707 28181 -5614 -94336
21102i4336J1625Q3835P8688k6058p0932r975j9334p0338m334O7911J07318O4453
$$ -94336 -82711 1124 79812 53754 -17178 -27153 -46487 -116825 -121159 -53248 54070 118523
21090A18523r3116j18189k8292J13885J11647K1096n7448n7457l1360k2349j2250
$$ 118523 25407 -92782 -121074 -7189 104458 125554 68106 10649 -20711 -43060 -55310
21079e5310k5611n4526L3148j4554O1656N3658O8430k2341j16794j11139n9566
$$ -55310 -80921 -135447 -102299 -116853 -55197 -1539 66891 44550 -72244 -183383 -242949
21068b42949J7409J6128L3097k4296O2016K0514M395O6243O3455M9520n2484O9370
$$ -242949 -225540 -209412 -176315 -200611 -138595 -118081 -113686 -47443 16012 65532 13048 82418
21056H2418N4167k6981P708o197o1152j25284m5603L4465K9973k7004Q388j8883
$$ 82418 136585 109604 117312 111115 49963 -75321 -120924 -86459 -56486 -83490 -75102 -93985
21044i3985q2876N907P1870p060j1875o312J7260K6252K3383K1424Q9794r3380
$$ -93985 -176861 -170954 -99084 -106144 -118019 -124331 -107071 -80819 -57436 -36012 53782 -39598
21032c9598j43673k1386M7827O7182j7503j9470n5758O0299L1382K5709p0825
$$ -39598 -183271 -204657 -156830 -89648 -107151 -126621 -182379 -122080 -90698 -64989 -135814
21021a35814J860N6362n0431k669J06030l3771l8208O137P2884j056l5501l1675
$$ -135814 -133954 -77592 -128023 -130692 -24662 -58433 -96641 -90504 -17620 -18676 -54177 -85852
21009h5852K9972j3331N689L0874k9153M3740K4525j3993k0074M4536P035o2047
$$ -85852 -55880 -69211 -63522 -32648 -61801 -18061 6464 -7529 -27603 16933 23968 -38079
20997c8079n4744m4678P0103J8133j0782j9685j8169P2920k2056N1818L8728L2036
$$ -38079 -92823 -137501 -67398 -49265 -60047 -79732 -97901 -24981 -47037 4781 43509 75545
20985G5545j3837Q3804O3154j3119N448l3194m0340n0338k1820p2538l59N5575
$$ 75545 61708 145512 208666 195547 200995 167801 127461 77123 55303 -17235 -17594 37981
20973C7981O6917l5680j60814l8825M7104L1594J5777R4147J9443o2753r251j24441
$$ 37981 104898 69218 -91596 -130421 -83317 -51723 -35946 58201 77644 14891 5640 -118801
20961a18801j0178N5252L2133L7641k0360n1656k7251M468O7684L8526l6267n1792
$$ -118801 -128979 -73727 -41594 -3953 -24313 -75969 -103220 -98752 -31068 7458 -28809 -80601
20949h0601j0661k7418P8612Q406k6549J6737R595p2383J7761K6737K2460P2556
$$ -80601 -91262 -118680 -40068 -31662 -58211 -41474 -31879 -104262 -86501 -59764 -37304 35252
20937C5252P973l2794j15590r2298O037K9058P4092P4289k4065o4389K5013K5229
$$ 35252 43225 10431 -105159 -197457 -191420 -162362 -88270 -13981 -38046 -102435 -77422 -52193
20925e2193j25868n1878N0669O0524N6274l2026O963j7614K030L4325o923l5296
$$ -52193 -178061 -229939 -179270 -118746 -62472 -94498 -87535 -105149 -103119 -68794 -75717 -111013
20913a11013j711k4298k1671N7374L2349M1690O27k6562j94O0972M4033M1932
$$ -111013 -112724 -137022 -158693 -101319 -68970 -27280 -26653 -53215 -53409 7563 51596 93528
20901I3528J3252l0432j8850r1924k5378m1225m6967p4283p055P791Q126Q0124
$$ 93528 106780 76348 57498 -34426 -59804 -101029 -147996 -222279 -229334 -221543 -213417 -133293
20889a33293K4275L1048J1012K1967K9477M8610m6760k4081n4977M5161J03788
$$ -133293 -109018 -77970 -66958 -44991 -15514 33096 -13664 -37745 -92722 -47561 56227
20878E6227R603j6270Q3151K0256j2995j5139j0699l52j09258o4848o9110K0907
$$ 56227 65830 49560 132711 152967 139972 124833 114134 113782 4524 -60324 -129434 -108527
20866a08527j4510J8454J4733n7098n680P442J5963M0520J6404l3994L7385J23481
$$ -108527 -123037 -104583 -89850 -146948 -152628 -145186 -129223 -88703 -72299 -106293 -68908 54573
20854E4573l4789j28516p9983K0146M5186l0225K6773M2790R469J7817O115m5952
$$ 54573 19784 -108732 -188715 -168569 -123383 -153608 -126835 -84045 -74576 -56759 -50644 -96596
20842i6596o8838k1753J8884M0606M9319K0302k8873p206L3252J5093n8116J0008
$$ -96596 -165434 -187187 -168303 -127697 -78378 -58076 -86949 -94155 -60903 -45810 -103926 -93918
20830i3918P1889K0859n678j24835K3372K5921n0145J1780M1428K7454P459j3594
$$ -93918 -22029 -1170 -6848 -131683 -108311 -82390 -132535 -120755 -79327 -51873 -44414 -58008
20818e8008L2866l7712O624j5146K9194L3825k1978o9317J1237K5822J08552m1844
$$ -58008 -25142 -62854 -56230 -71376 -42182 -8357 -30335 -99652 -88415 -62593 45959 4115
20806D115o8126L5908J0856p0886j13275N3830J08800J8736o2271l104j1792J6294
$$ 4115 -64011 -28103 -17247 -88133 -201408 -147578 -38778 -20042 -82313 -85417 -97209 -80915
20794h0915q055m8251L8542N6807N0952k9886j1948N0485j7130k2358J20301L1750
$$ -80915 -88970 -137221 -98679 -41872 9080 -20806 -32754 17731 601 -21757 98544 130294
20782A30294o6223o8346o3919m2191R342M9294N7275L7640j0756M8040o8406o596
$$ 130294 64071 -4275 -68194 -110385 -101043 -51749 5526 43166 32410 80450 12044 5448
20770E448M5014N320o8239j6812k9231K2840O972k5226o2512L9738o0922j2570
$$ 5448 50462 55782 -12457 -29269 -58500 -35660 -28688 -53914 -116426 -76688 -137610 -150180
20758a50180P1678R9958L306l8428q3698K7319O9706M2343J0005q292j32224m7741
$$ -150180 -78502 21456 24762 -13666 -97364 -70045 -339 42004 52009 43717 -88507 -136248
20746a36248L7317K7608O9350K3016p8575o3352N2022J5142J1067l9861Q9631
$$ -136248 -98931 -71323 -1973 21043 -57532 -120884 -68862 -53720 -42653 -82514 7117
20735G117O7729l4882L8167o962n6190o1404n8952q635J05220R1660L654q9683
$$ 7117 74846 39964 78131 71169 14979 -46425 -105377 -114012 -8792 82868 86522 -3161
20723c161o4627m5251q9380J1426J26046M8899m2828l957Q7015O4415l0893j18263
$$ -3161 -67788 -113039 -202419 -190993 -64947 -16048 -58876 -62833 24182 88597 57704 -60559
20711f0559q0305j8861L6476k484j5843j0953l8082l1199R0951K9666j9789L1743
$$ -60559 -140864 -159725 -123249 -125733 -141576 -152529 -190611 -221810 -130859 -101193 -120982 -89239
20699h9239L6542Q4592n7657l5627N837K2638K0058k8895m0129k6831N357K8220
$$ -89239 -52697 31895 -25762 -61389 -55552 -32914 -12856 -41751 -81880 -108711 -103354 -75134
20687g5134J6745r2303m9361K9598N290j0437N8392J0031K9547O4381K4539n3214
$$ -75134 -58389 -150692 -200053 -170455 -165165 -175602 -117210 -107179 -77632 -13251 11288 -41926
20675d1926l3893J2738j7757l9593K5852k3163m4759R451L2949R08J0857L1212
$$ -41926 -75819 -63081 -80838 -120431 -94579 -117742 -162501 -153050 -120101 -119193 -108336 -77124
20663g7124L0335l3617M1532K6469r8161l369Q7950o3014L2583N1358o7433M7234
$$ -77124 -46789 -80406 -38874 -12405 -110566 -113935 -25985 -88999 -56416 -5058 -72491 -25257
20651b5257K8673k9465q3595q392L0735M4917r082q2802N6964L2952n1163q255
$$ -25257 3416 -26049 -109644 -118036 -87301 -42384 -51466 -134268 -77304 -44352 -95515 -103770
20639a03770k1264r900R7854R5920q623p2970o2760N02N1724p343o3598n8713
$$ -103770 -125034 -134934 -37080 58840 50217 -22753 -85513 -85011 -33287 -40630 -104228 -162941
20627a62941n4881K5736L7694J6264M0969O3022r7536l9272L3720J0012Q6715
$$ -162941 -217822 -192086 -154392 -138128 -97159 -34137 -131673 -170945 -137225 -127213 -40498
20616d0498K5576m3291j5936J8436J4625J8315n1993r1183N465m087K0821N9525
$$ -40498 -14922 -58213 -74149 -55713 -41088 -22773 -74766 -165949 -160484 -164571 -143750 -84225
20604h4225l246p3533j041R7169N9203r942M1417j7620m5513p724K8185N8682
$$ -84225 -87471 -161004 -162045 -64876 -5673 -15615 25802 8182 -37331 -45055 -16870 41812
20592D1812o738m015L05j7974J300L4866p5147l9327k4132K5367k8938L9032Q2235
$$ 41812 35074 31059 31364 13390 14690 49556 -25591 -64918 -89050 -63683 -92621 -53589 28646
20579B8646N5485n520m0058j2583p2917J5928L7414j6028m3315J347J7502K0188
$$ 28646 84131 78611 38553 25970 -46947 -31019 6395 -9633 -52948 -51601 -34099 -13911
20567a3911q747p913r529m0520K7044O8674M7657j24938r805q371M0729o342M6667
$$ -13911 -22658 -30571 -40100 -80620 -53576 15098 62755 -62183 -71988 -80359 -39630 -45972 695
20554F95J2902L9164p8581M6175j044o4823n8421O5382J00156J8794l1936l8984
$$ 695 13597 52761 -25820 20355 19311 -45512 -103933 -38551 61605 80399 48463 9479
20542I479L57j0357N6149Q888L7165o3999m7496m1485q0621k8392J9781O5168
$$ 9479 9836 -521 55628 64516 101681 37682 -9814 -51299 -131920 -160312 -140531 -75363
20530g5363R8318K2811J0937K5761K3438P907k0509Q097m9093j7446j40124p2066
$$ -75363 22955 45766 56703 82464 105902 113809 93300 101397 52304 34858 -105266 -177332
20518a77332m2780K4746L9552J48925J2753k3829j9535j306k9118j6540j5306
$$ -177332 -220112 -195366 -155814 -6889 5864 -17965 -37500 -38806 -67924 -84464 -99770
20507i9770J7154M5612l6706O001P3327R2933o2957n7753L948O740M3825K4003
$$ -99770 -82616 -37004 -73710 -67709 5618 98551 35594 -22159 -18211 -11471 32354 56357
20495E6357m9812k5049k8932j07978K2771N0647N1784K625N5395k5211J3542K6270
$$ 56357 6545 -18504 -47436 -155414 -132643 -81996 -30212 -27587 27808 2597 16139 42409
20483D2409q9400r573Q2319J2842n7464M9962m3384p3183m0293L9882Q103m408
$$ 42409 -46991 -56564 25755 38597 -18867 31095 -12289 -85472 -125765 -85883 -77780 -82188
20471h2188l798N062l6111K5713J1095J9086Q8655N8227j19922k3423R86L5626
$$ -82188 -85986 -80924 -117035 -91322 -80227 -61141 27514 85741 -34181 -57604 -56618 -20992
20459b0992q092M4861M4053k0924N4533M9934n2225q7776j14431R281O0152O9439
$$ -20992 -29084 15777 59830 38906 93439 143373 91148 3372 -111059 -101778 -41626 27813
20447B7813L7521k3084k5272M3828l1568l203r5174m095O5406L8202p8800m1312
$$ 27813 65334 42250 16978 60806 29238 26035 -69139 -73234 -7828 30374 -48426 -89738
20435h9738m1769j7660O5255J0678L8488j4532m9070k606R693K7881K2500m6294
$$ -89738 -131507 -149167 -83912 -73234 -34746 -49278 -98348 -100954 -91261 -63380 -40880 -87174
20423h7174O236M6534m6824l816R846R4101O6750k7624j14598O0799L279k2064
$$ -87174 -80938 -34404 -81228 -85044 -75198 18903 85653 58029 -56569 4230 7509 -14555
20411a4555K069l2277j4804j9724q7080P7539L081l213P2525n377j3802Q1978
$$ -14555 -12486 -44763 -59567 -79291 -166371 -88832 -85751 -88964 -16439 -21816 -35618 46360
20399D6360O3228N5540K4863j18528J5243O8301j856n1727j0143K5786N57j10602
$$ 46360 109588 165128 189991 71463 86706 155007 153151 101424 91281 117067 117624 7022
20387G022J6757m4051m2820o72P8951k0697r3035p3139P6989J0322M3417Q914
$$ 7022 23779 -20272 -63092 -63764 15187 -5510 -98545 -171684 -94695 -84373 -40956 -32042
20375c2042r308O2884m5790k8324N3536l286L6081K3409j7252J138j406j3467
$$ -32042 -41350 21534 -24256 -52580 956 -2330 33751 57160 39908 41046 39640 26173
20363B6173j8423p4792L203N8384R1112r9671j7841J4202j2726L0331K500r9161
$$ 26173 7750 -67042 -63839 -5455 85657 -14014 -31855 -17653 -30379 -48 2452 -96709
20351i6709j1788J10943K5950q6179m3121P0439O5286n6877p8447O696k5242M4300
$$ -96709 -108497 2446 28396 -57783 -100904 -30465 34821 -22056 -100503 -93807 -119049 -74749
20339g4749n8617N9455n5545J8149O9845O1647J0577j12247r4149J08305Q5442
$$ -74749 -133366 -73911 -129456 -111307 -41462 20185 30762 -81485 -175634 -67329 18113
20328A8113l759o1304k5989O3484O494Q387l1901l894N7764k732J7719M3130j10777
$$ 18113 14354 -46950 -72939 -9455 -2961 5426 -26475 -30369 27395 24663 42382 85512 -25265
20315b5265m6536Q8124O5460j3596p63J7221q4110j7293L8657m6456k1797P123
$$ -25265 -71801 16323 81783 68187 67424 84645 535 -16758 21899 -24557 -46354 -39231
20303c9231L6897k7722O548N2984K8035l4919M8359J0186K7875O9983j8303k4667
$$ -39231 -2334 -30056 -23508 29476 57511 22592 70951 81137 109012 178995 160692 136025
20291A36025l0929o5550j37113q8406J4564J27408Q3426K3375p020m064L664l3689
$$ 136025 105096 39546 -97567 -185973 -171409 -44001 39425 62800 55780 51716 55380 21691
20279B1691k9058K1484N6477l5866q4164J8681L5542l9506k7695j5112k5164J382
$$ 21691 -7367 14117 70594 34728 -49436 -30755 4787 -34719 -62414 -77526 -102690 -101308
20267a01308K1713K1207m1271p6466K8628O5426P312K7345n8242P7310J31984
$$ -101308 -79595 -58388 -99659 -176125 -147497 -82071 -74759 -47414 -105656 -28346 103638
20256A03638q616o7780o0794q2708Q77j6762N0578L6245l7193j1845R5481J06679
$$ 103638 95022 27242 -33552 -116260 -115383 -132145 -81567 -45322 -82515 -94360 1121 107800
20244A07800Q0494p8217j15246J9522Q175j4296K9399Q34n5059J8204k5311j1164
$$ 107800 188294 110077 -5169 14353 22528 8232 37631 38465 -16594 1610 -23701 -34865
20232c4865l7347k3769Q6660M4973j1069n8692p8588l7299P3243M3754j9180m3075
$$ -34865 -72212 -95981 -9321 35652 24583 -34109 -112697 -149996 -76753 -32999 -52179 -95254
20220i5254J0856O8611l894l4800L5769L1007K8516o0144m3383k8938j8618o4666
$$ -95254 -84398 -15787 -19681 -54481 -18712 12295 40811 -19333 -62716 -91654 -110272 -174938
20208a74938J6544L180j3735J8151p169L2134Q5882L3108K1254L217k665n1005
$$ -174938 -158394 -155214 -168949 -150798 -157967 -125833 -39951 -6843 14411 17628 14963 -36042
20196c6042l2723m388l5840N0923P3071o3700p7269l2971l7530J01649R209N5230
$$ -36042 -68765 -73153 -108993 -58070 15001 -48699 -125968 -158939 -196469 -94820 -85611 -30381
20184c0381J0928m5252J5554J1288k1429J3250J4041p8153l6922N2476M9308j9664
$$ -30381 -19453 -64705 -49151 -37863 -59292 -46042 -32001 -110154 -147076 -94600 -45292 -64956
20172f4956J420K564k1356N6226K769j4831j16154L7850O8654O4356O655k5950
$$ -64956 -63536 -60972 -82328 -26102 -23333 -38164 -154318 -116468 -47814 16542 23197 -2753
20160b753l9876p4759J03541l249r1577P852J60349K1996k6515R054L2099k8132
$$ -2753 -42629 -117388 -13847 -17096 -108673 -100821 59528 81524 55009 64063 96162 68030
20148F8030o6141k9238J6234J03704O8542J2673j09888p9148l8709l4780J5558
$$ 68030 1889 -27349 -11115 92589 161131 173804 63916 -15232 -53941 -88721 -73163
20137g3163L248N6579J0175n8695K3713L1488M5683l6425L7451O5450j0308O850
$$ -73163 -69915 -13336 -3161 -61856 -38143 -6655 39028 2603 40054 105504 95196 102046
20125A02046L001n4818o9522l3139k4458j1725j9572L476K1291M025k0556p1686
$$ 102046 105047 50229 -19293 -52432 -76890 -88615 -108187 -104711 -83420 -79395 -99951 -171637
20113a71637M4939l8613k1802P9185L9516J0723n7426L8112M7648N879n7046j8452
$$ -171637 -126698 -165311 -187113 -107928 -68412 -57689 -115115 -77003 -29355 -23476 -80522 -98974
20101i8974j2839K0026J8975R365j5110O7896M8179P8853j6315p938r7066o6513
$$ -98974 -111813 -91787 -72812 -63447 -78557 -10661 37518 116371 100056 92118 -4948 -71461
20089g1461p9721l2544M6731J02826R1221J9769j07621M7339Q2520o5451j87410
$$ -71461 -151182 -183726 -136995 -34169 57052 76821 -30800 16539 99059 33608 -153802
20078a53802o3907l7044O7547J07330Q6090k7309P1604Q2284k5678j41155j03438
$$ -153802 -217709 -254753 -187206 -79876 6214 -21095 50509 132793 107115 -34040 -137478
20067a37478l0498Q7513M8847j461O6635m9582n2079K2440k6974k031N061q892
$$ -137478 -167976 -80463 -31616 -33077 33558 -16024 -68103 -45663 -72637 -74668 -69607 -78499
20055g8499O7951j7808o0024R0679J09246n8041K5926M3166j07348m8582L037
$$ -78499 -10548 -28356 -88380 2299 111545 53504 79430 122596 15248 -33334 -30297
20044c0297q1516J8958o562P884K0657r353n745M6187J01142j9229p081M21o752
$$ -30297 -111813 -92855 -99417 -91533 -70876 -80229 -85974 -39787 61355 42126 35045 35466 28714
20031B8714M6848R3232l3201n5679m7820l4272j8919P4101n948k3519J9084M9132
$$ 28714 75562 168794 135593 79914 32094 -2178 -21097 53004 47056 23537 42621 91753
20019I1753k180n4279K6766p9553q1105K5406Q0334n390O46o7159k953K134K1462
$$ 91753 89573 35294 62060 -17493 -98598 -73192 7142 1752 2398 -64761 -67714 -65580 -44118
20006d4118M5190o3327j5435K3518k9713l6670j6305J5047M7180n2125n0469K459
$$ -44118 1072 -62255 -77690 -54172 -83885 -120555 -136860 -121813 -74633 -126758 -177227 -174768
19994a74768J7272L549N7497K0190J8922O2488N372q0001k5688j0521l1578p3100
$$ -174768 -157496 -153947 -96450 -76260 -57338 5150 10522 -69479 -95167 -105688 -137266 -210366
19982b10366Q2582J42726J5879j6062M9849k132L217k7729J90M6569K538k3365
$$ -210366 -127784 14942 30821 14759 64608 62476 65693 37964 38154 84723 87261 63896
19970F3896M4898l323m1103j511j402m0247l7591J5164j1497L7882P4169O2091
$$ 63896 108794 105471 64368 62857 61455 21208 -16383 -1219 -12716 25166 99335 161426
19958A61426j3103j65325j12130L2451P0810k6917L5794J373r952k8711J817R9518
$$ 161426 148323 -17002 -129132 -96681 -25871 -52788 -16994 -15621 -25573 -54284 -52467 47051
19946D7051O4417o5737j56130r4391k1105j479J00229O9091O6487Q551j08761
$$ 47051 111468 45731 -110399 -204790 -225895 -227374 -127145 -58054 8433 16984 -91777
19935i1777K3476r747p5079K794k2030M9113l108J9228n2575M7836M2960l0589
$$ -91777 -68301 -78048 -153127 -150333 -172363 -123250 -126358 -107130 -159705 -111869 -68909 -99498
19923i9498J3537K2023J7271M6537r0918L102R587J2385K3159k6261r517O2215
$$ -99498 -85961 -63938 -46667 -130 -91048 -87946 -78359 -65974 -42815 -69076 -78593 -16378
19911a6378k4540n0957q9142K2407k2569k0556L4182j3796K25K0764R2679l180
$$ -16378 -40918 -91875 -181017 -158610 -181179 -201735 -167553 -181349 -181124 -160360 -67681 -70861
19899g0861q5282N2942J12778j7151m9206j7847k8642M5446K6990k8854J1501
$$ -70861 -156143 -103201 9577 -7574 -56780 -74627 -103269 -57823 -30833 -59687 -48186
19888d8186o435L7019k513l8631M629m8299l30r009M6522j3068j4326P0987L4369
$$ -48186 -54621 -17602 -20115 -58746 -54117 -102416 -102746 -111755 -65233 -78301 -92627 -21640 12729
19875A2729o2327q3125o3739K6603J8921L4464N563k6830K6465K8664L6695L9242
$$ 12729 -49598 -132723 -196462 -169859 -150938 -116474 -110911 -137741 -111276 -82612 -45917 -6675
19863f675J6688m1003M179r232n96J663o7888m3315L3746J12801K7863l0277J0526
$$ -6675 10013 -30990 -26811 -36043 -36639 -34976 -102864 -146179 -112433 368 28231 -2046 8480
19850H480J5856n0637K8283Q6511L1555m8959k2161M5187k0124q8777L9278R037
$$ 8480 24336 -26301 1982 88493 120048 71089 48928 94115 73991 -14786 24492 33529
19838C3529l7918j0551m6862J0108m1564R5J0057P8020J30688M0315q6767p9402
$$ 33529 -4389 -14940 -61802 -51694 -93258 -93163 -83106 -5086 125602 165917 79150 -252
19826b52n8683J2625J02973M0814M087J0915J39567P4830M2975J48102N515l6682
$$ -252 -58935 -46310 56663 97477 101564 112479 252046 326876 369851 517953 523468 486786
19814D86786L1693n5983m4613j7669r1290r9773j29633o9652J8182K4845p811
$$ 486786 518479 462496 417883 400214 308924 209151 79518 9866 28048 52893 45082
19803D5082J2271J1966M3566k3450j42132m9605J8807J2663L1859J21504N4673
$$ 45082 57353 69319 112885 89435 -52697 -102302 -83495 -70832 -38973 82531 137204
19792A37204m1572l2344p314J093P0455K4032l7982o5611n7204m8157j6152K5130
$$ 137204 95632 63288 55974 57067 127522 151554 113572 47961 -9243 -57400 -73552 -48422
19780d8422J2197p0157j9872N9454K7598K7313O6668k4961K8075k7890O2461J9506
$$ -48422 -36225 -106382 -126254 -66800 -39202 -11889 54779 29818 57893 30003 92464 111970
19768A11970J25436M5094J3459N4737M5100J26025J6678k8261O001J4414m4100
$$ 111970 237406 282500 295959 350696 395796 521821 538499 510238 516239 530653 486553
19757D86553j03196j18705m5220p390q5183o4604K8083j6213n2061K8170M324
$$ 486553 383357 264652 219432 212042 126859 62255 90338 74125 22064 50234 54558
19746E4558j4295J34673L5500r2405j57385n0756P3292J6471O2843O9077K8107
$$ 54558 40263 174936 210436 118031 -39354 -90110 -16818 -347 62496 131573 159680
19735A59680K2970q6066p9393L5157n7917l7883j6357K2134Q308l8016m886n360
$$ 159680 182650 96584 17191 52348 -5569 -43452 -59809 -37675 -29367 -67383 -72269 -77629
19723g7629K0033l0657O60j7981J22816J23229k3586r6422q6053m036k4023l6748
$$ -77629 -57596 -88253 -87593 -105574 17242 140471 116885 20463 -65590 -69626 -93649 -130397
19711a30397M9472M8576K6873m897K2906K9527P4946k2055j5851q704L6258k9235
$$ -130397 -80925 -32349 -5476 -10373 12533 42060 117006 94951 79100 70396 106654 77419
19699G7419r5360j926M0317M355N8735O0752p0089q3666L7452O1374l9922m4258
$$ 77419 -17941 -19867 20450 24805 83540 144292 74203 -9463 27989 89363 49441 5183
19687E183k8981J6105J2569k8242j0381K0022K9256o9286n9871K2796M0919k395
$$ 5183 -23798 -7693 4876 -23366 -33747 -13725 15531 -53755 -113626 -90830 -49911 -52306
19675e2306j5767j4570l284M5993J2536n3029m2517L2336M5923m2830j9605l5536
$$ -52306 -68073 -82643 -85927 -39934 -27398 -80427 -122944 -90608 -44685 -87515 -107120 -142656
19663a42656K2578M9171K2360l8129K1208J0347K169n1539o9615J12953R9752
$$ -142656 -120078 -70907 -48547 -86676 -65468 -55121 -52952 -104491 -174106 -61153 38599
19652C8599l2368n2295n4726j3423K397J9227J4414K7500M6239K2815R24m1881
$$ 38599 6231 -46064 -100790 -114213 -111816 -92589 -78175 -50675 -4436 18379 19303 -22578
19640b2578n5770n635k9112j8864L8310L3712L1196L0021r8558M6527O4984L9936
$$ -22578 -78348 -83983 -113095 -131959 -93649 -59937 -28741 1280 -97278 -50751 14233 54169
19628E4169O3404j1293m0076L6113n916k0190o5752n0370o210O4508N5025K9992
$$ 54169 117573 106280 66204 102317 96401 76211 10459 -39911 -46121 18387 73412 103404
19616A03404o9901l4717m2817l6772l3799R1783K7422j06701j79Q0723K7204K3583
$$ 103404 33503 -1214 -44031 -80803 -114602 -22819 4603 -102098 -102277 -21554 5650 29233
19604B9233j0089r4196k0756J2325M6851m2469p274N0723K8515K5214N4337Q0209
$$ 29233 19144 -75052 -95808 -83483 -36632 -79101 -86375 -35652 -7137 18077 72414 152623
19592A52623j1503R937Q209j02211p2105l6277M4961N8726M7027n53k8880r5176
$$ 152623 141120 151057 159266 57055 -15050 -51327 -6366 52360 99387 98834 69954 -25222
19580b5222m3189L5007k68J0305J3190N3981J5739k8158k1346k7115K454J2556
$$ -25222 -68411 -33404 -33672 -23367 -10177 43804 59543 31385 10039 -17076 -14622 -2066
19568b066O0249K7524M6056m7924k5978k5088k641N7154R756m7830j00968J18151
$$ -2066 58183 85707 131763 83839 57861 32773 30132 87286 97042 49212 -51756 66395
19556F6395L347q328R5453O8558j6238N1652l7611p9345N3272J46568K8743j40008
$$ 66395 69742 61414 156867 225425 209187 260839 223228 143883 197155 343723 372466 232458
19544B32458P988l1413j8585L9931m1407k8862q7474n3650K2821K4786k3650l9949
$$ 232458 240446 209033 190448 230379 188972 160110 72636 18986 41807 66593 42943 2994
19532B994J4337J4812N0836N6142L3118m4512o8359P240L7152L4853J5521Q880
$$ 2994 17331 32143 82979 139121 172239 127727 59368 66608 103760 138613 154134 163014
19520A63014k4996l7509k6550m1594j00119j16536K3173L7519O1646Q2480j4350
$$ 163014 138018 100509 73959 32365 -67754 -184290 -161117 -123598 -61952 20528 6178
19509F178K1551K6983J348q828M9506k7285q149K8727K3759j7069l6029m310p8617
$$ 6178 27729 54712 56060 47232 96738 69453 61304 90031 113790 96721 60692 56382 -22235
19496b2235p782n2087M2437L3469l2499J5009j3509m5856N831L1253J16723P3310
$$ -22235 -30017 -82104 -39667 -6198 -38697 -23688 -37197 -83053 -77222 -45969 70754 144064
19484A44064q3525l7971K4939O1257N686M393o1302n6838m9174R286M3570M3058
$$ 144064 60539 22568 47507 108764 114450 118843 57541 703 -48471 -39185 4385 47443
19472D7443Q0249J8943M7922K2895k5578r801p1474m2569j134k6194p9299j1703
$$ 47443 127692 146635 194557 217452 191874 182073 110599 68030 66896 40702 -38597 -50300
19460e0300M1582m2304o1698M7376j354J8051j6799p0569L0269P9233R334M014
$$ -50300 -8718 -51022 -112720 -65344 -66698 -48647 -65446 -136015 -105746 -26513 -17179 -13165
19448a3165K0181O396l5847j0845K5146O835K7077K8064n18p7980L1998J09422
$$ -13165 7016 13412 -22435 -33280 -8134 -1299 25778 53842 53324 -24656 7342 116764
19436A16764R671Q853j3627Q1741m7747N953n8422j13860J0969K6142J08349m6623
$$ 116764 126435 135288 121661 203402 155655 161608 103186 -10674 295 26437 134786 88163
19424H8163m8244O9676J55p3611q2520m201L6905O8118j9218L469o1604P9782
$$ 88163 39919 109595 109750 36139 -46381 -50582 -13677 54441 35223 38692 -22912 56870
19412E6870L4301p173N5687J28137K2662o9519q890n3562K6574j9064n2020j10121
$$ 56870 91171 83998 139685 267822 290484 220965 212075 158513 185087 166023 114003 3882
19400C882k039O0394J23805O1242k0552n8327j9479K3582q2132p9077P3481L8485
$$ 3882 1843 62237 186042 247284 226732 168405 148926 172508 90376 11299 84780 123265
19388A23265L6838m6549j9197Q946K8975l7637L313Q512q897j6353N1099L9626
$$ 123265 160103 113554 94357 103303 132278 94641 97954 106466 97569 81216 132315 171941
19376A71941l3004M2743N2615N5355M5960l0200L4639J46721Q9836n264L8109
$$ 171941 138937 181680 234295 289650 335610 305410 340049 486770 576606 571342 609451
19365F09451M0634M1511K3780j4130J33929j0216j25313n1797p689o3448j0810
$$ 609451 650085 691596 715376 701246 835175 824959 699646 647849 640160 576712 565902
19354E65902K7699j008N6356K3556p0190o7596j15157J0670n701o079L4975O5953
$$ 565902 593601 592593 648949 672505 602315 534719 419562 430232 424531 418452 453427 519380
19342E19380P1928l3738j32569l4488M1621N1407J1755L8399O1224K5323K007
$$ 519380 591308 557570 425001 390513 432134 483541 495296 533695 594919 620242 622249
19331F22249O1830L1463J14309P5877Q5865n912r7863N0796J17487J43206J63975
$$ 622249 684079 715542 829851 905728 991593 985681 887818 938614 1056101 1199307 1363282
19320A363282J95665K76728J58550O3942J2353O6380J14739R0794R6027K80621
$$ 1363282 1558947 1835675 1994225 2058167 2070520 2136900 2251639 2342433 2438460 2719081
19310B719081L96401N86532Q37943J088002J516904K146977K319050J633891K5517
$$ 2719081 3115482 3702014 4539957 5627959 7144863 9291840 11610890 13244781 13270298
19301A3270298j273968j328014p23949j35685M66589J085173J827587L077516
$$ 13270298 11996330 10668316 9944367 9808682 10275271 11360444 13188031 16265547
19293A6265547N403462R590575J5872881K1618116K1319517J1331107l422629
$$ 16265547 21669009 31259584 47132465 68750581 90070098 101401205 97978576
19286I7978576q183610q281N114476J66019j1613061j9314122j6224144j0533903
$$ 97978576 89794966 89786685 94901161 95067180 83454119 64139997 47915853 37381950
19278C7381950o729315m460050l039900k188764j902677j687010j288534j044068
$$ 37381950 30652635 26192585 23152685 20963921 19061244 17374234 16085700 15041632
19270A5041632r91028j149213j130783r69679q83500p59755q16630o47566m51430
$$ 15041632 14050604 12901391 11770608 10800929 9917429 9157674 8341044 7693478 7242048
19261G242048m23364k64877l06087l61513l03279k05003p3880n024o4988r2226
$$ 7242048 6818684 6553807 6247720 5886207 5582928 5377925 5304045 5299021 5234033 5141807
19251E141807j8363J22510K81988K75721K67978L14077O65546Q41396J035794
$$ 5141807 5123444 5245954 5527942 5803663 6071641 6385718 7051264 7892660 8928454
19242H928454J654964K742486M627688P886344J2947532J8474567K0251471J4503157
$$ 8928454 10583418 13325904 17953592 25839936 38787468 57262035 77513506 92016663
19234I2016663L299711k725351M015541J1163226O956582q405470k3008573k2465920
$$ 92016663 95316374 92591023 96606564 107769790 114726372 106320902 83312329 60846409
19226F0846409j4787842r037314n724383l904482k731437j927276j023539j94186
$$ 60846409 46058567 37021253 31296870 27392388 24660951 22733675 21710136 21515950
19218B1515950P02177J375846J208506l49287k550953l761455l282403k441686
$$ 21515950 22218127 23593973 24802479 24453192 21902239 18140784 14858381 12416695
19210A2416695j903218j400312j045554p77256o49664m33866l32320k56042j15780
$$ 12416695 10513477 9113165 8067611 7290355 6640691 6206825 5874505 5618463 5502683
19201E502683j42577l47812n67007o76588n15927l25285l09026k83659k26921
$$ 5502683 5360106 5012294 4445287 3768699 3252772 2927487 2618461 2334802 2107881
19192B107881j94177j05062j08119j55010n6887j0361o9540j36864j65403j46001
$$ 2107881 1913704 1808642 1700523 1545513 1488626 1478265 1408725 1271861 1106458 960457
19182I60457q9209n1066m8354m8754k9042p3906j06151p2910K9071N1140m710
$$ 960457 871248 820182 771828 723074 694032 620126 513975 441065 470136 521276 516566
19171E16566q9518m8086K25L9958J4223m4171o6307l7035O878J8593q0203k3831
$$ 516566 427048 378962 379187 419145 433368 389197 322890 285855 292733 311326 231123 207292
19159B07292L8652J5225k299P2741k1430k4103q789J1720L3407K8378J3826J1792
$$ 207292 245944 261169 258870 331611 310181 286078 277289 289009 322416 350794 364620 376412
19147C76412L0376L7964m0676q6328j08334m3947Q5J3095k7807r523N2670N3391
$$ 376412 406788 444752 404076 317748 209414 165467 165552 178647 150840 141317 193987 247378
19135B47378P4163N0686O52n9846p260j0133q4567p2996J2111l591p046p7240
$$ 247378 321541 372227 372879 313033 305773 295640 211073 138077 150188 146597 139551 62311
19123F2311M48O8729J40658L8928o3363j7460n8522q2904o8595n038K8137k0128
$$ 62311 62759 131488 272146 311074 247711 230251 171729 88825 20230 15192 43329 23201
19111B3201l6367M2891L1985n4107o409R3335M8058m6678K898k2786l0477N3073
$$ 23201 -13166 29725 61710 7603 1194 94529 142587 95909 98807 76021 45544 98617
19099I8617O7470k9942n6666K127J44185N6162o4254q9477k0655L8872Q6898J8671
$$ 98617 166087 136145 79479 81606 225791 281953 217699 128222 107567 146439 233337 252008
19087B52008n5076p7020p3892L5440K6118m1083L3402P2875L4182l0200M3681
$$ 252008 196932 119912 46020 81460 107578 66495 99897 172772 206954 176754 220435
19076B20435P3666N5807J5190K2155J3809k0934p7946j10077L1435K6257L4637
$$ 220435 294101 349908 365098 387253 401062 380128 302182 192105 223540 249797 284434
19065B84434l2383j1889L7441j7764r6061J4969J3037o4519n5882Q264M3135k3190
$$ 284434 252051 240162 277603 259839 163778 178747 191784 127265 71383 79647 122782 99592
19053I9592J06348J9312j22910q8006n922l1060m2P196J4825K8032Q4270M4394
$$ 99592 205940 225252 102342 14336 8414 -22646 -22688 -15492 -667 27365 111635 156029
19041A56029r435P186J2591q2862J6596l880q4981p4198J0172K6259j4698k1267
$$ 156029 146594 153780 166371 83509 100105 96225 11244 -62954 -52782 -26523 -41221 -62488
19029f2488r470k8947J5219N3790O1649L9019j2769o5730J5828N6628P9554M0217
$$ -62488 -71958 -100905 -85686 -31896 29753 68772 56003 -9727 6101 62729 142283 182500
19017A82500J3294k2857k5529k1972n7341j02109m8358Q5083M3508L4665M9647
$$ 182500 195794 172937 147408 125436 68095 -34014 -82372 2711 46219 80884 130531
19006A30531j6957R133L1918o9599j3424n462k6438L7952j02438n0107N0889N705
$$ 130531 113574 122707 154625 85026 71602 66140 39702 77654 -24784 -74891 -24002 -18297
18994a8297l4610q0302k2935r781J0538L4204M0949N4730m160J0193J0793O0715
$$ -18297 -52907 -133209 -156144 -165925 -155387 -121183 -80234 -25504 -29664 -19471 -8678 52037
18982E2037r1331J0720J7640l2995j1551P7647m6486L740K3848N0394N182K0618
$$ 52037 -39294 -28574 -10934 -43929 -55480 22167 -24319 -20579 3269 53663 58845 79463
18970G9463L4136K5126j1060r1843k0559K6878Q596Q816m7142l3534J54n1468
$$ 79463 113599 138725 127665 35822 15263 42141 50737 59553 12411 -21123 -20969 -72437
18958g2437N1162J46674n0668l1989N2121m3489j5910o809R5077O8375K8395J34311
$$ -72437 -21275 125399 74731 42742 94863 51374 35464 28655 123732 192107 220502 354813
18946C54813O6576J8486m0193j14699q7601j08580j7965N1344J17718j6342j9578
$$ 354813 421389 439875 399682 284983 197382 88802 70837 122181 239899 223557 203979
18935B03979N426m6804j25491j4501J1659J0701k1380m3112l7024k7887P635M6113
$$ 203979 209405 162601 37110 22609 34268 44969 23589 -19523 -56547 -84434 -76799 -30686
18923c0686N0063M1457L5345k5482o6730l1835N3218K87k2849N3687J19169M9953
$$ -30686 19377 60834 96179 70697 3967 -27868 25350 25637 2788 56475 175644 225597
18911B25597q1063p9845l6925m5910k656R825Q6383L2853l1013j7341k0428L4954
$$ 225597 144534 64689 27764 -18146 -20802 -10977 75406 108259 77246 59905 39477 74431
18899G4431J40454J28403n2027K8697L5136O6367m9752N1376r736j30733o5717
$$ 74431 214885 343288 291261 319958 355094 421461 371709 423085 413349 282616 216899
18888B16899j7924m5515M220Q5890q72j0779N3825K8037j16561n7346M918l0650
$$ 216899 198975 153460 157680 243570 242698 231919 285744 313781 197220 139874 144792 114142
18876A14142k2175o237K7932m0034K8532p1k7675o1902K3171L7273p9379j6470
$$ 114142 91967 85730 113662 73628 102160 102089 74414 12512 35683 72956 -6423 -22893
18864b2893M0676j3617m7598J7245K3181m8391p361L2766n5268N404P9327k7870
$$ -22893 17783 4166 -43432 -26187 -3006 -51397 -58758 -25992 -81260 -75856 3471 -24399
18852b4399O356k230L5526J2463M8927O3864M3821N9926l220j9437p4784l1867
$$ -24399 -18043 -20273 15253 27716 76643 140507 184328 244254 241034 221597 146813 114946
18840A14946o3546O1508N0951k2332p0599J9842R1393k8850r6733J0476q163J07670
$$ 114946 51400 112908 163859 141527 70928 90770 182163 153313 56580 67056 58893 166563
18828A66563Q5272j06883o9372j2755P0934J19065j23281j36026m8610r082j3337
$$ 166563 251835 144952 75580 62825 133759 252824 129543 -6483 -55093 -64175 -77512
18817g7512k6115M1129p2819K8571J02278J06981j9633j24551J7740K572K8464
$$ -77512 -103627 -62498 -135317 -106746 -4468 102513 82880 -41671 -23931 -21359 7105
18806G105o493N2104M3313J0754p5167m8420M011j9106n2165k111R8016L9598
$$ 7105 612 52716 96029 106783 31616 -16804 -12793 -31899 -84064 -86175 11841 51439
18794E1439p2983k8402N617J1740J8346Q2198M8849O770N368q8907m9055L6677
$$ 51439 -21544 -49946 -44329 -32589 -14243 67955 116804 123574 128942 40035 -9020 27657
18782B7657m0498L9121J3349K9810j5153p0987n2343k0345L7622J21372N2670
$$ 27657 -12841 26280 39629 69439 54286 -16701 -69044 -89389 -51767 69605 122275
18771A22275l6678l4274J1580L6129m1052O7000P2815j35583m3556k5782j5327
$$ 122275 85597 51323 62903 99032 57980 124980 197795 62212 18656 -7126 -22453
18760b2453P6458J37346J30010J0786R383k5635O2397N3056o774o5091m977q1149
$$ -22453 54005 191351 321361 332147 341530 315895 378292 431348 424574 359483 354506 273357
18748B73357l4834J2219K085m2259p76r4108j7007J6543j3095m0788j1605p8770
$$ 273357 238523 250742 252827 210568 209792 115684 98677 115220 102125 61337 49732 -29038
18736b9038P738J2628L0389l633j4891O2150K617r002l7111n6145M399J20532
$$ -29038 -21300 -8672 21717 18084 3193 65343 67960 58958 21847 -34298 -29899 90633
18724I0633J16397L8525j02462j3765k5724l9288L0492p985K7049M6846l5875
$$ 90633 207030 245555 143093 129328 103604 64316 94808 86823 113872 160718 124843
18713A24843l5712j9641l245K7074L3282J5578n8660k1642M7540Q2944L9601O8517
$$ 124843 89131 69490 66245 93319 126601 142179 83519 61877 109417 192361 231962 300479
18701C00479Q6800L9352M9819R7693k5986K4713Q4342J90824K56693J87305P7135
$$ 300479 387279 426631 476450 574143 548157 572870 657212 848036 1104729 1292034 1369169
18690A369169J0043j19372k08683k21702j64822j21957j26612m4163K7484J5079
$$ 1369169 1379212 1259840 1051157 829455 664633 542676 416064 371901 399385 414464
18680D14464o4556j742O8960K29425K48685K04740J37684n878j41289k56424k19419
$$ 414464 349908 348166 417126 646551 895236 1099976 1237660 1231782 1090493 834069 614650
18669F14650k13564j23232j00027j0670j5708j8485M7455k5149l3671k1862N8911
$$ 614650 401086 277854 177827 167157 151449 132964 180419 155270 121599 99737 158648
18658A58648M4039L3988m6006l7630k9023m3898m1363j28034M6628R2597n0272
$$ 158648 202687 236675 190669 153039 124016 80118 38755 -89279 -42651 49946 -326
18647c26l9367L128O7319j5545p2144L5291K9929O9584p0255m8579L0583l7309
$$ -326 -39693 -36565 30754 15209 -56935 -21644 8285 77869 7614 -40965 -10382 -47691
18635d7691M934k2443L5516L4223O8769m6426l4425n5098R524m7834K438k4335
$$ -47691 -42757 -65200 -29684 4539 73308 26882 -7543 -62641 -53117 -100951 -98513 -122848
18623a22848m8385M7330R4772P8557M8131L0908p1149r9989l1117L9266M9307
$$ -122848 -171233 -123903 -29131 49426 97557 128465 57316 -42673 -73790 -34524 14783
18612A4783K3926j7104o5417R07J9365l5673K7301O499K9120l7078R048O8568
$$ 14783 38709 21605 -43812 -42905 -23540 -59213 -31912 -25413 3707 -33371 -24323 44245
18600D4245J6716m3967k8248k1473J1536l1207j1396j5410j6074j07320k0358
$$ 44245 60961 16994 -11254 -32727 -21191 -52398 -63794 -79204 -95278 -202598 -222956
18589b22956M543K7265P6948Q1390K8164J9713N471j4964J6554O8875R980o5696
$$ -222956 -218413 -191148 -114200 -32810 -4646 15067 20538 5574 22128 91003 100983 35287
18577C5287n7254l9077K1839Q6L3074J21341Q5484m431j9734j5628k9011k5035
$$ 35287 -21967 -61044 -39205 -39119 -6045 115296 200780 196349 176615 160987 131976 106941
18565A06941k3648p3185j26684J8079N5581J19884M8513k1257n3483O384m3111
$$ 106941 83293 10108 -116576 -98497 -42916 76968 125481 104224 50741 57125 14014
18554A4014k8097N9106k6416k9570L2367J4853L6573l7381k3291J3834N5993k8759
$$ 14014 -14083 45023 18607 -10963 21404 36257 72830 35449 12158 25992 81985 53226
18542E3226J3523J2951l0089J1673n012n4483j3277K2358Q445Q1170J15575j4663
$$ 53226 66749 79700 49611 61284 56272 1789 -11488 10870 19315 100485 216060 201397
18530B01397p0920k3774K1042K1038n7778q0415j201n7308k3097K9458l0135J8806
$$ 201397 130477 106703 127745 148783 91005 10590 9389 -47919 -71016 -41558 -71693 -52887
18518e2887Q8342M4455j49n1555Q3259J04211O7828N6672J06691l947j20645r2886
$$ -52887 35455 79910 79761 28206 111465 215676 283504 340176 446867 442920 322275 229389
18506B29389r1271o4184l1153R7483M0166l8679j7861r8052j17580N944N2520
$$ 229389 138118 73934 42781 140264 180430 141751 123890 25838 -91742 -85798 -33278
18495c3278J68329O7337o8098n5115j08241N560M6733P8863o775O3400K7237K6431
$$ -33278 135051 202388 134290 79175 -29066 -23506 23227 102090 95315 158715 185952 212383
18483B12383l5820q5870J3133k249m7083M538N398k4628R704q631k4800j7850
$$ 212383 176563 90693 103826 101577 54494 59032 64430 39802 49506 40875 16075 -1775
18471a775J4558n172O4454L5441P5774M0648j55130Q0438J51870J91766J42486
$$ -1775 12783 7611 72065 107506 183280 223928 68798 149236 301106 492872 635358
18460F35358j4928j14375j79995p3705j10880q6235K6260m1244N8271k4375L2990
$$ 635358 620430 506055 326060 252355 141475 55240 81500 40256 98527 74152 107142
18449A07142R0494k5664n4785j4801k7982m3229k4562l4431N6274j8524l5919
$$ 107142 197636 171972 117187 102386 74404 31175 6613 -27818 28456 9932 -25987
18438b5987P4006m0317r7050p1749R0912l5040K0473L7714J05455M1943J0982
$$ -25987 48019 7702 -89348 -161097 -70185 -105225 -84752 -47038 58417 100360 111342
18427A11342J8044p4482l1363o7687K677O8775L4884K2112L7149J7916L8391p0215
$$ 111342 129386 54904 23541 -44146 -41469 27306 62190 84302 121451 139367 177758 107543
18415A07543k0481J58632K36101K05902P7878n4748j20850r8097r0216j41094
$$ 107543 87062 245694 481795 687697 765575 710827 589977 491880 401664 260570
18405B60570m3462j0456p5806r22Q8941j0751J5942l2604J5257k7529m3350N597
$$ 260570 217108 206652 130846 129924 218865 208114 224056 191452 206709 179180 135830 141427
18393A41427J4883j7716l0117r1107q2581l8991M6489L9638R2839l8826n5297
$$ 141427 156310 138594 108477 17370 -65211 -104202 -57713 -18075 74764 35938 -19359
18382a9359M6863n9878J4406k8164K7462M8480j3466P40r3300J5443K8622o207
$$ -19359 27504 -32374 -17968 -46132 -18670 29810 16344 17084 -76216 -60773 -32151 -38358
18370c8358O6838M3667m9980J6613p349m0441J0523J080J2435L9529J05149Q3878
$$ -38358 28480 72147 22167 38780 31431 -9010 1513 2593 15028 54557 159706 243584
18358B43584J57186J56201P1460n6238j03279L0497j3077m2837n6208K1258M8282
$$ 243584 400770 556971 628431 572193 468914 499411 486334 443497 387289 408547 456829
18347D56829R3250O717n9272j28176r6485p5703N264l1913p0874M4394R792l2206
$$ 456829 550079 556796 497524 369348 272863 197160 202424 170511 99637 144031 153823 121617
18335A21617p6467N967j4107K2221M6303m6518k5938o5115N6841J2897l7556l6428
$$ 121617 45150 51117 37010 59231 105534 59016 33078 -32037 24804 37701 145 -36283
18323c6283P2012n617n7850l9556K2156N1463R970l3204j09277J6899Q7497P5609
$$ -36283 35729 30112 -27738 -67294 -45138 6325 16295 -16909 -126186 -109287 -21790 53819
18311E3819l621L1412J50535J70071N4737P0310J0800k7602p3869j09756j28406
$$ 53819 50198 81610 232145 402216 456953 527263 538063 510461 436592 326836 198430
18300A98430j30584j605J28761J03865q466r9046n4657k4040J8628j8798k4901
$$ 198430 67846 66241 195002 298867 290401 191355 136698 112658 131286 112488 87587
18289H7587O5416L0972j3353j36626n2014n3046M2615J18850K1085j13137P06
$$ 87587 153003 183975 170622 33996 -18018 -71064 -28449 90401 111486 -1651 -945
18278i45L5248j4749N6234j1226q900N1426K6643P572k0588l618l041q1068j6768
$$ -945 34303 19554 75788 64562 55662 107088 133731 141303 120715 117097 114056 32988 16220
18265A6220M6241J06980J05288n6928l0914J4604Q909M001J4436o6822K23n509
$$ 16220 62461 169441 274729 217801 186887 201491 210400 214401 228837 162015 162238 156729
18253A56729M5451L9952K9805l8290j0858k2435N1235N2654k6942j727m4253J068
$$ 156729 202180 242132 271937 233647 222789 200354 251589 304243 277301 275574 231321 232389
18241B32389m3369m484N8908M2098L6536M0452k7419K575P6927K1718J5373o5616
$$ 232389 189020 184536 243444 285542 322078 362530 335111 337686 414613 436331 451704 386088
18229C86088j31788n0478r0158n8950L7815R7400R7484k4280J2918n3625o997
$$ 386088 254300 203822 113664 54714 92529 189929 287413 263133 276051 222426 215429
18218B15429l6500Q3483O898m3531m4087m3989n7192n3914P1982K5174Q151Q6107
$$ 215429 178929 262412 269310 225779 181692 137703 80511 26597 98579 123753 131904 218011
18206B18011O2186Q5011R0662K6546N0461J2878l9692N4819m4620k2966L6863
$$ 218011 280197 365208 455870 482416 532877 545755 506063 560882 516262 493296 530159
18195E30159P975N7891P6470n978p2424p476m414l9999J030n3826j5281n5289
$$ 530159 538134 596025 672495 666517 594093 586617 582203 542204 543234 489408 474127 418838
18183D18838O6746J19021J41974O8587J05291Q4347o6689j66182j41072L0119
$$ 418838 485584 604605 746579 815166 920457 1004804 938115 771933 630861 660980
18173F60980j5910m3109q0804q8177l8724P3206Q9959J12394M3735j6469R5968
$$ 660980 645070 601961 521157 432980 394256 467462 557421 669815 713550 697081 793049
18162G93049P7203O6272j03470j14101j96063j32816m0665m5494P3462L9317R2515
$$ 793049 870252 936524 833054 718953 522890 390074 349409 303915 377377 416694 509209
18151E09209K8694l0243j5427l5162m1537K16L1957N4295J33262J14857J14787
$$ 509209 537903 507660 492233 457071 415534 415750 447707 502002 635264 750121 864908
18140H64908O1880n3819j14406j99254j53162n4793p2341p8674r2387j6530J9073
$$ 864908 926788 872969 758563 559309 406147 351354 279013 200339 107952 91422 110495
18129A10495L0942J721L6048Q0127J19747M0542O2509J97355l2602j60327j87176
$$ 110495 141437 143158 179206 259333 379080 419622 482131 679486 646884 486557 299381
18118B99381p8254P9391l4044n7500r4060j8510P3376o2982k4031O6066n719J0518
$$ 299381 221127 300518 266474 208974 114914 96404 169780 106798 82767 148833 143114 153632
18106A53632o1708l8192k1535j7010p0987O2709R6876N9221k6908o2258k8831
$$ 153632 91924 53732 32197 15187 -55800 6909 103785 163006 136098 73840 45009
18095D5009o137N0006O850m2082J1223N3786j9768L054P4841J00568J44086J11879
$$ 45009 38872 88878 95728 53646 64869 118655 98887 101941 176782 277350 421436 533315
18083E33315J61178K7719j47917j64048q3296j26554j55903n6270J0432J75476
$$ 533315 694493 722212 574295 410247 326951 200397 44494 -11776 -1344 174132
18073A74132Q4530O542k3811M3481J19067J31621J07870Q4961r5697j76783j85907
$$ 174132 258662 265204 241393 284874 403941 535562 643432 728393 632696 455913 270006
18062B70006n9339o1198J0379o9198K8582j1412m1507o555K3714q3949o6042J5292
$$ 270006 210667 149469 159848 90650 119232 107820 66313 59758 83472 -477 -66519 -51227
18050e1227j2470M0056K1774m0686J2959M5058M4679q470m5649n7490m4666P0842
$$ -51227 -63697 -23641 -1867 -42553 -29594 15464 60143 51673 6024 -51466 -96132 -25290
18038b5290L5125m0960n008R130N902r8481J4401K0493k4833L3163K7984M1450
$$ -25290 9835 -31125 -36133 -27003 -21101 -119582 -105181 -84688 -109521 -76358 -48374 -6924
18026f924J0511N3076K8117O8093q407p4376J3013n290n6746k9110P5378Q1122
$$ -6924 3587 56663 84780 152873 144466 70090 83103 77813 21067 -8043 67335 148457
18014A48457k9086n4024p5478l9746q972N1884J9810O8827J11808J9179j12140
$$ 148457 119371 65347 -10131 -49877 -58849 -6965 12845 81672 193480 212659 100519
18003A00519j45385O6418M8507k3130Q5080N9471O6820M8001K3812p2152n4857
$$ 100519 -44866 21552 70059 46929 132009 191480 258300 306301 330113 257961 203104
17992B03104p8296o0523k0623L6460L8045J7476k1624j5686J7687N7300R3583
$$ 203104 124808 64285 43662 80122 118167 135643 114019 98333 116020 173320 266903
17981B66903m2059m1085K1883J0949l930l538j124J3033k5866L1140M434l1263
$$ 266903 224844 183759 205642 216591 212661 209123 207999 221032 195166 226306 230740 199477
17969A99477j9698k1716r653L4554O463o632n9592j239R0654M6326P2840n8185
$$ 199477 179779 158063 148410 182964 189427 182795 123203 121964 212618 258944 331784 273599
17957B73599m1017m4512l2265n0296K9026L5835l6295m3249N1358Q5392N4504
$$ 273599 232582 188070 155805 105509 134535 170370 134075 90826 142184 227576 282080
17946B82080l4381m2159p724m9730l0024K1425L5277k758j34456m8015M9315j2002
$$ 282080 247699 205540 197816 148086 118062 139487 174764 172006 37550 -10465 38850 26848
17934B6848q808Q907m6568O721k91L0971P0474M6422N1973M8077K7713J4954k2085
$$ 26848 18040 26947 -19621 -12900 -13191 17780 88254 134676 186649 234726 262439 277393 255308
17921B55308j2940L6564j5738k7750m1272k5049j9015O211K1741J57J3405K0440
$$ 255308 242368 278932 263194 235444 194172 169123 150108 156319 178060 178217 191622 212062
17909B12062K0786l1154R819P8445m3481p1496q4837q8305l7830P6837j3471M780
$$ 212062 232848 201694 211513 289958 246477 174981 90144 1839 -35991 40846 27375 32155
17897C2155N4589K3485k4598n1237l5273K0740P5562M5736o3627q8136J9122m123
$$ 32155 86744 110229 85631 34394 -879 19861 95423 141159 77532 -10604 8518 4395
17885D395L4979j0511M8501j1267q3400J678R1015M2528m4805m8766m2579k5642
$$ 4395 39374 28863 77364 66097 -17303 -15625 75390 117918 73113 24347 -18232 -43874
17873d3874K3729L2245J653q1474k5535P1257J9885p9798J8292K8677l6120m99
$$ -43874 -20145 12100 13753 -67721 -93256 -21999 -2114 -81912 -63620 -34943 -71063 -71562
17861g1562N4072J14860P3817L0554k7126j39915l7317j29n2199k4755R435Q9293
$$ -71562 -17490 97370 171187 201741 174615 34700 -2617 -2746 -54945 -79700 -70265 19028
17849A9028L4105n8369L645Q6670j0734r1007n4049j4527M6797o337N0993J42271
$$ 19028 53133 -5236 -1591 85079 74345 -16662 -70711 -85238 -38441 -44778 6215 148486
17837A48486M249k5682j0104n8078J3408Q9202j02994p8474Q7830k4501K012j4613
$$ 148486 152735 127053 116949 58871 72279 161481 58487 -19987 67843 43342 45354 30741
17825C0741k144R7911P0118l6663N9482o3159k5588l729m6967M4272J3318j1191
$$ 30741 28597 126508 196626 159963 219445 156286 130698 126969 80002 124274 137592 126401
17813A26401j3661Q29J3724k7384j7103R3039N3205p520k5014k3824o0002o7686
$$ 126401 112740 113569 127293 99909 82806 175845 229050 221530 196516 172692 112690 45004
17801D5004k5985j7414L8973R5668K1063k1734j9962q1769l1813M0677M4554J5874
$$ 45004 19019 1605 40578 136246 157309 135575 115613 33844 2031 42708 87262 103136
17789A03136j03363J2593J80944M0550M0480L1184r2687J27107N9798k901J8364
$$ 103136 -227 12366 193310 233860 274340 305524 212837 339944 399742 396841 415205
17778D15205M8364Q3324J9242n6080k0113L4732l4353k3706N448Q9945R0103K5683
$$ 415205 463569 546893 566135 510055 489942 524674 490321 466615 472063 562008 652111 677794
17766F77794J3358J2344L9039L9738j0677R1826J09416J51581N1094P3416q104
$$ 677794 691152 703496 742535 782273 771596 863422 972838 1124419 1175513 1248929 1240825
17755A240825o0652k5472J141J8340M6134J02176J85027P8667Q9089J83188K35728
$$ 1240825 1180173 1154701 1155842 1174182 1220316 1322492 1507519 1586186 1675275 1858463 2094191
17744B094191K99384L16713K89853K88146K53702K55828J81984L59796P79691
$$ 2094191 2393575 2710288 3000141 3288287 3541989 3797817 3979801 4339597 5119288
17735E119288J108312J734480K834050M482023P629858J2221093J5876523J4369660
$$ 5119288 6227600 7962080 10796130 15278153 22908011 35129104 51005627 65375287
17727F5375287M927616q669529j5034550j1761113p254501m415246k520970j213014
$$ 65375287 70302903 61633374 46598824 34837711 27583210 23167964 20646994 19433980
17719A9433980j91815Q31604K083205M174259P426765J2579929J9477415K4506776
$$ 19433980 19242165 20073769 22156974 26331233 33757998 46337927 65815342 90322118
17711I0322118K0807089M475713j6897813k5699938j9726536j2636612q228875
$$ 90322118 111129207 115604920 98707107 73007169 53280633 40644021 32415146
17704C2415146n467232l772478k747927k002006j412323r08251o27248p39059
$$ 32415146 26947914 23175436 20427509 18425503 17013180 16104929 15477681 14738622
17696A4738622j032019j153985j078478q68441p55584o55933l69633j89945O7627
$$ 14738622 13706603 12552618 11474140 10605699 9850115 9194182 8824549 8634604 8702231
17687H702231R9365p3062k13945j83047j1251K08812K67472K78533N85351J229116
$$ 8702231 8801596 8728534 8514589 8331542 8320291 8529103 8796575 9075108 9660459 10889575
17677A0889575K171895K940575L026341J814479k22820j659966j246899o5820
$$ 10889575 13061470 16002045 19028386 20842865 20620045 18960079 17713180 17647360
17669A7647360Q25904J916189L243691M907379P629564J2007458J9464462L0151160
$$ 17647360 18473264 20389453 23633144 28540523 36170087 48177545 67642007 97793167
17661I7793167M2853394N3113763N4165058M2559354K4155781L679896j6259955
$$ 97793167 140646561 193760324 247925382 290484736 314640517 318320413 302060458
17654C02060458k8738447m5980172n5282127m2054308k5875372j5388816q530109
$$ 302060458 273322011 227341839 172059712 130005404 104130032 88741216 80211107
17647H0211107k758644K671669P936514J1018852Q459823m88716j2001386j6321767
$$ 80211107 77452463 80124132 88060646 99079498 107539321 107050605 95049219 78727452
17639G8727452j1931721p881214o550313o955766p039934n613302m027553k934649
$$ 78727452 66795731 58914517 52364204 45408438 38368504 32755202 28727649 25793000
17631B5793000k243189j730111j324039j222880j313263j516447j681253j568357
$$ 25793000 23549811 21819700 20495661 19272781 17959518 16443071 14761818 13193461
17623A3193461j402141j219185j062801r23232q35612o85052n04409m68162l69840
$$ 13193461 11791320 10572135 9509334 8586102 7750490 7065438 6561029 6092867 5723027
17614E723027m53874n32114m01251k82109k93786k62565k44757k94499j84913
$$ 5723027 5269153 4737039 4335788 4053679 3759893 3497328 3252571 2958072 2773159
17605B773159j88679j64570k66752k07108j51057j87742j03256o9575p0524j11152
$$ 2773159 2584480 2419910 2153158 1946050 1794993 1607251 1503995 1434420 1363896 1252744
17595A252744q1216M2839m9219j50119j56309l9313R0043K8321R682l3412p277
$$ 1252744 1171528 1214367 1165148 1015029 858720 819407 909450 937771 947453 914041 906764
17584I06764l6461n8462o6997n9393Q8685R2859K2339q2402l3607p7785q9187
$$ 906764 870303 811841 744844 685451 774136 866995 889334 806932 773325 695540 606353
17573F06353L2683o519q4386R5493O3526R026j00836n9169m4328O9137J1697r4935
$$ 606353 639036 632517 548131 643624 707150 716176 615340 556171 511843 580980 592677 497742
17561D97742q8296K708j7613r88k9398o244m4963QK7396q290o3628j05029M8688
$$ 497742 409446 412154 394541 393553 364155 357911 312948 312956 340352 332062 268434 163405 212093
17548B12093N7417L5957l5085l6043K704N3898K6073N5783k4036r4858n8909j6894
$$ 212093 269510 305467 270382 234339 237043 290941 317014 372797 348761 253903 194994 178100
17536A78100J518N3158r972l6232P563n6786k0317N1817J17274N8142p3535k5281
$$ 178100 179618 232776 222804 186572 194135 137349 117032 168849 286123 344265 270730 245449
17524B45449M0203q243l5337l5268M1534L5081M5398J9232l9741k2437P2694r715
$$ 245449 285652 277409 242072 206804 248338 283419 328817 348049 308308 285871 358565 348850
17512C48850o228O473r6364q6641j0287m5312K4713P3049M7638l4286r1466M1840
$$ 348850 342622 349095 252731 166090 155803 110491 135204 208253 255891 221605 130139 171979
17500A71979J3060k7977k3592J0236j6048O9038R6834J4446L2778n323p6598k1965
$$ 171979 185039 157062 133470 143706 127658 196696 293530 307976 340754 335431 258833 236868
17488B36868p8571M0677J1210l6200J3093n7480q7425m4076L0633P1763J85066
$$ 236868 158297 198974 210184 173984 187077 129597 42172 -1904 28729 100492 285558
17477B85558J19161j25150r9138o3786M2960P8050M7399J5443n9063j6378q667
$$ 285558 404719 279569 180431 116645 159605 237655 285054 300497 241434 225056 216389
17466B16389m6816l4016p4782m6605m6938l7444L0897Q3061m1622k3176k034K2239
$$ 216389 169573 135557 60775 14170 -32768 -70212 -39315 43746 2124 -21052 -23086 -847
17454h47J06733n0855K2684o475n9508k3566J3984K2532N3626Q1727p9985K0038
$$ -847 105886 55031 77715 71240 11732 -11834 2150 24682 78308 160035 80050 100088
17442A00088Q8670l3631M5755k6881l68N6834J6292R781j4156n8475j18517L3993
$$ 100088 188758 155127 200882 174001 173633 230467 246759 256540 242384 183909 65392 99385
17430I9385L2304j0963n649k8510o9077p0958L6695L5675J6116J6159N1010j9341
$$ 99385 131689 120726 115077 86567 17490 -53468 -16773 18902 35018 51177 102187 82846
17418H2846m1982n0715L9834P5576L8438N1539p41n1325j3975K1626O119o6607
$$ 82846 40864 -9851 29983 105559 143997 195536 194795 143470 129495 151121 157240 90633
17406I0633j0344K4811M5473l5891m5805m2873J00001J2212l8902L7192k8842
$$ 90633 80289 105100 150573 114682 68877 26004 126005 138217 99315 136507 107665
17395A07665o043q930n206K8612J7970J15687J8413l9630l5713L9428k4059n3539
$$ 107665 101622 92692 87486 116098 134068 249755 268168 228538 192825 232253 208194 154655
17383A54655j8497Q2959N9652M6370O8477K44122K70461K11513Q6836o6210j96593
$$ 154655 136158 219117 278769 325139 393616 637738 908199 1119712 1206548 1140338 943745
17372I43745j44690l8059j33894j25301j64642r9271j6091J4319n0763L3172l8460
$$ 943745 799055 760996 627102 501801 337159 237888 221797 236116 185353 218525 180065
17361A80065m3820O6540j5112n3947l1250N8988j5653o9539n8941k0749O1221
$$ 180065 136245 202785 187673 133726 102476 161464 145811 76272 17331 -3418 57803
17350E7803M379K0615N9739o7168o214M224O541K1093L9811j6498p483L3442L5594
$$ 57803 62182 82797 142536 75368 69154 73378 79919 101012 140823 124325 116842 150284 185878
17337A85878L0218j7808l544K4289j8570o6949j2525j8969N6066L4055r206m2464
$$ 185878 216096 198288 194744 219033 200463 133514 120989 102020 158086 192141 182935 140471
17325A40471N0008Q6357J58109R2306J16661R7135R9931Q1700o7399k26651j53256
$$ 140471 190479 276836 434945 527251 643912 741047 840978 922678 855279 628628 475372
17314D75372o844p2207j40418o9038r529J736P1868M4143l5301k8444l0388N9657
$$ 475372 468528 396321 255903 186865 177336 179072 250940 295083 259782 231338 200950 260607
17302B60607k1719j10689q6334m7967K2606Q1754j3462q2043n778n207k0861J1354
$$ 260607 238888 128199 41865 -6102 16504 98258 84796 2753 -3025 -8232 -29093 -17739
17290a7739O6525J5891K1171l2304j8443j7427l5367j3397L2408O0222N2650J2756
$$ -17739 48786 64677 85848 53544 35101 17674 -17693 -31090 1318 61540 114190 126946
17278A26946j7100N8624R1260k0296j39390M819P58q7444j5278J0699q579Q9319
$$ 126946 109846 168470 259730 239434 100044 104863 105621 18177 2899 13598 5019 94338
17266I4338l7030p3260k827O0965K9605r3256l5709N5528O182K6401o0106r133
$$ 94338 57308 -15952 -18779 42186 71791 -21465 -57174 -1646 4536 30937 -29169 -38302
17254c8302P9734K8281M009q1485k8816r5279L6106Q2621O9210k3813p970M2455
$$ -38302 41432 69713 73722 -7763 -36579 -131858 -95752 -13131 56079 32266 24296 66751
17242F6751j129N9569j09460k96N4718L5900M9956R187o5256o8107K1002j6752
$$ 66751 65622 125191 15731 15435 70153 106053 156009 165196 99940 31833 52835 36083
17230C6083o241O2617J05506k0205p3205O825l7618N600k2162k4075q4045j9772
$$ 36083 29842 92459 197965 177760 104555 111380 73762 79362 57200 33125 -50920 -70692
17218g0692j8783n0749O38P3014M2191J8785m9818k4033K9285N2489K6428Q6764
$$ -70692 -89475 -140224 -139586 -66572 -24381 -5596 -55414 -79447 -50162 2327 28755 115519
17206A15519J14471L2563k1747o6129K1100N0053j3231R31K2900P177k8184N893
$$ 115519 229990 262553 240806 174677 195777 245830 232599 233530 256430 263607 235423 241316
17194B41316n7383n1704q8377O4846J5910l182l1993P5445R2178Q082r318M0538
$$ 241316 183933 132229 43852 108698 124608 121426 89433 164878 257056 265138 255820 296358
17182B96358J7545r6981q2801j49420L2322R5130M4225r2120k0247L9632J2975
$$ 296358 313903 216922 134121 -15299 17023 112153 156378 64258 44011 83643 96618
17171I6618l3011K8706K7692o8015q9044k5143M8539J07225J11575p1445m0794
$$ 96618 63607 92313 120005 51990 -37054 -62197 -13658 93567 205142 133697 92903
17160I2903L9986J3887q2102k0345R4Q592j1252N4488M7431m7359J7970J0016
$$ 92903 132889 146776 64674 44329 44423 53015 41763 96251 143682 96323 114293 124309
17148A24309M6447J1414K4578K6991J01957P5491J4377J4697O5539J5497J14647
$$ 124309 170756 182170 206748 233739 335696 411187 425564 440261 505800 521297 635944
17137F35944O8005K4355K2729m0204n1811p1457r8572o6092O8528R8548J08564
$$ 635944 703949 728304 751033 710829 659018 587561 488989 422897 491425 589973 698537
17126F98537L255l9435k7692j10086N0294L6998O2552K5009J8310q1115q3845
$$ 698537 701792 662357 634665 524579 574873 611871 674423 699432 717742 636627 552782
17115E52782n2181p4188n5742O157o1500o1715N0431n9990q0686k0591K9633q4597
$$ 552782 500601 426413 370671 376828 315328 253613 304044 244054 163368 142777 172410 87813
17103H7813l3535M5446M8844o0044l7587l5619N8992R5579n0196n053j2951N3813
$$ 87813 54278 99724 148568 88524 50937 15318 74310 169889 119693 114640 101689 155502
17091A55502N3869j6107k0925Q116j7759m9657j3258j0727q1458l4541k4079L7893
$$ 155502 209371 193264 172339 180455 162696 113039 99781 89054 7596 -26945 -51024 -13131
17079a3131O4852M6805o371l9331J9004N449J5950j315r5124j40695N3260J62914
$$ -13131 51721 98526 92155 52824 71828 77277 93227 91912 -3212 -143907 -90647 72267
17067G2267J4590l8426r115k0453N3471M2340Q710J7460o2987j65403p8151j9922
$$ 72267 86857 48431 39316 18863 72334 114674 123384 140844 77857 -87546 -165697 -185619
17055a85619J2772N05j9399L3358N6144P2738J3758n7471K0954j729K2151j5558
$$ -185619 -172847 -172342 -191741 -158383 -102239 -29501 -15743 -73214 -52260 -53989 -31838 -47396
17043d7396j1047O4526J4708K47J6451L435O433m842M3192Q3652j2730j8303l1501
$$ -47396 -58443 6083 20791 21038 37489 40924 47357 42515 85707 169359 156629 138326 106825
17030A06825o0812q9934l2353K4340K9968M4236k2274n4173J0954K1290K5465
$$ 106825 46013 -43921 -76274 -51934 -21966 22270 -4 -54177 -43223 -21933 3532
17019C532J3639L1331Q528n9147n7370k3310q597N2523K7731m6376L0391j1609
$$ 3532 17171 48502 57030 -2117 -59487 -82797 -91394 -38871 -11140 -57516 -27125 -38734
17007c8734O363j2156m1031K9634K1697q892n309N1502l1095O7436k3553p1541
$$ -38734 -32371 -44527 -85558 -55924 -34227 -43119 -48428 3074 -28021 39415 15862 -55679
16995e5679J0756k693j2507m174L5165N0551K0261l3109l9243P2202j9883j8338
$$ -55679 -44923 -47616 -60123 -64297 -29132 21419 41680 8571 -30672 41530 21647 3309
16983C309P9048j2561o3960q5539n5107P941k3466L3577J822q1094M1917Q2187
$$ 3309 82357 69796 5836 -79703 -134810 -126869 -150335 -116758 -114936 -196030 -154113 -71926
16971g1926J0049N442L3127l1714P7764k4857o9183Q99j778L8158J6554l5311
$$ -71926 -61877 -56435 -23308 -55022 22742 -2115 -71298 -70399 -72177 -34019 -17465 -52776
16959e2776m2074l1223N469O9259O1830Q0597l6663p8398j2418K8069J2140o926
$$ -52776 -94850 -126073 -120604 -51345 10485 91082 54419 -23979 -36397 -8328 3812 -3114
16947c114n1686k4980R07J6535k5791k5639M4663Q0697N7765K1219l9810n4333
$$ -3114 -54800 -79780 -78873 -62338 -88129 -113768 -69105 11592 69357 90576 50766 -3567
16935c567M7998l0096L458k4113r698K5585o5962j5659K7874L7075J1936n299
$$ -3567 44431 14335 17793 -6320 -16018 9567 -56395 -72054 -44180 -7105 4831 -468
16923d68N0578n1817j2779j2976L7259K7970Q551o1774L2108j0397J997m6182
$$ -468 50110 -1707 -14486 -27462 9797 37767 46318 -15456 16652 6255 8252 -37930
16911c7930J6841M9291l4837j1590m034k3886J3369K606p559P393j9838J8183
$$ -37930 -21089 28202 -6635 -18225 -22259 -46145 -32776 -30170 -37729 -30336 -50174 -31991
16899c1991l5556k4064M995j6504N4246l723m5234O2440L7808J3660l9697j216
$$ -31991 -67547 -91611 -86616 -103120 -48874 -52597 -97831 -35391 2417 16077 -23620 -24836
16887b4836O4485Q2275N454J451j812m7006q7836n6149m397J1801K0310O666L5709
$$ -24836 39649 121924 127378 128829 127017 80011 -7825 -63974 -68371 -56570 -36260 -29594 6115
16874F115O9477j8453j3920m2894J3981N8567M3302n4280l4208m5323r133P3642
$$ 6115 75592 57139 43219 325 14306 72873 116175 61895 27687 -17636 -26769 46873
16862D6873n1289j23696k685Q6811N4256M8285L2761l1809r6711k6902P2327j7446
$$ 46873 -4416 -128112 -130797 -43986 10270 58555 91316 59507 -37204 -64106 8221 -9225
16850i225l0558L1321o8664M7514j4820o8578J4414J8535J4294l141P6599n222
$$ -9225 -39783 -8462 -77126 -29612 -44432 -113010 -98596 -80061 -65767 -68908 7691 2469
16838B469o5775M310j1797k019l8657K0381M5082K1366l3726n5171j0526j6865
$$ 2469 -63306 -58996 -70793 -72812 -111469 -91088 -46006 -24640 -58366 -113537 -124063 -140928
16826a40928O8011m4781l2527K5285P7108K9682O004n793j2963N1674r7m7794
$$ -140928 -72917 -117698 -150225 -124940 -47832 -18150 -12146 -17939 -30902 20772 20675 -27119
16814b7119k7342K0657O58l871J2800J24984K9952n4166n8327n2704p519J3826
$$ -27119 -54461 -33804 -33146 -37017 -24217 100767 130719 76553 18226 -34478 -41997 -28171
16802b8171N9699K8453k2935k0722K1399P5153l1854j26526L1847J15802q02q5056
$$ -28171 31528 59981 37046 16324 37723 112876 81022 -45504 -13657 102145 101343 16287
16790A6287p7417k4224m9746R5647J15592j1526j40369L4158N7094k833l3992
$$ 16287 -61130 -85354 -135100 -39453 76139 64613 -75756 -41598 15496 12663 -21329
16779b1329n1553J8444J2042n0698n5207K6902M5755q326o975K5828l5575l2167
$$ -21329 -72882 -54438 -42396 -93094 -148301 -121399 -75644 -83970 -90945 -65117 -100692 -132859
16767a32859M6301Q9937q0536R249J6616l3381m711n0847q044M5073J1604K0330
$$ -132859 -86558 3379 -77157 -67908 -51292 -84673 -89384 -140231 -148275 -103202 -91598 -71268
16755g1268l4509K5054K8033p4088m2114n0005L149Q7955K5497K1910K5979L5712
$$ -71268 -105777 -80723 -52690 -126778 -168892 -218897 -215748 -127793 -102296 -80386 -54407 -18695
16743a8695j9828k4677M077j404K8552P2406J0768m8609o4795j3934o8460L3806
$$ -18695 -38523 -63200 -59123 -60527 -31975 40431 51199 2590 -62205 -76139 -144599 -110793
16731a10793O7669M8217n524m9702K4038Q0292N9861l4232n2254p4640p6559j2131
$$ -110793 -43124 5093 -431 -50133 -26095 54197 114058 79826 27572 -47068 -123627 -135758
16719a35758J4867J8278p7482j6445J4819L7046L1386J13299n6181n9965J2411
$$ -135758 -120891 -102613 -180095 -196540 -181721 -144675 -113289 10 -56171 -116136 -103725
16708a03725O6130k4478K5667J7061M036O211m85p8130m258o27l6703k9961P6805
$$ -103725 -37595 -62073 -36406 -19345 -15309 -9098 -9583 -87713 -91971 -92598 -129301 -159262 -82457
16695h2457J1674k8096O3474o9279K5526O9714k8749j2133M3152K4400O8863J2638
$$ -82457 -70783 -98879 -35405 -104684 -79158 -9444 -38193 -50326 -7174 17226 86089 98727
16683I8727Q9934j20269j57574P2302J37581k281o4698P588l4227r4480M6955
$$ 98727 188661 68392 -89182 -16880 120701 118420 53722 61310 27083 -67397 -20442
16672b0442O8035m6788l1299k7866J9360L0503J4662M8893L0740k1628l3760p7807
$$ -20442 47593 805 -30494 -58360 -39000 -8497 6165 55058 85798 64170 30410 -47397
16660d7397M1757n587j546K1835J7147J0011n4626l0865p248O8678N9012L3338
$$ -47397 -5640 -11227 -12773 9062 26209 36220 -18406 -49271 -56519 12159 71171 104509
16648A04509M1750l4711n0252j3371j03460K5480p133l9790k2031N3809L8125
$$ 104509 146259 111548 61296 47925 -55535 -30055 -37188 -76978 -99009 -45200 -7075
16637g075n073r9349n8912N7462M7223j6316N6880J3798r2749o40K2920q877k1404
$$ -7075 -12148 -111497 -170409 -112947 -65724 -82040 -25160 -11362 -104111 -104751 -81831 -90708 -112112
16624a12112N5025J5671j3942O7005K4067k0208m2642K7259M5227j3364P888n9775
$$ -112112 -57087 -41416 -55358 11647 35714 15506 -27136 123 45350 31986 39874 -19901
16612a9901o3681P4654Q2966n6784j15402K2796J3448N9966M9348K1142J7402
$$ -19901 -83582 -8928 74038 17254 -98148 -75352 -61904 -1938 47410 68552 85954
16601H5954p6582j8633N2060m7287r1464n2412n0471K2160N0172k1385K6880P4757
$$ 85954 9372 -9261 42799 -4488 -95952 -148364 -198835 -176675 -126503 -147888 -121008 -46251
16589d6251k5870k8161p0609M1366M5192j2652j3599J0204L0126l9981o0043p2534
$$ -46251 -72121 -100282 -170891 -129525 -84333 -96985 -110584 -100380 -70254 -110235 -170278 -242812
16577b42812P1578J22676k3312M7911L5905r0538N817o043l9353O3770l3362j9241
$$ -242812 -171234 -48558 -71870 -23959 11946 -78592 -72775 -78818 -118171 -54401 -87763 -107004
16565a07004l9844n6325P0494Q3756J10031K6856r7855J0671K7212k2253n153
$$ -107004 -146848 -203173 -132679 -48923 61108 87964 -9891 780 27992 5739 586
16554E86p6471o8432K721p302J0967O315J9M3417J07804N0888N7094o9023n9097
$$ 586 -75885 -144317 -141596 -148898 -137931 -131616 -131597 -88180 19624 70512 127606 58583 -514
16541e14k7835N4977J9138m9215L523R624O563J5775O8097r789p6795l7178P9029
$$ -514 -28349 26628 45766 -3449 74 9698 16261 32036 100133 90344 13549 -23629 55400
16528E5400k2196K7344l6859q8602J3206O4135j8798j14111M6526J6494m0471
$$ 55400 33204 60548 23689 -64913 -51707 12428 -6370 -120481 -73955 -57461 -97932
16517i7932N8081M115k5844Q562M9116j25213j08051Q4693L4480r50M607K06K3323
$$ -97932 -39851 -35736 -61580 -53018 -3902 -129115 -237166 -152473 -117993 -118943 -114336 -114130 -90807
16504i0807N55k2124l7306O7950N6210O2626l2087M3040k3311P672o5325l509
$$ -90807 -90252 -112376 -149682 -81732 -25522 37104 5017 48057 24746 32418 -32907 -36416
16492c6416n1909J6405M4174N7952J3936k9424k6249L0534K9293O573l1758o1152
$$ -36416 -88325 -71920 -27746 30206 44142 14718 -11531 19003 48296 54869 23111 -38041
16480c8041R612K7257J5497j03914j791Q5480J9985j8109L8163P4751m777n5502
$$ -38041 -28429 -1172 14325 -89589 -91380 -5900 14085 -4024 34139 108890 104113 48611
16468D8611L1662p620l7290m1462m6857N0016j5798J4918j2790r0k8250N4433
$$ 48611 80273 72653 35363 -6099 -52956 -2940 -18738 -3820 -16610 -16700 -44950 9483
16456I483L3335m4914N2799N7303o2069l7686k6981r375K7514n4013m7291j2179
$$ 9483 42818 -2096 50703 108006 45937 8251 -18730 -28105 -591 -54604 -101895 -114074
16444a14074L8025o7713m0841o9651O0185P7156k4015M9145J66J15520M5597q2461
$$ -114074 -76049 -143762 -184603 -254254 -194069 -116913 -140928 -91783 -91617 23903 69500 -12961
16432a2961j5515O4934M4003o739o1448j05828m1095P9441M7266k3125Q4992l2388
$$ -12961 -28476 36458 80461 73722 12274 -93554 -134649 -55208 -7942 -31067 53925 21537
16420B1537l7871l7152r8631Q7P0128N090q5639K5891P1294K1291N6652q537j6425
$$ 21537 -16334 -53486 -152117 -152030 -81902 -76812 -162451 -136560 -65266 -43975 12677 4140 -12285
16407a2285K7101l0559N069L0016K1318j16515n9058q517L3010k3573K5512J9314
$$ -12285 14816 -15743 -10674 19342 40660 -75855 -134913 -143430 -110420 -133993 -108481 -89167
16395h9167Q0237J17026N7714j8099q6359l8588k6332J169m1127N8052Q6541q2195
$$ -89167 -8930 108096 165810 147711 61352 22764 -3568 -2399 -43526 14526 101067 18872
16383A8872o0525r606j5349M1995K6898J5115l5574o0971k0003N0152J6396P0959
$$ 18872 -41653 -51259 -66608 -24613 2285 17400 -18174 -79145 -99148 -48996 -32600 38359
16371C8359P32j907k8890l0638J2099n7689L9105m483R805O4919m7475p4394L507
$$ 38359 39091 37184 8294 -22344 -10245 -67934 -28829 -33312 -23507 41412 -6063 -80457 -76950
16358g6950O4773q0270l8024J8017l478K2336L0876J26827M6000j5480o1928j06766
$$ -76950 -12177 -92447 -130471 -112454 -115932 -93596 -62720 64107 110107 94627 32699 -74067
16346g4067j8623L4567M1065N6449L1002r9338n152k3283K3446L9625l9412M1902
$$ -74067 -92690 -58123 -17058 39391 70393 -28945 -34097 -57380 -33934 5691 -33721 8181
16334H181Q4400J9552j9787p0634j18733l5530J467N3115Q4321l4363j09889o5544
$$ 8181 92581 112133 92346 21712 -97021 -132551 -131084 -77969 6352 -28011 -137900 -203444
16322b03444Q1895J2137k4810M5580O6918M9893k1930L3915Q3656l3355m2203
$$ -203444 -121549 -109412 -134222 -88642 -21724 28169 6239 40154 123810 90455 48252
16311D8252p0457J4086m0071L419J6424N7158J8239l4455k442m000q2982k0901
$$ 48252 -22205 -8119 -48190 -44771 -28347 28811 47050 12595 10153 6153 -76829 -97730
16299i7730K6533l9598J3209j7286L2829R9096M1881n5546m3398L3188r2767m7091
$$ -97730 -71197 -110795 -97586 -114872 -82043 17053 58934 3388 -40010 -6822 -99589 -146680
16287a46680M6562k3362J1852M744M0357l7459n7531P9868O5602L9393p9629l3907
$$ -146680 -100118 -123480 -111628 -106884 -66527 -103986 -161517 -81649 -16047 23346 -56283 -90190
16275i0190N016j9870K7535K9142o138k0763j6429M0681Q772J3722o591M0324
$$ -90190 -85174 -105044 -77509 -48367 -54505 -75268 -91697 -51016 -42244 -28522 -35113 5211
16263E211n1122p7881l3273K5800L7910m6271j340L8845M1402N6266q0365J890
$$ 5211 -45911 -123792 -157065 -131265 -93355 -139626 -140966 -102121 -60719 -4453 -84818 -82928
16251h2928R965Q3021K7142j9676n7483O9609M6041l8180o5678r3770k702J01126
$$ -82928 -72963 10058 37200 17524 -39959 29650 75691 37511 -28167 -121937 -124639 -23513
16239b3513J9514N5692n1156l4796n2033p8933J11552N3645J7185l6341m1230
$$ -23513 -3999 51693 537 -34259 -86292 -165225 -53673 -28 17157 -19184 -60414
16228f0414n8913l2529j5074j4994O5085M7199O0247P0165K3119j6904p4658K7794
$$ -60414 -119327 -151856 -166930 -181924 -116839 -69640 -9393 60772 83891 66987 -7671 20123
16216B0123j3048j04372m8731m3778P4707O9971m1420M523K877k7105o1372j6873
$$ 20123 7075 -97297 -146028 -189806 -115099 -45128 -86548 -82025 -79148 -106253 -167625 -184498
16204a84498k7744L0660Q5334L2378m7894M9319P0103j4052k5911M1465K7933
$$ -184498 -212242 -181582 -96248 -63870 -111764 -62445 7658 -6394 -32305 9160 37093
16193C7093L7373K0165q3761p5117M2073N5998J2339L6001k518p7588l1451j3732
$$ 37093 74466 94631 10870 -64247 -22174 33824 46163 82164 79646 2058 -29393 -43125
16181d3125K2964N9594O9865n0009l7047m3730L0456N0123J0371k2420j8984l5755
$$ -43125 -20161 39433 109298 59289 22242 -21488 8968 59091 69462 47042 28058 -7697
16169g697l9427j2233N7774N8388k8759k1508K5579n2976J4103O8668l156j7365
$$ -7697 -47124 -59357 -1583 56805 28046 6538 32117 -20859 -6756 61912 58756 41391
16157D1391l7806r5217p0092J6357p614k995n7627K0998J04194O0285L2734P5135
$$ 41391 3585 -91632 -161724 -145367 -152981 -155976 -213603 -192605 -88411 -28126 4608 79743
16145G9743P1785o5641m7201o257j9189l3101r0722J33636J1018r4429m9832P0105
$$ 79743 151528 85887 38686 32429 13240 -19861 -110583 23053 34071 -60358 -110190 -40085
16133d0085Q9530N6097m7939n6132n7458k0758k845l5530M4576l177q6040J9610
$$ -40085 49445 105542 57603 1471 -55987 -76745 -79590 -115120 -70544 -73721 -159761 -140151
16121a40151J25754k9023o642k3530l2311P2345R1747r8985j31639m063J8185
$$ -140151 -14397 -43420 -50062 -73592 -105903 -33558 58189 -40796 -172435 -176498 -158313
16110a58313L4084Q233O4475L5882P1485N7851l2790m1068m2496Q11R187K1882
$$ -158313 -124229 -115996 -51521 -15639 55846 113697 80907 39839 -2657 -1846 7341 29223
16098B9223j950q8964p5131l4193M1824N2150L3348Q5969P3386J0749l7427l1547
$$ 29223 27273 -61691 -136822 -171015 -129191 -77041 -43693 42276 115662 126411 88984 57437
16086E7437m5926M1474K2877m2659k7700M3610j1163k2263M1354m903j29895l0890
$$ 57437 11511 52985 75862 33203 5503 49113 37950 15687 57041 52138 -77757 -108647
16074a08647Q5494n0558N0381j1571n7651l1471J6759Q752J6619N7488K6518m3992
$$ -108647 -23153 -73711 -23330 -34901 -92552 -124023 -107264 -98512 -81893 -24405 2113 -41879
16062d1879P4662J1682q7013r584K8360O3897m515j00067m4192o3072l0029M895
$$ -41879 32783 44465 -42548 -52132 -23772 40125 35610 -64457 -108649 -171721 -201750 -196855
16050a96855R7365P9789J2512n457k5115p6303p3147N0596N9319m8448L7345j5685
$$ -196855 -99490 -19701 -7189 -12646 -37761 -114064 -187211 -136615 -77296 -125744 -88399 -104084
16038a04084n2747l569J23303Q9630K0123p9805k7363O2588n974N913K8963N5184
$$ -104084 -156831 -160400 -37097 52533 72656 -7149 -34512 28076 22102 28015 56978 112162
16026A12162J4411N9174J6271n9639k5517j5396r0200j00370j2592j3324O9507
$$ 112162 126573 185747 202018 142379 116862 101466 11266 -89104 -101696 -115020 -45513
16015d5513K100j3428k2280K4420q6442n7527J1848J04016Q4259K5490j1899m6325
$$ -45513 -43413 -56841 -79121 -54701 -141143 -198670 -186822 -82806 1453 26943 15044 -31281
16003c1281m1096N3367L4233J4441k4212P0228L0121m2513p5200l2511J7452P387
$$ -31281 -72377 -19010 15223 29664 5452 75680 105801 63288 -11912 -44423 -26971 -19584
15991a9584K5718m3276N308J5098J5728L4111L9429N5193N7481j01642j33419
$$ -19584 6134 -37142 -31834 -16736 -1008 33103 72532 127725 185206 83564 -49855
15980d9855P6650m09j8130l7621K9896O5847q1353n1267L508N0780p4311p6658
$$ -49855 26795 26386 8256 -29365 531 66378 -14975 -66242 -62734 -11954 -86265 -162923
15968a62923M5134P0847m2354j08096M7459J39993l8830k5154R9452j5754p4664
$$ -162923 -117789 -46942 -89296 -197392 -149933 -9940 -48770 -73924 25528 9774 -64890
15957f4890m3981M3388M8292n5352J0352M1525Q252l9839o1473J7844j6812O9015
$$ -64890 -108871 -65483 -17191 -72543 -62191 -20666 -12414 -52253 -113726 -95882 -112694 -43679
15945d3679K246J5475P4324o0684n8071N3222j3225j05623q746M5954J24696J575
$$ -43679 -41433 -25958 48366 -12318 -70389 -17167 -30392 -136015 -144761 -98807 25889 27464
15933B7464o5601j5653Q1427R83j7757J5533o8850p3803N53N8785K8312J0186
$$ 27464 -38137 -53790 27637 28620 10863 26396 -42454 -116257 -115704 -56919 -28607 -18421
15921a8421n8542J3742J7127q8470j5009P0424O9068M6115n4527k3767K6457n2327
$$ -18421 -76963 -63221 -46094 -134564 -149573 -79149 -10081 36034 -18493 -42260 -15803 -68130
15909f8130k9295j8253J07771n5285m5171Q3463k0962m5746K6101M3475k4758
$$ -68130 -97425 -115678 -7907 -63192 -108363 -24900 -45862 -91608 -65507 -22032 -46790
15898d6790m2901N3134M1399m5330M1047N0277r690n6123o8739j3843L2421L7480
$$ -46790 -89691 -36557 4842 -40488 559 50836 41146 -14977 -83716 -97559 -65138 -27658
15886b7658N1093N1470J3820N9415m0391n0899j9221J0757m1157n5523M5N8873
$$ -27658 23435 74905 88725 148140 107749 56850 37629 48386 7229 -48294 -48249 10624
15874A0624k2500m397M2342Q1235k5948l4688l9717l7606K5948N03r130M2706
$$ 10624 -11876 -16273 26069 107304 81356 46668 6951 -30655 -4707 -4204 -13334 29372
15862B9372l03r1182K5431J0322k1123j4875K4976M3067n583j03069q3942n0770
$$ 29372 29069 -62113 -36682 -26360 -47483 -62358 -37382 5685 102 -102967 -186909 -237679
15850b37679K4254K0965J35937N1181o3910n7415M6206j3025K0890Q4718K570
$$ -237679 -213425 -192460 -56523 -5342 -69252 -126667 -80461 -93486 -72596 12122 14692
15839A4692o4708k8409n1448K2148k3855N8606q202P4784O2967k6289r9007n1996
$$ 14692 -50016 -78425 -129873 -107725 -131580 -72974 -81176 -6392 56575 30286 -68721 -120717
15827a20717j0022J23376j4420O339j1747K7864l4059n3761J8894o4227k0784
$$ -120717 -130739 -7363 -21783 -15444 -27191 673 -33386 -87147 -68253 -132480 -153264
15816a53264M3644R652l2759P0125Q7487M7832O2793p0012p5397m3974K1899n0996
$$ -153264 -109620 -99968 -132727 -62602 24885 72717 135510 65498 -9899 -53873 -31974 -82970
15804h2970Q881J03334M8308L9424K0008j0726p2398n7060l0629n5777j924J151
$$ -82970 -74089 29245 77553 116977 136985 126259 53861 -3199 -33828 -89605 -91529 -90378
15792i0378L4832K8029J8054l3015R0152k2695k5536k6731n3290p6455K9602Q6931
$$ -90378 -55546 -27517 -9463 -42478 47674 24979 -557 -27288 -80578 -157033 -127431 -40500
15780d0500M5171o9287K9189r3228J9647K4286O1559Q0038n5249n3413Q844l187
$$ -40500 4671 -64616 -35427 -128655 -109008 -84722 -23163 56875 1626 -51787 -42943 -46130
15768d6130p2221J9977J1874j6944J06457K1609j39496j7461R8440R4411n5484
$$ -46130 -118351 -98374 -86500 -103444 3013 24622 -114874 -132335 -33895 60516 5032
15757E032J7516M6323o7469p4560M3977m1542M0622J1465N6075M1426N6124j7804
$$ 5032 22548 68871 1402 -73158 -29181 -70723 -30101 -18636 37439 78865 134989 117185
15745A17185n5233j26039n0438M2998M6348K3202j26619n0585Q1236P698L0833
$$ 117185 61952 -64087 -114525 -71527 -25179 -1977 -128596 -179181 -97945 -90247 -59414
15734e9414j3390k5342l3494L043r957k9735m7179Q5875Q9357L0872N3127j2125
$$ -59414 -72804 -98146 -131640 -128597 -138554 -168289 -215468 -129593 -40236 -9364 43763 31638
15722C1638L1743J8503q768r1818L5554Q3218l4678k9778L8719P3196l1989L8520
$$ 31638 63381 81884 73116 -18702 16852 100070 65392 35614 74333 147529 115540 154060
15710A54060n2518o3539l8951k4722j7458K9442L5470n5459r647P5708P214l6244
$$ 154060 101542 38003 -948 -25670 -43128 -13686 21784 -33675 -43322 32386 39600 3356
15698C356l988j1861K381P1425n239K6207m583R665N5477L7781m8819j12196j9549
$$ 3356 -632 -12493 -10112 61313 56074 82281 77698 87363 142840 180621 131802 19606 57
15685E7j697K5915k8008o5614K3859N4019j9818j09678m4150K5653J03731N5724
$$ 57 -1640 24275 -3733 -69347 -45488 8531 -11287 -120965 -165115 -139462 -35731 19993
15673A9993J583l3157m7348P461N2111M8928j3001m4184j5507q173J4303J6956
$$ 19993 21576 -11581 -58929 -51468 643 49571 36570 -7614 -23121 -31294 -16991 -35
15661c5K2356J4433j11076k8640J1196l6619L5159l7620M061M2310j075K2691
$$ -35 22321 36754 -74322 -102962 -91766 -128385 -93226 -130846 -126785 -84475 -85550 -62859
15649f2859O2884L8676r802K5296J3394l2084J6201n0397o1618l1595R073P8728
$$ -62859 25 38701 28899 54195 67589 35505 51706 1309 -60309 -91904 -82831 -4103
15637d103L3531n4177n7832o8819j06913K0417J04622J4839J1713L9740J23227
$$ -4103 29428 -24749 -82581 -151400 -258313 -237896 -133274 -118435 -106722 -66982 56245
15626E6245J4209q7202j0326M346K723L2256M1656q877k9631Q066R899M2460Q8304
$$ 56245 70454 -16748 -27074 -22728 -20005 12251 53907 45030 15399 23465 33364 75824 164128
15613A64128l6646n9159l8960k7218p1969R896M1538Q0122P3375J8898o2791r9150
$$ 164128 127482 68323 29363 2145 -69824 -59928 -18390 61732 135107 154005 91214 -7936
15601g936j9747K7752O871n9488j3153L8084K4769J19766P4798o8415q9195r7315
$$ -7936 -27683 69 6940 -52548 -65701 -27617 -2848 116918 191716 123301 34106 -63209
15589f3209j5201J3699o4759j6280P2186M9627o8981J2412O489N3799N0604q3015
$$ -63209 -78410 -64711 -129470 -145750 -73564 -23937 -92918 -80506 -74017 -20218 30386 -52629
15577e2629J517J3892j3819j5077k717k1557P5624J9399J17550J01943J926R053
$$ -52629 -51112 -37220 -51039 -66116 -68833 -90390 -14766 4633 122183 224126 226052 235105
15565B35105p3974p4454l7362j1086o2229p037J8429j0052o316M4080n4504J081
$$ 235105 161131 86677 49315 38229 -24000 -31037 -12608 -22660 -28976 15104 -39400 -38319
15553c8319l9925L2109J23937Q889j3l9712k4503j7237n2644o399l2853P915k861
$$ -38319 -78244 -46135 77802 86691 86678 46966 22463 5226 -47418 -53817 -86670 -78755 -81616
15540h1616k2661L939l0374R5635J1693m5341N2175k7943m0782N0149n1601M678
$$ -81616 -104277 -100338 -130712 -35077 -23384 -68725 -16550 -44493 -85275 -35126 -86727 -82049
15528h2049j557n7568p672L6804q244l448N4084l3852o5548J3070N4072p506L062
$$ -82049 -83606 -141174 -148846 -112042 -120286 -123734 -69650 -103502 -169050 -155980 -101908 -109414 -106352
15515a06352N6762Q6567O6643l6691k8711m5802j4883L9529j251N3248r2376o7481
$$ -106352 -49590 36977 103620 66929 38218 -7584 -22467 17062 15811 69059 -23317 -90798
15503i0798k8523N5032P7648M5924j7896m3767P0560q445J7553l0331l1005o4730
$$ -90798 -119321 -64289 13359 59283 41387 -2380 68180 59735 77288 46957 15952 -48778
15491d8778L7172L4670p8807N5915Q2823k0616r2339m0631m9572M2133j3191N6610
$$ -48778 -11606 23064 -55743 172 82995 62379 -29960 -70591 -120163 -78030 -91221 -34611
15479c4611J80382O6249m9101j23784j14270L5706j015n9122L0131m378L079Q1883
$$ -34611 145771 212020 162919 39135 -75135 -39429 -40444 -99566 -69435 -73813 -70734 11149
15467A1149O403k2086J6077p3420n0133k6652N6163K227Q398N1498K5949q2908
$$ 11149 17552 -4534 11543 -61877 -112010 -138662 -82499 -80272 -71874 -20376 5573 -77335
15455g7335j2270K7279J7392J8860k8846l5053j177m6050l0834j9875O2585K06915
$$ -77335 -89605 -62326 -44934 -26074 -54920 -89973 -91150 -137200 -168034 -187909 -125324 81591
15443H1591M6368q3783n4801m7962J8546q501m5698P5146J56071P6662m0079j39888
$$ 81591 127959 44176 -10625 -58587 -40041 -48542 -94240 -19094 136977 213639 173560 33672
15431C3672p6820j9365o3406R047P3116j6727m9502M3957j290N1688K5226Q268
$$ 33672 -43148 -62513 -125919 -116872 -43756 -60483 -109985 -66028 -67318 -15630 9596 17864
15419A7864j0257k6898K3556O4063L0917o4924m3366o0967l4585M4384R1628q756
$$ 17864 7607 -19291 4265 68328 99245 34321 -9045 -70012 -104597 -60213 31415 22659
15407B2659O9362r150j3455k1110P3101k1081r0508J9724j2341j13512k7049N8705
$$ 22659 92021 82871 69416 48306 121407 100326 9818 29542 17201 -96311 -123360 -64655
15395f4655N4117Q0644J198m9158j09793o175K1202j2631O8266K0607N086P321
$$ -64655 -10538 70106 71304 22146 -87647 -93822 -72620 -85251 -16985 3622 8708 16029
15383A6029K8678q840k5489M2196l8451q872k5750n4764L8133O75l7608k9997
$$ 16029 44707 35867 10378 52574 14123 5251 -20499 -75263 -37130 -36455 -74063 -104060
15371a04060j1813L1116j9771l1677N0377k571J6520j4570n8015l2716Q174L3477
$$ -104060 -115873 -84757 -104528 -136205 -85828 -88399 -71879 -86449 -144464 -177180 -169006 -135529
15359a35529k4075j9600P9231J15956k5122m2978J6762p8522k7300q673R10j451
$$ -135529 -159604 -179204 -99973 15983 -9139 -52117 -35355 -113877 -141177 -149850 -148940 -150391
15347a50391R0893Q8858N2432k7605k6956p9608L647J00393N542j01k473j9554
$$ -150391 -59498 29360 81792 54187 27231 -52377 -48730 51663 57205 57104 54631 35077
15335C5077m863q9715O807N4344j8758j9328L230k6784j6405J11472K8450j24026
$$ 35077 30214 -59501 -52694 1650 -17108 -36436 -33206 -59990 -76395 35077 63527 -60499
15323f0499N108M3262L8654l474J5525n3867l7304j10908J1272L4909k2893O325
$$ -60499 -55391 -12129 26525 23051 38576 -15291 -52595 -163503 -152231 -117322 -140215 -133890
15311a33890P7414l1545J1172L2710J7132k0445r6313M4310M3214l8862K7317
$$ -133890 -56476 -88021 -76849 -44139 -27007 -47452 -143765 -99455 -56241 -95103 -67786
15300f7786J63023L9495k3381N6765q6532j4772j2031j14496l891j2022M2665
$$ -67786 95237 134732 111351 168116 81584 66812 54781 -59715 -63606 -75628 -32963
15289c2963N4572o0316j27469n6866M1124N3800M2170P0893n5721k9246O3535
$$ -32963 21609 -38707 -166176 -223042 -181918 -128118 -85948 -15055 -70776 -100022 -36487
15278c6487j0828O566l9163l7984l7328j6299P6079m8618o0030K9541L8575J7634
$$ -36487 -47315 -40749 -79912 -117896 -155224 -171523 -95444 -144062 -204092 -174551 -135976 -118342
15266a18342M6898O6257K1340M4676p016p9747q4753k8624K4603M0982j4585K1553
$$ -118342 -71444 -5187 16153 60829 53813 -25934 -110687 -139311 -114708 -73726 -88311 -66758
15254f6758P9370J2733j12684n5758L6988Q2196N1003J6906L7972k6332q2238
$$ -66758 12612 25345 -87339 -143097 -106109 -23913 27090 43996 81968 55636 -26602
15243b6602n5249k7771n9016L8718M0323N8179m7674q2935k6785N8563J01977
$$ -26602 -81851 -109622 -168638 -129920 -89597 -31418 -79092 -162027 -188812 -130249 -28272
15232b8272P1260P4282n7316j17269P6541P2235q5770r3940l1483L4962N6273
$$ -28272 42988 117270 59954 -57315 19226 91461 5691 -88249 -119732 -84770 -28497
15221b8497r0246K2880K3832j9550j1099R6354K9170L7618O72p780k9581m3668
$$ -28497 -118743 -95863 -72031 -91581 -102680 -6326 22844 60462 61134 53354 23773 -19895
15209a9895K9396O9399K8239n6318m0017N0478o396k0402K5590J6429P3165L7830
$$ -19895 9501 78900 107139 50821 10804 61282 54886 34484 60074 76503 149668 187498
15197A87498m7779l0393l6530p9822K7598k1727j4931J7818m9981J3331R4343
$$ 187498 139719 109326 72796 -7026 20572 -1155 -16086 1732 -48249 -34918 59425
15186E9425L6141J2969l0397q0478M094K9157L4902j2891L60j401K0501N9954
$$ 59425 95566 108535 78138 -2340 1754 30911 65813 52922 53282 51881 72382 132336
15174A32336m1248r7715m5670J5547o1925N2776L4641n3740k5435n988j1431L9289
$$ 132336 91088 -6627 -52297 -36750 -98675 -45899 -11258 -64998 -90433 -96421 -107852 -68563
15162f8563M8634q701k7856N2422m2505n6379j1854j2361M1051N8183k1546m6379
$$ -68563 -19929 -28630 -56486 -4064 -46569 -102948 -114802 -127163 -86112 -27929 -49475 -95854
15150i5854L6232J1034K4616l1568l8948k65J02950j4085K7657q101n8730m0851
$$ -95854 -59622 -48588 -23972 -55540 -94488 -94753 8197 -5888 21769 13668 -45062 -85913
15138h5913m3889J04558M8963j7469P3452K8193p4124m0111L506q831O0657K5732
$$ -85913 -129802 -25244 23719 6250 79702 107895 33771 -6340 -2834 -11665 48992 74724
15126G4724m4186j9599N8972k3065q317Q779q6055J9505K494l3209N9417K3121
$$ 74724 30538 10939 69911 46846 38529 47308 -38747 -19242 -16748 -49957 9460 32581
15114C2581N9725p355q2339p4299o9536J6762J17112Q7338K4300j14298n961J2363
$$ 32581 92306 84951 2612 -71687 -141223 -124461 -7349 79989 104289 -10009 -15970 -3607
15102c607p716K4097Q518K3857N2671k2004K8939j0256l4269m6968k913k6067
$$ -3607 -11323 12774 21292 45149 97820 75816 104755 94499 60230 13262 10349 -15718
15090a5718l6111j0485m195J4671j5746J9724M5780N6090l925O6453j6297r0350
$$ -15718 -51829 -62314 -66509 -51838 -67584 -47860 -2080 54010 50085 116538 100241 9891
15078I891j212L4028Q892l4882n0035l8554j1738K0331N7049M3231k8227o9858
$$ 9891 8679 42707 51599 16717 -33318 -71872 -83610 -63279 -6230 37001 8774 -61084
15066f1084j9098N2473M8597Q1501p9712n5493L9305j0494K9093O3044k3487j81412
$$ -61084 -80182 -27709 20888 102389 22677 -32816 6489 -4005 25088 88132 64645 -116767
15054a16767o4497M5400N6998M9093J6560N2912m0717l451j6975m2418K9632K6767
$$ -116767 -181264 -135864 -78866 -29773 -13213 39699 -1018 -4469 -21444 -63862 -34230 -7463
15042g463K9708J34604J16811j05957j78831j30521M9913R1628P925l4662Q635
$$ -7463 22245 156849 273660 167703 -11128 -141649 -91736 -108 7817 -26845 -18210
15031a8210M0686J4205k0815n2818o2791L5227O5226L759k1962L6926O6916p5477
$$ -18210 22476 36681 15866 -36952 -99743 -64516 710 4469 -17493 19433 86349 10872
15019A0872o2870n4606k4327J6876J0994l7060l0906R4252L725p153j5989M3446
$$ 10872 -51998 -106604 -130931 -114055 -103061 -140121 -171027 -76775 -73050 -80203 -96192 -52746
15007e2746k3743o1068J1356N9457N8602j4365J4040p9117P2314L1669L7158N829
$$ -52746 -76489 -137557 -126201 -66744 -8142 -22507 -8467 -87584 -15270 16399 53557 59386
14995E9386n276k3140q4856n4862N5704J9882j7170J7574Q9240l4157O5968J1627
$$ 59386 54110 30970 -53886 -108748 -53044 -33162 -50332 -32758 56482 22325 88293 99920
14983I9920o4989K5731k4178m1143r2944l8397J42255k7383N02l143n9246m4768
$$ 99920 34931 60662 36484 -4659 -97603 -136000 6255 -21128 -20626 -23769 -83015 -127783
14971a27783J17537P1602j056n622o8367o4443R618Q5779L2411N9262M7357N426
$$ -127783 -10246 61356 60300 54678 -13689 -78132 -68514 17265 49676 108938 156295 161721
14959A61721l5378n1332n8297n092o7632m1996K2033M7690l1378j9684L8138J3251
$$ 161721 126343 75011 16714 11622 -56010 -98006 -75973 -28283 -59661 -79345 -41207 -27956
14947b7956n7140m6361J7878j9768q8994P8552O442M1890m169M0939R3477k2431
$$ -27956 -85096 -131457 -113579 -133347 -222341 -143789 -137347 -95457 -99626 -58687 34790 12359
14935A2359j01351j5317M352J2043O4853J36053P492j39879j06311R0914J58195
$$ 12359 -88992 -104309 -99957 -87914 -23061 112992 120484 -19395 -125706 -34792 123403
14924A23403L9440j17648K585q910J6371J35484j08096m8367m1234o4367O6242
$$ 123403 162843 45195 47780 38870 55241 190725 82629 34262 -6972 -71339 -5097
14913e097M9598M8445J0897q9497j51902r142P9399k8763M8336N0142J7151o4046
$$ -5097 44501 92946 103843 14346 -137556 -146698 -67299 -96062 -47726 2416 19567 -44479
14901d4479m6024n8365K492O4142O5693n0231K5914L7696r968j7077o1166k8288
$$ -44479 -90503 -148868 -146376 -82234 -16541 -66772 -40858 -3162 -13130 -30207 -91373 -119661
14889a19661j755J42861J40491j35538j31048O722m658O8488o1078j1109L6260
$$ -119661 -121416 21445 161936 26398 -104650 -97928 -102586 -34098 -95176 -106285 -70025
14878g0025N3727J0429l5847r2845l8413L5606Q2650J00354l5221k0988j1834
$$ -70025 -16298 -5869 -41716 -134561 -172974 -137368 -54718 45636 10415 -10573 -22407
14867b2407N2665L4059n3382m5974n2096o7651J05081o3084Q1968R9469l6741
$$ -22407 30258 64317 10935 -35039 -87135 -154786 -49705 -112789 -30821 68648 31907
14856C1907J6860k3148J8423l6743m4751N8795K8612j7046J4330o8952l6124l4022
$$ 31907 48767 25619 44042 7299 -37452 21343 49955 32909 47239 -21713 -57837 -91859
14844i1859M3718J04274k8623M356N4714l2932n1463l674L5992N0608n7263k3801
$$ -91859 -48141 56133 27510 31866 86580 53648 2185 -1489 34503 85111 27848 4047
14832D047j7562l8002k0794l4987L5771L5853l1104k9312N2255J6818R999j1826
$$ 4047 -13515 -51517 -72311 -107298 -71527 -35674 -66778 -96090 -43835 -27017 -17018 -28844
14820b8844O1898M1577k3579o0371K0228N0347j2621j406P95K9692j31196j6158
$$ -28844 33054 74631 51052 -9319 10909 61256 48635 47229 48024 77716 -53480 -69638
14808f9638J4895o8798o7605L3387o103O6041O5412R927N1926k3842k0618M8218
$$ -69638 -54743 -123541 -191146 -157759 -163862 -97821 -32409 -22482 29444 5602 -15016 33202
14796C3202l672P827J4707J0253j4030l4198m5081o1371L6034M586o0647r348
$$ 33202 29530 37357 52064 62317 48287 14089 -30992 -92363 -56329 -51743 -112390 -121738
14784a21738R7828k9309K5938J7659K0458J10698L7102j27752j1475k3325J5026
$$ -121738 -23910 -53219 -27281 -9622 10836 121534 158636 30884 19409 -3916 11110
14773A1110k1550l3300m256K9092O8089p4431o2362L8194l4101J3430j18536p2751
$$ 11110 -10440 -43740 -47996 -18904 49185 -25246 -87608 -49414 -83515 -70085 -188621 -261372
14761b61372Q7782J09600O0337R4987m158o1827l7567K6362j4265l8242o6709
$$ -261372 -173590 -63990 -3653 91334 87176 25349 -12218 14144 -121 -38363 -105072
14750a05072K3681J10520Q5461p9235r519l508o9840p9101k5073P506J9373R9258
$$ -105072 -81391 29129 114590 35355 25836 22328 -47512 -126613 -151686 -144180 -124807 -25549
14738b5549l4757k6273m6738o076L8308n008m6631l952N5539K6002k3114N7443
$$ -25549 -60306 -86579 -133317 -139393 -101085 -106093 -152724 -156676 -101137 -75135 -98249 -40806
14726d0806L6107l8685m8104J3502L8018q561m5533J8321l3104K3802L7785K7786
$$ -40806 -4699 -43384 -91488 -77986 -39968 -48529 -94062 -75741 -108845 -85043 -47258 -19472
14714a9472K3732m521K3537m8208n2922N9131N1422k5835r7963J8109k3500j14101
$$ -19472 4260 -261 23276 -24932 -77854 -18723 32699 6864 -91099 -72990 -96490 -210591
14702b10591L8127J08073J7947l3428o6070l6505m6376J8231M9894N1953k0694
$$ -210591 -172464 -64391 -46444 -79872 -145942 -182447 -228823 -210592 -160698 -108745 -129439
14691a29439N0963j990j385O3345p4527k0037K7199p8974L1811J3742N7316J07087
$$ -129439 -78476 -80466 -81851 -18506 -93033 -113070 -85871 -164845 -133034 -119292 -61976 45111
14679D5111j7140k5063n672P4595o3867j28128M1902J14358N2636j7840j0784
$$ 45111 27971 2908 -2764 71831 7964 -120164 -78262 36096 88732 70892 60108
14668F0108O3606J6822n112o5159R251P2087K9303j25841q8169L1944l8157l9846
$$ 60108 123714 140536 135424 70265 79516 151603 180906 55065 -33104 -1160 -39317 -79163
14656g9163L3753M4033Q4901j4783q8492m6088j8885r747J2024M9087l8254p3510
$$ -79163 -45410 -1377 83524 68741 -19751 -65839 -84724 -94471 -82447 -33360 -71614 -145124
14644a45124O6209J24140p0713k9145n3926M4850L0490N1641K4354P745o5201
$$ -145124 -78915 45225 -25488 -54633 -108559 -63709 -33219 18422 42776 50521 -14680
14633a4680L2708O025j0377L0310q5527J7682Q1011J5217r9088l0285P9033j6674
$$ -14680 18028 24053 13676 43986 -41541 -23859 57152 72369 -26719 -57004 22029 5355
14621E355k9664L7262k8368o7588O0193L6106J858q3920l1232O6741J02144l0762
$$ 5355 -24309 12953 -15415 -83003 -22810 13296 15154 -68766 -99998 -33257 68887 38125
14609C8125n7716j3215M0151Q1178k1548m3684N5346p4063k0409L8974l8443l9428
$$ 38125 -19591 -32806 7345 88523 66975 23291 78637 4574 -15835 23139 -15304 -54732
14597e4732k0592L5686J5574P5819q0106L496L3777J6585M9463j2554k5265q3041
$$ -54732 -75324 -39638 -24064 51755 -28351 -24855 8922 25507 74970 62416 37151 -45890
14585d5890p2032O434K8730P0358N0331j5547k6110M2951j4115j9956n8628j3599
$$ -45890 -117922 -111488 -82758 -12400 37931 22384 -3726 39225 25110 5154 -53474 -67073
14573f7073J06124n977J1449n9031m5763p6284K0801R1452q0400n182O850J16078
$$ -67073 39051 33074 44523 -14508 -60271 -136555 -115754 -24302 -104702 -109884 -103034 13044
14561A3044O4394P70p1355n7793M5248K8573O158q5842o3311Q6622J01325l8440
$$ 13044 77438 78208 6853 -50940 -5692 22881 29039 -56803 -120114 -33492 67833 29393
14549B9393o8523J6720N9698l7765q2798K1398J3043m2324K2502R0690J7580j4264
$$ 29393 -39130 -22410 37288 -477 -83275 -61877 -48834 -91158 -68656 22034 39614 25350
14537B5350J1323J11352p873r4853o7712p82J1095N8205k0571l2020L3598r6422
$$ 25350 36673 148025 140152 45299 -22413 -23195 -12100 46105 25534 -6486 27112 -69310
14525f9310l5394N6757Q2658j8929j1826M3218l8669j10179L5719L2051Q4692
$$ -69310 -104704 -47947 34711 15782 3956 47174 8505 -101674 -65955 -33904 50788
14514E0788R9207q0250p4078o435J1879J5413N0067j698O5612J1976o548K0604
$$ 50788 149995 69745 -4333 -10768 1111 16524 66591 64893 130505 142481 135933 156537
14502A56537j0850m7707m9249l7873j6164n7448k9685J8350n2750R456M4463P402
$$ 156537 145687 97980 48731 10858 -5306 -62754 -92439 -74089 -126839 -117383 -72920 -65518
14490f5518r547J7442L6865o9383j3608M0359P2354J0797L8345k062j27669l6424
$$ -65518 -75065 -57623 -20758 -90141 -103749 -63390 8964 19761 58106 56044 -71625 -108049
14478a08049M8666J6409q738k5085j9538Q5759J12388m2520j28791m4029m7408
$$ -108049 -59383 -42974 -51712 -76797 -96335 -10576 101812 59292 -69499 -113528 -160936
14467a60936K3762N4448J037M1933L5038J0778l6422m7009N1554O5783L6372o1618
$$ -160936 -137174 -82726 -81689 -39756 -4718 6060 -30362 -77371 -25817 39966 76338 14720
14455A4720J6486k4865m8389l1517P523j6813r691P2q6496O3127N5765l3859N23
$$ 14720 31206 6341 -42048 -73565 -66042 -82855 -92546 -92474 -178970 -115843 -60078 -93937 -93414
14442i3414J06140K6050j4667M9668L2886M0899J1137r1336n8846o9820j5709
$$ -93414 12726 38776 24109 73777 106663 147562 158699 67363 8517 -61303 -77012
14431g7012l9866K4024J6422Q0594j2499N6665M5842r2456j16159L9931m104N4342
$$ -77012 -116878 -92854 -76432 4162 -8337 48328 94170 1714 -114445 -74514 -78618 -24276
14419b4276j86l9726j3020K9595M4441p7492k1502m268O4365M2530l9037M0620
$$ -24276 -24462 -64188 -77208 -47613 -3172 -80664 -102166 -106434 -42069 461 -38576 2044
14407B044k7748K6088L3692N052K4209O0824q4744m4034m2168L0195L8815o349
$$ 2044 -25704 384 34076 39128 63337 124161 39417 -4617 -46785 -16590 22225 15876
14395A5876O4988J2087p6731k875k0920k7025J0902J5131j1843J1102r637k9926
$$ 15876 80864 92951 16220 13345 -7575 -34600 -23698 -8567 -20410 -9308 -18945 -48871
14383d8871l6455J8474O3369n213K2702L0105K6530K8057l2955m155N894p5079
$$ -48871 -85326 -66852 -3483 -8696 14006 44111 70641 98698 65743 61588 67482 -7597
14371g597N4643Q322k0082L6435m5927n9587l3150L8180K4368L1294J8309J7245
$$ -7597 47046 55368 35286 71721 25794 -33793 -66943 -28763 -4395 26899 45208 62453
14359F2453r1141o6866J21196O5816k2843q7433l7316L5576L3584k0093q5566
$$ 62453 -28688 -95554 25642 91458 68615 -18818 -56134 -20558 13026 -7067 -92633
14348i2633N5112Q2683m322k726O827l4393r6003L606m678k2068M0999P9048P0944
$$ -92633 -37521 45162 40840 38114 44941 10548 -85455 -81849 -86527 -108595 -67596 11452 82396
14335H2396q6867m3876J4334L9679k8249N1083J4476L5089L8402l9202l9616J3302
$$ 82396 -4471 -48347 -34013 5666 -22583 28500 42976 78065 116467 77265 37649 50951
14323E0951P5233O429r8256m8959M6721k9273J3619j0433l796l1203Q422j3943
$$ 50951 126184 132613 34357 -14602 32119 2846 16465 6032 2236 -28967 -20545 -34488
14311c4488m5822m3184l0979N9492N7822M4169M961J89l3016l0307M4312j8996
$$ -34488 -80310 -123494 -154473 -94981 -37159 7010 11971 12160 -20856 -51163 -6851 -25847
14299b5847l0812K5664o378q219O082L5134n890M3016J1085K0479L9242j14567
$$ -25847 -56659 -30995 -37373 -45592 -39510 -4376 -10266 32750 43835 64314 103556 -11011
14287a1011j7305j555P241M529K8730l7458l5742R7639J6992l0739l1988n2792
$$ -11011 -28316 -29871 -22630 -18101 10629 -26829 -62571 35068 52060 21321 -10667 -63459
14275f3459R7087P3294p1816m6036n2580p5415J6567J07994J5853N7224j2867
$$ -63459 33628 106922 35106 -10930 -63510 -138925 -122358 -14364 1489 58713 45846
14264D5846L5190O5802j8856k3043m6126M4474o3070r7139m0965l3352K8462K2718
$$ 45846 81036 146838 127982 104939 58813 103287 40217 -56922 -97887 -131239 -102777 -80059
14252h0059R6149L7328o599J2668j3405j4110K2420j7640l949k6196L3703j8956
$$ -80059 16090 53418 46819 59487 46082 31972 54392 36752 32803 6607 40310 21354
14240B1354M535K2243k5080n5644P733Q572q4098M0353M4794n8716r3882p419
$$ 21354 25889 48132 23052 -32592 -24859 -16287 -100385 -60032 -15238 -73954 -167836 -175255
14228a75255J04733K3961L5625M7647K2743p3041o7350o2462P420k9471M7540
$$ -175255 -70522 -46561 -10936 36711 59454 -13587 -80937 -143399 -135979 -165450 -117910
14217a17910L8177M7980l3980m6456K7105m5520k3813L2528k325L9098K4731N0724
$$ -117910 -79733 -31753 -65733 -112189 -85084 -130604 -154417 -121889 -124214 -85116 -60385 -9661
14205i661O9589j927q2835O934M4446q149m915J3079K3343K8095r0763m7714L4895
$$ -9661 59928 58001 -24834 -17900 26546 18397 13482 26561 49904 77999 -12764 -60478 -25583
14192b5583l011L1830o4984j39034o1977J12305J05697J21302O1291r4534k1388
$$ -25583 -28594 3236 -61748 -200782 -262759 -150454 -44757 76545 137836 43302 21914
14181B1914l683m0330K7478j2386k6539k807J9741o4417o7374O7439M5309k3737
$$ 21914 18231 -22099 5379 -7007 -33546 -36353 -16612 -81029 -148403 -80964 -35655 -59392
14169e9392M290N0196o3299N055k3748L4048J6747j2453j827k6424l6932N9071
$$ -59392 -55102 -4906 -68205 -63150 -86898 -52850 -36103 -48556 -50383 -76807 -113739 -54668
14157e4668J9393J3465J9129l914M2042j5330L5264Q513q9747p4381M7142p5643
$$ -54668 -35275 -21810 -2681 -6595 35447 20117 55381 63894 -25853 -100234 -53092 -128735
14145a28735L075O3869K9467L9998k2398j2313M0821L1968K8825M0892L8171k3959
$$ -128735 -125660 -61791 -32324 7674 -14724 -27037 13784 45752 74577 115469 153640 129681
14133A29681P695j30943r8026O747L8772M573r596m7907O5138L7904j0992O456
$$ 129681 137376 6433 -91593 -84846 -46074 -41501 -51097 -99004 -33866 4038 -6954 -498
14121d98K0045O7470p0533p1787K5155k4597J5667o0012m3282N133N988j5063
$$ -498 19547 87017 16484 -55303 -30148 -54745 -39078 -99090 -142372 -137239 -131251 -146314
14109a46314m0050N3039M9014l202P7470o9711j00300O5350K8074k7524L768J25887
$$ -146314 -186364 -133325 -84311 -87513 -10043 -79754 -180054 -114704 -86630 -114154 -110386 15501
14097A5501l1756p0371o6807K3057K684l1932R8731K2583l3735P651N1398M5595
$$ 15501 -16255 -86626 -153433 -130376 -127692 -159624 -60893 -38310 -72045 -64394 -12996 32599
14085C2599k579k9169n8340m6921K0223N1000J5269L6788K7837N5758n0942j23276
$$ 32599 30020 851 -57489 -104410 -84187 -33187 -17918 18870 46707 102465 51523 -71753
14073g1753l8890o4193M4950N1541R414P8014M2324r9562m6397j7651K4126K296
$$ -71753 -110643 -174836 -129886 -78345 -68931 9083 51407 -48155 -94552 -112203 -88077 -85781
14061h5781O2160P2909M4685N1490j8442q3268k3482P544M3631L2447M1578j548
$$ -85781 -23621 49288 93973 145463 127021 43753 20271 27815 71446 103893 145471 143923
14049A43923n4754n8322L1425J8872M381m1857N3937J6329n6690p579K0270J4347
$$ 143923 89169 30847 62272 81144 85525 43668 97605 113934 57244 49665 69935 84282
14037H4282n3764j09034L9047N1908M312l4002O0194j0585k9175m3986J3198j6055
$$ 84282 30518 -78516 -39469 12439 16751 -17251 42943 32358 3183 -40803 -27605 -43660
14025d3660L1941k014Q4338l6744m0579J01036K1404p7837n3941p897l7874k6602
$$ -43660 -11719 -13733 70605 33861 -6718 94318 115722 37885 -16056 -23953 -61827 -88429
14013h8429j3766N3949o515j3542Q4079l407N0141J7875k8417M4848j5893r2414
$$ -88429 -102195 -48246 -54761 -68303 15776 12369 62510 80385 51968 96816 80923 -11491
14001a1491n8873j9589j3867p7938o056Q1445J01165O9626J0314q5637r3415j3555
$$ -11491 -70364 -89953 -103820 -181758 -187814 -106369 -5204 64422 74736 -10901 -104316 -117871
13989a17871L5199j414J4273O6011K0812K0m0521k8665J6811j7039K9413N1556
$$ -117871 -82672 -84086 -69813 -3802 17010 17030 -23491 -52156 -35345 -52384 -22971 28585
13977B8585K2611j5653n9853j5765L7169j0575p9571J43921O0648n859q104n8934
$$ 28585 51196 35543 -24310 -40075 -2906 -13481 -93052 50869 111517 105658 97554 38620
13965C8620j03714m3249Q7481L0235J1175l4219K1475o102L7566L4304q534l1400
$$ 38620 -65094 -108343 -20862 9373 20548 -13671 7804 1702 39268 73572 65038 33638
13953C3638k3995m7398m9436K7001n912m7467j6325J1177R7578O423L1532Q6463
$$ 33638 9643 -37755 -87191 -60190 -66102 -113569 -129894 -118717 -21139 -14716 16816 103279
13941A03279l2874m7655K3077j2000q0288J23875O2725k9854k3866q5991J0527
$$ 103279 70405 22750 45827 33827 -46461 77414 140139 110285 86419 428 10955
13930A0955M7787M9702K7364k3184n8559m7641l9934j8591o9410O11J7845L6598
$$ 10955 58742 108444 135808 112624 54065 6424 -33510 -52101 -121511 -120900 -103055 -66457
13918f6457Q992m0960M3296M8324m4735K7329P9147M9839j0583m0801j938K2563
$$ -66457 -57465 -98425 -55129 -6805 -51540 -24211 54936 104775 94192 53391 51453 74016
13906G4016P318j7414l1528L4031Q1031L2614n0597o5427j8081J7860M4715K4091
$$ 74016 81334 63920 32392 66423 147454 180068 129471 64044 45963 63823 108538 132629
13894A32629m7239m909l0934j085l4001p5636j9454O794P3632L5418K0481n3428
$$ 132629 85390 80481 49547 48462 14461 -61175 -80629 -73835 -203 35215 55696 2268
13882B268K7003N968m0222k2051l3041J1984M4430L9206k6203k4695p1723k2256
$$ 2268 29271 35239 -4983 -27034 -60075 -48091 -3661 35545 9342 -15353 -87076 -109332
13870a09332O2797m4229j4045L215L1418r661Q8878K5708p3856q966N5673k3915
$$ -109332 -46535 -90764 -104809 -101594 -70176 -79837 9041 34749 -39107 -48073 7600 -16315
13858a6315l5270J5590o9267l3714q3422k7998M8525J34436k5736J2663P1182
$$ -16315 -51585 -35995 -105262 -138976 -222398 -250396 -201871 -67435 -93171 -80508 -9326
13847i326j141J2137p2244K1020Q8143J0646m3553J8835M9312q711N5442N0225
$$ -9326 -10467 1670 -70574 -49554 38589 49235 5682 24517 73829 65118 120560 170785
13835A70785j5498j02258o0005k7692J8307J8298N939L142N4092p2690L1981J2691
$$ 170785 155287 53029 -6976 -34668 -16361 1937 7876 11018 65110 -7580 24401 37092
13823C7092l3177m3694q057l1904m1220K4380K5532N8530Q1268m997m0165r2897
$$ 37092 3915 -39779 -47836 -79740 -120960 -96580 -71048 -12518 68750 63753 23588 -69309
13811f9309m1033j0092k9798j717q203j982j4866L6860Q770J7473J03592R6578
$$ -69309 -110342 -120434 -150232 -151949 -160152 -162134 -177000 -140140 -131370 -113897 -10305 86273
13799H6273P1223j4362M9594m6150n9907l7651o6679o6112K721J2934o4811m335
$$ 86273 157496 143134 192728 146578 86671 49020 -17659 -83771 -81050 -68116 -132927 -137262
13787a37262O8946L4370M6065j5227o4802K4716o4973m0656o213O4365N0621L0163
$$ -137262 -68316 -33946 12119 -3108 -67910 -43194 -108167 -148823 -155036 -90671 -40050 -9887
13775i887J2197Q2695M5955k8778p1190Q0842k4728o0928j8996o103N1999r0436
$$ -9887 2310 85005 130960 102182 30992 111834 87106 26178 7182 1079 53078 -37358
13763c7358k6232J03104M5847l8974q50m9070L5824J5982r1617l2907J9498Q8701
$$ -37358 -63590 39514 85361 46387 45537 -3533 32291 48273 -43344 -76251 -56753 31948
13751C1948P0461J6265p8475J2607K3961k3616j0084l8913Q231K1586j5624J661
$$ 31948 102409 118674 40199 52806 76767 53151 43067 4154 12385 33971 18347 20008
13739B0008P1189k3713q0237L7147J9166n8076M9458K4292K179O347L1339M2792
$$ 20008 91197 67484 -12753 24394 43560 -14516 34942 59234 61413 67760 99099 141891
13727A41891r145L4190L9456o8767o6586j0837N7273j3888m6328l1015k8110k7542
$$ 141891 132746 166936 206392 137625 71039 60202 117475 103587 57259 26244 -1866 -29408
13715b9408J1308m713j1638k8667J01303L7668l4529o7551L9730J04620q4768
$$ -29408 -18100 -22813 -34451 -63118 38185 75853 41324 -26227 13503 118123 33355
13704C3355m5866l3224j0495M5941n508j9724k023K3210K2321p625k8156J5689
$$ 33355 -12511 -45735 -56230 -10289 -15797 -35521 -37544 -14334 7987 362 -27794 -12105
13692a2105k6644j7562m701j9048j4067m7477L608M284K5840N5780M9111l8834
$$ -12105 -38749 -56311 -61012 -80060 -94127 -141604 -137996 -133712 -107872 -52092 -2981 -41815
13680d1815k4024J23143P9182n7999q5518J9995k645L7211N9775l9006N8756J8445
$$ -41815 -65839 57304 136486 78487 -7031 12964 10319 47530 107305 68299 127055 145500
13668A45500q1437o5161M186o618K0412k9731j09738R709P5799p796K6385L9616
$$ 145500 64063 -1098 3088 -3530 16882 -12849 -122587 -112878 -37079 -44875 -18490 21126
13656B1126n771O5831J7010K5401K8022j6630l3206l3175m4308M9630l0114k2499
$$ 21126 15355 81186 98196 123597 151619 134989 101783 68608 24300 73930 43816 21317
13644B1317j1460k2017K3662p981O137J06993P51o8582k442q0617q5463K0618
$$ 21317 9857 -12160 11502 3521 9658 116651 117402 48820 46378 -34239 -119702 -99084
13632i9084J13040J31453p786K838k4235L2729n9386k4299l1961k0557M7190j8088
$$ -99084 13956 145409 137623 140461 116226 148955 89569 65270 33309 12752 59942 41854
13620D1854m6227j9703l826L4455J1139m4209k9964L6539R2248n609m0890o6906
$$ 41854 -4373 -24076 -27902 6553 17692 -26517 -56481 -19942 72306 66697 25807 -41099
13608d1099P0051K8131Q2478J1538L5189L4846n6418j10720m0556J3301R614q2400
$$ -41099 28952 57083 139561 151099 186288 221134 164716 53996 13440 26741 36355 -46045
13596d6045p574k0620r678M557J0237K5760r110L6292K8271R6576k510j18149
$$ -46045 -53619 -74239 -83917 -79360 -69123 -43363 -52473 -16181 12090 108666 106156 -11993
13584a1993o1352r609Q8276Q4438l813j06554m0698M8014M5831j8779m8304p145
$$ -11993 -73345 -82954 5322 89760 85947 -20607 -61305 -13291 32540 13761 -34543 -41688
13572d1688K9536Q5395l0852j3052r0286j12170J0914O4355M7191j1569Q8820
$$ -41688 -12152 73243 42391 29339 -60947 -173117 -162203 -97848 -50657 -62226 26594
13561B6594R591m4383p5500l54P2612J5281q582O5749o5594n4454N2305j9709
$$ 26594 36185 -8198 -83698 -84052 -11440 3841 -4741 61008 -4586 -59040 -6735 -26444
13549b6444P28l827N5686L3273j4770l2614o701j7746K1671L6125J8529P382k1054
$$ -26444 -25716 -29543 26143 59416 44646 12032 5331 -12415 9256 45381 63910 71292 50238
13536E0238l2458L6589K2569m315k9567J7708o9520q6649k8519P8899J04862M2778
$$ 50238 17780 54369 76938 72623 43056 60764 -8756 -95405 -123924 -45025 59837 102615
13524A02615M0582k0781p8828l0945L8919l1394j1354P543O1797J0936k1117P343
$$ 102615 143197 122416 43588 12643 51562 20168 8814 16357 78154 89090 67973 75316
13512G5316q160l6530l7913l3365M1248M142j7908q550j2508K8143N6215J4373
$$ 75316 67156 30626 -7287 -40652 596 4738 -13170 -21720 -34228 -6085 50130 64503
13500F4503m0220l6029N9728L1549K8634l2767j2457k3639o3733J9431k5691O741
$$ 64503 24283 -11746 47982 79531 108165 75398 62941 39302 -24431 -5000 -30691 -23950
13488b3950l2851l0322M330N9026J9761l2552M2083J28891k4226m9596p6735o0971
$$ -23950 -56801 -87123 -82793 -23767 -4006 -36558 5525 134416 110190 60594 -16141 -77112
13476g7112M7197N3227L9629j970n2433k6425J31106R2527n8852q3142j02580
$$ -77112 -29915 23312 62941 60971 8538 -17887 113219 205746 146894 63752 -38828
13465c8828J4153N9364P3581J0805q6336j0940j8726l8342K6628N6688O4474Q146
$$ -38828 -24675 34689 108270 119075 32739 21799 3073 -35269 -8641 48047 112521 120667
13453A20667J082k3499j19102J0349K6280M5906K1458j3809m9452j352N0960N4862
$$ 120667 121749 98250 -20852 -10503 15777 61683 83141 69332 19880 18528 69488 124350
13441A24350k7773j01162m3957p5211k818K1962K7350P9337l4200K4580J04571
$$ 124350 96577 -4585 -48542 -123753 -126571 -104609 -77259 2078 -32122 -7542 97029
13430I7029O8963l8349m3879p7097k5175L4381M6468o3390L7978R862R590K3217
$$ 97029 165992 127643 83764 6667 -18508 15873 62341 -1049 36929 46791 56381 79598
13418G9598O314M4476j4020n7810L7837P092J6328P840J8339K3979k7787m5332
$$ 79598 85912 130388 116368 58558 96395 103487 119815 127655 145994 169973 142186 96854
13406I6854J7205k0659o6994q4649N128L928K7064O2489K3623n6657J5774L3728
$$ 96854 114059 93400 26406 -58243 -53115 -49187 -22123 40366 63989 7332 23106 56834
13394E6834M8445o2441m7795k9497N0821J9908p4480J6831Q2530l6414K827m0149
$$ 56834 105279 42838 -4957 -34454 16367 36275 -38205 -21374 61156 24742 27569 -12580
13382a2580k8018Q231O2922k7410m4290N2690L4059q3568m9504J3928Q7475R835
$$ -12580 -40598 -32367 30555 3145 -41145 11545 45604 -37964 -87468 -73540 13935 23770
13370B3770L5538R0798Q484n6222n8022p647L7249n8872p052K2083k9802J1044
$$ 23770 59308 150106 158590 102368 44346 36699 73948 15076 8024 30107 305 11349
13358A1349J4363k3805j9503j6425m4125L9746l9323j5585N2256L1633L4246R1257
$$ 11349 25712 1907 -17596 -34021 -78146 -38400 -77723 -93308 -41052 -9419 24827 116084
13346A16084k2034P696N6053J4622o0490n8081K576M5770J8181J2463n8192L3114
$$ 116084 94050 101746 157799 172421 111931 53850 56426 102196 120377 132840 74648 107762
13334A07762k6561m4421L4734O9836L8057o4017j10506m1752j126p0612m1840
$$ 107762 81201 36780 71514 141350 179407 115390 4884 -36868 -37994 -108606 -150446
13323a50446Q0557M4211l6194l1485J3938M813q1830K2026O356l7381J7180L8366
$$ -150446 -69889 -25678 -61872 -93357 -79419 -74606 -156436 -134410 -128054 -165435 -148255 -109889
13311a09889M2632K0268R6632J7260n2766m9090L092J8573R2904N0058j29374
$$ -109889 -67257 -46989 49643 66903 14137 -34953 -31861 -13288 79616 129674 300
13300C00q8993N7015l6786k4608l4424k8689K4717R8727R2227M6080J0144Q459
$$ 300 -88693 -31678 -68464 -93072 -127496 -156185 -131468 -32741 59486 105566 115710 124169
13288A24169j4683n8949o285l3K4966L0606k0757k1523n2956L1494k4588j8541
$$ 124169 109486 50537 44252 44219 69185 99791 79034 57511 4555 36049 11461 -7080
13276g080J7850L8337N3511l6548L252j01660j1819K8842R081K502R1962l474
$$ -7080 10770 49107 102618 66070 69322 -32338 -44157 -15315 -6234 -3732 88230 84756
13264H4756m6151K3135o2594k1832m0635p9125O4630n595P3331K2113k3641P791
$$ 84756 38605 61740 -854 -22686 -63321 -142446 -77816 -83411 -10080 12033 -11608 -3817
13252c817L8224l1946l1169j1758N8085m7314L3344R2661L9501r4082P0N7748
$$ -3817 34407 2461 -28708 -40466 17619 -29695 3649 96310 135811 41729 41799 99547
13240I9547r07r1924p6989L8944L7184l9712k4128M6277K6298J1296o3889o740
$$ 99547 98640 6716 -70273 -31329 5855 -33857 -57985 -11708 14590 25886 -38003 -44743
13228d4743n1170J6535k5087Q471J1586p100J2471m6490O5971J2520L1784N3395
$$ -44743 -95913 -79378 -104465 -95994 -84408 -91508 -79037 -125527 -59556 -47036 -15252 38143
13216C8143m1274r2752P7585J0565M6866O6632L9094O430M6000m7293p8497p8978
$$ 38143 -3131 -95883 -18298 -7733 39133 105765 144859 151289 197289 149996 71499 -7479
13204g479j9224L0798l6577p3314J2598J10985J7571K3828R7268k7159L9314m4050
$$ -7479 -26703 4095 -32482 -105796 -93198 17787 35358 59186 156454 129295 168609 124559
13192A24559k8379J21297O551n7621l9443m9427J5704L5569J7583L3362m0692
$$ 124559 96180 217477 224028 166407 126964 77537 93241 128810 146393 179755 139063
13181A39063k4253j36525k0532J18454J8622L7553M8213j2381r9617M8618J0536
$$ 139063 114810 -21715 -42247 76207 94829 132382 180595 168214 68597 117215 127751
13170A27751o3799l6986K9172J8431j4718k3945m2829o002P0857N3819L9477k5189
$$ 127751 63952 26966 56138 74569 59851 35906 -6923 -12925 57932 111751 151228 126039
13158A26039o0590j5430N9726Q898j21345J6918O2871P6835p0266k1032o661M760
$$ 126039 65449 50019 109745 118643 -2702 14216 77087 153922 83656 62624 55963 60723
13146F0723J8555L520k2138n2801j3094M736j2573j0252L6918M2085P8416M7515
$$ 60723 79278 82798 60660 7859 -5235 -499 -13072 -23324 13594 55679 134095 181610
13134A81610K2022j9828j9404p228J2728j14346r1633k3994r0856p636P3471J31434
$$ 181610 203632 183804 164400 157172 169900 55554 -36079 -60073 -150929 -158565 -85094 46340
13122D6340j6405J8879O7776j03321k8773l0783p0807J28737N8652r3756j7809
$$ 46340 29935 48814 116590 13269 -15504 -46287 -117094 11643 70295 -23461 -41270
13111d1270Q1138K2745m9018o9788n5673j8930L670O1146J4051M6280J10561L0773
$$ -41270 39868 62613 13595 -56193 -111866 -130796 -127126 -65980 -51929 -5649 104912 135685
13099A35685j2676o3342l7405n8069m888L7681N6762K0661K783o0887j01898N4648
$$ 135685 123009 59667 22262 -35807 -40695 -3014 53748 74409 77192 16305 -85593 -30945
13087c0945L9871n2574J7383N478P503m0593m5646k7321N9419N9495J8454Q55
$$ -30945 8926 -43648 -26265 -20787 -13284 -53877 -99523 -126844 -67425 -7930 10524 11379
13075A1379J7667l0531k961o017l456P1604L3764n221o7929r27m0156k2152O8921
$$ 11379 29046 -1485 -4446 -10463 -13919 57685 91449 86228 18299 17372 -22784 -44936 23985
13062B3985j997L2365J5878N993m6480J5794o016l210J5374O8310K9612l7254
$$ 23985 21988 54353 70231 76224 29744 45538 39522 36312 51686 119996 149608 112354
13050A12354J19187k7791j60993j18153J4526L2525Q988J15444J73416j6145j18657
$$ 112354 231541 203750 42757 -75396 -60870 -28345 -19357 96087 269503 253358 134701
13039A34701l6656O4441N2697m4620n2510m433q292M7401k2765k5779M1975o2485
$$ 134701 98045 162486 215183 170563 118053 113620 105328 152729 129964 104185 146160 83675
13027H3675K9836n2890k8170J0315O8991m2056n3695O3581K7661j073K8692L3594
$$ 83675 113511 60621 32451 42766 111757 69701 16006 79587 107248 106175 134867 168461
13015A68461o6606r9373q4134O360J07990K3330O0203l7317l5603q383p2715n9274
$$ 168461 101855 2482 -81652 -75292 32698 56028 116231 78914 43311 34928 -37787 -97061
13003i7061J00273K0767M6575l9327n6133K035K9547L4307N7550l6390N9497l1754
$$ -97061 3212 23979 70554 31227 -24906 -22871 6676 40983 98533 62143 121640 89886
12991H9886m5450J8941L8058k9173l3713K184M3516N4901k705M5307q142p5605
$$ 89886 44436 63377 101435 72262 38549 40733 84249 139150 136445 181752 173610 98005
12979I8005J8N9825j4702j2396N280R06m1823n58M6473k0517p2430K5816R1688
$$ 98005 98023 157848 143146 130750 136030 136936 95113 94555 141028 120511 48081 73897 165585
12966A65585L6325N2613m8109l1815m2102J8177k2419n4432L8121L8786k5157
$$ 165585 201910 254523 206414 174599 132497 150674 128255 73823 111944 150730 125573
12955A25573k2975L130J0690m6709L2237j5720l9848J1766L4696m0322q3393L4584
$$ 125573 102598 105728 116418 69709 101946 86226 46378 58144 92840 52518 -30875 3709
12943C709M3040n8867n753K7058N7837l1677q8112p5338O423K3612R708N6459
$$ 3709 46749 -12118 -17871 9187 67024 35347 -52765 -128103 -121680 -98068 -88360 -31901
12931c1901q127J35643J28920K2426L0362j12056n0094q5110o1619j9021l5290
$$ -31901 -40028 95615 224535 246961 277323 165267 115173 30063 -31556 -50577 -85867
12920h5867J02642n2673l2864J16091P1777K0684p2017o1714J03103J4925m1413
$$ -85867 16775 -35898 -68762 47329 119106 139790 67773 6059 109162 124087 82674
12909H2674K1490Q1186n2305j6511N7102K636p3218m369k5406m1336k2077L1808
$$ 82674 104164 185350 133045 116534 173636 176272 103054 98685 73279 31943 9866 41674
12897D1674o5413j16710J0902J01586O4897R1226J6239j0341m3321n9506j474
$$ 41674 -23739 -140449 -129547 -27961 36936 128162 144401 134060 90739 31233 29759
12886B9759k5069m1939j6309Q4885P1482K0547n0641p548j5873o7909J09527L7468
$$ 29759 4690 -37249 -53558 31327 102809 123356 72715 65167 49294 -18615 90912 128380
12874A28380L2830O6122l668p5811n1743J1490N639O8198Q961l0499l6435m713
$$ 128380 161210 227332 223664 147853 96110 107600 113239 181437 190398 159899 123464 118751
12862A18751l4406o0565K1195J2396j6781m7786J8316R7834P3683L5415o9717
$$ 118751 84345 23780 44975 57371 40590 -7196 11120 108954 182637 218052 148335
12851A48335p7895J7701k0537l1782M5703L8186M2699K483n9307l4278L3178M3927
$$ 148335 70440 88141 67604 35822 81525 119711 162410 164893 105586 71308 104486 148413
12839A48413k6523J4861m1440k2031J0918j6373j13512k9447k307N377R3323J33843
$$ 148413 121890 136751 95311 73280 84198 67825 -45687 -75134 -77441 -72064 21259 155102
12827A55102L5246j6043l3919m5741m597r52O067K9159K696p4188j13369k2499
$$ 155102 190348 174305 140386 94645 90048 89096 95163 124322 127018 52830 -60539 -83038
12815h3038k8912l6386Q7721L1176R3755J06009p310n9920K0150m6812j6534k1023
$$ -83038 -111950 -148336 -60615 -29439 64316 170325 163015 103095 123245 76433 59899 38876
12803C8876l465J11435N6795L1960J9514j7694m6063j0834J5530n5783j38504
$$ 38876 35411 146846 203641 235601 255115 237421 191358 180524 196054 140271 1767
12792A767J1825K8693J9804K9080m6292L4979m9823m738O347L8557M7896l6849
$$ 1767 13592 42285 62089 91169 44877 79856 30033 25295 31642 70199 118095 81246
12780H1246m4913n632L8656Q9768j2982k8737l9124j2099L6504P5736j4894m6723
$$ 81246 36333 30701 69357 159125 146143 117406 78282 66183 102687 178423 163529 116806
12768A16806k1430j2512Q7353m0263j8658m6167r6179M9307M8458K3687L6958
$$ 116806 95376 82864 170217 129954 111296 65129 -31050 18257 66715 90402 127360
12757A27360J8377p6479n4729j8615N1615L8523L4013N320j7478n6942M1893R5218
$$ 127360 145737 69258 14529 -4086 47529 86052 120065 125385 107907 50965 92858 188076
12745A88076P6893k8662j08825m5376R3317N6634o667q0214m7988L9061j10l5614
$$ 188076 264969 236307 127482 82106 175423 232057 225390 145176 97188 136249 136139 100525
12733A00525k71q0026L241J2285M5086q116N0726M6117j3572O9214l2937l6719
$$ 100525 100254 20228 23469 35754 80840 72724 123450 169567 155995 225209 192272 155553
12721A55553j0324l951O153M7539p0940p4179L5672K9988j2771L4525M3166n5659
$$ 155553 145229 141278 147431 194970 124030 49851 85523 115511 102740 137265 180431 124772
12709A24772J8180P8716J21698M6818q2358j86135r1513n1733O6813J14729N375
$$ 124772 142952 221668 343366 390184 307826 121691 30178 -21555 45258 159987 165362
12698A65362n716j9437l137M8831O496o0020k3557O1974m93K7530R0367m372n0969
$$ 165362 159646 140209 137072 185903 192399 132379 108822 170796 170303 197833 288200 283828 232859
12685B32859J3444L8337M1364p5065n2481m6433l0037J2016J1657q974J00443
$$ 232859 246303 284640 326004 250939 198458 152025 121988 134004 145661 136687 237130
12674B37130P7996M9735j17564r8078K7836K6863Q194n0628p7302k6480l3722
$$ 237130 315126 364861 247297 149219 177055 203918 212112 161484 84182 57702 23980
12663B3980J1677J8748K3198R9063L3714l6055m2462L5244P999r8250q957M6166
$$ 23980 35657 54405 77603 176666 210380 174325 131863 167107 175106 76856 67899 114065
12651A14065K9563n334L8378l209M1525j0233n8831n7016L8052J7716m6532J1493
$$ 114065 143628 138294 176672 173463 214988 204755 145924 88908 126960 144676 98144 109637
12639A09637N8790J16271k2667K0455P9581n3012m3721j7965K3900R126l7864
$$ 109637 168427 284698 262031 282486 362067 309055 265334 247369 271269 280395 242531
12628B42531j0927j8001p2425m4507L1311R2233P1036L6188K193o234p5864o6123
$$ 242531 231604 213603 141178 96671 127982 220215 291251 327439 329632 323398 247534 181411
12616A81411J8969r376m5181k2568L4674N7154l7387q6178k194O4321M4745q8480
$$ 181411 200380 191004 145823 123255 157929 215083 177696 91518 89324 153645 198390 109910
12604A09910l9012O5429L4672m1557k1999N9604J0353n7266N337J8567l4032j1594
$$ 109910 70898 136327 170999 129442 107443 167047 177400 120134 125471 144038 110006 98412
12592I8412Q7774N9936N320j6760N6374P9815p8964q541L3334l7594n1457j878
$$ 98412 186186 246122 251442 234682 291056 370871 291907 283366 316700 279106 227649 225771
12580B25771L5112j8815k2363N8132p9035M704M1807k4840L6568J2285k076m3171
$$ 225771 260883 242068 219705 277837 198802 203506 245313 220473 257041 269326 267250 224079
12568B24079q2056k2417L7223Q5974J8660j6016m3420n6411M3295r801R0345k3307
$$ 224079 142023 119606 156829 242803 261463 245447 202027 145616 188911 179110 269455 246148
12556B46148j3608k278j5834O4915k392L5002K8322L3110l1176j02648j4978j1969
$$ 246148 232540 230262 214428 279343 276951 311953 340275 373385 342209 239561 224583 212614
12544B12614p4880o7583P673Q0918J8303j2999k4105k546O6256L3771K3697P4795
$$ 212614 137734 70151 77824 158742 177045 164046 139941 137395 203651 237422 261119 335914
12532C35914R1545o8922r3014R617P7605L46o9578j01407m2942r298K4631Q115
$$ 335914 427459 358537 265523 275140 352745 353091 283513 182106 139164 129866 154497 162612
12520A62612L3261n454Q263J2059j0891L8601K0289Q2314j8810L8585n6778j19455
$$ 162612 195873 190419 198682 210741 199850 238451 258740 341054 322244 360829 304051 184596
12508A84596n1883R0452K7675k1265Q01m5413r6279L8588P0265J4406K1568L2338
$$ 184596 132713 223165 250840 229575 230376 184963 88684 127272 197537 211943 233511 265849
12496B65849L9067k1844K8421p2528j8200Q9592O8562K2399m6391p863L6020O1770
$$ 265849 304916 283072 311493 238965 220765 310357 378919 401318 354927 347064 383084 444854
12484D44854k0567p3771q0563N3722J12655l7428n7620m3166Q5128R4683l8623
$$ 444854 424287 350516 269953 323675 436330 398902 341282 298116 383244 477927 439304
12473D39304j7108p205l47r6100m3137N4391L6121n6384o1097n425N8516j3642
$$ 439304 422196 414991 414644 318544 275407 329798 365919 309535 248438 243013 301529 287887
12461B87887l2795M5234N0983K7658R4668J4752j38184o1379l4755n9222J12416
$$ 287887 255092 300326 351309 378967 473635 488387 350203 288824 254069 194847 307263
12450C07263Q4980n1191j13558M6158J11280Q5514n315n2050l4221M6139P1006
$$ 307263 392243 341052 227494 273652 384932 470446 465131 413081 378860 424999 496005
12439D96005k8098j12908m3791J5592N4853M6449l6304M7813n610L5811p189n5982
$$ 496005 467907 354999 311208 326800 381653 428102 391798 439611 434001 469812 462623 406641
12427D06641j0792k5852m3777r769K081N3247K4106J2241M0056m7286p6264P035
$$ 406641 395849 369997 326220 316451 318532 371779 395885 408126 448182 400896 324632 331667
12415C31667o5140R0662P2520k7388O5670k5964m4869P8668K5376k0397l0189
$$ 331667 266527 357189 429709 402321 467991 442027 397158 475826 501202 480805 450616
12404D50616K0206K4795q688p2444j5583k706J14417n4992p5679J8673j0497k9802
$$ 450616 470822 495617 486929 414485 398902 396196 510613 455621 379942 398615 388118 358316
12392C58316N8569O8417M6488K6300k2885J6270l9343j12536l5993K3633M518
$$ 358316 416885 485302 531790 558090 535205 551475 512132 399596 363603 387236 391754
12381C91754j9511q9723J4432M4622N2579O897l3649j7962J21465O0842M496l3173
$$ 391754 372243 282520 296952 341574 394153 401050 367401 349439 470904 531746 536242 503069
12369E03069j6204m0314K3987K8461P505j7132K4363K7283j5329P4719Q3953L3220
$$ 503069 486865 446551 470538 498999 506504 489372 513735 541018 525689 600408 684361 717581
12357G17581m4416k7226m6087j2765M5908j6015J4260k5194Q682q7741L913O9937
$$ 717581 673165 645939 599852 587087 632995 616980 631240 606046 614728 526987 530900 600837
12345F00837R9457o2571n5996K1183m367j603j5745L0924O2458K2030P928l1486
$$ 600837 700294 637723 581727 602910 598543 596940 581195 612119 674577 696607 704535 673049
12333F73049l5381k729q7477j6168l2145K6024k9072N3538L0104l5180R8100Q0736
$$ 673049 637668 634939 547462 531294 499149 525173 496101 549639 579743 544563 642663 723399
12321G23399K875o0292j07692q786j55N4040L5373j0239L5132L3708k37l8662
$$ 723399 726274 665982 558290 549504 549349 603389 638762 628523 663655 697363 697126 658464
12309F58464K7457J623K9581M8789j7644q847J20319R439P36O1641k6737k4657
$$ 658464 685921 687544 717125 765914 748270 739423 859742 869181 869917 931558 904821 880164
12297H80164n0916n6683l4884n5442o713J2177O1934N2939R4272n5247j41623
$$ 880164 829248 772565 737681 682239 675526 687703 749637 802576 896848 841601 699978
12286F99978M2839M3184j7829Q687M1255J2219j09426L0413L9342O0388L1629
$$ 699978 742817 786001 768172 776859 818114 830333 720907 751320 790662 851050 882679
12275H82679k2114L7320n092L0802k0888n633l6563q229N9825J0762J2505L7144
$$ 882679 860565 897885 892793 923595 902707 897074 860511 852282 912107 922869 935374 972518
12263I72518n8735M373j1210J9450k8798M4066L4891m3322l4786L9784M9016P2164
$$ 972518 913783 918156 906946 926396 897598 941664 976555 933233 898447 938231 987247 1059411
12251A059411p9038l7811n817o510l6988R719N6824N3472k9454p82j214J9597
$$ 1059411 980373 942562 936745 930235 893247 902966 959790 1013262 983808 983026 981812 1001409
12239A001409R763M115O7772l081n8285m2800m4125N0889J25348J16797K462N685
$$ 1001409 1011172 1015287 1083059 1079978 1021693 978893 934768 985657 1111005 1227802 1230264 1235949
12227A235949k1849o8569P7949k9093j3808j4759j8024J0675J24347o14o0223
$$ 1235949 1214100 1145531 1223480 1194387 1180579 1165820 1147796 1158471 1282818 1282204 1221981
12216A221981l6934j9947L3045P5409J3137N7109L7475M0273k6028O6462L4455
$$ 1221981 1185047 1165100 1198145 1273554 1286691 1343800 1381275 1421548 1395520 1461982 1496437
12205A496437p5885O5691j9518q4499j5983O8340O3215r3831m3241K9040r03J1602
$$ 1496437 1420552 1486243 1466725 1382226 1366243 1434583 1497798 1403967 1360726 1389766 1388863 1400465
12193A400465L9957O3964K1784j1902k2245P6654k9694l5443L1612Q8434M4676
$$ 1400465 1440422 1504386 1526170 1514268 1492023 1568677 1538983 1503540 1535152 1623586 1668262
12182A668262N4031K8612q7517k4740N8917Q1850j2927n3853K030j0437M9408
$$ 1668262 1722293 1750905 1663388 1638648 1697565 1779415 1766488 1712635 1714665 1704228 1753636
12171A753636O9271l8224j5568k2597O6322M0069J2903k5730m5164L4129J44310
$$ 1753636 1822907 1784683 1769115 1746518 1812840 1852909 1865812 1840082 1794918 1829047 1973357
12160A973357M431J927M9997O7930m7572M26J41660k6658m5223l3858k6007M0441
$$ 1973357 1977788 1979715 2029712 2097642 2050070 2050496 2192156 2165498 2120275 2086417 2060410 2100851
12148B100851L9481n5828J2697P6352N1049J35535N2026m7782k0594M5748L1148
$$ 2100851 2140332 2084504 2097201 2173553 2224602 2360137 2412163 2364381 2343787 2389535 2420683
12137B420683n6813l6362K9124M5709R3116Q883j6070Q4125O1448J8884N6413
$$ 2420683 2363870 2327508 2356632 2402341 2495457 2504340 2488270 2572395 2633843 2652727 2709140
12126B709140L2079j650N5600k2023m059J07476P7201N0554J01708m8753J9216
$$ 2709140 2741219 2739569 2795169 2773146 2769087 2876563 2953764 3004318 3106026 3057273 3076489
12115C076489N3380n6303l7472J4675R2658K758m5377N9048Q7534J1334J09501
$$ 3076489 3129869 3073566 3036094 3050769 3143427 3146185 3100808 3159856 3247390 3258724 3368225
12104C368225P0860p751P8485k9711l5888L4126Q5765k219O2323J15673N7800
$$ 3368225 3439085 3431334 3509819 3480108 3444220 3478346 3564111 3561892 3624215 3739888 3797688
12093C797688K403m6924N8484N5056J9996R9795N9930L8588k870K5252M8630L0750
$$ 3797688 3800091 3753167 3811651 3866707 3886703 3986498 4046428 4085016 4082146 4107398 4156028 4186778
12081D186778J12322R0528N7685l2402o380Q2293Q5062K5427P3614J88131J42346
$$ 4186778 4299100 4389628 4447313 4414911 4408531 4490824 4575886 4601313 4674927 4863058 5005404
12070E005404J07407L2915L1787j5587M5410O1292J20224M9069O2139Q2109R0931
$$ 5005404 5112811 5145726 5177513 5161926 5207336 5268628 5388852 5437921 5500060 5582169 5673100
$$ [...]
##END NTUPLES=NMR SPECTRUM
##END=
