##TITLE=Analysis number 319847
Compound Code rjc 00610
Project Code adrs
Chemist Name fudan
##JCAMPDX= 6.0         $$ Bruker NMR JCAMP-DX V2.0
##DATA TYPE= NMR SPECTRUM
##DATA CLASS= NTUPLES
##ORIGIN= Bruker BioSpin GmbH
##OWNER= nmr
$$ XWIN-NMR		Version 3.5
$$ Thu Jun  1 09:06:26 2006 GMT Daylight Time (UT+1h)  MAYBRIDGE\nmr@NMR_250MHZ
##.OBSERVE FREQUENCY= 250.131544655141
##.OBSERVE NUCLEUS= ^1H
##.ACQUISITION MODE= SIMULTANEOUS (DQD)
##.ACQUISITION SCHEME= undefined
##.AVERAGES= 16
##.DIGITISER RES= 18
##SPECTROMETER/DATA SYSTEM= dpx250
##.PULSE SEQUENCE= zg30
##.SOLVENT NAME= CDCl3
##.SHIFT REFERENCE= (INTERNAL, CDCl3, 0, 16.522)
##AUDIT TRAIL= $$ (NUMBER, WHEN, WHO, WHERE, WHAT)
$$ ##TITLE= Audit trail, XWIN-NMR		Version 3.5
$$ ##JCAMPDX= 5.01
$$ ##ORIGIN= Bruker BioSpin GmbH
$$ ##OWNER= nmr
$$ C:\u/data/dgb/nmr/ADRS/5480/pdata/1/auditp.txt
$$ ##AUDIT TRAIL=  $$ (NUMBER, WHEN, WHO, WHERE, WHAT)
(   1,<2006-06-01 09:06:01.11 +100>,<MAYBRIDGE\nmr>,<NMR_250MHZ>,
      <created by zg, POWCHK disabled, PULCHK disabled
       configuration hash MD5:
       E2 DF 36 D8 04 B2 41 60 5A D7 A3 38 5A 4B D0 FE
       data hash MD5: 64K
       D6 31 7A 02 50 E7 69 AF 01 F5 0D BB 9B D3 21 FE>)
(   2,<2006-06-01 09:06:16.17 +100>,<MAYBRIDGE\nmr>,<NMR_250MHZ>,
      <Start of raw data processing
       ef LB = 0.3 FT_mod = 6 PKNL = 1 SI = 32K 
       data hash MD5: 32K
       82 2A CA 0A 4C C0 1D DF A9 91 F5 17 A8 4A 3D 10>)
(   3,<2006-06-01 09:06:17.89 +100>,<MAYBRIDGE\nmr>,<NMR_250MHZ>,
      <apk 
       data hash MD5: 32K
       CF 68 1B 71 D9 96 7B 41 92 C4 84 7B BE 68 69 CF>)
(   4,<2006-06-01 09:06:18.62 +100>,<MAYBRIDGE\nmr>,<NMR_250MHZ>,
      <abs ABSG = 5 
       data hash MD5: 32K
       5B A8 AF F1 9A E9 D0 86 58 EB CF FC D9 14 58 9E>)
$$ ##END=
$$ 
$$ hash MD5
$$ 25 54 98 D9 D9 C9 11 C8 1B 67 36 1B 63 23 5A 34
##$RELAX= 
##$RELAX= 
##$RELAX= 
##$RELAX= 
##$RELAX= 
##$RELAX= 
##$RELAX= 
$$ Bruker specific parameters
$$ --------------------------
##$DU= <C:\u>
##$EXPNO= 5480
##$NAME= <ADRS>
##$PROCNO= 1
##$TYPE= <nmr>
##$USER= <dgb>
##$AMP= (0..31)
100 100 100 100 100 100 100 100 100 100 100 100 100 100 100 100 100 100 
100 100 100 100 100 100 100 100 100 100 100 100 100 100 
##$AQSEQ= 0
##$AQ_mod= 3
##$AUNM= <au_zg>
##$AUTOPOS= <1 >
##$BF1= 250.13
##$BF2= 250.13
##$BF3= 250.13
##$BF4= 250.13
##$BF5= 500.13
##$BF6= 500.13
##$BF7= 500.13
##$BF8= 500.13
##$BYTORDA= 1
##$CFDGTYP= 0
##$CFRGTYP= 5
##$CHEMSTR= <none>
##$CNST= (0..31)
1 1 145 1 1 1 1 1 1 1 1 1 1 1 1 1 1 1 1 1 1 1 1 1 1 1 1 1 1 1 1 1 
##$CPDPRG= <>
##$CPDPRG1= <>
##$CPDPRG2= <>
##$CPDPRG3= <>
##$CPDPRG4= <mlev>
##$CPDPRG5= <mlev>
##$CPDPRG6= <mlev>
##$CPDPRG7= <mlev>
##$CPDPRG8= <mlev>
##$CPDPRGB= <>
##$CPDPRGT= <>
##$D= (0..31)
0 1 0 0 0 0 0 0 0 0.06 0 0 0 0 0 0 0.0002 0 0 0 0 0 0 0 0 0 0 0 0 0 0 
0 
##$DATE= 1149149159
##$DBL= (0..7)
120 120 120 120 120 120 120 120 
##$DBP= (0..7)
150 150 150 150 150 150 150 150 
##$DBP07= 0
##$DBPNAM0= <>
##$DBPNAM1= <>
##$DBPNAM2= <>
$$ [...]
##$SUBNAM7= <"">
##$SUBNAM8= <"">
##$SUBNAM9= <"">
##$SW= 20.6930455092707
##$SWIBOX= (0..15)
0 0 3 0 0 0 0 0 0 0 0 0 0 0 0 0 
##$SW_h= 5175.983436853
##$TD= 65536
##$TD0= 1
##$TE= 295.16
##$TE2= 300
##$TE3= 300
##$TEG= 300
##$TL= (0..7)
0 120 120 120 120 120 120 120 
##$TP= (0..7)
150 150 150 150 150 150 150 150 
##$TP07= 0
##$TPNAME0= <>
##$TPNAME1= <>
##$TPNAME2= <>
##$TPNAME3= <>
##$TPNAME4= <>
##$TPNAME5= <>
##$TPNAME6= <>
##$TPNAME7= <>
##$TPOAL= (0..7)
0.5 0.5 0.5 0.5 0.5 0.5 0.5 0.5 
##$TPOFFS= (0..7)
0 0 0 0 0 0 0 0 
##$TUNHIN= 0
##$TUNHOUT= 0
##$TUNXOUT= 0
##$USERA1= <user>
##$USERA2= <user>
##$USERA3= <user>
##$USERA4= <user>
##$USERA5= <user>
##$V9= 5
##$VALIST= <valist>
##$VCLIST= <CCCCCCCCCCCCCCC>
##$VD= 0
##$VDLIST= <DDDDDDDDDDDDDDD>
##$VPLIST= <PPPPPPPPPPPPPPP>
##$VTLIST= <TTTTTTTTTTTTTTT>
##$WBST= 1024
##$WBSW= 4
##$XGAIN= (0..3)
0 0 0 0 
##$XL= 0
##$YL= 0
##$YMAX_a= 596845
##$YMIN_a= -589557
##$ZGOPTNS= <>
##$ZL1= 120
##$ZL2= 120
##$ZL3= 120
##$ZL4= 120
##$ABSF1= 16.522
##$ABSF2= -4.171173
##$ABSG= 5
##$ABSL= 3
##$ALPHA= 0
##$AQORDER= 0
##$ASSFAC= 0
##$ASSFACI= 0
##$ASSFACX= 0
##$ASSWID= 0
##$AUNMP= <proc_1d>
##$AZFE= 0.1
##$AZFW= 0.1
##$BCFW= 0
##$BC_mod= 0
##$BYTORDP= 0
##$COROFFS= 0
##$CY= 12.5
##$DATMOD= 1
##$DC= 0
##$DFILT= <>
##$DTYPP= 0
##$F1P= 14.0000005364418
##$F2P= -0.99999901652339
##$FCOR= 0.5
##$FTSIZE= 32768
##$FT_mod= 6
##$GAMMA= 0
##$GB= 0
##$INTBC= 1
##$INTSCL= 1
##$ISEN= 128
##$LB= 0.3
##$LEV0= 0
##$LPBIN= 0
##$MAXI= 10000
##$MC2= 0
##$MEAN= 0
##$ME_mod= 0
##$MI= 0
##$NCOEF= 0
##$NC_proc= -2
##$NLEV= 6
##$NOISF1= 0
##$NOISF2= 0
##$NSP= 0
##$NTH_PI= 0
##$NZP= 0
##$OFFSET= 16.522
##$PC= 1
##$PHC0= 171.0402
##$PHC1= 6.318079
##$PH_mod= 1
##$PKNL= yes
##$PPARMOD= 0
##$PSCAL= 4
##$PSIGN= 0
##$REVERSE= no
##$SF= 250.13
##$SI= 32768
##$SIGF1= 0
##$SIGF2= 0
##$SINO= 400
##$SIOLD= 32768
##$SREGLST= <1H.CDCl3>
##$SSB= 0
##$STSI= 32768
##$STSR= 0
##$SW_p= 5175.98343685301
##$SYMM= 0
##$S_DEV= 0
##$TDeff= 65536
##$TDoff= 0
##$TI= <Analysis number 999999
Compound Code 99
Book Reference 9
Project Code 9>
##$TILT= no
##$TM1= 0
##$TM2= 0
##$TOPLEV= 0
##$USERP1= <user>
##$USERP2= <user>
##$USERP3= <user>
##$USERP4= <user>
##$USERP5= <user>
##$WDW= 1
##$XDIM= 32768
##$YMAX_p= 388610627
##$YMIN_p= -45198
$$ End of Bruker specific parameters
$$ ---------------------------------
##NTUPLES= NMR SPECTRUM
##VAR_NAME=  FREQUENCY,     SPECTRUM/REAL,   SPECTRUM/IMAG
##SYMBOL=    X,             R,               I
##VAR_TYPE=  INDEPENDENT,   DEPENDENT,       DEPENDENT
##VAR_FORM=  AFFN,          ASDF,            ASDF
##VAR_DIM=   32768,         32768,           32768
##UNITS=     HZ,            ARBITRARY UNITS, ARBITRARY UNITS
##FACTOR=    0.157963299565203, 1,           1
##FIRST=     4132.6476996994, 0,             0
##LAST=      -1043.33573715361, 0,           0
##MIN=       -1043.33573715361, -45198,      0
##MAX=       4132.6476996994, 388610627,     0
$$ Real data points
##PAGE= N=1
##DATA TABLE= (X++(R..R)), XYDATA
$$ [...]
19231B98510j882p537r281j2255j2696k7953j5848l2620l3598k0192K391R40l239
$$ 298510 296628 289091 279810 267555 254859 226906 211058 178438 144840 124648 127039 127979 124740
19218A24740j1192p589n32r99K174L782j3966n515p608m521J8102K0228o78j155
$$ 124740 113548 105959 105427 104428 106602 110384 96418 90903 83295 78774 96876 117104 116426 115271
19204A15271N460J948j0515q898j2168K882J1519J5136J1921P797K4593L2976
$$ 115271 120731 122679 112164 103266 91098 93980 105499 120635 132556 140353 164946 197922
19192A97922K5706L9541L5805N147j3520J037N335J5708P897Q244j1227k7082
$$ 197922 223628 263169 298974 304121 290601 291638 296973 312681 320578 328822 317595 290513
19180B90513j2505j7381k8359j9728P739M813O005K0306l12j5447j2924j3849
$$ 290513 278008 260627 232268 212540 220279 225092 231097 251403 251091 235644 222720 208871
19168B08871o222R408J2362J0168R303K800j6061o784q748j77N036l29r805q830
$$ 208871 202649 212057 224419 234587 243890 246690 230629 223845 215097 214920 219956 219627 209822 200992
19154B00992k2641q473r157k623P702L254l377j185K3573K7206K7885M9573O4678
$$ 200992 178351 169878 160721 158098 165800 169054 165677 164492 188065 215271 243156 292729 357407
19141C57407M2752K6101K0027M882o523K088m783j8245k3217k7117l2026j7359
$$ 357407 400159 426260 446287 451169 444646 446734 441951 423706 400489 373372 341346 323987
19129C23987k2831k5403k8365q159K7206L2313J3196k261o444k0457k3454o424
$$ 323987 301156 275753 247388 239229 266435 298748 311944 309683 303239 282782 259328 252904
19117B52904L784l849P289o71k1436J106J0013q437n74j221n597p093r028j2469
$$ 252904 256688 252839 260128 259457 238021 239127 249140 240703 240129 238908 233311 226218 217190 204721
19103B04721q423q774O541k755J94l424N002J1985J6920K0829K1544J5177J6782
$$ 204721 196298 187524 194065 191310 191504 188080 193082 205067 221987 242816 264360 279537 296319
19090B96319K1077J4391q679L148j788j4243l7589k7517q278j293j2069P558K851
$$ 296319 317396 331787 323108 326256 324468 310225 272636 245119 236841 235548 223479 231037 233888
19077B33888l000J5822J4168O285J2317L9222K8323L1974L5106K9897L5246M0035
$$ 233888 230888 246710 260878 267163 279480 318702 347025 378999 414105 444002 479248 519283
19065E19283M3517N1883O4566P9322O7081P2941Q6668P3192Q7669J18412J56893
$$ 519283 562800 614683 679249 758571 825652 898593 985261 1058453 1146122 1264534 1421427
19054A421427J77380K12888K96765M15189O19737R64356J583062K543852L439129
$$ 1421427 1598807 1811695 2108460 2523649 3143386 4107742 5690804 8234656 11673785
19045A1673785L029374J416757P68406r7972j954312j168862J199251L258026
$$ 11673785 14703159 16119916 16888322 16790350 14836038 13667176 14866427 18124453
19037A8124453L838374L233034L016272Q91837k762282k978582l249440l475767
$$ 18124453 21962827 25195861 28212133 29103970 26341688 23363106 20113666 16637899
19029A6637899j515818P39957J861295R69040l46889o64868k375246l776810k756566
$$ 16637899 15122081 15862038 17723333 18692373 18345484 17680616 15305370 11528560 8771994
19020H771994j573738r38740o35100n00421l91621k68733j87890j38298p7890
$$ 8771994 7198256 6259516 5624416 5123995 4732374 4463641 4275751 4137453 4059563
19011D059563n2093k9378k2787L375L3997P6426J43053K08353L17000M78140P16820
$$ 4059563 4007470 3978092 3955305 3958680 3992677 4069103 4212156 4420509 4737509 5215649 5932469
19000E932469J153063J924811L150361M388840M025667J905623R31400l2073k588020
$$ 5932469 7085532 9010343 12160704 16549544 20575211 22480834 23412234 23380161 20792141
18991B0792141j869496J144599L786775M732429M187266L970308J492530l150584
$$ 20792141 18922645 20067244 23854019 28586448 32773714 36744022 38236552 35085968
18983C5085968l681489m067974m752308k351359N77236K145216J289003l85973
$$ 35085968 31404479 27336505 22584197 20232838 20810074 22955290 24244293 23858320
18975B3858320q63141k778997m714831l651320k159617j324161r16956o98200
$$ 23858320 22995179 20216182 15501351 11850031 9690414 8366253 7449297 6751097
18967F751097n53728m30235l69849l07775k53969k10947j88192j74380j65962
$$ 6751097 6197369 5767134 5397285 5089510 4835541 4624594 4436402 4262022 4096060
18958D096060j63308j73041j50334j15619j23022j36475j20482r7364r6300r6940
$$ 4096060 3932752 3759711 3609377 3493758 3370736 3234261 3113779 3016415 2920115 2823175
18948B823175q5323q9452q8771q2729p1143o1637m0446k7389l0960l2019m1343
$$ 2823175 2737852 2648400 2559629 2476900 2405757 2344120 2303674 2276285 2245325 2213306 2171963
18937B171963m5932m9558m0814j5803j2728k5025k2674j1923j0319j6436k0227
$$ 2171963 2126031 2076473 2035659 2019856 2007128 1982103 1959429 1947506 1937187 1920751 1900524
18926A900524j0960k5455k5266j3241j1347k0579k7140k5411j6835k4005l2559
$$ 1900524 1889564 1864109 1838843 1825602 1814255 1793676 1766536 1741125 1724290 1700285 1667726
18915A667726l7010n9535n0770m2806n3656m6477m9717n5623l5444l2947m6813
$$ 1667726 1630716 1571181 1520411 1477605 1423949 1377472 1327755 1272132 1236688 1203741 1156928
18904A156928o3356n2039l8015n1050m9482k9235l2548l2157k7626k3544k8883
$$ 1156928 1093572 1041533 1003518 952468 902986 873751 841203 809046 781420 757876 728993
18893G28993k5525o816r929k4543j1655j7620j6024k5177j8566j3117n341j3097
$$ 728993 703468 696652 686723 662180 650525 632905 616881 591704 573138 560021 554680 541583
18881E41583p962r971j1624k0634r048n142n597R304o520q967M30j9911j3982
$$ 541583 533621 523650 512026 491392 482344 477202 471605 480909 474389 465422 465852 445941 431959
18868D31959r969q732J583K364m401j6176k2869k9481j2443k277q877k0104l543
$$ 431959 421990 413258 414841 417205 412804 396628 373759 344278 331835 329558 320681 300577 297034
18855B97034j0688n627O961n313j4215k4915l672M463l553j9989j0378M785P110
$$ 297034 286346 280719 287680 282367 268152 243237 239565 244028 240475 220486 210108 214893 222003
18842B22003O839j2616j1647k29n220p589M859P570m781j2001j2043j0141q859
$$ 222003 228842 216226 204579 204350 199130 191541 196400 203970 199189 187188 175145 165004 156145
18829A56145n191q656j487Q935N542J4228o872j885n034o171p341J13l283o379
$$ 156145 150954 142298 140811 149746 155288 169516 162644 160759 155725 149554 142213 142326 139043 132664
18815A32664L914n900n541j4379o886J4190M952n050L900J257j3335n695Q692
$$ 132664 136578 130678 125137 110758 103872 118062 123014 117964 121864 123121 109786 104091 112783
18802A12783K4017O926j6959n520J261r014r791o067J3614K6063K6472K0049N064
$$ 112783 136800 143726 126767 121247 122508 113494 103703 97636 111250 137313 163785 183834 188898
18789A88898O96J7557P479j3876j7604j2589o301Q069j2349j2180j9103k182m81
$$ 188898 189594 207151 214630 200754 183150 170561 164260 172329 159980 147800 128697 126515 126034
18776A26034m044k590K064L867j040o676J346K474J323k821K349K3315J7609J0401
$$ 126034 121990 119400 121464 125331 124291 117615 118961 121435 122758 119937 122286 145601 163210 173611
18762A73611R013n170q989k2123k1204j1494q710k12J674m112r354L244J3093
$$ 173611 182624 177454 168465 146342 125138 113644 104934 104722 106396 102284 92930 96174 109267
18749A09267J1469m110p268J1509K7751K1322R734J6239K5106J2970J0424K772
$$ 109267 120736 116626 109358 120867 148618 169940 179674 195913 221019 233989 244413 247185
18737B47185k075j2122j6593r731r990k3240j9986j1966M180P86k43j0775N77
$$ 247185 245110 232988 216395 206664 196674 173434 153448 141482 145662 146448 146205 135430 136007
18724A36007j054N075j1528o00K528Q215j901q77R124N507L165p413m155P420
$$ 136007 134953 140028 128500 127900 130428 138643 136742 135865 144989 150496 153661 146248 142093 149513
18710A49513M69p899L302M478j668J491P834R058J3375K4807J6513M299j963P258
$$ 149513 149982 142083 145385 149863 148195 149686 157520 166578 179953 204760 221273 225572 223609 230867
18696B30867L3279M0988M3509N0069M8721N1996O6766M6477K5684L0369K3168
$$ 230867 264146 305134 348643 398712 447433 499429 566195 612672 638356 668725 691893
18685F91893M437j8213K086J4974K1062K8934L2813N9593R2212J03187J40070
$$ 691893 696330 678117 680203 695177 716239 745173 777986 837579 929791 1032978 1173048
18674A173048J90198K36524L01744M01035N64333Q39890J251657J928886L055615
$$ 1173048 1363246 1599770 1901514 2302549 2866882 3706772 4958429 6887315 9942930
18665I942930M593035N233890L819845K977453L518699J032465k267537k834330
$$ 9942930 14535965 19769855 23589700 26567153 30085852 31118317 28850780 26016450
18657B6016450k136769m038826n510729l942058k357947j491425j027721p60071
$$ 26016450 23879681 19840855 14330126 10388068 8030121 6538696 5510975 4750904
18649D750904n85235m36134l24388k37812j70256j23052p0512l5994J055K4677
$$ 4750904 4165669 3729535 3405147 3167335 2997079 2874027 2803515 2767521 2768576 2793253
18639B793253J8612j1410K609K2485k4854o0387l6540k148k0348q686L5831Q3969
$$ 2793253 2811865 2800455 2803064 2825549 2800695 2740308 2703768 2701620 2681272 2672586 2708417 2792386
18627B792386J12321J57271K23226K85510L93580N56067P67147J108714J662709
$$ 2792386 2904707 3061978 3285204 3570714 3964294 4520361 5287508 6396222 8058931
18618H058931K528317L985790O170790Q159715P766212N749861N379413M172284
$$ 8058931 10587248 14573038 20743828 28903543 36669755 42419616 47799029 51971313
18610E1971313o06875m252713m254180m914464p935620q232664n539656l365467
$$ 51971313 51364438 47111725 42857545 37943081 30007461 21774797 16235141 12869674
18602A2869674k190208j536749j157526q72204o56656n12367m01871l16156k58395
$$ 12869674 10679466 9142717 7985191 7112987 6456331 5943964 5542093 5225937 4967542
18593D967542k07759j67503j12138p6816p9080r0889n7790p2627j23626j22987
$$ 4967542 4759783 4592280 4480142 4403326 4324246 4233357 4175567 4102940 3979314 3856327
18583C856327p9820q2469j20839j20222p2698l4259k2850q960L6028R0375J52056
$$ 3856327 3776507 3694038 3573199 3452977 3380279 3346020 3323170 3314210 3350238 3440613 3592669
18572C592669K13479L47302N27521P99654J262420K050101L164089L775695K850903
$$ 3592669 3806148 4153450 4680971 5480625 6743045 8793146 11957235 15732930 18583833
18563A8583833K068636K519723R88430j547675k154333j564891k760186m092965
$$ 18583833 20652469 23172192 24160622 22612947 20458614 18893723 16133537 12040572
18555A2040572l027830j783929j108411p56141n66757m19171l07985k42226j92851
$$ 12040572 9012742 7228813 6120402 5364261 4797504 4378333 4070348 3828122 3635271
18546C635271j64433j30069j08981r6542q8666q6890q5342r4806j08077r0772
$$ 3635271 3470838 3340769 3231788 3135246 3046580 2959690 2874348 2779542 2671465 2580693
18536B580693j00576r9839r2713p9684q9805q3972q6120p2143o1599o6699o1310
$$ 2580693 2480117 2380278 2287565 2207881 2118076 2034104 1947984 1875841 1814242 1747543 1686233
18525A686233m8045m7511m9667o2333l8327l7143m3344l0421l3054l1202k9647
$$ 1686233 1638188 1590677 1541010 1478677 1440350 1403207 1359863 1329442 1296388 1265186 1235539
18514A235539j4524o742Q05N479j400r44k88j9600l1308j7302o142N389J2023
$$ 1235539 1221015 1214273 1215078 1220557 1219157 1218213 1217925 1198325 1167017 1149715 1143573 1148962 1160985
18501A160985K5963L1395K1023J8522l858k8587n0851l8053k7307k5903j1015
$$ 1160985 1186948 1218343 1239366 1257888 1254030 1225443 1174592 1136539 1109232 1083329 1072314
18490A072314j7573k7089l2244o1288p2145o7172n5283l9116k1577j7588l1876
$$ 1072314 1054741 1027652 995408 934120 861975 794803 739520 700404 678827 661239 629363
18479F29363l2879j1563j4034j8168j0366j9012k2201k1120k3743k8322k5177
$$ 629363 596484 584921 570887 552719 542353 523341 501140 480020 456277 427955 402778
18468D02778j0778j0393K465q288j5507j758R984N376M405J2433o744l0402j6459
$$ 402778 392000 381607 384072 375784 360277 358519 368503 373879 378284 390717 383973 353571 337112
18455C37112j3602L632q928M910J9239J8660O103k215j5418k8050l5297r256j5822
$$ 337112 323510 327142 318214 323124 342363 361023 367126 364911 349493 321443 286146 276890 261068
18442B61068l338L276M646r550m488j7847k5280j9103L012j1368j7858j3655Q585
$$ 261068 257730 261006 265652 256102 251614 233767 208487 189384 192396 181028 163170 149515 158100
18429A58100N313o365j0813j0277n313q39j39p42r747n401r118k50K1220J0995
$$ 158100 163413 157048 146235 135958 130645 129806 129667 128925 119178 113777 104659 104409 125629 136624
18415A36624L365Q357Q777J0106r877j5886q447l005j3389o738N502M673J953
$$ 136624 139989 148346 157123 167229 157352 141466 133019 130014 116625 109887 115389 120062 122015
18402A22015K425r388q861l49L396n923p946k134J110q661o807J2623P571j8086
$$ 122015 124440 115052 106191 105842 109238 103315 95369 93235 94345 85684 78877 91500 99071 80985
18388H0985L326k585j4935k557P520p674p260R572Q713J7343J417j1250L310m314
$$ 80985 84311 81726 66791 64234 71754 64080 56820 66392 75105 92448 93865 82615 85925 81611
18374H1611n931K130n19j349j2294j5869K17m116J8793J2046P224K462r963j3196
$$ 81611 75680 77810 77291 75942 63648 47779 47996 43880 62673 74719 81943 84405 74442 61246
18360F1246J0270L051J398n834J9327M782o477J627m640q733P72l910r535J5597
$$ 61246 71516 74567 75965 70131 89458 94240 87763 89390 84750 76017 76789 72879 63344 78941
18346G8941J520k437j156J213l571P608L151k893L288j905q454L866K089K665
$$ 78941 80461 78024 76868 78081 74510 82118 85269 82376 85664 83759 75305 79171 81260 83925
18332H3925J3706J3321R516J2331k599j4754r906j0069k2400j5210K589l836j446
$$ 83925 97631 110952 120468 132799 130200 115446 105540 95471 73071 57861 60450 56614 55168
18319E5168k403o707N248K489p140l221j655m015J050M23J0562J490K871J264
$$ 55168 52765 46058 51306 53795 46655 43434 41779 37764 38814 39237 49799 51289 54160 55424
18305E5424r970Q487k038J201L519m498Q172n495j8425l369j414j536K154M221
$$ 55424 45454 53941 51903 53104 56623 52125 60297 54802 36377 33008 31594 30058 32212 36433
18291C6433O882j1838N109J6808P879k618n35j367J4460J9891J8072J6369L712
$$ 36433 43315 31477 36586 53394 61273 58655 58120 56753 71213 91104 109176 125545 129257
18278A29257j424p791j0843o468j6712j0658q324m730p237l974j0307r305o86
$$ 129257 127833 120042 109199 102731 86019 75361 67037 62307 55070 51096 40789 31484 30798
18265C0798P3j265O938J2103O738j7711q662l057J398R055q751o624R419J6231
$$ 30798 30871 29606 36544 48647 55385 37674 29012 25955 27353 36408 27657 21033 30452 46683
18251D6683J1014M951j1431j7784o928n430J1858J7065J7075j546K5080K1950
$$ 46683 57697 62648 51217 33433 26505 21075 32933 49998 67073 65527 90607 112557
18239A12557M222p902J1309j921j1126Q746P682N736l196j1168P36j1436j8064
$$ 112557 116779 108877 120186 118265 107139 115885 123567 129303 126107 114939 115675 104239 86175
18226H6175j4749j2879j7856J818K333j0211m240K602j418Q125K123m338Q55r201
$$ 86175 71426 58547 40691 42509 44842 34631 30391 32993 31575 39700 41823 37485 38340 29139
18212B9139J117j730O613J0341m366n139P560k222l016o794O782l974K671o965
$$ 29139 30256 28526 35139 45480 41114 35975 43535 41313 38297 31503 38285 34311 36982 30017
18198C0017p607J0761J1371q532q751j6017n112j1J0476K475J0484R837J5716
$$ 30017 22410 33171 44542 36010 27259 11242 6130 6119 16595 19070 29554 39391 55107
18185E5107R132K0422L230l959k1588j8586K596j6m591j5586p492P202Q258l222
$$ 55107 64239 84661 87891 83932 62344 43758 46354 46338 41747 26161 18669 25871 34129 30907
18171C0907p53N132p161L788N163L974J3377O291M874O677k311j7240j4311q723
$$ 30907 30154 35286 28125 31913 37076 41050 54427 60718 65592 72269 69958 52718 38407 29684
18157B9684R346j779Q384J572j1209M253L43o458O233Q021J8626J0216j1920j196
$$ 29684 39030 37251 45635 47207 35998 40251 40594 34136 40369 48390 67016 77232 65312 64116
18143F4116J6813O539J2590J2361J7085K1051J3107K0367J5461J7293O925j1521
$$ 64116 80929 87468 100058 112419 129504 150555 163662 184029 199490 216783 223708 212187
18131B12187j5749q239j253l881r066n596k07J1778J5970K1649J7341K3162M2003
$$ 212187 196438 188199 186946 183065 173999 168403 168196 179974 195944 217593 234934 258096 300099
18118C00099L5641N2319N2368P8910J07643J42444K01198K83251M54966P66295
$$ 300099 335740 388059 440427 519337 626980 769424 970622 1253873 1708839 2475134
18108B475134J357071K356544L323382K560055M51132J11805j056751l653261
$$ 2475134 3832205 6188749 9512131 12072186 12523318 12635123 11578372 7925111
18100G925111k955411j531001q10958n08292l67502k57641j97927j33467r2923
$$ 7925111 4969700 3438699 2627741 2119449 1751947 1494306 1296379 1162912 1069989
18091A069989p4784n7955m1479k3941j6222j0319J332j1451l1437n0279l0563
$$ 1069989 995205 937250 895771 871830 855608 845289 846621 835170 803733 753454 722891
18080G22891m1742o4142m9443l8459l6669k7365k3866j9708O883m767j082r753
$$ 722891 681149 617007 567564 529105 492436 465071 441205 421497 428380 423613 422531 412778
18068D12778r657j1006j6588j0478j1604n302O94p901J87p611p255j9215m012
$$ 412778 403121 392115 375527 365049 353445 348143 348837 340936 341123 333512 326257 307042 303030
18055C03030K695N226j4880j2670j239n05l984K90J3076p150o388m05J4754J9018
$$ 303030 305725 310951 296071 283401 282162 281657 277673 277963 291039 283889 277501 277096 291850 310868
18041C10868J4489J3435L7431K5048J0600O061J3373k640k3381k4016l5986m3544
$$ 310868 325357 338792 376223 401271 411871 417932 431305 428665 405284 381268 345282 301738
18029C01738l8339k3186j4291j2761j8420j0985m73Q56q751k7697j2934K180K228
$$ 301738 263399 240213 225922 213161 194741 183756 183283 184139 175388 147691 134757 136937 139165
18016A39165k725j5421J813L208r473q709j2136o298p92L764r29L86J481J0845
$$ 139165 136440 121019 122832 126040 116567 107858 95722 89424 88632 92396 91467 91853 93334 104179
18002A04179L214p793L328L740j0797L2k215J0757J53j3688k048p321o718n878
$$ 104179 107393 99600 102928 106668 95871 95903 93688 104445 104598 90910 88862 81541 74823 68945
17988F8945J097J0306J2063K639j4817p715n333j6005J2930O684n595n085m518
$$ 68945 70042 80348 92411 95050 80233 72518 67185 51180 64110 70794 65199 60114 55596
17975E5596m246q80Q296j44p866j1450K812k977m493N351J7863N306r484j7394
$$ 55596 51350 50470 58766 58622 50756 39306 42118 39141 34648 39999 57862 63168 53684 36290
17961C6290j5181o059L55J3174N157j322K834j029q574q549n179j735J2033Q182
$$ 36290 21109 15050 15405 28579 33736 32414 35248 34219 25645 17096 11917 10182 22215 30397
17947C0397Q008O199p934k2296k494O873L535L508O095o963J1482J015j9056P195
$$ 30397 38405 44604 36670 14374 11880 18753 22288 25796 31891 24928 36410 37425 18369 25564
17933B5564P280o811k185O785r288m384Q233n857J264j695J5049R208J5643j2742
$$ 25564 32844 26033 23848 30633 21345 16961 25194 19337 20601 18906 33955 43163 58806 46064
17919D6064j2068j3515j3808l043o235O855M096Q367K96n634j944n975Q784J847
$$ 46064 33996 20481 6673 3630 -2605 4250 8346 16713 17009 11375 9431 3456 12240 14087
17905A4087n77N179K702j729N756j616o01l134N94n620L03Q841j1239j4093o03
$$ 14087 13510 18689 21391 19662 25418 23802 23201 20067 20661 15041 15344 24185 12946 -1147 -1750
17890a750R388P792J3497m489j1433l979k246P260O780j0749M114J2211K770p134
$$ -1750 7638 15430 28927 24438 13005 9026 6780 14040 20820 10071 14185 26396 29166 22032
17876B2032j4324l913R124J2793J933l721r535R68O306k842j664k075j539L992
$$ 22032 7708 3795 12919 25712 27645 23924 14389 15357 21663 18821 17157 15082 13543 17535
17862A7535n54K944j183j166O355n488p797l546K359j212J2948R065k121n366
$$ 17535 16981 19925 18742 17576 23931 18443 10646 7100 9459 8247 21195 30260 28139 22773
17848B2773N65L086J939J075p934m745J178Q899N066q834O71q491j1301P561N278
$$ 22773 23338 26424 28363 29438 21504 16759 17937 26836 31902 23068 23739 15248 3947 11508 16786
17833A6786o348N067J2519N57q50p421p007k291j537j839J2238P311M568m027
$$ 16786 10438 15505 28024 28581 27731 20310 13303 11012 9475 7636 19874 27185 31753 27726
17819B7726o540L717r860q459J1441J4097o581j3427j866L745k467N586P668q324
$$ 27726 21186 24903 15043 6584 18025 32122 25541 12114 10248 13993 11526 17112 24780 16456
17805A6456P1J2787R569k177j0340p920j0729n052O7L049K900P215J4943j502
$$ 16456 16527 29314 38883 36706 26366 18446 7717 2665 2732 5781 8681 15896 30839 29337
17791B9337p186j2004j2917m501k421J2244M794L789j476j2365k490O376L020
$$ 29337 22151 10147 -2770 -7271 -9692 2552 7346 11135 9659 -2706 -5196 1180 4200
17778D200K158J527q153o722Q304L919J890p085n534J298k943J4491O901l67j207
$$ 4200 6358 7885 -268 -6990 1314 5233 7123 38 -5496 -4198 -7141 7350 14251 13884 12677
17763A2677j69K737l966p031j1446l075M043Q837Q549q794m52J696k76M132P557
$$ 12677 12508 15245 11279 4248 -7198 -10273 -6230 2607 11156 2362 1910 3606 3330 7462 15019
17748A5019m17n377P510J3175M754j3152j3125N1P782n186J859J389M934Q112
$$ 15019 14602 9225 16735 29910 34664 21512 8387 8438 16220 11034 12893 14282 19216 27328
17734B7328r553j3849R05M859L922L499J359p736n889l310R325j5070N896P844
$$ 27328 17775 3926 4831 9690 13612 17111 18470 10734 4845 1535 10860 -4210 1686 9530
17720I530L323k250L576O566M115q097M177j0026j6555j70M045l147K405l378
$$ 9530 12853 10603 14179 20745 24860 16763 20940 10914 -5641 -5811 -1766 -4913 -2508 -5886
17706e886J107j386m693m212R962P366k346n153j0878M076K410k395P169P725
$$ -5886 -4779 -6165 -10858 -15070 -5108 2258 -88 -5241 -16119 -12043 -9633 -12028 -4859 2866
17692B866J3730Q850j4475k039l842P84P436o034p44j545r368l56Q978M472l93
$$ 2866 16596 25446 10971 8932 5090 5874 13310 7276 6532 4987 -4381 -4737 4241 8713 8320
17677H320q620j174n902k886k105L243J45j4629L100J1295K543J4152L943m565
$$ 8320 -300 -1474 -7376 -10262 -12367 -9124 -8979 -23608 -20508 -9213 -6670 7482 11425 6860
17663F860j743m936o32R724M098J34j416M188K451O895M577j3221j7063m76k909
$$ 6860 5117 181 -451 9273 13371 13505 12089 16277 18728 25623 30200 16979 -84 -560 -3469
17648c469J6024M236q882M855l154O10J226Q647K020j0054L310L027M104j2633
$$ -3469 12555 16791 7909 12764 9610 10220 11446 20093 22113 12059 15369 18396 22500 9867
17634I867o406l226J25l679Q380K029j1231l722r627M739l071J5020J1975j3579
$$ 9867 3461 235 360 -3319 5061 7090 -4141 -7863 -17490 -12751 -15822 -802 11173 -2406
17620b406l517R497k755Q97M162J552J020m52k11J3312k430n646o298m829o662
$$ -2406 -5923 3574 819 1716 5878 7430 8450 7998 7787 21099 18669 13023 6725 1896 -4766
17605d766R601M671P442o440l106p742J528M055P405n344J663K851P64m968k2568
$$ -4766 4835 9506 16948 10508 7402 -340 1188 5243 12648 7304 8967 11818 12582 7614 -14954
17590a4954k1Q885R691P428L292J016q200q197r773q444k30J2248L985J4577P605
$$ -14954 -14975 -6090 3601 11029 14321 15337 7137 -1060 -10833 -19277 -19507 -7259 -3274 11303 18908
17575A8908N12n616j3529q733m029p896K820J5474k929k207O013P428l642N367
$$ 18908 19420 13804 275 -8458 -12487 -20383 -17563 -2089 -5018 -7225 -1212 6216 2574 7941
17561G941K628R127n031j1189k333K2404L98j7304j919N02J645N97p244p591N214
$$ 7941 10569 19696 14665 3476 1143 23547 23945 6641 4722 5224 6869 7466 222 -7369 -2155
17546b155O925n555P186O957M93r957m136J2842Q13p552p580L192J4756J0494
$$ -2155 4770 -785 6401 13358 13851 3894 -242 12600 13413 5861 -1719 1473 16229 26723
17532B6723J73m229q080o85q03k893o611J116L600K421N405l006o512J613k357
$$ 26723 26896 22667 14587 13902 13099 10206 3595 4711 8311 10732 16137 13131 6619 8232 5875
17517E875o187n726j214Q56L742l374p95P112l037J829M831R26L29O138r4N796
$$ 5875 -312 -6038 -7252 -6396 -2654 -6028 -6823 289 -2748 -919 3912 4838 5167 11305 11211 17007
17501A7007j121O11j004q195n232O219j975j1375n177n652J2539J4037o180P144
$$ 17007 15886 16497 15493 7298 2066 8285 6310 -5065 -10242 -15894 -3355 10682 4502 11646
17487A1646J07L884j468o081j90m330P270k799J57j2124j0551L981O424L497R136
$$ 11646 11753 15637 14169 8088 7898 3568 10838 8039 8196 -3928 -14479 -10498 -4074 -577 8559
17472H559L28p412l654M866p163k260J3457r601j7683r934j951J0300L746Q272
$$ 8559 8887 1475 -2179 2687 -4476 -6736 6721 -2880 -20563 -30497 -32448 -22148 -18402 -10130
17458a0130J070L52K533k242R793Q541j533o598J702N2j281r251L482J0322J956
$$ -10130 -9060 -8708 -6175 -8417 1376 9917 8384 1786 3488 3540 2259 -6992 -3510 6812 8768
17443H768L589O204N19J1881K4756K2546N87m382j1092k4278o688J357q185j2132
$$ 8768 12357 18561 19080 30961 55717 78263 78850 74468 63376 39098 32410 33767 25582 13450
17429A3450q265q424L077J1542P492k730l458J0772J3619K289k758j1554r648
$$ 13450 5185 -3239 -162 11380 18872 16142 12684 23456 37075 39364 36606 25052 15404
17416A5404k458o402Q489J2944q349p729j1902m377n310R864M264j911m38O189
$$ 15404 12946 6544 15033 27977 19628 11899 -3 -4380 -9690 174 4438 2527 2089 8278
17402H278N62p023M247j1898m993O161N510N466r544n88K430J2177J2807k501
$$ 8278 8840 1817 6064 -5834 -10827 -4666 844 6310 -3234 -3822 -1392 10785 23592 21091
17388B1091l428J076j484j1415o165n000O515Q973K632L148l513m854m361r59
$$ 21091 17663 18739 17255 5840 -325 -5325 1190 10163 12795 15943 12430 7576 3215 2256
17374B256r25J10L449P067L524j435o214k896j844n741k987l642L007J785J274
$$ 2256 1331 1441 4890 11957 15481 14046 7832 4936 3092 -2649 -5636 -9278 -6271 -4486 -3212
17359c212J6119M573o255j1190j4069j8051L990K2377P110N05k748K807M57q55
$$ -3212 12907 17480 11225 35 -14034 -32085 -28095 -5718 1392 1897 -851 1956 2413 1558
17345A558N711M223M179l565l774j9j0682o097J5254K3140p590j1069q341O319
$$ 1558 7269 11492 15671 12106 8332 8313 -2369 -8466 6788 29928 22338 11269 2928 9247
17331I247K442j811M594J820o47Q334N665j0847m760l893o236p457o872M070J1214
$$ 9247 11689 9878 14472 16292 15645 23979 29644 18797 14037 10144 3908 -3549 -10421 -6351 4863
17316D863R849l179o933j833l328j7370L503J4505M613n04j166q344q834m915
$$ 4863 14712 11533 4600 2767 -561 -17931 -14428 77 4690 4186 3020 -5324 -14158 -19073
17302a9073m735R275R534Q976K022O322K927m727J910o371K03m594N306O488j919
$$ -19073 -23808 -14533 -4999 3977 5999 12321 15248 10521 12431 6060 6263 1669 6975 13463 11544
17287A1544o969p290N512J0085O56J795j0474J877J0220J070j002n124j3084m208
$$ 11544 4575 -2715 2797 12882 13538 15333 4859 6736 16956 18026 17024 11900 -1184 -5392
17273e392Q258K029k404m001P569L730l603n387M8N743k426n567L631K046l404
$$ -5392 2866 4895 2491 -1510 6059 9789 6186 799 847 6590 4164 -1403 2228 4274 870
17258H70n169n298r957J1619L946r680j1307J1061Q149p137R243J516Q057P346
$$ 870 -4299 -9597 -19554 -7935 -3989 -13669 -24976 -13915 -5766 -12903 -3660 -2144 5913 13259
17244A3259k515q625l219p37l277M421J9063j974j4899Q425J0487q19j3450q545
$$ 13259 10744 2119 -1100 -1837 -5114 -693 18370 16396 1497 9922 20409 19590 6140 -2405
17230b405J936Q888l740Q919j559j3658P719K152j0176q75L845o295j811J4373
$$ -2405 -469 8419 4679 13598 12039 -1619 6100 8252 -1924 -2799 1046 -5249 -7060 7313
17216G313O047j499j501l780j3310m101k39L228n097n731L702p587r617p407K0865
$$ 7313 13360 11861 10360 6580 -6730 -10831 -11070 -7842 -12939 -18670 -14968 -22555 -32172 -39579 -18714
17201a8714K0351L097r6o106j673j798r966k130k8M534K436p246l106Q272O99
$$ -18714 1637 4734 4638 -1468 -3141 -4939 -14905 -17035 -17063 -12529 -10093 -17339 -20445 -12173 -11474
17186a1474J636N189N147N82K070j511R563p501k3667J488J015m51q14J0373J45
$$ -11474 -9838 -4649 498 1080 3150 1639 11202 3701 -19966 -18478 -17463 -17914 -18728 -8355 -8210
17171h210P492Q135j1794m469M512P990N950J956L005L411O789k025n65o489l153
$$ -8210 -718 7417 -4377 -8846 -4334 3656 9606 11562 14567 17978 24767 22742 22177 15688 12535
17156A2535N37N569q845p266L669J54p938M709l13p790j5886M422J1582Q164k292
$$ 12535 13072 18641 9796 2530 6199 6353 -1585 3124 2811 -4979 -20865 -16443 -4861 3303 1011
17141A011j94l500P388J470M295k532M964o445q747l295n964O094M075k248P436
$$ 1011 817 -2683 4705 6175 10470 7938 12902 6457 -2290 -5585 -11549 -5455 -1380 -3628 3808
17126C808O123k609M452j1250q301O976J2524J361j494j435p395j841p092P603
$$ 3808 9931 7322 11774 524 -7777 -801 11723 13084 11590 10155 2760 919 -6173 1430
17112A430R817J187n185n427N150m223L993P09k296k563K534R543o794M06K162
$$ 1430 11247 12434 7249 1822 6972 2749 6742 7451 5155 2592 5126 14669 7875 8281 10443
17097A0443n605M489K899k60j565l572P80M34J161L175P214M158o209m366J260
$$ 10443 4838 9327 12226 11966 10401 6829 7609 8043 9204 12379 19593 23751 17542 13176 14436
17082A4436r317j2442J4124k351L677L74q602K899R664m417P812K648r100q473
$$ 14436 5119 -7323 6801 4450 8127 8501 -101 2798 12462 8045 15857 18505 9405 932
17068I32M637J058Q185K539q176K8L784O749R176m852j4967n12L989L443p113
$$ 932 5569 6627 14812 17351 9175 9203 12987 19736 28912 24060 9093 8581 12570 16013 8900
17053H900J168O053j213m578j701O208m103P376P233p38j636j1569o933n638j1017
$$ 8900 10068 16121 14908 10330 8629 14837 10734 18110 25343 24605 22969 11400 4467 -1171 -12188
17038a2188p258K674O094J4541J1278J235k581n558j676j056J588O433m93j1939
$$ -12188 -19446 -16772 -10678 3863 15141 16376 13795 8237 6561 5505 7093 13526 13033 1094
17024A094l979L180O99l986J3164J3762j918j7493r715l093J3545R316n223j2011
$$ 1094 -2885 295 994 -2992 10172 23934 22016 4523 -5192 -8285 5260 14576 9353 -2658
17010b658N287m244o304J0178M758j813N899P260J918p548l694j0646R8p435m830
$$ -2658 2629 -1615 -7919 2259 7017 5204 11103 18363 20281 12733 9039 -1607 -1509 -8944 -13774
16995a3774N972J911J1748K905p077j5071N097R063O161K563J2968J0483J317
$$ -13774 -7802 -5891 5857 8762 1685 -13386 -8289 774 6935 9498 22466 32949 34266
16982C4266j0433j7934p524R475J064j9810j2934J6696Q996M491j930P66m569
$$ 34266 23833 5899 -1625 7850 8914 -10896 -23830 -7134 1862 6353 4423 5189 620
16969F20q065L643j412l344j1519n24J1167o398o165M075J7778R212j014m078
$$ 620 -7445 -3802 -5214 -8558 -20077 -20601 -9434 -15832 -21997 -17922 -144 9068 8054 3976
16955C976j0559m365l226o521O349N626Q312N942p036Q446p67j0186j7158M642
$$ 3976 -6583 -10948 -14174 -20695 -14346 -8720 -408 5534 -1502 6944 6177 -4009 -21167 -16525
16941a6525J2389j664M527P823Q335m727K577J204n30j1469m801N776j321P667
$$ -16525 -4136 -5800 -1273 6550 14885 10158 12735 13939 13409 1940 -2861 2915 1594 9261
16927I261N560j725j4836m946J366q018M922N164N129p36O468L919N132j3644
$$ 9261 14821 13096 -1740 -6686 -5320 -13338 -8416 -3252 1877 1141 7609 11528 16660 3016
16913C016j2363j03N546j619L507M882o373j982K988k984P114J5683k452j3062
$$ 3016 -9347 -9450 -3904 -5523 -2016 2866 -3507 -5489 -2501 -5485 1629 17312 14860 1798
16899A798p710m241J2248J8031L033j4782k130J5q076o695k626O161J3192J0546
$$ 1798 -5912 -10153 2095 20126 23159 8377 6247 6262 -1814 -8509 -11135 -4974 8218 18764
16885A8764n76M89K816J887J223j3049j0922m38J284l145Q39P916n05J140J1806
$$ 18764 18188 18677 21493 23380 24603 11554 632 194 1478 -1667 -828 7088 6583 7723 19529
16870A9529K735K138j1462Q669M024n165l380j3250p488J035O624o165m623o8
$$ 19529 22264 24402 12940 21609 25633 20468 17088 3838 -3650 -2615 4009 -2156 -6779 -6847
16856f847n737j1201J5520J6109O170l988J1140O637j430j420j5038q964M651
$$ -6847 -12584 -23785 -8265 7844 14014 10026 21166 27803 26373 24953 9915 951 5602
16843E602O519l835n28R705j3942j3768N624L237O454O287m57j0935M09j068L214
$$ 5602 12121 8286 7758 17463 3521 -10247 -4623 -1386 5068 11355 10898 -37 372 -696 2518
16828B518o04l656j34N380p423l482p243l61O107l84K362J2317O48N144L162l638
$$ 2518 1914 -1742 -1876 3504 -3919 -7401 -14644 -15005 -8898 -9282 -6920 5397 6045 11189 14351 10713
16812A0713q741j4217O297J1087m45k340l00M792L016k834n534O645R92q722j1880
$$ 10713 1972 -12245 -5948 5139 4694 2354 2054 6846 9862 7028 1494 8139 9131 409 -11471
16797a1471k255o271J1623J6163O361j6636r809K395J4013J0202l46n441N428
$$ -11471 -13726 -19997 -8374 7789 14150 -2486 -12295 -9900 4113 14315 13969 8528 13956
16784A3956Q86K804L677Q429j223j2059q036l54Q030o235K885J230o276l189P204
$$ 13956 14842 17646 21323 29752 28529 16470 8434 8080 16110 9875 12760 13990 7714 4525 11729
16769A1729O686p406j490j642Q778L118L65j2181l894K096K856K486n557k732
$$ 11729 18415 11009 9519 7877 16655 19773 20138 7957 4063 6159 9015 11501 5944 3212
16755C212M886r969J90o783r578J3285m315m888k067p16n53R511R666J4746r645
$$ 3212 8098 -1871 -1681 -8464 -18042 -4757 -9072 -13960 -16027 -16743 -17296 -7785 1881 16627 6982
16740F982p096J6182J0756r832j8681l43J142k94j0925k867o003J2083L738R33
$$ 6982 -114 16068 26824 16992 -1689 -2032 -890 -1184 -12109 -14976 -20979 -8896 -5158 -4225
16726d225P292j810j4308r866N29j660K669N768M20P700M957O457j173j269o598
$$ -4225 3067 1257 -13051 -22917 -22388 -24048 -21379 -15611 -15191 -7491 -2534 3923 2750 1481 -5117
16711e117k1244L185P243J1978M017k07Q289J6430P074j5697j4247k0167K1702
$$ -5117 -26361 -23176 -15933 -3955 62 -145 8144 24574 31648 15951 1704 -18463 3239
16698C239O401j1290j5594O524Q992P511r353m670P003O464J237J3218J354r402
$$ 3239 9640 -1650 -17244 -10720 -1728 5783 -3570 -8240 -1237 5227 6464 19682 21036 11634
16684A1634j6405O146n398k30N300Q179M556K08m217j2221j490O989P155J521
$$ 11634 -4771 1375 -4023 -4253 1047 9226 13782 13990 9773 -2448 -3938 3051 10206 11727
16670A1727P10j0933p916N136R702n139O365L270l275K777o623O362J005r046
$$ 11727 12437 1504 -6412 -1276 8426 3287 9652 12922 9647 12424 5801 12163 13168 4122
16656D122K358K375j0387O923L904m588o808p887j867o5J0458p54l132K848J0769
$$ 4122 6480 8855 -1532 5391 9295 4707 -2101 -9988 -11855 -11920 -1462 -2216 -5348 -2500 8269
16641H269P08q367r28j779k268m273M217K4694j165m974j0868q052J1404L878
$$ 8269 8977 610 -318 -2097 -4365 -8638 -4421 20273 19108 14134 3266 -4786 6618 10496
16627A0496p236O251J3208J856j1133o531M805R349n982q885j1151N528Q730J836
$$ 10496 3260 9511 22719 24575 13442 6911 11716 21065 15083 6198 -4953 575 9305 11141
16613A1141k933k247K371n531n284n195M962j605J354j86N157Q567J0750n646
$$ 11141 8208 5961 8332 2801 -2483 -7678 -2716 -4321 -2967 -3153 2004 10571 21321 15675
16599A5675m494m020p003O439m838K852J3795j1143l135Q125L878J190j545o637
$$ 15675 11181 7161 158 6597 1759 4611 18406 7263 4128 12253 16131 17321 15776 9139
16585I139q868O400P406j31L333m839N218m029m256N634K447J419j744m493o989
$$ 9139 271 6671 14077 13946 17279 12440 17658 13629 9373 15007 17454 18873 17129 12636 5647
16570E647N366k481N29o669m554J4426L77L674O741J2344M377m827p487r024j0875
$$ 5647 11013 8532 9061 2392 -2162 12264 12641 16315 23056 35400 39777 34950 27463 18439 7564
16555G564k369L56l615o122J3800P732l600j1989R788P371n484n434o30M28j3339
$$ 7564 5195 5551 1936 -4186 9614 17346 13746 1757 11545 18916 13432 7998 7368 7796 -5543
16540e543r944K267K71L91J1104M858k841m030J1988J7056L019j6564k0462P49
$$ -5543 -15487 -13220 -12949 -12558 -1454 3404 563 -3467 8521 25577 28596 12032 -8430 -7681
16526g681P946K959L206K114J077N350k012M564O313k62j4087k9314q744Q379
$$ -7681 265 3224 6430 8544 9621 14971 12959 17523 23836 23574 9487 -19827 -28571 -20192
16512b0192J2002L59N44O304n556j60O386M325j019o391R384N916k943q573j3084
$$ -20192 -8190 -7831 -7287 -983 -6539 -6699 -313 4012 2993 -3398 5986 11902 8959 386 -12698
16497a2698M568K739p928P999M222K353p432o316m859R175J94J634K10r488L015
$$ -12698 -8130 -5391 -13319 -5320 -1098 1255 -6177 -12493 -17352 -8177 -7983 -6349 -6139 -15627 -12612
16482a2612l750J630Q12q72j807M845J1098N861q818O74N0J1481M185j717p839
$$ -12612 -16362 -14732 -13920 -14792 -16599 -11754 -656 5205 -3613 -2939 -2889 8592 12777 11060 3221
16467C221K152l568j1033n694k266J3J1356N304j796o008L51L551O042l497j146
$$ 3221 5373 1805 -9228 -14922 -17188 -17175 -5819 -515 -2311 -8319 -7968 -4417 1625 -1872 -3018
16452c018n756J5J1535L261L387k824J176M853O18j5751Q706P288j0102Q000O826
$$ -3018 -8774 -8759 2776 6037 9424 6600 7776 12629 13247 -2504 6202 13490 3388 11388 18214
16437A8214j2166j9718k75Q434k032J626N53J0059n037M31M440j3638n107J862
$$ 18214 6048 -13670 -13945 -5511 -7543 -5917 -5364 4695 -342 89 4529 -9109 -14216 -12354
16423a2354J386J0740O106j1204R560m002M509J862l679o109P99P440j934l256
$$ -12354 -10968 -228 5878 -5326 4234 232 4741 6603 2924 -3185 -2386 5054 3120 -136
16409a36N834M287o070k003N506r263p261m981n358K497J0486M456R466m908L672
$$ -136 5698 9985 3915 1912 7418 -1845 -9106 -14087 -19445 -16948 -6462 -2006 7460 2552 6224
16394F224J524m70O668l02p564j1208q41p3Q672J0585j181r012L157M109J245
$$ 6224 7748 7278 13946 13644 6080 -5128 -5969 -6042 2630 13215 12034 3022 6179 10288 11533
16379A1533J39j0476q040k587o230L783N007M15K036L226j930k281o753M11k098
$$ 11533 11672 1196 -6844 -9431 -15661 -11878 -6871 -6456 -4420 -1194 -3124 -5405 -12158 -11747 -13845
16364a3845p755R982Q547R489K329k198j1363n280J501N07O106J6996P291j4846
$$ -13845 -21600 -11618 -3071 6418 8747 6549 -4814 -10094 -8593 -8086 -1980 15016 22307 7461
16350G461j4830K4k743p739J2774J8007r70l622q374M299m62o644j0881K410K1208
$$ 7461 -7369 -7345 -10088 -17827 -5053 12954 11984 8362 -12 4287 3825 -2819 -13700 -11290 9918
16335I918j144j140K099k399j9368q779P671N325J189O066k573P485l939r527
$$ 9918 8774 7634 9733 7334 -12034 -20813 -13142 -7817 -6628 -562 -3135 4350 411 -9116
16321i116O276k118j715n23m966r140n691Q394J2081L85J261n935l614J4663R618
$$ -9116 -2840 -4958 -6673 -7196 -12162 -21302 -26993 -18599 -6518 -6133 -4872 -10807 -14421 242 9860
16306I860K629J527j0754L891p028m030J875Q878N345j550l557m142k064k963
$$ 9860 12489 14016 3262 7153 125 -3905 -2030 6848 12193 10643 7086 2944 880 -2083
16292b083J0920J5241j815j6558O87q25n376j1081q574P652J0615M13l519J0212
$$ -2083 8837 24078 22263 5705 6392 5567 191 -10890 -19464 -11812 -1197 -784 -4303 5909
16278E909R236q014J522p654j2809p198q32J1316J8300o699j2802J396Q067J63
$$ 5909 15145 7131 8653 999 -11810 -19008 -19840 -8524 9776 3077 -9725 -8329 -262 -99
16264i9j1261l34J0071O258L873p309L215k972o814P34n59O450j41o397O433k916
$$ -99 -11360 -11694 -1623 4635 8508 1199 4414 1442 -5372 -4638 -5197 1253 1112 -5285 1148 -1768
16248a768r35j139J898M407o949j115J924M186K40P173p039l092J2783o303n327
$$ -1768 -2703 -3842 -1944 2463 -4486 -5601 -3677 509 749 7922 883 -2209 10574 4271 -1056
16233a056m947k705K982j4281j2033P811N611J25L689J0677j395l310L784L79
$$ -1056 -6003 -8708 -5726 -20007 -32040 -24229 -18618 -18493 -14804 -4127 -5522 -8832 -5048 -4669
16219d669J61K418L430J1710j036p769j1782o222q48j4489R648J9318K774m055
$$ -4669 -4508 -2090 1340 13050 12014 4245 -7537 -13759 -14607 -29096 -19448 -130 2644 -1411
16205a411n786p598J4373p340m635l55R982K149O480R486k604o057j818p160n696
$$ -1411 -7197 -14795 -422 -7762 -12397 -12752 -2770 -621 5859 15345 12741 6684 4866 -2294 -7990
16190g990K119R44k886J2792P094k066p345l307m904q977J124R893l147o144J5632
$$ -7990 -5871 -4927 -7813 4979 12073 10007 2662 -645 -5549 -14526 -13402 -3509 -6656 -12800 2832
16175B832n528j1577Q279R525Q697n134l594r010j1294n305J1978n337n077J1753
$$ 2832 -2696 -14273 -5994 3531 12228 7094 3500 -5510 -16804 -22109 -10131 -15468 -20545 -8792
16161h792J6300k911L459K281j1662M12L901p684j1922M832J0017q238m812J3326
$$ -8792 7508 4597 8056 10337 -1325 -913 2988 -4696 -16618 -11786 -1769 -10007 -14819 -1493
16147a493O82m477P469J4685N289o472M952q150j0354m106K077l879k415J689
$$ -1493 -811 -5288 2181 16866 22155 15683 20635 12485 2131 -1975 102 -3777 -6192 -4503
16133d503Q27r581o541J92Q585M841P530m5q458L403r226m412J7849R595K896
$$ -4503 -3676 -13257 -19798 -19606 -11021 -6180 1350 1305 -7153 -3750 -12976 -17388 461 10056 12952
16118A2952j74n412j6587n515M268O811n080m356N46J6109J0403n265p702j3386
$$ 12952 12778 7366 -9221 -14736 -10468 -3657 -8737 -13093 -12547 3562 13965 8700 998 -12388
16104a2388q243R070M859n475P747j460p947j0446J282P533J0197P946j5616j070
$$ -12388 -20631 -11561 -6702 -12177 -4430 -5890 -13837 -24283 -23001 -15468 -5271 2675 -12941 -14011
16090a4011l537R273J1992q640q243J323R993M322P605J470n087l169n319o936
$$ -14011 -17548 -8275 3717 -4923 -13166 -11843 -1850 2472 10077 11547 6460 3291 -2028 -8964
16076h964J06J427J6398m907l385K693M156p484K923J8959P428j5401j8181J393
$$ -8964 -8858 -7431 8967 4060 675 3368 7524 40 2963 21922 29350 13949 -4232 -2839
16062b839m589j5887j417J7844J6198L101L839m982m47p573k349j107J2139p452
$$ -2839 -7428 -23315 -24732 -6888 9310 12411 16250 11268 10821 3248 899 -208 11931 4479
16048D479j7958n373L446K617K846r172M416K907j220l023K292Q700J602N722
$$ 4479 -13479 -18852 -15406 -12789 -9943 -19115 -14699 -11792 -13012 -16035 -13743 -5043 -3441 2281
16034B281R946O767o752o171l439j6289M132P347q072m684N56L822j203o910J0717
$$ 2281 12227 18994 12242 6071 2632 -13657 -9525 -2178 -10250 -14934 -14378 -10556 -11759 -18669 -7952
16019g952K587O24J1836J8552k307p812j8297o204K659L906O660R307M531o213
$$ -7952 -5365 -4741 7095 25647 23340 15528 -2769 -8973 -6314 -2408 4252 13559 18090 11877
16005A1877j6859N760m957m047J44J0308K455p28Q646n056L702J0178P25o261
$$ 11877 -4982 778 -4179 -8226 -8082 2226 4681 3953 12599 7543 11245 21423 22148 15887
15991A5887m166P387j988o807m674o136q11P476k62K936p497j057K474j361L072
$$ 15887 11721 19108 17120 10313 5639 -497 -1308 6168 5906 8842 1345 288 2762 1401 4473
15976D473q43Q350n735J458k570j0767p24l214j0191J818J2354J888L136n686
$$ 4473 3630 11980 6245 7703 5133 -5634 -6358 -9572 -19763 -17945 -5591 -3703 -567 -6253
15962f253k705m28q749o894O225J4736M423k699J0446l995l648J1450M95j9456
$$ -6253 -8958 -9386 -18135 -25029 -18804 -4068 355 -2344 8102 4107 459 11909 12404 -7052
15948g052j361n004l752L522M137J1159J703p170k104j049J158K316J744o582
$$ -7052 -8413 -13417 -17169 -13647 -9510 1649 3352 -3818 -5922 -6971 -5813 -3497 -1753 -8335
15934h335J0048N931j752J3550l842r681M18N526n359n553q27O189k857r260j18
$$ -8335 1713 7644 5892 19442 15600 5919 6337 11863 6504 951 124 6313 3456 -5804 -5922
15919e922l820L626M847L003r320k049J0324O756r173j1973J1156M982O128J2590
$$ -5922 -9742 -6116 -1269 1734 -7586 -9635 689 7445 -1728 -13701 -2545 2437 8565 21155
15905B1155Q91p461j1566L826m354q287M047J498N109n634K798N135n13o830m400
$$ 21155 22046 14585 3019 6845 2491 -5796 -1749 -251 4858 -776 2022 7157 6644 -186 -4586
15890d586k814l768o460K886J3233R226l309l589R968P866m145l443n798M66K654
$$ -4586 -7400 -11168 -17628 -14742 -1509 7717 4408 819 10787 18653 14508 11065 5267 5733 8387
15875H387J2724j3079n270M659n374L564m279j77r234N943L875o407r790J176
$$ 8387 21111 8032 2762 7421 2047 5611 1332 1155 -8079 -2136 1739 -4668 -14458 -13282
15861a3282R067K012K311L22o659n024k512K868P221q365l620P412J016M116M337
$$ -13282 -4215 -2203 108 430 -6229 -11253 -13765 -10897 -3676 -12041 -15661 -8249 -7233 -3117 1220
15846A220k762J000j0312K078J4507O104j0537R89O866L254r453Q238J1891K011
$$ 1220 -1542 -542 -10854 -8776 5731 11835 1298 2287 9153 12407 2954 11192 23083 25094
15832B5094o608p873j2992j783l195L931j870J105K785q470r004R829J1744K653
$$ 25094 18486 10613 -2379 -4162 -7357 -3426 -5296 -4191 -1406 -9876 -18880 -9051 2693 5346
15818E346m159k37p368j818k912p6J1819J3152l015j7432k782p113J705J774P668
$$ 5346 1187 950 -6418 -8236 -11148 -11224 595 13747 10732 -6700 -9482 -16595 -14890 -13116 -5448
15803e448P919k578m614n296L812P442q123P77L020L563j1648N755P249M447Q068
$$ -5448 2471 -107 -4721 -10017 -6205 1237 -6886 -6109 -3089 474 -11174 -5419 1830 6277 14345
15788A4345m270l904n651p161l547Q6J1481J4795n452N790N572p877n696K890
$$ 14345 10075 6171 520 -6641 -10188 -10102 1379 16174 10722 16512 22084 14207 8511 11401
15774A1401n199L990M994N361J567j2262p685k960P042O887p104j0762j3371P57
$$ 11401 6202 10192 15186 20547 22114 9852 2167 -793 6249 13136 6032 -4730 -18101 -17344
15760a7344Q602m182j0647l355M577p598N301J1763P530L414j3299r211J2325
$$ -17344 -8742 -12924 -23571 -26926 -22349 -29947 -24646 -12883 -5353 -1939 -15238 -24449 -12124
15747a2124p14J862p252L299K715J2443J0184j0847j0278n275J4006J8050N209
$$ -12124 -12838 -10976 -18228 -14929 -12214 229 10413 -434 -10712 -15987 -1981 16069 21278
15734B1278K79j2126L172n447n716Q196M878J781o690Q190p304k935N27q792N668
$$ 21278 21557 9431 12603 7156 1440 9636 14514 16295 9605 17795 10491 7556 8083 -709 4959
15719D959P673j419r1m632l068j779j3744L668r21J4425Q263M65j6211o571R114
$$ 4959 12632 11213 11122 6490 3422 1643 -12101 -8433 -9354 5071 13334 13799 -2412 -8983 131
15704A31M750j3464o202n386K263P218M145L297N212J125L12p540p659J223J2489
$$ 131 4881 -8583 -14785 -20171 -17908 -10690 -6545 -3248 1964 3089 3401 -4139 -11798 -10575 1914
15689A914K416r131q362j1088j2353K954N044R628J4299R885m753r822K319J930
$$ 1914 4330 -4801 -13163 -24251 -36604 -33650 -28606 -18978 -4679 5206 453 -9369 -7050 -5120
15675e120J374k953J7654R31K991k862k766p037k199J5871J1798j8515j919N524
$$ -5120 -3746 -6699 10955 11886 14877 12015 9249 2212 13 15884 27682 9167 7248 12772
15661A2772j4893n51M739m884J608j258M818K764L572J350j226J191L428J2619
$$ 12772 -2121 -2672 2067 -2817 -1209 -2467 2351 5115 8687 10037 8811 10002 13430 26049
15647B6049p629n302k039m357l620J872J6335l486j3549o25l625L602j265M314
$$ 26049 18420 13118 11079 6722 3102 4974 21309 17823 4274 3649 24 3626 2361 6675
15633F675K941J321P659m909o624j1538j0638J75L729J60J2050O087M900n939
$$ 6675 9616 10937 18596 13687 7063 -4475 -15113 -14938 -11209 -11049 1001 7088 11988 6049
15619F049q877J1839K027l390J0762l545Q515n679k523J0697R81j0558j0434Q044
$$ 6049 -2828 9011 11038 7648 18410 14865 23380 17701 15178 25875 26856 16298 5864 13908
15605A3908j816m547r50m337N018l357j163p945J2931P364O221r358r349n566
$$ 13908 12092 7545 6595 2258 7276 3919 2756 -5189 7742 15106 21327 11969 2620 -2946
15591b946m838Q581N828R70r21j2072l365N50J3327j111j1814n184J1632P191
$$ -2946 -7784 797 6625 7595 6674 -5398 -8763 -8213 5114 4003 -7811 -12995 -1363 5828
15577E828j0034j738p119Q368R693n397j8091l639j06k55m871R207P627J5265
$$ 5828 -4206 -5944 -13063 -4695 4998 -399 -18490 -22129 -22235 -22490 -27361 -18154 -10527 4738
15563D738j535J0777m803j3971j1039p29m657J86N254n466O2J9480J3135r755
$$ 4738 3203 13980 9177 -4794 -15833 -16562 -21219 -21033 -15779 -21245 -21183 -1703 11432 1677
15549A677j2170q222J6703P216N264j6791j8727j334J0796M229m922O694P642
$$ 1677 -10493 -18715 -2012 5204 10468 -6323 -25050 -26384 -15588 -11359 -16281 -9587 -1945
15536a945j3042j0876K440Q802J6765M889j030O928j0748N62l433q384K634j60
$$ -1945 -14987 -25863 -23423 -14621 2144 7033 6003 12931 2183 2745 -688 -9072 -6438 -6598
15522f598l148K367p20J560M73q00J299k779J2281J6950r912j4217j377K458J884
$$ -6598 -9746 -7379 -8099 -6539 -6066 -6866 -5567 -8346 3935 20885 10973 -3244 -4621 -2163 -279
15507b79M271j6170O824N088J86J0343k72n139m689L49P08N18J300n176J028o134
$$ -279 3992 -12178 -5354 -266 -80 10263 9991 4852 163 512 1220 1738 3038 -2138 -1110 -7244
15491g244o295P885j2403N506M363m927l255J572N664M199L845o356j1501l829
$$ -7244 -13539 -5654 -18057 -12551 -8188 -13115 -16370 -14798 -9134 -4935 -1090 -7446 -18947 -22776
15477b2776P060J4913R939K152j0138K539o310P027q884m148o637M276O894j0319
$$ -22776 -15716 -803 9136 11288 1150 3689 -2621 4406 -4478 -8626 -15263 -10987 -4093 -14412
15463a4412J446P387l887k017K644K859M377L576K936o237p364Q878R408m295
$$ -14412 -12966 -5579 -9466 -11483 -8839 -5980 -1603 1973 4909 -1328 -8692 186 9594 5299
15449E299J266K373L087r850L912O77o526m129P499K693N029n031r242N600j331
$$ 5299 6565 8938 12025 2175 6087 6764 238 -3891 3608 6301 11330 6299 -2943 2657 1326
15434A326k822M457m387j266r048J457K853J4940n797j101j796q636L231Q522
$$ 1326 -1496 2961 -1426 -2692 -11740 -10283 -7430 7510 1713 612 -1184 -9820 -6589 1933
15420A933n304J046k280j3355q699L865J0159O481n943O49O448L385J0317K18
$$ 1933 -3371 -2325 -4605 -17960 -26659 -22794 -12635 -6154 -12097 -11448 -5000 -1615 8702 8920
15406H920j0223o60k464o592J0217M547M246J294m828n097R765p010J910J7694
$$ 8920 -1303 -1963 -4427 -11019 -802 3745 7991 9285 4457 -640 9125 2115 4025 21719
15392B1719K857j4240q656J466P619m94j1680n643R503J221J1849q171p175o881
$$ 21719 24576 10336 1680 3146 10765 10271 -1409 -7052 2451 3672 15521 7350 175 -6706
15378f706j4923n369K1093J4582Q144R656r227p820Q4k408P597J206l580o053
$$ -6706 -21629 -26998 -5905 8677 16821 26477 17250 9430 9514 7106 14703 15909 12329 6276
15364F276p122o963o634J2585J2824j0022j1297M783n268j1198P167J574q303
$$ 6276 -846 -7809 -14443 -1858 10966 944 -10353 -5570 -10838 -22036 -14869 -13295 -21598
15351b1598L527J2056K1201n213j6982p887J5568O489m003p397O195j3057j659
$$ -21598 -18071 -6015 15186 9973 -7009 -14896 672 7161 3158 -4239 1956 -11101 -12760
15338a2760P461n358m047q453R313q03l78O800Q013K302k757o5p598l833N186
$$ -12760 -5299 -10657 -14704 -23157 -13844 -14647 -15025 -8225 -212 2090 -667 -732 -8330 -12163 -6977
15323f977J1434k65N127q590q400K595P798q84o896n086K372j693m325O518J657
$$ -6977 4457 4192 9319 729 -7671 -5076 2722 1838 -5058 -10144 -7772 -9465 -13790 -7272 -5615
15308e615r900K310K0019K566m853l459K51j960j2167N613L866q36j181P148k851
$$ -5615 -15515 -13205 6814 9380 4527 1068 1319 -641 -12808 -7195 -3329 -4165 -5346 1802 -1049
15293a049l046j4843J2361O167O306N696R386j1599j6954P690k5K897N496J010
$$ -1049 -4095 -18938 -6577 -410 5896 11592 20978 9379 -7575 115 90 2987 8483 9493
15279I493j2410q183r116O494O212N115n204l524P672L027O086J890O005k298
$$ 9493 -2917 -11100 -20216 -13722 -7510 -2395 -7599 -11123 -3451 -424 5662 7552 13557 11259
15265A1259j0305j2216k132J184M656N854P078J3266o998r156o140J3447M656
$$ 11259 954 -11262 -13394 -12210 -7554 -1700 5378 18644 11646 2490 -3650 9797 14453
15252A4453N293p766k275L425p438J2153M840r751n652K644j2859j2340q873R804
$$ 14453 19746 11980 9705 13130 5692 17845 22685 12934 7282 9926 -2933 -15273 -24146 -14342
15238a4342P549N702r67n691L943J058j444J9120l423j4198o257l26L486r811
$$ -14342 -6793 -1091 -2058 -7749 -3806 -2748 -4192 14928 11505 -2693 -8950 -9276 -5790 -15601
15224a5601m952P23L499J0037N558l965m296K033M664j0789j1060k826R346N149
$$ -15601 -20553 -19830 -16331 -6294 -736 -4701 -8997 -6964 -2300 -13089 -24149 -26975 -17629 -12480
15210a2480M503J7829q592p467J0462J619L255j459J679Q52K797J239m433M990
$$ -12480 -7977 9852 1260 -6207 4255 5874 9129 7670 9349 10201 12998 14237 9804 14794
15196A4794r294o747R196r65n398N422J917R106n974q709R483J0260o135p180
$$ 14794 5500 -1247 7949 6984 1586 7008 8925 18031 12057 3348 12831 23091 16956 9776
15182I776l249K121m834o000l209l286k003K654p57J444M957N668O795L203j7104
$$ 9776 6527 8648 3814 -2186 -5395 -8681 -10684 -8030 -8787 -7343 -2386 3282 10077 13280 -3824
15167c824j8838K883O440n53n116N922j958Q281L316K331J6161M894j0514q371
$$ -3824 -22662 -19779 -13339 -13892 -19008 -13086 -15044 -6763 -3447 -1116 15045 19939 9425 1054
15153A054R19N530o481r328N493J967j5784n137J948J482M529J4670P93J178k89
$$ 1054 1973 7503 1022 -8306 -2813 -846 -16630 -21767 -19819 -18337 -13808 862 1655 2833 2544
15138B544k803n710J0446Q977N127j1919k587R547j6283Q48J1370j54j3305Q79
$$ 2544 -259 -5969 4477 13454 18581 6662 4075 13622 -2661 -1813 9557 9403 -3902 -3023
15124c023M346j8576J0738Q734p014J958K140j830j022m149n870K035j1107O15
$$ -3023 1323 -17253 -6515 2219 -4795 -2837 -697 -2527 -3549 -7698 -13568 -11533 -22640 -22025
15110b2025J591O64J888J0596O943L044K665o103j5607k809J170K3524Q393j1616
$$ -22025 -20434 -19770 -17882 -7286 -343 2701 5366 -737 -16344 -19153 -17983 5541 13934 2318
15096B318q372j557r925R319J3730J170J687L937k897j098j4429l121N599k935
$$ 2318 -6054 -7611 -17536 -8217 5513 6683 8370 12307 9410 8312 -6117 -9238 -3639 -6574
15082f574L2l985N918J3891L439j1097L909P30n089m643m168L070j647n776l288
$$ -6574 -6542 -10527 -4609 9282 12721 1624 5533 6263 1174 -3469 -7637 -4567 -6214 -11990 -15278
15067a5278k808J4979L542j4137m534j473L817l204j304M096p22j823r74L44j955
$$ -15278 -18086 -3107 435 -13702 -18236 -19709 -15892 -19096 -20400 -16304 -17026 -18849 -19823 -19479 -21434
15052b1434l881P745J4467Q483r916Q479J2176q126j7744P692J0541j533o768
$$ -21434 -25315 -17570 -3103 5380 -4536 3943 16119 7993 -9751 -2059 8482 6949 181
15039A81p192k495N963J1552k447p087n626j0279O29J1756L866j531o174L475
$$ 181 -7011 -9506 -3543 8009 5562 -1525 -7151 -17430 -16801 -5045 -1179 -2710 -8884 -5409
15025e409K095j051K225q571r074j737J1667J346l416M813J3718p411q193J4017
$$ -5409 -3314 -4365 -2140 -10711 -19785 -21522 -9855 -8509 -11925 -7112 6606 -805 -8998 5019
15011E019L986n588p179j1o10N339O944L433q057K430K50P014O091p101l716p413
$$ 5019 9005 3417 -3762 -3773 -4383 956 7900 11333 3276 5706 5956 12970 19061 11960 8244 831
14995H31j0283q36R703J0696q480l262o729L885L692M48J0007j434p174j0207
$$ 831 -9452 -10288 -585 10111 1631 -1631 -8360 -4475 -783 -335 9672 8238 1064 -9143
14981i143L82O903L420N393M73L882q907q682N30j07P119k160o56K676l71p100
$$ -9143 -8761 -1858 1562 6955 7428 11310 2403 -6279 -5749 -5856 1263 -897 -1553 1123 752 -6348
14965f348L456m098n569P827k134K310O403R999q767j1336L900J0163m310k697
$$ -6348 -2892 -6990 -12559 -4732 -6866 -4556 1847 11846 3079 -8257 -4357 5806 1496 -1201
14951a201J6408j927q042m578L450n20m255l975O909Q521j2791m293P25j787L420
$$ -1201 15207 13280 5238 660 4110 3590 -665 -4640 2269 10790 -2001 -6294 -5569 -7356 -3936
14936c936j26J0108J758n657M988k282o815m236j722p485O746R654J0888O79j4077
$$ -3936 -4062 6046 7804 2147 7135 4853 -1962 -6198 -7920 -15405 -8659 995 11883 12562 -1515
14921a515k0474k546O942J0665p10q275L72J6597l565j2067J390M321L883O935
$$ -1515 -21989 -24535 -17593 -6928 -7638 -15913 -15541 1056 -2509 -14576 -13186 -8865 -4982 1953
14907A953M911R708J550j0945j2206J943Q949j707j2339J1912K2210j921r450
$$ 1953 6864 16572 18122 7177 -5029 -3086 5863 4156 -8183 3729 25939 24018 14568
14894A4568j4556K81J2973K128j5399J522j265j1085j3935J7676J5275K452M659
$$ 14568 12 293 13266 15394 -5 1517 252 -10833 -24768 -7092 8183 10635 15294
14881A5294j0505r713K513O609M821j6551P98J3886l875o17O196l209r790j3253
$$ 15294 4789 -4924 -2411 4198 9019 -7532 -6734 7152 3277 2660 8856 5647 -4143 -17396
14867a7396N061Q188J7385N923k226j2186q59O64j733k965R992K410k999l206
$$ -17396 -12335 -4147 13238 19161 16935 4749 3890 4554 2821 -144 9848 12258 9259 6053
14853F053j2553j2915M566O727O893q971r36L811J0882K235o438J06L588J316
$$ 6053 -6500 -19415 -14849 -8122 -1229 -10200 -11136 -7325 3557 5792 -646 -540 3048 4364
14839D364j875K62r373K391Q056P426n052j7201j0981O645J1097P530J5205r036
$$ 4364 2489 2751 -6622 -4231 3825 11251 6199 -11002 -21983 -15338 -4241 3289 18494 9458
14825I458o721j540n295r738o1O379l948J042J3155p022Q934L666n780k473n966
$$ 9458 2737 1197 -4098 -13836 -13897 -7518 -11466 -10424 2731 -4291 4643 8309 2529 56 -5910
14810e910p33p220j0535L378q69L208N870P245n49N950K098N039Q093j4169J487
$$ -5910 -6643 -13863 -24398 -21020 -21889 -18681 -12811 -5566 -6115 -165 1933 6972 15065 896 2383
14795B383N324K038J0691N651j9306l390L17K142r7O058K636m900m151L811N458
$$ 2383 7707 9745 20436 26087 6781 3391 3708 5850 5753 11811 14447 9547 5396 9207 14665
14780A4665k959N277o86m053l975O65o758q689p23N359P136k508r857j132r309
$$ 14665 11706 16983 16297 12244 8269 8934 2176 -6513 -7236 -1877 5259 2751 -7106 -8238 -17547
14765a7547N926K447N250K094L303l093L007N126j046j3052r659M606J5662J5350
$$ -17547 -11621 -9174 -3924 -1830 1473 -1620 1387 6513 5467 -7585 -17244 -12638 3024 18374
14751A8374m717l151K336L018j7613r525J310N85p417R931J4873J0360j0859J304
$$ 18374 13657 10506 12842 15860 -1753 -11278 -9968 -9383 -16800 -6869 8004 18364 7505 8809
14737H809P969j2603r96K822n420K252K153o00M344j0828n367R742p989n801J2561
$$ 8809 16778 4175 3179 6001 581 2833 4986 4386 8730 -2098 -7465 2277 -5712 -11513 1048
14722A048J4353q389n626K369J178n04q40k127j0280l912O152J4326K249q769
$$ 1048 15401 7012 1386 3755 4933 4429 3589 1462 -8818 -12730 -6578 7748 9997 1228
14708A228j2212j155m395J798J4073J20O60n846m017J2825J3398p697r633j3892
$$ 1228 -10984 -12139 -16534 -14736 -663 -543 117 -5729 -9746 3079 16477 8780 -853 -14745
14694a4745j168P268J3725l587J829R800r699m041n829M181N946k8K204J1671
$$ -14745 -15913 -8645 5080 1493 3322 13122 3423 -618 -6447 -2266 3680 3652 5856 17527
14680A7527J865p072l567j2389r963k130J1086j199k044n184j1541j1542O900
$$ 17527 19392 12320 8753 -3636 -13599 -15729 -4643 -5842 -7886 -13070 -24611 -36153 -29253
14667b9253P406j662L083O842Q867j097M433L661m93n081n912K469O855M016O07
$$ -29253 -21847 -23509 -20426 -13584 -4717 -5814 -1381 2280 1787 -3294 -9206 -6737 118 4134 4741
14652D741K539j247O25o596j381q637J0105J0591P64r192J910p456J1617J255
$$ 4741 7280 6033 6658 62 -1319 -9956 149 10740 11504 2312 4222 -3234 8383 9638
14638I638j6980q905k981j1124j4846P535L2241J4217n546r882K672l489j26Q32
$$ 9638 -7342 -16247 -19228 -30352 -45198 -37663 -5422 8795 3249 -6633 -3961 -7450 -7576 -6744
14624f744m642k55K447L014r68Q968K594q931J219P081N163j3280r178O28O095
$$ -6744 -11386 -11641 -9194 -6180 -7148 1820 4414 -4517 -3298 3783 8946 -4334 -13512 -12884 -6789
14609f789k145J7048m304l499J294J409L461j5770j5608Q805K361L648K530M351
$$ -6789 -8934 8114 3810 311 1605 3014 6475 -9295 -24903 -16098 -13737 -10089 -7559 -3208
14595c208j935N537R264M645j7630l67p76j5164n448N372N331r653r647k362J2279
$$ -3208 -5143 394 9658 14303 -3327 -3694 -4470 -19634 -25082 -19710 -14379 -24032 -33679 -36041 -23762
14580b3762J326J571N144L29J0355N496m268K608q495j241p060m3M802m061R101
$$ -23762 -22436 -20865 -15721 -15392 -5037 459 -3809 -1201 -9696 -10937 -17997 -18040 -13238 -17299 -8198
14565h198J777q44o734l001M288L897J672R271j740K828n084j7q714o81L877J65
$$ -8198 -6421 -7265 -13999 -17000 -12712 -8815 -7143 2128 388 3216 -1868 -1885 -10599 -11280 -7403 -7238
14549g238R3k883O78n870J9673J0383mk210M50l14k285p4l070q624j6664M77K921
$$ -7238 -7145 -10028 -9350 -15220 4453 14836 14832 12622 13072 12758 10473 10399 7329 -1295 -17959 -17482 -14561
14532a4561P131P863K775K186n890l925N243p272n359j433O888M873M738J0484
$$ -14561 -7430 433 3208 5394 -496 -4421 822 -6450 -11809 -13242 -6354 -1481 3257 13741
14518A3741K74m333L003k220q033j1004Q963q83p03n807m750M832M365N976j1095
$$ 13741 14015 9682 12685 10465 2432 -8572 391 -492 -1195 -7002 -11752 -6920 -2555 3421 -7674
14503g674j2173R861R007K358J595j0351j405N62K439J3742K88O425K77j760m906
$$ -7674 -19847 -9986 -979 1379 2974 -7377 -8782 -8220 -5781 7961 8249 14674 14951 13191 8285
14488H285n814o775l775M603j237n386M435J0588K597j2932j5397o14J5228J2811
$$ 8285 2471 -4304 -8079 -3476 -4713 -10099 -5664 4924 7521 -5411 -20808 -21422 -6194 6617
14474F617n614m12n36J91O96j007k502J290j279N725M94O607N523r189n167j1745
$$ 6617 1003 591 55 246 942 -65 -2567 -1277 -2556 3169 3663 10270 15793 6604 1437 -10308
14458a0308M86Q441j774j4022m199K296m410j443J1611O978r791j1659m332K707
$$ -10308 -9822 -1381 -3155 -17177 -21376 -19080 -23490 -24933 -13322 -6344 -16135 -27794 -32126 -29419
14444b9419J4468k779l3o777O539P928L524P864P056o244j0250n990m187M653
$$ -29419 -14951 -17730 -17763 -24540 -18001 -10073 -6549 1315 8371 2127 -8123 -14113 -18300 -13647
14430a3647R422k650J861q304j2342Q447P317K171J800m040M93L937p182q495
$$ -13647 -4225 -6875 -5014 -13318 -25660 -17213 -9896 -7725 -5925 -9965 -9472 -5535 -12717 -21212
14416b1212J0951j094N998n618l499L617P702j0431m804K545J2547j412j9421
$$ -21212 -10261 -11355 -5357 -10975 -14474 -10857 -3155 -13586 -18390 -15845 -3298 -4710 -24131
14403b4131L287J0072j385j890l699P135m415l374O767l501O738O148o735r493
$$ -24131 -20844 -10772 -12157 -14047 -17746 -10611 -15026 -18400 -11633 -15134 -8396 -2248 -8983 -18476
14389a8476k015n185O651J8109o870j2179j5854O356L917L107R09K638j443M069
$$ -18476 -20491 -25676 -19025 -916 -7786 -19965 -35819 -29463 -25546 -22439 -21530 -18892 -20335 -16266
14375a6266J9196L891j1638O123P35r757o970j8977j1106M721R904M231O601P265
$$ -16266 2930 6821 -4817 1306 2041 -7716 -14686 -33663 -44769 -40048 -30144 -25913 -19312 -12047
14361a2047J2925M743P95N91M610P49q330j496J0615K072L477m146j0320j1327
$$ -12047 878 5621 6416 7007 11617 12366 4036 2540 13155 15227 18704 14558 4238 -7089
14347g089M362o11l970M513R060J3704j1046r898L681O921m115q115o944P983
$$ -7089 -2727 -3338 -7308 -2795 6265 19969 8923 -975 2706 9627 5512 -2603 -9547 -1564
14333a564j3908k897j28L806P166P886k254K350k576R284K75j3564l434l10m945
$$ -1564 -15472 -18369 -18497 -14691 -7525 361 -1893 457 -2119 7165 7440 -6124 -9558 -9868 -14813
14318a4813Q681J170O092k130N56m986l895M926J282j0223j0212l706P543Q167
$$ -14813 -6132 -4962 1130 -1000 -444 -5430 -9325 -4399 -3117 -13340 -23552 -27258 -19715 -11548
14304a1548R071l230m605j0077K75M236m076k09J5056O929k3072l738J0015N115
$$ -11548 -2477 -5707 -10312 -20389 -20114 -15878 -19954 -20163 -5107 1822 -21250 -24988 -14973 -9858
14290i858M833o376J2554p690k0449n774R203J1334K420l271J199O619KL401L695
$$ -9858 -5025 -11401 1153 -6537 -26986 -32760 -23557 -12223 -9803 -13074 -11875 -5256 -5254 -1853 1842
14275A842R425r42q774p08Q970o904j3775J0307J0974M770M568r252j7348J61
$$ 1842 11267 10325 1551 843 9813 2909 -10866 -559 10415 15185 19753 10501 -6847 -6686
14261f686J45q222M5M836J576k311o048r651N483P957j995J3051L378n009j9898
$$ -6686 -6541 -14763 -14718 -9882 -8306 -10617 -16665 -26316 -20833 -12876 -14871 -1820 1558 -3451 -23349
14246b3349P174J2874j075J671J3513o368o044o848n309P38O307o474m762P519
$$ -23349 -16175 -3301 -4376 -2705 10808 4440 -1604 -8452 -13761 -13023 -6716 -13190 -17952 -10433
14232a0433N007j0144j9297j417Q013L855J0858R359N679o560k554o036O736n049
$$ -10433 -5426 -15570 -34867 -36284 -28271 -24416 -13558 -4199 1480 -5080 -7634 -13670 -6934 -11983
14218a1983j8377o503J0917J0857K228N467q06K864M623j820L403q919l51P101
$$ -11983 -30360 -36863 -25946 -15089 -12861 -7394 -8200 -5336 -713 -2533 870 -8049 -8400 -1299
14204a299j1530k110L45J466m893Q219N691m965n347j1901l419P18J0226R525
$$ -1299 -12829 -14939 -14594 -13128 -18021 -9802 -4111 -9076 -14423 -26324 -29743 -29025 -18799 -9274
14190i274L861P923p35J75M82n06p825k769j89R603p980j1204Q80q46L321P373
$$ -9274 -5413 2510 1775 1950 2432 1926 -5899 -8668 -8857 746 -7234 -18438 -17558 -18404 -15083 -7710
14174g710m596M21J2132R761M743k147j2736N258j9887j1411J237J7694J4082
$$ -7710 -12306 -11885 247 10008 14751 12604 -132 5126 -14761 -26172 -24935 -7241 6841
14161F841J5360n627j7791n817l719j686K790J998O557P853o634j4441k389J6098
$$ 6841 22201 16574 -1217 -7034 -10753 -12439 -9649 -7651 -1094 6759 125 -14316 -16705 -607
14147f07k103k768O503j1133j0042R661J3090N797k396n604j1887j3772K355J8795
$$ -607 -2710 -5478 1025 -10108 -20150 -10489 2601 8398 6002 398 -11489 -25261 -22906 -4111
14133d111J4646q317q769Q865N406q192j4923q932k479m140O927Q203K960K902
$$ -4111 10535 2218 -6551 2314 7720 -472 -15395 -24327 -26806 -30946 -24019 -15816 -12856 -9954
14119i954m146K304P825K4702N824o105j7809j4577Q364o508N029Q322l859j4621
$$ -9954 -14100 -11796 -3971 20731 26555 20450 2641 -11936 -3572 -10080 -5051 3271 -588 -15209
14105a5209m397J1025K423K289R610L68q366m172J3113J4435j423k623n553r951
$$ -15209 -19606 -8581 -6158 -3869 5741 6109 -2257 -6429 6684 21119 19696 17073 11520 1569
14091A569n26N964n212k656P08O256k643J064j0832Q635m678p265n165Q718J2583
$$ 1569 1043 7007 1795 -861 -153 6103 3460 4524 -6308 2327 -2351 -9616 -14781 -6063 6520
14076F520l162j1411L358R073K532M715k534l918j3170j8572o150R707J4040p947
$$ 6520 3358 -8053 -4695 4378 6910 11625 9091 5173 -7997 -26569 -32719 -23012 -8972 -16919
14062a6919L263N657O42K122j149N154J96p294m091j922M289J0844O96R91l044
$$ -16919 -13656 -7999 -7357 -5235 -6384 -1230 -1034 -8328 -12419 -14341 -10052 792 1488 2479 -565
14047e65Q888L856j4850k1077N349K2349P388o865r845k028K4450K535q377j694
$$ -565 8323 12179 -2671 -23748 -18399 3950 11338 4473 -5372 -7400 17050 19585 11208 9514
14033I514L70N686J025r627j4754o888O165N872j593q017l94J222K18l862L528
$$ 9514 9884 15570 16595 6968 -7786 -14674 -8509 -2637 -4230 -12247 -12641 -11419 -11201 -15063 -11535
14018a1535j9J274O486r248j1262M125J2917J1429k145R790K582j4092o073o249
$$ -11535 -11554 -10280 -3794 -13042 -24304 -20179 -7262 4167 2022 11812 14394 302 -5771 -12020
14004a2020n790J630L666o084l677k261j743Q949K714K382O761j1370p056L16
$$ -12020 -17810 -16180 -12514 -18598 -22275 -24536 -26279 -17330 -14616 -12234 -5473 -16843 -23899 -23583
13990b3583q56R14J5215J4818m340o067Q952N698k697n050k555j6510n959J411
$$ -23583 -24439 -23525 -8310 6508 2168 -3899 5053 10751 8054 3004 449 -16061 -22020 -20609
13976b0609k675N671R997J328r749n433r081L18O380L865J0495o90j80r365P288
$$ -20609 -23284 -17613 -7616 -6288 -16037 -21470 -30551 -30233 -23853 -19988 -9493 -10183 -10363 -19728 -12440
13961a2440k580q211n68J3636k121K127n471j279L661j579J805K585n409O430
$$ -12440 -15020 -23231 -23799 -10163 -12284 -10157 -15628 -16907 -13246 -14825 -13020 -10435 -15844 -9414
13947i414j385L790n432o695O944O586J0433o029p617m595M035R10j021j0168
$$ -9414 -10799 -7009 -12441 -19136 -12192 -5606 4827 -1202 -8819 -13414 -9379 -8469 -9490 -19658
13933a9658O698J0572j504j878j0256o378l507P843L397o086L515J359P20M674
$$ -19658 -12960 -2388 -3892 -5770 -16026 -22404 -25911 -18068 -14671 -20757 -17242 -15883 -15163 -10489
13919a0489R39j1342j1643Q373J1642m573M33n92P148N167j080n037N963J090
$$ -10489 -9550 -20892 -32535 -24162 -12520 -17093 -16660 -17252 -10104 -4937 -6017 -11054 -5091 -4001
13905d001M315j1259N243Q393l344M463m38L579O888N53j012J801Q403p760j0321
$$ -4001 314 -10945 -5702 2691 -653 3810 3372 6951 13839 14392 13380 15181 23584 15824 5503
13890E503Q34K890k774n255O50o221n436P15o206M723P096l398J054Q06P022N121
$$ 5503 6337 9227 6453 1198 1848 -4373 -9809 -9094 -15300 -10577 -3481 -6879 -5825 -5019 2003 7124
13874G124J589j62K148p322n29k234J921Q73k123j1825m691P277P192p406j796
$$ 7124 8713 8551 10699 3377 2848 614 2535 3408 1285 -10540 -15231 -7954 -762 -8168 -9964
13859i964J0247P949p109j6818K357K531J405j0923l887K1837J2689l699p645
$$ -9964 283 8232 1123 -15695 -13338 -10807 -9402 -20325 -24212 -2375 10314 6615 -1030
13846a030j4665r880J0217Q530J2414N033O181O913L724n116j1951r62O581q909
$$ -1030 -15695 -25575 -15358 -6828 5586 10619 16800 23713 27437 22321 10370 9408 15989 7080
13832G080j6104J040R123k640K759J0037j0092q090J626M230j0256q276P00m436
$$ 7080 -9024 -7984 1139 -1501 1258 11295 1203 -6887 -5261 -1031 -11287 -19563 -18863 -23299
13818b3299j66L900J364p131J337K561Q622L901J3638j832k679P206o960j697
$$ -23299 -23465 -19565 -18201 -25332 -23995 -21434 -12812 -8911 4727 2895 216 7422 462 -1235
13804a235K263K026j174J1515K404q938j1051j365q41K645Q606P312J993L57o564
$$ -1235 1028 3054 1880 13395 15799 6861 -4190 -5555 -6396 -3751 4855 12167 14160 14517 7953
13789G953j4691k086J3680M516m650m476o433j3454j3130K588Q602P219J0040
$$ 7953 -6738 -8824 4856 9372 4722 246 -6187 -19641 -32771 -30183 -21581 -14362 -4322
13776d322O663j0061j5951n464J4011J0141P917P539J143o830j1280L806L180
$$ -4322 2341 -7720 -23671 -29135 -15124 -4983 2934 10473 11616 4786 -6494 -2688 492
13763D92k564O708J8450Q165n136j2770j953J082o447M008K833j8454j4391Q877
$$ 492 -2072 4636 23086 31251 26115 13345 11392 12474 6027 10035 12868 -5586 -19977 -11100
13749a1100k548Q335N939M161O217r057r309P141M537O222p414p885J631n530
$$ -11100 -13648 -5313 626 4787 11004 1947 -7362 -221 4316 10538 3124 -4761 -3130 -8660
13735h660o003l43J999M057J052L87k592J486J857N202Q717p985l957n720j2761
$$ -8660 -14663 -15006 -13007 -8950 -7898 -7511 -10103 -8617 -6760 -1558 7159 -826 -4783 -10503 -23264
13720b3264K365J6691J773o565k968P73K112j1165p93J2311O531R065K885l555
$$ -23264 -20899 -4208 -2435 -9000 -11968 -11195 -9083 -20248 -21041 -8730 -2199 6866 9751 6196
13706F196j2738m40N189J0523j724o042j5248q882O077J4510M465r414M704K193
$$ 6196 -6542 -6982 -1793 8730 7006 964 -14284 -23166 -17089 -2579 1886 -7528 -2824 -631
13692f31K629N250L739r099j950q580n972J0925Q958J5247j2579j958L31r891
$$ -631 1998 7248 10987 1888 -62 -8642 -14614 -3689 5269 20516 7937 5979 6310 -3581
13678c581j2412O308J1652R81J946p501m300J790R080K826m375O888L435j4032
$$ -3581 -15993 -9685 1967 2948 4894 -2607 -6907 -5117 3963 6789 2414 9302 12737 -1295
13664a295k475r003n184O366M199K523q251q24m679r603P721r854M227J1392R576
$$ -1295 -3770 -12773 -17957 -11591 -7392 -4869 -13120 -13944 -18623 -28226 -20505 -30359 -26132 -14740 -5164
13649e164N430L491j0495n684N517l983N248k843L561L370N446N164j765O260
$$ -5164 266 3757 -6738 -12422 -6905 -10888 -5640 -8483 -4922 -1552 3894 9058 7293 13553
13635A3553m522p239j5477m456J45n735Q189N373j0636o371O813J1237n412P44
$$ 13553 9031 1792 -13685 -18141 -17996 -23731 -15542 -10169 -20805 -27176 -20363 -9126 -14538 -13794
13621a3794P671L488M992J0698M4j60n527M04N623J702l064r286P898K3574r609
$$ -13794 -6123 -2635 2357 13055 13099 12939 7412 7816 13439 15141 12077 2791 10689 34263 24654
13606B4654j0915j317Q582k929j2562n266m881m180P792M764K17p084J1209q763
$$ 24654 13739 12422 21004 18075 5513 247 -4634 -8814 -1022 3742 3959 -3125 8084 -679
13592f79m552O440R886N68j603r196q593K395J4008O717J260M309r403J203l529
$$ -679 -5231 1209 11095 11663 10060 864 -7729 -5334 8674 15391 16651 20960 11557 12760 9231
13577I231M202Q671q636M0j776p070Q751P68j7071m010J6074P138Q95P989N759
$$ 9231 13433 22104 13468 13508 11732 4662 13413 14181 -2890 -6900 9174 16312 17207 25196 30955
13562C0955K641q104p805j938J0917m195m993j2205j1114p219M565M0J0961O750
$$ 30955 33596 25492 17687 15749 26666 22471 17478 5273 -5841 -13060 -8495 -8455 2506 9256
13548I256K616M956n777j2651L734K601l199q039L936R685K016l029O710M149
$$ 9256 11872 16828 11051 -1600 2134 4735 1536 -6503 -2567 7118 9134 6105 12815 16964
13534A6964m598p766q42P520l195N821N954M95n594p343J1201P455O03p967M730
$$ 16964 12366 4600 3758 11278 8083 13904 19858 20353 14759 7416 18617 26072 26675 18708 23438
13519B3438M039m087K379K980Q989J54J531n857k4438j046K993l535o671r000
$$ 23438 27477 23390 25769 28749 37738 37892 39423 33566 9128 8082 11075 7540 869 -8131
13505h131J0779O829J707k800p782l140m482K402J3067J450N085n291r703N733
$$ -8131 2648 9477 11184 8384 602 -2538 -7020 -4618 8449 9899 14984 9693 -10 5723
13491E723L087J255Q95L222r674o675j4196l319K0928J7288O227q996q686M18
$$ 5723 8810 10065 10960 14182 4508 -2167 -16363 -19682 1246 18534 24761 15765 7079 7497
13477G497l785l657m770K133K404K553R237J101k121q360j008K486K94Q97N219
$$ 7497 3712 55 -4715 -2582 -178 2375 11612 12713 10592 2232 1224 3710 4004 4901 10120
13462A0120l199k442P198l164m524J0371J484J991K238j4866q348o09n916k51
$$ 10120 6921 4479 11677 8513 3989 14360 15844 17835 20073 5207 -3141 -3750 -9666 -9917
13448i917P772P120j2911K575O163l562r575J3209J0701j1434o453N047L476R331
$$ -9917 -2145 4975 -7936 -5361 802 -2760 -12335 874 11575 141 -6312 -1265 2211 11542
13434A1542M828m851k500N409J4439K269K482j3779q813O4J9890Q37j4470j2144
$$ 11542 16370 11519 9019 14428 28867 31136 33618 19839 11026 11090 30980 31817 17347 5203
13420E203j809J1529J617M600j2004j5293L042M506l19p268l418l882n585k737
$$ 5203 3394 14923 16540 21140 9136 -6157 -3115 1391 1072 -6196 -9614 -13496 -19081 -21818
13406b1818K794K1031J1133o05n60OQ02J769q728O395L073l203j4937P222J3639
$$ -21818 -19024 2007 13140 12535 11975 11981 12783 14552 5824 12219 15292 12089 -2848 4374 18013
13391A8013M007J824k666q190p139P662P146l644p958q549K167l349O381O610
$$ 18013 22020 23844 21178 12988 5849 13511 20657 17013 9055 506 2673 -676 5705 12315
13377A2315j494l465k931L145k134o356r126N092L831l401L853M646K191q310
$$ 12315 10821 7356 4425 7570 5436 -920 -10046 -4954 -1123 -4524 -671 3975 6166 -2144
13363b144n773J2139J6615M656L946R441q015q297K540K087M037j194R456m157
$$ -2144 -7917 4222 20837 25493 29439 38880 30865 22568 25108 27195 31232 30038 39494 35337
13349C5337j3964P380J7689K2030R648N683N631O703K0234J1880J6701K7669N3086
$$ 35337 21373 28753 46442 68472 78120 83803 89434 96137 116371 128251 144952 172621 225707
13336B25707R3662J23103J84242L21445M73769M61516K08761L7001q2809m37931
$$ 225707 319369 442472 626714 948159 1421928 1883444 2092205 2129206 2046397 1608466
13326A608466n34454l30941j88110j07844p7276n8850m0977l3307k4287k4311
$$ 1608466 1074012 743071 554961 447117 369841 310991 270014 236707 212420 188109
13316A88109l8010j5876q738k3170k3397q525P038M911J0966M629j0135r241j807
$$ 188109 150099 134223 125485 102315 78918 70393 77431 82342 93308 97937 87802 78561 76754
13303G6754r200q953R326J7897Q440r808r052j322q968r384J1723j985p697J3518
$$ 76754 67554 58601 67927 85824 94264 84456 75404 74082 65114 55730 67453 65468 57771 71289
13289G1289L485K126J355p166j406p270j0855J2499J1835n946j0513k7203j2424
$$ 71289 74774 76900 78255 71089 69683 62413 51558 64057 75892 69946 59433 32230 19806
13276A9806O397J6302N515J0266P513k238O86L952K142p792n05K328n415k54Q160
$$ 19806 26203 42505 48020 58286 65799 63561 64247 68199 70341 62549 62044 64372 58957 58703 66863
13261F6863J674p802K595J5300r431j0485r259J2j3084m791J157K917k132j81
$$ 66863 68537 60735 63330 78630 69199 58714 49455 49467 36383 31592 32749 35666 33534 33353
13247C3353R19J1746M160M497n507J2752J98p165r775k091l896M916L096l168
$$ 33353 34272 46018 50178 54675 49168 61920 62118 54953 45178 43087 39191 44107 47203 44035
13233D4035j48N187K972k194k048l89r565m383m630J3094L343j1477j7398p576
$$ 44035 43887 49074 52046 49852 47804 47415 37850 33467 28837 41931 45274 33797 16399 8823
13219H823l407Q920L087j716J4612M414l330M998K893p890n412J961J0011Q622
$$ 8823 5416 14336 17423 15707 30319 34733 31403 36401 39294 31404 25992 27953 37964 46586
13205D6586j0034q275j437j0462q850Q251Q921J0081j0514k001j1187j4693J423
$$ 46586 36552 28277 26840 16378 7528 15779 24700 34781 24267 22266 11079 -3614 -2191
13192b191r35m972Q968J5384L537n605j4145l488J866k57J1673j2979j2715m421
$$ -2191 -3126 -8098 870 16254 19791 14186 41 -3447 -1581 -1838 9835 -3144 -15859 -20280
13178b0280L539K665m098r020r347L166M417M757J2904P881M849N423O254l341
$$ -20280 -16741 -14076 -18174 -27194 -36541 -33375 -28958 -24201 -11297 -3416 1433 6856 13110 9769
13164I769M578M059Q915J2002J4176j0959j8518m420o483m066P172M191j6124
$$ 9769 14347 18406 27321 39323 53499 42540 24022 19602 13119 9053 16225 20416 4292
13151D292l622K1936K2247K486j9409j514O410p636M274l14l872J2616O431l486
$$ 4292 670 22606 44853 47339 27930 26416 32826 25190 29464 29150 25278 37894 44325 40839
13137D0839J0136L618j409J4266J4256q3n640K237P365M509K2123K8457L9948
$$ 40839 50975 54593 53184 67450 81706 81623 75983 78220 85585 90094 112217 140674 180622
13124A80622N9799O7517N2886K0930M137n3067o2022n7675m2445k4875l1450r499
$$ 180622 240421 307938 360824 381754 385891 332824 270802 213127 170682 145807 114357 104858
13112A04858J6719J3277N762O039j6848j8473j4012j3384j6841O107R491k536
$$ 104858 121577 134854 140616 146655 129807 111334 97322 83938 67097 73204 82695 80159
13100H0159l836L607K752J6563R596j886o401N479L66q696m088j0827j1046K897
$$ 80159 76323 79930 82682 99245 108841 106955 100554 106033 106399 97703 93615 82788 71742 74639
13086G4639j1013Q00m430q955Q746K106R755J0821J4337k759J3121J5666r586
$$ 74639 63626 64426 59996 51041 59787 61893 71648 82469 96806 94047 107168 122834 113248
13073A13248j6940p224j103k949P780n191j1503J2626R329J209r140J1779K1819
$$ 113248 96308 89084 87981 85032 92812 87621 76118 88744 98073 99282 90142 101921 123740
13060A23740J8887L7675L5160J4417j2931j2382l2295m2326j6669o035m035K407
$$ 123740 142627 180302 215462 229879 216948 204566 172271 129945 113276 107241 103206 105613
13048A05613j5240n779J1092J3438N043K938l17O564l902M29P217J7567M400M056
$$ 105613 90373 84594 95686 109124 114167 117105 116788 123352 119450 119879 127096 144663 149063 153119
13034A53119J3033o247j2491j4623J4586P856n149R513J781N5P73M918L808j9182
$$ 153119 166152 159905 147414 132791 147377 155233 150084 159597 161378 161433 162206 167124 170932 151750
13020A51750k3052j3672j4574j1128j9326M787K0703P209L828J3652N936n842
$$ 151750 128698 115026 100452 89324 69998 74785 95488 102697 106525 120177 126113 120271
13008A20271R143K8096K6889J5816Q037J0821L0182L7518P0260R9343J34699J98051
$$ 120271 129414 157510 184399 200215 208252 219073 249255 286773 357033 456376 591075 789126
12996G89126K25241J89695P4134j32480j68214p6278j92263k04773j85191j22431
$$ 789126 1014367 1204062 1278196 1145716 977502 901224 708961 504188 318997 196566
12986A96566o1556l9138r838k3513j0329N984R130J579N078P806M384m761o106
$$ 196566 135010 95872 86034 62521 52192 58176 67306 68885 73963 81769 86153 81392 75286
12973G5286o543m176Q240o836p13OJ3954J2297L3771K5803K2341K1233K1769R586
$$ 75286 68743 64567 72807 65971 65258 65264 79218 91515 125286 151089 173430 194663 216432 226018
12959B26018n111j3111k7427l3713k7161J331J6084o276N769J7553l67J792N795
$$ 226018 220907 207796 180369 146656 119495 120826 136910 130634 136403 153956 153589 155381 161176
12946A61176J3290J2673J5926R264j153j039N87J8028J9286K0093K8895K7715
$$ 161176 174466 187139 203065 212329 211176 210137 210724 228752 248038 268131 297026 324741
12934C24741K6311J8144K3090M7721M6853K6126L0687K3973J0459J3571L1310
$$ 324741 351052 369196 392286 440007 486860 512986 543673 567646 578105 591676 622986
12923F22986J7044R620L3143L8047K6229K5467K0067J0920L386j5789p939J1836
$$ 622986 640030 649650 682793 720840 747069 772536 792603 803523 806909 791120 783181 795017
12911G95017M0970Q6503Q2876N7307O9933Q3360O0308M9922P3572O4555P0007
$$ 795017 835987 922490 1005366 1062673 1132606 1215966 1276274 1326196 1399768 1464323 1534330
12900A534330R8746J33841J26379J33113J57048J68532J71589K16544K61112K66770
$$ 1534330 1633076 1766917 1893296 2026409 2183457 2351989 2523578 2740122 3001234 3268004
12890C268004K72703L38483M09582M98672O08736P18374Q37683J032328J283871
$$ 3268004 3540707 3879190 4288772 4787444 5396180 6114554 6952237 7984565 9268436
12881I268436J642041K077148K404658K564526K964425L636278M469059O462012
$$ 9268436 10910477 12987625 15392283 17956809 20921234 24557512 29026571 35488583
12873C5488583J0301188J6782270K7576929M6017358P3449204R2685394O7020438
$$ 35488583 45789771 62572041 90148970 136166328 209615532 302300926 369321364
12866C69321364J6773215K516048l4904130r8514160q5751687m9834766k8312260
$$ 369321364 386094579 388610627 353706497 255192337 169440650 119605884 91293624
12859I1293624j7755026j2384561r119881o604387m781830l845652l252698k684126
$$ 91293624 73538598 61154037 52034156 45429769 40647939 36802287 33549589 30865463
12851C0865463k613235k447389k005117j564482j280548j114350r36683q17237
$$ 30865463 28252228 25804839 23799722 22235240 20954692 19840342 18903659 18086422
12843A8086422p87895p04623o29360n73350m87789m64810m77691m60418l98266
$$ 18086422 17298527 16593904 15964544 15391194 14903405 14438595 13960904 13500486 13102220
12834A3102220l39480k70937k15519j98228k13817k10217k25141k87836l44364
$$ 13102220 12762740 12491803 12276284 12078056 11864239 11654022 11428881 11141045 10796681
12825A0796681l22302k62444k15826j76503j55404j51780j81576j51942j30727
$$ 10796681 10474379 10211935 9996109 9819606 9664202 9512422 9330846 9178904 9048177
12816I048177j16466r6911n7287k3497M5619J05709J65157J98739J51656J08831
$$ 9048177 8931711 8834800 8777513 8754016 8799635 8905344 9070501 9269240 9420896 9529727
12806I529727N9005r6904j65467j13755q8823k7211K0363m3788j47223k15188
$$ 9529727 9588732 9491828 9326361 9212606 9123783 9096572 9116935 9073147 8925924 8710736
12796H710736k64392l50498m34478m73826m59129m11497l72441l09409k76831
$$ 8710736 8446344 8095846 7661368 7187542 6728413 6316916 5944475 5635066 5358235
12787E358235k38917k18825j82333j80871j73440j77541j48875j26516j23802
$$ 5358235 5119318 4900493 4718160 4537289 4363849 4186308 4037433 3910917 3787115
12778C787115j28914j31952j37560j38738j34752j12179q3956q5908q6584o2525
$$ 3787115 3658201 3526249 3388689 3249951 3115199 3003020 2919064 2833156 2746572 2684047
12768B684047n7282n0269m5625m3525n2845n6276m9101n6336n1739m6070m0666
$$ 2684047 2626765 2576496 2530871 2487346 2434501 2378225 2329124 2272788 2221049 2174979 2134313
12757B134313m1711l9573k9035k6658k9549l4587k3818k4140k9973l0978j5056
$$ 2134313 2092602 2053029 2023994 1997336 1967787 1933200 1909382 1885242 1855269 1824291 1809235
12746A809235l2361m5372p2838p8542m7606n0553o9706o9265o8460o5938k0932
$$ 1809235 1776874 1731502 1658664 1580122 1532516 1481963 1412257 1342992 1274532 1208594 1187662
12735A187662p00m817k2332l7562l9114k8695k8228l6321m5256n0773l3562k4072
$$ 1187662 1186962 1182145 1159813 1122251 1083137 1054442 1026214 989893 944637 893864 860302 836230
12723H36230j9517j3611q794j2778j4360k2579j9370j9348k4678k7699l1651m2071
$$ 836230 816713 803102 794308 781530 767170 744591 725221 705873 681195 653496 621845 579774
12711E79774k7120m988j4567j2260j1282j5657j2635k9965l0615l2557k7703l5531
$$ 579774 552654 547666 533099 520839 509557 493900 481265 451300 420685 388128 360425 324894
12699C24894j6348r19J8301L591n055k1043q704j1914N337J661p827k626Q092
$$ 324894 308546 307627 325928 329519 324464 303421 294717 282803 288140 289801 281974 279348 287440
12686B87440N522Q462J8581K783k0875k0036k4553l7417n2603n1000m1763j6908
$$ 287440 292962 301424 320005 322788 301913 281877 257324 219907 167304 116304 74541 57633
12674E7633J3288L5036L8702M0890L3927J9891J5792P105O384k722l793Q305R265
$$ 57633 70921 105957 144659 185549 219476 239367 255159 262264 268648 265926 262133 270438 279703
12661B79703n414k1451k176j0257j3881O05j188m241j214M583k580j3187l597
$$ 279703 274289 252838 250662 240405 226524 227129 225941 221700 220486 225069 222489 209302 205705
12648B05705n396P267N034j3896j2558j2376J032N947K179j6619r562J1390P803
$$ 205705 200309 207576 212610 198714 186156 173780 174812 180759 182938 166319 156757 168147 175950
12635A75950l17k434R244J7119P994M346l9q407m797q861j2234l193K884r304
$$ 175950 175633 173199 182443 199562 207556 211902 211863 203456 198659 189798 177564 174371 177255 167951
12621A67951K438k039j2510n169Q664J2663j479O59J4660M789k026n116o169K011
$$ 167951 170389 168350 155840 150671 159335 171998 170519 171178 185838 190627 188601 183485 177316 179327
12607A79327L200J0152l033k513o127l75O400o053j0538p225j0498N094N271p667
$$ 179327 182527 192679 189646 187133 181006 180631 187031 180978 170440 163215 152717 157811 163082 155415
12593A55415p934N103P6j5936q310L488O899J2623l061l379M009P121j0739r346
$$ 155415 147481 152584 152660 136724 128414 131902 138801 151424 148363 144984 148993 156114 145375 136029
12579A36029j846r656j2658j5740p31l954l329r786q681O090O867n73K169L336
$$ 136029 134183 124527 111869 96129 95398 91444 88115 78329 69648 75738 82605 82032 84201 87537
12565H7537j282k115J7458J8029J1512P76m698k979j0877K81q877L985r166j0741
$$ 87537 86255 84140 101598 119627 131139 131915 127217 124238 113361 113642 104765 108750 99584 88843
12551H8843r493o377N411k238K322j512Q017L503j3508q624j3353N730J2440o233
$$ 88843 79350 72973 78384 76146 78468 76956 84973 88476 74968 66344 52991 58721 71161 64928
12537F4928j3158p671J1648O956P065Q45m296r43o136j426j1186K903k560n48
$$ 64928 51770 44099 55747 62703 69768 70613 66317 65374 59238 57812 46626 49529 46969 46421
12523D6421N798Q904O059m674O72M371j318L753j8314k089J1875J1110j0213O639
$$ 46421 52219 61123 67182 62508 63180 67551 66233 69986 51672 49583 61458 72568 62355 68994
12509F8994n151p417j433m549Q027O421L594k0327j699J863L063j244K712J191
$$ 68994 63843 56426 54993 50444 58471 64892 68486 48159 46460 48323 51386 50142 52854 54045
12495E4045p131r787K377M840M519k634J36j382Q69k766N777J503K516M53J526
$$ 54045 46914 37127 39504 44344 48863 46229 46365 44983 45852 43086 48863 50366 52882 53335 54861
12480E4861O895R714r430k2326l471m18n568l180Q328Q01m580l283M171J0293
$$ 54861 61756 71470 62040 39714 36243 35825 30257 27077 35405 36206 31626 28343 32514 42807
12466D2807j04L313O714o429M033O763j2515K94J3183j2638o707j654M779J0842
$$ 42807 42703 46016 52730 46301 50334 57097 44582 44876 58059 45421 38714 37060 41839 52681
12452E2681j890L849K667m856p866k455j0902l651J5721N654L47l802r044K225
$$ 52681 50791 54640 57307 52451 44585 42130 31228 27577 43298 48952 49299 45497 36453 38678
12438C8678J4789O40j8568P801m091Q972J496q930J2988J0274N957J882M088k806
$$ 38678 53467 54107 35539 43340 39249 48221 49717 40787 53775 64049 70006 71888 75976 73170
12424G3170j2019o860l339P805J4121O520k451j722l132o396r040j695J1601J4241
$$ 73170 61151 54291 50952 58757 72878 79398 76947 75225 72093 65697 56657 54962 66563 80804
12410H0804J0753J0856J5806K3317K3105J0109K2651L6644M7699P0443J05522
$$ 80804 91557 102413 118219 141536 164641 174750 197401 234045 281744 352187 457709
12399D57709J76720K93393M49598M78091K52689M3879m6422l73498n44919l76355
$$ 457709 634429 927822 1377420 1855511 2108200 2152079 2105657 1732159 1187240 810885
12389H10885k00570j21379p5909o8419l8435m1282l2334j8699n746n514k1859
$$ 810885 610315 488936 413027 344608 306173 264891 232557 213858 208112 202598 180739
12378A80739q307j51n624o274j5280j5505p756r68J4206J570m316O230L93j0696
$$ 180739 172432 172281 166657 160383 145103 129598 121842 120874 135080 136650 132334 138564 138957 128261
12364A28261o816p611k372k566O653l875k657O484o479j6580L624j1896k0893
$$ 128261 121445 113834 111462 108896 115549 111674 109017 115501 109022 92442 96066 84170 63277
12351F3277r374R397K514J561J4912J970j333o924j0476j36r925O603K201q600
$$ 63277 53903 63300 65814 67375 82287 84257 82924 76000 65524 65388 55463 62066 64267 55667
12337E5667Q158J683R158J1138k419K175J18l826K822J1389P883Q195j35k766
$$ 55667 63825 65508 74666 85804 83385 85560 85678 81852 84674 96063 103946 112141 112006 109240
12323A09240o754j0198j3388l645j3763j0061Q428J610n27Q177j273q521k76l224
$$ 109240 102486 92288 78900 75255 61492 51431 59859 61469 60942 69119 67846 59325 59049 55825
12309E5825M876j831m466J4258m50j3875j1655j839O534r578o895J278R295K34
$$ 55825 60701 58870 54404 68662 68212 54337 42682 40843 47377 37799 30904 32182 41477 41711
12295D1711m790L620M097k212K6Q934L552l106j2711q249k91M654R84R97j1630
$$ 41711 36921 40541 44638 42426 42452 51386 54938 51832 39121 30872 30581 35235 36219 37216 25586
12280B5586N773Q683j129J483J5260p019j1734m005o986l011l924k215q145p23
$$ 25586 31359 40042 38913 40396 55656 48637 36903 32898 25912 22901 18977 16762 8617 7894
12266G894J4183K589M771M335m082n041l452P821R199L75P437J742M055Q071m810
$$ 7894 22077 24666 29437 33772 29690 24649 21197 29018 38217 38592 46029 47771 51826 59897 55087
12251E5087j2749j3933m154K519j391N76J51o032K988l992J385K250m601P695
$$ 55087 42338 28405 24251 26770 25379 25955 26106 20074 23062 19070 20455 22705 18104 25799
12237B5799K413o315N736J0820j4016q467m401l685J8093K279o596o29J0101J078
$$ 25799 28212 21897 27633 38453 24437 15970 11569 7884 25977 28256 21660 21031 31132 32210
12223C2210m229k255Q478L946j9681k687n067L973K684k730J9P267K530N809j0315
$$ 32210 27981 25726 34204 38150 18469 15782 10715 14688 17372 14642 14661 21928 24458 30267 19952
12208A9952J340K085q786n882l763L234p348J285Q715P094K87K698M722N15j2452
$$ 19952 21292 23377 14591 8709 4946 8180 832 2117 10832 17926 18213 20911 25633 26148 13696
12193A3696n041n472k46J673k774m566j234J0234J4693N78r62R824q509r104q619
$$ 13696 8655 3183 2937 4610 1836 -2730 -3964 6270 20963 21541 20579 30403 21894 12790 4171
12178D171k712Q362k563L192P546o215k967k310l981N311m836N258O107k228R752
$$ 4171 1459 9821 7258 10450 17996 11781 8814 6504 2523 7834 2998 8256 14363 12135 21887
12163B1887K91j4522o292r888J3769O564j3743p376J8586J2355N601P289j672
$$ 21887 22178 7656 1364 -8524 5245 11809 -1934 -9310 9276 21631 27232 34521 32849
12150C2849q288o375k976Q323p085M724K882O050P135O486R82j0441j356k640
$$ 32849 24561 18186 15210 23533 16448 21172 24054 30104 37239 43725 44707 34266 32910 30270
12136C0270K45N421q430p343K506j457r139l822Q089Q880j6256q204L18R934J1084
$$ 30270 30515 35936 27506 20163 22669 21212 12073 8251 16340 25220 8964 760 1078 11012 22096
12121B2096J2910l649j0834K539l043n706L723P858P570K4K770r170q168L798
$$ 22096 35006 31357 20523 23062 20019 14313 18036 25894 33464 33488 36258 27088 18920 22718
12107B2718M333m950j4177o286M941O37k000q402J0540M79M148M771J667q18N424
$$ 22718 27051 22101 7924 1638 6579 7216 5216 -3186 7354 7833 11981 16752 18419 17601 23025
12092B3025N023n254j7973p977J618k930R131R711J0032Q968k91j0971J221j193
$$ 23025 28048 22794 4821 -3156 -1538 -4468 4663 14374 24406 33374 33083 22112 23333 22140
12078B2140J064p377l599Q263J0565N041k664m575k575q002l534J2541Q911q394
$$ 22140 23204 15827 12228 20491 31056 36097 33433 28858 26283 18281 14747 27288 36199 27805
12064B7805j5774p172L952n614R549K014M787P416r381l616K870k139l909l154
$$ 27805 12031 4859 8811 3197 12746 14760 19547 26963 17582 13966 16836 14697 10788 7634
12050G634Q374K805Q928j09j0025m707r23J712N080l170j2377r068k575l939p464
$$ 7634 16008 18813 27741 27632 17607 12900 11977 13689 18769 15599 3222 -5846 -8421 -12360 -19824
12035a9824K9408R691K624J034M739K26j1110O002m15j0793o1M311q389l393k785
$$ -19824 9584 19275 21899 22933 27672 27898 16788 22790 22375 11582 11521 15832 7443 4050 1265
12020A265q812l325M126K0494O4j3764j118J4073k782j3735O186K824J643L898
$$ 1265 -7547 -10872 -6746 13748 13812 48 -1070 13003 10221 -3514 2672 5496 7139 11037
12006A1037J4353K18j9768j452m941M386l47J736Q704j893R982K756j4684l35
$$ 11037 25390 25608 5840 4388 -553 3833 3486 5222 13926 12033 22015 24771 10087 9752
11992I752P733j2693q720P787M825q311j2479K969J6843J7316q877n960k858k297
$$ 9752 17485 4792 -3928 3859 8684 373 -12106 -9137 7706 25022 16145 10185 7327 5030
11978E030m438O891Q002M091p521j5823K277J0656R310m353j2199p674M464m729
$$ 5030 592 7483 15485 19576 12055 -3768 -1491 9165 18475 14122 1923 -5751 -1287 -6016
11964f016J0182O073m345l900K87K72p86L960R847m378N112K291L725k039K5P630
$$ -6016 4166 10239 5894 1994 2281 2553 1767 5727 15574 11196 16308 18599 22324 20285 20310 27940
11948B7940R347j338j7021n226p69r81P037M488P083K007m159j1861q573M848
$$ 27940 37287 35949 18928 13702 12933 11952 18989 23477 30560 32567 28408 16547 7974 12822
11934A2822J3326M331j0812r350m865L023P810Q114N28j2455j4434n097N077K0227
$$ 12822 26148 30479 19667 10317 5452 8475 16285 24399 24927 12472 -1962 -7059 -1982 18245
11920A8245M978n217p413n634k588P710r76m686N841M672J945k331n826K361l32
$$ 18245 23223 18006 10593 4959 2371 10081 9105 4419 10260 14932 16877 14546 8720 11081 10749
11905A0749J2016Q021r47j478k337m827N938m09O168k19L55k443R29j7650r995
$$ 10749 22765 30786 29839 28361 26024 21197 27135 26726 32894 32675 33030 30587 31516 13866 3871
11890C871R503N293l505j0868p19J0441j147p689l959L465j977m391m79j880P7
$$ 3871 13374 18667 15162 4294 3575 14016 12869 5180 1221 4686 2709 -1682 -2161 -4041 -3964
11875c964Q013O458K535N383j2419r455N19J1713O126Q282j144j1804o177n683
$$ -3964 4049 10507 13042 18425 6006 -3449 -2930 8783 14909 23191 22047 10243 4066 -1617
11861a617J2246K26K07o371J151M071n936m248P89M934J1257j1831n616J2021
$$ -1617 10629 10855 11062 4691 5842 9913 3977 -271 518 5452 16709 4878 -738 11283
11847A1283J2305P372j3279p318k453K472r999r561R257k243R71K948l473j46
$$ 11283 23588 30960 17681 10363 7910 10382 383 -9178 79 -2164 -1193 1755 -1718 -1864
11833a864l025m371J0547j082j517J6321R184j5761l426L024P382o01n636M896
$$ -1864 -4889 -9260 1287 205 -1312 15009 24193 8432 5006 8030 15412 14811 9175 14071
11819A4071p866N09l317l59J3399J2857j297m348l370k626o309k524o348k338
$$ 14071 6205 6714 3397 3038 16437 29294 27997 23649 20279 17653 11344 8820 2472 134
11805A34P769K3626M829j2346l770j0762j234N659M062L997K780j456Q667L152
$$ 134 7903 31529 36358 24012 20242 9480 8246 13905 17967 21964 24744 23288 31955 35107
11791C5107p399P19p235n59n495r696j326k51o648M148J7521j5941j4222J8567
$$ 35107 27708 28427 21192 20633 15138 5442 4116 3865 -2783 1365 18886 2945 -11277 7290
11777G290K421j0334o120m416Q63l681Q144L789p329M514J4957N286J99o817m397
$$ 7290 9711 -623 -6743 -11159 -10296 -13977 -5833 -2044 -9373 -4859 10098 15384 15583 8766 4369
11762D369J0575K748j0559p772K04K78L291k899j0185Q857J2458K059L810o584
$$ 4369 14944 17692 7133 -639 -435 -157 3134 235 -9950 -1093 11365 13424 17234 10650
11748A0650L515N350J508N116r744j0654O499P08k964j626j781M796m254m594
$$ 10650 14165 19515 21023 26139 16395 5741 12240 12948 9984 8358 6577 11373 7119 2525
11734B525l248l539K774Q56P452q740l597l004K1134N362q710o931L149J0078
$$ 2525 -723 -4262 -1488 -632 6820 -1920 -5517 -8521 12613 17975 9265 2334 5483 15561
11720A5561O101j901j1773j300M860Q820n30q445L52M903j6849n478P170J1582
$$ 15561 21662 19761 7988 6688 11548 20368 19838 11393 11745 16648 -201 -5679 1491 13073
11706A3073J9235m493n177j1702m45Q782l790j1443M163P264J0150J3100J107
$$ 13073 32308 27815 22638 10936 10491 19273 15483 4040 8203 15467 25617 38717 39824
11693C9824m718m660p148O790j8603j707Q154j1659j5701J686j448J0582J8806
$$ 39824 35106 30446 23298 30088 11485 9778 17932 6273 -9428 -7742 -9190 1392 20198
11680B0198P276j0058j4857l040P652N34P078J7451P036j3602p457p563j5427
$$ 20198 27474 17416 2559 -481 7171 7705 14783 32234 39270 25668 18211 10648 -4779
11667d779k727o324L037O889J0397o076j1223O690L230K681Q516L405k100n52
$$ -4779 -7506 -13830 -10793 -3904 6493 417 -10806 -4116 -886 1795 10311 13716 11616 11064
11653A1064j0554q928J6886L022l855j570l701L724P302m405n639p783O62K941
$$ 11064 510 -8418 8468 11490 7635 6065 2364 6088 13390 8985 3346 -4437 -3775 -834
11639h34J435R454j1573J32M206J916p92O670J2501J629j4291j3483L31K719J1807
$$ -834 601 10055 -1518 -1386 2820 4736 3944 10614 23115 24744 10453 -3030 -2699 20 11827
11624A1827n128j8042L618p33q92o874N084J0338N346R958P372M89j1509n952
$$ 11827 6699 -11343 -7725 -8458 -9350 -16224 -11140 -802 4544 14502 21874 22363 10854 4902
11610D902L554k63M268q131M13Q268L025k929m379j0866o541N150L082P27N949
$$ 4902 8456 8193 12461 4330 4743 13011 16036 13107 8728 -2138 -8679 -3529 -447 280 6229
11595F229L020p562r169L687J0647O334j7377j0330k014K681J0970J2413k819
$$ 6229 9249 1687 -7482 -3795 6852 13186 -4191 -14521 -16535 -13854 -2884 9529 6710
11582F710p889J753l820q302j364J3968J2199l927O897l783N061N923M288Q78
$$ 6710 -1179 574 -3246 -11548 -12912 1056 13255 9328 16225 12442 17503 23426 27714 28592
11568B8592j3617j455k806n219j0131K241J0357J1526O421j7985O140P471m111
$$ 28592 14975 13520 10714 5495 -4636 -2395 7962 19488 25909 7924 14064 21535 17424
11555A7424o817m52r16m569O336l931n217k253J0982K645j9116m404J738r84O328
$$ 17424 10607 10155 9239 4670 11006 7075 1858 -395 10587 13232 -5884 -10288 -8550 -9534 -3206
11540c206J1281J0942P038K180r315n696p516K296n074q703j42J4924R090J307
$$ -3206 8075 19017 26055 28235 18920 13224 5708 8004 2930 -5773 -5915 9009 18099 19406
11526A9406j5249L189K712O55p370m019M88l423J0180L375M836J0804m555r615
$$ 19406 4157 7346 10058 10713 3343 -676 -188 -3611 6569 9944 14780 25584 21029 11414
11512A1414o172N129K923o064l691Q18O734J1882m585j8217j172r36J0102L762
$$ 11414 5242 10371 13294 7230 3539 4357 11091 22973 18388 171 -1001 -1937 8165 11927
11498A1927R12l335J0200O003j32o048r315N542N620L898k241K26J383k82K352
$$ 11927 12839 9504 19704 25707 25575 19527 10212 15754 21374 25272 23031 23257 24640 24358 26710
11483B6710q180j1967j358N292N611J072j1412o540N528n685j1635P214J1298
$$ 26710 18530 6563 5205 10497 16108 17180 5768 -772 4756 -929 -12564 -5350 5948
11470E948N480M324l925n22Q281n375o566R691Q468m642j3514l095L667j0021
$$ 5948 11428 15752 11827 11305 19586 14211 7645 17336 25804 21162 7648 4553 8220 -1801
11456a801J747K49n425k601k488J7052R658j5447l809Q37R189q025L30m545l448
$$ -1801 -54 195 -5230 -7831 -10319 6733 16391 944 -2865 -2028 7161 -864 -534 -5079 -8527
11441h527N625M710k082P112k547K692M880Q880n890p116J2455j36m456L956m290
$$ -8527 -2902 1808 -274 6838 4291 6983 11863 20743 14853 7737 20192 20056 15600 19556 15266
11426A5266k0969j023r22j0534J2609J157o484M913l041l991Q200K566k570k676
$$ 15266 -5703 -6726 -7648 -18182 -5573 -4416 -10900 -5987 -9028 -13019 -4819 -2253 -4823 -7499
11412g499q944k704k159J069L447M999Q783l807j3895M639M160l616M234o11J797
$$ -7499 -16443 -19147 -21306 -20237 -16790 -11791 -3008 -6815 -20710 -16071 -11911 -15527 -11293 -11904 -10107
11397a0107M668J0331J022K340J4586j5277j2339q084O97R784K903O612O116n054
$$ -10107 -5439 4892 5914 8254 22840 7563 -4776 -12860 -12163 -2379 524 7136 13252 8198
11383H198j568q239j0031Q705Q266P69K62K297l578j1028N221q937k171J0781
$$ 8198 6630 -1609 -11640 -2935 5331 6100 6362 8659 5081 -5947 -726 -9663 -11834 -1053
11369a053L03n732R493R243J082j3679n452J3465j534p127j291j103J450n335
$$ -1053 -750 -6482 3011 12254 13336 -343 -5795 7670 6136 -991 -2282 -3385 -1935 -7270
11355g270M298Q805j167m952k501o191p289O238L665P494R937J5908j915n544
$$ -7270 -2972 5833 4666 -286 -2787 -8978 -16267 -10029 -6364 1130 11067 26975 25060 19516
11341A9516q141q755K324r64N164j129j4424m757Q606J6010K279l706k507j0535
$$ 19516 11375 2620 4944 3980 9144 8015 -6409 -11166 -2560 13450 15729 12023 9516 -1019
11327a019J863J320r078M238M742P077O238k37p612j3897o724O847M289O328q235
$$ -1019 844 2164 -6914 -2676 2066 9143 15381 15144 7532 -6365 -13089 -6242 -1953 4375 -3860
11312c860p365m168j0653j714J0126k145k679O680L47J2470O607k124M122l206
$$ -3860 -11225 -15393 -26046 -27760 -17634 -19779 -22458 -15778 -15431 -2961 3646 1522 5644 2438
11298B438L851P20J0192k24n374j5638j0772J023J0442k525p306N832O20j20J2531
$$ 2438 6289 7009 17201 16977 11603 -4035 -14807 -13784 -3342 -5867 -13173 -7341 -6721 -6841 5690
11283E690N680k824N099J3496l379q912N751K294m898n499q018O688j582j827
$$ 5690 11370 8546 13645 27141 23762 14850 20601 22895 17997 12498 4480 11168 9586 7759
11269G759n871l507O04n39k321n929n7R733J7975j251j6739j736m328K554J0325
$$ 7759 1888 -1619 -1015 -1554 -3875 -9804 -9861 -128 17847 16596 -143 -1879 -6207 -3653 6672
11254F672r48M649M827p560k822p306P9R943K344l465p267k32J136p817L662J0961
$$ 6672 5724 10373 15200 7640 4818 -2488 -2409 7534 9878 6413 -854 -1086 50 -7767 -4105 6856
11238F856P717P4O393n23o165j246O605P719J73L073n710j0821N808k535L96r004
$$ 6856 14573 14647 21040 20517 14352 13106 19711 27430 27603 30676 24966 14145 19953 17418 17814 8810
11222H810J56m561m22k253J0811o777o277M647N480n632J3627N199l381p578L347
$$ 8810 8966 4405 3983 1730 12541 5764 -513 4134 9614 3982 17609 22808 19427 11849 15196
11207A5196m101K013K47n62r88K142k86k863K031J0551n022j3347j4301O107J0984
$$ 15196 11095 13108 13355 12793 11805 13947 13661 10798 12829 23380 18358 5011 -9290 -3183 7801
11192G801m486K349J4326N061m124j0875k910m159m171k976J2377J774j4662J674
$$ 7801 3315 5664 19990 25051 20927 10052 7142 2983 -1188 -4164 8213 9987 -4675 -3001
11178c001L540l468l037l934J69J5389r57J534l535p846J1140J1079j1513M611
$$ -3001 539 -2929 -5966 -9900 -9731 5658 4701 6235 2700 -5146 5994 17073 5560 10171
11164A0171K331J2393o462k201l753j1829J2420O99n48R596J14l909j1225o003
$$ 10171 12502 24895 18433 16232 12479 650 13070 13769 13221 22817 22931 19022 7797 1794
11150A794m773R054L411j251L052k263l072r980K978J1708j7136o738J289J7265
$$ 1794 -2979 6075 9486 8235 11287 9024 5952 -4028 -1050 10658 -6478 -13216 -11927 5338
11136E338P802l890n816J943Q411o599M445O997k498J4682P784k90r822N57j730
$$ 5338 13140 9250 3434 5377 13788 7189 11634 18631 16133 30815 38599 38309 28487 29044 27314
11121B7314j6728j892N382P798K690o631J836l598m576r233O60O722P326j011
$$ 27314 10586 8694 14076 21874 24564 17933 19769 16171 11595 2362 3022 9744 17070 16059
11107A6059j2156q760j443j035M485J1337M515q842J116J4941L136L6n734q048
$$ 16059 3903 -4857 -6300 -7335 -2850 8487 13002 4160 5276 20217 23353 23389 17655 9607
11093I607j884K737m722K317Q482O684q470k280L93J012Q99n892L962K642r55
$$ 9607 7723 10460 5738 8055 16537 23221 14751 12471 12864 13876 14775 8883 12845 15487 14532
11078A4532r376P037N522k514L453L660l203j5247j058P350j725q432J289J982
$$ 14532 5156 12193 17715 15201 18654 22314 19111 3864 2806 10156 8431 -1 1288 3270
11064C270p798l813K910J5395Q003r708K275l692k627M401m491j0054J0144K645
$$ 3270 -4528 -8341 -5431 9964 17967 8259 10534 6842 4215 8616 4125 -5929 4215 6860
11050F860m80M947O867r002o652o314m661J746Q051P003l987o026q04k354J844
$$ 6860 6380 11327 18194 9192 2540 -3774 -8435 -6689 1362 8365 4378 -1648 -2452 -4806 -2962
11035b962O421p944Q121J2920j414j0058j397K504o864j340l296K118P170r062
$$ -2962 3459 -4485 3636 16556 15142 5084 3687 6191 -673 -2013 -5309 -3191 3979 -5083
11021e083j0232J202L910J8411O90j3963o831L630K047J4819Q852o148j8403j0893
$$ -5083 -15315 -14113 -10203 8208 8898 -5065 -11896 -8266 -6219 8600 17452 11304 -7099 -17992
11007a7992R507J8470j1419j0214j2948J4597K4850j290j2791j3867N753o989
$$ -17992 -8485 9985 -1434 -11648 -24596 -9999 14851 13561 770 -13097 -7344 -14333
10995a4333o463j896J6115J0321j480o955o033L606O727n591O930J4664k52k587
$$ -14333 -20796 -22692 -6577 3744 2264 -4691 -10724 -7118 -391 -5982 948 15612 15360 12773
10981A2773N7L122l096j5622n174K574r679J1575N026O561m764j7903q324J4867
$$ 12773 12830 15952 12856 -2766 -7940 -5366 -15045 -3470 1556 8117 3353 -14550 -22874 -8007
10967h007R908J4438P00p39m895j990k894O677o01k2343n19j705m822P811n800
$$ -8007 1901 16339 17039 16300 11405 9415 6521 13198 12597 -9746 -10265 -11970 -16792 -8981 -14781
10952a4781r42N670m579l595J6597Q622j2816N16J322R423k990j1358K031L510
$$ -14781 -15723 -10053 -14632 -18227 -1630 6992 -5824 -5308 -3986 5437 2447 -8911 -6880 -3370
10938c370M445j0116k317K571P450Q182O37L290o497o81J0927j3078m679K252
$$ -3370 1075 -9041 -11358 -8787 -1337 6845 7482 10772 4275 3594 14521 1443 -3236 -984
10924i84p521k679K515J0943q890O51M557J0335K086j0590j338L473K576J2498
$$ -984 -8505 -11184 -8669 2274 -6616 -5965 -1408 8927 11013 423 -915 2558 5134 17632
10910A7632l245j5144n267q58K734l535m001O501N504m532m090R006J1738j305
$$ 17632 14387 -757 -6024 -6882 -4148 -7683 -11684 -5183 321 -4211 -8301 705 12443 11138
10896A1138j0071l676R60J2270P325P643n277r954r830p787j0110M615R158K736
$$ 11138 1067 -2609 -1649 10621 17946 25589 20312 10358 528 -7259 -17369 -12754 -3596 -860
10882h60N228k288k898o492L116J3080K577j527M019l948n429q117J0837Q916
$$ -860 4368 2080 -818 -7310 -4194 8886 11463 9936 13955 10007 4578 -3539 7298 16214
10868A6214j558n891n813P143N844k462o920j1306Q355J3276K736n000K492J778
$$ 16214 14656 8765 2952 10095 15939 13477 6557 -4749 3606 16882 19618 14618 17110 18888
10854A8888l593k628r495j1226m638J0380R379P75J294n52O472J036J39j117j5993
$$ 18888 15295 12667 3172 -8054 -12692 -2312 7067 7842 9136 8584 15056 16092 16231 15114 -879
10839h79J668l961M379N298J1323j097l702m732L794J5970k72r58j0419j5546
$$ -879 789 -3172 1207 6505 17828 16731 13029 8297 12091 28061 27789 26831 16412 866
10825H66q93k059j5077m783R7Q810M910L642J6795O637j3552j1934L605J858j087
$$ 866 -27 -2086 -17163 -21946 -21849 -13039 -8129 -4487 12308 18945 5393 -6541 -2936 -1078 -2165
10810b165P93m461q682l253O815j007J037R160R8M220J983M282J511l499k465
$$ -2165 -1372 -5833 -14515 -17768 -10953 -11960 -10923 -1763 -1665 2555 4538 8820 10331 6832 4367
10795D367R87P072L387j0294k992j1257m278L982R673q202N997j381L197K522
$$ 4367 5354 12426 15813 5519 2527 -8730 -13008 -9026 647 -7555 -1558 -2939 258 2780
10781B780J1515o272q294n417L333n592J1304J7630m520j034L808p702m977p534
$$ 2780 14295 8023 -271 -5688 -2355 -7947 3357 20987 16467 15433 19241 11539 6562 -972
10767i72n103N566Q13O333K937m476J135p39m574M016j8688R901K2198K303j5699
$$ -972 -6075 -509 304 6637 9574 5098 6233 5494 920 4936 -13752 -3851 18347 20650 4951
10752D951n749p53k842J2070L824o260j4277m94K834J0442J266K865L153L900
$$ 4951 -798 -1551 -4393 7677 11501 5241 -9036 -9530 -6696 3746 5012 7877 11030 14930
10738A4930q339O002J275r503m561K511P104q662K143l559L440O825j0187k869
$$ 14930 6591 12593 13868 4365 -196 2315 9419 757 2900 -659 2781 9606 -581 -3450
10724c450k305J973O481l307N041K76J246o707p522r742N70R268Q148J3569L858
$$ -3450 -5755 -3782 2699 -608 4433 4709 5955 -752 -8274 -18016 -17446 -8178 -30 13539 17397
10709A7397k843r619L053m546M611P639k624r004M254r448L314m776p519J852
$$ 17397 14554 4935 7988 3442 8053 15692 13068 4064 8318 -1130 2184 -2592 -10111 -8259
10695h259O97k269R743n656K518J0680o466N662J5l163k916N156j58m913Q861
$$ -8259 -7562 -9831 -88 -5744 -3226 7454 988 6650 6665 3502 586 5742 5584 671 9532
10680I532K127J230q605j4405l424Q776M962j4695N364N307j591J0710k056l962
$$ 9532 11659 12889 4284 -10121 -13545 -4769 193 -14502 -9138 -3831 -5422 5288 3232 -730
10666g30R392P03m080k592m723k62l449P192M750K858n631p85l437p663k294J557
$$ -730 8662 9365 5285 2693 -2030 -2292 -5741 1451 6201 9059 3428 2643 -794 -8457 -10751 -9194
10650i194J4237N896j356l311j642R797o088n977l49q146K858l009k525L703o780
$$ -9194 5043 10939 9583 6272 4630 14427 8339 2362 2013 -6133 -3275 -6284 -8809 -5106 -11886
10635a1886j3341M953R300J0019J4122m640q843k0348p657p924K976O703R222
$$ -11886 -25227 -20274 -10974 -955 13167 8527 -316 -20664 -28321 -36245 -33269 -26566 -17344
10622a7344N965n811j674J183M087J5998n823l770Q740m738M516P625l080j1798
$$ -17344 -11379 -17190 -18864 -17681 -13594 2404 -3419 -7189 1551 -3187 1329 8954 5874 -5924
10608e924Q247O134p678n501o449k779J16o71Q396k646K855R370O552m934J043
$$ -5924 2323 8457 779 -4722 -11171 -13950 -13834 -14505 -6109 -8755 -5900 3470 10022 5088 6131
10593F131N164P698p080r269j8292J0456Q987l132N808j675K592p9M462L881j709
$$ 6131 11295 18993 11913 2644 -15648 -5192 3795 663 6471 4796 7388 7309 11771 15652 13943
10578A3943J0556n710n912k260m980j374m212R528j467l770j0771j0065n47K814
$$ 13943 24499 18789 12877 10617 5637 4263 51 9579 8112 4342 -6429 -16494 -17041 -14227
10564a4227O387J2267J1523l758n33J54m134q65o249p168O950O737l576m040O701
$$ -14227 -7840 4427 15950 12192 11659 11813 7679 6814 565 -6603 347 7084 3508 -532 6169
10549F169Q710J5l387k74p076o567j093K0111Q085j0320r756k5839l791J5882
$$ 6169 14879 14894 11507 11233 4157 -2410 -3503 16608 24693 14373 4617 -21222 -25013 -9131
10535i131K0723L954j4412j4671P077k740L458J3889N030n689j4786N476J0093
$$ -9131 11592 15546 1134 -13537 -6460 -9200 -5742 8147 13177 7488 -7298 -1822 8271
10522H271p249j2231o749q252L288J4244O443R692J997p365P390L059M750j0564
$$ 8271 1022 -11209 -17958 -26210 -22922 -8678 -2235 7457 9454 2089 9479 12538 17288 6724
10508F724n625m560q048q88P041K141P38n476j2591M551J2645j998k780N272m398
$$ 6724 1099 -3461 -11509 -12397 -5356 -3215 -2477 -7953 -20544 -15993 -3348 -5346 -8126 -2854 -7252
10493g252M517J6613j819k227k287j1418o580R129N325O074m533n106l238O168
$$ -7252 -2735 13878 12059 9832 7545 -3873 -10453 -1324 4001 10075 5542 436 -2802 3366
10479C366P711L525M336j2085k3680o387m576J5429R868P609L268L746n057K439
$$ 3366 11077 14602 18938 6853 -16827 -23214 -27790 -12361 -2493 5116 8384 12130 7073 9512
10465I512L625l548m599n90k830n916P38q972k535Q026j911k201K604K60P927
$$ 9512 13137 9589 4990 4400 1570 -4346 -3608 -12580 -15115 -7089 -9000 -11201 -8597 -8337 -410
10450d10K564l530L528p533k967J7333J2022o397j609M269r298q126k340r848
$$ -410 2154 -1376 2152 -5381 -8348 8985 21007 14610 13001 17270 7972 -154 -2494 -12342
10436a2342K993R370P827l49k999o668p224j3620O241K185j7061N10M752J4059
$$ -12342 -9349 21 7848 7499 4500 -2168 -9392 -23012 -16771 -14586 -31647 -31137 -26385 -12326
10422a2326K7654O923r017l577J487m780j658K151j8863p88p87p654l231p200
$$ -12326 15328 22251 13234 9657 11144 6364 4706 6857 -12006 -12794 -13581 -21235 -24466 -31666
10408c1666J2127J1961R441O75j0371l90r31m036J528N455Q638Q840K34j549R04
$$ -31666 -19539 -7578 1863 2538 -7833 -8223 -9154 -13190 -11662 -6207 2431 11271 11505 9956 10860
10393A0860M305M014j0490j3183k676K722J28O689p4J173p582j44N567R473L509
$$ 10860 15165 19179 8689 -4494 -7170 -4448 -4320 2369 2295 3468 -4114 -4258 1309 10782 14291
10378A4291N748j5119P43O545j4213p480O51P764J0517R320l373q493n444J071
$$ 14291 20039 4920 5663 12208 -2005 -9485 -8834 -1070 9447 18767 15394 6901 1457 2528
10364B528P395k283L470J7653o394j7518j3147j0262N492J4729O269L487m579
$$ 2528 9923 7640 11110 28763 22369 4851 -8296 -18558 -13066 1663 7932 11419 6840
10351F840k7412j001K851R984J2041P818o407j5262j4319Q631J8260K819m434
$$ 6840 -20572 -21573 -18722 -8738 3303 11121 4714 -10548 -24867 -16236 2024 4843 409
10338D09J35q548j2967M48Q040O945p98m453L663J4725n230r223K071o263n17
$$ 409 544 -8004 -20971 -20523 -12483 -5538 -6336 -10789 -7126 7599 2369 -6854 -4783 -11046 -11563
10323a1563P149L359M651J3860l489m072k738j7512N858J2726n953q90M022n280
$$ -11563 -4414 -1055 3596 17456 13967 9895 7157 -10355 -4497 8229 2276 1386 5408 128
10309A28J295p846R336O578O179K278j4504j1819o871J831J0005J7277p73o011
$$ 128 1423 -6423 2913 9491 15670 17948 3444 -8375 -15246 -13415 -3410 13867 13094 7083
10295G083N365o782J347R924j672q080q136l1O041q870r354M263k831Q987l492
$$ 7083 12448 5666 7013 16937 15265 7185 -951 -982 5059 -3811 -13165 -8902 -11733 -2746 -6238
10280f238J507L364j917n3k7j144O875L629l185R699Q959m900j7192j580L678
$$ -6238 -4731 -1367 -3284 -3337 -3364 -4508 2367 5996 2811 12510 21469 16569 -623 -2203 1475
10265A475o644p487q040j267R912N877R058q079J634o883R49q235q463k588J1719
$$ 1475 -5169 -12656 -20696 -21963 -12051 -6174 2884 -5195 -3561 -10444 -9495 -17730 -26193 -28781 -17062
10250a7062K0207M019o391j1006o04L302j0847L183j0023O42J6431m221N010o07
$$ -17062 3145 7164 773 -10233 -10837 -7535 -18382 -15199 -25222 -24580 -8149 -12370 -7360 -7967
10236g967J31J3774J7031J012r098j0559n193K19m929k717q806K994O339p080
$$ -7967 -7836 5938 22969 23981 14883 4324 -869 -650 -5579 -8296 -17102 -14108 -7769 -14849
10222a4849M903J735L487K791m613m869L088M173q098p518L959K093K313P643
$$ -14849 -9946 -8211 -4724 -1933 -6546 -11415 -8327 -4154 -12252 -19770 -15811 -13718 -11405 -3762
10208c762j2332n602J0414p633P432J0709Q957L431j6596l598J9816J2070l494
$$ -3762 -16094 -21696 -11282 -18915 -11483 -774 8183 11614 -4982 -8580 11236 23306 19812
10195A9812J488L569l079r913k0122n617Q47m826O325J063J845M699j991n459
$$ 19812 21300 24869 21790 11877 -8245 -13862 -13015 -17841 -11516 -10453 -8608 -3909 -5900 -11359
10181a1359K620m743j5510l085J5243J5495M212N36p692k219N559R390M396l188
$$ -11359 -8739 -13482 -28992 -32077 -16834 -1339 2873 3409 -4283 -6502 -943 8447 12843 9655
10167I655p947n149o292L569l815J731l302q38M498P372r337q709j67J4163K6342
$$ 9655 1708 -3441 -9733 -6164 -9979 -8248 -11550 -12388 -7890 -518 -9855 -18564 -18731 -4568 21774
10152B1774O272j6127j2325J2408p649p319l239N42p512P351L313l09R06o684
$$ 21774 28046 11919 -406 12002 4353 -2966 -6205 -5663 -13175 -5824 -2511 -2820 -1914 -8598
10138h598J0509M115l677J557m578R076J0262j3128j0848r6M916k648M454N896
$$ -8598 1911 6026 2349 3906 -672 8404 18666 5538 -5310 -5406 -490 -3138 1316 7212
10124G212J620K550j3176l413J0128L168M431M763J866j5423j3604m454O316O429
$$ 7212 8832 11382 -1794 -5207 4921 8089 12520 17283 19149 3726 -9878 -14332 -8016 -1587
10110a587N978r254K902j856j0080K441J3666M40j96j3259j98K227J0891J5388
$$ -1587 4391 -4863 -1961 -3817 -13897 -11456 2210 2650 2454 -10805 -11003 -8776 2115 17503
10096A7503j4919j3144l490L404L639J1051N062P39m533J579l887r961J145J926
$$ 17503 2584 -10560 -14050 -10646 -7007 4044 9106 9845 5312 6891 3004 -6957 -5812 -3886
10082c886K472k912j233O562Q401j0462r935l271k139j383J401J1842J025P269
$$ -3886 -1414 -4326 -5559 1003 9404 -1058 -10993 -14264 -16403 -17786 -16385 -4543 -3518 3751
10068C751p291j2333M833J0493K534O4o61J899j0270l010Q478N696N798p892K336
$$ 3751 -3540 -15873 -11040 -547 1987 2051 1390 3289 -6981 -9991 -1513 4183 9981 2089 4425
10053D425K547q929j0257j0110M330J2187Q63n739K858K954K687K723l745j1905
$$ 4425 6972 -1957 -12214 -22324 -17994 -5807 -4944 -10683 -7825 -4871 -2184 539 -3206 -15111
10039a5111J4535L723m70O762n343o189k013M171R232j1241O311Q458Q463J468
$$ -15111 -576 3147 2677 9439 4096 -2093 -4106 65 9297 -1944 4367 12825 21288 22756
10025B2756r971m814M150N923l012q483M173n42N800M613j52o830j3127P335l286
$$ 22756 12785 7971 12121 18044 15032 6549 10722 10180 15980 20593 20441 13611 484 7819 4533
10010D533n688r288j9595P180N603N542J4135j040k1101M962J1689J474k73K36
$$ 4533 -1155 -10443 -30038 -22858 -17255 -11713 2422 1382 -19719 -14757 -3068 -1594 -1867 -1631
9996a631p611J476n870J0062N621p160m819l072J4480J1192j631j2179j1270J0172
$$ -1631 -9242 -7766 -13636 -3574 2047 -5113 -9932 -13004 1476 12668 11037 -1142 -12412 -2240
9982b240J4366K208K814j69j872n332o493N22o61j735j403l363M106J2990j09
$$ -2240 12126 14334 17148 16979 15107 9775 3282 3804 3143 1408 5 -3358 748 13738 13629
9967A3629K611K399K286j3190k190M649L841m670j2565j2235j4826Q187J2303
$$ 13629 16240 18639 20925 7735 5545 10194 14035 9365 -3200 -15435 -30261 -22074 -9771
9954i771N247M440O973P345m730j7060q500L202Q848N288Q781j024j5489m4l398
$$ -9771 -4524 -84 6889 14234 9504 -7556 -16056 -12854 -4006 1282 10063 9039 -6450 -6494 -9892
9939i892L101J9634N735j3982j1565R443J044j0525p230q42K306m779K394p052
$$ -9892 -6791 12843 18578 4596 -6969 2474 3518 -7007 -14237 -15079 -12773 -17552 -15158 -22210
9925b2210P60J1322n98O265n584k094j656J0398m211o73j0568N444O227m335l91
$$ -22210 -21450 -10128 -10726 -4461 -10045 -12139 -13795 -3397 -7608 -8281 -18849 -13405 -7178 -11513 -11904
9910a1904k427j808L881J6275k883j2332N17l805r43m467J0806O006n131q258
$$ -11904 -14331 -16139 -12258 4017 1134 -11198 -10681 -14486 -15429 -19896 -9090 -3084 -8215 -16473
9896a6473l44L585O903R872l612p792m427K460J0639R75p242J4778P116q707r610
$$ -16473 -16817 -13232 -6329 3543 -69 -7861 -12288 -9828 811 1786 -5456 9322 16438 7731 -1879
9881a879O642K892k907L074j0546p533r890J5710J5694J0176Q836J466j3119j1913
$$ -1879 4763 7655 4748 7822 -2724 -10257 -20147 -4437 11257 21433 30269 31735 18616 6703
9867F703j3183N513L048j0182J841J1987K159j6436k273K242O532J4404k042j2498
$$ 6703 -6480 -967 2081 -8101 -6260 5727 7886 -8550 -10823 -8581 -2049 12355 10313 -2185
9853b185R37O543N069j466j170L382O42r203r733P314J3034R173n784j4906N755
$$ -2185 -1248 5295 10364 8898 7728 11110 11752 2549 -7184 130 13164 22337 16553 1647 7402
9838G402M815k731n134J390O024j160l949K945J3801k423j2162l351M380l805
$$ 7402 12217 9486 4352 5742 11766 10606 6657 9602 23403 20980 8818 5467 9847 6042
9824F042o083R577J0819j858r684j2657k757k762l24p114N758k533j3048p567
$$ 6042 -41 9536 20355 18497 8813 -3844 -6601 -9363 -9687 -16801 -11043 -13576 -26624 -34191
9810c4191J1534n110J815J7469J800M245j415k026l839M512p12Q411J1232L615
$$ -34191 -22657 -27767 -25952 -8483 -6683 -2438 -3853 -5879 -9718 -5206 -5918 2493 13725 17340
9796A7340O88k391N509o441j3505K746J5152M91j3585j2694n365O047J1008o732
$$ 17340 18028 15637 21146 14705 1200 3946 19098 19589 6004 -6690 -12055 -6008 5000 -1732
9782a732m358q267L475J1991P317l865p759J055O370L243j33r95M855J0397o950
$$ -1732 -6090 -14357 -10882 1109 8426 4561 -3198 -2143 4227 7470 7337 6342 11197 21594 14644
9767A4644j1682o241j0131L352P686J509M931n986l846P41k586j100K795J0039
$$ 14644 2962 -3279 -13410 -10058 -2372 -863 4068 -1918 -5764 -5023 -7609 -8709 -5914 4125
9753D125j8468q743J6258r44N133K693l8j342R874k842n713k260R29N624P300
$$ 4125 -14343 -23086 -6828 -7772 -2639 54 16 -1326 8548 5706 -7 -2267 -1338 4286 11586
9738A1586Q586R453j0223r538p370K54l239j1738j044P066m69o613M903k97K495
$$ 11586 20172 29625 19402 9864 2494 2748 -491 -12229 -13273 -6207 -6676 -13289 -8386 -8683 -6188
9723f188J9973k202q208R055k644j282J5714j038k3944m426P149P052K174j591
$$ -6188 13785 11583 3375 12430 9786 8504 24218 23180 -764 -5190 1959 9011 11185 9594
9709I594n725k9998n735K8187L201j7879n214K1225O641J52m335j2080J0040L473
$$ 9594 3869 -26129 -31864 -3677 -476 -18355 -23569 -2344 4297 4449 114 -11966 -1926 1547
9695A547R630L080k2077N79Q371m572M698J522Q080J9j8909j1508J36J3075J4236
$$ 1547 11177 14257 -7820 -7241 1130 -3442 1256 2778 10858 10877 -8032 -19540 -19404 -6329 7907
9680G907O309k901j2519m912O628k992q079m168k723j0263Q793J3606k274j8152
$$ 7907 14216 11315 -1204 -6116 512 -2480 -10559 -14727 -17450 -27713 -18920 -5314 -7588 -25740
9666b5740M162K1578M424l812m208L169P56k433K231R40n260p308R99L22K917
$$ -25740 -21578 0 4424 612 -3596 -427 329 -2104 127 1067 -4193 -11501 -10502 -10180 -7263
9651g263N886q98P48p2j309m691K048P212J582l35M407l998j3052k922N085l596
$$ -7263 -1377 -2275 -1527 -1599 -2908 -7599 -5551 1661 3243 2908 7315 3317 -9735 -12657 -7572 -11168
9635a1168M617j075j538l505J65j3931k763J0728J329M163J0947Q635j4453j1544
$$ -11168 -6551 -7626 -9164 -12669 -12504 -26435 -29198 -18470 -17141 -12978 -2031 6604 -7849 -19393
9621a9393P900n036l199K315N246O940R398J875j531Q09q12R084O913m567p204
$$ -19393 -11493 -16529 -19728 -17413 -12167 -5227 4171 6046 4515 5324 4512 13596 20509 15942 8738
9606H738m434r626l920P999M830J8756l611j4491o959M682K898Q767M888j4023
$$ 8738 4304 -5322 -9242 -1243 3587 22343 18732 4241 -2718 1964 4862 13629 18517 4494
9592D494j2715K937J7885j524j3994M17n059k989l385N803N354m734p326j0976
$$ 4494 -8221 -5284 12601 11077 -2917 -2500 -7559 -10548 -13933 -8130 -2776 -7510 -14836 -25812
9578b5812J508J1254J7352j0970N816K412j0094K991N494j818M534j903N594L128
$$ -25812 -24304 -13050 4302 -6668 -852 1560 -8534 -5543 -49 -1867 2667 764 6358 9486
9564I486l680r000k571n541K146P38J244Q945r60r95J0719L606p250l288o352
$$ 9486 5806 -3194 -5765 -11306 -9160 -8422 -7178 1767 807 -188 10531 14137 6887 3599 -2753
9549b753j0565J0333P000J1652K04o688j0776j0592j449L338j622L726l235J4952
$$ -2753 -13318 -2985 4015 15667 15871 9183 -1593 -12185 -13634 -10296 -11918 -8192 -11427 3525
9535C525Q69j736k632p615k155p298r710K167P804O313K784k679j3927K832J2244
$$ 3525 4394 2658 26 -7589 -9744 -17042 -26752 -24585 -16781 -10468 -7684 -10363 -24290 -21458 -9214
9520i214l564k216k47O146J2428P77j691P915j3528q356L56P223J0348J0425j0367
$$ -9214 -12778 -14994 -15241 -9095 3333 4110 2419 10334 -3194 -11550 -11194 -3971 6377 16802 6435
9505F435l849O175R61r893j4152M168O238j440M526M054j1314o065r603P848J3421
$$ 6435 2586 8761 9722 -171 -14323 -10155 -3917 -5357 -831 3223 -8091 -14156 -23759 -15911 -2490
9490b490l106j8414n65K351q83J6610J1828K096Q46n44q303N058O681o569O25
$$ -2490 -5596 -24010 -24575 -22224 -23107 -6497 5331 7427 8273 7729 -574 4484 11165 4596 5221
9475E221R283K56j2865o281L6J130P946n96Q571K675K207n380k509j37k748M718
$$ 5221 14504 14760 1895 -4386 -4350 -3220 4726 4130 12701 15376 17583 12203 9694 9557 6809 11527
9459A1527p388l864J2995Q623n761j414m361j4162j0690O966K2171Q347j3468
$$ 11527 4139 275 13270 21893 16132 14718 10357 -3805 -14495 -7529 14642 22989 9521
9446I521l46O814r4M632k693j4649k306n625N99O077J1704l040j566N899r129
$$ 9521 9175 15989 15895 20527 17834 3185 879 -4746 -4147 1930 13634 10594 9028 14927 5798
9431E798o53q888j0466r79k330N986J0318J532J0395o202q869l44p232m199P983
$$ 5798 5145 -3743 -14209 -15188 -17518 -11532 -1214 318 10713 4511 -4358 -4702 -11934 -16133 -8150
9416h150M939r696Q572J812j051J791q602J8145p680j0733O964p810J3716O311
$$ -8150 -3211 -12907 -4335 -2523 -3574 -1783 -10385 7760 80 -10653 -3689 -11499 2217 8528
9402H528P782n262j8133K903K113R793k052m050j8663m630L995J0860L512N376
$$ 8528 16310 11048 -7085 -4182 -2069 7724 5672 1622 -17041 -21671 -17676 -6816 -3304 2072
9388B072l054k806o90Q18m426j2070j367J2729J8497M978L52K035j149r799r553
$$ 2072 -982 -3788 -4478 -3660 -8086 -20156 -21523 -8794 9703 14681 15033 17068 15919 6120 -3433
9373c433j1336j0416j72J6608J370K107j918p540n972J5938k691l972O57O939
$$ -3433 -14769 -25185 -25357 -8749 -7379 -5272 -7190 -14730 -20702 -4764 -7455 -11427 -10770 -3831
9359c831j102J455m38l718l660m542k364P721K393R429Q247l73n556p868N077
$$ -3831 -4933 -3478 -3916 -7634 -11294 -15836 -18200 -10479 -8086 1343 9590 9217 3661 -4207 870
9344H70N104j5287j856R656Q462J449M23n845Q064O582P4M44N238N700j0538j0779
$$ 870 5974 -9313 -11169 -1513 6949 8398 8821 2976 11040 17622 17696 18140 23378 29078 18540 7761
9328G761j4000j1573M172P965N885N469J1544o152p284M68j159n902k176M017
$$ 7761 -6239 -17812 -13640 -5675 210 5679 17223 11071 3787 4255 3096 -2806 -4982 -965
9314i65P691q44m688j183K640o407o827M528J2379j061j3590O42P03J3581J1532
$$ -965 6726 5882 1194 11 2651 -3756 -10583 -6055 6324 5263 -8327 -7685 -6982 6599 18131
9299A8131l924R92L637j788n168k366l173M425R26J08q511q750k927J5391J5364
$$ 18131 14207 15199 18836 17048 11880 9514 6341 10766 11692 11800 3289 -5461 -8388 7003 22367
9284B2367P788k515p065r770K533k406j856k109N346K127K848J3918j305j2839
$$ 22367 30155 27640 20575 10805 13338 10932 9076 6967 12313 14440 17288 31206 29901 17062
9270A7062r97j2208m160j094M182J3150Q231N905j7717j2129J7385N459j1719
$$ 17062 16065 3857 -303 -1397 2785 15935 24166 30071 12354 225 17610 23069 11350
9257A1350n412k658J3411l679Q347M882q993P00J9670J0063p236r871J634N279
$$ 11350 5938 3280 16691 13012 21359 26241 17248 17948 37618 47681 40445 30574 32208 37487
9243C7487j592m100n504q193R672J4594O733N799K5788kj9941j2580O008N922
$$ 37487 35895 31795 26291 18098 27770 42364 49097 54896 80684 80682 60741 48161 54169 60091
9229F0091J2706L392L720l21J7054K1806K2667P470K4298M4598M5773L8680N4351
$$ 60091 72797 76189 79909 79588 96642 118448 141115 148585 172883 217481 263254 301934 356285
9216C56285Q2592J14253J64878K48706L71727M90823N60459M32042J66694l6372
$$ 356285 438877 553130 718008 966714 1338441 1829264 2389723 2821765 2988459 2952087
9206B952087k77588n13295n22303m03268k70520j72999j32321j01495p4372n3269
$$ 2952087 2674499 2161204 1638901 1235633 965113 792114 659793 558298 483926 430657
9196D30657l8270l8523l1565l8686k5786j4285j6893q274j3384j3382p184o026
$$ 430657 392387 353864 322299 283613 257827 243542 226649 218375 204991 191609 184425 178399
9184A78399j3886j4049p541m967m331n486N379K499P2R96R219q253j5672o208
$$ 178399 164513 150464 142923 137956 133625 128139 133518 136017 136089 137085 146304 138051 122379 116171
9170A16171L884k082k3195j1910N062n608K986J1796n266m663K055k455M140l240
$$ 116171 120055 117973 94778 82868 87930 82322 85308 97104 91838 87175 89230 86775 90915 87675
9156H7675n131k129n260P91M524J7307j49J0739M725k6126j5499k9M59Q20k238
$$ 87675 82544 80415 75155 75946 80470 97777 97628 108367 113092 86966 71467 71438 71897 72717 70479
9141G0479j432J0879N312l24l903j651q262r241M222L705K983p647P57n0L204
$$ 70479 69047 79926 85238 84914 81011 79360 71098 61857 66079 69784 72767 65120 65877 65827 69031
9126F9031l191l939o592p121N51N195m280j3256J1381J912N657P48l161l393M121
$$ 69031 65840 61901 55309 48188 48739 53934 49654 36398 47779 49691 55348 56096 52935 49542 53663
9111E3663j1776j4805p338o79m928o77R567J9035o555m611m293j341l233N089
$$ 53663 41887 27082 19744 19065 14137 13460 23027 42062 35507 30896 26603 25262 22029 27118
9097B7118l571P233K696M553j2605L91M102Q950j362r829l749O68n194l517o119
$$ 27118 23547 30780 33476 38029 25424 25815 29917 38867 37505 27676 23927 24595 19401 15884 9765
9082I765J0926j2280L69N753r326K916N134p17R766p801j0681O218J1999L824
$$ 9765 20691 8411 8780 14533 5207 8123 13257 12540 22306 14505 3824 10042 22041 25865
9068B5865J1005r239r696m824J4102p359p117R653m319n502q423m228j910Q652
$$ 25865 36870 27631 17935 13111 27213 19854 12737 22390 18071 12569 4146 -82 -1992 6660
9054F660R558m119K29O822m125m114K280J436j5055J711J261R920J204m773K752
$$ 6660 16218 12099 12328 19150 15025 10911 13191 14627 -428 1283 2544 12464 13668 8895 11647
9039A1647m280m501J7782P615k1916n354J163K194q186L108O00K359K534j863
$$ 11647 7367 2866 20648 28263 6347 993 2156 4350 -3836 -728 -128 2231 4765 2902
9025B902m444j623J0173Q449J697n87l390P460p562Q45l848n741K773J1373N423
$$ 2902 -1542 -3165 7008 15457 17154 16567 13177 20637 13075 13920 10072 4331 7104 18477 23900
9010B3900j2763q946r91m4o981P467O321M816P785Q530R01j1454j2349p212Q770
$$ 23900 11137 2191 1200 1156 -5825 1642 7963 12779 20564 29094 29995 18541 6192 -1020 7750
8995G750m834j2028m249R951m139n36P030J493j838q031Q17n55K194Q080Q076
$$ 7750 2916 -9112 -13361 -3410 -7549 -8085 -1055 438 -1400 -9431 -8614 -9169 -6975 1105 9181
8980I181P578q927l912m73q217K020M086j187l412O362j160M097L939Q26P038
$$ 9181 16759 7832 3920 3447 -4770 -2750 1336 149 -3263 3099 1939 6036 9975 10801 17839
8965A7839J1458L601j4116l072o810q792l303m410M085K792l703K660N486J969
$$ 17839 29297 32898 18782 15710 8900 108 -3195 -7605 -3520 -728 -4431 -1771 3715 5684
8951E684N130m520l639J1557N651j172L597P093p54j2484j4657j0119K703O017
$$ 5684 10814 6294 2655 14212 19863 18691 22288 29381 28627 16143 1486 -8633 -5930 87
8937H7o761r716o97R673J3051J353l411J0677J1774k762j353k814k14K918J858
$$ 87 -6674 -16390 -17087 -7414 5637 6990 3579 14256 26030 23268 21915 19101 18887 21805 23663
8922B3663j7019J270P663q216n829k401l67k898j97j3061j3067J2393J5637J0918
$$ 23663 6644 7914 15577 7361 1532 -869 -1236 -4134 -4331 -17392 -30459 -18066 -2429 8489
8908H489p950j37L190J758j243L647j430j0083l947K0043J0750j7471j9214r127
$$ 8489 539 402 3592 5350 4107 7754 6324 -3759 -7706 12337 23087 5616 -13598 -22725
8894b2725J0268N605j1464J660J1456K2159Q081j3609P697J4199N856l831jj8606
$$ -22725 -12457 -6852 -18316 -16656 -5200 16959 25040 11431 19128 33327 39183 35352 35351 16745
8880A6745j917P88P639p925K062o394j1873O756K525j419q745j144P879J2715
$$ 16745 14828 15616 23255 15330 17392 10998 -875 5881 8406 6987 -1758 -2902 4977 17692
8866A7692L032o323o591l796M815N640m857k862j0886j5374N752K0614O424q31
$$ 17692 20724 14401 7810 4014 8829 14469 9612 6750 -4136 -19510 -13758 6856 13280 12449
8852A2449K362K545p768q218M45J637m95N836K621j2063M613K1125J6799O434
$$ 12449 14811 17356 9588 1370 1815 3452 2957 8793 11414 -649 3964 25089 41888 48322
8838D8322J4552R558J5638O939k1488k4643j0054n865r101j5360P772Q886K609
$$ 48322 62874 72432 88070 95009 73521 48878 38824 32959 23858 8498 16270 25156 27765
8825B7765j952r323j6169j722K727K342O314P357o433p448j354k074K392n810
$$ 27765 25813 16490 321 -1401 1326 3668 9982 17339 10906 3458 2104 30 2422 -3388
8811c388n29J61m507K463J5697J432o370j3881p82l50J796K313P103Q780k986
$$ -3388 -3917 -3756 -8263 -5800 9897 11329 4959 -8922 -9704 -10054 -8258 -5945 1158 9938 6952
8796F952L892L618R467n841j1211J7098Q961l704j259j242j9973j0021N127J1978
$$ 6952 10844 14462 23929 18088 6877 23975 32936 29232 27973 26731 6758 -3263 1864 13842
8782A3842M745l537j3548j288j0729P389R691k941l465J1647K263m789j0206l928
$$ 13842 18587 15050 1502 214 -10515 -3126 6565 3624 159 11806 14069 9280 -926 -4854
8768d854J842K951M840o949m447K31M824Q092q550j6708O252K061m846J2281q330
$$ -4854 -3012 -61 4779 -2170 -6617 -6386 -1562 6530 -2020 -18728 -12476 -10415 -15261 -2980 -11310
8753a1310P54N819J35n037k642R016J1035M311O150l550k298k612q752l106O548
$$ -11310 -10556 -4737 -4602 -9639 -12281 -3265 7770 12081 18231 14681 12383 9771 1019 -2087 4461
8738D461l458K495M79l372j5001l944J5097M24L461J977j438J113N952K57O884
$$ 4461 1003 3498 3977 605 -14396 -18340 -3243 -2819 642 2619 1181 2294 8246 8503 15387
8723A5387L438n368j0863N678l99k368o131l031j262Q891k59j0942m18M148J0953
$$ 15387 18825 13457 2594 8272 7873 5505 -626 -3657 -4919 3972 3713 -7229 -7647 -3499 7454
8708G454M410K763o385r029l175j608l362O88k640N12N193N791J4322p0j0238
$$ 7454 11864 14627 8242 -787 -3962 -5570 -8932 -8244 -10884 -10372 -5179 612 14934 14864 4626
8693D626J4636J0468m990o588j0397l167p639l505p248K198Q756K018J2159J116
$$ 4626 19262 29730 24740 18152 7755 4588 -3051 -6556 -13804 -11606 -2850 -832 11327 12443
8679A2443O864L388l328j1371j3083Q01R975L146o868n817j918P408O894Q333
$$ 12443 19307 22695 19367 7996 -5087 -4286 5689 8835 1967 -3850 -5768 1640 8534 16867
8665A6867p746j0019L687K926q039r09k550L496l429m731K227R906k928k673M961
$$ 16867 9121 -898 2789 5715 -2324 -3233 -5783 -2287 -5716 -10447 -8220 1686 -1242 -3915 1046
8650A046N154O204O565j3505K694Q021j293j69l554o81P167k97j0808r511O260
$$ 1046 6200 12404 18969 5464 8158 16179 14886 14717 11163 10482 17649 17352 6544 -2967 3293
8635C293j314j973k463j1145J375j20O302Q290J0506P985J5j922j0656n416k487
$$ 3293 1979 6 -2457 -13602 -12227 -12347 -6045 2245 12751 20736 20751 18829 8173 2757 270
8620B70J3685J5263r5p956M885j8812j3208J1207L67J618j438J1101J884k945
$$ 270 13955 29218 29123 21167 26052 7240 -5968 5239 5606 7224 5786 16887 18771 15826
8606A5826n980P256L959P51L88m116M938j411o778n282M063J3863J6041O730j1519
$$ 15826 9846 17102 21061 21812 22200 18084 23022 21611 14833 9551 13614 27477 43518 50248 38729
8591C8729j7860O449k58r080M516L543K698O660O755k499j577n654r379n7O707
$$ 38729 20869 27318 27060 17980 22496 26039 28737 35397 42152 39653 38076 32422 23043 22986 29693
8576B9693q23l188r453O351P41o483M034q235l304O288Q171L584j4464k768P410
$$ 29693 28870 25682 16229 22580 23321 16838 20872 12637 9333 15621 23792 27376 12912 10144 17554
8561A7554M402j494L031l8N505o168r284R76n716M545o035m641N187J0104n465
$$ 17554 21956 20462 23493 23455 28960 22792 13508 14484 8768 13313 7278 2637 7824 17928 12463
8546A2463O66R692p963k886k21J934J2573R807j4968j2653p182j9853q504k052
$$ 12463 13129 22821 14858 11972 11751 13685 26258 36065 21097 8444 1262 -18591 -27095 -29147
8532b9147k78J650J1181L595j916K920J060J3355N000O548M216J1691o476j4016
$$ -29147 -29425 -27775 -16594 -12999 -14915 -11995 -10935 2420 7420 13968 18184 29875 23399 9383
8518I383n164Q168L250K633j8866K503J2761k132r133n27P807K307N386q441k1742
$$ 9383 4219 12387 15637 18270 -596 1907 14668 12536 3403 2876 10683 12990 18376 9935 -11807
8503a1807o215J5874K061p589K310P867J0643q81p668l566O186J1907p82j6140
$$ -11807 -18022 -2148 -87 -7676 -5366 2501 13144 12263 4595 1029 7215 19122 18340 2200
8489B200j0733N435J549j1394j036J0287J0037M795K48q301j9417K284J0717L620
$$ 2200 -8533 -3098 -1549 -12943 -13979 -3692 6345 11140 11388 3087 -16330 -14046 -3329 291
8475B91m687M101J2255N992n49O856m278j4695p124Q404J1572Q01j7453j2831
$$ 291 -4396 -295 11960 17952 17403 24259 19981 5286 -1838 6566 18138 18939 1486 -11345
8461a1345R20n466N821R375L270p94m383J80m753p383J4731J1793M122m503o528
$$ -11345 -10425 -15891 -10070 -695 2575 1781 -2602 -2422 -7175 -14558 173 11966 16088 11585 5057
8446E057M93k617j428M13J051j027o030m358J7019J0506J622q190k992n414q24
$$ 5057 5550 2933 1505 1918 2969 1942 -4088 -8446 8573 19079 20701 12511 9519 4105 3281
8431C281Q211l642L597o272j5173J5658P187j0604j2026q219L080M921J8409J1965
$$ 3281 11492 7850 11447 5175 -9998 5660 12847 2243 -9783 -18002 -14922 -10001 8408 20373
8417B0373k723n89m882K861L371q749p901M384K670m158L083n478j2676N96J2849
$$ 20373 17650 17061 12179 15040 18411 9662 1761 6145 8815 4657 7740 2262 -10414 -9818 3031
8402C031L009q096l466l974k013J0818K20J978M985k235p986o78M891j341m892
$$ 3031 6040 -2056 -5522 -9496 -11509 -691 -471 1507 6492 4257 -3729 -4407 484 -857 -5749
8387e749K723q252j209J4085M787Q175J0071k975j8228o029M502J502P708j310
$$ -5749 -3026 -11278 -12487 1598 6385 14560 24631 21656 3428 -2601 1901 3403 11111 9801
8373I801p961m644P67Q912n364P501M117j3317j5864K014J0220L748K612P156
$$ 9801 1840 -2804 -2037 6875 1511 9012 13129 -188 -16052 -14038 -3818 -70 2542 9698
8359I698K588n476L770P910j2829k331j6768O473O379p127l001l855J7963M590
$$ 9698 12286 6810 10580 18490 5661 3330 -13438 -6965 -586 -7713 -10714 -14569 3394 7984
8345G984r266L153M318K83l893o88Q22K409K053r96l577j41P460L110o735k766
$$ 7984 -1282 1871 6189 6472 2579 1891 2713 5122 7175 6179 2602 2461 9921 13031 6296 3530
8329C530P824m434N292R24J909k996j7506o020J7686M782p489L324n593j1659
$$ 3530 11354 6920 12212 13136 15045 12049 -5457 -11477 6209 10991 3502 6826 1233 -10426
8315a0426l261n55J3590L285r513O638P938m284n321P267m276j7259l064P328
$$ -10426 -13687 -14242 -652 2633 -6880 -242 7696 3412 -1909 5358 1082 -16177 -19241 -11913
8301a1913O033K269K486J4641j3473j3974J929J5749O448J1867N330k818n377
$$ -11913 -5880 -3611 -1125 13516 43 -13931 -12002 3747 10195 22062 27392 24574 19197
8288A9197j2534k1644J158K484k66K80J1743J840k384P0j5012K878J3190Q421
$$ 19197 6663 -14981 -13823 -11339 -11605 -11325 418 2258 -126 -56 -15068 -12190 1000 9421
8274I421O578k0578q671J7087l415o520n889J0689J1791l902o930n158Q27o47
$$ 9421 15999 -4579 -13250 3837 422 -6098 -11987 -1298 10493 6591 -339 -5497 -4670 -5317
8260e317O695Q513M31j4214r125J418J0969J0524k861p895n485q490O563J1039
$$ -5317 1378 9891 10322 -3892 -13017 -11599 -630 9894 7033 -862 -6347 -14837 -8274 2765
8246B765K91J585K167Q86m164q195j0604j32O590J4666K486n716n574J9718N27
$$ 2765 3056 4641 6808 7694 3530 -4665 -15269 -15401 -8811 5855 8341 2625 -2949 16769 17296
8231A7296j0284j0096j0760j145L544L136M32k127m470M674J2614O560k138j0035
$$ 17296 7012 -3084 -13844 -14989 -11445 -8309 -7877 -10004 -14474 -9800 2814 9374 7236 -2799
8217b799q562J8857J479j1296j379M95m724n410P588J2315j0316m810J2780j2113
$$ -2799 -11361 7496 8975 -2321 -3700 -3205 -7929 -13339 -5751 6564 -3752 -8562 4218 -7895
8203g895n522L762J2204K741j484K774l181N801O491n171p360N506R82l847m859
$$ -7895 -13417 -9655 2549 5290 3806 6580 3399 9200 15691 10520 3160 8666 9648 5801 942
8188I42O803j759J305j2847J311Q488J29n246L30L551O428N117q034Q815r387
$$ 942 7745 5986 7291 -5556 -4245 4243 4372 -874 -544 3007 9435 14552 6518 15333 5946
8173E946j8435k890k163K010J8969J0063Q331q53j8922J519O156n808j568K470
$$ 5946 -12489 -15379 -17542 -15532 3437 13500 21831 20978 2056 3575 9731 3923 2355 4825
8159D825j2229m338P551K494o22M877L527j5438M761J3326J2808l465j5286j3583
$$ 4825 -7404 -11742 -4191 -1697 -2319 2558 6085 -9353 -4592 8734 21542 18077 2791 -10792
8145a0792k099J5042J2631K539l355l222j5137j4007J958M939M389J5050J0713
$$ -10792 -12891 2151 14782 17321 13966 10744 -4393 -18400 -16442 -11503 -7114 7936 18649
8132A8649j74K855J0254J5003P492r412j6457k0777j855J802n512J438J0139J4002
$$ 18649 18475 21330 31584 46587 54079 44667 28210 7433 5578 7380 1868 3306 13445 27447
8118B7447j4611j1035K684o44k002M797Q710J4444q76j3884r445J079P885l049
$$ 27447 12836 1801 4485 3841 1839 6636 15346 29790 28914 15030 5585 6664 14549 11500
8104A1500r695O92m42O431J3098L558n825j2491r791o667J0231Q87R886J5364
$$ 11500 1805 2497 2055 8486 21584 25142 19317 6826 -2965 -9632 599 1486 11372 26736
8090B6736Q527R699j324M936J1544p992k2314j1742j9045j2448j798M13M475J0163
$$ 26736 35263 44962 43638 48574 60118 52126 29812 18070 -975 -13423 -15221 -14808 -10333 -170
8076a70N743M691j2383q553K743O756O265K83J2566m889O955K130j0391Q60o565
$$ -170 5573 10264 -2119 -10672 -7929 -1173 5092 5375 17941 13052 20007 22137 11746 12606 6041
8061F041O06N536K52O630l622p659J3747L437j2592L506k640j372m801j226R05
$$ 6041 6647 12183 12435 19065 15443 7784 21531 24968 12376 15882 13242 11870 7069 5843 6748
8046F748k2663j0176M653m94j55P736K0486J0395n340q62n876M481m448J163j504
$$ 6748 -15915 -26091 -21438 -21932 -22087 -14351 6135 16530 11190 10328 4452 8933 4485 5648 4144
8031D144R642k651j7743k669j339o52L296R95m570K317J979J1285q36k850n19
$$ 4144 13786 11135 -6608 -9277 -10616 -11268 -7972 -6977 -11547 -9230 -7251 4034 3198 348 -171
8016a71o602J4209J0217M77L455L589o734J141k273m689N21m984P607M403r26
$$ -171 -6773 7436 17653 18130 21585 25174 18440 19581 17308 12619 13140 8156 15763 20166 19240
8001A9240J0059j258k623J3373K775J449k552O06n216q850l610r210q349L386
$$ 19240 29299 28041 25418 38791 41566 43015 40463 41069 35853 27003 23393 14183 5834 9220
7987I220r60k389M778L679n447Q05R340J1036J1933R177k99q164n741R553l64
$$ 9220 8260 5871 10649 14328 8881 9686 19026 30062 41995 51172 50873 42709 36968 46521 46157
7972D6157O326k618l06L771J4612N182J5226m51j243o72j1961k567k772j6483
$$ 46157 52483 49865 49559 53330 67942 73124 88350 87899 86656 85984 74023 71456 68684 52201
7958E2201j0228o320j121l775j4227O38J2382p646n422K74L740M720P67N905M2
$$ 52201 41973 35653 34532 30757 16530 17168 29550 21904 16482 16756 20496 25216 25983 31888 31930
7943C1930j328j017j463L352m351J75L311Q616R447J5887L474O245K384K875N69
$$ 31930 30602 29585 28122 31474 27123 27298 30609 39225 48672 64559 68033 74278 76662 79537 80106
7928H0106r924L836o074J4216O793n260j232k80j3902j2703j0120j7342j2153
$$ 80106 70182 74018 67944 82160 88953 83693 82461 82181 68279 55576 45456 28114 15961
7915A5961p953m013J3312J1882r81o526k249K711j717K150o636n804K185L653
$$ 15961 8008 3995 17307 29189 28208 21682 19433 22144 20427 22577 15941 10137 12322 15975
7901A5975L049j16N222j279k481j203P506J6717j528o382l901k509n61P204j546
$$ 15975 19024 18908 24130 22851 20370 19167 26673 43390 41862 35480 31579 29070 28509 35713 34167
7886C4167r064J841r864k454k284L166N556m847J7864L387k1303k1165k332R37
$$ 34167 25103 26944 17080 14626 12342 15508 21064 16217 34081 37468 16165 -5000 -7332 -6395
7872f395k635o777P519J6816K061J1042l237m666Q426r342J828J0780j0026j5546
$$ -6395 -9030 -15807 -8288 8528 10589 21631 18394 13728 22154 12812 14640 25420 15394 -152
7858a52J608p324J1405P026O29J168k760P350P544j0399j1599o558o897o043j967
$$ -152 1456 -5868 5537 12563 13192 14360 11600 18950 26494 16095 4496 -2062 -8959 -15002 -16969
7843a6969J1244L783Q886l16j8331j5961K587o96k730J9292K600j044L210N970
$$ -16969 -5725 -1942 6944 6628 -11703 -27664 -25077 -25773 -28503 -9211 -6611 -7655 -4445 1525
7829A525Q212m396j963j711m743l529R170L497m762l314M055N448l083p516n342
$$ 1525 9737 5341 3378 1667 -3076 -6605 2565 6062 1300 -2014 2041 7489 4406 -3110 -8452
7814h452R09r94K853r50M05q682m340J3204J0397L943R65J487p090j0459k272
$$ -8452 -7543 -8537 -5684 -6634 -6229 -14911 -19251 -6047 4350 8293 9258 10745 3655 -6804 -9076
7799i076m987L196J617j291J62N539J1780p785j74p863N55l838K157J622m611
$$ -9076 -14063 -10867 -9250 -10541 -10379 -4840 6940 -845 -1019 -8882 -8327 -12165 -10008 -8386 -12997
7784a2997M172M174k828j923m146N510N23Q599M684K471q845l086L687l06J21
$$ -12997 -8825 -4651 -7479 -9402 -13548 -8038 -7515 1084 5768 8239 -606 -3692 -5 -311 -190
7769a90L105N225m332j286L65l916j005k724r7R936k178M33q212k513O480L784
$$ -190 2915 8140 3808 2522 2887 -1029 -2034 -4758 -4855 5081 2903 3336 -4876 -7389 -909 2875
7753B875M018K372m32m169Q93j420L160l533N489K14j0704o993J319n949N736
$$ 2875 6893 9265 8833 4664 5557 4137 7297 3764 9253 9467 -1237 -8230 -6911 -12860 -7124
7738g124J0130n117m069p747J3098J593n012l737M861j694J025P357j5811L401
$$ -7124 3006 -2111 -6180 -13927 -829 764 -4248 -7985 -3124 -4818 -3793 3564 -12247 -8846
7724h846l244N335J4463R307n707j0237K027l941p460j2806N131r05k189p555
$$ -8846 -12090 -6755 7708 17015 11308 1071 3098 -843 -8303 -21109 -15978 -16883 -19072 -26627
7710b6627o12Q712K94J1022j007J011L896l725r848Q028J0809K837j30P092L955
$$ -26627 -27239 -18527 -18233 -7211 -8218 -7207 -3311 -7036 -16884 -8856 1953 4790 4660 11752 15707
7695A5707j229k659O870J0896p853j2359R89k931l958l834N523o32j2963j618
$$ 15707 14478 11819 18689 29585 21732 9373 10362 7431 3473 -361 5162 4530 -8433 -10051
7681a0051j2710j1151O039K1809O82L063J9954j2695j4017M627M650J32q260O64
$$ -10051 -22761 -33912 -27873 -6064 -5382 -2319 17635 4940 -9077 -4450 200 332 -7928 -7264
7667g264Q041p520j16m946k753N835j0450N067Q699P559J153J841O981o756M477
$$ -7264 777 -6743 -6859 -11805 -14558 -8723 -19173 -14106 -5407 2152 3305 5146 12127 5371 9848
7652I848N096N796r444k335j1994j627J342M860Q640R315j4738j3783l929p39
$$ 9848 14944 20740 11296 8961 -3033 -4660 -3318 1542 10182 19497 4759 -9024 -12953 -13692
7638a3692R72M008J2468m731N48L682K996M328M437r996o603m854K800N9o189
$$ -13692 -12720 -8712 3756 -975 -427 3255 6251 10579 15016 5020 -1583 -6437 -3637 -3578 -9767
7623i767K749O614K444q112j119M710P442J997M723L908j6606j0742M827j237
$$ -9767 -7018 -404 2040 -6072 -7191 -2481 4961 6958 11681 15589 -1017 -11759 -6932 -8169
7609h169L292J0119k333p311L756R278p155j168m580q740J939J6111J5502M391
$$ -8169 -4877 5242 2909 -4402 -646 8632 1477 309 -4271 -13011 -11072 5039 20541 24932
7595B4932j7922q706J3687K2383q818j9930r445J4015j182r455R325M947l387
$$ 24932 7010 -1696 11991 34374 25556 5626 -3819 10196 9014 -441 8884 13831 10444
7582A0444j265l611n144q556j2977l857J0432P026P235j5076k718k819N744J8547
$$ 10444 9179 5568 424 -8132 -21109 -24966 -14534 -7508 -273 -15349 -18067 -20886 -15142 3405
7568C405O233m253p270R73m222J752O317L760J834K333j2964q137L756j842K011
$$ 3405 9638 5385 -1885 -912 -5134 -3382 2935 6695 8529 10862 -2102 -10239 -6483 -8325 -6314
7553f314P477J1428j2836o937L440M857l949n77M266j700q637o422J346L995P942
$$ -6314 1163 12591 -245 -7182 -3742 1115 -2834 -3411 855 -845 -9482 -15904 -14558 -10563 -2621
7538b621J2952K866Q642m550o198j076r52j815n718l75J1652j7977q403k142q094
$$ -2621 10331 13197 21839 17289 11091 10015 9063 7248 1530 1155 12807 -5170 -13573 -15715 -23809
7523b3809n305J1855Q110J2696p044k679N37L205m948n941O995K758L92J1076
$$ -23809 -29114 -17259 -9149 3547 -3497 -6176 -5639 -2434 -7382 -13323 -6328 -3570 -3178 7898
7509G898r199L987P513n927M212J7118k1439n220R231n899k317P542r12l503p149
$$ 7898 -1301 2686 10199 4272 8484 25602 4163 -1057 8174 2275 -42 7500 6588 3085 -4064
7494d064p01N209J310k973o516j0601k606Q22N052l37p465J8459K0284j552j1717
$$ -4064 -4765 444 1754 -1219 -7735 -18336 -20942 -20120 -15068 -15405 -22870 -4411 15873 14321 2604
7479B604j523O099o778m841p570o507j0635n021m400P487Q109Q26J764M851J2266
$$ 2604 1081 7180 402 -4439 -12009 -18516 -29151 -34172 -38572 -31085 -22976 -22150 -20386 -15535 -3269
7464c269J0414J16j203R479O689n187N451J192n786n963q984m173k829M167Q687
$$ -3269 7145 7261 6058 15537 22226 17039 22490 23682 17896 11933 2949 -1224 -4053 114 8801
7449H801M85j1371q203K656j665N285r274Q306K403n511L806j2156N626K407o18
$$ 8801 9286 -2085 -10288 -7632 -9297 -4012 -13286 -4980 -2577 -8088 -4282 -16438 -10812 -8405 -9023
7434i023o49J0347n454p487L799Q026j6972j5267J3966N197k72K0603K581l178
$$ -9023 -9672 675 -4779 -12266 -8467 -441 -17413 -32680 -18714 -13517 -13789 6814 9395 6217
7420F217O686P967q372n751k358p501j756K736Q34l14L961L555M662n676J142
$$ 6217 12903 20870 12498 6747 4389 -3112 -4868 -2132 -1298 -1612 2349 5904 10566 4890 6032
7405F032P362j6850l666L273J236N23m031k264n464j473k350L579J2062J7811
$$ 6032 13394 -3456 -7122 -3849 -2613 -2090 -6121 -8385 -13849 -15322 -17672 -14093 -2031 15780
7391A5780N801j2306k175N321M030R57j1438l720J162j722j1299O740L615j025
$$ 15780 21581 9275 7100 12421 16451 17408 5970 2250 3412 1690 -9609 -2869 746 -279
7377b79M248L852N379J747n33n686M350J4475r009j8503L127P932k080j3385j523
$$ -279 3969 7821 13200 14947 14414 8728 13078 27553 18544 41 3168 11100 9020 -4365 -5888
7362e888l781k563J525j578M309M298L402Q113L363J078q393j915r548N039R923
$$ -5888 -9669 -12232 -10707 -12285 -7976 -3678 -276 7837 11200 12278 3885 1970 -7578 -2539 7384
7347G384O336j517N365m822J308r61j0915o993m791k6766K589J3666J4240O900
$$ 7384 13720 12203 17568 12746 14054 13093 2178 -4815 -9606 -36372 -33783 -20117 -5877 1023
7333A023j1254J0109J139j1737o850j259R332M897K549M560m761K560O401n732
$$ 1023 -10231 -122 1017 -10720 -17570 -18829 -9497 -4600 -2051 2509 -2252 308 6709 977
7319I77k490m381j4609n036k402J4110J1992k981R173L681j0028J994k505N928
$$ 977 -1513 -5894 -20503 -25539 -27941 -13831 -1839 -4820 4353 8034 -1994 0 -2505 3423
7305C423J2444O29r429k0537L798Q592N944k727o058M366M178k763P128r24N847
$$ 3423 15867 16496 7067 -13470 -9672 -1080 4864 2137 -3921 445 4623 1860 8988 8064 13911
7290A3911J0061o485m687k149o018l726L834o054P669J321n086n571m406k533
$$ 13911 23972 17487 12800 10651 4633 907 4741 -1313 6356 7677 2591 -2980 -7386 -9919
7276i919L807P79J267NQ537Q562p668j1175j2033l755O152L291o14K513J588N119
$$ -9919 -6112 -5333 -4066 -4061 4476 13038 5370 -5805 -17838 -21593 -15441 -12150 -12764 -10251 -8663 -3544
7260c544j876K008r397J956j37K063N90p033N150j226o012r593M087N131J0659
$$ -3544 -5420 -3412 -12809 -10853 -10990 -8927 -8337 -15370 -10220 -11446 -17458 -27051 -22964 -17833 -7174
7245g174P821l038m556p960K424n444j770J1703J0730k835n669Q657R714n189
$$ -7174 647 -2391 -6947 -14907 -12483 -17927 -19697 -7994 2736 -99 -5768 2889 12603 7414
7231G414j1284k721K093n750n496l748J1982l427M824P550q072k599J1201l195
$$ 7414 -3870 -6591 -4498 -10248 -15744 -19492 -7510 -10937 -6113 1437 -6635 -9234 1967 -1228
7217a228j074J426o86o62m192l199R33k722o351O316o09p861l23J0972J465J041
$$ -1228 -2302 -876 -1562 -2224 -6416 -9615 -8682 -11404 -17755 -11439 -12048 -19909 -20232 -9260 -7795 -6754
7201f754L073M923N224o077l436Q121q335K147O988n061l766l413O03N437j1184
$$ -6754 -3681 1242 6466 389 -3047 5074 -3261 -1114 5874 813 -2953 -6366 -5763 -326 -11510
7186a1510r100K306Q374r61P007R348p136n03o854k995k139J2024O302n288N276
$$ -11510 -20610 -18304 -9930 -10891 -3884 5464 -1672 -2175 -9029 -12024 -14163 -2139 4163 -1125 4151
7171D151M705k424l723N620j7510j5333J4980J2994N976p529L107R16m368l963
$$ 4151 8856 6432 2709 8329 -9181 -24514 -9534 3460 9436 1907 5014 5930 1562 -2401
7157b401k045L717q31j2966p661M83J1441M752J389L770n306K242J0827J472k683
$$ -2401 -4446 -729 -1560 -14526 -22187 -21704 -10263 -5511 -4122 -352 -5658 -3416 7411 8883 6200
7142F200N654L254q463M853q754L51j4566n855J0772j075Q50O089k174p162m239
$$ 6200 11854 15108 6645 11498 2744 3095 -11471 -17326 -6554 -7629 -6779 -690 -2864 -10026 -14265
7127a4265N228J6759O209j083j0487j1990K670L974N966N58l560K450n069j027
$$ -14265 -9037 7722 13931 12848 2361 -9629 -6959 -2985 2981 3539 -21 2429 -2640 -3667
7113c667n456M242R085q64Q288k645L538K743j3253o289l003K627k186L953O482
$$ -3667 -9123 -4881 4204 3340 11628 8983 12521 15264 2011 -4278 -7281 -4654 -6840 -2887 3595
7098C595r788N271J6232q06l745k518o580k439J0358r895J0220J2983J613j3576
$$ 3595 -6193 -922 15310 14504 10759 8241 1661 -778 9580 -315 9905 22888 24501 10925
7084A0925n594q30P511j483R782r23r6j8230K329j96o806J729K4491J2299j5697
$$ 10925 5331 4501 12012 10529 20311 19388 19292 1062 3391 3195 -3611 -1882 22609 34908 19211
7069A9211j8974l97R06L807K90o918j129P046n842r858L510k920n984J0398J9749
$$ 19211 237 -160 746 4553 4843 -2075 -3204 3842 -2000 -11858 -8348 -11268 -17252 -6854 12895
7054A2895J0563j7911J643O161K94J335l053p684j0236k844j849m370N395J7424
$$ 12895 23458 5547 7190 13351 13645 14980 11927 4243 -5993 -8837 -10686 -15056 -9661 7763
7040G763N748m71j4149N809l635l437n549n744n22n974R500K561l370J1666M78
$$ 7763 13511 13040 -1109 4700 1065 -2372 -7921 -13665 -14187 -20161 -10661 -8100 -11470 196 674
7025F74k178J805p227j6775n997K59J2728R453J2821Q93j6557l284J905M458L152
$$ 674 -1504 301 -6926 -23701 -29698 -29439 -16711 -7258 5563 6456 -10101 -13385 -11480 -7022 -3870
7010c870L790l336Q208O678m047L598J433j0904j2086O311O374J835p55J4861
$$ -3870 -80 -3416 4792 11470 7423 11021 12454 1550 -10536 -4225 2149 3984 3229 18090
6996A8090m383j3623O0N790K304J0389L198k984j2199l7N385L283K555o107j0082
$$ 18090 13707 84 144 5934 8238 18627 21825 18841 6642 6605 11990 15273 17828 11721 1639
6981A639p49n834j0856j0561l095J1533n426n005R667R846J4508K096q169m928
$$ 1639 890 -4944 -15800 -26361 -29456 -17923 -23349 -28354 -18687 -8841 5667 7763 -406 -5334
6967e334K375m82l389K148N958o973n470M385l92r148O013Q091m480M637l100
$$ -5334 -2959 -3441 -6830 -4682 1276 -5697 -11167 -6782 -7174 -16322 -10309 -2218 -6698 -2061 -5161
6952e161m493n679J1868Q215p469j2856Q446J3592j193p343r472O113K574k79
$$ -5161 -9654 -15333 -3465 4750 -2719 -15575 -7129 6463 5270 -2073 -11545 -5432 -2858 -3137
6938c137K39p46k223k766L804j713N350M928K966N522l420p823P93J273M558l716
$$ -3137 -2898 -3644 -5867 -8633 -4829 -6542 -1192 3736 6702 12224 8804 981 1774 3047 7605 3889
6922C889j2418j883J506R960q83j52r82q811N619K086p033k88n002M346J0958
$$ 3889 -8529 -10412 -8906 1054 171 19 -963 -9774 -4155 -2069 -9102 -9390 -14392 -10046 912
6907I12P832N598k791j1659j509R002p01j839q195p569k715r419L444k629J805
$$ 912 8744 14342 11551 -108 -1617 7385 6684 4845 -3350 -10919 -13634 -23053 -19609 -22238 -20433
6892b0433Q183q807J4363J1657J092n093N04m030l974L618m214r873o222N208
$$ -20433 -12250 -21057 -6694 4963 6055 962 1466 -2564 -6538 -2920 -7134 -17007 -23229 -18021
6878a8021J834J3045N65p674N070l950O11m201O680p567l234M98m184J0405m397
$$ -18021 -16187 -3142 -2577 -10251 -5181 -9131 -8520 -12721 -6041 -13608 -16842 -16344 -20528 -10123 -14520
6863a4520p612o567Q77L572j547J4750J2801l128q972R372o997k634m033o734
$$ -14520 -22132 -28699 -27822 -24250 -25797 -11047 1754 -1374 -10346 -974 -7971 -10605 -14638 -21372
6849b1372m716k312N728P781r467J260M73p72m810p391J3778Q877J0138O494j7030
$$ -21372 -26088 -28400 -22672 -14891 -24358 -23098 -22625 -23397 -28207 -35598 -21820 -12943 -2805 3689 -13341
6834a3341n412K378L107L038J4668L327k029J1278L936K006J136j2078j6258k0738
$$ -13341 -18753 -16375 -13268 -10230 4438 7765 5736 17014 20950 22956 24092 12014 -4244 -24982
6820b4982M040k266Q707J1688K2014r294j1455P360o42j256M450n469k58q501
$$ -24982 -20942 -23208 -14501 -2813 19201 9907 -1548 5812 5170 3914 8364 2895 2637 -5864
6806e864n808Q0K524j6058k134Q473J5625J3256l104p596L7J698r029l535p031
$$ -5864 -11672 -11592 -9068 -25126 -27260 -18787 -3162 10094 6990 -606 -569 1129 -7900 -11435 -18466
6791a8466K062K859l452M95N406Q723J3348P417r016j3748q613p36L55L455J1611
$$ -18466 -16404 -13545 -16997 -16502 -11096 -2373 10975 18392 9376 -4372 -12985 -13721 -13366 -9911 1700
6776A700J8183q926q7J489m760j0577Q05Q710R798r377l048J2392r984m181R89
$$ 1700 19883 10957 10870 12359 7599 -2978 -2173 6537 16335 6958 3910 16302 6318 2137 3126
6761C126o340k677k35q1j942j4422o18J2033k946K574L7P090J517J4730N551o895
$$ 3126 -3214 -5891 -6126 -6207 -8149 -22571 -23189 -11156 -14102 -11528 -11491 -4401 -2884 11846 17397 10502
6745A0502j4269q572p711m640L85L976L278R312J1053K305k877j2478k371O666
$$ 10502 -3767 -12339 -20050 -24690 -24305 -20329 -17051 -7739 3314 5619 2742 -9736 -12107 -5441
6731e441j705n618p875Q255J8284O128m643K73n092j869k209K52J253q508Q758
$$ -5441 -7146 -12764 -20639 -12384 5900 12028 7385 7658 2566 697 -1512 -1260 -7 -8515 243
6716B43K097n850N778K604p414k280j745J146J0226o93J615j2705j2206l730P76
$$ 243 2340 -3510 2268 4872 -2542 -4822 -6567 -5421 4805 4112 5727 -6978 -19184 -22914 -22138
6701b2138N794J4875M905j1733m206k209L774n443J1461N630j976K329M818m950
$$ -22138 -16344 -1469 3436 -8297 -12503 -14712 -10938 -16381 -4920 710 -1266 1063 5881 931
6687I31j4199j6618M935Q956L888k94j725J37J0446J4719n439j5447p302J1711
$$ 931 -13268 -29886 -24951 -15995 -12107 -12401 -14126 -13989 -3543 11176 5737 -9710 -17012 -5301
6673e301M902J0516o050n289j420p867N21J8245m101r591K59j0226N779M567m372
$$ -5301 -399 10117 4067 -1222 -2642 -10509 -9988 8257 4156 -5435 -5176 -15402 -9623 -5056 -9428
6658i428p138N057O866N255k216L878O442M258q360K336k606j437k841K722j2488
$$ -9428 -16566 -11509 -4643 612 -1604 2274 8716 12974 4614 6950 4344 2907 66 2788 -9700
6643i700j0986k533M944L178J894Q381R586J0961r783j0152n309j579J7249O355
$$ -9700 -20686 -23219 -18275 -15097 -13203 -4822 4764 15725 5942 -4210 -9519 -11098 6151 12506
6629A2506o005M987m268q464l702q932N590J0536n963k355J0861L81N351R753
$$ 12506 6501 11488 7220 -1244 -4946 -13878 -8288 2248 -3715 -6070 4791 5172 10523 20276
6615B0276o383j2427j3353p930M491P046j0675N465J4290O701r546n3J5980J3773
$$ 20276 13893 1466 -11887 -19817 -15326 -8280 -18955 -13490 800 7501 -2045 -2098 13882 27655
6601B7655K649n255j2869j0121Q87j457n138j4357j709O748p72Q55L268L185P255
$$ 27655 30304 25049 12180 2059 2946 1489 -3649 -18006 -19715 -12967 -13739 -12884 -9616 -6431 824
6586H24j0023q464J028L177R619K0617j380j4766k596j912O622q071o665Q524
$$ 824 -9199 -17663 -16635 -13458 -3839 16778 15398 632 -1964 -3876 2746 -5325 -11990 -3466
6572c466J1304N062N989n396k506m91j3921j0183q453L538l006J937J5630J2350
$$ -3466 7838 12900 18889 13493 10987 10496 -3425 -13608 -22061 -18523 -21529 -19592 -3962 8388
6558H388j2581R976K853k532L845Q860p757j9031p158L484j939m372r240j1561
$$ 8388 -4193 5783 8636 6104 9949 18809 11052 -7979 -15137 -11653 -13592 -17964 -27204 -38765
6544c8765l31J2827Q086L184J2326J0101N765L824j0632j6404K486N034j5468
$$ -38765 -39096 -26269 -18183 -14999 -2673 7428 13193 17017 6385 -10019 -7533 -2499 -17967
6531a7967j0118O591J4784N13n155N108K556J2796N450k331j1717j1839l472N478
$$ -17967 -28085 -21494 -6710 -6197 -11352 -6244 -3688 9108 14558 12227 510 -11329 -14801 -9323
6517i323O537r301r46J606m287N598L267P863k26J053J2268L833l613n982j511
$$ -9323 -2786 -12087 -13033 -11427 -15714 -10116 -6849 1014 788 1841 14109 17942 14329 8347 6836
6502F836M157m239J044K971o311j6096J936P694q852L677R168O816l580n424M595
$$ 6836 10993 6754 7798 10769 4458 -11638 -9702 -2008 -10860 -7183 1985 8801 5221 -203 4392
6487D392o28N745j1282p522q951J7705K452n684J87l003J964m761q05Q554L920
$$ 4392 3764 9509 -1773 -9295 -18246 -541 1911 -3773 -3586 -6589 -4625 -9386 -10191 -1637 2283
6472B283J577j1772P853L153L504q38O566k166m265M223o600k588J2309Q213q783
$$ 2283 3860 -7912 -59 3094 6598 5760 12326 10160 5895 10118 3518 930 13239 21452 12669
6457A2669o122r599j65N98n467R92k693N838J3065M862J160k748q444j780k690
$$ 12669 6547 -3052 -3217 -2619 -8086 -7094 -9787 -3949 9116 13978 15138 12390 3946 2166 -524
6442e24L228m17O61J357j4276o654K389K031L934P918K525K807j593J616n94j481
$$ -524 2704 2287 2948 4305 -9971 -16625 -14236 -12205 -8271 -353 2172 4979 3386 5002 4408 2927
6426B927k284M931k065L41j351J641N851J1361j2523j2347k950r630k318O277
$$ 2927 643 5574 3509 3850 2499 4140 9991 21352 8829 -3518 -6468 -16098 -18416 -12139
6412a2139Q957J558j0041J564P807l662l138k040K647J4290M453l796L220L249
$$ -12139 -3182 -1624 -11665 -10101 -2294 -5956 -9094 -11134 -8487 5803 10256 6460 9680 12929
6398A2929m468m688j193l439q215j3924J1603n899m661n062l750Q332J9591L984
$$ 12929 8461 3773 2580 -859 -9074 -22998 -11395 -17294 -21955 -27017 -30767 -22435 -2844 1140
6384A140m289J2117q104p431l024j0227L534J2965O963p348o628j4756n088K064
$$ 1140 -3149 8968 864 -6567 -9591 -19818 -16284 -3319 3644 -3704 -10332 -25088 -30176 -28112
6370b8112Q482P648J0365m32J066k73j6365O22J5045n463P498R097O602j5498
$$ -28112 -19630 -11982 -1617 -2049 -983 -1256 -17621 -16999 -1954 -7417 81 9178 15780 282
6356B82j5752J1634J4892r23l009o301j1586k599l765K472P20J4792K2336k966
$$ 282 -15470 -3836 11056 10133 7124 823 -10763 -13362 -17127 -14655 -13935 857 23193 20227
6342B0227j0342m793K101M827N158j0734p262j1370j1554k906N089J1297J2443
$$ 20227 9885 5092 7193 12020 17178 6444 -818 -12188 -23742 -26648 -21559 -10262 2181
6329B181o677l206J0524J071J747j681j1419j1588J769r953L56J1018J1349O19
$$ 2181 -4496 -7702 2822 3893 5640 3959 -7460 -19048 -17279 -27232 -26876 -15858 -4509 -3890
6315c890l733J1618K520j727N477n216o779P826M307O971Q012q058j5708q689
$$ -3890 -7623 3995 6515 4788 10265 5049 -1730 6096 10403 17374 25386 17328 1620 -7069
6301g069L727O08J798J3109j847q628L021J1289m714j0056r101n738n910j584
$$ -7069 -3342 -2734 -936 12173 10326 1698 4719 16008 11294 1238 -7863 -13601 -19511 -21095
6287b1095K949P316M866N225o288j5180r34J4468M775o66P661J1125J45p819O56
$$ -21095 -18146 -10830 -5964 -739 -7027 -22207 -23141 -8673 -3898 -4564 3097 14222 14367 6548 7204
6272G204J587Q49p241J315j0077j3195P232n801O49j224N841R63N575m186l770
$$ 7204 8791 9640 2399 3714 -6363 -19558 -12326 -18127 -17478 -18702 -12861 -11898 -6323 -10509 -14279
6257a4279k014P093J3761J6334j698q031k565m779L734o896j0210j333O172R659
$$ -14279 -16293 -9200 4561 20895 19197 11166 8601 3822 7556 660 -9550 -10883 -4711 4948
6243D948M538M734r085j318J0205J0015K208j1441l985j9623r059OJ4825L296
$$ 4948 9486 14220 5135 3817 14022 24037 26245 14804 10819 -8804 -17863 -17857 -3032 264
6229B64K710P932L342m114j6352n124p10K6223L586r101j3851r334J0579Q125
$$ 264 2974 10906 14248 10134 -6218 -11342 -12052 14171 17757 8656 -5195 -14529 -3950 4175
6215D175j1874o391k736M339m65J561q534J1005J0678k934N308J2574j650p705
$$ 4175 -7699 -14090 -16826 -12487 -12952 -11391 -19925 -8920 1758 -1176 4132 16706 15056 7351
$$ [...]
##END NTUPLES=NMR SPECTRUM
##END=
