##TITLE=Analysis number 313513A
Compound Code rjc 01057
Book Reference 2
Project Code adrs
Chemist Name stores
##JCAMPDX= 6.0         $$ Bruker NMR JCAMP-DX V2.0
##DATA TYPE= NMR SPECTRUM
##DATA CLASS= NTUPLES
##ORIGIN= Bruker BioSpin GmbH
##OWNER= NMR
$$ XWIN-NMR		Version 3.5
$$ Mon Sep 12 15:28:48 2005 GMT Daylight Time (UT+1h)  MAYBRIDGE\NMR@NMR_250MHZ
##.OBSERVE FREQUENCY= 250.131544655141
##.OBSERVE NUCLEUS= ^1H
##.ACQUISITION MODE= SIMULTANEOUS (DQD)
##.ACQUISITION SCHEME= undefined
##.AVERAGES= 16
##.DIGITISER RES= 18
##SPECTROMETER/DATA SYSTEM= dpx250
##.PULSE SEQUENCE= zg30
##.SOLVENT NAME= CDCl3
##.SHIFT REFERENCE= (INTERNAL, CDCl3, 0, 16.522)
##AUDIT TRAIL= $$ (NUMBER, WHEN, WHO, WHERE, WHAT)
$$ ##TITLE= Audit trail, XWIN-NMR		Version 3.5
$$ ##JCAMPDX= 5.01
$$ ##ORIGIN= Bruker BioSpin GmbH
$$ ##OWNER= NMR
$$ C:\u/data/dgb/nmr/ADRS/9270/pdata/1/auditp.txt
$$ ##AUDIT TRAIL=  $$ (NUMBER, WHEN, WHO, WHERE, WHAT)
(   1,<2005-09-12 15:28:30.52 +100>,<MAYBRIDGE\NMR>,<NMR_250MHZ>,
      <created by zg, POWCHK disabled, PULCHK disabled
       configuration hash MD5:
       62 19 C7 07 E1 42 D1 B7 37 6C 3D D0 77 39 F9 E6
       data hash MD5: 64K
       8F A3 A5 31 68 0E AA 41 40 A3 61 B1 3F 41 67 2E>)
(   2,<2005-09-12 15:28:41.27 +100>,<MAYBRIDGE\NMR>,<NMR_250MHZ>,
      <Start of raw data processing
       ef LB = 0.3 FT_mod = 6 PKNL = 1 SI = 32K 
       data hash MD5: 32K
       9E 66 AB A2 1A 46 D6 1F C3 78 81 89 B4 A4 EC C0>)
(   3,<2005-09-12 15:28:43.00 +100>,<MAYBRIDGE\NMR>,<NMR_250MHZ>,
      <apk 
       data hash MD5: 32K
       5A D7 72 0E E0 06 AB 25 BE 1F 2C 5F 6F 01 77 30>)
(   4,<2005-09-12 15:28:43.74 +100>,<MAYBRIDGE\NMR>,<NMR_250MHZ>,
      <abs ABSG = 5 
       data hash MD5: 32K
       22 23 8F 5D 09 67 C1 FD B2 31 6B 48 3F 5D E5 A7>)
$$ ##END=
$$ 
$$ hash MD5
$$ 26 8B 78 BD 37 06 93 DA 4B 52 02 09 4E 8B F6 4F
##$RELAX= 
##$RELAX= 
##$RELAX= 
##$RELAX= 
##$RELAX= 
##$RELAX= 
##$RELAX= 
$$ Bruker specific parameters
$$ --------------------------
##$DU= <C:\u>
##$EXPNO= 9270
##$NAME= <ADRS>
##$PROCNO= 1
##$TYPE= <nmr>
##$USER= <dgb>
##$AMP= (0..31)
100 100 100 100 100 100 100 100 100 100 100 100 100 100 100 100 100 100 
100 100 100 100 100 100 100 100 100 100 100 100 100 100 
##$AQSEQ= 0
##$AQ_mod= 3
##$AUNM= <au_zg>
##$AUTOPOS= <41 >
##$BF1= 250.13
##$BF2= 250.13
##$BF3= 250.13
##$BF4= 250.13
##$BF5= 500.13
##$BF6= 500.13
##$BF7= 500.13
##$BF8= 500.13
##$BYTORDA= 1
##$CFDGTYP= 0
##$CFRGTYP= 5
##$CHEMSTR= <none>
##$CNST= (0..31)
1 1 145 1 1 1 1 1 1 1 1 1 1 1 1 1 1 1 1 1 1 1 1 1 1 1 1 1 1 1 1 1 
##$CPDPRG= <>
##$CPDPRG1= <>
##$CPDPRG2= <>
##$CPDPRG3= <>
##$CPDPRG4= <mlev>
##$CPDPRG5= <mlev>
##$CPDPRG6= <mlev>
##$CPDPRG7= <mlev>
##$CPDPRG8= <mlev>
##$CPDPRGB= <>
##$CPDPRGT= <>
##$D= (0..31)
0 1 0 0 0 0 0 0 0 0.06 0 0 0 0 0 0 0.0002 0 0 0 0 0 0 0 0 0 0 0 0 0 0 
0 
##$DATE= 1126535309
##$DBL= (0..7)
120 120 120 120 120 120 120 120 
##$DBP= (0..7)
150 150 150 150 150 150 150 150 
##$DBP07= 0
##$DBPNAM0= <>
##$DBPNAM1= <>
$$ [...]
##$SUBNAM7= <"">
##$SUBNAM8= <"">
##$SUBNAM9= <"">
##$SW= 20.6930455092707
##$SWIBOX= (0..15)
0 0 3 0 0 0 0 0 0 0 0 0 0 0 0 0 
##$SW_h= 5175.983436853
##$TD= 65536
##$TD0= 1
##$TE= 295.16
##$TE2= 300
##$TE3= 300
##$TEG= 300
##$TL= (0..7)
0 120 120 120 120 120 120 120 
##$TP= (0..7)
150 150 150 150 150 150 150 150 
##$TP07= 0
##$TPNAME0= <>
##$TPNAME1= <>
##$TPNAME2= <>
##$TPNAME3= <>
##$TPNAME4= <>
##$TPNAME5= <>
##$TPNAME6= <>
##$TPNAME7= <>
##$TPOAL= (0..7)
0.5 0.5 0.5 0.5 0.5 0.5 0.5 0.5 
##$TPOFFS= (0..7)
0 0 0 0 0 0 0 0 
##$TUNHIN= 0
##$TUNHOUT= 0
##$TUNXOUT= 0
##$USERA1= <user>
##$USERA2= <user>
##$USERA3= <user>
##$USERA4= <user>
##$USERA5= <user>
##$V9= 5
##$VALIST= <valist>
##$VCLIST= <CCCCCCCCCCCCCCC>
##$VD= 0
##$VDLIST= <DDDDDDDDDDDDDDD>
##$VPLIST= <PPPPPPPPPPPPPPP>
##$VTLIST= <TTTTTTTTTTTTTTT>
##$WBST= 1024
##$WBSW= 4
##$XGAIN= (0..3)
0 0 0 0 
##$XL= 0
##$YL= 0
##$YMAX_a= 501200
##$YMIN_a= -478950
##$ZGOPTNS= <>
##$ZL1= 120
##$ZL2= 120
##$ZL3= 120
##$ZL4= 120
##$ABSF1= 16.522
##$ABSF2= -4.171173
##$ABSG= 5
##$ABSL= 3
##$ALPHA= 0
##$AQORDER= 0
##$ASSFAC= 0
##$ASSFACI= 0
##$ASSFACX= 0
##$ASSWID= 0
##$AUNMP= <proc_1d>
##$AZFE= 0.1
##$AZFW= 0.1
##$BCFW= 0
##$BC_mod= 0
##$BYTORDP= 0
##$COROFFS= 0
##$CY= 12.5
##$DATMOD= 1
##$DC= 0
##$DFILT= <>
##$DTYPP= 0
##$F1P= 14.0000005364418
##$F2P= -0.99999901652339
##$FCOR= 0.5
##$FTSIZE= 32768
##$FT_mod= 6
##$GAMMA= 0
##$GB= 0
##$INTBC= 1
##$INTSCL= 1
##$ISEN= 128
##$LB= 0.3
##$LEV0= 0
##$LPBIN= 0
##$MAXI= 10000
##$MC2= 0
##$MEAN= 0
##$ME_mod= 0
##$MI= 0
##$NCOEF= 0
##$NC_proc= -1
##$NLEV= 6
##$NOISF1= 0
##$NOISF2= 0
##$NSP= 0
##$NTH_PI= 0
##$NZP= 0
##$OFFSET= 16.522
##$PC= 1
##$PHC0= -81.17192
##$PHC1= 7.431637
##$PH_mod= 1
##$PKNL= yes
##$PPARMOD= 0
##$PSCAL= 4
##$PSIGN= 0
##$REVERSE= no
##$SF= 250.13
##$SI= 32768
##$SIGF1= 0
##$SIGF2= 0
##$SINO= 400
##$SIOLD= 32768
##$SREGLST= <1H.CDCl3>
##$SSB= 0
##$STSI= 32768
##$STSR= 0
##$SW_p= 5175.98343685301
##$SYMM= 0
##$S_DEV= 0
##$TDeff= 65536
##$TDoff= 0
##$TI= <Analysis number 999999
Compound Code 99
Book Reference 9
Project Code 9>
##$TILT= no
##$TM1= 0
##$TM2= 0
##$TOPLEV= 0
##$USERP1= <user>
##$USERP2= <user>
##$USERP3= <user>
##$USERP4= <user>
##$USERP5= <user>
##$WDW= 1
##$XDIM= 32768
##$YMAX_p= 322461764
##$YMIN_p= -191461
$$ End of Bruker specific parameters
$$ ---------------------------------
##NTUPLES= NMR SPECTRUM
##VAR_NAME=  FREQUENCY,     SPECTRUM/REAL,   SPECTRUM/IMAG
##SYMBOL=    X,             R,               I
##VAR_TYPE=  INDEPENDENT,   DEPENDENT,       DEPENDENT
##VAR_FORM=  AFFN,          ASDF,            ASDF
##VAR_DIM=   32768,         32768,           32768
##UNITS=     HZ,            ARBITRARY UNITS, ARBITRARY UNITS
##FACTOR=    0.157963299565203, 1,           1
##FIRST=     4132.6476996994, 0,             0
##LAST=      -1043.33573715361, 0,           0
##MIN=       -1043.33573715361, -191461,     0
##MAX=       4132.6476996994, 322461764,     0
$$ Real data points
##PAGE= N=1
##DATA TABLE= (X++(R..R)), XYDATA
$$ [...]
24828 -7613 -5355 -3714 -5038 -6855 -14051 -11720 -6910 -6408 -5777 -5827 -10277 -10368 -13015 -14901 -9755 -3440
24812 -3440 -7933 -3017 2556 -2885 -7514 -10434 -12570 -15350 -13363 -12653 -16873 -13601 22 2591 -2227
24797 -2227 -4485 -1462 -6828 -4478 -5967 -5588 3255 383 -2403 -4058 -7252 -6896 -4097 -10012 -5791
24782 -5791 2209 7338 10256 4245 -2972 -3910 -4201 -1884 -4570 -7538 -12256 -10952 -4382 -3837 -1830
24767 -1830 -1584 1614 7266 8426 4487 5570 6473 5341 -7806 -8561 -16759 -12802 -7194 -9234 -7781
24752 -7781 625 3609 2941 7509 9042 3662 -1840 -766 7219 6047 6712 3921 -2472 -3441 -8137
24737 -8137 -7759 972 2984 9192 14271 12017 6218 8399 14927 9808 5438 3413 1537 -5218 -555
24722 -555 1430 -1013 -3186 264 -6538 -10823 -3494 -5024 -10378 -13322 -11700 -11306 -6890 -5706 -5411
24707 -5411 -1910 6203 7562 7826 1120 1694 2208 -3771 -1008 3582 10449 3531 917 817 -1256 -2163
24691 -2163 1549 -5219 -12828 -11119 -3430 -2845 -6827 26 -65 -10385 -7623 4110 12779 14075 13002
24676 13002 10688 8899 8673 10177 813 841 221 -892 -2161 1498 -11 15 3911 3488 7482 8602
24660 8602 9410 8552 10458 6617 7815 3533 -4431 3382 11916 5257 -6954 -2563 2965 2417 -1570
24645 -1570 -2628 -4586 -13256 -11692 -9767 -9293 -7878 -8842 -8080 -9990 -8504 -11495 -12133 -11150 -14053 -13544
24629 -13544 -11366 -11767 -14118 -11417 -3636 -3119 -730 4478 2003 -5887 -3560 -4877 -6576 -8634 -7116
24614 -7116 -10061 -12413 -8416 -7342 -7654 -10748 -6908 -7223 -4910 -4392 -1606 1581 3953 7463 11364
24599 11364 3608 4497 7383 6938 8910 10492 4374 3533 3702 5714 3608 -1032 -5178 -4605 -566 -5408
24583 -5408 -1234 6112 1938 4244 10655 10924 6314 5166 8123 2187 546 1609 2354 290 379 -2335
24567 -2335 1104 7674 2020 -5447 -7591 -6379 -2174 3972 1510 4111 2496 -1739 -5972 -3880 -68
24552 -68 5944 9532 10561 9920 11400 15018 14848 7157 -1936 -182 2460 1699 7408 5343 778 -410
24536 -410 2536 -4612 -12387 -14398 -13938 -5255 939 12750 8441 7347 6123 7181 9175 4822 -1509
24521 -1509 -3931 -5186 -3318 44 6231 9744 1667 -2114 -2449 151 4022 1281 -2726 -4286 -2652
24506 -2652 948 -367 2490 527 -11985 -11209 -2505 5345 7981 5944 6409 6384 4020 7170 6977 1190
24490 1190 -4757 -6256 -525 1708 -2097 -3930 2656 817 486 -3021 723 -4189 -5615 2872 9269
24475 9269 8179 7371 4468 5238 865 4575 4248 -297 -2306 -6744 -10120 -6370 -2282 5147 1747
24460 1747 -1572 4927 7684 7439 3726 1611 1567 -2702 -4231 -2222 925 -512 -1661 -9351 -12807
24445 -12807 -11819 -12855 -14064 -16787 -11060 2282 3001 -5485 -13639 -9081 -9122 -3234 -7447 -11406 -5419
24430 -5419 -3864 -7139 -4781 -3674 -3792 -11066 -12579 -10564 -13405 -14390 -12257 -13666 -8291 -7232 -6032
24415 -6032 -7650 -12641 -10432 -11295 -7887 -2093 -1526 4342 7685 793 -7611 -6592 -3414 1692 9993
24400 9993 8894 7396 5475 -3386 -11528 -13163 -13776 -15697 -17778 -16862 -7769 -5253 -8152 -12195 -13311
24385 -13311 -5116 5054 9566 7253 4061 -2097 -4575 -6899 -6225 -2803 -3789 -5137 -2413 -7977 -5202
24370 -5202 -3580 -600 5178 390 -7330 -7847 -1203 -2468 1604 -470 -6157 -4252 -202 -200 -3155 -7792
24354 -7792 2041 6050 -5854 -12244 -2109 3213 7588 9877 -1436 -8058 -10872 -5941 -5237 -4609
24340 -4609 5593 6195 -2195 4669 6397 2651 1103 -9837 -19877 -15614 -11023 -6342 -4698 -822
24326 -822 -1617 -1092 4430 7399 8797 6791 5493 4974 5394 7306 12769 11907 8707 2945 6195 2416
24310 2416 -3305 -3018 -10014 -12951 -5258 2153 2709 2089 6271 7080 4565 1928 1132 4443 6026 3232
24294 3232 1940 4187 1563 -7106 -9676 -5842 -3274 2781 2549 -6817 -10119 -13104 -8762 -2539 4053
24279 4053 4229 5112 6844 10544 7934 506 4058 2323 -182 6637 10741 14457 8788 -455 -6083
24264 -6083 -7533 -7023 -3691 1169 1040 -3305 -10865 -8467 -9950 -10780 -7193 378 -488 -5801 -2416 921
24248 921 196 4542 13668 8162 -3464 -1707 -1852 -6434 -1078 4308 10030 13865 14043 13665 6976 8478
24232 8478 6844 2003 7551 5326 3563 4527 817 -3685 -3438 -976 3485 5149 5104 723 -4172 -10825
24216 -10825 -12196 -8554 -5846 -6005 -10132 -12342 -4633 -3203 -2094 -1372 -10298 -11632 -7955 816 2245
24201 2245 -1363 -2813 -972 1652 543 2167 -410 -818 -212 -606 -3626 3915 224 -3603 -6618
24186 -6618 -6239 -4573 -7376 -11142 -11503 -2525 -5080 -9247 -4632 -3927 -4248 -2820 -10494 -13602 -13113 -14850
24170 -14850 -10742 -7545 -11435 -5992 1785 4132 1288 -2662 -6374 -6400 -3929 -7921 -6438 340 1843
24155 1843 316 -3876 -3853 918 5742 4768 4399 -740 -3507 -2650 2764 -165 -2842 -4518 -828 3121
24139 3121 478 -2442 -5505 -3330 7690 11166 10383 3790 3089 -3647 -9764 -11636 -7949 -6300 -6947
24124 -6947 -7111 -7248 -5838 -10025 -2665 1633 5412 6154 6830 7893 9536 10073 6711 2278 4171 5263
24108 5263 -6162 -9502 -1888 13 619 10654 12076 9226 9895 14957 12069 5431 3321 9261 13384
24093 13384 9683 9234 7274 5299 142 -1934 2934 884 4868 8387 2999 -380 40 1572 70
24078 70 -7290 -10036 -2874 -4707 -8448 -2965 -4444 -2516 4887 3598 -4244 -3636 -488 174 1999 1474
24062 1474 183 2780 8112 11679 9473 10017 9239 3512 -1798 1229 2760 -6338 -15894 -18463 -7379
24047 -7379 3515 3377 1700 -2347 -4828 -10123 -12631 -11108 -8194 -9811 -4879 -3228 -9241 -19140 -13125
24032 -13125 -3873 -3453 -6561 -4136 -4390 -13864 -18137 -14185 -12798 -11846 -9464 -3789 905 1474 -892
24017 -892 -684 -3113 -4098 -7901 -4927 -3667 -1666 -3013 2399 8402 3138 -573 -1082 1219 -3759 -5622
24001 -5622 -5005 2657 3324 1243 -7954 -13862 -9067 -4081 1973 10186 5771 -2648 1778 6403 7271
23986 7271 454 -7071 -6309 670 10533 13385 13844 15696 10379 4013 -1030 -4006 -3961 -1522 3408 10397
23970 10397 8750 6419 1116 -3336 -4560 2196 3861 1124 -4375 185 -2470 -7054 1208 66
23956 66 4087 -2136 -9980 -6810 -4597 -2675 4035 1532 -5695 -6654 -7168 43 -4048 -4561 -2571 -9318
23940 -9318 -16195 -12657 -4708 3420 4235 2242 -1243 -6344 -10624 -8529 -2858 -316 2234 292 9706
23925 9706 7704 1549 -191 6577 10858 13230 9918 94 -2749 -5525 -3818 639 -3811 2734 7172
23910 7172 2048 -3104 -2463 2511 1729 1859 -1560 -3589 170 729 -1719 -1638 7640 5266 1379 -3157
23894 -3157 -4683 -5858 -5691 -5826 -4122 3979 7155 2409 -2834 -3371 -3430 -6018 -9441 -4914 320 -2041
23878 -2041 -3384 -3732 672 5187 6393 4590 2626 1770 276 1969 2767 1302 -1336 -271 4182
23863 4182 10813 13594 4909 -1346 -1457 -443 -1065 1384 1680 289 5017 1599 -9939 -18625 -19320
23848 -19320 -16464 -15122 -11216 -8329 -6054 -7799 -1797 1186 -5981 -10504 -8077 1377 -1112 -1728 -213
23833 -213 -1242 316 1624 -3857 -4578 -6714 -11554 -12328 -12438 -6496 364 3173 1261 -105 -1189 -2633
23817 -2633 -3956 -6014 -1593 7884 8401 2308 1326 -3204 -4200 -5726 -7136 -222 -1830 -7134 -6987 -4428
23801 -4428 -4818 -5182 -3920 -6986 -11985 -13806 -12175 -10561 -12540 -5981 5097 2847 -1681 4701 10710
23786 10710 7435 -3173 -3384 -429 8485 13524 12274 -5481 -10560 -9497 -11742 -8248 -6611 -4152
23772 -4152 -2593 -9797 -15275 -12750 -12580 -12810 -13328 -10880 -7490 -8292 -3957 880 1372 1837 -1177 -10678
23756 -10678 -13063 -10549 -4601 -4096 -3518 4250 7741 244 -7934 -11426 -8911 -5028 -750 2567 5513
23741 5513 8211 11032 12061 17061 8039 -5703 -9619 -6254 -1300 -672 -2191 841 5047 4773 319
23726 319 -1413 -1044 3395 7691 3354 7362 11389 9938 4512 -4619 -3413 -3794 -2824 -6379 -7933 -7949
23710 -7949 -3810 -1026 894 4398 5753 7425 4401 1677 782 2285 3650 0 -446 -403 -3385 -3939
23694 -3939 -15553 -14019 -11550 -9109 -9100 -11496 -11553 -9273 -1732 1353 8206 13953 8219 3660 -2366 -1303
23678 -1303 3752 653 -2132 2622 4518 8926 10138 4209 -3409 1895 2539 -1128 2516 7937 5997
23663 5997 8960 4699 7146 10016 12106 6124 3252 2804 -556 -5434 -6093 -105 8188 14999 9476
23648 9476 2696 3299 4712 -3395 -7296 -8333 -9913 -7300 3345 9592 964 -9346 -11705 -5377
23634 -5377 5599 1201 -6042 -5572 -2912 -10774 -15465 -5902 4548 8162 7787 4393 3290 -3251 -3611
23619 -3611 -5149 -888 7792 4392 -773 31 -175 109 -1744 2236 -1259 -10766 -4620 2773 6752
23604 6752 2568 -1502 -5469 -4560 -2651 -4379 -5497 -5380 2733 5228 2451 -2509 -4313 -3057 -3063 1803
23588 1803 -8695 -16166 -6271 -1575 -2962 -6119 -11634 -12442 -2818 -271 -2856 -7088 -14299 -6638 -2784
23573 -2784 -2925 -6389 1395 3816 2564 2855 332 3936 10568 10294 815 4034 7337 7592 -1541 -5808
23557 -5808 -2893 1903 4237 5686 -1799 -6426 -3700 -2171 6048 6793 4388 1947 232 -6605 -7027
23542 -7027 999 -6398 -10056 -2757 4110 2816 -3233 -770 -2242 -5345 -6017 -266 -3019 -5033 -593
23527 -593 2368 6106 8977 12920 13780 8089 8101 9902 10682 5776 -292 -3970 -4342 -1895 4484 2799
23511 2799 980 6805 7541 2907 -2601 -385 -3618 -1550 2 2972 3161 2244 2417 4619 -1006 -2105
23495 -2105 -6503 -10874 -11602 -12248 -8711 -4994 682 1950 2554 4183 7189 3623 -1883 84 -8442
23480 -8442 -8204 -7543 2926 8212 7493 7954 7425 2398 -9955 -14141 -9121 1450 2501 6886 7314
23465 7314 4815 6597 1337 -8335 -10002 -18282 -23617 -24265 -20747 -8496 -7508 -4616 -2789 -4629 -2937
23450 -2937 -3365 -6207 -9997 -6985 -785 399 -6735 -16149 -18955 -18206 -6062 -6489 -13342 -11048 -1831
23435 -1831 4970 7203 3400 -405 -1417 -4802 -6573 -206 -6470 -9420 -10984 -12063 -18004 -16963 -13783
23420 -13783 -12065 -10720 -15856 -7366 949 11793 10610 10532 4300 -4997 -3935 -1555 -67 657 -539
23405 -539 6197 7105 5796 12834 12649 13471 7314 2642 3326 -3748 -2256 -2292 -7963 -3985 149 2650
23389 2650 5494 1390 -5788 -11153 -8113 -548 3698 2994 451 -4562 -2400 -2292 -10710 -11809 -1326
23374 -1326 1675 -1292 -2432 6333 12720 11459 9812 5505 -2977 -8503 -6917 -2469 -2684 -2543 -3533
23359 -3533 -4683 -6063 -3366 -69 -1754 -1272 -758 4487 7891 4201 4040 5760 12235 16083 11419
23344 11419 7073 6013 6929 7431 6250 11359 10916 9440 2704 250 4243 12031 11668 9539 13076
23329 13076 13839 10602 14744 10485 2771 2216 9661 11108 2036 -8815 -5637 -1394 -7139 -3246 -3289
23314 -3289 -3035 -1649 -1832 -5411 -3427 -2345 -298 -153 -5138 -11561 -7937 -4630 -183 81 -7211 -8556
23298 -8556 -7257 -3386 4967 7007 4899 7030 3949 -3720 -4416 -5349 -7140 -4889 -6408 -4024 -1305
23283 -1305 2266 8008 12118 5466 -5250 -9721 -7804 -4245 2743 2554 4400 8043 6286 6771 3256
23268 3256 7083 9444 6893 -1624 -8948 -14336 -12626 -12867 -8269 -13398 -21802 -9633 -6840 -4231 -1299
23253 -1299 1722 2720 4323 -474 -316 8294 1506 690 1006 -4693 -7461 -5649 -7343 -5985 -2448 -4285
23237 -4285 2257 -1645 -4526 -3921 1936 3361 2309 -5943 -9759 -386 5612 5732 2383 2700 -1947
23222 -1947 -9123 -5947 -6023 -8937 -5201 -345 -2380 490 1346 607 -409 -5531 -4595 -2304 2341 4843
23206 4843 6429 2603 738 -1635 -6155 -3759 -1024 7003 11064 5163 5088 1273 1607 -780 1251
23191 1251 1495 495 124 3576 -616 -6575 -7009 -9986 -11136 -9713 4387 11777 5557 -3802 -4229
23176 -4229 -7668 -6990 -12071 -9095 -463 -88 2390 6479 6004 4653 -1174 -4698 -16277 -15902 -7513
23161 -7513 -1569 377 2377 -609 -7999 -15279 -16511 -10302 -825 -174 -8154 -14941 -8505 1080 1056
23146 1056 6386 3432 4058 13 960 -6289 -10390 -10184 -7050 302 4464 3682 3610 2640 -3780 -10905
23130 -10905 -7058 -3060 -3204 -2101 3023 1309 1522 -1888 -14287 -14037 -16841 -13010 -3573 -550 -2078
23115 -2078 -6916 -7617 -4541 -2454 -456 2504 7137 5671 3818 -1109 -3469 2104 10358 13812 13700
23100 13700 9837 12827 10465 9741 7460 8070 5485 1780 -2339 -1825 5395 4683 -5168 -9310 -5746
23085 -5746 -3716 2808 5176 6255 3402 -734 -6177 -9921 -14620 -8890 -8521 -5703 -8983 -5456 -4593
23070 -4593 -5072 -2208 -3353 2715 5436 2386 382 -5630 -8389 -3156 -3304 -6312 -2879 6516 8900
23055 8900 4997 77 -3765 3589 -1744 -1164 -760 -2802 -27 9754 5483 1950 -1568 -3623 -3043
23040 -3043 -2157 457 1138 2710 -232 6582 9435 3969 1378 1051 -912 1259 3094 1858 -819
23025 -819 -2483 -7947 -8359 -5738 -6662 -11077 -2887 278 4490 -2379 -2101 -2328 8547 12312 3645 -5217
23009 -5217 -623 -8119 -6487 -3319 -10657 -11636 -8377 -2802 -2840 -1929 6978 6011 -1100 -925 -755 946
22993 946 2662 -1260 -6314 -9169 -3375 -2724 -8996 -3498 8381 -3037 -11219 -11704 -9521 -12127 -13451
22978 -13451 -8556 -8729 -12640 -11668 -10841 -11817 -2555 -84 1464 48 -7966 -17133 -16188 -7949 1947 2444
22962 2444 4199 2030 4548 7751 -813 -8286 -2954 4245 5797 1433 -2205 -3312 -3339 -6369 -2688
22947 -2688 -4219 -8409 -10400 -14209 -19523 -11871 -4666 -3509 -3928 -7271 -15310 -10752 -7087 89 -1803
22932 -1803 74 8136 6144 4299 51 1999 1360 2283 4263 645 -863 -292 3765 8361 6080
22917 6080 6560 4911 -3503 -6633 -5637 -2890 -3089 2410 381 -10488 -10245 -7962 -3944 6140 7595
22902 7595 4782 2709 -2770 -7109 -6245 -3453 -2414 5746 472 -8159 -10502 -6349 -1246 -4308 -1540
22887 -1540 -5619 -9291 -7583 -2479 -6083 -10835 -9997 -9041 -1010 -1120 -3468 44 -9399 -16446 -12963
22872 -12963 2055 13864 8560 5433 5610 5641 5239 -1736 557 3599 2559 -1026 -5973 -2636 8731
22857 8731 -201 -4708 -4242 388 4281 -2812 968 7423 5436 6358 7486 5818 1869 -5417 -7412
22842 -7412 -5944 -1909 -9622 -11927 -3992 -4404 -10471 -7348 -9798 -14381 -8415 -7576 -2280 -1280 -3205
22827 -3205 -3843 4467 7480 676 -3893 -2577 -5358 -3662 -3433 1372 4531 3282 23 -440 4442
22812 4442 7743 6426 898 4397 7595 9114 2877 -8063 -9613 -8063 -13945 -11506 -4716 -6012
22798 -6012 -4020 -3810 -9968 -7797 -1104 688 -570 4637 12780 9759 4189 4808 77 2129 8190
22783 8190 2907 -3698 -6586 -4588 3796 -517 -8176 -10151 -3417 -931 -2272 -5003 -3197 -3921 -3677
22768 -3677 -7196 -9120 -4582 -678 -774 2874 5636 6071 5252 4357 563 -2109 -2060 -1440 -1231 -1333 -1581
22751 -1581 -2366 -7410 -13489 -13417 -6304 -289 3096 163 -2955 -1553 423 -4134 4598 7050 1129
22736 1129 -2254 -4748 -3796 4760 7737 3774 -1983 -869 609 -4978 -8942 396 5897 2559 7526
22721 7526 13608 9100 -1947 -4955 5084 7720 10520 1359 6513 5827 -6461 -10513 -6133 1993
22707 1993 2292 -3305 -1107 -5110 -10454 -8195 -383 3938 449 -5661 -4049 -4348 -819 -1536 -2709
22692 -2709 -2331 314 1526 164 -2604 -5335 -4963 -7167 -1748 4088 5260 6105 -1556 -4615 -1845
22677 -1845 3703 -2769 -9011 -9059 -8512 -9683 -12184 -14699 -9811 -7027 -7860 -11315 -9160 -8278 -9276 -11626
22661 -11626 -10834 -6340 1643 -3322 -1812 3080 2585 -116 3619 4363 -68 2440 4758 11161 8731
22646 8731 6696 6141 4785 3445 5236 3681 -1388 -1980 -76 -280 641 613 3331 1706 -8021 -5768
22630 -5768 -1805 2998 4404 -1584 373 6255 5657 -1758 -7937 -5545 3472 2821 -827 -1353 -5123
22615 -5123 -1979 2807 4032 3966 -3568 -6190 -6426 -14141 -10737 -7785 -3250 -880 -1441 -9605 -6843 -7296
22599 -7296 -5603 -1646 228 -1743 -9552 -13298 -12831 -12630 -16601 -18964 -16527 -8916 4482 8233 4173
22584 4173 6378 5151 -1513 -4570 -5866 -3542 -2440 -8687 -11607 -7889 -8264 -8120 -5530 -6674 -3059
22569 -3059 -1175 3960 483 -9782 -6312 130 -79 -3101 -2266 4958 10084 9943 1901 750 2230
22554 2230 8926 7310 1689 1896 -2331 -10268 -12460 -9878 -4367 -1825 -4616 -6740 -5036 -567 4053
22539 4053 6711 -190 -1980 4655 7289 -3130 -9201 -5743 1712 -110 -4566 -844 545 -3172
22525 -3172 -3341 3246 8234 11396 7920 -2236 -7074 -3506 1015 10948 8944 895 -2121 -289 -8617
22510 -8617 -9707 -4145 -3876 -8663 -16615 -18131 -14211 -14395 -10294 -5474 -2938 3612 6337 746 -3230
22495 -3230 -2928 -6738 -13376 -9266 -2435 -4721 -7266 -6708 -11261 -6920 5366 4511 2103 477 -4245
22480 -4245 -4289 -4128 -1558 -4597 -2300 -1753 2665 8071 4381 5970 3120 3088 7470 9890 11083 10924
22464 10924 7930 -210 -5514 -9487 -10701 -15626 -19833 -11134 -2098 2351 1499 5218 8386 -137 -5526
22449 -5526 -6558 -9488 -9651 -4537 -8462 -6280 -3504 -2809 -2240 -2445 -6833 -6966 -5476 -5002 -12112 -16497
22433 -16497 -17188 -17626 -16221 -9925 -6248 -2077 1277 5888 4292 784 736 835 -4243 -7425 -7575 -456
22417 -456 -320 -6164 -12070 -12233 -7308 -3224 -2390 -1281 1557 -1787 -2496 -3195 -2651 -32 -1491 -4493
22401 -4493 -707 764 -734 -3748 -3567 -1851 -1492 -1880 -6227 -10790 -9680 -5225 -4407 -9022 -12734 -9574
22385 -9574 -5120 -772 -2053 -3439 -6745 -10419 -10199 -17923 -21082 -12825 -3627 1967 1159 402 -5000
22370 -5000 -3620 -2889 5500 12733 7959 8255 8886 16128 13665 11832 11476 7776 6918 7475 11089 12277
22354 12277 8800 8958 5781 1252 -4338 -1177 9398 5719 -1578 -1605 669 1968 -200 -1863 -4937
22339 -4937 -3592 -6578 739 6584 5075 2733 6085 801 -1758 -2088 -3258 -1038 2037 -2722 -7540
22324 -7540 -10175 -4982 -5724 -9796 -13186 -1851 -1740 -9553 -16286 -11917 -3755 -1947 293 -820 -9184
22309 -9184 -9703 -5682 -1631 -8365 -12743 -5830 2993 11278 8674 12323 4756 3510 1735 282 -2406
22294 -2406 767 4038 5667 9857 12164 9479 8361 7374 3649 -4456 -11544 -11085 -6594 -364 -453 -3909
22278 -3909 -169 6448 6645 68 -2618 -7460 -7395 -5767 -5402 1840 1841 -985 -6157 -12622 -17214 -11450
22262 -11450 -12135 -8833 -5106 -6957 -4105 -614 5414 496 -311 -890 -5534 1576 5078 -1923 1213
22247 1213 387 -4398 -1476 -3840 -6836 -16757 -14611 -10630 -10832 -13697 -4738 6358 3896 -7306 -14683
22232 -14683 -16408 -12207 -3376 -4899 -6666 -9571 -11677 -11227 -6236 -7423 -5032 -10243 -7903 -4962 -2640
22217 -2640 -2241 -1207 4583 1791 -10424 -14722 -7269 -1726 -273 -12210 -12453 -6826 -3670 -13852
22203 -13852 -13579 -6077 -4334 -4593 -2793 466 622 1973 266 4121 539 -1972 2578 975 -1233
22188 -1233 -6084 -9745 -7287 5767 7163 3604 3601 5291 6228 7758 6334 4614 -64 -854 -5425 -15569
22172 -15569 -21905 -18608 -18913 -17609 -18397 -15910 -12559 -9127 -10212 -3736 -4414 -4273 -9163 -7983 1727
22157 1727 2082 -1670 -2473 -8422 -5888 -3262 -7635 -6915 -600 3099 6224 -1019 -9046 -12071 -16186
22142 -16186 -21391 -19186 -18127 -12573 1536 3283 5046 9780 5589 -1760 -7264 -9887 1612 4003
22128 4003 782 -873 -3738 -6931 -2984 413 -4555 -8956 -8015 -1695 -1744 676 3525 3253 3734 9693
22112 9693 13577 10629 -26 -5248 -6755 -10697 -2068 9253 11852 9980 482 345 134 5334 4432
22097 4432 -4525 -9801 -5284 -5153 -6058 -814 4649 8954 824 -5047 -8294 -8110 -7072 -3611 -3022 -3536
22081 -3536 -9624 -16386 -13144 -5494 -396 -8703 -6397 -5258 -4196 911 5153 7010 -582 -10450 -15105
22066 -15105 -8081 -379 228 -5902 -11144 -10101 -3122 1989 7151 14186 12229 4085 -436 -1295 -1905
22051 -1905 3471 2256 1720 -354 -4637 -1076 -1301 -2857 -1314 -2861 -862 352 5101 5921 1976
22036 1976 1633 -1418 -2327 3953 7717 8248 1114 -1813 1420 1269 3573 10798 13843 4863 -3495 -117
22020 -117 5257 -1632 -3760 1465 7725 12816 18456 11068 5512 2443 336 3338 3731 4052 4367 11109
22004 11109 13128 5989 2590 3699 1351 2935 2184 -7968 -12640 -8442 -2835 992 -3335 -8625
21990 -8625 -9236 -2348 -1602 -1903 -223 8689 8959 987 -691 -3326 -3724 -1604 1843 4137 8090 9940
21974 9940 8543 5105 1580 2829 1069 -1848 -57 447 -2977 381 4861 4365 -7939 -10135 -7915
21959 -7915 -4988 -8419 -8413 -4889 -2504 -3915 2901 9994 7145 6099 2360 -7428 -2601 6043 7398
21944 7398 1441 -6219 -6189 -864 974 -1244 -6016 1014 12121 10992 4935 5312 4843 6144 10752
21929 10752 15833 13381 11606 3835 -6983 -8912 -10795 -6767 -4385 -5780 -2352 3565 5069 1504
21915 1504 7397 6113 -697 1398 818 -531 -1130 -11142 -17811 -15977 -9097 -10037 -9107 -3648 -2828 -613
21899 -613 1931 -4589 -4331 274 73 412 -5179 1290 1890 -3902 -8303 -4585 4025 8051 4945 3550
21883 3550 2367 -4414 -9400 -6119 451 -6527 -14496 -9251 -380 -1287 -4710 2932 5041 11026 2376
21868 2376 -1925 2749 11134 9217 7251 6120 -402 -6767 -7310 -11028 -8636 -1508 5340 1023 -2891
21853 -2891 -4249 -7248 1440 6227 4029 2526 385 -610 2077 11499 11102 -3200 -9985 -6792 -1153
21838 -1153 832 2248 -2287 -3718 -8436 -6033 -7420 -4720 -2695 -4931 -4249 760 1518 1090 -2237
21823 -2237 4048 11115 3509 -5570 -956 3366 3850 -4298 -4038 3661 1858 464 5530 7085 4484
21808 4484 3094 6724 10814 6527 1213 679 2020 1112 -2832 -844 439 4093 5998 2125 -7175
21793 -7175 -10364 -12173 -11126 -9519 -6853 -6456 -6024 -15581 -18704 -11144 -1462 -619 2423 547 550 6541
21777 6541 2337 -3795 -7176 -7517 -8434 -10553 -7036 498 4829 313 -1254 2651 5286 8407 7991
21762 7991 10084 9958 5904 1618 -3515 -2676 -7716 -9460 -8507 -6985 -1898 801 3413 5282 -2126
21747 -2126 -5450 478 214 -6111 1237 4113 -470 -8561 -12975 -18587 -22136 -16151 -11679 -854 2272
21732 2272 8078 3675 -2342 -1234 -489 -1140 -1017 -2661 -977 146 -10850 -15048 -15102 -12011 -16870 -15515
21716 -15515 -14823 -13056 -12002 -9389 -7550 -4671 -2004 -2380 -9931 -14630 -9213 -7645 -10881 -5508 455
21701 455 -8800 -16535 -10188 2178 -103 -2260 -4662 -6327 -9826 -6647 -5365 -749 2433 -756 2170
21686 2170 5136 -1099 898 4290 0 -5440 -13350 -14861 -10239 -1514 6474 3455 1162 7704 3691
21671 3691 1412 -2645 -2709 4939 10188 699 -7598 -6037 -1673 -4793 -9245 -11136 -11675 -9987 -14603
21656 -14603 -9521 -866 7543 8680 2976 6517 5640 6569 3835 982 3111 4875 771 820 5962
21641 5962 1323 -2279 -7059 -5095 -6182 -5206 -7927 -7162 -8340 -9489 -2568 2924 6154 10987 10687
21626 10687 7045 6888 1318 -1322 -5668 -5220 -6050 -331 -1542 -5228 -3209 -10320 -8968 -5489 -10620
21611 -10620 -7520 -7354 1485 -3319 -17016 -12313 -5267 886 -783 -1238 -7829 -9837 -9800 -10658 -13141
21596 -13141 -7119 -566 4857 4453 1643 -5884 -9832 -9526 -8544 -6592 -9245 -9275 -13827 -14497 -8254 -5959
21580 -5959 -616 280 1128 -8057 -7123 -501 -10661 -11784 -114 4629 7362 3862 1286 9129 10570
21565 10570 2174 -1381 3047 8991 6497 4771 -7251 -12330 -8673 -4406 -3281 -5440 -10769 -7797
21551 -7797 2627 10194 2480 1294 469 -102 -1924 -552 719 -1976 -3642 -2338 -3023 -2537 -9385
21536 -9385 -11200 1578 2850 2780 4392 4236 2780 11381 9606 5988 4409 7382 3949 -89 1982
21521 1982 -950 4663 3392 -4707 -8881 -14658 -16507 -23346 -19964 -16014 -19190 -11351 -2888 -723 -1802
21506 -1802 -2684 -1783 -5749 -6510 -4323 1007 5165 880 1505 1718 7649 7157 880 -9186 -11622 -9045
21490 -9045 -5407 -1637 2279 3832 9392 3408 -1872 -1336 3184 57 1742 3677 4295 -3516 -3575 1752
21474 1752 867 954 -3644 -5603 896 2164 -1307 1619 3695 -1808 -416 705 621 -1373 -2126 1637
21458 1637 1287 1687 -6017 -7330 -6495 -6928 -1722 2321 38 -830 -6638 -9957 -8725 -3757 -2303 -1991
21442 -1991 1873 9355 13557 11428 295 -706 6426 13924 10046 6275 7040 6711 628 -7191 280
21427 280 9728 11361 12008 9303 -1406 -6029 -6899 -5118 -4716 -2166 -5793 -2579 1741 -5388 -9294
21412 -9294 -10087 -5289 -3090 -548 -1818 1868 6956 7327 2361 -2076 -5552 -2387 -6012 -2383 212
21397 212 -5844 517 1491 -2042 6925 16164 8515 1774 -282 -9469 -18643 -18389 -16487 -19044 -18716 -13588
21381 -13588 -7396 -2335 -3924 -7041 -7539 -3034 -2310 -4274 -5096 403 4205 4316 3693 6883 8002 -15
21365 -15 -4397 1329 -1066 -4677 -13265 -15318 -13674 -13256 -15962 -6387 2319 -4703 -5261 -6027 -7922 -3886
21349 -3886 -1522 4023 13052 8085 308 -3019 -3395 -8850 -5025 -6826 -8952 -1218 4679 8426 7881
21334 7881 8141 17695 23586 19295 14550 8323 1217 -1747 -5507 -7997 -6135 -2372 12 602 -1121
21319 -1121 2544 5710 5196 1631 1357 -1683 -969 397 699 -3452 809 5195 3155 1382 1298 -1002
21303 -1002 349 -934 -1439 2218 655 -6249 -5407 -5764 -6543 -4518 2944 899 -4050 -10379 -4689 5164
21287 5164 8845 4900 3872 5523 2549 -2738 939 4815 3690 5635 3558 -9224 -14620 -10950
21273 -10950 -17739 -14830 -7179 -3651 -1679 -3900 -8335 -15194 -15167 -9005 -8798 -8498 -3701 -139 -6460
21258 -6460 -14480 -13929 -17869 -19184 -17557 -11791 -8377 -3654 -888 -2070 -11316 -9553 -3035 3204 4352
21243 4352 1066 -4254 -7087 -6953 -6747 -4469 4547 5386 1489 15 -1680 -6565 -565 5394 9491
21228 9491 9920 12068 7381 561 -611 -5888 -3881 -7051 -2067 -1275 -3818 -5685 -3399 -949 3929
21213 3929 2592 6933 -263 -8298 -7101 -7015 -9311 -7183 -9373 -6169 5846 9790 1487 11 -3024
21198 -3024 498 5633 3144 2114 2302 -4109 -4125 361 -412 3375 160 -4193 -2305 876 -3762 -4467
21182 -4467 -10612 -9199 -7063 -7813 -11889 -8016 -5679 -8892 -5559 -9218 -4050 4480 -3746 -7326 -1408
21167 -1408 6010 3170 -1751 -1775 -3045 838 -2917 -7812 -8747 -7629 -4747 -7701 -9469 -9268 -4165 -9914
21151 -9914 -12792 -10414 -8476 -2820 -2403 -1042 427 -1832 1951 6683 8369 8253 6371 -4627 -8856
21136 -8856 -8150 -4018 -5265 -2402 345 6928 2338 1004 419 -1132 -1537 3634 7391 10526 1659
21121 1659 -8141 -10621 -4250 4133 1934 -927 1876 1500 824 618 798 -9238 -12143 -9523 -8736 -3293
21105 -3293 -2360 -2109 6075 7833 5413 2087 -1954 -2571 -206 -2191 2132 -466 949 2831 869
21090 869 -4063 -2275 3260 2931 2738 3180 7328 11203 12529 5359 5550 5577 7974 -2244 -3455 939
21074 939 1896 2132 -1160 -4171 -9737 -22900 -20027 -12486 -9757 -5884 -2109 -2617 -1266 876 556 -4525
21058 -4525 -8587 -7031 -6569 2636 834 -298 -1533 -1911 -2961 -1027 -31 -6556 5679 9456 -4662
21043 -4662 -12072 -12687 -6255 4752 10833 10455 8051 -2706 -3361 -652 -1454 5877 6296 6500 -703 -361
21027 -361 -4567 -12018 -9171 -8190 -4233 1709 7591 3810 657 -3340 -4426 -2250 -7478 -7371 -2906
21012 -2906 -1702 -3276 -5282 -6135 -1423 1714 3133 436 307 466 1295 4392 6806 8477 12216 12335
20996 12335 13454 5488 3257 4095 -96 1646 9075 10071 6732 9144 15157 17012 12087 -58 -10659
20981 -10659 -7344 -6374 -7504 -11849 -8964 -7802 -8220 -5225 -6953 -407 5353 4707 4715 -1138 -6705 -12507
20965 -12507 -2400 162 4232 6410 4631 7328 15953 11480 4410 5590 8181 223 -7255 -8370
20951 -8370 -5552 -6024 -4181 -1747 -5782 -3309 4381 5920 5226 5338 7598 8093 7560 4506 2153 618
20935 618 3734 7784 6205 1958 5296 2747 4724 2574 2470 5908 7286 15767 13861 7559 5241
20920 5241 4128 2973 2404 -667 1792 -1340 -7156 -12091 -9327 -9857 -10896 -14362 -11622 -14980 -17101
20905 -17101 -11143 -6358 -5651 -4881 -3929 -4868 -3235 1154 8754 12435 12705 7657 -3882 -2644 6131
20890 6131 10639 13070 15848 16247 12862 8417 -2257 -1514 -734 5716 4473 7861 1248 -14225 -8995
20875 -8995 -1022 -6011 -11604 -16684 -19106 -12850 -13746 -16930 -10844 -4770 4403 2590 5348 6594 1522
20860 1522 -1004 -3032 -2465 -11392 -5167 -1046 -2111 -1829 -100 2025 4296 -1755 -4785 -4135 2624
20845 2624 7861 6350 686 2668 -2335 -5118 -8717 2157 -1901 2801 963 761 8047 10180 701
20830 701 -9966 -10840 -9029 -6858 -4955 -5977 -6242 -4392 6453 6755 -3649 -5781 -9944 -9883 -1086
20815 -1086 -2117 -1979 -3710 -1211 -10107 -561 4184 9480 3673 3496 4240 -377 -1096 2988 1120 4144
20799 4144 8617 8623 22 -9498 -13512 -13658 -8007 -3851 2048 3435 3015 -2182 -4035 -3820 -503 3573
20783 3573 3894 3403 -3313 -6602 1262 3686 254 -5290 -8989 -4738 -5846 -8710 -7415 -12567 -11458
20768 -11458 -16988 -16460 -17403 -9225 946 628 -376 -7581 -13258 -15301 -5428 529 -3600 -7819 -3308
20753 -3308 -2969 6939 7190 1746 -1048 1570 4264 683 -917 1596 3305 3832 -103 -941 -93 -815
20737 -815 -2162 2361 3728 5048 1819 -2943 939 3184 -489 1519 -702 -8311 -5914 -6303 -11657
20722 -11657 -11479 -4063 -7214 -14276 -15947 -12489 -7721 -3007 -5514 -10965 -8786 3007 461 -471 1595
20707 1595 4509 6442 9005 7943 10045 11170 10567 1976 4068 2851 2752 -5816 -7410 -1846 -1638 -1960
20691 -1960 -59 -6582 -5846 -1987 3738 6285 5579 -2825 -4680 -970 3829 954 -671 -280 -3516
20676 -3516 -9753 2076 5751 5635 3261 2929 3331 -1056 -2496 -3349 -5037 -3784 245 3121 -1281
20661 -1281 1510 5585 1884 3204 3467 4729 2134 -93 -1580 -3933 -7531 -5684 -7514 -3514 -1741
20646 -1741 -7937 -6770 -7323 -11614 -13229 -2072 8148 8242 3926 -858 -1459 -750 -4890 -8219 -9846
20631 -9846 -11508 -6502 -4235 -2918 -2084 -7088 -5801 4237 15046 15229 12796 4831 2904 1621 -2505
20616 -2505 -2018 -6566 -4764 10907 15030 12372 10190 9685 3840 -4633 -6276 -3791 -2314 -6157 -12064
20601 -12064 -9213 -7474 -6066 -3201 -1138 -4123 -2734 10315 9256 9602 13986 9164 9136 4678 -141
20586 -141 3137 7919 9514 13905 6181 2864 834 -942 -5632 -764 4358 -6033 -7381 -5658 -4332
20571 -4332 -2072 3585 4027 3062 -1369 673 3341 9716 8696 -131 4116 8720 12238 7501 7082
20556 7082 -880 -3925 3420 5252 -1680 -9117 -11879 -10485 -7175 -2528 -5684 -11805 -10481 -2759 -11
20541 -11 -3704 -5089 -2555 2391 -1004 -662 -8339 -9426 -6929 -5626 -893 1543 4078 3891 -98 -2160
20525 -2160 1256 1963 341 84 522 -619 -2909 -3774 2125 11214 15029 9452 4147 -311 -710 46
20509 46 3043 3023 5721 4073 4959 -2891 -4554 -458 4208 7561 3211 2743 -3911 -5339 -6339 897
20493 897 -648 -8549 -2855 1017 -6850 -12201 -9418 -5641 -1608 -355 -5063 -5790 -4802 -3690 -3004 2117
20477 2117 1323 4259 3411 736 2232 2613 4791 2575 -4906 -3392 -4565 643 3143 355 6193
20462 6193 15921 13078 6291 -348 -6169 -6490 -5050 -6901 -8139 -5987 -3286 -6963 -7398 -4699 -2830
20447 -2830 -4151 -2783 4885 4261 1994 2760 -293 -1752 5632 8805 6020 739 -211 763 1658 1977
20431 1977 720 4456 4727 6248 9401 5830 -1869 1771 6410 8534 10420 8014 4232 11741 12169
20416 12169 6200 5335 4634 8810 11966 9046 -1072 -3854 -3944 -3221 1216 -5122 -8567 -5592 -4932 379
20400 379 3679 -1885 -1095 -1770 -2603 972 -629 -4423 -4814 1061 -60 -6475 -7291 -3510 3257 1046
20384 1046 -6399 -4755 -7948 -12495 -15143 -10865 -4202 -6629 -3331 240 3436 4750 -1521 -2031 -1321
20369 -1321 961 7135 11529 9878 6860 10722 15688 14266 5659 248 -2357 1608 1217 -57 1424
20354 1424 1582 -1675 -740 -3596 -4126 1569 3119 570 -2517 -931 4224 5826 6460 7378 -1378 -4897
20338 -4897 -6993 -259 -176 -5858 -2897 6525 6448 6153 5504 3675 -2291 -4184 -7196 713 4859 6601
20322 6601 6926 4128 5706 280 -2499 1933 498 4527 4377 826 6559 11701 6878 0 -6759
20307 -6759 -6448 -5077 -180 1924 2340 1400 5632 4455 1273 5452 2390 27 1911 818 1473 1755
20291 1755 5507 2835 5981 6398 11556 14588 15551 8019 3662 7998 11697 10279 11450 10529 7796
20276 7796 4829 3049 5050 4170 -80 -3160 -5208 -5113 1895 9001 14077 13820 10358 5325 5779 5985
20260 5985 173 -1912 1202 -2670 -4083 -2574 1751 3765 6541 7465 10648 18905 25985 37180 38582
20245 38582 38231 54006 83455 133720 210428 258197 242033 186725 136908 108206 82608 61967
20233 61967 53438 39313 30085 26860 21826 17626 17894 13778 11907 15381 14531 6349 -750 565 -1380
20218 -1380 6909 15196 21787 15535 11044 7233 -2413 -12062 -5662 982 8896 11218 5944 -676 -1857
20203 -1857 3014 -788 -676 4051 12069 14554 17800 21475 21109 26430 36352 36689 43121 53567 64774
20188 64774 78702 104617 154024 227553 271745 251010 195254 142858 105165 86355 71831 54043
20176 54043 45083 37202 30968 25227 19292 11829 5722 5375 7297 6162 7741 4814 937 5346 10731
20161 10731 17095 9591 12916 11848 13324 12131 16336 11334 7355 8539 14928 14699 14049 9609 7160
20146 7160 4594 3910 7234 6277 8251 3163 261 -1381 2599 8694 7330 8366 7051 3260 7473
20131 7473 12605 6333 10434 12133 1626 -405 4871 3801 1917 5697 7383 4527 5166 12452 17943
20116 17943 11787 14102 12568 11102 4882 1152 -2329 2231 718 -1409 3034 4465 12767 15773
20102 15773 22486 22758 22553 26555 14436 9198 6790 9826 14917 12701 11132 3934 7194 13556 17291
20087 17291 13907 3823 4715 3908 -285 5609 3567 3507 3911 1205 4776 9752 16448 11444 7743
20072 7743 11830 18240 21038 25410 22724 20221 16607 16447 15674 9638 8724 4813 6465 3067 4269
20057 4269 5311 669 -89 5063 4417 841 261 2854 9428 16300 17616 14612 9557 4293 6944
20042 6944 3428 -1771 1883 640 5726 4755 -2155 -1141 -265 -639 1692 2821 1642 -3187 -3502 7683
20026 7683 10118 -78 -5409 -3897 -4356 -4965 224 10077 7205 17218 17867 10524 5850 -840 191
20011 191 2410 4828 9549 9613 6827 6563 11278 16712 14894 11228 8752 10689 5016 8644 14211 15199
19995 15199 12861 11904 19415 21288 16293 14891 8474 3696 12669 16074 18697 15788 17790 19639 26759
19980 26759 26330 16928 10107 10093 7811 7599 10271 13689 17589 15470 14834 11463 6273 14251 15781 12696
19964 12696 17651 22526 23427 14046 8477 9119 15073 23757 30130 30859 23497 22744 21548 11221 9714
19949 9714 16723 24942 19733 19579 19156 23209 29233 25067 26221 28827 26541 36016 38774 32389 22270
19934 22270 19375 16867 15020 17221 21357 21974 24467 20439 14718 8314 15369 19111 14975 7870 6392
19919 6392 8753 7028 14222 21763 24753 28636 28032 26633 20179 21698 31853 29040 21825 17551 17557
19904 17557 18982 7020 -2739 1334 7388 6751 -2141 2841 15425 24857 30334 38286 42182 39604
19890 39604 38943 38455 32660 26686 26041 24214 25928 32631 35888 36940 39774 41665 36892 29412 33190
19875 33190 34294 31325 28369 26589 20592 18987 20115 21199 17500 17804 22577 20739 21157 21222 14757
19860 14757 13310 18625 24430 21843 23856 26664 24536 23812 26863 25155 32112 38412 37090 23417
19846 23417 25120 22804 23940 32718 36268 36733 48811 74087 98352 114489 117449 106416 88412
19833 88412 77335 75151 75213 64555 60976 66024 67661 62395 52971 54522 65264 65853 58197 62194
19819 62194 73642 87809 102675 113656 121847 139622 169454 216726 299515 463643 721112
19808 721112 921292 877449 694088 511607 387962 307826 250352 204623 172459 155903 138185
19797 138185 120667 111442 107843 97025 81402 82186 87275 89407 90967 93209 93792 92156 100162 109923
19783 109923 124339 140852 152457 153136 145606 131875 115267 95856 100646 105015 112087 122021 125034
19770 125034 119339 107038 100639 104637 111177 117236 125281 141422 166503 181652 184457 198691 219845
19757 219845 238697 273995 316017 398685 558332 825456 1069293 1065118 905283 719980 578906
19746 578906 498423 454185 429022 424986 449953 512161 583610 590238 556041 513599 492773 488369
19734 488369 501246 525816 564225 620587 707077 803147 839713 834295 833015 853108 894640 950360
19722 950360 1034877 1148636 1286276 1454715 1675185 1949605 2269039 2640185 3080604 3583254
19712 3583254 4136257 4797572 5741071 7204391 9589551 13860242 21909112 35127356
19704 35127356 47069070 46723642 37907794 28105318 20599939 15433055 11699012 8816223
19696 8816223 6709350 5242120 4237608 3520475 2951898 2492510 2128977 1861267 1659080
19687 1659080 1504521 1400824 1362469 1346272 1287189 1214786 1173033 1182258 1183984 1135735 1074601
19676 1074601 1036820 1030994 1072646 1144008 1184666 1204603 1247407 1335582 1399791 1416902 1432538
19665 1432538 1477404 1578628 1734639 1941134 2199204 2518025 2897607 3344644 3862376 4454485
19655 4454485 5166244 6173155 7728523 10285778 14881515 23515487 37505278 49601299
19647 49601299 48645041 39192799 28959264 21199375 15863196 11982360 8983512 6811195
19639 6811195 5289130 4235730 3488215 2888696 2394547 2004255 1707977 1477892 1285398
19630 1285398 1121754 992994 882772 805557 768644 768679 795769 783935 705163 610205 521940
19619 521940 455244 413958 391485 394466 409057 456001 514748 522556 469590 406159 346775 291125
19607 291125 252579 224888 202027 181001 172601 168381 164954 159194 153244 148396 137991 129389 122813
19594 122813 112648 112893 107840 100291 100521 101324 112754 118540 127182 126336 117659 108988 100744 96164 95607
19579 95607 85343 79692 77756 73990 76194 76158 73207 50687 25618 2108 -13221 -3601 6154 10714
19565 10714 21655 28544 36615 30759 28459 29277 28598 26857 26582 26692 28399 26558 19973 16657 22010
19550 22010 26659 28075 25261 30405 37318 42526 39547 42116 44757 44901 37954 28946 25458 32511 40750
19535 40750 33631 22512 19805 25553 41492 40867 38408 29184 33954 38686 38399 22908 15482 2877
19521 2877 7796 19669 19412 16335 10246 -3086 -23226 -43692 -40656 -31949 -27703 -12402 -479
19508 -479 6009 12836 18811 25789 20720 12310 4787 9566 10490 12380 14823 17312 13372 12527 15315
19493 15315 12337 18458 19488 19050 16662 18867 17501 16704 11775 9118 11474 10828 7170 8626 15065
19478 15065 9189 3943 1429 8757 950 3331 6045 4235 3350 2054 2278 801 4084 950 -5570
19463 -5570 -6448 -10586 -10487 -13692 -23106 -27708 -23293 -8669 6134 7526 2224 9065 12962 14100 19524
19448 19524 20185 11436 6258 530 -3775 -5236 -6553 -6660 -6783 -2884 3357 6021 6445 7435 -582 -1219
19432 -1219 6872 14830 17688 16423 17234 14583 4655 5361 -2328 -11178 -3274 2832 4872 -2766 -3155
19417 -3155 -79 2994 -927 1374 5524 -1152 2635 6086 -965 -3031 -5390 -8369 -6440 -4615 -4484
19402 -4484 -5891 -7519 -265 461 -3672 -6973 -12183 -13298 -18088 -22973 -10154 -4284 -3331 -5226 -1722
19387 -1722 -5191 -9060 -12278 -12891 -10605 -11278 -5197 212 -1407 -3229 -2854 -2354 -2573 7786 3716 6857
19371 6857 8247 6888 6458 -5062 -5210 470 3554 9770 4659 3862 4482 4019 2495 4125 6761 12864
19355 12864 18202 10805 3517 4184 9259 12629 10708 10323 4728 1993 -4324 -2591 -4781 -2802 -5108
19340 -5108 -4659 -11624 -9988 -5377 -1909 6480 7211 7753 8466 7027 4722 -1179 -2212 -1951 -2810 -5649
19324 -5649 -5571 -7061 -5218 -1120 3135 5157 13790 16622 12254 6146 741 5750 6992 4488 11247
19309 11247 6147 -2556 6266 7634 -8467 -11607 -7652 -2429 -4741 -150 7910 5833 -1242 -10743
19295 -10743 -11599 -4110 -3167 -10626 -18151 -18360 -10393 -5821 -9951 -6750 -58 1813 7190 7035 2641
19280 2641 443 -4096 -5380 -1544 5776 9734 9333 11021 892 -3301 3776 2448 -85 1805 2678
19265 2678 6870 10177 7608 1933 -2649 720 -3637 -3275 464 -3358 -6606 -3759 -4942 -12174 -14721
19250 -14721 -7924 -15161 -14788 -13584 -10601 -2910 -217 562 1049 43 -1565 4481 9481 3832 -2335
19235 -2335 -3030 1830 -785 -6681 -4629 -2122 -2529 -851 1897 7228 14581 8503 6784 3632 -2839
19220 -2839 -2113 1148 -2208 -2048 1442 3495 4845 -2215 -5594 -5839 -5226 -99 4020 -1669 -2941 -1722
19204 -1722 1752 262 2555 2706 2578 -3329 4178 4292 4637 1799 -2168 -9385 -13043 -13305 -4047 -2961
19188 -2961 -8054 -10594 -8033 -7266 -12251 -7284 -654 3078 6660 7013 2604 5651 7964 12620 18608
19173 18608 27673 29728 31203 38030 33387 31015 37366 62878 94174 137642 199413 249016 242721
19160 242721 201330 156945 115005 82579 59566 34775 20659 12631 8732 13615 14765 16310
19148 16310 11300 10345 8626 6351 459 670 4027 -792 2360 2768 4094 5497 11111 3797 -3109
19133 -3109 -8716 -10081 -11793 -10466 -1949 869 3224 7199 13245 10957 8749 -404 3116 1774 1798
19118 1798 6994 9734 10640 19792 28944 29544 31320 45848 60610 93290 139373 203860 262663 259308
19104 259308 215528 161368 116563 86494 69050 51418 36878 19952 15573 7818 3503 6623
19092 6623 9297 6494 2834 2531 975 6565 6466 3780 6553 9291 10675 11622 10558 6854 2093 524
19076 524 5440 5495 -1465 -609 -3733 -2225 -1206 -2457 -3247 1939 3033 5687 9159 10973 15272 11677
19060 11677 1381 252 6558 6596 -7193 -12096 -11777 -14617 -23574 -15444 -8274 -6048 -3191 458 -4862
19045 -4862 -1827 4284 5591 10841 9958 2191 3444 -804 -4502 -7670 1274 6212 4179 3616 -3897
19030 -3897 -1027 4930 4448 189 -4266 -908 1749 3814 2896 -2015 -6406 -5163 3470 -6001 -5091
19015 -5091 -6083 -6770 -1834 -2091 -3119 1452 -3090 -6173 -8336 -2037 6041 5611 1931 2866 9400 10821
18999 10821 10563 9152 10194 4573 -377 -7182 -5966 -8009 -8864 -1894 6488 3433 -2578 -78 543
18984 543 1038 -2115 -1244 -7438 -7013 2694 1337 -15874 -17699 -13138 -9595 -4951 -2284 -2387 -7108 -11524
18968 -11524 -10105 -2332 -189 1381 4947 7946 -2270 -12721 -11774 -12264 -14554 -10683 1862 14081
18954 14081 17109 16477 11751 399 -1597 -1057 -2112 -3833 -7854 -4782 2635 5160 4332 2747 7496
18939 7496 7737 5355 -1350 -5635 -8853 -9772 -783 5985 3913 2639 2178 779 3653 6526 1940
18924 1940 523 3642 6974 943 -4627 -6203 -6889 -8913 -9860 -4707 -100 1216 -5311 -9562 -13565
18909 -13565 -14050 -10063 1377 -2821 -17761 -18998 -14468 -11739 -6997 -1382 -2559 -7623 -1780 -24
18895 -24 -459 370 -1117 -6712 -4790 -2094 4126 1847 -1448 2997 2204 643 1032 1932 -3885 -5614
18879 -5614 -1927 795 -7001 -11461 -7166 5067 1194 -4454 1925 -287 -10571 -16248 -25040 -21313
18865 -21313 -22204 -21950 -16391 -13060 -9820 -5531 -2295 -7077 -6909 -6916 -4284 -1582 4695 3180 -1580 -2841
18849 -2841 -7338 -5649 2104 4834 8410 9837 7023 5898 9029 7664 3265 -1598 -5897 -4825 352
18834 352 -5016 -11374 -10309 -10006 -6325 48 -3268 -5635 -1703 5121 2702 -6377 -10101 -12016 -6108
18819 -6108 -7959 -13185 -17284 -20624 -14634 -11356 -11894 -9435 -7699 -3236 -353 2249 3085 -840 8282
18804 8282 6580 4 -9778 -12604 -17660 -13974 -6406 -5187 -3267 -2373 2150 4956 7000 4361 -2464
18789 -2464 -5784 -1774 6492 13702 13753 1614 -12907 -10619 -802 2928 4136 5393 -1568 -730 -1006
18774 -1006 -6352 1833 7410 13630 14087 18072 27315 48302 73743 79010 66425 43806 28451 25603
18760 25603 25581 30304 26833 18095 12708 8215 -1961 -2854 -6529 -1097 996 4967 8377 10916 9045
18745 9045 3791 -4588 -6096 -13531 -15834 -13119 -9566 -6256 -8659 -5248 -4794 490 -425 115 2015
18730 2015 6560 7956 883 -1048 4518 3863 -6249 -10513 -13208 -10369 -2000 8485 8434 10245 4852
18715 4852 -569 -5317 -8151 -12604 -9922 -6231 -2088 5300 5861 1306 -1551 2694 2339 1060 409
18700 409 -8806 -7687 -2951 -3532 -4158 -3130 2327 3629 2055 -4582 -1641 5136 3876 -851 -2443
18685 -2443 -8670 -8323 -3094 1306 -556 -7604 -5239 2731 605 -710 5207 9045 10769 -3362 -11411
18670 -11411 -7680 -6756 -2191 -7053 -8219 -6871 -6500 2540 7675 5647 -8112 -12476 -11960 -12292 -8830
18655 -8830 -4270 2211 7448 77 -8991 -8470 -6795 -7166 -12257 -13576 -9100 -7233 -4128 -3164 -2941 -4825
18639 -4825 -3871 -9785 -990 8196 8397 -323 -6671 -11219 -12910 -5720 -3556 -3945 2899 3461 -6670
18624 -6670 -10506 -11531 -9578 -7064 -4921 -4095 -3460 1737 1490 -2065 3101 1448 -1843 -4648 -5738
18609 -5738 -8743 -6129 -5781 -16917 -18716 -13080 -8221 -3878 333 433 2236 -8005 -8623 -8021 -1742
18594 -1742 -2972 2061 -1130 2510 5101 1905 2235 1372 3217 1540 -369 -8652 -4805 -3957 -2533
18579 -2533 -1640 -373 1066 1596 -7328 -8076 -3612 1141 2510 6098 7352 8514 7766 -447 -855 -2084
18563 -2084 863 164 -4252 -4312 -2523 31 3086 5278 9598 -1940 -2335 -2843 -7588 -11768 -12213 -6284
18547 -6284 4055 12891 12744 5725 4289 2676 9217 2742 1382 10984 12422 2718 -2844 4804 8917
18532 8917 7125 4044 2430 1971 -1039 -5715 -6187 -5465 -4944 872 858 -2173 -184 -7278 -4681 -77
18516 -77 -3231 -8197 -6621 -10689 -15106 -12299 -2235 -3605 -12174 -6715 -4771 -12594 -8247 -6742 -5190
18501 -5190 -6851 -11548 -8275 -7318 -1021 3926 4259 713 3187 5314 5378 -3384 -4915 -5509 -8454 -4746
18485 -4746 -2827 -1328 -2184 1185 3984 880 -5770 -8048 -10130 -11693 -7086 -3567 -2483 -9191 -11520
18470 -11520 -9639 -3558 -2501 1873 3547 1073 3612 599 1092 -539 -5956 -6285 -1629 8474 7668
18455 7668 -1268 -5858 -3732 1689 12918 16787 11328 7387 5706 5487 214 -1643 -6755 -9142 -9961
18440 -9961 -2393 -1267 -3806 -2964 -6287 -2114 1263 -1183 -2951 -952 2481 657 -4681 -4913 4238
18425 4238 10007 2542 5589 13736 9261 -1717 -4949 -5803 -2942 5725 11747 8345 9566 5547 3880
18410 3880 5186 7353 1699 -2267 -788 2859 7308 11401 16181 13966 7817 6266 5487 5942 6929
18395 6929 8199 3163 -326 1530 3812 11473 9481 3595 -4637 -7453 -1123 2579 1686 2620 4966
18380 4966 5081 -1614 -4335 -4231 -2170 7178 12183 9459 6079 5951 1173 -3429 -8844 -4410 2091
18365 2091 6759 3419 5138 4262 4116 750 2538 -2607 -7670 -3153 -7784 -11720 -8700 -6725 -3030
18350 -3030 1052 4069 3252 11548 11117 11293 7416 6320 10939 8850 10534 10181 4210 2933 1923 5009
18334 5009 3659 4539 8150 13230 7308 6475 787 -2197 6041 3643 -703 -4575 -7830 -8948 -7673
18319 -7673 -1643 2940 7055 7638 6886 207 789 -2991 -10359 -4856 2048 -2878 -6252 -7081 -9464 -8789
18303 -8789 -6124 -1141 5702 -949 -11616 -11615 -1944 12780 15481 6887 -2875 -10024 -16964 -9199 -9496
18288 -9496 -15359 -11410 -4142 -8671 -11342 -7121 -4376 -1235 2278 5255 5160 5681 516 -2652 1582
18273 1582 -1711 -3851 -2407 -2630 2816 7027 10694 5665 4716 4080 -929 -6403 -4139 -6905 -165
18258 -165 1791 2541 -2560 -8242 -7190 -308 1680 1215 -4911 -2649 -2580 -6858 -3792 -1161 2692 5580
18242 5580 10743 16917 17144 15805 10144 60 1209 7109 4714 235 635 7979 13970 10512 12099
18227 12099 8410 6612 7058 1235 -3646 -1082 2945 3814 4404 8773 11278 14211 22450 22677 16903
18212 16903 11093 3713 423 -4220 -9153 -11369 -5647 1258 4876 1248 3756 3738 -1684 -2933 6143
18197 6143 4909 12913 20225 16758 12018 12459 6658 5936 12145 16979 9263 10144 7418 9705 8383
18182 8383 12861 15540 5672 3907 5479 -2 1669 2365 6540 8733 15457 19766 10704 7012 11619
18167 11619 13371 13268 8300 13435 16843 17359 12656 16573 21651 21933 22234 20611 22933 21094 22097
18152 22097 27571 30142 31396 31238 38640 41873 43018 44387 43563 41730 40846 47403 55588 59161 65326
18137 65326 71179 84800 85288 84909 87416 96925 110288 120604 134125 156087 170265 189014 210303
18124 210303 240241 285697 337412 402586 470200 546093 629631 723992 821594 943943 1124503
18113 1124503 1409092 1871065 2689553 4375274 7783218 12250442 13287775 10815004 7784778
18104 7784778 5483009 3998058 2968017 2165300 1582842 1187976 903083 702259 569458
18095 569458 471820 395584 333190 285138 242173 216316 193028 166078 148542 134579 119170
18084 119170 110038 104776 91821 77388 65165 60192 59562 55668 51154 43535 41171 40013 37429 34631
18070 34631 31921 30244 31268 31924 30894 23349 18411 17013 18357 13214 13892 16706 15578 16064 16488
18055 16488 15010 13206 13027 5398 7545 10263 13557 12105 10250 12384 12843 16836 15271 14575 20031
18040 20031 15710 10381 13511 21106 22552 19883 18415 21429 18945 15356 22300 25045 20552 8599
18026 8599 -2454 2432 5527 8400 12249 8063 12946 13858 10599 7944 16383 15843 12012 10727 11045
18011 11045 3927 4949 8566 5552 5057 9350 9114 13216 8032 1802 6580 4124 -602 -3234 -1782
17996 -1782 6161 5782 7579 14292 17118 16173 20901 27434 27730 22148 17595 21678 12927 1468 1436 4022
17980 4022 7868 6328 10847 7373 -4451 -9466 -14957 -16447 -8821 -11099 -13885 -9951 -1615 2693
17966 2693 1603 786 2499 3772 8101 12144 13627 1372 3549 1886 -4846 -8029 -336 8405 6848
17951 6848 -1163 -701 4836 9085 5113 806 -8449 -4737 -776 1093 -3727 -3932 -6485 -3221 6928
17936 6928 12173 8156 9724 9743 11408 13511 7986 6328 1819 2859 12530 11575 8756 5741 4307
17921 4307 215 3306 4425 2126 11850 20861 26945 27092 28649 39188 51822 82416 134458 208193
17907 208193 277971 273912 228323 174592 125273 91830 73224 62703 50797 45772 34255 26192
17895 26192 22558 14163 9578 10672 10084 10293 14784 8016 3036 5978 12005 8013 3984 1690 -5890
17880 -5890 -3894 5944 15552 15745 14242 7541 6465 12733 9916 10632 11061 8391 13772 19471 18389
17865 18389 16329 9887 6319 15816 23119 18656 21467 26162 31343 36942 50262 78947 126783 202414
17851 202414 269991 277024 229743 168239 123092 85008 58886 49333 37249 27051 14661 8816
17839 8816 8868 8563 11036 13104 17118 13671 7941 314 -3412 -6025 -3567 1141 5796 -160 -9035
17824 -9035 -12794 -8866 -8622 -9781 -8326 -4247 -469 -4642 -278 2471 -264 7224 3416 -5202 -2112
17809 -2112 5842 296 -304 7474 9121 6129 4398 2784 5610 5998 14042 17459 15627 16937 21409
17794 21409 24870 21238 12676 12096 7534 -2881 -10071 -7176 3950 5863 8149 8049 8110 3915 9036
17779 9036 8589 2270 6888 4430 2451 2844 1453 -4882 -14638 -16973 -18512 -17668 -13038 -8820 -304
17764 -304 2902 -2905 -5220 30 -2957 -6250 -2645 2060 6505 -223 -1732 -1109 -1393 457 9659
17749 9659 16199 9608 6391 5293 2758 3196 1053 4665 5655 -904 -7703 -7547 -3264 -3208 -3933 -7572
17733 -7572 -4935 -4639 3156 3966 337 -767 6849 7846 9382 12051 13361 9674 13252 10482 13727
17718 13727 10322 4297 11054 8994 350 5727 5922 356 -2521 -577 -3662 -2301 -7279 -2809 1556
17703 1556 5304 2854 -2882 -6365 -13977 -17409 -16074 -16224 -13455 -13148 -6672 -4750 -4135 -8756 -9402 -7591
17687 -7591 -5413 1596 4762 5756 4392 5454 10038 12110 3135 1133 2215 6797 10559 7099 4075
17672 4075 -4308 -12364 -7114 3559 6696 11496 10878 14775 13360 11277 10465 11248 16519 16332 5457
17657 5457 1485 -136 2722 7900 10083 15247 15703 17747 8306 189 -466 2400 -367 -789 -258 1879
17641 1879 3861 4165 -1810 -9424 -677 -431 1771 14266 17218 13381 6721 3494 8103 15318 20076
17626 20076 12237 7288 13385 5695 3012 6596 7693 13351 12581 14466 16455 19599 25469 28657 29028
17611 29028 18432 13451 14287 18148 22259 31436 27544 26266 24227 20144 18089 15521 21301 33930
17597 33930 27043 15270 11708 10896 5937 100 905 5738 6334 6593 2025 349 2968 8277 12580
17582 12580 14423 18999 17721 13364 3292 -2185 -2171 3251 6779 10990 8906 12390 20963 15852 7262
17567 7262 9955 9124 6049 -3294 -13945 -11381 -10425 -8459 -7399 -3637 -5068 -5953 3942 18718 31468
17552 31468 32667 22167 21852 26212 22669 18192 18422 16042 20010 23818 25309 23897 18156 13313 12633
17537 12633 7895 11850 14293 15058 14758 13871 18082 15362 7365 7641 5944 4959 5516 7115 19036 23514
17521 23514 19427 19805 11700 9745 14893 17262 17701 16136 19064 20236 23105 28444 30253 23549 14831
17506 14831 14459 22072 18629 13853 12286 20785 35460 57174 76769 103758 117796 112402 95882
17493 95882 75921 56809 39410 37765 44618 46998 51330 46664 40674 35514 39201 36897 24523
17480 24523 21551 24503 38645 45952 45076 37189 42518 47757 42062 46696 51212 46265 38214 31830
17466 31830 21956 19560 20774 27824 42745 48526 50227 48449 45973 45000 41669 46972 51682 51346 50748
17451 50748 52022 62675 67172 55702 47766 49226 61595 80396 109011 153382 186897 184698 159721
17438 159721 127277 98296 80574 72592 77779 89497 94778 90344 77554 72383 65096 60147 67598
17425 67598 73719 74146 81142 94171 106248 109356 113943 122434 124249 126061 116510 120714 124971 130306
17411 130306 133251 133236 139678 149661 153807 172899 182767 195526 205751 216118 225097 236128 249919
17398 249919 272326 293366 310786 345173 391618 452379 539320 662611 750345 737384 690763
17387 690763 668766 674570 703031 749312 820085 894743 975109 1091735 1245442 1436096 1667734
17376 1667734 1963361 2301788 2668392 3052198 3497869 4061375 4821731 5995501 7897262
17367 7897262 11034087 16776750 28193333 46175546 56395758 49710001 37469319 26945647
17359 26945647 19785176 14908879 11158775 8240864 6190026 4754938 3723952 2988041
17351 2988041 2460458 2086974 1812401 1597185 1413382 1256800 1132949 1028111 941795 887870
17341 887870 855899 849445 874916 933046 1035241 1126215 1173493 1163746 1079168 991345 938319 921597
17329 921597 926910 952038 995044 1043664 1112625 1208011 1336326 1506743 1732265 2005733 2313803
17318 2313803 2650213 3013871 3430750 3967046 4704680 5852733 7704971 10764982 16381519
17309 16381519 27550612 44807574 53874187 46970442 35202919 25268932 18545636 13946574
17301 13946574 10394374 7653344 5723400 4373312 3411397 2711591 2213911 1856650 1582439
17292 1582439 1360772 1172339 1026746 906596 794571 706317 644105 605816 573272 559052
17282 559052 578287 630884 628498 556155 465896 391620 344076 306662 284244 264028 247307 237516
17270 237516 226345 209383 180055 152279 146776 148717 155114 152586 143026 133672 129389 122217 125862
17257 125862 137440 137189 139776 140639 133423 131715 114761 93301 82856 87849 102938 109649 111242
17244 111242 103699 101421 105599 105352 99915 85973 75855 65496 63895 64676 68798 64150 60271 40727
17230 40727 14244 -1112 -5184 -10509 -9015 3071 17348 32089 41044 39416 35331 39424 41753
17217 41753 42661 36515 27180 29969 27102 25800 25328 31302 28939 40241 49899 50093 52281 57417 64446
17202 64446 52194 40706 35924 35896 31720 30929 33195 32911 17073 11683 12258 24062 36894 36861 32420
17187 32420 32299 36878 27358 13813 13905 8318 9404 11184 20620 36344 31601 15350 -8870 -32949
17173 -32949 -43908 -48137 -45661 -33201 -11689 11062 21826 21658 20731 28502 33656 30137 19814
17160 19814 16441 14542 17554 13739 -369 4037 10418 15670 18701 21561 27637 31909 25286 19165
17146 19165 15405 14393 20962 20216 23600 23780 17304 11894 9174 10675 13580 13933 14993 15098 11457
17131 11457 6256 964 -711 3179 8424 10760 9488 816 848 5456 6456 5580 -5918 -9252 -8430
17116 -8430 -1488 4842 8686 14183 18862 18663 12588 10072 13996 15419 11371 6181 8201 17167 15039
17101 15039 16238 15221 6859 2449 7173 17558 23661 21995 12413 6155 9767 13213 16873 17658
17087 17658 23003 24002 20170 17517 22660 20283 18907 19253 21308 19235 13516 7667 -806 -1472 2351
17072 2351 5661 5770 1390 -3144 -3970 -1882 3025 5255 6767 16403 12509 7487 7175 7918 1442 -306
17056 -306 6266 -479 -2623 486 3127 3432 1846 7811 9836 10119 9500 15359 17741 10871 9368 10493
17040 10493 10322 7282 8260 3341 8059 14841 8865 5189 905 4103 7132 10752 6734 4113 3856
17025 3856 2069 1829 -354 3616 5063 5698 5052 7221 209 5890 12840 15600 6021 -133 4002
17010 4002 14 -10689 -13156 -8684 -5217 -3920 5701 8813 3574 990 5126 -1742 -15197 -11138
16996 -11138 1273 8993 10619 11745 7807 11388 15580 17678 9072 5159 -2030 -5787 2440 6833
16982 6833 6796 5223 -5100 -13784 -7492 456 1902 5832 5656 5447 -3687 -4259 -1334 -3837 -5812 1036
16966 1036 6011 -2242 -2641 -1281 -6181 -7481 -4691 -2934 -1728 3280 6386 3092 -3039 79 -152
16951 -152 1165 9007 9380 -681 -3519 566 -2629 -6310 -7796 -413 -571 -5911 -6061 1539 9793
16936 9793 9389 13953 19621 12757 3459 2130 -816 -2834 25 -798 -3131 1758 4127 2007 -4080
16921 -4080 146 3091 -83 -22 681 1411 5809 1975 -7356 -5503 3125 298 -4241 -7662 -8028 -8723
16905 -8723 -4881 1463 4756 9324 17930 18369 16219 6469 4180 5887 7495 12406 16445 22597 20187
16890 20187 5105 -3605 10300 19461 16053 7156 551 -3 4946 5435 8117 12574 15652 17478
16876 17478 15877 16472 23853 38579 49467 58669 62783 65628 68840 82039 93595 110651 147285
16863 147285 211300 326404 546937 843030 960750 826981 619522 440932 318977 242245
16853 242245 186311 135722 102485 85778 67550 51153 39779 27668 22882 27794 26764 23341
16841 23341 22633 24457 21681 14173 14157 19027 15149 18806 24666 24624 25720 22858 19159 20817 21615 25645
16825 25645 23841 22017 29790 35202 41122 54024 71069 86944 114578 161874 237268 321286 329655
16812 329655 286627 237802 207112 187869 183668 200445 240371 332519 514044 782046 926328
16801 926328 824856 631325 462753 337774 255578 196570 151600 118118 92302 73859 63811
16790 63811 48922 31190 20151 19268 22564 27798 28341 25239 28569 28262 19159 14132 9221 11738
16776 11738 19906 25098 16398 9932 11099 4498 4939 11835 20893 25888 30024 28688 29846 32519 36160
16761 36160 61685 110107 189164 268885 275166 223734 167886 117180 87047 61772 40684 26415
16749 26415 14647 15761 16385 14396 7570 3615 3035 4317 4502 -1683 2847 2419 10212 8475 6791
16734 6791 2439 1928 7372 13133 17712 16773 15410 9739 7004 3109 -865 -2363 -2199 2760 3960
16719 3960 4096 4886 7187 5549 4238 1609 3514 398 -5301 -3912 -5310 -7355 711 6466 6640
16704 6640 8858 6230 -576 -4173 -2911 -872 2122 8526 8972 2705 2312 -4499 -7646 -8943 -12960
16689 -12960 -10058 -1448 -2878 -13907 -14545 -8977 -10664 -20908 -27452 -20173 -3179 2828 4282 1534
16675 1534 -1090 73 -10831 -12623 -8039 -11250 -19572 -16246 -9226 -2722 -2092 -4790 -2268 -282 -3629
16660 -3629 -4862 -11441 -11051 -7972 -12071 -6664 2484 3985 -589 -369 2438 -11152 -20067 -17959 -17796
16645 -17796 -17768 -16714 -12552 3587 4904 6257 9303 7446 2171 -2827 -4962 -654 1850 3806 -3740
16630 -3740 -8058 -8855 -11340 -11187 -6519 -5747 -3475 1235 944 -816 -2140 831 1134 978 2923 3043
16614 3043 6366 3646 5709 13344 6931 -3589 1501 3042 1564 -187 -371 5217 6603 4932 6223
16599 6223 -75 -7322 -8830 -10211 -13433 -5242 -4029 2560 8058 10780 14357 10710 709 -4987
16585 -4987 856 6719 3213 2742 1947 -3878 -4614 1069 2976 394 -1363 -348 -898 1604 1705 3611
16569 3611 -6559 -9986 -16588 -20812 -19950 -16858 -13324 -12140 -2921 -3965 -7425 -2093 5138 1633 -6693
16554 -6693 -7594 -2292 1471 2574 9223 8264 51 -9637 -11876 -9225 -14056 -18251 -17043 -14922 -13656
16539 -13656 -20509 -21444 -18084 -12352 -12098 -5405 -4068 -1602 -5429 -11752 -8155 -2934 -292 626 -6276
16524 -6276 -4575 -3330 -517 -196 -6699 -6011 -7162 -7408 747 -86 4481 11135 4323 -1234 5087 8985
16508 8985 4961 1943 -5833 -1769 6156 13593 11221 6616 -3933 -9552 -4412 1945 6832 8214
16494 8214 12781 12305 7443 7316 7593 -317 -8156 -14073 -17359 -14766 -8286 -1811 -3934 -5986 -4427
16479 -4427 -3617 922 5063 9136 10351 6445 2214 1877 -998 -9259 -12795 -13164 -15738 -17695 -17087 -12078
16463 -12078 -13628 -15375 -12149 -2580 -6304 -4755 3196 6826 4161 2235 10565 8439 683 -151 -2099
16448 -2099 3070 3474 2393 1925 4490 9735 11514 7136 10967 7719 3485 1549 -4165 646 -94
16433 -94 -1896 6728 4715 1538 3136 4162 7365 1181 -4075 131 3671 -1264 -452 818 342 -3606
16417 -3606 -619 3034 1667 4418 4991 -2129 -8562 -10216 -7748 -9431 -8526 -3627 -3520 -7773 -801
16402 -801 -2465 -6967 -8234 -4268 151 1121 -7118 -17503 -13926 -7961 -3966 -1505 -5660 -3637 -5938
16387 -5938 -4431 -1805 193 3409 7881 2089 -3570 546 -2967 -3914 -3410 -3316 -6871 -8407 -10176 -12125
16371 -12125 -9475 -7003 -11196 -15864 -9750 -6021 -5548 -9942 -8272 -1303 3603 6755 7367 -4320 -6438
16356 -6438 -4766 -4613 -9163 -12787 -13557 -12839 -14293 -17452 -10452 22 2141 383 7570 8857 895
16341 895 -4063 -3673 -6428 -6145 -5761 -6939 -6977 -5345 -5824 -3494 -7532 -10427 -7664 692 6097 7370
16325 7370 1386 -5255 -4668 1153 5934 6916 3806 2334 -1014 -5458 -3982 -6792 -9008 -1548 262
16310 262 1404 -2583 -1235 -8275 -8466 -1989 -4964 -3729 -2781 -2332 -3629 -4287 -4618 -11204 -11048 -1563
16294 -1563 -1473 -2464 -1928 1638 2899 -726 -9331 -8752 -8306 -9222 -7856 -10952 -10997 -8196 -10174 -14361 -15744
16277 -15744 -12612 -9742 -10578 -3877 5220 7754 881 -7782 -3826 609 7612 10110 10801 7770 652
16262 652 960 -8538 -12317 -13275 -9895 -11030 -7645 -12543 -11692 -5803 -4223 -1842 7261 15156 13270 6579
16246 6579 875 1344 2453 3952 6258 6077 -710 -5830 -8737 -10369 -4222 -3597 -5824 -10445 -12717
16231 -12717 -14552 -8047 -3904 -9310 -8723 -2168 -919 571 1407 -3672 -1172 2755 -2520 -6991 -4377
16216 -4377 -5410 -9433 -614 34 -745 -2318 -7646 -8577 -6108 1949 991 -3675 -3362 -4044 -4178 -1746
16200 -1746 -4301 -9236 -10252 -8661 -7472 2160 2061 -1642 -6433 -11168 -12840 -7627 -12331 -12663 -4178
16185 -4178 -1594 -1738 -616 -6218 -6707 -2262 2746 2253 -2258 240 3253 -1702 -9285 -10562 -5717
16170 -5717 1449 -178 -7114 -7903 -703 3412 -265 -4129 -7497 -4366 -1630 -1982 -959 553 920
16155 920 2284 5280 1981 -2723 -3292 -7517 -12439 -5562 -4198 161 2906 4700 -1380 -9036 -9181
16140 -9181 -9337 -749 2597 -2698 -8959 -6852 -6375 -240 6517 7548 7993 6022 2790 -3306 -403
16125 -403 4635 6534 7984 6614 4386 2536 -3412 -2653 -199 4261 12126 17896 10549 707 503
16110 503 -207 -2245 -8138 -12501 -17105 -10546 -6642 -4736 -10428 -17579 -16555 -14608 -7290 -9856 -16431
16095 -16431 -14531 -6052 -2284 97 -5321 -13114 -12416 -12838 -8999 -1753 540 -3928 -3823 -633 2951
16080 2951 -3954 -7357 141 -206 1819 -2627 -6973 -10262 -11552 -11381 -12279 -11270 -11084 -11569 -8092 -3238
16064 -3238 -90 1300 5810 5757 301 -2307 4794 7833 1847 -2835 3100 8464 5010 -3550 -4779
16049 -4779 -7081 -7240 818 -1499 -5662 5797 4780 -484 1772 3969 8532 8032 4523 2930 -1814
16034 -1814 -4606 -7681 -5954 2475 5297 741 -4510 -694 -1163 -2095 -1579 -8284 -3955 -3261 94 5076
16018 5076 1251 -2256 -7437 -4993 2285 1291 -5739 -4365 -811 2038 930 -1657 -5573 -8699 -7715
16003 -7715 -5464 -4657 -6232 -6877 2779 5605 4173 3715 7912 6345 3018 3210 7539 6660 -2210 -8677
15987 -8677 -3613 1108 3115 119 -3803 -4603 -2807 -2800 -1974 7012 10148 10399 631 68 3340 541
15971 541 -7818 -14166 -10085 -3453 1241 -2475 -3272 811 3940 -188 -8083 -12073 -12182 -4964 -457
15956 -457 286 -4846 -1568 -60 262 -1598 -3909 -2951 -3950 -6233 1684 -898 -3178 -4613 -6708 -6574
15940 -6574 -6521 -7827 -2180 335 1909 629 -1477 -11494 -10317 -4887 5102 10506 12910 7635 -3351
15925 -3351 -4603 -8168 -11077 -7831 -5299 2225 4824 -3343 -772 1331 5122 2323 -2687 -6148 -6075
15910 -6075 -4908 -3105 -5443 25 51 826 2802 10309 10715 3452 -2729 -9630 -8072 -890 -3266 -1565
15894 -1565 -2546 -97 1585 6669 16596 17940 10748 2775 309 4393 1690 -2634 -6741 -3334 -1161
15879 -1161 2367 -2088 -3563 -1794 3393 9469 3481 -3661 -3407 -3442 -10162 -15670 -13338 -11966 -13831
15864 -13831 -19048 -24191 -17113 -15413 -10493 -9630 -4695 -13305 -9901 -8172 -3743 -3448 -3529 1869 205
15849 205 -1896 -2687 -1058 -2646 984 2949 -2813 2555 8082 3133 -3592 -7413 -3875 2861 -2067
15834 -2067 -4437 -7234 -7908 215 6577 7901 979 -6084 -3602 1285 4164 -5470 -8883 -1347 1175
15819 1175 -3221 -4890 -1875 -3321 807 -7433 -11335 -3983 2437 1478 502 4909 5538 -2185 -13053
15804 -13053 -13890 -8591 -4867 -2887 -9135 -14461 -17321 -9473 -9599 -4913 -6646 -7600 -13377 -14005 -15900
15789 -15900 -22201 -18643 -15660 -13773 -13908 -13940 -11826 -9885 -6066 -3675 -9444 -13912 -13281 -7704 -3686
15774 -3686 -9838 -12754 -9946 -2513 -1853 -3046 711 -1063 -9537 -11500 -15594 -13395 -10623 -9621 -8998
15759 -8998 -14566 -10345 -8964 -9012 -7938 -9233 -5134 -6151 671 2166 2477 819 -2198 -5256 -767
15744 -767 962 1203 -3250 -5677 -10405 -2735 1559 1385 -1646 -3035 -2706 -4005 -5519 -4352 1874 5616
15728 5616 6057 8669 819 236 2946 2952 4112 3841 4913 1612 -5032 -2343 184 1771 5166 4706
15712 4706 4674 8071 1895 -189 -2603 -6940 -3834 -11402 -11865 -7474 -3610 759 2069 1704 1075 -3177
15696 -3177 -4107 -3653 -1308 -415 -5977 -6077 -7651 -9612 -9857 -5806 -893 -6261 31 5754 10178 7760
15680 7760 15207 15113 10250 8580 7267 10601 13302 11540 7587 9122 15615 15265 11023 7562 5816
15665 5816 5888 4466 3233 1797 -3582 2483 -598 -5390 -3782 -673 4262 6239 -1520 -4441 243
15650 243 -4 -5036 -4332 -5614 6283 9893 16717 18443 7737 11631 14902 9815 11316 6261 2153
15635 2153 -1815 -8149 -3959 -8451 -4191 -8009 -11514 -7951 -2638 -4857 -9673 -6608 -12910 -13511 -9946
15620 -9946 -5957 -2577 -2317 -3565 -4466 -6272 -8057 -11091 -5103 -2774 -2838 -761 1787 -2962 -7546 -10964
15604 -10964 -9102 -12522 -15547 -9855 -2957 -332 -2465 -3116 -2144 -8993 -11383 -14022 -17484 -17823 -7022
15589 -7022 1358 3408 5478 7598 9690 8388 8317 3657 -547 -3827 -7735 -1731 7214 4312 -6067
15574 -6067 -3973 -4587 -6458 -4465 -1688 -377 3625 -1716 -4929 -3219 -5312 -10764 -4391 330 3373
15559 3373 3576 4788 3467 4134 3624 5475 7076 9411 5177 8186 10797 14434 14416 7762 2616 957
15543 957 -4086 -8970 -10942 -11735 -11430 -13935 -7634 -1245 2148 6198 12666 6805 91 -2421 -4946
15528 -4946 -7418 -7911 -2814 -7311 -6649 -4010 2124 4313 1579 2369 1277 6918 7219 -2514 -2758 689
15512 689 -111 -4716 -5918 632 -2529 -9223 -12632 -10242 -4465 5051 1334 -2801 -3982 -191 4562
15497 4562 3177 -1939 -6895 -9243 966 4630 7841 2019 690 3091 3424 -4382 -7526 -3721 2114
15482 2114 -749 1277 -194 2602 2822 -2250 -3661 -2566 572 -4312 -1545 -4239 -3557 1985 2835
15467 2835 3777 5414 1790 2781 6894 9390 13809 11763 9019 8935 2667 983 1051 2906 -1016 -15336
15451 -15336 -20616 -15713 -11374 -12682 -13469 -10218 -6453 -7145 -7509 -5442 -1114 3955 3111 -1248 -10625
15436 -10625 -9549 -9147 -1137 4197 2940 -78 -1476 -1830 -1428 4245 6035 7585 3019 -1502 2532
15421 2532 8049 4667 5092 1021 -624 832 1177 -3097 -5668 292 4069 2383 1747 492 -4806
15406 -4806 -3763 -4041 -4980 -658 -2350 -38 189 746 -969 -4406 -1431 -1814 -1988 -3234 991 1699
15390 1699 303 2260 -4124 -7357 -11246 -11928 -9963 -4910 557 5457 7846 5727 2435 6130 5497
15375 5497 -808 -2478 3298 6457 6763 -5633 -11943 -4686 1883 -930 -4073 -2291 82 7030 11195
15360 11195 14362 11117 10019 2094 1125 3995 1604 -2344 -4322 -6166 -543 2401 -5794 -8421 -189
15345 -189 686 -5670 -8763 -6867 -2004 -241 459 4835 10319 9676 10109 8126 6440 10314 2661 -4448
15329 -4448 -4407 -4222 -3131 -2811 -969 3162 5320 6511 2050 -489 -2834 -6139 -3126 -1076 2253 2442
15313 2442 -1413 -7159 -12495 -12266 -8755 -10937 -11532 -4431 -5839 -7535 -6073 -7916 -3219 -277 -646
15298 -646 -1248 137 -1701 -2648 -1266 486 1885 -397 37 2447 -1308 -3990 255 -1348 -4672 -3672
15282 -3672 293 3174 2246 1428 3343 5089 969 -2022 -1125 2193 9058 10460 9725 2215 -5407 -536
15266 -536 1528 5819 4883 6231 9090 6849 7313 11249 11872 4411 -6879 -7947 401 9281 7040
15251 7040 4877 1690 -25 -103 3826 7126 14221 18034 11452 5388 5320 8351 12724 10649 -1164
15236 -1164 -3579 1464 -3851 -4899 -7028 -14859 -19225 -19660 -21700 -17557 -8842 -8826 -11243 176 3631
15221 3631 -491 -3068 -4423 -5495 -1169 -5673 -15870 -17010 -9548 -3802 -5050 -1998 -2103 -3262 846
15206 846 -1769 -6184 -6903 -1440 1620 -2684 -11890 -13181 -7433 -12197 -19389 -12052 -6167 1211 -1735
15191 -1735 -5136 -3375 -1414 3647 4848 8033 7055 493 -9096 -12151 -11432 -1704 2340 1566 3026
15176 3026 929 -3045 -7910 -9167 -8221 1678 -5474 -8200 -2908 3525 5443 -1879 -3657 513 2568
15161 2568 4314 -1145 -3685 3458 5351 3838 302 1461 -4760 -7034 -7368 -5838 -5774 -11554 -13819
15146 -13819 -12885 -6742 -4479 -10518 -10477 -7864 -14689 -18277 -16210 -17221 -10268 -1090 3299 3158 -2904
15131 -2904 -2599 -8388 -14913 -13696 -9082 -4832 -2935 -5721 -3235 10073 8970 -3049 -9962 -7688
15117 -7688 -7260 -4262 -7482 -5941 -4761 -2960 -3385 -5200 -5778 -10114 -180 2023 -1275 -4935 1694
15102 1694 -2585 -8505 -8354 -7983 -10826 -17278 -16122 -10915 -2745 1965 -3195 -2230 11218 16312 7948
15087 7948 -324 777 10175 6159 3160 5226 7119 7255 5294 2822 5982 9616 3090 2239 -539
15072 -539 -2917 2210 2409 -4600 -2519 7958 13046 9236 5140 171 -813 4784 9112 3237 -4114
15057 -4114 -5806 -6161 -4533 -6028 -10399 -12670 -5600 1999 1105 -54 -2118 -7821 -5010 4673 6694
15042 6694 4178 6806 8102 -2978 -10068 -18931 -13931 -16050 -18065 -17708 -14481 -7092 -5404 -228 5108
15027 5108 6245 2453 1736 -4523 -6476 -16889 -11765 -7065 -6070 1059 2055 4849 3624 -3829 -9270
15012 -9270 -14226 -14464 -8175 -3091 3717 6798 4759 3303 3158 -9896 -14215 -13027 -6622 -2433 3411
14997 3411 1015 393 -2593 -3203 750 4088 -2591 -7965 -5340 -1794 -8884 -16798 -14543 -699 10351
14982 10351 10485 2725 -2791 348 8664 12740 5839 125 1795 3168 509 -1835 1233 8990 9230
14967 9230 2231 3598 4467 7163 4336 4555 8045 8104 4019 7731 3939 -4680 -7799 -8038 -5947 -4117
14951 -4117 -6393 -6804 3035 10816 3885 3584 1383 4739 8139 1078 -5225 3000 5184 -6225 -6328
14936 -6328 3516 2989 2684 4612 3298 -1393 3354 10022 16928 9534 1535 -7483 -12719 -9559 -5594
14921 -5594 -8629 -11291 -10111 -10820 -6828 -741 4608 6673 5281 5400 9711 7526 7559 5454 -3872 -5818
14905 -5818 3735 7261 1607 7759 15463 15575 13249 6852 8681 8987 2980 -2547 1303 4362 -3077
14890 -3077 -9957 -6459 -4784 -15054 -15937 -5207 4190 5620 4897 -21 2143 4181 4989 356 -9572
14875 -9572 -10577 -2490 -6854 -9214 -8134 -10058 -7874 -5116 -838 5573 -1304 -1950 -1776 -1398 687
14860 687 2215 6377 8920 8119 4707 6601 9142 12929 17582 10803 1764 1096 6235 7399 -677
14845 -677 -8207 -8238 -12361 -10809 -7536 -8353 -8943 -2759 -1571 -11745 -11581 -9502 -10871 -10651 -6555 -2467
14829 -2467 3251 1666 7438 7586 9317 11561 11584 2381 -4131 -1723 -876 488 3645 13571 8022 7377
14813 7377 6718 9589 8683 13550 11067 6159 6082 -2586 -3879 -3523 -5456 -11877 -16573 -12650 -9603 -7675
14797 -7675 -9801 -15004 -14362 -12642 -9856 -12238 -11031 -9598 -3382 -3927 -5674 -1114 -2042 -8695 -12265
14782 -12265 -10128 -4982 -5675 -2355 -6644 -6988 -12721 -14222 -4487 -1087 -7386 -6671 -2415 -7885 -8955
14767 -8955 -6826 -7677 -12707 -8579 -6006 -7390 -11141 -3563 1823 -5930 -6845 -5051 -2157 -15048 -14563
14752 -14563 -1602 2772 2839 5013 4241 -1728 -10791 -6829 2310 1657 2973 513 3037 -2645 208
14737 208 8816 11967 7047 4562 10950 7444 4524 6220 10194 18545 19911 14765 9828 2440 232
14722 232 83 529 1642 -381 2781 6005 -111 -5138 -6489 -12227 -7471 -4394 -2079 -2779 1567 4694
14706 4694 4587 5255 -788 -6856 -2437 2035 -1204 -4923 -8434 -9931 -4610 5325 5314 -3284 2179 6959
14690 6959 6670 1068 -1519 -3878 -2090 -7257 -20840 -20182 -9653 -4853 -10421 -6785 -6808 -6226 -2228
14675 -2228 3401 -1691 -12514 -7807 -2563 -2358 674 257 -1946 -3665 -9035 -6899 -2230 418 -2430
14660 -2430 -1901 -682 -4585 -3235 -3043 5652 9054 5502 7069 -294 -7421 -7730 -1736 3453 2869 -1412
14644 -1412 -7112 -362 961 3038 5340 5493 2946 1156 177 400 6352 14204 8052 6609 8593
14629 8593 6789 2186 -2658 -1886 670 7024 11395 -261 -1032 4181 1977 -3555 -1775 835 5368
14614 5368 353 -3475 3090 -1036 -4368 2621 3257 2759 3134 -543 -8541 -1747 3849 689 -1840
14599 -1840 6261 11896 9759 8915 9527 5418 -3529 -1476 2498 3889 566 -4843 -8463 -6051 -1542
14584 -1542 -4419 -1325 311 6359 8779 13 -7736 -1559 -3435 -5941 -2681 -2033 -91 -2240 -3551
14569 -3551 -5604 -2132 3442 -1563 -2477 -1205 -5093 -7876 -3613 2780 4483 5817 10602 1474 3427
14554 3427 1744 4773 10501 14421 9557 11007 7784 5062 4577 -2237 -4560 -2355 -2368 -10342 -13766
14539 -13766 -4890 8653 13504 9465 2547 -196 -1201 411 -1135 -1364 -3943 -3366 3627 3621 2262
14524 2262 7647 13811 13736 15370 11054 7025 3692 -1672 1453 -35 1637 -463 2295 256 -4345
14509 -4345 -7618 -8004 3693 9713 6141 5132 1407 3800 13058 12961 6840 2347 -1108 793 862 -3387
14493 -3387 -4005 -8748 -6679 -6623 1562 7278 13931 12956 14197 9136 8322 12909 12459 9796 9113 7742
14477 7742 10304 1371 -6965 -11940 -11543 -10820 -4271 -1611 -4600 -9072 -6092 81 -932 -5395 -8404
14462 -8404 -6266 2274 -3021 -6845 -8804 -6895 -7702 -14985 -19083 -16483 -9201 -5176 3036 6520 3438
14447 3438 -3639 -4407 -8970 -10748 -1921 175 1940 565 2856 -3273 -13766 -12227 -3041 -2670 690
14432 690 1926 1539 555 2280 -4373 -1269 884 171 -7633 -14374 -1549 7105 3639 2588 3379 3905
14416 3905 1947 -2181 -2178 3522 4761 4255 8191 8125 5607 9973 7716 7377 7517 4702 2239 -1203 -1070
14399 -1070 -5951 -9752 -7523 -3944 654 -186 -3037 -6006 -5934 -3047 486 1900 5672 2874 -587
14384 -587 2015 1633 -4795 7896 16541 13686 12856 12117 2206 -8420 -10747 -2594 635 5771 8078
14369 8078 2516 -2957 -8566 -9947 -2451 -253 -2219 -242 -2458 -993 1305 -4093 -4770 -11495 -7578
14354 -7578 3989 -464 -1291 7405 6339 -5802 -3460 6138 12463 12427 13025 14349 18051 7817 3752
14339 3752 12073 9969 7024 3106 8821 8988 13713 16129 12407 11535 9586 7922 10689 8667 7588
14324 7588 4264 2526 -4919 637 1027 -11232 -9161 -11667 -10378 -4551 3657 11089 8254 5302 6680
14309 6680 4184 -1508 -2525 -1832 6083 3842 -1357 -1921 -645 4342 7811 10210 6288 -326 -5449
14294 -5449 -13622 -19465 -19121 -15779 -15828 -4774 2817 5060 3439 3022 4702 5477 7991 7617 7037 8042
14278 8042 4314 -6517 -4309 -1222 -277 4765 7804 2922 -1308 -4960 -11896 -8034 -2771 4788 6152
14263 6152 -82 342 3171 4194 5271 4725 257 -6036 -12895 -11993 -6030 3238 4700 3721 3363 785
14247 785 759 4067 5509 1030 493 -2861 -6414 -7276 -599 -1927 -12928 -12791 -7945 641 2746 -5174
14231 -5174 -6744 -8711 -6788 -1473 -4642 -3191 1835 2391 -1906 -707 1846 7781 7513 4847 140
14216 140 -3634 -9033 -10292 -14445 -16052 -10682 -7680 -5962 -10145 -5630 -3132 -899 349 623 -3470
14201 -3470 -5076 -5651 -3555 -1031 6271 10064 5051 4661 4653 5236 12217 11581 2928 1553 -7804 -7599 -7816
14184 -7816 -7463 -7040 -2883 1727 2040 -756 -4811 -8413 -2085 203 -2108 -2057 1849 4852 37 -3177
14168 -3177 -2829 -5547 -6864 -5433 -2279 -923 5151 9716 2492 -615 -3936 -4556 -2710 -4733 743
14153 743 2633 465 2174 6244 5171 1902 2586 3167 -712 -575 4004 9738 12445 -1282 -7677
14138 -7677 -17526 -16310 -8518 -3343 938 169 -1828 6433 4557 -411 -5489 -4921 -2044 1878 288
14123 288 1742 -807 740 775 494 854 -709 1638 74 932 8919 5682 -1729 -7012 -5772 -931
14107 -931 -606 -5041 -8681 -3748 3604 1396 -356 2473 1969 274 2212 -978 -4398 -3682 -880 1023
14091 1023 1221 -7039 -2421 -4169 -8040 -12691 -8058 1303 1575 -8142 -3587 1566 7982 11785 12227
14076 12227 12068 7516 5672 4989 8857 8409 8609 7019 4354 3046 7601 4593 -237 1317 2042 7449
14060 7449 5611 5096 -2138 -6575 -6581 -2945 5334 5992 -1393 -547 1918 -2462 -6983 -7522 -7037 -3359 -4189
14043 -4189 -8667 -13379 -13558 -6982 -1696 -2218 -8811 -9295 -7375 -6538 1701 6883 8433 5682 -1327 -3332
14027 -3332 1980 10060 11732 8875 6280 8113 10639 15796 13346 2623 1582 4787 2288 -5525
14013 -5525 -10209 -14161 -12140 -10183 -7577 -5585 -8304 -6312 -6651 -5294 -5146 -7884 -13689 -9519 -7953
13998 -7953 -7668 -10185 -12204 -9637 -5602 -5206 -3535 -1027 2492 432 2102 -5128 -13050 -7615 -5582
13983 -5582 -7725 -6424 -6729 -1841 3565 -681 6672 9884 4068 -3082 -8264 -8042 -9694 -5980 -9353
13968 -9353 -6025 -1805 514 -3592 5701 6010 4592 3334 307 -7056 -4143 -7187 -10667 -7003 -10377
13953 -10377 -12410 -1358 1960 -4571 -3093 -5749 -8521 -9217 -1545 -2791 -3809 4771 9473 5527
13939 5527 3111 3886 -1777 -11921 -8639 -767 6553 9172 1503 -5368 -1970 613 -4315 -2741 -2188
13924 -2188 1980 4503 6452 -2718 -10869 -6634 -303 -895 -1595 -2011 -2919 24 3192 3954 8254 11601
13908 11601 15505 16694 19588 15821 14512 15231 11904 9398 9938 8545 7752 1499 -1284 -6086 -3546
13893 -3546 -2528 4817 7188 8092 14085 5720 -8286 -7999 -8893 -7727 111 7058 6922 7549 5104 216
13877 216 -5639 -5512 -5231 -5530 -4863 -8852 -9674 -5217 -6927 -7072 -1511 4474 6153 3141 2602 697 8748
13860 8748 4440 -2248 -64 1301 3690 -1301 -212 -1301 -444 9066 10949 165 -1120 -641 -6460
13845 -6460 -6434 -4957 -6112 -6661 -11226 -14185 -5052 3859 3627 6700 8801 7482 3901 3214 4671 2825
13829 2825 9000 6099 -1231 -1282 -2903 -3984 -2866 5089 10465 10651 10096 8079 8664 9902 8308 13776
13813 13776 13465 7041 2047 2105 4733 149 2057 -665 -1458 -5582 -2427 -2592 -1206 -1366 -7588 -8096
13797 -8096 -551 -27 357 1436 -2767 3199 14080 11636 -1693 -716 4560 3285 1597 646 -3939
13782 -3939 802 4535 5203 4201 1568 3174 -1685 1038 3314 2865 1775 2241 -268 -915 -3259 -3770
13766 -3770 -11175 -9538 -8498 -10451 -4371 3107 -3468 784 -319 4172 8228 8438 10167 6924 1232
13751 1232 -4066 -4892 -390 -699 266 -2924 -5661 -7063 -4506 1622 8199 6316 2604 6561 953
13736 953 -6928 -7063 -5499 -3744 -2928 3824 7282 5304 4255 3244 -365 -3632 1373 53 -5368
13721 -5368 -2490 -794 -3737 -5770 -8792 -4769 -1583 728 5313 13395 13295 19345 26599 23950 18907
13706 18907 16776 14186 7756 4067 5185 10943 15206 16596 15808 12026 9594 9100 5861 4918 11908
13691 11908 11286 8629 4479 670 -2921 -3777 4887 5443 -1377 4119 11292 7073 10419 17979 10688
13676 10688 3953 1146 1157 4108 7591 4539 7404 5484 12184 18690 22961 25884 20020 15058 9318
13661 9318 4530 -4123 -9500 -1691 3800 8377 3482 360 794 446 -465 2294 71 -831 -2700 -5220
13645 -5220 -2080 -2200 -4528 -2428 -14393 -21232 -12748 -5506 -1654 -2427 -371 2588 2204 2701 -259
13630 -259 -7890 -13391 -9727 -965 4903 -952 -635 3355 12553 16368 15283 12941 6325 188 -2198
13615 -2198 -3893 -4415 -3578 -27 -2672 -4688 263 173 2350 4595 -4514 -9358 -14503 -8306 -7359 -9271
13599 -9271 545 6745 3269 -28 -1293 601 -295 -6610 -5883 3670 9830 8706 28 -3021 -4549
13584 -4549 -4970 -5527 -7752 -4755 -5918 -10172 -11058 -5625 -2253 -3882 -4493 -6506 -3965 2387 4123 2844
13568 2844 8076 5213 4634 3940 1548 5654 -886 -2151 224 -6598 -8008 -4706 -882 2377 15801
13553 15801 18218 18279 19968 20574 13973 11247 11662 12111 12309 3922 4872 1911 -2362 1291 3315 3831
13537 3831 3226 7905 4234 1948 2644 858 -3323 -1340 491 -472 4659 6332 5093 8247 10094
13522 10094 13806 17600 19220 18886 16685 15849 18213 18182 16143 19180 23307 22630 23576 16933 14744 20392
13506 20392 14261 11219 18296 20620 16245 16174 20032 20065 19083 28774 31089 27478 38933 42719 47842
13491 47842 55001 61120 62291 75989 81721 90815 113660 131137 144342 159459 197802 248328 320356
13478 320356 440646 656180 1058855 1567998 1732482 1472352 1104460 804388 592073 447862
13468 447862 331663 249077 206225 172098 145443 129359 113774 94892 79880 59263 52243
13457 52243 57614 61397 51068 40209 32687 32626 32902 28739 23690 22307 25247 31370 19629 11132
13443 11132 20112 22479 17171 12104 13033 12006 10225 9675 8308 6002 8971 10084 11307 12962 12711
13428 12711 9407 7536 3552 -904 -4523 -5907 -6688 -3042 -7160 -10823 -9384 -12223 -9078 -7340 -5
13413 -5 7669 8203 8725 12500 12884 15544 15794 10136 4902 5872 1976 -1002 1815 2420 -2258 -2511 -7347
13396 -7347 -6550 -6483 -2467 7089 7910 6736 12146 13896 11395 1100 -10873 -14813 -3066 2350 -4060
13381 -4060 -1909 652 3790 12443 15148 19043 17969 15728 16325 22846 22345 12421 8530 4538 1427
13366 1427 7522 12456 10931 16776 16520 10350 6824 6141 8009 4474 246 -318 -128 8118 6680 2458
13350 2458 934 -5558 -10098 -7302 -11944 -11838 -7976 -8859 -6307 -2239 -8525 -10872 -5354 -5899 -5736 -6209
13334 -6209 -5762 -3438 -1896 -14 -1664 -4352 -2651 588 -2942 -8772 -4963 -863 7671 21875 30254
13319 30254 39046 49039 52170 50693 54452 48591 37115 27412 25560 28333 27119 25155 24796 24425 20907
13304 20907 12823 17326 24675 24981 29636 29897 26158 27930 25483 27825 31486 29320 29131 34917 40768
13289 40768 43553 29242 19341 17846 19549 24405 27082 34133 38157 36554 32404 38393 47883 53165
13275 53165 51343 47826 41038 34183 32313 33368 29994 26473 28968 35105 34676 34371 42719 40722 35386
13260 35386 40002 46754 46302 39223 44117 57139 71826 82126 86110 90055 89953 83155 76708 80214
13246 80214 87139 87505 88740 86116 77416 60867 49444 46118 43443 37360 39540 43243 36750 31089
13232 31089 34596 41359 42090 35701 26899 28283 38677 39810 30306 23357 17545 21761 31469 38177
13218 38177 43071 47588 52889 59281 61120 43694 23030 -3237 -22552 -29496 -34905 -42494 -35885
13205 -35885 -28014 -14574 27906 97764 152468 166700 136520 111086 97553 88044 82561 73376
13193 73376 71456 67702 65008 65372 69362 63508 55328 56620 55880 50427 50870 56595 59309 63917 64704
13178 64704 57943 51017 41838 44123 56615 59638 59122 53163 46359 53719 59194 70438 96392 115352
13164 115352 118200 116442 111575 105561 94170 80518 71395 55693 47344 53863 66368 75363 58768
13151 58768 45794 51215 87860 153816 215807 307248 424426 506280 507114 442826 345370 250274
13139 250274 210156 235906 272877 276575 250278 205794 171001 146184 142579 142751 109602 64842
13127 64842 54132 87617 146444 178775 169459 174986 195545 197709 196089 190137 166701 137006 119892
13114 119892 112335 115480 128583 134913 142447 159505 179823 187065 188748 193735 192975 198053 206025 209856
13100 209856 209610 221501 226909 225512 222636 221945 214315 218147 244667 262557 269555 272234 263339 256627
13086 256627 254048 258037 277447 282339 278092 276674 288603 305829 318334 319705 299998 300594 306829
13073 306829 322508 348380 371068 391071 414966 437296 457484 475683 493423 536379 567183
13062 567183 585533 604816 635336 687987 742896 779083 804457 834124 871793 925354 992667
13051 992667 1058023 1097690 1122640 1180172 1263505 1342192 1431751 1541398 1685462 1854375 2040803
13040 2040803 2231777 2424811 2598158 2750646 2919615 3143345 3446634 3817092 4266909
13031 4266909 4792892 5363068 6007757 6826762 7902134 9314954 11210861 13531682 15724472
13022 15724472 17726492 19912231 22613048 26388525 31933116 40047525 50669369 66234734
13014 66234734 95301482 153484204 249501776 322461764 303288165 238082150 173321630
13007 173321630 126354054 94500543 70985678 52654675 39582384 30450506 23988075
13000 23988075 19532895 16597721 14554616 12630300 10753179 9098788 7763407 6690363
12992 6690363 5795222 5063183 4479863 4039140 3660950 3322601 3005198 2691832 2400005
12983 2400005 2159131 1981744 1844925 1742587 1677189 1618659 1565853 1495676 1427575 1377705
12973 1377705 1316325 1227236 1142639 1083986 1034341 991154 945236 892742 842741 800493 779422
12962 779422 766896 749310 726849 700463 675724 659754 649844 638033 609994 588465 565931 554363
12950 554363 560124 560870 565526 563552 541927 495123 460657 442387 429094 417352 402876 386782
12938 386782 367534 356552 347905 348048 331880 306706 292233 272280 265223 276305 280076 263309
12926 263309 249685 235349 233198 239022 239695 234367 229524 226541 227277 218083 207408 187633 173924
12913 173924 172042 183108 193358 207607 226426 249839 264511 256825 241098 215672 197841 181811
12901 181811 162161 177313 188223 156108 152835 188852 256759 299223 282746 254089 245296 252647
12889 252647 250526 225672 190925 150280 119027 125302 158800 198962 188713 126313 29212 -87287
12877 -87287 -169720 -191461 -174588 -153698 -118940 -47697 14563 44258 54185 56947 67485 80671
12865 80671 80928 79081 75527 77014 72086 56662 52344 57984 62673 67646 80640 92427 96278 96711
12851 96711 90880 89261 88239 89740 90118 92800 86267 75243 69039 65185 59121 56075 57169 66377
12837 66377 65601 56994 45842 41147 36971 41742 49382 45028 40439 24947 19309 13219 9812 15549
12823 15549 4943 -34225 -54201 -21389 24245 78373 111682 121506 128918 134768 138813 132678 111576
12810 111576 90016 71793 51561 44739 45477 41913 31988 36207 46527 58319 67268 73073 76227
12797 76227 78257 64433 61228 65598 63815 60308 61427 60308 54088 45310 44594 49083 65558 71072
12783 71072 72037 61880 52004 45639 45017 52779 55412 53954 42391 33986 21816 22137 26742 29968
12769 29968 32814 31683 31840 46211 57539 61761 54280 47130 42897 32907 26154 29565 27132 30651
12755 30651 40314 49844 49357 40379 40099 42242 37921 24573 28156 28430 23826 26815 33973 38377 37735
12740 37735 40017 48853 53766 54005 51438 42138 38845 31813 26058 23545 22115 21178 24405 25432 21600
12725 21600 17727 9482 4591 197 2365 9214 7948 7884 10470 3010 2970 12746 17633 14018 22005
12710 22005 24758 17580 5734 -6786 -8506 70 5427 1608 -2120 -6162 3369 18322 25201 27641
12696 27641 35576 41447 40261 28964 27374 30369 36428 37251 32888 36718 35844 34053 29710 24979 31647
12681 31647 30489 28671 28832 28635 30336 33289 38823 43469 43987 35249 26504 22231 25971 32049 32920
12666 32920 29400 31088 33962 21608 15980 18194 19739 20531 27734 25240 19531 17032 10978 7288
12652 7288 8119 -1461 -8240 206 5765 4950 7583 19481 27944 28655 20983 19631 19877 17053 15451
12637 15451 18921 18047 28737 32490 27348 24809 22616 22510 26963 34150 34396 31750 33424 33160 32420
12622 32420 31629 32898 33154 27636 22003 23951 21731 21111 8453 9212 23202 34928 37935 38197 37967
12607 37967 39818 37399 31472 37435 41261 46035 36490 31825 23673 21327 11792 15813 16058 17540 17621
12592 17621 19025 17342 14442 18446 18981 15878 20818 22988 21703 17250 19947 24354 25121 20255 18551
12577 18551 14542 10511 9412 6709 5178 6114 10241 11783 7133 10850 13638 15755 19783 22569 15398
12562 15398 12996 17392 26685 28859 27684 27355 37151 49185 54942 62176 75741 91027 110199 129168
12548 129168 151035 179012 215696 259329 323692 425583 613905 1000014 1524946 1761787
12538 1761787 1542352 1171929 851209 625276 468195 347016 257288 199664 164811 135813
12528 135813 108999 98059 88717 75720 60304 49486 39627 32799 32516 32493 30080 31776 32520 36995
12514 36995 41635 39239 35165 33654 30812 26788 17991 13893 11619 13575 15231 18207 11958 7015
12500 7015 4960 6066 5998 -2615 -5900 -4957 -3560 116 5617 14348 15838 11715 7072 -2242 -6659
12485 -6659 -6317 -3962 -3885 1580 3351 -2125 -478 2527 7938 14771 20375 19751 22574 20369 19525 17671
12469 17671 19665 22121 12662 13440 12266 10780 11429 7505 10709 4258 1196 9703 13401 7530 4077
12454 4077 4443 7493 10760 8569 -2494 -1883 169 -5050 5020 5963 302 2885 2310 7352 2023
12439 2023 2344 5794 9782 12461 15750 9861 3430 6004 2240 -609 -1053 4550 11590 12089 12316 7071
12423 7071 6478 5667 2845 6135 8539 547 1431 3314 12725 19891 20743 25407 22864 22963 16624 9267
12407 9267 6984 3092 1888 1437 -2585 -2763 2476 12247 10983 12266 11127 16952 19494 12749 4395
12392 4395 5460 5682 6369 -1784 -966 2286 -370 -2684 2155 -4912 -11332 -11414 -2923 -365 -2706 6233
12376 6233 8156 4530 10712 6273 8495 10317 10788 21662 30158 24161 27138 21652 22532 26007 19842
12361 19842 12315 8252 9615 7725 7622 5623 8931 18049 17347 12899 14485 13116 4708 3351 11976
12346 11976 10141 10711 7831 5279 15017 15756 6108 2378 4910 7769 8829 8033 2565 -7431 -8470
12331 -8470 893 4337 2294 2824 -449 20 4875 7511 11941 15555 11058 621 -282 2724 2523
12316 2523 7368 9701 13973 10598 12528 7841 6595 8950 9466 13297 18856 16594 15468 13792 8890
12301 8890 9465 5747 2089 1939 3474 10255 8784 3638 -310 2339 4753 6304 8587 1773 -4697
12286 -4697 -2259 -1473 -4927 -1670 -1046 942 2061 1697 -3886 -201 7379 10439 9524 8140 142 197
12270 197 3810 5073 4139 3122 3664 3342 8656 7679 3683 3409 4644 -1348 -5075 -12828 -6798 -1924
12254 -1924 1603 2116 5004 3254 10837 17755 21081 22947 16534 10661 13344 14187 2541 6248 1983
12239 1983 -1777 3862 7667 7837 10005 15673 11586 -730 -2576 -1224 -1102 10049 3932 -1044 356
12224 356 -3321 -1274 -3087 455 -2346 -3286 -6242 -6258 -2858 -6422 -5325 5985 13386 5573 -2047
12209 -2047 -5324 -4777 -5884 -4875 -932 -5147 -2130 -1368 -2190 3277 1799 45 -5296 -6611 -4253
12194 -4253 -8957 -3857 -20 3852 5605 6661 3273 7420 13277 17539 18926 20113 7688 4093
12180 4093 6782 9550 11725 5545 -1302 1013 3526 5673 1075 6470 10385 6525 10799 11817 17989
12165 17989 18850 21520 22774 30003 35905 36596 41698 41420 40983 44393 51625 60882 68523 78472 84774
12150 84774 105578 132409 155020 181281 213745 250693 280318 293561 294293 290276 278659 257114
12138 257114 238069 216385 193437 183349 167701 142996 128229 112513 108233 107679 112123 112118 112570
12125 112570 112675 112768 113425 120120 135311 147228 152135 154963 171039 184039 202880 225089 245743
12112 245743 263260 287606 310841 311280 299221 275282 242420 209225 175024 141085 118293 100542
12100 100542 84014 75787 68279 54985 48878 47755 45824 44973 47456 47310 38849 34067 23817 16086
12086 16086 18315 17765 15484 16094 14943 13658 5072 5693 9332 10189 9243 6790 12722 14798 14846 6402
12070 6402 3572 2523 7629 11304 16597 12547 13849 19406 16235 13304 10782 8890 6839 5963 15788
12055 15788 22221 15274 12847 11100 7306 9839 9861 7282 7947 7011 8642 2440 -4465 -10304 -9113
12040 -9113 -5468 -2634 1658 3379 4765 5468 3067 8223 7652 10560 6970 1286 7010 16794 16881 10774
12024 10774 8661 10443 15823 10527 4209 2834 4068 -413 -450 -1918 1186 976 -1411 -317 -3831
12009 -3831 2257 7387 5868 8637 6010 -646 7198 8106 3016 -936 -2367 -4648 -1948 -2236 -1854
11994 -1854 -971 1382 3476 4784 7350 10703 13735 13328 11836 8498 7217 3123 1180 -1459 -5687
11979 -5687 -7038 -7802 -1102 -1487 -4666 2479 8931 2109 2493 4807 3534 4460 5459 5616 -1349 884
11963 884 -746 1908 3096 7682 14723 10865 12965 12329 9492 11595 7191 -357 -910 -1466 -5116 -826
11947 -826 3033 4598 6336 14446 12351 6072 4143 3274 3661 -8722 -8328 2262 6737 5413 382
11932 382 3656 1970 5873 7008 4665 -1741 -1359 -1857 -5708 -3321 -6014 -7431 -4028 -6356 -2428
11917 -2428 -1973 -4965 -9267 -4431 1737 9047 4256 2940 2164 41 2786 5823 5053 2818 730
11902 730 -8204 -10616 -2199 228 456 7102 14789 3496 -2825 884 -163 -3978 -3792 -3107 -2319 1524
11886 1524 4336 12179 10342 2145 -4637 -458 1542 765 2342 2571 -2335 -5508 -5431 -2478 -1290 -1450
11870 -1450 1914 -378 138 31 -2494 -6515 -2885 2122 -2584 -594 4578 6339 4402 2006 -4428
11855 -4428 -1708 4023 7878 8037 9553 5086 2770 4136 973 -747 -1382 -4871 -4453 -8001 -9757
11840 -9757 -4184 961 3220 550 1949 2649 1057 1171 789 2796 -2974 -3650 2442 3742 7396 5894
11824 5894 972 1914 -3632 -893 2019 6673 3619 4031 3978 -2160 -860 -3844 -5811 -3832 3078 8891
11808 8891 9649 6880 5707 10835 6560 -4822 -12250 -14162 -16113 -12547 -8975 -15279 -7134 297 778
11793 778 -2350 -2556 -4375 1240 734 -2555 -2783 -4141 -844 -1287 -4111 -1866 2865 2175 -2608 -5630
11777 -5630 -1220 6623 10704 5048 -1176 3660 12590 6724 9405 5957 3321 1660 -8210 -16737 -11916
11762 -11916 -8078 -2213 9764 5907 -2261 -2643 8972 14186 16629 14024 13111 15940 16114 12624 7294
11747 7294 9024 12209 11308 9202 1014 574 -2043 -1908 6006 7095 11230 14525 10510 8926 9998
11732 9998 7407 1300 1847 -4999 -8460 369 2316 -1260 -3409 -4661 1867 2647 -261 -2473 -8320
11717 -8320 -7382 -7512 -6492 -7703 -3537 7871 5873 7626 9084 11079 8009 11896 14784 8410 1714
11702 1714 -3279 -5625 -1670 -2613 -1847 1210 8802 10598 12638 -173 -8113 -2978 1206 1713 1241
11687 1241 4207 6455 -372 -4229 -216 177 10197 11291 4043 -2782 -3493 1634 2227 1639 -1083
11672 -1083 7106 6854 9556 11692 6510 4867 3280 -2222 -8308 -7989 -4728 -3425 -5689 -9946 -15204
11657 -15204 -16707 -16257 -12245 -13417 -16032 -11150 -9813 -10826 -11874 -7168 -825 -611 350 -2298 2432
11642 2432 5366 -1077 -12234 -15429 -10236 -4747 1414 7713 7382 7737 10891 13910 10550 4302 2473
11627 2473 1989 7097 10031 9826 11761 9512 13632 18879 15404 8686 901 -855 4938 3596 3906
11612 3906 6070 9863 8214 5938 6547 5395 7185 12929 7641 -2514 -3286 -447 1619 2873 3640
11597 3640 2678 -2776 -7547 -5505 -6621 -9615 -14429 -13641 -8677 -6347 -2580 2135 3402 3385 1091 13387
11581 13387 20884 15991 7143 261 -3416 -2618 -458 -558 -4598 -6007 -995 -30 -5148 -7207 -5799
11566 -5799 -5379 -11365 -6953 -8975 -16854 -12264 -1623 3596 -2769 -8028 -10055 -9641 -7831 -7902 -2875
11551 -2875 -2404 3380 3314 -5435 -3083 -6432 -11650 -6965 -1837 -3318 -1756 -196 -4305 829 6429
11536 6429 3745 3569 2059 -2450 -3936 -3 2085 2274 5910 3425 2511 942 4283 6609 9898
11521 9898 1441 1551 6546 9585 7519 3867 3162 2542 7640 13183 12682 13834 11601 11222 6817 -4216
11505 -4216 -9570 -6678 -6252 -3872 3622 2746 2931 6051 4483 -1733 -2432 -507 -3713 -1169 7950 6140
11489 6140 -448 -4246 -8188 -4486 3367 7706 9699 7201 10193 5730 -3354 -6973 -9656 -6693 -8701
11474 -8701 -8894 -5721 2278 7181 3805 -1670 -5138 -6726 -6443 -1723 3254 4898 882 -1424 -3991
11459 -3991 -7378 -11061 -11614 667 2921 -5690 -1406 4208 189 1286 10384 10303 1715 -3672 -1476
11444 -1476 3391 8138 5184 8706 -691 -3477 3081 4713 3345 -3302 -10449 -8210 6596 9819
11430 9819 7888 3899 80 -4443 -6572 -8157 -6699 -5906 -5728 -11244 -5925 -182 -5288 -14919 -7635
11415 -7635 -6641 -11902 -13709 -11153 -7015 -2917 -691 2264 5866 3656 -5804 -5253 1728 -7920 -14771
11400 -14771 -10792 -11409 -15624 -18161 -13644 -6864 -101 3971 7562 12436 7863 2132 -1827 306 -1317
11385 -1317 1297 1100 -7331 -13244 -12494 -10808 -5830 -5122 -5047 -6639 -2345 -7221 -10157 -12173 -6488 -2315
11369 -2315 -4294 -3548 1854 2853 5889 14230 10197 -1809 618 5565 5611 6775 -79 -5860 -12411
11354 -12411 165 2405 -765 -10106 -6677 -3026 -569 -1447 -3036 -1873 -766 -2685 -7145 -3876
11340 -3876 -7069 -7553 -4147 3244 708 1250 -1350 -348 -1028 -7267 -8446 -13930 -11996 -15505 -6873
11325 -6873 2638 6626 6693 4065 1428 -2591 -3192 1171 1342 6776 4406 5838 7696 6128 9096 3382
11309 3382 1006 -1363 -2770 -895 952 2298 5407 3705 -3345 -6180 -3507 -3898 -1190 5521 3257
11294 3257 -4383 -12034 -5961 -762 5238 1423 -2807 -4733 -9543 -13130 -15700 -13036 -8661 -2032 -8844
11279 -8844 -9654 -5823 -1985 -3848 664 -8888 -8643 -3639 -4380 -5928 3125 7318 7567 3003 1417 6608
11263 6608 -3634 -6587 -5411 2424 4468 6335 12062 7212 -6978 -8961 -7325 -10468 -9638 -11747
11249 -11747 -5749 -1763 -1938 1391 -389 -3656 -6851 -7112 -5571 -12 405 3080 -2736 -2307 1220
11234 1220 -4583 -3027 2489 -2059 -7167 -269 4936 4550 2300 -3038 -2490 -1147 1437 -601 -1026
11219 -1026 837 2453 -2971 -10278 -3804 358 -262 1777 -914 -6366 -6692 -2640 -4552 -5200 -3751
11204 -3751 -11339 -10143 -6111 -11975 -16144 -15369 -8558 -1791 3558 4380 -3843 -6471 -5571 -6612 -9205
11189 -9205 -6388 -22 11188 4444 -2203 10498 17470 21206 19119 10675 3532 -4128 -2853 4579
11175 4579 9032 12203 10864 4922 7711 3051 3446 1524 -1212 2034 2412 6315 8457 14994 16359
11160 16359 15741 15375 8964 4228 -2576 -8259 -8936 -7358 -8287 -2472 4254 10923 9680 9985 6738 6973
11144 6973 2275 6681 12902 8820 4689 -3256 -4752 -3674 2936 1929 -634 -8360 -9758 -3500 -2365
11129 -2365 -745 1165 6904 11968 12895 10798 10363 10534 11823 8488 1507 -5190 -1208 -1927 -3366 -3693
11113 -3693 6284 2909 -3125 -4275 2714 5006 1427 -2904 -10504 -7521 -11604 -18348 -17169 -10110 -4881
11098 -4881 -4647 -7725 -11655 -11921 -8121 -7013 -5212 1 1082 3483 779 -158 -2432 -11173 -9293
11083 -9293 -10386 -10445 -5150 405 -7776 -11067 -13758 -9024 -3811 -9553 -11656 -7861 -1279 -1251 -202 4791
11067 4791 385 -901 -4294 -569 1847 -3873 -5351 205 5237 1949 -5080 -7435 -7400 -3476 469
11052 469 5129 -1522 -1007 -5604 -7886 -13485 -9392 2463 -2515 -2443 -845 295 1360 305 -3602
11037 -3602 -6240 -5393 -5385 1937 -1692 -2801 4385 2635 -2 -7785 559 8712 11268 2491 2991 512
11021 512 22 2416 4851 11604 10595 8509 10044 6517 1104 952 -1268 -3454 -7137 -8077 -4989 -1872
11005 -1872 -5597 -2702 -245 711 -3488 -7707 -6469 -6146 -6237 -1486 -1539 1606 722 1394 7045 1158 -854
10988 -854 2015 5211 -7636 -7971 -2896 -3442 7227 15811 10527 2801 4887 -1549 -12051 -13704 -11900
10973 -11900 -3651 -4672 -6456 -6074 -8872 -3966 3150 -383 -2974 1772 3671 3033 4075 2721 5205
10958 5205 2972 -3775 -6734 -6581 -2223 -4600 -14155 -16319 -20429 -17861 -14936 -9162 -11195 -10482 -2377
10943 -2377 1816 6014 10638 -1027 -6839 -10734 -7069 130 1797 -7791 -9874 -3765 -6083 -1869
10929 -1869 4554 9506 5755 1800 1446 3304 5540 883 990 -2713 -6327 -2437 -1600 -989 -5704 -10772
10913 -10772 -9557 -4019 -5840 -7990 -3867 -5779 -334 2114 327 2994 5672 1444 273 1609
10899 1609 8256 7307 200 -4329 1714 12584 11944 5530 1779 2251 3591 -1245 -485 1578 2435 2240
10883 2240 909 -1024 -4063 535 2425 5165 -1314 -5402 -2096 -2330 -5628 -8587 -10687 -11034 -9609
10868 -9609 -4811 -5596 -13007 -10833 -1378 -450 -6195 -3616 3766 5921 10799 1913 -4469 -1336 7000
10853 7000 4476 868 -1646 -3742 -5350 -5146 2300 7346 4198 -400 -4061 -374 -2044 4247 4421
10838 4421 1934 -2435 -3875 -921 3156 10285 9972 6055 6616 1801 -8392 -12861 -6979 -5623 -8631
10823 -8631 -3942 -3715 -2867 -4188 991 -398 -7052 -13037 -16966 -17731 -5817 910 -8506 -13236 -7862
10808 -7862 -4453 -3126 -3743 -735 -3335 -5543 -5469 -928 2456 -378 -4657 -3434 2269 267 -2196
10793 -2196 -8370 -8671 -2254 -125 -5426 -6830 -5505 -1503 -4240 -6320 -563 1785 -1597 2222 2438
10778 2438 -2886 -2868 -2648 -4874 -916 1117 -2990 -616 626 -1470 -4314 -7821 -6208 -318 1746
10763 1746 3342 2215 4441 -3234 -5303 -626 1094 -5774 -8360 -7480 -1095 2443 5540 6930 11129
10748 11129 20287 14437 5714 6857 10454 12079 8080 5907 6513 7374 6538 11812 10303 4825 -2611
10733 -2611 -13233 -10730 -6138 -5011 -8101 -3761 -154 546 3341 7199 1150 2614 1238 1097 -2588
10718 -2588 -5741 -4134 1564 -3321 -7946 -4360 519 -1237 -4002 -3184 -7400 -9692 2666 7265 9252
10703 9252 14617 10677 14258 15576 15231 7185 2314 -139 -2900 -3181 -168 -403 -5689 -12734 -11541
10688 -11541 -9862 -6749 -3568 -5609 995 5302 8655 3600 5101 6709 4785 -331 871 -2967
10674 -2967 1004 -3822 -435 5973 3464 3565 5966 5479 3025 7878 4936 663 -2844 -9557 -9444
10659 -9444 -2896 1809 2414 4378 8241 7223 3349 2118 4175 2232 -6985 -4013 -2745 -8106 -960
10644 -960 2403 1778 1529 -1582 -9961 -14293 -13663 -7957 -7181 -5472 -2776 -8303 -11225 -9811 -8067 -619
10628 -619 1729 4549 1310 -655 -1414 437 -2429 -11078 -13639 -13169 -10768 -7030 -1583 7088 7151 4775
10612 4775 9461 736 342 -97 5604 7189 1323 -3135 -4760 -3286 -1570 1091 1067 6730 9787 2765
10596 2765 -6322 -7815 -5590 -5814 -8060 -6599 -8384 -1739 3792 -1596 -4773 -4370 -2071 -3554 -7615
10581 -7615 -9004 -1900 8187 11468 9466 1489 198 -5217 -3549 -5525 -3802 -2578 -1951 -4614 -986
10566 -986 -391 -649 -5351 -8381 -4941 -81 -7310 -11037 -2613 5091 -776 -11552 -15701 -12564 -11015
10551 -11015 -11570 -7094 21 5120 -606 -9463 -16607 -16690 -16660 -10361 -4612 2719 2526 -1634 652 4532
10535 4532 8899 4109 -2350 751 3795 1485 9014 10502 7554 3042 9531 13718 3382 -2326
10521 -2326 -860 2085 6853 7664 6571 3878 1566 -2681 -4417 -6945 -519 6329 5191 61 -835
10506 -835 2225 8083 8340 5733 -7462 -12527 -10138 -1921 -5242 -6845 -11632 -11066 -6783 -10492 -13471
10491 -13471 -13161 -9195 -3109 -6817 -14521 -12761 -10842 -19411 -18776 -10085 -4678 -9415 -12875 -7980 -4059
10476 -4059 -7139 -9346 -6112 1470 88 -1567 -2642 7487 16211 11672 7321 858 -5123 -6298
10462 -6298 -3646 -1285 5653 5506 -5480 -3445 4581 2136 6577 9847 2654 6611 8964 10698 7736
10447 7736 4113 4926 2802 -1114 -6042 -5446 -5110 -3910 -3827 -5877 -7702 -11125 -3889 -3490 -13966 -16614
10431 -16614 -20727 -23162 -17615 -14877 -10499 -8762 -2547 7057 8288 -1010 -8675 -6752 3945 7644
10417 7644 7083 -104 -1746 -936 -4209 -2958 -11032 -12520 -14249 -10292 -5202 2317 -6431 -6765 -2723
10402 -2723 -3909 2543 2539 656 4267 4905 -4769 -2968 -4829 -7123 -6120 -5551 -1299 -237 -5580 1282
10386 1282 2832 1109 -3734 -7024 -6070 -2091 8145 13806 13118 4591 -4505 -5788 -3819 -6332 -4496
10371 -4496 2276 782 -3212 -2526 303 5840 7839 3437 -3788 -1827 -319 -4296 -9042 -4094 -5408
10356 -5408 -2179 -941 -4220 -9749 -12604 -10675 -51 6403 -803 -6137 -2032 -957 -3201 -2928 -2448
10341 -2448 -6704 -11451 -13332 -5879 2685 3084 593 1169 -1180 -4498 -9246 -6902 -12796 -14909 -12298
10326 -12298 -6892 -4911 -7245 2162 14814 16193 12330 9689 866 1433 6090 8099 8816 6593 6668
10311 6668 8734 6728 -2908 -6062 -4944 -5939 -4976 -2739 5003 10611 9596 8143 -3561 -8684 -4566
10296 -4566 -798 625 6454 6739 7517 8485 12000 7542 3038 506 -900 -4072 -1143 -4619 -4573 -3304
10280 -3304 -4640 1483 7515 11440 9144 12852 14786 13867 7784 9995 16605 9795 2563 4530 6292
10265 6292 14173 16193 15052 13500 4753 -6480 -4691 -5237 -3014 7285 7017 3095 -976 3932 7578
10250 7578 -3477 -5034 4484 7483 4666 3841 6670 12946 14475 14194 8634 3944 7073 6115 6700
10235 6700 13009 15508 13173 5275 4508 3019 -2378 -3364 4017 10075 14509 7282 8440 9060 9872 -1055
10219 -1055 -5396 -5879 -4342 1875 8104 9544 10425 8853 3037 350 3908 975 2710 11505 19519
10204 19519 20029 24801 21139 16689 14505 12780 9714 15999 15343 9592 1922 -815 42 -4516 -1303
10189 -1303 -129 2711 1263 134 1868 4224 4505 1284 -1845 -6144 1807 9278 3893 1320 -1218
10174 -1218 2003 25 -2900 -6029 -6959 796 7305 4381 8502 6261 8992 4173 4642 2532 2992
10159 2992 8182 15828 9372 3409 3548 -481 -12039 -17471 -15972 -5060 5745 5301 7798 -1228
10145 -1228 -3939 -7191 -5618 -1707 5004 6204 1090 4985 2353 2937 -645 -4292 -17037 -19501 -12468
10130 -12468 -12622 -9792 -6592 -9253 -7259 327 4745 179 -2150 -5970 -8484 -8728 2084 7408 5318
10115 5318 6771 6241 50 417 -594 3369 -1581 -2002 -2469 -3873 4831 5455 2201 10542 15533 14946
10099 14946 21273 21071 14393 4396 -2377 1114 2125 1507 2728 -684 -4320 -6919 1041 4343 2975
10084 2975 3188 -1210 1871 3677 1976 1736 4123 10468 6015 1360 -3695 -4875 -691 548 3916
10069 3916 4720 -3669 -1762 -3174 -7981 -5790 -3506 -7185 -8086 -1983 785 2054 3309 -2484 -326
10054 -326 3529 1477 -5967 -10542 -6130 -4019 -5107 -11041 -13965 -9627 -4277 -10344 -6021 -3262 3654
10039 3654 10329 5745 1203 -1547 -4078 -15356 -18435 -15495 -9576 -4028 3241 6403 5869 4848 1677
10024 1677 1956 -2624 -7425 -12337 -6866 -12524 -12175 -9651 -9289 471 629 -2363 805 -380 3141 -1263
10008 -1263 -11963 -9936 -2284 -4292 -5733 4278 7354 8019 6978 430 -6158 -5580 -2272 73 2523
9993 2523 -295 -1564 -3233 -2416 -2206 1649 6292 4781 2176 595 -3826 -8026 -7885 -6849 -6107 -1830
9977 -1830 -1750 1715 5072 4168 2382 -4076 -5989 -1386 1383 2925 -201 2142 -727 -2059 -4729 -4583
9961 -4583 -558 1086 633 -227 259 -2792 -1674 -1132 -1112 91 -2795 -6754 -11487 -6215 -2280 -3406
9945 -3406 -1742 3245 185 -743 4074 1450 2953 2315 4878 5435 7145 3804 6385 10224 10367 5273
9929 5273 2937 3181 4077 -2137 -4713 -3007 2631 2225 2972 -2732 -1866 3339 597 -4075 -3690 4580
9913 4580 56 -6729 -7883 -10757 -1125 -2040 -7422 -9924 -10616 -5272 2857 1885 -1829 -3595 -2252 -2582
9897 -2582 3411 6732 5608 5963 8541 1077 -6694 -7262 -10749 -8846 -3009 -3232 -13037 -17173 -13279 -12951
9881 -12951 -13714 -12364 -7372 -9466 -4128 1196 6890 2109 -7409 -4144 -2872 -793 -836 -5316 -5894 -12452
9865 -12452 -9553 -588 -324 106 2640 8861 7733 5618 1758 3561 4102 4633 1476 5693 8415 13623
9849 13623 11716 10246 8147 4207 2685 9969 8335 2265 3832 -3926 -10947 -19355 -13846 -11823 -10209
9834 -10209 -5312 -4119 -5086 -751 1348 6296 1995 -2119 -3613 -3837 -5611 1120 2379 -4712 -9430
9819 -9430 -8168 -6339 -2727 5547 10608 9081 3500 -2069 7684 11796 5353 -485 -7583 -12658 -12419
9804 -12419 -2926 351 -5898 -9941 -12201 -1676 5869 6679 7164 7755 8157 9670 9385 6137 -4315
9789 -4315 -5184 3869 5179 3777 3538 499 -9372 -5659 8426 11796 12270 7561 2234 -4709 -8765
9774 -8765 -5572 -1813 -1681 134 -1581 -1247 817 3522 2333 1379 3781 3680 -3942 -1908 3374 6978
9758 6978 1976 -2315 -749 1567 -2083 -784 6323 9993 8782 7708 12373 7054 3748 -35 -7942
9743 -7942 -12249 -3219 534 2122 2739 -5004 -12030 -15187 -10207 -7578 -8414 -1078 1126 -371 751
9728 751 -3738 -9228 -9083 -12341 -8304 -1271 -763 -1312 -2460 878 1373 3945 9208 16363 14666 11254
9712 11254 3698 -3296 -2509 1525 -219 -2310 660 -1367 -4104 -2045 2682 7726 3372 3883 6732
9697 6732 6982 2441 1303 -1523 -3262 -4471 627 -1466 6915 8074 8397 9567 5029 5619 5252 6337
9681 6337 1073 -387 -5273 -6271 -8897 -9878 -12671 -15708 -9318 -9760 -15045 -13556 -8201 -5309 -12031 -12045
9665 -12045 -5298 -6147 -2751 3957 4465 1967 2915 5288 4343 -227 -7794 -6328 -6881 -9137 -4459 -5263
9649 -5263 -2450 2649 1930 -3025 -6256 -6546 -6411 -6898 -5615 -1755 -6997 -3031 -2641 2833 5275 2751
9633 2751 -2930 -5639 -3045 355 1105 2778 4479 -2349 -4380 3287 2338 -6707 -1223 5801 3323
9618 3323 8753 10109 10592 10220 12333 9660 5871 -3274 -8924 -7849 -8694 -7506 783 12168 7176
9603 7176 3657 13926 15351 9530 -362 -7647 -7328 -9817 -4583 4179 11107 9316 6220 813 1140
9588 1140 9062 192 -6558 -6554 -4762 -2184 -836 368 -2118 -2915 -4456 -10280 -9366 -2769 1636 213
9572 213 -1807 -6857 -4839 -4908 -2008 -5821 -5303 -4110 -6536 -3498 -8719 -5673 1803 4428 4071 -1446
9556 -1446 1969 8238 10960 6911 1622 7574 4842 513 -378 -2494 -3943 -3506 -2028 3833 1623
9541 1623 2844 5898 3561 776 1297 -2610 -7020 -2528 5021 8187 9423 8971 10634 13888 14684 10270
9525 10270 4375 -863 4244 3842 4552 3477 2070 233 -6162 -5133 -5187 -1724 -6621 -10775 -8278 -2001
9509 -2001 466 -1750 -4110 135 8461 1423 -7183 -9723 2666 1712 1132 -4914 -10094 -14427 -12711
9494 -12711 -7013 -9465 -10793 -5661 2797 7727 2563 -4015 -3856 10658 13284 9148 12437 9806 7439
9479 7439 2005 -2541 -3178 1871 3993 2672 2843 -413 -4878 -6895 -7197 -3739 2491 1991 4466 3566
9463 3566 3079 2613 2493 5084 7568 6635 834 -3992 -2925 -585 5507 4296 -5579 -11778 -12212 -7658
9447 -7658 -5029 -6987 -5605 -11414 -11123 -8965 -9367 -2823 3479 13030 14078 5861 2869 7359 5020
9432 5020 1116 -3698 -146 -4970 -8744 -5480 1360 -3082 -993 -831 -575 285 -2826 -5169 -5609 3258
9416 3258 9136 9842 9021 4143 -1513 -3957 -23 3348 2682 -3248 -4576 -11805 -15790 -5835 -11121 -16180
9400 -16180 -17730 -12203 -5815 1235 13209 13833 8803 1469 3315 723 1971 -1030 8645 8127 -1490
9385 -1490 -7764 -9230 -8402 -11415 -10786 -4828 -4182 -11552 -8598 -1134 1151 2398 -827 -1300 2074 6367
9369 6367 3426 -369 -4954 -2393 5077 7053 4008 -1004 -4412 583 3695 8003 8604 10219 19121
9354 19121 14357 11660 19266 15725 7152 5407 5981 3618 497 1722 -2887 -4956 -7955 -13 2161
9339 2161 1458 597 7000 3015 -2459 563 2737 -637 -359 3372 -633 -1367 3126 3875 4317 669
9323 669 -786 2659 2690 10812 13561 9636 4501 835 -4846 5693 13131 10889 8674 1079 -1855
9308 -1855 2443 3826 640 567 -100 -4533 -5472 -3515 -670 3255 1044 496 2207 231 15 6773
9292 6773 10598 4468 -1278 -7492 -10794 -15392 -16694 -14875 -16232 -17489 -9987 -6066 -5652 -6556 -3972
9277 -3972 3033 6849 16260 17634 12839 9514 10648 10672 10282 9686 6538 6017 4029 4810 7340 7381 5959
9260 5959 1510 -2562 -3542 -3518 6821 7152 17 -4852 -1978 1578 -6437 -10809 -14622 -14276 -84 3159
9244 3159 -2715 1671 10196 15323 16822 17348 16024 8034 4202 6141 8051 4845 2916 7960 5766
9229 5766 5651 6947 5699 963 3249 5673 4675 2297 2000 -410 7566 11262 8991 3025 4071 12345
9213 12345 9871 1304 10338 17677 16742 11474 11486 11384 9524 8029 4945 4532 4380 8608 10640 7929
9197 7929 14647 18581 13497 15527 13556 12767 17997 13427 8460 13170 19107 20980 20257 12976 11777
9182 11777 12707 14486 14329 12394 16215 18781 13069 10655 10882 6404 11256 13458 12945 15518 15589 17005
9166 17005 17711 21403 25644 20894 23587 22337 18224 16111 22558 24749 23232 24555 22386 23128 30421
9151 30421 34740 37753 37758 41442 43788 38286 42462 43367 48434 53527 51948 54815 57221 53996 54732 64693
9135 64693 81852 83937 80712 81767 89786 100511 114003 125355 146182 173930 194122 212262 244024
9122 244024 279293 326362 383583 436974 497365 571087 662452 790062 957906 1209121 1596539
9111 1596539 2227381 3242655 4714557 6150754 6588601 5892250 4742703 3664261 2811758
9102 2811758 2173063 1685470 1305695 1023859 809908 648066 526698 438396 371681 322829
9092 322829 286433 260407 230727 199821 171766 146203 129551 117580 111111 103709 95173 90958
9080 90958 79729 65960 58762 53151 46526 43825 50582 54883 47621 39376 36884 37210 41813 40747
9066 40747 36135 33497 29667 28224 27223 31478 34513 31736 32797 34131 27025 20721 18092 17482 12595
9051 12595 14388 20680 24875 28646 21930 19197 20359 18205 12681 14253 18521 13901 11776 12194 12097
9036 12097 9286 12997 12233 13775 20417 13683 8575 4675 15604 18130 16358 16131 19486 22473 24187
9021 24187 26750 23243 18718 8301 -2605 -5061 -434 5587 15931 14783 5027 -4556 -8848 -8364
9007 -8364 -2930 2608 970 4504 -1561 2172 8587 6806 7479 17846 19200 26742 28040 26245 17636
8992 17636 9927 13019 12614 13972 12368 9479 7886 4960 -693 -498 -3402 -363 2642 3418 1101
8977 1101 -1284 -1911 -3139 -4041 -53 -771 -11329 -19164 -20331 -21926 -18253 -9989 -9576 -3960 -1065 -4808
8961 -4808 -2246 3697 8863 5159 4281 5027 8901 14606 11561 7976 2817 6177 7099 4774 10066 13216
8945 13216 8309 -6107 -4878 -51 -572 -2395 127 1854 575 2363 3040 1961 -5647 -5065 3943
8930 3943 11304 5260 -6551 -4591 3668 -1388 -14014 -16579 -10967 -6004 4592 3042 3524 4466 -2122
8915 -2122 -6743 -10308 -12791 -8570 -10061 -1404 7999 3041 198 4430 1919 1426 -206 -1386 980
8900 980 3306 8455 16155 16622 14232 16412 18676 17032 9591 5279 4382 7450 7862 7907 9616 4719
8884 4719 2128 3649 959 -126 4024 6492 8775 7939 7641 8525 5112 9385 12217 7867 7682 11595
8868 11595 14580 7597 -1829 1552 9797 3653 -724 2939 1502 -1320 2036 5441 9410 22770
8854 22770 32950 34408 33287 32453 29190 21742 15114 12824 10076 10334 8847 6004 7452 10344 9163
8839 9163 9290 13028 12950 9257 10429 14210 10447 10248 2761 -2053 230 -4060 -6322 -9582 -9350 -237
8823 -237 2280 11370 15448 8399 1782 -1595 -4611 -15685 -9876 5776 9454 6400 20689 30040
8809 30040 30536 27622 27144 20055 15780 16508 17244 12677 2798 -3740 -12259 -15887 -10185 3014 10180
8794 10180 14141 17826 15686 16034 13278 8358 5370 7258 7184 3393 -2835 -538 2089 -2089 -2710 -835
8778 -835 -568 -2402 -6099 -4788 1990 -1048 -5261 -1174 -3476 -7107 -5484 937 7638 5815 2442
8763 2442 -1855 -5697 -254 1592 -2467 -2760 -11584 -9941 -3636 1145 2385 3979 12952 12045 8497
8748 8497 7895 6136 68 -8289 -11406 -6433 -2731 3823 6284 3447 2802 1793 2466 -4206 -11519 -12978
8732 -12978 -12397 -5646 -5228 -1020 371 4105 1191 4733 10945 15741 10007 3067 -173 2107 467
8717 467 -2285 7027 15270 5588 -7104 -16030 -17790 -16586 -11105 -4231 6094 7235 1716 -3210 2307
8702 2307 4449 -2306 -2300 -6144 -3772 -9246 -15292 -8737 -3039 -5921 -3999 -7851 -7561 -4040 -5031 -7533
8686 -7533 -10353 -7341 -5617 -7364 -4115 -2824 -5546 424 5033 8748 6434 3813 10571 13178 11696
8671 11696 5300 -1067 -1843 820 5214 2201 1203 -1362 1838 3737 2356 3695 5235 -407 -2472
8656 -2472 4685 10294 10603 9380 -1654 -8933 -13004 -13424 -12183 -11506 -5210 -2341 3330 11911 18376
8641 18376 16043 12533 6055 -494 -5247 -6435 -7191 -5889 -135 2675 4556 2703 2386 2090 2606 864
8625 864 -4335 -3205 -5245 -743 4166 3667 4168 822 -3492 -6498 2730 7148 7353 8691 8206 4270
8609 4270 -231 -3714 -2083 3043 14787 14213 8670 6367 8756 20206 15671 11336 8512 9516 12114
8594 12114 10491 11142 6148 2726 2961 8921 1673 1773 2556 2930 3903 6609 8878 12917 9656 4601
8578 4601 3272 6380 10500 14468 18107 17415 13667 11700 13822 8493 6570 11309 13048 12541 18800
8563 18800 21121 17899 12061 8932 7481 11548 5303 -1954 1274 1882 -2290 -2132 4401 125 -229
8548 -229 -4460 4834 6596 1664 -3813 -8535 -8078 881 6672 7209 9089 15258 11752 2237 -3770 -11481
8532 -11481 -11332 -8556 -7538 -2504 3696 5826 130 50 -158 30 2788 6417 6971 2611 5763 13825
8516 13825 12522 5744 -542 -1290 -4347 -1834 -4575 -5275 -657 2948 2262 1951 7185 6684 5318 5192
8500 5192 1934 2024 1724 2442 4339 9446 8724 -5 -5581 -2011 149 -1411 -2614 -2901 -4195 -2867
8484 -2867 -3486 -1048 -969 -1172 2724 11035 12906 5742 1335 3917 5265 6432 8221 4259 4019 4524
8468 4524 2647 6482 4960 -1870 -9517 -7138 -1595 6691 10198 3570 663 -4673 1961 5933 7009
8453 7009 4566 5618 8525 7273 925 -1784 2308 5657 1202 1135 -3814 -4340 -1421 5054 2777 -2218
8437 -2218 -943 -2985 -5866 -1713 -313 -800 5447 5827 -7035 -18096 -17330 -11364 -2377 1129 -3137
8422 -3137 -1637 -6132 -6676 -7830 -1835 7234 12178 11968 12195 -1550 -6028 2139 7105 7553 4019 318
8406 318 99 4990 7794 3735 4809 4286 2672 659 5695 9039 13933 4983 6528 1688 -5019 -6706
8390 -6706 -9512 -11285 -11992 -13172 -10294 -6448 -274 -381 -6289 -11200 -8170 -2329 1536 735 2097 5590
8374 5590 4320 4730 5601 5112 -2169 -3561 -686 -1189 -2365 3145 6981 10153 8348 1736 1241 4985
8358 4985 3424 -3334 -1479 3129 11244 12090 -168 -9952 -10096 -2936 994 3191 63 2047 2461
8343 2461 3174 -496 -3202 -9755 -11771 -6952 -2050 4385 1067 -6604 -11875 -8373 -4150 -4360 -5683
8328 -5683 -3789 1485 2042 -5223 -4075 -4287 -218 -1807 -7680 -10368 -9294 -12509 -14817 -13370 -8397
8313 -8397 -10607 -9984 -4584 3755 -3486 -8844 -9155 1897 8701 13108 10419 7182 1893 -3631 -1603
8298 -1603 -800 6033 5839 5178 2060 -4404 -9966 -7370 1240 9202 10373 8865 8464 3263 -6834 -6401
8282 -6401 -1483 6045 4002 -4286 -4518 4584 -325 -5552 -8916 -6957 -3824 -7182 -7955 -4306 -3391 -5135
8266 -5135 -2276 1897 -259 -3983 -12634 -2460 15262 18716 16056 15629 12469 9440 10038 13648 11833
8251 11833 12717 12468 16171 15372 10256 849 182 -5457 -1276 1423 799 6601 10773 1423 -2869 -1212
8235 -1212 187 5277 4363 -1010 -8561 -8631 -7341 -5730 90 1650 780 592 -1089 -7442 -10968 -6757
8219 -6757 -1488 2920 4127 -1276 -7962 -3291 -2377 -4511 -2731 -655 5280 7089 11245 10105 3680
8204 3680 8201 10899 13559 9897 2510 924 1264 713 -3126 -5525 1033 5873 -1448 -2591 -1447
8189 -1447 -319 1148 -91 -4942 -2096 725 1818 2549 9725 16635 21942 22462 16967 5323 2997
8174 2997 5583 10179 14368 21566 18574 18092 17915 19474 18028 19335 24136 14243 11230 20589 29441
8159 29441 32066 37655 32670 33863 27596 16854 6882 6450 7635 4978 7429 14534 16158 17842 19234
8144 19234 15581 20111 23120 21953 27261 31113 30071 28023 26908 31008 42615 50489 50792 46881 47271
8129 47271 47445 49341 46156 39122 46012 50854 44919 39531 38473 38775 27226 31492 40255 37354 30537
8114 30537 25166 16692 14075 20333 24538 32494 37774 42501 40931 39412 25520 18762 26149 28936
8100 28936 30088 39883 38927 42702 51367 56290 54586 50810 45593 42589 45139 40941 40948 43993 35978 35003
8084 35003 33028 24278 21488 13929 12149 11250 11613 9764 17047 13985 14901 9009 13957 14201 8485 5927
8068 5927 16562 12794 7516 12018 6154 -1746 -7821 -4095 -281 6849 14188 15562 17549 18608 23949
8053 23949 28172 23251 20216 16454 16151 8552 3820 7350 2846 -655 2733 -1832 -9011 -5118 -1629
8038 -1629 5567 11798 10948 11008 8379 8356 6430 5318 -263 4793 15627 15788 7343 4348 5972 2610
8022 2610 6703 7654 1939 1063 -2187 -844 2578 3793 1779 -2553 -3017 -3218 -6817 -5997 2919 10952
8006 10952 8377 -141 -5715 -6519 -5626 -2823 -826 1911 -400 -2768 5172 3423 4562 2970 -14
7991 -14 -111 -2853 -6709 -11409 -5768 -2030 8518 12615 6579 3162 -259 2299 1713 1129 4848 7350
7975 7350 5850 4808 1134 -4592 -5893 -1218 42 -6676 -15059 -16848 -14159 -8966 -2792 48 -5269
7960 -5269 -6424 -5366 -6326 -1689 -4678 -11375 -12190 -3050 61 53 -3347 3853 6288 241 1932 3889
7944 3889 -1684 -4426 -7014 -11333 -8993 -6849 -2731 702 -1389 -425 3168 2204 2868 2101 -2028 4167
7928 4167 4806 2102 -2120 -10460 -6321 2851 7042 3744 4348 235 -2542 3212 7708 4453 -2335
7913 -2335 1526 5302 4179 1487 7174 2956 2634 11008 9756 3034 3097 1571 -4160 -1833 3276 5588
7897 5588 14515 9848 6178 11965 7505 1072 -5163 689 2233 11768 11834 2511 -1613 1664 9987
7882 9987 7727 -4806 -3310 3791 8945 16040 14971 4726 5619 3200 5202 -512 -3014 2535 9414
7867 9414 7507 10081 6578 3905 -3776 -5397 362 5528 5453 -549 -3481 -3439 -1777 -1504 -2167 -6273
7851 -6273 -9485 -4921 5799 10931 2967 -4338 -8130 -11365 -3606 -4892 -3700 7406 14648 13417
7837 13417 12066 12819 7934 11612 16404 19187 11260 6643 -411 -906 -1095 -5752 -12402 -10485 -7819
7822 -7819 -3547 -3273 1807 5073 1625 -147 -3219 -1777 -926 -2486 4439 7862 6748 3814 2782
7807 2782 3967 3403 1123 -4232 -2007 5987 6767 2346 -6698 -6594 -5170 -2346 724 4165 7360 6732
7791 6732 -1156 -7990 -12781 -17138 -14886 -20466 -18793 -12629 -8748 -5779 -5134 -6752 -11034 -9576 -14057
7776 -14057 -10627 -11725 -9716 -5984 -6108 -1124 823 3188 2321 7819 12215 6132 5456 -362 -5488
7761 -5488 -3970 -3946 -3433 -817 -5573 -6588 -9772 -7149 -4639 -508 -423 -6402 -12202 -12453 -6106 -3493
7745 -3493 -1328 -3555 -4400 1698 -1334 -458 1522 1655 5121 2394 1471 1329 -1995 -4603 -6728 2170
7729 2170 1943 6798 8457 9251 10639 15484 7391 -2986 -5001 4182 8242 8899 5813 -1880 1953
7714 1953 17351 16186 -839 -14936 -20086 -15599 -694 6040 8591 10384 5016 1080 -3501 -1333
7700 -1333 3018 -1584 -7947 -9962 -3733 -6632 -4032 2610 -4471 -7356 -3011 -2086 -3597 3130 9528
7685 9528 13689 13079 10975 4967 2759 -3006 -11477 -1692 12758 10379 9331 5544 527 -680 -2765
7670 -2765 -1887 1175 1786 -1423 -2160 -7121 -7119 -1758 650 2711 -6439 -14790 -14541 -9073 -1468 1176 -5467
7653 -5467 -30 -2056 -5972 -8073 -1910 2685 6987 5624 -538 2698 629 -5233 -1882 4546 3796
7638 3796 304 427 -2291 447 4539 9061 9902 6434 -822 -18 1289 256 -7068 -6874 -5923 -1279
7622 -1279 1642 -1154 3113 4533 4878 9938 3433 -1239 10322 14188 10890 8554 6688 3940 -6487
7607 -6487 -13302 -9694 -11588 -8413 -2342 1384 3022 44 -3041 4798 3337 1826 3876 6850 2192
7592 2192 -2105 -6212 -11185 -8855 -6610 -2350 9946 15673 6937 3165 3464 -1597 -6006 -3889 -5577
7577 -5577 -11037 -3862 7307 6504 1460 4198 2231 -2542 -3185 -7545 -11052 -12920 -11524 -9704 -7671
7562 -7671 -14852 -17155 -10066 -7401 -7273 -12329 -15872 -21684 -18569 -12295 -8879 -4383 -2504 3435 3348 9262
7546 9262 11075 5692 3402 2125 896 -1069 3478 -1363 -884 2788 13607 28172 23661 14808 12751
7531 12751 8913 6096 1598 -1622 -3639 -539 4069 2621 2763 6675 3181 -2727 41 1420 3345
7516 3345 -4412 -7825 -5708 6656 12043 4108 -4721 -5594 -648 1892 5799 5753 2855 560 -519
7501 -519 -4363 -7689 -6660 -3690 -109 -1813 -1080 -2215 -3741 -4703 -4356 -4653 1202 2704 2824 5810
7485 5810 3455 5574 -2945 -12252 -9132 -12882 -9355 -5397 1589 6104 7946 4167 1517 -5005 -9112
7470 -9112 -2148 705 3062 2323 2379 -349 -2149 6252 8980 -387 -7520 -5939 -2158 -5326 -7620 -4854
7454 -4854 1936 -138 -4680 -5737 -3187 1156 -3902 -6341 128 -1526 2237 2501 -376 89 323 -82
7438 -82 -2759 -2300 -8247 -11135 -6299 -4733 -9201 -5970 -6165 -5923 5786 4708 419 -5134 -11131 -7381
7422 -7381 -4322 -1945 1051 -1638 702 -2216 -10592 -17002 -15557 -18082 -12952 -8244 -8382 -8935 -5233
7407 -5233 -631 4964 6229 3637 5919 10176 12169 5243 -859 -1573 -356 3481 605 -4766 -9736
7392 -9736 -6151 3576 2464 -6597 -8295 -9265 -6087 -6730 1463 11221 15097 17792 12454 8641 2407
7377 2407 3923 1726 5490 9430 7424 4396 5243 5727 9812 -4739 -14358 -13999 -8461 -6139 -5260 -6450
7361 -6450 -946 2270 2206 12617 10148 -967 -2106 4965 8574 10836 10418 8033 3893 1593 99
7346 99 543 5489 8275 7932 4615 -2277 515 3081 1266 6136 -660 -1548 -1014 1201 2792 -1879
7330 -1879 -2432 -504 -2787 4518 4435 -580 4691 7799 3073 3357 3952 -3057 -998 3270 6750 2302
7314 2302 3729 230 -7525 -5761 1042 909 -2880 -10061 -20724 -23780 -14912 -11582 -8350 -8598 -15116
7299 -15116 -13264 -4895 -8391 -16412 -19834 -21460 -17424 -11501 -13474 -8464 -5885 -6166 -843 -2990 -2662
7284 -2662 -2784 346 2207 1231 -4858 -7677 -216 6647 3665 3592 661 21 -2614 405 8714 11562
7268 11562 5816 2120 -3233 -7708 -5793 -1944 1627 5563 1825 -5677 -2879 -863 1696 -1288 -6485
7253 -6485 -6960 2964 12045 7421 -4296 -5968 -7250 -5160 -1877 -1602 -1289 -2645 -4929 -4207 -3470 -10187
7237 -10187 -5709 -8154 -11775 -10088 -8329 -4872 -3165 -7854 -7562 -6178 -1249 1903 2246 1356 4532
7222 4532 2124 -6726 -8023 -5095 -11335 -1411 5687 2775 3918 -2698 -11268 -14191 -9841 -6434 -1339
7207 -1339 5717 9437 13299 8668 12837 16156 12815 13319 12173 13906 15929 10972 3553 -3661 -1376
7192 -1376 -3017 -3839 -4775 -8296 -6771 1918 -2023 -5025 -6563 1589 4700 5901 7327 6336 4101 -847
7176 -847 -1295 -7092 -6208 -771 -6718 -8047 -5798 -6875 -5631 -6340 -5993 370 3122 8270 3621 72
7160 72 531 -10359 -5605 -5389 -6797 -6566 -8838 -14295 -9427 -1712 711 4043 4497 170 -4197 -8252
7144 -8252 -8906 -13363 -13272 -9693 -6289 3233 1671 1697 163 1960 6836 6768 5204 4806 7823 2457 -2801
7127 -2801 -3667 208 4777 8995 9458 -2870 -6716 -6247 -7747 -8904 -13530 -10537 -5350 -7372 419
7112 419 6858 8081 3473 -1278 5970 7600 5483 2738 -4237 -5918 -2745 -441 -185 -115 -6785 -11975
7096 -11975 408 4136 -1344 -1553 -5865 -5589 -5114 -2424 -2242 246 5772 -308 -3274 -6570 -7314 -1140
7080 -1140 12614 5063 -1510 -2948 240 -4963 -5719 -12460 -8679 -2709 -4692 -5555 -3702 -3777 -2229 -1388
7064 -1388 -1430 166 1298 -3929 -6988 -4311 -1680 5600 8033 2805 7541 8292 4067 1981 5117 11721
7048 11721 7752 2576 1169 1885 1774 -2519 -1052 1761 4314 5990 6475 4755 3412 211 1891
7033 1891 4006 6736 9621 6912 2074 2090 -709 -10966 -12894 -11919 -8051 -3894 -3924 -5189 -5247 -7400
7017 -7400 -790 1698 5840 12179 11639 19708 20286 11349 -5169 -1978 619 -4197 -8993 -13547 -17993
7002 -17993 -17099 -11895 -5458 3742 10094 6076 4418 -570 -8140 -11071 -8763 -6438 -6402 -4820 -3159
6987 -3159 5194 11614 6458 -286 -2682 -3102 -2026 -3227 -3050 -10456 -17162 -14486 -10124 1036 3821
6972 3821 -483 -3849 -3240 -5690 -7150 -7883 -4521 -2208 -3540 -6320 -3652 2530 2334 -1466 288 -1786
6956 -1786 2740 954 -1142 8240 15341 17209 17485 10633 -2224 -8921 -3242 249 -681 -2653 911
6941 911 -342 -5612 1850 7710 5644 2169 937 -3091 -5120 -1662 2461 2742 1215 2611 -1658
6926 -1658 -8808 -1294 7187 6275 5868 4299 4986 10440 6626 3725 -662 -3018 -7042 -9480 -11113 1662
6910 1662 6559 2545 4460 876 -2359 -8670 -15411 -10620 -4928 -5298 -11845 -14823 -13130 -7786 2971
6895 2971 6459 4531 -7105 -9886 -3589 1589 5806 6952 7079 8242 5992 3022 1381 -3354 -4305
6880 -4305 -1086 3575 2412 -416 -4672 -3824 -4629 1309 3631 10233 12289 11778 2513 754 2817 133
6864 133 -1935 -86 1186 -1195 1698 912 -7040 -8375 -9066 -1579 2646 6558 2671 -6768 -8968 -8721
6848 -8721 -3727 -2458 -3836 -7531 -9786 -4973 -5230 -3756 -2759 -3373 6225 10237 9643 1430 -5051 -2323
6832 -2323 -9977 -11753 -9476 -4338 -8172 -2608 7434 9347 2112 -3732 -7445 -2328 -1202 -4087 -1105
6817 -1105 -2798 -8561 -14817 -13811 -10197 -1251 1457 -2515 -4612 1272 -498 -3362 3286 127 -7617
6802 -7617 -8092 -8526 -3668 -4696 -4566 -1836 -5161 -450 3880 4682 3308 5076 2963 1577 1056 -3370
6786 -3370 -1517 -2007 -4328 -6341 -10599 -15067 -11015 -1916 -3045 -4722 -4236 6304 14721 14636 11639 11340
6770 11340 7948 16134 14828 4171 -3293 -6232 -7254 -4166 1886 2984 7452 11711 8543 1381
6756 1381 1395 6550 3060 -1035 -2609 -11851 -11379 -603 1095 -929 875 4515 4137 7052 9436 6262
6740 6262 1694 -423 -4031 -11123 -11033 5577 11127 11268 12332 5474 -4333 698 6355 3811 -12112
6725 -12112 -17169 -12817 -11788 -2160 -213 400 5972 8174 -3327 -3770 -4076 -6659 -9350 -9434 -3207 3168
6709 3168 7250 2837 28 2133 -2707 1754 -693 -1523 -3909 -622 6464 11571 3833 -1151 -7515
6694 -7515 -7130 -5731 -8396 -3635 2588 3597 4494 6588 6316 1632 -2183 1382 5276 7017 1140 -1381
6678 -1381 -494 103 613 2112 5621 744 -12099 -10362 -5025 -2414 -6922 -7155 -1986 8278 9060 2162
6662 2162 4147 1997 440 2704 2749 4567 -3119 -6042 4869 13865 14007 12775 11003 10104 1305 -9510
6646 -9510 -10922 -15240 -10322 -1723 1459 3857 930 -4991 -79 3059 -974 1693 3077 3232 3913
6631 3913 5964 2408 5165 3515 6057 8149 10804 12386 7552 4031 5602 2591 -1259 -4245 44
6616 44 5933 13758 10718 5229 4541 8349 7160 8923 15091 12197 1791 3948 10819 9867 5118 -5282
6600 -5282 -5071 -1353 -936 -2737 -6083 -5572 -2372 1780 1927 -1655 -120 698 1473 4760 2470 3429 5563
6583 5563 5164 -4383 -171 11355 18073 9949 2874 -3937 -9641 -9345 -6633 957 4322 3719 2185
6568 2185 3076 -1334 900 6705 2316 4932 10322 7804 4328 7398 17615 15800 6674 851 -5444
6553 -5444 -5303 483 6265 8487 13775 6365 292 2373 -3407 -1100 -2327 -3851 -4647 -3812 -6297 -8099
6537 -8099 -1787 4692 6961 2525 3015 1888 -8458 -16922 -14977 -7298 -33 5339 -646 -3063 2804
6522 2804 1160 5689 11163 5889 1339 3134 -2694 -12321 -10900 -11355 -12041 -9376 -5372 -4720 -5951 -85
6506 -85 7712 119 -2066 3435 3583 2856 6032 2672 900 453 -6017 -10407 -12053 -13012 -14228 -10180
6490 -10180 -6794 -8731 -9821 -9056 -12349 -6352 -3084 -4967 -2248 -3631 867 35 -50 811 -2331 -6963
6474 -6963 -5981 935 5371 1559 3480 5549 3556 6766 7652 7063 5184 1661 -2495 -1870 3869 -457
6458 -457 -2441 -1870 1280 8677 8566 9190 13718 9963 5267 3361 5194 9028 6381 1476 672 -6040
6442 -6040 -7182 -6988 1372 7887 3760 -10572 -13053 -4679 -5521 221 566 3658 4997 263 -680 -3065
6426 -3065 7424 15494 10911 1593 2045 3144 -2841 -1397 1279 4025 9116 5966 578 -1690 -6360
6411 -6360 -3888 -3085 -939 -3265 -6431 -7506 -6099 -3727 355 4339 9537 13022 8204 1579 6018
6396 6018 7660 5065 2547 -1631 -3540 2292 4537 4158 5551 1608 -4127 -7710 -12546 -5872 -1100
6381 -1100 2255 -3993 -10435 -6893 -6293 -7579 4073 7045 6663 -1104 -9146 -12635 -8272 -2248 -5014
6366 -5014 -6656 -4994 -9021 -9583 -5160 -1075 -84 4220 12408 11367 11840 10478 3430 5427 9016 8125
6350 8125 2406 3601 13362 6785 -2361 -5395 -6504 -3022 2551 -1 -1072 -1061 1151 -4778 -4727 -1738
6334 -1738 -2915 -9748 -12732 -9715 -1396 -1139 -6038 -5932 -7788 -3605 -1983 -2696 -9312 -7550 -3819 4675
6318 4675 3240 -3844 -5300 -2716 -196 4032 5331 -3960 -14901 -16371 -11784 -12270 -14949 -10694 -9202
6303 -9202 -11605 -11108 -9414 -2392 -7488 -6537 -2973 -2011 -3995 -3799 -6576 -6211 -85 3283 2964 -357
6287 -357 -1132 1105 422 5506 5713 3749 -2598 -12103 -7595 8642 12351 3052 549 1696 2178 2705
6271 2705 2505 2801 3088 3722 5542 6687 1737 -5940 -4746 -2841 1352 1495 -2425 -644 1314 1203
6255 1203 3044 6412 13496 9376 2631 884 -3219 358 -2961 -4319 -1976 -60 2172 316 -7348
6240 -7348 -5187 -8236 -7036 -5709 -3097 -2265 -5415 -4823 -2886 -3766 -3453 -2974 -7371 -7247 -5517 -5292 -6794
6223 -6794 -4551 -2739 -4545 -5273 -12254 -14688 -12680 -6742 -1152 -4440 455 8520 5862 1907 5904
6208 5904 -1332 -2491 -589 3343 7722 3943 -4053 -8590 -4729 -2067 -2279 -3929 -472 -2781 -9609
6193 -9609 -12480 -10249 -7319 -8692 -5871 -4184 -5098 -6667 -12257 -11514 -7778 -8728 -13466 -13125 -5070 5442
6177 5442 2567 5496 7397 7746 4820 8455 12437 7863 4372 2372 5315 2923 558 -4688 -4381
6162 -4381 642 4091 3821 314 -3940 -10213 -9287 -9183 -8990 -6806 -7283 -5353 -2174 2852 211 -11073
6146 -11073 -14619 -13674 -5449 -8555 -2175 -5505 -7094 -7864 -4164 10372 13930 14931 16481 10485 7803
6131 7803 1290 293 -5486 -7611 -3398 4160 4207 933 -3048 -14376 -12201 -5666 4481 3548 -385
6116 -385 616 6137 2636 -864 -4780 -7456 -4674 -5681 -9972 -14166 -13904 -14844 -12237 -1904 2522
6101 2522 2802 8641 2201 -245 1334 2834 6276 6763 4706 6303 4969 7686 18793 16195 4185
6086 4185 441 -1190 -6107 -1687 -253 9333 17036 8887 -2756 824 2374 -2526 -8059 -6502 -1580
6071 -1580 -2738 -4136 -970 -7152 -8219 -3852 -2185 1497 4824 7080 664 823 7828 12523 9265
6056 9265 6732 8283 8925 3965 4107 3573 4968 2614 5776 11239 5477 1339 0 -834 -5876 1492
6040 1492 9880 8153 9401 7882 8761 12526 8747 3255 -8480 -8403 -2527 -3520 -4533 -5388 -5493 -8002
6024 -8002 -2278 4181 5010 7946 3039 3516 4764 5381 10742 10485 6121 6631 2740 -4627 -4956 1812
6008 1812 7677 5850 -548 -1802 -1400 -1842 955 2863 3275 10331 12515 4244 1400 4387 4854 8453
5992 8453 13394 6422 6116 14500 8634 -1488 -8907 -8797 -9165 -8281 -8524 -6672 -4417 -637 -648 3425
5976 3425 2211 1013 10127 6821 -3586 -7481 -4019 655 -1371 -2860 -3078 -1930 -25 767 -12331
5961 -12331 -18064 -12790 -4919 -11686 -10935 -7450 -2587 2229 -1601 -5229 -2384 -3453 -983 -998 3495
5946 3495 2004 -697 3853 6228 -5322 -7479 -2321 1787 -2411 -13776 -6325 -5954 -2678 8322
5932 8322 6568 4801 4267 -72 1074 1756 -1104 -4445 4234 3230 2870 -2315 -7263 -4017 640 -4113
5916 -4113 -4806 -7048 -4374 -3908 -2720 1721 -184 -161 2169 -5239 -13276 -12106 -5929 -11354 -10747 -7535
5900 -7535 -15302 -19004 -12901 -9073 -8977 -4267 186 3136 -965 -3338 -1855 -930 -7285 -5410 -7980 -2130
5884 -2130 6958 9139 7607 6988 545 -2599 -1688 -780 3846 5838 3566 7815 10867 8637 6710 5718
5868 5718 3984 9354 9539 561 -7016 -1489 7733 3247 -562 2870 1039 -8487 -12439 -382 5428
5853 5428 3920 2050 -3207 -5013 -719 557 1926 1547 -1235 -3612 -5254 -5766 -8924 -10258 -15855
5838 -15855 -14312 -5930 -2085 6884 10838 6923 5336 -4337 -6305 -677 336 5077 6446 6126 3776
5823 3776 5416 4023 -2008 -4601 -8253 -9666 -6704 -330 5509 11757 7457 6558 3940 -5167 -8245
5808 -8245 1526 2791 -981 1493 3671 5551 321 6336 5426 396 -10002 -13517 -15436 -7333 2264
5793 2264 -3504 -1445 -697 1650 7447 4292 4117 4777 -3353 -6560 -1197 2792 1404 2982 3130 7188
5777 7188 8531 -278 -6232 -6562 -5202 -7694 -6961 -3185 -3351 -7077 -6933 -8060 -6311 1361 9301 356
5761 356 1400 2992 1324 -5403 -17571 -18262 -9272 -7684 -207 4766 1691 864 5700 2222 -116
5746 -116 -290 -2893 -209 3359 3475 1522 1068 -1226 -993 -5586 -7891 -7930 -7636 -3137 871 1586 -4317
5729 -4317 -8543 -8609 -5789 -6199 -7452 -10530 -9722 -5642 -8979 -13199 -6877 -5220 -7562 -3348 -2822 -144
5713 -144 7 858 -148 9644 13948 11516 16283 16886 11482 2303 1063 -6200 -9857 -3078 9300 8454
5697 8454 1249 -5594 -5648 1661 4196 242 1638 366 -2282 -4186 -6904 -8970 -11077 -7402 -8865
5682 -8865 -11716 -4984 -762 488 -1356 -5588 -3517 -4885 -12152 -18782 -16579 -10798 -9349 -8029 -5651
5667 -5651 1507 1831 -8215 -8418 -7009 2572 6586 7349 11509 10206 1323 3379 9485 15556 18362
5652 18362 16574 17250 15760 12961 11045 7830 1235 -8555 -6949 -2850 -309 1809 254 -2245 -6341
5637 -6341 -7268 -1521 -3599 -1970 -3673 -4803 -8168 3238 9033 5037 -5704 -2571 719 2079 4801
5622 4801 9836 9362 2652 -2674 -3034 -256 1002 -820 -7521 -9386 -6169 -1244 -2699 -862 2804
5607 2804 7246 10194 6689 993 -1255 -1479 999 -1420 5831 6983 3577 724 -10395 -21238 -21281
5592 -21281 -16941 -12481 -5087 2995 1035 257 3811 8235 3100 1005 6034 1256 -1213 1511 7829
5577 7829 9420 1168 -1649 -8557 -9903 -7112 -4225 -446 66 2677 5470 -3396 -4710 -6902 -7022
5562 -7022 -4151 -1097 -4527 -639 -2994 -5578 -9119 -5803 -9328 -1634 -2188 -9015 -3524 -2308 -5750
5547 -5750 -3855 -3863 -3438 3215 5484 6451 2186 -2646 -5570 -9095 -11435 -7335 -8266 -9558 -8441 -11816
5531 -11816 -16251 -20387 -24188 -20372 -10529 -10053 -11645 -4176 -2033 -12013 -11090 -12361 -8713 548 3138
5516 3138 -1292 -7044 -14564 -20257 -22405 -22943 -22237 -16753 -9989 -5837 -882 2796 -3042 -6718 -8217
5501 -8217 -6886 -7225 -379 -3548 -507 -2510 -6163 -4553 1174 -3585 -7055 -1977 -727 -6061 -11914
5486 -11914 -15743 -6115 1184 4317 4012 -1877 -6168 -1147 2463 -4203 -6613 -3880 -3019 -783 -777 439
5470 439 835 8179 6594 6936 15096 14832 4817 -5791 -7535 -6105 -8534 -8891 -10254 -10784 -8022 3078
5454 3078 1498 -3168 -4883 -9288 -9526 -582 7622 8597 2548 4036 7471 17047 18936 10209 -4343
5439 -4343 -14534 -15696 -16706 -21420 -15000 -6784 -3698 -3496 -3777 -639 -4223 -10620 -5286 4100 814
5424 814 -81 5407 10490 11109 1832 -3216 6277 6052 4058 187 1756 1691 894 3326 3714 3462 3870
5407 3870 -41 -122 -7678 -9781 -8359 -4769 61 7781 5619 5292 7549 14460 11808 7219 4055 4486
5391 4486 12076 15473 10927 11245 9237 4492 -378 -1975 4033 3747 448 -5198 -1191 -3567 -5775
5376 -5775 -8283 -8171 -2104 8513 4843 -2674 -5701 -8384 -2615 1979 1091 830 3865 913 2871
5361 2871 5875 6074 4058 1772 1236 -3048 -7809 -2855 -1744 -3053 1325 6567 10869 13573 8676
5346 8676 -3889 -12464 -8591 -8170 -6178 -3393 -1832 -930 165 710 8520 2387 -7203 3223 8074
5331 8074 3509 -2416 -818 -2395 3891 7408 4935 -2984 -3833 -6487 -1042 2023 3540 9998 17492
5316 17492 11265 3973 -1761 -6978 -1376 4789 8013 9996 8000 8144 5443 665 3450 3467 243
5301 243 -11344 -14481 -2555 -3028 -4540 -4987 -5676 -4356 -3086 -3241 -4477 -3908 -4055 -7468 -5337 885
5285 885 6593 6838 6369 9618 11784 5527 2086 -3016 -1677 -1280 -403 -5056 -7483 -1068 5644 7710
5269 7710 -1132 -3321 -5279 -4187 -1649 -2802 891 5723 6348 -4910 -3339 2256 2889 7171 5187
5254 5187 -1053 -1711 -6395 -16819 -18955 -16469 -16268 -14182 -3340 -3348 3338 2656 -5219 -6019 -2442 -5542
5238 -5542 -4675 46 1701 1753 -1721 -2874 -5148 -3471 -756 2577 421 -3397 -7137 -6337 -10135 -14336
5222 -14336 -11120 -1820 -3215 -10418 -661 2677 -4765 -9561 -2389 -2305 -6744 -3911 -1175 1104 118
5207 118 -1752 1081 3988 16674 15826 7688 6018 1590 2084 -892 -5388 -7309 -6938 -6441 -5415 1239
5191 1239 5242 -2141 -4514 -4188 -2937 -8676 -4329 -8736 -10093 -5300 -6455 -8161 -10470 -8695 -5481
5176 -5481 -6084 -10404 -4409 3838 1072 1790 336 -259 -1294 7205 11042 13112 7818 7970 2886 -6901
5160 -6901 -6367 -7148 -3548 -4117 -10425 -11318 -4277 -5863 -3749 -1506 -9739 -16146 -6645 -4095 2275 13241
5144 13241 10951 5631 3920 5455 7959 2891 2534 4019 2224 -1416 -3474 479 5523 8171 8354
5129 8354 -756 -6391 -3820 1195 8967 10083 6973 63 -3174 -3392 -8270 -13550 -11167 -10862 -10948 -6558
5113 -6558 -3583 -4476 -3600 -4351 1077 304 -1288 -517 2357 3364 10837 1311 -6677 -8483 -10253 -3852
5097 -3852 -2166 2856 3840 3242 2392 10701 12990 10047 2694 -3498 -1523 -2133 -6815 -2458 -359 532
5081 532 4878 11544 6215 795 2289 68 3078 12181 6814 6228 4182 4526 1952 -4595 -6191 -6287
5065 -6287 -837 -239 3636 5811 11491 9254 3693 -1179 -2256 5040 3327 -660 2403 -868 -1815
5050 -1815 4877 855 1777 3900 1016 3860 5333 1939 -875 3198 5124 2009 829 2419 -3471
5035 -3471 364 -1276 -84 13154 17088 15119 9739 2886 -1936 -838 -3962 972 7890 6510 6468
5020 6468 7402 -1745 -2144 754 1140 -2950 -5635 -2335 454 2856 -902 -4869 -8049 -9708 -8539 -6591
5004 -6591 -6997 -5272 -4972 14 5486 -155 -5606 -13358 -10422 -4736 -7032 -6943 1761 -1015 -6459 -12015
4988 -12015 -13263 -9682 -6137 -9178 -5025 3510 -2725 -6571 1531 4372 -862 4528 4325 10212 17731
4973 17731 14444 2528 -4255 -6082 -9374 -798 4887 9729 13546 10446 -3673 -10657 -4260 -6163
4959 -6163 -2059 5608 6653 -6274 -12857 -14280 -10910 -4655 926 6910 3597 -1233 -3519 -4488 173
4944 173 -410 2471 9614 4905 -4036 -8361 -10323 -12634 -14242 -14928 -6253 -7771 -3380 4119 11891 14740
4928 14740 11310 1467 -2868 -2017 -129 1341 10914 6888 9009 11903 17014 18271 13294 8029 4389
4913 4389 2186 3207 3343 5193 10231 10763 7030 6135 5099 1851 -1994 -373 -1489 -5363 -6178 -6258
4897 -6258 -8254 -12899 -10456 -3460 -1171 1973 525 755 864 -2121 -1668 -410 -1754 2261 7718 12464
4881 12464 9661 4680 6939 15911 15723 17708 12064 1188 -847 3004 1162 -82 4124 7587 273
4866 273 -3116 -1169 4570 5399 9228 10722 7828 7595 3255 942 -4649 -11089 -14738 -14601 -6349 -4687
4850 -4687 -5498 -4861 -1653 -2077 -3695 -1712 -2371 247 7812 7596 2586 -1276 -5787 785 -398 -978
4834 -978 1928 -2534 -2088 -7173 -8037 -5344 -2480 -3434 -2558 -2140 746 616 -6700 -4380 6913 8458
4818 8458 3909 9519 5103 2422 1566 -3805 -673 -630 2533 7135 8139 3068 4177 8853 7026 2814
4802 2814 3789 4894 3281 35 -1684 -2712 -775 5399 12295 12125 6996 -5155 -6633 -1130 -779
4787 -779 -4147 -3392 -555 9020 11910 10952 8003 545 -2196 1296 5700 7461 -1943 5520 11091 8208
4771 8208 -2395 -8302 -9950 -2449 12246 15626 14678 10688 19279 18904 14318 9127 3222 1762 6258
4756 6258 13419 9424 12800 14509 15578 14711 1498 -430 4560 8241 3228 -3808 845 3463 4637
4741 4637 5174 -2212 -1006 1840 -1179 -5710 -8135 -11573 -6855 -6925 -10488 -7477 1925 33 -2921 -2554
4725 -2554 -678 -5083 2734 1152 2240 7230 10784 5826 -4134 -2391 -224 -1626 -6353 -13620 -13272
4710 -13272 -8967 -19904 -16389 -7645 -2022 -698 -910 -294 4026 1071 -8106 -10696 -7742 -10808 -19143
4695 -19143 -18076 -8876 1186 5283 2665 -1151 -2692 -6628 -10409 -6641 -1046 -2665 253 4279
4681 4279 2266 3707 -122 -3003 813 194 -1209 8460 16271 7325 13409 9470 3279 2438 2701 2732
4665 2732 3864 2574 3065 7968 8923 9903 12113 16535 14261 9120 2528 -680 -3720 -1607 -8139 -7796
4649 -7796 -6475 -8092 -10650 -13185 -10064 -7292 -2015 -2766 -4398 3673 5030 -4312 -13763 -12871 -5028
4634 -5028 -1233 2421 -1468 -7843 -2257 4652 8308 1014 -3020 -735 -5083 -7501 -4642 5961 5971
4619 5971 1552 4400 4702 7083 16591 12860 7849 4723 -4791 -6915 -3596 3408 107 -2347 -3507
4604 -3507 -1303 1114 8305 6933 8221 3518 -2343 -7948 -2801 -3595 -2983 -3618 -1615 1590 1173 3007
4588 3007 6807 12384 11127 9499 12561 11223 5963 3921 1805 7979 9308 5083 -7006 -13658 -9160
4573 -9160 -10223 -12495 -13757 -10982 -14220 -15556 -10258 -2350 -1273 3739 3935 8552 6326 1321 1323 -3590
4557 -3590 -10777 -8467 -6450 -11025 -16268 -13373 -4346 -6003 -11915 -9502 -9013 -1811 3984 1701 3624
4542 3624 16054 15331 10144 9024 1220 -8506 -7194 -3149 -2451 -699 927 -3080 -2911 3411 12449
4527 12449 5182 1244 -1625 -2796 -4577 -4504 -5588 -9295 -7504 -11030 -9221 -574 4805 8634 7453
4512 7453 3719 -463 -6722 -4401 -1398 -3308 -11358 -9189 -5041 -2043 6137 9233 12981 15487 9380
4497 9380 11294 10933 2959 2592 3037 7140 2004 -3633 -2234 712 -1099 472 1211 1102 -742 -1469
4481 -1469 4045 4995 1671 3780 12319 9869 1432 717 -632 1953 3243 -633 -4069 3552 7575
4466 7575 11812 6359 -175 -1762 -3132 3683 9350 7847 4347 1028 1798 1966 396 -4715 -5434 -8232
4450 -8232 -9226 -15384 -14573 -15752 -15335 -12619 -8378 -8731 4794 10917 2402 -552 564 1342 3099 3458
4434 3458 5568 6686 3886 1036 -1178 -7151 -8931 -6769 -1364 -1769 -4060 -3950 2133 3278 5818
4419 5818 6909 3985 5887 2057 -2758 -3768 -3973 450 5949 6949 8136 17346 20733 12527 2639
4404 2639 -4785 -6997 -2656 286 -5469 -8572 -9005 -11090 -5841 -3927 -8683 -9324 -9074 -11705 -8997 -4038
4388 -4038 -2739 1518 850 -2895 -8271 -864 -4030 -6557 -8643 -8328 -4175 -2762 834 -2164 -4363
4373 -4363 -3062 -2069 -1364 -145 -3575 -6828 -4861 -6036 -9113 -2617 -4818 2556 7930 11503 6791
4358 6791 -927 319 3632 4389 267 2449 7551 2751 1936 5873 10687 11552 10202 2791 -7205 -9166
4342 -9166 -9777 -12595 -11610 -4599 7508 6133 -675 -5738 -9766 -14275 -14393 -7516 1308 7199 8316
4327 8316 6246 975 -2937 -960 -994 -4519 -4029 398 117 1839 -2588 -5790 -184 -3873 -11567 -7785
4311 -7785 -5041 -5991 -6096 -3813 -4845 -140 3464 3938 4040 -2293 -4329 -9965 -13678 -11443 -4972 -2273
4295 -2273 -3394 -371 400 7265 6885 7059 10014 3570 -925 153 5837 12687 11207 7256 6442 7875
4279 7875 2007 995 1002 -4510 -5248 -2948 355 7125 4351 -52 -5216 -10466 -5679 -263 912 -883
4263 -883 -3002 3166 4820 -94 2706 4766 -5700 -8542 -10102 -7087 -434 1805 -237 4347 1521
4248 1521 1865 3407 -3344 -4838 -3060 533 1533 -3330 -6731 -4013 -4658 -8442 -9070 -10598 -9340 -8932
4232 -8932 -4044 -2735 -5177 309 1344 1633 6242 9084 11326 15756 11353 2056 1438 4825 5593 1420
4216 1420 -4298 -5240 -4543 -648 791 -1141 -13314 -4117 -667 -5119 -3076 -4813 -12655 -10729 -9091
4201 -9091 -10922 -3561 -1049 3706 6110 7819 5746 3322 1317 -4352 -10376 -5281 -4417 -3602 -3834 -8162
4185 -8162 -7744 -4058 1947 3168 5949 6055 3294 2852 -3408 -11068 -8836 2135 -143 -8531 -6094
4170 -6094 20 -9692 -13258 -15661 -13903 -12342 -7703 -1652 702 -1763 -8832 -6052 -1250 5759 7215
4155 7215 10535 6245 -171 3236 841 3142 -1767 -4464 -5192 -4897 -2245 -1271 756 1762 1116 646
4139 646 -763 -6113 -4713 -5061 1762 8795 6754 3153 4662 2977 3718 5833 5585 1146 -4335 -6027
4123 -6027 -2482 1152 594 2159 7855 6241 5722 4275 2769 8202 7744 2095 -1788 -1613 -555 3118
4107 3118 -3156 -7960 -9442 -4992 4353 4477 -870 3415 9505 -2406 -4571 -3759 -4294 101 1200
4092 1200 2178 -5144 -6191 -11767 -14195 -8751 3113 8952 -397 -954 1453 5668 2119 -653 899
4077 899 1789 1211 -2409 -5961 -3366 6337 6599 8442 12500 8000 8165 3084 102 3636 3609 5595 2536
4060 2536 8120 14566 15886 12606 7633 4663 -2854 -9779 -9287 -5755 -4749 -8073 -4496 -908 941
4045 941 1540 6095 8658 5800 3477 -4849 -9686 -4249 -1065 3645 8623 7759 -281 104 -3268 -3299
4029 -3299 -3204 -84 1550 3062 -5779 -13645 -15078 -14461 -7085 -6587 -4202 3928 11948 6091 4735 -767
4013 -767 -4506 -14586 -15754 -10504 -17020 -12123 -9579 -2911 1188 581 -1839 2325 954 -5786 -4934
3998 -4934 -2088 -1717 -4010 -6637 -8958 -8076 -9589 -8450 -2594 -798 255 1261 2619 -3308 -6367
3983 -6367 -5462 -7478 -8777 -13954 -13575 -5304 1469 3453 5235 9794 13878 9743 14066 11229 6028
3968 6028 8511 3423 -3686 -1035 -6287 -8035 -6002 130 -1498 -3453 1131 2610 5198 3640 -4722
3953 -4722 -3768 -5086 -2231 -3363 -9458 -8898 -5284 -3643 -6170 -8890 -10083 -6157 -7458 -11688 -5951
3938 -5951 406 6652 3183 -1318 2970 7059 -520 2089 6048 9929 5262 -675 -2824 1020 -2401
3923 -2401 -2162 -3850 -3314 -686 -8474 -9282 -11192 -10849 -12873 -9956 -9025 -7333 -9514 -8723 3288 11792
3907 11792 17250 11696 7327 5392 8203 6448 -4400 -15100 -14552 -11356 -13474 -10700 -5105 319
3893 319 2547 4689 6001 2981 351 1162 3816 3014 1741 2141 5236 1880 8144 8203 -3135 -4028
3877 -4028 -2297 -2686 2730 -977 -7741 -5458 -43 -2803 1474 7714 11455 13649 16320 218 -7064
3862 -7064 -3837 -3341 -3940 -12479 -11219 -6436 -4687 -4461 -10279 -11359 -6126 1131 4150 4354 -47 -3625
3846 -3625 -1564 -3340 3600 6069 8982 1805 -7973 -4497 3657 15096 16315 15444 6021 2048 2276
3831 2276 6032 5119 -1253 3737 8720 1585 332 4618 11251 1933 -6663 -8646 2301 6028 -1005
3816 -1005 -11053 -10647 -6158 -5025 -9153 -8896 -2966 -5666 -6811 -3666 -3216 -2681 3235 3469 3268 5323
3800 5323 -4148 -6708 -6388 -5629 -5466 -7064 -8202 -4966 -5072 -5640 -3657 -5241 -2321 -1876 -4068 2343
3784 2343 1186 3800 5312 -5873 -12225 -7746 -3810 3282 7226 11659 10884 2472 4518 9227 9194
3769 9194 886 -1205 1230 7597 7078 6694 2737 2695 -926 -9418 -8927 -4808 5522 6814 7263 3377
3753 3377 1903 -1431 645 3663 9658 10201 2484 4737 5931 2958 3348 7175 5269 8386 10922
3738 10922 6822 5188 9694 14117 9667 8911 1256 -1733 -1789 8141 6663 870 -1475 -3085 -7494
3723 -7494 -6304 -396 -6572 -10935 -9663 1589 9647 14106 10937 8639 5400 2946 7287 -2634 -3885
3708 -3885 -6059 -8462 -183 5682 -3317 -6972 -183 184 -4179 -10614 -13955 -5174 373 247 -2823
3693 -2823 995 4267 9599 5650 -2513 -1154 -206 -3857 -12403 -10660 -4995 -2747 -2797 -4752 -7024 -4727
3677 -4727 -8252 -5635 228 1320 131 2319 916 -3652 -614 -1455 -3679 2927 2216 -3143 -7540
3662 -7540 -2842 -5357 -9896 -6231 -7216 -8447 -3957 -369 142 5887 1452 -7173 -7836 -5641 -7480 -10584
3646 -10584 -13450 -5606 -4785 -4943 -8375 -5384 -713 1029 8905 14847 10866 6163 647 4941 7535
3631 7535 1193 -1410 -5443 -2815 4487 10436 8287 5202 633 -1620 -316 -6578 -8820 -7884 401
3616 401 2363 -466 2447 3737 -1015 3120 1621 2045 2089 -2750 -5931 -1760 -81 -12536 -9211 -3774
3600 -3774 -3787 -3346 -6710 -3893 1375 465 1397 5136 1477 -5791 -8970 -4239 -1064 -10070 -8643 -13008
3584 -13008 -8156 891 -1604 -2238 -1930 -2709 -7494 -5246 270 2276 4007 12836 8136 1419 2723
3569 2723 1854 -5627 -13098 -14054 -17334 -14546 -9947 -12288 -11259 -6497 -4928 -4975 -15154 -10360 -8924 -3856
3553 -3856 2842 11493 13557 6743 -2728 52 7306 15738 15402 14883 8775 2196 3963 -2457 -6521
3538 -6521 -2200 -2258 -5708 -764 3446 3033 1952 5359 1366 -3957 -1708 4822 9320 11659 14423 8109
3522 8109 4180 7395 7233 5216 3554 2024 -4930 -3985 -2838 -803 -2125 -2246 -2420 -10248 -10078 -3709
3506 -3709 -3756 -1559 -1053 -6715 -278 874 4110 5396 -960 -3179 -4604 -7504 -7870 -3539 5443 170
3490 170 -2681 -1110 2514 -705 -3090 -7577 -4935 4239 4120 4611 500 -5501 -8593 -3964 6032 -4
3474 -4 830 7326 2430 -1990 -7801 -9278 -10005 -4418 4333 4896 6024 8493 9501 4950 287 -668 2868
3457 2868 2121 292 2394 7226 7966 3399 1698 5590 10789 17561 12786 1326 3660 5030 2548
3442 2548 -456 3065 9303 8024 11472 7437 4790 8059 9301 5531 8672 7535 1648 3304 1774
3427 1774 -2026 -1326 -37 -4725 -4268 -884 5310 6493 10318 14536 10208 712 -7765 -9307 -4748
3412 -4748 -511 160 -2353 -1424 -5808 -6323 -4269 2165 7194 209 -10008 -9401 -12301 -18848 -14469 -7187
3396 -7187 -9816 -9234 -2626 -4291 -10463 -8734 -1802 4808 5461 1415 -422 -356 2454 3788 -5255 -7060
3380 -7060 -2847 2397 6725 2586 -867 -5098 -8917 -6936 -1774 -196 -3731 -11831 -12143 -11679 -11466 -10265
3364 -10265 -7235 -5163 -3776 -1606 -168 1207 -2146 -814 5619 5509 5969 4534 1733 -401 1943
3349 1943 9585 15288 20643 12170 3674 -4682 -7961 -2780 933 -1008 4164 6176 4759 1423 3442
3334 3442 4388 13959 18109 12230 6884 -3363 -10879 -9698 -8533 -7834 -3246 -1518 988 1410 993 4310
3318 4310 9160 9445 -661 -3608 -6732 -2678 -1166 6075 4929 -22 -418 -6796 -6424 -2152 -4252
3303 -4252 -5841 -6451 -3217 3335 -1328 -4136 515 -384 3265 5569 3864 2754 3024 3424 4119 3278
3287 3278 7707 8787 5347 8785 2478 860 -2339 -8490 -2595 4580 8719 8380 4808 3375 6122
3272 6122 6974 3902 2671 9338 7298 4107 -1728 -2658 1501 5462 -1351 -3423 -1421 240 2586
3257 2586 5718 8860 8927 7454 271 2773 6337 2674 -6255 -4616 -2986 -8014 -10386 -8203 136
3242 136 5172 2830 31 3140 3061 4104 10330 9608 -1173 -8954 -4272 -3176 -2420 -7591 -11157 -7401
3226 -7401 3070 10008 6804 -374 -1898 1026 5377 5997 5917 973 -5599 -6794 210 -911 -6248
3211 -6248 -8467 -3186 -1091 -628 4007 13979 11977 3366 2314 5601 -1457 -5865 -6972 -3034 4275
3196 4275 2064 821 -2046 -5889 -1089 7771 12356 16637 14106 12033 14279 11478 3073 2963 3153
3181 3153 117 -291 -1020 148 1912 -1581 -3492 -5945 -5148 -5040 -4246 1514 3509 7591 -1190 -1784
3165 -1784 83 6062 9894 48 -5136 -6406 -8718 -8807 -2527 3105 207 308 2428 -2398 -3412 -2910
3149 -2910 -3637 -4939 -1520 -1563 -4788 -5570 -4126 -11357 -12547 -7089 -2998 2430 2371 -254 -3527 -1236
3133 -1236 2186 -657 -1253 -1849 -8158 -9487 2560 7552 6616 497 -5797 -4087 -4164 -7120 -2392 4916
3117 4916 6109 5202 -4846 -8219 -3709 -2529 -10126 -6470 10672 8941 -1425 -6538 -2030 2938
3103 2938 -5075 -4431 -1979 -12014 -9374 -8198 -9882 -7487 -166 3259 4546 1874 1562 -144 -366
3088 -366 3905 3323 566 -6824 -8999 -4770 2656 -969 -9709 -11956 -15014 -18924 -15735 -15951 -14096 -12252
3072 -12252 -7480 -9380 -1540 720 -2237 -3638 -5579 -3836 -2998 -10261 -14375 -6618 -1223 -4570 -205
3057 -205 3845 3537 1515 -652 2469 -92 -3032 -2866 -1773 4539 6565 6404 -3377 -9360 -13021 -11535
3041 -11535 -4492 -2347 8608 11240 6619 -1247 787 -3960 375 -1172 -5491 -5069 -441 -3018 -3284
3026 -3284 -796 8365 7108 631 -1736 -5339 -678 9509 11422 6405 1658 3829 1228 -5559 -3814
3011 -3814 -4833 -2450 4221 -1821 -2994 4738 2862 2560 -3175 -5180 -909 -3015 -4974 -5943 -5464 -10691
2995 -10691 -20089 -15499 -7353 -12322 -17939 -11883 -5526 -12483 -17551 -16528 -12926 -6047 -10177 -9909 -7521
2980 -7521 -85 -6502 -17664 -14009 -11514 -10238 -8448 376 -128 -6793 -3999 221 -997 -4118 -1302
2965 -1302 -1970 1670 2949 4886 2817 -5364 -10683 -9425 -6902 -4954 -3549 1315 3876 -1958 -580
2950 -580 -2405 -4288 4209 6324 9810 10713 4441 -4195 -5188 -4718 -386 550 487 4426 2513 1577 3242
2933 3242 6252 10134 8756 7911 4269 -3304 -9979 -11939 -8357 -9452 -7923 -5868 -564 3167 2827
2918 2827 4122 5388 1849 -7522 -6574 3932 8059 6734 4265 7272 1666 -7135 -13690 -12797 -2854
2903 -2854 2793 2600 -45 7211 8795 4378 -569 229 1677 3487 2226 4728 9256 10484 4421
2888 4421 1587 1507 4698 1425 -648 -872 6233 8897 -258 -6496 2876 -351 -2747 -19 327 1266
2872 1266 -4185 -858 4435 5049 1893 252 -4985 -4081 -2119 -4688 -3405 593 10048 14837 13146
2857 13146 3360 93 2724 3587 5585 7453 4751 2815 -4445 -8683 -1321 4824 -908 -4417 -1201
2842 -1201 1900 1932 5234 9425 8286 1271 2261 5279 3872 5442 4505 1582 97 1320 2156 1550
2826 1550 4698 1993 8289 9038 5635 -1682 -5521 2326 7439 7474 4152 5527 1297 933 -1502 -10955
2810 -10955 -11701 -3434 -1163 4815 2445 -2009 -3750 -2558 -4487 -15681 -15847 -7390 225 1807 557
2795 557 -8609 -14745 -13626 -8936 -352 2682 8104 11473 8128 3392 4847 7151 11220 12080 6817
2780 6817 5229 9087 6961 3938 -5366 -5999 -10545 -15543 -18376 -4054 5874 547 -5912 -5590 5725
2765 5725 11769 6790 876 2330 1827 -8822 -13991 -15678 -12542 -11309 -10417 -7941 -6425 -925 -1026
2750 -1026 2594 1865 -804 -3969 2597 4496 -2294 74 427 -1008 3748 -965 -4321 -1975 5146
2735 5146 9395 10091 4921 -98 3714 5635 456 -2359 -90 3253 -2046 -7039 -7948 -4237 5157
2720 5157 10659 10158 3726 -2437 331 -5809 -2952 2577 -4284 -10240 -8648 -3037 335 1341 2302
2705 2302 7463 11300 5730 1443 -6571 -4267 5285 9179 6093 9099 5823 7487 13896 15618 18557
2690 18557 15318 9596 4078 -2267 -4177 64 506 -847 2309 6034 6265 4093 6072 10771 12443
2675 12443 6714 2736 4573 2721 -4432 -8726 413 2942 3331 10496 9480 -4563 -11469 -12607 -13146
2660 -13146 -7885 1538 8686 3576 -216 -4762 -1469 -8343 -7049 3012 8799 3430 -10196 -6028
2646 -6028 -3264 -1515 10267 8325 4198 4692 4082 821 -3308 -6191 -5203 -6761 -7579 -11044 -6231 -3675
2630 -3675 -2193 288 -2300 -1007 1499 2454 4288 6502 4365 -1163 6448 8435 -3660 -7653 -2991
2615 -2991 -4704 -1346 3736 5150 2723 -1857 -3914 -2143 -4357 -8053 -6971 -4815 -419 -3383 -2341
2600 -2341 5212 6410 1211 -642 3727 5431 7021 8959 13086 11965 8661 10833 10839 8662 3874 -7394
2584 -7394 -13646 -3329 7144 12123 5065 -4290 -8168 -427 -1331 9369 13207 8318 5720 4389
2570 4389 961 198 9207 11719 14225 14709 7125 -324 -5076 -9544 -8844 -10020 -8089 -2174 1186 11149
2554 11149 6163 939 -2216 528 5774 15098 12392 12173 9072 11304 12271 7415 5554 5129 1594
2539 1594 3817 8995 16112 14849 11657 14411 12032 9076 2603 6491 7261 6306 3081 3339 8886 9507
2523 9507 4417 -15 -7224 -5391 -8323 -6504 -2366 2005 2463 4655 12995 13454 8632 3874 -4796
2508 -4796 -7811 -15334 -11160 -2179 -1585 -5645 -1926 -4894 -24 4529 8231 13781 19741 20372 16809
2493 16809 18696 12748 8443 10103 12863 8748 891 -7000 -12478 -10506 -8297 -5096 -7131 -5313 -5274
2478 -5274 -10633 -12243 836 2542 3492 2743 2049 -1110 3733 11787 5325 4166 -955 -6039 -1668
2463 -1668 -6716 -9081 -11792 -5180 -4380 -7237 -3777 -1468 -3147 -11042 -10769 -5060 2462 962 -2903
2448 -2903 -6679 -11459 -4474 -4682 -15603 -15765 -18114 -16973 -9504 -1349 4312 4138 2546 4257 8972
2433 8972 4497 -452 -930 687 360 3084 3132 5988 13429 7906 2607 -6182 -12391 -6659 -3348 3142
2417 3142 4306 -1753 -4375 -5660 -5936 1350 5001 455 -2881 -3832 -5238 -3551 3316 -1329 -10721
2402 -10721 -9567 -8990 1410 2306 1428 -3370 -9610 -2983 -1929 -1898 -7044 -10301 -11179 -11508 -8809 -5986
2386 -5986 -7139 -8555 -15490 -16388 -12062 -5211 -2444 -3013 -1447 -6866 -11469 -13780 -14311 -10983 -5976 -8436
2370 -8436 -7950 -2852 -1700 300 1073 -1801 -555 -1964 4328 2539 -3111 -2303 1458 -1795 -4508 -4529
2354 -4529 2396 -3696 -11617 -14355 -12963 -17982 -19064 -10240 -8501 -12323 -7723 737 4197 673 -4713
2339 -4713 -8257 -214 3988 -2240 5340 15285 12085 6713 9386 2571 -1362 1275 -5721 -3863 -1088
2324 -1088 -10925 -7612 1394 -3545 -8739 -6781 -9612 -9643 -13246 -9036 -4839 -704 -264 1592 4725 8851
2308 8851 7000 5025 1707 8278 15318 14418 1229 -2915 -4770 -4871 -438 1094 2344 -6842 -15702
2293 -15702 -12949 -9581 -9001 -5464 -4231 -11622 -11420 -6472 -12451 -12384 -11876 -11736 -2539 1139 -353 -255 -1336
2276 -1336 3238 4640 6388 7968 8372 5263 8676 10081 2553 -3417 -8891 -7166 3839 3661 3014
2261 3014 1590 -1028 959 10203 8237 5457 11967 12600 8751 5182 3575 3439 869 -3473 3309
2246 3309 6989 5468 2081 536 -360 7057 11893 16839 12995 13446 8463 6759 10693 8937 3031
2231 3031 11229 9213 1168 -4546 -4950 -10574 -13146 -8787 -3834 2852 10517 6970 -4262 -6159 -10491
2216 -10491 -11717 -10515 -164 11824 17547 9254 4794 6223 8968 8369 8654 -4042 -11451 -13485
2202 -13485 -6605 -2013 -2902 -1272 698 78 4846 9510 15620 16921 7776 -3317 -15278 -15598 -4574
2187 -4574 1986 -4268 -5177 -4891 -7298 -3906 -1487 -1699 -6065 -8145 -5481 -3127 2029 7861 7626 1541
2171 1541 10971 15961 15899 13807 13261 7209 3975 -1560 1041 8179 9826 7339 11790 2912 -2805 -12931
2155 -12931 -14761 -8520 -6496 -865 4520 6504 9790 12697 14125 12762 9658 1252 860 6092 -134
2140 -134 -3309 801 5336 752 -2014 4842 2834 -5109 -11632 -13418 -14806 -11482 -8953 2816 11358
2125 11358 14277 7175 5049 10029 11620 11779 8961 5909 -2578 -8164 -2226 1171 -4635 -3080 -1043
2110 -1043 -856 -3012 -6335 -2605 -2589 1101 7536 7565 6337 546 -10309 -10270 -15997 -21304 -12895 -4172
2094 -4172 -613 -1568 3715 10415 13269 7513 3968 -1007 -1516 811 -3892 2408 5127 11846 10890 2980
2078 2980 4061 6855 8360 11642 17341 12823 8592 7301 5407 1110 -4659 -7090 -1355 2763 4875
2063 4875 4370 7297 2093 4957 10317 9553 2012 -268 7769 10158 4275 -34 -5478 -1686 -3907
2048 -3907 -595 433 -3577 -6798 -8758 -11153 -11604 -7173 -2546 -6260 -3201 -865 -383 -1987 -6433
2033 -6433 -7760 -7693 -8085 -11559 -10355 -3324 8689 5417 2363 941 -5404 -5272 -10986 -1392 7992 5002
2017 5002 -2706 -7809 1635 458 4581 11276 14969 10677 -4089 -15680 -11854 -3503 -1382 -9836
2003 -9836 -12707 -12974 -8333 -6136 -4705 -2841 4178 5715 6088 1571 583 3403 8498 16086 10631 2763
1987 2763 3523 956 1860 3008 852 -1458 -3043 -6699 -8014 1629 3498 245 -2994 -2560 -1219 7638
1971 7638 10991 12368 10244 3346 -6277 -14371 -7710 -5433 -11530 -8981 959 1368 -6016 -9401 -241
1956 -241 4776 9135 9190 6740 4401 5415 3577 -642 1177 -3908 -1612 -2871 4349 6738 3300 8468
1940 8468 11069 3451 -941 -5263 -8150 1564 6366 5104 -961 -861 3737 1970 -14872 -26509 -17832
1925 -17832 -4311 2952 1274 5359 4907 7831 10935 2698 1087 -754 -5333 -5769 -7536 -8628 -5271
1910 -5271 4888 10290 3887 4111 5015 2275 2261 -1352 -6034 -5452 -7590 -8486 -12951 -20540 -10086 3718
1894 3718 945 -6075 -11513 -6387 -4031 -201 -3207 -6073 -10638 -2914 3717 1065 -2865 -3655 -7271
1879 -7271 -6055 -3865 2124 9339 11443 14343 6450 -3238 -11048 -9045 -523 3453 6818 12008 10475
1864 10475 2087 -1361 1049 6289 3708 1253 -3241 1638 6997 14151 12928 7414 3301 -6078 -7993
1849 -7993 -8526 -9632 -11334 -7353 -5043 -8450 -11764 -8129 -832 -2198 561 -4449 -4244 -2777 -4033
1834 -4033 -4973 121 4164 1561 -3989 343 1122 2912 4517 0 -1292 -526 -2450 -10336 -12137 -5926
1818 -5926 8996 6818 -476 -4075 -8452 -5616 -2605 -4251 -6327 -7896 -2711 8029 15358 10712
1804 10712 11468 13496 9692 4172 459 -5237 -11036 -10590 -3779 -5281 -236 4947 -366 7148 7035
1789 7035 1893 -2616 3752 6354 9351 17245 14995 12475 3713 4192 5421 6291 1158 -5210 -8612
1774 -8612 -1764 4033 3458 1003 -5764 -8426 -1811 11523 14622 9955 4085 -3834 -4398 -2054 -3643
1759 -3643 -311 -1425 4138 7187 7429 9996 8365 -4106 -6684 -6061 1731 6269 7291 4051 -4388
1744 -4388 -4532 4883 7908 17408 15982 7481 6863 7417 8671 4285 6054 4422 2487 2982 2517 2182
1728 2182 -2191 -14188 -19910 -9923 -419 -4719 -4441 -2914 -1299 5036 8274 4096 -263 -2471 -9019
1713 -9019 -4472 2151 -442 5134 5666 4391 -2166 1239 -4738 -5897 -504 -846 -906 -378 4780 3332
1697 3332 1698 -4984 -6624 -9588 -10095 -5935 -1888 3351 9464 13690 14767 11505 1948 -5447 -6725
1682 -6725 -6818 -3232 -997 -5973 -13145 -9346 -5502 -1771 1555 -3250 -7364 -3829 -2477 -2494 -1048 -324
1666 -324 -7298 -10108 -7995 -3940 -2231 -3694 -1677 -2206 -844 -2154 88 -1086 608 -1688 -3027
1651 -3027 4161 7399 8135 3622 -95 5084 7244 7044 5434 4975 5181 6850 6672 8864 8816 6595 2845
1634 2845 -2402 1292 1193 -3106 -10155 -16603 -4976 1323 3719 2905 5067 9734 7492 711 -1241
1619 -1241 -5450 -4521 1314 7906 8930 1508 -2902 -8160 -5415 -2502 1034 -1083 -252 -1019 -6522 -3639
1603 -3639 -4744 -1946 2470 -2421 -5165 243 1920 -2510 -2082 3355 5096 6710 2061 -5198 -14444
1588 -14444 -16705 -15324 -4572 -1662 39 764 2622 2689 -688 3276 6159 10770 8268 5813 11771
1573 11771 9666 3572 5620 5426 8532 11094 12731 8596 6482 4664 3171 -2523 -2177 1285 349
1558 349 -4010 -4624 216 1585 -4257 472 4603 10543 12424 14362 14779 12272 6595 1907 9600 13114
1542 13114 5370 3153 860 3199 3792 9292 12498 10613 7172 5996 2732 273 4386 2558 802
1527 802 367 5920 3088 -4151 -1335 5871 2936 -2159 -1537 2083 4672 115 -1717 -747 6978 1088
1511 1088 1311 -2436 -5021 -2204 -10042 -12428 -6828 -120 5347 3278 -2647 -9109 -15689 -6452 4956
1496 4956 6821 -2914 -10871 -6881 2400 6476 3934 -3245 6229 13838 3389 -5157 1040 5552 3198
1481 3198 -4620 -10575 -7943 -7707 -5572 -1135 -1508 -1425 364 -1274 2128 1251 -1386 -4363 -8973 -14069
1465 -14069 -15533 -14272 -10399 -3743 -3200 3715 3613 -1773 3418 4289 3142 1738 2423 -2879 -7289 -12542
1449 -12542 -9818 -4019 2123 173 -1169 675 4049 1998 -4919 -5355 -6654 1187 10928 11417 11372 12012
1433 12012 9315 9544 8148 12433 10026 7072 2510 4236 8041 6507 -3940 -6403 -3422 -119 -4258
1418 -4258 -8712 -8996 -6465 -1652 3017 2339 -2307 -1826 -1565 -1281 7327 11100 8282 3275 -1047 -2134
1402 -2134 1063 6881 6414 3054 676 6654 9555 6347 902 -1783 -716 4507 8386 11917 15201
1387 15201 12564 4428 4053 1015 -2113 1866 -2860 -3482 -1638 -2738 454 1425 -3087 -16129 -18190
1372 -18190 -8600 -5587 321 4232 3585 -4112 -6736 -3435 1838 -1446 -3505 1657 5901 -565 440
1357 440 0 -4959 -7619 -7489 -9203 -17522 -18588 -17733 -12853 -11131 -5453 -6073 -13693 -15223 -9768 2028
1341 2028 4725 4674 -3459 -6410 -723 5866 8745 6806 32 -6033 -4837 2298 2365 10642 10674 3486
1325 3486 4875 980 -4840 -5772 -12103 -10183 -8365 -5920 -3913 -5559 -3504 1631 6491 3877 -11254
1310 -11254 -8279 -4778 -1253 1523 2160 1570 398 1480 2545 2367 1119 2774 -6169 -116 11881
1295 11881 11775 5419 -1178 3331 6636 4578 1085 4810 4430 1189 -778 1543 -82 2987 8938
1280 8938 10410 4367 -3671 -5848 -705 3192 5743 7970 6706 2182 1114 -5174 -7226 -7273 -6408 -2930
1264 -2930 -2271 -4118 -10194 -11099 -10520 -9603 -3077 8372 7525 9779 6289 5400 577 550 6590 5583 2340
1247 2340 3133 4287 10618 9645 4336 -1686 -6608 25 3733 8684 12615 13940 5500 -1614 -3152
1232 -3152 -4565 -2765 1359 8719 11748 13917 9440 5212 4637 2798 -1271 6595 6357 -4372 -6860
1217 -6860 -3279 -1895 -464 -5149 -5482 56 -2613 -12291 -14126 -13255 -12510 -9435 -6815 -5191 -2664 -4378
1201 -4378 -9481 -13382 -14568 -15189 -11285 -7908 -1962 -809 2171 4822 8729 8302 6178 1213 -949
1186 -949 139 -3270 -6195 -5334 131 2552 2206 5042 3416 2468 -4129 1326 8114 4170 1447 5833
1170 5833 5962 9991 17340 15163 12916 11100 9902 824 -13474 -15440 -6283 -1397 -514 -1567 248
1155 248 -2363 -6245 -6385 -7560 100 4979 1749 -8053 -14247 -15485 -17035 -16932 -10277 -3765 -433 2839
1139 2839 1066 -1662 2378 12369 12703 -1130 -11689 -19913 -18156 -10678 -3925 -447 2698 6332 4097
1124 4097 2248 6701 10141 7675 170 -864 -5759 -1880 2207 3954 6591 6713 7525 5652 2619
1109 2619 -190 -3061 -6098 2254 10893 6692 -330 -4072 -4507 -7222 -10958 -5394 1053 6555 7758
1094 7758 11202 8618 -526 143 1943 -4548 -11570 -6768 345 1423 -3005 -179 3874 -1672 -4272
1079 -4272 -2493 -2956 -6987 -13841 -7254 -3005 -7163 -11408 -8398 -638 -2251 -5011 -9529 -14788 -11402
1064 -11402 -7802 -6262 -5114 1211 2971 -10840 -18061 -12858 -15676 -18801 -10854 -115 1980 -1275
1050 -1275 6092 2276 -5422 -5321 -1335 587 575 985 -1954 -5234 436 10764 10027 9830 9081 8771 2845
1033 2845 -1855 2132 12086 13091 10553 5602 2881 2524 1851 564 464 2168 3990 2278 -1379 3269
1017 3269 5580 -5414 -9415 -5950 433 8859 9003 6547 1182 -273 4081 -1035 -3365 68 1991
1002 1991 -533 -1565 -6116 -8746 -4409 -1510 -3688 -6548 -10108 -13606 -7958 -3848 268 597 568 2110
986 2110 6737 10620 15238 15683 15474 16519 20464 19010 9357 8495 8437 9920 5679 -4820 -14776 -14977
970 -14977 -6420 680 3158 1060 3309 36 -5823 -10422 -5188 -4611 -4140 3191 5458 8135 7678 5928
954 5928 1000 4710 11117 8619 4356 3306 4397 4488 11190 9309 5849 2768 4291 -496 -3047 -2187
938 -2187 -5026 -7607 -7222 -4883 -11798 -16714 -11584 -3421 891 1976 5260 9300 9813 9443 11834 8183
922 8183 5984 17544 13654 7182 4449 3150 1725 458 167 -622 6612 6057 -365 4736 2607 -1540
906 -1540 -1941 -5544 -2336 1494 -1581 -8439 -10783 -5410 -1504 2705 141 -8409 -8801 -7233 -395 -8600
890 -8600 -18861 -16718 -12317 -4715 923 3626 2427 -1322 -4745 -4313 4130 9788 7648 11647 17771
875 17771 15465 17704 22454 23906 21090 11136 976 -4903 -5498 253 1491 3468 3241 9691 7255
860 7255 1968 -2289 -224 4114 5456 1427 -2001 1295 1680 -183 262 10558 14010 12031 8168
845 8168 3081 868 -1880 -1675 -538 930 -1013 1847 8828 12061 14653 7108 6920 11959 14948 8580
829 8580 1988 7732 12975 11066 8087 8883 14862 17037 5320 -9708 -4041 6843 4566 -876 50
$$ [...]
##END NTUPLES=NMR SPECTRUM
##END=
