##TITLE=Analysis number 314493
Compound Code sb 00611
Project Code adrs
Chemist Name acros
##JCAMPDX= 6.0         $$ Bruker NMR JCAMP-DX V2.0
##DATA TYPE= NMR SPECTRUM
##DATA CLASS= NTUPLES
##ORIGIN= Bruker BioSpin GmbH
##OWNER= NMR
$$ XWIN-NMR		Version 3.5
$$ Tue Oct 18 13:39:16 2005 GMT Daylight Time (UT+1h)  MAYBRIDGE\NMR@NMR_250MHZ
##.OBSERVE FREQUENCY= 250.131544655141
##.OBSERVE NUCLEUS= ^1H
##.ACQUISITION MODE= SIMULTANEOUS (DQD)
##.ACQUISITION SCHEME= undefined
##.AVERAGES= 16
##.DIGITISER RES= 18
##SPECTROMETER/DATA SYSTEM= dpx250
##.PULSE SEQUENCE= zg30
##.SOLVENT NAME= CDCl3
##.SHIFT REFERENCE= (INTERNAL, CDCl3, 0, 16.522)
##AUDIT TRAIL= $$ (NUMBER, WHEN, WHO, WHERE, WHAT)
$$ ##TITLE= Audit trail, XWIN-NMR		Version 3.5
$$ ##JCAMPDX= 5.01
$$ ##ORIGIN= Bruker BioSpin GmbH
$$ ##OWNER= NMR
$$ C:\u/data/dgb/nmr/ADRS/11000/pdata/1/auditp.txt
$$ ##AUDIT TRAIL=  $$ (NUMBER, WHEN, WHO, WHERE, WHAT)
(   1,<2005-10-18 13:38:50.00 +100>,<MAYBRIDGE\NMR>,<NMR_250MHZ>,
      <created by zg, POWCHK disabled, PULCHK disabled
       configuration hash MD5:
       62 19 C7 07 E1 42 D1 B7 37 6C 3D D0 77 39 F9 E6
       data hash MD5: 64K
       21 86 A9 DC 55 C4 FD 6D B1 0F 4E E5 F1 2D 24 E7>)
(   2,<2005-10-18 13:39:02.74 +100>,<MAYBRIDGE\NMR>,<NMR_250MHZ>,
      <Start of raw data processing
       ef LB = 0.3 FT_mod = 6 PKNL = 1 SI = 32K 
       data hash MD5: 32K
       93 8B 05 1E 0D B0 34 22 5E 22 C7 09 1C 62 04 51>)
(   3,<2005-10-18 13:39:06.25 +100>,<MAYBRIDGE\NMR>,<NMR_250MHZ>,
      <apk 
       data hash MD5: 32K
       CE C2 17 1B D6 90 9B 98 E8 6C 8A 1E 7E 00 A8 78>)
(   4,<2005-10-18 13:39:07.24 +100>,<MAYBRIDGE\NMR>,<NMR_250MHZ>,
      <abs ABSG = 5 
       data hash MD5: 32K
       D3 70 BE B4 DF F0 43 73 09 3D CD F6 60 00 26 36>)
$$ ##END=
$$ 
$$ hash MD5
$$ CA 41 26 B3 A7 24 C7 AD EE D3 2D 99 58 DB A8 62
##$RELAX= 
##$RELAX= 
##$RELAX= 
##$RELAX= 
##$RELAX= 
##$RELAX= 
##$RELAX= 
$$ Bruker specific parameters
$$ --------------------------
##$DU= <C:\u>
##$EXPNO= 11000
##$NAME= <ADRS>
##$PROCNO= 1
##$TYPE= <nmr>
##$USER= <dgb>
##$AMP= (0..31)
100 100 100 100 100 100 100 100 100 100 100 100 100 100 100 100 100 100 
100 100 100 100 100 100 100 100 100 100 100 100 100 100 
##$AQSEQ= 0
##$AQ_mod= 3
##$AUNM= <au_zg>
##$AUTOPOS= <30 >
##$BF1= 250.13
##$BF2= 250.13
##$BF3= 250.13
##$BF4= 250.13
##$BF5= 500.13
##$BF6= 500.13
##$BF7= 500.13
##$BF8= 500.13
##$BYTORDA= 1
##$CFDGTYP= 0
##$CFRGTYP= 5
##$CHEMSTR= <none>
##$CNST= (0..31)
1 1 145 1 1 1 1 1 1 1 1 1 1 1 1 1 1 1 1 1 1 1 1 1 1 1 1 1 1 1 1 1 
##$CPDPRG= <>
##$CPDPRG1= <>
##$CPDPRG2= <>
##$CPDPRG3= <>
##$CPDPRG4= <mlev>
##$CPDPRG5= <mlev>
##$CPDPRG6= <mlev>
##$CPDPRG7= <mlev>
##$CPDPRG8= <mlev>
##$CPDPRGB= <>
##$CPDPRGT= <>
##$D= (0..31)
0 1 0 0 0 0 0 0 0 0.06 0 0 0 0 0 0 0.0002 0 0 0 0 0 0 0 0 0 0 0 0 0 0 
0 
##$DATE= 1129639128
##$DBL= (0..7)
120 120 120 120 120 120 120 120 
##$DBP= (0..7)
150 150 150 150 150 150 150 150 
##$DBP07= 0
##$DBPNAM0= <>
##$DBPNAM1= <>
##$DBPNAM2= <>
$$ [...]
##$SUBNAM7= <"">
##$SUBNAM8= <"">
##$SUBNAM9= <"">
##$SW= 20.6930455092707
##$SWIBOX= (0..15)
0 0 3 0 0 0 0 0 0 0 0 0 0 0 0 0 
##$SW_h= 5175.983436853
##$TD= 65536
##$TD0= 1
##$TE= 294.16
##$TE2= 300
##$TE3= 300
##$TEG= 300
##$TL= (0..7)
0 120 120 120 120 120 120 120 
##$TP= (0..7)
150 150 150 150 150 150 150 150 
##$TP07= 0
##$TPNAME0= <>
##$TPNAME1= <>
##$TPNAME2= <>
##$TPNAME3= <>
##$TPNAME4= <>
##$TPNAME5= <>
##$TPNAME6= <>
##$TPNAME7= <>
##$TPOAL= (0..7)
0.5 0.5 0.5 0.5 0.5 0.5 0.5 0.5 
##$TPOFFS= (0..7)
0 0 0 0 0 0 0 0 
##$TUNHIN= 0
##$TUNHOUT= 0
##$TUNXOUT= 0
##$USERA1= <user>
##$USERA2= <user>
##$USERA3= <user>
##$USERA4= <user>
##$USERA5= <user>
##$V9= 5
##$VALIST= <valist>
##$VCLIST= <CCCCCCCCCCCCCCC>
##$VD= 0
##$VDLIST= <DDDDDDDDDDDDDDD>
##$VPLIST= <PPPPPPPPPPPPPPP>
##$VTLIST= <TTTTTTTTTTTTTTT>
##$WBST= 1024
##$WBSW= 4
##$XGAIN= (0..3)
0 0 0 0 
##$XL= 0
##$YL= 0
##$YMAX_a= 504190
##$YMIN_a= -467258
##$ZGOPTNS= <>
##$ZL1= 120
##$ZL2= 120
##$ZL3= 120
##$ZL4= 120
##$ABSF1= 16.522
##$ABSF2= -4.171173
##$ABSG= 5
##$ABSL= 3
##$ALPHA= 0
##$AQORDER= 0
##$ASSFAC= 0
##$ASSFACI= 0
##$ASSFACX= 0
##$ASSWID= 0
##$AUNMP= <proc_1d>
##$AZFE= 0.1
##$AZFW= 0.1
##$BCFW= 0
##$BC_mod= 0
##$BYTORDP= 0
##$COROFFS= 0
##$CY= 12.5
##$DATMOD= 1
##$DC= 0
##$DFILT= <>
##$DTYPP= 0
##$F1P= 14.0000005364418
##$F2P= -0.99999901652339
##$FCOR= 0.5
##$FTSIZE= 32768
##$FT_mod= 6
##$GAMMA= 0
##$GB= 0
##$INTBC= 1
##$INTSCL= 1
##$ISEN= 128
##$LB= 0.3
##$LEV0= 0
##$LPBIN= 0
##$MAXI= 10000
##$MC2= 0
##$MEAN= 0
##$ME_mod= 0
##$MI= 0
##$NCOEF= 0
##$NC_proc= -4
##$NLEV= 6
##$NOISF1= 0
##$NOISF2= 0
##$NSP= 0
##$NTH_PI= 0
##$NZP= 0
##$OFFSET= 16.522
##$PC= 1
##$PHC0= -68.54972
##$PHC1= 6.300835
##$PH_mod= 1
##$PKNL= yes
##$PPARMOD= 0
##$PSCAL= 4
##$PSIGN= 0
##$REVERSE= no
##$SF= 250.13
##$SI= 32768
##$SIGF1= 0
##$SIGF2= 0
##$SINO= 400
##$SIOLD= 32768
##$SREGLST= <1H.CDCl3>
##$SSB= 0
##$STSI= 32768
##$STSR= 0
##$SW_p= 5175.98343685301
##$SYMM= 0
##$S_DEV= 0
##$TDeff= 65536
##$TDoff= 0
##$TI= <Analysis number 999999
Compound Code 99
Book Reference 9
Project Code 9>
##$TILT= no
##$TM1= 0
##$TM2= 0
##$TOPLEV= 0
##$USERP1= <user>
##$USERP2= <user>
##$USERP3= <user>
##$USERP4= <user>
##$USERP5= <user>
##$WDW= 1
##$XDIM= 32768
##$YMAX_p= 392655218
##$YMIN_p= -181449
$$ End of Bruker specific parameters
$$ ---------------------------------
##NTUPLES= NMR SPECTRUM
##VAR_NAME=  FREQUENCY,     SPECTRUM/REAL,   SPECTRUM/IMAG
##SYMBOL=    X,             R,               I
##VAR_TYPE=  INDEPENDENT,   DEPENDENT,       DEPENDENT
##VAR_FORM=  AFFN,          ASDF,            ASDF
##VAR_DIM=   32768,         32768,           32768
##UNITS=     HZ,            ARBITRARY UNITS, ARBITRARY UNITS
##FACTOR=    0.157963299565203, 1,           1
##FIRST=     4132.6476996994, 0,             0
##LAST=      -1043.33573715361, 0,           0
##MIN=       -1043.33573715361, -181449,     0
##MAX=       4132.6476996994, 392655218,     0
$$ Real data points
##PAGE= N=1
##DATA TABLE= (X++(R..R)), XYDATA
$$ [...]
24944I94357J04741J06076Q3280Q1151J20742J17695J59146J78272J74512J16657
$$ 994357 1099098 1205174 1288454 1369605 1490347 1608042 1767188 1945460 2119972 2236629
24934B236629J18938J90634K18185J53162J36292Q2743O5934j0596p9728j15264
$$ 2236629 2355567 2546201 2764386 2917548 3053840 3136583 3202517 3191921 3112193 2996929
24924B996929j22018j27700j24889j68178r3271j56899k15465j85672j34408j20630
$$ 2996929 2874911 2747211 2622322 2454144 2360873 2203974 1988509 1802837 1668429 1547799
24914A547799o7109j04311j22280r4117r0474r9835l5511o0039j05700m5704J2216
$$ 1547799 1480690 1376379 1254099 1159982 1069508 969673 934162 874123 768423 722719 734935
24903G34935j3917m6356n9584o3755m2044n9007p363k3250k0122m1277l1187m9975
$$ 734935 721018 674662 615078 551323 509279 450272 442909 419659 399537 358260 327073 277098
24891B77098m1504n9656N210j490L868L5768k746n2558j5234J8027k3639J6910
$$ 277098 235594 175938 181148 179658 183526 219294 216548 163990 148756 166783 143144 160054
24879A60054L1732M2452q041l9900l5041k6931J0289L0888j3844p63q84n1492
$$ 160054 191786 234238 226197 186297 151256 124325 134614 165502 151658 150895 150011 98519
24867I8519j6687j0918j6231j8036J4459P1099K765j379Q584n252k0168l0246
$$ 98519 81832 70914 54683 36647 51106 122205 124970 123591 132175 126923 106755 76509
24855G6509j6782Q008P137l672p289m4640j8705j6662O930k9288j5489K7345L615
$$ 76509 59727 67735 74872 71200 63911 19271 566 -16096 -9166 -38454 -53943 -26598 -22983
24842b2983J2652k7620K9331L4315L0130J5726j684L7496j3176k0352J3806k1262
$$ -22983 -10331 -37951 -8620 25695 55825 71551 69867 107363 94187 73835 87641 66379
24830F6379o725k6500j1808j3782l7618o1612L3833L5999L4735j6557m7321K5339
$$ 66379 59654 33154 21346 7564 -30054 -91666 -57833 -21834 12901 -3656 -50977 -25638
24818b5638N0452J2403m0973k2559J3440j7635K2192M4966K0907k5561l1811K2762
$$ -25638 24814 37217 -3756 -26315 -12875 -30510 -8318 36648 57555 31994 183 22945
24806B2945N6522L5007J5227J453j541l579l142m1584p8869l233M6782J7072J896
$$ 22945 79467 114474 129701 131154 129613 126034 122892 81308 2439 -794 45988 63060 64956
24793F4956n547k8256l7130N3265J4918m6662M308J7684J9103o2607J7656P5917
$$ 64956 59409 31153 -5977 47288 62206 15544 19852 37536 56639 -5968 11688 87605
24781H7605j7624j7811q193k4173m2532l2886K1186K9279j3617Q961K3559M9137
$$ 87605 69981 52170 43977 19804 -22728 -55614 -34428 -5149 -18766 -9805 13754 62891
24769F2891m72l3333j5227o491p665j0235K9684M7273J0583L8452J0891j9459
$$ 62891 62419 29086 13859 7368 -297 -10532 19152 66425 77008 115460 126351 106892
24757A06892j0204m3119o195m494q5425k0364J6447K4782L5467j3087m0591J5595
$$ 106892 96688 53569 47374 42880 -42545 -62909 -46462 -21680 13787 700 -39891 -24296
24745b4296J4728P439j6444O198L0185n319R3R544j7804K8048k7099k1377k5917
$$ -24296 -9568 -2129 -18573 -12375 17810 12491 12584 22128 4324 32372 5273 -16104 -42021
24732d2021j6525k3199M578J562N6302J6536J1738Q514K8839K2493N221j6747
$$ -42021 -58546 -81745 -77167 -75605 -19303 -2767 8971 17485 46324 68817 74038 57291
24720E7291k8335L722j4833j6048L1741O0775l3722n9688l8351M8952O1675K1407
$$ 57291 28956 32678 17845 1797 33538 94313 60591 903 -37448 11504 73179 94586
24708I4586k4183K903j5796l5176j2042o063k6568M4943K6301n8266n8741k2628
$$ 94586 70403 73306 57510 22334 10292 4229 -22339 22604 48905 -9361 -68102 -90730
24696i0730M7559K3823q981M3616J9589m1240j9576l597k783j2131L2743L1318
$$ -90730 -43171 -19348 -28329 15287 34876 -6364 -25940 -29537 -32320 -44451 -11708 19610
24684A9610m817k4654J1424k2475k2010k6391k2243J0659L368J1854n189L0721
$$ 19610 14793 -9861 1563 -20912 -42922 -69313 -91556 -80897 -77529 -65675 -70864 -40143
24672d0143J9538J4281j4031m6985J9056R45r942K267N1256j6639l675j7943J754
$$ -40143 -20605 -6324 -20355 -67340 -48284 -47339 -57281 -55014 -3758 -20397 -24072 -42015 -40261
24659d0261l1916j5463P9164N8085K0520m7941R829j4931J741K8520j8070o3815
$$ -40261 -72177 -87640 -8476 49609 70129 22188 32017 17086 18827 47347 29277 -34538
24647c4538K3120L1904j5084j7617P128j1049m3088J7755J5268M9840k768j9334
$$ -34538 -11418 20486 5402 -12215 -5087 -16136 -59224 -41469 -26201 23639 20871 1537
24635A537K7627R033J850l8143o005p821n1121j4344P902L3031K593j1535M5714
$$ 1537 29164 38197 40047 1904 -4101 -11922 -63043 -77387 -69485 -36454 -33861 -45396 318
24622C18K0975k9953k2489P2786R484o4840m6231K4883M6935K6936K3679J3950
$$ 318 21293 -8660 -31149 41637 51121 -13719 -59950 -35067 11868 38804 62483 76433
24610G6433k1061N7837j3314m7496m8768n2695K7846K8595k0629m0870r20L7767
$$ 76433 55372 113209 99895 52399 3631 -49064 -21218 7377 -13252 -54122 -55042 -17275
24598a7275J0567J387k6170R791M4080k7219L1369J403k0996k9889J6789P900
$$ -17275 -6708 -5321 -31491 -21700 22380 -4839 26530 27933 6937 -22952 -6163 1737
24586A737L6631P973K5705m6399k6990o2570J3524k5995K4753M2917L5464l3964
$$ 1737 38368 46341 72046 25647 -1343 -63913 -50389 -76384 -51631 -8714 26750 -7214
24574g214m0156L7650J4495r406J118K3080R34k5834R830L7542M698k3479n2072
$$ -7214 -47370 -9720 4775 -4631 -3513 19567 20501 -5333 4497 42039 46737 23258 -28814
24561b8814m6566K8534K7303L1572O001j4110j3528O7681k5411l6813J1984j2288
$$ -28814 -75380 -46846 -19543 12029 18030 3920 -9608 58073 32662 -4151 7833 -4455
24549d455j2976k4656J7697K0076R685l1803K2892m715k553K5066j9138q563m8525
$$ -4455 -17431 -42087 -24390 -4314 5371 -26432 -3540 -8255 -10808 14258 -4880 -13443 -61968
24536f1968k91m175j9518l408N4640k2652k8874J3633J3921r199L5420J9742l0235
$$ -61968 -62259 -66434 -85952 -89360 -34720 -57372 -86246 -72613 -58692 -67891 -32471 -12729 -42964
24523d2964k3124k1854O0367L0092k9767q153J0518M3803r70J0867l0440p636
$$ -42964 -66088 -87942 -27575 2517 -27250 -35403 -24885 18918 17948 28815 -1625 -9261
24511i261L0918L2496K7254l6401r398O845j5617j5878L8525J371p0447l5083
$$ -9261 21657 54153 81407 45006 35608 42453 26836 10958 49483 50854 -19593 -54676
24499e4676M3940K8240j5103j6323L3205l4164p5534P489L7934l3860p47M2610
$$ -54676 -10736 17504 2401 -13922 19283 -14881 -90415 -82926 -44992 -78852 -79599 -36989
24487c6989p113r066L0150L1027K6876Q805M087M749k0709K248K5717l6930k5428
$$ -36989 -44102 -53168 -23018 8009 34885 43690 47777 52526 31817 34065 59782 22852 -2576
24474b576m637o652L7793K9310J44m0835o456O725N0671O994m5246J6207m4831
$$ -2576 -7213 -13865 23928 53238 53382 12547 6091 12816 63487 70481 25235 41442 -3389
24461c389n5708m3672M2513K0112m2229j3011J4793L489K084L9459N0862m400
$$ -3389 -59097 -102769 -60256 -40144 -82373 -95384 -80591 -77102 -75018 -35559 15303 10903
24449A0903l3384m2771L187j3884K5969O710R106P215L2767K5866j5169l4971
$$ 10903 -22481 -65252 -62065 -75949 -49980 -43270 -34164 -26949 5818 31684 16515 -18456
24437a8456p841l46q29j8105J747L0647p158J8899m842m009j9954j9692K3004
$$ -18456 -26297 -26643 -27472 -45577 -43830 -13183 -20341 -1442 -6284 -10293 -30247 -49939 -26935
24424b6935K2516M5560m690M3485Q057k9291m5025j7030M2986r137k4751K3280
$$ -26935 -4419 41141 36451 79936 87993 58702 13677 -3353 39633 30496 5745 29025
24412B9025K1953k6957m500l5533j1355n663J8082L4330Q539K0329J1838J2218
$$ 29025 50978 24021 19521 -16012 -27367 -33030 -14948 19382 27921 48250 60088 72306
24400G2306k6830j7244M061l8046N194n9815R34M2766M1184J724m75K9424Q69
$$ 72306 45476 28232 32293 -5753 -559 -60374 -59440 -16674 24510 26234 25759 55183 56052
24387E6052k9514k7479m0565m548O7765K9402p0527j3430N1843O1287j4580j2343
$$ 56052 26538 -941 -41506 -46054 21711 51113 -19414 -32844 18999 80286 65706 53363
24375E3363j6315k177n2785m6964q96M4965l7039L5057N6836L155j5891l8157
$$ 53363 37048 34871 -17914 -64878 -65774 -20809 -57848 -22791 34045 37200 21309 -16848
24363a6848K1501p283n3733K8944L6092l9985k2266m989L1099K9964K2327K3513
$$ -16848 4653 -2630 -56363 -27419 8673 -31312 -53578 -58567 -27468 2496 24823 48336
24351D8336l1628l7235J2434L0847J9074J6501k336l4206j0307K5854J0055n255
$$ 48336 16708 -20527 -8093 22754 41828 58329 55993 21787 11480 37334 47389 42134
24339D2134j3237n385K0981l0378k9675k339l0635k4344J4474o987J6651N0000
$$ 42134 28897 23512 44493 14115 -15560 -17899 -48534 -72878 -58404 -65391 -48740 1260
24327A260L7525k8265k6508M3668J6180J890l824l448R246l7052K862j764n395
$$ 1260 38785 10520 -15988 27680 43860 45750 41926 38478 47724 10672 13534 11770 6375
24314F375q868n8591J7318j0602k3690K1700L0790n655j375j0846J1448J5857
$$ 6375 -2493 -61084 -43766 -54368 -78058 -56358 -25568 -31223 -32598 -43444 -31996 -16139
24302a6139j7674j0692j0021J4880J32K2981L4080M4070p554n819j5224k8610
$$ -16139 -33813 -44505 -54526 -39646 -39514 -16533 17547 61617 54063 48244 33020 4410
24290D410n123Q665J1481j4939n5113J1716M4331L5115J3557j2227J5334L323
$$ 4410 -713 7952 19433 4494 -50619 -38903 5428 40543 54100 41873 57207 60530
24278F0530l2470k4892K6861L8916l4943n6850j6973J7245o994K5581J7975K358
$$ 60530 28060 3168 30029 68945 34002 -22848 -39821 -22576 -29570 -3989 13986 16344
24266A6344J6479k7642O012q389L8571K2261m788j5950l4733O472Q666J827J4361
$$ 16344 32823 5181 11193 2804 41375 63636 58848 42898 8165 14637 23303 25130 39491
24253C9491j192K3520o264j6599k4614n565m566n0119o506j0310L721J0442K9875
$$ 39491 38299 61819 55555 38956 14342 8777 4211 -45908 -52414 -62724 -59003 -48561 -18686
24240a8686L1805K613l1171K0026M887j6477K0092J5213l208m7208l4801K5770
$$ -18686 13119 15732 -15439 4587 9474 -7003 13089 28302 25094 -22114 -56915 -31145
24228c1145l706p803M593Q074M4182o420o755n062M4106M2890k5253k5980m9570
$$ -31145 -34851 -42654 -38061 -29987 14195 7775 1020 -4042 40064 82954 57701 31721 -17849
24215a7849k9616j7825m621K3440n474K6403L4816l4340p591N578K677K0800k7004
$$ -17849 -47465 -65290 -69911 -46471 -51945 -25542 9274 -25066 -32657 -27079 -24402 -3602 -30606
24202c0606J5471p695n2836m1860M4314M0662O3421K2901L5622m353q264j4320
$$ -30606 -15135 -22830 -75666 -117526 -73212 -32550 30871 53772 89394 85041 76777 62457
24190F2457l023r806j7803k8073k2684K2947k2603m1809j9392L1475k0161l3037
$$ 62457 59434 49628 31825 3752 -18932 4015 -18588 -60397 -79789 -48314 -68475 -101512
24178a01512M1851Q2319J3219K4780l8322l1978M5558J2001m7029k1314j9062
$$ -101512 -59661 22658 35877 60657 22335 -9643 35915 47916 887 -20427 -39489
24167c9489k5033q875K1670J3740J0402K7212n5227p907M4453Q343l8034r452
$$ -39489 -64522 -73397 -51727 -37987 -27585 -373 -55600 -63507 -19054 -10711 -48745 -58197
24155e8197j0860K1821N0512j8251j1022O298j6968K7699M756k2291J62k7454
$$ -58197 -69057 -47236 3276 -14975 -25997 -19699 -36667 -8968 -4212 -26503 -26341 -53795
24143e3795l0420Q556L8422J673L785J7802r045J1840K4030m239k1908p644k38
$$ -53795 -84215 -75659 -37237 -35564 -31779 -13977 -23022 -11182 12848 8609 -13299 -20943 -21181
24130b1181N8000J5378k0560R371m2474m872J9318m0277m981J2200L5538j2271
$$ -21181 36819 52197 31637 41008 -1466 -6338 12980 -27297 -32278 -20078 15460 3189
24118C189k7135m55k966n652r27P958n5826l0103M5166M2417J1896l5220N240
$$ 3189 -23946 -24401 -27367 -33019 -33946 -25988 -81814 -111917 -66751 -24334 -12438 -47658 -42418
24105d2418K6094k6596q952J9458K5603k4692j3626N7478N757J7097k2111J0532
$$ -42418 -16324 -42920 -51872 -32414 -6811 -31503 -45129 12349 18106 35203 13092 23624
24093B3624j3313j7518n456N4565j9814l135j7144r547j2021o2982l3118J8202
$$ 23624 10311 -7207 -12663 41902 22088 18953 1809 -7738 -19759 -82741 -115859 -97657
24081i7657K0223l875M698L6645N8026j2674l5532L015o061k1930M360L9937L0965
$$ -97657 -77434 -81309 -76611 -39966 18060 5386 -30146 -27131 -33192 -55122 -50762 -10825 20140
24068B0140j9615j1249j959o4566l4346p586O2613L0964n1780L0470N8655K3244
$$ 20140 525 -10724 -12683 -77249 -111595 -119181 -56568 -25604 -77384 -46914 11741 34985
24056C4985l9512l6263J8682J2549k7569p5406j1215J3277L2577L9224N4294m942
$$ 34985 -4527 -40790 -22108 -9559 -37128 -112534 -123749 -110472 -77895 -38671 15623 10681
24044A0681J147K9932J99k0686j8665P099O107k7188l299L567J0133m5436l0641
$$ 10681 11828 41760 41959 21273 2608 9707 15814 -11374 -14673 -11106 -973 -46409 -77050
24031g7050L586j4672M9059K9413k4460J4236K4030o582L482J1865n328m9102
$$ -77050 -73464 -88136 -39077 -9664 -34124 -19888 4142 -2440 1042 12907 7579 -41523
24019d1523r811j9275Q520K3151O4323k0848m4753J942n303l8140L8216j4020
$$ -41523 -51334 -70609 -62089 -38938 25385 4537 -40216 -38274 -43577 -81717 -43501 -57521
24007e7521j9343K4258K5165J0992n7729N468P2102M2328J8962L2332L1557n1435
$$ -57521 -76864 -52606 -27441 -16449 -74178 -68710 3392 45720 64682 97014 128571 77136
23995G7136k2914j6306k0718l3863J3263M6491P20N217j4347j6276j4939K2409
$$ 77136 54222 37916 17198 -16665 -3402 43089 43809 49026 34679 18403 3464 25873
23983B5873j7492k0574j852L263J7724O3227l999K2505l0486m2464n7705r795
$$ 25873 8381 -12193 -14045 -10782 6942 70169 66170 88675 58189 15725 -41980 -51775
23971e1775k9646j8608k8612l8585J3916M9500K6005k3961L4028M3562k0436L1087
$$ -51775 -81421 -100029 -128641 -167226 -153310 -103810 -77805 -101766 -67738 -24176 -44612 -13525
23959a3525M8518J2203j7697j6199k2516P913o931K689n91m509j5916K1306L667
$$ -13525 34993 47196 29499 13300 -9216 -1303 -8234 -5545 -6136 -10645 -26561 -5255 -1588
23946a588p246j6984K7344J6234K1694K351J9937j3622k5648N354J6574l2803
$$ -1588 -8834 -25818 1526 17760 39454 41805 61742 48120 22472 27826 44400 11597
23934A1597k8797J1873R754J8965J4294N058N527m739j6925j3336k6457K1245
$$ 11597 -17200 -5327 4427 23392 37686 42744 48271 43532 26607 13271 -13186 8059
23922H059J3698J6313j8462l1383k5278j7947r969M7299L2632J6832o216m0440
$$ 8059 21757 38070 19608 -11775 -37053 -55000 -64969 -17670 14962 31794 25578 -14862
23910a4862j7516J2151J8208k1400l380M266M7759O2982m6333m1424R20k9235
$$ -14862 -32378 -20227 -2019 -23419 -26799 -22533 25226 88208 41875 451 1371 -27864
23898b7864O968Q981k4637k451N7889o275K862m0335j1774M3234O947j2647l5559
$$ -27864 -20896 -11915 -36552 -39003 18886 12611 15473 -24862 -36636 6598 13545 898 -34661
23885c4661o652K0309K5532l550l5j226P696L1841j3527o5766j3376M5086J8879
$$ -34661 -41313 -21004 4528 978 943 -283 7413 39254 25727 -40039 -53415 -8329 10550
23872A0550p383m245k2158R640K4259l9557L494L27k9637M590K4202K670j1730
$$ 10550 3167 -1078 -23236 -13596 10663 -28894 -25400 -25073 -54710 -50120 -25918 -23248 -34978
23859c4978o258K7560O126J4586j0011J2204j6423J5605p014q184K3741m7376
$$ -34978 -41236 -13676 -7550 7036 -2975 9229 -7194 8411 1397 -6787 16954 -30422
23847c0422q8408L3983L0744J2509k3377m8627J8815P5229k853l0083l646k5601
$$ -30422 -118830 -84847 -54103 -41594 -64971 -113598 -94783 -19554 -22407 -52490 -56136 -81737
23835h1737l862M4532L4490J4935K9974l828j0015L119l5243l5148K25j5523J8897
$$ -81737 -85599 -41067 -6577 8358 38332 34504 24489 27608 -7635 -42783 -42558 -58081 -39184
23822c9184j8536K9099o175p113j1226P973K8553L0388K2805K4249m2026l540
$$ -39184 -57720 -28621 -34796 -41909 -53135 -45162 -16609 13779 36584 60833 18807 15267
23810A5267M164P255J2308j2258k1496Q577L282k0185M880j2756r262j5666r177
$$ 15267 19431 26686 38994 26736 5240 13817 17099 -3086 1794 -10962 -20224 -35890 -45067
23797d5067j8851k623N5323q781n0496J5655J8530m186j9743j0919j1364r413
$$ -45067 -63918 -66541 -11218 -19999 -70495 -54840 -36310 -40496 -60239 -71158 -82522 -91935
23785i1935K5677L3050J454K1868K8690K6189m7416K461j3709N7515l0853k1627
$$ -91935 -66258 -33208 -31754 -9886 18804 44993 -2423 38 -13671 43844 12991 -8636
23773h636k3394L2869O1405J1976k2047l8302J5725K0500k69j6937j7942l8861
$$ -8636 -32030 839 62244 74220 52173 13871 29596 50096 49827 32890 14948 -23913
23761b3913q222N5655k5361q4230k8078M8637K2403O3249J1644J6276n370m1202
$$ -23913 -32135 23520 -1841 -86071 -114149 -65512 -43109 20140 31784 48060 42690 1488
23749A488k2497j3483j0796K4302l0596Q26M4434L4572m9690n7317J9242R0981
$$ 1488 -21009 -34492 -45288 -20986 -51582 -50756 -6322 28250 -21440 -78757 -59515 31466
23737C1466M2932k629n193l2159l1280m094K4602K414j7403m4726P394p476j738
$$ 31466 74398 71769 66576 34417 3137 -957 23645 26059 8656 -36070 -28676 -36152 -37890
23724c7890L2519l4136L5268J6275o54j5098j6993J3923q480o102k6500O887P074
$$ -37890 -5371 -39507 -4239 12036 11382 -3716 -20709 -6786 -15266 -21368 -47868 -40981 -33907
23711c3907Q719K9083j6322l838k794K2429L932J1631j6628p261l3810k0516j2561
$$ -33907 -25188 3895 -12427 -16265 -19059 3370 7302 18933 2305 -4956 -38766 -59282 -71843
23698g1843L4292n603J802K775j9993k8341l829L3441N9860O4550l0672O333M5618
$$ -71843 -37551 -43154 -41352 -38577 -58570 -86911 -90740 -57299 2561 67111 36439 42772 88390
23685H8390L763n1696j3971j7431K228O0536N776k0320m8487n0995J9862L1487
$$ 88390 92153 40457 26486 9055 11283 71819 77595 57275 8788 -42207 -22345 9142
23673I142q618j7007k3098J8475N7803Q401n4033j9948k5633l1841K2346M9192
$$ 9142 524 -16483 -39581 -21106 36697 45098 -8935 -28883 -54516 -86357 -64011 -14819
23661a4819N8726l5636l4386O13K2750M475J5135p4597K3951K5651N2969J9331
$$ -14819 43907 8271 -26115 -25502 -2752 1723 16858 -57739 -33788 -8137 44832 64163
23649F4163n954k0854j4058k9224n640j8929j1605O7196K5276l7083n4446J9629
$$ 64163 58209 37355 23297 -5927 -11567 -30496 -42101 25095 50371 13288 -41158 -21529
23637b1529J0851m7962j9462o844j8678r80j2456M2786Q7968M0133J7809o806
$$ -21529 -10678 -58640 -78102 -84946 -103624 -104604 -117060 -74274 13694 53827 71636 64830
23625F4830m6227m6040j782K1295L4424K000K218R248N776j5753j2436k0964k4577
$$ 64830 18603 -27437 -29219 -7924 26500 28500 30718 39966 45742 29989 17553 -3411 -27988
23612b7988R514K1517J8310M6884j0562l7868k8047J4633n3360k9766J6366l3622
$$ -27988 -18474 3043 21353 68237 57675 19807 -8240 6393 -46967 -76733 -60367 -93989
23600i3989k911m598J5926K5784M0763J8804N740J9455J968k395n906j6990o454
$$ -93989 -96900 -101498 -85572 -59788 -19025 -221 5519 24974 26942 24547 18641 1651 -4803
23587d803L2062j013K7127m36n7158m6365K4392J3004O515k696j9502k7650m1833
$$ -4803 27259 26246 53373 52937 -4221 -50586 -26194 -13190 -6675 -9371 -28873 -56523 -98356
23574i8356R318M6098k476O3572q033J6613o750j8933K529J5326J2594p72L924
$$ -98356 -89038 -42940 -45416 18156 10123 26736 19986 1053 3582 18908 31502 30730 34654
23561C4654J7432k6669J068l7245K041K5984P050k4829N449l054m6573L2350K8885
$$ 34654 52086 25417 26485 -10760 -8719 17265 24315 -514 4935 1881 -44692 -12342 16543
23548A6543n019j6560n7643L855O2859k4100m5836o696j6820l4112r469M0480
$$ 16543 11524 -5036 -62679 -58824 4035 -20065 -65901 -72597 -89417 -123529 -132998 -92518
23536i2518N9262O2791r006l3678K6448P818L458j3272K037m9827o4204Q295J4572
$$ -92518 -33256 29535 20529 -13149 13299 21117 24575 11303 13340 -36487 -100691 -92396 -77824
23523g7824J2649R274K7079N1249J00N719J9075k1878O923L7654j8267K575l9559
$$ -77824 -65175 -55901 -28822 22427 22527 28246 47321 25443 32366 70020 51753 54328 14769
23510A4769n9354k2434o181K9282L981j3707l2082j3614L157K8849P9041L108
$$ 14769 -44585 -67019 -73200 -43918 -39937 -53644 -85726 -99340 -96183 -67334 11707 14815
23498A4815J9498j3149J7704M4592l1128j8844M054P645J5310j1179l096j2431
$$ 14815 34313 21164 38868 83460 52332 33488 37542 45187 60497 49318 46222 33791
23486C3791K7743l1588m9023j1587q237K9531L2485O073k572j5708R507K3530
$$ 33791 61534 29946 -19077 -30664 -38901 -9370 23115 29188 26616 10908 20415 43945
23474D3945l4661Q732K7359k3438j4913L9764k0755j2434j8694k3444P9487N0833
$$ 43945 9284 18016 45375 21937 7024 46788 26033 13599 -5095 -28539 50948 101781
23462A01781J3893n2717n4145J5737J6954r812j2749L5156O089l7758p5770J0512
$$ 101781 115674 62957 8812 24549 41503 31691 18942 54098 60187 22429 -53341 -42829
23450d2829K6162k7173o5797r429N2367L2456K5216O5578L087m3752m3728K2655
$$ -42829 -16667 -43840 -109637 -119066 -66699 -34243 -9027 56551 59638 15886 -27842 -5187
23438e187J001j2333k7660k6133k0112J6300o948Q479K0789J2796P065m6831p671
$$ -5187 -4186 -16519 -44179 -70312 -90424 -74124 -81072 -72593 -51804 -39008 -31943 -78774 -86445
23425h6445L9621N5430j4601o550k5200J4831l5522k7904l533P290L8392N189
$$ -86445 -46824 8606 -5995 -12545 -37745 -22914 -58436 -86340 -89873 -82583 -44191 -39002
23413c9002K794J8081L7076K614J569j8698O635j8955q4581j2071Q887K1642r433
$$ -39002 -36208 -18127 18949 21563 23132 4434 11069 -7886 -92467 -104538 -95651 -74009 -83442
23400h3442M2886O0695r41J2066l9127j7327K8245p507l87k4083J7169j6248J4138
$$ -83442 -40556 20139 19198 31264 -7863 -25190 3055 -4452 -4839 -28922 -11753 -28001 -13863
23387a3863M696M2763J8688k7268j5244K4373j5117j3317l4378K2657L0268K2754
$$ -13863 -9167 33596 52284 25016 9772 34145 19028 5711 -28667 -6010 24258 47012
23375D7012K4449k5374n2420l4042r115Q3522M1247K8270l0085l5873k2081p21
$$ 47012 71461 46087 -6333 -40375 -49490 34032 75279 103549 73464 37591 15510 14789
23363A4789j8269k8692k6444R940k935k812K0120L6776j6008p512J5435M3201
$$ 14789 -3480 -32172 -58616 -48676 -51611 -54423 -34303 2473 -13535 -21047 -5612 37589
23351C7589O038k2535k0325j3795m736j8470p801o5962o6043K1610O0094R085
$$ 37589 43627 21092 767 -13028 -17764 -36234 -44035 -109997 -176040 -154430 -94336 -85251
23339h5251k8809K8149l6669L887M4678N9872J1217m5609j0342J776R965M2771
$$ -85251 -114060 -85911 -122580 -118693 -74015 -14143 -2926 -48535 -58877 -57101 -47136 -4365
23327d365K3489k5166o3964K7393L3501L5732L890m1821J4447r215J1364p097
$$ -4365 19124 -6042 -70006 -42613 -9112 26620 30510 -11311 3136 -6079 5285 -1812
23315a812R272K6467k4992l5475j1981J3435Q703m0245K7409M5924K5865l7496
$$ -1812 7460 33927 8935 -26540 -38521 -25086 -16383 -56628 -29219 16705 42570 5074
23303E074k7867j1914k2492R543K5582R693j9743J063N9463q634j0921j9998k6046
$$ 5074 -22793 -34707 -57199 -47656 -22074 -12381 -32124 -31061 28402 19768 8847 -11151 -37197
23290c7197J1426L4216J9063k1491l3128l0064P126L1676N3565J7375j6207k8007
$$ -37197 -25771 8445 27508 6017 -27111 -57175 -50049 -18373 35192 52567 36360 8353
23278H353J711M0972j6611l5349j616p963Q520J2277J8116k3911L857k8672k8157
$$ 8353 10064 51036 34425 -924 -2540 -10503 -1983 10294 28410 4499 8356 -20316 -48473
23265d8473O4523M614k2220L4624L0772j8628m1640j7332j6764r525j9541L5601
$$ -48473 16050 20664 -1556 33068 63840 45212 3572 -13760 -30524 -40049 -59590 -23989
23253b3989J5798k919j2343J5958j2911l9622j8838j2699k2296J9220P3552K2308
$$ -23989 -8191 -11110 -23453 -7495 -20406 -60028 -78866 -91565 -113861 -94641 -21089 1219
23241A219n0857k3900L4206m431K2021j1888K3522L0831r484q612M0592j5513
$$ 1219 -49638 -73538 -39332 -43763 -21742 -33630 -10108 20723 11239 2627 43219 27706
23229B7706k9791L983k3295M02m416R587k8105J3358l6214j2384O0879M7021j7324
$$ 27706 -2085 1898 -21397 -20995 -25411 -15824 -43929 -30571 -66785 -79169 -18290 28731 11407
23216A1407l1779r445J5365K7206k589j2938k2267K5631l2346q487l519K7584
$$ 11407 -20372 -29817 -14452 12754 10165 -2773 -25040 591 -31755 -40242 -43761 -16177
23204a6177K9591j8974p4498k7098O1100J7898K0471K7288p886l2307j0921L5139
$$ -16177 13414 -5560 -80058 -107156 -46056 -28158 -7687 19601 11715 -20592 -31513 3626
23192C626P448m5199m1901L699K2739J0922K1453q824Q816m9277l5175J6552Q0167
$$ 3626 11074 -34125 -76026 -72327 -49588 -38666 -17213 -26037 -17221 -66498 -101673 -85121 -4954
23179d954L0887L7921J7955j1029j6976J798j7127m7010J9513M2395M5036J2898
$$ -4954 25933 63854 81809 70780 53804 55602 38475 -8535 10978 53373 98409 111307
23167A11307K919K544M2072K8089J0855J8437m9062j6413M1523n629Q0486Q4052
$$ 111307 114226 116770 158842 186931 197786 216223 167161 150748 192271 186642 267128 351180
23155C51180N2626M1027R3187J07954J18824K03389K01925K41744K46823K60880
$$ 351180 403806 444833 538020 645974 764798 968187 1170112 1411856 1658679 1919559
23145A919559K13776J10956J4651n2021j80467k77304l27465l13238k41021j25670
$$ 1919559 2133335 2244291 2258942 2206921 2026454 1749150 1421685 1108447 867426 741756
23135G41756p4673p6792o3853n4986n4806p7760n4405m6754l6066k1299l1631
$$ 741756 667083 590291 526438 471452 416646 338886 284481 237727 201661 180362 148731
23124A48731P401K8781o650J9063l6237j5473l0828m9059l2918L952K454k4669
$$ 148731 156132 184913 178263 197326 161089 145616 114788 65729 32811 36763 39217 14548
23112A4548k7883J5934J679K70M0536L0955L332k8874J707k8442m4979o553J7920
$$ 14548 -13335 2599 4278 4548 45084 76039 79371 50497 52204 23762 -21217 -27770 -9850
23099i850m4957J1261L0681J5865L4945O089j3601o0682n0280j2100O003N202
$$ -9850 -54807 -43546 -12865 3000 37945 44034 30433 -30249 -80529 -92629 -86626 -81424
23087h1424l6958L6786N1825K5928k1382r036L0187R010o1794m0320N2452L2698
$$ -81424 -118382 -81596 -29771 -3843 -25225 -34261 -4074 4936 -56858 -97178 -44726 -12028
23075a2028j1455J5483k2234L9926K1909K013n232M712k3678k9098o306k0773
$$ -12028 -23483 -8000 -30234 9692 31601 33614 28382 33094 9416 -19682 -25988 -46761
23063d6761l0892l865M1723R2651K3228l8884n4482n522N8201J0113Q301p947
$$ -46761 -77653 -81518 -39795 52856 76084 37200 -17282 -22804 35397 45510 53811 45864
23051D5864n3373Q755l1438j3287J9767j1855J0214P1092L0502l173j2618k8784
$$ 45864 -7509 1246 -30192 -43479 -23712 -35567 -25353 45739 76241 73068 60450 31666
23039C1666j1358l9661j4178J6819K1852p435o070k3946M2360K468j0126K7800
$$ 31666 20308 -19353 -33531 -16712 5140 -2295 -8365 -32311 10049 12517 2391 30191
23027C0191l4963l3527n138J2687P666J1089k1306K9059L704J4468o073J2379
$$ 30191 -4772 -38299 -43437 -30750 -23084 -11995 -33301 -4242 -538 13930 7857 20236
23015B0236r94m5619l4117J78J397J2367J7879K4681L2167K4880k408m5865o1530
$$ 20236 19242 -26377 -60494 -60316 -58919 -46552 -28673 -3992 28175 53055 50647 4782 -56748
23002e6748J4596N0817j6038r382O557K7757N9386J7851k5743l5340L1063j9057
$$ -56748 -42152 8665 -7373 -16755 -10198 17559 76945 94796 69053 33713 64776 45719
22990D5719l079J8742k4194j2351k2942m4945Q090R7508j1587k7296k2513J5689
$$ 45719 42640 61382 37188 24837 1895 -43050 -34960 62548 50961 23665 1152 16841
22978A6841K1453O2709M253m4554l5075L0691K208j4539K1488m7101j5683L1684
$$ 16841 38294 101003 105256 60702 25627 56318 58526 43987 65475 18374 2691 34375
22966C4375r818L048J1829J5302m0212L156k0407L5273L5090L9926o133n9590
$$ 34375 24557 27605 39434 54736 14524 17680 -2727 32546 67636 107562 101429 41839
22954D1839j8885l9733p092L1579P3661l0306k551K0543j6397L7161K3548l9629
$$ 41839 22954 -16779 -23871 7708 81369 51063 48512 69055 52658 89819 113367 73738
22942G3738J6884K8246Q112m4308l3532j5432L1780j8694n4356O604J5266N7269
$$ 73738 90622 118868 126980 82672 49140 33708 65488 46794 -7562 -958 14308 71577
22930G1577J9462m1777j9386L6004j315k4025K5224k7740L4388L2215K3289j2350
$$ 71577 91039 49262 29876 65880 64565 40540 65764 38024 72412 104627 127916 115566
22918A15566k1599j6720n237L582L6394j139l9180k5935q832P444M427j3703m945
$$ 115566 93967 77247 72010 75592 111986 110847 71667 45732 36900 44344 48771 35068 30123
22905C0123J0118j037r742K5236Q208j3874n877q131j0280m5467j7121J3642O543
$$ 30123 40241 39204 29462 54698 62906 49032 43155 35024 24744 -20723 -37844 -24202 -17659
22892a7659L3163L7415o0815k8798J7896k1763J7734P475n868J1598n415L6760
$$ -17659 15504 52919 -7896 -36694 -18798 -40561 -22827 -15352 -21220 -9622 -15037 21723
22880B1723p055m5613K7775j2468M6772O6963l2605m8917p663J1037j0265m8152
$$ 21723 14668 -30945 -3170 -15638 31134 98097 65492 16575 8912 19949 9684 -38468
22868c8468J8003L1849J9210l2847n6573J7936M9057N431O3236R009L4137k6595
$$ -38468 -20465 11384 30594 -2253 -58826 -40890 8167 13598 76834 85843 119980 93385
22856I3385k0244k5372L316Q762J9124O040M2087J4952k7461N0719M1569j9396
$$ 93385 73141 47769 51085 59847 78971 85011 127098 142050 114589 165308 206877 187481
22844A87481l5140j6229l7040m4935J4028O1956j410j8009l5102K115K3141l9533
$$ 187481 152341 136112 99072 54137 68165 130121 128711 110702 75600 77715 100856 61323
22832F1323j9036J3114L2018J7181o739l2227o4966l395Q7397J19113J2797n0688
$$ 61323 42287 55401 87419 104600 97861 65634 668 -2727 84670 203783 216580 165892
22820A65892j7238k0455M1976j6896k5079k2658m3771P907J9288K451o131m2759
$$ 165892 148654 128199 170175 153279 128200 105542 61771 69678 88966 91417 85286 42527
22808D2527L3292j4471l0918j784R120L8852K7330l4406J2367M0216K4091j6345
$$ 42527 75819 61348 30430 28646 37766 76618 103948 69542 81909 122125 146216 129871
22796A29871j8979k6665J4240J5567J905l7364J3652L5003l69j541k8827j9051
$$ 129871 110892 84227 98467 114034 115939 78575 92227 127230 126861 125320 96493 77442
22784G7442l0832k8578p5979L5909P756P962L0052l505M3442Q006L2852N4622
$$ 77442 46610 18032 -57947 -22038 -14282 -6320 23732 20227 63669 71675 104527 159149
22772A59149j1888p394k846n2334L2393j884k9422k9938j9605K0853l2392J1481
$$ 159149 147261 139867 137021 84687 117080 115196 85774 55836 36231 57084 24692 36173
22760C6173J7944q182k6333j5680L7318o768R999J0196Q6966N755q6303M781k5608
$$ 36173 54117 45935 19602 3922 41240 34472 44471 54667 141633 147388 61085 65866 40258
22747D0258p8771n6714r312M1815N7713o4388m1420j7137m416k4296j5184J4643
$$ 40258 -38513 -95227 -104539 -62724 -5011 -69399 -110819 -127956 -132372 -156668 -171852 -157209
22735a57209j5393P9077P0520L5935O5286O2558j9181j4131K8653J997K0479j1491
$$ -157209 -172602 -93525 -23005 12930 78216 140774 121593 107462 136115 138112 158591 147100
22723A47100q431j5200m2234j8303m695j7304q728J2659N9154M6517M5043K049
$$ 147100 138669 123469 81235 62932 58237 40933 32205 44864 104018 150535 195578 197627
22711A97627q055q409l4534M7254M4105N2982Q317m0629j1831K568j5275L5862
$$ 197627 189572 181163 146629 193883 237988 290970 299287 258658 246827 249395 234120 269982
22699B69982K6699q256O642l1009L1138m991K8793J7405r969l4211j2939J4808
$$ 269982 296681 288425 295067 264058 295196 290205 318998 336403 326434 292223 279284 294092
22687B94092J6212l1403M6991O9519N9893o013l9358L5202Q6423M9440L8975K2116
$$ 294092 310304 278901 325892 395411 455304 449291 409933 445135 531558 580998 619973 642089
22675F42089J6694P6645R6315Q2332Q0835J28192J56510J60918K23671K45941
$$ 642089 658783 735428 831743 914075 994910 1123102 1279612 1440530 1664201 1910142
22665A910142K08528J76635J65249R9807k9149j62617k60716k35140k51314k59910
$$ 1910142 2118670 2295305 2460554 2560361 2531212 2368595 2107879 1872739 1621425 1361515
22655A361515k12607j02745n8684j106j0800J1352M0742N4672K5371p4864o314
$$ 1361515 1148908 1046163 987479 986373 975573 986925 1027667 1082339 1107710 1032846 1026532
22644A026532N2623r846o1657q5959K4981N4457P8574M1377M2123M6985N1422
$$ 1026532 1079155 1069309 1007652 921693 946674 1001131 1079705 1121082 1163205 1210190 1261612
22633A261612P2382J14044R4599J66397K16684J84920K04624K55322L03358L61943
$$ 1261612 1333994 1448038 1542637 1709034 1925718 2110638 2315262 2570584 2873942 3235885
22623C235885L80414M00720M10446M18041M35773N28889N82329O80088P64468
$$ 3235885 3616299 4017019 4427465 4845506 5281279 5810168 6392497 7072585 7837053
22614G837053Q55236R93674J096031J134026J193408J304693J430183J562985
$$ 7837053 8692289 9685963 10781994 11916020 13109428 14414121 15844304 17407289
22606A7407289J711193J869491J977026K105220K375874K728579L101450L526892
$$ 17407289 19118482 20987973 22964999 25070219 27446093 30174672 33276122 36803014
22598C6803014M093186M880302N927185P178692R079132J2501211J8472185K5641692
$$ 36803014 40896200 45776502 51703687 58882379 67961511 80462722 98934907 124576599
22590A24576599K9513782L1970318L8320356M1727036L8553741L3814045K6158809
$$ 124576599 154090381 186060699 224381055 266108091 304661832 338475877 364634686
22583C64634686J0435925j2726808l6948537m8988707n1867433n1521243m0565920
$$ 364634686 375070611 362343803 325395266 276406559 224539126 173017883 132451963
22576A32451963k5945874j5880129j0206886p634235o421086n969993n814808
$$ 132451963 106506089 90625960 80419074 72784839 66363753 60393760 54578952
22569E4578952n525497n242784m952575m388127l930249l401159k869102k532847
$$ 54578952 49053455 43810671 38858096 34469969 30539720 27138561 24269459 21736612
22561B1736612k186398j879825j646409j504676j285136j067644j022828r76994
$$ 21736612 19550214 17670389 16023980 14519304 13234168 12166524 11143696 10166702
22553A0166702q09226o80961o93879o44958o25774n33928m76487m17804m12436
$$ 10166702 9357476 8676515 7982636 7337678 6711904 6177976 5701489 5283685 4871249
22544D871249l59754l07532l33503l61446l08693k44831j77469k02637j90047
$$ 4871249 4511495 4203963 3870460 3509014 3200321 2955490 2778021 2575384 2385337
22535B385337j17377m4427j36540j17467n8472r8115m8516j05721j47887j09140
$$ 2385337 2267960 2223533 2086993 1969526 1911054 1812939 1764423 1658702 1510815 1401675
22525A401675j76393p1248k144m0164l3381q0994r3811P7277J01389o862j3593
$$ 1401675 1225282 1154034 1151890 1111726 1078345 997351 903540 980817 1082206 1075344 1061751
22514A061751j2923N1753Q5846J58934J37848J09193J41985J94128K03680K07818
$$ 1061751 1048828 1100581 1186427 1345361 1483209 1592402 1734387 1928515 2132195 2340013
22504B340013J95946Q5458p5573j61201k44998l14674l17639k75587j64842j03945
$$ 2340013 2535959 2621417 2545844 2384643 2139645 1824971 1507332 1231745 1066903 962958
22494I62958n9697p545n0300q2008j4531K5678m094k9316o6267j5760m4679l1774
$$ 962958 903261 895716 845416 763408 748877 774555 770461 741145 674878 659118 614439 582665
22482E82665k6454k7293n4764k782M0406M9400P054p7241n6841K3372L7654K4774
$$ 582665 556211 528918 474154 471372 511778 561178 568232 490991 434150 457522 495176 519950
22470E19950J8356Q056p832j8057Q39q077o7164m2455j8078L3863O8610J10034
$$ 519950 538306 546362 538530 520473 521312 513235 446071 403616 385538 419401 488011 598045
22458E98045L2451j4195M439m3547n8365j02366l0053p594L3904M3217L3180r766
$$ 598045 630496 616301 620740 577193 518828 416462 386409 378815 412719 455936 489116 479350
22446D79350O9l1417k9550J2746J1193Q280J2744m7602j9519k5237j7082M5256
$$ 479350 479419 448002 418452 431198 442391 450671 463415 415813 396294 371057 353975 399231
22434C99231R0864Q3160j2387l6457l4080K0134J2302l7165j7790l63p773q348
$$ 399231 490095 573255 560868 524411 490331 510465 522767 485602 467812 467449 459676 451328
22422D51328k4322j6926m0233O648n0319R20l4926o761k2812p9861m8580o732
$$ 451328 427006 410080 369847 376495 326176 327096 292170 285409 262597 182736 134156 127424
22410A27424p019P479o0k8437k815K7491L2717j3864L9175K063m8502l7267j1797
$$ 127424 120405 127884 127824 99387 96572 124063 156780 142916 182091 184154 135652 98385 86588
22397H6588j176l1762K7172N1954l8553J4952J6545p503k538L7588J9693J6285
$$ 86588 85412 53650 80822 132776 94223 109175 125720 118217 115679 153267 172960 189245
22385A89245j2174N418k3169k1889l266l607j4933n6991m4368J161J5021K1759
$$ 189245 177071 182489 159320 137431 134165 130558 115625 58634 14266 15427 30448 52207
22373E2207J7928N7159q497M041m2369n4043j1695N8937J5011l8530j7617J6672
$$ 52207 70135 127294 118797 122838 80469 26426 14731 73668 88679 50149 32532 49204
22361D9204L1218j6793k1708M139j562K8769n133J7541K3511L1728J7368K3902
$$ 49204 80422 63629 41921 46060 44498 73267 68134 85675 109186 140914 158282 182184
22349A82184l0376r768l8238K8606j2154m1132m1834j8154L88o204J5246P3779
$$ 182184 151808 142040 103802 132408 120254 79122 37288 19134 19522 13318 28564 102343
22337A02343L3587p0848m3594l0590M4341P5096j9660m0779L594N3443L2701k057
$$ 102343 135930 65082 21488 -9102 35239 110335 90675 49896 53490 106933 139634 137577
22325A37577M5647k7157k8347p4987J4358N5561Q973n7814m4157P909l2707j5425
$$ 137577 183224 156067 127720 52733 67091 122652 131625 73811 29654 37563 4856 -10569
22313a0569J9695J7022j2805j614K7039N2083m600p3567k9386m4098N5355O2716
$$ -10569 9126 26148 13343 11729 38768 90851 86251 12684 -16702 -60800 -5445 57271
22301E7271K3835k2073p769k1159J0536K1452J2704k456n1372k1910j4869O5254
$$ 57271 81106 59033 51264 30105 40641 62093 74797 72341 20969 -941 -15810 49444
22289D9444K291j9261n924J0375j798J2318p229k8901O8212N1010j2466l3342
$$ 49444 51735 32474 26550 36925 35127 47445 40216 11315 79527 130537 118071 84729
22277H4729j5209O458J3720Q968P879q681m4310j4521N887j069J9412N4868L8713
$$ 84729 69520 75978 89698 98666 106545 97864 53554 39033 44920 43851 63263 118131 156844
22264A56844O945j8454r216n0815n0396k3451K9661L1055J6376o2602J466L8002
$$ 156844 163789 145335 136119 85304 34908 11457 41118 72173 88549 25947 27413 65415
22252F5415j5498n5015m245j2076K937j8383J6518M9453k335k3376n1822o384
$$ 65415 49917 -5098 -9343 -21419 -18482 -36865 -20347 29106 26771 3395 -48427 -54811
22240e4811L8399J6350J9371J4298j6056q293j0081p00M553j6663j0072l7164
$$ -54811 -16412 -62 19309 33607 17551 9258 -823 -1523 3030 -13633 -23705 -60869
22228f0869L2550j4026M6479N3924O4224k9625q9162k2874K7724L9773j4668R826
$$ -60869 -28319 -42345 4134 58058 122282 92657 3495 -19379 8345 48118 33450 43276
22216D3276R348k2612M37k1384n420P724J5872K4932l388o96m40K307j6493M9443
$$ 43276 52624 30012 30449 9065 3645 11369 27241 52173 48785 48089 47649 49956 33463 82906
22202H2906K093O344j7791o3053m1016J2366K0492J4433J9414J703J6351K189
$$ 82906 84999 91343 73552 10499 -30517 -18151 2341 16774 36188 37891 54242 56431
22190E6431l5178k5041j206J4366o05k6689m4185j440k8472L3678j2941K6333
$$ 56431 21253 -3788 -4994 9372 8767 -17922 -62107 -63547 -92019 -58341 -71282 -44949
22178d4949N3349M3957l6664L385k2135j8152j0316J3381n337J8502J7544J0479
$$ -44949 8400 52357 15693 19078 -3057 -21209 -31525 -18144 -23481 -4979 12565 23044
22166B3044K5473m0537n0r85p0323m2709q133J2705J3863j6342L3406n852l6318
$$ 23044 48517 7980 7930 6945 -63378 -106087 -114220 -101515 -87652 -103994 -70588 -76440 -112758
22153a12758N9982K2517m3678P5561L4879l6666j6038Q564j2948m355M4818J8344
$$ -112758 -52776 -30259 -73937 1624 36503 -163 -16201 -7637 -20585 -24940 19878 38222
22141C8222k1734j6767L6037R957n1328J0413N048m1996K1753K7061l1151o1149
$$ 38222 16488 -279 35758 45715 -5613 4800 9848 -32148 -10395 16666 -14485 -75634
22129g5634K0426Q5361K879o8149J1399K530k5757K2932Q223O398k7087j1991
$$ -75634 -55208 30153 33032 -35117 -23718 -21188 -46945 -24013 -15790 -9392 -36479 -48470
22117d8470L2003Q329l079K9111l6341q701K824p3796j7225m108j0643R88j069
$$ -48470 -16467 -8138 -11217 17894 -18447 -27148 -24324 -98120 -115345 -119453 -130096 -129108 -130177
22104a30177L5615M8767M3296M5061l91n9307K105J3375M5079N96l2860j0750
$$ -130177 -94562 -45795 -2499 42562 42171 -17136 -15031 -1656 43423 44019 11159 409
22092D09N8438j6379j3465k9694K347J9472N1792p688L646J9881J0943k9763m7361
$$ 409 58847 42468 29003 -691 1656 21128 72920 65232 68878 88759 99702 69939 22578
22079B2578K8881L0992m0478l4655K3984j8263M3421L4065o5056j4422M1116j4873
$$ 22578 51459 82451 41973 7318 31302 13039 56460 90525 25469 11047 52163 37290
22067C7290k8773J6269N842o558k5159j8956J8322K3962N1626L5805n6448m5911
$$ 37290 8517 24786 30628 24070 -1089 -20045 -1723 22239 73865 109670 53222 7311
22055G311N0845L2375J8584l2486J6470J4794m2722r570j0292J0779n357J0323
$$ 7311 58156 90531 109115 76629 93099 107893 65171 55601 45309 56088 50731 61054
22043F1054K4056L7373j6729K2592j3264K7259J4544k1360r0662r156J9499K7728
$$ 61054 85110 122483 105754 128346 115082 142341 156885 135525 44863 35707 55206 82934
22031H2934K8349P2739N8478j7225J5602Q1629O2195O6150J02301J12139J79921
$$ 82934 111283 184022 242500 225275 240877 322506 384701 450851 553152 665291 845212
22020H45212K19244K45143K21532J93753K14205K36013J91341j2552j57253l04664
$$ 845212 1064456 1309599 1531131 1724884 1939089 2175102 2366443 2353891 2196638 1891974
22010A891974l50367l80261k98819j87334o9632k6249m2105r8413l0546J3081
$$ 1891974 1541607 1161346 862527 675193 605561 579312 537207 438794 408248 421329
22000D21329l5399n2017p0066n7148l2109m9810j5285M1483O353k2554l4277m4886
$$ 421329 385930 333913 263847 206699 174590 124780 109495 150978 157331 134777 100500 55614
21988E5614l9467j6306l2134J1393L4075J0446l0170j4381j139J3929M6572O914
$$ 55614 16147 -159 -32293 -20900 13175 23621 -6549 -20930 -22069 -8140 38432 45346
21976D5346j8014K480j448k7380J1186j2504l0391q913K8923L1969L4017k18j7148
$$ 45346 27332 29812 28364 984 12170 -334 -30725 -39638 -10715 21254 55271 55053 37905
21963C7905O862j4685l2417J7467l3225l0801J7366L5751P843q472K8196r55o423
$$ 37905 44767 30082 -2335 15132 -18093 -48894 -31528 4223 12066 3594 31790 30835 24412
21950B4412K8017j8780l9846o4899J3977K0343O0608J73k9349j8140N3327K0518
$$ 24412 52429 33649 -6197 -71096 -57119 -36776 23832 24005 -5344 -23484 29843 50361
21938E0361k7338k1000p239O132n8007o6034N9786M6390J3702l0002j2547K8154
$$ 50361 23023 2023 -5216 916 -57091 -123125 -63339 -16949 -3247 -33249 -45796 -17642
21926a7642J8592K4857k839N9677J3661l1457o8178m3769M4557j0255j383m5469
$$ -17642 950 25807 22968 82645 96306 64849 -3329 -47098 -2541 -12796 -14179 -59648
21914e9648k7554K5666Q1715L173M242m9661j0945r310M743K1242J3284k9623
$$ -59648 -87202 -61536 20179 23352 27594 -22067 -33012 -42322 -37579 -16337 -3053 -32676
21902c2676k5437J6298m3977l7557L8158N2102q150j9581l7250K5836L7648K0823
$$ -32676 -58113 -41815 -85792 -123349 -85191 -33089 -41239 -60820 -98070 -72234 -34586 -13763
21890a3763L5217L9641j7987m7193k4999l169J4669k6104J5092O879J7215K2399
$$ -13763 21454 61095 43108 -4085 -29084 -32253 -17584 -43688 -28596 -21717 -4502 17897
21878A7897J4681J4230J00k4592l2491J217j5230K135J5887j7351K5959j3650
$$ 17897 32578 46808 46908 22316 -10175 -8958 -24188 -22053 -6166 -23517 2442 -11208
21866a1208K3200M2924K0836m839n624l2727j2013m2192k1440l5522O000N1249
$$ -11208 11992 54916 75752 70913 65289 32562 20549 -21643 -43083 -78605 -72605 -21356
21854b1356K8629j6711m4102J3381P5317J9202n3063m8699J1151L0211K1651j7929
$$ -21356 7273 -9438 -53540 -40159 35158 54360 1297 -47402 -36251 -6040 15611 -2318
21842b318K1727M4341J9446m7768m8526r074M771J0649K892P4320n8905p5996
$$ -2318 19409 63750 83196 35428 -13098 -22172 -17401 -6752 -3860 70460 11555 -64441
21830f4441k2372N6938K0012J2237L7679J0439Q272k4701j4209k9354O3503J9196
$$ -64441 -86813 -29875 -9863 2374 40053 50492 58764 34063 19854 -9500 54003 73199
21818G3199n7518j7933Q966L1182l5254m3410j7096J3631K9536l1546j8522L9003
$$ 73199 15681 -2252 6714 37896 2642 -40768 -57864 -44233 -14697 -46243 -64765 -25762
21806b5762P97J749J7292N1477O4027K725l9147k8648l6502l0058l5134K812J8186
$$ -25762 -24965 -23216 -5924 45553 109580 112305 73158 44510 8008 -22050 -57184 -54372 -36186
21793c6186J121j0817j953Q760j7783K9277M982j5572o249k6625K1140K362L16
$$ -36186 -35065 -45882 -47835 -39075 -56858 -27581 -22599 -38171 -44420 -71045 -49905 -47543 -47227
21780d7227L4003j0339J7299L2763L2552k1114k9461o53N941j0371m4955p2100
$$ -47227 -13224 -23563 -6264 26499 59051 37937 8476 7823 13764 3393 -41562 -113662
21768a13662j9724K8137L0380M9818j1176o3093J6701M2865k4983j8348k7785
$$ -113662 -133386 -105249 -74869 -25051 -36227 -99320 -82619 -39754 -64737 -83085 -110870
21757a10870K9340M2282N4159J2128m2864j8680m0370O861K5265M0878J7485Q04
$$ -110870 -81530 -39248 14911 27039 -15825 -34505 -74875 -68014 -42749 -1871 15614 16418
21745A6418J4686L370k8617j6916j2813k9283L6701N707J0143n575n8438n620
$$ 16418 31104 34474 5857 -11059 -23872 -53155 -16454 -10747 -604 -6179 -64617 -70237
21733g0237K0564N5327M5159O74o3507O37K8813p039K5936j8161j3897m4998N023
$$ -70237 -49673 5654 50813 51487 -12020 -11383 17430 10391 36327 18166 4269 -40729 -35706
21720c5706O5445N8792N0394n0428o9214k6302J8417k9530m1367R076N0365Q241
$$ -35706 29739 88531 138925 88497 19283 -7019 11398 -18132 -59499 -50423 -58 8183
21708H183k3751J9592L0781N5972N6174n6664j11531j8561M0229J3942L61k1778
$$ 8183 -15568 4024 34805 90777 146951 90287 -21244 -39805 424 14366 14727 -7051
21696g051m6664J7231J02911R957l0163J4642L055j6532L306P218q3621k1529
$$ -7051 -53715 -36484 66427 76384 46221 60863 63918 47386 50692 57910 -25711 -47240
21684d7240j1813J6297M048j8781j1749Q977N3585r598m1055P615n649J9087K1734
$$ -47240 -59053 -42756 -38708 -57489 -69238 -60261 -6676 -16274 -57329 -49714 -55363 -36276 -14542
21671a4542L8001j0975m6269N333K0214P743l1411j2764l211m572j780N4664J2585
$$ -14542 23459 12484 -33785 -28452 -8238 -495 -31906 -44670 -47881 -52453 -54233 431 13016
21658A3016k9003O1233j0638n0776l2349R085K4361M8612k9996m0471j8972J7904
$$ 13016 -15987 45246 34608 -16168 -48517 -39432 -15071 33541 3545 -36926 -55898 -37994
21646c7994L1936N968N202K5778L7601o439J0590k1034L569M0909l69j2476J7274
$$ -37994 -6058 -90 5112 30890 68491 62052 72642 51608 55177 96086 95717 83241 100515
21633A00515m810m7203k0755j4202J6645J5641k6092l25l0014k8632J6772J1063
$$ 100515 95705 48502 27747 13545 30190 45831 19739 19414 -10600 -39232 -22460 -11397
21621a1397L7055k8489M651k6270m9135K5618O0177M7149L630p0695l0468J2299
$$ -11397 25658 -2831 1820 -24450 -73585 -47967 12210 59359 62989 -7706 -38174 -25875
21609b5875m914O975j592j3586O385J7254l083m8518Q385L8951j3268r687n172
$$ -25875 -30789 -23814 -25406 -38992 -32607 -15353 -18436 -66954 -58569 -19618 -32886 -42573 -47745
21596d7745K5036J2517k7627l4259p355L8625j2892j0041O6042N5611L1086m2191
$$ -47745 -22709 -10192 -37819 -72078 -79433 -40808 -53700 -63741 2301 57912 88998 46807
21584D6807l5769k9653J9664K8097l2910k5484L2137l5313J4460L8797K3923J7308
$$ 46807 11038 -18615 1049 29146 -3764 -29248 2889 -32424 -17964 20833 44756 62064
21572F2064K5781j6225p8942k9116K9502K3962k6077Q390J7418m2156j2097P1426
$$ 62064 87845 71620 -7322 -36438 -6936 17026 -9051 -661 16757 -25399 -37496 33930
21560C3930J631p6692M656M84j6450j6827K0420N269n257L5268k8659Q934J5839
$$ 33930 35561 -41131 -36475 -35991 -52441 -69268 -48848 -43579 -48836 -13568 -42227 -33293 -17454
21547a7454j0423k8285M0511r086K9706l5002k2577R923m087K1109j261P006j4792
$$ -17454 -27877 -56162 -15651 -24737 4969 -30033 -52610 -42687 -46774 -25665 -26926 -19920 -34712
21534c4712j1406M4360j0461k9373J1638j183j4553J378j429l717j4634K763q038
$$ -34712 -46118 -1758 -12219 -41592 -29954 -31137 -45690 -44312 -45741 -49458 -64092 -61329 -69367
21521f9367l1143M542N4992K2323L0818O008k6971O1165J3729m7018m1512J6453
$$ -69367 -100510 -95968 -40976 -18653 12165 18173 -8798 52367 66096 19078 -22434 -5981
21509e981j9513r606j8430O412L3571L5049k8867j5394L4081l837k4347M236k3406
$$ -5981 -25494 -35100 -53530 -47118 -13547 21502 -7365 -22759 11322 7485 -16862 -12626 -36032
21496c6032j0296Q606j3931L9320J5358J7278k0407j6523K9663l181K13L518m5869
$$ -36032 -46328 -37722 -51653 -12333 3025 20303 -104 -16627 13036 9855 10068 13586 -32283
21483c2283j2049J35j1615J1278M4825K7044N860j9627m1983j3152J5044J9758
$$ -32283 -44332 -44197 -55812 -44534 291 27335 33195 13568 -28415 -41567 -26523 -6765
21471f765O801k1014j5846o626n9981l0338L5739L3290O2962O6490M8409m0603
$$ -6765 36 -20978 -36824 -43450 -103431 -133769 -98030 -64740 -1778 64712 113121 72518
21459G2518q6023j9603j5367M0955k5094p069k5834L1055L1789k620q27l2392
$$ 72518 -13505 -33108 -48475 -7520 -32614 -39683 -65517 -34462 -2673 -5293 -6120 -38512
21447c8512l140k5092J4968k0304L4152l603Q853k6754l814J7643M0790O607j1463
$$ -38512 -41652 -66744 -51776 -72080 -37928 -41531 -32678 -59432 -63246 -45603 -4813 1794 -9669
21434i669L9716K9106j097k1495L1261L8907j7420J092l576m944l211k7731l8685
$$ -9669 30047 59153 58056 36561 67822 106729 89309 90401 86825 81881 78670 50939 12254
21421A2254K0055j9051j1438j1624k2135k6064N2976J7106N947O4414L3065n6550
$$ 12254 32309 13258 1820 -9804 -31939 -58003 -5027 12079 18026 82440 115505 58955
21409E8955k7199j4l0676k1044K2703r989k6654l742J3304M5229K8193l7331k98
$$ 58955 31756 31742 1066 -19978 2725 -7264 -33918 -37660 -24356 20873 49066 11735 11437
21396A1437m0850o5103j2399M9010K3168J7682J1222j0021j8092k8624q459j3357
$$ 11437 -29413 -94516 -106915 -57905 -34737 -17055 -5833 -15854 -33946 -62570 -71029 -84386
21384h4386n9797J7605L3817L3095p899J427L516N6984L3802K9581k6938j1692
$$ -84386 -144183 -126578 -92761 -59666 -67565 -66138 -62622 -5638 28164 57745 30807 19115
21372A9115O171l3922j4510j6831p0928K1091l999P190J8399K1340l1270j6150
$$ 19115 25286 -8636 -23146 -39977 -110905 -89814 -93813 -86623 -68224 -46884 -78154 -94304
21360i4304K1761j3923K344j1537L752M5760J3482M085J0226O699Q302J6197k222
$$ -94304 -72543 -86466 -84122 -95659 -91907 -46147 -32665 -28580 -18354 -11655 -3353 12844 10622
21347A0622p129N089k8282n0447J1903O9923N3378l0947n5205n4983J1637L9877
$$ 10622 3493 8582 -19700 -70147 -58244 11679 65057 34110 -21095 -76078 -64441 -24564
21335b4564k2136k4329K5379j3651J7856M3630j9756k4204K7910M869L2r111n2173
$$ -24564 -46700 -71029 -45650 -59301 -41445 2185 -17571 -41775 -13865 -8996 -8964 -18075 -70248
21322g0248L4591K5817k722k2833j9543L1682K8093l851j3103q187j4076j0316
$$ -70248 -35657 -9840 -12562 -35395 -54938 -23256 4837 986 -12117 -20304 -34380 -44696
21310d4696j2628Q917J6399j2937L041l53M7378j1151J2237L4628L2597k5555
$$ -44696 -57324 -48407 -32008 -44945 -41904 -42257 5121 -6030 6207 40835 73432 47877
21298D7877n0687k3816l0442j906K6420K4431j4900K5032o764l1540M106j6708
$$ 47877 -2810 -26626 -57068 -58974 -32554 -8123 -23023 2009 -4755 -36295 -32189 -48897
21286d8897Q841K5577K1386l6934M246j018M600L0027L4638M409J4985L0267l3955
$$ -48897 -40056 -14479 6907 -30027 -25781 -26799 -22199 7828 42466 46875 61860 92127 58172
21273E8172m6222J7348J3553J0400L599q790K0735J5162o4764j7476N3079R770
$$ 58172 11950 29298 42851 53251 56850 48060 68795 83957 19193 1717 54796 64566
21261F4566m8281p1123k4062L3254j3409M383O1462R10r521J2080J2006l1173
$$ 64566 16285 -54838 -78900 -45646 -59055 -54672 6790 7700 -1821 10259 22265 -8908
21249h908j1723k5404L8576J2014J494k8544J5098r144J8557K328L3227j3682
$$ -8908 -20631 -46035 -7459 4555 6049 -22495 -7397 -16541 2016 4344 37571 23889
21237B3889k7843k1698P935Q628l695j4317M5908j0364r530l6816o574K2540K0481
$$ 23889 -3954 -25652 -17717 -9089 -12784 -27101 18807 8443 -1087 -37903 -44477 -21937 -1456
21224a456j3169j5817j8859k7506K2487j9688l5044N854Q0260P2817j7628k2086
$$ -1456 -14625 -30442 -49301 -76807 -54320 -74008 -109052 -103198 -22938 49879 32251 10165
21212A0165J5879L0533o5199m0457J8280J2005J251k1505n390J0425R499n845
$$ 10165 26044 56577 -8622 -49079 -30799 -18794 -17543 -39048 -44438 -34013 -24514 -30359
21200c0359N994J6834J9474n81O1624J4979n1672j3674p8560n0297K1332M4662
$$ -30359 -24365 -7531 11943 11362 72986 87965 36293 22619 -55941 -106238 -84906 -40244
21188d0244r719K4589M0368J6088J9388K3417J6352n7225m5518k6934M2856J1006
$$ -40244 -49963 -25374 14994 31082 50470 73887 90239 33014 -12504 -39438 3418 14424
21176A4424k4116k5653J3056L5105p495k7835l5223K6654K2601K2136K7156J5246
$$ 14424 -9692 -35345 -22289 12816 5321 -22514 -57737 -31083 -8482 13654 40810 56056
21164E6056o0107j9127j3016J7617M89p1353j4767J9805L3263R805J2701q777
$$ 56056 -4051 -23178 -36194 -18577 -18088 -89441 -104208 -84403 -51140 -41335 -28634 -37411
21152c7411m919N7273K4881j0412k9216j5217P4407M748o8545o4157L0608R573
$$ -37411 -42330 14943 39824 29412 196 -15021 59386 64134 -4411 -68568 -37960 -28387
21140b8387k7134J7952Q184N389n312j1104L1295M5727j8786j1638k9312j2695
$$ -28387 -55521 -37569 -29385 -23996 -29308 -40412 -9117 36610 17824 6186 -23126 -35821
21128c5821J6068L7681L121o572n2777m6823j7646L0396M0256M3417J0745q873
$$ -35821 -19753 17928 21049 14477 -38300 -85123 -102769 -72373 -32117 11300 22045 13172
21116A3172p84j330n6819k2660J7845j1847j5894R644L0940M4798k4312j9558
$$ 13172 12388 11058 -45761 -68421 -50576 -62423 -78317 -68673 -37733 7065 -17247 -36805
21104c6805N939j0050J0303K5923N330j5905K6774j1142j8792l8324j5830M272
$$ -36805 -30866 -40916 -30613 -4690 640 -15265 11509 367 -18425 -56749 -72579 -68307
21092f8307k4697L3294p662Q1470J5589l4942Q817J2490m12J285J2383m3366K871
$$ -68307 -93004 -59710 -67372 14098 29687 -5255 3562 16052 15640 16925 29308 -14058 -11187
21079a1187m3140l3264R418L513M361m4041P549P0491L2316j3801J7474K2714
$$ -11187 -54327 -87591 -78173 -74660 -70299 -114340 -106791 -36300 -3984 -17785 -311 22403
21067B2403R313O5J003j0160k762J2152J4677l3915j0372m965k5916k0300k848
$$ 22403 31716 31781 32784 22624 19862 32014 46691 12776 2404 -2561 -28477 -48777 -51625
21054e1625J341m081O625J2300j412N850M4141L638K4602k3807L5416M8133l5869
$$ -51625 -50284 -54365 -47740 -35440 -36852 -31002 13139 16777 41379 17572 52988 101121 65252
21041F5252l7307j4629j3431pl4872j4708J1680R923Q6147M4501j0368M084j6711
$$ 65252 27945 13316 -115 -122 -34994 -49702 -38022 -28099 58048 102549 92181 96265 79554
21028G9554k9377k6641n615K4982J1205K1681l1738k6126n4935N777M0290M655
$$ 79554 50177 23536 17921 42903 54108 75789 44051 17925 -37010 -31233 9057 13712
21016A3712j0967j204k2476k047J3919o668k2708l2182R580J2304R490J9056k0827
$$ 13712 2745 1541 -20935 -22982 -9063 -15731 -38439 -70621 -61041 -48737 -39247 -20191 -41018
21003d1018J4898M312k4350K0475N7876k4295k2375L0527O574j311j8816l9732
$$ -41018 -26120 -21808 -46158 -25683 32193 7898 -14477 16050 22624 21313 2497 -37235
20991c7235L4461K1932j4370P376o9381k5217L2313k077k0972Q519J4689M3210
$$ -37235 -2774 19158 4788 12164 -57217 -82434 -50121 -52198 -73170 -64651 -49962 -6752
20979f752K3354J446r700j2461j1526n5258k2771J933L0752P635j4447m1805k6416
$$ -6752 16602 18048 8348 -4113 -15639 -70897 -93668 -91735 -60983 -53348 -67795 -109600 -136016
20966a36016J4840L5321N3805j099j8694L7996L3353q665L499J7601n8270m9414
$$ -136016 -121176 -85855 -32050 -33149 -51843 -13847 19506 10841 14340 31941 -26329 -75743
20954g5743p49J0319j0639L3790Q219K0322j9946l9032J7568O6036L458J8825
$$ -75743 -76492 -66173 -76812 -43022 -34803 -14481 -34427 -73459 -55891 10145 13603 32428
20942C2428J6927j2683o1250k3436Q651j4587K2890O3496J6736k8552N69j7689
$$ 32428 49355 36672 -24578 -48014 -39363 -53950 -31060 32436 49172 20620 21189 3500
20930C500J2457N2017l2204k0105n0906m9228R075L7122J3063k3007n65P174L2702
$$ 3500 15957 67974 35770 15665 -35241 -84469 -75394 -38272 -25209 -48216 -48781 -41607 -8905
20917h905J1556o0018j6602K6718m240Q66P1771P2609O191j2833k6526k9013k6467
$$ -8905 2651 -57367 -73969 -47251 -51491 -50625 21146 93755 99946 87113 60587 31574 5107
20904E107N195l0070j8507J4411M252J4334m622l0000l3524L9294M5449K1053
$$ 5107 10302 -19768 -38275 -23864 -19612 -5278 -9900 -39900 -73424 -34130 11319 32372
20892C2372j0625J4832j6195l9262p258n909k515J3865J8831L0125o0780m9488
$$ 32372 21747 36579 20384 -18878 -26136 -32045 -34560 -20695 -1864 28261 -32519 -82007
20880h2007K6907L7113K4894r346L286r066n681J2678J0290R288q488j5396M541
$$ -82007 -55100 -17987 6907 -2439 847 -8219 -13900 -1222 9068 18356 9868 -5528 -987
20867i87Q079J8614p322k5928K5371O0089K5311o432k2426k1965k3393l8642L2950
$$ -987 7092 25706 18384 -7544 17827 77916 103227 96795 74369 52404 29011 -9631 23319
20854B3319J293k5110m6691M0845q558j2421L8588l4528j0650k5227K319N991
$$ 23319 24612 -498 -47189 -6344 -14902 -27323 11265 -23263 -33913 -59140 -56821 -50830
20842e0830k1684o900k3884m033Q6937O5524o020J8132k2603M618Q654J3011q204
$$ -50830 -72514 -79414 -103298 -107331 -20394 45130 39110 57242 34639 39257 47911 60922 52718
20829E2718k3077l8727r955l6613j0996J3642L105P739L331L6004P126l4170l9008
$$ 52718 29641 -9086 -19041 -55654 -66650 -53008 -49903 -42164 -38833 -2829 4297 -29873 -68881
20816f8881N8768N3738Q720j7617o6700O7266J8803k8043k9910p8918k1103L7598
$$ -68881 -10113 43625 52345 34728 -31972 35294 54097 26054 -3856 -82774 -103877 -66279
20804f6279N7840J0894j4536L8289m7288j2331M9835L2866l3228q808l815J2730
$$ -66279 -8439 2455 -12081 26208 -21080 -33411 16424 49290 16062 7254 3439 16169
20792A6169K5967j5862k9551n063J6619k7195o5898l8135L7883P3457r923j1509
$$ 16169 42136 26274 -3277 -8340 8279 -18916 -84814 -122949 -85066 -11609 -21532 -33041
20780c3041j7559J5013L944J1894N3161k214l8106j1094k9832k8067J2106j0159
$$ -33041 -50600 -35587 -31643 -19749 33412 31198 -6908 -18002 -47834 -75901 -63795 -73954
20768g3954J4741O2285L8070k1459l8741j9788J1092J2616k6519m8630j6517K2821
$$ -73954 -59213 3072 41142 19683 -19058 -38846 -27754 -15138 -41657 -90287 -106804 -83983
20756h3983j774J3847M0295J7680l7645k212L7212n405L193L3167j0394J3943
$$ -83983 -85757 -71910 -31615 -13935 -51580 -53792 -16580 -21985 -18792 14375 3981 17924
20744A7924M3171K7937l2793Q676j7139M760m1970k2667l7269m479j8174m0874
$$ 17924 61095 89032 56239 64915 47776 52536 10566 -12101 -49370 -53849 -72023 -112897
20732a12897L9413J1384p897j0227j6877K3656N467R147M0462m5256R802M341
$$ -112897 -73484 -62100 -69997 -80224 -97101 -73445 -67978 -58831 -18369 -63625 -53823 -49482
20720d9482L7920Q954P25l4928R668K5307K2818k6736n3258J6046N484P14r578
$$ -49482 -11562 -2608 -1883 -36811 -27143 -1836 20982 -5754 -59012 -42966 -37482 -36768 -46346
20707d6346J6769J3184K2183K8899n2660n6516j1396M5483j6591K375n40M4466
$$ -46346 -29577 -16393 5790 34689 -17971 -74487 -85883 -40400 -56991 -54616 -55156 -10690
20695a0690J0841K5725j0507m6728k8079L793n978r245K4324J9892J1668J9974
$$ -10690 151 25876 15369 -31359 -59438 -55645 -61623 -70868 -46544 -26652 -14984 4990
20683D990M0508r409j5284j1522L448K9797l6653q7369k1589M3716L7209j1899
$$ 4990 45498 36089 20805 9283 12731 42528 5875 -81494 -103083 -59367 -22158 -34057
20671c4057j0437J1184J6645P466L30J1865K4821j2009k7405q779k361m1475j5244
$$ -34057 -44494 -33310 -16665 -9199 -8869 2996 27817 15808 -11597 -20376 -22737 -64212 -79456
20658g9456p068r079m693O3242N4471l4722q4495J5962N620o329K8437L4067j4763
$$ -79456 -86524 -95603 -100296 -37054 17417 -17305 -101800 -85838 -80218 -86547 -58110 -24043 -38806
20645c8806K127O4136J5836m893k2781p7357M392L5938J0261J4507l784q202o1418
$$ -38806 -36679 27457 43293 38400 15619 -61738 -57346 -21408 -11147 3360 -424 -8626 -70044
20632g0044n6443K1928J8273N120K660J0701r474N4682j8346q5378j8139K0998
$$ -70044 -126487 -104559 -86286 -81166 -78506 -67805 -77279 -22597 -40943 -126321 -144460 -123462
20620a23462k801j1488N6154L6170j3843j7896N7495n179k0434k8339J7261M3522
$$ -123462 -126263 -137751 -81597 -45427 -59270 -77166 -19671 -24850 -45284 -73623 -56362 -12840
20608a2840K8197J3032m1346l087j4484m877L1554K4439K9301L0107l2583l4230
$$ -12840 15357 28389 -12957 -16044 -30528 -35405 -3851 20588 49889 79996 47413 13183
20596A3183m020J4167l5657K757K7370N4283j3853o2211m896j2177l507o875O476
$$ 13183 9163 23330 -12327 -9570 17800 72083 58230 -3981 -8877 -21054 -24561 -31436 -24960
20583b4960l709j7328J5633M5943n7585m1470K9429K7097M6396k2370k5289K7519
$$ -24960 -28669 -45997 -30364 15579 -42006 -83476 -54047 -26950 19446 -2924 -28213 -694
20571f94L1522R16j1344r370j7500o7303M4570J2181R0L9117k5052Q643K4766
$$ -694 30828 31744 20400 11030 -6470 -73773 -29203 -17022 -16932 22185 -2867 5776 30542
20558C0542L103J4285J8497K7165l1485n7621p3977l1689N0368L3981K3122Q041
$$ 30542 33645 47930 66427 93592 62107 4486 -69491 -101180 -50812 -16831 6291 14332
20546A4332j3170k4006J8159J7529j7770J9921k3035L7374l3255n1674l6174K8390
$$ 14332 1162 -22844 -4685 12844 -4926 14995 -8040 29334 -3921 -55595 -91769 -63379
20534f3379O0580k0844k4097m5373k7874P010N3057P2925K7921m313L5086k2963
$$ -63379 -2799 -23643 -47740 -93113 -120987 -113977 -60920 12005 39926 35613 70699 47736
20522D7736m1996o7922m6940K609j1628P3929P7092J062m3551r789L0498K7851
$$ 47736 5740 -62182 -109122 -106513 -118141 -44212 32880 33942 -9609 -19398 11100 38951
20510C8951K2986p263k7313k5683k4198n9082N9416M6345K1891o1337n6777l7137
$$ 38951 61937 54674 27361 1678 -22520 -81602 -22186 24159 46050 -15287 -72064 -109201
20498a09201k358O5371J5616K179R97m1088l7924J3117K3236P872l5167N0216
$$ -109201 -111559 -46188 -30572 -28393 -27396 -68484 -106408 -93291 -70055 -62183 -97350 -47134
20486d7134N6689m562m1542k0115L0144K6294q091L4977n142o3848j1919L9804
$$ -47134 9555 4993 -36549 -56664 -26520 -226 -8317 26660 21518 -42330 -54249 -14445
20474a4445J8624j7293K300L651l1474k4433J2761L515J6414N7230j0156J5634
$$ -14445 4179 -13114 -10814 -7163 -38637 -63070 -50309 -46794 -30380 26850 16694 32328
20462C2328k308p0416L3734M5053L0605l3395m629k5756J453K613J4128K1379
$$ 32328 30020 -40396 -6662 38391 68996 35601 30972 5216 6669 9282 23410 44789
20450D4789r049k2808l3381L0316K2413L1805j0064k9145j1733q8460o7207N3659
$$ 44789 35740 12932 -20449 9867 32280 64085 54021 24876 13143 -75317 -142524 -88865
20438h8865O1807m744R721N1966M240L729m0852o0504l9615L1900K1424j4357
$$ -88865 -27058 -31802 -22081 29885 34125 37854 -2998 -63502 -103117 -71217 -49793 -64150
20426f4150P946j8473o561k9898j0181P1814K3246l557J3632k7067R117o886L8000
$$ -64150 -56204 -74677 -81238 -111136 -121317 -49503 -26257 -29814 -16182 -43249 -34132 -41018 -3018
20413c018K7648j7775k0634L2933K8202l7924l1858o783K1198k349j1825K8040
$$ -3018 24630 6855 -13779 19154 47356 9432 -22426 -29209 -8011 -10360 -22185 5855
20401E855L6103J7915l2977j7521o2641l0853j6861L197L2582L4044K2108O3615
$$ 5855 41958 59873 26896 9375 -53266 -84119 -100980 -97783 -65201 -31157 -9049 54566
20389E4566L2507o2526m8703O082l1784j1345K5653L6475M4862j2140j874k784
$$ 54566 87073 24547 -24156 -18074 -49858 -61203 -35550 925 45787 33647 31773 28989
20377B8989o1806P699K7021N891P043J6732j8261j3117N312p168k715j2237Q519
$$ 28989 -32817 -25118 1903 7794 14837 31569 13308 191 5503 -1665 -4380 -16617 -8098
20364h098r006K8426J2937m9910j1015m7256J3438R707J8705M8820J2898K4401
$$ -8098 -17104 11322 24259 -25651 -36666 -83922 -70484 -60777 -42072 6748 19646 44047
20352D4047p962P674Q93K053j0151n155m6321L7940Q226k8259J993M981k9937
$$ 44047 36085 43759 44652 46705 36554 31399 -14922 23018 31244 2985 4978 9959 -19978
20339a9978j7659n6878M1793M1725n003k6972K7085L3253L6130J8256j7719n426
$$ -19978 -37637 -94515 -52722 -10997 -16000 -42972 -15887 17366 53496 71752 54033 48607
20327D8607j5279j8416L845J2421m086n1704p751K5915L5197L2540l8185n6359
$$ 48607 33328 14912 18757 31178 27092 -24612 -32363 -6448 28749 61289 23104 -33255
20315c3255m1698K6502J0458q290M2427J5392k3481j8461J6063Q7010M1369j9890
$$ -33255 -74953 -48451 -37993 -46283 -3856 11536 -11945 -30406 -14343 72667 114036 94146
20303I4146j5446l3268m6598n3481j1859J5168M7328K8611l7718l5797K9939J6928
$$ 94146 78700 45432 -1166 -54647 -66506 -51338 -4010 24601 -13117 -48914 -18975 -2047
20291b047j1680K2506L492k6725m7162k36K0329K2539j6073j5740N3258J7378
$$ -2047 -13727 8779 12271 -14454 -61616 -61852 -41523 -18984 -35057 -50797 2461 19839
20279A9839k7373L068n1787m6543L6172N3111K3998j8865R44k0247l403j0290
$$ 19839 -7534 -4466 -56253 -102796 -66624 -13513 10485 -8380 -7436 -27683 -31086 -41376
20267d1376j1620L6j1342j2855o456l045M0985O2361P194J8826k4209o5708p1257
$$ -41376 -52996 -52960 -64302 -77157 -83613 -86658 -45673 16688 23882 42708 18499 -47209 -118466
20254a18466J2650L5382K9457j8047J3020M3852j9399l1222k7417j7190l763J3367
$$ -118466 -105816 -70434 -40977 -59024 -46004 -2152 -21551 -52773 -80190 -97380 -101143 -87776
20242h7776M0244M7216J10k6117k0230K5611M062j9066j1954Q540K1463K3095
$$ -87776 -47532 -316 -206 -26323 -46553 -20942 -16880 -35946 -47900 -39360 -17897 5198
20230E198k427j1049l6489R137J1352j8575r417m637J907M2862N46q363J0395
$$ 5198 2771 -8278 -44767 -35630 -24278 -42853 -52270 -56907 -55000 -12138 -11592 -19955 -9560
20217i560O7627J2937l0385j3189l7591l8293J6567K7541m812n1741K2381P010
$$ -9560 58067 71004 40619 27430 -10161 -48454 -31887 -4346 -9158 -60899 -38518 -31508
20205c1508M033K5928K3683K4942J8202k9903n5967L546K3661p31o014k3503J795
$$ -31508 -27475 -1547 22136 47078 65280 35377 -20590 -17044 6617 5886 -128 -23631 -21836
20192b1836l6634p399K2821r843m6274k1907O2271J31881L0916k2648R563q9164
$$ -21836 -58470 -65869 -43048 -52891 -99165 -121072 -58801 73080 103996 81348 90911 1747
20180A747l2427j0743L4735K0579j7067K2796K8877N063K0885j1214q387k8815
$$ 1747 -30680 -41423 -6688 13891 -3176 19620 48497 53560 74445 63231 54844 26029
20168B6029j9031l6007l3403L5176M7252K3375j1067o5314k7802M8427Q537m6500
$$ 26029 6998 -29009 -62412 -27236 20016 43391 32324 -32990 -60792 -12365 -3828 -50328
20156e0328R365M9402k0328J6072L028j1794O0397L4291k3598l9697j9077K0747
$$ -50328 -40963 8439 -11889 4183 7211 -4583 55814 90105 66507 26810 7733 28480
20144B8480j129n971l758L1232K9811O575m4777k7218J1417L8440l1018q095J9727
$$ 28480 27351 21380 17622 48854 78665 85240 40463 13245 24662 63102 32084 23989 43716
20131D3716L2355k5759k2379M1559j0667p5338k4082P0172K1139n0629P189J021
$$ 43716 76071 50312 27933 69492 58825 -16513 -40595 29577 50716 87 7276 8297
20119H297j65K5299J9093K975J549m7959M927k569j2669J6427Q996K777Q193J1526
$$ 8297 8132 33431 52524 55499 57048 9089 14016 11447 -1222 15205 24201 26978 35171 46697
20105D6697o7848J2728j6015L2214L0426j3791Q18p174L201o5464m3561j903J4045
$$ 46697 -21151 -8423 -24438 7776 38202 24411 25229 18055 21256 -44208 -87769 -89672 -75627
20092g5627J7594K0703J1710k9699K3750N69k7405N597K6915o2814p785N3867
$$ -75627 -58033 -37330 -25620 -55319 -31569 -31000 -58405 -52808 -25893 -88707 -96492 -42625
20080d2625P391J1392K5575J4253m839j9800m1496M390J7886J5381J7019L5319
$$ -42625 -35234 -23842 1733 15986 11147 -8653 -50149 -45759 -27873 -12492 4527 39846
20068C9846M274k3876o3076j3789M6181K1378p625J1253M1221N107j7057j5237
$$ 39846 44120 20244 -42832 -56621 -10440 10938 3313 14566 55787 60894 43837 28600
20056B8600P099K5073m1036K5773K118k5874k2930n7322k5411q159L7074M3859
$$ 28600 35699 60772 19736 45509 47627 21753 -1177 -58499 -83910 -92069 -54995 -11136
20044a1136K8030j7249j45J4138r040J0911J4770k4450j0817J4607L8816p9055
$$ -11136 16894 -355 -500 13638 4598 15509 30279 5829 -4988 9619 48435 -30620
20032c0620J2891O8606k7833j4137M8639J4234K357o4395j9668L2666J1606n3034
$$ -30620 -17729 50877 23044 8907 57546 71780 74137 9742 -9926 22740 34346 -18688
20020a8688q44L3819o795j7544m417K1057m7194l1623L4490N0653l4586K9168
$$ -18688 -19532 14287 7492 -10052 -14469 6588 -40606 -72229 -37739 12914 -21672 7496
20008G496L0050j4266l3604l224K004n206k8295k2920N71J8269J100K9631L0644
$$ 7496 37546 23280 -10324 -13548 -11544 -16750 -45045 -67965 -67394 -49125 -48025 -18394 12250
19995A2250Q053j4906Q2824m6574k5793J3966N7962J0540n1891l9345j1049j8495
$$ 12250 20303 5397 88221 41647 15854 29820 87782 98322 46431 7086 -3963 -22458
19983b2458j0487K1111M5071L192J5574k5972j1633p404n0178j2295L7594J8479
$$ -22458 -32945 -11834 33237 36429 52003 26031 14398 6994 -43184 -55479 -17885 594
19971E94M1745L0459K2941k3431j1234K0734r297j418k3326j7641m639k0561K5348
$$ 594 42339 72798 95739 72308 61074 81808 72511 71093 47767 30126 25487 4926 30274
19958C0274K3882k4086K4336k6353Q140O756M595o1467J0691K6197o040J8619
$$ 30274 54156 30070 54406 28053 36193 42949 47544 -13923 -3232 22965 16925 35544
19946C5544k4882J5416K4561j3724P004K7807K1937l5515J626J5876k2092n5934
$$ 35544 10662 26078 50639 36915 43919 71726 93663 58148 59774 75650 53558 -2376
19934b376R729L4658n440M792j1860n63J8947L0997k9075j0056m1059l6797J5876
$$ -2376 7353 42011 36571 41363 29503 28940 47887 78884 49809 39753 -1306 -38103 -22227
19921b2227M8471l0616j8731K1586M3849L376M574O572j3440j0079j0160k4011
$$ -22227 26244 -4372 -23103 -1517 42332 45708 50282 56854 43414 33335 23175 -836
19909h36L9010J4143m1745q752M699K106j0473J9472k4248K6863Q42l6274J3612
$$ -836 38174 52317 10572 1820 6519 8625 -1848 17624 -6624 20239 21081 -15193 -1581
19896a581j3088J4762J5080m6935J9557K0790k0410J2175j7493P784L2381O624
$$ -1581 -14669 93 15173 -31762 -12205 8585 -11825 350 -17143 -9359 23022 29646
19884B9646O90R792n6574p026m9491o891N9544J3020J3055k3384k1804R676K5568
$$ 29646 30336 40128 -16446 -23472 -72963 -79854 -20310 -7290 5765 -17619 -39423 -29747 -4179
19871d179L0161K4493j7333o43L151J3974l815P996j0740K4553N227j3133o892
$$ -4179 25982 50475 33142 32499 35650 49624 45809 53805 43065 67618 72845 59712 52820
19858E2820n844J4886J1996m0896J7757r447o927j6412q106n812j5317O0847M9905
$$ 52820 46976 61862 73858 32962 50719 41272 34345 17933 9827 4015 -11302 49545 99450
19845I9450j6084k0827q264K9149L3926k808J7103M575K7523Q430N883n29O487
$$ 99450 83366 62539 54275 83424 117350 114542 131645 136220 163743 172173 178056 177527 184014
19832A84014L1110M291l0328J4088O028M1786L1980N2878J4159n3443P204J27172
$$ 184014 215124 219415 189087 203175 209203 250989 282969 335847 350006 296563 303767 430939
19820D30939J49854J46666J47112R4026J62690K42419R0714j40131k33200j46027
$$ 430939 580793 727459 874571 968597 1131287 1373706 1464420 1324289 1091089 945062
19810I45062j2148P7743N6446J9703L5572J20371J64975R0297q2521j55609j06592
$$ 945062 932914 1010657 1067103 1086806 1122378 1242749 1407724 1498021 1415500 1259891 1153299
19799A153299l0778r386n9037j43075j77983j27157j48343m4935J3719j2751m7176
$$ 1153299 1122521 1113135 1054098 911023 733040 605883 457540 412605 426324 413573 366397
19788C66397L9396M950n1096l8468K1736L6478j3653n3382m094J1071N4058O0972
$$ 366397 405793 410743 359647 321179 342915 379393 365740 312358 308264 319335 373393 434365
19776D34365M6113L5073N2795O7768L1778k1714l2915l4386K374N3881J44632
$$ 434365 480478 515551 568346 636114 667892 646178 613263 578877 581251 635132 779764
19765G79764J12743J19049J11640K09386L10374J83839p2055j66818j11357k2101
$$ 779764 892507 1011556 1123196 1332582 1642956 1826795 1754740 1587922 1476565 1454464
19755A454464L942j30163j33478j14253k0144P5902j1094q8817j48956j49702
$$ 1454464 1458406 1328243 1194765 1080512 1060368 1136270 1125176 1036359 887403 737701
19745G37701j02390n9579m5385k9505j16049n4067n0724k7597j6231P278k25k3826
$$ 737701 635311 575732 530347 500842 384793 330726 280002 252405 236174 243452 243227 219401
19733B19401K9776j226n0288p9387j1156J808m736P338j9313m655R73j0778l8389
$$ 219401 249177 247951 197663 118276 107120 108928 104192 111530 92217 87562 88535 77757 39368
19720C9368L4924L5688l574r654j6076l2040m9744N4345M5554k9348k7990J2258
$$ 39368 74292 109980 106406 96752 80676 48636 -1108 53237 98791 69443 41453 53711
19708E3711N034J7127l4446m1217j0027m041j235N0867J4329P082K9340O2294
$$ 53711 58745 75872 41426 209 -9818 -13859 -15094 35773 50102 57184 86524 148818
19696A48818M5464j0411k437k2395K1934n8360l2589j7709L958K3972J5762K5641
$$ 148818 194282 183871 181434 159039 180973 122613 90024 72315 76273 100245 116007 141648
19684A41648l3844J0625L0264p110j4785k9161k2431Q752J6420N080j6115k4223
$$ 141648 107804 118429 148693 141583 126798 97637 75206 83958 100378 105458 89343 65120
19672F5120j9474K5437M0795J1021k7769l4806j7021k2263J965L2280J0482k3286
$$ 65120 45646 71083 111878 122899 95130 60324 43303 21040 23005 55285 65767 42481
19660D2481L491M4151L6903J0314k3278j8641L9377L6857J7869k5746k8476n8618
$$ 42481 45972 90123 127026 137340 114062 95421 134798 171655 189524 163778 135302 76684
19648G6684k4323O300n797M6451Q0641p507M7810L9278p221m6233o8474J4549
$$ 76684 52361 58661 52864 99315 179956 172449 220259 259537 252316 206083 137609 152158
19636A52158k1811R977O76l9517K0522L7172M207j2217J32K5652j8538j0024k8160
$$ 152158 130347 140324 141000 101483 122005 159177 163384 151167 151299 176951 158413 148389 120229
19623A20229J6892L4077M1830K8668O24J2588L804j5753m429l9827k2214j2184
$$ 120229 137121 171198 213028 241696 242320 254908 258712 242959 238530 198703 176489 164305
19611A64305M5415N4030L8394l1680K0648M5079K7676O5572K4537N8937P5899
$$ 164305 209720 263750 302144 270464 291112 336191 363867 429439 453976 512913 588812
19600E88812M7361P5916J23142P3105J06699J27733J04481Q8173M7206N8556P4720
$$ 588812 636173 712089 835231 908336 1015035 1142768 1247249 1335422 1382628 1441184 1515904
19589A515904L4983P6672R8686K03245K53305J64121J0721j15001j67763k15655
$$ 1515904 1550887 1627559 1726245 1929490 2182795 2346916 2357637 2242636 2074873 1859218
19579A859218k10761j91189j11046n6504j4613p857j6103n1177j03081j74424
$$ 1859218 1648457 1457268 1346222 1289718 1275105 1267248 1251145 1199968 1096887 922463
19569I22463j14708r5348r6958k4619O786k7155k6629k7597L7823K3103J7916
$$ 922463 807755 712407 615449 590830 597616 570461 543832 516235 554058 577161 595077
19558E95077O3416N0183j3388K3117P1797N1215N4912N6551M0815N0463Q8918
$$ 595077 658493 708676 695288 718405 790202 841417 896329 952880 993695 1044158 1133076
19547A133076P7978P3252J07499J05832J22909J69968J87181J33571J41762J21639
$$ 1133076 1211054 1284306 1391805 1497637 1620546 1790514 1977695 2111266 2253028 2374667
19537B374667J64451P0364L3794l5068q0019q9554p963J44001R4295r9051k58634
$$ 2374667 2539118 2609482 2643276 2608208 2528189 2438635 2430672 2574673 2668968 2569917 2311283
19526B311283k47953k51368k49067k10340j57167j00562p1475q6668q4052k7792
$$ 2311283 2063330 1811962 1562895 1352555 1195388 1094826 1023351 936683 852631 824839
19516H24839K8182l8113l9095q4642j07996m4981L8972P4669k0869l8221K8781
$$ 824839 853021 814908 775813 691171 583175 538194 577166 651835 630966 592745 621526
19505F21526J2451J1525L8126q304j6369p335m8545n5878M3978k8365p699J4170
$$ 621526 633977 645502 683628 675324 658955 651620 603075 547197 591175 562810 555111 569281
19493E69281L7082N3119K9495K6591L2180K5638P9624P0827J33704M9639M5605
$$ 569281 606363 659482 688977 715568 747748 773386 853010 923837 1057541 1107180 1152785
19482A152785J05384K23130K27964J89645P5280R6856L04372M77868M04085J64882
$$ 1152785 1258169 1481299 1709263 1898908 1974188 2071044 2375416 2853284 3257369 3422251
19472C422251L24512Q24828Q02394J21872o56206o31973k40400j51426l65944
$$ 3422251 3746763 4571591 5373985 5495857 4839651 4207678 3967278 3815852 3449908
19463C449908m89002l37275k37129j32134N8892J91250L3837k24307l63318l48018
$$ 3449908 2960906 2623631 2386502 2254368 2313260 2504510 2538347 2314040 1950722 1602704
19453A602704k79196j70855j00065n3429m8315r7148m6267K871J0971k1020j236
$$ 1602704 1323508 1152653 1052588 999159 950844 853696 807429 810300 821271 800251 799015
19442G99015J9406K2549j8725N3902O831J0528N6820J08936J43635K49750K68184
$$ 799015 818421 840970 822245 876147 882978 893506 950326 1059262 1202897 1452647 1720831
19431A720831J51217L7296K21106M27691L19898P7826p7693M4711K06720K24178
$$ 1720831 1872048 1909344 2130450 2558141 2878039 2955865 2878172 2922883 3129603 3353781
19421C353781L51031P76077R50682M90852l2293n2671L21926J00542o87909j158052
$$ 3353781 3704812 4480889 5431571 5922423 5890130 5837459 6159385 6259927 5572018 4413966
19411D413966r69504o16341l93569k74660o5030K7113j717j48085k80082k31566
$$ 4413966 3444462 2828121 2434552 2159892 2094862 2121975 2120258 1972173 1692091 1460525
19401A460525j61612j21606j31355j18061j7293N819j08804r4917p007L3158M3020
$$ 1460525 1298913 1177307 1045952 927891 910598 916417 807613 712696 705689 738847 781867
19390G81867k7607J8714K0793m672N8724j4990k9921j1073O197k6541m7174L3836
$$ 781867 754260 772974 793767 789095 847819 832829 802908 791835 798032 771491 724317 758153
19378G58153K7033o5868q634O3580L727K5407m5044p465L5612P4573L5451n0568
$$ 758153 785186 719318 710684 774264 777991 803398 758354 750889 786501 861074 896525 845957
19366H45957M055K854M287L3892J6596K2763M2217Q879k8061J1453P4285K8476
$$ 845957 850012 852866 857153 891045 907641 930404 972621 981500 953439 964892 1039177 1067653
19354A067653M3287M9192J8836O6197M1545P2295Q1331L1639K3955J6703M2155
$$ 1067653 1110940 1160132 1178968 1245165 1286710 1359005 1440336 1471975 1495930 1512633 1554788
19343A554788R1023J07147J14011J18137J33719J35391R6007J57123K83159L15865
$$ 1554788 1645811 1752958 1866969 1985106 2118825 2254216 2350223 2507346 2790505 3106370
19333C106370L16682K82346L38674L98320M33454M64175M37618N15763O41436
$$ 3106370 3423052 3705398 4044072 4442392 4875846 5340021 5777639 6293402 6934838
19324F934838O69913P37615Q69033J076184J044731R34216Q98968J068285J169133
$$ 6934838 7604751 8342366 9211399 10287583 11332314 12266530 13165498 14233783 15402916
19315A5402916J254623J359903J546951J690500J977055K430169K880539L457752
$$ 15402916 16657539 18017442 19564393 21254893 23231948 25662117 28542656 32000408
19307C2000408M391127N682464O081419M744835M581508P526783J1232303J1675422
$$ 32000408 36391535 42073999 48155418 52900253 57481761 65008544 76240847 87916269
19299H7916269J0447610J4052341K1084884J9065391J0807788J6918784L9212422
$$ 87916269 98363879 112416220 133501104 152566495 163374283 180293067 219505489
19292B19505489M6458952J5039785k7137564l6882370j6446550m555918j1417063
$$ 219505489 265964441 281004226 253866662 216984292 200537742 195981824 184564761
19285A84564761k1144735k1077614j6090144p614076L995797Q672757n30901j5351554
$$ 184564761 163420026 142342412 126252268 118638192 122633989 131306746 130775845 115424291
19277A15424291k1604849j7056822j1361615p461139m851172l077220j876976
$$ 115424291 93819442 76762620 65401005 57939866 53088694 50011474 48134498
19270D8134498j205319p24514n09593l76643q1816K07211M97526Q27032J058273
$$ 48134498 46929179 46204665 45695072 45318429 45236613 45443824 45941350 46768382 47826655
19261D7826655J571498K603704L927744N549690Q206120J2389923J4404774J0363372
$$ 47826655 49398153 52001857 55929601 61479291 69685411 82075334 96480108 106843480
19253A06843480O652163J1861468K1266951K0150156N841639o343841n24835J3544836
$$ 106843480 113495643 125357111 146624062 166774218 172615857 166272016 165747181 179292017
19245A79292017J8522486K1949165L9708953N6735260M3492647J0992177j079717
$$ 179292017 197814503 219763668 259472621 316207881 359700528 370692705 369612988
19238C69612988J2957860J0084370k9821271o6545355o7256840m7942324k8908804
$$ 369612988 382570848 392655218 362833947 296288592 229031752 181089428 152180624
19231A52180624j2560935k371896l815274j2240982j7573880j5537357j1958037
$$ 152180624 139619689 137247793 133432519 121191537 103617657 88080300 76122263
19224G6122263r229815p087197n880840n311388m968399m434411l784824l339929
$$ 76122263 66892448 59805251 53924411 48613023 43644624 39210213 35425389 32085460
19216C2085460k982590k498892j934177j569279j626170j593712j487876j434305
$$ 32085460 29102870 26603978 24669801 23100522 21474352 19880640 18392764 16958459
19208A6958459j488165j539530j387896j196658j027623p88193o25746n29702
$$ 16958459 15470294 13930764 12542868 11346210 10318587 9530394 8904648 8374946
19200H374946n86220o56084n99961m55011m13246m32244l84059l00528k63611
$$ 8374946 7788726 7132642 6532681 6077670 5664424 5232180 4848121 4547593 4283982
19191D283982k59525k33439k63981j37010q1534j31622j27013j08171j57786j83365
$$ 4283982 4024457 3791018 3527037 3390027 3308493 3176871 3049858 2941687 2783901 2600536
19181B600536j18714o7309q0669r2487j25419j37387r8183q871n9494j09819l0003
$$ 2600536 2481822 2414513 2333844 2241357 2115938 1978551 1880368 1871497 1812003 1702184 1672181
19170A672181k574n876L0243O959j2130J4865k1003j05651q8881l5527l0292k8231
$$ 1672181 1669607 1663731 1693974 1700933 1688803 1703668 1682665 1577014 1488133 1452606 1422314 1394083
19158A394083Q318J3399N0613o36N225J9642j3760O6546N9101j5416o8156l2147
$$ 1394083 1402401 1415800 1466413 1465777 1471002 1490644 1476884 1543430 1602531 1587115 1518959 1486812
19146A486812L9338O3217P5256N8402r326N8316l1115q9635M248J4406J1243n999
$$ 1486812 1526150 1589367 1664623 1723025 1713699 1772015 1740900 1651265 1655513 1669919 1681162 1675163
19134A675163N6076K3182P179K7158l7067k9960r024J3422l2676N8702M4735N2807
$$ 1675163 1731239 1754421 1761600 1788758 1751691 1721731 1712707 1726129 1693453 1752155 1796890 1849697
19122A849697k7967j7960K598l8404M928R0839P7448P3737J20405P5897j1217
$$ 1849697 1821730 1803770 1806368 1767964 1772892 1863731 1941179 2014916 2135321 2211218 2200001
19111B200001o7174p7184k8283O0950Q6030J39509P0682J31801K51896K20997
$$ 2200001 2132827 2055643 2027360 2088310 2174340 2313849 2384531 2516332 2768228 2989225
19101B989225K17194K06103K36562K27330K59122K87719L86354M44659M09313
$$ 2989225 3206419 3412522 3649084 3876414 4135536 4423255 4809609 5254268 5663581
19092E663581M65294N46008O60348O95973P19043Q77747J008328J122663J190821
$$ 5663581 6128875 6674883 7335231 8031204 8750247 9627994 10636322 11758985 12949806
19083A2949806J324316J488932J514438J653821J878115J934555K080852K217526
$$ 12949806 14274122 15763054 17277492 18931313 20809428 22743983 24824835 27042361
19075B7042361K312413K598256K859406L213825L783182M693570O189213P462409
$$ 27042361 29354774 31953030 34812436 38026261 41809443 46503013 52692226 60154635
19067F0154635P614437P950302J0168245J2838623J4915060J8028752K3290102
$$ 60154635 67769072 75719374 85887619 98726242 113641302 131670054 154960156
19060A54960156K5433966K1317285K1710770L2518964L7375833K8589973J6825083
$$ 154960156 180394122 201711407 223422177 255941141 293316974 321906947 338732030
19053C38732030P089063n999307k7098260m0907800l6794171k7802816k5964619
$$ 338732030 345821093 339821786 312723526 271815726 235021555 207218739 181254120
19046A81254120k3020449j3451460l929802J001744K27287l430265p564109j1461526
$$ 181254120 158233671 144782211 140852409 141854153 142081440 138651175 131087066 119625540
19038A19625540j6268623j7777763j3568461r105388o084132m144421k967532
$$ 119625540 103356917 85579154 72010693 62905305 56821173 52676752 49709220
19031D9709220k243745j923919j549276j334281j118685p37741l03357J53329
$$ 49709220 47465475 45541556 43992280 42657999 41539314 40801573 40498216 40651545
19023D0651545M77983Q84502J587632K539702M321184O327277O728782O224687
$$ 40651545 41129528 42014030 43601662 46141364 50462548 56789825 63518607 69743294
19015F9743294P771816R930345J0250462R469048R364480Q236677M186967J943443
$$ 69743294 77515110 87445455 97695917 107164965 116529445 124766122 128953089 130896532
19007A30896532Q847592J7386134J7309671J2572510J1395414J1233424M143722
$$ 130896532 139744124 157130258 174439929 187012439 198407853 209641277 213784999
19000B13784999n911918j0126462j2871745j9226016k8293376k7578189j7839575
$$ 213784999 207873081 197746619 184874874 165648858 137355482 109777293 91937718
18993I1937718r846582n955720m834030m801043n094270o305505p137781o046403
$$ 91937718 82091136 76135416 71301386 66500343 61406073 55100568 47962787 41916384
18985D1916384m602863l643615l104980k934121k656782k321580k022772j765134
$$ 41916384 37313521 33669906 30564926 27630805 24974023 22652443 20629671 18864537
18977A8864537j572751j416115j293731j199311j048884r44874q12036p07276
$$ 18864537 17291786 15875671 14581940 13382629 12333745 11388871 10576835 9869559
18969I869559o10200m65337l84199m53264m05820k75882k51401j67995k4809P3480
$$ 9869559 9259359 8794022 8409823 7956559 7550739 7274857 7023456 6855461 6830652 6904132
18959F904132J31587K45269K89096P33297J370153J369344N14884Q5281J050870
$$ 6904132 7035719 7280988 7570084 8303381 9673534 11042878 11557762 11643043 12693913
18950A2693913K011074J023464j068983k063936j467907j096512j002648n07138
$$ 12693913 14704987 15728451 14659468 12595532 11127625 10031113 9028465 8521327
18942H521327L6229l1599n88020r80630p99516n55932m28564l15006j32316K0750
$$ 8521327 8557556 8525957 7937937 6957307 6157791 5601859 5173295 4858289 4725973 4746723
18932D746723m9878k00623k99684l10304k78561k26738k50748k16337j94557j32585
$$ 4746723 4696845 4496222 4196538 3886234 3607673 3380935 3130187 2913850 2719293 2586708
18922B586708r2159p8550m9255k6473j02081j37995j05459j14395q2259q0124
$$ 2586708 2494549 2415999 2366744 2340271 2238190 2100195 1994736 1880341 1798082 1717958
18912A717958p7437n7329m6447q7491r832O092k2684K900j5837K6639M8247l7842
$$ 1717958 1640521 1583192 1536745 1449254 1439422 1445514 1422830 1425730 1409893 1436532 1484779 1446937
18900A446937l3832J9221M092o456L959K7179P246K1988l8603n4558L7675J14266
$$ 1446937 1413105 1432326 1436418 1429962 1433921 1461100 1468346 1490334 1451731 1397173 1434848 1549114
18888A549114J9766j9004k4619O1908K4333M3501Q7945L5334j6330p13N2660M684
$$ 1549114 1568880 1549876 1525257 1587165 1611498 1654999 1742944 1778278 1761948 1761235 1813895 1818579
18876A818579j08217j74494j12951j43587j07240J3377L9755n2955q2028m2354
$$ 1818579 1710362 1535868 1422917 1279330 1172090 1185467 1225222 1172267 1090239 1047885
18866A047885l2522r2300k1844j7893J2624Q441J056m9935m4696l840J3229j6642
$$ 1047885 1015363 923063 901219 883326 895950 904391 905447 855512 810816 806976 820205 803563
18854H03563m9252o916j3441j3135L5417k5184J0417K45K4529k3056k5626n0560
$$ 803563 754311 747395 733954 720819 756236 731052 741469 741714 766243 743187 717561 667001
18842F67001l9698O871k7497p6129k5637M9149r396N1219L2675m0537j03J5642
$$ 667001 627303 634174 606677 530548 504911 554060 544664 595883 628558 588021 587918 603560
18830F03560o844k6236P610j7623j4014m8905l8794n158j3585k7627L5658L8281
$$ 603560 596716 570480 578090 560467 546453 497548 458754 453596 440011 412384 448042 486323
18818D86323m1916j8922l5862R606J9154o8181k1542J2640J0744K052K2466N1556
$$ 486323 444407 425485 389623 399229 418383 350202 328660 341300 352044 354096 376562 428118
18806D28118R715N113j3864J234K8765l5985p7855o929J6809J3360O3971L755
$$ 428118 437833 442946 429082 430316 459081 423096 345241 338312 355121 368481 432452 436207
18794D36207k8286O8414Q7658l566m109o873R680J338l2507n382L6209M2138j987
$$ 436207 407921 476335 563993 560427 556318 549445 559125 560463 527956 522574 558783 600921 598934
18781E98934q628K6214L8299Q539n0L4347J15180R0824J11523J40419J09366Q3886
$$ 598934 590306 616520 654819 663358 663308 697655 812835 903659 1015182 1155601 1264967 1348853
18769A348853J09910J15575J53781R4306k0067m1819m0291L8959J69034J29888
$$ 1348853 1458763 1574338 1728119 1822425 1802358 1760539 1720248 1759207 1928241 2058129
18759B058129P2732N1350M7130R622r9684l03795l06749k26127j40643l0343o1662
$$ 2058129 2130861 2182211 2229341 2238963 2139279 1835484 1528735 1302608 1161965 1131622 1069960
18748A069960l3457P824O6712Q648r3913j31280r1236m8599p495l5341n6305m933
$$ 1069960 1036503 1044327 1111039 1119687 1025774 894494 803258 754659 747164 711823 655518 650585
18736F50585k5178n7431k0084j4671l4014o1000l3811J0880L4657j8202K917Q5824
$$ 650585 625407 567976 547892 533221 499207 438207 404396 415276 449933 431731 434648 520472
18724E20472J17442Q1171Q9122N3133J01883J02615N9718L0806l3847j4372L4327
$$ 520472 637914 719085 808207 861340 963223 1065838 1125556 1156362 1122515 1108143 1142470
18713A142470J05552J90241Q5438q6666j36977j54093r1508l951J2382L7721N9531
$$ 1142470 1248022 1438263 1523701 1437035 1300058 1145965 1054457 1050506 1062888 1100609 1160140
18702A160140Q8724N5403o4527j48950j97451j24205r6502k1084m1691o0160o100
$$ 1160140 1248864 1304267 1239740 1090790 893339 769134 672632 651548 609857 549697 543597
18691E43597O396m2164m6197n9737n9398k0369l0377k321j8655O100L5930j2026
$$ 543597 549993 507829 461632 401895 342497 322128 291751 289430 270775 276875 312805 300779
18679C00779l7202k7022j5114j376m0023j6739n0245K3508n4851J970Q8840P5593
$$ 300779 263577 236555 221441 220065 180042 163303 113058 136566 81715 83685 172525 248118
18667B48118L162J1954j645k1980n2154l9387k1902q831J9725l0890m8073P192
$$ 248118 251280 263234 261589 239609 187455 148068 126166 117335 137060 106170 58097 65289
18655F5289K0524j2951o462M8276j5741l595K3626O3811j5503j7224K3587L3090
$$ 65289 85813 72862 66400 114676 98935 95340 118966 182777 167274 150050 173637 206727
18643B06727j462o6843J7579L5129L0018K1960k663j0682k3598L2226K8980o3590
$$ 206727 205265 138422 156001 191130 221148 243108 240445 229763 206165 238391 267371 203781
18631B03781o4886j4234K4025K4806O2073k4602j1367L8537k1691o2258J041J6288
$$ 203781 138895 124661 148686 173492 235565 210963 199596 238133 216442 154184 155225 171513
18619A71513J7836l2867m2041K8943q756j351j1825m9587L0879L3707K1255m7020
$$ 171513 189349 156482 114441 143384 134628 133277 121452 71865 102744 136451 157706 110686
18607A10686K619N7825j391l2435k8000l749J1275M75j2905O825K685l341o70
$$ 110686 113305 171130 169739 137304 109304 105555 116830 117305 104400 111225 113910 110569 109899
18594A09899L223k0320m835k801l342M7158J9649K4364n151l1475j7181M8093
$$ 109899 113122 92802 87967 85166 81824 128982 148631 172995 167844 136369 119188 167281
18582A67281L4219l446k8777k7096j6796m832L3378l3733l3347L4314J9592j3824
$$ 167281 201500 198054 169277 142181 125385 120553 153931 120198 86851 121165 140757 126933
18570A26933k7099l3273k9255R155J8415L2715L427J0420M6079K8975l3738k5321
$$ 126933 99834 66561 37306 46461 64876 97591 101018 111438 157517 186492 152754 127433
18558A27433k0221M7472P2297J3780k3045l7022l1560j47K5193M9154K3276K1960
$$ 127433 107212 154684 226981 240761 217716 180694 149134 148987 174180 223334 246610 268570
18546B68570J7254l4760l3083L95L2905M3206k4566k440L2174L410N1627M4655
$$ 268570 285824 251064 217981 218376 251281 294487 269921 267481 299655 303065 354692 399347
18534C99347K6619R7512J07871Q3674Q1241J13753Q2730J04019J29266O9137O9826
$$ 399347 425966 523478 631349 715023 796264 910017 992747 1096766 1226032 1295169 1364995
18523A364995N8524K4904L0820Q0233R5943Q5581m4315q0165m5087p1132j90203
$$ 1364995 1423519 1448423 1479243 1559476 1655419 1741000 1696685 1616520 1571433 1500301 1310098
18512A310098k19055j76949j41972q5180l6400l0152l6199R327K3157L6572j5114
$$ 1310098 1091043 914094 772122 686942 650542 620390 584191 593518 616675 653247 638133
18501F38133m3611m338n2275L94J5324j3540p3272o0231m30J6940K0920n707j8557
$$ 638133 594522 590184 537909 538303 553627 540087 466815 406584 406154 423094 444014 438307 419750
18488D19750K5939L3294J3481L2177L6468P6941P7489J28817J10430J19693J02110
$$ 419750 445689 478983 492464 524641 561109 638050 715539 844356 954786 1074479 1176589
18477A176589P6509N3378n4908o2149M297j4675m3161L8420l3979l2021j0546
$$ 1176589 1253098 1306476 1251568 1189419 1193716 1179041 1135880 1174300 1140321 1108300 1097754
18466A097754l9984M1328P8910J21145J63j9661j18392j56761j88501j82186j11570
$$ 1097754 1057770 1099098 1178008 1299153 1299316 1279655 1161263 1004502 816001 633815 522245
18455E22245l6177k7171o521n5260m1819l9763m1207r869J981k575l3105M1125
$$ 522245 486068 458897 452376 397116 355297 315534 274327 264458 266439 263864 230759 271884
18443B71884p1063j3774Q344L8683m75l0434K5683m6592m3704j5055n1787k5787
$$ 271884 200821 187047 195391 234074 233599 203165 228848 182256 138552 123497 71710 45923
18431D5923L9787j6099L169N4348J6102m4756l4374J1483M173l968J8390j1003
$$ 45923 85710 69611 72780 127128 143230 98474 64100 75583 79756 75788 94178 83175
18419H3175m0115K3023R696k7594L646J8415o406j6989L1001J5096k8861M4948
$$ 83175 43060 66083 75779 48185 51831 70246 63840 46851 77852 92948 64087 109035
18407A09035N8260l5236l3757M40J2836L9365Q599K787R342n244M1563j8759n0928
$$ 109035 167295 132059 98302 98742 111578 150943 159542 162329 171671 166427 207990 189231 138303
18394A38303q319k9815j3318k6474K9048M3480m6090k5021j5284k0k353J2678
$$ 138303 129984 100169 86851 60377 89425 132905 86815 61794 46510 46490 44137 56815
18382E6815K502K2446L2783K990j9078J7765m8307l8046M7262N0858L3871l6917
$$ 56815 59317 81763 114546 117536 98458 116223 67916 29870 77132 127990 161861 124944
18370A24944j6774l4759O752O589r083m4343j6405L8606J5208j3638J580J1015
$$ 124944 108170 73411 80163 86752 77669 33326 16921 55527 70735 57097 58677 69692
18358F9692j339K3041N6455L4369O625j4205J08J2402o3886l6569k8153L6651
$$ 69692 68353 91394 147849 182218 188843 174638 174746 187148 123262 86693 58540 95191
18346I5191N7667P2522j5612l5956k0794j5121n116l3887k7876o241k4054L064
$$ 95191 152858 225380 209768 173812 153018 137897 132781 98894 71018 64777 40723 43787
18334D3787M0463O270N355R913k0194m463j9573P075L2154j0743o1659k5876k9503
$$ 43787 84250 90520 95875 105788 85594 81131 61558 68633 100787 90044 28385 2509 -26994
18321b6994j2177j8523N7565Q035J5088O1873K2664k4118l6594l0556J0617j7116
$$ -26994 -39171 -57694 -129 7906 22994 84867 107531 83413 46819 16263 26880 9764
18309I764j4140K5044K4784Q623L755k9167m2510n0021J4471J7835L8550P1578
$$ 9764 -4376 20668 45452 54075 57830 28663 -13847 -63868 -49397 -31562 6988 78566
18297G8566j5369J0345P920k5985k7431m3609J9952M4115q764K1086J5992k4543
$$ 78566 63197 73542 81462 55477 28046 -15563 4389 48504 39740 60826 76818 52275
18285E2275P777K4948M3847k2627k4753R214m6173l2055N127M356l6418J5004
$$ 52275 60052 85000 128847 106220 81467 90681 44508 12453 17580 21936 -14482 522
18273E22J1527K3317M3632j3874l5970o0696r060M6904L7232j2402k407O1608
$$ 522 12049 35366 78998 65124 29154 -31542 -40602 6302 43534 31132 28725 90333
18261I0333L1110J3218m2332p859k0438l1802l5939L017l4526k0226J6009K1939
$$ 90333 121443 134661 92329 84470 64032 32230 -3709 -692 -35218 -55444 -39435 -17496
18249a7496M179M4887M4563J1757j166p956m7964j1576l7664k6371K8823M7594
$$ -17496 -13317 31570 76133 87890 86724 78768 30804 19228 -18436 -44807 -15984 31610
18237C1610l2745m1399M8900k140K494l540Q049N4021K1690k9964l8587P067q540
$$ 31610 -1135 -42534 6366 4226 6720 3180 11229 65250 86940 56976 18389 25456 16916
18224A6916j11q267j2782J4782M0857j7529m2014L2085r555j2488J7700J6687
$$ 16916 16805 8538 -4244 10538 51395 33866 -8148 23937 14382 1894 19594 36281
18212C6281L1996M492j7650J3414j4179Q735j0152j8941K1211K4927j6824l1422
$$ 36281 68277 72769 55119 68533 54354 63089 52937 33996 55207 80134 63310 31888
18200C1888J7786J8121j0888o55l5638K6973N5588K1290l6663p0461Q132N712
$$ 31888 49674 67795 56907 56252 20614 47587 103175 124465 87802 17341 25473 31185
18188C1185J5866L7020k1315l2354J3069J3591P905l1149J0806N3587J9226k290
$$ 31185 47051 84071 62756 30402 43471 57062 64967 33818 44624 98211 117437 115147
18176A15147n9078J4279j5227r008P5406n124l9389m144P49j8549o3020L8854
$$ 115147 56069 70348 55121 46113 121519 116395 77006 72862 73611 55062 -7958 30896
18164C0896K5251J1292O698O321n4568L6774J4956l4788J0122o805K9815m9971
$$ 30896 56147 67439 74137 80458 25890 62664 77620 42832 52954 46149 75964 25993
18152B5993j1443M3877J0359R114l299j4413J4587M5187K521p116N5700O4856
$$ 25993 14550 58427 68786 77900 74601 60188 74775 119962 122483 115367 171067 235923
18140B35923N0295O0555K8043m590L7563R1683J11742K0253j532M1377Q2184J27200
$$ 235923 286218 346773 374816 370226 407789 499472 611214 631467 629935 671312 753496 880696
18128H80696L5965M7318Q8580J18498J06532R1132M1582M9193L2858N9429J73987
$$ 880696 916661 963979 1052559 1171057 1277589 1368721 1410303 1459496 1492354 1551783 1725770
18117A725770J66311J96839J94543K07881K48096L76498N09921P58953J323873
$$ 1725770 1892081 2088920 2283463 2491344 2739440 3115938 3625859 4384812 5708685
18108E708685K258883K640577J119623n38402K42166K136162K272747l01476l465525
$$ 5708685 7967568 10608145 11727768 11189366 11431532 13567694 15840441 15538965 12073440
18099A2073440l879843k481256j434691q00311m31551k50338j88222k17521j29637
$$ 12073440 8193597 5712341 4277650 3477339 3045788 2795450 2607228 2389707 2260070
18090B260070j71842k28872k18712j86048k11394j60470q3229q4411j37241j17786
$$ 2260070 2088228 1859356 1640644 1454596 1243202 1082732 999503 915092 777851 660065
18080F60065l7697n81n394p5885n2926q9779l6453R624n296k8434K71m1101m9360
$$ 660065 622368 621787 616393 540508 487582 397803 361350 370974 365678 337244 337515 296414 247054
18067B47054Q478q333j5544J4107L602k3490K5380m9926r1096j2408K1743K2691
$$ 247054 255532 247199 231655 245762 249364 225874 251254 201328 110232 97824 119567 142258
18055A42258L5609O740o808k189k6278o8091n0358j5572L3130k0932k6812O3661
$$ 142258 177867 184607 177799 175610 149332 81241 30883 15311 48441 27509 697 64358
18043F4358R0815l168j3348l7578o102J610J1515k5226m0918L70L2139k6010M4300
$$ 64358 155173 152005 138657 101079 94977 96587 108102 82876 41958 42328 74467 48457 92757
18030I2757k1226m3802m1659j5729j7010k4879M3144K0800L927P1936J8440j0132
$$ 92757 71531 27729 -13930 -29659 -46669 -71548 -28404 -7604 -3677 68259 86699 76567
18018G6567j8555n3293k8006O505K836M6917J5980K227n388j1601L3044j2545
$$ 76567 58012 4719 -23287 -16782 -13946 32971 48951 51178 45790 34189 67233 54688
18006E4688j8884M1276J7302m9442J508K3056j2387m2573j2154k3412M3130K9740
$$ 54688 35804 77080 94382 44940 46448 69504 57117 14544 2390 -21022 22108 51848
17994E1848j4992O010J7668N578l1135l1042n239K8131j102k6800j1432j6627
$$ 51848 36856 42866 60534 66112 34977 3935 -1304 26827 25725 -1075 -12507 -29134
17982b9134r223o3657k0279N9031K8372K1759J9342N0126M4468j1555J446k8502
$$ -29134 -38357 -102014 -122293 -63262 -34890 -13131 6211 56337 100805 89250 90696 62194
17970F2194k4114R642J4466m5411J8057N6644m341j2057k9759j8730j5261l4379
$$ 62194 38080 47722 62188 16777 34834 91478 87137 75080 45321 26591 11330 -23049
17958b3049L787M494l2866m0735N0665K8138L4897R654J096K1179l7104m4296
$$ -23049 -19262 -14768 -47634 -88369 -37704 -9566 25331 34985 36081 57260 20156 -24140
17946b4140L9371J5834p613k3054j7094j1663P204J5347J0355q466l5701r701
$$ -24140 15231 31065 23452 398 -16696 -28359 -21155 -5808 4547 -3919 -39620 -49321
17934d9321N1835M3328J6398k9188j6684j2927K0977L6701K6200j031M223m0531
$$ -49321 2514 45842 62240 33052 16368 3441 24418 61119 87319 86288 90511 49980
17922D9980j5016J040j82l6328k4029j4609L8856P840n352j6486K5629N0573J5877
$$ 49980 34964 36004 35822 -506 -24535 -39144 -288 7552 2200 -14286 11343 61916 77793
17909G7793o1354M110M3249n7003J0700N3402L5986l1512n1594Q346J8650K4490
$$ 77793 16439 20549 63798 6795 17495 70897 106883 75371 23777 32123 50773 75263
17897G5263n688j9708J6857Q16J7431q389j7421J7130n3162j6183L2301K0180
$$ 75263 69575 49867 66724 67540 84971 76582 59161 76291 23129 6946 39247 59427
17885E9427n703k3801l4251M758K5878l9890k7419K4893L3259m2861J2409L8899
$$ 59427 53724 29923 -4328 430 26308 -13582 -41001 -16108 17151 -25710 -13301 25598
17873B5598k2751j0671L3332j5667k371k618O348K9495N270k6065j1572p895o448
$$ 25598 2847 -7824 25508 9841 7470 4852 11200 40695 45965 19900 8328 433 -6015
17860f015k6197K3542o53K3434j7900o978N5197k714k2888Q315N241k9421j3113
$$ -6015 -32212 -8670 -9323 14111 -3789 -10767 44430 41716 18828 27143 32384 2963 -10150
17847a0150J9868K9254J2872Q737j0849l3365L779r143j7990L3423o027J9351
$$ -10150 9718 38972 51844 60581 49732 16367 20146 11003 -6987 26436 20409 39760
17835C9760l2076k6419M7768j1661k6193o688P063K5389L5879K6520k0484k8594
$$ 39760 7684 -18735 29033 17372 -8821 -15509 -8446 16943 52822 79342 58858 30264
17823C0264l4250l6633M6024K9716k7866j5521n1241J8617l867j9996L0825N0847
$$ 30264 -3986 -40619 5405 35121 7255 -8266 -59507 -40890 -44757 -64753 -33928 16919
17811A6919J0562n086k743M9671p953m2752m758J6152n697m0718J8393Q601m3770
$$ 16919 27481 22395 19652 69323 61370 18618 13860 30012 24315 -16403 1990 10591 -33179
17798c3179j3349O375M544L5167M4514l113m7748k0462N0365P417N0617M4848
$$ -33179 -46528 -40153 -35609 -442 44072 40959 -6789 -27251 23114 30531 81148 125996
17786A25996k1052n1659J501m6030l1152K033L6284K2385k9165J1937J75j551
$$ 125996 104944 53285 54786 8756 -22396 -20363 15921 38306 9141 21078 21253 19702
17774A9702K9344K6788M493o8761m8548Q016j7545k4510N0668M5777J5927M914
$$ 19702 49046 75834 80327 11566 -36982 -28966 -46511 -71021 -20353 25424 41351 46265
17762D6265L1647p39J4898k2216m5569K0768L9077j6732m4031M981J8008j7754
$$ 46265 77912 77173 92071 69855 24286 45054 84131 67399 23368 28349 46357 28603
17750B8603J0391m2834n422J2365K1024L1833k0767K3229K9606j0814q2492l4250
$$ 28603 38994 -3840 -9262 3103 24127 55960 35193 58422 88028 77214 -5278 -39528
17738c9528O1320L1226j9271k1959l8434K2287q105L3659k561K6679N242k483
$$ -39528 21792 53018 33747 11788 -26646 -4359 -12464 21195 18634 45313 50555 48072
17726D8072J6304J3357k6500m7019l4054M623M4953j7651j8746k2996K9475P5874
$$ 48072 64376 77733 51233 4214 -29840 -25217 19736 2085 -16661 -39657 -10182 65692
17714F5692J13n4112l4478L3564m78k8147j156j6308L6186L1996j1627L7656J8784
$$ 65692 65805 11693 -22785 10779 10301 -17846 -19002 -35310 876 32872 21245 58901 77685
17701G7685j6981k5510o6257m2149k462l0498N6449N0382N7758J4504l3636J9370
$$ 77685 60704 35194 -31063 -73212 -75674 -106172 -49723 659 58417 72921 39285 58655
17689E8655K7409J9969m0545o2430r532K0362O2010m8057l158o6021K5421L8452
$$ 58655 86064 106033 65488 3058 -6474 13888 75898 27841 24683 -41338 -15917 22535
17677B2535j9136k2545j3592j4195J8472K2539P008J9395j1900m5341k0703J7368
$$ 22535 3399 -19146 -32738 -46933 -28461 -5922 1086 20481 8581 -36760 -57463 -40095
17665d0095J7337P0593L7420n8867n0328M1183L1215M2330l8938J1686J0613j1289
$$ -40095 -22758 47835 85255 26388 -23940 17243 48458 90788 51850 63536 74149 62860
17653F2860j0512q105R843L919M6115M0548l9057k9226m6924R452k837j3934L995
$$ 62860 52348 44243 54086 58005 104120 144668 105611 76385 29461 38913 36076 22142 26137
17640B6137j9932m2826N113L7912M2252j6845k4209K9544l3492k4636k9131N875
$$ 26137 6205 -36621 -31508 6404 48656 31811 7602 37146 3654 -20982 -50113 -44238
17628d4238J0333q057J5889M0386N1934K486j0065J8997l5523m5638N600P32K585
$$ -44238 -33905 -41962 -26073 14313 66247 68733 58668 77665 42142 -3496 2104 2836 5421
17615E421J0766M4581K1777q718J2002m3844Q271K407m3862R652k9979M65L6303
$$ 5421 16187 60768 82545 73827 85829 41985 50256 52663 8801 18453 -11526 -11061 25242
17602B5242J0746K5217L000l9849n0305j502n21Q722L860k166J557M0997l0237
$$ 25242 35988 61205 64205 24356 -25949 -27451 -27972 -19250 -15390 -17556 -15999 24998 -5239
17589e239K3135M3858m8603n409M1102L1596o773j4372j3793n0085l3387r355
$$ -5239 17896 61754 13151 7742 48844 80440 73667 59295 45502 -4583 -37970 -47325
17577d7325M2919M5211k2995p8638J1661k2513l5907L0408L9305R436k5952k755
$$ -47325 -4406 40805 17810 -60828 -49167 -71680 -107587 -77179 -37874 -28438 -54390 -57145
17565e7145k1360N7994M1022J4621J1582j7073r434j9230k7050o9137L3769L9881
$$ -57145 -78505 -20511 20511 35132 46714 29641 20207 977 -26073 -95210 -61441 -21560
17553b1560K5940K2292J6398J7203l9871k7162L1239L851q56j6412j7646j0772
$$ -21560 4380 26672 43070 60273 20402 -6760 24479 28330 27474 11062 -6584 -17356
17541a7356K1975o713r673j829K8042J7156l710l3451m359N1941M784L7150k946
$$ -17356 4619 -2094 -11767 -13596 14446 31602 27892 -5559 -9918 42023 46807 83957 81011
17528H1011l0862j7649K0512J0051r231Q408k4620o9158L1185O5025l9210o2150
$$ 81011 50149 32500 53012 63063 53832 62240 37620 -31538 -353 64672 25462 -36688
17516c6688O934L580L8229R573P819q860k1502j9759J5884j0730K2294J363j7595
$$ -36688 -29754 -26174 12055 21628 29447 20587 -915 -20674 -4790 -15520 6774 8137 -9458
17503i458o63M200J5609l761N554L5815Q226J4223J146L1188m657l9915J2321
$$ -9458 -10121 -5921 9688 5927 11481 47296 55522 69745 70891 102079 97422 57507 69828
17490F9828M4202o2723p0242j4294J1605K9465n7718k7491J0030O7204K8495l431
$$ 69828 114030 51307 -18935 -33229 -21624 7841 -49877 -77368 -67338 -134 28361 24930
17478B4930m8049m296j5694n828L8792L2889l126L898J7817l47J5851k6411P38
$$ 24930 -23119 -27415 -43109 -48937 -10145 22744 19618 23516 41333 40986 56837 30426 31164
17465C1164J2228M2036q39n4399m3483n3735k3598L666L2954O5228M7702k4339
$$ 31164 43392 85428 84589 30190 -13293 -67028 -90626 -86960 -54006 11222 58924 34585
17453C4585j4641M098m388p879K0044P646l2324l682O5794k25J703j5280L846
$$ 34585 19944 24042 19654 11775 31819 39465 7141 3459 69253 69028 70731 55451 59297
17440E9297O5063J0933k1258K0348Q1278O6479k1598r1423n4121l9697k1394l230
$$ 59297 124360 135293 114035 134383 215661 282140 260542 169119 114998 75301 53907 50677
17428E0677k0520l926P465j078j6290p911P998j1213n79K597R623M017M254Q988
$$ 50677 30157 26231 33696 32618 16328 8417 16415 5202 4623 7220 16843 20860 25114 34102
17414C4102j1042N3575k1688j02267j8450J1818M8257K5957j8354k1438M9431
$$ 34102 23060 76635 54947 -47320 -65770 -53952 -5695 20262 1908 -19530 29901
17403B9901P0030l6978n2677l1809L1018J0999k9348J025Q289k8804M178J1426
$$ 29901 99931 62953 10276 -21533 9485 20484 -8864 -7839 450 -28354 -24176 -12750
17391a2750M070j5564K3663n844m3679j040M8067m62l9294l1562l811J7405L9283
$$ -12750 -8680 -24244 -581 -6425 -50104 -51144 -3077 -3539 -42833 -74395 -78206 -60801 -21518
17378b1518L9729j9480m2355m4522k6540L9645O0570J6765R181J2188K5091J6074
$$ -21518 18211 -1269 -43624 -88146 -114686 -75041 -14471 2294 11475 23663 48754 64828
17366F4828j013k3061k6255o963o495K293J5899P19k126K5983J3478o9530k2051
$$ 64828 63815 40754 14499 7536 1041 3334 19233 19952 17826 43809 57287 -12243 -34294
17353c4294J4329j4361j4022K9154J3137K1867L0461k9471O2282m3181o7561Q1683
$$ -34294 -19965 -34326 -48348 -19194 -6057 15810 46271 16800 79082 35901 -31660 50023
17341E0023M7820j4299J793k1838l2645k3748K3671N264N1885j187n248l6251
$$ 50023 97843 83544 85337 63499 30854 7106 30777 36041 87926 86739 81491 45240
17329D5240o0640j6933j8804k3829j8476j1256J3812N2901L8921M2343N966j0662
$$ 45240 -15400 -32333 -51137 -74966 -93442 -104698 -90886 -37985 936 43279 49245 38583
17317C8583J5041J0914l6042l158j8661k5137j6277K3665M3692m9643k5405N5518
$$ 38583 53624 64538 28496 25338 6677 -18460 -34737 -11072 32620 -17023 -42428 13090
17305A3090L6743k3901k1516J6461M0158K5212J1592k9106k1840j1008k8629j7938
$$ 13090 49833 25932 4416 20877 61035 86247 97839 68733 46893 35885 7256 -10682
17293a0682K5579N5129j7397k8128K9882J7084l7819j593j0924l038L2399M543
$$ -10682 14897 70026 52629 24501 54383 71467 33648 32055 21131 18093 50492 55035
17281E5035l0781Q693R461R900k2676m1192J518N8739L9147o38n1357k8616m3351
$$ 55035 24254 32947 42408 52308 29632 -11560 -10042 48697 87844 87206 35849 7233 -36118
17268c6118m525M2674J4111j2266k126M8343K3329l383p8348L3238N3256J728
$$ -36118 -40643 2031 16142 3876 1750 50093 73422 70039 -8309 24929 78185 79913
17256G9913p8175n4297j4988N0234K4903K8438k282o3982j3458j633L0382L2402
$$ 79913 1738 -52559 -67547 -17313 7590 36028 33746 -30236 -43694 -45327 -14945 17457
17244A7457L2961k5195m9137J1307L7236m9743l5374n269J2206O3528k4279k0539
$$ 17457 50418 25223 -23914 -12607 24629 -25114 -60488 -65757 -53551 9977 -14302 -34841
17232c4841j2037j2474M9096K3948J4418L2323J1398J6210j113k4092k2694o546
$$ -34841 -46878 -59352 -10256 13692 28110 60433 71831 88041 86928 62836 40142 33596
17220C3596K2800l83k4775k9139J9570K5867l4465k4269j6030p303N939j1724
$$ 33596 56396 56013 31238 2099 21669 47536 13071 -11198 -27228 -34531 -28592 -40316
17208d0316q366Q4210J5815n0446l8832J754J8355J4729L9912K9620P2334j4726
$$ -40316 -48682 35528 51343 897 -37935 -36181 -17826 -3097 36815 66435 138769 124043
17196A24043r7966k2457N6074L139l0131j1858r226l5199m3127K7085M2372M915
$$ 124043 26077 3620 59694 62833 32702 20844 11618 -23581 -66708 -39623 2749 7664
17184G664n4273K5308J5877j0724J1314O159k6389J9337K2221L1811L4448m3294
$$ 7664 -46609 -21301 -5424 -16148 -4834 1325 -25064 -5727 16494 48305 82753 39459
17172C9459n7276j9063J5900k268l2583L2083O309j0757K9132J4618j592n709
$$ 39459 -17817 -36880 -20980 -23248 -55831 -23748 -17439 -28196 936 15554 13962 8253
17160H253J1730K081r963L262k7766l6858j4082P126K6189M366L668p275K024
$$ 8253 19983 22064 12101 15363 -12403 -49261 -63343 -56217 -30028 -25662 -21994 -29269 -27245
17147b7245L2684J2776J3493k0067M817K5920O2390J9949m4651k633n6484j3563
$$ -27245 5439 18215 31708 11641 16458 42378 104768 124717 80066 77433 20949 7386
17135G386J8154q5m4746j2566Q152L932J7854L0501q270P080K4622k140n28k2146
$$ 7386 25540 25455 -19291 -31857 -23705 -19773 -1919 28582 20312 27392 52014 49874 49346 27200
17121B7200K7916N256m4116k6213r922m818K4365O152j4689o672k6801K2651K3642
$$ 27200 55116 60372 16256 -9957 -19879 -24697 -332 5820 -8869 -15541 -42342 -19691 3951
17108C951j3263j9531M9657N0240j1075l5621l2942j8148r87l88L3424L989j6284
$$ 3951 -9312 -28843 20814 71054 59979 24358 -8584 -26732 -27719 -28107 5317 9306 -6978
17095f978R414k1922O955j3492o185M966k0848l535O585K9348J29L2609M4737
$$ -6978 2436 -19486 -12531 -26023 -32208 -27242 -48090 -51625 -45040 -15692 -15563 17046 61783
17082F1783k8690l5663k741J0815J3882k9780r14j8191o194R48N0264M9115l7943
$$ 61783 33093 -2570 -5311 5504 19386 -10394 -11308 -29499 -35693 -34745 15519 64634 26691
17069B6691p9530j2840M906L3956J5343J4938Q720j1393J0508o193P26L3401J368
$$ 26691 -52839 -65679 -60773 -26817 -11474 3464 12184 791 11299 5106 5832 39233 40601
17056D0601l8952r053L7621m640k3073j641k019j5505P756L573m906k5163L5577
$$ 40601 1649 -7404 30217 25577 2504 863 -1156 -16661 -8905 -5332 -10238 -35401 176
17043A76k532m1282k4520j1519K1146J28889J1190n4536l6205J2901P1475K541
$$ 176 -2356 -43638 -68158 -79677 -58531 70358 81548 27012 -9193 3708 75183 77724
17031G7724m3738j4307K8361q1295l4819N2095L1284k8160k9180k1852M1653K1909
$$ 77724 33986 19679 48040 -33255 -68074 -15979 15305 -12855 -42035 -63887 -22234 -325
17019c25J2090k9939k8206k872L9761K4846m2971l0054K5218J2191J0699k0142
$$ -325 11765 -18174 -46380 -49252 -9491 15355 -27616 -57670 -32452 -20261 -9562 -29704
17007b9704J1418K2577k0299l1202j3715P934L5971L1122J0430k4476L0721K6932
$$ -29704 -18286 4291 -16008 -47210 -60925 -52991 -17020 14102 24532 56 30777 57709
16995E7709n3642m5007k3260N441o222k8994l072J4407J7694L0730j251J5407
$$ 57709 4067 -40940 -64200 -58759 -64981 -93975 -97047 -82640 -64946 -34216 -35467 -20060
16983b0060l648l2455k9015K0890K8674K8931M7343j570j9173O6427L1242k1996
$$ -20060 -23708 -56163 -85178 -64288 -35614 -6683 40660 39090 19917 86344 117586 95590
16971I5590n8562m0245j9495L4611M5968N36L969l2828l2221K3211O9990N5518
$$ 95590 37028 -3217 -22712 11899 57867 58403 62372 29544 -2677 20534 90524 146042
16959A46042o7605q2888j2369J8598p226L041K0641m5587k1387R350J2960M2613
$$ 146042 78437 -4451 -16820 1778 -5448 -2407 18234 -27353 -48740 -39390 -26430 16183
16947A6183L1835J0923j4911j9750j0495j1880l9411k0209L5466L4221r948l4980
$$ 16183 48018 58941 44030 24280 13785 1905 -37506 -57715 -22249 11972 2024 -32956
16935c2956K5866L9622K0385J2806l1904l85j3043n3087K5129J5660J4842L0604
$$ -32956 -7090 32532 52917 65723 33819 33434 20391 -32696 -7567 8093 22935 53539
16923E3539n8371j7664M9937k4858k1167P789j4088m0485O9979M9354l0297n139
$$ 53539 -4832 -22496 27441 2583 -18584 -10795 -24883 -65368 4611 53965 23668 18529
16911A8529P774m901P101M9198K4408q440k9357L671l3551l6936L3417M8470j0526
$$ 18529 26303 21402 28503 77701 102109 93669 64312 67983 34432 -2504 30913 79383 68857
16898F8857o0674l385l409P047n9752j8075K539q625j7927J6008j4876N1682P8849
$$ 68857 8183 4798 1389 8436 -51316 -69391 -66852 -75477 -93404 -77396 -92272 -40590 38259
16885C8259M463k1837j0962J3223N855m3739l5074L7096R4719K626l7996m8527
$$ 38259 42722 20885 9923 23146 29001 -14738 -49812 -12716 82003 84629 46633 -1894
16873a894o1886l0110R941j9185K3159j0066l9920O0270L7482l574K7291K1820
$$ -1894 -63780 -93890 -83949 -103134 -79975 -90041 -129961 -69691 -32209 -35783 -8492 13328
16861A3328o132k0026k4963R138K3696N2221K1269j0306m3884k9195n377L734
$$ 13328 7196 -12830 -37793 -28655 -4959 47262 68531 58225 14341 -14854 -20231 -16497
16849a6497Q6650J1359k4833p3231l6283j4938M2569J4664J4160l7286K0553N3503
$$ -16497 70153 81512 56679 -16552 -52835 -67773 -25204 -10540 3620 -33666 -13113 40390
16837D0390j3355l7730k4698J335M7911O1958J7191m354n5079l5360J2529O9158
$$ 40390 27035 -10695 -35393 -34058 13853 75811 93002 88648 33569 -1791 10738 79896
16825G9896L1130K3518n6351n1037m6159L591M4908L738K2432l6334L8063K7173
$$ 79896 111026 134544 78193 27156 -19003 -15412 29496 33234 55666 19332 57395 84568
16813H4568l4858j5014j6682J5109M139p340m564l1836O287o0191m4757N446J6076
$$ 84568 49710 34696 18014 33123 37262 29922 25358 -6478 -191 -60382 -105139 -99693 -83617
16800h3617L5865M0531n236l104K0264J9567j4803l5400j4171M837r89K1331l2751
$$ -83617 -47752 -7221 -12457 -15561 4703 24270 9467 -25933 -40104 -35267 -36256 -14925 -47676
16787d7676m5494l0285M6091O4835P3285J3470J3117k5762o0768l2205L9169L4234
$$ -47676 -93170 -123455 -77364 -12529 60756 74226 87343 61581 813 -31392 7777 42011
16775D2011n0135J4081K0517n0863l5211J321K525l0441L2878J7070Q819L1584
$$ 42011 -8124 5957 26474 -24389 -59600 -58279 -55754 -86195 -53317 -36247 -27428 4156
16763D156m226p548j4860k3487k3883M4219j922l7538j6415O2993j962K1126r232
$$ 4156 -70 -7618 -22478 -45965 -69848 -25629 -27551 -65089 -81504 -18511 -20473 653 -8579
16750h579n9743p292L8790K9189J7200m6558j4178N098r73L1745k3766m7778j5761
$$ -8579 -68322 -75614 -36824 -7635 9565 -36993 -51171 -46073 -47046 -15301 -39067 -86845 -102606
16737a02606P151j5030M3064N9001K1300o125j4980J9810L8316j2548J0336m313
$$ -102606 -95455 -110485 -67421 -8420 12880 6755 -8225 11585 49901 37353 47689 43376
16725D3376P004J9949J6164j3643m6551M45K844j7268J6940j9888J476o780p5452
$$ 43376 50380 70329 86493 72850 26299 26744 29588 12320 29260 9372 10848 4068 -71384
16712g1384o0719M2072O1206M4791K6231L4290p669k5281m7822j4429l4270J1694
$$ -71384 -132103 -90031 -28825 15966 42197 76487 68818 43537 -4285 -18714 -52984 -41290
16700d1290l5978J847Q939P746J0271j2203J9488J3036l5864n2050N4113K9837
$$ -41290 -77268 -75421 -66482 -58736 -48465 -60668 -41180 -28144 -64008 -116058 -61945 -32108
16688c2108n47O2595L2688k7193k156J1605j4093l0031n9475l647M5098K0066
$$ -32108 -32655 29940 62628 35435 33279 44884 30791 760 -58715 -62362 -17264 2802
16676B802k3659k603r785Q051N202P609O151Q656k4380j1580j8189J4284K2489
$$ 2802 -20857 -23460 -33245 -25194 -19992 -12383 -6232 2424 -21956 -33536 -51725 -37441 -14952
16663a4952L3074J6012K735l1984J0965k9976m7854j054K8266L2973j6849k0898
$$ -14952 18122 34134 36869 4885 15850 -14126 -61980 -63034 -34768 -1795 -18644 -39542
16651c9542j4274K2628K8056l672K0263l8142l8894J2908j9032M773M030Q087
$$ -39542 -53816 -31188 -3132 -6804 13459 -24683 -63577 -50669 -69701 -64928 -60898 -52811
16639e2811q247K9832N9689j6673l0158L5708K7582l2261j7425O823L6736j9524
$$ -52811 -61058 -31226 28463 11790 -18368 17340 44922 12661 -4764 2059 38795 19271
16627A9271l7644j7514K979k9070j5925L2509P943N017k0535L9319L2397K1816
$$ 19271 -18373 -35887 -32908 -61978 -77903 -45394 -37451 -32434 -52969 -13650 18747 40563
16615D0563k040K063o2158m59K5226K2303M6085M131l3572M939l2512q169k261
$$ 40563 38523 40586 -21572 -22031 3195 25498 71583 75714 42142 47081 14569 6400 4139
16602D139k8747j3311K4028K4914L7054j5011k1942K1139r149o8254K0491j3071
$$ 4139 -24608 -37919 -13891 11023 48077 33066 11124 32263 23114 -45140 -24649 -37720
16590c7720L2174L0433r580l0090l439o661j4943K7506M3484k3331r1706j3142
$$ -37720 -5546 24887 15307 -14783 -18222 -24883 -39826 -12320 31164 7833 -83873 -97015
16578i7015M5583O1685J9164j8632m1129K8520J8018m9383L062M6794P079M2609
$$ -97015 -51432 10253 29417 10785 -30344 -1824 16194 -33189 -30127 16667 23746 66355
16566F6355L8506k4303k5839k4032q54o938l6231K982J7408J2454N716K194R497
$$ 66355 104861 80558 54719 30687 29833 22895 -13336 -10354 7054 19508 25224 27418 36915
16553C6915L1485m2551m0062J5115k8369n357M7492M0544L3075l1190k3243m445
$$ 36915 68400 25849 -14213 902 -27467 -32824 14668 55212 88287 57097 33854 29409
16541B9409l4234k1675L5114J7112K0378k2613l3161l8292M102K8676n045N862
$$ 29409 -4825 -26500 8614 25726 46104 23491 -9670 -47962 -43860 -15184 -20229 -14367
16529a4367j0530K635L0439k5178l1825m59L5185J2398J2181J6270j0097j4438
$$ -14367 -24897 -22262 8177 -17001 -48826 -49285 -14100 -1702 10479 26749 16652 2214
16517B214j4456m6360J9461N1044l7282J7587K5382l156j7265O786m0453m4578
$$ 2214 -12242 -58602 -39141 11903 -25379 -7792 17590 14434 -2831 3955 -36498 -81076
16505h1076o549L2708J20l8336K2517R033O159L4676K4062j7978q666k853r721
$$ -81076 -87625 -54917 -54797 -93133 -70616 -61583 -55424 -20748 3314 -14664 -23330 -26183 -35904
16492c5904K8795N5144l0293j0402k8996J9054j144m7379L3433N4325L2940k9160
$$ -35904 -7109 48035 17742 7340 -21656 -2602 -3746 -51125 -17692 36633 69573 40413
16480D0413k3241K4356k413O794P1239L8987r0501o2385j1464O0093J3690J2745
$$ 40413 17172 41528 39115 45909 117148 156135 65634 3249 -8215 51878 65568 78313
16468G8313N202N896r038k9649R03k6091m866m8584N1141L9761k8099q861j4502
$$ 78313 83515 89411 80373 50724 51627 25536 20670 -27914 23227 62988 34889 26028 11526
16455A1526J5255k0707k5049K8632J9667m917L5973P892J6730K727m8055N020
$$ 11526 26781 6074 -18975 9657 29324 24407 60380 68272 85002 87729 39674 44694
16443D4694N0543m7727m5168k8603k1882Q449J8291L6814j32j9363l2059o618
$$ 44694 95237 47510 2342 -26261 -48143 -39694 -21403 15411 15279 -4084 -36143 -42761
16431d2761M1547K1441l2491p176M283k8440k4947L9205K2172J3229L0824p220
$$ -42761 -1214 20227 -12264 -19440 -15157 -43597 -68544 -29339 -7167 6062 36886 29666
16419B9666l3333K1249k289k9896m0998L9742K9685l7575j5509K1289J2542j6374
$$ 29666 -3667 17582 15293 -14603 -55601 -15859 13826 -23749 -39258 -17969 -5427 -21801
16407b1801N831j7957N353K8034K6799J6831l251K0234j9186l2804L583K18j4406
$$ -21801 -15970 -33927 -28574 -540 26259 43090 39839 60073 40887 8083 11666 11884 -2522
16394b522n6631L536O3838M1225j4066k2808q70j4396j5515k1977p353j1692M8258
$$ -2522 -59153 -55617 8221 49446 35380 12572 11702 -2694 -18209 -40186 -47539 -59231 -10973
16381a0973L2038j3964l6268K7843q068k3836K6270K8586k65j8024j0316J7286
$$ -10973 21065 7101 -29167 -1324 -9392 -33228 -6958 21628 21363 3339 -6977 10309
16369A0309J9734Q46j5301j8517k3709K3310Q411K7818l0792j2915q427J5917
$$ 10309 30043 30889 15588 -2929 -26638 -3328 5083 32901 2109 -10806 -19233 -3316
16357c316J9229n901j813R778L6516k1936k1588k5677j8303j2516m4660K39J1397
$$ -3316 15913 10012 8199 17977 54493 32557 10969 -14708 -33011 -45527 -90187 -89948 -78551
16344g8551L0173L0024M1354L6824o0859k1532J6157J2414L6775M703p3000J3473
$$ -78551 -48378 -18354 23000 59824 -1035 -22567 -6410 6004 42779 47482 -25518 -12045
16332a2045M5112J1729J9955j25m2629m9004J6595J9006J2901J5965k7136k3369
$$ -12045 33067 44796 64751 64626 21997 -27007 -10412 8594 21495 37460 10324 -13045
16320a3045J360k2451L6061l4756o845O2546J9969K2899R180l3755k1410m2496
$$ -13045 -11685 -34136 1925 -32831 -39676 22870 42839 65738 74918 41163 19753 -22743
16308b2743J6165J6933M579n0809J8596O2405k628j8624L053J6098j7406J5829
$$ -22743 -6578 10355 14934 -35875 -17279 45126 42498 23874 26927 43025 25619 41448
16296D1448J112j6782n8340p960K7087K8995k288p184j9295j9046J2010q276J1149
$$ 41448 42560 25778 -32562 -40522 -13435 15560 13272 6088 -13207 -32253 -20243 -28519 -17370
16283a7370J2269K7937n906L943N2601k2149k4977k7758l7652p604l1535L7112
$$ -17370 -5101 22836 16930 20873 73474 51325 26348 -1410 -39062 -46666 -78201 -41089
16271d1089K9462j07j8532o06m0068m1036Q8173J7954j8212M7951L9956j31q577
$$ -41089 -11627 -11734 -30266 -30872 -70940 -111976 -23803 -5849 -24061 23890 63846 63715 55138
16258E5138j0269J3294J2739m1267m4910M227P001N4921M767k1137J1326R135
$$ 55138 44869 58163 70902 29635 -15275 -11048 -4047 50874 55641 34504 45830 54965
16246E4965p1146m0932j0668J9959j5497M5562l0431k0226K8475J4095J6678k4507
$$ 54965 -16181 -57113 -67781 -47822 -63319 -17757 -48188 -68414 -39939 -25844 -9166 -33673
16234c3673p804L7890O2127N143k1158k1685l3390m3322J4625M6371J6963k8519
$$ -33673 -41477 -3587 58540 63683 42525 20840 -12550 -55872 -41247 5124 22087 -6432
16222f432l879P022J6116J2225J0682o978K7147Q267l2990n9993J9017K9287j7396
$$ -6432 -10311 -3289 12827 25052 35734 28756 55903 64170 31180 -28813 -9796 19491 2095
16209B095l0185m7157j4056N6362L6393k5169k7017M2610k5510K3424M2268K9855
$$ 2095 -28090 -75247 -89303 -32941 3452 -21717 -48734 -6124 -31634 -8210 34058 63913
16197F3913J4322M099l0575R185J3564K1144J339l6819q6959j0372Q8222k4175
$$ 63913 78235 82334 51759 60944 74508 95652 96991 60172 -26787 -37159 51063 26888
16185B6888o7960N735k293P315K4010K751J9559N912k2778m1188k1675L3510M996
$$ 26888 -41072 -35337 -37630 -30315 -6305 -3554 16005 21917 -861 -42049 -63724 -30214 -25218
16172b5218N647m0056M1586M6521O654J3953K8654j3869j2721k4812q1625p4679
$$ -25218 -19571 -59627 -18041 28480 35134 49087 77741 63872 51151 26339 -55286 -129965
16160a29965K2138K9516K5188K108m1635K1902M8042L3073l8708j3629M812j3445
$$ -129965 -107827 -78311 -53123 -51015 -92650 -70748 -22706 10367 -28341 -41970 -37158 -50603
16148e0603j4475m640K6609k930J3457l1550P434j5573k8325J0310J5123O0309
$$ -50603 -65078 -69718 -43109 -46039 -32582 -64132 -56698 -72271 -100596 -90286 -75163 -14854
16136a4854M6163n8420n0637K5566L0233j7181k6784J5584L9337L6953M267m510
$$ -14854 31309 -27111 -77748 -52182 -21949 -39130 -65914 -50330 -10993 25960 30227 25717
16124B5717j013j5238J496m2295j5708K3294J2075J7110M1429n5778k3762K9398
$$ 25717 24704 9466 10962 -31333 -47041 -23747 -11672 5438 46867 -8911 -32673 -3275
16112c275j2641l5667Q405Q339K944L090j4947J8433J1575j5080L7195J6507q970
$$ -3275 -15916 -51583 -43178 -34839 -31895 -28805 -43752 -25319 -13744 -28824 8371 24878 15908
16099A5908O861K733l6227m9088K2361K810m8832k2970O2567m836p873J4566J2719
$$ 15908 22769 25502 -10725 -59813 -37452 -34642 -83474 -106444 -43877 -48713 -56586 -42020 -29301
16086b9301N578P818k0883m987J5718L8386J2086J9797j5452N4803K158l8445
$$ -29301 -23723 -15905 -36788 -41775 -26057 12329 24415 44212 28760 83563 85721 47276
16074D7276l9612o26L631M072m2069O969O345N2690L9963j4068k2207l6619k4977
$$ 47276 7664 7038 10669 14741 -27328 -20359 -14014 38676 78639 64571 42364 5745 -19232
16061a9232L2722R550J3165j6117P040j2741K988R913L9834k8398P307q694L4239
$$ -19232 13490 23040 36205 20088 27128 14387 17375 27288 67122 38724 46031 37337 71576
16048G1576J2057j0049n1125O396L0180J3308K0827m6019l5009j1749M223J1628
$$ 71576 83633 73584 22459 28855 59035 72343 93170 47151 12142 393 4616 16244
16036A6244m331L043k2976k8094o201N6343P079K436J2n595k1963m568l3919J6007
$$ 16244 11913 14956 -8020 -36114 -42315 14028 21107 23543 23555 17960 -4003 -8571 -42490 -26483
16022b6483J9391j3698J2306j0977r233k3814k597N4350J7428m3815J4022L9541
$$ -26483 -7092 -20790 -8484 -19461 -28694 -52508 -55105 -755 16673 -27142 -13120 26421
16010B6421o9965m1520N3089K4895o2649k399M3508L329o937l1130R04N7125L1641
$$ 26421 -43544 -85064 -31975 -7080 -69729 -72128 -28620 -25291 -32228 -63358 -62454 -5329 26312
15997B6312m9053p388J4386N3547O807m5724p146j4773j703J4451J602K9161n0808
$$ 26312 -22741 -30129 -15743 37804 44611 -1113 -8259 -23032 -24735 -10284 -8682 20479 -30329
15984c0329k4411N6757N5541k0108k8724j7263k0480k0771M539M000M0021M1069
$$ -30329 -54740 2017 57558 37450 8726 -8537 -29017 -49788 -45249 -41249 -1228 39841
15972C9841j6696n831K8298j6849j9918J2730K729K4773J0363n3928l5025k8999
$$ 39841 23145 17314 45612 28763 8845 21575 24304 49077 59440 5512 -29513 -58512
15960e8512o251J9956J0773J9921P255R349K519l373J3616O926m662n464P5999
$$ -58512 -64763 -44807 -34034 -14113 -6858 2491 5010 1637 15253 22179 17517 12053 88052
15947H8052L9562n0581k7468l3396k0830M572k9509K1938J8472R652M1524L8413
$$ 88052 127614 77033 49565 16169 -4661 -89 -29598 -7660 10812 20464 61988 100401
15935A00401l5388m1337k9907K9925M6401J1692k9339L53l0584k6993j2163N078
$$ 100401 65013 23676 -6231 23694 70095 81787 52448 52801 22217 -4776 -16939 -11861
15923a1861j0651J6235j4140r241J2982m417J4729k5031k1012r624M0335J5728
$$ -11861 -22512 -6277 -20417 -29658 -16676 -21093 -6364 -31395 -52407 -62031 -21696 -5968
15911e968j5177J4472k2421j675J2428j2995o6382L4346O5793O5948j7990k9356
$$ -5968 -21145 -6673 -29094 -30769 -18341 -31336 -97718 -63372 2421 68369 50379 21023
15899B1023l3219K1943L4325L382l254J6441m874J1863n1289q340M3376o824l8961
$$ 21023 -12196 9747 44072 47454 44200 60641 55767 67630 16341 8001 51377 44553 5592
15886E592q654R496J215j2843J7880J1086l6727j8271K000l7765M7318K3175R588
$$ 5592 -3062 6434 7649 -5194 12686 23772 -12955 -31226 -29226 -66991 -19673 3502 13090
15873A3090M683J0386k2454Q758L179l7484J1921K6172R063k2821k4452K2859
$$ 13090 17773 28159 5705 14463 17642 -19842 -7921 18251 27314 4493 -19959 2900
15861B900l141m0931r260N5865K0953R379l6841n2190J2243K2681m342J1789j6624
$$ 2900 -241 -41172 -50432 5433 26386 35765 -1076 -53266 -41023 -18342 -22684 -10895 -27519
15848b7519n161J5595R016L1288K7727k6725m5185J3079M2415l722j0494k1053
$$ -27519 -32680 -17085 -8069 23219 50946 24221 -20964 -7885 34530 30808 20314 -739
15836g39J6756J341L4173M8085j9773p4737o1135L3040K9117K8782l0908J9368
$$ -739 16017 17358 51531 99616 79843 5106 -56029 -22989 6128 34910 4002 23370
15824B3370R769K7076L3652k2975p9532k2342L7086j1948k2069Q717n0721l8600
$$ 23370 33139 60215 93867 70892 -8640 -30982 6104 -5844 -27913 -19196 -69917 -108517
15812a08517K5741M0674O3956m3161l7078P0350L2090j9900n60j4353m3076o939
$$ -108517 -82776 -42102 21854 -21307 -58385 11965 44055 24155 23595 9242 -33834 -40773
15800d0773M9382M7461k3675l9157j0109k2709P753P537K3593J9279J696M7173
$$ -40773 8609 56070 32395 -6762 -16871 -39580 -31827 -24290 -697 18582 20278 67451
15788F7451K062j0741n4058l5636K1031J3294k0250m5533l2269k1777L4612L4255
$$ 67451 69513 58772 4714 -30922 -9891 3403 -16847 -62380 -94649 -116426 -81814 -47559
15776d7559R540L8319k483L5608L2095k084l027k0346j7470P040L0620p917j2617
$$ -47559 -38019 300 -2183 33425 65520 63436 60409 40063 22593 29633 60253 52336 39719
15763C9719M1479M3120k1529k8696m9708o497m3217j7003J0411K0399l2366j6615
$$ 39719 81198 124318 102789 74093 24385 17888 -25329 -42332 -31921 -11522 -43888 -60503
15751f0503K4805L3533o072K6014K7178j8074J5486L3827o5361n3795J2648P10
$$ -60503 -35698 -2165 -8237 17777 44955 26881 42367 76194 10833 -42962 -30314 -29604
15739b9604L1125O712K148M5009P030k5650n5841k6332k2786j2131J0921J2306
$$ -29604 1521 8233 10381 55390 62420 36770 -19071 -45403 -68189 -80320 -69399 -57093
15727e7093Q866K2827N100J2570R522k5856m7818N2178M3878l4250K1678L411
$$ -57093 -48227 -25400 -20300 -7730 1792 -24064 -71882 -19704 24174 -10076 11602 15013
15715A5013l201K0007Q39l877J2317J7088P8019K5296R422j9222p0624n5055m2517
$$ 15013 11812 31819 32658 28781 41098 58186 136205 161501 170923 151701 81077 26022 -16495
15702a6495m3240l8197n7729J5276M3425L5465K5391K1345R26k3517j0449J1420
$$ -16495 -59735 -97932 -155661 -140385 -96960 -61495 -36104 -14759 -13833 -37350 -47799 -36379
15690c6379J8219M5891J7872J7559j8654k4747k7810k9950M9J6681J0870q7n509
$$ -36379 -18160 27731 45603 63162 44508 19761 -8049 -37999 -37950 -21269 -10399 -10486 -15995
15677a5995l2834J5600O0454O87k4428l4132o022P924J431j2976J8624M0048l3783
$$ -15995 -48829 -33229 27225 27912 3484 -30648 -36670 -28746 -27315 -40291 -21667 18381 -15402
15664a5402J436K0387k682o290K1041j2644r931p769K1150l360k0794m8502J261
$$ -15402 -13966 6421 3739 -2551 18490 5846 -4085 -11854 9296 5936 -14858 -63360 -62099
15651f2099K6540j1299L9596M4953O992J845j8289J2144l3128n0885L9620K9643
$$ -62099 -35559 -46858 -7262 37691 44683 46528 28239 40383 7255 -43630 -4010 25633
15639B5633m1038j6980j9072j2639P5171K5940R138k0957k1745L4822L0291k7851
$$ 25633 -15405 -32385 -51457 -64096 11075 37015 46153 25196 3451 38273 68564 40713
15627D0713k8895J3793K6367l3094j1174l992p0218j8559N7140L46k7093k5778
$$ 40713 11818 25611 51978 18884 7710 3718 -66500 -85059 -27919 -27573 -54666 -80444
15615h0444L0055K1863M5242K425L3665M3143J0172m5536o540j7384m823l1503
$$ -80444 -50389 -28526 16716 19141 52806 95949 106121 60585 54045 36661 31838 335
15603C35J0278K3169r399J0837K7692j3350r752K3564J2051l7555K0138R966k4181
$$ 335 10613 33782 24383 35220 62912 49562 39810 63374 75425 37870 58008 67974 43793
15590D3793j3353O298j5857j4883J2315j2598p524J3435L010j3899L0909L8870
$$ 43793 30440 36738 20881 5998 18313 5715 -1809 11626 14636 737 31646 70516
15578G0516m3694p1567p730O7504M0552k0152l3742k0972k749M884J8102K8695
$$ 70516 26822 -44745 -52475 15029 55581 35429 1687 -19285 -22034 -17150 952 29647
15566B9647l3269J0274m9805k2893J921L0539K680Q260K800Q490M0076q916m8156
$$ 29647 -3622 6652 -43153 -66046 -64125 -33586 -30906 -22646 -19846 -11356 28720 19804 -28352
15553b8352K745K8658j0920o592j665m2457M097j1240p323L5550j3593j1422J253
$$ -28352 -25607 3051 -7869 -14461 -16126 -58583 -54486 -65726 -73049 -37499 -51092 -62514 -61261
15540f1261J448j5363m857N537L513J3304O6009K7296j4171k3055K4722q267l6277
$$ -61261 -59813 -75176 -80033 -74496 -70983 -57679 8330 35626 21455 -1600 23122 14855 -21422
15527b1422k598j2068M1398L1098Q007k9595m406j059R997k7208q876R724J2537
$$ -21422 -24020 -36088 5310 36408 44415 14820 10414 9355 19352 -7856 -16732 -7008 5529
15514E529J4454J9418l2928l3882R506K0608j1313j6729J5965J4368k518j4714
$$ 5529 19983 39401 6473 -27409 -17903 2705 -8608 -25337 -9372 4996 2478 -12236
15502a2236L626j6092j3718J434K4372L6415j9964k2891l7454K3648j378J1708
$$ -12236 -8610 -24702 -38420 -36986 -12614 23801 3837 -19054 -56508 -32860 -34238 -22530
15490b2530n923j4775M8763l4831L8809L2188p7345r307L0429L5120M5157j53
$$ -22530 -28453 -43228 5535 -29296 9513 41701 -35644 -44951 -14522 20598 65755 65602
15478F5602k8997R806k4740J3094L7335K092m3615r189J1997k1038k650J6830
$$ 65602 36605 46411 21671 34765 72100 74192 30577 21388 33385 12347 9697 26527
15466B6527k5909J776j126J2641j3325L0710k8570n0577J8619k6986J2443K1962
$$ 26527 618 2394 1268 13909 584 31294 2724 -47853 -29234 -56220 -43777 -21815
15454b1815K9872M8833R518k1764k9378j4343K6437j2766n8367l4212k3415M2576
$$ -21815 8057 56890 66408 44644 15266 923 27360 14594 -43773 -77985 -101400 -58824
15442e8824K5866J3947J6600k535j218r403j9242J6563l600j6516k449J561L3774
$$ -58824 -32958 -19011 -2411 -4946 -6164 -15567 -34809 -18246 -21846 -38362 -40811 -39250 -5476
15429e476n566o8496J3275N7935P011l1688k6211M0313j930k9442M7749O6216
$$ -5476 -11042 -79538 -66263 -8328 -1317 -33005 -59216 -18903 -20833 -50275 -2526 63690
15417F3690J938m2946k7863J1981M0231L2429n6000k8679k5083q878R577N2612
$$ 63690 65628 22682 -5181 6800 47031 79460 23460 -5219 -30302 -39180 -29603 23009
15405B3009K9614n0876j672K5176J3816N347L447k85l6723L4062K8515l2399k9345
$$ 23009 52623 1747 75 25251 39067 44414 47861 47576 10853 44915 73430 41031 11686
15392A1686m1265l806J9810l6463J3742K3915M3990K1376l7165J9161k366l7952
$$ 11686 -29579 -33385 -13575 -50038 -36296 -12381 31609 52985 15820 34981 32615 -5337
15380e337M2473J3867K058Q034O167j5997j9329l9581j0921K405m687j4614k0268
$$ -5337 37136 51003 53061 61095 67262 51265 31936 -7645 -18566 -16161 -20848 -35462 -55730
15367e5730L7898K176n0050l967K2287O743m004K6261N975j1694J0447J4864L0739
$$ -55730 -17832 -15656 -65706 -69673 -47386 -40643 -44647 -18386 -12411 -24105 -13658 1206 31945
15354C1945j074N52K6588j505r326K6640L4405J3023Q736K0674k2514o432j0500
$$ 31945 30871 31423 58011 56506 47180 73820 108225 121248 129984 150658 128144 121712 111212
15341A11212J2338M1914m5183p7276k7917n129k8300M427J2518P0812K7880M26
$$ 111212 123550 165464 120281 43005 15088 9959 -18341 -13914 -1396 69416 97296 97722
15329I7722k0501j1660l8961j280j0428M216k4712l3012L3511N3402J5661n4217
$$ 97722 77221 65561 26600 25320 14892 19108 -5604 -38616 -5105 48297 63958 9741
15317I741k6137k2714N69L8568k3072k6567K3821n926k7558J4182J1357J0103
$$ 9741 -16396 -39110 -38541 27 -23045 -49612 -25791 -31717 -59275 -45093 -33736 -23633
15305b3633j612J9109k9154k2778K4932K8433O8209l7390N416n010j9649j581
$$ -23633 -25245 -6136 -35290 -58068 -33136 -4703 63506 26116 31532 26522 6873 5292
15293E292j8973K971j1900J8377J8956l923J5165l2985k5133K9257L1740O360
$$ 5292 -13681 -10710 -22610 -4233 14723 10800 25965 -7020 -32153 -2896 28844 35204
15281C5204n809n5714o1835N2560N1752N5061J5069j9307m7445n0957J9116N8151
$$ 35204 29395 -26319 -88154 -35594 16158 71219 86288 66981 19536 -31421 -12305 45846
15269D5846M824j1293j9326l4415k4904l2560P098O1214j0895j8316K5134L8166
$$ 45846 50670 39377 20051 -14364 -39268 -71828 -64730 -3516 -14411 -32727 -7593 30573
15257C0573R948j0162j0072J2036l7457k5272j1946k9079K1586J6823j375R848
$$ 30573 40521 30359 20287 32323 -5134 -30406 -42352 -71431 -49845 -33022 -34397 -24549
15245b4549j2796L521m378l4854J2061K248N807L5614k3107Q201Q2663Q901k5915
$$ -24549 -37345 -33824 -38202 -73056 -60995 -58747 -52940 -17326 -40433 -32232 50431 59332 33417
15232C3417k2759J1179k9327o230L9535P3388K4272K4408k2703o4022k8814o7739
$$ 33417 10658 21837 -7490 -13720 25815 99203 123475 147883 125180 61158 32344 -35395
15220c5395j6269M1796M9739j0277l9502l4743l774K854k721K3453K5666M0869
$$ -35395 -51664 -9868 39871 29594 -9908 -44651 -48425 -45571 -48292 -24839 827 41696
15208D1696J7611k5878k6693l734r16j7503K3541k0873r549M9274M434j0286L97
$$ 41696 59307 33429 6736 3002 2086 -15417 8124 -12749 -22298 26976 31410 21124 21521
15195B1521l212K3248L1299l6630m2529j7371J2040n950L6107N2627l439q7998
$$ 21521 18309 41557 72856 36226 -6303 -23674 -11634 -17584 18523 71150 67711 -20287
15183b0287l500K4480j7564j2490J0608J4961j0366K5562K5444o789N1493l1769
$$ -20287 -23787 693 -16871 -29361 -18753 -3792 -14158 11404 36848 30059 81552 49783
15171D9783p0148j6743R987L4161K6888l933J1835p1318l5463N6212j3802k2135
$$ 49783 -20365 -37108 -27121 7040 33928 29995 41830 -29488 -64951 -8739 -22541 -44676
15159d4676R030q932O605L921K8031L13J5044K4327L2181q913J390M6930l8176
$$ -44676 -35646 -44578 -37973 -34052 -6021 -5708 9336 33663 65844 56931 58321 105251 67075
15146F7075L980Q569k6863j5615k8114k8364m8650m283J3657J2609P4086O6597
$$ 67075 71055 79624 52761 37146 9032 -19332 -67982 -72265 -58608 -45999 28087 94684
15134I4684m292k3655k3352o1894j9737j80J096k0011j7260J8130M7899K7621
$$ 94684 90392 66737 43385 -18509 -38246 -38426 -37330 -57341 -74601 -56471 -8572 19049
15122A9049K9899N272l0856J3252J1867m9587k8119k1231K642P834k0715L5838
$$ 19049 48948 54220 23364 36616 48483 -1104 -29223 -50454 -47812 -39978 -60693 -24855
15110b4855K3387M0525J9223N4981j2875m1128j3999k4362K734M94k5921j8043
$$ -24855 -1468 39057 58280 113261 100386 59258 45259 20897 23631 24125 -1796 -19839
15098a9839m8448l1488J6647Q0677L7851k161n9456K077J3511J5709J9534j9940
$$ -19839 -68287 -99775 -83128 -2451 35400 33239 -26217 -24140 -10629 5080 24614 4674
15086D674L9686M8296l9059q1687J6868P787q775L8676k4548p7867L532K3635
$$ 4674 44360 92656 53597 -28090 -11222 -3435 -12210 26466 1918 -75949 -72417 -48782
15074d8782J9560J2487n780K479k5819j0160N7569M3126m0940M851j8896j9396
$$ -48782 -29222 -16735 -22515 -20036 -45855 -56015 1554 44680 3740 8591 -10305 -29701
15062b9701J4020M6179M1566m4235m0880K1394j6455r206r895o983j6692j6752
$$ -29701 -15681 30498 72064 27829 -13051 8343 -8112 -17318 -27213 -34196 -50888 -67640
15050f7640J6120L0249K4906k4378l4053M464N303N4754J1272k847j5159m1886
$$ -67640 -51520 -21271 3635 -20743 -54796 -50332 -45029 9725 20997 18150 2991 -38895
15038c8895l1056L8359M010k0184K4287L0238j9444m1281K7592K8082J2365m3024
$$ -38895 -69951 -31592 -27582 -47766 -23479 6759 -12685 -53966 -26374 1708 14073 -28951
15026b8951K580K8745Q36M0611M7397J5029j6148m4708M8341k6917n9106m2203
$$ -28951 -26371 2374 3210 43821 91218 106247 90099 45391 93732 66815 7709 -34494
15014c4494k281L119l062j297Q104L7055N017n835k2722N2226K1209j8828l4992
$$ -34494 -36775 -33656 -36718 -38015 -29911 7144 12161 6326 -16396 35830 57039 38211 3219
15001C219j5438J2846o0756r497M6787K1964q344n083l124N1584K4991m0935k7443
$$ 3219 -12219 627 -60129 -69626 -22839 -875 -9219 -14302 -17426 34158 59149 18214 -9229
14988i229J4197j2434q800k723l560J6535j0488l6799j8919K1224K2377o075O813
$$ -9229 4968 -7466 -16266 -18989 -22549 -6014 -16502 -53301 -72220 -50996 -28619 -34694 -27881
14975b7881O9840N3754k3243l9216J3260J6127m4821j4521M5806J3145j5609K5352
$$ -27881 41959 95713 72470 33254 46514 62641 17820 3299 49105 62250 46641 71993
14963G1993m58n6776m0343K2412m336k6970J4175R849J5446J2320k8146P232K0617
$$ 71993 71535 14759 -25584 -3172 -7508 -34478 -20303 -10454 4992 17312 -10834 -3602 17015
14950A7015Q102L8093n4529l8278n292q116P24p481M2139L1274j9057j7763Q210
$$ 17015 25117 63210 8681 -29597 -34889 -43005 -42281 -49762 -7623 23651 4594 -13169 -4959
14937d959r19J9166k6833l6458K3400N8138L8357m145l2850o6728K8485r416M8868
$$ -4959 -5878 13288 -13545 -50003 -26603 31535 69892 65747 32897 -33831 -5346 -14762 34106
14924C4106K0449P893n418k9298N166J2335p04k2126J839J7719l3590l9851j1144
$$ 34106 54555 62448 57030 27732 32898 45233 44529 22403 24242 41961 8371 -31480 -42624
14911d2624q274J484M3515N8224l0006m8514M5568N0996j9147k8665m296P919
$$ -42624 -50898 -49414 -5899 52325 22319 -26195 19373 70369 51222 22557 18261 26180
14899B6180q37j8212j1011j7037m3293k3573p44l7207j9553O6718K6581k0206
$$ 26180 25343 7131 -3880 -20917 -64210 -87783 -88527 -125734 -145287 -78569 -51988 -72194
14887g2194r912M17K5407L4539J6168j2559l5004N500l420j6937J7683M2107l53
$$ -72194 -82106 -81689 -56282 -21743 -5575 -18134 -53138 -47638 -51058 -67995 -50312 -8205 -8558
14874h558K9650N8193k4712n5383k4631K2075P533k044j5750K697L7155j3803
$$ -8558 21092 79285 54573 -810 -25441 -3366 4167 2123 -13627 -10930 26225 12422
14862A2422R962q047L5886j5657m2533j3237K1288L3569K779j090m9099r590K8468
$$ 12422 22384 14337 50223 34566 -7967 -21204 84 33653 36432 35342 -13757 -23347 5121
14849E121J7649m4157p1792K4797K6027K9436K1387m979l139k8920M113J9002
$$ 5121 22770 -21387 -93179 -68382 -42355 -12919 8468 3489 350 -28570 -24457 -5455
14837e455K4860K1505m8194P27L6131J727k0040k5681J2502k0415J3611k3249
$$ -5455 19405 40910 -7284 -6557 29574 31301 11261 -14420 -1918 -22333 -8722 -31971
14825c1971J8519J9771m1275k7218k8910q282J3638m681J9624o510O0335K4582
$$ -31971 -13452 6319 -34956 -62174 -91084 -99366 -85728 -90409 -70785 -77295 -16960 7622
14813G622n979j6875N69K2339q716l9512L1177J1214L7196k4563J0468l191l1413
$$ 7622 1643 -15232 -14663 7676 -1040 -40552 -9375 1839 39035 14472 24940 21749 -9664
14800i664q327k6605J6226J7513m0929K5740M7841M2656J171m4717l0501L6724
$$ -9664 -17991 -44596 -28370 -10857 -51786 -26046 21795 64451 65622 20905 -9596 27128
14788B7128P327L242j6084o3456l1042K2905m409J950K8872K843K2881k9942l0297
$$ 27128 34455 37697 21613 -41843 -72885 -49980 -54389 -52439 -23567 -20724 2157 -27785 -58082
14775e8082j4353K6862j1807M1453m9474j2270L9897J6339l058o154M105k9148
$$ -58082 -72435 -45573 -57380 -15927 -65401 -77671 -37774 -21435 -24493 -30647 -26542 -55690
14763e5690J3669J0041M0691n259K3238J0091l510R867m5069l244m298m6825L5860
$$ -55690 -42021 -31980 8711 3452 26690 36781 33271 43138 -1931 -5175 -9473 -56298 -20438
14750b0438P4400L3175m7628j08263J0547J3349l4197L537M5151J2177K0227j3832
$$ -20438 53962 87137 39509 -68754 -58207 -44858 -79055 -75518 -30367 -18190 2037 -11795
14738a1795M92j4350k4338J2847j5248M6141M9119R335q007R731k250k657k5892
$$ -11795 -11303 -25653 -49991 -37144 -52392 -6251 42868 52203 44196 53927 51677 49020 23128
14725B3128k4208l4081K542K5009J478n9075n680L5386Q606n467K5787K0682l937
$$ 23128 -1080 -35161 -32619 -7610 -6132 -65207 -70887 -35501 -26895 -32362 -6575 14107 10170
14712A0170K4934J3489j386j1742p755j1708K4501K6332J4747j4482l3379m0829
$$ 10170 35104 48593 47207 35465 27710 16002 40503 66835 81582 67100 33721 -7108
14700g108K5601N6190j7652r461k0187m9103q78m7914m743J5263J6289N0657J5989
$$ -7108 18493 74683 57031 47570 27383 -21720 -22598 -70512 -75255 -59992 -43703 6954 22943
14687B2943r996J6394j5218K9119r620k8473k598j1896N0745O100k0522l995o110
$$ 22943 12947 29341 14123 43242 33622 5149 2551 -9345 41400 47500 26978 22983 16873
14674A6873k1087j3977P508M2396l7455j2304L8901J802K5161L380l6996l725
$$ 16873 -4214 -18191 -10683 31713 -5742 -18046 20855 22657 47818 51198 14202 10477
14662A0477n1809j4625K0128K2149l032M3536j810J0978L0807k0471m6401j6917
$$ 10477 -41332 -55957 -35829 -13680 -16712 26824 25014 35992 66799 46328 -73 -16990
14650a6990j154j4399L1320K3797l1105r065m7425m7669M7278L6654p469k411
$$ -16990 -18144 -32543 -1223 22574 -8531 -17596 -65021 -112690 -65412 -28758 -36227 -38638
14638c8638M7441K120K3184L439n4788l8211j1424K9568J728K0164Q359K1074
$$ -38638 8803 10923 34107 37546 -17242 -55453 -66877 -37309 -35581 -15417 -7058 14016
14626A4016k0381J4866K9589j860j9519J0151k1523K0572M2341l3757n5921l0472
$$ 14016 -6365 8501 38090 36230 16711 26862 5339 25911 68252 34495 -21426 -51898
14614e1898K1365r147O874L5566K8882J9199r115k9963j6505K3798N361q785k8605
$$ -51898 -30533 -39680 -32806 2760 31642 50841 41726 11763 -4742 19056 24417 15632 -12973
14601a2973m010j775K6019R707p826M550M6483P262n7l0962o1386l2221M6308
$$ -12973 -16983 -18758 7261 16968 9142 13692 60175 67437 67380 36418 -24968 -57189 -10881
14588a0881N1163J2374k1508k7253j297k7471o774M1663j0607j1968k4044J8159
$$ -10881 40282 52656 31148 3895 2598 -24873 -31647 10016 -591 -12559 -36603 -18444
14576a8444N1652l7863Mo121J2793l4242n1654M2219L1637o379Q230l5047k342
$$ -18444 33208 -4655 -4651 -10772 2021 -32221 -83875 -41656 -10019 -16398 -8168 -43215 -45557
14563d5557o17L2065L1753k0916j4452N728J9008k4218m2238k8951P259O089M7698
$$ -45557 -46174 -14109 17644 -3272 -17724 -11996 7012 -17206 -59444 -88395 -81136 -75047 -27349
14550b7349K2607n1435j8043j7733M3701O6700J7932o621m1072k2185K4503N2775
$$ -27349 -4742 -56177 -74220 -91953 -48252 18448 36380 29759 -11313 -33498 -8995 43780
14538D3780K7375K4537M2727o075k4544k6719l627k3654M3908L7350j1746l1581
$$ 43780 71155 95692 138419 132344 107800 81081 77454 53800 97708 135058 123312 91731
14526I1731j0715k5721J3042j5812K0461M8572j2500m7970m7670M035J9118k2348
$$ 91731 81016 55295 68337 52525 72986 121558 109058 61088 13418 17453 36571 14223
14514A4223l2181K5250q745j8683k6125J4178K2988L316m739K5752j4800m9526
$$ 14223 -17958 7292 -1453 -20136 -46261 -32083 -9095 -5779 -10518 15234 434 -49092
14502d9092j3007J1108N7312j9176m9671k2488J9126Q06L002L1111L7286K7992
$$ -49092 -62099 -50991 6321 -12855 -62526 -85014 -65888 -65082 -62080 -30969 6317 34309
14490C4309K4648l8435k6786p192K3434Q403k532n2417n2750k8902L4194J8324
$$ 34309 58957 20522 -6264 -13456 9978 18381 15849 -36568 -89318 -118220 -84026 -65702
14478f5702p484K3593M7112O4253J8643j7511m7769J9658k8623m8290K3325R846
$$ -65702 -73186 -49593 -2481 61772 80415 62904 15135 34793 6170 -42120 -18795 -8949
14466h949k6223M3631K1178k9775m3863L6706J4593j8127l4406l3822J455N4618
$$ -8949 -35172 8459 29637 -138 -44001 -7295 7298 -10829 -45235 -79057 -77602 -22984
14454b2984M8187J2040j8079j3855N626k9464M5k0510k3073J1663L1642P127J94
$$ -22984 25203 37243 19164 5309 10935 -18529 -18484 -38994 -62067 -50404 -18762 -11635 -11441
14441a1441k6545l97N1607P736j6303n162j6257P427j5111j1020l660L0074L1047
$$ -11441 -37986 -38383 13224 20960 4657 -505 -16762 -9335 -24446 -35466 -39126 -9052 21995
14428B1995P181k757J0604j5426o270J2211l217J8166j5808m9840o7218j0427
$$ 21995 29176 26419 37023 21597 15327 27538 24321 42487 26679 -23161 -90379 -100806
14416a00806J6191K7964K2764M7610J4807k1708n379J9599J7129o8371O116K8715
$$ -100806 -84615 -56651 -33887 13723 28530 6822 1443 21042 38171 -30200 -24084 4631
14404D631q880J8975P338r359k3823m291k364J3768K0866r371K2389j7363m7665
$$ 4631 -4249 14726 22064 12705 -11118 -15409 -17773 -4005 16861 7490 29879 12516 -35149
14391c5149n0700L0982N3366L410P326m1738k8196P1714k9988q1710q120K3230
$$ -35149 -85849 -54867 -1501 1909 9235 -32503 -60699 11015 -18973 -100683 -108803 -85573
14379h5573O5414R345m2576J476M244j2630J329M3899j8318j0722L7533L9237
$$ -85573 -20159 -10814 -53390 -51914 -47670 -60300 -58971 -15072 -33390 -44112 -6579 32658
14367C2658P26o676j2287o651J1724J7963l0880M6644K6939l6348j7884k1043
$$ 32658 33384 26708 14421 7770 19494 37457 6577 53221 80160 43812 25928 4885
14355D885k1092j2002N679n009k883J3453k6374J7050K1229K1856O7l4028J8358
$$ 4885 -16207 -28209 -22530 -27539 -30422 -16969 -43343 -26293 -5064 16792 16859 -17169 1189
14342A189N1097j4127k8229l3387j3235P799j3119R377l5978q083L6636j3854
$$ 1189 52286 38159 9930 -23457 -36692 -28893 -42012 -32635 -68613 -76696 -40060 -53914
14330e3914K2847J8261N8679K777J714n0217m9802Q17O8094M3358l2844j725r167
$$ -53914 -31067 -12806 45873 48650 50364 147 -49655 -48838 19256 62614 29770 28045 18878
14317A8878r671l328M4868K5029j5729L919K4343l0328J4967l0284l4974k6468
$$ 18878 9207 5879 50747 75776 60047 63966 88309 57981 72948 42664 7690 -18778
14305a8778N6443J7977k6936m0402j3108o14J1020k8784N9667K2796l0000m0379
$$ -18778 37665 55642 28706 -11696 -24804 -25418 -14398 -43182 16485 39281 9281 -31098
14293c1098K5136N9497k1902l2089p344j4102n897j5473j2886N2972K970k5064
$$ -31098 -5962 53535 31633 -456 -7800 -21902 -27799 -43272 -56158 -3186 -216 -25280
14281b5280Q000P0894Q070l5272j1932l4325m1676j3263O580l530j6034N0203
$$ -25280 -17280 53614 61684 26412 14480 -19845 -61521 -74784 -68204 -71734 -87768 -37565
14269c7565M835K0303K1236r028j424K2239M490J3608o176O976L750m1427j4162
$$ -37565 -32730 -12427 8809 -219 -1643 20596 25086 38694 32518 39494 43244 1817 -12345
14256a2345o676j8421l3919M5877P260k8601j5224K1512J7750J0686M7375j0195
$$ -12345 -19021 -37442 -71361 -25484 -18224 -46825 -62049 -40537 -22787 -12101 35274 25079
14244B5079j5830j4996r522K9913L6237j1664k0195j3416m2044l4223J4128m237
$$ 25079 9249 -5747 -15269 14644 50881 39217 19022 5606 -36438 -70661 -56533 -60770
14232f0770k812L7128J7840R153j6671m5070O42K9639k737m6346l4828k521K8473
$$ -60770 -63582 -26454 -8614 539 -16132 -61202 -60560 -30921 -33658 -80004 -114832 -117353 -88880
14219h8880K631N1146K7842R151J9361j3171J5220j0606k3936K6900J8545J1226
$$ -88880 -86249 -35103 -7261 1890 21251 8080 23300 12694 -11242 15658 34203 45429
14207D5429O222P071m8855k6323K2852J6664k7666o1094J9338N6471J0287m9931
$$ 45429 51651 58722 9867 -16456 6396 23060 -4606 -65700 -46362 10109 20396 -29535
14195b9535m4448q349K2907N6995m399l5059m5471N8407J4141l1345L6757J9059
$$ -29535 -73983 -82332 -59425 -2430 -6829 -41888 -87359 -28952 -14811 -46156 -9399 9660
14183I660L4131n240k4872n5465k0847J1729K0385K2103N310K2364Q965J9407
$$ 9660 43791 38551 13679 -41786 -62633 -50904 -30519 -8416 -3106 19258 28223 47630
14171D7630O988m6234l2971l2921R142J6659O190q356O8223K893o1431K0077j9863
$$ 47630 54618 8384 -24587 -57508 -48366 -31707 -25517 -33873 34350 37243 -24188 -4111 -23974
14158b3974q962M8918l113L2579M758o174m3246o5176L8577k5661q52M8850n028
$$ -23974 -32936 15982 12869 45448 50206 44032 786 -64390 -25813 -51474 -52326 -3476 -8504
14145h504k7565K625J447j6114k1492K1120L0501k4069M1621j7321k186O1639
$$ -8504 -36069 -33444 -31997 -48111 -69603 -48483 -17982 -42051 -430 -17751 -19937 41702
14133D1702N1851m6108k1412o019P507N264j7409n3775k2499J8389N3714L5477
$$ 41702 93553 47445 26033 20014 27521 32785 15376 -38399 -60898 -42509 11205 46682
14121D6682l9765l2154j8373K8024l652j2151l0720J1385J1232M2142J5135k28
$$ 46682 6917 -25237 -43610 -15586 -19238 -31389 -62109 -50724 -39492 2650 17785 17557
14109A7557j890k5312n3626j8022q980M3292l799M141M4445M4624k791l9466j8510
$$ 17557 15667 -9645 -63271 -81293 -90273 -46981 -50780 -46639 -2194 42430 39639 173 -18337
14096a8337J4746l9188N8056L9235k0424j8990l080q872j8745j0826J663j3585
$$ -18337 -3591 -42779 15277 54512 34088 15098 12018 3146 -15599 -26425 -24762 -38347
14084c8347K5441M0488M4573k6123m2586j0482l6163O118m467q477M2574J5861
$$ -38347 -12906 27582 72155 46032 3446 -7036 -43199 -37081 -41548 -50025 -7451 8410
14072H410k3763J7676j5471m179L6003L7793L876j0416j0396m83j9166r887j1066
$$ 8410 -15353 2323 -13148 -17327 18676 56469 60345 49929 39533 39050 19884 9997 -1069
14059a069k1066l3630O552M5510J7972q057L1832N652J7707o211l9691J3715K570
$$ -1069 -22135 -55765 -49213 -3703 14269 6212 38044 43696 61403 55192 15501 29216 31786
14046C1786n3595k2179j7470J3230J5541K3049O3099m0440q6892l2714J9956M0980
$$ 31786 -21809 -43988 -61458 -48228 -32687 -9638 53461 13021 -73871 -106585 -86629 -45649
14034d5649L8074J0580N676l4849m9710M7938K5748L805k7588L938J128l3312
$$ -45649 -7575 3005 8681 -26168 -75878 -27940 -2192 1613 -25975 -22037 -20909 -54221
14022e4221O751M6111k5339L0497M2490n6190m1585J2785P0810J6454L239p3023
$$ -54221 -47470 -1359 -26698 3799 46289 -9901 -51486 -38701 32109 48563 51802 -21221
14010b1221o0735L7347K0912N5445M5090l9416p103j0544m0174k5113k007L2532
$$ -21221 -81956 -44609 -23697 31748 76838 37422 30319 19775 -20399 -45512 -47519 -14987
13998a4987R767l4218j1947L0528L4916j6816k7708j5117L2851J0480j0630j7780
$$ -14987 -5220 -39438 -51385 -20857 14059 -2757 -30465 -45582 -12731 -2251 -12881 -30661
13986c0661Q248J1379l4907J5663j9281j4753j2719l1726L4197L5720Q402J5910
$$ -30661 -22413 -11034 -45941 -30278 -49559 -64312 -77031 -108757 -74560 -38840 -30438 -14528
13974a4528J392k727M1627J3722m1555O244k5635K443L4333P710k8382r764K1273
$$ -14528 -13136 -15863 25764 39486 -2069 4175 -21460 -19017 15316 23026 -5356 -15120 6153
13961F153K4156k3194m0310O6585N9451j3068J0627L4929m2610o7392l1935l3312
$$ 6153 30309 7115 -33195 33390 92841 79773 90400 125329 82719 15327 -16608 -49920
13949d9920J6036O36l368q268K1324N452o412l0041J7509K7354j7401j0117l2389
$$ -49920 -33884 -33248 -36616 -44884 -23560 -18108 -24520 -54561 -37052 -9698 -27099 -37216 -69605
13936f9605J6873J7847L5006J7912R881J9780n6005m0919L5817Q778M910N2751
$$ -69605 -52732 -34885 121 18033 27914 47694 -8311 -49230 -13413 -4635 275 53026
13924E3026J2157k6422j3835k4192R078K0171m3172J9899l6265l6191M3726K0534
$$ 53026 65183 38761 24926 734 9812 29983 -13189 6710 -29555 -65746 -22020 -1486
13912a486l641K4623l7301J0361L455l1266k4728L3759j3971L476k582J7372o411
$$ -1486 -5127 19496 -17805 -7444 -3989 -35255 -59983 -26224 -40195 -36719 -39301 -21929 -28340
13899b8340j967O8469J4555k2246r881j1534l0448k838L1926N4438m3034l3070
$$ -28340 -30307 38162 52717 30471 20590 9056 -21392 -24230 7696 62134 19100 -13970
13887a3970k3138p864K3153N294j675k813J4565j0605j4090K712R45l882K5319
$$ -13970 -37108 -44972 -21819 -16525 -18200 -21013 -6448 -17053 -31143 -28431 -27486 -31368 -6049
13874f049j4609J6031L9061K407Q437n5747k9169j0536L2775N0064J1396l7085
$$ -6049 -20658 -4627 34434 36841 45278 -10469 -39638 -50174 -17399 32665 44061 6976
13862F976j7504n2507o1960j925L7432N5660M6445L1143k6071k788L5222N255
$$ 6976 -10528 -63035 -124995 -126920 -89488 -33828 12617 43760 17689 14901 50123 55378
13850E5378l6739l2826R804j0473j8204P820J3368j3473K4184K0937J4118P968
$$ 55378 18639 -14187 -4383 -14856 -33060 -25240 -11872 -25345 -1161 19776 33894 41862
13838D1862k0129j1300p657j1648m787m5408m1905O6687o655P6543R2453n6706
$$ 41862 21733 10433 2776 -8872 -13659 -59067 -100972 -34285 -40940 35603 128056 71350
13826G1350l5855l0240l9149K2891J9624K2611l1508m7865k506M0309K7113j344
$$ 71350 35495 5255 -33894 -11003 8621 31232 -276 -48141 -50647 -10338 16775 15431
13814A5431k7812j7586M310M534L6007j3520j4370Q457j2504L5925J0718j9867
$$ 15431 -12381 -29967 -25657 -21123 14884 1364 -13006 -4549 -17053 18872 29590 9723
13802I723p210J4584K8694k1038o5602J0360N7602j0476p2114l530J3892j1582
$$ 9723 2513 17097 45791 24753 -40849 -30489 27113 16637 -55477 -59007 -45115 -56697
13790e6697L1618M8720j062r36P694o9674m3553O175K6028q156K575q404j4556
$$ -56697 -25079 23641 22579 21643 29337 -40337 -83890 -77715 -51687 -59843 -57268 -65672 -80228
13777h0228k8591l520K1439O2937M3395J7324j5690k2241K7300K5115k2654l8409
$$ -80228 -108819 -112339 -90900 -27963 15432 32756 17066 -5175 22125 47240 24586 -13823
13765a3823l536L3421L0728K4710q1868n1372K0560K1721m3072o3482L7909L1534
$$ -13823 -17359 16062 46790 71500 -10368 -61740 -41180 -19459 -62531 -126013 -88104 -56570
13753e6570M9574K9331n5114l1712J0760M8959j493p528o4903l6198L5145L6428
$$ -56570 -6996 22335 -32779 -64491 -53731 -4772 -6265 -13793 -78696 -114894 -79749 -43321
13741d3321K8322K4749K6707K0125m2171L108j750K2515k4462n0862J2081j3065
$$ -43321 -14999 9750 36457 56582 14411 17519 15769 38284 13822 -37040 -24959 -38024
13729c8024L205K907J3022J0476m6149j1191M7375k1551j6668J4349J2318l5565
$$ -38024 -34819 -31912 -18890 -8414 -54563 -65754 -18379 -39930 -56598 -42249 -29931 -65496
13717f5496J337K1653q784P496N1506j3677o8590K7442O2381n005M9081O931n1779
$$ -65496 -64159 -42506 -51290 -43794 7712 -5965 -74555 -47113 15268 10263 59344 66275 14496
13704A4496q3083J2294L7109j4557Q999N656k9893j5044k0063K6570M9387N722
$$ 14496 -68587 -56293 -19184 -33741 -24742 -19086 -48979 -64023 -84086 -57516 -8129 -2407
13692b407J0894J3012J9822m5655J2408M8860j0343l4106r500K8839j5621L2877
$$ -2407 8487 21499 41321 -4334 8074 56934 46591 12485 2985 31824 16203 49080
13680D9080J3595q329k6415k7088m0231L0338o801j7659K3990M0053L614R069
$$ 49080 62675 54346 27931 843 -39388 -9050 -15851 -33510 -9520 30533 34147 43216
13668D3216J9875k9218l8696k5903M22J3483M0556J0723K6875L377n468l8786
$$ 43216 63091 33873 -4823 -30726 -30304 -16821 23735 34458 61333 64710 59242 20456
13656B0456j1362m292l8133m0879k538P412j871K8317k6116j884O1262Q486J7060
$$ 20456 9094 4802 -33331 -74210 -76748 -69336 -71207 -42890 -69006 -70890 -9628 -1142 15918
13643A5918L9898J2406k4954k6563k5783J2028j1198j3831n893L5279K4125k9495
$$ 15918 55816 68222 43268 16705 -9078 2950 -8248 -22079 -27972 7307 31432 1937
13631A937N708k181J82K9621K500M785k3286j4892q707j3386O906l3082m5282
$$ 1937 7645 5464 5646 35267 37767 42552 19266 4374 -4333 -17719 -10813 -43895 -89177
13618h9177k6850K0091P6587J9444P725J8186n1103l8918k1631N2862R990l7242
$$ -89177 -116027 -95936 -19349 95 7820 26006 -25097 -64015 -85646 -32784 -22794 -60036
13606f0036n878M8243L4966J5465P37l5826k4556M390N1991M3958m8932m4531
$$ -60036 -65914 -17671 17295 32760 33497 -2329 -26885 -22495 29496 73454 24522 -20009
13594b0009j9687m5554K7417N8474O099l6284j4165j6193L7680L0883M1469L986
$$ -20009 -39696 -85250 -57833 641 6740 -29544 -43709 -59902 -22222 8661 50130 54116
13582E4116k4586m8513j7927J4530P29M1461k4687J0306J5626l683L966j7707
$$ 54116 29530 -18983 -36910 -22380 -21651 19810 -4877 5429 21055 17372 21338 3631
13570C631q404j6229Q278K9012J130j6746l353J8583l5228j7424K2993L4938J0918
$$ 3631 -4773 -21002 -12724 16288 17418 672 -2681 15902 -19326 -36750 -13757 21181 32099
13557C2099L7183K9665k1104m2365L8034j6570p951n4649l9654n8643R257J7046
$$ 32099 69282 98947 77843 35478 73512 56942 48991 -5658 -45312 -103955 -94698 -77652
13545g7652J06804L527l0236n905j7303K2464K3763K8498n2488m4177p184N0351
$$ -77652 29152 32679 2443 -3462 -20765 1699 25462 53960 1472 -42705 -49889 462
13533D62j4350L7236J2848k886k3354k593L0489K9568J0203n1141j7197j0735
$$ 462 -13888 23348 36196 33310 9956 7363 37852 67420 77623 26482 9285 -1450
13521a450j0105m256l988L1417n970J0956K3577m142k4215K9996L1731j680k2136
$$ -1450 -11555 -15811 -19799 11618 5648 16604 40181 36039 11824 41820 73551 71871 49735
13508D9735l9474j0636J5506j5712j6340j3665j4092L2483K2177K4301K317J9296
$$ 49735 10261 -375 15131 -581 -16921 -30586 -44678 -12195 9982 34283 36600 55896
13496E5896p298o6426M102K775o3706k4580K769K6699J1486N3083N879j9619o45
$$ 55896 48598 -17828 -13726 -10951 -74657 -99237 -96468 -69769 -58283 -5200 679 -18940 -19585
13483a9585J6347K1031K9177M982l4493k5781Q917k7901K7706M1151m78k6291
$$ -19585 -3238 17793 46970 51952 17459 -8322 595 -27306 400 41551 41073 14782
$$ [...]
##END NTUPLES=NMR SPECTRUM
##END=
