##TITLE=Analysis number 312674
Compound Code ac 35768
Project Code qc-cat
Chemist Name andyc
##JCAMPDX= 6.0         $$ Bruker NMR JCAMP-DX V2.0
##DATA TYPE= NMR SPECTRUM
##DATA CLASS= NTUPLES
##ORIGIN= Bruker BioSpin GmbH
##OWNER= NMR
$$ XWIN-NMR		Version 3.5
$$ Wed Aug 10 15:09:13 2005 GMT Daylight Time (UT+1h)  MAYBRIDGE\NMR@NMR_250MHZ
##.OBSERVE FREQUENCY= 250.131544655141
##.OBSERVE NUCLEUS= ^1H
##.ACQUISITION MODE= SIMULTANEOUS (DQD)
##.ACQUISITION SCHEME= undefined
##.AVERAGES= 16
##.DIGITISER RES= 18
##SPECTROMETER/DATA SYSTEM= dpx250
##.PULSE SEQUENCE= zg30
##.SOLVENT NAME= DMSO
##.SHIFT REFERENCE= (INTERNAL, DMSO, 0, 16.522)
##AUDIT TRAIL= $$ (NUMBER, WHEN, WHO, WHERE, WHAT)
$$ ##TITLE= Audit trail, XWIN-NMR		Version 3.5
$$ ##JCAMPDX= 5.01
$$ ##ORIGIN= Bruker BioSpin GmbH
$$ ##OWNER= NMR
$$ C:\u/data/dgb/nmr/ADRS/7500/pdata/1/auditp.txt
$$ ##AUDIT TRAIL=  $$ (NUMBER, WHEN, WHO, WHERE, WHAT)
(   1,<2005-08-10 15:08:56.28 +100>,<MAYBRIDGE\NMR>,<NMR_250MHZ>,
      <created by zg, POWCHK disabled, PULCHK disabled
       configuration hash MD5:
       62 19 C7 07 E1 42 D1 B7 37 6C 3D D0 77 39 F9 E6
       data hash MD5: 64K
       A5 96 17 C1 25 3F 0E 77 BC 0B 04 DC 39 76 54 E2>)
(   2,<2005-08-10 15:09:06.82 +100>,<MAYBRIDGE\NMR>,<NMR_250MHZ>,
      <Start of raw data processing
       ef LB = 0.3 FT_mod = 6 PKNL = 1 SI = 32K 
       data hash MD5: 32K
       73 E7 CA 0C D8 00 74 FF 22 EC 42 7C 14 E4 C2 8E>)
(   3,<2005-08-10 15:09:08.50 +100>,<MAYBRIDGE\NMR>,<NMR_250MHZ>,
      <apk 
       data hash MD5: 32K
       DD 91 9E 10 39 82 B0 27 B9 E4 65 65 12 56 A4 E6>)
(   4,<2005-08-10 15:09:09.20 +100>,<MAYBRIDGE\NMR>,<NMR_250MHZ>,
      <abs ABSG = 5 
       data hash MD5: 32K
       4F DE B1 D0 CB 3B A0 F4 5E 69 EF 58 B8 31 13 62>)
$$ ##END=
$$ 
$$ hash MD5
$$ BB 39 78 98 08 11 C5 3F FD E2 BD A2 CE 48 9F 5B
##$RELAX= 
##$RELAX= 
##$RELAX= 
##$RELAX= 
##$RELAX= 
##$RELAX= 
##$RELAX= 
$$ Bruker specific parameters
$$ --------------------------
##$DU= <C:\u>
##$EXPNO= 7500
##$NAME= <ADRS>
##$PROCNO= 1
##$TYPE= <nmr>
##$USER= <dgb>
##$AMP= (0..31)
100 100 100 100 100 100 100 100 100 100 100 100 100 100 100 100 100 100 
100 100 100 100 100 100 100 100 100 100 100 100 100 100 
##$AQSEQ= 0
##$AQ_mod= 3
##$AUNM= <au_zg>
##$AUTOPOS= <41 >
##$BF1= 250.13
##$BF2= 250.13
##$BF3= 250.13
##$BF4= 250.13
##$BF5= 500.13
##$BF6= 500.13
##$BF7= 500.13
##$BF8= 500.13
##$BYTORDA= 1
##$CFDGTYP= 0
##$CFRGTYP= 5
##$CHEMSTR= <none>
##$CNST= (0..31)
1 1 145 1 1 1 1 1 1 1 1 1 1 1 1 1 1 1 1 1 1 1 1 1 1 1 1 1 1 1 1 1 
##$CPDPRG= <>
##$CPDPRG1= <>
##$CPDPRG2= <>
##$CPDPRG3= <>
##$CPDPRG4= <mlev>
##$CPDPRG5= <mlev>
##$CPDPRG6= <mlev>
##$CPDPRG7= <mlev>
##$CPDPRG8= <mlev>
##$CPDPRGB= <>
##$CPDPRGT= <>
##$D= (0..31)
0 1 0 0 0 0 0 0 0 0.06 0 0 0 0 0 0 0.0002 0 0 0 0 0 0 0 0 0 0 0 0 0 0 
0 
##$DATE= 1123682935
##$DBL= (0..7)
120 120 120 120 120 120 120 120 
##$DBP= (0..7)
150 150 150 150 150 150 150 150 
##$DBP07= 0
##$DBPNAM0= <>
##$DBPNAM1= <>
##$DBPNAM2= <>
$$ [...]
##$SUBNAM7= <"">
##$SUBNAM8= <"">
##$SUBNAM9= <"">
##$SW= 20.6930455092707
##$SWIBOX= (0..15)
0 0 3 0 0 0 0 0 0 0 0 0 0 0 0 0 
##$SW_h= 5175.983436853
##$TD= 65536
##$TD0= 1
##$TE= 295.16
##$TE2= 300
##$TE3= 300
##$TEG= 300
##$TL= (0..7)
0 120 120 120 120 120 120 120 
##$TP= (0..7)
150 150 150 150 150 150 150 150 
##$TP07= 0
##$TPNAME0= <>
##$TPNAME1= <>
##$TPNAME2= <>
##$TPNAME3= <>
##$TPNAME4= <>
##$TPNAME5= <>
##$TPNAME6= <>
##$TPNAME7= <>
##$TPOAL= (0..7)
0.5 0.5 0.5 0.5 0.5 0.5 0.5 0.5 
##$TPOFFS= (0..7)
0 0 0 0 0 0 0 0 
##$TUNHIN= 0
##$TUNHOUT= 0
##$TUNXOUT= 0
##$USERA1= <user>
##$USERA2= <user>
##$USERA3= <user>
##$USERA4= <user>
##$USERA5= <user>
##$V9= 5
##$VALIST= <valist>
##$VCLIST= <CCCCCCCCCCCCCCC>
##$VD= 0
##$VDLIST= <DDDDDDDDDDDDDDD>
##$VPLIST= <PPPPPPPPPPPPPPP>
##$VTLIST= <TTTTTTTTTTTTTTT>
##$WBST= 1024
##$WBSW= 4
##$XGAIN= (0..3)
0 0 0 0 
##$XL= 0
##$YL= 0
##$YMAX_a= 428708
##$YMIN_a= -429950
##$ZGOPTNS= <>
##$ZL1= 120
##$ZL2= 120
##$ZL3= 120
##$ZL4= 120
##$ABSF1= 16.522
##$ABSF2= -4.171173
##$ABSG= 5
##$ABSL= 3
##$ALPHA= 0
##$AQORDER= 0
##$ASSFAC= 0
##$ASSFACI= 0
##$ASSFACX= 0
##$ASSWID= 0
##$AUNMP= <proc_1d>
##$AZFE= 0.1
##$AZFW= 0.1
##$BCFW= 0
##$BC_mod= 0
##$BYTORDP= 0
##$COROFFS= 0
##$CY= 12.5
##$DATMOD= 1
##$DC= 0
##$DFILT= <>
##$DTYPP= 0
##$F1P= 14.0000005364418
##$F2P= -0.99999901652339
##$FCOR= 0.5
##$FTSIZE= 32768
##$FT_mod= 6
##$GAMMA= 0
##$GB= 0
##$INTBC= 1
##$INTSCL= 1
##$ISEN= 128
##$LB= 0.3
##$LEV0= 0
##$LPBIN= 0
##$MAXI= 10000
##$MC2= 0
##$MEAN= 0
##$ME_mod= 0
##$MI= 0
##$NCOEF= 0
##$NC_proc= -3
##$NLEV= 6
##$NOISF1= 0
##$NOISF2= 0
##$NSP= 0
##$NTH_PI= 0
##$NZP= 0
##$OFFSET= 16.522
##$PC= 1
##$PHC0= -90.68675
##$PHC1= 4.437178
##$PH_mod= 1
##$PKNL= yes
##$PPARMOD= 0
##$PSCAL= 4
##$PSIGN= 0
##$REVERSE= no
##$SF= 250.13
##$SI= 32768
##$SIGF1= 0
##$SIGF2= 0
##$SINO= 400
##$SIOLD= 32768
##$SREGLST= <1H.DMSO>
##$SSB= 0
##$STSI= 32768
##$STSR= 0
##$SW_p= 5175.98343685301
##$SYMM= 0
##$S_DEV= 0
##$TDeff= 65536
##$TDoff= 0
##$TI= <Analysis number 999999
Compound Code 99
Book Reference 9
Project Code 9>
##$TILT= no
##$TM1= 0
##$TM2= 0
##$TOPLEV= 0
##$USERP1= <user>
##$USERP2= <user>
##$USERP3= <user>
##$USERP4= <user>
##$USERP5= <user>
##$WDW= 1
##$XDIM= 32768
##$YMAX_p= 407360527
##$YMIN_p= -387538
$$ End of Bruker specific parameters
$$ ---------------------------------
##NTUPLES= NMR SPECTRUM
##VAR_NAME=  FREQUENCY,     SPECTRUM/REAL,   SPECTRUM/IMAG
##SYMBOL=    X,             R,               I
##VAR_TYPE=  INDEPENDENT,   DEPENDENT,       DEPENDENT
##VAR_FORM=  AFFN,          ASDF,            ASDF
##VAR_DIM=   32768,         32768,           32768
##UNITS=     HZ,            ARBITRARY UNITS, ARBITRARY UNITS
##FACTOR=    0.157963299565203, 1,           1
##FIRST=     4132.6476996994, 0,             0
##LAST=      -1043.33573715361, 0,           0
##MIN=       -1043.33573715361, -387538,     0
##MAX=       4132.6476996994, 407360527,     0
$$ Real data points
##PAGE= N=1
##DATA TABLE= (X++(R..R)), XYDATA
$$ [...]
15766d3406K2661K6696J4383K217r566L048P995n085j0854M194J2704k5492J645
$$ -43406 -20745 5951 20334 22551 12985 16033 24028 18943 8089 12283 24987 -505 1140
15753A140J4498m661O4J2828j008j5756j513p595R477n568R366K309j8102J9377
$$ 1140 15638 10977 11041 23869 22861 7105 5592 -2003 7474 1906 11272 13581 -4521 14856
15739A4856m242k5256J8487M087l682p311J2809M359n155j070J1546K8884k0515
$$ 14856 10614 -14642 3845 7932 4250 -3061 9748 14107 8952 7882 19428 48312 27797
15726B7797l3134Q925K9151j2602l32m55p495j3023J9962J844r473L99j0067j0653
$$ 27797 -5337 3588 32739 20137 19805 19350 11855 -1168 18794 20638 11165 11564 1497 -9156
15712i156K554N43o01j3942k0416J5688j3232J075l8236j4968M7222J5545j4937
$$ -9156 -6602 -6059 -6660 -20602 -41018 -25330 -38562 -37487 -75723 -90691 -43469 -27924 -42861
15699d2861m94L7087Q271J4932Q705k1556l9759j6427K6066L7990r332k2745l7213
$$ -42861 -43355 -6268 2003 16935 25640 4084 -35675 -52102 -26036 11954 2622 -20123 -57336
15686e7336p04K0069J6967j6668k7625L2322L8624J922q851Q221j3515p116J6321
$$ -57336 -58040 -37971 -21004 -37672 -65297 -32975 5649 7571 -1280 6941 -6574 -13690 2631
15673B631k535m18l107N133k1440O242n562j9759J0138P142n493K008K1700L763
$$ 2631 96 -322 -3429 1704 -19736 -13494 -19056 -38815 -28677 -21535 -27028 -25020 -3320 443
15659D43j222m98k159k5149O605L0384k35R523p785j3213J273k692Q289p055J0534
$$ 443 -779 -1277 -3436 -28585 -21980 8404 8169 17692 9907 -3306 -2033 -4725 3564 -3491 7043
15644G043q801m225J5137J0870k154k1169m627j2911k695P970O234Q660J1983
$$ 7043 -1758 -5983 9154 20024 17870 -3299 -7926 -20837 -23532 -15562 -9328 -668 11315
15631A1315J0241j8522l3793K6679p994j5507Q995L2839p798j7130j3286M398
$$ 11315 21556 3034 -30759 -4080 -12074 -27581 -18586 14253 6455 -10675 -23961 -19563
15619a9563p826J3198N628n000J9985l379K6025K590J1495J874m494l7452j6525
$$ -19563 -27389 -14191 -8563 -13563 6422 3043 29068 31658 43153 45027 40533 3081 -13444
15606a3444N490R636J7564j0093l9597r384L2926O721k6098j7486J597L9931J2203
$$ -13444 -7954 1682 19246 9153 -30444 -39828 -6902 -181 -26279 -43765 -42168 -2237 9966
15593I966L175j39m674K582j1342k0844J1693J5184j3999m50j8761j6732J5928
$$ 9966 13141 13002 8328 10910 -432 -21276 -9583 5601 -8398 -8848 -27609 -44341 -28413
15580b8413P14K3220K0416O2P676k9025K967q459o964L2173l806q689L396J9299
$$ -28413 -27699 -4479 15937 15999 23675 -5350 -2383 -10842 -17806 14367 10561 1872 5268 24567
15566B4567p787l8669l2055L470K0407K5664N913J077J1686k3736j0807K8928
$$ 24567 16780 -21889 -53944 -50474 -30067 -4403 1510 2587 14273 -9463 -20270 8658
15554H658q572K025K0868p26m0124j3119r45P519J0532l680j7675m794K7874J8615
$$ 8658 86 2111 22979 22253 -17871 -30990 -31935 -24416 -13884 -17564 -35239 -40033 -12159 6456
15540F456k363M029O480k4497l565Q377K7419O444k6367j7132m4304K5462M9138
$$ 6456 4093 8122 14602 -9895 -13460 -5083 22336 28780 2413 -14719 -59023 -33561 15577
15527A5577J9004l7000n89J0414j529k6765k5943J5378R299J3985l6867J997J3921
$$ 15577 34581 -2419 -3008 7406 5877 -20888 -46831 -31453 -22154 -8169 -45036 -43039 -29118
15514b9118L159j1251J1473P009j3277m289K541K5299L5423J0522q690k3581K2514
$$ -29118 -25959 -37210 -25737 -18728 -32005 -36294 -33753 -8454 26969 37491 28801 5220 27734
15501B7734j4381j9053P19J5681l049k3081J5750J5195q543K2866R987N445j6734
$$ 27734 13353 -5700 -4981 10700 7651 -15430 320 15515 6972 29838 39825 45270 28536
15488B8536k4360j5389Q953L589j2085o317J3677j3210j6389k1454L952K1039
$$ 28536 4176 -11213 -2260 1329 -10756 -17073 -3396 -16606 -32995 -54449 -50497 -29458
15476b9458o839J1904K3501J5286J9189j7136l2110j1696J7099J982k6361j1082
$$ -29458 -36297 -24393 -892 14394 33583 16447 -15663 -27359 -10260 -8278 -34639 -45721
15464d5721K1864J2220J6675J7234j8366k3415l214K5054j063K7327N997l432
$$ -45721 -23857 -11637 5038 22272 3906 -19509 -22723 2331 1268 28595 34592 31160
15452C1160l3869l3163n212J3383J3457N944K0930P624l6005j9312J107R55K2668
$$ 31160 -2709 -35872 -41084 -27701 -14244 -8300 12630 20254 -15751 -35063 -33956 -33001 -10333
15439a0333M002m290l530l4481J3305K0630l369J8695m888l457q363j0906j5210
$$ -10333 -6331 -10621 -14151 -48632 -35327 -14697 -18066 629 -4259 -7716 -16079 -26985 -42195
15426d2195J2643L8936J6948J1300j736k895l63j8210l3662K897L011m760J1088
$$ -42195 -29552 9384 26332 37632 35896 33001 32638 14428 -19234 -16337 -13326 -18086 -6998
15413f998N574K122q6r930j1843K9120O692R3k4509q102j4521k1663Q380J201
$$ -6998 -1424 698 612 -9318 -21161 7959 14651 14744 -9765 -17867 -32388 -54051 -45671 -44470
15399d4470p820L0055M4473l324k554J1805j0679j3608P439J0459l8638k1626
$$ -44470 -52290 -22235 22238 18914 16360 28165 17486 3878 11317 21776 -16862 -38488
15387c8488Q773P415j4778q283j4335R917l778j897J2421P341j4804J3795L0187
$$ -38488 -29715 -22300 -37078 -45361 -59696 -49779 -53557 -55454 -43033 -35692 -50496 -36701 -6514
15374f514R247k1933l886o398j6993N562J369J3497j3227J8663N185j0847K7314
$$ -6514 2733 -19200 -23086 -29484 -46477 -40915 -39546 -26049 -39276 -20613 -15428 -26275 1039
15361A039R699k1685r699K0432M7639K1661r347N953k4296l1121r556j314J8128
$$ 1039 10738 -10947 -20646 -214 47425 69086 59739 65692 41396 10275 719 -595 17533
15348A7533n39j4882J6853K2829r968m1543o835q052m430o878K1099j4546J5167
$$ 17533 16994 2112 18965 41794 31826 -9717 -16552 -24604 -29034 -35912 -14813 -29359 -14192
15335a4192M0623l423k7161J1801J9439K1142J8046j2879l8922k5341J902J2664
$$ -14192 26431 23008 -4153 7648 27087 48229 66275 53396 14474 -10867 -8965 3699
15323C699j8590k7141n885K5300N0614J1522j1945j9158O985N28p781j3482J394
$$ 3699 -14891 -42032 -47917 -22617 27997 39519 27574 8416 15401 15929 8148 -5334 -3940
15310c940q983N750M925l2579j8863J5288K3563J2395P214J6828J8779o760j3604
$$ -3940 -12923 -7173 -2248 -34827 -53690 -38402 -14839 -2444 4770 21598 40377 33617 20013
15297B0013j5663q85R872k6603K784l216k6513J5153K5803l048K964j528j7368
$$ 20013 4350 3465 13337 -13266 -10482 -13698 -40211 -25058 745 -2303 661 -867 -18235
15284a8235j4402P720L251j3491N253K8834N008R203L0487J9638j8212j2003J854
$$ -18235 -32637 -24917 -21666 -35157 -29904 -1070 3938 13141 43628 63266 45054 33051 34905
15271C4905k470k4578m0687J3172K7884j160j3085k9640m023O017J2732K3662
$$ 34905 32435 7857 -32830 -19658 8226 7066 -6019 -35659 -39682 -33665 -20933 2729
15259B729J762j8783J8661L9852K247m108l0523Q099M340o565J4178j7832k1069
$$ 2729 4491 -14292 4369 44221 46468 42360 11837 19936 24276 17711 31889 14057 -7012
15246g012k6026n190n643J7041K4666R466j6894o521Q616J1782K347M765L2999
$$ -7012 -33038 -38228 -43871 -26830 -2164 7302 -9592 -16113 -7497 4285 6632 11397 44396
15233D4396O334O075K1338K358l3953l5363j5407J1134l417j1865Q6J3820m471
$$ 44396 50730 56805 78143 80501 46548 11185 -4222 6912 3495 -8370 -8284 5536 1065
15220A065J8002N572n285j409m869l112j2648j1588O611q037J602J6798j6201
$$ 1065 19067 24639 19354 17945 13076 9964 -2684 -14272 -7661 -15698 -14096 2702 -13499
15207a3499k0411O02J9833p846l083K0716J8989k2224N427J538J3645m228j039
$$ -13499 -33910 -33308 -13475 -21321 -24404 -3688 15301 -6923 -1496 42 13687 9459 8420
15194H420P320j4226K9072P901k1228r615P368O550k2638j2229M9291k677j6801
$$ 8420 15740 1514 30586 38487 17259 7644 15012 21562 -1076 -13305 35986 33309 16508
15181A6508Q466k1060m2102K7512n786O699J3602k2911J3179K2333j8528j1500
$$ 16508 24974 3914 -38188 -10676 -16462 -9763 3839 -19072 -5893 16440 -2088 -13588
15169a3588J9362j4205J09r256j0128o812J1307K9983J9360k6774n281p281p93
$$ -13588 5774 -8431 -8322 -17578 -27706 -34518 -23211 6772 26132 -642 -5923 -13204 -13997
15156a3997n86l496J8184J4310j1122L361j8005J151j626o150J0823N06j1967
$$ -13997 -14583 -18079 105 14415 3293 6654 -11351 -10200 -11826 -17976 -7153 -6647 -18614
15143a8614K9476o891O483k656r456j6946M752m046J3187k550l078K041R279J3385
$$ -18614 10862 3971 10454 7798 -1658 -18604 -13852 -17898 -4711 -7261 -10339 -8298 981 14366
15129A4366k2155L407J7583K372p915j273J244M836k2700k8571m150K9070L9m443
$$ 14366 -7789 -4382 13201 15573 7658 6385 7629 12465 -10235 -38806 -42956 -13886 -13847 -18290
15115a8290k6773J4754M865P752R069J1453j1092L108J5428K634l915l672k4787
$$ -18290 -45063 -30309 -25444 -17692 -8623 2830 -8262 -5154 10274 12908 8993 5321 -19466
15102a9466m521m49J6679J3073r035O57O283j0697j0081J1626J0475R286m0803
$$ -19466 -23987 -24436 -7757 5316 -3719 -3062 3221 -7476 -17557 -5931 4544 13830 -26973
15089b6973o226P740K2627j2933j2852l1296J4635K9793J8606o669Q161J9091
$$ -26973 -33199 -25459 -2832 -15765 -28617 -59913 -45278 -15485 3121 -3548 4613 23704
15077B3704j1789l127J2771j4092k4537k10n004Q369M635j6973J2935J0901k8179
$$ 23704 11915 8788 21559 7467 -17070 -17280 -22284 -13915 -9280 -26253 -13318 -2417 -30596
15064c0596l1901J5187M4454J3084J774J3502j0151L094k9896r968M6583K0354
$$ -30596 -62497 -47310 -2856 10228 12002 25504 15353 18447 -11449 -21417 25166 45520
15052D5520j7901J1564P620l628N564k0437J0705L226M851r277l3063l4417n164
$$ 45520 27619 39183 46803 43175 48739 28302 39007 42233 47084 37807 4744 -29673 -34837
15039c4837N128L3983L5682j5221k7509J5121K7198j4519K720j1400k4582k330
$$ -34837 -29709 4274 39956 24735 -2774 12347 39545 25026 27746 16346 -8236 -10566
15027a0566k0225r965L8258J982l6423Q631N2425K2895j3074j1358k0647J010
$$ -10566 -30791 -40756 -2498 -516 -36939 -28308 24117 47012 33938 22580 1933 2943
15015B943K140j7469j6919j0530Q796j144K2505L3277j2872J5717k4505k3826
$$ 2943 5083 -12386 -29305 -39835 -31039 -32183 -9678 23599 10727 26444 1939 -21887
15003b1887q297n412K7752n443K428K2191L1522m979q066J8094l835m5009m0728
$$ -21887 -30184 -35596 -7844 -13287 -10859 11332 42854 37875 29809 47903 44068 -941 -41669
14990d1669q770L3196L0420K979l989N792o887j2360L989j3952m3945R531K1028
$$ -41669 -50439 -17243 13177 16156 12167 17959 11072 -1288 2701 -11251 -55196 -45665 -24637
14977b4637K6063K2079j0396q818P776M875j1881M953j5078j3150q779m592J1725
$$ -24637 1426 23505 13109 4291 12067 16942 5061 10014 -5064 -18214 -26993 -31585 -19860
14964a9860P62P860j8899J3281M2518J598l9068k0049j6618L365K9039J4709J7441
$$ -19860 -19098 -11238 -30137 -16856 25662 27260 -11808 -31857 -48475 -45110 -16071 -1362 16079
14951A6079r339j4973J387L772j5182J8017J2872l8546q964L9561M0828j4135
$$ 16079 6740 -8233 -6846 -3074 -18256 -239 12633 -25913 -34877 4684 45512 31377
14939C1377k5419k2554k3045m4246J2401J7446M3047n619k0834n145Q505O327
$$ 31377 5958 -16596 -39641 -83887 -71486 -54040 -10993 -16612 -37446 -42591 -34086 -27759
14927b7759n738J2437J7126K3122p831m212K941m491j3960R535p885L639k0183
$$ -27759 -33497 -21060 -3934 19188 11357 7145 10086 5595 -8365 1170 -6715 -3076 -23259
14914b3259K979K6686j5314j0480J3632J8965p076l3317m131L7203M3934K322
$$ -23259 -20280 6406 -8908 -19388 -5756 13209 6133 -27184 -31315 5888 49822 52144
14902E2144j8561l6035l1275n397q093J0798j8704l690M1526O151K468K332p406
$$ 52144 33583 -2452 -33727 -39124 -47217 -36419 -55123 -58813 -17287 -11136 -8668 -6336 -13742
14889a3742j1535k0340J2168J3957k783j4119k065j213K1866K923K287j3541K338
$$ -13742 -25277 -45617 -33449 -19492 -22275 -36394 -38459 -39672 -17806 -14883 -12596 -26137 -23799
14876b3799Q759K3346J4457n780j286k868K210k5437j4702o148J1039J1261K9916
$$ -23799 -15040 8306 22763 16983 15697 12829 15039 -10398 -25100 -31248 -20209 -8948 20968
14863B0968j0590K1530j1999p078j4849J9596j0529k8224m693Q6J1062K795Q494
$$ 20968 10378 31908 19909 12831 -2018 17578 7049 -21175 -25868 -25782 -14720 -11925 -3431
14850c431J8228K2560k7158o806R289P638j21J2720n1791j9125O730K0886J7083
$$ -3431 14797 37357 10199 3393 12682 20320 20199 32919 -18872 -37997 -31267 -10381 6702
14837F702J0594K6956l0000q375J7282n390N092j5996k762J8768j0219m2281j6431
$$ 6702 17296 44252 14252 5877 23159 17769 22861 6865 4103 22871 12652 -29629 -46060
14824d6060L484o265O376n244m477K8313J1364j313j8280J5852K1208k1769k9674
$$ -46060 -42576 -48841 -42465 -47709 -52186 -23873 -12509 -13822 -32102 -16250 4958 -16811 -46485
14811d6485L647J8375K0021j2530l282J4994j715J2766J1544P112k3533l2509
$$ -46485 -42838 -24463 -4442 -16972 -20254 -5260 -6975 5791 17335 24447 914 -31595
14799c1595l5738J0238K9781P299J6019N087L547j9230J431q85J3827r414j355
$$ -31595 -67333 -57095 -27314 -20015 -3996 1091 4638 -14592 -13161 -14046 -219 -9633 -10988
14786a0988m716J532K3497l828J4611K3771k6121l4811l3535k8040j7715J2990
$$ -10988 -15704 -14172 9325 5497 20108 43879 17758 -17053 -50588 -78628 -96343 -83353
14774h3353L0875M0627M4820J4088R432R312j6683l1671j5919J5004Q233l2424
$$ -83353 -52478 -11851 32969 47057 56489 65801 49118 17447 1528 16532 24765 -7659
14762g659k1168j155k30K0548L3871J2399j8762l1185k2135p060N2953K7277k0551
$$ -7659 -28827 -29982 -30212 -9664 24207 36606 17844 -13341 -35476 -42536 10417 37694 17143
14749A7143j5606j1268K1674J402O319k1254l9830K3391J0052j616J0920K828
$$ 17143 1537 -9731 11943 13345 19664 -1590 -41420 -18029 -7977 -9593 1327 4155
14737D155j7509J4515P941L895p708j4574K0776j0241k1151K8443m647J3439j6988
$$ 4155 -13354 1161 9102 12997 5289 -9285 11491 1250 -19901 8542 3895 17334 346
14724C46j0000K1822J3910K48j0285R240l937k7032k2755J0261J7124J1685j1752
$$ 346 -9654 12168 26078 26326 16041 25281 21344 -5688 -28443 -18182 -1058 10627 -1125
14711a125Q945j0134k29N381J7388K3018j6150k1645j4472j8582l0228J4195M8320
$$ -1125 7820 -2314 -2543 2838 20226 43244 27094 5449 -9023 -27605 -57833 -43638 4682
14698D682L1059R49l951k6394j0831o390J0485P967p723K565p460L3500K59k1523
$$ 4682 35741 36690 32739 6345 -4486 -10876 -391 7576 -147 2418 -5042 28458 28717 7194
14684G194k8205l982k234Q399m989J6068K3877R399j1525r42j551q243m349k8851
$$ 7194 -21011 -24993 -27227 -18828 -23817 -7749 16128 25527 14002 13060 11509 3266 -1083 -29934
14670b9934K3078J2239j926n454K026r52j0423K739M910k533l814q622j4566k5582
$$ -29934 -6856 5383 3457 -1997 29 -923 -11346 -8607 -3697 -6230 -10044 -18666 -33232 -58814
14656e8814n396M4527R443j1528L0347j4559P085K094k4858K225j4960Q766R625
$$ -58814 -64210 -19683 -10240 -21768 8579 -5980 1105 3199 -21659 -19434 -34394 -25628 -16003
14643a6003K276n515N26K9396J2274p051j6296j5962J8224J7565j4415P615J0311
$$ -16003 -13727 -19242 -18716 10680 22954 15903 -393 -16355 1869 19434 5019 12634 22945
14630B2945K070K0944l295J5580J732m4843J4682K9684k4600k6530o885K1805
$$ 22945 25015 45959 42664 58244 59976 15133 29815 59499 34899 8369 1484 23289
14618B3289M2886J4271k6936k2948J264j5314m4241K1361l379j9108J8700J4852
$$ 23289 66175 80446 53510 30562 31826 16512 -27729 -6368 -9747 -28855 -10155 4697
14606D697j4721J1890J9743n1510p490M4041K4124O338j6564l4267p389K9260
$$ 4697 -10024 1866 21609 -29901 -37391 6650 30774 37112 20548 -13719 -21108 8152
14594H152q613J2269J3756j1945o739j060K0545J7934k209p375j9320j1018j9244
$$ 8152 -461 11808 25564 13619 6880 5820 26365 44299 42090 34715 15395 4377 -14867
14581a4867O675k692J1444j4815o007R247J5174N568k2179L704m587k427o601
$$ -14867 -8192 -10884 560 -14255 -20262 -11015 4159 9727 -12452 -8748 -13335 -15762 -22363
14568b2363j1342J0827J4318L0684Q455k7509k8687J8788J8888K0957J2048q300
$$ -22363 -33705 -22878 -8560 22124 30579 3070 -25617 -6829 12059 33016 45064 36764
14556C6764R046p826m2486r834q23J3101k013J9380j6248l3991j8264L8715J1091
$$ 36764 45810 37984 -4502 -14336 -15159 -2058 -4071 15309 -939 -34930 -53194 -14479 -3388
14543c388k2805k5361j2845J6720J8515p555j9906J2531K3529l423J748n196K3823
$$ -3388 -26193 -51554 -64399 -47679 -29164 -36719 -56625 -44094 -20565 -23988 -22240 -27436 -3613
14530c613o93r802J2189k903k187P782j5674J099j1026k0015k231R885L6108J2759
$$ -3613 -4306 -14108 -1919 -4822 -7009 773 -14901 -13802 -24828 -44843 -47074 -37189 -1081 11678
14516A1678L6564r87k2953j5605l9935J6779K6317L7072k103j8030j9236j6007
$$ 11678 48242 47255 24302 8697 -31238 -14459 11858 48930 46827 28797 9561 -6446
14504f446l7247m015N796L3186J797J9023N387j219N001n703J2443j4370l6440
$$ -6446 -43693 -47708 -41912 -8726 -6929 12094 17481 16262 21263 15560 28003 13633 -22807
14491b2807j2511J5162O012m320J7243J8226J0291K5580n424k5428J977q828K0597
$$ -22807 -35318 -20156 -14144 -18464 -1221 17005 27296 52876 47452 22024 24001 15173 35770
14478C5770n017j0873J3500j3879K745j5165j1025J7770N718r812K103J7935k7140
$$ 35770 30753 19880 33380 19501 22246 7081 -3944 13826 19544 9732 11835 29770 2630
14465B630l9286J8185K6026P138Q570l774k3125k3616J5379j0769J2156J4627
$$ 2630 -36656 -18471 7555 14693 23263 19489 -3636 -27252 -11873 -22642 -10486 4141
14453D141J6751k9623k0003j0876J5164K0508J1030L776k5429k0363m28J1193
$$ 4141 20892 -8731 -28734 -39610 -24446 -3938 7092 10868 -14561 -34924 -35352 -24159
14441b4159J6727J8984M470K1073m32l1484o614J8251R804l122m018j1474J3019
$$ -24159 -7432 11552 16022 37095 36663 5179 -1435 16816 26620 23498 19480 8006 21025
14428B1025Q837O428n071q049n518q087J9891N927K824m79k9176j4583J2673j0465
$$ 21025 29862 36290 31219 23170 17652 9565 29456 35383 38207 37728 8552 -6031 6642 -3823
14414c823m110q581j0391j537l119J6981J1031k2827k1130J3179K6117J1951j4758
$$ -3823 -7933 -16514 -26905 -28442 -31561 -14580 -3549 -26376 -47506 -34327 -8210 3741 -11017
14401a1017o654j979J5193k5369J181J6903j4284K9124j077L065K2339q277j9676
$$ -11017 -17671 -19650 -4457 -29826 -28645 -11742 -26026 3098 2021 5086 27425 19148 -528
14388e28M53k701R198J1976j440m7984j6137N461J375K4857j6623j8259J2566
$$ -528 -75 -2776 6422 18398 16958 -31026 -47163 -41702 -40327 -15470 -32093 -50352 -37786
14375c7786J6566k198o914Q947j2539q77K6464j8705P500J3032l833q086Q832
$$ -37786 -21220 -23418 -30332 -21385 -33924 -34801 -8337 -27042 -19542 -6510 -10343 -18429 -9597
14362i597L77P513K9811J9499k421M456M469l4497m5030k1769L5404J8673k852
$$ -9597 -9220 -1707 28104 47603 45182 49638 54107 19610 -25420 -47189 -11785 6888 4036
14349D036p620P152N118P190r62o918r218J1130J4194k4100m0153j4408J2146
$$ 4036 -3584 3568 8686 15876 14914 7996 -1222 9908 24102 2 -40151 -54559 -42413
14336d2413L235J9030r890j760L4482K1927p135j0632M540k9153n741J390J1911
$$ -42413 -39178 -20148 -30038 -31798 2684 24611 17476 6844 11384 -17769 -23510 -22120 -10209
14323a0209K456O834J1173k1358l722J6568K4484L409k3597l5251j1066L8759
$$ -10209 -7753 -919 10254 -11104 -14826 1742 26226 29635 6038 -29213 -40279 -1520
14311a520K2072J1369p939Q145K1536J0522j9926l5498k525O631K234K633K0215
$$ -1520 20552 31921 23982 32127 53663 64185 44259 8761 6236 12867 15101 17734 37949
14298C7949Q747o849j6407r952r972R199O159R750P862l4152l9130l829m650j8114
$$ 37949 46696 39847 23440 13488 3516 12715 18874 28624 36486 2334 -36796 -40625 -45275 -63389
14284f3389O373L3980O231k1792M126L1375P604j248k3323K5149J5791l550l209
$$ -63389 -57016 -23036 -16805 -38597 -34471 -3096 4508 3260 -20063 5086 20877 17327 14118
14271A4118j333j8189o698k052K94j46J9850K0033k1208l0319l5752n631J0186
$$ 14118 12785 -5404 -12102 -14154 -13860 -14006 5844 25877 4669 -25650 -61402 -67033 -56847
14258e6847J9921K8710M613J5436L1r546j976J222k2422l1407k0125K9392Q630
$$ -56847 -36926 -8216 -3603 11833 11864 2318 342 1564 -20858 -52265 -72390 -42998 -34368
14245c4368J6726J9465O609P627j2391j2986k4064N367L5241J7219L291r69O249
$$ -34368 -17642 1823 8432 16059 3668 -9318 -33382 -28015 7226 24445 27736 26767 33016
14232C3016j6798k6177j5423J2608K8295K3258r505k4616j7663L517R639J7338
$$ 33016 16218 -9959 -25382 -12774 15521 38779 29274 4658 -13005 -9488 151 17489
14220A7489P118l6096k9686L378K4004J8856M578k502j4139k5262n721M506K5847
$$ 17489 24607 -11489 -41175 -37797 -13793 5063 9641 7139 -7000 -32262 -37983 -33477 -7630
14207g630O168o749J1016L0698L42o848r686j1038k9587k1616j2145j949L7816
$$ -7630 -1462 -8211 2805 33503 33845 26997 17311 6273 -23314 -44930 -57075 -59024 -21208
14194b1208P760j7790o830N3L43J5460J6853r489K9729K205l948K6239L746J1861
$$ -21208 -13448 -31238 -38068 -38015 -37672 -22212 -5359 -14848 14881 17086 13138 39377 43123 54984
14180E4984j8066m0570k05R515M194N995j8276n983O678J5748J7186j9605q252
$$ 54984 36918 -3652 -3857 5658 9852 15847 -2429 -8412 -1734 14014 31200 11595 3343
14167C343j8411o811Q852K3826j5970j2151k1830K1851J4064n072J8455l2698
$$ 3343 -15068 -21879 -13027 10799 -5171 -17322 -39152 -17301 -3237 -8309 10146 -22552
14155b2552l6769l990L7920L0151K0100K6148o672m8431l4710J3281K5482j5932
$$ -22552 -59321 -63311 -25391 4760 24860 51008 44336 -4095 -38805 -25524 -42 -15974
14143a5974l9678k5202J9552L4714L2407K4181m324N448j0854j4939r252j3949
$$ -15974 -55652 -80854 -61302 -26588 5819 30000 25676 31124 20270 5331 -3921 -17870
14131a7870L7254J6768o450o726K4126l044q459K881k5930m147n100k382j1237
$$ -17870 19384 36152 29702 22976 47102 44058 35599 38480 12550 8403 3303 921 -10316
14118a0316j8144o89L183J9360P521k083N745k2247j9946J1444L37j2248j5659
$$ -10316 -28460 -29149 -25966 -6606 915 -1168 4577 -17670 -37616 -26172 -25835 -38083 -53742
14105e3742q752J1646L7579L078q500J2539o249j2512j8255q15K5571K8852J9135
$$ -53742 -62494 -50848 -13269 -10191 -18691 -6152 -12401 -24913 -43168 -43983 -18412 10440 29575
14092B9575j2307k9098k1697N489K2520J9445K9716J1676l6180k724j0439p107
$$ 29575 17268 -11830 -33527 -28038 -5518 13927 43643 55319 19139 16415 5976 -1131
14080a131j1805O817M163k159o453J5260R057j3401M386n068L170J1653J7913
$$ -1131 -12936 -6119 -1956 -4115 -10568 4692 13749 348 4734 -334 2836 14489 32402
14067C2402k8241k4852L3730p198j7966j6574k1023J7444M1196k6187J702R412
$$ 32402 4161 -20691 13039 5841 -12125 -28699 -49722 -32278 8918 -17269 -15567 -6155
14055f155r08n187r563N671K0734J0924k272k364k4705j0049p35L333J2849J594
$$ -6155 -7063 -12250 -21813 -16142 4592 15516 13244 10880 -13825 -23874 -24609 -21276 -8427 -6833
14041f833j0525L3149J8853l5621j3639j5192M639J4274J2824K979J0523m080
$$ -6833 -17358 15791 34644 -977 -14616 -29808 -25169 -10895 1929 4908 15431 11351
14029A1351J9093q089k1374K239K5828j6113k1052K469p502j0854k0177J8080
$$ 11351 30444 22355 981 3220 29048 12935 -8117 -5648 -13150 -24004 -44181 -26101
14017b6101J7199J4005L444J1801j9864K207j9158o647K721K5025J2147j5584
$$ -26101 -8902 5103 8547 20348 484 2691 -16467 -23114 -20393 4632 16779 1195
14005A195j0094k1111q385R221J090L3233R935j8197m2950n647K1700r14J3359
$$ 1195 -8899 -30010 -38395 -29174 -28084 5149 15084 -3113 -46063 -51710 -30010 -30924 -17565
13992a7565n713k2483K769K1687K7526j1944j6871r682M094j1973q948J3287M622
$$ -17565 -23278 -45761 -42992 -21305 6221 -5723 -22594 -32276 -28182 -40155 -49103 -35816 -31194
13979c1194O419J3080m230j9734J5L0523L1766j9926j3397l416J7997J6616j2226
$$ -31194 -24775 -11695 -15925 -35659 -35644 -5121 26645 6719 -6678 -10094 7903 24519 12293
13966A2293L660j3249J6395n82l3968l68K8803l4869j9449K4295K1282M943j2045
$$ 12293 15953 2704 19099 18517 -15451 -15819 12984 -21885 -41334 -17039 4243 9186 -2859
13953b859K2351N853j4456o37o667r965J746j6827J9165P852j425O077J1469j0346
$$ -2859 19492 25345 10889 10252 3585 -6380 -4634 -21461 -2296 5556 4131 10208 21677 11331
13939A1331J7395r631j8943Q434J589r705j5727k4977j2824M5439J8302N021L0841
$$ 11331 28726 19095 152 8586 10175 470 -15257 -40234 -53058 -7619 10683 15704 46545
13926D6545n122k4955l2920R391J7310K355j9933p065K6451K1748L279r616j4673
$$ 46545 41423 16468 -16452 -7061 10249 12604 -7329 -14394 12057 33805 37084 27468 12795
13913A2795K0183J4478M220l6085K492j4176K1778k930j6451j000k234k5113q448
$$ 12795 32978 47456 51676 15591 18083 3907 25685 22755 6304 5304 3070 -22043 -30491
13900c0491j702k549n796J6838J9506J2873K6641k3142j9892p028J461J8187l6916
$$ -30491 -32193 -34742 -40538 -23700 -4194 8679 35320 12178 -7714 -14742 -13281 4906 -32010
13887c2010k8224J6977M4175N6689J8430K586P23k6334k7458J0170l956r999J7273
$$ -32010 -60234 -43257 918 57607 76037 78623 79346 53012 25554 35724 31768 21769 39042
13874C9042J4712P618j5194j3688m3811R398k446Q353J0609j0645j7007J2306
$$ 39042 53754 61372 46178 32490 -11321 -1923 -4369 3984 14593 3948 -13059 -753
13862g53J9833N695o864m631P183q125l0021k3059K1727J2265n714K1147K0403
$$ -753 19080 24775 17911 13280 20463 12338 -17683 -40742 -19015 -6750 -12464 8683 29086
13849B9086k393l807K2376K791o997k7011m004J0266J1306P001K624J7316k3720
$$ 29086 26693 22886 45262 48053 41056 14045 10041 20307 31613 38614 41238 58554 34834
13836C4834J6220j585l0518p785j1997N051k448l680P070j2477k76K1870j1723
$$ 34834 51054 49469 18951 11166 -831 4220 1772 -1908 5162 -7315 -7591 14279 2556
13823B556k3076J638L260J746J8770K8098j0237k8245J7384J9616m604j0378k7126
$$ 2556 -20520 -18882 -15622 -13876 4894 32992 22755 -5490 11894 31510 26906 16528 -10598
13810a0598q897J014J6936J6647M647K012r465J9698K3625r372l5838o193L073
$$ -10598 -19495 -18481 -1545 15102 19749 21761 12296 31994 55619 46247 10409 4216 7289
13797G289l1485p278J4324K9688J08o281p408n906J9494l2509p709m898j2984
$$ 7289 -24196 -31474 -17150 12538 12646 6365 -1043 -6949 12545 -19964 -27673 -32571 -45555
13784d5555m496K3052M8895l745k665k2803j398j1627p753j214K818J5755l1608
$$ -45555 -50051 -26999 21896 18151 15486 -7317 -8715 -20342 -28095 -29309 -26491 -10736 -42344
13771d2344q987J9732K0541L223p73k9186j0366J0176K0408J5164n278j4281k351
$$ -42344 -51331 -31599 -11058 -7835 -8608 -37794 -48160 -37984 -17576 -2412 -7690 -21971 -24322
13758b4322M246J8816J2148j3080J1264n548P074L304P863j7908j4946N267K2857
$$ -24322 -20076 -1260 10888 -2192 9072 3524 10598 13902 21765 3857 -11089 -5822 17035
13745A7035o869k5185j1720o664K3619J0221J2197R465J200k6631m5094J356M2209
$$ 17035 10166 -15019 -26739 -33403 -9784 437 12634 22099 23299 -3332 -48426 -47070 -4861
13732d861R430j3549q254k2872R739P3p416J1578k1991l002Q743j1471l048K8805
$$ -4861 4569 -8980 -17234 -40106 -30367 -30294 -37710 -26132 -48123 -51125 -42382 -53853 -56901 -28096
13718b8096J3186j0981m655O296J4730J2919M244P861q499L143L345j398j7432
$$ -28096 -14910 -25891 -30546 -24250 -9520 3399 7643 15504 7005 10148 13493 12095 -5337
13705e337k7426j1279k8495j4334J5823L8803L7392L0337o739j6619j1835j6316
$$ -5337 -32763 -44042 -72537 -86871 -71048 -32245 5147 35484 28745 12126 291 -16025
13693a6025l5798J0328K9976l331J8516K5715j1509J9630o748j9480k9161j6988
$$ -16025 -51823 -41495 -11519 -14850 3666 29381 17872 37502 30754 11274 -17887 -34875
13681c4875j6477K0345K1911j599K673o041m402J3799J066Q644J4768o414j1790
$$ -34875 -51352 -31007 -9096 -10695 -8022 -14063 -18465 -4666 -3600 5044 19812 13398 1608
13668A608j1137o849J4480j0998l230J3833J9494j8072m0058k0431J727M0385
$$ 1608 -9529 -16378 -1898 -12896 -16126 -2293 17201 -871 -40929 -61360 -59633 -19248
13656a9248N2814n686J5470L880r146J5343K0473L801j9542k5718k8991J246K0755
$$ -19248 33566 27880 43350 47230 38084 53427 73900 77701 58159 32441 3450 4696 25451
13643B5451j1269k4604m431J2897J3711k72k3294j3497P631j0480J581R213J611
$$ 25451 14182 -10422 -14853 -1956 11755 11483 -11811 -25308 -17677 -28157 -26576 -17363 -15752
13630a5752j1246J5519M330k403j1016k01L3171O709l675p498j6472j0158n656
$$ -15752 -26998 -11479 -7149 -9552 -20568 -20769 12402 19111 15436 7938 -8534 -18692 -24348
13617b4348N188J0304K952J5651j1786j9420k8485J5173J0067J535k22J2616p386
$$ -24348 -19160 -8856 -5904 9747 -2039 -21459 -49944 -34771 -24704 -23169 -23391 -10775 -18161
13604a8161J2107J0943J4386N193j892l399R66J3729J9222j1424j0560l5112m7303
$$ -18161 -6054 4889 19275 24468 22576 19177 20143 33872 53094 41670 31110 -4002 -51305
13591e1305m7171J8857N5060M6279J6217o557j133q41j1818r59j4110J9771J3364
$$ -51305 -98476 -79619 -24559 21720 37937 31380 30247 29406 17588 16629 2519 22290 35654
13578C5654j4354J2767o413j4085J978J5430m115k1870k4523R751M395p222j0378
$$ 35654 21300 34067 27654 13569 15547 30977 26862 4992 -19531 -9780 -5385 -12607 -22985
13565b2985o034P76m796L1421j5147k1668j4452K717J6963J9173j4001o345K7574
$$ -22985 -29019 -28243 -33039 -1618 -16765 -38433 -52885 -50168 -33205 -14032 -28033 -34378 -6804
13552f804j5623j610M1860K4245L7028K7552O45L4961L5003j6246m6631k6184
$$ -6804 -22427 -24037 17823 42068 79096 106648 107293 142254 177257 161011 114380 88196
13540H8196R777k976k0758l5873K722K6203k475j4894l2457r508j0777j4375N391
$$ 88196 97973 94997 74239 38366 41088 67291 64816 49922 17465 7957 -2820 -17195 -11804
13527a1804j2195l397J6576K7683k0632k8698j6717j2939J6266K9914M3975K7449
$$ -11804 -23999 -27396 -10820 16863 -3769 -32467 -49184 -62123 -45857 -15943 28032 55481
13515E5481K610j5953j01n263o960n699K571O582p55k665l7739J833J7354k874
$$ 55481 58091 42138 42037 36774 29814 24115 26686 33268 32513 29848 -7891 -6058 11296 8422
13501H422l0112R967J5302l68K0620J1045m8146l4808L051j099J1272j3420J1601
$$ 8422 -21690 -11723 3579 3211 23831 34876 -13270 -48078 -45027 -46126 -34854 -48274 -36673
13488c6673L6024K122j014j4132j9293j1504l183K5439K3867l030K593J8473j490
$$ -36673 -649 1473 459 -13673 -32966 -44470 -47653 -22214 1653 -1377 1216 19689 18199
13475A8199l968n871n221O718L758j3129j648J3772j148j0541j9925O175J7250
$$ 18199 14231 8360 3139 9857 13615 486 -1162 12610 11462 921 -19004 -12829 4421
13462D421K2193j2619l9878l4355j30J2989J7248J6178J9876J4781P958k6058
$$ 4421 26614 13995 -25883 -60238 -60368 -47379 -30131 -13953 5923 20704 28662 2604
13450B604l4689n144O058J6626l927j5499p287M987K343M229P239J4424J5993
$$ 2604 -32085 -37229 -31171 -14545 -18472 -33971 -41258 -36271 -33928 -29699 -22460 -8036 7957
13437G957J0881J1023M851k3930j2859m67J2857k53N522j302o160p156L2919j3276
$$ 7957 18838 29861 34712 10782 -2077 -2544 10313 10060 15582 14280 8120 964 33883 20607
13423B0607r835m659K9529J5180k3909j8963K944m214J626k3154l9841N368L5456
$$ 20607 10772 6113 35642 50822 26913 7950 10894 6680 8306 -14848 -54689 -49321 -13865
13410a3865L4552J3256k2853j8192Q198p187j553K460J6918J356O903l734l0806
$$ -13865 20687 33943 11090 -7102 1096 -6091 -7644 -5184 11734 13090 19993 16259 -14547
13397a4547j237k177L5123L63k9357j2009j1821l810n30o452k4725J336K001L8905
$$ -14547 -15784 -17961 17162 17525 -11832 -23841 -35662 -39472 -40002 -46454 -71179 -69843 -67842 -28937
13383b8937Q874J2658J5159M848k2427j2603o141j1320O395J5777J1198k663J7500
$$ -28937 -20063 -7405 7754 12602 -9825 -22428 -28569 -39889 -33494 -17717 -6519 -9182 8318
13370H318J4064J8260L2774l611m3744l2493j428O22j7111N136K0636J991K3706
$$ 8318 22382 40642 73416 69805 26061 -6432 -7860 -7238 -24349 -19213 1423 3414 27120
13357B7120K1747k4451j7867k5515J5402Q297N445j9618l331K346p446L249K3677
$$ 27120 48867 24416 6549 -18966 -3564 4733 10178 -9440 -12771 -10425 -17871 -14622 9055
13344I055J0114J1206j7572L340j1393p546j3393j7309R445J9081K4743j432K696
$$ 9055 19169 30375 12803 16143 4750 -2796 -16189 -33498 -24053 -4972 19771 18339 21035
13331B1035M13l171O033O041j9345r902j6350k3276O367J8826J3284l121P083
$$ 21035 21448 18277 24310 30351 11006 1104 -15246 -38522 -32155 -13329 -45 -3166 3917
13318C917J3544J6249n62k1631L14j487j2700L145K7028J4366J3787q218n5110
$$ 3917 17461 33710 33148 11517 11831 10344 -2356 789 27817 42183 55970 47752 -7358
13305g358j5688K6099J944p539j3642j7201k6892J6044J6594k9994J2714L7846
$$ -7358 -23046 3053 4997 -2542 -16184 -33385 -60277 -44233 -27639 -57633 -44919 -7073
13293g073Q343p32O01J2173j5740k3927j1771j1280p44K3123K9682J0906q453
$$ -7073 1270 538 1139 13312 -2428 -26355 -38126 -49406 -50150 -27027 2655 13561 5108
13280E108k479o475j7914L600K0372j2777J2498K2968Q988n499j3223q875P656
$$ 5108 2629 -3846 -21760 -18160 2212 -10565 1933 24901 33889 28390 15167 6292 13948
13267A3948Q058M0714K022l1575j4276o512k3051N690R546q502k1131j506Q910
$$ 13948 22006 62720 64742 33167 18891 12379 -10672 -4982 4564 -3938 -25069 -26575 -17665
13254a7665O0648J0529q759n258j3997j0387k6035q884N804J376j0800J2942J5780
$$ -17665 42983 53512 44753 39495 25498 15111 -10924 -19808 -14004 -12628 -23428 -10486 5294
13241E294p552K647k441j3110j2633K3028j6846M565K1797J5041N332J1417j6387
$$ 5294 -2258 389 -2052 -15162 -27795 -4767 -21613 -17048 4749 19790 25122 36539 20152
13228B0152m0373p214J6925q219L0447M0124m631j7499j8981j5815j1777J0579
$$ 20152 -20221 -27435 -10510 -18729 11718 51842 47211 29712 10731 -5084 -16861 -6282
13216f282L2169O254k0379r79j7955l0974q132Q716K1195K6964J9171q493p199
$$ -6282 25887 32141 11762 10783 -7172 -38146 -46278 -37562 -16367 10597 29768 21275 14076
13203A4076M88J9224Q188M134m269J8058n427N83L0794J8083k2511k1960l8733
$$ 14076 14564 33788 41976 46110 41841 59899 54472 55055 85849 103932 81421 59461 20728
13190B0728j2448j8116j9037j1257j1200J1743J3043r97J2627j5241j5341J5934
$$ 20728 8280 -9836 -28873 -40130 -51330 -39587 -26544 -27541 -14914 -30155 -45496 -29562
13178b9562o663K7923L7056j5042k3083N052p176M794L9210P651R745J0514n608
$$ -29562 -36225 -8302 28754 13712 -9371 -4319 -11495 -6701 32509 40160 49905 60419 54811
13165E4811J8551K7708K3605K1186L3618o824j6396j7824n6283j5445J6073o626
$$ 54811 73362 101070 124675 145861 179479 172655 156259 138435 82152 66707 82780 76154
13153G6154J7332P950k4398l2873J2950q961J2143J2715l1570j6051J2102J1687
$$ 76154 93486 101436 77038 44165 57115 48154 60297 73012 41442 25391 37493 49180
13141D9180K142L364k424j1522L259n696M917J8393M701j3933K6490L2329K3384
$$ 49180 51322 54686 52262 40740 43999 38303 43220 61613 66314 52381 78871 111200 134584
13128A34584J8540Q624l1584o569k7806k4032J041k6677j9051l023k2709J2921
$$ 134584 153124 161748 130164 123595 95789 71757 72798 46121 27070 24047 1338 14259
13116A4259R644l0471j864M1066m874j2053J164J6351J6143J0521O475l3957n533
$$ 14259 23903 -6568 -8432 32634 27760 15707 16871 33222 49365 59886 66361 32404 26871
13103B6871Q964l673j1683j765J7501N630o567K5348L3649M741j1605k9829m1482
$$ 26871 35835 32162 20479 18714 36215 41845 35278 60626 94275 99016 87411 57582 16100
13090A6100k5831J3502j540j45j5444L836r894k3156n178K5071K0027N615M668
$$ 16100 -9731 3771 2231 2086 -13358 -9522 -19416 -42572 -47750 -22679 -2652 2963 7631
13077G631j6183M941O280J1185K831j0952j4938L0083J1385M876p794j6048L774
$$ 7631 -8552 -3611 2669 13854 16685 5733 -9205 20878 32263 37139 29345 13297 17071
13064A7071P46n74l232n665K083j7659k1106K2473k1914j9252L5145K9831J4234
$$ 17071 17817 17243 14011 8346 10429 -7230 -28336 -5863 -27777 -47029 -11884 17947 32181
13051C2181j2031j7845l008o133j9550J7747P900J106r79N686o78J124k9066j4615
$$ 32181 20150 2305 -703 -6836 -26386 -8639 -739 367 -612 5074 4396 5520 -23546 -38161
13037c8161q913L7076L1444p109P175j5344K8744J2289L430J0528j8171k7701
$$ -38161 -47074 -9998 21446 14337 21512 6168 34912 47201 50631 61159 42988 15287
13025A5287l371J4538J0759k9576K697J2690n058J8624j37l5021j2164j4552Q586
$$ 15287 11916 26454 37213 7637 10334 23024 17966 36590 36453 1432 -10732 -25284 -16698
13012a6698L732M810k7362l8040K8821J6467J165k0750k6337L2628L4485q239
$$ -16698 -12966 -8156 -35518 -73558 -44737 -28270 -27105 -47855 -74192 -41564 -7079 -15318
13000a5318J2537O700q568Q228O007p360j730M0271P611k7637j6774r581O412
$$ -15318 -2781 3919 -4649 3579 9586 2226 496 40767 48378 20741 3967 -5614 798
12987G98k2862j6765m299K5559J6809k5447k4297L76j1195L0748L0628J3791J1220
$$ 798 -22064 -38829 -43128 -17569 -760 -26207 -50504 -50128 -61323 -30575 53 13844 25064
12974B5064k5866j0508m009O998J6704K1656R70m962k2768k8649J9300L357j4814
$$ 25064 -802 -11310 -15319 -8321 8383 30039 31009 26047 3279 -25370 -6070 -2713 -17527
12961a7527n744J3740K482q018O326j2060K4653K1727m86j1054m758O665j4129
$$ -17527 -23271 -9531 -7049 -15067 -8741 -20801 3852 25579 25093 14039 9281 15946 1817
12948A817k8349o315n886k57Q380n38J5020l876o239p64N766J6786J041K5650
$$ 1817 -26532 -32847 -38733 -38990 -30610 -31148 -16128 -20004 -26243 -27007 -21241 -4455 -3414 22236
12934B2236J3454j1074l4057k1376K5733K1417J3909o225Q796o388k802k463K362
$$ 22236 35690 24616 -9441 -30817 -5084 16333 30242 24017 32813 26425 23623 21160 23522
12921B3522J8770p093m736j3202J6124J207j107p863k3803k459m993k4379q00
$$ 23522 42292 35199 30463 17261 33385 34592 33485 25622 1819 -640 -5633 -30012 -30812
12908c0812N492r763k700J4896J4908o058j1696J9012K2848N439p061K2230j036
$$ -30812 -25320 -35083 -37783 -22887 -7979 -14037 -25733 -6721 16127 21566 14505 36735 35699
12895C5699l2897j7594K1552J4014j3204m0073j7670j6875R911K9420K8820K3323
$$ 35699 2802 -14792 6760 20774 7570 -32503 -50173 -67048 -57137 -27717 1103 24426
12883B4426R113n101k2385j242R210K9889k7145l3445K3902K3001J719n2645r765
$$ 24426 33539 28438 6053 4811 14021 43910 16765 -16680 7222 30223 31942 -20703 -30468
12870c0468J6002K1519J1458j4738j509j5950j6799J0453l456k198p004k2812
$$ -30468 -14466 7053 18511 3773 2264 -13686 -30485 -20032 -23488 -25686 -32690 -55502
12858e5502K0238l92J5471N0176m656m5720q430Q359L1399J5955N2K0939K0852
$$ -55502 -35264 -35656 -20185 29991 25335 -20385 -28815 -20456 10943 26898 26950 47889 68741
12845F8741l2212k7979j1316J276j0566O014L5558k34j8278q46J8983p172K6217
$$ 68741 36529 8550 -2766 -1490 -12056 -6042 29516 29282 11004 10158 29141 21969 48186
12832D8186k231l3415k9186J809j0401j1095J4072p967m804M0204J5021p442M016
$$ 48186 45955 12540 -16646 -14837 -25238 -36333 -22261 -30228 -35032 5172 20193 12751 16767
12819A6767J5791J803K8724M363K0871J9434J9199M3642J47946K11886M35357
$$ 16767 32558 34361 63085 67448 88319 107753 126952 170594 318540 530426 965783
12808I65783N70918K60174j60285m26272m14155k90653j89862j15427n1657o4243
$$ 965783 1536701 1796875 1636590 1210318 796163 505510 315648 200221 148564 84321
12798H4321k5238J5028r414l2573k8382N912K2244K3970o476l1896l0675j2642
$$ 84321 59083 74111 64697 32124 3742 9654 31898 55868 49392 17496 -13179 -25821
12786b5821q465j050n47k1549O686J7970J4298l0640o899J8746q947j6494M4288
$$ -25821 -34286 -35336 -35883 -57432 -50746 -32776 -18478 -49118 -56017 -37271 -46218 -62712 -18424
12773a8424K6638K998k9420O069L1982k40q862j4674N431J1394m034K3462J326
$$ -18424 8214 11212 -18208 -12139 19843 19603 10741 -3933 1498 12892 8858 32320 33646
12760C3646o492p613j5715P831K1383J8303j8966l3271K993l3173o120L804M3889
$$ 33646 27154 19541 3826 11657 33040 51343 32377 -894 2099 -31074 -37194 -33390 10499
12747A0499N639J108j0267j4418L499L601J2966l7943j4180K9575K3511K4523
$$ 10499 16138 17246 6979 -7439 -3940 -339 12627 -25316 -39496 -9921 13590 38113
12735C8113o359J8831J4684j7129k4819l2523r630k103K6618K3169j3410j8558
$$ 38113 31754 50585 65269 48140 23321 -9202 -18832 -20935 5683 28852 15442 -3116
12723c116k9584M207K199L279J0525R972J0084l4595L553L1719J8105l1387l9135
$$ -3116 -32700 -28493 -26294 -23015 -12490 -2518 7566 -27029 -23476 8243 26348 -5039 -44174
12710d4174j7183L5997L5210Q221j5880J5322j05j2784j7557L6817L9824k3063
$$ -44174 -61357 -25360 9850 18071 2191 17513 17408 4624 -12933 23884 63708 40645
12698D0645P64k3439J814J9250r248O418P778J5325j4848l0276l0386k3227J7087
$$ 40645 41409 17970 19784 39034 29786 36204 43982 59307 44459 14183 -16203 -39430 -22343
12685b2343K3131J894j7014J6808J4364k6136J143J9268J207r469m479p845L3045
$$ -22343 788 2682 -14332 2476 16840 -9296 -8153 11115 12322 2853 -1626 -9471 23574
12672B3574J4043j0673r036j3286j3014l133L515j7821N628J6150J7868J162K6133
$$ 23574 37617 26944 17908 4622 -8392 -11525 -8010 -25831 -20203 -4053 13815 14977 41110
12659D1110N220j3305k3154k6850K7515o984n704Q358k5663O379L484k5743J4043
$$ 41110 46330 33025 9871 -16979 10536 3552 -2152 6206 -19457 -13078 -9594 -35337 -21294
12646b1294K9740L4541q973J3220j1887l7999k4177K7879n825k5464J0201K3026
$$ -21294 8446 42987 34014 47234 35347 -2652 -26829 1050 -4775 -30239 -20038 2988
12634B988O267p85j5185p210j9643K1069L546j2561K8985K2956j4943R581k5505
$$ 2988 9255 8470 -6715 -13925 -33568 -12499 -8953 -21514 7471 30427 15484 25065 -440
12621d40k28J2993o032j4801k856J5737j5101j3516j0756L8747J303k5359N831
$$ -440 -668 12325 6293 -8508 -11364 4373 -10728 -24244 -35000 3747 5050 -20309 -14478
12608a4478K5616J3710J0171k4743j6437n857L377j410M113k3250K2184J8060
$$ -14478 11138 24848 35019 10276 -6161 -12018 -8641 -10051 -5938 -29188 -7004 11056
12596A1056n555Q103M810M740j8704l9168L2322K8336j2782m8206q055L9849P789
$$ 11056 5501 13604 18414 23154 4450 -34718 -2396 25940 13158 -35048 -43103 -3254 4535
12583D535p376j8956k1245K3086m687k868L408K655Q932K3526K364j1004q449
$$ 4535 -2841 -21797 -43042 -19956 -24643 -27511 -24103 -21448 -12516 11010 13374 2370 -6079
12570f079j9483j1105r102J6231Q325k545m06j1487m19K5017K4270P733j4591
$$ -6079 -25562 -36667 -45769 -29538 -21213 -23758 -24164 -35651 -36070 -11053 13217 20950 6359
12557F359J112K0046K7621p038k9044l0596m721J6200O166m850J3651M373j8341
$$ 6359 7471 27517 55138 48100 19056 -11540 -16261 -61 6105 1255 14906 19279 938
12544I38j587K4118n238k485N140k5965J869m290k7000J4852K8388Q789L049J4975
$$ 938 -649 23469 18231 15746 20886 -5079 -3210 -7500 -34500 -19648 8740 17529 20578 35553
12530C5553J0938l4082m1300j484J6503J3451m159O486k668j9465j7846q330m958
$$ 35553 46491 12409 -28891 -30375 -13872 -421 -4580 1906 -762 -20227 -38073 -46403 -51361
12517e1361K0567r209J473j3742J201O688q706j0099K2383J5163q219K853R612
$$ -51361 -30794 -40003 -38530 -52272 -51071 -44383 -53089 -63188 -40805 -25642 -33861 -31008 -21396
12504b1396K6287J3436M059o3o665j2042n689k2346r842j173j0590K706K4422
$$ -21396 4891 18327 22386 22323 15658 3616 -2073 -24419 -34261 -35434 -46024 -43318 -18896
12491a8896j1043j569J838k9471J4121K913J7754j382j2696k4363J7455L1795
$$ -18896 -29939 -31508 -29670 -59141 -45020 -42107 -24353 -25735 -38431 -62794 -45339 -13544
12479a3544o925J4286l431j6814J7103n642l798k1155M321K0472L499o624j8825
$$ -13544 -20469 -6183 -9614 -26428 -9325 -14967 -18765 -39920 -35599 -15127 -11628 -18252 -37077
12466c7077K166J4707J2317J8780l226n112K293j9488J0056K2761K40j0823p090
$$ -37077 -34911 -20204 -7887 10893 7667 2555 4848 -14640 -4584 18177 18417 7594 504
12453E04m232J1021j684r943J5272j2540m946K3180n711J9831o021j8566K682
$$ 504 -3728 7293 5609 -4334 10938 -1602 -6548 16632 10921 30752 24731 6165 8847
12440H847j0206k7317Q71j9412K6160k444J9237K5574j906o898q061r1P909j6653
$$ 8847 -1359 -28676 -27805 -47217 -21057 -23501 -4264 21310 19404 12506 4445 4354 12263 -4390
12426d390j0313j4085j2100M027p378j4961J6854L107j2014Q496j4585j3001K4693
$$ -4390 -14703 -28788 -40888 -36861 -44239 -59200 -42346 -39239 -51253 -42757 -57342 -70343 -45650
12413d5650K2157J4268j886K8483J007j8748j9762J6690L4602k3055n294k4346
$$ -45650 -23493 -9225 -11111 17372 18379 -369 -20131 -3441 31161 8106 2812 -21534
12401b1534R527M7672J9986j4899j7952k4310o496J7462J6602j8867j0723J8624
$$ -21534 -12007 35665 55651 40752 22800 -1510 -8006 9456 26058 7191 -3532 15092
12389A5092L5439K0012k1349l5995k5091K321J9828m154o854K6944R073j3548
$$ 15092 50531 70543 49194 13199 -11892 -9571 10257 6103 -751 26193 35266 21718
12377B1718r216J8455M908L409j0005j9591O546P354j2121O436j4036k5017j0744
$$ 21718 12502 30957 35865 39274 29269 9678 16224 23578 11457 17893 3857 -21160 -31904
12364c1904q271L3745L2680J215m090j7472l121l0737p067K3248K7530J6392n72
$$ -31904 -40175 -6430 26250 27465 23375 5903 2782 -27955 -35022 -11774 15756 32148 31576
12351C1576o650k6060j6277Q514j5246J0743l187j5523j1688q308J683J4385R041
$$ 31576 24926 -1134 -17411 -8897 -24143 -13400 -16587 -32110 -43798 -52106 -50423 -36038 -26997
12338b6997J5597j8389n861J4852L8893j93n2067l5115Q128J3083P249j4446J5552
$$ -26997 -11400 -29789 -35650 -20798 18095 17902 -34165 -69280 -61152 -48069 -40820 -55266 -39714
12325c9714K8871k5273P119J9429L0786o996P636m844j6589J5562M838N863J2245
$$ -39714 -10843 -36116 -28997 -9568 21218 14222 21858 17014 425 15987 20825 26688 38933
12312C8933k1460q053M689K2716J5483l6964r017P94K2319k5463k5770J1159J8604
$$ 38933 17473 9420 14109 36825 52308 15344 6327 7121 29440 3977 -21793 -10634 7970
12299G970n44K011K9220K0782p635j9821N90j4228k6438k0854M4921K4743L170
$$ 7970 7426 9437 38657 59439 51804 31983 32573 18345 -8093 -28947 15974 40717 43887
12286D3887l730k0133n087O628j9266k6076R513j2955M573L0464K0595n624J7190
$$ 43887 40157 20024 14937 21565 2299 -23777 -14264 -27219 -22646 7818 28413 22789 39979
12273C9979j6127r406p6J0631n0Q836N369M657n4982k6282J8163L0285K0704K7082
$$ 39979 23852 14446 14370 25001 24951 33787 39156 43813 -11169 -37451 -19288 10997 31701 58783
12259E8783j3244k0100P2j8291o339q906R35J5731L884J4149J4829k214m7322
$$ 58783 45539 25439 25511 7220 881 -8025 -7090 8641 12525 26674 41503 39289 -8033
12246h033j6784J2074J1390K838j5157J7233k30n7537J2005L7763J3116n091q733
$$ -8033 -24817 -12743 -1353 1485 -13672 3561 3331 -54206 -42201 -4438 8678 3587 -5146
12233e146p319r259L2213J7762l1605r403K2873J8139k78j5901j9675J6180J3365
$$ -5146 -12465 -21724 10489 28251 -3354 -12757 10116 28255 27977 12076 -7599 8581 21946
12220B1946j0151K3182l3721j9338K2476j5651l1191p755J4004K8228P882K3448
$$ 21946 11795 34977 1256 -18082 4394 -11257 -42448 -50203 -36199 -7971 -89 23359
12208B3359M1870Q958k0298q855k6056p685j6879K463K1187J8021P95K688k4446
$$ 23359 65229 74187 53889 45034 18978 11293 -5586 -3123 18064 36085 36880 39568 15122
12195A5122k0969O031J1284j7099m2283Q399Q764L6067j881J0058N331K747k1911
$$ 15122 -5847 184 11468 -5631 -47914 -39515 -30751 5316 3435 13493 18824 21571 -340
12182c40j3836J0986K9397N506J3034P527j6610m807L670J0059L4477l7989n690
$$ -340 -14176 -3190 26207 31713 44747 52274 35664 30857 34527 44586 79063 41074 35384
12169C5384O202L557l5225j1149j8214k479K5602J6343K5361L111k1403j3598
$$ 35384 41586 45143 9918 -1231 -19445 -21924 3678 20021 45382 48493 27090 13492
12157A3492J9975N2549J0115k5733l772j2214k1004k2583K7033N7301q08m9691
$$ 13492 33467 86016 96131 70398 66626 54412 33408 10825 37858 95159 94351 44660
12145D4660m550j2196j3210Q90m507p222L9591L0304j712k5763l2783K2231J8338
$$ 44660 40110 27914 14704 15594 11087 3865 43456 73760 72048 46285 13502 35733 54071
12132E4071J5920j0185j0241n278j3998j1336o89J0386J1638k1j7295j3003r976
$$ 54071 69991 59806 49565 44287 30289 18953 18264 28650 40288 40267 22972 9969 -7
12119gK372J6048o813J3825O723K524K3556J8716L5448r801k9865k4277P146j2895
$$ -7 2365 18413 11600 25425 32148 34672 58228 76944 112392 102591 72726 48449 55595 42700
12105D2700j2254m871j4021l0835P229K5753M1638K484j9798J5485k7296l774
$$ 42700 30446 25575 11554 -19281 -12052 13701 55339 57823 38025 53510 26214 22440
12093B2440P675m1341n461K2470q569m0617j8633r454J6402L0479K7755J5310
$$ 22440 30115 -11226 -16687 5783 -2786 -43403 -62036 -71490 -55088 -24609 3146 18456
12081A8456L9875P4730N8456L029j9539n7398l7649j9143P830Q786j3819k33j6315
$$ 18456 58331 133061 191517 194546 175007 117609 79960 60817 68647 77433 63614 63381 47066
12068D7066J8901L1376j3243l931j6592j6505k238J797j0219J5260K043j6378
$$ 47066 65967 97343 84100 80169 63577 47072 44834 46631 36412 51672 53715 37337
12056C7337N341J8712M883J2546n989l0337k6082Q060N86L4431J2308R604K6122
$$ 37337 42678 61390 66273 78819 72830 42493 16411 24471 25057 59488 71796 81400 107522
12043A07522K6178j5677o792P164J5443J3540O067L3078J5037P703K962k7344
$$ 107522 133700 118023 111231 118395 133838 147378 153445 186523 201560 209263 212225 184881
12031A84881n4805j5944j5256k5767k3892M77j1567J3225K6545J4080K4504J9530
$$ 184881 130076 114132 98876 73109 49217 49694 38127 51352 77897 91977 116481 136011
12019A36011Q213j122k9987j4159L613L013j439j6384K998k0534m010n462K2688
$$ 136011 144224 143102 113115 98956 102569 105582 104143 87759 90757 70223 66213 60751 83439
12006H3439l2976J3289J6168L3437J4205j4975j9017P804k939j0404K8735N890
$$ 83439 50463 63752 79920 113357 127562 112587 93570 101374 98435 88031 116766 122656
11994A22656q032K1374K1385P734K9690K9029k3953q548Q801j5623p018J33j6934
$$ 122656 114624 135998 157383 165117 194807 223836 199883 191335 200136 184513 177495 177628 160694
11981A60694K2286J3230q488J5418M0245K0248K6208L0694K259k3330J5140K4132
$$ 160694 182980 196210 187722 203140 243385 263633 289841 320535 322794 299464 314604 338736
11969C38736N924P670J967O077L8392K2835J3096L1594L0960O2589J5382L1584
$$ 338736 344660 352330 354297 360374 398766 421601 434697 466291 497251 559840 575222 606806
11957F06806P0106M9751K4956O3246P9177Q2215R6580J02632R6922R3029J07312
$$ 606806 676912 726663 751619 814865 894042 976257 1072837 1175469 1272391 1365420 1472732
11946A472732J48596K01650K63445K93352L45246L83531N12981O80531Q57400
$$ 1472732 1621328 1822978 2086423 2379775 2725021 3108552 3621533 4302064 5159464
11937E159464J139053J509062K032945K818188M022045N754351P988666R909925
$$ 5159464 6298517 7807579 9840524 12658712 16680757 22435108 30423774 40333699
11929D0333699R674498N694447p25836o399670r129923q909586p212822n406378
$$ 40333699 50008197 55702644 54976808 48577138 39447215 30537629 23324807 17918429
11921A7918429l965964k929603k147776j642500j289692r87975p49340n88688
$$ 17918429 13952465 11022862 8875086 7232586 5942894 4954919 4205579 3616891
11913C616891m53353l44116l06741k63881k76571k26642j53372j36657j05606
$$ 3616891 3163538 2819422 2512681 2248800 1972229 1745587 1592215 1455558 1349952
11904A349952r3418j21251o7330n9341o1557m6133m1515k1810m0725k0723j5074
$$ 1349952 1256534 1135283 1067953 1008612 947055 900922 859407 837597 796872 776149 761075
11893G61075l1584j3394q984l4997n1918k8763n5325k8255j2303k0889m9344m2070
$$ 761075 729491 716097 707113 672116 620198 591435 536110 507855 495552 474663 425319 383249
11881C83249j3064j6859j1452j9215J0668j8742n6325j3716k2170r376k2994M858
$$ 383249 370185 353326 341874 322659 333327 314585 258260 244544 222374 212998 190004 194862
11869A94862P954k8910k9383k5069r246k878J5916O724J9800r693J1501K5521
$$ 194862 202816 173906 144523 119454 110208 107330 123246 129970 149770 140077 151578 177099
11857A77099j4825l5734k6665J9009K7715k780j5410j8186J7096J3457k53l597
$$ 177099 162274 126540 99875 118884 146599 143819 128409 110223 127319 140776 140523 136926
11845A36926r887k8019j4061J8766K6320l892r280m351O868j7625r460j2430M676
$$ 136926 127039 99020 84959 103725 130045 126153 116873 112522 119390 101765 92305 79875 84551
11832H4551J4378l8158M694J8697N209k4242r150J5878J354n829Q550o291q790
$$ 84551 98929 60771 65465 84162 89371 65129 55979 71857 73211 67382 75932 69641 60851
11819F0851j6382l2662j378j1220p048j3082M2327J1368j1383l536P100J8481
$$ 60851 44469 11807 10429 -791 -7839 -20921 21406 32774 21391 17855 24955 43436
11807D3436K7437K3099k1206l7023j2724l04R883J5994J3896J4261J5224L004
$$ 43436 70873 93972 72766 35743 23019 22715 32598 48592 62488 76749 91973 94977
11795I4977j3992O445j5457J6150Q567k6065o786J6326k0747j6353j8470J083
$$ 94977 80985 87430 71973 88123 96690 70625 63839 80165 59418 43065 24595 25678
11783B5678N059R859j958j6028k340J7515j4887J6468J5331J3542J9220K0644
$$ 25678 30737 40596 38638 22610 20270 37785 22898 39366 54697 68239 87459 108103
11771A08103M5597J0469l1409j7933j8901N539k922m2365j4378J1161o970j6356
$$ 108103 153700 164169 132760 114827 95926 101465 98543 56178 41800 52961 45991 29635
11759B9635r589J7110j2475j1280k0312j6266K7704l265k3551J8107J8595J9870
$$ 29635 20046 37156 24681 13401 -6911 -23177 4527 1262 -22289 -4182 14413 34283
11747C4283K0774j2424q086P481K0509J6780O523k1781l6102P673R118j0083j2183
$$ 34283 55057 42633 34547 42028 62537 79317 85840 64059 27957 35630 44748 34665 22482
11734B2482j1922j0480l307q405J2298o447J284J5249r152k6199L798J5204O960
$$ 22482 10560 80 -3227 -11632 666 -5781 -4497 10752 1600 -24599 -20801 -5597 1363
11721A363K8908K8765k2298k353R582O621l9977k8312K6884j070J4361K9453j5771
$$ 1363 30271 59036 36738 34385 43967 50588 10611 -17701 9183 8113 22474 51927 36156
11708C6156j9654k852n565M674L0474q120k3330l2317J645R376K2778j6089L643
$$ 36156 16502 13650 8085 12759 43233 35113 11783 -20534 -18889 -9513 13265 -2824 819
11695H19J5004k6903k9657J1094J5593M119J6885L7268N194n7399n9647K3606
$$ 819 15823 -11080 -40737 -29643 -14050 -9931 6954 44222 49416 -7983 -67630 -44024
11683d4024M5163Q732l0939J6722K4171o937J8780J3937K3781K4446j8948j9020
$$ -44024 1139 9871 -21068 -4346 19825 12888 31668 45605 69386 93832 74884 55864
11671E5864k1438m5240j0947Q703N1099J6561R17K9376Q6251J51107J77031J73574
$$ 55864 34426 -10814 -21761 -13058 38041 54602 55519 84895 171146 322253 499284 672858
11659F72858J55695m588j04632j56296j69792j27048o5373n2601Q440j8130p4664
$$ 672858 828553 823965 719333 563037 393245 266197 200824 148223 156663 138533 63869
11648F3869m0283j2678K5088K5499k3730N018K7433k925j4279J6886k97l0351
$$ 63869 23586 10908 35996 61495 37765 42783 70216 67291 53012 69898 69601 39250
11636C9250J5814L0995J7480M936O566J7135O5932J02897J71253J85952R8819
$$ 39250 55064 86059 103539 108475 115041 132176 198108 301005 472258 658210 757029
11625G57029r605j40292j60229j32637p3061m4186n3905m1590l2651m1044k3287
$$ 757029 747424 607132 446903 314266 241205 197019 143114 101524 68873 27829 4542
11614D542J5391n352p722p897K6255J0851k1040j6754J3273j1262K188j2719l580
$$ 4542 19933 14581 6859 -1038 25217 36068 15028 -1726 11547 285 2473 -10246 -13826
11601a3826K6792l601N823O21j4809o994K16K2653J5518j0568R177k734k4640
$$ -13826 12966 9365 15188 15809 1000 -5994 -5778 16875 32393 21825 31002 28268 3628
11588C628P97R65K0893k0754j7752K7324j324j5702j6095j1487K0199O761j1287
$$ 3628 4425 5390 26283 5529 -12223 15101 13777 -1925 -18020 -29507 -9308 -2547 -13834
11575a3834r628M068K2648J3740o849j1173k3659J102N93j6764k0702p340K5949
$$ -13834 -23462 -19394 3254 16994 10145 -1028 -24687 -23585 -22992 -39756 -60458 -67798 -41849
11562d1849J9116j432Q64j7138K7638K3601J2825J8677j9819j336K9349m946l5916
$$ -41849 -22733 -24165 -23301 -40439 -12801 10800 23625 42302 22483 21147 50496 45550 9634
11549I634k4427r193P980J775M466j30O600J5145j763M324Q644l828l6921j4614
$$ 9634 -14793 -23986 -16006 -14231 -9765 -9895 -3295 11850 10087 14411 23055 19227 -17694 -32308
11535c2308L0122r623j3053K139q609J3558j5750n935L413N414J5125j1798J03
$$ -32308 -2186 -11809 -24862 -22723 -31332 -17774 -33524 -39459 -36046 -30632 -15507 -27305 -27202
11522b7202M162K255P522l27k071O455j6760j4147L3355K0515O546o141n882j1710
$$ -27202 -23040 -20785 -13263 -13590 -15661 -9206 -25966 -40113 -6758 13757 20303 14162 8280 -3430
11508c430Q213R454j7548l700l680L533J0512Q746J5723r959j3943L231m976j822
$$ -3430 4783 14237 -3311 -7011 -10691 -7158 3354 12100 27823 17864 3921 7152 2176 354
11494C54p413L4899J2521l2026l9666K5308J5724k930R39j7209J5775K0753m930
$$ 354 -7059 27840 40361 8335 -31331 -6023 9701 6771 7710 -9499 6276 27029 22099
11481B2099M147j490N278N391j5155l2847j8503K287r580l2554O368J6970O783
$$ 22099 26246 24756 30034 35425 20270 -12577 -31080 -28793 -38373 -70927 -64559 -47589 -40806
11468d0806N141P213J2577J5243J3059Q706k3622K5869m785J7894J881j2919r070
$$ -40806 -35665 -28452 -15875 -632 12427 21133 -2489 23380 18595 36489 38370 25451 16381
11455A6381j1677J516k9421L9827L5671k0218k0099j951J6210J5766k09o2539
$$ 16381 4704 6220 -23201 16626 52297 32079 11980 10029 26239 42005 41796 -20743
11443b0743K035o53J9149K3308j4976j1985Q843Q591R892k4o129q323P716M4895
$$ -20743 -18708 -19361 -212 23096 8120 -3865 4978 13569 23461 23437 17308 8985 16701 61596
11429F1596j220m1603j0879l7528r506L324j9912K3215K6723j0799J2748J4351
$$ 61596 60376 18773 7894 -29634 -39140 -35816 -55728 -32513 -5790 -16589 -3841 10510
11417A0510k4516J4581K8164k236j7034M150j897o789N216L0292J8861m057m8958
$$ 10510 -14006 575 28739 26503 9469 13619 11722 4933 10149 40441 59302 55245 6287
11404F287k8552k389L69N69j4054k15L2542P956r094k818Q110l0592L069M6127
$$ 6287 -22265 -24654 -24285 -23716 -37770 -37985 -5443 2513 -6581 -9399 -1289 -31881 -28812 17315
11390A7315L3978k8503m1988J518M840J8166k8897j0832N379n679K9414L2936
$$ 17315 51293 22790 -19198 -17680 -12840 5326 -23571 -34403 -29024 -34703 -5289 27647
11378B7647J081j2933j1065Q558k5007k0346q07J3265k4949k132L3660J9115r764
$$ 27647 28728 15795 4730 13288 -11719 -32065 -32872 -19607 -44556 -46688 -13028 6087 -3677
11365c677k0591j0639J1692J3788J7479K093k6216J2796K3623k0714J8552j711
$$ -3677 -24268 -34907 -23215 -9427 8052 10145 -16071 -3275 20348 -366 18186 16475
11353A6475j5718n682K9907j7654l5054q204j0677J0648K0255Q729l62R087j6074
$$ 16475 757 -4925 24982 7328 -27726 -35930 -46607 -35959 -15704 -6975 -7337 1750 -14324
11340a4324N019r905j7003J4454K7008J6891q53k3797K2427K0029l4416P71J7813
$$ -14324 -9305 -19210 -36213 -21759 5249 22140 21287 -2510 19917 39946 5530 6301 24114
11327B4114k7104n670k517J9758J313j2304l0832l5608k1868K9712L8839N696
$$ 24114 -2990 -8660 -11177 8581 9894 -2410 -33242 -68850 -90718 -61006 -22167 -16471
11315a6471J1442J4603J146j2114j2311p504o391L260K7202J3193o632k3400n582
$$ -16471 -5029 9574 10720 -1394 -13705 -21209 -27600 -24340 2862 16055 9423 -13977 -19559
11302a9559k2830J3459M991J069k624j4089N064J1437K7685j477l301n017K68
$$ -19559 -42389 -28930 -23939 -22870 -25494 -39583 -34519 -23082 4603 3126 -175 -5192 -4924
11289d924j3612J6573K1435R601j0104o961K4817J7014k104j6911k45j686j2144
$$ -4924 -18536 -1963 19472 29073 18969 12008 36825 53839 51735 34824 34579 32893 20749
11276B0749J267j2069j1268M338O81j0961P468J5689l6020p05J9264j0951l0052
$$ 20749 22016 9947 -1321 3017 3698 -7263 205 15894 -20126 -20831 -1567 -12518 -42570
11263d2570N088o73J3817l1720j0319K5565M2032J3537j0201J3014M0737j526
$$ -42570 -37482 -38155 -24338 -56058 -66377 -40812 1220 14757 4556 17570 58307 56781
11251E6781l5046k5575j6998J4734J9211n218l4320J9541r310k6867L780L2616
$$ 56781 21735 -3840 -20838 -6104 13107 7889 -26431 -6890 -16200 -43067 -39287 -6671
11239f671K9836O733j3051j2101K2573k7401j9257j1508P160K0273j2351k0762
$$ -6671 23165 29898 16847 4746 27319 -82 -19339 -30847 -23687 -3414 -15765 -36527
11227c6527K3865J8981K76J6958K6713k6382N235k7403j0653M423L4346M7509
$$ -36527 -12662 6319 6595 23553 50266 23884 29119 1716 -8937 -4514 29832 77341
11215G7341n754k8470j3301k7498k1597L8438J7574k441j1438J1324J821j2935
$$ 77341 71587 43117 29816 2318 -19279 19159 36733 34292 22854 34178 35999 23064
11203B3064M978j4392j5590J3757K2499k8819j1340J4230j7300m454q549m038
$$ 23064 28042 13650 -1940 11817 34316 5497 -5843 8387 -8913 -13367 -21916 -25954
11191b5954J4026L7155k29p697r349k6800L475L481j8791n787R212J8878J2909
$$ -25954 -11928 25227 24998 17301 7952 -18848 -15373 -11892 -30683 -36470 -27258 -8380 4529
11178D529L8497J2993q58k4442n638K4323j0856k1561J5916N880j1789l368m214
$$ 4529 43026 56019 55161 30719 25081 49404 38548 16987 32903 38783 26994 23626 19412
11165A9412m655J3195K343l7409j1683R507J1633p525p667j4642K8863l666j5680
$$ 19412 14757 27952 30295 -7114 -18797 -9290 2343 -5182 -12849 -27491 1372 -2294 -17974
11152a7974J8181O72k1636k6K762K1776p868m939j8045J200J9648P685L64m069
$$ -17974 207 879 -20757 -20783 -18021 3755 -4113 -9052 -27097 -25897 -6249 1436 1800 -2269
11138b269J4366J4798k1767m0506J481K3150O375M049m753l153J9541P986j8535
$$ -2269 12097 26895 5128 -35378 -33897 -10747 -4372 -323 -5076 -8229 11312 19298 763
11125G63O536J5033N412K3456j7913j8187J510J8791L807k386r874o948J3791
$$ 763 7299 22332 27744 51200 33287 15100 16610 35401 39208 36822 26948 20000 33791
11112C3791j3043n646k4692q706M4685P987m2570m1866k6707K3753L3334J0695
$$ 33791 20748 15102 -9590 -18296 26389 34376 -8194 -50060 -76767 -53014 -19680 -8985
11100h985K8850J7782M296o85j3683k436j600q621j435J6823j3202j1856P867
$$ -8985 19865 37647 41943 41258 27575 25139 23539 14918 13483 30306 17104 5248 13115
11087A3115j2637j8783K3197K0963k921K0932o179j5047k042N506j8082j9804
$$ 13115 478 -18305 4892 25855 22934 43866 37687 22640 20598 26104 8022 -11782
11075a1782N439j2666j984J5388P824K1051n069K703N84k496K3738J5858j0225
$$ -11782 -6343 -19009 -20993 -5605 2219 23270 18201 20904 21488 18992 42730 58588 48363
11062D8363n707R330n058l638j1823K514k3799k9916J0600K6588R961K2002m226
$$ 48363 42656 51986 46928 43290 31467 33981 10182 -19734 -9134 17454 27415 49417 45191
11049D5191j8838K0O727J1248N161L8869J5503m802M683j2752l5630M329J5624
$$ 45191 26353 26373 33100 44348 49509 88378 103881 99079 103762 91010 55380 59709 75333
11036G5333l448o659L5199O7401R786j1109L775J218J3113k3324q588o935J4009
$$ 75333 71885 65226 100425 167826 177612 166503 170278 171496 184609 161285 152697 145762 159771
11023A59771K8463j88M4008L5409j6300r380j2556j4489k0827l4787j74q371j3962
$$ 159771 188234 188046 232054 267463 251163 241783 229227 214738 193911 159124 158950 150579 136617
11010A36617J1848J9059Q570K3951M618l2839l4368n497j726l3192k5859q467
$$ 136617 148465 167524 176094 200045 204663 171824 137456 131959 130233 97041 71182 62715
10998F2715J4020L3337k9015j7560R487k8874j7932J0479M905L176J8192r573
$$ 62715 76735 110072 81057 63497 72984 44110 26178 36657 41562 44738 62930 53357
10986E3357k5548J33J0687k5832k187K4386J0012j8074p710n213J855K2031K0094
$$ 53357 27809 27942 38629 12797 10610 34996 45008 26934 19224 14011 15866 37897 57991
10973E7991r170k5108m651n79M19J191j1120l037P675J7100j3386J2985q842j5031
$$ 57991 48821 23713 19062 18483 18902 20093 8973 5936 13611 30711 17325 30310 21468 6437
10959F437M801J3961j232J2371J083j2727j1919j4432n824J9901m600j2863j4882
$$ 6437 11238 25199 23967 36338 37421 24694 12775 -1657 -7481 12420 7820 -5043 -19925
10946a9925J5274L2797j3251l456j1056N207J3621J1052o671q087j8379k3217
$$ -19925 -4651 28146 14895 11439 383 5590 19211 30263 23592 15505 -2874 -26091
10934b6091J0536J6402J616k2217O361K4878J1516j9194J1336K2991j6649J0284
$$ -26091 -15555 847 2463 -19754 -13393 11485 23001 3807 15143 38134 21485 31769
10922C1769J0630l2679P168L3041L654k964p104k3374k1809K2510K8772n32k4651
$$ 31769 42399 9720 16888 49929 53583 50619 43515 20141 -1668 20842 49614 49082 24431
10909B4431m431J2902l1317o328J2640J0753J9818K325n69l034J2907l4195o62
$$ 24431 20000 32902 1585 -4743 7897 18650 38468 40793 40224 37190 50097 15902 15240
10896A5240j0254K72J9566O236j56k4286j1202K4257K6499L116j6883q184k6790
$$ 15240 4986 5258 24824 31060 30904 6618 -4584 19673 46172 49288 32405 24221 -2569
10883b569L763J0789p945m351J60L435J9346P65P226M913k9258M049K7292q656
$$ -2569 1194 11983 4038 -313 -153 3282 22628 23393 30619 35532 6274 10323 37615 28959
10869B8959l782L868q304k708M305m032j2178K526j656K2134n235K0926K724l003
$$ 28959 25177 29045 20741 18033 22338 18306 6128 8654 6998 29132 23897 44823 47547 44544
10855D4544k930j428J3398r582j8155k3653k5904K0105K1583L772l831J5213l066
$$ 44544 41614 40186 53584 44002 25847 2194 -23710 -3605 17978 21750 17919 33132 30066
10842C0066l0195j5159Q022R558J7507n190L172P38j6188j017K5784n099L95K5440
$$ 30066 -129 -15288 -7266 2292 19799 14609 17781 18519 2331 1314 27098 21999 22394 47834
10828D7834q84k5384m313k940J3275j1516n606J5914M724q961K08Q946O172r547
$$ 47834 46950 21566 17253 14313 27588 16072 10466 26380 31104 22143 22351 31297 37469 27922
10814B7922j1786L698J0160k783L893J0879R531o568N594j1472m6851K4476K6386
$$ 27922 16136 19834 29994 27211 31104 41983 51514 44946 50540 39068 -7783 16693 43079
10801D3079M288L276L174j999k2314j1782K5063J720R2K6181j0016j2277K065
$$ 43079 47367 50643 53817 51818 29504 17722 42785 44505 44597 70778 60762 48485 50550
10788E0550O470k0288q323r238K2413q51J3247K930O993m461k971J7376j9383
$$ 50550 57020 36732 28409 19171 41584 40733 53980 56910 63903 59442 56471 73847 54464
10775E4464l6187l9179j5078J5174k4446j4569K3202M7774o554j1198j2469q073
$$ 54464 18277 -20902 -35980 -20806 -45252 -59821 -36619 11155 4601 -6597 -19066 -27139
10763b7139K0715Q258p279N43Q609k2319j2567R305n995J47J6491J3270k3577
$$ -27139 -6424 1834 -5445 -4902 3707 -18612 -31179 -21874 -27869 -27722 -11231 2039 -21538
10750b1538M970Q438q556j8104m2143J2865K3004J7665M732j215j5450J6804k241
$$ -21538 -16568 -8130 -16686 -34790 -76933 -64068 -41064 -23399 -18667 -19882 -35332 -18528 -20769
10737b0769M718l121L6808Q44j0649l364R017N465K4902J1152o502l382J183j2685
$$ -20769 -16051 -19172 17636 18480 7831 4467 13484 18949 43851 55003 48501 45119 46302 33617
10723C3617q366m601J8228J4511J7023J8395J300j1574L659J5877L3150J3169
$$ 33617 25251 20650 38878 53389 70412 88807 90107 78533 82192 98069 131219 144388
10711A44388j4431m0593l5625P306q086L2118O4728L0056O561j9984k3061j5726
$$ 144388 129957 89364 53739 61045 52959 85077 149805 179861 186422 166438 143377 127651
10699A27651j1210r951k9433j4820K4859J7438p974J9342L2724j4940m2108k1834
$$ 127651 116441 106490 77057 62237 87096 104534 96560 115902 148626 133686 91578 69744
10687F9744K649K6509N716R89l1604O875K8579J7198P495P585j8042J0841K28
$$ 69744 72393 98902 104618 105607 74003 80878 109457 126655 134150 141735 123693 134534 134762
10674A34762k9844j2435j7937J3742J0884P662J3573K1587J998l6135k217J113
$$ 134762 104918 92483 74546 88288 99172 106834 120407 141994 143992 107857 105640 106753
10662A06753k4117r8J7246J1199J2096P007n501r838P56J3940K6338P199M4402
$$ 106753 82636 82538 99784 110983 123079 130086 124585 114747 115503 129443 155781 162980 207382
10649B07382K7327J96k765k4476J212M4575k1607j8776J9726K1459K5053N9346
$$ 207382 234709 234905 232140 207664 208876 253451 231844 213068 232794 254253 279306 338652
10637C38652R55J8476J9554M4576O4259P5335O5643P9980O9616L7138R8927R2088
$$ 338652 339607 358083 377637 422213 486472 561807 627450 707430 777046 814184 913111 1005199
10625A005199Q6980J50508K03849K73286L30750M82440O69618R61064J344768
$$ 1005199 1092179 1242687 1446536 1719822 2050572 2533012 3202630 4163694 5508462
10616E508462J783382K101402K105534J524282O15314k24229p11843o47758k37667
$$ 5508462 7291844 9393246 11498780 13023062 13638376 13414147 12702304 12054546 11816879
10607A1816879L91873J212705K221532L411363M305094M176982K515286N0121
$$ 11816879 12208752 13421457 15642989 19054352 23359446 27536428 30051714 30101835
10599C0101835j933590k708436k401310j468570k02593J253008K872415M507123
$$ 30101835 28168245 25459809 23058499 21589929 21387336 22640344 25512759 30019882
10591C0019882N516749M866042K111275j473119m188161n126144m545861l250041
$$ 30019882 35536631 40402673 42513948 41040829 36852668 31726524 27180663 23930622
10583B3930622j776572l40591J020249K212640K875441K292966L27928k094751
$$ 23930622 22154050 21813459 22833708 25046348 27921789 30214755 30542683 28447932
10575B8447932l700229m092886l523272k494880j527432p15171P362N63357P30476
$$ 28447932 24747703 20654817 17131545 14636665 13109233 12394062 12401424 12964781 13695257
10566A3695257L65418m54070j339807j908401k025775j810781j450198j099967
$$ 13695257 14060675 13606605 12266798 10358397 8332622 6521841 5071643 3971676
10558C971676q31779n99491m29913l39635k52566j97328j51496j22593j25198
$$ 3971676 3139897 2540406 2110493 1770858 1518292 1320964 1169468 1046875 921677
10549I21677j09259p1933n4984o3981l0548n4669m3338m5340o7737n5197Q836
$$ 921677 812418 740485 685501 621520 590972 536303 492965 447625 379888 324691 333527
10538C33527k8101k5978N212j2662o581N952l5299N68j8976j4202o294J01m675
$$ 333527 305426 279448 284660 271998 265417 271369 236070 236638 217662 203460 197166 197267 192592
10525A92592J9719m039j4526J5698j6461N95J8153L941j3988l7306j8509r110
$$ 192592 212311 208272 193746 209444 192983 193578 211731 215672 201684 164378 145869 136759
10513A36759j899q095J4383J5034p861k3127J6322P28N970J7928k1739k6422L996
$$ 136759 134860 126765 141148 156182 148321 125194 141516 142244 148214 166142 144403 117981 121977
10500A21977j0633j1052j199k902J6200J1379r976j3226l05q072J5341j1129p473
$$ 121977 111344 100292 99093 96191 112391 123770 113794 100568 100263 92191 107532 96403 88930
10487H8930M459j5249J0145K4826J440J511k18q803O345k126n231N029j1621n009
$$ 88930 93389 78140 88285 113111 114551 116062 115844 107041 113386 111260 106029 111058 99437 94428
10473I4428N01M5457K3188L378k2830p993j3278k7494j4793K1016l3054L319K158
$$ 94428 94929 140386 163574 166952 144122 136129 122851 95357 80564 101580 68526 71845 74003
10460G4003k620L850L5356K3761l779N78j3697r96p441L786j6905j9678r109J2020
$$ 74003 71383 75233 110589 134350 130571 131149 117452 116456 109015 112801 95896 76218 67109 79129
10446G9129L7888m006m189L1554P834k0401p197p764j3524k5914l0779L000J3444
$$ 79129 117017 113011 108822 140376 148210 127809 120612 112848 99324 73410 42631 45631 59075
10433E9075j6394l47O451K931J1147o029k507l124K79k793K0734K710j4965J5776
$$ 59075 42681 42334 48785 51716 62863 56834 54327 51203 51482 48689 69423 72133 57168 72944
10419G2944k6855k2378m05J4961L2895J5061m374J0021O833J7038j125k0715j9033
$$ 72944 46089 23711 23306 38267 71162 86223 81849 91870 98703 115741 114616 93901 74868
10406G4868j1212l057Q169M76k9025j5647J4011K9300j5335j0785j5645n912J2107
$$ 74868 63656 60599 68768 69244 40219 24572 38583 67883 52548 41763 26118 20206 32313
10393C2313L0513K9280N561K9889p311k8177j7618k8845J8342j022j7568j047
$$ 32313 62826 92106 97667 127556 120245 92068 74450 45605 63947 62925 45357 44310
10381D4310n63k3064k2747m231R753J8700m061k5456J1008K4712J1996K1526p387
$$ 44310 43747 20683 -2064 -6295 3458 22158 18097 -7359 3649 28361 40357 61883 54496
10368E4496m87J0536P023j4214k7764m1225N040P423q623L797K4475j061m759
$$ 54496 54009 64545 71568 57354 29590 -11635 -6595 828 -7795 -3998 20477 19416 14657
10355A4657j7085M504J384J793K4416K3484p085J8469K3789J3349k0680j4904
$$ 14657 -2428 2076 3460 5253 29669 53153 46068 64537 88326 101675 80995 66091
10343F6091k2349Q364J0639J0369m499j6401l3694p387M1055j265j2194J2901
$$ 66091 43742 52106 62745 73114 68615 52214 18520 11133 52188 50923 38729 51630
10331E1630k1782J7994L99J3824k3537r191J3601J331J0709O997K7335n003q400
$$ 51630 29848 47842 48241 62065 38528 29337 42938 44269 54978 61975 89310 84307 75907
10318G5907j1614m5794k4209J4393o949j7216O210J4830K546K652j0459r645J8448
$$ 75907 64293 18499 -5710 8683 1734 -15482 -9272 5558 8104 10756 297 -9348 9100
10305I100j920j3749K3923L3113L655J3092P908n1252k1082K3057R654J0959j1088
$$ 9100 7180 -6569 17354 50467 54122 67214 75122 23870 2788 25845 35499 46458 35370
10292C5370j3608J4756J0468K5022K576N685j6733p61Q034Q485J0064R055l2549
$$ 35370 21762 36518 46986 72008 74584 80269 63536 62775 70809 79294 89358 98413 65864
10279F5864k4738j5401o578P168L62Q665r67r705j9131J1267O527J2399Q806J4691
$$ 65864 41126 25725 19147 26315 26677 35342 34375 24670 5539 16806 23333 35732 44538 59229
10265E9229L5839P348k0256k5633k1068l9982j8538j0949j9o439m754K527J6078
$$ 59229 95068 102416 82160 56527 35459 -4523 -23061 -34010 -34029 -40468 -45222 -42695 -26617
10252b6617p959j1725q456N437K3653q819K5928o015O17K3052j0845k9498m3724
$$ -26617 -34576 -46301 -54757 -49320 -25667 -34486 -8558 -14573 -13956 9096 -1749 -31247 -74971
10239g4971J9400K9819J7763J4657K4236n737l361N209j893J4940P857j6252k040
$$ -74971 -55571 -25752 -7989 6668 30904 25167 21806 27015 25122 40062 47919 31667 29627
10226B9627K8706J6248K3139l724m64k715k4818l826p921R622K4454K792p927
$$ 29627 58333 74581 97720 93996 93532 90817 65999 62173 54252 63874 88328 91120 83193
10213H3193K6074J4577k0100j24K0879l740k3815R694k04l6718j6439J8087J1101
$$ 83193 109267 123844 103744 103620 124499 120759 96944 106638 106434 69716 53277 71364 82465
10200H2465j9130M699N704p439K7793K5447o616O63K2661P94K0525Q122J6170
$$ 82465 63335 68034 73738 66299 94092 119539 112923 113586 136247 137041 157566 165688 181858
10187A81858K4509j2115l925J7846K6366M4310N4768P8114J28113J78106K44004
$$ 181858 206367 194252 190327 208173 234539 278849 333617 411731 539844 717950 961954
10176I61954L14679L58749L13194K08083O7457q637k1331K0471M4879M9519m3189
$$ 961954 1276633 1635382 1948576 2156659 2224116 2215479 2194148 2214619 2259498 2309017 2265828
10165B265828j36172k53156l47969l30299k78987j96677r9367q8469n6133o0289
$$ 2265828 2129656 1876500 1528531 1198232 919245 722568 623201 534732 478599 418310
10155D18310k2548J0795J3901k1687k9045m0330o4034l4523o766j459j8471P436
$$ 418310 395762 406557 420458 398771 369726 329396 265362 230839 224073 222614 204143 211579
10143B11579J3584M0223L948J1269q884l9482l2155l1117k7763J786q734J3066
$$ 211579 225163 265386 269334 280603 271719 232237 200082 168965 141202 142988 134254 147320
10131A47320L3056J4408k6692j6425r069P363k2712k2436j5133J8982K0698P108
$$ 147320 180376 194784 168092 151667 142598 149961 127249 104813 89680 108662 129360 136468
10119A36468J711k4437k3425L433J7150k255k2767R552p635l2928O283K3827j507
$$ 136468 138179 113742 90317 93750 110900 108645 85878 95430 87795 54867 61150 84977 83470
10106H3470Q799n905r528J0227j1911j1462o811L282Q885J7300O106J8552K468
$$ 83470 92269 86364 76836 87063 75152 63690 56879 60161 69046 86346 92452 111004 113472
10093A13472m1886k8314l828r444j6179J1576N627J1009K848K5727J6472J4988
$$ 113472 71586 43272 39444 30000 13821 25397 31024 42033 44881 70608 87080 102068
10081A02068K562R907K0228J3295N0972P207J9530n484k8176j5320N795l8418
$$ 102068 104630 114537 134765 148060 199032 206239 225769 220285 192109 176789 182584 144166
10069A44166j2704J2654j0300l1074J9398p346K0011J9559J0956k52n653l9692
$$ 144166 131462 144116 133816 102742 122140 114794 134805 154364 165320 165068 159415 119723
10057A19723l2989j069m309K4176p661k1896J9136K6785o583p204K5757K5043
$$ 119723 86734 85665 81356 105532 97871 75975 95111 121896 115313 108109 133866 158909
10045A58909k6602K0182N754k3792j2280j2959K6611j1049J837L4712J7486r100
$$ 158909 132307 152489 158243 134451 122171 109212 135823 124774 126611 161323 178809 169709
10033A69709J5905r40k595m680j4091j7174M2818J5875k3574M294L343m6396j1329
$$ 169709 185614 184674 182079 177399 163308 146134 188952 204827 181253 185547 188890 142494 131165
10020A31165K3693j1702J9998J4347J6929J0870k9304j9258K392j4895j4904k2180
$$ 131165 154858 143156 163154 177501 194430 205300 175996 156738 159130 144235 129331 107151
10008A07151J0376J6403R164j5980l0026p422K7568J0260J5443j1315l82J8303
$$ 107151 117527 133930 143094 127114 97088 89666 117234 127494 142937 131622 131240 149543
9996A49543J7062k597J0510P290K4329k442j3445j8173r734N028j5039k0134j2039
$$ 149543 166605 164008 174518 181808 206137 203695 190250 172077 162343 167371 152332 132198 120159
9983A20159Q996L1985J3192j3294J4555J1519O823Q634J7541Q968L4215j1421
$$ 120159 129155 161140 174332 161038 175593 187112 193935 202569 220110 229078 263293 251872
9971B51872k1873j0342R776R911k169Q475N745M399j4k2398k7795J856j7670K2119
$$ 251872 229999 219657 229433 239344 237175 245650 251395 255794 255780 233382 205587 207443 189773 211892
9957B11892J5475J4937K1713j645P142m728P304j3023j9705l4020j0131J0332
$$ 211892 227367 242304 264017 262372 269514 264786 272090 259067 239362 205342 195211 205543
9945B05543l0804k2213j6163k3836p509l1281l6185k6374k2270k5826n4143p2780
$$ 205543 174739 152526 136363 112527 105018 73737 37552 11178 -11092 -36918 -91061 -163841
9933a63841p7261q3641m8699j4096K4275M3592L0238K7181J4233m567j15M1348
$$ -163841 -241102 -324743 -373442 -387538 -363263 -319671 -289433 -262252 -248019 -252586 -252701 -211353
9921b11353J01343J07114J32054J22765N8328J6836j2069l2431l1233k7189k9324
$$ -211353 -110010 -2896 129158 251923 310251 327087 315018 282587 251354 224165 194841
9910A94841l4779k6722m7965m3070P147P659K3887M0778N7571M9826N3992J0622
$$ 194841 160062 133340 85375 42305 49452 57111 80998 121776 179347 229173 283165 293787
9898B93787L0238M9405L0460O0199N3595N6462O8097K9208P4215N4117N5239L883
$$ 293787 324025 373430 403890 464089 517684 574146 642243 671451 745666 799783 855022 858905
9886H58905L849L9944r150P072L8140Q7275N3782J0397k4481n3556r2316r0928
$$ 858905 862754 902698 893548 900620 938760 1026035 1079817 1090214 1065733 1012177 919861 828933
9874H28933q7153n4771k5137J9049L6574J2172k5080l775m7221l0452J0890j9516
$$ 828933 741780 687009 661872 680921 717495 729667 704587 700812 653591 623139 634029 614513
9862F14513J3243L5890N9677J6066j695m1883o4799n1826r249l6825j0511R644
$$ 614513 627756 663646 723323 739389 737694 695811 631012 579186 569937 533112 522601 532245
9850E32245J12R919K8264L944J6161J7656K119K2365J3587R581K4720N1414O8438
$$ 532245 532357 542276 570540 574484 590645 608301 610420 632785 646372 655953 680673 732087 800525
9837H00525N0773O3667O0330N2900J3108K6057M8183M2961J5271L6281Q8309O4177
$$ 800525 851298 914965 975295 1028195 1041303 1067360 1115543 1158504 1173775 1210056 1298365 1362542
9825A362542K3949N4121K2288L7562N6252P4900P2943O6496Q7895R4492J12287
$$ 1362542 1386491 1440612 1462900 1500462 1556714 1631614 1704557 1771053 1858948 1953440 2065727
9814B065727J05986Q9636Q8279P3673R2771J26121J34945J50400J77025J83024
$$ 2065727 2171713 2261349 2349628 2423301 2516072 2642193 2777138 2927538 3104563 3287587
9804C287587K12128K43016K79322L10950M19184N49236O34198Q04691J037041
$$ 3287587 3499715 3742731 4022053 4333003 4752187 5301423 5935621 6740312 7777353
9795G777353J231877J365639J374929J314072J309235J383021J533967J741561
$$ 7777353 9009230 10374869 11749798 13063870 14373105 15756126 17290093 19031654
9787A9031654J990151K302127K771806L513133M765941O854254J0374926J6433561
$$ 19031654 21021805 23323932 26095738 29608871 34374812 41229066 51603992 68037553
9779F8037553K6699712M2341400N8611104O6102484O4739588M7588195K1191391
$$ 68037553 94737265 137078665 195689769 261792253 326531841 374120036 395311427
9772C95311427J668082o148901j304894O534242J1300571r46115k4395438m6631550
$$ 395311427 396979509 390830608 389525714 396059956 407360527 406414412 382018974 335387424
9764C35387424o2283377o4292972n5357532m1436234k8428760j9044473j2918039
$$ 335387424 273104047 208811075 153453543 112017309 83588549 64544076 51626037
9757E1626037r009663o470057m802104l658992k850289k382669k048909j782419
$$ 51626037 42616374 36146317 31344213 27685221 24834932 22452263 20403354 18620935
9749A8620935j570515j458360j359451j408241j418555j393688j249624j073955
$$ 18620935 17050420 15592060 14232609 12824368 11405813 10012125 8762501 7688546
9741G688546q43282o44723n24112m68278m12081l73577l32833k80995k17090k11096
$$ 7688546 6845264 6200541 5676429 5208151 4796070 4422493 4089660 3808665 3591575 3380479
9731C380479j72654j51998j93361j54769j70161j43178j19250j14502p7071o6123
$$ 3380479 3207825 3055827 2862466 2707697 2537536 2394358 2275108 2160606 2083535 2017412
9721B017412q8759j07437q2995o4050p4280p1656m6614m2314n9757m6148l6969
$$ 2017412 1928653 1821216 1738221 1674171 1599891 1528235 1481621 1439307 1379550 1333402 1296433
9710A296433n6661n3730l6013l1519j9678k5517l7798j6166j4492k2058j6616
$$ 1296433 1239772 1186042 1150029 1118510 1098832 1073315 1035517 1019351 1004859 982801 966185
9699I66185k947J0142j7167p823l5387k5499j8705p843m54l8043k6883k4460k3381
$$ 966185 963238 973380 956213 948390 913003 887504 868799 860956 860502 822459 795576 771116 747735
9686G47735j9667M166J316K6511j7434q150l685l536N09J9676j2988k8991o205
$$ 747735 728068 732234 733550 760061 742627 734477 730792 727256 727765 747441 734453 705462 699257
9673F99257o939J257k4148k5401r598l6496j4278j3565l9223p7561r1551m9879
$$ 699257 692318 693575 669427 644026 634428 597932 583654 570089 530866 453305 361754 311875
9661C11875q235J3656p867k2206j8300l9853m3721L817J5786N015j3793J1243
$$ 311875 303640 317296 309429 287223 268923 229070 185349 189166 204952 209967 196174 207417
9649B07417K9576K5110J6017O7189L7979M4748K892P833R890M5403L3300L3835
$$ 207417 236993 262103 278120 345309 383288 428036 430928 438761 448651 494054 527354 561189
9637E61189M1067j9261n0719k9902q856j6810L942n0296o6366m7591M394l9146
$$ 561189 602256 582995 532276 502374 493518 476708 480650 430354 363988 316397 320791 281645
9625B81645m3779m2441k397L7364P6420J14984J13244P1555N7581K2112K8197
$$ 281645 237866 195425 193028 230392 306812 421796 535040 606595 664176 686288 714485
9614G14485J9616O1197M8488K3765J4364n3741j21185j10849q8585p3699q3972
$$ 714485 734101 795298 843786 867551 881915 828174 706989 596140 507555 433856 349884
9603C49884m0696j9914K015m964k7675J4961J0m2975l5011j0748j4701J3638L1601
$$ 349884 309188 289274 291289 286325 258650 273611 273621 230646 195635 184887 170186 183824 215425
9590B15425O67j9962J134O909J3990j2777j3385j587r816q821Q35K730l484j7788
$$ 215425 216092 196130 197264 204173 218163 205386 192001 190414 180598 171777 172612 175342 171858 154070
9576A54070J165j0769q896P095J7310k3757l0619k5848j9823n281L211J3468k2542
$$ 154070 155235 144466 135570 142665 159975 136218 105599 79751 59928 54647 57858 71326 48784
9563D8784p42R610p835J8350J3469p780K9079l454k4428n297Q824J3976k2709
$$ 48784 48042 57652 49817 68167 81636 73856 102935 99481 75053 69756 78580 92556 69847
9550F9847n5064j5373K5940K6988K357N449m00k1744J5677l288q114K2156n816
$$ 69847 14783 -590 25350 52338 54695 60144 59744 38000 53677 50389 42275 64431 58615
9537E8615j191O368J1818N45J2981l979Q647J9424J3566q33l4893j6680k900j5751
$$ 58615 57424 63792 75610 76155 89136 85157 93804 113228 126794 125961 91068 74388 71488 55737
9523E5737J6055j2686k1996L134N76m956j1069J0034L762J703j8960m171p551
$$ 55737 71792 59106 37110 40244 40820 35864 24795 34829 38591 40294 21334 17163 9612
9510I612J4336J3701J6477K1109J4513k3019j2710q408j3037R530q410j5178j5156
$$ 9612 23948 37649 54126 75235 89748 66729 54019 45611 32574 42104 33694 18516 3360
9497C360J705P520L6889K8277j8180j7143L915k5167k2623J8513K4587K338k0958
$$ 3360 5065 12585 49474 77751 59571 42428 46343 21176 -1447 17066 41653 43991 23033
9484B3033K528J9755j3899l6901p136N364N002J3542L291M339j2508j8787l619
$$ 23033 25561 45316 31417 -5484 -12620 -7256 -2254 11288 14579 18918 6410 -12377 -15996
9471a5996l481J2220l0352l4095K348J7044K4498J7288K257j069j7483j0287J8336
$$ -15996 -19477 -7257 -37609 -71704 -69356 -52312 -27814 -10526 -8269 -9338 -26821 -37108 -18772
9458a8772L2080L5850L8342K2943r593N202j2413P934J1453m8196k4448K1718
$$ -18772 13308 49158 87500 110443 100850 106052 93639 101573 113026 64830 40382 62100
9446F2100M629p424o350r939L832L534j5385l203j0667l3747l513K4167L5303
$$ 62100 66729 59305 52955 43016 46848 50382 34997 31794 21127 -12620 -16133 8034 43337
9433D3337J9431o763j4802k3586Q736J2117k0785j4113J1616N48O999j1012Q663
$$ 43337 62768 56005 41203 17617 26353 38470 17685 3572 15188 15736 22735 11723 20386
9420B0386L2348m745j3150J2417m404m2550K0623p188K996L657R115K1625J2495
$$ 20386 52734 47989 34839 47256 42852 302 20925 13737 16733 20390 29505 51130 63625
9407F3625J878k0004j1150l197j2376K3376K844N053l717l9979P475J4383j6333
$$ 63625 65503 45499 34349 31152 18776 42152 44996 50049 46332 6353 13828 28211 11878
9394A1878k40O567J0398K5378l476k7639K393K1920K0345J846K8397L3318J6847
$$ 11878 11638 18205 28603 53981 50505 22866 25259 47179 67524 69370 97767 131085 147932
9381A47932O823L568K6619J2325M1747P3913P9488J24023J84912K80250L26451
$$ 147932 154755 158323 184942 197267 239014 312927 392415 516438 701350 981600 1308051
9370A308051L25710K85338K01495N8178m0746l7065j7654M2101k063j15956k11703
$$ 1308051 1633761 1919099 2120594 2178772 2138026 2100961 2083307 2125408 2123345 2007389 1795686
9359A795686k93355l30030k73643k09789j73502j07986o5783p2138m7062l8703
$$ 1795686 1502331 1172301 898658 688869 515367 407381 341598 269460 222398 183695
9349A83695l6359k1026j566K4638J1356j8412r477k0172j8218k6558j8200O577
$$ 183695 147336 126310 124744 149382 160738 142326 132849 112677 94459 67901 49701 56278
9337E6278o351k3332j0961o884p626K5916j128k063P205m773k1581k046R711j7155
$$ 56278 49927 26595 15634 8750 1124 27040 25912 23849 31054 26281 4700 2654 12365 -4790
9323d790N898Q664Q931r79L0148J8173k570m2450k2252j0440J4849j9020L736
$$ -4790 1108 9772 18703 17724 47872 66045 63475 21025 -1227 -11667 3182 -15838 -12102
9310a2102M1517J8287n639P677L685N906J8104j6794p289K831M6897L031j3041
$$ -12102 29415 47702 42063 49740 53425 59331 77435 60641 53352 56183 103080 106111 93070
9297I3070n174m4737j7380M283o760J2551n485K2937j1202J5260M2j2515j6781
$$ 93070 87896 43159 25779 30062 23302 35853 30368 53305 42103 57363 57405 44890 28109
9284B8109p093L147R286L089m2413j1072L9088L100j2108J8612J7305l9655J035
$$ 28109 21016 24163 33449 36538 -5875 -16947 22141 25241 13133 31745 49050 9395 10430
9271A0430K694P311n727l630J0065J1929J1558j1024j7351l52R638J2443j3919
$$ 10430 13124 20435 14708 11078 21143 33072 44630 33606 16255 15903 25541 37984 24065
9258B4065M085J6445p536k7506j3195K4946K4035J5827k8924k5158j5730M510
$$ 24065 28150 44595 37059 9553 -3642 21304 45339 61166 32242 7084 -8646 -4136
9246d136J7188J5134K2041r022l2640j9645L8660L2987o241k6552r322L0052j987
$$ -4136 13052 28186 50227 41205 8565 -11080 27580 60567 54326 27774 18452 48504 46517
9233D6517m5045P581R493q664o139K3000J1717j4946P385N927P530k0667o971
$$ 46517 1472 9053 18546 9882 3743 26743 38460 23514 30899 36826 44356 23689 16718
9220A6718J0154J364q594k3965l427L6473p704k4971K2572K593j4614m3437j2536
$$ 16718 26872 28236 19642 -4323 -7750 28723 21019 -3952 18620 21213 6599 -36838 -49374
9207d9374J4188M1129M3659K6602j0006k8350J5863l3486m4577P599P241O030
$$ -49374 -35186 5943 49602 76204 66198 37848 53711 20225 -24352 -16753 -9512 -3482
9195c482P313k538m837J6257j1838P434J6264K962j1028P545j7551J4891o363
$$ -3482 3831 1293 -3544 12713 875 8309 24573 27535 16507 24052 6501 21392 15029
9182A5029J95N630J1170j4935l5821K162L1923J7555O339j9932J943j2053l532
$$ 15029 15224 20854 32024 17089 -18732 -16570 15353 32908 39247 19315 21258 9205 5673
9169E673M1282j2711k1828K813N566K590o32m681q713j1921N33m68k9253q37K1485
$$ 5673 46955 34244 12416 15229 20795 23385 22753 18072 9359 -2562 -2029 -2497 -31750 -32587 -11102
9154a1102j9294m323r292J43l111L1987J6684j6354k6574n385q785J7073N0010
$$ -11102 -30396 -34719 -44011 -43868 -46979 -14992 1692 -14662 -41236 -46621 -55406 -38333 11677
9141A1677M996j0938r508k3078o470O778q132J1011k2656J4995J7844M013N136
$$ 11677 16673 5735 -3773 -26851 -33321 -26543 -34675 -23664 -46320 -31325 -13481 -9468 -4332
9128d332j3882J013Q507K130j4091q416j015j0203j5821J5747L9254j1152n765
$$ -4332 -18214 -17201 -8694 -6564 -20655 -29071 -30086 -40289 -56110 -40363 -1109 -12261 -18026
9115a8026J968l342L905J1324K86O925j0221l0277k3938P138J2913L4009J2563
$$ -18026 -16058 -19400 -15495 -4171 -3885 3040 -7181 -37458 -61396 -54258 -41345 -7336 5227
9102E227J1669j2517o733k5937q817R136j285L1259J5653r373J069J5844n218
$$ 5227 16896 4379 -2354 -28291 -37108 -27972 -29257 2002 17655 8282 9351 25195 19977
9089A9977j9669q534r857n016L9273L6541o21k576k6803j6873K812J2658J3862
$$ 19977 308 -8226 -18083 -23099 16174 52715 52094 49518 22715 5842 8654 21312 35174
9076C5174m4470k8443J2790J2249Q526J9592k4089J9725p731k8287J0126m229
$$ 35174 -9296 -37739 -24949 -12700 -4174 15418 -8671 11054 3323 -24964 -14838 -19067
9064a9067n51J6049l7492k5677J3831K2954K785M702K173K9416j0264m1634j8029
$$ -19067 -19618 -3569 -41061 -66738 -52907 -29953 -27168 -22466 -20293 9123 -1141 -42775 -60804
9051f0804J4712j017J6715K9864J5995k1238Q898n744j9916P570l124p103M632
$$ -60804 -46092 -47109 -30394 -530 15465 -5773 3125 -2619 -22535 -14965 -18089 -25192 -20560
9038b0560R630p388m537J0780M878j6778l129J7023J0555K6129J4373m6569n7882
$$ -20560 -10930 -18318 -22855 -12075 -7197 -23975 -27104 -10081 474 26603 40976 -5593 -63475
9025f3475K3898M253J6315J5468q770m4373j2819K4869J4016K8940P906J2415
$$ -63475 -39577 -35324 -19009 -3541 -12311 -56684 -69503 -44634 -30618 -1678 6228 18643
9013A8643K316J9323k7748j5699p357K899k11m299K2452Q78L997k798k5889N131
$$ 18643 20959 40282 12534 -3165 -10522 -7623 -7834 -12133 10319 11197 15194 12396 -13493 -8362
8999h362J7194p343J779l6881k7379J2444K6617M1977J4959k1327k4591j25K3049
$$ -8362 8832 1489 3268 -33613 -60992 -48548 -21931 20046 35005 13678 -10913 -11038 12011
8986A2011R336q674Q293j3370l4398k2647J594P53o680O507Q543j952p298K003
$$ 12011 21347 12673 20966 7596 -26802 -49449 -47855 -47102 -53782 -47275 -38732 -40684 -47982 -45979
8972d5979L958J8780P669j2902J4037P207J654L3434J158n692k4200l526L078
$$ -45979 -42021 -23241 -15572 -28474 -14437 -7230 -5576 27858 29016 23324 -876 -4402 -1324
8959a324Q088o085J2022N587p465J2142J7364j2993k0667L714r834n0268j6435
$$ -1324 6764 679 12701 18288 10823 22965 40329 27336 6669 10383 549 -49719 -66154
8946f6154K1777N366j046M7723J2617j0596j2434j7304O36m429m245J2626q669
$$ -66154 -44377 -39011 -40057 7666 20283 9687 -2747 -20051 -19415 -23844 -28089 -15463 -24132
8933b4132o919L1191K3276o228o542m5428n781M495j079j3109J1011m38q22M28
$$ -24132 -31051 140 23416 17188 10646 -34782 -40563 -36068 -37147 -50256 -39245 -39683 -40505 -40077
8919d0077L4085O410k8420k3606M9160J9490J1380k8816L330M055K266Q810m314
$$ -40077 -5992 418 -28002 -51608 -2448 17042 28422 -394 2936 6991 9257 18067 13753
8906A3753o10K348J268j6838r933j4261j736J949M9193K7319l221l2425m2389
$$ 13753 13143 15491 16759 -79 -10012 -24273 -26009 -24060 25133 52452 49231 16806 -25583
8893b5583J264K1089j5754l765l26J3757P861j1095q538J8826l865L1789k777
$$ -25583 -24319 -3230 -18984 -22749 -23075 -9318 -1457 -12552 -21090 -2264 -6129 25660 22883
8880B2883l1997r66K2402N353J5511K343j7896q781K192J7427l655N738N95j2095
$$ 22883 -9114 -10080 12322 17675 33186 35529 17633 8852 11044 28471 24816 30554 31149 19054
8866A9054O55k2021n042K4469j2172m299L9080p103J686k0246N807j1269j3382
$$ 19054 19709 -2312 -7354 17115 4943 644 39724 32621 34307 14061 19868 8599 -4783
8853d783M051N678J9132Q487q333k68k887j8056J4277P929K0374J2874o431j610
$$ -4783 -732 4946 24078 32565 24232 23964 21077 3021 17298 25227 45601 58475 52044 50434
8839E0434l7589j8962p240L733J0158O151k2536n2195M02O826J7531J0248r995
$$ 50434 12845 -6117 -13357 -9624 534 6685 -15851 -68046 -67644 -60818 -43287 -33039 -43034
8826d3034n726j2149R913J0662L744J0569K4326j3657N971m373k427k7010k0769
$$ -43034 -48760 -60909 -50996 -40334 -36590 -26021 -1695 -15352 -9381 -13754 -16181 -43191 -63960
8813f3960o30J1708J9057J0676J4585K9301J9319M292m335q506j3774J6839J1967
$$ -63960 -64590 -52882 -33825 -23149 -8564 20737 40056 44348 40013 31507 17733 34572 46539
8800D6539k7455k3290j6667m214K1463J5981M730L5946M951l5808k1459j4249
$$ 46539 19084 -4206 -20873 -25087 -3624 12357 17087 53033 57984 22176 717 -13532
8788a3532J4044L693n457k3477j4058J6596J4140Q74J8754J6200j2056j9205k4936
$$ -13532 512 4205 -1252 -24729 -38787 -22191 -8051 -7177 11577 27777 15721 -3484 -28420
8775b8420K0910J0018J8307l4644m3063K3224M1327j247J3960p208l0169P135
$$ -28420 -7510 2508 20815 -13829 -56892 -33668 7659 6412 20372 13164 -17005 -9870
8763i870N621M088M909j039l9569M115K0422r313Q368L3004L393r255q011p637
$$ -9870 -4249 -161 4748 3709 -35860 -31745 -11323 -20636 -12268 20736 24129 14874 6863 -774
8749g74j5514L7L009K3422K7389n225n065k9912j0638j7764J180J359J0079Q55
$$ -774 -16288 -16251 -13242 10180 37569 32344 27279 -2633 -13271 -31035 -29855 -28496 -18417 -17562
8735a7562o405J0697j963j6980r442r384k2426j7592P109J4218J4578M110p019
$$ -17562 -23967 -13270 -15233 -32213 -41655 -51039 -73465 -91057 -83948 -69730 -55152 -51042 -58061
8722e8061J294p407J8041o895K06K3398Q161p548j896m39M801r069K922J3369
$$ -58061 -56767 -64174 -46133 -53028 -52822 -29424 -21263 -28811 -30707 -31146 -26345 -35414 -32492 -19123
8708a9123R577K2065J8234j745o174J334M617j255J3092j7226j7062j0250q870
$$ -19123 -9546 12519 30753 29008 22834 24168 28785 27530 40622 23396 6334 -3916 -12786
8695a2786n901j3545p468J9300J9297K30K5291N816k2887p420j1329J061R302
$$ -12786 -18687 -32232 -39700 -20400 -1103 -873 24418 30234 7347 -73 -11402 -10341 -1039
8682a039K0593r340l4056J2783R324k0728K4949Q651k6479O493K0516P83r508
$$ -1039 19554 10214 -23842 -11059 -1735 -22463 2486 11137 -15342 -8849 11667 12450 2942
8669B942l6889J7479K1669J191J2111L5453q012k2781l7929n534M3835j2234P007
$$ 2942 -33947 -16468 5201 6392 18503 53956 45944 23163 -14766 -20300 23535 11301 18308
8656A8308R009j9180j6227P904k733j0512o015q450j4916L6053L5434K8534o518
$$ 18308 27317 8137 -8090 -186 -2919 -13431 -19446 -27896 -42812 -6759 28675 57209 50691
8643E0691k5601l1554j3838J2870J293J016J7732K3415m855j0669J685m945q473
$$ 50691 25090 -6464 -20302 -7432 -6139 -5123 12609 36024 31169 20500 22185 17240 8767
8630H767j9720l751L938n891L5121K8775n2579j7078O510L145q808J8172r514
$$ 8767 -10953 -14704 -10766 -16657 18464 47239 -5340 -22418 -15908 -12763 -21571 -3399 -12913
8617a2913n697J6824q377J8417J6231m7331l0821L2058K7054j3618j6526k5042
$$ -12913 -18610 -1786 -10163 8254 24485 -22846 -53667 -21609 5445 -8173 -24699 -49741
8605d9741j7462J6938L2761M3298K7124j3218k5700J0175Q945j1168q499j0259
$$ -49741 -67203 -50265 -17504 25794 52918 39700 14000 24175 33120 21952 13453 3194
8593C194j8218n080J1882Q575q937k051m308j583N141o108k7363J3631J3318n390
$$ 3194 -15024 -20104 -8222 353 -8584 -10635 -14943 -16526 -11385 -17493 -44856 -31225 -17907 -23297
8579b3297O721K466K4493J2695J0725j0228J028N736k0817j1536K6258o827p187
$$ -23297 -16576 -14110 10383 23078 33803 23575 24603 30339 9522 -2014 24244 17417 10230
8566A0230R819K3153O191k2616J130q195m480p18l986R157J716q48M720K4651
$$ 10230 20049 43202 49393 26777 27907 19712 15232 14514 10528 19685 21401 20553 25273 49924
8552D9924l7193k9623L779R564j029j3141K1917k0193k3031P098L1888J9658N899
$$ 49924 12731 -16892 -13113 -3549 -4578 -17719 4198 -15995 -39026 -31928 -40 19618 25517
8539B5517j2357j8827o430m057p362Q685j2822J5206Q126P616Q304J5768k5385
$$ 25517 13160 -5667 -12097 -16154 -23516 -14831 -27653 -12447 -4321 3295 11599 27367 1982
8526A982k3663m408p978K1885J7984N572J9640L258o874K027k3517j470l89R833
$$ 1982 -21681 -26089 -34067 -12182 5802 11374 31014 34272 27398 29425 5908 4438 4049 13882
8512A3882J3615Q517q245p921J2447m2333l260L495p893l6454j5830J9547L6263
$$ 13882 27497 36014 27769 19848 32295 -10038 -13298 -9803 -17696 -54150 -69980 -50433 -14170
8499a4170P658k0965k4436j0533K0772K7059J4633k8205k4171j4404N606J7030
$$ -14170 -6512 -27477 -51913 -62446 -41674 -14615 18 -28187 -52358 -66762 -61156 -44126
8487d4126j127K9830J0503j1361k108J3990J0511K3323J5138m1349R432R064J0500
$$ -44126 -45253 -15423 -4920 -16281 -18389 -4399 6112 29435 44573 3224 12656 21720 32220
8474C2220M468J1257j7112m5240N601k226Q649J9048K202L716j9307J6791q90
$$ 32220 36688 47945 30833 -14407 -8806 -11032 -2383 16665 18867 22583 3276 20067 19177
8461A9177M789n201m054K4451m118j0293J0740j1751j9820n430J3355N5880K4623
$$ 19177 23966 18765 14711 39162 35044 24751 35491 23740 3920 -1510 11845 67725 92348
8448I2348m8l0530l7623M723J0412j484J0717j1225j254Q897N684l439m416P721
$$ 92348 92300 61770 24147 28870 39282 37798 48515 37290 36036 44933 50617 47178 42762 50483
8434E0483l8650R866J8996P09l4833j5533J2968O65J8858O341j693j8396k1075
$$ 50483 11833 21699 40695 41404 6571 -8962 4006 4671 23529 29870 28177 9781 -11294
8421a1294J2814j5647l4682K1630K2891J7457r005k0325p177l5941K5414K2076
$$ -11294 1520 -14127 -48809 -27179 -4288 13169 4164 -16161 -23338 -59279 -33865 -11789
8409a1789j8272N059L4132k0978j4665J3054J0437m437j8402L4125r304j1099
$$ -11789 -30061 -25002 9130 -11848 -26513 -13459 -3022 -7459 -25861 8264 -1040 -12139
8397a2139j5839K0694J4138J1507K571j7847j2606N405J0920J8094K1463j4908
$$ -12139 -27978 -7284 6854 18361 20932 3085 -9521 -4116 6804 24898 46361 31453
8385C1453k1604j3217q025k98O0J4691L1901L261l4028k3479N318k6720p441R160
$$ 31453 9849 -3368 -11393 -11691 -11631 3060 34961 38222 4194 -19285 -13967 -40687 -48128 -38968
8371c8968K1115J8533r545R054Q850j2018r705M702J7779L647J5477j5888K3380
$$ -38968 -17853 680 -8865 189 9039 -2979 -12684 -7982 9797 13444 28921 13033 36413
8358C6413j3183j636r584k2237Q489p82k5397m010m159M064K5809J1125J889L05
$$ 36413 23230 21594 12010 -10227 -1738 -2520 -27917 -31927 -36086 -32022 -6213 4912 6801 7106
8344G106M792J2242M1671L8382O2128J03475J0097r3919p5371k7301k2341j7200
$$ 7106 11898 24140 65811 104193 166321 269796 279893 185974 110603 83302 60961 43761
8332D3761l568j9660m045R145J969j2156m746J8076n263m2776j4375K9718n607
$$ 43761 40193 20533 16488 25633 27602 15446 10700 28776 23513 -19263 -33638 -3920 -9527
8319i527J130q690j3190l952J5206m075q819J4296N668j913J6308J1269r895N474
$$ -9527 -8397 -17087 -30277 -34229 -19023 -23098 -31917 -17621 -11953 -13866 2442 13711 3816 9290
8305I290K6754q361p224J7033k760J3105O552K5772N9136J27020J81736Q4144
$$ 9290 36044 27683 20459 37492 34732 47837 54389 80161 139297 266317 448053 532197
8293E32197m7285j37177j50172p4456l5319m1603j7673M428l6127k747K078o285
$$ 532197 484912 347735 197563 123107 87788 46185 28512 32940 -3187 -5934 -3856 -10141
8281a0141m363K6532l627k5521K7348N04j93L0391J7079k1221Q98k6159o454p200
$$ -10141 -14504 12028 8401 -17120 10228 10732 10539 40930 58009 36788 37686 11527 5073 -2127
8267b127J9293J8869N207j369j2184q300J9249J3960k0861J9302m2600m542R414
$$ -2127 17166 36035 41242 39873 27689 19389 38638 52598 31737 51039 8439 3897 13311
8254A3311N2852J7624M7356R6161K8409l7634m8921m1030l0821l7669j5447m6229
$$ 13311 66163 83787 131143 227304 255713 218079 169158 128128 97307 59638 44191 -2038
8242b038l9881J2484J1292K9264J3602r660K27j256L713K7813r136j8528N462
$$ -2038 -41919 -29435 -18143 11121 24723 15063 15290 14034 17747 45560 36424 17896 23358
8229B3358K4938j0679k4220j1026l105N270N178L3036j1033j9631j7253j6354
$$ 23358 48296 37617 13397 2371 -734 4536 9714 42750 31717 12086 -5167 -21521
8217b1521n20N421j1051J0799l043P207k543M584M938l0750J5016J7798l2381
$$ -21521 -22041 -16620 -27671 -16872 -19915 -12708 -15251 -10667 -5729 -36479 -21463 -3665 -36046
8204c6046j2040p48K4918J7163J2325N577j1490L559P755m054L73k5194n3045
$$ -36046 -48086 -48834 -23916 -6753 5572 11149 -341 3218 10973 6919 7292 -17902 -70947
8191g0947O772K6027J142R336N940r487K7768O190l1374j1966O483L0167K4951
$$ -70947 -64175 -38148 -37006 -27670 -21730 -31217 -3449 2741 -28633 -40599 -34116 -3949 21002
8178B1002J4116j3534k3180j4024k719J1181j9250q222J8129K6694P402J0544
$$ 21002 35118 21584 -1596 -15620 -18339 -7158 -26408 -34630 -16501 10193 17595 28139
8166B8139K3538j3181k0314m810j9444J6504J2127k1041o784j5058k0599J9400
$$ 28139 51677 38496 18182 13372 -6072 10432 22559 1518 -5266 -20324 -40923 -21523
8154b1523J2834J9277J1332p894Q595q413J856l426m0302o784M0450J2307p559
$$ -21523 -8689 10588 21920 14026 22621 14208 16064 12638 -27664 -34448 6002 18309 10750
8141A0750m3454l2627L220J9476j1003q99J5472J8964J3891l771m433o217j5286
$$ 10750 -32704 -65331 -62111 -42635 -53638 -54537 -39065 -20101 -6210 -9981 -14414 -20631 -35917
8128c5917l1642o44J0250K8632R444O153L4495J1451M690n567j5428P315k6245
$$ -35917 -67559 -68203 -57953 -29321 -19877 -13724 20771 32222 36912 31345 15917 23232 -3013
8115c013M837J0564l976p017p945R178K1181j2700o58j5992j6218L495j1406J1025
$$ -3013 1824 12388 8412 1395 -6550 2628 23809 11109 10451 -5541 -21759 -18264 -29670 -18645
8101a8645J6301m99J932L2055r778j7312j0181k211l7877k2406K5900K4247J0123
$$ -18645 -2344 -2843 -911 31144 21366 4054 -6127 -8338 -46215 -68621 -42721 -18474 -8351
8088h351p955Q593M24q102n637P748n19j6976J0545K7604L4838p571O632K2931
$$ -8351 -16306 -7713 -7289 -15391 -21028 -13280 -13799 -30775 -20230 7374 42212 34641 41273 64204
8074F4204k2255k6131j4057J660q009k542q063l2289n2256L8267k13l2940L0800
$$ 64204 41949 15818 1761 3421 -4588 -7130 -15193 -47482 -99738 -61471 -61684 -94624 -63824
8061f3824R371k9613J9456J9383K9189N602q426J3811J789k086J7293K45L442
$$ -63824 -54453 -84066 -64610 -45227 -16038 -10436 -18862 -5051 -3262 -5348 11945 12190 15632
8048A5632j066q709k002j1855k5765k8525j4768J1789J6827L4351r484L645j527
$$ 15632 14566 5857 3855 -8000 -33765 -62290 -77058 -65269 -48442 -14091 -23575 -19930 -21457
8035b1457k949K5170j8142J4015J1244j8661q329j368J8240K9903J2210k4738
$$ -21457 -24406 764 -17378 -3363 7881 -10780 -19109 -20477 -2237 27666 39876 15138
8023A5138q912l3374j1483J2607J005J4396j0177j0194J1087K8703K0140k3081
$$ 15138 6226 -27148 -38631 -26024 -25019 -10623 -20800 -30994 -19907 8796 28936 5855
8011E855k7874K984J226j1568L674J3817J4145J8648K1442k8218k7376p563l7652
$$ 5855 -22019 -19035 -17809 -29377 -25703 -11886 2259 20907 42349 14131 -13245 -20808 -58460
7998e8460L305O440j938J6459L4038K3226j1277l088k006k030L6k955R732o559
$$ -58460 -55155 -48715 -50653 -34194 -156 23070 11793 8705 6699 4669 4705 1750 11482 4923
7984D923j13k7359n469J0788J6561J3766j2598j7221J5053L0237J5236J7692j6891
$$ 4923 4810 -22549 -28018 -17230 -669 13097 499 -16722 -1669 28568 43804 61496 44605
7971D4605k3722J6966l497p431P13J0514L0724k1803m5321j2880R330L978J2083
$$ 44605 20883 37849 34352 26921 27634 38148 68872 47069 1748 -11132 -1802 2176 14259
7958A4259M080J2829R611r395k18j2433j9822R61J3521N36j1891k242r452j1085
$$ 14259 18339 31168 40779 31384 31166 18733 -1089 -128 13393 13929 2038 -204 -9656 -20741
7944b0741j2880k2335J5684K0564J4726J0860O852P443P214N150j3370j4638M512
$$ -20741 -33621 -55956 -40272 -19708 -4982 5878 12730 20173 27387 32537 19167 4529 9041
7931I041J4012k318j3709Q006m580Q468P106J409J2432N320k5740k824J6869j1259
$$ 9041 23053 20735 7026 15032 10452 18920 26026 27435 39867 45187 19447 16623 33492 22233
7917B2233j1895p219L7112K440j5613l322M272k6635k3725j0021n840J5516K4813
$$ 22233 10338 3119 40231 42671 27058 23736 28008 1373 -22352 -32373 -38213 -22697 2116
7904B116j7563K31J8171O658O347K1537M784J1531j8087k6502j7360k3276m172
$$ 2116 -15447 -15216 2955 9613 15960 37497 42281 53812 35725 9223 -8137 -31413 -35585
7891c5585n509K357j269K8474K5412K5139q828j2027l043p468j2325L533n036
$$ -35585 -41094 -38737 -40006 -11532 13880 39019 30191 18164 15121 7653 -4672 -1139 -6175
7878f175O96o95L0275j0641n729K6807j7498j622J310j7481k4048L9573M686r487
$$ -6175 -5479 -6174 24101 13460 7731 34538 17040 15418 16728 -753 -24801 14772 19458 9971
7864I971N394J1452j300k0715J69r475j6859l420m85K1726J2850m796j7439K8941
$$ 9971 15365 26817 25517 4802 4971 -4504 -21363 -24783 -25268 -3542 9308 4512 -12927 16014
7850A6014O558r756J2048J5859P180l8467K2174K3826j1717K7108j0031k0293
$$ 16014 22572 12816 24864 40723 47903 9436 31610 55436 43719 70827 60796 40503
7838D0503m3617J2048j0436j1601K3077J467K720j085j3735j7170l197Q281L677
$$ 40503 -3114 8934 -1502 -13103 9974 11441 14161 13076 -659 -17829 -21026 -12745 -9068
7825i068J7635J5041K1804p824r066J0876k759k6844j3182k6496J920o315J1893
$$ -9068 8567 23608 45412 37588 28522 39398 36639 9795 -3387 -29883 -27963 -34278 -22385
7812b2385J5275m334j0317q166P348j1194j5450O306K635K1377O985r723N660
$$ -22385 -7110 -11444 -21761 -29927 -22579 -33773 -49223 -42917 -40282 -18905 -11920 -21643 -15983
7799a5983j512L3031K2190Q41k066j5219k2051j7887K953Q93k4023m966L373m718
$$ -15983 -17495 15536 37726 38567 36501 21282 -769 -18656 -15703 -14810 -38833 -43799 -40426 -45144
7785d5144Q638k08k925l283n416J7140J6614j116j8202J248p2k2916j1807K3568
$$ -45144 -36506 -36714 -39639 -42922 -48338 -31198 -14584 -15700 -33902 -32654 -32726 -55642 -67449 -43881
7771d3881K1832K4217O357j4844o616m201J3775J2371O634k4604l279K3872K2767
$$ -43881 -22049 2168 8525 -6319 -12935 -17136 -3361 9010 15644 -8960 -12239 11633 34400
7758C4400k4980m61o642o311K4192J7375J4772j8291l0769m579L0580k2274r375
$$ 34400 9420 8959 2317 -3994 20198 37573 52345 34054 3285 -1294 29286 7012 -2363
7745b363K150r170j2803K8174l468o75P167j989L07R093J9001O343j0919l2179
$$ -2363 -213 -9383 -22186 5988 2520 1845 9012 7023 7330 16423 35424 41767 30848 -1331
7731a331j9324o406K1065L177O30j449o895r720j7374J6072L8531n087r692j3600
$$ -1331 -20655 -27061 -5996 -2819 -2189 -3638 -10533 -20253 -37627 -21555 16976 11889 2197 -11403
7717a1403O769J0860q445q432j4767r386K973n134L6537j317j5385m383J9299
$$ -11403 -4634 6226 -2219 -10651 -25418 -34804 -31831 -36965 -428 -1745 -17130 -21513 -2214
7704b214J502j2768j1670j873K3155Q621j2122L7925P660L680N835n808j2253
$$ -2214 -712 -13480 -25150 -27023 -3868 4753 -7369 30556 38216 41896 47731 41923 29670
7691B9670k2681l2767o87K0622L282K3874q568k4323J8020N208r732R71J1245
$$ 29670 6989 -25778 -26465 -5843 -2561 21313 12745 -11578 6442 11650 1918 2889 14134
7678A4134J467o856k949O142J1177l3093r228J064m1355O483l06k109J5023J6206
$$ 14134 15601 8745 5796 11938 23115 -9978 -19206 -18142 -59497 -53014 -53320 -55429 -40406 -24200
7664b4200J0387J8368N817L959j2259m0544J5395J9119L5132K548k9025q643j9083
$$ -24200 -13813 4555 10372 14331 2072 -38472 -23077 -3958 31174 33722 4697 -3946 -23029
7651b3029k378J8393J336j9257j8703L2153J8867k5325l722J333k656L899n43
$$ -23029 -25407 -7014 -5678 -24935 -43638 -11485 7382 -17943 -21665 -20332 -22988 -19089 -19632
7638a9632Q968q200k2249K1042L9311j8500j7107K0922Q403r661j972n797k7909
$$ -19632 -10664 -18864 -41113 -20071 19240 740 -16367 4555 12958 3297 1325 -4472 -32381
7625c2381k028k0563J4646M0192j6231k2896J0534O407j1938J5912M106j7944
$$ -32381 -34409 -54972 -40326 -134 -16365 -39261 -28727 -22320 -34258 -18346 -14240 -32184
7613c2184K9593L7713R34j0699j9432j8998M682K3437m142j086n316M086p297
$$ -32184 -2591 35122 36056 25357 5925 -13073 -8391 15046 10904 9818 4502 8588 1291
7600A291m9668l544K6154J9594j6567j8326m529K4224J9490J959k20J185J5674
$$ 1291 -48377 -51921 -25767 -6173 -22740 -41066 -45595 -21371 -1881 78 -142 1043 16717
7587A6717M106j7095k9K9159m765J2804K567l833k2787k9810o166K0706p437M683
$$ 16717 20823 3728 3699 32858 28093 40897 43464 39631 16844 -12966 -19132 1574 -5863 -1180
7573a180J3279k183j0601J0655N901j2219J489P984r25k1501P61K1069P301r510
$$ -1180 12099 9916 -685 9970 15871 3652 5141 13125 12200 -9301 -8540 12529 19830 10320
7559A0320k3983j1511k3169J451J67J2989L1878M3590m053j9599l4645k343L1359
$$ 10320 -13663 -25174 -48343 -46892 -46725 -33736 -1858 41732 37679 18080 -16565 -18908 12451
7546A2451M1614Q765k5021j4335p984P628J885m1024J3893l363j3987K3348J1580
$$ 12451 54065 62830 37809 23474 15490 23118 25003 -16021 -2128 -5491 -19478 3870 15450
7533A5450J7460j6434j3940m425j5904J3902K1661m302j4904j6223p044J3404
$$ 15450 32910 16476 2536 -1889 -17793 -3891 17770 13468 -1436 -17659 -24703 -11299
7521a1299L384j8644l465j9126q540K8806K0843J9728K0895J7926k2588l6690
$$ -11299 -7915 -26559 -30024 -49150 -57690 -28884 -8041 11687 32582 50508 27920 -8770
7509h770k5370P428P165Q045Q339k3860j4673Q107l945J2632N341m4658l7907
$$ -8770 -34140 -26712 -19547 -11502 -3163 -27023 -41696 -33589 -37534 -24902 -19561 -64219 -102126
7496a02126N9455O1911J2877j837P069j1704m394j6349k471M490N051j1019r886
$$ -102126 -42671 19240 32117 30280 37349 25645 21251 4902 2431 6921 11972 953 -8933
7483h933J0879q501k6588r689J2292K3483l087K3555J4413J4056J0749K166r562
$$ -8933 1946 -6555 -33143 -42832 -30540 -7057 -10144 13411 27824 41880 52629 54795 45233
7470D5233o379n603j7530l238p921j5711q677K6634p559o67O171j9780j4703J4040
$$ 45233 38854 33251 15721 12483 4562 -11149 -19826 6808 -751 -1418 4753 -15027 -29730 -15690
7456a5690k839j1992N6550J2628r677l1678k7498o600J7031J0418O06m862n341
$$ -15690 -18529 -30521 26029 38657 28980 -2698 -30196 -36796 -19765 -9347 -8741 -13603 -18944
7443a8944M111k405o848l2857j099Q961o206j795J8116r298P762R345K7189M446
$$ -18944 -14833 -17238 -24086 -56943 -58042 -49081 -55287 -57082 -38966 -48264 -40502 -31157 -3968 478
7429D78j36M021j9171m3721O845J4182L4056L1385n380j0046j6334M920r794k0769
$$ 478 342 4363 -14808 -58529 -51684 -37502 -3446 27939 22559 12513 -3821 1099 -8695 -29464
7415b9464J0058r585l3469J8094J5506k2785l8601J7057L2676K9758j6598q792
$$ -29464 -19406 -28991 -62460 -44366 -28860 -51645 -90246 -73189 -40513 -10755 -27353 -36145
7403c6145K567J9615J5611q191j0423j7607k0403K2006K7507K8653l199k366J7317
$$ -36145 -33578 -13963 1648 -6543 -16966 -34573 -54976 -32970 -5463 23190 19991 17625 34942
7390C4942N095m4500l9370p371M08J2953L31N0372L6797J2587k0375k7698p84
$$ 34942 40037 -4463 -43833 -51204 -50796 -37843 -37512 12860 49657 62244 41869 14171 13387
7377A3387q306j7018K8335o505K550J4277J578J3504n521rN11r823r978q262j5203
$$ 13387 5081 -11937 16398 9893 12443 26720 28298 41802 36281 36272 36783 26960 16982 8720 -6483
7362f483J2169J1389J4206M555k7992k3128J6464R507k3009J8746j685q552j1481
$$ -6483 5686 17075 31281 35836 7844 -15284 1180 10687 -12322 6424 4739 -3813 -15294
7349a5294J6238J349n667j0123K1184J4307O606n403q421r435j2089M165o256
$$ -15294 944 2293 -3374 -13497 7687 21994 28600 23197 14776 5341 -6748 -2583 -8839
7336h839K1018M1550k8683j8919k3193k421N870k6219k6359P173L3677J8752P249
$$ -8839 12179 53729 25046 6127 -17066 -19487 -13617 -39836 -66195 -59022 -25345 -6593 656
7323F56j863J102L580r481j1778p157j40K7442k35M621K149K0345j4500k7131
$$ 656 -1207 -105 3475 -6006 -17784 -24941 -25081 2361 2126 6747 8896 29241 14741 -12390
7309a2390L0137pJ002K028r55n954j6153o175r061k233L260j6900k6140J2954
$$ -12390 17747 17740 18742 20770 19815 13861 -2292 -8467 -17528 -19761 -16501 -33401 -59541 -46587
7295d6587K5299K4425j455l196j4271m2418J5294K3656R362o115J1454L0228J1887
$$ -46587 -21288 3137 1682 -1514 -15785 -58203 -42909 -19253 -9891 -16006 -4552 25676 37563
7282C7563J5843R049l0895J6130J659j0359n3051J1012J8560L470Q692J951P916
$$ 37563 53406 62455 31560 47690 49349 38990 -14061 -3049 15511 18981 27673 29624 37540
7269C7540q759j6583P424O469n3687J6269L4744R121r57j0113k0773l532k3101
$$ 37540 28781 12198 19622 26091 -27596 -11327 23417 32538 31581 21468 695 -2837 -25938
7256b5938N569O494M307J4853j3985k8449j5558J4581J7784J2067q50K1960n419
$$ -25938 -20369 -13875 -9568 5285 -8700 -37149 -52707 -38126 -20342 -8275 -9125 12835 7416
7243G416j1067J2067K126j5382N923J8910K236j5602k960j5460j0021K3771K8800
$$ 7416 -3651 8416 10542 -4840 1083 19993 22229 6627 3667 -11793 -21814 1957 30757
7230C0757k1614j0626j8553q848J916k340J7495O815j7812j2764K2304J4649k3577
$$ 30757 9143 -1483 -20036 -28884 -26968 -29308 -11813 -4998 -22810 -35574 -13270 1379 -22198
7217b2198M676M82L540J712j5301o480J4390J0565j4689r643j8548J950L2060
$$ -22198 -17522 -17040 -13500 -11788 -27089 -33569 -19179 -8614 -23303 -32946 -51494 -49544 -17484
7204a7484L8629J52q505Q249M416K5696K0917k9159l4587j0052K485k6350J4466
$$ -17484 21145 21297 12792 21041 25457 51153 72070 42911 8324 -1728 757 -25593 -11127
7191a1127K9183k6156P08M825J0196r442j9207j6268L9104L6566l7312k3267K9835
$$ -11127 18056 -8100 -7392 -2567 7629 -1813 -21020 -37288 1816 38382 1070 -22197 7638
7178G638j7626j0032r122J4677L2153p306k5640N273p654m390q076j4928J3784
$$ 7638 -9988 -20020 -29142 -14465 17688 10382 -15258 -9985 -17639 -22029 -30105 -45033 -31249
7165c1249K2837K2271J494p046j4166J7768L6070o509l2994k1896l2202K4635
$$ -31249 -8412 13859 15353 8307 -5859 11909 47979 41470 8476 -13420 -45622 -20987
7153b0987K7482J4673Q390K801M137M222J6623j9743k9831m719l7147o990K7511
$$ -20987 6495 21168 29558 32359 36496 40718 57341 37598 7767 3048 -34099 -41089 -13578
7140a3578k0211j983P996J8532j2410J1751K9022J052j4653r193j710J8082O290
$$ -13578 -33789 -35772 -27776 -9244 -21654 -9903 19119 20171 5518 -3675 -5385 12697 18987
7127A8987j2474j7308l1634l5479k2856K8450L9616J8140K455M0832P712l6563
$$ 18987 6513 -10795 -42429 -77908 -100764 -72314 -32698 -14558 -12103 28729 36441 -122
7115a22m1883j1498J6706Q06J1143M3547K38r78j798m695m2142J0358J8401K4213
$$ -122 -42005 -53503 -36797 -35991 -24848 18699 18937 17959 16161 11466 -30676 -20318 -1917 22296
7101B2296J770j6434n154j3724R182J5822j6339n647J2001P479k1608j2144j8129
$$ 22296 24066 7632 2478 -11246 -2064 13758 -2581 -8228 3773 11252 -10356 -22500 -40629
7088d0629J1669K0735k2415j172K2492q384L973l018m095J0481o102p111q819
$$ -40629 -28960 -8225 -30640 -31812 -9320 -17704 -13731 -16749 -20844 -10363 -16465 -23576 -32395
7075c2395m460L3694l655J6246M389K026j8718j3906n571k9585K2547K3637K4783
$$ -32395 -36855 -3161 -6816 9430 13819 15845 -2873 -16779 -22350 -51935 -29388 -5751 19032
7062A9032J2213j764o043k2961j9648P738j357j8835k3209j963K5632K3141j0179
$$ 19032 31245 29481 23438 477 -19171 -11433 -12790 -31625 -54834 -56797 -31165 -8024 -18203
7049a8203j4133l2980K636K1513J4788K9851J9018n115l421k3747q974k716K1368
$$ -18203 -32336 -65316 -62680 -41167 -26379 3472 22490 17375 13954 -9793 -18767 -21483 -115
7036a15J5333P116l8585r312p337R346K5195Q935J5573j5616l5398k7981J060
$$ -115 15218 22334 -16251 -25563 -32900 -23554 1641 10576 26149 10533 -24865 -52846 -51786
7023e1786M3568J7109J728M2856J7748j0818K2685J173m2946m9157m7487j94K0198
$$ -51786 -8218 8891 10619 53475 71223 60405 83090 84263 41317 -7840 -55327 -55521 -35323
7010c5323L4746K7292L457p550M611J0863r52l4556o522o16j5623j6185L813K67
$$ -35323 -577 26715 30172 22622 27233 38096 37144 2588 -3934 -4550 -20173 -36358 -32545 -32278
6996c2278K2539q56j7972j4170J8j9041j9383K1734J9108J0526J2701J11j0975
$$ -32278 -9739 -10595 -28567 -42737 -42719 -61760 -81143 -59409 -40301 -29775 -17074 -16963 -27938
6983b7938K1964J8474o446j0907n888J2195o81K823J1156p248j2654j4803k585
$$ -27938 -5974 12500 6054 -4853 -10741 1454 773 3596 14752 7504 -5150 -19953 -22538
6970b2538p326K3076J6576j8343j4939j19L716j535Q516K7280j8644j2567j7611
$$ -22538 -29864 -6788 9788 -8555 -23494 -23613 -19897 -21432 -12916 14364 -4280 -16847 -34458
6957c4458l008J4645K3135L5295K2098n1643k7059L0649R248j2807j3704j723
$$ -34458 -37466 -22821 314 35609 57707 6064 -20995 9654 18902 6095 -7609 -9332
6945i332l599J7554j3660Q66K2011P518k5637J1028L980k5489M35j6408o431K3744
$$ -9332 -12931 4623 -9037 -8171 13840 21358 -4279 6749 10729 -14760 -14325 -30733 -37164 -13420
6931a3420J1905J9040J0726K3102m236k8081q481J5520k1834K1983J4534k6128
$$ -13420 -1515 17525 28251 51353 47117 19036 10555 26075 4241 26224 40758 14630
6919A4630m6231l9602Q145K3496J7783j1504j837J7725N729J0580j6743j3349
$$ 14630 -31601 -71203 -63058 -39562 -21779 -33283 -35120 -17395 -11666 -1086 -17829 -31178
6907c1178L0181J4903L625P761Q719j0512m4130p702k782j207O571J0942n029
$$ -31178 -997 13906 17531 25292 34011 23499 -20631 -28333 -31115 -32322 -25751 -14809 -19838
6894a9838j2205k355k1081K1765Q344r923J8975l12L523N18p438O551N543K5247
$$ -19838 -32043 -34398 -55479 -33714 -25370 -35293 -16318 -16630 -13107 -12589 -20027 -13476 -7933 17314
6880A7314J2568k7077j8016K6809J7395O205j739J0516L459k5091j963J5892k9517
$$ 17314 29882 2805 -15211 11598 28993 35198 33459 43975 47434 22343 20380 36272 6755
6867F755l4130P806J036k4327L4560R985m855L6584L324J2000n021k1959j8436
$$ 6755 -27375 -19569 -18533 -42860 -8300 1685 -3170 33414 36738 48738 43717 21758 3322
6854C322j3723P08Q969k2667k6820O835M4579M5712j1720l1626r41j0956j8413
$$ 3322 -10401 -9693 -724 -23391 -50211 -43376 1203 46915 35195 3569 2628 -8328 -26741
6841b6741j0715o519J1372O604K3296J7491l7725l0364J1251J8331N313J718J9988
$$ -26741 -37456 -43975 -32603 -25999 -2703 14788 -22937 -53301 -42050 -23719 -18406 -16688 3300
6828C300R597K23p614M855k3682m4570l0976J653N388K1895K5530J0826J5234
$$ 3300 12897 13120 5506 10361 -13321 -57891 -88867 -87214 -81826 -59931 -34401 -23575 -8341
6815h341J1592j4424j4471j8175P519J025L919n745J7240J4397j5437j376q581
$$ -8341 3251 -11173 -25644 -43819 -36300 -35275 -31356 -37101 -19861 -5464 -20901 -22277 -30858
6802c0858K8157J937j0082k7818k924m490K2468Q48R142K99n331J0688O836j841
$$ -30858 -2701 -764 -10846 -38664 -41588 -46078 -23610 -22762 -13620 -13321 -18652 -7964 -1128 -2969
6788b969k0061m054K1272K727q255k3984J0097N935J941R553J0749J5062j5126
$$ -2969 -23030 -27084 -5812 -3085 -11340 -35324 -25227 -19292 -17351 -7798 2951 18013 2887
6775B887j0998R080N724J740r244o612J9885J8672l1230l0082j7884n735j1667
$$ 2887 -8111 969 6693 8433 -811 -7423 12462 31134 -96 -30178 -48062 -53797 -65464
6762f5464Q66K1166K0689R473j1670J1167J9790p34k862K850k8180R147l852n429
$$ -65464 -64598 -43432 -22743 -13270 -24940 -13773 6017 5283 2421 5271 -22909 -13762 -17614 -23043
6748b3043p959J345J3785p505L630L131K1231j9836m3204Q153J2249J9976r232
$$ -23043 -31002 -29657 -15872 -23377 -19747 -16616 4615 -15221 -58425 -50272 -38023 -18047 -27279
6735b7279n740K1921Q877k9561j6291K4552N177j0313q837J8554o014P070O459
$$ -27279 -33019 -11098 -2221 -31782 -48073 -23521 -18344 -28657 -37494 -18940 -24954 -17884 -11425
6722a1425J7300L2342k7930o07J3236j2343j6998J0514R50K4014K0211l4131l1862
$$ -11425 5875 38217 10287 9680 22916 10573 -6425 4089 5039 29053 49264 15133 -16729
6709a6729j7004J6916J4879q961l2j8381k1854M541J8291K2455K7878L467k9239
$$ -16729 -33733 -16817 -1938 -10899 -10931 -29312 -51166 -46625 -28334 -5879 21999 25466 -3773
6696c773j813l1020o778l458K0123K609j9778L499J7083K5962K0539N20j89r21
$$ -3773 -5586 -36606 -43384 -46842 -26719 -24110 -43888 -40389 -23306 2656 23195 23715 23526 22605
6682B2605p594J635l501j7212k3867J0171P355j8000j9234J2033K3213k2173n931
$$ 22605 15011 16646 13145 -4067 -27934 -17763 -10408 -28408 -47642 -35609 -12396 -34569 -40500
6669d0500K8963Q608M687K1978J1957j8620O9p485J0772j505j9513j1271Q202
$$ -40500 -11537 -2929 1758 23736 35693 17073 17142 9657 20429 18924 -589 -11860 -3658
6656c658q102k745j2309L607J316J2202K546j8095j3783P817J7304L4177P062
$$ -3658 -11760 -14505 -26814 -23207 -21891 -9689 -7143 -25238 -39021 -31204 -13900 20277 27339
6643B7339j2439k4243k9096m983K7029P886K9058J0830j3255k2687j2942L3562
$$ 27339 14900 -9343 -38439 -43422 -16393 -8507 20551 31381 18126 -4561 -17503 16059
6631A6059L932k7447k2171q005R343K0726K7066J013j3719l1647k2118K7129K9250
$$ 16059 19991 -7456 -29627 -37632 -28289 -7563 19503 20516 6797 -24850 -46968 -19839 9411
6618I411m963j6215k39L8861J9596J3669j1457N057N824k4233r293m3395j1107
$$ 9411 4448 -11767 -12006 26855 46451 60120 48663 53720 59544 35311 26018 -17377 -28484
6605b8484J0724J7026J0306n677o414j2299j3095P512J8842j4094o893J9293J1748
$$ -28484 -17760 -734 9572 3895 -2519 -14818 -27913 -20401 -1559 -15653 -22546 -3253 8495
6592H495n528k6368O864K4357k1712j7106n383J9312K1564m0402o20K0918L2976
$$ 8495 2967 -23401 -16537 7820 -13892 -30998 -36381 -17069 4495 -35907 -36527 -15609 17367
6579A7367L467q107K9415J8719r698J8180m592l9009j8822r983o680N17R382n628
$$ 17367 20834 12727 42142 60861 51163 69343 64751 25742 6920 -3063 -9743 -9226 156 -5472
6565e472p000J1507o639k136J0215K5779M854k5687m6219k7626K0955L9724J6968
$$ -5472 -12472 -965 -7604 -9740 475 26254 31108 5421 -40798 -68424 -47469 -7745 9223
6552I223k575O238j7983J1160K8758L170k0469j1004K1189K3569N717o475q814
$$ 9223 6648 12886 -5097 6063 34821 37991 17522 6518 27707 51276 56993 50518 41704
6539D1704m0215o804K8850J5686j0033k065l4401m910m63j7258K6308L310j982
$$ 41704 1489 -5315 23535 39221 29188 27123 -7278 -12188 -12651 -29909 -3601 -291 -2273
6526b273K1251K0758r27P336l662O281m910k7719L777q850l2837K3527L649j7489
$$ -2273 18978 39736 38809 46145 42483 48764 43854 16135 19912 11062 -21775 1752 5401 -12088
6512a2088k84N5496l403k0682k8145l2133M335K6401j422m2316J2806M0087J5400
$$ -12088 -12372 43124 39721 19039 -9106 -41239 -36904 -10503 -11925 -54241 -41435 -1348 14052
6499A4052j7129j5726j2925J0069K203R621O993k8159J5069L2658o086N451j1091
$$ 14052 -3077 -18803 -31728 -21659 -19456 -9835 -2842 -31001 -15932 16726 10640 16091 5000
6486E000M14K3440j4693k1017j9135j3713J0872n926K7157J4289k530j9135R182
$$ 5000 5414 28854 14161 -6856 -25991 -39704 -28832 -34758 -7601 6688 4158 -14977 -5795
6473e795K1699j2018m0415k0934J9306J7648R138K1794R881p468j282j2789j6875
$$ -5795 15904 3886 -36529 -57463 -38157 -20509 -11371 10423 20304 12836 11554 -1235 -18110
6460a8110j2436j055J1220J4412J4972k7044j0195M499l7546j5388Q269n165K5986
$$ -18110 -30546 -31601 -20381 -5969 9003 -18041 -28236 -23737 -61283 -76671 -68402 -73567 -47581
6447d7581L0815L052J1409j9840k1377R37k5939o39J6776N201M479k0149J4287
$$ -47581 -16766 -13714 -2305 -22145 -43522 -42585 -68524 -69163 -52387 -47186 -42707 -62856 -48569
6434d8569L8377K1781J2502N582j0493j7609j1984J5415n122k6896l7609l751
$$ -48569 -10192 11589 24091 29673 19180 1571 -10413 5002 -120 -27016 -64625 -68376
6422f8376K4933L5687j0021n841k0294j5039K8844K5042J2910j2310l6574O475
$$ -68376 -43443 -7756 -17777 -23618 -43912 -58951 -30107 -5065 7845 -4465 -41039 -34564
6410c4564J9164k9976j7838R788J0442L4962N882q625j3039o833L445l4268K9531
$$ -34564 -15400 -45376 -63214 -53426 -42984 -8022 -2140 -10765 -23804 -30637 -27192 -61460 -31929
6397c1929j0280L011K91O368o499r53k4160L763J6441j509l246j4116O96K1746
$$ -31929 -42209 -39198 -38907 -32539 -39038 -39991 -64151 -60388 -43947 -45456 -48702 -62818 -62122 -40376
6383d0376J2759L750J4851L9101L1948K5608J994m8160l2305k1182j0073o552
$$ -40376 -27617 -23867 -9016 30085 62033 87641 89635 41475 9170 -12012 -22085 -28637
6371b8637j1275j8737J1596M3917L4046k2620j5676j1958j4032J0829J4114o091
$$ -28637 -39912 -58649 -47053 -3136 30910 8290 -7386 -19344 -33376 -22547 -8433 -14524
6359a4524n107J5748r145M231J0109J8386k6305l6271O684L5635j667k6393j9461
$$ -14524 -19631 -3883 -13028 -8797 1312 19698 -6607 -42878 -36194 -559 -2226 -28619 -48080
6346d8080j2861K3140J5500R568R721k0654r604K593J6062j2195j8138K1741R364
$$ -48080 -60941 -37801 -22301 -12733 -3012 -23666 -33270 -30677 -14615 -26810 -44948 -23207 -13843
6333a3843q011J2012l810r893k322q306J3375Q70J0701L0275J2372k2424n246
$$ -13843 -21854 -9842 -13652 -23545 -25867 -34173 -20798 -19928 -9227 21048 33420 10996 5750
6320E750J6262l213q229k1436r728q650p112m0127J8791K0483l317J230K7476
$$ 5750 22012 18799 10570 -10866 -20594 -29244 -36356 -76483 -57692 -37209 -40526 -39296 -11820
6307a1820K1793p666k2544k939J2345K2462j2949J4911M149k2908P838J4323n331
$$ -11820 9973 2307 -20237 -23176 -10831 11631 -1318 13593 17742 -5166 2672 16995 11664
6294A1664Q314J1361k9486k3459j032J730l085j0028J1858M593k482j3916j513
$$ 11664 19978 31339 1853 -21606 -22638 -20908 -23993 -34021 -22163 -17570 -20052 -33968 -35481
6281c5481j7080K2478J3334J8383K8280j2403q550J778m047n79n430N230L7141
$$ -35481 -52561 -30083 -16749 1634 29914 17511 8961 10739 6692 6113 683 5913 43054
6268D3054k986k166k3934N73J7064j2686k0006m3014k0967l885K7067K1434K3898
$$ 43054 40068 37902 13968 14541 31605 18919 -1087 -44101 -65068 -68953 -41886 -20452 3446
6255C446P197P698j237j410j0584j2418j1433j225L2511J8676l122l4363L896
$$ 3446 10643 18341 17104 15694 5110 -7308 -18741 -19966 12545 31221 28099 -6264 -2368
6242b368L9980L4246l8667k7959J6892L954Q212O020n511j7613L524j9945l093
$$ -2368 37612 71858 33191 5232 22124 26078 34290 40310 34799 17186 20710 765 -2328
6229b328K3163J6058k9747k4312j6214K2292P978j8980Q038K7200k0073k1987
$$ -2328 20835 36893 7146 -17166 -33380 -11088 -3110 -22090 -14052 13148 -6925 -28912
6217b8912l400k252k072j914J1102L524L3075P491m1731j2253L3357O211r916
$$ -28912 -32312 -34564 -36636 -38550 -27448 -23924 9151 16642 -25089 -37342 -3985 2226 -7690
6204g690R550J1170Q08l4224j8255J8181J8438K2889M0098q91l7740k9266j6161
$$ -7690 1860 13030 13838 -20386 -38641 -20460 -2022 20867 60965 60074 22334 -6932 -23093
6191b3093k7652N747L0821N492k2492P322r548J5251L1467M312j1749J905J2994
$$ -23093 -50745 -44998 -14177 -8685 -31177 -23855 -33403 -18152 13315 17627 5878 7783 20777
6178B0777j6091j6009L556j179j2357J0523j6620q891P903M0330K4377j497l1700
$$ 20777 4686 -11323 -7767 -8946 -21303 -10780 -27400 -36291 -28388 11942 36319 34822 3122
6165C122k0891M84K5748k036j2286J3213J4448l907O05j2640j1533k474m9424
$$ 3122 -17769 -17285 8463 6427 -5859 7354 21802 17895 18500 5860 -5673 -8147 -57571
6152e7571l1604R426J7604L1334J1845j505r177J2941R648k379J7269M895l0812
$$ -57571 -89175 -79749 -62145 -30811 -18966 -20471 -29648 -16707 -7059 -9438 7831 12726 -18086
6139a8086J0365N0267M622l0521k5984j7233r328j315q985l823P000M187K1019
$$ -18086 -7721 42546 47168 16647 -9337 -26570 -35898 -37213 -46198 -50021 -43021 -38834 -17815
6126a7815K2823J8528J1474k0800P689J6654k3926k1906M29J8970j3896M370q992
$$ -17815 5008 23536 35010 14210 21899 38553 14627 -7279 -6850 12120 -1776 2594 -6398
6113f398k4957k3998j1678r425K4828K3132K4430L289k7650K85o171m883o555
$$ -6398 -31355 -55353 -67031 -76456 -51628 -28496 -4066 -777 -28427 -28142 -34313 -39196 -45751
6100d5751M2662q76m4399l551J4797j4783q128L8149O619K8071J9063N640j3724
$$ -45751 -3089 -3965 -48364 -51915 -37118 -51901 -60029 -21880 -15261 12810 31873 37513 23789
6087B3789l1191j6702P054k3951J471L4056N717j2955J441M707K3957Q161k4109
$$ 23789 -7402 -24104 -17050 -41001 -39530 -5474 243 -12712 -11271 -6564 17393 25554 1445
6074A445j4025j6671k5005N499K9898J7203j3988p066k0581J5615K2908J6358
$$ 1445 -12580 -29251 -54256 -48757 -18859 -1656 -15644 -22710 -43291 -27676 -4768 11590
6062A1590k5171m79k0962J8064J3115N509L822j8916j8959L445L7654p040J9406
$$ 11590 -13581 -14060 -35022 -16958 -3843 1666 5488 -13428 -32387 -28942 8712 1672 21078
6049B1078J582Q200N876k3533r756j2555p834j8278J0071M436q973o755m069K3229
$$ 21078 22660 30860 36736 13203 3447 -9108 -16942 -35220 -25149 -20713 -29686 -36441 -40510 -17281
6035a7281K9017K5455J1790k9704j7984l930J5976k1378J7958L4833N950n222
$$ -17281 11736 37191 48981 19277 1293 -2637 13339 -8039 9919 44752 50702 45480
6023D5480l640J314K89K6718n550j198q372o718M75j0144n9319k1518j784k0931
$$ 45480 41840 43154 43443 70161 64611 63413 55041 48323 48798 38654 -20665 -42183 -43967 -64898
6009f4898J150j713L1299K4608L901l1113o770n906K1012M842n167J7907j892
$$ -64898 -63748 -65461 -34162 -9554 -5653 -36766 -43536 -49442 -28430 -23588 -28755 -10848 -12740
5996a2740M553k6576j4747L15o684M483J3097k2379p03N2828K5266j7408n748
$$ -12740 -8187 -34763 -49510 -49195 -55879 -51396 -38299 -60678 -61381 -8553 16713 -695 -6443
5983f443K0391N099k0369J8915K5308P858j5503l3700j7832R534N564k8179r973
$$ -6443 13948 19047 -1322 17593 42901 50759 35256 1556 -16276 -6742 -1178 -29357 -39330
5970c9330J5748Q342r30J6965N090K1654K713k3936O970K7764j3981l9874n457
$$ -39330 -23582 -15240 -16170 795 5885 27539 30252 6316 13286 41050 27069 -12805 -18262
5957a8262M709Q286l021k4009r80j9124J0199J4612N358K1105P111K036J2017
$$ -18262 -13553 -5267 -8288 -32297 -33277 -52401 -42202 -27590 -22232 -1127 5984 8020 20037
5944B0037k1144j5714J5332K2044R394o763j2607R935o655k9125q314M0723J3049
$$ 20037 -1107 -16821 -1489 20555 29949 23186 10579 20514 13859 -15266 -23580 17143 30192
5931C0192L811k0893j7169j0962j1104K8837L0186j511k3745k7400L929K0187
$$ 30192 34003 13110 -4059 -15021 -26125 2712 32898 31387 7642 -19758 -15829 4358
5919D358Q739j1502k9438l440q49k4560P63M102p953k298P240K2513J0738J3482
$$ 4358 13097 1595 -27843 -31283 -32132 -56692 -55929 -51827 -59780 -62078 -54838 -32325 -21587 -8105
5905h105j0003R619j3484k3208R671J1554j9674k9996o986j168J9046L9686M6514
$$ -8105 -18108 -8489 -21973 -45181 -35510 -23956 -43630 -73626 -80612 -81780 -62734 -23048 23466
5892B3466j33k6673j8604m235j1315l969K0407L0832K2894j8446j0020q188j3867
$$ 23466 23333 -3340 -21944 -26179 -37494 -41463 -21056 9776 32670 14224 4204 -3984 -17851
5879a7851j8738P131L1635K5546l1406O07J0319k2950r645m894j9560L1188J1885
$$ -17851 -36589 -29458 2177 27723 -3683 -3076 7243 -15707 -25352 -30246 -49806 -18618 -6733
5866f733K4242P675j3226j0361j3065o400j4535M343K5604J6616j3011J4074J8191
$$ -6733 17509 25184 11958 1597 -11468 -17868 -32403 -28060 -2456 14160 1149 15223 33414
5853C3414P874j9052j1286q010N810l523k4120j0679j393K2080P955J3134q186
$$ 33414 41288 22236 10950 2940 8750 5227 -18893 -29572 -30965 -8885 -930 12204 4018
5840D018j2955L870l08J0262O010M62J2841k1539K408j3532l3731K3144J5778
$$ 4018 -8937 -5067 -5375 4887 10897 11359 24200 2661 5069 -8463 -42194 -19050 -3272
5827c272j0082p817R084J3798L1137N424O327K2160K0865r381l1237k3223J5211
$$ -3272 -13354 -21171 -12087 1711 32848 38272 44599 66759 87624 78243 47006 23783 38994
5814C8994J8856K511k6597j8534j9169j9446K66J1398L2210m166o67K4897n365
$$ 38994 57850 60361 33764 15230 -3939 -23385 -23119 -11721 20489 16323 15656 40553 35188
5801C5188k1798j3440k3875R817k017j2988Q431k5462J2358K3344K9612K0302
$$ 35188 13390 -50 -23925 -14108 -16125 -29113 -20682 -46144 -33786 -10442 19170 39472
5789C9472j1196l8755k6978J043L6831K1291j8216L0772K147l8198R276J1134
$$ 39472 28276 -10479 -37457 -36414 417 21708 3492 34264 36411 -1787 7489 18623
5777A8623k2478K61k4945M165R680Q144p560N619J4058j6172l297L6273Q748k0711
$$ 18623 -3855 -3594 -28539 -24374 -14694 -6550 -14110 -8491 5567 -10605 -13902 22371 31119 10408
5763A0408l331K2098j7547O715J7804j5355l3575j5495R898J8184M895o860L3607
$$ 10408 7077 29175 11628 18343 36147 20792 -12783 -28278 -18380 -196 4699 -2161 31446
5750C1446K0347j0369k7078k1406m248q295J5599k4723N698J3795M648k192J5253
$$ 31446 51793 41424 14346 -7060 -11308 -19603 -4004 -28727 -23029 -9234 -4586 -6778 8475
5737H475L552J3785p252l3058k7519J2648K267N275K329j1857p023J8179L3438
$$ 8475 12027 25812 18560 -14498 -42017 -29369 -27102 -21827 -19498 -31355 -38378 -20199 13239
5724A3239R72k8436k3244j505k184J2448k4282j6184K2870L8569J6277j5424r344
$$ 13239 14211 -14225 -37469 -38974 -41158 -28710 -52992 -69176 -46306 -7737 8540 -6884 -16228
5711a6228L33k58l654o487P992L0902M1310j0664j6505L151k2151j7488L479R427
$$ -16228 -15895 -16153 -19807 -26294 -18302 12600 53910 43246 26741 29892 7741 -9747 -6268 3159
5697C159k0131j2181J4324q304q27k0122L827J4495Q416K046n239L2878j5371
$$ 3159 -16972 -29153 -14829 -23133 -23960 -44082 -40255 -25760 -17344 -15298 -20537 12341 -3030
5684c030l2190K3225m6j9639Q349P91K2818J8550k683l8988j8148P239P836j2763
$$ -3030 -35220 -11995 -12041 -31680 -23331 -22540 278 18828 16145 -22843 -40991 -33752 -25916 -38679
5670c8679J3513J1782M912k5861O270K9109L3008q781k0842r454j8317K1116L2144
$$ -38679 -25166 -13384 -8472 -34333 -28063 1046 34054 25273 4431 -5023 -23340 -2224 29920
5657B9920J0268p648q523n15k18j1844K8649j8630k5460o61r393J4941j6220P064
$$ 29920 40188 32540 24017 23502 23284 11440 40089 21459 -4001 -4662 -14055 886 -15334 -8270
5643h270O323K6576J5713K444j9335j8389J4823L319J945j5129k6644q152j2108
$$ -8270 -1947 24629 40342 42786 23451 5062 19885 23204 25149 10020 -16624 -24776 -36884
5630c6884P960J0062K6718l696j3351K21J2967k1644r295q551L318k600J3051
$$ -36884 -28924 -18862 7856 4160 -9191 -8970 3997 -17647 -26942 -35493 -32175 -34775 -21724
5617b1724K352K6219P863j3716Q647j7082j1049J5589L8317j8858j1890J3334
$$ -21724 -19372 6847 14710 994 9641 -7441 -18490 -2901 35416 16558 4668 18002
5605A8002j1343l3018L230L812j4830J9085K2727j6977m226K1754j7284q315N720
$$ 18002 6659 -26359 -23129 -19317 -34147 -15062 7665 -9312 -13538 8216 -9068 -17383 -11663
5592a1663J0826o606J40n79M4154n968M433j1p993l5833q201N67J4334J0666J9056
$$ -11663 -837 -7443 -7303 -7882 36272 30304 34737 34726 26733 -9100 -17301 -16734 -2400 8266 27322
5577B7322K306j4041j3345k6319j4365J3842l492l0960K2933M0203l236K296k1837
$$ 27322 29628 15587 2242 -24077 -38442 -24600 -28092 -59052 -36119 4084 848 3144 -18693
5564a8693m2228J2705J5358J7543K3811P217j4526r306J1673j0120J6563L4037
$$ -18693 -60921 -48216 -32858 -15315 8496 15713 1187 -8119 3554 -6566 9997 44034
5552D4034J9791k7323r280j6778j97L811k1521j2991K554p700R098J5366N757
$$ 44034 63825 36502 27222 10444 10247 14058 -7463 -20454 -17900 -25600 -16502 -1136 4621
5539D621n329K3397l648n562j4763K1795M739M754P696n844J2475K9137l4353
$$ 4621 -708 22689 19041 13479 -1284 20511 25250 30004 37700 31856 44331 73468 39115
5526C9115l8700N740o320m290L1378p729Q142J7928j2471k2541l0260k4816K1556
$$ 39115 415 6155 -165 -4455 26923 19194 27336 45264 32793 10252 -20008 -44824 -23268
5513b3268J9573L9400o895j3633p590m029K789J922J0837j3702j5506J9339J4757
$$ -23268 -3695 35705 28810 15177 7587 3558 6347 8269 19106 5404 -10102 9237 23994
5500B3994j8525l0576O809J9377P589L92O671l2550o449j348K8909Q821n452J0744
$$ 23994 5469 -25107 -18298 1079 8668 9060 15731 -16819 -23268 -24616 4293 13114 7662 18406
5486A8406J4156J451k4193j0190r214J3793j8965J3219J0449J9726L543j0608
$$ 18406 32562 34013 9820 -370 -9584 4209 -14756 -1537 8912 28638 32181 21573
5474B1573k1714j0202j335M788J1612n016l3724P752K5200r94j9892R095J5921
$$ 21573 -141 -10343 -11678 -6890 4722 -294 -34018 -26266 -1066 -2060 -21952 -12857 3064
5461C064k666o228J3036K2887j8259l2864k2903J7597K3656Q769J8865r934k7945
$$ 3064 398 -5830 7206 30093 11834 -21030 -43933 -26336 -2680 6089 24954 15020 -12925
5448a2925K2820J3570k0334k0686m937N38r445l115O381J8678J4408J1447M993
$$ -12925 9895 23465 3131 -17555 -22492 -21954 -31399 -34514 -28133 -9455 4953 16400 21393
5435B1393k8714k2729R443J1565o608n523L865j8668j0121R120R598k4768M8K3038
$$ 21393 -7321 -30050 -20607 -9042 -15650 -21173 -17308 -35976 -46097 -36977 -27379 -52147 -52099 -29061
5421b9061J2188K1107K393M775j914k8496k891R181J2561J0178j7348q166m987
$$ -29061 -16873 4234 6627 11402 9488 -19008 -21899 -12718 -157 10021 -7327 -15493 -20480
5408b0480m324J0894j4183k0523r908L2275J8362M134j1716r063j3098J907K0174
$$ -20480 -24804 -13910 -28093 -48616 -58524 -26249 -7887 -3753 -15469 -24532 -37630 -35723 -15549
5395a5549J1318K685p309l4477Q151K8576J112j0356j6929K6927J5768k6598P229
$$ -15549 -4231 -1546 -8855 -43332 -35181 -6605 -5493 -15849 -32778 -5851 9917 -16681 -9452
5382i452m27J926j6983j5569J0311J6106J6835l559R200L666r492o005k3191L0196
$$ -9452 -9879 -7953 -24936 -40505 -30194 -14088 2747 -812 8388 12054 2562 -3443 -26634 3562
5368C562J050r361J2257K461j1814p513j5895O520r716J6295p241L7708j3268
$$ 3562 4612 -4749 7508 9969 -1845 -9358 -25253 -18733 -28449 -12154 -19395 18313 5045
5355E045j8852K412r304O745J5391l068j540P624o077J9076J8470K7037k8545
$$ 5045 -13807 -11395 -20699 -13954 1437 -1631 -3171 4453 -1624 17452 35922 62959 34414
5342C4414o3896p398L4841L2440J9569K862j5548p54j8717k1885j6599J4472K4115
$$ 34414 -29482 -36880 -2039 30401 49970 52832 37284 36530 17813 -4072 -20671 -6199 17916
5329A7916o684L698Q98j20K3966P928j5285m7349j4757J3744J6495j4382P877
$$ 17916 11232 14930 15828 15708 39674 47602 32317 -15032 -29789 -16045 450 -13932 -6055
5316f055K2048r040p718j6837l7421q764p31K617L0173J9319K001j1198j7230
$$ -6055 15993 6953 -765 -17602 -55023 -63787 -64518 -61901 -31728 -12409 -10408 -21606 -38836
5303c8836K6954J355O689K1985q977N747o965l2710j3621j062j510J1067J2059
$$ -38836 -11882 -10527 -3838 18147 9170 14917 7952 -24758 -38379 -39441 -40951 -29884 -17825
5290a7825K0479k3996M142P392k543l2316l8539J598K0387M2539M6307J5324j1411
$$ -17825 2654 -21342 -17200 -9808 -12351 -44667 -83206 -81608 -61221 -18682 27625 42949 31538
5277C1538p890K775j045n291J6803o299k7227m599p328J877K3508j041k021m969
$$ 31538 23648 26423 25378 20087 36890 30591 3364 -1235 -8563 -6686 16822 15781 13760 8791
5263H791Q22q088m925k272j0996J4699m733L863J3067J8700m362k1419J3454J9715
$$ 8791 9613 1525 -3400 -5672 -16668 -1969 -6702 -2839 10228 28928 24566 3147 16601 36316
5249C6316j3178p356j032k0952j0165R299k422j7563k1327J585K2666N5660K5187
$$ 36316 23138 15782 14750 -6202 -16367 -7068 -9490 -27053 -48380 -46795 -24129 31531 56718
5236E6718J654j9821j5131J8960j8623r40J9254k067k9908j5309M2377O597l0262
$$ 56718 58372 38551 23420 42380 23757 22817 42071 40004 10096 -5213 37164 43761 13499
5223A3499q292k967J6595j500k1125j5514P363j0203M548N662n967K5091m427
$$ 13499 5207 2240 18835 17335 -3790 -19304 -11941 -22144 -17596 -11934 -17901 7190 2763
5210B763k737k2207P304L0460J0550j8336k0470P485Q625l239L29J1990J3326
$$ 2763 26 -22181 -14877 15583 26133 7797 -12673 -5188 3437 198 527 12517 25843
5197B5843m48J519m990k3979L90M25O933M569j7943j5629J0195N34K956j71k404
$$ 25843 25395 26914 21924 -2055 -1665 -1240 5693 10262 -7681 -23310 -13115 -12581 -9625 -9796 -12200
5182a2200p313o376K934J4184j3797J3833P869j2764K1105L64m1098L106Q065
$$ -12200 -19513 -25889 -22955 -8771 -22568 -8735 -866 -13630 7475 7839 -33259 -30153 -22088
5169b2088o032l6642p531J7393J2783O839K16L3869N796k8032k2503L4815J5147
$$ -22088 -28120 -64762 -72293 -54900 -42117 -35278 -35062 -1193 4603 -23429 -45932 -11117 4030
5156D030r01J0882k428k1891l450J08q67j2207k4365n293L7129J450j1141j329
$$ 4030 3129 14011 11583 -10308 -13758 -13650 -14517 -26724 -51089 -56382 -19253 -17803 -28944 -30273
5142c0273k711R808J3909M48J5709j5883k0901J8220K5642P912k3788n564J9283
$$ -30273 -32984 -23176 -9267 -8819 6890 -8993 -29894 -11674 13968 21880 -1908 -7472 11811
5129A1811j565j6586J4621Q321P63N799P324j0775l7457J4290L564L567j150j0382
$$ 11811 10246 -6340 8281 16602 17365 23164 30488 19713 -17744 -3454 110 3677 2527 -7855
5115g855J4689L9035J7437m5198l9745M967J0187l44j9003j8530j1646K3806J4181
$$ -7855 6834 45869 63306 18108 -21637 -16670 -6483 -6827 -25830 -44360 -56006 -32200 -18019
5102a8019j6898J6173J1051R742l991k4236j6361Q385K2713J2173k961q751K2720
$$ -18019 -34917 -18744 -7693 2049 -1942 -26178 -42539 -34154 -11441 732 -2229 -10980 11740
5089A1740m4804k1373J6193K0807K7870q822j5872J5531J4006J2463l487L679
$$ 11740 -33064 -54437 -38244 -17437 10433 1611 -14261 1270 15276 27739 24252 27931
5077B7931j2415q161r406J7092M953n365J1582O011k5752k390R02N823J8862K1718
$$ 27931 15516 7355 -2051 15041 19994 14629 26211 32222 6470 4080 4982 10805 29667 51385
5063E1385J0382k7408k8987k891j8492k2495n65J9264K1290L7927J6876k3528
$$ 51385 61767 34359 5372 2481 -16011 -38506 -39071 -19807 1483 39410 56286 32758
5051C2758l7720q10q017M495K4002O586m686j6954j6707O111k4939p288j2837
$$ 32758 -4962 -5772 -13789 -9294 14708 21294 16608 -346 -17053 -10942 -35881 -43169 -56006
5038e6006K0786L6506k0576l592J0083J2944K2371m454j9589o674J3740j1853
$$ -56006 -35220 1286 -19290 -22882 -12799 145 22516 18062 -1527 -8201 5539 -6314
5026f314j0067r684l43K2595R063l4196j931j3904j2216J2539K026J5957J7563
$$ -6314 -16381 -26065 -26408 -3813 5250 -28946 -30877 -44781 -56997 -44458 -42432 -26475 -8912
5013h912r728J4159K6744J5121M671k1460k185J2448j0876m8859q031M7183K4590
$$ -8912 -18640 -4481 22263 37384 42055 20595 18410 30858 19982 -28877 -36908 10275 34865
5000C4865k8793j8895j0129j1086K411L448K1475J5850N635j2701J6381J4933
$$ 34865 6072 -12823 -22952 -34038 -31627 -28179 -6704 9146 14781 2080 18461 33394
4988C3394m778n191j995l4800n872K2676K0856k095k1045r819l108q494k004O086
$$ 33394 28616 23425 21430 -13370 -19242 3434 24290 22195 1150 -8669 -11777 -20271 -22275 -16189
4974a6189J5286M520N244q518k3628j1792R465J0213n664J5310R76j9890P078
$$ -16189 -903 3617 8861 343 -23285 -35077 -25612 -15399 -21063 -5753 -4777 -24667 -17589
4961a7589p84j5103J1722m165M299r922J43J6239p49L1630J2181M475J788k0754
$$ -17589 -18373 -33476 -21754 -25919 -21620 -31542 -31399 -15160 -15909 15721 27902 32377 34165 13411
4947A3411q082J9111p391l8506J1289J9439N593O009L067M632j6148j7947j1288
$$ 13411 5329 24440 17049 -21457 -10168 9271 14864 20873 23940 28572 12424 -5523 -16811
4934a6811L6324J1824L463J892k4369j1015L5906j8559k7179k779K0118j8242
$$ -16811 19513 31337 34800 36692 12323 1308 37214 18655 -8524 -11303 8815 -9427
4922i427P884K144J6605J2740j1391j5451J1240l224k2309K4430M111j2864J6159
$$ -9427 -1543 601 17206 29946 18555 3104 14344 11120 -11189 13241 17352 4488 20647
4909B0647N130j0824k5864j4298j1235Q962j5325J2735J6126J599L285J5203J0456
$$ 20647 25777 14953 -10911 -25209 -36444 -27482 -42807 -30072 -13946 -12347 -9062 6141 16597
4896A6597o099L7962J1933O222j7646j5932K950J8774j3594o0233k6392J8472
$$ 16597 10498 48460 60393 66615 48969 33037 35987 54761 41167 -19066 -45458 -26986
4884b6986q539J5114K8293j293j861J652j8411j9737M97j0318n513j6936j3259
$$ -26986 -35525 -20411 7882 6589 4728 6380 -12031 -31768 -31271 -41589 -47102 -64038 -77297
4871g7297J4408M203J2008K6135J0938J877O886r310P940L5122M412K500j4538
$$ -77297 -62889 -58686 -46678 -20543 -9605 -7728 -842 -10152 -2212 32910 37322 39822 25284
4858B5284n267Q13M740k2227j7127J3916m300j4501Q692P354j257J7099J4805
$$ 25284 20017 20830 25570 3343 -13784 132 -4168 -18669 -9977 -2623 -3880 13219 28024
4845B8024j0840j2212k374K243j0816J8698l595J5647J4366J008k7407l6341m93
$$ 28024 17184 4972 2598 4841 -5975 12723 9128 24775 39141 40149 12742 -23599 -24092
4832b4092J3294m508P719K884J3756j1327j9983R410J4444j4383K99K0520k797
$$ -24092 -10798 -15306 -7587 -4703 9053 -2274 -22257 -12847 1597 -12786 -12487 8033 5236
4819E236k5989j8060j56P303N799J218K5397L7321k925l4637j5589q793K3612
$$ 5236 -20753 -38813 -38969 -31666 -25867 -24649 748 38069 35144 507 -15082 -23875 -263
4806b63O865J7895n961q642l937O58j573Q327R207j4076m981L5695K3150l1298
$$ -263 6602 24497 18536 9894 5957 6615 5042 13369 22576 8500 3519 39214 62364 31066
4792C1066l2397J7530k0217m5775L8119k494j003J9137o562j891J3201j5509j9689
$$ 31066 -1331 16199 -4018 -49793 -11674 -14168 -15171 3966 -2596 -4487 8714 -6795 -26484
4779b6484m204J8271K9685J3477Q74n0679r057R885L149Q526k0560j5850N583
$$ -26484 -30688 -12417 17268 30745 31619 -19060 -28117 -18232 -15083 -6557 -27117 -42967 -37384
4766c7384N1089K5555j872o397j1761N836Q132l376k2470k7284J4534k8912j2450
$$ -37384 13705 39260 37388 30991 19230 25066 33198 29822 7352 -19932 -5398 -34310 -46760
4753d6760J0943P142N973J1634O25k633l3247R759J9536K5895L0948P447n423
$$ -46760 -35817 -28675 -22702 -11068 -10443 -13076 -46323 -36564 -17028 8867 39815 47262 41839
4740D1839j4438l2028J7250Q372m002J6047J8289l681K291n255J2787o224k4127
$$ 41839 27401 -4627 12623 20995 16993 33040 51329 47648 49939 44684 57471 51247 27120
4727B7120o507k0601k1082J5488J1557j3384k5682j2356J4175J6216J5757J33
$$ 27120 20613 12 -21070 -5582 5975 -7409 -33091 -45447 -31272 -15056 701 834
4715H34j1568K270m748k7789m472J2348k871L5754K5314M786j9091j2644k3382
$$ 834 -10734 -8464 -13212 -41001 -45473 -33125 -35996 -242 25072 29858 10767 -1877 -25259
4702b5259k7257N669k342N638j4641j7188K9618K9746R264J0924mk9820j6541
$$ -25259 -52516 -46847 -49189 -43551 -58192 -75380 -45762 -16016 -6752 4172 4168 -25652 -42193
4689d2193K9512J8825K5468r135m1637p038K3598N852J4144K610p980l356K48
$$ -42193 -12681 6144 31612 22477 -19160 -26198 -2600 3252 17396 20006 12026 8670 8918
4676H918P519k359j7941Q211J7638q098j1715k6267l579J1750Q448K569j9740
$$ 8918 16437 14078 -3863 4348 21986 13888 2173 -24094 -27673 -15923 -7475 -4906 -24646
4663b4646j9583m036l6137j8962L8803N7441J6058J2227r153J452R210k1709Q741
$$ -24646 -44229 -48265 -84402 -103364 -64561 -7120 8938 21165 12012 13464 22674 965 9706
4650I706J5225q278j1234O919j2467O324q263N414K04p007k5544j2405J5193J2719
$$ 9706 24931 16653 5419 12338 -129 6195 -2068 3346 3550 -3457 -29001 -41406 -26213 -13494
4636a3494Q487K4697J5618j2310M106J5485O066O322k8455m3471k5815J3181K2881
$$ -13494 -5007 19690 35308 22998 27104 42589 48655 54977 26522 -16949 -42764 -29583 -6702
4623f702Q673Q539K0637l4249r267N947m574k825l608L8158j1071j9337R55K302
$$ -6702 1971 10510 31147 -3102 -12369 -6422 -10996 -13821 -17429 20729 9658 -9679 -8724 -6422
4609f422k4482k3565L083J0896Q867k727L1022K6281j4238k2012o15J4149l201
$$ -6422 -30904 -54469 -51386 -40490 -31623 -34350 -3328 22953 8715 -13297 -13912 237 -2964
4596b964k8924J9759K6242N071O011m183J3433J7919K368r428l0428k2342J219
$$ -2964 -31888 -12129 14113 19184 25195 21012 34445 52364 54732 45304 14876 -7466 -6247
4583f247J418Q058K9114j0123j8843r037l954j6016J542J1515J3801M735j5564
$$ -6247 -4829 3229 32343 22220 3377 -5660 -9614 -25630 -24088 -12573 1228 5963 -9601
4570i601k6607o933M76J1291J4333l997k1540L4177K4556n554L116k383j0850
$$ -9601 -36208 -43141 -42665 -31374 -17041 -21038 -42578 -8401 16155 10601 13717 11334 484
4557D84m460Q356K0374o424j9153o36J947J5872k5215J1709L1037K113k4685l1371
$$ 484 -3976 4380 24754 18330 -823 -1459 488 16360 -8855 2854 33891 36004 11319 -20052
4543b0052J1243P774l412j1907R721k0048o226J3231J0832k692n388R502k4623
$$ -20052 -8809 -1035 -4447 -16354 -6633 -26681 -32907 -19676 -8844 -11536 -16924 -7422 -32045
4530c2045r842L3572o696k2168p616L209K628K4428K2909L5278N964j168l0406
$$ -32045 -41887 -8315 -15011 -37179 -44795 -41586 -38958 -14530 8379 43657 49621 48453 18047
4517A8047k6179k577m580j3748l0L2161J9609m713J289j3736j3738J66O855Q308
$$ 18047 -8132 -10709 -15289 -29037 -29067 3094 22703 17990 19279 5543 -8195 -8029 -1174 7134
4503G134R233K4678k808k6182k0873k0462q218J047j9570J3001O751J7615P838
$$ 7134 16367 41045 38237 12055 -8818 -29280 -37498 -36451 -56021 -43020 -36269 -18654 -10816
4490a0816K1322J2568J4969K3322j7330j889r002J1177j1006m540J7620M093j0655
$$ -10816 10506 23074 38043 61365 44035 42146 33144 44321 33315 28775 46395 50488 39833
4477C9833j5321K1056q607k1690Q219J1424j0174q611m752m58j6744K054n411
$$ 39833 24512 45568 36961 15271 23490 34914 24740 16129 11377 10919 -5825 -3771 -9182
4464i182j1683m90j22j2240k2285K5589J8142m731j9976R618M2785J5596l200
$$ -9182 -20865 -21355 -21477 -33717 -56002 -30413 -12271 -17002 -36978 -27360 15425 31021 27821
4451B7821m552J5521j4700j0613N328k109j288j4416n005N450k4968k2134K829
$$ 27821 23269 38790 24090 13477 18805 16696 15408 992 -4013 1437 -23531 -45665 -42836
4438d2836K6426J4866J9605L608j2620M21J1100r637k1200k1958k6458K4687J5392
$$ -42836 -16410 -1544 18061 21669 9049 9470 20570 10933 -10267 -32225 -58683 -33996 -18604
4425a8604L5022K9334l1022j8935Q057O417j1359r288o086J2787l176K8452R469
$$ -18604 16418 45752 14730 -4205 3852 10269 -1090 -10378 -16464 -3677 -6853 21599 31068
4412C1068p417M524n720K468K712Q788q368k3038k0829j0659j0112j0965n73J5823
$$ 31068 23651 28175 22455 24923 27635 36423 28055 5017 -15812 -26471 -36583 -47548 -48121 -32298
4398c2298J4847K1820K2884K1352j4993o754j7023o303o968l341j1833k1270L1746
$$ -32298 -17451 4369 27253 48605 33612 26858 9835 3532 -3436 -6777 -18610 -39880 -8134
4385h134N858k1862l895J2286O713J0054J2087j7505k1512j1831J2768R139o354
$$ -8134 -2276 -24138 -28033 -15747 -9034 1020 13107 -4398 -25910 -37741 -24973 -15834 -22188
4372b2188k27M106r583q601N156L1038m193k7459l945J3091L4569o036r2J5187
$$ -22188 -22415 -18309 -27892 -36493 -31337 -299 -4492 -31951 -35896 -22805 11764 5728 5636 20823
4358B0823K5001N738j5880j7832k9171q162J1555J1781m800j4025K0658J7535
$$ 20823 45824 51562 35682 17850 -11321 -19483 -7928 3853 -947 -14972 5686 23221
4346B3221n987O566j778l5570J5116J6079P731J5155j6198j0177p300M656J8134
$$ 23221 17234 23800 22022 -13548 1568 17647 25378 40533 24335 14158 6858 11514 29648
4333B9648k7476l8849K6137J7432K3869K4948J0056k0063k1657k6396J7301M186
$$ 29648 2172 -36677 -10540 6892 30761 55709 65765 45702 24045 -2351 14950 19136
4321A9136j3700J1246q902R411L190K6873P850m617j8401j1272N802m278l5403
$$ 19136 5436 16682 7780 17191 20381 47254 55104 50487 32086 20814 26616 22338 -13065
4308a3065k9399j025K1562K9495j0821Q596K010M247r039l8323q20J1968P698
$$ -13065 -42464 -43489 -21927 7568 -3253 5343 7353 11600 2561 -35762 -36582 -24614 -16916
4295a6916j6479n584p262K5802L659Q28K3757M827Q448k3491o053Q033J6078J6041
$$ -16916 -33395 -38979 -46241 -20439 -16780 -15952 7805 12632 21080 -2411 -8464 -431 15647 31688
4281C1688r048N288J4217n976N623k52j833j0591l217k195K166K1136l1111r605
$$ 31688 22640 27928 42145 36169 41792 41540 39707 29116 25899 23704 25870 47006 15895 6290
4267F290K8964o014j7223P855j578m6518l2658k364M672O735L0981j0287p021
$$ 6290 35254 29240 12017 19872 18294 -28224 -60882 -63246 -58574 -51839 -20858 -31145 -38166
4254c8166K6184K3888j0395j2957l125J6436J7131j5675J1446Q612j9940k2200
$$ -38166 -11982 11906 1511 -11446 -14571 1865 18996 3321 14767 23379 3439 -18761
4242a8761p8J1849j6137j1462J5300L319K7197K4413j3111J7609N949k2382k579
$$ -18761 -18839 -6990 -23127 -34589 -19289 -15970 11227 35640 22529 40138 46087 23705 21126
4229B1126p507j2924j0760J8267j3173q212n475K682N037r700J2618N194m463
$$ 21126 13619 695 -10065 8202 -4971 -13183 -18658 -15976 -10939 -20639 -8021 -2827 -7290
4216g290K0645O85j8407K936K788O382Q346N100k9691l2310K5473K0859r026J3002
$$ -7290 13355 14040 -4367 -1431 1357 7739 16085 21185 -8506 -40816 -15343 5516 -3510 9492
4202I492J1418K167r727j7760j017k0722j02J8270J5949r146R411J3804m0754
$$ 9492 20910 23077 13350 -4410 -5427 -26149 -26251 -7981 7968 -1178 8233 22037 -18717
4189a8717O040L1912K0437j2821j6227k2175j3231j476j8012j1408K8098K1522
$$ -18717 -12677 19235 39672 26851 10624 -11551 -24782 -26258 -44270 -55678 -27580 -6058
4177f058r009j6173j06K7114R425k5016j4257Q128K2418L2880l203J1407l7014
$$ -6058 -15067 -31240 -31346 -4232 5193 -19823 -34080 -25952 -3534 29346 26143 37550 536
4164E36k6035Q491P875J5020j1208J9606j5961k8253N528K4036K1312j913N234
$$ 536 -25499 -17008 -9133 5887 -5321 14285 -1676 -29929 -24401 -365 20947 19034 24268
4151B4268L208j6616j0410K641n42N273K1893k5289j5796J1470K4186j2688k2006
$$ 24268 27476 10860 450 3091 2549 7822 29715 4426 -11370 100 24286 11598 -10408
4138a0408r691J6557k274J3499k2566l0954J9781K9668n529j946J9929o813l100
$$ -10408 -20099 -3542 -5816 7683 -14883 -45837 -26056 3612 -1917 -3863 16066 9253 6153
4125F153K8595j8120k0083K0534K3314o844o114j2115j23n826j5563j1419J546
$$ 6153 34748 16628 -3455 17079 40393 33549 27435 15320 15197 9371 -6192 -17611 -16065
4112a6065P229O203p214q191Q661p410K367r788k2354Q381N418N998J7684L124
$$ -16065 -8836 -2633 -9847 -18038 -9377 -16787 -14420 -24208 -46562 -38181 -32763 -26765 -9081 -5957
4098e957K9535j4094k7304J0266J6555o652l5967o741L1594K3194K9412J0408
$$ -5957 23578 9484 -17820 -7554 9001 2349 -33618 -40359 -8765 14429 43841 54249
4086E4249k2517k6252J1224J8485k1578j47k1089k2386J3331N874k744J8507O424
$$ 54249 31732 5480 16704 35189 13611 13464 -7625 -30011 -16680 -10806 -13550 4957 11381
4073A1381k6697J3990J4639N498k6152l9228l87L872J578J2053K6956J1244m7014
$$ 11381 -15316 -1326 13313 18811 -7341 -46569 -46956 -43084 -41506 -29453 -2497 8747 -38267
4060c8267J6437K6452J8875k4820j5748N713M980n039J1537K1278J0206r753k9556
$$ -38267 -21830 4622 23497 -1323 -17071 -11358 -6378 -11417 120 21398 31604 21851 -7705
4047g705j7480J6235K59k3112J7167q304P737k042k4624L862j8129K4660N1217
$$ -7705 -25185 -8950 -8691 -31803 -14636 -22940 -15203 -17245 -41869 -38007 -56136 -31476 19741
4034A9741L1900k839P323k8329j048l195j3753n183J19j1600m689K0007J9753
$$ 19741 51641 48802 56125 27796 26748 23553 9800 4617 4736 -6864 -11553 8454 28207
4021B8207J7533O453j0589l3330l3586m0127o115R624P677J0737P403J5750J5484
$$ 28207 45740 52193 41604 8274 -25312 -65439 -71554 -61930 -54253 -43516 -36113 -20363 -4879
4008d879J886k266J3163J5004J0353K658k5090K096k3245k5462r541K8479P426
$$ -4879 -2993 -5259 7904 22908 33261 35919 10829 12925 -10320 -35782 -45323 -16844 -9418
3995i418j9964j2930M570J7358j3048q461K2074N429j3966n338J899M768O398
$$ -9418 -29382 -42312 -37742 -20384 -33432 -41893 -19819 -14390 -28356 -33694 -31795 -27027 -20629
3982b0629l732q334k285m278O150o605j9066j3086o948k646q918J2213J1273j2786
$$ -20629 -24361 -32695 -34980 -39258 -33108 -39713 -58779 -71865 -78813 -81459 -90377 -78164 -66891 -79677
3968g9677L031L1047K3050j4499L1234J1907p593Q739M403k1868j9870M607k7114
$$ -79677 -76646 -45599 -22549 -37048 -5814 6093 -1500 7239 11642 -10226 -30096 -25489 -52603
3955e2603K5027J4764K5543L012j4378N408l402q990j919n373R962J0599j601
$$ -52603 -27576 -12812 12731 15743 1365 6773 3371 -5619 -7538 -12911 -2949 7650 6049
3942F049p432J4024k7921j1214j169p735r826J396K0775N972K6575J8187r478
$$ 6049 -1383 12641 -15280 -26494 -27663 -35398 -45224 -43828 -23053 -17081 9494 27681 18203
3929A8203J6323k2920j574N637J8822K2556m534j8253j8150j2234q434N354m409
$$ 18203 34526 11606 10032 15669 34491 57047 52513 34260 16110 3876 -4558 796 -3613
3916c613P600k813J846p664M742L602J0951M928J1858m287O689j4166j8118j2518
$$ -3613 3987 1174 3020 -4644 98 3700 14651 19579 31437 27150 33839 19673 1555 -10963
3902a0963j1765O108K7734k838P485l0285k2404R302J2954J8195j0680j0393J9712
$$ -10963 -22728 -16620 11114 8276 15761 -14524 -36928 -27626 -14672 3523 -7157 -17550 2162
3889B162N388l351j8667J2409J6841L861K5342R55j3403j4218j1583J950l9832
$$ 2162 7550 4199 -14468 -2059 14782 18643 43985 44940 31537 17319 5736 7686 -32146
3876c2146O410K1183K288r758J0806j6084k2108J7859J777l296p262j1510J1468
$$ -32146 -25736 -4553 -2265 -12023 -1217 -17301 -39409 -21550 -19773 -23069 -30331 -41841 -30373
3863c0373J6843N680n623L243K3980l392j1914Q030Q961j7982K3454M700q009
$$ -30373 -13530 -7850 -13473 -10230 13750 10358 -1556 6474 15435 -2547 20907 25607 17598
3850A7598j3621O049M227L908n182j8293k7545o36k738m910J5021K8381j5279
$$ 17598 3977 10026 14253 18161 12979 -5314 -32859 -33495 -36233 -41143 -26122 2259 -13020
3837a3020j3602k0107R561M7590J280j8941j6220J8143J5812j3311q962j6609
$$ -13020 -26622 -46729 -37168 10422 11702 -7239 -23459 -5316 10496 -2815 -11777 -28386
3825b8386k2422k2444J7879K2077K9336j767P525n006j8167q141J4761j1289j7258
$$ -28386 -50808 -73252 -55373 -33296 -3960 -5727 1798 -3208 -21375 -29516 -14755 -26044 -43302
3812d3302j2000J1436L5787J8029O135L03j6631N247J3963K742j8772k4554j5628
$$ -43302 -55302 -43866 -8079 9950 16085 16388 -243 5004 18967 21709 2937 -21617 -37245
3799c7245o602L0007L791J4918J7907k125l0569p021R227q179k698k4910k216
$$ -37245 -43847 -13840 -10049 4869 22776 20651 -9918 -16939 -7712 -15891 -18589 -43499 -45715
3786d5715L7358L2400J7369j0043k2284L12r448K0021L3256m67j3492l5346J0644
$$ -45715 -8357 24043 41412 31369 9085 9397 -51 19970 53226 52759 39267 3921 14565
3773A4565j5297l0294J5775K6009J42N670p741J5900j8915j7942L669K79j547
$$ 14565 -732 -31026 -15251 10758 10900 16570 8829 24729 5814 -12128 -8459 -8180 -9727
3760i727m53P890k4775j3301J0380K1904k9645j1846L3350K3353K5702l97n110
$$ -9727 -10180 -2290 -27065 -40366 -29986 -8082 -37727 -49573 -16223 7130 32832 32435 27325
3747B7325p802Q889N692K2612L86k8942j763k830K224k8576l4218M599k448n318
$$ 27325 19523 28412 34104 56716 57102 28160 26397 23567 25791 -2785 -37003 -32404 -34852 -40170
3733d0170K6738M1282k7459j2656J1792j7276L5729r240m0246p42J2025Q913P572
$$ -40170 -13432 27850 391 -12265 -473 -17749 17980 8740 -31506 -32248 -20223 -11310 -3738
3720c738O866P250m234k9129K523J4805Q877k482N524J2767R145j8110j761M49
$$ -3738 3128 10378 6144 -22985 -20462 -5657 3220 738 6262 19029 28174 10064 8303 8752
3706H752j7380Q025n322K4355O507r744n889m809J6021J8966j5341j4262J6983
$$ 8752 -8628 -603 -5925 18430 24937 15193 9304 4495 20516 39482 24141 9879 26862
3693B6862L4234N27l5485k1188k6658j1749J3613J7542J8665j7860j136k942K788
$$ 26862 61096 61623 26138 4950 -21708 -33457 -19844 -2302 16363 -1497 -2633 -5575 -2787
3680b787K5410j6272l9941m01R93k3117J1987L6189J386P081K1566k367j8002
$$ -2787 22623 6351 -33590 -33991 -32998 -56115 -44128 -7939 -6553 528 22094 19727 1725
3667A725q467J307K0846l550j7712M305K8910R662j1110j471j9933k8485j282
$$ 1725 -6742 -5435 15411 11861 -5851 -1546 27364 37026 25916 24445 4512 -23973 -25255
3654b5255K3782O176J7285j5056q599K2751L0006j566l181k3094r711J396j1493
$$ -25255 -1473 4703 21988 6932 -1667 21084 51090 49524 46343 23249 13538 14934 3441
3641C441j4090l752K2195r397j8374j3465J7089o992N332N595k0867K2571J102
$$ 3441 -10649 -14401 7794 -1603 -19977 -33442 -16353 -23345 -18013 -12418 -33285 -10714 -9612
3628i612K2234K399j588J3392j5540k4957j2323k4171j5939J8563J3752N420M7534
$$ -9612 12622 15021 13433 26825 11285 -13672 -25995 -50166 -66105 -47542 -33790 -28370 19164
3615A9164k3696N343K2482q989j9096O667K004o511o826j6594l176J5943K4158
$$ 19164 -4532 811 23293 14304 -4792 1875 3879 -2632 -9458 -26052 -29228 -13285 10873
3602A0873Q610j0511r26j6729j135l479k1107J4325L12L418O444L209J6738P838
$$ 10873 19483 8972 8046 -8683 -9818 -13297 -34404 -20079 -19767 -16349 -9905 -6696 10042 17880
3588A7880j13M620q376l7894p795K132N569Q479L962J8001J4970K84l8971J0049
$$ 17880 17767 22387 14011 -23883 -31678 -29546 -23977 -15498 -11536 6465 21435 21719 -17252 -7203
3574g203L3223J254L624J2146k1634n119K0297k782l1328J008L744p394l387J0220
$$ -7203 26020 27274 30898 43044 21410 16291 36588 33806 2478 3486 7230 -164 -3551 6669
$$ [...]
##END NTUPLES=NMR SPECTRUM
##END=
