##TITLE=Analysis number 312677
Compound Code ac 35851
Project Code qc-cat
Chemist Name andyc
##JCAMPDX= 6.0         $$ Bruker NMR JCAMP-DX V2.0
##DATA TYPE= NMR SPECTRUM
##DATA CLASS= NTUPLES
##ORIGIN= Bruker BioSpin GmbH
##OWNER= NMR
$$ XWIN-NMR		Version 3.5
$$ Wed Aug 10 15:32:07 2005 GMT Daylight Time (UT+1h)  MAYBRIDGE\NMR@NMR_250MHZ
##.OBSERVE FREQUENCY= 250.131544655141
##.OBSERVE NUCLEUS= ^1H
##.ACQUISITION MODE= SIMULTANEOUS (DQD)
##.ACQUISITION SCHEME= undefined
##.AVERAGES= 16
##.DIGITISER RES= 18
##SPECTROMETER/DATA SYSTEM= dpx250
##.PULSE SEQUENCE= zg30
##.SOLVENT NAME= CDCl3
##.SHIFT REFERENCE= (INTERNAL, CDCl3, 0, 16.522)
##AUDIT TRAIL= $$ (NUMBER, WHEN, WHO, WHERE, WHAT)
$$ ##TITLE= Audit trail, XWIN-NMR		Version 3.5
$$ ##JCAMPDX= 5.01
$$ ##ORIGIN= Bruker BioSpin GmbH
$$ ##OWNER= NMR
$$ C:\u/data/dgb/nmr/ADRS/7530/pdata/1/auditp.txt
$$ ##AUDIT TRAIL=  $$ (NUMBER, WHEN, WHO, WHERE, WHAT)
(   1,<2005-08-10 15:31:44.35 +100>,<MAYBRIDGE\NMR>,<NMR_250MHZ>,
      <created by zg, POWCHK disabled, PULCHK disabled
       configuration hash MD5:
       62 19 C7 07 E1 42 D1 B7 37 6C 3D D0 77 39 F9 E6
       data hash MD5: 64K
       67 33 16 38 DD FB 7B 53 D6 78 12 E5 0D 27 28 3F>)
(   2,<2005-08-10 15:31:57.25 +100>,<MAYBRIDGE\NMR>,<NMR_250MHZ>,
      <Start of raw data processing
       ef LB = 0.3 FT_mod = 6 PKNL = 1 SI = 32K 
       data hash MD5: 32K
       76 AC F1 B0 F4 6F B1 D2 40 21 89 A3 08 19 C3 82>)
(   3,<2005-08-10 15:31:59.82 +100>,<MAYBRIDGE\NMR>,<NMR_250MHZ>,
      <apk 
       data hash MD5: 32K
       68 EF AB 14 CB 52 78 B5 EB BC 15 7E 1A 53 13 6B>)
(   4,<2005-08-10 15:32:00.53 +100>,<MAYBRIDGE\NMR>,<NMR_250MHZ>,
      <abs ABSG = 5 
       data hash MD5: 32K
       B1 47 29 49 D4 2C 6D DA 62 CE 49 3B C5 A5 70 5A>)
$$ ##END=
$$ 
$$ hash MD5
$$ E9 2B BA 71 99 B5 76 13 67 00 EA 62 A9 01 BB 8E
##$RELAX= 
##$RELAX= 
##$RELAX= 
##$RELAX= 
##$RELAX= 
##$RELAX= 
##$RELAX= 
$$ Bruker specific parameters
$$ --------------------------
##$DU= <C:\u>
##$EXPNO= 7530
##$NAME= <ADRS>
##$PROCNO= 1
##$TYPE= <nmr>
##$USER= <dgb>
##$AMP= (0..31)
100 100 100 100 100 100 100 100 100 100 100 100 100 100 100 100 100 100 
100 100 100 100 100 100 100 100 100 100 100 100 100 100 
##$AQSEQ= 0
##$AQ_mod= 3
##$AUNM= <au_zg>
##$AUTOPOS= <44 >
##$BF1= 250.13
##$BF2= 250.13
##$BF3= 250.13
##$BF4= 250.13
##$BF5= 500.13
##$BF6= 500.13
##$BF7= 500.13
##$BF8= 500.13
##$BYTORDA= 1
##$CFDGTYP= 0
##$CFRGTYP= 5
##$CHEMSTR= <none>
##$CNST= (0..31)
1 1 145 1 1 1 1 1 1 1 1 1 1 1 1 1 1 1 1 1 1 1 1 1 1 1 1 1 1 1 1 1 
##$CPDPRG= <>
##$CPDPRG1= <>
##$CPDPRG2= <>
##$CPDPRG3= <>
##$CPDPRG4= <mlev>
##$CPDPRG5= <mlev>
##$CPDPRG6= <mlev>
##$CPDPRG7= <mlev>
##$CPDPRG8= <mlev>
##$CPDPRGB= <>
##$CPDPRGT= <>
##$D= (0..31)
0 1 0 0 0 0 0 0 0 0.06 0 0 0 0 0 0 0.0002 0 0 0 0 0 0 0 0 0 0 0 0 0 0 
0 
##$DATE= 1123684303
##$DBL= (0..7)
120 120 120 120 120 120 120 120 
##$DBP= (0..7)
150 150 150 150 150 150 150 150 
##$DBP07= 0
##$DBPNAM0= <>
##$DBPNAM1= <>
##$DBPNAM2= <>
$$ [...]
##$SUBNAM7= <"">
##$SUBNAM8= <"">
##$SUBNAM9= <"">
##$SW= 20.6930455092707
##$SWIBOX= (0..15)
0 0 3 0 0 0 0 0 0 0 0 0 0 0 0 0 
##$SW_h= 5175.983436853
##$TD= 65536
##$TD0= 1
##$TE= 295.16
##$TE2= 300
##$TE3= 300
##$TEG= 300
##$TL= (0..7)
0 120 120 120 120 120 120 120 
##$TP= (0..7)
150 150 150 150 150 150 150 150 
##$TP07= 0
##$TPNAME0= <>
##$TPNAME1= <>
##$TPNAME2= <>
##$TPNAME3= <>
##$TPNAME4= <>
##$TPNAME5= <>
##$TPNAME6= <>
##$TPNAME7= <>
##$TPOAL= (0..7)
0.5 0.5 0.5 0.5 0.5 0.5 0.5 0.5 
##$TPOFFS= (0..7)
0 0 0 0 0 0 0 0 
##$TUNHIN= 0
##$TUNHOUT= 0
##$TUNXOUT= 0
##$USERA1= <user>
##$USERA2= <user>
##$USERA3= <user>
##$USERA4= <user>
##$USERA5= <user>
##$V9= 5
##$VALIST= <valist>
##$VCLIST= <CCCCCCCCCCCCCCC>
##$VD= 0
##$VDLIST= <DDDDDDDDDDDDDDD>
##$VPLIST= <PPPPPPPPPPPPPPP>
##$VTLIST= <TTTTTTTTTTTTTTT>
##$WBST= 1024
##$WBSW= 4
##$XGAIN= (0..3)
0 0 0 0 
##$XL= 0
##$YL= 0
##$YMAX_a= 506499
##$YMIN_a= -728078
##$ZGOPTNS= <>
##$ZL1= 120
##$ZL2= 120
##$ZL3= 120
##$ZL4= 120
##$ABSF1= 16.522
##$ABSF2= -4.171173
##$ABSG= 5
##$ABSL= 3
##$ALPHA= 0
##$AQORDER= 0
##$ASSFAC= 0
##$ASSFACI= 0
##$ASSFACX= 0
##$ASSWID= 0
##$AUNMP= <proc_1d>
##$AZFE= 0.1
##$AZFW= 0.1
##$BCFW= 0
##$BC_mod= 0
##$BYTORDP= 0
##$COROFFS= 0
##$CY= 12.5
##$DATMOD= 1
##$DC= 0
##$DFILT= <>
##$DTYPP= 0
##$F1P= 14.0000005364418
##$F2P= -0.99999901652339
##$FCOR= 0.5
##$FTSIZE= 32768
##$FT_mod= 6
##$GAMMA= 0
##$GB= 0
##$INTBC= 1
##$INTSCL= 1
##$ISEN= 128
##$LB= 0.3
##$LEV0= 0
##$LPBIN= 0
##$MAXI= 10000
##$MC2= 0
##$MEAN= 0
##$ME_mod= 0
##$MI= 0
##$NCOEF= 0
##$NC_proc= -3
##$NLEV= 6
##$NOISF1= 0
##$NOISF2= 0
##$NSP= 0
##$NTH_PI= 0
##$NZP= 0
##$OFFSET= 16.522
##$PC= 1
##$PHC0= -84.55707
##$PHC1= 11.06407
##$PH_mod= 1
##$PKNL= yes
##$PPARMOD= 0
##$PSCAL= 4
##$PSIGN= 0
##$REVERSE= no
##$SF= 250.13
##$SI= 32768
##$SIGF1= 0
##$SIGF2= 0
##$SINO= 400
##$SIOLD= 32768
##$SREGLST= <1H.CDCl3>
##$SSB= 0
##$STSI= 32768
##$STSR= 0
##$SW_p= 5175.98343685301
##$SYMM= 0
##$S_DEV= 0
##$TDeff= 65536
##$TDoff= 0
##$TI= <Analysis number 999999
Compound Code 99
Book Reference 9
Project Code 9>
##$TILT= no
##$TM1= 0
##$TM2= 0
##$TOPLEV= 0
##$USERP1= <user>
##$USERP2= <user>
##$USERP3= <user>
##$USERP4= <user>
##$USERP5= <user>
##$WDW= 1
##$XDIM= 32768
##$YMAX_p= 420025869
##$YMIN_p= -223089
$$ End of Bruker specific parameters
$$ ---------------------------------
##NTUPLES= NMR SPECTRUM
##VAR_NAME=  FREQUENCY,     SPECTRUM/REAL,   SPECTRUM/IMAG
##SYMBOL=    X,             R,               I
##VAR_TYPE=  INDEPENDENT,   DEPENDENT,       DEPENDENT
##VAR_FORM=  AFFN,          ASDF,            ASDF
##VAR_DIM=   32768,         32768,           32768
##UNITS=     HZ,            ARBITRARY UNITS, ARBITRARY UNITS
##FACTOR=    0.157963299565203, 1,           1
##FIRST=     4132.6476996994, 0,             0
##LAST=      -1043.33573715361, 0,           0
##MIN=       -1043.33573715361, -223089,     0
##MAX=       4132.6476996994, 420025869,     0
$$ Real data points
##PAGE= N=1
##DATA TABLE= (X++(R..R)), XYDATA
$$ [...]
$$ plain form
16141 147890 157527 169193 193160 215292 235068 259054 266220 282265 301191 298705 294821 291858
16129 291858 283525 274192 267093 261988 276793 287695 284064 276907 270215 255881 249278 252961 266802
16116 266802 278523 280570 297350 317438 337455 353966 363079 378435 396914 396442 395117 402221 394099
16103 394099 383338 382800 375950 356315 340992 330668 316648 308258 314903 310798 312096 325091 343846
16090 343846 335397 327308 335591 333987 327307 330688 332899 339052 338037 347757 357189 355725 354434 369115
16076 369115 381062 379716 370942 370270 368451 358536 358738 355058 348155 345212 343556 353595 366969 367694
16062 367694 355041 362045 375556 388247 413933 444577 471377 514120 530418 539121 528619 520613
16050 520613 507287 501789 514425 521526 532959 549331 558428 581034 619707 652462 677747 696684
$$ packed form
16141A47890R637J1666K3967K2132J9776K3986P166J6045J8926k486l884k963
16129B91858q333r333p099n105J4805J0902l631p157o692j4334o603L683J3841
16116B66802J1721K047J6780K0088K0017J6511R113J5356J8479m72j325P104q122
16103C94099j0761n38o850j9635j5323j0324j4020q390O645m105J298J2995J8755
16090C43846q449q089Q283j604o680L381K211O153j015R720R432j464j291J4681
16076C69115J1947j346q774o72j819r915K02l680o903k943j656J0039J3374P25
16062C67694j2653P004J3511J2691K5686L0644K6800M2743J6298Q703j0502q006
16050E20613j3326n498J2636P101J1433J6372R097K2606L8673L2755K5285J8937
$$ plain form
16038 696684 719173 765918 813042 876251 972551 1086817 1210687 1360576 1531047 1693478
16028 1693478 1862447 2027599 2198988 2364652 2510152 2666152 2798324 2874648 2935335 2928754
16018 2928754 2882701 2833917 2763742 2696950 2683897 2708368 2749322 2834895 3002897 3191842 3388238
16007 3388238 3640095 3891261 4137284 4403481 4647272 4826810 4976507 5060418 5100073 5183868
15997 5183868 5266870 5361423 5482572 5616158 5792828 6023993 6331570 6697590 7114758 7613270
15987 7613270 8215836 8904099 9666377 10505340 11455457 12585699 14019821 15824661 18095664
15978 18095664 20935113 24358099 28136930 32022991 35728180 39044782 42656075 47282790
15970 47282790 53015155 58810127 63720932 65905114 65519027 64512561 64254055 65297157
$$ packed form
16038F96684K2489M6745M7124O3209R6300J14266J23870J49889J70471J62431
16028A693478J68969J65152J71389J65664J45500J56000J32172P6324O0687o581
16018B928754m6053m8784p0175o6792j3053K4471M0954Q5573J68002J88945J96396
16007C388238K51857K51166K46023K66197K43791J79538J49697Q3911L9655Q3795
15997E183868Q3002R4553J21149J33586J76670K31165L07577L66020M17168M98512
15987G613270O02566O88263P62278Q38963R50117J130242J434122J804840K271003
15978A8095664K839449L422986L778831L886061L705189L316602L611293M626715
15970D7282790N732365N794972M910805K184182l86087j006466k58506J043102
$$ plain form
15962 65297157 66920110 67684157 65718499 62234876 58676084 56133691 55033256 54837549
15954 54837549 54343858 53534162 53388635 54530293 56628643 58883689 59826770 58358685 56096474
15945 56096474 54296610 53717261 53868677 53665754 51061059 46132159 40373506 34802201
15937 34802201 30327061 26947851 23981523 20736570 17348273 14078715 11202189 8961721
15929 8961721 7331532 6165476 5328767 4702258 4205429 3807452 3515207 3305666 3139570
15920 3139570 2974736 2839698 2723118 2628099 2575326 2553989 2547839 2561808 2598128 2637916 2686144
15909 2686144 2736360 2790361 2870264 2975775 3090791 3203766 3267306 3234314 3161503 3095018 3051145
15898 3051145 3037204 3038503 2982068 2861889 2724068 2598200 2488965 2427501 2377594 2335778 2317257
$$ packed form
15962F5297157J622953P64047j965658l483623l558792k542393j100435j95707
15954E4837549m93691q09696j45527J141658K098350K255046R43081j468085k262211
15945E6096474j799864n79349J51416k02923k604695m928900n758653n571305
15937C4802201m475140l379210k966328l244953l388297l269558k876526k240468
15929H961721j630189j166056q36709o26509m96829l97977k92245k09541j66096
15920C139570j64834j35038j16580r5019n2773k1337o150J3969L6320L9788M8228
15909B686144N0216N4001P9903J05511J15016J12975O3540l2992p2811o6485m3873
15898C051145j3941J299n6435j20179j37821j25868j09235o1464m9907m1816j8521
$$ plain form
15887 2317257 2306401 2312833 2339310 2345356 2283217 2201489 2135179 2100999 2089975 2067795 1991168 1862730
15875 1862730 1708419 1542403 1388191 1255917 1167649 1071063 976941 877900 778561 703511
15865 703511 648335 612103 579683 550993 522287 506052 503975 496787 458556 431660 417604 407507
15853 407507 406718 396118 399006 385324 388954 397246 395877 395682 388585 378763 372592 368663 362803 357616
15839 357616 340940 314252 291645 276050 267882 253131 253170 257705 236779 224770 231534 237219 223218
15826 223218 208835 202267 217984 231052 230371 242502 248586 249126 267902 308058 339942 380309 420446
15813 420446 469367 515113 563982 617185 653919 656013 632381 575791 509514 462811 406610 336705
15801 336705 267411 231850 223314 230684 241000 259117 274052 296300 337727 380508 403149 426555
$$ packed form
15887B317257j0856O432K6477O046o2139q1728o6310l4180j1024k2180p6627j28438
15875A862730j54311j66016j54212j32274q8268r6586r4122r9041r9339p5050
15865G03511n5176l6232l2420k8690k8706j6235k077p188l8231k6896j4056j0097
15853D07507p89j0600K888j3682L630Q292j369j95p097r822o171l929n860n187
15839C57616j6676k6688k2607j5595q168j4751L9M535k0926j2009O764N685j4001
15826B23218j4383o568J5717J3068o81J2131O084N40J8776M0156L1884M0367M0137
15813D20446M8921M5746M8869N3203L6734K094k3632n6590o6277m6703n6201o9905
15801C36705o9294l5561q536P370J0316J8117J4935K2248M1427M2781K2641K3406
$$ plain form
15789 426555 428181 437459 428536 393415 352464 319412 286865 260312 226494 194835 165176 161009
15777 161009 166758 169334 182360 176932 177428 187289 188544 177232 158146 132486 112270 125378 127038
15764 127038 115180 100258 88856 82950 89870 101935 106667 105675 110247 113023 103786 98930 101226
15751 101226 109232 115011 119179 113615 102311 89989 77726 72077 78273 67836 48447 29125 27170
15738 27170 36504 34311 31715 30996 39373 46736 46431 59692 62422 48389 38093 36144 42288 46550
15724 46550 54383 56012 51876 43330 45652 31755 14382 22352 34564 42392 37749 25859 22368
15711 22368 22648 28383 22523 7415 -8599 -11464 -8312 -1491 -5366 -1803 8180 11576 20514 19743
15697 19743 8689 27715 51941 46890 38088 39785 44650 46739 56781 68866 80789 80305 70775
$$ packed form
15789D26555J626R278q923l5121m0951l3052l2547k6553l3818l1659k9659m167
15777A61009N749K576J3026n428M96R861J255j1312j9086k5660k0216J3108J660
15764A27038j1858j4922j1402n906O920J2065M732r92M572K776r237m856K296
15751A01226Q006N779M168n564j1304j2322j2263n649O196j0437j9389j9322j955
15738B7170R334k193k596p19Q377P363l05J3261K730j4033j0296j949O144M262
15724D6550P833J629m136q546K322j3897j7373P970J2212P828m643j1890l491
15711B2368K80N735n860j5108j6014k865L152O821l875L563R983L396Q938p71
15697A9743j1054J9026K4226n051q802J697M865K089J0042J2085J1923m84r530
$$ plain form
15684 70775 54282 60666 61860 27151 22177 12618 3675 1512 12638 18678 15969 15955 19174 27880
15670 27880 24399 21470 19181 9912 -56 7951 10496 1833 -12237 -16489 -27236 -15135 -4261
15657 -4261 4402 23562 25851 12910 13216 6423 5891 12091 9432 9412 6413 -4482 2989 8671 6523
15642 6523 13134 16408 10589 -599 12200 9347 13605 13356 4026 6332 10791 7155 3834 4956
15628 4956 6100 3085 1720 609 5852 5063 11559 12837 17764 22908 27663 14892 15633 18411 11487
15613 11487 -791 -3441 270 -1352 -2754 -9213 3498 17111 15553 7334 6927 -670 5752 3822
15599 3822 -4593 -17925 -26117 -27160 -21634 -15608 -14092 221 11907 9205 8189 780 3493 -1512
15585 -1512 -2120 9723 -7367 -13252 -6020 18783 32358 22450 20945 13066 -5774 3356 -5695 -10814
$$ packed form
15684G0775j6493O384J194l4709m974r559q943k163J1126O040k709j4L219Q706
15670B7880l481k929k289r269r968Q007K545q663j4070m252j0747J2101J0874
15657d261Q663J9160K289j2941L06o793n32O200k659k0k999j0895P471N682k148
15642F523O611L274n819j1188J2799k853M258k49r330K306M459l636l321J122
15628D956J144l015j365j111N243p89O496J278M927N144M755j2771P41K778o924
15613A1487j2278k650L711j622j402o459J2711J3613j558q219m07p597O422j930
15599C822q415j3332q192j043N526O026J516J4313J1686k702j016p409K713n005
15585a512o08J1843j7090n885P232K4803J3575r908j505p879j8840R130r051n119
$$ plain form
15571 -10814 -4484 -12160 -10297 -1343 2747 -5717 -10681 -11400 114 11084 5598 5532 5937 13684 9977
15556 9977 16014 14467 12303 8942 2998 -10107 -20856 -26342 -14879 -10762 -9763 -5881 -3049 -14171
15542 -14171 -13430 -9015 -8872 -4679 10256 25583 17708 9709 12819 26840 40548 35792 30296 14282
15528 14282 5319 -4330 -8489 -19696 -23388 -20310 -7997 -11028 -19953 -8095 -9624 -8493 -2193 -6026
15514 -6026 -16661 -13682 -7426 -8090 -11710 -3284 -3756 -5106 -3678 -1092 4554 9371 -1308 -5017 -5102
15499 -5102 -15328 -16017 -12509 -8374 -7716 -20805 -17209 -7220 -13364 -10175 48 -3193 3614 -2409
15485 -2409 -11640 -5125 8203 597 3369 6503 3204 2600 -457 -15378 -2938 15961 12594 2713
15471 2713 6805 8813 6509 3785 -4120 -5904 -4300 -7600 -6230 -5915 -13750 -6917 -7974 -10925 -4079
$$ packed form
15571a0814O330p676J863Q954M090q464m964p19J1514J0970n486o6M05P747l707
15556I977O037j547k164l361n944j3105j0749n486J1463M117R99L882K832j1122
15542a4171P41M415J43M193J4935J5327p875p999L110J4021J3708m756n496j6014
15528A4282q963r649m159j1207l692L078J2313l031q925J1858j529J131O300l833
15514f026j0635K979O256o64l620Q426m72j350J428K586N646M817j0679l709q5
15499e102j0226o89L508M135O58j3089L596R989o144L189J0223l241O807o023
15485b409r231O515J3328p606K772L134l299o04l057j4921J2440J8899l367r881
15471B713M092K008k304k724p905j784J604l300J370L15p835O833j057k951O846
$$ plain form
15456 -4079 4070 5274 7807 -592 -6176 -7860 5957 4276 14043 26036 27497 32040 32491 17061
15442 17061 15181 13438 15583 26448 31854 22388 9499 12157 28120 42699 48765 60148 62242
15429 62242 72617 92573 110917 125771 154560 186013 204125 209080 226391 248547 274217 302067
15417 302067 313231 316927 315470 318262 326467 337233 346732 348056 328641 323447 300105 282567 275263
15404 275263 282382 282854 271208 278856 291215 299876 306727 309341 298776 290118 287312 280579 271172 260997
15390 260997 251370 229354 212437 193140 155716 131318 122899 108027 90393 70570 60922 47873
15378 47873 30828 19692 21482 20775 8102 -10159 -24980 -28351 -2366 16039 24136 25190 9907
15365 9907 5157 614 5625 1078 1549 8300 19882 17908 -2766 -15504 -7234 -215 -3442 -344
$$ packed form
15456d079Q149J204K533q399n584j684J3817j681R767J1993J461M543M51j5430
15442A7061j880j743K145J0865N406r466j2889K658J5963J4579O066J1383K094
15429F2242J0375J9956J8344J4854K8789L1453J8112M955J7311K2156K5670K7850
15417C02067J1164L696j457K792Q205J0766R499J324j9415n194k3342j7538p304
15404B75263P119M72j1646P648J2359Q661O851K614j0565q658k806o733r407j0175
15390B60997r627k2016j6917j9297l7424k4398q419j4872j7634j9823r648j3049
15378D7873j7045j1136J790p07j2673j8261j4821l371K5985J8405Q097J054j5283
15365I907m750m543N011m547M71O751J1582j974k0674j2738Q270P019l227L098
$$ plain form
15351 -344 8828 11462 11044 -1467 -13651 -1868 7435 -4743 -18989 -22938 -15207 -5289 -13414 -11771
15337 -11771 -18578 -10058 -10686 -19784 -12559 -5325 2395 11255 19364 14089 -2963 -6367 -7393 -11243
15323 -11243 -13172 -6294 -6973 -15589 -21664 -27699 -18284 -6609 -1418 -1282 -2202 -4525 -19366 -20215 -17212
15308 -17212 -9068 -3337 -5165 -12338 -23010 -15781 -18460 -28668 -22546 -23264 -23898 -20047 -2539 -18013
15294 -18013 -28388 -23866 -15172 -7677 -13505 -8053 -6458 -33794 -37203 -24226 -15661 -14735 -17852 -15101
15280 -15101 -7124 -10100 -16776 -22854 -22417 -18368 -23919 -16669 -21565 -36111 -25139 -18906 -16951 -17034 -18799
15265 -18799 -15666 -14684 -13519 -21102 -26075 -18538 -15283 -16879 -22134 -10877 -20173 -15392 -12255 -13070 -4673
15250 -4673 -391 -117 -952 -6513 -7822 -12865 -13142 -16248 -22712 -13116 -22307 -12491 -5041 -15269 -13973
$$ packed form
15351c44R172K634m18j2511j2184J1783R303j2178j4246l949P731R918q125J643
15337a1771o807Q520o28r098P225P234P720Q860Q109n275j7052l404j026l850
15323a1243j929O878o79q616o075o035R415J1675N191J36r20k323j4841q49L003
15308a7212Q144N731j828p173j0672P229k679j0208O122p18o34L851J7508j5474
15294a8013j0375M522Q694P495n828N452J595k7336l409J2977Q565R26l117K751
15280a5101P977k976o676o078M37M049n551P250m896j4546J0972O233J955q3j765
15265a8799L133R82J165p583m973P537L255j596n255J1257r296M781L137q15Q397
15250d673M282K74q35n561j309n043k77l106o464R596r191R816P450j0228J296
$$ plain form
15235 -13973 8838 616 -8690 -23947 -33157 -31371 -23522 -15173 -22761 -32283 -22695 -20103 -28658 -16447
15221 -16447 -4066 -3206 -15168 -16702 -12884 1417 -1766 -7515 -24618 -34599 -36110 -26802 -5729
15208 -5729 -3866 -15813 -23847 -31272 -28704 -28184 -26341 -20653 -34245 -39451 -29746 -16172 -4023 -9095
15194 -9095 -12242 -17110 -23807 -11772 -11087 -18208 -22652 -25986 -30025 -35495 -20092 -1917 145 122 322
15179 322 1336 -383 4113 6368 -5576 -8605 -12866 -15001 -17536 -17730 -16190 -16416 -4298 -11201 -16915
15164 -16915 -3708 -188 -4096 -7596 -8832 -7288 2203 -2682 -11725 -6655 -7005 2119 -494 -9582
15150 -9582 -7372 -5501 -22110 -15332 -1561 4624 -2036 -14996 -10292 -4850 -5408 -22 7956 797
15136 797 -11719 -8845 -18132 -26605 -26014 -20951 -20426 -26755 -30727 -22618 -18043 -15979 -21602 -28034 -31134
$$ packed form
15235a3973K2811q222r306j5257r210J786P849Q349p588r522R588K592q555J2211
15221a6447J2381Q60j1962j534L818J4301l183n749j7103r981j511R308K1073
15208e729J863j1947q034p425K568N20J843N688j3592n206R705J3574J2149n072
15194i095l147m868o697J2035O85p121m444l334m039n470J5403J8175K062k3K00
15179C22J014j719M496K255j1944l029m261k135k535j94J540k26J2118o903n714
15164a6915J3207L520l908l500j236J544R491m885r043N070l50R124k613r088
15150i582K210J871j6609O778J3771O185o660j2960M704N442n58N386P978p159
15136G97j2516K874r287q473N91N063N25o329l972Q109M575K064n623o432l100
$$ plain form
15121 -31134 -20520 -16135 -15900 -21619 -14056 3137 -5608 -16775 -10580 -9056 -23055 -19891 -16223 -1593
15107 -1593 9729 16876 11501 2312 -15417 -18579 -20752 -26513 -25260 -13954 -8255 -14100 -258 6709
15093 6709 19894 20523 19440 13340 -2610 -19084 -21415 -16336 -22128 -24147 -15032 -23956 -12577 -2902
15079 -2902 3938 2300 -15350 -33938 -37286 -26452 -17826 -12134 -9502 -10356 -17560 -31013 -22359 -15871
15065 -15871 -27367 -24202 -17649 -25624 -34386 -44173 -40635 -38335 -39018 -47623 -52328 -51430 -27910 -3634
15051 -3634 -1846 -6105 -15460 -19730 -2102 9810 11645 9407 504 -746 -611 -207 594 -10035 -17635
15036 -17635 -14560 -9885 -5142 -3019 -8926 -23398 -27318 -18286 -15909 -15926 -17633 -20546 -16979 -21276 -16292
15021 -16292 -13738 -22122 -33147 -31627 -32925 -21751 -7374 -18079 -27117 -19356 -11009 339 5992
$$ packed form
15121c1134J0614M385K35n719P563J7193q745j1167O195J524j3999L164L668J4630
15107a593J1322P147n375r189j7729l162k173n761J253J1306N699n845J3842O967
15093F709J3185O29j083o100j5950j6474k331N079n792k019R115q924J1379R675
15079b902O840j638j7650j8588l348J0834Q626N692K632q54p204j3453Q654O488
15065a5871j1496L165O553p975q762r787L538K300o83q605m705Q98K3520K4276
15051c634J788m259r355m270J7628J1912J835k238q903j250J35M04Q01j0629p600
15036a7635L075M675M743K123n907j4472l920R032K377j7j707k913L567m297M984
15021a6292K554q384j1025J520j298J1174J4377j0705r038P761Q347J1348N653
$$ plain form
15008 5992 -2500 -7566 -4818 -3419 -50 -9686 -26961 -24407 -21548 -6723 10352 10355 13460 7542 10028
14993 10028 14040 5062 -2058 -2626 -18457 -19590 -22262 -18482 -12721 -10417 -13067 -16545 -13027 -17014
14979 -17014 -18314 -24939 -26551 -19398 -11188 -4311 -8356 -9287 -5846 -2653 -3635 -276 -8999 -7500 -9862
14964 -9862 -25146 -20316 -5859 -6258 -11129 -4469 -2919 7572 21859 6445 5939 6484 -5059 -6775
14950 -6775 -8204 -9347 -13008 -10802 -6671 2911 230 -1607 5066 4194 5997 14162 8209 192 -9778
14935 -9778 -7731 -8811 -1003 2908 4474 1163 -4667 -8015 -8119 -11775 -10242 -7365 -12639 -10133 -10267
14920 -10267 -19471 -17428 -10760 3047 3705 382 -9406 -16076 -11097 -4310 17846 28342 20671 -5368
14906 -5368 -24876 -23988 -24283 -25544 -16743 1134 9691 7627 2375 -4269 -4299 -18172 -27734 -25886 -25801
$$ packed form
15008E992q492n066K748J399L369r636j7275K554K859J4825J7075LL105n918K486
14993A0028M012q978p120n68j5831j133k672L780N761K304k650l478L518l987
14979a7014j300o625j612P153Q210O877m045r31L441L193r82L359q723J499k362
14964i862j5284M830J4457l99m871O660J550J0491J4287j5414n06N45j1543j716
14950f775j429j143l661K206M131R582k681j837O673q72J803Q165n953q017r970
14935i778K047j080P808L911J566l311n830l348j04l656J533K877n274K506j34
14920a0267r204K043O668J3807O58l323r788o670M979O787K2156J0496p671k6039
14906e368j9508Q88k95j261Q801J7877Q557k064n252o644l0j3873r562J848Q5
$$ plain form
14891 -25801 -27444 -20078 -8931 1332 6072 -268 -6151 -7911 -5585 -10086 -10442 -8384 -12214 -12615
14877 -12615 -16122 -23070 -19290 -15426 4459 21188 17490 6463 -2508 -14022 -7959 -3812 -5711
14864 -5711 5190 5322 -1012 10006 7113 -2754 -5880 -1775 -2169 -7987 -5396 -4695 -6903 5087 1226
14849 1226 -15969 -19455 -17887 -12608 2575 10005 6787 -3848 -4734 -12142 -21940 -28083 -20814 -24056
14835 -24056 -19600 -14846 950 9762 3697 7284 2406 3302 -804 -8770 -11767 -16312 -13890 3733
14821 3733 7499 10195 4923 3829 -9227 -17626 -14219 -9152 -2775 -3421 -14 1610 11846 11067 5553
14806 5553 -1176 -8360 -14285 -9206 -8779 8771 7314 5568 842 -5661 -1503 -8006 -15103 -14961 -8372
14791 -8372 -6611 -6352 1709 -5879 -17521 -8909 -5801 -12003 -14096 -7397 -1236 4635 -2376 -13188
$$ packed form
14891b5801j643P366J1147J0263M740o340n883j760K326m501l56K058l830m01
14877a2615l507o948L780L864J9885J6729l698j1027q971j1514O063M147j899
14864e711J0901J32o334J1018k893r867l126M105l94n818K591P01k208J1990l861
14849A226j7195l486J568N279J5183P430l218j0635q86p408r798o143P269l242
14835b4056M456M754J5796Q812o065L587m878Q96m106p966k997m545K422J7623
14821C733L766K696n272j094j3056q399L407N067O377o46L407J624J0236p79n514
14806E553o729p184n925N079M27J7550j457j746m726o503M158o503p097J42O589
14791h372J761K59Q061p588j1642Q612L108o202k093O699O161N871p011j0812
$$ plain form
14777 -13188 -3855 -4217 -7536 7026 6551 -16249 -22285 -10735 6033 13229 15580 11402 -4860 -15277
14763 -15277 -18978 -8607 -1518 2533 8382 1465 10858 21372 28122 12656 21251 27740 21562 11266
14749 11266 17144 19071 17336 27324 30049 28108 21650 18159 17187 14893 15114 10911 9554 8900 -492
14734 -492 -2942 3357 13646 13517 8876 7785 9587 3630 -1829 8174 8287 6717 10193 7249 6100
14719 6100 447 5751 -4259 -8354 -9089 -12275 -13856 -6053 5906 21722 28145 29225 18373 12483
14705 12483 13552 16796 8238 4085 5165 -3472 -6325 6049 8223 9703 19594 13582 7126 17124
14691 17124 20821 21919 19567 1051 -3176 8665 8543 15569 2417 -1478 -11 16506 12259 9552
14677 9552 11376 7905 8059 2651 6352 21912 29512 27529 28403 32873 29798 35294 39738 34946 24600
$$ packed form
14777a3188R333l62l319J4562m75k2800o036J1550J6768P196K351m178j6262j0417
14763a5277l701J0371P089M051N849o917R393J0514O750j5466Q595O489o178j0296
14749A1266N878J927j735R988K725j941o458l491r72k294K21m203j357o54r392
14734d92k450O299J0289j29m641j091J802n957n459J0003J13j570L476k944j149
14719F100n653N304j0010m095p35l186j581P803J1959J5816O423J080j0852n890
14705A2483J069L244q558m153J080q637k853J2374K174J480R891o012o456R998
14691A7124L697J098k352j8516m227J1841j22P026j3152l895J467J6517m247k707
14677I552J824l471J54n408L701J5560P600j983Q74M470l075N496M444m792j0346
$$ plain form
14662 24600 37292 37054 34628 20641 11668 20958 16844 18637 21960 22737 26742 25462 18118 -1786
14648 -1786 -11138 -3817 14427 10832 13075 21975 21163 13275 13544 3291 -6442 -12400 -14684 -14314 -5851
14633 -5851 4213 24992 27393 21166 6053 3500 -388 -7267 -10075 -9887 -1664 -1554 4674 -1407
14619 -1407 3310 15719 19661 9367 8196 13402 10976 3218 3262 6648 10157 29077 31975 30761
14605 30761 26614 30396 24208 18104 3055 5391 11836 6388 7154 14520 7318 3739 15941 22444
14591 22444 11823 2555 6280 13773 12860 23972 23031 16700 16573 17657 12495 3662 6168 16487
14577 16487 17291 20829 27119 28847 28970 36572 34302 28226 26063 28159 38428 38431 33869 32996 23419 23734
14561 23734 23824 25342 22730 11524 7315 11839 10593 7914 14234 26116 28938 25040 22024 7184
$$ packed form
14662B4600J2692k38k426j3987q973R290m114J793L323P77M005j280p344j9904
14648a786r352P321J8244l595K243Q900q12p888K69j0253r733n958k284L70Q463
14633e851J0064K0779K401o227j5113k553l888o879k808J88Q223J10O228o081
14619a407M717J2409L942j0294j171N206k426p758M4L386L509J8920K898j214
14605C0761m147L782o188o104j5049K336O445n448P66P366p202l579J2202O503
14591B2444j0621r268L725P493r13J1112r41o331j27J084n162q833K506J0319
14577A6487Q04L538O290J728J23P602k270o076k163K096J0269Lm562q73r577L15
14561B3734R0J518k612j1206m209M524j246k679O320J1882K822l898l016j4840
$$ plain form
14547 7184 10412 19685 10553 10657 17156 25456 18165 1615 -507 2086 2380 2143 5591 12013 11675
14532 11675 15860 16988 20573 19128 6369 -4630 3505 -2211 15393 32613 33743 21022 19082
14519 19082 22817 26617 36322 35076 35420 30072 44181 50538 57345 47872 66450 78313 88371 104832
14505 104832 116052 129866 160679 175046 185560 194683 210472 234812 237542 229776 206884 176994
14493 176994 146516 118159 95624 84371 65968 54978 41597 45776 53980 49673 33543 31744
14481 31744 34761 38304 36062 37176 40980 38694 24712 32360 25281 18278 23060 22168 13281 19597
14467 19597 19580 21046 6561 1987 -3268 6999 20561 14751 10815 26677 43918 38512 44073 37494
14453 37494 31485 35461 32044 38139 49158 35011 19778 20289 28158 26450 15703 25935 29719
$$ packed form
14547G184L228R273r132J04O499Q300p291j6550k122K593K94k37L448O422l38
14532A1675M185J128L585j445j2759j0999Q135n716J7604J7220J130j2721j940
14519A9082L735L800R705j246L44n348J4109O357O807r473J8578J1863J0058J6461
14505A04832J1220J3814L0813J4367J0514R123J5789K4340K730p766k2892k9890
14493A76994l0478k8357k2535j1253j8403j0990j3381M179Q204m307j6130j799
14481C1744L017L543k242J114L804k286j3982P648p079p003M782q92q887O316
14467A9597j7J466j4485m574n255J0267J3562n810l936J5862J7241n406N561o579
14453C7494o009L976l417O095J1019j4147j5233N11P869j708j0747J0232L784
$$ plain form
14440 29719 22329 20554 25050 42149 33436 26473 23195 34342 35414 27089 24570 17325 18400 22729
14426 22729 19444 27754 31406 18500 23404 38544 46868 50929 46436 38141 34111 24487 30269 34589
14412 34589 35674 30211 38782 39953 30254 10066 9703 19240 35099 43294 39524 29990 20466 35775
14398 35775 31411 17903 11100 17992 34690 42798 50662 47237 47857 51228 40539 39181 35168 31816
14384 31816 24291 24520 24939 23654 30093 33005 28569 25280 22005 27632 31847 45779 51688 39785
14370 39785 23545 22238 23327 24087 26209 26045 21633 23956 19277 21118 33482 32319 38776 40902
14356 40902 49324 50991 38493 25471 21277 26808 30976 33188 27866 26178 30415 20870 29718 37064
14342 37064 32099 40705 41498 41835 30355 27153 30358 26695 19057 18703 35033 36739 40226 35669 40414
$$ packed form
14440B9719p390j775M496J7099q713o963l278J1147J072q325k519p245J075M329
14426B2729l285Q310L652j2906M904J5140Q324M061m493q295m030r624N782M320
14412C4589J085n463Q571J171r699k0188l63R537J5859Q195l770r534r524J5309
14398C5775m364j3508o803O892J6698Q108P864l425O20L371j0689j358m013l352
14384C1816p525K29M19j285O439K912m436l289l275N627M215J3932N909j1903
14370C9785j6240j307J089P60K122j64m412K323m679J841J2364j163O457K126
14356D0902Q422J667j2498j3022m194N531M168K212n322j688M237r545Q848P346
14342C7064m965Q606P93L37j1480l202L205l663p638l54J6330J706L487m557M745
$$ plain form
14327 40414 38008 36712 29676 22249 19839 21949 26605 44470 56025 66230 67535 67644 72305 70252
14313 70252 53560 48878 49942 41238 36715 39915 42804 57983 60290 59721 65433 70162 66580 55845
14299 55845 55332 67388 71848 78668 77411 69626 65118 73574 81894 99043 99716 100240 108712 110414 110554
14284 110554 103808 110793 120670 129543 146250 157944 173486 184673 195158 202910 221424 235153
14272 235153 241158 255153 276969 300140 307882 326044 351387 376100 398170 413207 450311 495710
14260 495710 523605 555638 590015 639542 685270 731880 787614 876417 967318 1088970 1210660
14249 1210660 1352969 1523416 1724426 1965472 2257715 2642089 3109526 3613573 4131559
14240 4131559 4607787 4899288 4900531 4619782 4175272 3683149 3225326 2864294 2598498 2435943
$$ packed form
14327D0414k406j296p036p427k410K110M656J7865J1555J0205J305J09M661k053
14313G0252j6692m682J064q704m523L200K889J5179K307n69N712M729l582j0735
14299E5845n13J2056M460O820j257p785m508Q456Q320J7149O73N24Q472J702J40
14284A10554o746O985R877Q873J6707J1694J5542J1187J0485P752J8514J3729
14272B35153O005J3995K1816K3171P742J8162K5343K4713K2070J5037L7104M5399
14260D95710K7895L2033L4377M9527M5728M6610N5734Q8803R0901J21652J21690
14249A210660J42309J70447K01010K41046K92243L84374M67437N04047N17986
14240D131559M76228K91501J243k80749m44510m92123m57823l61032k65796j62555
$$ plain form
14230 2435943 2363680 2353722 2380158 2389895 2358722 2273169 2138705 1935817 1698143 1451962 1219385
14219 1219385 1007460 822519 677814 564973 478111 416736 366738 320109 276933 241749
14209 241749 218136 200361 190732 184431 164414 146411 145154 149031 146556 136909 127471 113606 95435
14196 95435 93609 93225 78116 74580 68364 60215 63982 71595 63013 48501 63752 77452 78681 82595
14182 82595 79790 93512 100452 102905 90364 85866 78899 73783 89972 109617 102310 94731 99579
14169 99579 101548 110319 105449 95291 77152 76912 78071 78628 68802 63980 68092 69109 73126 74500
14155 74500 73320 75127 76278 72508 73018 68564 61522 63318 80471 82420 81500 86701 80569 63812
14141 63812 68504 69198 71512 73375 54532 40667 53896 77222 81031 86318 85868 84635 77317 76653
$$ packed form
14230B435943p2263r958K6436R737l1173q5553j34464k02888k37674k46181k32577
14219A219385k11925j84941j44705j12841q6862o1375m9998m6629m3176l5184
14209B41749k3613j7775r629o301k0017j8003j257L877k475r647r438j3865j8171
14196I5435j826l84j5109l536o216q149L767P613q582j4512J5251J3700J229L914
14182H2595k805J3722O940K453j2541m498o967n116J6189J9645p307p579M848
14169I9579J969Q771m870j0158j8139k40J159N57r826m822M112J017M017J374
14155G4500j180J807J151l770N10m454p042J796J7153J949r20N201o132j6757
14141F3812M692O94K314J863j8843j3865J3229K3326L809N287m50j233p318o64
$$ plain form
14127 76653 81326 71402 50398 50071 61578 59323 64823 61715 63382 61469 56262 43798 49503 55889
14113 55889 52122 44577 38138 33506 43187 51324 51116 52866 71000 84268 106872 127884 121723 105206
14099 105206 100380 105246 115979 111790 96425 64589 82928 95168 73577 67982 82205 95417
14087 95417 106222 99287 97647 87757 83472 77949 76837 88418 103545 106052 95933 89675 93345
14074 93345 95855 88792 86892 74962 69698 61743 57178 76720 93710 90389 98531 106002 107721 102923
14060 102923 93743 100014 107150 111246 124923 131085 125736 135147 155389 166130 168539 167420 176328
14047 176328 174800 184041 185443 172042 170324 175419 172375 176106 166642 150951 151267 161046 168764 155112
14033 155112 150894 152695 152267 137530 123049 133095 148725 155219 160248 170192 189315 200891 183989
$$ packed form
14127G6653M673r924k1004l27J1507k255N500l108J667j913n207j2464N705O386
14113E5889l767p545o439m632R681Q137k08J750J8134J3268K2604K1012o161j6517
14099A05206m826M866J0733m189j5365l1836J8339J2240k1591n595J4223J3212
14087I5417J0805o935j640r890m285n523j112J1581J5127K507j0119o258L670
14074I3345K510p063j900j1930n264p955m565J9542J6990l321Q142P471J719m798
14060A02923r180O271P136M096J3677O162n349R411K0242J0741K409j119Q908
14047A76328j528R241J402j3401j718N095l044L731r464j5691L16R779P718j3652
14033A55112m218J801m28j4737j4481J0046J5630O494N029R944J9123J1576j6902
$$ plain form
14020 183989 181793 193771 197196 200760 200277 195369 193605 197551 197736 197753 196618 199721 205610 204624 189032
14005 189032 180166 175091 192267 197482 198364 186231 183383 204987 231127 230392 216033 210491 211904
13992 211904 200280 200705 192561 180233 179375 183030 170563 162165 167934 172970 161165 150447 152518
13979 152518 143389 117004 94727 66717 57209 42674 7285 -31072 -68907 -95804 -121483 -155002
13967 -155002 -183395 -203743 -196889 -174068 -162049 -139734 -99979 -66682 -34696 -2476 2614 12203
13955 12203 21864 38303 52592 61958 83896 109085 113879 130471 139788 152070 185748 216878
13943 216878 239645 253306 272526 294219 303457 311426 321047 320449 337518 363732 366589 388260 403141
13930 403141 414932 402007 389036 372971 358616 352049 352430 346434 345533 365233 386205 408161 432468
$$ packed form
14020A83989k196J1978L425L564m83m908j764L946J85J7j135L103N889r86j5592
14005A89032q866n075J7176N215Q82j2133k848K1604K6140p35j4359n542J413
13992B11904j1624M25q144j2328q58L655j2467q398N769N036j1805j0718K071
13979A52518r129k6385k2277k8010r508j4535l5389l8357l7835k6897k5679l3519
13967a55002k8393k0348O854K2821J2019K2315L9755L3297L1986L2220N090R589
13955A2203R661J6439J4289R366K1938K5189M794J6592R317J2282L3678L1130
13943B16878K2767J3661J9220K1693R238P969R621n98J7069K6214K857K1671J4881
13930D03141J1791j2925j2971j6065j4355o567L81n996r01J9700K0972K1956K4307
$$ plain form
13917 432468 450575 474457 493800 521246 552425 580406 600903 622898 652145 675163 665210 671165
13905 671165 676931 676016 652228 629994 594426 566631 538646 521823 518023 511327 526481 567727
13893 567727 577698 580351 579617 577323 573930 570244 556253 532023 504379 483137 460642 433658 422075
13880 422075 408503 382903 373005 371736 386318 403933 442207 492644 544487 589835 605032 593431
13868 593431 562831 537767 525722 533417 548313 567368 573420 597097 636059 668628 695234 702834
13856 702834 721611 740562 772018 812137 832956 857216 893540 908129 941317 989518 1047558
13845 1047558 1095791 1131392 1188522 1260306 1329668 1403231 1498482 1612733 1729361 1848390 1965453
13834 1965453 2075412 2202904 2337544 2492798 2675100 2882484 3133854 3473149 3900266
$$ packed form
13917D32468J8107K3882J9343K7446L1179K7981K0497K1995K9247K3018r953N955
13905F71165N766r15k3788k2234l5568k7795k7985j6823l800o696J5154M1246
13893E67727R971K653p34k294l393l686j3991k4230k7644k1242k2495k6984j1583
13880D22075j3572k5600r898j269J4582J7615L8274N0437N1843M5348J5197j1601
13868E93431l0600k5064j2045P695J4896J9055O052K3677L8962L2569K6606P600
13856G02834J8777J8951L1456M0119K0819K4260L6324J4589L3188M8201N8040
13845A047558M8233L5601N7130P1784O9362P3563R5251J14251J16628J19029J17063
13834A965453J09959J27492J34640J55254J82302K07384K51370L39295M27117
$$ plain form
13825 3900266 4437529 5121363 5908437 6735127 7506649 8143306 8547644 8686843 8568630
13816 8568630 8228031 7772280 7309987 6932030 6702166 6659668 6802939 7105107 7522295 8050295
13806 8050295 8691639 9425501 10253266 11178016 12194883 13303948 14497073 15783450 17171246
13797 17171246 18681016 20330214 22156127 24207863 26522666 29189467 32291761 35892047
13789 35892047 40069636 44939000 50619782 57286553 65235500 74975176 87258613 103144055
13781 103144055 123874842 150409569 182677830 219277991 256427851 289839866 314908617
13774 314908617 327618715 326244607 310796760 282782829 245915625 205001734 164391090
13767 164391090 128211214 98509009 75578816 58633487 46264402 37171756 30359113
$$ packed form
13825C900266N37263O83834P87074Q26690P71522O36657M04338J39199j18213
13816H568630l40599m55751m62293l77957k29864m2498J43271L02168M17188N28000
13806H050295O41344P33862Q27765R24750J016867J109065J193125J286377J387796
13797A7171246J509770J649198J825913K051736K314803K666801L102294L600286
13789C5892047M177589M869364N680782O666771P948947R739676J2283437J5885442
13781A03144055K0730787K6534727L2268261L6600161L7149860L3412015K5068751
13774C14908617J2710098j374108j5447847k8013931l6867204m0913891m0610644
13767A64391090l6179876k9702205k2930193j6945329j2369085r092646o812643
$$ plain form
13760 30359113 25147721 21058739 17777699 15138932 13022448 11308518 9918863 8797422
13752 8797422 7888356 7138485 6520448 5993665 5537785 5142274 4796362 4487132 4202066
13743 4202066 3936106 3677570 3446490 3244118 3056387 2866514 2708213 2571610 2442764
13734 2442764 2323232 2221375 2133741 2051844 1968685 1897164 1849547 1812972 1767415 1719145 1684984
13723 1684984 1646755 1607164 1569432 1538597 1512879 1475967 1426994 1373384 1325121 1274871 1221552
13712 1221552 1185702 1166127 1142251 1121545 1104324 1096031 1063144 1035160 1012001 981726 942079
13701 942079 900003 874515 852017 837563 821636 793557 775888 763939 739616 733791 731129 741960
13689 741960 750216 740800 735651 733661 740603 753901 767423 772130 766246 763264 757696 760442 758341 759736
$$ packed form
13760C0359113n211392m088982l281040k638767k116484j713930j389655j121441
13752H797422r09066p49871o18037n26783m55880l95511l45912l09230k85066
13743D202066k65960k58536k31080k02372j87731j89873j58301j36603j28846
13734B442764j19532j01857q7634q1897q3159p1521m7617l6575m5557m8270l4161
13723A684984l8229l9591l7732l0835k5718l6912m8973n3610m8263n0250n3319
13712A221552l5850j9575k3876k0706j7221q293l2887k7984k3159l0275l9647
13701I42079m2076k5488k2498j4454j5927k8079j7669j1949k4323n825k662J0831
13689G41960Q256r416n149j990O942J3298J3522M707n884k982n568K746k101J395
$$ plain form
13675 759736 765547 779507 789232 798817 805617 812734 812178 814386 809482 801182 803337 794767 795213 779703
13661 779703 759196 723959 686144 646400 598982 572144 561370 562220 576041 601248 609399 630869
13649 630869 633476 632725 613700 596919 564953 511383 463099 424634 399435 373215 346620 336117
13637 336117 328134 339826 361853 360371 368490 391155 403494 415458 415214 414596 433617 425981 419205
13624 419205 413447 391338 353063 321668 307793 288139 271243 252642 240240 250322 257912 278187
13612 278187 288960 305540 305276 318671 344259 384341 411297 421708 442799 473921 497606 534884
13600 534884 575689 611413 657311 704505 757564 810561 887390 981828 1121030 1300938 1499447
13589 1499447 1717066 1917314 2072268 2131845 2123683 2033798 1872651 1669682 1458859 1270028
$$ packed form
13675G59736N811J3960R725R585O800P117n56K208m904q300K155q570M46j5510
13661G79703k0507l5237l7815l9744m7418k6838j0774Q50J3821K5207Q151K1470
13649F30869K607p51j9025j6781l1966n3570m8284l8465k5199k6220k6595j0503
13637C36117p983J1692K2027j482Q119K2665J2339J1964k44o18J9021p636o776
13624D19205n758k2109l8275l1395j3875j9654j6896j8601j2402J0082P590K0275
13612B78187J0773J6580k64J3395K5588M0082K6956J0411K1091L1122K3685L7278
13600E34884M0805L5724M5898M7194N3059N2997P6829R4438J39202J79908J98509
13589A499447K17619K00248J54954N9577q162q9885j61147k02969k10823j88831
$$ plain form
13579 1270028 1092833 953582 832170 725342 634954 573212 535088 497823 463286 455250 448230
13568 448230 426951 416806 414011 410305 392918 375074 373097 378828 388211 393371 398585 407220 415550
13555 415550 414488 400682 400689 399695 390618 390674 395271 387585 374588 365512 350817 327386 323393 313614 316484
13540 316484 311975 301062 300548 287176 258103 230997 227148 216638 202539 203047 201794 194935 197235
13527 197235 200897 215264 243858 263181 261194 255618 255444 267246 277305 284212 310694 326802 341879
13514 341879 354516 364229 372451 366385 361957 360788 351343 336466 327188 335017 351243 347133 339046
13501 339046 311179 289489 287016 285134 283931 264775 255210 268040 277202 294329 297300 283486 287888
13488 287888 283311 261018 268025 263443 258178 267318 273539 274794 272964 268180 276733 275875 267618 270743
$$ packed form
13579A270028j77195j39251j21412j06828r0388o1742l8124l7265l4537q036p020
13568D48230k1279j0145k795l706j7387j7844j977N731R383N160N214Q635Q330
13555D15550j062j3806Pr94r077N6M597p686j2997r076j4695k3431l993r779K870
13540C16484m509j0913n14j3372k9073k7106l849j0510j4099N08j253o859K300
13527A97235L662J4367K8594J9323j987n576j74J1802J0059O907K6482J6108J5077
13514C41879J2637R713Q222o066m428j169r445j4877r278P829J6226m110q087
13501C39046k7867k1690k473j882j203j9156r565J2830R162J7127K971j3814M402
13488B87888m577k2293P007m582n265R140O221J255j830m784Q553q58q257L125
$$ plain form
13474 270743 279660 281076 287222 282762 282896 298718 307289 321633 317456 317960 317513 311814 303573 289805
13460 289805 287335 299980 291031 275328 273113 270959 269892 271406 292488 309950 323481 343334 366427
13447 366427 390307 408343 424213 442573 455537 460789 459556 459484 437970 412077 390416 386453 378128
13434 378128 363541 355595 348281 342787 328814 330282 340392 337318 325777 321555 299915 284384 262012
13421 262012 232482 206163 186156 169274 162371 167053 165295 171153 181620 182190 171533 181441 188282
13408 188282 188395 190167 167695 173664 185355 176680 174881 183863 193644 192956 192580 201597 220872 234579
13394 234579 231174 227348 230570 240689 235038 221000 226668 222943 221138 224331 230056 227301 222872 215229
13380 215229 215898 219699 214639 198757 198780 185709 172453 157449 146958 155511 146416 146570 159577 169954
$$ packed form
13474B70743Q917J416O146m460J34J5822Q571J4344m177N04m47n699q241j3768
13460B89805k470J2645q949j5703k215k154j067J514K1082J7462J3531J9853K3093
13447C66427K3880J8036J5870J8360J2964N252j233p2k1514k5893k1661l963q325
13434C78128j4587p946p314n494j3973J468J0110l074j1541m222k1640j5531k2372
13421B62012k9530k6319k0007j6882o903M682j758N858J0467N70j0657R908O841
13408A88282J13J772k2472N969J1691q675j799Q982R781o88l76R017J9275J3707
13394B34579l405l826L222J0119n651j4038N668l725j805L193N725k755m429p643
13380B15229O69L801n060j5882K3j3071j3256j5004j0491Q553r095J54J3007J0377
$$ plain form
13366 169954 174880 182239 199768 215326 235900 238402 220229 217047 221538 224240 220858 214310 206107
13353 206107 208212 213131 206835 211858 214265 199946 209180 207045 223946 234881 244898 244259 261872
13340 261872 282991 294230 315124 335638 353329 369284 387398 395774 403606 410071 421190 448264
13328 448264 481588 517342 556775 588185 649934 724752 816022 952028 1116080 1277471 1449969
13317 1449969 1615884 1731935 1797914 1788236 1714498 1570523 1385604 1177802 962456 758617
13307 758617 603443 490239 407024 336438 288415 263376 241689 222414 212024 195455 172904
13296 172904 173924 168809 172703 180706 204669 221639 204365 194200 178550 160801 153620 156477 148031
13283 148031 140592 136879 130938 133213 132400 107737 96250 115985 116288 128771 131007 122807 118584 115329
$$ packed form
13366A69954M926P359J7529J5558K0574K502j8173l182M491K702l382o548q203
13353B06107K105M919o296N023K407j4319R234k135J6901J0935J0017o39J7613
13340B61872K1119J1239K0894K0514J7691J5955J8114Q376P832O465J1119K7074
13328D48264L3324L5754L9433L1410O1749P4818R1270J36006J64052J61391J72498
13317A449969J65915J16051O5979r678p3738j43975j84919k07802k15346k03839
13307G58617j55174j13204q3215p0586m8023k5039k1687j9275j0390j6569k2551
13296A72904J020n115L894Q003K3963J6970j7274j0165j5650j7749p181K857q446
13283A48031p439l713n941K275q13k4663j1487J9735L03J2483K236q200m223l255
$$ plain form
13269 115329 111222 112693 112828 131833 144360 145827 137943 142523 142172 133474 138874 148980 145412 130109
13255 130109 118643 118909 122877 113424 118007 126820 120349 107974 96090 94824 101973 99600 87284
13242 87284 79484 86520 93487 91749 93015 98694 88764 80116 86090 89869 90683 81642 69713 73350
13228 73350 87413 91904 105238 125791 129059 119801 128698 145542 147129 152290 154237 161892 164799
13215 164799 162976 133562 122645 140648 145205 152430 154653 148731 157474 149714 151021 154852 161884
13202 161884 165285 154038 141158 140744 157377 157047 153258 138254 113662 107275 112955 115469 97548
13189 97548 91177 95049 89247 90583 88224 95147 98722 102434 115663 138070 144744 140539 142120 142293
13175 142293 142011 137594 128351 127375 124586 116103 120204 117297 118997 120353 123955 118496 122743 124903 121736
$$ packed form
13269A15329m107J471J35J9005J2527J467p884M580l51q698N400J0106l568j5303
13255A30109j1466K66L968r453M583Q813o471j2375j1884j266P149k373j2316
13242H7284p800P036O967j738J266N679r930q648N974L779Q14r041j1929L637
13228G3350J4063M491J3334K0553L268r258Q897J6844J587N161J947P655K907
13215A64799j823k9414j0917J8003M557P225K223n922Q743p760J307L831P032
13202A61884L401j1247j2880m14J6633l30l789j5004k4592o387N680K514j7921
13189I7548o371L872n802J336k359O923L575L712J3229K2407O674m205J581J73
13175A42293k82m417r243r76k789q483M101k907J700J356L602n459M247K160l167
$$ plain form
13160 121736 109874 100755 96496 104463 112429 134345 151544 150500 140904 143362 140855 139663 126299
13147 126299 122592 120077 130066 132382 138995 156039 163221 164821 189039 211279 234523 256277 271300
13134 271300 264514 256243 253442 227561 198103 179941 168957 156624 150742 155514 148842 121944 98806
13121 98806 80913 71695 61742 66661 71679 65726 43086 29675 31707 42566 63463 68588 74762
13108 74762 76578 76576 88674 93257 96628 100503 104783 119849 147340 178235 201173 186282 153484
13095 153484 116262 102683 99509 99661 89704 86520 88263 96489 111926 118100 109353 96494 86213
13082 86213 65331 52269 58097 65871 67333 61991 57718 74135 90240 86830 82381 70527 63010
13069 63010 63505 48782 47125 58189 67904 65977 57872 59215 57084 47399 39210 31297 34394 48414
$$ packed form
13160A21736j1862r119m259P967P966K1916J7199j044r596K458k507j192j3364
13147A26299l707k515R989K316O613J7044P182J600K4218K2240K3244K1754J5023
13134B71300o786q271k801k5881k9458j8162j0984j2333n882M772o672k6898k3138
13121I8806j7893r218r953M919N018n953k2640j3411K032J0859K0897N125O174
13108G4762J816kJ2098M583L371L875M280J5066K7491L0895K2938j4891l2798
13095A53484l7222j3579l174J52r957l184J743Q226J5437O174q747j2859j0281
13082H6213k0882j3062N828P774J462n342m273J6417J6105l410m449j1854p517
13069F3010M95j4723j657J1064R715j927q105J343k131r685q189p913L097J4020
$$ plain form
13055 48414 66002 77976 59064 54968 54252 64581 52829 46010 43222 43636 45129 49150 58102 52475
13041 52475 61061 58598 58419 48388 48235 56568 61709 83285 98153 113693 145434 169753 193196
13028 193196 202214 190688 187486 177197 158695 141881 111898 100027 97013 90435 80602 78064 75279
13015 75279 69276 62946 60124 66377 64802 53744 48307 60562 71870 61572 60177 49392 55756
13002 55756 60323 61505 58930 49120 39097 41049 49792 47538 55540 62983 59420 47886 47942 43916
12988 43916 39037 45349 62239 62886 60483 61057 67288 55604 49146 60253 72641 76280 78618 96063
12974 96063 97141 85681 74636 68212 73874 69168 59990 62713 51621 43233 51585 65696 78989
12961 78989 88943 92567 89079 73276 55449 41816 43925 48125 37848 32033 49392 68034 67886
$$ packed form
13055D8414J7588J1974j8912m096p16J0329j1752o819k788M14J493M021Q952n627
13041E2475Q586k463j79j0031j53Q333N141K1576J4868J5540L1741K4319K3443
13028A93196R018j1526l202j0289j8502j6814k9983j1871l014o578r833k538k785
13015G5279o003o330k822O253j575j1058n437J2255J1308j0298j395j0785O364
13002E5756M567J182k575r810j0023J952Q743k254Q002P443l563j1534N6m026
12988D3916m879O312J6890O47k403N74O231j1684o458J1107J2388L639K338J7445
12974I6063J078j1460j1045o424N662m706r178K723j1092q388Q352J4111J3293
12961G8989R954L624l488j5803j7827j3633K109M200j0277n815J7359J8642j48
$$ plain form
12948 67886 67532 66126 70628 78696 78883 86629 78087 75607 75448 75108 65685 50844 43906 40426 54379
12933 54379 72102 66092 59938 65896 63638 49854 43350 52746 66080 69455 56749 54460 51037
12920 51037 49185 47694 57157 65944 74926 69346 69895 75733 81052 82051 73753 65309 61803 63547 73414
12905 73414 72571 59035 41493 29014 33294 37498 36547 50667 54428 57676 75035 74656 69722 74963
12891 74963 57304 62749 78556 88941 97989 104971 111217 130884 130052 127530 120471 105443 101173
12878 101173 107539 107225 95909 97209 100037 99474 99533 94037 92909 96298 97564 85087 74484 82516
12864 82516 88787 96979 99835 83301 69696 58059 59705 63712 70207 61233 49721 42674 55071
12851 55071 65632 74013 69658 65298 58557 73283 83285 83876 94183 104023 99678 76697 87690
$$ packed form
12948F7886l54j406M502Q068J87P746q542k480j59l40r423j4841o938l480J3953
12933E4379J7723o010o154N958k258j3784o504R396J3334L375j2706k289l423
12920E1037j852j491R463Q787Q982n580N49N838N319R99q298q444l506J744R867
12905G3414q43j3536j7542j2479M280M204r51J4120L761L248J7359l79m934N241
12891G4963j7659N445J5807J0385R048O982O246J9667q32k522p059j5028m270
12878A01173O366l14j1316J300K828n63N9n496j128L389J266j2477j0603Q032
12864H2516O271Q192K856j6534j3605j1637J646M007O495q974j1512p047J2397
12851E5071J0561Q381m355m360o741J4726J0002N91J0307R840m345k2981J0993
$$ plain form
12838 87690 96746 94881 97569 97765 95244 98965 102801 93589 94729 108086 116474 109403 108899 114559 108643
12823 108643 101685 91451 95776 84945 65410 75313 76561 88227 103320 95038 108207 114573 127555
12810 127555 143992 160536 158407 163968 181054 199956 186766 183074 174961 165097 158046 151394 144906
12797 144906 135254 125916 121691 131667 137802 150824 177697 201942 212990 224235 252145 277957
12785 277957 300893 316437 342765 372919 401906 419822 449589 480222 503455 516067 518236 549676
12773 549676 594101 638805 694399 752134 830911 931883 1050513 1175217 1317158 1493678
12763 1493678 1710403 1929902 2177127 2438974 2703607 2947291 3174626 3370825 3528573
12754 3528573 3624769 3674776 3669446 3604152 3480891 3309701 3088066 2852345 2595487 2320848
$$ packed form
12838H7690R056j865K688J96k521L721L836r212J140J3357Q388p071n04N660n916
12823A08643o958j0234M325j0831j9535R903J248J1666J5093q282J3169O366J2982
12810A27555J6437J6544k129N561J7086J8902j3190l692q113r864p051o652o488
12797A44906r652r338m225R976O135J3022K6873K4245J1048J1245K7910K5812
12785B77957K2936J5544K6328L0154K8987J7916K9767L0633K3233J2612K169L1440
12773E49676M4425M4704N5594N7735P8777J00972J18630J24704J41941J76520
12763A493678K16725K19499K47225K61847K64633K43684K27335J96199J57748
12754C528573R6196N0007n330o5294j23261j71190k21635k35721k56858k74639
$$ plain form
12744 2320848 2042021 1785599 1534727 1318263 1109282 928728 794742 685424 592866 508986
12734 508986 454998 419686 396703 360388 327617 296241 278949 254807 244026 243158 232585 229350
12722 229350 212594 200213 201821 195094 195318 195514 194353 176090 169822 166545 165997 156803 163965 171072
12708 171072 178772 166314 148224 129924 117501 120073 124351 125548 117320 112745 120509 104082 98980
12695 98980 109508 100994 103558 109836 118883 121971 127740 130238 134669 128340 111643 109611 125133 123366
12681 123366 122980 140918 153467 168009 178132 185825 198585 210930 222779 234708 264227 270204
12669 270204 255082 242783 225641 217115 205760 189020 177585 164821 171851 175421 166744 164463
12657 164463 167184 164841 156050 144283 143257 140086 135501 126762 116067 113719 120029 111717 109641 108249
$$ packed form
12744B320848k78827k56422k50872k16464k08981j80554j33986j09318r2558q3880
12734E08986n3988l5312k2983l6315l2771l1376j7292k4142j0781q68j0573l235
12722B29350j6756j2381J608o727K24J96j161j8263o268l277n48r194P162P107
12708A71072P700j2458j8090j8300j2423K572M278J197q228m575P764j6427n102
12695I8980J0528q514K564O278R047L088N769K498M431o329j6697k032J5522j767
12681A23366l86J7938J2549J4542J0123P693J2760J2345J1849J1929K9519N977
12669B70204j5122j2299j7142q526j1355j6740j1435j2764P030L570q677k281
12657A64463K721k343q791j1767j026l171m585q739j0695k348O310q312k076j392
$$ plain form
12643 108249 106556 110031 101966 102492 105583 104958 113946 129000 140349 140865 136218 123449 122449 118966
12629 118966 108752 106604 104830 97438 89223 95963 111251 110855 106336 110622 112579 111644 99785 96902
12615 96902 99217 100175 99540 100709 105831 108262 116925 107835 101741 101464 109468 118914 130873 134317 135605
12600 135605 132034 133707 141000 152190 161751 155455 156147 163369 161137 173940 169159 166231 166299 163835
12586 163835 166461 168560 172120 183231 192518 179891 169597 175475 180920 190522 201380 191667 175425
12573 175425 168660 167681 183292 182820 165235 159301 161929 175730 177872 170817 159175 154607 160891 150845
12559 150845 140461 129077 123381 133053 141887 150411 159605 160538 160530 162506 162576 162169 155766 153408 158630
12544 158630 147314 136424 121387 111246 113881 123216 125423 133644 151002 147213 145699 158132 167061
$$ packed form
12643A08249j693L475q065N26L091o25Q988J5054J1349N16m647j2769j000l483
12629A18966j0214k148j774p392q215O740J5288l96m519M286J957r35j1859k883
12615I6902K315R58o35J169N122K431Q663r090o094k77Q004R446J1959L444J288
12600A35605l571J673P293J1190R561o296O92P222k232J2803m781k928O8k464
12586A63835K626K099L560J1111R287j2627j0294N878N445R602J0858r713j6242
12573A75425o765r79J5611m72j7585n934K628J3801K142p055j1642m568O284j0046
12559A50845j0384j1384n696R672Q834Q524R194R33qJ976P0m07o403k358N222
12544A58630j1316j0890j5037j0141K635R335K207Q221J7358l789j514J2433Q929
$$ plain form
12531 167061 161274 156998 153467 162469 165115 164963 169854 189073 189554 190164 203349 204985 201417 199299
12517 199299 191262 192790 183464 173830 174070 168142 163419 154314 157603 160353 159045 147524 150185 149824
12503 149824 139474 126348 124599 133271 131579 122593 111097 126843 153021 154126 145258 157359 164792
12490 164792 166475 151266 143225 147460 151536 155338 160295 174309 176015 155089 139199 133586 113676
12477 113676 113547 108940 108092 112765 116908 126620 141668 130189 123309 154194 151664 136567 141976 139020
12463 139020 140238 143794 157617 172513 171535 186000 196134 202266 201507 217074 233246 244296 280489
12450 280489 316503 363082 369214 329450 286043 247198 217805 207413 190930 160410 131869 127876
12438 127876 140510 141427 132710 118320 107497 104456 108421 113588 116587 121108 121608 111925 104609 98429
$$ packed form
12531A67061n787m276l531R002K646j52M891J9219M81O10J3185J636l568k118
12517A99299q037J528r326r634K40n928m723r105L289K750j308j1521K661l61
12503A49824j0350j3126j749Q672j692q986j1496J5746K6178J105q868J2101P433
12490A64792J683j5209q041M235M076L802M957J4014J706k0926j5890n613j9910
12477A13676j29m607q48M673M143R712J5048j1479o880L0885k530j5097N409k956
12463A39020J218L556J3823J4896r78J4465J0134O132p59J5567J6172J1050L6193
12450B80489L6014M6579O132l9764m3407l8845k9393j0392j6483l0520k8541l993
12438A27876J2634R17q717j4390j0823l041L965N167K999M521N00r683p316o180
$$ plain form
12424 98429 108705 107795 108142 107426 117187 133358 130898 115737 102811 97495 113710 124018 136576
12411 136576 130662 130687 126618 118990 108622 120208 128706 127823 112813 109067 96800 99245 112588 113135
12397 113135 111354 107806 92782 87233 73429 67178 76058 83666 84013 82360 94501 100202 118752
12384 118752 125420 126050 118816 112972 103787 105642 109967 104795 98855 104932 85456 92597 105774 97874
12370 97874 87836 92375 80044 75311 96888 109433 104446 107494 90996 90505 107477 113507 112725
12357 112725 105332 99044 113413 115704 104305 108446 111930 113648 112316 113299 108257 114857 126336 132574
12343 132574 124272 116322 114531 122151 141696 155892 161211 170412 185307 189671 196885 197819 198948 192208
12329 192208 173500 164236 153380 144942 128095 109865 100276 109398 118081 121847 116209 102128 91682
$$ packed form
12424I8429J0276r10L47p16R761J6171k460j5161j2926n316J6215J0308J2558
12411A36576n914K5m069p628j0368J1586Q498q83j5010l746j2267K445J3343N47
12397A13135j781l548j5024n549j3804o251Q880P608L47j653J2141N701J8550
12384A18752O668O30p234n844r185J855M325n172n940O077j9476P141J3177p900
12370I7874j0038M539j2331m733K1577J2545m987L048j6498m91J6972O030p82
12357A12725p393o288J4369K291j1399M141L484J718j332R83n042O600J1479O238
12343A32574q302p950j791P620J9545J4196N319R201J4895M364P214R34J129o740
12329A92208j8708r264j0856q438j6847j8230r589R122Q683L766n638j4081j0446
$$ plain form
12316 91682 83000 87937 93178 100055 114540 114659 118212 110711 98109 103901 121881 113666 102723 99122
12302 99122 112805 104238 93216 89691 90280 96991 97846 100394 103191 93166 96056 114118 123025 116387
12288 116387 104760 106032 127228 135788 125600 103665 88941 103821 120485 137026 138698 129653
12276 129653 128216 123599 115041 109283 116939 118919 121809 118965 103796 101572 102186 94965 83972 70167
12262 70167 81147 87499 82553 72364 89144 111843 123039 117425 125462 133219 135099 145760 152747
12249 152747 149974 133637 125912 135304 128019 123038 139408 127258 116316 122435 122081 119186 114838
12236 114838 112639 113711 113741 119457 121096 127294 132709 124529 117000 122689 129673 139389 144300 140918 147156
12221 147156 144772 164060 163578 159026 173271 172326 175099 174292 162305 149413 153813 146023 144566 142680
$$ packed form
12316I1682q682M937N241O877J4485J19L553p501j2602N792J7980q215j0943l601
12302I9122J3683q567j1022l525N89O711Q55K548K797j0025K890J8062Q907o638
12288A16387j1627J272K1196Q560j0188k1935j4724J4880J6664J6541J672r045
12276A29653j437m617q558n758P656J980K890k844j5169k224O14p221j0993j3805
12262G0167J0980O352m946j0189J6780K2699J1196n614Q037P757J880J0661O987
12249A52747k773j6337p725R392p285m981J6370j2150j0942O119l54k895m348
12236A14838k199J072L0N716J639O198N415q180p529N689O984R716M911l382O238
12221A47156k384J9288m82m552J4245r45K773q07j1987j2892M400p790j457j886
$$ plain form
12207 142680 144779 142678 146016 148693 138174 128918 138982 124281 112017 98936 86705 78164 76903
12194 76903 94055 105682 97965 87171 82836 80691 80209 81875 77432 76873 86160 73289 70921 75649
12180 75649 79259 90265 98048 97011 94789 98071 106769 110774 106403 96486 80599 80234 85119 95820
12166 95820 98319 78195 83204 108547 114422 116032 108282 100646 107400 115439 129201 121466 106427
12153 106427 103469 106008 117426 129072 141781 156413 157361 156664 157763 149620 152689 140403 119668
12140 119668 105386 91471 86044 82305 93955 102111 88760 74423 73321 76303 79396 75811 65128
12127 65128 68277 65450 68792 69654 70953 85028 92572 89329 84250 77372 88539 86162 78110 93920
12113 93920 98731 90358 91279 91463 109048 124210 109930 97406 83931 80518 93557 100537 89956
$$ packed form
12207A42680K099k101L338K677j0519r256J0064j4701j2264j3081j2231q541j261
12194G6903J7152J1627p717j0794m335k145m82J666m443n59R287j2871k368M728
12180G5649L610J1006P783j037k222L282Q698M005m371r917j5887l65M885J0701
12166I5820K499k0124N009K5343N875J610p750p636O754Q039J3762p735j5039
12153A06427k958K539J1418J1646J2709J4632R48o97J099q143L069j2286k0735
12140A19668j4282j3915n427l739J1650Q156j3351j4337j102K982L093l585j0683
12127F5128L149k827L342Q62J299J4075P544l243n079o878J1167k377q052J5810
12113I3920M811q373R21J84J7585J5162j4280j2524j3475l413J3039O980j0581
$$ plain form
12100 89956 88331 94267 88254 82965 82824 74421 79188 89692 81357 83442 83116 86002 97271 105100
12086 105100 105001 113496 115976 142019 131302 118252 110358 120421 143936 162842 155947 130865 121637
12073 121637 125356 137995 116210 109007 98968 83407 80003 79201 65677 61126 56016 55910 66057
12060 66057 60488 48328 56699 68576 68229 65666 77800 71741 68587 71317 56303 60038 75224
12047 75224 74309 77882 72781 56561 57516 62928 62668 71838 68341 67631 63655 53829 58824 71336 76212
12032 76212 62013 51595 44064 48782 56384 53102 55794 56555 60789 55324 50067 46197 54345 58399
12018 58399 58437 62336 63835 55114 66873 70368 56930 57954 55205 51919 45567 51885 60529 66014
12004 66014 65211 63517 47378 48459 53766 49238 53109 42537 39384 46816 57281 56266 47915 50529
$$ packed form
12100H9956j625N936o013n289j41q403M767J0504q335K085l26K886J1269P829
12086A05100r9Q495K480K6043j0717j3050p894J0063K3515J8906o895k5082r228
12073A21637L719J2639k1785p203j0039j5561l404q02j3524m551n110j06J0147
12060F6057n569j2160Q371J1877l47k563J2134o059l154K730j5014L735J5186
12047G5224r15L573n101j6220R55N412k60R170l497p10l976r826M995J2512M876
12032G6212j4199j0418p531M718P602l282K692P61M234n465n257l870Q148M054
12018E8399L8L899J499q721J1759L495j3438J024k749l286o352O318Q644N485
12004F6014q03j694j6139J081N307m528L871j0572l153P432J0465j015q351K614
$$ plain form
11990 50529 52667 50227 58723 54362 45837 39558 33365 27295 21204 19272 22154 28205 23200 17176
11976 17176 31002 41994 36136 42958 48016 44216 51021 43136 32777 30402 36187 33651 38234 51931
11962 51931 56962 58399 53545 51870 31554 35096 46049 43306 46976 37245 29978 42758 48834 41505
11948 41505 35294 31188 21545 35912 41813 44098 48746 55542 48783 46330 49990 57423 65227 46441
11934 46441 43638 33286 20821 21696 23106 21380 31655 35825 26628 25012 47298 61611 48212
11921 48212 47233 45360 42650 47075 52549 45580 47354 45508 41983 47656 35243 45365 69711 76657
11907 76657 71901 62304 60945 65092 54571 47847 47580 54061 62677 69370 64869 60548 64127 61656
11893 61656 52591 48889 49205 51854 55449 60218 60131 59726 43608 49325 49740 55504 58357 68851 69823
$$ packed form
11990E0529K138k440Q496m361q525o279o193o070o091j932K882O051n005o024
11976A7176J3826J0992n858O822N058l800O805p885j0359k375N785k536M583J3697
11962E1931N031J437m854j675k0316L542J0953k743L670r731p267J2780O076p329
11948D1505o211m106r643J4367N901K285M648O796o759k453L660P433P804j8786
11934D6441k803j0352j2465Q75J410j726J0275M170r197j616K2286J4313j3399
11921D8212r79j873k710M425N474o969J774j846l525N673j2413J0122K4346O946
11907G6657m756r597j359M147j0521o724k67O481Q616O693m501m321L579k471
11893F1656r065l702L16K649L595M769q7m05j6118N717M15N764K853J0494R72
$$ plain form
11878 69823 56446 58905 65510 66821 63874 52794 54823 51604 40589 25161 34693 54234 68871
11865 68871 76240 65972 68938 73541 66810 61298 55244 40242 39896 36759 29589 22918 34426 42437
11851 42437 50174 60255 54126 58859 59778 68021 73070 76998 65398 60392 57077 62201 66533 74918
11837 74918 77897 77499 80214 76672 64904 64529 75171 67339 44812 32968 32980 32395 50021 60736
11823 60736 58369 57112 60233 57121 48549 40483 53457 49597 54046 52075 50284 60456 61022 63801
11809 63801 51723 35295 48293 45914 42786 57430 69443 68472 78343 80514 66463 73127 74894
11796 74894 77132 83290 88900 109363 125455 149982 190027 216107 240355 258192 238190 203873
11784 203873 170073 126708 99165 91839 89886 91155 82519 78714 64168 53018 43756 43154 45152
$$ packed form
11878F9823j3377K459O605J311k947j1080K029l219j1015j5428R532J9541J4637
11865F8871P369j0268K966M603o731n512o054j5002l46l137p170o671J1508Q011
11851D2437P737J0081o129M733R19Q243N049L928j1600n006l315N124M332Q385
11837G4918K979l98K715l542j1768l75J0642p832k2527j1844J2n85J7626J0715
11823F0736k367j257L121l112q572q066J2974l860M449j971j791J0172N66K779
11809F3801j2078j6428J2998k379l128J4644J2013r71R871K171j4051O664J767
11796G4894K238O158N610K0463J6092K4527M0045K6080K4248J7837k0002l4317
11784B03873l3800m3365k7543p326j953J269q636l805j4546j1150r262o02J998
$$ plain form
11771 45152 47025 60864 69742 60393 45857 40886 42500 48160 52031 49478 43946 51036 53094 50636
11757 50636 58834 61876 62409 47424 39513 31781 26892 24362 37559 57151 64030 69594 60619 47929
11743 47929 47008 32453 34370 33269 27255 29726 33456 39900 42853 47407 50960 58840 63799 61330
11729 61330 62106 68104 71175 70054 75477 72539 59629 60928 69363 74630 64860 67075 77663 85962
11715 85962 79382 67372 64336 64329 49789 37986 35066 47140 65734 75024 58828 62874 69694 69656
11701 69656 69319 71427 70189 63113 70168 77193 85998 82955 69392 64831 69113 76197 80149 74698
11687 74698 84795 83965 69831 74821 74089 78004 75432 88111 101932 117079 123038 133728 138414
11674 138414 150898 176682 197531 215616 220240 205871 210563 198343 182232 160747 145262 125824
$$ packed form
11771D5152J873J3839Q878r349j4536m971J614N660L871k553n532P090K058k458
11757E0636Q198L042N33j4985p911p732m889k530J3197J9592O879N564q975j2690
11743D7929r21j4555J917j101o014K471L730O444K953M554L553P880M959k469
11729F1330P76N998L071j121N423k938j2910J299Q435N267r770K215J0588Q299
11715H5962o580j2010l036pj4540j1803k920J2074J8594R290j6196M046O820l8
11701F9656l37K108j238p076P055P025Q805l043j3563m561M282P084L952n451
11687G4698J0097q30j4134M990p32L915k572J2679J3821J5147N959J0690M686
11674A38414J2484K5784K0849J8085M624j4369M692j2220j6111k1485j5485j9438
$$ plain form
11662 125824 116158 106230 97350 83347 82270 75782 67264 67428 72157 67386 64872 66026 65316 63396
11648 63396 63946 70596 59737 63310 68652 71762 69357 64544 62244 74261 89982 86141 75675 78688
11634 78688 69221 70024 84635 93952 82681 59170 61711 82159 99056 100207 86860 72382 79389
11621 79389 95873 91120 83855 78466 73869 79694 80091 85104 72631 82707 90468 75662 77466 78765
11607 78765 68795 62006 66705 72049 72084 72615 75773 83675 85694 82780 88046 84438 87662 94521 104753
11592 104753 94848 68263 63476 73366 67599 64311 70862 72370 69166 72146 68193 72508 76580 74482
11578 74482 75686 78382 93948 109901 118957 96739 95943 94050 105697 109554 102190 113783 115495
11565 115495 100303 94428 94008 102773 93970 94266 92368 92666 86898 72187 80274 101996 101105 89138
$$ packed form
11662A25824r666r928q880j4003j077o488q518J64M729m771k514J154p10j920
11648F3396N50O650j0859L573N342L110k405m813k300J2017J5721l841j0466L013
11634G8688r467Q03J4611R317j1271k3511K541K0448J6897J151j3347j4478P007
11621G9389J6484m753p265n389m597N825L97N013j2473J0076P761j4806J804J299
11607G8765r970o789M699N344L5N31L158P902K019k914N266l608L224O859J0232
11592A04753r905k6585m787R890n767l288O551J508l204K980l953M315M072k098
11578G4482J204K696J5566J5953R056k2218p96j893J1647L857p364J1593J712
11565A15495j5192n875m20Q765q803K96j898K98n768j4711Q087K1722q91j1967
$$ plain form
11551 89138 84972 77576 75061 76028 74706 71290 80021 98077 108553 118344 117850 131129 140543 124682
11537 124682 115429 122856 132760 128496 129726 124672 110041 93571 94871 110638 113528 100917 84031
11524 84031 85699 88563 93857 97681 108890 115636 118241 110553 114987 115041 121383 125333 123653 113627
11510 113627 104577 103855 106777 117658 118861 119226 118605 124708 133880 129359 137733 136027 145108 152014 158223
11495 158223 154883 152383 155030 148903 133672 127781 125745 117900 106103 118349 113354 110098 121686
11482 121686 135868 138694 130369 133746 139216 147281 154015 144709 141857 134342 135907 145277 134964 127050
11468 127050 139800 142060 132566 127307 141562 137408 137717 132647 126586 126181 131166 133696 141554 155792
11454 155792 154052 158229 164606 197851 220588 229363 250002 273326 270610 274703 290755 287309 273019
$$ packed form
11551H9138m166p396k515R67j322l416Q731J8056J0476R791m94J3279R414j5861
11537A24682r253P427R904m264J230n054j4631j6470J300J5767K890j2611j6886
11524H4031J668K864N294L824J1209O746K605p688M434N4O342L950j680j0026
11510A13627r050p22K922J0881J203L65o21O103R172m521Q374j706R081O906O209
11495A58223l340k500K647o127j5231n891k036p845j1797J2246m995l256J1588
11482A21686J4182K826q325L377N470Q065O734r306k852p515J565R370j0313p914
11468A27050J2750K260r494n259J4255m154L09n070o061m05M985K530P858J4238
11454A55792j740M177O377L3245K2737Q775K0639K3324k716M093J6052l446j4290
$$ plain form
11441 273019 257812 248269 216739 203520 188021 170114 156728 148689 135567 133470 142906 143279 156759
11428 156759 148294 136056 131534 129834 125799 141456 181805 201495 193850 191013 181976 177496 192545
11415 192545 207454 212748 207958 214817 232961 237169 241508 236790 247741 276023 287322 280717 281143
11402 281143 302271 320438 347917 375680 404716 431496 458468 475015 496973 517848 564987
11391 564987 624244 687359 747043 811920 885211 951904 1014589 1093007 1191889 1282827 1375524
11380 1375524 1460012 1561165 1683747 1803064 1926486 2102272 2292206 2480696 2713785 3037856
11370 3037856 3441707 3908544 4451046 5034659 5653812 6372056 7333456 8720701 10772584
11361 10772584 13702588 17804711 23360413 29962192 35468204 36620698 32470070 25570384
$$ packed form
11441B73019j5207r543l1530j3219j5499j7907j3386q039j3122k097R436L73J3480
11428A56759q465j2238m522j700m035J5657M0349J9690p645k837r037m480J5049
11415A92545J4909N294m790O859J8144M208M339m718J0951K8282J1299o605M26
11402B81143K1128J8167K7479K7763K9036K6780K6972J6547K1958K0875M7139
11391E64987N9257O3115N9684O4877P3291O6693O2685P8418R8882R0938R2697
11380A375524Q4488J01153J22582J19317J23422J75786J89934J88490K33089L24071
11370C037856M03851M66837N42502N83613O19153P18244R61400J387245K051883
11361A0772584K930004M102123N555702O601779N506012J152494m150628o899686
$$ plain form
11353 25570384 18890339 13600626 9767300 7140319 5411982 4272927 3496976 2917480
11345 2917480 2453004 2040273 1679064 1400667 1196824 1040560 928176 841739 769790 704999
11335 704999 656914 605889 544468 510849 482840 469990 453267 430044 411246 383083 363595
11324 363595 352659 360062 350509 343891 329130 326300 321527 307028 299155 292367 288951 278985 266340
11311 266340 261885 258223 251099 245065 248635 250025 250124 260081 259226 258477 260054 254841 241188 250589 258699
11296 258699 271929 278029 282846 279936 281809 295557 303307 318685 311065 306755 304271 315789 330047
11283 330047 343138 363000 385559 396344 408298 427371 442107 456353 478455 488904 521392
11272 521392 562016 609309 657655 721131 787224 863679 928601 995030 1067955 1157848 1252001
$$ packed form
11353B5570384o680045n289713l833326k626981j728337j139055p75951n79496
11345B917480m64476m12731l61209k78397k03843j56264j12384q6437p1949o4791
11335G04999m8085n1025o1421l3619k8009j2850j6723k3223j8798k8163j9488
11324C63595j0936P403r553o618j4761k830m773j4499p873o788l416r966j2645
11311B66340m455l662p124o034L570J390R9R957q55p49J577n213j3653R401Q110
11296B58699J3230O100M817k910J873J3748P750J5378p620m310k484J1518J4258
11283C30047J3091J9862K2559J0785J1954J9073J4736J4246K2102J0449L2488
11272E21392M0624M7293M8346O3476O6093P6455O4922O6429P2925Q9893R4153
$$ plain form
11261 1252001 1351898 1453593 1536798 1645063 1777273 1923607 2090349 2266452 2489457 2738463
11251 2738463 3054038 3427457 3845955 4353752 4968313 5734794 6726712 8029012 9797675
11242 9797675 12164760 15108672 18304403 21646646 24917923 26879766 27230743 26737378
11234 26737378 24827186 21359034 17615907 14060058 10731223 7976184 5953681 4514873
11226 4514873 3511452 2794122 2285196 1896479 1583437 1324045 1132522 1006054 898108
11217 898108 807143 720794 654353 612338 588256 572589 546016 525798 507504 475384 447700
11206 447700 429121 414984 407130 391618 365704 336059 312496 302480 295273 291330 286138 281521
11194 281521 294271 297577 280819 275389 278635 263291 254685 264686 273453 282396 286625 294840 307225
$$ packed form
11261A252001R9897J01695Q3205J08265J32210J46334J66742J76103K23005K49006
11251B738463L15575L73419M18498N07797O14561P66481R91918J302300J768663
11242I797675K367085K943912L195731L342243L271277J961843L50977m93365
11234B6737378j910192l468152l743127l555849l328835k755039k022503j438808
11226D514873j003421p17330n08926l88717l13042k59392j91523j26468j07946
11217H98108r0965q6349o6441m2015k4082j5667k6573k0218j8294l2120k7684
11206D47700j8579j4137p854j5512k5914k9645k3563j0016p207l943n192m617
11194B81521J2750L306j6758n430L246j5344q606J0001Q767Q943M229Q215J2385
$$ plain form
11181 307225 303310 292833 285975 297301 308140 315183 307299 300529 298200 290513 279877 277409 290833
11168 290833 298319 287093 276239 269640 270491 269174 259183 242094 226251 228803 240389 245876 246153
11155 246153 246288 266151 261468 257325 281698 293829 289210 292207 288553 287966 280697 257053 252938 240334
11141 240334 228473 222946 218924 218146 218781 217799 213302 203946 190511 186660 186480 183647 176902 174514 188789
11126 188789 196094 189209 183168 175670 175390 181163 191212 183694 188759 198704 190990 193521 206106 209889
11112 209889 219691 204848 207107 208746 206472 207005 202711 201796 202997 179116 156461 139507 132744 126734
11098 126734 137385 157458 160803 151431 147179 147875 161377 162520 160434 158232 150108 141121 124074
11085 124074 129167 124417 126254 137947 134285 115122 111093 104187 88642 92704 103347 119499 140004
$$ packed form
11181C07225l915j0477o858J1326J0839P043p884o770k329p687j0636k468J3424
11168B90833P486j1226j0854o599Q51j317r991j7089j5843K552J1586N487K77
11155B46153J35J9863m683m143K4373J2131m619K997l654n87p269k3644m115j2604
11141B40334j1861n527m022p78O35r82m497r356j3435l851j80k833o745k388J4275
11126A88789P305o885o041p498k80N773J0049p518N065R945p714K531J2585L783
11112B09889R802j4843K259J639k274N33m294r15J201k3881k2655j6954o763o010
11098A26734J0651K0073L345r372m252O96J3502J143k086k202q124q987j7047
11085A24074N093m750J837J1693l662j9163m029o906j5545M062J0643J6152K0505
$$ plain form
11072 140004 155384 159609 156326 149216 148207 154381 162052 168511 165339 149922 136719 124636 116262
11059 116262 120110 125577 120504 108601 115598 129602 138041 139734 145138 150137 157074 166943 155963
11046 155963 144263 145940 153758 156331 160936 158594 154932 154454 160188 161652 154188 152179 168933 171631
11032 171631 164298 159337 147525 132568 130154 125621 131959 129013 114355 120865 130221 131977 127971
11019 127971 111089 119885 132865 140538 132565 118796 116345 129128 136035 121667 116977 109109 112733
11006 112733 113855 110746 103574 105172 113907 116174 111682 105678 118787 124032 121252 130215 141006 141170
10992 141170 140824 142092 134633 138647 136753 127224 123269 104923 111443 120500 122844 125730 133529 152533
10978 152533 153084 162131 160669 162785 163097 151293 151503 160548 173570 186664 182479 168278 157191 153251
$$ packed form
11072A40004J5380M225l283p110j009O174P671O459l172j5417j3203j2083q374
11059A16262L848N467n073j1903O997J4004Q439J693N404M999O937R869j0980
11046A55963j1700J677P818K573M605k342l662m78N734J464p464k009J6754K698
11032A71631p333m961j1812j4957k414m533O338k946j4658O510R356J756m006
11019A27971j6882Q796J2980P673p973j3769k451J2783O907j4368m690p868L624
11006A12733J122l109p172J598Q735K267m492o004J3109N245k780Q963J0791J64
10992A41170l46J268p459M014j894r529l955j8346O520R057K344K886P799J9004
10978A52533N51R047j462K116L12j1804K10R045J3022J3094m185j4201j1087l940
$$ plain form
10964 153251 132038 133699 148589 159639 164732 167066 171876 181937 173413 170372 179241 184806 189806
10951 189806 203490 217522 210268 203045 203296 206936 216056 223330 231090 237579 235993 241200 239504 237251
10937 237251 239996 245293 263587 260244 255593 275914 284047 285913 289582 278383 269785 279538 278825 272875
10923 272875 295851 330930 371000 400015 426751 427975 404979 374652 350294 325114 310826 283026
10911 283026 256961 238702 217163 192136 185563 189971 198281 196523 195523 202595 208297 206396 216942
10898 216942 232878 235200 218055 199823 207599 203209 187292 172360 175754 174664 166710 165468 181976
10885 181976 183261 173489 178411 172315 166488 162098 158800 167003 165311 169463 179929 191435 189734 171550
10871 171550 154441 147151 149184 156239 155202 150203 153094 154855 135876 122714 120554 115828 117660
$$ packed form
10964A53251k1213J661J4890J1050N093K334M810J0061q524l041Q869N565N000
10951A89806J3684J4032p254p223K51L640R120P274P760O489j586N207j696k253
10937B37251K745N297J8294l343m651K0321Q133J866L669j1199q598R753p13n950
10923B72875K2976L5079M0070K9015K6736J224k2996l0327k4358k5180j4288k7800
10911B83026k6065j8259k1539k5027o573M408Q310j758j000P072N702j901J0546
10898B16942J5936K322j7145j8232P776m390j5917j4932L394j090p954j242J6508
10885A81976J285r772M922o096n827m390l298Q203j692M152J0466J1506j701j8184
10871A71550j7109p290K033P055j037m999K891J761j8979j3162k160m726J832
$$ plain form
10858 117660 117797 131079 140485 127788 121168 135572 134202 131946 121589 119157 121372 128376 136981
10845 136981 143537 150349 166273 160717 175745 184119 177959 172499 176395 179966 180229 177402 178831 181772
10831 181772 177999 162767 154141 154029 155962 151948 135500 129475 120624 116530 120203 116681 112334 122096
10817 122096 131366 133011 145326 153914 160050 168369 181649 182908 174530 172762 182751 173692 163543
10804 163543 167242 187750 205589 217441 239562 263264 286053 297309 290415 282332 268790 253935
10792 253935 242077 224250 201790 178807 163609 167405 164961 158519 157771 162462 155845 145113 146455
10779 146455 153969 155823 150527 146649 134794 129004 139021 145216 142181 123171 134628 143628 142946
10766 142946 145602 150648 144869 149030 144184 148709 146557 136473 123108 133124 152782 166035 171147
$$ packed form
10858A17660J37J3282R406j2697o620J4404j370k256j0357k432K215P004Q605
10845A36981O556O812J5924n556J5028Q374o160n460L896L571K63k827J429K941
10831A81772l773j5232q626j12J933m014j6448o025q851m094L673l522m347R762
10817A22096R270J645J2315Q588O136Q319J3280J259q378j768R989r059j0149
10804A63543L699K0508J7839J1852K2121K3702K2789J1256o894q083j3542j4855
10792B53935j1858j7827k2460k2983j5198L796k444o442p48M691o617j0732J342
10779A46455P514J854n296l878j1855n790J0017O195l035j9010J1457R000o82
10766A42946K656N046n779M161m846M525k152j0084j3365J0016J9658J3253N112
$$ plain form
10753 171147 184287 188800 187513 182896 183365 178185 182161 179042 166725 164273 161416 169954 173235 179124
10739 179124 181480 173525 172422 174707 176858 184826 191453 174129 166660 159793 148657 140686 142851 143119
10725 143119 140342 136596 135407 141878 143751 144901 147354 146843 149435 156308 171491 165138 169859 176765
10711 176765 194230 196148 186453 185072 192233 206597 199090 194584 187575 196370 208275 214345 221435
10698 221435 221948 209345 193372 189566 183360 173798 174985 174884 178646 173629 162514 155468 155052 171235
10684 171235 179947 170517 169826 170798 176912 197125 217198 223412 228193 209938 205387 204354 206531 204923
10670 204923 200724 200148 206729 208949 185835 166279 165979 161782 163159 175481 191147 191379 184911 177494
10656 177494 188178 202466 200800 195390 197406 204662 217393 237270 239528 250234 253749 259389 270258
$$ packed form
10753A71147J3140M513j287m617M69n180L976l119j2317k452k857Q538L281N889
10739A79124K356p955j103K285K151P968O627j7324p469o867j1136p971K165K68
10725A43119k777l746j189O471J873J150K453n11K592O873J5183o353M721O906
10711A76765J7465J918r695j381P161J4364p507m506p009Q795J1905O070P090
10698B21435N13j2603j5973l806o206r562J187j01L762n017j1115p046m16J6183
10684A71235Q712r430o91R72O114K0213K0073O214M781j8255m551j033K177j608
10670B04923m199n76O581K220k3114j9556l00m197J377J2322J5666K32o468p417
10656A77494J0684J4288j666n410K016P256J2731J9877K258J0706L515N640J0869
$$ plain form
10643 270258 282265 286092 290799 317362 343847 356754 377541 424876 462575 494165 543595 597876
10631 597876 668315 778769 934604 1144092 1404998 1685652 1989898 2209082 2351905 2421603
10621 2421603 2428383 2399546 2357845 2309812 2212504 2064502 1823862 1529120 1244877 979523
10611 979523 756343 593268 473900 389948 329265 294862 285954 274173 254857 244976 227750
10600 227750 218636 207832 203688 202138 208947 213033 206482 194018 180145 172068 165724 157560 157967 169161
10586 169161 173845 178705 180202 176520 188878 191122 192161 190921 185779 188064 197692 202363 202865 208188
10572 208188 225492 232349 237767 235392 235707 228528 213071 199847 197861 177707 154389 148133 156704
10559 156704 147110 136768 148611 139102 128195 141044 150803 149260 154656 151837 167230 166988 153851
$$ packed form
10643B70258J2007L827M707K6563K6485J2907K0787M7335L7699L1590M9430N4281
10631E97876P0439J10454J55835K09488K60906K80654L04246K19184J42823O9698
10621B421603O780k8837m1701m8033r7308j48002k40640k94742k84243k65354
10611I79523k23180j63075j19368q3952o0683l4403q908j1781j9316r881j7226
10600B27750r114j0804m144j550O809M086o551j2464j3873q077o344q164M07J1194
10586A69161M684M860J497l682J2358K244J039j240n142K285R628M671N02N323
10572B08188J7304O857N418k375L15p179j5457j3224j986k0154k3318o256Q571
10559A56704r594j0342J1843r509j0907J2849R759j543N396k819J5393k42j3137
$$ plain form
10546 153851 146924 147103 134026 137342 140043 147730 150646 158578 164614 165608 160142 161467 142751 123202
10532 123202 129100 132245 121285 132482 150814 152101 149998 152678 155449 150726 146430 142911 147833
10519 147833 159360 148932 140756 148861 145708 145689 149888 136916 136239 141667 156266 161684 161371 165295
10505 165295 161188 156145 158698 165818 169606 173771 178706 190852 188976 186652 198540 201046 198959 207352
10491 207352 198046 197476 205742 221899 220851 218940 231552 233933 235466 238384 243320 248061 242769 248340
10477 248340 243230 237628 249899 256132 248983 261974 278297 280925 294338 300349 306199 317726 330273
10464 330273 340956 357866 363696 360438 352554 355890 365940 368661 358437 350108 349949 349646 350838 348386
10450 348386 355972 364856 365789 371962 386508 401298 433609 480449 537425 595669 687332 819082
$$ packed form
10546A53851o927J79j3077L316K701P687K916P932O036R94n466J325j8716j9549
10532A23202N898L145j0960J1197J8332J287k103K680K771m723m296l519M922
10519A47833J1527j0428q176Q105l153j9M199j2972o77N428J4599N418l13L924
10505A65295m107n043K553P120L788M165M935J2146j876k324J1888K506k087Q393
10491B07352r306n70Q266J6157j048j911J2612K381J533K918M936M741n292N571
10477B48340n110n602J2271O233p149J2991J6323K628J3413O011N850J1527J2547
10464C30273J0683J6910N830l258p884L336J0050K721j0224q329j59l03J192k452
10450C48386P586Q884R33O173J4546J4790L2311M6840N6976N8244R1663J31750
$$ plain form
10438 819082 924535 980741 1021223 1096394 1147356 1143734 1088275 1011194 943268 883295 784699
10427 784699 656882 532650 425377 355637 290997 244582 218145 191677 151771 104258 51698
10416 51698 -1107 -59928 -117560 -162749 -198606 -223089 -218521 -205625 -209069 -211094 -198945 -178197
10404 -178197 -149427 -110831 -59999 -16456 12308 41804 70736 86255 110805 127677 144151
10393 144151 165606 175208 192245 231287 271896 298068 327911 344009 361655 395870 418495 439580
10381 439580 462278 488003 508218 518322 522408 540487 539256 513367 509019 524606 528725 527873 520533
10368 520533 499446 492349 499211 505749 513083 535341 566559 597182 639440 671236 702468 731792
10356 731792 766407 805166 834229 848881 877753 892054 887945 884343 876896 849961 833683 812443
$$ packed form
10438H19082J05453N6206M0482P5171N0962l622n5459p7081o7926n9973r8596
10427G84699j27817j24232j07273o9740o4640m6415k6437k6468l9906m7513n2560
10416E1698n2805n8821n7632m5189l5857k4483M568J2896l444k025J2149K0748
10404a78197K8770L8596N0832M3543K8764K9496K8932J5519K4550J6872J6474
10393A44151K1455R602J7037L9042M0609K6172K9843J6098J7646L4215K2625K1085
10381D39580K2698K5725K0215J0104M086J8079j231k5889m348J5587M119q52p340
10368E20533k1087p097O862O538P334K2258L1218L0623M2258L1796L1232K9324
10356G31792L4615L8759K9063J4652K8872J4301m109l602p447k6935j6278k1240
$$ plain form
10344 812443 783609 766049 746901 743327 737083 731438 711090 698515 707050 712220 720265 726759 723970
10331 723970 700824 676336 637779 585205 542967 515540 481291 456987 440545 419566 403683
10320 403683 392194 386772 376904 358365 338946 341716 354344 372838 391544 409662 441007 462642
10308 462642 480342 510744 540660 573702 608541 631715 644991 665169 696734 729455 748478
10297 748478 783438 809597 825135 839530 867354 895343 916076 945667 988678 1030120 1053360
10286 1053360 1101831 1165932 1223909 1281790 1350749 1414270 1498163 1599767 1712585 1822782 1932414
10275 1932414 2033369 2135200 2250822 2367364 2479413 2581259 2693224 2829123 3001781
10266 3001781 3181843 3367719 3599686 3879590 4176394 4510861 4871576 5259442 5681370
$$ packed form
10344H12443k8834j7560j9148l574o244n645k0348j2575Q535N170Q045O494k789
10331G23970k3146k4488l8557n2574m2238k7427l4249k4304j6442k0979j5883
10320D03683j1489n422r868j8539j9419K770J2628J8494J8706J8118L1345K1635
10308D62642J7700L0402K9916L3042L4839K3174J3276K0178L1565L2721J9023
10297G48478L4960K6159J5538J4395K7824K7989K0733K9591M3011M1442K3240
10286A053360M8471O4101N7977N7881O8959O3521Q3893J01604J12818J10197J09632
10275A932414J00955J01831J15622J16542J12049J01846J11965J35899J72658
10266C001781J80062J85876K31967K79904K96804L34467L60715L87866M21928
$$ plain form
10257 5681370 6159533 6696796 7324436 8022783 8789998 9660769 10648860 11755112 12996741
10248 12996741 14390566 15940846 17655996 19523105 21531388 23657278 25859948 28192718
10240 28192718 30661256 33330731 36314349 39694425 43548134 47948299 53000902 58787829
10232 58787829 65464745 73383706 83103793 95492709 111735351 133387906 162352859
10225 162352859 200459827 247255390 297755973 347491548 386178813 409206832 420025869
10218 420025869 418973302 414106872 409159664 403098505 387740533 361793844 322554321
10211 322554321 270723126 216852788 166648115 125032241 94147982 72149836 56699447
10204 56699447 45905127 38222605 32619420 28439514 25241479 22771521 20819777 19251867
$$ packed form
10257E681370M78163N37263O27640O98347P67215Q70771R88091J106252J241629
10248A2996741J393825J550280J715150J867109K008283K125890K202670K332770
10240B8192718K468538K669475K983618L380076L853709M400165N052603N786927
10232E8787829O676916P918961R720087J2388916J6242642K1652555K8964953
10225A62352859L8106968M6795563N0500583M9735575L8687265K3028019J0819037
10218D20025869j052567m866430m947208o061159j5357972k5946689l9239523
10211C22554321n1831195n3870338n0204673m1615874l0884259k1998146j5450389
10204E6699447j0794320p682522n603185m179906l198035k469958j951744j567910
$$ plain form
10196 19251867 17995268 16955895 16100774 15404085 14813570 14259684 13684540 13067948 12428593
10187 12428593 11798609 11208953 10660415 10179587 9782055 9480386 9249741 9093789 9011807
10178 9011807 9030135 9193839 9556829 10155264 11026322 12089538 13273112 14577433 15729960
10169 15729960 16505878 17154974 17563915 17485051 17280963 17069823 16448317 15497222 14493932
10160 14493932 13180112 11618452 10144139 8779716 7527799 6529590 5774958 5222512
10152 5222512 4828378 4539860 4316152 4152113 4025116 3926769 3861939 3820473 3791871 3764395
10142 3764395 3706402 3628812 3551945 3483958 3412522 3344127 3279480 3199376 3105098 3033978 2947619
10131 2947619 2859954 2784701 2703373 2642485 2590669 2550771 2520490 2493616 2467325 2456396 2439936
$$ packed form
10196A9251867j256599j039373q55121o96689n90515n53886n75144o16592o39355
10187A2428593o29984n89656n48538m80828l97532l01669k30645j55952q1982
10178I011807J8328J63704L62990N98435Q71058J063216J183574J304321J152527
10169A5729960P75918O49096M08941p8864k04088k11140o21506r51095j003290
10160A4493932j313820j561660j474313j364423j251917r98209p54632n52446
10152E222512l94134k88518k23708j64039j26997r8347o4830m1466k8602k7476
10142C764395n7993p7590p6867o7987p1436o8395o4647q0104r4278p1120q6359
10131B947619q7665p5253q1328o0888n1816l9898l0281k6874k6291j0929j6460
$$ plain form
10120 2439936 2399299 2368375 2363106 2360411 2363810 2361925 2346489 2338836 2336582 2336397 2329131 2310535 2286988
10107 2286988 2247970 2219147 2198039 2160193 2131638 2102303 2069688 2048481 2027315 2015469 2021643
10096 2021643 2038421 2042122 2048640 2062492 2046309 1994962 1950154 1903505 1866713 1828238 1796870 1749405
10084 1749405 1711709 1687274 1663335 1649732 1633681 1636845 1655231 1666400 1690815 1726980 1757661
10073 1757661 1796007 1825137 1851477 1897737 1941714 1963887 1991577 1993561 1990351 1997033 1998859 2013954
10061 2013954 2034386 2064233 2081130 2099498 2111098 2115015 2119036 2117821 2148011 2169671 2194779 2229440
10049 2229440 2271432 2318103 2363310 2410334 2470833 2533356 2603418 2666758 2745263 2828767 2901619
10038 2901619 2956853 2999153 3014783 3037384 3086603 3169659 3282828 3421149 3554172 3679645
$$ packed form
10120B439936m0637l0924n269k695L399j885j5436p653k254j85p266j8596k3547
10107B286988l9018k8823k1108l7846k8555k9335l2615k1207k1166j1846O174
10096B021643J6778L701O518J3852j6183n1347m4808m6649l6792l8475l1368m7465
10084A749405l7696k4435k3939j3603j6051L164J8386J1169K4415L6165L0681
10073A757661L8346K9130K6340M6260M3977K2173K7690J984l210O682J826J5095
10061B013954K0432K9847J6897J8368J1600L917M021j215L0190K1660K5108L4661
10049B229440M1992M6671M5207M7024O0499O2523P0062O3340P8505Q3504P2852
10038B901619N5234M2300J5630K2601M9219Q3056J13169J38321J33023J25473
$$ plain form
10028 3679645 3786199 3807738 3740802 3652775 3590510 3555328 3539392 3510283 3481790 3453318 3418914
10017 3418914 3386072 3368175 3368618 3378547 3397008 3438006 3472855 3514498 3583325 3649280 3716791 3782391
10005 3782391 3843006 3908401 3987730 4062529 4140819 4236189 4326825 4431263 4527118 4626520 4731600
9994 4731600 4839518 4952485 5066519 5174856 5286719 5419505 5569936 5703409 5838322 5983405
9984 5983405 6131996 6279300 6424878 6582368 6730573 6880556 7045544 7196500 7351522 7533941
9974 7533941 7724306 7919261 8125809 8347594 8576383 8836421 9115739 9397326 9670583 9962443
9964 9962443 10261723 10569507 10904696 11246952 11591137 11958476 12335212 12735285 13164462 13590873
9954 13590873 14021115 14477656 14963614 15447719 15943823 16463773 16997633 17547904 18120441
$$ packed form
10028C679645J06554K1539o6936q8027o2265l5182j5936k9109k8493k8472l4404
10017C418914l2842j7897M43R929J8461M0998L4849M1643O8827O5955O7511O5600
10005C782391O0615O5395P9329P4799P8290R5370R0636J04438R5855R9402J05080
9994D731600J07918J12967J14034J08337J11863J32786J50431J33473J34913J45083
9984E983405J48591J47304J45578J57490J48205J49983J64988J50956J55022J82419
9974G533941J90365J94955K06548K21785K28789K60038K79318K81587K73257K91860
9964I962443K99280L07784L35189L42256L44185L67339L76736M00073M29177M26411
9954A3590873M30242M56541M85958M84105M96104N19950N33860N50271N72537
$$ plain form
9945 18120441 18681538 19282637 19899395 20506752 21125258 21749089 22363839 22990004 23620356
9936 23620356 24267268 24916001 25542110 26166153 26786056 27375997 27936389 28472050 28976547
9927 28976547 29425537 29829311 30206293 30539166 30800231 31018502 31181715 31273353 31278352 31229349
9917 31229349 31109689 30924047 30684031 30383033 30022459 29611104 29172971 28696965 28177073
9908 28177073 27635628 27063173 26463739 25859866 25248136 24636237 24010155 23392316 22801301
9899 22801301 22206416 21626928 21055785 20510515 19985265 19487528 19033426 18590355 18186028
9890 18186028 17823594 17493900 17195254 16952265 16770644 16664857 16653904 16731757 16894537 17157249
9880 17157249 17580218 18299396 19492683 21285952 23705391 26580138 29704053 32835050
$$ packed form
9945A8120441N61097O01099O16758O07357O18506O23831O14750O26165O30352
9936B3620356O46912O48733O26109O24043O19903N89941N60392N35661N04497
9927B8976547M48990M03774L76982L32873K61065K18271J63213R1638M999m9003
9917C1229349j19660j85642k40016l00998l60574m11355m38133m76006n19892
9908B8177073n41445n72455n99434o03873o11730o11899o26082o17839n91015
9899B2801301n94885n79488n71143n45270n25250m97737m54102m43071m04327
9890A8186028l62434l29694k98646k42989j81621j05787j0953P7853J62780K62712
9880A7157249M22969P19178J193287J793269K419439K874747L123915L130997
$$ plain form
9872 32835050 35235947 36211697 35866548 34273390 31236441 27311381 23312338 19561975
9864 19561975 16258272 13625388 11690063 10296222 9282139 8546189 7994056 7548360 7187641
9855 7187641 6896775 6648775 6430194 6234831 6055626 5891183 5744970 5602716 5477370 5362364
9845 5362364 5278408 5218614 5187136 5209985 5286642 5456322 5745136 6116643 6221795 5810629
9835 5810629 5269154 4823584 4480349 4221366 4019999 3873058 3765071 3667926 3596836 3541321
9825 3541321 3495522 3458625 3429143 3401501 3388141 3386138 3425287 3498652 3613737 3787652 4005524
9814 4005524 4236487 4462766 4625539 4709357 4720071 4680540 4628578 4577414 4492653 4347210 4148030
9803 4148030 3873701 3551808 3226871 2926956 2696512 2523502 2373228 2264396 2161060 2085314
$$ packed form
9872C2835050K400897R75750l45149j593158l036949l925060l999043l750363
9864A9561975l303703k632884j935325j393841j014083p35950n52133m45696l60719
9855G187641k90866k48000k18581j95363j79205j64443j46213j42254j25346j15006
9845E362364q3956n9794l1478K2849P6657J69680K88814L71507J05152m11166
9835E810629n41475m45570l43235k58983k01367j46941j07987r7145p1090n5515
9825C541321m5799l6897k9482k7642j3360k003L9149P3365J15085J73915K17872
9814D005524K30963K26279J62773Q3818J0714l9531n1962n1164q4761j45443j99180
9803D148030k74329l21893l24937k99915k30444j73010j50274j08832j03336p5746
$$ plain form
9793 2085314 2029879 2000516 1966392 1924631 1880787 1851082 1825725 1795392 1775779 1762507 1751205
9782 1751205 1728857 1695775 1656241 1616451 1592017 1568165 1540210 1514188 1493862 1475805 1456230
9771 1456230 1437818 1413529 1388954 1377722 1364922 1349195 1347761 1340293 1333124 1322779 1319537 1307109
9759 1307109 1288552 1282582 1255359 1232883 1227301 1225564 1208108 1205964 1200798 1184819 1158122 1147776
9747 1147776 1128904 1120073 1098155 1084727 1070886 1049146 1038802 1031460 1004758 984686 969804 960843
9735 960843 958166 949886 943282 941160 935156 910390 887134 877539 879446 875143 871666 868999 855532 837756
9721 837756 827854 818128 807097 806047 796023 798504 785201 771953 764200 762103 753353 744356 722486
9708 722486 702550 700417 713326 709170 711376 719276 721731 714141 706120 696671 697655 698231 687440 688943
$$ packed form
9793B085314n5435k9363l4124m1761m3844k9705k5357l0333j9613j3272j1302
9782A751205k2348l3082l9534l9790k4434k3852k7955k6022k0326j8057j9575
9771A456230j8412k4289k4575j1232j2800j5727j434p468p169j0345l242j2428
9759A307109j8557n970k7223k2476n582j737j7456k144n166j5979k6697j0346
9747A147776j8872q831k1918j3428j3841k1740j0344p342k6702k0072j4882q961
9735I60843k677q280o604k122o004k4766k3256r595J907m303l477k667j3467j7776
9721H37756r902r726j1031j050j0024K481j3303j3248p753k097q750q997k1870
9708G22486j9936k133J2909m156K206P900K455p590q021r449R84N76j0791J503
$$ plain form
9694 688943 686898 687805 683107 674235 669756 658633 656007 663094 669223 672353 665100 658499 642495 632445
9680 632445 634483 636137 625677 621828 605683 597183 595434 605374 605721 591651 585094 593323 584197 574681
9666 574681 575366 579919 579940 578625 572212 569458 545416 536476 528432 519054 504187 503150 505489 507151 513024
9651 513024 509462 521082 522576 512076 504922 510370 521029 507219 488888 477725 483744 497110 520428
9638 520428 533336 527200 531427 527569 526903 528770 528777 511444 498292 488482 474205 468407 444972 426592
9624 426592 445858 453601 450561 442785 447234 446912 437341 430945 429710 420498 414521 418769 411212 390084
9610 390084 376691 380744 384990 380996 376970 378618 387950 393662 377737 378282 381411 378005 381828 388802
9596 388802 392932 403733 407485 393424 376265 384963 387628 381953 398114 405973 413866 408871 405884
$$ packed form
9694F88943k045R07m698q872m479j1123k626P087O129L130p253o601j6004j0050
9680F32445K038J654j0460l849j6145q500j749R940L47j4070o557Q229r126r516
9666E74681O85M553K1j315o413k754k4042q940q044r378j4867j037K339J662N873
9651E13024l562J1620J494j0500p154N448J0659j3810j8331j1163O019J3366K3318
9638E20428J2908o136M227l858o66J867Pj7333j3152r810j4277n798k3435j8380
9624D26592J9266P743l040p776M449l22r571o396j235r212n977M248p557k1128
9610C90084j3393M053M246l994m026J648R332N712j5925N45L129l406L823O974
9596C88802M130J0801L752j4061j7159Q698K665n675J6161P859P893m995k987
$$ plain form
9583 405884 398922 397340 391149 377640 373753 380029 370502 353157 345758 346806 340029 334235 332603 325536
9569 325536 331144 326028 328335 325224 316011 305159 293386 299291 329636 347109 335943 333276 321449
9556 321449 301993 306470 324570 333876 335293 334570 331549 327668 313461 306301 317364 321909 313372 302468
9542 302468 301509 297657 290903 291310 292522 300031 313453 302282 279796 270657 278172 269802 263974 278191
9528 278191 292998 297087 284096 276552 262105 255558 264083 256561 251811 256098 264797 271121 279841 288231
9514 288231 277982 266019 285228 289822 286639 272014 250984 250614 266404 269219 255838 251973 256955
9501 256955 274336 280524 299086 307244 293719 295873 298060 290702 281838 275347 260200 264662 260396
9488 260396 247538 244361 251190 252121 254535 264723 262727 262281 250886 253979 247147 238421 242828 249598
$$ packed form
9583D05884o962j582o191j3509l887O276r527j7345p399J048o777n794j632p067
9569C25536N608n116K307l111r213j0852j1773N905L0345J7473j1166k667j1827
9556C21449j9456M477J8100R306J417p23l021l881j4207p160J1063M545q537j0904
9542C02468r59l852o754M07J212P509J3422j1171k2486r139P515q370n828J4217
9528B78191J4807M089j2991p544j4447o547Q525p522m750M287Q699O324Q720Q390
9514B88231j0249j1963J9209M594l183j4625k1030l70J5790K815j3381l865M982
9501B56955J7381O188J8562Q158j3525K154K187p358q864o491j5147M462m266
9488B60396j2858l177O829R31K414J0188j996m46j1395L093o832q726M407O770
$$ plain form
9474 249598 247392 255911 247500 238102 251092 267622 288583 320753 353482 375443 375615 372863 370118
9461 370118 376867 358858 330430 309861 300438 293161 275228 273098 265198 256232 265315 277075 276254
9448 276254 259883 251373 236887 244453 241096 250239 256893 249456 242115 232945 228917 231062 236278 227934
9434 227934 227234 228989 227180 222872 234035 241666 242600 233891 236445 242165 242581 237324 241892 257205 266500
9419 266500 274409 279180 263321 239087 236007 238397 234674 232909 233343 235190 219824 213011 200520 198003
9405 198003 201312 187083 185806 187523 192256 196380 198621 200525 199460 197437 200876 194020 197271 197353 191493
9390 191493 185141 178252 180934 193353 199127 200372 209747 211791 193760 194113 190069 179153 172065 174486
9376 174486 181595 190915 194020 201851 195569 194875 204161 200873 203774 209961 209741 211695 209806 217963 213910
$$ packed form
9474B49598k206Q519q411r398J2990J6530K0961L2170L2729K1961J72k752k745
9461C70118O749j8009k8428k0569r423p277j7933k130p900q966R083J1760q21
9448B76254j6371q510j4486P566l357R143O654p437p341r170m028K145N216q344
9434B27934p00J755j809m308J1163P631R34q709K554N720M16n257M568J5313R295
9419B66500P909M771j5859k4234l080K390l723j765M34J847j5366o813j2491k517
9405A98003L309j4229j277J717M733M124K241J904j065k023L439o856L251Q2n860
9390A91493o352o889K682J2419N774J245R375K044j8031L53m044j0916p088K421
9376A74486P109R320L105P831o282o94R286l288K901O187k20J954j889Q157m053
$$ plain form
9361 213910 207841 207755 210224 209751 201961 208867 208814 203163 212069 219806 232809 247629 241792 234117 219723
9346 219723 211787 206042 201024 197681 207800 209737 201082 196327 208189 202429 190389 193454 191525 186836
9332 186836 190720 171180 164543 184328 181959 179292 175040 162237 151619 156323 151099 163818 175879
9319 175879 172395 170427 175122 173050 176986 185105 187375 201323 202628 198546 183040 169546 177051 183721
9305 183721 175901 180249 181277 178544 179791 176874 187702 203462 194676 186128 180614 185890 189013 185686
9291 185686 183289 173637 185483 201520 214404 219294 209666 211926 220926 225645 221721 218588 212724 208184
9277 208184 204031 199186 213355 222100 236745 252500 234835 215778 203510 195089 188153 169111 171889
9264 171889 194464 188259 185372 191457 191685 201409 209751 205866 204140 205293 196820 200365 201532 202346 217119
$$ packed form
9361B13910o069q6K469m73p790O906n3n651Q906P737J3003J4820n837p675j4394
9346B19723p936n745n018l343J0119J937q655m755J1862n760j2040L065j929m689
9332A86836L884j9540o637J9785k369k667m252j2803j0618M704n224J2719J2061
9319A75879l484j968M695k072L936Q119K270J3948J305m082j5506j3494P505O670
9305A83721p820M348J028k733J247k917J0828J5760q786q548n514N276L123l327
9291A85686k397r652J1846J6037J2884M890r628K260R000M719l924l133n864m540
9277B08184m153m845J4169Q745J4645J5755j7665j9057j2268q421o936j9042K778
9264A71889K2575o205k887O085K28R724Q342l885j726J153q473L545J167Q14J4773
$$ plain form
9249 217119 212891 207360 212571 222218 222521 220047 224906 229027 245405 263420 276045 297711 323036
9236 323036 325535 318356 302995 297666 275660 254705 261658 256799 232187 225800 241224 256918 278723
9223 278723 300168 292423 284996 278722 270992 261402 255183 252362 246909 238697 232092 217186 213457 209399
9209 209399 206308 203090 223447 233060 231222 235714 216491 204430 210793 224790 232655 233024 233894 237072
9195 237072 249935 262345 261670 258498 243228 250414 262917 278097 273223 281308 291603 288835 292201
9182 292201 316997 334815 334249 356002 388709 403534 421399 438724 451774 472184 488651 515707
9170 515707 528378 551200 604734 688667 796950 967173 1183240 1382236 1429221 1269773 1021099
9159 1021099 801514 646386 544228 466288 416189 380783 385658 378686 367711 351994 324608
$$ packed form
9249B17119m228n531N211R647L03k474M859M121J6378J8015J2625K1666K5325
9236C23036K499p179j5361n329k2006k0955O953m859k4612o387J5424J5694K1805
9223B78723K1445p745p427o274p730r590o219k821n453q212o605j4906l729m058
9209B09399l091l218K0357R613j838M492j9223j2061O363J3997P865L69Q70L178
9195B37072J2863J2410o75l172j5270P186J2503J5180m874Q085J0295k768L366
9182B92201K4796J7818n66K1753L2707J4825J7865J7325J3050K0410J6467K7056
9170E15707J2671K2822N3534Q3933J08283J70223K16067J98996M6985j59448k48674
9159A021099k19585j55128j02158p7940n0099l5406M875o972j0975j5717k7386
$$ plain form
9148 324608 308684 304410 284089 275147 259243 248049 259593 261343 267574 271924 258919 241510 241235
9135 241235 253491 272564 281319 297133 306490 311995 323561 308587 292333 283645 265163 258311 271002
9122 271002 288351 290829 298328 289369 285558 285480 286730 299615 311029 321594 326599 335913 355596 389537
9108 389537 422386 463448 510591 573536 634382 694382 759089 785172 777019 756007 730305 706992
9096 706992 692133 646603 592505 546634 527318 524268 505351 493262 487014 502967 513758 506140
9084 506140 511507 532580 561010 589458 605586 612869 618430 619243 613214 613529 626291 655295 680004
9071 680004 700111 717214 735353 744008 731925 708348 697866 670783 652362 639394 633350 638965
9059 638965 639703 643838 648413 647304 632528 626011 638581 638117 646788 659195 668134 665927 676864 700492
$$ packed form
9148C24608j5924m274k0321q942j5904j1194J1544J750O231M350j3005j7409k75
9135B41235J2256J9073Q755J5814R357N505J1566j4974j6254q688j8482o852J2691
9122B71002J7349K478P499q959l811p8J250J2885J1414J0565N005R314J9683L3941
9108C89537L2849M1062M7143O2945O0846O0000O4707K6083q153k1012k5702k3313
9096G06992j4859m5530n4098m5871j9316l050j8917j2089o248J5953J0791p618
9084E06140N367K1073K8430K8448J6128P283N561Q13o029L15J2762K9004K4709
9071F80004K0107J7103J8139Q655j2083k3577j0482k7083j8421j2968o044N615
9059F38965P38M135M575j109j4776o517J2570m64Q671J2407Q939k207J0937K3628
$$ plain form
9045 700492 716282 743053 763087 774464 760127 734714 722083 700409 689989 681667 673511 648063
9033 648063 636300 639561 629318 609485 590840 568064 556502 543348 552083 559878 576874 587334
9021 587334 589741 601962 637654 664575 692145 717240 733328 748848 740211 697357 659102 655731
9009 655731 669841 682006 715358 744588 784184 849210 910070 960316 1000059 1017571 999716 950740
8997 950740 887922 816137 757625 699820 648101 617069 578172 553421 529581 505685 483421 449814
8985 449814 453322 463765 492740 524898 568630 609587 638957 666731 682890 679683 676513 694008
8973 694008 701264 697867 689336 659231 635004 614838 601624 564922 539018 530406 534487 525464 514557
8960 514557 505032 481289 475953 483838 497596 518293 546972 564305 592265 626926 664899 693736
$$ packed form
9045G00492J5790K6771K0034J1377j4337k5413j2631k1674j0420q322q156k5448
9033F48063j1763L261j0243j9833j8645k2776j1562j3154Q735P795J6996J0460
9021E87334K407J2221L5692K6921K7570K5095J6088J5520q637m2854l8255l371
9009F55731J4110J2165L3352K9230L9596O5026O0860N0246L9743J7512j7855m8976
8997I50740o2818p1785n8512n7805n1719l1032l8897k4751k3840k3896k2264l3607
8985D49814L508J0443K8975L2158M3732M0957K9370K7774J6159l207l170J7495
8973F94008P256l397q531l0105k4227k0166j3214l6702k5904q612M081r023j0907
8960E14557r525k3743n336P885J3758K0697K8679J7333K7960L4661L7973K8837
$$ plain form
8948 693736 705550 732203 768491 813458 889648 991987 1121208 1227731 1261265 1207992 1085175
8937 1085175 960725 852441 769806 711931 693176 689664 697327 697206 711656 725498 736219 754901
8925 754901 758898 754879 735683 704731 648810 605208 580390 574064 556089 537366 524055 531141
8913 531141 552810 571119 586608 611898 658511 701239 734801 751330 763211 748497 706576 656282
8901 656282 609608 560367 506062 458551 432076 407922 395896 400870 409267 404291 392287 385834
8889 385834 379910 375274 347076 315640 321250 321794 295181 270197 267053 264418 265889 260026 243174
8876 243174 245497 268494 266899 253506 251282 257474 258180 248188 243352 233110 230276 243268 261153
8863 261153 266954 262989 254989 269794 278122 281035 273629 261021 258853 268486 262383 257157 260385 275137
$$ packed form
8948F93736J1814K6653L6288M4967P6190J02339J29221J06523L3534n3273j22817
8937A085175j24450j08284q2635n7875j8755l512P663j21J4450J3842J0721J8682
8925G54901L997m019j9196l0952n5921m3602k4818o326j7975j8723j3311P086
8913E31141K1669J8309J5489K5290M6613M2728L3562J6529J1881j4714m1921n0294
8901F56282m6674m9241n4305m7511k6475k4154j2026M974Q397m976j2004o453
8889C85834n924m636k8198l1436N610N44k6613k4984l144k635J471n863j6852
8876B43174K323K2997j595j3393k224O192P06r992m836j0242k834J2992J7885
8863B61153N801l965q000J4805Q328K913p406j2608k168R633o103n226L228J4752
$$ plain form
8849 275137 289829 298110 305105 299954 287543 281630 260883 235023 237879 251988 252515 252392 251210 245777
8835 245777 226650 213249 224020 222738 216705 203665 202885 198373 199364 196471 181657 182142 186989 197744
8821 197744 202329 210447 208314 194493 198729 200238 207119 207972 217426 227316 224792 227963 228107 230305 234339
8806 234339 240920 241533 233753 219758 218290 214823 198190 186405 188021 200953 215650 211570 197539
8793 197539 199079 193664 196965 194309 172820 172782 175782 177730 188654 186396 180669 163501 166751 172568
8779 172568 177954 182009 182397 183842 183193 165885 167317 181517 181292 165366 158187 168928 159322 136283
8765 136283 128901 144721 158055 165391 161859 167133 168198 159643 165404 181980 196446 203561 211702
8752 211702 209354 194653 181693 168742 167084 154664 149158 146594 144414 153644 156296 151568 155527
$$ packed form
8849B75137J4692Q281O995n151j2411n913k0747k5860K856J4109N27j23j182n433
8835B45777j9127j3401J0771j282o033j3040p80m512R91k893j4814M85M847J0755
8821A97744M585Q118k133j3821M236J509O881Q53R454R890k524L171J44K198M034
8806B34339O581O13p780j3995j468l467j6633j1785J616J2932J4697m080j4031
8793A97539J540n415L301k656k1489l8L000J948J0924k258n727j7168L250N817
8779A72568N386M055L88J445o49j7308J432J4200k25j5926p179J0741r606k3039
8765A36283p382J5820J3334P336l532N274J065q555N761J6576J4466P115Q141
8752B11702k348j4701j2960j2951j658j2420n506k564k180R230K652m728L959
$$ plain form
8739 155527 166656 171521 139525 137021 139206 137999 138885 138664 143789 144891 148967 138976 122498 120865
8725 120865 115044 109536 108303 118508 121951 115673 112253 124844 128214 121532 137147 157002 166486
8712 166486 161080 160116 165984 174305 187712 196368 188378 194462 212475 238645 266264 284633 291319
8699 291319 277431 263668 240422 225522 200637 182545 163380 148175 146413 154799 144466 143417
8687 143417 158528 171096 172782 168298 168919 171377 155082 147121 155739 140034 122412 116515 119730
8674 119730 105542 96415 108483 126576 131103 125356 123853 116204 112815 110542 97759 90132 108135
8661 108135 118742 119894 122191 108306 107294 106412 122098 117787 123953 122555 108387 102830 114545
8648 114545 132485 146633 140150 140533 126783 127534 126240 136461 152302 140580 127461 130895 123536
$$ packed form
8739A55527J1129M865l1996k504K185j207Q86k21N125J102M076r991j6478j633
8725A20865n821n508j233J0205L443o278l420J2591L370o682J5615J9855R484
8712A66486n406r64N868Q321J3407Q656p990O084J8013K6170K7619J8369O686
8699B91319j3888j3763k3246j4900k4885j8092j9165j5205j762Q386j0333j049
8687A43417J5111J2568J686m484O21K458j6295p961Q618j5705j7622n897L215
8674A19730j4188r127J2068J8093M527n747j503p649l389k273j2783p627J8003
8661A08135J0607J152K297j3885j012q82J5686m311O166j398j4168n557J1715
8648A14545J7940J4148o483L83j3750P51j294J0221J5841j1722j3119L434p359
$$ plain form
8635 123536 116341 113981 109933 106769 107998 100637 102185 102235 102968 107044 111231 100772 87292 81840 90574
8620 90574 95918 98245 91792 87609 82721 84826 88473 100599 107862 102044 97576 88918 87695 92125
8606 92125 106498 105150 98013 100363 95721 102174 100622 102655 100217 98223 95407 94489 97071 117876
8592 117876 139926 157852 168183 176324 191511 182146 147905 138184 137762 121068 106115 99401 92903
8579 92903 81390 81194 79441 95036 98273 97419 114005 100758 96758 85137 74553 80027 88105 97241
8565 97241 91372 80963 78023 80055 78534 74322 86100 93534 98727 106634 94876 81148 83760 93865
8551 93865 105283 109458 119609 118516 107239 112574 123589 143761 162637 173485 199993 215674
8539 215674 202917 168841 146344 135066 135005 122610 109902 100764 106974 102366 94814 113945 115660
$$ packed form
8635A23536p195k360m048l164J229p361J548N0P33M076M187j0459j3480n452Q734
8620I0574N344K327o453m183m888K105L647J2126P263n818m468q658j223M430
8606I2125J4373j348p137K350m642O453j552K033k438j994k816r18K582K0805
8592A17876K2050J7926J0331Q141J5187r365l4241r721m22j6694j4953o714o498
8579I2903j1513j96j753J5595L237q54J6586j3247m000j1621j0584N474Q078R136
8565I7241n869j0409k940K032j521m212J1778P434N193P907j1758j3728K612J0105
8551I3865J1418M175J0151j093j1277N335J1015K0172J8876J0848K6508J5681
8539B15674j2757l4076k2497j1278o1j2395j2708r138O210m608p552J9131J715
$$ plain form
8526 115660 101578 89896 71607 69039 74211 63725 61049 52786 72775 81294 77387 76125 73331
8513 73331 59486 52614 52900 64668 61551 61926 67974 78443 81953 68055 53166 46097 57707 64459
8499 64459 77888 92399 92646 76303 80589 98074 98375 95408 97082 92882 81248 68995 60958 49128
8485 49128 45867 41332 45927 49749 37946 42239 44219 44261 48463 53723 58104 52009 45910 42944 30016
8470 30016 44909 55752 53524 47133 29905 26941 38743 51805 51016 51579 57803 59446 60872 50757
8456 50757 50754 58988 80090 69089 57642 52486 55952 49358 48850 41577 41631 47615 50020 51926 59745
8441 59745 58818 58704 54341 51556 50951 55194 62623 57118 36101 27444 24444 24232 31860 33606 32303
8426 32303 21374 15430 18395 33903 43824 45535 44445 47730 44088 37379 42425 43578 45162 36374
$$ packed form
8526A15660j4082j1682j8289k568N172j0486k676q263J9989Q519l907j262k794
8513G3331j3845o872K86J1768l117L75O048J0469L510j3898j4889p069J1610O752
8499F4459J3429J4511K47j6343M286J7485L01k967J674m200j1634j2253q037j1830
8485D9128l261m535M595L822j1803M293J980M2M202N260M381o095o099k966j2928
8470C0016J4893J0843k228o391j7228k964J1802J3062p89N63O224J643J426j0115
8456E0757lQ234K1102j1001j1447n156L466o594n08p273N4N984K405J906P819
8441E9745r27j14m363k785o05M243P429n505k1017q657l000k12P628J746j303
8426C2303j0929n944K965J5508R921J711j090L285l642o709N046J153J584q788
$$ plain form
8412 36374 27187 23672 38281 36202 28787 27838 19046 17123 21841 27382 35820 44019 47055 52407 60546
8397 60546 65914 70601 53110 52797 50619 55175 53407 51835 50858 52432 54612 53428 35124 23795
8383 23795 32323 29324 35289 43841 49929 41777 36509 33072 24545 29094 28825 23202 39666 48415 45849
8368 45849 30872 36962 43950 39969 35422 37676 28466 28842 43730 50303 64591 64361 73231 74058 59427
8353 59427 46681 47356 55992 61035 58775 46484 27591 28619 32362 40459 32038 30096 39087 33000
8339 33000 20965 22532 27653 34247 32889 34826 30567 23189 21270 21143 22286 27875 36776 29357 37644
8324 37644 51028 40861 30866 28695 27918 7197 492 8443 19763 32391 46741 47151 50547 40498
8310 40498 28403 41974 40895 36194 18105 2843 9598 15202 15880 24005 23286 26601 26749 23014
$$ packed form
8412C6374r187l515J4609k079p415r49q792j923M718N541Q438Q199L036N352Q139
8397F0546N368M687j7491l13k178M556j768j572r77J574K180j184j8304j1329
8383B3795Q528k999N965Q552O088q152n268l437q527M549k69n623J6464Q749k566
8368D5849j4977O090O988l981m547K254r210L76J4888O573J4288k30Q870Q27j4631
8353E9427j2746O75Q636N043k260j2291j8893J028L743Q097q421j942Q991o087
8339C3000j2035J567N121O594j358J937m259p378j919j27J143N589Q901p419Q287
8324C7644J3384j0167r995k171p77k0721o705P951J1320J2628J4350M10L396j0049
8310D0498j2095J3571j079m701j8089j5262O755N604O78Q125p19L315J48l735
$$ plain form
8296 23014 7023 -1147 13547 29864 26780 20780 23393 31947 48986 48067 41042 43901 43169 34653
8282 34653 26562 26221 29665 30722 15425 5690 9489 31906 31854 13633 13321 15520 20524 19627 34134
8267 34134 33509 19081 19737 18143 10727 29065 33075 20065 15016 19418 28696 30130 37180 38522
8253 38522 23535 21137 26482 30176 33734 21657 16853 15632 15402 11967 15924 17420 23968 11563
8239 11563 -364 919 14951 27192 23104 23850 27488 21565 17880 15587 15696 17219 24393 19044
8225 19044 24060 31268 33265 34678 19283 7368 8529 8845 10294 19231 22308 18511 28679 23990
8211 23990 13392 6824 16638 38380 41015 32815 24139 10564 27351 43430 36748 26095 26450
8198 26450 16173 10662 24501 29656 31796 31665 29917 19394 10997 14294 29854 29157 16773 16665
$$ packed form
8296B3014j5991q170J4694J6317l084o000K613Q554J7039r19p025K859p32q516
8282C4653q091l41L444J057j5297r735L799K2417n2j8221l12K199N004q97J4507
8267C4134o25j4428O56j594p416J8338M010j3010n049M402R278J434P050J342
8253C8522j4987k398N345L694L558j2077m804j221k30l435L957J496O548j2405
8239A1563j1927J283J4032J2241m088P46L638n923l685k293J09J523P174n349
8225A9044N016P208J997J413j5395j1915J161L16J449Q937L077l797J0168m689
8211B3990j0598o568R814K1742K635q200q676j3575J6787J6079o682j0653L55
8198B6450j0277n511J3839N155K140j31j748j0523q397L297J5560o97j2384j08
$$ plain form
8184 16665 16305 15804 27833 39130 36636 17987 2261 -3506 644 3098 16316 23853 22478 24121
8170 24121 34522 41804 48083 48784 42622 35778 22253 31417 36986 37536 44883 45551 50242 42745 37978
8155 37978 36963 39966 30393 26781 33443 38333 26170 18623 -803 -4110 -2709 1323 3818 19350
8141 19350 14434 17702 10729 675 -1940 7178 4077 8682 3462 8791 12442 28999 27971 18463
8127 18463 4203 5539 14018 28199 32078 32509 33050 46882 49520 46326 46173 47410 40858 37893 51647
8112 51647 43326 42113 36575 25072 10625 2541 8108 21818 27816 19053 16543 18641 21849 25495
8098 25495 16789 23598 30300 33653 36668 28118 29196 41970 38518 28816 38985 27396 21593 37955
8084 37955 41488 35418 33453 36066 28316 36061 35290 32478 32991 38179 41564 47869 43814 35661 27136
$$ packed form
8184A6665l60n01J2029J1297k494j8649j5726n767M150K454J3218P537j375J643
8170B4121J0401P282O279P01o162o844j3525R164N569N50P347O68M691p497m767
8155C7978j015L003r573l612O662M890j2163p547j9426l307J401M032K495J5532
8141A9350m916L268o973j0054k615R118l101M605n220N329L651J6557j028r508
8127A8463j4260J336Q479J4181L879M31N41J3832K638l194j53J237o552k965J3754
8112E1647q321j213n538j1503j4447q084N567J3710N998q763k510K098L208L646
8098B5495q706O809O702L353L015q550J078J2774l452r702J0169j1589n803J6362
8084C7955L533o070j965K613p750P745p71k812N13N188L385O305m055q153q525
$$ plain form
8069 27136 34415 38830 37724 39154 45492 39336 37115 41761 43803 50568 42191 33129 33208 32067 36194
8054 36194 32287 23803 15597 15478 25575 38850 38735 22056 20906 19818 21467 17361 18832 29289
8040 29289 28728 28436 12144 6951 25756 36534 44444 40245 34851 34048 37709 40382 34804 28874 37948
8025 37948 39923 34758 28781 41207 42481 24426 20983 18043 10042 15702 14415 19268 23713 24256
8011 24256 31940 37843 38934 31521 23364 23824 40374 50972 47608 36955 29397 30103 38071 39457
7997 39457 22620 20453 30438 34233 41130 48002 37824 35154 38815 33025 24658 30403 22343 25244
7983 25244 22984 10251 3797 17372 23688 18753 22819 36126 26406 13761 23181 18978 16850 9858
7969 9858 8879 22237 23985 22793 28730 20171 9968 22511 33362 30282 35883 44285 39689 31733
$$ packed form
8069B7136P279M415j106J430O338o156k221M646K042O765q377r062P9j141M127
8054C6194l907q484q206j19J0097J3275j15j6679j150j088J649m106J471J0457
8040B9289n61k92j6292n193J8805J0778P910m199n394q03L661K673n578n930R074
8025C7948J975n165n977J2426J274j8055l443k940q001N660j287M853M445N43
8011B4256P684N903J091p413q157M60J6550J0598l364j0653p558P06P968J386
7997C9457j6837k167R985L795O897O872j0178k670L661n790q367N745q060K901
7983B5244k260j2733o454J3575O316m935M066J3307r720j2645R420m203k128o992
7969I858r79J3358J748j192N937q559j0203J2543J0851l080N601Q402m596p956
$$ plain form
7955 31733 21714 8952 17664 15660 14515 14850 10975 11015 12233 9788 -3896 -210 -540 -7539 -5527
7940 -5527 -4173 -3557 -7728 -1555 -5555 -10917 -8052 5649 11568 17031 28163 23884 21143 16710 19335
7925 19335 17288 19323 10108 723 1295 -3279 -3962 7200 26400 23654 13643 14648 25170 33069
7911 33069 39095 41330 38763 32392 28570 23160 20982 12542 1501 -1291 -9116 -7283 -2144 7385
7897 7385 21573 15934 20819 29466 40059 34108 28288 29279 24644 31373 29008 19979 24473 32668 19832
7882 19832 -405 -3379 3123 8660 20157 17380 9024 4956 1798 -8394 -13171 -11996 3424 5874
7868 5874 3754 27644 23017 11299 18895 19938 18104 11925 1056 15810 16707 22266 29816 43573
7854 43573 33391 20108 21904 8434 6954 9340 7061 7940 1238 13050 27830 36617 36667 37379
$$ packed form
7955C1733j0019j2762Q712k004j145L35l875M0J218k445j3684L686l30o999K012
7940e527J354O16m171O173m000n362K865J3701N919N463J1132m279k741m433K625
7925A9335k047K035r215r385N72m574o83J1162J9200k746j0011J005J0522P899
7911C3069O026K235k567o371l822n410k178q440j1041k792p825J833N139R529
7897G385J4188n639M885Q647J0593n951n820R91m635O729k365r029M494Q195j2836
7882A9832k0237k974O502N537J1497k777q356m068l158j0192m777J175J5420K450
7868E874k120K3890m627j1718P596J043j834o179j0869J4754Q97N559P550J3757
7854D3573j0182j3283J796j3470j480K386k279Q79o702J1812J4780Q787N0P12
$$ plain form
7840 37379 28917 23436 13823 10919 19170 28091 19170 20609 11267 16544 8794 7266 11632 14381 19966
7825 19966 26588 36035 40874 28314 16991 15994 9351 -2161 12754 20535 12542 23368 32880 22748
7811 22748 12929 7846 3673 17973 31525 37897 34494 29024 35279 44004 48180 38837 29576 22340
7797 22340 29395 24018 31563 29412 24825 20131 23255 26860 20554 15222 12438 10189 17822 16312 19510
7782 19510 20550 26659 25147 27399 21794 12876 10148 4550 -8155 -13837 -3084 5702 -9947 -12582
7768 -12582 -3422 2721 11169 13787 2731 4057 847 6609 4657 11500 8713 6548 15143 14446 3723
7753 3723 -9402 1070 -5183 -2998 -4993 -10453 -5217 -7320 -6095 16240 20426 13038 25102 26576
7739 26576 15386 4008 5214 15033 14421 16038 6110 -2489 -3269 4661 17681 31422 23476 24529
$$ packed form
7840C7379q462n481r613k904Q251Q921q921J439r342N277p750j528M366K749N585
7825A9966O622R447M839j2560j1323r97o643j1512J4915P781p993J0826R512j0132
7811B2748r819n083m173J4300J3552O372l403n470O255Q725M176r343r261p236
7797B2340P055n377P545k151m587m694L124L605o306n332k784k249P633j510L198
7782A9510J040O109j512K252n605q918k728n598j2705n682J0753Q786j5649k635
7768a2582R160O143Q448K618j1056J326l210N762j952O843k787k165Q595o97j0723
7753C723j3125J0472o253K185j995n460N236k103J225K2335M186p388J2064J474
7739B6576j1190j1378J206R819o12J617r928q599p80P930J3020J3741p946J053
$$ plain form
7725 24529 10246 1950 18629 22444 20406 29783 31212 16591 3750 1525 8830 20514 11640
7712 11640 -3175 -8970 9196 14827 21549 19691 5785 -3512 -8441 -11210 -13517 -16020 -7470 -7165
7698 -7165 -5213 -8143 -5181 2382 2120 -13631 -15911 -13318 -11633 -4523 8955 7330 7709 9302 13136
7683 13136 13310 23775 24889 20121 14918 4002 6291 21336 14778 -1080 -16687 -14227 -13382 -6267
7669 -6267 -5213 -19020 -4026 -3667 -4995 1003 4876 2489 -10258 -9151 7920 9556 11356 14191
7655 14191 19592 34038 49837 43550 34314 33859 32926 14111 11750 21659 17821 -4919 -3801 -9967
7641 -9967 -16829 -21016 -25387 -20283 -13166 -1933 10520 10346 15421 14452 12167 27551 38782 15751
7627 15751 1886 -7382 -17466 -10896 3422 4207 -89 3032 3549 3460 -6295 -9988 -920 8551 20707
$$ packed form
7725B4529j4283q296J6679L815k038R377J429j4621j2841k225P305J1684q874
7712A1640j4815n795J8166N631O722j858j3906r297m929k769k307k503Q550L05
7698g165J952k930K962P563k62j5751k280K593J685P110J3478j625L79J593L834
7683A3136J74J0465J114m768n203j0916K289J5045o558j5858j5607K460Q45P115
7669f267J054j3807J4994L59j328N998L873k387j2747J107J7071J636J800K835
7655A4191N401J4446J5799o287r236m55r33j8815k361R909l838k2740J118o166
7641i967o862m187m371N104P117J1233J2453j74N075r69k285J5384J1231k3031
7627A5751j3865r268j0084O570J4318P85m296L121N17q9r755l693R068R471J2156
$$ plain form
7612 20707 30825 22827 21102 32483 25489 11383 13130 11989 13858 10970 4375 -7314 -6141 4375
7598 4375 10621 14465 11273 10355 13341 7823 10425 4898 -1144 -6705 2155 -1073 1104 -8037 -23822
7583 -23822 -15762 -18747 -25013 -10085 5724 10090 21990 24772 15039 5270 1314 8044 9000 -2575
7569 -2575 -1676 9959 1648 -4119 -4003 9509 16539 6135 -5991 -10207 -2585 3340 16885 13941
7555 13941 6876 2188 10734 12304 18324 11757 -5455 -10744 10896 34156 46072 27851 24792
7542 24792 24950 20949 14010 1897 -4189 9387 6825 -4530 -10309 -6694 -6848 -2091 -1713 4554 9028
7527 9028 12331 10612 4248 2448 6734 8827 16745 20850 18462 2190 -13640 -3276 -1883 8920
7513 8920 16987 11321 -4961 -15976 -21566 -7704 7928 3655 -1727 8332 5537 -6311 -9555
$$ packed form
7612B0707J0118p998j725J1381o994j4106J747j141J869k888o595j1689J173J0516
7598D375O246L844l192r18K986n518K602n527o042n561Q860l228K177r141j5785
7583b3822Q060k985o266J4928J5809M366J1900K782r733r769l956O730R56j1575
7569b575Q99J1635q311n767J16J3512P030j0404j2126m216P622N925J3545k944
7555A3941p065m688Q546J570O020o567j7212n289K1640K3260J1916j8221l059
7542B4792J58m001o939j2113o086J3576k562j1355n779L615j54M757L78O267M474
7527I028L303j719o364j800M286K093P918M105k388j6272j5830J0364J393J0803
7513H920Q067n666j6282j1015n590J3862J5632m273n382J0059k795j1848l244
$$ plain form
7500 -9555 -16551 -6709 7264 14121 16173 24522 27305 4572 9842 22795 17320 16477 27025 21218
7486 21218 4987 -1337 4881 494 8204 10677 11057 16568 16410 6598 -5740 2048 13891 10276
7472 10276 -2103 -2824 3561 4920 5677 -2658 6364 14440 18287 21278 16450 8812 6889 6532 20014
7457 20014 24548 14445 5820 12550 4570 5126 -1555 -1906 4139 21274 24492 13782 -3381 -20705
7443 -20705 -19325 -920 -1349 -2038 -7941 -12060 -5867 -8610 -734 15200 18400 12166 5233 -5015
7429 -5015 -8818 -6811 -4209 5972 3582 7032 -553 8840 8053 -3995 -18079 -22549 -121 9083
7415 9083 3660 -9401 -10457 4687 12210 10057 -905 -13019 -12234 -12856 -16123 -10319 1883 7312
7401 7312 11445 5791 -1962 9817 15036 20593 27792 6236 2640 3806 -12726 -11188 -15416 -15938
$$ packed form
7500i555o996R842J3973O857K052Q349K783k2733N270J2953n475q43J0548n807
7486B1218j6231o324O218m387P710K473L80N511j58r812j2338P788J1843l615
7472A0276j2379p21O385J359P57q335R022Q076L847K991m828p638j923l57J3482
7457B0014M534j0103q625O730p980N56o681l51O045J7135L218j0710j7163j7324
7443b0705J380J8405m29o89n903m119O193k743P876J5934L200o234o933j0248
7429e015l803K007K602J0181k390L450p585R393p87j2048j4084m470K2428R204
7415I083n423j3061j056J5144P523k153j0962j2114P85o22l267N804J2202N429
7401G312M133n654p753J1779N219N557P199k1556l596J166j6532J538m228n22
$$ plain form
7387 -15938 -21199 -23787 -15724 -4939 7191 18718 26181 15334 4320 2274 6514 8609 8096 10396
7373 10396 4941 2095 15202 21480 14573 8746 -2562 -13921 -13011 -5215 6162 5598 4772 10353
7359 10353 20222 20107 12128 139 285 4696 -4596 -19195 -20513 -11629 -11077 -9208 -5829 -1529 13942
7344 13942 14722 7143 5765 17001 12358 -1538 52 -197 -308 3824 12363 6630 2953 4180 -1068
7329 -1068 7639 8896 -1553 -6301 7856 2214 -10819 607 485 -3590 -4849 -3120 3133 14366
7315 14366 20486 15795 11095 1378 966 2060 -1755 1485 16766 32680 27493 25348 10793 4361
7301 4361 -7597 -8146 532 6542 5714 7531 2264 -2098 -2271 2916 7655 14503 20340 16229 13210
7286 13210 -2907 -9285 -4313 -7964 3806 25183 23444 17401 14914 4682 4762 8379 12493 23659
$$ packed form
7387a5938n261k588Q063J0785J2130J1527P463j0847j1014k046M240K095n13K300
7373A0396n455k846J3107O278o907n827j1308j1359R10P796J1377n64q26N581
7359A0353R869j15p979j1989J46M411r292j4599j318Q884N52J869L379M300J5471
7344A3942P80p579j378J1236m643j3896J590k49j11M132Q539n733l677J227n248
7329a068Q707J257j0449m748J4157n642j3033J1426j22m075j259J729O253J1233
7315A4366O120m691m700r717m12J094l815L240J5281J5914n187k145j4555o432
7301D361j1958n49Q678O010q28J817n267m362j73N187M739O848N837m111l019
7286A3210j6117o378M972l651J1770K1377j739o043k487j0232Q0L617M114J1166
$$ plain form
7272 23659 24101 25803 20667 -8933 -14530 -8979 -387 6628 18 5271 19173 24574 13513 5875
7258 5875 1673 -7049 -1621 9218 2908 1128 1654 2441 -318 2047 8817 10369 20581 29142 22540
7243 22540 7040 5955 563 8114 2750 420 -492 6203 23918 25361 10584 -3523 -13707 -19521
7229 -19521 -1879 8232 3462 705 10079 13185 1660 -5175 -3597 -14478 781 5540 4294
7216 4294 9397 8533 -1573 3332 6408 7299 -7314 -13013 5857 8500 5098 3636 -4202 6794
7202 6794 34363 28170 15857 2717 4211 8257 -2893 -10618 -10286 -10706 -13841 -14992 -9746 2255
7188 2255 4537 -2097 -3023 -6267 1025 4195 -2536 -4179 -3989 -3599 1236 3462 2619 7633 7508 1740
7172 1740 2481 -2926 -5601 -20296 -18664 5588 17358 11110 -2071 -10386 -6104 4966 5316 5363 7944
$$ packed form
7272B3659M42J702n136k9600n597N551Q592P015o610N253J3902N401j1061p638
7258E875m202q722N428J0839o310j780N26P87k759K365O770J552J0212Q561o602
7243B2540j5500j085n392P551n364k330r12O695J7715J443j4777j4107j0184n814
7229a9521J7642J0111m770k757R374L106j1525o835J578j0881J5259M759j246
7216D294N103q64j0106M905L076Q91j4613n699J8870K643l402j462p838J0996
7202F794K7569o193j2313j3140J494M046j1150p725L32m20l135j151N246J2001
7188B255K282o634r26l244P292L170o731j643J90L90M835K226q43N014j25n768
7172A740P41n407k675j4695J632K4252J1770o248j3181q315M282J1070L50M7K581
$$ plain form
7157 7944 -511 -5290 -1982 3556 5322 7997 5450 10847 9298 2319 11845 13034 6374 11589 7829
7142 7829 3361 11597 19055 18868 13718 4397 -5716 -24284 -20310 -10678 -8295 -1310 -1395 -4884 -8009
7127 -8009 2245 12301 10344 1135 11502 14605 7972 10231 97 9745 7260 3446 3535 7699
7113 7699 9251 814 -1920 569 10889 13956 2178 1626 10349 14885 10879 3639 2425 5598 3036
7098 3036 -1664 8611 18214 20590 2345 6130 12092 1680 627 12188 24867 28726 24177 8037
7084 8037 4268 -9784 -4787 -2745 1705 4239 12183 12611 7904 -6870 -5170 7741 22207 21469
7070 21469 13686 10312 17227 12830 4104 7429 2957 5102 -4604 -10371 -6923 -11899 -5367 8548
7056 8548 8279 8622 7725 -6832 -8752 3077 -3581 -5844 -11699 -8023 6957 14985 13756 15308 2793
$$ packed form
7157G944q455m779L308N538J766K675k547N397j549o979R526J189o660N215l760
7142G829m468Q236P458j87n150r321j0113j8568L974R632K383O985q5l489l125
7127h009J0254J0056j957r209J0367L103o633K259j0134R648k485l814Q9M164
7113G699J552q437k734K489J0320L067j1778n52Q723M536m006p240j214L173k562
7098C036m700J0275R603K376j8245L785N962j0412j053J1561J2679L859m549j6140
7084H037l769j4052M997K042M450K534P944M28m707j4774J700J2911J4466p38
7070B1469p783l374O915m397q726L325m472K145r706n767L448m976O532J3915
7056H548k69L43q97j4557j920J1829o658k263n855L676J4980Q028j229J552j2515
$$ plain form
7041 2793 -7776 1269 14380 8416 7963 19006 21688 26446 18470 21878 13461 14580 1445 -9371
7027 -9371 -9586 -6834 -5965 -4909 -311 5582 12816 17605 31070 29827 15159 3771 3460 7291 8538
7012 8538 13706 15407 17788 -615 -12333 -20782 -5023 2521 3881 8716 21071 22076 15558 8874
6998 8874 9208 6195 5160 17804 23679 12377 3089 -466 -4156 -2714 -4698 -8055 -11322 6198
6984 6198 16907 27334 22254 16534 18180 6597 7094 13385 11171 3430 -3999 -4939 -11959 -12956 -19443
6969 -19443 -18356 -20071 -22106 -24168 -24450 -12145 -14192 -7708 7678 24837 23925 15708 7862 5308
6955 5308 7607 5174 5003 17942 17460 25568 15113 15906 13461 12675 6654 3631 -3897 -4928 -1893
6940 -1893 5632 71 235 9179 11200 4156 7004 13299 26288 15250 1306 1307 -154 -1010 5097
$$ packed form
7041B793j0569R045J3111n964m53J1043K682M758p976L408q417J119j3135j0816
7027i371k15K752Q69J056M598N893P234M789J3465j243j4668j1388l11L831J247
7012H538N168J701K381j8403j1718q449J5759P544J360M835J2355J005o518o684
6998H874L34l013j035J2644N875j1302r288l555l690J442j984l357l267J7520
6984F198J0709J0427n080n720J646j1583M97O291k214p741p429r40p020r97o487
6969a9443J087j715k035k062k82J2305k047O484J5386J7159r12q217p846k554
6955E308K299k433j71J2939m82Q108j0455P93k445p86o021l023p528j031L035
6940a893P525n561J64Q944K021p044K848O295J2989j1038j3944Jj461q56O107
$$ plain form
6925 5097 22481 19372 11110 2246 119 1531 1126 7685 20714 29739 15430 13613 10094 1319
6911 1319 2568 -2391 11732 16097 11809 3526 -2352 2269 2551 -3305 -3255 -6073 -373 7352 6517 18558
6895 18558 29149 26812 22614 16554 10266 20064 32795 39246 38964 31060 14978 2436 -13596 -12961
6881 -12961 -16735 -24232 -27742 -7790 11720 13619 9544 3472 6283 17955 20879 14550 14863 16531
6867 16531 14643 7347 10578 14607 3734 6934 271 9416 26573 32591 23712 -3461 -11566 -2349
6853 -2349 -8135 -10198 -1163 -11769 -26415 -19244 -4270 12873 12165 3873 -4478 -2019 -2173 -7391
6839 -7391 -11017 -8131 -12017 -4423 797 6772 8880 11261 21845 24525 15798 15549 15765 17822 -1590
6824 -1590 -5834 -6335 16314 19888 24521 21501 13736 5512 8609 11012 7234 1629 -4035 3775 4139
$$ packed form
6925E097J7384l109q262q864k127J412m05O559J3029R025j4309j817l519q775
6911A319J249m959J4123M365m288q283n878M621K82n856N0k818N700P725q35J2041
6895A8558J0591k337m198o060o288R798J2731O451k82p904j6082j2542j6032O35
6881a2961l774p497l510J9952J9510J899m075o072K811J1672K924o329L13J668
6867A6531j888p296L231M029j0873L200o663R145J7157O018q879k7173q105R217
6853b349n786k063R035j0606j4646P171J4974J7143p08q292q351K459j54n218
6839g391l626K886l886P594N220N975K108K381J0584K680q727k49K16K057j9412
6824a590m244n01K2649L574M633l020p765q224L097K403l778n605n664P810L64
$$ plain form
6809 4139 956 -2027 -140 -679 12326 9677 -924 -12977 -7758 4511 7315 -11452 -12700 -3353
6795 -3353 549 -5183 1624 9718 -5078 -10666 -5137 1456 -3121 -5634 -2642 -8297 -11185 -9142 -5803
6780 -5803 -6001 -6508 -10528 -17535 -13114 -7418 -254 -721 -2744 16427 31973 26930 27573 20199 21408
6765 21408 10513 70 6275 15319 6895 4251 -1337 -6136 -8510 -8244 -4970 2008 1934 2525 -2256
6750 -2256 -307 7222 3253 4183 16101 4214 -18643 -18373 -10231 8748 12396 6037 197 -3128
6736 -3128 -9138 -9152 -18195 -24566 -14607 -7391 -6658 -4869 -5247 -16799 -28564 -30169 -13118 -6082 -4018
6721 -4018 -10534 -23180 -27643 -23550 -22907 -24344 -19962 -22316 -7323 -11499 -17099 -9195 -9969 -18471 -16642
6706 -16642 -14293 -7927 -14489 -10769 -1139 11060 15052 19808 11581 6246 2831 2436 4985 9342 18927
$$ packed form
6809D139l183k983J887n39J3005k649j0601j2053N219J2269K804j8767j248R347
6795c353L902n732O807Q094j4796n588N529O593m577k513K992n655k888K043L339
6780e803j98n07m020p007M421N696P164m67k023J9171J5546n043O43p374J209
6765B1408j0895j0443O205R044q424k644n588m799k374K66L274O978p4N91m781
6750b256J949P529l969R30J1918j1887k2857K70Q142J8979L648o359n840l325
6736c128o010j4r043o371R959P216P33J789l78j1552j1765j605J7051P036K064
6721d018o516j2646m463M093O43j437M382k354J4993m176n600P904p74q502J829
6706a6642K349O366o562L720R630J2199L992M756q227n335l415l95K549M357R585
$$ plain form
6691 18927 12905 20134 11939 5984 -139 2420 -7079 -2430 11660 2463 -1100 -9971 -7985 -5499
6677 -5499 -12917 -24023 -30050 -23150 -13089 -4683 5343 9052 9259 -3827 -7804 -11389 50 17487
6663 17487 24921 49123 61495 65720 65987 48592 35650 33785 36357 21248 16452 17177 9637 -19518
6649 -19518 -27437 -27481 -24966 -21308 -9806 -18913 -24960 -18912 -20325 -12573 -17818 -20707 -4265 -593 -3013
6634 -3013 -5330 -6344 -5647 -18685 -7758 -797 -3986 973 6585 7978 6913 2265 -10182 10556
6620 10556 15475 -584 -10834 23 8621 20484 11151 14624 19860 10429 -3784 -12977 -2383
6607 -2383 7649 13334 16671 10453 6907 3520 5102 5589 1166 8550 25212 20009 7293 5525
6593 5525 -9684 -10374 9182 21269 3359 3864 5918 15572 6830 -6950 -9266 -4467 1929 2250
$$ packed form
6691A8927o022P229q195n955o123K559r499M649J4090r197l563q871J986K486
6677e499p418j1106o027O900J0061Q406J0026L709K07j3086l977l585J1439J7437
6663A7487P434K4202J2372M225K67j7395j2942j865K572j5109m796P25p540k9155
6649a9518p919m4K515L658J1502r107o047O048j413P752n245k889J6442L672k420
6634c013k317j014O97j3038J0927O961l189M959N612J393j065m648j2447K0738
6620A0556M919j6059j0250J0857Q598J1863r333L473N236r431j4213r193J0594
6607b383J0032N685L337o218l546l387J582M87m423P384J6662n203j2716j768
6593E525j5209o90J9556J2087j7910N05K054R654q742j3780k316M799O396L21
$$ plain form
6579 2250 11237 3702 -7868 -13953 -7795 2042 6475 1418 1745 8247 13828 16331 4996 4191 -2478
6564 -2478 796 4066 7707 8586 464 3796 7995 8475 4345 -7997 -9407 -2419 -1312 1274 -1072
6549 -1072 6285 4272 2409 7952 24763 26730 30196 15260 139 -8298 -3536 -406 7149 6782
6535 6782 11772 -5926 -16005 -2581 -1067 -566 2348 11388 5410 -1819 1783 9943 11246 6421
6521 6421 555 -6489 -7242 -11193 -4203 -19824 -23249 -9776 -11111 -7519 16219 27192 29006 16694
6507 16694 8556 8474 18379 20899 4087 -9686 -5524 -9933 -17307 -20108 -10035 -2025 -4884 -133
6493 -133 -3469 -5691 -2870 -3432 -14165 -20796 -15190 -8300 2427 21665 25670 18639 14199 -1763
6479 -1763 -9150 -15113 -11488 -9866 -16336 -20490 -7588 -3580 -5373 7596 16292 10316 -1464 -819
$$ packed form
6579B250Q987p535j1570o085O158R837M433n057L27O502N581K503j1335q05o669
6564b478L274L270L641Q79q122L332M199M80m130j2342j410O988J107K586k346
6549a072P357k013j863N543J6811J967L466j4936j5121q437M762L130P555l67
6535F782M990j7698j0079J3424J514N01K914R040n978p229L602Q160J303m825
6521F421n866p044p53l951O990j5621l425J3473j335L592K3738J0973J814j2312
6507A6694q138q2R905K520j6812j3773M162m409p374k801J0073Q010k859M751
6493a33l336k222K821n62j0733o631N606O890J0727J9238M005p031m440j5962
6479a763p387n963L625J622o470m154J2902M008j793J2969Q696n976j1780O45
$$ plain form
6465 -819 -1198 -4141 -10981 -5582 5941 15170 10974 9369 10738 4571 8651 16935 8007 4723 4223
6450 4223 4811 11263 9446 25036 23568 14911 -222 -8829 -8989 -6082 -2552 7056 11027 5808 5607
6435 5607 5846 4062 6072 1997 8912 1968 -8729 -16863 -17140 -22738 -16537 -15754 -13775 -7645 -4065
6420 -4065 101 -7684 -12801 -3324 786 8076 22742 10658 -2865 11753 14346 2866 -4397 -4448
6406 -4448 -5797 -12046 -8982 -5482 -9438 -21194 -25420 -20850 -2604 780 -264 -2985 286 -3849
6392 -3849 -12320 994 15258 3974 793 9989 20862 7572 -8250 1025 5541 4309 -1875
6379 -1875 -15206 -9794 -11669 -5586 -7033 -5859 4923 17751 16610 10210 4783 -10853 -12783 -8150
6365 -8150 -2458 -2918 3038 -10172 -7072 -2884 -2859 5585 7533 7249 17689 25892 31658 28729 24969
$$ packed form
6465h19l79k943o840N399J1523R229m196j605J369o167M080Q284q928l284n00
6450D223N88O452j817J5590j468q657j5133q607j60K907L530R608L971n219k01
6435E607K39j784K010m075O915o944j0697q134k77n598O201P83J979O130L580
6420d065M166p785n117R477M110P290J4666j2084j3523J4618K593j1480p263n1
6406d448j349o249L064L500l956j1756m226M570J8246L384j044k721L271m135
6392c849q471J3314J4264j1284l181R196J0873j3290j5822R275M516j232o184
6379a875j3331N412j875O083j447J174J0782J2828j141o400n427j5636j930M633
6365h150N692m60N956j3210L100M188K5Q444J948k84J0440Q203N766k929l760
$$ plain form
6350 24969 13936 677 -2111 69 -11480 -23109 -15312 -12913 -11230 -2173 -3426 4094 -2539 77
6336 77 -4562 -11969 -7962 790 2672 14392 15343 9223 6276 -8672 -9695 -11649 -14322 -637 -9560
6321 -9560 -8111 6863 11920 3231 -6980 -7459 -2093 -3716 -10206 -12892 -7412 -4722 -1756 -5887 -5869
6306 -5869 -5384 -12475 -22399 -32414 -23056 -16632 5148 16357 7682 1306 -5236 6364 13423 4955
6292 4955 1577 3549 7655 3889 -3564 -13136 -16616 -10392 -20548 -31489 -22811 -18291 -13806 -13892 -4490
6277 -4490 -2377 3853 9433 17783 22470 22981 2691 -14507 -16990 -7146 -10044 -11330 -2433 1869 1307
6262 1307 -11897 -25317 -25503 -4052 6523 1463 7214 7088 3440 4974 16782 13563 878 -4844
6248 -4844 -6884 -20888 -17129 -12027 -1017 -995 7431 10515 20818 10906 -2679 16780 37069 36002
$$ packed form
6350B4969j1033j3259k788K180j1549j1629P797K399J683R057j253P520o633K616
6336G7m639p407M007Q752J882J1720R51o120k947j4948j023j954k673J3685q923
6321i560J449J4974N057q689j0211m79N366j623o490k686N480K690K966m131J8
6306e869M85p091r924j0015R358O424K1780J1209q675o376o542J1600P059q468
6292D955l378J972M106l766p453r572l480O224j0156j0941Q678M520M485q6R402
6277d490K113O230N580Q350M687N11k0290j7198k483R844k898j286Q897M302n62
6262A307j3204j3420j86K1451J0575n060N751j26l648J534J1808l219j2685n722
6248d844k040j4004L759N102J1010K2Q426L084J0303r912j3585J9459K0289j067
$$ plain form
6234 36002 24027 12669 1317 35 8886 4077 -2437 -18699 -16851 -8343 -16660 -22754 -27650 -31123
6220 -31123 -17083 -5541 -2771 5838 8310 5587 12186 29145 24498 15282 8508 10705 12465 17355
6206 17355 20791 20890 15694 978 -12248 -8557 -3142 9291 6424 12372 20718 16172 23786 18189
6192 18189 6642 -7528 -5826 -7066 9455 17743 10246 -8894 -20804 -25728 -27000 -18835 -9706
6179 -9706 -7209 -10964 3829 12637 13054 7760 -6524 -6018 -4462 987 763 -1031 -2539 -802 1645
6164 1645 10867 1811 2174 -1710 -6108 -9683 -6563 5882 18575 22171 31685 32349 20692 15977 16904
6149 16904 18012 23701 13082 2745 -8859 -2699 10623 10164 6326 24622 26912 11895 6647
6136 6647 13120 15012 10586 10932 11660 11658 7971 2584 7597 11884 8636 5788 11319 11271 9342 4736 4364
$$ packed form
6234C6002j1975j1358j1352j282Q851m809o514j6262J848Q508q317o094m896l473
6220c1123J4040J1542K770Q609K472k723O599J6959m647r216o774K197J760M890
6206A7355L436R9n196j4716j3226L691N415J2433k867N948Q346m546P614n597
6192A8189j1547j4170J702j240J6521Q288p497j9140j1910m924j272Q165R129
6179i706K497l755J4793Q808M17n294j4284N06J556N449k24j794j508J737K447
6164A645R222r056L63l884m398l575L120J2445J2693L596R514O64j1657m715R27
6149A6904J108N689j0619j0337j1604O160J3322m59l838J8296K290j5017n248
6136F647O473J892m426L46P28kl687n387N013M287l248k848N531m8j929m606l72
$$ plain form
6119 4364 4998 -16746 -21370 -9778 -10299 -3626 -8443 871 10794 15261 -2290 -15732 -20969 -15634
6105 -15634 -9905 -4295 -3891 -7458 2533 11891 19569 153 -8356 -241 -4420 -7273 -7224 -15062 -20974
6090 -20974 -21766 -26187 -13921 -7328 -3233 -1342 -6580 1500 -1522 -7020 -3124 -2369 -20690 -28703 -25065
6075 -25065 -17815 -17798 -30542 -29965 -22586 -14138 4398 4898 -2452 1394 -4148 3638 1574 -2841 -7663
6060 -7663 -9832 -10431 -11334 -14559 -19539 -18667 -16307 -6228 278 -1455 -1260 -5241 -3028 160 5141 -4522
6044 -4522 -13380 -3106 5007 6748 9131 13536 11527 8158 6863 19512 9584 18389 18084 7565
6030 7565 2261 5547 2268 3419 3504 -7270 -1134 -9491 -12119 -6782 -608 8066 7308 -809 -7180
6015 -7180 2811 -2046 -24370 -22730 -14067 5214 21110 17364 14432 1376 -12990 -4876 4990 3556
$$ packed form
6119D364O34k1744m624J1592n21O673m817R314R923M467j7551j3442n237N335
6105a5634N729N610M04l567R991R358P678j9416q509Q115m179k853M9p838n912
6090b0974p92m421J2266O593M095J891n238Q080l022n498L896P55j8321q013L638
6075b5065P250J7j2744N77P379Q448J8536N00p350L846n542P786k064m415m822
6060g663k169n99r03l225m980Q72K360J0079O506j733J95l981K213L188M981r663
6044d522q858J0274Q113J741K383M405k009l369j295J2649r928Q805l05j0519
6030G565n304L286l279J151Q5j0774O136q357k628N337O174Q674p58q117o371
6015g180R991m857k2324J640Q663J9281J5896l746k932j3056j4366Q114R866j434
$$ plain form
6001 3556 -8732 -14735 -9465 -17253 -17544 -10587 -11107 -2016 7298 11306 14081 23565 24362 8025 3364
5986 3364 15202 14701 7782 2738 -1079 2011 -829 -10725 -15919 -6031 6600 -835 -5270 -11792 -1640
5971 -1640 -8913 -8976 -7933 -7044 4849 -2514 -3258 9095 14749 3412 -5936 -13108 -10050 -2512 2546
5956 2546 -518 4698 16928 20481 14379 8672 3938 -4000 14521 14629 14731 16813 15415 17138 15036
5941 15036 18640 15743 1254 3309 3429 -12203 -33948 -38922 -13414 -4634 -6472 -11982 -14460 -16591
5927 -16591 -8845 -449 3592 -5991 -7589 -12613 -2418 13925 17598 13343 -1940 -13942 -20861 -26774
5913 -26774 -25483 -15165 -7078 -3869 -2111 1946 -19100 -39923 -31096 -24327 -25283 -32407 -36790 -30822
5899 -30822 -23283 -27273 -25834 -19970 -11768 -12685 -28957 -26812 -4186 7926 -8371 -7545 -16589 -17168
$$ packed form
6001C556j2288o003N270p788k91O957n20R091R314M008K775R484P97j6337m661
5986C364J1838n01o919n044l817L090k840r896n194R888J2631p435m435o522J0152
5971a640p273o3J043Q89J1893p363p44J2353N654j1337r348p172L058P538N058
5956B546l064N216J2230L553o102n707m734p938J8521J08J02K082j398J723k102
5941A5036L604k897j4489K055J20j5632k1745m974K5508Q780j838n510k478k131
5927a6591P746Q396M041r583j598n024J0195J6343L673m255j5283j2002o919n913
5913b6774J291J0318Q087L209J758M057k1046k0823Q827O769r56p124m383N968
5899c0822P539l990J439N864Q202r17j6272K145K2626J2112j6297Q26r044n79
$$ plain form
5885 -17168 2148 -3813 -9741 -1489 7138 5647 2563 -6154 -4052 -4876 -10323 -13677 -13535 -9642 -4806
5870 -4806 1002 9605 4199 7669 7083 4602 5726 -1433 -6577 -5110 -1028 -3323 -13992 -5629 -9330
5855 -9330 709 13581 16252 1094 871 -8114 -20388 -14967 -13318 -7493 6633 8063 11147 7752
5841 7752 -6467 -12431 -13690 -10557 -8465 -29711 -23450 -15655 -8516 6806 1950 -10258 -9092 8759
5827 8759 16994 21047 21729 7279 -8493 -10236 -12732 -7380 -8611 -11836 -16223 -16611 -8041 4010 5103
5812 5103 9947 9332 7132 1526 1307 6190 1376 5360 8107 8647 11473 11792 10226 -96 -4414 -3065
5796 -3065 -13877 -10415 -5778 -2368 617 3809 6718 15527 18437 23860 24756 22327 19438 14459 5824
5781 5824 -3127 -10333 3544 3564 2538 -153 -7822 -10375 -9907 -9030 -11925 -17665 -8199 -3787 -776 -6277
$$ packed form
5885a7168J9316n961n928Q252Q627j491l084q717K102q24n447l354J42L893M836
5870d806N808Q603n406L470n86k481J124p159n144J467M082k295j0669Q363l701
5855i330J0039J2872K671j5158k23q985j2274N421J649N825J4126J430L084l395
5841G752j4219n964j259L133K092k1246O261P795P139J5322m856j2208J166J7851
5827H759Q235M053O82j4450j5772j743k496N352j231l225m387l88Q570J2051J093
5812E103M844o15k200n606k19M883m814L984K747N40K826L19j566j0322m318J349
5796c065j0812L462M637L410K985L192K909Q809K910N423Q96k429k889m979q635
5781E824q951p206J3877K0j026k691p669k553M68Q77k895n740R466M412L011n501
$$ plain form
5765 -6277 -16482 -7182 -2006 -11497 -24546 -27722 -23940 -14758 -17366 -18705 -17311 -18258 -8634 1459
5751 1459 -2282 6041 5384 3766 1746 -11341 -10140 -7485 -3489 5154 12774 24328 20929 17723 18708
5736 18708 7802 5395 12529 11729 19706 1435 3092 -1310 -21237 -11563 9186 11567 3498 -718
5722 -718 -1906 6486 18863 15868 4815 -2374 -930 6398 7302 8585 5541 9588 21 -22 1810
5707 1810 -4657 -13660 -8132 -4677 -4484 5896 5342 -4955 -10078 -13259 -4298 -956 -114 -5370 -3768
5692 -3768 240 -1459 -716 1526 11068 1057 -2207 6829 -5800 -3078 -1599 -4290 1837 3994 16329
5677 16329 17612 -2619 -26245 -25814 -15045 -9167 -976 11999 8607 -10218 -11400 -2681 -17668
5664 -17668 -230 7639 13143 27971 32998 21937 4208 -4047 1882 7773 9939 1415 4883 5385
$$ packed form
5765f277j0205R300N176r491j3049l176L782R182k608j339J394r47R624J0093
5751A459l741Q323o57j618k020j3087J201K655L996Q643P620J1554l399l206R85
5736A8708j0906k407P134q00P977j8271J657m402j9927R674K0749K381q069m216
5722g18j188Q392J2377k995j1053p189J444P328R04J283l044M047r567m3J832
5707A810o467r003N528L455J93J0380n54j0297n123l181Q961L342Q42n256J602
5692c768M008j699P43K242R542j0011l264R036j2629K722J479k691O127K157J2335
5677A6329J283k0231k3626M31J0769N878Q191J2975l392j8825j182Q719j4987
5664a7668J7438P869N504J4828N027j1061j7729q255N929N891K166q524L468N02
$$ plain form
5650 5385 6137 922 3240 -1187 11056 19248 5021 -4142 2830 15116 9024 9998 15980 6420 -671
5635 -671 2475 2021 -4707 -12255 -1034 9871 7901 24831 35978 22065 9249 8860 1024 -2263
5621 -2263 3865 6257 -6698 -1085 2594 -11966 -17738 -15994 -17391 -1861 15814 8592 -7273 1147
5607 1147 11136 6538 6587 11816 474 -2939 -10004 -16385 -14113 -11108 -9800 -11802 -4211 -1959 2505
5592 2505 16874 9757 13422 28880 32398 26917 14628 -319 -10031 958 11422 11969 3585 -2601
5578 -2601 -7038 -4702 -14679 -15523 -14800 -21332 -21376 -19199 -9012 -3220 -2699 -7155 -15903 -15791 -10212 5275
5562 5275 1009 -13939 -11689 -13758 -12687 -10486 1274 8007 -1164 -9668 -7460 5327 5833 8113
5548 8113 15509 27936 2543 -3720 9244 8454 9194 14036 16737 13950 3215 6268 15143 10494
$$ packed form
5650E385P52n215K318m427J2243Q192j4227r163O972J2286o092R74N982r560p091
5635f71L146m54o728p548J1221J0905j970J6930J1147j3913j2816l89p836l287
5621b263O128K392j2955N613L679j4560n772J744j397J5530J7675p222j5865Q420
5607A147R989m598M9N229j1342l413p065o381K272L005J308k002P591K252M464
5592B505J4369p117L665J5458L518n481j2289j4947r712J0989J0464N47q384o186
5578b601m437K336r977q44P23o532m4K177J0187N792N21m456q748J12N579J5487
5562E275m266j4948K250k069J071K201J1760O733r171q504K208J2787N06K280
5548H113P396J2427k5393o263J2964p90P40M842K701k787j0735L053Q875m649
$$ plain form
5534 10494 6436 2959 12657 29855 25788 14992 4977 961 2797 4002 14623 13800 2136 -7198
5520 -7198 -285 9501 16406 8809 13089 2518 -2453 -16681 -21288 -16483 -14314 -16101 -9421 -3380
5506 -3380 -13184 -4504 3236 8899 11252 10342 12543 -454 -3467 -4155 -6109 3962 8310 -3479 -9357
5491 -9357 -8327 -2257 -932 -7064 -1991 2145 7385 10143 1652 11184 11442 2925 4690 6795 -3106
5476 -3106 3292 -7556 -10930 -17559 -30384 -46643 -39764 -23786 -17919 -4868 4136 11002 -2298
5463 -2298 840 7125 6002 -229 -12118 -25549 -31643 -30379 -17741 -3858 2309 11808 15281 14276
5449 14276 -309 -26812 -16270 -174 10349 1806 5148 1257 -11884 -13055 4634 6433 9038
5436 9038 15096 15985 14573 12193 5761 -7148 -807 9062 14021 12122 10522 -3692 -9813 -8692 -11126
$$ packed form
5534A0494m058l477R698J7198m067j0796j0015m016J836J205J0621q23j1664r334
5520g198O913R786O905p597M280j0571m971j4228m607M805K169j787O680O041
5506c380r804Q680P740N663K353r10K201j2997l013o88j954J0071M348j1789n878
5491i357J030O070J325o132N073M136N240K758q491R532K58q517J765K105r901
5476c106O398j0848l374o629j2825j6259O879J5978N867J3051R004O866j3300
5463b298L138O285j123o231j1889j3431o094J264J2638J3883O167R499L473j005
5449A4276j4585k6503J0542J6096J0523q543L342l891j3141j171J7689J799K605
5436I038O058Q89j412k380o432j2909O341R869M959j899j600j4214o121J121k434
$$ plain form
5421 -11126 -13562 -13548 -19450 -18079 -9434 -12213 -17046 -22056 -19617 -6094 -5319 -1162 -761 -1411 -5758 522
5405 522 -7313 -16427 -2928 22627 25706 18049 9835 -6598 -18852 -19802 -14979 -11197 -3789 -13942
5391 -13942 -20398 -21673 -9063 -2811 -9531 -18547 -19137 -16508 -25223 -14140 -3379 -8769 -10855 -5606
5377 -5606 -5130 -474 4443 16967 22210 8002 -18232 -15923 -19503 -5258 474 -5634 -3877 -4521
5363 -4521 822 8471 23315 18667 14065 14724 18151 10679 49 5131 14787 16978 10624 6539 5087
5348 5087 1367 -165 3047 -19070 -29260 -20977 -12075 838 14773 20371 27203 19008 3159 19867
5334 19867 16658 13705 15507 27146 27574 18670 8733 15253 -1717 -16503 -9949 -4955 -2011 -9683
5320 -9683 -8702 -3355 703 6773 15858 21895 23933 11464 9905 10494 -5789 -12486 -5707 1796 7845
$$ packed form
5421a1126k436J4n902J371Q645k779m833n010K439J3523P75M157M01o50m347O280
5405E22p835r114J3499K5555L079p657q214j6433j2254r50M823L782P408j0153
5391a3942o456j275J2610O252o720r016n90K629q715J1083J0761n390k086N249
5377e606M76M656M917J2524N243j4208k6234K309l580J4245N732o108J757o44
5363d521N343P649J4844m648m602O59L427p472j0630N082R656K191o354m085j452
5348E087l720j532L212k2117j0190Q283Q902J2913J3935N598O832q195j5849J6708
5334A9867l209k953J802J1639M28q904r937O520j6970j4786O554M994K944p672
5320i683R81N347M058O070R085O037K038j2469j559N89j6283o697O779P503O049
$$ plain form
5305 7845 -2613 -10532 -9604 -10333 -7923 -29712 -36484 -32775 -36163 -21060 -4702 12926 20397 23543
5291 23543 15958 6881 -830 -911 5815 11009 4154 4015 1340 7582 11734 11759 -1227 -7365 -9647 -8044
5275 -8044 -6544 1546 5441 -8713 -11108 8259 549 844 22502 14365 -5264 -14414 -13447 -5037
5261 -5037 1293 3825 7219 11279 12726 9406 3827 3412 10370 16534 18882 10974 16284 23435 18298
5246 18298 -8577 -15574 -7434 5120 6868 3902 10488 10624 13915 18637 16384 24380 20392 5335
5232 5335 -5582 -11176 -2986 5791 18544 19939 7630 -6650 -7143 7492 -1857 -14493 -21800 -20469
5218 -20469 -13159 -7534 6700 14717 3978 -10714 -1677 -5266 -12265 -4445 -1768 -3229 3025 -4710
5204 -4710 -8321 -7913 8372 8168 8708 7529 -9206 -12498 -5615 -16002 -6544 -942 1470 -698 -4217
$$ packed form
5305G845j0458p919R28p29K410k1789o772L709l388J5103J6358J7628P471L146
5291B3543p585r077p711q1O726N194o855j39k675O242M152K5j2986o138k282J603
5275h044J500Q090L895j4154k395J9367p710K95K1658q137j9629r150R67Q410
5261e037O330K532L394M060J447l320n579m15O958O164K348p908N310P151n137
5246A8298k6875o997Q140J2554J748k966O586J36L291M722k253P996l988j5057
5232E335j0917n594Q190Q777J2753J395j2309j4280m93J4635r349j2636p307J331
5218b0469P310N625J4234Q017j0739j4692R037l589o999P820K677j461O254p735
5204d710l611M08J6285k04N40j179j6735l292O883j0387R458N602K412k168l519
$$ plain form
5189 -4217 -1051 5499 13171 8185 13574 22725 8827 -1182 -10865 -8125 -12027 -6680 -6143 -8499 -3700
5174 -3700 -1222 6405 13764 30438 37833 22217 -2337 -5737 -1251 779 -6248 -10705 -13202 -13452
5160 -13452 -14252 -8121 -18118 -24372 -20969 -17185 -17193 -20967 -7915 5223 3754 -7941 -9183 -2068 6474
5145 6474 -387 6890 14019 171 -9870 -12215 -8380 1618 4552 -5457 -14485 -12819 -8153 -15340
5131 -15340 1831 8588 -222 -9813 1764 11131 16039 16839 20406 10742 12630 5474 3385 9928
5117 9928 13059 -3499 -4692 -356 418 -664 -2247 3067 1881 -1563 281 7091 1880 11700 28433
5102 28433 27645 18272 9944 11239 10157 7329 -1711 7377 8363 -776 10524 18665 18835 22430 19423
5087 19423 -7601 -11285 -6395 -10096 -15300 -21801 -23526 -29651 -23391 -14429 -2820 -4722 784 8229
$$ packed form
5189d217L166O550P672m986N389R151j3898j0009r683K740l902N347N37k356M799
5174c700K478P627P359J6674P395j5616k4554l400M486K030p027m457k497k50
5160a3452q00O131r997o254L403L784ql774J3052J3138j469j1695j242P115Q542
5145F474o861P277P129j3848j0041k345L835R998K934j0009r028J666M666p187
5131a5340J7171O757q810r591J1577R367M908Q00L567r664J888p156k089O543
5117I928L131j6558j193M336P74j082j583N314j186l444J844O810n211R820J6733
5102B8433p88r373q328J295j082k828r040R088R86r139J1300Q141J70L595l007
5087A9423k7024l684M890l701n204o501j725o125O260Q962J1609j902N506P445
$$ plain form
5073 8229 11569 4316 9527 11469 12363 21050 10784 -754 -8695 -1560 -973 4059 5777 10368 10109
5058 10109 11236 16977 13298 4924 3533 6354 15476 20768 26267 44382 29800 -1953 -18478 -17599
5044 -17599 -18734 -28638 -21452 -7471 -192 7802 6123 12340 5851 -1922 -2423 -6952 -8584 2720
5030 2720 7927 1412 -13319 -14246 6132 14731 9709 3414 -5604 -17931 -27129 -20456 5159 15653
5016 15653 12856 12536 17382 13079 6726 -7011 -11376 -4800 -7243 -4037 1076 10673 11595 14058 6555
5001 6555 6232 9366 14498 23659 23131 5056 -14896 -13934 -8721 -14974 -21658 -18456 -3358 -6772 -10544
4986 -10544 -6312 -1415 1800 -937 -7156 -8945 -9141 680 4200 -3571 -9123 -14051 -8980 -4920 -6031
4971 -6031 5688 7878 13210 9772 4329 -10258 -8028 -4291 -8337 -764 -1798 -11314 -12663 -13593 -19879
$$ packed form
5073H229L340p253N211J942Q94Q687j0266j1538p941P135N87N032J718M591k59
5058A0109J127N741l679q374j391K821R122N292N499J8115j4582l1753j6525Q79
5044a7599j135r904P186J3981P279P994j679O217o489p773n01m529j632J1304
5030B720N207o515j4731r27K0378Q599n022o295r018j2327r198O673K5615J0494
5016A5653k797l20M846m303o353j3737m365O576k443L206N113R597R22K463p503
5001F555l23L134N132R161n28j8075j9952R62N213o253o684L202J5098l414l772
4986a0544M232M897L215k737o219j789j96R821L520p771n552m928N071M060j111
4971f031J1719K190N332l438n443j4587K230L737m046P573j034r516j349r30o286
$$ plain form
4956 -19879 -19249 -7473 -13559 -19100 -13463 3807 13526 2658 -1303 6044 11082 9107 5051 -5548
4942 -5548 2910 -3060 -5541 -5010 3031 4251 -2570 -1571 -12486 -11049 5115 15102 8769 615 -16337
4927 -16337 -9726 -1478 -2515 -5714 -4922 -2831 107 -8973 -10165 -9454 -8807 -16586 -6865 6200 -5040
4912 -5040 -3085 -12704 -17855 -4531 4840 8272 -10572 -12340 1347 837 9696 14949 12312 22728
4898 22728 19149 4597 6476 17777 29276 19892 1102 -7502 -11880 3219 4001 -641 -5755 -10396
4884 -10396 -2491 -7395 -1960 770 2625 6725 14448 3963 -13917 -3179 1978 5458 7825 11382
4870 11382 12683 14354 2891 -1025 5701 1190 -1040 1410 -1431 -7746 1780 830 4826 5875 -5672
4855 -5672 -3855 3287 7429 8425 10149 7296 2696 -9856 18 7482 8140 1620 -4517 -8486 -19360
$$ packed form
4956a9879O30J1776o086n541N637J7270R719j0868l961P347N038j975m056j0599
4942e548Q458n970k481N31Q041J220o821R99j0915J437J6164R987o333q154j6952
4927a6337O611Q248j037l199P92K091K938r080j192P11O47p779R721J3065j1240
4912e040J955r619n151J3324R371L432j8844j768J3687n10Q859N253k637J0416
4898B2728l579j4552J879J1301J1499r384j8790q604m378J5099P82m642n114m641
4884a0396P905m904N435K730J855M100P723j0485j7880J0738N157L480K367L557
4870A1382J301J671j1463l916O726m511k230K450k841o315R526r50L996J049j1547
4855e672J817P142M142R96J724k853m600j2552R874P464O58o520o137l969j0874
$$ plain form
4840 -19360 -13864 -5718 -6977 -8797 -9224 -16806 -11507 -6533 -9343 -11154 -8611 -14410 -16519 -20925 -17921
4825 -17921 -11209 -5526 -8276 -8893 -17651 -22545 -13788 -5023 -6195 -3797 -2448 -776 765 -466 -1891
4810 -1891 -6126 -8728 -5673 2147 14316 19832 17842 8084 -16222 -21724 -17632 -11061 4055 8344
4796 8344 -5420 -8778 -10598 -8997 -9861 -13925 -13335 -12972 -11704 -7212 -5632 -2005 -5599 -15620 -14969
4781 -14969 -14858 4059 14163 -1197 -6555 3796 3729 2397 4867 934 2918 3902 550 6159 21532
4766 21532 21682 12476 11918 9453 2540 9820 4275 -12972 -7973 -4017 -2359 4030 26712 21414 4997
4751 4997 2791 -4229 -18587 -23488 -19443 -7984 -4495 -270 -12664 -31161 -27196 -22687 -7565 -2678
4737 -2678 -5104 2144 -437 -2495 4779 5928 7780 16679 12367 13872 -2629 -4473 11928 13404
$$ packed form
4840a9360N496Q146j259j820m27p582N299M974k810j811K543n799k109m406L004
4825a7921O712N683k750o17q758m894Q757Q765j172K398J349J672J541j231j425
4810a891m235k602L055P820J2169N516j990r758k4306n502M092O571J5116M289
4796H344j3764l358j820J601q64m064N90L63J268M492J580L627l594j0021O51
4781a4969J11J8917J0104j5360n358J0351o7j332K470l933J984R84l352N609J5373
4766B1532J50r206n58k465o913P280n545j7247M999L956J658O389K2682n298j6417
4751D997k206p020j4358m901M045J1459L489M225j2394j8497L965M509J5122M887
4737b678k426P248k581k058P274J149J852Q899m312J505j6501j844J6401J476
$$ plain form
4723 13404 7429 -677 -2832 9025 30974 27131 26314 23945 15462 7843 376 1595 14154 14937
4709 14937 -3781 -14055 -19596 -7228 11131 6505 -12125 -14059 -6524 -4451 -3539 -1506 7997 -376
4695 -376 -7681 -7907 -15749 -11410 -6750 -9668 -14565 -6128 -91 -8036 -5287 8568 17304 19379 14832
4680 14832 -3404 -10594 -5004 2001 13927 14533 1968 14163 26270 29821 15575 13450 11553
4667 11553 3447 6003 11520 16257 14377 30898 29876 22323 21260 13582 8672 -7852 3638 9111
4653 9111 9642 5858 3120 -1303 -13002 -23116 -27927 -11356 -6849 -14790 -20084 -29176 -15432 -7675
4639 -7675 -18398 -10761 1644 -10299 -21785 -15271 -5193 -506 3248 5364 4726 -4609 -3633 -2282
4625 -2282 -11077 -11504 -8200 -16078 -22643 -21714 -27480 -16375 -8379 -6048 -2373 -6611 -1077 -2498 -5520
$$ packed form
4723A3404n975q106k155J1857K1949l843q17k369q483p619p467J219J2559P83
4709A4937j8718j0274n541J2368J8359m626j8630j934P535K073R12K033R503q373
4695c76p305k26p842M339M660k918m897Q437O037p945K749J3855Q736K075m547
4680A4832j8236p190N590P005J1926O06j2565J2195J2107L551j4246k125j897
4667A1553q106K556N517M737j880J6521j022p553j063p678m910j6524J1490N473
4653I111N31l784k738m423j1699j0114m811J6571M507p941n294r092J3744P757
4639g675j0723P637J2405j1943j1486O514J0078M687L754K116o38r335R76J351
4625b282q795m27L304p878o565R29n766J1105P996K331L675m238N534j421l022
$$ plain form
4610 -5520 -3466 4582 10487 17335 34639 28061 13945 342 -9817 -11126 -3675 5848 10553 8834
4596 8834 16282 7733 -6773 -7463 5859 -2458 -3385 -3275 207 6256 9861 -5312 -20078 634
4582 634 17376 18472 15475 1839 -9389 -10112 -4120 3044 9752 12299 1100 -7357 4403 5007
4568 5007 -7957 -22115 -27312 -21022 -15506 734 1730 16014 9157 6522 13587 20914 11394 6359
4554 6359 10048 12365 14960 -753 -3577 -5693 -2374 1438 18656 9255 4186 18644 8441 -376
4540 -376 -6772 -4700 -5051 -6841 -13609 -15962 -7392 423 682 -8326 -16936 -10549 3133 3403 -13090
4525 -13090 647 10745 6142 -8486 -13365 -9555 -8986 -14682 -6552 3097 -10629 -15792 -2149 10797
4511 10797 12761 10671 143 -4808 -3520 10699 604 -280 -5055 -15175 -4698 14208 29030
$$ packed form
4610e520K054Q048N905O848J7304o578j4116j3603j0159j309P451R523M705j719
4596H834P448q549j4506o90J3322q317r27J10L482O049L605j5173j4766K0712
4582F34J6742J096k997j3636j1228p23N992P164O708K547j1199q457J1760O04
4568E007j2964j4158n197O290N516J6240R96J4284o857k635P065P327r520n035
4554F359L689K317K595j5713k824k116L319L812J7218r401n069J4458j0203q817
4540c76o396K072l51j790o768k353Q570P815K59r008q610O387J3682K70j6493
4525a3090J3737J0098m603j4628m879L810N69n696Q130R649j3726n163J3643J2946
4511A0797J964k090j0528m951J288J4219j0095q84m775j0120J0477J8906J4822
$$ plain form
4498 29030 34723 26669 14378 3112 -8006 -7944 -4667 -284 11413 28414 29405 19942 -2056 4348
4484 4348 8755 -799 -8642 -10789 4181 20437 28791 27243 25153 9098 -2519 561 8178 11847
4470 11847 10449 1767 -4277 5232 13121 17731 12130 11188 9231 -7610 -22133 -25679 -28639 -22026
4456 -22026 -7124 4545 203 3418 -2978 5003 15616 3549 -2453 -7470 2359 -4878 1262 -2251
4442 -2251 -19988 -17709 -13126 -3441 -4504 -7005 942 5675 9105 2021 -4669 -12559 -13652 2555
4428 2555 -7200 -9251 -3422 711 11111 -1463 408 -394 1218 5607 -7296 -10836 -1057 -8932
4414 -8932 -12990 -15523 -1915 3927 6305 9311 -7026 -17354 -22216 -25199 -11786 2612 3175 -7582
4400 -7582 -1277 -230 11603 23572 20964 11290 1928 -5142 -2841 -9070 47 9599 13959 17348
$$ packed form
4498B9030N693q054j2291j1266j1118O2L277M383J1697J7001R91r463k1998O404
4484D348M407r554p843k147J4970J6256Q354j548k090j6055j1617L080P617L669
4470A1847j398q682o044R509P889M610n601r42j957j6841j4523l546k960O613
4456b2026J4902J1669m342L215o396P981J0613j2067o002n017R829p237O140l513
4442b251j7737K279M583R685j063k501P947M733L430p084o690p890j093J6207
4428B555r755k051N829M133J0400j2574J871q02J612M389j2903l540R779p875
4414h932m058k533J3608N842K378L006j6337j0328m862k983J3413J4398N63j0757
4400g582O305J047J1833J1969k608r674r362p070K301o229R117R552M360L389
$$ plain form
4386 17348 6866 568 125 -1442 7879 382 -5357 -7941 -1528 6110 11897 3182 -151 -9811 -2033
4371 -2033 13126 23499 21356 16213 7536 13879 4994 -1590 -2934 -8754 7175 6788 1444 4714
4357 4714 11245 12155 13304 9535 18435 17191 16956 7782 2860 5124 12828 9235 10327 -10009 -23081
4342 -23081 -18489 -22532 -22822 -20271 -13889 17125 18521 8500 6443 927 -1881 -8701 -6058 -11805
4328 -11805 1824 -2264 -5463 -8194 -8483 -12162 -10858 -4464 7048 8561 5437 3442 -6651 -11084
4314 -11084 -25731 -25808 -23991 -23839 -9723 6945 9503 14364 7006 -1315 -1986 -4075 -11572 -12381 3582
4299 3582 8701 -5735 -9970 -10803 -30345 -34405 -26986 -8693 -2725 -7908 -7111 -6248 5875 -8810
4285 -8810 -5398 -459 -2652 844 3188 -2864 -6395 -5795 -631 -10001 -16362 -10817 8027 7418 -7109
$$ packed form
4386A7348j0482o298m43j567R321p497n739k584O413P638N787q715l333r660P778
4371b033J5159J0373k143n143q677O343q885o584j344n820J5929l87n344L270
4357D714O531R10J149l769Q900j244k35r174m922K264P704l593J092k0336j3072
4342b3081M592m043k90K551O382L1014J396j0021k057n516k808o820K643n747
4328a1805J3629m088l199k731k89l679J304O394J1512J513l124j995j0093m433
4314a1084j4647p7J817J52J4116J6668K558M861p358q321o71k089p497q09J5963
4299C582N119j4436m235q33j9542m060P419J8293N968n183P97Q63J2123j4685
4285h810L412M939k193L496K344o052l531O00N164r370o361N545J8844o09j4527
$$ plain form
4270 -7109 -13706 -23197 -11659 3714 8359 6712 13876 10023 18419 26936 15243 9980 16337 22501
4256 22501 10695 -126 -5408 723 4457 -2151 -10158 -14975 -4734 8561 26490 31770 34895
4243 34895 33415 23898 21305 8990 -6420 -4407 10061 12112 1394 457 5667 -4277 -1628 -11543
4229 -11543 -15512 -18243 -17419 -15023 -5858 -8021 -7935 -5231 8132 10145 -509 -10709 -3386 -2892 -1471
4214 -1471 -5569 -7107 1227 -9729 -10419 -11459 -13824 -3741 -1759 -8955 -6887 -19071 -14035 -9593
4200 -9593 -5368 -769 -7948 -13065 -23086 -25404 -9949 9787 9004 7825 13194 10203 18925 15773
4186 15773 6279 11401 21770 27952 24807 18552 8485 5841 8684 1526 -2601 296 8156 4281
4172 4281 -8090 -20417 -18252 -4532 5611 18693 16909 -4290 -15087 -18894 -9274 -7446 -16480
$$ packed form
4270g109o597r491J1538J5373M645j647P164l853Q396Q517j1693n263O357O164
4256B2501j1806j0821n282O131L734o608q007m817J0241J3295J7929N280L125
4243C4895j480r517k593j2315j5410K013J4468K051j0718r37N210r944K649r915
4229a1543l969k731Q24K396R165k163Q6K704J3363K013j0654j0200P323M94J421
4214a471m098j538Q334j0956o90j040k365J0083J982p196K068j2184N036M442
4200i593M225M599p179n117j0021k318J5455J9736p83j179N369k991Q722l152
4186A5773r494N122J0369O182l145o255j0067k644K843p158m127K897P860l875
4172D281j2371j2327K165J3720J0143J3082j784k1199j0797l807R620J828r034
$$ plain form
4159 -16480 -21841 -20492 -1816 5983 8244 3370 4690 9769 14600 23353 27239 11938 588 -3202
4145 -3202 -7195 -8510 -4848 3738 11848 21053 18542 18769 17979 16898 17419 22022 15518 5727 -1243 -5550
4129 -5550 -5585 -15493 -21076 -20157 -21060 -4489 1333 -11081 -16653 -8494 -2808 -4325 5851 -5212 -3620
4114 -3620 -2604 1657 12157 7964 6910 10159 11812 11005 11067 -4356 -5334 -5809 -9986 -6910 -13642 -9290
4098 -9290 -1575 9238 -165 -10802 -8788 -16441 -11869 -2610 -252 2649 -1475 -8284 -5581 -11768
4084 -11768 -5482 -8913 -6973 -5596 -11739 -19001 -11276 -15515 -10584 -14792 -7146 2257 -5591 -4144 187
4069 187 9898 17378 21428 3811 6731 28296 26349 8267 -5610 3754 19662 14699 -3924 -14462
4055 -14462 -18849 299 13189 -812 -269 353 5571 10353 -2110 -11302 -9257 -7808 4167 12398
$$ packed form
4159a6480n361J349J8676P799K261m874J320N079M831Q753L886j5301j1350l790
4145c202l993j315L662Q586Q110R205k511K27p90j081N21M603o504r791o970m307
4129e550l5r908n583R19r03J6571N822j2414n572Q159N686j517J0176j1063J592
4114c620J016M261J0500m193j054L249J653q07O2j5423r78m75m177L076o732M352
4098i290P715J0813r403j0637K014p653M572R259K358K901m124o809K703o187
4084a1768O286l431J940J377o143p262P725m239M931m208P646R403p848J447M331
4069A87R711P480M050j7617K920K1565j947j8082j3877R364J5908m963j8623j0538
4055a4462m387J9148J2890j4001N43O22N218M782j2463r192K045J449J1975Q231
$$ plain form
4041 12398 25588 23803 6839 2345 12225 17971 -5631 -16568 -12448 -16352 -9805 -17519 -25781 -10754
4027 -10754 7191 5183 -6032 -11134 -10912 -8013 -1289 -2744 -2641 -3467 -3920 -3391 1198 3563 9589
4012 9589 9439 -11310 -10012 -645 6852 12528 11672 -1613 -9482 10873 10690 158 -5851 -2123 -2118
3997 -2118 -5720 -5342 -5577 -6315 -8248 4829 9439 -13281 -15518 -3723 -53 -1029 4960 18102 15583
3982 15583 12571 5974 5865 10304 14930 7374 -1050 -3197 -2521 -1150 1640 5225 14831 9865 7692
3967 7692 9644 -1169 -3922 -1142 -19542 -25065 -5886 6702 -892 -9766 -9450 -11190 -15196 -19573
3953 -19573 -21756 -29324 -6488 17332 14746 1247 -6798 -12956 -8748 865 4373 4191 -9221 -2979
3939 -2979 11703 15283 5651 11828 6427 -1760 -1669 -3500 -3470 10441 8984 9611 21356 22632 16592
$$ packed form
4041A2398J3190j785j6964m494R880N746k3602j0937M120l904O547p714q262J5027
4027a0754J7945k008j1215n102K22K899O724j455J03q26m53N29M589K365O026
4012I589j50k0749J298R367P497N676q56j3285p869K0355j83j0532o009L728N
3997b118l602L78k35p38j933J3077M610k2720k237J1795L670r76N989J3142k519
3982A5583l012o597j09M439M626p556q424k147O76J371K790L585R606m966k173
3967G692J952j0813k753K780j8400n523J9179J2588p594q874L16j740m006m377
3953a9573k183p568K2836K3820k586j3499q045o158M208R613L508j82j3412O242
3939b979J4682L580r632O177n401q187R1j831L0J3911j457O27J1745J276o040
$$ plain form
3924 16592 14707 14589 5644 -9784 -5083 -4499 -13929 -7004 7605 10832 10147 1740 -2260 -8014 2643
3909 2643 -2659 -10940 -14638 -7082 8433 2655 -11479 -14439 -12391 -18481 -12218 -11862 -11000 -10480 -19586
3894 -19586 -28910 -21962 -17724 -16783 -8214 -6758 -9489 -16745 -18614 -15124 -10629 -9192 -23646 -31012 -9459
$$ packed form
3924A6592j885j18q945j5428M701N84r430O925J4609L227o85q407m000n754J0657
3909B643n302q281l698P556J5515n778j4134k960K048o090O263L56Q62N20r106
3894a9586r324O948M238R41Q569J456k731p256j869L490M495J437j4454p366K1553
$$ [...]
##END NTUPLES=NMR SPECTRUM
##END=
