##TITLE=Analysis number 307099
Compound Code ac 35974
Project Code adrs
Chemist Name frontier
##JCAMPDX= 6.0         $$ Bruker NMR JCAMP-DX V2.0
##DATA TYPE= NMR SPECTRUM
##DATA CLASS= NTUPLES
##ORIGIN= Bruker BioSpin GmbH
##OWNER= NMR
$$ XWIN-NMR		Version 3.5
$$ Wed Apr 20 15:25:29 2005 GMT Daylight Time (UT+1h)  MAYBRIDGE\NMR@NMR_250MHZ
##.OBSERVE FREQUENCY= 250.131544655141
##.OBSERVE NUCLEUS= ^1H
##.ACQUISITION MODE= SIMULTANEOUS (DQD)
##.ACQUISITION SCHEME= undefined
##.AVERAGES= 16
##.DIGITISER RES= 18
##SPECTROMETER/DATA SYSTEM= dpx250
##.PULSE SEQUENCE= zg30
##.SOLVENT NAME= DMSO
##.SHIFT REFERENCE= (INTERNAL, DMSO, 0, 16.522)
##AUDIT TRAIL= $$ (NUMBER, WHEN, WHO, WHERE, WHAT)
$$ ##TITLE= Audit trail, XWIN-NMR		Version 3.5
$$ ##JCAMPDX= 5.01
$$ ##ORIGIN= Bruker BioSpin GmbH
$$ ##OWNER= NMR
$$ C:\u/data/dgb/nmr/ADRS/1910/pdata/1/auditp.txt
$$ ##AUDIT TRAIL=  $$ (NUMBER, WHEN, WHO, WHERE, WHAT)
(   1,<2005-04-20 15:25:09.76 +100>,<MAYBRIDGE\NMR>,<NMR_250MHZ>,
      <created by zg, POWCHK disabled, PULCHK disabled
       configuration hash MD5:
       62 19 C7 07 E1 42 D1 B7 37 6C 3D D0 77 39 F9 E6
       data hash MD5: 64K
       28 3D E4 BC B7 7B 43 70 73 65 E8 AA E9 B3 A5 10>)
(   2,<2005-04-20 15:25:20.76 +100>,<MAYBRIDGE\NMR>,<NMR_250MHZ>,
      <Start of raw data processing
       ef LB = 0.3 FT_mod = 6 PKNL = 1 SI = 32K 
       data hash MD5: 32K
       72 54 55 31 31 94 B9 0A 31 77 28 58 1F 70 56 5C>)
(   3,<2005-04-20 15:25:22.52 +100>,<MAYBRIDGE\NMR>,<NMR_250MHZ>,
      <apk 
       data hash MD5: 32K
       A3 E0 D8 9F 5B 53 BE E3 2C E3 44 C2 32 3F 86 E6>)
(   4,<2005-04-20 15:25:23.27 +100>,<MAYBRIDGE\NMR>,<NMR_250MHZ>,
      <abs ABSG = 5 
       data hash MD5: 32K
       4C 24 D1 3F 41 32 D5 79 AE DA 90 AF F1 B8 45 33>)
$$ ##END=
$$ 
$$ hash MD5
$$ 21 E9 B2 6D D1 48 AD 0E 8D 84 C7 31 AD 9A B2 F0
##$RELAX= 
##$RELAX= 
##$RELAX= 
##$RELAX= 
##$RELAX= 
##$RELAX= 
##$RELAX= 
$$ Bruker specific parameters
$$ --------------------------
##$DU= <C:\u>
##$EXPNO= 1910
##$NAME= <ADRS>
##$PROCNO= 1
##$TYPE= <nmr>
##$USER= <dgb>
##$AMP= (0..31)
100 100 100 100 100 100 100 100 100 100 100 100 100 100 100 100 100 100 
100 100 100 100 100 100 100 100 100 100 100 100 100 100 
##$AQSEQ= 0
##$AQ_mod= 3
##$AUNM= <au_zg>
##$AUTOPOS= <32 >
##$BF1= 250.13
##$BF2= 250.13
##$BF3= 250.13
##$BF4= 250.13
##$BF5= 500.13
##$BF6= 500.13
##$BF7= 500.13
##$BF8= 500.13
##$BYTORDA= 1
##$CFDGTYP= 0
##$CFRGTYP= 5
##$CHEMSTR= <none>
##$CNST= (0..31)
1 1 145 1 1 1 1 1 1 1 1 1 1 1 1 1 1 1 1 1 1 1 1 1 1 1 1 1 1 1 1 1 
##$CPDPRG= <>
##$CPDPRG1= <>
##$CPDPRG2= <>
##$CPDPRG3= <>
##$CPDPRG4= <mlev>
##$CPDPRG5= <mlev>
##$CPDPRG6= <mlev>
##$CPDPRG7= <mlev>
##$CPDPRG8= <mlev>
##$CPDPRGB= <>
##$CPDPRGT= <>
##$D= (0..31)
0 1 0 0 0 0 0 0 0 0.06 0 0 0 0 0 0 0.0002 0 0 0 0 0 0 0 0 0 0 0 0 0 0 
0 
##$DATE= 1114007108
##$DBL= (0..7)
120 120 120 120 120 120 120 120 
##$DBP= (0..7)
150 150 150 150 150 150 150 150 
##$DBP07= 0
##$DBPNAM0= <>
##$DBPNAM1= <>
##$DBPNAM2= <>
$$ [...]
##$SUBNAM7= <"">
##$SUBNAM8= <"">
##$SUBNAM9= <"">
##$SW= 20.6930455092707
##$SWIBOX= (0..15)
0 0 3 0 0 0 0 0 0 0 0 0 0 0 0 0 
##$SW_h= 5175.983436853
##$TD= 65536
##$TD0= 1
##$TE= 295.16
##$TE2= 300
##$TE3= 300
##$TEG= 300
##$TL= (0..7)
0 120 120 120 120 120 120 120 
##$TP= (0..7)
150 150 150 150 150 150 150 150 
##$TP07= 0
##$TPNAME0= <>
##$TPNAME1= <>
##$TPNAME2= <>
##$TPNAME3= <>
##$TPNAME4= <>
##$TPNAME5= <>
##$TPNAME6= <>
##$TPNAME7= <>
##$TPOAL= (0..7)
0.5 0.5 0.5 0.5 0.5 0.5 0.5 0.5 
##$TPOFFS= (0..7)
0 0 0 0 0 0 0 0 
##$TUNHIN= 0
##$TUNHOUT= 0
##$TUNXOUT= 0
##$USERA1= <user>
##$USERA2= <user>
##$USERA3= <user>
##$USERA4= <user>
##$USERA5= <user>
##$V9= 5
##$VALIST= <valist>
##$VCLIST= <CCCCCCCCCCCCCCC>
##$VD= 0
##$VDLIST= <DDDDDDDDDDDDDDD>
##$VPLIST= <PPPPPPPPPPPPPPP>
##$VTLIST= <TTTTTTTTTTTTTTT>
##$WBST= 1024
##$WBSW= 4
##$XGAIN= (0..3)
0 0 0 0 
##$XL= 0
##$YL= 0
##$YMAX_a= 330906
##$YMIN_a= -349756
##$ZGOPTNS= <>
##$ZL1= 120
##$ZL2= 120
##$ZL3= 120
##$ZL4= 120
##$ABSF1= 16.522
##$ABSF2= -4.171173
##$ABSG= 5
##$ABSL= 3
##$ALPHA= 0
##$AQORDER= 0
##$ASSFAC= 0
##$ASSFACI= 0
##$ASSFACX= 0
##$ASSWID= 0
##$AUNMP= <proc_1d>
##$AZFE= 0.1
##$AZFW= 0.1
##$BCFW= 0
##$BC_mod= 0
##$BYTORDP= 0
##$COROFFS= 0
##$CY= 12.5
##$DATMOD= 1
##$DC= 0
##$DFILT= <>
##$DTYPP= 0
##$F1P= 14.0000005364418
##$F2P= -0.99999901652339
##$FCOR= 0.5
##$FTSIZE= 32768
##$FT_mod= 6
##$GAMMA= 0
##$GB= 0
##$INTBC= 1
##$INTSCL= 1
##$ISEN= 128
##$LB= 0.3
##$LEV0= 0
##$LPBIN= 0
##$MAXI= 10000
##$MC2= 0
##$MEAN= 0
##$ME_mod= 0
##$MI= 0
##$NCOEF= 0
##$NC_proc= -4
##$NLEV= 6
##$NOISF1= 0
##$NOISF2= 0
##$NSP= 0
##$NTH_PI= 0
##$NZP= 0
##$OFFSET= 16.522
##$PC= 1
##$PHC0= -80.57129
##$PHC1= 7.813732
##$PH_mod= 1
##$PKNL= yes
##$PPARMOD= 0
##$PSCAL= 4
##$PSIGN= 0
##$REVERSE= no
##$SF= 250.13
##$SI= 32768
##$SIGF1= 0
##$SIGF2= 0
##$SINO= 400
##$SIOLD= 32768
##$SREGLST= <1H.DMSO>
##$SSB= 0
##$STSI= 32768
##$STSR= 0
##$SW_p= 5175.98343685301
##$SYMM= 0
##$S_DEV= 0
##$TDeff= 65536
##$TDoff= 0
##$TI= <Analysis number 999999
Compound Code 99
Book Reference 9
Project Code 9>
##$TILT= no
##$TM1= 0
##$TM2= 0
##$TOPLEV= 0
##$USERP1= <user>
##$USERP2= <user>
##$USERP3= <user>
##$USERP4= <user>
##$USERP5= <user>
##$WDW= 1
##$XDIM= 32768
##$YMAX_p= 314933674
##$YMIN_p= -397318
$$ End of Bruker specific parameters
$$ ---------------------------------
##NTUPLES= NMR SPECTRUM
##VAR_NAME=  FREQUENCY,     SPECTRUM/REAL,   SPECTRUM/IMAG
##SYMBOL=    X,             R,               I
##VAR_TYPE=  INDEPENDENT,   DEPENDENT,       DEPENDENT
##VAR_FORM=  AFFN,          ASDF,            ASDF
##VAR_DIM=   32768,         32768,           32768
##UNITS=     HZ,            ARBITRARY UNITS, ARBITRARY UNITS
##FACTOR=    0.157963299565203, 1,           1
##FIRST=     4132.6476996994, 0,             0
##LAST=      -1043.33573715361, 0,           0
##MIN=       -1043.33573715361, -397318,     0
##MAX=       4132.6476996994, 314933674,     0
$$ Real data points
##PAGE= N=1
##DATA TABLE= (X++(R..R)), XYDATA
$$ [...]
$$ plain form
25430 11682 -12264 28131 43188 -47284 46467 106972 74421 55528 156655 166583 52452
25419 52452 -40426 -92642 -118539 -125177 -125345 -216600 -270326 -186274 -79328 7593 62304 94005
25407 94005 89845 14444 -17946 -14595 76575 109080 53126 69671 -21396 -40807 -114640 -174134
25395 -174134 -92164 -22052 19039 -30656 -22379 -36378 -52028 -92637 -72974 -123284 -42221 34843
25383 34843 -53211 -101509 -33186 15783 -103291 -110821 2486 106158 163639 124634 46106
25372 46106 13962 23162 15808 87985 90943 103335 153711 75095 -48878 89339 155760 201154
25360 201154 282567 261597 212937 141653 87247 108731 80770 23880 8004 60824 -3120
25349 -3120 -47101 -101913 -165113 -109145 772 71624 9380 13443 141344 106180 86217 215178
$$ packed form
25430A1682k3946M0395J5057r0472R3751O0505l2551j8893J01127R928j14131
25419E2452r2878n2216k5897o638j68r1255n3726Q4052J06946Q6921N4711L1701
25407I4005m160p5401l2390L351R1170L2505n5954J6545r1067j9411p3833n9494
25395a74134Q1970P0112M1091m9695Q277j3999j5650m0609J9663n0310Q1063P7064
25383C4843q8054m8298O8323M8969j19074p530J13307J03672N7481l9005p8528
25372D6106l2144R200p354P2177K958J2392N0376p8616j23973J38217O6421M5394
25360B01154Q1413k0970m8660p1284n4406K1484k7961n6890j5876N2820o3944
25349c120m3981n4812o3200N5968J09917P0852o2244M063J27901l5164j9963J28961
$$ plain form
25337 215178 209208 135993 118669 108537 80101 52883 30928 -40931 7744 86908 31649 45280
25325 45280 55994 133193 131318 89900 12072 -23379 -19563 27376 25581 -51265 -116340 -76031
25313 -76031 -22075 -17021 8341 13731 68675 24376 -5909 61305 110018 166438 152908 161336
25301 161336 116737 64701 -8572 -58016 -16681 23384 44241 111845 68156 10290 -76247
25290 -76247 -44784 -48930 -9562 39702 33345 97019 73984 -47936 -32296 44053 104655 47342
25278 47342 -122760 -122936 -28703 -11995 41813 27995 17570 41747 66837 83658 -6212 22248
25266 22248 125705 100945 57664 83194 25362 -56414 -111981 -41882 -19117 -55505 -51247 -58268
25254 -58268 -116102 -168366 -177939 -157359 -159564 -89795 -46698 -113350 -82614 -92797 -23865 -26538
$$ packed form
25337B15178n970p3215j7324j0132k8436k7218k1955p1859M8675P9164n5259J3631
25325D5280J0714P7199j875m1418p7828l5451L816M6939j795p6846o5075M0309
25313g6031N3956N054K5362N390N4944m4299l0285O7214M8713N6420j3530Q428
25301A61336m4599n2036p3273m9444M1335M0065K0857O7604m3689n7866q6537
25290g6247L1463m146L9368M9264o357O3674k3035j21920J5640P6349O0602n7313
25278D7342j70102j76R4233J6708N3808j3818j0425K4177K5090J6821q9870K8460
25266B2248J03457k4760m3281K5530n7832q1776n5567P0099K2765l6388M258p021
25254e8268n7834n2264r573K0580k205O9769M3097o6652L0736j0183O8932k673
$$ plain form
25242 -26538 -915 93858 27854 -54591 -59844 -27358 -18707 -55078 23413 73794 135464 78597
25230 78597 12785 -69477 -131290 -20812 44801 28989 9443 90400 97321 45956 -24902 -110850
25218 -110850 -78558 -60787 -50278 41622 -23726 -129832 -114796 -59797 6905 124576 132866
25207 132866 131468 -760 -22446 10277 47666 52588 89685 162202 161858 88085 -29987 -54659
25195 -54659 -22492 -20740 -9572 55909 87600 3593 -4258 -72177 -150407 -170558 -135819 -57571
25183 -57571 -17316 11225 -16247 2217 -7365 -16018 -29362 -122692 -67380 -4304 -5519 -78077
25171 -78077 -112749 -116720 -161098 -188596 -103289 -45024 63300 29928 9516 32492 1327 -106843
25159 -106843 -149247 -137342 -89202 -13907 7006 53178 12502 -82751 -129465 -68741 44427
$$ packed form
25242b6538K5623R4773o6004q2445n253L2486Q651l6371P8491N0381O1670n6867
25230G8597o5812q2262o1813J10478O5613j5812j9546Q0957O921n1365p0858q5948
25218a10850L2292J7771J0509R1900o5348j06106J5036N4999O6702J17671Q290
25207A32866j398j32228k1686L2723L7389M922L7097P2517l44p3773j18072k4672
25195e4659L2167J752J1168O5481L1691q4007p851o7919p8230k0151L4739P8248
25183e7571M0255K8541k7472J8464r582q653j3344r3330N5312O3076j215p2558
25171g8077l4672l971m4378k7498Q5307N8265J08324l3372k0412K2976l1165j08170
25159a06843m2404J1905M8140P5295K0913M6172m0676r5253m6714O0724J13168
$$ plain form
25148 44427 96324 23289 48862 53155 51820 28280 17806 18527 -78695 -74851 -26415 -3378 123702
25135 123702 195623 160988 129604 118935 65087 -13266 -34488 23512 -48982 -116939 -118356 -25760
25123 -25760 -47056 -61617 -171827 -184178 -73280 -23512 -56405 -43046 -37710 -40273 2250 33988
25111 33988 28628 -3525 4353 -4805 84810 -5921 -52069 -42273 -84651 -132343 -79591 40799
25099 40799 9976 -41304 48457 57738 -62785 -43625 17347 -28658 -110269 -112279 -52305 -48414
25087 -48414 -12868 -68636 -12176 53044 97428 190534 184056 60803 135183 233916 195856 216050
25075 216050 172929 59548 52159 60745 -6302 13164 75951 125097 131387 28849 95026 120933
25063 120933 29495 51526 9665 84763 164724 139569 101516 122441 139446 77508 8420
$$ packed form
25148D4427N1897p3035K5573M293j335k3540j0474P21r7222L844M8436K3037J27080
25135A23702P1921l4635l1384j0669n3848p8353k1222N8000p2494o7957j417R2596
25123b5760k1296j4561j10210j2351J10898M9768l2893J3359N336k563M2523L1738
25111C3988n360l2153P878r158Q9615r0731m6148R796m2378m7692N2752J20390
25099D0799l0823n1280Q9761R281j20523J9160O0972m6005q1611k010N9974L891
25087d8414L5546n5768N6460O5220M4384R3106o478j23253P4380R8733l8060K0194
25075B16050m3121j13381p389Q586o7047J9466O2787M9146O290j02538O6177K5907
25063A20933r1438K2031m1861P5098P9961k5155l8053K0925J7005o1938o9088
$$ plain form
25052 8420 -16618 -5232 39755 73557 46688 23322 66807 -22308 -86957 46502 13193 -6388
25040 -6388 32632 -14471 -52221 -19800 20539 64740 75516 804 -83633 -100429 -196106 -163281
25028 -163281 -81465 -42526 -1689 -11130 -92525 -198960 -216573 -207189 -114062 -53869 -39466 -8472
25016 -8472 11490 23196 44849 11663 -82180 -64133 -61840 -85607 -108201 -14779 38854 -44221
25004 -44221 -96426 -79210 -7191 43400 72676 4284 16360 28839 11735 49672 24624 4794
24992 4794 26795 -9400 -73398 -80908 -113035 -136987 -125209 -83108 -99034 -22868 54631 59752
24980 59752 94755 109413 99549 7277 -3422 -18949 53058 43402 -45826 -11757 17135 53992
24968 53992 106122 108766 46206 33615 -13142 -60410 -92419 -73537 -69800 -27042 -42489 -36761
$$ packed form
25052H420k5038J1386M4987L3802k6869k3366M3485q9115o4649J33459l3309j9581
25040f388L9020m7103l7750L2421M0339M4201J0776p4712q4437j6796r5677L2825
25028a63281Q1816L8939M0837r441q1395j06435j7613R384R3127O0193J4403L0994
25016h472J9962J1706K1653l3186r3843J8047K293k3767k2594R3422N3633q3075
25004d4221n2205J7216P2019N0591K9276o8392J2076J2479j7104L7937k5048j9830
24992D794K2001l6195o3998p510l2127k3952J1778M2101j5926P6166P7499N121
24980E9752L5003J4658r864r2272j0699j5527P2007r656q9228L4069K8892L6857
24968E3992N2130K644o2560j2591m6757m7268l2009J8882L737M2758j5447N728
$$ plain form
24956 -36761 -89067 -89767 -70594 -35494 -82603 -5679 -33150 -55532 -52620 -93059 -79632 -63785
24944 -63785 -93358 -11417 176578 171856 45886 -53613 -86901 -124725 -140460 -112723 -128484
24933 -128484 -33279 30079 -50567 -83625 -75627 -19735 -14680 -58268 -31580 -80096 -94453 -104389
24921 -104389 -106376 -115269 -127429 -165599 -35261 21055 -40178 -30963 -22292 -16186 25171 -32341
24909 -32341 -68389 109379 183191 103815 10381 -54865 -41811 -18903 29781 31378 28390 -24496
24897 -24496 -73841 -158913 -210203 -121978 -37472 47789 83584 9893 57898 15072 -42116 -97878
24885 -97878 -68175 -128652 -46263 49713 103555 57177 49664 71029 -36159 -55291 -46593 17041
24873 17041 101575 -21563 -164312 -198938 -176637 -135690 -83308 -19310 -31058 -18586 -991
$$ packed form
24956c6761n2306p00J9173L5100m7109P6924k7471k2382K912m0439J3427J5847
24944f3785k9573Q1941J87995m722j25970r9499l3288l7824j5735K7737j5761
24933a28484R5205O3358q0646l3058P998N5892N055m3588K6688m8516j4357r936
24921a04389j987q893j2160l8170J30338N6316o1233R215Q671O106M1357n7512
24909c2341l6048J77768P3812p9376r3434o5246J3054K2908M8684J597k988n2886
24897b4496m9345q5072n1290Q8225Q4506Q5261L5795p3691M8005m2826n7188n5762
24885i7878K9703o0477Q2389R5976N3842m6378p513K1365j07188j9132Q698O3634
24873A7041Q4534j23138j42749l4626K2301M0947N2382O3998j1748J2472J7595
$$ plain form
24862 -991 -39989 70786 142929 153395 73275 2644 -6920 14509 18844 -17669 -48612 -76898
24850 -76898 -59840 -30354 -70418 -81244 -92962 -52440 -34604 -64620 14846 -39977 -77487 -106883
24838 -106883 -141982 -67857 33318 27495 37857 3162 -81130 -135472 -102801 -29886 32397
24827 32397 43354 40263 116767 27955 -160460 -162886 -129380 -24544 -86958 -143750 -59547 -18145
24815 -18145 -66910 -33458 -96080 -67744 -33523 -53252 19996 102243 116639 126231 71912 -65123
24803 -65123 -195719 -161450 -108014 43247 58881 -36913 -38523 -30299 -103328 -67004 -13201 58355
24791 58355 49746 -29505 -28564 -1563 -29543 -97 -31450 1061 -19915 81381 103846 -9999
24779 -9999 -110611 -96073 12905 105346 124631 181197 168666 51109 12643 11126 29381
$$ packed form
24862i91l8998J10775P2143J0466q0120p0631r564K1429M335l6513l0943k8286
24850g6898J7058K9486m0064j0826j1718M0522J7836l0016P9466n4823l7510k9396
24838a06883l5099P4125J01175n823J0362l4695q4292n4342L2671P2915O2283
24827C2397J0957l091P6504q8812j88415k426L3506J04836o2414n6792Q4203M1402
24815a8145m8765L3452o2622K8336L4221j9729P3248Q2247J4396R592n4319j37035
24803f5123j30596L4269N3436J51261J5634r5794j610Q224p3029L6324N3803P1556
24791E8355q609p9251R41K7001k7980K9446l1353L2511k0976J01296K2465j13845
24779i999j00612J4538J08978R2441J9285N6566j2531j17557l8466j517J8255
$$ plain form
24768 29381 -72827 -118930 -106455 -34314 -44466 -136422 -109843 -153400 -86641 21988 75920
24757 75920 41152 26906 61644 54974 20265 69818 90802 90867 91704 75531 64043 19639 29300
24744 29300 69594 116318 97793 -51065 -51600 17898 34111 -34051 -11648 34317 -6844 10302
24732 10302 18442 28565 -2316 -85250 -76839 -32924 5357 -61889 -146806 -209426 -222848 -132274
24720 -132274 18951 89695 91164 82654 2424 -63488 -137006 -128512 -175144 -242052 -222215 -211253
24708 -211253 -199907 -85320 -54525 -118823 -128052 -73489 -32176 51882 30157 9401 65963
24697 65963 5850 15995 50334 93229 116362 136371 24146 -64824 -63732 11434 114582
24686 114582 124851 103427 70039 -38404 -25634 -34327 -71403 -51557 -51728 90770 75661 -16687
$$ packed form
24768B9381j02208m6103J2475P2141j0152r1956K6579m3557O6759J08629N3932
24757G5920l4768j4246L4738o670l4709M9553K0984O5Q37j6173j1488m4404R661
24744B9300M0294M6724j8525j48858n35O9498J6213o8162K2403M5965m1161J7146
24732A0302Q140J0123l0881q2934Q411M3915L8281o7246q4917o2620j3422R0574
24720a32274J51225P0744J469q510q0230o5912p3518Q494m6632o6908J9837J0962
24708b11253J1346J14587L0795o4298r229N4563M1313Q4058k1725k0756N6562
24697F5963o0113J0145L4339M2895K3133K0009j12225q8970J092P5166J03148
24686A14582J0269k1424l3388j08443J2770q693l7076J9846j71J42498j5109r2348
$$ plain form
24674 -16687 30924 47571 56000 7934 -109544 -167507 -111001 -65090 -5495 -60755 -134499 -157809
24662 -157809 -87344 -72774 -79479 -94523 -109862 -54537 9189 -84294 -19387 16738 16001 -10071
24650 -10071 -103395 -133411 -104029 -36600 -23450 37968 134518 173713 98006 52596 38657 -39663
24638 -39663 -55997 21728 51210 17427 14032 18432 37965 -363 -57233 -80635 -20294 25246
24626 25246 -51038 -63884 -29329 -23897 -18423 8147 -130839 -221501 -244819 -196600 -161821 -139160
24614 -139160 -145128 -189225 -184751 -260874 -246712 -122249 28475 22559 28843 4421 -71711 -52843
24602 -52843 -78318 -38390 10887 13305 -48140 -57916 -81393 -58187 -28449 -67782 -94331 -181923
24590 -181923 -215626 -134232 26576 20259 -13054 -81187 -95431 -11850 45861 51293 171438
$$ packed form
24674a6687M7611J6647Q429m8066j17478n7963N6506M5911N9595n5260p3744k3310
24662a57809P0465J4570o705j5044j5339N5325O3726r3483O4907L6125p37k6072
24650a0071r3324l0016K9382O7429J3150O1418R6550L9195p5707m5410j3939p8320
24638c9663j6334P7725K9482l3783l395M400J9533l8328n6870k3402O0341M5540
24626B5246p6284j2846L4555N432N474K6570j38986r0662k3318M8219L4779K2661
24614a39160n968m4097M474p6123J4162J24463J50724n916O284k4422p6132J8868
24602e2843k5475L9928M9277K418o1445r776k3477K3206K9738l9333k6549q7592
24590a81923l3703Q1394J60808o317l3313o8133j4244Q3581N7711N432J20145
$$ plain form
24579 171438 223199 159121 71669 109781 139680 180139 179754 85697 28157 70891 128472 101534
24567 101534 -1919 39642 95503 97163 124297 138518 153608 147763 177300 144638 -34406
24556 -34406 -49491 -36187 -42013 -23706 -20399 -13834 -61924 -10263 -5618 14564 30673 -4222
24544 -4222 -20601 -89072 -100310 -62727 -65482 -81358 -78764 -63109 -34497 1798 27376 13009
24532 13009 -54105 -84540 -122340 -65660 -11692 893 -65727 60485 156750 159082 103281 46827
24520 46827 46587 -51475 -142507 -44581 84535 124786 60734 50705 43563 -28799 -86451 -35861
24508 -35861 12548 -13850 -44695 -1380 18706 -39695 -136000 -122756 35237 91533 54485
24497 54485 9263 26732 20018 -17043 -149791 -144447 3133 -57664 -157303 -240739 -249852 -168041
$$ packed form
24579A71438N1761o4078q7452L8112K9899M0459l85r4057n7540M2734N7581k6938
24567A01534j03453M1561N5861J660K7134J4221J5090n845K9537l2662j79044
24556c4406j5085J3304n826J8307L307O565m8090N1661M645K0182J6109l4895
24544d222j6379o8471j1238L7583k755j5876K594J5655K8612L6295K5578j4367
24532A3009o7114l0435l7800N6680N3968J2585o6620J26212R6265K332n5801n6454
24520D6827k40r8062r1032R7926J29116M0251o4052j0029p142p2362n7652N0590
24508c5861M8409k6398l0845M3315K0086n8401r6305J3244J57993N6296l7048
24497E4485m5222J7469o714l7061j32748N344J47580o0797r9639q3436r113Q1811
$$ plain form
24485 -168041 -109876 -119226 -90509 -142021 -53694 28524 56247 1038 24326 -703 22882 86550
24473 86550 23967 -36528 -24390 -28726 -29836 21649 -10502 14427 71340 59518 9402 -59992
24461 -59992 39492 75156 -5575 -130735 -141822 -53272 -15713 -41662 1510 -57032 -5935
24450 -5935 -57295 -55426 -49344 -31457 14380 74064 20152 17460 -19767 -9946 82710 72799 -6561
24437 -6561 -114628 -113326 -33244 -33951 -57097 -98895 -101774 -140278 -170593 -117645 -48387 15371
24425 15371 35176 -52826 -52998 -47108 3922 13151 -18539 -54441 -26747 -14294 -49860 -71767
24413 -71767 -148255 -67693 -12941 -41308 7156 43352 40477 55417 37627 30544 5974 -22323
24401 -22323 -8506 17693 29973 83563 112139 89717 111815 131281 150127 60700 -88605
$$ packed form
24485a68041N8165r350K8717n1512Q8327Q2218K7723n5209K3288k5029K3585O3668
24473H6550o2583o0495J2138m336j110N1485l2151K4929N6913j1822n0116o9394
24461e9992R9484L5664q0731j25160j1087Q8550L7559k5949M3172n8542N1097
24450e935n1360J869O082J7887M5837N9684n3912k692l7227R821R2656r911p9360
24437f561j08067J302Q0082p07k3146m1798k879l8504l0315N2948O9258O3758
24425A5371J9805q8002j72N890N1030R229l1690l5902K7694J2453l5566k1907
24413g1767p6488Q0562N4752k8367M8464L6196k875J4940j7790p083k4570k8297
24401b2323J3817K6199J2280N3590K8576k2422K2098J9466J8846q9427j49305
$$ plain form
24390 -88605 -131587 -144687 -147083 -145162 -175542 -145896 -86741 28947 71137 114116 67810 -65243
24378 -65243 -115173 -115544 -80720 -65923 -38321 42360 178381 184185 133802 102012 -21387 4170
24366 4170 126586 103189 19757 -14197 54505 108234 120904 76610 72237 44144 -11589 28379
24354 28379 140089 110550 55519 -10121 -53860 -30793 1855 37861 80756 63888 -21431
24343 -21431 -103218 -116559 9100 91151 101893 164546 191712 186946 99771 138765 142021 -56119
24331 -56119 -189270 -190433 -219101 -184980 -26001 102415 74005 31796 4684 54268 79560
24320 79560 14731 -138811 -171284 -66483 39230 54891 173 31228 23314 -35531 -48398
24309 -48398 83485 47231 -6913 70381 41037 -28069 -131623 -80750 13592 15538 26877
$$ packed form
24390h8605m2982j3100k396J921l0380K9646N9155J15688M2190M2979m6306j33053
24378f5243m9930l71L4824J4797K7602Q0681J36021N804n0383l1790j23399K5557
24366D170J22416k3397q3432l3954O8702N3729J2670m4294m373k8093n5733L9968
24354B8379J11710k9539n5031o5640m3739K3067L2648L6006M2895j6868q5319
24343b1431q1787j3341J25659Q2051J0742O2653K7166m766q7175L8994L256j98140
24331e6119j33151j163k8668L4121J58979J28416k8410m2209k7112M9584K5292
24320G9560o4829j53542l2473J04801J05713J5661n4718L1055p914n8845j2867
24309d8398J31883l6254n4144P7294k9344o9106j03554N0873R4342J946J1339
$$ plain form
24298 26877 35941 56646 -25016 26502 107500 195525 186957 116704 65503 80916 -16750 17468
24286 17468 40180 52513 37259 73788 105062 93593 29686 8249 25250 -30520 -32536 -10260
24274 -10260 -46226 1308 4110 -107916 -168585 -113595 -107308 -81041 -67948 -42626 -91311 -82190
24262 -82190 -41071 -28825 -34522 3055 13876 38999 -12063 -63147 -85307 -36864 17962 44013
24250 44013 18709 36659 41352 25535 -9332 -100857 14006 55838 31335 13496 31510 57737
24238 57737 -7176 -54149 -58512 -137394 -221471 -171472 -98660 -39135 -62225 -55930 -51419 -32267
24226 -32267 -92415 -107524 -194773 -197892 -87257 -21705 44633 15555 60300 -12039 7128 -11978
24214 -11978 58972 121394 118147 57459 2812 -2532 -46067 -46575 18926 57585 43260 45954 5094
$$ packed form
24298B6877R064K0705q1662N1518Q0998Q8025q568p0253n1201J5413r7666L4218
24286A7468K2712J2333j5254L6529L1274j1469o3907k1437J7001n5770k016K2276
24274a0260l5966M7534K802j12026o0669N4990O287K6267J3093K5322m8685R121
24262h2190M1119J2246n697L7577J0821K5123n1062n1084k2160M8443N4826K6051
24250D4013k5304J7950M693j5817l4867r1525J14863M1832k4503j7839J8014K6227
24238E7737o4913m6973m363p8882q4077M9999P2812N9525k3090O295M511J9152
24226c2267o0148j5109q7249l119J10635O5552O6338k9078M4745p2339J9167j9106
24214a1978P0950O2422l247o0688n4647n344m3535n08O5501L8659j4325K694m0860
$$ plain form
24201 5094 610 48253 104724 165515 122369 54184 31826 67021 101734 125479 23217 1111
24189 1111 -19999 27878 80362 43145 46196 15751 -70921 -58450 26768 2963 -56310 -40357
24177 -40357 44124 118524 101296 91778 84724 103305 128588 26975 -3611 -28669 -7556 44245
24165 44245 63611 791 -37753 -76994 -149198 -100364 -113018 -160666 -188579 -176968 -89366 12235
24153 12235 64333 -42836 -49916 -21188 78516 110852 58330 65283 50557 15360 73631 122688
24141 122688 33033 -24182 -9405 -3056 -12377 21988 116726 159426 205171 181307 117803 -2637
24129 -2637 -102326 -63773 39593 72614 75561 41882 133943 130599 20819 1373 29014 -51108
24117 -51108 -167681 -98345 -33487 -62749 -56972 -72952 -4058 94366 58187 57497 76691 65576
$$ packed form
24201E094m484M7643N6471O0791m3146o8185k2358L5195L4713K3745j02262k2106
24189A111k1110M7877N2484l7217L051l0445q6672J2471Q5218k3805n9273J5953
24177d0357Q4481P4400j7228r518p054J8581K5283j01613l0586k5058K1113N1801
24165D4245J9366o2820l8544l9241p2204M8834j2654m7648k7913J1611Q7602J01601
24153A2235N2098j07169p080K8728R9704L2336n2522O953j4726l5197N8271M9057
24141A22688q9655n7215J4777O349r321L4365R4738M2700M5745k3864o3504j20440
24129b637r9689L8553J03366L3021K947l3679R2061l344j09780j9446K7641q0122
24117e1108j16573O9336O4858k9262N777j5980O8894R8424l6179o90J9194j1115
$$ plain form
24105 65576 9291 -27276 -37123 -121 -13762 -18826 -32623 -1662 51770 7959 44211 98051
24093 98051 37421 110215 152711 131548 55229 11301 -51953 -5869 14344 96156 -22818
24082 -22818 -80731 -24651 -90918 -56732 -28362 40284 -3701 -45298 -15584 86511 79270 42922
24070 42922 47554 51363 117552 101630 78745 163193 73712 -548 -54100 -87921 -57209 -33037
24058 -33037 -44383 -47917 -79167 -42831 -61795 -1860 113671 92790 79038 8600 -56890 -62742
24046 -62742 -73925 -99107 -113348 -103438 -99718 12247 137116 148118 162635 116509 -32670
24035 -32670 -61268 -51593 -151935 -170587 -206338 -107696 -16603 -61562 -33020 -59464 -24247 91003
24023 91003 115243 215862 289824 228133 176169 179018 140373 170331 110590 55564 38623 55446
$$ packed form
24105F5576n6285l6567r847L7002j3641n064j3797L0961N3432m3811L6252N3840
24093I8051o0630P2794M2496k1163p6319m3928o3254M6084K0213Q1812j18974
24082b2818n7913N6080o6267L4186K8370O8646m3985m1597K9714J02095p241l6348
24070D2922M632L809O6189j5922k2885Q4448q9481p4260n3552l3821L0712K4172
24058c3037j1346l534l1250L6336j8964N9935J15531k0881j3752p0438o5490n852
24046f2742j1183k5182j4241R910L720J11965J24869J1002J4517m6126j49179
24035c2670k8598R675j00342j8652l5751R8642R1093m4959K8542k6444L5217J15250
24023I1003K4240J00619P3962o1691n1964K849l8645K9958n9741n5026j6941J6823
$$ plain form
24011 55446 9087 46261 42292 43320 -7629 -92976 -108033 -206286 -275963 -150229 -106617 -61106
23999 -61106 -87474 67086 157547 159357 114056 50112 38341 -6282 -23909 -93719 -100461 -64960
23987 -64960 -18736 31258 43388 29685 86593 53476 90416 74735 50637 -62862 -43132
23976 -43132 28928 -10634 37047 94749 159222 124624 99678 33843 58336 37782 -407 -38178
23964 -38178 2910 13395 -1479 3012 5463 55780 -16453 -39130 -13722 -24610 -22928 -84345
23952 -84345 -190391 -213643 -186920 -192397 -146392 -84109 -76680 -15605 87264 164111 198974 121501
23940 121501 -6359 26776 52291 43641 87753 13712 -10392 -34363 -37859 -30172 -16533 70091
23928 70091 32443 -107204 -75186 -32791 9345 35326 92282 131553 91451 105161 119423
$$ packed form
24011E5446m6359L7174l969J028n0949q5347j5057r8253o9677J25734M3612M5511
23999f1106k6368J54560R0461J810m5301o3944j1771m4623j7627o9810o742L5501
23987f4960M6224M9994J2130j3703N6908l3117L6940j5681k4098j13499J9730
23976d3132P2060l9562M7681N7702O4473l4598k4946o5835K4493k0554l8189l7771
23964c8178M1088J0485j4874M491K451N0317p2233k2677K5408j0888J682o1417
23952h4345j06046k3252K6723n477M6005O2283P429O1075J02869P6847L4863p7473
23940A21501j27860L3135K5515q650M4112p4041k4104k3971l496P687J3639Q6624
23928G0091l7648j39647L2018M2395M2136K5981N6956L9271m0102J3710J4262
$$ plain form
23917 119423 106428 65662 78167 100349 85757 78692 14659 -3698 84164 100125 110218 60827
23905 60827 -39062 -71817 -64715 -26450 155 30428 46767 47948 25099 86585 90512 28254
23893 28254 17623 -17849 43436 52148 -41943 11666 14273 -70913 -191538 -225852 -168786 -103021
23881 -103021 -75033 -30569 -24384 25236 36072 92074 162511 109582 36301 10108 93094 21846
23869 21846 -29384 -16581 5329 42703 43669 87132 99393 51793 77188 164456 106363 109831
23857 109831 37039 -26293 -2024 39273 31089 45246 -36658 3642 84998 178352 158332 49342
23845 49342 -9926 -21737 16772 -11092 -35952 -26348 -54649 -82112 -34625 42692 145818 141092
23833 141092 90963 24040 32845 28611 -115173 -260119 -179534 -164992 -153290 -112010 -92085
$$ packed form
23917A19423j2995m0766J2505K2182j4592p065o4033j8357Q7862J5961J0093m9391
23905F0827r9889l2755P102L8265K6605L0273J6339J181k2849O1486L927o2258
23893B8254j0631l5472O1285Q712r4091N3609K607q5186j20625l4314N7066O5765
23881a03021K7988M4464O185M9620J0836N6002P0437n2929p3281k6193Q2986p1248
23869B1846n1230J2803K1910L7374R66M3463J2261m7600K5395Q7268n8093L468
23857A09831p2792o3332K4269M1297q184J4157q1904M0300Q1356R3354k0020j08990
23845D9342n9268j1811L8509k7864k4860R604k8301k7463M7487P7317J03126m726
23833A41092n0129o6923Q805m234j43784j44946Q0585J4542J1702M1280J9925
$$ plain form
23822 -92085 -133506 -65018 60499 42971 161923 164976 -12032 -153491 -97751 -58349 -111373
23811 -111373 -133295 -114801 -82894 -65290 -98339 -1028 67484 28007 -61324 33652 105594
23800 105594 13600 -17997 -78360 -56847 -26916 -32704 97886 57593 11458 110166 28256
23789 28256 -57147 -89260 -8743 86779 -418 46950 41399 -15936 21820 29129 144735 77983
23777 77983 -63348 -9493 100785 50145 126746 107786 -14094 -171401 -111650 -46899 -76539
23766 -76539 -58876 -44006 37407 21777 -92724 -141738 -92096 -108795 -72006 -5516 8049
23755 8049 -26138 -139543 -155655 -66719 13074 -25726 -86538 -40861 -85905 -119965 -81930 -51384
23743 -51384 -25335 51266 50645 -7788 -115466 -127038 -72552 -83623 -36391 -3206 -62713 23294
$$ packed form
23822i2085m1421O8488J25517j7528J18952L053j77008j41459N5740L9402n3024
23811a11373k1922J8494L1907J7604l3049R7311O8512l9477q9331R4976P1942
23800A05594r1994l1597o0363K1513K9931n788J30590m0293m6135R8708q1910
23789B8256q5403l2113Q0517R5522q7197M7368n551n7335L7756P309J15606o6752
23777G7983j41331N3855J10278n0640P6601j8960j21880j57307N9751O4751k9640
23766g6539J7663J4870Q1413j5630j14501m9014M9642j6699L6789O6490J3565
23755H049l4187j13405j6112Q8936P9793l8800o0812M5677m5044l4060L8035L0546
23743e1384K6049P6601o21n8433j07678j1572N4486j1071M7232L3185n9507Q6007
$$ plain form
23731 23294 -23832 -6334 -35264 -67997 -33945 29938 39605 38535 79943 97110 60340 48425
23719 48425 29066 18925 65666 -25330 -74873 -64714 45656 117352 122193 65904 60234 -1966
23707 -1966 -54627 -83953 -55209 -58890 -48631 -91228 -114641 -146640 -191779 -114337 -128246 -110465
23695 -110465 -11106 12076 -31930 65786 79187 32699 -18148 8815 38694 36357 31193 47560
23683 47560 140566 107912 9188 -39916 -94861 -117122 -158800 -80508 -49036 -80053 -52982 8156
23671 8156 19750 56724 47202 16402 -9239 -12853 24171 88484 124528 -19934 -105456 -87136
23659 -87136 -102327 -126536 -32011 9885 -17588 -4663 -9297 -25491 10373 18986 14061 52745
23647 52745 -20969 -21999 -18401 -46121 -43309 -62712 -13261 -25123 -44119 -3415 30492 -7535
$$ packed form
23731B3294m7126J7498k8930l2733L4052O3883R667j070M1408J7167l6770j1915
23719D8425j9359j0141M6741r0996m9543J0159J10370P1696M841n6289n670o2200
23707a966n2661k9326K8744l681J0259m2597k3413l1999m5139P7442j3909J7781
23695a10465R9359K3182m4006R7716J3401m6488n0847K6963K9879k337n164J6367
23683D7560R3006l2654r8724m9104n4945k2261m1678P8292L1472l1017K7071O1138
23671H156J1594L6974r522l0800k5641l614L7024O4313L6044j44462q5522J8320
23659h7136j5191k4209R4525M1896k7473J2925m634j6194L5864Q613m925L8684
23647E2745p3714j030L598k7720K812j9403M9451j1862j8996M0704L3907l8027
$$ plain form
23635 -7535 -18333 -19508 -8877 -38185 -55069 -1334 14758 58011 122536 150700 122589 102065
23623 102065 146437 34923 -43477 -21710 70105 117052 111254 58944 -87103 -47772 91375
23612 91375 127525 42029 23421 -16760 -96864 -121348 -152314 -78321 -111873 -83252 -31580 99448
23600 99448 94710 -32087 -139984 -7236 77050 23462 -41959 -32608 -39541 -58712 -71837 -113793
23588 -113793 -130741 -54175 8527 -12987 5333 -6416 25690 -79948 -83551 21718 89273
23577 89273 69023 -40584 -24417 39781 26556 82673 61410 5762 24486 107101 25913
23566 25913 -51145 -102897 -182374 -155904 -141535 -118782 -114317 -56669 7198 104931 149540 111636
23554 111636 66290 54589 55851 38646 -31402 -72214 -87741 -45918 -501 40317 62040 33628
$$ packed form
23635g535j0798j175J0631k9308j6884N3735J6092M3253O4525K8164k8111k0524
23623A02065M4372j11514p8400K1767R1815M6947n798n2310j46047L9331J39147
23612I1375L6150q5496j8608m0181q0104k4484l0966P3993l3552K8621N1672J31028
23600I9448m738j26797j07897J32748Q4286n3588o5421R351o933j9171j3125m1956
23588a13793j6948P6566O2702k1514J8320j1749L2106j05638l603J05269O7555
23577H9273k0250j09607J6167O4198j3225N6117k1263n5648J8724Q2615q1188
23566B5913p7058n1752p9477K6470J4369K2753M465N7648O3867R7733M4609l7904
23554A11636m5346j1701J262j7205p0048m0812j5527M1823M5417M0818K1723k8412
$$ plain form
23542 33628 98565 96731 61136 12150 6364 -15024 -13726 -46405 -19729 -1488 57266 41377
23530 41377 4733 -16145 -21104 48471 -19175 -64591 -21312 89782 93963 125129 77036 99201
23518 99201 207083 161784 130048 75129 -50457 -18393 26987 26419 -76739 -92822 -27546
23507 -27546 38825 9218 -70486 -89409 -84377 -37988 17893 -36349 -165368 -213937 -140094 -47772
23495 -47772 -46318 -128309 -60182 -42026 -74213 -90463 -122256 -122036 -158899 -90780 -53333 19373
23483 19373 104876 82163 1986 -79625 -66556 -90876 27061 -53667 -40188 48653 -60159
23472 -60159 -107490 -90455 125006 286857 259103 210570 154317 102517 89144 103787 64237
23461 64237 27289 72450 -34089 69579 121200 87096 -105103 -54504 7858 -32690 -91633
$$ packed form
23542C3628O4937j834l5595m8986n786k1388J298l2679K6676J8241N8754j5889
23530D1377l6644k0878m959O9575o7646m5416M3279J11094M181L1166m8093K2165
23518I9201J07882m5299l1736n4919j25586L2064M5380n68j03158j6083O5276
23507b7546O6371k9607p9704j8923N032M6389N5881n4242j29019m8569P3843R2322
23495d7772J454q1991O8127J8156l2187j6250l1793K20l6863O8119L7447P2706
23483A9373Q5503k2713q0177q1611J3069k4320J17937q0728J3479Q8841j08812
23472f0159m7331J7035K15461J61851k7754m8533n6253n1800j3373J4643l9550
23461F4237l6948M5161j06539J03668N1621l4104j92199N0599O2362m0548n8943
$$ plain form
23450 -91633 -75269 34620 86487 63974 110033 161262 60640 9417 6447 -32781 16018
23439 16018 46786 -16144 -38012 -58575 -54109 -92108 -75255 -83832 -89895 -36172 20639 -33612
23427 -33612 -16689 46532 46160 10156 33436 25024 86696 92844 23729 30293 58959 14655 -69710
23414 -69710 -102708 -115906 -108968 -134777 -178278 -79918 -22571 29995 88058 75085 59108 44631
23402 44631 22109 -119926 -208028 -54031 -4470 -28614 -73379 -102458 -64716 -74468 63222
23391 63222 -49269 -124929 -31197 -185656 -233938 -237558 -240449 -189497 10778 48513 -25982
23380 -25982 -24658 18165 97145 74475 78648 24341 43566 49402 44157 -15746 -42772 -15628
23368 -15628 7982 -25945 -29282 -99084 -103771 -28612 32123 -42423 -122218 -80240 -15587 -58504
$$ packed form
23450i1633J6364J09889N1867k2513M6059N1229j00622n1223k970l9228M8799
23439A6018L0768o2930k1868k0563M466l7999J6853q577o063N3723N6811n4251
23427c3612J6923O3221l72l6004K3280q412O1672O148o9115O564K8666m4304q4365
23414f9710l2998j3198O938k5809m3501R8360N7347N2566N8063j2973j5977j4477
23402D4631k2522j42035q8102J53997M9561k4144m4765k9079L7742r752J37690
23391F3222j12491p5660R3732j54459m8282l620k891N0952K00275L7735p4495
23380b5982J324M2823P8980k2670M173n4307J9225N836n245n9903k7026K7144
23368a5628K3610l3927l337o9802m687P5159O0735p4546p9795M1978O4653m2917
$$ plain form
23356 -58504 -139456 -175823 -213464 -191159 -64444 135373 119918 88012 29889 36646 67056
23345 67056 23025 69939 145367 29359 -157636 -165211 -106919 -102689 -123815 -194668 -135609 -21940
23333 -21940 1911 -55756 -87209 -72783 4945 99900 158505 144903 133108 117164 68118 -19349
23321 -19349 -2611 96254 103342 13267 -121299 -65618 64482 95076 56850 76481 85312 99597
23309 99597 97685 102363 109652 -33141 -112133 -150179 -162418 -144944 -161737 -122683 -83067 23980
23297 23980 32439 68084 57746 -23585 -28264 -56085 11542 77112 106114 36171 -43524 28398
23285 28398 78641 121975 103852 14295 -46655 -35070 48930 31130 -8154 -59028 -28912 -69786
23273 -69786 -38088 80727 119077 127964 141941 53944 -3855 -43145 -76795 -119933 -70607 64259
$$ packed form
23356e8504q0952l6367l7641K2305J26715J99817j5455l1906n8123O757L0410
23345F7056m4031M6914P5428j16008j86995p575N8292M230k1126p0853N9059J13669
23333b1940K3851n7667l1453J4426P7728R4955N8605j3602j1795j5944m9046q7467
23321a9349J6738R8865P088r0075j34566N5681J30100L0594l8226J9631Q831J4285
23309I9597j912M678P289j42793p8992l8046j2239J7474j6793L9054L9616J07047
23297B3980Q459L5645j0338q1331m679k7821O7627O5570K9002o9943p9695P1922
23285B8398N0243M3334j8123q9557o0950J1585Q4000j7800l9284n0874L0116m0874
23273f9786L1698J18815L8350Q887J3977q7997n7799l9290l3650m3138M9326J34866
$$ plain form
23261 64259 32118 81069 107166 20288 -74473 -85247 32137 69613 71784 53892 72904 49989
23249 49989 46115 72225 41985 19793 12727 -56218 -39747 45328 -24905 -25239 94779 158750
23237 158750 159805 120423 11049 -76166 -49840 -54521 -28720 20672 30673 82744 100661 21131
23225 21131 -70416 -1044 -6269 89839 55030 41998 24038 7266 -52625 -66643 -1349 -28943
23213 -28943 -46471 -623 70233 68359 30078 -21466 -33541 63785 69155 38643 59297 61117
23201 61117 36148 -44354 -105475 -88145 6674 -15782 -87853 -44772 -20497 -27910 13446 56427
23189 56427 44016 50118 -52282 -184921 -207881 -158836 -75607 6344 91411 29173 31032 80570
23177 80570 89320 79532 36314 4940 -81885 -81729 -70817 -136279 -227765 -354241 -364971 -205133
$$ packed form
23261F4259l2141M8951K6097q6878r4761j0774J17384L7476K171j7892J9012k2915
23249D9989l874K6110l0240k2192p066o8945J6471Q5075p0233l34J20018O3971
23237A58750J055l9382j09374q7215K6326m681K5801M9392J0001N2071J7917p9530
23225B1131r1547O9372n225R6108l4809j3032j7960j6772n9891j4018O5294k7594
23213b8943j7528M5848P0856j874l8281n1544j2075R7326N370l0512K0654J820
23201F1117k4969q0502o1121J7330R4819k2456p2071M3081K4275p413M1356M2981
23189E6427j2411O102j02400j32639k2960M9045Q3229Q1951Q5067o2238J859M9538
23177H0570Q750r788m3218l1374q6825J56J0912o5462r1486j26476j0730J59838
$$ plain form
23165 -205133 -110824 4877 21477 47006 -9475 -61401 -72078 -78601 -133921 -135617 -82797 44663
23153 44663 27949 -39224 -50766 5471 78466 153360 218327 106409 -13697 -13125 -47737 -6040
23141 -6040 -34211 -30802 -24117 -13013 59095 51372 63220 42433 -45600 57566 181833 136165
23129 136165 81062 118740 174772 136544 101788 52676 -73128 -160455 -23297 -28862 -16232
23118 -16232 -31349 -23295 20347 36843 -40733 -38656 26028 -1332 78423 66376 27193 -79982
23106 -79982 -116396 -70765 -73399 -85114 10499 77257 168578 282421 152969 101180 97764 73338
23094 73338 -50183 8859 83918 14934 -4487 -39549 -39413 -39693 -3335 15875 -57175 -47929
23082 -47929 12949 45789 49356 104710 79651 159131 79818 66175 56612 -13127 48686 85108
$$ packed form
23165b05133R4309J15701J6600K5529n6481n1926j0677o523n5320j696N2820J27460
23153D4663j6714o7173j1542N6237P2995P4894O4967j11918j20106N72l4612M1697
23141f040k8171L409O685J1104P2108p723J1848k0787q8033J03166J24267m5668
23129A36165n5103L7678N6032l8228l4756m9112j25804q7327J37158n565J2630
23118a6232j5117Q054M3642J6496p7576K077O4684k7360P9755j2047l9183j07175
23106g9982l6414M5631k634j1715R5613O6758R1321J13843j29452n1789l416k4426
23094G3338j23521N9042P5059o8984j9421l5062J36k80L6358J9210p3050R246
23082d7929O0878L2840L567N5354k5059P9480p9313j3643r563o9739O1813L6422
$$ plain form
23070 85108 50852 49705 48165 -90498 -134881 -5578 17193 -32115 -58620 -82409 -76368 -78316
23058 -78316 -49102 -96628 -119341 -177912 -199467 -167834 -70869 -94378 -162026 -182674 -215607 -265191
23046 -265191 -252142 -192223 -144736 -81222 -53904 -51214 35155 32142 93471 103402 105980 125815
23034 125815 192394 160937 184137 162396 80652 2788 -71993 -47884 -129982 -173206 -38487
23023 -38487 33624 -8554 -108457 -154310 -52110 29591 38597 -42470 -140525 -58730 13806 18396
23011 18396 -12025 1479 -38821 -10859 62367 38085 -107326 -165312 -130566 -147933 -167567
23000 -167567 -74383 -88791 -111679 -99257 -131908 -88909 -6445 74209 152131 129612 132165 37273
22988 37273 51617 62066 36829 -129617 -166131 -161112 -143193 -74092 -22883 15205 39877 18825
$$ packed form
23070H5108l4256j147j540j38663m4383J29303K2771m9308k6505k3789O041j948
23058g8316K9214m7526k2713n8571k1555L1633R6965k3509o7648k0648l2933m9584
23046b65191J3049N9919M7487O3514K7318K690Q6369l013O1329R931K578J9835
23034A25815O6579l1457K3200k1741q1744p7864p4781K4109q2098m3224J34719
23023c8487P2111m2178r9903m5853J02200Q1701R006q1067r8055Q1795P2536M590
23011A8396l0421J3504m0300K7962P3226k4282j45411n7986L4746j7367j9634
23000a67567R3184j4408k2888J2422l2651M2999Q2464Q0654P7922k2519K553r4892
22988C7273J4344J0449k5237j66446l6514N019J7919O9101N1209L8088K4672k1052
$$ plain form
22976 18825 79618 -3155 -49760 77343 89564 40008 26259 110504 88030 -53147 -145234
22965 -145234 -132414 -74548 -14703 35314 69539 98982 193507 145981 129719 145017 50157
22954 50157 -38715 -15360 55797 55295 -29038 -93386 -153616 -65190 78102 136137 96429 -48218
22942 -48218 -88240 -52551 -92169 -131482 -122748 -3453 -31323 -82243 -77067 -61707 -22712 15168
22930 15168 48581 100169 36744 24061 -33312 -73682 -134428 -144233 -66389 -47741 35137 154479
22918 154479 181377 187377 102367 -3215 -22899 -163173 -42130 -100679 -128906 -127766 -80492
22907 -80492 -64404 5052 17992 -56707 -147661 -235771 -215540 -136998 -242766 -177041 -146855
22896 -146855 -63496 42364 117092 195654 134812 44386 43643 23092 14642 33026 87285 -28788
$$ packed form
22976A8825O0793q2773m6605J27103J2221m9556j3749Q4245k2474j41177r2087
22965a45234J2820N7866N9845N0017L4225K9443R4525m7526j6262J5298r4860
22954E0157q8872K3355P1157n02q4333o4348o0230Q8426J43292N8035l9708j44647
22942d8218m0022L5689l9618l9313Q734J19295k7870n0920N176J5360L8995L7880
22930A5168L3413N1588o3425j2683n7373m0370o0746r805P7844J8648Q2878J19342
22918A54479K6898O000q5010j05582j9684j40274J21043n8549k8227J140M7274
22907h0492J6088O9456J2940p4699r0954q8110K0231P8542j05768O5725L0186
22896a46855Q3359J05860P4728P8562o0842r0426p43k0551q450J8384N4259j16073
$$ plain form
22884 -28788 -92850 30014 117841 80414 25647 67789 45144 -14745 -60195 33782 56095
22873 56095 15209 -39147 -25604 92509 41848 128029 175668 228852 100814 -5281 -53663
22862 -53663 -76125 -55185 -68855 -93480 -92152 -6969 212425 227671 107701 31219 9549
22851 9549 17968 82004 136472 100273 144415 192699 194708 169773 81186 80227 39930 -35630 80425
22838 80425 170858 236198 211553 117774 -21633 -77910 -16321 34331 30098 39461 59017 44095
22826 44095 68862 73213 61015 35767 102070 38499 -17071 45278 66556 -25547 -85153 -145764
22814 -145764 -61733 -59491 -32516 -26143 -88643 -55006 2736 1664 46461 111123 -1025 -82719
22802 -82719 -19082 84554 32872 57069 78355 90320 22301 -18407 21955 21569 18439 84261
$$ packed form
22884b8788o4062J22864Q7827l7427n4767M2142k2645n9889m5450R3977K2313
22873E6095m0886n4356J3543J18113n0661Q6181M7639N3184j28038j06095m8382
22862e3663k2462K0940j3670k4625J328Q5183K19394J5246j19970p6482k1670
22851I549Q419O4036N4468l6199M4142M8284K009k4935q8587r59m0297p5560J16055
22838H0425R0433O5340k4645r3779j39407n6277O1589N0652m233R363J9556j4922
22826D4095K4767M351j2198k5248O6303o3571n5570O2349K1278r2103n9606o0611
22814a45764Q4031K242K6975O373o2500L3637N7742j072M4797O4662j12148q1694
22802h2719O3637J03636n1682K4197K1286J1965o8019m0708M0362l86l130O5822
$$ plain form
22790 84261 172624 170911 55194 7645 83880 136544 54298 95455 93834 78802 20981 10098
22778 10098 -32291 -161667 -240385 -124147 -35142 142443 223359 166356 115389 72274 131726
22767 131726 222727 250580 237856 114458 -91002 -120582 -45511 -61998 15362 55496 12364
22756 12364 -85055 -64598 -87821 -152464 -123623 -104926 -46416 -18148 -34431 -43353 -97632 -49504
22744 -49504 -934 103752 159461 130486 92735 24757 -36188 2608 49751 68813 138625
22733 138625 115166 106054 149241 70289 -24351 -93367 -122822 -45960 -14859 89608 83440 16878
22721 16878 -10728 9199 41890 54288 62856 65608 151647 274638 153854 -30760 -22715 92717
22709 92717 99182 65673 50177 57852 -12539 43824 66578 60268 122525 98007 -631 -23678
$$ packed form
22790H4261Q8363j713j15717m7549P6235N2664q2246M1157j621j5032n7821j0883
22778A0098m2389j29376p8718J16238Q9005J77585Q0916n7003n0967m3115N9452
22767A31726R1001K7853j2724j23398k05460k9580P5071j6487P7360M0134m3132
22756A2364r7419K0457k3223o4643K8841J8697N8510K8268j6283q922n4279M8128
22744d9504M8570J04686N5709k8975l7751o7978o0945L8796M7143J9062O9812
22733A38625k3459r112M3187p8952r4640o9016k9455P6862L1101J04467o168o6562
22721A6878k7606J9927L2691J2398Q568K752Q6039J22991j20784j84614Q045J15432
22709I2717O465l3509j5496P675p0391N6363K2754o310O2257k4518r8638k3047
$$ plain form
22697 -23678 -87068 -52922 -20463 -49259 -113736 -195514 -207170 -184309 -127922 -126556 -95694 20823
22685 20823 103494 117963 -4018 -72558 -97165 -127575 -164938 -189741 -139353 -149623 -129891
22674 -129891 -107175 -136204 -83771 -85088 -211095 -189561 -143224 -162198 -149091 -132327 -119008
22663 -119008 -106727 -87146 -76322 -60306 -49622 -96705 -135109 -96960 -138701 -133358 -24004
22652 -24004 -93150 -105066 -41972 -28244 -91140 -75744 -98411 -100549 11160 109884 153146 209830
22640 209830 120062 12043 17557 54546 69360 107014 130325 149798 109516 66176 70574 23926
22628 23926 30622 41277 118558 198495 150073 52786 -3765 -77686 -132939 -101737 -30908 5260
22616 5260 27944 -23654 -9644 -82075 -154482 -107379 -45609 8404 44490 105632 68819 60932
$$ packed form
22697b3678o3390L4146L2459k8796o4477q1778j1656K2861N6387J366L0862J16517
22685B0823Q2671J4469j21981o8540k4607l0410l7363k4803N0388j0270J9732
22674a29891K2716k9029N2433j317j26007K1534M6337j8974J3107J6764J3319
22663a19008J2281J9581J0824J6016J0684m7083l8404L8149m1741N343J09354
22652b4004o9146j1916O3094J3728o2896J5396k2667k138J11709R8724M3262N6684
22640B09830q9768j08019N514L6989J4814L7654K3311J9473m0282m3340M398m6648
22628B3926O696J0655P7281P9937m8422r7287n6551p3921n5253L1202P0829L6168
22616E260K2684n1598J4010p2431p2407M7103O1770N4013L6086O1142l6813p887
$$ plain form
22604 60932 23969 3423 43607 -9326 -97008 -65464 -42025 37512 43753 63854 38099 8599
22592 8599 37237 34510 -53250 38408 30393 39165 74075 28761 52765 182936 287841 156350
22580 156350 101337 107977 60726 5985 105808 125196 -32528 -82949 -193902 -245676 -162775
22569 -162775 -112555 -111571 -172763 -210836 -264484 -199507 -75257 -12925 35129 -96831 -87172 -68199
22557 -68199 -100034 -131056 -201497 -168279 -25642 79727 97461 64455 -64717 -107341 -136136
22546 -136136 -57432 44355 35815 -57396 -88893 -87609 -35743 -31725 -25061 44132 38522 67685
22534 67685 41488 -9245 -44334 7654 -3188 -438 -21010 22028 71525 66521 121874 71193
22522 71193 -1871 -120927 -105637 -94645 -124845 -83707 -137005 -130228 -189926 -151029 -98445 -31678
$$ packed form
22604F0932l6963k0546M0184n2933q7682L1544K3439P9537O241K0101k5755k9500
22592H599K8638k727q7760R1658q015Q772L4910m5314K4004J30171J04905j31491
22580A56350n5013O640m7251n4741R9823J9388j57724n0421j10953n1774Q2901
22569a62775N0220R84o1192l8073n3648O4977J24250O2332M8054j31960R659J8973
22557f8199l1835l1022p0441L3218J42637J05369J7734l3006j29172m2624k8795
22546a36136P8704J01787q540r3211l1497J284N1866M018O664O9193n610K9163
22534F7685k6197n0733l5089N1988j0842K750k0572M3038M9497n004N5353n0681
22522G1193p3064j19056J5290J0992l0200M1138n3298O777n9698L8897N2584O6767
$$ plain form
22510 -31678 -60305 -164368 -160845 -176595 -96900 -97964 -211192 -167701 -103279 -33352 -70091 -134694
22498 -134694 -18607 -15203 54129 15669 -9567 52292 90098 -41545 -71899 -1727 127011
22487 127011 96020 15927 13406 71538 95924 46807 -24923 30234 77064 37114 71803 62761
22475 62761 107787 108921 -44424 -121943 -138904 -127258 -141817 -47044 -32698 -48621 -116395 -224871
22463 -224871 -201670 -59817 -17115 -16763 -3197 -2281 -54825 -1752 83490 152329 59591 -43118
22451 -43118 -81145 -158568 -189615 -86373 -4390 -37463 -63309 16211 73212 50295 94456
22440 94456 61313 -29473 -22173 63555 -40797 -143670 -80282 -17330 61148 88533 80676 108311
22428 108311 120386 121161 -4989 -40158 71921 113747 89927 167095 184902 66069 110795
$$ packed form
22510c1678k8627j04063L523j5750P9695j064j13228M3491O4422O9927l6739o4603
22498a34694J16087L404O9332l8460k5236O1859L7806j31643l0354P0172J28738
22487A27011l0991q0093k521N8132K4386m9117p1730N5157M6830l9950L4689r042
22475F2761M5026J134j53345p7519j6961J1646j4559R4773J4346j5923o7774j08476
22463b24871K3201J41853M2702L52J3566R16n2544N3073Q5242O8839r2738j02709
22451d3118l8027p7423l1047J03242Q1983l3073k5846P9520N7001k2917M4161
22440I4456l3143r0786P300Q5728j04352j02873O3388O2952P8478K7385p857K7635
22428A08311J2075P75j26150l5169J12079M1826k3820P7168J7807j18833M4726
$$ plain form
22417 110795 133421 142736 93310 25319 88115 107192 101343 65005 90513 99793 16859 13148
22405 13148 -26531 -43299 -38501 -32079 -48985 -13342 8491 -52602 -66332 -44162 -64807 -3346
22393 -3346 5433 -9079 -65491 -73240 -34994 -69828 -159049 -151226 -218895 -209666 -193044 -209917 -233524
22380 -233524 -140309 -108753 -125564 -110138 -128791 -188636 -100273 -19251 -96272 -152178 -194968
22369 -194968 -106619 -40631 -76498 -96836 -149726 -133188 -98515 -139034 -88179 -110040 -88716
22358 -88716 -38678 -126516 -145847 -135219 -85517 -39651 -74120 -59837 -6829 22298 -53897 -108926
22346 -108926 -65767 30308 57558 -13236 50693 82115 47244 -74560 -75855 -155779 -150536 -185874
22334 -185874 -206606 -239205 -215229 -178260 -83850 26883 -7713 -14543 56633 112873 155104
$$ packed form
22417A10795K2626R315m9426o7991O2796J9077n849l6338K5508R280q2934l711
22405A3148l9679j6768M798O422j6906L5643K1833o1093j3730K2170k0645O1461
22393c346Q779j4512n6412p749L8246l4834q9221P823o7669R229J6622j6873k3607
22380b33524R3215L1556j6811J5426j8653n9845Q8363Q1022p7021n5906m2790
22369a94968Q8349O5988l5867k0338n2890J6538L4673m0519N0855k1861K1324
22358h8716N0038q7838j9331J0628M9702M5866l4469J4283N3008K9127p6195n5029
22346a08926M3159R6075K7250p0794O3929L1422l4871j21804j295p9924N243l5338
22334a85874k0732l2599K3976L6969R4410J10733l4596o830P1176N6240M2231
$$ plain form
22323 155104 118601 30113 -28360 -27054 -13358 -7695 43384 28143 -21559 -31866 -28717 -96407
22311 -96407 -91651 -166516 -112113 -11979 -16146 -116400 -48283 -30500 26777 85499 166534 173204
22299 173204 190525 59503 -7944 -95509 -177552 -93952 -81100 -147741 -30566 61173 86892
22288 86892 109549 38882 -93921 -111314 -78956 -60087 49573 1353 -29386 59 3073
22277 3073 40460 37235 -49567 -99201 -160839 -163749 -132512 6908 66208 -13417 -108837 -212092
22265 -212092 -237532 -118559 -52770 -55587 -203793 -314870 -247484 -172901 -240976 -266978 -173245
22254 -173245 -91170 -35873 -38380 -24368 -47165 -41462 27418 51772 -40528 -81418 45489 81152
22242 81152 31129 -37243 -51149 1794 49538 48746 84887 44773 13473 -6737 -77461 -84091
$$ packed form
22323A55104l6503q8488n8473J306J3696N663N1079j5241m9702j0307L149o7690
22311i6407M756p4865N4403J00134m167j00254O8117J7783N7277N8722Q1035O670
22299A73204J7321j31022o7447q7565q2043Q3600J2852o6641J17175R1739K5719
22288H6892K2657p0667j32803j7393L2358J8869J09660m8220l0739K9445L014
22277C073L7387l225q6802m9634o1638k910L1237J39420N9300p9625r5420j03255
22265b12092k5440J18973O5789k817j48206j11077O7386P4583o8075k6002R3733
22254a73245Q2075N5297k507J4012k2797N703O8880K4354r2300m0890J26907L5663
22242H1152n0023o8372j3906N2943M7744p92L6141m0114l1300k0210p0724o630
$$ plain form
22230 -84091 -174938 -221947 -266590 -219187 -283200 -156778 -63083 -4302 63950 106186 112349 46453
22218 46453 -19680 53091 75721 83498 102110 79629 40120 58177 76423 65968 110698 59059
22206 59059 20214 24513 -12106 5615 -24013 -1775 33877 100721 73614 22260 -52399 27011
22194 27011 -9538 -69368 -86649 -100465 -57375 30319 -33231 -58311 -191938 -215263 -155572
22183 -155572 -117499 -78205 -3414 -24487 -158299 -163214 -84998 -73979 28746 16690 -20339
22172 -20339 68508 90253 61312 20037 -758 -73 27115 10644 156086 132348 46844 117332
22160 117332 57495 18289 -33803 -11968 -73046 -63906 10521 -79864 -94099 -102938 -113006 -94337
22148 -94337 -52892 -1068 -36628 -75504 -86472 -59382 -59035 -27601 -23966 -8365 64780 -899
$$ packed form
22230h4091r0847m7009m4643M7403o4013J26422R3695N8781O8252M2236O163o5896
22218D6453o6133P2771K2630P777J8612k2481l9509J8057J8246j0455M4730n1639
22206E9059l8845M299l6619J7721k9628K2238L5652O6844k7107n1354p4659P9410
22194B7011l6549n9830j7281j3816M3090Q7694o3550k5080j33627k3325N9691
22183a55572L8073L9294P4791k1073j33812m915P8216J1019J02725j2056l7029
22172b0339Q8847K1745k8941m1275k0795O85K7188j6471J45442k3738q5504P0488
22160A17332n9837l9206n2092K1835o1078R140P4427r0385j4235q839j0068J8669
22148i4337M1445N1824l5560l8876j0968K7090L47L1434L635J5601P3145o5679
$$ plain form
22136 -899 17434 9135 -25230 -60739 -93706 -186030 -253121 -194123 -129097 -122305 -89811 -31878
22124 -31878 27813 -17548 -15242 4371 17060 13640 16882 23060 -32312 -29776 -37360 -6305 37147
22111 37147 -86323 -2243 35564 -9822 -89812 -133707 -172492 -199140 -169680 -75226 -42222
22100 -42222 -53506 4525 53087 39202 -20386 20470 76328 37950 -15798 3201 -68106 -172936
22088 -172936 -195974 -129043 -20996 -46459 -107671 -126893 -127724 -69042 -54620 -94674 -176306 -74330
22076 -74330 -87934 -92227 -62397 -73893 -116820 -165769 -40591 -25766 -14479 -8822 -33505 -60286
22064 -60286 -48272 -31814 -44247 -82305 -437 70990 58355 35010 37299 -18757 -41265 68382
22052 68382 96487 16848 -26815 42181 17043 -35333 -64508 -102007 -106727 81072 173671 91560
$$ packed form
22136h99J8333q299l4365l5509l2967r2324o7091N8998O5026O792L2494N7933
22124c1878N9691m5361K306J9613J2689l420L242O178n5372K536p584L1055M3452
22111C7147j23470Q4080L7807m5386p9990m3895l8785k6648K9460R4454L3004
22100d2222j1284N8031M8562j3885n9588M0856N5858l8378n3748J8999p1307j04830
22088a72936k3038O6931J08047k5463o1212j9222q31N8682J4422m0054q1632J01976
22076g4330j3604m293K9830j1496m2927m8949J25178J4825J1287N657k4683k6781
22064f0286J2014J6458j2433l8058Q1868P1427j2635k3345K289n6056k2508J09647
22052F8382K8105p9639m3663O8996k5138n2376k9175l7499m720J87799R2599q2111
$$ plain form
22040 91560 -34192 -84740 -128327 -65518 -37760 28101 -62179 -206814 -224762 -102975 100885
22029 100885 184235 143433 81169 129319 54403 93188 61536 34180 45124 -18548 -140257
22018 -140257 -247937 -180584 -42643 -69372 -118443 -152594 -166421 -79378 -128578 -50626 30725
22007 30725 18064 12366 -70037 -48287 -67215 -64510 -53707 -39803 33353 -7228 -30763 -23870
21995 -23870 -32613 4132 49240 71942 107161 161941 100346 13431 15436 -50034 -91864 -40228
21983 -40228 48003 28187 66070 93089 64706 -4310 -80063 -117019 -89574 -142 17884 3925
21971 3925 87892 152918 92534 -25286 -20854 51264 44177 -33508 -124077 -97377 -14626 31710
21959 31710 28498 53086 163887 78634 -33742 -51138 -32168 -45182 -51359 15609 91954 56259
$$ packed form
22040I1560j25752n0548m3587O2809K7758O5861r0280j44635j7948J21787K03860
22029A00885Q3350m0802o2264M8150p4916L8785l1652k7356J0944o3672j21709
22018a40257j07680O7353J37941k6729m9071l4151j3827Q7043m9200P7952Q1351
22007C0725j2661n698q2403K1750j8928K705J0803J3904P3156m0581k3535O893
21995b3870q743L6745M5108K2702L5219N4780o1595q6915K005o5470m1830N1636
21983d0228Q8231j9816L7883K7019k8383o9016p5753l6956K7445Q9432J8026j3959
21971C925Q3967O5026o0384j17820M432P2118p087p7685r0569K6700Q2751M6336
21959C1710l212K4588J10801q5253j12376j7396J8970j3014o177O6968P6345l5695
$$ plain form
21947 56259 11045 12369 -4994 -29281 -69662 -21602 -7883 30949 22501 53289 12105 80593
21935 80593 4916 -108685 -91100 -42910 -45389 -13218 -73402 -52885 27785 21594 2653 -70068
21923 -70068 -52809 25037 7257 -19715 -43909 -78758 -140536 -134191 -81484 -26779 -58727 -39867
21911 -39867 -36707 -105173 -111005 -123475 -113863 -74085 -126056 -88499 16991 36570 78209 128298
21899 128298 103055 46580 -61505 -24899 -48141 -123972 -134511 -11911 -40810 -88543 -40583
21888 -40583 -43940 -173382 -126358 -71768 -12166 -81424 -174276 -151636 -63070 -31608 -37317 10526
21876 10526 1988 -22113 19560 66734 51846 8686 -62201 -132488 -171495 -181580 -87624 -61578
21864 -61578 -108495 -9210 -61173 -65638 63515 75036 39084 71456 54269 67884 26277 -61963
$$ packed form
21947E6259m5214J324j7363k4287m0381M8060J3719L8832q448L0788m1184O8488
21935H0593p5677j13601J7585M8190k479L2171o0184K0517Q0670o191j8941p2721
21923g0068J7259P7846j7780k6972k4194l4849o1778O345N2707N4705l1948J8860
21911c9867L160o8466n832j2470R612L9778n1971L7557J05490J9579M1639N0089
21899A28298k5243n6475j08085L6606k3242p5831j0539J22600k8899m7733M7960
21888d0583l357j29442M7024N4590N9602o9258r2852K2640Q8566L1462n709M7843
21876A0526q538k4101M1673M7174j4888m3160p0887p0287l9007j0085R3956K6046
21864f1578m6917R9285n1963m465J29153J1521l5952L2372j7187J3615m1607q8240
$$ plain form
21852 -61963 -91227 -152878 -127647 -105056 -113589 -47994 -58292 -43187 108682 159397 -2670
21841 -2670 -50959 -79854 -125609 -130730 -18416 17777 121624 73926 17456 37411 17247 -34738
21829 -34738 -28203 -79190 -29121 -9789 -5419 6660 -48715 -42149 -41425 54301 161376 139353
21817 139353 102970 55635 66605 7338 8342 -45957 -82643 -49203 23224 38056 -14786 -15416
21805 -15416 -38470 -105687 -139128 -143027 -136065 -78879 7697 64683 93558 71440 74401 119743
21793 119743 146355 121487 67415 61948 127735 -18312 -134589 -172213 -100328 60464 58656
21782 58656 42641 24204 15135 39516 13328 -27467 -76243 -46112 -103949 -79609 -138427 -176788
21770 -176788 -133446 -59304 690 -42949 20967 44861 -13168 -8724 -56447 -97324 -138151 -192736
$$ packed form
21852f1963k9264o1651K5231K2591q533O5595j0298J5105J51869N0715j62067
21841b670m8289k8895m5755n121J12314L6193J03847m7698n6470J9955k0164n1985
21829c4738O535n0987N0069J9332M370J2079n5375O566P24R5726J07075k2023
21817A39353l6383m7335J0970n9267J004n4299l6686L3440P2427J4832n2842o30
21805a5416k3054o7217l3441l899O962N7186Q6576N6986K8875k2118K961M5342
21793A19743K6612k4868n4072n467O5787j46047j16277l7624P1885J60792j808
21782E8656j6015j8437r069K4381k6188m0795m8776L0131n7837K4340n8818l8361
21770a76788M3342P4142N9994m3639O3916K3894n8029M444m7723m0877m0827n4585
$$ plain form
21758 -192736 -273392 -290188 -142881 -131708 -156052 -128306 -189298 -210036 -167698 -169062 -122226
21747 -122226 -101196 -138848 -21551 18096 -1422 -89762 -6727 27219 10163 -32452 -64650
21736 -64650 -1096 14039 -6086 -56956 -121052 -44930 -92784 -232558 -240380 -199309 -86777
21725 -86777 -91801 -86919 -186263 -111020 -61257 1148 10626 41398 37803 -53678 -148201 -112657
21713 -112657 -62767 -43513 -67943 -25737 -5729 -65658 -19765 10178 62955 95644 82183
21702 82183 26501 65585 88847 136678 87843 -1979 -155000 -174822 -90340 -108524 -176762
21691 -176762 -206746 -205193 -131786 -7320 -7742 51200 114724 132576 86275 116992 112858 58057
21679 58057 26950 20771 12377 -6709 -79758 -111112 -92582 -122675 -194486 -175485 -102909 -154906
$$ packed form
21758a92736q0656j6796J47307J1173k4344K7746o0992k0738M2338j364M6836
21747a22226K1030l7652J17297L9647j9518q8340Q3035L3946j7056m2615l2198
21736f4650O3554J5135k0125n0870o4096P6122m7854j39774p822M1071J12532
21725h6777n024M882r9344P5243M9763O2405R478L0772l595r1481r4523L5544
21713a12657M9890J9254k4430M2206K0008n9929M5893K9943N2777L2689j3461
21702H2183n5682L9084K3262M7831m8835q9822j53021j9822Q4482j8184o8238
21691a76762k9984J553P3407J24466m22N8942O3524J7852m6301L0717m134n4801
21679E8057l1107o179q394j9086p3049l1354J8530l0093p1811J9001P2576n1997
$$ plain form
21667 -154906 -71368 -9545 -30546 -75110 -122072 -66423 6359 17478 -17006 24447 29743 -98763
21655 -98763 -79949 -687 3097 26981 54376 17058 32838 70246 43996 -13950 63410 196742
21643 196742 259939 191838 166484 164035 121427 90819 79985 78884 59700 77540 120538 14955
21631 14955 15656 17691 -17980 4712 -3873 78940 116094 -7502 -33592 12844 30879 -60570
21619 -60570 -193226 -199355 -166525 -59960 16286 12449 12740 -89108 -153325 -143798 -139400 -82939
21607 -82939 -63705 -101793 -129420 -85435 -38585 -83941 -160361 -181639 -89007 58953 37518
21596 37518 -42393 5632 33868 29742 -3429 -49166 -77381 -17773 14258 71592 64437 20655
21584 20655 -61702 -135373 -108298 -110827 -129546 -95119 -75858 -30079 80405 137430 115069 -8839
$$ packed form
21667a54906Q3538O1823k1001m4564m6962N5649P2782J1119l4484M1453N296j28506
21655i8763J8814P9262L784K3884K7395l7318J5780L7408k6250n7946P7360J33332
21643A96742O3197o8101k5354k449m2608l0608j0834j101j9184J7840M2998j05583
21631A4955P01K035l5671K2692q585Q2813L7154j23596k6090M6436J8035r1449
21619f0570j32656o129L2830J06565P6246l837K91j01848o4217R527M398N6461
21607h2939J9234l8088k7627M3985M6850m5356p6420k1278R2632J47960k1435
21596C7518p9911M8025K8236m126l3171m5737k8215N9608L2031N7334p155m3782
21584B0655q2357p3671K7075k529j8719L4427J9261M5779J10484N7025k2361j23908
$$ plain form
21572 -8839 -58610 -22924 29326 40637 171529 166752 137273 76635 -20509 -38792 25095 103452
21560 103452 66840 -50759 -59013 -56726 -106413 -156947 -159486 -68319 -61780 -40966 -68440 -96919
21548 -96919 -142589 -140021 -118378 -78112 -21714 -118057 -179133 -82781 50332 73000 -12793 -63434
21536 -63434 -113784 -133940 -51300 865 9568 -38244 -110983 -117986 -89514 -17978 -1351 88482
21524 88482 147266 77263 34446 17761 -30098 -56366 61436 159107 183273 130609 99604
21513 99604 18047 38454 44995 130759 146916 107654 19689 -165418 -213696 -96284 -14797
21502 -14797 96966 141605 105740 60455 50485 -18560 -88815 -129941 -125748 -141220 -179034 -148448
21490 -148448 -63865 -43843 -64139 -122094 -222936 -176684 -209278 -200859 -104588 -139970 -184367
$$ packed form
21572h839m9771L5686N2250J1311J30892m777k9479o0638r7144j8283O3887P8357
21560A03452l6612j17599q254K287m9687n0534k539R1167O539K0814k7474k8479
21548i6919m5670K568K1643M0266N6398r6343o1076R6352J33113K2668q5793n0641
21536f3434n0350k0156Q2640N2165Q703m7812p2739p003K8472P1536J6627Q9833
21524H8482N8784p0003m2817j6685m7859k6268J17802R7671K4166n2664l1005
21513I9604q1557K0407O541Q5764J6157l9262q7965j85107m8278J17412Q1487
21502a4797J11763M4639l5865m5285r970o9045p0255m1126M193j5472l7814L0586
21490a48448Q4583K0022k0296n7955j00842M6252l2594Q419R6271l5382m4397
$$ plain form
21479 -184367 -89617 -1400 -6541 -51453 -166346 -225235 -97285 -87520 -108258 -46260 38865
21468 38865 102069 115347 86549 70416 103411 85194 -52874 -179332 -203973 -187507 -111725
21457 -111725 87827 248988 149399 68824 -55027 -65691 -119710 -164317 -157628 -114912 -72371
21446 -72371 -74267 -84664 -70695 12474 95710 101006 152094 150925 192807 172752 197457 195769
21434 195769 94943 -12401 -1969 39390 -42880 -14790 -41497 30775 127118 63033 -32126
21423 -32126 -104989 -73404 -117523 -202449 -112073 -21836 17093 95560 119316 137266 150861 -10296
21411 -10296 31163 36639 -12364 30847 28854 8412 12916 13463 26434 126055 79744 -46648
21399 -46648 -94549 -57548 -71335 -5436 -27883 -40483 -85639 -117266 -94421 -78123 -103604 -102689
$$ packed form
21479a84367R4750Q8217n141m4912j14893n8889J27950R765k0738O1998Q5125
21468C8865O3204J3278k8798j6133L2995j8217j38068j26458k4641J6466P5782
21457a11725J99552J61161r9589q0575j23851j0664n4019m4607O689M2716M2541
21446g2371j896j0397J3969Q3169Q3236N296N1088j169M1882k0055K4705j688
21434A95769j00826j07344J0432M1359q2270K8090k6707P2272R6343o4085r5159
21423c2126p2863L1585m4119q4926R0376R0237L8929P8467K3756J7950J3595j61157
21411a0296M1459N476m9003M3211j993k0442M504N47J2971R9621m6311j26392
21399d6648m7901L7001j3787O5899k2447j2600m5156l1627K2845J6298k5481R15
$$ plain form
21387 -102689 -146250 -139444 -91064 -135075 -119107 -118527 -50812 -108204 -56955 -9960 91676 59193
21375 59193 -31039 -89793 -100569 -130068 -119176 -52512 -31350 -23123 4640 -18482 76673 133557
21363 133557 141876 178727 179031 228527 149885 112800 147039 170076 153349 97049 25627 -68295
21351 -68295 -158521 -152862 -123091 -137967 -91508 -12622 86367 39638 -74517 -175891 -188660
21340 -188660 -253056 -185299 -107874 23948 25005 28970 48081 -37560 25234 101569 57087 24143
21328 24143 23141 26019 53422 41604 33891 -53001 -126261 -195361 -133471 -82520 -8980 4422
21316 4422 -18528 22293 87450 115568 40443 23673 38423 5155 33824 -22660 -73964 -90146
21304 -90146 -114719 24052 45446 96041 51551 -8215 -73320 -94637 -21121 5787 -28902
$$ packed form
21387a02689m3561O806M8380m4011J5968N80O7715n7392N1249M6995J01636l2483
21375E9193r0232n8754j0776k9499J0892O6664K1162Q227K7763k3122R5155N6884
21363A33557Q319L6851L04M9496p8642l7085L4239K3037j6727n6300p1422r3922
21351f8295r0226N659K9771j4876M6459P8886R8989m6729j14155j01374j2769
21340a88660o4396O7757P7425J31822J057L965J9111q5641O2794P6335m4482l2944
21328B4143j002K878K7403j1818p713q6892p3260o9100O1890N0951P3540J3402
21316D422k2950M0821O5157K8118p5125j6770J4750l3268K8669n6484n1304j6182
21304i0146k4573J38771K1394N0595m4490n9766o5105k1317P3516K6908l4689
$$ plain form
21293 -28902 -36322 -73157 -18987 148757 165686 85527 81217 104443 101479 166550 148326 48408
21281 48408 18665 83018 29880 -473 50064 167175 153006 -6785 -80759 -134385 -208839
21270 -208839 -228920 -168842 -109051 -72156 72642 45202 41677 34345 -58429 -85356 229 9009
21258 9009 19085 -57472 -140435 -35256 52130 32551 25949 11387 -1765 -6175 31139 105347
21246 105347 87096 57305 1635 -9358 -6655 3566 40038 4063 28528 75654 50943 73921
21234 73921 22560 -73851 -108802 -100172 -62981 -95970 -25196 36904 70222 65794 32552 89239
21222 89239 17543 16805 67420 98796 97618 77149 96770 86456 123253 128566 98986 85793
21210 85793 32914 -65836 -50054 -37489 -22106 -13876 5979 -9598 -28546 -57207 31474 -11748
$$ packed form
21293b8902p420l6835N4170J67744J6929q0159m310K3226k964O5071j8224r9918
21281D8408k9743O4353n3138l0353N0537J17111j4169j59791p3974n3626p4454
21270b08839k0081O0078N9791L6895J44798k7440l525p332r2774k6927Q5585Q780
21258I009J0076p6557q2963J05179Q7386j9579o602j4562j3152m410L7314P4208
21246A05347j8251k9791n5670j0993K703J0221L6472l5975K4465M7126k4711K2978
21234G3921n1361r6411l4951Q630L7191l2989P0774O2100L3318m428l3242N6687
21222H9239p1696p38N0615L1376j178k0469J9621j0314L6797N313k9580j3193
21210H5793n2879r8750J5782J2565J5383Q230J9855j5577j8948k8661Q8681m3222
$$ plain form
21198 -11748 -119245 -145679 -128664 -142161 -251519 -179319 -14463 74130 82137 24373 -104299
21187 -104299 -99091 -123406 -166383 -96717 -92494 -815 17697 28843 -3782 -10056 42087 38389
21175 38389 79604 12430 -46551 -59309 -81869 -79254 -15411 39994 9171 -54638 -106632 -77771
21163 -77771 18453 19812 29597 30456 109665 79545 -106756 -153759 -48365 -50992 -42429 -1810
21151 -1810 -1116 -83042 -103721 -54149 15025 23529 28591 43278 -16501 -37168 65929 51385
21139 51385 -53600 48126 38351 -33763 -94771 -174252 -190183 -133100 -121941 -115819 -16772 71371
21127 71371 31125 21292 -31587 -52274 -14981 -98963 -92159 600 11522 655 47552 57329
21115 57329 39531 41607 24112 14146 45542 26462 36549 22074 -12589 -35350 27525 4019
$$ packed form
21198a1748j07497k6434J7015j3497j09358P2200J64856Q8593Q007n7764j28672
21187a04299N208k4315m2977O9666M223R1679J8512J1146l2625o274N2143l698
21175C8389M1215o7174n8981j2758k2560K615O3843N5405l0823o3809n1994K8861
21163g7771R6224J359R785Q59P9209l0120j86301m7003J05394k627Q563M0619
21151a810O94q1926k0679M9572O9174Q504N062J4687n9779k0667J03097j4544
21139E1385j04985J01726r775p2114o1008p9481j5931N7083J1159O122R9047Q8143
21127G1371m0246r833n2879k0687L7293q3982O804R2759J0922j0867M6897R777
21115E7329j7798K076j7495r966L1396j9080J0087j4475l4663k2761O2875k3506
$$ plain form
21103 4019 -19270 -55317 -5103 12122 -46765 -60271 10021 -46506 -83386 -89721 -82607 -207128
21091 -207128 -273907 -182038 -107904 30046 84583 118244 14379 -52916 -25749 57968 42479
21080 42479 50844 88569 39513 -67346 -62408 -47353 64171 175466 153778 140942 111244
21069 111244 116760 81089 11071 -77885 -90513 54342 66559 18398 -42447 -48845 -11357 94256
21057 94256 142991 -19548 -2451 118364 85211 -15846 -79288 -49850 -71304 -106274 29795
21046 29795 64681 10077 -88280 -210398 -242231 -159748 -96866 -134614 -326562 -266914 -116595
21035 -116595 -65681 18697 83809 98846 82766 -12461 6884 69323 45841 57886 27799
21024 27799 409 -72905 -78936 -105862 -14745 12733 69247 93292 78588 132616 210716 238365
$$ packed form
21103D019k3289l6047N0214J7225n8887j3506P0292n6527l6880o335P114j24521
21091b07128o6779R1869P4134J37950N4537L3661j03865o7295K7167Q3717j5489
21080D2479Q365L7725m9056j06859M938J5055J11524J11295k1688j2836k9698
21069A11244N516l5671p0018q8956j2628J44855J2217m8161o0845o398L7488J05613
21057I4256M8735j62539J7097J20815l3153j01057o3442K9438k1454l4970J36069
21046B9795L4886n4604r8357j22118l1833Q2483O2882l7748j91948N9648J50319
21035a16595N0914Q4378O5112J5037j6080r5227J9345O2439k3482J2045l0087
21024B7799k7390p3314o031k6926R1117K7478N6514K4045j4704N4028P8100K7649
$$ plain form
21012 238365 251723 262819 186410 120020 10546 -112597 -143437 -131833 -63445 -57030 -52007
21001 -52007 7570 -28710 -27977 -6113 -55621 -71615 10741 -1527 -21271 -2744 -61333 -86764
20989 -86764 -259931 -319494 -229969 -101505 24866 112661 93245 64583 -1976 -88505 -132409
20978 -132409 -73553 84535 136686 70664 27696 -24817 -137753 -151122 -89175 16963 63038
20967 63038 56091 87842 167011 146149 186431 206449 191721 174861 174093 181196 161619 40401
20955 40401 526 48835 64224 62403 76711 89024 54697 22930 79650 123940 122152 110057
20943 110057 -29669 -60352 3358 14051 -34203 -99160 -84226 -13136 74021 127022 -21480
20932 -21480 -122535 -170225 -134518 -117649 -67183 20191 -44742 -114746 13167 63253 68623
$$ packed form
21012B38365J3358J1096p6409o6390j09474j23143l0840J1604O8388O415N023
21001e2007N9577l6280P33K1864m9508j5994Q2356j2268j9744J8527n8589k5431
20989h6764j73167n9563Q9525J28464J26371Q7795j9416k8662o6559q6529m3904
20978a32409N8856J58088N2151o6022m2968n2513j12936j3369O1947J06138M6075
20967F3038o947L1751P9169k0862M0282K0018j4728j6860p68P103j9577j21218
20955D0401l9875M8309J5389j821J4308J2313l4327l1767N6720M4290j788j2095
20943A10057j39726l0683O3710J0693m8254o4957J4934P1090Q7157N3001j48502
20932b1480j01055m7690L5707J6869N0466Q7374o4933p0004J27913N0086N370
$$ plain form
20921 68623 118238 47587 21405 -38937 -138307 -111800 -31024 -26418 14420 80005 -42130 -83731
20909 -83731 -88758 -45740 -97589 -143076 -16759 46604 38780 16558 56145 36858 -11295 75769
20897 75769 128202 19712 20555 18676 -40898 -4112 30288 125853 89127 18536 -32469 -101889
20885 -101889 -98397 -43442 11058 35303 50168 72788 79699 -1453 -25499 -28674 -78176 -35926
20873 -35926 -21205 -81037 -114846 -112315 -15280 -19570 -46017 10600 97796 95844 31633 73111
20861 73111 186109 135593 67760 12110 20631 11232 -76062 -47935 -47960 -77637 -44321 -135889
20849 -135889 -229719 -201834 -185368 -74578 -21136 33486 79879 -6948 -38662 15348 -5517
20838 -5517 -41498 -40174 65167 147687 176768 168465 23177 -2847 -136040 -177596 -58705
$$ packed form
20921F8623M9615p0651k6182o0342r9370K6507Q0776M606M0838O5585j22135m1601
20909h3731n027M3018n1849m5487J26317O3363p824k2222L9587j9287m8153Q7064
20897G5769N2433j08490Q43j879n9574L6786L4400R5565l6726p0591n1005o9420
20885a01889L492N4955N4500K4245J4865K2620O911q1152k4046l175m9502M2250
20873c5926J4721n9832l3809K531R7035m290k6447N6617Q7196j952o4211M1478
20861G3111J12998n0516o7833n5650Q521r399q7294K8127k5k9677L3316r1568
20849a35889r3830K7885J6466J10790N3442N4622M6393q6827l1714N4010k0865
20838e517l5981J324J05341Q2520K9081q303j45288k6024j33193m1556J18891
$$ plain form
20827 -58705 -71765 -4658 12252 -7372 -41329 -44989 -48472 -61824 -40554 -10555 -23267 39126
20815 39126 51806 51735 75571 58627 142557 85161 21886 16022 65323 12732 -40609 -71847
20803 -71847 -49245 -86409 -85971 31300 75864 1822 -67077 -107571 -54523 -23228 19401 57640
20791 57640 64365 26379 92272 101881 94906 100521 40798 60339 101056 78041 88929 81853 31987
20778 31987 22613 47445 18183 -59918 -25968 69469 33854 -14382 -3794 -45185 -86386 -53558
20766 -53558 -73622 -191903 -212425 -38806 -8287 -77818 -146656 -120321 -84982 -111492 -113563
20755 -113563 -93923 -79375 -14083 73874 153175 184051 41143 13676 139760 104091 -4727
20744 -4727 4766 86868 72243 -30115 15513 101183 85630 -121810 -201790 -101585 30643
$$ packed form
20827e8705j3060O7107J6910j9624l3957l660l483j3352K1270K9999j2712O2393
20815C9126J2680p1K3836j6944Q3930n7396o3275n864M9301n2591n3341l1238
20803g1847K2602l7164M38J17271M4564p4042o8899m0494N3048L1295M2629L8239
20791E7640O725l7986O5893R609o975N615n9723J9541M0717k3015J0888p076m9866
20778C1987r374K4832k9262p8101L3950R5437l5615m8236J0588m1391m1201L2828
20766e3558k0064j18281k0522J73619L0519o9531o8838K6335L5339k6510k071
20755a13563J9640J4548O5292Q7957P9301L0876j42908k7467J26084l5669j08818
20744d727R493Q2102j4625j02358M5628Q5670j5553k07440p9980J00205J32228
$$ plain form
20733 30643 20534 41228 100064 79447 150009 124516 38414 20125 -35313 -57306 -22760 -2173
20721 -2173 46491 92572 102086 66659 1522 9109 47778 58763 -9674 -143636 -119228 17095
20709 17095 82263 -583 -15835 97647 124934 63652 -1032 -51704 -37535 -28004 26563 14817
20697 14817 -23416 -7855 27850 95231 135702 -34111 -85474 -55323 -35082 -95719 -207479
20686 -207479 -242162 -15380 82226 98062 53066 6443 -31731 -29232 -7522 -8095 -19249 -6690
20674 -6690 48843 142302 140863 76564 15896 33988 -46631 -120084 -143940 -139304 -144643 -53479
20662 -53479 34420 40338 93658 73280 59428 -23167 59596 123759 149131 169718 119846 22095
20650 22095 -24041 -142024 -112129 -29359 -7185 -22670 -73585 -65252 25870 106435 48075 46731
$$ packed form
20733C0643j0109K0694N8836k0617P0562k5493q6102j8289n5438k1993L4546K0587
20721b173M8664M6081R514l5427o5137P587L8669J0985o8437j33962K4408J36323
20709A7095O5168q2846j5252J13482K7287o1282o4684n0672J4169R531N4567j1746
20697A4817l8233J5561L5705O7381M0471j69813n1363L0151K0241o0637j11760
20686b07479l4683K26782R7606J5836m4996m6623l8174K499K1710n73j1154J2559
20674f690N5533R3459j439o4299o0668J8092q0619p3453k3856M636n339R1164
20662e3479Q7899N918N3320k0378j3852q2595Q2763O4163K5372K0587m9872r7751
20650B2095m6136j17983K9895Q2770K2174j5485n0915Q333R1122Q0565n8360j344
$$ plain form
20638 46731 77668 -5056 -5659 -24849 -65774 16030 23433 43917 122816 57489 58512 -26148
20626 -26148 -5278 2525 8512 66543 48201 51989 104674 124253 59512 -46605 -69917 -2511
20614 -2511 43061 -24627 4813 1950 5819 24878 89582 79044 43694 61270 -11983 -123519
20602 -123519 -133593 -165065 -134311 -56965 -94786 -75068 -586 92235 29443 -28675 -81995
20591 -81995 -106284 -4477 44697 -10827 -37270 -132245 -94642 35254 18588 -43969 51329
20580 51329 94596 122864 80246 26473 38740 72445 112454 114352 149034 149724 118068 3973
20568 3973 -69409 -3656 -20890 -39093 22567 16499 -60477 -99464 -46894 -51236 -9939 -90993
20556 -90993 -182710 -211983 -217339 -218511 -238107 -204624 -55437 5830 -35278 -84009 -171395 -118617
$$ packed form
20638D6731L0937q2724o03j9190m0925Q1804P403K0484P8899o5327J023q4660
20626b6148K0870P803N987N8031j8342L788N2685J9579o4741j06117k3312O7406
20614b511M5572o7688K9440k863L869J9059O4704j0538l5350J7576p3253j11536
20602a23519j0074l1472L0754P7346l7821J9718P4482R2821o2792n8118n3320
20591h1995k4289J01807M9174n5524k6443r4975L7603J29896j6666o2557R5298
20580E1329M3267K8268m2618n3773J2267L3705M0009J898L4682O90l1656j14095
20568C973p3382O5753j7234j8203O1660o068p6976l8987N2570m342M1297q1054
20556i0993r1717k9273n356j172j9596L3483J49187O1267m1108m8731q7386N2778
$$ plain form
20544 -118617 -74212 -130474 -43201 -35277 -15648 39225 61198 116553 119549 96699 45090 -31969
20532 -31969 -37266 5742 -16523 -111478 -181568 -162126 -138084 -118590 -143255 -134836 -15359 62223
20520 62223 16216 47553 64116 53149 91880 58870 80132 107037 36717 27484 -50429 -129272
20508 -129272 -158794 -106515 -64266 23699 -27456 -73596 -192553 -221942 -191051 -36158 77047
20497 77047 112510 53290 2126 -57423 -141490 -121578 -58401 -31995 -20989 48814 93397 87483
20485 87483 159075 225573 98995 58916 -102099 -90342 -47356 -87816 -105866 -134949 -137676
20474 -137676 -47183 -45288 -120286 -213948 -228779 -259720 -135686 25153 66602 27888 -62239
20463 -62239 -99886 -127110 -115833 -35438 -21808 62561 167654 191570 212988 124992 39730
$$ packed form
20544a18617M4405n6262Q7273P924J9629N4873K1973N5355K996k2850n1609p7059
20532c1969n297M3008k2265r4955p0090J9442K4042J9494k4665Q419J19477P7582
20520F2223m6007L1337J6563j0967L8731l3010K1262K6905p0320r233p7913p8843
20508a29272k9522N2279M2249Q7965n1155m6140j18957k9389L0891J54893J13205
20497G7047L5463n9220n1164n9549q4067J9912O3177K6406J1006O9803M4583n914
20485H7483P1592O6498j26578m0079j61015J1757M2986m0460j8050k9083k727
20474a37676R0493J895p4998r3662j4831l0941J24034J60839M1449l8714r0127
20463f2239l7647k7224J1277Q0395J3630Q4369J05093K3916K1418q7996q5262
$$ plain form
20452 39730 46852 8466 23387 41427 81614 90003 -29274 9709 48919 44895 -44341 -115579
20440 -115579 -137695 -140000 -127129 -105972 -94341 -90461 -89377 -40527 80849 29221 -35247 -23040
20428 -23040 27850 124928 178220 203628 181423 5024 -86117 -151047 -137241 -104512 -205047
20417 -205047 -256522 -307394 -288092 -250429 -223642 -98649 -64311 -152584 -241749 -134823 34984
20406 34984 97886 76255 47431 66354 17310 -9255 -46221 -38896 13642 15205 -16626 49487
20394 49487 1488 18385 125121 168984 91942 -9786 -89670 -98803 -102788 -86846 -116891 -168654
20382 -168654 -86718 -179565 -195552 -149842 -67985 -78721 -12674 11064 34393 63328 127023
20371 127023 167006 59155 29261 102033 63720 40252 73741 24983 -20024 -19407 -69945 -49501
$$ packed form
20452C9730P122l8386J4921J8040M0187Q389j19277L8983L9210m024q9236p1238
20440a15579k2116k305J2871K1157J1631L880J084M8850J21376n1628o4468J2207
20428b3040N0890R7078N3292K5408k2205j76399r1141o4930J3806L2729j00535
20417b05047n1475n0872J9302L7663K6787J24993L4338q8273q9165J06926J69807
20406C4984O2902k1631k8824J8923m9044k6565l6966P325N2538J563l1831O6113
20394D9487m7999J6897J06736M3863p7042j01728p9884r133l985J5942l0045n1763
20382a68654Q1936r2847j5987M5710Q1857j0736O6047K3738K3329K8935O3695
20371A27023L9983j07851k9894P2772l8313k3468L3489m8758m5007O17n0538K0444
$$ plain form
20359 -49501 -1808 57255 27876 87405 78814 60820 64390 44188 12568 -15875 -61968 17073
20347 17073 84889 26678 26879 164961 243773 231638 239518 227587 91847 85048 12108 -54159
20335 -54159 -55543 -144964 -136628 -4690 -18430 -148308 -178948 -139352 -81703 -11555 38499 -12281
20323 -12281 -83268 -84897 -19698 75906 -71744 -154974 -62728 21897 3217 -29667 -14109 -7127
20311 -7127 34406 45476 53243 142107 178703 213830 153596 44776 35195 -87258 -147491 -108989
20299 -108989 -60689 -80979 -139007 -81913 -9299 26092 22395 -87730 -78443 -15162 -1166 25306
20287 25306 1105 37947 36755 -699 -4360 22367 -269 -58871 -125552 -105069 -85244 -22095
20275 -22095 91637 227818 207247 209844 213189 202117 171397 103858 114792 147452 182218 155235
$$ packed form
20359d9501M7693N9063k9379N9529q591j7994L570k0202l1620k8443m6093P9041
20347A7073O7816n8211K01J38082P8812j2135P880j1931j35740o799p2940o6267
20335e4159j384q9421Q336J31938j3740j29878l0640L9596N7649P0148N0054n0780
20323a2281p0987j629O5199R5604j47650q3230R2246Q4625j8680l2884J5558O982
20311g127M1533J1070P767Q8864L6596L5127o0234j08820r581j22453o0233L8502
20299a08989M8300k0290n8028N7094P2614L5391l697j10125R287O3281J3996K6472
20287B5306k4201L6842j192l7454l661K6727k2636n8602o6681K0483J9825O3149
20275b2095J13732J36181k0571K597L345j1072l0720o7539J0934L2660L4766k6983
$$ plain form
20263 155235 7719 -20843 -40242 44328 101548 63721 23338 32290 100841 107819 153126 91955
20251 91955 14902 -9168 -23278 89858 236961 188248 6629 -30438 -124830 -160163 -69833
20240 -69833 -79168 -65944 -142110 -119680 26138 67980 -31895 -11790 -5672 132731 143755 25017
20228 25017 13696 74921 69020 34984 48357 5891 14435 86986 60442 14929 62026 61016
20216 61016 80881 29138 75919 159907 271476 319981 215644 95805 -28100 -55134 -64871
20205 -64871 -89694 -58800 -24978 9812 84134 93781 15434 -20311 -61552 -149565 -208255 -82126
20193 -82126 81748 180323 171240 129903 75668 60320 120755 118573 106916 50255 5488 6370
20181 6370 64997 69030 -30508 -69737 -81104 -63733 -103029 -65682 9881 123020 198798 156784
$$ packed form
20263A55235j47516k8562j9399Q4570N7220l7827m0383Q952O8551O978M5307o1171
20251I1955p7053k4070j4110J13136J47103m8713j81619l7067r4392l5333R0330
20240f9833r335J3224p6166K2430J45818M1842r9875K0105O118J38403J1024j18738
20228B5017j1321O1225n901l4036J3373m2466Q544P2551k6544m5513M7097j010
20216F1016J9865n1743M6781Q3988J11569M8505j04337j19839j23905k7034r737
20205f4871k4823L0894L3822L4790P4322R647p8347l5745m1241q8013n8690J26129
20193h2126J63874R8575r083m1337n4235j5348O0435k182j1657n6661m4767Q82
20181F370N8627M033r9538l9229j1367J7371l9296L7347P5563J13139P5778m2014
$$ plain form
20169 156784 73919 -10996 -4046 -20001 49714 105033 85306 138738 170828 102734 181421 247558
20157 247558 164909 146905 185609 191492 160260 110433 88722 174848 214246 172174 167824 144196
20145 144196 160665 147821 65015 169464 203176 120409 79384 73422 57160 58369 121140 139199
20133 139199 153321 244971 259236 177533 206871 199540 209114 269223 233113 201479 190897 113544
20121 113544 76274 96846 112523 80620 99586 120386 95981 174049 195979 152641 104532
20110 104532 214350 280717 184175 104303 138963 100907 94879 136201 166294 65801 -60984
20099 -60984 -37179 -16123 -7834 50531 24875 55197 113320 131190 143584 178325 263695 272071
20087 272071 136657 137994 167523 222467 249971 327651 290480 297798 305420 287147 326860 279726
$$ packed form
20169A56784q2865q4915O950j5955O9715N5319j9727N3432L2090o8094P8687O6137
20157B47558q2649j8004L8704N883l1232m9827k1711Q6126L9398m2072m350k3628
20145A44196J6469j2844q2806J04449L3712q2767m1025n962j6262J209O2771J8059
20133A39199J4122R1650J4265q1703K9338p331R574O0109l6110l1634j0582p7353
20121A13544l7270K0572J5677l1903J8966K0800k4405P8068K1930m3338m8109
20110A04532J09818O6367r6542p9872L4660l8056o028M1322L0093j00493j26785
20099f0984K3805K1056Q289N8365k5656L0322N8123J7870J2394L4741Q5370Q376
20087B72071j35414J337K9529N4944K7504P7680l7171P318P622j8273L9713m7134
$$ plain form
20075 279726 255994 224517 192988 170805 229645 189360 91325 90687 104497 49059 134609 153746
20063 153746 119386 49301 107255 147148 168131 148197 191791 220290 251518 233793 186089
20052 186089 259793 261379 273668 246590 238097 178910 203787 241535 222826 255248 250652 196313
20040 196313 162895 105735 200660 300551 375031 394799 375727 403940 303630 147426 200131
20029 200131 170766 167007 206851 119064 28562 47135 102956 105143 126948 55824 96718 86522
20017 86522 155118 249720 228659 137938 101034 92030 174588 182219 137925 164279 150876 26030
20005 26030 53272 165328 278807 227517 150362 192173 237472 199147 206277 217476 248146
19994 248146 250778 249923 195556 198260 224843 119242 77000 131586 97392 112479 154860 98733
$$ packed form
20075B79726k3732l1477l1529k2183N8840m0285r8035o38J3810n5438Q5550J9137
20063A53746l4360p0085N7954L9893K0983j9934M3594K8499L1228j7725m7704
20052A86089P3704J586J2289k7078q493n9187K4877L7748j8709L2422m596n4339
20040A96313l3418n7160R4925R9891P4480J9768j9072K8213j00310j56204N2705
20029B00131k9365l759L9844q7787r0502J8573N5821K187K1805p1124M0894j0196
20017H6522O8596R4602k1061r0721l6904r004Q2558P631m4294K6354j3403j24846
20005B6030K7242J12056J13479n1290p7155M1811M5299l8325P130J1199L0670
19994B48146K632q55n4367K704K6583j05601m2242N4586l4194J5087M2381n6127
$$ plain form
19982 98733 109105 68534 90356 149795 147509 166357 184725 228249 197960 72460 81974 253232
19970 253232 262642 342740 443350 470417 364611 291146 331763 403813 476155 419186 344654
19959 344654 350615 281786 231489 229908 307485 329586 356834 384874 411696 411008 463565 417728
19947 417728 377967 515659 641506 665057 566768 535835 516626 570140 672225 773918 787429
19936 787429 759196 680244 668591 585413 622020 712614 662521 624205 675633 692863 709027
19925 709027 788454 899747 937960 1001051 998044 950818 900729 881283 878259 886369 925143 1001815
19913 1001815 898184 834858 946497 958959 961850 964857 1017067 1111634 1176783 1234506 1240253
19902 1240253 1250719 1373056 1392473 1529787 1524767 1466230 1518504 1539491 1548246 1633952 1675770
$$ packed form
19982I8733J0372m0571K1822N9439k286J8848J8368M3524l0289j25500R514J71258
19970B53232R410Q0098J00610K7067j05806p3465M0617P2050P2342n6969p4532
19959C44654N961o8829n0297j581P7577K2101K7248K8040K6822o88N2557m5837
19947D17728l9761J37692J25847K3551r8289l0933j9209N3514J02085J01693J3511
19936G87429k8233p8952j1653q3178L6607R0594n0093l8316N1428J7230J6164
19925G09027P9427J11293L8213O3091l007m7226n0089j9446l024Q110L8774P6672
19913A001815j03631o3326J11639J2462K891L007N2210R4567O5149N7723N747
19902A240253J0466J22337J9417J37314n020n8537N2274K0987Q755Q5706M1818
$$ plain form
19891 1675770 1631780 1675408 1642800 1703668 1811975 1923113 2011165 2025354 2065401 2156101 2225252
19880 2225252 2246711 2265222 2325155 2425159 2507300 2701500 2787636 2763894 2807313 2974265 3199848
19869 3199848 3319278 3518942 3755169 3941520 4066379 4146870 4346724 4684458 5018687 5363297
19859 5363297 5773712 6220210 6663627 7175689 7745638 8475556 9277358 10058775 10931582
19850 10931582 11975592 13155966 14360720 15649745 17137205 18789566 20638733 23078223
19842 23078223 26255135 29969088 34569378 40453579 47928642 57676469 70511531 87522614
19834 87522614 109709032 137436093 170251991 206216454 241828207 273318142 297829767
19827 297829767 312663681 314933674 303253882 279704823 249663403 219216363 192058184
$$ packed form
19891A675770m3990M3628l2608O0868J08307J11138Q8052J4189M0047R0700O9151
19880B225252K1459J8511N9933J00004Q2141J94200Q6136k3742M3419J66952K25583
19869C199848J19430J99664K36227J86351J24859Q0491J99854L37734L34229L44610
19859E363297M10415M46498M43417N12062N69949P29918Q01802P81417Q72807
19850A0931582J044010J180374J204754J289025J487460J652361J849167K439490
19842B3078223L176912L713953M600290N884201P475063R747827J2835062J7011083
19834H7522614K2186418K7727061L2815898L5964463L5611753L1489935K4511625
19827B97829767J4833914K269993j1679792k3549059l0041420l0447040k7158179
$$ plain form
19820 192058184 169404155 151111939 136133112 123407965 111912799 101348590 91597700
19813 91597700 82592850 74425547 67128138 60689782 54979393 49885421 45462016 41607085
19805 41607085 38218643 35201459 32555558 30057739 27887296 25955253 24197226 22619142
19797 22619142 21343870 20032374 18785081 17731284 16798072 15806199 14811531 13919040 13106225
19788 13106225 12436676 11793592 11131733 10467824 9923370 9503067 9090268 8738197 8375494
19779 8375494 7911379 7491346 7069779 6674718 6425622 6164498 5831071 5591026 5340645
19770 5340645 5041993 4787111 4599168 4516982 4376932 4286876 4140305 4018954 3851182 3658575
19760 3658575 3499339 3365735 3305420 3280124 3222116 3099242 2898882 2779622 2769097 2753632
$$ packed form
19820A92058184k2654029j8292216j4978827j2725147j1495166j0564209r750890
19813I1597700r004850q167303p297409o438356n710389n093972m423405l854931
19805D1607085l388442l017184k645901k497819k170443j932043j758027j578084
19797B2619142j275272j311496j247293j053797r33212r91873r94668q92491q12815
19788A3106225o69549o43084o61859o63909n44454m20303m12799l52071l62703
19779H375494m64115m20033m21567l95061k49096k61124l33427k40045k50381
19770E340645k98652k54882j87943q2186j40050r0056j46571j21351j67772j92607
19760C658575j59236j33604o0315k5296n8008j22874k00360j19260j0525j5465
$$ plain form
19750 2753632 2670257 2529092 2412030 2356074 2395697 2396300 2237362 2124579 2090922 1993238 1827320
19739 1827320 1735831 1775031 1743883 1581509 1453734 1443259 1530074 1562422 1485052 1396295 1320596
19728 1320596 1373527 1362433 1342087 1303028 1246509 1266845 1240446 1171809 1187488 1071650 1014234
19717 1014234 992488 997883 917079 838526 808413 779439 744033 690718 672866 677700 711803 777513
19705 777513 814638 876150 1005369 1112755 1138146 1078489 1112753 1088245 1091807 1146864 1035350
19694 1035350 971345 878034 911644 925800 999769 1192334 1081290 858202 800494 826910 811133
19683 811133 741536 687983 692669 681294 653280 678805 670395 741765 821598 773698 721854 695054
19671 695054 744226 765241 799121 814310 707654 588478 536965 674179 802864 728652 630713
$$ packed form
19750B753632q3375j41165j17062n5956L9623O03j58938j12783l3657r7684j65918
19739A827320r1489L9200l1148j62374j27775j0475Q6815L2348p7370q8757p5699
19728A320596N2931j1094k0346l9059n6519K0336k6399o8637J5679j15838n7416
19717A014234k1746N395q0804p8553l0113k8974l5406n3315j7852M834L4103O5710
19705G77513L7125O1512J29219J07386K5391n9657L4264k4508L562N5057j11514
19694A035350o4005r3311L3610J4156P3969J92565j11044k23088n7708K6416j5777
19683H11133o9597n3553M686j1375k8014K5525q410P1370P9833m7900n1844k6800
19671F95054M9172K1015L3880J5189j06656j19176n1513J37214J28685p4212r7939
$$ plain form
19660 630713 513126 462754 440312 422333 549684 640456 625465 596293 552162 598804 551349
19649 551349 419706 411246 443592 430190 494191 479333 369177 324522 306119 376595 346871
19638 346871 253084 210083 328056 430144 506082 526089 536353 416822 326107 195814 228190
19627 228190 275361 305091 297730 250744 194848 286927 368604 328923 314587 277535 202317 222419
19615 222419 252145 243308 216329 285683 306285 238904 269388 287726 205575 151377 210239 368013
19603 368013 318028 259723 292123 201146 141243 151770 179360 224506 187219 158981 130204
19592 130204 80742 73404 108301 59073 -46671 21553 171470 211357 157361 35259 7981
19581 7981 -16217 -46269 28398 28850 43632 117271 163802 136046 136386 92192 87175 105763 118235
$$ packed form
19660F30713j17587n0372k2442j7979J27351R0772j4991k9172m4131M6642m7455
19649E51349j31643q460L2346j3402O4001j4858j10156m4655j8403P0476k9724
19638C46871r3787m3001J17973J02088P5938K0007J0264j19531r0715j30293L2376
19627B28190M7171K9730p361m6986n5896R2079Q1677l9681j4336l7052p5218K0102
19615B22419K9726q837k6979O9354K0602o7381L0484J8338q2151n4198N8862J57774
19603C68013m9985n8305L2400r0977n9903J0527K7590M5146l7287k8238k8777
19592A30204m9462p338L4897m9228j05744O8224J49917L9887n3996j22102k7278
19581G981k4198l0052P4667M52J4782P3639M6531k7756L40m4194n017J8588J2472
$$ plain form
19568 118235 149546 185554 78573 120073 127191 77917 38863 100253 220315 245005 184998
19557 184998 101499 853 -39587 513 26062 -4515 15629 -13891 64887 115978 85982
19546 85982 95888 62141 62908 148436 141448 151727 168481 199633 194202 90509 45909 32958
19534 32958 65892 140611 175408 158581 139013 153399 210048 237987 147587 -83738 -185902
19523 -185902 -116940 23652 133631 180841 217074 158711 50842 -26272 -68662 914 59569
19512 59569 73097 15759 -9652 25273 100314 155186 157039 88927 57187 143625 161404 139408
19500 139408 245417 286803 210769 172297 104974 33730 -48348 -109616 -107217 -41705 66121
19489 66121 33090 -64512 -61140 -70092 1878 16885 22865 53155 103380 53781 -65364 -111902
$$ packed form
19568A18235L1311L6008j06981M1500P118m9274l9054O1390J20062K4690o0007
19557A84998q3499j00646m0440M0100K5549l0577K0144k9520P8778N1091k9996
19546H5982R906l3747P67Q5528o988J0279J6754L1152n431j03693m4600j2951
19534C2958L2934P4719L4797j6827j9568J4386N6649K7939r0400k31325j02164
19523a85902O8962J40592J09979M7210L6233n8363j07869p7114m2390O9576N8655
19512E9569J3528n7338k5411L4925P5041N4872J853o8112l1740Q6438J7779k1996
19500A39408J06009M1386p6034l8472o7323p1244q2078o1268K399O5512J07826
19489F6121l3031r7602L372q952P1970J5007N980L0290N0225m9599j19145m6538
$$ plain form
19477 -111902 17393 121092 53555 1983 -89341 -65573 -48814 -39999 -56334 -6738 -42607
19466 -42607 29170 173284 149420 10644 -51599 -138713 -229644 -125953 -65059 -26030 144291
19455 144291 173148 107222 107065 144161 86485 175809 191344 151075 59980 -10674 -3665 -175
19443 -175 -72411 -99661 -38456 63735 98636 36150 35241 122737 51487 27871 -13195 68708
19431 68708 144208 221183 146565 76157 59616 101415 141629 66217 126076 134472 48912 27585
19419 27585 121841 191479 189347 183926 148085 140968 107694 -3289 -103259 -97221 -2732 19016
19407 19016 35832 51739 76614 71049 77298 92244 21722 7794 -17930 45130 34565 -15693
19395 -15693 -141591 -174499 -100367 -24962 33450 2920 90422 36999 53071 124721 126083 187011
$$ packed form
19477a11902J29295J03699o7537n1572r1324K3768J6759Q815j6335M9596l5869
19466d2607P1777J44114k3864j38776o2243q7114r0931J03691O0894L9029J70321
19455A44291K8857o5926j57L7096n7676Q9324J5535m0269r1095p0654P009L490
19443a75p2236k7250O1205J02191L4901o2486r09Q7496p1250k3616m1066Q1903
19431F8708P5500P6975p4618p0408j6541M1799M0214p5412N9859Q396q5560k1327
19419B7585R4256O9638k132n421l5841p117l3274j10983r9970O038R4489K1748
19407A9016J6816J5907K4875n565O249J4946p0522j3928k5724O3060j0565n0258
19395a5693j25898l2908P4132P5405N8412l0530Q7502n3423J6072P1650J362O0928
$$ plain form
19383 187011 194885 174531 184155 111643 19399 -10517 1295 -61276 -17688 8121 41054 2072
19371 2072 -4711 44955 69321 58908 61299 -36587 -55631 32004 114276 66727 12620 44036
19359 44036 4615 -50690 -55155 40373 8792 39800 203487 282679 250209 141732 63232
19348 63232 57996 81132 131701 153239 27963 30287 33074 -52451 -141892 -204667 -157049 -120790
19336 -120790 -4425 140450 161089 49059 -10313 -77895 -219607 -156544 -7829 64818
19326 64818 59740 -41633 -60221 -99915 -123255 8969 80034 38604 71734 146174 159320
19315 159320 147036 117121 124363 103445 49725 80787 109479 132069 113049 74698 -26510
19304 -26510 -41410 -53007 -7298 54467 93134 78121 -65833 -24853 68412 96409 106446
$$ packed form
19383A87011P874k0354R624p2512r2244k9916J1812o2571M3588K5809L2933l8982
19371B072o783M9666K4366j0413K391r7886j9044Q7635Q2272m7549n4107L1416
19359D4036l9421n5305m465R5528l1581L1008J63687P9192l2470j08477p8500
19348F3232n236K3136N0569K1538j25276K324K787q5525q9441o2775M7618L6259
19336a20790J16365J44875K0639j12030n9372o7582j41712O3063J48715P2647
19326F4818n078j01373j8588l9694k3340J32224P1065m1430L3130P4440J3146
19315A59320j2284k9915P242k0918n3720L1062K8692K2590j9020l8351j01208
19304b6510j4900j1597M5709O1765L8667j5013j43954M0980R3265K7997J0037
$$ plain form
19293 106446 14973 23761 -14399 59262 55140 80104 145632 225900 256375 175418 183474 90015
19281 90015 96705 191981 308877 369637 369228 385214 312535 329921 275317 249135 331084 235602
19269 235602 183034 216310 199163 170420 181531 257240 350649 453545 391445 359003 245868
19258 245868 109695 61591 44603 -32363 9414 61594 125512 92252 6284 10507 38168
19247 38168 19312 42093 72977 201734 225121 198728 165031 151477 142976 155615 148154 120052
19235 120052 165622 198372 136763 74830 173099 247125 337543 417421 423285 396250 374203 425859
19223 425859 333330 211103 173750 248708 379768 415112 400779 354865 400893 508352 471191
19212 471191 374862 274254 236443 275746 190990 130605 212567 177804 113495 88686 223598
$$ packed form
19293A06446r1473Q788l8160P3661m122K4964O5528Q0268L0475q0957Q056r3459
19281I0015O690R5276J16896O0760m09J5986p2679J7386n4604k6182Q1949r5482
19269B35602n2568L3276j7147k8743J1111P5709R3409J02896o2100l2442j13135
19258B45868j36173m8104j6988p6966M1777N2180O3918l3260q5968M223K7661
19247C8168j8856K2781L0884J28757K3387k6393l3697j3554q501J2639p461k8102
19235A20052M5570L2750o1609o1933R8269P4026R0418P9878N864k7035k2047N1656
19223D25859r2529j22227l7353P4958J31060L5344j4333m5914M6028J07459l7161
19212D71191r6329j00608l7811L9303q4756o0385Q1962l4763o4309k4809J34912
$$ plain form
19201 223598 331524 295899 180691 146379 180803 157548 179385 322377 321842 183212 206475
19190 206475 343716 450782 548237 684629 917634 902941 806269 723409 637028 639755 635879
19179 635879 715514 794067 934295 1021746 974263 869532 919675 883029 821716 787570 794999
19168 794999 794077 829799 827431 746103 713050 603014 588321 556268 539298 597320 533740 339716
19156 339716 312033 396403 337694 340014 389416 391432 349640 242868 223766 333357 541169
19145 541169 587629 694854 832677 743084 734091 874140 941485 1023823 1104718 1104988 1039262
19134 1039262 1050180 1086700 1140439 1152276 1087733 1062649 1042873 1080374 1130883 1171407 1053914
19123 1053914 943483 927669 887005 789575 658260 557251 607097 687870 704958 627557 621010
$$ packed form
19201B23598J07926l5625j15208l4312L4424k3255K1837J42992n35j38630K3263
19190B06475J37241J07066R7455J36392K33005j4693r6672q2860q6381K727l876
19179F35879P9635P8553J40228Q7451m7483j04731N0143l6646o1313l4146P429
19168G94999r22L5722k368q1328l3053j10036j4693l2053j6970N8022o3580j94024
19156C39716k7683Q4370n8709K320M9402K016m1792j06772j9102J09591K07812
19145E41169M6460J07225J37823q9593q993J40049O7345Q2338Q0895K70o5726
19134A039262J0918L6520N3739J1837o4543k5084j9776L7501N0509M0524j17493
19123A053914j10431j5814m0664r7430j31315j01009M9846Q0773J7088p7401o547
$$ plain form
19112 621010 616225 605610 534331 435785 392895 454079 498665 491752 490685 490717 441888 453313 536473
19099 536473 527540 521768 487114 386873 260112 202722 279622 257433 256502 253513 157168 124748
19087 124748 219204 219742 153113 117953 72369 64977 84098 55157 171871 179196 84513 80903
19075 80903 182622 271310 295376 281445 216333 126317 179275 367803 449317 539318 559825
19064 559825 573505 518175 471603 516362 584837 675278 627987 648581 752819 784318 831338
19053 831338 785994 719761 672927 610340 594688 573597 494483 435763 467586 408320 454094
19042 454094 542036 501607 518093 317571 238604 181390 222135 265906 212828 200254 251767
19031 251767 232286 181882 216275 267952 328587 350960 451643 569346 632539 644449 665036
$$ packed form
19112F21010m785j0615p1279r8546m2890O1184M4586o913j067L2m8829J1425Q3160
19099E36473q933n772l4654j00241j26761n7390P6900k2189r31k989r6345l2420
19087A24748R4456N38o6629l5160m5584p392J9121k8941J16714P325r4683l610
19075H0903J01719Q8688K4066j3931o5112r0016N2958J88528Q1514R0001K0507
19064E59825J3680n5330m6572M4759O8475R0441m7291K0594J04238L1499M7020
19053H31338m5344o6233m6834o2587j5652k1091p9114n8720L1823n9266M5774
19042D54094Q7942m0429J6486k00522p8967n7214M0745M3771n3078j2574N1513
19031B51767j9481n0404L4393N1677O0635K2373J00683J17703O3193J1910K0587
$$ plain form
19020 665036 678135 686313 652551 591279 569831 632568 739271 762459 768249 845871 811776 733003
19008 733003 703570 747471 743319 649579 583876 628002 562264 512387 551641 569437 459579
18997 459579 408695 378120 313056 387321 407868 372998 400239 387998 303572 348353 397400
18986 397400 333558 253682 311297 477702 363740 341672 451726 445223 300693 264391 228903
18975 228903 188072 323301 426413 391209 338812 290452 361102 414637 340384 338271 338754 228101
18963 228101 197753 227944 238651 256353 190315 151993 72911 71652 159357 201573 195025 247399
18951 247399 221015 176692 205521 212380 251162 299958 313733 297791 279960 232029 203930 297829
18939 297829 305815 324462 302795 290265 339181 348611 218857 175219 163554 148522 162944 233399
$$ packed form
19020F65036J3099Q178l3762o1272k1448O2737J06703K3188N790P7622l4095p8773
19008G33003k9433M3901m152r3740o5703M4126o5738m9877L9254J7796j09858
18997D59579n0884l0575o5064P4265K0547l4870K7241j2241q4426M4781M9047
18986C97400o3842p9876N7615J66405j13962k2068J10054o503j44530l6302l5488
18975B28903m0831J35229J03112l5204n2397m8360P0650N3535p4253k113M83j10653
18963B28101l0348L0191J0707J7702o6038l8322p9082j259Q7705M2216o548N2374
18951B47399k6384m4323K8829O859L8782M8796J3775j5942j7831m7931k8099R3899
18939B97829P986J8647k1667j2530M8916R430j29754m3638j1665j5032J4422P0455
$$ plain form
18927 233399 248938 309734 335083 286372 217490 142159 110914 107323 31238 19970 106742 190897
18915 190897 163886 234109 352951 360657 229341 266505 246987 120711 150387 200122 218805
18904 218805 290847 357265 295514 223166 207828 163262 113033 167564 281403 256660 188731
18893 188731 219187 334154 367471 279700 276174 384100 388602 255455 317946 338783 273085
18882 273085 233000 267158 278118 266293 193440 211202 218811 208302 393621 487255 513462
18871 513462 521552 470755 416111 394200 368277 297748 231018 225888 220749 219145 291432 311706
18859 311706 293701 231145 144254 205282 287544 267131 316029 416285 478858 544226 641922
18848 641922 676297 657161 675849 739753 847083 851972 929516 974190 910620 1023318 1071155
$$ packed form
18927B33399J5539O0796K5349m8711o8882p5331l1245l591p6085j1268Q6772Q4155
18915A90897k7011P0223J18842P706j31316L7164j9518j26276K9676M9735J8683
18904B18805P2042O6418o1751p2348j5338m4566n0229N4531J13839k4743o7929
18893A88731L0456J14967L3317q7771l526J07926M502j33147O2491K0837o5698
18882B73085m0085L4158J0960j1825p2853J7762P609j0509J85319R3634K6207
18871E13462Q090n0797n4644k1911k5923p0529o6730n130n139j604P2287K0274
18859C11706j8005o2556q6891O1028Q2262k0413M8898J00256O2573O5368R7696
18848F41922L4375j9136J8688O3904J07330M889P7544M4674o3570J12698M7837
$$ plain form
18837 1071155 1057577 1097845 1087773 1114185 1125539 1126958 1181251 1193860 1114205 1014034 1077498
18826 1077498 1118321 1072358 1056183 995301 939578 939078 975474 931040 999199 1076881 1137458 1147535
18814 1147535 1036920 980518 958103 1012358 1045446 990679 921400 1007292 1068630 1042200 996090
18803 996090 1133683 1265158 1345491 1430147 1542816 1705469 1972752 2233145 2382092 2601003
18793 2601003 2882927 3211775 3565145 3915757 4259122 4762385 5614107 6665558 7913527
18784 7913527 9508546 11522828 13893391 16514734 19102015 21586842 23940384 26077484
18776 26077484 27672300 28663987 29320467 30027882 30801133 31590123 32416268 33385902 34977613
18767 34977613 36855431 38147167 38900991 39782357 40526160 40571445 39544167 37868413 35973801
$$ packed form
18837A071155j3578M0268j0072K6412J1354J419N4293J2609p9655j00171O3464
18826A077498M0823m5963j6175o0882n5723n00L6396m4434O8159P7682O0577J0077
18814A147535j10615n6402k2415N4255L3088n4767o9279Q5892O1338k6430m6110
18803I96090J37593J31475Q0333Q4656J12669J62653K67283K60393J48947K18911
18793B601003K81924L28848L53370L50612L43365N03263Q51722J051451J247969
18784G913527J595019K014282K370563K621343K587281K484827K353542K137100
18776B6077484J594816R91687O56480P07415P73251P88990Q26145R69634J591711
18767C4977613J877818J291736P53824Q81366P43803M5285j027278j675754j894612
$$ plain form
18758 35973801 33963336 31493250 28746723 26127366 23733824 21451627 19582467 18079910
18750 18079910 16945071 16075508 15472624 15021411 14780870 14794134 14950110 15165260 15585650
18741 15585650 16059363 16441282 16703971 16852978 17039825 17342728 17651747 18247989 19225869
18732 19225869 20699225 22927494 25869315 29715016 34307361 39419633 45019609 51036852
18724 51036852 56988402 62640532 67778254 72084763 75858831 79317669 81494416 82084619
18716 82084619 82127376 81838992 79962321 76318635 72431323 68537303 64022498 59059255
18708 59059255 54446042 50487418 46566183 42640197 39144277 36041140 33062433 30224814
18700 30224814 27497229 25079896 22829997 20782478 19122988 17725082 16498512 15458885
$$ packed form
18758C5973801k010465k470086k746527k619357k393542k282197j869160j502557
18750A8079910j134839q69563o02884m51213k40541J3264J55976K15150M20390
18741A5585650M73713L81919K62689J49007J86847L02903L09019N96242R77880
18732A9225869J473356K228269K941821L845701M592345N112272N599976O017243
18724E1036852N951550N652130N137722M306509L774068L458838K176747N90203
18716H2084619M2757k88384j876671l643686l887312l894020m514805m963243
18708E9059255m613213l958624l921235l925986l495920l103137k978707k837619
18700C0224814k727585k417333k249899k047519j659490j397906j226570j039627
$$ plain form
18692 15458885 14492895 13694296 12980175 12380332 11917521 11683366 11495819 11407588 11439805 11658943
18682 11658943 12146613 12924188 14072341 15639811 17546645 19841521 22500735 25480439
18674 25480439 28658635 32039966 35185467 37845005 40022048 42166264 43799629 44248046
18666 44248046 43896192 43534232 42771998 41315354 39753658 38304089 36776122 35286654
18658 35286654 34383673 33562838 32257353 30614097 29195582 28012371 26658435 25182050
18650 25182050 23854942 22848123 21830043 20934333 20095224 19325224 18685607 18031929 17391531
18641 17391531 16861272 16492547 16370008 16397343 16686050 17428002 18757387 20492843 22783785
18632 22783785 25846429 29689127 34303386 39510247 44670711 49534088 54303656 57832283
$$ packed form
18692A5458885r65990p98599p14121n99843m62811k34155j87547q8231L2217K19138
18682A1658943M87670P77575J148153J567470J906834K294876K659214K979704
18674B5480439L178196L381331L145501K659538K177043K144216J633365M48417
18666D4248046l51854l61960p62234j456644j561696j449569j527967j489468
18658C5286654r02981q20835j305485j643256j418515j183211j353936j476385
18650B5182050j327108j006819j018080q95710q39109p70000o39617o53678o40398
18641A7391531n30259l68725j22539K7335K88707P41952J329385J735456K290942
18632B2783785L062644L842698M614259N206861N160464M863377M769568L528627
$$ plain form
18624 57832283 59454564 60097389 60122925 59087359 57598835 56317843 55231273 54442777 54274775
18615 54274775 54119551 52937983 50890907 48638209 45830126 42437623 38763752 35289953
18607 35289953 32321992 29860103 28040753 26776466 26048460 25675771 25625284 26066407 26695386
18598 26695386 27358824 28050614 28911360 30181021 31467879 32592339 33762109 35498323
18590 35498323 37922733 40531329 43152543 46047950 49041079 51832478 54339929 56907437
18582 56907437 59212604 59859314 58610352 56887988 55556129 53881849 50771922 46708752
18574 46708752 43061348 40013888 37355627 34738001 32491399 30768550 29652284 29120082
18566 29120082 29326216 30147102 31653936 33712665 36421581 39710529 43194153 46909552
$$ packed form
18624E7832283J622281O42825K5536j035566j488524j280992j086570p88496j68002
18615E4274775j55224j181568k047076k252698k808083l392503l673871l473799
18607C5289953k967961k461889j819350j264287p28006l72689n0487M41123O28979
18598B6695386O63438O91790Q60746J269661J286858J124460J169770J736214
18590C5498323K424410K608596K621214K895407K993129K791399K507451K567508
18582E6907437K305167O46710j248962j722364j331859j674280l109927m063170
18574D6708752l647404l047460k658261k617626k246602j722849j116266n32202
18566B9120082K06134Q20886J506834K058729K708916L288948L483624L715399
$$ plain form
18558 46909552 51126954 55732952 60298284 64493848 68576998 73256526 78772337 84389882
18550 84389882 89006625 93159728 97969297 103711121 108440312 111097741 112202363 112703040
18542 112703040 112914981 112146853 109400905 104887090 99408246 93919662 89140283 84460028
18534 84460028 78774692 72449269 66615956 61606823 57259584 53110699 48909393 44857092
18526 44857092 41376740 38556025 36121184 34083002 32298469 31007808 30214450 29969518
18518 29969518 30262705 30671702 31326620 32347169 33766023 35201977 36410887 37267815 38275390
18509 38275390 39649963 41065920 41843096 42118147 42551764 43447267 44396689 44960470 45061880
18500 45061880 44909159 44729829 44535776 44201082 43219471 41636792 40280708 39272452 37959412
$$ packed form
18558D6909552M217402M605998M565332M195564M083150M679528N515811N617545
18550H4389882M616743M153103M809569N741824M729191K657429J104622N00677
18542A12703040K11941p68128k745948m513815n478844n488584m779379m680255
18534H4460028n685336o325423n833313n009133m347239m148885m201306m052301
18526D4857092l480352k820715k434841k038182j784533j290661p93358k44932
18518B9969518K93187M08997O54918J020549J418854J435954J208910Q56928J007575
18509C8275390J374573J415957P77176K75051M33617Q95503R49422N63781J01410
18500D5061880j52721j79330j94053l34694r81611j582679j356084j008256j313040
$$ plain form
18491 37959412 36218528 34150369 32238315 30646453 29263104 27641125 25773752 23941187
18483 23941187 22494214 21249670 19818872 18112343 16504456 15116608 13842485 12819886
18475 12819886 11777815 10860723 10033519 9189118 8463186 7855435 7365280 6804915 6380135
18466 6380135 6021255 5755761 5442562 5040727 4795310 4429061 4234309 4108319 3845244
18457 3845244 3608096 3471280 3310301 3205938 3095041 3021760 2870039 2702052 2627412 2472012
18447 2472012 2366355 2238253 2189731 2161743 2138017 2032229 1974525 1961649 1871776 1788935 1660412
18436 1660412 1551874 1557463 1574424 1600395 1545168 1498526 1534791 1523995 1402821 1302671 1273409
18425 1273409 1232786 1163747 1169206 1227974 1331210 1375866 1405766 1409181 1333836 1309255 1165429
$$ packed form
18491C7959412j740884k068159j912054j591862j383349j621979j867373j832565
18483B3941187j446973j244544j430798j706529j607887j387848j274123j022599
18475A2819886j042071r17092q27204q44401p25932o07751m90155n60365m24780
18466F380135l58880k65494l13199m01835k45417l66249j94752j25990k63075
18457C845244k37148j36816j60979j04363j10897p3281j51721j67987p4640j55400
18447B472012j05657j28102m8522k7988k3726j05788n7704j2876q9873q2841j28523
18436A660412j08538N589J6961K5971n5227m6642L6265j0796j21174j00150k9262
18425A273409m0623o9039N459N8768J03236M4656K9900L415p5345k4581j43826
$$ plain form
18414 1165429 1098544 1063456 1126359 1164752 1195963 1159603 1054634 992077 910118 901107 936650
18403 936650 901613 856555 818651 750293 713573 695822 690807 643161 606435 643525 600169 526652
18391 526652 587648 620845 663700 769221 781413 656914 508978 510014 643331 670806 656572
18380 656572 560116 605529 712547 711280 649008 529178 473176 505900 602980 623198 639983
18369 639983 507880 491948 487317 387723 320898 316428 405343 495980 417659 389075 541907
18358 541907 575353 376731 240573 305049 350364 384550 445868 398395 387838 318653 300364
18347 300364 307761 361366 422382 416660 422002 431950 490233 444715 385546 227710 122285 182734
18335 182734 266870 268443 331645 363724 401205 323364 292559 322292 410671 416254 337647 242956
$$ packed form
18414A165429o6885l5088O2903L8393L1211l6360j04969o2557q1959r011L5543
18403I36650l5037m5058l7904o8358l6720j7751n015m7646l6726L7090m3356p3517
18391E26652O0996L3197M2855J05521J2192j24499j47936J036J33317K7475j4234
18380F56572r6456M5413J07018j267o2272j19830n6002L2724R7080K0218J6785
18369F39983j32103j5932m631r9594o6825m470Q8915R0637p8321k8584J52832
18358E41907L3446j98622j36158O4476M5315L4186O1318m7473j0557o9185j8289
18347C00364P397N3605O1016n722N342R948N8283m5518n9169j57836j05425O0449
18335A82734Q4136J573O3202L2079L7481p7841l0805K9733Q8379N583p8607r4691
$$ plain form
18323 242956 300868 253378 216494 173777 185062 280290 450881 486367 364682 239808 294003
18312 294003 357504 363408 289081 215639 226566 209675 229593 301281 214616 217428 282542 295384
18300 295384 335203 311508 280433 294492 277516 205827 292654 311934 331323 274815 299682
18289 299682 503297 656993 659077 684389 782296 756172 722229 921319 1156229 1298709 1384890
18278 1384890 1543183 1898389 2209311 2494504 2794079 3067098 3406957 3750425 4048628
18269 4048628 4283719 4332812 4299084 4282985 4158141 3917624 3670458 3346054 3165974 2999412
18259 2999412 2730684 2502570 2356293 2257655 2156571 1987146 1806821 1688469 1537965 1415089
18249 1415089 1399280 1424251 1375334 1264045 1178090 1089258 1037291 1009657 959317 864065 861661
$$ packed form
18323B42956N7912m7490l6884m2717J1285R5228J70591L5486j21685j24874N4195
18312B94003O3501N904p4327p3442J0927j6891J9918P1688q6665K812O5114J2842
18300B95384L9819k3695l1075J4059j6976p1689Q6827J9280J9389n6508K4867
18289B99682K03615J53696K084K5312R7907k6124l3943J99090K34910J42480Q6181
18278A384890J58293L55206L10922K85193K99575K73019L39859L43468K98203
18269D048628K35091M9093l3728j6099j24844k40517k47166l24404j80080j66562
18259B999412k68728k28114j46277r8638j01084j69425j80325j18352j50504j22876
18249A415089j5809K4971m8917j11289q5955q8832n1967k7634n0340r5252k404
$$ plain form
18238 861661 790094 708459 652565 610264 603141 523163 481896 457625 428055 416478 417394 583780
18226 583780 663983 465838 345297 326346 359019 376431 338382 255595 279454 299777 228463
18215 228463 121462 122701 116260 231172 319278 314150 280085 239002 290593 244731 239867 369990
18203 369990 443730 453950 459828 397026 398403 393811 358756 392142 408137 488717 494302 434235
18191 434235 414997 500442 450370 352608 423300 478916 389810 343908 367783 431887 430258 340971
18179 340971 290636 309233 242650 311672 407132 413220 393111 275906 186061 134201 114881
18168 114881 247302 227485 153569 151482 126459 69431 61762 83472 87056 140018 162116 107275
18156 107275 115018 183807 132956 138004 208339 209357 202565 238746 271358 256172 349862 368902
$$ packed form
18238H61661p1567q1635n5894m2301p123p9978m1267k4271k9570j1577R16J66386
18226E83780Q0203j98145j20541j8951L2673J7412l8049q2787K3859K0323p1314
18215B28463j07001J239o441J14912Q8106n128l4065m1083N1591m5862m864J30123
18203C69990P3740J0220N878o2802J377m592l5055L3386J5995Q0580N585o0067
18191D34235j9238Q5445n0072r7762P0692N5616q9106m5902K3875O4104j629q9287
18179C40971n0335J8597o6583O9022R5460O088k0109j17205q9845n1860j9320
18168A14881J32421j9817p3916k087k5023n7028p669K1710L584N2962K2098n4841
18156A07275P743O8789n0851N048P0335J018o792L6181L2612j5186R3690J9040
$$ plain form
18144 368902 365436 432853 444836 504818 405910 380760 439103 471726 451906 432280 491644 470811
18132 470811 494276 466786 401935 359376 348987 360633 337609 242447 237881 219192 188242 148052
18120 148052 129504 14729 -58009 -49532 32702 164152 224325 174492 178443 203381 193304
18109 193304 233966 240611 227786 203599 171479 144000 160276 192253 230477 273343 247368 237885
18097 237885 268756 286387 284202 234475 230394 208061 127334 123626 196222 273234 335784 340889
18085 340889 261759 156267 200266 244232 276650 234999 218958 133949 149513 159072 271668
18074 271668 222792 163340 123459 149265 196819 284852 182824 115738 75942 80459 114454
18063 114454 129008 150891 226056 244034 235604 226319 205341 109358 49372 56552 107862 204656
$$ packed form
18144C68902l466O7417J1983N9982r8908k5150N8343L2623j9820j9626N9364k0833
18132D70811K3465k7490o4851m2559j0389J1646k3024r5162m566j8689l0950m0190
18120A48052j8548j14775p2738Q477Q2234J31450O0173m9833L951K4938j0077
18109A93304M0662O645j2825k4187l2120k7479J6276L1977L8224M2866k5975r483
18097B37885L0871J7631k185m9727m081k2333q0727l708P2596P7012O2550N105
18085C40889p9130j05492M3999M3966L2418m1651j6041q5009J5564R559J12596
18074B71668m8876n9452l9881K5806M7554Q8033j02028o7086l9796M517L3995
18063A14454J4554K1883P5165J7978q430r285k0978r5983n9986P180N1310R6794
$$ plain form
18051 204656 177346 171804 215670 317181 328154 331988 367967 387681 379574 418771 386713 326872
18039 326872 349703 454351 503929 502167 408880 436797 451776 384365 365942 323956 307750
18028 307750 373515 386127 353254 425873 547167 529098 460094 449860 393898 262149 263577
18017 263577 235164 314488 409470 416920 426311 369347 258182 222676 291804 205972 233743 299894
18005 299894 254696 288402 313841 306685 273284 254583 337417 289186 280830 357305 380860 422097
17993 422097 453502 441662 341426 226832 146236 110584 169689 274041 364426 251112 158684
17982 158684 105408 189951 269054 219499 174033 240318 261211 189772 226401 91012 92403
17971 92403 50836 -6939 -11816 108710 76672 73206 53722 81691 35021 -12285 -10705 20144
$$ packed form
18051B04656k7310n542M3866J01511J0973L834L5979J9714q107L9197l2058n9841
18039C26872K2831J04648M9578j762r3287K7917J4979o7411j8423m1986j6206
18028C07750O5765J2612l2873P2619J21294j8069o9004j0234n5962j31749J428
18017B63577k8413P9324R4982P450R391n6964j11165l5506O9128q5832K7771O6151
18005B99894m5198L3706K5439p156l3401j8701Q2834m8231q356P6475K3555M1237
17993D22097L1405j1840j00236j14594q0596l5652N9105J04352R0385j13314r2428
17982A58684n3276Q4543P9103m9555m5466O6285K0893p1439L6629j35389J391
17971I2403m1567n7775m877J20526l2038l466j9484K7969m6670m7306J580L0849
$$ plain form
17959 20144 86940 45581 47342 103786 90369 70408 41562 103632 5866 -44762 -96994 -126543
17947 -126543 -33263 98640 53183 -38098 6072 35350 7226 92265 -10175 -23886 -16771
17936 -16771 14365 -28073 -70169 21091 124451 178107 144299 75401 24414 -34517 -19785
17925 -19785 -38417 -57411 -25775 -1344 81069 106502 16721 52944 -34021 -74766 -87732 -37060
17913 -37060 -27163 -93307 -93191 -88191 -91095 -79488 -37418 68996 89117 18828 -173543 -220551
17901 -220551 -181559 -71350 -42347 -34449 -111003 -113480 -33715 17937 83986 79142 2666 46980
17889 46980 80321 21345 -14074 -20494 61874 19786 -1357 -24081 -32337 -91044 -124465 -83687
17877 -83687 -164584 -152024 -63151 -3090 54890 38216 42348 7304 -68779 -29909 -107931 -201566
$$ packed form
17959B0144O6796m1359J761N6444j3417j9961k8846O2070r7766n0628n2232k9549
17947a26543R3280J31903m5457r1281M4170K9278k8124Q5039j02440j3711P115
17936a6771L1136m2438m2096R1260J03360N3656l3808o8898n0987n8931J4732
17925a9785j8632j8994L1636K4431Q2413K5433q9781L6223q6965m0745j2966N0672
17913c7060R897o6144J16N000k904J1607M2070J06414K0121p0289j92371m7008
17901b20551L8992J10209K9003P898p6554k477P9765N1652O6049m844p6476M4314
17889D6980L3341n8976l5419o420Q2368m2088k1143k2724q256n8707l3421M0778
17877h3687q0897J2560Q8873O0061N7980j6674M132l5044p6083L8870p8022r3635
$$ plain form
17865 -201566 -72741 24297 30697 -35195 -65805 -43772 -66575 -46146 26543 42379 41688 111434
17853 111434 44005 -1319 39543 -31407 -112287 -51837 21209 69515 83940 79740 134943 127848
17841 127848 79335 45367 9458 -42396 -16187 60362 45481 44492 34916 64083 79926 35900
17829 35900 25045 9977 -46442 258 -14384 -78620 -49827 87252 80169 23549 -58085 71483
17817 71483 152192 57759 52758 59814 86520 1803 -121116 -86099 -95947 -135679 -79651 -76229
17805 -76229 -78249 -72771 -89437 -66042 -52146 -19915 -37532 1533 31898 1065 -7464 13239
17793 13239 34400 85743 4186 -64312 -69711 -7110 -7741 -80182 -106438 -122049 -148907 -84578
17781 -84578 -19379 -30566 9681 67935 172997 143965 64769 11931 -60500 -55758 3372 -135199
$$ packed form
17865b01566J28825R7038O400o5892l0610K2033k2803K0429P2689J5836o91O9746
17853A11434o7429m5324M0862p0950q0880O0450P3046M8306J4425m200N5203p095
17841A27848m8513l3968l5909n1854K6209P6549j4881r89r576K9167J5843m4026
17829C5900j0855j5068n6419M6700j4642o4236K8793J37079p083n6620q1634J29568
17817G1483Q0709r4433n001P056K6706q4717j22919L5017r848l9732N6028L422
17805g6229k020N478j6666K3395J3896L2231j7617L9065L0365l0833q529K0703
17793A3239K1161N1343q1557o8498n399O2601o31p2441k6256j5611k6858O4329
17781h4578O5199j1187M0247N8254J05062k9032p9196n2838p2431M742N9130j38571
$$ plain form
17769 -135199 -144130 -52009 24740 47014 71408 35836 14471 -40354 -37201 59734 23799 -41690
17757 -41690 -116873 -173222 -141371 -97270 -35281 46539 71224 68943 33125 51712 81617 84226
17745 84226 25944 -70522 -95588 -37076 -73470 -28173 14902 -20262 -50484 26075 77462 96995
17733 96995 14434 -58918 -113699 -141563 -147377 -52786 -44084 -74243 49158 21958 -39311 13570
17721 13570 63441 126885 176867 116289 14284 40491 14830 90595 88030 -119 31442 54322
17709 54322 96837 39472 75782 70186 38883 -30189 -27780 24374 7448 -4469 -35442 -43940
17697 -43940 8925 61244 34780 23127 -55279 -125938 -45643 55326 12424 -134621 -144370
17686 -144370 -54945 8806 20374 -7125 -9198 86205 118852 39456 -62464 -110398 9206
$$ packed form
17769a35199q931R2121P6749K2274K4394l5572k1365n4825L153R6935l5935o5489
17757d1690p5183n6349L1851M4101O1989Q1820K4685k281l5818J8587K9905K609
17745H4226n8282r6466k5066N8512l6394M5297M3075l5164l0222P6559N1387J9533
17733I6995q2561p3352n4781k7864n814R4591Q702l0159J23401k7200o1269N2881
17721A3570M9871O3444M9982o0578j02005K6207k5661P5765k565q8149L1561K2880
17709E4322M2515n7365L6310n596l1303o9072K409N2154j6926j1917l0973q498
17697d3940N2865N2319k6464j1653p8406p0659Q0295J00969m2902j47045r749
17686a44370Q9425O3751J1568k7499k073R5403L2647p9396j01920m7934J19604
$$ plain form
17675 9206 107916 184814 201141 103909 70246 10753 8427 6218 11511 -30565 -105590 -51226
17663 -51226 -24809 44002 59473 -36574 -81879 -69305 -60384 -21430 -87136 1313 -21271 -131247
17651 -131247 -74769 -60540 -126132 -60597 -71598 -53153 -62332 -109657 -86503 55450 69843
17640 69843 -1581 -35391 -59126 -160602 -159753 -181022 -264323 -224747 -73454 -64473 -100194 -71691
17628 -71691 -63372 -105389 -72812 -125258 -45979 15152 -7992 -19016 -58575 -9127 28179 45838
17616 45838 -18201 -50664 13654 -46665 -130818 -90556 -46863 -85565 -91068 -128936 -147665 -131937
17604 -131937 -59044 43968 61007 54664 31541 34383 116583 125014 137542 109811 11142 31417
17592 31417 81670 6035 33457 76221 41213 6604 38484 -52856 -125501 -72799 -13957 -24525
$$ packed form
17675I206R8710P6898J6327r7232l3663n9493k326k209N293m2076p5025N4364
17663e1226K6417O8811J5471r6047m5305J2574Q921L8954o5706Q8449k2584j09976
17651a31247N6478J4229o5592O5535j1001J8445r179m7325K3154J41953J4393
17640F9843p1424l3810k3735j01476Q49k1269q3301L9576J51293Q981l5721K8503
17628g1691Q319m2017L2577n2446P9279O1131k3144j1024l9559M9448L7306J7659
17616D5838o4039l2463O4318o0319q4153M0262M3693l8702n503l7868j8729J5728
17604a31937P2893J03012J7039o343k3123K842Q2200Q431J2528k7731r8669K0275
17592C1417N0253p5635K7422M2764l5008l4609L1880r1340p2645N2702N8842j0568
$$ plain form
17580 -24525 -76174 -3566 -28843 -95530 -71098 -38919 -21098 108902 164783 131199 109672
17569 109672 113934 61720 42976 -3821 -31055 9674 -43873 -39108 47126 28123 55113 128323
17557 128323 126981 23085 -32119 -19308 36213 3547 -95289 -197358 -112915 -9362 5345
17546 5345 -16876 -23848 -43861 -54378 -85421 -27377 -52014 -111653 8417 58314 84698 29983
17534 29983 1896 -19037 -7232 89031 76487 29185 23755 -1669 66090 -48964 -16202 14195
17522 14195 4714 -95109 -123057 -153199 -78434 -43280 -21624 -94884 -102225 -39703 14208 7490
17510 7490 1972 -11811 100349 102785 60023 -75160 -108364 -96424 -64838 -13855 16726 32445
17498 32445 114774 150463 118909 49963 17354 55228 -109451 -90022 -6630 106209 195352
$$ packed form
17580b4525n1649P2608k5277o6687K4432L2179J7821J30000N5881l3584k1527
17569A09672M262n2214j8744m6797k7234M0729n3547M765Q6234j9003K6990P3210
17557A28323j342j03896n5204J2811N5521l2666r8836j02069Q4443J03553J4707
17546E345k2221o972k0013j0517l1043N8044k4637n9639J20070M9897K6384n4715
17534B9983k8087k0933J1805R6263j2544m7302n430k5424O7759j15054L2762L0397
17522A4195r481r9823k7948l0142P4765L5154K1656p3260p341O2522N3911o718
17510G490n518j3783J12160K436m2762j35183l3204J1940L1586N0983L0581J5719
17498C2445Q2329L5689l1554o8946l2609L7874j64679J9429Q3392J12839Q9143
$$ plain form
17487 195352 162145 146503 101865 50199 31814 69720 83072 -25893 -14545 60501 116056
17476 116056 38423 24446 84945 216651 238346 239537 195693 199835 236206 189478 72231
17465 72231 21526 -6321 36643 61007 92740 134848 187788 100853 93465 43083 30956 9563
17453 9563 -2893 -46962 -117200 -162100 -222034 -145791 -75765 65824 212575 199216 118333
17442 118333 99054 160694 157438 128766 32707 -93797 -119828 -70457 6207 -19711 -68984
17431 -68984 -95772 -34084 31092 4269 59776 -38524 -180154 -194053 -106487 13565 -67269
17420 -67269 -115659 -42679 8485 174552 189473 166177 93654 117794 133158 57307 -54976
17409 -54976 -34191 29866 89146 71041 143315 139414 87180 31390 59419 67893 64007 74226
$$ packed form
17487A95352l3207j5642m4638n1666j8385L7906J3352j08965J1348P5046N5555
17476A16056p7633j3977O0499J31706K1695J191m3844M142L6371m6728j17247
17465G2231n0705k7847M2964K4364L1733M2108N2940q6935p388n0382j2127k1393
17453I563j2456m4069p0238m4900n9934P6243P0026J41589J46751j3359q0883
17442A18333j9279O1640l256k8672r6059j26504k6031M9371P6664k5918m9273
17431f8984k6788O1688O5176k6823N5507r8300j41630j3899Q7566J20052q0834
17420f7269m8390P2980N1164J66067J4921k3296p2523K4140J5364p5851j12283
17409e4976K0785O4057N9280j8105P2274l901n2234n5790K8029Q474l886J0219
$$ plain form
17397 74226 105455 65398 3487 11021 116113 92345 -4286 -80492 -41968 56376 106951 57776
17385 57776 26432 -22658 33949 28768 -22080 -60070 -88883 -140850 -122610 -114932 -76867 -148769
17373 -148769 -292816 -238768 -134704 -165392 -152395 -119562 -122452 -54825 42392 13760 -41270
17362 -41270 -30115 -12297 1115 -107699 -199052 -217546 -118018 -159597 -209983 -173707 -76426
17351 -76426 1662 12152 41975 86208 -3999 -59415 -106220 -204113 -162397 -124766 -68579 -65301
17339 -65301 -94105 17443 -21231 -91150 -58254 50841 24147 47163 70712 55565 3668
17328 3668 -40509 -94 -66429 -129181 -71811 -79306 -120076 -134552 -172304 -181935 -108728 -74846
17316 -74846 -29251 -102740 -50513 -36050 10644 182535 234001 173183 105310 22881 -15351
$$ packed form
17397G4226L1229m0057o1911P534J05092k3768r6631p6206L8524R8344N0575m9175
17385E7776l1344m9090N6607n181n0848l7990k8813n1967J8240P678L8065p1902
17373a48769j44047N4048J04064l0688J2997L2833k890O7627R7217k8632n5030
17362d1270J1155J7818J3412j08814r1353j8494R9528m1579n0386L6276R7281
17351g6426P8088J0490K9823M4233r0207n5416m6805r7893M1716L7631N6187L278
17339f5301k8804J11548l8674o9919L2896J09095k6694K3016K3549j5147n1897
17328C668m4177M0415o6335o2752N7370p495m0770j4476l7752r631P3207L3882
17316g4846M5595p3489N2227J4463M6694J71891N1466o0818o7873q2429l8232
$$ plain form
17305 -15351 5174 35496 -38258 -85357 27623 85671 25409 -16256 -73850 -76001 -127439 -128515
17293 -128515 -177685 -187976 -150515 -147775 -109087 -49768 -8103 -12449 -35299 -55114 -9541 -41844
17281 -41844 -49593 -19879 46728 44481 -84020 -112181 -134386 -176571 -65786 55265 82792
17270 82792 177860 155478 156188 43249 -19612 -35351 -77895 -76044 -12811 16573 46301 55518
17258 55518 22130 44399 69753 11143 -76127 -98628 -17162 17733 -21514 -14250 -47880 -47484
17246 -47484 -37185 -157975 -188581 -201958 -261319 -226169 -185733 -158069 -103485 -91497 -135871
17235 -135871 -144221 -79914 -3827 127629 185978 91581 -56006 -124605 -38675 -97697 -70689
17224 -70689 -52577 37809 65089 37566 -4725 1040 1630 62978 77741 116239 154746 139060
$$ packed form
17305a5351K0525L0322p3754m7099J12980N8048o0262m1665n7594k151n1438j076
17293a28515m9170j0291L7461K740L8688N9319M1665m346k2850j9815M5573l2303
17281d1844p749K9714O6607k247j28501k8161k2205m2185J10785J21051K7527
17270H2792R5068k2382P10j12939o2861j5739m2544J851O3233K9384K9728R217
17258E5518l3388K2269K5354n8610q7270k2501Q1466L4895l9247P264l3630L96
17246d7484J0299j20790l0606j3377n9361L5150M0436K7664N4584J1988m4374
17235a35871q350O4307P6087J31456N8349r4397j47587o8599Q5930n9022K7008
17224g0689J8112R0386K7280k7523m2291N765N90O1348J4763L8498L8507j5686
$$ plain form
17212 139060 187061 117727 90963 138066 124595 100610 -9865 -55447 -20540 89165 139666
17201 139666 85807 -21776 -73701 -95045 -123016 -59567 93431 61779 -61501 -118940 -36389
17190 -36389 67689 47621 12802 -78325 -101170 -84885 -37258 6040 62899 116458 95733
17179 95733 -35368 -130277 -123415 -162818 -175672 -52379 -39023 -13853 39892 14890 -67378
17168 -67378 -94543 -59842 -28224 -52383 -111506 -148053 -113315 -55295 -19495 46121 -5188 -130933
17156 -130933 -160044 -149281 -198223 -79638 6252 14358 -11185 -2057 -16822 -25920 -21844 49745
17144 49745 92234 -24075 -138968 -210957 -193611 -216774 -177793 -132801 -76325 20967 1989
17133 1989 -20197 62779 41598 -66571 -17370 11943 -22907 -18492 -19578 -12905 -48146 -12842
$$ packed form
17212A39060M8001o9334k6764M7103j3471k3985j10475m5582L4907J09705N0501
17201A39666n3859j07583n1925k1344k7971O3449J52998l1652j23280n7439Q2551
17190c6389J04078k0068l4819r1127k2845J6285M7627M3298N6859N3559k0725
17179I5733j31101r4909O862l9403j2854J23293J3356K5170N3745k5002q2268
17168f7378k7165L4701L1618k4159n9123l6547L4738N8020L5800O5616n1309j25745
17156a30933k9111J0763m8942J18585Q5890Q106k5543R128j4765r098M076P1589
17144D9745M2489j16309j14893p1989J7346k3163L8981M4992N6476R7292j8978
17133A989k2186Q2976k1181j08169M9201K9313l4850M415j086O673l5241L5304
$$ plain form
17121 -12842 17466 51726 6955 -59318 -87608 -30816 -20946 -18777 -48409 -43570 -66345 -124306
17109 -124306 -114959 -89562 -6228 13385 -14657 -41630 -3223 40496 54908 -97207 -227926
17098 -227926 -332925 -365519 -290476 -126981 -46551 -23943 -34591 -22067 -30517 -19867 -12502
17087 -12502 -94430 -64494 -56827 -54395 -98287 -219291 -197303 -138726 -40426 33243 22346 -104587
17075 -104587 -163100 -160035 -228421 -196035 -161053 -121335 -182850 -207667 -136186 -57610 29894 27273
17063 27273 -64964 -96698 -34502 12621 -54473 -57476 -50144 29395 44940 117238 133318 5464
17051 5464 18655 62589 56291 -42325 -38549 -22594 8630 24188 1394 -35439 -130168 -139678
17039 -139678 -90131 -74675 -72920 5873 129243 47176 9052 -112934 -96790 24818 64719
$$ packed form
17121a2842L0308L4260m4771o6273k8290N6792R870K169k9632M839k2775n7961
17109a24306R347K5397Q3334J9613k8042k6973L8407M3719J4412j52115j30719
17098b27926j04999l2594P5043J63495Q0430K2608j0648J2524q450J0650P365
17087a2502q1928K9936P667K432m3892j21004K1988N8577R8300P3669j0897j26933
17075a04587n8513L065o8386L2386L4982L9718o1515k4817P1481P8576Q7504k621
17063B7273r2237l1734O2196M7123o7094l003P332P9539J5545P2298J6080j27854
17051E464J3191M3934o298r8616L776J5955L1224J5558k2794l6833r4729r510
17039a39678M9547J5456J755P8793J23370q2067l8124j21986J6144J21608L9901
$$ plain form
17028 64719 131096 127893 28525 -1343 19324 -10210 -15794 -3083 89777 203697 231818 101011
17016 101011 18529 58580 91662 73647 87150 138299 254649 397086 475702 467404 479352
17005 479352 542539 571546 608598 703056 608201 644566 766358 784986 799226 890539 946665
16994 946665 982360 975372 888661 734773 595202 538152 468010 407429 432162 375207 381197
16983 381197 371573 358590 205724 95978 88401 114368 113435 135717 213356 239787 252797 241155
16971 241155 180866 266808 322243 285948 226236 195643 196154 239791 196512 75245 86715 197703
16959 197703 230907 242350 261043 273654 221774 96909 46148 57899 35177 50700 77667
16948 77667 150566 225434 183926 63325 38549 73028 53576 108082 145242 184882 111749
$$ packed form
17028F4719O6377l203r9368k9868K0667k9534n584J2711R2860J13920K8121j30807
17016A01011q2482M0051L3082j8015J3503N1149J16350J42437P8616q298J1948
17005D79352O3187K9007L7052R4458r4855L6365J21792J8628J4240R1313N6126
16994I46665L5695o988q6711j53888j39571n7050p0142o0581K4733n6955N990
16983C81197r624j2983j52866j09746p577K5967r33K2282P7639K6431J3010j1642
16971B41155o0289Q5942N5435l6295n9712l0593N11M3637m3279j21267J1470J10988
16959A97703L3204J1443J8693J2611n1880j24865n0761J1751k2722J5523K6967
16948G7667P2899P4868m1508j20601k4776L4479j9452N4506L7160L9640p3133
$$ plain form
16937 111749 50313 42722 76571 117241 39404 -84338 -91052 -405 14432 -25114 -55014 24528
16925 24528 60766 37701 -11129 -9835 80086 78883 107679 178535 146969 104503 46240 18238
16913 18238 57471 45521 -66195 6222 41482 12422 -29600 8751 35848 -9058 -10514 7304
16901 7304 16574 11067 66246 25139 -767 -73579 -33819 125792 130573 43847 -40448 -20561
16889 -20561 41371 41120 -54915 -150337 -62579 -57173 -51393 -119347 -139758 -18776 -23629 -39354
16877 -39354 -99549 -152019 -85007 46574 24091 -62661 -117725 -111447 -68434 -71073 -57940 -12199
16865 -12199 139816 150895 76518 93376 54305 12632 42853 57469 5604 -2769 -29501 -107992
16853 -107992 -159076 -70970 -14563 -3834 -65654 -125917 -188138 -153476 -115687 -52642 -49105 17518
$$ packed form
16937A11749o1436p591L3849M0670p7837j23742o714R0647J4837l9546k9900P9542
16925B4528L6238k3065m8830J294Q9921j203K8796P0856l1566m2466n8263k8002
16913A8238L9233j1950j11716P2417L5260k9060m2022L8351K7097m4906j456J7818
16901G304R270n507N5179m1107k5906p2812L9760J59611M781q6726q4295J9887
16889b0561O1932k51r6035r5422Q7758N406N780o7954k0411J20982m853j5725
16877c9354o0195n2470O7012J31581k2483q6752n5064O278M3013k639J3133M5741
16865a2199J52015J1079p4377J6858l9071m1673L0221J4616n1865q373k6732p8491
16853a07992n1084Q8106N6407J0729o1820o0263o2221L4662L7789O3045L537O6623
$$ plain form
16841 17518 67798 15454 62208 42226 27306 -54847 -215921 -159025 -149002 -184724 -67782
16830 -67782 -9929 55497 75128 10039 -84957 -120564 -150975 -117714 -114661 -131889 -52956 -9713
16818 -9713 -58166 -11385 -27151 3295 15077 -3047 6812 4721 -2873 -19959 -56924 -36269
16806 -36269 24255 16202 -5693 87654 189989 82865 279 -61951 -125753 -217535 -105654
16795 -105654 45400 41951 14011 930 47304 29793 -1666 23070 24075 40200 1878 -34582
16783 -34582 -39980 -64326 -40821 88173 124833 95801 85799 -3005 -77580 -122804 -127818 -131417
16771 -131417 -64676 59560 15803 -98365 -180937 -139998 -37028 -25463 -80670 -56168 7492
16760 7492 5089 37255 -27259 -85370 -52563 -9628 -29024 -104673 -93708 -54404 10395 38742
$$ packed form
16841A7518N0280n2344M6754j9982j4920q2153j61074N6896J0023l5722J16942
16830f7782N7853O5426J9631o5089r4996l5607l0411L3261L053j7228P8933M3243
16818i713m8453M6781j5766L0446J1782j8124R859k091p594j7086l6965K0655
16806c6269O0524q053k1895R3347J02335j07124q2586o2230o3802r1782J11881
16795a05654J51054l449k7940j3081M6374j7511l1459K4736J005J6125l8322l6460
16783c4582n398k4346K3505J28994L6660k9032j0002q8804p4575m5224n014l599
16771a31417O6741J24236m3757j14168q2572M0939J02970J1565n5207K4502O3660
16760G492k403L2166o4514n8111L2807M2935j9396p5649J0965L9304O4799K8347
$$ plain form
16748 38742 28604 69637 27048 32655 40723 27302 -116825 42684 130541 68351 96613 114538
16736 114538 15547 48435 67859 69094 78803 73207 159202 254351 170554 112213 82720 54472
16724 54472 -6222 -18157 -10236 70854 151925 150244 56693 -48817 23345 -69503 -127114 -74985
16712 -74985 73029 81580 10202 -1481 43398 57117 -27257 -72741 49448 16289 -47186
16701 -47186 -74529 56814 83237 70225 157578 21256 -105812 -147360 -223990 -223610 -182734
16690 -182734 -74796 -44806 -26216 2572 -24495 -91592 -101319 -142413 -148410 18636 33729
16679 33729 504 -51484 3845 9567 4276 -50147 -87682 -13948 89211 25656 -17562 -53806
16667 -53806 -49296 -107147 -167876 -174259 -154008 -223514 -222937 -234523 -192570 -175180 -248600 -207421
$$ packed form
16748C8742j0138M1033m2589N607Q068j3421j44127J59509Q7857o2190K8262J7925
16736A14538r8991L2888J9424J235R709n596Q5995R5149q3797n8341k9493k8248
16724E4472o0694j1935P921Q1090Q1071j681r3551j05510P2162r2848n7611N2129
16712g4985J48014Q551p1378j1683M4879J3719q4374m5484J22189l3159o3475
16701d7186k7343J31343K6423j3012Q7353j36322j27068m1548p6630L80M0876
16690a82734J07938K9990J8590K8788k7067o7097r727m1094n997J67046J5093
16679C3729l3225n1988N5329N722n291n4423l7535P3734J03159o3555m3218l6244
16667e3806M510n7851o0729o383K0251o9506N77j1586M1953J7390p3420M1179
$$ plain form
16655 -207421 -166065 -124955 -44122 -40330 -12462 101537 83211 91995 30535 -10189 -64307 -27417
16643 -27417 46662 -51631 -65676 -27411 -53505 18618 88015 -12470 -27645 -11875 -75541
16632 -75541 -135459 -17780 -35502 -67874 -120715 -123884 -114066 -108138 -90006 -105585 -150038 -129618
16620 -129618 -114012 -106088 -8451 64619 38119 -56857 -18142 -71146 -168251 -155074 -110363 -32031
16608 -32031 35195 40681 -80701 -160818 -167359 -187548 -246125 -180038 -155822 -113050 -84049 -89062
16596 -89062 -90556 29312 3834 3873 -11138 14606 -3910 16824 22536 77656 20027 -15142
16584 -15142 -11625 -50841 43217 39202 4596 -4147 -54933 -134337 -136016 -169824 -97387 -55825
16572 -55825 -120971 -49986 -10337 7548 -5527 -24061 -28325 -27931 -40086 -3959 37762 -19477
$$ packed form
16655b07421M1356M1110Q0833L792K7868J13999j8326Q784o1460m0724n4118L6890
16643b7417P4079r8293j4045L8265k6094P2123O9397j00485j5175J5770o3666
16632g5541n9918J17679j7722l2372n2841l169R818N928J8132j5579m4453K0420
16620a29618J5606P924R7637P3070k6500r4976L8715n3004r7105J3177M4711P8332
16608c2031O7226N486j21382q0117o541k0189n8577O6087K4216M2772K9001n013
16596h9062j494J19868k5478L9j5011K5744j8516K0734N712N5120n7629l5169
16584a5142L517l9216R4058m015l4606q743n0786p9404j679l3808P2437M1562
16572e5825o5146P0985L9649J7885j3075j8534m264L94j2155L6127M1721n7239
$$ plain form
16560 -19477 -57744 -119986 -117796 -52900 -193 -560 104392 76506 48185 126606 87132 -3113
16548 -3113 -4386 23719 48667 -13189 1417 -75798 -43941 9110 74298 102120 155339 149605
16536 149605 63573 45013 31935 115233 119135 24740 23953 -41086 -154817 -27380 153676
16525 153676 49371 -97711 -91136 -98766 -30438 -23939 -18328 -56482 -173960 -133439 -88111 -63109
16513 -63109 -28983 40925 -5022 -47492 -40648 -36717 16854 8307 -39582 -26502 -37219 17250
16501 17250 2484 -91746 -63941 -34446 -47207 -34640 -24166 -65474 45085 85322 16357
16490 16357 -14431 -10065 52133 -81190 -131433 -82105 53709 67257 123341 205493 172456
16479 172456 176140 134840 90739 103355 132446 100435 61408 56666 146636 102381 94871 -19040
$$ packed form
16560a9477l8267o2242K190O4896N2707l67J04952k7886k8321P8421l9474r0245
16548c113j273K8105K4948o1856J4606p7215L1857N3051O5188K7822N3219n734
16536A49605q6032j8560j3078Q3298L902r4395p87o5039j13731J27437J81056
16525A53676j04305j47082O575p630O8328O499N611l8154j17478M0521M5328K5002
16513f3109L4126O9908m5947m2470O844L931N3571q547m7889J3080j0717N4469
16501A7250j4766r4230K7805K9495j2761J2567J0474m1308J10559M0237o8965
16490A6357l0788M366O2198j33323n0243M9328J35814J3548N6084Q2152l3037
16479A72456L684m1300m4101J2616K9091l2011l9027m742Q9970m4255p510j13911
$$ plain form
16467 -19040 -17885 -44765 12857 69901 126733 90279 53700 -20454 -133366 -130634 -165355 -197977
16455 -197977 -172461 -75379 -53846 -91212 -176637 -178826 -154993 -102651 -49548 18075 -27427 -10923
16443 -10923 -37914 47170 186476 145688 175929 263903 354251 242541 43534 -68409 -54999
16432 -54999 -81244 -66835 -4468 -4400 -39007 -22473 22892 -42478 -142251 -89523 -96771 -27515
16420 -27515 -29376 -56989 4645 54022 -33973 -18764 29786 74243 109419 123161 136330 71750
16408 71750 106037 84581 -37766 -136467 -133430 -191746 -179079 -117029 -82634 -85202 -120063 -66403
16396 -66403 36478 7784 -35586 -44743 23335 23547 -34971 13083 80172 32130 4824 -10539
16384 -10539 -62301 7337 89569 120832 111972 10885 -55712 -55824 -22200 -14394 -22770 -4942
$$ packed form
16467a9040J155k6880N7622N7044N6832l6454l6579p4154j12912K732l4721l2622
16455a97977K5516R7082K1533l7366q5425k189K3833N2342N3103O7623m5502J6504
16443a0923k6991Q5084J39306m0788L0241Q7974R0348j11710j99007j11943J3410
16432e4999k6245J4409O2367O8l4607J6534M5365o5370r9773N2728p248O9256
16420b7515j861k7613O1634M9377q7995J5209M8550M4457L5176J3742J3169o4580
16408G1750L4287k1456j22347r8701L037n8316J2667O2050L4395k568l4861N3660
16396f6403J02881k8694m3370r157O8078K12n8518M8054O7089m8042k7306j5363
16384a0539n1762O9638Q2232L1263q860j01087o6597j12L3624P806q376J7828
$$ plain form
16372 -4942 569 -26254 -56087 53587 159415 152767 77544 122124 138003 -24582 -181462
16361 -181462 -80128 -9198 -16670 -46234 -17129 -42582 -87114 -118807 -52634 56186 72505
16350 72505 71662 79959 -14284 -126095 -107519 -83808 4288 63285 94713 44981 -29676 -5625
16338 -5625 23087 63706 28261 -61587 -65886 -31676 12919 698 -47614 -139188 -210133 -212954
16326 -212954 -180111 -178338 -137838 -73609 -109744 -139615 -170791 -84056 29039 -14968 -30768
16315 -30768 -98398 -93903 -17076 9464 31632 13343 36008 28065 73546 118118 69159 112100
16303 112100 132203 36605 103355 99364 44791 -23799 -11256 -40676 -38562 61040 47032 -25463
16291 -25463 -47978 -88232 -78961 -69470 -13645 -2805 -54863 -94436 21185 104087 62586 -29659
$$ packed form
16372d942N511k6823k9833J09674J05828o648p5223M4580J5879j62585j56880
16361a81462J01334P0930p472k9564K9105k5453m4532l1693O6173J08820J6319
16350G2505q43Q297r4243j11811J8576K3711Q8096N8997L1428m9732p4657K4051
16338e625K8712M0619l5445q9848m299L4210M4595j2221m8312r1574p0945k821
16326b12954L2843J773M0500O4229l6135k9871l1176Q6735J13095m4007j5800
16315c0768o7630M495P6827K6540K2168j8289K2665p943M5481M4572m8959M2941
16303A12100K0103r5598O6750l991n4573o8590J2543k9420K114R9602j4008p2495
16291b5463k2515m0254R271R491N5825J0840n2058l9573J15621Q2902m1501r2245
$$ plain form
16279 -29659 -50454 -19447 -38845 -35685 -53720 -96158 -68837 10247 107743 97539 67476 43952
16267 43952 86297 77401 101795 64018 -38286 -21101 -57992 -103491 -115193 -248157 -285711
16256 -285711 -270514 -222640 -161539 -100130 -66995 -27380 -60635 -89597 -106513 -168906 -179911
16245 -179911 -161827 -14260 62835 98572 202811 116104 82810 172281 159759 126187 128250
16234 128250 154985 56928 34822 82200 16777 -101666 -48305 1265 -28954 321 39742
16223 39742 50160 32150 -1582 -2972 78624 67370 68476 -52329 -102036 -102971 -62034 -56203
16211 -56203 -49122 -12272 76225 116359 86389 100772 135449 191923 113328 14902 7656 -64652
16199 -64652 -50100 27352 29063 17103 -40123 53744 70519 6459 -87831 -94792 -31736 9372
$$ packed form
16279b9659k0795L1007j9398L160j8035m2438K7321P9084R7496j0204l0063k3524
16267D3952M2345q896K4394l7777j02304J7185l6891m5499j1702j32964l7554
16256b85711J5197M7874O1101O1409L3135L9615l3255k8962j6916o2393j1005
16245a79911J8084J47567P7095L5737J04239q6707l3294Q9471j2522l3572K063
16234A28250K6735r8057k2106M7378o5423j18443N3361M9570l0219K9275L9421
16223C9742J0418j8010l3732j390Q1596j1254J106j20805m9707r35M0937N831
16211e6203P081L6850Q8497M0134k9970J4383L4677N6474p8595r8426p246p2308
16199f4652J4552P7452J711j1960n7226R3867J6775o4060r4290o961O3056M1108
$$ plain form
16187 9372 -9155 -60470 -91050 3362 101192 70971 31212 102024 56623 -46393 -87398 -140499
16175 -140499 -94524 -115840 -78595 -58257 -11481 -35098 -95107 -121903 -44880 22092 83421
16164 83421 54488 12237 -29908 -24817 11281 55323 6962 -33742 -56826 -49605 -16983 -47485
16152 -47485 -173425 -98890 3929 -22384 -56574 -57039 27965 60804 -11605 54819 68044 -25618
16140 -25618 -129409 -88251 -127591 -189765 -123134 -52670 1224 42412 53318 76968 81709 51215
16128 51215 24117 96415 112279 85002 78213 118525 95122 87541 132504 186758 73283 -47045
16116 -47045 -136136 -60983 78720 105761 88939 100116 5453 -37541 -81637 -73497 -63264 -7858
16104 -7858 16553 11918 -31048 16389 7048 -2637 -15354 -16220 15551 -13415 -119647 -147902 -170699
$$ packed form
16187I372j8527n1315l0580R4412R7830l0221l9759P0812m5401j03016m1005n3101
16175a40499M5975k1316L7245K0338M6776k3617o0009k6796P7023O6972O1329
16164H3421k8933m2251m2145N091L6098M4042m8361m0704k3084P221L2622l0502
16152d7485j25940P4535J02819k6313l4190m65Q5004L2839p2409O6424J3225r3662
16140b5618j03791M1158l9340o2174O6631P0464N3894M1188J0906K3650M741l0494
16128E1215k7098P2298J5864k7277o789M0312k3403p581M4963N4254j13475j20328
16116d7045q9091P5153J39703K7041j6822J1177r4663m2994m4096Q140J0233N5406
16104g858K4411m635m2966M7437r341r685j2717q66L1771k8966j06232k8255k2797
$$ plain form
16091 -170699 -130438 -68283 -82506 -52108 10055 647 69891 27294 -21507 69647 75183 28424
16079 28424 -28629 -47384 7298 26028 28036 -33488 34871 39321 39169 24246 7295 61347
16067 61347 71370 70802 74981 104316 -14498 -22054 -126589 -205101 -205396 -134172 34207 98896
16055 98896 17981 -16514 -26963 -9766 51010 -15377 -97709 -148516 -44705 92912 61496
16044 61496 -61840 -74497 -70562 -134408 -32946 96515 63007 -42863 -56479 -54536 -53675 -82564
16032 -82564 -123651 -201347 -246268 -222329 -158038 -44934 -2249 52830 32876 134245 179707
16021 179707 84068 -13213 -21998 -62374 -49201 -75491 -124895 -26506 -19197 9224 111206 90449
16009 90449 51063 69353 166083 80424 -51801 -64049 -47492 -20494 -47719 -116214 -90705
$$ packed form
16091a70699M0261O2155j4223L0398O2163r408O9244m2597m8801R1154N536m6759
16079B8424n7053j8755N4682J8730K008o1524O8359M450j52j4923j6951N4052
16067F1347J0023n68M179K9335j18814p556j04535p8512k95P1224J68379O4689
16055I8896q0915l4495j0449J7197O0776o6387q2332n0807J03811J37617l1416
16044F1496j23336j2657L935o3846J01462J29461l3508j05870j3616J943Q61k8889
16032h2564m1087p7696m4921K3939O4291J13104M2685N5079j9954J01369M5462
16021A79707r5639r7281q785m0376J3173k6290m9404R8389P309K8421J01982k0757
16009I0449l9386J8290R6730q5659j32225j2248J6557K6998k7225o8495K5509
$$ plain form
15998 -90705 -119629 -245206 -248808 -261058 -209689 -79745 100477 157139 71707 60544 131484
15987 131484 95671 -6729 72964 165627 138465 115067 80666 -62726 -151188 -237261 -328942
15976 -328942 -295280 -253891 -197530 -144249 -147164 -107974 -10152 41896 125378 98201 96679 97951
15964 97951 15575 8629 -49153 -117846 -82820 51329 87417 46491 83778 -1929 -9362 73361
15952 73361 130530 50507 -61892 -115057 2006 -9265 -92137 25194 153654 139487 86256
15941 86256 68605 58727 -46551 12019 23164 -21423 -60242 -43173 -4588 17061 -11688 -33356
15929 -33356 -8732 8112 -84683 -9113 48194 43246 27437 120811 153045 161711 78846 27016
15917 27016 -12101 -25461 16897 13661 -72670 -88457 -32116 -64772 -159117 -182953 -124386 -165414
$$ packed form
15998i0705k8924j25577l602j2250N1369J29944J80222N6662q5432j1163P0940
15987A31484l5813j02400P9693R2663k7162k3398l4401j43392q8462q6073r1681
15976c28942L3662M1389N6361N3281k915L9190R7822N2048Q3482k7177j522J272
15964I7951q2376o946n7782o8693L5026J34149L6088m0926L7287q5707p433Q2723
15952G3361N7169q0023j12399n3165J17063j1271q2872J17331J28460j4167n3231
15941H6256j7651r878j05278N8570J1145m4587l8819J7069L8585K1649k8749k1668
15929c3356K4624J6844r2795P5570N7307m948j5809R3374L2234Q666q2865n1830
15917B7016l9117j3360M2358l236q6331j5787N6341l2656r4345k3836N8567m1028
$$ plain form
15905 -165414 -104127 -59900 -28476 47110 83024 42102 -10508 59187 154431 26888 440
15894 440 5904 42893 68149 93721 -13446 9237 60393 64507 88877 78478 -42221 -4700
15882 -4700 91234 85427 64531 128090 120440 52587 183158 236814 94995 -44293 -10546 54401
15870 54401 44647 29591 -85691 -121491 -13783 14450 117589 155452 94773 61755 95843
15859 95843 152372 56436 12964 -52991 -98058 -153914 -168996 -78904 16628 -34196 -132266 -72129
15847 -72129 -77566 -76013 -8672 26228 -6079 8543 62694 12971 1631 -39366 -12475 6967
15835 6967 -6189 -75172 -70489 -178376 -190137 -12415 68267 136462 80206 2587 7594 -4323
15823 -4323 29545 -27964 -96989 -74577 8757 33764 60529 -39077 -94305 -69291 -59339 -81411
$$ packed form
15905a65414O1287M4227L1424P5586L5914m0922n2610O9695R5244j27543k6448
15894D40N464L6989K5256K5572j07167K2683N1156M114K4370j0399j20699L7521
15882d700R5934n807k0896O3559p650o7853J30571N3656j41819j39288L3747O4947
15870E4401r754j5056j15282l5800J07708K8233J03139L7863o0679l3018L4088
15859I5843N6529r5936m3472o5955m5067n5856j5082R0092R5532n0824r8070O0137
15847g2129n437J553O7341L4900l2307J4622N4151m9723j1340m0997K6891J9442
15835F967j3156o8983M683j07887j1761J77722Q0682O8195n6256p7619N007j1917
15823d323L3868n7509o9025K2412Q3334K5007K6765r9606n5228K5014R952k2072
$$ plain form
15811 -81411 -103495 -103969 -65874 -31813 50967 102044 88354 44123 64338 88090 15053 -56389
15799 -56389 30049 10254 -54625 47479 29501 -26425 10582 -30723 -67958 -5412 -35356
15788 -35356 -119926 -86166 -25238 -15816 63228 112240 54467 20769 -17040 -39318 5326 48457
15776 48457 82698 116141 71174 -79676 -122020 -106341 -104766 -80752 -133952 -122134 -163924 -181265
15764 -181265 -158698 -141091 -24665 24733 -11361 58322 241324 167930 51208 -44208 8099
15753 8099 57757 107752 34776 -54625 43578 25211 31341 108399 7298 -86343 18410 115769
15741 115769 126605 117031 -18347 -65036 -153918 -168359 -129114 -141792 -102301 -96307 -8949 73359
15729 73359 149643 134196 -4749 -145032 -71142 21165 65951 29911 63885 77690 62683
$$ packed form
15811h1411k2084m74L8095L4061Q2780N1077j3690m4231K0215K3752p3037p1442
15799e6389Q6438j9795o4879J02104j7978n5926L7007m1305l7235O2546k9944
15788c5356q4570L3760O0928R422P9044M9012n7773l3698l7809k2278M4644M3131
15776D8457L4241L3443m4967j50850m2344J5679J575K4014n3200J1818m1790j7341
15764a81265K2567J7607J16426M9398l6094O9683J83002p3394j16722r5416N2307
15753H099M9658M9995p2976q9401R8203j8367O130P7058j01101r3641J04753R7359
15741A15769J0836r574j35378m6689q8882j4441L9245j2678L9491N994Q7358Q2308
15729G3359P6284j5447j38945j40283P3890R2307M4786l6040L3974J3805j5007
$$ plain form
15718 62683 11005 19027 -29807 -57294 -97697 -109285 -31967 -52686 -89972 -132704 -27153 -226
15706 -226 -23787 -102862 -17643 26007 165298 161191 -8118 10954 66856 64971 9831 -108837
15694 -108837 -85187 -64014 -91215 -14546 8751 -6290 -46026 61104 8174 -25706 44378
15683 44378 18802 -91864 -152050 -99257 -39515 -22643 -86224 -101556 -70033 -45175 37172
15672 37172 26680 -26890 -20194 -6893 -97617 -80700 -29526 -20764 -12348 55715 12205 -28616
15660 -28616 -2696 72577 139675 92841 -24336 21203 -25935 -24544 -89754 -148715 -66833 50834
15648 50834 95199 98794 91073 54102 32564 59431 29022 -30034 -16631 58115 139317 72881
15636 72881 15908 20903 88788 -21203 -4390 168860 254990 154897 39781 7155 19724
$$ packed form
15718F2683n1678Q022m8834k7487m0403j1588P7318k0719l7286m2732J05551K6927
15706b26k3561p9075Q5219M3650J39291m107j69309J9072N5902j885n5140j18668
15694a08837K3650K1173k7201P6669K3297j5041l9736J07130n2930l3880P0084
15683D4378k5576j10666o0186N2793N9742J6872o3581j5332L1523K4858Q2347
15672C7172j0492n3570O696J3301r0724J6917N1174Q762Q416O8063m3510m0821
15660b8616K5920P5273O7098m6834j17177M5539m7138J391o5210n8961Q1882J17667
15648E0834M4365L595p721l6971k1538K6867l0409n9056J3403P4746Q1202o6436
15636G2881n6973M995O7885j09991J6813J73250Q6130j00093j15116l2626J2569
$$ plain form
15625 19724 20634 112384 178845 58063 -76281 -82767 53068 88341 79014 57490 36611 44235
15613 44235 51299 81839 5994 -160407 -154994 -66929 19240 -94430 -166335 -103067 -51180 11303
15601 11303 23145 -52975 -84298 -53706 -53745 -65835 -9041 127357 98344 75877 123509 126695
15589 126695 43469 -6780 -37781 14977 70908 173583 236835 254500 193618 73964 3489
15578 3489 18465 -25317 -19862 -11592 32953 -10415 -39109 -13847 60369 89749 72862 49135
15566 49135 41216 16412 4957 -44247 -83052 -11826 -32227 -131393 -60450 -16709 -15512 55600
15554 55600 50104 95832 164181 71554 -40441 -110668 -89397 -49854 -61965 -21472 -14093 -51896
15542 -51896 -84892 42790 103313 57991 24626 54585 64721 64858 48819 -1185 36313 55073
$$ packed form
15625A9724R10R1750O6461j20782j34344o486J35835L5273r327k1524k0879P624
15613D4235P064L0540p5845j66401N413Q8065Q6169j13670p1905O3268N1887O2483
15601A1303J1842p6120l1323L0592l9j2090N6794J36398k9013k2467M7632L186
15589A26695q3226n0249l1001N2758N5931J02675O3252J7665o0882j19654p0475
15578C489J4976m3782N455Q270M4545m3368k8694K5262P4216K9380j6887k3727
15566D9135p919k4804j1455m9204l8805P1226k0401r9166P0943M3741J197P1112
15554E5600n496M5728O8349r2627j11995p0227K1271L9543j2111M0493P379l7803
15542e1896l2996J27682O0523m5322l3365K9959J0136J37j6039n0004L7498J8760
$$ plain form
15530 55073 47022 39441 123946 156221 75034 -36097 35614 63419 81267 73252 44337 55782
15518 55782 19801 31540 -42670 -123140 -139294 -90893 -97688 -77017 21280 58460 156064 107787
15506 107787 -32029 -118680 -15916 31753 -14055 -83572 -95838 -109498 -100332 -97131 -65772
15495 -65772 -66121 -110623 -79439 -58995 -46704 -69591 -227899 -179547 -69615 -36622 -90844 -153224
15483 -153224 -185400 -80503 -60076 -28044 23050 120537 86081 -52499 -106362 -48361 19164
15472 19164 9988 -9613 9429 -38821 -7394 43767 56634 96106 53209 12444 -58361 -56318
15460 -56318 -41495 -58076 -121161 -160342 -113337 -5577 64944 -3589 13667 -24933 -28067 -27327
15448 -27327 -86122 -96335 -121633 -86623 -56855 -67841 -33714 38030 13149 32218 -2527 -85724
$$ packed form
15530E5073q051p581Q4505L2275q1187j11131P1711K7805J7848q015k8915J1445
15518E5782l5981J1739p4210q0470j6154M8401o795K0671R8297L7180R7604m8277
15506A07787j39816q6651J02764M7669m5808o9517j2266j3660R166L201L1359
15495f5772l49m4502L1184K0444J2291k2887j58308M8352J09932L2993n4222o2380
15483a53224l2176J04897K0427L2032N1094R7487l4456j38580n3863N8001O7525
15472A9164r176j9601J9042m8250L1427N1161J2867L9472m2897m0765p0805K043
15460e6318J4823j6581o3085l9181M7005J07760P0521o8533J7256l8600l134P40
15448b7327n8795j0213k5298L5010K9768j0986L4127P1744k4881J9069l4745q3197
$$ plain form
15436 -85724 14432 69602 33067 -22916 -79791 -108861 -129772 -121620 -103146 -140791 -195830 -115537
15424 -115537 23589 -32027 4187 1130 -3278 -18681 46896 41638 20577 -31184 -99634 -127755
15412 -127755 -138301 -129235 -76052 -22127 -11277 -99148 -139986 -59186 10625 31617 23712 115793
15400 115793 85801 -108576 -182415 -129516 -62537 -146808 -45905 -39615 -120253 -132633 -59588
15389 -59588 -6264 7227 16950 85380 84201 -13802 -94722 4037 77719 21088 -23966 24443
15377 24443 150087 142991 -50476 -177575 -50011 41593 29398 42194 -5742 23930 58500
15366 58500 25685 -79636 -141061 -156593 -55924 45370 59072 85535 164568 148743 63474
15355 63474 -9182 -65349 -76082 -55398 3148 80627 121841 83057 52537 48386 84982 18676
$$ packed form
15436h5724J00156N5170l6535n5983n6875k9070k0911Q152J8474l7645n5039Q0293
15424a15537J39126n5616L6214l057m408j5403O5577n258k1061n1761o8450k8121
15412a27755j0546R066N3183N3925J0850q7871m0838Q0800O9811K0992p905R2081
15400A15793k9992j94377p3839N2899O6979q4271J00903O290q0638j2380P3045
15389e9588N3324J3491R723O8430j179r8003q0920R8759P3682n6631m5054M8409
15377B4443J25644p096j93467j27099J27564R1604j2195J2796m7936K9672L4570
15366E8500l2815j05321o1425j5532J00669J01294J3702K6463P9033j5825q5269
15355F3474p2656n6167j0733K0684N8546P7479M1214l8784l0520m151L6596o6306
$$ plain form
15343 18676 9363 31497 18829 28769 92868 101274 96193 60638 59959 56047 -78170 -83441 -458
15330 -458 -16300 -75853 5605 7628 24386 39980 49084 101163 78082 -5261 4014 -29136 -87655
15317 -87655 -135820 -22914 27308 -76020 -103904 -52995 -36225 -38172 -39266 -11595 11692 -50523
15305 -50523 -76088 -55183 1327 3722 -6476 -13285 -50900 -6154 14678 -45160 -129353 -57284
15293 -57284 -45598 47639 92901 27401 25196 -15927 -15298 16099 -17370 -100196 -55345 -37326
15281 -37326 -51462 -100023 -99834 -107871 -13635 66112 169154 173896 164785 157908 55247 50908 147948
15268 147948 141419 77219 66731 111128 73063 8121 -66224 -102963 -56352 -87902 -40625 131203
15256 131203 291949 305746 253911 230569 191867 126117 25324 -15954 57499 135937 192205
$$ packed form
15343A8676r313K2134j2668R940O4099Q406n081l5555o79l912j34217n271Q2983
15330d58j5842n9553Q1458K023J6758J5594R104N2079k3081q3343R275l3150n8519
15317h7655m8165J12906N0222j03328k7884N0909J6770j947j094K7671K3287o2215
15305e0523k5565K0905N6510K395j0198o809l7615M4746K0832n9838q4193P2069
15293e7284J1686R3237M5262o5500k205m1123O29L1397l3469q2826M4851J8019
15281c7326j4136m8561J89q037R4236P9747J03042M742r111o877j02661m339R7040
15268A47948o529o4200j0488M4397l8065o4942p4345l6739M6611l1550M7277J71828
15256A31203J60746J3797n1835k3342l8702o5750j00793m1278P3453P8438N6268
$$ plain form
15245 192205 156678 54973 -22238 -126890 -139344 -55130 23881 54503 65075 53936 -14749
15234 -14749 -8501 -14636 -10947 -25078 5201 65300 177690 101383 -15906 -113420 -111778 -71866
15222 -71866 -30444 -56658 19484 2941 2106 -36536 -35190 19179 56451 44147 82867 20488
15210 20488 34892 23381 19877 7011 -12373 -34192 -32380 -35263 -23182 -139606 -196869 -123415
15198 -123415 -28702 -66106 -57011 -104267 -153002 -102536 -80619 -180259 -164058 -89951 -112842 -134931
15186 -134931 -105380 -72472 -35656 -88386 -168304 -99606 -22356 -129277 -142880 -133195 -174503
15175 -174503 -122700 1798 -27763 -121232 -151045 -70927 81616 105604 47043 70700 95842
15164 95842 53270 96156 132521 158531 189912 198264 142969 38895 -43606 -11010 -23325 47608
$$ packed form
15245A92205l5527j01705p7211j04652j2454Q4214P9011L0622J0572j1139o8685
15234a4749O248o135L689j4131L0279O0099J12390p6307j17289r7514J642L9912
15222g1866M1422k6214P6142j6543q35l8642J346N4369L7272j2304L8720o2379
15210B0488J4404j1511l504j2866j9384k1819J812k883J2081j16424n7263P3454
15198a23415R4713l7404R095m7256m8735N0466K1917r9640J6201P4107k2891k2089
15186a34931K9551L2908L6816n2730p9918O8698P7250j06921j3603R685m1308
15175a74503N1803J24498k9561r3469k9813Q0118J52543K3988n8561K3657K5142
15164I5842m2572M2886L6365K6010L1381Q352n5295j04074q2501L2596j2315P0933
$$ plain form
15152 47608 94825 37741 -15349 -31376 22892 16317 -27665 -53451 -18364 107151 113058 52420
15140 52420 56072 8661 -79431 -70619 -19719 13817 -398 19060 -48717 -167315 -157976 -76266
15128 -76266 -31422 43859 110766 112770 -14974 44802 119788 110977 59524 31075 -12194 -58724
15116 -58724 -71962 -159351 -137209 -57080 -45106 -153417 -199445 -93238 -32338 39977 111275
15105 111275 223922 233973 169916 139888 103483 77261 79472 68934 40235 13898 51844
15094 51844 85455 21224 69369 112773 78244 68160 93454 163131 68321 -14039 31410 23053
15082 23053 24639 20989 26511 20674 -105546 -141056 -114604 -86596 -49656 -48091 -7549 20220
15070 20220 45429 8476 -67591 -79388 -53786 19919 -73099 -137130 -182167 -75100 -101526
$$ packed form
15152D7608M7217n7084n3090j6027N4268o575m3982k5786L5087J25515N907o0638
15140E2420L652m7411q8092Q812N0900L3536j4215J9458o7777j18598R339Q1710
15128g6266M4844P5281O6907K004j27744N9776P4986q811n1453k8449m3269m6530
15116e8724j3238q7389K2142Q0129J1974j08311m6028J06207O0900P2315P1298
15105A11275J12647J0051o4057l0028l6405k6222K211j0538k8699k6337L7946
15094E1844L3611o4231M8145M3404l4529j0084K5294O9677r4810q2360M5449q357
15082B3053J586l650N522n837j26220l5510K6452K8008L6940J565M0542K7769
15070B0220K5209l6953p6067j1797K5602P3705r3018o4031m5037J07067k6426
$$ plain form
15059 -101526 -64955 -53437 -61 56983 54662 57069 35739 55690 -4823 -29326 13049 14098
15047 14098 -30266 -42236 3520 -115517 -165054 -104838 6248 16859 31849 37106 53011
15036 53011 10150 -111263 -134867 -79978 7061 14729 83394 49718 -51810 -22384 94918
15025 94918 45790 -56371 -49386 -3533 45658 -1966 -56878 18161 -43435 -85985 -151658 -47667
15013 -47667 40874 7343 -71537 -72936 -53158 -117941 -81029 -122285 -93394 -44079 -80820 -74358
15001 -74358 1114 86371 123969 -1084 -43070 19470 104300 114928 96713 -5866 -116793
14990 -116793 -129247 -108953 -116945 -59536 -72158 -102821 12590 25746 -14780 -440 -7414 25781
14978 25781 -102406 -237022 -202691 -122921 -64151 -127684 -104024 -39604 15258 48732 45397
$$ packed form
15059a01526L6571J1518N3376N7044k321K407k1330J9951o0513k4503M2375J049
15047A4098m4364j1970M5756j19037m9537O0216J11086J0611J4990N257J5905
15036E3011m2861j21413k3604N4889Q7039P668O8665l3676j01528K9426J17302
15025I4918m9128j02161O985M5853M9191m7624n4912P5039o1596m2550o5673J03991
15013d7667Q8541l3531p8880j399J9778o4783L6912m1256K8891M9315l6741O462
15001g4358P5472Q5257L7598j25053m1986O2540Q4830J0628j8215j02579j10927
14990a16793j2454K0294p992N7409j2622l0663J15411J3156m0526J4340o974L3195
14978B5781j28187j34616L4331P9770N8770o3533K3660O4420N4862L3474l335
$$ plain form
14967 45397 11302 -59525 -24476 26352 19020 -43158 -29714 -38208 31618 -19522 -43820 -67723
14955 -67723 -54356 16527 -16960 -8792 50468 55354 50839 2664 59150 -7187 -22116 -108587
14943 -108587 -57576 93146 101531 28389 -17145 -115286 -74348 -17996 49280 79692 130229
14932 130229 141983 108289 37783 -99762 -238744 -274125 -210303 -162221 -125298 -87847 -45377
14921 -45377 -34525 -49565 -72840 -54081 -22453 -14269 -38813 -43307 -80302 -34348 14674 -3139
14909 -3139 -119486 -189747 -141409 -78432 -97777 -10355 18231 53507 68965 16499 9890 28632
14897 28632 -57252 -49469 70005 86453 30276 -19529 -132362 -205399 -113284 -70234 -37284
14886 -37284 -94735 -118491 -173972 -124658 -37948 -19574 -12269 -9469 19469 71685 76505 85402
$$ packed form
14967D5397l4095p0827L5049N0828p332o2178J3444q494O9826n1140k4298k3903
14955f7723J3367P0883l3487Q168N9260M886m515m8175N6486o6337j4929q6471
14943a08587N1011J50722Q385p3142m5534r8141M0938N6352O7276L0412N0537
14932A30229J1754l3694p0506j37545j38982l5381O3822M8082L6923L7451M2470
14921d5377J0852j5040k3275J8759L1628Q184k4544m494l6995M5954M9022j7813
14909c139j16347p0261M8338O2977j9345Q7422K8586L5276J5458n2466o609J8742
14897B8632q5884P783J19474J6448n6177m9805j12833p3037R2115M3050L2950
14886c7284n7451k3756n5481M9314Q6710J8374P305K800K8938N2216M820Q897
$$ plain form
14874 85402 53238 33872 96217 86204 54138 22486 72318 60920 95825 140313 85872 86484
14862 86484 90926 106294 99552 5363 -82057 7420 50306 10105 7441 8363 50288 68698 89151
14849 89151 98980 97012 14379 -14432 -53877 -9039 -28049 -70657 8570 175252 144031 112312
14837 112312 173706 185453 185247 186212 169432 85484 -19580 -21168 -10917 -17528 -37916 -24863
14825 -24863 -17736 2110 -15556 -53715 -8517 -1304 52557 119554 93138 31483 10994 19524
14813 19524 -24962 -48304 19841 46472 72456 113510 99925 -34370 86082 173756 156913
14802 156913 110563 113400 95991 45296 35552 -903 -71384 -127491 -148713 -89115 9366 99788
14790 99788 127617 87429 51870 13315 4268 26791 38422 101609 63968 -12521 -10340 66801
$$ packed form
14874H5402l2164j9366O2345j0013l2066l1652M9832j1398L4905M4488n4441O12
14862H6484M442J5368o742r4189q7420Q9477M2886m0201k664R22M1925J8410K0453
14849H9151R829j968q2633k8811l9445M4838j9010m2608P9227J66682l1221l1719
14837A12312O1394J1747k06R65j6780q3948j05064j588J0251o611k0388J3053
14825b4863P127J9846j7666l8159M5198P213N3861O6997k6416o1655k0489Q530
14813A9524m4486k3342O8145K6631K5984M1054j3585j34295J20452Q7674j6843
14802A56913m6350K837j7409n0695r744l6455p0481n6107k1222N9598R8481R0422
14790I9788K7829m0188l5559l8555r047K2523J1631O3187l7641p6489K181P7141
$$ plain form
14778 66801 122358 65971 17813 -36670 -30034 23464 11569 -23988 48484 62586 49745 74768
14766 74768 188460 250337 315731 284563 195748 104952 75058 48758 72067 -5963 -54172
14755 -54172 -31166 24276 45735 52667 -7033 -18419 -42873 -98408 -14361 44747 -14585 -2113
14743 -2113 -78383 -89659 -27155 -9477 110178 89650 -18434 25874 6150 58841 62574 93697
14731 93697 71337 62252 15524 18990 19836 18774 -41548 -32003 54634 65001 67990 -1747 -74249
14718 -74249 -93060 -114330 -37041 68892 39320 83015 71746 29852 21998 91207 -5492 -130758
14706 -130758 -103244 -33136 -1733 -24225 1521 -34601 23018 67135 47401 46911 9267 -27454
14694 -27454 6232 56638 -58330 -104960 -22191 3869 -37444 -49263 -39357 -86382 -151370 -93475
$$ packed form
14778F6801N5557n6387m8158n4483O636N3498j1895l5557P2472J4102j2841K5023
14766G4768J13692O1877O5394l1168q8815r0796k9894k6300K3309p8030m8209
14755e4172K3006N5442K1459O932n9700j1386k4454n5535Q4047N9108n9332J2472
14743b113p6270j1276O2504J7678J19655k0528j08084M4308j9724N2691L733L1123
14731I3697k2360r085m6728L466Q46j062o0322R545Q6637J0367K989o9737p2502
14718g4249j8811k1270P7289J05933k9572M3695j1269m1894p854O9209r6699j25266
14706a30758K7514P0108L1403k2492K5746l6122N7619M4117j9734m90l7644l6721
14694b7454L3686N0406j14968m6630Q2769K6060m1313j1819R906m7025o4988N7895
$$ plain form
14682 -93475 -46580 -38461 -114828 -132458 -1195 -7160 -77912 -43458 -36993 -26912 15084 26002
14670 26002 84615 61983 -8899 52986 127930 118750 76145 114668 142197 138442 45737 55424
14658 55424 119368 103547 -71274 -89865 -23513 40984 50121 3471 -34764 38035 -17563 -23632
14646 -23632 63524 40209 -10658 35582 -43240 -57332 -44061 66505 23317 27157 58914 17758
14634 17758 24623 71976 81270 -43833 -106023 -82890 -128530 -174810 -212465 -153808 -131940 -130746
14622 -130746 -120066 -177304 -210196 -239570 -224534 -133034 -77475 -106365 -48197 43827 -4480
14611 -4480 25437 22582 16992 72723 66759 17851 -28571 56348 105984 109220 180315 74408
14599 74408 12798 46383 43964 -38028 -116781 -146604 -55665 91537 134120 -16911 -84177
$$ packed form
14682i3475M6895Q119p6367j7630J31263n965p0752L4454O465J0081M1996J0918
14670B6002N8613k2632p0882O1885P4944r180m2605L8523K7529l755r2705R687
14658E5424O3944j5821j74821j8591O6352O4497R137m6650l8235P2799n5598o069
14646b3632Q7156k3315n0867M6240p8822j4092J3271J10566m3188L840L1757m1156
14634A7758O865M7353R294j25103o2190K3133m5640m6280l7655N8657K1868J194
14622a30746J0680n7238l2892k9374J5036R1500N5559k8890N8168R2024m8307
14611d480K9917k855n590N5731n964m8908m6422Q4919M9636L236P1095j05907
14599G4408o1610L3585k419q1992p8753k9823R0939J47202M2583j51031o7266
$$ plain form
14588 -84177 -101246 -156561 -34477 44896 22377 18818 -55890 20102 58240 -2339 -70463 -94319
14576 -94319 3414 -14684 -57099 -180163 -253525 -232422 -81077 -78343 -85880 35601 95612
14565 95612 83575 160327 226891 184281 87982 65594 -5172 -17593 34897 -20622 -49104 53702
14553 53702 154206 157631 144276 144618 175239 79854 24201 80960 47821 73233 166133 128280
14541 128280 141889 201131 164060 64328 32282 -32913 -64847 -39864 45580 26676 112279
14530 112279 263192 191571 107991 25153 -65684 -54586 -3350 32998 46862 36897 81949
14519 81949 19517 40963 52355 21614 35501 -15079 -170393 -166508 -54137 44070 122809
14508 122809 121722 160565 189640 115651 65166 123149 63094 41982 53915 88333 194855
$$ packed form
14588h4177j7069n5315J22084P9373k2519l559p4708P5992L8138o0579o8124k3856
14576i4319R7733j8098m2415j23064p3362K1103J51345K734p537J21481O0011
14565I5612j2037P6752O6564m2610r6299k2388p0766j2421N2490n5519k8482J02806
14553E3702J00504L425j3355L42L0621r5385n5653N6759l3139K5412R2900l7853
14541A28280J3609N9242l7071r9732l2046o5195l1934K4983Q5444j8904Q5603
14530A12279J50913p1621q3580q2838r0837J1098N1236L6348J3864r965M5052
14519H1949o2432K1446J1392l0741J3887n0580j55314L885J12371R8207P8739
14508A22809j087L8843K9075p3989n0485N7983o0055k1112J1933L4418J06522
$$ plain form
14497 194855 134929 58110 72515 91012 73049 78745 54211 22118 29435 68634 36292 -47771
14485 -47771 -34314 4630 -61800 -127295 -36356 42434 92567 29028 82918 65111 274 -18601
14473 -18601 -48895 -121589 -94500 -30660 106298 155655 61042 -11092 -2399 27390 -35211 -82300
14461 -82300 -86116 -142329 -190760 -155345 -177001 -256386 -235098 -102594 -14146 141530 180309
14450 180309 78325 2394 36866 84811 155991 67824 -26102 -102037 -70419 25017 15807
14439 15807 -64847 3925 14980 -42953 -62153 -8024 19408 17434 46538 124942 163054 179558
14427 179558 26156 -11595 32157 12994 22665 43436 34598 24977 82266 13180 71755 134999
$$ packed form
14497A94855n9926p6819J4405J8497j7963N696k4534l2093P317L9199l2342q4063
14485d7771J3457L8944o6430o5495R0939P8790N0133o3539N3890j7807o4837j8875
14473a8601l0294p2694K7089O3840J36958M9357r4613p2134Q693K9789o2601m7089
14461h2300l816n6213m8431L5415k1656p9385K1288J32504Q8448J55676L8779
14450A80309j01984p5931L4472M7945P1180q8167r3926p5935L1618R5436r210
14439A5807q0654O8772J1055n7933j9200N4129K7432j974K9104P8404L8112J6504
14427A79558j53402l7751M3752j9163R671K0771q838r621N7289o9086N8575O3244
$$ [...]
##END NTUPLES=NMR SPECTRUM
##END=
