##TITLE=Analysis number 310509
Compound Code btb 09453
Chemist Name fudan
##JCAMPDX= 6.0         $$ Bruker NMR JCAMP-DX V2.0
##DATA TYPE= NMR SPECTRUM
##DATA CLASS= NTUPLES
##ORIGIN= Bruker BioSpin GmbH
##OWNER= NMR
$$ XWIN-NMR		Version 3.5
$$ Mon Jun 20 15:02:03 2005 GMT Daylight Time (UT+1h)  MAYBRIDGE\NMR@NMR_250MHZ
##.OBSERVE FREQUENCY= 250.131544655141
##.OBSERVE NUCLEUS= ^1H
##.ACQUISITION MODE= SIMULTANEOUS (DQD)
##.ACQUISITION SCHEME= undefined
##.AVERAGES= 16
##.DIGITISER RES= 18
##SPECTROMETER/DATA SYSTEM= dpx250
##.PULSE SEQUENCE= zg30
##.SOLVENT NAME= CDCl3
##.SHIFT REFERENCE= (INTERNAL, CDCl3, 0, 16.522)
##AUDIT TRAIL= $$ (NUMBER, WHEN, WHO, WHERE, WHAT)
$$ ##TITLE= Audit trail, XWIN-NMR		Version 3.5
$$ ##JCAMPDX= 5.01
$$ ##ORIGIN= Bruker BioSpin GmbH
$$ ##OWNER= NMR
$$ C:\u/data/dgb/nmr/ADRS/4290/pdata/1/auditp.txt
$$ ##AUDIT TRAIL=  $$ (NUMBER, WHEN, WHO, WHERE, WHAT)
(   1,<2005-06-20 15:01:44.94 +100>,<MAYBRIDGE\NMR>,<NMR_250MHZ>,
      <created by zg, POWCHK disabled, PULCHK disabled
       configuration hash MD5:
       62 19 C7 07 E1 42 D1 B7 37 6C 3D D0 77 39 F9 E6
       data hash MD5: 64K
       A4 F7 04 CE 42 02 90 75 0D EB CD 37 19 FC E0 C7>)
(   2,<2005-06-20 15:01:55.96 +100>,<MAYBRIDGE\NMR>,<NMR_250MHZ>,
      <Start of raw data processing
       ef LB = 0.3 FT_mod = 6 PKNL = 1 SI = 32K 
       data hash MD5: 32K
       4F 41 6C 3C 32 4B CD 8D 98 6D 12 90 F3 B6 91 83>)
(   3,<2005-06-20 15:01:57.74 +100>,<MAYBRIDGE\NMR>,<NMR_250MHZ>,
      <apk 
       data hash MD5: 32K
       99 16 49 2C 4B E9 3C 2A C4 ED 84 B0 7D 2C 78 E6>)
(   4,<2005-06-20 15:01:58.43 +100>,<MAYBRIDGE\NMR>,<NMR_250MHZ>,
      <abs ABSG = 5 
       data hash MD5: 32K
       A1 80 AD E1 CD EB 5F 45 99 1E 19 93 23 2D CA 0C>)
$$ ##END=
$$ 
$$ hash MD5
$$ 7E EF 08 D1 B4 0D 35 98 B9 54 CF B4 DE 3E F8 F7
##$RELAX= 
##$RELAX= 
##$RELAX= 
##$RELAX= 
##$RELAX= 
##$RELAX= 
##$RELAX= 
$$ Bruker specific parameters
$$ --------------------------
##$DU= <C:\u>
##$EXPNO= 4290
##$NAME= <ADRS>
##$PROCNO= 1
##$TYPE= <nmr>
##$USER= <dgb>
##$AMP= (0..31)
100 100 100 100 100 100 100 100 100 100 100 100 100 100 100 100 100 100 
100 100 100 100 100 100 100 100 100 100 100 100 100 100 
##$AQSEQ= 0
##$AQ_mod= 3
##$AUNM= <au_zg>
##$AUTOPOS= <21 >
##$BF1= 250.13
##$BF2= 250.13
##$BF3= 250.13
##$BF4= 250.13
##$BF5= 500.13
##$BF6= 500.13
##$BF7= 500.13
##$BF8= 500.13
##$BYTORDA= 1
##$CFDGTYP= 0
##$CFRGTYP= 5
##$CHEMSTR= <none>
##$CNST= (0..31)
1 1 145 1 1 1 1 1 1 1 1 1 1 1 1 1 1 1 1 1 1 1 1 1 1 1 1 1 1 1 1 1 
##$CPDPRG= <>
##$CPDPRG1= <>
##$CPDPRG2= <>
##$CPDPRG3= <>
##$CPDPRG4= <mlev>
##$CPDPRG5= <mlev>
##$CPDPRG6= <mlev>
##$CPDPRG7= <mlev>
##$CPDPRG8= <mlev>
##$CPDPRGB= <>
##$CPDPRGT= <>
##$D= (0..31)
0 1 0 0 0 0 0 0 0 0.06 0 0 0 0 0 0 0.0002 0 0 0 0 0 0 0 0 0 0 0 0 0 0 
0 
##$DATE= 1119276104
##$DBL= (0..7)
120 120 120 120 120 120 120 120 
##$DBP= (0..7)
150 150 150 150 150 150 150 150 
##$DBP07= 0
##$DBPNAM0= <>
##$DBPNAM1= <>
##$DBPNAM2= <>
##$DBPNAM3= <>
##$DBPNAM4= <>
$$ [...]
##$SUBNAM7= <"">
##$SUBNAM8= <"">
##$SUBNAM9= <"">
##$SW= 20.6930455092707
##$SWIBOX= (0..15)
0 0 3 0 0 0 0 0 0 0 0 0 0 0 0 0 
##$SW_h= 5175.983436853
##$TD= 65536
##$TD0= 1
##$TE= 295.16
##$TE2= 300
##$TE3= 300
##$TEG= 300
##$TL= (0..7)
0 120 120 120 120 120 120 120 
##$TP= (0..7)
150 150 150 150 150 150 150 150 
##$TP07= 0
##$TPNAME0= <>
##$TPNAME1= <>
##$TPNAME2= <>
##$TPNAME3= <>
##$TPNAME4= <>
##$TPNAME5= <>
##$TPNAME6= <>
##$TPNAME7= <>
##$TPOAL= (0..7)
0.5 0.5 0.5 0.5 0.5 0.5 0.5 0.5 
##$TPOFFS= (0..7)
0 0 0 0 0 0 0 0 
##$TUNHIN= 0
##$TUNHOUT= 0
##$TUNXOUT= 0
##$USERA1= <user>
##$USERA2= <user>
##$USERA3= <user>
##$USERA4= <user>
##$USERA5= <user>
##$V9= 5
##$VALIST= <valist>
##$VCLIST= <CCCCCCCCCCCCCCC>
##$VD= 0
##$VDLIST= <DDDDDDDDDDDDDDD>
##$VPLIST= <PPPPPPPPPPPPPPP>
##$VTLIST= <TTTTTTTTTTTTTTT>
##$WBST= 1024
##$WBSW= 4
##$XGAIN= (0..3)
0 0 0 0 
##$XL= 0
##$YL= 0
##$YMAX_a= 531010
##$YMIN_a= -489735
##$ZGOPTNS= <>
##$ZL1= 120
##$ZL2= 120
##$ZL3= 120
##$ZL4= 120
##$ABSF1= 16.522
##$ABSF2= -4.171173
##$ABSG= 5
##$ABSL= 3
##$ALPHA= 0
##$AQORDER= 0
##$ASSFAC= 0
##$ASSFACI= 0
##$ASSFACX= 0
##$ASSWID= 0
##$AUNMP= <proc_1d>
##$AZFE= 0.1
##$AZFW= 0.1
##$BCFW= 0
##$BC_mod= 0
##$BYTORDP= 0
##$COROFFS= 0
##$CY= 12.5
##$DATMOD= 1
##$DC= 0
##$DFILT= <>
##$DTYPP= 0
##$F1P= 14.0000005364418
##$F2P= -0.99999901652339
##$FCOR= 0.5
##$FTSIZE= 32768
##$FT_mod= 6
##$GAMMA= 0
##$GB= 0
##$INTBC= 1
##$INTSCL= 1
##$ISEN= 128
##$LB= 0.3
##$LEV0= 0
##$LPBIN= 0
##$MAXI= 10000
##$MC2= 0
##$MEAN= 0
##$ME_mod= 0
##$MI= 0
##$NCOEF= 0
##$NC_proc= -4
##$NLEV= 6
##$NOISF1= 0
##$NOISF2= 0
##$NSP= 0
##$NTH_PI= 0
##$NZP= 0
##$OFFSET= 16.522
##$PC= 1
##$PHC0= -71.10754
##$PHC1= -10.34001
##$PH_mod= 1
##$PKNL= yes
##$PPARMOD= 0
##$PSCAL= 4
##$PSIGN= 0
##$REVERSE= no
##$SF= 250.13
##$SI= 32768
##$SIGF1= 0
##$SIGF2= 0
##$SINO= 400
##$SIOLD= 32768
##$SREGLST= <1H.CDCl3>
##$SSB= 0
##$STSI= 32768
##$STSR= 0
##$SW_p= 5175.98343685301
##$SYMM= 0
##$S_DEV= 0
##$TDeff= 65536
##$TDoff= 0
##$TI= <Analysis number 999999
Compound Code 99
Book Reference 9
Project Code 9>
##$TILT= no
##$TM1= 0
##$TM2= 0
##$TOPLEV= 0
##$USERP1= <user>
##$USERP2= <user>
##$USERP3= <user>
##$USERP4= <user>
##$USERP5= <user>
##$WDW= 1
##$XDIM= 32768
##$YMAX_p= 506677143
##$YMIN_p= -189070
$$ End of Bruker specific parameters
$$ ---------------------------------
##NTUPLES= NMR SPECTRUM
##VAR_NAME=  FREQUENCY,     SPECTRUM/REAL,   SPECTRUM/IMAG
##SYMBOL=    X,             R,               I
##VAR_TYPE=  INDEPENDENT,   DEPENDENT,       DEPENDENT
##VAR_FORM=  AFFN,          ASDF,            ASDF
##VAR_DIM=   32768,         32768,           32768
##UNITS=     HZ,            ARBITRARY UNITS, ARBITRARY UNITS
##FACTOR=    0.157963299565203, 1,           1
##FIRST=     4132.6476996994, 0,             0
##LAST=      -1043.33573715361, 0,           0
##MIN=       -1043.33573715361, -189070,     0
##MAX=       4132.6476996994, 506677143,     0
$$ Real data points
##PAGE= N=1
##DATA TABLE= (X++(R..R)), XYDATA
$$ [...]
$$ plain form
24889 -776 -29798 22793 47844 15802 10898 6983 -12722 3509 -14734 -24441 -25346 -58213 -61813
24876 -61813 -41138 4198 -8946 -35181 -74168 -107861 -99805 -75417 -49094 -47047 -38709 -45735
24864 -45735 -69152 -42048 -27762 -38254 -65330 -64029 -82139 -86754 -57351 -25552 -30061 -26255
24852 -26255 -9579 -31150 -29656 -14407 -44157 -62391 -52987 -50078 -19636 -23418 -17619 -32342 -31545
24839 -31545 -19430 -32457 -32349 -37102 -58856 -26041 -19990 -39265 -59590 -67035 -42706 -10832 4004
24826 4004 30478 14919 5698 -15291 -49429 -10136 26908 59916 34570 11120 13323 2350
24814 2350 -22718 -36568 15729 77277 61051 60223 74493 54378 -6503 7954 -4876 -22857
24802 -22857 24550 64071 -280 -28937 -36473 -12859 36989 62332 86143 48159 8166 -28500
$$ packed form
24889g76k9022N2591K5051l2042m904l915j9705J6231j8243r707r05l2867l600
24876f1813K0675M5336j3144k6235l8987l3693Q056K4388K6323K047Q338p026
24864d5735k3417K7104J4286j0492k7076J301j8110m615K9403L1799m509L806
24852b6255J6676k1571J494J5249k9750j8234R404K909L0442l782N799j4723P97
24839c1545J2115j3027J08m753k1754L2815O051j9275k0325p445K4329L1874J4836
24826D004K6474j5559r221k0989l4138L9293L7044L3008k5346k3450K203j0973
24814B350k5068j3850N2297O1548j6226q28J4270k0115o0881J4457j2830j7981
24802b2857M7407L9521o4351k8657p536K3614M9848K5343K3811l7984l9993l6666
$$ plain form
24790 -28500 -48306 -56360 -75687 -56683 -10240 10094 30884 39569 4492 -42562 -1156 24634
24778 24634 -39323 -75304 -106309 -92379 -76823 -69669 -55899 -19625 16375 -27429 -53604 16471
24766 16471 20088 5603 26433 10697 -9203 4380 -32839 -45493 -13417 -39410 -42452 -52676
24754 -52676 -41502 15316 -5840 -36 -40745 -56390 -14446 -10668 -2309 -1159 16277 25195 13041
24741 13041 -3210 -5184 -18580 2151 239 -15913 -37124 -48695 -60674 -14130 46685 40431
24729 40431 65182 81006 52767 35857 -3705 -2626 2605 20319 1636 53672 91254 44741
24717 44741 -13192 -43951 -29724 -38314 -97533 -58462 3346 17148 21750 28660 16396 1308
24705 1308 -6580 -1476 54772 53313 25655 -2376 -25782 -48141 -34166 13751 -22545 -90781
$$ packed form
24790b8500j9806q054j9327J9004M6443K0334K0790Q685l5077m7054M1406K5790
24778B4634o3957l5981l1005J3930J5556P154J3770L6274L6000m3804k6175P0075
24766A6471L617j4485K0830j5736j9900J3583l7219j2654L2076k5993l042j0224
24754e2676J1174N6818k1156N804m0709j5645M1944L778Q359J150J7436Q918j2154
24741A3041j6251j974j3396K0731j912j6152k1211j1571j1979M6544O0815o254
24729D0431K4751J5824k8239j6910l9562J079N231J7714j8683N2036L7582m6513
24717D4741n7933l0759J4227q590n9219L9071O1808J3802M602O910j2264j5088
24705A308p888N104N6248j459k7658k8031k3406k2359J3975M7917l6296o8236
$$ plain form
24693 -90781 -57392 -35687 -28347 -1518 -18904 -38031 -57398 -32618 -3958 4711 -2890 -26126
24681 -26126 -38399 -47802 -18937 -42551 -50101 -59105 -36074 11936 22223 -3226 -600 -1336 -15234
24668 -15234 -48726 -16538 25846 12245 46029 41196 -1171 -37723 33021 8241 -35080 -21117
24656 -21117 29234 71702 93669 81625 59643 65938 59833 28333 3719 13983 2083 -22190
24644 -22190 -40365 -46723 -73194 -75377 -30603 -7942 -6005 18933 38904 34392 23413 -3575
24632 -3575 -36100 -78959 -72163 -38104 -23550 -5984 -34368 -63475 -66682 -77426 -76490 -60465 -58015
24619 -58015 -13249 28289 4300 43231 19079 -73646 -53661 -26733 -18706 -50898 -68901 -36386
24607 -36386 -22430 -24237 -25165 8882 4902 69646 43607 36724 53449 41481 -8041 -60007 -50346
$$ packed form
24693i0781L3389K1705P340K6829j7386j9127j9367K4780K8660Q669p601k3236
24681b6126j2273r403K8865k3614p550r004K3031M8010J0287k5449K626p36j3898
24668a5234l3492L2188M2384j3601L3784m833m2367l6552P0744k4780m3321J3963
24656b1117N0351M2468K1967j2044k1982O295o105l1500k4614J0264j1900k4273
24644b2190j8175o358k6471k183M4774K2661J937K4938J9971m512j0979k6988
24632c575l2525m2859O796L4059J4554J7566k8384k9107l207j0744R36J6025K450
24619e8015M4766M1538k3989L8931k4152r2725J9985K6928Q027l2192j8003L2515
24607c6386J3956j807r28L4047l980O4744k6039o883J6725j1968m9522n1966R661
$$ plain form
24594 -50346 -28472 -17117 -19316 -16149 -8518 -39501 -58826 -11452 18819 19432 63306 84382 36544
24581 36544 10043 -11159 -13001 -14115 13013 42102 4113 -55023 -58594 -30944 -43182 -57402
24569 -57402 -23054 24763 67678 40822 -993 38947 58324 79741 68010 22018 11821 10505
24557 10505 -3536 -24389 -24528 -6424 -33314 -37379 -59699 -40800 -4308 25570 27043 31696 61598
24544 61598 94264 49961 -6225 -6615 -19671 -21830 17554 53186 33695 54386 11615 -7760
24532 -7760 -25514 -27143 -39019 -40775 -50603 -40383 -13246 -44755 -45917 -4320 -30634 -17001 -9693
24519 -9693 6486 21884 53440 66639 17472 -2690 16521 44075 67123 59892 74713 67031
24507 67031 44795 -29493 -27170 -32180 -44367 -17476 -26152 -29285 -35699 -44445 -47912 -32853 -25479
$$ packed form
24594e0346K1874J1355k199L167P631l0983j9325M7374L0271O13M3874K1076m7838
24581C6544k6501k1202j842j114K7128K9089l7989n9136l571K7650j2238j4220
24569e7402L4348M7817M2915k6856m1815L9940J9377K1417j1731m5992j0197j316
24557A0505j4041k0853j39J8104k6890m065k2320J8899L6492K9878J473M653K9902
24544F1598L2666m4303n6186l90j3056k159L9384L5632j9491K0691m2771j9375
24532g760j7754j629j1876j756r828J0220K7137l1509j162M1597k6314J3633P308
24519i693J6179J5398L1556J3199m9167k0162J9211K7554K3048p231J4821p682
24507F7031k2236p4288K323n010j2187K6891q676l133o414q746l467J5059P374
$$ plain form
24494 -25479 -45243 -55929 -20711 -25252 -30609 -46914 -39042 -25450 -35497 -28146 -16652 -35544
24482 -35544 -76274 -75569 -16699 26993 12703 -18308 -20751 7086 19555 -2174 -34330 -26319
24470 -26319 202 14856 -13312 -28174 13820 50373 67280 17283 -66802 -107825 -112351 -84262
24458 -84262 -54590 -24526 -46593 -95956 -38083 -23432 -47623 -60292 -21398 -18226 -22225 -29839
24446 -29839 9580 21133 11222 -15931 -57022 -84656 -114055 -133877 -133292 -119148 -132005 -81018
24434 -81018 -58198 -20391 -634 -20168 -29286 -4004 -24865 -58984 -62022 -46643 -73074 -7875
24422 -7875 9042 -33340 -27103 -8211 29092 -4775 -14653 8845 30693 39937 27667 6626
24410 6626 -49508 -78845 -73687 -44193 7965 -6821 9160 14409 -26173 -46226 -61375 -76206
$$ packed form
24494b5479j9764j0686L5218m541n357j6305P872J3592j0047P351J1494j8892
24482c5544m0730P05N8870M3692j4290l1011k443K7837J2469k1729l2156Q011
24470b6319K6521J4654k8168j4862M1994L6553J6907m9997q4085m1023m526K8089
24458h4262K9672L0064k2067m9363N7873J4651k4191j2669L8894L172l999p614
24446b9839L9419J1553r911k7153m1091k7634k9399j9822N85J4144j2857N0987
24434h1018K2820L7807J9757j9534r118K5282k0861l4119l038J5379k6431O5199
24422g875J6917m2382O237J8892L7303l3867r878K3498K1848R244j2270k1041
24410F626n6134k9337N158K9494N2158j4786J5981N249m0582k0053j5149j4831
$$ plain form
24398 -76206 -52351 -35186 -34210 279 5216 -31559 -29785 -15787 31586 37765 31519 -440 -15969
24385 -15969 -18643 -28933 -4520 29968 11678 25980 43318 42692 32037 46323 39482 10847
24373 10847 -18830 -26345 -43428 -52729 5794 44935 6882 -41676 -33633 -38526 -17485 -50656
24361 -50656 -48981 4929 36436 42661 64101 29852 13730 17929 33466 1607 -70240 -36814
24349 -36814 25543 13381 17148 32458 22349 -24191 -42499 40411 85273 55506 28094 -5814
24337 -5814 -73201 -100601 -80500 -22793 25246 59475 45147 1458 -60824 -87739 -75601 -12228
24325 -12228 62483 44241 50939 42232 14332 -38552 -60254 -44498 -24526 -8023 -13073 5012
24313 5012 -13449 -56316 -44526 -16195 -33452 -72238 -37078 -28689 -61457 -14935 -69999 -86166
$$ packed form
24398g6206K3855J7165R76L4489M937l6775J774J3998M7373O179o246l1959j5529
24385a5969k674j0290K4413L4488j8290J4302J7338o26j0655J4286o841k8635
24373A0847k9677p515j7083r301N8523L9141l8053m8558Q043m893K1041l3171
24361e0656J675N3910L1507O225K1440l4249j6122M199J5537l1859p1847L3426
24349c6814O2357j2162L767J5310j0109m6540j8308Q2910M4862k9767k7412l3908
24337e814o7387k7400K0101N7707M8039L4229j4328m3689o2282k6915J2138O3373
24325a2228P4711j8242O698q707k7900n2884k1702J5756J9972J6503n050J8085
24313E012j8461m2867J1790K8331j7257l8786L5160Q389l2768M6522n5064j6167
$$ plain form
24301 -86166 -45933 -44705 -79583 -89839 -90378 -36708 -33538 -22287 4930 19893 19481 -13234 -55202
24288 -55202 -27758 6804 27889 41426 78620 76745 37248 -8243 -47126 -68558 -52044 -26034
24276 -26034 -45924 -75452 -244 7694 -19044 -21647 -23898 -59325 -60048 -20102 77766 121886 137888
24263 137888 123028 107544 113827 86552 27170 -245 6164 7494 3646 18266 227 -46420
24251 -46420 -3417 19139 -23342 -32002 -9713 -30689 -54353 -53766 -37011 -27473 -21227 -21041 -34334
24238 -34334 -37514 -50672 -43574 -25141 -53225 -25076 -3108 26210 5231 -4295 -1562 -2705 -2370
24225 -2370 16856 68915 10573 -50383 -86615 -70231 -61975 -40642 -43463 -35581 -15381 -22835 -53148
24212 -53148 -53471 -38478 -48274 -30249 -6106 42849 72161 48020 2551 -751 19431 19331 -6779
$$ packed form
24301h6166M0233J228l4878j0256n39N3670L170J1251K7217J4963m12l2715m1968
24288e5202K7444L4562K1085J3537L7194j875l9497m5491l8883k1432J6514K6010
24276b6034j9890k9528P5208P938k6738k603k251l5427p23L9946R7868M4120J6002
24263A37888j4860j5484O283k7275n9382k7415O409J330l848J4620j8039m6647
24251d6420M3003K2556m2481q660K2289k0976k3664N87J6755R538O246J86j3293
24238c4334l180j3158P098J8433k8084K8149K1968K9318k0979r526K733j143L35
24225b370J9226N2059n8342o0956l6232J6384Q256K1333k821P882K0200p454l0313
24212e3148l23J4993r796J8025K4143M8955K9312k4141m5469l302K0182j00k6110
$$ plain form
24199 -6779 -2168 62697 72356 93609 72839 36395 29495 37200 42151 22846 -8548 -30717 -83388
24186 -83388 -60201 -50112 -62180 -47221 -15105 31339 19747 -2652 3742 -2717 -19828 -35019
24174 -35019 -22465 -10656 -38192 -34072 -54209 -59857 -61287 -41122 -3299 11540 -12649 -21559
24162 -21559 -48420 -44220 -56548 -47973 -49589 -35269 -11616 -13250 -44816 -46797 -48995 -68487 -38480
24149 -38480 -29191 -34262 28820 -10979 -27327 -18514 -40791 -6067 -12108 -18660 3633 -49709 -65518
24136 -65518 -37267 -26131 13853 -2129 -60308 -43366 6153 9474 16761 9823 -9150 -28350
24124 -28350 -40668 -18586 -11671 -48955 -31807 18771 66210 76119 53539 17732 55653 90000
24112 90000 72735 51709 18443 -8205 -7977 14031 40589 15316 12793 3963 -10443 20959
$$ packed form
24199f779M611O4865R659K1253k0770l6444o900P705M951j9305l1394k2169n2671
24186h3388K3187J0089j2068J4959L2116M6444j1592k2399O394o459j7111j5191
24174c5019J2554J1809k7536M120k0137n648j430K0165L7823J4839k4189q910
24162b1559k6861M200j2328Q575j616J4320K3653j634l1566j981k198j9492L0007
24149c8480R289n071O3082l9799j6348Q813k2277L4724o041o552K2293n3342j5809
24136f5518K8251J1136L9984j5982n8179J6942M9519L321P287o938j8973j9200
24124b8350j2318K2082O915l7284J7148N0578M7439R909k2580l5807L7921L4347
24112I0000j7265k1026l3266k6648K28K2008K6558k5273k523q830j4406L1402
$$ plain form
24100 20959 30325 27579 -6492 -24014 18571 26463 -2772 -19072 -40706 -24162 -26902 -23839 -27064
24087 -27064 -58740 -53800 -23430 31128 24340 481 2758 -152 -29133 -39422 -5928 8456
24075 8456 -21631 -4709 17237 64807 60924 58115 13449 18620 20543 8363 -7506 -20928 -39408
24062 -39408 -66256 -91548 -100788 -74275 -44005 -15467 -28475 -45129 -117607 -112961 -73627 -37368
24050 -37368 -22085 -13282 -18260 -31846 -40065 23925 51549 9929 -19868 4455 -4281 -27892
24038 -27892 -54769 -69135 -48395 -50730 -56700 -53211 -60895 -40786 -10351 44965 -5194 -18841
24026 -18841 32766 31753 -21159 -21967 24228 41730 46948 59989 74369 62420 66952 60755 16235
24013 16235 -19688 -44745 -42354 -28614 -7816 28410 14315 43467 50321 54853 23475 -17182
$$ packed form
24100B0959R366k746l4071j7522M2585P892k9235j6300k1634J6544k740L063l225
24087b7064l1676M940L0370N4558o788k3859K277k910k8981j0289L3494J4384
24075H456l0087J6922K1946M7570l883k809m4666N171J923j2180j5869j3422j8480
24062c9408k6848k5292r240K6513L0270K8538j3008j6654p2478M646L9334L6259
24050c7368J5283Q803m978j3586q219O3990K7624m1620k9797K4323q736k3611
24038b7892k6877j4366K0740k335n970L489p684K0109L0435N5316n0159j3647
24026a8841N1607j013n2912q08M6195J7502N218J3041J4380j1949M532o197m4520
24013A6235l5923k5057K391J3740K0798L6226j4095K9152O854M532l1378m0657
$$ plain form
24001 -17182 -47781 -4779 41324 40769 -5272 -49946 -49962 23951 40522 -4436 -3426 10364 -2551
23988 -2551 35910 51242 43672 12875 -15188 -18901 -56006 -79818 -82769 -85424 -41066 -21544 -17725
23975 -17725 12889 45266 60326 68814 3088 -37574 -20769 -25461 -60210 -67895 -76761 -85926 -54118
23962 -54118 -5657 1314 -11587 -38050 -61407 -42193 -717 -52657 -65647 -39558 -49432 -58633
23950 -58633 -58721 -18036 9699 -10156 7427 7254 -3313 -36858 -1916 42057 72974 31868 3788
23937 3788 -7403 -212 8014 2718 -54871 -108632 -89556 -22051 -21931 -71995 -92711 -52623 -62747
23924 -62747 -33580 -54998 -60855 -52842 -59633 -106129 -44194 -20293 20193 92741 28844 -62874
23912 -62874 -56075 -55695 -9510 44153 64137 28029 11766 30946 57968 29680 1523 -1441
$$ packed form
24001a7182l0599M3002M6103n55m6041m4674j6P3913J6571m4958J010J3790j2915
23988b551L8461J5332p570l0797k8063l713l7105k3812k951k655M4358J9522L819
23975a7725L0614L2377J5060Q488o5726m0662J6805m692l4749p685q866r165L1808
23962e4118M8461O971j2901k6463k3357J9214M1476n1940j2990K6089r874r201
23950e8633q8M0685K7735j9855J7583j73j0567l3545L4942M3973L0917m1106k8080
23937C788j1191P191Q226n296n7589n3761J9076O7505J20n0064k0716M0088j0124
23924f2747K9167k1418n857Q013o791m6496O1935K3901M0486P2548o3897r1718
23912f2874O799L80M6185N3663J9984l6108j6263J9180K7022k8288k8157k964
$$ plain form
23900 -1441 -53346 -52110 -71004 -90875 -111395 -137936 -149711 -143588 -146228 -108757 -63956 -15279
23888 -15279 -12952 -24974 15409 62057 66381 -18459 -40700 31075 1394 -30128 -35294 -45438
23876 -45438 -50206 -49737 -89381 -70478 -18479 -17324 -29906 -17791 -13715 -10434 609 -3691 -27857
23863 -27857 -53265 -20535 -16380 -27313 51609 70872 34790 7880 35978 56058 40549 -8326
23851 -8326 -9067 14817 25678 93716 140506 122433 46075 11830 4994 14625 -16433 -12782 15336
23838 15336 4139 -29684 -30063 -26795 -64190 -62720 -34152 22791 63762 23694 -26996 -22987 -13107
23825 -13107 16432 18523 1297 -29979 -42695 8110 12863 -24810 4632 25506 3354 -12764
23813 -12764 11596 2348 -44734 -16872 9167 -221 27510 -19213 -64970 -31248 -51166 -71955
$$ packed form
23900a441n1905J236j8894j9871k0520k6541j1775O123k640L7471M4801M8677
23888a5279K327j2022M0383M6648M324q4840k2241P1775k9681l1522n166j0144
23876d5438m768M69l9644J8903N1999J155j2582J2115M076L281J1043m300k4166
23863b7857k5408L2730M155j0933P8922J9263l6082k6910K8098K0080j5509m8875
23851h326p41K3884J0861O8038M6790j8073p6358l4245o836R631l1058L651K8118
23838A5336j1197l3823l79L268l7395J470K8568N6943M0971m0068n0690M009R880
23825a3107K9539K091j7226l1276j2716N0805M753l7673K9442K0874k2152j6118
23813a2764K4360r248m7082K7862K6039r388K7731m6723m5757L3722j9918k0789
$$ plain form
23801 -71955 -86456 -35852 -41626 -75788 -37750 -42455 -49063 -47287 -39720 -63384 -47263 -4473 15262
23788 15262 -30380 -32320 2015 5564 -3188 -27911 -15739 -13005 -32632 -16148 1147 -5797 18381
23775 18381 50355 39096 4413 -23085 -17376 22195 40744 51893 90871 54687 28861 15796
23763 15796 9393 18284 7203 -21829 -4006 17236 50714 58691 33287 5088 -29352 -17555
23751 -17555 -25608 -17719 -48709 -60165 -59593 -63351 -52344 -73660 -76289 -32271 -38797 -31044 -72926
23738 -72926 -48316 -8491 3165 14020 6468 -19288 -72898 -77146 -27895 4739 -28081 -79634
23726 -79634 -39703 -16468 -7275 34461 24390 -37288 -62457 -3031 6165 22407 38496 20177
23714 20177 -19938 -100681 -109742 -105825 -85832 -20256 925 -11869 12284 -17760 -66773 -44885
$$ packed form
23801g1955j4501N0604n774l4162L8038m705o608J776P567k3664J6121M2790J9735
23788A5262m5642j940L4335L549q752k4723J2172K734j9627J6484J7295o944K4178
23775A8381L1974j1259l4683k7498N709L9571J8549J1149L8978l6184k5826j3065
23763A5796o403Q891j1081k9032J7823K1242L3478P977k5404k8199l4440J1797
23751a7555q053P889l0990j1456N72l758J1007k1316k629M4018o526P753m1882
23738g2926K4610L9825J1656J0855p552k5756n3610m248M9251L2634l2820n1553
23726g9634L9931K3235R193M1736j0071o1678k5169N9426R196J6242J6089j8319
23714B0177m0115q0743r061L917J9993O5576K1181j2794K4153l0044m9013K1888
$$ plain form
23702 -44885 -3642 -68095 -79680 -62821 -65141 -50483 -80104 -29358 40875 33924 2325 -5539
23690 -5539 -22700 -6824 4456 -4757 5063 -5122 -16509 -40792 -40635 -55026 -39811 -30809 -11426
23677 -11426 30582 36670 -16833 -57738 -19650 -18760 -25773 -31353 -33150 -13644 18102 10788 -33392
23664 -33392 7695 2404 -9397 4174 3877 -8066 -5997 8601 2048 -3871 -1450 -56049 -24461
23651 -24461 25567 76253 73223 36219 -8333 -48888 -20610 -441 -26542 17882 83714 42560
23639 42560 31733 67806 28504 -4346 6065 679 3396 1921 16379 36447 23682 19043
23627 19043 14111 -2890 28673 42480 8774 -24129 -50033 -73139 -109771 -126948 -65266 -29685
23615 -29685 -32080 -20298 -2913 22697 3861 -25342 -38180 872 9294 -17175 29058 54650
$$ packed form
23702d4885M1243o4453j1585J6859k320J4658k9621N0746P0233o951l1599p864
23690e539j7161J5876J1280r213R820j0185j1387k4283J57j4391J5215R002J9383
23677a1426M2008O088n3503m0905L8088Q90p013n580j797J9506L1746p314m4180
23664c3392M1087n291j1801J3571k97j1943K069J4598o553n919K421n4599L1588
23651b4461N0028N0686l030l7004m4552m0555K8278K0169k6101M4424O5832m1154
23639D2560j0827L6073l9302l2850J0411n386K717j475J4458K0068j2765m639
23627A9043m932j7001L1563J3807l3706l2903k5904k3106l6632j7177O1682L5581
23615b9685k395J1782J7385K5610j8836k9203j2838L9052Q422k6469M6233K5592
$$ plain form
23603 54650 74077 87603 61152 18958 -10302 -32109 -12185 -22810 -8077 13117 21290 26017
23591 26017 2348 18709 63225 77768 87343 61288 30956 -20894 -13792 33129 53642 47673
23579 47673 54570 53386 41468 39223 -2191 -17270 24011 67318 55528 57808 47817 21307 31093
23566 31093 75901 71467 25807 -11742 -11942 -1743 38281 48199 -2743 7462 4522 25849 12044
23553 12044 12742 55930 48406 40877 56711 64537 37762 -3861 -9367 30765 62750 41966 20900
23540 20900 -4915 -15446 3713 50890 87480 99612 107084 100494 32928 25615 15798 -27705
23528 -27705 -54308 -34255 27466 -38114 -57541 -4784 -17484 -26331 -5946 -14901 -11708 1231
23516 1231 23009 28641 7022 3128 -192 -19145 3584 11286 9841 25091 26866 17238 11027
$$ packed form
23603E4650J9427J3526k6451m2194k9260k1807J9924j0625J4733K1194Q173M727
23591B6017k3669J6361M4516J4543R575k6055l0332n1850P102M6921K0513n969
23579D7673O897j184j1918k245m1414j5079M1281M3307j1790K280r991k6510R786
23566C1093M4808m434m5660l7549k00J0199M0024R918n0942J0205k940K1327j3805
23553A2044O98M3188p524p529J5834P826k6775m1623n506M0132L1985k0784k1066
23540B0900k5815j0531J9159M7177L6590J2132P472o590o7566p313r817m3503
23528b7705k6603K0053O1721o5580j9427N2757j2700q847K0385q955L193J2939
23516A231K1778N632k1619l894l320j8953K2729P702j445J5250J775r628o211
$$ plain form
23503 11027 18262 -10453 255 -16522 -12705 19129 12014 18216 18922 9015 8366 -2936 -25149
23490 -25149 -28791 19449 31448 62409 41887 -7439 -3976 -6746 19570 26824 63204 30064
23478 30064 6671 40741 39797 39067 29774 -10593 -1748 9434 -28744 -82231 -92329 -71241 -39837
23465 -39837 -91634 -107974 -81102 -15700 30592 31567 -7658 18181 42516 87831 89657 81496
23453 81496 71662 80041 49137 32538 -11619 -19450 4179 9566 -25111 -22388 1944 -471 9073
23440 9073 8931 35837 41901 50749 -1823 -26898 -12559 -40501 -16303 -16455 -63166 -88888 -68181
23427 -68181 -62916 -12349 -39705 -43674 -44612 -30571 -23815 -14056 -13922 35679 53288 25030 10072
23414 10072 -4593 -26102 -32846 -42476 -22171 -2453 10775 -649 -73953 -80969 -44759 -60643
$$ packed form
23503A1027P235k8715J0708j6777L817L1834p115O202P06r907o49j1302k2213
23490b5149l642M8240J1999L0961k0522m9326L463k770K6316P254L6380l3140
23478C0064k3393L4070r44p30r293m0367Q845J1182l8178n3487j0098K1088L1404
23465c9837n1797j6340K6872O5402M6292R75l9225K5839K4335M5315J826q161
23453H1496r834Q379l0904j6599m4157p831K3629N387l4677K723K4332k415R544
23440I073j42K6906O064Q848n2572k5075J4339k7942K4198j52m6711k5722K0707
23427f8181N265N0567k7356l969r38J4041O756R759J34M9601J7609k8258j4958
23414A0072j4665k1509o744r630K0305J9718J3228j1424p3304p016L6210j5884
$$ plain form
23402 -60643 -26864 -46412 -105678 -103629 -83615 -37127 10720 49153 27419 7331 27758 43069
23390 43069 79992 78228 53914 1114 -53647 -33232 8410 57224 127821 132333 72410 35494
23378 35494 44319 22032 12521 28489 54838 20055 -303 2264 -2536 -22223 -42724 -49427 -57340
23365 -57340 -34788 -20853 -38008 -58700 -51392 -30759 -45684 -36691 -58260 -79967 -87616 -50666
23353 -50666 -8477 -34682 -15907 -15149 -42227 -50338 -52774 -19086 -8600 9265 -12427 7279
23341 7279 20361 -12484 -10247 60689 48344 35486 51100 32846 -4037 43751 62981 -24019
23329 -24019 -37746 -15317 -64851 -24310 1211 -2515 401 -7093 16311 -3417 7657 29680
23317 29680 -27262 -17356 -32650 -29660 -17632 -11904 -49313 -69066 -34364 30908 40416 4857
$$ packed form
23402f0643L3779j9548n9266K049K0014M6488M7847L8433k1734k0088K0427J5311
23390D3069L6923j764k4314n2800n4761K0415M1642M8814P0597M512n9923l6916
23378C5494Q825k2287r511J5968K6349l4783k0358K567m800j9687k0501o703p913
23365e7340K2552J3935j7155k0692P308K0633j4925Q993k1569k1707p649L6950
23353e0666M2189k6205J8775P58k7078q111k436L3688J0486J7865k1692J9706
23341G279J3082l2845K237P0936j2345j2858J5614j8254l6883M7788J9230q7000
23329b4019j3727K2429m9534M0541K5521l726K916p494K3404j9728J1074K2023
23317B9680n6942R906j5294K990J2028N728l7409j9753L4702O5272R508l5559
$$ plain form
23305 4857 15972 8194 -14630 -47779 -62216 -45966 825 -18095 -2327 14482 13231 32240
23293 32240 15385 49204 75009 73375 70417 62962 34334 -33327 -35910 18977 43750 41717 28665
23280 28665 51045 51490 5533 -61029 -66672 -59170 -44077 -748 406 -28713 18532 51305 39417
23267 39417 25379 41956 19468 -33408 -30285 13914 -10629 -43648 -48165 -11105 21961 46911
23255 46911 73705 74538 59963 20560 -8797 -14755 -27426 -70389 -53207 -53241 -41691 -32959 -21548
23242 -21548 -5983 1405 6812 51936 12844 -14315 -5073 36957 73981 57783 -547 10372
23230 10372 71725 58312 30130 29173 22048 57309 19064 -33018 -53172 -58804 -77379 -52596
23218 -52596 -16600 -24311 -62476 -118628 -52788 -20797 -1155 -61461 -65112 -40606 -46234 -68668
$$ packed form
23305D857J1115p778k2824l3149j4437J6250M6791j8920J5768J6809j251J9009
23293C2240j6855L3819K5805j634k958p455k8628o7661k583N4887K4773k033j3052
23280B8665K2380M45m5957o6562n643P502J5093M3329J154k9119M7245L2773j1888
23267C9417j4038J6577k2488n2876L123M4199k4543l3019m517L7060L3066K4950
23255D6911K6794Q33j4575l9403k9357n958j2671m2963J7182l4J1550Q732J1411
23242b1548J5565P388N407M5124l9092k7159R242M2030L7024j6198n8330J0919
23230A0372O1353j3413k8182r57p125L5261l8245n2082k0154n632j8575K4783
23218e2596L5996p711l8165n6152O5840L1991J9642o0306l651K4506n628k2434
$$ plain form
23206 -68668 -65363 -41978 -41874 -33236 9470 32358 27377 56123 32351 -14115 -62056 -46115 -42139
23193 -42139 -9144 -11509 7524 49619 72503 69381 80874 74196 76160 6864 26864 28512 12244
23180 12244 15689 33639 11965 3880 42936 72008 37867 31527 9020 -17219 -22070 -7436
23168 -7436 -3782 61871 84273 26156 -1932 22012 22108 10703 -16997 -17432 -35421 -41123 -19856
23155 -19856 8183 49737 35251 43646 41560 34356 55103 64434 48974 33828 5753 1780 49967
23142 49967 15139 19075 -11405 -36352 -63896 -34653 -30905 -24390 -23345 -41255 -66989 -49237
23130 -49237 -37897 -22872 -2965 -18767 -44277 -39079 -21250 1390 5608 -7500 -20642 1685
23118 1685 48737 36805 -3298 -26940 -72264 -123286 -145531 -95646 -53444 -61816 -71896 -69509
$$ packed form
23206f8668L305K3385J04Q638M2706K2888m981K8746k3772m6466m7941J5941L976
23193d2139L2995k365J9033M2095K2884l122J1493o678J964o9296K0000J648j6268
23180A2244L445J7950k1674q085L9056K9072l4141o340k2507k6239m851J4634
23168g436L654O5653K2402n8117k8088K3944R6j1405k7700m35j7989n702K1267
23155a9856K8039M1554j4486Q395k086p204K0747R331j5460j5146k8075l973M8187
23142D9967l4828L936l0480k4947k7544K9243L748O515J045j7910k5734J7752
23130d9237J1340J5025J9907j5802k5510N198J7829K2640M218j3108j3142K2327
23118A685M7052j1932m0103k3642m5324n1022k2245M9885M2202q372j0080K387
$$ plain form
23106 -69509 -80800 -77488 -31303 33088 67196 62225 50330 38630 -7541 -37816 -28423 -41853
23094 -41853 -46297 -15514 -11 19742 -6159 -32238 -50267 -93494 -110074 -55887 -64148 -87347
23082 -87347 -62635 -45321 -25711 -57297 -39079 -25950 17950 80658 82777 24725 -12465 -27599
23070 -27599 6825 34132 52418 77494 47078 36227 57226 29496 -7713 7179 17970 -10733
23058 -10733 -75574 -63706 -16915 -5123 1883 -14803 -32041 -18839 22813 -12437 -11775 25350
23046 25350 65010 76115 58676 53222 -6842 -21868 -43534 -13463 79527 81521 79425 65258
23034 65258 90665 98313 34023 33253 24307 23615 36752 -30606 -80134 -55290 -77418 -65441 -11363
23021 -11363 8482 -5864 -10876 -44521 -64722 -34875 -40046 -71405 -36168 17652 3281 2726
$$ packed form
23106f9509j1291L312M6185O4391L4108m971j1895j1700m6171l0275R393j3430
23094d1853m444L0783J5503J9753k5901k6079j8029m3227j6580N4187q261k3199
23082h7347K4712J7314J9610l1586J8218J3129M3900O2708K119n8052l7190j5134
23070b7599L4424K7307J8286K5076l0416j0851K0999k7730l7209J4892J0791k8703
23058a0733o4841J1868M6791J1792P006j6686j7238J3202M1652l5250O62L7125
23046B5350L9660J1105j7439n454o0064j5026k1666L0071R2990J994k096j4167
23034F5258K5407P648o4290p70q946o92J3137o7358m9528K4844k2128J1977N4078
23021a1363J9845j4346n012l3645k0201K9847n171l1359L5237N3820j4371n55
$$ plain form
23009 2726 19685 19863 9121 -25793 -49157 -32990 -40783 -64362 -40573 -19691 5615 -2275 -22703
22996 -22703 -32946 -1166 23779 -8920 -27101 -29496 -38356 -36400 -23747 -11864 -10780 -22834
22984 -22834 -32690 18669 16036 13158 19827 4905 -34874 -43633 2944 -12246 -71450 -114090 -95482
22971 -95482 -36162 13734 58374 43341 -26999 -55589 -1892 4646 -1287 -13731 -11515 -20279
22959 -20279 -4765 -21729 3799 24998 57407 62848 33283 48232 80920 59390 11916 -14083
22947 -14083 -11636 -12060 30789 41870 81153 72107 68736 21895 -10647 4837 4500 -45799 -28731
22934 -28731 6704 -23763 -26203 -56047 -32142 -13056 34163 40835 2343 -11154 79 52608
22922 52608 84644 106618 85087 69626 20381 20868 -9652 1849 20326 50886 47271 4875
$$ packed form
23009B726J6959J78j0742l4914k3364J6167p793k3579K3789K0882K5306p890k0428
22996b2703j0243L1780K4945l2699j8181k395q860J956J2653J1883J084j2054
22984b2834r856N1359k633k878O669j4922l9779q759M6577j5190n9204m2640J8608
22971i5482N9320M9896M4640j5033p0340k8590N3697O538n933j2444K216q764
22959b0279J5514j6964K5528K1199L2409N441k9565J4949L2688k1530m7474k5999
22947a4083K447m24M2849J1081L9283r046l371m6841l2542J5484l37n0299J7068
22934b8731L5435l0467k440k9844K3905J9086M7219O672l8492j3497J1233N2529
22922E2608L2036K1974k1531j5461m9245M87l0520J1501J8477L0560l615m2396
$$ plain form
22910 4875 -6718 -32636 -6915 26168 19379 38673 2571 1754 29730 25647 19854 -18693 -13089
22897 -13089 -31782 13593 13709 3146 -12194 -14201 7494 -8095 -38409 -748 25488 57628
22885 57628 37741 22575 37954 5933 -45825 -41085 -22904 -13841 -731 28581 70996 93957
22873 93957 70573 9623 -56274 -63142 -45586 -39742 -53059 -51610 -13933 35797 57668 30015
22861 30015 16088 49680 60218 54325 27634 -11160 -13972 -24297 11174 53222 51208 -34980
22849 -34980 -51528 -62606 -81799 -73214 -14445 -3761 -13735 -38610 -11394 -511 45574 59813
22837 59813 23750 -13900 -29609 -35622 -51459 -45458 -3265 -9519 -30570 -34444 -24147 -17282 -26993
22824 -26993 -28603 -4226 7941 18142 29939 34999 32923 -11611 -43977 -17259 2259 -9168
$$ packed form
22910D875j1593k5918K5721L3083o789J9294l6102q17K7976m083n793l8547N604
22897a3089j8693M5375J16j0563j5340k007K1695j5589l0314L7661K6236L2140
22885E7628j9887j5166J5379l2021n1758M740J8181R063J3110K9312M2415K2961
22873I3957k3384o0950o5897o868J7556N844j3317J449L7677M9730K1871k7653
22861C0015j3927L3592J0538n893k6691l8794k812j0325L5471M2048k014q6188
22849c4980j6548j1078j9193Q585N8769J0684r974k4875K7216J0883M6085J4239
22837E9813l6063l7650j5709o013j5837O001M2193o254k1051l874J0297O865r711
22824b6993j610K4377J2167J0201J1797N060k076m4534l2366K6718J9518j1427
$$ plain form
22812 -9168 -42380 -18765 -3409 -48456 -55019 6815 38151 38519 26377 23476 -18078 -60883 -82298
22799 -82298 -86390 -57210 -70175 -50488 -29639 -1802 17129 -10815 21153 44131 45677 39705
22787 39705 59688 57325 70625 97290 159603 129422 39791 -17356 -74162 -33325 13436 14457
22775 14457 -76508 -116682 -128746 -143907 -135419 -100952 -58905 -44351 -69337 -53178 -64011 -84010
22763 -84010 -78753 -54515 -23657 -15171 -18150 -8634 -41694 -61701 -41239 -11560 34195 61371
22751 61371 52218 49867 -6489 -13339 11983 9570 5765 4227 3256 -13672 -34092 -21322 -18883
22738 -18883 36918 41895 51848 54931 49072 -6322 17007 53186 55760 32771 -6148 -36308 -18936
22725 -18936 -31858 -25452 -8543 -21226 -41094 -20090 -16368 26915 -6128 2481 40672 19839
$$ packed form
22812i168l3212K3615J5356m5047o563O1834L1336L68j2142k901m1554m2805k1415
22799h2298m092K9180j2965J9687K0849K7837J8931k7944L1968K2978J546n972
22787C9705J9983k363J3300K6665O2313l0181q9631n7147n6806M0837M6761J021
22775A4457r0965m0174j2064j5161Q488L4467M2047J4554k4986J6159j0833j9999
22763h4010N257K4238L0858Q486k979R516l3060k0007K0462K9679M5755K7176
22751F1371r153k351n6356o850K5322k413l805j538r71j6928k0420J2770K439
22738a8883N5801M977R953L083n859n5394K3329L6179K574k2989l8919l0160J7372
22725a8936j2922O406J6909j2683j9868K1004L722M3283l3043Q609L8191k0833
$$ plain form
22713 19839 -13117 -24930 10842 51194 19531 -1993 -5449 3519 -31154 2984 -4560 -35102
22701 -35102 -25813 -26701 -22929 -17102 -1484 31972 16719 26106 26326 3696 -27410 -12965 34096
22688 34096 55013 51009 51242 42746 22735 -19029 19919 7358 -19441 -31081 -23575 -8175 -7401
22675 -7401 -20691 -43845 -31909 -23597 -6274 -19806 -20032 -27395 437 12269 -17122 7559 14241
22662 14241 57739 41959 11518 20523 24813 -18317 -38240 -20865 -11792 24471 77525 63923
22650 63923 19261 -18604 -21631 -18680 19974 3264 -29951 -38081 -68993 -22303 16436 14194
22638 14194 5451 1522 -29907 -70018 -21162 -2517 42054 9034 -33114 962 -1760 -65917
22626 -65917 -73836 -34871 -27639 -57064 -70564 -31272 -56599 -79649 -9188 21326 -12148 -254
$$ packed form
22713A9839l2956j1813L5772M0352l1663k1524l456Q968l4673L4138p544l0542
22701c5102R289q88L772N827J5618L3456j5253R387K20k2630l1106J4445M7061
22688C4096K0917m004K33q496k0011m1764L8948j2561k6799j1640P506J5400P74
22675g401j3290k3154J1936Q312J7323j3532k26p363K7832J1832k9391K4681O682
22662A4241M3498j5780l0441R005M290m3130j9923J7375R073L6263N3054j3602
22650F3923m4662l7865l027K951L8654j6710l3215q130l0912M6690L8739k242
22638A4194q743l929l1429m0111M8856J8645M4571l3020m2148L4076k722o4157
22626f5917p919L8965P232k9425j3500L9292k5327k3050P0461L0514l3474J1894
$$ plain form
22614 -254 -18075 -54473 -54008 -16545 339 33959 43375 3841 -49224 -42098 -37992 -61920 -9884
22601 -9884 34722 79893 32624 8335 38425 33156 15607 28553 33779 10654 -18637 -35953
22589 -35953 -33771 -943 -9055 16446 20481 -33623 8191 22265 19632 7877 3767 -487 3752
22576 3752 46907 60656 110021 128882 101798 102182 60558 31701 20616 33142 16946 24783
22564 24783 10918 17281 13690 -33056 -35649 -4721 29284 21342 28783 -9060 -4566 -13717 -7716
22551 -7716 -43679 -48085 23985 49446 31769 -15591 -44026 -32765 -26690 -56599 25387 33470
22539 33470 21969 59790 78302 56972 46589 52851 21381 20558 7463 99 21468 49768
22527 49768 47160 25300 -5047 14843 44832 53148 4100 35572 114318 112305 75828 56351
$$ packed form
22614b54j7821l6398M65L7463J6884L3620R416l9534n3065P126M106k3928N2036
22601i884M4606M5171m7269k4289L0090n269j7549J2946N226k3125k9291j7316
22589c5953K182L2828q112K5501M035n4104M1814J4074k633j1755m110m254M239
22576C752M3155J3749M9365J8861k7084L84m1624k8857j1085J2526j6196P837
22564B4783j3865O363l591m6746k593L0928L4005p942P441l7843M494r151O001
22551g716l5963m406P2070K5461j7677m7360k8435J1261O075k9909Q1986Q083
22539C3470j1501L7821J8512k1330j0383O262l1470q23j3095p364K1369K8300
22527D9768k608k1860l0347J9890K9989Q316m9048L1472P8746k013l6477j9477
$$ plain form
22515 56351 73475 86617 80645 88897 114432 122005 102128 55595 20939 15514 29169 38282 -3642
22502 -3642 28326 78541 53814 55549 32975 15199 -431 -7823 -41156 -53501 -75446 -81737
22490 -81737 169 40832 19052 12031 2202 -19025 -8996 -43138 -56204 -79993 -46593 -7199
22478 -7199 -10046 -12001 17897 -1941 -7160 -16435 9837 4698 -27296 -16449 -413 21703 -97
22465 -97 -49850 -110705 -49341 9623 40536 18706 -31461 -289 19198 15840 9806 28402 40143
22452 40143 -15405 -51671 -30898 25479 30228 16400 31288 -2955 -45233 -8023 19202 44434
22440 44434 24744 25420 15974 7137 12840 14692 45140 7789 9118 29346 52831 71523 -10193
22427 -10193 -33636 -6743 27639 18489 30634 59025 65113 -905 -11418 -19519 -32530 -47703
$$ packed form
22515E6351J7124J3142n972Q252K5535P573j9877m6533l4656n425J3655R113m1924
22502c642L1968N0215k4727J735k2574j7776j5630p392l3333j2345k1945o291
22490h1737Q1906M0663k1780p021r829k1227J0029l4142j3066k3789L3400L9394
22478g199k847j955K9898j9838n219r275K6272n139l1994J0847J6036K2116k1800
22465i7m9753o0855O1364N8964L0913k1830n0167L1172J9487l358o034J8596J1741
22452D0143n5548l6266K0773N6377M749j3828J4888l4243m2278L7210K7225K5232
22440D4434j9690O76r446q837N703J852L0448l7351J329K0228K3485J8692q1716
22427a0193k3443K6893L4382r150J2145K8391O088o6018j0513q101j3011j5173
$$ plain form
22415 -47703 -7874 47595 73838 40570 -1976 10161 20933 10600 5305 12715 21133 30312
22403 30312 5807 -16297 -17640 -6757 38955 74352 121388 68721 20924 27879 48826 57052
22391 57052 966 -42041 -13605 -4768 -30968 -24374 -19655 -25533 6983 36675 60783 74647
22379 74647 59241 32856 12326 32506 212 -19435 -32626 -38633 -21439 -20994 -37496 5642
22367 5642 -30149 -73595 -80060 -68975 -72832 -53312 -26782 -81001 -110831 -102382 -104746 -76816 -39066
22354 -39066 -73205 -81444 -53763 -72218 -90306 -14191 18868 11866 11048 -13294 14091 65126
22342 65126 62329 24886 -52 -13288 -9088 -28914 -48876 -30006 -31374 -455 10298 8356
22330 8356 29049 33725 30434 38094 12987 2285 20757 23107 18041 20023 671 45304 63934
$$ packed form
22415d7703L9829N5469K6243l3268m2546J2137J0772j0333n295P410Q418R179
22403C0312k4505k2104j343J0883M5712L5397M7036n2667m7797O955K0947Q226
22391E7052n6086m3007K8436Q837k6200O594M719n878L2516K9692K4108J3864
22379G4647j5406k6385k0530K0180l2294j9647j3191o007J7194M45j6502M3138
22367E642l5791m3446o465J1085l857J9520K6530n4219k9830Q449k364K7930L7750
22354c9066l4139q239K7681j8455j8088P6115L3059p002q18k4342K7385N1035
22342F5126k797l7443k4938j3236M200j9826j9962J8870j368L0919J0753j942
22330H356K0693M676l291P660k5107j0702J8472K350n066J982j9352M4633J8630
$$ plain form
22317 63934 44507 46426 63253 62571 88978 86453 36853 42177 44796 17678 1597 -10965 -24578
22304 -24578 -23363 -34179 -24220 -43612 -56621 -48354 7262 24025 36109 27160 18662 17283 13991
22291 13991 51196 59939 49110 81337 83113 88049 71103 107659 99786 80147 30431 52658
22279 52658 51090 56175 79991 70170 115531 115990 62192 65402 95583 76607 67665 75030 82277
22266 82277 55241 45765 56275 33335 -7212 -31614 -56977 -87996 -109111 -90005 -94119 -88940
22254 -88940 -57225 -40500 -28749 -12471 -27613 -48537 -22656 -27250 -18191 -24665 -28306 -3654
22242 -3654 4516 -1586 15679 23301 -8423 5037 -21866 -37400 -50371 -75516 -42724 -36987 -46626
22229 -46626 -60701 -32108 -19120 -19596 -48108 -75000 -23162 33903 53846 28387 41759 -35722
$$ packed form
22317F3934j9427J919J6827o82K6407k525m9600N324K619k7118j6081j2562j3613
22304b4578J215j0816R959j9392j3009Q267N5616J6763J2084q949q498j379l292
22291A3991L7205Q743j0829L2227J776M936j6946L6556p873j9639m9716K2227
22279E2658j568N085K3816r821M5361M59n3798L210L0181j8976q942P365P247
22266H2277k7036r476J0510k2940m0547k4402k5363l1019k1115J9106m114N179
22254h8940L1715J6725J1751J6278j5142k0924K5881m594R059o474l641K4652
22242c654Q170o102J7265P622l1724J3460k6903j5534j2971k5145L2792N737r639
22229d6626j4075K8593J2988m76k8512k6892N1838N7065J9943k5459J3372p7481
$$ plain form
22217 -35722 -35438 -15048 -4876 -19715 -53066 -71882 -56361 -61912 -51217 -4325 16790 -20219
22205 -20219 -34372 -55861 -47799 -36889 -19519 4875 -21721 -57291 -63830 -37563 3714 -15967
22193 -15967 -23689 -51652 -68977 -31034 8877 33544 38552 18238 -20099 -21579 -6169 43510
22181 43510 44560 31254 18829 35548 73039 54162 -4202 -18228 -23153 7056 60378 73284
22169 73284 52435 35646 14459 -38691 -26092 -19133 -30771 -61181 -70847 -65279 -41007 40792
22157 40792 43627 20308 23794 25597 30814 -30097 -51276 16675 -467 509 30622 47277 23934
22144 23934 -4743 10082 130 -4639 42834 67775 120367 123350 106093 64951 35726 11414
22132 11414 21071 15301 -9694 -67582 -44130 -2628 -8830 -1601 49082 99664 52760 6731
$$ packed form
22217c5722K84K0390J0172j4839l3351j8816J5521n551J0695M6892K1115l7009
22205b0219j4153k1489Q062J0910J7370K4394k6596l5570o539K6267M1277j9681
22193a5967p722k7963j7325L7943L9911K4667N008k0314l8337j480J5410M9679
22181D3510J050j3306j2425J6719L7491j8877n8364j4026m925L0209N3322J2906
22169G3284k0849j6789k1187n3150J2599O959j1638l0410r666N568K4272Q1799
22157D0792K835k3319L486J803N217o0911k1179O7951j7142R76L0113J6655k3343
22144B3934k8677J4825r952m769M7473K4941N2592K983j7257m1142k9225k4312
22132A1414R657n770k4995n7888K3452M1502o202P229N0683N0582m6904m6029
$$ plain form
22120 6731 -33933 6189 -30001 -18522 57578 32163 31091 27722 16296 16933 6482 10514 -8242
22107 -8242 22330 49204 47532 9069 -45058 -71807 -80332 -89952 -111722 -52760 -2076 -5862 -12820
22094 -12820 2397 17725 21293 31099 107745 138076 76512 53782 52742 11330 3997 676 17594
22081 17594 35260 21257 -22424 -50640 -82242 -77081 -46675 -59836 -27882 -17886 -1092 -28686
22069 -28686 -51221 -67465 -20611 3861 47094 52118 16748 20967 29712 -26275 -24940 -17696 26181
22056 26181 29152 -13375 -28179 -33804 -34689 -25827 -23016 8574 5445 46654 26684 -22890 -12041
22043 -12041 -13803 5829 -7727 -9134 -3983 27020 22762 -4633 15998 53905 81538 46097
22031 46097 54445 73903 34497 23622 13022 12361 2868 -26498 -21758 7288 -25085 -63097 -81821
$$ packed form
22120F731m0664M0122l6190J1479P6100k5415j072l369j1426O37j0451M032j8756
22107h242L0572K6874j672l8463n4127k6749q525r620k1770N8962N0684l786o958
22094a2820J5217J5328L568R806P6646L0331o1564k2730j040m1412p333l321J6918
22081A7594J7666j4003m3681k8216l1602N161L0406j3161L1954R996J6794k7594
22069b8686k2535j6244M6854K4472M3233N024l5370M219Q745n5987J335P244M3877
22056B6181K971m2527j4804n625q85Q862K811L1590l129M1209j9970m9574J0849
22043a2041j762J9632j3556j407N151L1003m258k7395K0631L7907K7633l5441
22031D6097Q348J9458l9406j0875j0600o61r493k9366M740K9046l2373l8012j8724
$$ plain form
22018 -81821 -58543 -49030 -53338 -75292 -71836 -69968 -109283 -70755 -34888 -6857 14601 17356 1630
22005 1630 -30597 -30524 -75629 -24521 53545 40248 5313 7489 27732 34811 -6098 21312 -1175
21992 -1175 4409 18975 -5245 -42484 10590 24751 -29562 -49086 4186 19563 51449 67761
21980 67761 38982 27258 68367 103391 52152 -4488 -43498 -13189 58744 26522 -36114 -61396
21968 -61396 -59892 -45710 -38095 -17883 11413 39346 99650 93472 67282 53068 87878 70492
21956 70492 12720 -40614 -50738 -30519 -45362 -68597 -39301 -32893 -51015 -80487 -42213 -55320
21944 -55320 -92631 -71119 -58942 -23097 -21411 -40696 -30770 -39176 -33438 -7612 20202 26417 30549
21931 30549 43615 28652 12127 15614 15514 31060 2893 -4809 26853 35790 -18979 -61955 -38731
$$ packed form
22018h1821K3278R513m308k1954L456J868l9315L8528L5867K8031K1458K755j5726
22005A630l2227P3m5105N1108P8066j3297l4935K176K0243P079m0909K7410k2487
21992a175N584J4566k4220l7239N3074J4161n4313j9524N3272J5377L1886J6312
21980F7761k8779j1724M1109L5024n1239n6640l9010L0309P1933l2222o2636k5282
21968f1396J504J4182P615K0212K9296K7933O0304o178k6190j4214L4810j7386
21956G0492n7772n3334j0124K0219j4843k3235K9296O408j8122k9472L8274j3107
21944e5320l7311K1512J2177L5845J686j9285R926q406N738K5826K7814O215M132
21931C0549J3066j4963j6525L487j00J5546k8167p702L1662Q937n4769m2976K3224
$$ plain form
21918 -38731 -23342 -4326 -34772 -85641 -102526 -108180 -64325 -3177 -26989 -41386 -57344 -80571
21906 -80571 -94550 -50874 -44212 -35949 -2859 -448 -29041 -22228 -22955 -14198 25328 27966 56840
21893 56840 39097 17148 -14669 -45246 -54024 -70992 -46813 -63294 -78775 -25815 25689 29997
21881 29997 3617 -10797 -34215 -23392 -39620 11231 39551 12346 -43055 -64551 -85906 -90277
21869 -90277 -55544 -56975 -30133 -37534 -38700 -25232 7118 68886 48391 39769 83748 61843
21857 61843 11907 46070 84032 123673 111254 59013 55416 65469 76787 105046 73795 69463
21845 69463 100023 39915 13855 -34466 5732 36959 6311 10274 46342 33965 11421 -2827
21833 -2827 -11363 22055 -9452 -30363 -8388 -15350 44859 33921 -20602 -26681 -4809 48892
$$ packed form
21918c8731J5389J9016l0446n0869j6885n654M3855O1148k3812j4397j5958k3227
21906h0571j3979M3676O662Q263L3090K411k8593O813p27Q757L9526K638K8874
21893E6840j7743k1949l1817l0577q778j6968K4179j6481j5481N2960N1504M308
21881B9997k6380j4414k3418J0823j6228N0851K8320k7205n5401k1496k1355m371
21869i0277L4733j431K6842p401j166J3468L2350O1768k0495q622M3979k1905
21857F1843m9936L4163L7962L9641j2419n2241l597J0053J1318K8259l1251m332
21845F9463L0560o0108k6060m8321M0198L1227l0648L963L6068j2377k2544j4248
21833b827q536L3418l1507k0911K1975o962O0209j0938n4523o079K1872N3701
$$ plain form
21821 48892 58774 38307 14921 -24079 -17034 -25716 14886 36392 -15110 25106 49893 55091
21809 55091 70768 50570 -5801 -48964 -57244 -32828 4035 55495 14676 -23373 -10777 -21675
21797 -21675 -16708 -8902 -18130 -33185 -39104 -36628 -32866 -62325 -39251 -35574 -11857 54554 101872
21784 101872 71707 45699 14740 -24577 -64162 -20217 -15897 -20415 7294 16077 13602 11089
21772 11089 33710 69969 51809 42319 42665 40800 46769 -15179 -8664 -992 -39330 -48977 -20322
21759 -20322 -23108 -11646 -1532 -45273 -84479 -73167 -28448 -4361 30761 22831 9695 30949
21747 30949 22153 25727 21541 -2083 -16833 -25887 -3459 23283 -381 -41565 -49659 -14722 46587
21734 46587 15896 11889 28060 -18861 -70285 -99444 -85921 -42390 4819 -11021 10865 12622
$$ packed form
21821D8892R882k0467k3386l9000P045q682M0602K1506n1502M0216K4787N198
21809E5091J5677k0198n6371m3163q280K4416L6863N1460m0819l8049J2596j0898
21797b1675M967P806r228j5055n919K476L762k9459K3074L677K3717O6411M7318
21784A01872l0165k6008l0959l9317l9585M3945M320m518K7709Q783k475k513
21772A1089K2621L6259j8160r490L46j865N969o1948O515P672l8338r647K8655
21759b0322k786J1462J0114m3741l9206J1312M4719K4087L5122p930j3136K1254
21747C0949q796L574m186k3624j4750r054K2428K6742k3664m1184q094L4937O1309
21734D6587l0691m007J6171m6921n1424k9159J3523M3531M7209j5840K1886J757
$$ plain form
21722 12622 947 -16137 -30702 39643 74784 59937 45381 -16326 -30982 3729 36919 -267
21710 -267 -32498 -77920 -102900 -106831 -81075 -18652 -8766 -10875 -14065 -21425 498 -1104 7568
21697 7568 13390 -9263 9995 -34034 -67746 -67190 -11908 46256 19958 -2516 14211 5635 -1324
21684 -1324 47139 34973 28095 -26591 -47221 -6027 -14508 -14223 1916 23449 -24136 26721 27242
21671 27242 26655 29393 28531 32095 -13719 -33989 -11208 13366 34513 65713 71454 94363 90303
21658 90303 105545 133582 85314 34370 24241 12664 -28162 -19912 16260 19415 34332 13504
21646 13504 -12672 -36900 -21672 -12474 -18594 15432 22979 4260 -67494 -72288 -68511 -101979 -98069
21633 -98069 -43990 -6237 -32529 -58962 -60613 -38710 -60968 -77605 -63321 -85580 -89672 -41904
$$ packed form
21722A2622j1675j7084j4565P0345L5141j4847j4556o1707j4656L4711L3190l7186
21710b67l2231m5422k4980l931K5756O2423R886k109l190p360K1923j602Q672
21697G568N822k2653J9258m4029l3712N56N5282N8164k6298k2474J6727q576o959
21684a324M8463j2166o878n4686k0630M1194q481K85J6139K1533m7585N0857N21
21671B7242n87K738q62L564m5814k0270K2781K4574K1147L1200N741K2909m060
21658I0303J5242K8037m8268n0944j0129j1577m0826Q250L6172L155J4917k0828
21646A3504k6176k4228J5228R198o120L4026P547j8719p1754m794L777l3468L910
21633i8069N4079L7753k6292k6433j651K1903k2258j6637J4284k2259m092M7768
$$ plain form
21621 -41904 -14264 -15043 1214 42072 33355 16242 16903 42341 102478 80243 37118 -1830 19373
21608 19373 -36567 -58409 -6449 15430 -4686 -16077 2599 -23724 -13307 -6128 11075 19976
21596 19976 -47128 -48375 -7113 60206 62926 47720 18861 21802 -1868 -11042 -712 8517 18320
21583 18320 29112 70067 68994 45010 55144 60857 22303 -11876 9018 -32295 -18227 -17617
21571 -17617 -22727 26564 21435 1339 4885 2550 -22243 -26016 -5988 2828 81014 142907 68303
21558 68303 37331 74490 99894 108494 77986 57843 47243 62549 83294 102166 94900 83486
21546 83486 28191 -17150 21686 30672 8431 4700 29505 3957 -10576 12317 33281 35354
21534 35354 5570 -6530 26045 48570 24151 45990 70063 88511 55323 26556 11552 13237
$$ packed form
21621d1904K7640p79J6257M0858q717j7113O61K5438O0137k2235m3125l8948K1203
21608A9373n5940k1842N1960K1879k0116j1391J8676k6323J0417P179J7203Q901
21596A9976o7104j247M1262O7319K720j5206k8859K941k3670r174J0330R229R803
21583A8320J0792M0955j073k3984J0134N713l8554l4179K0894m1313J4068O10
21571a7617n110M9291n129k0096L546k335k4793l773K0028Q816P8186O1893p4604
21558F8303l0972L7159K5404Q600l0508k0143j0600J5306K0745J8872p266j1414
21546H3486n5295m5341L8836Q986k2241l731K4805k5548j4533K2893K0964K073
21534C5354k9784j2100L2575K2525k4419K1839K4073J8448l3188k8767j5004J685
$$ plain form
21522 13237 -11566 3955 768 -41703 -20845 -52786 -44621 -49075 -32700 -64868 -50333 -60644
21510 -60644 -79172 -93283 -61413 -38842 -71073 -97641 -71803 -55786 -54896 -62761 -52231 -20941
21498 -20941 -9940 -11721 -13768 -11092 11532 -1341 10210 21937 28183 62183 59780 25763 17746
21485 17746 45049 61821 47230 23907 -4010 -1781 971 19360 6877 -28472 -2938 -5195
21473 -5195 20529 57713 54264 30198 -7714 -19223 32077 43868 -11123 -11627 34775 28521 12101
21460 12101 3577 -5080 6101 21980 40643 83662 53671 31685 27439 30658 50997 49187 3791
21447 3791 -9487 22393 37772 14460 32897 -1545 -13477 19761 20654 37932 50734 20627
21435 20627 40597 76278 61823 54246 36092 -2647 -13600 2876 36467 24766 44247 38066
$$ packed form
21522A3237k4803J5521l187m2471K0858l1941Q165m454J6375l2168J4535j0311
21510f0644j8528j4111L1870K2571l2231k6568K5838J6017Q90p865J0530L1290
21498b0941J1001j781k047K676K2624j2873J1551J1727O246L4000k403l4017q017
21485A7746K7303J6772j4591k3323k7917K229K752J8389j2483l5349K5534k257
21473e195K5724L7184l449k4066l7912j1509N1300J1791n4991n04M6402o254j6420
21460A2101q524q657J1181J5879J8663M3019k9991k1986m246L219K0339j810m5396
21447C791j3278L1880J5379k3312J8437l4442j1932L3238Q93J7278J2802l0107
21435B0627J9970L5681j4455p577j8154l8739j0953J6476L3591j1701J9481o181
$$ plain form
21423 38066 70738 49891 -32082 -66736 -41422 -14695 274 25030 -19760 -27514 1924 5603
21411 5603 66952 68911 28536 25434 2694 24594 -28251 -11463 13348 48323 75598 49426
21399 49426 5391 -4378 -363 -24040 -26988 34877 62969 96520 87364 73362 16544 -33130
21387 -33130 -37462 -23283 -40859 -22462 -55277 -44016 -15677 -23415 -59697 -74199 -53075 -40207
21375 -40207 -2572 8807 17470 67825 42017 44497 35336 7832 7413 6424 51605 69619 91299
21362 91299 86865 70455 12938 -35319 -16885 -29616 -62125 -64734 -65432 -103583 -97573 -85174 -58298
21349 -58298 -15510 -34833 -2002 9240 -55659 -22531 -16965 -70145 -61476 -23840 9835 -9459
21337 -9459 11361 26223 27103 9015 3004 4067 -6164 -3147 11598 32011 47863 52846 39650
$$ packed form
21423C8066L2672k0847q1973l4654K5314K6727J4969K4756m4790p754K9438L679
21411E603O1349J959m0375l102k2740K1900n2845J6788K4811L4975K7275k6172
21399D9426m4035r769M015k3677k948O1865K8092L3551r156j4002n6818m9674
21387c3130m332J4179j7576J8397l2815J1261K8339p738l6282j4502K1124J2868
21375d0207L7635J1379Q663N0355k5808K480r161k7504m19r89M5181J8014K1680
21362I1299m434j6410n7517m8257J8434j2731l2509k609o98l8151O010J2399K6876
21349e8298M2788j9323L2831J1242o4899L3128N566n3180Q669L7636L3675j9294
21337i459K0820J4862Q80j8088o011J063j0231L017J4745K0413J5852M983j3196
$$ plain form
21324 39650 22313 7576 33910 -8093 -718 38178 45013 24460 -12634 -30736 -5052 44479
21312 44479 -25574 1447 57340 33887 16055 4519 -534 8644 29702 46546 45955 43067 68226
21299 68226 73222 39490 10703 -9856 27410 54638 30139 40618 62471 61889 53138 -14045
21287 -14045 -30716 10272 9845 -8025 -24205 -35401 1485 20673 14352 38718 64078 91247
21275 91247 94291 74471 68101 106781 65658 -2645 -2402 -38464 -79214 -70910 -24657 5177 -25711
21262 -25711 -49107 -34379 -56861 -42198 -31661 29192 56399 44906 4478 -17491 -27514 -248
21250 -248 -6063 -30376 -32765 -17132 -1462 -16128 17564 10058 -45069 -86537 -92710 -8263 18500
21237 18500 33417 22434 -27885 -23558 38163 71369 69125 26275 39916 76711 81177 17416
$$ packed form
21324C9650j7337j4737K6334m2003P375L8896O835k0553l7094j8102K5684M9531
21312D4479p0053K7021N5893k3453j7832j1536n053R178K1058J6844n91k888K5159
21299F8226M996l3732k8787k0559L7266K7228k4499J0479K1853n82q751o7183
21287a4045j6671M0988m27j7870j6180j1196L6886J9188o321K4366K5360K7169
21275I1247L044j9820o370L8680m1123o8303K43l6062m0750Q304M6253K9834l0888
21262b5711k3396J4728k2482J4663J0537O0853K7207j1493m0428k1969j0023K7266
21250b48n815k4313k389J5633J5670j4666L3692p506n5127m1468o173Q4447K6763
21237A8500J4917j0983n0319M327O1721L3206k244m2850J3641L6795M466o3761
$$ plain form
21225 17416 1194 23754 1433 18142 -15904 -38801 -792 12567 39658 55637 15182 -15974
21213 -15974 -48323 -53622 -95508 -52572 -20750 -43973 -65264 -83698 -84489 -16152 44271 64210
21201 64210 41528 -22780 -36646 -66784 -10238 39444 45358 41277 55633 49952 10227 20082
21189 20082 79590 51668 22313 42844 26178 -15233 -46130 -66706 -60020 -42031 -89847 -43249
21177 -43249 31022 45367 94096 104517 42799 -20795 -75584 -69894 -60935 -16405 22469 37668
21165 37668 20826 39087 36835 71005 88085 41738 15711 25213 77889 44721 26088 58838
21153 58838 56004 22828 -21539 -2607 10406 9704 38071 62969 67027 56598 76735 79743 79972
21140 79972 100999 56747 41275 77371 88233 98445 76548 40840 -2223 -33293 -15881 -19061
$$ packed form
21225A7416j6222K2560k2321J6709l4046k2897L8009J3359K7091J5979m0455l1156
21213a5974l2349n299m1886M2936L1822k3223k1291j8434p91O8337O0423J9939
21201F4210k2682o4308j3866l0138N6546M9682N914m081J4356n681l9725R855
21189B0082N9508k7922k9355K0531j6666m1411l0897k0576O686J7989m7816M6598
21177d3249P4271J4345M8729J0421o1718o3594n4789N690Q959M4530L8874J5199
21165C7668j6842J8261k252L4170J7080m6347k6027R502N2676l3168j8633L2750
21153E8838k834l3176m4367J8932J3013p02K8367K4898M058j0429K0137L008K29
21140G9972K1027m4252j5472L6096J0862J0212k1897l5708m3063l1070J7412l180
$$ plain form
21128 -19061 -2351 -3798 -13800 18234 22239 14615 -2360 35084 28481 17848 27502 48544 45403
21115 45403 55613 149569 133785 64103 46968 64337 61617 122782 96636 100804 59045 48822
21103 48822 62637 69228 73852 35835 -19470 -4533 -3199 3624 26337 55715 22255 5954
21091 5954 51934 90913 108249 90880 69589 54940 44278 37255 30446 18544 10343 38322
21079 38322 49287 -27080 -52423 -16228 9401 25356 9977 29661 19989 -16886 8515 28260
21067 28260 48369 50599 36721 15043 16366 31734 96250 106525 81133 75852 60643 18037
21055 18037 -18560 15336 49210 76904 86488 113875 113682 76229 90116 97653 77396 48162
21043 48162 52439 36886 804 -501 -49775 -69198 -53054 -36971 -9971 19032 15801 41912
$$ packed form
21128a9061J6710j447j0002L2034M005p624j6975L7444o603j0633R654K1042l141
21115D5403J0210R3956j5784o9682j7135J7369k720O1165k6146M168m1759j0223
21103D8822J3815O591M624l8017n5305J4937J334O823K2713K9378l3460j6301
21091E954M5980L8979J7336j7369k1291j4649j0662p023o809j1902q201K7979
21079C8322J0965p6367k5343L6195K5629J5955j5379J9684r672l6875K5401J9745
21067B8260K0109K230j3878k1678J323J5368O4516J0275k5392n281j5209m2606
21055A8037l6597L3896L3874K7694R584K7387j93l7453J3887P537k0257k9234
21043D8162M277j5553l6082j305m9274j9423J6144J6083K7000K9003l231K6111
$$ plain form
21031 41912 12101 -20601 3900 3771 -5754 16749 14807 23000 26693 63884 84726 66792 66233
21018 66233 50219 73817 71666 64659 59994 12198 -50419 -69279 -45867 -43719 -43309 42349 112840
21005 112840 140206 141910 148048 57090 -9361 4684 18666 -16890 -7864 -14946 15155 28533
20993 28533 53511 89690 122384 91383 17362 14621 42318 68431 108572 115676 52379 57229
20981 57229 52902 10180 -23685 -32285 -27595 15377 59139 44419 38773 42867 46334 54003 36238
20968 36238 77678 95535 88140 40702 29283 29761 55175 45307 57183 38919 4 27700
20956 27700 77059 80121 26966 25202 34591 48357 36039 22337 -17955 -7066 21764 25872
20944 25872 42329 52634 38348 2697 -21247 17563 32860 20659 41422 59437 92521 48547
$$ packed form
21031D1912k9811l2702K4501j29r525K2503j942Q193L693L7191K0842j7934n59
21018F6233j6014K3598k151p007m665m7796o2617j8860K3412K148M10Q5658P0491
21005A12840K7366J704O138r0958o6451J4045J3982l5556R026p082L0101J3378
20993B8533K4978L6179L2694l1001p4021k741K7697K6113M0141P104o3297M850
20981E7229m327m2722l3865q600M690M2972M3762j4720n646M094L467P669j7765
20968C6238M1440J7857p395m7438j1419M78K5414r868J1876j8264l8915K7696
20956B7700M9359L062n3155j764R389J3766j2318j3702m0292J0889K8830M108
20944B5872J6457J0305j4286l5651k3944L8810J5297j2201K0763J8015L3084m3974
$$ plain form
20932 48547 13853 12556 35684 -5328 -12780 9294 -4511 -18592 -34517 15131 66086 72985
20920 72985 84118 43969 17646 29384 90659 105958 59357 56496 57400 44118 49684 97698
20908 97698 132042 173079 126797 32614 -5767 35210 56656 54567 44390 -13278 -50182 -40145
20896 -40145 -21175 -1446 29664 45297 17820 -23881 -7121 20498 25783 54376 28609 57818
20884 57818 72624 57043 45816 69114 85638 84346 65045 18825 -6563 -29048 248 13495
20872 13495 42853 42621 -958 17851 37009 43040 92338 119819 97484 34941 4073 29863
20860 29863 -11029 8527 17876 39007 30874 -38796 -65751 -18293 31877 70784 96654 64696
20848 64696 56642 55530 72240 41163 28739 27183 34569 -26729 -18324 27998 35961 37752 62165
$$ packed form
20932D8547l4694j297K3128m1012p452K2074j3805j4081j5925M9648N0955O899
20920G2985J1133m0149k6323J1738O1275J5299m6601k861R04j3282N566M8014
20908I7698L4344M1037m6282r4183l8381M0977K1446k089j0177n7668l6904J0037
20896d0145J8970J9729L1110J5633k7477m1701J6760K7619N285K8593k5767K9209
20884E7818J4806j5581j1227K3298J6524j292j9301m6220k5388k2485K9296J3247
20872A3495K9358k32m3579J8809J9158O031M9298K7481k2335o2543l0868K5790
20860B9863m0892J9556R349K1131q133o9670k6955M7458N0170L8907K5870l1958
20848F4696q054j112J6710l1077j2424j556P386o1298Q405M6322P963J791K4413
$$ plain form
20835 62165 96624 100673 92780 88856 116339 122380 125104 110424 92798 61894 73715 120113 98692
20822 98692 51672 -5797 -8195 25716 39641 38303 59726 58689 41491 21624 31943 60304
20810 60304 68053 46082 69926 75362 65836 102577 95691 40073 75519 106464 85471 77597 57239
20797 57239 56185 69001 88598 73201 93466 57332 34031 26953 31753 61504 125932 134608
20785 134608 113840 94184 71139 81808 88508 64629 44868 38326 65277 108232 138217 107244
20773 107244 53781 90410 132972 145086 72553 41953 77691 115499 134197 128656 118055 152254
20761 152254 155981 160715 191327 188169 219341 168027 168084 169840 171904 248896 297022 310990 333009
20748 333009 372389 411755 429247 453880 505403 622642 744097 898648 1066608 1195714
$$ packed form
20835F2165L4459M049p893l924K7483O041K724j4680j7626l0904J1821M6398k1421
20822I8692m7020n7469k398L3911J3925j338K1423j037j7198j9867J0319K8361
20810F0304P749k1971K3844N436r526L6741o886n5618L5446L0945k0993p874k0358
20797E7239j054J2816J9597j5397K0265l6134k3301p078M800K9751O4428Q676
20785A34608k0768j9656k3045J0669O700k3879j9761o542K6951M2955K9985l0973
20773A07244n3463L6629M2562J2114p2533l0600L5738L7808J8698n541j0601L4199
20761A52254L727M734L0612l158L1172n1314N7J756K064P6992M8126J3968K2019
20748C33009L9380L9366J7492K4633N1523J17239J21455J54551J67960J29106
$$ plain form
20738 1195714 1314780 1520228 1801651 2008286 2131161 2163709 2249940 2372655 2494316 2527768
20728 2527768 2459228 2451461 2444747 2467143 2471023 2545126 2577849 2607780 2541621 2395418 2358242 2381103
20716 2381103 2366455 2325965 2185181 1955170 1756707 1587368 1399053 1243746 1126779 958683
20706 958683 773455 663377 534029 522963 496949 446404 409206 423937 454625 485392 455149
20695 455149 449758 414478 388018 375541 363629 350015 324223 343972 363197 339564 321256 305034
20683 305034 321326 312508 271936 258628 295368 326263 325442 307826 297491 312272 279687 230836
20671 230836 234147 245732 219744 191563 171991 163465 165250 178905 126924 96904 87738 105416
20659 105416 109560 69837 127280 126249 115028 96225 98583 106833 96556 68213 94993 119967
$$ packed form
20738A195714J19066K05448K81423K06635J22875L2548Q6231J22715J21661L3452
20728B527768o8540p767o714K2396L880P4103L2723K9931o6159j46203l7176K2861
20716B381103j4648m0490j40784k30011j98463j69339j88315j55307j16967j68096
20706I58683j85228j10078j29348j1066k6014n0545l7198J4731L0688L0767l0243
20695D55149n391l5280k6460j2477j1912j3614k5792J9749J9225k3633j8308j6222
20683C05034J6292q818m0572j3308L6740L0895q21j7616j0335J4781l2585m8851
20671B30836L311J1585k5988k8181j9572q526J785J3655n1981l0020r166J7678
20659A05416M144l9723N7443j031j1221j8803K358Q250j0277k8343K6780K4974
$$ plain form
20647 119967 88461 98756 116310 102891 165208 189840 160537 149380 143849 159595 144639 127105
20635 127105 129094 134117 111955 86347 126913 101684 71368 18015 -4918 -23468 12086 8625
20623 8625 26067 42148 56529 71678 63460 55885 87045 98343 90370 58559 31867 -5765
20611 -5765 -27075 -33034 -7457 -5703 -513 3438 22985 27437 63318 75726 50781 33117 61726
20598 61726 65245 67929 77709 24548 1691 12867 39362 60024 62327 49425 96050 145441
20586 145441 134991 129345 138217 147805 156815 130403 64822 43082 75060 69044 58657 46978
20574 46978 37677 42482 71010 104223 124695 127956 90066 59141 63461 18240 8009 40147
20562 40147 61444 90778 97970 106999 144743 125987 116118 80350 85390 99288 49447 74478
$$ packed form
20647A19967l1506J0295J7554j3419O2317K4632k9303j1157n531J5746j4956j7534
20635A27105J989N023k2162k5608M0566k5229l0316n3353k2933j8550L5554l461
20623H625J7442J6081J4381J5149q218p575L1160J1298p973l1811k6692l7632
20611e765k1310n959K5577J754N190L951J9547M452L5881J2408k4945j7664K8609
20598F1726L519K684R780n3161k2857J1176K6495K0662K303j2902M6625M9391
20586A45441j0450n646Q872R588R010k6412o5581k1740L1978o016j0387j1679
20574D6978r301M805K8528L3213K0472L261l7890l0925M320m5221j0231L2138
20562D0147K1297K9334P192R029L7744j8756r869l5768N040J3898m9841K5031
$$ plain form
20550 74478 139256 180764 153114 120856 115685 128405 150819 141560 126772 149418 182397 163238
20538 163238 146466 142506 152892 147294 133035 130079 154656 174354 216010 239548 264158 272660
20526 272660 231456 181472 160805 140616 173111 203941 231007 229947 181627 173042 170589 150403
20514 150403 156376 209440 211976 181900 230399 252511 237899 191190 189810 154885 138026 148980
20502 148980 145784 128212 152190 129545 185635 180126 101235 117887 126599 113494 113584 85528 113233
20489 113233 158735 167863 162963 119447 91902 118692 141344 147655 158778 173991 183757 188450
20477 188450 164253 155556 143887 151242 125877 67424 69911 58912 73635 88043 121024 141061
20465 141061 135751 129048 136200 73375 23967 43032 110670 122967 94800 130074 186143 200616
$$ packed form
20550G4478O4778M1508k7650l2258n171J2720K2414r259j4788K2646L2979j9159
20538A63238j6772l960J0386n598j4259k956K4577J9698M1656K3538K4610Q502
20526B72660m1204m9984k0667k0189L2495L0830K7066j060m8320q585k453k0186
20514A50403N973N3064K536l0076M8499K2112j4612m6709j380l4925j6859J0954
20502A48980l196j7572K3978k2645N6090n509p8891J6652Q712j3105R0k8056K7705
20489A13233M5502R128m900m3516k7545K6790K2652O311J1123J5213R766M693
20477A88450k4197q697j1669P355k5365n8453K487j0999J4723J4408L2981K0037
20465A41061n310o703P152o2825m9408J9065O7638J2297k8167L5274N6069J4473
$$ plain form
20453 200616 169943 138023 136506 160122 179175 149921 134172 157813 166136 145018 184393 193742
20441 193742 153368 153799 168672 230570 250550 213082 202904 160340 134512 130708 141266 181059
20429 181059 197339 183139 132736 129484 155702 175362 153889 179546 199374 207906 205996 209500
20417 209500 205150 223049 208953 178483 209420 197967 223897 234666 218667 202124 240024 287577
20405 287577 354633 360286 371415 348270 317729 344661 419091 497710 531937 562370 629942 720627
20393 720627 756833 794395 799842 792486 796392 785110 764552 726823 697327 708016 696170 732268
20381 732268 807803 833303 840362 793806 746451 752548 730558 726712 778571 719280 658332 580076
20369 580076 593735 626982 601948 575580 552075 488197 448383 453346 371307 370103 433762 480728
$$ packed form
20453B00616l0673l1920j517K3616J9053k9254j5749K3641Q323k1118L9375R349
20441A93742m0374M31J4873O1898J9980l7468j0178m2564k5828l804J0558L9793
20429A81059J6280j4200n0403l252K6218J9660k1473K5657J9828Q532j910L504
20417B09500m350J7899j4096l0470L0937j1453K5930J0769j5999j6543L7900M7553
20405B87577O7056N653J1129k3145l0541K6932P4430P8619L4227L0433O7572R0685
20393G20627L6206L7562N447p356L906j1282k0558l7729k9496J0689j1846L6098
20381G32268P5535K5500P059m6556m7355O097k1990l846N1859n9291o0948p8256
20369E80076J3659L3247k5034k6368k3505o3878l9814M963q2039j204O3659M6966
$$ plain form
20357 480728 485287 443298 425334 430079 412052 381943 387179 379960 352575 352064 375750 385393 376793
20344 376793 379351 376464 382301 357334 341349 327337 313381 344381 370958 385059 349773 293679
20332 293679 251118 250196 268906 248456 244369 270392 264474 227461 168471 152891 190576 189465
20320 189465 172163 94701 72321 102716 164711 192137 185095 135736 111927 156536 189112 227185
20308 227185 273267 295718 321730 336024 338234 366256 367965 419792 468731 527095 497502 510467
20296 510467 545138 539057 520697 495368 490418 523562 581793 642250 668878 684212 678173 657613
20284 657613 693194 745714 799071 842055 834535 803726 804424 809065 781848 789529 795528 814240 836088
20271 836088 879307 853560 809352 772682 814126 904557 909456 927163 961563 939362 958415 1003932
$$ packed form
20357D80728M559m1989j7964M745j8027l0109N236p219k7385n11K3686R643q600
20344C76793K558k887N837k4967j5985j4012j3956L1000K6577J4101l5286n6094
20332B93679m2561r22J8710k0450m087K6023n918l7013n8990j5580L7685j111
20320A89465j7302p7462k2380L0395O1995K7426p042m9359k3809M4609L2576L8073
20308B27185M6082K2451K6012J4294K210K8022J709N1827M8939N8364k9593J2965
20296E10467L4671o081j8360k5329m950L3144N8231O0457K6628J5334o039k0560
20284F57613L5581N2520N3357M2984p520l0809O98M641k7217P681N999J8712K1848
20271H36088M3219k5747m4208l6670M1444R0431M899J7707L4400k2201J9053M5517
$$ plain form
20259 1003932 975560 962196 981684 1002590 982337 1016093 1056031 1052015 1041147 991392 966061
20248 966061 1001188 1073883 1089008 1121912 1172624 1185411 1210895 1230250 1172150 1151933 1173059
20237 1173059 1198264 1242361 1259872 1333144 1368929 1405943 1450328 1483784 1517785 1566529 1688249
20226 1688249 1808196 1884851 1941009 2042032 2089801 2175623 2293285 2384037 2495961 2599032
20216 2599032 2673363 2789738 2864896 2849218 2916350 3032321 3128915 3159655 3261091 3328699 3396210
20205 3396210 3484797 3618031 3735242 3825079 3860268 3925859 4093464 4240025 4345277 4486488
20195 4486488 4618549 4832744 5074853 5330516 5671497 6082118 6495082 6928900 7393669
20186 7393669 7876889 8445217 8971344 9363030 9661825 10020777 10478051 10941739 11363270
$$ packed form
20259A003932k8372j3364J9488K0906k0253L3756L9938m016j0868m9755k5331
20248I66061L5127P2695J5125L2904N0712J2787K5484J9355n8100k0217K1126
20237A173059K5205M4097J7511P3272L5785L7014M4385L3456L4001M8744J21720
20226A688249J19947P6655N6158J01023M7769Q5822J17662R0752J11924J03071
20216B599032P4331J16375P5158j5678O7132J15971R6594L0740J01436O7608O7511
20205C396210Q8587J33234J17211Q9837L5189O5591J67605J46561J05252J41211
20195D486488J32061K14195K42109K55663L40981M10621M12964M33818M64769
20186G393669M83220N68328N26127L91686K98795L58952M57274M63688M21531
$$ plain form
20177 11363270 11702959 12006907 12295741 12638518 13085906 13580802 14214617 14854801 15417536
20168 15417536 15975586 16649676 17438608 18329431 19334465 20332295 21418772 22591838 23948744
20159 23948744 25578893 27551425 29914413 32754338 36243722 40737547 46595812 54256410
20151 54256410 64415346 77928880 95724981 118200096 144202381 170832094 196736240
20144 196736240 224858488 259189201 299216512 336599164 360668937 372460288 382603817
20137 382603817 398349673 417272307 429861126 431254082 427169225 423593864 421957675
20130 421957675 423400794 429918773 441637295 452371068 452290160 441639980 430561416 425522510
20122 425522510 422964395 411912267 386231011 352213547 318648942 288480541 259945696
$$ packed form
20177A1363270L39689L03948K88834L42777M47388M94896O33815O40184N62735
20168A5417536N58050O74090P88932Q90823J005034R97830J086477J173066J356906
20159B3948744J630149J972532K362988K839925L489384M493825N858265P660598
20151E4256410J0158936J3513534J7796101K2475115K6002285K6629713K5904146
20144A96736240K8122248L4330713M0027311L7382652K4069773J1791351J0143529
20137C82603817J5745856J8922634J2588819J392956m084857l575361j636189
20130D21957675J443119O517979J1718522J0733773q0908j0650180j1078564n038906
20122D25522510k558115j1052128k5681256l4017464l3564605l0168401k8534845
$$ plain form
20115 259945696 231128751 202456054 176068989 153342333 134390077 119086317 107061594
20108 107061594 97610759 90115286 84153093 79465079 75696166 72428526 69461245 66871287
20100 66871287 64622339 62693417 60918137 59095392 57226578 55360636 53620578 52057327
20092 52057327 50566526 49131884 47710614 46204035 44665209 43193603 41879282 40642110
20084 40642110 39346756 37953703 36516012 34963209 33456462 31955611 30548430 29126959
20076 29126959 27698138 26218140 24744680 23388615 22139895 21014390 19965433 18932509
20068 18932509 17943615 17014511 16177301 15412677 14624841 13948048 13360852 12777121 12185896
20059 12185896 11624741 11081282 10595570 10157812 9733724 9315715 8905712 8562267 8164857
$$ packed form
20115B59945696k8816945k8672697k6387065k2726656j8952256j5303760j2024723
20108A07061594r450835p495473n962193m688014l768913l267640k967281k589958
20100F6871287k248948j928922j775280j822745j868814j865942j740058j563251
20092E2057327j490801j434642j421270j506579j538826j471606j314321j237172
20084D0642110j295354j393053j437691j552803j506747j500851j407181j421471
20076B9126959j428821j479998j473460j356065j248720j125505j048957j032924
20068A8932509r88894r29104q37210p64624p87836o76793n87196n83731n91225
20059A2185896n61155n43459m85712m37758m24088m18009m10003l43445l97410
$$ plain form
20050 8164857 7809657 7459153 7167523 6954802 6709933 6419104 6168083 5908062 5598601
20041 5598601 5345102 5077942 4874857 4733961 4540662 4425691 4276501 4144176 3988600
20032 3988600 3830712 3696193 3618407 3552703 3518560 3370730 3260795 3217362 3155289 3073537
20022 3073537 3018996 2976674 2935174 2893078 2842612 2851451 2819274 2744664 2691407 2698003 2642020 2649727
20010 2649727 2672617 2652793 2565175 2482682 2464833 2404451 2369278 2307003 2244826 2206409 2155562
19999 2155562 2097794 2041963 1978356 1896638 1835840 1786510 1736359 1690611 1563836 1420726 1379607
19988 1379607 1343171 1309164 1311525 1259665 1153222 1163570 1163409 1115301 1097569 1099467 1112719 1082651
19976 1082651 1092948 1131745 1137009 1105945 1130967 1146513 1147134 1138465 1130285 1174067 1210087 1274387
$$ packed form
20050H164857l55200l50504k91630k12721k44869k90829k51021k60021l09461
20041E598601k53499k67160k03085j40896j93299j14971j49190j32325j55576
20032C988600j57888j34519p7786o5704l4143j47830j09935m3433o2073q1752
20022C073537n4541m2322m1500m2096n0466Q839l2177p4610n3257O596n5983P707
20010B649727K2890j9824q7618q2493j7849o0382l5173o2275o2177l8417n0847
19999B155562n7768n5831o3607q1718o0798m9330n0151m5748j26775j43110m1119
19988A379607l6436l4007K361n1860j06443J0348j61m8108j7732J898J3252l0068
19976A082651J0297L8797N264l1064K5022J5546O21q669q180M3782L6020O4300
$$ plain form
19964 1274387 1291323 1333093 1375556 1393102 1430854 1429381 1444296 1485190 1535589 1557174 1581030
19953 1581030 1601249 1625026 1654619 1714562 1717659 1693433 1697557 1699467 1662907 1665310 1614623 1571033
19941 1571033 1629184 1668692 1668763 1640345 1585043 1524593 1435492 1448555 1444166 1480606 1484374 1443040
19929 1443040 1433439 1404329 1410527 1420294 1404287 1372654 1317067 1266045 1276722 1302664 1258727 1265399
19917 1265399 1250265 1223020 1205493 1167433 1130156 1104972 1078331 1071761 1067331 1043569 1052991 1028776
19905 1028776 996380 975477 969295 911256 849280 843362 840353 881300 874563 867609 832147 824236
19893 824236 808370 817176 837324 802878 764750 810503 838870 809487 778936 794443 824263 808490
19881 808490 777182 743384 713728 741186 723749 663984 662799 722064 713366 655775 673644 669005
$$ packed form
19964A274387J6936M1770M2463J7546L7752j473J4915M0894N0399K1585K3856
19953A581030K0219K3777K9593N9943L097k4226M124J910l6560K403n0687m3590
19941A571033N8151L9508P1k8418n5302o0450q9101J3063m389L6440L768m1334
19929A443040r601k9110O198R767j6007l1633n5587n1022J0677K5942m3937O672
19917A265399j5134k7245j7527l8060l7277k5184k6641o570m430k3762R422k4215
19905A028776l2396k0903o182n8039o1976n918l009M0947o737o954l5462p911
19893H24236j5866Q806K0148l4446l8128M5753K8367k9383l0551J5507K9820j5773
19881H08490l1308l3798k9656K7458j7437n9765j185N9265q698n7591J7869m639
$$ plain form
19869 669005 607499 605121 594456 530354 527379 527633 507170 479105 475125 410038 356059 405481
19857 405481 388242 357934 339720 305126 287748 307565 319717 327366 333945 355729 355837 347257
19845 347257 344433 326230 297403 259198 285845 365439 398803 339067 291710 288794 299273 354138
19833 354138 375830 347014 352994 364616 373176 374092 383132 425496 451194 458621 456056 478865 449349
19820 449349 429972 397285 397355 393710 406386 435079 482037 485348 427128 425819 456113 502931 581074
19807 581074 620486 595691 599513 599936 516507 525020 501649 522870 502163 505450 519164 512701 520300
19794 520300 515816 485546 505675 521195 529642 577354 544951 478710 505930 496906 508641 503907
19782 503907 518789 497391 481778 484892 441824 418453 463333 486250 474380 496124 541383 536519
$$ packed form
19869F69005o1506k378j0665o4102k975K54k0463k8065l980o5087n3979M9422
19857D05481j7239l0308j8214l4594j7378J9817J2152P649O579K1784J08q580
19845C47257k824j8203k8827l8205K6647P9594L3364n9736m7357k916J0479N4865
19833C54138K1692k8816N980J1622Q560R16R040M2364K5698P427k565K2809k9516
19820D49349j9377l2687P0l645J2676K8693M6958L311n8220j309L0294M6818P8143
19807E81074L9412k4795L822M23q3429Q513k3371K1221k0707L287J3714o463P599
19794E20300m484l0270K0129J5520Q447M7712l2403o6241K7220r024J1735m734
19782E03907J4882k1398j5613L114m3068k3371M4880K2917j1870K1744M5259m864
$$ plain form
19770 536519 493685 534409 557158 592237 580228 598570 641872 733977 848887 1061564 1324275
19759 1324275 1515345 1688866 1972070 2359079 2695827 2835229 2932337 3039553 3095251 3020252
19749 3020252 2882100 2727137 2592207 2525514 2502582 2522038 2568323 2702780 2886789 2966654
19739 2966654 2959347 2998627 2990560 2822109 2526698 2266159 2028476 1720259 1451502 1235757
19729 1235757 1080444 974573 817180 738851 706171 662055 622139 605016 594265 581640 543011
19718 543011 500762 484055 492731 518627 468707 448786 409748 439167 493857 524851 507920 459177
19706 459177 429492 409263 388494 379531 374706 376299 359600 375168 396466 369667 353752 353424
19694 353424 321499 299560 260522 278032 317364 305250 325548 329340 328375 332153 266750 234673
$$ packed form
19770E36519m2834M0724K2749L5079j2009J8342M3302R2105J14910K12677K62711
19759A324275J91070J73521K83204L87009L36748J39402R7108J07216N5698p4999
19749C020252j38152j54963j34930o6693k2932J9456M6285J34457J84009P9865
19739B966654p307L9280q067j68451k95411k60539k37683l08217k68757k15745
19729A235757j55313j05871j57393p8329l2680m4116l9916j7123j0751j2625l8629
19718E43011m2249j6707Q676K5896m9920j9921l9038K9419N4690L0994j6931m8743
19706D59177k9685k0229k0769q963m825J593j6699J5568K1298k6799j5915l28
19694C53424l1925k1939l9038J7510L9332j2114K0298L792r65L778o5403l2077
$$ plain form
19682 234673 197886 181717 192521 245495 218488 219817 248336 238408 195149 200286 256676 293737
19670 293737 314887 319616 335583 293618 304947 328862 347834 345626 377516 352586 316599 301323
19658 301323 303048 283526 274678 333928 366348 352567 343939 325704 311618 317413 279968 306896
19646 306896 362010 396521 395057 380187 356222 361485 371532 383829 344094 294956 267363 277366
19634 277366 328319 345854 332502 283238 319942 327684 353799 392377 399140 365008 330769 289969
19622 289969 313034 339470 344105 336821 326399 347076 384219 363318 361933 353060 343164 368909
19610 368909 390459 362492 404897 427382 372393 360107 387585 390793 393787 394919 381880 392559
19598 392559 403808 372237 290806 249156 291148 325066 339419 385987 442646 497507 504494 526296
$$ packed form
19682B34673l6787j6169J0804N2974k7007J329K8519r928m3259N137N6390L7061
19670B93737K1150M729J5967m1965J1329K3915J8972k208L1890k4930l5987j5276
19658C01323J725j9522q848N9250L2420j3781q628j8235j4086N795l7445K6928
19646C06896N5114L4511j464j4870k3965N263J0047J2297l9735m9138k7593J0003
19634B77366N0953J7535j3352m9264L6704P742K6115L8578O763l4132l4239m0800
19622B89969K3065K6436M635p284j0422K0677L7143k0901j385q873r896K5745
19610C68909K1550k7967M2405K2485n4989j2286K7478L208K994J132j3039J0679
19598C92559J1249l1571q1431m1650M1992L3918J4353M6568N6659N4861O987K1802
$$ plain form
19586 526296 435950 384265 362200 340458 335501 353834 356378 386915 365732 299946 308203 335795
19574 335795 332084 331943 353740 367655 409763 432033 422238 431639 426205 432780 473614 441794 451147
19561 451147 469641 471858 494814 534761 569422 577679 550234 529104 554346 587518 582848 592369
19549 592369 668464 756073 915165 1087499 1197809 1330669 1461876 1638053 1816813 1996603
19539 1996603 2139336 2218712 2264601 2348670 2464619 2562807 2653677 2667723 2588654 2552961 2522394
19528 2522394 2550972 2677090 2759052 2809231 2778815 2689318 2629522 2685499 2709019 2593013 2398494
19517 2398494 2159916 1990427 1865153 1755651 1588167 1442738 1357218 1274599 1225041 1202260
19507 1202260 1203380 1201234 1167380 1126093 1104368 1083436 1042894 997905 979399 907956 858583 880220
$$ packed form
19586E26296r0346n1685k2065k1742m957J8333K544L0537k1183o5786Q257K7592
19574C35795l711j41K1797J3915M2108K2270r795R401n434O575M0834l1820R353
19561D51147J8494K217K2956L9947L4661Q257k7445k1130K5242L3172m670R521
19549E92369P6095Q7609J59092J72334J10310J32860J31207J76177J78760J79790
19539A996603J42733P9376M5889Q4069J15949R8188R0870J4046p9069l5693l0567
19528B522394K8578J26118Q1962N0179l0416q9497n9796N5977K3520j16006j94519
19517B398494k38578j69489j25274j09502j67484j45429q5520q2619m9558k2781
19507A202260J120k146l3854m1287k1725k0932m0542m4989j8506p1443m9373K1637
$$ plain form
19495 880220 846660 831338 822348 786334 797961 753525 710736 719395 741311 762318 721129 700593
19483 700593 688994 687953 723759 735044 695402 699543 792204 871020 886128 911012 984481 1053648
19471 1053648 1060113 1069958 1125289 1141917 1148744 1200178 1249226 1305824 1291703 1279921 1269349 1291822
19459 1291822 1364511 1467380 1584756 1722048 1815819 1895855 1920017 1913683 1900219 1891268 1823896
19448 1823896 1655855 1517697 1433448 1313566 1205253 1057574 956705 930771 886149 822792
19438 822792 849336 856435 815714 792720 784371 785430 779030 760203 754731 708987 737950 715254
19426 715254 691380 662371 651408 646743 630688 606184 632215 636583 608840 604601 605123 635724
19414 635724 653939 702720 756927 822288 899964 928624 980322 1062260 1146479 1241714 1221934
$$ packed form
19495H80220l3560j5322q990l6014J1627m4436m2789Q659K1916K1007m1189k0536
19483G00593j1599j041L5806J1285l9642M141R2661P8816J5108K4884P3469O9167
19471A053648O465R845N5331J6628O827N1434M9048N6598j4121j1782j0572K2473
19459A291822P2689J02869J17376J37292R3771Q0036K4162o334j3464q951o7372
19448A823896j68041j38158q4249j19882j08313j47679j00869k5934m4622o3357
19438H22792K6544P099m0721k2994q349J059o400j8827n472m5744K8963k2696
19426G15254k3874k9009j0963m665j6055k4504K6031M368k7743m239N22L0601
19414F35724J8215M8781N4207O5361P7676K8660N1698Q1938Q4219R5235j9780
$$ plain form
19403 1221934 1221975 1230732 1192037 1136120 1032261 896238 830405 718757 641017 611954 591018
19392 591018 583745 562202 469712 419201 412813 438079 405356 397987 448722 467576 445244 379432
19380 379432 326350 400588 491184 527934 597994 665502 721780 707746 765866 859593 914559
19369 914559 969899 929419 931388 919626 872225 830718 777200 729594 669078 657139 670738 712577
19357 712577 737362 703582 678077 702935 747679 778670 795065 773773 812471 869452 862198 871580
19345 871580 912915 937457 983000 1039535 1027672 1021218 1056476 1101309 1109860 1095310 1112945 1139262
19333 1139262 1129976 1120454 1117223 1152547 1200470 1318957 1343270 1376296 1390386 1434277 1513340 1518171
19321 1518171 1528972 1601012 1638124 1572817 1527522 1509584 1533126 1546037 1519813 1578656 1579374 1550047
$$ packed form
19403A221934M1Q757l8695n5917j03859j36023o5833j11648p7740k9063k0936
19392E91018p273k1543r2490n0511o388K5266l2723p369N0735J8854k2332o5812
19380C79432n3082P4238R0596L6750P0060O7508N6278j4034N8120R3727N4966
19369I14559N5340m0480J969j1762m7401m1507n3518m7606o0516j1939J3599M1839
19357G12577K4785l3780k5505K4858M4744L0991J6395k1292L8698N6981p254R382
19345H71580M1335K4542M5543N6535j1863o454L5258M4833Q551j4550J7635K6317
19333A139262r286r522l231L5324M7923J18487K4313L3026J4090M3891P9063M831
19321A518171J0801P2040L7112o5307m5295j7938K3542J2911k6224N8843P18k9327
$$ plain form
19309 1550047 1557667 1660462 1742803 1805966 1944078 2082143 2160887 2291299 2500152 2791469
19299 2791469 3084940 3389164 3690757 4069702 4433695 4664495 4799168 4959576 5093323
19290 5093323 5054494 4988284 4935051 4901621 4875110 4958082 5138822 5349745 5537204 5773490
19280 5773490 5868705 5939044 6016079 6086420 6003588 5843091 5660980 5546490 5351626 5153088
19270 5153088 5027090 4972933 4905313 4911225 4909629 4976437 5019102 5089444 5147435 5244133 5387332
19259 5387332 5475787 5609364 5722355 5836842 5991780 6144653 6358889 6565740 6792371 7019990
19249 7019990 7296024 7597669 7974700 8473998 9016729 9663548 10436649 11267319 12281598
19240 12281598 13484363 14735518 15989270 17380223 18934232 20556676 22322652 24330117
$$ packed form
19309A550047P620J02795Q2341O3163J38112J38065P8744J30412K08853K91317
19299B791469K93471L04224L01593L78945L63993K30800J34673J60408J33747
19290E093323l8829o6210n3233l3430k6511Q2972J80740K10923J87459K36286
19280E773490R5215P0339P7035P0341q2832j60497j82111j14490j94864j98538
19270E153088j25998n4157o7620N912j596O6808M2665P0342N7991R6698J43199
19259E387332Q8455J33577J12991J14487J54938J52873K14236K06851K26631K27619
19249G019990K76034L01645L77031M99298N42731O46819P73101Q30670J014279
19240A2281598J202765J251155J253752J390953J554009J622444J765976K007465
$$ plain form
19232 24330117 26623029 29277431 32659966 36792328 41843030 48457376 57417488 69621268
19224 69621268 86473197 110328460 143423530 185238388 230431280 276679472 331017622
19217 331017622 394507002 446171994 469736448 483062614 500168012 504878095 481021288
19210 481021288 447400411 423535115 409993109 401817878 399501101 405564207 427015205
19203 427015205 463901475 495382765 503329041 502693140 506677143 499140900 462116228 411296355
19195 411296355 363839269 318746970 271111531 225935147 188307629 158886119 136169926
19188 136169926 118798376 105635059 95795052 88495066 82840763 78102932 74193063 71091801
19180 71091801 68578627 66254738 63955015 61758265 59655255 57591234 55432119 53225339
$$ packed form
19232B4330117K292912K654402L382535M132362N050702O614346Q960112J2203780
19224F9621268J6851929K3855263L3095070M1814858M5192892M6248192N4338150
19217C31017622O3489380N1664992K3564454J3326166J7105398M710083k3856807
19210D81021288l3620877k3865296j3542006q175231k316777O063106K1450998
19203D27015205L6886270L1481290P946276o35901L984003p536243l7024672n0819873
19195D11296355m7457086m5092299m7635439m5176384l7627518k9421510k2716193
19188A36169926j7371550j3163317r840007p299986n654303m737831l909869l101262
19180G1091801k513174k323889k299723k196750k103010k064021k159115k206780
$$ plain form
19172 53225339 51128813 49210809 47463354 45795765 44257296 42916738 41735267 40625303
19164 40625303 39420762 38190455 37024537 35759036 34341814 32854981 31366831 29886294
19156 29886294 28382703 26916854 25515747 24187525 22988972 21816517 20632406 19480116
19148 19480116 18432937 17486262 16624208 15785065 14975471 14219369 13532210 12842154 12212441
19139 12212441 11631645 11058191 10552172 10082739 9625820 9209722 8784526 8351276 7901982
19130 7901982 7487850 7138106 6801279 6471660 6180052 5886610 5617867 5361987 5116209
19121 5116209 4880246 4671470 4466715 4234383 4024417 3805012 3602112 3449378 3320404
19112 3320404 3128548 3011626 2919780 2789886 2726757 2650186 2567725 2535299 2499139 2436990 2391196
$$ packed form
19172E3225339k096526j918004j747455j667589j538469j340558j181471j109964
19164D0625303j204541j230307j165918j265501j417222j486833j488150j480537
19156B9886294j503591j465849j401107j328222j198553j172455j184111j152290
19148A9480116j047179r46675q62054q39143q09594p56102o87159o90056o29713
19139A2212441n80796n73454n06019m69433m56919m16098m25196m33250m49294
19130G901982m14132l49744l36827l29619k91608k93442k68743k55880k45778
19121E116209k35963k08776k04755k32332k09966k19405k02900j52734j28974
19112C320404j91856j16922r1846j29894o3129p6571q2461l2426l6160o2149m5794
$$ plain form
19101 2391196 2345930 2304836 2260268 2217695 2199903 2210051 2201266 2192769 2223481 2247314 2261827 2286232
19089 2286232 2285268 2273851 2243612 2218620 2199692 2159695 2081095 2029549 2013264 1987418 1950962 1901298
19077 1901298 1866459 1757784 1663503 1617191 1571159 1501920 1446763 1367621 1278331 1214040 1094551
19066 1094551 963656 907926 870118 812990 715038 668477 673387 621661 588164 612799 575284
19055 575284 599265 644730 647484 678372 661274 642654 622179 680840 709271 724164 738176 796763
19043 796763 855995 906697 921772 961286 1003378 1007866 1048336 1114028 1131603 1176704 1228208 1261885
19031 1261885 1328716 1369551 1373395 1375380 1394267 1394342 1424384 1435574 1401458 1376192 1305128 1314838
19019 1314838 1305310 1242961 1257142 1269014 1255481 1204016 1178060 1166496 1126348 1093881 1038311
$$ packed form
19101B391196m5266m1094m4568m2573j7792J0148q785q497L0712K3833J4513K4405
19089B286232r64j1417l0239k4992j8928l9997p8600n1546j6285k5846l6456m9664
19077A901298l4839j08675r4281m6312m6032o9239n5157p9142q9290o4291j19489
19066A094551j30895n5730l7808n7128r7952m6561M910n1726l3497K4635l7515
19055E75284K3981M5465K754L0888j7098j8620k0475N8661K8431J4893J4012N8587
19043G96763N9232N0702J5075L9514M2092M488M0470O5692J7575M5101N1504L3677
19031A261885O6831M0835L844J985J8887P5L0042J1190l4116k5266p1064R710
19019A314838r528o2349J4181J1872j3533n1465k5956j1564m0148l2467n5570
$$ plain form
19008 1038311 1008161 1043214 1060416 1024159 1010371 993447 967229 964039 907297 866907 830636
18997 830636 783779 689591 687656 716979 710129 636496 628292 615957 619620 656326 676764 633103
18985 633103 634322 612958 595083 536152 475602 489979 494360 491076 520637 564305 544928 552291
18973 552291 554571 478817 486453 499817 490280 459051 496266 522684 527123 562340 550298 521559
18961 521559 498019 473790 474128 497381 519816 531697 519628 478078 488444 491777 520935 526009
18949 526009 463199 436490 403510 381514 379754 341569 295449 283454 298443 274083 234309 230600
18937 230600 232013 223611 213708 270683 269288 236967 159342 85400 69309 91439 131885 168848
18925 168848 135230 92398 67277 60634 33733 55866 89704 117821 93488 102980 90668 39508
$$ packed form
19008A038311l0150L5053J7202l6257j3788j6924k6218l190n6742m0390l6271
18997H30636m6857r4188j935K9323o850p3633q204j2335L663L6706K0438m3661
18985F33103J219k1364j7875n8931o0550J4377M381l284K9561M3668j9377P363
18973E52291K280p5754P636J3364r537l1229L7215K6418M439L5217j2042k8739
18961E21559k3540k4229L38K3253K2435J1881j2069m1550J0366L333K9158N074
18949E26009o2810k6709l2980k1996j760l8185m6120j1995J4989k4360l9774l709
18937B30600J413q402r903N6975j395l2321p7625p3942j6091K2130M0446L6963
18925A68848l3618m2832k5121o643k6901K2133L3838K8117k4333R492j2312n1160
$$ plain form
18913 39508 72140 140006 167805 168168 200975 222991 242559 287034 331955 403484 499129 620594
18901 620594 741565 862367 989840 1080871 1105569 1145268 1134251 1101898 970444 846539
18891 846539 782588 788403 850643 916774 1009159 1180982 1304724 1462662 1619592 1661201 1642976
18880 1642976 1588963 1471523 1335727 1150118 994455 900116 829868 747979 685588 650605
18870 650605 620714 526189 421364 432098 433390 445982 424298 398971 437707 476478 427890
18859 427890 409015 370550 375104 344061 278356 292321 322828 334814 309205 298587 296478 352354
18847 352354 379446 317209 293200 340298 355701 345561 337999 325987 360730 441285 475132 465694
18835 465694 442375 469181 503453 558784 592723 688152 760144 773500 658575 598837 662656
$$ packed form
18913C9508L2632O7866K7799L63L2807K2016J9568M4475M4921P1529R5645J21465
18901F20594J20971J20802J27473R1031K4698L9699j1017l2353j31454j23905
18891H46539o3951N815O2240O6131R2385J71823J23742J57938J56930M1609j8225
18880A642976n4013j17440j35796j85609j55663r4339p0248q1889o2391l4983
18870F50605k9891r4525j04825J0734J292J2592k1684k5327L8736L8771m8588
18859D27890j8875l8465M554l1043o5705J3965L0507J1986k5609j0618k109N5876
18847C52354K7092o2237k4009M7098J5403j0140p562j2012L4743Q0555L3847r438
18835D65694k3319K6806L4272N5331L3939R5429P1992J3356j14925n9738O3819
$$ plain form
18824 662656 685920 720581 764528 849309 820463 742480 690789 687956 664648 668988 696064 704395
18812 704395 671166 650220 608270 559652 523756 520365 576838 575937 506028 426773 316197 236891
18800 236891 233525 248143 267195 277830 269930 205213 154716 113812 98075 109836 132793 82633
18788 82633 46025 57325 79977 60943 33821 41263 70405 58158 24980 79603 87667 55321
18776 55321 59824 99921 115332 85085 130934 186027 212233 222658 283213 381749 387451 328176
18764 328176 302742 247694 207973 179020 152619 124126 94598 68300 68709 74642 45979 55283
18752 55283 39051 53526 70897 95782 93503 99161 121669 130031 146093 170586 181652 137926
18740 137926 72796 64029 115409 148696 206733 278581 300884 281467 307311 365467 427006 483968
$$ packed form
18824F62656K3264L4661M3947Q4781k8846p7983n1691k833k3308M340K7076Q331
18812G04395l3229k0946m1950m8618l5896l391N6473r01o9909p9255j10576p9306
18800B36891l366J4618J9052J0635p900o4717n0497m0904j5737J1761K2957n0160
18788H2633l6608J1300K2652j9034k7122P442K9142j2247l3178N4623Q064l2346
18776E5321M503M0097J5411l0247M5849N5093K6206J0425O0555R8536N702n9275
18764C28176k5434n5048l9721k8953k6401k8493k9528k6298M09N933k8663R304
18752E5283j6232J4475J7371K4885k279N658K2508Q362J6062K4493J1066m3726
18740A37926o5130q767N1380L3287N8037P1848K2303j9417K5844N8156O1539N6962
$$ plain form
18728 483968 567023 563216 531603 501456 488074 446983 438742 397371 324899 263778 225375 211842
18716 211842 179029 162580 162526 172012 161123 176585 159267 145004 141064 174610 168203 142845 139326
18703 139326 129742 114688 133787 167867 166969 162213 170220 168702 148254 114657 142660 171443 178844
18690 178844 120062 110619 102342 138297 166012 189301 230315 329115 398750 415019 499481 644708
18678 644708 777873 912306 1118755 1390516 1628882 1908571 2207687 2500662 2664060 2733395
18668 2733395 2821367 2842961 2696072 2497117 2370914 2340909 2330343 2318965 2296045 2345326 2500594
18657 2500594 2681921 2773304 2825407 2813387 2742118 2538099 2258748 1986435 1749628 1515447
18647 1515447 1268374 1044877 864455 761706 642647 538123 397686 371630 376679 388545
$$ packed form
18728D83968Q3055l807l1613l0147j3382m1091q241m1371p2472o1121l8403j3533
18716B11842l2813j6449n4R486j0889J5462j7318j4263l940L3546o407k5358l519
18703A39326r584j5054J9099L4080q98m756Q007j518k0448l3597K8003K8783P401
18690A78844n8782r443q277L5955K7715K3289M1014R8800O9635J6269Q4462J45227
18678F44708J33165J34433K06449K71761K38366K79689K99116K92975J63398O9335
18668B733395Q7972K1594j46889j98955j26203l0005j0566j1378k2920M9281J55268
18657B500594J81327R1383N2103j2020p1269k04019k79351k72313k36807k34181
18647A515447k47073k23497j80422j02749j19059j04524j40437k6056N049J1866
$$ plain form
18637 388545 407350 372439 342883 359251 370949 311114 257033 271496 306666 295162 272433
18626 272433 228654 242895 252803 249735 225712 203832 210283 201151 194399 163011 177527 217398
18614 217398 252036 194970 189621 173984 169173 154424 115907 92513 121538 129752 91367 36216
18602 36216 86693 109680 122319 100963 109437 146576 119341 113517 59983 27394 36266 120809
18590 120809 119086 87144 32397 -38286 -29696 -4956 7086 22375 22986 -30420 -47791 -63291
18578 -63291 -35292 -13639 -52675 -52713 -30005 16821 51123 52351 22693 32336 59020 23835 18823
18565 18823 61045 41792 9841 32638 37271 22528 44635 77011 63895 89595 100309 77310
18553 77310 48480 14711 -37509 -25921 -2293 -35752 -7823 16841 61427 53099 51565 47723
$$ packed form
18637C88545J8805l4911k9556J6368J1698n9835n4081J4463L5170j1504k2729
18626B72433m3779J4241R908l068k4023k1880O451r132o752l1388J4516L9871
18614B17398L4638n7066n349j5637m811j4749l8517k3394K9025Q214l8385n5151
18602C6216N0477K2987J2639k1356Q474L7139k7235n824n3534l2589Q872Q4543
18590A20809j723l1942n4747p0683Q590K4740J2042J5289O11n3406j7371j5500
18578f3291K7999K1653l9036l8K2708M6826L4302J228k9658R643K6684l5185n012
18565A8823M2222j9253l1951K2797M633j4743K2107L2376j3116K5700J0714k2999
18553G7310k8830l3769n2220J1588K3628l3459K7929K4664M4586q328j534l842
$$ plain form
18541 47723 57368 83563 85274 71485 94630 90552 78595 29769 -27103 -49271 7173 -15311
18529 -15311 -2696 -35169 -62886 -44364 -93451 -67181 -7312 4607 44647 55133 25073 -15837
18517 -15837 -15718 28711 39686 13038 -10912 12279 28110 76577 56733 80321 80693 91455
18505 91455 87427 24781 45285 46263 34291 32908 10645 42555 88480 63882 44844 57636
18493 57636 67325 54872 97606 111247 53991 36479 55656 56813 58067 53876 45606 51617 64918
18480 64918 48053 -35388 -81045 -3560 56724 22235 -16903 -22604 8554 27954 11152 41710
18468 41710 61104 -2716 -14955 6433 -2368 9082 36437 30816 25365 29601 48414 100055
18456 100055 140927 137743 85602 114559 65930 14141 -13922 -29224 -43286 -12849 11288 8527
$$ packed form
18541D7723R645K6195J711j3789K3145m078j1957m8826n6872k2168N6444k2484
18529a5311J2615l2473k7717J8522m9087K6270N9869J1919M0040J0486l0060m0910
18517a5837J19M4429J0975k6648k3950K3191J5831M8467j9844K3588L72J0762
18505I1455m028o2646K0504R78j1972j383k2263L1910M5925k4598j9038J2792
18493E7636R689j2453M2734J3641n7256j7512J9177J157J254m191q270O011J3301
18480F4918j6865q3441m5657P7485O0284l4489l9138n701L1158J9400j6802L0558
18468D1710J9394o3820j2239K1388q801J1450K7355n621n451M236J8813N1641
18456A00055M0872l184n2141K8957m8629n1789k8063j5302j4062L0437K4137k761
$$ plain form
18444 8527 33712 36467 70851 97491 62718 43584 51746 17873 36349 40704 29649 -4262
18432 -4262 -4034 -4150 25014 60222 55168 13904 -20934 -20421 -31817 -30158 -44692 430 20218
18419 20218 27115 75247 97980 96284 107192 98068 119237 144382 162031 120248 47026 50735
18407 50735 98073 106558 102591 103374 86055 38985 60032 78359 103734 108326 74934 117869 112081
18394 112081 76250 64631 83238 74959 82286 101155 68568 29872 22859 4269 2436 10224
18382 10224 -37445 -28435 -9412 30810 11949 53610 35788 4672 48183 48553 45010 56717
18370 56717 66543 56497 27265 44273 50790 27877 65762 101043 99918 89197 95458 56429
18358 56429 -10425 -27237 13301 51955 56166 39490 24520 27737 51824 66182 85749 47749
$$ packed form
18444H527K5185K755L4384K6640l4773j9134Q162l3873J8476M355j1055l3911
18432d262K28j16K9164L5208n054m1264l4838N13j1396J659j4534M5122J9788
18419B0218O897M8132K2733j696J0908r124K1169K5145J7649m1783p3222L709
18407E0735M7338Q485l967P83j7319m7070K1047J8327K5375M592l3392M2935n788
18394A12081l5831j1619J8607q279P327J8869l2587l8696p013j8590j833P788
18382A0224m7669R010J9023M0222j8861M1661j7822l1116M3511L70l543J1707
18370E6717R826j0046k9232J7008O517k2913L7885L5281j125j0721O261l9029
18358E6429o6854j6812M0538L8654M211j6676j4970L217K4087J4358J9567l8000
$$ plain form
18346 47749 62352 91285 72253 46 -2495 -6658 54995 80583 71201 72348 60656 47780
18334 47780 34872 41468 53765 102925 114715 125653 126347 122858 63047 50725 90853 62656
18322 62656 121897 158808 166723 138584 111005 112944 142306 159219 134039 108433 123140 123901
18310 123901 134551 162312 189564 198130 195003 236766 299126 320896 277498 208660 202797 203748
18298 203748 208687 169736 216538 220664 184170 196186 248033 256828 203206 240238 310478 353702
18286 353702 363472 335706 350847 387520 380394 352031 309258 276859 307564 346531 335187 342033
18274 342033 315132 284361 302186 229476 210132 237682 247898 187554 163591 169702 166780 222306
18262 222306 313424 373423 430517 498645 538382 570537 605665 592182 542976 550502 565094 514176
$$ packed form
18346D7749J4603K8933j9032p2207k541m163O1653K5588r382J147j1692j2876
18334D7780j2908O596J2297M9160J1790J0938O94l489n9811j2322M0128k8197
18322F2656N9241L6911P915k8139k7579J939K9362J6913k5180k5606J4707P61
18310A23901J0650K7761K7252Q566l127M1763O2360K1770m3398o8838n863R51
18298B03748M939l8951M6802M126l6494J2016N1847Q795n3622L7032P0240M3224
18286C53702R770k7766J5141L6673p126k8363m2773l2399L0705L8967j1344O846
18274C42033k6901l0771J7825p2710j9344K7550J0216o0344k3963O111k922N5526
18262B22306R1118N9999N7094O8128L9737L2155L5128j3483m9206P526J4592n0918
$$ plain form
18250 514176 462994 431986 425462 458754 445531 435104 397738 347661 317143 324415 293936 336677
18238 336677 369472 406939 412288 387478 431813 478000 492053 513537 505917 458175 448551 416491
18226 416491 339618 326918 308107 307112 301803 316372 332192 313861 289408 311976 352668 364803
18214 364803 319661 255404 279059 327242 359580 384437 476723 551458 616852 644369 664566
18203 664566 611980 516332 396041 313265 306704 302637 283901 227522 224983 262630 252202 258504
18191 258504 305762 287740 294513 311265 266215 224057 229767 235386 212343 223629 225923 226552 188680
18178 188680 186584 204337 199931 227249 245140 191834 146279 133107 139131 132721 123365 153391
18166 153391 151588 136159 179967 264619 329899 288599 304361 358219 365134 314050 285595 307306
$$ packed form
18250E14176n1182l1008o524L3292j3223j0427l7366n0077l0518P272l0479M2741
18238C36677L2795L7467N349k4810M4335M6187J4053K1484p620m7742r624l2060
18226D16491p6873j2700j8811r95n309J4569J5820j8331k4453K2568M0692J2135
18214C64803m5142o4257K3655M8183L2338K4857R2286P4735O5394K7517K0197
18203F64566n2586r5648j20291q2776o561m067j8736n6379k539L7647j0428O302
18191B58504M7258j8022O773J6752m5050m2158N710N619k3043J1286K294O29l7872
18178A88680k096J7753m406K7318J7891n3306m5555j3172O024o410r356L0026
18166A53391j803j5429M3808Q4652O5280m1300J5762N3858O915n1084k8455K1711
$$ plain form
18154 307306 310784 358465 355025 365622 368388 380114 408931 423697 413334 376446 376397 398353 433333
18141 433333 447564 435861 409610 399307 417952 476838 509816 515295 543756 581341 620339 705769
18129 705769 814262 891775 1021648 1157056 1292701 1415883 1552820 1734000 2015938 2455610
18119 2455610 2954467 3476293 4256046 5376553 6963252 9277937 12772860 18069409 26083310
18110 26083310 38219962 54461742 66923631 64677607 53159672 41386358 31658016
18103 31658016 23401587 17279370 13177559 10441667 8594310 7219210 6123476 5260541
18095 5260541 4607470 4154316 3767092 3445380 3220302 3061694 2869886 2737937 2604885
18086 2604885 2506757 2481666 2487909 2492254 2539951 2608445 2629402 2518744 2384900 2298970 2243477
$$ packed form
18154C07306L478M7681l440J0597K766J1726K8817J4766j0363l6888m9K1956L4980
18141D33333J4231j1703k6251j0303J8645N8886L2978N479K8461L7585L8998Q5430
18129G05769J08493P7513J29873J35408J35645J23182J36937J81180K81938M39672
18119B455610M98857N21826P79753J120507J586699K314685L494923N296549Q013901
18110B6083310J2136652J6241780J2461889k246024j1517935j1773314r728342
18103C1658016q256429o122217m101811k735892j847357j375100j095734q62935
18095E260541o53071m53154l87224l21712k25078j58608j91808j31949j33052
18086B604885r8128k5091O243M345M7697O8494K0957j10658j33844q5930n5493
$$ plain form
18075 2243477 2236431 2266480 2279830 2294162 2319326 2279305 2206293 2109471 2006810 1909870 1777112
18064 1777112 1625217 1595316 1554581 1498455 1456207 1357427 1308873 1283939 1279801 1254360 1211631
18053 1211631 1102369 972129 882487 821964 795831 779087 783829 726862 635977 658938 665865
18042 665865 593846 525451 532041 501077 413769 391389 402076 417003 398763 366688 326367 287962
18030 287962 253261 236984 226157 237906 239937 254059 228391 186112 222774 271473 324115 315509
18018 315509 267286 198878 178562 195270 243183 285953 337373 351135 423101 460689 437540
18007 437540 448639 417366 379342 272988 215004 222773 239171 227855 188635 189688 178506 162119
17995 162119 130952 65245 71469 72664 53669 133203 143559 118575 133663 143609 119445 124072
$$ packed form
18075B243477p046L0049J3350J4332K5164m0021p3012r6822j02661r6940j32758
18064A777112j51895k9901m0735n6126m2248r8780m8554k4934m138k5441m2729
18053A211631j09262j30240q9642o0523k6133j6744M742n6967r0885K2961O927
18042F65865p2019o8395O590l0964q7308k2380J0687J4927j8240l2075m0321l8405
18030B87962l4701j6277j0827J1749K031J4122k5668m2279L6662M8699N2642q606
18018C15509m8223o8408k0316J6708M7913M2770N1420J3762P1966L7588k3149
18007D37540J1099l1273l8024j06354n7984P769J6398j1316l9220J053j1182j6387
17995A62119l1167o5707O224J195j8995P9534J0356k4984J5088R946k4164M627
$$ plain form
17983 124072 147756 130277 148307 170168 198533 172399 170022 167557 147976 131825 122968 155717
17971 155717 134598 160906 158442 157157 158921 158430 161692 181440 164918 177427 232114 206001 160636
17958 160636 112994 105968 120221 124620 116289 100492 57885 44577 26515 18763 27665 37173 6968
17945 6968 15970 54672 79697 96230 138842 101062 9883 3300 19310 74818 49381 65342
17933 65342 89445 77639 52089 77967 121373 112056 132150 127768 129589 147183 133501 109509
17921 109509 81808 87023 90950 67212 88056 56217 26932 5244 25450 69777 82829 65156
17909 65156 40718 59469 99609 92985 81659 27650 40537 63212 27871 -15189 -11057 19681
17897 19681 42407 69464 74810 33398 40219 28539 39255 71827 72055 37481 73266 97408
$$ packed form
17983A24072K3684j7479J8030K1861K8365k6134k377k465j9581j6151q857L2749
17971A55717k1119K6308k464j285J764m91L262J9748j6522J2509N4687k6113m5365
17958A60636m7642p026J4253M399q331j5797m2607j3308j8062p752Q902R508l0205
17945F968R002L8702K5025J6533M2612l7780r1179o583J6010N5508k5437J5961
17933F5342K4103j1806k5550K5878M3406r317K0094m382J821J7594j3682k3992
17921A09509k7701N215L927k3738K0844l1839k9285k1688K0206M4327J3052j7673
17909F5156k4438J8751M0140o624j1326n4009J2887K2675l5341m3060M132L0738
17897A9681K2726K7057N346m1412O821j1680J0716L2572K28l4574L5785K4142
$$ plain form
17885 97408 99452 136366 168139 171893 214479 238924 235868 212775 167772 131225 105764 52041
17873 52041 43769 10735 5101 63089 42901 32679 40952 5963 95 -20828 -13812 -29384 -22444
17860 -22444 -7996 14141 -9314 -3327 24471 10603 -28608 -11860 -3618 -1202 21697 25374
17848 25374 34044 43682 36326 58943 29950 39739 84418 107427 104320 102528 57688 7469 23777
17835 23777 3027 -79806 -82482 -43104 -33663 8671 29999 59106 49402 38793 70573 120744
17823 120744 114255 133761 227874 366563 464962 510926 531022 518012 475188 437734 423447
17812 423447 492584 586752 660657 673397 634169 600581 473781 343315 279143 208839 153187
17801 153187 175438 225231 215809 226158 237190 209284 159708 139940 107503 94225 66094 56385
$$ packed form
17885I7408K044L6914L1773L754M2586K4445l056k3093m5003l6547k5461n3723
17873E2041q272l3034n634N7988k0188j0222Q273l4989n868k0923P016j5572O940
17860b2444J4448K2137k3455N987K7798j3868l9211J6748Q242K416K2899L677
17848B5374Q670R638p356K2617k8993R789M4679K3009l107j792m4840n0219J6308
17835B3777k0750q2833k676L9378R441M2334K1328K9107r704j0609L1780N0171
17823A20744o489J9506R4113J38689R8399M5964K0096j3010m2824l7454j4287
17812D23447O9137R4168P3905J2740l9228l3588j26800j30466o4172p0304n5652
17801A53187K2251M9793r422J0349J1032k7906m9576j9768l2437j3278k8131r709
$$ plain form
17789 56385 64344 99452 90872 57680 49214 54558 64595 71884 104711 60323 36502 81509 94783
17776 94783 99293 189880 214477 228664 228880 254348 245887 243199 255207 237219 252541 315857 376254
17763 376254 457771 496298 456208 474731 500708 466440 461395 551194 565196 476993 424994 376782
17751 376782 353374 359811 324218 294164 231222 181659 140438 88773 119680 109845 105388 128388
17739 128388 174174 191667 133742 88140 140890 196081 235205 206570 167225 208263 231170
17728 231170 235554 248127 177757 122674 112534 146217 121248 65302 73016 92793 103375 107575
17716 107575 113987 74152 68036 43891 -3646 6390 40857 52709 -13500 -34244 -33072 6877
17704 6877 10450 4881 4314 27660 42572 62181 111527 147451 185675 215729 159577 116797 73330
$$ packed form
17789E6385P959L5108q580l3192q466N344J0037P289L2827m4388k3821M5007J3274
17776I4783M510R0587K4597J4187K16K5468q461k688J2008j7988J5322O3316O0397
17763C76254Q1517L8527m0090J8523K5977l4268n045Q9799J4002q8203n1999m8212
17751C76782k3408O437l5593l0054o2942m9563m1221n1665L0907r835m457K3000
17739A28388M5786J7493n7925m5602N2750N5191L9124k8635l9345M1038K2907
17728B31170M384J2573p0370n5083j0140L3683k4969n5946P714J9777J0582M200
17716A07575O412l9835o116k4145m7537J0036L4467J1852o6209k0744J172L9949
17704F877L573n569n67K3346J4912J9609M9346L5924L8224L0054n6152m2780m3467
$$ plain form
17691 73330 18481 20326 42018 22704 -14160 -18110 3029 80422 152200 179915 154161 125992
17679 125992 141684 192341 196667 164656 128829 101090 64441 61786 59810 1446 2842 -567
17667 -567 -29461 -37406 -37626 -57058 -48120 -29678 27102 45182 24432 8195 -9318 -37119 -39328
17654 -39328 -39116 -29015 23680 61293 51935 2625 12587 55805 34606 13282 26500 20604 -39253
17641 -39253 -65108 -43965 -35676 -24849 -79216 -87288 -93282 -68092 1114 -586 4251 27192 26176
17628 26176 10328 11878 37845 42609 35582 52416 59499 81685 28281 5912 -6887 14430
17616 14430 46934 62610 60708 42915 15161 -7919 -45360 -34287 -28459 -2185 -2276 -30121 -64133
17603 -64133 -54564 -14925 -54160 -63009 -38231 -15041 -11798 9054 5592 -21040 -10541 -38735
$$ packed form
17691G3330n4849J845K1692j9314l6864l950K1139P7393P1778K7715k5754k8169
17679A25992J5692N0657M326l2011l5827k7739l6649k655j976n8364J396l409
17667e67k8894p945k20j9432Q938J8442N6780J8080k0750j6237j7513k7801k209
17654c9328K12J0101N2695L7613r358m9310R962M3218k1199k1324J3218n896n9857
17641c9253k5855K1143Q289J0827n4367q072n994K5190O9206j700M837K2941j016
17628B6176j5848J550K5967M764p027J6834P083K2186n3404k2369j2799K1317
17616A4430L2504J5676j902j7793k7754k3080l7441J1073N828K6274r1k7845l4012
17603f4133R569L9639l9235q849K4778K3190L243K0852l462k6632J0499k8194
$$ plain form
17591 -38735 -45293 -47910 -15163 14656 -68 29926 31328 -7557 -29356 -15201 -18596 -34607
17579 -34607 -64001 -68216 -58399 -65709 -65107 -20200 -18750 -16122 -16296 12384 2215 -5403 -19687 -49767
17565 -49767 -34805 -25746 -47245 -37605 -2719 -6142 -23026 -71055 -62754 -22116 -11209 55634
17553 55634 83800 76884 89810 152571 132279 113086 96441 120677 149702 179164 205789 234981
17541 234981 210271 154975 79945 82528 122019 209454 264354 342961 376948 349560 328476 284833
17529 284833 252080 182217 95797 64619 77018 37802 4383 -21855 -776 -18339 -66880
17518 -66880 -20870 -49513 -61104 -36826 -10744 -20092 -12782 9123 -18000 -2851 -18029 -39050
17506 -39050 -4582 11452 32983 21410 -2782 -12686 11691 2244 8382 48276 76141 48449
$$ packed form
17591c8735o558k617L2747K9819j4724K9994J402l8885k1799J4155l395j6011
17579c4607k9394m215R817p310O02M4907J450K628j74K8680j0169p618j4284l0080
17565d9767J4962R059k1499R640L4886l423j6884m8029Q301M0638J0907O6843
17553E5634K8166o916J2926O2761k0292j9193j6645K4236K9025K9462K6625K9192
17541B34981k4710n5296p5030K583L9491Q7435N4900P8607L3987k7388k1084m3643
17529B84833l2753o9863q6420l1178J2399l9216l3419k6238K1079j7563m8541
17518f6880M6010k8643j1591K4278K6082r348P310K1905k7123J5149j5178k1021
17506c9050L4468J6034K1531j1573k4192r904K4377r447O138L9894K7865k7692
$$ plain form
17494 48449 35045 -8903 -25646 26686 22233 -1039 -8653 -27604 -57477 -66246 -84719 -62897
17482 -62897 -31243 -62625 -61994 -56724 -48748 -38050 -5136 -28039 -63998 -74823 -80722 -90437 -88939
17469 -88939 -83853 -64644 -31313 -23499 26993 48353 79984 33876 -4802 13677 66763 51688
17457 51688 36827 11718 -2596 437 -697 23069 20661 7949 20888 28185 42846 115384
17445 115384 144259 190626 215759 270200 291455 249815 185462 145874 120984 94341 85058 72384
17433 72384 38936 -3041 25114 74660 25942 15059 22024 10406 12618 31666 18159 -6803
17421 -6803 -61015 -91363 -70666 -28900 1220 11464 70839 120341 114114 113847 69390 82934
17409 82934 106432 87504 68889 69508 65205 105136 122794 175325 164741 108300 78353 47322
$$ packed form
17494D8449j3404m3948j6743N2332m453k3272p614j8951k9873q769j8473K1822
17482f2897L1654l1382O31N270P976J0698L2914k2903l5959j0825n899r715J498
17469h8939N086J9209L3331P814N0492K1360L1631m6108l8678J8479N3086j5075
17457E1688j4861k5109j4314L033j134K3766k408j2712J2939P297J4661P2538
17445A15384K8875M6367K5133N4441K1255m1640o4353l9588k4890k6643r283j2674
17433G2384l3448m1977K8155M9546m8718j0883O965j1618K212J9048j3507k4962
17421f803n4212l0348K0697M1766L0120J0244N9375M9502o227k67m4457J3544
17409H2934K3498j8928j8615O19m303L9931J7658N2531j0584n6441k9947l1031
$$ plain form
17397 47322 24225 -12320 -21358 -16776 23943 89040 96723 116646 163429 234490 266940 259328
17385 259328 279179 268391 199736 153550 105045 42906 30900 74000 68216 42945 -21149 -67420
17373 -67420 -27673 -19996 2883 16187 -25597 -34971 -31000 -35084 -30177 -29252 -34661 -81887 -98251
17360 -98251 -114923 -106858 -53109 -38432 -3233 12031 12935 7848 3550 -25270 -68517 -53561 12776
17347 12776 28579 17213 32703 17293 -6156 15237 -22247 -16259 -226 11987 8539 26483
17335 26483 13344 -36411 -13909 -29887 -9986 -3084 2794 -24382 -77663 -83710 -64547 -37716
17323 -37716 -46727 -33445 -67086 -77256 -10731 14243 -11701 -44495 -46804 -49526 -99705 -88048
17311 -88048 -99391 -76075 9143 74852 95594 86215 18077 -27384 -21047 -31424 -58889 -17254
$$ packed form
17397D7322k3097l6545r038M582M0719O5097P683J9923M6783P1061L2450p612
17385B59328J9851j0788o8655m6186m8505o2139j2006M3100n784k5271o4094m6271
17373f7420L9747P677K2879J3304m1784r374L971m084M907R25n409m7226j6364
17360i8251j6672Q065N3749J4677L5199J5264R04n087m298k8820m3247J4956O6337
17347A2776J5803j1366J5490j5410k3449K1393l7484N988J6033J2213l448J7944
17335B6483j3139m9755K2502j5978J9901O902N878k7176n3281o047J9163K6831
17323c7716r011J3282l3641j0170O6525K4974k5944l2794k309k722n0179J1657
17311h8048j1343K3316Q5218O5709K0742r379o8138m5461O337j0377k7465M1635
$$ plain form
17299 -17254 34331 39916 15823 -9676 -11504 -15641 6954 42491 -1672 -28967 -6795 -32000
17287 -32000 -48929 -81935 -60386 -27393 -16058 -59011 -48829 -5146 -29540 -87516 -103470 -74270
17275 -74270 -103712 -71375 -63213 -81642 -112432 -95329 -33754 -37873 -28167 -41587 11297 4652
17263 4652 -20547 -29772 -7281 683 -14146 5158 13753 -31412 -45364 -25467 -26275 -35749 -29417
17250 -29417 -24505 -35497 -62835 -85318 -97886 -72020 -84709 -58336 -61206 -46059 -52794 -70049
17238 -70049 -44824 -36533 -51530 -37778 -38377 5886 -1508 -27148 -42811 -28708 3735 14155
17226 14155 9654 13092 3691 -1111 -14632 -54439 -93719 -66499 -46791 -22986 5435 7465 -48992
17213 -48992 -79811 -97271 -94110 -20264 -28021 -77830 -77977 -46468 26608 68406 116027 150163
$$ packed form
17299a7254N1585N585k4093k5499j828m137K2595L5537m4163k7295K2172k5205
17287c2000j6929l3006K1549L2993J1335m2953J0182M3683k4394n7976j5954K9200
17275g4270k9442L2337Q162j8429l0790J7103O1575m119R706j3420N2884o645
17263D652k5199r225K2491P964j4829J9304Q595m5165j3952J9897q08r474O332
17250b9417M912j0992k7338k2483j2568K5866j2689K6373k870J5147o735j7255
17238g0049K5225Q291j4997J3752n99M4263p394k5640j5663J4103L2443J0420
17226A4155m501L438r401m802j3521l9807l9280K7220J9708K3805K8421K030n6457
17213d8992l0819j7460L161P3846p757m9809j47L1509P3076M1798M7621L4136
$$ plain form
17201 150163 211809 241612 187523 187747 207869 207797 193711 182725 179187 151476 191279 216515 197346
17188 197346 111982 75243 36222 66706 47533 9300 19887 31832 31353 41630 13878 -13288
17176 -13288 -13695 29182 88183 68496 83189 71509 21736 7865 -30694 -49337 36618 56786
17164 56786 19431 -59386 -73810 -46573 -20996 -16888 9845 16141 -177 -16112 11681 28301
17152 28301 -3045 -49026 -118924 -115367 -81509 -65497 -11166 -10594 23428 31654 20256 -29646
17140 -29646 -77787 -83796 -63803 -66029 -97033 -83324 -60755 -33780 -392 2272 -26689 -41804
17128 -41804 -61528 -30805 -29720 -38588 -43802 -21290 1781 16728 15447 19163 22174 -25219 -79988
17115 -79988 -52513 -57799 -90857 -57722 -1735 32447 16931 -15586 -6058 42925 59359 37734
$$ packed form
17201A50163O1646K9803n4089K24K0122p2j4086j0986l538k7711L9803K5236j9169
17188A97346q5364l6739l9021L0484j9173l8233J0587J1945m79J0277k7752k7166
17176a3288m07M2877N9001j9687J4693j1680m9773j3871l8559j8643Q5955K0168
17164E6786l7355p8817j4424K7237K5577M108K6733O296j6318j5935K7793J6620
17152B8301l1346m5981o9898L557L3858J6012N4331N72L4022Q226j1398m9902
17140b9646m8141o009J9993k226l1004J3709K2569K6975L3388K664k8961j5115
17128d1804j9724L0723J085q868n214K2512K3071J4947j281L716L011m7393n4769
17115g9988K7475n286l3058L3135N5987L4182j5516l2517R528M8983J6434k1625
$$ plain form
17103 37734 -10551 7000 38356 28937 68231 28212 2496 -24984 -48301 -111762 -127044 -99797
17091 -99797 -75880 -99367 -95079 -69862 -69261 -79712 -83129 -75425 -26271 -41361 -94547 -91698 -54584
17078 -54584 -30857 -38207 -31968 -26785 -40819 -17931 -31397 -26349 -21880 40052 30259 65488 43608
17065 43608 30542 19304 20907 23413 64817 108100 127989 124666 158904 134631 110490 96052
17053 96052 134134 133162 68395 -26065 -34641 34650 33509 68501 113343 93686 117474 101880
17041 101880 134301 136056 106091 58464 23044 27876 25447 18850 39632 48751 42062 29185 -24260
17028 -24260 -13666 -8258 -56888 -64493 -33576 -49575 -36434 -44520 -90611 -95638 -71606 -80048 -98638
17015 -98638 -88882 -129131 -136936 -82792 -58810 -18702 11811 -9094 2569 23017 23250 -15533
$$ packed form
17103C7734m8285J7551L1356r419L9294m0019k5716k7480k3317o3461j5282K7247
17091i9797K3917k3487M288K5217O01j0451l417P704M9154j5090n3186K849L7114
17078e4584K3727p350O239N183j4034K2888j3466N048M469O1932r793L5229k1880
17065D3608j3066j1238J603K506M1404M3283J9889l323L4238k4273k4141j4438
17053I6052L8082r72o4767r4460q576O9291j141L4992M4842j9657K3788j5594
17041A01880L2421J755k9965m7627l5420M832k429o597K0782R119o689j2877n3445
17028b4260J0594N408m8630p605L0917j5999J3141q086m6091n027K4032q442j8590
17015i8638R756m0249p805N4144K3982M0108L0513k0905J1663K0448K33l8783
$$ plain form
17003 -15533 -38178 -43639 -37903 -40970 -16626 9278 3435 66474 65715 29167 18399 1494 39050
16990 39050 39519 758 -82606 -146650 -126606 -89875 -76237 -106289 -118919 -66861 8466 14256
16978 14256 5090 35248 -11045 -11521 16987 5133 -3480 -15443 -42254 -13138 -3737 -13155 -33665
16965 -33665 -11215 -8297 -13649 -40439 -55540 -66528 -54188 -19336 -53724 -61655 -44906 -64954
16953 -64954 -99653 -94606 -94657 -92163 -89801 -72012 -43796 -40963 -20995 -30985 -1345 23014 2885
16940 2885 48726 43236 7148 -19747 -1726 15480 26865 23045 9107 38405 27983 -2637
16928 -2637 -5507 18132 2031 4271 -7473 -2921 14799 3032 -56208 -77223 -32209 -979
16916 -979 180 -34800 -36893 48573 79998 12956 -29981 19075 28756 23689 45532 -2342 -31692
$$ packed form
17003a5533k2645n461N736l067K4344K5904n843O3039p59l6548j0768j6905L7556
16990C9050M69l8761q3364o4044K0044L6731J3638l0052j2630N2058P5327N790
16978A4256r166L0158m6293m76K8508j1854q613j1963k6811K9116R401r418k0510
16965c3665K2450K918n352k6790j5101j0988J2340L4852l4388p931J6749k0048
16953f4954l4699N047n1K494K362J7789K8216K833J9968r990K9640K4359k0129
16940B885M5841n490l6088k6895J8021J7206J1385l820j3938K9298j0422l0620
16928b637k870K3639j6101K240j1744M552J7720j1767n9240k1015M5014L1230
16916i79J159l4980k093Q5466L1425o7042m2937M9056R681n067K1843m7874k9350
$$ plain form
16903 -31692 914 -2437 9149 -27679 -44785 -42379 -66631 -70087 -38329 -42646 -51634 -109127 -126414
16890 -126414 -117547 -112876 -38336 2290 19120 2745 -14486 40001 84239 61283 30630 -4955
16878 -4955 -3508 -14691 -73083 -120622 -120652 -101860 -60426 -53141 -69201 -113041 -110863 -82435 -87789
16865 -87789 -80873 -75724 -64072 -30871 -43715 -66113 -48563 -11976 -2460 -9491 3 29374 45518
16852 45518 91656 94611 103362 124013 125628 119478 118582 109208 107432 109528 93735 100001 78740 17587
16838 17587 12702 -5117 -57254 -47154 -38723 -40000 -28892 19515 49899 30385 -8986 4526
16826 4526 7628 -41273 -30578 -10425 3312 2105 32233 25009 16866 -4528 3117 -33481 -30963
16813 -30963 -20783 -27281 -34835 2465 461 -3801 -14461 -53172 -70491 -28932 -8180 -9600 -14046
$$ packed form
16903c1692L2606l351J1586l6828j7106K406k4252l456L1758m317q988n7493j7287
16890a26414Q867M671P4540M0626J6830j6375j7231N4487M4238k2956l0653l5585
16878d955J447j1183n8392m7539l0J8792M1434P285j6060m3840K178K8428n354
16865h7789O916N149J1652L3201j2844k2398J7550L6587R516p031R494K9371J6144
16852D5518M6138K955Q751K0651J615o150q96r374j776K096j5793O266k1261o1153
16838A7587m885j7819n2137J0100Q431j277J1108M8407L0384j9514l9371J3512
16826D526L102m8901J0695K0153J3737j207L0128p224q143k1394P645l6598K518
16813c0963J0180o498p554L7300k004m262j0660l8711j7319M1559K0752j420m446
$$ plain form
16800 -14046 -14759 -29822 -62738 -68995 -63305 -108425 -141216 -123538 -97147 -87710 -33991 -41847 -39070
16787 -39070 -73172 -140671 -153338 -135504 -120747 -102979 -104194 -90149 -47758 -64900 -55680 -90214
16775 -90214 -109093 -64335 -54027 -86085 -62559 -27752 -15847 -2625 -12365 -8985 -9625 -1287 -44117
16762 -44117 -47374 -61066 -64624 -24083 52378 50272 62743 40035 31835 27405 -4912 -56902 -52930
16749 -52930 -42692 -58760 -38812 -10790 11375 -25517 -28903 657 49490 38356 -9601 1138
16737 1138 -13413 -55811 -71907 -85849 -68995 -50272 -35917 -53525 -43449 -11195 -26289 -26655
16725 -26655 4938 30239 13545 -2737 -40909 -50241 -41133 8487 24285 9740 -14651 -47741
16713 -47741 -31643 -53722 -59761 -37200 -43180 -36753 -29261 -13552 -41824 -65340 -70690 -42640 -33149
$$ packed form
16800a4046p13j5063l2916o257N690m5120l2791J7678K6391R437N3719p856K777
16787c9070l4102o7499j2667J7834J4757J7768j215J4045M2391j7142R220l4534
16775i0214j8879M4758J0308l2058K3526L4807J1905J3222r740L380o40Q338m2830
16762d4117l257j3692l558M0541P6461k106J2471k2708q200m430l2317n1990L972
16749e2930J0238j6068J9948K8022K2165l6892l386K9560M8833j1134m7957J0739
16737A138j4551m2398j6096j3942J6854J8723J4355j7608J0076L2254j5094l66
16725b6655L1593K5301j6694j6282l8172r332R108M9620J5798j4545k4391l3090
16713d7741J6098k2079o039K2561n980O427P492J5709k8272k3516n350K8050R491
$$ plain form
16700 -33149 -9624 -33424 -74146 -62146 -8858 19520 -36941 -7675 -50561 -82024 -91730 -64151
16688 -64151 -40671 -47234 -57160 -69567 -84514 -110847 -100928 -94188 -96536 -101076 -78376 -59876 -36188
16675 -36188 -72510 -78030 -113483 -130025 -87832 -50123 -104986 -119009 -114763 -73031 -36070 -72212
16663 -72212 -65689 -79329 -71187 -22157 -18980 -31491 -43158 -63999 -78223 -36174 -56396 -63587
16651 -63587 -50673 -45492 -69927 -70604 -82759 -46972 -21866 -13603 -35098 -74397 -68243 -70291 -68312
16638 -68312 -40220 -31528 -33331 -63508 -92730 -73104 -79817 -66796 -83151 -28268 14443 18633
16626 18633 73026 105023 130660 75082 32611 84420 118500 135316 76911 17189 -29711 -32384
16614 -32384 7136 28650 -15349 -58987 -38383 -34008 -26561 14466 4474 26989 36117 8834
$$ packed form
16700c3149K3525k3800m0722J2000N3288K8378n6461K9266m2886l1463r706K7579
16688f4151K3480o563r926j2407j4947k6333R919O740k348m540K2700J8500K3688
16675c6188l6322n520l5453j6542M2193L7709n4863j4023M246M1732L6961l6142
16663g2212O523j3640Q142M9030L177j2511j1667k0841j4224M2049k0222p191
16651f3587J2914N181k4435o77j2155L5787K5106Q263k1495l9299O154k048J979
16638f8312K8092Q692j803l0177k9222J9626o713J3021j6355N4883M2711M190
16626A8633N4393L1997K5637n5578m2471N1809L4080J6816n8405n9722m6900k673
16614c2384L9520K1514m3999m3638K0604M375P447M1027r992K2515R128k7283
$$ plain form
16602 8834 -32708 -66834 -49456 -33215 -8873 -9370 -20242 -28882 -32240 25386 -5152 -46704 -5683
16589 -5683 12824 -6231 -1549 -29044 -43807 -2974 51073 19727 -14082 -63476 -39084 -55072
16577 -55072 -34838 -23562 -64051 -44855 -29401 -38931 -40767 -74543 -87396 -65473 -36706 -43844
16565 -43844 -36698 -43132 -63915 -62346 -52347 -27620 -32210 -36167 -26069 -7072 -944 36540 71755
16552 71755 30859 19510 21717 -3523 -39642 -69737 -39199 -33965 -44953 -37761 -21017 -26968
16540 -26968 -36418 -8395 -11867 -8728 -146 21388 5279 -39683 -13079 -25581 -12750 -14388 -19300
16527 -19300 -43417 -53916 -5122 -13888 -37439 -56803 -59955 -75976 -56072 -12963 9088 -18298
16515 -18298 -70106 -78381 -71034 -29505 -24708 -85209 -51698 -67064 -78794 -28038 -47829 -58629
$$ packed form
16602H834m1542l4126J7378J6241K4342m97j0872q640l358N7626l0538m1552M1021
16589e683J8507j9055M682k7495j4763M0833N4047l1346l3809m9394K4392j5988
16577e5072K0234J1276m0489J9196J5454r530j836l3776j2853K1923K8767p138
16565d3844P146o434k0783J569R999K4727m590l957J0098J8997O128L7484L5215
16552G1755m0896j1349K207k5240l6119l0095L0538N234j0988P192J6744n951
16540b6968r450K8023l472L139Q582K1534j6109m4962K6604j2502J2831j638m912
16527a9300k4117j0499M8794q766k3551j9364l152j6021J9904M3109K2051k7386
16515a8298n1808q275P347M1529M797o0501L3511j5366j1730N0756j9791j0800
$$ plain form
16503 -58629 -52193 -51321 -45148 -35761 -51741 -68486 -97144 -115663 -83267 -73105 -118425 -120496 -113948
16490 -113948 -76803 7543 82662 84476 61814 62760 18992 -29746 -58354 -67785 -46715 26157
16478 26157 41443 37766 -15374 -35850 -42550 -55649 -87555 -99748 -118634 -80711 -40174 -62247
16466 -62247 -50210 -13134 -12747 5724 -23863 -25941 -14931 -19776 -16343 -55052 -69526 -46065 -46162
16453 -46162 -33134 -3134 3586 6952 -11544 -61137 -43514 -45208 -68535 -18190 5669 718
16441 718 -17392 10089 55447 50697 36958 20800 5577 30965 36720 -7444 7736 44138
16429 44138 75117 111441 62235 37973 25811 3872 13189 24375 49199 45149 38339 68578
16417 68578 36316 19872 11843 -11049 -20847 -51476 -34422 -56324 -87463 -105826 -75248 -63701
$$ packed form
16503e8629O436Q72O173R387j5980j6745k8658j8519L2396J0162m5320k071O548
16490a13948L7145Q4346P5119J814k2662R46m3768m8738k8608r431K1070P2872
16478B6157J5286l677n3140k0476o700j3099l1906j2193j8886L7923M0537k2073
16466f2247J2037L7076L87J8471k9587k078J1010m845L433l8709j4474K3461r7
16453d6162J3028L0000O720L366j8496m9593J7623j694k3327N0345K3859m951
16441G18j8110K7481M5358m750j3739j6158j5223K5388N755m4164J5180L6402
16429D4138L0979L6324m9206k4262j2162k1939R317J1186K4824m050o810L0239
16417F8578l2262j6444q029k2892r798l0629J7054k1902l1139j8363L0578J1547
$$ plain form
16405 -63701 -51976 -70036 -23689 -15694 -536 -19755 -4985 4950 6251 26263 7765 36891
16393 36891 41916 31908 57786 36176 -17047 -40025 3944 21672 -1105 -71441 -94983 -54548
16381 -54548 -36667 31643 34246 18091 -11960 -43307 -52242 -44108 -27113 -41983 -96466 -68154
16369 -68154 -62111 -46276 24018 53047 15762 13700 -17369 4706 19851 -8902 -62334 -78133
16357 -78133 -77843 -74154 -62294 -54388 -25554 52940 54217 7051 -21109 12062 25949 -31263 -36758
16344 -36758 -54208 -111286 -126732 -114043 -42878 6631 37249 2088 -2621 -18835 -72139 -80954
16332 -80954 -97858 -132184 -111850 -53279 6606 -5012 -15127 11796 23393 -8569 -14994 -20767
16320 -20767 27269 15358 3129 31562 24107 26512 10613 5355 23269 36791 12065 -41131
$$ packed form
16405f3701J1725j8060M6347P995J5158j9219J4770R935J301K0012j8498K9126
16393C6891N025j0008K5878k1610n3223k2978M3969J7728k2777p0336k3542M0435
16381e4548J7881O8310K603j6155l0051l1347q935Q134J6995j4870n4483K8312
16369f8154O043J5835P0294K9029l7285k062l1069K2075J5145k8753n3432j5799
16357g8133K90L689J1860P906K8834P8494J277m7166k8160L3171J3887n7212n495
16344c6758j7450n7078j5446J2689P1165M9509L0618l5161m709j6214n3304q815
16332h0954j6904l4326K0334N8571N9885j1618j0115K6923J1597l1962o425n773
16320b0767M8036j1911j2229K8433p455K405j5899n258J7914J3522k4726n3196
$$ plain form
16308 -41131 -72750 -39492 11551 49540 50725 -2307 -29011 -8271 -26285 -89822 -139186 -158889
16296 -158889 -129278 -47347 -470 2411 -2052 -48073 -67511 -55768 -29019 -17094 -10167 -14342
16284 -14342 -51264 -50967 -43735 -44397 -57268 -35925 -23145 -42950 -75593 -73750 -34923 -25109 -20875
16271 -20875 -21163 -55595 -44455 -16669 -53573 -60311 -79823 -62005 -49732 -50861 -46869 -48652 -20636
16258 -20636 -42637 -13793 -6627 -29948 -38499 15574 49443 48336 24833 4349 -4572 -14939
16246 -14939 33992 51598 27310 -27402 -18539 821 -2169 17798 61030 62480 42580 32497
16234 32497 12444 -11380 -16760 -15114 -18584 -23516 -62013 -55989 -56886 -28634 -57572 -33114 -11889
16221 -11889 41440 58245 26634 -17164 -55023 -126795 -97032 -40681 24955 35714 13654 -18727
$$ packed form
16308d1131l1619L3258N1043L7989J185n3032k6704K0740j8014o3537m9364j9703
16296a58889K9611Q1931M6877K881m463m6021j9438J1743K6749J1925O927m175
16284a4342l6922K97P232o62j2871K1343J2780j9805l2643J843L8827R814M234
16271b0875k88l4432J1140K7786l6904o738j9512J7818J2273j129L992j783K8016
16258b0636k2001K8844P166k3321q551N4073L3869j107k3503k0484q921j0367
16246a4939M8931J7606k4288n4712Q863J9360k990J9967M3232J450j9900j0083
16234C2497k0053k3824n380J646l470m932l8497O024q97K8252k8938K4458K1225
16221a1889N3329J6805l1611m3798l7859p1772K9763N6351O5636J0759k2060l2381
$$ plain form
16209 -18727 -46134 -88191 -100636 -80882 -34162 29779 33042 -31200 36180 60624 -15121 -26170
16197 -26170 -28962 -15281 -16861 -12655 -14184 15997 -25253 -78863 -66388 -86071 -116441 -120455 -79681
16184 -79681 -10792 9147 -12655 -13881 -17035 -33482 -16294 42235 35873 -4920 -29718 -35018
16172 -35018 -45716 -59951 -54008 -74258 -22541 1968 -52348 -64807 -54619 -69804 -83452 -27892
16160 -27892 -10225 -19394 6013 19184 -21284 -56452 -8303 -9863 -20292 -42057 -22527 -10792
16148 -10792 1039 -23760 -31097 2489 5678 17761 11713 -18972 -33698 -65067 -78585 -90627
16136 -90627 -45730 10284 24645 52380 52794 92295 50718 -11178 -26564 -2342 25972 8231
16124 8231 11445 19887 -11121 -321 30967 -35118 -64941 -52759 -9830 -6889 -21250 -62775
$$ packed form
16209a8727k7407m2057j2445J9754M6720O3941L263o4242O7380K4444p5745j1049
16197b6170k792J3681j580M206j529L0181m1250n3610J2475j9683l0370m014M0774
16184g9681O8889J9939k1802j226l154j6447J7188N8529o362m0793k4798n300
16172c5018j0698j4235N943k0250N1717K4509n4316j2459J0188j5185j3648N5560
16160b7892J7667r169K5407J3171m0468l5168M8149j560j0429k1765J9530J1735
16148a0792J1831k4799p337L3586L189J2083o048l0685j4726l1369j3518j2042
16136i0627M4897N6014J4361K7735M14L9501m1577o1896j5386K4222K8314j7741
16124H231L214Q442l1008J0800L1288o6085k9823J2182M2929K941j4361m1525
$$ plain form
16112 -62775 -61732 -42520 -43525 -84494 -90858 -71339 11448 15903 -46567 -43817 21603 69744 24110
16099 24110 6098 -22810 -63658 -83941 -41467 -44351 -71239 -48504 -80749 -115366 -77094 -32022
16087 -32022 8691 -3771 -16978 9926 17488 2174 -9617 -10794 14076 10558 18540 24790 40619
16074 40619 46390 55272 53696 45549 39747 8619 -18318 -40481 -55001 633 11207 -8959 11128
16061 11128 37155 31756 13458 -16144 6638 -7095 -19774 -33643 5282 -974 10542 13593
16049 13593 -14193 -42921 -17408 21507 23279 -40711 -37032 -46303 -48058 -80583 -48655 -25634
16037 -25634 -71483 -43524 -12064 -80636 -85169 -60255 -49259 -11839 -4303 25314 13157 -11183
16025 -11183 -52514 -47390 9025 17755 31764 27457 510 5078 -24313 -66723 -51963 -32120
$$ packed form
16112f2775J043J9212j005m0969o364J9519Q2787M455o2470K750O5420M8141m5634
16099B4110j8012k8908m0848k0283M2474k884k6888K2735l2245l4617L8272M5072
16087c2022M0713j2462j3207K6904P562j5314j1791j177K4870l518P982O250J5829
16074D0619N771Q882j576q147n802l1128k6937k2163j4520N5634J0574k0166K0087
16061A1128K6027n399j8298k9602K2782j3733j2679j3869L8925o256J1516L051
16049A3593k7786k8728K5513L8915J772o3990L679r271j755l2525L1928K3021
16037b5634m5849K7959L1460o8572m533K4914J0996L7420P536K9617j2157k4340
16025a1183m1331N124N6415Q730J4009m307k6947M568k9391m2410J4760J9843
$$ plain form
16013 -32120 -27002 -19468 -34498 246 -15219 -781 15933 -1688 5223 9341 -22123 -2773
16001 -2773 69809 120481 96512 47246 3750 -20980 -7982 -17046 -33388 -21318 11312 1825
15989 1825 -4094 1353 3176 -14136 -65507 -76592 -77614 -86198 -66696 -12834 -3288 -42964 -77579
15976 -77579 -85756 -77535 -16569 -33133 -59134 -125625 -91168 -35807 18247 69132 63189 20573
15964 20573 30706 8468 -7003 -20762 -50269 -61680 -55969 -70162 -38915 -7434 -3838 -20582
15952 -20582 18992 36470 235 -2508 -38358 -52201 -28261 -64423 -56355 -13495 -28937 -62121
15940 -62121 -56831 -37821 -31377 -8273 26179 37536 99750 77148 16066 1300 -2519 -28095
15928 -28095 -13468 -9149 7738 62884 98875 136157 178462 195550 227696 263589 386786 557583
$$ packed form
16013c2120N118P534j5030L4744j5465J4438J6714j7621O911M118l1464J9350
16001b773P2582N0672k3969m9266m3496k4730J2998r064j6342J2070L2630r487
15989A825n919N447J823j7312n1371j1085j022q584J9502N3862R546l9676l4615
15976g7579q177Q221O0966j6564k6001o6491L4457N5361N4054N0885n943m2616
15964B0573J0133k2238j5471j3759k9507j1411N711j4193L1247L1481L596j6744
15952b0582L9574J7478l6235k743l5850j3843K3940l6162Q068M2860j5442l3184
15940f2121N290J9010O444K3104L4452J1357O2214k2602o1082j4766l819k5576
15928b8095J4627M319J6887N5146L5991L7282M2305J7088L2146L5893J23197J70797
$$ plain form
15916 557583 731526 974876 1098329 975073 758452 594154 499368 323493 231112 149158
15906 149158 148894 83968 38296 32148 46461 55247 88670 61390 32810 10661 -46140 -47956
15894 -47956 -1644 29802 14153 -36241 -96889 -56789 12732 56266 63280 29334 11981 6514
15882 6514 43196 43720 74437 68513 58411 14645 835 12750 85441 103381 46879 16798
15870 16798 29067 67913 46196 -6840 -19101 -63783 -44117 6178 39028 10698 -21894 -5535
15858 -5535 31372 40611 8956 -4238 -3489 2204 -27162 -41271 -32838 -41010 -8323 -7628 -30219
15845 -30219 -28437 20584 1713 34146 48252 51213 30810 -1999 -51717 -72025 -67589 -42001
15833 -42001 -31778 -25612 15312 38865 39697 41034 31794 18400 43587 57642 49078 52543 56885
$$ packed form
15916E57583J73943K43350J23453j23256k16621j64298r4786j75875r2381q1954
15906A49158k64o4926m5672o148J4313Q786L3423k7280k8580k2149n6801j816
15894d7956M6312L1446j5649n0394o0648M0100O9521M3534P014l3946j7353n467
15882F514L6682N24L0717n924j0102m3766j3810J1915P2691J7940n6502l0081
15870A6798J2269L8846k1717n3036j2261m4682J9666N0295L2850k8330l2592J6359
15858e535L6907R239l1655j3194P49N693k9366j4109Q433q172L2687O95k2591
15845c0219J782M9021j8871L2433J4106K961k0403l2809m9718k0308M436K5588
15833d2001J0223O166M0924K3553Q32J337r240j3394K5187J4055q564L465M342
$$ plain form
15820 56885 6703 -25837 -20794 -28899 -28534 -317 14429 -12324 -21656 -8622 -32396 -44003 -76137
15807 -76137 -96281 -74965 -20374 7604 -34264 -54380 -65874 -89737 -105336 -91961 -111626 -130527
15795 -130527 -122357 -70611 -33132 -46972 -37922 -81765 -121148 -119359 -160599 -157880 -143797 -128504
15783 -128504 -97538 -96473 -108056 -114811 -91792 -34348 -2202 15780 17484 -40945 -98570 -88130
15771 -88130 -90935 -102837 -140003 -153516 -132681 -102089 -114433 -97500 -71595 -58844 -63074 -93886
15759 -93886 -121477 -97087 -32142 -47474 -56980 -24224 29579 33625 25274 40368 8410 48833
15747 48833 39627 13824 -24262 -28707 -28977 -3033 30755 34307 37658 -4549 -58336 -47799 -20672
15734 -20672 -18188 25460 59845 86261 97498 139851 79857 26333 3823 2161 -16028 -50004
$$ packed form
15820E6885n0182l2540N043q105L65K8217J4746k6753r332J3034k3774j1607l2134
15807g6137k0144K1316N4591K7978m1868k0116j1494k3863j5599J3375j9665j8901
15795a30527Q170N1746L7479j3840R050m3843l9383J789m1240K719J4083J5293
15783a28504L0966J065j1583o755K3019N7444L2146J7982J704n8429n7625J0440
15771h8130k805j1902l7166j3513K0835L0592j2344J6933K5905J2751m230l0812
15759i3886k7591K4390O4945j5332r506L2756N3803M046q351J5094l1958M0423
15747D8833r206k5803l8086m445k70K5944L3788L552L351m2207n3787J0537K7127
15734b0672K484M3648L4385K6416J1237M2353n9994n3524k2510j662j8189l3976
$$ plain form
15722 -50004 -87827 -82077 -76982 -94629 -72572 -33485 -48967 -72889 -50163 -8498 41726 36538
15710 36538 34912 17146 30331 33245 46320 -3892 -26515 18246 29571 59453 72651 46980
15698 46980 15867 14905 -21021 -7334 -47803 -78435 -41963 -34000 -29649 -3283 12520 14212 16223
15685 16223 -668 -41632 -47285 -47730 -76079 -69476 -48991 -35748 -44381 -41143 -29860 -17112 -33100
15672 -33100 -53582 3635 26253 16802 -15920 -25422 -39808 -50607 -24500 5994 37604 35315
15660 35315 32567 20093 -40577 -39388 -10134 12214 28458 29705 -30092 -67809 -60820 -87990
15648 -87990 -70546 -16409 941 -14600 -41552 -62600 -53892 -12855 -17824 17467 41136 74610
15636 74610 72874 28770 14458 50272 45288 55933 43945 -17823 -82804 -100721 -55751 -55001
$$ packed form
15722e0004l7823N750N095j7647K2057L9087j5482k3922K2726M1665N0224n188
15710C6538j626j7766J3185K914J3075n0212k2623M4761J1325K9882J3198k5671
15698D6980l1113r62l5926J3687m0469l0632L6472P963M351K6366J5803J692K011
15685A6223j6891m0964n653m45k8349O603K0485J3243q633L238J1283J2748j5988
15672c3100k0482N7217K2618r451l2722r502j4386j0799K6107L0494L1610k289
15660C5315k748j2474o0670J189K9254K2348J6244J247n9797l7717O989k7170
15648h7990J7444N4137J7350j5541k6952k1048Q708M1037m969L5291K3669L3474
15636G4610j736m4104j4312L5814m984J0645j1988o1768o4981j7917M4970P50
$$ plain form
15624 -55001 -106797 -130769 -110959 -32520 -62037 -54742 -80993 -70172 -4531 18485 3719 -56106
15612 -56106 -98882 -64558 -32646 -44327 -75555 -48880 -29483 31418 2299 -52774 -70634 -73796
15600 -73796 -74878 -65350 -43978 -42718 -8440 6455 33473 6630 -22515 -29220 -13385 -9646 -19019
15587 -19019 -2342 21170 -17761 -56717 -9393 13641 -34618 -90399 -130407 -95527 -78759 -82665
15575 -82665 -73878 -31310 -15831 12489 28111 21430 10758 -10355 -32978 -81001 -94419 -123913
15563 -123913 -131133 -115558 -80910 -47554 -62182 -109750 -79000 -73031 -78238 -75325 -89563 -72124
15551 -72124 -46296 -33029 -33912 -45414 -49183 -54425 -39210 -7096 -12084 10385 2240 -8604 -33217
15538 -33217 -37437 17460 23225 -30384 -15266 21645 35038 5643 -26788 -10884 -39563 -116704
$$ packed form
15624e5001n1796k3972J9810P8439k9517P295k6251J0821O5641K3016j4766n9825
15612e6106m2776L4324L1912j1681l1228K6675J9397O0901k9119n5073j7860l162
15600g3796j082R528K1372J260L4278J4895K7018k6843k9145o705J5835L739r373
15587a9019J6677K3512l8931l8956M7324K3034m8259n5781m0008L4880J6768l906
15575h2665Q787M2568J5479K8320J5622o681j0672k1113k2623m8023j3418k9494
15563a23913p220J5575L4648L3356j4628m7568L0750N969n207K913j4238J7439
15551g2124K5828J3267q83j1502l769n242J5215L2114m988K2469q145j0844k4613
15538c3217m220N4897N765n3609J5118L6911J3393k9395l2431J5904k8679p7141
$$ plain form
15526 -116704 -123893 -54444 2634 -31257 -37453 -23851 -18381 9509 24749 -35019 -58275 -96913
15514 -96913 -111951 -137922 -91995 -58865 -96905 -93704 -100106 -90425 -85088 -55818 -27695 -21926 -38128
15501 -38128 -17026 -29914 -54780 -39402 -8925 18428 38639 1938 -34316 -11676 -4049 -20785
15489 -20785 2699 -679 6363 971 19132 21814 5898 22180 -8929 -11839 -6067 -32730 -37726
15476 -37726 -36019 -39521 -45897 -42661 -40069 -64193 -70254 -89587 -58950 -25621 -4871 15929 14754
15463 14754 -5162 -5474 -20801 53 11588 33603 37613 20429 7195 -25575 -54796 -61900
15451 -61900 -72248 -62770 -39060 -82375 -64882 -64009 -58910 -67953 -53698 -16814 15522 -4460 -42803
15438 -42803 -68714 -38226 -26114 -2247 11910 -4690 -43911 -20874 -14441 -17935 -14903 -15699 -36303
$$ packed form
15526a16704p189O9449N7078l3891o196J3602N470K7890J5240n9768k3256l8638
15514i6913j5038k5971M5927L3130l8040L201o402R681N337K9270K8123N769j6202
15501c8128K1102j2888k4866J5378L0477K7353K0211l6701l6254K2640P627j6736
15489b0785K3484l378P042n392J8161K682j5916J6282l1109k910N772k6663m996
15476c7726J707l502o376L236K592k4124o061j9333L0637L3329K0750K0800j175
15463A4754j9916l12j5327K0854J1535K2015M010j7184j3234l2770k9221p104
15451f1900j0348R478K3710m3315J7493Q73N099r043J4255L6884L2336j9982l8343
15438d2803k5911L0488J2112K3867J4157j6600l9221K3037O433l494L032p96k0604
$$ plain form
15425 -36303 -63437 -36128 -38075 -59855 -65337 -85338 -77960 -40180 -42569 -57450 -75237 -52661
15413 -52661 -57208 -57513 -59277 -29400 15407 420 -38773 -46805 -46372 -78257 -96092 -86597 -26223
15400 -26223 5126 -15580 -55073 -35680 -19718 2670 2260 742 -17050 -29234 -40869 -6679
15388 -6679 30396 1980 -34915 -79157 -60911 -53427 -31297 -3114 18517 38865 76709 90504
15376 90504 90622 43341 1186 23239 13708 25932 14309 -12919 -12117 -21294 29902 -6674 -74600
15363 -74600 -25538 58428 92703 57568 -15501 -42138 -59188 -79898 -93134 -100073 -123933 -119802
15351 -119802 -130688 -119622 -70392 -61796 -86291 -84443 -68224 -68617 -76318 -10267 -8406 -36449 -63547
15338 -63547 -80476 -97704 -79610 -57535 -28277 -56308 -70376 -35819 -14362 -39245 -44950 1318
$$ packed form
15425c6303k7134K7309j947k1780n482k0001P378L7780k389j4881j7787K2576
15413e2661m547l05j764K9877M4807j4987l9193q032M33l1885j7835R495O0374
15400b6223L1349k0706l9493J9393J5962K2388m10j518j7792j2184j1635L4190
15388f679L7075k8416l6895m4242J8246P484K2130K8183K1631K0348L7844J3795
15376I0504J18m7281m2155K2053r531J2224j1623k7228Q02r177N1196l6576o7926
15363g4600M9062Q3966L4275l5135p3069k6637j7050k0710j3236o939k3860M131
15351a19802j0886J1066M9230Q596k4495J848J6219l93p701O6051J861k8043k7098
15338f3547j6929j7228J8094K2075K9258k8031j4068L4557K1457k4883n705M6268
$$ plain form
15326 1318 8342 -79 30767 16021 18946 -36824 -21336 14524 1330 5401 24241 -20822 -25213
15313 -25213 -20503 32863 22977 -33478 -34251 -6621 -20199 -55864 -56038 -46079 17262 4480 -22491
15300 -22491 -68397 -82547 -86941 -71869 -49244 -18344 -29404 -13158 17745 35928 35482 43711
15288 43711 69144 24850 -3612 -17384 -60435 -64142 -36918 -51549 -89282 -56330 -27270 -57868
15276 -57868 -40250 -2594 -37978 -67358 -24986 -51095 -83408 -44949 -21022 -41766 -37781 -24794
15264 -24794 -2790 -14306 -18580 -39285 -33189 -41654 -55101 -50527 -39483 -45144 -6493 18497 -242
15251 -242 -29330 -4288 45397 39647 -39408 -62962 -62616 -11592 53162 71847 56969 83303 88326
15238 88326 84703 84577 56435 49074 69862 82652 29236 -4815 -26879 -42180 -17131 -34498
$$ packed form
15326A318P024q421L0846j4746K925n5770J5488L5860j3194M071J8840m5063m391
15313b5213M710N3366r886n6455p73K7630j3578l5665j74R959O3341j2782k6971
15300b2491m5906j4150m394J5072K2625L0900j1060J6246L0903J8183m46Q229
15288D3711K5433m4294k8462j3772m3051l707K7224j4631l7733L2952K9060l0598
15276e7868J7618L7656l5384k9380M2372k6109l2313L8459K3927k0744L985J2987
15264b4794K2004j1516m274k0705O096q465j3447M574J1044n661L8651K4990j8739
15251b42k9088K5042M9685n750p9055k3554L46N1024O4754J8685j4878K6334N023
15238H8326l623j26k8142p361K0788J2790n3416l4051k2064j5301K5049j7367
$$ plain form
15226 -34498 -41278 -40544 -40460 -49352 -96294 -89990 -61382 -77033 -90168 -78459 -80520 -71519 -62943 -18170
15212 -18170 26815 40945 30420 -9269 -6311 19256 71430 80918 53228 -46840 -79343 -81079
15200 -81079 -83590 -12427 -7134 2734 20309 16629 18996 26490 30688 11573 -64727 -129681 -88910
15187 -88910 -37442 -9333 -17759 -22890 -41717 -41417 -48811 -25238 -14667 -39381 -34284 -26359 -15038
15174 -15038 16866 56060 42963 -10733 11100 65294 83692 72392 59303 52323 34541 -10663
15162 -10663 11356 13844 -7675 -6252 -17157 -47769 -35966 -32027 -25139 -38224 -70297 -39423
15150 -39423 -10844 -8876 -26780 -54583 -88051 -117367 -106825 -87747 -84875 -90522 -81898 -80013 -92529
15137 -92529 -87578 -66406 -58494 -70795 -61625 -7231 -15845 -25023 -41390 -69100 -70678 -82490 -49375
$$ packed form
15226c4498o780P34Q4q892m6942O304K8608j5651j3135J1709k061R001Q576M4773
15212a8170M4985J4130j0525l9689K958K5567N2174R488k7690j00068l2503j736
15200h1079k511P1163N293R868J7575l680K367P494M198j9115p6300o4954M0771
15187h8910N1468K8109q426n131j8827L00p394K3573J0571k4714N097P925J1321
15174a5038L1904L9194j3097n3696K1833N4194J8398j1300j3089o980j7782m5204
15162a0663K2019K488k1519J423j0905l0612J1803L939O888j3085l2073L0874
15150c9423K8579J968j7904k7803l3468k9316J0542J9078K872n647Q624J885j2516
15137i2529M951K1172P912j2301R170N4394q614r178j6367k7710j578j1812L3115
$$ plain form
15124 -49375 -24582 -29713 -8186 -29755 -36431 -37543 -81475 -51778 -32452 -24976 -45015 -78748
15112 -78748 -59509 -41002 7921 11008 24421 24180 9101 8915 -32447 -68610 -43615 -21919 -25607
15099 -25607 -42434 -69811 115 44458 63846 48283 6769 -34102 -13856 -13801 -48527 -64616
15087 -64616 -80433 -75940 -72764 -51902 -70362 -22480 -11135 -14669 -46303 -24360 -18646 -64092
15075 -64092 -69402 -65264 -73810 -66143 -77918 -74002 -34359 -16948 3302 -8493 37812 42145 -7022
15062 -7022 -8574 -31564 -23958 10368 67535 9379 -60737 -55181 -6185 -13933 -39822 -18961 -15225
15049 -15225 3149 -22943 -24427 10981 -21120 -81628 -107558 -93777 -144323 -140175 -110476 -62726
15037 -62726 -22835 22653 59576 105260 138011 68432 1349 32502 48273 62653 31668 -28796
$$ packed form
15124d9375K4793n131K1527k1569o676j112m3932K9697J9326P476k0039l3733
15112g8748J9239J8507M8923L087J3413k41j5079j86m1362l6163K4995K1696l688
15099b5607j6827k7377O9926M4343J9388j5563m1514m0871K0246N5l4726j6089
15087f4616j5817M493L176K0862j8460M7882J1345l534l1634K1943N714m5446
15075f4092n310M138q546P667j1775L916L9643J7411K0250j1795M6305M333m9167
15062g022j552k2990P606L4326N7167n8156p0116N556M8996p748k5889K0861L736
15049a5225J8374k6092j484L5408l2101o0508k5930J3781n0546M148K9699M7750
15037f2726L9891M5488L6923M5684L2751o9579o7083L1153J5771J4380l0985o0464
$$ plain form
15025 -28796 -7157 40788 35771 -5653 -40748 -57787 -19990 17197 27922 53360 51435 -7896
15013 -7896 -6696 25956 -3330 -29169 -32645 -15819 -34776 -39596 -66463 -57849 -44710 -17189 11262
15000 11262 21656 4605 26167 16384 39936 43484 17310 6515 -191 -37442 -24004 -27225
14988 -27225 -18020 14138 -10715 -65788 -33759 28198 39731 -2492 -40493 -46557 -29551 -50220
14976 -50220 -58836 -75483 -64865 -13271 -8677 17754 5866 16487 10014 -15890 -25758 -31491 -27876
14963 -27876 -8331 19192 36521 47085 42327 587 -56094 -41330 -3702 -8128 7662 3051
14951 3051 -22019 -9594 -13550 -17363 -44877 -17060 -40465 -2421 -3565 -6027 -22192 -39684 -21862
14938 -21862 -66122 -122528 -106380 -47142 -9683 4826 40856 84973 90217 65959 40209 25256
$$ packed form
15025b8796K1639M7945n017m1424l5095j7039L7797L7187J0725K5438j925n9331
15013g896J200L2652k9286k5839l476J6826j8957m820k6867Q614J3139K7521K8451
15000A1262J0394j7051K1562r783K3552L548k6174j0795o706l7251J3438l221
14988b7225R205L2158k4853n5073L2029O1957J1533m2223l8001o064J7006k0669
14976e0220q616j6647J0618N1594M594K6431j1888J0621o473k5904r868n733L615
14963b7876J9545K7523J7329J0564m758m1740n6681J4764L7628m426J5790m611
14951C051k5070J2425l956l813k7514K7817k3405L8044j144k462j6165j7492J7822
14938b1862m4260n6406J6148N9238L7459J4509L6030M4117N244k4258k5750j4953
$$ plain form
14926 25256 -9411 -40458 -41162 -30026 -13927 1263 34851 -3052 -9265 -16989 -43987 -63997
14914 -63997 -66765 -39059 -69866 -58471 -40647 -34291 -61666 -81306 -62604 -61330 -25707 -29161
14902 -29161 -54062 -18330 -15339 -30335 -42291 -11744 -24641 -30028 -53464 -52889 -58560 -66543 -59309
14889 -59309 -25665 -27097 -50933 -51714 -26825 -36239 -43305 -82648 -84474 -106686 -73985 -66783 -44503
14876 -44503 -38516 8248 15624 -37924 -53588 -63430 -58693 -36732 -43808 -31706 14968 11117 4519
14863 4519 14049 31632 10827 1409 27198 60902 74195 72364 19567 -2319 -3811 -40307 -14683
14850 -14683 -3128 8946 35353 -2228 -54463 -48656 -50259 -52568 -45678 -10313 -49317 -78340
14838 -78340 -107537 -125145 -127199 -105570 -41489 -14630 28625 -6959 -6866 -10510 -42781 -34178 -54316
$$ packed form
14926B5256l4667l1047p04J1136J6099J5190L3588l7903o213p724k6998k0010
14914f3997k768K7706l0807J1395J7824O356k7375j9640J8702J274L5623l454
14902b9161k4901L5732K991j4996j1956L0547j2897n387k3436N75n671p983P234
14889e9309L3644j432k3836p81K4889r414p066l9343j826k2212L2701P202K2280
14876d4503N987M6764P376n3548j5664r842M737K1961p076J2102M6674l851o598
14863D519R530J7583k0805r418K5789L3704J3293j831n2797k1886j492l6496K5624
14850a4683J1555J2074K6407l7581n2235N807j603k309O890L5365l9004k9023
14838g8340k9197j7608k054K1629O4081K6859M3255l5584R3l644l2271Q603k0138
$$ plain form
14825 -54316 -83430 -71407 -88111 -93607 -103047 -113827 -49629 14119 24197 42410 46932 59971
14813 59971 34365 56537 37711 -37262 -64161 -63942 -62307 -49337 -34665 -20375 5840 49458
14801 49458 21390 -14477 -18077 -32166 -34671 -21761 12545 41053 33456 10775 1369 38069
14789 38069 59718 19190 17554 23352 -5165 -34072 -56872 -50702 -9148 4815 -28684 -55118
14777 -55118 -56028 -57478 -30694 -43795 -2524 5362 12106 24052 14344 3151 -52676 -30052 5105
14764 5105 8158 -39312 -40755 -77688 -47832 -38555 -28302 -159 2737 46116 17092 -4620 -41729
14751 -41729 -33667 -43647 -17777 556 -67423 -95855 -70531 -23693 -8151 -35535 -19946 -42514
14739 -42514 -37660 -40655 -34806 -46110 -32634 -48599 -74106 -96273 -149126 -96634 -51636 -57004
$$ packed form
14825e4316k9114J2023j6704n496r440j0780O4198O3748J0078J8213M522J3039
14813E9971k5606K2172j8826p4973k6899K19J635J2970J4672J4290K6215M3618
14801D9458k8068l5867l600j4089k505J2910L4306K8508p597k2681r406L6700
14789C8069K1649m0528j636N798k8517k8907k2800O170M1554J3963l3499k6434
14777e5118r10j450K6784j3101M1271P886O744J1946r708j1193n5827K2624L5157
14764E105L053m7470j443l6933K9856R277J0253K8143K896M3379k9024k1712l7109
14751d1729Q062r980K5870J8333o7979k8432K5324M6838J5542k7384J5589k2568
14739d2514M854k995N849j1304J3476j5965k5507k2167n2853N2492M4998n368
$$ plain form
14727 -57004 -52069 -43833 -76492 -61522 -33090 -40579 -48599 -55369 -24387 -11217 -16648 6059 28022
14714 28022 30521 17924 30197 27612 40121 18349 19200 11934 -10506 -35458 -84702 -52943 -45342
14701 -45342 -13587 -1996 5998 -38020 -42694 -72949 -16958 45097 39261 44765 983 -21619
14689 -21619 -44666 -74887 -68228 -8451 -442 -7332 -42752 -61011 -23666 -17534 20726 -49554
14677 -49554 -125875 -119162 -81387 -68577 -55142 -46730 -22191 158 -46434 -32710 9623 30328
14665 30328 -4306 3192 21089 76350 60674 36013 11808 19674 41369 59380 33938 12450
14653 12450 741 -19230 6723 -749 8587 35159 32944 38858 14374 21685 19224 2471 6126
14640 6126 -53970 -82139 -70496 -45264 -74147 -86955 -53433 -32845 -42447 -36320 -17888 -3266
$$ packed form
14727e7004M935Q236l2659J4970K8432p489q020o770L0982J3170n431K2707K1963
14714B8022K499j2597J2273k585J2509k1772Q51p266k2440k4952m9244L1759P601
14701d5342L1755J1591P994m4018m674l0255N5991O2055n836N504m3782k2602
14689b1619k3047l0221O659N9777Q009o890l5420j8259L7345O132L8260p0280
14677d9554p6321O713L7775J2810J3435Q412K4539K2349m6592J3724M2333K0705
14665C0328l4634P498J7897N5261j5676k4661k4205P866K1695J8011k5442k1488
14653A2450j1709j9971K5953p472R336K6572k215N914k4484P311k461j6753L655
14640F126o0096k8169J1643K5232k8883j2808L3522K0588r602O127J8432J4622
$$ plain form
14628 -3266 -43662 -81037 -90712 -36348 6314 3952 -22969 -34958 -72371 -21495 18446 -45276
14616 -45276 -59742 -14946 2001 51961 55159 -6495 -8428 3572 -6908 15611 64160 46012
14604 46012 -3092 13138 62585 21167 -26513 -34945 -28036 23731 13822 31342 59839 93050
14592 93050 115211 75925 29182 23631 47290 68374 48275 24765 -6431 -20784 -14092 -11931
14580 -11931 -6453 26563 31614 -1681 -8183 35778 29886 5769 14054 29755 21691 55813 23052
14567 23052 -22451 44213 86174 95257 71693 44362 38059 60290 103865 60617 18026 -51200
14555 -51200 -27471 2744 -37184 -76020 -107060 -44606 -27546 -16328 5377 9585 13797 32852
14543 32852 52838 50585 42852 24055 -22073 -8561 -9751 -323 -12123 -30147 -33556 -10788 115
$$ packed form
14628c266m0396l7375r675N4364M2662k362k6921j1989l7413N0876L9941o3722
14616d5276j4466M4796J6947M9960L198o1654j933J2000j0480K2519M8549j8148
14604D6012m9104J6230M9447m1418m7680q432O909N1767r909J7520K8497L3211
14592I3050K2161l9286m6743n551K3659K1084k0099k3510l1196j4353O692K161
14580a1931N478L3016N051l3295o502M3961n892k4117Q285J5701q064L4122l2761
14567B3052m5503O6664M1961R083k3564k7331o303K2231M3575m3248m2591o9226
14555e1200K3729L0215l9928l8836l1040O2454J7060J1218K1705M208M212J9055
14543C2852J9986k253p733j8797m6128J3512j190R428j1800j8024l409K2768J0903
$$ plain form
14530 115 -6982 -6451 55996 76669 24636 12756 -21988 -14909 21275 -6810 8193 -14036 -8336
14517 -8336 -5552 -2592 -13296 -51282 -57290 -14970 12372 17044 16881 36109 24261 -31465 -29749
14504 -29749 -29373 -44790 -88116 -106810 -92339 -64990 -25237 38803 38385 -3571 -16343 -10109 -11080
14491 -11080 8907 16077 4280 -23862 -34561 -41015 -23376 -23749 -62412 -82002 -49274 -23317
14479 -23317 -18382 -40927 -34617 -7958 -19260 -26968 -33008 -20391 -8705 22921 -14194 -31616
14467 -31616 -3242 11166 16575 30725 60174 40754 17509 -19199 -14595 -45924 -88131 -71324
14455 -71324 -19169 25169 24465 36578 43207 21567 -44792 -111808 -100050 -67086 -24764 -52790
14443 -52790 -100649 -101429 -92368 -63537 -37963 -63771 -86535 -83090 -75655 -41192 -9394 34837 16971
$$ packed form
14530A15p097N31O2447K0673n2033j1880l4744P079L6184k8085J5003k2229N700
14517h336K784K960j0704l7986o008M2320K7342M672j63J9228j1848n5726J716
14504b9749L76j5417m3326j8694J4471K7349L9753O4040m18m1956j2772O234r71
14491a1080J9987P170j1797k8142j0699o454J7639l73l8663j9590L2728K5957
14479b3317M935k2545O310K6659j1302p708o040J2617J1686L1626l7115j7422
14467c1616K8374J4408N409J4150K9449j9420k3245l6708M604l1329m2207J6807
14455g1324N2155M4338p04J2113O629k1640o6359o7016J1758L2964M2322k8026
14443e2790m7859p80R061K8831K5574k5808k2764L445P435L4463L1798M4231j7866
$$ plain form
14430 16971 10603 16172 -5442 23737 11295 -21285 -30229 -56388 -58249 -79895 -60646 -7147
14418 -7147 3513 46518 31806 9957 20400 41697 19673 50829 32801 -28027 -82228 -77132
14406 -77132 -114518 -120941 -98092 -57509 31744 -27508 -71269 -82234 -46703 -16512 11765 44829
14394 44829 -4946 -32198 -9337 31201 35266 18743 -32013 -70664 -53736 -41929 -50468 -62860
14382 -62860 -53603 -39309 -61744 -53483 -17333 -24754 -85118 -83310 -67175 -31341 -22094 1091 22079
14369 22079 21274 48959 -34315 -49227 -12274 47754 29021 -54141 -106792 -61513 -27117 -49986
14357 -49986 -8104 -5488 -37656 -12210 1383 -3638 -8506 14831 -17945 -6129 -3896 27227
14345 27227 57552 57337 71349 65847 7725 -17035 -48727 -43470 -40374 -41106 -44218 -25569 -20814
$$ packed form
14430A6971o368N569k1614K9179j2442l2580q944k6159j861k1646J9249N3499
14418g147J0660M3005j4712k1849J0443K1297k2024L1156j8028o0828n4201N096
14406g7132l7386o423K2849M0583Q9253n9252m3761j0965L5531L0191K8277L3064
14394D4829m9775k7252K2861M0538M065j6523n0756l8651J6928J1807q539j2392
14382f2860R257J4294k2435Q261L6150p421o0364J808J6135L5834R247K3185K0988
14369B2079q05K7685q3274j4912L6953O0028j8733q3162n2651M5279L4396k2869
14357d9986M1882K616l2168K5446J3593n021m868K3337l2776J1816K233L1123
14345B7227L0325k15J4012n502n8122k4760l1692N257L096p32l112J8649M755
$$ plain form
14332 -20814 -78275 -75339 -60706 4926 9640 -29939 -31967 -39964 -64802 -11728 -17126 15645 80515
14319 80515 88914 49295 56588 47115 21735 -32049 -35384 -39539 -72951 -82627 -31557 -1592 -11686
14306 -11686 -9833 -3623 7378 -37517 -39183 -45847 -27781 -19487 -37298 -49063 -53059 -25764 11935
14293 11935 27822 13116 -19837 -27595 -7116 -51521 -71386 -52782 -46600 -73388 -79171 -80878
14281 -80878 -49357 -31315 16916 22513 6103 -44880 -100401 -93915 -82506 -72434 -8074 44767
14269 44767 19879 -1307 -30553 -23224 -55990 -76878 -55452 -39421 -47166 -12569 19047 21696
14257 21696 17468 46018 44809 45511 40324 16448 -10468 18938 -4218 -45615 -45618 10822 43207
14244 43207 38096 15383 -18623 -48808 -39747 14222 39208 22456 -2595 13006 -4497 -19849
$$ packed form
14332b0814n7461K936J4633O5632M714l9579k028p997k4838N3074n398L2771O4870
14319H0515Q399l9619P293r473k5380n3784l335m155l3412r676N1070K9965j0094
14306a1686J853O210J1001m4895j666o664J8066Q294j7811j1765l996K7295L7699
14293A1935J5887j4706l2953p758K0479m4405j9865J8604O182k6788n783j707
14281h0878L1521J8042M8231N597j6410n0983n5521O486J1409J0072O4360N2841
14269D4767k4888k1186k9246P329l2766k0888K1426J6031p745L4597L1616K649
14257B1696m228K8550j209P02n187k3876k6916K9406k3156m1397lN6440L2385
14244D3207n111k2713l4006l0185R061N3969K4986j6752k5051J5601j7503j5352
$$ plain form
14232 -19849 -21471 -66640 -64252 -58628 -96589 -96135 -70371 -87206 -115698 -110631 -56670 -18283 -43366
14219 -43366 -22594 3130 729 -32324 -21374 -55596 -53297 -52450 -33563 -64431 -46420 -27294
14207 -27294 -47948 -24658 -463 852 11434 11984 10475 -7689 -2013 -15784 -31629 8629 13368
14194 13368 6592 22513 27659 11264 -29642 -53330 -16301 29894 33121 22935 32800 65555
14182 65555 31265 -17780 -6913 13163 47638 56016 14089 -23580 -728 12109 27694 42409
14170 42409 7053 7490 -33736 -82404 -76265 -53359 -46937 -13990 11376 -46846 -24944 -6497
14158 -6497 4452 26594 35910 25341 32717 15754 -12899 -48605 -51909 -35658 -41173 -25220 13613
14145 13613 -16392 -52708 -48627 -56518 -18180 -42576 -89805 -69239 -32859 -16995 -1673 20605
$$ packed form
14232a9849j622m5169K388N624l7961M54K5764j6835k8492N067N3961L8387k5083
14219d3366K0772K5724k401l3053J0950l4222K299Q47J8887l0868J8011J9126
14207b7294k0654K3290K4195J315J0582N50j509j8164N676j3771j5845M0258M739
14194A3368o776J5921N146j6395m0906k3688L7029M6195L227j0186R865L2755
14182F5555l4290m9045J0867K0076L4475Q378m1927l7669K2852J2837J5585J4715
14170D2409l5356M37m1226m8668O139K2906O422L2947K5366n8222K1902J8447
14158f497J0949K2142R316j0569P376j6963k8653l5706l304J6251n515J5953L8833
14145A3613l0005l6316M081p891L8338k4396m7229K0566L6380J5864J5322K2278
$$ plain form
14133 20605 -10834 -26833 -23896 -34515 -51115 -62992 -10017 11348 9054 -31598 -75145 -69076
14121 -69076 -93931 -101175 -20551 -17174 -17428 -4698 -13708 -37855 -30124 9412 18943 -8188 13361
14108 13361 -19506 -53114 -68685 -59573 -66602 -34987 13623 8636 -37260 -55628 -30168 -18005
14096 -18005 -38286 -83315 -39067 5229 974 15847 -9557 3049 34579 5678 -20933 -67607
14084 -67607 -124959 -80047 -26285 -34670 -28697 -32957 1767 12419 45266 56660 22609 51770
14072 51770 14400 -30239 -59142 -81553 -78657 -35968 -341 8141 40267 28912 13277 -25532
14060 -25532 -72816 -71828 -40667 -10390 14535 10754 29191 31487 25547 28140 10932 -7816 12518
14047 12518 -26559 -100303 -85807 -75604 -68181 -36219 -14619 -40780 -63167 -36860 -35232 -18979
$$ packed form
14133B0605l1439j5999K937j0619j6600j1877N2975K1365k294m0652m3547O069
14121f9076k4855p244Q0624L377k54J2730r010k4147P731L9536R531k7131K1549
14108A3361l2867l3608j5571R112p029L1615M8610m987m5896j8368K5460J2163
14096a8005k0281m5029M4248M4296m255J4873k5404J2606L1530k8901k6611m6674
14084f7607n7352M4912N3762q385N973m260L4724J0652L2847J1394l4051K9161
14072E1770l7370m4639k8903k2411K896M2689L5627Q482L2126j1355j5635l8809
14060b5532m7284R88L1161L0277K4925l781J8437K296n940K593j7208j8748K0334
14047A2518l9077p3744J4496J0203P423L1962K1600k6161k2387K6307J628J6253
$$ plain form
14035 -18979 35333 59937 62111 14629 -9271 -19597 -25745 17520 72968 60289 53929 27142
14023 27142 25681 -12354 -67239 -50667 -45037 -74698 -63047 -56242 -39295 -9943 31405 4037
14011 4037 3243 -27477 -74607 -59814 -6729 3099 32385 63179 31671 -30142 -38138 -2066 5097
13998 5097 32344 -1949 -68600 -57826 -29077 -30505 -40182 -7760 15899 49883 2217 -24870
13986 -24870 -58758 -86713 -78953 -107687 -137909 -90186 -70068 -90453 -84948 -110465 -97714 -93697
13974 -93697 -76908 -36056 -68984 -123521 -65674 -50346 11059 42393 9627 -37895 -48519 -32654
13962 -32654 -64413 -51371 -63307 -39703 -26310 -64252 -48630 -76384 -123772 -129432 -85149 -66220
13950 -66220 -68107 -37120 -23996 -21399 -30250 -67749 -50283 -39056 2912 11141 -35591 -117961
$$ packed form
14035a8979N4312K4604K174m7482k3900j0326o148M3265N5448j2679o360k6787
14023B7142j461l8035n4885J6572N630k9661J1651O805J6947K9352M1348k7368
14011D037p94l0720m7130J4793N3085R828K9286L0794l1508o1813p996L6072P163
13998E097K7247l4293o6651J0774K8749j428r677L2422K3659L3984m7666k7087
13986b4870l3888k7955P760k8734l0222M7723K0118k0385N505k5517J2751M017
13974i3697J6789M0852l2928n4537N7847J5328O1405L1334l2766m7522j0624J5865
13962c2654l1759J3042j1936K3604J3393l7942J5622k7754m7388n660M4283J8929
13950f6220j887L0987J3124K597q851l7499J7466J1227M1968Q229m6732q2370
$$ plain form
13938 -117961 -172442 -142470 -120690 -121386 -94213 -59819 -74715 -44888 27617 31658 -2714 -34151
13926 -34151 -47529 -47263 -40563 -22758 -11262 14446 47115 56457 71410 59904 -6895 -69501
13914 -69501 -79823 -101886 -94116 -74476 -98917 -115323 -117237 -107732 -113931 -86778 -47336 -11024
13902 -11024 -7813 -20649 -37807 -39885 -15910 -25794 -60179 -61323 -52129 -19927 -32255 -53525 -66686
13889 -66686 -57948 -39766 -49311 -98579 -122932 -142048 -134469 -67222 -22350 -1578 -11333 -25763
13877 -25763 -38422 -54337 -67539 -37920 3332 -40835 -104232 -126999 -112088 -75392 -25394 -7272
13865 -7272 -19949 -19581 -9434 -74367 -106522 -44564 -25708 -39873 -28344 -40781 -65250 -25255
13853 -25255 17027 45359 39540 33115 -3506 -53142 -59017 -65223 -33074 -29303 -63714 -47321 -13469
$$ packed form
13938a17961n4481K9972K1780o96K7173L4394j4896K9827P2505M041l4372l1437
13926c4151j3378K66O700J7805J1496K5708L2669R342J4953j1506o6799o2606
13914f9501j0322k2063P770J9640k4441j6406j914R505o199K7153L9442L6312
13902a1024L211j2836j7158k078K3975r884l4385j144R194L2202j2328k1270j3161
13889f6686Q738J8182r545m9268k4353j9116P579O7247M4872K0772r755j4430
13877b5763j2659j5915j3202K9619M1252m4167o3397k2767J4911L6696M9998J8122
13865g272j2677L68J0147o4933l2155O1958J8856j4165J1529j2437k4469L9995
13853b5255M2282K8332n819o425l6621m9636n875o206L2149L771l4411J6393L3852
$$ plain form
13840 -13469 -42549 -60922 -78036 -92165 -41814 10422 -4053 -49632 -32837 -46690 -62310 -30746
13828 -30746 -39494 -4359 43130 -24255 -32205 -19701 -47057 -14851 22805 21654 23330 3047
13816 3047 16485 10343 -23669 -22383 -22103 -8095 -33010 -55570 -28131 -8824 -36604 -27108 -27841
13803 -27841 13341 -14201 -21913 -10071 16145 44325 43526 -496 -16388 -39919 -37477 9447
13791 9447 10783 27512 68648 62467 64939 53835 -10661 -99126 -74061 -36805 7614 36490
13779 36490 53866 834 17428 -1592 5267 -13993 -15355 -30431 7148 37989 47044 11172
13767 11172 -16801 -4182 23076 24053 9098 -3362 -4568 -6096 -35393 -48808 -27759 20265
13755 20265 35942 -27901 -41584 -35447 -23771 -47228 -33438 -33311 -48068 -54008 -73437 -22207
$$ packed form
13840a3469k9080j8373j7114j4129N0351N2236j4475m5579J6795j3853j5620L1564
13828c0746q748L5135M7489o7385p950J2504k7356L2206L7656j151J676k0283
13816C047J3438o142l4012J286K80J4008k4915k2560K7439J9307k7780R496p33
13803b7841M1182k7542p712J1842K6216K8180p99m4022j5892k3531K442M6924
13791I447J336J6729M1136o181K472j1104o4496q8465K5065L7256M4419K8876
13779C6490J7376n3032J6594j9020O859j9260j362j5076L7579L0841R055l5872
13767A1172k7973J2619K7258R77j4955j2460j206j528k9297j3415K1049M8024
13755B0265J5677o3843j3683O137J1676k3457J3790J27j4757n940j9429N1230
$$ plain form
13743 -22207 4333 -14441 -12494 -5368 -62638 -81791 -41353 -26750 -21990 -5602 25241 5133
13731 5133 -48034 -27492 -48113 -90550 -88868 -39460 -48120 -73980 -86966 -64469 7167 -20606
13719 -20606 -33704 -38579 -44988 -26945 2707 -13172 -15422 3928 -22764 2478 -2601 -3002 29031
13706 29031 30627 44677 79734 11299 12365 48904 23582 -16307 -17341 -30080 -31107 -4771
13694 -4771 -7553 14912 14547 47389 29053 -8911 -14560 -9380 -13835 -17184 -47848 -77382 -71402
13681 -71402 -27720 -25531 -52705 -65815 -74899 -120770 -115878 -75916 -20363 -8485 1564 -56382
13669 -56382 -68073 -57298 -86428 -69538 10188 21541 -18996 -40304 -14111 -23330 -47711 -60805
13657 -60805 -50459 -57805 -48151 -54499 -57469 -50377 -68139 -63069 -37439 -15185 -61153 -76721 -53652
$$ packed form
13743b2207K6540j8774J947P126n7270j9153M0438J4603M760J6388L0843k0108
13731E133n3167K0542k0621m2437J682M9408q660k5860j2986K2497P1636k7773
13719b0606j3098m875o409J8043K9652j5879k250J9350k6692K5242n079m01L2033
13706B9031J596J4050L5057o8435J066L6539k5322l9889j034j2739j027K6336
13694d771k782K2465l65L2842j8336l7964n649N180m455l349l0664k9534N980
13681g1402M3682K189k7174j3110r084m5871M892L9962N5553J1878J0049n7946
13669e6382j1691J0775k9130J6890P9726J1353m0537k1308K6193r219k4381j3094
13657f0805J0346p346R654o348k970P092j7762N070K5630K2254m5968j5568K3069
$$ plain form
13644 -53652 -56465 -46062 -10481 -40998 -74453 -38849 -72388 -91266 -111619 -118773 -82467 -79118
13632 -79118 -37732 -9341 -7115 -10816 -21163 -3654 33309 49133 28360 22152 -4391 -32261
13620 -32261 -52278 -36574 -15130 5549 3704 8821 1569 -19277 4265 -3977 -28540 -21160 8880
13607 8880 25193 40890 -4902 -58466 -65850 -33172 -35445 -24897 -11196 1024 1465 -1800 -24485
13594 -24485 -31558 9035 51486 11302 -63479 -85864 -65309 -71051 -119690 -113249 -89693 -76871
13582 -76871 -55940 -84926 -94836 -47143 -10473 -51294 -40930 -49137 -4932 55860 16692 -20236
13570 -20236 -35053 -15830 -37332 -20604 -33061 -48339 -11212 730 4389 -58694 -31458 15997
13558 15997 14576 13616 -6183 -7384 -35985 -87251 -65039 -16409 -26123 -63039 -57038 -28983 -11307
$$ packed form
13644e3652k813J0403L5581l0517l3455L5604l3539j8878k0353p154L6306L349
13632g9118M1386K8391K226l701j0347J7509L6963J5824k0773o208k6543k7870
13620c2261k0017J5704K1444K0679j845N117p252k0846K3542q242k4563P380L0040
13607H880J6313J5697m5792n3564p384L2678k273J0548J3701J2220M41l265k2685
13594b4485p073M0593M2451m0184p4781k2385K0555n742m8639O441K3556J2822
13582g6871K0931k8986r910M7693L6670m0821J0364q207M4205O0792l9168l6928
13570b0236j4817J9223k1502J6728j2457j5278L7127J1942L659o3083K7236M7455
13558A5997j421r60j9799j201k8601n1266K2212M8630r714l6916O001K8055J7676
$$ plain form
13545 -11307 -5640 -13754 -14490 -30751 -11914 54394 106078 54057 -13471 -13082 -30881 -9115 8789
13532 8789 38430 33436 7216 -21018 705 27323 49989 28565 12434 -31290 -76697 -30330
13520 -30330 -20570 -29958 -6375 4818 -23861 -34599 -24351 -12016 53240 78024 93081 76139
13508 76139 39003 18081 30913 18113 -44279 -37695 -53502 -63204 -59205 -16041 -4595 25618
13496 25618 35966 67823 66787 35025 32050 39549 40000 34155 73468 66952 4952 23506 -8987
13483 -8987 -46990 -63948 -22185 -21711 -73945 -88389 -57259 -63551 -52778 -8227 14269 24216 19596
13470 19596 34769 38274 21433 7915 -39074 -19394 14637 12059 39116 17109 33881 69500
13458 69500 75460 -5000 -39898 -72171 -50936 -73466 -62374 -18783 40445 85862 93731 85727
$$ packed form
13545a1307N667q114p36j6261J8837O6308N1684n2021o7528L89j7799K1766J7904
13532H789K9641m994k6220k8234K1723K6618K2666k1424j6131m3724m5407M6367
13520c0330R760r388K3583J1193k8679j0738J0248J2335O5256K4784J5057j6942
13508G6139l7136k0922J2832j2800o2392O584j5807r702L999M3164J1446L0213
13496B5618J0348L1857j036l1762k975P499M51n845L9313o516o2000J8554l2493
13483h987l8003j6958M1763M74n2234j4444L1130o292J0773M4551K2496R947m620
13470A9596J5173L505j6841j3518m6989J9680L4031k578K7057k2007J6772L5619
13458F9500N960q0460l4898l2273K1235k2530J1092M3591N9228M5417P869q004
$$ [...]
##END NTUPLES=NMR SPECTRUM
##END=
