##TITLE=Analysis number 307340
Compound Code btb 09887
Project Code qc-cat
Chemist Name adomenas
##JCAMPDX= 6.0         $$ Bruker NMR JCAMP-DX V2.0
##DATA TYPE= NMR SPECTRUM
##DATA CLASS= NTUPLES
##ORIGIN= Bruker BioSpin GmbH
##OWNER= NMR
$$ XWIN-NMR		Version 3.5
$$ Thu Apr 28 10:34:27 2005 GMT Daylight Time (UT+1h)  MAYBRIDGE\NMR@NMR_250MHZ
##.OBSERVE FREQUENCY= 250.131544655141
##.OBSERVE NUCLEUS= ^1H
##.ACQUISITION MODE= SIMULTANEOUS (DQD)
##.ACQUISITION SCHEME= undefined
##.AVERAGES= 16
##.DIGITISER RES= 18
##SPECTROMETER/DATA SYSTEM= dpx250
##.PULSE SEQUENCE= zg30
##.SOLVENT NAME= CDCl3
##.SHIFT REFERENCE= (INTERNAL, CDCl3, 0, 16.522)
##AUDIT TRAIL= $$ (NUMBER, WHEN, WHO, WHERE, WHAT)
$$ ##TITLE= Audit trail, XWIN-NMR		Version 3.5
$$ ##JCAMPDX= 5.01
$$ ##ORIGIN= Bruker BioSpin GmbH
$$ ##OWNER= NMR
$$ C:\u/data/dgb/nmr/ADRS/2420/pdata/1/auditp.txt
$$ ##AUDIT TRAIL=  $$ (NUMBER, WHEN, WHO, WHERE, WHAT)
(   1,<2005-04-28 10:34:08.74 +100>,<MAYBRIDGE\NMR>,<NMR_250MHZ>,
      <created by zg, POWCHK disabled, PULCHK disabled
       configuration hash MD5:
       62 19 C7 07 E1 42 D1 B7 37 6C 3D D0 77 39 F9 E6
       data hash MD5: 64K
       C1 24 AC 55 18 6D 9C 48 00 92 5B 6B 51 22 19 25>)
(   2,<2005-04-28 10:34:19.54 +100>,<MAYBRIDGE\NMR>,<NMR_250MHZ>,
      <Start of raw data processing
       ef LB = 0.3 FT_mod = 6 PKNL = 1 SI = 32K 
       data hash MD5: 32K
       EE 9A D9 C9 29 02 29 C3 06 C8 28 1C 46 E5 5D 3E>)
(   3,<2005-04-28 10:34:21.40 +100>,<MAYBRIDGE\NMR>,<NMR_250MHZ>,
      <apk 
       data hash MD5: 32K
       43 68 39 7D D9 69 73 A7 E7 CB 82 79 9D 03 82 50>)
(   4,<2005-04-28 10:34:22.10 +100>,<MAYBRIDGE\NMR>,<NMR_250MHZ>,
      <abs ABSG = 5 
       data hash MD5: 32K
       CA 4A 38 AF 84 89 B5 98 A5 D3 10 AE FD C8 BD 2B>)
$$ ##END=
$$ 
$$ hash MD5
$$ AF 3F C0 E3 91 C6 7D 2A 7B 73 8E 2E D5 9E 90 A5
##$RELAX= 
##$RELAX= 
##$RELAX= 
##$RELAX= 
##$RELAX= 
##$RELAX= 
##$RELAX= 
$$ Bruker specific parameters
$$ --------------------------
##$DU= <C:\u>
##$EXPNO= 2420
##$NAME= <ADRS>
##$PROCNO= 1
##$TYPE= <nmr>
##$USER= <dgb>
##$AMP= (0..31)
100 100 100 100 100 100 100 100 100 100 100 100 100 100 100 100 100 100 
100 100 100 100 100 100 100 100 100 100 100 100 100 100 
##$AQSEQ= 0
##$AQ_mod= 3
##$AUNM= <au_zg>
##$AUTOPOS= <9 >
##$BF1= 250.13
##$BF2= 250.13
##$BF3= 250.13
##$BF4= 250.13
##$BF5= 500.13
##$BF6= 500.13
##$BF7= 500.13
##$BF8= 500.13
##$BYTORDA= 1
##$CFDGTYP= 0
##$CFRGTYP= 5
##$CHEMSTR= <none>
##$CNST= (0..31)
1 1 145 1 1 1 1 1 1 1 1 1 1 1 1 1 1 1 1 1 1 1 1 1 1 1 1 1 1 1 1 1 
##$CPDPRG= <>
##$CPDPRG1= <>
##$CPDPRG2= <>
##$CPDPRG3= <>
##$CPDPRG4= <mlev>
##$CPDPRG5= <mlev>
##$CPDPRG6= <mlev>
##$CPDPRG7= <mlev>
##$CPDPRG8= <mlev>
##$CPDPRGB= <>
##$CPDPRGT= <>
##$D= (0..31)
0 1 0 0 0 0 0 0 0 0.06 0 0 0 0 0 0 0.0002 0 0 0 0 0 0 0 0 0 0 0 0 0 0 
0 
##$DATE= 1114680847
##$DBL= (0..7)
120 120 120 120 120 120 120 120 
##$DBP= (0..7)
150 150 150 150 150 150 150 150 
##$DBP07= 0
##$DBPNAM0= <>
##$DBPNAM1= <>
##$DBPNAM2= <>
$$ [...]
##$SUBNAM7= <"">
##$SUBNAM8= <"">
##$SUBNAM9= <"">
##$SW= 20.6930455092707
##$SWIBOX= (0..15)
0 0 3 0 0 0 0 0 0 0 0 0 0 0 0 0 
##$SW_h= 5175.983436853
##$TD= 65536
##$TD0= 1
##$TE= 295.16
##$TE2= 300
##$TE3= 300
##$TEG= 300
##$TL= (0..7)
0 120 120 120 120 120 120 120 
##$TP= (0..7)
150 150 150 150 150 150 150 150 
##$TP07= 0
##$TPNAME0= <>
##$TPNAME1= <>
##$TPNAME2= <>
##$TPNAME3= <>
##$TPNAME4= <>
##$TPNAME5= <>
##$TPNAME6= <>
##$TPNAME7= <>
##$TPOAL= (0..7)
0.5 0.5 0.5 0.5 0.5 0.5 0.5 0.5 
##$TPOFFS= (0..7)
0 0 0 0 0 0 0 0 
##$TUNHIN= 0
##$TUNHOUT= 0
##$TUNXOUT= 0
##$USERA1= <user>
##$USERA2= <user>
##$USERA3= <user>
##$USERA4= <user>
##$USERA5= <user>
##$V9= 5
##$VALIST= <valist>
##$VCLIST= <CCCCCCCCCCCCCCC>
##$VD= 0
##$VDLIST= <DDDDDDDDDDDDDDD>
##$VPLIST= <PPPPPPPPPPPPPPP>
##$VTLIST= <TTTTTTTTTTTTTTT>
##$WBST= 1024
##$WBSW= 4
##$XGAIN= (0..3)
0 0 0 0 
##$XL= 0
##$YL= 0
##$YMAX_a= 659485
##$YMIN_a= -692974
##$ZGOPTNS= <>
##$ZL1= 120
##$ZL2= 120
##$ZL3= 120
##$ZL4= 120
##$ABSF1= 16.522
##$ABSF2= -4.171173
##$ABSG= 5
##$ABSL= 3
##$ALPHA= 0
##$AQORDER= 0
##$ASSFAC= 0
##$ASSFACI= 0
##$ASSFACX= 0
##$ASSWID= 0
##$AUNMP= <proc_1d>
##$AZFE= 0.1
##$AZFW= 0.1
##$BCFW= 0
##$BC_mod= 0
##$BYTORDP= 0
##$COROFFS= 0
##$CY= 12.5
##$DATMOD= 1
##$DC= 0
##$DFILT= <>
##$DTYPP= 0
##$F1P= 14.0000005364418
##$F2P= -0.99999901652339
##$FCOR= 0.5
##$FTSIZE= 32768
##$FT_mod= 6
##$GAMMA= 0
##$GB= 0
##$INTBC= 1
##$INTSCL= 1
##$ISEN= 128
##$LB= 0.3
##$LEV0= 0
##$LPBIN= 0
##$MAXI= 10000
##$MC2= 0
##$MEAN= 0
##$ME_mod= 0
##$MI= 0
##$NCOEF= 0
##$NC_proc= -1
##$NLEV= 6
##$NOISF1= 0
##$NOISF2= 0
##$NSP= 0
##$NTH_PI= 0
##$NZP= 0
##$OFFSET= 16.522
##$PC= 1
##$PHC0= -74.15654
##$PHC1= 5.528949
##$PH_mod= 1
##$PKNL= yes
##$PPARMOD= 0
##$PSCAL= 4
##$PSIGN= 0
##$REVERSE= no
##$SF= 250.13
##$SI= 32768
##$SIGF1= 0
##$SIGF2= 0
##$SINO= 400
##$SIOLD= 32768
##$SREGLST= <1H.CDCl3>
##$SSB= 0
##$STSI= 32768
##$STSR= 0
##$SW_p= 5175.98343685301
##$SYMM= 0
##$S_DEV= 0
##$TDeff= 65536
##$TDoff= 0
##$TI= <Analysis number 999999
Compound Code 99
Book Reference 9
Project Code 9>
##$TILT= no
##$TM1= 0
##$TM2= 0
##$TOPLEV= 0
##$USERP1= <user>
##$USERP2= <user>
##$USERP3= <user>
##$USERP4= <user>
##$USERP5= <user>
##$WDW= 1
##$XDIM= 32768
##$YMAX_p= 277644322
##$YMIN_p= -88074
$$ End of Bruker specific parameters
$$ ---------------------------------
##NTUPLES= NMR SPECTRUM
##VAR_NAME=  FREQUENCY,     SPECTRUM/REAL,   SPECTRUM/IMAG
##SYMBOL=    X,             R,               I
##VAR_TYPE=  INDEPENDENT,   DEPENDENT,       DEPENDENT
##VAR_FORM=  AFFN,          ASDF,            ASDF
##VAR_DIM=   32768,         32768,           32768
##UNITS=     HZ,            ARBITRARY UNITS, ARBITRARY UNITS
##FACTOR=    0.157963299565203, 1,           1
##FIRST=     4132.6476996994, 0,             0
##LAST=      -1043.33573715361, 0,           0
##MIN=       -1043.33573715361, -88074,      0
##MAX=       4132.6476996994, 277644322,     0
$$ Real data points
##PAGE= N=1
##DATA TABLE= (X++(R..R)), XYDATA
$$ [...]
16069I986R35j086j481R43k386L76K026J606M48o51l06k882O85J420J527P70j211
16052A0719J184q95k646l00J925J626J026k099k394m1R83j733k249J429K78m075
16036B738j231o18K444J561R18k3R64J687l66j382k092q22K265J470j083k415
16020D015l13N460J002k960p85j392p35j28M168L190l597j45K201N49J106O20
16004A2256j95K17k782K21O744K728L05m251k45K914L239L340L403L993L015L348
15988C8250K773M223r43o88k979k827J809m922p390l064J070J925j857m514J059
15973B1925J043L756J484o135J191M180N00k78J530J151j966r94n85J571M020
15958C2393J40k322n751p90K176N234L230J009k382l748j237J625K010M21K37
$$ plain form
16069 9986 10921 9835 8354 9297 6911 7287 9313 10919 11367 10716 10410 7528 8213 9633 11160 11930 10719
16052 10719 11903 11008 8362 8062 9987 11613 12639 10540 8146 8105 9088 7355 5106 6535 6813 2738
16036 2738 1507 889 3333 4894 5812 5789 6753 8440 8074 6692 4600 3778 6043 7513 6430 4015
16020 4015 3702 9162 10164 7204 6419 5027 4292 4164 8332 11522 7925 7780 9981 10530 11636 12256
16004 12256 12061 12278 9496 9717 16461 19189 19494 15243 14998 17912 21151 24491 27894 31887 34902 38250
15988 38250 41023 45246 44303 43615 40636 37809 39618 34696 27306 24242 25312 27237 25380 20866 21925
15973 21925 22968 26724 28208 22073 23264 27444 27944 27666 29196 30347 28381 27387 26802 28373 32393
15958 32393 32533 30211 24460 23670 25846 31080 34310 35319 32937 29189 27952 29577 31587 32008 32245
15943C2245J847q72j495J667K903L641j225J13J065J51j85O30K891L73j731q08
15927D1210M567o48n076o88J695n95J901K035N082P473J532m49K053K890K330
15912F5312L143L298N225L231L604m51L775M760J080L090O067O860O685M321O535
15897A26535O029Q063O020O275J0194Q512J1901J5085J3242K3889K7571K8847
15885B92163L3496L6556M4814N3631O2846P8770R7053J14699J42758J73602J99234
15874A329622K24035K51044K80572L18333L74701M60863N88016P77409J044414
15865E649009J390027J767967K077849K140987J872900J291054M05893m86445
15857A6109241j246150j799790k020852j957704j712373j363276j013652p31776
$$ plain form
15943 32245 34092 33220 31725 33392 36295 39936 38711 38824 39889 40040 39855 40485 43376 43749 42018 41210
15927 41210 45777 45129 40053 39365 41060 40465 42366 44401 49483 56956 58488 58039 60092 62982 65312
15912 65312 68455 71753 76978 80209 83813 83362 87137 91897 92977 96067 102134 108994 115679 120000 126535
15897 126535 132564 140627 146647 152922 163116 171628 183529 198614 211856 235745 263316 292163
15885 292163 325659 362215 407029 460660 523506 602276 699329 814028 956786 1130388 1329622
15874 1329622 1553657 1804701 2085273 2403606 2778307 3239170 3827186 4604595 5649009
15865 5649009 7039036 8807003 10884852 13025839 14898739 16189793 16595686 16109241
15857 16109241 14863091 13063301 11042449 9084745 7372372 6009096 4995444 4263668
15849D263668n42795m33358l63094l21675k92593k62367k36461k13879j85617
15840A411829j62761j44500j18257j03642q5081p0382o6681n5917m9480m4464
15830E10664l5967l6795l7598l4926k7813k6693k4014k3322k0546j5770j6446
15819B10774j4727j1095j0193j1498j0790p479p990n519o999n883p650q056m439
15806I8456n069m520l203l569k227k043j766j135k409l315l366j775k575n354
15792E6130j377Q02j769o552j411J028p10m952j416P35l68m203o16j143k586j407
15776C0185k313k752k16O45K838l86r64J19N20J374K319r25J511q86q11J745J791
15759C3794k954J35l158j62P51n52j108j445K08Q85j042j539L622o5m555l167
$$ plain form
15849 4263668 3720873 3287515 2924421 2602746 2310153 2047786 1811325 1597446 1411829
15840 1411829 1249068 1104568 986311 882669 797588 727206 660525 604608 555128 510664
15830 510664 474697 437902 400304 365378 337565 310872 286858 263536 242990 227220 210774
15819 210774 196047 184952 174759 163261 152471 144992 137002 131483 124484 118601 110951 102895 98456
15806 98456 93387 88867 85664 82095 79868 77825 76059 74924 72515 69200 65834 64059 61484 56130
15792 56130 54753 55555 53786 47234 45823 46851 46141 41189 39773 40508 40140 35937 35321 34178 31592 30185
15776 30185 27872 25120 24904 25549 28387 28001 27037 27156 27676 29050 31369 30444 31955 31069 30258 32003 33794
15759 33794 30840 30975 27817 27655 28406 27854 26746 25301 25509 26394 25352 23813 27435 27370 22815 19648
15743A9648O83K6K006J226J10M31j095j490k913j855l5K546Q51j035j371j811
15727A5922n03j949j41k201k560K412L448M922L448R22O10J094K596O15J350l063
15711B6922o314r15J811K426M609K54j889L286L685J225K677N275O596R922P362
15696F6932J2387J0853J3138J3662J6215J9978K8869M3567N4486O9005P6334P9127
15684E04553O5894L5762M546k0953n2644p3683p5959o9710n9480m9027l4553k9403
15672A45343j8825j4676j0571q351j3299j2158p702n482j476m216n141l507k880
15659C7059n228k774j147k243j371k5l524j10j087l256j287j554n490K471r81
15644I453j267j065j431k473j433j688L491L510P87J721m376l386j738k901J26
$$ plain form
15743 19648 20331 20357 22363 23589 23699 24130 23035 21545 18632 16777 16742 19288 20139 19104 17733 15922
15727 15922 15419 13470 13329 11128 8568 10980 14428 19350 22798 23720 24330 25424 28020 28635 29985 26922
15711 26922 20608 19693 21504 23930 28539 28793 26904 30190 33875 35100 37777 43052 49648 59570 66932
15696 66932 79319 90172 103310 116972 133187 153165 182034 225601 280087 349092 425426 504553
15684 504553 570447 606209 610755 589802 537158 463475 387516 317806 258326 209299 174746 145343
15672 145343 126518 111842 101271 92920 79621 67463 59761 54279 52803 48587 43446 39939 37059
15659 37059 31831 29057 27910 25667 24296 24271 20747 20637 19550 16294 15007 13453 7963 10434 9453
15644 9453 8186 7121 5690 3217 1784 96 3587 7097 7884 9605 5229 1843 105 -2796 -2670
15629b670L104L73J574K627k38K017K446ln45m807K671j177k390J652K795O32
15613H061l336k557j935n1L056l05k457j183j084j100j786p67n05P15J117J291
15597b826J994j897l845K899K548J358J791K819J819j940j366K877P95j287j716
15582D023o61k370j092J893k306k798J276L100k098p87j163o56J973l179j087
15567e932J273J071j000j603M97k246Q93J190j469o53K087K564K917k77J698J435
15551B445K287j211L37J632M098K421j851k038j307L99R33O65k913k201o62j572
15535A462J874L171J295o40j359j742l493m69K175n60r88L90j387k48Q66j505
15519a158j065K943J030M619J547j297l467n22k776M14N09M57J649q4k257l327
$$ plain form
15629 -2670 434 807 2381 5008 4770 6787 9233 9230 8685 3878 6549 5372 2982 4634 7429 8061
15613 8061 4725 2168 233 182 3238 2933 476 -707 -1791 -2891 -4677 -5444 -5949 -5234 -4117 -2826
15597 -2826 -832 -2729 -6574 -3675 -1127 231 2022 4841 6660 4720 3354 6231 7026 5739 4023
15582 4023 3362 992 -100 1793 -513 -3311 -2035 1065 -1033 -1820 -2983 -3639 -1666 -4845 -5932
15567 -5932 -4659 -3588 -4588 -6191 -5694 -7940 -7047 -5857 -7326 -7979 -5892 -3328 -411 -688 1010 2445
15551 2445 4732 3521 3858 5490 9588 12009 10158 8120 6813 7212 8145 8810 5897 3696 3034 1462
15535 1462 3336 6507 7802 7162 5803 4061 568 99 2274 1714 726 1116 -271 -519 347 -1158
15519 -1158 -2223 720 1750 6369 7916 6619 3152 2630 -146 268 777 1234 2883 2799 542 -2785
15503b785L009J488k141k245L255K679j919j529l117K770K451J131J496k038J09
15488B614n21k8j149k817j403J394M260J867l91K273k510j100j99k855n67L208
15472B076k40j518J028n6J186M062j09n29k020o85j374k218o02J526K156R0o81
15455B092j743J325o65m238J75P82k685M55p79L253J923R84K510m564m98j125
15439b798j79J736O62J562j855K619K178k66J289m151k289K181J829j553j721
15424g56R07J470r94k063p34L631L339l888m113j696L983N130j558k489k852j149
15408c832R27R04M12K089j64m607k374L834K996Q70j74k202o04l510j003J675
15392d763O19K522P09K500P94M05O70k310k287Q72k521M1J445j896J26L944J666
$$ plain form
15503 -2785 224 1712 -429 -2674 581 3260 1341 -188 -3305 -535 1916 3047 4543 2505 2614
15488 2614 2093 2065 916 -1901 -3304 -1910 2350 4217 3826 6099 3589 2489 2290 -565 -1132 2076
15472 2076 1836 318 1346 1290 2476 6538 6429 5900 3880 3195 1821 -397 -999 527 2683 2773 2092
15455 2092 349 1674 1009 -3229 -3054 -2272 -4957 -4502 -5281 -2028 -105 879 3389 -1175 -1673 -2798
15439 -2798 -2977 -1241 -579 983 -872 1747 3925 3659 4948 797 -1492 689 2518 965 -756
15424 -756 151 1621 627 -1436 -2170 1461 4800 912 -3201 -4897 -914 4216 2658 169 -2683 -3832
15408 -3832 -2905 -2001 -1589 500 336 -4271 -6645 -2811 185 1055 881 -1321 -1925 -5435 -6438 -4763
15392 -4763 -4144 -1622 -913 1587 2381 2786 3456 1146 -1141 -269 -2790 -2749 -1304 -3200 -3074 870 2536
15375B536k991k825q99K097L35k829L348K667L14L8j348k667o97J859l566J413
15359c215K678K010q71k014Q54j440K352R72q37K918K076J431J57l057k431l438
15343a855K621J655J67l661j580l72L34N30M68K8l8j673J496K851R24k791m199
15326e095J884J951j353J002M098L537O16k499P06J12r23j903j555O24l070L65
15310a503J226l075n16L088L788P71p16o01m75J247j381Q13K350N64l3o060m992
15293e505M231K303l515k776r25J180N656J840l074m862K185K816k111J720j910
15278b747j827j618j871l198K236K581J69K857k538P5L056K18J797p50Q83m14
15262a091k225m933k524J426K275K513L022j247k70j477K943n47K722L070N16
$$ plain form
15375 2536 -455 -3280 -4179 -2082 -1747 -4576 -1228 1439 1753 1791 443 -2224 -2921 -1062 -4628 -3215
15359 -3215 -537 1473 602 -1412 -558 -1998 354 1326 489 3407 5483 6914 7071 4014 1583 -1855
15343 -1855 766 2421 2588 -1073 -2653 -3025 -2691 -2161 -1693 -1665 -1703 -3376 -1880 971 1895 -896 -5095
15326 -5095 -3211 -1260 -2613 -1611 2487 6024 6640 4141 4847 4959 4036 2133 578 1202 -1868 -1503
15310 -1503 -277 -3352 -3868 -780 3008 3779 3063 2462 1987 3234 1853 2666 5016 5580 5547 -513 -5505
15293 -5505 -1274 1029 -2486 -5262 -6187 -5007 649 2489 -585 -5447 -3262 -446 -2557 -837 -2747
15278 -2747 -4574 -6192 -8063 -11261 -9025 -6444 -6275 -3418 -5956 -5881 -2825 -2607 -810 -1560 -677 -1091
15262 -1091 -3316 -8249 -10773 -9347 -7072 -4559 -1537 -2784 -3054 -4531 -1588 -2135 587 3657 4173
15247D173m835k734l492l52L613M52L48K729J753n32L87L65j877J136r36p08j488
15230a998j238K033J330j946j85J918l027k00K522p98L32j162O10J505j431j940
15214c675L83K394l52K773J424k611L81j7j303k118J08K972J447k550j561l093
15198e398o81J660M52K686J259k533J817k76l664k30j226O48J018M181L86J262
15182A361j709J526K581n17Q26J147k205k473j642l71J680K043J280l46k829l217
15166b865o78J541J060j119r53j622K062J975J025q51k690l957r48j14N23K392
15150e219J856K039o74k604Q59K562L340R67j128k286k943m481R98J735J70L805
15134a004L282m040n500M06K926Q01K389O59p9l82j866k3R86J14J759J848P24
$$ plain form
15247 4173 -662 -3396 -6888 -7240 -3627 -3175 -2827 -98 1655 1123 1510 1875 -2 1134 198 -510 -1998
15230 -1998 -3236 -1203 127 -1819 -2004 -86 -3113 -3313 -791 -1589 -1257 -2419 -1809 -304 -1735 -3675
15214 -3675 -3292 -898 -1250 1523 2947 336 717 700 -603 -2721 -2613 359 1806 -744 -2305 -5398
15198 -5398 -6079 -4419 -3967 -1281 -22 -2555 -738 -1014 -4678 -4908 -6134 -5486 -4468 -287 99 1361
15182 1361 -348 1178 3759 3242 4068 5215 3010 537 -1105 -1476 204 2247 3527 3181 352 -2865
15166 -2865 -3543 -2002 -942 -2061 -3014 -4636 -2574 -599 426 -425 -3115 -7072 -8020 -8134 -7611 -5219
15150 -5219 -3363 -1324 -1998 -4602 -3743 -1181 2159 3126 1998 -288 -3231 -7712 -6714 -4979 -4809 -1004
15134 -1004 2278 -1762 -7262 -6856 -3930 -3129 -740 -81 -160 -542 -2408 -2431 -1445 -1331 428 2276 3000
15117C000J067j299K29j884l224L635K352n072m33J124j845p46K229N340K113
15102F586n33l076k232j141k519l45j41J152K244j462j462j718K100n5K488K57
15086A43k237m95j313m854r28P114K722r77R2o75k233K948p3L604J827m134k360
15069a829R34m04r13p42j676J597J306J896j643M95M89m55j453J97M292K499K2
15052D612k196j821m74j296K373k1m167j545o15M80J339l87j134J595K78K715
15036b64j876k275J633O384K573p72j792k183j432l540n95o38L69L077L643l814
15020a502n713j540J699p12o36K150J327R80N33K235j563j903k051J955M58O68
15004c615P23l639j80J437K5j279m241j082J861K290K439N981K871m08J646K64
$$ plain form
15117 3000 4067 2768 2997 1113 -2111 1524 3876 -1196 -1629 -505 -2350 -3096 -867 4473 6586
15102 6586 6053 2977 745 -396 -2915 -3260 -3401 -2249 -5 -1467 -2929 -4647 -2547 -2602 -114 143
15086 143 -2094 -2589 -3902 -8756 -9684 -2570 152 -825 -733 -1408 -3641 -693 -766 2838 4665 531 -1829
15069 -1829 -895 -1299 -2212 -2954 -4630 -3033 -1727 169 -1474 -979 -490 -945 -2398 -2201 2091 4590 4612
15052 4612 2416 595 121 -1175 1198 1177 -2990 -4535 -5150 -4670 -3331 -3718 -4852 -3257 -2979 -264
15036 -264 -2140 -4415 -2782 3602 6175 5403 3611 1428 -4 -3544 -4139 -4777 -4408 -1331 2312 -1502
15020 -1502 -7215 -8755 -7056 -7768 -8404 -6254 -4927 -3947 -3414 -1179 -2742 -4645 -6696 -4741 -4283 -3615
15004 -3615 -2892 -6531 -6711 -5274 -5249 -6528 -10769 -11851 -9990 -7700 -5261 720 3591 3183 4829 5093
14988E093n204l716O41M28k775o54J875J983j007o45K072K120J585j043J166k266
14972c47R06J802k308J7K594L446j2l409j911j012K151J176J547l172m025o091
14956h648K74L282L133L787p91r23J429n42j470j232J092j285J76L601R12k586
14940B09j339l16k174k721k0L213M084J5r05J633m3k613k972k025j866L94J785
14923e661J960L365n65L525J514k802m90n1r48L598p2k953j346j325p55J256M158
14906B408K297k774k001l687j759M879l39k839k737J362K607J690K887J041k13
14891B822p33j015j208q40p51k693M81J363k753m32L847k345o27K014M94J37k99
14874b538o31j130K020j946j040r20J864l384O98J921J039K20r10l357k55N146
$$ plain form
14988 5093 -111 -3827 -3186 -2758 -5533 -6187 -4312 -2329 -3336 -3981 -1909 211 1796 753 1919 -347
14972 -347 559 2361 53 70 2664 6110 6098 2689 778 -234 1917 3093 4640 1468 -2557 -8648
14956 -8648 -8374 -5092 -1959 1828 1037 114 1543 1001 -469 -1701 -609 -1894 -1718 1883 2795 209
14940 209 -1130 -1446 -3620 -6341 -6361 -3148 936 951 46 1679 1636 -977 -3949 -5974 -7840 -7446 -5661
14923 -5661 -3701 -336 -901 2624 4138 1336 846 795 -153 3445 3373 420 -926 -2251 -3006 -1750 2408
14906 2408 4705 1931 -70 -3757 -5516 -637 -976 -3815 -6552 -5190 -2583 -893 1994 3035 2822
14891 2822 2089 1074 -134 -974 -1725 -4418 -3937 -2574 -5327 -5759 -1912 -4257 -4884 -2870 -2376 -2239 -2538
14874 -2538 -3169 -4299 -2279 -4225 -5265 -6185 -4321 -7705 -7007 -5086 -4047 -3827 -4737 -8094 -8349 -3203
14858c203L264J654K540r23k979j780M26J685P76M56j559J045O38p91j43K697
14842C803L407J259l006n835M15k9J120j135k955n12k80J614J809j329m01M207
14826B152K521k769n671l348J750L730K808K128Q5j935k59R85r26j449k284M511
14810B029L35j250j186j671j520R15K727J872k548J158K035k492M88j806l05P72
14794d47k154k51K216J286j30j627k974j249j962M15L292K288J172Q24m775K96
14778c780K226J222K797l94J697l04q51l84O30j782M41L371j029j65j570m466
14762b341P63m68J059K727J878j576l277N50r21j050o22p46k738k454K485N436
14746a295J825J600K727L86k51j212N6k876J685N08q06J120j001N33l25l533l495
$$ plain form
14858 -3203 61 1715 4255 3332 353 -1427 -1001 684 1460 1916 357 1402 2040 1249 1106 3803
14842 3803 7210 8469 5463 -372 43 14 1134 -1 -2956 -3468 -3748 -2134 -325 -1654 -2055 2152
14826 2152 4673 1904 -3767 -7115 -5365 -1635 1173 3301 3386 1451 1192 2177 1251 -198 -2482 2029
14810 2029 2364 1114 -72 -1743 -3263 -2348 379 2251 -297 861 2896 404 892 -914 -1219 -447
14794 -447 -2601 -2852 -636 650 520 -1107 -4081 -5330 -7292 -6877 -3585 -1297 -125 699 -4076 -3780
14778 -3780 -1554 -332 2465 2071 3768 3464 2613 2229 2859 1077 1518 4889 3860 3695 2125 -2341
14762 -2341 -1578 -2046 -987 1740 3618 2042 -1235 -685 -1606 -2656 -3278 -4024 -6762 -9216 -6731 -1295
14746 -1295 530 2130 4857 5243 4992 3780 3836 960 2645 3153 2347 3467 2466 2999 2674 -859 -4354
14729d354j081J796K480j460L44L86J257O88K061K388J106Q83j737m270l146j200
14713c859q19j86q66J326L642R63l343J24K927K253K707n310k832l231O07r71
14697f868N04K404K464O91j945N06K002j168n41L663K212k456k932J121K492p3
14681B076K0r00j723j421K37L10j900j75N90m84l812j390K675K535N204J910R29
14664D681j091j427j534J720K140N41Q57j581j917m5J324o13j632J864j037j592
14648F58q09L010J385l486j10l11L709J938J0k902l727j583j883Q82J763K606
14632A150J702r07j863j044q13K234J303k071K34L92o75K69j66R87K772K613q59
14615E258l892R87L770J322r71l602K805j004j732r76o79j175m78m802l49K507
$$ plain form
14729 -4354 -5435 -3639 -1159 -2619 -2275 -1889 -632 56 2117 4505 5611 6494 4757 487 -2659 -3859
14713 -3859 -4678 -4864 -5730 -4404 -762 201 -3142 -3018 -91 2162 4869 -441 -3273 -6504 -5897 -6868
14697 -6868 -6364 -3960 -1496 -805 -2750 -2244 -242 -1410 -1951 1712 3924 1468 -1464 -343 2149 2076
14681 2076 2096 1196 -527 -1948 -1711 -1401 -3301 -3476 -2886 -3370 -7182 -8572 -5897 -3362 1842 3752 4681
14664 4681 3590 2163 629 2349 4489 5030 5887 4306 2389 2344 3668 3055 1423 3287 2250 658
14648 658 -151 2859 4244 758 648 337 4046 5984 5994 3092 -635 -2218 -4101 -3219 -1456 1150
14632 1150 2852 1945 82 -962 -1775 459 1762 -309 -75 317 -358 -89 -255 732 3504 6117 5258
14615 5258 1366 2353 6123 7445 6474 2872 5677 4673 2941 1965 1286 111 -367 -5169 -5518 -3011
14599c011K668j260J940K497r46j801P29Q64J985j881k040K729K244J41l953l771
14583b866j062K77K407P47o14K390k91J26P97k605j45j379N50K139j4k041o22
14566b206P2l43J074r3O44j522l66j024k531n14J534L109K827O9k362j604k163
14549e399Q69n35J200j939p98J170J205L271j329j95k117J783J959J80j51K062
14533A236l054j773J733L652k543j143J991k552l078K170J753j896J158J518l059
14518c887k430J931N148K247q20l230n51r12K164J341K20l951n68J532J064J916
14502A214l3R14M75j4o990l849L440J797K660n69J453L905m644k503L105j805
14486a444j496K442J929r87l201j631q83K093M19m05R04K003o8J021m84k612j071
$$ plain form
14599 -3011 -343 -1603 337 2834 1888 87 816 1680 3665 1784 -256 2473 4717 4858 905 -2866
14583 -2866 -3928 -3651 -1244 -497 -1111 1279 988 1114 1911 -694 -839 -2218 -1668 471 457 -1584 -2206
14566 -2206 -2134 -2477 -1403 -1496 -852 -2374 -2740 -3764 -6295 -6809 -5275 -2166 661 730 -1632 -3236 -5399
14549 -5399 -4530 -5065 -3865 -5804 -6602 -5432 -4227 -956 -2285 -2480 -4597 -2814 -855 -675 -826 1236
14533 1236 -1818 -3591 -1858 1794 -749 -1892 99 -2453 -5531 -3361 -1608 -3504 -2346 -828 -3887
14518 -3887 -6317 -4386 762 3009 2189 -1041 -1592 -2504 -340 1001 1221 -2730 -3298 -1766 -702 1214
14502 1214 1181 2095 2570 2556 -4434 -8283 -4843 -3046 -386 -955 498 4403 -241 -2744 361 -1444
14486 -1444 -2940 -498 1431 444 -2757 -4388 -5271 -3178 -2759 -3164 -2260 -257 -325 696 212 -2400 -3471
14469c471K558K013k238j955J132M18J026M26m73M560j625m437J924k871N51O35
14453a827j788j067L456M819R15k556j38J721J786l434k165j669j197J220L722
14438A798j899n747q77J351K448M636Q40k761m653J552Q82n09K309j000K295j548
14422h83j704pL250J717m521m811K495K682P43R13m85k007j110K661J281m34k583
14405b803l907k769N365M35q14k12M044K636j106q8J386J775k246n650j218J675
14389c497K828O27J895r24j068J424L604k348k326m56j138P95J874j372n050L12
14373d820K426K018J944P28Q2l50k997n76P26L934j057l419k490P19j312M73J310
14356b661L109K916l865r80J259J93K947N58k583m071k422m27J924l45j11j761
$$ plain form
14469 -3471 -913 1100 -1138 -3093 -1961 -1543 -517 -91 -564 3996 2371 -2066 -142 -3013 -2462 -1827
14453 -1827 -3615 -4682 -1226 3593 4508 1952 1814 3535 5321 1887 -278 -1947 -3144 -1924 1798
14438 1798 -101 -5848 -6725 -5374 -2926 1710 2550 -211 -4864 -3312 -2430 -2939 -630 -1630 665 -883
14422 -883 -2587 -2594 656 2373 -2148 -6959 -4464 -1782 -1039 -126 -611 -2618 -3728 -1067 214 -220 -2803
14405 -2803 -6710 -9479 -4114 -3679 -4493 -4705 -661 1975 869 781 2167 3942 1696 -3954 -5172 -3497
14389 -3497 -669 -42 1853 929 -139 1285 4889 2541 215 -241 -1379 -584 1290 -82 -5132 -4820
14373 -4820 -2394 -376 1568 2296 2378 2028 -969 -1545 -819 3115 2058 -1361 -3851 -3132 -4444 -3971 -2661
14356 -2661 448 3364 -501 -1481 -222 -29 2918 3476 893 -3178 -5600 -6027 -4103 -4448 -4559 -6320
14340f320k91M415K00K392m73j556l81K456M47k208m020K220J575Q33k117k402
14324e230J228L072J016J6o61O80K247j26J06q53q4j873J60R90L500P2k678m490
14306b908k589K795j238k348J823J461O33N35M453k699j433j181j368K25J656
14291b183K07j691J090K851Q27p49o88k920O95l75j616P74K872r56j011n95L900
14274D32O31L34N77j208k216j392M79N61J39K283j126J047J72J864k386q37K292
14257A646l77o25k942M7J182k567o52N51M430M174j180l869l813j924N03L730
14241a686M227L509r60p07j391l387k019k020P5J336K87K018p25m474j414K698
14225d633J940N08q60j154J834o66n29M718J828k871k918k987l887PL820P23N008
$$ plain form
14340 -6320 -6611 -2196 -1996 396 -77 -1633 -2014 442 889 -1319 -5339 -3119 -1544 -711 -2828 -5230
14324 -5230 -4002 -930 86 102 -559 121 2368 2242 2348 1495 1411 -462 -302 688 4188 4260 1582 -2908
14306 -2908 -5497 -2702 -3940 -6288 -4465 -3004 -2371 -1836 2617 -82 -1515 -2696 -4064 -3839 -2183
14291 -2183 -1976 -3667 -2577 274 1101 352 -336 -3256 -2561 -2936 -4552 -3778 -906 -1862 -2873 -3468 432
14274 432 1063 1397 1974 766 -1450 -2842 -2363 -1802 -1663 620 -506 541 713 2577 191 -646 1646
14257 1646 1269 644 -2298 -2251 -1069 -3636 -4288 -3737 693 4867 3687 -182 -3995 -5919 -5416 -1686
14241 -1686 2541 6050 5090 4383 2992 -395 -2414 -4434 -4359 -3023 -2736 -718 -1443 -5917 -7331 -4633
14225 -4633 -2693 -2185 -3045 -4199 -2365 -3031 -3560 1158 2986 115 -2803 -5790 -9677 -9670 -5850 -5127 -119
14208a19Q08j183l39L21L195N24k330k223k113l24M620K459O12j318r61q04K395
14191C220k476q13K981J657k634k491m36k92k281N49J043L808J274J299K2k850
14175A580k037J900K58j945m36K095o03r66J194K96p97O53l16P41J409J52k350
14158H28j658L901k693j192J406K827K238k173k925k08j504q93J513R93M920j273
14142D107k47k555k475J245j272j560M82K199J105L6j474J447q62o16k375j807
14126d622O52L485K241n30J08j10R1j322J50m24j955j205m99J826L728J016P00
14109C330J13l309r47J382O98K049l99j051K893j743j629k832l254L80L766J544
14093I91J89J698K88q03m39k927j045L56M662L600k424l228L27j9L004p84j61
$$ plain form
14208 -119 689 -494 -833 -512 2683 3207 877 -1346 -3459 -3783 837 3296 3908 2590 1629 825 3220
14191 3220 744 -69 2912 4569 1935 -556 -992 -1284 -3565 -3016 -1973 1835 3109 4408 4430 1580
14175 1580 -457 1443 1701 -244 -680 1415 812 -154 1040 1336 539 1192 876 1617 3026 3178 828
14158 828 -830 3071 378 -814 592 3419 5657 3484 559 351 -1153 -2046 -533 460 5380 4107
14142 4107 3860 1305 -1170 75 -1197 -2757 -2275 -76 1029 1065 -409 1038 176 -440 -2815 -4622
14126 -4622 -3970 -485 1756 1226 1334 1224 1315 -7 143 -281 -2236 -3441 -3940 -2114 1614 2630 3330
14109 3330 3443 134 -813 569 1267 3316 2917 1866 4759 3016 1387 -1445 -4699 -4319 -553 991
14093 991 1180 2878 3166 2363 1924 -1003 -2048 -1692 2970 6570 4146 918 1245 1226 4230 3446 3285
14076C285o37o155M38M658K492o13M98L926K503K328K054K205L268N603L78K321
14060B8552L983L464N438N988R708J6202K0929K3638K3984K4388J8535J536j3256
14047A73089j7782k0244k5540k3408j7495j1737q133p210n577k678m258j710m233
14034B3084k958k64o00k360m533O25K64j058n05j806l972m022p97J6J35J844K711
14017E804j456q14j060L099Q98p25k464k81j96k027L538K691l895j323j514l480
14001c205K68M169L309l364l462L255k62j804r6J934J284j329J081R10P54j615
13985A827O00J602K37o75j941k69J592J191K426Q47m090k756L29R16j420m249
13969c833k172j313l13K776M637N09j379r37L95J564K492j65k067l479J357K991
$$ plain form
14076 3285 2648 -3507 -3069 1589 4081 3468 3966 7892 10395 12723 14777 16982 20250 25853 26231 28552
14060 28552 32535 35999 41437 47425 57133 73335 94264 117902 141886 166274 184809 186345 173089
14047 173089 155307 135063 109523 86115 68620 56883 48750 41540 35963 33285 29027 27317 23084
14034 23084 20126 19862 19262 16902 12369 12994 13258 12200 11695 9889 5917 1895 1098 1114 1249 3093 5804
14017 5804 4348 3534 2474 5573 6471 5746 3282 3001 2805 778 4316 7007 3112 1789 275 -3205
14001 -3205 -2937 1232 4541 1177 -2285 970 708 -1096 -1192 742 2026 697 1778 2688 3442 1827
13985 1827 2427 4029 4266 3591 1650 1381 2973 4164 6590 7437 3347 591 920 1836 416 -3833
13969 -3833 -6005 -7318 -7631 -4855 -218 291 -1088 -2025 -1630 -66 2426 2261 194 -3285 -1928 1063
13953A063J803L184k396q73n95P69j2Q33n630O22q05k126M119K54o42J339O32
13936A539L8k90j471k815q98R19r9N85N29J345L3k272K742j615q3M070P51k066
13918I42o29K173K794k022k544k84j484p06j3j91P99m87J71N44m583J132J505
13901b883l195l449m464l39J553M55j582m018k093N058K447l9K113j870j578k427
13885a6311k770R00N756N491P008Q771Q140K802K555J714O8j447L49r17j038k754
13869A8317K89L685n32o68m756R42p79j787n90L013j873k646j231R66m26r99L788
13852A4713K60J606k203q78M35R2K066L314K123n50r05J032j799j55K014J673
13836B2838K845P10J181J834M538M718m564j0022p060k087K050L427K112r28j549
$$ plain form
13953 1063 2866 6050 3654 2781 2186 2955 2943 3776 -1854 -1232 -2037 -4163 -44 210 -432 907 1539
13936 1539 1577 1287 -184 -2999 -3897 -2978 -3077 -2492 -1963 -618 -585 -2857 -115 -1730 -1813 2257 3008 942
13918 942 313 2486 5280 3258 714 430 -1054 -1760 -1773 -1964 -1165 -1652 -1481 -937 -5520 -4388 -2883
13901 -2883 -6078 -9527 -13991 -14330 -12777 -12322 -13904 -17922 -20015 -14957 -12510 -12549 -10436 -12306 -13884 -16311
13885 -16311 -19081 -18181 -12425 -6934 74 8845 16985 19787 22342 24056 24124 22677 23026 22109 21071 18317
13869 18317 18606 22291 21759 21091 16335 17277 16498 14711 14121 17134 15261 12615 11384 12350 11924 10925 14713
13852 14713 14973 16579 14376 13498 13933 14025 16091 19405 21528 20978 20073 21105 19306 19151 21165 22838
13836 22838 25683 26393 27574 29408 33946 38664 34100 24078 17018 14931 16981 20408 22520 21592 20043
13821B0043l171m097j88K443K053P64o7l402l979P71K947J165j947l375L31M57
13805A0748j508R56J276O80l639J98K426p63m701j03K218K568J745m836j111k73
13789E881K855M796l548n99J271J688m2p55r04q42q98L528M631Q91k998l729K939
13772A4165O41q31k396K623L597J934P83o35J088J854M03l182j610j204k914k590
13756A1726M03k88J964j242n397J635L757J155n465j879R17K641J723K968J05
13741A4723l911J128n34O3M411K066j70k986L7j51K327N383J677Q80j045K038
13725B5936k637m419J8M97Q30J937j302j455P56O536M467J053L972J523K196K621
13709D2529N088L799L437L075M119K233J213L554m16n202p475j413m265o725k413
$$ plain form
13821 20043 16872 12775 12587 15030 17083 17847 17780 14378 10399 11170 14117 15282 13335 9960 10291 10748
13805 10748 9240 10196 11472 12152 8513 8711 11137 10374 5673 5570 7788 10356 12101 7265 6154 5881
13789 5881 8736 13532 9984 9385 10656 12344 12302 11547 10643 9801 8903 12431 17062 17953 14955 11226 14165
13772 14165 14806 13975 11579 14202 17799 19733 20516 19881 20969 22823 23226 20044 18434 17230 14316 11726
13756 11726 12129 11841 13805 12563 7166 8801 12558 13713 8248 6369 7286 9927 11650 14618 14723
13741 14723 10812 11940 11406 11469 15880 17946 17776 14790 14827 14676 17003 22386 24063 24943 23898 25936
13725 25936 23299 18880 18898 19395 20225 22162 20860 19405 20161 26697 31164 32217 36189 37712 39908 42529
13709 42529 47617 51416 54853 57928 62047 64280 65493 69047 68631 63429 55954 54541 50276 43551 41138
13694D1138K73K648k095L846J402j040J82L185J698J107K18J547o7R43J998k004
13678E4979o19j52j91K391L451L250k491p8N304J403q07J505j013P14J105k486
13662F6265k707K178L530M812j155l64K520M600j850N3K62K320j111l095r74j35
13646G5149N54J165K452m45L07K58L930N359N465M83J26L215O853P970P666P627
13630A28134K339L745P702O347M533L881P240Q830R521J0555P670Q180J0073O716
13616B25466P613R455P213J1509J1778J4478J6410J6505J7774J9017K5068K9961
13604D12247L6909M4632N2316N7024O7954P7863R0598J06444J25563J45605J78125
13593A395280K19934K71200L33561M04565M80620N53911O35425P26501Q49930
$$ plain form
13694 41138 41411 44059 41964 45810 47212 46172 46354 49539 51237 52344 52562 54109 54042 54985 56983 54979
13678 54979 54360 54208 54017 56408 59859 63109 60618 60540 65844 67247 66440 67945 66932 67646 68751 66265
13662 66265 63558 65736 69266 74078 72923 72559 75079 79679 77829 77882 78144 80464 79353 76258 75284 75149
13646 75149 75703 76868 79320 78875 79182 79440 83370 88729 94194 94677 94803 98018 104871 112841 120507 128134
13630 128134 130473 134218 141920 148267 152800 156681 163921 172751 182272 192827 200497 208677 218750 225466
13616 225466 233079 242534 249747 261256 273034 287512 303922 320427 338201 357218 382286 412247
13604 412247 449156 493788 546104 603128 671082 748945 839543 945987 1071550 1217155 1395280
13593 1395280 1615214 1886414 2219975 2624540 3105160 3659071 4294496 5020997 5870927
13584E870927J036961J326786J749292K355674L199521M286410N299886N547917
13576C0673374M249345J071553j454743k585943l954273n128790m897192l773537
13568A4199794k663402j864198j331780j012919q48121p73631p04711o21311n42562
13559C837159m62089l92850l35307k84993k45451k07960j78909j59252j40892
13550A429456j22399j07011r3066q5287p5021p1001o5512o1038n5877n6388m9895
13539E86961m4403m1524l2575l3934l2244k4229k4894j9883j8877j5965j8064
13528B80369j5331j1994j6409j2589o966p417j1315j0849n574p232p486m88k481
13515A64238r181r577l791l895l766p407p361m179n555p600o875p39M1j879l335
$$ plain form
13584 5870927 6907888 8234674 9983966 12339640 15539161 19825571 25125457 30673374
13576 30673374 34922719 35994272 34539529 31953586 27999313 22870523 17973331 14199794
13568 14199794 11536392 9672194 8340414 7327495 6479374 5705743 5001032 4379721 3837159
13559 3837159 3375070 2982220 2646913 2361920 2116469 1908509 1729600 1570348 1429456
13550 1429456 1307057 1200046 1106980 1021693 946672 875671 810159 749121 693244 636856 586961
13539 586961 542558 501034 468459 434525 402281 378052 353158 333275 314398 298433 280369
13528 280369 265038 253044 236635 224046 217080 209663 198348 187499 181925 174693 167207 166719 164238
13515 164238 155057 145480 141689 137794 134028 126621 119260 115081 109526 101926 95051 94312 94353 92474 89139
13500H9139j917m064p100n391m932l278M66J670j943l121k136N80j341j751j240
13485E3641J463K839r95n002k700m36J80J33P95k258l990K547L09m183r16m236
13469C7191j776J886K806J179K700J779n52K925M317p04p64K242m672j698J167
13454D8026k649m068k675l856M50l081l727m010k555l305l9J283L89m01K279K177
13438B4238J438K120J426M407L890R73j631n42J413L25J228j674j372k895j674
13423C1670n56K045k97R17J121l86J58k087j318K63Q03J044M49k493m610n145
13407B1578K687l252j127K856j103K449R70L245l325r19J347l279k026k926l130
13392A4045j614q3j147j481l251j520K18K458j862m268K832J782J811J005j544
$$ plain form
13500 89139 87222 83158 76058 70667 65735 62457 62923 64593 62650 59529 57393 57973 56632 54881 53641
13485 53641 55104 57943 56948 51946 49246 48810 48990 49123 49918 47660 43670 46217 46526 42343 41427 37191
13469 37191 35415 37301 40107 41286 43986 45765 45213 48138 52455 51751 50987 53229 48557 46859 48026
13454 48026 45377 41309 38634 34778 35228 32147 28420 24410 21855 18550 18511 19794 20183 19782 22061 24238
13438 24238 25676 27796 29222 33629 37519 38492 36861 36319 37732 38057 39285 37611 36239 33344 31670
13423 31670 31114 33159 32862 33779 34900 34514 34672 32585 31267 31530 32333 33377 33826 31333 26723 21578
13407 21578 24265 21013 19886 22742 21639 24088 25058 28303 24978 24059 25406 22127 20101 17175 14045
13392 14045 12431 12348 11201 9720 6469 4949 5167 7625 5763 1495 4327 6109 7920 8925 7381
13377G381k986J785P5l285j132k81j792J329Q06j332n98J216Q51j543j8M06j749
13360h67J498J689n50j811j579K778K035n21k337j662J753M700O89j403M72j201
13344C683j373L605k42n77j481n99J963K095k827O17K295J280O61n4k792m81L481
13327I254J892J056l600j354j521k299j176k253J553j840m925m82M432L198Q33
13312B768p35j541k84J611J897j333j096N20L49R13J02k425N26J467p15m081m71
13295b528N59J284L735R74k198l508n40j882k219N25N57j203l44O33K084j107
13279e178j332k983n529j348l064n789J651L432P484J0055O827O349P048Q933
13265B6556P37l285l090k572m175J28L049M228r33k695k897k242q60K331q43l21
$$ plain form
13377 7381 4395 6180 6255 2970 1838 1557 -235 1094 1900 568 -30 1186 2037 494 476 882 -867
13360 -867 631 2320 1770 -41 -1620 1158 3193 2672 335 -1327 426 5126 5815 4412 4884 3683
13344 3683 2310 5915 5673 5096 3615 3016 4979 7074 4247 4864 7159 8439 9100 9046 6254 5773 9254
13327 9254 11146 12202 8602 7248 5727 3428 2252 -1 1552 -288 -5213 -5695 -1263 1935 2768
13312 2768 2033 492 208 1819 3716 2383 1287 1807 2156 3069 3171 746 1272 2739 2024 -2057 -2528
13295 -2528 -1969 -685 3050 4024 1826 -1682 -2222 -4104 -6323 -5798 -5241 -6444 -6788 -6155 -4071 -5178
13279 -5178 -6510 -9493 -15022 -16370 -19434 -25223 -23572 -20140 -12656 -2601 4226 10575 17623 26556
13265 26556 27293 24008 20918 18346 14171 14299 17348 21576 20643 17948 15051 12809 11949 14280 13437 13116
13249A3116p19j666q51K342j987j913k868k09L967j063j407j687J231J154L718
13234A1158Q48k137j044M20j170M03J666j207m393k957R62K475Q65O99K065K254
13218A0907j528r13l223j869l59k386L195J498j175J54K331O65j591k795K009
13203D920J037k916%l4l433k902K349J941R62l710l014p60L191L619K121p22Q42
13186C491L812j513j87k107l101L516J102M61j799P95k405K665R09m1P21j654
13170D665l30k48J564n09o41j697j984K495M323j630k201K244k573r0o35K54J506
13153D513J036K188m110l925j804j071N062Q57j524k265j275o9K466j202j010
13138b133L29l15k578M730L170J603K371L21k151l200j436J013J918l33k088j370
$$ plain form
13249 13116 12397 10731 9880 12222 10235 8322 5454 5245 9212 8149 6742 5055 6286 7440 11158
13234 11158 12006 9869 8825 9245 8075 8478 10144 8937 4544 1587 2549 5024 5889 6588 8653 10907
13218 10907 9379 8466 5243 3374 3015 629 3824 5322 4147 4301 6632 7297 5706 2911 4920
13203 4920 5957 3041 3041 3007 -426 -3328 -979 962 1924 -1786 -4800 -5560 -2369 1250 3371 2649 3491
13186 3491 7303 5790 5603 3496 395 3911 5013 5474 3675 4470 2065 4730 5639 5598 6319 4665
13170 4665 4335 4087 5651 5142 4501 2804 820 3315 7638 6008 3807 6051 3478 3388 2753 3007 4513
13153 4513 5549 7737 3627 -298 -2102 -3173 1889 2746 1222 -1043 -2318 -2387 79 -1123 -2133
13138 -2133 -1804 -2119 -4697 33 3203 4806 7177 7498 5347 2147 711 1724 3642 3309 1221 -149
13122a49L30K667J375K7K708N57k613j418K421m50k582K624J932J896O467L677
13106A9469J408M267N914N923M924J2120J0999J6335K1304K5937K7899J9895P068
13093A83462l030j1750j8278k4248k8215j7921j2609j0357j1033o009n098o074
13081B8840k331m578j173r23m336l931j443j2L497p46m325m177J152n5J090j255
13065E294L71L790K231l750j089k932j940L104K317K111J131L12m137j101K309
13050H021K858J593o762l718p04k158j83j019k192o38k66j248J926J979N504k233
13034G60k39j947o56k79M887L052l90n08N48K86k67k765J591J589j747l071k394
13017a550L762j2r61K139k073n35l084o38J144M23M094P87n48j358q81l70J775
$$ plain form
13122 -149 181 2848 4223 4250 6958 7515 4902 3484 5905 5455 2873 5497 7429 9325 15792 19469
13106 19469 20877 25144 31058 36981 41905 54025 65024 81359 102663 128600 156499 176394 183462
13093 183462 180432 168682 150404 126156 97941 80020 67411 57054 46021 40012 34914 28840
13081 28840 26509 21931 20758 19835 15499 11568 10125 10113 13610 12864 8539 4362 5514 5459 6549 5294
13065 5294 5665 9455 11686 7936 6847 3915 1975 5079 7396 9507 10638 10950 6813 5712 8021
13050 8021 10879 12472 5710 1992 1288 -870 -1053 -2072 -4264 -4902 -5168 -6416 -4490 -2511 2993 760
13034 760 521 -1426 -2082 -2361 2526 5578 5188 4680 5228 5514 5247 2482 4073 5662 3915 844 -1550
13017 -1550 2212 2200 1239 3378 1305 770 -2314 -2952 -1808 -1385 2709 3496 2948 1590 709 339 2114
13000B114j772m074j198J222l995m64q62J154K382K278J744p65K971J708j806
12985F37j36j235q79r37L132M079j41j407m254k295q53l804J737K009k117q20
12969g284L70L444L259j498Q89M17k542r40K438J350j169O9j685J357J003O73
12953A51J601m92N74J462n20l13j748J873J890K064j407m550p77j892l556j920
12937g560j90j51K50L174m50Q5K238O57p00J428L98J995K505K2l235l595R88j669
12919c810o75K294Q30l7j227k376J351K768J04m27N59P11J061J473k333l755J209
12902b280J372J705J098m36j091Q53J120n002m606K133J803l646K20j036j75k108
12886a0076L617M436O64j478k495K434l76k747R17K662K065Q27k461J231L31k38
$$ plain form
13000 2114 342 -3732 -4930 -3708 -7703 -8167 -9029 -7875 -5493 -3215 -1471 -2236 735 2443 637
12985 637 501 -734 -1613 -2550 582 4661 4520 3113 -1141 -3436 -4289 -8093 -6356 -4347 -6464 -7284
12969 -7284 -6914 -3470 -211 -1709 -820 -403 -2945 -3885 -1447 -97 -1266 -1197 -2882 -1525 -522 151
12953 151 1752 1260 1834 3296 2776 2463 715 2588 4478 6542 5135 585 -192 -2084 -5640 -7560
12937 -7560 -7750 -7901 -7651 -4477 -4927 -4842 -2604 -1947 -2647 -1219 -821 1174 3679 3701 466 -3129 -2141 -3810
12919 -3810 -4485 -2191 -1361 -1398 -2625 -5001 -3650 -882 -778 -1205 -646 65 1126 2599 266 -3489 -2280
12902 -2280 -908 797 1895 1459 368 1221 2341 -2661 -7267 -5134 -3331 -6977 -6757 -7793 -7968 -10076
12886 -10076 -6459 -2023 -1359 -2837 -5332 -2898 -3274 -6021 -5104 -2442 -377 450 -2011 -780 -449 -687
12870f87K45q64k678K989L045L353P78k750p50R79k35L94l89l43l209k477j53
12853b752j94k303J237J195R25K893P66j113l32J088l130j691K178j091j013Q2
12837c255K028J107j879l613m13K007J029L33r8k436k64O24j009L05m95j957j183
12820i169K398L203O28K58Q2N65J323q52j663j340O98R67k14r48n11O99o4J45
12802c795M51K22n52j674q01J585K439r13K634K925l244l06M73r81j296l56J194
12785a995k386N64J577R9j262J784J527j635j867J683q30K109q92K260P60J502
12769B998M84j256j486l074m98L176K621j75k458l275l757k035L789N296J517
12754A867p09l97J11P51m377l380J50n41L144j19J517k052J146J92k96M462N72
$$ plain form
12870 -687 -442 -1306 -3984 -995 2050 5403 6181 3431 2681 3660 3425 3819 3430 3087 -122 -2599 -2752
12853 -2752 -2946 -5249 -4012 -2817 -1892 1001 1767 654 322 1410 -1720 -3411 -1233 -2324 -3337 -3255
12837 -3255 -1227 -120 -1999 -5612 -6025 -4018 -2989 -2656 -2754 -5190 -5454 -4830 -5839 -5534 -6029 -7986 -9169
12820 -9169 -6771 -3568 -2940 -2682 -2600 -2035 -712 -1564 -3227 -4567 -3869 -2902 -3116 -4064 -4575 -3876 -3940 -3795
12802 -3795 -3344 -3122 -3674 -5348 -6149 -4564 -2125 -3038 -404 2521 -723 -1029 -556 -1537 -2833 -3189 -1995
12785 -1995 -4381 -3817 -2240 -2141 -3403 -1619 -92 -1727 -3594 -1911 -2741 -632 -1524 736 1496 2998
12769 2998 3482 2226 740 -2334 -2832 344 2965 2790 332 -2943 -6700 -8735 -4946 350 1867
12754 1867 1158 761 872 1623 -2754 -6134 -5984 -6525 -3381 -3500 -1983 -4035 -2889 -2697 -2993 1469 2041
12737B041l247j78J463j710l068K581J571M197J811j142k165J517J643k538o059
12722c283k942Q19M845L52l8J190j827l23N44K674j66j403k119k103L001L567
12706B788k988l326j243q26R79L425J157j462k699p72j485J886K79J337j744Q4
12690d610m73L64N553p34k611J607p51l061k08K190L610l335j941j674K983j162
12674d253O76J297K654N94J88m82n28p32j717l888J686J275J251K041k638k026
12658d602K50K437k442k926M529J587l096j693K447K496j773j228n38Q13L72K112
12642a255J772r18m97J028m636j50L257q18K56M80k310j956Q67J45j485k07M464
12625a963J144k049K442O62L89K321j526k545P7j341p60j986J774n64q91K029
$$ plain form
12737 2041 -1206 -1384 79 -1631 -4699 -2118 -547 3650 5461 4319 2154 3671 5314 2776 -3283
12722 -3283 -6225 -5406 -561 -209 -247 943 -884 -1207 -663 2011 1845 442 -1677 -3780 -779 2788
12706 2788 -200 -3526 -4769 -5595 -4616 -1191 -34 -1496 -4195 -4967 -6452 -4566 -4287 -2950 -4694 -4610
12690 -4610 -5083 -4719 834 100 -2511 -904 -1655 -4716 -4924 -2734 876 -2459 -4400 -6074 -3091 -4253
12674 -4253 -3577 -2280 374 968 1156 674 146 -586 -2303 -6191 -4505 -3230 -1979 62 -2576 -4602
12658 -4602 -4352 -1915 -4357 -7283 -2754 -1167 -4263 -5956 -3509 -1013 -2786 -4014 -4552 -3739 -3367 -1255
12642 -1255 517 -401 -898 130 -4506 -4656 -1399 -2217 -1961 -1481 -3791 -5747 -4880 -4735 -6220 -6427 -1963
12625 -1963 -819 -2868 -426 236 625 2946 1420 -1125 -1048 -2389 -3149 -5135 -3361 -3925 -4816 -2787
12609b787j551J70J604j05k831m020K492M286L287j793m86J189K800J700O24M6
12593D625k142K0M21m73J091j782j893l26L322L377J863j068l276k879J623q45
12577A658Q6j579Q62O02K38k78j110j448k34l389n318k804K552K693J626J152
12561d691j968j273O45K496R92J157M705q39m639l860Q09l54M741L93l99K402
12545C17K178j713j780j980j299m78K171K167O20Q96j112k778j838j098k275J994
12529f008M000J498j390o94K852l79j202L77J505J868J759q91k597m24j518p94
12513b038k44j874j555o14J062L906J624M94j467k557j584R51K845J864L069L317
12497G199L58k975j772K500K391K53J453n90l189j889M09J825K793J234N83J236
$$ plain form
12609 -2787 -4338 -4168 -2564 -2669 -5500 -9520 -7028 -2742 545 -1248 -1734 -545 2255 3955 4579 4625
12593 4625 2483 2503 2924 2451 3542 1760 -133 -459 2863 6240 8103 7035 3759 880 2503 1658
12577 1658 1744 165 1027 1629 1867 1589 479 -969 -1203 -4592 -9910 -12714 -10162 -7469 -5843 -4691
12561 -4691 -6659 -7932 -7287 -4791 -3799 -2642 2063 1224 -3415 -7275 -6466 -6820 -2079 -1686 -2085 317
12545 317 2495 782 -998 -2978 -4277 -4755 -2584 -417 203 1099 -13 -2791 -4629 -5727 -8002 -6008
12529 -6008 -2008 -510 -1900 -2594 258 -121 -1323 -946 559 2427 4186 3295 698 274 -1244 -2038
12513 -2038 -2282 -4156 -5711 -6325 -5263 -1357 267 761 -706 -3263 -4847 -3896 -1051 813 3882 7199
12497 7199 7557 4582 2810 5310 7701 7954 9407 8817 5628 3739 4148 5973 8766 10000 10583 11819
12481A1819k21K267Q510O828L200l132j204k122o970l578j07m888l887j871k754
12466A890j790J852K439R15m116j021N185P73l762k402j594k071P62q9j899q54
12450e782K411K035R98m85n959n18p4l486K490J586j211J125J623J084j176p04
12434f043J684L253K380j473m89J307J024m26j187m148j24K107k879J764j361
12419d611k85n608k062L416L371J685K18j837M06j02k87j56M194L559j993m955
12403e047k830j992J828J220J279J837J140J993N59j555k82J005R70j825L232
12388A532j46q15k578j042J999K115L242j451j170k165k050K837j07k132j919
12373c850O93J300k099k030J009J7k46K457j519q63J446j323k088r12j246M93
$$ plain form
12481 11819 11598 13865 22375 29203 32403 29271 28067 25945 18975 15397 15290 10402 6515 4644 1890
12466 1890 100 1952 4391 5306 1190 169 5354 6127 2365 -37 -1631 -3702 -2940 -3029 -4928 -5782
12450 -5782 -3371 -1336 -338 -823 -6782 -7300 -7374 -10860 -8370 -6784 -7995 -6870 -5247 -4163 -5339 -6043
12434 -6043 -4359 -1106 1274 -199 -688 619 1643 1217 30 -4118 -4242 -2135 -5014 -3250 -4611
12419 -4611 -4896 -10504 -12566 -9150 -5779 -4094 -3876 -5713 -5307 -5409 -5696 -5852 -1658 1901 -92 -5047
12403 -5047 -7877 -9869 -8041 -6821 -5542 -3705 -2565 -572 -13 -1568 -1850 -845 125 -1700 1532
12388 1532 1386 571 -2007 -3049 -1050 1065 4307 2856 1686 -479 -2529 308 201 -1931 -3850
12373 -3850 -3157 -1857 -3956 -5986 -4977 -4960 -5206 -2749 -4268 -5131 -3685 -5008 -7096 -8008 -9254 -8761
12357h761K487l584K33J954L186K625O60K003j817k755k152L565R60R64r43l980
12341e355k300N676K192l284l873m65K448K147J779r07K07M263P33l431j261m75
12325a906M16K889J530j572k171j448J321K674M23l341k326j875J68J963R43k298
12309d610K042L222K035K767k239n152R74j832p26L038Q42m560k099k335J59M59
12293h015J591O141R67k287O78L18j001m053n10q43J406k128j620J604J968J846
12277c938O68N50J387m86m95j819o80M481j933j489J863N51J289p27j713K270
12261b21K743o203k140mK349M147L137j1l04j062l937k835j953JK090p06K975
12244a934K023J724K82q48k026k753l510k1l233K966O422J213k733R09K731q10
$$ plain form
12357 -8761 -6274 -9858 -9625 -7671 -4485 -1860 -1200 803 -1014 -3769 -5921 -2356 -1396 -432 -1375 -5355
12341 -5355 -7655 -1979 213 -3071 -6944 -7409 -4961 -2814 -1035 -1942 -1735 2528 3261 -170 -1431 -1906
12325 -1906 -1490 1399 2929 1357 -814 -2262 -941 1733 2156 -1185 -3511 -5386 -5218 -3255 -2312 -4610
12309 -4610 -2568 654 2689 5456 3217 -1935 -961 -2793 -3519 -481 361 -4199 -6298 -8633 -8474 -8015
12293 -8015 -6424 -283 684 -1603 -925 -607 -1608 -5661 -6171 -7014 -5608 -7736 -9356 -7752 -5784 -3938
12277 -3938 -3270 -2720 -1333 -1819 -2314 -4133 -4813 -332 -2265 -3754 -1891 -1340 -51 -778 -2491 -221
12261 -221 2522 -3681 -5821 -5825 -3476 671 3808 3797 3493 2431 -1506 -4341 -6294 -6293 -4203 -4909 -1934
12244 -1934 89 1813 2095 1247 -779 -3532 -7042 -7063 -10296 -7330 -908 305 -2428 -1519 1212 402
12228D02p01P87m713k820P84K568J068P06r30l860K672L225k89J449k210j919
12212c781k72N85N01l93J947O48o03j177K301K457k298n59M45l158N96K905K695
12195B839l595m701k404J276M314J391j269J145k791n62J718J423L2K214K766
12180C796l127m164p82K860j196j046j201j19j653L47k976q68N296M620J339l52
12164G74k617k030J896k371j237p02k182K950M156L490l585l978P97M445K279
12149B085J023m74q49k436k316k27J701l295J33l101l804J146J493J231q11J212
12133g289J469L893K341J372m119K828J05j287Q40j721k17K480R77k711q39K465
12117E87l295l741J722L554K09k636r27J391J073k845m82M284J020n295j584l801
$$ plain form
12228 402 -299 488 -4225 -7045 -6261 -3693 -2625 -1919 -2849 -6709 -4037 -812 -1101 348 -1862 -3781
12212 -3781 -4053 -3468 -2967 -3360 -1413 -765 -1368 -2545 -244 2213 -85 -644 -199 -3357 -2761 144 2839
12195 2839 -756 -5457 -7861 -6585 -2271 -880 -2149 -1004 -3795 -4357 -2639 -1216 -1184 1030 3796
12180 3796 669 -3495 -4277 -1417 -2613 -3659 -4860 -4979 -6632 -6285 -9261 -10129 -4833 -213 1126 774
12164 774 -1843 -3873 -1977 -4348 -5585 -6287 -8469 -5519 -1363 2127 -1458 -5436 -4639 -194 2085
12149 2085 3108 2634 1785 -651 -2967 -3194 -1493 -4788 -4655 -7756 -11560 -10414 -8921 -7690 -8501 -7289
12133 -7289 -5820 -1927 414 1786 -2333 495 600 -687 153 -1568 -1785 695 1672 -1039 -1878 587
12117 587 -2708 -6449 -4727 -1173 -964 -3600 -4527 -3136 -2063 -4908 -5390 -1106 -86 -5381 -6965 -10766
12101a0766R3L007L175M633M289j8j102O29q07o34M61m30k964N60j820j84J909
12084C1j201q64k434q36M43K568m17J827K98m278k369L132N315J110K39J119k391
12067A292l750k743K944J839j785l278p88J545l2M190K601j398l427k738k657
12052h185K198L773O43J003j42P30R47j417J859J073J291l730j980O93K687J310
12036B753j651n495K438K914j045k514L975J291J234J055j619l576o33k472j573
12021d918O17J987L942K020l590n430j497L697N3J555K010J380P61Q41n495l133
12005e200M189J314j876k764k278m75M119M284m437j761l03O47j027K219J913
11990a436m157q09L566J198k463J579L416l319k576k354P10R25M284j468j247
$$ plain form
12101 -10766 -10673 -7666 -4491 142 4431 4413 3311 3940 3133 2499 2960 2530 -434 126 -1694 -1878 31
12084 31 -1170 -2034 -4468 -5304 -4861 -2293 -2710 -883 -585 -4863 -7232 -4100 1215 2325 2564 3683 1292
12067 1292 -2458 -5201 -2257 -418 -2203 -5481 -6269 -4724 -4756 -566 2035 637 -2790 -5528 -8185
12052 -8185 -5987 -2214 -1571 -568 -710 20 967 -450 1409 2482 3773 43 -1937 -1244 1443 2753
12036 2753 1102 -4393 -1955 959 -86 -2600 1375 2666 3900 4955 3336 -240 -873 -3345 -4918
12021 -4918 -4301 -2314 1628 3648 58 -5372 -6869 -3172 -3119 -1564 446 1826 2587 3428 -2067 -5200
12005 -5200 -1011 303 -1573 -4337 -6615 -7090 -2971 1313 -3124 -4885 -5188 -4541 -5568 -3349 -1436
11990 -1436 -5593 -6402 -2836 -1638 -4101 -2522 894 -2425 -5001 -7355 -6645 -5720 -1436 -2904 -4151
11975d151l11Q95p98J265n01L554L772m43j638l249j844k917j200J24j188J701
11959f929J548J51k5J569J101j854K152N52J29k456p54J357j840O9J862L258j007
11942a117k374J479J710L832J955q548o833K800L922J071J935K170J420l49p54
11927B319J179q02j406p13J017l23l3j496m19l56j534J935j346O86K293J513l572
11910a058j451k80R81J228Q5k501j553J079P01m974k470L660L327j557K671J014
11894a098k656l019J734K857k360m494p89L646K321J775J508Q36j108J434K39
11879H26o31k778j248K116J254j550l983L633K494k106K078R06k008k713R23K017
11863g70R94J816R72l270k390r53j888J22J830L364J399N9j947q06j910r92K023
$$ plain form
11975 -4151 -4462 -3567 -4365 -3100 -3601 -47 3725 3282 1644 -1605 -3449 -6366 -7566 -7442 -8630 -6929
11959 -6929 -5381 -5230 -5255 -3686 -2585 -4439 -2287 -1735 -1606 -4062 -4816 -3459 -5299 -5230 -3368 -110 -1117
11942 -1117 -3491 -2012 -302 3530 5485 -3063 -9896 -7096 -3174 -2103 -168 2002 3422 3073 2319
11927 2319 3498 2696 1290 577 1594 1271 1238 -258 -677 -1033 -2567 -632 -1978 -1292 1001 2514 -1058
11910 -1058 -2509 -2789 -1808 -580 -495 -2996 -4549 -3470 -2769 -7743 -10213 -6553 -3226 -4783 -2112 -1098
11894 -1098 -3754 -6773 -5039 -2182 -4542 -9036 -9825 -6179 -3858 -2083 -575 261 -847 587 826
11879 826 195 -2583 -3831 -1715 -461 -2011 -5994 -2361 133 -1973 105 1011 -997 -3710 -2787 -770
11863 -770 224 2040 3012 -258 -2648 -3601 -5489 -5367 -3537 -173 1226 1285 -662 -1468 -3378 -4370 -2347
11846b347J44k048j199J185K041K06k325k209K121q46l57mR67k62M95Q80Q80n19
11828c197O16m1m42K735J943j774l200j342k659j147Q76L928m70K236j733k373
11812f044K732J419j46P5J21J617j689o987J187K768J533j468k958j59q38K957
11796e880L693N75m02M13K523k870k267L265j548k698k54L599K269K837k287l58
11780F10r6l835o89P44J945j466J528k092L46L044J303k871l896J748J484k18
11764b411l088l485o22L254M561L023j588J391J690j254m143R87L126M48L62n14
11748A737m066j627l019o49J994J647L250o22R7k784n09K529R19j027J166j084
11732b048k278k053J3M427j106O92p37K870k197j703N09K604o35j235n7L98J821
$$ plain form
11846 -2347 -2203 -4251 -5450 -4265 -2224 -2018 -4343 -6552 -4431 -5277 -5634 -5638 -4671 -4933 -4438 -3558 -2678 -3197
11828 -3197 -2581 -2622 -3064 -329 1614 -160 -3360 -4702 -7361 -8508 -7632 -3704 -4174 -1938 -3671 -6044
11812 -6044 -3312 -1893 -2039 -1964 -1843 -226 -1915 -8902 -7715 -4947 -3414 -4882 -7840 -7999 -8837 -5880
11796 -5880 -2187 -1612 -2014 -1601 922 -1948 -4215 -950 -2498 -5196 -5450 -1851 418 3255 968 610
11780 610 514 -3321 -4010 -3266 -1321 -2787 -1259 -3351 -3005 39 1342 -1529 -5425 -3677 -2193 -2411
11764 -2411 -5499 -8984 -9606 -6352 -1791 1232 -356 1035 2725 1471 -2672 -1685 1441 1889 2251 1737
11748 1737 -2329 -3956 -6975 -7624 -5630 -3983 -733 -1355 -1258 -4042 -4551 -2022 -1103 -2130 -964 -2048
11732 -2048 -4326 -6379 -6366 -1939 -3045 -2353 -3090 -220 -2417 -4120 -3611 -1007 -1642 -2877 -2934 -2536 -715
11715g15L32j042J024j212j997J143l114j339P48k968p67K126l71L719J850k73
11699b856J046K812N68k28K80J676k43m340K42R16R17l215l950K643J279o40L89
11682b704P66K381m9J641j354q28q69p60m225j966K685M209k038J00q71j481O0
11665e303J590L858J616k05l143p14k022j653N014Q1k623m295k769J098M18K177
11649f875N247M378k445k754j488L263J294L16J355J132m533k883J048M89M210
11634A754L035K379n89n003l363L077K320J89j356j070O03m443J137K357l92l899
11618c264k57j380j469K007j59l15O91O07Q26L89J072j594j088j643q16j430K706
11601e117K785r04k277j69m304j776p89K444M004J919q64j561K91K346J142n26
$$ plain form
11715 -715 -383 -1425 -401 -1613 -3610 -2467 -5581 -6920 -6172 -9140 -9907 -7781 -8152 -4433 -2583 -2856
11699 -2856 -1810 1002 1570 1342 1622 3298 3055 -1285 -1043 -127 790 -2425 -6375 -3732 -2453 -3093 -2704
11682 -2704 -1938 443 394 2035 681 -147 -1016 -1776 -6001 -7967 -5282 -1073 -3111 -3011 -3882 -5363 -5303
11665 -5303 -3713 145 1761 1556 -1587 -2301 -4323 -5976 -962 -881 -3504 -7799 -10568 -9470 -9052 -6875
11649 -6875 -1628 2750 305 -2449 -3937 -674 620 936 2291 3423 -1110 -3993 -2945 -2456 1754
11634 1754 4789 7168 6579 1576 -1787 1290 3610 3799 2443 1373 1976 -2467 -1330 1027 635 -3264
11618 -3264 -3521 -4901 -6370 -4363 -4522 -4837 -4146 -3539 -2713 -2324 -1252 -2846 -3934 -5577 -6393 -7823 -5117
11601 -5117 -2332 -3236 -5513 -5682 -9986 -11762 -12551 -10107 -6103 -4184 -5048 -6609 -6318 -3972 -2830 -3356
11585c356K010R69r33J237J550k867k004j000R86J40o44j925j184j253j81J650
11569f805J02j34L255j84j853K090N41n15p90p25j162J047J610N04M98M26l068
11552e163K327M844m226j839K58J846J290k403p5L43k4K098J657Q5j952P79o45
11535h00j407r74m120k578N172K639k13k01l162j71J634Q53m317J840K161j084
11519d728O87O74o70J057L492J052k661J973J282J237n290m585L896N079J795
11504D290j864J862k008j768K162j619m381j515j145J729K507L894N373l302k925
11489A290j657K54m291j273L27J9L835J239M92K78N21j709j756j681J568J321
11473a223q95M012k705k029J225j92J35j847m31J283J699L128J354j733K25l633
$$ plain form
11585 -3356 -1346 -377 -1310 -73 1477 -1390 -3394 -4394 -3408 -3268 -3912 -5837 -7021 -8274 -8455 -6805
11569 -6805 -6703 -6837 -3582 -3766 -5619 -3529 -2988 -3503 -4293 -5018 -6180 -5133 -3523 -3019 -2521 -2095 -5163
11552 -5163 -2836 2008 -2218 -4057 -3799 -1953 -663 -3066 -3141 -2798 -2822 -724 933 1018 -934 -155 -800
11535 -800 -2207 -3181 -7301 -9879 -4707 -2068 -2281 -2482 -5644 -5815 -4181 -3328 -7645 -5805 -3644 -4728
11519 -4728 -4041 -3367 -4037 -2980 512 1564 -1097 876 2158 3395 -1895 -6480 -2584 2495 4290
11504 4290 2426 4288 2280 512 2674 1055 -3326 -4841 -5986 -4257 -1750 2144 7517 4215 1290
11489 1290 -367 -113 -4404 -5677 -5350 -5331 -1496 -257 235 513 1034 -675 -2431 -4112 -2544 -1223
11473 -1223 -2118 1894 -811 -2840 -1615 -1807 -1672 -3519 -3950 -2667 -968 2160 3514 1781 2006 -1627
11457a627j761K660j377j703M83J856k980j184J568J202K27l246j481J031q60
11442g192L477M746l178k764J397J80m72m058J927L728L527j823J011m46J302
11427A362J923k89l699j497N09j748n872K580K681J710K47J765O93k978K383k870
11411c100l251J025L528J730J239Q31m144j342J381K782j128j468j476j356K193
11396b556L071M1k168j571k26o64R89K738q1k750j8K320Q20j178k498N04J850
11379a377n38q31K957q71m08j779P07K937L611o46j930n28L642l75j336o85r68
11362A582o05k813O44O28r4M71j301p17k64J044J178q18p27j841k041J721K189
11345a764j261j441J872p2k454j897j558J105K700L914q07J09J540p41K139j45
$$ plain form
11457 -1627 -3388 -728 -2105 -3808 -3325 -1469 -4449 -5633 -4065 -2863 -2636 -5882 -7363 -6332 -7192
11442 -7192 -3715 1031 -2147 -4911 -3514 -3334 -3806 -7864 -5937 -2209 1318 -505 506 60 1362
11427 1362 3285 2996 -703 -2200 -1691 -3439 -9311 -6731 -4050 -2340 -2093 -328 365 -2613 -230 -3100
11411 -3100 -6351 -5326 -1798 -68 1171 2002 -2142 -3484 -2103 679 -449 -1917 -3393 -4749 -2556
11396 -2556 515 556 -1612 -3183 -3409 -4073 -3084 -346 -427 -3177 -3195 -875 -55 -1233 -3731 -3227 -1377
11379 -1377 -1915 -2746 211 -660 -1068 -2847 -2140 797 4408 3762 1832 1304 4946 4571 3235 2550 1582
11362 1582 977 -1836 -1192 -564 -658 -187 -1488 -2205 -2469 -1425 -247 -1065 -1792 -3633 -5674 -3953 -1764
11345 -1764 -3025 -4466 -2594 -2666 -5120 -7017 -8575 -7470 -4770 -856 -1663 -1554 -14 -755 1384 1239
11329A239k089j076k27r87j520K727K154Q15j216P81p84l390j416J235J034r85
11313c705J459J826q85p78m89N31J476J845J164k939j440P83K178K504N16m182
11297a36R37n037l781P63J857o11K080J293j028J813k84j306J057K51l87K034
11281d85K069L632r3J098n753l384J224j80l332k567M68K436o31J732K115l848
11265e499k323J559K865j457k977j619M2K907N226J727J575j192O91J162M3k150
11249E80k690J68K496j883j080p0P62L996j426r71J47m0k244j621j472Q69P59
11232c720L615Q26J388J58k891o390N16K524O23p44L217M608O98k683N71L178
11216E494k928k726L91k950J332N362r45m419J288K436p7K61p62n86l197m382
$$ plain form
11329 1239 -850 -1926 -2153 -3140 -4660 -1933 221 1036 -180 601 -183 -3573 -4989 -3754 -2720 -3705
11313 -3705 -2246 -420 -1305 -2083 -2572 -2041 -565 1280 2444 -495 -1935 -1152 1026 3530 4046 -136
11297 -136 801 -4236 -8017 -7254 -5397 -6008 -3928 -2635 -3663 -1850 -2134 -3440 -2383 -2132 -2519 -485
11281 -485 1584 5216 5123 6221 468 -2916 -1692 -1872 -5204 -7771 -7303 -4867 -5498 -3766 -1651 -5499
11265 -5499 -7822 -6263 -3398 -4855 -7832 -9451 -9409 -6502 -1276 451 2026 834 1525 2687 2730 580
11249 580 -2110 -1942 554 -1329 -2409 -2479 -1717 2279 853 -118 29 -11 -2255 -3876 -5348 -4479 -3720
11232 -3720 -105 721 2109 2267 -624 -7014 -6498 -3974 -3351 -4095 -878 3730 4428 1745 2316 5494
11216 5494 2566 -160 231 -2719 -1387 3975 3030 -1389 -101 2335 2258 2519 1757 1171 -2026 -6408
11200f408o25K823M186M34k142n58J078P8Q51P22J243j130J87j648k11Q22K23
11183g5M184O84j774l531J11j415k11j306p92L632L605J79J4j273k183j564M14
11166a301j848J908j063m71K639j100j964n90k658J227L186Q07j860Q86J778Q08
11150C84J369N28L77p13m399k53l44M75j271J654j657j761L753q13K27J012k959
11133d391j900j15L194K169q33k74J451J096k524O12J478k73J398J958R89K63
11117D298J30k293k945nr21k87l54K45J447r6p65n24L8q26j201j00M516K557k8
11098B886R15m86j634Q30j829l995j202K639L188l20l234k068L46L546L788j042
11082B328m79j059j897J283J063K411l821l239k07K286L44r20j270j326P69m88
$$ plain form
11200 -6408 -7033 -4210 -24 410 -1732 -2290 -1212 -1134 -283 439 1682 552 739 -909 -1120 -298 -75
11183 -75 4109 4793 3019 -512 -401 -1816 -2027 -3333 -4125 -493 3112 3291 3305 2032 -151 -1715 -1301
11166 -1301 -3149 -1241 -2304 -2775 -136 -1236 -3200 -3790 -6448 -5221 -2035 -1228 -3088 -2202 -424 384
11150 384 1753 2281 2658 1945 -2454 -2707 -3051 -2576 -3847 -2193 -3850 -5611 -1858 -2671 -2444 -1432 -4391
11133 -4391 -6291 -6406 -3212 -1043 -1876 -2150 -699 397 -2127 -1515 -37 -310 1088 3046 4035 4298
11117 4298 4428 2135 -810 -815 -1736 -2023 -2377 -2132 -685 -781 -1546 -2070 -2032 -2858 -4059 -4159 357 2914 2886
11098 2886 3801 3315 1681 2511 682 -3313 -4515 -1876 1312 992 -2242 -4310 -3964 -418 3370 2328
11082 2328 1849 790 -1107 176 1239 3650 -171 -3410 -3617 -1331 -987 -1907 -3177 -4503 -3734 -4222
11066d222J922o12J456L449k681M031L435P52J870J509r32p98k498p3J148k331
11050E425n53J069J827k438P54j569l193m284O2N42m13r36L025J823l703l932
11034f494m65K748J456L34J429J141J071J541q69o3p12J911l35p85j820k476o98
11017c086j686K180L250j060K314K064j138J055J451K689m464k811j141J221J713
11002B551n61j345P32l02j247J0k858k40K754j727K44J284J402J598n583l512
10986f800J566J984J422J443j490Q44k98K906Q28k522l821k15L415J962j570l400
10970c746j291J077N44K404j225L169P54J073L35l603l753R31L41l74K310J580
10954E26l99J725P06J185l031m987k939J250m39J725M524M348J254j430l282n47
$$ plain form
11066 -4222 -2300 -2912 -1456 1993 -688 3343 6778 7530 9400 10909 9977 9179 6681 6608 7756 5425
11050 5425 4872 5941 7768 5330 6084 4515 1322 -2962 -2900 -2358 -2771 -3707 -682 1141 -2562 -6494
11034 -6494 -6959 -4211 -2755 -2421 -992 149 1220 2761 1892 1829 1117 3028 2693 1908 88 -2388 -3086
11017 -3086 -4772 -2592 658 -402 1912 3976 2838 3893 5344 8033 3569 758 -383 838 2551
11002 2551 1990 645 1377 1075 -172 -162 -3020 -3260 -506 -2233 -1989 -705 697 2295 -3288 -6800
10986 -6800 -5234 -3250 -1828 -385 -1875 -1031 -1329 1577 2405 -117 -3938 -4153 -738 1224 -346 -3746
10970 -3746 -5037 -3960 -3416 -1012 -2237 932 1686 2759 3094 -509 -4262 -3331 -2990 -3364 -1054 526
10954 526 127 1852 2558 3743 712 -4275 -7214 -5964 -6403 -4678 -154 4194 5448 4018 736 189
10938A89K16L217K744K306k148j955k6K101q94J991L21j487r0k246q72o72n13
10921B182j338j323k136J989K302j055K622K484K466j632k456P72K265k795m060
10906B87o85l75j709j479L234J358j524j590P03J183L396j709m455J05M670n89
10890H21l065k550o23Rj290J480K598J880J750J171K616J99m063r91j541j880
10874c479j164L09P69K795N294M79l116n85K635J346j652j29j684k41k895k546
10858c864l851K412N929J316K75K038k93l389P22J634k302n00O3k376n25j39L882
10841A032j588k120L533L309j682M88K03K195j69k408l281k172J722J136l959
10826c761p90K722j037l919N084O334K204o59l283k768k605k149O60p07k57J398
$$ plain form
10938 189 405 3622 6366 8672 6524 4569 4543 6644 5750 7741 8062 6575 6485 4239 3367 2695 2182
10921 2182 844 -479 -2615 -626 1676 621 3243 5727 8193 6561 4105 4877 7142 4347 287
10906 287 -398 -773 -2482 -3961 -727 631 -893 -2483 -1780 -597 2799 1090 -3365 -3260 1410 821
10890 821 -2244 -4794 -5417 -5408 -6698 -5218 -2620 -740 1010 2181 4797 4996 933 -58 -1599 -3479
10874 -3479 -4643 -4334 -3565 -770 4524 5003 1887 1302 3937 5283 3631 3502 1818 1577 -1318 -3864
10858 -3864 -7715 -5303 626 1942 2217 4255 3962 573 1295 2929 627 127 190 -2186 -2711 -2850 1032
10841 1032 -556 -2676 857 4166 2484 2972 3175 5370 5201 2793 -488 -2660 -938 198 -3761
10826 -3761 -4551 -1829 -2866 -6785 -1701 4633 6837 6178 2895 127 -2478 -4627 -3967 -4674 -4931 -3533
10810c533J233J959R90R47J142K823O68J651l69k556J720P93l007l565lJ629n28
10793A994j791R58K017L94L953K425J743J589m078L23J863O19m02l98l307m028
10777C874k125P36qK45K733m10j322k22P52J987k18k258K011j11l288j658j635
10760i17R24k976J5M197J069r20J145K337J106j004J235J364m741k600M495N37
10744E266N72q74q08Q06k348j260J424R11j499k678O91j99K64M324L766k45P01
10727H814J214j322R94m771j541K765M1M83o1p78K22m03K212J888o04j812Q69
10710H210K853l95k18Q14J180J831J653K327j495L30J039k551N759j015k453J906
10694A9775O53N06j395j337j530M369J432J153O265M440K812N174N165K263K251
$$ plain form
10810 -3533 -2300 -341 649 1596 2738 5561 6229 7880 7511 4955 6675 7468 4461 896 893 2522 1994
10793 1994 203 1161 3178 3572 7525 9950 11693 13282 9204 9527 11390 12009 11607 11209 7902 3874
10777 3874 1749 2485 2477 2722 5455 5045 3723 3501 4253 6240 6022 3764 5775 5664 2376 718 -917
10760 -917 7 -2969 -2954 1243 2312 1392 2537 4874 5980 4976 6211 7575 2834 234 4729 5266
10744 5266 5838 4964 4156 4962 2614 1354 2778 3689 2190 -488 203 4 268 4592 8358 8113 8814
10727 8814 10028 8706 9700 4929 3388 6153 6194 6677 6616 5838 6060 5657 7869 9757 9153 7341 8210
10710 8210 11063 10668 10450 11264 12444 14275 15928 18255 16760 17090 18129 15578 21337 20322 17869 19775
10694 19775 20428 20934 19539 18202 16672 21041 22473 23626 29891 34331 37143 42317 47482 49745 51996
10679E1996N512P886P108J0457J8960J4599J5157J9357K4677K9811L7325L9236
10667B82081M9075O1283Q3731J09241J49982K05868K65879L13718L00710J65586
10657A987154k6592j14530j76291k65983k95070k44548j76678j23357q8228o4288
10647D11589m8161m0734l7881l6532l1170k4128j8794j7023j4886j7643j8233
10636A06404q430o677o233o388p073j2368k937j668m851p745n085l593j434K189
10622C4111k643j181j098j03M6l267l728q22j832n23N25n293l483j57M48J627
10606A2627j782k137n887n31M164J391J772K095J508l405p96m197k138m21K134
10591D397L341J399j015j328q53R99L331J407J234k728j398L0L67p17j000k71
$$ plain form
10679 51996 57508 65394 72502 82959 101919 116518 131675 151032 175709 205520 242845 282081
10667 282081 331156 392439 476170 585411 735393 941261 1207140 1520858 1821568 1987154
10657 1987154 1960562 1846032 1669741 1403758 1108688 864140 687462 564105 475877 411589
10647 411589 363428 322694 284813 248281 217111 192983 174189 157166 142280 124637 106404
10636 106404 97974 91297 85064 78676 71603 59235 56298 54630 49779 42034 36949 33356 31922 34111
10622 34111 31468 30287 29189 29086 29132 25865 22137 21315 19483 18960 19485 14192 10709 10552 11000 12627
10606 12627 10845 8708 2821 2290 6454 7845 9617 11712 13220 9815 9019 4822 2684 2263 4397
10591 4397 7738 9137 8122 6794 5941 6940 10271 11678 12912 10184 8786 8816 9183 8466 7466 7195
10575G195k634l332N31J261n6k307N55K69n7L086J44m383m213K757N039k99j264
10558B292L591K312j0l736L11K88j246q83R45J024L135n4r58l763k652J696p38
10541A554k275o765K783K999J743o8K52J671K973j192J034m536m212p14j776K374
10525d155O201J211k022M4K334J428r35o31J571k80q81m35l409M22J398j863L036
10508C034J460k036K73q52K547N241K98m238l991m111R76L425K71Q70j619M89
10492B037l98K234Q5k651n56J919K697M151J062l45k418j422k329p04j340k670
10476f48R56J345J632p41j694k330J027K597M10j10O40j512j268k66J240j616
10460c38K887J435j586k439J074k018K516j341j832k456J197Q65N253N722J312
$$ plain form
10575 7195 4561 1229 1760 3021 2965 658 1213 1482 1425 4511 4655 272 -3941 -1184 3855 3556 2292
10558 2292 5883 8195 8185 4449 4760 5048 3802 2919 3864 4888 8023 7969 7011 3248 596 2292 1554
10541 1554 -721 -7486 -4703 -1704 39 -29 223 1894 4867 3675 4709 173 -4039 -4753 -6529 -4155
10525 -4155 2046 3257 1235 1279 3613 5041 4106 3475 5046 4766 3885 3450 41 463 1861 -2 3034
10508 3034 4494 2458 2731 1879 4426 9667 9965 5727 1736 -2375 -1399 2026 2297 3167 1548 2037
10492 2037 1639 3873 3958 1307 751 2670 5367 9518 10580 10235 7817 6395 4066 3362 2022 -648
10476 -648 308 1653 3285 2544 850 -1480 -453 2144 2554 2444 3084 1572 304 38 1278 -338
10460 -338 2549 3984 2398 -41 1033 -985 1531 190 -1642 -4098 -2901 -2036 3217 8939 10251
10445A0251n179m22L604p28l039j094j413n82J903J987L60J391J796J345k944
10430G236k404k647q60j514q99K866L18K578L088n85O11J576m705k711J626k863
10414G11J073L11Q42M310M88k224j763k612L038K336K128n086k621J959R54j854
10398A990m19K350L191j595n442j372O20k778j430J230M016L68N93j06n31K43
10382I28j810K964M626k85l460l596j470J643L983J531J205J334J92J213j807
10367G191k969K12k011j586J479m4p48k356Q65p31L212J870K53k927k082M72L995
10350D095K806N44k198k782J205K475K37j804k088r63Q50j380L56r49L544M798
10334H746k138m237k707J800O16J786M95k403r81M84J382o42K304M043j309j644
$$ plain form
10445 10251 5072 4650 8254 7526 4487 3393 1980 1398 3301 5288 5648 7039 8835 10180 7236
10430 7236 4832 2185 1325 -189 -1088 1778 2096 4674 7762 7177 7788 9364 4659 1948 3574 711
10414 711 1784 2095 2937 7247 7735 5511 3748 1136 4174 6510 8638 3552 931 2890 3844 1990
10398 1990 1571 3921 7112 5517 75 -1297 -677 -3455 -4885 -3655 361 729 1322 1216 685 928
10382 928 -882 2082 6708 6423 2963 -633 -2103 -460 3523 5054 6259 7593 7785 8998 7191
10367 7191 4222 4434 2423 837 2316 2272 1524 -832 33 -698 2514 4384 4637 1710 -372 100 4095
10350 4095 6901 7445 5247 2465 3670 6145 6382 4578 2490 1527 2377 997 1353 404 3948 8746
10334 8746 6608 2371 -336 1464 2080 3866 4361 1958 977 1461 2843 2201 4505 8548 7239 5595
10318E595J984K54k037Q61K39Q22k439l332p25J041N464K445k187l269q22J144
10302E038L726J81l272j937p5M60L08p38M92J212m66k24J455J105k468l378J760
10285C179J98J028K61n17k247q13L539J832l393l538J140m35N34Q60K156K467
10269F251L298n228l783J692J482J525J160j766m255R84K506n5N09J054K041L364
10253A0779K215j199M27L41k004J350m50j422o26R88O36j666l354K070J597J64
10237I846Q37k943k813O58j224j135L090j5j442J821j217j530n91L630M576l311
10221H237j475j411j838J217m13J114J802J145j874o93K215j069o41k86q51J3
10205E192j090L022j091j454j073j950k056k197k03M347K659k532L66J888l53
$$ plain form
10318 5595 7579 7833 5796 6657 6896 7718 5279 1947 1222 2263 7727 10172 7985 4716 3894 5038
10302 5038 8764 8945 5673 3736 3661 4121 4429 3691 4183 5395 4929 4705 6160 7265 4797 1419 3179
10285 3179 3377 4405 4666 4149 1902 1089 4628 6460 3067 -471 669 234 768 1628 3784 6251
10269 6251 9549 4321 538 2230 3712 5237 6397 4631 376 1360 3866 3811 4320 5374 7415 10779
10253 10779 12994 11795 12222 12563 10559 11909 11459 10037 9411 10399 11035 9369 6015 8085 9682 9846
10237 9846 10683 7740 4927 5585 4361 3226 6316 6301 4859 6680 5463 3933 3342 6972 11548 8237
10221 8237 6762 5351 3513 4730 4317 5431 7233 8378 6504 5811 8026 6957 6316 6030 5179 5192
10205 5192 4102 7124 6033 4579 3506 1556 -500 -2697 -2900 1447 4106 1574 1940 3828 3475
10190C475J441j693O14L513K072k951l905k664K66K55k206J566K824K004J363
10175E974j935k233l633K961K478N011l243k38q96j033M57P18J345j974J05J701
10159E565o87k120j723o15M77k417K226L355k88J513l78n359k050K798L881p28
10143C450J897K095J966q76j321l30k320p01R76M494l47k730N5j557j857j572
10127A322J073L012K14J096J95O39J33J651m1k358m347O00J740J120L503m622
10111D930l307j327L98J516n77J822M985Q5j270O14l25k233J153j408k16J981
10095F821M7j247J616k009J021o12j349P38M417K309l384j116k155M01R61J899
10079H358j94J367J556K58o08Q02K4K20k768k020K51L868J825P88k821k971k843
$$ plain form
10190 3475 4916 3223 3837 7350 9422 6471 2566 -98 168 423 -1783 -217 2607 4611 5974
10175 5974 4039 1806 -1827 1134 3612 8623 5380 5142 4246 3213 3670 4388 5733 3759 3864 5565
10159 5565 4878 2758 1035 420 897 -1520 706 4061 3773 5286 4908 -451 -2501 297 4178 3450
10143 3450 5347 7442 9408 8532 7211 6881 4561 3860 4836 9330 8983 6253 6308 4751 2894 1322
10127 1322 2395 5407 5621 6717 6912 7551 7684 9335 9294 6936 2589 3189 4929 6049 9552 4930
10111 4930 1623 296 694 2210 1633 3455 8440 8525 7255 7869 7544 5311 6464 5056 4840 6821
10095 6821 6868 5621 7237 5228 6249 5637 4288 5026 9443 11752 8368 7252 5097 5498 6459 8358
10079 8358 8164 9531 11087 11345 10737 11539 11563 11783 9015 6995 7246 11114 12939 13727 10906 7935 5092
10062E092n463j947L506L463L586l397l952Q74j346k637M746L061M368K221l741
10047H434l303k434j057M344o4j200l219J77L662p59Q5M3J3j243J631M998M187
10030A4295O68l016n208m266j768N22K809J032l923j751k201N45L742r66l889
10015c375K799O312M352R53m96M10R56j806m121l262j903P88J345K90J120K733
9999G095K154k404o37j887R30n912j562L122K755L66l49J917n61j650j803j85
9983A389L803Q94j253m62o45l479K548o38K390L233K287n27k270K63j472k194
9967C867P51r21K32O46n08j055Q13J940J278k298j504J340K956J437r3Q15L221
9950A2917m253j043K42n62L69J139L270N70M92l750k8j015n66l21J183M024L00
$$ plain form
10062 5092 -371 -2318 1188 4651 8237 4840 888 1762 416 -2221 2525 5586 9954 12175 8434
10047 8434 5131 2697 1640 5984 5920 4720 1501 1678 5340 4581 4666 4709 4722 3479 5110 10108 14295
10030 14295 14963 11947 6739 2473 705 1227 4036 5068 1145 -606 -2807 -2262 1480 514 -3375
10015 -3375 -576 5736 10088 11041 10545 10955 11911 10105 5984 2722 819 1607 2952 3242 4362 7095
9999 7095 9249 6845 6208 4321 5251 -661 -2223 899 3654 4020 3671 5588 5027 3377 1574 1389
9983 1389 5192 6086 4833 4371 3726 247 2795 2157 4547 7780 10067 9540 7270 7533 6061 3867
9967 3867 4618 3697 3929 4575 4067 3012 3825 5765 7043 4745 3241 4581 7537 8974 8881 9696 12917
9950 12917 8664 7621 7863 7301 7670 8809 12079 12649 13141 9391 9363 8348 7782 7461 8644 12668 12968
9933A2968J701q06k711l887j868J838K321j767m24J540j147k29m194K06J242n42
9917D241R0J457J455n70j666j845M5L407J286J339o59m73J607N51j432j057r38
9900F838k096k935N47L481K165k055l122j414N40n1j964o84j021J041l569J138
9884c161K524M697L427N87j297l661N02k65o33p96J027K943N29qL88q2m66J694
9866G949N95K488L32p218J375K095J099M73R34K001l657J92k47o11j783k670M61
9849C808k558L65L283K101j322j067j32J395K727Q1q39q66j740L389j566M38L195
9832A0692R45n58m76K387L288k203m078q93k844k969m8N0N127K329m630j366L572
9815H325J723L282l538m361M04N404l81k832M44J432p60K475J249j280P58j329
$$ plain form
9933 12968 14669 13863 11152 7265 5397 7235 9556 7789 7365 8905 7758 7529 3335 3541 4783 4241
9917 4241 4331 5788 7243 6673 5007 3162 3207 6614 7900 9239 8580 8107 9714 10265 8833 7776 6838
9900 6838 4742 1807 2354 5835 8000 5945 2823 1409 1949 1898 -66 -750 -1771 -730 -4299 -3161
9884 -3161 -637 4060 7487 8074 6777 3116 3618 3353 2720 1924 2951 5894 6423 6415 6803 6721 6255 7949
9866 7949 8544 11032 11364 4146 5521 7616 8715 9188 10122 12123 8466 8658 8411 7800 6017 3347 3808
9849 3808 1250 1615 4898 6999 5677 4610 4478 5873 8600 8681 7842 6976 5236 8625 7059 7497 10692
9832 10692 11637 11079 10603 12990 16278 14075 9997 9104 6260 3291 3243 3293 8420 10749 6119 4753 8325
9815 8325 10048 13330 9792 5431 5835 11239 10858 8026 8470 9902 9142 11617 12866 11586 12344 11015
9799A1015K955O18j880J298J94L96k764P3k337J561M320j709l121L37J384l128
9783I212J486L375N84q8k4l831j803p59j431j913l481R85K633p61R11K882P98
9766H775l667J192j254Q78L017K786Q56J869j595j38k614K26j182k089p34k438
9750C888M305L700m12K079K924j615j775o21r11N063K152r30j818l718P85P54
9734A3850K198q83o898m681L475L714L183K660m277m858K358K632K781M39j421
9719A4272r5q5r88J301J481j186N44L830j380n18r10l669m790P74M455J414k866
9702A1584k632l50L95L243J511l217j590j022J5K363m96j010P23K149Q62M66R64
9685A3958J335m67j080k712l875K421L219r36p21l366N57J051n89n37K65R17R54
$$ plain form
9799 11015 13970 14588 12708 14006 14200 14596 11832 11905 9568 11129 15449 13740 10619 10956 12340 9212
9783 9212 10698 14073 14657 14569 14545 10714 8911 8152 6721 4808 1327 2312 4945 4184 5095 7977 8775
9766 8775 5108 6300 5046 5924 8941 11727 12583 14452 12857 12719 10105 10331 9149 7060 6326 3888
9750 3888 8193 11893 11481 13560 16484 14869 13094 12473 11562 16625 18777 17847 16029 12311 13096 13850
9734 13850 16048 15165 8267 3586 7061 10775 13958 16618 12341 7483 9841 12473 15254 15693 14272
9719 14272 14177 14092 13104 14405 15886 14700 15244 19074 17694 17176 16266 12597 7807 8581 13036 14450 11584
9702 11584 8952 8602 8997 12240 13751 10534 8944 7922 7937 10300 9804 8794 9517 11666 12528 12994 13958
9685 13958 15293 14826 13746 11034 7159 9580 12799 11863 11142 7776 8333 9384 8795 8258 8523 9440 10394
9668A0394k11J465M703m38n094m029q67K804O62q93O04j64l44J233J871r32k709
9651H055R02L90o87J92j351j930j7M086L941M370L36j797K606L257K287j382k253
9634B1005k142n185k781j410j977L7N330L630J708l35j149j883J5k074k354J496
9618A1931j076Q85K071J168L128l532j02J690l76K631N33J9P36q35j045P32J518
9601B0076o13j411j544Q60J150L161r25j919J288K609K079K588j889k409l818
9586A9283l837P01J724K9o64J640K655j524l042l43j094q49Q13P18R94j410j286
9569A4508J807k45K64j328P58L098j883k601o41K314k310j707J526O49q81O13
9553A3941J576M641M51k132K200K558Q02N54j821j840r19M758P16M20J417m67
$$ plain form
9668 10394 10183 11648 16351 15913 10819 6790 5923 8727 9389 8496 9100 8936 8592 9825 11696 10764 8055
9651 8055 8957 9347 8660 8852 7501 5571 5554 9640 13581 17951 18287 16490 19096 22353 24640 23258 21005
9634 21005 18863 13678 10897 9487 7510 7547 12877 16507 18215 17880 16731 14848 14863 12789 10435 11931
9618 11931 10855 11740 13811 14979 18107 14575 14473 16163 15787 18418 18951 18970 19706 18871 17826 18558 20076
9601 20076 19463 18052 16508 17368 18518 21679 20754 18835 20123 22732 24811 27399 25510 23101 19283
9586 19283 15446 16147 17871 17900 17236 18876 21531 20007 16965 16622 15528 14679 15492 16210 17204 15794 14508
9569 14508 16315 16070 16334 15006 15764 18862 16979 14378 13737 16051 13741 12034 13560 14209 13328 13941
9553 13941 15517 20158 20609 18477 20677 23235 24037 24591 22770 20930 20011 24769 25485 25905 27322 26855
9537B6855m033k34J243j995j286M54M30J655J716k914k112J708K175J583r15K73
9521B4603J950k334l875K312K025m35P62J084R40o58l338k5Q91j547L078k315
9505B3118j317j317J636K474k963l202j538j718j88L39j367k214j650K734M175
9490A7002o11P59M04L92k862j491O438J172k598l825L79m46k937J729L210j155
9474A5560Q89L326l31L263J040k492O23J49q42J04K930L70j266l031p57N88J109
9457B1232O61J125R48J763p02l27L066J350j754n3L296K424J659k187r209k36
9441B3056O658K434k235j027m98m23K279L208j721Q61O85J236k94l073k153P30
9425B9723j198j68K440K395o67j064k003j527l489m129M9J827l364P35l66q57
$$ plain form
9537 26855 22822 22588 23831 21836 20550 21004 21434 23089 24805 21891 19779 21487 23662 25245 24330 24603
9521 24603 26553 24219 20344 22656 24681 24246 25008 26092 27032 26374 23036 23011 23902 22355 25433 23118
9505 23118 21801 20484 22120 24594 21631 18429 16891 15173 14985 15324 13957 11743 10093 12827 17002
9490 17002 16391 17150 17554 17946 15084 13593 20031 21203 18605 14780 15159 14713 11776 13505 16715 15560
9474 15560 16449 19775 19444 22707 23747 21255 21878 22027 21185 21289 24219 24589 23323 20292 19535 20123 21232
9457 21232 21893 23018 23966 25729 25027 24700 27766 29116 27362 27309 30605 33029 34688 32501 23292 23056
9441 23056 29714 32148 29913 28886 28388 27965 30244 33452 31731 32592 33277 34513 34219 31146 28993 29723
9425 29723 28525 28357 30797 33192 32525 31461 29458 27931 24442 20313 20362 22189 18825 19560 19194 18337
9409A8337k607J050N21J340M799N219K356j988m963k679M89L120j327O44l60J582
9393B5533O92J236J437J333K48k488l91k23N07j180L926P267M208J555J256L335
9377D8251L798K473j11J754L167M180O12P54K160L099K13L737K782O78K802O893
9361H7242J2528R177L477J0381J3982J3967J2849K1363K4070K4968K5920L1615
9349B91539M0101N1526O3800P1086Q3637R1616J03405J12704J11555R6532Q0348
9338A197849N0619J7293k1835n9074q6098j00852j06617j02414r9989q8798p3068
9327E27016o5787n5712m6797l7493k6160k1170k0939j6416j5872j6602j7928j4221
9315A71919j7339j9586j4861q538o777r840j1831r875l520j31j372Q96j416q567
$$ plain form
9409 18337 15730 16780 17301 18641 23440 28659 31015 29027 24064 21385 21874 24994 23667 24311 23951 25533
9393 25533 26225 27461 28898 30231 30479 27991 27600 27377 27884 26704 30630 37897 42105 43660 44916 48251
9377 48251 52049 54522 54411 56165 59332 63512 64124 64878 67038 70137 70350 74087 76869 77547 80349 87242
9361 87242 99770 108947 112424 122805 136787 150754 163603 184966 209036 234004 259924 291539
9349 291539 331640 383166 446966 518052 601689 693305 796710 909414 1020969 1117501 1197849
9338 1197849 1248468 1265761 1243926 1184852 1098754 997902 891285 788871 688882 600084 527016
9327 527016 461229 405517 358720 321227 295067 273897 252958 236542 220670 204068 186140 171919
9315 171919 154580 134994 120133 111595 104818 94978 83147 73272 69752 69621 68249 69145 67729 59162
9301E9162l574J028l423l928m185m715O25k270j239j02l49k638k994j272l14k223
9285B7589m225j981J600j864l984j843L333K266n900m845J950L332j042k402m776
9270G208n830m997l960n265p476l195l934l262k147l492o979o785o300q007r825
9255g4246j275l005n598l950J910J9748L7757N1261N9599N2740M7151L1969J8287
9242B32348P446j08m654j0806l181l849o060m489m497l798m654o9l221l652l484
9227A83272l941j985j658m925J686n13j831J024K303M867R97M348O438R371R927
9212B09380P645J2078J2503J1532N627N162O552M624O729J3573R893J0782J7808
9199C33888J7398J6572r18k8253l8086k8891j1216k797o544p018J446J956l846
$$ plain form
9301 59162 55588 56616 53193 49265 45080 40365 40990 38720 37481 37379 37030 34392 31398 30126 29812 27589
9285 27589 23364 21383 22983 21119 17135 15292 18625 20891 14991 10146 12096 15428 14386 11984 7208
9270 7208 1378 -3619 -7579 -12844 -20320 -23515 -27449 -30711 -32858 -36350 -43329 -50114 -56414 -64421 -74246
9255 -74246 -75521 -78526 -84124 -88074 -86164 -66416 -28659 22602 82201 134941 182092 214061 232348
9242 232348 239794 239686 235032 224226 221045 217196 211136 206647 202150 198352 193698 193629 190408 186756 183272
9227 183272 179331 177346 175688 170763 172449 171936 170105 171129 173432 178299 179296 183644 190082 199453 209380
9212 209380 217025 229103 241606 253138 258765 263927 270479 275103 281832 295405 305298 316080 333888
9199 333888 351286 367858 366940 338687 300601 271710 260494 257697 251153 244135 245581 247537 243691
9186B43691p372p301j56K275P708O622N978N083J0243J4362J6557J9002K4823
9173C41515L0986L9451N0244O4957Q8386J18926J55472J81111J65698J03510j178
9162A339078o0913r6378j45170j66357j47504j08837q2177n6734l8578k8154k1781
9151C86495k4814k0811j8244j1419q323n958q344q316p609n922p254m340J501
9138B56642m78M048M781P647M30P073Q803j887k317k321o753j1482j2619j2940
9124B38627r612r918o844q640l517m76K66l915j447j203j447p46K601J935L613
9109A99277J387J053K265M268J0968R479N959N857N370O092O877M785O192K541
9095B72370M16P3K365L733M957L269M617O818N585M717O686J0364J2628J5792
$$ plain form
9186 243691 236319 229018 228862 231137 238845 245467 251445 256528 266771 281133 297690 316692 341515
9173 341515 372501 411952 462196 527153 615539 734465 889937 1071048 1236746 1340256 1339078
9162 1339078 1278165 1181787 1036617 870260 722756 613919 531742 475008 436430 408276 386495
9151 386495 361681 340870 322626 311207 302884 296926 288582 280266 272657 266735 259481 255141 256642
9138 256642 256164 260212 264993 272640 273070 280143 288946 287059 284742 282421 275668 264186 251567 238627
9124 238627 229015 219097 212253 203613 200096 199620 199886 195971 194524 193321 191874 191128 193729 195664 199277
9109 199277 200664 201717 203982 208250 219218 228697 234656 240513 245883 251975 258852 263637 269829 272370
9095 272370 272786 272859 275224 278957 283914 287183 291800 298618 304203 308920 315606 325970 338598 354390
9081C54390K0541K3366K3854K5140K8846L1631L3609L1164L0235K7254K6477K1556
9069F78063J1633J0647j203j5354k0760k2197k6129k9479j7864q413l114M632
9057E60462Q445J5205J3524J4992J3404J4153J4080J3442R592R874J2953P166
9045G07292K419M554P370L679O354Q331Q444N518P150P119R773R019O45K918J1218
9030H01803J4334J3142J3693J7187J7848J9210J3802J4383J4056J1304J1301Q349
9018I70412P371P305J0402O814J0155J2791J5353J9000J7388J7402K2410K1645
9006A138448K0275K5836L3277M2630M3477N4294N6434N2924O0057O7331O5451
8995A660434P2684P7228Q2280Q1712Q8319Q9468R5046R6698R5137J01809J11539
$$ plain form
9081 354390 374931 398297 422151 447291 476137 507768 541377 572541 602776 630030 656507 678063
9069 678063 689696 700343 699140 683786 663026 640829 614700 585221 567357 558944 555830 560462
9057 560462 568907 584112 597636 612628 626032 640185 654265 667707 677299 687173 700126 707292
9045 707292 709711 714265 721635 725314 731668 739999 748443 753961 761111 768230 778003 787022 787667 790585 801803
9030 801803 816137 829279 842972 860159 878007 897217 911019 925402 939458 950762 962063 970412
9018 970412 977783 985088 995490 1002304 1012459 1025250 1040603 1059603 1076991 1094393 1116803 1138448
9006 1138448 1158723 1184559 1217836 1260466 1303943 1358237 1414671 1467595 1527652 1594983 1660434
8995 1660434 1733118 1810346 1892626 1974338 2062657 2152125 2247171 2343869 2439006 2540815 2652354
8984B652354J15121J26926J37189J49228J59662J70679J80191J99215K21111K43188
8974D354864K73757L18562L74259M35181N06031N87133O77556P84139R03147J041541
8964A0256170J207812J399554J640138J936839K291238K705576L181031L728530
8956B8346888M324617M909945N467046O037243O755474P909268R668539J2160454
8948H5579474J5608222K0218207K5920962L1939071L5781351L3771565K3152933
8941B71971785N672537q731734j7504498k5836262l2543335l2979001k8007286
8934A32042206k1577734j6059068j1980500r212550p549779o649801o039412n455871
8926D7517491m912011m436017l985482l551469l153522k791498k448461k144828
$$ plain form
8984 2652354 2767475 2894401 3031590 3180818 3340480 3511159 3691350 3890565 4111676 4354864
8974 4354864 4628621 4947183 5321442 5756623 6262654 6849787 7527343 8311482 9214629 10256170
8964 10256170 11463982 12863536 14503674 16440513 18731751 21437327 24618358 28346888
8956 28346888 32671505 37581450 43048496 49085739 55841213 63750481 73419020 85579474
8948 85579474 101187696 121405903 147326865 179265936 215047287 248818852 271971785
8941 271971785 277644322 268912588 251408090 225571828 193028493 160049492 132042206
8934 132042206 110464472 94405404 82424904 73212354 65662575 59012774 52973362 47517491
8926 47517491 42605480 38169463 34183981 30632512 27478990 24687492 22239031 20094203
8918B0094203j880681j646720j437189j261802j116161r98637r02599q22607p52778
8909I275029o93666o39709n83364n34282m92089m39187l96736l57611l24783k94609
8899D518993k69672k43051k25642k08140j93466j80409j66648j52174j39503j25940
8889B614348j16579j05687r7777q7937q6334q0366p4067o8443o4472o5426o1488
8878A705772o1483o0802o1179n8237n6194n3393m9019m6861m7173m4246m3743
8867A123442m0916l6997m0696l9118l7219l4239l5924l1958k2289k3039k1887
8856G59160j5732j1632r534j1098j0581j0334j2905j6243j1338r142q641q017
8844F23963o123n443m896p839p609q572j0206p643j0546p272m143j938J398M87
$$ plain form
8918 20094203 18213522 16566802 15129613 13867811 12751650 11753013 10850414 10027807 9275029
8909 9275029 8581363 7941654 7358290 6824008 6331919 5892732 5495996 5138385 4813602 4518993
8899 4518993 4249321 4006270 3780628 3572488 3379022 3198613 3031965 2879791 2740288 2614348
8889 2614348 2497769 2392082 2294305 2206368 2120034 2039668 1965601 1897158 1832686 1767260 1705772
8878 1705772 1644289 1583487 1522308 1464071 1407877 1354484 1305465 1258604 1211431 1167185 1123442
8867 1123442 1082526 1045529 1004833 965715 928496 894257 858333 826375 804086 781047 759160
8856 759160 743428 731796 722262 711164 700583 690249 677344 661101 649763 640621 631980 623963
8844 623963 617840 612397 607501 599662 592053 583481 573275 565632 555086 547814 543671 541733 543131 543618
8830E43618l412j678k204K245j475k344k084p748q630j4405j5966j4914j9204
8817D51799k5484k8293k3998k7191k5788k1432j4463p955p83K959J2280J4094
8805C05745J8325K3425K5999K5715J5947J3573Q116L202p90j938m966o698j2383
8792D13272q564q752r664j0610j1401j0686q510j0287j1222n383l841n138l995
8779C05219j047k758j171l591l808k854o260k162j662k777m279o563r197n693
8765B51397r660r840q038j0804r297q630j6048j8465j6919j7809j6375j3839j3697
8752H1976q730o243m742J197O090M94L030K583M275J456j191k653j423k565m685
8737F8869J865J171k460k35L346J726p82K782M609r58K9l239m422n362j626K019
$$ plain form
8830 543618 540206 538528 536324 538569 537094 534750 532666 524918 516288 501883 485917 471003 451799
8817 451799 426315 398022 374024 346833 321045 299613 285150 277195 276412 279371 291651 305745
8805 305745 324070 347495 373494 399209 415156 428729 436845 440047 439257 437319 432353 425655 413272
8792 413272 404708 395956 386292 375682 364281 353595 345085 334798 323576 318193 314352 309214 305219
8779 305219 304172 301414 300243 296652 292844 289990 283730 281568 279906 277129 272850 266287 257090 251397
8765 251397 241737 231897 223859 213055 203758 195128 179080 160615 143696 125887 109512 95673 81976
8752 81976 73246 67003 62261 63458 69548 70042 73072 75655 79930 81386 80195 77542 76119 73554 68869
8737 68869 70734 71905 69445 69210 72556 74282 73500 76282 80891 79933 79962 76723 72301 66939 65313 67332
8721F7332R16J371j820n445L4j372J212P13K29J201k075J077P95K746k345r7M310
8704F8782K8K599o14J575M531N67K176M221J965J774P900M173K436N447r11n400
8688A01249q122r997o523o245m021n448k192k997k867k310j551m85P19J934O148
8673E7292L298K062M80n543q40K066j509j871j808r29k347k015J380Rl881m862
8657D0982l731o016l842l260o767o254o092m745o492n948m137p131q944p855j0567
8642e0799o510p378q160J282J2736L1465N4890N9400N3450M3276L5925K2944R708
8629B52229n934j0768j0150m559k986l702m630k232m555j659J15l610k405j60
8615A94994k128o883n070m389m885m161n630n422m464J009j74p31n43%j052o319
$$ plain form
8721 67332 68248 69619 67799 62354 62388 61016 62228 62941 63170 64371 62296 63373 64168 66914 64569 64472 68782
8704 68782 68810 71409 70795 72370 76901 77468 79644 83865 85830 87604 95504 99677 102113 107560 106649 101249
8688 101249 93127 83130 76607 70362 66341 60893 58701 55704 52837 50527 48976 48491 49210 51144 57292
8673 57292 60590 62652 63132 57589 56749 58815 57306 55435 53627 52698 50351 48336 49716 49725 45844 40982
8657 40982 37251 31235 27393 24133 17366 11112 5020 275 -6217 -12165 -16302 -23433 -32377 -40232 -50799
8642 -50799 -57309 -64687 -72847 -71565 -58829 -27364 27526 86926 140376 183652 219577 242521 252229
8629 252229 246295 235527 225377 220818 217832 214130 209500 207268 202713 201054 201169 197559 195154 194994
8615 194994 192866 185983 180913 176524 171639 167478 161848 156426 151962 152971 152797 152066 151523 151523 150471 144152
8599A44152k770o458l318j509j576j082l28l468k679j433l287m965m347l140J064
8584A04856o28l166j375K748j877l037l90m75k388Q03K525j044j000K625J646
8569I9823k750q61k153k006J645N218J744L578R278J0617J2758J6261K0093K0664
8555A93909J9363K3151K8018L0900M0700M6810N3978O2726P4067Q9987R9913J05950
8543H69472J13007J08740R2177O7634L7769r4l9492o9438r0655j07113j12674
8532H69333j07954r5009q5697p3016n7208m9014m5788l6314l0274k7078k6969
8521B35012k7276j6969j8156j4669j4722j2052p971j0351m319m452n946m557q704
8508H4868m609j84k684k308l091k468l560j783N52K96J445j263l130J75N011m89
$$ plain form
8599 144152 141382 134924 131606 130097 128521 127439 127111 123643 120964 119531 116244 111279 106932 103792 104856
8584 104856 104228 101062 99687 102435 100558 97521 97131 96656 94268 95071 97596 96552 95552 98177 99823
8569 99823 97073 96212 94059 92053 93698 98916 100660 104238 113516 124133 136891 153152 173245 193909
8555 193909 213272 236423 264441 295341 336041 382851 436829 499555 573622 663609 763522 869472
8543 869472 982479 1091219 1183396 1251030 1288799 1288705 1249213 1179775 1089120 982007 869333
8532 869333 761379 666370 580673 507657 450449 401435 355647 319333 289059 261981 235012
8521 235012 207736 190767 172611 157942 143220 131168 123197 112846 108527 104075 98129 93572 84868
8508 84868 80259 80075 77391 75083 71992 69524 65964 64181 64733 65029 66474 65211 62081 62256 67267 66778
8492F6778l065j501l538n142K010J111m26l38n101k034J964k893q16j276J267
8477D7000L476J676m18k098n322L61K63j159p2j553m20j97O52J677j569l606k060
8460C6631j487K108k28k719k188l14J10j500N32j135j536l479j502m38O45J843
8444B5343j066J258K148k431L644N873N173K426j165J304k446R6L8j56J515k017
8428C9537m94j778j277O5J734m184N59j135L182k33m174j508J239R42r52k128
8412B9395r12n29K115N76r18k353j978Q12J313j580l084j242j348J039M824J852
8396B7982K209k214j901K597L820J755K036k598o324j61K438K320J0k092l294
8381B6583l201J892J417k531J259j097l233l403k171K621j111j227N16m18p93
$$ plain form
8492 66778 63713 62212 58674 53532 55542 56653 56227 55889 50788 48754 50718 47825 47009 45733 47000
8477 47000 50476 52152 51734 49636 44314 44675 44938 43779 43707 42154 41734 41537 42189 43866 42297 38691 36631
8460 36631 35144 37252 37024 34305 32117 31803 31913 30413 30945 29810 28274 24795 23293 22855 23500 25343
8444 25343 24277 25535 27683 25252 28896 34769 39942 42368 41203 42507 40061 40157 40195 40039 41554 39537
8428 39537 39043 37265 35988 36053 37787 33603 34162 33027 36209 35976 31802 30294 31533 32475 31523 29395
8412 29395 28483 27954 30069 30645 29727 27374 25396 26208 27521 25941 22857 21615 20267 21306 26130 27982
8396 27982 30191 27977 26076 28673 32493 34248 36284 33686 27362 27201 29639 31959 31969 29877 26583
8381 26583 23382 25274 26691 24160 25419 24322 21089 17686 15515 18136 17025 15798 16314 15896 15103
8366A5103k686j647K317J022j896l87r94R34K084j406j160j311p06K119k241L20
8350I465K892j979k238j624K658K206n023j4K089j937J915j570J80k42k033N69
8334E314J467P8j43Q72K307L234K57k030J626M15J39k790l747j969K917m2Q07
8317H712J483n744K046K153L505J470k177k992j320J126k90j03K407n06K701j763
8301A0708L32k612J507J232l222r50j214j19l051P51J383Q78J079k45l64J496
8285G589j259l494n5N764K486J885L428rk061M02J588j451j888l523N48j888k2
8268H040K565l79L80K751k795J502J20L88R04R79J847m14J631q78p72N93J78P39
8250A7379j303Q7j337j177M63J573j931j461o18Q80J274k327l258J557J021mJ472
$$ plain form
8366 15103 12417 10770 13087 14109 12213 11826 10832 11766 13850 12444 11284 9973 9267 11386 9145 9465
8350 9465 12357 10378 8140 6516 9174 11380 6357 6343 8432 6495 8410 6840 7020 6778 4745 5314
8334 5314 6781 6859 6716 7588 9895 13129 13386 11356 12982 13397 13536 10746 6999 5030 7947 7905 8712
8317 8712 10195 4451 6497 8650 12155 13625 11448 8456 7136 8262 7972 7869 10276 9770 12471 10708
8301 10708 11040 8428 9935 11167 7945 6995 5781 5662 2611 3362 4745 5623 6702 6457 6093 7589
8285 7589 6330 2836 2781 8545 11031 12916 16344 16335 14274 14676 16264 14813 12925 9402 9950 8062 8040
8268 8040 10605 10226 10606 13357 10562 12064 12184 12572 13476 14455 16302 15888 17519 16641 15869 16462 16640 17379
8250 17379 16076 16163 14826 13649 14112 15685 13754 12293 11675 12555 13829 11502 8244 9801 10822 10818 12290
8233A2290L126k213j770K01J375M316M13n877k881M11l30J897J211K113k581k201
8217I500J32R18J223L160J137j467k715m06L428J533J773o7k296K74n48l160K005
8200A4424Q76j652k717l82J912M27J219K535q16m351k019k419k045j878q65K32
8184B481j197p78L44J987l03p20J341n78P50L9m28K249Q542R44l898j102J144
8167A0817k082j485k955J237J554J505K430j724R40J489L638L926J325j933k549
8152A6133j490k85j602j125m094k899M064N38l769N72j029J018J351J484j36o13
8136H118L363R71p03K142M62k309N49L009N38n50n17m534j07k368J823L931M56
8119A4274j54L688N010L432j283n74m304m358k216j807k138m912L530N39k21K20
$$ plain form
8233 12290 15416 13203 11433 11634 13009 17325 17738 11861 8980 9391 9061 10958 12169 14282 11701 9500
8217 9500 9632 10550 11773 14933 16070 14603 11888 11482 14910 16443 18216 18149 15853 16127 15579 12419 14424
8200 14424 15300 13648 10931 10549 12461 12888 14107 16642 15826 11475 9456 7037 4992 3114 2249 2481
8184 2481 1284 506 850 2837 2534 1814 3155 2577 3327 3366 2938 5187 13729 14673 10775 9673 10817
8167 10817 8735 7250 4295 5532 7086 8591 11021 9297 10237 11726 15364 19290 20615 18682 16133
8152 16133 14643 14358 12756 11631 7537 4638 8702 9240 5471 6043 5014 6032 7383 8867 8731 8118
8136 8118 11481 12452 11749 13891 14353 12044 12593 15602 16140 15590 15073 10539 10432 8064 9887 13818 14274
8119 14274 14120 17808 22818 26250 24967 24393 20089 15731 13515 11708 9570 4658 8188 8727 8506 8726
8103H726k624m264N8K354P68N15R72j472L533o98j657q17J299L99j066j525K820
8086G321j900q83J270J938N48J421j09j380R78j836k564M30j216j273L293J793
8070G831r74l447J66K732Q78K82R66k278p51O19K342M54N78o91l62j58K224n53
8052I858N090K962J020Q92J477M20k243K755N585j69k759j83K846J719L011J452
8036C3733l87l935k906L10j021J000j20n36R69j668n378O46J874K531N68q2k172
8019B3426j052K615J766J918K663M807K239L171M853O269O645N479Q739J850R57
8004G6345j685n94l036n013k071k001q41L176M666O999P258K089k537m568r582
7989F8605j3199q698q046n258m708k964J847k27j613l165L56R21p83j314R25N8
$$ plain form
8103 8726 6102 1838 1896 4250 5018 5533 6505 5033 8566 7868 6211 5394 6693 7092 6026 4501 7321
8086 7321 5421 4538 5808 7746 8294 9715 9606 8226 9204 7368 4804 5234 4018 2745 6038 7831
8070 7831 6857 3410 3576 6308 7186 7468 8434 6156 5405 6024 8366 8820 9398 8707 8345 8187 10411 9858
8052 9858 14948 17910 18930 19822 21299 21719 19476 22231 27816 27647 24888 24705 27551 29270 32281 33733
8036 33733 33346 29411 26505 26815 25794 26794 26674 26138 27107 25439 20061 20707 22581 25112 25680 25598 23426
8019 23426 22374 24989 26755 28673 31336 36143 38382 41553 46406 52675 59320 64799 73538 75388 76345
8004 76345 74660 74066 71030 66017 63946 61945 61104 64280 68946 75945 83203 85292 82755 78187 68605
7989 68605 55406 46708 38662 33404 28696 25732 27579 27352 25739 22574 22930 23851 23068 21754 22679 22737
7973B2737n38j505J699L926J332K911N001K720N440L666M335K660R93k93O50j387
7957E4347j164N72J337l57N678o39j292l160m517n170l401l209m190j123p764
7942B5948q149K281N19j082m315k738L825J993k374j314R32J81L17o03k55n10
7926A4656J012J757P42R43J008L07n84L60O17R00L473J318n339l428k053J576
7910A7265o47k644K028J267l210l541J002j365l662J613k49j744m305j183L187
7895C812Q91q3J029R54o93J230J138l128k712r58o51N66j01l82J609O59j706j418
7877E6P85p15j699k096N55K279J119L873M000Q95j202k566l022k914n48q07K37
7860a770l181k61L057M578N97j863l64J256M74Q42q96j844m83J184J670l825l99
$$ plain form
7973 22737 22199 20694 22393 26319 27651 30562 35563 38283 43723 47389 51724 54384 55377 55084 55734 54347
7957 54347 53183 53755 55092 54735 60413 59774 58482 55322 50805 45635 42234 39025 34835 33712 25948
7942 25948 17799 20080 20599 19517 15202 12464 16289 18282 15908 14594 15526 15707 16024 15421 15166 14656
7926 14656 15668 17425 18167 19110 20118 20425 19841 20201 20818 21718 25191 26509 21170 17742 15689 17265
7910 17265 16618 13974 16002 17269 14059 10518 11520 10155 6493 8106 7857 6113 1808 625 3812
7895 3812 4703 4620 5649 6603 5910 7140 8278 5150 2438 1480 829 1395 1294 912 2521 3180 1474 56
7877 56 841 126 -1573 -3669 -3114 -835 284 4157 8157 9052 7850 5284 2262 -652 -1200 -2007 -1770
7860 -1770 -4951 -5212 -2155 2423 3020 1157 793 2049 2523 3365 2469 625 142 1326 2996 -829 -1228
7843a228K901j698J032M297M25Q9M76K74J950r69K28j228p10p43j646J84k298
7826A336l771k254j855k539J60K369L584L501r40j788M97j928k382k013L49J53
7810g521L183M088K926J241J202m187k856J994L73J138l17n91l155J150p13M11
7794a634J456J76p99j283L929L464J342K600l896j206j951n67n63r34N69K43k65
7777F81L944R59J340J088m352k17K239N04l532j180j535k676k717l226O2J392
7761g226J145K092M013K787R38k028r47K014L399N77J93o63k755j724m92K533
7745C856J94k142l609k288K925J881m18j169J113P30q15k101p87j136J051J921
7729g94L144q86k453j624n07J604J838O39L265J806m13j995n517l581J300J948
$$ plain form
7843 -1228 1673 -25 1007 5304 5729 5818 6294 6568 8518 7549 7777 6549 5839 5096 3450 3634 1336
7826 1336 -2435 -4689 -6544 -9083 -8923 -6554 -2970 531 -409 -2197 -1700 -3628 -6010 -8023 -7674 -7521
7810 -7521 -4338 -250 2676 3917 5119 932 -1924 70 443 1581 1264 673 -2482 -1332 -2045 -1634
7794 -1634 -178 -2 -801 -2084 1845 5309 6651 9251 5355 4149 2198 1631 1068 134 703 946 681
7777 681 4625 5584 6924 8012 3660 3443 5682 6186 2654 1474 -61 -2737 -5454 -8680 -8618 -7226
7761 -7226 -6081 -3989 24 2811 3749 1721 774 2788 6187 6764 6957 6294 3539 1815 1323 3856
7745 3856 4050 1908 -1701 -3989 -1064 817 399 -770 343 1073 258 -1843 -2630 -3766 -2715 -794
7729 -794 2350 1464 -989 -2613 -3120 -1516 322 961 4226 6032 5619 3624 -1893 -5474 -4174 -2226
7713b226J604j93M83o36K881J837J187j647n740k130k732M655J872L17L123J31
7697B786r61k76K5m85j450p9j53J310J523O69L294J030j879j106p61J071j467
7680C091j005p18j124k075j330j95K1k4K99N033L059j753m556k296Q89J770J831
7663I17k307J147J338m38j031J739k343j495j753K183j061K2m89P22K739M152
7647D042K697n38l034l574J038j768j089j27r50j735J12L987k722M90K857r38
7631a252j149j193Q58M89r36K640K445k908k503L47K560N98J668j388n43Q00L370
7614C903M57l01j62Kj463K092k15k195m23J261J46k512N62K892j402l319l59m85
7596a521Q19J160n65P48K030l48j767k432N44j0j657j082J451K256K670r74j106
$$ plain form
7713 -2226 -622 -815 -332 -968 1913 3750 4937 3290 -2450 -4580 -7312 -2657 -785 -468 2655 2786
7697 2786 1825 1549 1574 1089 -361 -440 -593 717 2240 2909 6203 7233 5354 4248 3487 4558 3091
7680 3091 2086 1368 244 -1831 -3161 -3356 -3335 -3359 -3060 1973 5032 3279 -1277 -3573 -2684 -914 917
7663 917 -1390 -243 1095 657 -374 1365 -978 -2473 -4226 -2043 -3104 -3082 -3571 -2849 -110 4042
7647 4042 6739 6201 3167 -407 631 -1137 -2226 -2353 -3303 -5038 -4926 -939 -3661 -3171 -314 -1252
7631 -1252 -2401 -3594 -2736 -2247 -3183 -543 1902 -1006 -3509 -3162 -602 -4 1664 276 -267 533 3903
7614 3903 4360 4059 3897 3899 2436 4528 4313 2118 1695 2956 3102 590 1152 4044 2642 -677 -1036 -1521
7596 -1521 -702 458 -107 641 2671 2323 556 -1876 -1332 -1342 -2999 -4081 -2630 -374 2296 1322 216
7579B16k71j338L98l42j239j812M787L569p99k432k316J220L60M507J197n14m061
7562A130j123j078j053K062L334O8K570p78j099o61k99J870J592j009j518j884
7546B124o787l054J10M10M246K300n53O86m3J406M127L059l567k052q06J400k234
7529G72j874O27O04J444O73j041J169k487o06j309r63k1K868M480j357k910k368
7512b299j876P25K895K743L328k367k712J452l176l565N474N396J238k716o05
7497C935j633m378L77K309j209j60k574n60pR79J342J701r91M76m170J233J561
7480a769k096J772J08J173K425k233k053J224j615Q21J549J144p99k99R28K208
7464B488q00L4K181l333k836K767k846l238L044O33j81r97J735J203j950M64K13
$$ plain form
7579 216 -55 -1393 -995 -1337 -2576 -4388 399 3968 3169 737 -1579 -359 1 4508 5705 5191 1130
7562 1130 7 -1071 -2124 -62 3272 3340 5910 5132 4033 3372 3073 4943 6535 5526 4008 2124
7546 2124 -4663 -7717 -7607 -7197 -2951 -651 -1204 -518 -561 845 4972 8031 4464 2412 1606 3006 772
7529 772 -1102 -475 129 1573 2246 1205 2374 -113 -719 -2028 -2991 -3012 -144 4336 2979 69 -2299
7512 -2299 -4175 -3450 -555 2188 5516 3149 437 1889 -1287 -4852 622 6018 7256 4540 3935
7497 3935 2302 -2076 -1699 610 -599 -759 -3333 -3893 -3900 -2921 -1579 122 -869 -393 -4563 -3330 -1769
7480 -1769 -3865 -2093 -1985 -812 1613 -620 -2673 -1449 -3064 -2243 -694 450 -349 -648 280 2488
7464 2488 1688 1722 3903 570 -2266 501 -2345 -5583 -2539 -1906 -2087 -3084 -1349 -146 -2096 -1632 -1419
7447a419j900O92P14K641j653M62K124J942J137N72l66k336r56K377n07l874K226
7430A876J894Q77l108r82k839L65L567j247Q05k053n21l110m41N73N64K183j76
7413a773k918J106Q47r47K057K637j451L420J524K5j668m792j35L190M478J146
7397F746j074j699q59q04L46j141k091k318L30K98m12j0J573J708J78j571J142
7380C42j904k953J685N93l196j844R73K48K459M725n24J794q12l076J801J062
7364A373j638r04j777J559J471N90m164k1K753j965j709n23P25K671K269P58n26
7347I42j545J22j292K40M069J6m173k136J084R97L77o10J180L314j054j717k584
7330b770J240k624j256j880J03l08L638K384r80J995J784m90k410r16j870M51
$$ plain form
7447 -1419 -3319 -2627 -1913 728 -925 -463 1661 3603 4740 5312 4946 2610 1654 4031 3524 -350 1876
7430 1876 3770 4647 1539 557 -2282 -1917 1650 403 1208 -845 -1366 -4476 -4917 -4344 -3780 -1597 -1773
7413 -1773 -4691 -3585 -2738 -3685 -1628 1009 -442 2978 4502 4527 2859 -1933 -2068 1122 5600 6746
7397 6746 5672 3973 3114 2310 2656 1515 -576 -2894 -2564 -2266 -2678 -2688 -1115 593 771 -800 342
7380 342 -1562 -4515 -2830 -2237 -5433 -7277 -6304 -6056 -3597 1128 604 2398 1586 -1490 311 1373
7364 1373 -265 -1169 -2946 -1387 84 674 -3490 -3511 -758 -2723 -4432 -4955 -4230 -1559 710 1468 942
7347 942 -603 -481 -1773 -1533 2536 2552 -1621 -3757 -2673 -1676 -1299 -1909 -729 2585 1531 -186 -2770
7330 -2770 -1530 -4154 -5410 -7290 -7187 -7495 -3857 -1473 -2453 -458 1326 836 -1574 -2490 -4360 -3909
7314c909N41k114n98l515P20M692J813K533j093J012K049N46R48N24m97j515j196
7297I41k152o05n21k664k908j344J495L749K542r59R69P38L842L287m235j339
7281H36O27j632j480K441j500J870L109Q89k44K883N09m487n114J442J16J222
7265A487k06L7k465l163K400j856l608L517M215L16O49j600J380k87j237J387
7249I66J446o60j714J253p76N89j92l930l3k458j031r52J431J707J304l586j262
7232g898O539O15k027P23J129p97n67o84j510L119L183k608j454j148j812J045
7216d152J504P9K95l525J71J682J898k192j729n17J876K478k354o68L712P994
7200F552K099j662k826k154j79r34k064l089j718J405j402J04M058k865Q5K007
$$ plain form
7314 -3909 -3368 -5482 -6080 -9595 -8875 -4183 -2370 163 -930 82 2131 2677 3625 4149 3652 2137 941
7297 941 -1211 -1816 -2337 -5001 -7909 -9253 -7758 -4009 -1467 -2426 -1457 -719 3123 6410 2175 836
7281 836 1463 -169 -1649 792 -708 1162 4271 5160 4916 7799 8308 3821 -1293 149 265 1487
7265 1487 1281 1318 -1147 -4310 -1910 -3766 -7374 -3857 358 674 1323 -277 1103 816 -421 966
7249 966 2412 1752 38 1291 515 1104 912 -3018 -3051 -5509 -6540 -7492 -6061 -4354 -3050 -6636 -7898
7232 -7898 -1359 -744 -2771 -2048 -919 -1716 -2283 -2967 -4477 -1358 1825 -783 -2237 -3385 -5197 -4152
7216 -4152 -2648 -2569 -2274 -5799 -5628 -3946 -2048 -4240 -5969 -6486 -4610 -2132 -4486 -5154 -1442 6552
7200 6552 8651 6989 4163 2009 1830 896 -1168 -4257 -5975 -4570 -5972 -5868 -1810 -4675 -4590 -2583
7184b583j028k279l42L464M574m41k543M41J659j262k071j003q82q77K482j123
7168c814K186L043M245k063k758K322l331q65N18K005j53L596p41k150m50K466
7152D056L44o60K060k109n236J25M0P01L363m305l878K135K178j329k512J774
7136c253J573j531L53o25n30M560K152j204j48k364q09N14j826L83J556j136J428
7119i07J860K399n39k052L34N39n83K655n9m45l999k039K906K212k833j161L554
7102A842J286J053k572k801J321K6Q90K206K166r30l343j16j433j659r94j359
7086d417K380K186j708l795K247L910o6r68j331L834M4l320l249j577K515K514
7070h01j192K64k42L751J300j691j706K804k33K508J065j402n682j935J097q70
$$ plain form
7184 -2583 -3611 -5890 -6232 -2768 1806 1365 -1178 -737 922 -340 -2411 -3414 -4296 -5173 -2691 -3814
7168 -3814 -1628 1415 5660 3597 839 3161 -170 -1035 -517 1488 1335 4931 4190 2040 1590 4056
7152 4056 4400 3740 5800 3691 -1545 -1420 -1380 -679 2684 -1621 -5499 -3364 -1186 -2515 -5027 -3253
7136 -3253 -1680 -3211 -2858 -3483 -4013 547 2699 1495 1347 -1017 -1826 -1312 -3138 -2755 -1199 -2335 -907
7119 -907 953 3352 2813 761 1095 1634 1051 3706 3647 3202 -797 -2836 70 2282 -551 -1712 1842
7102 1842 3128 4181 1609 -1192 129 155 1045 3251 5417 4487 1144 1028 -405 -2064 -3058 -4417
7086 -4417 -2037 149 -1559 -5354 -3107 803 737 -231 -1562 2272 2316 -1004 -4253 -5830 -3315 -801
7070 -801 -1993 -1729 -1971 1780 3080 1389 -317 2487 2254 4762 5827 4425 -1257 -3192 -2095 -2965
7054b965J963j89O77N926K41l024k13L872J700k021k67j060j567J08L849m31m562
7037B037j411p19J391N2j82Q40l868j861q47J534K194k183p46j903J75k607J677
7020f427J922K282k575K211L326o98m624p93L859l84j917P76L15J014K56N41N88
7003c28k46r16L426J891K571l79j898j33j016l103j483j759l94k18J12M062j808
6986a619n60j879J240L915j111r27L701j055k633O76j320j084j115J791R22L22
6970g36m018M614L525k088m22j092R65K999M39K372l97l230l24J322J982M9m428
6953A532m142J054lj701k654k482L961J329j15N27j033j996J641N243J590J148
6937C899l53j383k188r03J640J519o49l169Q27Q3m747J656L698K236j761j756
$$ plain form
7054 -2965 -1002 -1191 -514 5412 5653 2629 2416 6288 7988 5967 5700 4640 3073 3181 7030 6599 2037
7037 2037 626 -93 1298 1350 1168 2008 -1860 -3721 -4568 -3034 -840 -3023 -3769 -5672 -5497 -8104 -6427
7020 -6427 -4505 -2223 -4798 -2587 739 41 -4583 -5376 -1517 -1901 -3818 -3042 -2727 -1713 -1457 -916 -328
7003 -328 -574 -1490 1936 3827 6398 6019 4121 3988 2972 -131 -1614 -3373 -3767 -3985 -3873 189 -1619
6986 -1619 -2179 -4058 -2818 1097 -14 -941 2760 1705 -928 -252 -1572 -2656 -3771 -1980 -1058 -736
6970 -736 -4754 -140 3385 1297 875 -217 748 3747 4186 6558 6161 2931 2607 3929 5911 5960 1532
6953 1532 -2610 -1556 -1559 -3260 -5914 -8396 -4435 -3106 -3221 -2694 -3727 -5723 -4082 1161 2751 3899
6937 3899 3546 2163 -25 -928 712 2231 1582 -1587 -760 -677 -5424 -3768 -70 2166 405 -1351
6921a351j286j104N99L321K003k94l449m945O81L176k43k741p55j035J673L146
6905b604N57M134K974o80l570k101j928j786K170R79M905L375Q14m412j073r04
6889H50l622n324M7J665J871j308K266q31k778n28M13J05j102n20j49L841M195
6872i09l671n528q22R63K049M818K761l51k589k704J755J107q86o93L815L957
6856C072k506k787N237L082j771n098M00m68j568K470J738P51J480r01j909O80
6840A902k276j564j046J94j152q32n5J107K126J922j503K657K552k250j781j610
6824a609l69k366k029J444J04J547K609R97j369j169p38K813J887l64j691k831
6808c134k944K835P82k298J56O19K69K95o02k04J554j460k027K602K412K527k03
$$ plain form
6921 -1351 -2637 -3741 -3142 179 2182 1888 -1561 -6506 -5825 -2649 -2892 -5633 -6388 -7423 -5750 -2604
6905 -2604 -2047 2087 5061 4381 811 -1290 -3218 -5004 -2834 -1855 3050 6425 7239 2827 1754 850
6889 850 -2772 -8096 -8049 -6384 -4513 -5821 -3555 -4386 -7164 -7692 -7279 -7174 -8276 -8796 -8945 -5104 -909
6872 -909 -4580 -10108 -10930 -9967 -7918 -3100 -339 -690 -3279 -5983 -4228 -3121 -4007 -4700 -885 3072
6856 3072 566 -2221 3016 6098 4327 -771 -371 -839 -2407 63 1801 2552 4032 3131 1222 1902
6840 1902 -374 -1938 -2984 -2790 -3942 -4774 -4829 -3722 -1596 326 -1177 1480 4032 1782 1 -1609
6824 -1609 -1978 -4344 -6373 -4929 -4825 -3278 -669 328 -1041 -2210 -2948 -135 1752 1388 -303 -3134
6808 -3134 -6078 -3243 -2461 -4759 -4603 -3984 -3715 -3420 -4022 -4226 -2672 -4132 -6159 -3557 -1145 1382 1179
6791A179k413J623j940l177l43N167j37k027K467N84O63J862l210j451n05j127
6775b785J820k349j412M22J740O30K055j053l487N04j811k064N040L220k077l325
6759d932j94K077L09J296q5J409L020j157q26k357j861K241M293L736j946n289
6743b66l170J174Q30n43J492M53l61k747J987K092k240k406J566P27m08J319J166
6726F65j123o06N08j184m012K27K643J819q04P26j440k026L413K4l51k04j016
6709b741J684k111m417J885L880P28j041K43q91L22J173K035J609o97o99k04n445
6692d687l664J801o5n94J588K313N04J620k39k231K581P64J923J903K56m05j053
6675B315k025K830L077M47m259j871l53K088o37l57L982m629L41j279L309M54
$$ plain form
6791 1179 -1234 389 -1551 -4728 -5071 96 -41 -2068 399 983 1646 3508 298 -1153 -1658 -2785
6775 -2785 -965 -3314 -4726 -4304 -2564 -1934 121 -932 -4419 -3915 -5726 -7790 -2750 470 -1607 -4932
6759 -4932 -5126 -3049 -2740 -1444 -1529 -120 2900 1743 917 -1440 -3301 -1060 3233 6969 5023 -266
6743 -266 -3436 -2262 -1432 -1975 -483 -30 -391 -3138 -1151 941 -1299 -3705 -2139 -1412 -1820 -501 665
6726 665 -458 -1064 -556 -1740 -5752 -5525 -2882 -1063 -1867 -1141 -2581 -4607 -1194 -1170 -1521 -1725 -2741
6709 -2741 -1057 -3168 -7585 -5700 -1820 -1092 -2133 -1890 -2781 -2459 -1286 749 2358 1661 962 758 -4687
6692 -4687 -8351 -6550 -6615 -7209 -5621 -3308 -2804 -1184 -1423 -3654 -1073 -309 1614 3517 3773 3368 2315
6675 2315 290 3120 6197 6644 2385 514 161 2249 1612 1255 5237 608 949 -330 2979 3433
6659C433K405k095j198p8j370k9j87j603l073K548K739j677k623J179J552J389
6643A312L47o2M69L95P1l46o17k506K334J461m958j178p10mN088J526p83k505
6625f66j577K30k985j058r69M97N744J453P45K235J431j829n907j947L239L050
6609A686K008j706j030m351j851J873R93N9r03j193J398K081K626j393l927P72
6593b858K261R71k503k525J3L08K690J210J783K479L031k609k545M83J62Q26N54
6576C731k043l83k213r45J223K642J318k546j624K459K70J77R5k54l69k80J474
6559B732K266k878j163o51j070k050j571J998r03L74J71L115J398J80q52m46K23
6542H73j889K731L168P94k483l514m656j017L806O375J396k637k249n50J027j537
$$ plain form
6659 3433 5838 3743 2545 2467 1097 1068 881 -722 -3795 -1247 1492 -185 -2808 -1629 -77 1312
6643 1312 1659 1597 2066 2461 2532 2186 1569 -937 1397 2858 -2100 -3278 -3988 -3992 1096 2622 1839 -666
6625 -666 -2243 -2013 -4998 -6056 -7025 -6528 -784 669 1414 3649 5080 3251 -2656 -4603 -1364 1686
6609 1686 3694 1988 958 -3393 -5244 -3371 -2378 -2319 -3222 -4415 -3017 -936 1690 297 -3630 -2858
6593 -2858 -597 374 -2129 -4654 -4641 -4333 -1643 -433 1350 3829 6860 4251 1706 2189 2351 3177 3731
6576 3731 1688 1305 -908 -1853 -630 2012 3330 784 -840 1619 1889 2066 2161 1907 1538 1258 2732
6559 2732 4998 2120 957 306 -764 -2814 -4385 -2387 -3290 -2916 -2745 370 1768 1948 1096 650 873
6542 873 -1016 1715 4883 5677 3194 -320 -4976 -5993 -2187 4188 5584 2947 698 148 1175 -362
6526c62q18L36J421j870k299J522M032j111l237L2R14r8k575j327N561K788m73
6509B436m5k81l234m652J164K226K343Q26j889m38M124k437j861L88n90K470j54
6492C96k739J471k03j140j766j151R33L634K281K054M002l350n372l285J253O13
6476b369O97M637J585l527J077k38J823J79m11K94l448p26q26J827L82n09q58
6459d11l59P63N027k644m858o8m076M81N30J783L845j447k715M556J468K19j647
6442D47r93J858j87j895j338N81P53J798K699L844k71m325l086l710j431L434
6426a822o19l07K690j9q41K526M4o51jj682j19j998n29n1R1L962J778R5N29j222
6406A854k973m58J372K940p70l126k561j863J854L215K607j719k79r84j944q78
$$ plain form
6526 -362 -1180 -844 577 -1293 -3592 -2070 1962 851 -2386 -2354 -1440 -1538 -4113 -5440 121 2909 2436
6509 2436 2391 2110 -1124 -5776 -4612 -2386 -43 783 -1106 -1544 2580 143 -1718 -1330 -1920 550 396
6492 396 -2343 -872 -1075 -2215 -3981 -5132 -4199 -565 1716 3770 7772 4422 -950 -4235 -2982 -2369
6476 -2369 -1672 2965 4550 1023 2100 1862 3685 3864 3453 3747 299 -427 -1253 574 956 447 -411
6459 -411 -770 -7 5020 2376 -2482 -2550 -6626 -6145 -5615 -3832 13 -1434 -4149 407 1875 2094 447
6442 447 -546 1312 1125 -770 -2108 -1527 -774 1024 3723 7567 7296 2971 -115 -3825 -5256 -1822
6426 -1822 -2441 -2748 -58 -77 -918 1608 1652 1001 1000 -682 -801 -2799 -3328 -3379 -3288 674 2452 2547 3076 1854
6406 1854 -1119 -1577 -205 2735 1965 -1161 -3722 -5585 -3731 -516 2091 372 93 -891 -2835 -3713
6390c713J888N805L647J660l01m074j426j901j288o77M92J425k247k593K370o99
6374a632J617M845N82m145j437K364N24k076l094L844J683j628l546j084K76k003
6358d910j750J938J549J378L346j133O36R99K790m36J634l06J16Q64k573J818
6342E960l80o06k630l701j525K78j07J565K270N83j332k795J644o88n24n59K529
6325a8J369M120L053K012k697m506l88o51l001Q0R88k087p67l87L083J924j282
6308H45J167j499j159k197J47K095M8k90m768K80L74M105K374q42O17j799K23
6291b79k52j632k428k99M55J341K75Q36J664J672J356j143J100l777P92J6J97
6274a06j695k083J045j1m048J633L122M581M952l292l323k211j860K9K488L423
$$ plain form
6390 -3713 -1825 3980 7627 9287 8986 4912 3486 1585 297 -380 112 1537 -710 -3303 -933 -1632
6374 -1632 -15 4830 5412 1267 -170 2194 2718 642 -2452 1392 3075 1447 -2099 -3183 -2907 -4910
6358 -4910 -6660 -4722 -3173 -1795 1551 418 1054 2053 4843 4407 6041 5735 5851 6715 4142 5960
6342 5960 5580 4974 2344 -1357 -2882 -2604 -2711 -1146 1124 1707 375 -2420 -776 -1464 -1988 -2547 -18
6325 -18 1351 5471 8524 10536 7839 3333 2945 2294 -707 -627 361 -1726 -2493 -2880 203 2127 845
6308 845 2012 513 -646 -2843 -2696 -601 -553 -843 -5611 -5331 -4957 -852 1522 680 1297 -502 -279
6291 -279 -531 -2163 -4591 -4890 -4435 -3094 -2819 -1983 -319 1353 2709 1566 2666 -1111 -319 -303 -106
6274 -106 -1801 -3884 -2839 -2850 -6898 -5265 -2143 2438 7390 4098 775 -1436 -3296 -3267 -779 2644
6258B644m9l906j63Q71K601k781n31k757L898K368j955o76p22J792M05k461j167
6241b589R78k96O98n11k602L009j765o41j621N80L085L424J427l263m300j561
6225e948l650K162M402j25L97r52j464N231k64j207l99N90J663k34j291l209j192
6208e490K86K898j216m811L489p17m113K547M435K901R42N38j741N87J649J692
6192C876j868l725r91K143Q91L20k845J309J640J91m46P47o54k562k41j536n074
6175h825j180M422K282j217K36l89n12Q10J677M95J458R90J126j530j479j750
6159c386k865l56J330M63L692J489J864k299o88j110j35k9l000M357M387J254
6143D968l423j595l98k073k283j062J292M90J32J711k767K287J770l77K298K474
$$ plain form
6258 2644 2595 -1311 -1474 -603 1998 -783 -1314 -4071 -173 2195 240 -436 -1158 634 1039 -1422 -2589
6241 -2589 -1611 -1907 -1209 -1720 -4322 -1313 -3078 -3719 -5340 -4760 -1675 1749 3176 -87 -4387 -5948
6225 -5948 -9598 -7436 -3034 -3159 -2762 -3714 -5178 53 -211 -1418 -1817 -1227 436 202 -1089 -4298 -5490
6208 -5490 -5204 -2306 -3522 -8333 -4844 -5561 -9674 -7127 -2692 209 1151 1689 -52 535 2184 3876
6192 3876 2008 -1717 -2708 -565 326 646 -2199 -890 750 941 495 1242 588 -1974 -2215 -3751 -8825
6175 -8825 -10005 -5583 -3301 -4518 -4282 -4671 -5183 -4373 -2696 -2201 -743 247 1373 -157 -1636 -3386
6159 -3386 -6251 -6607 -5277 -4814 -1122 367 2231 -68 -756 -1866 -2001 -2030 -5030 -673 3714 4968
6143 4968 1545 -50 -448 -2521 -4804 -5866 -4574 -4084 -3952 -2241 -5008 -2721 -951 -1328 970 3444
6127C444m81l844k206L619K655r32m420q84M204L67k746m38J374L402J609j786
6111B937p95k04p16k434l89j616O39J792p53J591j69l15m753K02M149k357M40
6094b751M14j088j905j003M705K749N56J759n75j271L654K4j539j463P91j088
6078A969J547n89j808O39p19l98l52m10p72J769m01j776J09K600l90m26J328p07
6060A213K525R67j204k084K535O10p37R72j351j692j754k735K4J822L499M60J547
6043D617N092l046r13l025N33m182q54K613J464n33m56J254K917Rm16k475k278
6026C21L430P79j316L99Q34j746M7p1M496K903l040j796m789m62M024K502l330
6009C185o81K042k769j989J444J414j967j53L21J512k2M51j05k824j584Q62M27
$$ plain form
6127 3444 2963 -881 -3087 532 3187 2255 -2165 -3049 1155 1522 -1224 -1662 -288 3114 4723 2937
6111 2937 2142 1938 1222 -1212 -1601 -3217 -2578 -786 -1539 52 -117 -432 -5185 -4983 -834 -3191 -2751
6094 -2751 -2337 -3425 -5330 -6333 -1628 1121 1677 3436 2861 1590 5244 5268 3729 2266 3057 1969
6078 1969 3516 2927 1119 1758 1039 641 289 -121 -893 876 475 -1301 -1192 1408 1018 592 1920 1213
6060 1213 3738 4705 3501 1417 3952 4562 3825 4797 3446 1754 0 -2735 -2711 -889 2610 3070 4617
6043 4617 9709 6663 5750 2725 3258 -924 -1778 835 2299 1766 1310 2564 5481 5490 5074 2599 321
6026 321 3751 4530 3214 3613 4447 2701 2748 2677 7173 10076 7036 5240 451 -11 4013 6515 3185
6009 3185 2504 4546 1777 -212 1232 2646 679 526 847 2359 2337 2788 2683 -141 -1725 -863 -436
5992d36J551N72j436n32p03J168j006lQ4M059j441j651n91M52j95L8m162k33o24
5973e089O70K249N49K085j082L492o15l558k535k419P6K297J248k020m11J493
5957c570N12j29n71P03r90l83J904J156J328L849K552l236o8o98k957P72Q43j618
5939f01n65M600j592j220j073M47N85m62J797N60j579J184J67j673k456k332O22
5922c591J934j009J162L071k863k680m19P02J456J58J45J285K675n75j871l063
5906c483j756M383L907L62j257j521j016k590N29j458k982J155m33M394q50r80
5890c596J681O273J752j218m77j952j07j228M68J307p53p95m292J97N67K773j419
5873h19k181k631n67J482J916q20J398O59rj833j178L181P75j806J864K886k908
$$ plain form
5992 -436 1115 1687 251 -281 -984 184 -822 -825 -741 3318 1877 226 -365 87 -108 -70 -4232 -4465 -5089
5973 -5089 -4419 -2170 -1621 464 -618 2874 2259 -1299 -3834 -6253 -6177 -3880 -2632 -4652 -5063 -3570
5957 -3570 -3058 -3187 -3758 -3055 -4045 -4428 -2524 -1368 -40 3809 6361 3125 3057 2359 -598 174 1017 -601
5939 -601 -1166 3434 1842 622 -451 -4 581 119 1916 2476 897 2081 2248 575 -1881 -4213 -3591
5922 -3591 -1657 -2666 -1504 1567 -1296 -3976 -4395 -3693 -2237 -2079 -1934 -649 2026 1451 -420 -3483
5906 -3483 -5239 -856 3051 3413 2156 635 -381 -2971 -2442 -3900 -6882 -5727 -6160 -1766 -2616 -3596
5890 -3596 -1915 4358 6110 4892 4415 2463 2356 1128 1596 2903 2150 1355 -2937 -2740 -2173 600 -819
5873 -819 -3000 -5631 -6198 -4716 -2800 -3620 -2222 -1563 -1572 -3405 -4583 -1402 -627 -2433 -569 2317 -591
5856e91l168M35K56K8N19J663L556l4l017j206k137j654J090J856P7J018j300
5839b609k266k2J780L820J082k693q9k643j866P33L970K388j449q78K426m23O46
5822A907k368o833J80K054M170n20J019M416k654j482k044J634K174N51J98j043
5806A359Q10J773k956q70j530J428R70p2k557J911K934k482k479j721j524N147
5790A41N8j081k59p21l887j376L662M214O82k399j206j499L646P07q85k991l235
5773f429J03K443J897J577O04J863K206l971l046j764R85L469M279R45k255l897
5757i91k37r06L67j21l84j919L903J389O31J481l3o21k137P63L166O3Q27r90l492
5738G59L25k84j45k114k199J404J383j000j455p59l7P80l92L47l68R31n44M10
$$ plain form
5856 -591 -3759 -3324 -3068 -3040 -2521 -858 2698 2664 -353 -1559 -3696 -5350 -4260 -2404 -2327 -1309 -2609
5839 -2609 -4875 -4897 -3117 703 1785 -908 -997 -3640 -5506 -4773 -803 1585 136 -742 1684 1261 1907
5822 1907 -461 -7294 -7114 -5060 -890 -1410 -391 4025 1371 -111 -2155 -521 1653 2204 2402 1359
5806 1359 2169 3942 986 116 -1414 14 984 912 -1645 266 3200 718 -1761 -3482 -5006 141
5790 141 199 -882 -1141 -1862 -5749 -7125 -3463 751 1433 -966 -2172 -3671 -25 682 -203 -3194 -6429
5773 -6429 -6326 -3883 -1986 -409 195 2058 4264 293 -2753 -4517 -3532 -63 4216 5161 2906 -991
5757 -991 -1228 -2134 -1767 -1888 -2272 -4191 -288 1101 1732 3213 3180 2559 422 1185 4351 4414 5241 4251 759
5738 759 1084 800 655 -1459 -3658 -2254 -871 -1871 -3326 -4085 -4122 -3342 -3734 -3387 -3755 -2824 -3368 -2958
5720b958j263p77L113K858M47j363k120J472J510j88j140m20k533j813j65L919
5704a421J780N2m73K30K873P91N05k005k203Q05j774j972L691O94j397l458k128
5687e410K352R11o25J44k115j09L31j079j758J567P49K09J743m968j610K731M397
5670b540L042j328J523j209M45O74k688q05j79L351p55o03J749K52j235j506P12
5653a100m71l108L592L090l84o01j397k241R08L117R4L60K44p99L449J400j91
5636E962o92j620j659J691j014l956L150K524r23k866j616L766L10l83l759R71
5620a14K11l377l97k155L554K147M162j322l509K76k216j284M194L280P8q46k222
5603D60j818M06m4l300j749K595L384o79l99Q81n97j776k770J58n2J410M750Q95
$$ plain form
5720 -2958 -4221 -4998 -1885 973 1420 57 -2063 -591 919 731 -409 -829 -3362 -5175 -5340 -1421
5704 -1421 359 411 -62 168 3041 3832 4337 2332 129 934 -840 -2812 879 1573 176 -3282 -5410
5687 -5410 -3058 -2147 -2772 -2628 -4743 -4852 -4521 -5600 -7358 -5791 -5042 -4833 -3090 -8058 -9668 -6937 -2540
5670 -2540 502 -826 697 -512 -67 607 -2081 -2886 -3065 286 -469 -1072 677 929 -306 -1812 -1100
5653 -1100 -1571 -4679 -1087 2003 1619 1018 -379 -2620 -1712 1405 1499 1859 2103 1304 4753 6153 5962
5636 5962 5270 3650 1991 3682 2668 -1288 1862 4386 3463 597 -1019 2747 3057 2674 -1085 -114
5620 -114 97 -3280 -3677 -5832 -2278 -131 4031 2709 -800 -524 -2740 -4024 170 3450 3528 2682 460
5603 460 -1358 -952 -996 -4296 -6045 -3450 -66 -745 -1144 -263 -860 -2636 -5406 -5248 -5300 -3890 860 1755
5585A755q30j253j744m53J761k757j22J815M792K864J922l386m272r10k900P68
5569b950j26M30J717J94O28L874N32o050l336J484K984l51N69k056j178J755J685
5552a95k803k335J969L807J635k76j23l575k524K271L570K032K01j342K353Q19
5536E484j212q45Q35k001k828q79J042K199P36J526j807r6M12l29j030l10l609
5519b712p27l12O7j360K333L994M246k93l336k900q90j671j46L125L97j340n58
5502b083n2o93M39k685L879L612J001k855m454K75L200L734K92j104L79k79J98
5485B804J276k00L092J075q34M16k798m257J096J837K896j686m384O18j068N71
5469D54q96k470M36R19J10j25j575M82m85J942M810M11j687j920k021o31J947
$$ plain form
5585 1755 925 -328 -2072 -2525 -764 -3521 -3643 -1828 2964 5828 7750 4364 92 -818 -3718 -2950
5569 -2950 -3076 -2646 -929 -735 -107 3767 4299 -1751 -5087 -3603 -619 -970 -401 -2457 -3635 -1880 -195
5552 -195 -2998 -5333 -3364 443 2078 1802 1679 -1896 -4420 -2149 1421 3453 3654 2312 4665 5484
5536 5484 4272 3427 4262 2261 -567 -1446 -404 1795 2531 4057 2250 2154 2566 2237 1207 897 -2712
5519 -2712 -3439 -3751 -3684 -5044 -2711 1283 5529 5236 1900 -1000 -1890 -3561 -3707 -582 -185 -1525 -2083
5502 -2083 -2135 -2828 -2389 -5074 -1195 2417 3418 563 -3891 -3616 -416 3318 3610 2506 2885 2606 2804
5485 2804 4080 3880 6972 8047 7213 7629 4831 574 1670 3507 6403 4717 333 951 -117 454
5469 454 -442 -2912 -2476 -1557 -1447 -1572 -3147 -2665 -3150 -1208 3602 4013 2326 406 -1615 -2246 -299
5452b99K405K592j080l630J558M85k399j554J321q85r77j588m67L06J87p5j625
5435e725K277M378n369j361M346J568J58m26L437j815j942p6K062k460m0J458
5419D70j325l373K96K448K562q35k622R50l33Q65l35k11J148j627p97N59K239
5402G9K43J524r19j837j331K716N82K580m71j800j102Q95l850q56n06L82L878
5385B07k843k162K023j73M343K528k617Q2k575j988j158K741J065j587p95K127
5369g82L84k199j919J221P94j211k09o64j447N79J107m66j028N8J050K489L88
5352a855m225p93K721L175M796J946j200m69J509q90o819k62L388M27p15J107
5336A841K365l310q17L20n81J008k314N93J644N3J434j095j199K819rk936j475
$$ plain form
5452 -299 2106 4698 3618 -12 1546 2031 -368 -1922 -601 -1486 -2463 -4051 -4518 -4212 -4025 -4100 -5725
5435 -5725 -3448 930 -4439 -5800 -1454 114 272 -154 3283 1468 -474 -550 1512 -948 -988 470
5419 470 -855 -4228 -3932 -1484 1078 243 -2379 -1429 -1762 -897 -1232 -1443 -295 -1922 -2719 -2160 79
5402 79 322 1846 927 -910 -2241 475 1057 3637 3166 1366 264 1159 -2691 -3547 -4053 -3671 207
5385 207 -2636 -4798 -2775 -2948 1395 3923 1306 1388 -1187 -3175 -4333 -1592 -527 -2114 -2909 -782
5369 -782 -398 -2597 -4516 -3295 -2501 -3712 -3921 -4585 -6032 -5453 -4346 -4812 -5840 -5782 -4732 -2243 -1855
5352 -1855 -6080 -6873 -4152 -977 3819 5765 4565 4096 5605 4715 -2104 -2366 1022 1449 734 1841
5336 1841 4206 896 79 399 -182 826 -1488 -895 749 802 2236 1141 -58 2761 2752 -184 -1659
5319a659M598M510k765m211l136k73k754j550J999R27K730j522K17L082k117K262
5303C38k226k748J043P20j701K199J169M00k001r2j75L899K01k22M30r16l208
5286b890N66M576J765r19P19Q40j728j485k276K180J632k965Q39j00j993m26O81
5269i84k690n7L89K13M281J838j499j598j133l73q06K131K087k477j10N36K8P57
5251E33j798Q02j648J012N10M89j063J515J96j115j525l249k247J882L258K797
5235C49J255J310k851k970k737q80L121J499k146k056K658M9j573N62L772L061
5219B423j390l85p43K542M46k429j329j005j612J109l07J157J135o90L438j53
5203B207q54R86l68l334K40k380l127J304K394L176J300l427J517L49L53j36j311
$$ plain form
5319 -1659 2939 7449 4684 473 -2663 -2936 -5690 -7240 -5241 -4314 -1584 -3106 -2889 193 -1924 338
5303 338 -1888 -4636 -3593 -2873 -4574 -2375 -1206 -806 -2807 -2899 -3074 825 1026 804 1234 318 -2890
5286 -2890 -2324 2252 4017 3098 3817 4657 2929 1444 -832 1348 2980 15 854 754 -1239 -1665 -984
5269 -984 -3674 -3731 -3342 -3129 1152 2990 1491 -107 -1240 -1613 -2419 -288 1799 -678 -788 -252 -224 533
5251 533 -1265 -463 -2111 -1099 -589 -100 -1163 352 548 -567 -2092 -5341 -7588 -5706 -2448 349
5235 349 1604 2914 63 -2907 -5644 -6524 -3403 -1904 -4050 -6106 -3448 -3399 -4972 -4410 -638 2423
5219 2423 1033 648 -95 2447 2893 464 -865 -1870 -3482 -2373 -2680 -1523 -388 -1078 2360 2207
5203 2207 1353 2339 1971 -1363 -1123 -3503 -6630 -5326 -2932 244 1544 -1883 -366 -17 336 200 -1111
5186a111P30J553j183j251J006K406o20k53L710j006O37j395n165o74J478J005
5170a33l8K847l490l201L901M59j520l046k006Q36L496M711M256l884l513j871
5154b196k020m66J486O73L42K356l45m149j107K81N13M1q79P02Q3L74q50J064
5136d097J545P6K74k200j985J090K544K287j494L244K629l631n19j197L608J322
5120C496Q06l855j115l24j880k10k860j759J156K923M234K558j185j137j153k963
5104c268k05m34j635L159J780K338P28j376j827K654L508j951l881j459J25p2
5088a816K006R89r96o00j178J130l93n77K126J212n108j816K691L799K554l642
5072C81o88N3r51Q21K254k62j837m910k598J246K725J192O88j970K62M482M177
$$ plain form
5186 -1111 -381 1172 -11 -1262 -256 2150 1530 1277 4987 3981 4618 3223 -1942 -2616 -1138 -133
5170 -133 -171 2676 -814 -4015 -114 345 -1175 -4221 -6227 -5391 -1895 2816 7072 3188 -325 -2196
5154 -2196 -4216 -4682 -3196 -2523 -2181 175 -170 -4319 -5426 -5145 -4632 -4591 -5470 -4768 -4685 -4311 -5161 -4097
5136 -4097 -2552 -2476 -2202 -4402 -6387 -5297 -2753 -466 -1960 1284 3913 282 -237 -1434 2174 3496
5120 3496 4302 447 -668 -992 -2872 -3082 -5942 -7701 -6545 -3622 612 3170 1985 848 -305 -3268
5104 -3268 -3473 -3907 -5542 -2383 -603 1735 2463 1087 -740 1914 5422 3471 -410 -1869 -1744 -1816
5088 -1816 190 1179 183 -417 -1595 -465 -858 -1435 691 1903 -3205 -5021 -2330 1469 4023 381
5072 381 -307 -254 -1205 -384 1870 1608 -229 -5139 -7737 -6491 -3766 -2574 -1886 -3856 -3594 888 5065
5055E065R90j702j939j491k766L023J492J654M05l189M51Q13l546l379k607M106
5039b620J915l61O46K906M56J718k331p98k250K16q74O54O89L395J020l235j202
5022e6j319m61J138P55j323k3m65M63P83P82j228p18p73R96j487p15r47N49M914
5003H65k026o403o43J810L856M202L946N59j21L55k752k343j204j711J052q73
4987a431j325K49O99m004O86J368j160r80J62j834M157K721J655J676j040L965
4971E564L430k647n600J682k5J78k500R46J377Q65m45j793q5j268j589k164J205
4954b869J206j164q35J167L552j03p04k885k82M342o48l814m280K17L950J701
4938a449K245M605l91j939Q36j341k936K613k380k199k870K853J180n604K39J879
$$ plain form
5055 5065 6055 4353 2414 923 -1843 1180 2672 4326 4731 1542 1993 2806 -740 -4119 -6726 -2620
5039 -2620 -705 -1066 -420 2486 2942 4660 2329 1531 -719 -503 -1377 -723 -34 3361 4381 1146 -56
5022 -56 -1375 -1836 -698 57 -1266 -1289 -1754 -1291 -508 274 -954 -1672 -2445 -1449 -2936 -3651 -4598 -4049 865
5003 865 -1161 -7564 -8207 -6397 -2541 1661 5607 6166 6045 6400 3648 1305 101 -1610 -558 -1431
4987 -1431 -2756 -2507 -1808 -5812 -5126 -3758 -4918 -5898 -5736 -7570 -3413 -692 963 2639 1599 5564
4971 5564 8994 6347 747 2429 2404 2582 82 1028 2405 3270 2825 1032 947 -321 -1910 -4074 -2869
4954 -2869 -1663 -2827 -3662 -2495 1057 954 250 -2635 -2917 1425 777 -3037 -7317 -7100 -3150 -1449
4938 -1449 796 5401 5010 3071 3907 2566 -370 2243 -137 -2336 -5206 -2353 -1173 -6777 -6538 -4659
4922d659K112L32R83P37J607J880k172l629o54R76Q94J676j266k313J945k565
4906d116M89J171J060L348k98j264j916r99J516M676j942N27m96p58m98N46k013
4889i67k372L085o93j834m13J021J457n78Q17L64Q7j335n41q94J514K873K870
4872D461n07j661J719J153o18J000k183n211j311J146n16p8K195j094M93K207
4856A195l533l948M4L656K136P0L725R36k82J244L815j596l767k181j857j102
4840a445j458J272l47L325J130R80K807J743j274k467p08k088l929M22J197Q40
4824@k37J636L076j02q19P50q16n21n944R59M9q97J824j828J851O59Q82j190L71
4805b97k176J854J475l445k259j734K446L459M156J158J182j597j787k098n196
$$ plain form
4922 -4659 -2547 -2215 -1232 -495 1112 2992 820 -2809 -3463 -2487 -1593 83 -1183 -3496 -1551 -4116
4906 -4116 -3627 -2456 -1396 1952 1654 390 -1526 -2525 -1009 3667 1725 2252 1756 998 500 1046 -967
4889 -967 -3339 -254 -947 -2781 -3194 -2173 -716 -1294 -477 -113 -26 -1361 -1902 -2796 -1282 1591 4461
4872 4461 3954 2293 4012 5165 4547 5547 3364 -1847 -3158 -2012 -2528 -2606 -411 -1505 -1012 1195
4856 1195 -2338 -6286 -6242 -2586 -450 -380 3345 4281 3999 5243 9058 7462 3695 1514 -343 -1445
4840 -1445 -2903 -1631 -1978 1347 2477 3457 6264 8007 6733 4266 3558 1470 -2459 -2037 -840 0
4824 0 -237 1399 4475 4373 3554 4304 3488 2967 -2977 -2018 -1969 -2866 -1042 -2870 -1019 -360 522 -668 -297
4805 -297 -2473 -619 856 -2589 -4848 -6582 -4136 -677 3479 4637 5819 4222 2435 337 -4859
4790d859K016L970J081m029p93K378M45j446o47K154p69K876K324K339m28j608
4774E004k029k868j73M58q99m00j370k23k987Q96k18J43J912Q31J82o48K972L057
4756C640J07j697j166o62J845J301l07N64K08J125K968p32j604l789j777k21r58
4739a155j91r01J61l29o607j273L086L319J19L69k043k861k59K902J784L889O19
4722F29n48J842M595n0l170k879Q91K132J483k51l212k809j244j01J752L41J8
4705e81k098q32J144p37L4K819J815m72Q20m86k041k253J683o06J715Q4q71j195
4687b058o52K416K141k712j730L833M398j648j989j60n69J332o31J955l094j77
4671F55j805q11M28l94J74p26J689n82j13N531J880j911l720J568L658k022l599
$$ plain form
4790 -4859 -2843 1127 2208 -1821 -2614 -236 209 -1237 -1884 270 -499 2377 4701 7040 6612 5004
4774 5004 2975 107 -66 392 -507 -907 -2277 -2500 -5487 -4591 -4809 -4666 -2754 -1923 -1741 -2389 583 3640
4756 3640 3747 2050 884 222 2067 3368 3061 3625 3833 4958 7926 7194 5590 1801 24 -197 -1155
4739 -1155 -1346 -2247 -2086 -2415 -9022 -10295 -7209 -3890 -3771 -3402 -5445 -8306 -8565 -5663 -3879 10 629
4722 629 81 1923 6518 6468 3298 419 1310 3442 4925 4674 1462 -1347 -2591 -2692 -940 -599 -581
4705 -581 -2679 -3511 -2367 -3104 -3070 -251 1564 1092 1912 1426 -615 -2868 -1185 -1791 -76 8 -863 -2058
4687 -2058 -2710 -294 1847 -865 -2595 1238 5636 3988 1999 1839 1270 2602 1971 3926 832 655
4671 655 -1150 -1961 -1533 -1927 -1753 -2479 -790 -1372 -1485 4046 5926 4015 295 1863 5521 3499 -100
4654a00l53O02K296j883L93n09o84m36K913j30mj459o077O47J047J600j478j028
4636d643n23K795K162q10j341L00l294j144J355R87L400m2j49Q78m24J983J355
4619B845k340j396J324R8j683j299K242N572j736l122k972k554L601L348J94K49
4603B371K292k608o45m76J16K412J842j054l015n84r57r64k593K467J693L148
4587C445n218m62J629j474Q8L218L210L488k48j626r84k790j286N27R60L385J855
4570G717l714J047j649l40P8j055l533k57n54j209p25L377K903k386l613p8j856
4553e847J155M378L346J160J356R0j686l103j215j838O19J698k891O50K490j101
4537g39J204J547j865n31Q35L35k084j456J45M297L651j255j323k138j969j659
$$ plain form
4654 -100 -453 149 2445 562 955 446 -238 -674 2239 2109 2105 646 -5431 -4784 -3737 -2137 -3615 -4643
4636 -4643 -5166 -2371 -209 -1019 -2360 -2060 -5354 -6498 -5143 -4156 -756 -798 -947 -69 -493 1490 2845
4619 2845 505 -891 433 531 -1152 -2451 -209 5363 3627 505 -2467 -5021 -1420 1928 2122 2371
4603 2371 4663 2055 1410 934 1050 3462 5304 4250 1235 651 -306 -1270 -3863 -1396 297 3445
4587 3445 -1773 -2235 -606 -2080 -1992 1226 4436 7924 7676 6050 5066 2276 990 1517 2477 5862 7717
4570 7717 4003 5050 3401 3061 3139 2084 -1449 -1706 -2260 -3469 -4194 -817 2086 -300 -3913 -3991 -5847
4553 -5847 -4692 -314 3032 4192 5548 5638 3952 849 -366 -2204 -1585 113 -2778 -2128 362 -739
4537 -739 465 2012 147 -384 451 786 -1298 -2754 -2609 1688 5339 4084 2761 623 -1346 -3005
4521c005O67j814K643l89p51K52M177j415m539N41P50p97l632P34P43R64K97L075
4503a499o37n83J512l916K95k373m37M885K000q42k48m66L74k17k953p94K981
4486b918N219L64k78l4J759J886l27O47k460o69q78k775l324j541K800N21J058
4469i50N36j205K546L116j003k332k595L511J436j854l023l599K248L183J720
4454A735L027p14m746r03p18K715J115J376M43l699l50J857N2r27r04J603l48
4437F14r61j918o49J150j496J41K560o22l376j969Q94K470K816k238k167M016
4421g35O64j497P63p67k963j6J025j840k869m9M148J111L582m99m586J674K245
4404f09m593L81J451k31J881k988k42l66j443j468K531N145J318p62J760l070
$$ plain form
4521 -3005 -2338 -4152 -1509 -1898 -2649 -2397 1780 365 -4174 -3633 -2883 -3680 -7312 -6578 -5835 -4871 -4574 -1499
4503 -1499 -2136 -2719 -1207 -5123 -4828 -7201 -7638 -2753 -753 -1595 -1843 -2309 -1935 -2152 -5105 -5899 -2918
4486 -2918 2301 2665 2387 2353 4112 5998 5671 6318 3858 3189 2311 -464 -3788 -5329 -2529 -2008 -950
4469 -950 -414 -1619 927 4043 3040 708 -1887 1624 3060 1206 -1817 -5416 -3168 15 1735
4454 1735 4762 4048 -698 -1601 -2319 396 1511 2887 3330 -369 -719 1138 1190 263 -641 962 614
4437 614 -347 -2265 -2914 -1764 -3260 -3119 -559 -1181 -4557 -6526 -5632 -3162 -346 -2584 -4751 -735
4421 -735 -71 -1568 -805 -1572 -4535 -4551 -3526 -5366 -8235 -8284 -4136 -3025 557 58 -4528 -2854 -609
4404 -609 -5202 -4821 -3370 -3601 -1720 -4708 -4950 -5316 -6759 -8227 -5696 -551 767 5 1765 -1305
4388a305M92K082r56k003j018M537L071J631j510l647k420j463k804m62Q88N80
4372d307J807M558R55k203l800P59J34q17j14k100j917k375L690N017L317K020
4356D624m248n254J583K335j359q24K897M171k82l605l202j529n11L054N274j481
4340A643r26k361K80k789k935J307o8m38Q61J099O84J82K71K030L384J316K41
4323C781j921m307j259K197K303L627j407k751p58m183J202M552k70l233J469
4308i58J796M672N89p270n348J383k756j335J933L976L722Q18m38L93K191R1M68
4291C927l019q97J073L93L354j905l019J115K43l75l710j111R82L138p53R01m049
4274c712k131M35j289J550K151O07M304M375R48l484o86l60l33m03o53K336K548
$$ plain form
4388 -1305 -813 1269 313 -1690 -2708 1829 4900 6531 5021 1374 -1046 -2509 -5313 -5775 -4887 -4307
4372 -4307 -2500 2058 3013 810 -2990 -2231 -2097 -2914 -3028 -5128 -7045 -9420 -5730 -713 2604 4624
4356 4624 376 -4878 -3295 -960 -2319 -3143 -246 3925 3643 38 -3164 -4693 -5204 -2150 3124 1643
4340 1643 717 -1644 -1364 -4153 -7088 -5781 -5849 -6287 -5426 -4327 -3643 -3461 -3190 -1160 2224 3540 3781
4323 3781 1860 -2447 -3706 -1509 794 4421 3014 263 -495 -4678 -3476 1076 806 -2427 -958
4308 -958 838 5510 6099 -1171 -6519 -5136 -7892 -9227 -7294 -3318 404 1222 784 1177 3368 3459 3927
4291 3927 908 11 1084 1477 4831 2926 -93 1022 1265 890 -2820 -3931 -2949 189 -564 337 -3712
4274 -3712 -5843 -5408 -6697 -5147 -2996 -2389 1915 6290 7238 3754 3068 2708 2375 1972 1319 3655 6203
4257F203j438j95J802j879k453j499l20k079J334J131L545J396j044k074N86N76
4241C592Q32m281K89R67j785J907K577M97l55K00o20J589j940m491j746J316K96
4224a156MP59K381L082jk425o810k935j462j7K047J880K963K901M71P34o21k87
4206A508J546Q51j39j730l058k723J86l67J628J652L134p50j118k773k184l012
4190g349l298q61J501N054M82J322j851j610K223j813j816J613L274J051m605
4175f683k127L311M156J159J96j058p31K809J781j267j470k085l935K063m2o9
4159c992K770J462k2q59r52J242K592j198N07j958N3L726R47k266k257j529J676
4142e8j054K887M60j448J032j063j755k512O28Q40L80l98o03j360J312l7J946
$$ plain form
4257 6203 4765 4570 6372 4493 2040 541 221 -1858 -524 607 4152 5548 4504 2430 3016 3592
4241 3592 4424 143 432 1399 -386 1521 4098 4595 4240 4440 3820 5409 3469 -1022 -2768 -1452 -1156
4224 -1156 -1152 -393 1988 5070 5069 2644 -4166 -7101 -8563 -8580 -6533 -4653 -1690 1211 1682 2416 1795 1508
4206 1508 3054 3905 3766 2036 -1022 -3745 -3559 -3926 -2298 -646 2488 1738 620 -2153 -4337 -7349
4190 -7349 -10647 -11508 -10007 -4953 -4471 -3149 -5000 -6610 -4387 -6200 -8016 -6403 -3129 -2078 -6683
4175 -6683 -8810 -5499 -1343 -184 12 -1046 -1777 1032 2813 1546 76 -2009 -5944 -3881 -3923 -3992
4159 -3992 -1222 240 218 -641 -1593 -351 2241 1043 1550 -408 -355 3371 4318 2052 -205 -1734 -58
4142 -58 -1112 1775 2235 787 1819 756 -999 -3511 -2883 -2043 -1663 -2061 -2664 -4024 -2712 -2749 -803
4125h03N477o78l089j826k5j323L411M067p70j869j929o73o44K410J631J130N47
4108E044l943J218Q44r48j772n31M04m89l054J10p41J112P21K346qn23J798l24
4090A264l094k562j895N03L579M114J967q21o49j251j728j814L364M50J600M08
4074C435k08o76J705o22k444l454R55j230J614L5J150p28K24M467om2K796j499
4056E472J437l182k014k396J42l45J610L72m135J185L916j816l323l23K084M64
4040h52R32o35m34O0N99l176k845M97O05L120M169J687J030l030k304O05J990
4023B018K32l029l9j434j297J587N97m56j913O02M723Q79J199k012l467J37K373
4006G00j82k764n340K282M795O36k762J343L345K676l158k318l3l573m517j106
$$ plain form
4125 -803 4674 3996 907 -919 -944 -2267 1144 5211 4441 2572 643 -30 -674 1736 3367 4497 5044
4108 5044 1101 2319 3163 2215 443 -88 316 -173 -3227 -3117 -3858 -2746 -2025 321 313 -210 1588 1264
4090 1264 -1830 -4392 -6287 -5784 -2205 1909 3876 3055 2406 1155 -573 -2387 977 1427 3027 3435
4074 3435 3227 2551 4256 3634 1190 -2264 -1309 -2539 -925 -890 260 -468 -244 4223 4217 4175 6971 5472
4056 5472 6909 3727 1713 -683 -541 -886 724 1096 -3039 -1854 2062 246 -3077 -3400 -1316 -852
4040 -852 80 -555 -989 -929 -330 -3506 -6351 -5854 -5249 -2129 2040 3727 4757 1727 -577 28 2018
4023 2018 2250 -779 -818 -2252 -3549 -1962 -1365 -1821 -3734 -3132 1591 2470 3669 1657 -1810 -1673 700
4006 700 518 -2246 -7586 -5304 -509 127 -2635 -1292 2053 4729 1571 -747 -780 -4353 -8870 -9976
3990i976J982M57K570N394K392k886k246k585j488J026K342J660L422K169k848
3975A385K3j882q94M20n06m551p26J394K763K44o09m403L52j189l28M607j89k740
3957f829P30J098k881j08P09P45j447j114K067P73J755n0j068J959L305k324J69
3940b511J535k134m14m1K393K537j469k030K553J593m933l156K04L478M165K587
3924D357J476p10N29j515l47o727l473M702K359k196j389q73j043n21L503M50
3908a418K372K932k24j248L58k15j197k407j626R0l76pJ718o62J696K610j374
3891A022j278J853k880j948K822J686R07Q55l397j694K413j277O1m283J880j98
3875c456K353N216J718k987k537q0N96j993o57P3J78K95M366L046j58l632j230
$$ plain form
3990 -9976 -7994 -7537 -4967 427 2819 -67 -2313 -4898 -6386 -5360 -3018 -1358 2064 4233 1385
3975 1385 1408 -474 -1368 -948 -1454 -6005 -6731 -5337 -2574 -2330 -2939 -7342 -6990 -8179 -8507 -3900 -4089 -6829
3957 -6829 -6099 -5001 -7882 -7990 -7281 -6536 -7983 -9097 -7030 -6257 -4502 -4552 -5620 -3661 -356 -2680 -2511
3940 -2511 -976 -3110 -3524 -3565 -1172 1365 -104 -2134 419 2012 -2921 -6077 -5873 -2395 1770 4357
3924 4357 5833 5123 5652 4137 3790 -2937 -6410 -1708 651 -1545 -2934 -3807 -4850 -5371 -1868 -1418
3908 -1418 954 3886 3662 2414 2772 2557 1360 -1047 -2673 -2583 -2959 -2966 -1248 -1910 -214 2396 1022
3891 1022 -256 1597 -1283 -3231 -409 1277 2184 3039 -358 -2052 361 -916 -855 -5138 -3258 -3456
3875 -3456 -1103 4113 5831 2844 307 227 823 -1170 -1827 -1754 -1576 -1281 3085 6131 5973 2341 1111
3858A111j70j939j812j154q10k297J085K648L018j726L20J010k8J302j285k927
3842c654j900L632O21J454j200j12r5n36l226L173l06j093K29J168M305l08n138
3825b986k033J496Q48J177J106K537J999n36l719N86J288l021P09P99M689n16
3809D423k926l913j240K212Q22J040k844k436J003K786M36J555p23J099k205N5
3793h56J001J432j55j519n21j514j273K125j980k29j050J113J316J240q43J429
3777b84J055P70J695j109k262K443K129J445j540L71k601r91Q10q73m761J154
3761b549J032J10L67J76J119p47L740O72o27k090j735j237K38K766J284R9J243
3744C861o76j228L78k017K867Q41k131J633K756j262k55m194j725M550K06m209
$$ plain form
3858 1111 941 -998 -2810 -3964 -4774 -7071 -5986 -3338 -320 -2046 -1726 -716 -744 558 -727 -3654
3842 -3654 -5554 -1922 -1301 153 -1047 -1159 -1254 -1790 -5016 -1843 -2149 -3242 -3013 -1845 2460 2152 -2986
3825 -2986 -5019 -3523 -2675 -1498 -392 2145 4144 3608 -111 475 1763 -1258 -549 250 4939 4423
3809 4423 1497 -2416 -3656 -1444 -622 418 -2426 -4862 -3859 -1073 -637 918 195 1294 -911 -856
3793 -856 145 1577 1422 -97 -618 -2132 -3405 -1280 -3260 -3489 -4539 -3426 -2110 -870 -1713 -284
3777 -284 771 1541 3236 2127 -135 2308 4437 5882 4342 4713 2112 1121 1931 1058 -3703 -2549
3761 -2549 -1517 -1407 -1040 -864 255 -492 3248 3920 3293 1203 -532 -1769 -1531 1235 2519 2618 3861
3744 3861 3185 1957 2335 318 3185 4026 1895 3528 6284 5022 4767 573 -1152 3398 3604 -605
3728f05l996Q39N60J97K124J401l261m83K83j50j642l39K665n06K811L102J563
3711D563m67l594k958j392L57L184L201k227p24j299J839Q6j960j868J829K366
3695I36J465L031n67m043j910q37o03J942J289k174k574q68N60j843J256L16J544
3678c080j468j267K265J15J617q3k58K155P23j77o19l12j376p72J711K972k296
3661a50l337J642J563l62J785K635k098k079p56M036q14k092O21K2o63L63K627
3644B943K77j597k47j56k965J62L910J610K662j242l172k750N65L59j273k67K111
3627I30r8n10Q01J89l012k869J168N13J690J131J849j083k517K06M76j1j016Q33
3609a330R2q05K094J207j448j822L451o44m610K365J470l05J534Q23L35k770l694
$$ plain form
3728 -605 -4601 -3762 -3202 -3005 -881 520 -2741 -3224 -2941 -3091 -4733 -5072 -2407 -2913 -102 3000 4563
3711 4563 4096 502 -2456 -3848 -3491 -307 2894 667 -57 -1356 483 569 -1391 -3259 -1430 936
3695 936 2401 5432 4865 822 -1088 -1925 -2528 -586 703 -1471 -4045 -4913 -4353 -6196 -4940 -4624 -3080
3678 -3080 -4548 -5815 -3550 -3435 -1818 -1901 -2159 -4 719 542 -77 -389 -1765 -2537 -826 2146 -150
3661 -150 -3487 -1845 -282 -644 1141 3776 1678 -401 -1157 2879 2065 -27 594 616 -47 316 2943
3644 2943 3220 1623 1376 1220 -1745 -1583 2327 3937 6599 5357 2185 -565 0 359 -914 -1181 930
3627 930 832 322 1123 1312 -1700 -4569 -3401 -2888 -1198 -67 1782 699 -1818 -1612 -1136 -1147 -2163 -1330
3609 -1330 -1238 -2043 51 1258 -190 -2012 1439 795 -3815 -1450 20 -285 1249 2072 2407 -363 -4057
3592d057N08K49O007P737k223n052n74K62l727R15K659K085r97q2J897n052p55
3575b00L531j926m413k771P5J554J273j238o75K50L694L969J248j440j542q77
3559E12l73m46J246j78q99K910J96m54k838l741q23O9n86K646J127K556K616j008
3541B532O61n43l39l716p75N62p18j524M77N270J235l2j738P23J481P45r31l12
3523C058o90j097m440r38j607J125L110J55j857j873K254M542K758l742l189P74
3507a657K81k142K701L501R00J325k124k257k724j405L016J792N0L087Q49j991
3491C202k562l489j62P97J377r7l492L105N01J405P49J674l595L94j84M57j003
3474i23R70K801L55n77n46m18J447J000n080k66J858j247k666L76J557l85L777
$$ plain form
3592 -4057 -3549 -3300 2707 10444 8221 3169 2595 2857 -870 45 2704 4789 3792 3710 5607 555 -200
3575 -200 3331 1405 -3008 -5779 -5704 -4150 -2877 -4115 -4790 -4540 -846 3123 4371 2931 1389 512
3559 512 139 -307 939 761 -138 2772 2968 2514 -324 -4065 -4888 -4819 -5405 -2759 -1632 924 3540 2532
3541 2532 3193 2650 2311 -1405 -2180 -1618 -2336 -3860 -3383 1887 3122 3090 1352 2075 3556 4301 3370 3058
3523 3058 2368 1271 -3169 -4107 -5714 -4589 -1479 -1324 -3181 -5054 -2800 1742 4500 758 -2431 -1657
3507 -1657 -1376 -3518 -817 2684 3584 4909 2785 528 -2196 -3601 -585 1207 1257 4344 5193 3202
3491 3202 640 -2849 -3011 -2214 -837 -934 -4426 -1321 -820 585 1334 3008 -587 -193 -377 80 -923
3474 -923 47 2848 3203 2626 2080 1662 3109 4109 -971 -1237 621 -626 -3292 -2916 -1359 -1744 2033
3457B033Q63k93m00j736j917Q3K418J371j037l60o66L710K342l106n26k911N51
3440D19J284J420L72k360Q95K85l327N75m64j69r83k056Q80n94M071K817k69L348
3422F144J257l982k206R10J896K896j641m182l734k201J128L672o31K324J272
3407B922j642j275J57n38o36R5l18J78J098K025l67j557k576J189L300R42j047
3390A950j796k76K591j156n43J876J163k422j169j452k711n70L091o6k7J395L151
3373C029k841m03J594L610J794p39j073j664k539l049K059J383j054j696K299
3358G10j387j442q74p82j077K24M44K567K051n0j003P75k778k646K503Q68L21
3341a576j555l204L386J963k46k548J156L22k88r96M60J146Q18M417j72j856J055
$$ plain form
3457 2033 2896 2603 2203 467 -1450 -1367 1051 2422 1385 1025 359 4069 6411 3305 2779 -132 419
3440 419 1703 3123 3495 1135 2030 2315 -1012 -437 -901 -1070 -2053 -4109 -3229 -3823 248 3065 2796 6144
3422 6144 7401 3419 1213 2123 4019 6915 5274 1092 -2642 -4843 -3715 -43 -674 1650 2922
3407 2922 1280 5 162 -376 -1012 -917 -1235 -1057 41 2066 1699 142 -2434 -1245 2055 2997 1950
3390 1950 154 -122 2469 1313 770 2646 3809 1387 218 -1234 -3945 -4515 -1424 -1490 -1517 -122 3029
3373 3029 188 -215 1379 4989 6783 6044 4971 3307 768 -2281 -222 1161 107 -1589 710
3358 710 -677 -2119 -2993 -3775 -4852 -4628 -4184 -1617 434 384 -619 156 -2622 -5268 -2765 -1897 -1576
3341 -1576 -3131 -6335 -2949 -986 -1232 -3780 -2624 -2302 -2590 -3586 -3126 -1980 -1162 3255 3083 1227 2282
3324B282M86N52J270k471j992n84J326Q09l51k486j654K459L87J65L33j927P73
3307f23l001j059K324k118R70J613L228k203k627l52Q9J34mk636O14L543R38L78
3289g92l250M60o61k186o41N022O138j286m794n545J398m43j086Q62M66L214L836
3272G12K286k213k359j348k07K16M323j266k273j562p73J140J635J311K16k336
3256b498m031K363K349J734l093O04J887M60J147J454m441k813o72K725P08K449
3240C32K111k463k230J271j418r3K13k42j113o40O08p84o39j761N761P02j031
3223a416m831m45j254K324K379L46j311J430J330M56j540k79J359j545K250r88
3207a735K86k060k280L52O10M013N73j377P32j344k168n08K871P96l020l128k27
$$ plain form
3324 2282 2768 3320 4590 2119 127 -457 869 1678 1327 -1159 -2813 -354 33 198 531 -1396 -623
3307 -623 -3624 -4683 -2359 -4477 -3507 -1894 1334 -869 -3496 -3848 -3759 -3625 -3629 -6265 -5651 -2108 -1170 -792
3289 -792 -4042 -3582 -4243 -6429 -7070 -2048 4090 2804 -1990 -7535 -6137 -6580 -7666 -6804 -6338 -3124 712
3272 712 2998 785 -1574 -2922 -3129 -2913 1410 144 -2129 -3691 -4464 -3324 -1689 -378 -162 -2498
3256 -2498 -6529 -4166 -1817 -83 -3176 -2572 -685 -225 922 2376 -2065 -4878 -5550 -2825 -2117 332
3240 332 2443 -20 -2250 -979 -2397 -2490 -2277 -2519 -3632 -4272 -3664 -4448 -5087 -6848 -1087 -385 -1416
3223 -1416 -6247 -6692 -7946 -5622 -3243 -2897 -4208 -2778 -1448 -992 -2532 -2811 -1452 -2997 -747 -1735
3207 -1735 -1449 -3509 -5789 -5437 -4827 -814 -241 -1618 -886 -2230 -4398 -4906 -2035 -1239 -4259 -7387 -7614
3190g614L496J413L809J294m279k188K493k518J577P52j69O551j02L49j844k202
3174H18J01r6j223J279R73p036J023r97j667K333J924O70J993R25K009l735l617
3157d323j249M50N329N548O54k601q92m63l852q69k712k287N337J126j299L54
3141a749j319M48n21k254K527O67R87j392j714o74K131k66Q61j258Q19J386k21
3124a542K492K041l39k922L88N72J867j008l524j865K564J063r33P6p93K456k59
3107C34n2J821l742j662K908J049Q96K640K50l081k326j667J782J420l12L311
3091C569j308j375l227N95P23k70Q10L29J37j51l657j848J041K546K930O65J484
3074B993q85m093m67J749J240J797j209r01J625L03j832k452p25k590J368J516
$$ plain form
3190 -7614 -4118 -2705 1104 2398 -1881 -4069 -1576 -4094 -2517 -1765 -1934 4617 4515 4864 3020 818
3174 818 919 823 -400 879 1852 -5184 -4161 -5158 -6825 -4492 -2568 -1898 95 1020 3029 -706 -4323
3157 -4323 -5572 -5122 207 5755 6409 3808 2916 2453 -1399 -2268 -4980 -7267 -1930 -804 -2103 -1749
3141 -1749 -3068 -2620 -3141 -5395 -2868 -2201 -1214 -2606 -4320 -4994 -2863 -3129 -2268 -3526 -2707 -1321 -1542
3124 -1542 950 2991 2652 -270 118 690 2557 1549 -1975 -3840 -1276 -213 -1146 -1070 -1863 593 334
3107 334 282 2103 -1639 -3301 -393 656 1552 4192 4442 1361 -965 -2632 -850 570 258 3569
3091 3569 2261 886 -2341 -1746 -1023 -1293 -483 -154 -17 -168 -3825 -5673 -4632 -2086 844 1509 2993
3074 2993 2108 -1985 -2452 -703 537 2334 1125 224 1849 2152 320 -2132 -2857 -5447 -4079 -2563
3058b563M69k74j459r23L493J46J129j329j073N26L205K528l262j889p72l056
3042e104L454J860K738J158l044j816L90J769k011J98J173R2k06R66o80q54J65
3025B48L143l74l74k006k751J075J539M991P04l644l046n70K892J408j02m288
3009a155J072o6k188J658J603j882j239J259k995O29O10J485K728J511J133k403
2993A760Q6n18R30J487j629l626m60N09L021L75k401j591q92K601O33j737K966
2976A514M30K182j790k069m137k027K199J519R53J487L304K669J689j039k954
2961C930n424k908J490J506k984k500K637L258J207L498n99M10k699l866R99J782
2945b63j15k058J848K470K030J177l593j28j379k632n259K236M179J719J07J801
$$ plain form
3058 -2563 -2094 -2368 -3827 -4750 -1257 -1111 18 -1311 -2384 -1858 1347 3875 613 -1276 -2048 -5104
3042 -5104 -1650 210 2948 4106 1062 -754 -364 1405 -606 -408 765 857 651 1617 937 83 248
3025 248 3391 3017 2643 637 -2114 -1039 500 5491 6195 2551 -495 -1065 1827 3235 3133 -1155
3009 -1155 -83 -149 -2337 -679 924 -958 -2197 -938 -3933 -3304 -2694 -1209 1519 3030 4163 1760
2993 1760 1846 1328 2258 3745 2116 -1510 -1970 -1461 1560 1935 -466 -2057 -2949 -348 285 -1452 1514
2976 1514 1944 4126 2336 267 -3870 -5897 -3698 -2179 -1226 261 3565 6234 7923 6884 3930
2961 3930 -1494 -4402 -2912 -1406 -4390 -6890 -4253 -995 212 3710 3111 3521 822 -3044 -2045 -263
2945 -263 -378 -2436 -588 1882 3912 5089 1496 1368 -11 -2643 -7902 -5666 -1487 232 339 2140
2929B140l085j170K721j027j705J983N78K507O33m002J1L757L874K25j529l518
2913B393r95j357j360Q55K574J769l056J450K90L36J176j469k363r72J691L66
2897A328q41J385j07l914r78L557Q93k570L79J164m67K106N33J091M93R94n18
2880D528k34k685k862j978M12N16J49L337R47k839J097J814K2j836M847K408k772
2863D871k300p89n24k049l12J350J604j893o1k70k93j336M638J654j096J044j32
2846D106k040Q81J831Q96o415l091J659J746J122J220R44K378k101M37K054K923
2830H550j223k80j010p63l243l770p04K248j072o29j184K031K512K548k892l505
2814b386j970J603L507M11M01L257J940k083r84m074l498k16L933Q24k667j492
$$ plain form
2929 2140 -945 -2115 606 -421 -2126 -143 435 2942 3575 -427 -416 3341 7215 7440 5911 2393
2913 2393 1398 41 -1319 -464 2110 3879 823 2273 2563 2899 4075 2606 243 -729 962 1328
2897 1328 487 1872 1765 -2149 -3127 430 1323 -1247 -868 296 -171 1935 2468 3559 4052 5046 4528
2880 4528 4294 1609 -1253 -3231 -2819 -2303 -2154 1183 2130 -709 388 2202 2224 388 5235 7643 4871
2863 4871 2571 1782 1258 -791 -1103 247 1851 -42 -103 -373 -666 -2002 2636 4290 3194 4238 4106
2846 4106 2066 2947 4778 5674 -741 -3832 -2173 -427 695 1915 2859 5237 3136 3573 5627 8550
2830 8550 7327 7047 6037 5274 2031 -1739 -2443 -195 -1267 -1896 -3080 -1049 1463 4011 1119 -2386
2814 -2386 -4356 -2753 754 1165 1566 4823 6763 4680 3696 -378 -3876 -4092 -159 665 -2002 -3494
2798c494k252J248K650M336J394J97R77k938j891M209J97m570k72m74L435K257
2782E009k978k759R70k389m65J481k059j609L083j638j731J276j815K299Q38J306
2766a181K822J1j381L193P66m458n387J458K721P51j936j148M099K390j003J097
2750B814r16o96j615K366J812j752l326l14k392j767N008K543J26M76q57p07J165
2733A968k289K375J509j46l420J777K113m325k316j220k19J241o63J51k561k159
2717h184M098L497o4l208L2N268K618L11K56k038j491k454k032K833P85l576q06
2700d155K736K84L062J382j216o43l95J368J0O56k052r88l139m23K002J152q65
2683a224j077j164J8L690j765j55R09L72J106n44j17k304J262L049J102J299r44
$$ plain form
2798 -3494 -5746 -4498 -1848 2488 3882 4079 5056 2118 227 4436 4633 63 -209 -683 2752 5009
2782 5009 2031 -728 242 -2147 -2612 -1131 -3190 -4799 -1716 -3354 -5085 -3809 -5624 -3325 -2487 -1181
2766 -1181 1641 1652 271 3464 4230 -228 -5615 -4157 -1436 -685 -2621 -3769 330 2720 1717 2814
2750 2814 1898 1202 -413 1953 3765 2013 -1313 -1627 -4019 -5786 -778 1765 1891 2367 1510 803 1968
2733 1968 -321 2054 3563 3417 -3 1774 3887 -438 -2754 -3974 -4193 -2952 -3615 -3464 -6025 -8184
2717 -8184 -4086 -589 -653 -3861 -3829 1439 4057 4368 4624 2586 1095 -1359 -3391 -558 227 -3349 -4155
2700 -4155 -1419 -1135 1927 3309 2093 1450 1055 2423 2433 3089 1037 49 -3090 -3513 -1511 -359 -1224
2683 -1224 -2301 -3465 -3447 243 -1522 -1677 -768 -396 710 166 49 -2255 -993 2056 3158 4457 3513
2666C513j099M52j917j037l657j066K47K56J599K11K325J827K161j51j075k257
2650C32K393m16j003N56k430j57R4j615m01R19k582j532L164J279J746J883N03
2633B733j086N94l642R20J239P22O26J708j803k175J571j075J526L018m22J058
2617E512K35l135l367k468k826J501O381J284j435k569l337J7Q66J505N740K664
2601F568n21k858j109J126k66j486k768m85j145O5J875K007K293n24l083N48K43
2584D80J413J121o31L33l7J69n95r50j43Q97K990j578l377J79K175J738L202m89
2566F897l656j080J469K59J753K791N67m54l164l596K79j992j933j346j891J394
2550c703K936L946L285nj580J283j832O82K644k442m392k068j894l19K611j608
$$ plain form
2666 3513 2414 2866 949 -88 -3745 -4811 -4564 -4308 -2709 -2498 -173 1654 3815 3664 2589 332
2650 332 2725 2309 1306 1862 -568 -725 -631 -2246 -2647 -1728 -4310 -5842 -2678 -1399 347 2230 2733
2633 2733 1647 2241 -1401 -481 758 1480 2106 3814 2011 -164 1407 332 1858 4876 4454 5512
2617 5512 5747 2612 -755 -3223 -6049 -4548 1833 3117 1682 -887 -4224 -4207 -3341 -1836 3904 6568
2601 6568 6047 3189 2080 3206 2940 1454 -1314 -1799 -2944 -2879 -1004 1003 3296 2772 -311 237 480
2584 480 1893 3014 2383 2716 2679 2848 2253 1303 1160 2057 5047 3469 92 271 2446 4184 7386 6897
2566 6897 3241 2161 3630 3889 5642 8433 9000 8546 5382 1786 2065 73 -1860 -3206 -5097 -3703
2550 -3703 -767 3179 6464 6459 4879 6162 4330 5012 7656 5214 822 -1246 -3140 -3459 -848 -2456
2534b456N44M474J95l260k254J979J783K019o19r04n63j082r89l308l781K888
2518e334j293l81R24L422j32k25J695L040K104j173j753l617j49l34k878m90J154
2501e420N42N8m415k177L837O307J163K80k119j753n01J102J044j774j272J45
2485d953J760k096J398K057k05J231m67j422q30j054M143j327J990n63L7k839
2469c140j400J371K839Q38n070m719K455K740j244O82N998K684J556k934p70L63
2453B249L807K633o332k868O69k122m44j104K247J481J211K269j603m654J316
2438a245J918p64l60K061m21j79r57l434l839q05k103J319L759J830j77K127m81
2421a751Q89l34m05k475k227L310L425P01j558r55R05L093Q97q97l93r29l85J488
$$ plain form
2534 -2456 -1912 2562 2757 -503 -2757 -778 1005 3024 2405 1501 938 -144 -1133 -4441 -8222 -5334
2518 -5334 -6627 -7008 -6084 -2662 -2794 -3019 -1324 1716 3820 2647 894 -2723 -2872 -3206 -6084 -6574 -5420
2501 -5420 -4878 -4820 -9235 -11412 -7575 -1268 -105 175 -1944 -3697 -4198 -3096 -2052 -3826 -5098 -4953
2485 -4953 -3193 -5289 -3891 -1834 -2039 -808 -1275 -2697 -3527 -4581 -438 -1765 225 -338 -301 -3140
2469 -3140 -4540 -3169 -330 508 -4562 -9281 -6826 -4086 -5330 -4648 1350 4034 5590 2656 1886 2249
2453 2249 6056 8689 2357 -511 158 -1964 -2408 -3512 -1265 216 1427 3696 2093 -2561 -1245
2438 -1245 673 -91 -451 1610 1189 1010 53 -3381 -7220 -8025 -10128 -8809 -5050 -3220 -3397 -1270 -1751
2421 -1751 -862 -1196 -1601 -4076 -6303 -2993 432 1133 -425 -1380 -475 2618 3515 2618 2225 1296 911 2399
2403B399j444k430j581j86M702P10p80j800k705M823K313k202l151j348N350N960
2387H630j08m987n171K1K567L44p99P97K053o13k069l14K744m159j548l28p25
2370c665M283J862o39M30k88R20k640j379K845K942M01J283J082K642k278j701
2354F100m022o05J141O16l610n71n29j270l083O41N933L072L84J508J205J539
2338H449q87n883j529J282L321j076k347j299j50K911j129K849O13q9k388m905
2322b257J363k849P45K664K364J474j972l855L46k58L136J979j388J519J57l896
2306g28l621J044k92o1J310L137J159l508j233k002n28L088J619k686k04K095
2290a411PL315J995j633l420k151K427K147n43k125K808k441R32J038l78j780
$$ plain form
2403 2399 955 -1475 -3056 -3242 1460 2170 1390 -410 -3115 1708 4021 1819 -1332 -2680 2670 8630
2387 8630 8522 3535 -1636 -1615 952 1296 497 1294 3347 2734 665 351 3095 -1064 -2612 -2940 -3665
2370 -3665 618 2480 1841 2271 1983 2903 263 -1116 1729 4671 5072 6355 7437 10079 7801 6100
2354 6100 2078 1473 2614 3230 -380 -951 -1480 -2750 -5833 -5192 741 3813 4197 5705 6910 8449
2338 8449 7562 1679 150 1432 4753 3677 1330 31 -119 2792 1663 4512 5125 5036 2648 -2257
2322 -2257 -894 -3743 -2998 -334 2030 3504 1532 -2323 -1977 -2235 901 2880 1492 3011 3168 -728
2306 -728 -4349 -3305 -3597 -3658 -2348 789 1948 -1560 -2793 -4795 -5323 -2235 -616 -3302 -3506 -1411
2290 -1411 -1404 1911 3906 2273 -1147 -3298 -871 1276 733 -1392 1416 -1025 -93 945 567 -1213
2274a213k41j288J59j896L000K206J2m070l98l65L904J547J38J972O90m543j475
2257a861Q9K018L139P39J563M71J602l45K047j032j100r83L77r06m838k239J174
2240h5L470j168J536q56k422l174J455J704N7J097j085p92L33j345O16K56j444
2223a847K782j036l827q42J12K015L044j500P10j648j09K064J764J808L19n250
2207a441m302r36q1K233K319q59k417J669L703j405j904J717K488J653j904O7
2191F00m042l410L019L951Q81k273J309L739K434J295k658j667o27J471K85j594
2175B713j568k386j069M79J547K196J504k813j349Q66k04k140R91J983j230L11
2159a69k799n84k68o62J846q3j280p79R72j178K335L76k969j266K455j193j876
$$ plain form
2274 -1213 -1454 -2742 -2583 -4479 -1479 727 739 -3331 -3729 -4094 -190 1357 1495 3467 4157 -386 -1861
2257 -1861 -1772 246 3385 4124 5687 6158 7760 7415 9462 8430 7330 6347 6724 5818 980 -1259 -85
2240 -85 3385 2217 3753 2897 475 -2699 -1244 460 517 1614 529 -263 70 -1275 -659 -403 -1847
2223 -1847 935 -101 -3928 -4770 -4658 -2643 401 -1099 -389 -2037 -2146 -82 1682 3490 3809 -1441
2207 -1441 -5743 -6679 -6760 -4527 -2208 -3067 -5484 -3815 -112 -1517 -3421 -1704 784 2437 533 600
2191 600 -3442 -6852 -3833 118 999 -1274 35 3774 6208 7503 4845 3178 2551 4022 4307 2713
2175 2713 1145 -1241 -2310 -1831 -284 1912 3416 603 -746 120 -84 -2224 -1233 750 -480 -169
2159 -169 -2968 -3552 -3820 -4482 -2636 -2719 -3999 -4778 -3806 -4984 -2649 -2273 -5242 -6508 -4053 -5246 -7122
2142g122n41l23L299J069J177L167l77k578k885J172K219k173j665m77o10N97
2126f051L085Q56L982k127l841j524J055K07N509L019q87j77m92j079o90N26J132
2109B503k51l529j237l163P97J684p1K8J905O5m39O17K236J527n319M8K144N18
2091F3L267J574R69q26k294q14k210k503j095K960K86M734J354k053k070J160
2075B502K306m74K004j465k346N0R67R86l586k024P73j402k312K257k819j228
2059e811Q43K582M092o50k231j307m65L093K180l035q00j133K795P159K184K24
2043I720l121j911o22j853j143j334p74k857m56K121J120L7k78m70j736j17K428
2026a246K404k02R86P36K165j189l179K535R85j929j040Q0P01j820L325r09m400
$$ plain form
2142 -7122 -7663 -7986 -4687 -3618 -2441 726 349 -2229 -5114 -3942 -1723 -3896 -5561 -6038 -6648 -6051
2126 -6051 -2966 -2110 1872 -255 -4096 -5620 -4565 -4358 1151 4170 3283 3106 2614 1535 845 1371 2503
2109 2503 2252 -1277 -2514 -5677 -4880 -3196 -3267 -3239 -1334 -1269 -1708 -1091 1145 2672 -2647 -2599 -455 63
2091 63 3330 4904 5873 5047 2753 1939 -271 -2774 -3869 -909 -623 4111 5465 3412 1342 2502
2075 2502 4808 4334 6338 4873 2527 2577 3544 4530 944 -1080 -307 -1709 -4021 -1764 -4583 -5811
2059 -5811 -4968 -2386 1706 1056 -1175 -2482 -2947 146 2326 -709 -1509 -2642 153 7312 9496 9720
2043 9720 6599 4688 4066 2213 1070 -264 -1038 -3895 -4351 -2230 -1110 -1073 -1351 -1821 -3557 -3674 -1246
2026 -1246 1158 956 1942 2678 4843 3654 475 3010 3995 2066 1026 1106 1807 -13 3312 2403 -1997
2009a997J070q66L929J323k468k208R77K781j869j45L472k845k322J309O26j824
1993a057k436j310K063K85J678N00K459k093J142K46J025N90J150m66k768J753
1977B761J952K209l99Q61j613j692J283k396j372q41l36m006L060K501j332q63
1961b23n267j115L899J872j387N79k822n9K659K395l740j974M053K664J815M81
1945C830n58M6R68J631N48n525l461Q03j632Q36r59K399M775j710n139m62P17
1928b893j571K772k722k857K908L927J034k840j222J961J068N26j181k098Q25
1913b363M82l678j226O635R46k628K134K918j869o52j19J83K2k082r64J770k372
1896b863J474N30K136Q95k095j431j743j249Q41L019J401O2l113M09J048j445
$$ plain form
2009 -1997 -927 -1793 2136 3459 991 -1217 -240 2541 672 527 3999 1154 -1168 141 767 -1057
1993 -1057 -3493 -4803 -2740 -2455 -777 -277 2182 89 1231 1477 2502 3092 4242 3776 1008 2761
1977 2761 4713 6922 6523 7384 5771 4079 5362 2966 1594 753 417 -3589 -529 1972 640 -223
1961 -223 -5490 -6605 -2706 -834 -2221 -1642 -4464 -4523 -1864 531 -3209 -5183 -1130 1534 3349 3830
1945 3830 3272 3318 4286 5917 6465 940 -2521 -1718 -3350 -2514 -3473 -1074 3701 1991 -3148 -3610 -2893
1928 -2893 -4464 -1692 -4414 -7271 -4363 -436 598 -2242 -3464 -1503 -435 91 -1090 -3188 -2363
1913 -2363 -1881 -5559 -6785 -150 796 -1832 302 3220 1351 699 580 763 785 -1297 -2261 -491 -2863
1896 -2863 -1389 -859 1277 2172 77 -1354 -3097 -4346 -3505 -486 915 977 -2136 -1727 -679 -2124
1880b124K180j54q49L21M895L412l823j956k097j621J095J657j411L836l7j946
1864A378k063k818j524J632L477j844l63K109Q70R11J745j637l723N80m11R51
1848g30Q14r73N01J17J171j943q61q37k52J716j078k674j903J341N285j462J003
1831g65n37J89j390J659J540p7J082k333j021l149l420k7L19L993K240k144l94
1814d235L513j416j059l18J193r77j149J484P19q7j309k286N193K616k59L310
1798D933J255o44k927k9j143J897j719n329l454K425J764M50J158j300P50K061
1782A48n23K5L285J931l531n337l338L296N00N35j487J543K282M589L960m394
1766C484k055J136j886J313K468k054j704m241Q14M849K48m131j776K119J658
$$ plain form
1880 -2124 56 -98 -947 -626 4269 7681 3858 1902 -195 -1816 -721 936 -475 3361 3324 1378
1864 1378 -685 -3503 -5027 -3395 82 -1762 -2125 -16 854 1765 3510 1873 -1850 -1270 -1681 -730
1848 -730 84 -889 -388 -271 900 -1043 -1904 -2741 -2993 -1277 -2355 -5029 -6932 -5591 -306 -1768 -765
1831 -765 -1302 -1113 -2503 -844 696 619 1701 -632 -1653 -4802 -8222 -8249 -7930 -3937 -1697 -3841 -4235
1814 -4235 -722 -2138 -3197 -3515 -2322 -3299 -4448 -2964 -2245 -2332 -3641 -5927 -734 1882 1623 4933
1798 4933 6188 5544 2617 2588 1445 3342 1623 -3706 -7160 -4735 -2971 -2521 -1363 -2663 -1913 148
1782 148 -375 -350 2935 4866 1335 -4002 -7340 -4044 -3544 -3009 -4496 -2953 -671 3918 7878 3484
1766 3484 1429 2565 679 1992 4460 2406 702 -3539 -2725 2124 2372 -1759 -3535 -1416 242
1751B42N66N65K478L30j797J359N105L972m645j578m871n08R27O84l629j594L281
1734H87J556n79K255n04j000N18j726l479n01J101j792L32J938K517K921r09n568
1717b033n20J733n9n95k233J424J830O73j330K53R01M017J46j664k351J420p64
1700H48K876j062l856j134Q64K424J232J533k170k369J018L158J849J637n463
1685A385j557J750R86j698k692J617L133K679J477j735l018j71k286l182M888
1670A576M252r25j787j32K479j918j697R37N66P97j731k161N51J796m35j886j192
1653i10N23k03l449j361J228K917J379L03K637l426q99P55k158K900K993R06j399
1636B736k03k08J205L59k108J76k308J96L118j963o21M073L112J938P22n1l870
$$ plain form
1751 242 808 1373 3851 4181 2384 3743 8848 12820 8175 6597 1726 1218 2145 2829 -800 -2394 887
1734 887 2443 1864 4119 3615 2615 3133 1407 -2072 -2573 -1472 -3264 -2932 -994 1523 4444 3535 -2033
1717 -2033 -2553 -820 -879 -1474 -3707 -2283 -453 220 -1110 -857 44 4061 4207 2543 192 1612 848
1700 848 3724 2662 -1194 -2328 -1464 960 2192 3725 1555 -814 204 3362 5211 6848 1385
1685 1385 -172 1578 2564 866 -1826 -209 2924 5603 7080 5345 2327 2156 -130 -3312 1576
1670 1576 5828 4903 3116 2984 5463 3545 1848 2785 3351 4148 2417 256 807 2603 2168 282 -910
1653 -910 -387 -590 -4039 -5400 -4172 -1255 124 427 3064 -362 -1261 -506 -2664 236 3229 4135 2736
1636 2736 2533 2325 3530 3889 1781 1957 -351 -155 2963 1000 379 4452 7564 9502 10224 10173 6303
1619F303k530M26k351j621m00p5M94p22J145m29k856J754L431K679j952n01k00
1602B595J86J441L4k710o17K724l92K562k373m761k233j527J308K233K718p56
1586D32N34j310L43J051q58k335j584j174l226K535J837N418K172K419j156j027
1570D071j263J533M527j636k457j981j577J976j064k182R83k914m72K542K497
1555B583L508l528l390J849j772j009j016K255J277M264k69k452m543k43M669
1540B183q55LP74k545K868j599j386L9k55K49R50p67k24P25R69j840k05K023N63
1521A670p94m72K963Qj733j905l170p55M671L058r06K919Q35n78n067k237l855
1504e348J970P73J286J40k11j194J088J399m83M79l363q45J122j97j098j408L543
$$ plain form
1619 6303 3773 4199 1848 227 -173 -248 246 -476 669 240 -2616 -862 2569 5248 3296 2795 2595
1602 2595 2781 4222 4256 1546 929 3653 3261 5823 3450 -1311 -3544 -5071 -3763 -1530 1188 432
1586 432 966 -344 -1 1050 192 -2143 -3727 -4901 -8127 -5592 -3755 1663 3835 6254 5098 4071
1570 4071 2808 4341 8868 7232 4775 2794 1217 3193 2129 -53 930 -1984 -2456 86 2583
1555 2583 6091 2563 -827 1022 -750 -1759 -2775 -520 757 5021 4752 2300 -2243 -2486 2183
1540 2183 1328 1331 2105 -440 2428 829 -557 -518 -773 -524 426 -341 -565 160 1129 -711 -916 1107 1670
1521 1670 876 404 3367 3375 1642 -263 -3433 -4188 483 3541 2635 5554 6389 5811 744 -1493 -5348
1504 -5348 -3378 -2605 -1319 -1179 -1390 -2584 -1496 -97 -580 -101 -3464 -4309 -3187 -3384 -4482 -5890 -2347
1487b347K527j043j239L026J809l83J142J172l133M83J030O76J384l33q59Q45
1471D757j643P42q21j928o94J605l157j041M443J478j630J866P60R73k124j376
1455B210R41R09J134j294j714m41J508j36j188P68K101N62k115l041K078J878
$$ plain form
1487 -2347 180 -863 -2102 924 2733 2350 3492 4664 1531 2014 3044 3720 5104 4771 3912 4757
1471 4757 3114 3856 3035 1107 413 2018 -1139 -2180 2263 3741 2111 3977 4737 5710 3586 2210
1455 2210 3151 4060 5194 3900 2186 1745 3253 3117 1929 2697 4798 5360 3245 204 2282 4160
$$ [...]
##END NTUPLES=NMR SPECTRUM
##END=
