##TITLE=Analysis number 309583
Compound Code cc 00503
Book Reference 433/69/4
Project Code adrs
Chemist Name victoriam
##JCAMPDX= 6.0         $$ Bruker NMR JCAMP-DX V2.0
##DATA TYPE= NMR SPECTRUM
##DATA CLASS= NTUPLES
##ORIGIN= Bruker BioSpin GmbH
##OWNER= NMR
$$ XWIN-NMR		Version 3.5
$$ Wed Jun  1 15:04:07 2005 GMT Daylight Time (UT+1h)  MAYBRIDGE\NMR@NMR_250MHZ
##.OBSERVE FREQUENCY= 250.131544655141
##.OBSERVE NUCLEUS= ^1H
##.ACQUISITION MODE= SIMULTANEOUS (DQD)
##.ACQUISITION SCHEME= undefined
##.AVERAGES= 16
##.DIGITISER RES= 18
##SPECTROMETER/DATA SYSTEM= dpx250
##.PULSE SEQUENCE= zg30
##.SOLVENT NAME= CDCl3
##.SHIFT REFERENCE= (INTERNAL, CDCl3, 0, 16.522)
##AUDIT TRAIL= $$ (NUMBER, WHEN, WHO, WHERE, WHAT)
$$ ##TITLE= Audit trail, XWIN-NMR		Version 3.5
$$ ##JCAMPDX= 5.01
$$ ##ORIGIN= Bruker BioSpin GmbH
$$ ##OWNER= NMR
$$ C:\u/data/dgb/nmr/ADRS/3720/pdata/1/auditp.txt
$$ ##AUDIT TRAIL=  $$ (NUMBER, WHEN, WHO, WHERE, WHAT)
(   1,<2005-06-01 15:03:45.21 +100>,<MAYBRIDGE\NMR>,<NMR_250MHZ>,
      <created by zg, POWCHK disabled, PULCHK disabled
       configuration hash MD5:
       62 19 C7 07 E1 42 D1 B7 37 6C 3D D0 77 39 F9 E6
       data hash MD5: 64K
       4F 80 31 B1 E1 D6 18 C2 D6 18 A5 E9 AD A3 2B 2F>)
(   2,<2005-06-01 15:03:57.52 +100>,<MAYBRIDGE\NMR>,<NMR_250MHZ>,
      <Start of raw data processing
       ef LB = 0.3 FT_mod = 6 PKNL = 1 SI = 32K 
       data hash MD5: 32K
       31 AD 0B A7 A7 49 44 70 7B 7E DF AB E1 23 C7 FD>)
(   3,<2005-06-01 15:03:59.26 +100>,<MAYBRIDGE\NMR>,<NMR_250MHZ>,
      <apk 
       data hash MD5: 32K
       FF A5 17 43 29 70 A6 F1 AC 04 A8 6E 95 2C AD 39>)
(   4,<2005-06-01 15:04:00.02 +100>,<MAYBRIDGE\NMR>,<NMR_250MHZ>,
      <abs ABSG = 5 
       data hash MD5: 32K
       9C 7D 5E A8 50 7E 8A 0A 05 23 FE 82 7B 72 72 41>)
$$ ##END=
$$ 
$$ hash MD5
$$ 15 40 23 63 D8 3C E2 4E 0A 78 C5 D3 E2 AB 52 EA
##$RELAX= 
##$RELAX= 
##$RELAX= 
##$RELAX= 
##$RELAX= 
##$RELAX= 
##$RELAX= 
$$ Bruker specific parameters
$$ --------------------------
##$DU= <C:\u>
##$EXPNO= 3720
##$NAME= <ADRS>
##$PROCNO= 1
##$TYPE= <nmr>
##$USER= <dgb>
##$AMP= (0..31)
100 100 100 100 100 100 100 100 100 100 100 100 100 100 100 100 100 100 
100 100 100 100 100 100 100 100 100 100 100 100 100 100 
##$AQSEQ= 0
##$AQ_mod= 3
##$AUNM= <au_zg>
##$AUTOPOS= <35 >
##$BF1= 250.13
##$BF2= 250.13
##$BF3= 250.13
##$BF4= 250.13
##$BF5= 500.13
##$BF6= 500.13
##$BF7= 500.13
##$BF8= 500.13
##$BYTORDA= 1
##$CFDGTYP= 0
##$CFRGTYP= 5
##$CHEMSTR= <none>
##$CNST= (0..31)
1 1 145 1 1 1 1 1 1 1 1 1 1 1 1 1 1 1 1 1 1 1 1 1 1 1 1 1 1 1 1 1 
##$CPDPRG= <>
##$CPDPRG1= <>
##$CPDPRG2= <>
##$CPDPRG3= <>
##$CPDPRG4= <mlev>
##$CPDPRG5= <mlev>
##$CPDPRG6= <mlev>
##$CPDPRG7= <mlev>
##$CPDPRG8= <mlev>
##$CPDPRGB= <>
##$CPDPRGT= <>
##$D= (0..31)
0 1 0 0 0 0 0 0 0 0.06 0 0 0 0 0 0 0.0002 0 0 0 0 0 0 0 0 0 0 0 0 0 0 
0 
##$DATE= 1117634624
##$DBL= (0..7)
120 120 120 120 120 120 120 120 
##$DBP= (0..7)
150 150 150 150 150 150 150 150 
##$DBP07= 0
##$DBPNAM0= <>
##$DBPNAM1= <>
$$ [...]
##$SUBNAM7= <"">
##$SUBNAM8= <"">
##$SUBNAM9= <"">
##$SW= 20.6930455092707
##$SWIBOX= (0..15)
0 0 3 0 0 0 0 0 0 0 0 0 0 0 0 0 
##$SW_h= 5175.983436853
##$TD= 65536
##$TD0= 1
##$TE= 294.16
##$TE2= 300
##$TE3= 300
##$TEG= 300
##$TL= (0..7)
0 120 120 120 120 120 120 120 
##$TP= (0..7)
150 150 150 150 150 150 150 150 
##$TP07= 0
##$TPNAME0= <>
##$TPNAME1= <>
##$TPNAME2= <>
##$TPNAME3= <>
##$TPNAME4= <>
##$TPNAME5= <>
##$TPNAME6= <>
##$TPNAME7= <>
##$TPOAL= (0..7)
0.5 0.5 0.5 0.5 0.5 0.5 0.5 0.5 
##$TPOFFS= (0..7)
0 0 0 0 0 0 0 0 
##$TUNHIN= 0
##$TUNHOUT= 0
##$TUNXOUT= 0
##$USERA1= <user>
##$USERA2= <user>
##$USERA3= <user>
##$USERA4= <user>
##$USERA5= <user>
##$V9= 5
##$VALIST= <valist>
##$VCLIST= <CCCCCCCCCCCCCCC>
##$VD= 0
##$VDLIST= <DDDDDDDDDDDDDDD>
##$VPLIST= <PPPPPPPPPPPPPPP>
##$VTLIST= <TTTTTTTTTTTTTTT>
##$WBST= 1024
##$WBSW= 4
##$XGAIN= (0..3)
0 0 0 0 
##$XL= 0
##$YL= 0
##$YMAX_a= 331648
##$YMIN_a= -335986
##$ZGOPTNS= <>
##$ZL1= 120
##$ZL2= 120
##$ZL3= 120
##$ZL4= 120
##$ABSF1= 16.522
##$ABSF2= -4.171173
##$ABSG= 5
##$ABSL= 3
##$ALPHA= 0
##$AQORDER= 0
##$ASSFAC= 0
##$ASSFACI= 0
##$ASSFACX= 0
##$ASSWID= 0
##$AUNMP= <proc_1d>
##$AZFE= 0.1
##$AZFW= 0.1
##$BCFW= 0
##$BC_mod= 0
##$BYTORDP= 0
##$COROFFS= 0
##$CY= 12.5
##$DATMOD= 1
##$DC= 0
##$DFILT= <>
##$DTYPP= 0
##$F1P= 14.0000005364418
##$F2P= -0.99999901652339
##$FCOR= 0.5
##$FTSIZE= 32768
##$FT_mod= 6
##$GAMMA= 0
##$GB= 0
##$INTBC= 1
##$INTSCL= 1
##$ISEN= 128
##$LB= 0.3
##$LEV0= 0
##$LPBIN= 0
##$MAXI= 10000
##$MC2= 0
##$MEAN= 0
##$ME_mod= 0
##$MI= 0
##$NCOEF= 0
##$NC_proc= -3
##$NLEV= 6
##$NOISF1= 0
##$NOISF2= 0
##$NSP= 0
##$NTH_PI= 0
##$NZP= 0
##$OFFSET= 16.522
##$PC= 1
##$PHC0= -68.42591
##$PHC1= 2.9688
##$PH_mod= 1
##$PKNL= yes
##$PPARMOD= 0
##$PSCAL= 4
##$PSIGN= 0
##$REVERSE= no
##$SF= 250.13
##$SI= 32768
##$SIGF1= 0
##$SIGF2= 0
##$SINO= 400
##$SIOLD= 32768
##$SREGLST= <1H.CDCl3>
##$SSB= 0
##$STSI= 32768
##$STSR= 0
##$SW_p= 5175.98343685301
##$SYMM= 0
##$S_DEV= 0
##$TDeff= 65536
##$TDoff= 0
##$TI= <Analysis number 999999
Compound Code 99
Book Reference 9
Project Code 9>
##$TILT= no
##$TM1= 0
##$TM2= 0
##$TOPLEV= 0
##$USERP1= <user>
##$USERP2= <user>
##$USERP3= <user>
##$USERP4= <user>
##$USERP5= <user>
##$WDW= 1
##$XDIM= 32768
##$YMAX_p= 376519846
##$YMIN_p= -157995
$$ End of Bruker specific parameters
$$ ---------------------------------
##NTUPLES= NMR SPECTRUM
##VAR_NAME=  FREQUENCY,     SPECTRUM/REAL,   SPECTRUM/IMAG
##SYMBOL=    X,             R,               I
##VAR_TYPE=  INDEPENDENT,   DEPENDENT,       DEPENDENT
##VAR_FORM=  AFFN,          ASDF,            ASDF
##VAR_DIM=   32768,         32768,           32768
##UNITS=     HZ,            ARBITRARY UNITS, ARBITRARY UNITS
##FACTOR=    0.157963299565203, 1,           1
##FIRST=     4132.6476996994, 0,             0
##LAST=      -1043.33573715361, 0,           0
##MIN=       -1043.33573715361, -157995,     0
##MAX=       4132.6476996994, 376519846,     0
$$ Real data points
##PAGE= N=1
##DATA TABLE= (X++(R..R)), XYDATA
$$ [...]
17075a2435l3322K6280P876M106j5581m0176o369O1259L2924m6612l209N5678
17063C0419K7365O754j3336k1615j6552K1734j1433n8735k0580M8252J7114l861
17051E526l6918J6639l216q079J4243K0157M9933K9045l9425o1922j8517K3391
17039i143k3023j6184j769M7538K1730K3921L8605J1184n3247j9537k9803P084
17027b644l1033K1952l43J2329K3910m5091M9M610K9751q052O541P589l4305J4849
17013A12l447J9275K5905k306m1547k1165K085o020k2761j727j2948k957J6338
17000e1163K8575R582Q553p591l5284M387K5695J2226k7056Q692m27L1177L6510
16987D3876J8153L6582l4632n4469j3598J9176o612P833k6706k0716M5638L1260
$$ y = [-12435, -45757, -19477, -11601, -7495, -23076, -63252, -69621, -8362, 24562, -22050, -25259, 30419, 57784, 64538, 51202, 29587, 13035, 34769, 23336, -35399, -55979, -7727, 9387, 5526, -31392, -14753, -17969, -26048, -11805, 8352, 58285, 87330, 47905, -14017, -32534, -9143, -32166, -48350, -50119, -2581, 19149, 43070, 81675, 92859, 39612, 20075, -9728, -2644, -33677, -11725, -12068, 261, 24171, -20920, -20871, -16261, 13490, 5438, 11979, 19568, -14737, 112, -3335, 15940, 41845, 39539, -2008, -23173, -21088, -27108, -49869, -51596, -64544, -67501, -51163, -22588, -13006, -4453, -12044, -47328, -42941, -17246, -5020, -32076, -23384, -23811, 7366, 43876, 62029, 98611, 63979, 9510, -4088, 15088, 8476, 16309, -10397, -31113, 14525, 45785]
16975D5785l958l1687j6364l3735K5622P9525M0659n874l2980k5813N978M5233
16963I2391m1635m4898L320r339L3364J0524L044p196l646j7415O534N644n338
16950B5354J0631j2784l2548l1668j4530K7494M9305L5079N180m4925m3255O060
16938b0607M417J327k6148J5875q717j1452K7566M718M2838q925k5644k1824q364
16925c4940o395M263j221J4481O1840M340J625K7765m1136R134N939k3808K08
16912B2095j4702j9225j7711Q997j2766K7744J6067n314q79J5264O255J446n703
16899B1568j984j9816J400J3823j7678Q684L240J2386l3171o820K4744J168K643
16886A0187p947j1225K3018J9244k6188l5685L7122k844L393K233j1164K466K6390
$$ y = [45785, 41827, 10140, -6224, -39959, -14337, 65188, 105847, 99973, 66993, 41180, 47158, 92391, 50756, 5858, 9178, -161, 33203, 43727, 46771, 39575, 35929, 18514, 25048, 30692, 25354, 35985, 23201, -9347, -41015, -55545, -28051, 21254, 56333, 61513, 16588, -26667, -20607, -16190, -14863, -41011, -25136, -33853, -45305, -17739, -13021, 29817, 20892, -4752, -26576, -34940, -41335, -37072, -38293, -23812, 38028, 42368, 43993, 71758, 30622, 39756, 45695, 21887, 22095, 7393, -11832, -29543, -20546, -33312, -5568, 10499, 5185, 4306, 19570, 25825, 27271, 21568, 19584, -232, 1168, 14991, -2687, 5997, 9237, 21623, -11548, -18368, 6376, 7544, 10187, 2240, -8985, 14033, 33277, 7089, -28596, 8526, 5682, 9075, 11308, 144, 2610, 29000]
16873B9000o666J5667R307j229K925j9078m6409L0825j4383O014R99n6783o095
16860e5906J4853L8869l58K0970J8628k7122l6614k3991P942M375l1447K504M7933
16847a9364J2331p068J19l7311j9051l2588N1407O5426L9381l8810k9869j4189
16835b9586J6093K4772o017K8931K0746l5084r46m4883j9953J7291M673O182J3144
16822d637k815q928n417j571K2403J7798J0973J6592J6774j8329J9307j0602J2318
16809F3866O577m6648j7712j3401L872l2700K5400L2194J5815J0817J1657R113
16797F8850J003n5760q695k5682l0079M134K18j3293O683J4193R139J1008K6259
16784G978L5L4676Q935J0980q165j9574J883m870l2631j0772P156j4467J2158
$$ y = [29000, 22334, 38001, 47308, 46079, 49004, 29926, -16483, 14342, -41, 5973, 6972, -49811, -55906, -41053, -2184, -2542, 18428, 37056, 9934, -26680, -50671, -42729, -38354, -69801, -67297, -19364, -7033, -14101, -13982, -51293, -70344, -102932, -51525, 13901, 53282, 14472, -15397, -29586, -13493, 11279, 5262, 34193, 54939, 19855, 18909, -25974, -45927, -28636, -23963, -17781, -4637, -7452, -16380, -21797, -23368, -965, 16833, 27806, 44398, 61172, 42843, 62150, 51548, 63866, 70443, 23795, 6083, -7318, -3446, -36146, -10746, 21448, 37263, 48080, 59737, 68850, 69853, 14093, 5398, -20284, -50363, -46229, -46011, -59304, -52621, -38428, -29289, -18281, 7978, 8013, 42689, 51624, 62604, 54439, 34865, 36748, 31878, -753, -11525, -4369, -18836, -6678]
16771f678J0568j302l970L6676N530l5982k7652L713M771m2078k8552L0261P1268
16758A6573M6786j6196j0621R771l0607n3962o273J6552j592J3205l386K6795
16746G045K2903K9671j4926K1748n1989k5758k4740l61L2061O100p035J9594j7626
16733c313m1221r085j4958O49k2363k1258O0340P295N382k3139N445L0125K9054
16720B953J6780J4281j1859l4066j0076K6565J0235J7112N106k1698M269K1032
16708D0634j6016l7795n123L295J8276J4048J4017j7354n002P647l1314k3853
16696c8540l068J514M805J0196M1580J5542l5772j3580K8723L8154J1839K4704
16684H6097j6900j8959k5940j5227N6790K0522m7161n0241n60K1707r340K6685
$$ y = [-6678, 3890, 2588, -1382, 35294, 40824, 4842, -22810, -19097, -14326, -56404, -84956, -54695, 16573, 63359, 47163, 36542, 46313, 15706, -38256, -44529, -27977, -29569, -16364, -19750, 7045, 29948, 59619, 44693, 66441, 14452, -11306, -36046, -36407, -4346, 1754, -5281, 14313, -3313, -44534, -53619, -68577, -67928, -90291, -111549, -51209, -43914, -38532, -61671, -56226, -26101, 2953, 19733, 34014, 22155, -11911, -21987, 4578, 14813, 31925, 37031, 15333, 19602, 40634, 24618, -13177, -18300, -15005, 3271, 17319, 31336, 13982, 8980, 16627, -14687, -38540, -41608, -40094, -35289, -25093, 16487, 32029, -3743, -17323, 11400, 49554, 61393, 86097, 69197, 50238, 24298, 9071, 65861, 86383, 39222, -11019, -11579, 10128, 788, 27473]
16672B7473l8711k5594k4843k628k783k0487K7227K9408R313n10r323J6820J9542
16659D904J8766K5623k7551k7320k2428q078K8477k4006k3722J4705j9667K0091
16647d0206L0553K3059m494k6604k4848k9155N3074m427K3784L1097L8365k1802
16635D8396K914m362k5855O20J0356L908J8699k4827m2353k3848J9141L5234m383
16622A3640j1192k0332k4310O781j4196m826N1853l4604n466Q801o806L3113L7822
16609C0278K1605J1608m196K7241m9950m9577m618K147L7636L6699Q839k0689
16597D7023R077j1997k3109p142K7158k2922j2366L4656L0093k7607j849N499
16585D6514l328O4824J8748k0451k615l1314J4765K8230q133m0428j4231m179
$$ y = [27473, -11238, -36832, -61675, -64303, -67086, -87573, -60346, -30938, -21625, -22135, -31458, -14638, 4904, 23670, 49293, 21742, -5578, -28006, -36084, -7607, -31613, -55335, -40630, -60297, -40206, -9653, 13406, 8912, -17692, -42540, -71695, -18621, -23048, 736, 31833, 70198, 48396, 51310, 46948, 21093, 21713, 32069, 35977, 54676, 29849, -12504, -36352, -17211, 18023, 13640, 2448, -17884, -42194, -35413, -49609, -54435, -2582, -37186, -42652, -33851, -40657, -7544, 30278, 51883, 63491, 59295, 86536, 36586, -12991, -17609, -15462, 22174, 58873, 67712, 47023, 56100, 44103, 20994, 13852, 41010, 18088, 5722, 40378, 70471, 42864, 41015, 46514, 43186, 108010, 126758, 106307, 103692, 72378, 87143, 115373, 107240, 66812, 52581, 48402]
16573D8402K1987N788o922J8027J1787k4890n1747l4618N3165L3442L4782L250
16561A12453l0293j4174l7776k8388k0571K2681M4542L8978K484l3853o1514l86
16549e817N6221j8067n0333m0702J8069L232J1962k9280K1022K5881J927Q70N375
16536C60j1518K523k4300k167K0426k6355j4732J3548n0J1363L289L7365N1917
16523F1669K4552m1352l2772k6916m259K684j6648K5088O689m1611M773M2243
16511D140J2437l880j3651J3981q841J47j1007j2619J3594N5708j0042j2202j2332
16498A5433k1717l8815K4896M876j6335L4140o267l9854J7905M8674J5408n869
16486C2475j0501J5848K9335j262j3523j2850J8130M0699k9154k6446k7801n5402
$$ y = [48402, 70389, 76177, 69255, 87282, 99069, 74179, 22432, -12186, 40979, 74421, 109203, 112453, 82160, 67986, 30210, 1822, -18749, 3932, 48474, 87452, 89936, 56083, -5431, -5817, 50404, 32337, -17996, -58698, -40629, -37397, -25435, -54715, -33693, -7812, -5885, -5015, 360, -11158, -8635, -32935, -35102, -14676, -41031, -55763, -42215, -42265, -30902, -27613, 9752, 61669, 86221, 44869, 12097, -14819, -19078, -16394, -33042, -7954, -1265, -42876, -38103, 4140, 16577, 12697, -954, 13027, 4186, 4333, -6674, -19293, -5699, 50009, 39967, 27765, 15433, -6284, -45099, -20203, -15327, -31662, 2478, -3789, -43643, -25738, 22936, 38344, 32475, 21974, 37822, 67157, 65895, 52372, 39522, 57652, 98351, 69197, 42751, 14950, -40452]
16474d0452N946N732j8627K3395K9947j3485l8977L4490M819L644K9476L2584
16462E8492Q196m196k2980q039j0614Q811o282J6375l3727j6816K0930l5961o979
16449c2790R439j4973L5680M0422K9413k2485k7962l1131q405N615j4271j4356
16437d5804j6639j6535J3706K3011J7302j7397L519K1512L9071K0819j0623k3482
16425H460M497k8194l2433L3898o742k4359j8970L6904K7761k6685j8888l8039
16413h2790L1190q557O289Q449K8854M2027j9020l8836m468L7429L2311j0256
16401B2622J2802J7464l5787k8804n1367J9294N9727L7522K0287R701j662l7457
16389D4342p037Q330k1438m3462P560J8835k7153l2625k8867M2663L9501N6559
$$ y = [-40452, -34506, -28774, -47401, -24006, 5941, -7544, -46521, -12031, -7212, -3568, 25908, 58492, 66688, 62492, 39512, 31473, 20859, 29670, 23388, 39763, 6036, -10780, 10150, -25811, -32790, -23351, -38324, -2644, 37778, 67191, 44706, 16744, -14387, -22792, -17177, -31448, -45804, -62443, -78978, -65272, -42261, -24959, -42356, -38837, -17325, 21746, 42565, 31942, 8460, 12957, -15237, -47670, -13772, -20514, -44873, -63843, -26939, 822, -25863, -44751, -82790, -51600, -60157, -53868, -45419, -16565, 25462, 6442, -32394, -36862, 567, 32878, 22622, 35424, 52888, 17101, -11703, -63070, -43776, 15951, 53473, 73760, 83461, 81799, 44342, 37305, 45635, 24197, -19265, -11705, 7130, -20023, -52648, -81515, -38852, 649, 57208]
16377E7208J7492j6839k7616j1201j6562J6824J9421O768N577R712J1630k228
16365G0186j1821p717j9909j8147P072K1319k5298m8185J7172J3625k719j2442
16353a6864J156J2929L3338p513k4695J6020N64L4768n588j0605r718l1093j577
16340h878J2137j1592M2175K8805j2960m2027j5910j4577p246k5667j375p250
16328f4365j059J1757M7170J6860n9171Q750J2791K0494L7149L743k6213k5694
16316a7788o3057Q136J4855P896K528M0556L5235J5058l5196N373k4539n3545
16304f4488J203J3029L8721r703k7795p667K8444L2442k9871k8416M9952R699
16292E550K106o44R450O367J2911J7797M3161O178n6377m5886l1850j550L1409
$$ y = [57208, 74700, 57861, 30245, 19044, 2482, 19306, 38727, 45495, 51072, 60784, 72414, 70186, 58365, 50648, 30739, 12592, 19664, 40983, 15685, -32500, -15328, -1703, -4422, -16864, -15708, -2779, 30559, 23046, -1649, 14371, 14935, 49703, 44115, 33510, 23792, -7301, -8878, 3259, -8333, 33842, 62647, 49687, 7660, -8250, -22827, -30073, -55740, -57115, -64365, -65424, -53667, -6497, 10363, -48808, -40058, -27267, -6773, 30376, 34119, 7906, -17788, -80845, -72709, -57854, -49958, -47430, -6874, 28361, 43419, 8223, 13596, -10943, -64488, -63285, -50256, -11535, -21238, -49033, -56700, -28256, 4186, -25685, -54101, -4149, 5550, 7656, 7012, 16462, 22829, 35740, 53537, 96698, 102876, 46499, 613, -31237, -32787, -1378]
16279a378J2387K1090J9464J1558l2788j1021R890K7m7323K4057Q465P900J2345
16266C4673l503k1627k3121j0023K8273j9724m875M460L6362K9498J5224k626
16254F2991M659L007q770k6382l3936k7418J5184K9311J4373o055j9084K328L1068
16241D1276K2230k1464n2814r449k0188k0563N721p87k4377K8132K4379k1832
16229d9736q238K5693J7265j725J0951K5473m0323j9196K1418N133j2976R170
16217a7091L7380k5203l2412J8500L7152q687P154K6636l2290j8339K871L0687
16205B6358J7783k850j6565L3632L7228K442n3533k5576m7916m7765n047j6619
16193i8428J5218L5265J7781N7525J5272J7666o361j1882J958k8410k2105j3207
$$ y = [-1378, 11009, 32099, 51563, 63121, 30333, 19312, 29202, 29229, -18094, 5963, 14428, 22328, 34673, 31170, 9543, -13578, -23601, 4672, -15052, -19927, -15467, 20895, 50393, 65617, 62991, 67650, 70657, 61887, 35505, 1569, -25849, -10665, 18646, 33019, 26964, 7880, 10208, 41276, 63506, 42042, -10772, -20221, -40409, -60972, -55251, -56038, -80415, -52283, -27904, -49736, -57974, -32281, -15016, -16741, -5790, 19683, -20640, -39836, -18418, -13285, -26261, -17091, 20289, -4914, -37326, -18826, 18326, 9639, 16793, 43429, 11139, -7200, -4329, 26358, 44141, 41291, 24726, 58358, 95586, 98028, 44495, 18919, -28997, -76762, -81809, -98428, -83210, -47945, -30164, 27361, 42633, 60299, 53938, 42056, 44014, 15604, -6501, -19708]
16181a9708k1845L6957k4238r367K9144j589J7016Q747O7469L0818l1856l3315
16169D8233Q128k3000l3471M151Q794k034O14m0297l8281k5473L9812L5008j6873
16156c4689J0016J5244K2600j8l5084q984L297O128r147L3952l855L7788J0112
16143D7360j105J903J39m5781k2876m720K7596L6904J9336k2706l2020j4768L4154
16130B3416p785n0288k5588k6484L5798K5263l8798m1804J5361l8647J9196L9704
16118g0656M9587K8786k4642k3303J075n479J3217K8280R630l8125k0175J4883
16106c6922M2787J7466j0864K8628J4155k552j9808k468j8010K4766K487K2771
16094F2436K6361k1712m0162P222k0050n9711N878K0723L0685J4143j0407J2696
$$ y = [-19708, -41553, -4596, -28834, -38201, -9057, -10646, 6370, 15117, 82586, 113404, 81548, 48233, 56361, 33361, -110, 4041, 12835, 10801, 11415, -28882, -67163, -92636, -52824, -17816, -34689, -24673, -9429, 13171, 13153, -21931, -30915, -27618, -21490, -30637, 3315, -540, 37248, 47360, 46255, 48158, 48297, 2516, -20360, -25080, 2516, 39420, 58756, 36050, 4030, -10738, 23416, 15631, -34657, -60245, -86729, -50931, -25668, -64466, -106270, -90909, -129556, -110360, -70656, -21069, 7717, -16925, -40228, -39153, -44632, -31415, -3135, 6495, -31630, -51805, -36922, 5865, 23331, 12467, 41095, 55250, 52698, 32890, 30422, 12412, 37178, 39665, 62436, 88797, 67085, 26923, 34145, 14095, -45616, -39738, -19015, 11670, 25813, 15406, 28102]
16082B8102j125j7758j1685l4211K3729K4924m799M50K6327L6913J7902O887j2576
16069H3080k5523n3726k7395j6463j2620j834N0899K1656n9171k8586O0236M3296
16057C3849L1616K9006p419m466l4909r85j8699K9612J1789j5075k6954j9573
16045G792j9207J6009k3285K8205K2845J0511R921J230l9602k528L10m8848l244
16032c9891Q3651J5445n833L2107j4676l2970k5528j5459O081M5518j4074o0028
16020b5657R033K9006o86l0460J5727K4996j9381l5996M2853K8249j3849l4594
16008a0759J8943N482m2801j9023j34M282J3394K9013k8067r95K3446n898k8738
15995d1855N110J0385o588K9242K0528k5941j2051J489L0676J3954l3647l6676
$$ y = [28102, 26977, 9219, -2466, -36677, -12948, 11976, 7177, 7627, 33954, 70867, 88769, 95656, 83080, 57557, 3831, -23564, -40027, -52647, -54481, -3582, 18074, -41097, -69683, -9447, 33849, 65465, 94471, 87052, 82586, 47677, 46692, 27993, 57605, 69394, 54319, 27365, 7792, -11415, 4594, -18691, 9514, 32359, 42870, 52791, 54021, 14419, 11891, 12201, -36647, -39891, 43760, 59205, 53372, 85479, 70803, 37833, 12305, -3154, 2927, 48445, 34371, -25657, -16624, 12382, 11696, -18764, -3037, 21959, 2578, -33418, 9435, 37684, 23835, -10759, 8184, 13666, -29135, -48158, -48292, -44010, -30616, -1603, -29670, -30665, -7219, -13117, -41855, -36745, -26360, -32948, -3706, 16822, -9119, -21170, -19681, 10995, 24949, -8698, -45374]
15983d5374k203Q573R968J0155n639l672j4483k254K7106K2287p254K6449M7886
15970G1545k0231l7370k5836Q927J024J8878N462k4480m2658K1528L145M0809
15958B0743K3888n0119m5131j2688O928L8068N780J1564k7911j2812N907K9299
15946f484J6603l977J4452k7492k6710J2910K8089M1796J993n0786L875N1616
15934E5885L2398j599M521k3814l4803l450K3764p886j0036j4669J8738J5331
15922E4380o732M19j4043k292P1898l3246l8540r872l6514l1217k596L726k4698
15909f9327q825Q4869L0597n0009O636J6124J8883M7500J9461n000J830o6164
15897B6575j9556j1351m9727j3174M7171K1329J1202k3041n914k75N350l4046
$$ y = [-45374, -47577, -39004, -29036, -18881, -24520, -28192, -42675, -44929, -17823, 4464, -2790, 23659, 71545, 51314, 13944, -11892, -2965, -1941, 16937, 22399, -2081, -44739, -23211, -20066, 20743, 44631, -5488, -50619, -63307, -56379, -18311, -12531, -967, -28878, -41690, -35783, -6484, 10119, 6142, 20594, -6898, -33608, -20698, 7391, 49187, 51180, 394, 4269, 55885, 88283, 86684, 91205, 67391, 32588, 29138, 52902, 45016, 34980, 20311, 39049, 54380, 47648, 48067, 34024, 31732, 103630, 70384, 31844, 21972, -14542, -45759, -48355, -44629, -69327, -78152, 6717, 37314, -12695, -6059, 10065, 28948, 76448, 95909, 90909, 92739, 26575, 7019, -4332, -54059, -67233, -20062, 1267, 12469, -10572, -16486, -16761, -11411, -45457]
15885d5457j5228L7150L3516k1469L4876j923M08K859j0003k1230J1848M457j8256
15872h452Q853k5174J5268M7946j8913l3791L371J5424k9187J3298L4699l69J1462
15859C4435j1562k7052m2272j2063R042j484l867l8592K8691N9402J7855m587
15847G946n498n797k835j8280J3744K4751m961r870L728N0190J5379l180k0241
15834D5076k4160n58Q316J2747j733k211M186l7727m3568M1760L828o907K3542
15821B2591K3070J4962k2052P200L8660J2569n7532n4243k0150j9221K9800M3783
15809A9437O027k1792K794M7449P492p5877l6769P573J1663J0805m263l837l278
15796c2576J6710O921k8147m997K8832m495K670K2571J4512m7483j4605K2220
$$ y = [-45457, -60685, -23535, 9981, -11488, 23388, 21465, 21873, 24732, 14729, -6501, 5347, 9804, -8452, 401, -24773, -9505, 38441, 19528, -14263, -10892, 4532, -24655, -11357, 23342, 22973, 34435, 22873, -4179, -46451, -58514, -49472, -50956, -54823, -93415, -64724, -5322, 12533, 7946, 2448, -3349, -6184, -24464, -10720, 14031, 9070, -800, 2928, 53118, 68497, 65317, 45076, 20916, 20358, 28674, 41421, 39688, 37477, 41663, 3936, -39632, 2128, 5956, -951, 22591, 45661, 60623, 38571, 45771, 84431, 97000, 39468, -14775, -34925, -54146, -24346, 19437, 25464, 3672, 6466, 53915, 61407, -14470, -51239, -43666, -32003, -21198, -25461, -29298, -32576, -15866, -8945, -37092, -42089, -13257, -17752, -15082, 7489, 22001, -25482, -40087, -17867]
15784a7867O0319Q469l776k3163M326j203q677K7357j8467k1563M3366k351j1231
15771C5539Q836j0905k0742k5803L00J5678n68K681L3777r460l4342l8509J7232
15758b6286L5963L6464o7592p3225J1092j8306K0503P5580J5790k1844l0442K50
15746d2053L3680L8833p03L69m2475k8885k290R259j139K0109J2584j4703j9460
15733c6874k8136l159K1122q37R77P431k9144P413K2961j4678J9016M2296J4704
15720B3092J475m355r558M7279l578p6470r41L3707q081o431J9868N4430L2724
15707A03161p3552m4300M1753M7539k5567m5239j0604o390k1942L3758N89J338
15695E44j5099N126K1045L0581j4054k1218k9873k064L5588J5017k0698K1838
$$ y = [-17867, 42452, 50921, 47145, 23982, 28308, 27105, 18428, 45785, 27318, 5755, 49121, 46770, 35539, 44375, 33470, 12728, -13075, -12775, 2903, 2335, 5016, 38793, 29333, -5009, -43518, -26286, 9677, 46141, -21451, -94676, -83584, -101890, -81387, -5807, 9983, -11861, -42303, -42053, -8373, 30460, 29757, 30126, -12349, -41234, -43524, -34265, -35404, -15295, -2711, -17414, -36874, -65010, -68169, -47047, -47884, -46907, -39476, -68620, -61207, -38246, -52924, -33908, 8388, 23092, 24567, 20212, 10654, 57933, 54355, -22115, -23056, 10651, 2570, -3861, 16007, 70437, 103161, 29609, -14691, 27062, 74601, 49034, 3795, -6809, -13199, -35141, -1383, -794, 544, -14555, -9429, 11616, 42197, 28143, 6925, -22948, -25012, 10576, 25593, 4895, 26733]
15683B6733M425K801l8761n5787j3383J4962M3768J8783k8249J2486j130k0340
15671c3692j642J7493k3348k6611J5527O3249J9267j7685K7122l5549n2865j9371
15659f8105K6824M0199j6927r524r109n188K528O650P573O599P946L2539M1618
15646F3623K7693J7253p0864l3371J0987j4576j7428J6314Q195j1864J123j729
15634d644q586M5755J3569J264m6922o7729j6158k398m512j7573l2562R06N8269
15621h1321N4342O215k3780P891J0374J1983J1855j2719k4365P909P716j9689
15609d3589J9507K9898K854j6276k0042l3479N2479J8515J026l3357K0833Q722
15597G091M1639N692Q488k1705M09K5668O699k5915m5882k4890J7898L2311J3636
$$ y = [26733, 31158, 33959, -4802, -60589, -73972, -59010, -15242, 3541, -24708, -12222, -13352, -33692, -35334, -17841, -41189, -67800, -52273, 10976, 30243, 12558, 39680, 4131, -48734, -68105, -41281, -1082, -18009, -27533, -36642, -41830, -39302, -32652, -25079, -18480, -10534, 22005, 63623, 91316, 108569, 37705, 4334, 15321, 745, -16683, -369, 7826, -4038, -2915, -4644, -13230, 32525, 46094, 47358, 436, -67293, -83451, -85849, -90361, -107934, -140496, -139590, -81321, -26979, -20764, -44544, -36653, -26279, -14296, -2441, -15160, -39525, -31616, -23900, -43589, -24082, 5816, 8670, -7606, -27648, -61127, -8648, 9867, 10893, -22464, -1631, 7091, 48730, 54422, 62910, 41205, 41614, 67282, 73981, 48066, 2184, -22706, -4808, 27503, 41139]
15584D1139j775l9491K565N0111J4263j9499j0817r030k1997m7886N6689N0811
15572F5083j8956m5256k3966J7786K5057l287m2437j2875M6990j0535j347k358
15560f101K1804P648o592o1964l3978m0045M9371M0261J2824L1171j8510j1125
15548a5236J1224l3575k0287P854N9324j5798m6149J3652m846m396N7333K7432
15536C6532m8673m2439q122r271L2524K5963o80m978M0653K7112l0867n3185K147
15523c3284K8935J5629k4839l8283j6151K630N7079L9015j4168k3436j372Q728
15511D83j2222J8340M4515n3338l4083K2048j3581m1589K8731M672j1124K5504
15499b1644l76p933J5823l7158k2519M128L8251M285L0366K315n6913k4744M3371
$$ y = [41139, 39364, -127, 2438, 52549, 66812, 47313, 36496, 27466, 5469, -42417, 14272, 65083, 46127, 871, -23095, -5309, 19748, 16461, -25976, -38851, 8139, -2396, -3743, -6101, 15703, 23351, 16759, -45205, -79183, -119228, -69857, -29596, -16772, 14399, -4111, -15236, -4012, -37587, -57874, -50020, 9304, -6494, -52643, -38991, -43837, -48233, 9100, 36532, -12141, -54580, -62702, -71973, -39449, -13486, -14166, -19144, 21509, 48621, 17754, -35431, -33284, -4349, 11280, -13559, -51842, -67993, -65363, -8284, 30731, 16563, -6873, -8245, 483, -11739, 6601, 51116, -2222, -36305, -14257, -27838, -69427, -40696, -36024, -47148, -21644, -22020, -29953, -14130, -51288, -73807, -69679, -31428, -27143, 3223, 5538, -51375, -76119, -32748]
15486c2748k4628q292J7719J4860L4131m2518k2989K6990N8657L3315j507k1270
15474C1720k1702R452p339n4251Q897L7029J1700r607O823p688m1080J0437M6735
15461B1126k3856m6319o8600L6228J5711J0922M7246k1305m1746J9965J5094j960
15449c7494J1676Q346P206k9792j2637L2465M7995q058n424l0598o73Q834J8425
15436A0271m851j184L6693M1080j1205k8333J226m5750j4815M8428J5795K1734
15424F9089k2863k8154j0159L8265j5066k5695l2450J0876M3377J279k6276L2185
15412C4408L9099p708p753m7159j2380N031j7437q40j197K5217M202l152p794
15399B537J5563M7452K425o4546k3306K5994L0952k220J7086k5969k2837j5705
$$ y = [-32748, -57376, -65668, -47949, -33089, 1042, -41476, -64465, -37475, 21182, 54497, 52990, 31720, 10018, 19470, 12131, -42120, -33223, 3806, 15506, 5899, 12722, 5034, -36046, -25609, 21126, -2730, -49049, -117649, -81421, -65710, -54788, -7542, -28847, -70593, -50628, -35534, -37494, -25818, -17472, -10266, -40058, -52695, -20230, 27765, 19707, 14283, -16315, -16988, -8154, 10271, 5420, 4236, 40929, 82009, 70804, 42471, 43697, -2053, -16868, 31560, 47355, 69089, 46226, 18072, 7913, 46178, 31112, 5417, -27033, -16157, 27220, 28499, 2223, 34408, 73507, 65799, 58046, 10887, -1493, 3538, -13899, -14739, -15936, 9281, 13483, 10331, 2537, 18100, 65552, 67977, 3431, -19875, 6119, 37071, 34851, 51937, 25968, 3131, -12574]
15387a2574k176K4983l1181j2073M962J3858M8642J7120k7470k4076J7817O172
15375B4004o377j9202N757q836j6411N717L158k6609n8350J0327M1547M7255N055
15362G035o000j0244j1492L2609m765q099J3399r916m2882M719O4781J4726j1802
15349C2069j0329J9913J8900j8954k5610l381L5146O8810K0710l3687m8396j6871
15337C8320Q613q694m5652j1025O062n046k5908k8546j1196M496N5461J4482K8258
15324A9625p494j9875o135K447j1828K2531l7145k5637J6666M6062J4060Q948
15312B2225o152N873L1821J1065J7267m9575k8722M8456j1774l4564Q507n104
15300I323p647O706K6983p959k4469k4380J681l1192P448L229j1574L8570M0608
$$ y = [-12574, -14750, 10233, -20948, -33021, -28059, -14201, 34441, 51561, 24091, 15, 17832, 24004, 17627, -1575, 4182, -4654, -21065, -15348, -12190, -38799, -97149, -86822, -45275, 1980, 7035, 1035, -9209, -20701, 11908, 7143, -956, 12443, 2527, -40355, -35636, 29145, 43871, 32069, 21740, 41653, 60553, 41599, 15989, 12608, 47754, 116564, 137274, 103587, 55191, 38320, 46933, 38239, -7413, -18438, -12376, -17422, -43330, -71876, -83072, -78576, -23115, -8633, 19625, 12131, -7744, -13879, -11432, -23260, -729, -37874, -63511, -46845, -783, 13277, 22225, 16073, 21946, 53767, 64832, 82099, 32524, 3802, 52258, 40484, 5920, 14427, 9323, 1676, 8382, 35365, 27406, 2937, -21443, -19762, -50954, -43506, -40277, -51851, -13281, 27327]
15287B7327M7315j9254q4468K8969N9486P364K15m150l7663k4750K2378M3502
15275F6271M6599m6645j03785m5885L6956M1261j0603O43M0663P767J6163j4930
15263C4475l0693k1858R811l7213j4692M821j1272L6645j3477K8098K3144m921
15251B868j9904j6619L8946J3637j5087N791m166j2070p629J6042k5850l0537
15239e4578M4780J3775o317J7943K4670J7651q969k5393k3092j1652j8419O1761
15227C2160L6782m1427m3649j3485J3530K9206O820L1286p602j9222R130j6406
15215A7123j1057Q277k5535j0323L5980K1926Q39k7561l7850k0413L3251L3823
15203A8480M6093K2158m6732m3598k1581K2851J5033O077k358k3194j0322n083
$$ y = [27327, 74642, 55388, -29080, -111, 59375, 66739, 66954, 62804, 25141, 391, 22769, 66271, 112870, 66225, -37560, -83445, -46489, -5228, -15831, -15188, 25475, 33242, 49405, 34475, 3782, -18076, -8265, -45478, -60170, -55349, -66621, -29976, -43453, -15355, 7789, 2868, -17036, -33655, 5291, 18928, 3841, 9632, 5466, -6604, -14233, 1809, -24041, -54578, -9798, 3977, -2340, 15603, 40273, 57924, 48955, 23562, 470, -11182, -29601, 32160, 68942, 27515, -16134, -29619, -16089, 13117, 19937, 51223, 43621, 24399, 33529, 17123, 6066, 14343, -11192, -21515, 14465, 36391, 37230, 9669, -28181, -48594, -15343, 18480, 64573, 86731, 39999, -3599, -25180, -2329, 12704, 18781, 16423, -6771, -17093, -22176]
15191b2176k6635j421J8639J4175k6405q202K2728L601M91K9962j2270j2770L1707
15178A1424k2878L809l8239Q171K8966K7933k5574j3532O4k276J3940j31L1747
15165B3424m995n254K0221J0119k3969k8841J056j9586j4949k3060q466K8767
15153d5533M2536K2941l8037m8804q857J4264O7253R455l0014J8045N0305m9432
15141D122j8693k4945k8303K3608L4935j5153J5637L7857k4170j7570J7853J650
15129F828J0570k1776K7393p488n2833O411P097J4700n028l0247K110P83j0744
15116e2224M0094L1205K5588L2891m2443k1194j6227l510l103L6322K0511m174
15104D3736K121k3553n4493l6842Q085j2059K5433Q000K8190J277n3815K5467
$$ y = [-22176, -48811, -50232, -31593, -17418, -43823, -52025, -29297, -25696, -25205, 4757, -7513, -20283, 11424, -11454, -7645, -45884, -37713, -8747, 19186, -6388, -19920, -19856, -22132, -8192, -8323, 23424, 18429, 13175, 33396, 43515, 19546, -9295, -8239, -27825, -42774, -65834, -74300, -45533, -2997, 19944, -18093, -66897, -75754, -61490, 5763, 15218, -14796, 3249, 53554, 4122, -14571, -39516, -67819, -44211, -9276, -24429, -8792, 29065, 4895, -12675, 5178, 6828, 17398, -4378, 23015, 15527, -37306, -30895, -23798, -9098, -14126, -44373, -42263, -41480, -52224, -12130, 19075, 44663, 77554, 35111, 13917, -2310, -5820, -8923, 27399, 47910, 43736, 45857, 22304, -32189, -69031, -60946, -73005, -47572, -39572, -11382, -10105, -63920, -38453]
15092c8453L5259j9957J5881K8650m3546M375K2940P079L87M0972J5697r753J7181
15079G6712J152m1746K5387j4222k1928k2787J6063K9371K174k395k2908P398
15067C2271r991k2994n0361N8578K2572J1244j5870k7776N25l6178Q794R69j513
15054b9730l872K4812L289J3774M8589L1870L1740p150o7436k6303J0017m0816
15042a1216l392P206J6118l685j8864K310J9676j8534J7432N1756j0592l0286
15030A7929J9128p777q752j7193L3789K5925p3376k7772M342M2658M7168j2106
15018D3963n2335m2949N929J3671j4812L0679M9501K8669n4365k9464l1551l209
15006e6273j2423m299L5596L5595J5410l1459l8554j5057j7924J4148j7793j3240
$$ y = [-38453, -3194, -23151, -7270, 21380, -22166, -17791, 5149, 12228, 12615, 53587, 69284, 59531, 76712, 77864, 36118, 61505, 47283, 25355, 2568, 18631, 48002, 50176, 47781, 24873, 32271, 22280, -714, -51075, 7503, 30075, 41319, 25449, -2327, -1802, -37980, -29186, -28217, -29730, -33602, -8790, -5501, 8273, 56862, 88732, 120472, 113322, 45886, 19583, 29600, -11216, -14608, -7402, 8716, 5031, -13833, -11523, 8153, -10381, 7051, 58807, 48215, 17929, 37057, 29280, 20528, 3335, 37124, 63049, -10327, -38099, -33757, 8901, 56069, 43963, -8372, -51321, -45392, -31721, -46533, -15854, 33647, 62316, 7951, -21513, -53064, -56273, -68696, -72995, -37399, -1804, 13606, -17853, -56407, -71464, -89388, -75240, -93033, -106273]
14994a06273N4850Q4193k995p01l0412j7620j5245J8376L5482m4504k220K7514
14982D45K7415o140r496K0710K747J1726l3075l0468J4952k3492J8468l029J9292
14969A0055P988L0873j4083m735J3005K8355j3548l4929L532k710k5617k5140
14957b6954q828k1945J6700K5181k5894l0473L6036O8068O752m566j9936j6585
14945b444l3228J755N7238P4061L1113o7459m7683M497Q355N8859m3073m8557
14933f566Q830N2268j0745j0989K453j3414j4118k3288l0340N532K3671J3475
14921c231R531q098J7979l4524l1031P579K5766k8725K7325K9412j0219k0694
14909a8930l7457J2479j3788k072J2185J3318K2800N6237M6941k7146l4299l0723
$$ y = [-106273, -51423, 32770, 29775, 29074, -1338, -18958, -34203, -15827, 19655, -24849, -27069, 445, 27860, 21720, 12224, 32934, 35681, 47407, 14332, -16136, -1184, -24676, -6208, -9237, 10055, 18043, 48916, 34833, 30098, 43103, 71458, 57910, 22981, 26513, 23803, -1814, -26954, -35782, -57727, -41027, -15846, -41740, -72213, -36177, 31891, 38643, 34077, 14141, -2444, -35672, -33917, 23321, 97382, 128495, 61036, 13353, 17850, 26205, 85064, 41991, -6566, 2264, 54532, 43787, 32798, 35251, 21837, 7719, -15569, -45909, -40377, -16706, -3231, 6300, -1798, 16181, -18343, -49374, -41795, -16029, -44754, -17429, 11983, 1764, -18930, -56387, -43908, -57696, -59768, -47583, -34265, -11465, 44772, 91713, 64567, 30268, -455]
14897d55M435j7145j4451J0976L8752r527j5970k8739j1415n268L1055L2482k3570
14884h840k9544J561M7309K6125n0336n77L6165J1313l501p156j5939o179l2866
14871c2465L058L0124J673J2837J0628K1857k6281k3362N91q852k5522K1812k4604
14858c8506m9559K4790q1l3737J5042K7772K7602M2303M1773L030r207k7904j8710
14845D608j4411j059k703L9546K7175J1727p169k5370j7975k7085j1671K7266
14833B879N7674k4674m3313k5905l706Q693Q87n911J0275L1302M2954l2227k4558
14820e630l0420q198j5253K804J6774J9423J2120N51J8845m7151k1856M468J6066
14807c7457P778p690k6530j7412K7798J1275k0303o78J8799j6839K8676O3593
$$ y = [-455, 3980, -13165, -27616, -16640, 22112, 12585, -3385, -32124, -43539, -48807, -17752, 14730, -8840, -38384, -36823, 10486, 36611, -13725, -14302, 21863, 33176, 29675, 22519, 6580, 401, -32465, -29407, 717, 2390, 15227, 25855, 47712, 21431, -1931, -1340, -10192, -35714, -13902, -38506, -88065, -63275, -63356, -97093, -82051, -54279, -26677, 15626, 57399, 60429, 51222, 23318, 4608, -9803, -10862, -13565, 25981, 53156, 64883, 57714, 32344, 14369, -12716, -24387, 2879, 60553, 35879, -7434, -33339, -37045, -28352, -27465, -33376, -23101, 8201, 51155, 18928, -5630, -36050, -44248, -59501, -56697, -39923, -20500, -8380, -7829, 11016, -36135, -57991, -53523, -37457, -29679, -37369, -63899, -81311, -53513, -42238, -62541, -63219, -44420, -61259, -32583, 31010]
14795C1010J7511n0437j4077j2584j0259J007R340J9774q247k5432J5884L7305
14783A0795R555m646j4433l4394M8787L2683l1589k8166j0051j9598L2439K666
14771e952J7841j5128L210j007k9532l3253L645J2774J1551J0006o4964j8442
14759a09251L7559L8949j1158M3401M9484p13j4808j2800q25l7573j3186R365
14747b1556L1483L0107l470R282j5959j3932m096J2047k943j0299k0911j0382
14735b0629j3552L6501K9154R113K6193m5578l240M1733q284j5011l005R029j854
14722D0570k3388P372J4667r589J2788j5647J2948J8553m0911r599L7021m2820
14710A965j0928J9188M820J0514J5922j8750N226N47k2234J9953K3671n520J3228
$$ y = [31010, 48521, -1916, -15993, -28577, -38836, -37829, -28489, -8715, -16962, -42394, -26510, 10795, 20350, 15704, 1271, -33123, 15664, 48347, 16758, -11408, -21459, -41057, -8618, -5952, 11889, -3239, -29, -1036, -30568, -63821, -60176, -47402, -35851, -25845, -90809, -109251, -71692, -32743, -43901, -500, 48984, 48271, 33463, 20663, 19838, -17735, -30921, -21556, 9927, 40034, 36564, 45846, 29887, 15955, 11859, 23906, 20963, 10664, -10247, -20629, -34181, 2320, 31474, 40587, 66780, 21202, 17962, 59695, 51411, 36400, 33395, 42424, 40570, 17182, 24554, 39221, 29632, 42420, 26773, 39721, 58274, 17363, 7764, 44785, 1965, -8963, 10225, 15045, 25559, 41481, 22731, 27957, 28504, 6270, 26223, 49894, 44374, 57602]
14697E7602L582J3249R382l8768m7340l350j6667j7469j5187K681L9811m842j2071
14684b9387J2028K555j2332K8552l7545k74K5611l8504l2294l78J9876K9592K7211
14671e289j8902k4456J9751K3890M3784K2544p809o1201n5504K2793K2054K4460
14659F115L0232l927q184Q93N797m4449j2704K2312R595J8251Q107L9728l938
14646F7828m9892j8036O725K4029j3156k3035r280m500j7508O5750K8350l5818
14634B1457l1256K7323K595j5458m1542k3726L9481L6897q816J840k0382K931
14622h656J8560j5788q736K4421K1107o642j1070j3037N657O135J1519j6932J7401
14609B3939J4777j4015l7006n6055J746M1521J8960L1410j9247l3456O038J7419
$$ y = [57602, 61184, 74433, 83815, 45047, -2293, -5643, -22310, -39779, -54966, -52285, -12474, -17316, -29387, -17359, -14804, -27136, 1416, -36129, -36403, -10792, -49296, -81590, -81968, -62092, -32500, -5289, -24191, -48647, -28896, -5006, 38778, 61322, 53513, -7688, -63192, -40399, -18345, 6115, 36347, 32420, 24236, 25129, 30926, -13523, -26227, -3915, 5680, 23931, 32038, 71766, 67828, 17936, -100, 6625, 30654, 17498, -5537, -14817, -19317, -36825, 28925, 57275, 21457, -9799, 17524, 20119, 4661, -36881, -60607, -21126, 15771, 6955, 8795, -11587, -8656, 9904, -5884, -14620, 9801, 30908, 24266, 13196, 159, 5816, 11951, 23470, 6538, 23939, 38716, 24701, -12305, -68360, -66614, -25093, -6133, 25277, 6030, -27426, -21388, -3969]
14597c969m126r020J9826K5705N750j4308l883k760N717M1787l4371j5640K3880
14584C4588K2234L4318k5272k6281N716J0849m437m868l2909K096k6484j482M5916
14571C3984M084l6138l8574n899K6475O781j9620m906l0010M1702j7324j7199
14559e6644J2573Q160L762K3702L0915P186k0535j6271j2771j6531l6703l25K30
14546g3252M5492J4697k151J2458k131q220q815M6529j2851J743J4704K8590P176
14533F3969m2501l3218k6916L1025N1191M986K338k0192M771J1083j0994J1043
14521D6585L4396L7602l4512j8322p287k8731J4096k7508J436o248k7611K3515
14509G411M8686L3917k7474n7303j0977r235q665j7567L0199J9255J4428j7269
$$ y = [-3969, -8095, -17115, 2711, 28416, 34166, 19858, 15975, 13215, 18932, 60719, 26348, 10708, 34588, 56822, 91140, 65868, 39587, 45303, 56152, 51715, 46847, 13938, 16034, -10450, -11932, 33984, 38068, 1930, -36644, -42543, -16068, -9287, -28907, -33813, -63823, -22121, -39445, -56644, -44071, -35911, -32149, -8447, 22468, 29654, 9119, -7152, -19923, -36454, -73157, -73482, -73252, -27760, -13063, -15214, -2756, -4887, -13107, -21922, 24607, 11756, 13499, 28203, 56793, 63969, 21468, -11750, -38666, -7641, 43550, 48536, 50874, 30682, 35453, 46536, 35542, 46585, 80981, 118583, 84071, 65749, 58462, 29731, 43827, 16319, 17755, 11507, -16104, 7411, 56097, 90014, 62540, 5237, -5740, -14975, -23640, -41207, -11008, 8247, 22675, 5406]
14497E406J0003L8728k9062k5971M048K5247j4991R611r735L5776j0194m1738
14485b872O480K5814n4930n4981j0518J8742O4964k6053j3698J1572J5859N2761
14473C3140k9216p936q531l4161j9698M0848r641l774J6880j9044p9407L6234
14461h4306O5861L5516J1683j0585l7978M0455L731K5734o486k2246l3550j0934
14449b3105N882M67K3749m1804J7413Q949m5378k5367o31J3753R375N7410M1474
14436D2187P724l366j2267n4846j4008J8539N675K0686j2760m4408k2365R708
14424e9501P050L2522j0745J4860j1939Q540J1132K5522K6826J9291J9684J3996
14412I7238k6947o8009q307K1815J6018M2614O714n4946l6719R57Q740l8590m7297
$$ y = [5406, 15409, 54137, 25075, -896, 3152, 28399, 13408, 23019, 13284, 49060, 38866, -2872, 3608, 29422, -25508, -80489, -91007, -72265, -7301, -33354, -47052, -35480, -19621, 33140, 3924, -4012, -12543, -46704, -66402, -25554, -35195, -38969, -22089, -41133, -120540, -84306, -18445, 17071, 28754, 18169, -19809, 20646, 24377, 50111, 43625, 21379, -12171, -23105, -17223, -16756, 6993, -34811, -17398, -8449, -53827, -79194, -79825, -66072, -56697, 713, 42187, 49911, 46545, 34278, -20568, -34576, -16037, -10362, 10324, -2436, -46844, -69209, -59501, -52451, -19929, -30674, -15814, -27753, -19213, -8081, 17441, 44267, 63558, 83242, 97238, 70291, 2282, -6025, 15790, 31808, 74422, 81136, 26190, -10529, -9572, -832, -39422, -86719]
14399h6719l60K2961j526q514j9343O594M250m5211J7407M5085J9485K9924M6052
14386C0085M123L2862j4324L452m3886o532L3471M2753N289N860o186j9593q150
14373E9224L7516r541L0048l3933m2830l9738j5260J3084j3011j2375j9717j7110
14361f3643r784K2031N8818K6484k0507j2005r35N069j6697K052l7836m1763J9971
14348f8745L8945J3283J556L7530M746m5867j7982n807J2234M757O139J6625m0975
14335d3561Q748L925o79J0942K2134r087n889j4722m719j7434q517L2910N395
14322b0554l4374l5394K2569J2827j8575R73O2836M1808k0501k6402k351J2912
14310d226j1322l226l8289R685j1139J007j0573O2368J6894l5821k429j7374K57
$$ y = [-86719, -87079, -64118, -65644, -74158, -93501, -86907, -82657, -127868, -110461, -65376, -45891, -15967, 30085, 34208, 67070, 52746, 56198, 12312, 5780, 39251, 82004, 87293, 93153, 86967, 67374, 59224, 96740, 87199, 117247, 83314, 40484, 746, -14514, -1430, -14441, -26816, -46533, -63643, -73427, -51396, 7422, 33906, 13399, 1394, 459, 5528, -11169, -9117, -46953, -88716, -68745, -29800, -16517, -14961, 22569, 27315, -18552, -36534, -42341, -30107, -25350, -19211, -2586, -43561, -34813, -30888, -31567, -20625, 1509, -7578, -13467, -28189, -32908, -50342, -58859, -25949, -20554, -54928, -90322, -67753, -54926, -73501, -72528, -9692, 32116, 11615, -14787, -17138, -4226, -15548, -18774, -57063, -47378, -58517, -57510, -68083, -5715, 11179, -24642, -27071, -44445, -44188]
14297d4188L7111J3554j9028O465K6891N397L1244j2996n438l4295k0890L330
14285a2843K3829o871q732k0976M0886P656k7099j2400K2638j7712l1313k172
14273d5109J5233O212K4792P520l3606l2345J2493j5317J4450O4511L1890P850
14261E8574J4292n7057l2670N823l8905j912J2522j1058J1000j1804k464K7790
14249b5869N2160k0492j7058R933k9973L7115M0646n7354l1089m7245m3207K8125
14237a04308L5335K9975J0486n747k7423m5956j0050P5212O3977K534j8164l0285
14225b4414l036l4682j9235K7142J9302K0008J9549M3590r209l3179j183L428
14213H081K710j5931l3013Q486P615J5130K9683L4038j3784l6482k1503K798j8629
$$ y = [-44188, -7077, 6477, -12551, -6086, 20805, 26202, 57446, 44450, 39012, 4717, -16173, -12843, 10986, 4115, -4617, -25593, 15293, 22949, -4150, -16550, 6088, -11624, -42937, -45109, -29876, -23664, 1128, 8648, -24958, -57303, -44810, -60127, -45677, 18834, 50724, 58574, 72866, 15809, -16861, -11038, -49943, -51855, -39333, -50391, -39391, -51195, -53659, -25869, 26291, 5799, -11259, -1326, -31299, 5816, 46462, -10892, -41981, -89226, -132433, -104308, -68973, -38998, -28512, -34259, -61682, -107638, -117688, -42476, 21501, 24035, 5871, -24414, -27450, -62132, -81367, -54225, -34923, -14915, 4634, 48224, 39015, 5836, 4653, 8081, 10791, -5140, -38153, -29667, -22052, -6922, 22761, 56799, 43015, 6533, -14970, -12172, -30801]
14200c0801k952J3089R164p130L4603J3213o096k5562m1782k4824M1175M4310
14188A6407J8136n1470K8142N912k8304J9825J5962K6149k0677m8695n6365k1680
14176i6658M7342K7659p571o2791k303k5546j0334K1024L7090O5665R5j0860p22
14163a7910L5659m892j4157j8471K291L0052O752L424j8845m7518J4611l66k0748
14150e0118M9897M5579j4463k2568l890j1979o3864k3294O1212K4020J2709K9271
14138C2512K2801l6412n95m1926p7168N519L8785k6304J5979K2765L0959K5848
14126A2763K0244J3246k6584k2217J6573K2173l6746j234M7496Q959Q923m554
14114E9042k9326l4589j760J9268l0870k0934L4115j2300L1332j7775K4731N5819
$$ y = [-30801, -33753, -20664, -11500, -18630, 15973, 29186, 23090, -2472, -44254, -69078, -27903, 16407, 34543, -16927, 11215, 17127, -11177, 8648, 24610, 50759, 30082, -18613, -74978, -96658, -49316, -21657, -29228, -92019, -94322, -119868, -130202, -109178, -72088, -6423, -6328, -17188, -17910, 17749, 12857, -1300, -19771, -17480, 12572, 19324, 22748, 3903, -43615, -29004, -29370, -50118, -221, 45358, 30895, 8327, 4437, -7542, -71406, -94700, -33488, -9468, 3241, 32512, 55313, 18901, 18306, -23620, -100788, -95269, -56484, -82788, -66809, -44044, -13085, 12763, 33007, 46253, 19669, -2548, 14025, 36198, -548, -1782, 45714, 54673, 63596, 59042, 29716, -4873, -6633, 12635, -18235, -39169, -5054, -17354, 13978, -3797, 20934, 76753]
14102G6753K5672K1263q190k0485j8438M4256Q9097K6541j9740o8832q3107k2287
14090D2503K7188k4335J1233r057p636q734O537K230j3001j3721L55K322j701
14077A4183j7585n0626r055M550L0877K2998j5751n4886n374k900L1313N7719
14065E463J4172k6995R132L8918J0292j6999n0254K9190K1707l863m0012L367
14053e882K7500k343p9323j7276J8870K0505J9875K4876j2175k4597p009L9935
14041B956M572N724J71O677k7656j1623j3655Q886J4364j5829J6026J9768L365
14028A3746J4085m982l8435q585j4552k500J9338r296m306K4340m149J102K2513
14015H319j7099M8682J7194n675j1551j7097j6945K2439M1504j7751j0264l5304
$$ y = [76753, 102425, 123688, 115498, 95013, 76575, 120831, 209928, 236469, 216729, 147897, 64790, 42503, 69691, 45356, 56589, 47532, 39896, 31162, 37699, 39929, 26928, 13207, 13562, 15884, 14183, -3402, -54028, -63083, -58533, -27656, -4658, -20409, -75295, -80669, -83569, -52256, 5463, 19635, -7360, 1772, 40690, 50982, 33983, -16271, 12919, 34626, 30763, -9249, -5882, 21618, 19275, -60048, -77324, -58454, -37949, -18074, 6802, -5373, -29970, -36979, 2956, 7528, 13252, 13423, 20100, -7556, -19179, -32834, -23948, -9584, -25413, -9387, 10381, 13746, 27831, 22849, -15586, -24171, -38723, -41223, -21885, -31181, -35487, -11147, -15296, -14194, 8319, -8780, 39902, 57096, 51421, 39870, 22773, 5828, 28267, 69771, 52020, 41756, 6452]
14003F452k4810K298J1034K064o230L0206m703n2760j8504L6995O491K5976O243
13990B0752l8397j3793J2167j5244K2954k2667l5902L390L6748L2359M2389j1615
13978C3141m3947j128J6913k2125J304J809m9768k2611N5490J9346k9827K9658
13966a1745M0046j3861R259n384q822k5280k9376j2396K9959K0442N269J5945
13954A4056j3555R671n381k6190K7580L805k89K5950L9936l3131m7454m4924J4821
13941c5105K2762j812J8756J5212m3313Q251P697m2145k842J9521J5817J8381
13929A180j4758M7691k004l7296l7042K0967J706m9704k6503M0771J4740M87K0326
13916a9439J1209N086M3744k1181m6437r718L0454M8798J8161l8183j3898K889
$$ y = [6452, -18358, -16060, -5026, -2962, -9192, 21014, 16311, -36449, -54953, -17958, -11467, 14509, 20752, -17645, -31438, -19271, -34515, -11561, -34228, -70130, -66740, -29992, 2367, 44756, 33141, -10806, -11934, 4979, -17146, -15842, -14033, -63801, -86412, -30922, -11576, -41403, -11745, 28301, 14440, 23699, 18315, 9493, -15787, -45163, -57559, -27600, -7158, -1889, 14056, 501, 10172, 4791, -21399, 6181, 9986, 9697, 35647, 75583, 42452, -5002, -49926, -35105, -12343, -14155, 4601, 19813, -23500, -15249, -7552, -49697, -52539, -33018, -17201, 1180, -13578, 34113, 32109, -5187, -42229, -21262, -19556, -69260, -95763, -54992, -40252, -39765, -19439, -8230, -3144, 40600, 19419, -27018, -36736, -6282, 42516, 60677, 22494, 8596, 11485]
13904A1485R310O377j2829m4153j1414m973R823K0713M7278J2146l4848L2197
13892D1112R388j7592M050q800m3466j1479J7304M5703j5782j3617l2110M088
13880b1201J8912J9251r039j8335j3726J2533m4609n513j1964Q205L9542j9615
13868d5559O074K5105J6978K6284N282j4254m8361M593K7413l0489R246L5450
13856A7762L6106M463j0268r910j9777j3948K8560q518k3541j7436N241J5766
13844D500K777k5409K4316Q283j5763J9966k194L447K9543j8090r470m3760K867
13831a8987J1628K1128K5171R431o820J0482l499m5397r926l1360N940j5528j1270
13818e9007J4510L3243M2856J9078q001k3972j2405j0233l5209Q312j4951p449
$$ y = [11485, 20795, 27172, 14343, -29810, -41224, -46197, -36374, -15661, 31617, 43763, 8915, 41112, 50500, 32908, 36958, 28158, -15308, -26787, -9483, 36220, 20438, 6821, -25289, -21201, -2289, 16962, 7923, -10412, -24138, -11605, -56214, -61727, -73691, -65486, -25944, -45559, -39485, -14380, 2598, 28882, 34164, 19910, -28451, -23858, 3555, -26934, -17688, 17762, 53868, 58331, 48063, 38153, 18376, 4428, 32988, 24470, 929, -16507, -11266, 4500, 7277, -18132, 6184, 14467, -1296, 18670, 16476, 19923, 49466, 31376, 21906, -21854, -18987, -7359, 13769, 38940, 48371, 41551, 52033, 48534, 3137, -6789, -38149, -32209, -47737, -59007, -44497, -11254, 31602, 50680, 42679, 18707, 6302, -3931, -39140, -30828, -45779, -53228]
13806e3228K7918L8596K6436Q585k7661k8812p181Q331J3106L1757O169L8856
13794H2872K525N453k0320p426k3846j8732k9824l5977J3319m639k2146J0958
13782d7783k8558J4789J9813L0176P0254l644k5044k9342J1403O441j7008o063
13770d566j0190M3432Q241l2232j3322j2933j1321K2584M942K1814j9175k7169
13758b9895m58K6441K3974K3956O003m5569k094K0650N454J7299l157j0053k3248
13745I303J5414O420M799k616q504j9669j9594l2167k7631J5022K2467K1003Q257
13732g496L458K1612N062k1730J9875M2722j2206J3229o647n4349l8801k676L9994
13719B047J3308l4419L33k722M538J6447q992k1073J1580O857J3432L840L7826
$$ y = [-53228, -25310, 13286, 39722, 48307, 20646, -8166, -15347, -7016, 6090, 37847, 44016, 82872, 85397, 90850, 70530, 63104, 39258, 20526, -9298, -45275, -31956, -36595, -58741, -47783, -76341, -61552, -41739, -11563, 58691, 55047, 30003, 661, 12064, 18505, 1497, -4566, -14756, 28676, 36917, 4685, -8637, -21570, -32891, -10307, -5365, 16449, -2726, -29895, -30353, -3912, 20062, 44018, 50021, 4452, 2358, 23008, 28462, 45761, 42604, 32551, 9303, 24717, 31137, 35936, 33320, 24816, 5147, -14447, -46614, -74245, -59223, -36756, -15753, -7496, -4038, 17574, 22636, 906, 20781, 63503, 51297, 64526, 57879, 3530, -35271, -37947, 2047, 15355, -19064, -18731, -21453, -16915, -468, -9460, -30533, -18953, -12096, 1336, 5176, 43002]
13706D3002O454k3385K0486o163j2206n2691m1765l1206P755K6673N7658n835
13694a1223m843l0276J0242J3836n797K6106r969J4795L3416L409m6757l4349
13682d1410k3172J530L6129J3166j2715k8819q262L2442K4158k4506l6142r695
13670g7296J0207K7573O7607L379k6046n4489L368O534K5295J7855J2866n1066
13658c4213l6322M2352L3942M862l8273L5701K3924o67k8846j7103K1771j6105
13646h977j9623j8895K3748j513M752M5977J6418n1042p667l777J1415k254j4722
13633b6160k376J5970p681m2685R764m330J0777N1466m5881k4021R753R577J6468
13620b9359p878j0581N7156l8450R914J1490p383o090M992J4529J2206O427k7991
$$ y = [43002, 49456, 26071, 46557, 40394, 28188, -24503, -66268, -97474, -89719, -63046, -5388, -11223, -16066, -46342, -36100, -22264, -28061, -1955, -11924, 2871, 36287, 39696, -7061, -41410, -64582, -63052, -26923, -13757, -26472, -55291, -63553, -31111, -6953, -31459, -67601, -77296, -67089, -39516, 28091, 31470, 5424, -49065, -45697, -39163, -13868, 3987, 16853, -34213, -70535, -28183, 5759, 10621, -27652, 8049, 31973, 31306, 2460, -14643, 7128, -8977, -28600, -47495, -23747, -25260, -20508, 25469, 41887, -9155, -16822, -20599, -9184, -11438, -26160, -28536, -12566, -20247, -62932, -53168, -57498, -46721, 4745, -41136, -65157, -55404, -45827, -29359, -37237, -47818, 9338, -29112, -19198, -7708, -15091, -21181, -16189, -1660, 10546, 16973, -11018]
13607a1018J4227J5013J3357P549j4452k067O694R909J1720n286J6564k8999k6791
13594F420R640j3715M152J1949J9969J3708k7504l9190Q675j7189J4483L3921
13582B5319k4232J9864r208j3837L3816J1221k6257m0173R754l699m4909K1429
13570d0912J0304L399j2884l1721p649K0585K2924J956L8180L1778K0359n876
13558E0443o7551r927M7027J5899n1898l3214J2869k2303k0171L9087J0732K2607
13546f400J9913M918M1492j5879k7084K0131m163j7025J2655N6544l7874j9976
13534B7252n166n072l106j4520j5058O0108J8306k9670J3332O45k6206J1871K9225
13521F1941o684l7481j5512k023k4010j5248O390j059J6364p872K815K5215J5711
$$ y = [-11018, 3209, 18222, 31579, 39128, 24676, 22609, 29303, 39212, 50932, 45646, 62210, 33211, 6420, 16060, 2345, 6497, 18446, 38415, 52123, 24619, -14571, -5896, -23085, -8602, 25319, 1087, 20951, 11743, -2094, 31722, 42943, 16686, -23487, -13733, -17432, -62341, -40912, -30608, -27209, -40093, -71814, -79463, -58878, -35954, -33998, 4182, 35960, 56319, 50443, -17108, -27035, 19992, 35891, -16007, -49221, -36352, -58655, -78826, -39739, -29007, -6400, 13513, 18431, 59923, 44044, 16960, 37091, 32928, 15903, 28558, 85102, 47228, 27252, 22086, 17014, 13908, -612, -15670, 44438, 62744, 33074, 46406, 47051, 20845, 32716, 61941, 55257, 17776, 2264, 241, -23769, -39017, -32627, -33686, -17322, -25194, -22379, 2836, 18547]
13508A8547J3957K7254k6362p6866k1261k10K4683O59J0581L7676L6893K3845
13496F9396p754m9749k6717K2047j903n1858j8862p986Q902K5256j5761l424R662
13483d8751M5142J2128k1073k2572l42K818K4377P080K1194l3186k1275M6807
13471A2347J6346l5137L018K611o970J3106l2587l0758M1030M9649j748r835k1045
13458B7O509J7453l0120j3905L1572J6547j7850m0596l022K9765K2454K172J4956
13445C5962k3855k4922J2594j9801J2924K8939J3191K4786L376k072l180j2237
13433D5705r434l5942l3924n759k1175R839M182J024p928m4416r692Q619l6320
13420a35221M0462N8206N007M396J1825p09J2749R485K1499M696l597j7999j2619
$$ y = [18547, 32504, 59758, 33396, -43470, -64731, -64941, -40258, -39599, -29018, 8658, 45551, 69396, 61642, 11893, -14824, 7223, 5320, -46538, -65400, -73386, -64484, -39228, -54989, -58413, -48751, -3609, 8519, -12554, -35126, -35468, -32650, -8273, -1193, 20001, -13185, -34460, 12347, 28693, -6444, -3426, -815, -7785, 5321, -27266, -58024, -16994, 32655, 30907, 21072, 27, 6536, 23989, -6131, -20036, 11536, 28083, 10233, -30363, -33385, -3620, 18834, 21006, 35962, 12107, -12815, -221, -20022, -7098, 21841, 35032, 59818, 63194, 61122, 57942, 45705, 36271, 329, -33595, -39354, -60529, -50690, -46508, -45484, -53412, -97828, -107520, -98901, -135221, -94759, -36553, -31546, -27150, -15325, -16034, -3285, 6200, 27699, 32395, 28798, 10799, -1820]
13407a820O438o1321k6024J1426K6041n226K8801Q648K4178j73l2753k8375J596
13394d8564p872n945j0130J7940L5954J1283M537j884k1450J2181L9820j671j2205
13381A1994k6665k974N690K055L0145M4746l4592P647K8918k4079k425Q027K157
13368E0644k4261k2501j4669k8862J6354M3880l3253o5606j118O0350L6856k7588
13356i774J3795J8678r331o946Q302N850m303p367k82J4151K3118n259n6465p452
13342b3285k0164l2202J119j5759J0261M1955M1625K0248J1399k0098k4437m255
13330a3593l2676j554j4204L2218M2776l2106K0394j543l976m8479k7916K7706
13318e2953J5638R222L8565K3639k6064p631k6887k8281j802J8441j5671L553
$$ y = [-1820, 4618, -56703, -82727, -71301, -45260, -50486, -21685, -13037, 11141, 10968, -21785, -50160, -48564, -56436, -62381, -72511, -54571, -18617, -7334, -2797, -4681, -26131, -13950, 25870, 24199, 11994, -14671, -17645, -11955, -9900, 20245, 64991, 30399, 38046, 66964, 42885, 40460, 48487, 50644, 26383, 3882, -10787, -39649, -23295, 20585, -12668, -78274, -79392, -19042, 17814, -9774, 4021, 22699, 13368, 6422, 14724, 20574, 16271, 8904, 8622, 22773, 45891, 40632, -15833, -23285, -43449, -75651, -74532, -90291, -80030, -38075, 3550, 23798, 35197, 15099, -9338, -13593, -46269, -47823, -62027, -29809, 12967, -19139, 1255, -288, -4264, -52743, -80659, -52953, -37315, -28093, 10472, 34111, 8047, 416, -26471, -54752, -56554, -38113, -53784, -50231]
13306e0231J6247L2130P415n809j8146L9033j7637k4696N1085j6979l708m2663
13294c3959m4823j281M3892k0016L4123K0295l3205k9170P959q989M1307K6990
13282C123J8880m7465j3931K8563J4496l69L9552k9403l7313k9782j6148P1233
13270A436P970m1684J4116l236O173N937Q034Q61k6140K8219N2678J9580k6027
13257D7917j8248q791r716M356j31N065K8318J3660o111l1814L4432K3361l8907
13244D3391K200k4755l1976l9829K5903J5103j319j9743n569R598N905n633l4791
13231f1515k467L1521K6420k5362k0711j6278L201J6154J2107R364K4519J0350
13219G303L0426J5576j5035L6778r211l2675R764m577J7538J3663o607j4190M702
$$ y = [-50231, -33984, -1854, 5561, -248, -18394, 20639, 3002, -21694, 29391, 12412, 8704, -33959, -78782, -80063, -36171, -56187, -22064, -1769, -34974, -64144, -56185, -65174, -23867, 3123, 22003, -25462, -39393, -10830, 3666, 3297, 42849, 13446, -23867, -53649, -69797, 1436, 9406, -32278, -18162, -21398, -15225, -9288, -1254, -393, -26533, 1686, 54364, 73944, 47917, 29669, 20878, 11162, 15518, 15387, 20452, 48770, 62430, 56319, 24505, 58937, 82298, 43391, 45591, 20836, -11140, -50969, -25066, -9963, -11282, -31025, -36594, -26996, -21091, -26724, -61515, -63982, -32461, -6041, -31403, -52114, -68392, -65191, -49037, -36930, -27566, -3047, 7303, 37729, 53305, 38270, 75048, 65837, 33162, 42926, 38349, 55887, 69550, 62943, 48753, 53455]
13206E3455J8982O176m7679m9628Q404M5229R621l0939l9183r792j4212M6828
13194b738N8401L1980J760N945L598k3489P391j3511n2229k7215L0795K9025k8331
13181B1382l896r368j1967k9901L326j2700J7989J0149K0180m751n753N9193l930
13168D9953n191O96J0181j1867j2067j0516K7170j7775m2378r493K1883L8471
13156C9067J3160J928J7206j3844Q274L8581l962j8428k7767m3637j713r853P227
13143F239K4193J5596J3267r289m490J6755J7239j2245r271l5844M982J3691k6727
13130A4096l1388K8405L4764j9724l4010o70j9042k5229M922M2478L1160Q514
13118C4276j6138o230R642j2975k1348K0817k642k2731J919J6509l4571l8527
$$ y = [53455, 72437, 78613, 30934, -18694, -10290, 34939, 44560, 13621, -25562, -35354, -49566, -2738, 55663, 87643, 89403, 95348, 98946, 75457, 82848, 69337, 17108, -10107, 20688, 49713, 21382, 17486, 8118, -3849, -33750, -30424, -43124, -25135, -14986, 5194, 443, -5310, 53883, 49953, 44762, 45458, 55639, 43772, 31705, 21189, 48359, 30584, -11794, -21287, 596, 39067, 52227, 54155, 71361, 57517, 65791, 104372, 100410, 81982, 54215, 10578, 8865, -988, 6239, 30432, 46028, 59295, 50006, 45516, 62271, 79510, 67265, 57994, 22150, 27132, 40823, 14096, -17292, 11113, 45877, 26153, -7857, -8527, -27569, -52798, -47876, -5398, 25762, 34276, 18138, 11908, 21550, 8575, -12773, 8044, 5402, -17329, -15410, 1099, -33472, -71999]
13106g1999m834L3357o354J446L5229N122K5371P411K36l212j3754m5741j1205
13093d8927l4046L466J820N1177N8283j3598J319k9433n39M1087l9412m9481k9478
13080h7762J3031M0357m0906r868N197M5759J7064K1828q074J155N537l5246j5748
13067d7676L9462k742m1811o647k8901k1915K6069J3677O3780K5155k7622J3255
13055D084l6549J0446J2536k3157R972k3209k7043P871M3511N7413k1188m5119
13043c0432J0642J7245J0814J6889q434l078m58l1391J1527j82r10O64p966j8751
13029c3821p34L9588m6637k9225M410K8440L4076j6476j9628J616l4868O036K7125
13016d0098n17J643K9430J1959j0078m0076l347P341M7273K6932k9572J4985J7857
$$ y = [-71999, -76833, -43476, -49830, -48384, -13155, -8033, 17338, 24749, 24985, 21773, 8019, -37722, -48927, -82973, -79507, -77687, -26510, 31773, 18175, 19494, -9939, -10478, 30609, -8803, -58284, -87762, -74731, -34374, -75280, -85148, -79951, -34192, -17128, 4700, -3374, -2219, 3318, -31928, -47676, -8214, -10956, -52767, -59414, -88315, -110230, -84161, -70484, -6704, 18451, -9171, 4084, -32465, -22019, -9483, -32640, -22668, -45877, -72920, -65049, -21538, 35875, 14687, -30432, -19790, -2545, 8269, 25158, 16724, 13646, 13188, -18203, -6676, -6858, -7768, -7104, -15070, -33821, -34555, 5033, -41604, -70829, -66419, -37979, -3903, -20379, -40007, -38391, -73259, -67223, -40098, -40615, -38972, -9542, 2417, -7661, -47737, -51084, -43743, 3530, 30462, 890, 15875, 33732]
13003C3732O214l4193n369k3800L5725K3472j8015p922l0002P621P061r457k2717
12990c7650J2865L7491K5568q43m5893j4286K9248O2844N925k5069l7606l147
12978I447J8100j1811j3575n609j2152R699n3214k021O5055J5019p523J8734k3782
12965F367m2330n3425K300L7950p614m852M3094K8823j0389J560k9414M785L3820
12952A0675L202k09k3067j4111M56M931J5760k7727q024J4174J7225j1537j2855
12939c1107J9234j3590K2617K2235j9706N215l1911l0198J2473R421p018J2491
12927b9844J8181J4181K1043L6625j2460k7076j1011j7075J3955K8831k1115l674
12915A0561m899n6871k3569R417k6787j4440L0271J4923J2660J1255l245k443
$$ y = [33732, 39946, 5753, 384, -23416, 12309, 35781, 17766, 9844, -20158, -12537, -5476, -14933, -37650, -24785, 12706, 38274, 37431, -8462, -22748, 6500, 69344, 75269, 50200, 12594, 9447, 27547, 15736, 2161, -3448, -15600, -5901, -59115, -61136, 3919, 18938, 11415, 30149, 6367, -35963, -89388, -87088, -49138, -56752, -61604, -18510, 10313, -76, 1484, -27930, -23145, 10675, 13877, 13668, -9399, -23510, -23054, -18123, -2363, -30090, -38114, -23940, -6715, -18252, -31107, -11873, -25463, -2846, 19389, -317, 4898, -27013, -57211, -44738, -35317, -42335, -29844, -11663, 2518, 23561, 60186, 47726, 20650, 9639, -7436, 6519, 35350, 14235, 10561, 5662, -51209, -74778, -65361, -92148, -106588, -76317, -61394, -48734, -37479, -40724, -43167]
12903d3167K4714K9655M862M4219k8242j1476J0307l3042Q743N693o232P977M861
12890A8872k4822j0491l8876N792L9244M4653J7906j641J1365J121k0232q4k3060
12877A9747n514L164L320K7046n6447n292N14J8400k904j2984k6362j1532j6557
12864f5401L719L3973K5542o038k674J2297l4339j5535N0097k245R176n039q881
12851e348J7935L0947k3496k5276J632j1L1555M559l3099l5301K3722k7615j2508
12838e2304K2480K9811L7803M9982J6748l9232n371J1690j0967N418K4853j182
12826H9729n9778l6723P011j6066l8289l7437K7206L4620K1042n556j0934k5020
12814e0195N807K3741Q06k3454k4805K075L9486M9444k7125l3429k2098K298J6461
$$ y = [-43167, -18453, 11202, 16064, 60283, 32041, 20565, 30872, -2170, 6573, 12266, 6034, 14011, 18872, -5950, -16441, -55317, -49525, -10281, 34372, 52278, 50637, 62002, 63123, 42891, 42807, 19747, 14233, 17397, 20717, 47763, -8684, -13976, -13462, 4938, 2034, -10950, -37312, -48844, -65401, -61682, -27709, -2167, -8205, -10879, 1418, -32921, -48456, 1641, -604, 8572, 3533, -5348, 12587, 43534, 20038, -5238, -3606, -3617, 27938, 32497, -602, -35903, -12181, -39796, -52304, -29824, -13, 37790, 87772, 104520, 65288, 59917, 71607, 60640, 66058, 90911, 89729, 29951, -6772, 239, -15827, -54116, -91553, -64347, -29727, -8685, -14241, -25175, -50195, -44388, -20647, -19841, -43295, -68100, -66025, -26539, 22905, -4220, -37649, -59747, -57449, -40988]
12801d0988M174j3848J5785k732j1733j4129K4368k4561Q317L522J5977O533J2815
12788a6500K4389J1791m3984j9887L6632Q101m4958K147P324K0306p345P835N21
12775a3628j5697L3800L3663N7887J2170o6732j5825r333J1284J0857R636j9114
12763B8968O159j5689j5446L479Q782k3236j211k0924j3111K2491J7355L5742
12751C3359m040k2723K23k432o4336l9266M5172O0583J7424q005l3931J2204r80
12738f748k6603j3089J8146j4823k0731R342J8166n788k7164K476L9373L6801
12726I358K0186l7422n289j4542k4571L7216R942k939j1646r470R854M8044J8809
12713D7530m6751m7943j7446J0866Q6215O4228j3387k8592r117J2609l0924l9028
$$ y = [-40988, -36814, -50662, -34877, -37609, -49342, -63471, -39103, -63664, -55347, -51825, -35848, -29315, -16500, 7889, 19680, -24304, -44191, -7559, 542, -44416, -42269, -34945, -14639, -21984, -14149, -13628, -29325, 4475, 38138, 96025, 108195, 41463, 25638, 16305, 27589, 38446, 48082, 28968, 35127, 19438, 3992, 7471, 16253, -6983, -8194, -29118, -42229, -19738, -2383, 33359, 29319, 6596, 6819, 4387, -59949, -99215, -54043, 6540, 23964, 15959, -17972, -5768, -6748, -33351, -46440, -28294, -43117, -63848, -54506, -36340, -42128, -69292, -66816, -27443, 9358, 29544, -7878, -13167, -27709, -52280, -15064, -5122, -8061, -19707, -29177, -19323, 28721, 47530, 779, -47164, -64610, -53744, 32471, 96699, 83312, 54720, 45603, 58212, 27288, -11740]
12701a1740R736N8268o839j6749J099K1058q839l4317K0163J3608J7367j8223
12689D4592k9852k0104k7330m391N882n158Q890J3306J4277m0317M000j9036j9426
12676g4667K2610J5596L2711M0626m2702k5569L272Q526L2858J9819l1547K480
12664D013L0852J4165k2254k1407J2735n9630k5378N4487J1570m1319L6179J7558
12652A1571m3479k1995j040L8351M6268j1074k7022l4817P72j7782J7125J6002
12640b7120k2464q647R611r73j1391O721J676k4940L5494K1750J7215k0787j2981
12627c6836l3662l1858K5889K3579L2889M0893l523n746p329k2567J5418l744
12615f597j4987K3032j513P066M8406P722l9332K3745j5715l5005k284R406k856
$$ y = [-11740, -2004, 56264, 49425, 32676, 33775, 54833, 45994, 11677, 31840, 45448, 62815, 44592, 14740, -5364, -32694, -37085, -31203, -36361, -27471, -14165, 112, -40205, -36205, -55241, -74667, -52057, -36461, -3750, 36876, -5826, -31395, -28123, -19597, 13261, 33080, 1533, 4013, 34865, 49030, 26776, 5369, 18104, -41526, -66904, -12417, -847, -42166, -5987, 11571, -31908, -53903, -54943, -16592, 29676, 18602, -8420, -43237, -42465, -60247, -43122, -27120, -49584, -58231, -48620, -49593, -60984, -54263, -52587, -77527, -42033, -20283, -3068, -23855, -36836, -70498, -102356, -76467, -52888, -19999, 20894, 17371, 11625, 4296, -18271, -2853, -6597, -21584, 1448, -65, 7001, 55407, 63129, 23797, 47542, 31827, -3178, -5462, 3944, 1088]
12602A088K0720J3427J2737J2996j5498L75k4570l6079k4440L382J4202M9826
12590B8166K6303O321j9078k781K8167L6465m2284j1129l4307j7965K5998k175
12578B1701J1436k2885q135L2013J7364k815l787k8304j9752o2369J9754L7410
12566h369J5613o416n106k0610j8086k5081j2835Q730k177J9720N5396M8449k3565
12553B5663l3697R183j0639l4287m3673m359L2307L5481L7058j3881J9579j6430
12541B305J9234K4109L9658o861k342Q150k3964l0288l884l6203l9473j8872J2429
12528e6002M6044L2122J6129N417j4180J9567j5238l3247P004k1753K3598J9293
12516B8754j7067m183P961k1459m789j9449p267j2737p906N4079P0090M922J718
$$ y = [1088, 21808, 35235, 47972, 60968, 45470, 45845, 21275, -14804, -39244, -35862, -21660, 28166, 54469, 60790, 41712, 38931, 67098, 103563, 61279, 50150, 15843, -2122, 23876, 21701, 33137, 10252, 2117, 34130, 51494, 48679, 44892, 16588, -3164, -65533, -45779, -8369, 7244, 828, -4278, -24888, -42974, -68055, -80890, -72160, -74337, -54617, 779, 49228, 25663, -8034, 1149, -9490, -43777, -87450, -91809, -59502, -24021, 13037, -844, 18735, 2305, 21539, 45648, 85306, 78445, 76103, 84253, 60289, 30001, 26117, -10086, -49559, -68431, -56002, -9958, 22164, 38293, 43710, 29530, 49097, 33859, 612, 7616, -14137, 9461, 28754, 11687, 7504, 15465, -5994, -10783, -30232, -37499, -50236, -58142, -4063, 66027, 70949, 72667]
12503G2667k9744R403j1694q1509L6844M7172J5464J532p871l932j8716l900j921
12490B3795l8570j8050L4569j3477L1101J9860M382L8601l7337n9415Q296j243
12478g488k585l142m313r211J3174j5407l538Q211r519m249q8K4265m0850m2165
12464i6905L6989J0976L8279j6993o765j2719K771K908J8670N4529J0377n968
12452C6149M8669k453l0644J2541j2761j6337K2169k4209l7423J185K5971J9024
12440D1881m2023j1353p994M9555J5739K488j4309o958k7642j1734k098l7917
12428e2365n823L3619J845j7661J9387k4100j2461M880n258M3077K3495J0214
12416A8849N8101j4878k5893O837q089Q424N7677j5131n2887q11J0736l3067j4047
$$ y = [72667, 42923, 52326, 40632, -40877, -4033, 43139, 58603, 60135, 52264, 48332, 29616, 25716, 23795, -14775, -32825, 1744, -11733, 19368, 39228, 43610, 82211, 44874, -14541, -6245, -7488, -10073, -13215, -17528, -26739, -13565, -28972, -32510, -24299, -33818, -38067, -38155, -13890, -54740, -96905, -59916, -48940, -10661, -27654, -34419, -47138, -44367, -41459, -22789, 31740, 42117, 36149, 84818, 82365, 51721, 64262, 51501, 35164, 57333, 33124, -4299, -3114, 22857, 41881, -142, -11495, -19489, 30066, 45805, 48293, 33984, 27026, -616, -12350, -14448, -52365, -58188, -24569, -22724, -40385, -20998, -45098, -57559, -52679, -57937, -14860, 8635, 18849, 76950, 62072, 36179, 43016, 34927, 43351, 101028, 85897, 33010, 32199, 42935, 9868, -4179]
12403d179M593J1981r880K969K0768n599j0665j188K628k984n3717L4312j1590
12390b2551j8861J3774J2253L2413L3502l6741M219k6602N5641j709o6384k1822
12378d2868K2999L1622K2567j9984j90M0829k794n8240m0556l56K9647n017j622
12365b3963j199J8098J0191K6993k4353k0194l540K2316L1101j1926j3766R448
12353A9206M9364k4781k3588j0739N252J0877o729K351J1514J6655l6398J2312
12341B5296Q561k1410k2879k6689R817J6299Q81Q8786J8279n1352k8037N991k560
12328B0983J2500M96n5018l977M756j0923J6418k374j6706k8703J7599j882J1180
12315c5651J891n795j6207L5656L3252M8878j7094j9844k0691n273R433K2028
$$ y = [-4179, 414, 12395, 2515, 5484, 26252, 20653, 9988, 8800, 11428, 8444, -45273, -10961, -22551, -41412, -27638, -15385, 17028, 50530, 13789, 18008, -8594, 47047, 45338, -21046, -42868, -19869, 11753, 34320, 14336, 14146, 54975, 52181, -6059, -46615, -46971, -17324, -22341, -23963, -25162, -7064, 3127, 30120, 5767, -14427, -17967, 4349, 35450, 23524, 9758, 19206, 68570, 43789, 20201, 9462, 14714, 25591, 18862, 21213, 32727, 49382, 12984, 25296, 33857, 12447, -10432, -37121, -27304, -11005, -10124, 78662, 96941, 45589, 17552, 23543, 20983, 33483, 33979, -21039, -25016, -20260, -31183, -14765, -17139, -33845, -62548, -44949, -46831, -35651, -33760, -39555, -55762, -20106, 13146, 62024, 44930, 25086, 4395, -878, 8555, 30583]
12303C0583k6354m3045j5979J3628L4905M038K6207M0453R087k564j4972Q438
12291F4425k6320l3829l3983q363k0842J842N372m2569j5445K9951L8091J7251
12279b4419J421l6462q7L0190j952j1260j3255K3972M0201N095j0216j5039o559
12266a8370j6692M4310J2808l4426k6900J4203j5108K6104J8193l387k1105L049
12254a7321N4486L6498l2763p0961L9395P8774Q355j3286j2230m0574j3957p343
12242I073k5569J5460J6773K5901k1212l4538j5556j3056l178j3162j6523K7053
12230d8534R147l5047J1054L1828j0558j7036o2419K1674L2354J8902O177j9854
12218f2312L9303p831J4649K0231n762n550L146j3843N9806n808K7981J1235k5401
$$ y = [30583, 4229, -38816, -54795, -41167, -6262, -2224, 23983, 64436, 73523, 70959, 55987, 64425, 38105, 4276, -29707, -38070, -58912, -57070, -51698, -94267, -109712, -79761, -41670, -24419, -22998, -59460, -59547, -29357, -31309, -42569, -55824, -31852, 8349, 13444, 3228, -11811, -18370, -35062, 9248, 22056, -12370, -39270, -25067, -40175, -14071, 4122, 735, -20370, -17321, 37165, 73663, 40900, -30061, 9334, 88108, 96463, 83177, 70947, 30373, 16416, 9073, -16496, -1036, 15737, 41638, 20426, -14112, -29668, -42724, -45902, -59064, -75587, -48534, -39387, -74434, -63380, -31552, -42110, -59146, -121565, -99891, -67537, -48635, -42458, -62312, -23009, -30840, -16191, 4040, -1722, -7272, -4126, -17969, 41837, 36029, 64010, 75245, 49844]
12205D9844p2540j2892r859j2955K9065M0911K2612m280J3712q870j2804o743
12193A5201q380l596K9082J3278l936P980P817j9106j7195m2895K0318K4795m4418
12180b1055n7892L031L7805K099M8015o624m0614L35J4949L5026l766j2469j622
12167b782l6927m241J727K3621O295L251L2894n0456j6206L7513O271J2389M57
12154A3806J6560j3080k6393N434j9747R011j9565m9965J0930M0263P549K6308
12142A111r651J2645L0408q436k4126K7896J154k5081l1917r512L7857k4994J5801
12129f845K6969N978L526K888K058j9179l7570l9630k9375N817N8574M0652N69
12116A4432K2690k859j7785M2427J842o9990l5977k9575P354l209M0380N6242
$$ y = [49844, -22696, -35588, -45447, -58402, -29337, 11574, 34186, 29906, 43618, 34748, 21944, 15201, 6821, 3225, 32307, 45585, 41649, 49629, 57446, 38340, 21145, -21750, -1432, 23363, -21055, -78947, -75916, -38111, -36012, 12003, 5379, -35235, -34900, -19951, 15075, 11309, -1160, -2782, -39709, -43950, -42223, -18602, -12307, -9056, 23838, -26618, -42824, -5311, 960, 13349, 13806, 30366, 17286, -9107, -3673, -23420, -14409, -33974, -83939, -73009, -32746, -25197, 1111, -8540, 4105, 34513, 26077, 1951, 29847, 31001, 5920, -25997, -35509, 2348, -22646, -6845, 20124, 26102, 29628, 32516, 34574, 15395, -22175, -61805, -91180, -85363, -26789, 13863, 14432, 37122, 34263, 16478, 58905, 60747, -9243, -45220, -74795, -67441, -70650, -30270, 25972]
12104B5972J6075n3040j7905J3275N758N1054K6346m240m7755J7136N7151m51
12092H9376m5819m3937j5637L06j466k6122J5788j7135J5335O1798K8831o852
12080E4466j9197J295L5289l1852n6178k8246k245J3798j2138O884K5071j7515
12068c0568l5990j1239O3868o980R579k222q873n871l223q454N582J0296L3321
12055I226L7975q308l877j4835k6289M698K0434k0169j2459k280r884q618K550
12042c1836L3275j537K6968K4243l0519m6418p713L1678K3847q268K7180j5694
12030B5206m2787J6808L8511J720l5468j5923K9918p390j727J2475l9312J2254
12018e715L1638J2755R142P79m6345j5667K3154j3908j1061l0377j0015K8467
$$ y = [25972, 42047, -10993, -28898, -15623, -9865, 41189, 67535, 63295, 15540, 32676, 89827, 89376, 43557, -380, -16017, -15711, -17177, -43299, -27511, -44646, -29311, 32487, 61318, 54466, 35269, 36564, 71853, 40001, -16177, -44423, -46668, -32870, -45008, -38124, -13053, -30568, -66558, -77797, -13929, -20909, -11330, -13552, -22425, -28296, -31519, -39973, -34391, -24095, 9226, 47201, 38893, 35016, 20181, -6108, -1410, 19024, -1145, -13604, -15884, -25768, -34386, -31836, 1439, -98, 26870, 51113, 20594, -25824, -33537, -1859, 21988, 13720, 40900, 25206, -17581, -773, 37738, 39458, 3990, -11933, 17985, 10595, 8868, 21343, -17969, -5715, 25923, 38678, 47820, 48599, 2254, -13413, 9741, -4167, -15228, -45605, -55620, -27153]
12006b7153n9111j3089L4477N0883K4987j2470J5270K1905K616J7442J6375j7904
11994E4228l2029p585n4672L1928O1510j1185q225k511J0616M5041k9246k3384
11982C4486m9156N463L1362m6115m4557K7683K7092O253O1946P574J4086K3385
11970I9502k897k6631k1511J5557r719k8376j6555k3632j8204M1909K3887j1839
11958B1491j6802k0333j9244j8068J9237k1249K0557K4387j357o813k1482O254
11946c3422n68J5598K8213l5124l4660M1916L8964O262O740M41j3086j228k8432
11933h386q666j7249l129L7332N1108J1873n5166n2000N2311r290N937L8360k390
11920D0645j2879m1368N951j6860m98k3869M5300O7391K9322k0996p2923k9836
$$ y = [-27153, -86264, -99353, -64876, -13993, 10994, -1476, 13794, 35699, 38315, 55757, 72132, 54228, 22199, 14614, -40058, -8130, 53380, 42195, 33970, 31459, 42075, 87116, 57870, 34486, -14670, -9207, 22155, -23960, -68517, -40834, -13742, -7489, 54457, 62031, 76117, 99502, 96605, 69974, 48463, 64020, 54301, 25925, 9370, -14262, -32466, 9443, 33330, 21491, 4689, -15644, -34888, -52956, -33719, -54968, -34411, -10024, -11381, -18194, -39676, -33422, -33990, -18392, 9821, -25303, -59963, -18047, 20917, 27179, 33919, 34360, 21274, 20046, -8386, -17052, -34301, -37430, -98, 51010, 62883, 7717, -44283, 8028, -1262, 4675, 43035, 40645, 27766, -13602, -7651, -24511, -25009, -48878, -3578, 63813, 93135, 72139, -784, -30620]
11908c0620P296L9863L6920l9245n0164N389M1132P022Q356J3981Q44o954K347
11895C6167n1933m9492j7427O7774N7473J7820P602k6554L7066j1871n183j3332
11883D8110l6871J1477K1398k4624o735k060L7984L247J1249j8778m4241L4948
11871C5104j284m8147p650M0367P1399M375o5815o567o832k4534l5823j4541M2153
11858a7795J2404l3661j4614M2522L3617K2895m432j8735n950N053k059M164k4079
11845f70m0712J5588O272M409j744J5974K455k5515P59J2188r814k8680J1162
11832c8328P897N2655k4759l6951N6000K9793k6274J9414j2184q483R980J6334
11820D5094j5685j2482j171K9145k4344p904m5467M1992L3347l7328m2737R378
$$ y = [-30620, -23324, 16539, 53459, 14214, -35950, -30561, 10571, 17593, 25949, 39930, 40774, 33820, 36167, -15766, -65258, -82685, -14911, 42562, 60382, 67984, 41430, 78496, 66625, 61442, 48110, 11239, 22716, 44114, 19490, 12755, 10695, 48679, 51926, 63175, 44397, 156, 35104, 33820, -14327, -21977, 18390, 89789, 94164, 28349, 21782, 14950, -9584, -45407, -59948, -17795, -5391, -39052, -53666, -11144, 22473, 45368, 40936, 22201, 16251, 21304, 19245, 23409, -670, -41382, -25794, -19522, -15113, -16857, -883, 1572, -23943, -23184, -10996, -20810, -49490, -38328, -30431, 22224, -2535, -39486, 16514, 46307, 20033, 39447, 27263, 18780, 28760, 45094, 29409, 16927, 15756, 44901, 20557, 12653, -32814, 9178, 42525, 5197, -37540, -28162]
11808b8162p964R72o212J6025n152J6343j1929K9406K9457l63j4068K225M308
11795B4886o190l2754l1322L8021Q4676p673j8998l7519j0325R494k4672R242
11783c134J6997K094j8803J7464J0995j2997j6167M305j8395j1577J3841k8391
11771d3768k8576J7143L7481J2061l1692l4495J6366N7292P6983J7802m0390n6582
11759c75k3838J0514K0249J67O353K1102j2610q552K3613J4171J582k0560k2280
11746I536Q93L4858k5561N780k0677l147K9803N524N398P310L0804m5363j0150
11733B5008k0441K9771r810q1509k5399M0358K3108O2656J6039K832r067n844
11721D7702K3994k6465j4720K409j3353q842j7198K7142Q292k6753Q891J1720
$$ y = [-28162, -36126, -35154, -41366, -25341, -30493, -14150, -26079, 3327, 32784, 32421, 18353, 20578, 24886, 18696, -14058, -45380, -7359, 77317, 69644, 50646, 13127, 2802, 12296, -12376, -3134, 13863, 15957, -2846, 14618, 25613, 12616, -3551, 754, -17641, -29218, -15377, -43768, -72344, -55201, -17720, -5659, -37351, -71846, -55480, 1812, 78795, 96597, 56207, -375, -24213, -13699, 6550, 6717, 13070, 34172, 21562, 13010, 36623, 50794, 52376, 31816, 9536, 10429, 45287, 19726, 25506, 4829, 1682, 31485, 37009, 42407, 49717, 80521, 35158, 25008, 4567, 34338, 24528, -56981, -82380, -42022, -18914, 43742, 59781, 62613, 53546, 47702, 71696, 45231, 30511, 32920, 19567, 10725, -6473, 20669, 28961, 2208, 11099, 22819]
11709B2819J9418J9356R44M2969N171m5559k6010Q994J4773n1823k1458q045N0027
11696C1576M2184j8805k4650l8300j0868J4363n846n772K9670J723J858J860j0830
11683H163R15j7021J5327q216l407n92j6020J0667J9098m541J6883m5811J3193
11670a1362N9492N413N464m5942K2741l908j6641K6383j8978l064K9946l2862
11658A6682k8815j2050K9548M9189R459l3363j3612K0425o62l7837N87J7086M034
11645B0671L0246k924o5804k0856M9317L4178J7274l1513q954O962l2725l4258
11633c8386J698N3642L3545K7806k3822o9039j5332M0153K5592J1216m5706L3212
11621C4579L9378m9081k0279m4909k5005J8208L7720j2201l7540J9235J8857O317
$$ y = [22819, 42237, 61593, 62537, 105506, 110677, 65118, 39108, 48102, 62875, 11052, -10406, -18451, 31576, 73760, 54955, 30305, -7995, -18863, -4500, -10346, -16118, 13552, 15275, 17133, 18993, 8163, 9078, -7943, 7384, -832, -4239, -4831, -20851, -10184, 8914, 4373, 21256, -24555, -11362, 48130, 53543, 59007, 13065, 35806, 31898, 15257, 41640, 22662, 19598, 49544, 16682, -12133, -24183, 5365, 54554, 64013, 30650, 17038, 37463, 36801, -1036, -449, 16637, 20671, 50917, 47993, -17811, -38667, 10650, 44828, 62102, 30589, 21635, 28597, -4128, -38386, -36688, 16954, 50499, 78305, 54483, -14556, -29888, 10265, 35857, 47073, 1367, 34579, 73957, 24876, 4597, -40312, -65317, -47109, -9389, -21590, -59130, -39895, -21038, -14721]
11609a4721K3447P316M2321R391J0556j2945l7302J1516L2813L518P472j3836
11597F9546n1772j2757L8184L412k186l8859O964L5004J8828J6196K1940l5391
11585F9109l5160M693K5898J5176J4878K4000M489j0726k6784j825J5740J3088
11573A12576l0910k6642k2350L8663P3496K8336N0096L8658L7889M8131P9511
11562D27454R8553J39756K41528K86945L74643L85617P3575k73059m08684l45316
11552A001012k30720j84570j69237o8626p9087k6830o051j2036j1085j0839l1741
11541A70190l3370p559P486k1813k7768K2237J2733m707K2041j0611k7192k522
11529I9145j0995n889N5081J4651k9043L2002J5762l1650j8833j7209q774J6109
$$ y = [-14721, 8726, 16042, 58363, 67754, 78310, 65365, 28063, 39579, 72392, 75910, 83382, 69546, 17774, 5017, 43201, 46613, 44427, 5568, 12532, 47536, 66364, 82560, 104500, 69109, 33949, 38642, 64540, 79716, 94594, 118594, 123083, 112357, 85573, 83748, 99488, 112576, 81666, 55024, 32674, 71337, 144833, 173169, 223265, 261923, 299812, 347943, 427454, 526007, 665763, 907291, 1194236, 1568879, 1954496, 2028071, 1755012, 1346328, 1001012, 770292, 585722, 416485, 347859, 268772, 241942, 235891, 223855, 212770, 201931, 170190, 136820, 129261, 136747, 114934, 87166, 109403, 122136, 117429, 139470, 128859, 101667, 99145, 88150, 82261, 137342, 151993, 122950, 154952, 170714, 139064, 120231, 103022, 94248, 110357]
11517A10357j3349l3257j886k3963L873L3441L71j3236P050J0932K1035r317J4492
11504A06543j3082M06J4427l2958p121m332J6379K2019Q914n7899n8291j5168
11492b0163K4458J8537J073M013j7332J7331K996L7178K4416j538M1450M643j8112
11479A18950m4765j9859J4457J78m4711m7505k7482J8712O227J6162M2761M4914
11467G8039K92K7112L5293l3042o8414l0313J3054j3252N3284k626l0344J0601
11455C9684k1431J6056J6214P13j0648O388m408r41J3294O7094j9074l0082k9927
11442D2932J9657M7472N0663j4022k4169Q428m8663l8106k9093l6875N3326K4845
11430E6395l5789M5724K2969k6084m6278Q763k6440j2654J7188N0402R433j2509
$$ y = [110357, 97008, 63751, 61865, 37902, 41775, 75216, 75587, 62351, 69401, 80333, 101368, 92051, 106543, 93461, 93867, 108294, 75336, 68215, 63883, 80262, 102281, 111195, 53296, -4995, -20163, 4295, 22832, 23905, 27918, 10586, 27917, 30913, 68091, 92507, 90969, 132419, 137062, 118950, 74185, 54326, 68783, 68961, 24250, -23255, -50737, -32025, -25798, -9636, 33125, 78039, 78331, 105443, 140736, 107694, 39280, 8967, 22021, 8769, 62053, 59427, 29083, 39684, 18253, 34309, 50523, 51236, 40588, 46976, 42568, 41627, 54921, 122015, 102941, 72859, 42932, 62589, 110061, 160724, 146702, 122533, 130961, 82298, 44192, 15099, -21776, 31550, 56395, 20606, 66330, 89299, 63215, 16937, 25700, -740, -13394, 3794, 54196, 63629, 51120]
11418E1120l95J9581L1216J6114m1564J4796Q980J6237N507l1399m4456M432L3184
11405H3353k5356M1728M7366K0891L0884L2340K0601J2860R1039M4946o9598n1618
11393B79436J3181m1394k1172O3704l5903p7352j6899K5460K3927j7864q644m7257
11381A39223p6907k2605l8095J8973J4748k9902j5435K8244N5513K0701k1363
11370G3095j6813J1066j6418j5958k0844N6432N2356R082J4454j1387M0391K298
11358A77754p8579M691M8309L9139l297p6558o1709R315l100M304R025J0526Q796
11345H8616r217n444J5690J588J8816j6057j6795J5199k9431K2885J5460K104
11333A03414N713j0166n8331k6426L5246J3235j3582P067k23j092o197k3785J6237
$$ y = [51120, 50725, 70306, 101522, 117636, 76072, 90868, 99848, 116085, 121592, 90193, 45737, 50169, 83353, 57997, 99725, 147091, 167982, 198866, 231206, 251807, 264667, 355706, 400652, 331054, 279436, 292617, 251223, 230051, 293755, 257852, 180500, 163601, 189061, 212988, 195124, 186480, 139223, 62316, 39711, 1616, 20589, 35337, 5435, -10000, 18244, 73757, 94458, 73095, 56282, 67348, 50930, 34972, 14128, 70560, 122916, 131998, 146452, 135065, 175456, 177754, 99175, 103866, 152175, 191314, 188017, 111459, 49750, 59065, 55965, 60269, 69294, 79820, 88616, 79399, 73955, 89645, 91233, 110049, 93992, 77197, 92396, 62965, 85850, 101310, 103414, 109127, 98961, 40630, 14204, 49450, 62685, 49103, 56170, 55947, 54855, 48658, 24873, 41110]
11320D1110K3362M324q459J006M1474k9304J4114l084M0090L6750k2563N223J85
11307A44228k4223P010J4699k243P018j3910J1375J388O383j1568R317q358M927
11294A46043L1807M268N981L4673j4195K517M3582J139j5656K5599j4042n666
11282B46050j4386L174J6380J9573m996j876j0518J3058N0908L1474K3668j5095
11270C57414l6365m5140n0293j00243p8489J8923Q1418O9025M2505K9776J8997
11259C07528j9290k9100l1995K5529l457J1411L6778N1743p275R086k35J8393
11247C69116j4276o1311m6315o022j0298N0172J7128L2890J5525J6165P3143N6390
11235D92307k7863o0765L743M3507k693N171Q1204K7722Q632J8801L924r581K5523
$$ y = [41110, 64472, 68796, 60337, 61343, 102817, 73513, 87627, 84543, 124633, 161383, 138820, 144043, 144228, 120005, 127015, 141714, 139471, 146489, 132579, 143954, 145342, 151725, 140157, 149474, 141116, 146043, 177850, 182118, 188099, 222772, 208577, 211094, 254676, 255815, 240159, 265758, 251716, 246050, 231664, 234838, 251218, 270791, 265795, 263919, 253401, 266459, 317367, 348841, 372509, 357414, 321049, 275909, 225616, 125373, 46884, 65807, 147225, 216250, 258755, 288531, 307528, 288238, 259138, 227143, 252672, 249215, 260626, 297404, 349147, 341872, 350958, 350723, 369116, 354840, 293529, 247214, 241192, 230894, 281066, 298194, 331084, 346609, 362774, 435917, 492307, 464444, 403679, 407422, 450929, 448236, 453407, 534611, 562333, 570965, 589766, 593690, 584109, 609632]
11222F09632M9698M0730j3053j9780K6873M389L8275O6004k3415J7163O784Qp156
11209G96152J0815j7315j5160M8642N2308M2884N7595P5095K8325P011K0083o940
11197A099495L8109N4376L8550O4523P0934j446R04n169k5695O985N2124K8897
11185A422587K7811Q2680O2101J00534J14528N8822N3821R1509N6068M1984J20005
11174B232450J35825J28602J50138K09853K54482K52763K86217M06018M31017
11165D487365M88962M93815N70238O74802O75341L89854J80666K76432N14042
11156H751517Q36116J224240J751387K147287K756360L727237M857910O250444
11148C2302498Q028843J0320965J3736974J8452207K4806203L4612789N0011581
$$ y = [609632, 659330, 700060, 687007, 667227, 694100, 698489, 736764, 802768, 779353, 796516, 803300, 803308, 796152, 806967, 789652, 774492, 823134, 875442, 918326, 975921, 1051016, 1079341, 1086352, 1106435, 1099495, 1137604, 1191980, 1230530, 1295053, 1365987, 1364541, 1365445, 1360276, 1334581, 1341566, 1393690, 1422587, 1450398, 1533078, 1595179, 1695713, 1810241, 1869063, 1922884, 2014393, 2070461, 2112445, 2232450, 2368275, 2496877, 2647015, 2856868, 3111350, 3364113, 3650330, 4056348, 4487365, 4976327, 5470142, 6040380, 6715182, 7390523, 7780377, 7961043, 8237475, 8751517, 9587633, 10811873, 12563260, 14710547, 17466907, 21194144, 26052054, 32302498, 40331341, 50652306, 64389280, 82841487, 107647690, 142260479, 192272060]
11141A92272060P1233243Q0302794L2711749m6064350p6311236p0307590n1913523
11134A31923147l4312948k2326783j4886202j0282946p651596o050200m696464
11127C1716008l651326k895421k277442j706151j282965j056496r07566q01004
11119A7137637n88154l79300j75774j70702m78262p70965p56465n41960l17119
11110A2958936j73781m555J6523N5998K24013K12201m6322l63937n35205o16152
11100A1727719o03353n91315n74945n08223n03412m81603m55338l75719m05263
11091G228548m01537l60015l68631l76948l57299l27134k52193k31108j90433
11082D363250k14726j95654j36865j25119j45300j49755j21860j17135j04789
$$ y = [192272060, 263505303, 343808097, 376519846, 330455496, 254144260, 183836670, 131923147, 97610199, 75283416, 60397214, 50114268, 42462672, 36412472, 31716008, 28064682, 25169261, 22891819, 21185668, 19902703, 18846207, 17938641, 17137637, 16549483, 16170183, 15994409, 15823707, 15345445, 14574480, 13818015, 13276055, 12958936, 12785155, 12780600, 12797123, 12853121, 13077134, 13289335, 13243013, 12879076, 12343871, 11727719, 11124366, 10533051, 9958106, 9449883, 8946471, 8464868, 8009530, 7633811, 7228548, 6827011, 6466996, 6098365, 5721417, 5364118, 5036984, 4784791, 4553683, 4363250, 4148524, 3952870, 3816005, 3690886, 3545586, 3395831, 3273971, 3156836, 3052047]
11073C052047n0594p5262o6373l303O53j35751k03297k06952j53664r7946j45047
11062A914511j80333j54067q7563p9191k9928N132m0385o5014l4623n0570n1140
11051A146829l0576J022r4662j10609l0952k3140k3406m0694n8845M315j2453
11040G26829k7989l6729K1748J3928o8013j09860j5825K5271j2949j5848j9012
11029D81551L0590N554J2995j6115L0423L7890m443J5449J7534L7217J05743J16696
11017H71084O5693Q2926J25563K03599J66720J4245M3643J12866K52730L77909
11007B316978M87470P14164J174284J700940J899940N21554j368035j840047j569788
10998D037460j113304p17683m57782l14662k35106j75103j11494r6289n5248j8235
$$ y = [3052047, 3001453, 2926191, 2859818, 2856515, 2857168, 2721417, 2518120, 2311168, 2157504, 2059558, 1914511, 1734178, 1580111, 1492548, 1413357, 1383429, 1388561, 1348176, 1283162, 1248539, 1197969, 1146829, 1116253, 1117275, 1022613, 912004, 881052, 857912, 834506, 793812, 734967, 739282, 726829, 698840, 662111, 683859, 697787, 629774, 519914, 504089, 529360, 516411, 500563, 481551, 512141, 517695, 530690, 514575, 544998, 582888, 578445, 593894, 611428, 648645, 754388, 871084, 936777, 1019703, 1145266, 1348865, 1515585, 1529830, 1573473, 1686339, 1939069, 2316978, 2804448, 3518612, 4692896, 6393836, 8293776, 8815330, 7447295, 5607248, 4037460, 2924156, 2206473, 1748691, 1434029, 1198923, 1023820, 912326, 816037, 760789, 742554]
10988G42554j8392l1910N698N9513L5265L7404P7823J1165m5964n2574q7134r5153
10976F38295j05608j7434L5470L2208K3643k06j0665K2489O766n013k2187L4805
10964F32563M1273L7443j0056j5240k8834J4114L844J1258l4361l8872m9836l9338
10952E23958J3258Q164k6252n8211k3079k1833k6888k4315K275k0259j7675M792
10940C33935K1823J808J1256j3622J3782R022j4444m6144k231K2336j7448l532
10928C16541j3842j4336j223J611k246l4217N266j6570n6467j8603L0896M5626
10916B42436M8632k912m6819q3364k7940K627J1271L6530J0488k531K7338k083
10904B13673J4120L8471R361n7863O333L8780j6662n1032k5738q937k0639k6082
$$ y = [742554, 724162, 692252, 697950, 757463, 792728, 830132, 907955, 919120, 873156, 820582, 733448, 638295, 532687, 515253, 550723, 582931, 606574, 606368, 595703, 618192, 624958, 619945, 597758, 632563, 673836, 711279, 701223, 685983, 657149, 671263, 675107, 686365, 652004, 613132, 563296, 523958, 537216, 545380, 519128, 460917, 437838, 416005, 389117, 364802, 367077, 346818, 329143, 333935, 355758, 357566, 368822, 355200, 368982, 378004, 363560, 317416, 315185, 337521, 320073, 316541, 302699, 288363, 287140, 288751, 286505, 252288, 257554, 240984, 184517, 165914, 196810, 242436, 291068, 288156, 241337, 157973, 130033, 132660, 143931, 180461, 190949, 188418, 215756, 213673, 227793, 266264, 275625, 217762, 224095, 262875, 246213, 195181, 169443, 160506, 139867, 113785]
10892A13785J1632K9477N2841N688j7687l8868M2735K3674J432j6947J6559l7427
10880A86894l9631m3824J8049K7261l57l1895k8377J178K6994j3083l1022l9535
10868C2652j7892J8053Q808L8938k9217k4969L3189K5276j8054k284j6131k0937
10856B7432K9451P4850K1189p501j4115k3427q765J537K6963O9193J7893J7856
10844B32556O9570P4156M6332M1145R9899L0771n7690r6701p1928n8078o380K3860
10832C27512M6820M6516Q0980J02776L2251m2885j17996j21042o0228m0259n6193
10821A98252l4816l2044J2857k2878j0299k3749q528M805J4716J754k9540L0165
10809A00695N2829j5670n6641l7838L1185O7050L8553m699j4768k0007L538J5747
$$ y = [113785, 125417, 154894, 207735, 213423, 195736, 156868, 199603, 223277, 224709, 207762, 224321, 186894, 147263, 103439, 121488, 148749, 148392, 116497, 88120, 89298, 116292, 103209, 72187, 32652, 14760, 32813, 41621, 80559, 51342, 26373, 59562, 84838, 66784, 64500, 48369, 27432, 56883, 131733, 152922, 145421, 131306, 107879, 99114, 100651, 127614, 196807, 214700, 232556, 302126, 376282, 422614, 463759, 563658, 594429, 536739, 440038, 368110, 310032, 303652, 327512, 374332, 420848, 501828, 604604, 636855, 593970, 475974, 354932, 294704, 254445, 198252, 163436, 131392, 144249, 121371, 111072, 87323, 78795, 83600, 98316, 100070, 70530, 100695, 153524, 137854, 81213, 43375, 74560, 141610, 180163, 175464, 160696, 140689, 144227, 159974]
10797A59974m6048M349r833J0355L4082K6685j5269K6969l8659l8817k852K1508
10785A32444K2836k3855j2358j2343l487J9369K0651m3053q1289l2075j6067K0994
10773h233M7414M3222K5481K1567j2612n787K2355k0142o5663k4556R543L4265
10761F6854j1995k0603J1663j0965L0614K5798J393j125M7944N504k6468J2328
10749A30942M407j9377M031K1042k483m2160r391L4983K0541M944k7437j973J1453
10736A29522j8414L2758L5056k4074J579N0573p740j9646k3247L1323L0061K1799
10724B39550K9283N0173J37070J51260K23522L44341L97933M43232J60317k27364
10714A949317m09388m12035k99621k09713j01031p0228o5757m2031k3962l4300
$$ y = [159974, 113926, 118275, 108442, 118797, 152879, 179564, 164295, 191264, 152605, 113788, 110936, 132444, 155280, 131425, 119067, 106724, 103237, 122606, 143257, 100204, 18915, -13160, -29227, -8233, 39181, 82403, 107884, 129451, 116839, 111052, 133407, 113265, 47602, 23046, 32589, 66854, 54859, 34256, 45919, 34954, 65568, 91366, 92759, 91634, 139578, 145082, 118614, 130942, 135349, 115972, 120003, 141045, 138562, 96402, 87011, 121994, 142535, 147479, 120042, 118069, 129522, 111108, 143866, 178922, 154848, 156427, 207000, 199260, 179614, 156367, 187690, 217751, 239550, 268833, 319006, 456076, 607336, 830858, 1175199, 1573132, 2016364, 2176681, 1949317, 1539929, 1127894, 828273, 618560, 517529, 447301, 381544, 339513, 315551, 281251]
10704B81251k4573k9913l8405k5100J0261L2509K3455K390j6460J331k1693J4701
10692B09754J4018J2280j758J2840l4485P272K5446L8796O6772N1219j2763L1506
10680D20897N1604k5937n787k6679N2980N7185L7289J04619Q6255P9227J76719
10669A008372K08822K42015L08887M68423O02186P83474J046309J527897K221228
10660H417613L118810L556709J509883j988244l384692l116734k277914j498871
10652D336560j024638o84035m17754l03097k53059j68634j11549j15303j06827
10643A151664q7058n9197n2824q9217p8622p4800j8722M4278N5251m9433k8865
10632G12455l6870L5978O6786M2217N2895R3479J43853J15539J0113r2498j35468
$$ y = [281251, 256678, 226765, 188360, 163260, 173521, 206030, 229485, 231875, 215415, 216746, 195053, 209754, 223772, 236052, 234294, 247134, 212649, 219921, 245367, 284163, 350935, 402154, 389391, 420897, 472501, 446564, 440777, 414098, 467078, 524263, 561552, 666171, 752426, 831653, 1008372, 1217194, 1459209, 1768096, 2236519, 2838705, 3622179, 4668488, 6196385, 8417613, 11536423, 15093132, 16603015, 14614771, 11230079, 8113345, 5835431, 4336560, 3311922, 2627887, 2210133, 1907036, 1653977, 1485343, 1373794, 1258491, 1151664, 1064606, 1005409, 952585, 863368, 784746, 709946, 691224, 735502, 790753, 741320, 712455, 675585, 711563, 778349, 820566, 873461, 966940, 1110793, 1226332, 1236445, 1143947, 1008479]
10621A008479j34119j15701q0014n5455k0951p7744l9124o4379o8830j8821k0295
10610C13046m01k760l1466k6854m2830j690m233J4724N53r685J1054N73l6518
10597A83513N087J6048K6448J7282j8126n14J0044r841m825M755o9254n2586L7592
10584A45623K4521l7913j8175r824K1071n800J2378m183n1681m034Q105q512Q431
10571H0007l753K5968J9829m2433m6364J4106k4190j7266k1221L3455K5209M6235
10559H9582J8425l7341l3176o3862J2616M2780K8679L9731M4J4994L2536L2379
10547A77387J02612J40076Q1716l0752m6136m5870j3787J0781r939l4197q0583
10536B51308l6178n1718m9067j1599J5316K5262Q406j000L792q0804N859J6489
$$ y = [1008479, 874360, 758659, 678645, 623190, 602239, 524495, 485371, 420992, 352162, 333341, 313046, 312645, 309885, 278419, 251565, 208735, 207045, 202812, 217536, 218089, 208404, 219458, 220031, 183513, 188600, 204648, 231096, 248378, 230252, 229738, 239782, 229941, 225116, 229871, 160617, 108031, 145623, 170144, 132231, 114056, 104232, 125303, 119503, 131881, 127698, 76017, 71983, 80088, 71576, 80007, 76254, 102222, 122051, 79618, 33254, 47360, 23170, 5904, -15317, 18138, 43347, 89582, 108007, 70666, 37490, -26372, -13756, 29024, 57703, 97434, 97478, 112472, 145008, 177387, 279999, 420075, 501791, 471039, 424903, 379033, 365246, 376027, 366088, 331891, 251308, 215130, 163412, 114345, 102746, 118062, 143324, 151730, 150730, 154522, 73718, 79577, 96066]
10524I6066o789K4810J0649p122l8737l4082J4116j9826K686K0350j0480k2396
10512B9245k880L4916o671J6846R238k554r691l5553j8302k2093J4327n984j0752
10499i908K7032N951J2528k0270k1466j5945M886M4502K2983j6463k4539J9049
10487B8340j9061L0523N0876L006k7696j1076j0020J7957l0337J7589k6357j6340
10475G404L3773k5896k5186p856j0254j1146K8087M3959j2925q64k6354k310j6780
10462b6348J7273N8323K2046l9861L53K9515j5157M1427N217k3618l8770k098
10450B8302j8035J0378l559J9506K9010L4773K950k6013k324J2621J3187r01J0615
10437A10510m0997k9833j8705j7321p124R316j1249k9511r860J5271L8707P326
$$ y = [96066, 89277, 114087, 124736, 117614, 78877, 44795, 58911, 39085, 41771, 62121, 51641, 29245, 26365, 61281, 54610, 71456, 80694, 78140, 68449, 32896, 14594, -7499, 6828, 844, -9908, 17124, 23075, 35603, 15333, -6133, -22078, -17192, 27310, 50293, 33830, 9291, 28340, 9279, 39802, 90678, 93684, 65988, 54912, 44892, 62849, 32512, 50101, 23744, 7404, 41177, 15281, -9905, -17761, -28015, -39161, -11074, 32885, 19960, 19096, -7258, -9568, -26348, -9075, 49248, 71294, 31433, 31786, 61301, 46144, 87571, 92788, 69170, 30400, 28302, 10267, 20645, 17086, 36592, 65602, 100375, 103325, 77312, 74988, 87609, 100796, 99895, 110510, 69513, 39680, 20975, 3654, -3470, 5846, -5403, -34914, -44774, -29503, 9204, 16530]
10425A6530J5380j8458K1986N1171l6480j0501j9802j1169M0881q6j948o812J576
10412D2268q627J3158M5738N3357o7568m9400j4701m2185m3631K985K5465m338
10400d7479L7420M9529r803K7672J253l5535l8523K7424K721L6091Q599R622J9634
10387H8625j3700m1476J2844J0928k0373K4698K4953o8426k4982L0415O09J8221
10375D2336j2255j8416k4m2522j8832J6992L9664m639n3839j7548J5709J2590
10363d0784K9568J8058j5888R646K093M7426K8910j7264M3639M5940N3231P0500
10351B75075Q7239J56744K04858J49726K3378j39594k05043j61732q7924n0147
10341B52580m6646p797J354J0312m1608k4048J6375L506l1092k1205l8815n110
$$ y = [16530, 31910, 13452, 35438, 86609, 50129, 39628, 19826, 8657, 49538, 49452, 47504, 40692, 42268, 33641, 46799, 92537, 145894, 78326, 28926, 14225, -27960, -71591, -68606, -43141, -47479, -10059, 39470, 29667, 57339, 58592, 23057, -15466, 11958, 14679, 50770, 59369, 68991, 88625, 74925, 33449, 46293, 57221, 36848, 61546, 86499, 18073, -6909, 23506, 24115, 42336, 30081, 11665, 11641, -30881, -49713, -32721, 6943, 2304, -51535, -69083, -53374, -40784, -11216, 6842, -9046, 600, 2693, 50119, 79029, 61765, 105404, 151344, 204575, 275075, 362314, 519058, 723916, 873642, 897020, 757426, 552383, 390651, 302727, 252580, 205934, 198137, 199491, 209803, 168195, 144147, 160522, 164028, 132936, 111731, 72916, 67806]
10329F7806j6869K816l1565L2888j957J0516k164m834m1510l8084J9154L1301
10317B7498l7553J8713J1466j4918j2085n94L4195n070Q673j2271j6622N155k918
10304C669l3133L8759N8337r199p965K9890K499j4808o2079p898K3144j5912l8844
10291c3540j2973K4169k5865Q019m258J6904j4726k0643r222M256N150L2690O185
10278b3854k4001L8201L2417j2116j694M673j2807J059J1739j3480m2460j0213
10266e2536P3323M1550j4627o7950r232N6333j0154j3667m65J7440J3670k8001
10254E684L2350M2839R003l5819k8569j1047j8427O22O1826K0757Q920J769q628
10241H1280k6474R096N128M245j429q585o717j0037l0841M411m5749K6144J225
$$ y = [67806, 50937, 53753, 22188, 55076, 53119, 63635, 61471, 56637, 15127, -22957, -3803, 27498, -10055, 8658, 20124, 5206, -6879, -7473, 26722, 21652, 30325, 18054, 1432, 6587, 3669, -29464, 9295, 67632, 58433, 50468, 80358, 82857, 68049, 5970, -1928, 21216, 5304, -33540, -46513, -22344, -48209, -40190, -44448, -27544, -42270, -62913, -72135, -67879, -62729, -30039, -23854, -47855, -9654, 22763, 10647, 8953, 13626, 819, 1878, 13617, 137, -42323, -52536, 20787, 62337, 47710, -20240, -29472, 26861, 16707, 3040, 2575, 20015, 33685, 5684, 38034, 80873, 89876, 54057, 25488, 14441, -3986, -3364, 58462, 79219, 88139, 89908, 81280, 54806, 63902, 69030, 73275, 71846, 63261, 56544, 46507, 15666, 20077, -25672, 472, 1697]
10228A697J0154J2019L15k1066r930j8588Q26k81k3899K4961j0776l9383j7940
10215i1891Q507j0012J8276J4067M8930L4533O2739k2737o4333N841J70o669J8380
10202A5801L2536M2423k1001k9981j0859J2243m053Q18K7691L927j3964j3173
10190D2408j8496M8144L9027O373J3836j509q013K1715O0003M4602M5196N6945
10178C50231J00578J23804J38461J8682j39917j50683r5585o6853r0357m3429
10168A44932N718J2123j8459M594n714m0236k1589L1703k7558k4342j6905k0225
10156B4042R212m925l2927l9689p162J8206O806K7161l774J8750n180l3423J6161
10143f742k7315L352J7615J8209L4867m2402m1565O0818L2058K0702j1756k6281
$$ y = [1697, 11851, 23870, 24185, 3119, -6811, -25399, -24573, -24854, -48753, -23792, -34568, -73951, -91891, -83384, -93396, -75120, -61053, -12123, 22410, 85149, 62412, -1921, 3920, 4090, -2579, 15801, 48337, 90760, 69759, 39778, 28919, 41162, 37109, 37927, 65618, 69545, 55581, 42408, 23912, 72056, 111083, 117456, 131292, 129783, 121770, 143485, 203488, 248090, 293286, 350231, 450809, 574613, 713074, 731756, 591839, 441156, 345571, 278718, 188361, 144932, 150650, 162773, 144314, 148908, 143194, 102958, 81369, 113072, 85514, 61172, 44267, 24042, 33254, 28329, -4598, -44287, -51449, -33243, -26437, 724, -3050, 15700, 10520, -22903, -6742, -34057, -30705, -13090, 5119, 39986, -2416, -43981, 16837, 48895, 69597, 57841, 31560]
10131C1560K5747n1490n2816M0326L350k9562n248j7140j686L0481L1684K6159
10119C1365m5314j5090j8661K2291P0128K1757n3563p812J1096k4167j9875j8327
10107d6172k5639J4324O1124L8839j0876m3255k6607K6735l438J9363L8572M6478
10095H9448k1175j6941n648j9138k3510m4985M2002N2656J622l4445L923J9823
10083D3632J9852m6223N445O987K649k3709k0264j6765J6942M661r174L3131o938
10070A0226m0987K5426k086n4323k5295K2653L9005L1767j1744R801k835q644
10058g036J6416K3582N2653K9800N5905R1460P0981l9404r3130q4237m9305k3222
10046D4463j5757k9870R357K4671N384R864P607p5335J7879k047M939k456k1620
$$ y = [31560, 57307, 5817, -46999, -6673, -3323, -32885, -38133, -55273, -56959, -26478, 5206, 31365, -13949, -29039, -47700, -25409, 44719, 66476, 12913, 5101, 16197, -7970, -27845, -46172, -71811, -57487, 3637, 42476, 31600, -11655, -38262, -11527, -14965, 4398, 42970, 89448, 68273, 51332, 45684, 26546, 3036, -41949, 53, 52709, 54331, 19886, 23809, 43632, 63484, 17261, 22706, 29693, 32342, 8633, -11631, -28396, -11454, -6793, -15967, 17164, 10226, -30761, -5335, -7421, -61744, -87039, -64386, -25381, 6386, -5358, 4443, 1608, -7036, 9380, 32962, 85615, 115415, 171320, 262780, 333761, 294357, 201227, 116990, 67685, 44463, 28706, -1164, 8193, 32864, 38248, 48112, 55719, -19616, -1737, -3784, 1155, -1301, -22921]
10033b2921L3245J8426m5276J5786P1402J2002n1535k4080R718m495J0134J3927
10021C6333J3018n2641k8011L6633j3070q580j2397k3478l0457K2886L6141k5078
10009d8701M397J8147K9330K6929Q777J3757j2124k3277l8714N0286K8510k9834
9997B7483R942O056l7673l963m1703L8045j5840J8605K7317L877l6119l6738k8689
9984f9400Q798M7332K6959r973l2194j1715R788M216n956m1075k0078L4581L2887
9971b5830l6230j008L5809p145J8769K1997j3139p198p795O677K5960K1677j8718
9958A3826m1876j0397L2239J1221j535j9718k2649j0741m946O110M5825j7930
9946b0571l3391K6198l007R618J4132M7618J6768O084m5015l1011j9979k5514
$$ y = [-22921, 10324, 28750, -16526, -740, 70662, 82664, 31129, 7049, 16767, 12272, 22406, 36333, 49351, -3290, -31301, 5332, -7738, -16318, -28715, -52193, -82650, -59764, -23623, -48701, -44304, -26157, 3173, 30102, 38879, 52636, 40512, 17235, -21479, 28807, 57317, 27483, 37425, 43481, 5808, 1845, -39858, -1813, -17653, 952, 28269, 32146, -3973, -40711, -69400, -60602, -13270, 13689, 3716, -28478, -40193, -30405, -26189, -32145, -73220, -93298, -58717, -25830, -62060, -63068, -27259, -34404, -15635, 6362, -6777, -13975, -21770, -15093, 10867, 32544, 13826, -28050, -38447, -6208, 5013, 3478, -16240, -38889, -49630, -54576, -48466, -2641, -20571, -53962, -27764, -30771, -21153, -7021, 40597, 57365, 63449, 18434, -12577, -32556, -58070]
9934e8070j833M0790L7748Q518r27L7725K4530o9498n1688R13q956R810N363K7136
9920A561j9005k0250J6432j3087k2904j6819K6257K0147J5417j210j5322O030
9908b2753j1122j2272O145n2608P043J3644M6390L2634K380P289M1229J7127k5503
9895D9623m386j765j0414m67k188k987L9066Q235j8843l6158l8477Q473K8110
9882A7822K306m5836o972L3094o5R919j4977m6563n031N752n0635K93J5901L2437
9868e2555j987m738M1318J4127l5970m0395J8515K9387j9565j3196Q232l4325
9856i1152j6322K1032K9690M4685L5235K1486q155l341k9367m7064n9280k8988
9844a31541M7567M8063J1045m630j864p965p114K153k5727n431N7291N5624R692
$$ y = [-58070, -59903, -19113, 18635, 27153, 26226, 63951, 88481, 18983, -32705, -31792, -40748, -30938, -25575, 1561, -17444, -37694, -21262, -34349, -57253, -74072, -47815, -27668, -12251, -13461, -28783, -22753, -33875, -46147, -40002, -92610, -85567, -71923, -25533, 7101, 9481, 16770, 57999, 75126, 49623, 45237, 43472, 33058, 32591, 30403, 27416, 66482, 74717, 55874, 19716, -18761, -10288, 17822, 20128, -25708, -32680, 414, 349, 10268, -4709, -51272, -56303, -50551, -101186, -100893, -84992, -52555, -54542, -59280, -17962, -3835, -39805, -80200, -61685, -32298, -51863, -65059, -56827, -91152, -107474, -86442, -56752, -12067, 23168, 44654, 36499, 33158, 3791, -43273, -102553, -131541, -83974, -35911, -24866, -29496, -31360, -39325, -46439, -44286, -70013, -75444, -18153, 37471, 47163]
9831D7163l0861k8574k5866j7803J5609R006Q796j8606j9582N74K8450K3606J3591
9818E503M5976K0105j9975K2946J2253l2954o292J7545j5007K9627r490o6241
9806C996l5623L5718J3193j6426l2447J9812M2204n6141m0116L4573J8177K702
9794a0378j4060m1097L1248J2816R166N166Q1j0701K687J743J5556J1243j5336
9781a866Q876l0555k1257o679M2334J0936m0595M9N8133J0005m0754Q626n836
9768h583M605L058M0117K1934k739N25J2337O489k2683r159j7171j2211M980J311
9754B2810n6919M2565K9524k1376J0673J3066l2613k6588J935M1090J2427O37
9742C7231K221l5793j8592N851K3343j2580K17J1259r809R508Q967l451j6147
$$ y = [47163, 16302, -12272, -38138, -55941, -40332, -31326, -22530, -41136, -60718, -60144, -31694, -8088, 5503, 51479, 71584, 51609, 74555, 86808, 53854, 47562, 65107, 50100, 79727, 70237, 3996, -31627, 4091, 17284, 858, -31589, -11777, 30427, -25714, -65830, -31257, -13080, -10378, -24438, -65535, -34287, -21471, -12305, -7139, -7058, -17759, -15072, -13329, 2227, 13470, -1866, 7010, -23545, -44802, -51481, -9147, 1789, -38806, -38757, 19376, 29381, -11373, -2747, -8583, -3978, -920, 39197, 61131, 58392, 58917, 71254, 77743, 55060, 45901, 28730, 16519, 21499, 22810, -34109, 8456, 37980, 16604, 27277, 40343, 7730, -18858, -16923, 24167, 36594, 37231, 39452, 3659, -14933, -9082, 14261, 1681, 1898, 13157, 3348, 12856, 21823, 18372, 2225]
9729B225J3255Q164L5213p16N152j6355l6864k5591l8241r39L3969K7339J2471
9716A9082R070k0132J1413K3589m877m4541j3776L5458K9606m1088k2067Q163
9704a0100K4511n78Q42m0956r882j6196J2600K0592k6765j7851Q683r250j3692
9691g8042M6804M9481J849l228K1830K5941J3871J4284q350K9513N6031R059m8654
9678A30389L768J8298k5339j1262k6775l567j2702l7098O123m8741j7092J6836
9666g162J8700K5319j645l7566M061k7284L2623L6412L2160L4560o268l8445q918
9653E6547l521r740M1780J7230j6292n5094k5199R57N2825j5231m2106L3224J9597
9640E4977n0494j6791J8110M5886P057M351L5954K2283k1982q705n2319m3479
$$ y = [2225, 15480, 23644, 58857, 58141, 63293, 46938, 10074, -15517, -53758, -54697, -20728, 6611, 19082, 28152, 8020, 19433, 43022, 38145, -6396, -20172, 15286, 44892, 3804, -18263, -10100, 14411, 13833, 14675, -26281, -36163, -52359, -39759, -19167, -45932, -63783, -55100, -64350, -78042, -31238, 18243, 20092, 16864, 38694, 64635, 78506, 92790, 84440, 113953, 169984, 179043, 130389, 134157, 152455, 127116, 115854, 89079, 85512, 72810, 35712, 41835, -6906, -23998, -7162, 11538, 36857, 35212, -2354, 1707, -25577, 7046, 43458, 75618, 110178, 103910, 65465, 56547, 53026, 43286, 85066, 102296, 86004, 30910, 5711, 6668, 59493, 44262, 2156, 35380, 54977, 4483, -12308, 5802, 51688, 58745, 63096, 99050, 121333, 99351, 90646, 38327, -5152]
9628e152n023k4184L9000O1107l6065o0521R682L2982J5082L6680J2934o1355
9616A5167l7343L0299K2044k0592Q072o304J158k2900J2684M8504K0117o974L0950
9603I4882j3996n0761k2882J1436L1397j2065J3048m4879m6461J0359K1974l9004
9591d6952M556K0284l5008R743K3731j3130k960L5839L6120m3825j7622J8107
9579a1117M1631K5144K7532R205j071m5025o1615j9611J365M0601l0116k7677
9567e0754n878N0302L1757l9717k3720L5875J2721p17l336k2443k5907j0347l8722
9554i0886P988J2451L1465R845K6987l40K4378L038k0049m7126J2128J5705K492
9541a1924Q994K5835L2547K9065k1355o8576j2677J7560j1581R20K8448q330J3142
$$ y = [-5152, -10175, -34359, 4641, 65748, 29683, -30838, -21156, 11826, 26908, 63588, 76522, 15167, -22176, 8123, 30167, 9575, 17647, 11343, 12501, -10399, 2285, 50789, 70906, 63932, 94882, 80886, 30125, 7243, 18679, 50076, 38011, 51059, 6180, -40281, -29922, -7948, -46952, -42396, -22112, -57120, -47377, -23646, -36776, -39736, -3897, 32223, -11602, -29224, -11117, 30514, 55658, 83190, 92395, 91324, 46299, -15316, -34927, -33562, 7039, -23077, -50754, -56632, -6330, 25427, -14290, -38010, -2135, 10586, 9869, 6533, -15910, -41817, -52164, -90886, -82898, -70447, -38982, -29137, -2150, -2490, 21888, 24926, 4877, -42249, -30121, -14416, -11924, -2930, 22905, 55452, 84517, 63162, -5414, -18091, -531, -12112, -11192, 17256, 8926, 22068]
9528B2068l3067n380j1978j6961Q931P570J7714q488L0607k4755k4329N2143L2894
9515D6969P302P84l491l3085k7389N525j6612L9365J138k3783K6771o867K6750
9502D3377K025m5866k1130p683k3125j7768N499J6723K4348L9657K9550k3537
9490B2070m3072N8j9765L168o266P624l872k1424j1005j519K9060N2562k5021
9477a7402k0381J0546M2138J8682r63J8306J4886m0473m5860K1833j9845l4551
9465e3084j665k2076o067M8598j84k015K7240l868l5567O184L1840L2902N2768
9452G5006o375j8581J5744O399J1124n3936l2165j2485K9653J3678m992J3118
9440C6188O539k1028n5095l7751j5902J4424M0377O588k2947J7299j3303J6650
$$ y = [22068, -10999, -16379, -28357, -45318, -36387, -28817, -11103, -19591, 11016, -13739, -38068, 14075, 46969, 54271, 55055, 51564, 18479, -8910, -3385, -19997, 19368, 20506, -3277, 23494, 16627, 43377, 45402, -464, -21594, -29277, -52402, -70170, -64671, -47948, -23600, 16057, 45607, 22070, -21002, -20944, -40709, -37541, -43807, -36183, -40055, -61479, -72484, -74003, -44943, 7619, -17402, -37783, -27237, 14901, 33583, 32620, 50926, 65812, 25339, -20521, 1312, -18533, -53084, -54749, -76825, -82892, -34294, -34478, -36493, -9253, -13121, -48688, -42504, -10664, 22238, 75006, 68631, 50050, 65794, 72193, 83317, 29381, -2784, -15269, 14384, 28062, 23070, 36188, 42727, 21699, -33396, -71147, -87049, -72625, -32248, -25660, -48607, -31308, -44611, -27961]
9428b7961j599j1681Q150n704r980j1552L8547J5718Q419J5344j7972K433P484
9415I646m2787K3438J5722n143J9923K8686j7385l8611l0826p579K8310K9364
9403A2758L2446k7420K1277r261j2444J5935K395J7168K780j6956j5077N657J0438
9390C9696m243l5798l911m296J8803j9525o4731q085l102M7492M9540M399o192
9377A0047m984p012l915J9150K4772N488J4391l7868l9549M069j2737k332N7612
9364B7132M0743j0849j9780J2897k2884l3293Q511J9727L1298L375k5472p450
9352B3955J5942l936k0179m6456m0475L1167Q873j7095j0788Q025L3091o872L472
9339b1276o491M1960l5402l204K4095K9032k3362k6962k763K6051J1836k673M9326
$$ y = [-27961, -29560, -41241, -33091, -38795, -48775, -60327, -21780, -6062, 2357, 17701, -271, 2162, 9646, -33141, -9703, 6019, 876, 20799, 49485, 32100, -6511, -37337, -44916, -16606, 12758, 45204, 17784, 39061, 29800, 17356, 33291, 35686, 52854, 55634, 38678, 23601, 29258, 39696, 35453, -345, -4256, -8552, 10251, -9274, -74005, -82090, -85192, -37700, 11840, 16239, 10047, 5063, -1949, -5864, 13286, 38058, 43546, 57937, 20069, -19480, -15411, -28148, -30480, 27132, 67875, 57026, 37246, 50143, 27259, -6034, 2477, 22204, 53502, 56877, 31405, 23955, 39897, 35961, 15782, -30674, -71149, -39982, -31109, -48204, -58992, -50967, -17876, -24748, -21276, -27767, 14193, -21209, -24413, -318, 28714, 5352, -21610, -24373, 1678, 13514, 10841, 60167]
9326F0167n074l4313k1457j0339j1382l788M7801J3228k0475l206l0699r528N2015
9313B2950K1493q2827l1803L0973K3813J3492k5920j3286L4322M785L8422R371
9301D5785K351r990l9398l1511M758j4837L3633O1743k2804j8116J8980k7740
9289B854j9107l4277k636J1784J7723p579k631n418R637K0397J6695Q781k5948
9276i725k3560J6646k055j4367J6392k3675k8923N6113K4848k405k0137k2998
9264c3846J6009M9858l181j2564j2663J5330P792J4765m1160L1434P788j3765
9252B5797j4192k960q623q042n701k2428K4050M6297L3499M13n0804m7774J9741
9239a0727M5372P083O159L669J3169j7646j2613L2990J0755l7974k2409J2765
$$ y = [60167, 55093, 20780, -677, -11016, -22398, -26186, 21615, 34843, 14368, 11162, -19537, -29065, 22950, 44443, -38384, -70187, -39214, -15401, -1909, -27829, -41115, -6793, -2008, 36414, 45785, 48136, 38146, -1252, -32763, -28005, -42842, -9209, 52534, 29730, 11614, 30594, 2854, -16253, -50530, -53166, -41382, -23659, -31238, -33869, -39287, -29650, -9253, 7442, 16223, -9725, -33285, -16639, -18694, -33061, -16669, -40344, -69267, -13154, 11694, 9289, -10848, -33846, -17837, 32021, 28840, 16276, 3613, 18943, 26735, 41500, 340, 31774, 39562, 25797, 11605, 8645, 22, -8020, -13721, -36149, -12099, 34198, 67697, 68110, 17306, -30468, -10727, 34645, 41728, 47887, 51556, 64725, 47079, 34466, 67456, 78211, 40237, 17828, 30593]
9227C0593K7515R813m425k9418j6957j3232j282k1703J4480K4222M1912K940k5546
9214C8912m3233k6565J0149L2337J7416L2769j1536m8111J8718K5755j1603j4714
9202B0294j6305N701K6193j6248M2209O646j0320K0598k6221j620M807J0058k929
9189F2863j3740l794N86kJ0939l4047n992j371K6759M361J0458Q216J2084l5006
9175D2314l273K368J827K1136l9062l4203K2181N4638K7954p024P804K817R447
9162A08924m0652l9702J5835J6154j2667k21j3522M8269M4133k6955m9459j6496
9150C3641m333Q033P354M4759L014J2363K0855j8126l6670J6656J7518K4769J2083
9137A41916Q784N893j4919m023K5551K8301l316M008J203k9650J907K1011O6J9977
$$ y = [30593, 58108, 67921, 63496, 34078, 17121, 3889, 2607, -19096, -4616, 19606, 61518, 64458, 38912, -4321, -30886, -20737, 11600, 29016, 61785, 50249, 2138, 20856, 46611, 35008, 20294, 3989, 9690, 35883, 19635, 61844, 68490, 58170, 78768, 52547, 50927, 55734, 65792, 62863, 49123, 45329, 45915, 45913, 56852, 22805, 16813, 15442, 42201, 46562, 57020, 65236, 77320, 42314, 39041, 41409, 43236, 64372, 25310, -8893, 13288, 67926, 95880, 88856, 96660, 99477, 108924, 68272, 28570, 44405, 60559, 47892, 47671, 34149, 82418, 126551, 99596, 50137, 33641, 29308, 37341, 44695, 89454, 92468, 104831, 125686, 107560, 70890, 87546, 105064, 129833, 141916, 150700, 156593, 141674, 137651, 163202, 191503, 188187, 192195, 193398, 163748, 165655, 186666, 186732, 206709]
9123B06709J820J1780l8814k4173J8597L6432L758M0320K4942Q545J2567k123
9111C00360j6897n536l633M4019P2135L0378O3089K3669p77R188L1945J7887L4582
9098F00409M8842M6649O7658N6774O7161N8138J05695R9485P6052J18794J22909
9087A468566J81017K17637K46562K92176L69216L81662M23934N04716N91355P00698
9077E377539P15691P31654O69660N77623M59421J74818j43509l95339n58963o54305
9067F954290o98069o78916o55031n71367m81946m12412l64042l47646k62778k28381
9057B253702j48243j72732j36983q2241n5905q2220r1423j08641p8707o8809k5315
9046A202483o4684n5358n3281l2577j8652n682O116n6713p654l9559m8314k0985
$$ y = [206709, 208529, 220309, 181495, 157322, 175919, 212351, 216109, 256429, 281371, 289916, 302483, 300360, 283463, 277927, 274294, 318313, 390448, 420826, 483915, 507584, 506807, 515995, 547940, 565827, 600409, 649251, 695900, 763558, 820332, 887493, 945631, 1051326, 1150811, 1226863, 1345657, 1468566, 1649583, 1867220, 2113782, 2405958, 2775174, 3156836, 3580770, 4085486, 4676841, 5377539, 6093230, 6824884, 7494544, 8072167, 8531588, 8706406, 8562897, 8167558, 7608595, 6954290, 6256221, 5577305, 4922274, 4350907, 3868961, 3456549, 3092507, 2744861, 2482083, 2253702, 2105459, 1932727, 1795744, 1713503, 1657598, 1575378, 1483955, 1375314, 1296607, 1227798, 1202483, 1137799, 1082441, 1029160, 996583, 977931, 972249, 978365, 921652, 913998, 874439, 826125, 805140]
9034H05140N072j3084K980p0839q6195m7979k1767k0938L593j7870n9182l4032
9022D44899l5730j037L1030k6328k8748J638k5493j9454m4115l0379J5414K3012
9010C04709L7159j2542n0969j9570J1858L2854k9937K64o189m3822m3358J824
8998A82281q269m6728J7293R291p060M443j7151L555N2669r811l561J8287j5486
8985A79753k3707l3097k9101k5379k2742l6011j0932l269j931J3722q872K6140
8973B4574J9735L7926L7358o669M690m2731k080J4574J7728K7103n820l4660n857
8960H5871K812P815M127n4799l7170j998J3153M0848K3608M1863m0839O362K1402
8947A13055J4181j9484j1472l0157j0916Q141k846O756q149j7444l312J8226O278
$$ y = [805140, 810212, 797128, 800108, 729269, 643074, 595095, 573328, 552390, 555983, 538113, 478931, 444899, 409169, 408132, 439162, 412834, 384086, 385724, 360231, 340777, 296662, 266283, 281697, 304709, 341868, 329326, 278357, 258787, 270645, 303499, 273562, 273826, 267637, 223815, 180457, 182281, 174012, 127284, 144577, 153868, 146808, 151251, 134100, 137655, 190324, 180513, 176952, 195239, 179753, 156046, 122949, 93848, 68469, 45727, 9716, -1216, -4485, -6416, 7306, -1566, 24574, 44309, 82235, 119593, 112924, 117614, 74883, 72803, 87377, 105105, 132208, 126388, 91728, 85871, 88683, 96498, 100625, 45826, 8656, 6658, 19811, 60659, 84267, 126130, 85291, 91653, 113055, 127236, 107752, 96280, 66123, 55207, 63348, 60502, 67258, 59109, 41665, 38353, 56579, 62857]
8934F2857K6677k0053L87k9245M601L2146l0343K6738p215O844q501l0597K3941
8921E8237l042n2019k2791K1700K0772J3174M285k959l1965K3996R238K788O232
8908D7646m015l5047l8517L1951L393J8908J0787r420k9772K7933J2716j4577
8896B1986Q781N0251l0458k1276n72O524N2053k4122J0341J1748j286k2409j5132
8883D6429J1052L9034l0865j8979J4388R608K629K1123p880L6803k3539J8507
8871A18310M8517J7021K6676K9836m5959l4493m4653n3619J4573K4389k9813j0210
8859F0575n904j7241K2585K367k7512j4288J9736j0839j2204K6388J2778j7478
8847C8963r873k921K8693L0617L957l7177K4179K7258j2246m9906K4793j3572
$$ y = [62857, 89534, 69481, 69868, 40623, 45224, 77370, 47027, 73765, 66550, 73394, 64893, 34296, 58237, 55195, 3176, -19615, 2085, 22857, 36031, 40316, 37357, 5392, 29388, 38626, 41414, 47646, 43631, 8584, -29933, 2018, 5411, 24319, 35106, 25686, -4086, 23847, 36563, 21986, 30767, 81018, 50560, 29284, 28712, 35236, 87289, 63167, 73508, 85256, 83970, 61561, 46429, 57481, 96515, 65650, 46671, 61059, 70667, 73296, 94419, 86539, 123342, 99803, 118310, 166827, 183848, 210524, 240360, 194401, 159908, 115255, 61636, 76209, 100598, 70785, 60575, 54671, 37430, 60015, 62382, 34870, 20582, 40318, 29479, 17275, 43663, 56441, 38963, 29090, 26169, 54862, 85479, 89436, 52259, 76438, 103696, 91450, 41544, 66337, 52765]
8835E2765j9343n540j795J9595p268p142n551N971k8911R11n220j3758K7149J4933
8821B6796L6178J4419q238k3454k4626l8793n566K4715K1927l058j1160J5799
8809B4939q060o955K7814l883m765J5074Q389o82k1529j7567O302j0203k9510
8796b0636k7015Q138O130K8702L6850R942K7807Q603l771j0345k3614l4914l2616
8783b6739p737O4186M5930N078N220l9412k3384k6469M1793J824l7368k7875N921
8770a9032q429J8795p42n870k1421l41J3597M6991N3309j3019k0811J8835P498
8757F9360k2616n4706j2132j3447J669L3476N253K406j4968j5540L22J673M1446
8744B2196K7996j1040K9084L214l1943k8943J7609K5661J0266l038l708N5278
$$ y = [52765, 33422, 27882, 26087, 45682, 38414, 31272, 25721, 31692, 2781, 3692, -1528, -15286, 11863, 26796, 62974, 77393, 69155, 45701, 21075, -17718, -23284, 1431, 23358, 20300, 9140, 24939, 16879, 9924, 37738, 33855, 29090, 44164, 52553, 51871, 30342, 12775, 19077, 8874, -20636, -47651, -39513, -33383, -4681, 32169, 42111, 69918, 78521, 74750, 64405, 40791, 5877, -26739, -34476, 29710, 75640, 80718, 85938, 46526, 23142, -3327, 38466, 40290, 2922, -24953, -19032, -27461, -8666, -9408, -15278, -36699, -37040, -23443, 23548, 76857, 63838, 43027, 61862, 69360, 46744, -7962, -20094, -33541, -31872, 1604, 6857, 9263, -5705, -21245, -20923, -19250, 22196, 50192, 39152, 68236, 71450, 39507, 10564, 28173, 53834, 64100, 61062, 57354, 112632]
8732A12632k2212k8545j0831n0205M622M621R013n907J8387J1977K8263J8828
8720I0643p013K0939M6167l6673O702k8566k1438k8872j1628m492j811K3278K3875
8707G1111J0268L5766j2454k7995m2269j3533J2562K3243N5968o903l2870L4569
8695A07463o282r738J212L7133L5030j6437q951l4017k4410M6784K9365j3331
8683A43821l3856j9092j7164J5363L8501J0674P006j0361n9824l6217K1796K1411
8671H2058M3861L2253k4141q087j0952o180K5976M780k8376n575K7418J8381L3578
8658A84994J4278N141L3123m2843q576j6300k4137J8074K4143m983J6366j9434
8646A79846k0876K0309J802n180O694j2016J9847J8524P328K7422n4079k3857
$$ y = [112632, 90420, 61875, 51044, 839, 5461, 10082, 19095, 13188, 31575, 43552, 71815, 90643, 83630, 104569, 150736, 114063, 120765, 92199, 70761, 41889, 30261, 25769, 23958, 47236, 71111, 81379, 117145, 104691, 76696, 34427, 20894, 33456, 56699, 112667, 105764, 72894, 107463, 101181, 91443, 92655, 129788, 164818, 148381, 139430, 105413, 81003, 127787, 157152, 143821, 109965, 90873, 73709, 89072, 127573, 138247, 145253, 134892, 75068, 38851, 60647, 82058, 125919, 158172, 134031, 125944, 114992, 108812, 134788, 139568, 111192, 105617, 133035, 151416, 184994, 199272, 204413, 237536, 194693, 186117, 169817, 145680, 163754, 187897, 182914, 199280, 179846, 158970, 179279, 181081, 175901, 182595, 170579, 190426, 208950, 216278, 243700, 189621, 165764]
8634A65764J5616M5590L4558L0502j4411L0805M7549K5274L2307J9377O358J7330
8622D56619j466k116J2570r636K2295j4500j3657k1504m138L141j253J0843N27
8609D37725k5208q732o4691j620l230J5404K5368m105j6376J1730J5087k1286
8597C60066m7601j2991J716M899k9357m2187j6929j921L0604n3094p0944K342
8585A24603M7413j3361j6301J3905o2137l1091K0379M8405J8551L466k9332K2539
8573A47039j0108k8289j5187m1600j9630O620j1940k1361K6629n323l1097r768
8561a4015k4410K0026L8039P591p982Q089q468M98M3993M1028m2677J3947K3470
8548I9129o5928m3336O832K2444j3763M5062J2284n4864k53K0494J8432N912J9951
$$ y = [165764, 181380, 226970, 261528, 292030, 277619, 308424, 355973, 381247, 413554, 432931, 439289, 456619, 455153, 453037, 465607, 455971, 478266, 463766, 450109, 428605, 424467, 427608, 426355, 437198, 437725, 412517, 403785, 339094, 337474, 334244, 349648, 375016, 370911, 354535, 366265, 381352, 360066, 312465, 299474, 301190, 306089, 276732, 234545, 217616, 215695, 246299, 193205, 122261, 124603, 172016, 158655, 142354, 156259, 94122, 63031, 83410, 131815, 150366, 153832, 124500, 147039, 136931, 108642, 93455, 51855, 32225, 38845, 26905, 5544, 32173, 26850, -4247, -14015, -38425, -18399, 19640, 27231, 19249, 27338, 18870, 19368, 63361, 104389, 61712, 75659, 99129, 33201, -10135, -3303, 19141, 5378, 50440, 62724, 7860, 7607, 28101, 46533, 52445, 72396]
8535G2396q222k129K0249l016k5410r5j5420J9359k2823L1063J9366n5996m6028
8522a6706j8711K5765M6738K692j4067K0735j819R902j3486p8067k2452M9990
8510i486N0524K6355J6594j3809R297l0551l5941K4958M0444k0417j2341l132
8498D2495l8828m9651j3803N2843L9401K8903m9511j3333N5858n1527j2951j7617
8486b7721m696K8192J7579O100J4027N320l5610l0285N429N2825p468K3968j136
8473D6524k2569n0402O926M3723L1996J5225N216k80r745J0730J917o7515k4697
8460a2951Q50K1284K9965k6224l310q716r285n230j1869K2773K3231L5074m91
8447E5101j4870K8677m7317m2157N7107N3064j5442j9600J9797n549l0167l5244
$$ y = [72396, 64174, 62045, 82294, 79278, 53868, 53773, 38353, 57712, 34889, 65952, 85318, 29322, -16706, -35417, -9652, 37086, 39778, 25711, 46446, 44627, 54529, 41043, -37024, -59476, -9486, 41038, 67393, 83987, 70178, 79475, 48924, 12983, 37941, 78385, 57968, 45627, 42495, 3667, -45984, -59787, -6944, 32457, 61360, 11849, -1484, 54374, 2847, -10104, -27721, -32417, -4225, 13354, 19454, 33481, 38801, 3191, -27094, -21665, 31160, 23692, 47660, 46524, 23955, -26447, -19521, 24202, 56198, 71423, 76639, 76359, 66614, 77344, 79261, 11746, -12951, -12101, 9183, 39148, 12924, 9614, 898, -8387, -13617, -25486, -2713, 20518, 55592, 55101, 40231, 68908, 21591, -20566, 36541, 89605, 74163, 54563, 74360, 68811, 38644, 3400]
8435C400J3735L9421j31L064n008l6084r2j9935o3958m2896O319K4803J6233J2020
8421d9109m111j2125K4838M7897K0425J416Q066k5709k7569O8330L0184J634P990
8408I2157r93j4568O382J4044N303M857k6237k1004K4262j2507l9517j0497j1399
8395A0283K747J486j280M9185K6027l0667j1842j1266n8858Q241K0482K9021L9208
8382G2767k7267k3155j4972j3239J9962Q676j0255K3951J8649J3311j726J095
8370F7797k8462m6512r660M4115m829r020J5916N317r031J2583j6809P734l1239
8357b100K0655l581o66M7313O75l0361J4882J9938L2379N791k3999m1016k6181
8344A3729q731N4201K0446k3878r839l1587J1037l694J3402o478k2891L2929m6087
$$ y = [3400, 17135, 56556, 56425, 59489, 54481, 18397, 18305, -1630, -65588, -108484, -102165, -77362, -61129, -49109, -53220, -65345, -40507, 7390, 27815, 29231, 37297, 11588, -15981, 52349, 82533, 84167, 92157, 91164, 76596, 82978, 97022, 102325, 107182, 80945, 59941, 84203, 71696, 32179, 21682, 10283, 13030, 14516, 13236, 62421, 88448, 57781, 45939, 34673, -24185, -15944, 4538, 33559, 72767, 45500, 22345, 7373, -5866, 14096, 22772, 12517, 36468, 55117, 68428, 66702, 67797, 39335, -7177, -16837, 27278, 22449, 13429, 29345, 34662, 25631, 38214, 21405, 29139, -2100, 18555, 14974, 14308, 61621, 62296, 31935, 46817, 66755, 99134, 104925, 80926, 39910, 13729, 4998, 59199, 79645, 55767, 45928, 14341, 25378, 21684, 35086, 28608, 5717, 38646, -7441]
8331g441j8075L0662J9491J4014n696J82P299M149l6249j9358J5242l2318j7109
8318d5207K3343L142K0913p714J2928j0305K3324K8044q676k4499r4571j3237
8306i2515N7639O5913L510j8882J9309m527Q709J1253J3214P465n613P192K1075
8293I3742O069m2717j9684k1216l0069K2412j3860K8683k3295j8891L988n210
8281b0048K5318N6187j5003k0998J551K8386J4288r262J2649J0372k8060l5553
8269A9827k6226o678K7863K7330j6488o1505L8447K0564j7648K4523K1590K0055
8257G1654m1907q312J0395q398M26J0278m5660l101o301J5990q469L036K5783
8244A5414j484k4219j5446J0866J373m380m53J4521J4083m971l641P684L9554
$$ y = [-7441, -25516, 5146, 24637, 38651, 32955, 33137, 40436, 44585, 8336, -11022, 4220, -28098, -45207, -21864, -18722, 2191, -5523, 7405, -2900, 20424, 48468, 39792, 15293, -79278, -92515, -34876, 31037, 34547, 15665, 34974, 30447, 39156, 50409, 63623, 71088, 65475, 72667, 93742, 99811, 57094, 37410, 16194, -13875, 8537, -5323, 23360, 65, -18826, -14838, -20048, 5270, 61457, 46454, 25456, 27007, 55393, 69681, 60419, 73068, 83440, 55380, 19827, -6399, -13077, 14786, 42116, 25628, -35877, 2570, 23134, 5486, 30009, 51599, 71654, 29747, 21435, 31830, 23432, 23858, 34136, -11524, -14625, -20926, -4936, -13405, -10369, 15414, 13930, -10289, -25735, -14869, -13496, -17876, -18329, -3808, 10275, 5304, 1663, 9347, 48901]
8231D8901L164k4695o3993l9424L0486n404Q07O060K7967k0449J7673J0826k4187
8218c2268N9754L2370K6723j2522l6101l2974j7215K8136L389m019L955J1800
8206C1028K9105n267k8195n5471R22M6899k9581j9909L0820j4937j3625K4107
8194d104j6422J4271j0454j4418K6366J6210j1748L317M4715K8624j2695l3190
8182C0472m1269k2862l4716K4355J9373J3828j8558K3867N4101j1242l1977J2437
8170A7809J6872K8442L5189k1696m8650J701M0442L0816k1471K8891K2610j443
8158A29512l0258j761l9665p7827k1782M3922j1902q131N1764J8697k4700K0876
8146D8745P186k3808m3177j9205K3237l6432J4334J857J2279K8414r452J0843
$$ y = [48901, 52065, 27370, -36623, -76047, -45561, -50965, -50158, -44098, -16131, -36580, -18907, -8081, -32268, 27486, 59856, 86579, 74057, 37956, 4982, -12233, 15903, 19292, 15273, 19228, 31028, 60133, 54866, 26671, -28800, -27878, 19021, -10560, -30469, 351, -14586, -28211, -4104, -20526, -6255, -16709, -31127, -4761, 11449, -299, 3018, 47733, 76357, 63662, 30472, -10797, -33659, -68375, -44020, -24647, -10819, -29377, -5510, 48591, 37349, 5372, 17809, 34681, 63123, 98312, 76616, 27966, 29667, 70109, 100925, 79454, 108345, 130955, 129512, 99254, 97493, 57828, -19999, -41781, 2141, -9761, -17892, 33872, 52569, 27869, 48745, 55931, 32123, -11054, -30259, -7022, -43454, -29120, -27263, -14984, 13430, 3978, 14821]
8134A4821m038k4835j311K9706L1185j6363p210P604k075L9439Q410J5276K6415
8121A17024J7335j1673J942J5374j0444j0523j2614Q418k9151l5632J003J272
8109E2331p525k1474M32k2381j4064L0394K9499J7311M690m4804j6528M3246L2821
8096H3948k6895n4432j0697o151j1430K840K6221j8584K3219R785j0743J8117
8084B5198L1035J7034n53K2477k7169o394R483j5056K1726m182K967j0757k2307
8071D3502m994J305m9744Q294L8959K0104M928K051M129l6988J9384L3074J4660
8058I8664J6960N399J7690J5663k9358q164O9907L3947J5760j5887O310l3911
8046A92980O414q855J6551k1396J8169J4296R035k2352R356j1022l9915j0472
$$ y = [14821, 10783, -14052, -15363, 14343, 45528, 29165, 21955, 29559, 27484, 66923, 75333, 90609, 117024, 134359, 122686, 124628, 140002, 129558, 119035, 106421, 114839, 85688, 50056, 51059, 52331, 44806, 23332, 23764, 1383, -12681, 17713, 47212, 64523, 69213, 24409, 7881, 51127, 83948, 57053, 2621, -8076, -14227, -25657, -22817, 3404, -15180, 8039, 17824, 7081, 25198, 56233, 73267, 72714, 95191, 68022, 61628, 71111, 56055, 77781, 73599, 76566, 65809, 43502, 38508, 39813, -9931, -1637, 37322, 57426, 62354, 64405, 68534, 31546, 50930, 84004, 98664, 115624, 121023, 138713, 154376, 125018, 116854, 186761, 220708, 236468, 220581, 226891, 192980, 199394, 190539, 207090, 185694, 203863, 218159, 227194, 204842, 214198, 203176, 163261, 152789]
8034A52789k0019l1130L1197k2706j4905P9756L0923k6174j6427K0063L5786J0944
8022B30097m246k7870l7927N2723N8311j0218R151M1273R1182O1389R9556R6210
8010F59631M4593J3862m1377r6037o2890k9565o7626n5349j9457K1301N8699M2001
7998D67786M0932J689j0322o8567p5183n2029l7509n818M872J7755j1778Q471
7986B80299l7034l6239Q062R696j3426n2516k630L1254k757O304j3041K0602j326
7973A97248J8279M2856N6962K2551J1603L814J5190K3844O1327N6767k3388k2584
7961D64469o3311m0805j3609J5210M4782O3989j8799k9157r4495o1278j8779N030
7949B53247m1983j3246k4719k0379j0269m949L4649j689m7974j3791K4406N715
$$ y = [152789, 132770, 101640, 132837, 110131, 95226, 174982, 205905, 179731, 163304, 183367, 219153, 230097, 225851, 197981, 160054, 212777, 271088, 260870, 270021, 311294, 402476, 463865, 563421, 659631, 704224, 718086, 676709, 580672, 517782, 488217, 420591, 365242, 345785, 367086, 425785, 467786, 508718, 510407, 500085, 431518, 356335, 304306, 266797, 260979, 265851, 283606, 271828, 280299, 243265, 207026, 215088, 224784, 211358, 158842, 156212, 187466, 184709, 191013, 177972, 198574, 197248, 215527, 258383, 315345, 337896, 349499, 353313, 368503, 392347, 453674, 510441, 487053, 464469, 401158, 360353, 346744, 361954, 406736, 470725, 451926, 422769, 328274, 266996, 248217, 253247, 211264, 198018, 173299, 152920, 142651, 137702, 172351, 170662, 122688, 108897, 133303, 139018]
7937A39018l3079k9306k480R915J9901k4971K0148K8675o943J7603L7266L4528
7925B10275O046o967K1261m064j5397j8849j3326m2489m0448R119p586L350O910
7912A07835j8349l5493n2813q325j2916n736M5808O10j8075K6577k118l3210j8990
7899b5195J7240J4846M145K1155J354K0128L3271j8822k7004l521J2713K7860
7887G8170K5757o463J2454o656l1703l3246j0998K2091J1048o016k487J388l7179
7874A6160k6336R395q507j9201O536r454R080m473l531K5206J2048J573P059O263
7860B1818N0739j9097l1049M230K2758l0511k9637M615M14J1252j6325l6245l5772
7847h2810L2848M6578m294k297J1237q349J2820l914K1148o961N391k7735l2063
$$ y = [139018, 105939, 76633, 74153, 84068, 103969, 78998, 99146, 127821, 120878, 138481, 175747, 210275, 216321, 209354, 230615, 226551, 211154, 192305, 178979, 136490, 96042, 105161, 97575, 100925, 107835, 89486, 53993, 1180, -7145, -20061, -25797, 20011, 20621, 2546, 29123, 27005, -6205, -25195, -7955, 6891, 11036, 32191, 33545, 53673, 86944, 68122, 41118, 37597, 50310, 78170, 103927, 97464, 109918, 103262, 71559, 38313, 27315, 49406, 60454, 54438, 51951, 53339, 16160, -10176, -781, -9288, -28489, -21953, -31407, -22327, -26800, -30331, -5125, 6923, 8496, 15555, 21818, 72557, 53460, 22411, 26641, 49399, 18888, -10749, -6134, -5720, 5532, -10793, -47038, -82810, -49962, -3384, -7678, -9975, 1262, -7087, 5733, 1819, 22967, 16006, 21397, -6338, -38401]
7834c8401l0882M2504L4506M994K5908J2704P025r080k7383r136k6399K0853K2853
7821C0066J584L1420l155k3251k4770K2507k1472j6819J2062n306k0606J2699
7809e041J6156j1372J5704k8116J3141K5335m73n433m8526N593K6830J6011o751
7796A3058l841k2770K9600L3404L347j0099N935p309R327J0157k9781l7139o133
7783a2244l4188m1558K9723O5347L2760r900l0968l2900K339K4100K0370O375
7771A9256r107L3266J8826k4380j883l1256l9541j954j252j198J8204J9669J4712
7758A3362m8129J5529K4300k749M517q720k1424l961o999R233r966L373Q206n383
7744b8811n0705K0098K0253K0834J9066J8487L078j7182L0300n5369n8887K3536
$$ y = [-38401, -69283, -26779, 7727, 12721, 38629, 51333, 58358, 49278, 21895, 12759, -13640, 7213, 30066, 31650, 63070, 59915, 36664, 11894, 34401, 12929, -3890, 8172, 2866, -17740, -5041, 11115, -257, 15447, -12669, 472, 25807, 25334, 19901, -28625, -23032, 3798, 19809, 13058, 9217, -13553, 16047, 49451, 52798, 42699, 48634, 41325, 50652, 60809, 31028, -6111, -12244, -46432, -87990, -58267, 7080, 39840, 29940, -1028, -33928, -31589, -7489, 12881, 19256, 10149, 43415, 62241, 37861, 35978, 4722, -34819, -36773, -38025, -39223, -21019, -1350, 13362, -34767, -19238, 5062, 2313, 6830, -1890, -23314, -27275, -34274, -25041, -35007, -31634, -23428, -28811, -79516, -59418, -39165, -18331, 735, 19222, 22300, 5118, 35418, -19951, -78838, -55302]
7732e5302J3411L5864K1643j3256j1949j0220k1827K0399K5231l5817l8867k2716
7720i3406O1709N4550J8638R746o2054l3953N999P592j762M8496O695j5890q285
7707a925j3463j749j1920j4364K3550j3756J7608R900R584o661l0525l0228Q254
7694e5695o729J8483M2061J5234q226j1487K2021k1997m4639M67K4921J0252K4610
7681I276k3475m2918k1994K5071L8855K1770p712J62q064Q857j5383o896P044
7668a5407K9151l7857j8979L6462R674l2943l8665L4799L190Q621Q36J9153k1990
7655b3955N185N597K1515L0936l6718L545K6829k8783k5578j5152n626k7133l4334
7642a03672l9053L2110Q5216L1949r948j8855O713J7135Q268j8161l711p752K4432
$$ y = [-55302, -41891, -6027, 15616, 2360, -9589, -19809, -41636, -21237, 3994, -31823, -70690, -93406, -31697, 22853, 41491, 51237, -10817, -44770, -38771, -31179, -32941, 15555, 22250, 6360, -1925, -15388, -17137, -29057, -43421, -19871, -33627, -16019, -6119, 3465, -3196, -33721, -63949, -55695, -62424, -43941, -1880, 13354, 5128, -6359, 15662, -6335, -50974, -50507, -25586, -15334, 9276, -14199, -57117, -79111, -54040, -15185, 6585, -1127, -965, -9029, -172, -15555, -22451, -15407, 13744, -24113, -43092, -6630, 3044, -29899, -68564, -33765, -30575, -21954, -21118, -1965, -23955, -18770, -13173, 8342, 39278, 2560, 6105, 32934, 4151, -21427, -36579, -42205, -69338, -103672, -142725, -110615, -25399, 6550, -3398, -22253, -15540, 1595, 9863, -8298, -12009, -19761, 4671]
7629D671k8650j3574r247J685P156l847n1341k4474J4083j8736L8197M2408J7205
7616b4464m5154l2054L6552K6528J8487J0917l9628J8433k386o10J0225k466l75
7603b5995Q704j2360k5603m73R895j2823M739J7248J6239k6906L1328L7458L8192
7590E9643P859m1448l845N2874k8842l9175k0411k6143l1934J9738O830J8267
7578b6587J4972O433l24L1242J1306k6399j4942j1482J4879J5333k7330J5288
7566B389Q45L0081K0161k1831J5845L0260k8795k1122M195k0141J2561J1450m9585
7553a3687L855J5455N228r516k6812J8170J1435k7915J8412j803j624m1636k229
7540e2667K2778k1072l8465R621L6763K0935K0143j9824j3786j210j4395J2704
$$ y = [4671, -23979, -37553, -46800, -45115, -37959, -41806, -93147, -117621, -103538, -122274, -84077, -41669, -24464, -69618, -101672, -65120, -38592, -20105, -9188, -48816, -30383, -32769, -33379, -23154, -25620, -25995, -17291, -29651, -55254, -55727, -45832, -58655, -53916, -36668, -20429, -47335, -16007, 21451, 59643, 67502, 26054, 22209, 75083, 46241, 7066, -13345, -39488, -71422, -51684, -44854, -26587, -11615, -5182, -5506, 25736, 37042, 10643, -4299, -15781, -902, 14431, -12899, 2389, 3234, 33315, 53476, 31645, 47490, 77750, 48955, 27833, 32028, 11887, 24448, 35898, -13687, -9832, 5623, 10851, 1335, -25477, -7307, 4128, -23787, -5375, -7178, -8802, -50438, -52667, -29889, -50961, -89426, -79805, -43042, -22107, -1964, -21788, -35574, -36784, -51179, -38475]
7528c8475K8580L1651l367j4703J0331J7808j1953k4403k7338j9420J6841K3835
7516a0613m853l0469j4470M8601L841l0543K2063p169O991Q46K3437K538j8442
7503h242j2839M5311K4151o710n738m767l7725j4510r08j9691j0181l960M2375
7490a3434L7765j362J774K0820J3366m7321q3470q336M8501J8793j9069R631L347
7477a8995L0392j5091n929L9808k8900k3119L225k2896J700l9368J7633L3755
7465b7785m730k4768Q637k4237K027P929L6685K750k0237M710L1119R094K6369
7452B7563K0913j4561k5629j0115k7442K568j686J899K8976K2697m654N1R484
7439C0064k4720n2220q952J3010N432n712K5820P697r335j6294k6468k086n2909
$$ y = [-38475, -9895, 21756, 18389, 3686, 14017, 31825, 19872, -4531, -31869, -51289, -34448, -10613, -15466, -45935, -60405, -11804, -7963, -38506, -16443, -23612, -16621, -15775, 7662, 10200, -8242, -21081, 24230, 48381, 41671, 35933, 31166, -6559, -21069, -21977, -41668, -51849, -55809, -13434, 24331, 22969, 24743, 45563, 58929, 11608, -71862, -80198, -31697, -12904, -31973, -22342, -18995, 11397, -3694, -9623, 30185, 1285, -21834, -18609, -41505, -39805, -79173, -61540, -27785, -32515, -57283, -48646, -72883, -70856, -62927, -26242, -23492, -43729, -39019, -7900, 1194, 27563, 48476, 33915, 8286, -1829, -29271, -26703, -28389, -26490, 2486, 25183, 20529, 20580, 30064, 5344, -46876, -55828, -42818, -37386, -43098, -17278, -9581, -18916, -35210, -61678, -63764, -116673]
7426a16673k350O9399L4305j0927k1464m6452J462j0432m348O3647K7987m2934
7414e8780j7899L7960L6457n0353j0748L6014K901n506k3968M7529L3923j7386
7402A0144K3j0404j6711q809j6396M6812r853n768l1527N537L5403j5252j1985
7389b8786k0189l7399k945L6283P3116J3197m9660n0597L8306N715O594K9032
7377A2667L0712K3792R615m4602j4372l8651k8114L8567K7990J067J9304M635
7365D2610j6084j8846J3850L1912k9998l5487M1198J873P103K7968k5991l1304
7353H804j0737L7730q008l5196j8298l7531m571J0135M3119j118l172n539M5959
7340B1577K4144K0799l411l867O252J301j6939j2238j5358j6493K7100k2948o762
$$ y = [-116673, -119023, -49624, -15319, -26246, -47710, -94162, -92700, -103132, -107480, -43833, -15846, -58780, -76679, -38719, -2262, -52615, -63363, -27349, -24448, -29954, -53922, -6393, 27530, 10144, 10167, -237, -16948, -25757, -42153, 4659, -5194, -10962, -42489, -36952, -1549, -16801, -28786, -48975, -86374, -89319, -53036, 20080, 33277, -16383, -66980, -28674, -22959, -16365, 12667, 43379, 67171, 76786, 32184, 17812, -20839, -48953, -10386, 17604, 18671, 37975, 42610, 26526, 7680, 21530, 53442, 23444, -12043, 29155, 31028, 38131, 66099, 40108, 8804, -1933, 35797, 27789, -7407, -25705, -63236, -67807, -57672, -14553, -15671, -18843, -24382, 21577, 45721, 66520, 63109, 59242, 65494, 66795, 49856, 37618, 22260, 5767, 32867, 9919, 3157]
7327C157Q385j0034j5091J3140J0729L4575k2722k0361Q130p037l9725J2205k0468
7314d5117J3340P934J5637J3792K8408n5002j4254J4683L6234o160J816l029K127
7301A0409k7414l0447J5707P883k4725M3874K1505M248l5290M0056L2607p142
7289E1271N220j3497k0649k5429j6165l097J9077K4829L0627k903p46k1312k5244
7276A982m5432k4520N2248K9208n0301j5171K0411K7972K5259j4054m5747q547
7264d6692p03K6358J3621m404O255L319m1505j57l755P840m758l2067M5025J0822
7250b0801L085K1940q279J1923K341J0238j3383L780L7299J9606p256K4301n7311
7237B7483j0218j4161j6236m731j0288j5606J421K578K9947j0251j4778k9445
$$ y = [3157, 11542, 1508, -13583, -443, 10286, 44861, 22139, 1778, 9908, 2871, -36854, -24649, -45117, -31777, -23843, -8206, 5586, 33994, -21008, -35262, -20579, 15655, 9495, 11311, 8282, 10409, -17005, -47452, -31745, -23862, -48587, -4713, 16792, 21040, -14250, 25806, 58413, 51271, 56491, 42994, 22345, -3084, -19249, -22346, -3269, 21560, 52187, 49284, 48538, 27226, 1982, -43450, -67970, -15722, 13486, -36815, -51986, -31575, -3603, 21656, 7602, -38145, -46692, -47395, -21037, -7416, -11820, -5565, -2246, -43751, -43908, -47663, -39823, -44581, -76648, -31623, -20801, -17716, 4224, -4055, 7868, 10209, 20447, 7064, 10844, 48143, 67749, 60493, 84794, 27483, 17265, 3104, -13132, -17863, -28151, -43757, -42336, -39758, -9811, -20062, -34840, -64285]
7225f4285J793L6625K3019L5281L3599j4826l7506l5476l6588J2636K4551N7133
7213C5956R860l6477k8965l3016o937J6683J8918M304j0162k9178k5397L0217
7201e4194K1948J9064L0875J2151n7241k429K3782O2575J5403j5557j7483K788
7189D1682l2718k3334P799k6597L6641J6138j7869q462n868O412n8428m6685K9769
7176h1520Q0181p161m5865O11P1186J5052m8612k6777J8504M6128k8893j6592
7164b3758K624J2204L1521J2608m4300J2015M173J0267K7022l4274l9680l2510
7152f2088K9443L517j7404l3590L0177K2246k7226j4742J1661L2777J0769J2008
7140b452m238Q043k9980o639K3545J4592K4387J9292j3649k2250j9714J8917r322
$$ y = [-64285, -62492, -25867, -2848, 32433, 66032, 51206, 13700, -21776, -58364, -45728, -21177, 35956, 45816, 9339, -19626, -52642, -59579, -42896, -23978, -19674, -29836, -59014, -84411, -54194, -32246, -13182, 17693, 29844, -27397, -29826, -6044, 56531, 71934, 56377, 38894, 41682, 8964, -14370, -6571, -33168, 3473, 19611, 1742, -6720, -12588, -6176, -64604, -111289, -81520, -1339, -8500, -54365, -53754, 17432, 32484, -16128, -42905, -24401, 21727, -7166, -23758, -21134, -8930, 22591, 35199, -9101, 2914, 7087, 17354, 44376, 10102, -29578, -62088, -32645, -29128, -46532, -80122, -49945, -27699, -54925, -69667, -58006, -25229, -14460, -2452, -6690, 1353, -28627, -35266, -11721, 2871, 27258, 46550, 32901, 10651, -9063, 9854, 532]
7127E32K6910k675k8813L1519k4013k9232L9616m685k5928l8170j8145M9892j1895
7114c5087j9328J716J251k2191N4913K4089J5458j6647m2292J846J181K2041L9846
7101B6796o629k0806m5361r980N7784M2289k9612j2659k0181J298l801n667k863
7088b9392r057j0094J7024J5187K7405J564k8043j2295R805l2154j5742j4568
7076h0360P764M8713M1873J8604J1402j4138m552m32k0008j6970p8023j2230M8173
7063e0184K303m805K4316J6110n782j7059K372J8903q466n892L2877l0277k7787
7050e3371K9358K8036m023l2182J9412K5149j1410J5018L2758L711J4418O280
7038G3154k7107l3987j5504k6901o223N5647J2779k2214R794j0904r956j2549
$$ y = [532, 27442, 24767, -4046, 27473, 3460, -25772, 13844, 9159, -16769, -54939, -73084, -23192, -35087, -54415, -52699, -51448, -73639, -18726, 5363, 20821, 4174, -38118, -36272, -35091, -13050, 26796, 20167, -639, -46000, -55980, 1804, 44093, 14481, 1822, -18359, -17061, -20862, -26529, -29392, -38449, -48543, -31519, -16332, 11073, 12637, -15406, -27701, -17896, -50050, -65792, -80360, -72596, -23883, 17990, 36594, 47996, 33858, 29306, 28874, 8866, -8104, -86127, -98357, -50184, -47881, -52686, -28370, -12260, -18042, -35101, -32729, -13826, -22292, -28184, 4693, -25584, -53371, -24013, 4023, 0, -32182, -12770, 12379, 969, 15987, 48745, 52456, 66874, 73154, 46047, 12060, -3444, -30345, -36568, 19079, 31858, 9644, 19438, 8534, -1422, -13971]
7026a3971j6277M2608L3068Q3P172k0429o7683n1424K0568M6676K9085k0259o2643
7013g3426l4267O462M5429J192L3484K3027J4593O39l5164J5605J8500j6659j1467
7000a2052k4717K8121n787j1610J1382L3095L2257r242m2472o8034J64K2902M6490
6987D97J9315J7710N748m988j2189k2381k2508L288J925N07M9809j0068J437M073
6973C2175N0054m2056p5804j2801K2571L7838P695o485M664j0467N298J456J83
6960A4321n842k5546j6344R01L573J4820n301j5460J6756L0082J2570j1660j2143
6947G27J8978K64l3887j9358J4752M7414M7326K716l8070l2330p3114k8046L7834
6934e4794J3828M1662j7415K0286J2061k210j9313o515k1154K5751K2820L5758
$$ y = [-13971, -30248, 12360, 45428, 45511, 52683, 32254, -35429, -86853, -66285, -19609, 9476, -10783, -73426, -107693, -101231, -55802, -54610, -21126, 1901, 16494, 17133, -18031, -2426, 16074, -585, -12052, -36769, -8648, -14435, -26045, -14663, 18432, 50689, 41447, -1025, -69059, -68895, -45993, 497, 19812, 37522, 43270, 38282, 26093, 3712, -18796, -15508, -13583, -13076, 36733, 26665, 28102, 32175, 82229, 40173, -35631, -48432, -25861, 11977, 19672, 13187, 17851, 7384, 12682, 14138, 14321, 8479, -17067, -33411, -32510, -28937, -14117, -19418, -34878, -18122, 11960, 24530, 12870, 727, 19705, 19969, -13918, -33276, -18524, 28890, 76216, 78932, 40862, 8532, -64582, -92628, -54794, -40966, 696, -16719, 3567, 15628, 13418, -5895, -12410, -33564, -7813, 15007, 50765]
6922E0765N19O215L1815j5531p7246n6998k0023N8633k2576j1941q025k5200L4766
6909e4827K999K2471k2103m46J9826j7586J7476R119R772J6438k5342J7436K1589
6896A6822L4806p451j8775K3009k6763j6901K4817j8240r346j0559L994J3362
6884H775l5986L652K8534j4972l4067r064M2867J9695k5533n4965j3974K7369
6872e7669J8701J7709p418l4847J8568R494p134k4950J5711K1774K1934k6394
6860c4521n808j4367j3255J7669Q236j339o208j7931o27L6674P433P749P7104
6847F0809m616l1452N98p905q84K1640n73J0750k9737l322k3904k9365M3498K3349
6833B8886k7805k7211Q785L6320r106j1732K418J4115L6020k1384J3965L8224
$$ y = [50765, 51284, 57499, 89314, 73783, -3463, -60461, -80484, -21851, -44427, -56368, -64393, -89593, -54827, -51828, -29357, -51460, -51906, -32080, -49666, -32190, -23071, -13299, 3139, -22203, -4767, 16822, 51628, 44177, 25402, 48411, 21648, 4747, 29564, 11324, 1978, -8581, -4587, 8775, -27211, -23559, 4975, -9997, -44064, -53128, -10261, 9434, -16099, -71064, -85038, -57669, -38968, -21259, -28677, -63524, -44956, -35462, -42596, -67546, -51835, -30061, -8127, -34521, -40329, -54696, -67951, -50282, -42046, -43385, -49593, -67524, -68151, -31477, -24044, -16295, 60809, 56193, 24741, 25339, 17434, 16550, 38190, 37617, 48367, 18630, 15308, -8596, -37961, 5537, 28886, 1081, -26130, -17345, 18975, 9869, -1863, 555, 14670, 50690, 29306, 43271, 81495]
6821H1495n0645n1569n777J5159L4004k286j4512j7715J1286k88j0356n775J3486
6808c493R152j7516j950K1795j971j4598k3672O479P448J2920M5737j4142j4472
6795A1717q039k3711j7443K9577p793j4914J0823J9372k684K562K5253k0085l8695
6782c4060l2304k5989l531L2159K9668l8993M622M6964J361k9656K9304M4847
6770B4392k1398N39L7422K0216j7675J6024K4626j0623k4579n3246m8405m054
6758e6761L8591K6445K5670o270L206J1566k9726j3551p864j4319O422K5414L9879
6745D8702l2278l2056J7168l643P110J5731l860j4470l2096k0921K5112K681L4827
6732A2007K0374K633p641m791K594L1946p630j0414L186J7665l7983m9111j4855
$$ y = [81495, 30850, -20719, -26496, -11337, 22667, 20381, 5869, -11846, -560, -848, -11204, -16979, -3493, 5659, -11857, -13807, 7988, 6017, -8581, -32253, -25774, -18326, -5406, 40331, 26189, 11717, 3678, -20033, -37476, -7899, -15692, -30606, -19783, -411, -3095, -533, 24720, 4635, -34060, -66364, -92353, -95884, -63725, -34057, -73050, -68428, -21464, -20103, -49759, -20455, 24392, 2994, 3533, 40955, 61171, 43496, 59520, 84146, 73523, 48944, -4302, -52707, -56761, -18170, 8275, 33945, 27675, 30881, 42447, 12721, -830, -8694, -23013, -16591, 8823, 48702, 16424, -15632, 1536, -2107, 5003, 20734, 16874, 2404, -29692, -50613, -25501, -22820, 12007, 32381, 35014, 27373, 22582, 25176, 57122, 49492, 39078, 42264, 59929, 21946, -27165, -42020]
6719d2020l0569o018L2184K9066K9748L050K2286l915l3204k2268j0943m99J9956
6706a3146k0060m5897M5013N1889P837M756l1949q094J7529q899j2166L9285J3332
6693C9430K518k2577j2452j1400N480Q111l2629j427M0909L1073J6579J4631l165
6680G5081r032m2608l7952J0712n4232j7659J7326L5977k0417M381L1830K897
6668c696K0963J4508n3747L8025R822l1092l634L1345j6358j4723p43p807L5305
6655A8168J8985k0661j3293j9828R638m262k1672L7332J3405l8058l0775j9474
6643g0495N1894L262m958j1436k9097k3350N618J2657L8275K1139K6555j9627
6631D37m589J9726K0957l1940q787J1788K3073K7091k8086j369M4163L7068n638
$$ y = [-42020, -72589, -78607, -46423, -17357, 12391, 15441, 37727, 33812, 608, -21660, -32603, -33102, -13146, -33206, -79103, -34090, 17799, 25636, 30392, -1557, -9651, 7878, -1021, -13187, 26098, 39430, 41948, 19371, 6919, -4481, 999, 9110, -23519, -24946, 15963, 47036, 63615, 78246, 75081, 66049, 23441, -14511, -3799, -58031, -75690, -58364, -22387, -42804, -38423, -6593, -3696, 17267, 31775, -21972, 16053, 25875, -5217, -8851, 22494, 6136, -8587, -9330, -17137, 18168, 37153, 16492, 3199, -16629, -6991, -11253, -32925, 4407, 17812, -20246, -51021, -70495, -18601, -15339, -20297, -31733, -60830, -84180, -78562, -65905, -27630, -6491, 20064, 437, -4152, 15574, 36531, 4591, -4196, 7592, 30665, 57756, 29670, 28301, 72464, 109532, 103894]
6618A03894m8580r8487l4220K393j2512J533J4700L9625N6050k7462O9100K7218
6606I3252l7924l6382m9167j3525m5641j1403K6373L750j6585N4794O7614J6104
6594E1260n5502o1061M3012K2034K7651J1858p682J8164J9150k5037m9001n0622
6582e5776L7922P316K3902l3042q82M1870l191j7218K1944Q51O937k2021o755
6569A857n7454r318r603n231M476J4497o458J7426L5935J8330M9901k6231k8835
6556g08Q673J8350p634r200K0139j0708L5823M4249n6643m2127r552K6330q92
6543A6100k3529j6428J5671l0854K4884l0449K4443L1795j19j428J1526j8290
6531C322j4450j4397K8173k2755k3844m2522K522L3283M3287K4737k5802O00k279
$$ y = [103894, 55314, -43173, -77393, -75000, -87512, -85979, -71279, -31654, 24396, -3066, 66034, 93252, 55328, 18946, -30221, -43746, -89387, -100790, -74417, -70667, -87252, -32458, 35156, 51260, -4242, -65303, -22291, -257, 27394, 39252, 31570, 49734, 68884, 43847, -5154, -55776, -17854, -10538, 13364, -19678, -20560, 21310, 18119, 901, 22845, 23696, 30633, 8612, 1857, -55597, -64915, -74518, -79749, -75273, -60776, -67234, -49808, -13873, 4457, 54358, 28127, -708, 7965, 26315, 18681, 9481, 29620, 18912, 54735, 98984, 42341, 214, -9338, 16992, 16100, -7429, -23857, -8186, -39040, -14156, -44605, -20162, 11633, 11514, 10086, 21612, 3322, -11128, -25525, 2648, -20107, -43951, -86473, -83951, -50668, -7381, 17356, -8446, -7846, -10125]
6518a0125J2678K1534k8037n900n9457k3377O897R352K8352N5311l08j690j3420
6505h190m6332p074K1704n216K724P214Q91L6313J503L622l8470l4597J8797K1756
6491b5355r781k5834m251K3608R177n3453k7606K0436O469O419k0998j0985L9029
6478g3125M5354P312l0740j207R715L3935P553L1776J5752O103R650m7069L2723
6465D7732J4664o3448n871L675j8284m3205r712N9282M193l080L3658j3086K4823
6452C1341J9710J8297j8809k3259j4501K1768J5419m618l7229m3780K6296P0179
6440F0814m5784j8617L236J265P405K5614n3932j6702K510j2715l066J6091L501
6427c0380n794R824l8800l5840K8529L616R274l0660K8195L1395K0626N229r889
$$ y = [-10125, 2553, 24087, -3950, -9850, -69307, -92684, -85787, -76435, -48083, 7228, 6920, 5230, -8190, -54522, -61596, -39892, -45108, -42384, -35170, -34279, 2034, 3537, 7159, -31311, -65908, -47111, -25355, -35136, -60970, -65221, -41613, -32436, -85889, -113495, -93059, -86590, -80171, -101169, -112154, -73125, -27771, -20459, -51199, -52406, -42691, -8756, -1203, 30573, 46325, 52428, 62078, 15009, 47732, 62396, -1052, -6923, -3248, -21532, -64737, -74449, -15167, -10974, -14054, 19604, 6518, 31341, 51051, 69348, 50539, 27280, 12779, 34547, 49966, 45348, 8119, -35661, -9365, 60814, 15030, -3587, -351, 914, 8319, 33933, -19999, -36701, -34191, -46906, -49972, -33881, -30380, -36174, -26350, -65150, -100990, -72461, -68845, -59571, -90231, -62036, -30641, -10015, -4786, -14675]
6414a4675j4626r299J0139L6999k3854k7518J5789k2392K0002J4478j3544n936
6402c4437k7459O47L9337j4101q26M2240K8568l4068m0681L3343M8979j3350o898
6389B1294l149k720L415j2983O416R03j8468N206N0291l0143l3838J4608J8523
6376A9355J7299l0483m7746L259J4734j8701K92j4253K5195M5155P401j0503l0290
6363a9286j4628j2880L8844j617k230Q45J2769j7126j9792k8257O7016l1388l8065
6350f5795J5509J5347l434M378L5048J2431O089J4618J0028j0228L1673j0296
6338E5368o2468p900J0679o983j461J1815k4579J1039Q84K0669J0391k3177k1144
6325b6867K4342J5781P911K973m3127k9246k4816k8255r766M4016J9895k7988
$$ y = [-14675, -29301, -38600, -28461, 8538, -15316, -42834, -27045, -49437, -29435, -14957, -28501, -34437, -61896, -61249, -21912, -36013, -36839, 5401, 33969, -99, -40780, -7437, 41542, 28192, 21294, 18145, 15425, 18840, 5857, 12273, 13176, -5292, -86, 50205, 20062, -13776, 832, 19355, 36654, 6171, -41575, -38316, -23582, -42283, -41991, -56244, -31049, 14106, 21507, 11004, -19286, -33914, -46794, -7950, -9567, -11797, -10952, 1817, -15309, -35101, -63358, 3658, -27730, -65795, -50286, -34939, -38373, -33995, 1053, 13484, 19573, 34191, 44219, 33991, 65664, 55368, -7100, -15000, -4321, -11304, -12765, -950, -25529, -14490, -13606, 7063, 17454, -5723, -26867, -2525, 13256, 21167, 24140, -18987, -48233, -73049, -101304, -111070, -67054, -47159, -75147]
6313g5147J7586L9284k468k0824k6815J7961L3379K5789j5486j7207l5560J7271
6301d2237R031L4128L1389j5989o3770L806J030J7271M9082M4537n945m5817p391
6288I125R586n932Q40q61q274K8478L738L355J0198k5796l1621J9539K9315M552
6274D6242n4189j6840o81O011q867O165Q453p280J0078K2352K2463L0107k071
6261F1943J2652k5941n0311l5545J6120L1227K0855m0947J4186O232k126k0530
6249a2185r440N305N0515K599l6527k1291J3241J343J6350J2393j6696k0934k4398
6236c9725K2809j2491n1930P175J9492M9748K6810j0268j1623j6982M372j4570
6224b7183k5589Q95r227K1747L8283r204l2342J223N734J0753k2823J5596M600
$$ y = [-75147, -57561, -18277, -20745, -41569, -68384, -50423, -17044, 8745, -6741, -23948, -59508, -42237, -33206, 922, 32311, 16322, -47448, -43642, -42612, -25341, 23741, 68278, 62333, 16516, 9125, 18711, 12779, 13619, 12758, 4484, 32962, 36700, 40055, 50253, 24457, -7164, 12375, 41690, 46242, -7947, -24787, -25468, -19457, -28324, -22159, -13706, -20986, -10908, 11444, 33907, 64014, 61943, 74595, 48654, -1657, -37202, -21082, 10145, 31000, -9947, 4239, 10471, 8345, -12185, -21625, -16320, 34195, 36794, 267, -21024, -7783, -6440, 9910, 22303, 5607, -15327, -39725, -16916, -29407, -81337, -74162, -54670, -4922, 21888, 11620, -3, -16985, -12613, -27183, -52772, -51877, -61104, -39357, -1074, -10278, -42620, -41397, -35663, -24910, -47733, -32137, -27537]
6211b7537K8269j4339r991k0659j77K5663l4337q5L3039K6057l6003j1820q119
6198e0039M1730M4170q852l7887J453L2662j183k0631J3919J9245J3840J7046
6186F5473l7474K654j1776L681j4459k860o51k6803J2931K8438R411j0738N661
6173B3488k2485l0007J8458J370N104j360j3819K6406J4638j2818J0180l7455
6161a8300J172M2772L344l337J1789L0664j2581l3691k0699p65K4991O585K348
6148C4292p36m6663l9919K3850J0452J0702J3103o6538k6493l505P814L2450J3656
6135c7535J2982Q169J6513O718k754l0442j7943J5054k924J4492j1644l4802q758
6122g2874O5818K3037k084k2942n193j1457r044j2258j3886l9367j3267P549K4473
$$ y = [-27537, 732, -13607, -23598, -44257, -44434, -18771, -53108, -53193, -20154, 5903, -30100, -41920, -50039, -8309, 35861, 27009, -10878, -9425, 23237, 22054, 1423, 15342, 34587, 48427, 65473, 27999, 30653, 18877, 22558, 8099, 5239, 4588, -22215, -9284, 19154, 28565, 17827, 23488, 1003, -29004, -10546, -9176, -4072, -5432, -19251, 7155, 21793, 8975, 19155, -18300, -17128, 25644, 28988, 25651, 37440, 68104, 55523, 21832, 1133, 368, 25359, 31944, 34292, 33556, -13107, -53026, -29176, -18724, -8022, 5081, -61457, -87950, -91455, -83641, -51191, -37535, -24553, -16384, 129, 6847, 4093, -26349, -44292, -29238, -32162, -17670, -29314, -64116, -72874, -7056, 15981, 13897, -9045, -14238, -25695, -34739, -46997, -60883, -100250, -113517, -105968, -81495]
6109h1495J9371O4512L4954l6330r15l2995N1941l143m5612Q249j1747n7916M5469
6096d5657J6741J3144J5836J8613J7248l072k0772o113L800P96k1610j367p55
6083a3168J3970m421J1025L225k3434j7921q87J959M169l674j1406n887p781L4023
6069b0208K1312j6108N671L5657k5161j4228L475J3422J0391R069k0865k019N075
6056E483K44j2378j7551q054l4345L9721J1524J9117k4107j5394K2712J7107r483
6043e404l6544P131n0917J6960L1317L661R295L5867R254k9400k6580J2313Q346
6030a4701J530J4744J1340J7947k1616j1612j8075k2025m99m5554Q215K0257q35
6017f0884k1156J2922M1331K7102k6062R210l823K2504J0495k4867l4505k0325
$$ y = [-81495, -62124, 2388, 37342, 1012, 97, -32898, 19043, 15900, -29712, -21463, -33210, -91126, -45657, -28916, -15772, 64, 18677, 35925, 32853, 12081, 5968, 9768, 10564, -11046, -12413, -13168, 802, -3619, 7406, 10631, -12803, -30724, -31611, -29652, -25483, -29157, -40563, -46450, -54231, -20208, 1104, -15004, -9333, 26324, 1163, -13065, -9590, 3832, 14223, 23292, 2427, 408, 5483, 5727, -6651, -24202, -32256, -66601, -26880, -15356, 3761, -20346, -35740, -13028, 4079, -5404, -41948, -34817, -85734, -68774, -37457, -33796, -24501, 11366, 20620, -8780, -35360, -23047, -14701, -13171, 1573, 12913, 30860, 9244, -2368, -20443, -42468, -42967, -88521, -80306, -60049, -60884, -82040, -69118, -27787, -685, -26747, -17537, -21360, 1144, 11639, -13228, -47733, -68058]
6005f8058L3867J7480Q406j9570j8011J7390j6138l1701N5338M2474K8560q550
5993D1487J2792o0723l7083J5918k8056K9324m1172j2477Q86K7578K663Q501L1199
5980i163L2145K0180R861o3372l4247J2625L0568m2n819Q37M276o147j4606j1733
5966c4637m140K7461K3253q052l7242j8826J2413n803j2232j7202J9812J7116
5954c8079M0324R449n4647k8600l9552O0570K9893j9124k3801J4635L3734m170
5942a9368n669K6084J9900q335k5026K104r082J2827L411j752o182K3228J0509
5929B2649N863j148R220J7226j9930j4639N135q610L0819K8441N433J4990M631
5916A00080o399l3917o848l2033j9212o999k560p28m609l603N235j7202n283K6368
$$ y = [-68058, -34191, -16711, -8305, -27875, -45886, -28496, -44634, -76335, -20997, 21477, 50037, 41487, 54279, -6444, -43527, -27609, -55665, -26341, -67513, -79990, -79104, -51526, -48863, -40362, -9163, 22982, 43162, 53023, -10349, -44596, -31971, -1403, -1445, -7264, -6427, -2151, -8298, -22904, -34637, -38777, -11316, 11937, 3885, -33357, -52183, -39770, -45573, -57805, -75007, -55195, -38079, 2245, 11694, -42953, -71553, -111105, -50535, -20642, -39766, -63567, -48932, -15198, -19368, -25037, 1047, 20947, 12612, -12414, -10310, -19392, -6565, -3154, -4906, -11088, 12140, 22649, 28512, 27364, 36584, 53810, 33880, 19241, 24376, 15766, 46585, 75026, 80459, 95449, 100080, 93681, 59764, 52916, 20883, 1671, -5328, -7888, -8616, -13225, -16828, -11593, -28795, -34078, -7710]
5902g710J3668K5084L4945M9203k6340n1109m6033j6050q699n396k822L6525L8271
5889C3537L7346L0o434j0909K61j5410J4639j1236j4437k4848L316l2486k337
5876b8968J488j573J9304K3338j8599J1783J0369J614k8721k3732O8169L8874
5864G3346j7514o965n6618m1649o97R477N52R44L9959j0398j4918J5924J077K5384
5850A7904n2324l6083L8781N0324J754k6166k3580J4565M1056l2902m1994j8174
5838f6839J4618K9563K6714K158j5494K901L4012m083J595l3461k0847k5607k2293
5825g7063l901K2586j3229j1038N0730J4462N350j2125J0618J6791k145j3317
5813a2281q448j3856j4404J5766J8596J0169K8575k9493j3309j4533j4615P902
$$ y = [-7710, 5958, 31042, 65987, 115190, 88850, 37741, -8292, -24342, -33041, -38437, -41259, -4734, 33537, 70883, 70913, 64479, 53570, 53831, 38421, 53060, 41824, 27387, 2539, 5855, -26631, -28968, -27480, -29053, -9749, 13589, -5010, 6773, 17142, 18756, -9965, -33697, 34472, 73346, 55832, 48867, -7751, -49400, -50097, -40620, -40068, -39124, 835, -9563, -24481, -8557, -7480, 17904, -34420, -70503, -31722, 18602, 20356, -5810, -29390, -14825, 26231, -6671, -48665, -66839, -52221, -22658, 4056, 6214, -9280, -6379, 27633, 23550, 25145, -8316, -29163, -54770, -77063, -80964, -58378, -71607, -82645, -31915, -17453, -12103, -24228, -13610, 3181, 1036, -12281, -20729, -34585, -48989, -33223, -14627, -4458, 24117, -5376, -18685, -33218, -47833, -39931]
5801c9931L4563k7075m405n61k899J4206j0190J9990k099K4529J6928l2418l4930
5788d4292J4155L7283R74p875m013m116K3886j4442l6326J7120P0373L343J4379
5775G0449j2871m4004l1989l2454m8601k560J0226K6679L0275j7320j3963K0308
5763d5825L8124M8318l3777k2400J4869k6738O44J4979k4782l9554L6452N9790
5751B0100J2017j1072n683m5899J3307j6338m511M3429k8017o305L3895K58L668
5738H849K0983l3368j9622Q337K0420m012P573k8796m9674q586K4240M322J0125
5725c9209K0121R946M9094N8308k8154l3328j1988O459P995J8677r3945p5714
5713a11738R199J5665O2324K9247l0183q992L8820M5939N607j3357O034J5564
$$ y = [-39931, -5368, -32443, -36848, -37409, -40308, -26102, -36292, -16302, -18401, 6128, 23056, -9362, -44292, -30137, 7146, 8120, 245, -3768, -7884, 16002, 1560, -34766, -17646, 52727, 56070, 70449, 57578, 13574, -18415, -50869, -99470, -102030, -91804, -65125, -34850, -52170, -66133, -45825, -7701, 40617, 6840, -15560, -691, -27429, -26785, -11806, -36588, -76142, -39690, 20100, 32117, 21045, 15362, -30537, -17230, -33568, -38079, 5350, -22667, -28972, 4923, 5181, 8849, 29832, -3536, -23158, -14821, 5599, 1587, 9160, -19636, -69310, -77896, -53656, -49334, -39209, -19088, -9142, 39952, 98260, 70106, 36778, 24790, 31249, 39244, 57921, -36024, -111738, -102539, -86874, -24550, 4697, -25486, -34478, 4342, 50281, 55888, 42531, 48565, 64129]
5701F4129j4155m4071l1818l969j5781K563J9849n911J5801P934k0629m001l2788
5688f2847J3741j5106Q078L349j8018R551m418m3265j7085j2715L3797L6854L1141
5675c6943K9285L8447L6063p458j2413m7865m723O107m7261J9263K5396n6422
5663e8524r348K8257m336n116K3477M4485L1520K168O82n9448k1595m0412j5340
5650h3530M9395N2849N5062k3683l3028j4373k2981j3601o937L6708K9648j9173
5638F356k7360m591K1775j9668L492Q719J179J575K702l3681Q539K8852j2858
5625a4969p3707k2760O581K1370M4053J5009O563j1314j2608J5473M1436l3110
5613a7983k3415l829j1405K6357J81j6229j0899j3945L9454j0091j6934J2105
$$ y = [64129, 49974, 5903, -25915, -29884, -45665, -43102, -23253, -29164, -13363, -5429, -26058, -30059, -62847, -49106, -64212, -56134, -52785, -70803, -61252, -65670, -108935, -126020, -138735, -104938, -68084, -36943, -7658, 30789, 66852, 59394, 46981, -884, -5607, 500, -46761, -27498, -2102, -58524, -67872, -39615, -43951, -49067, -25590, 18895, 50415, 52583, 53265, -6183, -27778, -68190, -83530, -34135, 18714, 73776, 50093, 17065, 2692, -20289, -33890, -40827, -4119, 25529, 6356, -21004, -25595, -3820, -23488, -19996, -11277, -10098, -8523, -5821, -39502, -30963, -2111, -14969, -88676, -111436, -104855, -83485, -39432, -24423, -17860, -29174, -41782, -26309, 15127, -17983, -41398, -45227, -56632, -30275, -30094, -46323, -57222, -71167, -31713, -41804, -58738, -46633]
5601d6633M3113J2439k9958Q608L2207L4052K6269J0650k3475m857j2167l891
5589D6357o946o802j2105J3579O05n622J9129n1765j7982n2679p993M1761Q147
5576c2316j561K2718J3630J3715k977N148l5528m6954K8254M6200q499k3283k795
5563b4248R976J0853j8826l6879l542K1852J4134K8516L5874k2195j1132J1700
5551A6083l563m600K536P014r020l863m1434j5373k0755K8769N7042J4238O407
5538C3481k6246m4000k3779J3421M4105M0545j5775l876l3375K8560J101p909
5526F253M1569Q118k1588n6813J3044J348O022j6249M830J6923k6341N110k3480
5513d1254P290r391M028N3571J8655j745l7925r581j2514P391J1790J4393K7761
$$ y = [-46633, -3520, 8919, -21039, -12431, 19776, 53828, 80097, 90747, 67272, 62415, 50248, 46357, 39411, 32609, 20504, 34083, 34688, 29066, 48195, -3570, -21552, -74231, -82224, -40463, -32316, -33877, -11159, 2471, 16186, 13209, 18357, -17171, -64125, -35871, 10329, 1830, -21453, -24248, -14272, -3419, -22245, -59124, -62666, -40814, -26680, 1836, 37710, 15515, 4383, 16083, 12520, 7920, 10456, 17470, 8450, 4587, -36847, -52220, -72975, -44206, 12836, 27074, 33481, 7235, -36765, -60544, -47123, -3018, 37527, 21752, 17876, -15499, 13061, 14162, 6253, 47822, 55940, 34352, -22461, -9417, -8069, -2047, -18296, -13466, 3457, -22884, -17774, -41254, -33964, -43355, -39327, 14244, 32899, 31154, -6771, -16352, -28866, -21475, -9685, 4708, 32469]
5500C2469j2533j9295k375K0417J1471r97m3736j3456p506p613j1706k8377L4694
5487d8543J149P159K3075L1893M1245J0191j8739m9808j0155k5124R160Q974J3966
5474e557j0948N863J8055r609k6177j5371K047j7938Q932j2895K976J8151r563
5461e2034N706L2088K8837K3921j9135k0672K7933K1158k2236j8665j7318j9980
5449c0397k415n788N41j9697j1127K9993L8852K515L740k4852m10j0387L6858
5436G426J9381l0081j8896j33J7727k8145p422K2055p95j4846j458J6391k7175
5423d5971m300M030R011L963Q981j1433R001L755O297L545m3049n4925K6855P0793
5409a3447M3496l255J756m281J4798J26K833m7159O563M0813K4106J8399l2422
$$ y = [32469, 19936, 641, -1734, 18683, 30154, 29157, -14579, -28035, -35541, -43154, -54860, -83237, -48543, -47394, -40235, -17160, 14733, 55978, 66169, 47430, -2378, -12533, -37657, -28497, -19523, -5557, -16505, -10642, 7413, -2196, -28373, -43744, -41697, -59635, -50703, -63598, -60622, -42471, -52034, -46328, -14240, 14597, 38518, 19383, -1289, 26644, 47802, 25566, 6901, -10417, -30397, -32812, -38600, -38059, -57756, -68883, -38890, -38, 2477, 6217, -18635, -19045, -29432, 7426, 26807, -3274, -22170, -22303, -4576, -32721, -40143, -18088, -18883, -33729, -35187, -18796, -45971, -50271, -46241, -37230, -33267, -24286, -35719, -26718, -22963, -16666, -13121, -56170, -111095, -84240, -13447, 30049, 26794, 28550, 24269, 39067, 39193, 42026, -5133, 1430, 42243, 66349, 84748, 52326]
5396E2326k7734j2227q828n215R329J3113m0249l6204J9592J0571N16k1472K2242
5383b4240K1130l9167M182J169M237j0931l388O087j9493J7844M4451n229n1322
5370e4670J5750K2200R081k94J4504K0463j5709j6517M1398L8418j2517k1174
5358D0933j9266O070J9327l04q413k7286k6111l7415k040J4612j3680O433J7272
5345b9868K2984M7948J7874M2256j0374j6254l9671k25k8991l1690N1215l700
5333B1504J8069L2274o3284n5955j0575N4757L6338K1858l106j486l2658J749
5321A9485k079r986q136R878k2599o354K1697K2499k161m2796k0545j5156L4379
5308b1874j0600l1630R356L5042l442k3931P867l3119k871p017L4393J8699K4629
$$ y = [52326, 24592, 12365, 3537, -1678, 7651, 20764, -19485, -55689, -36097, -25526, -25010, -46482, -24240, -3110, -42277, -38095, -36926, -32689, -43620, -47008, -40921, -60414, -42570, 1881, -3348, -54670, -38920, -16720, -7639, -7933, 6571, 27034, 11325, -5192, 36206, 74624, 62107, 40933, 21667, 27737, 47064, 46760, 38347, 11061, -15050, -52465, -54505, -39893, -53573, -47140, -29868, -6884, 41064, 58938, 101194, 90820, 74566, 34895, 34670, 5679, -26011, 25204, 21504, 39573, 71847, 8563, -47392, -57967, -3210, 33128, 54986, 51880, 50394, 17736, 19485, 17406, 7420, -716, 9162, -13437, -19791, 1906, 24405, 22244, -20552, -41097, -56253, -21874, -32474, -64104, -54748, -19706, -23148, -47079, -39212, -72331, -75202, -82219, -47826, -29127, -4498]
5295d498Q273j9242l3062k2240J5990K1611m373P914N3374K2407l040q808l7260
5282b954N0179O140k6507q186n0j348m029p64Q078P748r06l9421k3970k4011m2767
5267a02768j2207N4826O3465j4864l1495K2069K3661K8938k0103L981j2899o366
5255c762K5702K6118m9282p802j5209j2755P172n1391o724M5719j1218j4658R578
5242e8512J6979K2369L9531P806K3512K0120k9810k2063M640J207Q169l507n6429
5229b5988k1235R2926J0900k2552N20k481r375j4072k0724J8661j1347P673L985
5216F891k2999j4364j239j6292K8624j1179l7229k1686N5480L7791L7454m125
5204C7127o3166m4789J3686J64M6835J9025l3150j3298j3636K3343J2489L7523
$$ y = [-4498, 3775, -15467, -48529, -70769, -54779, -33168, -37541, -29627, 23747, 46154, 43114, 34306, -2954, 47225, 53365, 26858, 18672, 18622, 17274, 13245, 12481, 20559, 28307, 27401, -12020, -35990, -60001, -102768, -114975, -60149, 3316, -11548, -43043, -20974, 2687, 31625, 11522, 15503, 2604, -3762, 21940, 48058, -1224, -9026, -24235, -36990, -29818, -81209, -87933, -42214, -53432, -68090, -58512, -41533, -19164, 20367, 28173, 51685, 71805, 41995, 19932, 24572, 25779, 33948, 30441, -25988, -47223, 45703, 56603, 34051, 34571, 32090, 22715, 8643, -12081, 6580, -4767, 2906, 6891, -16108, -30472, -31711, -48003, -19379, -30558, -67787, -89473, -33993, 3798, 41252, 37127, -26039, -70828, -57142, -56978, -10143, 8882, -24268, -37566, -51202, -27859, -15370, 22153]
5192B2153J9564n724k187k9167m2053M323K3231J6030R546k3102R589j1480K3494
5179A4217j4638j9054p217Q593j2934l490j4773J7366L9401j4298j6555m610M621
$$ y = [22153, 41717, 35993, 33806, 4639, -37414, -33091, -9860, 6170, 15716, -7386, 2203, -9277, 14217, -421, -19475, -26692, -18099, -31033, -34523, -49296, -31930, 7471, -6827, -23382, -27992, -23371]
$$ [...]
##END NTUPLES=NMR SPECTRUM
##END=
