##TITLE=Analysis number 313439
Compound Code cc 02110
Book Reference 439/58/31
Project Code adrs
Chemist Name ronp
##JCAMPDX= 6.0         $$ Bruker NMR JCAMP-DX V2.0
##DATA TYPE= NMR SPECTRUM
##DATA CLASS= NTUPLES
##ORIGIN= Bruker BioSpin GmbH
##OWNER= NMR
$$ XWIN-NMR		Version 3.5
$$ Thu Sep  8 10:31:01 2005 GMT Daylight Time (UT+1h)  MAYBRIDGE\NMR@NMR_250MHZ
##.OBSERVE FREQUENCY= 250.131544655141
##.OBSERVE NUCLEUS= ^1H
##.ACQUISITION MODE= SIMULTANEOUS (DQD)
##.ACQUISITION SCHEME= undefined
##.AVERAGES= 16
##.DIGITISER RES= 18
##SPECTROMETER/DATA SYSTEM= dpx250
##.PULSE SEQUENCE= zg30
##.SOLVENT NAME= CDCl3
##.SHIFT REFERENCE= (INTERNAL, CDCl3, 0, 16.4313)
##AUDIT TRAIL= $$ (NUMBER, WHEN, WHO, WHERE, WHAT)
$$ ##TITLE= Audit trail, XWIN-NMR		Version 3.5
$$ ##JCAMPDX= 5.01
$$ ##ORIGIN= Bruker BioSpin GmbH
$$ ##OWNER= NMR
$$ C:\u/data/dgb/nmr/ADRS/9080/pdata/1/auditp.txt
$$ ##AUDIT TRAIL=  $$ (NUMBER, WHEN, WHO, WHERE, WHAT)
(   1,<2005-09-08 10:30:39.83 +100>,<MAYBRIDGE\NMR>,<NMR_250MHZ>,
      <created by zg, POWCHK disabled, PULCHK disabled
       configuration hash MD5:
       62 19 C7 07 E1 42 D1 B7 37 6C 3D D0 77 39 F9 E6
       data hash MD5: 64K
       DD 31 25 0B 9B 2E E3 69 7D 7B 42 A3 83 20 AC C0>)
(   2,<2005-09-08 10:30:52.69 +100>,<MAYBRIDGE\NMR>,<NMR_250MHZ>,
      <Start of raw data processing
       ef LB = 0.3 FT_mod = 6 PKNL = 1 SI = 32K 
       data hash MD5: 32K
       DD 36 17 AD 7D FC AD 13 77 22 B1 7E EC 6D 24 C2>)
(   3,<2005-09-08 10:30:54.72 +100>,<MAYBRIDGE\NMR>,<NMR_250MHZ>,
      <apk 
       data hash MD5: 32K
       78 90 12 5E E6 C4 42 54 92 A8 4E 19 12 2C 97 4E>)
(   4,<2005-09-08 10:30:55.41 +100>,<MAYBRIDGE\NMR>,<NMR_250MHZ>,
      <abs ABSG = 5 
       data hash MD5: 32K
       08 E6 09 EB 0B 6C 91 12 1A DC B7 18 72 B9 92 07>)
$$ ##END=
$$ 
$$ hash MD5
$$ 7D EC AC 9D 97 38 CA C3 A8 50 B2 44 C7 D8 55 37
##$RELAX= 
##$RELAX= 
##$RELAX= 
##$RELAX= 
##$RELAX= 
##$RELAX= 
##$RELAX= 
$$ Bruker specific parameters
$$ --------------------------
##$DU= <C:\u>
##$EXPNO= 9080
##$NAME= <ADRS>
##$PROCNO= 1
##$TYPE= <nmr>
##$USER= <dgb>
##$AMP= (0..31)
100 100 100 100 100 100 100 100 100 100 100 100 100 100 100 100 100 100 
100 100 100 100 100 100 100 100 100 100 100 100 100 100 
##$AQSEQ= 0
##$AQ_mod= 3
##$AUNM= <au_zg>
##$AUTOPOS= <5 >
##$BF1= 250.13
##$BF2= 250.13
##$BF3= 250.13
##$BF4= 250.13
##$BF5= 500.13
##$BF6= 500.13
##$BF7= 500.13
##$BF8= 500.13
##$BYTORDA= 1
##$CFDGTYP= 0
##$CFRGTYP= 5
##$CHEMSTR= <none>
##$CNST= (0..31)
1 1 145 1 1 1 1 1 1 1 1 1 1 1 1 1 1 1 1 1 1 1 1 1 1 1 1 1 1 1 1 1 
##$CPDPRG= <>
##$CPDPRG1= <>
##$CPDPRG2= <>
##$CPDPRG3= <>
##$CPDPRG4= <mlev>
##$CPDPRG5= <mlev>
##$CPDPRG6= <mlev>
##$CPDPRG7= <mlev>
##$CPDPRG8= <mlev>
##$CPDPRGB= <>
##$CPDPRGT= <>
##$D= (0..31)
0 1 0 0 0 0 0 0 0 0.06 0 0 0 0 0 0 0.0002 0 0 0 0 0 0 0 0 0 0 0 0 0 0 
0 
##$DATE= 1126171838
##$DBL= (0..7)
120 120 120 120 120 120 120 120 
##$DBP= (0..7)
150 150 150 150 150 150 150 150 
##$DBP07= 0
##$DBPNAM0= <>
##$DBPNAM1= <>
$$ [...]
##$SUBNAM7= <"">
##$SUBNAM8= <"">
##$SUBNAM9= <"">
##$SW= 20.6930455092707
##$SWIBOX= (0..15)
0 0 3 0 0 0 0 0 0 0 0 0 0 0 0 0 
##$SW_h= 5175.983436853
##$TD= 65536
##$TD0= 1
##$TE= 295.16
##$TE2= 300
##$TE3= 300
##$TEG= 300
##$TL= (0..7)
0 120 120 120 120 120 120 120 
##$TP= (0..7)
150 150 150 150 150 150 150 150 
##$TP07= 0
##$TPNAME0= <>
##$TPNAME1= <>
##$TPNAME2= <>
##$TPNAME3= <>
##$TPNAME4= <>
##$TPNAME5= <>
##$TPNAME6= <>
##$TPNAME7= <>
##$TPOAL= (0..7)
0.5 0.5 0.5 0.5 0.5 0.5 0.5 0.5 
##$TPOFFS= (0..7)
0 0 0 0 0 0 0 0 
##$TUNHIN= 0
##$TUNHOUT= 0
##$TUNXOUT= 0
##$USERA1= <user>
##$USERA2= <user>
##$USERA3= <user>
##$USERA4= <user>
##$USERA5= <user>
##$V9= 5
##$VALIST= <valist>
##$VCLIST= <CCCCCCCCCCCCCCC>
##$VD= 0
##$VDLIST= <DDDDDDDDDDDDDDD>
##$VPLIST= <PPPPPPPPPPPPPPP>
##$VTLIST= <TTTTTTTTTTTTTTT>
##$WBST= 1024
##$WBSW= 4
##$XGAIN= (0..3)
0 0 0 0 
##$XL= 0
##$YL= 0
##$YMAX_a= 522535
##$YMIN_a= -480547
##$ZGOPTNS= <>
##$ZL1= 120
##$ZL2= 120
##$ZL3= 120
##$ZL4= 120
##$ABSF1= 16.43132
##$ABSF2= -4.26185
##$ABSG= 5
##$ABSL= 3
##$ALPHA= 0
##$AQORDER= 0
##$ASSFAC= 0
##$ASSFACI= 0
##$ASSFACX= 0
##$ASSWID= 0
##$AUNMP= <proc_1d>
##$AZFE= 0.1
##$AZFW= 0.1
##$BCFW= 0
##$BC_mod= 0
##$BYTORDP= 0
##$COROFFS= 0
##$CY= 12.5
##$DATMOD= 1
##$DC= 0
##$DFILT= <>
##$DTYPP= 0
##$F1P= 14.0000005364418
##$F2P= -0.99999901652339
##$FCOR= 0.5
##$FTSIZE= 32768
##$FT_mod= 6
##$GAMMA= 0
##$GB= 0
##$INTBC= 1
##$INTSCL= 1
##$ISEN= 128
##$LB= 0.3
##$LEV0= 0
##$LPBIN= 0
##$MAXI= 10000
##$MC2= 0
##$MEAN= 0
##$ME_mod= 0
##$MI= 0
##$NCOEF= 0
##$NC_proc= -3
##$NLEV= 6
##$NOISF1= 0
##$NOISF2= 0
##$NSP= 0
##$NTH_PI= 0
##$NZP= 0
##$OFFSET= 16.43132
##$PC= 1
##$PHC0= -73.00067
##$PHC1= -11.27236
##$PH_mod= 1
##$PKNL= yes
##$PPARMOD= 0
##$PSCAL= 4
##$PSIGN= 0
##$REVERSE= no
##$SF= 250.130022679731
##$SI= 32768
##$SIGF1= 0
##$SIGF2= 0
##$SINO= 400
##$SIOLD= 32768
##$SREGLST= <1H.CDCl3>
##$SSB= 0
##$STSI= 32768
##$STSR= 0
##$SW_p= 5175.98343685301
##$SYMM= 0
##$S_DEV= 0
##$TDeff= 65536
##$TDoff= 0
##$TI= <Analysis number 999999
Compound Code 99
Book Reference 9
Project Code 9>
##$TILT= no
##$TM1= 0
##$TM2= 0
##$TOPLEV= 0
##$USERP1= <user>
##$USERP2= <user>
##$USERP3= <user>
##$USERP4= <user>
##$USERP5= <user>
##$WDW= 1
##$XDIM= 32768
##$YMAX_p= 324366386
##$YMIN_p= -78454
$$ End of Bruker specific parameters
$$ ---------------------------------
##NTUPLES= NMR SPECTRUM
##VAR_NAME=  FREQUENCY,     SPECTRUM/REAL,   SPECTRUM/IMAG
##SYMBOL=    X,             R,               I
##VAR_TYPE=  INDEPENDENT,   DEPENDENT,       DEPENDENT
##VAR_FORM=  AFFN,          ASDF,            ASDF
##VAR_DIM=   32768,         32768,           32768
##UNITS=     HZ,            ARBITRARY UNITS, ARBITRARY UNITS
##FACTOR=    0.157963299565203, 1,           1
##FIRST=     4109.9664918901, 0,             0
##LAST=      -1066.01694496291, 0,           0
##MIN=       -1066.01694496291, -78454,      0
##MAX=       4109.9664918901, 324366386,     0
$$ Real data points
##PAGE= N=1
##DATA TABLE= (X++(R..R)), XYDATA
$$ [...]
24850A043J7612J589j7708j5823O352J4827l346l851n065j830J6448k755j5379
24837g886n050N554J4204J2308j2766q390j0691p2k022j410J0382J7645j0611
24824A195M966Q450Q51o228p089m754O92M900p117k08Q884j0374O886O093R129
24809A6276L713l809j859j2806l696J4047J0383M037j2216J135k840J046K693
24796A6104L104q188o337q388O274O730N57p044o960j385o637m87Q443J7515P08
24781A4009j1976j836O281Q142n870j2774k451m249o601K30L812O894O944N311
24767E866O53k934m829p178J5376J4573J987j6587l739N273k566j3963p254N683
24753i639R515J669l410L448J8300M978j1112m795o087J538J1333m501j1190j2547
$$ plain form
24850 1043 18655 20244 2536 -13287 -6935 7892 4546 695 -4370 -6200 10248 7493 -7886
24837 -7886 -12936 -7382 6822 19130 6364 -2026 -12717 -12789 -14811 -16221 -5839 11806 1195
24824 1195 6161 14611 15462 9234 2145 -2609 -1917 2983 -4134 -4342 4542 -5832 1054 7147 16276
24809 16276 19989 16180 14321 1515 -2181 11866 22249 26286 14070 15205 12365 13411 16104
24796 16104 19208 11020 4683 -3705 2569 9299 9856 2812 -4148 -5533 -12170 -12657 -4214 13301 14009
24781 14009 2033 197 6478 14620 8750 -4024 -6475 -10724 -17325 -17095 -13283 -6389 555 5866
24767 5866 6519 3585 -1244 -8422 6954 21527 23514 6927 3188 8461 5895 -8068 -15322 -9639
24753 -9639 -124 1545 -1865 1583 19883 24861 13749 8954 2867 4405 15738 11237 47 -12500
24739a2500n916k386O420Q24Q712n70j5391K872o426M268n281L344N233L354l190
24724a6633R538Q014Q224J1705r386j0959J53j989M718l230j6097k0513P561R225
24710a9669K1836O504P59o421j1835o589J0320j086q498O728Q538O334J007J549
24696I477k775k402K710k429p637p885m332j084k673M973M932K527M662N141Q989
24681A2194L296o183j797q608J517J0768J5621M287k6030j3521k62p661j227N420
24667a2186O572N1P471n93J9915M522j3344l145j0627n74R691J681j2394o528
24653i488J7217J5187J209N600m155j8167q167j184n633k17p963P303Q322n904
24639f040m056O837p259o075J018J643J5478m327j2116l253J1159m85j0538Q665
$$ plain form
24739 -12500 -18416 -20802 -14382 -13558 -4846 -5416 -20807 -17935 -24361 -20093 -25374 -22030 -16797 -13443 -16633
24724 -16633 -7095 919 9143 20848 11462 503 656 -1333 3385 155 -15942 -36455 -28894 -19669
24710 -19669 2167 8671 9430 3009 -8826 -15415 -5095 -6181 -14679 -7951 587 6921 7928 9477
24696 9477 6702 4300 7010 4581 -3056 -10941 -15273 -16357 -19030 -14057 -9125 -6598 -1936 3205 12194
24681 12194 15490 9307 7510 -1098 419 11187 26808 31095 5065 -8456 -8718 -16379 -17606 -12186
24667 -12186 -5614 -5563 1908 1315 21230 25752 12408 9263 -1364 -1938 7753 9434 -2960 -9488
24653 -9488 7729 22916 24125 29725 25570 7403 -764 -1948 -7581 -7798 -15761 -8458 -136 -6040
24639 -6040 -10096 -3259 -10518 -16593 -15575 -13932 1546 -2781 -14897 -18150 -6991 -7476 -18014 -9349
24625i349Q513J0024R941M922J057j2855j5462r115j130L711J1157J2505m702
24612I217N304Q974J351m234p900j2916K134Q22P338M865r389m436K909j390q821
24597f172K474J0352j648P677r965o035l767N183k370k887m146J07J672M177o033
24582a1381k411L623J351n84J0371R984n429m74j183N546m783l904L355J0552
24568A4633m271k6826P222O010M025M134o001K265P140P230J721o957J596q131
24554C790O23m842P388p510L777r605p135K549Q919L438p191J416n968l906l440
24539a7697L708P778m078j2203J933J1171n424j434p042o920K956J2418K761M891
24525g182J6047j1351j2869J0435J4105j3375p818J792K979n301K594N141M91
$$ plain form
24625 -9349 -836 9188 19129 24051 25108 12253 -3209 -12324 -13454 -9743 1414 13919 9217
24612 9217 14521 23495 24846 20612 12712 -204 1930 2752 10090 14955 5566 1130 4039 2649 -6172
24597 -6172 -3698 6654 5006 12683 2718 -3317 -7084 -1901 -4271 -7158 -11304 -11197 -9525 -5348 -11381
24582 -11381 -13792 -10169 -8818 -9402 969 10953 5524 5050 3867 9413 4630 726 4081 14633
24568 14633 10362 -16464 -9242 -3232 793 4927 -1074 1191 8331 15561 17282 10325 11921 3790
24554 3790 4413 -429 6959 -551 3226 -6379 -13514 -10965 -2046 1392 -5799 -4383 -10351 -14257 -17697
24539 -17697 -13989 -6211 -10289 -22492 -20559 -9388 -14812 -16246 -23288 -30208 -27252 -14834 -12073 -7182
24525 -7182 8865 -2486 -15355 -4920 9185 -4190 -12008 -10216 -7237 -12538 -9944 -4803 -4312
24512d312p133Q342q211j682O11k527Q817K284j1007n435O067Q521J3039J312
24498H686m665R393K166k119j5518j89N622j1010n087M447M429O29r61R6Q362
24483D281Q9M543p598l267j409j8499j490J0510J6955M828k922P607L937j2953
24469D612o855J6021J0971j6473j1588P578O082p878N833O166j5750j4493O330
24456i444R779o398l549k189J0478M963j580m775P577N547k959L469O556j3395
24442D080m713L219J347m885K841k0195j2156P269R337J594K776j4071j2133J1899
24428b3791K1435J1712N879L863p665o778O695M060N830n415n033J3664o692j7668
24414I6N028k705K659n087o246o91O495l521l549P551p32K192j3141q887J1761
$$ plain form
24512 -4312 -11445 -3103 -11314 -12996 -12385 -14912 -6095 -3811 -14818 -20253 -14186 -5665 7374 8686
24498 8686 4021 13414 15580 13461 -2057 -2246 3376 -7634 -12721 -8274 -3845 -3216 -4177 -4081 4281
24483 4281 4370 8913 1315 -1952 -3361 -21860 -23350 -12840 4115 8943 6021 13628 17565 4612
24469 4612 -2243 13778 24749 8276 -3312 4266 10348 2470 8303 14469 -1281 -15774 -9444
24456 -9444 335 -6063 -9612 -11801 -1323 3640 2060 -2715 4862 10409 7450 10919 17475 4080
24442 4080 -633 2586 3933 -952 1889 -18306 -30462 -23193 -13856 -12262 -9486 -23557 -35690 -23791
24428 -23791 -2356 9356 15235 19098 11433 4655 11350 15410 21240 15825 10792 24456 17764 96
24414 96 5124 2419 5078 -9 -6255 -6946 -451 -3972 -7521 30 -702 1490 -11651 -20538 -8777
24399h777J1837K36k626O149K980n375j2579l713q883O347J4582M617O030j4818
24385c993o14J9844J6830M699q267j4533r568p503K563M133R182q76q524N080
24371H453L843j579r824K340L275l553l348k547l411m323j1954K528j1690l455
24357c5245P686j603R511J1643P438m15M25N846J3047Q044n231j6738j5328p134
24343a8054J3197P432P575j0753p550k540M708P414L620J64J4618P707m022j0231
24329A3285j1553q120K501J3398L376j1424K794J560q182p568P747R703R349J3955
24315C0821p595j944j4816l487j0808j0613l170Q478J0795K735J305p934j77k022
24301h432o226J514J0706J496K09J446L441q785j446P61l211J0374R133k700n719
$$ plain form
24399 -8777 3060 3296 670 6819 9799 4424 -8155 -11868 -20751 -14404 178 4795 10825 -3993
24385 -3993 -4607 15237 32067 36766 28499 13966 4398 -3105 -542 3591 12773 11897 3373 8453
24371 8453 12296 10717 893 3233 6508 2955 -393 -2940 -6351 -10674 -22628 -20100 -31790 -35245
24357 -35245 -27559 -29162 -19651 -8008 -570 -985 -560 5286 18333 26377 21146 4408 -10920 -18054
24343 -18054 -4857 2575 10150 -603 -8153 -10693 -5985 1429 5049 5213 19831 27538 23516 13285
24329 13285 1732 -6388 -3887 9511 12887 1463 4257 5817 -2365 -9933 -2186 7517 16866 30821
24315 30821 23226 21282 6466 2979 -7829 -18442 -21612 -13134 -2339 396 1701 -6233 -6410 -8432
24301 -8432 -14658 -13144 -2438 -942 -733 713 4154 -4631 -6077 -5316 -8527 1847 10980 8280 2561
24286B561j0980L19J3118O83J0396Q070j9926k2688o764j367n870O135J7143R547
24272C77K011o596j928L263Q87K215M761J1185m902r497n119M547m628L294R996
24257I866J421k2442n456J473K578P345J1369J39r48L399p683n403P944N666m195
24242E073n138j782n841K718l754J265J0657P963j7909j134J1064M757k831r926
24228d818j2435P4J2072j651P41R302j0026L432r559l590R224m101l60J1278Q082
24213G665q091n45M133o155K050k234L815J649l786M47N935j17M461p245j9128
24198a7146K794J8574M88j1734q170p069J3735J9821Q898p832o982P207J402k08
24184A3778r02p933j2205j4698k1L726n582k605l823N244J0220J6383J1872J2681
$$ plain form
24286 2561 -8419 -8100 5018 5701 16097 24167 4241 -18447 -25211 -26578 -32448 -26313 -9170 377
24272 377 2388 -4208 -6136 -2873 -1986 229 4990 16175 11273 1776 -3343 1204 -3424 -130 9866
24257 9866 11287 -11155 -16611 -15138 -12560 -5215 6154 6293 5345 8744 1061 -4342 3602 9268 5073
24242 5073 -65 -1847 -7688 -4970 -8724 -7459 3198 11161 -6748 -7882 3182 7939 5108 -4818
24228 -4818 -17253 -17179 -5107 -6758 -6017 3285 -6741 -3309 -12868 -16458 -7234 -11335 -11695 -417 7665
24213 7665 -426 -971 3162 -2993 -943 -3177 638 2287 -1499 -1052 4883 4766 9227 1982 -17146
24198 -17146 -14352 4222 4710 -7024 -15194 -22263 -8528 11293 20191 12359 5377 12584 13986 13778
24184 13778 12876 4943 -7262 -21960 -21981 -18255 -23837 -26442 -30265 -25021 -14801 1582 13454 26135
24170B6135o368p154M89j2762r356K380k083L472o35R297P27N780M426j1212p454
24155d318M439J697l045J124n66K435j70K878j675M718r511p052p13L639p487
24140a3607K511j0407m408M10J7754P566q938r575j8672j1187O167K1646J8116
24127b624J276Q113L763o60o200o030N51l014n62J0092N969j0496j296N146L94
24112D422J788j4739j3579J2637P165j1190q918m159j492K3197Q460k016j8047
24099a6471J229P776k070J6211M041j965O594r008k4611K216J2128k492m494k2
24085a0938L871q410P499N902K335O012q994k1197J235J6471Q467j45r907m690
24071a2489L9Q763Q639k799o911O542J0238j3148j1341N771o13p596k57Q493J1411
$$ plain form
24170 26135 19767 12613 13102 340 -9016 -6636 -8719 -5247 -5882 3415 4142 9922 14348 3136 -4318
24155 -4318 121 1818 -1227 -103 -669 1766 1596 4474 2799 7517 -1994 -9046 -9759 -6120 -13607
24140 -13607 -11096 -21503 -25911 -25501 -7747 -181 -9119 -18694 -37366 -48553 -42386 -20740 -2624
24127 -2624 -1348 6765 10528 9868 3668 -2362 -1811 -4825 -5387 4705 10674 178 -1118 4028 4422
24112 4422 6210 -8529 -22108 -9471 -2306 -13496 -22414 -26573 -28065 -4868 3592 1576 -16471
24099 -16471 -15242 -7466 -9536 6675 10716 8751 15345 6337 -18274 -16058 -3930 -6422 -10916 -10938
24085 -10938 -7067 -15477 -7978 -2076 259 6271 -2723 -23920 -22685 -6214 2253 2108 -7799 -12489
24071 -12489 -12450 -3687 4952 2153 -4758 1784 12022 -1126 -12467 -6696 -7309 -14905 -15162 -6669 4742
24056D742Q190k736K365P159J1020j6487j7944N781l787K278J4058R783J88j0470
24042A4140p556n376j7454M07J8501Q082j2153m267O973M333N724L758J0407l646
24028B1873j8330j0333L086l5Q593J1481J1167k444k1291j0384N635n207j2227
24015a8416o037M526J8337M104o083p794o4j779p904L494J8782R355R076J222
24001B0819j1684p605n983J788P671L114o369j1891n876K002M730Q184O398m335
23987I63k068o728N782J3100J9146N141j3559j2006O191p231R13j895n9r794j2060
23972a4164M814J1773j882K411o942k315L775j618N986J0042j380k736q738k384
23958c358m449N404o24j299O798l901k358k820O138J4382K865j1490j5607j0101
$$ plain form
24056 4742 12932 10196 12561 19720 30740 14253 -3691 2090 -1697 581 14639 24422 24610 14140
24042 14140 6584 1208 -16246 -15839 2662 10744 -1409 -5676 1297 5630 11354 15112 25519 21873
24028 21873 3543 -6790 -3704 -3739 4854 16335 27502 25058 3767 -6617 -982 -6189 -18416
24015 -18416 -24453 -19927 -1590 2514 -3569 -11363 -11427 -13206 -21110 -17616 1166 10521 19597 20819
24001 20819 9135 1530 -4453 -2665 5006 8120 1751 -10140 -16016 -14014 -9284 -1100 5298 963
23987 963 -1105 -7833 -2051 11049 30195 35336 21777 9771 15962 8731 9644 7749 7690 -2104 -14164
23972 -14164 -9350 2423 541 2952 -3990 -6305 -2530 -4148 1838 11880 10500 7764 -974 -3358
23958 -3358 -7807 -2403 -3027 -4326 2472 -1429 -3787 -6607 -469 13913 16778 5288 -10319 -20420
23944b0420m468R545Q639m497J4J0395k017j3235m763L231j696J7381N135J0612
23930A3856J820l347P1p064q286J446M594M210m110M029L115l584k611q096q249
23915a2206J541J310j2872k37p010k804N260J3549n279j3190o142O322J5277J8768
23901B287m950K635k01J058J2263m021J902L24k337R559j791j0116o513M100k771
23886A428k796M848R38j311j4508N594P848k353q47o628p958p595K861K33k967
23871b3213o592j399R485J586J379M302q135Q262J9317N987j2373k613k611N85
23857f033J0460J7141r128K842P84j1328j2172J496N128j818K81K437m590M40
23843d060j3113K383N934j0093n625q602J743N006J3050J5432L953n096R422j1247
$$ plain form
23944 -20420 -24888 -15343 -6704 -11201 -11187 -792 -2809 -16044 -20807 -17576 -19272 -1891 3244 13856
23930 13856 15676 12329 12400 5336 -2950 -1504 3090 7300 3190 7219 10334 6750 4139 -3957 -12206
23915 -12206 -10665 -9355 -22227 -22464 -29474 -32278 -27018 -13469 -18748 -31938 -38080 -31758 -16481 2287
23901 2287 -2663 -28 -229 829 13092 9071 10973 11297 8960 18519 16728 6612 99 4199 1428
23886 1428 -1368 3480 4418 3107 -11401 -5807 2041 -312 -1159 -7787 -15745 -23340 -20479 -20246 -23213
23871 -23213 -29805 -31204 -21719 -20133 -18754 -14452 -22587 -14325 4992 10979 -1394 -4007 -6618 -6033
23857 -6033 4427 21568 12440 15282 16066 4738 -7434 -5938 -810 -2628 -2347 90 -4500 -4060
23843 -4060 -17173 -14790 -8856 -18949 -24574 -33176 -31433 -26427 -13377 2055 6008 912 10334 -913
23829i13j0246j4138q130R400J7493j298J718m956J5978N507L518K889r166n594
23815B062q660p141j7166l954M096N028J1436L060K30r110p098J8918J6918J559
23801A0178j4747O134J4346m625j0959j635L728P471K525n171j3975o9r772J7760
23787A189N753O176r432o554k275k130n536l593N098J4383J2622j3104m341K542
23773G98p780q509o088q476M621N326R142J4036m242j5523n046J4273M224r58
23759d202L707l115q30p785J1602J410j3303m967J0211J2334N698r219p658m98
23745f615K809n461J0134m49n0o781J894L393R619l824j832K901q552j0603k700
23730a6117l140K431j087Q823J746R432o875o439o505j008Q242O913O145K565
$$ plain form
23829 -913 -11159 -25297 -33427 -24027 -6534 -7832 -6114 -11070 4908 10415 13933 16822 7656 2062
23815 2062 -6598 -13739 -30905 -34859 -30763 -25735 -14299 -11239 -11009 -20119 -27217 -8299 8619 10178
23801 10178 -4569 1565 15911 11286 327 -1308 2420 9891 12416 7245 -6730 -6799 -16571 1189
23787 1189 6942 13118 3686 -2868 -5143 -7273 -12809 -16402 -11304 3079 15701 2597 -1744 798
23773 798 -6982 -15491 -21579 -30055 -25434 -20108 -10966 3070 -1172 -16695 -21741 -7468 -3244 -4202
23759 -4202 -495 -3610 -4440 -12225 -623 787 -12516 -17483 -7272 5062 10760 1541 -6117 -6615
23745 -6615 -3806 -9267 867 418 368 -6413 -4519 -1126 8493 4669 2837 5738 -2814 -13417 -16117
23730 -16117 -19257 -16826 -17913 -9090 -7344 2088 -4787 -11226 -17731 -18739 -10497 -3584 2561 5126
23716E126L923P079L863j0425n011r970o951j913K500o010o612Q183m8P92P908
23701g566K529L620P026O927j2426J907J210p345L481J3466J839n723P097N613
23687B1655N408j3424k1537n82j780m456m191M253M545K524q324k537M553J995
23673a1898n856j176J899K218O740N399N208L23j312Q6R198m955j489J611o711
23658g15K935n513O092N438J0059j193k3442j3673L966N121M677J2471n838J605
23644A990l674o933o398J1088K882O209P19n515r270J1656n582N692Q140n082
23630E922j1921m023M063Q326j633o639L808R4j639k160J3765P411r179j0476
23616d281J165l689r734N66K817j0365J309J2782J5521J287o435Q42N994J422
$$ plain form
23716 5126 9049 16128 19991 9566 4555 -5415 -12366 -14279 -11779 -17789 -24401 -16218 -16266 -15474 -7566
23701 -7566 -5037 -1417 5609 12536 110 2017 3227 -4118 -637 12829 14668 8945 16042 21655
23687 21655 27063 13639 -7898 -8480 -10260 -14716 -18907 -14654 -10109 -7585 -15909 -18446 -13893 -11898
23673 -11898 -17754 -18930 -17031 -14813 -8073 -2674 2534 2857 1545 1631 10829 5874 4385 5996 -715
23658 -715 2220 -3293 2799 8237 18296 17103 -6339 -20012 -16046 -10925 -6248 6223 385 1990
23644 1990 -1684 -8617 -15015 -3927 -1045 5164 5883 368 -8902 2754 -2828 2864 11004 5922
23630 5922 -5999 -10022 -5959 2367 734 -5905 -2097 -2003 -3642 -5802 7963 15374 6195 -4281
23616 -4281 -3116 -6805 -16539 -15973 -13156 -23521 -22212 -9430 6091 7378 943 1785 7779 9201
23602I201K905O969j0400l352m601l544j7888n441P05N952J3142K524r988M101
23588i715M960r564j380M110O027j381O522P088M500J1807k086j2444j2055J171
23574b440O48J603R218m135M149Q451r709j1266M182O539j5291j164J2508N914
23560I207k786J2961N246J933j4914j373P823j6275j224J4266j0204m958j1088
23547a1386j094J771N591L531J82k710K385r676j2813o350Q728L00j3433J5219
23533a9755R734k321K365O260J1312L587o258n305o337n095N390J4797o573j3156
23519a1355R046J1087J2477P087j5436l317N798k2051q679L742K057O497k882
23506e929j3275j013J5754J217l182p58J3897J2670n351o107P073q801q042N804
$$ plain form
23602 9201 12106 19075 8675 5323 722 -2822 -20710 -26151 -25446 -19494 -6352 -3828 -13816 -9715
23588 -9715 -4755 -14319 -15699 -11589 -5562 -6943 -421 6667 11167 22974 20888 8444 -3611 -2440
23574 -2440 -1792 -189 9029 4894 9043 17494 7785 -3481 701 7240 -8051 -9215 3293 9207
23560 9207 6421 19382 24628 26561 11647 10274 18097 1822 598 14864 4660 -298 -11386
23547 -11386 -12480 -10709 -5118 -1587 -1405 -4115 -1730 -11406 -24219 -30569 -21841 -21541 -34974 -19755
23533 -19755 -10021 -12342 -9977 -3717 7595 11182 4924 -381 -6718 -11813 -6423 8374 1801 -11355
23519 -11355 -2309 8778 21255 28342 12906 9589 15387 -6664 -15343 -11601 -9544 -3047 -5929
23506 -5929 -19204 -20217 -4463 -3246 -6428 -7186 6711 19381 14030 7923 14996 6195 -1847 3957
23492C957o456r447J917l827J6399L167M608m440j4716l386j0114J5724J2003
23479E389j2472n099r193o601M297J0250p697l270O233J6460R440q509j6623n067
23465b2462Q868k656J315k100O328m934j4551N39J0306J3428j724n581O501M718
23451b005R582K473m557r611L555P98L509J2704l841M645J0502j3909j4008n569
23437e732l021P00P245M564j2989n919k7K208j0852Q96q1R182K598K694J90o562
23421a4906o794q95K230O400Q559r61l266j680J181O245J3853r7m722j3533n283
23406a3669m272Q782k472M227k905j3040j1291O945K1175O934k332j849K008j3157
23392a4916j3087O043K306m762J0488J6179J797n937N974N676n967j242J207N06
$$ plain form
23492 3957 -2499 -11946 -10029 -13856 2543 5710 10318 5878 -8838 -12224 -22338 -6614 5389
23479 5389 -7083 -12182 -21375 -27976 -23679 -13429 -21126 -24396 -18163 -1703 7737 -772 -17395 -22462
23465 -22462 -13594 -16250 -14935 -17035 -10707 -15641 -30192 -29653 -19347 -5919 -7643 -13224 -6723 -2005
23451 -2005 7577 10050 5493 -4118 -563 235 3744 16448 12607 17252 27754 13845 -163 -5732
23437 -5732 -8753 -8053 -808 3756 -9233 -15152 -15179 -12971 -23823 -22927 -23008 -13826 -11228 -8534 -8344 -14906
23421 -14906 -21700 -22595 -20365 -13965 -5406 -6367 -9633 -11313 -10132 -3887 9966 9869 5147 -8386 -13669
23406 -13669 -17941 -9159 -11631 -7404 -10309 -23349 -34640 -27695 -6520 414 -1918 -3767 -1759 -14916
23392 -14916 -28003 -21960 -19654 -24416 -13928 2251 4048 -1889 4085 9761 3794 2552 3759 4265
23378D265M815o98l213l154J056L10Q489L70Q823j0086j306j1724j330l43J326
23363b400J1147J426m647L265l86r650K836R24j2742l774m740J4899j6423N566
23349a4699K0789p55o892K972J2574j083j0513k3177j5243o779o609J4901K0464
23336a4050J876P196R738j5624j2434O092k177L89K918L572j210P279N74Q99p62
23321e724K268J0171n973q010o384J734P150P689J0179M898K528o729j5459j0236
23307a1898m875J1520J7212j58r329n72m26K100M042L408m037q80R008j35J648
23292A6628n757o116k300l460L599L898m547M577M928O419o982j203L581l361
23278I904k2701Q825l409k0k704n863r331K137J9219N962j8094j245O314p00J3355
$$ plain form
23378 4265 9080 8382 5169 2015 3071 3381 11870 12240 21063 10977 9671 -2053 -3383 -3726 -2400
23363 -2400 8747 10173 5526 8791 8405 -1245 1591 2515 -10227 -14001 -18741 -3842 -20265 -14699
23349 -14699 6090 5335 -1557 1415 13989 12906 2393 -20784 -36027 -42806 -49415 -34514 -14050
23336 -14050 -12174 -4978 4760 -10864 -23298 -17206 -19383 -18994 -16076 -12504 -13714 -6435 -5861 -4962 -5724
23321 -5724 -3456 6715 742 -7268 -13652 -11918 -4768 2921 13100 17998 20526 13797 -1662 -11898
23307 -11898 -16773 -5253 11959 11801 2472 1900 1474 3574 7616 11024 6987 6107 15115 14980 16628
23292 16628 10871 4755 2455 -1005 2594 6492 1945 6522 11450 17869 10887 9684 13265 9904
23278 9904 -12797 -3972 -7381 -7401 -10105 -15968 -25299 -23162 -3943 2019 -16075 -17320 -11006 -11706 1649
23263A649k27L296J5102O049j8650j0610K148O431o701K954K687p48J1579j293
23249A3666l043p87M094Q633K362m759j1603j5667o996J555j3035J446O778K511
23235a4845J7616J1550l307j4491o607J2197J2345M75j8488j2995J1162J468J381
23222b539M831r478p142j75J002n679m716K592R122M877k148M148K0000J0084
23208B4779n603k2051j1204J759Q556R37j2064P606K481q756P388O918k157m564
23194e975M184q963j8012l590J1053O250Q056P179N255J9594j2633r427J3120
23181A6091j359n77j2741j8272K296J4297N664l768r396L874p72K467k488j310
23167e994P073J1084l795j0887j4256k987J9082R509L043o597q252j546K345R614
$$ plain form
23263 1649 1422 4718 19820 25869 7219 -3391 -1243 5188 -1513 1441 4128 3380 14959 13666
23249 13666 10623 9836 13930 22563 24925 20166 8563 -7104 -14100 -12545 -25580 -24134 -17356 -14845
23235 -14845 2771 14321 11014 -3477 -10084 2113 14458 14933 -3555 -16550 -5388 -3920 -2539
23222 -2539 2292 -7186 -14328 -14503 -13501 -19180 -23896 -21304 -12182 -7305 -9453 -5305 14695 24779
23208 24779 19176 -2875 -14079 -12320 -3764 -2827 -14891 -7285 -4804 -13560 -6172 746 -1411 -5975
23194 -5975 -1791 -10754 -28766 -32356 -21303 -15053 -6997 182 5437 25031 12398 2971 16091
23181 16091 14732 14155 1414 -16858 -14562 -265 5399 1631 -7765 -3891 -4663 -2196 -4684 -5994
23167 -5994 1079 12163 8368 -2519 -16775 -19762 -680 8829 11872 5275 -2977 -4523 -2178 7436
23153G436J0576J3295j778j8761k082K521j3219j202K931K897r950J2886p7l354
23139B119J692j821N015K417q186l51p382Q27j3582J8775K888O35J5224n630n936
23124F704J1858l052q809j454Q75j7078k3116o000J3570J4403M889N899K495K434
23110C618j21l811j1712k407J4752L643m971j2063q0O425O182n658K109K162O119
23095D187k516k2768j884J5571J3458m82R959k648k0421j0010J2378O560p735
23082f351j5217J202J2967Q624n670J892j1207Q055J7130n912o34R21R275J191
23068A6266m394m005j3272j1767N160L895Q706N882p117l298r892r53J7142Q910
23054A1263j9308K020J666j728m196j7131q488R725L46P182J6788J0469m346j1756
$$ plain form
23153 7436 18012 31307 29529 10768 8686 11207 -2012 -3214 -283 2614 -7336 5550 5473 2119
23139 2119 3811 1990 7005 9422 1236 885 -6497 -5670 -19252 -477 2411 3046 18270 12640 6704
23124 6704 18562 15510 6701 5247 6122 -10956 -34072 -40072 -26502 -12099 -7210 -1311 1184 3618
23110 3618 3497 -314 -12026 -14433 319 3962 -1009 -13072 -13152 -6727 -545 -6203 -4094 -1932 4187
23095 4187 1671 -21097 -22981 -7410 6048 5566 15525 12877 -7544 -17554 -5176 1384 -6351
23082 -6351 -21568 -20366 -7399 1225 -4445 -2553 -13760 -5705 11425 5513 4879 5800 15075 16266
23068 16266 11872 7867 -5405 -17172 -12012 -8117 589 6471 -646 -3944 -13836 -14789 2353 11263
23054 11263 -8045 -6025 -4359 -6087 -10283 -27414 -35902 -26177 -25831 -18649 -1861 8608 4262 -7494
23040g494j1861j664J0746P534o470q083N979k831M36J0776J389j418n378L637
23026d702m324j3863O11R970j6471N365K0607J1659j1500o005P711n777J025n104
23012a0798j4677Q816K9318m553j0165K01o529m374K821L357P474M328N866k1456
22998a0371j6037K48J1714m33L786o95M951J3525O767n503j384J379K0009o18
22984B7338j3007n871j800j6846n551L514k409J1529K659J1087P191Q321K456
22971B8611r632r023j4795j124l870O057L994j0207N737N574M853P611j3987j4406
22957a4607k681N190r19j2064j429N698J0060Q473m028j5420L948O797k029M450
22943h561J517l67N859j177l203k301p141o144j261J4688R763n464L988J253j307
$$ plain form
23040 -7494 -19355 -21019 -10273 -2739 -9209 -17292 -11313 -14144 -13708 -2932 -1543 -2961 -8339 -4702
23026 -4702 -9026 -22889 -22278 -12308 -28779 -23414 -2807 8852 -2648 -8653 -942 -6719 -5694 -10798
23012 -10798 -25475 -16659 12659 8106 -2059 -1858 -8387 -12761 -9940 -6583 891 5219 11085 -10371
22998 -10371 -26408 -26160 -14446 -14879 -11093 -11788 -6837 6688 13455 7952 6568 7947 27956 27338
22984 27338 14331 8460 6660 -10186 -15737 -12223 -14632 -3103 -444 10643 17834 26155 28611
22971 28611 18979 9956 -4839 -5963 -9833 -3776 218 -9989 -4252 1322 6175 13786 -201 -14607
22957 -14607 -17288 -12098 -13017 -25081 -26510 -20812 -10752 -2279 -6307 -21727 -17779 -10982 -13011 -8561
22943 -8561 -7044 -7411 -1552 -2729 -5932 -8233 -15374 -21518 -22779 -8091 1672 -3792 196 1449 142
22928A42N024n425j1531k609P59K730q206O643p988J526M090p158J391J4277k91
22913f626l872R418P715J1594M47n462q767J67K201P237j100p550m300j534j4857
22898a5289N491N738m496j0008j383O026J8480J0043Q505P420j5394k1191q762
22885a4820j9726l302K2658J2438l807n047O040l44P106m190j127L168J0262L174
22871A2483l287K653o536R697J541j8797j3956j808J295K739J2622R428q501k0161
22857b0588J3716J2864j3379m028J1126J901N39J197m700n277J298Q080p925j4475
22843a9651P295K2616J2291O834k3429r245O347K534P546k012p642n737j460k504
22829f217k198Q875J788j6718R915J7494J883p558k241J299j3389j0364K187J0939
$$ plain form
22928 142 5166 -259 -11790 -14399 -13640 -10910 -19116 -12473 -20461 -18935 -14845 -22003 -20612 -6335 -6626
22913 -6626 -10498 -1080 6635 18229 18676 13214 4447 4614 6815 14052 12952 5402 1102 -432 -15289
22898 -15289 -9798 -4060 -8556 -18564 -19947 -13921 4559 14602 23107 30527 15133 -6058 -14820
22885 -14820 -34546 -37848 -15190 -2752 -6559 -11606 -5566 -5910 1196 -2994 -4121 -953 9309 12483
22871 12483 9196 11849 5313 15010 16551 -2246 -16202 -18010 -16715 -13976 -1354 8074 -427 -20588
22857 -20588 -6872 5992 -7387 -11415 -289 1612 2151 3348 -1352 -6629 -5331 2749 -5176 -19651
22843 -19651 -12356 10260 22551 29385 5956 -3289 3058 5592 13138 11126 3484 -2253 -3713 -6217
22829 -6217 -8415 460 2248 -14470 -4555 12939 14822 7264 5023 6322 -7067 -17431 -15244 -4305
22815d305l248L989J3224O178j2723r348O503o748J805K179n688k700j7258J1525
22801a6615n664j634P674Q645Q295J00m085L933l010M992J2844p18q265P834J365
22786A5691q272m800M958j0647o196J0849k002p486R466j91J94J4648M608r655
22772A1165l807Q523L199j1752n271j3639o422l393N690L969R974O5o373k675
22758a0747P664R42J285K755n455p587o52L363Q504n235r824p528J0598J4832
22744B915K879j0304j1784L38o402Q059J3858O845K692j0868r825P848L206O162
22730E619O875J8239j400j4260n869L771j935j4266m383k504P307J2178j9046
22717i674j713J1660N174J090k764j6268k475N730o251J0640J0253o1n180r54
$$ plain form
22815 -4305 -7553 -3564 9660 15838 3115 -6233 270 -6478 -4673 -2494 -8182 -10882 -28140 -16615
22801 -16615 -22279 -23913 -16239 -7594 701 801 -3284 649 -2361 2631 15475 14757 6492 14326 15691
22786 15691 7419 2619 7577 -3070 -9266 1583 -419 -7905 1561 1370 1564 16212 20820 11165
22772 11165 7358 15881 19080 7328 2057 -11582 -18004 -21397 -15707 -11738 -1764 -1699 -8072 -10747
22758 -10747 -3083 -2141 -856 1899 -3556 -11143 -11795 -8432 72 -5163 -14987 -22515 -11917 2915
22744 2915 5794 -4510 -16294 -15956 -22358 -14299 -441 6404 9096 -1772 -11597 -3749 -543 5619
22730 5619 12494 30733 29333 15073 9204 12975 11040 -3226 -7609 -10113 -2806 9372 -9674
22717 -9674 -11387 273 5447 6537 3773 -12495 -14970 -9240 -15491 -4851 5402 5341 161 -793
22703g93n118P750q70n754j167p332p892J428Q35J106J297L306L80R14N387J745
22687d778m840J0678M64N561k930m283m244J0226O072o008j3434j0709L726J578
22673a2921M910j0811j3143J4073J1833L976K589q279M269n51j746N876k450K69
22659b106j1289m106n930j0432J5430M155J0865J067L884p984M536P617o86p841
22645b820Q254M663q891k97N040m083m463j507o106J5466J0233j2292r956k638
22631i397j729J643j436o484j812m092N975N503M553o196M858L135j335n768k637
22616a5219K262R382n490m41O013L529p430p128P18J715P014J5248L986L949j0832
22601G276l171J7970n336o660o035p098m342l875j116p639Q213j335J1086O497
$$ plain form
22703 -793 -5911 1839 969 -4785 -5952 -13284 -21176 -19748 -18913 -17807 -16510 -13204 -12824 -11910 -6523 -4778
22687 -4778 -9618 1060 1524 7085 4155 -128 -4372 5854 11926 5918 -7516 -18225 -14499 -12921
22673 -12921 -8011 -18822 -31965 -17892 -6059 -2083 506 -7773 -3504 -4055 -5801 75 -2375 -2106
22659 -2106 -13395 -17501 -23431 -33863 -18433 -14278 -3413 -2346 1538 -6446 -1910 5707 5021 -2820
22645 -2820 5434 10097 1206 909 5949 1866 -2597 -4104 -10210 5256 15489 3197 -6759 -9397
22631 -9397 -11126 -9483 -10919 -17403 -19215 -23307 -17332 -11829 -7276 -13472 -8614 -5479 -6814 -12582 -15219
22616 -15219 -12957 -3575 -9065 -9506 -3493 36 -7394 -14522 -13804 -12089 -5075 10173 14159 18108 7276
22601 7276 4105 22075 16739 10079 4044 -3054 -7396 -11271 -12387 -20026 -11813 -13148 -2062 4435
22587D435P119l906J523l376j5510K094R541l001N61L536n158m812Q436J228p526
22572d816r05l894P2P136N262L195j516j325j1776p654q66r364j888J521M846
22557b1972K297m096J0749J4709Q442K274K530k969j1892q563l159n345J4261
22544b734P287M253Nr551j640R15p28o953m162N453m670m15M779m058r066O99
22528b0586J1288l710j5327Q190K797r691k84K2114J0669j4501n719L046Q933
22515b781j1229j2949L872O774P074J3791N986l037m963p5J574o523N301M823
22501G638j7388j1500M26m095l391R984J6876N732o384j2251l037O298J744N4
22487i294R167J665p408O006J9857k497j6264k446K305J035j7278j5912m414K822
$$ plain form
22587 4435 11554 7648 9171 5795 -9715 -7621 1920 -1081 -520 3016 -2142 -6954 1482 2710 -4816
22572 -4816 -5721 -9615 -9543 -2407 2855 6050 4534 3209 -8567 -16221 -17087 -26451 -28339 -26818 -21972
22557 -21972 -19675 -23771 -13022 1687 10129 12403 14933 11964 72 -8491 -11650 -16995 -2734
22544 -2734 4553 8806 8811 -740 -2380 -1465 -2193 -9146 -13308 -7855 -12525 -12940 -8161 -12219 -21285 -20586
22528 -20586 -9298 -13008 -28335 -20145 -17348 -27039 -27323 -5209 5460 -9041 -14760 -11714 -2781
22515 -2781 -14010 -26959 -23087 -16313 -9239 4552 10538 7501 2538 2463 4037 -2486 2815 7638
22501 7638 -9750 -21250 -20824 -24919 -28310 -18326 -1450 4282 -2102 -14353 -17390 -11092 -9348 -9294
22487 -9294 -127 1538 -5870 136 19993 17496 1232 -1214 1091 2126 -15152 -31064 -35478 -32656
22473c2656o041j908K351O980O898N452l975n83M43P024L012m725J8263J0313
22459A0848k117j331j5809j8840L49J2037N23J077M450J051M897j1118j016J5700
22445G01J1363o112q304K067J7031j6185j4964l544J5434j491r354M54P538L448
22431a918p132m770o46k360M568j4249n499j2600J054P460O424M211R574k333
22417a8216R081R905P076n465j4955M858r84j0240j1095J4489M109r658p573O059
22403b2609M331O035k095K246J1479P357M465q62R31j868k937j8505j1568Q031
22389a5569J3884o45o362m031M762k899m645L097J1385R467j303k766j800J276
22375C851p569n875L384m45l396M164J2870J1841R381j8793j4763P130P014L463
$$ plain form
22473 -32656 -38697 -40605 -38254 -31274 -24376 -18924 -22899 -23482 -23039 -16015 -13003 -17728 535 10848
22459 10848 8731 7400 -8409 -27249 -26900 -14863 -14340 -13263 -8813 -7762 -2865 -13983 -14999 701
22445 701 12064 5952 -2352 -285 16746 561 -14403 -17947 -2513 -4004 -13358 -12904 -5366 -1918
22431 -1918 -9050 -13820 -14466 -16826 -12258 -26507 -32006 -44606 -43552 -36092 -29668 -25457 -15883 -18216
22417 -18216 -9135 770 7846 2381 -12574 -7716 -8700 -18940 -30035 -15546 -11437 -21095 -28668 -22609
22403 -22609 -18278 -12243 -14338 -12092 -613 6744 11209 10347 11278 9410 6473 -12032 -23600 -15569
22389 -15569 -1685 -2330 -8692 -12723 -7961 -10860 -15505 -12408 -1023 8444 7141 4375 2575 3851
22375 3851 -3718 -9593 -6209 -6654 -10050 -5886 6984 18825 28206 9413 -5350 1780 8794 12257
22361A2257j651j5636n664O180J1177m743j4624p160J3419j6447l128j773m660
22348c2453P863J5000J1565R34j1121L259M493M405O47N76J90j0126M73P166j0496
22333g625m592q06N487Q063j627j283J214n127m270J519l652n017Q128J4656j1492
22318f424r703r272Q663Q916j6805n076J3641J2044P528Q754O491q146m578l089
22304B944m137k445K066J1187k743L919K377k680J823J048k3778l1314M135P269
22290c0329M008q736J2910J6059j365J1721R865l592j4531p027J1737K752J395
22277D867q209r598K116K6K705J758j958J0271R42P0K108L578j4730N356J0695
22262I997j535r404j0590j183Q873J548k2955l365M157J0197K1041l410K620k681
$$ plain form
22361 12257 10606 -5030 -10694 -4514 6663 1920 -12704 -19864 -6445 -22892 -26020 -27793 -32453
22348 -32453 -24590 -9590 1975 2909 -8212 -4953 -460 3945 4592 5168 5358 -4768 -4295 2871 -7625
22333 -7625 -12217 -13023 -7536 527 -1100 -2383 -1169 -6296 -10566 -9047 -12699 -17716 -9588 5068 -6424
22318 -6424 -16127 -25399 -16736 -7820 -24625 -29701 -16060 -4016 3512 12266 18757 10611 6033 2944
22304 2944 -1193 -3638 -1572 9615 6872 10791 13168 10488 12311 13359 -10419 -41733 -37598 -30329
22290 -30329 -26321 -35057 -22147 -6088 -7453 4268 14133 10541 -3990 -11017 720 3472 4867
22277 4867 -3342 -12940 -10824 -10798 -8093 -6335 -8293 1978 2920 2990 5098 8676 -6054 -698 9997
22262 9997 8462 -942 -11532 -12715 -3842 -2294 -25249 -28614 -24457 -14260 6781 3371 5991 3310
22248C310Q181n227M541Q861M01l445J0933j198j1814j1768m85q923J3291R779
22234A6437l733m998n032l351j446l741J5597l881k769R947n528q288q789N326
22220d249N411j7215k69O439J2039L21m523K524P613r48j573r239j7148k013p903
22205c0733J1682J2909K256L764l834p403R934Q454k149m202o706K171J4910n992
22191E061L436o792J387L180N937n547j1414o106P836M774O586l316m046J1695
22177A2671J542j4464p262m426j1029J8O853P140P802J5355n746M842J581o663
22163H214L956m797Q267M405j5422k9101j0810K3647J9040P479p184n495q931
22150f732j0121k444J6288P297o396o482N292Q421r383J3078k333O654M207j3969
$$ plain form
22248 3310 11491 6264 10805 19666 20067 16622 27555 26357 14543 2775 2290 -6633 6658 16437
22234 16437 12704 7706 2674 -677 -2123 -5864 9733 5852 3083 13030 7502 -786 -9575 -4249
22220 -4249 1162 -16053 -16322 -9883 2156 2477 -2046 478 8091 7143 5570 -3669 -20817 -22830 -30733
22205 -30733 -19051 -6142 -3886 -122 -3956 -11359 -1425 7029 4880 678 -6028 -3857 11053 5061
22191 5061 8497 1705 3092 6272 12209 6662 -4752 -10858 -3022 1752 8338 5022 976 12671
22177 12671 14213 -251 -7513 -11939 -22968 -22950 -16097 -8957 -1155 14200 8454 13296 14877 8214
22163 8214 12170 7373 15640 20045 4623 -24478 -35288 -11641 7399 14878 7694 2199 -6732
22150 -6732 -16853 -19297 -3009 4288 -2108 -8590 -3298 5123 -4260 8818 6485 13139 17346 3377
22136C377K718o814M79m381j502M946j7284l806l232J180n122p529J1478J8726
22122f766J4577o184k286Q600n2o583q137j245J866J580k30J681P365j972l936
22107a722m439k561p656k957P470J5694j267j0578n533J018J3727m308M180J1566
22093A2634O374K450j3227j4348k540J0234j873P569p557j4102L03J1044Q178
22080E139l178q578J753P550M791p009M652j0725q460J2431J719O395P164l78
22066A3266l159K95n631K858p685M81m004k732J073O08l192L399M58M473k133
22051a625q61Q693J0064j0558l514J1211l964j5290l023q74m407k106J5626J1124
22037A0496q2O291J3791j1953j0527p978J1295J8762k73j6924n558J775J1578
$$ plain form
22136 3377 6095 -719 -240 -4621 -6123 -1177 -18461 -22267 -25499 -24319 -29441 -36970 -25492 -6766
22122 -6766 7811 1627 -659 7941 7889 1306 -6831 -8076 -6210 -4630 -4860 -3179 4186 2214 -1722
22107 -1722 -6161 -8722 -16378 -19335 -11865 3829 2562 -8016 -13549 -12531 1196 -3112 1068 12634
22093 12634 19008 21458 8231 -6117 -8657 1577 -296 7273 -284 -14386 -14083 -3039 5139
22080 5139 1961 -6617 -4864 2686 7477 468 5120 -5605 -14065 -1634 85 6480 13644 13266
22066 13266 10107 10402 4771 7629 -56 425 -3579 -6311 -5238 -4630 -7822 -4423 -3965 508 -1625
22051 -1625 -2486 6207 16271 5713 2199 13410 9446 -5844 -8867 -9741 -14148 -16254 -628 10496
22037 10496 10414 16705 30496 18543 8016 38 11333 30095 29822 12898 7340 9115 20693
22024B0693n097j1291m444j7586p24n296K81J478j1217N702L179m465L167J0063
22010a5557j135j6186k004M832l671J551J1046M769j383N921N553j217j2964L361
21996a7084J8375P730P027l318j0075j2880N305L94j2598O661Q469l583J909j4685
21982a8353N974N468Q225N718k29m334q548P65J487l046k064Q806P46j814M560
21967C361j577N296l132j1557n33l584J865J0779O600p138p040P047Q368K810
21953A1565p347j984J1002o822k5238J241R243RJ1029J8191N589q444q142p304
21939B588m896J735n674l226l70R197J1190j492m498o910o874O152J1770k401
21925F291J1033r76j0985o933j279N762Q230j1985j7397l985J025J105K443r515
$$ plain form
22024 20693 15596 4305 -139 -17725 -18449 -23745 -23464 -21986 -33203 -27501 -24322 -28787 -25620 -15557
22010 -15557 -16692 -32878 -34882 -30050 -33721 -32170 -21124 -16355 -17738 -11817 -6264 -7481 -20445 -17084
21996 -17084 1291 9021 16048 12730 2655 -10225 -4920 -4526 -17124 -10463 -1994 -5577 -3668 -18353
21982 -18353 -12379 -6911 1314 7032 6803 2469 -6079 -5314 -3827 -6873 -8937 -131 615 -1199 3361
21967 3361 1784 7080 3948 -7609 -8142 -11726 -9861 918 7518 380 -6660 387 8755 11565
21953 11565 4218 2234 13236 6414 -18824 -17583 -8340 -8331 2698 20889 26478 18034 9892 2588
21939 2588 -2308 -573 -6247 -9473 -9843 -646 10544 9052 4554 -2356 -9230 -3078 8692 6291
21925 6291 17324 16348 5363 -1570 -2849 2913 11143 -842 -18239 -22224 -21199 -20094 -17651 -27166
21911b7166o20Q130o220k304L879K059P246L013O563k374r296M513L004o556j226
21896a7355K826K3079N923k1474j1020J3712Q149k133k63q41o069J4601j2133
21883b998o054L330o97P193P13o690N773q977m070O784m730J6766M827k253k113
21868F804q243K859j859j0715o31O811m158k879n085o760k86J4796O644N450N23
21853C271j4R959n460R541N453l459K691o981k1167K844N649r07k302k45l297
21838d424J2163k39j2079j1009N895l61R729J016r650J755j242q754j1214N869
21824b2545J9276L740m302R987k226j8578o351P277L177L052N80Q006p843P379
21810F29P068k1592r046N632l040p846N273O616m344j7070P941J2884J502k528
$$ plain form
21911 -27166 -27786 -19656 -25876 -28180 -24301 -22242 -14996 -11983 -5420 -7794 -17090 -12577 -9573 -16129 -17355
21896 -17355 -14529 8550 14473 -7001 -18021 -4309 3840 1707 1444 603 -5466 9135 -2998
21883 -2998 -9052 -5722 -6419 774 1487 -5203 570 -8407 -12477 -5693 -10423 6343 11170 8917 6804
21868 6804 -1439 1420 -439 -11154 -11785 -4974 -9132 -12011 -17096 -23856 -24142 -9346 -2702 2748 3271
21853 3271 3257 13216 7756 17297 22750 19291 21982 15001 -6166 -3322 2327 1420 -882 -1127 -4424
21838 -4424 7739 7500 -4579 -15588 -9693 -10054 -325 691 -8959 -7204 -8446 -17200 -28414 -22545
21824 -22545 -3269 471 -3831 6156 3930 -14648 -20999 -13722 -10545 -7493 -6913 1093 -6750 629
21810 629 7697 -13895 -22941 -17309 -20349 -28195 -22922 -16306 -20650 -37720 -29779 -16895 -15393 -17921
21796a7921o433j0083L885J3260P376j3026o920J1900R245j24j2466j950n9l982
21782b7298J735J214O672Q881j3671j362O80L216k227J755P177J1563M228R101
21768A1664j1979j7571m334M491J152R244J2644n785m809N295K247j374j2508
21755a1623m105r714l517L172N866o131k058k54J810P614O504k26N795J4388k439
21740E082L988J0531N536j5381j8182K120n045l639n27m9O050p691j1376R62O539
21725b1082l078m126l181O493L663n69j1966J1854Q460k573N081J271o783J8550
21711B014J4482p199q078m851K444q241q416n889j509J3805P209l533o944L028
21697a1678J490r644j279j1131j5715O528J7268P606O096N490r749n179R373L635
$$ plain form
21796 -17921 -24354 -34437 -30552 -17292 -9916 -22942 -29862 -17962 -8717 -8841 -21307 -23257 -23316 -27298
21782 -27298 -25563 -24349 -17677 -8796 -22467 -23829 -23149 -19933 -22160 -20405 -13228 -1665 2563 11664
21768 11664 -315 -17886 -22220 -17729 -16577 -7333 5311 -474 -5283 12 2259 885 -11623
21755 -11623 -15728 -25442 -28959 -25787 -19921 -26052 -28110 -28364 -26554 -18940 -12436 -12662 -6867 7521 5082
21740 5082 9070 19601 25137 9756 -8426 -6306 -11351 -14990 -15517 -15566 -9516 -17207 -28583 -27621 -21082
21725 -21082 -24160 -28286 -31467 -24974 -21311 -21880 -33846 -21992 -13532 -16105 -11024 -9753 -16536 2014
21711 2014 16496 9297 1219 -3632 -1188 -9429 -17845 -23734 -25243 -11438 -4229 -7762 -14706 -11678
21697 -11678 -10188 -19832 -21111 -32242 -47957 -41429 -24161 -16555 -10459 -4969 -14718 -19897 -10524 -6889
21683f889J7651o405j1838Q83m928l18P775k930o725k376N972Q742N374j1110
21669g122n425k897j2000Q130L041O143P364O152Q484k783k138o105k5570j0552
21655c5278O972l800R207J3033j505o519j0870K1616J3909p528j3079J3961K586
21642B705j2000p570N895R735o902K143j96L369L828O385J7918j011j5978N79
21628H900M13j2173p91N382Q305m78o664j0293q944j6710r222J2193K4809J0678
21614E405j779M284N266j920m638j0567K834O681j253o905o013J331J482j268
21600g060J4467k399k928K910m109o328q060K175j349L506M847L193J3749q255
21586D359Q43q690j2658N861L010l238q446j571J635m555L864J805N535R542O681
$$ plain form
21683 -6889 10762 4357 -7481 -6598 -11526 -11844 -4069 -6999 -13724 -16100 -10128 -1386 3988 -7122
21669 -7122 -12547 -15444 -27444 -19314 -16273 -10130 -2766 3386 11870 9087 6949 844 -24726 -35278
21655 -35278 -28306 -32106 -22899 -9866 -11371 -17890 -28760 -7144 6765 -763 -13842 119 2705
21642 2705 -9295 -16865 -10970 -1235 -8137 -5994 -6190 -2821 1007 7392 25310 24299 8321 8900
21628 8900 9313 -2860 -3651 1731 10036 9558 2894 -7399 -16343 -33053 -42275 -30082 -5273 5405
21614 5405 3626 7910 13176 11256 6618 -3949 -1115 5566 4313 -2592 -8605 -7274 -5792 -7060
21600 -7060 7407 5008 2080 4990 881 -5447 -13507 -11332 -12681 -9175 -4328 -1135 12614 4359
21586 4359 5202 -3488 -16146 -10285 -7275 -10513 -18959 -20530 -18895 -23450 -19586 -17781 -12246 -2704 3977
21571C977m355k248K052J330K317j2419n288r021q605o843J0573L1288Q137J597
21557A2492n267r924m168M305J4805P4l443o0P816J3024o318l796m937L274K134
21542B0011O32q804q638L346Q871o969j2071l431j0334K087p34L731m244j7666
21528c4213J682j798O356M455K655Q984J3320l383J2257J016k769j0984N067J2554
21514A5199J420j1352m456j3655n486O704N117L775L528q400J4122Q272l72Q841
21500B3257n616j7170J0012J3224j5078p070Q605N81n067j6249j3760L587L622
21487a7122m261R205J1276m379l321N338o708R24k1k423k414k879n099J872K21
21472a9791r142j5493J6180J4748k531N978O696l353j2753j4721l996N340P022
$$ plain form
21571 3977 -378 -2626 -574 756 3073 -9346 -14634 -23655 -32260 -39103 -28530 2758 10895 12492
21557 12492 7225 -2699 -6867 -2562 12243 12317 8874 8814 16630 29654 23336 19540 14603 17877 20011
21542 20011 20643 11839 3201 6547 15418 8449 -3622 -7053 -17387 -15300 -16034 -12303 -16547 -34213
21528 -34213 -32531 -34329 -27973 -23518 -20863 -11879 1441 -1942 10315 11331 8562 -2422 2645 15199
21514 15199 16619 5267 811 -12844 -18330 -11626 -6509 -2734 794 -7606 6516 14788 14416 23257
21500 23257 17641 471 10483 23707 8629 1559 10164 10745 5678 -10571 -24331 -20744 -17122
21487 -17122 -21383 -12178 -902 -5281 -8602 -3264 -9972 -9048 -9069 -11492 -13906 -16785 -21884 -20012 -19791
21472 -19791 -28933 -44426 -28246 -13498 -16029 -10051 -3355 -6708 -19461 -34182 -38178 -32838 -25816
21459b5816J1690R568J5332j8582l746O909Oj711M00p579O821n581j2952O204
21445a9037J082K342k425J2042l798p085N121R248O94o36j79J9276n990M132L482
21430A8269o985j6031j934J6365m953j3378O381P500k149L572J32r475j1022m287
21416a7995P365J421o534O21Q921j1008n573Q504K907j1379L627L366j000J6228
21402e29k545j5081n623k673K427K2036k29L341n414j3386O820o558J6108Q413
21388G107n2l676j321Q36J0244J8018O115k0214j1164n46r40m751M066P473j1641
21373d46p781j1237J2438J7071q96L010K151m059p241j6754j7133M972N174m469
21359b5200O911l654j480P007Q00p395J3028j937p91j444O431j034p60j923k699
$$ plain form
21459 -25816 -14126 -4558 10774 -7808 -11554 -4645 -4639 -6350 -5950 -13529 -6708 -12289 -25241 -19037
21445 -19037 -17955 -15613 -18038 -5996 -9794 -16879 -11758 -2510 -1816 -2452 -2631 16645 10655 14787 18269
21430 18269 11284 -4747 -6681 9684 4731 -8647 -2266 5234 3085 6657 6789 -2686 -13708 -17995
21416 -17995 -10630 -9209 -15743 -15122 -6201 -17209 -22782 -14278 -11371 -22750 -19123 -15757 -16757 -529
21402 -529 -3074 -18155 -23778 -26451 -24024 -1988 -2217 1124 -4290 -17676 -10856 -17414 -1306 7107
21388 7107 7055 3379 2058 2894 13138 31156 37271 17057 5893 5347 4407 -344 3722 11195 -446
21373 -446 -8227 -19464 -7026 10045 9149 12159 14310 10251 3010 -13744 -30877 -25905 -20731 -25200
21359 -25200 -18289 -21943 -23423 -16416 -15616 -23011 -9983 -11920 -12711 -14155 -7724 -8758 -9518 -11441 -14140
21344a4140J0606R240n281O88J047j2121j4031K786O442M809J2464L169l959O161
21330G880j05j2521o528j971n104n925K972m011L133J0348J420L132m252l097
21316a4629O969n331N0n604j097l273m698J4816P264K917n306k261j149J11J4638
21301C417J784Q952j3972J831L187K276K636r617L213j2673m000K87K952L744
21287e983l024L492p253J0515J0853m940n335J221n845J096L296o836L614n906
21273a1035J2542l755l377n382j175m645j3014o222J2855J3093n660Q632J0287
21260C144J0160j1351j6320j7854N279J6549m298m146J1895J3787O939n412j6146
21247g774n441J711j1535m624J295M846J0783J932j4170l895j79J1898K310J0285
$$ plain form
21344 -14140 -3534 5706 425 1113 2160 -9961 -23992 -21206 -14764 -9955 2509 5678 1719 7880
21330 7880 7775 -4746 -11274 -13245 -18349 -24274 -21302 -25313 -22180 -11832 -10412 -7280 -11532 -14629
21316 -14629 -7660 -12991 -12941 -18545 -19642 -22915 -27613 -12797 -5533 -2616 -7922 -10183 -11332 -11221 3417
21301 3417 5201 14153 181 2012 5199 7475 10111 494 3707 -8966 -12966 -12679 -9727 -5983
21287 -5983 -9007 -5515 -12768 -2253 8600 3660 -1675 -454 -6299 -5203 -1907 -8743 -5129 -11035
21273 -11035 1507 -2248 -5625 -11007 -12182 -16827 -29841 -36063 -23208 -10115 -15775 -7143 3144
21260 3144 13304 1953 -14367 -32221 -26942 -10393 -14691 -18837 -6942 6845 13784 8372 -7774
21247 -7774 -13215 -11504 -23039 -27663 -26368 -21522 -10739 -8807 -22977 -26872 -27051 -15153 -12843 -2558
21233b558J5962J0923j3886j9093n864j3129J1210R189m416K022k537p156K111
21220a7222L398j319J1697j2797q379l489l48j583J5113O833O318j217N087J74
21206B266l80q391K969N444J477K50j133k2479J204L766l58k405J059O759q630
21191a8582k206n852N145Q601Q264K157o954j170N655Q264j056q634n399k269
21177a4036m440O526q84o050m771M989O335j865Q054K0250J1414o50j3625l260
21163G987k645K73j2044p347r278K953J2276O095o106j849P4P711J0775J615k002
21148H488n982L225k915j2540j0711l336l01J900j0166j401L046J6148P194n627
21134a2978o807o331N279K046J984M256J50M454L149j049M883L95K445j3455r164
$$ plain form
21233 -2558 13404 24327 10441 -8652 -14516 -27645 -16435 -7246 -11662 -9640 -12177 -19333 -17222
21220 -17222 -13824 -15143 -3446 -16243 -24622 -28111 -28459 -30042 -14929 -8096 -1778 -2995 2092 2266
21206 2266 1886 -6505 -3536 1908 3385 3635 2502 -19977 -18773 -15007 -15365 -17770 -16711 -9952 -18582
21191 -18582 -20788 -26640 -21495 -12894 -4630 -2473 -9427 -10597 -4942 3322 2266 -6368 -11767 -14036
21177 -14036 -18476 -11950 -12834 -18884 -23655 -18666 -12331 -14196 -6142 14108 25522 24872 11247 7987
21163 7987 5342 5615 -6429 -13776 -23054 -20101 -7825 -1730 -7836 -9685 -9611 -1900 8875 10490 8488
21148 8488 2506 5731 2816 -9724 -20435 -23771 -24072 -22172 -32338 -33739 -30693 -14545 -7351 -12978
21134 -12978 -19785 -26116 -20837 -18791 -16807 -12551 -12401 -7947 -4798 -5847 -964 -569 1876 -11579 -20743
21119b0743q333O267L280J8783M818M894n681j3322j519Q159M483m889j514K617
21105b700m193k95J751j580r324j3479M875J0232J8450Q288o928n785K212j0489
21091h965O51N78K094k329L244O85k612M43M216K424J1293n598m248J0438J322
21076A3636N330N519j4667j0506k331J1881l765l66p648N652J2933J0453r054
21063A7067j4887q168j6627o729O211m630j1550L644m53M024N869J7832j615k245
21049a2257n35j2234p506J5940L351l805j1334l438O902J3965M431O823K385K321
21035E009J2285O882j3489j5482J0480K957j128j942M574M188q713Q640j036k244
21021A0981J1363K002j6030o633J526m418K348J0212R05k505j4525q666k472q411
$$ plain form
21119 -20743 -29076 -22809 -19529 -746 4072 8966 3285 -10037 -11556 -3397 1086 -3803 -5317 -2700
21105 -2700 -6893 -7188 -5437 -7017 -16341 -29820 -24945 -14713 3737 12025 5097 -688 1524 -8965
21091 -8965 -8314 -7736 -5642 -7971 -4727 -4042 -6654 -6211 -1995 429 11722 6124 1876 12314 13636
21076 13636 18966 24485 9818 -688 -3019 8862 5097 4731 -2917 2735 15668 26121 17067
21063 17067 2180 -5988 -22615 -29344 -23133 -27763 -39313 -35669 -36122 -32098 -26229 -8397 -10012 -12257
21049 -12257 -12792 -25026 -32532 -16592 -13241 -17046 -28380 -31818 -24916 -10951 -6520 303 2688 5009
21035 5009 17294 24176 10687 -4795 5685 8642 7514 5572 10146 14334 5621 14261 13225 10981
21021 10981 22344 24346 8316 1683 3209 -1209 1139 11351 12256 9751 -4774 -13440 -15912 -24323
21007b4323n227J1019K4448Q058j6976k373O719j737j5778j6025J763J3405R359
20994g668K807k302p125j419J2094j025k673J684n185r840J2015J6830j3579k990
20980h376Q542n281j0538p018Q593J1323Q29J4283j2258m327j726J717n01q159
20966a2897L166k486K599L356q747o272J1537Q633P634l945l115L37l344j951
20952e495M17O679j1182k953J2044m41N488R754Q462o169r519j0565o585j3333
20938b3398L248J2113N758M065r160J4248L307o212j694o605N326P76l793o900
20924h921J116J729n380K364R567J5956q193j9965q22N400j620n111j911j266
20910a7057Q419O752n336j1800K517J3436n378n082N433J694j0768n29L549J4235
$$ plain form
21007 -24323 -29550 -18531 5917 13975 -3001 -5374 1345 -392 -16170 -32195 -30432 -17027 -7668
20994 -7668 -4861 -7163 -14288 -15707 -3613 -4638 -7311 -5627 -10812 -20652 -8637 8193 -5386 -8376
20980 -8376 166 -5115 -15653 -22671 -14078 -2755 -1926 12357 99 -4228 -5954 -4237 -4738 -12897
20966 -12897 -9731 -12217 -9618 -6262 -15009 -21281 -9744 -1111 6523 2578 -537 -200 -3544 -5495
20952 -5495 -5078 1601 -9581 -12534 -490 -931 4557 14311 22773 16604 7085 -3480 -10065 -23398
20938 -23398 -20150 -8037 -2279 1786 -7374 6874 10181 3969 2275 -4330 996 1772 -2021 -8921
20924 -8921 -7805 -6076 -11456 -9092 475 16431 8238 -11727 -12549 -7149 -8769 -13880 -15791 -17057
20910 -17057 -8638 -1886 -7222 -19022 -16505 -3069 -8447 -13529 -8096 -6402 -17170 -17699 -14150 85
20896H5o763j2775j330r909O741N060n06N956J8968j418L008K55n372N139J43
20881G282M38n039j3186o39K247J0796L070j0071j0856J611K461N056r680k0663
20867c7173L345J1046R026M098J0633R200K166j6540m235J462K3693R706m251
20854B2176l671j5770l583N596R628n137o330j1418m96Q2k979J560R365K396p961
20839f542l20J0104p057j221K3o697j2198o428L180J2488q180K0662L761K544
20825D119k49j373L577L721j31Q66j1998n572j0470R69O501J3285m680p079r304
20810a7818j1166J5688J2217R746K860j6466m989n580J1149L005m074J1102P886
20797A3560q330q759m639N503L812j4817m657J198N380L844J545J0550O256j0338
$$ plain form
20896 85 -6678 -19453 -20783 -30692 -23951 -18891 -19397 -13441 5527 4109 7117 7372 2000 7139 7282
20881 7282 7720 2681 -10505 -11144 -8897 1899 4969 -5102 -15958 -14347 -11886 -6830 -16510 -37173
20867 -37173 -33828 -22782 -13756 -9658 975 10175 12341 -4199 -8434 -6972 16721 26427 22176
20854 22176 18505 2735 -848 4748 14376 9239 2909 -8509 -9005 -8923 -11902 -10342 -977 1419 -6542
20839 -6542 -6862 3242 -3815 -5036 -5013 -11710 -23908 -30336 -27156 -14668 -22848 -2186 1575 4119
20825 4119 3870 2497 6074 9795 9664 10530 -1468 -7040 -17510 -16541 -10040 3245 -1435 -8514 -17818
20810 -17818 -28984 -13296 -1079 8667 11527 -4939 -9928 -15508 -4359 -1354 -5428 5674 13560
20797 13560 5230 -3529 -8168 -2665 1147 -13670 -18327 -17129 -11749 -7905 -6360 4190 10446 108
20783A08j606Q253Q067j4243q574l767J93P26M971m840R668N17k761j2977r91
20768a7256N570N226J294K4L861Q50p399k515o20M134o55J279P615J8553J3761
20753C3722l054k591m143q306q937n752K459J980p040j855J0578J2514k235r22
20739A6418k344r739L16r30p577J374j602n18j5159j4659p260k314J0709P307
20725b5978J2389J1891r18j4427j1969j493R732N715J351l469n39j791l058N55
20711b2009P982j286m350Q978J775p798q889J2942o955q510k715J3705K0018P666
20697A0554o304p723N447k514n497o173O402J3317K199K475J0894o220j1851j2265
20683g259J342m023K618J2546J4177J261j6014o611Q292l00n278Q94q054o404
$$ plain form
20783 108 -1498 6755 14822 579 -7995 -11762 -11569 -10843 -5872 -10712 -1044 -527 -3288 -16265 -17256
20768 -17256 -11686 -6460 -5166 -5142 -1281 -431 -7830 -10345 -10965 -6831 -7486 -6207 1408 19961 33722
20753 33722 30668 28077 23934 15628 6691 939 3398 5378 -1662 -3517 7061 19575 17340 16418
20739 16418 14074 4335 4651 3721 -3856 -2482 -4084 -4602 -19761 -34420 -41680 -43994 -33285 -25978
20725 -25978 -13589 -1698 -2616 -17043 -29012 -30505 -20773 -15058 -13707 -17176 -17715 -19506 -22564 -22009
20711 -22009 -14027 -15313 -19663 -10685 -8910 -16708 -25597 -12655 -19610 -28120 -30835 -17130 2888 10554
20697 10554 4250 -3473 1974 -540 -6037 -12210 -5808 7509 9708 12183 23077 16857 5006 -7259
20683 -7259 -5917 -9940 -7322 5224 19401 20662 4648 -1963 6329 6029 751 1645 -6409 -12813
20669a2813Q800J6816K240k4399j1059J1062J1646k504j813R742q900l276K771
20656a687O305J150J2463M433j0370K412Q36j425p372K090m957k57N157j1869
20642c091j2671K196j81q036o400P787L044j725K995r470j114m164J0145J719
20628a8966l659N168k999k702P98O001N781R894R077n125n23L86J469j6032m866
20613a6298j0012j475M399P837j149l094l035J6507J4167m340O42k285o019L240
20599i15o682k135o78L055Q416o326O402rj4329M99K228j3618O828J2193k041
20584g112k1231J012N866N738M811o922r839J5127J3099K495J992l609J0569Q78
20570A2874l365q472m987j1806n240o44J9453l234l741p582o582J1992M310P658
$$ plain form
20669 -12813 -4013 12803 15043 -9356 -20415 -9353 2293 -211 -2024 7718 -1182 -4458 -1687
20656 -1687 4618 5768 18231 22664 12294 14706 15542 14117 6745 8835 3878 3621 8778 -3091
20642 -3091 -15762 -13566 -13747 -21783 -28183 -20396 -17352 -19077 -16082 -25552 -26666 -30830 -20685 -18966
20628 -18966 -22625 -17457 -20456 -23158 -22360 -16359 -10578 -684 8393 3268 2745 3131 4600 -11432 -16298
20613 -16298 -26310 -27785 -23386 -15549 -16698 -19792 -22827 -6320 7847 3507 4149 1864 -4155 -915
20599 -915 -7597 -9732 -10410 -7355 1061 -5265 1137 1128 -13201 -12702 -10474 -24092 -17264 -5071 -7112
20584 -7112 -28343 -27331 -21465 -15727 -10916 -17838 -27677 -12550 549 3044 5036 1427 11996 12874
20570 12874 9509 1037 -3950 -15756 -20996 -21640 -2187 -5421 -9162 -16744 -23326 -11334 -7024 634
20556F34J229m312M841q107J686R996p707L43O968M389m603n85j02p806n096m617
20540a2849J059Q260O277n927r187k1056l45J7028O90N45M189j557R865j796J4761
20525I957j74k590j203J874r234o836P51k283m037j415q55O779R604l006O77m409
20509f400K546m830J78K387o21J7317J046o675L679j0172k286K906J6668O482
20495B2225j082j4083l291J6635l812m829K20k904j2653j5640K759J0191Q910
20482B646N143l91n225K742r266N860M687n441n909M93O721j492Q78J061l515
20467a008J9552N660k1145m504J7162n154j4890j4376k746o88J0749o757R750
20454h395Q305j1948n25L325L006J0407l156J903m563r093n629P953K1124k209
$$ plain form
20556 634 1863 -2449 2392 -5715 -4029 5967 -1740 -1397 5571 9960 5357 4772 4670 -3136 -8232 -12849
20540 -12849 -11790 -3530 2747 -3180 -12367 -33423 -33768 -16740 -16050 -15505 -11316 -12873 -3008 -4804 9957
20525 9957 9783 7193 5990 7864 -1370 -8206 -7455 -9738 -13775 -15190 -16045 -9266 338 -2668 -1991 -6400
20509 -6400 -3854 -8684 -8506 -6119 -6740 10577 11623 4948 8627 -1545 -3831 -925 15743 22225
20495 22225 21143 7060 3769 20404 16592 11763 11983 9079 -3574 -19214 -16455 -6264 2646
20482 2646 7789 7398 2173 4915 -4351 1509 6196 755 -5154 -4661 2060 568 1446 2507 -1008
20467 -1008 18544 24204 3059 -1445 15717 10563 -4327 -18703 -21449 -22137 -11388 -18145 -8395
20454 -8395 -90 -12038 -12563 -9238 -6232 4175 1019 2922 -1641 -10734 -16363 -8410 12714 10505
20440A0505p977q850r569K21L144J1062N147o525j0843N991O585p795l745p81
20426a3430N744N258n474j6233J1364J8272L291p438k445O279j714j0616M588
20413b554r478l443J3545J5079k18M248L364p848k011l186P84j405n410p716j2575
20398a8824J669O13k293R703J0754J622m926q424R968L016l521o358M516n43J0004
20383F976P228o231j862j1156M706Q139k480o066J881L548O728j1906n700Q478
20369B283K723j0748p404J339m530K612j067K366OP76K920N976q034j670K126
20354a0326O906P33P56N368P95j4932l298R379J5539n443o185l288o699J243k962
20339a2414o496N768R895k685k676j04r862m16K276R600p070j531P223k005j752
$$ plain form
20440 10505 2528 -6322 -15891 -15670 -12526 -1464 3683 -2842 -13685 -7694 -1109 -8904 -12649 -13430
20426 -13430 -7686 -2428 -7902 -24135 -12771 5501 8792 1354 -1091 5188 3474 -7142 -2554
20413 -2554 -12032 -15475 -1930 13149 12931 17179 20543 12695 10684 7498 8282 6877 1467 -6249 -18824
20398 -18824 -17155 -16542 -18835 -9132 1622 3244 -1682 -10106 -138 2878 -643 -7001 -2485 -3028 6976
20383 6976 14204 7973 6111 -5045 -339 7800 5320 -746 1135 4683 11411 -495 -6195 2283
20369 2283 5006 -5742 -13146 -11807 -16337 -13725 -14792 -12426 -12420 -11644 -8724 -2748 -10782 -12452 -10326
20354 -10326 -3420 -2687 -1931 3437 4232 -10700 -13998 -4619 10920 5477 -708 -3996 -10695 -9452 -12414
20339 -12414 -18910 -13142 -3247 -5932 -8608 -8712 -18574 -18990 -16714 -7114 -14184 -15715 -8492 -10497 -12249
20324a2249M506j554n880P486L132O514l638m577o200R592P449Q010j0730p681
20310e820n385J298J915n200J2554J5068L074j1983o145j436r798k825P787M13
20296f483l136j3625K3J4362J0983q239p240K290K159J5228J0276M284j1164k4788
20282a5070N505n879Q008J1006N893m000q027P554m381M761O761q424j2860L145
20268f008M198J837N677M8p995l032r92J488p380j7870l388R561n29J2935J9199
20253G749l283p017J4638R562p839n877j0225j877R825Q350M126j3257j2492o542
20239a4159K468M659N695O770j652j3970j0980l777k75J1385K2476J9422j0632
20226A7430p480R294j1946m756J475j203P3p35k083j6646n072J3344J4825R600
$$ plain form
20324 -12249 -7743 -9297 -15177 -7691 -4559 1955 -1683 -6260 -12460 -2868 4581 12591 1861 -5820
20310 -5820 -11205 -9907 -7992 -13192 -638 14430 17504 5521 -624 -2060 -11858 -14683 -6896 -6483
20296 -6483 -9619 -23244 -23221 -8859 2124 -6115 -13355 -11065 -8906 6322 16598 20882 9718 -15070
20282 -15070 -9565 -15444 -7436 3570 9463 5463 -2564 4990 609 5370 12131 3707 -9153 -6008
20268 -6008 -1810 27 5704 5752 -2243 -5275 -6267 -4779 -12159 -30029 -33417 -23856 -24385 -11450 7749
20253 7749 4466 -2551 12087 21649 13810 7933 -2292 -4169 5656 14006 18132 4875 -7617 -14159
20239 -14159 -11691 -7032 -1337 5433 3781 -10189 -21169 -24946 -25221 -13836 8640 28062 17430
20226 17430 9950 19244 7298 2542 4017 2814 2887 2152 69 -16577 -21649 -8305 6520 16120
20212A6120k505k0789K867O599j3306k387J2150O331J2916l143k757q339k4662
20199b0905p17Q603o51R162k32j120K986r549J701J2041M872j6526ON309J924
20184c096q871m000Q479P057m166m182j98M518j223j099j1041p282J706R094O223
20169h081l668N6K676m024J6774L041j0936j0315n709q226N265J1899J399O763
20155c086Q0J463L202k769K277O053k668r675M473J5593L575r274n945j4444K223
20140h922P445R744M453J117o789n563K499l258M664J8802L452J742J3721j569
20126D1538k219j6153K01j5426r956R454m533j5719k864J1870P33l497J2241M202
20112I872j84l55o008P131k393k559N43K709k622m643k613k756K1877J1203J690
$$ plain form
20212 16120 13615 -7174 -4307 2292 -11014 -13401 -1251 5080 17996 14853 12096 3757 -20905
20199 -20905 -21622 -13019 -13670 -4508 -4740 -5860 -2874 -12423 -10722 1319 6191 -10335 -10329 -5020 -3096
20184 -3096 -11967 -15967 -7488 -431 -4597 -8779 -8977 -4459 -5682 -6781 -17822 -25104 -23398 -14304 -8081
20169 -8081 -11749 -11693 -9017 -13041 3733 6774 -4162 -14477 -20186 -28412 -23147 -11248 -9849 -3086
20155 -3086 -3006 -1543 1659 -1110 1167 7220 4552 -5123 -650 14943 18518 9244 3299 -11145 -8922
20140 -8922 -1477 8267 12720 13837 7048 1485 3984 726 5390 24192 27644 29386 43107 41538
20126 41538 39319 23166 23367 7941 -2015 7439 2906 -12813 -15677 -3807 -3074 -6571 5670 9872
20112 9872 9688 9333 3325 10456 8063 5504 6047 8756 6134 1491 -1122 -3878 17999 29202 30892
20097C0892p106j2452O618n883M072K387j705O692L89k328K496J159J042r355
20083A6918k153j4823o079J266n66Q334m571K092p940p704p266p72L836p742K433
20068b4737J4991K682J9394R200O269j5957o229K160J316M443j1083R133l689
20055G893j5698j895P605J0038k696q510jO647Q764n025J914O548j1351l48k961
20040I24R232P296l054j3491r181l547L544J0965M960J1035m02j0205m84m878
20026B714Q485J454k293q686p361j417J309K2139N424l452o498k0405m990J0059
20012c518J7658m100j97q806q407N566J164r090L378R69K509O860K414j3656o716
19997a3972N380P243J1762P534M195M022L799k399m250j0023j0532l708J0199
$$ plain form
20097 30892 23786 11334 17952 12069 16141 18528 16823 23515 23904 21576 24072 25231 26273 16918
20083 16918 14765 -58 -6137 -4871 -5437 2897 -1674 418 -7522 -15226 -22492 -23264 -19428 -27170 -24737
20068 -24737 -9746 -7064 12330 21530 27799 11842 5613 7773 9089 13532 2449 11582 7893
20055 7893 -7805 -9700 -2095 7943 5247 -3263 -3264 3383 12147 7122 9036 15584 4233 3885 924
20040 924 10156 17452 14398 907 -8274 -11821 -8277 2688 7648 18683 18281 8076 7592 2714
20026 2714 11199 12653 10360 1674 -5687 -7104 -5795 16344 21768 18316 11818 -8587 -13577 -3518
20012 -3518 14140 10040 9843 1037 -7370 -1804 -640 -9730 -6352 -5383 -2874 3986 6400 -7256 -13972
19997 -13972 -8592 -1349 10413 17947 22142 26164 29963 27564 23314 13291 2759 -949 9250
19984I250r598K646K514l524j2098r050j876J1393p225m343M567j19J1774J6611
19970A0922O471J0573l036r528o594l018p625J356R608j156j2495J907K358J910
19956A653P853J120K347j2081n604L730j759M70r722j3226n203J2091J736K532
19942a4063j905J010Q646J1344q692p56Q97j487j303J0464J3514M317r199O933
19928A9720k944j5861o123O242J0695O180m4j5502j7089k365n947n665M127L428
19914b1148m139j3644j540J8726j389K47K5915J1525K885k785l995j9166o032
19901a4540n627Mj304P403M864J0417K996J787k303j558k420J460N094K237N997
19886A4507K272l94n869j753m321J1342K1o840j4617O615J1221j7147q726J437
$$ plain form
19984 9250 -348 2298 4812 1288 -10810 -19860 -21736 -10343 -17568 -21911 -17344 -17463 -5689 10922
19970 10922 17393 27966 24930 15402 8808 5790 -1835 -479 9129 7973 -4522 -2615 -257 1653
19956 1653 9506 10626 12973 892 -4712 -982 -2741 -2271 -11993 -25219 -30422 -18331 -16595 -14063
19942 -14063 -15968 -14958 -6312 5032 -3660 -4416 -3519 -5006 -6309 4155 17669 21986 12787 19720
19928 19720 16776 915 -5208 1034 11729 17909 17865 2363 -14726 -17091 -23038 -28703 -24576 -21148
19914 -21148 -25287 -38931 -40471 -21745 -23134 -22887 3028 14553 17438 14653 10658 -8508 -14540
19901 -14540 -20167 -20163 -21467 -14064 -9200 1217 4213 6000 3697 2139 -281 1179 6273 8510 14507
19886 14507 16779 16385 10516 8763 4442 15784 15805 8965 -5652 963 12184 -4963 -13689 -12252
19872a2252m71j0261j7907o349J6670J2055K1l1Q880J2259P989l299o659p80k890
19857c025L837M022j971M112Q885M499Q185J4116M422k637k3529q335K950j502
19843A4029o398r486M272j1470N631o475L491p73L004J944J599J0212J997j1206
19829C71j2205j1139J457M310J0391K796o610m294Q363k347K183O949J901Q823
19815A0949J769k40j3408k947K3454n244q429j4412p124Q252J3851P421n591j2681
19801d380J320j781L812O150R062k679J395j173O970j1601p052o503N08o644l07
19786a2903J6579O21Q096M473j1762p490J1470M702N114J536p254j3229q560N93
19772h014k033J074k697k753J0738O864m364k555m318O661n392J333j489j053
$$ plain form
19872 -12252 -12723 -22984 -40891 -47240 -30570 -18515 -18494 -18525 -9645 2614 10603 7304 645 -135 -3025
19857 -3025 812 4834 2863 6975 15860 20359 28544 42660 47082 44445 20916 12581 15531 14029
19843 14029 7631 -1855 2417 -9053 -3422 -9897 -6406 -7179 -4175 -2231 -632 9580 11577 371
19829 371 -11834 -22973 -21516 -17206 -6815 -4019 -10629 -14923 -6560 -8907 -6724 225 2126 10949
19815 10949 12718 12478 -930 -3877 19577 14333 5904 -8508 -15632 -7380 6471 13892 8301 -4380
19801 -4380 -3060 -4841 -1029 5121 14183 11504 12899 11726 18696 7095 43 -6460 -5952 -12596 -12903
19786 -12903 3676 4297 12393 16866 5104 -2386 9084 13786 18900 20436 13182 -47 -8607 -8014
19772 -8014 -10047 -8973 -11670 -14423 -3685 3179 -1185 -3740 -8058 -1397 -6789 -5456 -6945 -7998
19758g998Q705L388L397M119O011l968j2241j503p505q479p444J563J3461J6151
19744G657M760m813l725J063O547R743J319j1738j7205L446N272q770O421M821
19730D798L477J7012P382K018j5409j1295j805O199k450j3757O879P185L719j1145
19716B808j4480N169P910j9448m781P682o55J238J1741P767O183q750R86L244
19702F614r10K186r278o731q008k615J3547J9675Q906j2846p188o435j021J2222
19688H118R271j7716j0007Q52Q068L794m197J8305r634k3109l942J0955K478J862
19674d902L49R683N699O306J3307L134p627m437k776K061n228r789L977J6219
19660B5976L500q422k1629j220k281J4515p82k956L471q555o769Q362M567R745
$$ plain form
19758 -7998 707 4095 7492 11611 17622 13654 1413 -90 -7595 -16074 -23518 -21955 -8494 7657
19744 7657 12417 7604 3879 4942 11489 21232 22551 10813 -6392 -2946 2326 -6444 -23 4798
19730 4798 8275 25287 32669 34687 19278 7983 6178 12377 9927 -3830 3049 10234 13953 2808
19716 2808 -11672 -6503 1407 -18041 -22822 -15140 -15795 -14557 -2816 4951 11134 2384 3370 6614
19702 6614 5704 7890 -1388 -8119 -16127 -18742 -5195 14480 23386 10540 3352 -3083 -4104 8118
19688 8118 17389 -327 -10334 -9482 -1414 2380 -1817 16488 6854 -16255 -20197 -9242 -6764 -4902
19674 -4902 -4553 5130 10829 17135 30442 33576 25949 21512 18736 20797 15569 5780 9757 25976
19660 25976 29476 21054 -575 -1795 -4076 10439 9657 6701 10172 1617 -5152 3210 7777 17522
19646A7522J2350m151j0706j2797q296J4967j063r039k276L430J770q02M174o159
19632a076j2299j1059L128K2906J1343K650j2392j917N592p253j0738k09J0291
19619a033K760m731J1061J694o351o224R762m91P642J539o876N17J5177M500M376
19604C3322r476j2326P146J2410q162o154l631P098P895J547o218M946r335j2636
19590F426j1757r754L500l742M27J5434J202J254k168Q937Q229o028j6050m561
19576h651K614N561N862j715r945o911J4240M118k573q384J539P179J2786P458
19562B3178O289j3221r150L777O436R996J048J098J608j1688j53j6089j4593q380
19548a9844J5202J4432k342o92j040J287J2357l127l603K361j8932m036K963p50
$$ plain form
19646 17522 29872 25721 15015 2218 -6078 8889 7826 -1213 -3489 -59 1711 909 5083 -1076
19632 -1076 -13375 -24434 -21306 1600 12943 15593 3201 1284 6876 -377 -11115 -11324 -1033
19619 -1033 1727 -3004 8057 9751 3400 -2824 6938 6447 14089 15628 8752 9269 24446 28946 33322
19604 33322 23846 11520 18666 31076 22914 16760 13129 20227 28122 29669 23451 28397 19062 6426
19590 6426 -5331 -15085 -11585 -15327 -14900 534 1736 2990 822 9759 17988 11960 -4090 -8651
19576 -8651 -6037 -476 5386 3671 -6274 -13185 1055 5173 2600 -5784 -4245 2934 15720 23178
19562 23178 29467 16246 7096 10873 17309 27305 28353 29451 31059 19371 19218 3129 -11464 -19844
19548 -19844 -4642 9790 7448 6756 5716 7003 19360 16233 12630 14991 -3941 -7977 -5014 -5764
19534e764k579J0453J7923p64p081k260R801R546j321o605K093k125j555N066
19520B4828M108J2907j3041r749l199j432j0917L347K8413J9682p731k2247p372
19507A7597J0476K538k024j3704p355Q858p638j456P348O293j3456p193j1509
19494a1225K395L807N397J3239K83N15j3017k0785J5187n629P860P451o83o710
19480a915q249j5228n74M224J1175L650o7r492m12M57R51n084J5039J8258Q020
19465B0753J335o107r029j0367J742K6089L246l767o425P107P748l320k2992j3453
19451g440p391J2170j185L959p944m203J629J4374R104M39q372j144P560j192
19437A0364J708K175J107Q11o260k879R365N166r627j618k800n391L972J072O539
$$ plain form
19534 -5764 -8343 2110 20033 19269 12188 9928 19729 29275 27954 21349 23442 21317 19762 24828
19520 24828 28936 41843 28802 19053 15854 14422 3505 6852 35265 54947 47216 24969 17597
19507 17597 28073 30611 28587 14883 7528 16386 8748 7292 14640 20933 7477 284 -11225
19494 -11225 -8830 -5023 374 13613 13896 14411 1394 -19391 -4204 -9833 -1973 5478 4795 -1915
19480 -1915 -10164 -25392 -25966 -21742 -10567 -6917 -6984 -16476 -16888 -16431 -15480 -20564 -5525 12733 20753
19465 20753 22088 15981 6952 -3415 -1673 24416 27662 23895 17470 24577 32325 29005 6013 -7440
19451 -7440 -14831 -2661 -3846 113 -7831 -12034 -10405 3969 13073 13512 5140 3996 11556 10364
19437 10364 12072 14247 15354 16165 9905 7026 16391 21557 11930 10312 7512 2121 6093 7165 13704
19422A3704m855m947o846L947n30n062J308P702Q2j182L570Q965k36q220R859
19407A7259P490j891q057l824J332m048M531M53l442P346L101O256j3314m095
19393I097l941M773J360j0812p428R738J6296N442j6090o133J5842J2249m542
19380B5851l176J1396o678J680K88m929j0071j0546m950O890N251J637n946L274
19366I971J5664Q487k119M019j5149k1356J338R659n322n343J2048J4483m272
19353B2108j537R265J3989o814j4077N5j0145n669Q003l478r51n997O993M000
19339A5745M622N768j2728p798O040k2o777j265J0059Q326m848l114J903O164
19325B2075l24K867n744j9565J247P830j1752K626J1076K708N805Q475l238J090
$$ plain form
19422 13704 8849 3902 -2944 1003 473 -4589 -3281 4421 4503 3321 6891 15856 15620 7400 17259
19407 17259 24749 22858 14801 10977 12309 8261 12792 13245 9803 17149 20250 26506 13192 9097
19393 9097 5156 9929 11289 477 -6951 2787 19083 24525 8435 2302 18144 30393 25851
19380 25851 22675 34071 27393 29073 29361 24432 14361 3815 -1135 5755 11006 12643 6697 9971
19366 9971 25635 34122 32003 36022 20873 -483 855 10514 5192 -151 11897 26380 22108
19353 22108 20571 29836 43825 37011 22934 22989 12844 7175 15178 11700 10749 4752 11745 15745
19339 15745 20367 26135 13407 5609 11649 11627 4850 3585 13644 21970 17122 14008 15911 22075
19325 22075 21751 24618 18874 -691 556 8386 -3366 -740 10336 13044 18849 27324 24086 25176
19311B5176q712o713M93J2824J4364j161n448n007p882L081j7r650j2784k335
19297c771J4781J1419L939o918O199Q835L331o161p127j924p502l320l179R38
19283I540j3055Q80O14J2803L973q274j3670p051J65M729Q23O936L327P806J0338
19268A9884K098L468l5p97j365K0270j258q146K590j087r723p511P613o845j0193
19253H963J3365l81m735J0549l185l390k083J0038O58K633l061j0790j8627R24
19239H78R323J424L846O371p534M824m735K731n09j560Q492J1914j549q293L619
19224B9242r58l283N820p450l296N199q912q567J5025k575j1992m287k041J8908
19210B0833k11o230K141K891j544j2415J0247J3697k644O94M844l188j050j868
$$ plain form
19311 25176 16464 9751 10244 23068 37432 36271 30823 25816 17934 21015 20998 11348 -1436 -3771
19297 -3771 11010 22429 26368 19450 25649 34484 37815 31654 24527 22603 15101 11781 8602 9540
19283 9540 -3515 -2635 -2021 10782 14755 6481 -7189 -14240 -14075 -9346 -8523 -1587 1740 9546 19884
19268 19884 21982 25450 25415 24618 23253 43523 42265 34119 36709 35622 25899 18388 26001 19156 8963
19253 8963 22328 21947 17212 27761 24576 21186 19103 29141 29799 32432 29371 18581 -46 878
19239 878 10201 11625 15471 21842 14308 19132 14397 17128 16619 15059 23551 35465 33916 25623 29242
19224 29242 28284 25001 30821 23371 20075 25274 16362 7795 22820 20245 8253 3966 1925 20833
19210 20833 20622 14392 16533 19424 17880 5465 15712 29409 26765 27459 32303 29115 28065 26197
19196B6197l33j2799p466k156O993M819m65o798o111m207j7394J1740L848M037
19182i5N325J6757M419r888p20j090K243O270L217r998n985O06n376K789J218
19167I692Q014M913m217o281O562Q320L094l708J369J4369M089j0812q516j119
19153B5769n928r193K797M710J2747j204l782j1363j031Q702j146j0460j707j144
19139G767l463J0097p541p641J9875q49L711J0739J0886m007j961m768j5077N97
19125A8365M288K766K779m069j0667M547Q243J9985j1109j2019K818n905j4454
19112E568J235r21p651j2296L059J4485O170N596j316P430n658o809O991J9769
19098C5652R929o869l114K660q160P624K140n718P799o425n742Q525Q872P662
$$ plain form
19196 26197 25864 13065 5599 3443 10436 15255 14790 7992 1881 -2326 -19720 -7980 -4132 -95
19182 -95 5230 21987 26406 16518 15798 14708 16951 23221 26438 16440 10455 11061 5685 8474 9692
19167 9692 17706 22619 18402 12121 18683 27003 30097 26389 27758 42127 46216 35404 26888 25769
19153 25769 19841 10648 13445 18155 30902 29698 25916 14553 13522 22224 21078 10618 8911 7767
19139 7767 4304 14401 6860 -781 19094 18245 21956 32695 43581 39574 37613 32845 17768 18365
19125 18365 22653 25419 28198 24129 13462 18009 26252 46237 35128 23109 25927 20022 5568
19112 5568 6803 5882 -1769 -14065 -11006 3479 9649 15245 13929 21359 15701 8892 15883 35652
19098 35652 45581 38712 35598 38258 30098 37722 39862 34144 41943 35518 29776 38301 47173 54835
19084E4835r682O111J1148L629n60N811q540L438P638J1332j665J3562k844M429
19070I8642K3267K6158K6165M4174L8125N5844R5289J50956K54087K59616J15854
19059A188177M1700M5139N7535N4890j439k9663l2109n71P6266K7128n1092l1287
19047A344674l0160M424q030j13477j58998k07317k34611j88417j14017o0735
19037B33336l6221k2091j7818j0523r831k0004j7025N404k858j0870j7110q457
19025F5932Q890j650q309k818m228p493p603o720M805o279k547j139Q531J0063
19011D9435K565O485o845n699K666n213J095p69j3495q071K120K015k153K079
18997B6215L46N674J4587J6198J0326L054p735k2188l749O545K34J5984N849J347
$$ plain form
19084 54835 45153 51264 62412 66041 65481 71292 62752 66190 73828 85160 83495 97057 94213 98642
19070 98642 121909 148067 174232 218406 256531 312375 407664 558620 812707 1072323 1188177
19059 1188177 1229877 1275016 1332551 1387441 1386002 1356339 1324230 1323659 1399925 1427053 1375961 1344674
19047 1344674 1314514 1318938 1310908 1197431 1038433 831116 596505 408088 294071 233336
19037 233336 197115 175024 157206 146683 136852 116848 99823 105227 102369 91499 74389 65932
19025 65932 74822 73172 64863 62045 57817 50324 42721 36001 40806 34527 31980 30841 39372 49435
19011 49435 52000 58485 51640 45941 48607 43394 44489 43720 30225 22154 24274 26289 24136 26215
18997 26215 26561 32235 46822 63020 73346 76400 68665 46477 42728 49273 49507 65491 71340 72687
18983G2687o656q740K796R6L64l690l117j859k494J4058J1210l142R296M851j2654
18968G3006p946k219Q005j375p732k265n880P816K066n470l816J4614K8803l569
18954I4038o697J1436J3365J7231q755n54j724J3015L2647L3426M4236N1114Q8024
18941C80802J82891K52160J99394L8890l1557j22048j67109j21719m2663N2187
18931F21228J53811K81760L76520K98164J43852q8404k53646l02541l02673k23375
18921G04696j14964k7741N9335J60438K07001R3869n5892j21959k03728k12488
18911D88567j41434q6100m5782k4893k4324j2708j6464j3450k0531j1535r393
18900H1953k868R295k217m152j917q700n434l543j2002N012m498l179K602J2114
$$ plain form
18983 72687 66031 57291 60087 60183 60547 56857 53740 51881 49387 63445 74655 71513 80809 85660 73006
18968 73006 65060 62841 70846 69471 61739 59474 53594 61410 63476 58006 54190 68804 97607 94038
18954 94038 87341 98777 112142 129373 120618 120064 118340 131355 164002 197428 241664 292778 380802
18941 380802 563693 815853 1015247 1054137 1022580 900532 733423 611704 569041 621228
18931 621228 775039 1056799 1433319 1731483 1875335 1786931 1533285 1230744 928071 704696
18921 704696 589732 561991 621326 781764 988765 1082634 1026742 904783 701055 488567
18911 488567 347133 261033 215251 190358 166034 153326 136862 123412 102881 91346 81953
18900 81953 79085 88380 86163 82011 80094 71394 65960 62417 50415 55427 50929 47750 50352 62466
18886F2466M218J5571L022l426n044L370j0515j7342j2835M062O415L134J571
18873E4667q453p284j3635j4831m804R18P557K214q756N003m449M843q63N876
18859A8003J3114J8221N514j1306q474k486J5799L996j3893K01j49J1666R433
18846E9639M698Q670P776O626k151O730J6842J0390Q859j2322j1050j1549n005
18833H8153J5596J4505m678q392K1222R107j1684j8021j2322J6191M186k2298
18821I1565j3093o010K789Q270J210J1216l002k2926J183Q904M40j2118m001J0809
18807G5236m212p728J0031J253L990M70m23n20J173j809p084K862n165j331N373
18792G2116N05J3084j5824j5074o641J0834N240O352k965K652Q038J1774j2373
$$ plain form
18886 62466 66684 82255 85277 81851 76807 80177 69662 52320 39485 43547 49962 53096 54667
18873 54667 46214 38930 25295 10464 5660 6578 14135 16349 7593 12596 8147 12990 12127 18003
18859 18003 31117 49338 54852 43546 35072 32586 48385 52381 38488 38689 38540 50206 59639
18846 59639 64337 73007 80783 87409 85258 91988 108830 119220 128079 115757 104707 93158 88153
18833 88153 103749 118254 113576 105184 126406 135513 123829 105808 93486 109677 113863 91565
18821 91565 78472 72462 75251 83521 84731 95947 92945 70019 71202 80106 80546 68428 64427 75236
18807 75236 71024 63296 73327 74580 78570 79040 78617 78097 79270 77461 70377 73239 68074 66743 72116
18792 72116 72621 85705 69881 54807 48166 59000 64240 70592 67627 70279 78317 90091 77718
18779G7718j1491m098K612R756Q671K724Q968J0130j1333k1589q998J8250K1622
18766A02942L0229J1611J766j0395k3327j4607j7778m980L670k360j1443P534
18754G2862O815m4q974L936O121L726j888k7483j1547Q314l753J509P228J2563
18740F9385l455J4686J0451m968M875Q636M009O49M623j574J0071O566L63j5028
18726A09289o985J1673J4927M267r046o318N505J2954o555M591R437o666j0847
18713A26226n870j9785r445k612J2365J3526k19j2251k0115p252J8026J9587q307
18700A03874q045m493J4237O141r355J529O675J570j3032p446k648N260J2756
18687A07023J1573o6r067J9094J7152L001j3239j7745r600L955M974K905l790
$$ plain form
18779 77718 66227 62129 64741 74497 83168 85892 94860 104990 93657 72068 63070 81320 102942
18766 102942 133171 144782 146548 136153 112826 98219 80441 75461 79131 76771 65328 72862
18754 72862 79677 79633 70659 74595 80716 84442 82554 55071 43524 51838 48085 49594 56822 69385
18740 69385 65930 80616 91067 86099 90974 99610 103619 104268 108891 107317 117388 123954 124317 109289
18726 109289 102304 113977 128904 133171 124125 117807 123312 136266 129711 134302 143739 137073 126226
18713 126226 120356 100571 91126 88514 100879 114405 114186 101935 81820 74568 92594 112181 103874
18700 103874 95829 91336 105573 111714 102359 103888 110563 112133 99101 91655 89007 94267 107023
18687 107023 118596 118530 109463 128557 145709 148710 135471 117726 108126 112081 117055 119960 116170
18674A16170p11L4J0577L720k30K2930j873j8511K6N092J2590J2257J3900K3681
18660A99652J1875k740n070Q085K8960J1707L263o665J1346l672O502J4732O147
18647B84122n419R298P91N39j5346j9822k829o073J6820J1412k2479l1309r921
18634B09784K198J2409L2485K6611P380j3245j9087j0265j7389l4326j0979M758
18622A90334J5057K8395L1081M5030L9257r258j2298l1804o5255n3191l2773j4369
18610A30206J778J1239K7885K9227J9989j1257k1760l3465k7313m0308j5756j592
18598F8873J516o499j2348l3467m0603k4880n878Q229K795o771J4172J2389Q539
18585a3933P644j1913k1814J3451K4360J5057k355K616K1046K6292M0629L2156
$$ plain form
18674 116170 115459 115493 126070 129790 129560 152490 150617 132106 132132 137224 149814 162071 175971 199652
18660 199652 211527 208787 203717 211802 240762 252469 255732 249067 260413 256741 263243 277975 284122
18647 284122 278703 288001 288792 289331 273985 254163 251334 245261 262081 273493 251014 219705 209784
18634 209784 211982 224391 256876 283487 290867 277622 258535 248270 230881 196555 185576 190334
18622 190334 205391 233786 264867 309897 349154 339896 327598 295794 230539 177348 144575 130206
18610 130206 131984 143223 171108 200335 220324 209067 187307 153842 126529 86221 70465 68873
18598 68873 70389 63890 51542 18075 -22528 -47408 -53286 -45057 -42262 -49033 -34861 -22472 -13933
18585 -13933 -6289 -18202 -40016 -26565 -2205 12852 10497 13113 34159 60451 101080 133236
18573A33236K7377K1644L982J1021P420J5142J6822j971j0847q353l859j276K660
18560B12998m875r315p711L407Q140K150j5921l57K587J8643J3196K321m822J8238
18546B38679K2841K0031J1072o569j3677K835K4544M9203K8749J2920J7693J7838
18534D26159K6401K5271R248k0575m4685m5193P138M092p070P062l984k6134M313
18521C62043J4397M735l1991n1267j7168K4803L9915l538m6302k7425j235K3109
18509B90076K6103K6033K1017M932K295o666J2140R964M851J6225L135j185p240
18496D01680m167J1046J8224J4799P707N869p91O111J0156J7951K44m4317l5228
18483D09284J2978L2415O2567N7435M2963K6844K6711J2532j6207m5475o0172
$$ plain form
18573 133236 160613 182257 186239 197260 204680 219822 236644 234673 223826 215473 211614 210338 212998
18560 212998 208123 198808 191097 194504 202644 204794 188873 188516 191103 209746 222942 225263 220441 238679
18546 238679 261520 281551 292623 286054 272377 275212 299756 348959 377708 390628 408321 426159
18534 426159 452560 477831 487079 466504 421819 376626 383764 387856 380786 387848 383864 357730 362043
18521 362043 376440 381175 349184 297917 280749 305552 345467 341929 295627 268202 266967 290076
18509 290076 316179 342212 363229 368161 370456 363790 375930 385894 390745 406970 410105 408920 401680
18496 401680 397513 408559 426783 441582 449289 455158 454367 460478 470634 488585 488829 444512 409284
18483 409284 422262 454677 517244 574679 617642 644486 671197 683729 667522 622047 561875
18472E61875j5376L6785P7347P3771P0785N3701N5368M6127K9732K4595o813J150
18460A009047K7963M2533P2895O1333O5571P0025N3098N5706N7897N9590O1183
18449A636841M3551L2898M7600O1986R4458J13692J49314J74306K08051K63153
18439B825850L44287L77820L10338K52526L20489M86425P31205P39766L93104
18430F781810K19722K02164K58047M58314Q27392J225433J184295Q35049M94693
18421A2486919K52129J84517J64940L87701R89368J591505J849903J931011K051820
18412B1889813K378367L016630M050335N541885P801981J1746592J9000846L2191847
18404A07618296M5792724L5373589J1217590N701412N195102J0513429J1019786
$$ plain form
18472 561875 546499 583284 660631 734402 805187 858888 914256 960383 990115 1014710 1007897 1009047
18460 1009047 1037010 1079543 1152438 1213771 1279342 1349367 1402465 1458171 1516068 1575658 1636841
18449 1636841 1680392 1713290 1760890 1822876 1917334 2031026 2180340 2354646 2562697 2825850
18439 2825850 3170137 3547957 3858295 4110821 4431310 4917735 5648940 6388706 6781810
18430 6781810 7001532 7203696 7461743 7920057 8747449 9972882 11157177 11992226 12486919
18421 12486919 12739048 12923565 13088505 13476206 14465574 16057079 17906982 19837993 21889813
18412 21889813 24268180 27284810 31335145 36877030 44679011 56425603 75426449 107618296
18404 107618296 153411020 188784609 200002199 205703611 210898713 221412142 232431928
18397B32431928l406819m604315q64319Q698535J8711332K890989o968739m959720
18389B41928872j889211M820469r602103k5114864l0749446m2952019m3724766
18382I2716932k9560158j7342126j0615354p097062m943715l452706k549185j926434
18374A5230192j555154j227820r42272q49060p39485o66304o24350m52165l48979
18365G824603l34164l66771m11226l51894l39794l85892l17075k23779j34007
18356D960001p5017j24617j53209j48198j33032q4911j38263k06629k23285k48786
18346C424054k42318j71178j08715p6493n6454l5907j2929J9691O8429J50471
18336B958651K85423L10719J42684K0865n5868j51568j44895m8666K1584J42732
$$ plain form
18397 232431928 229025109 224420794 223556475 232255010 250966342 253857331 246888592 241928872
18389 241928872 240039661 244860130 235258027 210143163 179393717 136441698 92716932
18382 92716932 63156774 45814648 35199294 28102232 23158517 19705811 17156626 15230192
18374 15230192 13675038 12447218 11504946 10655886 9916401 9250097 8625747 8173582 7824603
18365 7824603 7490439 7123668 6712442 6360548 6020754 5634862 5317787 5094008 4960001
18356 4960001 4884984 4760367 4607158 4458960 4325928 4241017 4102754 3896125 3672840 3424054
18346 3424054 3181736 3010558 2901843 2825350 2768896 2732989 2720060 2739751 2808180 2958651
18336 2958651 3244074 3554793 3697477 3718342 3662474 3510906 3366011 3317345 3338929 3481661
18326C481661K89905M52608N27027N05850M01235K54722L9155j19581j00983n2058
18316E679541L6647K00511M45434P49851R66722R70764Q70697P55043O21831N68213
18306A1865254Q07461J197990J624602K105234K711024L404740M161967N408691
18298C3286963P706617J1692152J9293734L3627887M9430072L8145978M956380
18291A98139783j0017823k3339442l4096499k5498062q548547O637409K3664490
18284A26941309M6473839O3210005N5464083L2277150q843829m0139572n3716261
18277B21666724n7246822m4886254k4138654p695851O806452K4073410L4618870
18270A53197875J5817695q327357j7495137l0048012l4993274k5149846j4686981
$$ plain form
18326 3481661 3771566 4224174 4751201 5257051 5658286 5913008 5952163 5832582 5731599 5679541
18316 5679541 5716188 5916699 6362133 7111984 8078706 9049470 9920167 10675210 11297041 11865254
18306 11865254 12672715 13870705 15495307 17600541 20311565 23716305 27878272 33286963
18298 33286963 40993580 52685732 71979466 105607353 155037425 193183403 198139783
18291 198139783 188121960 164782518 130686019 105187957 96639410 103276819 126941309
18284 126941309 173415148 236625153 292089236 324366386 315522557 275382985 221666724
18277 221666724 164419902 119533648 95394994 87699143 94505595 118579005 153197875
18270 153197875 169015570 160688213 143193076 113145064 78151790 53001944 38314963
18263C8314963q882007n926825m400073l295215k439842j779337j192802p22005
18255I676857m40158k94865k95191l65788m74772m68942m41724n58217n38384
18246E798816m42419l87722k24350j55577j53404r3339l7905L0934Q6710O5110
18236D486854j11997l30224m16256m32869l92762k80268j61675p3727K0084J34366
18226B441526J06037k2069r3113k01186k39764k15439j41050j16126r9141q9101
18216A330574m2374j0657j92N587Q569n308j6060l2371m4037l7892k7992j8920
18204A108927j6233j0163J9749N519r426l1473m0676l2687j6008l0410m9688n2209
18192H45222m4009l6071j0098J6447q351k138r328k547j5557j4310l2445j7790
$$ plain form
18263 38314963 29432956 23506131 19106058 15810843 13371001 11591664 10398862 9676857
18255 9676857 9236699 8941834 8646643 8280855 7806083 7337141 6895417 6337200 5798816
18246 5798816 5356397 4968675 4744325 4588748 4435344 4342005 4304100 4335034 4421744 4486854
18236 4486854 4374857 4044633 3628377 3195508 2802746 2522478 2360803 2287076 2307160 2441526
18226 2441526 2547563 2525494 2432381 2231195 1991431 1775992 1634942 1518816 1419675 1330574
18216 1330574 1288200 1277543 1277351 1282938 1291507 1286199 1270139 1237768 1193731 1155839 1127847 1108927
18204 1108927 1092694 1082531 1102280 1107799 1098373 1066900 1026224 993537 977529 947119 897431 845222
18192 845222 801213 765142 755044 771491 763140 761002 751674 749127 733570 719260 686815 669025
18180F69025j4985O312K3025K5986J1465J7958j5554k2869j5639P858m463K7839
18168G15958K3421j2300m9278n1630m4250j1458R93k425J2834K3897M3525N0733
18156G00020L5893j6258p0961n6759l0155j6637Q9n426l343R043L8619L1331q187
18143F07269l4302j2727n729R032R756o765r073l226q59q085o057J4645L6647
18130E90526L1015N0788N3482M3123J6679K9631P518J0126L9101P7812J22625
18119A072426J71240K05282K32633K74018L20298L75271N77634R32243J559837
18110E720882K853939M904624N353972J706311j166981k491589m316097m425786
18102H139275k855105j599335r54419o46439m64957k96085j98272j27004o6768
$$ plain form
18180 669025 654040 660352 683377 709363 720828 738786 723232 700363 684724 692582 688119 715958
18168 715958 739379 727079 677801 626171 581921 570463 571456 569031 581865 605762 649287 700020
18156 700020 735913 719655 648694 591935 561780 545143 545232 539806 536463 545506 584125 615456 607269
18143 607269 572967 560240 554511 563543 573299 566534 557461 554235 553376 545291 539234 553879 590526
18130 590526 621541 672329 725811 768934 785613 815244 822762 832888 871989 949801 1072426
18119 1072426 1243666 1448948 1681581 1955599 2275897 2651168 3228802 4161045 5720882
18110 5720882 8574821 13479445 18833417 20539728 19372747 16881158 12565061 8139275
18102 8139275 5284170 3684835 2730416 2083977 1619020 1322935 1124663 997659 930891
18093I30891l8137k2748j9928k6255l1380o3949p9466p7528n8285k0012o513N303
18081D91993J3698J8225J2852J349k5362m7154m2998q097m983j4882j0634o430
18069C77577k1041k0972q682j2270q430j1791j2968r423j1120q961j1347P064
18057B47636k024Q765L881j1373o602l765k980j4835j5083k5178M667M334m234
18044A83209o303k1541n231O978Q339L784Q192J792R067K113p134r654k135j2371
18030A59105M162R256Q490R434L77N187J155N342j5838j9058j4330l241l45j0366
18016A39330l219R451j002P843j309j4635m943M067Q714N94n80J2929K291j4748
18002A44783j5776o732n603m934k187N053P19n4Q033l666N268J1576J337P893
$$ plain form
18093 930891 892754 870006 850078 823823 792443 728494 649028 571500 513215 493203 486690 491993
18081 491993 505691 523916 536768 538117 512755 465601 422603 414506 409523 394641 384007 377577
18069 377577 356536 335564 326882 314612 306182 294391 281423 272000 260880 251919 240572 247636
18057 247636 245612 254377 258258 246885 240283 236518 233538 218703 203620 178442 183109 187443 183209
18044 183209 176906 155365 150134 157112 165451 169235 177427 179219 188286 190399 183265 173611 171476 159105
18030 159105 163267 172523 181013 190447 190824 196011 197166 202508 186670 167612 153282 150041 149696 139330
18016 139330 136111 145562 144560 152403 151094 136459 131516 135583 144297 144891 144311 157240 159531 144783
18002 144783 129007 122275 116672 111738 109551 114604 115323 115269 123302 119636 124904 136480 137817 145710
17988A45710p160p597j6953l737q441M448O490P201O397j141j2636l633J274P822
17974A18044k381j3476l79N038j0242n057n325J34l445l354J7412J0064p209j2132
17960H7692j1222q809k5165l981J4482l435o824Q121O174J1794O3l822m071R039
17946G0036N557l999n669J0828j4183P046J6734P487P383n029J349j2956K042
17933H6626R031O459l746P108J6040n812k3974J080J2949J3544M96O08L117o553
17919A16973K711O749J566J0028j493p215j6298j9414j0541O23N483P558n679
17906I1051j1586J7673L314o763q809P627J159o626M747K639o201M886m10k961
17892H9740l394m109J231L5l360o914M313l920M438P695p779O405k491j2397k794
$$ plain form
17988 145710 138550 130953 114000 110263 101822 106270 112760 119961 126358 125217 112581 108948 110222 118044
17974 118044 115663 102187 101808 106846 96604 91547 86222 86356 82911 79557 96969 107033 99824 87692
17960 87692 76470 67661 42496 38515 52997 49562 42738 50859 57033 68827 68890 65068 60997 70036
17946 70036 75593 71594 65925 76753 62570 69616 86350 93837 101220 96191 97540 84584 86626
17933 86626 95657 102116 98370 105478 121518 115706 91732 92812 105761 119305 119801 120409 123526 116973
17919 116973 119684 126433 127999 138027 136534 129319 113021 93607 83066 83689 89172 96730 91051
17906 91051 79465 97138 100452 93689 84880 92507 93666 87040 91787 94426 88225 93111 92701 89740
17892 89740 86346 82237 83468 83503 80143 73229 77542 73622 78060 85755 77976 84381 81890 69493 66699
17877F6699J078r93R4J0123j603j4894n713R2n25p25O488P483k542j887j4724
17862D8451l031P434o359j1503M953J194l720R09k524m870L277J279j2081n813
17848A7596P872J340j7019m451J0041K0416R0n035J0568j637L310N566L669Q627
17834F0953n907J487J09j3488j2924L612O825K1377J3809J4057j331l758j0703
17821G4118Q55J2582P203l214J3946J864r337k396J2027l418j4526j0755j4170
17808F4779N137J2041J9484J3582L534M155m076j930k862j2363l421n0n226k125
17794I0659k962m220O276j05k203j087M651R440m317n189K264Q584J184l703o072
17779I3200L727L686N652J2506L137K770o443m418r88j286J62o282P76N839j696
$$ plain form
17877 66699 67777 66784 66878 77001 75398 60504 54791 54883 54358 53633 60121 67604 65062 63175 48451
17862 48451 45420 52854 46495 34992 39945 41139 37419 38328 35804 30934 34211 35490 23409 17596
17848 17596 25468 26808 9789 5338 15379 35795 35885 30850 41418 39781 43091 48657 52326 60953
17834 60953 55046 56533 56642 43154 30230 33842 40667 62044 75853 89910 88579 84821 74118
17821 74118 74973 87555 94758 91544 105490 107354 98017 95621 107648 104230 89704 78949 64779
17808 64779 69916 81957 101441 115023 118557 122712 118636 116706 113844 101481 98060 98010 92784 90659
17794 90659 87697 83477 89753 89648 87445 86358 91009 100449 96132 90943 93207 101791 102975 99272 93200
17779 93200 96927 100613 106265 118771 121908 124678 118235 113817 112829 111543 111705 105423 106199 112038 110342
17764A10342j803p696j7199j852M556P296P718j0013J4336J9020L409P646j728
17751A34032r410k650J2985K2304J7390N742J4954L0272K3697L8436N0459O7841
17739D06052J17714J85909K79418K24890O9161M1068M0061O3539M6904l1241n6917
17728A386558l2159j403M8917j2217l8109k1259j6187L135n4560j23757j59730
17717I79229k34159k16570j45442r4036m5432l3631l1394p273j5547k0721q026
17706A26998m039l675k84r766j6477n236J0177J1428P330j5875q864k2751J0639
17693G9605O217m643q883R362j916n693K596M927L411K897P080q455p986Q68Q855
17678H8242J0236M11n446M63o686m846P591q1M362O967J5634J3891K156j8811
$$ plain form
17764 110342 108539 100843 83644 81792 86348 93644 101362 91349 105685 124705 128114 135760 134032
17751 134032 124622 121972 134957 157261 174651 180393 195347 225619 249316 287752 338211 406052
17739 406052 523766 709675 989093 1213983 1283144 1324212 1364273 1427812 1474716 1443475 1386558
17728 1386558 1354399 1352996 1401913 1389696 1351587 1330328 1314141 1317276 1262716 1138959 979229
17717 979229 745070 528500 383058 289022 243590 209959 178565 171292 155745 135024 126998
17706 126998 122959 119284 119000 109234 92757 87521 97698 109126 116456 100581 91717 68966 79605
17693 79605 85822 81179 72296 81658 79742 74049 76645 81572 84983 87880 94960 86505 78519 79387 88242
17678 88242 98478 98889 93443 93906 87220 82374 89965 89884 94246 101213 116847 130738 132894 114083
17664A14083k0875k2846Q806J5660L200M691r22r857N679J4958M423O466J4467
17651A37933J0882J5894K0609R427J5890J1100R114K1174L8783O1528J32281K22372
17639G06987K50666J28082j736o0679j48057j53267r7911j6067Q2083J96031L26617
17628A212749L53924K58335Q7774j47871k80618l13037l01913j99597p5903J4023
17618F07866Q8411J74666J74759K1817p2435j38549k10002k00066j33604p9382
17608B33481m5578k9944j0722P2j3776j2592m113p785Q841O551J645j1153K41
17595A15168j0188J50R293j960k074N179j2787j4887Q301p80J5456K3468J8905
17582A53244j3393l553j6413l966j4231p847O866J2342K358r019j3009m398k629
$$ plain form
17664 114083 93208 70362 79168 94828 98028 102719 101797 91940 97619 112577 117000 123466 137933
17651 137933 148815 164709 185318 194745 210635 221735 230849 252023 290806 352334 484615 706987
17639 706987 957653 1085735 1083999 1023320 875263 721996 624085 608018 690101 886132 1212749
17628 1212749 1566673 1825008 1912782 1764911 1484293 1171256 869343 669746 593843 607866
17618 607866 696277 870943 1045702 1067519 995084 856535 646533 446467 312863 233481
17608 233481 187903 157959 147237 147309 133533 120941 116828 109043 117884 124435 126080 114927 115168
17595 115168 104980 105130 114423 112463 110389 115568 102781 87894 96195 95415 110871 134339 153244
17582 153244 139851 136298 119885 115919 101688 93841 100707 113049 115407 106388 93379 88981 86352
17569H6352n736R82l314o276o909K3041J8509r714j1543L105J4760p375j1621
17556H4261J0198J1862l073j4270K511J5841m401j4883p125j0038K146Q362j1048
17543G0343j2698M916L012N220M558J0668j2446K508k739K099P291o659o813j0083
17529E9177J8830J5090M057j2232p278k432N039K529n870M32O188K700M96r57
17515H5769j3018M016N537n637k978Q167J1320k333j1021l796Q048M486J295O227
17501I6082K269n816L198R935l231j0436m764j851q158M561k0624l063L178m495
17487E6785l63J120j764Q673N301J2876J4008m886j8930r385j0638J0416P14j0444
17473E3483J0230J2274K895o642R956O151r809j966j280q926L47k833P375L049
$$ plain form
17569 86352 80616 81598 78284 72008 65099 88140 106649 96935 85392 88497 103257 95882 84261
17556 84261 94459 106321 103248 88978 91489 107330 102929 88046 80921 70883 73029 81391 70343
17543 70343 57645 62561 65573 70793 75351 86019 73573 76081 73342 75441 82732 76073 69260 59177
17529 59177 78007 93097 97154 84922 77644 75212 80251 82780 76910 77342 83530 86230 86726 85769
17515 85769 72751 76767 82304 76667 73689 81856 93176 90843 79822 76026 84074 88560 89855 96082
17501 96082 98351 92535 95733 105668 102437 92001 87237 85386 77228 81789 61165 58102 61280 56785
17487 56785 56422 57542 55778 64451 69752 82628 96636 91750 72820 63435 52797 63213 63927 53483
17473 53483 63713 75987 78882 72240 82196 88347 78538 76572 75292 66366 66713 63880 71255 74304
17459G4304k073L723J58J0407J3418j4882j1737P425K37n664J41m980m840O001
17445G1638J6692K4397K1318L1879K6902O676o288k3025l1854j2953l87O434m933
17432A26496q203j9359m232J2549L972J4186p032j3674J042J4382L860R387J9247
17419A52621j364J3649K1298Q531J4162J9009Q422K1004M4618P4435Q8018J61394
17407F25797K58863K64909J23728K5788J4522M2532Q1873k0443r9089j13798j41860
17396A062822q4068O9806J81297P9385j1251j5773p42L4898k7594j19283j65008
17385A004489k09334k20925j50944j00986o6820m4653l0216k6672j4801r059k439
17374A27640J066k965J2588o88j87J444j2867o47L172j1851l643K052K133n108
$$ plain form
17459 74304 72231 75954 76112 86519 99937 85055 73318 80743 80980 75316 75457 70477 65637 71638
17445 71638 88330 112727 134045 165924 192826 199502 193214 170189 138335 125382 124995 131429 126496
17432 126496 118293 98934 94702 107251 111223 125409 118377 104703 105745 120127 123987 133374 152621
17419 152621 151257 164906 186204 194735 208897 227906 236328 257332 301950 376385 464403 625797
17407 625797 884660 1149569 1273297 1299085 1313607 1356139 1438012 1417569 1318480 1204682 1062822
17396 1062822 978754 1048560 1229857 1309242 1297991 1282218 1281476 1316374 1288780 1169497 1004489
17385 1004489 795155 574230 423286 322300 255480 210827 180611 153939 139138 130079 127640
17374 127640 128706 125741 138329 137641 137454 138898 126031 125384 128556 116705 113062 115114 117247 112139
17360A12139K749J0132Q960j5077k3281n279R212l622l775j656L608o614M844
17347I2340K575j995o529J906O083p168L741N038j0343O679P468Q51m765N621
17333A01502m868r633P195l858j7841O847N88K223O032K150Q27O739L284K671
17319A03858p341l993l839m462j0252j489Q002O199Po460L06J0432J0283k453
17305I8798q021N615j2190j7419j1941M134N361J806R021J0804Q586p208N294
17292I2640m709R363O14j2075n232L973N206J6167J5908N316l840R25q200n168
17278A10888L238N135J6293O469m31J4948N041m363q311o778m08M97K577J0141
17264A54936Q336P66j1911p028q899O770N443K799j3524j9204O902K1404M930
$$ plain form
17360 112139 114888 125020 133980 118903 95622 90343 99555 95933 92158 90502 94110 87496 92340
17347 92340 94915 92920 86391 88297 94380 87212 90953 95991 85648 92327 99795 100646 95881 101502
17333 101502 96634 87001 94196 90338 72497 79344 79932 82155 88187 90337 91164 97903 101187 103858
17319 103858 96517 92524 88685 84223 73971 72482 80484 86683 86690 80230 80536 90968 101251 98798
17305 98798 90777 96392 84202 66783 54842 58976 64337 66143 75164 85968 94554 87346 92640
17292 92640 87931 97294 97908 85833 80601 84574 89780 105947 121855 127171 123331 124256 116056 110888
17278 110888 114126 119261 135554 142023 141592 156540 161581 157218 148907 142129 141721 142218 144795 154936
17264 154936 163272 164038 152127 145099 136200 142970 148413 151212 137688 118484 125386 146790 151720
17251A51720r228q369r087o945j0694l196P752J8412L637o528m333n490R146L921
17237A30718j0200j3424Q577P326r104K765J1024k09j4411l430M386n15L298J808
17223A18609j7067j88R449J1585Q506j0015j1815r176L010R122O049R251k620
17210A24700M25K926R327k825p032q101N33q07J980P047O012j0574r119k795n989
17195A05708J4003l286r078J0155o882n135J825J7118J2745l615L978j9k810m056
17181A30651j7780j12J4364k094o335L935M372J1846K353p887r678J0315J9492
17168A53442Q534m844k177j0660j8741q98n97r75q412o605J1181J0849n650p400
17154A17047j657p336K067J7278l4j249j6040m549N625O453J0309l379m056l960
$$ plain form
17251 151720 142492 134123 125036 118091 107397 104201 111953 130365 134002 127474 123141 117651 126797 130718
17237 130718 120518 107094 115671 122997 113893 116658 127682 127473 113062 109632 114018 113503 116801 118609
17223 118609 101542 101354 110803 122388 130894 120879 109064 99888 102898 112020 118069 127320 124700
17210 124700 125125 128051 137378 134553 127521 119420 119953 119146 121126 128173 134185 123611 114492 111697 105708
17195 105708 119711 116425 107347 117502 110620 105485 107310 124428 137173 133558 137536 137517 134707 130651
17181 130651 112871 112759 127123 125029 118694 122629 127001 138847 141200 133313 123635 133950 153442
17168 153442 161976 157132 154955 144295 125554 124656 124059 123084 114672 108067 119248 130097 124447 117047
17154 117047 115390 108054 110121 127399 127365 126116 110076 105527 111152 117605 127914 124535 120479 116519
17140A16519J415P33o794j206p788JJ032J8743J6811j4015r961J1845M996l95
17126A31936Q301N41k012o451r996P901R020J0892Q110p24r376K000r741p119
17112A33282J2889L525r487p035n68R029o540o168J1333J1325J8323j991q784
17099A59133J142J1578M344j398m437J6147K6478M75j664K1312m816M411K6626
17086B59331J8645K5485J070L17j4640l925j3725j1002J2587K4051L219j1128
17074B90285j5301J679M926n258Q701K015k3011j8588l687p079j5122M200J681
17061B25441j2637j5270j4244L4R228J3735K600j0571o959J211p037J449J4834
17048B01814o54k6945p409j2958j1095n88O695k434P270R835J384m315j3925r566
$$ plain form
17140 116519 117934 118667 111873 110667 102879 102880 103912 122655 139466 125451 115490 127335 132331 131936
17126 131936 140237 140778 138766 132315 122319 130220 139240 150132 158242 157518 148142 150142 140401 133282
17112 133282 146171 149696 140209 133174 132606 141635 135095 128927 140260 151585 169908 167917 159133
17099 159133 160275 171853 176197 174799 170362 186509 212987 213462 211798 233110 228294 232705 259331
17086 259331 277976 303461 304531 304848 290208 286283 272558 261556 274143 298194 301413 290285
17074 290285 274984 276663 281589 276331 285032 287047 264036 245448 241761 234682 219560 223760 225441
17061 225441 212804 197534 183290 183324 192552 206287 208887 198316 191357 192568 185531 186980 201814
17048 201814 201160 174215 166806 153848 142753 142165 148860 146426 153696 163531 164915 160600 146675 137109
17034A37109M234m073j8244j2619j1372p774k7878l1807o717N138K1337j6737
17022C0597j7841J5737J6172L3037K0399N434p450k8186J846K2083Q124q94n007
17009I4051K3219L2228K6335L3008L6816K7951J6288O939j0882p117Q957m074
16997B83719N967J4744R791j2268p777p046k0621p31l705J041K303l099J572J3214
16983B77104J7619K0583J6431r32k233J2594K1686M530k9694k2054P81J8064J0100
16970C44579K1423L7782K3796J4782J6386J175l5545j6785j6429n743J6573K1598
16958D23592N687l2484l2740L917M6759M9228J2590l1338l1880j1604P403J5191
16946D24321J3131m826j8232j4881M4061P0272M5269O41q160J6748R139k158j4053
$$ plain form
17034 137109 141343 137270 119026 106407 95035 87261 59383 27576 20859 25997 47334 30597
17022 30597 12756 28493 44665 77702 98101 103535 96085 67899 69745 91828 99952 99058 94051
17009 94051 117270 149498 175833 208841 245657 273608 289896 296835 285953 278836 287793 283719
16997 283719 289686 304430 314221 301953 294176 287130 266509 265778 262073 263114 265417 262318 263890 277104
16983 277104 294723 315306 331737 330805 328572 341166 362852 367382 337688 315634 316415 334479 344579
16970 344579 366002 403784 427580 442362 458748 459923 424378 407593 391164 385421 401994 423592
16958 423592 429279 396795 364055 367972 414731 463959 476549 445211 413331 401727 409130 424321
16946 424321 437452 432626 414394 399513 443574 513846 559115 559756 551596 568344 577483 575325 561272
16933E61272j3440R254K7483J3714J4120K0398J0749P039K518J7778J9134J9145
16921G09164J5820R456R429J6590Q979n000J2999J9099K5828L5422J5644Q834
16909H82264M5029K2735K2864K7182J1022J3239J8912K7298L1753K1464J6974
16898A140736K9600M4443M1957K5522J3833K796L9242N8426O6767M1054L2997
16887A537373M6319K5643M2590O2611O8247N3364M3099M4647O3385Q1322Q8519
16876B157119J24741J11624J04534J16551J22629J54837J86485K34468K94237
16867C607225L97147M37865L18906K63507K72776L23427L64733K87446K80302
16858F553334L28400L54718N10188Q45791J089589J003305Q75598R89239J262559
$$ plain form
16933 561272 547832 557086 584569 598283 612403 632801 643550 650589 653107 670885 690019 709164
16921 709164 724984 734440 743869 760459 769438 764438 777437 796536 822364 857786 873430 882264
16909 882264 927293 950028 972892 1000074 1011096 1024335 1043247 1070545 1102298 1123762 1140736
16898 1140736 1170336 1214779 1256736 1282258 1296091 1298887 1338129 1396555 1463322 1504376 1537373
16887 1537373 1583692 1609335 1651925 1714536 1782783 1836147 1879246 1923893 1987278 2068600 2157119
16876 2157119 2281860 2393484 2498018 2614569 2737198 2892035 3078520 3312988 3607225
16867 3607225 4004372 4442237 4761143 5024650 5297426 5620853 5985586 6273032 6553334
16858 6553334 6881734 7236452 7746640 8592431 9682020 10685325 11560923 12550162 13812721
16849A3812721J689738J938482K082417K429235K868568L564740M746725O694273
16841C9826899R651891J4360403K3064834L8351575N0873760L4067845Q654944
16834B18852151M328829L539028R137378M967094j3214509j7211311k2752049
16827A87646611k3023346m85628K7743542K6714408L385745k484729k356871K230003
16819B19369735K640959j6027447k4790990l2166194m1721922l6054900k2439074
16812D8810167j3351499q501627n789217m018281k701336j885783j477270j124794
16804I960360p79262n09734m87773o35335o27633n78760n33463m97056m82344
16795D829000m11244l71285l29779j71421j4497P542j06387j27590j37777j03130
$$ plain form
16849 13812721 15502459 17440941 19523358 21952593 24821161 28385901 33132626 39826899
16841 39826899 49478790 63839193 86904027 125255602 176129362 210197207 218852151
16834 218852151 223180980 226720008 235857386 240824480 227609971 210398660 187646611
16827 187646611 164623265 164137637 191881179 218595587 221981332 219496603 217139732 219369735
16819 219369735 222010694 205983247 181192257 149026063 107304141 71249241 48810167
16812 48810167 35458668 26957041 21167824 17149543 14448207 12562424 11085154 9960360
16804 9960360 9181098 8671364 8183591 7548256 6920623 6341863 5808400 5311344 4829000
16795 4829000 4417756 4046471 3716692 3545271 3530774 3538316 3431929 3304339 3166562 3063432
16785C063432r3903k01490k33930k34132k83056k66503j93086j10271p9139p7071
16775A290851o8550n1625l5145m0697n5569l4869m464P012K8576K5068N4698J07166
16763A222452J72537K95430M65760M35967J06349p2150j59894k16578n4531L17757
16753B513099O42821O13295K18366j84377m52479o10650n38583k36688J33549
16744B098353K72467J5260j91773k78872m01135m15562k82746j61670j19332r7246
16734D37744o6403l4161j3156j3878k2422k1893j0231O256J3909K2j0335o932
16722B58520Q649n72j0211k807m81J145k1577O449M1922K5741J0783K8776K7192
16709C73529j7244k5043M329K0977N267m9266n1229k2981P428Q873K2615J8655
$$ plain form
16785 3063432 2969529 2768039 2534109 2299977 2016921 1750418 1557332 1447061 1367922 1290851
16775 1290851 1222301 1170676 1135531 1094834 1039265 1004396 999932 1006944 1035520 1060588 1115286 1222452
16763 1222452 1394989 1690419 2156179 2592146 2698495 2626345 2466451 2249873 2195342 2513099
16753 2513099 3155920 3769215 3987581 3803204 3350725 2740075 2201492 1964804 2098353
16744 2098353 2370820 2386080 2194307 1915435 1514300 1098738 815992 654322 534990 437744
16734 437744 371341 337180 324024 310146 287724 265831 255600 261856 275765 275787 265452 258520
16722 258520 267169 266597 256386 253579 253098 254243 232666 239115 281037 306778 317561 346337 373529
16709 373529 356285 331242 335571 356548 361815 312549 261320 238339 245767 254640 277255 295910
16697B95910k1734j9010Q027J5614O070n0277m0123m2822j8351j5301j7509j714
16685I8780O486R305j681Q145J887k863K278r459k279j2676m166j3036j9477k1540
16671C9704M479K8421K7421J3675K607k462j0656j4421j3714j1305j6381l2335
16659A5033k1493m19N921J5262o610j8266J001j59J3542P944K0396K2038M2105
16646I6295M9537L9234K0650O666l468j1426R846k619j3267l4970j6365J0753
16634A50866J2905J9781Q302J2102k268l014J7323m796j8487k6473k5814j6070
16622A24357k2879k992j8938j6447j8724l145J64j131l064R623J0513J6951j45
16609G4143k2944j4461p220M277J1391l325k1691l905O553k1521r853J1702P301
$$ plain form
16697 295910 274176 255166 263193 278807 284877 234600 194477 151655 133304 118003 100494 98780
16685 98780 105266 114571 112890 121035 122922 120059 122337 112878 110599 97923 93757 80721 61244 39704
16671 39704 44183 72604 100025 113700 116307 113845 103189 88768 75054 63749 47368 15033
16659 15033 -6460 -6879 -958 14304 7694 -10572 -9571 -9730 3812 11756 32152 54190 96295
16646 96295 145832 185066 205716 212382 208914 197488 207334 204715 191448 156478 140113 150866
16634 150866 163771 183552 191854 203956 201688 198674 215997 211201 192714 166241 140427 124357
16622 124357 101478 98486 79548 63101 44377 41232 41396 40265 37201 46824 57337 74288 74143
16609 74143 51199 36738 29518 33795 45186 41861 20170 16265 22818 1297 -8556 3146 10447
16596A0447N638K574j700p294k385K854J2220J8560P553o148j3592j8937p770
16583B020O666J3108q64N148J9436J8767p082k0226L77K1556L070r509k3324P306
16569C6449J7817K239L732o343j2705j1683m8J618Q797K187k175L022J2810k1104
16555C4613j2626k843j869o597J4834J1707o599j0427j4612j2215o78p417O655
16542h074J9267j705j8474n396N363J7214j0658j7548o632J0223J5085O719p171
16529a787p036N753p232m179K980j4544l156J339P765J1077J222L013O161n136
16515c760K798P083k075m787J1841J4536q310k519j1122j0199L250P026K304k915
16501C151o585m379l146j9207q194j239K090N500k427m989L348k514N662p957
$$ plain form
16596 10447 16085 18659 16959 9665 7280 10134 22354 40914 48467 42319 28727 9790 2020
16583 2020 8686 21794 20930 26078 45514 64281 57199 36973 37350 58906 61976 52467 29143 36449
16569 36449 54266 56505 60237 53894 41189 29506 29458 31076 39873 42060 39885 42907 55717 34613
16555 34613 21987 19144 17275 10678 25512 37219 30620 20193 5581 -6634 -7312 -14729 -8074
16542 -8074 11193 9488 -8986 -14382 -9019 8195 -2463 -20011 -26643 -16420 -1335 5384 -1787
16529 -1787 -8823 -3070 -10302 -14481 -11501 -26045 -29201 -27862 -20097 -9020 -7798 -4785 1376 -3760
16515 -3760 -962 6121 4046 -741 11100 25636 17326 14807 3685 -6514 -3264 3762 6066 3151
16501 3151 -3434 -7813 -10959 -30166 -38360 -39599 -37509 -32009 -34436 -39425 -36077 -38591 -32929 -40886
16487d0886j5193J8548J2626J516p303o5K123m077q477M91K5297J8168O364m0200
16473c1068k0209J5231p60Q140J6017j956m657p683M116R363N12o319p299M203
16459b2369j817m136L285r612j1222M785L437n194j044R021K57l465o771R7l730
16444d8478k388R001N945r358J426p736L496j262k812j443l158L955J393n013
16430e6432j592J4834J5021p86m576j816j2265j9494K483P154J898J6147O814
16417c2610r865J989Q652J392P256o89j3410m524O747n296n721M155m265L095
16403d3094Q511k157k008M184q574J206p294Q59j4177j5910N65K014Q030O200
16389f1645M852N719R833j1133j1921O087J2453r34j562M874n149J0965J1223
$$ plain form
16487 -40886 -56079 -37531 -24905 -23389 -30692 -30757 -28634 -32711 -41188 -40697 -15400 2768 9132 -31068
16473 -31068 -51277 -36046 -36806 -28666 -12649 -14605 -19262 -26945 -22829 -13466 -12954 -19273 -26572 -22369
16459 -22369 -24186 -28322 -25037 -34649 -45871 -41086 -37649 -42843 -43887 -34866 -34609 -38074 -44845 -44748 -48478
16444 -48478 -50866 -41865 -35920 -45278 -43852 -51588 -48092 -49354 -52166 -53609 -56767 -52812 -51419 -56432
16430 -56432 -58024 -43190 -28169 -28955 -33531 -35347 -47612 -67106 -64623 -57469 -55571 -39424 -32610
16417 -32610 -42475 -40486 -31834 -30442 -23186 -23875 -37285 -41809 -35062 -40358 -46079 -41924 -46189 -43094
16403 -43094 -34583 -36740 -38748 -34564 -43138 -41932 -49226 -48367 -62544 -78454 -77889 -75875 -67845 -61645
16389 -61645 -56793 -51074 -41241 -52374 -64295 -58208 -45755 -46689 -48251 -43377 -48526 -37561 -26338
16376b6338Q202J2447n145j2591n780R655J3081J3275J1559j560L617P4r391o635
16362D470m382J9977K6297n447l3852l837O95Q759R336M476j200K115P916o056
16348B9267n887j1200j0238J814j490n370O66K718k871p373Q493Q610O646J2896
16334B6681P995j6676n929j830p060m530p97m161J4471M287O209P786j1693j0099
16320D654j0833k7583j2125J2811J6356l479r609N883J0509l686j1036l508J8471
16307a3175R438J2384m791n357K703R322n019J604k280L350J0727J836l225P13
16293A8230j3976p532j519K0600L328j2176l708n074J073K3590L837m85l289j1584
16279A1315k88K4548J0459L736j876L236N005J6219K5159J3151J8533J5238J5343
$$ plain form
16376 -26338 -18136 -5689 -10834 -23425 -29205 -19550 -6469 6806 18365 16805 20422 20496 11105 4470
16362 4470 88 20065 46362 40915 7063 3226 3921 12680 22016 26492 25292 27407 35323 29267
16348 29267 23380 12180 1942 3756 2266 -3104 -2438 280 -2591 -9964 -1471 7139 13785 26681
16334 26681 34676 18000 12071 10241 3181 -1349 -2146 -6307 8164 12451 18660 26446 14753 4654
16320 4654 -6179 -33762 -45887 -33076 -16720 -20199 -29808 -23925 -13416 -17102 -28138 -31646 -13175
16307 -13175 -3737 8647 3856 -1501 1202 10524 5505 7109 4829 8179 18906 20742 17517 18230
16293 18230 4254 -3278 -4797 15803 19131 6955 3247 -1827 -754 22836 26673 26188 22899 11315
16279 11315 11027 35575 46034 49770 47894 51130 56135 72354 97513 110664 129197 144435 159778
16266A59778L2839M3318O5988J05664J87711K66784K48550P8677J4884J7696N5233
16255A277122N7872m4793r3988j07710j50324n3657J22025J71564M3786K41q694
16244A213444L831K3017n4283j38401j68544k37585k13576j37962q2087n3302
16234A54552m4309j1931k0495r502j0802l981r091m128K316j2015j7991O61n876
16221G408j9026O08J7969O61j126r86j200J977Q804J9649j391r001o502j2158
16207E686q295k788M734P662M808L585P604M91m424j1468O619K511l093j09l515
16192A0008p047o160J4889K8697n419j1464l814P503J046k418k593j3742p758
16179A728m709j5611j36J8619j029r125j985J607J0069L522R337L758k68j3645
$$ plain form
16266 159778 192617 235935 301923 407587 595298 862082 1110632 1189309 1204193 1221889 1277122
16255 1277122 1334994 1290201 1196213 1088503 938179 884522 1006547 1178111 1221897 1222138 1213444
16244 1213444 1217275 1240292 1186009 1047608 879064 641479 427903 289941 207854 154552
16234 154552 110243 98312 77817 68315 57513 53532 44441 40313 42629 30614 12623 13284 7408
16221 7408 -11618 -11010 6959 7620 6494 5508 4308 6285 15089 34738 33347 24346 17844 5686
16207 5686 -2609 -5397 -663 6999 11807 15392 22996 23487 19063 7595 14214 16725 13632 13523 10008
16192 10008 2961 -3199 11690 40387 34968 23504 19690 27193 28239 25821 23228 9486 1728
16179 1728 -2981 -18592 -18728 -109 -1138 -10263 -12248 -10641 -572 2950 12287 16045 15777 2132
16165B132k251N697q03m035j8958o032J1731n292o425n344j396P520M404l238
16151b2290m776K332p930m11J800j0465o71L623p924J3685J1300p705j1046J1660
16137b8818J4243J518j0913M337k396J113K293M285j778o857q589k648l4J3135
16123b1109Q319j4147L563J3463p59n336j1222O298K309M087K773M030L591J288
16109b852p39r388O62K353L449j2905j6201n036o996R393n78L110M710l286J475
16094c2829o376O923K1778M509j8921n984J3223K226N014M248K428o775o777n097
16080b2410m827l49R260J3679l929J842p784n170j494M438J0835j320j0435m737
16066b2401P99N590K117M941J1159J1541j911N566j8219j1006P157M83M409J131
$$ plain form
16165 2132 -119 5578 4775 740 -18218 -24250 -12519 -17811 -24236 -29580 -30976 -23456 -19052 -22290
16151 -22290 -27066 -24734 -32664 -33075 -31275 -41740 -42411 -38788 -46712 -33027 -21727 -29432 -40478 -28818
16137 -28818 -14575 -13057 -23970 -19633 -22029 -20916 -18623 -14338 -16116 -22973 -31562 -34210 -34244 -21109
16123 -21109 -12790 -26937 -23374 -9911 -10670 -16006 -27228 -20930 -18621 -14534 -11761 -7731 -4140 -2852
16109 -2852 -3591 -12979 -12317 -9964 -6515 -19420 -35621 -40657 -47653 -38260 -38838 -35728 -31018 -34304 -32829
16094 -32829 -39205 -32282 -10504 -5995 -24916 -30900 -17677 -15451 -10437 -6189 -3761 -10536 -17313 -22410
16080 -22410 -27237 -27586 -18326 -4647 -8576 -6734 -14518 -19688 -21182 -16744 -5909 -7229 -17664 -22401
16066 -22401 -21602 -16012 -13895 -8954 2205 13746 11835 17401 -818 -11824 -4667 -4184 225 1356
16052A356j5675k126N943j2077j1567l298M960p204J764J7053n77Q230J3384Q643
16038H809l594o442M927l382j0636q840O365P735k26k159q17r494k704n190l347
16023b8995Q701O619n424j1591L045m982m164k786J0984R899m130Q363M593j0795
16009b0663j1661p25J1257L254m974r459J2589K882k180P081J2388k04L72N170
15995E127L587r62r132L77K970q499n670R169N90r182N484O359K862j0644J0248
15980B684k545j0941N359q729j6375p979J1892M062J0869Q830j0606j872l782
15967a9133o574O421M539N345Q113J673o055j4690q905N110J7119N614J2691R596
15953B0864j6014r550K296M544j066K391l779n821p357j1099p450P275N230P591
$$ plain form
16052 1356 -14319 -16445 -10502 -22579 -34146 -37444 -32484 -39688 -37924 -20871 -21448 -13218 166 8809
16038 8809 5215 -1227 3700 318 -10318 -19158 -12793 -5058 -5284 -7443 -8260 -17754 -20458 -25648 -28995
16023 -28995 -20294 -13675 -19099 -30690 -27645 -32627 -36791 -39577 -28593 -18694 -22824 -14461 -9868 -20663
16009 -20663 -32324 -33049 -21792 -18538 -23512 -32971 -20382 -17500 -19680 -12599 -211 -415 -43 5127
15995 5127 8714 7752 -1380 -1003 1967 -6532 -12202 -3033 -2443 -11625 -6141 218 3080 -7564 2684
15980 2684 139 -10802 -5443 -14172 -30547 -38526 -26634 -22572 -11703 -2873 -13479 -15351 -19133
15967 -19133 -25707 -19286 -14747 -9402 -1289 384 -5671 -20361 -29266 -24156 -7037 -1423 11268 20864
15953 20864 4850 -4700 -2404 2140 1074 3465 -314 -6135 -13492 -24591 -32041 -24766 -19536 -11945
15939a1945m165k651N780o359o885n627o979n680O822J1769N263n2n618M798p408
15924b8937J735N334m027O51m107N954J0898R28l176o955K856j164J92M610l584
15909a8792j4244k924J2453N367m865p4Q754J1721J0097o626o060J371k644j0373
15895a6839j7544K46J0886J475M382m305K422n17N822J3879K063j890q127q699
15881a6746o841K386m004q589M938J3324L965Q703P304K094r564j1123j6071l448
15867c3672J2101J0666N133J1263J3356M650l055k263n144q241o05M517j1030
15854b324k2105j0786J9612L658m251O030q094j6707r3j716P864K034J0376O448
15840a0054j513j6117Q523O436L79L468M445L011j2644o983Q839n660m070K0111
$$ plain form
15939 -11945 -16110 -18761 -12981 -19340 -26225 -31852 -38831 -44511 -37689 -25920 -20657 -20709 -26327 -21529 -28937
15924 -28937 -27202 -21868 -25895 -25244 -29351 -23397 -12499 -11571 -14747 -21702 -18846 -20010 -19818 -15208 -18792
15909 -18792 -33036 -35960 -23507 -18140 -23005 -23079 -14325 -2604 7493 867 -5193 -3822 -6466 -16839
15895 -16839 -34383 -34137 -23251 -21776 -17394 -21699 -19277 -19794 -13972 -93 1970 80 -8047 -16746
15881 -16746 -23587 -21201 -25205 -33794 -28856 -15532 -11567 -2864 4440 6534 -3030 -14153 -30224 -33672
15867 -33672 -21571 -10905 -5772 5491 18847 23497 20442 18179 13035 4794 4189 8706 -2324
15854 -2324 -24429 -35215 -15603 -11945 -16196 -10166 -18260 -34967 -35060 -36776 -28912 -26878 -16502 -10054
15840 -10054 -11567 -27684 -19161 -12725 -12346 -8878 -4433 -1422 -14066 -21049 -12210 -17870 -21940 -1829
15826a829Q153j0829m635n311o041k482P700M122n395j1367J403M498N578Q340
15812h095k797O128J53J144O230M392m412j2183j6465j0701P980K6192K0738K569
15798B0873j6992j1853J1046Q96j631L449j901j5166j5926J407L331O070M478
15785a1919j3295L383J3812M96n601q970J2415J1016j446m670M269r936r123L510
15771a6059M202k147K885j3369L022J0654O93K380N490j1667q309o205p983J2136
15757b4277J0946n834j0206P389J979r24j428J4640O70j35n790M255m157j5196
15743b8068j091J0075J1701oj717k04J0835J3328o357J453l482j858m650O873
15729F832k1071j7458J0061M947J8317J065m918j913j1507j3003j003J886N401
$$ plain form
15826 -1829 6324 -4505 -9140 -14451 -20492 -22974 -15274 -11152 -16547 -27914 -26511 -22013 -16435 -8095
15812 -8095 -10892 -4764 -4611 -3467 2763 7155 2743 -9440 -25905 -36606 -28626 -2434 18304 20873
15798 20873 3881 -7972 3074 3970 2339 5788 3887 -11279 -27205 -25798 -22467 -16397 -11919
15785 -11919 -25214 -21831 -8019 -7523 -13124 -22094 -9679 1337 -109 -4779 -510 -10446 -19569 -16059
15771 -16059 -11857 -14004 -11119 -24488 -21466 -10812 -10119 -7739 -2249 -13916 -22225 -28430 -36413 -24277
15757 -24277 -13331 -19165 -29371 -21982 -20003 -20927 -22355 -7715 -7045 -7180 -12970 -8715 -12872 -28068
15743 -28068 -29159 -19084 -7383 -7389 -9106 -9310 1525 14853 8496 9949 6467 4609 -41 6832
15729 6832 -14239 -31697 -21636 -16689 1628 2693 -2225 -4138 -15645 -28648 -29651 -27765 -22364
15716b2364Q83j325J8449N010j568o529l772P625k982k207r057M252K142N42N543
15701e358J8740P2K305j0686j3887j981Q553Q640k97m097n080q81j408J041q890
15686a3214O701J0342o114M712p763q522R773Q329n841N073J5468Q221j7381L188
15672A2972o680o716q459j711q513Q65L258r134J4112J1670k094n720M679J1233
15658I762O951m053l167o441r498J376k6873k704K15j39J6001K1512K128n354
15644b84o443m556p561p358J589J0429O431p567k781o474P72K3179N520q904j731
15629e739q943k43p291L162J484j0169M671K759k87j482r434P312J3100K2858
15615A1758K012L373j2043k327n775j6081K005N976M921j1090j5582J1089J611
$$ plain form
15716 -22364 -21481 -22806 -4357 653 -915 -7444 -11216 -3591 -6573 -8780 -17837 -13585 -11443 -10901 -5358
15701 -5358 13382 13454 15759 5073 -8814 -10795 -2242 6398 6101 2004 -3076 -3957 -5365 -4324 -13214
15686 -13214 -6513 3829 -2285 2427 -5336 -13858 -4085 4244 -1597 3476 18944 27165 9784 12972
15672 12972 6292 -424 -8883 -10594 -19107 -18242 -14984 -24118 -10006 1664 -430 -6150 -1471 9762
15658 9762 16713 12660 9493 3052 -6446 -5070 -31943 -34647 -34432 -34571 -18570 2942 5070 -284
15644 -284 -6727 -11283 -18844 -26202 -24613 -14184 -7753 -15320 -18101 -24575 -23803 -624 4896 -4008 -5739
15629 -5739 -14682 -14925 -22216 -19054 -17570 -27739 -23068 -20309 -20596 -22078 -31512 -24200 -11100 11758
15615 11758 13770 17143 5100 2773 -3002 -19083 -17078 -11102 -6181 -17271 -32853 -21764 -20153
15602b0153O661j311Q537M263J944n493J813J532K484m019l374N519r31J946p594
15587h176p033M46j225K215J414o407j3798j4036R577J9779N082o233k959N095
15573a6259O169J731O473N304j0430m73k13K015O336J0123o12r624l461j614n694
15558a0229o231M392M186o675q505K978N000j865M025J1701l716r161O62j93k253
15543a5884J5086m510j1251q01J5795Q973L625Q313j4094j3313l189N472Lk63
15529f038j337O764Q021K26p807r946j7434q142l623L114J2741J3348n252r870
15515b5235l920J9272J7179j463m37j8305j1388K647j869j0913n9N997K4582J5160
15501A1248k525j0859q93n120j849l839M69P93p048q555p444j011J6085Q707N225
$$ plain form
15602 -20153 -13492 -14803 -6266 -2003 -59 -5552 -3739 -2207 277 -3742 -7116 -1597 -2528 -582 -8176
15587 -8176 -15209 -14763 -15988 -13773 -12359 -18766 -32564 -46600 -37023 -17244 -12162 -18395 -21354 -16259
15573 -16259 -10090 -8359 -1886 3418 -7012 -7485 -7698 -5683 653 10776 10164 540 -2921 -4535 -10229
15558 -10229 -16460 -12068 -7882 -14557 -23062 -20084 -15084 -16949 -12924 -1223 -4939 -14100 -13438 -13631 -15884
15543 -15884 -798 -5308 -16559 -17360 -1565 7408 11033 19346 5252 -8061 -11250 -5778 -5775 -6038
15529 -6038 -7375 -611 7410 7636 -171 -10117 -27551 -35693 -39316 -36202 -23461 -10113 -15365 -25235
15515 -25235 -29155 -9883 7296 5833 5396 -12909 -24297 -21650 -23519 -34432 -34491 -28494 -3912 11248
15501 11248 8723 -2136 -3029 -8149 -9998 -13837 -13368 -12575 -19623 -28178 -35622 -36633 -20548 -11841 -6616
15486f616M031J0918p230j4389M643k815p461q135L927J3318N172j7515Q78K3098
15472A824J971q090m395L650l723j745j561L748j1228q575J6918J43p633l911
15458b2607R566K1845O364n250q401j013N235k083j027p84j1431j8925r95J2222
15444a7284J0225J3291K096J137L397O51n154q850O085r393k233L872j0589M771
15430g978J9620N47o428j5826n951l096J8179J3564L419l363l200j979r713m332
15416f537L26n417n468Q490J2811j785m232m077J420L002N42j521p075r160n849
15401b4530O97J2494P130K805J152m097j2760k228Q091J8568J9030K245k1023
15388G574j4876o710J518Q000J88j6503q389J4350J6792P37p127P5N131J7877
$$ plain form
15486 -6616 -2585 8333 1103 -13286 -8643 -11458 -18919 -27054 -23127 -9809 -4637 -22152 -21274 1824
15472 1824 3795 -4295 -8690 -5040 -8763 -10508 -12069 -8321 -19549 -28124 -11206 -11063 -18696 -22607
15458 -22607 -13041 8804 15168 9918 1517 504 5739 3656 2629 1845 -9586 -28511 -29506 -17284
15444 -17284 -7059 6232 8328 9465 12862 13513 8359 -491 5594 -3799 -6032 -2160 -12749 -7978
15430 -7978 11642 12189 5761 -10065 -16016 -19112 -933 12631 16050 12687 9487 7508 -2205 -6537
15416 -6537 -6211 -11628 -17096 -8606 4205 2420 -1812 -5889 -4469 -1467 -925 -2446 -9521 -18681 -24530
15401 -24530 -23833 -11339 -4209 -1404 -252 -4349 -17109 -19337 -11246 7322 26352 28597 7574
15388 7574 -7302 -14012 -12494 -4494 -4306 -20809 -29198 -14848 1944 2681 -4446 -4371 760 18637
15374A8637P884j064o593k1860n316J656J0137O994P368R019r747j231R825o912
15360A8797j0066O248m85j1626r421J2208J053m610r317q537K367M200J229j4849
15346b2809j0413J4400J5812J0288R67r79l24m344j0455L286m274j199j142j0569
15332b1755j937Q241Q361M135K252m16o962P465L712j340L078N568K377j0904
15318A875j0911m216L040k581j7995N62K016m273L091M784P218j551r987M796
15304b4132P880k714o239J3906N698j9352L816o88O39K845m654q078N379J5641
15290a0053q788o616J5238J1052p83j0075n036K67n84l523R015k730p609j0526
15276c0751j9722k417J5652J4378J1095J4149O968n752j909P634P102J0653k476
$$ plain form
15374 18637 26521 25457 18864 -2996 -8312 -6656 3481 10475 17843 26862 17115 15884 25709 18797
15360 18797 8731 14979 14494 2868 -6553 5655 6708 2098 -7219 -15756 -13389 -9189 -7960 -22809
15346 -22809 -33222 -18822 -3010 7278 8245 7266 6942 2598 -7857 -4571 -8845 -10044 -11186 -21755
15332 -21755 -23692 -15451 -7090 -2955 -703 -1119 -8081 -616 3096 1756 4834 10402 12779 1875
15318 1875 -9036 -13252 -10212 -12793 -30788 -30226 -28210 -32483 -29392 -24608 -17390 -18941 -28928 -24132
15304 -24132 -16252 -18966 -25205 -11299 -5601 -24953 -21137 -21825 -21186 -18341 -22995 -31073 -25694 -10053
15290 -10053 -18841 -25457 -10219 833 50 -10025 -15061 -14794 -15378 -18901 -9886 -12616 -20225 -30751
15276 -30751 -50473 -52890 -37238 -22860 -11765 2384 9352 3600 1691 9325 16427 27080 24604
15263B4604j1017n198j0913n820j3617L596K952J7292P688p738k573L816K497
15250E569N500J87m424L909R60k413o541j3378m967m976Q159J5012N722j1737
15236c418q407K38J2612K2397p110r253O982q710o537P621r438j3447J178P501
15222g791k999j3232O514P644K281L983j1397l479N803n404K997O99j619K798
15208a3202J1712m114L976M331j683j2253L317K013J159o043m727J248m735j901
15194b0902n24j277M476k597l245l067J6070J3524R670p534j3952N470O641K390
15180E143r009p538O369L869p608P504K2324p914r285P395K285M985q864L808
15166A3464P740R0o799O44M736j1439k324R165M468p626J415j5990j7196j870
$$ plain form
15263 24604 13587 8389 -2524 -8344 -21961 -18365 -15413 1879 9567 1829 -744 3072 5569
15250 5569 11069 11256 6832 10741 11701 9288 2747 -10631 -15598 -20574 -12415 2597 8319 -3418
15236 -3418 -11825 -11587 1025 23422 16312 7059 14041 5331 -1206 6415 -3023 -16470 -15292 -7791
15222 -7791 -10790 -24022 -17508 -9864 -7583 -3600 -14997 -18476 -12673 -18077 -15080 -14381 -16000 -13202
15208 -13202 -1490 -5604 -1628 2703 1020 -11233 -7916 -5903 -4744 -10787 -15514 -14266 -19001 -20902
15194 -20902 -21426 -22703 -18227 -20824 -24069 -27136 -11066 2458 12128 4594 -9358 -3888 2753 5143
15180 5143 -3866 -11404 -5035 -1166 -8774 -1270 21054 13140 3855 11250 13535 18520 9656 13464
15166 13464 21204 21294 14495 15139 19875 8436 6112 15277 19745 12119 13534 -2456 -19652 -21522
15152b1522n924n726N619Q530m791M951j5189n769m405l271O229K1990J4850o596
15138a1024Q194M088m872P019l368m40N308N713O541j0642l880j0819l838P633
15124d387M82M630P272R994j1302q973j366R84R892m86n314j5891l048J7300J2907
15109A2694q107j1794L359J0991P372k858k281r91o783n202r6K119j1012J1105
15095a484P323j815M612r674k981M757J0145q383q130m827N039j2317M72k415
15081a9678K606K236j0231N338O229M676K24j0403N382l241j857N770j70K345
15067a0774N345q839l820N323K577l281M796L051M274J815O710l738n446m611
15053f618M325L652j762j0016o124O257J0612O84l055r37j2524l993l15J3862
$$ plain form
15152 -21522 -27446 -33172 -27553 -19023 -23814 -18863 -34052 -39821 -44226 -47497 -41268 -19278 -4428 -11024
15138 -11024 -2830 1258 -3614 3405 37 -403 4905 10618 17159 6517 2637 -8182 -12020 -4387
15124 -4387 -3905 725 7997 17991 6689 -2284 -3650 -2666 7226 6740 1426 -14465 -17513 -213 12694
15109 12694 4587 -7207 -3848 7143 14515 11657 9376 8385 1602 -3600 -3696 -1577 -12589 -1484
15095 -1484 5839 4024 8636 -1038 -4019 738 10883 2500 -5630 -10457 -5418 -17735 -17263 -19678
15081 -19678 -17072 -14836 -25067 -19729 -13500 -8824 -8600 -19003 -13621 -16862 -18719 -12949 -13119 -10774
15067 -10774 -5429 -14268 -18088 -12765 -10188 -13469 -8673 -5622 -1348 467 7177 3439 -2007 -6618
15053 -6618 -2293 1359 -403 -10419 -16543 -10286 326 1010 -2045 -2982 -15506 -19499 -19814 -5952
15039e952P952k589l469o586m862J4693R947j86p069k904Q681m848j6145o274
15025a9611K1423K730j9128j4262M184Q344L310N129J2204l430m939J491M362
15012A807j867L930j4120j1895j045L047J887Q98J2339L638j0448O108P313k171
14998e79j6809m95N99N346r114J4262J166J1733k117k529k547J580n262k488L287
14983c967r509j372J4345J0444p166j8209O425J983Q24o045J2333J7839O993j6570
14969H348j0543m073n309l707p030k044j1962Q230L467Q751J5647l809K462O975
14955E403j0668m733P904o744Q80j3037J220p584m497N642J8483R994l867k506
14941d110K496q937j1900M646J4855o869O08J1292p946n486N848J4450Q829n698
$$ plain form
15039 -5952 2000 -589 -4058 -10644 -15506 -813 9134 8948 1879 -1025 7656 2808 -13337 -19611
15025 -19611 1812 4542 -14586 -28848 -24664 -16320 -13010 -7881 4323 893 -4046 -2555 1807
15012 1807 -60 3870 -10250 -22145 -23190 -20143 -18256 -17358 -5019 -1381 -11829 -5721 1592 -579
14998 -579 -17388 -17883 -17284 -11938 -21052 -6790 -5624 6109 3992 1463 -1084 496 -4766 -7254 -3967
14983 -3967 -13476 -14848 -503 9941 2775 -15434 -9009 -7026 -6202 -12247 86 17925 24918 8348
14969 8348 -2195 -6268 -11577 -15284 -22314 -24358 -36320 -28090 -24623 -15872 -225 -4034 -1572 5403
14955 5403 -5265 -9998 -2094 -8838 -7958 -20995 -19775 -27359 -31856 -26214 -7731 2263 -1604 -4110
14941 -4110 -1614 -10551 -22451 -17805 -2950 -9819 -9211 2081 -5865 -11351 -5503 8947 17776 12078
14927A2078o549k177j3698q066M854k069k528O922P736J4038q561p725j806l889
14913a1440P275L692r235j639L445M670N522K877N537m031l810m829o141P215
14899h92M512k322p960K369j7757O163M793n60j3300k37J0006M62L631r130r393
14884b9615p515J4471J9573N447l422j0475l377M230J629j537J2152J805j2763
14871i397m404L70Q587m164n624J374j2272P935J4877J957k413r35K298K237j0477
14856a0051Q679J0595P139n054j1834m552O06j423r25o48P584k495K389J023N72
14841A605p162k392j177K720Q133Q275l064R309N845r947j4352j790j2256o460
14827b2713Q953Q093Q903j511P918J1499k0160j216n757j4739J1936J1855j5801
$$ plain form
14927 12078 5529 3352 -10346 -18412 -13558 -15627 -18155 -11233 -3497 10541 1980 -5745 -7551 -11440
14913 -11440 -4165 -473 -9708 -11347 -7902 -3232 2290 5167 10704 6673 2863 -1966 -8107 -892
14899 -892 3620 1298 -6662 -4293 -22050 -15887 -11094 -11654 -24954 -25191 -15185 -14723 -11092 -20222 -29615
14884 -29615 -37130 -22659 -3086 2361 -1061 -11536 -14913 -10683 -9054 -10591 1561 3366 -9397
14871 -9397 -13801 -13431 -4844 -9008 -14632 -13258 -25530 -17595 -2718 -761 -3174 -4109 -1811 426 -10051
14856 -10051 -1372 9223 16362 11308 -526 -5078 -4472 -5895 -6820 -7468 116 -2379 10 1033 1605
14841 1605 -5557 -7949 -9126 -6406 1727 10002 6938 16247 22092 12145 -2207 -3997 -16253 -22713
14827 -22713 -13760 -5667 3236 1725 9643 21142 982 -234 -5991 -20730 -8794 3061 -12740
14814a2740j1870J2171Q968J880n493k846J1835K439L155l232l052J173n383m47
14800c442Q861p905j1682R281R898p342l887J1256r751M769J6955J951q940p304
14786B718j1314q242J2160l756P852K187n243O243N501K878j1816j3705j1362
14773b5899m008Q789M539K921J3667L361j9569K501J425P061J5987O71n427J0468
14759A6487M619j0371j3435n421J1047l543L110K326R170J4296L68o575o976q394
14745F708N65J0490J2496j6862j6620k034K313J819O65j386o489n672m125O254
14731a1878m510J257l40N032J5285J0373j771o270n533O4m398j2866L067Q209
14717d279p933P876J1024j097k569q45l831m247q248k537L772J6649K87j1918
$$ plain form
14814 -12740 -24610 -12439 -3471 -1591 -7084 -9930 1905 4344 7499 4267 1215 2388 -2995 -3442
14800 -3442 5419 -2486 -14168 -4887 5011 -2331 -6218 5038 -4713 56 17011 18962 10022 2718
14786 2718 -8596 -16838 -4678 -8434 -582 1605 -3638 2605 8106 10984 -832 -14537 -25899
14773 -25899 -29907 -21118 -16579 -13658 9 3370 -16199 -13698 -12273 -5212 10775 11446 6019 16487
14759 16487 21106 10735 -2700 -8121 2926 -617 2493 4819 13989 28285 28653 22078 15102 6708
14745 6708 7273 17763 30259 13397 -3223 -5257 -2944 -1125 -460 -1846 -8335 -14007 -18132 -11878
14731 -11878 -16388 -15131 -15471 -10439 4846 15219 13448 7178 1645 1709 -2689 -15555 -12488 -4279
14717 -4279 -12212 -4336 6688 5591 3022 2177 -1654 -5901 -14149 -16686 -12914 3735 4022 -7896
14703g896m993j124J0607J0001r636n225L907M527j172J0842K129m223j3317r770
14689a5343M99M668j2005M817J2880j8109L061J9321J1463j8092n503J5736N873
14676I266r663p387l948O327K1259J477j7069Q72p543J0280K58p405l133o626
14662a3035l339N445J512K940k623q782n981J6425J0423Q328K152k293j4599M773
14648A346p485n880K571j542O80K1o359K364J0141Q578r959p981n250J3579J7601
14633A2425L933j2659k734M191L745r967j5686J604J1278M43m915J527o260j2637
14619b5712R125J3341J509o683n668J0170J8944K461l539L452O927j7774l221
14606C332J3340R379J17l577j2895j284O800r409j7190Q68M579n795l274J8277
$$ plain form
14703 -7896 -12889 -14013 -3406 6595 -3041 -8266 -4359 168 -1004 9838 11967 7744 -5573 -15343
14689 -15343 -14844 -10176 -22181 -17364 -4484 -22593 -19532 -211 11252 -6840 -12343 3393 9266
14676 9266 -397 -7784 -11732 -5405 15854 17331 262 1134 -6409 3871 4129 -3276 -6409 -13035
14662 -13035 -16374 -10929 -9417 -6477 -9100 -17882 -23863 -7438 2985 11313 13465 11172 -3427 1346
14648 1346 -6139 -12019 -9448 -10990 -10310 -10289 -16648 -14284 -4143 4435 -5524 -13505 -18755 -5176 12425
14633 12425 16358 3699 965 5156 8901 -1066 -16752 -15148 -3870 -3427 -8342 -6815 -13075 -25712
14619 -25712 -16587 -3246 -1737 -8420 -14088 -3918 15026 17487 13948 17400 24327 6553 3332
14606 3332 16672 26051 26168 22591 9696 8412 15212 5803 -11387 -10519 -5940 -11735 -15009 3268
14592C268M571J591M980J154j745O466n01j197n592j6418j4563J219J1366J2591
14578G190o862o549L653N183J0111l223K25j46K632n690q32o518M278J425J0126
14563A5003L352j0445o409p347j607K395K5484J7706k1668p795l805J769N411
14550A2044J1812q836k2565p979J7907R815o335J042R31p579p95J3826M713j2754
14536E247q558P456P13l682P119k015l063l158m674J669Q722K163M231l526p31
14521G913j534j2795j0754P428J1517N942q361r007K0330L395j5398l945P252
14508A983M268r72o737K462J783p206j37j416j728J713q406M816P238l701O340
14493C00N907j2518r220J3441J1765J274j732k345N022k324q787L920k30j4346
$$ plain form
14592 3268 7839 9430 14410 15564 13819 20285 19784 18587 12995 -3423 -17986 -16767 -5401 7190
14578 7190 328 -6221 -2568 2615 12726 9503 9728 9582 12214 6524 5692 -826 3452 4877 15003
14563 15003 18355 7910 1501 -5846 -7453 -5058 20426 38132 16464 8669 4864 6633 12044
14550 12044 23856 15020 -7545 -15524 2383 12198 5863 6905 7836 257 -538 13288 18001 5247
14536 5247 -3311 4145 4858 1176 8295 6280 3217 59 -4615 -2946 5776 7939 12170 8644 7913
14521 7913 6379 -6416 -17170 -9742 1775 7717 -644 -9651 10679 14074 -1324 -5269 1983
14508 1983 6251 5279 -1458 1004 2787 -4419 -4556 -5972 -7700 -5987 -14393 -9577 -2339 -6040 300
14493 300 6207 -6311 -15531 -2090 9675 10949 9217 6872 11894 9570 783 4703 4473 -9873
14479i873r630J8250J4463J893K459j1648J30J328m276p393J873J412m040K872
14465b180L220J356K135Q482J1642j526n206j4301n017N194L314o430J0100K67
14451A1050q464r164k026j562M295k452O682J6930J4408j0363o644r269M10J1567
14437A5398K177k107Q769n326j8399o4m395o12n787l516L082N168K374L446K464
14422B672j5074k778Q012K0475N012m113q025j6310j0367k88J5149P524k883j5482
14408a6476o010J0302N985L165K456J2179O379M822J0248q68J005n782o389L701
14394B4717L754q149j5721J2268P158k479L141n399o183J8912J4442k849p765
14381C5847p498j6858L967n978j0045N452N551L043O524R659J5705r867L209L401
$$ plain form
14479 -9873 -19503 -1253 13210 15103 17562 5914 6044 7372 3096 -4297 -2424 -1012 -5052 -2180
14465 -2180 1040 2396 4531 13013 24655 23129 17923 3622 -1395 3799 7113 683 10783 11050
14451 11050 2586 -6578 -8604 -10166 -5871 -8323 -1641 15289 29697 19334 12690 3421 3831 15398
14437 15398 17575 15468 24237 18911 512 448 -3947 -4559 -10346 -13862 -10780 -5612 -3238 208 2672
14422 2672 -12402 -15180 -7168 13307 18319 14206 6181 -10129 -20496 -20784 -5635 1889 -994 -16476
14408 -16476 -22486 -12184 -6199 -3034 -578 11601 17980 22802 33050 32182 33187 27405 21016 24717
14394 24717 28471 20322 4601 16869 24027 21548 24689 19290 13107 32019 46461 43612 35847
14381 35847 28349 11491 15458 9480 -565 4887 10438 13481 20005 29664 45369 35502 38711 42112
14367D2112p171j2883j4452j3092p925R385J8728J5096R982L898L698j715j1327
14354C4334k1456k0652k523K520n682r556N387m79j2533P731J0733L71K45J2730
14340A170j638m371l785l480J2878N410j3634j2955Q705N159r24r234j1879J5098
14326a3480k510k584P582R876m123m847o28O304j927N746j5865N197J1932J0777
14312A1450J2330P048l458j8511j0747J6528L833m1M316M187J462r462l767J2246
14298B7414J0719P880L177o148r237r779Q644m210J6663J2478R529M619O996J7314
14284I6059J8985J5346M6976Q5285J05133Q1730O519k3283n5549j03903p5809
14273A97489m8876p022M229K4757N0913Q5844J09878M8633k0454p1340j04345
$$ plain form
14367 42112 34941 22058 7606 -5486 -13411 -4026 14702 29798 39780 43678 47376 45661 34334
14354 34334 12878 -7774 -10297 -7777 -13459 -23015 -17628 -18107 -30640 -22909 -12176 -11805 -11560 1170
14340 1170 -468 -4839 -8624 -12104 774 6184 -7450 -20405 -11700 -6541 -7465 -16699 -28578 -13480
14326 -13480 -15990 -18574 -10992 -1116 -5239 -10086 -10714 -4410 -6337 -591 -16456 -11259 673 11450
14312 11450 23780 30828 27370 8859 -1888 14640 18473 18432 22748 26935 28397 18935 15168 27414
14298 27414 38133 46013 49190 43042 33805 24026 32670 28460 45123 57601 67130 71749 78745 96059
14284 96059 115044 130390 177366 262651 367784 449514 456033 432750 377201 273298 197489
14273 197489 148613 141591 145820 170577 221490 307334 417212 465845 445391 374051 269706
14262B69706r9328n2871l0783j8634k1721r853j1625q175k505p914P382r959o408
14249b688J1331M989k563R255M965j7733r864r879j312J3950q336l564R547M546
14235B644j1203j0848L539Q267J557M796J2891J701r335n343k68r924N69O614
14221d343L893j712j924l463m974N077k756L931N812p64m174J427J6276K772k166
14206A2912J4568L468n693o833j1075L085J3170J1293j2083j5919k727J7321j927
14193A9560k680l052M755Q197p378j1258n521o333K163j0869N171L648j179o705
14179a1481j5736l322R311M354p11J345R167J3522L041J622k811j180j1048j1147
14165a5074k144K743n700M552P497J1024K567r331Q11j2803L625J3415m832N303
$$ plain form
14262 269706 170378 117507 86724 68090 46369 36516 24891 16716 14211 6297 13679 3720 -2688
14249 -2688 8643 13632 11069 20324 25289 7556 -2308 -12187 -13499 451 -7885 -11449 -1902 2644
14235 2644 -8559 -19407 -15868 -7601 -6044 -1248 11643 13344 4009 -1334 -1602 -11526 -10957 -4343
14221 -4343 -450 -2162 -4086 -7549 -12523 -7446 -10202 -6271 -459 -1223 -5397 -3970 12306 15078 12912
14206 12912 27480 30948 25255 18422 7347 10432 23602 34895 22812 6893 4166 21487 19560
14193 19560 16880 13828 18583 26780 19402 8144 2623 -3710 -1547 -12416 -7245 -3597 -4776 -11481
14179 -11481 -27217 -30539 -21228 -16874 -17585 -16240 -7073 6449 9490 11112 8301 7121 -3927 -15074
14165 -15074 -17218 -14475 -20175 -15623 -8126 2898 5465 -3866 -3055 -15858 -12233 1182 -3650 1653
14151A653J1889K1786N85m139p690j1948k310q22j3904o606q032j1742L158k15
14137b8337P76R746J4212L010L260k91q554j6080k697r476K989K0213P20p20N028
14122f201P066Q53Q69n152j780P516K182p630q836M39M630J7405J5179N026j3663
14107A7903j8701k998R237j1313p044J437O766J4652N31K653k302j2632n337L044
14093d104L99J3780J1999j8754j7435k07l820R479Q76j1340J6786Q662p778J4326
14079A2869N285r181j4063N45q611R995K449q529J2131l895n322K405K10l818
14065g530n652J4342l293m674O992Q02k369o496O563q749L823J4356O738o325
14051H528j472j729p778J144O133N827R609p746j3964N3J3517q261j7656j0347
$$ plain form
14151 1653 13542 35328 35913 31774 24084 12136 9826 9004 -4900 -11506 -19538 -31280 -28122 -28337
14137 -28337 -27561 -17815 -3603 -593 2667 2376 -6178 -22258 -24955 -34431 -31442 -11229 -10509 -11229 -6201
14122 -6201 865 1718 2587 -2565 -4345 3171 5353 -2277 -11113 -10674 -6044 11361 26540 31566 17903
14107 17903 -798 -3796 5441 -5872 -12916 -11479 -4713 9939 10470 13123 10821 -1811 -7148 -4104
14093 -4104 -3705 10075 22074 3320 -14115 -14322 -18142 -8663 -7787 -19127 -2341 6321 -1457 12869
14079 12869 18154 8973 -5090 -4545 -13156 -3161 -712 -9241 2890 -1005 -6327 -3922 -3712 -7530
14065 -7530 -13182 1160 -2133 -6807 185 987 -1382 -7878 -1315 -10064 -6241 8115 14853 8528
14051 8528 7056 5327 -2451 -1307 4826 10653 20262 12516 -1448 -1395 12122 3861 -13795 -24142
14037b4142J3513R485J1863M542O659l396l285M398M560k521j033j2300j7855
14024i512j2968L635J7176o254L833J7697Q223k700j1072q591n572K186l91K540
14010a770L07N939m536J111P538r07l656N966J682j01j8540k0649K08P773J3847
13995e788M266j2996j1158K1712O507q628J227m164j795R9J539j853n392j476
13981a7900q49J2873J1285O17j55J315N367l46n054K425o784m085r293K928n555
13966a3211p608N269l425J2638J1211q788l852K080j324q206K023p98k300J760
13952a4531R455M145M576O131n187n169O02m03N196L643l053J595J0k32o383j947
13936a552j4126n234P538q785j761n341L547Q367j711J8175J7057J2926q276m287
$$ plain form
14037 -24142 -10629 -1144 10719 15261 21920 18524 15239 19637 24197 21676 20643 8343 -9512
14024 -9512 -22480 -18845 -1669 -7923 -4090 13607 21830 19130 8058 -533 -6105 -3919 -4310 -1770
14010 -1770 -1463 4476 -60 1051 8589 7682 4026 9992 11674 11573 -6967 -27616 -27408 -19635 -5788
13995 -5788 -1522 -14518 -25676 -3964 2543 -6085 -4858 -9022 -10817 -10718 -9179 -11032 -16424 -17900
13981 -17900 -18749 -5876 5409 6026 5871 7186 12553 12207 7153 9578 2794 -1291 -10584 -7656 -13211
13966 -13211 -20819 -15550 -18975 -6337 4874 -3914 -7766 -5686 -7010 -15216 -13193 -13991 -16291 -14531
13952 -14531 -5076 -931 3645 9776 4589 -580 22 -381 4815 8458 5405 7000 7010 6778 395 -1552
13936 -1552 -15678 -20912 -13374 -22159 -23920 -29261 -25714 -17347 -19058 -883 16174 29100 20824 16537
13922A6537o590K127j511l396J450r518j5014j653J0260K354L706k973p998M443
13908g776j0254j5150o820J3615J0063O361N192m6R348n251L912j438P037M922
13894A3715k188M127o613k467m194l084J031O235p189q151n204m2N718q971j435
13879a8712K335J451O142M839M133j0152R076M436r173L699L129r159K097J3617
13865G758R976M128j862j9531j6300n514O882M611O206p97N770n105P723L813
13851G758l084m789q505p892J158J0106N935j4773J007J3608K431N944l365j0243
13837d704p299P209P635R595k311l410l925j1954k765N721R427q665J88Q101k844
13822ap738N649O890K317q639l479R878J1179M44m281m884K347j437j5153j1802
$$ plain form
13922 16537 9947 12074 10563 7167 8617 -901 -15915 -17568 -7308 -4954 -1248 -4221 -12219 -7776
13908 -7776 -18030 -33180 -40000 -26385 -16322 -9961 -4769 -4815 4533 -718 3194 1756 8793 13715
13894 13715 11527 15654 9041 6574 2380 -704 327 6562 -627 -8778 -13982 -14024 -8306 -17277 -18712
13879 -18712 -16377 -14926 -8784 -3945 188 -9964 -888 3548 -5625 -1926 1203 -7956 -5859 7758
13865 7758 17734 21862 20000 469 -15831 -21345 -14463 -9852 -3646 -4443 1327 -3778 3945 7758
13851 7758 4674 -115 -8620 -16512 -15354 -5248 687 -14086 -13079 529 2960 8904 5539 -4704
13837 -4704 -12003 -4794 2841 12436 10125 6715 2790 -9164 -11929 -6208 3219 -5446 -5258 2843 -1
13822 -1 -7739 -2090 4800 7117 -1522 -5001 4877 16056 16500 12219 7335 9682 8245 -6908 -18710
13807a8710J806R594N207l934j0464q221N152J2713R471J594l07M447q379j3950
13793a3981K197Q309K552n987l772j2598J865M127j3028P124p63o581K381O583
13779b1572N368K0429Q077j403o759q453N90N264o190J0561R248j883n341N498
13765A3434M592k368j0112n041n286p446P408O939J907R677j635n553N654j5662
13751c492j2490J3792O906L195k337j4480q274N998N463P948m279l11Q90j011
13737b482J164L247r831o406K626l370L694L108j4396J2003J7185r566j2032j1012
13723b6068n720J9562M172p592l87l449N012L960P109k242J498O820J0849J374
13709A4898q395r428J660q496n402O951L073J0518P051q508R40N040l953O8Q99
$$ plain form
13807 -18710 -16904 -7310 -2103 -6037 -16501 -24722 -19570 -6857 2614 4208 3901 8348 -31 -13981
13793 -13981 -11784 -3475 -923 -6910 -10682 -23280 -21415 -17288 -30316 -23192 -23955 -30536 -28155 -21572
13779 -21572 -16204 4225 12302 10899 4140 -4313 -3723 1541 -4649 5912 15160 13277 7936 13434
13765 13434 18026 15658 5546 505 -4781 -12227 -4819 2120 4027 13704 12069 6516 12170 -3492
13751 -3492 -15982 -2190 4716 7911 5574 -8906 -17180 -11182 -5719 2229 -2050 -2361 -1471 -2482
13737 -2482 -1318 1929 -7902 -14308 -11682 -15052 -11358 -8250 -22646 -10643 6542 -3024 -15056 -26068
13723 -26068 -31788 -12226 -8054 -15646 -16033 -19482 -14470 -10510 -3401 -5643 -4145 2675 13524 14898
13709 14898 6503 -2925 -1265 -9761 -15163 -8212 -5139 5379 12430 3922 4862 9902 5949 6017 6916
13694F916K166m74L236j0901M221M490r591j1778M089J0258J355J592j599L173
13680G153m015O894j782n223J0409O868q315n547Q360k3105j9584J6942J7337
13667F392M369L328J755k039j302p570j0213n521j61k830n573M722J3730O545
13653E632o970n409K524J3666J3709l78p646n50N20m487j3693R11J6L314Q745
13638I904J417O241J4957p053k706L687j6909j2480L821Q378q196k4201L37J3046
13624i757j108k104K121q814N535j468K864k148N786K333K1312J0119l7K417R680
13609C6731J2020j3530j2921J97m953k30N225n358j601k804q823m431O062j6120
13595a0536J2571n227p360M083Q742J5199j0906J7557L586k923p339m240m814
$$ plain form
13694 6916 9082 8608 11844 943 5164 9654 63 -11715 -7626 2632 3987 5579 3980 7153
13680 7153 3138 10032 8250 3027 13436 20304 11989 6442 14802 -8303 -27887 -10945 6392
13667 6392 10761 14089 15844 13805 12503 4933 -5280 -10801 -10962 -13792 -19365 -14643 -913 5632
13653 5632 -1338 -6747 -4223 9443 23152 22774 15128 14578 15098 10611 -3082 -2171 -2155 1159 9904
13638 9904 11321 17562 32519 25466 22760 26447 9538 -2942 879 9257 1061 -23140 -22803 -9757
13624 -9757 -10865 -12969 -10848 -19662 -14127 -15595 -12731 -14879 -9093 -6760 14552 24671 24634 27051 36731
13609 36731 48751 35221 22300 22497 17544 17314 22539 17181 15580 12776 3953 -478 5584 -10536
13595 -10536 2035 -3192 -10552 -6469 2273 17472 6566 24123 27709 24786 17447 13207 8393
13582H393J943q698R117J842q890L116m878j5845K784P080O924M415L076O105
13568A6484J1343R110J1760J7763L9382K6109J5191K079k6310l4824k4029m602
13556E9456k1190k150j6367k3887p21P410m641m534P709m514j64Q821j6173j5339
13542b6284P194p60l319N271K6774P131o189m624k176m783o178p262L4J5016N738
13527E583L331J6825j94P373L511j65K4168K2373J5702L3272J2714m419j8964
13514A21110l3641k5303j3828j9536r654p109J601N936J133j0789N71L514L964
13501A7969o225O848r184j2952j0165n699Q120n151J342P150Q37M301O930J753
13487E874L525l763q53p571n610J245R161q289p967K334o28J3695L0025J0485
$$ plain form
13582 8393 10336 1638 10755 12597 3707 6823 1945 -13900 -11116 -4036 2888 7303 10379 16484
13568 16484 27827 36937 48697 66460 105842 131951 147142 149221 122911 88087 64058 59456
13556 59456 38266 36116 19749 -4138 -4859 2551 -2090 -6624 1085 -3429 -3593 5228 -10945 -26284
13542 -26284 -19090 -19850 -23169 -17898 8876 16007 9818 5194 3018 -1765 -7943 -15205 -15171 -155 5583
13527 5583 8914 25739 25545 32918 36429 36264 60432 82805 98507 131779 144493 140074 121110
13514 121110 87469 62166 48338 28802 19148 12039 13640 19576 20709 9920 10491 14005 17969
13501 17969 11744 18592 9408 -3544 -13709 -19408 -11288 -16439 -15097 -7947 -7110 -2809 4121 5874
13487 5874 9399 5636 4783 -2788 -8398 -7153 2008 -6281 -14248 -11914 -12542 1153 31178 41663
13473D1663M523r741j4967O142m938j511l184j6421j8738j0922P472R409J2329
13460A116M555P677K498j80j5722m488P206O040J4404j356l106J550J54q405N961
13445A7904j770K094p658n788j2756n91N217J422o89k441j5570q631j167J2712
13431a7712N689J7039J9046j3647O426j2803k0197M407J0125J1082n573o265K539
13418A56J317p581M417r900Q99j747P556L492j2783K369P682j0401p227J0998
13404a0753J3309l968k952m382O949N717P176J2975k706j2889m453m168o67m269
13390e081m059Q08j1007j8395Q421Q373N684M305R020O785j260j3321l043M013
13376h757N411l175q894R020O910m515J1613N912r579J752l678J4834m525m442
$$ plain form
13473 41663 46186 36445 21478 27620 22682 21171 17987 1566 -17172 -28094 -20622 -11213 1116
13460 1116 5671 13348 15846 15666 -56 -4544 2662 8702 23106 21750 18644 20194 20348 11943 17904
13445 17904 16134 18228 10570 4782 -7974 -8565 -3348 -1926 -2615 -5056 -20626 -29257 -30424 -17712
13431 -17712 -12023 5016 24062 10415 16841 4038 -16159 -11752 -1627 9455 3882 -2383 156
13418 156 1473 -6108 -1691 -11591 -10692 -12439 -4883 -1391 -14174 -11805 -4123 -14524 -21751 -10753
13404 -10753 2556 -1412 -4364 -8746 -1797 3920 11096 24071 21365 8476 4023 -145 -812 -5081
13390 -5081 -9140 -8332 -19339 -37734 -29313 -20940 -15256 -10951 -1931 4854 3594 -9727 -12770 -8757
13376 -8757 -3346 -6521 -15415 -6395 515 -4000 7613 13525 3946 5698 2020 16854 12329 7887
13362G887j1228R354K071j2861k672N33J040K982M163K120Q21Q277m872n488O635
13347H762O294o230l585n270J28Q449K407j7567r99J954j923M472o251j0535M875
13332a5019L130L710J661R852J4126N817K284o755o792j834o398o238m856j3961
13318b1273l409J3664K5821p091j4226N028o263q358j662O838M511m714R264p517
13304i387m610M554K77l375R774J4524M908o568q39J726p493K120j2293l265m142
13289a4089j3338P783K1939J5141l676l268j84O960p45j713M787M529q354j337
13275A4435K141l514m641r603M631Q108J0340O343M786l58r193j1466n776r186
13261b953r947M841J5537Q400L007J685j2912l752J390j780k950n52n573K608
$$ plain form
13362 7887 -3341 6013 8084 -4777 -7449 -6916 -5876 -2894 1269 3389 4210 12487 7615 2127 8762
13347 8762 15056 8826 5241 -29 99 8548 10955 -6612 -7611 -5657 -7580 -3108 -9359 -19894 -15019
13332 -15019 -11889 -8179 -6518 3334 17460 23277 25561 18806 12014 10180 3782 -2456 -7312 -21273
13318 -21273 -24682 -11018 14803 7712 -6514 -1486 -7749 -16107 -17769 -10931 -6420 -11134 -1870 -9387
13304 -9387 -13997 -9443 -9166 -12541 -2767 11757 16665 10097 9258 10984 3491 5611 -6682 -9947 -14089
13289 -14089 -27427 -19644 2295 17436 13760 10492 10308 17268 16523 14810 19597 24126 15772 14435
13275 14435 16576 13062 8421 -1182 3449 11557 21897 28240 33026 32668 23475 12009 6233 -2953
13261 -2953 -12900 -8059 7478 15878 18885 20570 7658 3906 5296 3516 566 14 -5559 -2951
13247b951K296P726M297L740j292L339l128j5222o256P158O467j0427l025J7144
13233I866J775J705j5086j4073k237K872J2215J5391K950L336o15K757j62L015
13219B3709J3867J7097M055K7783K3800K790j7052l0611k5804p553n98p350l272
13206B0861L058k999m673j3639k224m46J0361J5990J179q813j1592j336Q331J942
13192A6000J991n389l945P735r79j335P516n314N4R917K375r606J343O070J3226
13177C9659J3066p28R561K5556L5141N3366M1203J7775n027k8882l4660l2934
13165A33096m2311k8974j3884N74L861q089j3992j3012k287R751J2919j1314j8206
13152H132l101p005j1948K493J1421J2245m188l233R816R162J0025l330M071Q394
$$ plain form
13247 -2951 -655 7071 11368 15108 13816 17155 14027 -1195 -7451 -293 6174 -4253 -7278 9866
13233 9866 11641 13346 -1740 -15813 -18050 -15178 -2963 12428 15378 18714 18099 20856 20694 23709
13219 23709 37576 54673 58728 86511 110311 113101 96049 65438 39634 32081 31483 24133 20861
13206 20861 23919 20920 16247 2608 384 -62 10299 26289 27468 18655 7063 5727 14058 16000
13192 16000 17991 12602 8657 16392 15413 14078 21594 16280 16334 26251 28626 19020 20363 26433 39659
13177 39659 52725 51997 61558 87114 122255 175621 216824 234599 229572 200690 166030 133096
13165 133096 90785 61811 47927 48501 52362 44273 30281 17269 14982 24733 37652 26338 8132
13152 8132 5031 -1974 -13922 -11429 -8 12237 8049 4816 14632 23794 33819 30489 34560 42954
13138D2954r432N530o655l629N543K850q168J848K5308J5775K8719M4728N8542
13125B03913K9975O591j7278m8164m9483m2495k3465n771j1893m949j4684L921
13113B6218M480M126j2440j6494r438M141O005k854j0392n535L739m428K158J761
13099h953n925Q156J4058J6796j0737j0642j387Q108L423p664J058J2912L849
13086B3052j2554k263J0842K2005J9484J5707N688M078n269j2530j5282k5257
13074B7701k6248m250m835K468R825L882R827n795P58j209R22j1075L52l352j434
13059b463Q306p056J3535J2506Q99j176L965l694k2727j0050O769J5622Q579j0165
13045A2850o787o430m356Q08n394M445J0651K651k2836K85L788n560J3349J126
$$ plain form
13138 42954 33522 39052 32397 28768 34311 37161 28993 30841 56149 71924 100643 145371 203913
13125 203913 233888 240479 223201 175037 125554 83059 59594 53823 41930 36981 22297 26218
13113 26218 30698 34824 22384 5890 -3548 593 6598 3744 -6648 -12183 -8444 -12872 -10714 -8953
13099 -8953 -14878 -6722 7336 24132 13395 2753 1366 9474 12897 5233 6291 19203 23052
13086 23052 10498 8235 19077 41082 60566 76273 81961 86039 80770 68240 52958 27701
13074 27701 1453 -2797 -7632 -5164 4661 8543 18370 12575 13333 12124 13046 1971 2323 -1029 -2463
13059 -2463 5843 -1213 12322 24828 25727 24551 28516 24822 2095 -7955 -1186 14436 23015 12850
13045 12850 6063 -367 -4723 -3915 -9309 -4864 5787 8438 -14398 -14113 -10325 -15885 -2536 -1410
13031a410n465N091M52O343q392n165M227L391j170O954L978k126P10q813J2721
13016A1326j347p448M33q86K492N403q272j712p737j075j0308L307P680M52J1834
13001D142O670R380O866k623j9635m486p769l37N272j7624M816K2896K634K578
12987A2780P718J783M20r530j1431J410l956J2739o19k419o04K469J41n723L140
12972H318p006j1028m103j4692Q894O374O848n190k594J0434J7476J2439J1813
12959C7983m592j1092N31k332j3936o977N899r078J961j0748L159M555L070J5901
12945A4304k762j3237j8313n322J2021M732J474R019J6582n532k2231j4320J2743
12932a0842J6839Q95m484m354N590J133J7p580p059j0809j211P483K67Q015J8458
$$ plain form
13031 -1410 -6875 -1784 -1332 5011 -3381 -8546 -4319 -928 -2098 4856 8834 6708 7418 -1395 11326
13016 11326 9979 2531 2964 2078 4570 9973 1701 -11 -7748 -8823 -19131 -15824 -8144 -7692 4142
13001 4142 10812 20192 27058 24435 4800 314 -7455 -7792 -2520 -20144 -15328 7568 10202 12780
12987 12780 20498 22281 22701 13171 1740 3150 -806 11933 11314 8895 8291 10760 10901 5178 8318
12972 8318 1312 -9716 -13819 -28511 -19617 -13243 -6395 -11585 -14179 -3745 13731 26170 37983
12959 37983 33391 22299 22830 20498 6562 -415 5484 -3594 -1633 -12381 -9222 -4667 -1597 14304
12945 14304 11542 -1695 -20008 -25330 -13309 -8577 -7103 1916 18498 12966 -9265 -23585 -10842
12932 -10842 5997 6892 2408 -1946 3644 4777 4794 -2786 -9845 -20654 -21865 -14382 -14115 -6100 12358
12917A2358P837o694j0636q33L981M228J1099J550k392n870q882q613j5346q39
12903a9052M80j737O630J9652J4012j503J671j6443M66L83l985l700q97N452O213
12888G642q873r204O929J4389n038n074K239L630l948j4286L485n886m561O729
12874a1827J2751p53l281k715q52L576m461m848q710N036J3076J9771J5031J288
12860C3082j6455j2708q877N025K702N152P840J442q648o155m976k139J99l816
12846h332j1266m46J7562K4933K055j0420q832j1314q28k568o289k0457J0733
12833b5469J9310j633j867O435l366p26K321J0583j209K105m275O32J7408J250
12819B1499j8498M988L206O434k459k586L077k250l198j1066j821K696q129M151
$$ plain form
12917 12358 20195 13501 2865 2032 6013 10241 21340 22890 20498 14628 5746 -2867 -18213 -19052
12903 -19052 -18572 -20309 -13679 5973 19985 18482 20153 3710 4176 4559 574 -3126 -4023 1429 7642
12888 7642 -1231 -10435 -3506 10883 5845 771 3010 6640 2692 -11594 -8109 -13995 -18556 -11827
12874 -11827 924 171 -3110 -5825 -6677 -3101 -7562 -12410 -21120 -16084 -3008 16763 31794 33082
12860 33082 16627 3919 -4958 67 2769 7921 15761 17203 8555 2400 -2576 -4715 -4516 -8332
12846 -8332 -19598 -20044 -2482 22451 24506 14086 5254 -6060 -6888 -9456 -15745 -36202 -25469
12833 -25469 -6159 -7792 -9659 -3224 -6590 -7316 -4995 5588 4379 6484 2209 2841 20249 21499
12819 21499 3001 7989 11195 17629 15170 12584 15661 13411 10213 -853 -2674 22 -8107 -3956
12805c956N61J608J8424J3288j007j3349j9917M615J4969O770k908l766k315j121
12791A1896L699j084p262N4K376j4146m91P625P896J435r334l742L429P56M083
12776G190j1173r102o668n565N570J718J9307L493J107j893j2348R65N465k412
12762d346R563M021l759l538j6861m332M210L881R634n862n440r182K504O753
12748a2754N304O69L56j3425M658J2172J5748R665n69q115j6518J2170K504r840
12734B025k972J4435R575j2403k0706p21R566Q704l443m497j1225m872J0358K143
12720d033j660p408k46P562L985Q446k537J0193n739q807r399m188J394m128K174
12705a4391K677O480n510n042J2189J1710n141J368M212k47p098M999l5Q029M904
$$ plain form
12805 -3956 -3395 -1787 16637 29925 28918 15569 -4348 267 15236 22006 19098 15332 13017 11896
12791 11896 15595 14511 7249 7303 9679 -4467 -4958 2667 10563 11998 2664 -1078 2351 3107 7190
12776 7190 -3983 -13085 -19753 -25318 -19748 -18030 1277 4770 5877 3984 -8364 -7399 -1934 -4346
12762 -4346 5217 9238 5479 1941 -14920 -19252 -15042 -11161 -1527 -7389 -12829 -22011 -19507 -12754
12748 -12754 -7450 -6781 -6425 -19850 -15192 -3020 12728 22393 21824 13709 -2809 9361 11865 2025
12734 2025 -947 13488 23063 10660 -10046 -10767 -1201 7503 4060 -437 -11662 -16534 -6176 -4033
12720 -4033 -5693 -13101 -13347 -5785 -1800 6646 4109 14302 8563 -244 -9643 -13831 -12437 -16565 -14391
12705 -14391 -11714 -5234 -10744 -15786 -3597 8113 2972 4340 8552 8305 1207 6206 6171 14200 19104
12690A9104m540j5898j5502n902Q04r009J1724J6648O069L304q251r541n235j097
12676a7322N648l710J3746R066n816L92L505O988j840n669o594M300k584j6767
12662a6657N57K0039J1732r19l896K775J185o876K904k602q73j550L004J800J3302
12647B3925o707k665j0272j3050R172R851l45j1524N158p076q774p875j33L034
12633a7281N235J904q236N45j2058J877J3401j457J582Q297r351j1348j809K1009
12619g690J7768l009j3025K8J1690O865K112n693j6648k772n160j729o931P064
12605a7130M227J8817m045j3040J918j8085J410K0461J5421O751N958L161J1936
12592C7760j2043k912n180q090N160j5162p710J589k550O381r119J2751J5478
$$ plain form
12690 19104 14564 -1334 -16836 -22738 -21934 -30943 -19219 -2571 3498 6802 -1449 -10990 -16225 -17322
12676 -17322 -11674 -15384 -1638 7428 1612 2004 5509 12497 10657 4988 -1606 2694 110 -16657
12662 -16657 -16100 3939 15671 14752 10856 13631 14816 7940 10844 8242 7369 5819 8823 10623 23925
12647 23925 17218 14553 4281 -8769 403 10254 9909 -1615 3543 -3533 -12307 -20182 -20315 -17281
12633 -17281 -12046 -10142 -18378 -17833 -29891 -28014 -14613 -16070 -14488 -6191 -15542 -26890 -28699 -7690
12619 -7690 10078 7069 -5956 -5928 5762 12627 14739 9046 -7602 -10374 -15534 -17263 -24194 -17130
12605 -17130 -12903 5914 1869 -11171 -9253 -27338 -25928 -5467 9954 16705 22663 25824 37760
12592 37760 25717 22805 17625 9535 14695 -467 -8177 -6588 -9138 -2757 -11876 875 16353
12579A6353K109O115p960o499j1750q699k780O41J2903K825l231k887r420l811
12565a6091K060M989J3606l971j411J7176k206L319m919j2791j372M582P356L92
12551A0719l709j173l460r495N542O009O814P250J727Q97J582l735N161J8913
12537D3042j1604k1458j7867Q306J9390p007j1616l383m833l085K1053J7874j4553
12524A4259k0719L54J2303j880J2839n390j3973k039N661j212o053k69P900N921
12510G702r736k506M816N65P490J1373R57k676j0153N571J6957N638q702k6938
12496C58p98P470J084q13L810P668k125j5352r328O61j6442N942M994k850k509
12481a8230J779P36M553O222J8634K960j2763M904l109p956j0546l817J802M055
$$ plain form
12579 16353 18462 24577 16617 10118 -1632 -10331 -13111 -12470 433 3258 27 -2860 -12280 -16091
12565 -16091 -14031 -9042 4564 593 -818 16358 14152 17471 12552 -239 -1611 2971 10327 10719
12551 10719 7010 5837 2377 -7118 -1576 4433 11247 18497 20224 21121 22703 18968 24129 43042
12537 43042 31438 9980 -7887 419 19809 12802 1186 -2197 -7030 -10115 10938 28812 14259
12524 14259 -6460 -6106 6197 4317 17156 11766 -2207 -4246 1415 203 -5850 -6119 1781 7702
12510 7702 -2034 -4540 276 841 8331 19704 20661 17985 7832 13403 30360 35998 27296 358
12496 358 -440 7030 8114 7301 11111 18779 16654 1302 -8026 -7365 -23807 -17865 -12871 -15721 -18230
12481 -18230 -16451 -15715 -11162 -4940 13694 16654 3891 8795 5686 -2270 -12816 -16633 -14831 -10776
12467a0776j5903P40J0444K031N609O049l707p026O939m193M643J028O226O715
12453H819k811j4882L76J0638J4885L946J115j0627j8877o341n137o37n551p78
12439b5862j231K583J1707L521m956m370k400R204K4228j1407j1089J875p72n808
12425a4777K247K035P916M316J945j894O032M334p775k189J040P9n748K047Q435
12410H043m468o666p870M578Q738R662j197l684L63k072j666q110q050K661M182
12395e556q22j2059L740J3141J3481J0118m768Q16j1779j774q070j1029L231J6402
12381E072o94n246L791K659j774o427N560M627p415N453M909r9p523j0056J317
12366e846Q086m567j0407J3875k741M2j902L847J3843j625q10Q529m795O199r342
$$ plain form
12467 -10776 -26679 -25939 -15495 -13464 -7855 -1806 -5513 -12539 -5600 -9793 -5150 -4122 2104 8819
12453 8819 6008 -8874 -8498 2140 17025 20971 22086 11459 -7418 -13759 -18896 -19533 -25084 -25862
12439 -25862 -27093 -24510 -12803 -9282 -14238 -18608 -21008 -11804 12424 1017 -10072 -8197 -8969 -14777
12425 -14777 -12530 -10495 -2579 1737 3682 1788 7820 12154 4379 2190 3230 3309 -2439 -392 8043
12410 8043 3575 -3091 -10961 -6383 2355 12017 10820 7136 7499 5427 3761 -4349 -12399 -9738 -5556
12395 -5556 -6378 -18437 -14697 -1556 11925 22043 17275 18091 6312 4538 -3532 -14561 -11330 5072
12381 5072 4378 -868 2923 5582 3808 -2619 2941 7568 153 5606 10515 10416 2893 -7163 -5846
12366 -5846 2240 -2327 -12734 1141 -1600 -1558 -3460 387 14230 12605 11795 20324 15529 21728 12386
12351A2386r931p909q294P507O602m009j3200N984O492j90R112Q441j2071r001
12337h081J381L820K105J672K827L97j3272k2917j642K1794N65n121L59l890j159
12322b1162L558J4368p500l559n594J3936J9502p70p551N13n853K133Q165j2617
12308b431n396N509K556j608m321p558L586J110Q871R533L277m442o327j295Q320
12293I384O481m868o173R981O796p272o352M028r965p863j6300r04J4132J8972
12279A0077L138o956j5982p416Q158j024q386L523J1852J5695Q449j2966j9291
12266a1129k022M252J0454N243l463l191R939o513j0516J2978R573L87N442k184
12252A9250j0408p623M098Q544l52p560J55l529k132K494J1666m154o777j914
$$ plain form
12351 12386 2455 -5454 -13748 -6241 361 -3648 -16848 -10864 -4372 -4562 4550 12991 920 -8081
12337 -8081 -6700 -2880 -775 897 3724 4121 -9151 -32068 -33710 -11916 -11351 -16472 -16113 -20003 -21162
12322 -21162 -17604 -3236 -10736 -14295 -19889 -5953 13549 12779 5228 5741 -112 2021 10186 -2431
12308 -2431 -7827 -2318 238 -1370 -5691 -13249 -9663 -8553 318 9851 13128 8686 2359 1064 9384
12293 9384 15865 10997 4824 14805 21601 14329 7977 12005 2040 -5823 -22123 -23027 -8895 10077
12279 10077 13215 6259 -9723 -17139 -8981 -10005 -18391 -14868 -3016 12679 21128 8162 -11129
12266 -11129 -13151 -8899 1555 6798 3335 144 10083 3570 -6946 6032 15605 15992 21434 19250
12252 19250 8842 1219 5317 13861 13509 5949 6104 2575 443 2937 14603 10449 3672 1758
12238A758j4376j0548Q077J5392q407n016o074J1224j7898l6J3008O805O379K061
12224B349R73q658P79r733j5645J990J4702n504k711Q763N80J978m279N178o55
12209i893l332L977P463n593m146J0163J4223j6819j065J1841J704q635J2549
12196A2437J6657j7736o728J5299N40j0001j833L822R632j1111j415L850J0155
$$ plain form
12238 1758 -12618 -23166 -15089 303 -8104 -13120 -19194 -7970 -25868 -25904 -12896 -6091 288 2349
12224 2349 3322 -5336 -4557 -14290 -29935 -27945 -13243 -18747 -21458 -12695 -12115 -10137 -14416 -9238 -9893
12209 -9893 -13225 -9248 -1785 -7378 -11524 -1361 12862 -3957 -5022 6819 8523 -112 12437
12196 12437 29094 11358 4630 19929 20469 10468 8635 12457 22089 10978 9563 13413 23568
$$ [...]
##END NTUPLES=NMR SPECTRUM
##END=
