##TITLE=Analysis number 307288
Compound Code cc 03112
Project Code adrs
Chemist Name molekula
##JCAMPDX= 6.0         $$ Bruker NMR JCAMP-DX V2.0
##DATA TYPE= NMR SPECTRUM
##DATA CLASS= NTUPLES
##ORIGIN= Bruker BioSpin GmbH
##OWNER= NMR
$$ XWIN-NMR		Version 3.5
$$ Wed Apr 27 10:38:36 2005 GMT Daylight Time (UT+1h)  MAYBRIDGE\NMR@NMR_250MHZ
##.OBSERVE FREQUENCY= 250.131544655141
##.OBSERVE NUCLEUS= ^1H
##.ACQUISITION MODE= SIMULTANEOUS (DQD)
##.ACQUISITION SCHEME= undefined
##.AVERAGES= 16
##.DIGITISER RES= 18
##SPECTROMETER/DATA SYSTEM= dpx250
##.PULSE SEQUENCE= zg30
##.SOLVENT NAME= DMSO
##.SHIFT REFERENCE= (INTERNAL, DMSO, 0, 16.522)
##AUDIT TRAIL= $$ (NUMBER, WHEN, WHO, WHERE, WHAT)
$$ ##TITLE= Audit trail, XWIN-NMR		Version 3.5
$$ ##JCAMPDX= 5.01
$$ ##ORIGIN= Bruker BioSpin GmbH
$$ ##OWNER= NMR
$$ C:\u/data/dgb/nmr/ADRS/2300/pdata/1/auditp.txt
$$ ##AUDIT TRAIL=  $$ (NUMBER, WHEN, WHO, WHERE, WHAT)
(   1,<2005-04-27 10:38:05.84 +100>,<MAYBRIDGE\NMR>,<NMR_250MHZ>,
      <created by zg, POWCHK disabled, PULCHK disabled
       configuration hash MD5:
       62 19 C7 07 E1 42 D1 B7 37 6C 3D D0 77 39 F9 E6
       data hash MD5: 64K
       F6 2E 24 B0 09 83 B7 CD 2F 5D 5F 7B 42 C8 FF E2>)
(   2,<2005-04-27 10:38:19.79 +100>,<MAYBRIDGE\NMR>,<NMR_250MHZ>,
      <Start of raw data processing
       ef LB = 0.3 FT_mod = 6 PKNL = 1 SI = 32K 
       data hash MD5: 32K
       D8 C0 11 E0 EB B6 C3 3A 05 CA A4 72 75 C6 29 CF>)
(   3,<2005-04-27 10:38:23.90 +100>,<MAYBRIDGE\NMR>,<NMR_250MHZ>,
      <apk 
       data hash MD5: 32K
       7E 74 22 1C 47 DB 67 57 1C 83 88 A2 6C F6 CF 57>)
(   4,<2005-04-27 10:38:25.23 +100>,<MAYBRIDGE\NMR>,<NMR_250MHZ>,
      <abs ABSG = 5 
       data hash MD5: 32K
       B8 70 9E 1D D6 1D 4F F9 54 AE 5A 86 46 B9 57 D0>)
$$ ##END=
$$ 
$$ hash MD5
$$ A1 4D 0F 13 2E AB 50 FE DE 25 8B C5 82 B7 86 29
##$RELAX= 
##$RELAX= 
##$RELAX= 
##$RELAX= 
##$RELAX= 
##$RELAX= 
##$RELAX= 
$$ Bruker specific parameters
$$ --------------------------
##$DU= <C:\u>
##$EXPNO= 2300
##$NAME= <ADRS>
##$PROCNO= 1
##$TYPE= <nmr>
##$USER= <dgb>
##$AMP= (0..31)
100 100 100 100 100 100 100 100 100 100 100 100 100 100 100 100 100 100 
100 100 100 100 100 100 100 100 100 100 100 100 100 100 
##$AQSEQ= 0
##$AQ_mod= 3
##$AUNM= <au_zg>
##$AUTOPOS= <9 >
##$BF1= 250.13
##$BF2= 250.13
##$BF3= 250.13
##$BF4= 250.13
##$BF5= 500.13
##$BF6= 500.13
##$BF7= 500.13
##$BF8= 500.13
##$BYTORDA= 1
##$CFDGTYP= 0
##$CFRGTYP= 5
##$CHEMSTR= <none>
##$CNST= (0..31)
1 1 145 1 1 1 1 1 1 1 1 1 1 1 1 1 1 1 1 1 1 1 1 1 1 1 1 1 1 1 1 1 
##$CPDPRG= <>
##$CPDPRG1= <>
##$CPDPRG2= <>
##$CPDPRG3= <>
##$CPDPRG4= <mlev>
##$CPDPRG5= <mlev>
##$CPDPRG6= <mlev>
##$CPDPRG7= <mlev>
##$CPDPRG8= <mlev>
##$CPDPRGB= <>
##$CPDPRGT= <>
##$D= (0..31)
0 1 0 0 0 0 0 0 0 0.06 0 0 0 0 0 0 0.0002 0 0 0 0 0 0 0 0 0 0 0 0 0 0 
0 
##$DATE= 1114594684
##$DBL= (0..7)
120 120 120 120 120 120 120 120 
##$DBP= (0..7)
150 150 150 150 150 150 150 150 
##$DBP07= 0
##$DBPNAM0= <>
##$DBPNAM1= <>
##$DBPNAM2= <>
$$ [...]
##$SUBNAM7= <"">
##$SUBNAM8= <"">
##$SUBNAM9= <"">
##$SW= 20.6930455092707
##$SWIBOX= (0..15)
0 0 3 0 0 0 0 0 0 0 0 0 0 0 0 0 
##$SW_h= 5175.983436853
##$TD= 65536
##$TD0= 1
##$TE= 295.16
##$TE2= 300
##$TE3= 300
##$TEG= 300
##$TL= (0..7)
0 120 120 120 120 120 120 120 
##$TP= (0..7)
150 150 150 150 150 150 150 150 
##$TP07= 0
##$TPNAME0= <>
##$TPNAME1= <>
##$TPNAME2= <>
##$TPNAME3= <>
##$TPNAME4= <>
##$TPNAME5= <>
##$TPNAME6= <>
##$TPNAME7= <>
##$TPOAL= (0..7)
0.5 0.5 0.5 0.5 0.5 0.5 0.5 0.5 
##$TPOFFS= (0..7)
0 0 0 0 0 0 0 0 
##$TUNHIN= 0
##$TUNHOUT= 0
##$TUNXOUT= 0
##$USERA1= <user>
##$USERA2= <user>
##$USERA3= <user>
##$USERA4= <user>
##$USERA5= <user>
##$V9= 5
##$VALIST= <valist>
##$VCLIST= <CCCCCCCCCCCCCCC>
##$VD= 0
##$VDLIST= <DDDDDDDDDDDDDDD>
##$VPLIST= <PPPPPPPPPPPPPPP>
##$VTLIST= <TTTTTTTTTTTTTTT>
##$WBST= 1024
##$WBSW= 4
##$XGAIN= (0..3)
0 0 0 0 
##$XL= 0
##$YL= 0
##$YMAX_a= 452438
##$YMIN_a= -443678
##$ZGOPTNS= <>
##$ZL1= 120
##$ZL2= 120
##$ZL3= 120
##$ZL4= 120
##$ABSF1= 16.522
##$ABSF2= -4.171173
##$ABSG= 5
##$ABSL= 3
##$ALPHA= 0
##$AQORDER= 0
##$ASSFAC= 0
##$ASSFACI= 0
##$ASSFACX= 0
##$ASSWID= 0
##$AUNMP= <proc_1d>
##$AZFE= 0.1
##$AZFW= 0.1
##$BCFW= 0
##$BC_mod= 0
##$BYTORDP= 0
##$COROFFS= 0
##$CY= 12.5
##$DATMOD= 1
##$DC= 0
##$DFILT= <>
##$DTYPP= 0
##$F1P= 14.0000005364418
##$F2P= -0.99999901652339
##$FCOR= 0.5
##$FTSIZE= 32768
##$FT_mod= 6
##$GAMMA= 0
##$GB= 0
##$INTBC= 1
##$INTSCL= 1
##$ISEN= 128
##$LB= 0.3
##$LEV0= 0
##$LPBIN= 0
##$MAXI= 10000
##$MC2= 0
##$MEAN= 0
##$ME_mod= 0
##$MI= 0
##$NCOEF= 0
##$NC_proc= -2
##$NLEV= 6
##$NOISF1= 0
##$NOISF2= 0
##$NSP= 0
##$NTH_PI= 0
##$NZP= 0
##$OFFSET= 16.522
##$PC= 1
##$PHC0= -84.68457
##$PHC1= 6.696172
##$PH_mod= 1
##$PKNL= yes
##$PPARMOD= 0
##$PSCAL= 4
##$PSIGN= 0
##$REVERSE= no
##$SF= 250.13
##$SI= 32768
##$SIGF1= 0
##$SIGF2= 0
##$SINO= 400
##$SIOLD= 32768
##$SREGLST= <1H.DMSO>
##$SSB= 0
##$STSI= 32768
##$STSR= 0
##$SW_p= 5175.98343685301
##$SYMM= 0
##$S_DEV= 0
##$TDeff= 65536
##$TDoff= 0
##$TI= <Analysis number 999999
Compound Code 99
Book Reference 9
Project Code 9>
##$TILT= no
##$TM1= 0
##$TM2= 0
##$TOPLEV= 0
##$USERP1= <user>
##$USERP2= <user>
##$USERP3= <user>
##$USERP4= <user>
##$USERP5= <user>
##$WDW= 1
##$XDIM= 32768
##$YMAX_p= 369817053
##$YMIN_p= -96855
$$ End of Bruker specific parameters
$$ ---------------------------------
##NTUPLES= NMR SPECTRUM
##VAR_NAME=  FREQUENCY,     SPECTRUM/REAL,   SPECTRUM/IMAG
##SYMBOL=    X,             R,               I
##VAR_TYPE=  INDEPENDENT,   DEPENDENT,       DEPENDENT
##VAR_FORM=  AFFN,          ASDF,            ASDF
##VAR_DIM=   32768,         32768,           32768
##UNITS=     HZ,            ARBITRARY UNITS, ARBITRARY UNITS
##FACTOR=    0.157963299565203, 1,           1
##FIRST=     4132.6476996994, 0,             0
##LAST=      -1043.33573715361, 0,           0
##MIN=       -1043.33573715361, -96855,      0
##MAX=       4132.6476996994, 369817053,     0
$$ Real data points
##PAGE= N=1
##DATA TABLE= (X++(R..R)), XYDATA
$$ [...]
18657E430476m23205l05476k65853k79188k88470k63213k53959k73476k88205
$$ 5430476 5007271 4701795 4435942 4156754 3868284 3605071 3351112 3077636 2789431
18648B789431k65050k20266j81826j42087j05537p2251o0308n5983m4285k7017
$$ 2789431 2524381 2304115 2122289 1980202 1874665 1802414 1742106 1686123 1641838 1614821
18638A614821q28K8834Q5950J31914J79349J95133J22487P95r2871j03334n1906
$$ 1614821 1613993 1642827 1728777 1860691 2040040 2235173 2357660 2358455 2265584 2162250 2110344
18627B110344L7954J57714L02236M73189N75852M37837R8812k52334m24651l91862
$$ 2110344 2148298 2306012 2608248 3081437 3657289 4095126 4193938 3941604 3516953 3125091
18617C125091k92130j65177j5400J05169R0994j7292j60666k60236k43634k02219
$$ 3125091 2832961 2667784 2652384 2757553 2848547 2831255 2670589 2410353 2166719 1964500
18607A964500j84786k06439j87865j78153j44755j06206q4746o6378n2686m5882
$$ 1964500 1779714 1573275 1385410 1207257 1062502 956296 871550 805172 752486 706604
18597G06604m1515m5301m5632m1931k7825k7719k6160k9594l254J2878j972j5984
$$ 706604 665089 619788 574156 532225 504400 476681 450521 420927 417673 430551 428579 412595
18585D12595j8103j8597j4977j5453j4856j0302q687k0496j7078k0712k3152j4481
$$ 412595 394492 375895 360918 345465 330609 320307 311620 291124 274046 253334 230182 215701
18573B15701k1898p506p103o196j6811j4111r354n419n307m690O583p193k353
$$ 215701 193803 186297 179194 172998 156187 142076 132722 127303 121996 117306 123889 116696 114343
18560A14343j618o832m467j001O277K687j523n010N040j385m973J079P831l259
$$ 114343 112725 105893 101426 100425 106702 109389 107866 102856 107896 106511 101538 102617 110448 107189
18546A07189m519L874N445k382j544O06k909J236M39K346m637j267K62m673P47
$$ 107189 102670 106544 111989 109607 108063 108669 105760 106996 107435 109781 105144 103877 104139 99466 100213
18531A00213n825m798l799q78J083K705k999L48K425q736j2240k079J648q470
$$ 100213 94388 89590 85791 84913 85996 88701 85702 86050 88475 79739 67499 65420 67068 58598
18517E8598o831N019o361P347L031j1019L625P806l73J1406J987j0645j2088n948
$$ 58598 51767 56786 50425 57772 60803 49784 53409 61215 60842 72248 74235 63590 51502 45554
18503D5554O835P46p981p036m04N225k955J767j279L524L990p81J527O65P28n681
$$ 45554 52389 53135 45154 38118 37714 42939 39984 41751 40472 43996 47986 47205 48732 49397 50125 44444
18487D4444p671M464P365R535J25q284N823R917k603K48o841m538N948p926r436
$$ 44444 36773 41237 48602 58137 58262 49978 55801 65718 63115 63363 56522 51984 57932 50006 40570
18472D0570o209K879J1454p527q500J460N308j770j013l766J431m887P041j236
$$ 40570 34361 37240 48694 41167 32667 34127 39435 37665 36652 32886 34317 29430 36471 35235
18458C5235m8L470m939n042J84M681K698k353J737k07N57K904k829J343q036o891
$$ 35235 35187 38657 33718 28676 28860 33541 36239 33886 35623 35416 35973 38877 36048 37391 29355 22464
18442B2464n532K882Q768M991m590o754j508M921q505J289L331m334L472K792
$$ 22464 16932 19814 28582 33573 28983 22229 20721 25642 17137 18426 21757 17423 20895 23687
18428B3687K347n616j615L813M171j853r671m132R434R044j28j3664n852N088
$$ 23687 26034 20418 18803 22616 26787 24934 15263 11131 20565 29609 29481 15817 9965 15053
18414A5053P845J2301q569q452q48J617m676o973J2593L35o620N933J427J3633
$$ 15053 22898 35199 26630 18178 17330 18947 14271 7298 19891 20226 13606 19539 20966 34599
18400C4599p075p870j263n094M312M182O981M972k71l920J924R25m084r906l881
$$ 34599 27524 19654 18391 13297 17609 21791 28772 33744 33473 29553 31477 32402 28318 18412 14531
18385A4531P004N128j307L020p651m590N001j075n517O201J3019O799K865m810
$$ 14531 21535 26663 25356 28376 20725 16135 21136 20061 14544 20745 33764 40563 43428 38618
18371C8618O365J150j1037j1001m177L340l041p028L760R899L24l908J477K575
$$ 38618 44983 46133 35096 24095 19918 23258 20217 13189 16949 26848 27172 23264 24741 27316
18357B7316R785j0566o83L174L050p000L611P327K969P94o438P356O8q260j690
$$ 27316 37101 26535 25852 29026 32076 25076 28687 36014 38983 39777 33339 40695 40763 32503 30813
18342C0813J965n338K697N206O357p6J305J182O394m573r291l923J427K194n970
$$ 30813 32778 27440 30137 35343 41700 41624 42929 44111 50505 45932 36641 32718 34145 36339 30369
18327C0369n52J933J230K122K539K826m863n258K544R316Q79p33M596R068J1014
$$ 30369 29817 31750 32980 35102 37641 40467 35604 30346 32890 42206 43085 42352 46948 56016 67030
18312F7030J6898J0782J0562p83q436j0720j326P009L352J1711J1377k099J735
$$ 67030 83928 94710 105272 104489 96053 85333 84007 91016 94368 106079 117456 115357 117092
18299A17092p801j1300o90m039j1452o144O805K381j78O979K884k657l468j2737
$$ 117092 109291 97991 97301 93262 81810 75666 82471 84852 84674 91653 94537 91880 88412 75675
18285G5675Q051J0622l672J319j4075k036J120k33P31P555k08L639L759J2389
$$ 75675 83726 94348 90676 91995 77920 75884 77004 76771 77502 85057 84849 88488 92247 104636
18271A04636R014O464O500L35J2883J8400K5583J8755J0261M737M862L011J4610
$$ 104636 113650 120114 126614 126949 139832 158232 183815 202570 212831 217568 222430 225441 240051
18258B40051J1483R578J6202J3379M073N493j157K126J4173K2060L4974L9709
$$ 240051 251534 261112 277314 290693 294766 300259 299102 301228 315401 337461 372435 412144
18246D12144M6524N4800P0691J00177J45494J98019K33963K39245J79622P1728
$$ 412144 458668 513468 584159 684336 829830 1027849 1261812 1501057 1680679 1752407
18236A752407k8781q6654p9278m834Q4162J64937K02547J56619L3202j18080k22598
$$ 1752407 1723626 1636972 1557694 1552860 1637022 1801959 2004506 2161125 2194327 2076247 1853649
18225A853649k58873k29973j78615j38128r8428p4543o8621n4275m2162k8872
$$ 1853649 1594776 1364803 1186188 1048060 949632 875089 806468 752193 710031 681159
18215F81159j7182j6474q655p931j6577k1895j0904O390P252K5297L8770M7929
$$ 681159 663977 647503 638848 630917 614340 592445 581541 587931 595183 620480 659250 707179
18203G07179P2516R2955J02020J23329J60649K19625K93131M08013N25624N85119
$$ 707179 779695 872650 974670 1097999 1258648 1478273 1771404 2179417 2705041 3290160
18193C290160N61290M16092J96287k7413j53069j57589q0264M3580J41337J71356
$$ 3290160 3851450 4267542 4463829 4436416 4283347 4125758 4045494 4089074 4230411 4401767
18183D401767J29019M117j39393k21837k49454k51361k44907k80701l22655l37555
$$ 4401767 4530786 4534903 4395510 4173673 3924219 3672858 3427951 3147250 2824595 2487040
18173B487040l19138k70562k15043j57349j30386j10284r5664q8417p8337o1189
$$ 2487040 2167902 1897340 1682297 1524948 1394562 1284278 1188614 1100197 1021860 960671
18163I60671m8046l9687k6598k1435j1930L435J4146L3332N1362N8338N3713O1029
$$ 960671 912625 872938 846340 824905 812975 816410 830556 863888 915250 973588 1027301 1088330
18151A088330R4327J45563J92354K55856L31683M28591N23931N44463M51185K15153
$$ 1088330 1182657 1328220 1520574 1776430 2108113 2536704 3060635 3605098 4056283 4271436
18141D271436o5080k65073l33444k53283q7490P9973K41698L77920M41288M18628
$$ 4271436 4206356 3941283 3607839 3354556 3267066 3347039 3588737 3966657 4407945 4826573
18131D826573L10702J66767R8966J12576J60799J08594j06627l50863m48154l79586
$$ 4826573 5137275 5304042 5403008 5515584 5676383 5784977 5678350 5327487 4879333 4499747
18121D499747k06518J5002K22660L61576L47596J16991k65675n82580o77969n85026
$$ 4499747 4293229 4308231 4530891 4892467 5240063 5357054 5091379 4508799 3830830 3245804
18111C245804m36957l08425k33733j90670j62616j49914j36608j14749j01355
$$ 3245804 2808847 2500422 2266689 2076019 1913403 1763489 1626881 1512132 1410777
18102A410777q9203p5029o1897o1329o2594o8036o0384l3896k3036j0551j042
$$ 1410777 1321574 1246545 1184648 1123319 1060725 992689 932305 898409 875373 864822 863780
18091H63780J3855M0498N3174O9574R1934J34610J91530K67533L64945M72644
$$ 863780 877635 918133 971307 1040881 1132815 1267425 1458955 1726488 2091433 2564077
18081B564077N62719N72654M91795L54447J74566j1423j50734j57421r825K18072
$$ 2564077 3126796 3699450 4191245 4545692 4720258 4708835 4558101 4400680 4390855 4608927
18071D608927L88938L67866R8202l09291o43713p42673o37204m69401l35125k44245
$$ 4608927 4997865 5365731 5463933 5154642 4510929 3768256 3131052 2661651 2326526 2082281
18061B082281k04275j85676j64947j34449j19139j15272r1266p3291p4411o7578
$$ 2082281 1878006 1692330 1527383 1392934 1273795 1158523 1067257 993966 919555 851977
18051H51977o8380m9420l6291l7952m3383l7366j9617j5022j7019k812J6086K3851
$$ 851977 783597 734177 697886 659934 616551 579185 559568 544546 527527 524715 540801 564652
18039E64652L2094M4127P2240J12446J56789K25352K96058L14217J93754J2873
$$ 564652 596746 640873 713113 825559 982348 1207700 1503758 1817975 2011729 2024602
18029B024602j49820j83004r2695K7464J16590J31586M4161j05066k40241k70705
$$ 2024602 1874782 1691778 1599083 1626547 1743137 1874723 1918884 1813818 1573577 1302872
18019A302872k25081j68448j19014r7596o9531o2583n6800m9553l8044l1992j9558
$$ 1302872 1077791 909343 790329 692733 623202 560619 503819 454266 416222 384230 364672
18008C64672j8039k6119k7465k1236k3297k5657k1053j6252o579j9007j1702r380
$$ 364672 346633 320514 293049 271813 248516 222859 201806 185554 178975 159968 148266 138886
17996A38886j4046j0759o150o612m431j108k479m907j3635n24q37j4524o124N984
$$ 138886 124840 114081 107931 101319 96888 95780 93301 88394 74759 74235 73398 58874 52750 58734
17982E8734M81k487R13L955m610j984n356j1368p3K708L503j358M593l703j1262
$$ 58734 59215 56728 57641 61596 56986 55002 49646 38278 38205 40913 44416 43058 47651 43948 32686
17967C2686p753L5j15L51P296O854L685M079Mp729n062K548q281r502M690O272
$$ 32686 24933 24968 24853 25204 32500 39354 43039 47118 47122 39393 34331 36879 28598 19096 23786 30058
17951C0058L770k049n159N521M959r64j163l559L330M011k837n732j2330j2306
$$ 30058 33828 31779 26620 32141 37100 36136 34973 31414 34744 38755 35918 30186 17856 5550
17937E550j158p720m955O663J4371J3665K126o454J336J325n613n679J152J699
$$ 5550 4392 -3328 -8283 -1620 12751 26416 28542 22088 23424 24749 19136 13457 14609 16308
17923A6308L269m066q559L916j620M020J2940N823l388O29P839l797p564m641
$$ 16308 19577 15511 6952 10868 9248 13268 26208 32031 28643 29272 37111 33314 25750 21109
17909B1109r12k989m834J916K362n012j991M567m582N680l596j0780M593L729
$$ 21109 20197 17208 12374 14290 16652 11640 9649 14216 9634 15314 11718 938 5531 9260
17895I260j024J86N764J0168J184N325o72j084j2876M812M53q07n730J745M475
$$ 9260 8236 8422 14186 24354 25538 30863 30191 29107 16231 21043 21496 20689 14959 16704 21179
17880B1179m022n416J137o343L20P207L97n973N060n158j093O411M393k178n468
$$ 21179 17157 11741 12878 6535 6855 14062 14459 8486 13546 8388 7295 13706 18099 15921 10453
17865A0453m419j014k456p060j755nJ1739P161J689k303p592J778j799k637K429
$$ 10453 6034 5020 2564 -4496 -6251 -6256 5483 12644 14333 12030 4438 6216 4417 1780 4209
17850D209m927M610k045O716O560n00l735k646M580j885l127Q466j2959N990n303
$$ 4209 -718 3892 1847 8563 15123 14623 10888 8242 12822 10937 7810 16276 3317 9307 4004
17835D004j0553m131Q850R084p29J977M920m173J983N22j0697q762O51K947n665
$$ 4004 -6549 -10680 -1830 7254 6525 8502 13422 9249 11232 11754 1057 -7705 -7054 -4107 -9772
17820i772j065O374m494N578K699N232J198n604q472L63l311L196Q854O136J0754
$$ -9772 -10837 -4463 -8957 -3379 -680 4552 5750 146 -8326 -7963 -11274 -8078 776 6912 17666
17805A7666k717r119n6o491p772m572N346K767R43M046R22q719m76L388M612p97
$$ 17666 14949 5830 5774 -717 -8489 -13061 -7715 -4948 -4005 41 963 -7756 -8232 -4844 -232 -1029
17789a029m199J374N053L266j0658J264m336l512O959J183J7J886J961o58o270
$$ -1029 -5228 -3854 1199 4465 -6193 -4929 -9265 -12777 -5818 -4635 -4618 -2732 -771 -1429 -7699
17774g699p12N325J0057r839q670O685Q469N511J0668k325k718j1105j4918k368
$$ -7699 -8411 -3086 6971 -2868 -11538 -4853 3616 9127 19795 17470 14752 3647 -11271 -13639
17760a3639M881L27P63j931m818K725J573R05k111j405R492K270N46l399j027
$$ -13639 -8758 -8431 -7668 -9599 -14417 -11692 -10119 -9214 -11325 -12730 -3238 -968 -422 -3821 -4848
17745d848o410k564J519K420O936M864j508n630J856O183l238j1170n991K801
$$ -4848 -11258 -13822 -12303 -9883 -2947 1917 409 -5221 -3365 2818 -420 -11590 -17581 -14780
17731a4780N021R540J501L31r83K24l163j8l136J609O646P457M226n583m565N126
$$ -14780 -9759 -219 1282 1613 630 854 -2309 -2327 -5463 -3854 2792 10249 14475 8892 4327 9453
17715I453l906j476N019m590l324O033M544k522r535J539j061j495j711L29K306
$$ 9453 5547 4071 9090 4500 1176 7209 11753 9231 -304 1235 174 -1321 -3032 -2703 -397
17700c97O804m039q282J096O056P493j274j2078L02M184J202O461M53j740K828
$$ -397 6407 2368 -5914 -4818 1238 8731 7457 -4621 -4319 -135 1067 7528 7981 6241 9069
17685I069n906O10l120K594M323l995L550P031L117k256j07j0157J548J1164J1314
$$ 9069 3163 3773 653 3247 7570 3575 7125 14156 17273 15017 14910 4753 6301 17465 28779
17670B8779J05q163j7970j1263M07J2164Q300L742m632Q25K31o800l989N122J873
$$ 28779 28884 20721 2751 -8512 -8105 4059 12359 16101 11469 12294 12525 5725 1736 6858 8731
17655H731O968O899O020j759j612p830K273N158n833o331m65j723m760p336k404
$$ 8731 15699 22598 28618 26859 25247 17417 19690 24848 19015 12684 12219 10496 5736 -1600 -4004
17640d004m713K74L139L002O049O794j605m719l812N514j4103n971L252J0429
$$ -4004 -8717 -8443 -5304 -2302 3747 10541 8936 4217 405 5919 -8184 -14155 -10903 -474
17626d74J0054l091L434N90L245m818J1212J1054o603l301k672K383n240k787
$$ -474 9580 6489 9923 10513 13758 8940 20152 31206 24603 21302 18630 21013 15773 12986
17612A2986M574N826L246m073o736q222q02J409o34j099j070l579l748N983L759
$$ 12986 17560 23386 26632 22559 15823 7601 6799 8208 7574 6475 5405 1826 -1922 4061 7820
17597G820o306k040N079j599j485N715j332k11K1p621Q10N908L172Q22J188r958
$$ 7820 1514 -526 4553 2954 1469 7184 5852 5641 5662 -1959 -1149 4759 7931 8753 9941 -17
17581a7L510N021N337R331p696j163O697J1276P056K746r835m411j967p341k407
$$ -17 3493 8514 13851 23182 15486 14323 21020 32296 39352 42098 32263 27852 25885 18544 16137
17566A6137q53j941M20L444j070o903n814J764J4270l511j0360J082l408l09K475
$$ 16137 15284 13343 13763 17207 16137 9234 3420 5184 19454 15943 5583 6665 3257 2948 5423
17551E423J076J198L57k486k434J017j851K477O682K130p770r734K416P194n10
$$ 5423 6499 7697 8054 5568 3134 4151 2300 4777 11459 13589 5819 -3915 -1499 5695 5185
17536E185l932P524P845k305M7M512J095q254J948N777L930l743n716j592M916
$$ 5185 1253 8777 16622 14317 14364 18876 19971 11717 13665 19442 23372 19629 13913 12321 17237
17521A7237M57M77m29J058k771l702n347m780l157P048Q526L259o330k504J802
$$ 17237 17694 18171 17742 18800 16029 12327 6980 2200 -957 6091 14617 17876 11546 9042 10844
17506A0844L434j493J671L835n495q0k884L665R401P626J4859O222O633J2408
$$ 10844 14278 12785 14456 18291 12796 12716 9832 13497 22898 30524 45383 51605 58238 70646
17492G0646K7105L5164L7161J6355o90q10J556J7160J392j9632l3981l1678l5052
$$ 70646 97751 132915 170076 186431 185741 184931 186487 203647 205039 185407 151426 119748 84696
17479H4696j5956j503p772l060L16K541J1024Q216L022Q333J8163L1232K8530
$$ 84696 68740 67237 59465 56405 56721 59262 70286 78502 81524 89857 108020 139252 167782
17466A67782K1526J1647J601k897R0K418n157k4409l2178k6792k1425k2660j3093
$$ 167782 189308 200955 202556 199659 199749 202167 197010 172601 140423 113631 92206 69546 56453
17453E6453q838n506L581p154r522n124p309k099j814j537N48n262n156M249P08
$$ 56453 47615 42109 45690 38536 29014 23890 16581 14482 12668 11131 11679 6417 1261 5510 6218
17438F218N269j836J676L551J064n021q503K495O126m309j0046j679o692Q504
$$ 6218 11487 9651 11327 14878 15942 10921 2418 4913 11039 6730 -3316 -4995 -11687 -3183
17424c183J2373K483o78M525O96N817k651q03n004m488k733m637o740O593J1918
$$ -3183 9190 11673 10995 15520 16216 22033 19382 18579 13575 9087 6354 1717 -5023 1570 13488
17409A3488m19k37P162n737j4953o024L985M284q136k949j644L323K19J1908L816
$$ 13488 13069 12832 19994 14257 -696 -6720 -2735 1549 -6587 -9536 -11180 -7857 -7638 4270 8086
17394H086n406l04M568Q566J2725J5570J6872J0725j3504j1523j997M691O670
$$ 8086 2680 2376 6944 15510 28235 43805 60677 71402 57898 46375 44378 49069 55739
17381E5739r15j3854j8147m460K988o540m93p49j0749m281p463j994M804J1922
$$ 55739 54824 40970 22823 18363 21351 14811 14318 13569 2820 -1461 -8924 -10918 -6114 5808
17367E808m302n891J446M927L773p185o930K782M441K681L685k852m893k602L152
$$ 5808 1506 -4385 -2939 1988 5761 -1424 -8354 -5572 -1131 1550 5235 2383 -2510 -5112 -1960
17352a960N153n900m652M203O440k635k49q535N928L120L712N618o728O44j460
$$ -1960 3193 -2707 -7359 -3156 3284 649 400 -8135 -2207 913 4625 10243 3515 4159 2699
17337B699l500M301j93o078l576J279k425l004N94k841N08J2260O783j993m71
$$ 2699 -801 3500 3307 -2771 -6347 -5068 -7493 -10497 -9903 -12744 -12236 24 6807 4814 4343
17322D343j930j374l59J12J36j975p687p43l408p220K923J946J015R88R15P438
$$ 4343 2413 1039 680 792 928 -1047 -8734 -9477 -12885 -20105 -17182 -15236 -14221 -13233 -12318 -4880
17306d880N715L936m355j170J754J407o860L859l960k083l158J706O691L735j681
$$ -4880 835 4771 416 -754 1000 2407 -4453 -594 -4554 -6637 -9795 -8089 -1398 2337 656
17291F56l488k677r435M046J0246J725n156L050l703j597k994L397Q28k594N104
$$ 656 -2832 -5509 -14944 -10898 -652 1073 -4083 -1033 -4736 -6333 -9327 -5930 -5102 -7696 -2592
17276b592R828o10p733m777l859L180M954P044k508L403j301j1333l11M664O614
$$ -2592 7236 6626 -1107 -5884 -9743 -6563 -1609 5435 2927 6330 5029 -6304 -6615 -1951 4663
17261D663K178j1743R29P408J20j882o437J938p713k287N188J2012L343k103r4
$$ 4663 6841 -4902 -3973 3435 3555 1673 -4764 -2826 -10539 -12826 -7638 4374 7717 5614 5520
17246E520l876l839N074J68m984p820J977R574r56o867L588K135N155j365m818
$$ 5520 1644 -2195 2879 3047 -1937 -9757 -7780 1794 838 -6029 -2441 -306 4849 3484 -1334
17231a334J180n998j784q35M199m029l924O8M696M744L131k289q361n012m047
$$ -1334 -154 -6152 -7936 -8771 -4572 -8601 -12525 -12457 -7761 -3017 114 -2175 -10536 -15548 -19595
17216a9595p838P544J9643M760K989k008j3641q93k966L804L288l94o485O114
$$ -19595 -27433 -19889 -246 4514 7503 5495 -8146 -9039 -12005 -8201 -4913 -5307 -11792 -5678
17202e678J8050l323j0002o37M069K96R470m84q363p230m431Q63m80j943O497
$$ -5678 12372 9049 -953 -1590 2479 2775 12245 11761 3398 -3832 -8263 -7400 -7880 -9823 -3326
17187c326p059n033J2271k011j628P083j1951p67J571Q449J597L027m49k193m23
$$ -3326 -10385 -15418 -3147 -5158 -6786 297 -11654 -12421 -10850 -2401 -804 2223 1774 -419 -842
17172h42m688m779J758N780L365n108m339J795r50m690RL204M125k286K908p867
$$ -842 -5530 -10309 -8551 -2771 594 -4514 -8853 -7058 -8008 -12698 -12689 -9485 -5360 -7646 -4738 -12605
17156a2605J027j793L70m7K469L800l43m991Q554Q388o0j962K582j006J1690p379
$$ -12605 -11578 -13371 -13001 -13048 -10579 -6779 -7122 -12113 -3559 4829 4769 2807 5389 4383 16073 8694
17140H694K987j011o935R783K803r694k158R800K23J48j1270o988l117J759K149
$$ 8694 11681 10670 3735 13518 16321 6627 4469 14269 14492 14640 3370 -3618 -6735 -4976 -2827
17125b827J0943O897o260p979j349M650L038l855o356L832j543o822K81P09J989
$$ -2827 8116 15013 8753 774 -575 4075 7113 3258 -3098 734 -809 -7631 -7350 -6641 -4652
17110d652m897J2894L030O509j899o601n874k221k142j237j135L964j590m83L585
$$ -4652 -9549 3345 6375 12884 10985 4384 -1490 -3711 -5853 -7090 -8225 -4261 -5851 -6334 -2749
17095b749M671k710j2281m509n766L174J5050J3314J819p841j1190K00J2838j890
$$ -2749 1922 -788 -13069 -17578 -23344 -20170 -5120 8194 10013 2172 -9018 -8818 4020 2130
17081B130M744N992q772o075m451k710K301M663J0756j659j488J703p284n647
$$ 2130 6874 12866 4094 -1981 -6432 -9142 -6841 -2178 8578 6919 5431 7134 -150 -5797
17067e797J1N617J266j352K715r559l32N63K128k676o54L534L315o059J3426R320
$$ -5797 -5786 -169 1097 -255 2460 -7099 -7431 -6868 -4740 -7416 -8070 -4536 -1221 -7280 6146 15466
17051A5466q99n50n045m667j726N492j120n63K209p79N639O616K893N74n523L552
$$ 15466 14567 14017 8972 4305 2579 8071 6951 6388 8597 7818 13457 20073 22966 23540 18017 21569
17035B1569J0679Q631k961P642P027J321R941J1164J6260J0984K7080M4410M8566
$$ 21569 32248 40879 37918 45560 52587 53908 63849 75013 91273 102257 129337 173747 222313
17022B22313N0137N8239Q4489J33903J96164K67582L32428K86287J07159j18611
$$ 222313 272450 330689 415178 549081 745245 1012827 1345255 1631542 1738701 1620090
17012A620090k78811l01111k33777j39554q8770q0036o0356m1964m1846m0938
$$ 1620090 1341279 1040168 806391 666837 578067 498031 437675 395711 353865 312927
17002C12927m0998l3898l4032k4602k2522j5571j2660o319k4153j4011m868o76
$$ 312927 271929 238031 203999 179397 156875 141304 128644 122325 98172 84161 79293 78617
16990G8617o845j5838n025m026m376m894N04m729m096J454o198k419j076M910
$$ 78617 71772 55934 50909 46883 42507 37613 38117 33388 29292 30746 24548 22129 21053 25963
16976B5963m12m634k708q328l367O628l468m465j141K101M525k795p011l930N308
$$ 25963 25551 20917 18209 9881 6514 13142 9674 5209 4068 6169 10694 7899 888 -3042 2266
16961B266Q581M566Q00q846k457R715R055l887p936m992l704k798M27r64N975
$$ 2266 10847 15413 16213 7367 4910 14625 23680 19793 11857 6865 3161 363 790 -174 5801
16946E801O291O030R73l340j2959m353M977O857k953o536l511M50j556J606k28
$$ 5801 12092 18122 19095 15755 2796 -1557 3420 10277 7324 788 -2723 -2273 -3829 -2223 -2451
16931b451p748K86K874n2k569j409N355N869K220m17n416m281q952q436L772N956
$$ -2451 -10199 -9913 -7039 -7091 -9660 -11069 -5714 155 2375 1958 -3458 -7739 -16691 -25127 -21355 -15399
16915a5399P33L700p6L345M007n688J414M135j459m002o933K171Q329p809O1L586
$$ -15399 -14666 -10966 -11042 -7697 -3690 -9378 -7964 -3829 -5288 -9290 -16223 -14052 -5723 -13532 -13471 -9885
16899i885m338l176L83P066J0369P051k892p664o932N023J3519r770r962j879
$$ -9885 -14223 -17399 -17016 -9950 419 7470 4578 -3086 -10018 -4995 8524 -1246 -11208 -13087
16885a3087o481N600Q905l73o164J0941P691N246K327M048r813m415K492L873
$$ -13087 -19568 -13968 -5063 -5436 -11600 -659 7032 12278 14605 18653 8840 4425 6917 10790
16871A0790M849q043o850q261k308P47M272k59m808n319l724N648M839K417P083
$$ 10790 15639 7596 746 -7515 -9823 -9076 -4804 -5063 -9871 -15190 -18914 -13266 -8427 -6010 1073
16856A073K31R73M617j2123o590n366L847N723J005K034j0621J344j302M278K219
$$ 1073 1304 2277 6894 -5229 -11819 -17185 -13338 -7615 -6610 -4576 -15197 -13853 -15155 -10877 -8658
16841h658N531Q528J544j2358l164Q342P398m829O005l751j2011m170O237L41
$$ -8658 -3127 5401 6945 -5413 -8577 -235 7163 2334 8339 4588 -7423 -11593 -5356 -5015
16827e015n403N545m2n122L122L235M537K438j1977j981L583o802n319L795N140
$$ -5015 -10418 -4873 -4915 -10037 -6915 -3680 857 3295 -8682 -10663 -7080 -13882 -19201 -15406 -10266
16812a0266M99o662m28J0419Q005K655r50m940l69o27j251j296M823j679n494
$$ -10266 -9767 -16429 -16857 -6438 1567 4222 3272 -1668 -2037 -2664 -3915 -5211 -388 -2067 -7561
16797g561K985O245K205o481k462J31L990P904N880j543m79k220j861J085K019
$$ -7561 -4576 1669 3874 -2607 -5069 -4938 -948 6956 12836 11293 10814 8594 6733 7818 9837
16782I837j652M37n315j952P899j414l457R2P963j184o523M35j2322K03k35N964
$$ 9837 8185 8622 3307 1355 9254 7840 4383 4475 12438 11254 4731 5166 -7156 -6953 -7188 -1224
16766a224J1851j911l656M536j601n357q666M655k345p649k781M713K061J698
$$ -1224 10627 8716 5060 9596 7995 2638 -6028 -1373 -3718 -11367 -14148 -9435 -7374 -5676
16752e676n84L703l948o05M674Q03P208O285j815k049M050j2391o058P479l819
$$ -5676 -6260 -2557 -6505 -7110 -2436 -1633 5575 11860 10045 7996 12046 -345 -6403 1076 -2743
16737b743K461M294O11j696n153j610R06L207J0468P91o574o62O467K096j0211
$$ -2743 -282 4012 4623 2927 -2226 -3836 -2930 277 10745 11536 4962 4300 10767 12863 2652
16722B652K29J768L198o725K66J363O100J0142n982k0266n920o277j986J4077
$$ 2652 2881 4649 7847 1122 1388 2751 8851 18993 13011 -7255 -13175 -19452 -21438 -7361
16708g361Q940L131j438rj916l230k446m821q59r641L85L849M921K526N054O513
$$ -7361 1579 4710 3272 3263 1347 -1883 -4329 -9150 -10009 -19650 -19265 -15416 -10495 -7969 -2915 3598
16692C598M943J84j288o410n66N610L028l751r702O802N487q174J822q874r766
$$ 3598 8541 8725 7437 1027 461 6071 9099 5348 -4354 2448 7935 -239 1583 -7291 -17057
16677a7057n9M35L545R203L487j39J380l921K932O521L348k497M217J348n029
$$ -17057 -17116 -16681 -13136 -3933 -446 -585 795 -3126 -194 6327 9675 7178 11395 12743 7714
16662G714j2965j5689k371N022N016K665P023K121p495o092n265L859M562J1092
$$ 7714 -5251 -20940 -23311 -18289 -13273 -10608 -3585 -1464 -8959 -15051 -20316 -16457 -11895 -803
16648h03P09j1982l965k841J788J0949P391L931j238o298q544j85m989K374M144
$$ -803 -94 -12076 -16041 -18882 -17094 -6145 1246 5177 3939 -2359 -10903 -11088 -16077 -13703 -9559
16633i559o975J0242P404J192l584p084J4703J6770j0424n319m918k260k474k849
$$ -9559 -16534 -6292 1112 2304 -1280 -8364 6339 23109 12685 7366 2448 188 -2286 -5135
16619e135K829p34l161K172O052k35n129m617n351j506N998k951J968O641P47
$$ -5135 -2306 -3040 -6201 -4029 2023 1788 -3341 -7958 -13309 -14815 -8817 -11768 -9800 -3159 -2412
16604b412p064L134J589k454n520O509K136M058M848k041l69j167m777q71o710
$$ -2412 -9476 -6342 -4753 -7207 -12727 -6218 -4082 -24 4824 2783 2414 1247 -3530 -4401 -11111
16589a1111q62K457Q623q19k668j6786p71R651k236m247L546O875L557P228k350
$$ -11111 -11973 -9516 -893 -1712 -4380 -21166 -21937 -12286 -14522 -18769 -15223 -8348 -4791 2437 87
16574H7N102j153l954k096m096l162J825O963Q517L463o935p913l279l765j0475
$$ 87 5189 4036 82 -2014 -6110 -9272 -7447 -484 8033 11496 4561 -3352 -6631 -10396 -20871
16559b0871n944K587m39j290N68l13q51M143l99L494Q18nJ75R226N620j085m760
$$ -20871 -26815 -24228 -24667 -25957 -25389 -25702 -26553 -22410 -22809 -19315 -18497 -18502 -18327 -9101 -3481 -4566 -9326
16542i326p012O457R71m917q75l670n434pN648M417q27L343k683O895L316J530
$$ -9326 -16338 -9881 -8910 -13827 -14702 -18372 -23806 -23813 -18165 -13748 -14575 -11232 -13915 -7020 -3704 -2174
16526b174Q777K146l188K772P7m477J720q39o556j3l944L388M60k211j760J562
$$ -2174 6603 8749 5561 8333 8410 3933 5653 4814 -1742 -1755 -5699 -2311 -1851 -4062 -5822 -4260
16510d260k478L415M374m356J937j25j424l585K196k943M5m506J080l938J2971
$$ -4260 -6738 -3323 1051 -3305 -1368 -1493 -2917 -6502 -4306 -7249 -7204 -11710 -10630 -14568 -1597
16495a597K1p36q436l133N649K792k388j717Q65K941K452M352K704n072K098J0624
$$ -1597 -1576 -2312 -10748 -13881 -8232 -5440 -7828 -9545 -8680 -5739 -3287 1065 3769 -1303 795 11419
16479A1419n480l439m827m151n810k851j290K302J1567M906p117l141O530J916
$$ 11419 5939 2500 -2327 -6478 -12288 -15139 -16429 -14127 -2560 2346 -4771 -7912 -1382 534
16465E34r2Q456R303m40q566j6m799n156N25R783J803j5049n783o908M51J1175
$$ 534 442 8898 18201 17761 9195 9179 4380 -776 -251 9532 11335 -3714 -9497 -16405 -15954 -4779
16449d779J885p912o295l586k582Q153O756J0571L857J2615O38j1483j2440j384
$$ -4779 -2894 -10806 -17101 -20687 -23269 -15116 -8360 2211 6068 18683 19321 7838 -4602 -5986
16435e986k603j1473j610J1592j095m94J78l004K691O417M436M813J512K851o981
$$ -5986 -8589 -20062 -21672 -10080 -11175 -11669 -11491 -14495 -11804 -5387 -951 3862 5374 8225 1244
16420A244l676J847j751o763M16O033M816J900n840O053N596o032n339m580l847
$$ 1244 -2432 -585 -2336 -9099 -8683 -2650 2166 4066 -1774 4279 9875 3843 -1496 -6076 -9923
16405i923J409j2579j0751L198L514J0881J3003N93L885L125m369q439O12N626
$$ -9923 -8514 -21093 -31844 -28646 -25132 -14251 -1248 -655 3230 6355 1986 -6453 -5841 -215
16391b15N397m937j0511R268J1270M554j4177j2626q621j594K901m350L921N328
$$ -215 5182 245 -10266 -998 10272 14826 649 -11977 -20598 -22192 -19291 -23641 -19720 -14392
16377a4392r36L70r9J0071J2427Q54n219q127p076j399J838N995P541L122q281
$$ -14392 -15328 -14958 -15057 -4986 7441 8295 3076 -5051 -12127 -13526 -11688 -5693 1848 4970 -3311
16362c311k405K176m732m320j977j564Q713J129j798M126Q66L209O256o884O86
$$ -3311 -5716 -3540 -8272 -12592 -14569 -16133 -7420 -6291 -8089 -3963 -3097 112 6368 -516 170
16347A70m478N446j293J113k527m628q479L608o94P110k847J676j487L832p566
$$ 170 -4308 1138 -155 958 -1569 -6197 -14676 -11068 -11762 -4652 -7499 -5823 -7310 -3478 -11044
16332a1044l604N791Q380P28j538l635l384q404J586J5674N174m647q307o527
$$ -11044 -14648 -8857 -477 251 -1287 -4922 -8306 -16710 -15124 550 5724 1077 -7230 -13757
16318a3757N413K171m220P198L793j425j544m563Q16K77K153P478K33n055k375
$$ -13757 -8344 -6173 -10393 -3195 598 -827 -2371 -6934 -6118 -5841 -3688 3790 4023 -1032 -3407
16303c407n00P01q209j624M619L682m873K288N311L81l530q25M782j536M330K473
$$ -3407 -3907 -3206 -11415 -13039 -8420 -4738 -9611 -7323 -2012 -1631 -5161 -5986 -1204 -2740 1590 4063
16287D063o120r589o952K60Q447j761l179O041m012q805j221k944R532N318J1413
$$ 4063 -2057 -11646 -18598 -18338 -9891 -11652 -14831 -8790 -12802 -21607 -22828 -25772 -16240 -10922 491
16272D91L214J949o48j545k413j2929k458m052Q708J3539j464l799l025p114M97
$$ 491 3705 5654 5006 3461 1048 -11881 -14339 -18391 -9683 3856 2392 -1407 -4432 -11546 -11049
16257a1049j173J817j769J16m119k704l90Q509J0265L268m186n231M224M126K5
$$ -11049 -12222 -10405 -12174 -12058 -16177 -18881 -19271 -10762 -497 2771 -1415 -6646 -2422 1704 1729
16242A729M478K757k989J360J356r607j768j320n833r95K42j3007N733P590Q393
$$ 1729 6207 8964 5975 7335 8691 -916 -2684 -4004 -9837 -10832 -10590 -23597 -17864 -10274 -1881
16227a881L255p500k978N094k813M757Q162k002k70m911k89j719m11M05P97j573
$$ -1881 1374 -6126 -9104 -4010 -6823 -2066 6096 4094 3824 -1087 -1376 -3095 -3506 -3101 -2304 -3877
16211c877L984J106j19r131n78J518J2018l269K218m97r2n917L090L267n454L406
$$ -3877 107 1213 1094 -8037 -8615 -7097 4921 1652 3870 3373 3281 -2636 454 3721 -1733 1673
16195A673M632o82m225k823K262k683p793N358L280R91P780m417j211Q209K584
$$ 1673 6305 5623 1398 -1425 837 -1846 -9639 -4281 -1001 -10 7770 3353 2142 10351 12935
16180A2935k373L908r05p234p047m670L174n524p647K997J2521J75Q340n311m404
$$ 12935 10562 14470 13565 6331 -716 -5386 -2212 -7736 -15383 -12386 135 310 8650 3339 -1065
16165a065P654j6188q296m04O14m647L470P134R420K328K605n014j925l720K526
$$ -1065 6589 -9599 -17895 -18299 -17685 -22332 -18862 -11728 -2308 20 2625 -2389 -4314 -8034 -5508
16150e508J5438K704k735p684L387K697q374o318k167m484O974Q558J185K613
$$ -5508 9930 12634 9899 2215 5602 8299 -75 -6393 -8560 -13044 -6070 2488 3673 6286
16136F286M10n136j5895r217p94Q611M272Q798N179L313J926L936j003j2831k134
$$ 6286 6696 1560 -14335 -23552 -24346 -15735 -11463 -2665 2514 5827 7753 11689 10686 -2145 -4279
16121d279Q69n240j409L19J976M564L152M758N764J459n049m993m523l203m70
$$ -4279 -3410 -8650 -10059 -9740 -7764 -3200 -48 4710 10474 11933 6884 1891 -2632 -5835 -6305
16106f305K289J392PJ2148n185j4542m116k741Q044Q14O636p2p657L284P573M498
$$ -6305 -4016 -2624 -2617 9531 4346 -10196 -14312 -17053 -9009 -8195 -1559 -1631 -9288 -6004 1569 6067
16090F067l749M278n45P54j0544P35M827J949j1360J074q524r658O315J5416P447
$$ 6067 2318 6596 6051 6805 -3739 -3004 1823 3772 -7588 -6514 -15038 -24696 -18381 -2965 4482
16075D482j837o568R279J248n645k11k976N037P194n572m714J806m744l575q984
$$ 4482 2645 -3923 5356 6604 959 748 -2228 2809 10003 4431 -283 1523 -3221 -6796 -15780
16060a5780j862J632k36J832L158K715m10R767M839n049l108n978m261J079R64
$$ -15780 -17642 -16010 -16246 -14414 -11256 -8541 -8951 816 5655 606 -2502 -8480 -12741 -11662 -10698
16045a0698k016N22J2122j932K583M913O394j2086l244O678j572L791K353k890
$$ -10698 -12714 -12192 -70 -2002 581 5494 11888 -198 -3442 3236 1664 5455 7808 4918
16031D918n846j571k655p122o712L120N561k497k294Q139N667q49J630j917r357
$$ 4918 -928 -2499 -5154 -12276 -18988 -15868 -10307 -12804 -15098 -6959 -1292 -2141 -511 -2428 -11785
16016a1785N095Q125l706n025M122R868p057m434q3p88j667M655K489j015m739
$$ -11785 -6690 1435 -2271 -7296 -3174 6694 -363 -4797 -4880 -5668 -7335 -2680 -191 -1206 -5945
16001e945J095P298j524j897O60n794J088p887M236J4781o24j1658o731N642K008
$$ -5945 -4850 2448 924 -973 -313 -6107 -5019 -12906 -8670 6111 5487 -6171 -12902 -7260 -5252
15986e252j951O176o161k266j295K847L005j884K166R71m752M263j890O835q04
$$ -5252 -7203 -1027 -7188 -9454 -10749 -7902 -4897 -6781 -4615 -3644 -8396 -4133 -6023 812 8
15971Hq078k175o625K034k037L527O397R969L643L319n990n709O19k337o983L155
$$ 8 -8070 -10245 -16870 -14836 -16873 -13346 -6949 3020 6663 9982 3992 -1717 -1098 -3435 -10418 -7263
15955g263L358N332J83p104q638K122k590O28P31R760Q896J705M257k84J289n418
$$ -7263 -3905 1427 1610 -5494 -14132 -12010 -14600 -13972 -13241 -3481 5415 7120 11377 11093 12382 6964
15939F964p194k666n24M496R83j0154p893J598J978J0449R72K31P99j342P462
$$ 6964 -230 -2896 -3420 1076 2059 -8095 -15988 -14390 -12412 -1963 -991 -760 39 -1303 6159
15924F159R457p01j5000P68M087k148p862J693j841m53l352n526P593o70J242
$$ 6159 15616 14915 -85 683 4770 2622 -5240 -3547 -5388 -5841 -9193 -14719 -7126 -7796 -6554
15909f554p35J002M674N819q614o406m451o605J270N737J0365J1657n469p955
$$ -6554 -7289 -6287 -1613 4206 -4408 -10814 -15265 -21870 -20600 -14863 -4498 7159 1690 -6265
15895f265J826j385M226P983o294o985j2536n18L105J326j069J0111K728l305
$$ -6265 -4439 -5824 -1598 6385 91 -6894 -19430 -19948 -16843 -15517 -16586 -6475 -3747 -7052
15881g052L28L385p94k442l898K220R65q22K538L729k571m624J794J615o688n9
$$ -7052 -6724 -3339 -4133 -6575 -10473 -8253 -7288 -8110 -5572 -1843 -4414 -9038 -7244 -5629 -12317 -12376
15865a2376K602K116k750l193N109k40r96L039O045q494l832n881k361Q507k115
$$ -12376 -9774 -7658 -10408 -13601 -8492 -8732 -9728 -6689 -644 -9138 -12970 -18851 -21212 -12705 -14820
15850a4820M719N799L31L211j18n208j0090j531K018L258m896K577O083O008M514
$$ -14820 -10101 -4302 -3971 -760 -878 -6086 -16176 -17707 -15689 -12431 -17327 -14750 -8667 -2659 1855
15835A855J025p244j1028k810k52r522l269J1909R351K919K18k291J0035L944
$$ 1855 2880 -4364 -15392 -18202 -18454 -27976 -31245 -19336 -9985 -7066 -6848 -9139 896 4840
15821D840J125J410o739j1516O850J2698n084p805j32J478j784j739K089O19r753
$$ 4840 5965 7375 636 -10880 -4030 8668 3584 -4221 -4353 -2875 -4659 -6398 -4309 -3690 -13443
15806a3443l146J790N495M194j153J376M642M699N794q187K012j91Q624j965N201
$$ -13443 -16589 -14799 -9304 -5110 -6263 -4887 -245 4454 10248 2061 4073 3882 12506 10541 15742
15791A5742p586r142M447k335p526r160p0O457K847L141o302r994R108R544l005
$$ 15742 8156 -986 3461 1126 -6400 -15560 -15630 -9173 -6326 -3185 -9487 -19481 -10373 -829 -3834
15776c834j647N267J2161J1153m924j7586l586K884J147j139J174M276j017K152
$$ -3834 -5481 -214 11947 23100 18176 590 -2996 -112 1035 -104 1070 5346 4329 6481
15762F481P733q503k021K323O279M58m120j3175r848l947O45R370J387l78L924
$$ 6481 14214 5711 3690 6013 12292 12750 8630 -4545 -14393 -18340 -17695 -8325 -6938 -7316 -3392
15747c392Q98j12m696j734l431M283k688m397K501R907P016K078l897o910L172
$$ -3392 -2494 -2606 -7302 -9036 -12467 -8184 -10872 -15269 -12768 -2861 4155 6233 2336 -4574 -1402
15732a402J1702k435n889k033k89k013J115m146j431N652O945k041p688l656J2896
$$ -1402 10300 7865 1976 -57 -346 -2359 -1244 -5390 -6821 -1169 5776 3735 -3953 -7609 5287
15717E287J1961p545j2238p99j347m370k760K41l207n003J862K478n775Q806O556
$$ 5287 17248 9703 -2535 -3334 -4681 -9051 -11811 -11570 -14777 -19780 -17918 -15440 -21215 -12409 -5853
15702e853R90j3414k183O806R915R863M702n582q446m804p145O838Q333k886L385
$$ -5853 -4863 -18277 -20460 -13654 -3739 6124 10826 5244 -3202 -8006 -15151 -8313 20 -2866 519
15687E19N629J64k318r351P753J066j0449j0318K708P547p270K266K611p299J18
$$ 519 6148 6312 3994 -5357 2396 3462 -6987 -17305 -14597 -7050 -14320 -12054 -9443 -16742 -16624
15672a6624J9676r93r381j68l79k178j703Q542L587Q72q000j913M136K1k309K86
$$ -16624 3052 2059 -7322 -7490 -7869 -10047 -11750 -3208 379 1251 -6749 -8662 -4526 -4505 -6814 -6528
15656f528J132k895n097o944L916O287J80r8P548L311k088p743M259Q968n348
$$ -6528 -5396 -8291 -13388 -20332 -16416 -10129 -9949 -10047 -2499 812 -1276 -9019 -4760 4208 -1140
15641a140O06o87j413J714n94K222K35O65k007L599j44j1923p572J313N792N695
$$ -1140 -534 -1221 -2634 -920 -1514 708 943 1608 -399 3200 3056 -8867 -16439 -15126 -9334 -3639
15625c639O889j2147p777K812L123j609K044M024q45j696o345K610J2774m347
$$ -3639 3250 -8897 -16674 -13862 -10739 -12348 -10304 -6280 -7125 -8821 -15166 -12556 218 -4129
15611d129j90n55p929O393L501l844k597r92l446J880M481L124Q543L867j1765
$$ -4129 -4319 -4874 -12803 -6410 -2909 -6753 -9350 -10342 -13788 -11908 -7427 -4303 4240 8107 -3658
15596c658K359K353K915m913l980n053j180J1559j080q202l118M427P528j12j515
$$ -3658 -1299 1054 3969 -944 -4924 -9977 -11157 402 -678 -8880 -11998 -7571 -43 -155 -1670
15581a670k839N444J989j799L421L884j820n448L197m415r694N7N066L206n611
$$ -1670 -4509 935 2924 1125 4546 8430 6610 1162 4359 -56 -9750 -9693 -4627 -1421 -7032
15566g032K142l11K978N36o85j3016p015M498J691Q115O010j7j099p735J32j888
$$ -7032 -4890 -5201 -2223 -1687 -2372 -15388 -22403 -17905 -16214 -8099 -2089 -2106 -3205 -10940 -10808 -12696
15550a2696N056J3673m396J290m835k122L861n169m608J223J1206j131M026K362
$$ -12696 -7640 6033 1637 2927 -1908 -4030 -169 -5338 -9946 -8723 2483 1352 5378 7740
15536G740l716l379J231K365o321k014J477M687n015k838p523n797O428M992J0669
$$ 7740 4024 645 1876 4241 -2080 -4094 -2617 2070 -2945 -5783 -13306 -19103 -12675 -7683 2986
15521B986M108p684q635N809J160j4366N371J2528m38o869o54L597l143j747M466
$$ 2986 7094 -590 -9225 -3416 -2256 -16622 -11251 1277 839 -6030 -6684 -3087 -6230 -7977 -3511
15506c511Q698n712r085o9j632q81L56K339M814R521r578j1239Q479P456K998
$$ -3511 5187 -525 -9610 -9679 -11311 -12192 -11836 -9497 -4683 4838 -4740 -15979 -7500 -44 2954
15491B954j663n049j3111K009J6545L535m97J598O95o67L720j415j253p393J764
$$ 2954 1291 -3758 -16869 -14860 1685 5220 4723 6321 7016 6349 10069 8654 7401 8 1772
15476A772M544J424p528k138l112l320r007j927M785O665K31L600J1610q95M416
$$ 1772 6316 7740 212 -1926 -5038 -8358 -17365 -19292 -14507 -7842 -7611 -4011 7599 6704 11120
15461A1120p082p261j98K476n824o018O779m4m773N542P740n176k550l846K547
$$ 11120 4038 -3223 -3421 -945 -6769 -12787 -6008 -6052 -10825 -5283 2457 -2719 -5269 -9115 -6568
15446f568P784M846K758l474k861p985J976k69r855pM687P583L902k378n599n86
$$ -6568 1216 6062 8820 5346 2485 -5500 -3524 -3793 -13648 -13655 -8968 -1385 2517 139 -5460 -6046
15430f046L207K75j43Q677j422K501Q729K008j1775p689j110k909K855j897k067
$$ -6046 -2839 -2564 -2707 5970 4548 7049 15778 17786 6011 -1678 -2788 -5697 -2842 -4739 -6806
15415f806M948N198R703l386p749l309n763j279O757p14r808k904N916M582Q097
$$ -6806 -1858 3340 13043 9657 1908 -1401 -7164 -8443 -1686 -2400 -12208 -15112 -9196 -4614 3483
15400C483M564m631M561O024n945j611N15m084m468o134j0544j091K78N612R492
$$ 3483 8047 3416 7977 14001 8056 6445 6960 2876 -1592 -7726 -18270 -19361 -19083 -13471 -3979
15385c979P631k965j0524J664R383L360o032l114K265O314n374j1046j359J975
$$ -3979 3652 687 -9837 -8173 1210 4570 -1462 -4576 -2311 4003 -1371 -12417 -13776 -11801
15371a1801J082M518Q728M714q755q186n39k794Q28q19q648M739O312L706J2324
$$ -11801 -10719 -6201 2527 7241 -1514 -9700 -10239 -13033 -12205 -13024 -21672 -16933 -10621 -6915 5409
15356E409q48r154o226L049J216l690M549O330k279n493j41K134R934P7k438K768
$$ 5409 4561 -4593 -10819 -7770 -6554 -10244 -5695 635 -1644 -7137 -7278 -5144 4790 4867 2429 5197
15340E197j128q623k322l688m38J4361P710J75n047l965k487n278l196L316M35
$$ 5197 4069 -4554 -6876 -10564 -11002 3359 11069 11244 6197 2232 -255 -5533 -8729 -5413 -4978
15325d978K787o701o926P010j482j154n355q02Q892k110O420N89o853l663K376
$$ -4978 -2191 -8892 -15818 -8808 -10290 -11444 -16799 -17601 -8709 -10819 -4399 -3810 -10663 -14326 -11950
15310a1950M012P350N601j0691N648Q181k260p893n350J1295o256r057o601K934
$$ -11950 -7938 -588 5013 -5678 -30 8151 5891 -2002 -7352 3943 -2313 -11370 -17971 -15037
15296a5037N997R549l151k535j226k61j583k385O020N616N648M747N23k983j552
$$ -15037 -9040 509 -2642 -5177 -6403 -6664 -8247 -10632 -4612 1004 6652 11399 11922 8939 7387
15281G387n0O396K454j3140j1304L407m97j151l792l14N549n94m381M281J4882
$$ 7387 7337 13733 16187 3047 -8257 -4850 -5347 -6498 -10290 -10604 -5055 -5649 -10030 -5749 9133
15266I133R59m096l195O678L886J66o569n223j908n531O376M930l288K671l099
$$ 9133 10092 5996 2801 9479 13365 13531 6962 1739 -169 -5700 676 5606 2318 4989 1890
15251A890j100l049j0852N362j941l349J2906N624n870N257Q116J285n507Q821
$$ 1890 790 -2259 -13111 -7749 -9690 -13039 -133 5491 -379 4878 12994 14279 8772 17593
15237A7593n66r51K212o873o465K43n197j702l648j588k990P857O479j413q64
$$ 17593 17027 16076 18288 11415 4950 5193 -4 -1706 -5354 -6942 -9932 -2075 4404 2991 2127
15222B127J1880J348p409q506k31P530Q720l715j0323p919N239J0121R30J908
$$ 2127 14007 15355 7946 -560 -791 6739 15459 11744 1421 -6498 -1259 8862 9792 11700
15208A1700J276o936j0948m855N010L396l741L411J641M282P171N873n123j0731
$$ 11700 12976 6040 -4908 -9763 -4753 -1357 -5098 -1687 -46 4236 11407 17280 12157 1426
15194A426k588L020K494k735o069m521k01k336J382m735J557L079M399o022M364
$$ 1426 -1162 1858 4352 1617 -4452 -8973 -9174 -11510 -10128 -14863 -13306 -10227 -5828 -11850 -7486
15179g486N867n475p072q571l03J2239K62J058O911m746n503J179J0587K815n086
$$ -7486 -1619 -7094 -14166 -22737 -23040 -10801 -10539 -9481 -2570 -7316 -12819 -11640 -1053 1762 -3324
15164c324l248L595K855P492P208m990r056r831m587J281o338K381L006J3445
$$ -3324 -6572 -2977 -122 7370 14578 9588 532 -9299 -13886 -12605 -18943 -16562 -13556 -111
15150a11K220p397j0168P635K608j919L342R486L229J408n737J228K453o094o486
$$ -111 2109 -5288 -15456 -7821 -5213 -7132 -3790 5696 8925 10333 4596 5824 8277 2183 -4303
15135d303N251l521p51K5J390J685j648P455M839k747l401n385o554J628M251
$$ -4303 948 -2573 -3324 -3299 -1909 -224 -1872 5583 10422 7675 4274 -1111 -7665 -6037 -1786
15120a786M075r864n170K286O204N412l845m599O720J2300q204q850j58J611J581
$$ -1786 2289 -7575 -12745 -10459 -4255 1157 -2688 -7287 -567 11733 3529 -5321 -5479 -3868 -2287
15105b287K026q039o802J258N615J0193p129j3007J811Q443l568M78O412K087
$$ -2287 -261 -8300 -15102 -13844 -8229 1964 -5165 -18172 -16361 -7918 -11486 -11008 -4596 -2509
15091b509j0618o797R113J3824p514n289L792J0134L176o296m995o170J133J4280
$$ -2509 -13127 -19924 -10811 3013 -4501 -9790 -5998 4136 7312 1016 -3979 -10149 -9016 5264
15077E264Q553k615l827K561k508n326m880j43n832R60q7J97N549N629k368q305
$$ 5264 13817 11202 7375 9936 7428 2102 -2778 -2921 -8753 -7793 -7880 -7683 -2134 3495 1127 -7178
15061g178n74k084m846J378m487J209J0766L854p26m42k546L426R343p185L130
$$ -7178 -7752 -9836 -14682 -13304 -17791 -16582 -5816 -1962 -2688 -3130 -5676 -2250 7093 -92 3038
15046C038L752j3769k679k268Q004J1386n002J152L415N966m801j0417k526K020
$$ 3038 6790 -6979 -9658 -11926 -3922 7464 2462 3614 7029 12995 8194 -2223 -4749 -2729
15032b729o41O484N363j035j4183o449Q723L578J683j0369p386R322m798J957
$$ -2729 -3370 3114 8477 7442 -6741 -13190 -4467 -889 794 -9575 -16961 -7639 -12437 -10480
15018a0480L093N345J059m244M826j190O17k193L90O739j695j1646N96Q40M358
$$ -10480 -7387 -2042 -983 -5227 -401 -1591 -974 -3167 -2777 3962 2267 -9379 -8783 -7943 -3585
15003c585M670j213j058k450k132m516N089M038l254p368J4719O554p419j2110
$$ -3585 1085 -128 -1186 -3636 -5768 -10284 -5195 -1157 -4411 -11779 2940 9494 2075 -10035
14989a0035q760N547J978L213j255L138N046N854K047o176j205l459j992N62r501
$$ -10035 -18795 -13248 -11270 -8057 -9312 -6174 -1128 4726 6773 597 -608 -4067 -6059 -5497 -14998
14974a4998J115N298j737N266P595O115k849L31L100j989n681m970M338J529o818
$$ -14998 -13883 -8585 -10322 -5056 2539 8654 5805 6136 9236 7247 1566 -3404 934 2463 -4355
14959d355K739k741R098M17j2401O04J1075O848r304r027m647J1069M392o048
$$ -4355 -1616 -4357 4741 5158 -7243 -6639 4436 11284 1980 -7047 -11694 -625 3767 -2281
14945b281m259r71J984Q75K802l204R8k398M355j434m351j654P192P050K160K021
$$ -2281 -6540 -7511 -5527 -4652 -1850 -5054 -4956 -7354 -2999 -4433 -8784 -10438 -3246 3804 5964 7985
14929G985k278l915p39R50n242j907n72K097L760M677O382J609j6124p968K565
$$ 7985 5707 1792 1053 2003 -3239 -5146 -5718 -3621 139 4816 11198 12807 -3317 -11285 -8720
14914h720Q51J630L977p378l563n041k264M095M636J908J0419m110L516J0518
$$ -8720 -7869 -6239 -2262 -9640 -13203 -18244 -20508 -16413 -11777 -9869 550 -3560 -44 10474
14900A0474L708k986p86l321k621M393k347j0608j105J0532N592m352o358P94
$$ 10474 14182 11196 10410 7089 4468 8861 6514 -4094 -5199 5333 10925 6573 215 1009
14886A009Q9l098O120l177m027P038m194J153j932m829m3J3637O788n865j831
$$ 1009 1098 -2000 4120 943 -3084 3954 -240 913 -1019 -5848 -5891 7746 14534 8669 6838
14871F838o10j532l58l155p026o052m769l482J1234Q156p899j027L756j488K721
$$ 6838 6228 4696 4338 1183 -5843 -11895 -16664 -20146 -8912 -756 -8655 -9682 -5926 -7414 -4693
14856d693O311l157m319k374J1512j369k335j3154m611K864M745L061m154J697
$$ -4693 1618 -1539 -5858 -8232 3280 1911 -424 -13578 -18189 -15325 -10580 -7519 -11673 -9976
14842i976O394M678l717n533q375m261R576J1730j074K72j805k630P945R346l710
$$ -9976 -3582 1096 -2621 -8154 -16529 -20790 -11214 516 -558 -286 -2091 -4721 3224 12570 8860
14827H860o619q140j0288K597M109O40J538J85J906Q074k604r352k078p74L414
$$ 8860 2241 -5899 -16187 -13590 -9481 -8841 -7303 -7118 -5212 2862 258 -9094 -11172 -11946 -8532
14812h532R54j957k003J957J188l70p3P730o929J656L004N933J139l840K019N861
$$ -8532 -7578 -9535 -11538 -9581 -8393 -8763 -8836 -1106 -8035 -6379 -3375 2558 3697 -143 1876 7737
14796G737n553j2455o724N167K746k246K346Q062j459j396N87l178l44K416j908
$$ 7737 2184 -10271 -16995 -11828 -9082 -11328 -8982 -920 -2379 -3775 -3188 -6366 -6710 -4294 -6202
14781f202k38l198K533J6475Q501n668j0907p662M841R227l205q239l022K591
$$ -6202 -6440 -9638 -7105 9370 17871 12203 1296 -6366 -1525 7702 4497 -3742 -6764 -4173
14767d173L434n739k752K541N000j553n912p336j945M01M825J0063N105m414m923
$$ -4173 -739 -6478 -9230 -6689 -1689 -3242 -9154 -16490 -18435 -18034 -13209 -3146 1959 -2455 -7378
14752g378M831O340n084q001O39L507M899k67K658J666j357k117L213J335N177
$$ -7378 -2547 3793 -1291 -9292 -8653 -5146 -247 -514 2144 3810 2453 336 3549 4884 10061
14737A0061M704l95j198q1m007j591j9m307j987Q93J210k109n657n774Q324N212
$$ 10061 14765 14370 13172 13091 9084 7493 7474 3167 1180 2073 3283 1174 -4483 -10257 -1933 3279
14721C279j497O8m106Q102N614k188n397k433J833m798J110L239n504n323K82
$$ 3279 1782 1850 -2256 5846 11460 9272 3875 1442 3275 -1523 -413 2826 -2678 -8001 -7719
14706g719R831Q252j017k114k146r589L957j73n804L268J820P108k308l407J634
$$ -7719 2112 10364 9347 7233 5087 -4502 -545 -718 -6522 -3254 -1434 5674 3366 -41 1593
14691A593q272l484m521k475J867M594J880Q647o893l365k36O883Q273m233l685
$$ 1593 -6679 -10163 -14684 -17159 -15292 -10698 -8818 -171 -7064 -10429 -10665 -3782 4491 258 -3427
14676c427m455o131R32Q151O271m114L914O62k936J008J281l060J3107q380r378
$$ -3427 -7882 -14013 -13081 -4930 1341 -2773 1141 1803 -1133 -125 1156 -1904 11203 2823 -6555
14661f555L12l419o66O003j57j540L18L11l032K064Q108J3979M235K95p619n863
$$ -6555 -6243 -9662 -10328 -4325 -4482 -6022 -5704 -5393 -8425 -6361 1747 15726 19961 20256 12637 6774
14645F774J014M965R65P36j557L43J193k7K381q824o837K314O06O672P049n101
$$ 6774 7788 12753 13718 14454 12897 13240 14433 14406 16787 7963 1126 3440 4046 10718 17767 12666
14629A2666j2715p600n668P90L602P710M62m050k974j35j0001k140P579L083J2601
$$ 12666 -49 -7649 -13317 -12527 -8925 -1215 -753 -4803 -7777 -7912 -17913 -20053 -12474 -9391 3210
14614C210K000q837r29j814j1965J974k949P36k033M942J6196M451p0n09m939
$$ 3210 5210 -3627 -4556 -6370 -18335 -16361 -19310 -18574 -20607 -15665 531 4982 4912 4403 -536
14599e36n21l986K771L736k698K852O355J0093p6J866L364o684r998m825l5q46
$$ -536 -1057 -5043 -2272 1464 -1234 1618 7973 18066 17990 19856 23220 16536 6538 1713 1678 832
14583H32L571J0492j882N560J230j1716k910M388m11n479l017p074R10J156M97
$$ 832 4403 14895 13013 18573 19803 8087 5177 9565 9154 3675 658 -6416 -5506 -4350 -3853
14568c853l779K65o584N333L874n445l932m357Q999L817n300q005N12J3021J1261
$$ -3853 -7632 -7367 -13951 -8618 -4744 -10189 -14121 -18478 -9479 -5662 -10962 -18967 -18455 -5434 5827
14553E827M810o093O478K371O11l968p876J917r755n476Q69L74p47L906n543l996
$$ 5827 10637 4544 11022 13393 14004 10036 2160 4077 -5678 -11154 -10285 -9911 -10658 -6752 -12295 -16291
14537a6291M565k855M268P663m95O081l897l434J821m698o766Q318P731n548q22
$$ -16291 -11726 -14581 -10313 -2650 -3145 2936 -961 -4395 -2574 -7272 -14038 -5720 2011 -3537 -4359
14522d359N712K697j300p818J823j048n027N420K12R97L394K324m615o813P584
$$ -4359 1353 4050 2750 -5068 -3245 -4293 -9320 -3900 -3688 -2691 703 3027 -1588 -8401 -817
14507h17N118n004O46j4234j3071J0946M334J358J0541O727r502L46q55l594r59
$$ -817 4301 -703 -57 -14291 -27362 -16416 -12082 -10724 -183 6544 -2958 -2612 -3467 -7061 -8020
14492h020R032O658l523k215o935J496K354L214m240n660O942j896m159n08l973
$$ -8020 1012 7670 4147 1932 -5003 -3507 -1153 2061 -2179 -7839 -897 -2793 -6952 -7460 -11433
14477a1433l20N752L365m560K32J1772M849N67n59l299r179N338L43j90R458J241
$$ -11433 -11753 -6001 -2636 -7196 -6964 4808 9657 10224 9665 6366 -2813 2525 2868 2678 12136 13377
14461A3377k846p57N23J167o431L019j644o571J609M846O084q083k400j624o150
$$ 13377 10531 9774 10297 11464 5033 8052 6408 -163 1446 6292 12376 4293 1893 269 -5881
14446e881n122j213N612J0278J794K475k357p069o293K707O798k920r387o857
$$ -5881 -11003 -12216 -6604 3674 5468 7943 5586 -1483 -7776 -5069 1729 -1191 -10578 -17435
14432a7435K268N530Q912k701J609p299K933J313l471K311N262J318M685k55o523
$$ -17435 -15167 -9637 -725 -3426 -1817 -9116 -6183 -4870 -8341 -6030 -768 550 5235 4980 -1543
14417a543r926m74Q185M682l668j4953m872N68J066L275Q787P187K837M403j161
$$ -1543 -11469 -11943 -3758 924 -2744 -17697 -22569 -22001 -20935 -17660 -8873 -1686 1151 5554 4393
14402D393M111j205j658m320k589J723P34j0103M002K301k0615n275R930M007
$$ 4393 8504 7299 5641 1321 -1268 455 1189 -8914 -4912 -2611 -23226 -28501 -18571 -14564
14388a4564l835M278j686k932RJ2863L979L827k712k672l572p854o775L794Q635
$$ -14564 -18399 -14121 -15807 -18739 -18730 -5867 -1888 1939 -773 -3445 -7017 -14871 -21646 -17852 -9217
14373i217l43n94P300M38m715m563P709R122O689q381j3376j643Q151P5o177j134
$$ -9217 -9560 -10154 -2854 -2416 -7131 -11694 -3985 5137 11826 3445 -9931 -11574 -3423 -3348 -9525 -10659
14357a0659M142N530R047O73j0885J954O9n707j1330j815M624R228R169l629Q45
$$ -10659 -6517 -987 8060 8733 -2152 -198 -129 -5836 -17166 -18981 -14357 -5129 4040 411 1256
14342A256L431o826J3K862q350L229l533J137L756j574q468m201R266k65j394
$$ 1256 4687 -2139 -2126 736 -7614 -4385 -7918 -6781 -3025 -4599 -13067 -17268 -8002 -8267 -9661
14327i661L050K505N389l690n283K748J0241Q29n487J689J541r77L307j650k231
$$ -9661 -6611 -4106 1283 -2407 -7690 -4942 5299 6128 641 2330 3871 2894 6201 4551 2320
14312B320J2434P833j1175p879p97M147j462P449q306r550j42L548O595k644k045
$$ 2320 14754 22587 11412 3533 2736 6883 5421 12870 4564 -4986 -5128 -1580 5015 2371 326
14297C26Q428o42m019q278j1359l55J3914O845M17m217l081L20K989k222P600
$$ 326 8754 8112 4093 -4185 -15544 -15899 -1985 4860 5277 1060 -2021 -1701 1288 -934 6666
14282F666L608m166K529l759N077k57M65j0038p827K083L963O94n355O25l972
$$ 6666 10274 6108 8637 4878 9955 9698 10163 125 -7702 -5619 -1656 -962 -6317 -5692 -9664
14267i664R846O530p354O08k164J952n314r59j702M097M112r943l75K563K404
$$ -9664 182 6712 -642 -34 -2198 -246 -5560 -6519 -8221 -4124 -12 -9955 -10330 -7767 -5363
14252e363K672j14K446o462r305L479L773lO921o313K026L844J637k897n52Q839
$$ -5363 -2691 -2805 -359 -6821 -16126 -12647 -8874 -8877 -1956 -8269 -6243 -2399 -762 -3659 -4211 4628
14236D628k371M409O986j0312m907j619k79L887K534N726J04j0121o423p589K99
$$ 4628 2257 6666 13652 3340 -1567 -3186 -3465 422 2956 8682 8786 -1335 -7758 -15347 -15048
14221a5048N905L818K140N597m488q09L873p631l756N431Q866J3286k237q559
$$ -15048 -9143 -5325 -3185 2412 -2076 -2885 988 -6643 -10399 -4968 3898 17184 14947 6388
14207F388j0683j800l642p88k08M336l474J098p82J1327R090J703j664m896k090
$$ 6388 -4295 -6095 -9737 -10525 -10733 -6397 -9871 -8773 -9555 1772 10862 12565 10901 6005 3915
14192C915k221r714L926p152p225O028J0750O819M506o605o332Q563Q441l985
$$ 3915 1694 -8020 -4094 -11246 -18471 -12443 -1693 5126 9632 3027 -3305 5258 13699 9714
14178I714K27j544j655j8503r805R974J2387K707J1815J297K353j1701q880J731
$$ 9714 9941 8397 6742 -11761 -21566 -11592 795 3502 15317 16614 18967 7266 -1614 117
14164A17N921K670n438L737M391o184j0467r125J651J3583M628j482K285l279
$$ 117 6038 8708 3270 7007 11398 5214 -5253 -14378 -12727 856 5484 4002 6287 3008
14150C008K186k948r037k762m014K109J0749N897k380m086O9o557J880K549P024
$$ 3008 5194 2246 -6791 -9553 -13567 -11458 -709 5188 2808 -1278 -1209 -7766 -5886 -3337 3687
14135C687r135K045N737l804l053Q216M632r575o505j1188L067J2460J5842O5
$$ 3687 -5448 -3403 2334 -1470 -4523 3693 8325 -1250 -7755 -18943 -15876 -3416 12426 12491
14121A2491k695J083m240J2388k510k117r351j3634n73K895R377L587j1871L142
$$ 12491 9796 10879 6639 19027 16517 14400 5049 -8585 -9158 -6263 3114 6701 -5170 -2028
14107b028K804j660l153J0943m254j1351o24J953N977O285Q329Q33j2650M42O68
$$ -2028 776 -884 -4037 6906 2652 -8699 -9323 -7370 -1393 4892 13221 14054 1404 1846 2514
14092B514P32p860n280M365Q368N86j749j891M833J652j942L4L354j670p846L370
$$ 2514 3246 -4614 -9894 -5529 2839 3425 1676 -215 4618 6270 4328 4362 7716 6046 -1800 1570
14076A570J940J822k054L051P550j297m4M194k985R15K334l950j0176m647o543
$$ 1570 3510 5332 3278 6329 13879 12582 12538 16732 13747 14662 16996 13046 2870 -1777 -8320
14061h320k2J293j57m635L118K360j220O540j711O9j70K181M920O97j624k27p34
$$ -8320 -8342 -7049 -7206 -11841 -8723 -6363 -7583 -1043 -2754 -2685 -2855 -674 4246 4943 3319 3092 2358
14044B358r285L679J0093l059l648L167m300o50k24j146n62K401J927m141N067
$$ 2358 -6927 -3248 6845 3786 138 3305 -995 -1645 -1869 -3015 -3577 -1176 751 -3390 1677
14029A677r86o894k866N94P216n099K644m16j494M570J536M345k426j404N125
$$ 1677 691 -6203 -9069 -8475 -1259 -6358 -3714 -4130 -5624 -1054 482 4827 2401 997 6122
14014F122n373j1820J421O058n267m464J1780L060m42K446j840K017j648P71q759
$$ 6122 749 -11071 -9650 -3592 -8859 -13323 -1543 1517 1075 3521 1681 3698 2050 2821 -5938
13999e938J848J3544P2q720m284P494K554K56l300q391l101M131K978J1616M132
$$ -5938 -4090 9454 9526 806 -3478 4016 6570 6826 3526 -4865 -7966 -3835 -857 10759 14891
13984A4891N478j511n339l027o732p91P98k606k715L421j726J1513M997k872n696
$$ 14891 20369 18858 13519 10492 3760 2969 3767 1161 -1554 1867 141 11654 16651 13779 8083
13969H083j480m039k389J031K029m163q566K146O393Q48j562J351k201K15M4k247
$$ 8083 6603 2564 175 1206 3235 -928 -9494 -7348 -955 -107 -1669 -318 -2519 -2304 -2260 -4507
13953d507o9R91M409m283K293J915q873o88M501j503J501L404j946K059K267j468
$$ -4507 -4576 -3585 824 -3459 -1166 749 -8124 -8812 -4311 -5814 -4313 -909 -2855 -796 1471 3
13937Cp577n711O693K204L735L412N5J161k830J218l99K743j0196K451L610j097
$$ 3 -7574 -13285 -6592 -4388 -653 2759 2814 3975 1145 2363 1964 4707 -5489 -3038 572 -525
13921e25j4020k01N572K559R478l241j983P649k669J728n133k665L82J0595N182
$$ -525 -14545 -14746 -9174 -6615 2863 -378 -2361 5288 2619 4347 -786 -3451 -3069 7526 12708
13906A2708l556o292m610N569K660p908K688K304L318L028o78N58k317p222O24
$$ 12708 9152 2860 -1750 3819 6479 -1429 1259 3563 6881 9909 9231 9789 7472 250 874
13891H74J1122q9o575r74J378L75N537j801o230k944J1M087M629n31k759J1465
$$ 874 11996 11907 5332 4358 5736 6111 11648 9847 3617 673 684 4771 9400 8869 6110 17575
13875A7575K227j274o86K537p413q537j4985Q75M451j659J0125J0065K441P41
$$ 17575 19802 18528 17842 20379 12966 4429 -10556 -9681 -5230 -6889 3236 13301 15742 16483
13861A6483m812o989k533o450p949P270L018q995j339l621K490K447J368J578
$$ 16483 11671 4682 2149 -4301 -12250 -4980 -1962 -10957 -12296 -15917 -13427 -10980 -9612 -8034
13847h034N603J801l651l465J023k669L707n48p380O987J3422Q8m342K559L00
$$ -8034 -2431 -630 -4281 -7746 -6723 -9392 -5685 -6233 -13613 -6626 6796 6884 2542 5101 5401
13832E401p756n167P147l230m265O576L002L356O552n733k198N34M077n064P50
$$ 5401 -2355 -7522 -375 -3605 -7870 -1294 1708 5064 11616 5883 3685 4219 8296 3232 3982
13817C982q330n654l286j681K557N787N223o263N238J695q096K793k092k426l700
$$ 3982 -4348 -10002 -13288 -14969 -12412 -6625 -1402 -7665 -2427 -732 -8828 -6035 -8127 -10553 -14253
13802a4253L998O79j108O525Q555O594k787j687O04o224j2134j965J3691K718
$$ -14253 -10255 -9576 -10684 -4159 4396 10990 8203 6516 7120 896 -11238 -13203 488 3206
13788C206n44k029K001m244P201l637n788n615o70J355L004o943n154Q682J3199
$$ 3206 2662 633 2634 -1610 5591 1954 -3834 -9449 -10119 -8764 -5760 -12703 -17857 -9175 4024
13773D024O0M504K191N97n251O18N349k828p882K255j851m720m510K228J768n311
$$ 4024 4084 8588 10779 11376 6125 6743 12092 9264 1382 3637 1786 -2934 -7444 -5216 -3448 -8759
13757h759M796P260J804O2K341j24l896J964M065k520L152L116m173m542n701
$$ -8759 -3963 3297 5101 5163 7504 7380 3484 5448 9513 6993 10145 13261 9088 4546 -1155
13742a155M7k113j178M269j448L947J474J9n479J849N546k949j249R70j149Q40
$$ -1155 -1108 -3221 -4399 -130 -1578 2369 3843 3862 -1617 232 5778 2829 1580 2550 1401 2241
13726B241J131o121m0Q802Q570k682K827j6p140p705j0470J971J6840M106n362
$$ 2241 3372 -2749 -2789 6013 14583 11901 14728 14712 7572 -133 -10603 -8632 8208 12314 6952
13711F952j1886m706M994p353K788N265j461L919P376k581l623l430J041j335
$$ 6952 -4934 -9640 -4646 -11999 -9211 -3946 -5407 -1488 5888 3307 -316 -3746 -2705 -4040
13697d040N449O214l115m194R927M430R674P305Q003J0850O455l64p042m030p251
$$ -4040 1409 7623 4508 314 10241 14671 24345 31650 39653 50503 56958 56594 49552 45522 38271
13682C8271j0339o121q896O147N717p697j04k138L449l05p899m762J052n101m49
$$ 38271 27932 21811 12915 19062 24779 17082 16978 14840 18289 17984 10085 5323 6375 1274 825
13667H25K906P71J995R84p61M119M612l055j215l453M75Q589n560p28R328P17
$$ 825 3731 4502 6497 7481 6720 10839 15451 12396 11181 7728 8203 16792 11232 10504 19832 20549
13651B0549l104q18o649p589l712K807J2J009O748P296O370j940q50l755l292
$$ 20549 17445 16627 9978 2389 -1323 1484 1496 2505 9253 16549 22919 20979 20129 16374 13082
13636A3082o452j833J359p69k339J514L467L836l618j487o532l913J0025l07l991
$$ 13082 6630 4797 6156 5387 3048 4562 8029 11865 8247 6760 228 -3685 6340 6033 2042
13621B042m073O587n588L792K712p309M329J0050j389o376J134K813L93K764K420
$$ 2042 -2031 4556 -1032 2760 5472 -1837 2492 12542 11153 4777 5911 8724 9117 11881 14301
13606A4301l609m761K779P311l051k785L8J404n41L36l701n066l103j836O359
$$ 14301 10692 5931 8710 16021 12970 10185 10223 11627 11086 11422 7721 2655 -448 -2284 4075
13591D075n646l391N855L659O13K239l054K829J266j626K24n95Q5l430m530J586
$$ 4075 -1571 -4962 893 4552 5165 7404 4350 7179 8445 6819 7043 6448 6533 3103 -1427 159
13575A59j613M21j095L302P438q441o145l063p37M112l184L919N527J3681P394
$$ 159 -1454 -1033 -2128 1174 8612 171 -5974 -9037 -9774 -5662 -8846 -4927 600 14281 21675
13560B1675m674r921m097n39r817K013Q220M669J0897m465p217m277N7k758K256
$$ 21675 17001 7080 2983 2444 -7373 -5360 2860 7529 18426 13961 6744 2467 2524 -234 2022
13545B022k796p538j394J0792Q215j520k116q576q76l590k061p532l719R277N236
$$ 2022 -774 -8312 -9706 1086 9301 7781 5665 -2911 -3787 -7377 -9438 -16970 -20689 -11412 -6176
13530f176L263l943K26K545L137K661K236M468o004k129l774N46J63j408k349
$$ -6176 -2913 -6856 -6630 -4085 -948 1713 3949 8417 2413 284 -3490 -2944 -2781 -4189 -6538
13515f538k094K652P798P186J226r367Q41o967m958N003O36K158n843r560J0338
$$ -6538 -8632 -5980 1818 9004 10230 863 1704 -5263 -10221 -5218 -4582 -2424 -8267 -17827 -7489
13500g489O451r16M184R47j0406q225M818M956m450L851J156j994M966O660O67
$$ -7489 -1038 -1954 2230 3177 -7229 -15454 -10636 -5680 -10130 -6279 -5123 -7117 -2151 4509 5176
13485E176O141p307j1558M719J4282O522O629L09l375O03K428k338j0105m854
$$ 5176 11317 4010 -7548 -2829 11453 17975 24604 24913 21538 22141 24569 22231 12126 7272
13471G272n145r650Q100P962o068k244J96L821n931j087N971J389l108n088j223
$$ 7272 2127 -7523 577 8539 2471 227 423 4244 -1687 -2774 3197 4586 1478 -3610 -4833
13456d833O136K920J100l526k355N460M784M564M749p792p611p85L486Q454R208
$$ -4833 1303 4223 5323 1797 -558 4902 9686 14250 18999 11207 3596 2811 6297 14751 23959
13441B3959j318j7523N121O400L552m971l296N73m860o896j711k806K415J947
$$ 23959 22641 5118 10239 16639 20191 15220 11924 12497 7637 741 -970 -3776 -1361 586
13427E86k810K786R26N144J228J523j685m488M174n45O49L24k426L96K40J796
$$ 586 -2224 562 1488 6632 7860 9383 7698 3210 7384 6839 7488 7812 5386 5782 6022 7818
13411G818J317k211q071j0074M522P893m40o269M485M290J049K800L668M665j0516
$$ 7818 9135 6924 -1147 -11221 -6699 1194 754 -5515 -1030 3260 4309 7109 10777 15442 4926
13396D926j1132J173l688J276O886L807P204L108p221p435J431K124J0062j70
$$ 4926 -6206 -5033 -8721 -7445 -559 3248 10452 13560 6339 -1096 335 2459 12521 12351
13382A2351p236k172J74p69m299p431l594L176m456M846L357L773K391n195K302
$$ 12351 5115 2943 3117 2348 -1951 -9382 -12976 -9800 -14256 -9410 -6053 -2280 111 -5084 -2782
13367b782M508K806M694N481j862o877O065o97m572m673J043P909j675q144o188
$$ -2782 1726 4532 9226 14707 12845 5968 12033 11336 6764 2091 3134 11043 9368 1224 -4964
13352d964m201J86J1045L558j5262q402R946R680N679K613o855k880K13R046M267
$$ -4964 -9165 -8979 2066 5624 -9638 -18040 -8094 1586 7265 9878 3023 143 356 9402 13669
13337A3669n748o660p442Q21N240J3718K440r394O404k010l025J1916j576p348
$$ 13669 7921 1261 -6181 -5360 -120 13598 16038 6644 13048 11038 8013 19929 18353 11005
13323A1005K832k534M6L765r032p053N398L160m195l06M82O833O478o404M308
$$ 11005 13837 11303 11349 15114 6082 -971 4427 7587 3392 3086 3568 10401 16879 10475 14783
13308A4783n621j804l08R448P897L678n624k0882j2204Q173Q256p169L346M834
$$ 14783 9162 7358 7050 16498 24395 28073 22449 1567 -10637 -2464 5792 -1377 1969 6803
13294F803Q74k656l698p9M299J145p34K977l942j173Q976l313n002m300N413J263
$$ 6803 7677 5021 1323 1244 5543 6688 5954 8931 4989 3816 12792 9479 4477 177 5590 6853
13278F853l884K199R635K513M97j428q089n18P630M531p979k921M98k895K229
$$ 6853 2969 5168 14803 17316 17813 16385 8296 7778 15408 19939 11960 9039 9537 6642 8871
13263H871k537J561l07q764l338j850k122l356o29N088k500J010R475O835m33
$$ 8871 6334 7895 7588 -1176 -4514 -6364 -8486 -11842 -12471 -7383 -9883 -8873 602 7437 7004
13248G004j847R12l999o90M316J2390M774j1457l488N306J248j1111r955q603
$$ 7004 5157 6069 2070 1380 5696 18086 22860 11403 7915 13221 14469 3358 -6597 -15200
13234a5200k820J1774J0371M142K831k99l888l486o751m59O677J4386m834p109
$$ -15200 -18020 -6246 4125 8267 11098 10799 6911 3425 -3326 -3785 2892 17278 12444 5335
13220E335N626L166Q821n05q14L723j2875j910N169l574n489l497O74M304p38
$$ 5335 10961 14127 22948 22443 21629 25352 12477 10567 15736 12162 6673 3176 3850 8154 7416
13205G416P030J603p393l755p496n81n61L902p19m001K762L512j574k107N871
$$ 7416 14446 16049 8656 4901 -2595 -3176 -3737 165 -554 -4555 -1793 1719 145 -1962 3909
13190C909P106l055q304P05Q172N953l402p867L169j446q417K866O495J0857M052
$$ 3909 11015 7960 -344 361 8533 14486 11084 3217 6386 4940 -3477 -611 5884 16741 20793
13175B0793p578l114k34k124Q32K974J076n892L296m52j2003j1388R05L316P782
$$ 20793 13215 10101 9867 7743 8575 11549 12625 6733 10029 9577 -2426 -13814 -12909 -9593 -1811
13160a811J917L178o25J755P169L983L715q650q459j1074L396P23l100k766O083
$$ -1811 106 3284 2659 4414 11583 15566 19281 10631 2172 -8902 -5506 -4783 -7883 -10649 -4566
13145d566Q070k816P84J355J6l964n782N265K807M503Q057K742p121m333L861
$$ -4566 3504 688 1472 2827 2843 -1121 -6903 -1638 1169 5672 13729 16471 9350 5017 8878
13130H878J25m53n516k393k129p11R570R248j280j568P859M652q24l773n210m98
$$ 8878 9003 8550 3034 641 -1488 -2199 7371 16619 15339 13771 21630 26282 25458 21685 16475 15977
13114A5977l169j695k196R38O664P74O39k56q851k261N438q41K089K040J484o532
$$ 15977 12808 11113 8917 9855 16519 17293 17932 17676 8825 6564 12002 11161 13250 15290 16774 10242
13098A0242l595M346P317j314N7J2607k41j1011j2002K547K768n75q63J355O67
$$ 10242 6647 10993 18310 16996 17053 29660 29419 18408 6406 8953 11721 11146 10283 11638 12305
13083A2305P958k585m891j148o654m075N740O408L930n017k113M45p9j3155N929
$$ 12305 20263 17678 12787 11639 4985 910 6650 13058 16988 11971 9858 10303 10224 -2931 2998
13068B998K465j001L140n156L883P390l350j2787q757P51J899O411o766m595J0883
$$ 2998 5463 4462 7602 2446 6329 13719 10369 -2418 -11175 -10424 -8525 -2114 -8880 -13475 -2592
13053b592Q934K917M083J388P633K818m002Q60m631j965J114K394l413k024L242
$$ -2592 6342 9259 13342 14730 22363 25181 21179 22039 17408 15443 16557 18951 15538 13514 16756
13038A6756l012j0859j948k192O067j786J0412l346n357q150K334J1277P326o485
$$ 16756 13744 2885 937 -1255 4812 3026 13438 10092 4735 -3415 -1081 10196 17522 11037
13024A1037j802o026m869J0729N255r450Q508R468j0138k718J389j802k295M204
$$ 11037 9235 3209 -1660 9069 14324 4874 13382 22850 12712 9994 11383 9581 7286 11490
13010A1490J0826n410j1813P167n629n840p830r18P569J428N688O102j830k34
$$ 11490 22316 16906 5093 12260 6631 791 -7039 -7957 -388 1040 6728 12830 11000 10766
12996A0766m263k582K625P95M878n427l286L139l861L827J1614J2191j395n624
$$ 10766 6503 3921 6546 7341 12219 6792 3506 6645 2784 6611 18225 30416 29021 23397
12982B3397o428l773O41k136p16l554K08l753j820J158R894Q616n699n252M133
$$ 23397 16969 13196 13837 11701 10985 7431 7639 3886 2066 3224 13118 21734 16035 10783 14916
12967A4916k187o063k457L092K990N86k1m533k793M290O779N780J317l468j0416
$$ 14916 12729 6666 4209 7301 10291 10877 10856 6323 3530 7820 14599 20379 21696 18228 7812
12952G812l573R070j099q070K145k104l609L655m236p048N312R597K892n30J704
$$ 7812 4239 13309 12210 4140 6285 4181 572 4227 -9 -7057 -1745 7852 10744 10214 11918
12937A1918m950j025L075K673l421j188k332J485Q721O498L640j591j3572o069
$$ 11918 6968 5943 9018 11691 8270 7082 4750 6235 14956 21454 25094 23503 9931 3862
12923C862M375J4052o89k278q921M38k069N775l74L147L917n358k940j651p36
$$ 3862 8237 22289 21600 19322 10401 10839 8770 14545 14171 17318 21235 15877 12937 11286 10550
12908A0550p3k805j1669K72M322J614L386L929O07n289J185L951j768j933r423
$$ 10550 10477 7672 -3997 -3725 597 2211 5597 9526 10133 4844 6029 9980 8212 6279 -3144
12893c144o835N082l277n254J5143O702j372M660P424q504q54L019K319p38l633
$$ -3144 -9979 -4897 -8174 -13428 1715 8417 7045 11705 19129 10625 9771 12790 15109 14371 10738
12878A0738O17m56l445O306K529o63p892J086O238m539J612Q940O910K502j0338
$$ 10738 11355 10899 7454 13760 16289 15626 7734 8820 15058 10519 12131 21071 27981 30483 20145
12863B0145j0909q772j838L837J376K94J031Q24l754p14P338O639q07q995r524
$$ 20145 9236 464 -1374 2463 3839 4133 5164 5988 2234 1520 8858 15497 14690 5695 -3829
12848c829K899J3783P019m633m181L465j370n418r791J2906J1965k916p470l324
$$ -3829 -930 12853 19872 15239 11058 14523 13153 7735 -2056 10850 22815 19899 12429 9105
12834I105J164m590M67j1588N517N121L338k764Q50J453r37O629L525l982N09
$$ 9105 10269 5679 6146 -5442 75 5196 8534 5770 6620 8073 7136 13765 17290 13308 13817
12819A3817p276k137J932J1886P599Q157K554j7830l569K066q92M674j795o831
$$ 13817 6541 4404 6336 18222 25821 33978 36532 18702 15133 17199 16307 20981 19186 12355
12805A2355l369K566Q014O627n56N86K310O321L593o788n64q035n557K00J0332
$$ 12355 8986 11552 19566 26193 25637 26223 28533 34854 38447 31659 31095 23060 17503 17703 28035
12790B8035J295n663o829q953P415l83J1326N294l546j3883l835R935l322m286
$$ 28035 29330 23667 16838 7885 15300 14917 26243 31537 27991 14108 10273 20208 16886 12600
12776A2600J732n610M317m78M249l716N904k308K617o97P18o013M186L054o146
$$ 12600 14332 8722 13039 12561 16810 13094 18998 16690 19307 18610 19328 13315 17501 20555 14409
12761A4409p944L171L68N835Q917n054K250L696J362m437o127M289p625l206J091
$$ 14409 6465 9636 10004 15839 24756 19702 21952 25648 27010 22573 16446 20735 13110 9904 10995
12746A0995N773J866m724J634O092N402o178o363N025M29R488L878l809j220P358
$$ 10995 16768 18634 13910 15544 21636 27038 20860 14497 19522 19951 29439 33317 29508 28288 35646
12731C5646r910j2012M262k644O272q069l672j027M634j253k967l300J55K494
$$ 35646 25736 13724 17986 15342 21614 13545 9873 8846 13480 12227 9260 5960 6115 8609
12717H609N763J1927k358m959j68J783k27M030o243m852r055o971O472R483P709
$$ 8609 14372 26299 23941 18982 18814 20597 20370 24400 18157 13305 4250 -2721 3751 13234 20943
12702B0943k363K970r38k517m60J604M160r006n438p66M527M609m234L211J3794
$$ 20943 18580 21550 20612 18095 17635 19239 23399 14393 8955 8189 12716 17325 13091 16302 30096
12687C0096K24l267r921J776Q685k180m681J401j0610j1433J789P819J0075N131
$$ 30096 30320 27053 17132 18908 27593 25413 20732 22133 11523 90 1879 9698 19773 24904
12673B4904L212p561j0441o289N678P73k714J046O044J738o50m08n76p08n657
$$ 24904 28116 20555 10114 3825 9503 10276 7562 8608 14652 16390 15740 15332 14756 14048 8391
12658H391P387L053J470J254L254K827k056j170p2n740o280o461J1756R729K565
$$ 8391 15778 18831 20301 21555 24809 27636 25580 24410 24338 18598 12318 5857 17613 27342 29907
12643B9907L150J40j19k087M775k925l379L504j524j056j009r016K364N93O790
$$ 29907 33057 33197 33078 30991 35766 32841 29462 32966 31442 30386 29377 20361 22725 23318 30108
12628C0108l921L687j173m291K441P879j939L77j875r04n915J342L515m090q184
$$ 30108 26187 29874 28701 24410 26851 34730 32791 33168 31293 30389 24474 25816 29331 25241 17057
12613A7057j647P285P456O887l485o89j192n382m692J993L176K839j88o680M283
$$ 17057 15410 22695 30151 37038 33553 32864 31672 26290 21598 23591 26767 29606 29418 22738 27021
12598B7021k11j526N014K021j436M274j816O666N795K153k180K041j258p720l122
$$ 27021 26810 25284 30298 32319 30883 35157 33341 40007 45802 47955 45775 47816 46558 38838 35716
12583C5716n207j1363k163K953K542J468j180k553n476r1N38J236K972k309J883
$$ 35716 30509 19146 16983 19936 22478 23946 22766 20213 14737 14646 15184 16420 19392 17083 18966
12568A8966k042N211P772n129J420j553N098o934J315q972k341L556R512l033
$$ 18966 16924 22135 29907 24778 26198 24645 29743 22809 24124 15152 12811 16367 25879 22846
12554B2846k345N32N884M990l824m956m643o817l046J560m319n670N05J1525N976
$$ 22846 20501 21033 26917 31907 28083 23127 18484 11667 8621 10181 5862 192 697 12222 18198
12539A8198j225p533M391R778Q259P263p22l623M500k266n649j6371j206J6906
$$ 18198 16973 9440 13831 23609 31868 39131 38409 34786 39286 37020 31371 15000 13794 30700
12525C0700k373p635l765O832J9833q31o244j0021j1072J9k734k833Q374M639
$$ 30700 28327 20692 16927 23759 43592 42761 36517 26496 15424 15443 12709 9876 18250 22889
12511B2889l493N140M245R031K394j332k779n147r98K237J866q4J2363J429L899
$$ 22889 19396 24536 28781 37812 40206 38874 36095 30948 29950 32187 34053 33969 46332 47761 51660
12496E1660K848j5702n862R869q747o243J778k598Q315K057l886N261J739l762
$$ 51660 54508 38806 32944 42813 34066 27823 29601 27003 35318 37375 33489 38750 40489 36727
12482C6727o222p513n700L006J5344L692m966M886M364m010n892r236j3234p361
$$ 36727 30505 22992 17292 20298 35642 39334 34368 39254 43618 39608 33716 24480 11246 3885
12468C885L871R429R411J2706J5814N360m377n831k206N316j406J837L443N67
$$ 3885 7756 17185 26596 39302 55116 60476 56099 50268 48062 53378 51972 53809 57252 57819
12454E7819J676p112j2104j2746k506N111J046p54o422MO230O614R473J29k652
$$ 57819 59495 52383 40279 27533 25027 30138 31184 30430 24008 24012 30242 36856 46329 46458 43806
12439D3806r937J567K760j353O360M188P471k61n439n351n214P913J043k529R2
$$ 43806 33869 35436 38196 36843 43203 47391 54862 54601 49162 43811 38597 46510 47553 45024 45116
12424D5116O120m261q888k872q074p69Q780m497N885N186N726K209o178r933L775
$$ 45116 51236 46975 38087 35215 27141 26372 35152 30655 36540 41726 47452 49661 43483 33550 37325
12409C7325O556m101J28q655m670K991p11j191P609K811K478K583Q718K243L497
$$ 37325 43881 39780 39908 31253 26583 29574 28863 27672 35281 38092 40570 43153 51871 54114 57611
12394E7611o75J103N621j609p187j284m034p076R055J0301k936o731n052J128
$$ 57611 56936 58039 63660 62051 54864 53580 49546 42470 51525 61826 58890 52159 47107 48235
12380D8235j444q24O904K075p73K50K159l453j142Q705m2j65J910J071K382j937
$$ 48235 46791 45967 52871 54946 54173 54423 56582 53129 51987 60692 60650 60485 62395 63466 65848 63911
12364F3911M739j897k102L160j0641j505L116L140j223k949k942P99J0793L783
$$ 63911 68650 66753 64651 67811 57170 55665 58781 61921 60698 57749 54807 55606 66399 70182
12350G0182k136q246J680J0361L415K295M445N342m42k67J1363R557M880M289
$$ 70182 68046 59800 61480 71841 75256 77551 81996 87338 86896 86629 97992 107549 112429 116718
12336A16718Q548O557J6212K4220R870j1090k4578l3513k6817j3672q257j3537
$$ 116718 125266 131823 148035 172255 182125 171035 146457 112944 86127 72455 64198 50661
12324E0661j3062j059m651q686P956N140P811Q75k270O554k848n178K002l522
$$ 50661 37599 36540 31889 23203 31159 36299 44110 44985 42715 49269 46421 41243 43245 39723
12310C9723Q74Q669m334J016J0586K148P579n71j1922j0770l435J722L319N804
$$ 39723 40597 49266 44932 45948 56534 58682 66261 65690 53768 42998 39563 41285 44604 50408
12296E0408K322o463l602R72L883L582N084q19R38O468K418J5287Q286r748p199
$$ 50408 52730 46267 42665 43637 47520 51102 56186 55367 56305 62773 65191 80478 88764 79016 71817
12281G1817p600n238J854R065k996o944k517O606M442O048M606O23j249J488j669
$$ 71817 64217 58979 60833 69898 66902 59958 57441 64047 68489 74537 79143 79766 78517 80005 78336
12266G8336k301J914J0912R391M166n423j141j118M931Q780m526p273p559J0827
$$ 78336 76035 77949 88861 98252 102418 96995 95854 94736 99667 108447 103921 96648 89089 99916
12252I9916K0061J6238J2491J1396J6065K0568K1075M875N961R905J3877O912
$$ 99916 119977 136215 148706 160102 176167 196735 217810 222685 228646 238551 252428 259340
12240B59340L7J5993J4579J1997M71o761j3386n071p530k6409k0117k1017k1421
$$ 259340 259377 275370 289949 301946 302417 295656 282270 277199 269669 243260 223143 202126 180705
12227A80705k3869k5415q592l863o741N721r52j920Q026J0609l747r597m215k341
$$ 180705 156836 131421 122829 118966 112225 117946 116994 115074 123100 133709 129962 120365 116150 113809
12213A13809J338J851K060M893Q315l821l233j0787j4174m241N696J2980J0497
$$ 113809 115147 116998 119058 123951 132266 128445 125212 114425 100251 96010 101706 114686 125183
12200A25183j291J061O028P618J251M955N356K22M792j768o508N196M431J826
$$ 125183 123892 124953 130981 138599 139850 144805 150161 150383 155175 153407 146899 152095 156526 158352
12186A58352O292l691q520j857N061P236M394r27j1326j1931j952O008Q318L137
$$ 158352 164644 160953 152433 150576 155637 162873 167267 166340 155014 143083 141131 147139 155457 158594
12172A58594n175k525p487j1267j2242j0835K07L285P232J4363L0212J2048l499
$$ 158594 153419 150894 143407 132140 119898 109063 109270 112555 119787 134150 164362 176410 172911
12159A72911l327K690L772k868q660q944J4519L431l497R399O51k935O11K843
$$ 172911 169584 172274 176046 173178 164518 155574 170093 173524 170027 179426 180077 177142 177753 180596
12145A80596O814O470M909j611R987R145J4177P659L902j2753j0117m154P078
$$ 180596 187410 193880 198789 197178 207165 216310 230487 238146 242048 229295 219178 215024 222102
12132B22102R313P236J0230Q258m39P867r82K15J2368J2246K413J0957K5452K1788
$$ 222102 231415 238651 248881 257139 256700 264567 263585 263800 276168 288414 290827 301784 327236 349024
12118C49024K3082L6755N4620Q6712J06236J15158R6467M0274j8308o3118q1270
$$ 349024 372106 408861 463481 550193 656429 771587 868054 908328 890020 826902 745632
12107G45632q4573m9351l0889l6857l8000k3849l111J210J041J1285J2028K8215
$$ 745632 661059 611708 580819 543962 505962 482113 479002 480212 481253 492538 504566 532781
12095E32781J9385J1093R981J2388L455N129J073J5656K4753R431M438J0693K870
$$ 532781 552166 563259 573240 585628 589083 594212 595285 610941 635694 645125 649563 660256 663126
12082F63126k444k071N571N803n276m186P822m234j2204N764O026L483J972N227
$$ 663126 660682 658611 664182 669985 664709 660523 668345 664111 651907 657671 663697 667180 669152 674379
12068F74379R896L520L639J3292K1375J4588O079R850J5494J1806J4052J0646
$$ 674379 684275 687795 691434 704726 726101 740689 746768 756618 772112 783918 797970 808616
12056H08616J0967J8077J5631J2552J0569o18J3437L4341J3203J7313J5695J3696
$$ 808616 819583 837660 853291 865843 876412 875794 889231 923572 936775 954088 969783 983479
12044I83479K2796K6241L0397K8685L0766L2595K8310L4044M0309M6280N7176
$$ 983479 1006275 1032516 1062913 1091598 1122364 1154959 1183269 1217313 1257622 1303902 1361078
12033A361078O3854N7903N7217M5629N8522P2113Q7098J03375R5431Q5588R8726
$$ 1361078 1424932 1482835 1540052 1585681 1644203 1716316 1803414 1906789 2002220 2087808 2186534
12022B186534J01310J15904J25054J45950J61909J63806J65488J87514K18669
$$ 2186534 2287844 2403748 2528802 2674752 2836661 3000467 3165955 3353469 3572138
12013C572138K47513K80792L07376L38550L66647L92699M25838M88397N72539
$$ 3572138 3819651 4100443 4407819 4746369 5113016 5505715 5931553 6419950 6992489
12004F992489O77615P99467R26879J102885J349714J637731K004470K465327L055415
$$ 6992489 7670104 8469571 9396450 10499335 11849049 13486780 15491250 17956577 21011992
11995B1011992L874853M972780O375087Q084383J0121749J2710747J6433137K2220201
$$ 21011992 24886845 29859625 36234712 44319095 54440844 67151591 83584728 105804929
11987A05804929L1117616M4065253N9890886O8595371N1264247R078751l4972661
$$ 105804929 136922545 180987798 240878684 309474055 360738302 369817053 334844392
11980C34844392o1183841n8643402m2762431k8246554j8612792j3656735j1942586
$$ 334844392 273660551 215017149 172254718 144008164 125395372 111738637 99796051
11973I9796051j1016833r778727q440582p310190o573559o101461n595933m998194
$$ 99796051 88779218 79000491 70559909 63249719 56676160 50574699 44978766 39980572
11965C9980572m379367l815580l309518k874949k526187k225954j960103j757381
$$ 39980572 35601205 31785625 28476107 25601158 23074971 20849017 18888914 17131533
11957A7131533j578778j402173j252072j110283j004579q98857p90959p10634
$$ 17131533 15552755 14150582 12898510 11788227 10783648 9884791 9093832 8383198
11949H383198o43924n82613n06379m48356m14093l79920l36765l02215k80841
$$ 8383198 7739274 7156661 6650282 6201926 5787833 5407913 5071148 4768933 4488092
11940D488092k58259k21900k03159k03080j89639j84336j85205j59411j36179
$$ 4488092 4229833 4007933 3804774 3601694 3412055 3227719 3042514 2883103 2746924
11931B746924j26593j16618j08339j12164j15981j00775j02089j04065q0308q4989
$$ 2746924 2620331 2503713 2395374 2283210 2167229 2066454 1964365 1860300 1779992 1695003
11921A695003p3764o7324o9638q2308o1117m8305m3027n7310n9080m1631l8750
$$ 1695003 1621239 1553915 1484277 1401969 1340852 1292547 1249520 1192210 1133130 1091499 1052749
11910A052749m0128l4726l1959l1197k5060k4181j8498j6980k3246k6509j4465
$$ 1052749 1012621 977895 945936 914739 889679 865498 847000 830020 806774 780265 765800
11899G65800j9290k5779j8139j3749j6701j5976p000j2698j4081k2628k2197j8441
$$ 765800 746510 720731 702592 688843 672142 656166 649166 636468 622387 599759 577562 559121
11887E59121j0686l855l096q28r288j3799j0254R96m684j5973j1366l086K785
$$ 559121 548435 544580 541484 540656 531368 517569 507315 508311 503627 487654 476288 473202 475987
11874D75987O938q267L156J0053m497q584m786J0170J4235J984J0625J4540J7478
$$ 475987 482925 474658 477814 487867 483370 474786 470000 480170 494405 496389 507014 521554 539032
11861E39032J0481J4429J0965L064j6488o6778j33601j52967j12309l9007K5397
$$ 539032 549513 563942 574907 577971 561483 494705 361104 208137 95828 56821 82218
11850H2218M7060L9016L9303K8341R555J0235J8972K4199J7123L074M479Q757
$$ 82218 129278 168294 207597 235938 245493 255728 274700 298899 316022 319096 323575 332332
11838C32332K417L373R173j951l360M139q204p396r484q919r334L385q598l102
$$ 332332 334749 338122 347295 345344 341984 346123 337919 330523 321039 312120 302786 306171 297573 294471
11824B94471m029j1217j4907j3813p872n30l071k539k006J644L336m956j580l355
$$ 294471 290442 279225 264318 250505 242633 242103 239032 236493 234487 236131 239467 234511 232931 229576
11810B29576p976j2798j2095m958k985J0380N691L59P752J4171O653M246j1162
$$ 229576 221600 208802 196707 191749 188764 199144 204835 205194 212946 227117 233770 238016 226854
11797B26854k2424k7482k5409j6178k109l074J808p038j8475l969q452k2626m861
$$ 226854 204430 176948 151539 135361 133252 130178 131986 124948 106473 102504 94052 71426 66565
11784F6565J0035J0686J0499M410o108j5355j6906j4136N247n518J597q298L338
$$ 66565 76600 87286 97785 102195 96087 80732 63826 49690 54937 49419 51016 42718 46056
11771D6056O78n3M924k21P554N901M77R037R420R06m610q395n632J104o488o172
$$ 46056 46734 46681 51605 51384 58938 64839 65316 74353 83773 84679 80069 71674 66042 67146 60658 54486
11755E4486j798M564J7686J140p787J897O077Q133K748P546K238M203M386n027
$$ 54486 52688 57252 74938 76078 68291 70188 76265 84398 87146 94692 96930 101133 105519 100492
11741A00492P518M507j1716p538P9k349r042j0801j686M353R034P437N536m260
$$ 100492 108010 112517 100801 93263 93342 90993 81951 71150 69464 73817 82851 90288 95824 91564
11727I1564r805P252M542k657j3374j3032n971K92J77P837Q372k488o785N51k571
$$ 91564 81759 89011 93553 90896 77522 64490 58519 58811 58988 66825 75197 72709 65924 66475 63904
11712F3904k538M040o838L153J938j827K851l51l647Q624j14o569m381O428Q720
$$ 63904 61366 65406 58568 61721 63659 61832 64683 64332 60685 69309 69195 62626 58245 64673 73393
11697G3393o400K373n195j0050q054K473m683K726O60m500q607p324P189o02l653
$$ 73393 66993 69366 64171 54121 46067 48540 43857 46583 47243 42743 34136 26812 34001 33399 29746
11682B9746L147J4080O733O30m381K432j747N320J0359M50P224J2812l791j3428
$$ 29746 32893 46973 53706 54336 49955 52387 50640 55960 66319 66769 73993 86805 83014 69586
11668F9586j2708q413l416J316L537K946Q03M418n306m633j242n472m430J0163
$$ 69586 56878 48465 45049 46365 49902 52848 53651 58069 52763 48130 46888 41416 36986 47149
11654D7149J2694O092K76J120o491N97L524J143J987q91q249N003K326n237l458
$$ 47149 59843 65935 66211 67331 60840 61437 64961 66104 68091 67200 58951 63954 66280 61043 57585
11639E7585l452j0672l3174m1649l9854k5639R38L4316K6621R443j451M566k608
$$ 57585 54133 43461 10287 -31362 -71216 -96855 -95917 -61601 -34980 -25537 -26988 -22422 -25030
11626b5030M232J428j63Q29L070N720P517j1092J0771O142K207J10p391p446K937
$$ -25030 -20798 -19370 -19533 -18704 -15634 -9914 -2397 -13489 -2718 3424 5631 5741 -1650 -9096 -6159
11611f159L904M215r276m98J3373K936R946N738J271l935j3881j1881L863J854
$$ -6159 -2255 1960 -7316 -7814 5559 8495 18441 24179 25450 21515 7634 -4247 -384 1470
11597A470O65J817K192R897j229j544k836J0242o48p898N463N898N707n570j670
$$ 1470 2135 3952 6144 16041 14812 13268 10432 20674 20026 12128 17591 23489 29196 23626 21956
11582B1956L297K958K420m533O98r591j1405M50n92O256M285K285O42L250k800
$$ 21956 25253 28211 30631 26098 26796 17205 5800 6250 5658 11914 16199 18484 19126 22376 19576
11567A9576j447L207L047n629J755J801n722M85O684j067M563o311n16K061O262
$$ 19576 18129 21336 24383 18754 20509 22310 16588 17073 23757 22690 27253 20942 20426 22487 28749
11552B8749l609j0918m973J488n272j314M370J800m807j200l933q193j362J1677
$$ 28749 25140 14222 9249 10737 5465 4151 8521 10321 5514 4314 381 -7812 -9174 2503
11538B503J0346q885r807J756J1740N383K36j284m210K516k360rN942j4892j69
$$ 2503 12849 3964 -5843 -4087 7653 13036 13272 11988 7778 10294 7934 7925 13867 -1025 -1194
11523a194K709r868n97O913J350j9L756o100K036R75o633J986k790L537R645J515
$$ -1194 1515 -8353 -8950 -2037 -687 -706 3050 -3050 -1014 -39 -6672 -4686 -7476 -3939 5706 7221
11507G221k241L501N845R38r727j6907m749P448R616Q597K442P499p629m298m377
$$ 7221 4980 8481 14326 15264 5537 -11370 -16119 -8671 945 9542 11984 19483 11854 7556 3179
11492C179k008N288P38J827N387N684m383N572L251k848p023k459K169L24l189
$$ 3179 1171 6459 7197 9024 14411 20095 15712 21284 24535 21687 14664 12205 14374 14698 11509
11477A1509m581J697Q072M294j1119p779k87R82l536p857m687J0528Q650m975
$$ 11509 6928 8625 16697 20991 9872 2093 1806 2788 -748 -8605 -13292 -2764 5886 911
11463I11M139N416J498N102l918O21k40J442o891N164J041p658J033p95M803Q590
$$ 911 5050 10466 11964 17066 13148 13769 13529 14971 8080 13244 14285 6627 7660 6865 11668 20258
11447B0258Q614k618o437J141l093l96j468p904p175j816J672n035k849R72Q430
$$ 20258 28872 26254 19817 20958 17865 17469 16001 8097 922 -894 778 -4257 -7106 -6134 2296
11432B296L584O123K602l691m603n10m159q454K241j0066K501J2004J329M325
$$ 2296 5880 12003 14605 10914 6311 5801 1642 -6812 -4571 -14637 -12136 -132 1197 5522
11418E522K971L021L927J140m169j617K941l081r289o417l0M752J875Q77j33J072
$$ 5522 8493 11514 15441 16581 12412 10795 13736 10655 1366 -5051 -5081 -329 1546 2423 2290 3362
11402C362l224j6J3771N67l726p043k649k490l922j828O009J0459N746J412k488
$$ 3362 138 122 13893 14460 10734 3691 1042 -1448 -5370 -7198 -1189 9270 15016 16428 13940
11387A3940m533J3499L689J426k793J788p501m564J782k331m186l473o650l12
$$ 13940 9407 22906 26595 28021 25228 27016 19515 14951 16733 14402 10216 6743 93 -219
11373b19K384M365j969j1350K130N453O921m036o398O771J1666p951r864j0558
$$ -219 2165 6530 4561 -6789 -4659 794 7715 3679 -2719 4052 15718 7767 -2097 -12655
11359a2655K67Q493R26j0287l077J3205J3642l466j2859K585p564m32K233n1n06
$$ -12655 -12388 -3895 -2969 -13256 -16333 -3128 10514 7048 -5811 -3226 -10790 -11222 -8989 -9040 -9546
11344i546L650K226J160k497P353J830l7j027p297M15P421J1717L341o234m584
$$ -9546 -5896 -3670 -2510 -5007 2346 4176 4139 3112 -4185 -3770 3651 15368 18709 12475 7891
11329G891K507j94m717j343k276m784O338L793l248k664K085n824j3546Q132K200
$$ 7891 10398 10204 5487 4144 1868 -2916 3422 7215 3967 1303 3388 -2436 -15982 -7850 -5650
11314e650Q528Q624J744m01q008o258J605k656l902L443k187q37O06m980o18n703
$$ -5650 2878 11502 13246 12845 4837 -1421 184 -2472 -6374 -2931 -5118 -5955 -5349 -10329 -10947 -16650
11298a6650J1571J0495K322J12J317q344n289P541p68n501R910J212k051m052
$$ -16650 -5079 5416 7738 7850 9167 823 -4466 3075 2307 -3194 6716 7928 5877 1825
11284A825R784k835o306l122l191P764J2832j174q091p134J197m478P537N370
$$ 1825 11609 8774 2468 -654 -3845 3919 16751 15577 7486 352 1549 -2929 4608 9978
11270I978j223p078k190R382K11n005p601q593K998K553P807L13K73n335n857
$$ 9978 8755 1677 -513 8869 9080 4075 -3526 -12119 -9121 -6568 1239 1552 1825 -3510 -9367
11255i367l219j64J1673n075k046J0576O445p851q695Q390j51o082L60O89k268
$$ -9367 -12586 -12750 -1077 -6152 -8198 2378 8823 972 -7723 667 516 -5566 -5206 -4517 -6785
11240f785n549l297P107K572J810j201O254R686L678j63r785p321m261L635P792
$$ -6785 -12334 -15631 -8524 -5952 -4142 -5343 911 10597 14275 14112 4327 -2994 -7255 -3620 4172
11225D172N775k386p676m33L728O355j044R55l528N730N203n542j3638L047J0468
$$ 4172 9947 7561 -115 -548 3180 9535 8491 9446 5918 11648 16851 11309 -2329 718 11186
11210A1186R948O23j3467m150O127K563O869k905J694J226m836l138j1289j6499
$$ 11186 21134 21757 8290 4140 10267 12830 19699 16794 18488 19714 14878 11740 451 -16048
11196a6048M161J4585j078P463J0823j405R84l914N79r500j551k599j32m527k465
$$ -16048 -11887 2698 1620 9083 19906 18501 19485 15571 16150 6650 5099 2500 2368 -2159 -4624
11181d624J686M638p093K895J1656p712m765p225O440J794p525J2890N374K79
$$ -4624 -2938 1700 -5393 -2498 9158 1446 -3319 -10544 -4104 -2310 -9835 3055 8429 8708
11167H708N430m780J001p990L27J888O44m190J957N657M821L18r088q013L797
$$ 8708 14138 9358 10359 2369 2696 4584 5228 1038 2995 8652 13473 13791 4703 -3310 487
11152D87M573n234k888J2191P515m812J802N143m844k627p73M426j744r662l466
$$ 487 5060 -174 -3062 9129 16644 11832 13634 18777 13933 11306 10533 14959 13215 3553 87
11137H7P201N654K477q85q228o85o285k590m050O351J880M626k519j738O433j885
$$ 87 7288 12942 15419 14534 6306 5621 -664 -3254 -7304 -953 927 5553 3034 1296 7729 5844
11121E844k28K051l878r625p053L770P45q857K827Q283R54M213J1591n555j986
$$ 5844 5616 7667 3789 -5836 -12889 -9119 -8374 -17231 -14404 -6121 -5167 -954 10637 5082 3096
11106C096o335j453L139l300N260K574L54j084k104k542k1j367k597R9K626Q906
$$ 3096 -3239 -4692 -1553 -4853 407 2981 3335 2251 147 -2395 -2416 -3783 -6380 -6281 -3655 5251
11090E251J253j1801K010J2863K285l126O361J2192j953R17j15n767r675r017
$$ 5251 6504 -5297 -3287 9576 11861 8735 15096 27288 25335 26252 26137 20370 10695 1678
11076A678r939j590O074L813L156R501O734o578N50K09n553l304K11M679L633
$$ 1678 -8261 -9851 -3777 36 3192 12693 19427 12849 13399 13608 8055 4751 4962 9641 13274
11061A3274M239n755k981N096K722p875q99k855m164o767K284J569J798L006L176
$$ 13274 17513 11758 8777 13873 16595 8720 7821 4966 802 -5965 -3681 -2112 -314 2692 5868
11046E868L178K091K903K940J4781L970K448q61l380q81O493J416R836P081k398
$$ 5868 9046 11137 14040 16980 31761 35731 38179 37318 33938 33057 39550 40966 50802 57883 55485
11031E5485J951o072j0701n416l263k618J878R832l951L355J2557L178k760J035
$$ 55485 57436 51364 40663 35247 31984 29366 31244 41076 37125 40480 53037 56215 53455 54490
11017E4490m935n477j0280k438O064J2865K161m583n85M479j422j0534n766n271
$$ 54490 49555 44078 33798 31360 37424 50289 52450 47867 47282 51761 50339 39805 34039 28768
11003B8768J0571K503o859m423l762R775R281N876j4967p843R02o134j4204k581
$$ 28768 39339 41842 34983 30560 26798 36573 45854 51730 36763 28920 29822 23688 9484 6903
10989F903J8568Q085p234j6200j0835K404L710k050M695l968m503j65J551M404
$$ 6903 25471 33556 26322 10122 -713 1691 5401 3351 8046 4078 -425 -590 961 5365
10975E365L676l625k004l99m471K350P129R083K429q481J965R92J349o652j789
$$ 5365 9041 5416 3412 3013 -1458 892 8021 17104 19533 11052 13017 14009 15358 8706 6917
10960F917O623K398k808L813J065o615j1170q200j320P689L216n59M055j173J242
$$ 6917 13540 15938 13130 16943 18008 11393 223 -7977 -9297 -1608 1608 1049 5104 3931 5173
10945E173q656j749K055J695K950m567l235M144o69L042L024K328J925N009Q169
$$ 5173 -3483 -5232 -3177 -1482 1468 -3099 -6334 -2190 -2859 183 3207 5535 7460 12469 20638
10930B0638q683m349j683L932l08n646r168k467R36R243Q554J652l931o433o30
$$ 20638 11955 7606 5923 9855 9547 3901 -5267 -7734 -6798 2445 10999 12651 8720 2287 1657
10915A657N708q727J630j209k491M85N395M084k473N15p234k207q82M29J745J0359
$$ 1657 7365 -1362 268 -941 -3432 -2947 2448 6532 4059 4574 -2660 -4867 -5749 -5320 -3575 6784
10899F784L317j0047J018J1498P556p829n357o655n788N650O04n220l837j444
$$ 6784 10101 54 1072 12570 20126 12297 6940 285 -5503 147 751 -4469 -8306 -9750
10885i750L010J1546Q740O658j4182q111R975k531m865J100N940J1449L68j784
$$ -9750 -6740 4806 13546 20204 6022 -2089 7886 5355 490 1590 7530 18979 19347 17563
10871A7563m062M452K097j2287j06P74l401m829k538J2126R642m246k465L309
$$ 17563 13501 17953 20050 7763 7657 8431 5030 201 -2337 9789 19431 15185 12720 16029
10857A6029J444o4j0188j321O32k431K91L929J746j039L161R51N187L579m874
$$ 16029 17473 17409 7221 5900 6532 4101 4392 8321 10067 9028 12189 13140 18327 21906 17032
10842A7032M21K536k151Q026J936j7163n406J0357J122l053p488P838j249r715
$$ 17032 17453 19989 17838 25864 27800 10637 5231 15588 16710 13657 6169 14007 12758 3043
10828C043l446J57J700K765j505k107l31m736P99K229j796Q56M797L130Qm767
$$ 3043 -403 -246 1454 4219 2714 607 276 -4460 -3661 -1432 -3228 -2372 2425 5555 5563 796
10812G96n28p504K363O860P631M725q495K39Q25p025j471N28J840J831P418j612
$$ 796 268 -7236 -4873 1987 9618 14343 5848 6087 6912 -113 -1584 -1056 784 2615 10033 8421
10796H421k413M933L206n871P60p14n807P502J3618l91o838j030k406p764m925
$$ 8421 6008 10941 14147 8276 9036 8322 2515 10017 23635 23244 16406 15376 12970 5206 281
10781B81N683j270k418o402j205O043l735K239P716K783o56j974l666l83K721
$$ 281 5964 4694 2276 -4126 -5331 712 -3023 -784 6932 9715 9059 7085 3419 3036 5757
10766E757q327J695R502J684p705M239R246J283q084j3147p894q01L703r24J25
$$ 5757 -2570 -875 8627 10311 2606 6845 16091 17374 9290 -3857 -11751 -12552 -8849 -9773 -9648
10751i648M462Q305j229L677K523K427L984l538N152l12O582Q621l236j0984n430
$$ -9648 -5186 3119 1890 5567 8090 10517 14501 10963 16115 15803 22385 31006 27770 16786 11356
10736A1356P843P954J190O816O371J156m048o953J615m62K556M60m94N077O969
$$ 11356 19199 27153 28343 35159 41530 42686 38638 31685 33300 32838 35394 35854 35360 40437 47406
10721D7406r510J474N780k537p10j026r538p882P818J1212m197l68P31K083n303
$$ 47406 37896 39370 45150 42613 41903 40877 31339 23457 31275 42487 38290 37922 38653 40736 35433
10706C5433k554K912J771l004k0K823q852p648J091O271l046M672m526O066N204
$$ 35433 32879 35791 37562 34558 34538 37361 28509 20861 21952 28223 25177 29849 25323 31389 36593
10691C6593k792p004j566N907K53K621M935M500P821l323k423K273l701J47K843
$$ 36593 33801 26797 25231 31138 31391 34012 38947 43447 51268 47945 45522 47795 44094 44241 47084
10676D7084k899k962j1145Q746k317M644O851j1129j2301N9k076J0224M230N10
$$ 47084 44185 41223 30078 38824 36507 41151 48002 36873 24572 24631 22555 32779 37009 37519
10662C7519L918Q970Q188l325j2933j403K835R587Q621O9o40Q008J0746M787O
$$ 37519 41437 50407 58595 55270 42337 40934 43769 53356 61977 62046 61406 69414 80160 84947 84953
10647H4953J519J606O118n555k654j919J462O402P725J2641Q023N277P242J6501
$$ 84953 86472 88078 94196 88641 85987 84068 85530 91932 99657 112298 120321 125598 132840 149341
10633A49341J2024J8342J6756K3375K7868K6661L4209M0109M6892N5850O6558
$$ 149341 161365 179707 196463 219838 247706 274367 308576 348685 395577 451427 517985
10622E17985R8081J32871J57157J96135K58445L36459M05937M40892M14075K97488
$$ 517985 616066 748937 906094 1102229 1360674 1697133 2103070 2543962 2958037 3255525
10612C255525J31437J5687k9029J0338J18605K51158M15094N88557P69330Q46954
$$ 3255525 3386962 3402649 3373620 3383958 3502563 3753721 4168815 4757372 5526702 6373656
10602F373656P27786L99374j8420l14242l87501k51649m2083K03604M46637P08523
$$ 6373656 7101442 7500816 7482396 7168154 6780653 6529004 6486921 6690525 7137162 7845685
10592G845685R29785R88758P51933K00885m30894q53016r03512p17863m56037
$$ 7845685 8775470 9764228 10516161 10717046 10286152 9433136 8529624 7811761 7355724
10583G355724j90247M3039K46169L88064M03094K16573j52220n74498q21155q01036
$$ 7355724 7165477 7208516 7454685 7842749 8245843 8462416 8310196 7735698 6914543 6113507
10573F113507o49542m53889k83294j55713n4953j596j0308j03416k52193m05664
$$ 6113507 5463965 5010076 4726782 4571069 4516116 4514520 4504212 4400796 4148603 3742939
10563C742939m72364m60590l94677l18814k50710k11294j75513j56973j49430
$$ 3742939 3270575 2809985 2415308 2096494 1845784 1634490 1458977 1302004 1152574
10554A152574j19820j03197r0757q4772o3371o0724o3083n3762m4396m6542l6704
$$ 1152574 1032754 929557 838800 754028 690657 629933 566850 513088 468692 422150 385446
10543C85446k6924k9750k5542k2824k3253k3995j1916j5182k2792j3088l775q088
$$ 385446 358522 328772 303230 280406 257153 233158 221242 206060 183268 170180 166405 158317
10531A58317q011p750j0961j6085j2497k358n114K495N127j233o079j7625p845
$$ 158317 150306 142556 131595 115510 103013 100655 95541 98036 103163 101930 95851 78226 70381
10518G0381L127Q65q833j4086r316P293P879m259j72J343m204l587p57p241j51
$$ 70381 73508 74373 65540 51454 42138 49431 57310 53051 52879 54222 50018 46431 45674 38433 38282
10503C8282m892j957l96Q707m389o214K864r07M49K605m36P69l571l357o07M798
$$ 38282 33390 31433 31037 39744 35355 29141 32005 31098 31547 34152 33716 34485 30914 27557 26950 31748
10487C1748M112L020l714k609j814q69l710N455J420K935K125n376O379J290q992
$$ 31748 35860 38880 35166 32557 30743 29874 26164 31619 33039 35974 38099 32723 39102 40392 31400
10472C1400J400K082l536l89m259o53k444L949l645l861n459k819J1504K075p453
$$ 31400 32800 34882 31346 30957 26698 26045 23601 27550 23905 20044 14585 11766 23270 25345 17892
10457A7892j997n610k508J432l513M526L571q12o10J838O448P163J703J714j827
$$ 17892 15895 10285 7777 9209 5696 10222 13793 12981 12371 14209 20657 27820 29523 31237 29410
10442B9410l793r376n835N733j064J932L72p685l438L891J418o31K022N898L711
$$ 29410 25617 16241 10406 16139 15075 17007 17379 9694 6256 10147 11565 10934 12956 18854 22565
10427B2565j3788l476L987j0789q290N982l25M945m742K535J751O331L937k637
$$ 22565 8777 5301 9288 -1501 -9791 -3809 -4134 811 -3931 -1396 355 6686 10623 7986
10413G986N43k140l888n364N49J1451J0866r55p042M30o45k270O903J0667m150
$$ 7986 8529 6389 2501 -2863 -2314 9137 20003 19048 12006 12436 11791 9521 16424 27091 22941
10398B2941q832k125m528K524l783n449K117j3317j177K646l368J884J6231M151
$$ 22941 14109 11984 7456 9980 6197 748 2865 -10452 -11629 -8983 -12351 -10467 5764 9915
10384I915m617k94L52Q768q1p691j0373K326k164n593J692P984J046J263K935
$$ 9915 5298 5004 5356 14124 14043 6352 -4021 -1695 -3859 -9452 -7760 224 1270 2533 5468
10369E468k136n330m955j113j928m017P017N209K272R271R817p939j0173O596
$$ 5468 3332 -1998 -6953 -8066 -9994 -14011 -6994 -1785 487 9758 19575 11636 1463 8059
10355H059K088l097k351j634M07k91n195p544k047K962J1671P948q02O39L643
$$ 8059 10147 7050 4699 3065 3472 3181 -2014 -9558 -11605 -8643 3028 10976 10174 10813 14456
10340A4456n21N07l681k415P58n53m176j374K450j036n390n807l944M117K0285
$$ 14456 13935 14442 10761 8346 9104 8551 4375 3001 5451 4415 -975 -6782 -10726 -6609 13676
10325A3676L763O003K438q312l815j786j2616l35K734k391Q929r80J508Q44K078
$$ 13676 17439 23442 25880 17568 13753 11967 -649 -984 1750 -641 8288 7308 8816 9660 11738
10310A1738m405J290m631m086P473q83K038n245q327l395J70j25J2121L896j177
$$ 11738 7333 8623 3992 -94 7379 6496 8534 3289 -5038 -8433 -8263 -8388 3733 7629 6452
10295F452q050j587M454M675k881j622j26n572N190n93P235L449j732n946p56
$$ 6452 -1598 -3185 1269 5944 3063 1441 1315 -4257 933 340 7575 11024 9292 3346 2590
10280B590J950q762n20R36J351L80K052J1077P115o413q270Q19j016l119k171
$$ 2590 4540 -4222 -4742 -3806 -2455 -2075 -23 11054 18169 11756 3486 4305 3289 170 -2001
10265b001J104R12K264j49L386Q187J498J312j4279k1848r964P578J4031M239
$$ -2001 -897 15 2279 2130 5516 13703 15201 16513 2234 -19614 -29578 -22000 -7969 -3730
10251c730L709K511m2p276L481K309r018o406j2301M275J2186j743M828J2785
$$ -3730 -21 2490 2448 -4828 -1347 962 -8056 -14462 -26763 -22488 -10302 -12045 -7217 5568
10237E568K058n138j976m502L470r379p483J791L088O668k808K227O014K485n924
$$ 5568 7626 2488 512 -3990 -520 -9899 -17382 -15591 -12503 -5835 -8643 -6416 -402 2083 -3841
10222c841p619j010K199P196M631L875J799j716l668R482k25L820L995j1370n256
$$ -3841 -11460 -12470 -10271 -3075 1556 5431 7230 5514 1846 11328 11103 14923 18918 7548 2292
10207B292J782L45l340j645l80j975n458j866l950P23K439L775n086P179J1393
$$ 2292 4074 4419 1079 -566 -946 -2921 -8379 -10245 -14195 -13472 -11033 -7258 -12344 -5165 6228
10192F228j59l458m698N101J0154m270m009q87K122M543P854L361L11k195k186
$$ 6228 6069 2611 -2087 3014 13168 8898 4889 4002 6124 10667 18521 21882 22193 19998 17812
10177A7812J850O533K529n441m786k352N148J320K64j566Q90J4680J3167O795
$$ 17812 19662 26195 28724 23283 18497 16145 21293 22613 22877 21311 22201 36881 50048 56843
10163E6843m477o156j0872n113M399Q840J551j299J3624J4195J072o881l792j2332
$$ 56843 52366 46210 35338 30225 34624 43464 45015 43716 57340 71535 72607 65726 61934 49602
10149D9602j3321n994L316J2387J2405j532J388K474k113k461j483j576l547l682
$$ 49602 36281 30287 33603 45990 58395 56863 58251 60725 58612 56151 54668 53092 49545 45863
10135D5863j0941n080p000j212K175L833L213k754j0883n299J0437k076k900q515
$$ 45863 34922 29842 22842 21630 23805 27638 30851 28097 17214 11915 22352 20276 17376 8861
10121H861m984j806l818P49O580O020O774j1603q784l896M513q58m002r148Q534
$$ 8861 3877 2071 -1747 -998 5582 11602 18376 6773 -2011 -5907 -1394 -2252 -6254 -15402 -6868
10106f868L959L660K916M256J050M281m361l540J581p03l268n191L455K195K554
$$ -6868 -2909 751 3667 7923 8973 13254 8893 5353 6934 6231 2963 -2228 1227 3422 5976
10091E976j473r817m840R581l023j110K622K87o08l008p526k253L856P171l889
$$ 5976 4503 -5314 -10154 -573 -3596 -4706 -2084 -1797 -2405 -5413 -12939 -15192 -11336 -4165 -8054
10076h054J290m67j0899O260K068Q343J4552n928o587j649M735j808q361r877
$$ -8054 -6764 -7231 -18130 -11870 -9802 -1459 13093 7165 578 -1071 3664 1856 -6505 -16382
10062a6382R911M040K969R373N074o891o642M224N43R7j241J90j599p809r431
$$ -16382 -6471 -2431 538 9911 14985 8094 1452 5676 6219 6316 5075 5265 3666 -4143 -13574
10047a3574o206j111P381l552r191P360P492j266M863J0423J479q68P732n955
$$ -13574 -19780 -20891 -13510 -17062 -26253 -18893 -11401 -12667 -7804 2619 4098 3230 10962 5007
10033E007j9613K74R747P990j12j119J32J702m00J778k60p416o623M927N954M899
$$ 5007 -14606 -14332 -4585 3405 3293 2174 2306 4008 3608 5386 5126 -2290 -8913 -3986 1968 6867
10017F867q7k631k477j411j098K870Q066r040n962j711j3645j650J5035p20Q064
$$ 6867 6780 4149 1672 261 -837 2033 10099 1059 -4903 -6614 -20259 -21909 -6874 -7594 470
10002D70L751K778J0780m358q371o126J61L809l898QK085n598j0714k938K024
$$ 470 4221 6999 17779 13421 5050 -1076 -915 2894 -1004 -996 1089 -4509 -15223 -18161 -16137
9987a6137O708J392L358M834m022R28M546K221M973j965k090j0044p4j0318r3
$$ -16137 -9429 -8037 -4679 155 -3867 -2939 1607 3828 8801 6836 4746 -5298 -5372 -15690 -15783
9972a5783M894J150q43j294m39K917r17O226J2497K870j6362j478k309p171o82
$$ -15783 -10889 -9739 -10582 -11876 -12315 -9398 -10315 -4089 8408 11278 -5084 -6562 -8871 -16042 -16724
9957a6724l484l686L982J0538P404Q95J007N867m178l488k845R315K002k699o581
$$ -16724 -20208 -23894 -19912 -9374 -1970 -1075 -68 5799 1621 -1867 -4712 4603 6605 3906 -2675
9942b675l651K900O62P096J072m212M536o121L187m635P606J3284J0173O475P244
$$ -2675 -6326 -3426 -2764 4332 5404 1192 5728 -393 2794 -1841 5765 19049 29222 35697 42941
9927D2941J7504K6698L6442K9073O215k5343l5883l1293k0341j0972n505K152
$$ 42941 60445 87143 123585 152658 158873 133530 97647 66354 46013 35041 29536 31688
9915C1688q19M364R724K653r238o968p351m355m366k067l665k01J464m20j0843
$$ 31688 30869 35233 44957 47610 38372 31404 24053 19698 15332 13265 9600 9399 10863 10443 -400
9900d00p186R237R733K702p097l75J811n466k299o817M490L851n444o535J0637
$$ -400 -7586 1651 11384 14086 6989 6614 8425 2959 660 -6157 -1667 2184 -3260 -9795 842
9885H42J8249R030n321j4652j079P316R34J31l172J296r385M757L77J534k165
$$ 842 19091 28121 22800 8148 7069 14385 15319 15450 12278 13574 4189 8946 9323 10857 8692
9870H692o168j634K828J388l559j003P13p585J626M787R829N744j729o258M109
$$ 8692 2524 890 3718 5106 1547 544 1257 -6328 -4702 85 9914 15658 13929 7671 11780
9855A1780j4912M935J556K01k3o061j1293n811P555O815K326n523N427J5075M97
$$ 11780 -3132 1803 3359 3560 3537 -2524 -13817 -19628 -12073 -5258 -2932 -8455 -3028 12047 12544
9840A2544m40p868R38l99l472k049r20O40j783N645l911o876p6N840k207P620
$$ 12544 12104 4236 5174 4775 1303 -746 -1666 -1026 -2809 2836 -1075 -7951 -8027 -2187 -4394 3226
9824C226q707m626K409M242L516k532K090J769q195K987N076L62K441M617r47
$$ 3226 -5481 -10107 -7698 -3456 60 -2472 -382 1387 -6808 -3821 1255 1617 4058 8675 7728
9809G728m020K95J435l440J685J503p181r185K280Q434J442o713K315J1673M194
$$ 7728 3708 4003 5438 1998 3683 5186 -1995 -11180 -8900 -466 976 -5737 -3422 8251 12445
9794A2445n161K444l04j4427m702j647m493N358N690m451k087j40L554q80k912
$$ 12445 7284 9728 9424 -5003 -9705 -11352 -15845 -10487 -4797 -9248 -11335 -11475 -7921 -8801 -11713
9779a1713Q777J3141M43m196K167l661j317q498k253l343j223K223N625J922M037
$$ -11713 -2936 10205 10648 6452 8619 4958 3641 -4857 -7110 -10453 -11676 -9453 -3828 -1906 2131
9764B131K984N40l187N261P107n622k255M03m079K36J073l919q055j718J1003
$$ 2131 5115 5655 2468 7729 14836 9214 6959 7362 3283 3519 4592 673 -7382 -9100 1903
9749A903M048m615j358J793q842N062l24o256M008M267J540J265n012p097K557
$$ 1903 5951 1336 -22 1771 -7071 -2009 -2333 -8589 -4581 -314 1226 2491 -2521 -9618 -7061
9734g061K074n56q769k223o8Q422j144N44M326L849j231p5j2453p99J1091P728
$$ -7061 -4987 -5543 -14312 -16535 -16603 -8181 -9325 -8781 -4455 -606 -1837 -1912 -14365 -15164 -4073 3655
9718C655J0993p98p163j200q202L060R103O847n398n565j539K184j0781l078O523
$$ 3655 14648 13850 6687 5487 -2715 345 9448 16295 10897 5332 3793 5977 -4804 -7882 -1359
9703a359P782Q29J119n897j89l980q759o792J7200J0674j766O437m397k085j0076
$$ -1359 6423 7252 8371 2474 2285 -1695 -10454 -17246 -46 10628 8862 15299 10902 8817 -1259
9688a259j280P845j36r519M168l166m519L019M698m89N333J0653o146m283n142
$$ -1259 -2539 5306 5170 -4349 -181 -3347 -7866 -4847 -149 -638 4695 15348 9202 4919 -223
9673b23j904J479Q62r45l559n052q270K636j179j4337J1362J9377L130k817P96
$$ -223 -2127 -648 214 -731 -4290 -9342 -17612 -14976 -16155 -30492 -19130 247 3377 560 1356
9658A356m100N210O733q552k80M141Q674M64j2780j0196n466J3362J4588K939
$$ 1356 -2744 2466 9199 647 367 4508 13182 13646 866 -9330 -14796 -1434 13154 16093
9644A6093l530n025k596k190j694L303O29l591l744q193L551O621M982n257m654
$$ 16093 12563 7538 4942 2752 1058 4361 4990 1399 -2345 -10538 -6987 -366 4616 -641 -5295
9629e295j515Q9P211P235J2806j81N24K036l62m034j1752k482p494n517j401L071
$$ -5295 -6810 -6721 490 7725 20531 20350 20874 22910 22548 18514 6762 4280 -3214 -8731 -10132 -7061
9613g061p741n94l70K686J2855R162l877q551J402K768k818j0153o456L460K17
$$ -7061 -14802 -15396 -15766 -13080 -225 8937 5060 -3491 -2089 679 -2139 -12292 -18748 -15288 -15071
9598a5071J242J1305J1707R391j755j833J312o191l369K153n133p893l507N271
$$ -15071 -13829 -2524 9183 18574 16819 14986 16298 10107 6738 8891 3758 -4135 -7642 -2371
9584b371p73j0897J607O314Q035Q797K40j3913m004M527O970N005o841j4801j389
$$ -2371 -3144 -14041 -12434 -6120 1915 10712 10952 -2961 -6965 -2438 4532 9537 2696 -12105 -13494
9569a3494J418l12M255P224k466n349N410M547P056J946M647L782n024m235n341
$$ -13494 -12076 -12388 -8133 -909 -3375 -8724 -3314 1233 8289 10235 14882 18664 13640 9405 4064
9554D064j191p77J423L219L898L231k569p390J244o928L165R249N907j4519n550
$$ 4064 2873 2096 3519 6738 10636 13867 11298 3908 5152 -1776 1389 10638 16545 2026 -3524
9539c524n885l671j5627M599J7164M509k173N652P624r555N401L866o479k645
$$ -3524 -9409 -13080 -28707 -24108 -6944 -2435 -4608 1044 8668 -887 4514 8380 1901 -744
9525g44O323N872q845q03q368M252o453j0189J344J1955l808O116L556p816j0099
$$ -744 5579 11451 2606 1803 -6565 -2313 -8766 -18955 -17611 -5656 -9464 -3348 208 -7608 -17707
9510a7707k05P560P631q478n373O397J2666J6Q61o16k066k690r28k475j465N648
$$ -17707 -17912 -10352 -2721 -11199 -16572 -10175 2491 2507 3368 2752 686 -2004 -2932 -5407 -6872 -1224
9494a224J901L130p46k934n129O486L064N582J602M66p956k297M402O34k2l459
$$ -1224 677 3807 3061 127 -5002 1484 4548 10130 11732 12198 4242 1945 6347 6981 6959 3500
9478C500l448K885J075l770J737j98r90p178j836L685J43P2N235q144p7P760J033
$$ 3500 52 2937 4012 242 1979 1781 791 -6387 -8223 -4538 -4395 -4323 912 -7232 -7309 451 1484
9461A484n027K062k284J762K472K201o935j4610L876J2040O523J771m8q496j94
$$ 1484 -3543 -1481 -3765 -2003 469 2670 -4265 -18875 -14999 -2959 3564 5335 5287 -3209 -3403
9446c403k436L399Q467M077J1684j1430j4550J006N777J858l003j4454l497N186
$$ -3403 -5839 -2440 6027 10104 21788 10358 -4192 -3186 2591 4449 1446 -13008 -16505 -11319
9432a1319O729N98l003K504m147j532J1490J5474m892r54k374p079K616J476j803
$$ -11319 -4590 -3992 -6995 -4491 -8638 -10170 1320 16794 11902 10948 8574 1495 4111 5587 3784
9417C784L755k081j6934J839L848J654J0514J4817l420n138l222j1214j1739k444
$$ 3784 7539 5458 -11476 -9637 -5789 -4135 6379 21196 17776 12638 9416 -1798 -13537 -15981
9403a5981J652P360Q704n133n999M700K452P068k020q225l422o057P350N487k841
$$ -15981 -14329 -6969 1735 -3398 -9397 -4697 -2245 4823 2803 -5422 -8844 -14901 -7551 -2064 -4905
9388d905N402J730p359o798n24J0067K168j094J25N42o138r370P606Q377m756
$$ -4905 497 2227 -5132 -11930 -12454 -2387 -219 -1313 -1188 -646 -6784 -16154 -8548 -171 -4927
9373d927m461n03R054P569n16p824o126j0134N851R426L841k505k408K488M437
$$ -4927 -9388 -9891 -837 6732 6216 -1608 -7734 -17868 -12017 -2591 1250 -1255 -3663 -1175 3262
9358C262O336K838M013K386j2193k306P497j1031l34k948r60L23k69n098m165
$$ 3262 9598 12436 16449 18835 6642 4336 11833 802 468 -2480 -3440 -3117 -3386 -8484 -12649
9343a2649M09O1q229k932N376R841K883J43j244j457k793l649l18J6309k739l689
$$ -12649 -12240 -12179 -20408 -23340 -17964 -8123 -5240 -5097 -6341 -7798 -10591 -14240 -14558 1751 -988 -4677
9327d677K555q363O453Q123n276o8K900n745O93q60L818M348K33q8o779m998Q932
$$ -4677 -2122 -10485 -4032 4091 -1185 -1253 1647 -4098 -3405 -4265 -447 3901 4134 4046 -2733 -7731 1201
9310A201J706l8n4J784J330j0579J96O92K619O98o190p247R010K547k091J6343
$$ 1201 2907 2869 2815 4599 5929 -4650 -4454 -3762 -1143 -445 -6635 -13882 -4872 -2325 -4416 11927
9294A1927O64R4l148k930L232M285j1264m584p464L259O034Q299k953p786p992
$$ 11927 12591 12685 9537 6607 9839 14124 2860 -1724 -9188 -5929 105 8404 5451 -2335 -10327
9279a0327l505O096K683K768K65m120K813K585l701q97k209K916O23j49m935m098
$$ -10327 -13832 -7736 -5053 -2285 -2020 -6140 -3327 -742 -4443 -5340 -7549 -4633 -4010 -4159 -9094 -13192
9263a3192R500N116N64L254p973p604Q727p178p560j510J3598O563n940r276O705
$$ -13192 -3692 1424 1988 5242 -2731 -10335 -1608 -8786 -16346 -17856 -4258 2305 -3635 -12911 -6206
9248f206p32m063l883J1216J0720J556J821J040J747o586o367j794N146j222n857
$$ -6206 -6938 -11001 -14884 -3668 7052 8608 10429 11469 13216 6630 263 -1531 3615 2393 -3464
9233c464k467k854m499J0978N272q618P601J0330j878m409o325k260q132k66q12
$$ -3464 -5931 -8785 -13284 -2306 2966 -5652 1949 12279 10401 5992 -333 -2593 -10725 -10991 -11803
9218a1803M443L794p412R824L832o42m865Q8M194k935j133k771K381P309N039
$$ -11803 -7360 -3566 -10978 -1154 2678 2036 -2829 -2741 1453 -1482 -2615 -5386 -3005 4304 9343
9203I343n560n539K968J1898P634K499j0586j591J3104j1116k908J03N30L781
$$ 9343 3783 -1756 1212 13110 20744 23243 12657 11066 24170 13054 10146 10249 10779 14560
9189A4560J081p742P747k064j2908K917L876k24J562p847j424o165N729n55L115
$$ 14560 15641 7899 15646 13582 674 3591 7467 7243 8805 958 -466 -6631 -902 -1457 1658
9174A658j377m276p230J120n20P378p108J562P471M41P901J267k738k912q341
$$ 1658 281 -3995 -11225 -10105 -10625 -3247 -10355 -8793 -1322 -881 7020 8287 5549 2637 -5704
9159e704K677O796k503j035l425O590m484O279l25M085P910K28j404p194n147
$$ -5704 -3027 3769 1266 231 -3194 3396 -1088 5191 4866 8951 16861 17089 15685 8491 3344
9144C344l139M055k140n527m21o167r414q233J2786J1549R607N893o530Q80j389
$$ 3344 205 4260 2120 -3407 -3828 -9995 -19409 -27642 -14856 -3307 6300 12193 5663 6543 5154
9129E154J338O864L491l566J4539J870r612j752q14r124m804n177q889J1277O799
$$ 5154 6492 13356 16847 13281 27820 29690 20078 18326 17512 8388 3584 -1593 -10482 795 7594
9114G594K862l230n486n19L465k011q999p460l774J5783K783l253m393M49K847
$$ 7594 10456 7226 1740 1221 4686 2675 -6324 -13784 -17558 -1775 1008 -2245 -6638 -6189 -3342
9099c342r322O28L702K553J701n450R922O284j1557j0249J3855J2391j046o954
$$ -3342 -12664 -12036 -8334 -5781 -4080 -9530 392 6676 -4881 -15130 -1275 11116 10070 3116
9085C116K966J628m421l346j376N825m469p608M881L836L095N555j687J41n360
$$ 3116 6082 7710 3289 -57 -1433 4392 -77 -7685 -2804 1032 4127 9682 7995 8136 2776
9070B776n143j0700n086o6l22Q38k227l335K328J0476J2515N639J96R04j0470
$$ 2776 -2367 -13067 -18153 -18219 -18541 -17703 -19930 -23265 -20937 -10461 2054 7693 7889 8793 -1677
9055a677r842o373J1383J5063n804o817l1K954J116j1980N331K540J334P322m298
$$ -1677 -11519 -17892 -6509 8554 2750 -4067 -4098 -1144 -28 -12008 -6677 -4137 -2803 4519 221
9040B21n044j811L318O169L331J348k755j937Q27K336o349p210O335k508j887
$$ 221 -4823 -6634 -3316 2853 6184 7532 4777 2840 3667 6003 -346 -7556 -1221 -3729 -5616
9025e616j739P674n026j543Q394J965o355m612P350q390L633O028J808p547k750
$$ -5616 -7355 319 -4707 -6250 2144 4109 -2246 -6858 492 -7898 -4265 1763 3571 -3976 -6726
9010f726p17l675M438J796K164K053m119o526K159Q011l24N566Q381K29l193K79
$$ -6726 -7443 -11118 -6680 -4884 -2720 -667 -4786 -11312 -9153 -1142 -1466 4100 12481 12710 9517 9796
8994I796r175K190l136n779K754l4o62P734J484n921n358l203k11N878K593m709
$$ 9796 621 2811 -325 -6104 -3350 -3384 -4046 3688 5172 -749 -6107 -9310 -9521 -3643 -1050 -5759
8978e759L600O400R55Q068k447n087p935j666K576L91N138k783p104r401l494
$$ -5759 -2159 4241 5196 13264 10817 5730 -2205 -3871 -1295 -904 4234 1451 -5653 -15054 -18548
8963a8548J6025k788j236Q568J4207N755q686j1615k836J0548O522j0659n934
$$ -18548 -2523 -5311 -6547 2021 16228 21983 13297 1682 -1154 9394 15916 5257 -677
8950f77l02L040M50j0519K681O212j736K483N144o712K405k107j975n946L91Q679
$$ -677 -979 2061 2511 -8008 -5327 885 -851 1632 6776 64 2469 362 -1613 -7559 -7168 1511
8934A511j0637N401M790k179N231l666n093M88L075j689m014Q26J1713R293k488
$$ 1511 -9126 -3725 1065 -1114 4117 451 -4642 -4154 -1079 -2768 -6782 -5956 5757 15050 12562
8919A2562k081N013N332j495j910j1475k731p864o960R38J285l736N642p8j371
$$ 12562 10481 15494 20826 19331 17421 5946 3215 -4649 -11609 -10671 -9386 -13122 -7480 -7558 -8929
8904h929q395o92N880j424L431o315n052J3086Q95K837J0018P019K976m835m516
$$ -8929 -17324 -18016 -12136 -13560 -10129 -16444 -21496 -8410 -7515 -4678 5340 12359 15335 10500 5984
8889E984k247k123j3643J214J4032L640o146m743K235L867o74l639K741P57M345
$$ 5984 3737 1614 -12029 -10815 3217 6857 711 -4032 -1797 2070 1396 -2243 498 1255 5600
8874E600m548o163j594m439l34O079P488k523M81K89O610o51J708L684l41p467
$$ 5600 1052 -5111 -6705 -11144 -11478 -5399 2089 -434 47 336 6946 6295 8003 11687 11346 3879
8858C879m160j394M146R86j582j2222K2q25o328L192J230N115j361O039K730n42
$$ 3879 -281 -1675 2471 3457 1875 -10347 -10325 -11150 -17478 -14286 -13056 -7941 -9302 -3263 -533 -1075
8842a075j024J941l382k456p921l255Q173l767n615o00Q795M654P656q758m459
$$ -1075 -2099 -158 -3540 -5996 -13917 -17172 -8999 -12766 -18381 -18981 -10186 -5532 2124 -6634 -11093
8827a1093o87N383Q940N99r549J806M056M46r538m709L499Q243M377n302n741
$$ -11093 -11780 -6397 2543 3142 -6407 -4601 -545 -99 -9637 -14346 -10847 -2604 1773 -3529 -9270
8812i270K171J2750J0266l193q349n966Q10O125Q084K629q590J872J0438j1873
$$ -9270 -7099 5651 15917 12724 4375 -1591 -781 5344 13428 16057 7467 9339 19777 7904
8798G904n434O17M666L865M167k18k68j2933j0879P612P772N798J163J779n71
$$ 7904 2470 3087 7753 11618 15785 15567 15299 2366 -8513 -901 6871 12669 13832 15611 15040
8783A5040j5668l362M497k521n294M78J041L828J0083L749o275m498K918k420
$$ 15040 -628 -3990 507 -2014 -7308 -6830 -5789 -1961 8122 11871 5596 1098 4016 1596
8769A596p2R146j1455k120k70p373N790O948L043j402j40n579j785N739J965l688
$$ 1596 1524 10670 -785 -2905 -3175 -10548 -4758 2190 5233 3831 3691 -1888 -3673 2066 4031 343
8753C43m029J472j475O950J1322P15q937j8923O17Q141O545l411j3626K725M499
$$ 343 -3686 -2214 -3689 3261 14583 15298 6361 -12562 -11945 -3804 2741 -670 -14296 -11571 -7072
8738g072M521j060k276j0736R3J5842P933j220j65M216n676j847K946L946K584
$$ -7072 -2551 -3611 -5887 -16623 -16530 -688 7245 6025 5860 10076 4400 2553 5499 9445 12029
8723A2029k412J073o07l973k489j17Q04K529P36R22p753n850O92N892m766M144
$$ 12029 9617 10690 10083 6110 3621 3504 4308 6837 7573 8495 742 -5108 -4416 1476 -3290 854
8707H54j003K904m106o709n650r93j287M080P698k233j018J584Q044j649l900
$$ 854 -149 2755 -1351 -8060 -13710 -14703 -15990 -11910 -4212 -6445 -7463 -5879 2165 516 -3384
8692c384k561P836P533r485q396J369Q98J466L419q62Q4J508Q422J133J5244l063
$$ -3384 -5945 1891 9424 -61 -8457 -7088 -6190 -4724 -1305 -2167 -2083 -575 7847 8980 24224 21161
8676B1161n605o93N76j081l681n322o010k943N560L231P75p893p57L768L818L852
$$ 21161 15556 14863 15439 14358 10677 5355 -655 -3598 1962 5193 5968 -1925 -2682 1086 4904 8756
8660H756L479l492j4094l035R519M951P25J32l614n428q040O002p02o875J458
$$ 8756 12235 8743 -5351 -8386 1133 6084 6809 6941 3327 -2101 -10141 -4139 -4841 -11716 -10258
8645a0258O344L037N074j318J660N613P45J393m191q5r455M44n571l723K142M403
$$ -10258 -3914 -877 4197 2879 4539 10152 10897 12290 8099 8014 -1441 -997 -6568 -10291 -8149 -3746
8629c746P039J2701O144k390j0510r179K613j361N698l720o124J215L142r34j901
$$ -3746 3293 15994 22138 19748 9238 59 2672 1311 7009 3289 -2835 -1620 1522 588 -1313
8614a313n225L170Q308M49P09l524n576P139M572oN184l691l953m557j0305L038
$$ -1313 -6538 -3368 4940 5389 6098 2574 -3002 4137 8709 8703 13887 10196 6243 1686 -8619 -5581
8598e581O340m288J307J0252O317l517q767j756J0918m517j2078j432l241N585
$$ -5581 759 -3529 -2222 8030 14347 10830 2063 307 11225 6708 -5370 -6802 -10043 -4458
8584d458K418K152m404K045N060J319L967n487j0103l669J669J1116J539l203
$$ -4458 -2040 112 -4292 -2247 2813 4132 8099 2612 -7491 -11160 -9491 1625 3164 -39
8570c9P44K355l487k261l620n96L82J0262K555q225j2172K15M343M829J0000k0
$$ -39 705 3060 -427 -2688 -6308 -6904 -6522 3740 6295 -1930 -14102 -13887 -9544 -4715 5285 5265
8554E265K64l01r1J0447l51j120J944l924n490l707j831M897J826n086L017O002
$$ 5265 5529 5228 5137 15584 15233 14113 16057 12133 6643 2936 1105 6002 7828 2742 5759 11761
8538A1761j210j1384n664P005N639o558k674n03j169Q657N581o194j1653p145
$$ 11761 10551 -833 -6497 508 6147 -411 -3085 -3588 -4757 3900 9481 3287 -8366 -15511
8524a5511J273P097j510J795n505P031j017n070J0485O627l529m190j0534L144
$$ -15511 -14238 -7141 -8651 -6856 -12361 -5330 -6347 -11417 -932 5695 2166 -2024 -12558 -9414
8510i414Q187l45K787r66l453p790n917N393P122P709p66J454J928l802L132l214
$$ -9414 -1227 -1572 1215 249 -3204 -10994 -16911 -11518 -4396 3313 2547 4001 5929 2127 5259 2045
8494B045J935n617q814J0227P461r299n75q613j300J517k807L677O92L393K236
$$ 2045 3980 -1637 -10451 -224 7237 -2062 -2637 -11250 -12550 -11033 -13840 -10163 -9471 -6078 -3842
8479c842l933K558K10M762L437r02p258L670N28k072J278L12l383J599n255K141
$$ -3842 -7775 -5217 -5007 -245 3192 2290 -4968 -1298 -770 -2842 -1564 -1252 -4635 -3036 -8291 -6150
8463f150L009N468P482R298Q04l751k840o89n631m225j1316l540Q761M054O611
$$ -6150 -3141 2327 9809 19107 19911 16160 13320 12631 7000 2775 -8541 -12081 -3320 734 7345
8448G345k932j732N833j361l522k441J1397O681O407l934r010J315L006M481r44
$$ 7345 4413 2681 8514 7153 3631 1190 12587 19268 25675 21741 12731 14046 17052 21533 20589
8433B0589q105l776P963q37q100o367L210N43J623L68l57K840O669n372o962p645
$$ 20589 12484 8708 16671 15834 7734 1367 4577 5120 6743 7111 6754 9594 16263 10891 3929 -3716
8417c716l297M798k666M997N845l176k37L581N403N733k695q20J193p742m088
$$ -3716 -7013 -2215 -4881 116 5961 2785 2548 6129 11532 17265 14570 13750 14943 7201 3113
8402C113N997K731N231k38k157j1202j5544k265L955M947O326O684l557m137K493
$$ 3113 9110 11841 17072 16834 14677 3475 -12069 -14334 -10379 -5432 894 7578 4021 -116 2377
8387B377P249k567m477K206K291l398j075o13q49J082l81j0461n094N984M835
$$ 2377 9626 7059 2582 4788 7079 3681 2606 1993 1144 2226 1845 -8616 -13710 -7726 -2891
8372b891n87l567K866m150o084J030P182o181m766J4390L133q402n829J274J332
$$ -2891 -3478 -7045 -4179 -8329 -14413 -13383 -6201 -12382 -17148 -2758 375 -8027 -13856 -12582 -11250
8357a1250Q124m493n726O386o68j839P158k116m400O727P775j96r810m302K961
$$ -11250 -3126 -7619 -13345 -6959 -7627 -9466 -2308 -4424 -8824 -2097 5678 5482 -4328 -8630 -5669
8342e669k316k807j884N919K563O201k798l558N022J762q808l708J93l074j897
$$ -5669 -7985 -10792 -12676 -6757 -4194 2007 -791 -4349 673 2435 -6373 -10081 -9888 -12962 -14859
8327a4859k9K588N380r29m521M81M616R80L810n542j294K999N152P463J2491p82
$$ -14859 -14888 -12300 -6920 -7849 -12370 -11889 -7273 -6293 -2483 -8025 -9319 -6320 -1168 6295 18786 18004
8311A8004N280o723p802q264m392M880q10p70O287p942q41k661M501O76n551q5
$$ 18004 23284 16561 8759 495 -3897 983 173 -597 5690 -2252 -3093 -5754 -1253 -577 -6128 -6213
8295f213m624n134K557l263M85m075k003R815m690l136M774Q207Q706J1395j932
$$ -6213 -10837 -15971 -13414 -16677 -16192 -20267 -22270 -12455 -17145 -20281 -15507 -7300 1406 12801 10869
8280A0869m930M742O19L277L039J34L78j164o787j3594l737J631m360Q25l060
$$ 10869 5939 10681 11300 14577 17616 17750 18128 16964 10177 -3417 -7154 -5523 -9883 -9058 -12118
8265a2118L455R707j739q670J975J494o608q99N943K636J779N936n37J962N231
$$ -12118 -8663 1044 -695 -9365 -7390 -5896 -12504 -13403 -7460 -4824 -3045 2891 2354 4316 9547
8250I547M95j590M699r248j4879j0316n861Q233P160P132P196m756n426o513K168
$$ 9547 10042 8452 13151 3903 -10976 -21292 -27153 -18920 -11760 -4628 2568 -2188 -7614 -14127 -11959
8235a1959O309p816L198N251n105r204l958J3359P834L841j01j473m801l109P724
$$ -11959 -5650 -13466 -10268 -5017 -10122 -19326 -23284 -9925 -2091 1750 1649 176 -4625 -7734 -10
8220a0L845k143L06p1Q900J65j1724j149q960M404Q267m99j0765j100O73K104
$$ -10 3835 1692 1998 1927 10827 10992 -732 -1881 -10841 -6437 1830 1331 -9434 -10534 -9861 -7757
8204g757P037n260j839m552L190Q706k834O586m59j55j3929q916P731J662J352
$$ -7757 -720 -5980 -7819 -12371 -9181 -475 -3309 3277 2818 2663 -11266 -20182 -12451 -10789 -9437
8189i437L135O16p863Q154O428l740Q07k899k250R148J0650J545j513n346m450
$$ -9437 -6302 -5686 -13549 -5395 1033 -2707 -1900 -4799 -7049 2099 12749 14294 12781 7435 2985
8174B985M441N511K217K68m647m880l929K422j109r727k775R799L810n552m945
$$ 2985 7426 12937 15154 15422 10775 5895 1966 4388 3279 -6448 -9223 576 4386 -1166 -6111
8159f111p167J3430K539q53m200q260K482n935R289Q459j147l898n546L100n09
$$ -6111 -13278 152 2691 1838 -2362 -10622 -8140 -14075 -4786 3673 2526 -1372 -6918 -3818 -4327
8144d327L413M419m838j3200M509P254k795j3908N468J4216K527r670K139j069
$$ -4327 -914 3505 -1333 -14533 -10024 -2770 -5565 -19473 -14005 211 2738 -6932 -4793 -5862
8130e862k993O317k324J0812L859p891k828m028M82k232n337M57M802O749k334
$$ -5862 -8855 -2538 -4862 5950 9809 1918 -910 -4938 -4456 -6688 -12025 -11568 -6766 -17 -2351
8115b351j1505q479K887L261J528K848p61P142N819J402l229n627o683K375R10
$$ -2351 -13856 -22335 -19448 -16187 -14659 -11811 -12572 -5430 389 1791 -1438 -7065 -13748 -11373 -10463
8100a0463j921Q931L878M258k157m795k659q79N599L415p040L436k19o324J36
$$ -10463 -12384 -3453 425 4683 2526 -2269 -4928 -5807 -208 3207 -3833 -397 -616 -6940 -6804
8085f804M300M201l956m37l244j635j865N27Q618N587L426K073n806j553j080
$$ -6804 -2504 1697 -2259 -2696 -5940 -7575 -9440 -8913 -295 5292 8718 10791 4985 3432 2352
8070B352J20p804q086P493R750m548m537R764K44j488M676j503L218o084j189
$$ 2352 2472 -5332 -13418 -5925 3825 -723 -5260 4504 4748 3260 7936 6433 9651 3567 2378
8055B378K30J1641m539n807P964P31o006m909N06p373R903Q824R40N424K248n040
$$ 2378 2608 14249 9710 3903 11867 12598 6592 1683 2189 -5184 4719 13543 14483 19907 22155 17115
8039A7115o083j2069J124J4363M231j0972j27J1216J24o626J747k655q897r65
$$ 17115 11032 -1037 87 14450 18681 7709 7582 18798 18922 12296 14043 11388 2491 1526
8025A526j951J452pj040J94J192o541k398Q870J0161l132m417k230n1r300k91
$$ 1526 -425 1027 1020 -20 174 1366 -5175 -7573 1297 11458 8326 3909 1679 1628 -7672 -7963
8009g963J232j256K23L837n338p481k714O195O477r83p991R119M075P146K951
$$ -7963 -6731 -7987 -7764 -3927 -9265 -16746 -19460 -13265 -6788 -7771 -15762 -6643 -2568 4578 7529
7994G529j0558j2640L273j658P985L094J848j413M527Q521L800K019l078q790
$$ 7529 -3029 -15669 -12396 -14054 -6069 -2975 -1127 -2540 1987 10508 14308 16327 13249 4459
7980D459m968m706L054L089j1253J199J0320k071L97L977J0771K349m736n181
$$ 4459 -509 -5215 -2161 928 -10325 -9126 1194 -877 -480 3497 14268 16617 11881 6700
7966F700p597q463l456K824L515M111n399M329P333M34j143o439m165j714L522
$$ 6700 -897 -9360 -12816 -9992 -6477 -2366 -7765 -3436 3897 4331 3188 -3251 -7416 -9130 -5608
7951e608L413j456k201r3M54m302J515M193j74K59q282K369P934J196K553pJ763
$$ -5608 -2195 -3651 -5852 -5945 -5491 -9793 -8278 -4085 -4259 -4000 -12282 -9913 -1979 -783 1770 1763 3526
7934C526K169k064K555p985l557R55M722P84m838l075k925O933Q805N288o458
$$ 3526 5695 3631 6186 -1799 -5356 -4401 321 1105 -3733 -6808 -9733 -2800 6005 11293 4835
7919D835q574l143R53ro608K554P706J1975j240K292q414j3751l911L779J4691
$$ 4835 -3739 -6882 -5929 -5938 -12546 -9992 -2286 9689 8449 10741 2327 -11424 -15335 -11556 3135
7904C135K975l039p655J342n550P969J4240L593j3470p649J083k180j273L91K961
$$ 3135 6110 3071 -4584 -3242 -8792 -823 13417 17010 3540 -4109 -3026 -5206 -6479 -6088 -3127
7889c127M915J658p040j1246K951O129K716J587n754M367P601k391L975p940o135
$$ -3127 1788 3446 -3594 -14840 -11889 -5760 -3044 -1457 -7211 -2844 4757 2366 6341 -1599 -7734
7874g734J9k144K358m039l85m42l902m291L244J0091M073n18N99J470R277J5687
$$ -7734 -7715 -9859 -7501 -11540 -11925 -12367 -16269 -20560 -17316 -7225 -3152 -3670 -3071 -1601 7676 23363
7858B3363K761j2275l903o157r29j693L651O24n380K12O596j288L27O05k275j0540
$$ 23363 26124 13849 9946 3789 2860 1167 4818 5442 62 274 6870 5582 5909 6514 4239 -6301
7842f301K706o523K543k336O728K814Q57P201m331o334L456M566r98k338j563
$$ -6301 -3595 -10118 -7575 -9911 -3183 -369 488 7689 3358 -2976 480 5046 4048 1710 147
7827A47m542N147N93O882N643L833j756m294j975m563j66m176K243L814l16j193
$$ 147 -4395 752 1345 8227 13870 17703 15947 11653 9678 5115 4949 773 3016 6830 6514 5321
7811E321p82K098q967k189q78K449R638L120m723k447L350j0543k192J456m405
$$ 5321 4539 6637 -2330 -4519 -5397 -2948 6690 9810 5087 2640 5990 -4553 -6745 -5289 -9694
7796i694j659K487l909L177P194j447m794J976M962Q494o903j2519J852q46l596
$$ -9694 -11353 -8866 -12775 -9598 -2404 -3851 -8645 -6669 -1707 6787 -116 -12635 -10783 -11629 -15225
7781a5225r00k714L619k947L946M942n65J231N191O050m61K093N39m192n74J766
$$ -15225 -16125 -18839 -15220 -18167 -14221 -9279 -9844 -8613 -3422 2628 2167 4260 4799 607 33 1799
7765A799l562j5949n372J2178l23n403q369K996J2780J0115N681L292j2990n672
$$ 1799 -1763 -17712 -23084 -10906 -11229 -16632 -25001 -22005 -9225 890 6571 9863 -3127 -8799
7751h799J1200K061j422K48n965k053J2651o345m685K142j239O749m71o495J93
$$ -8799 2401 4462 3040 3288 -2677 -4730 7921 1576 -3109 -967 -2206 4543 4072 -2423 -2230
7736b230N513L693m356o576K050O574o008n73o537J2087J8480j160j1504j0350
$$ -2230 3283 6976 2620 -3956 -1906 4668 -1340 -1913 -8450 3637 22117 20957 9453 -897
7722h97M627J176n591L950N546l068r19p001p926K537J102k689j977P836L940
$$ -897 3730 4906 -685 3265 8811 5743 4824 -2177 -10103 -7566 -6464 -9153 -11130 -3294 646
7707F46r81L778r939J795N767j2087j1483J459P305R805P81j841R73l300j834
$$ 646 -335 3443 -6496 -4701 1066 -11021 -22504 -21045 -13740 -3935 -3154 -4995 -4022 -7322 -9156
7692i156N848J650M374J70o154m943J97M310J936K324l270j148q151P79J1798
$$ -9156 -3308 -1658 2716 2886 -3268 -8211 -8014 -3704 -1768 556 -2714 -3862 -12013 -11234 564
7677E64L258m388n456n340q9N149K825l184j597m182R496N134Q83L517N925m459
$$ 564 3822 -566 -6022 -11362 -11451 -6302 -3477 -6661 -8258 -12440 -2944 2190 3073 6590 12515 8056
7661H056l006p044p527l625O239M725j797N25l653m112Q944J1181J730m145j827
$$ 8056 5050 -1994 -9521 -13146 -6907 -2182 -3979 -3454 -7107 -11219 -2275 8906 10636 6491 4664
7646D664K707L567l303M467j1327k200P465q738J882l681m477J654R715L797n08
$$ 4664 7371 10938 7635 12102 775 -1425 6040 -2698 -816 -4497 -8974 -7320 2395 6192 5684
7631E684k087j898N05M499L410l264p903n451o847K886J92j430J087N985M31Q039
$$ 5684 3597 1699 2204 6703 10113 6849 -1054 -6505 -13352 -10466 -10274 -11704 -10617 -4632 -4201 3838
7615C838M793k507O35j810R93j0449P379M373k332J462j122K645R944P010j1683
$$ 3838 8631 6124 6759 4949 5942 -4507 2872 7245 4913 6375 5253 7898 17842 24852 13169
7600A3169j6357J449L074M396J83P67k127L512P032m855n772L488M304j490l558
$$ 13169 -3188 -1739 1335 5731 5914 6681 4554 8066 15098 10243 4471 7959 12263 10773 7215
7585G215m51m848M69k682K637L778M72M04j3150L910L502r37m30j989n939o80
$$ 7215 6764 1916 2385 -297 2340 6118 6590 6994 -6156 -2246 1256 319 -111 -2100 -8039 -8719
7569h719M820O667m78L417J572j1952p927J1154J0151k234m665p772J996q721
$$ -8719 -3899 2768 2290 5707 7279 -4673 -12600 -1446 8705 6471 1806 -5966 -3970 -12691
7555a2691l142R885j359Q862j237r390n430j174P071J2143l143N8n579m555j2273
$$ -12691 -15833 -5948 -7307 1555 318 -9072 -14502 -15676 -8605 3538 395 453 -5126 -9681 -21954
7540b1954L69P632J0816m818l457J0311Q728o148p401K398J865L24N880q863m012
$$ -21954 -21585 -13953 -3137 -7955 -11412 -1101 7627 1479 -5922 -3524 -1659 -1335 4545 -4318 -8330
7525h330L085P853m224j938M70N284k633p316L404P339P965m777j0858l126p899
$$ -8330 -5245 2608 -1616 -3554 -3084 2200 -433 -7749 -4345 2994 10959 6182 -4676 -7802 -15701
7510a5701P059n726L559M261p911Q233o059j1K273j416M330L162M918L769J725
$$ -15701 -8642 -14368 -10809 -6548 -14459 -6226 -12285 -12296 -10023 -11439 -7109 -3947 971 4740 6465
7495F465Q300q548r258q626N68O09O942J0083n875q806q074N750K499J3384J538
$$ 6465 14765 6217 -3041 -11667 -11099 -10490 -3548 6535 660 -8146 -16220 -10470 -7971 5413 6951
7480F951r465J470k563L189J1518l609j4408J951j73k525K42j701m969Q756K995
$$ 6951 -2514 -1044 -3607 -418 11100 7491 -6917 -4966 -5139 -7664 -7422 -9123 -14092 -5336 -2341
7465b341K516m241L494r57M697m710n929k710J030L306Q386K434j0027n773J192
$$ -2341 175 -4066 -572 -1529 3168 -1542 -7471 -10181 -9151 -5845 2541 4975 -5052 -10825 -9633
7450i633o126n27L098J3639L96m053r83K367R842L85k553K09o130l024J658l713
$$ -9633 -15759 -16286 -13188 451 847 -3206 -4189 -1822 8020 8405 5852 6061 -69 -3093 -1435 -5148
7434e148k314J600K88J931O104M315L726O252K457m19m648k668k726k824r001
$$ -5148 -7462 -5862 -5574 -3643 2461 6776 10502 16754 19211 18792 14144 11476 8750 5926 -3075
7419c075j440L548J100q554k894j890N20M593Q335K675o373k84o122k257O443
$$ -3075 -4515 -967 133 -8421 -11315 -13205 -12685 -8092 243 2918 -3455 -3739 -9861 -12118 -5675
7404e675J0197l875j0874j957R482M607O162j686m727m876K439J2045K057l683
$$ -5675 4522 647 -10227 -12184 -2702 1905 8067 6381 1654 -3222 -783 11262 13319 9636
7390I636m009M734J370k529k701n984r272m72Q66J99l691O203J50q460K324Q532
$$ 9636 5627 10361 11731 9202 6501 517 -8755 -9227 -8361 -8162 -11853 -5650 -5500 -13960 -11636 -3104
7374c104J122L84M563J889p334K865o68M108M643j640o725r279Q41K066j11r28
$$ -3104 -1982 -1598 2965 4854 -2480 385 -283 3825 8468 6828 103 -9176 -8335 -6269 -6380 -7308
7358g308M795l420j897N396Q239j3186q208j126O711J2792J0319p316k073Q937
$$ -7308 -2513 -5933 -7830 -2434 5805 -7381 -15589 -16715 -10004 2788 13107 5791 3718 12655
7344A2655k070l974m682M801m561N301Q39r957j132M347N723k929r083p538n196
$$ 12655 10585 6611 1929 6730 2169 7470 8309 -1648 -2780 1567 7290 4361 -4722 -12260 -17456
7329a7456p52l301N872L747M785K092J42r625J492N387R51J081k069Q688Q248
$$ -17456 -18208 -21509 -15637 -11890 -7105 -5013 -4871 -14496 -13004 -7617 -6666 -5585 -7654 1034 9282
7314I282O98M237R141j1500j2567l277p531o75P869j714r93J193j427N761P095
$$ 9282 9980 14217 23358 11858 -709 -3986 -11517 -12192 -4323 -6037 -7030 -5837 -7264 -1503 5592
7299E592K346j810m508L407J1923J010j3304p613j204N584Q610J873l603j178
$$ 5592 7938 6128 1620 5027 16950 17960 4656 -2957 -4161 1423 10033 11906 8303 7125
7285G125O466r732p581l404K560o51K170O637L493q676m494L648R423j756m000
$$ 7125 13591 3859 -3722 -7126 -4566 -5217 -3047 3590 7083 -1593 -6087 -2439 6984 5228 1228
7270A228rR349K447n331n210N752K293L746l731n022k128m044P573K305o12K83
$$ 1228 1219 10568 13015 7684 2474 8226 10519 14265 10534 5512 3384 -660 6913 9218 8606 8889
7254H889l391l246o342o223N656Q331q818j872K629M10L316M339Q052m351r073
$$ 8889 5498 2252 -4090 -10313 -4657 3674 -5144 -7016 -4387 -3977 -661 3678 11730 7379 -1694
7239a694l75j700M600O810K51l024j4419j0820R73R641J1439K15J827P322L332
$$ -1694 -2069 -3769 831 7641 7892 4868 -9551 -20371 -19398 -9757 1682 1897 3724 11046 14378
7224A4378M869r52p684n007l897l595L952R023O496o645j763K81J0732k023r795
$$ 14378 19247 18295 10611 5604 1707 -1888 2064 11087 17583 10938 9175 9456 20188 18165 8370
7209H370k427j982N485K034M514J92l655k12o011m633l103L721r832K679P305
$$ 8370 5943 3961 9446 11480 15994 16186 12531 12319 6308 1675 -1428 2293 -7539 -4860 2445
7194B445m590N067J436m322N487K131l54r216L596o219o202M957j762K218Q01
$$ 2445 -2145 2922 4358 36 5523 7654 7300 -1916 1680 -4539 -10741 -5784 -7546 -5328 -4527
7179d527k722l188L027J2900L29l596M859M536N621J824r189n813M75l15N361
$$ -4527 -7249 -10437 -7410 5490 5819 2223 7082 11618 17239 19063 9874 4061 4536 4221 9582
7164I582m309q935M558o809n728R048k14j307J689J678j093N693P336k188K09
$$ 9582 5273 -3662 896 -5913 -11641 -2593 -2807 -4114 -2425 -747 -1840 3853 11189 9001 9210
7149I210k478J277L761q355p303M121P96L222K761j442o376o059n056k833J1742
$$ 9210 6732 8009 11770 3415 -3888 233 1029 4251 7012 5570 -806 -6865 -11921 -14754 -3012
7134c012P245O39p021k486p877n695l488J300O373L560J5897J1567K37k114J605
$$ -3012 4233 4872 -2149 -4635 -12512 -18207 -21695 -20395 -14022 -10462 5435 17002 17239 15125 16730
7119A6730p895p50N193L432l812R83j247l463o021J557m44p69j991o357m883k848
$$ 16730 8835 8085 13278 16710 12898 13881 12634 9171 3150 4707 4263 3494 1503 -4854 -9737 -12585
7103a2585j64j472k290P595Q583R40M006n140p39j717j830j731m556P545O172
$$ -12585 -12749 -14221 -16511 -8916 -333 607 4613 -527 -1266 -2983 -4813 -6544 -11100 -3555 2617
7088B617k404j2008r57K284k306L071N218R67M816N740j701j970M536n211o994
$$ 2617 213 -11795 -12752 -10468 -12774 -9703 -4485 -3518 1298 7038 5337 3367 7903 2692 -4302
7073d302l899J300K269L511K755J42j074O61l520R363J0434n02Q35l772j0044
$$ -4302 -8201 -6901 -4632 -1121 1634 1776 702 1363 -2157 7206 17640 17138 17973 14201 4157
7058D157n365J235m313k566R916P048m538m604R71L813K812p619k461l093j496
$$ 4157 -1208 27 -4286 -6852 3064 10112 5574 970 1941 5754 8566 947 -1514 -4607 -6103
7043f103M630N855N721j0103p895P008J74N04J1L850P952N655Q369o18j4191j0586
$$ -6103 -1473 4382 10103 0 -7895 -887 -713 -209 -198 3652 11604 17259 25628 25010 10819 233
7027B33m477J676k215n088K390L420K979n148j3871O029J2134Q910J6899N147
$$ 233 -4244 -2568 -4783 -9871 -7481 -4061 -1082 -6230 -20101 -14072 -1938 6972 23871 29018
7013B9018o231m292n600k923p11n304p941L396M72m960M311J121j455N185O675
$$ 29018 22787 18495 12895 9972 9261 3957 -3984 -588 -116 -5076 -765 356 -1099 4086 10761
6998A0761j646R39O78j724k096j0630o014j849o136M823J2702J0958J641p074
$$ 10761 9115 10054 10732 9008 6912 -3718 -9732 -11581 -17717 -12894 -192 10766 12407 5333
6984E333j3395K005P211m425k844l223R343J0864R07j4562q946Q614Q336K752
$$ 5333 -8062 -6057 1154 -3271 -6115 -9338 5 10869 11776 -2786 -11732 -3118 5218 7970
6970G970j2134n903j193J3253J6291o844j1378n977n150M920J2010J706m60n31
$$ 7970 -4164 -10067 -11260 1993 18284 11440 62 -5915 -11065 -6145 5865 7571 7111 6580
6956F580k454r913l720Q471K108L910j494r565j867K773J020O591Q069n035m932
$$ 6580 4126 -5787 -9507 -1036 1072 4982 3488 -6077 -7944 -5171 -4151 2440 10509 5474 542
6941E42o005k133J1986K984K529j852j2101K301K800k763L907R762l852j915K868
$$ 542 -5463 -7596 4390 7374 9903 8051 -4050 -1749 1051 -1712 2195 11957 8105 6190 9058
6926I058j388q178j682N488k621p49P328q771q556Q441J2233n392n555Q89M74
$$ 9058 7670 -508 -2190 3298 677 -72 7256 -1515 -10071 -1630 10603 5211 -344 545 1019
6911A019Q69M408n114l113J415l852L813O489J423m021m167j457m756l182K668
$$ 1019 1888 6296 1182 -1931 -516 -4368 -555 5934 7357 3336 -831 -2288 -7044 -10226 -7558
6896g558M709P240N245L213n983n176m010J606r40Q993P289o413q426k814N627
$$ -7558 -2849 4391 9636 12849 6866 1690 -2320 -714 -1654 7339 14628 8215 -211 -3025 2602
6881B602L06l185o491J824L475l777J160M02o352N003k55R053O287M342M999p714
$$ 2602 2908 -277 -6768 -4944 -1469 -5246 -4086 -3684 -10036 -5033 -5288 3765 10052 14394 19393 11679
6865A1679p928q412m595k319N41L767L010J947j2R75J0086m125m4m874r38n364
$$ 11679 3751 -4661 -9256 -11575 -11034 -7267 -4257 -2310 -2322 -1347 8739 4614 4570 -304 -1242 -6606
6849f606r714J1473O240m024q495J187J2871j721N810J947m275p998J238k985
$$ -6606 -16320 -4847 1393 -2631 -11126 -9939 2932 1211 7021 8968 4693 -3305 -2067 -5052
6835e052p424n188m481Q373K026M578R86m004J426J926J8798p74n291N56j2505
$$ -5052 -12476 -17664 -22145 -13772 -11746 -7168 -6182 -10186 -8760 -6834 11964 11190 5899 6455 -6050
6820f050l01M51n023Q579N209o286p860l289O775J1223m728L600M876L134N176
$$ -6050 -6351 -5900 -10923 -2344 2865 -3421 -11281 -14570 -7795 3428 -1300 2300 7176 10310 15486
6805A5486K089m271j6455n71k67K028o817Q334P012J921J402o440j3344O761p08
$$ 15486 17575 13304 -3151 -3722 -3989 -1961 -8778 -444 6568 8489 9891 3451 -9893 -3132 -3840
6790c840N580P46l331P036m559o310L648J0486q145l430k298L588Q414k950m856
$$ -3840 1740 2486 -845 6191 1632 -4678 -1030 9456 1311 -2119 -4417 -829 7585 4635 -221
6775b21q911m132l409J140P177Q935N527p304L252j024p389l404P585J163q033
$$ -221 -9132 -13264 -16673 -15533 -8356 579 6106 -1198 2054 1030 -6359 -9763 -2178 -1015 -9048
6760i048r499j642k927L572J4467R267J1049l280r336J534p099k225j88O366l86
$$ -9048 -18547 -20189 -23116 -19544 -5077 4190 15239 11959 2623 4157 -2942 -5167 -5355 1011 625
6745F25L386p36k387O803q64k363k686l822j274Q229O327N588k378k169K627k328
$$ 625 4011 3275 888 7691 6827 4464 1778 -2044 -3318 4911 11238 16826 14448 12279 14906 12578
6729A2578l807L062m46j0750k914r606o722J2923J6811l469q494k48o49k372j055
$$ 12578 8771 11833 11387 637 -2277 -11883 -18605 -5682 11129 7660 -834 -1082 -1731 -4103 -5158
6714e158o038O953J1600k241k822N490k515k752p903l930R022k996m893P307M949
$$ -5158 -11196 -4243 7357 5116 2294 7784 5269 2517 -5386 -9316 -294 -3290 -8183 -876 4073
6699D073J409j0077r081o359M584P912M29M000r85r75K156P626j650K907L079
$$ 4073 5482 -4595 -13676 -20035 -15451 -7539 -7110 -3110 -4095 -5070 -2914 4712 3062 5969 9048
6684I048L399R99n177k000o067O11o23J775O822k844n35q43j2286L100N717m561
$$ 9048 12447 13446 8269 6269 202 813 190 1965 8787 5943 5408 4565 -7721 -4621 1096 -3465
6668c465k087O820j433j229n012n577N080L002k520K108J5478k597j0351j612
$$ -3465 -5552 1268 -165 -1394 -6406 -11983 -6903 -3901 -6421 -4313 11165 8568 -1783 -3395
6654c395l75r63o913j631P324Q804O111K235k713q597n497n113J676L733O800
$$ -3395 -3770 -4733 -11646 -13277 -5953 2851 8962 11197 8484 -113 -5610 -10723 -9047 -5314 1486
6639A486l055O852K81k848K382R54M964l352k264l844L182M353K337j771r595
$$ 1486 -1569 5283 5564 2716 5098 6052 11016 7664 5400 1556 4738 9091 11428 9657 62
6624F2m727J078L69J654m736l355Q17m875k595j681N670O452N511K720l249K053
$$ 62 -4665 -3587 -3218 -1564 -6300 -9655 -8838 -13713 -16308 -17989 -12319 -5867 -356 2364 -885 1168
6608A168K339p492R252o431k337R694k026J641m800l519M52M81n92K306J580J216
$$ 1168 3507 -3985 5267 -1164 -3501 6193 4167 5808 1008 -2511 -2059 -1578 -2170 136 1716 2932
6592B932M23P99p74r907K434j0494O30K333J2980N688K746P83p192r382j038q23
$$ 2932 3355 4154 3380 -6527 -4093 -14587 -13957 -11624 1356 7044 9790 10573 3381 -6001 -7039 -7862
6576g862O026l71n388o519L302Q982K483N935R36o683L833L183j582n519o710
$$ -7862 -1836 -2207 -7595 -14114 -10812 -1830 653 6588 7524 841 4674 7857 6275 756 -5954
6561e954L791J126o360O85n071r43J931N83O624m111o643M813j32L890L379m364
$$ -5954 -2163 -1037 -7397 -6712 -11783 -12726 -10795 -10212 -3588 -7699 -14342 -9529 -9661 -5771 -2392 -6756
6545f756m293L134k460n424J4240J2723r776r938q676n778J622Q372J684Q49M285
$$ -6756 -11049 -7915 -10375 -15799 -1559 11164 1388 -8550 -17226 -23004 -21382 -13010 -11326 -10477 -6192
6530f192R354K670q857k985o986O7Q291m154o66l317J719J2238k571j848L005
$$ -6192 3162 5832 -3025 -6010 -12996 -12929 -4638 -8792 -9458 -12775 -11056 1182 -1389 -3237 -232
6515b32J618M89M317p797n511L357o395j165k418Q682R545o047l101l426j917
$$ -232 1386 1875 6192 -1605 -7116 -3759 -10154 -11319 -13737 -5055 4490 -1557 -4658 -8084 -10001
6500a0001Q671J285M750O07n738K595k079M042J905j1858N703N076m998n41q34
$$ -10001 -1330 -45 4705 5312 -426 2169 90 4132 6037 -5821 -118 4958 -40 -581 -1415
6485a415L22O99k39N479k304j145K186l41o548j621j4821r55j786P697O424L596
$$ -1415 -1093 -394 -633 4846 2542 1397 3583 3242 -3306 -4927 -19748 -20703 -22489 -14792 -8368 -4772
6469d772Lj598P457L242Q19L274k203o236j336l134R19J2571k03j689n03L782
$$ -4772 -4769 -6367 1090 4332 5151 8425 6222 -14 -1350 -4484 -3565 9006 8803 7114 6611 10393
6453A0393p00K23l309M417K90l722N65l453k208p362J220p60J5604P398j1711
$$ 10393 9693 9916 6607 11024 11314 7592 8157 4704 2496 -4866 -3646 -4406 11198 18596 6885
6438F885r543j4181P437k82M456O007L142N819k356n695j1715P537K031k94m117
$$ 6885 -2658 -16839 -9402 -9684 -5228 779 3921 9740 7384 1689 -10026 -2489 -458 -752 -4869
6423d869Q4m035K751N576n942l041J83m464k60R774J2306N026P5n263j2601q599
$$ -4869 -4785 -8820 -6069 -493 -6435 -9476 -9293 -13757 -14017 -4243 8063 13089 13164 7901 -4700 -13299
6407a3299K949J961K626j530j684J196j919J0996J374j3576l290j006J2290P042
$$ -13299 -10350 -8389 -5763 -7293 -8977 -7781 -9700 1296 2670 -10906 -14196 -15202 -2912 4130
6393D130K48N60m569q618K215P656j0278m226O28K511k365L098M144L64p06j998
$$ 4130 4378 4938 369 -8249 -6034 1622 -8656 -12882 -12254 -9743 -12108 -9010 -4866 -4502 -5208 -7206
6377g206J3354O765j1661j939l888r812j787N187Q080O302J1387N943k111o605
$$ -7206 6148 12913 1252 -687 -4575 -14387 -16174 -10987 -2907 3395 14782 20725 18614 12009
6363A2009n825q301M080k080q318j659K402N540M573k375m38M745N89o121k538
$$ 12009 6184 -2117 1963 -117 -8435 -10094 -7692 -2152 2421 46 -392 4353 4942 -1179 -3717
6348c717L63m381j754N835L561o945p294K207K847M528k664q018k964M80Q753
$$ -3717 -3354 -7735 -9489 -3654 -93 -7038 -14332 -12125 -9278 -4750 -7414 -15432 -18396 -17916 -9163
6333i163J1016m68n403p269o807J1709J4177k421K969J1080K403n712o296k863
$$ -9163 1853 1385 -4018 -11287 -18094 -6385 7792 5371 8340 19420 21823 16111 9815 6952
6319F952n404p845N638M978M386m533l801O9J092l366o404O613l031m172p27j37
$$ 6952 1548 -6297 -659 4319 8705 4172 371 440 1532 -1834 -8238 -1625 -4656 -8828 -9555 -9692
6303i692m829k887J550M970J5578L524j5568l077L832L593M956M447j2661j776
$$ -9692 -14521 -17408 -15858 -10888 4690 8214 -7354 -10431 -6599 -3006 1950 6397 -6264 -8040
6289h040j482l45O691L261l222n136M53M926L363L456M135k492K91K245O117o339
$$ -8040 -9522 -9867 -3176 85 -3137 -8273 -7820 -2894 469 3925 8060 5568 5859 8104 14221 7882
6273G882j6649p193j617J1411K748k949P18R298Q559J823n553l031k024r403n994
$$ 7882 -8767 -15960 -17577 -6166 -3418 -6367 -5649 3649 12208 14031 8478 5447 3423 -5980 -11974
6258a1974J0311O086m995o16k564k462p202j176R878J512J606j847J924N298k46
$$ -11974 -1663 4423 -572 -1188 -3752 -6214 -13416 -14592 -4714 -3202 -1596 -3443 -1519 3779 3533
6243C533j1547J908j586J150j776N210O893L499N051P49l893l224n039o897J781
$$ 3533 -8014 -6106 -7692 -6542 -8318 -3108 3785 7284 12335 13084 9191 5967 928 -5969 -4188
6228d188P763m651n755m441J527O439j702o605j442N047k448k358O825N273k457
$$ -4188 3575 -1076 -6831 -11272 -9745 -3306 -5008 -11613 -13055 -8008 -10456 -12814 -5989 -716 -3173
6213c173m603L616R551k976n967Q800O910L661K598j0822r276p957K971J0242
$$ -3173 -7776 -4160 5391 2415 -3552 5248 12158 15819 18417 7595 -1681 -9638 -6667 3575
6199C575K922m777J432k312J253l009J838m647m339Q94p65m644M024P18j195L64
$$ 3575 6497 1720 3152 840 2093 -916 922 -3725 -8064 -7170 -7935 -12579 -8555 -7837 -9032 -8668
6183h668L742N956O19k495O302j762l862K216m064o18L158j1246l636O204L681
$$ -8668 -4926 1030 1649 -846 5456 3694 -168 2048 -2016 -2634 524 -10722 -14358 -8154 -4473
6168d473K266O164n71j7750r017O975J1737j625L684K691m159J663R496k519n238
$$ -4473 -2207 3957 3386 -14364 -23381 -16406 -4669 -6294 -2610 81 -4078 -2415 7081 4562 -676
6153f76l479L520K200K651o49j0575j032M492N027Q938Q156l697r284q577l08
$$ -676 -4155 -635 1565 4216 3567 -7008 -8040 -3548 1479 10417 18573 14876 5592 -2985 -3293
6138c293n108k497M42Q389P482m492k44M587p801q475p57R521R553Q797m602m218
$$ -3293 -8401 -10898 -10456 -2067 5415 923 679 5266 -2535 -11010 -11767 -2246 7307 16104 11502 7284
6122G284p070l264j589j680j688J997K567P407k981q846l823M007J377n17q115
$$ 7284 214 -3050 -4639 -6319 -8007 -6010 -3443 3964 983 -7863 -11686 -7679 -6302 -6819 -14934
6107a4934p52k051N247K570N72M739J779p932j0743M207N666J149L783R207L279
$$ -14934 -15686 -17737 -12490 -9920 -9348 -4609 -2830 -10762 -21505 -17298 -11632 -10483 -6700 2507 5786
6092E786o52M982l443L042j1j1042k823k77J47J470m836j881n661J714Q805n04
$$ 5786 5134 10116 6673 9715 9704 -1338 -4161 -4438 -4291 -2821 -7657 -9538 -15199 -13485 -4680 -5184
6076e184L592K601L147q318k686R625L129q49R64P75n283j427O623q14l745J209
$$ -5184 -1592 1009 4156 -4162 -6848 2777 5906 5057 6021 6796 1513 86 6709 5895 2150 3359
6060C359m643R071J87o370l281m569O197P468K903m723J245l296j376k202l79
$$ 3359 -1284 7787 7974 1604 -1677 -6246 -49 7419 10322 5599 6844 3548 2172 -30 -409
6045d09k84O973l913r850K817J2688k280L327P121k316r414R35j269k225j2532
$$ -409 -693 6280 2367 -7483 -4666 8022 5742 9069 16190 13874 4460 5395 4126 1901 -10631
6030a0631o216L768P114j405L012N919o320j816k025o99j514R639Q293o539L246
$$ -10631 -16847 -13079 -5965 -7370 -4358 1561 -4759 -6575 -8600 -9299 -10813 -1174 7119 580 3826
6015C826L928L724L303k533m244K295l64p109n013o154p174N184P395j853O450
$$ 3826 7754 11478 14781 12248 8004 10299 9935 2826 -2187 -8341 -15515 -10331 -2936 -4789 1661
6000A661l484m669m497k665J1757M006J322P290n399q019k617m723k042J0403
$$ 1661 -1823 -6492 -10989 -13654 -1897 2109 3431 10721 5322 -2697 -5314 -10037 -12079 -1676
5986a676l592j0646o610m131J7238J6468l538m658O602L849J892j107k161j637
$$ -1676 -5268 -15914 -22524 -26655 -9417 7051 3513 -1145 5457 9306 11198 10091 7930 6293
5972F293j449J0588o293j0700n394j0681R973k926J317P927J373j465N272j907
$$ 6293 4844 15432 9139 -1561 -6955 -17636 -7663 -10589 -9272 -1345 28 -1437 3835 1928
5958A928l430N064M663M782m623o401m489J227K808L265r544m679L75k821J512
$$ 1928 -1502 3562 8225 13007 8384 1983 -2506 -1279 1529 4794 -4750 -9429 -9054 -11875 -10363
5943a0363J424o142q581R015J1028R9L087L015l873n15J143J671j210j0967o329
$$ -10363 -8939 -15081 -23662 -14647 -3619 -3520 -433 2582 -1291 -1806 -663 1008 -202 -11169 -17498
5928a7498M781Q230K330J661J433N507m500m464k705l341j003R873N136k975q350
$$ -17498 -12717 -4487 -2157 -496 937 6444 1944 -2520 -5225 -8566 -9569 304 5440 2465 -5885
5913e885l258K084m864k108j378N295K533j592K807J646L844Q63M532q708k110
$$ -5885 -9143 -7059 -11923 -14031 -15409 -10114 -7581 -9173 -6366 -4720 -876 -13 4519 -4189 -6299
5898f299K138K331O926p565q174O935L959N360j267j0704k275R133K417j631M888
$$ -6299 -4161 -1830 5096 -2469 -10643 -3708 251 5611 4344 -6360 -8635 498 2915 1284 6172
5883F172J421K050k596l128J971k232m917j0210J546p10J277N752P79M011N417
$$ 6172 7593 9643 7047 3919 5890 3658 -1259 -11469 -9923 -10633 -9356 -3604 -2825 1186 6603
5868F603N081N031K061m408m762k170O266j735l962O663N99j1809k046k613n018
$$ 6603 11684 16715 18776 14368 9606 7436 13702 11967 8005 14668 15267 3458 1412 -1201 -6219
5853f219R609n506l239N691Q498m234m414p849m428n962J143L125n02P169m508
$$ -6219 3390 -2116 -5355 336 8834 4600 186 -7663 -12091 -18053 -16910 -13785 -14287 -7118 -11626
5838a1626N883P627J1276L427m684j1174m454Q639J454K513k387o43o75L281j883
$$ -11626 -5743 1884 13160 16587 11903 729 -3725 4914 6368 8881 6494 5851 5176 8457 6574
5823F574n425j879r12Q135N625q669M26k627r975k366l975J059R949K696p332
$$ 6574 1149 -730 -1642 6493 12118 3449 3875 1248 -8727 -11093 -15068 -14009 -4060 -1364 -8696
5808h696O55R88J0602R619k832m489j4553m690K651J486j554j580j331l932P223
$$ -8696 -8041 -7053 3549 13168 10336 5847 -8706 -13396 -10745 -9259 -10813 -12393 -13724 -17656 -10433
5793a0433R361J762J549P53K121o715K708R68p226J51O148R677m681m782J492
$$ -10433 -1072 690 2239 2992 5113 -1602 1106 2074 -5152 -5001 1147 10824 6143 1361 2853
5778B853L515Q800M319m338n791R99J385k644J283n301j1931K361O898l709j913
$$ 2853 6368 15168 19487 15149 9358 10357 11742 9098 10381 5080 -6851 -4490 2408 -1301 -3214
5763c214O533O333j267q586m467Q12Q845P308j368O33M156l011k542j959n578
$$ -3214 3319 9652 8385 -201 -4668 -3856 4989 12297 10929 11562 15718 12707 10165 8206 2628
5748B628j417r609L846j027M964M083M03j370r61l972m714M59O228J593r01n144
$$ 2628 1211 -8398 -4552 -5579 -615 3468 3871 2501 1540 -2432 -7146 -6687 -459 1134 233 -4911
5732d911n213n694L238O621J0818Q647l075r003K160R780k001m301o419K552N97
$$ -4911 -10124 -15818 -12580 -5959 4859 13506 10431 1428 3588 13368 11367 7066 647 3199 3796
5717C796k950m025K879L291J036q73l376J872Q606l217n979M225m381p962k155
$$ 3796 846 -3179 -300 2991 4027 3154 -222 1650 10256 7039 1060 5285 904 -7058 -9213
5702i213K213n548l319J0074P766l613m140J743j607Q42o71n749Q31J0652M353
$$ -9213 -7000 -12548 -15867 -5793 1973 -1640 -5780 -4037 -5644 -4802 -5473 -11222 -10391 261 4614
5687D614r54Q499l760M09L544n498p991K182p04q215p409J2020N629o085N829
$$ 4614 3660 12159 8399 8808 12352 6854 -1137 1045 341 -7874 -15283 -3263 2366 -3719 2110
5672B110o655n373J0116J3756k563q13r112k133r947K088K1302L555j0260q454
$$ 2110 -4545 -9918 198 13954 11391 10578 1466 -667 -10614 -8526 12776 16331 6071 -2383
5658b383n820Q88O317L809J1886l565L491o536m420K261k148J675K253j775j0593
$$ -2383 -8203 -7315 -998 2811 14697 11132 14623 8087 3667 5928 3780 5455 7708 5933 -4660
5643d660R73k915L232P716M117p4J304L464j067o488j2j0789o051K962O46N389
$$ -4660 -3687 -6602 -3370 4346 8463 8389 9693 13157 12090 5602 5590 -5199 -11250 -8288 -7642 -2253
5627b253l671O270r96p191o099P258k672o822Q124k963m608K468N811J2964m59
$$ -2253 -5924 346 -650 -7841 -13940 -6682 -9354 -16176 -8052 -11015 -15623 -13155 -7344 5620 5161
5612E161k543j510l578J301M669J0995J188k780L067j782n088K630k556q956n868
$$ 5161 2618 1108 -2470 -1169 3500 14495 15683 12903 15970 14188 9100 11730 9174 218 -5650
5597e650n047J3744J6632k744M95o779o910p089j971J7803o138p142O035J98q904
$$ -5650 -10697 3047 19679 16935 17430 10651 3741 -3348 -5319 12484 6346 -796 5239 5437 -3467
5582c467l455N865P309j86L250O381m369r424j932L074L935J953N468J227o314
$$ -3467 -6922 -1057 6252 6066 9316 15697 11328 1904 -28 3046 6981 8934 14402 15629 9315
5567I315j0120r188N859N040P287K721l328o635q423p85j056k18M110N461k056
$$ 9315 -805 -9993 -4134 906 8193 10914 7586 951 -7472 -8257 -9313 -9531 -5421 40 -2016
5552b016j1474P585J3460P570j2466Q16P984n170q516o381M435J020L996P32j2633
$$ -2016 -13490 -5905 7555 15125 2659 3475 11459 6289 -2227 -8608 -4173 -3153 843 1575 -11058
5537a1058P1L925Q479L600l711N221l11N302j0516n599N337M091j923j072J435
$$ -11058 -10987 -7062 1417 5017 1306 6527 6216 11518 1002 -4597 740 4831 2908 1836 3271
5522C271M316l248r502p59R033J0498l521m436q169k741k02l17p496j328J026
$$ 3271 7587 4339 -5163 -5922 3111 13609 10088 5652 -2517 -5258 -5460 -5777 -13273 -14601 -13575
5507a3575L565M679J402K899m48j3765n512R150J663k623Q504J466N376n783p74
$$ -13575 -10010 -5331 -3929 -1030 -1478 -15243 -20755 -11605 -9942 -12565 -4061 -2595 2781 -3002 -3776
5492c776o03k715j051L884P426n757j299O35q740o014J0798K346P62m490l73j904
$$ -3776 -4379 -7094 -8145 -4261 3165 -2592 -3891 -3256 -11996 -18010 -7212 -4866 -4104 -8594 -8967 -10871
5476a0871J132k808R477J972K135K845k636J182K145k143m992n29N944n570J24
$$ -10871 -9739 -12547 -3070 -1098 1037 3882 1246 2428 4573 2430 -2562 -3091 2853 -2717 -2593
5461b593m868J182J1505L293P538m21j99q326m590j207K652J867O362m255p94
$$ -2593 -7461 -6279 5226 8519 16057 15636 15437 7111 2521 1314 3966 5833 12195 7940 7146
5446G146N316k755j5571n649N494J2267O671n73q093m896M092M363N669j467j848
$$ 7146 12462 9707 -5864 -11513 -6019 6248 12919 12346 4253 -643 3449 7812 13481 12014 10166
5431A0166J87j944j0838j707L452K530Q232J634r685j20k360l743k617m51J0148
$$ 10166 10353 8409 -2429 -4136 -684 1846 10078 11712 2027 1907 -453 -4196 -6813 -7264 2884
5416B884P383N444r569k370N367k871p876o818p676R502N154m326n682M099J3312
$$ 2884 10267 15711 6142 3772 9139 6268 -1608 -8426 -16102 -6600 -1446 -5772 -11454 -7355 5957
5401E957M321n819o916m860R14j326k458J4269J0319k655N606M396n783M053J005
$$ 5957 10278 4459 -2457 -7317 -6403 -7729 -10187 4082 14401 11746 17352 21748 15965 20018 21023
5386B1023j2657j4688J426P723j91O366r83r035P58P11P769p881q880l145M81
$$ 21023 8366 -6322 -4896 2827 2636 9002 8019 -1016 -258 453 8222 341 -8539 -11684 -11203
5371a1203K920r964j690J1448j804N358k547p61m986o625P421K909J0652J0810
$$ -11203 -8283 -18247 -19937 -8489 -10293 -4935 -7482 -8243 -13229 -19854 -12433 -9524 1128 11938
5357A1938O110K916J183r454l336q642L56j071r400K045R70L088P105J4622j303
$$ 11938 18048 20964 22147 12693 9357 715 1071 0 -9400 -7355 -6385 -3297 3808 18430 17127
5342A7127k887K287K228l326n782p425Q00L531j387l267J204M106j1270m122l854
$$ 17127 14240 16527 18755 15429 9647 2222 3022 6553 5166 1899 3103 7209 -4061 -8183 -12037
5327a2037l95N598P76m240O190Q330k020o702N02m383k103P304P735M656l959
$$ -12037 -12432 -6834 -6058 -10298 -4108 4222 2202 -4500 -3998 -8381 -10484 -3180 4555 9211 5252
5312E252N433m594j0259o613L878l043n40J524L020k856j0209L883J0862P632
$$ 5252 10685 6091 -4168 -10781 -6903 -9946 -10486 -8962 -5942 -8798 -19007 -15124 -4262 3370
5298C370o651n343p70M392K018k170o124J51R515j2987p621J1709O655m428k793
$$ 3370 -3281 -8624 -9394 -5002 -2984 -5154 -11278 -11127 -1612 -14599 -22220 -10511 -3856 -8284 -11077
5283a1077j78J1204L399O76n541J811p848m499R036J4944k859k307j714q556j440
$$ -11077 -11255 -51 3348 4024 -1517 294 -7554 -12053 -3017 11927 9068 6761 5047 -3509 -4949
5268d949J225M96R03M119O571n462l703N270N655j1401P613N757m608n095m0P289
$$ -4949 -3724 -3228 -2325 1794 8365 2903 -800 4470 10125 -1276 6337 12094 7486 2391 2351 9640
5252I640P738j803j1013J981N047m609n47N176N316J321p407r269k798l441M444
$$ 9640 17378 15575 4562 6543 11590 6981 6434 11610 16926 18247 10840 1571 -1227 -4668 -224
5237b24j575l160Q484L192n78q659o118J361N975Q009p213j2302O212p77M116
$$ -224 -1799 -4959 3525 6717 6139 -2520 -8638 -7277 -1302 6707 -506 -12808 -6596 -7373 -3257
5222c257Q571n18q619k615N527m239j0343l448J0142J6549L030o702l876j17n092
$$ -3257 5314 4796 -3823 -6438 -911 -5150 -15493 -18941 -8799 7750 10780 4078 202 85 -5007
5207e007o048M957k405o156J98R34j47m976J2480P977j0600Q313M970J337K587
$$ -5007 -11055 -6098 -8503 -14659 -14461 -13527 -13674 -18650 -6170 1807 -8793 -480 4490 5827 8414
5192H414p563o810J636P475L543J539J313j10J291Q200l881l486N004p404p152
$$ 8414 851 -5959 -4323 3152 6695 8234 9547 9437 10728 18928 15047 11561 16565 9161 2009
5177B009j2362j4711k360J2959P29M197M613q59n320J262k489o244L946O021J2926
$$ 2009 -10353 -25064 -27424 -14465 -13736 -9539 -4926 -5785 -11105 -9843 -12332 -18576 -14630 -8609 4317
5162D317K29p003j0205M47R753j1655j792J1318Q379q922j2714P108p424J507
$$ 4317 4546 -2457 -12662 -12215 -2462 -14117 -15909 -4591 3788 -5134 -17848 -10740 -18164 -16657
5148a6657J1809R765K429j354M070l140j2304j0543n549j858M671O704n163J2486
$$ -16657 -4848 4917 7346 5992 10062 6922 -5382 -15925 -21474 -23332 -18661 -11957 -17120 -4634
5134d634R359j1208p899K065N544L704L509J751m075l664K050m463M022L526M619
$$ -4634 4725 -6483 -14382 -12317 -6773 -3069 440 2191 -1884 -5548 -3498 -7961 -3939 -413 4206
5119D206Q330N8l678r61n257m404q362r804N078J3655N538m402J610K829pp212
$$ 4206 12536 12594 8916 7955 2698 -1706 -10068 -19872 -14794 -1139 4399 -3 1607 4436 4429 -2783
$$ [...]
##END NTUPLES=NMR SPECTRUM
##END=
