##TITLE=Analysis number 312690
Compound Code cc 03402
Project Code adrs
Chemist Name hixia
+insolubles
##JCAMPDX= 6.0         $$ Bruker NMR JCAMP-DX V2.0
##DATA TYPE= NMR SPECTRUM
##DATA CLASS= NTUPLES
##ORIGIN= Bruker BioSpin GmbH
##OWNER= NMR
$$ XWIN-NMR		Version 3.5
$$ Thu Aug 11 09:48:14 2005 GMT Daylight Time (UT+1h)  MAYBRIDGE\NMR@NMR_250MHZ
##.OBSERVE FREQUENCY= 250.131544655141
##.OBSERVE NUCLEUS= ^1H
##.ACQUISITION MODE= SIMULTANEOUS (DQD)
##.ACQUISITION SCHEME= undefined
##.AVERAGES= 16
##.DIGITISER RES= 18
##SPECTROMETER/DATA SYSTEM= dpx250
##.PULSE SEQUENCE= zg30
##.SOLVENT NAME= CDCl3
##.SHIFT REFERENCE= (INTERNAL, CDCl3, 0, 16.4583)
##AUDIT TRAIL= $$ (NUMBER, WHEN, WHO, WHERE, WHAT)
$$ ##TITLE= Audit trail, XWIN-NMR		Version 3.5
$$ ##JCAMPDX= 5.01
$$ ##ORIGIN= Bruker BioSpin GmbH
$$ ##OWNER= NMR
$$ C:\u/data/dgb/nmr/ADRS/7590/pdata/1/auditp.txt
$$ ##AUDIT TRAIL=  $$ (NUMBER, WHEN, WHO, WHERE, WHAT)
(   1,<2005-08-11 09:47:41.54 +100>,<MAYBRIDGE\NMR>,<NMR_250MHZ>,
      <created by zg, POWCHK disabled, PULCHK disabled
       configuration hash MD5:
       62 19 C7 07 E1 42 D1 B7 37 6C 3D D0 77 39 F9 E6
       data hash MD5: 64K
       D1 95 6D 64 8B 5E ED 5F A7 FA 51 BA B4 A4 F2 B9>)
(   2,<2005-08-11 09:47:57.96 +100>,<MAYBRIDGE\NMR>,<NMR_250MHZ>,
      <Start of raw data processing
       ef LB = 0.3 FT_mod = 6 PKNL = 1 SI = 32K 
       data hash MD5: 32K
       7D D5 6C 27 A7 C0 87 BC 65 BD AA 62 F5 CF 7D 9D>)
(   3,<2005-08-11 09:48:01.67 +100>,<MAYBRIDGE\NMR>,<NMR_250MHZ>,
      <apk 
       data hash MD5: 32K
       69 6F 79 58 0A 48 EC 06 27 F6 2A 97 31 58 30 74>)
(   4,<2005-08-11 09:48:02.43 +100>,<MAYBRIDGE\NMR>,<NMR_250MHZ>,
      <abs ABSG = 5 
       data hash MD5: 32K
       3C FE 5B 51 F3 5C 0A 64 6B A4 42 0A 2D BE EB 1B>)
$$ ##END=
$$ 
$$ hash MD5
$$ F2 6F 93 65 25 39 F0 89 9C 8B EF 4D FF C4 A6 D3
##$RELAX= 
##$RELAX= 
##$RELAX= 
##$RELAX= 
##$RELAX= 
##$RELAX= 
##$RELAX= 
$$ Bruker specific parameters
$$ --------------------------
##$DU= <C:\u>
##$EXPNO= 7590
##$NAME= <ADRS>
##$PROCNO= 1
##$TYPE= <nmr>
##$USER= <dgb>
##$AMP= (0..31)
100 100 100 100 100 100 100 100 100 100 100 100 100 100 100 100 100 100 
100 100 100 100 100 100 100 100 100 100 100 100 100 100 
##$AQSEQ= 0
##$AQ_mod= 3
##$AUNM= <au_zg>
##$AUTOPOS= <8 >
##$BF1= 250.13
##$BF2= 250.13
##$BF3= 250.13
##$BF4= 250.13
##$BF5= 500.13
##$BF6= 500.13
##$BF7= 500.13
##$BF8= 500.13
##$BYTORDA= 1
##$CFDGTYP= 0
##$CFRGTYP= 5
##$CHEMSTR= <none>
##$CNST= (0..31)
1 1 145 1 1 1 1 1 1 1 1 1 1 1 1 1 1 1 1 1 1 1 1 1 1 1 1 1 1 1 1 1 
##$CPDPRG= <>
##$CPDPRG1= <>
##$CPDPRG2= <>
##$CPDPRG3= <>
##$CPDPRG4= <mlev>
##$CPDPRG5= <mlev>
##$CPDPRG6= <mlev>
##$CPDPRG7= <mlev>
##$CPDPRG8= <mlev>
##$CPDPRGB= <>
##$CPDPRGT= <>
##$D= (0..31)
0 1 0 0 0 0 0 0 0 0.06 0 0 0 0 0 0 0.0002 0 0 0 0 0 0 0 0 0 0 0 0 0 0 
0 
##$DATE= 1123750059
##$DBL= (0..7)
120 120 120 120 120 120 120 120 
##$DBP= (0..7)
150 150 150 150 150 150 150 150 
##$DBP07= 0
##$DBPNAM0= <>
##$DBPNAM1= <>
##$DBPNAM2= <>
$$ [...]
##$SUBNAM7= <"">
##$SUBNAM8= <"">
##$SUBNAM9= <"">
##$SW= 20.6930455092707
##$SWIBOX= (0..15)
0 0 3 0 0 0 0 0 0 0 0 0 0 0 0 0 
##$SW_h= 5175.983436853
##$TD= 65536
##$TD0= 1
##$TE= 295.16
##$TE2= 300
##$TE3= 300
##$TEG= 300
##$TL= (0..7)
0 120 120 120 120 120 120 120 
##$TP= (0..7)
150 150 150 150 150 150 150 150 
##$TP07= 0
##$TPNAME0= <>
##$TPNAME1= <>
##$TPNAME2= <>
##$TPNAME3= <>
##$TPNAME4= <>
##$TPNAME5= <>
##$TPNAME6= <>
##$TPNAME7= <>
##$TPOAL= (0..7)
0.5 0.5 0.5 0.5 0.5 0.5 0.5 0.5 
##$TPOFFS= (0..7)
0 0 0 0 0 0 0 0 
##$TUNHIN= 0
##$TUNHOUT= 0
##$TUNXOUT= 0
##$USERA1= <user>
##$USERA2= <user>
##$USERA3= <user>
##$USERA4= <user>
##$USERA5= <user>
##$V9= 5
##$VALIST= <valist>
##$VCLIST= <CCCCCCCCCCCCCCC>
##$VD= 0
##$VDLIST= <DDDDDDDDDDDDDDD>
##$VPLIST= <PPPPPPPPPPPPPPP>
##$VTLIST= <TTTTTTTTTTTTTTT>
##$WBST= 1024
##$WBSW= 4
##$XGAIN= (0..3)
0 0 0 0 
##$XL= 0
##$YL= 0
##$YMAX_a= 359155
##$YMIN_a= -274218
##$ZGOPTNS= <>
##$ZL1= 120
##$ZL2= 120
##$ZL3= 120
##$ZL4= 120
##$ABSF1= 16.45829
##$ABSF2= -4.234882
##$ABSG= 5
##$ABSL= 3
##$ALPHA= 0
##$AQORDER= 0
##$ASSFAC= 0
##$ASSFACI= 0
##$ASSFACX= 0
##$ASSWID= 0
##$AUNMP= <proc_1d>
##$AZFE= 0.1
##$AZFW= 0.1
##$BCFW= 0
##$BC_mod= 0
##$BYTORDP= 0
##$COROFFS= 0
##$CY= 12.5
##$DATMOD= 1
##$DC= 0
##$DFILT= <>
##$DTYPP= 0
##$F1P= 14.0000005364418
##$F2P= -0.99999901652339
##$FCOR= 0.5
##$FTSIZE= 32768
##$FT_mod= 6
##$GAMMA= 0
##$GB= 0
##$INTBC= 1
##$INTSCL= 1
##$ISEN= 128
##$LB= 0.3
##$LEV0= 0
##$LPBIN= 0
##$MAXI= 10000
##$MC2= 0
##$MEAN= 0
##$ME_mod= 0
##$MI= 0
##$NCOEF= 0
##$NC_proc= -4
##$NLEV= 6
##$NOISF1= 0
##$NOISF2= 0
##$NSP= 0
##$NTH_PI= 0
##$NZP= 0
##$OFFSET= 16.45829
##$PC= 1
##$PHC0= -76.22358
##$PHC1= 9.378094
##$PH_mod= 1
##$PKNL= yes
##$PPARMOD= 0
##$PSCAL= 4
##$PSIGN= 0
##$REVERSE= no
##$SF= 250.130015933794
##$SI= 32768
##$SIGF1= 0
##$SIGF2= 0
##$SINO= 400
##$SIOLD= 32768
##$SREGLST= <1H.CDCl3>
##$SSB= 0
##$STSI= 32768
##$STSR= 0
##$SW_p= 5175.98343685301
##$SYMM= 0
##$S_DEV= 0
##$TDeff= 65536
##$TDoff= 0
##$TI= <Analysis number 999999
Compound Code 99
Book Reference 9
Project Code 9>
##$TILT= no
##$TM1= 0
##$TM2= 0
##$TOPLEV= 0
##$USERP1= <user>
##$USERP2= <user>
##$USERP3= <user>
##$USERP4= <user>
##$USERP5= <user>
##$WDW= 1
##$XDIM= 32768
##$YMAX_p= 392665051
##$YMIN_p= -365592
$$ End of Bruker specific parameters
$$ ---------------------------------
##NTUPLES= NMR SPECTRUM
##VAR_NAME=  FREQUENCY,     SPECTRUM/REAL,   SPECTRUM/IMAG
##SYMBOL=    X,             R,               I
##VAR_TYPE=  INDEPENDENT,   DEPENDENT,       DEPENDENT
##VAR_FORM=  AFFN,          ASDF,            ASDF
##VAR_DIM=   32768,         32768,           32768
##UNITS=     HZ,            ARBITRARY UNITS, ARBITRARY UNITS
##FACTOR=    0.157963299565203, 1,           1
##FIRST=     4116.71236498043, 0,            0
##LAST=      -1059.27107187258, 0,           0
##MIN=       -1059.27107187258, -365592,     0
##MAX=       4116.71236498043, 392665051,    0
$$ Real data points
##PAGE= N=1
##DATA TABLE= (X++(R..R)), XYDATA
$$ [...]
26144A40061P526l182k0955q0419l4964k7002l224J9999k7631o5539j3944J1240
26132i8034R590K3293n3235j0172J9119P6222k41k5868M5784Q2494l6852j13973
26120h1873n3795J9690J72478R0796o0550j8788m1255o4370j4035l5344R9255
26109A2209L2616L0086m9705k5595k1764o7310N5028m7413J0846O3982q7912m4120
26097a39052K5996J47146J27003q3210j04848q4748K5588R8738J4657j9333o3953
26086e6016J04530k8051o1187L3065j0942n4649K7845L0793N1174l4989J1087
26075A2660l8148p2741r884J8011j6831O7373j1970J5904J3264K8001j5482m4704
26063e4547L3034M812k2606m1862N6116Q156J3114p0400k0205l324L2118O2581
$$ plain form
26144 140061 147587 144405 123450 43031 8067 -18935 -22159 -2160 -29791 -95330 -109274 -98034
26132 -98034 -88444 -65151 -118386 -128558 -109439 -33217 -33458 -59326 -13542 68952 32100 -81873
26120 -81873 -135668 -115978 56500 147296 86746 67958 26703 -37667 -51702 -87046 12209
26109 12209 44825 74911 25206 -389 -22153 -89463 -34435 -81848 -71002 -7020 -94932 -139052
26097 -139052 -113056 34090 161093 77883 -26965 -111713 -86125 12613 27270 7937 -56016
26086 -56016 48514 20463 -40724 -7659 -18601 -73250 -45405 -14612 36562 1573 12660
26075 12660 -25488 -98229 -108113 -90102 -106933 -39560 -51530 -35626 -22362 5639 -9843 -54547
26063 -54547 -21513 -16701 -39307 -81169 -25053 -16897 -3783 -74183 -94388 -97712 -65594 -3013
26051c013N3964R4376m9789q932J4901O8125L959j34513j8059M7826j5565m7577
26039E703Q347o8709J1989K1563J1540R4483P8562j7406k8314j62367l3640P2010
26027f239J2427j2504m9575P4094P0997p6063O5990N0715p2553n3757n2028p7046
26015a25542M7144J38168j6533p3304j78514p5160R9064J15498N8171O7755N7431
26004A14178M1543k1354m5224p8917K942k2434M9633J34049K9992n7038p194L7434
25992A77610q025J8777j4064l8473r11J0420j10536n2090O6822P6242r1197L1539
25980F6114q637K1628l6037m7883n6388j01808K405J0198L5331O0167N9273M1533
25968D5896l544j4106k7023l4848q1776j9921K2943j1752J32928J19341m848p9514
$$ plain form
26051 -3013 50951 145327 95538 86606 101507 169632 173591 39078 21019 68845 53280 5703
26039 5703 14050 -54659 -42670 -21107 -9567 84916 163478 146072 117758 -44609 -78249 -6239
26027 -6239 6188 -6316 -55891 18203 89200 13137 79127 129842 57289 3532 -48496 -125542
26015 -125542 -78398 59770 43237 -30067 -208581 -283741 -184677 -69179 -11008 56747 114178
26004 114178 155721 134367 89143 10226 13168 -9266 40367 174416 204408 147370 140176 177610
25992 177610 169585 188362 174298 135825 134914 145334 34798 -17292 49530 125772 34575 66114
25980 66114 57477 79105 43068 -4815 -61203 -163011 -160606 -150408 -115077 -54910 4363 45896
25968 45896 42352 28246 1223 -33625 -115401 -135322 -112379 -124131 8797 128138 123290 43776
25956D3776J51163R5443m7679r7629r6743l8159j0383l4462O4939l8286k6450
25945c4470l8685J5074N6528j4688R817K7379r7421J3928Q2003k2879o5961r247
25933g8622P572n041k9099L1865Q3514K2016M1809o93q2107j24139J295Q8976
25921d2654M487p8052K1937k1434M9759J34203P3530o0138o5326j9619q92j4352
25909a8551J6047q8754Q896L9899P1484O3820n6862j15165j25147k0606O9546
25898a55393J1912J42521J05836O7652l6415q1050p2007P8557O047q1060k6202
25887c9602l4451k0185m1250K3764r391J324L3140R6870j1707l6531m9960O3747
25875b4232J326j4949k2245N0871L4036J5194R789N537l7114R788p5668n7191
$$ plain form
25956 43776 194939 290382 242703 145074 48331 10172 -211 -34673 30266 -8020 -34470
25945 -34470 -73155 -58081 -1553 -16241 -6424 20955 -76466 -62538 19465 -3414 -69375 -78622
25933 -78622 -71050 -76091 -105190 -73325 10189 32205 74014 73321 -8786 -132925 -131630 -42654
25921 -42654 -38167 -116219 -94282 -115716 -65957 68246 141776 81638 16312 -3307 -4199 -18551
25909 -18551 -2504 -91258 -82362 -42463 29021 92841 35979 -79186 -204333 -224939 -155393
25898 -155393 -143481 -960 104876 172528 136113 55063 -16944 61613 67660 -13400 -39602
25887 -39602 -74053 -94238 -135488 -111724 -121115 -119791 -86651 10219 -1488 -38019 -87979 -24232
25875 -24232 -22906 -37855 -60100 -9229 24807 40001 49790 55327 18213 28001 -47667 -104858
25863a04858M6105J4203m6430K7321O7681J203K9311M9654p3042j54313L9994
25852a03171O346n1577j5259M6403M3935K1700L8985L1355l6569r9566R8277J52999
25840A33858k3182j4539O3214r0190p8869j2886n2854m9788N4695j7607o8424
25829a56572l2195j7167J12901M9362m8769P0813p4581M1742p01j7019j1719l0677
25817a14582k3998l3320P1680K5828j04407M9608K05111J04569k9660j80880p2453
25806a02504M7274N7197J8414M1436o4280m8819M1174O6754K5379M9483K9491
25795A60999M4462p0673r6844m8225m9219M3545l7491K9175J21815l1384M6659
25784A12819K8063q6918J27160l3146j27027n0445k1254R345J07227k0816J7199
$$ plain form
25863 -104858 -58753 -44550 -90980 -63659 4022 5225 34536 84190 11148 -143165 -103171
25852 -103171 -96825 -148402 -163661 -117258 -73323 -51623 -12638 18717 -17852 -117418 -19141 133858
25840 133858 110676 96137 159351 69161 -9708 -22594 -75448 -125236 -70541 -88148 -156572
25829 -156572 -188767 -205934 -93033 -43671 -92440 -21627 -96208 -54466 -55167 -72186 -83905 -114582
25817 -114582 -138580 -171900 -100220 -74392 -178799 -129191 75920 180489 150829 -30051 -102504
25806 -102504 -55230 1967 20381 61817 -2463 -51282 -10108 56646 82025 131508 160999
25795 160999 205461 134788 37944 -10281 -59500 -15955 -53446 -24271 97544 66160 112819
25784 112819 140882 53964 181124 147978 20951 -29494 -50748 -41403 65824 45008 62207
25773F2207O653M5228k9922o1893K8310K8413K965k7675K788P8116o9369r7375
25761c1554n6817p0053k4589J16847l0653K5323O9943L0680l6090k5268K4805
25750g426N2760K001Q4197J6645q8516q8249M0885K7157M6375J7303k7919K5451
25738A00664J119m2911P347p7100j2033R5956l9544k5309K5770n0048j0851k7586
25726e4526j24216p2866l18Q6230M7052O8286P6317M5496r2786j0214j03956m304
25714a39805O3203J38784N6717k0781r4774j24170L2857J12364L230l7201J24803
25703A15227P8620Q038j12440j7239J3525n5721p5010m5417M9222M3609p1220
25692f8806j1434J0674O6189Q2395m7511m7861J833j02210j9541L8793M2071N377
$$ plain form
25773 62207 68860 114088 84166 22273 50583 78996 81961 54286 57074 135190 65821 -31554
25761 -31554 -88371 -158424 -183013 -66166 -96819 -71496 -1553 29127 -6963 -32231 -7426
25750 -7426 45334 47335 131532 148177 59661 -28588 12297 39454 85829 103132 75213 100664
25738 100664 101783 58872 66219 -10881 -22914 73042 33498 8189 33959 -16089 -26940 -54526
25726 -54526 -178742 -251608 -251926 -165696 -118644 -50358 25959 71455 -21331 -31545 -135501 -139805
25714 -139805 -76602 62182 118899 98118 3344 -120826 -87969 24395 27625 -9576 115227
25703 115227 193847 201885 89445 72206 85731 30010 -45000 -90417 -41195 2414 -68806
25692 -68806 -80240 -69566 -3377 79018 31507 -16354 -14521 -116731 -136272 -97479 -55408 -50031
25680e0031l9148n142P8819n4856o2863M6103q9993k35K8731K9542J64749M935
25668E0611l6343o9923j7724M7275m3959K9876M0528m7668k7751J05646M1488
25657G2056q4615j10111J0572q5085K1329N4535Q7102O4788j961k6765p0954J0199
25645e8910m7114o1498J13349k0219J28743j3615p3991m0635o91r322j982Q544
25633g7341P6794N9015J8418k0215j8283K8261k6743m7866p9657J3334J31382
25622E7099L1449M4654r2321m581n3873n5051K0986J18520j5716j761n9827q0516
25610i0938m8417K6898K6951L6415k199L0311l6536q035O3692j3908l3183r1686
25598a40635m2334J4547J17515J36950m7115o081J41472P6392o3448j26799k8558
$$ plain form
25680 -50031 -89179 -94321 -15502 -70358 -133221 -87118 -177111 -177346 -148615 -119073 45676 50611
25668 50611 14268 -55655 -73379 -26104 -70063 -40187 341 -47327 -75078 30568 72056
25657 72056 -12559 -122670 -112098 -197183 -175854 -121319 -34217 30571 28610 1845 -69109 -58910
25645 -58910 -106024 -167522 -54173 -74392 54351 40736 -33255 -73890 -74581 -83903 -85885 -77341
25633 -77341 -547 58468 76886 56671 38388 66649 39906 -7960 -87617 -74283 57099
25622 57099 88548 133202 40881 36300 -17573 -72624 -51638 66882 51166 49405 -10422 -90938
25610 -90938 -139355 -112457 -85506 -49091 -51290 -20979 -57515 -65550 -1858 -15766 -48949 -140635
25598 -140635 -182969 -168422 -50907 86043 38928 32847 174319 250711 187263 60464 31906
25587C1906K1868P9106J3532L2286j07361k11387Q4752K44745P4298j7051m1385
25576B05309r9601j19509k7536l0213J05273R0546n9542j09712O4898q6822L0082
25565c6827N7337N053l505l3528j19681N1732R0009L7576K5228K8670p0613m7728
25553a6277l3869J2135k452q0321L3243L7266M4448O0164K7609q1838o3341M0074
25541b3159q266M8067O1663P4077N1456n3957o4169n6281n3789j1546P0731l758
25529C1069l1401m7388J0436J15178j22875j08331K417M3764L0630L0509N351
25518d0641N7462O6124J1173r2811k5032K7517l5732L011K1801m1885l6805O8495
25506a7323M2240r3733o017J1071J07340j8076r3062m314j9089q6643L0925n762
$$ plain form
25587 31906 53774 132880 146412 178698 71337 -140050 -55298 189447 263745 246694 205309
25576 205309 105708 -13801 -41337 -71550 33723 124269 64727 -44985 19913 -66909 -36827
25565 -36827 20510 25563 22058 -11470 -131151 -79419 10590 48166 73394 102064 31451 -16277
25553 -16277 -50146 -38011 -40463 -120784 -87541 -50275 -5827 54337 81946 108 -63233 -23159
25541 -23159 -31425 16642 78305 152382 203838 149881 85712 29431 -24358 -35904 34827 31069
25529 31069 -332 -47720 -37284 77894 -44981 -153312 -150895 -107131 -76501 -45992 -40641
25518 -40641 16821 82945 94118 1307 -23725 3792 -31940 -28929 -7128 -49013 -85818 -17323
25506 -17323 24917 -68816 -74833 -63762 43578 25502 -67560 -71874 -90963 -177606 -146681 -152443
25494a52443J06590N7455K6848n3475K8742l2535O5354p325m4693K9839P0052
25483I4409j6257l6500r0018k2684j1179L984O5440J39256k081J9219K6852o0373
25471A10068L1793n5028o3050L5320L1651o4595m6434N3080J02969N465N4674
25460A95913J2313m3384L910l695j01572r3640J3707L3957n275k8555k1432P0055
25448C2302N3410r4709j5968m5871J1714P1372J2605J0488q3616N7373O6085L1387
25436A06572n6320j1761N5885P778m2049M4162k8414O2190k5823j01388j0173
25425F59o9133J4875K4748R9296p3301r6637K3419k2948L168J8747L9498m0138
25413g7747o9013M9451j6416M5269M4070L2769k3027M1506L3188r9512l284N153
$$ plain form
25494 -152443 -45853 11602 38450 -15025 13717 -18818 46536 39211 -5482 24357 94409
25483 94409 78152 41652 -48366 -71050 -82229 -78245 -12805 126451 124370 143589 170441 110068
25471 110068 141861 86833 23783 59103 90754 26159 -20275 32805 135774 141239 195913
25460 195913 208226 164842 168752 165057 63485 -30155 -16448 17509 12234 -16321 -37753 32302
25448 32302 85712 -8997 -24965 -70836 -59122 12250 24855 35343 -48273 9100 75185 106572
25436 106572 50252 38491 94376 102154 60105 104267 75853 138043 112220 10832 659
25425 659 -68474 -53599 -28851 70445 -2856 -99493 -76074 -99022 -95854 -77107 -37609 -77747
25413 -77747 -146760 -97309 -113725 -68456 -24386 8383 -14644 26862 60050 -39462 -42746 -37593
25401c7593K9049q5273q1048O1309L7831l6584K4345P6893l1573j777O318O3180
25389B5077j8481n9418p8763j2292J52216P7423m2388n9874J9730P0202J11576
25378A85008J9975q6270m3351r8541M8360N785p8474j4311K0482K0535K357k8253
25366d6698n5998j0746R1589O6872k9402K2098J917o6482p6698o9543L2014m3956
25354a85033J1599K4389N8848O3379K0844M8081L8709n6224r699O690m6950P1195
25342D5828k5555k8837K370k7861M952O6198J2918l198O3084p0274q3639q2273
25330a26287K9673R8028J3807R199j06226k4192J11463K1503m1919n4402J32351
25319F2998P8585o3016n7109N6023O0756O1296K6065r8530j9638j7159o8456j4174
$$ plain form
25401 -37593 -8544 -93817 -174865 -113556 -75725 -112309 -87964 -11071 -42644 -44421 -38103 25077
25389 25077 6596 -52822 -131585 -143877 8339 85762 43374 -16500 3230 73432 185008
25378 185008 204983 118713 75362 -23179 25181 30966 -47508 -61819 -41337 -20802 -18445 -46698
25366 -46698 -102696 -113442 -21853 45019 15617 37715 39632 -26850 -103548 -173091 -141077 -185033
25354 -185033 -173434 -149045 -90197 -26818 -5974 42107 80816 24592 14893 21583 -25367 45828
25342 45828 20273 -8564 -6194 -34055 -29103 37095 50013 46815 109899 39625 -44014 -126287
25330 -126287 -96614 1414 15221 24420 -81806 -105998 5465 26968 -14951 -69353 62998
25319 62998 141583 78567 21458 77481 138237 199533 225598 127068 107430 90271 21815 7641
25307G641M1621K2440n2062L0995P0325l4373Q407p4020j82695p870Q9437P1482
25295h672k3874q1058K000K0054M9981P8564J48200N02r2580j12687M8638J07171
25283A36239N981P1221j11959p4375q4333J9566L1159J38775k3029l4392o6221
25272H632n6400L4866O8182l7013j15886M2467j9223r1623J05914L5955l1285
25261e5414m3869K48N0498j4997m0583P3855Q575j9985M7404j0417N9765L2746
25249H7826j14731l7065J832k2219L2340l372j401M2468j5938L6106R4119l2717
25237F7248Q7994M4462q211m9114q9462k8102k8649J9155p953J7229O3582m1861
25225D6318o9512l6908o6914m3230J20577R0398j4031r0547p759l7300l4461Q5427
$$ plain form
25307 7641 49262 71702 19640 50635 120960 86587 94994 20974 -161721 -169591 -80154 -8672
25295 -8672 -32546 -113604 -111604 -91550 -41569 36995 185195 185697 93117 -19570 29068 136239
25283 136239 142220 213441 101482 27107 -57226 -37660 -6501 132274 109245 74853 8632
25272 8632 -47768 -12902 55280 18267 -97619 -55152 -74375 -165998 -60084 -24129 -55414
25261 -55414 -99283 -99035 -48537 -63534 -104117 -30262 -21687 -41672 5732 -4685 55080 87826
25249 87826 -26905 -63970 -62138 -84357 -52017 -55389 -56790 -14322 -30260 5846 99965 67248
25237 67248 155242 199704 191493 142379 52917 24815 -3834 15321 7368 24597 88179 46318
25225 46318 -23194 -60102 -127016 -170246 -49669 40729 26698 -63849 -71608 -108908 -143369 -57942
25213e7942O3549m7416J2014N7472L5175j9159M5333Q759q670N3055M5506j25256
25201F2420r5967q2971j1833k5410J12551K2563o8233Q9606J8218l7953L5862
25190A8853q9027n5121J08032j5502Q5912N4959j04941j15479J6656M0987J45489
25179I0818J03026o6430q8635q8209j4446N2855K410L2248N7800J5739p502k0204
25167F9470m6691l4855Q275J760m1662n4732j1149M8301L2386K7852K4346q626
25155A4675j1641k8863j71686j00892O1727N5901J42706J11974j09527p2721R1316
25144a7031J0594m3284l7465m3225R3045P5496L2671J6517m6036n9125p1528m7653
25132a37024o20j2648J11994J07731l9620M5300o7595n0198m1695J8884J2063
$$ plain form
25213 -57942 5607 -41809 -29795 27677 62852 43693 89026 97785 89115 142170 187676 62420
25201 62420 -33547 -116518 -128351 -153761 -41210 -18647 -86880 2726 20944 -17009 18853
25190 18853 -70174 -125295 -17263 -32765 53147 108106 3165 -112314 -95658 -54671 90818
25179 90818 193844 127414 38779 -49430 -63876 -11021 -8611 23637 81437 97176 89674 69470
25167 69470 22779 -12076 -3801 -2041 -43703 -98435 -109584 -61283 -28897 -1045 23301 14675
25155 14675 3034 -25829 -197515 -298407 -236680 -180779 -38073 73901 -35626 -108347 -17031
25144 -17031 -6437 -49721 -87186 -130411 -37366 38130 70801 87318 41282 -17843 -89371 -137024
25132 -137024 -137644 -150292 -38298 69433 29813 75113 7518 -42680 -84375 -65491 -53428
25121e3428N0778J9991p0111m5618k7757O5057J11459J05497K3963l8069p0882
25110G0880j24336K942K1496J3298J5009J40688O1176m75n0482n3702l7842k3516
25098C5136J5063N5945O9915o6405p3233j42125L3400l9855R3761J72118L1638
25087A85358q7708j45346J937J15745M6250j6006j7330M9706M615K5406l2525
25076A30102j40068j83078l869J32448J8211j00045r4579r312J19728J7250R9008
25065a4204R3923L5030n4176j61987m6331J38167J21558n0042K3301l8412J0025
25054E6852j6013J7700K9535K2579p0381l8668Q3190M2762j9702Q0389L341p5323
25042A16261j8990r4110k3672k0665l2673M0581n2887j12926K4320P3353j6965
$$ plain form
25121 -53428 -2650 17341 -52770 -98388 -126145 -61088 50371 155868 179831 141762 70880
25110 70880 -53456 -50514 -29018 -15720 -711 139977 201153 200678 150196 96494 58652 35136
25098 35136 50199 106144 176059 109654 36421 -105704 -72304 -112159 -18398 153720 185358
25087 185358 97650 -47696 -45759 69986 116236 100230 82900 132606 137221 162627 130102
25076 130102 -9966 -193044 -196913 -64465 -46254 -146299 -240878 -250190 -130462 -113212 -14204
25065 -14204 79719 114749 60573 -101414 -147745 -9578 111980 61938 85239 46827 56852
25054 56852 40839 58539 88074 110653 40272 1604 84794 127556 107854 188243 191584 116261
25042 116261 97271 3161 -20511 -41176 -73849 -33268 -86155 -199081 -174761 -101408 -118373
25031a18373j4135J2155R8474J3891m4993l3339O9209M6945n0711M9223R6398
25020A24744P5065N9834j7064o3878m6639r3341K5506L6583L6407J12285k5427
25009B24075n5376K0953K1539p5864j11563N95j9260j2082l036M3423p4592j16514
24997a57702J13972P3988K9829K3403O634m604j6286N3417M7734J8258l0322l3265
24985A25056N9012l2207J0795o9221o6353k7195P08J4266o4335M0022J9242j38277
24973a28487J1989J5382P1220K5734O0264J39385k7853p7765j35195r6241r023
24962a50590O6907o5321J5110P8477P1355K8826m4446p4516m9916j8989l1384
24951a74487J6496J04706N1413k1809Q5444M7582p4280M7226n4312m6901J20724
$$ plain form
25031 -118373 -132508 -120353 -21879 -7988 -52981 -86320 -17111 29834 -20877 28346 124744
25020 124744 199809 259643 242579 178701 132062 38721 64227 100810 137217 249502 224075
25009 224075 168699 189652 211191 135327 23764 24359 5099 -6983 -10019 33404 -41188 -157702
24997 -157702 -43730 30258 60087 83490 90124 85520 69234 122651 170385 188643 158321 125056
24985 125056 184068 151861 162656 93435 27082 -113 595 14861 -49474 -9452 9790 -128487
24973 -128487 -116498 -101116 -29896 -4162 56102 195487 167634 89869 -45326 -141567 -150590
24962 -150590 -83683 -149004 -133894 -55417 15938 44764 318 -74198 -124114 -143103 -174487
24951 -174487 -157991 -53285 -1872 -23681 61763 109345 35065 82291 27979 -18922 101802
24940A01802o4145j50657J0784J9589q567R8509k1999n2071J19625M8741j26521
24929b4910p8667J5075N1973J01547P9667n6218j63170j26869L9798Q3164M0288
24918c8322K255J8659L589k2244M1917N8819N0737q5555r3045j8593L5264p65
24906d7284n363l9428o4556M9064j4216P126L3533m0148Q3594l6823r933P0139
24894a4295K1979J4130q5830r469M0604N9878Q1037p3596l2149m845R483L3325
24882D0252l677J8311P6427j8101m6490o1918o0940j12180j51742N3748Q0880
24871a85430O587O5902K9656j8807K4557r505k6629q3845R9482N7310n8519k2784
24859a22025j27853K4558J46213O6477l4506m6420L1650k917M8127j091k0798
$$ plain form
24940 101802 37657 -113000 -102216 -82627 -91194 7315 -14684 -66755 52870 101611 -24910
24929 -24910 -103577 -88502 -36529 65018 144685 88467 -74703 -201572 -161774 -78610 -38322
24918 -38322 -36067 -17408 -13819 -36063 5854 64673 115410 29855 -63190 -81783 -46519 -47284
24906 -47284 -52647 -92075 -156631 -107567 -121783 -114657 -81124 -121272 -37678 -74501 -84434 -14295
24894 -14295 7684 21814 -64016 -73485 -32881 26997 108034 34438 2289 -2556 6927 40252
24882 40252 36575 54886 131313 113212 66722 4804 -56136 -168316 -320058 -266310 -185430
24871 -185430 -178843 -112941 -83285 -102092 -77535 -87040 -113669 -197514 -98032 -40722 -99241 -122025
24859 -122025 -249878 -225320 -79107 -12630 -47136 -93556 -61906 -64823 -16696 -17787 -38585
24848c8585R9355m6222N601J31470k4834j57594q9529P6053J5098J7375O951J5639
24836A0778J4518O0851K6876l7531l1185O842m3339J661j6957K9442r0948r5775
24824a64767k7532J9649J16281K5607K2743n731J04522J3811m1691p448p3823
24813a8379n2753J07092M8336o8129o7877J4741R0093k3828K1469l5624K236l3624
24801a6247n9411n9317j9753n0974J2091N2232Q0830n5673l0134N6930J61209
24790G1783P0673o9560j06783l2298j5041R2364j6269p63m5420j10671Q27J63551
24778B393Q9077O6761K7550j68289n7686N7514o1994K2143k8930J2010l533L5056
24766g928M2339L935l6920n2392l6879M637l7762j1154O2568K9230J04357N0959
$$ plain form
24848 -38585 60770 14548 20149 151619 126785 -30809 -120338 -44285 -29187 -11812 -4861 10778
24836 10778 25296 86147 113023 75492 44307 51149 7810 9471 -7486 21956 -68992 -164767
24824 -164767 -192299 -172650 -56369 -30762 -8019 -13750 90772 104583 62892 55444 -18379
24813 -18379 -71132 35960 84296 16167 -51710 -36969 53124 29296 50765 15141 17377 -16247
24801 -16247 -75658 -134975 -154728 -205702 -193611 -141379 -60549 -116222 -146356 -89426 71783
24790 71783 142456 72896 -33887 -66185 -81226 11138 -5131 -5894 -51314 -161985 -161158 2393
24778 2393 91470 158231 185781 17492 -40194 17320 -44674 -22531 -51461 -39451 -42984 -7928
24766 -7928 34411 38346 1426 -50966 -87845 -83208 -120970 -132124 -69556 -40326 64031 114990
24754A14990m2667j30868L9528j8274p426O6142n4666j1563K3781O2890J0530
24743E2397k0799K442J15415j1881m8142l1852O954L3314j2011p4909m5901L8434
24731C461J11207O1048p8066j37109n6652j1582j3539Q0258J06787j08860o3309
24720a06356k4567m7705K5978M1916O9368J1759J0097p2880o425J19335N1193
24709G1713J8094j133M2374j0774k9850n298m9093j09510p1045O3193J88127N2641
24697A59439q6640J300r355o8506J227J1806q1414N4150o505m9089k0214R0854
24685b947J17616p0896m221J15904Q423k40711p9404N624L9326m5606J18911J09781
24673G1800J0748p5373K6600R2685j23519n1752m1429o9245K0962J19338K8732
$$ plain form
24754 114990 72323 -58545 -19017 -37291 -44717 21425 -33241 -44804 -21023 41867 52397
24743 52397 31598 34040 149455 137574 89432 57580 64534 97848 85837 10928 -34973 3461
24731 3461 114668 175716 97650 -39459 -96111 -107693 -121232 -40974 65813 -43047 -106356
24720 -106356 -130923 -178628 -152650 -110734 -41366 -29607 -19510 -92390 -98815 20520 71713
24709 71713 89807 88674 131048 120274 90424 85126 36033 -73477 -144522 -81329 106798 159439
24697 159439 72799 74099 64744 -3762 -2535 9271 -72143 -17993 -24498 -73587 -93801 -2947
24685 -2947 114669 43773 39552 155456 163879 -76832 -156236 -150612 -111286 -156892 -37981 71800
24673 71800 82548 7175 33775 126460 2941 -48811 -90240 -159485 -138523 -19185 9547
24662I547K9425p089L4169k9444o7603j34226l5033M1211O9058R0342L5770q4996
24650d8869r4572J57453J18895j3515n2971l5020o182p5534O0290o06q2464m3034
24638a16129m640Q2901M0330n6278q228k6217n751J45300J41287l279j24843n5679
24626H774j01259O310M1279p010J7904Q4698k4868j06945K2064n64N2322J965
24614e330k8401p2955Q2624j677J0934n8291l2310N3168N8187R3338M0973N0540
24602A90800m2540n6543k0495o97K1764M8027l1407j01726m7473J5389L0380L0299
24590C5778l0594P146o3798K6450N6221k0124o1460m4403l9790j3606q833L534
24578a53479N8678J2066J5737J61124P6433n6627q9473q9209j1990O8875m0363
$$ plain form
24662 9547 38972 31883 66052 36608 -30995 -165221 -200254 -159043 -89985 357 36127 -48869
24650 -48869 -143441 14012 132907 119392 66421 31401 25219 -50315 9975 9369 -73095 -116129
24638 -116129 -120769 -37868 2462 -53816 -62044 -88261 -94012 51288 192575 189296 64453 8774
24626 8774 -92485 -86175 -44896 -51906 -34002 50696 25828 -81117 -59053 -59617 -7295 -5330
24614 -5330 -33731 -106686 -24062 -25739 -14805 -73096 -105406 -52238 5949 99287 140260 190800
24602 190800 148260 91717 71222 70525 92289 140316 108909 7183 -40290 -24901 5479 35778
24590 35778 5184 12330 -51468 -25018 31203 11079 -50381 -94784 -134574 -148180 -157013 -153479
24578 -153479 -94801 -82735 -66998 94126 170559 113932 24459 -64750 -76740 -7865 -48228
24567d8228j1656R497m1287K9908l329J18756k5091m9661P1544J2592N864k3419
24555D5490k2164M1298M0L5594j8605o5093m6343N4606M3400K2724m9371j35584
24543i4008j6140J02026P7798J9501l9176j2155m6213l2884K5905j1816L8311
24532A1149Q4028J0734j01380r2823m5063J5531L1411L4555l7395N6305L9325
24521F377p9553N1865J31055l0810q8603o353k3765q5060O8630O2755O2085L5832
24509A04455n525j05242m6823K6212P6151n3881n5203M9788J1190M8697l8854
24498A0965o2159l0297L2694n0432k0659R8021K6912O193N9111N7101Q84O471
24486A34805l2458j18986j07764l1630m8163M9179O2538l6367J4478M7974m0608
$$ plain form
24567 -48228 -59884 -50387 -91674 -61766 -65095 53661 28570 -21091 50453 63045 68909 45490
24555 45490 23326 64624 64664 100258 81653 16560 -29783 24823 68223 90947 41576 -94008
24543 -94008 -110148 -8122 69676 89177 50001 37846 -8367 -41251 -15346 -27162 11149
24532 11149 95177 105911 4531 -88292 -133355 -117824 -86413 -51858 -89253 -32948 6377
24521 6377 -73176 -21311 109744 78934 -9669 -16022 -39787 -124847 -56217 6538 68623 104455
24509 104455 98930 -6312 -53135 -26923 49228 -4653 -59856 -10068 1122 49819 10965
24498 10965 -51194 -81491 -48797 -99229 -119888 -21867 5045 11238 70349 127450 128334 134805
24486 134805 102347 -16639 -124403 -156033 -204196 -155017 -92479 -128846 -114368 -66394 -107002
24475a07002M707K030L3134l3717k8878j2840n763J23722J50060K0730k3653o6678
24463E5852p5526j0855L8650q5793M1117R6018n604J2521j8441L944K3327j1131
24451F4079Q7031P4125o9703j11695n4981q553Q035L7980m2423K3680P413N238
24439B0226R6948J05221p2515m9412j9951n7154m1714j32422L1750p315Q1262
24428d5076J43763P1875m1630p2485j6911k5598L6782m1628M9657M315j11247
24417d8183p7529O9952R0230M4289J7313k7355p7085o724O4186L0521j9868k9526
24405C0221p6066m2206L299r3097P445J5990K4178l3956l7396j4709m8118N5347
24393b09068J33609J9444O9840k5947n2913j6055K2047O1360n2557m3805o543
$$ plain form
24475 -107002 -102295 -100265 -67131 -100848 -129726 -142566 -148329 -24607 125453 146183 122530 55852
24463 55852 -19674 -30529 8121 -77672 -36555 59463 53859 66380 47939 51883 75210 64079
24451 64079 151110 225235 155532 43837 -11144 -19697 -11662 26318 -16105 7575 14988 20226
24439 20226 117174 222395 149880 100468 80517 23363 -18351 -150773 -119023 -126338 -45076
24428 -45076 98687 170562 128932 56447 39536 13938 50720 9092 58749 63064 -48183
24417 -48183 -125712 -55760 34470 78759 96072 68717 -8368 -15092 49094 79615 59747 30221
24405 30221 -45845 -88051 -84752 -177849 -170404 -154414 -130236 -164192 -201588 -216297 -264415 -209068
24393 -209068 -75459 -56015 13825 -12122 -65035 -81090 -59043 2317 -50240 -94045 -100588
24382a00588K2226k9669J09192l1350l9352N3917j0512L3377K6899l8431p597
24371a1888K9787Q775o3599o9890l3283m270M9210J4262J5858p4630J749J7978
24359a19941K3046J7558P2268L2077q7760m078J0786J13676J5117N7948K2185
24348A52882k2331l2263q1772M9337n2376p6953m827R6995k4894j01107R5249
24337b060J0648n251O2746O9843p5129l0591k3507k3436l7700M1404N2920j2521
24325B7366J05123p4643k748l2112o3698p795m9650k3952j3580M0488N1325P3124
24313B9248K1463m437q534q1164q3901P9255J5225m3203O4339j0973O5879p9356
24301c6159L2565L5779p9370J8320o760J2146k6737N3441J2592l3299p7396J5527
$$ plain form
24382 -100588 -78362 -108031 1161 -30189 -69541 -15624 -26136 7241 34140 -4291 -11888
24371 -11888 17899 26674 -36925 -106815 -140098 -144368 -95158 -80896 -65038 -139668 -137919 -119941
24359 -119941 -96895 -79337 -7069 25008 -62752 -66830 -56044 57632 72749 130697 152882
24348 152882 130551 98288 16516 65853 13477 -63476 -68303 28692 3798 -97309 -2060
24337 -2060 8588 3337 66083 135926 60797 30206 6699 -16737 -54437 -13033 39887 27366
24325 27366 132489 57846 55098 22986 -40712 -48507 -98157 -122109 -135689 -95201 -43876 29248
24313 29248 50711 46274 37740 -43424 -127325 -48070 -32845 -76048 -11709 -22682 43197 -36159
24301 -36159 -3594 32185 -47185 -28865 -35625 -23479 -50216 3225 15817 -17482 -94878 -79351
24289g9351o462o5295N0729J66029J02030k2229r6488q5806N225l1169j31626
24278a94413n8372J29808J12729M8950o3409j09460j6057R1301M5360o7801j9132
24267a00496l178N6596P6461l3461O7525R0508r946l8356l0031k7626k9602M7279
24255F5673L6885l1700n594J1909J2048j01769l8682M2634N19k4368O541L0007
24243D103J4920N1928M7344r0131n3774p6517k3399O4360l6726L2574N8951k5876
24231c2243p0114J00224k0921J14739K6046M8828K8228j7063o8593q7497n5579
24220c3945J0558l62O2092l5927j6657r292O0890O9104k6948j6810l4549J6455
24208D4609j01571j3283L8600Q3985K5245M58K0429n0325M2387k5391l9515l2862
$$ plain form
24289 -79351 -85813 -151108 -100379 65650 167680 145451 48963 -36843 -31618 -62787 -194413
24278 -194413 -252785 -122977 -10248 38702 -24707 -134167 -150224 -58923 -13563 -81364 -100496
24267 -100496 -103674 -47078 29383 -4078 63447 153955 144009 105653 75622 47996 18394 65673
24255 65673 102558 70858 65264 77173 89221 -12548 -51230 -8596 -8077 -32445 -25904 4103
24243 4103 19023 70951 118295 28164 -25610 -102127 -125526 -61166 -97892 -65318 -6367 -32243
24231 -32243 -102357 -2133 -23054 91685 117731 166559 194787 177724 109131 21634 -33945
24220 -33945 -23387 -23749 38343 2416 -14241 -23533 37357 106461 79513 62703 28154 44609
24208 44609 -56962 -70245 -31645 52340 77585 78043 98472 48147 90534 65143 25628 -7234
24196g234o8532l18P8780Q1219N182l070m9218j05542o3774P6240K8722j1867
24184c9412K0344k31p0762L3132P5474l9470j8319J0430P489k0258L1993k2956
24172c2546r25J8976M3776J1672m9170o8251L0614p1933m3764K5694P1591J31478
24160F7212r815m7408l4374K3038N038L018K8985p2716Q1344P6294L5864K5333
24148A81813j3623P397r0743j06944j4504M151l8354P2277J29740L1457n1310
24137A11357k1449p9550p4427l7855O060M9817k0753l5163R599n5161L7220R7031
24125a3274O652m9477J2468k7760m0486P6302M0478q9958L8957R1794M9013M391
24113I9100m930o3798j20887m75P5454k219o2464p1244J46030P4482q9265r4675
$$ plain form
24196 -7234 -75766 -76084 2696 83915 89097 86027 36809 -68733 -132507 -56267 -27545 -39412
24184 -39412 -19068 -19299 -90061 -56929 18545 -20925 -39244 -28814 -21325 -41583 -9590 -32546
24172 -32546 -33471 -14495 29281 40953 -8217 -76468 -45854 -117787 -161551 -135857 -64266 67212
24160 67212 57397 9989 -24385 -1347 3691 6709 35694 -37022 44322 120616 156480 181813
24148 181813 168190 175587 84844 -22100 -36604 -32453 -70807 1470 131210 162667 111357
24137 111357 89908 10358 -64069 -101924 -95864 -46047 -66800 -101963 -92364 -147525 -110305 -13274
24125 -13274 -6622 -56099 -43631 -71391 -111877 -35575 4903 -85055 -46098 45696 94709 99100
24113 99100 94170 30372 -90515 -90990 -15536 -17755 -80219 -151463 -5433 69049 -20216 -114891
24101a14891l6599M4640N5968l4543k8354Q6399N5638p0949m1554J22822N5112
24090I3689K7921K3559l7408j07199n0668L69M1905m6603p7559o3361k0103J67018
24078d8440J2302K4825k4694L5571m5398K8659L2951j37073N6105j5224J09147
24067B8731K2314m2080N1407Q055L3045j4448m6390q9933m6890N4989N0146m931
24055D015l2484k13316j4433J16203J62568O343O7040R474J5231k3100n7068j42997
24043a02524j12634j3887K8927k2228L5741L4899L6697O5567L1573k0890j8680
24032e7439M5318J45369J9128n1595o3232j2757R1816K5035P1030p9665k40335
24021a07327n4696Q4316Q8219j5085k8824n8378L6074P7206N0175o6216l2400
$$ plain form
24101 -114891 -151490 -106850 -50882 -85425 -113779 -27380 28258 -42691 -84245 38577 93689
24090 93689 121610 145169 107761 562 -50106 -49737 -7832 -54435 -131994 -195355 -215458 -48440
24078 -48440 -36138 -11313 -36007 -436 -45834 -17175 15776 -121297 -65192 -80416 28731
24067 28731 51045 8965 60372 68427 101472 87024 40634 -49299 -96189 -41200 8946 4015
24055 4015 -28469 -241785 -256218 -140015 22553 28896 95936 105410 120641 97541 40473 -102524
24043 -102524 -215158 -229045 -200118 -222346 -186605 -151706 -115009 -49442 -17869 -38759 -57439
24032 -57439 -12121 133248 152376 100781 37549 24792 116608 141643 212673 133008 -107327
24021 -107327 -162023 -77707 10512 -4573 -33397 -91775 -55701 21505 71680 5464 -26936
24010b6936j0330q6873O9161Q7239J308J15862L6707L692m1732k6070j00626k3064
23998a662K5995l4655j46949j19333N7459J35938K539J7541J22181J09939M4111
23987B13104j39279o9184m2527k6697k3526k6700r7824M308n4908n5486J66971
23976a51748J03945l1353N11O2931p25o7714R559L6646n1586q153N1769k4066
23964f9984J8253o6593P2730J37729k1562L05p3759j7049K7054J9186j9185k1368
23952a4243K7612n9918L883n607Q655J8596k3570N2236m1158k4813j1590n8204
23940a28121j2094J4802J4043J7820L5942J9400R9608k302j20441q0806M4311
23929i7838O1440O8491J1634k7321n9133N1581M6376m3658l8477p0887k9016N6076
$$ plain form
24010 -26936 -37266 -124139 -54978 32261 33569 149431 186138 189830 148098 122028 21402 -1662
23998 -1662 24333 -10322 -157271 -276604 -219145 -83207 -80668 -63127 59054 168993 213104
23987 213104 73825 4641 -37886 -64583 -88109 -114809 -212633 -208325 -263233 -318719 -151748
23976 -151748 -47803 -79156 -78645 -15714 -16439 -84153 -74594 -37948 -89534 -97687 -45918 -69984
23964 -69984 -51731 -118324 -45594 92135 70573 70878 -2881 -19930 7124 26310 7125 -14243
23952 -14243 13369 -46549 -42666 -48273 -39618 -21022 -44592 7644 -33514 -58327 -69917 -128121
23940 -128121 -140215 -125413 -111370 -93550 -57608 -38208 61400 59098 -61343 -142149 -97838
23929 -97838 -36398 32093 43727 16406 -42727 8854 55230 11572 -26905 -97792 -126808 -70732
23917g0732R9845k4165n6844L0415O7337j07017j5728M9025N5667k5501m6018
23906d3716Q9136l554K7338p6951n4576M2940j5366r8936L0237N7989M4569L6194
23894C5304o7866l0477o4605m6769o4185o6079K6624J40365Q8662j0323L0504
23883b8845k1847m357m9903R7460P1303n5227q3561L835J18256Q168K1473M168
23871H0923o2022o6967K9365O650q575p009j4876K9979P3557Q1011k6303O602
23859A22335o545l4581p2790q4120R347L6376j25830l8210Q5141P3765R8357M5601
23847A08846p2290j30114p0408J6069M6009L1817L3140P0098j06933j63468K4489
23836b12745J87088J05904K9637P3517m2023p2513m264n7137j118L6329j6333
$$ plain form
23917 -70732 29113 4948 -51896 -21481 45856 -61161 -76889 -27864 27803 2302 -43716
23906 -43716 45420 41866 69204 -7747 -62323 -19383 -34749 -133685 -103448 -45459 -890 35304
23894 35304 -32562 -63039 -127644 -174413 -238598 -304677 -278053 -137688 -49026 -59349 -28845
23883 -28845 -50692 -55049 -104952 -7492 63811 8584 -74977 -71142 47114 55282 76755 80923
23871 80923 18901 -48066 -18701 -12051 -20626 -27635 -42511 -12532 61025 142036 115733 122335
23859 122335 115790 81209 8419 -75701 -66354 -29978 -155808 -194018 -108877 -35112 63245 108846
23847 108846 36556 -93558 -163966 -147897 -101888 -70071 -36931 33167 -73766 -237234 -212745
23836 -212745 -25657 80247 109884 183401 141378 68865 64601 7464 6346 42675 26342
23825B6342k2594J5812l9915l139k9994N19J56364L3064j16424j04470R22Q816
23813g4697j11267p4927O0990P9835K6260L3634P4623K2981M5993m4200l0930
23802H295K6137p4358m3949j5254L0471R8572J11592k6789j26743k7497K2690
23791a6833j07433L6794N8428l2036j1783Q287j7638J653J46493O9705n8593M4231
23779A21275o6472l0316j502M890K0359l2247m4139M833L164n5772n6617M6333
23767h6211J10799o285m3581o7885o140o2944N010m4851l844L0289P5991O638
23755i3014J7806k1726Q0718O2246o861O6670l4154n5214k9903P5300K7874j05602
23743a5860p9372J6533m7878q6992o5591M39J08808J33241o1142q9761J8866N0251
$$ plain form
23825 26342 3748 19560 -20355 -23494 -53488 -52969 103395 136459 20035 -84435 -83513 -74697
23813 -74697 -185964 -260891 -199901 -120066 -93806 -60172 14451 37432 83425 39225 8295
23802 8295 34432 -39926 -83875 -99129 -68658 29914 141506 114717 -12026 -39523 -16833
23791 -16833 -124266 -87472 -29044 -61080 -72863 -64576 -82214 -80561 65932 135637 77044 121275
23779 121275 54803 24487 22985 27875 48234 15987 -28152 -23319 -20155 -75927 -132544 -86211
23767 -86211 24588 18303 -25278 -93163 -99303 -162247 -157237 -202088 -205932 -175643 -99652 -93014
23755 -93014 -75208 -96934 -16216 46030 39169 105839 71685 16471 -13432 61868 89742 -15860
23743 -15860 -95232 -78699 -126577 -213569 -279160 -278721 -169913 -36672 -97814 -187575 -168709 -118458
23731a18458J07189K8101k235M4587P8190k1320j09207M9045K7917m9170p3627
23720c8988j8414j9931n387M4380K1238L8401Q7978n9249q4537j8943J3166Q0585
23708D0299Q7664p187q2395J3104N1296q9404j14666j6530P6600l3105k9785m8807
23696a52916m5916Q521o971J0674O0161j4833L148J29350N6984J638k3271K4434
23684E1003j5890o5552l0301n2276L9327J20831j2687l3850j0304j8338j3607
23673d1644j50787J9173l5288Q621L9520k9419j4441M9336J07585p335n081o958
23661f6718J02531k49k7861j947K3755K7970k3142n4678l4142j8878J3047N3948
23649f364n9615n0366Q1427L1003k7035m0336P7124R0501j8026K121p9169j97397
$$ plain form
23731 -118458 -11269 16832 14597 59184 137374 116054 6847 55892 83809 34639 -38988
23720 -38988 -57402 -77333 -82720 -38340 -17102 21299 109277 50028 -34509 -53452 -40286 40299
23708 40299 127963 120776 38381 51485 102781 13377 -101289 -117819 -41219 -74324 -104109 -152916
23696 -152916 -198832 -190311 -197282 -186608 -126447 -141280 -138132 -8782 48202 49840 26569 51003
23684 51003 35113 -30439 -60740 -113016 -73689 47142 34455 605 -9699 -28037 -41644
23673 -41644 -192431 -173258 -208546 -199925 -160405 -189824 -204265 -154929 -47344 -54679 -59760 -66718
23661 -66718 35813 35564 7703 5756 29511 57481 34339 -20339 -54481 -73359 -60312 -6364
23649 -6364 -65979 -116345 -34918 -3915 -30950 -71286 5838 96339 78313 80434 1265 -196132
23637a96132j36303J06198J83239J77318Q0966q1514q8257n922m7552p6867M151
23626h0675L0624l8983Q858k6912L637j34q0649k6025R7143K234l9028m9273P740
23613a91443R1523R2731J5665p5288p5526M2473Q5811R9552m6129j14220J1699
23602f3152k2904m2134O1870n1524k1787J02510N1630L1810j08107k0819j3606
23591i6213K0945M4621J7954N3946K221M3626n7470q3737Q2011p426K025K3454
23579D5957J165n901r2021J5151J00952n5308n8426k76o0413N339K8847o7286
23567a42220Q3994Q4750J26809K1031j00792L8526Q7035p7170p2317j04325q2188
23556a36867L5869n4003O3224J25570J12246k548j8483o7990n8580P6709p6304
$$ plain form
23637 -196132 -332435 -226237 -42998 134320 215286 133772 45515 39593 -7959 -84826 -80675
23626 -80675 -50051 -89034 -80176 -107088 -103451 -103585 -184234 -210259 -113116 -110882 -149910 -199183 -191443
23613 -191443 -99920 -7189 8476 -66812 -142338 -99865 -14054 85498 39369 -74851 -63152
23602 -63152 -86056 -128190 -66320 -117844 -139631 -37121 14509 46319 -61788 -82607 -96213
23591 -96213 -75268 -30647 -12693 41253 43474 87100 29630 -54107 27904 20478 22503 45957
23579 45957 47122 41221 -50800 -35649 65303 9995 -48431 -48707 -109120 -103781 -74934 -142220
23567 -142220 -58226 26524 153333 174364 73572 112098 199133 121963 49646 -54679 -136867
23556 -136867 -100998 -155001 -91777 33793 146039 143491 125008 57018 -1562 75147 -1157
23545a157l6435m2262p4977P720K5878l5765O9482K9627m5619P8210Q5781N7455
23533A17938n8629l6473m8457K5466M0774N1311n8492L7532J33768N4382j12811
23522A46309j70413j08394o444N0497j0796J53881P6659q2528j01807Q5286J071
23511C3321j8080M5798m7566k4604o5752m7857K0411J45089k919k5063Q3103p705
23499H8176k2619M4757j756p619l4758p5289k2418o1838k5417P4367J1962L7074
23487D622O5496N5036p4254m3987J8081j8089p5756p4030N6476L4515P3354P3753
23475I5217n5296J4423n9813r3836r84N0848l1027M1386M386k1438l126N4003
23463e257p8531K894O1235P5360k8504p8902Q5585o456q2309P9024J57779j09248
$$ plain form
23545 -1157 -37592 -79854 -154831 -147111 -121233 -156998 -87516 -57889 -103508 -25298 60483 117938
23533 117938 59309 22836 -25621 -155 40619 91930 33438 70970 204738 259120 146309
23522 146309 -24104 -132498 -138942 -88445 -99241 54640 131299 48771 -53036 32250 33321
23511 33321 15241 61039 13473 -11131 -76883 -124740 -104329 40760 37841 12778 95881 88176
23499 88176 65557 110314 108558 100939 66181 -9108 -31526 -93364 -118781 -44414 -32452 4622
23487 4622 70118 125154 50900 6913 24994 6905 -68851 -142881 -86405 -51890 21464 95217
23475 95217 39921 54344 -5469 -99305 -100289 -49441 -80468 -39082 -34696 -56134 -59260 -5257
23463 -5257 -83788 -80894 -19659 55701 27197 -51705 33880 27424 -54885 24139 181918 72670
23451G2670p9163M2781K1137J2865O7578m654o6868n8961l6582m5600J36068l2389
23439B8882j10524j05064J9329P9812O6973K5320q9238q4371J6412J54623n3255
23428e1101K1166N3523k4295m6200m2034q3871j9272N4904J00980P5952K3307
23417F3059j09074l5573Q2390Q11M0140J13591R1401j33877k7772J6282l6239
23406F5139O1901j2934j0862q7973j35956K8364J20003P458j14455o762L2480
23395e3597M7555L5388o0951j72387M0790M7991K1846M8964n6985n7516O6217
23384i2685J10557j5262k8640j0322P857q3003K6558O0976M8468J7122p0163l3118
23372f1655Q2212m9895j11771p4570Q3606R5495K2488K2024k9116l2220K2912
$$ plain form
23451 72670 -6493 36288 57425 70290 137868 133214 66346 7385 -29197 -74797 61271 28882
23439 28882 -81642 -186706 -167377 -87565 -20592 4728 -84510 -168881 -152469 2154 -51101
23428 -51101 -29935 23588 -707 -46907 -88941 -172812 -192084 -137180 -36200 39752 63059
23417 63059 -46015 -81588 802 1613 41753 155344 246745 112868 85096 101378 65139
23406 65139 127040 114106 103244 15271 -120685 -92321 27682 35140 -79315 -86077 -53597
23395 -53597 -6042 29346 -31605 -203992 -163202 -115211 -93365 -44401 -101386 -158902 -92685
23384 -92685 17872 2610 -26030 -36352 -28495 -111498 -84940 -23964 24504 41626 -28537 -61655
23372 -61655 20557 -29338 -141109 -215679 -132073 -36578 -14090 7934 -21182 -53402 -30490
23361c0490j8893K1992N3176N7195k8527j40946k7945K2431p2425p4035J47289
23350i1178M7617m5941N5140P1141K0306j6383n7519l4732L8266L6105m2629j08208
23338a28015Q8898l9308m6746Q6676J04751j5066n6460l7387j938l781L6386p987
23326a9977J5793J3725L1130m4286J6713l494o1458o5728O9188O8398j64194r4909
23314b39099N6354O4922P3769l8754Q0976K5595l6367M9j1713n3045J50931K0760
23302I4378m9203n6746j3251N6541O3446M7740L0852p8856R9854n5238k7233r6141
23290A6143m8686Q2259n5221N076l5838o886o2097k4786j3998O0870Q6436P9264
23278H2536k6718n3043k00J6157q139L2094J5162k1727M1292l7647P3225k7722
$$ plain form
23361 -30490 -49383 -27391 25785 82980 54453 -86493 -114438 -92007 -164432 -238467 -91178
23350 -91178 -43561 -89502 -34362 36779 57085 40702 -16817 -51549 -13283 22822 -19807 -128015
23338 -128015 -39117 -78425 -125171 -38495 66256 51190 -5270 -42657 -44595 -48376 -11990 -19977
23326 -19977 -4184 9541 40671 -3615 13098 9604 -51854 -117582 -48394 20004 -144190 -239099
23314 -239099 -182745 -117823 -44054 -82808 -1832 23763 -12604 -12555 -24268 -77313 73618 94378
23302 94378 45175 -11571 -24822 31719 95165 142905 173757 94901 194755 139517 112284 16143
23290 16143 -32543 49716 -5505 -429 -36267 -43153 -105250 -130036 -144034 -83164 3272 82536
23278 82536 55818 2775 2575 18732 10593 42687 57849 36122 77414 39767 112992 85270
23266H5270R767j932J4429O6212l04j07623r1019r9769j7853N8438q6326M040
23254a66670J26437P1030n1391j8633m1724k3095J6512R4190M3735L3054J8070
23243A01515j07129o8640M0723P3997K0603J00577M0083n9739n7234p9248j03895
23232i8387j59484k5326J14849P2333j25959N2230J15276L6412k1935R20P2489
23221C3418M5855n8128M279l1457n0728j0673j2010J36391M8545q1191j48215
23210a23914K4611J3394K2904q7335L4379R2855O9006J9570m775n6033L2586j1255
23198B5993n5113L2228J9684n7466k823r7321J5801P0949M9925M9839L4323r291
23186G6728l3384n7104p6149l1730R4545N1620L1461M2062j09457R7771J5491
$$ plain form
23266 85270 95037 93105 107534 173746 173442 65819 -25200 -124969 -142822 -84384 -170710 -166670
23254 -166670 -40233 30797 -20594 -39227 -80951 -104046 -87534 6656 50391 83445 101515
23243 101515 -5614 -74254 -33531 40466 61069 161646 201729 141990 84756 5508 -98387
23232 -98387 -257871 -283197 -168348 -96015 -221974 -169744 -54468 -18056 -39991 -39071 33418
23221 33418 79273 21145 25424 -6033 -56761 -67434 -79444 56947 105492 24301 -123914
23210 -123914 -99303 -85909 -63005 -150340 -115961 -23106 45900 65470 60695 4662 37248 25993
23198 25993 -29120 3108 22792 -34674 -37497 -134818 -119017 -48068 1857 51696 86019 76728
23186 76728 43344 -13760 -89909 -121639 -27094 24526 55987 98049 -11408 86363 101854
23175A01854n0551N1593k1416o7237M654m6211l0729r191J46975R8050j06295
23164G1496l4639o5558K3407n4254j104J8749p8687k9522Q2901J13512p1057p7794
23152a02550P1049p4484J9987k3617k6494L1443m0116L6255O1702m3187m9531
23141a39543N4054K6745L2939R5653j54445m4703R0396p795J3333M8159K4827
23130C9620K8014o6464L2828O5589p9182L1368k5075J266M9992o803q6970M7235
23118C1418Q4125n5317o685q2936o6408q8517n289M1726J01133K1010l4266m3197
23106a03203P538k4921o8127r1345j8485J23625K0944M7891K4572L5333R89o3538
23094a08727m2796Q2362n9513j3453R3075P5208m4799O562N7493o3383q930o5222
$$ plain form
23175 101854 51303 102896 81480 14243 18897 -27314 -58043 -67234 79741 177791 71496
23164 71496 36857 -28701 -5294 -59548 -60652 -41903 -120590 -150112 -67211 46301 -24756 -102550
23152 -102550 -31501 -105985 -85998 -109615 -136109 -104666 -144782 -108527 -46825 -90012 -139543
23141 -139543 -85489 -58744 -25805 69848 -84597 -129300 -38904 -46699 -33366 14793 39620
23130 39620 67634 1170 33998 99587 20405 51773 26698 27964 77956 71153 -15817 31418
23118 31418 115543 60226 53541 -29395 -95803 -184320 -189609 -147883 -46750 -25740 -60006 -103203
23106 -103203 -95665 -120586 -188713 -280058 -298543 -174918 -153974 -106083 -81511 -46178 -45189 -108727
23094 -108727 -151523 -69161 -128674 -142127 -49052 26156 -18643 -12081 45412 -17971 -26901 -92123
23082i2123P948O3182j0867J325K2416o2596n7830K5182J37073r360j8814J461
23070F997L7339q6099P015J03702K1739k8481q4327n6130J4633l7247L7865K4299
23058c8695l8437L9472Q7427R6564J4731l4339m1365Q605j6680k7720j6519N7203
23046I0247P6040l1820q8507l9304n2560r3534q6950K401R3071N5098k670k0732
23034i9220l5208O1017N3852K8754J20879n6767p9348O4916m0579r327J2145J9332
23022D0446K3272k5793n97l3996j623n1054K729L8533J3535n0048N2368N7726
23010F5498P9959o4044r7469M5760M1554N6211o1312m04o1916j0744J5880Q919
22998A7892j29950m2552m9192J4301J71346Q6376r3425k4103M9995N2056L1230
$$ plain form
23082 -92123 -84175 -20993 -31860 -30535 -8119 -70715 -128545 -103363 33710 24350 5536 6997
23070 6997 44336 -41763 -34748 68954 90693 62212 -22115 -78245 -63612 -100859 -62994 -38695
23058 -38695 -77132 -37660 49767 146331 161062 126723 85358 93963 77283 49563 33044 90247
23046 90247 166287 134467 45960 6656 -45904 -139438 -226388 -223987 -130916 -75818 -78488 -99220
23034 -99220 -134428 -73411 -19559 9195 130074 73307 -6041 58875 18296 8969 21114 40446
23022 40446 63718 37925 37328 3332 1709 -49345 -46616 -8083 5452 -44596 7772 65498
23010 65498 145457 81413 -16056 29704 71258 127469 66157 65753 3837 -6907 8973 17892
22998 17892 -112058 -154610 -203802 -189501 -18155 68221 -25204 -49307 688 52744 83974
22987H3974k3521n6501p7951l2009J2436N6371L9551n207l199j40002j3979m8913
22975b08950Q1630J07395M3597J14520P5239o9987j21657q3377K1114m3229l23
22964h4028m6496o755J17934R0559l532L791n6262q1473k5802k4214L1088J19040
22952C3850N0592M8770K0603r7386q3582J6949j6072k1061O2693j5257n7140K5934
22940c1107l5470l9657K927r273J6140M5923o911l0164J4970K3802k6282L5885
22928c9217M3779L6311K2796j8738m0694k860j7359J3124N5940p558p8877M2526
22916I173l2128j22882j0530K0288M0458K2093K4801k3011l3028R1440K4579q1474
22904g0221j08796J1669P4404L5570j0703K7447K8580M1191q1312J5059L8595
$$ plain form
22987 83974 60453 3952 -73999 -106008 -93572 -37201 2350 -2857 -6056 -146058 -160037 -208950
22975 -208950 -127320 -19925 23672 138192 213431 143444 21787 -61590 -40476 -83705 -84028
22964 -84028 -130524 -137279 -19345 71214 67682 71473 15211 -66262 -92064 -116278 -85190 33850
22952 33850 84442 133212 153815 56429 -27153 -10204 -26276 -47337 15356 99 -57041 -31107
22940 -31107 -66577 -106234 -103307 -112580 -96440 -50517 -57428 -87592 -72622 -48820 -75102 -39217
22928 -39217 4562 40873 63669 44931 4237 1377 -15982 -2858 53082 45524 -33353 9173
22916 9173 -22955 -145837 -156367 -136079 -95621 -73528 -48727 -71738 -104766 -13326 11253 -70221
22904 -70221 -179017 -167348 -92944 -57374 -68077 -40630 -12050 29141 -52171 -37112 1483
22893A483R275l6911l0248p2633J01540K3895j5115l6883Q7364Q103Q5446N2018
22881A77334j3853r633o9083J3322M4233m4151k4967l9954O137m960j2162R236
22869C1499M3884n4760j18048L5320J18848P8186r9375K4595J4360r1700j27899
22858a45090M3050R5948O306l3342N4716R0343q947M501m5029l5712j02799K3451
22846e2604P6333L8839o217m1m9742m6399n3583P8234N7131q169N1312M7366k2329
22833A10131L8462p8560M4389m3073Q7470J881j07125m7916O8667l3473l5861
22822D992M671l7755o472J9737L7098n1155J4956N4265m003J05105N1212j206
22810A91445l6933P141j1524k31755J7551N2340m8228m1206M0686K6057m0128
$$ plain form
22893 1483 10758 -26153 -56401 -129034 -27494 -3599 -18714 -55597 31767 39870 125316 177334
22881 177334 163481 153848 84765 98087 142320 98169 73202 33248 39385 34425 22263 31499
22869 31499 75383 20623 -97425 -62105 56743 134929 35554 60149 74509 -17191 -145090
22858 -145090 -102040 -6092 214 -33128 21588 111931 102984 107485 62456 26744 -76055 -52604
22846 -52604 23729 62568 56351 56310 6568 -39831 -93414 -15180 41951 33782 85094 132460 110131
22833 110131 148593 70033 114422 71349 158819 160700 53575 5659 74326 40853 4992
22822 4992 9663 -28092 -34564 -14827 22271 -28884 -13928 40337 36334 141439 192651 191445
22810 191445 154512 161653 150129 -81626 -64075 -11735 -59963 -101169 -60483 -34426 -74554
22799g4554J18688J61705j6948j19498n3933m4171j083P7367M0180k816q0963
22788C974n0462K9931o512j7932n6902M4117N6288Q4329r957j8718P845N0629
22776A16630l7170n6423l5347p6106m5385m6183o4709N4470J40250P872M1807
22765b94j0345m4106K9849M9723L4178Q2091M7677j40604q7808j04802K2321p82
22753a22902o6650P9508O6822p232R8654R0362Q2719o0751q3956k29179n2857
22742b05462J25875K8425o8827L2474j8303n1450J16467J42559L0985r0481l5165
22731G097m2885M9614Q1182N4928m0711l5521J2591r5503j09740L4812N9053L0248
22719E165m0342M5060J0549j230k331L9770L6475J17039l1516k02728q4694Q1337
$$ plain form
22799 -74554 44134 205839 188891 69393 15460 -28711 -29794 47573 87753 84937 3974
22788 3974 -46488 -16557 -23069 -41001 -97903 -53786 2502 86831 76874 58156 66001 116630
22776 116630 79460 23037 -12310 -88416 -133801 -179984 -244693 -190223 -49973 -42101 -294
22765 -294 -10639 -54745 -24896 24827 59005 141096 188773 48169 -39639 -144441 -122120 -122902
22753 -122902 -189552 -110044 -43222 -50454 48200 138562 221281 160530 76574 -152605 -205462
22742 -205462 -79587 -51162 -119989 -87515 -105818 -157268 -40801 101758 132743 42262 7097
22731 7097 -35788 13826 95008 149936 109225 73704 86295 -9208 -118948 -84136 -25083 5165
22719 5165 -35177 9883 20432 19202 16871 56641 93116 210155 178639 -24089 -108783 -27446
22707b7446O4751Q505Q6451m0479q5184n2745R3363N4975l9245r2610o7175j473
22695i8312q124q4318n646R535R0968O7040O6633N0731k210j5547o9012M5539
22683D7277J62200m915j07235j60242j3294N308M9147N27n0845k9443P0944N4956
22671B4385m3386m8101n7452R6738M0639P1069j2310m7363p91L2233p9069k9073
22659e2481j0118L1164M4867N7242P2650K3347p4670K009j7506J6127m7195l414
22647D2022p76J5041N2936M6592l8132r4387J7347m8825l3342Q1410j2510n6157
22635b8781n0529K4828L2258L766O1065L0456k9080m1313l3943Q9120O7945J8715
22623A44507j11447r6197q5935R1004J8900o6577M065J5309Q4323J5995o208O412
$$ plain form
22707 -27446 37305 45810 132261 91782 6598 -46147 47216 102191 62946 -29664 -96839 -98312
22695 -98312 -106436 -190754 -196400 -186865 -95897 -28857 37776 88507 86297 70750 1738 47277
22683 47277 209477 204562 97327 -62915 -76209 -70901 -21754 -21227 -72072 -101515 -30571 24385
22671 24385 -19001 -67102 -124554 -27816 12823 83892 71582 24219 23428 55661 -23408 -52481
22659 -52481 -62599 -31435 13432 70674 143324 166671 92001 94010 76504 92631 45436 42022
22647 42022 41246 56287 109223 155815 117683 23296 40643 -8182 -41524 39886 27376 -28781
22635 -28781 -79310 -54482 -22224 -18458 42607 73063 43983 2670 -31273 57847 125792 144507
22623 144507 33060 -63137 -149072 -58068 -39168 -105745 -101680 -86371 -2048 13947 7739 14151
22611A4151R1202N2699r6510j6281n6179J812N6717j949r1587p0341Q699R296
22599i8271K6756K4399O2917O1207j15064j52087M2586j5347J125P7283M7587
22588c6909M2348n0855N5071j3490q5648M0294Q2922N695P5461o7677q6519N2060
22576A2753Q3478m4496k0486q4356L5277P5938l6618n5703Q7325J9508l0252o9849
22564b7481m4820K3878k60m8596l2961K6231p84K6271M0634j0483K7549Q014N0691
22551C7883N0165r4200l2559r236o1323k6216k1944P5925J1314l9698k6857L6087
22539a00659Q2359J6475j44082n5515K2829Q6465K6854L5087R8158r1588M1356
22528A7739j4574J794k2355J4741N9666K1581k3227j1599k8857p1919n840j6740
$$ plain form
22611 14151 105353 158052 61542 45261 -10918 -9106 47611 45662 -45925 -116266 -107567 -98271
22599 -98271 -71515 -47116 15801 77008 -38056 -190143 -147557 -162904 -161779 -84496 -36909
22588 -36909 5439 -45416 9655 -3835 -89483 -49189 33733 39428 114889 47212 -39307 12753
22576 12753 96231 51735 31249 -53107 -17830 58108 21490 -34213 53112 72620 42368 -27481
22564 -27481 -72301 -48423 -48683 -97279 -130240 -104009 -104793 -78522 -37888 -48371 -20822 -12808 37883
22551 37883 88048 -6152 -38711 -47947 -109270 -135486 -157430 -81505 -70191 -109889 -136746 -100659
22539 -100659 -18300 -1825 -145907 -201422 -178593 -92128 -65274 -30187 67971 -23617 17739
22528 17739 3165 4959 -17396 -2655 57011 78592 55365 43766 14909 -57010 -62850 -79590
22516g9590R1518N2255j09062l1860k9971P5104Q4016p453n4621j28295O0454
22505g7505J17192j7060k5036k1799p354k5510k7328O731J0889M3010N7599J4815
22493D8644j6967J1949m5732n5858P2757J00234j10313o6183L7355l2380l8323
22482i4817P0981p952L5736J49L2124P5932j2499m8807q8624k2534j05716r1013
22470b57040j6998J04339J19250K7077n808M9115N3729M202n224n8865j6280q3517
22458h6020M5931P0307o5490j00577R2669J71922L219l6831o5096l1426P3851
22447G2459M8495O343q2080j07842M3288J6254L3273Q7541k3381R5997J1065n7228
22435A44184j22023L0379J5444o1992O376O0537l782L6511p2182j04852R9310
$$ plain form
22516 -79590 11928 64183 -44879 -76739 -106710 -31606 52410 44957 -9664 -137959 -77505
22505 -77505 39687 22627 -2409 -24208 -31562 -57072 -84400 -77669 -66780 -23770 33829 48644
22493 48644 31677 43626 -2106 -57964 14793 115027 4714 -61469 -24114 -56494 -94817
22482 -94817 -23836 -31788 3948 4097 36221 112153 99654 50847 -37777 -60311 -166027 -257040
22470 -257040 -274038 -169699 -50449 -23372 -29180 19935 73664 77866 72642 13777 -2503 -86020
22458 -86020 -40089 30218 -35272 -135849 -43180 128742 131961 95130 30034 -1392 72459
22447 72459 120954 127297 45217 -62625 -19337 -3083 30190 117731 94350 190347 201412 144184
22435 144184 22161 52540 67984 5992 12368 72905 69123 105634 33452 -71400 27910
22424B7910j8284o2524N874m292M9931p6615L0438N8043K092n7572j1165J1964
22412d4200l6527N7077J58391O4948j8853j966N4424J1231j34209n0484O0415
22401A20247J08553N2721j21901j26497o7706L2698P52r447L3680P8175k0624
22390H0651r4214k2236P920J8520J8067j07748l3086j0303J8551O9137K8124l3206
22378e9823j3987Q9218J69951m3979n7913j4607p0198J6139o7892o771J5562J250
22366d3050r3840J2894N3663L5019L9582O4742K4718j01570J1565K6714L8496
22355F8933K052p9597m9722O8378N0237l4519o1084N0213O6142Q9817q2191k4253
22343F4406L4906P540J1941r8224q8938m0789O3794O3789L1855K4911J5271J0857
$$ plain form
22424 27910 9626 -52898 -47024 -51316 -1385 -78000 -47562 10481 12573 -44999 -56164 -44200
22412 -44200 -80727 -23650 134741 199689 180836 178870 233294 244525 110316 59832 120247
22401 120247 228800 281521 159620 33123 -34583 -1885 -1133 -10580 23100 101275 80651
22390 80651 -13563 -35799 -27879 -9359 8708 -99040 -132126 -142429 -123878 -54741 -26617 -59823
22378 -59823 -73810 15408 185359 141380 83467 68860 -1338 14801 -53091 -59862 -44300 -43050
22366 -43050 -136890 -123996 -70333 -35314 4268 69010 93728 -7842 3723 30437 68933
22355 68933 70985 -8612 -58334 10044 60281 25762 -35322 14891 81033 170850 88659 64406
22343 64406 99312 106852 118793 20569 -68369 -109158 -45364 18425 50280 75191 90462 101319
22331A01319k918m8982m0983K4975N2709J4038M2291L618n2276m4957q057J9201
22319E9978j2454l8788q1021l5600P7414K0136R0148K5421o5794P7621N4684p8368
22307I3377n9360p1812k1834m1391l1026p195j2343J6118n768P9004M0104l5659
22295e7785N2142n3600K7185K7413o347q2182M9507J5457p479J734J55968L1141
22283A53154j43079q6932K5637M9393O33r3021m6026O2084j15006j8655J24044
22272h7774N9528j9573R3368J3309o3681m50K0332O9552J8366k000q9294j09794
22260i8111O40M4287L4708k540n9202M5028M6632P470o931L2827M6112m2771j50988
22247a02839n320J03625l8738m2376N206j0397K8745M3395k0392q7816p6310L9765
$$ plain form
22331 101319 98401 49419 8436 33411 86120 100158 142449 146067 93791 48834 40777 59978
22319 59978 47524 8736 -72285 -107885 -30471 -10335 79813 105234 39440 117061 171745 93377
22307 93377 34017 -37795 -59629 -101020 -132046 -139241 -151584 -135466 -141234 -62230 -22126 -57785
22295 -57785 -5643 -59243 -32058 -4645 -10992 -93174 -43667 -28210 -35689 -33955 122013 153154
22283 153154 10075 -76857 -51220 -1827 -1194 -94215 -140241 -78157 -193163 -211818 -87774
22272 -87774 -28246 -47819 45549 58858 -4823 -5273 15059 84611 102977 100977 11683 -98111
22260 -98111 -97471 -53184 -18476 -21016 -80218 -35190 11442 18912 11981 44808 90920 48149 -102839
22247 -102839 -108159 -4534 -43272 -85648 -80442 -90839 -62094 -18699 -39091 -126907 -203217 -163452
22235a63452R2393M3233J2347q6051l7636M9537J26400p9506o3230k0007N3892
22224g2080N7701J12529J731r0756L9196K6578M4834n4474q1880l411K0130j9377
22212a9279J0125o048o2009k1161o6674K7155J6168M0448M3225J13760P1989l4071
22200A13628k7845Q79J53288j893r936q2810o2277K591K4613L1011j30549o1903
22188e1203P6838O2000l8293J5645j5908p1246M215N1565J9291M4953k2391N6536
22176A32002J7689m3807l8473K26J8348q642P3480k9751p8157N635P3386K0704
22164A42640O9917o8679q2871j1787K5986J4619R1570J3453m7279j9059L1104
22153A59614p9154j0086K681K5272J8423L863n9647K1678l2125r7465J4935J8615
$$ plain form
22235 -163452 -71059 -27826 -15479 -101530 -139166 -89629 36771 -42735 -105965 -125972 -72080
22224 -72080 -14379 98150 99881 9125 48321 74899 119733 65259 -16621 -20032 98 -19279
22212 -19279 -9154 -15202 -77211 -98372 -165046 -137891 -121723 -81275 -38050 75710 147699 113628
22200 113628 85783 86662 239950 238057 228121 145311 83034 85625 110238 141249 10700 -51203
22188 -51203 25635 87635 49342 64987 49079 -22167 -17952 33613 52904 97857 75466 132002
22176 132002 149691 105884 67411 67637 85985 77343 150823 121072 42915 48550 121936 142640
22164 142640 212557 143878 61007 49220 75206 89825 181395 194848 147569 128510 159614
22153 159614 80460 70374 73055 98327 116750 120613 60966 82644 50519 -46946 -32011 -13396
22141a3396k1896O2984J2562N3504J87354J14246p8061j17747j53725j08007r5285
22130a57467Q5330n348L8960p4494l5849K9989P433m1936k5269Q4666M3246L5304
22118a5435j8077j16188n4282L8367J36476J02863n0987j09141l0230j4712K6507
22107a04839M1881J54488k5316k9885N0895n6372q7295j1306J08997J42165r4015
22096H9398j23388q8153K4243j392O7366N1377o5676m1709P9484m4132q1659N7530
22084g6711Q8569J3712p7681m6362M4591J3213J42203O8430k9754q4428m6450
22073I332k7768L8189o3240m0035J12878N5136m7353k9657n9358J4759P9485K5049
22061F7417m0971P811L1472n3208J9233m2683l5204m8379O6575k5512L6596J17827
$$ plain form
22141 -13396 -35292 27692 40254 93758 281112 395358 317297 199550 45825 -62182 -157467
22130 -157467 -72137 -77485 -38525 -113019 -148868 -118879 -111446 -153382 -178651 -93985 -50739 -15435
22118 -15435 -33512 -149700 -203982 -165615 -29139 73724 22737 -86404 -116634 -131346 -104839
22107 -104839 -62958 91530 66214 36329 87224 30852 -56443 -67749 41248 183413 89398
22096 89398 -33990 -122143 -97900 -99292 -31926 19451 -46225 -87934 -8450 -52582 -134241 -76711
22084 -76711 11858 25570 -52111 -98473 -53882 -40669 101534 169964 140210 55782 9332
22073 9332 -18436 19753 -43487 -83522 29356 84492 37139 7482 -51876 -37117 42368 67417
22061 67417 26446 34257 65729 12521 31754 -10929 -46133 -94512 -27937 -53449 -16853 100974
22049A00974M5683n9615L4915m2511o5494J1618j03145j05745O0166Q3186P742
22038c2226Q770P6780K7399L4811q5935r1818L315l362M4468M604k0148J918q6475
22025a17899N3692J38041J35802J10810p4116j53261k603K1723J8044q2983l3109
22014A4141M6875O4092M2581j23492r7497j9859N8877P6294J1711m7999q7659
22003f1935j403m625M7249P2888j02653p1088J4355P6754M8825j6578M0050K9488
21991G1327p8196K9979K6802r863j9754k3307N3674N647P4200j9389P342M4587
21979A63049l1806q7644P2561M7997m308Q3125K7361Q9682K56875L36950M13633
21968A367475L77492J57846J9077p454j59416k27905j95444N3824K86611K88407
$$ plain form
22049 100974 146657 87042 121957 79446 13952 25570 -77575 -183320 -123154 -39968 -32226
22038 -32226 -23456 53324 80723 115534 29599 -62219 -58904 -62266 -17798 -13194 -33342 -31424 -117899
22025 -117899 -64207 73834 209636 320446 246330 93069 90466 112189 130233 47250 14141
22014 14141 61016 125108 167689 44197 -53300 -73159 -14282 62012 73723 25724 -61935
22003 -61935 -63338 -67963 -20714 52174 -50479 -121567 -107212 -30458 18367 1789 41839 71327
21991 71327 -6869 23110 49912 40049 20295 -3012 50662 56309 130509 111120 118462 163049
21979 163049 131243 43599 116160 164157 159849 242974 270335 360017 616892 953842 1367475
21968 1367475 1744967 1902813 1921890 1914436 1755020 1527115 1331671 1385495 1672106 1960513
21958A960513N9344K2074j83565l84432m28895k82298j67646j98779p7595j06877
21948B11844o3406Q0576L8914j02865m7066N0917P3170m2125j2330N2p4284o8827
21936D4570P4261l1753j01735J6189l0189N5115M359j10007O556L4277j5332M5301
21924h388L4915Q461k7662L1964M6468M8581k2019j35846M0849L2108N1547m009
21912I6969o9678m2779P041Q28N7394N7951l77p8869k1682M1483j0643Q4375P6823
21899A98836O6987N3966p2954j58971p3901m3444K0066q3309j0973N868k1435
21888a19264N3736L3158o991o941M8856Q4412J43394J377o3902n7759M2308q6899
21876F5485j00287Q949Q8905N8053L7600O1355N5683J3754J6239p3228j7309M6983
$$ plain form
21958 1960513 2019857 2041931 1858366 1473934 1045039 762741 595095 396316 318721 211844
21948 211844 148438 229014 267928 165063 117997 168914 242084 199959 187629 187681 113397 44570
21936 44570 118831 87078 -14657 1532 -28657 26458 30817 -79190 -72634 -38357 -53689 -8388
21924 -8388 26527 34988 7326 39290 85758 134339 112320 -23526 17323 49431 100978 96969
21912 96969 27291 -15488 -8447 -7619 49775 107726 107349 28480 6798 48281 37638 122013 198836
21899 198836 265823 319789 246835 87864 13963 -29481 -9415 -92724 -103697 -97829 -119264
21888 -119264 -65528 -32370 -39361 -46302 2554 86966 230360 231737 167835 110076 152384 65485
21876 65485 -34802 -25853 63052 121105 158705 220060 275743 289497 305736 232508 215199 262182
21864B62182j04446l7811J1563o6170l5373L4238N6392R472j27860O2439j9426
21853D5200p8101M4126j1917L4950Q9364O2976J920o9568n970q7421J1909N4104
21841I1572j08082K3938n8043j7422K0418L9743P1810J65o2859j1593M5674l0305
21829E016M4696k3090p2629R7191k862L0222O9607j2553q1640n8454n688K0731
21817A0547p8200L869N6423O7508P3227J0261r5507m8530n831l8832J0668Q702
21805b5695N409O9231J4596M715Q453k7073K9685j05557j70723k9462Q8833P9782
21793e7806K8015K2221p593j249L7852N2088O5264L493m0398J3360l1017l7550
21781D6680K1100N0750J7913m4748q3998M1255q6501r4789K4213J7363J30673
$$ plain form
21864 262182 157736 119925 131488 65318 29945 64183 120575 130047 2187 64626 45200
21853 45200 -32901 11225 -692 34258 123622 186598 188518 118950 112980 25559 37468 91572
21841 91572 -16510 7428 -50615 -68037 -47619 -7876 63934 64099 1240 -10353 35321 5016
21829 5016 49712 26622 -46007 51184 48322 78544 148151 135598 53958 -4496 -10184 10547
21817 10547 -67653 -63784 -7361 60147 133374 143635 48128 -402 -6233 -45065 -34397 -25695
21805 -25695 -20286 48945 63541 68256 76709 49636 79321 -26236 -196959 -226421 -137588 -57806
21793 -57806 -29791 -7570 -15163 -16412 21440 73528 138792 142285 101887 115247 84230 46680
21781 46680 67780 118530 136443 91695 7697 48952 -37549 -132338 -108125 -90762 39911
21770C9911O0113j15120p7553M4626P0089O5552O924m4424J5156R8346p750l7762
21758A18108M7380O1695K8249p6530o7664o1497j7864j19252p8186J19719j5964
21747f1806L8742O210l9569j03675O599M756j6391N8754J56505K3729R034j28294
21735d5406n4119k4552k1183M9910O7343J029O9054J02172l1649j84116K2971
21724d8546L1673J7561n758o983Q830l5235j4807o2m4796n4209M8907J37406k5041
21711H940n157k1869L611L6840J16042Q6207L2709p8311q3479o9188J8152l1255
21699A3242l1911p0882L9333l7983R2378J1463K368J2952m6357k638O8034o7470
21687a7471p3576j2055J2752k835j1568J60862m5707j31275P732J33436P3752
$$ plain form
21770 39911 100024 -15096 -92649 -48023 22066 87618 94542 50118 65274 163620 155870 118108
21758 118108 165488 227183 255432 178902 111238 49741 31877 -87375 -165561 -45842 -61806
21747 -61806 -23064 -16854 -56423 -160098 -153499 -148743 -165134 -106380 50125 73854 82888 -45406
21735 -45406 -99525 -124077 -145260 -95350 -28007 -26978 42076 144248 112599 -71517 -48546
21724 -48546 -16873 688 -5070 -12053 -3223 -38458 -53265 -53327 -98123 -152332 -103425 33981 8940
21711 8940 3783 -18086 -14475 22365 138407 224614 257323 179012 95533 26345 44497 13242
21699 13242 -18669 -89551 -50218 -88201 4177 15640 18008 30960 -15397 -18035 49999 -17471
21687 -17471 -91047 -103102 -90350 -93185 -104753 56109 10402 -120873 -113141 20295 94047
21676I4047M6842J1751k1129j930Q3712l0615l3576k6285l4122K8328o4836p1769
21664a9582j8509M8932O594l9430O1110R3436q8565Q933M4591M0332K1141r0507
21652F8476l6536J1206N8986J8172j06092n2370O1886J52501K6727O7903j00093
21641A70766k6471M9722J05296J15242K7963j27503j07571k9477r750O0153L4463
21630B62833O328L6419m1970m9072o1906O4634J03287N7885L1891K0148o2268
21619C68209Q1168M5187l1595N2672k6720n6356j8152P1939O2871o5391r1100
21608C92732q0306j8945n066J29982N1938p9747O8971L0739p4312j3087j91R236
21596D11944J29646J78648J80329J51762J86364K97051L80113O69134R26084J202255
$$ plain form
21676 94047 140889 152640 131511 129581 213293 182678 149102 122817 88695 117023 52187 -19582
21664 -19582 -38091 10841 17435 -21995 39115 132551 43986 52919 97510 137842 158983 68476
21652 68476 31940 43146 102132 120304 14212 -38158 23728 176229 202956 270859 170766
21641 170766 144295 194017 299313 414555 442518 315015 207444 177967 168217 228370 262833
21630 262833 269161 305580 263610 214538 152632 217266 320553 378438 410329 430477 368209
21619 368209 449377 494564 462969 515641 488921 432565 414413 486352 549223 483832 392732
21608 392732 312426 293481 288415 418397 470335 390588 459559 490298 415986 402899 402708 411944
21596 411944 541590 720238 900567 1052329 1238693 1535744 1915857 2584991 3511075 4713330
21586D713330J287827R05593L45695k75899o42450q03465o00845j03675M32742
21577E258853R14978Q54791K97972j75580p86508j102641j268526r94644p35832
21568B262863n31461l82602k76295j75002k00628j18277M3831K2338n9389k6800
21558E58578j11359l0031r8571M6678l1226q8214q3551J0587k6326K9689P1463
21547B47717K0996K924J57373R2929r1970o5437Q5309L1344J8498r4475n2804
21536C52404o3571m5169m5428l1232j26m0403r2649m8591j4522M3639J19663m3431
21524I0584j18676J1679J08611P8462j1038k8583j05385M8911K16954j9903r1473
21513A80143l2939n9789k8052p941L1394O077m368P4912k7358l5010R0447L3656
$$ plain form
21586 4713330 6001157 6906750 7252445 6976546 6334096 5530631 4929786 4826111 5258853
21577 5258853 6173831 7028622 7326594 7151014 6364506 5261865 3993339 2998695 2262863
21568 2262863 1731402 1348800 1072505 897503 696875 578598 622429 644767 585378 558578
21558 558578 447219 417188 318617 365295 334069 245855 162304 172891 146565 176254 247717
21547 247717 268713 271637 429010 521939 429969 364532 449841 481185 499683 405208 352404
21536 352404 288833 243664 198236 167004 166878 126475 33826 -14765 -29287 14352 134015 90584
21524 90584 -28092 -16413 92198 170660 159622 131039 25654 74565 291519 271616 180143
21513 180143 147204 87415 59363 51422 82816 88893 84525 159437 132079 97069 187516 221172
21501B21172r7603n0063p250J01742L34357K88617J26205J41369J08553o7271
21491A099828r837p2150o245O8549O2653N7769J98882J49758j13886q5216m5575
21480A304530j36698r4738j01832q9812q0712j20875j5147r6265o0256L6022k3242
21469E20975J03913L2967J9971M0440K8021l9383L9770o7322o2156O7771J11733
21458G96700l7329r9636m4167N2381l1253J4718M0991Q8898l636r9792L4869J05602
21446H18346K6870J0652q7428J0958O185O2242j17004j12372q6570O7527P3839
21435F73245J97929O6024l8353L0192J03471k892R169J13297o8703K798n061R7347
21423A178463M7016j3914M4408N0208J23594J26892M4312l6053j9636J00598J67801
$$ plain form
21501 221172 123569 73506 66256 167998 502355 790972 917177 1058546 1167099 1099828
21491 1099828 1089991 1017841 1011596 1080145 1142798 1200567 1399449 1549207 1435321 1350105 1304530
21480 1304530 1167832 1073094 971262 881450 800738 679863 664716 568451 508195 544217 520975
21469 520975 624888 657855 677826 718266 746287 706904 746674 679352 617196 684967 796700
21458 796700 759371 659735 615568 667949 636696 651414 692405 781303 777667 677875 712744 818346
21446 818346 845216 855868 768440 779398 785583 847825 730821 618449 531879 599406 673245
21435 673245 871174 937198 898845 929037 1032508 1029616 1038785 1152082 1083379 1086177 1081116 1178463
21423 1178463 1225479 1211565 1255973 1306181 1429775 1556667 1600979 1564926 1545290 1645888 1813689
21412A813689J46075J41406J68133J35077J94165K78428J76095J23201K02984
21403C379253L24506N33776O87664P43084M59688K61126K51417K22757K15475
21394G078746L71152N41968O26264N53164M17623M10998K87986M49778O60892
21385A1398571P17343Q54075J012726J149966J504251K017518K747914L847235
21377B5249599N181816P196571J0417345J5456713K3927432L7924767N7500016
21370A82854259P1747357O1429479L3419762L647664k8272655m8723211m2466838
21363B33635817j4361978K0345129M8280706N0212504K5767964m669794l8036320
21356C21174028o5392405p0410394n5370326l7085850k4179525j5953510j0980374
$$ plain form
21412 1813689 1959764 2101170 2269303 2404380 2598545 2876973 3053068 3176269 3379253
21403 3379253 3703759 4237535 4925199 5668283 6127971 6389097 6640514 6863271 7078746
21394 7078746 7449898 7991866 8618130 9171294 9588917 9999915 10287901 10737679 11398571
21385 11398571 12115914 12969989 13982715 15132681 16636932 18654450 21402364 25249599
21377 25249599 30431415 37627986 48045331 63502044 87429476 125354243 182854259
21370 182854259 254601616 316031095 349450857 353098521 324825866 276102655 233635817
21363 233635817 219273839 239618968 287899674 338112178 363880142 359210348 321174028
21356 321174028 255781623 185371229 130000903 92915053 68735528 52782018 41801644
21349D1801644p841447n760033m376692l381150k414557j801507j085789q67640
21341A4272829p75634n67989n93075p52158o97304m58456m52599l36303k50847
21332I388464l13017m23715m48236n02828n28582l77201m24722o56070n64775
21323E149318o07397o20058m53473k53196j80884k00184j39972j60136j75493
21314B358525k39979q9517r1791n5807L1425J9006j03973n7944q5917l8387j30754
21303A514887j10286l518M6452k081n1370j14638k0772M9149r2586m0209N9270
21292A234298m7647l2606m8535n471o4612k6355l7047o4259l0958o951r0597l049
21280G76211J08188J12126l5137M5776l173l2973L9340r665j20182o9146l0773
$$ plain form
21349 41801644 33960197 28200164 23823472 20442322 18027765 16226258 15140469 14272829
21341 14272829 13497195 12929206 12336131 11583973 10886669 10428213 9975614 9639311 9388464
21332 9388464 9075447 8651732 8203496 7700668 7172086 6794885 6370163 5714093 5149318
21323 5149318 4541921 3921863 3468390 3215194 3034310 2834126 2694154 2534018 2358525
21314 2358525 2118546 2029029 1937238 1881431 1912856 1931862 1827889 1769945 1684028 1645641 1514887
21303 1514887 1404601 1401083 1447535 1445454 1394084 1279446 1258674 1307823 1215237 1175028 1234298
21292 1234298 1186651 1154045 1105510 1100039 1035427 1009072 972025 907766 876808 869857 779260 776211
21280 776211 884399 996525 961388 1007164 1003991 971018 1010358 1000693 880511 811365 780592
21269G80592n1094M7194J0701k172o2861l1758j8599Q248O8177J79090K68322
21258A195840K44663M33922K34215Q5558j10160l75105l08116k70541k33112j36348
21248G60816m1774l390J6972K5238K13348L39611K86137L37603J21621j287j16741
21237A938154k84143k30432j50847k15903k70904n7245j8656K959o5131o3385
21227E84467l0k616J9820l2398r0207o3475J6442J13759J8173p5465k2124O3249
21215E29595j09604m3594J20665r239j01799j0746R9323R0404J4002q1895q1786
21204D15326k4010q336K5431M263k4379n993Q5678P2405j29966j20519O2228M9629
21192D01757k812O7073l3186j26972r0220M680M0169M8195J09129K13245K28063
$$ plain form
21269 780592 729498 776692 787393 785221 722360 690602 672003 680251 748428 927518 1195840
21258 1195840 1440503 1874425 2108640 2194198 2084038 1708933 1400817 1130276 897164 760816
21248 760816 719042 715652 732624 757862 971210 1310821 1596958 1934561 2056182 2054895 1938154
21237 1938154 1654011 1423579 1272732 1056829 785925 728680 710024 712983 647852 584467
21227 584467 584437 581821 601641 569243 479036 415561 432003 545762 563935 488470 466346 529595
21215 529595 419991 376397 497062 487823 386024 375278 474601 565005 579007 497112 415326
21204 415326 391316 382980 408411 412674 388295 382302 467980 540385 410419 289900 352128 401757
21192 401757 398945 466018 432832 305860 215640 220320 260489 308684 417813 631058 859121
21181H59121K47130J85163O1578p6323k96760k03885P5593J33405N7191J65267
21171A207480K13409Q2720R457p5843q61K00371K12569j5469k62086k87524l21006
21160I63217j06899K3214k6690J83506K25819N7395j43244k26715j64828j55839
21150F28936j72705j09801j25518n9418M8280j1470Q0652O8746r3508Q2344l6101
21139C00437q7958j48893m0848O4862m777n982K4967M7857J0726R078R4427j03643
21127A60253o7332O6131R649K873n7219j07057L6755O7659n4040n5699J03285
21116A05258J77744M5238j2888l8377j39744n3262l0568J43537Q1803m1385p0531
21105A66825l9741j8206Q9405N8825N98P848R486K3850K6578m3841l6981q3542
$$ plain form
21181 859121 1106251 1291414 1352992 1276669 979909 776024 851617 985022 1042213 1207480
21171 1207480 1420889 1503609 1513066 1437223 1436362 1636733 1849302 1833833 1571747 1284223 963217
21160 963217 856318 879532 852842 1036348 1262167 1319562 1176318 949603 784775 628936
21150 628936 456231 346430 220912 161494 209774 198304 278956 347702 254194 336538 300437
21139 300437 212479 63586 22738 87600 82823 76841 101808 149665 160391 169469 263896 160253
21127 160253 92921 159052 168701 171574 114355 7298 44053 111712 57672 1973 105258
21116 105258 283002 328240 315352 276975 137231 83969 53401 196938 278741 237356 166825
21105 166825 127084 108878 198283 257108 257706 265554 275040 298890 325468 281627 244646 161104
21093A61104o724J54080L7122k9387j29397k5995J9271N5349Q515n5158N2435
21082B41215o5226o5174J339Q272J2842J41599M0896q0666l8468m6236J5851q721
21070A57523k0379J4714r7255Q6756K9119j34015l5939M3137M8407j19759j26744
21059a54435J20602J44981j5300j6744J7698p115O813m9435K3209N0673Q118J2795
21047A41860k3327j9418j2988m0708K9588R227K193m225R0193L3563q9342q3898
21035C2718Q6454J11104M9665j69162m5249M094l9254R4716j9631N3154L7131
21024A95740L1308r3216q2338O1525M4214K1984k695J0671n5469j32593n8411
21013e9280J95758J2959k6201k7983k1691k1112o824j1461P148J22153J47685
$$ plain form
21093 161104 154380 308460 345582 316195 186798 160803 180074 235423 243938 188780 241215
21082 241215 175989 110815 112154 120426 133268 274867 315763 235097 196629 150393 166244 157523
21070 157523 137144 151858 54603 141359 170478 36463 524 43661 92068 -27691 -154435
21059 -154435 -33833 111148 95848 79104 96802 89687 96500 47065 70274 120947 129065 141860
21047 141860 118533 99115 86127 45419 75007 84234 86427 82202 172395 205958 116616 32718
21035 32718 119172 230276 279941 110779 65530 69624 30370 125086 105455 158609 195740
21024 195740 227048 133832 51494 113019 157233 179217 176522 187193 131724 -869 -59280
21013 -59280 136478 149437 123236 95253 73562 52450 45626 34165 41313 163466 311151
21002C11151O5449J0546j4792l6932n5575q6294j6686J27897R4547M1931J6459
20991D57701O4984m9932j80518q3980p167o4337m0701M2493l3253n5635j2073
20980C7582L2894n2227l2910o513K0217O9636O3838k2931M6204N8748p40J2889
20968B26687K8854K4658k8966r2593j54502n7240J6942R378L906O3743M9875P3463
20956A64205n8455o9670N0k707N669P6427n469k6067m1489p8326J81112J40545
20944B85825k6361n5980l7019n606m2409J1602n3945K8437N7556K8509J8870l539
20932B05940P5393M8309o1913p8523P0156N4610N0752m2377r5511K7976N5549
20921C10361o1803m2358M6859n0108J50650r186j06460M7515P9633P1721L4333
$$ plain form
21002 311151 376600 387146 372354 335422 279847 193553 176867 304764 399311 441242 457701
20991 457701 522685 472753 292235 208255 201088 136751 96050 138543 105290 49655 37582
20980 37582 70476 18249 -14661 -21174 -957 68679 132517 109586 155790 214538 213798 226687
20968 226687 255541 280199 251233 158640 4138 -53102 -36160 -26782 -22876 40867 90742 164205
20956 164205 105750 36080 36130 33423 39092 115519 110050 83983 42494 -35832 145280 285825
20944 285825 259464 203484 166465 160859 118450 130052 76107 104544 162100 190609 209479 205940
20932 205940 281333 329642 267729 189206 259362 313972 364724 322347 226836 254812 310361
20921 310361 248558 206200 253059 202951 353601 344415 237955 285470 365103 436824 471157
20910D71157l6617j05886j28278J4572j8006n7772J7721l9491K9477k687o3030
20899H1160m3274l5158L8941J24437J9194j2858J5034n7628k0419K6582Q2877
20888B18888N8096p0964n7841n2471j4495N5885J24717k3567j10027j16475R860
20877B1606M4974P7537p0863p3935N052N0223m017m2314J45118j1288J3294N198
20865A60585p9375j4230Q0519O674Q1388M628r4801q9768K2630M8257l0619J132
20853I7020J09124L7548p4488j04102J4513J25069P4151J419m5473J33425J3844
20842C82050K6944P1135R343L5048R1953l3466j02682Q034N7807O902K7556R3907
20830F74531j05656j88200l5269L5233N6730m8631j31557m4169l8818r189P3305
$$ plain form
20910 471157 434540 328654 200376 214948 196942 139170 156891 117400 146877 144190 81160
20899 81160 37886 2728 41669 166106 185300 172442 187476 129848 109429 136011 218888
20888 218888 276984 206020 148179 95708 81213 137098 261815 238248 128221 11746 21606
20877 21606 66580 144117 73254 -681 4371 54594 50577 8263 153381 142093 155387 160585
20865 160585 81210 66980 147499 154173 235561 240189 145388 55620 78250 126507 95888 97020
20853 97020 206144 243692 169204 65102 79615 204684 278835 280254 234781 368206 382050
20842 382050 408994 480129 489472 524520 616473 583007 480325 488359 546166 553068 580624 674531
20830 674531 568875 380675 345406 380639 437369 388738 257181 213012 174194 165005 238310
20819B38310N4011n416J4000K0278q2522o9664k0538j5635p977j22989j6697K1986
20807G147J22202J15106P2881p586P4940J20592J55447P8479J00251R9724k4654
20796I14529K2361l2655r1517n6981q8804m2636j8321j0051Q6276J55134R2283
20785I29618J32216J86037J61480j4577l1376N0965o4883j20274j47485n276L6569
20774A113014J10131L7893n2046o1868k9799l033J1048K27521L51237L96309L11494
20763B411901K26546J45614m23j25677k97349l15879k4859J01182K47934L84801
20753B753791J11550q2981k96882m11693n18075k12020o46j37534o7146l8075
20743A100289j35251q5431l8029M6061Q1149Q4874O1607k0836K2176R6108M2166
$$ plain form
20819 238310 292321 286905 300905 321183 238661 168997 148459 132824 124847 1858 -14839 7147
20807 7147 129349 244455 317336 309750 384690 505282 660729 739208 839459 939183 914529
20796 914529 936890 904235 812718 755737 666933 624297 605976 595925 682201 837335 929618
20785 929618 1061834 1247871 1409351 1394774 1363398 1414363 1349480 1229206 1081721 1076445 1113014
20774 1113014 1223145 1261038 1208992 1147124 1117325 1114292 1125340 1352861 1704098 2100407 2411901
20763 2411901 2638447 2784061 2783638 2657961 2360612 2044733 2019874 2121056 2368990 2753791
20753 2753791 2865341 2782360 2485478 2073785 1555710 1343690 1343044 1205510 1138364 1100289
20743 1100289 965038 879607 841578 887639 968788 1053662 1115269 1094433 1116609 1212717 1254883
20732A254883L5307l3408o5535J7962O309M5948J38936J22949O8731N7818L0721
20721A680621J71026J74121K20729K48796K26341K70854K81377K68350L55641
20712C897856M38251O99599J084489J494723J981528K136659J489522N48180n67415
20703A3203392j277175j489342j261016q36892m35775j17884J06558N18396J125386
20694I535648J548483K128533K472274K280926J408290M61276m52752j132680
20686A8249998p62761N0117J036477J933728L056837M475475O362021R024690
20678D3426582J3237468K0345694L2110311M8002264N7804660M6342129K1464199
20671B82733307m758011l2156576m9705689m7755348l3324672j8770239p821608
$$ plain form
20732 1254883 1290190 1256782 1191247 1209209 1215518 1261466 1400402 1523351 1592082 1649900 1680621
20721 1680621 1851647 2025768 2246497 2495293 2721634 2992488 3273865 3542215 3897856
20712 3897856 4336107 5035706 6120195 7614918 9596446 11733105 13222627 13770807 13203392
20703 13203392 11926217 10436875 9175859 8338967 7903192 7785308 7891866 8410262 9535648
20694 9535648 11084131 13212664 15684938 17965864 19374154 19835430 19382678 18249998
20686 18249998 17487237 17537354 18573831 20507559 23564396 28039871 34401892 43426582
20678 43426582 56664050 77009744 109120055 157122319 214926979 261269108 282733307
20671 282733307 277975296 245818720 196113031 148357683 115033011 96262772 88441164
20664H8441164R26205R466641K0704148L7435813N9854485P6699442O5956688
20657C59484586L3180465l299969m3248275p3028065p5689655n7976473l8687830
20650A00734784k5489482j7313452j2133222q682636o276942m630537l400768
20643B2807745k499945j760061j341646j105764q70708q87581q13517p92953q90416
20634A1845154q13718o83166o48464n60258m07306j26955J78471O74703R13538
20625A0371999J000511P48247K77954j16959k57262m98259o84807o73259m64102
20616I704063j92208j16851M3417J50233K86244K48366J59190R1094J75544L47430
20606A0896522N34804P01120P74557J145074J551904J957398K389524L167420
$$ plain form
20664 88441164 89367369 98834010 119538158 156973971 216828456 293527898 359484586
20657 359484586 392665051 389365082 346116807 273088742 197399087 139422614 100734784
20650 100734784 75245302 57931850 45798628 37115992 30839050 26208513 22807745
20643 22807745 20307800 18547739 17206093 16100329 15229621 14342040 13528523 12735570 11845154
20634 11845154 11031436 10348270 9699806 9139548 8732242 8605287 8783758 9458461 10371999
20625 10371999 11372510 12120757 12398711 12281752 12024490 11526231 10841424 10168165 9704063
20616 9704063 9511855 9395004 9438421 9588654 9874898 10123264 10282454 10373548 10549092 10896522
20606 10896522 11431326 12132446 12907003 14052077 15603981 17561379 19950903 23118323
20598B3118323M183906N913092Q440063J2653038J9735017L1365680M7766386
20591A53175505N8389874L9565585o302186m0514349m2727399k6189353p204023
20584A28193654J1771597L2194358M8979340M2057706M361225l0032602l2692765
20577B04832513j0497227J2234134J2568243j2371862l5213860l7312850k4956003
20570A09283088j0492570L013269J7646832L0439470K7975646Q90050k9151213
20563A49604572l9320199l2037172k1487061j3749297r008893o270451m578382
20556B3153117l277750k343460k009547j847674j462078r91247o49365m64769
20548A0107227n95311n35106k57347j82582l19508m56546m47911l96084k76055
$$ plain form
20598 23118323 27302229 33215321 41655384 54308422 74043439 105409119 153175505
20591 153175505 211565379 251130964 244828778 204314429 161587030 135397677 128193654
20584 128193654 139965251 172159609 221138949 263196655 267557880 237525278 204832513
20577 204832513 194335286 206569420 219137663 206765801 171551941 134239091 109283088
20570 109283088 98790518 101803787 119450619 149890089 177865735 178755785 149604572
20563 149604572 110284373 78247201 56760140 43010843 34001950 27731499 23153117
20556 23153117 19875367 17531907 15522360 13674686 12212608 11221361 10571996 10107227
20548 10107227 9511916 8976810 8719463 8536881 8217373 7760827 7312916 6916832 6640777
20539F640777k05583m48039n87100l50073r8202m0101j31626j02325k593j8783
20529D656352k75135n04341l76431l92379k49851j43519k54984j45855j63119
20520B150738l5953k3207j14130r6254l0992n4635p8445K5561J06933M9984j30876
20509A768724m8072j6715j47601r9265J473r0161j03820j06025L6665J90614O4992
20498A450809N4035r2549j86468q1013o2427o2347n0364J35520J08846m9370r3000
20487A071672j11357L0546M3007o8290k6568m1776p4471O8898J098j36614j06210
20476F49935N4719R491n4151o6105L3396o0125P482N1641Q602k4574k3318l6119
20464E50874p3283K6987J20614M0153j0526k2666o4127n9261J0110K7391L6442
$$ plain form
20539 6640777 6435194 5987155 5400055 5049982 4951780 4911679 4780053 4677728 4675135 4656352
20529 4656352 4381217 3876876 3500445 3108066 2858215 2714696 2459712 2313857 2150738
20520 2150738 2114785 2091578 1977448 1881194 1850202 1795567 1717122 1742683 1849616 1899600 1768724
20509 1768724 1720652 1703937 1556336 1457071 1458544 1368383 1264563 1158538 1195203 1385817 1450809
20498 1450809 1504844 1412295 1225827 1144814 1082387 1020040 969676 1105196 1214042 1164672 1071672
20487 1071672 960315 990861 1033868 965578 939010 897234 822763 891661 892759 756145 649935
20476 649935 704654 714145 659994 593889 627285 567160 574642 626283 634885 610311 586993 550874
20464 550874 477591 504578 625192 665345 654819 632153 568026 508765 518875 546266 582708
20453E82708P568N8683P0941Q8319p7854j5656k20Q3793J9737L3681p5872j07913
20441F67915L8768K6822p475O1764R493M188m4409l6601j5041J7650m9723J1397
20429F84748l1981O5206Q1601r9563J1457Q2011j7048K1469k6353j04944p0354
20418E96249p1246K8797n1104l3431p1273r820J23469O8851r9674l0161j4836
20407D35821n5729Q831J6904L9519j063q6311j5653n5806N5012J10425j7588k5807
20395D08555L2633j3184m6435j0068l0403K9751q552l151J2328P0565O2882O0267
20383E65188J00199k9848j7193R464j07814l6657k0610J7574P1206j5195j3740
20372E22574J0772n857M1620K6485Q6328K4661l5458J07708j9860j2858J47265
$$ plain form
20453 582708 590276 648959 719900 808219 730365 714709 714489 798282 818019 851700 775828 667915
20441 667915 706683 733505 726030 787794 797287 801475 757066 720465 705424 723074 673351 684748
20429 684748 652767 717973 799574 700011 711468 793479 776431 797900 771547 666603 596249
20418 596249 525003 553800 502696 469265 397992 388172 511641 580492 480818 450657 435821
20407 435821 380092 388923 405827 445346 444283 357972 342319 286513 341525 451950 434362 408555
20395 408555 441188 428004 381569 371501 341098 370849 362297 359146 371474 442039 504921 565188
20383 565188 665387 635539 618346 627810 519996 483339 462729 480303 551509 536314 522574
20372 522574 533346 527489 569109 595594 681922 706583 671125 778833 758973 746115 893380
20361H93380J88905J77044L25484N45107P23434Q43555O25791L8020m86279n99357
20351C275084n07473j73492J28348N54867P63470P63637K95903k62919l42704
20342D494721j21474J60165L49820J04138m79101q06885o73994m26247j48951
20333B452192K33476M79895O20915N29925N2654o05526q26510p04954n72828l04475
20323A354764k41932k37860k22735r7542m8158j6632k1205O770n3648O335l062
20312D25095N7086K1751j37053q2390L0197K0180L7834j4164m0920n054J13685
20301D26247q836j2754J4707n9754m4672Q4029m3044J6232n2775l1893J280K6741
20289C15508R7231J05737J49087J20006j41900j01299k4885m9943j48154j28984
$$ plain form
20361 893380 1082285 1259329 1584813 2129920 2853354 3696909 4322700 4360720 3874441 3275084
20351 3275084 2767611 2594119 2722467 3277334 4040804 4804441 5100344 4837425 4494721
20342 4494721 4373247 4533412 4883232 4987370 4508269 3701384 3027390 2601143 2452192
20333 2452192 2685668 3165563 3786478 4316403 4369057 3763531 2937021 2232067 1659239 1354764
20323 1354764 1112832 874972 652237 554695 506537 489905 468700 475470 421822 428157 425095
20312 425095 482181 503932 366879 284489 314686 334866 372700 358536 317616 312562 426247
20301 426247 417411 404657 419364 359610 314938 398967 355923 372155 319380 287487 288767 315508
20289 315508 412739 518476 667563 787569 645669 544370 519485 469542 321388 192404
20279A92404r4478j7856O5237P5546O8054p3246o4013M4444J04870R6302M1342
20268D38606m1025K8151J5848j51912r7827O9257R2572j6681m7906j0486m680
20257B73917p5161j09825P3411J7380l9091j01679j9449N0449J8569K7010L4201
20246A49732m7851j0952K829Q1632O5471J668K0985r6145j06150j3850P5134j7780
20234A04723k1547j6450k6919o5388N4550P7350J28674R0579n7732r7332j658
20223A68850J1498k1562o1296k6449O2654J27311n6180k9758J8153P960k4472
20212A76709k6971M1108O0517P648l7764m5673O7988J0145j38607o8389j731m6575
20200a595o4207m2557R2879J34410L7358m369l5911r8795o768R0403n7226m1188
$$ plain form
20279 192404 97926 80070 145307 220853 288907 215661 151648 196092 300962 397264 438606
20268 438606 397581 425732 441580 289668 191841 261098 353670 336989 289083 278597 273917
20257 273917 198756 88931 162342 179722 140631 38952 19503 69952 88521 115531 149732
20246 149732 101881 90929 93758 175390 240861 242529 263514 167369 61219 47369 122503 104723
20234 104723 83176 66726 39807 -25581 28969 106319 234993 325572 267840 170508 168850
20223 168850 180348 158786 97490 71041 133695 261006 204826 175068 193221 201181 176709
20212 176709 149738 190846 251363 259011 221247 175574 243562 253707 115100 46711 44980 -1595
20200 -1595 -65802 -108359 -15480 118930 156288 151919 116008 17213 10445 100848 43622 2434
20188B434R3360N149r9189K3205o1169O9941Q456j9605M1478P5749P42j8337M3613
20175A65827o8230m8717Q7258m2686n6283k0204j2608O225O6342j03711L807L7132
20163A4152K8017k2705n962L1706J3340k2567l6337K4418L0119m774m3051k1448
20151a5092j5137J8038M5971R8516J21885l4610O450m1311j12760K5197J28882
20140B26029r4167O9292K2792j50266p9391K702L0167Q2474R9158J1921r4715
20129A25996o1981N3971M2983k4651Q496r1614p586j4023K8045P9304k3886o5465
20117D9589n6515J22180m3071M8343R162J3739M2511j7986j32504q5733K8420
20106b1865n108j8568O4150N0226o7509m3597R4746N4268k8874K8309J03406N447
$$ plain form
20188 2434 95794 100943 1754 24959 -36210 33731 42187 22582 64060 139809 140551 122214 165827
20175 165827 97597 48880 136138 93452 37169 16965 4357 10582 76924 -26787 -22980 14152
20163 14152 42169 19464 13502 45208 58548 35981 -356 24062 54181 49407 6356 -15092
20151 -15092 -30229 -12191 33780 132296 254181 219571 226021 184710 71950 97147 226029
20140 226029 131862 201154 223946 73680 -5711 -3009 27158 109632 208790 220711 125996
20129 125996 64015 117986 160969 136318 144814 53200 45614 31591 59636 138940 115054 49589
20117 49589 -6926 115254 72183 120526 129688 143427 185938 167952 35448 -50285 -21865
20106 -21865 -26973 -45541 18609 68835 1326 -42271 52475 106743 77869 106178 209584 215031
20094B15031j17487n8176m0719Q3833J16712P5433R4147q369K3420J62883K39171
20083G85879J98814L33734K76888J59203R2636l2037j77160l99581k82332k05154
20073G50890k29411p3393R8582J17926K508J31407K60353K40887K55742J66554
20063A722045m961k80813l05527k69658k66857j54010q0434j18911k074o7125
20053A71675j3079m1950l7868m8144n6415K7193M0566k9228n7595O8735J29473
20042A53363k1380K6146l9987l6493l4767N9230j05839K801O0116l2366r8821
20031f7997k4201J23613N0929n4253m4466K1432R799q7224L1605j2526L8588J9288
20019D587j37448l1234K2178j11657L7661J48275J32689j0593L886l609J38O5905
$$ plain form
20094 215031 97544 39368 -1351 82482 199194 274627 368774 360405 383825 546708 785879
20083 785879 984693 1318427 1595315 1754518 1847154 1815117 1637957 1238376 956044 750890
20073 750890 521479 448086 546668 664594 667102 798509 1058862 1299749 1555491 1722045
20063 1722045 1717084 1436271 1130744 861086 594229 440219 359785 240874 238800 171675
20053 171675 158596 116646 78778 30634 -25781 1412 41978 12750 -44845 23890 153363
20042 153363 131983 158129 118142 81649 46882 106112 273 3074 63190 30824 -67997
20031 -67997 -92198 31415 82344 28091 -16375 5057 14856 -72368 -40763 -53289 -14701 4587
20019 4587 -132861 -164095 -141917 -253574 -215913 -67638 65051 54458 58344 54735 54873 120778
20007A20778J08179k7658P5951l0399n3178m8792R6375J21404j884M5938J09511
19996E16225K14643L48524J89440o4625j61854k37894r5001N362J14670J66553
19986I96043K07709Q3599o4918l7673n7189J3716J12952N4902j40440k16044k33648
19975G19009j12861L6149O2180P4521J22159J74651J32868j78812l45319k86178
19965C98367j22217p2844k4938J7104m8017J2112j6914J7573j5537L167M1999
19954A89855j06152j4310N5267j23817j9628m5652p4226M6127J01447R088M2194
19943F0193k9403r3264P7211m5234l4508L5688O6746j3239j23482j03387N5325
19932a47354O1556R0489Q1183J461p4504j724k706m3435J23252R678j37841n6402
$$ plain form
20007 120778 228957 201299 277250 246851 193673 144881 241256 362660 360776 406714 516225
19996 516225 730868 1079392 1268832 1204207 1042353 804459 709458 714820 829490 996043
19986 996043 1203752 1287351 1222433 1184760 1127571 1141287 1254239 1309141 1168701 952657 719009
19975 719009 606148 642297 704477 778998 901157 1075808 1208676 1029864 684545 398367
19965 398367 276150 203306 178368 195472 147455 159567 142653 160226 144689 147856 189855
19954 189855 83703 69393 124660 843 -18785 -64437 -138663 -92536 8911 17999 60193
19943 60193 30790 -62474 14737 -30497 -65005 -29317 37429 24190 -99292 -202679 -147354
19932 -147354 -85798 4691 85874 87335 12831 11107 8401 -35034 88218 97896 -39945 -96347
19920i6347L0369P4771J1251q0039n8735J7012M0364n8388l1037N5782N8066k5835
19908f2766J1342k446j1031Q3057r156j30295P067l59o889Q4261J6407l6600R5892
19895C8484P2434k8945p1697m2610N7629k5500K1608K5044J50454K7436r839k7281
19883A87217L4270m6101m1612o583K8433q7478K209M0443P5446o0943r9011Q970
19871C5260J7606k2454l6501q2628M7225R3197P5935P0511k5641N5253N2661r103
19859B71321j15341j96780j16269R4627O7117L2474R3264O8101J2599j6217m5274
19848A49622j65054Q7714l8927k622R2706O249j14748m935N3205L6740M5335K9830
19836A75115l2853n360l5081j42075M1492P1819j2346q2610p6325J71l676k6930
$$ plain form
19920 -96347 -65978 8793 20044 -59995 -118730 -101718 -61354 -119742 -150779 -94997 -36931 -62766
19908 -62766 -51424 -53870 -64901 18156 9000 -121295 -114228 -114587 -121476 -37215 -20808 -57408 38484
19895 38484 110918 81973 10276 -32334 25295 -205 21403 46447 196901 224337 214498 187217
19883 187217 221487 175386 133774 127191 155624 68146 70355 110798 186244 125301 26290 35260
19871 35260 52866 30412 -6089 -88717 -41492 51705 127640 198151 172510 227763 280424 271321
19859 271321 155980 -40800 -157069 -62442 4675 37149 130413 198514 211113 194896 149622
19848 149622 -15432 72282 33355 30733 123439 129688 14940 10005 63210 99950 145285 175115
19836 175115 142262 136902 101821 -40254 1238 73057 60711 -21899 -98224 -98053 -101729 -128659
19824a28659O6392J1884p4219o0674J10326L3786O4367l1555M9181Q8378r8759
19813C0448p2626m0432K7792P633J20873N073J6168j2411J4695p1087j09157k2479
19801a05510J16106Q6959l4854o1724r2392j7608M0471l0917P9331R6705m6880
19790B9687n3422r2190L9765P2018n5591P0433K8063M481J3342O1680K545n1078
19778F9733r1326m3847k5696J4655J6044P9617M4786l6171L364O567N551j5999
19766B7278k4631l9577m9199N3817j4259m3935L1795J9794L3872l858q0530M092
19754h5341M7557M8627L1253q7748Q1316N3259l0433j6744o826O3201K8214o6662
19742E9673r4112M598J00743M3910L2671m5039l6291o8153o117r299p45o512J0213
$$ plain form
19824 -128659 -62267 -50383 -124602 -185276 -74950 -41164 23203 -8352 40829 129207 30448
19813 30448 -42178 -82610 -54818 -47185 73688 78761 94929 82518 97213 26126 -83031 -105510
19801 -105510 10596 97555 62701 977 -91415 -109023 -68552 -99469 -20138 76567 29687
19790 29687 -23735 -115925 -76160 -4142 -59733 10700 38763 43244 56586 118266 120811 69733
19778 69733 -21593 -65440 -91136 -76481 -60437 19180 63966 27795 31159 37726 43277 27278
19766 27278 2647 -36930 -86129 -32312 -46571 -90506 -58711 -38917 -5045 -8903 -89433 -85341
19754 -85341 -37784 10843 42096 -45652 35664 88923 58490 41746 34920 98121 126335 59673
19742 59673 -34439 -29841 70902 114812 147483 102444 66153 -2000 -8117 -17416 -18161 -24673 -14460
19729a4460K0008N9302K9163k4590J0483j8641N526r407k2737l0612q8541J4995
19717f9511J8284j2244K0254L5503r191M4152M9077n122j33013N0048Q9384M543
19705H2164r3112O5161L6320J8192n6757j1539k7647L6653O0844R691j4547m6577
19693E8846l2601j5715K1303o4212K5437n1064p730l2192L2819P9384L5211l4152
19681A5334j8741m0197L214L6002j11698m1624j9519q937J54812Q9814K3456p3366
19669H550j9613k224p7561J03265O5000K090m7241j1501k3760M6243J4541q8059
19657c0270k6371r425M7273R4227l5415j08779l7837J20928R455l5678L9752N5210
19645H3070L8703n7199j21454J7489Q894J7050Q394P4470R6283p0242j44318O5313
$$ plain form
19729 -14460 5548 64850 94013 69423 79906 61265 66791 57384 34647 4035 -84506 -69511
19717 -69511 -51227 -63471 -43217 -7714 -16905 27247 76324 71202 -61811 -11763 77621 82164
19705 82164 -10948 54213 90533 108725 51968 40429 12782 49435 110279 119970 105423 58846
19693 58846 26245 10530 31833 -32379 -6942 -58006 -65736 -97928 -65109 14275 49486 15334
19681 15334 -3407 -43604 -40390 -4388 -116086 -157710 -177229 -186166 -31354 58460 81916 8550
19669 8550 -11063 -13287 -90848 12417 77417 79507 32266 20765 -2995 43248 57789 -30270
19657 -30270 -56641 -66066 -18793 75434 40019 -68760 -106597 14331 23786 -11892 27860 83070
19645 83070 121773 64574 -56880 -39391 -30497 -13447 -5053 69417 165700 95458 -48860 16453
19633A6453j7403j26714M2148L4810K819p189K1177K3030m2429l374K3384Q6639
19621E3351k1309N3755M5764l7836l8887l9548P5580K9188J0044k5637l0792j57
19609G3516j34577l5984N2401J5149o604O4730L2773m2548j3345M8139o9754L5501
19597A9397p588p6528j6248J1977k303P0560J5940l0371J11321L8281R421l7603
19585A06256r3272l42n633k4141J00927M4593m3872P3064K3009K9341p9209k4264
19573A06457R1655m6497j85770r760K9445Q3603j3252k9645M464N2262R3987K1242
19561A98191l7370l1833q3766l1178P785l2439r7534k8988J10604Q5980J8534
19550G7986r1308L8450R6388m70o9238q644l155M964q467o7721n6266l7088J36497
$$ plain form
19633 16453 -950 -127664 -85516 -50706 -47887 -55076 -33899 -10869 -53298 -56672 -33288 53351
19621 53351 32042 85797 131561 93725 54838 15290 90870 120058 130102 104465 73673 73516
19609 73516 -61061 -97045 -44644 -29495 -36099 28631 61404 18856 5511 53650 -16104 19397
19597 19397 11809 -64719 -80967 -68990 -71293 -733 15207 -15164 96157 134438 143859 106256
19585 106256 12984 12642 7009 -17132 83795 128388 84516 157580 180589 209930 130721 106457
19573 106457 198112 151615 -34155 -43915 -14470 69133 55881 26236 30700 82962 176949 198191
19561 198191 160821 128988 45222 14044 21829 -10610 -108144 -137132 -26528 59452 77986
19550 77986 -13322 25128 121516 121046 51808 43164 40009 44973 36506 -31215 -87481 -124569 11928
19537A1928M2850J364R657O509p4328N5759J0926j8620n0657O3961p6997n8137
19525g5785n9872P5391Q4966J5187n207J1530o3502r6099k29J33732O3242M149
19513H7503J264K6813Q023n3897l3839o0540k8299M2532J1453o2000M7983L4023
19501B1019j6625O4564p3672q2004K2865N5578o5908k8450J5216L3812o1178K527
19489a12256n054k1420j5110n561K4232j8108M4229j3021M4178L6379j872l0568
19477g3952P3010P1679J7814J615N9828J0763p7464O802j2634l5505k1458k7615
19465g117J03510J7127n2763j18971j23292K423J23406N3785N3264J7944r167
19454F0149k044n2434j8656m5368K2508K3601j1392L5788j170P3135R1989K2691
$$ plain form
19537 11928 54778 56142 65799 72308 -2020 53739 64665 46045 -4612 59349 -17648 -75785
19525 -75785 -135657 -60266 24700 39887 34680 46210 -17292 -113391 -113620 20112 83354 87503
19513 87503 88767 115580 123603 69706 35867 -24673 -52972 -10440 1013 -60987 -13004 21019
19501 21019 4394 68958 -4714 -86718 -63853 -8275 -74183 -102633 -87417 -53605 -114783 -112256
19489 -112256 -117310 -138730 -153840 -159401 -135169 -153277 -109048 -122069 -77891 -41512 -43384 -73952
19477 -73952 -942 70737 88551 90166 149994 160757 83293 90095 77461 41956 20498 -7117
19465 -7117 96393 113520 60757 -58214 -181506 -179083 -55677 -1892 51372 69316 60149
19454 60149 58105 5671 -12985 -58353 -35845 -12244 -23636 12152 10982 84117 176106 198797
19442A98797n9073j18154r2251j6586o1849n6561J06156K9519j8887N346l4129
19431a17672P9470J41738p2625r0992Q4709l1598j06634o7482j1174J69450R1349
19420F8539k4980j26221m6030k3643J21155j9248j6049l8590K889o3288J8532
19409a46934j6990l375O4679n1667j1197M6718J9610k9285j9922P5212J3642k4297
19397h3806l6627l7065J9600L5626K6023k087N9521R4699l2707n0532m6033R9963
19385D6575J08397k9651K0549q1025o2620n7039r950J2655J8059J00472p0794
19374d372j18906q8436O2037Q3775M7176J6854j0211L1920N4889q3703p7886J7078
19362f9785j4532J9899o5220J6813j0382P6779R4898J913k9868q1301j14490j4487
$$ plain form
19442 198797 139724 21570 -70681 -87267 -149116 -205677 -99521 -70002 -88889 -83543 -117672
19431 -117672 -38202 103536 30911 -60081 24628 -6970 -113604 -181086 -192260 -22810 68539
19420 68539 43559 -82662 -128692 -152335 -31180 -50428 -66477 -105067 -102178 -165466 -146934
19409 -146934 -163924 -167299 -102620 -154287 -165484 -118766 -99156 -128441 -148363 -73151 -59509 -83806
19397 -83806 -120433 -157498 -137898 -102272 -76249 -78336 -18815 75884 43177 -7355 -53388 46575
19385 46575 154972 125321 145870 64845 2225 -54814 -64764 -52109 -34050 66422 -4372
19374 -4372 -123278 -211714 -149677 -65902 -18726 -1872 -12083 19837 74726 -8977 -86863 -69785
19362 -69785 -84317 -64418 -129638 -112825 -123207 -46428 48470 50383 20515 -60786 -175276 -189763
19350a89763N031P9159J20150M1329m3937J4212o8324o1859O2296M4959J4925
19339A8178p8108O626k0995l8602J05410O0707m3881m0570r570J922R3064l901
19327E0280r3513o4053l3302O0600J3380M875K3851l7098j5811K1205Q255J0113
19315e1218K809M6777J268p8537l1178l7334L2084K0521m3712k6080R9114K886
19303f2600K4330m2916K425K5091L8607j4566n549n4878M9967J12611k0362m7151
19291E009l4505j8454m683o2470O3582N7101m4228j7703l5583j3510O3190J22881
19279H0627N7089q9470K1729r6846r3054K7213O2951M9436q0206l2780P8912p3885
19267h8284J327j03616K6794J43701O361m5820q297O2197l4866K2445P668M4331
$$ plain form
19350 -189763 -184732 -105573 14577 55906 11969 26181 -42143 -104002 -41706 3253 18178
19339 18178 -59930 -53304 -74299 -112901 -7491 53216 9335 -31235 -40805 -38883 54181 50280
19327 50280 -43233 -107286 -140588 -79988 -66608 -61733 -37882 -74980 -90791 -69586 -61331 -51218
19315 -51218 -48409 -1632 -364 -78901 -110079 -147413 -115329 -94808 -138520 -164600 -65486 -62600
19303 -62600 -38270 -81186 -78761 -53670 -15063 -29629 -35178 -90056 -40089 72522 52160 5009
19291 5009 -29496 -47950 -52633 -115103 -51521 5580 -38648 -56351 -91934 -105444 -42254 80627
19279 80627 137716 48246 69975 -26871 -119925 -92712 -29761 19675 -60531 -93311 -14399 -88284
19267 -88284 -86957 -190573 -163779 -20078 -13717 -59537 -67834 -5637 -40503 -18058 -10390 33941
19255C3941o4577J1473K3278m9073j7964L2062J8849K5527K6456M7133j00734
19244a3629p7699J18130M5172n9853p7272K7774L527P5363M8786j14601j10722
19233a35024Q5416J0078p1034j11147o8631J43598O8447O6142l526j20439O719
19222a29401R8673k754r1725N0639L9928L1139J8201m4391r9606l307k2182Q1696
19210g3090P4877L4937J8493M548J2266m8789L801J8006o8241P977j0317p3493
19198i9025k448J76285m5729k2615N6707k4658l0916m3735o5866r3399k2626M0107
19186a77918M4154J3864o798j0425R7013O7855J3018o745j7835l5962q7976n2924
19174a60679J2297P6315m1957k6478R0092J8526m3971L1273K507L152n1838N4802
$$ plain form
19255 33941 -30636 -19163 4115 -44958 -62922 -30860 -12011 13516 39972 87105 -13629
19244 -13629 -91328 26802 71974 12121 -65151 -37377 -33850 41513 90299 -24302 -135024
19233 -135024 -49608 -39530 -110564 -221711 -290342 -146744 -78297 -12155 -15681 -136120 -129401
19222 -129401 -30728 -33482 -125207 -74568 -34640 -3501 14700 -29691 -129297 -132604 -154786 -73090
19210 -73090 1787 36724 55217 59765 72031 23242 27043 45049 -23192 -15215 -25532 -99025
19198 -99025 -101473 74812 29083 6468 63175 38517 7601 -36134 -102000 -195399 -218025 -177918
19186 -177918 -133764 -119900 -126698 -137123 -40110 27745 40763 34018 16183 -19779 -107755 -160679
19174 -160679 -148382 -72067 -114024 -140502 -50410 -31884 -75855 -44582 -42075 -38923 -90761 -35959
19162c5959K919p716K1931k3173J7142J0541l3839j9446j17705p6224Q8752R0140
19150h2637M7651J3479k2120j2542J05012J03887r9808j58504r9901J20947M306
19139h0230j2250K6835P0503O8580O7572Q3331K4005p5410j0506k2323n33q2804
19127E6770m852J4892N6209k1024k4603n9813J11545N8056j38005k5147L4005
19116E8033O2490l2389m5838M0662o650L066p1174n9212k8074k2325m9804k2039
19104a73254L2801M8397J04184N2904o7932r3981K1392M4130M7741p3799M5784
19093a1633O0071j3852m2429l3785J3835L1048Q8995O1727n4366K630r178m7031
19081D6032k423m9448K2559P714n833m7605o601J14651Q1333m6446j57427l4179
$$ plain form
19162 -35959 -33040 -40756 -18825 -41998 -24856 -14315 -48154 -67600 -185305 -261529 -172777 -82637
19150 -82637 -34986 -21507 -43627 -56169 48843 152730 52922 -105582 -205483 -84536 -80230
19139 -80230 -92480 -65645 4858 73438 141010 224341 248346 172936 162430 140107 139574 56770
19127 56770 51918 66810 123019 101995 77392 17579 129124 187180 49175 24028 58033
19116 58033 120523 88134 42296 82958 76308 79374 8200 -51012 -79086 -101411 -151215 -173254
19104 -173254 -140453 -92056 12128 65032 -2900 -96881 -75489 -31359 16382 -57417 -11633
19093 -11633 48438 34586 -7843 -41628 -27793 3255 92250 153977 99611 102241 93063 46032
19081 46032 43609 -5839 16720 24434 18601 -29004 -35605 79046 160379 113933 -43494 -77673
19069g7673N8706J30455J3614j3196n0444J6358K9585r1275l4239P9867m0574
19058B1184l7741j9467J8897K1586o3148L9148n9234J056R5307J35387K7829R372
19046A90176n147O588o50j31252n9680m7052Q9113l7997p7645K7955Q105O707
19034c0779M9390J0796K9230J14884j6292j91734o5515m3579K0183j3733P3220
19023f3929k388L4434N4147L0984m6460K7641n5273q8648l6940m5959O3762J46477
19011A7848j1682k8120r8136p5227Q7111J68739J756m2793p495J3956k0034L8646
18999D4569p8652j4433M4823R1628m4842k9056J41133J8380j92850k6830N0114
18988C984M6959r665l5556M5026L7864k9180l7626M0406J7873n79J8364q1284
$$ plain form
19069 -77673 -18967 111488 125102 111906 61462 77820 107405 16130 -18109 61758 21184
19058 21184 -16557 -36024 -17127 4459 -58689 -19541 -78775 -77719 17588 152975 180804 190176
19046 190176 185029 191617 190967 59715 35 -47017 42096 4099 -73546 -45591 -37486 -30779
19034 -30779 18611 29407 58637 173521 157229 -34505 -100020 -143599 -123416 -137149 -63929
19023 -63929 -66317 -31883 22264 53248 6788 34429 -20844 -109492 -146432 -192391 -128629 17848
19011 17848 6166 -21954 -120090 -195317 -108206 60533 62289 19496 12001 25957 5923 44569
18999 44569 -34083 -48516 -3693 87935 43093 14037 155170 173550 -19300 -46130 3984
18988 3984 50943 41278 5722 50748 88612 59432 21806 62212 80085 79506 97870 16586
18976A6586l7398n3931p4094p8972L9388R0223l4715j4002R3641p9322K5126K576
18964a04894k5457L4609O6232K8897k3222j2962o6796l5279N7005m8244n218l896
18952a39225J1825R6676j9968Q26P1103K4059j18674q4680j657P2683R3104J5460
18940B1532n6829r710O6777J1436N7848k8726p4580o4363o9590o8843j5198K2
18928b30224J4321L6358M5928j8590j5587J04081J07287L5578k211K6585j8110
18917H5416j42872p576J62405M8562p15q6701K2594J5468P013q6869j07034J6033
18905g4276k4645J15116P0926o3936m7915k1885O4729N0787L4466j2197j01617
18894a0447n5388o676J3935J53434j7600J9776R864J8843P1156p1870m2708l9754
$$ plain form
18976 16586 -20812 -74743 -148837 -227809 -188421 -98198 -132913 -146915 -53274 -132596 -107470 -104894
18964 -104894 -130351 -95742 -29510 -613 -23835 -36797 -103593 -138872 -81867 -130111 -135329 -139225
18952 -139225 -127400 -30724 -50692 -49866 21237 45296 -73378 -158058 -159715 -87032 6072 21532
18940 21532 -35297 -45007 21770 33206 91054 62328 -12252 -76615 -146205 -215048 -230246 -230224
18928 -230224 -215903 -179545 -133617 -152207 -167794 -63713 43574 79152 76941 103526 85416
18917 85416 -57456 -65032 97373 145935 145220 58519 81113 96581 103594 16725 -90309 -74276
18905 -74276 -98921 16195 87121 23185 -24730 -46615 18114 68901 103367 91170 -10447
18894 -10447 -65835 -72511 -58576 94858 77258 97034 106898 125741 196897 125027 82319 42565
18882D2565l2406j01061n0237K952N2589O0271N9255O3047o2j0458m95r9698k5285
18869c9023L2261l727J1987j232j32522l773P0309K9332l2311L0511N5186k3740
18857f742M2760Q0206n4580o24N7199K3879k3540o4122R109p1136j2414l5839
18845e5844j20341j08087J11489J19667L6426Q4190l136p2715q8021j5678P2680
18834c9370j869j0544Q3151J097L463l4638P489k352Q9719j198j24847j23466
18822a53365M2880J1297R911L9849J2906P896O889k4681o0507q715O2126M5147
18810h367J05332O4496j10976L9893K5446j36820o8131k6853j5584Q2337j006
18799e0233J2623o9865p2974P0441O9270l6933k5757J20500Q1798J8052m6335
$$ plain form
18882 42565 10159 -90902 -141139 -138187 -85598 -25327 33928 96975 96913 86455 85960 -13738 -39023
18869 -39023 -6762 -10489 1498 266 -132256 -136029 -65720 -36388 -68699 -38188 16998 -6742
18857 -6742 36018 116224 61644 61020 118219 142098 118558 54436 63545 -7591 -20005 -55844
18845 -55844 -176185 -284272 -172783 -53116 -16690 67500 64364 -8351 -96372 -112050 -39370
18834 -39370 -41239 -51783 31368 32465 35928 1290 8779 6427 96146 94948 -29899 -153365
18822 -153365 -110485 -99188 -89277 -49428 -36522 -28626 -21737 -46418 -106925 -115640 -53514 -8367
18810 -8367 96965 161461 50485 90378 115824 -20996 -89127 -115980 -131564 -49227 -50233
18799 -50233 -37610 -107475 -180449 -110008 -40738 -77671 -103428 17072 98870 116922 70587
18788G0587m1122l1287n7508k9238p7544K5109N0860J09588L2442p69n7052O3724
18776E7790k2117j6086j771O5204P6768M890P340n119K17096L58885M20552J35167
18764A298599l34119m29786l06191j98679N3504k464P439l4708l9529l4506j8350
18753c8790N2938L7755J6221j13287j7216P835j5440L6401J3163j45861J7587
18742a48694J48603N6426K2696j197l0987k9892K200j1205J6243l0453M8956P0430
18730A13126j05325n7424J7909R2366o1554l1448P8899J4725l0437o4907j8204
18719e2274L1539N5491N5570n406l8656o9368k2243Q3412P833j0827n2826m5607
18707f3362J8789N8950n2778L0541j7538K8639n595Q2497J3588q6180J0231j482
$$ plain form
18788 70587 29465 -1822 -59330 -88568 -166112 -141003 -90143 19445 51887 51118 -5934 57790
18776 57790 35673 19587 17816 83020 159788 164678 172018 166899 383995 742880 1163432 1298599
18764 1298599 964480 534694 228503 29824 83328 80864 88303 53595 14066 -20440 -38790
18753 -38790 14148 51903 68124 -45163 -62379 -54544 -69984 -33583 -20420 -166281 -148694
18742 -148694 -91 56335 79031 77834 46847 16955 19155 7950 24193 -6260 42696 113126
18730 113126 7801 -49623 -31714 60652 -902 -32350 46549 61274 30837 -34070 -52274
18719 -52274 -20735 34756 90326 84920 46264 -23104 -45347 38065 45898 35071 -17755 -63362
18707 -63362 -44573 14377 -38401 -7860 -25398 3241 -2354 80143 93731 7551 17782 16300
18695A6300j3756O3894k9217j3741j7434M8257R95N8528L8931k6412j3398l8422
18683G4525R5848l3138j44525n5313r850L2855j4012n0204K2709J2147q724n2492
18671a30174k9234M7129N370k1152M3063j6781O7244J53201J8816j00627j31097
18660i4242l4736R9115K879N2990N2443j6054m548N8529P1079n5195M3789J7083
18648A93132j40832j68166O2205J02013p4096q9508k2653m1891K1847k8563O3640
18637a22872P4263Q8826j0427j0910M5864P6640l0108j06783j8573K892r0465
18626a01653l4112O3617L2215K1139j2087p1335J47433K2390o9861R5172P9718
18615A72636K9498J2926l0757r2446o2228K0417j3891n283k7741N6398o2999j4584
$$ plain form
18695 16300 2544 66438 37221 23480 6046 54303 55298 113826 152757 126345 112947 74525
18683 74525 170373 137235 -7290 -62603 -72453 -39598 -53610 -103814 -81105 -68958 -77682 -130174
18671 -130174 -159408 -112279 -106909 -128061 -84998 -101779 -34535 118666 137482 36855 -94242
18660 -94242 -128978 -29863 -26984 26006 78449 62395 57847 116376 187455 132260 176049 193132
18648 193132 52300 -115866 -53661 48352 -25744 -115252 -137905 -179796 -157949 -186512 -122872
18637 -122872 -48609 40217 29790 18880 64744 141384 111276 4493 -14080 -11188 -101653
18626 -101653 -135765 -72148 -39933 -18794 -30881 -102216 45217 67607 -2254 92918 172636
18615 172636 202134 215060 184303 91857 29629 50046 36155 30872 3131 59529 -3470 -18054
18603a8054n917k0597O6728M2643l0573o7234p2132l678n3882K4876l0348m5550
18591b13718N7306J19598R8271K7048j2682K5095k5964R73k1977j9570k0925l1471
18579a8016P351m3983O4077J8984o9577j909j4279N508R4679N9423j7814k0125
18567F4319K2914j10718p7059m3790R1913L3805M372R0466l7767j26651M2678
18556d5518K2650J1003P74l1658j4099N8670m3179o6902R8453q5051l77j6079
18544a11313j1528O2921R8919J0320m3580q418j7117M2283R6086L3080o5618n0563
18532C5472O7536J6192L8832k2012m8235r3990j4689K1694m8111L6722n048m0188
18520e5825k9065o3280m9248k948L4515N6249J279j488P5997k4386o6330k1873
$$ plain form
18603 -18054 -23971 -44568 22160 64803 34230 -33004 -105136 -108814 -162696 -137820 -168168 -213718
18591 -213718 -156412 -36814 61457 88505 75823 100918 74954 75927 53950 34380 13455 -18016
18579 -18016 -10665 -54648 9429 28413 -41164 -43073 -57352 -51844 42835 102258 84444 64319
18567 64319 87233 -23485 -100544 -144334 -52421 -18616 -14244 76222 38455 -88196 -45518
18556 -45518 -22868 -11865 -11091 -42749 -56848 1822 -41357 -108259 -9806 -94857 -95234 -111313
18544 -111313 -122841 -59920 38999 49319 5739 -2679 -19796 22487 118573 151653 86035 35472
18532 35472 103008 119200 158032 136020 87785 -6205 -20894 800 -47311 -10589 -15637 -55825
18520 -55825 -84890 -148170 -197418 -200366 -165851 -109602 -108323 -109811 -33814 -58200 -124530 -146403
18508a46403O6003N7500O205P318J5155Q759L9594L3305l2186m4047r2381n2375
18496a33553P8744R166J2588j1554p1336n9552J00053K10372K3905p1846K3076
18485A10063q9836o2124K948j02999J2623P3447L368l6520n7393L4051J12343
18474b9K7706j17977k4246O421J07688N6890M747P504n5973j18330o3773J25478
18462d3894M5034N8690j6998L1312m3581n3441p7512p9614j5088O2589k1111J5861
18450a37753O9383M3794j0156r2979K3325L6501p9256L6295J21167n6908q412
18439e4999K8808k6940O0350n1934M704o680l5168m7138R000J14714O0277j11718
18427e6724l7038J16742Q1784J4623j12615j5377M4110l509n8013j5954N2679
$$ plain form
18508 -146403 -80400 -22900 -16695 -9377 5778 14537 54131 87436 55250 11203 -81178 -133553
18496 -133553 -54809 -45643 -33055 -44609 -115945 -175497 -75444 134928 158833 86987 110063
18485 110063 20227 -41897 -38949 -141948 -129325 -55878 -52510 -89030 -146423 -112372 -29
18474 -29 27677 -90300 -114546 -108125 -437 56453 61200 68704 12731 -105599 -169372 -43894
18462 -43894 1140 59830 42832 74144 30563 -22878 -100390 -180004 -195092 -132503 -153614 -137753
18450 -137753 -68370 -24576 -34732 -127711 -104386 -67885 -147141 -110846 10321 -46587 -54999
18439 -54999 -26191 -53131 7219 -44715 -40011 -46691 -81859 -128997 -119997 -5283 54994 -56724
18427 -56724 -93762 22980 104764 119387 6772 -8605 35505 31996 -26017 -41971 10708
18416A0708n1667m9140M3422K9821J2643L8695p0611p5414J5415J16472J47101
18405A67445k2040l1056q34p3038p6580L9275j3049P3171m2927l8044n2369n0233
18393a20279o5827L5940J18023J13963l0724p6489q2547m0393p0802r190J48829
18382g9496N2409o5196L1269K9117l9271J1514L0007K7044J5724L6038L9158p773
18370H0544J4694n0297k5203l1703M8805M4929m0J23001K1655j22026K2975l8303
18358H9031k6183l089k6570l2475o7261K4704J0727M8619P4818k7416o9027l003
18346g125n733j0092R2090N3833l8332j68757J7011m3119r052K6353Q4074O2590
18334E3741Q3989N5945j13543p9407m7076J1395J5739J1506M1518J5753J9143
$$ plain form
18416 10708 -40959 -90099 -46677 -16856 -4213 34482 -36129 -111543 -96128 20344 167445
18405 167445 145405 114349 113515 40477 -36103 3172 -9877 63294 20367 -17677 -70046 -120279
18393 -120279 -186106 -150166 -32143 81820 51096 -25393 -107940 -148333 -219135 -228325 -79496
18382 -79496 -27087 -92283 -61014 -31897 -71168 -59654 -29647 -2603 13121 49159 88317 80544
18370 80544 95238 44941 19738 -11965 36840 81769 81729 204730 226385 104359 127334 89031
18358 89031 62848 59759 33189 714 -66547 -41843 -31116 17503 92321 64905 -4122 -7125
18346 -7125 -12858 -22950 69140 122973 84641 -84116 -67105 -110224 -119276 -92923 -8849 53741
18334 53741 137730 193675 80132 725 -46351 -34956 -19217 -7711 33807 49560 68703
18323F8703n0808m0530L1625j32025n0019j5895R7670R0632L8424J961j3802N963
18311C1899J30850N0362j32304j07523m3851N795J15473K1270q4917j6828k891
18300c2665K4498P7046J3812q230r5391j13804l3134Q4419J32467J32207m3390
18289A37835j84174J0357j1053m703o4349q1266n9408R039O8857K2954L600n6272
18277b08583p6707j8698O7938R8500Q3181P5085O1698J5133j3638o3708M260l5703
18265a1242j2061l7589M475O3943l5395k9388j5313L2468O9986M9966l0944k8621
18253B0285J1252R5447r2428j95094M8584O1822J0906m5302Q5615Q1152R786p3797
18241A8228l5696k0734J48578K0459J7136J59975J78687M9699O3776L7915j71478
$$ plain form
18323 68703 17895 -22635 8990 -123035 -173054 -188949 -91279 -647 37777 39738 25936 31899
18311 31899 162749 213111 80807 -26716 -70567 -64772 50701 71971 -12946 -29774 -32665
18300 -32665 -8167 68879 82691 74461 -20930 -134734 -167868 -83449 49018 181225 137835
18289 137835 -46339 -35982 -47035 -51738 -116087 -197353 -256761 -247722 -178865 -155911 -152311 -208583
18277 -208583 -285290 -303988 -236050 -137550 -54369 20716 82414 97547 83909 20201 24461 -11242
18265 -11242 -23303 -60892 -56417 7526 -27869 -57257 -72570 -40102 29884 79850 48906 20285
18253 20285 31537 126984 34556 -160538 -111954 -50132 -39226 -84528 1087 82239 92025 18228
18241 18228 -17468 -38202 110376 130835 147971 307946 486633 536332 600108 638023 466545
18230D66545j87644n2545j493o8144m6341n3746m2579n1419L6178l7979O1467
18219B2300o4490L0707j2304J2627q866N5853J0942o157L8103r22k1514n6597
18207c18M9595K9218p8160k3113o4341Q1706Q3359O1073n463n2487J02348p8637
18195A04780m1675o4231J16158L0104r9336j9837O6555j3482R4373J3172o665
18184A79916j53077L6107R0128m475R037O0239o2202j03360o330n1441M8095Q5149
18172A27786K9688K9584M1280M0122m4727m0673j00485q5631Q7120L3969n7807
18161F0226O416J09989P2958L0252J6292j24672L5134P8567m3579l1039Q3735
18150B94279J19107o930o4786l8933o745J29519K2669m7465J4315P252J13119
$$ plain form
18230 466545 278901 226356 224863 156719 110378 56632 14053 -37366 -1188 -39167 22300
18219 22300 -42190 -11483 -23787 -11160 -20026 35827 46769 40612 78715 77793 56279 -318
18207 -318 49277 78495 335 -22778 -87119 -5413 77946 139019 133556 81069 183417 104780
18195 104780 63105 -1126 115032 145136 45800 25963 92518 79036 173409 186581 179916
18184 179916 26839 62946 153074 148599 157636 217875 155673 52313 45983 -5458 42637 127786
18172 127786 157474 187058 228338 268460 223733 183060 82575 -3056 84064 118033 60226
18161 60226 66642 176631 249589 279841 296133 171461 206595 285162 241583 210544 294279
18150 294279 413386 406456 341670 302737 295992 425511 448180 400715 415030 422282 535401
18139E35401J22112n3105p548O1646p0125O2358J41292J34412J24750P0789J656
18128A123638J11991J64560J83333J37635K27085L86215L87027M57179P03967
18119C882630P77524R43544J186202J767743K461518L698610N673907R484326
18111B9876004J7227925L2693094N9450548P5253482K7772003m3815290p0279131
18104A28178635n1521972k8670721j5831681r163552n785361l951294k798827
18097A0455227k021529j561350j155729q15782n36347n06222m73783l32282k56929
18088B795274k96857j95738j19719j41858j37666k07160j37075j13785j63145
18079A282271p9665r8700r6017o41l5836j58523q8178M457o1647j33085K9789
$$ plain form
18139 535401 657513 604408 596860 658506 588381 650739 792031 926443 1051193 1121982 1123638
18128 1123638 1235629 1400189 1583522 1721157 1948242 2334457 2721484 3178663 3882630
18119 3882630 4660154 5603698 6789900 8557643 11019161 14717771 20391678 29876004
18111 29876004 47103929 79797023 139247571 214501053 242273056 198457766 128178635
18104 128178635 76656663 47985942 32154261 22990709 17205348 13254054 10455227
18097 10455227 8433698 6872348 5716619 4900837 4364490 3858268 3384485 3052203 2795274
18088 2795274 2498417 2302679 2182960 2041102 1903436 1696276 1559201 1445416 1282271
18079 1282271 1202606 1103906 1007889 1007248 971412 812889 724711 729168 667521 534436 564225
18068E64225j7662j37744j35118L176m0581k076M4114P9370O1436L3775j1337
18057D41578o0602J2846n5206j17575O1942j2574K9979L63k6026j9190R4750L970
18045C54255j7142m8211J9772N7420L5130l2793j02162J231M5582j6522p1923
18034B24637l3411M7290L0083N6666Q2841r4320p5290n6559q6475K7933J06231
18023B29626l7342P647k2972r7487N4069J43841J2903n4601q0086j17106K059
18012D0551P4142p480J2327o1294J9080R1586N8288l3355m0061o2500j14238J4483
18000h471J10518J62552j6433j02672j7523k6327q6409K7639l6016l9924L4084
17989A018J5066O832J47070M836j9074N3984k0150k3695P1894m1981n9378M3002
$$ plain form
18068 564225 546563 408819 273701 276877 236296 234220 278334 357704 419140 452915 441578
18057 441578 380976 393822 338616 221041 282983 270409 300388 300751 274725 255535 350285 354255
18045 354255 337113 288902 308674 366094 401224 368431 266269 267500 313082 296560 224637
18034 224637 191226 238516 268599 325265 408106 313786 238496 181937 95462 123395 229626
18023 229626 192284 199931 176959 79472 133541 277382 290285 235684 155598 38492 40551
18012 40551 114693 107213 119540 58246 77326 168912 227200 193845 153784 91284 -22954 -8471
18000 -8471 102047 264599 248166 145494 127971 101644 15235 42874 6858 -33066 1018
17989 1018 16084 22916 169986 174822 155748 209732 189582 165887 237781 195800 136422 179424
17977A79424P7300J41723R5962n1793q4343M4559j3990j4808L5681J5816p1540
17966C53991n8146l9515p665n2509j49910o6567M8910r351O2736K7913L524j6644
17954I6767J570j8891J8207k4821k9015k4333j5674K1284L0313J17815J3877J0008
17942A97107M2751j9551l1868m4664r6728Q9932k8336r9045Q1099J4073O606O9580
17930A80956N9589m3628r4741n3754j7459L2347M1626j27437p9362J55953Q29
17919E4919O1160r3473N8148j166j2884k3986J3427M2115m4045k3047p8546p4514
17907a21892j7559M887J03415L9481P8887m4596j5699m6969p4179j9731O8131
17896d5824L9493k8749p0931m643M5385Q5047M9632o7102n3177N0966J0430k3330
$$ plain form
17977 179424 256724 398447 494409 442616 358273 402832 388842 374034 409715 425531 353991
17966 353991 295845 256330 248665 196156 46246 -20321 28589 19238 81974 109887 113411 96767
17954 96767 98337 79446 97653 72832 43817 19484 3810 25094 55407 173222 187099 197107
17942 197107 239858 220307 188439 143775 47047 136979 108643 9598 90697 104770 111376 180956
17930 180956 240545 196917 102176 48422 30963 63310 104936 -22501 -101863 54090 54919
17919 54919 116079 22606 80754 79588 66704 42718 56145 98260 54215 31168 -47378 -121892
17907 -121892 -139451 -134564 -31149 8332 87219 42623 26924 -20045 -94224 -113955 -45824
17896 -45824 -6331 -35080 -106011 -110654 -65269 19778 69410 2308 -50869 97 10527 -12803
17884a2803j2823o915L0885M700m8013J2022J30226k5716k3657K7508N5851k7545
17872A03720m59J950j5557M2682N8689r9397j19746p455P0449n793m7709L8016
17860A9390p9336P9670K4623K1731m227n7876j22162J0984J1767K6646L7884O5481
17848C4575R8353k5470j7306Q5298L9551L6768p4353j31945J7138Q7014k6667
17837A22956j1993M3488j03525r8020O1143L2630l6717p0630k0794J43952m2416
17826B0074n5778J5611R382J4259k6675o2845R8255Q2702j152j05922j6025J4773
17814a3341K8167l7755L824P8102M706q5313l0275O63Q8531k9015j31413Q3103
17802d0016l43l7506J4569k5059o0426j9159O3704Q2761j1941o4830J2406M3815
$$ plain form
17884 -12803 -25626 -32541 -1656 3044 -44969 -32947 97279 71563 47906 75414 131265 103720
17872 103720 103261 105211 89654 132336 191025 91628 -28118 -35573 34876 29083 -18626 19390
17860 19390 -59946 19724 44347 66078 61851 3975 -118187 -107203 -95436 -68790 -30906 34575
17848 34575 132928 107458 90152 175450 215001 251769 177416 45471 62609 149623 122956
17837 122956 110963 154451 50926 -47094 14049 46679 9962 -60668 -81462 62490 20074
17826 20074 -35704 -20093 -10711 3548 -23127 -85972 12283 94985 93833 -12089 -28114 -13341
17814 -13341 14826 -22929 -19105 58997 63703 -21610 -51885 -51222 37309 8294 -123119 -40016
17802 -40016 -40359 -77865 -63296 -88355 -148781 -167940 -104236 -21475 -33416 -98246 -85840 -42025
17790d2025k5168k2008m8112J1133K7869O9853J18740O5474p561j13261o1275
17779b6341O3218j09654k6651L7696k6488O4234J29614l8017n592M2464l5335
17768F9148m7374p4898J1666k8156j638O6428R4987R1951m0892j29457m8020m3208
17756g9463k4605P6060o1510k100J1078m7313Q4583M5497j10965l1395N1545j0956
17744i9544L3501k7892l651l772m1k1276M3727j17550J5170R5076l5473j9552
17732a41277P0298q694j03341r731J62518N3420m2453k7344j01527M2619j0069
17721a15581J2073l1705K9922J0044l937M9723P6679J0774l7854n0084K1367O1371
17709C2792L014o0803p3626K3372K6006K3860n451J4528J16014k5188j21491P171
$$ plain form
17790 -42025 -67193 -89201 -137313 -126180 -98311 -28458 90282 155756 148195 34934 -26341
17779 -26341 36877 -72777 -99428 -61732 -88220 -23986 105628 67611 62019 104483 69148
17768 69148 21774 -53124 -41458 -69614 -71252 -4824 90163 182114 141222 11765 -36255 -79463
17756 -79463 -104068 -28008 -89518 -91618 -80540 -127853 -43270 2227 -108738 -140133 -88588 -99544
17744 -99544 -66043 -93935 -97586 -101358 -101399 -122675 -78948 -196498 -181328 -86252 -121725 -141277
17732 -141277 -70979 -79673 -183014 -192745 -30227 23193 -19260 -46604 -148131 -105512 -115581
17721 -115581 -103508 -135213 -105291 -95247 -99184 -49461 27218 37992 138 -49946 -28579 32792
17709 32792 35806 -24997 -98623 -75251 -49245 -25385 -30836 -16308 99706 74518 -46973 -39802
17697c9802n0977L3885O4904q9810K3843J09653M4221j13260j43410K8542Q493
17686a23718O7320R476M11k6088j0079J4198K5729N6899M2144o0277K6660L0694
17674E3369k3333J3660R1102J657j60900p3751Q719p0228J7619M7526N1155p6365
17662a19770m1110K0234M0927J5459m6319J09538P1292o7196N0761R7942k3697
17651A08061q7008j59774j09540J9123J90451O7374o7073L2245L948M5124m7782
17640d851j4961n9217O2566P6596K9485o6348Q587j23163l0917R1713R5361O8742
17628A33593r2274o5917R7972J9661p5575j4263r7975R078N9067O1400p9276o4397
17616a08906l2224m1881K554L007N3247J74013R4880j7612o5273R4848R5028k0899
$$ plain form
17697 -39802 -90779 -56894 8010 -81800 -57957 51696 95917 -17343 -160753 -132211 -123718
17686 -123718 -56398 -46922 -46511 -72599 -82678 -68480 -42751 14148 56292 -3985 22675 53369
17674 53369 30036 43696 134798 136455 -24445 -98196 -89477 -159705 -142086 -94560 -43405 -119770
17662 -119770 -160880 -140646 -99719 -84260 -130579 -21041 50251 -16945 33816 131758 108061
17651 108061 21053 -138721 -248261 -229138 -38687 28687 -38386 -6141 -2193 42931 -4851
17640 -4851 -19812 -79029 -16463 60133 89618 23270 31857 -91306 -122223 -30510 64851 133593
17628 133593 41319 -24598 73374 93035 17460 3197 -94778 -85700 -26633 34767 -44509 -108906
17616 -108906 -141130 -183011 -180457 -177450 -124203 49810 144690 127078 61805 156653 251681 230782
17604B30782j01893L7201P5486J5697q1269q4296j2655k0757P606J3786N8824
17593A38512n0665p6737o595j02611O4231J46000q5311k3358j4680K2046L4853
17582D5685k818m607N000M1334N8655N2288J130m6452L4718N2616q7804j08767
17570D0978k4696k469j6217k1896K2650j2968J3412M4506J31867J01590p7794
17559A98963m3376O5874r2314l4610K936P9002K1225l0255l7971j2873k4684J22981
17547B14898j1257j28894k1118M6696m2262q2861r484l2900N3820Q1671n9631
17536H678n3981O5259J06662l491k3612q6211j51824L2802J06546J48873p6875
17525G2826n8189k2593O4937O1717L4864q2441j7034m011q7711M2561O9678L0381
$$ plain form
17604 230782 128889 166090 241576 257273 176004 91708 79053 58296 65902 79688 138512
17593 138512 87847 11110 4515 -98096 -33865 112135 26824 3466 -11214 10832 45685
17582 45685 42867 38260 43260 84594 143249 195537 196667 150215 184933 237549 149745 40978
17570 40978 16282 13813 -2404 -24300 -1650 -14618 -1206 43300 175167 276757 198963
17559 198963 155587 221461 129147 94537 97473 176475 197700 167445 129474 116601 91917 214898
17547 214898 203641 74747 53629 100325 58063 -24798 -34282 -67182 -13362 68309 8678
17536 8678 -45303 19956 126618 123127 99515 13304 -138520 -105718 828 149701 72826
17525 72826 14637 -7956 56981 118698 153562 71121 54087 50076 -37635 4926 74604 104985
17513A04985r7738r9130j2401O7275M3987J01137j8436p8425k4076M302N0329
17502D1809R328J4841m5425q2809p1626r4155O6721J37344J19194N6637l3217
17491A18642l6837M2531n2237K4825j2294o5866L4619k9159j6424k4089r7715
17480a14004M523J51316O4301j13653m3661M1555M0011Q4545J36803N5706j02031
17469B05411m9143j06718q1349L2144J62965q0272j6649q4994q4997p7987Q8931
17458i2658O4402L3436L8047m9070N5966J544J7266m728j538l8807L549R9431
17446A26840R2911L3031J34374K49998M22125L05202j38l41135l89659j81777
17436D51772p5040j81806j34165j57105J2506J14429J9651N7953k7877l6511q5336
$$ plain form
17513 104985 7247 -91883 -104284 -37009 6978 108115 89679 11254 -12822 -8520 41809
17502 41809 51137 65978 20553 -62256 -133882 -228037 -161316 -23972 95222 151859 118642
17491 118642 81805 124336 72099 96924 84630 18764 53383 24224 7800 -16289 -114004
17480 -114004 -109481 41835 106136 -7517 -51178 -9623 30388 114933 251736 307442 205411
17469 205411 156268 49550 -31799 345 163310 83038 66389 -18605 -103602 -181589 -92658
17458 -92658 -28256 5180 43227 -5843 50123 51667 68933 64205 62667 23860 27409 126840
17446 126840 219751 252782 387156 637154 1059279 1364481 1364343 1023208 633549 451772
17436 451772 376732 194926 60761 -96344 -83838 30591 50242 108195 80318 43807 -41529
17425d1529n8889n0961o9268J8671Q8286J04731j4059p9276Q9367K2577R0235
17414I9885L8349j76223j52171R6546J6254O1043P633j30062J05129R3619j0077
17403D9925K5463p4529m1535m3865r545J1434m0606k7999k7533O1998M8859N1339
17391a6594k8912k6047n4491m3380n0143P784M5326O3351K9366m3451j5385Q9328
17379d3248Q7265K9680n2815j26082o148Q8153J01098j2400j31455o35J22188
17368E5601P5161k4893j03648j41812O2579M3185l1002l3476j5804m6755K0046
17357a40818Q7780J34425O459j4555o4266J9266R0061m3816j75216J1456j265
17346i0489o5769M1510N5148j4727J33918k9043j8386R713K7195K117j9178l172
$$ plain form
17425 -41529 -100418 -151379 -220647 -201976 -113690 -8959 -23018 -102294 -12927 9650 99885
17414 99885 138234 -37989 -190160 -93614 -77360 -16317 -8684 -138746 -33617 60002 49925
17403 49925 75388 859 -40676 -84541 -94086 -82652 -123258 -151257 -178790 -116792 -67933 -16594
17391 -16594 -45506 -71553 -126044 -169424 -219567 -211783 -166457 -103106 -73740 -117191 -132576 -43248
17379 -43248 44017 73697 20882 -105200 -111348 -23195 77903 65503 -65952 -66587 55601
17368 55601 130762 105869 2221 -139591 -77012 -33827 -64829 -98305 -114109 -160864 -140818
17357 -140818 -53038 81387 87846 73291 9025 28291 118352 74536 -100680 -89224 -90489
17346 -90489 -156258 -114748 -59600 -74327 59591 30548 12162 21875 49070 51187 32009 28837
17334B8837p6030j5711k9937l7750J36336M7104m2115m9661m659m7918j04345
17323a95849N897J03274R7729l5148J731Q52L8836O9528o8143q6447Q5815J07795
17311A25870J4686r9653j06913Q3175N2728l7297N497J922J2136Q6392l8227p5167
17299B5149N0238P6413j08068j02960q2020l9495K6633k6834l5367l103P9441
17288a39973Q2549o521n7477m1870Q985N1509O3748p2387J4275O777o2803N789
17276a47399m7399R987K0826M7614k3587K9269J12256k073n6909J6361O0832r1520
17264g1742j24902P9723Q1849l9346j8313p428m9250N230l8230K8724L816J0444
17252a39425N5702N7139K5348M0694j725j36152p9206m729J31748O7149l8039
$$ plain form
17334 28837 -47193 -62904 -92841 -130591 5745 52849 10734 -38927 -43586 -91504 -195849
17323 -195849 -189952 -86678 11051 -24097 -22366 -21514 17322 86850 18707 -67740 18075 125870
17311 125870 140556 40903 -66010 17165 69893 32596 38093 40015 52151 138543 100316 25149
17299 25149 75387 151800 43732 -59228 -141248 -180743 -154110 -180944 -216311 -219414 -139973
17288 -139973 -57424 -63945 -121422 -163292 -154307 -102798 -39050 -111437 -97162 -90385 -153188 -147399
17276 -147399 -194798 -184811 -163985 -116371 -139958 -110689 1567 -506 -57415 -41054 19778 -71742
17264 -71742 -196644 -116921 -35072 -74418 -92731 -100159 -149409 -144179 -182409 -153685 -149869 -139425
17252 -139425 -83723 -26584 -1236 39458 37733 -98419 -177625 -182354 -50606 16543 -21496
17241b1496M662k5852l6533j21649k5750O4826R801l7550M2514L9825m6563J5255
17229a38510Q0073K4100q0465j47162J0065J51990J23518J31448j05427o6400
17219a6770k6238J4279J33759J16064j26247r7820p7818O4395m1447l1815J22448
17208C2790P1362L1033p4619j33494m8069J24462J9137N5797p020r8443k087o6555
17196i5706p419K7238m4699l3555n9461j7017R5063R3599J1635L9464J5324p8106
17184e3640l1244J4152K2393J7306Q8706m6133n5130j5838K2137l7761k0342N3785
17172d1609O6116P762j9445j2770o5431J01814P4171r3047l0417N9434L1783P732
17160H6093r3337m1983R8715j4250k8788K5611l4722L4313N9650o7742j4480N5591
$$ plain form
17241 -21496 -16834 -42686 -79219 -200868 -226618 -161792 -151991 -189541 -147027 -107202 -153765 -138510
17229 -138510 -58437 -34337 -114802 -261964 -251899 -99909 23609 155057 49630 -16770
17219 -16770 -43008 -28729 105030 221094 94847 -2973 -80791 -16396 -57843 -89658 32790
17208 32790 104152 135185 60566 -72928 -120997 3465 22602 78399 71379 -27064 -29151 -95706
17196 -95706 -103125 -75887 -120586 -154141 -213602 -230619 -135556 -41957 -30322 9142 24466 -53640
17184 -53640 -84884 -70732 -48339 -31033 57673 11540 -43590 -59428 -37291 -75052 -95394 -41609
17172 -41609 24507 32269 12824 54 -65377 36437 110608 17561 -12856 46578 78361 86093
17160 86093 -7244 -49227 49488 35238 6450 32061 -2661 31652 91302 23560 9080 64671
17148F4671m3523o6959n4885L6928k6130M038k763J3936Q6338j8345q8993J1868
17136h3819R928k2581Q8287J5961o4374p0519O435J16385P6642K2278q2837L620
17124A5406l8764j02457k1837J37307N1239K6792K199j05003q732Q6155p9421
17113c7116p1170l4982k9061P4694J8627n724N2868l889M0664J3054l9668n7289
17101g8992r1989R209R1200N6017m2778k9027K732M3104n6514J0387O3242m7178
17089g0587j852K1381O8071J03537L6509q7491j43815J3953M9505K3717K7366
17078D0294J06452N238j16572j44963l1539k5637k8743N7127J06525q401l4369
17067g4588n3177k6600O9146N5094j7528k7744M5638P2049J168M1462n3783j06472
$$ plain form
17148 64671 21148 -45811 -100696 -63768 -89898 -85860 -88623 -74687 11651 -6694 -95687 -83819
17136 -83819 -73891 -96472 -8185 7776 -56598 -127117 -120682 -4297 72345 94623 11786 15406
17124 15406 -23358 -125815 -147652 -10345 40894 67686 69885 -35118 -43850 42305 -37116
17113 -37116 -108286 -143268 -172329 -97635 -79008 -84732 -31864 -35753 4911 17965 -21703 -78992
17101 -78992 -170981 -161772 -70572 -14555 -57333 -86360 -83628 -40524 -97038 -86651 -23409 -70587
17089 -70587 -72439 -51058 17013 120550 157059 69568 -74247 -60294 -10789 12928 40294
17078 40294 146746 151984 35412 -109551 -141090 -166727 -195470 -138343 -31818 -40219 -74588
17067 -74588 -127765 -154365 -85219 -30125 -47653 -75397 -29759 42290 43458 84920 31137 -75335
17055g5335o0563O1880Q006K7436P385j27017N596J05977L0024k5223Q4163K9710
17043G2039m2390o2398r1336k3019Q0382R4451N9468J4914J12009j03201j54082
17032d3163l5556P654q8172M8977O8563o2056K8711M4337j6791O3166N3396m422
17020F4644l8446n1940M9971k285j10001j02835K2077j3349L1621L6884N6253
17009e7406n7206l0730R5168o295o0481L1816Q184m2598L5597o550N1747m3925
16997h2679o6939k0576J76108J11046J338j13034M919k6646J8594p4678M5782
16986b6765L6821M3927k9385j193R7212N1661j35464k1483n7128p03M5467k6872
16974b3905j367O0067J021Q252J0990k3324n6732L5089J17169j8287l8541J7406
$$ plain form
17055 -75335 -135898 -74018 -66012 -38576 -31191 -158208 -152612 -46635 -16611 -41834 42329 72039
17043 72039 29649 -32749 -124085 -147104 -66722 27729 87197 102111 214120 110919 -43163
17032 -43163 -78719 -71065 -159237 -110260 -41697 -103753 -75042 -30705 -47496 15670 69066 64644
17020 64644 26198 -25742 24229 21944 -88057 -190892 -168815 -182164 -150543 -113659 -57406
17009 -57406 -114612 -145342 -50174 -56469 -116950 -85134 -76950 -119548 -83951 -90501 -38754 -82679
16997 -82679 -149618 -170194 5914 116960 118298 5264 10183 -16463 2131 -72547 -26765
16986 -26765 10056 53983 24598 23405 120617 172278 36814 15331 -41797 -42500 2967 -23905
16974 -23905 -25272 34795 35816 44068 55058 31734 -24998 10091 127260 108973 70432 87838
16962H7838j1808l0191j7470m7802r6621j6750J27092P8241q8950n5926J6635
16951e5712K2737J0235K9793Nl3030k7919K3236q2288j0289N6596m6473J2701
16939a00408j3929n7991Q5184J28017M612m6836o1134k1344k4546K9508O6588
16928a2279j3646p6908K4576N3579J27754R6144K7166k17423k08201l4163J8490
16917b14911K852O9961N4945M1215o6936j06376O8736J4713K1126P3008N0633
16906H966J7723q4531K4490N7209L6323K2623m4835m4867n6045k4021l1607J2707
16894a05865J08056J8963r0964j12039M2859Q6486K5111k6345m1086J64J4728
16883g9932M7579n7675N337O6086n2374j820j9832p2816N5503k8942q5547k907
$$ plain form
16962 87838 76030 45839 28369 -19433 -116054 -132804 -5712 72529 -16421 -72347 -55712
16951 -55712 -32975 -22740 7053 7058 -25972 -53891 -30655 -112943 -123232 -66636 -113109 -100408
16939 -100408 -114337 -172328 -87144 40873 45485 -1351 -62485 -83829 -108375 -78867 -12279
16928 -12279 -25925 -102833 -78257 -24678 103076 199220 226386 8963 -199238 -233401 -214911
16917 -214911 -212059 -142098 -87153 -45938 -112874 -219250 -150514 -135801 -114675 -41667 8966
16906 8966 26689 -57842 -33352 23857 60180 82803 37968 -6899 -62944 -86965 -118572 -105865
16894 -105865 2191 21154 -69810 -181849 -138990 -52504 -27393 -53738 -94824 -94660 -79932
16883 -79932 -32353 -90028 -84691 -18605 -70979 -72799 -92631 -165447 -109944 -138886 -224433 -227340
16871b27340M9676J54649L6905j19557n2221R9969P1647q3678j14375n417P9604
16860a10138J1553R5795J12958K7841o5814j24693L2703Q3862J07033q773j27789
16849C4538P108j9495o0524o5828O748J4243J2244R9384Q6799J0863n7902j38188
16837g0010n9307J6912N3774M2680N733L064R479J1979J694r3487N7154J20941
16825A00606m8693q8483n9068K875O9987N3155o0939j00889m0829L6064J28683
16814g531J08780k3440Q099J1499k0079n7651k6342l7167j07728k6550P2533J42052
16802C6475K395j6064K490k7156R247p590N1071O1491j22016O430N96P4971j9326
16789E3014l5951J42421o0532m3378K8129J087k5688k6787p0010P2514l1661r033
$$ plain form
16871 -227340 -177664 -23015 13890 -105667 -157888 -57919 13728 -69950 -184325 -189742 -110138
16860 -110138 -98585 -2790 110168 138009 72195 -52498 -19795 64067 171100 162327 34538
16849 34538 41646 22151 -38373 -104201 -97453 -83210 -70966 28418 115217 126080 68178 -70010
16837 -70010 -129317 -112405 -58631 -15951 -10218 -7154 2325 14304 15998 -77489 -20335 100606
16825 100606 51913 -36570 -95638 -92763 -22776 30379 -30560 -131449 -172278 -136214 -7531
16814 -7531 101249 77809 85908 97407 77328 19677 -6665 -43832 -151560 -178110 -105577 36475
16802 36475 38870 22806 25296 -1860 7387 -203 50868 112359 -9657 -3227 -2631 72340 53014
16789 53014 17063 159484 98952 55574 83703 84790 59102 32315 -37695 34819 3158 -5875
16777e875K1718o4582o8127r1647j5957k1403J7706Q2967L1997O000J12643L6283
16765D1723J4960P2191j3793l2408m5475k3928j7696j24721k6031K576N8444P0664
16753b3494K0945j3214r1736j03729Q0078L4897J6025P3982K7951j8619L743n0635
16741d3806q9518L2807J09171k9932m8243M4545O7497j9497j9481o0762J122O9679
16729A3582K5781l2709o2108M8878m3137o2158L7445L9776n0752J6751J3807K3791
16717c1053O0992k4264j01914p8342M9214Q5158J04292m0944p4066k1751J2744
16706e9934k7761O4232j1777R3494p366n4059m7477l3356O7140L6880L2361n8972
16694f595L2761O6712p348p4451P8474l2858j6429L3102N618l0615q195m4978
$$ plain form
16777 -5875 15843 -48739 -116866 -208513 -224470 -245873 -228167 -145200 -113203 -107203 5440 41723
16765 41723 56683 128874 115081 82673 37198 13270 -4426 -129147 -155178 -152602 -94158 -23494
16753 -23494 -2549 -15763 -107499 -211228 -131150 -96253 -80228 -6246 21705 3086 6829 -43806
16741 -43806 -133324 -100517 8654 -21278 -69521 -24976 42521 23024 3543 -57219 -56097 13582
16729 13582 39363 6654 -55454 -6576 -49713 -111871 -74426 -34650 -85402 -68651 -54844 -31053
16717 -31053 29939 5675 -96239 -174581 -125367 -40209 64083 23139 -50927 -72678 -59934
16706 -59934 -87695 -23463 -35240 58254 50888 -3171 -50648 -84004 -16864 20016 52377 -6595
16694 -6595 26166 92878 85530 11079 89553 56695 40266 73368 78986 48371 40176 -4802
16682d802j9482L0511Q6576J04648P3475o8424q2944j23911p212L1576k9489n4951
16670f4429k8897n3624m1565L5155L0608N0487p4357j29922n7963M7803P6979
16659b09725P4610m0459j4695m5482l7799J21433M6309L6858l5004N6674m9885
16648i7165k61Q282k210j6070K2417M3772k3736r4546k1425M3859Q5865m5483
16636i6701k2690o3704j1639N9789q2404L0216M9744M5097K3433K0010M7441M6179
16624D4771q3464J1819J521M943j1561O2556m5975p8860m1716Q074j2413K0016
16612a20289P8207J6979N1420O1472K094R439l1233M9941n3944j39610n9625N9131
16600g6018N1893Q0363J7528k8974K8798Q5206l0318j29753p3117N8303Q9762
$$ plain form
16682 -4802 -24284 6227 92803 197451 270926 202502 119558 -4353 -11565 20011 -9478 -64429
16670 -64429 -93326 -146950 -188515 -153360 -122752 -72265 -146622 -276544 -334507 -286704 -209725
16659 -209725 -135115 -175574 -190269 -235751 -273550 -152117 -105808 -68950 -103954 -47280 -97165
16648 -97165 -97426 -89144 -91354 -107424 -85007 -41235 -64971 -159517 -180942 -137083 -51218 -96701
16636 -96701 -119391 -183095 -194734 -134945 -217349 -187133 -137389 -92292 -68859 -48849 -1408 44771
16624 44771 -38693 -26874 -25353 -20410 -31971 30585 -15390 -94250 -135966 -127892 -140305 -120289
16612 -120289 -42082 -25103 26317 87789 89883 99322 68089 118030 64086 -75524 -135149 -76018
16600 -76018 -24125 56238 73766 44792 73590 158796 128478 -1275 -74392 -16089 73673
16589G3673q6233o4588k5174k3780N5672l840K3945J27311R148o9722l1804l5874
16577e1266K8738M6589n1010l4280n2426j4416P6854J10569P772j13303j18668
16566a64847O0390m2203N553J02474P7162n7998m3803q3925N2063P7326o31j29448
16554a47887j6799l8927M9446J02402m2858k2989k0878J2582M8926M3514O2386
16543B8918M4377k4127p2692R8023J4875K6808m7454m2138K7758J04961R2634
16532B51943j41369p8662j1459N6347K7149K1796o0423l9346K7972L2910m020
16521H2838r1211j35078L0146Q7016O453k1791p279q094J3613N5971o93l1863
16509a9972M921p304m2551l7931K8297M9748l0208p7793R0363O4224l4432j05908
$$ plain form
16589 73673 -12560 -77148 -102322 -126102 -70430 -74270 -50325 76986 86134 16412 -15392 -51266
16577 -51266 -22528 24061 -26949 -61229 -113655 -128071 -51217 59352 67124 -46179 -164847
16566 -164847 -104457 -146660 -141107 -38633 38529 -19469 -63272 -147197 -95134 -17808 -18439 -147887
16554 -147887 -164686 -203613 -154167 -51765 -94623 -117612 -138490 -125908 -76982 -33468 28918
16543 28918 73295 49168 -23524 74499 89374 116182 68728 26590 54348 159309 251943
16532 251943 110574 31912 20453 76800 103949 125745 65322 25976 53948 86858 82838
16521 82838 -8373 -143451 -113305 -26289 -19836 -41627 -48906 -57000 -43387 12584 11891 -19972
16509 -19972 -15051 -22355 -64906 -102837 -74540 -24792 -55000 -132793 -42430 21794 -12638 -118546
16497a18546j20721K8596N2353Q6636M4020q2255J2041R7548O7806n2304o9949
16486e4775l3385M5321L4216K8455p3918q434m1973P024l6100N3411O5238J6135
16474A215L8048O7675j2900n2529n7n085o7633k9374o5957p9818N1266J12597
16462d2552O9988J0063J2522p844L2468M0981q5983n0188j0133k0353n0956j7630
16450a19617J04286K1817m2518j9703p7921O6625J15442k434l4581P794r5033
16439g5843R47L3218o6417m0097J297k31p1549m3570J33913J04850M3716K8181
16427D8415J2125l0274q4503q4838K5476J6806M1115P8320n0254p3661J9550m5540
16415a27263J1167L5323J8917l0774P76o312K4955P3807M4389k6998n4178M3502
$$ plain form
16497 -118546 -239267 -210671 -158318 -71682 -27662 -109917 -97876 -328 67478 15174 -54775
16486 -54775 -88160 -42839 -8623 19832 -54086 -62520 -104493 -97469 -133569 -80158 -14920 1215
16474 1215 39263 106938 94038 41509 41452 36367 -31266 -60640 -126597 -206415 -155149 -42552
16462 -42552 27436 37499 50021 42177 74645 115626 29643 -20545 -30678 -51031 -101987 -119617
16450 -119617 -15331 6486 -36032 -55735 -133656 -67031 48411 45977 11396 19190 -75843
16439 -75843 -74896 -41678 -108095 -148192 -146895 -147126 -218675 -262245 -128332 -23482 20234 48415
16427 48415 60540 30266 -54237 -139075 -113599 -96793 -55678 22642 -27612 -101273 -81723 -127263
16415 -127263 -116096 -80773 -61856 -92630 -91854 -98166 -73211 596 44985 17987 -36191 7311
16403G311Q0708M9822L3280j9266r1078j14414l5340J14546L454m9549O6788j101
16391D5161j20713j4235J6229l438P2597K9716J995J20772m7695N301P5340k9694
16379A51336n0167o9820q8008j5636p485K3854O3280M2373l8908N0646L6813n3469
16367D4809N9147r0608m5770k4164K7283L6682k1102K557J5935l0400m5906O175
16355f5362M5468L1035J8638p9031j3446N6927O848l3158R6023k485q0795j6184
16343c5522n4720q525p988o9871Q2817k9366r1587q585O2440r832K9471Q3058
16331e8210j6284k5258O681l4317K7364O8984L5662k332M374j11114j1975J3761
16319a02664j8614J9640N0477Q7455k886l4884j8953M6427J27588j2320j01269
$$ plain form
16403 7311 88019 137841 171121 151855 60777 -53637 -88977 25569 29023 -20526 46262 45161
16391 45161 -75552 -89787 -73558 -76996 -4399 25317 27312 148084 100389 105690 181030 151336
16379 151336 101169 31349 -56659 -72295 -79780 -55926 7354 49727 10819 61465 98278 44809
16367 44809 103956 13348 -32422 -56586 -29303 7379 -13723 -11166 4769 -25631 -71537 -65362
16355 -65362 -19894 11141 29779 -49252 -62698 -5771 1077 -32081 63942 61457 -19338 -35522
16343 -35522 -90242 -98767 -106755 -176626 -93809 -123175 -214762 -223347 -160907 -170739 -141268 -58210
16331 -58210 -74494 -99752 -93071 -127388 -100024 -31040 4622 2290 6664 -104450 -116425 -102664
16319 -102664 -121278 -101638 -51161 36294 33408 -1476 -20429 25998 153586 141266 39997
16308C9997K0374M150J479j4870J7355o1116q171J5090j2022L2011M4998K185
16296H1460p2199n42L764J9547j20201j12037K3417N7933J9428j1027l2315J02155
16284d0617J56421N582q6904m9180r62n053q9406l3364M236J11261M1492O3062
16272G6568K1436R7735K7119j33810k8908m6805p9499P9982N2629M6083p1044
16261D1486J6528K545m5646j48233j0693L551L4735J06269l7235n3209K7278J28907
16249F6283m3750j68410m9571N5036J3972L0177n3717L3295Q3329p552q016r1175
16237a40099j9285N5432P5060J20833n7371J5460O6666o5908o0690m3241P1346
16226A8203r986q6192k4267p1240L5847O3781K88m988n2132M8214m7959n38N6541
$$ plain form
16308 39997 60371 64521 66000 51130 68485 7369 -802 14288 2266 34277 79275 81460
16296 81460 9261 8719 12483 32030 -88171 -200208 -176791 -118858 -99430 -110457 -142772 -40617
16284 -40617 115804 121386 34482 -14698 -15660 -20713 -110119 -143483 -139247 -27986 13506 76568
16272 76568 98004 195739 222858 89048 60140 13335 -66164 13818 66447 112530 41486
16261 41486 58014 60559 14913 -133320 -144013 -140462 -105727 542 -36693 -89902 -62624 66283
16249 66283 22533 -145877 -195448 -140412 -126440 -96263 -149980 -116685 -33356 -40908 -48924 -140099
16237 -140099 -159384 -103952 -28892 91941 34570 50030 116696 50788 -9902 -53143 18203
16226 18203 8217 -77975 -102242 -173482 -137635 -73854 -73566 -78554 -130686 -82472 -130431 -130969 -74428
16213g4428J2653n3142o4214J3667q7844p2343K36982O5037L3731k2146m6237
16202e8284M4019q6364J8461j4297m166P4164Q460L7908L6921L8087j9338m8719
16190B6852j08004L1512N7416j04483p641K2620q3021K7415J49650o243k1365
16179a5292Q1149L6538n6091j1423O3354n6838q6287m8214j04100J6864Q6685
16168i3655J16187l739j00135K324M3058O157o3231K033J41920O8198j48638J4821
16156a4700m2077p4891J965K7750R9544K909K0363M0137L430q2996K1343J10462
16144A13239O721M4636l902p7758j04906q1166K9582N092J24347K6105m1439N9076
16132I9627K856m1710r3082o1014o5687L9305N3998M6220L5603M7088L589P6021
$$ plain form
16213 -74428 -61775 -114917 -179131 -165464 -253308 -325651 -88669 -23632 10099 -12047 -58284
16202 -58284 -14265 -100629 -82168 -96465 -100631 -26467 -18007 19901 56822 94909 75571 26852
16190 26852 -81152 -49640 7776 -96707 -104348 -81728 -164749 -137334 12316 6073 -15292
16179 -15292 65857 102395 46304 34881 98235 41397 -44890 -93104 -197204 -180340 -93655
16168 -93655 22532 18793 -81342 -79018 -35960 -29803 -93034 -91001 50919 119117 -29521 -14700
16156 -14700 -56777 -131668 -129703 -101953 -2409 500 20863 61000 64430 -18566 2777 113239
16144 113239 119960 164596 160694 82936 -21970 -103136 -73554 -68462 55885 81990 40551 99627
16132 99627 102483 60773 -32309 -93323 -159010 -119705 -65707 -19487 16116 63204 66793 142814
16120A42814N7744p0842l6505n762j2304l570q4638k1847Q4452O4363l9366q8573
16108a4034j04519l2505R4786j664K3235m4336J171m8837O9976K0863l9035j9241
16096i4140l935j9296J9127J35785P0095j5516q4947n5198n0633L5133o2384o287
16084a32196Q0913O6700M4225k8325K3474k1196N3645m4123j20102P7741J26669
16073A27425k5283n7768k7052J3077p3388q6866J2560N7877P5700N2722K0287
16062H9291m2468j17960J8828R0485k91k5259j28699K7250K16833N4460j99750
16051a7280j49392l8171L6231M9472J03340J22431N5690O5214N9000Q900m4130
16040B51305m7030o6123n5458m4823m1369P4158J273L1742o1591m620r281J20342
$$ plain form
16120 142814 200558 129716 93211 87449 75145 71575 -13063 -34910 49542 113905 74539 -14034
16108 -14034 -118553 -151058 -56272 -57936 -34701 -79037 -77866 -126703 -56727 -35864 -74899 -94140
16096 -94140 -98075 -117371 -98244 37541 107636 92120 7173 -48025 -98658 -63525 -125909 -132196
16084 -132196 -51283 15417 59642 31317 54791 33595 87240 43117 -76985 756 127425
16073 127425 102142 44374 17322 30399 -42989 -129855 -117295 -59418 16282 69004 89291
16062 89291 46823 -71137 -52309 38176 37885 12626 -116073 -88823 128010 182470 -17280
16051 -17280 -166672 -204843 -168612 -119140 -15800 106631 162321 227535 286535 295435 251305
16040 251305 204275 138152 82694 37871 -3498 70660 71933 103675 42084 37464 28183 148525
16028A48525K2563n9852n9070J4649k6302r6182n9043J6570L64j8871j9946M7466
16016h9129Q7280P9819k9458j6031n9261o3485p1051N863P7925J9644n9725J7408
16004a00201P746P8699P0988K1823m6987k1423p6094k8256p1479J04468J12695
15993E1979j2835n8735O592l5633Q2187k1657n7589K4846L0110l4576O6170J29276
15981A70135j18876p8653M7434L5722M5285m2361n6245l6896N0469P7839j21006
15970b7153L1700P5035l8249r163l8545q0617p270J3441O2469j8886m4098K2384
15958e8952J21726N7317j19885K7738n784l2146j6741k7936M4180l7744J039M7297
15946A09J19141m566m8203l4582J1468n5247m6930O1229k4999K1652L2883J03724
$$ plain form
16028 148525 171088 111236 52166 66815 40513 -55669 -114712 -98142 -97778 -116649 -136595 -89129
16016 -89129 -1849 77970 48512 32481 -26780 -90265 -161316 -155453 -77528 -57884 -117609 -100201
16004 -100201 -92455 -13756 57232 79055 32068 10645 -65449 -93705 -165184 -60716 51979
15993 51979 39144 -19591 -12999 -48632 33555 11898 -45691 -20845 9265 -25311 40859 170135
15981 170135 51259 -27394 20040 55762 101047 58686 2441 -34455 16014 93853 -27153
15970 -27153 4547 79582 41333 32170 -6375 -86992 -94262 -80821 -18352 -37238 -81336 -58952
15958 -58952 62774 120091 206 27944 22160 -9986 -26727 -54663 -10483 -48227 -47188 109
15946 109 119250 114684 66481 31899 43367 -11880 -58810 2419 -22580 -928 31955 135679
15934A35679J43023j97861q9863l9904p7648k3280L6705m9438p7579n2216L4937
15923b57445J37365J12226j8722L6094J6019m2253n9227j26000M9982J40452J8362
15912F853k9264j8331Q6155J2128K51K9665q7954q4473r3533R0397Q1250O640
15900b16o8030j0682P2345K8372Q4726M9665n8644M1951N6536j0958j10436r29
15888G3700L9813l2060m3755p597k8748m4640L4641J4656j7980J7421l4364N4824
15876B5911J6977p992K9927k055r3467m3067J7006J5379K2243P753O1227O3344
15864A13186m0339l4279m5318P549N6513j8458p5397M0182N4026p1178m4301P7314
15852A9500m9153m1992j3037k8316N9790Q176j1720J36014k0570K1783j2668j60110
$$ plain form
15934 135679 278702 80841 -9022 -48926 -126574 -149854 -113149 -162587 -240166 -292382 -257445
15923 -257445 -120080 -7854 -26576 9518 25537 -16716 -75943 -201943 -151961 -11509 6853
15912 6853 -22411 -40742 45413 57541 57792 87457 -497 -84970 -178503 -88106 -6856 -216
15900 -216 -68246 -78928 -6583 21789 106515 156180 97536 139487 196023 185065 74629 73700
15888 73700 113513 81453 37698 30101 1353 -43287 -8646 6010 -11970 5451 -28913 25911
15876 25911 42888 34896 64823 62768 -30699 -73766 -56760 -41381 -19138 -11385 49842 113186
15864 113186 72847 38568 -6750 799 57312 38854 -36543 3639 57665 -13513 -57814 19500
15852 19500 -29653 -71645 -84682 -112998 -53208 -45032 -56752 79262 58692 80475 67807 -92303
15840i2303q4783N50N4708j1251j89J599J07872R0443l6585J4351k5972l0666
15828a2226O490P9637M8804j01747L970n133n4807r1319r5676L2248l8439k3600
15816b51798P8332J7407O2760q439p7056Q6166O1971L6462M2972M2331l2475k5909
15804C2724j03328N1252R682j01385j8235N8714K6864Q9982J6683p7058L3333
15793A9228M5580Q2744Q853j25619r2717m8498L0358K0934p3432M6310L6385R2751
15781D2877J11840o6111o6801p6574n0663K0804j0123r3190R7047K8645m0730
15770a02979J7974l8250m832J22877J0496J7003m5129R19O683J11845L4355q1471
15758D9491p1359l1965Q8841M5369n2259r7898q9585K0538P4202K2592J7761r1049
$$ plain form
15840 -92303 -177086 -176536 -121828 -133079 -133268 -131669 -23797 66646 30061 44412 18440 -12226
15828 -12226 -5736 73901 122705 20958 24928 19795 -35012 -126331 -222007 -189759 -228198 -251798
15816 -251798 -173466 -156059 -93299 -101738 -178794 -92628 -30657 5805 48777 91108 58633 32724
15804 32724 -70604 -19352 -9670 -111055 -129290 -70576 -43712 46270 62953 -14105 19228
15793 19228 64808 147552 156405 30786 -61931 -110429 -80071 -59137 -132569 -86259 -49874 42877
15781 42877 154717 88606 21805 -54769 -105432 -84628 -94751 -187941 -90894 -62249 -102979
15770 -102979 -85005 -123255 -128087 -5210 5286 22289 -22840 -21921 -15238 96607 130962 49491
15758 49491 -21868 -53833 35008 80377 28118 -69780 -159365 -138827 -64625 -42033 -24272 -115321
15746a15321l7913L8041J93293J07834r8543l0042P108L1434q4007j55743Q5029
15735e8830J17811m7050q1038j5676j41666J600J17126Q5705K8378K6052K7316
15724E9728n7410o4077K1051M6630Q269r585J3152m3184o7685l5999m2721N164
15712a66667J38158n524j50308o8452P8432m4651r769Q1334N4341l0839N7600
15701f6345K6922L4386J48896l7339j90978j2693L056J4594L2320N2465K6848
15690C2132o7096n4581M0724M6512O2681L2673O337j6780j09325J3500O0357J6375
15678F3509m4291k7956J6024n708J9236n3448P172J4505n6234L14p245q4125O4944
15665i3303J13924Q1995q968j4750m8328L5102P8180M7107p8685j26009q044N6309
$$ plain form
15746 -115321 -153234 -115193 78100 185934 87391 57349 64457 95891 11884 -143859 -58830
15735 -58830 58981 11931 -69107 -84783 -226449 -224849 -107723 -22018 6360 32412 59728
15724 59728 2318 -61759 -40708 5922 14191 4606 17758 -25426 -93111 -129110 -171831 -166667
15712 -166667 -28509 -34033 -184341 -252793 -174361 -219012 -228781 -147447 -93106 -123945 -66345
15701 -66345 -39423 -5037 143859 106520 -84458 -97151 -94095 -79501 -47181 5284 32132
15690 32132 -34964 -89545 -48821 -2309 60372 93045 99382 82602 -26723 -13223 47134 63509
15678 63509 19218 -8738 7286 1578 20814 -32634 -25462 -10957 -67191 -66877 -74122 -158247 -93303
15665 -93303 20621 102616 93648 78898 30570 65672 143852 190959 112274 -13735 -21779 34530
15653C4530Q797n8471O3376J7694l505M7187L0554J2726m1933j45022j29072N0305
15641a12834J1982l8736R0906P7462r873K8194q6492j10154J8004J1405l4725
15630a54861m820J31689j9327m9451o2459J249P6854J06597K3392l3496r8444
15619h3077j1366L4865Q0226J23593L3902r9082m7330m5928j22611l8146R7129
15608g7825R928k3973P6017J07915J1715O407n8570m0736R7562R8429K7105r0211
15596A43763k8691J0117p3211k187O1840N4101o7973p3977j4391j13641n8948
15585a63198K0051O6458J09156J17087q15L7053N263k6383o0253j07751J09371
15574A06039M6105j56005L1068M7909n1152k1181j5109j09180k5468K0379l2869
$$ plain form
15653 34530 43327 -15144 48232 65926 62421 109608 140162 152888 110955 -34067 -163139 -112834
15641 -112834 -100852 -139588 -48682 28780 18907 47101 -39391 -149545 -131541 -120136 -154861
15630 -154861 -159681 -27992 -47319 -96770 -159229 -157980 -81126 25471 48863 15367 -83077
15619 -83077 -94443 -59578 20648 144241 178143 79061 31731 -14197 -136808 -174954 -77825
15608 -77825 -67897 -91870 -15853 92062 103777 110184 51614 10878 108440 206869 233974 143763
15596 143763 115072 125189 51978 49791 111631 165732 97759 23782 9391 -104250 -163198
15585 -163198 -143147 -76689 32467 149554 148739 185792 191055 164672 104419 -3332 106039
15574 106039 152144 -3861 27207 75116 23964 2783 -12326 -121506 -146974 -126595 -159464
15563a59464Q2810J0195q1584Q5067M5192K1794n681r7901N2492j8587j17779
15552a83446n786O5765J4354k1513M8014J4482m9371m122j2126J14660J08908
15541H9819n1175j33477N8506M0717J10974K0850j40084j16645r122l1951L856
15530a57732J7593P1304P678q8164L1755J09251k7475o8784J03589M0610O9824
15519A09449Q208o311n0378o7737O1241n848j01799J4209N494K3202K0769K9966
15507D0465K4306n4381m5882P0471M235J0144M43k7567M8904P589l4536j30122
15495h5931M682K4410j0182K1085P4433N2534n0117q2287O082J0884n4484l9867
15483a28758J74027J2090k1061k4652n3143J7896l9926J9380m984k810J4555K7823
$$ plain form
15563 -159464 -76654 -66459 -148043 -62976 -17784 4010 -1671 -99572 -47080 -65667 -183446
15552 -183446 -189232 -123467 -109113 -130626 -82612 -68130 -117501 -121623 -133749 -19089 89819
15541 89819 38644 -94833 -36327 4390 115364 136214 -3870 -120515 -129637 -161588 -157732
15530 -157732 -140139 -68835 -61157 -149321 -117566 -8315 -35790 -104574 -985 39625 109449
15519 109449 117657 111346 60968 -6769 54472 48624 -53175 -38966 -33472 -10270 10499 40465
15507 40465 64771 10390 -35492 34979 39214 49358 49801 22234 71138 78727 44191 -85931
15495 -85931 -81249 -56839 -67021 -45936 28497 81031 30914 -51373 -45291 -34407 -88891 -128758
15483 -128758 45269 57359 36298 11646 -41497 -23601 -63527 -44147 -49131 -51941 -37386 -9563
15471i563L9710Q6847k6380j07900j8740J7958n8652l4037Q351P3156L6787l8783
15459c1246l3750k7628j1764N0568l072M3591o2974m642M438m1369P2699P3872
15447B8723R986p0733n5770J5204Q25K6835M1228j2808o0065N127k8328j3258
15435a13034M2820Q4894q9607K9018R965M768R648k392p010M0156J4544O5964
15423H9734o1606M0591N8598o8541J9709l1912m118L4962N7030n2656n9315j9374
15411C102l4971L1313n3174N1923K231m422P34R408O8022j46377l0156K1650J05967
15398B5250k5003j00068l9351K2769m7777p7549L129J49494Q6194O6342K7055
15387I0485m5478n074m3031Q2192K9784N3541k1200k4073k5049J33j8846j3026
$$ plain form
15471 -9563 30147 116994 90614 -17286 -36026 -18068 -76720 -110757 -102406 -29250 7537 -31246
15459 -31246 -64996 -92624 -104388 -53820 -56892 -13301 -76275 -80917 -76479 -117848 -45149 28723
15447 28723 38709 -32024 -87794 -72590 -71765 -44930 -3702 -16510 -76575 -71448 -99776 -113034
15435 -113034 -70214 14680 -74927 -45909 -35944 -31176 -21528 -23920 -30930 9226 23770 89734
15423 89734 28128 68719 127317 58776 78485 46573 42455 77417 134447 81791 22476 3102
15411 3102 -31869 -556 -53730 -1807 424 -3998 -3264 6144 74166 -72211 -102367 -80717 25250
15398 25250 247 -99821 -139172 -116403 -164180 -241729 -238600 -89106 -2912 63430 90485
15387 90485 45007 39933 -3098 79094 108878 162419 141219 117146 92097 92230 73384 60358
15375F0358k9427j2995P8314P99k9566q5758j33381k4571m9970j8886q5555Q24
15363c29814O7166P2711N6333N3385J2677l5199k8966L4232P5753R4639Q4483
15352A57400k4129j25220l4428Q544k980j2903J06885M604j02670k1586K1252
15341b5231K0539o1590K594j347L4983m9190j2770O133k9922j63j4526R3263J8680
15328a8547m5079j8524M2615N123o0906O51M5016m502M2676m4580r2702j9119
15316a67878k9445Q6870R8812p6963j0480j6307K2424n715K6527Q6877o492j7642
15304i412k2030M9675K405q12m0994K5261Q3298k0385r9014j12050k7061Q551
15292a62568L7761Q6214R1879o6410J8936P2523L3202q0530M9573n2797j30656
$$ plain form
15375 60358 30931 17936 96250 97049 67483 -18275 -151656 -176227 -226197 -245083 -330638 -329814
15363 -329814 -262648 -189937 -133604 -80219 -67542 -102741 -131707 -97475 -21722 72917 157400
15352 157400 133271 8051 -26377 -17833 -20813 -33716 73169 77773 -24897 -46483 -25231
15341 -25231 -4692 -66282 -63688 -65035 -30052 -79242 -92012 -85879 -115801 -115964 -130490 -37227 -18547
15328 -18547 -63626 -82150 -39535 -34412 -95318 -94667 -49651 -54153 -11477 -56057 -148759 -167878
15316 -167878 -197323 -110453 -11641 -88604 -99084 -115391 -92967 -98682 -72155 14722 8230 -9412
15304 -9412 -31442 18233 20638 19826 -21168 4093 87391 67006 -32008 -144058 -171119 -162568
15292 -162568 -124807 -38593 53286 -13124 5812 78335 111537 31007 80580 27783 -102873
15281a02873P7975J4025o838O2295O898n018k1807j8804r2282n6055Q6565J61866
15269A05947Q5666m0386o5574j36221n9320j07622m7248J23657N1169J21085J1473
15258D2626k7735j7632J32438l2301j33253r1539J6660P3995O1747j5402m3186
15247c3582N0259P2052K736o7683k3499k3948p7843j6771j3959L6050J30070N8596
15235I2478n857r274n1560N2375k005P226m6482k4714O7058j0989j48430m6215
15223a26389k9762J02691O9874O747J0423L4873m1966j14390K1977K5960m8465
15212h8427k5325m9081K1098O0224J3109K5128J5387o479O6573M7666M4514p8235
15200D6152l4672k6499N552L7831L6882p080l1289j803q0873q2688j9187L5448
$$ plain form
15281 -102873 -24898 -10873 -17711 44584 51482 46464 24657 5853 -86429 -142484 -55919 105947
15269 105947 191613 151227 85653 -50568 -109888 -217510 -264758 -141101 -89932 31153 42626
15258 42626 14891 -2741 129697 97396 -35857 -127396 -110736 -36741 25006 9604 -33582
15247 -33582 16677 88729 91465 23782 283 -23665 -101508 -118279 -132238 -96188 33882 92478
15235 92478 86621 77347 25787 78162 76157 83383 36901 12187 79245 68256 -80174 -126389
15223 -126389 -156151 -53460 16414 23161 33584 68457 26491 -87899 -65922 -39962 -88427
15212 -88427 -113752 -162833 -141735 -81511 -68402 -43274 -27887 -34366 32207 79873 124387 46152
15200 46152 11480 -15019 -9467 28364 65246 58166 26877 25074 -55799 -138487 -157674 -122226
15188a22226J14645K18O9503R7568k02361j2876J0551J20259M9782M6383p1156
15177A00290j09770J1245Q6662l057l9977k3838r2199P3011R3611j5531O029L2962
15165A19438r1395k1783l9484K7625Q3694M8471p8062j02490K3593M2711O7551
$$ plain form
15188 -122226 -7581 -7363 62140 159708 -42653 -55529 -44978 75281 125063 171446 100290
15177 100290 -9480 1765 88427 85370 45393 21555 -70644 2367 95978 80447 86476 119438
15165 119438 28043 6260 -33224 -5599 78095 126566 48504 -53986 -30393 12318 79869
$$ [...]
##END NTUPLES=NMR SPECTRUM
##END=
