##TITLE=Analysis number 312449
Compound Code cc 06010
Project Code adrs
Chemist Name molekula
##JCAMPDX= 6.0         $$ Bruker NMR JCAMP-DX V2.0
##DATA TYPE= NMR SPECTRUM
##DATA CLASS= NTUPLES
##ORIGIN= Bruker BioSpin GmbH
##OWNER= NMR
$$ XWIN-NMR		Version 3.5
$$ Thu Aug  4 13:40:19 2005 GMT Daylight Time (UT+1h)  MAYBRIDGE\NMR@NMR_250MHZ
##.OBSERVE FREQUENCY= 250.131544655141
##.OBSERVE NUCLEUS= ^1H
##.ACQUISITION MODE= SIMULTANEOUS (DQD)
##.ACQUISITION SCHEME= undefined
##.AVERAGES= 16
##.DIGITISER RES= 18
##SPECTROMETER/DATA SYSTEM= dpx250
##.PULSE SEQUENCE= zg30
##.SOLVENT NAME= CDCl3
##.SHIFT REFERENCE= (INTERNAL, CDCl3, 0, 16.522)
##AUDIT TRAIL= $$ (NUMBER, WHEN, WHO, WHERE, WHAT)
$$ ##TITLE= Audit trail, XWIN-NMR		Version 3.5
$$ ##JCAMPDX= 5.01
$$ ##ORIGIN= Bruker BioSpin GmbH
$$ ##OWNER= NMR
$$ C:\u/data/dgb/nmr/ADRS/7150/pdata/1/auditp.txt
$$ ##AUDIT TRAIL=  $$ (NUMBER, WHEN, WHO, WHERE, WHAT)
(   1,<2005-08-04 13:39:41.84 +100>,<MAYBRIDGE\NMR>,<NMR_250MHZ>,
      <created by zg, POWCHK disabled, PULCHK disabled
       configuration hash MD5:
       62 19 C7 07 E1 42 D1 B7 37 6C 3D D0 77 39 F9 E6
       data hash MD5: 64K
       AB 21 65 53 6E 8A B6 46 C9 E8 32 37 DF B3 0E 21>)
(   2,<2005-08-04 13:39:59.28 +100>,<MAYBRIDGE\NMR>,<NMR_250MHZ>,
      <Start of raw data processing
       ef LB = 0.3 FT_mod = 6 PKNL = 1 SI = 32K 
       data hash MD5: 32K
       F7 B7 87 F8 C8 E7 1D 2F 5F 06 0C 39 48 B6 25 C2>)
(   3,<2005-08-04 13:40:03.34 +100>,<MAYBRIDGE\NMR>,<NMR_250MHZ>,
      <apk 
       data hash MD5: 32K
       AF 9E D7 24 0D 0C AC EA 59 72 88 FF 71 C1 7F 84>)
(   4,<2005-08-04 13:40:04.57 +100>,<MAYBRIDGE\NMR>,<NMR_250MHZ>,
      <abs ABSG = 5 
       data hash MD5: 32K
       25 0D BA DE 16 06 D2 A0 44 A3 E4 9C 31 B3 D7 F3>)
$$ ##END=
$$ 
$$ hash MD5
$$ 00 1F FE F7 AD A0 BA 18 B3 93 84 CC ED 00 BF B7
##$RELAX= 
##$RELAX= 
##$RELAX= 
##$RELAX= 
##$RELAX= 
##$RELAX= 
##$RELAX= 
$$ Bruker specific parameters
$$ --------------------------
##$DU= <C:\u>
##$EXPNO= 7150
##$NAME= <ADRS>
##$PROCNO= 1
##$TYPE= <nmr>
##$USER= <dgb>
##$AMP= (0..31)
100 100 100 100 100 100 100 100 100 100 100 100 100 100 100 100 100 100 
100 100 100 100 100 100 100 100 100 100 100 100 100 100 
##$AQSEQ= 0
##$AQ_mod= 3
##$AUNM= <au_zg>
##$AUTOPOS= <28 >
##$BF1= 250.13
##$BF2= 250.13
##$BF3= 250.13
##$BF4= 250.13
##$BF5= 500.13
##$BF6= 500.13
##$BF7= 500.13
##$BF8= 500.13
##$BYTORDA= 1
##$CFDGTYP= 0
##$CFRGTYP= 5
##$CHEMSTR= <none>
##$CNST= (0..31)
1 1 145 1 1 1 1 1 1 1 1 1 1 1 1 1 1 1 1 1 1 1 1 1 1 1 1 1 1 1 1 1 
##$CPDPRG= <>
##$CPDPRG1= <>
##$CPDPRG2= <>
##$CPDPRG3= <>
##$CPDPRG4= <mlev>
##$CPDPRG5= <mlev>
##$CPDPRG6= <mlev>
##$CPDPRG7= <mlev>
##$CPDPRG8= <mlev>
##$CPDPRGB= <>
##$CPDPRGT= <>
##$D= (0..31)
0 1 0 0 0 0 0 0 0 0.06 0 0 0 0 0 0 0.0002 0 0 0 0 0 0 0 0 0 0 0 0 0 0 
0 
##$DATE= 1123159180
##$DBL= (0..7)
120 120 120 120 120 120 120 120 
##$DBP= (0..7)
150 150 150 150 150 150 150 150 
##$DBP07= 0
##$DBPNAM0= <>
##$DBPNAM1= <>
##$DBPNAM2= <>
$$ [...]
##$SUBNAM7= <"">
##$SUBNAM8= <"">
##$SUBNAM9= <"">
##$SW= 20.6930455092707
##$SWIBOX= (0..15)
0 0 3 0 0 0 0 0 0 0 0 0 0 0 0 0 
##$SW_h= 5175.983436853
##$TD= 65536
##$TD0= 1
##$TE= 296.16
##$TE2= 300
##$TE3= 300
##$TEG= 300
##$TL= (0..7)
0 120 120 120 120 120 120 120 
##$TP= (0..7)
150 150 150 150 150 150 150 150 
##$TP07= 0
##$TPNAME0= <>
##$TPNAME1= <>
##$TPNAME2= <>
##$TPNAME3= <>
##$TPNAME4= <>
##$TPNAME5= <>
##$TPNAME6= <>
##$TPNAME7= <>
##$TPOAL= (0..7)
0.5 0.5 0.5 0.5 0.5 0.5 0.5 0.5 
##$TPOFFS= (0..7)
0 0 0 0 0 0 0 0 
##$TUNHIN= 0
##$TUNHOUT= 0
##$TUNXOUT= 0
##$USERA1= <user>
##$USERA2= <user>
##$USERA3= <user>
##$USERA4= <user>
##$USERA5= <user>
##$V9= 5
##$VALIST= <valist>
##$VCLIST= <CCCCCCCCCCCCCCC>
##$VD= 0
##$VDLIST= <DDDDDDDDDDDDDDD>
##$VPLIST= <PPPPPPPPPPPPPPP>
##$VTLIST= <TTTTTTTTTTTTTTT>
##$WBST= 1024
##$WBSW= 4
##$XGAIN= (0..3)
0 0 0 0 
##$XL= 0
##$YL= 0
##$YMAX_a= 479473
##$YMIN_a= -390350
##$ZGOPTNS= <>
##$ZL1= 120
##$ZL2= 120
##$ZL3= 120
##$ZL4= 120
##$ABSF1= 16.522
##$ABSF2= -4.171173
##$ABSG= 5
##$ABSL= 3
##$ALPHA= 0
##$AQORDER= 0
##$ASSFAC= 0
##$ASSFACI= 0
##$ASSFACX= 0
##$ASSWID= 0
##$AUNMP= <proc_1d>
##$AZFE= 0.1
##$AZFW= 0.1
##$BCFW= 0
##$BC_mod= 0
##$BYTORDP= 0
##$COROFFS= 0
##$CY= 12.5
##$DATMOD= 1
##$DC= 0
##$DFILT= <>
##$DTYPP= 0
##$F1P= 14.0000005364418
##$F2P= -0.99999901652339
##$FCOR= 0.5
##$FTSIZE= 32768
##$FT_mod= 6
##$GAMMA= 0
##$GB= 0
##$INTBC= 1
##$INTSCL= 1
##$ISEN= 128
##$LB= 0.3
##$LEV0= 0
##$LPBIN= 0
##$MAXI= 10000
##$MC2= 0
##$MEAN= 0
##$ME_mod= 0
##$MI= 0
##$NCOEF= 0
##$NC_proc= -4
##$NLEV= 6
##$NOISF1= 0
##$NOISF2= 0
##$NSP= 0
##$NTH_PI= 0
##$NZP= 0
##$OFFSET= 16.522
##$PC= 1
##$PHC0= -80.23755
##$PHC1= 3.16273
##$PH_mod= 1
##$PKNL= yes
##$PPARMOD= 0
##$PSCAL= 4
##$PSIGN= 0
##$REVERSE= no
##$SF= 250.13
##$SI= 32768
##$SIGF1= 0
##$SIGF2= 0
##$SINO= 400
##$SIOLD= 32768
##$SREGLST= <1H.CDCl3>
##$SSB= 0
##$STSI= 32768
##$STSR= 0
##$SW_p= 5175.98343685301
##$SYMM= 0
##$S_DEV= 0
##$TDeff= 65536
##$TDoff= 0
##$TI= <Analysis number 999999
Compound Code 99
Book Reference 9
Project Code 9>
##$TILT= no
##$TM1= 0
##$TM2= 0
##$TOPLEV= 0
##$USERP1= <user>
##$USERP2= <user>
##$USERP3= <user>
##$USERP4= <user>
##$USERP5= <user>
##$WDW= 1
##$XDIM= 32768
##$YMAX_p= 315861691
##$YMIN_p= -142696
$$ End of Bruker specific parameters
$$ ---------------------------------
##NTUPLES= NMR SPECTRUM
##VAR_NAME=  FREQUENCY,     SPECTRUM/REAL,   SPECTRUM/IMAG
##SYMBOL=    X,             R,               I
##VAR_TYPE=  INDEPENDENT,   DEPENDENT,       DEPENDENT
##VAR_FORM=  AFFN,          ASDF,            ASDF
##VAR_DIM=   32768,         32768,           32768
##UNITS=     HZ,            ARBITRARY UNITS, ARBITRARY UNITS
##FACTOR=    0.157963299565203, 1,           1
##FIRST=     4132.6476996994, 0,             0
##LAST=      -1043.33573715361, 0,           0
##MIN=       -1043.33573715361, -142696,     0
##MAX=       4132.6476996994, 315861691,     0
$$ Real data points
##PAGE= N=1
##DATA TABLE= (X++(R..R)), XYDATA
$$ [...]
24032f2992J8869l145J2826O4419K1191j2153n2786l1181k278l3087J9284M6435
$$ -62992 -44123 -47268 -34442 29977 51168 39015 -13771 -44952 -47230 -80317 -61033 -14598
24020a4598M230j497K3706j000R791M173l7735J2663M901J5336N4295L3759k2397
$$ -14598 -10368 -11865 11841 10841 20632 24805 -12930 -267 4634 19970 74265 108024 85627
24007H5627m3085j4723L08k7993l1403L9725M5926p965j8721j1625k136j7421
$$ 85627 42542 27819 28127 134 -31269 8456 54382 46417 27696 16071 13935 -3486
23995c486k0618n1633J5695L8092K4455M791j5898l099L0810P031p822j9218K5463
$$ -3486 -24104 -75737 -60042 -21950 2505 7296 -8602 -11701 19109 26140 18318 -900 24563
23982B4563O489k2791K071J4588L9685k1588n1390J6611J536l7650k9391K1356
$$ 24563 31052 8261 10332 24920 64605 43017 -8373 8238 9774 -27876 -57267 -35911
23970c5911K1598J0979L2707r231J3649k1170j2252p018k148K2964j853O515J2696
$$ -35911 -14313 -3334 29373 20142 33791 12621 369 -6649 -8797 14167 12314 18829 31525
23957C1525l521K1030m5173n4088L6750K2817k0636k31l936j3095j8187J427K1457
$$ 31525 28004 49034 3861 -50227 -13477 9340 -11296 -11527 -15463 -28558 -46745 -45318 -23861
23944b3861P827n175P804M0975k7713j908R22L00l5098J9988R720O016J731l9595
$$ -23861 -16034 -21209 -13405 27570 -143 -2051 -1129 -829 -35927 -15939 -6219 -203 1528 -38067
23930c8067k0329J1080L6128Q923J7071K4223j2580k8207m4492K981k7589K7335
$$ -38067 -58396 -47316 -11188 -2265 14806 39029 26449 -1758 -46250 -43269 -70858 -43523
23918d3523N4058L037j2004p911k6883l0821N776L1080O537m918K9993Q673j8156
$$ -43523 10535 13572 1568 -6343 -33226 -64047 -58271 -27191 -20654 -25572 4421 13094 -5062
23905e062L3613M2136L694m6254l7828j9715k2975j8733l649L0018j9257j5345
$$ -5062 28551 70687 74381 28127 -9701 -29416 -52391 -71124 -74773 -44755 -64012 -79357
23893g9357K7106K9470K7042L034j7057L366r126j9272J3856K3920K9921q247
$$ -79357 -52251 -22781 4261 7295 -9762 -6396 -15522 -34794 -20938 2982 32903 24656
23881B4656l015K6262O656j8717n439j7016J6879p084p014l0506k6532K6061K9162
$$ 24656 21641 47903 54559 35842 30403 13387 30266 23182 16168 -14338 -40870 -14809 14353
23868A4353j1359k8634M3959J3265k7501p588l0367m8439k087K5532K8869J3476
$$ 14353 2994 -25640 18319 31584 4083 -3505 -33872 -82311 -84398 -58866 -29997 -16521
23856a6521L703J4310P333l2424K6316M5389k4311j5749N201O403j2368K670k6681
$$ -16521 -12818 1492 8825 -23599 2717 48106 23795 8046 13247 19650 7282 9952 -16729
23843a6729m4794L6530L3599R454K1470J7451K177k5622j8662k3660k3000J4808
$$ -16729 -61523 -24993 8606 18060 39530 56981 59158 33536 14874 -8786 -31786 -16978
23831a6978J2902K4177k062O01K974J416o972r034l1760m967k5415J6952L1398
$$ -16978 -4076 20101 18039 18640 21614 23030 16058 7024 -24736 -29703 -55118 -38166 -6768
23818f768K0650M3910l6560n66r333J8903j8471k4627p742J8657K289L1229K5641
$$ -6768 13882 57792 21232 20666 11333 30236 11765 -12862 -20604 -1947 342 31571 57212
23805E7212j1696m1222o424M057j9704j8847J4089J4765J1750K4928M922l1941
$$ 57212 45516 4294 -2130 1927 -17777 -36624 -22535 -7770 3980 28908 33830 1889
23793A889R963j8234Q585j658j0409j7097j5788O8553o312l6782j293J2486J6405
$$ 1889 11852 -6382 2203 545 -9864 -26961 -42749 25804 19492 -17290 -18583 -6097 10308
23780A0308p348n4974J653N0426L6150N007R897l121n9199j9401N3662L311P141
$$ 10308 2960 -52014 -50361 65 36215 41222 51119 47998 -11201 -30602 23060 26371 33512
23767C3512k6700J6301K08k2253j4452k1655J3470M9504J8056j8727j7700P264
$$ 33512 6812 23113 23321 1068 -13384 -35039 -21569 27935 45991 27264 9564 16828
23755A6828j4536N82j855n016Q043o733j3772j1645L786q029k2625J6838Q656
$$ 16828 2292 2874 1019 -3997 4046 -2687 -16459 -28104 -24318 -32347 -54972 -38134 -29478
23742b9478R15l5791k932J3994L6558j1505m444J9516J0360j2630J6842M3023
$$ -29478 -28563 -64354 -67286 -53292 -16734 -28239 -32683 -13167 -2807 -15437 1405 44428
23730D4428N782q047k4442k2914o889j6469k3080l3207k809K906J0631J9061K1615
$$ 44428 50210 42163 17721 -5193 -12082 -28551 -51631 -84838 -87647 -84741 -74110 -55049 -33434
23717c3434J682J9814L8387j7048m5516L2554K7804L667j8420l771J2616K0223
$$ -33434 -31752 -11938 26449 9401 -36115 -3561 24243 27910 9490 5719 18335 38558
23705C8558j5671j9504j926n546r96J0183n839j7316j8294L7322j6918J5486l968
$$ 38558 22887 3383 1457 -4089 -5085 5098 -741 -18057 -36351 971 -15947 -461 -4429
23692d429l047J1944K8118M0768l1039k5425j4458k4663J7083R666k5397j1238
$$ -4429 -7476 4468 32586 73354 42315 16890 2432 -22231 -5148 4518 -20879 -32117
23680c2117K9903P3l6071Q13N0114l5831l654K889j9408K563M4159M8423l514
$$ -32117 -2214 -2141 -38212 -37399 12715 -23116 -26770 -23881 -43289 -40726 3433 51856 48342
23667D8342k2229L4766j5098j960J1937k5331l9810m9315J5746N394R823n981
$$ 48342 26113 60879 45781 43821 55758 30427 -9383 -58698 -42952 -37558 -27735 -33716
23655c3716n873l594L7219M4990L7659p605L156j9209m755l2394j1542j7853q5
$$ -33716 -39589 -43183 -5964 39026 76685 69080 72236 53027 48272 15878 4336 -13517 -13602
23642a3602Q35R264k4596K8380K8681j5027j8219l7386L9347K3395M034j9741
$$ -13602 -12767 -3503 -28099 281 28962 13935 -4284 -41670 -2323 21072 25106 5365
23630E365l3290l005p982k4051J2582K494K3692N6447N785j9707k0832j6431J4355
$$ 5365 -27925 -30930 -38912 -62963 -50381 -47887 -24195 32252 38037 18330 -2502 -18933 -4578
23617d578Q931M007J1524j9258j0341j9914K4012O802j2921k1486L5114L0530
$$ -4578 4353 8360 19884 626 -9715 -29629 -5617 1185 -11736 -33222 1892 32422
23605C2422k3592j2753J0j7156m2462o800M2950L1404j3309J4876J4580m836j8278
$$ 32422 8830 -3923 -3913 -21069 -63531 -70331 -27381 4023 -9286 5590 20170 15334 -2944
23592b944O4k388J7512K8115k5342k0201Q773J3076j0375J7071j5737k0101l854
$$ -2944 -2880 -5268 12244 40359 15017 -5184 3589 16665 6290 23361 7624 -12477 -16331
23579a6331k1517J1041J1878K9700j8843l7373l3600l264M4694M2777L174P467
$$ -16331 -37848 -26807 -14929 14771 -4072 -41445 -75045 -78309 -33615 9162 12336 19803
23567A9803O606l5796J9259R005l522n52j2182r517q920K6376j9346j9279k348
$$ 19803 26409 -9387 9872 18877 15355 14803 2621 -6896 -15816 10560 -8786 -28065 -30413
23554c0413k3232j9385R354L8577J7246l7313j590M0857J4332j1353K3053Q561
$$ -30413 -53645 -73030 -63676 -25099 -7853 -45166 -46756 -5899 8433 -2920 20133 28694
23542B8694j7868j7766J6841k2086j7432K1614o9j9473k0870l739J0927L1020
$$ 28694 10826 -6940 9901 -12185 -29617 -8003 -8072 -27545 -48415 -52154 -41227 -10207
23530a0207K6440J9343j9669j8843R351J0752k4121l1052j5859p928j2641L1106
$$ -10207 16233 35576 15907 -2936 6415 17167 -6954 -38006 -53865 -61793 -74434 -43328
23518d3328l757K1957L479J6612p242k0860K558L2583L8663J0510n2854k827N700
$$ -43328 -47085 -25128 -21649 -5037 -12279 -33139 -30581 2002 40665 51175 -1679 -4506 1194
23505A194Q906j9395m4881M583J7814j2886l819J5879J7652j5163r018p993R819
$$ 1194 10100 -9295 -54176 -49593 -31779 -44665 -48484 -32605 -14953 -30116 -39134 -47127 -37308
23492c7308J9588O004M0660M204m2455j2711K1548J977k3888k7790l6635p392
$$ -37308 -17720 -11716 28944 33148 -9307 -22018 -470 1507 -22381 -50171 -86806 -94198
23480i4198P904K5604j1218J3899L6036L8328K083k5550n5733n5705L7253R054
$$ -94198 -86294 -60690 -71908 -58009 -21973 16355 18438 -7112 -62845 -118550 -81297 -72243
23468g2243J2285L1291K9727o04r76J6489r876k4711M711J6379L0382p237o2884
$$ -72243 -59958 -28667 1060 456 -520 15969 6093 -18618 -13907 2472 32854 25617 -37267
23455c7267n7859J709L6560J7513r219J9921J0256M6866M985j9669k4175k4911
$$ -37267 -95126 -93417 -56857 -39344 -48563 -28642 -18386 28480 33465 13796 -10379 -35290
23443c5290Q987J4667l1030J602K5961L5392K5910P939o634j6754O50m404j7581
$$ -35290 -26303 -11636 -42666 -41064 -15103 20289 46199 54138 47504 30750 31400 26996 9415
23430I415l5141J642L6216J6439k451k565k2525j5291k8229R583L9437K1563j080
$$ 9415 -25726 -24084 12132 28571 26120 23555 1030 -14261 -42490 -32907 6530 28093 27013
23417B7013k0421k1443O478P212J4522k5046J7362M1911k1890k7242k4606O220
$$ 27013 6592 -14851 -8373 -1161 13361 -11685 5677 47588 25698 -1544 -26150 -19930
23405a9930n538K0395J5841j9818k1156J3638K1903J9494l3196k5340L5126J5059
$$ -19930 -25468 -5073 10768 -9050 -30206 -16568 5335 24829 -8367 -33707 1419 16478
23393A6478l0772k3505M346K6236j792l3193j6933J8621K0933M712j8767J8120
$$ 16478 -14294 -37799 -33453 -7217 -9009 -42202 -59135 -40514 -19581 -14869 -33636 -15516
23381a5516N5300j6837k7317p795j3482k7901J7741O7924M4578K0202l3255m0051
$$ -15516 39784 22947 -4370 -12165 -25647 -53548 -35807 32117 76695 96897 63642 23591
23369B3591J0941J0028n5447k679K437k974j1702l2407J6162Q654l681k4605K9053
$$ 23591 34532 44560 -10887 -13566 -11129 -14103 -25805 -58212 -42050 -33396 -37077 -61682 -32629
23356c2629J9504K9042j512q408m311k1846j3201L675j1357J5470J0944J8226
$$ -32629 -13125 15917 14405 5997 1686 -20160 -33361 -29686 -41043 -25573 -14629 3597
23344C597k255j2833j3209p753K8693R8l4496J1928L0231r875J1150q185O799
$$ 3597 1342 -11491 -24700 -32453 -3760 -3662 -38158 -26230 4001 -5874 5276 -2909 3890
23331C890n421M603n156J206K8372K7268l4867K7228O836l9873J0911N356K1340
$$ 3890 -1531 3072 -2084 -878 27494 54762 19895 47123 53959 14086 24997 30353 51693
23318E1693N421j6920j1326l409P938J3764k2753k8086j6558l5416J7818N4680
$$ 51693 57114 40194 28868 25459 33397 47161 24408 -3678 -20236 -55652 -37834 16846
23306A6846J1664j2528m8099O250K33L0690K3195O21j4262J0544J1948k085L3839
$$ 16846 28510 15982 -32117 -25867 -25634 5056 28251 28872 14610 25154 37102 35017 68856
23293F8856J4640j4385k2846m1563k3324k3043L1926N3181J4973k4828n0242M4935
$$ 68856 83496 69111 46265 4702 -18622 -41665 -9739 43442 58415 33587 -16655 28280
23281B8280j5840m6553L272J3762l7012J4887j765J0438l83J6996J3590j0335
$$ 28280 12440 -34113 -30841 -17079 -54091 -39204 -40969 -30531 -30914 -13918 -328 -10663
23269a0663K4388j7067j6401J3555m479J8222J3907K7290k9703J8815m373j7366
$$ -10663 13725 -3342 -19743 -6188 -10667 7555 21462 48752 19049 37864 33491 16125
23257A6125R880J1436k0736r504J6216K7390j5849j2934K1843j5713k198K1063
$$ 16125 26005 37441 16705 7201 23417 50807 34958 22024 43867 28154 25956 47019
23245D7019K2336k2576Q647j8301n7402N779N1326k149j8973m1766j6470L8500
$$ 47019 69355 46779 55426 37125 -20277 -14498 36828 34679 15706 -26060 -42530 -4030
23233d030Q988j5310r339O303j6146K5463k6307m424j8119n715M526j7657O756
$$ -4030 4958 -10352 -19691 -13388 -29534 -4071 -30378 -34802 -52921 -58636 -54110 -71767 -65011
23220f5011m60R295r004m6300M4201L1028J0982L56l2717N900M0636k984J2018
$$ -65011 -65471 -56176 -65180 -111480 -67279 -36251 -25269 -24913 -57630 -51730 -11094 -14078 -2060
23207b060R298k6012l5880P572p658J0614n328j7689o66J7000J5345Q587L0556
$$ -2060 7238 -18774 -54654 -47082 -54740 -44126 -49454 -67143 -67809 -50809 -35464 -26877 3679
23194C679Q228j7819j4997J5190j4082J3623m833J0170O024j9276l009N317j105
$$ 3679 11907 -5912 -20909 -5719 -19801 -6178 -11011 -841 5183 -14093 -17102 -11785 -12890
23181a2890J5454M169o236l1664p177L9651K6916M5k9825l3758o762K9272q650
$$ -12890 2564 6733 497 -31167 -38344 1307 28223 28268 -1557 -35315 -42077 -12805 -21455
23168b1455j7306K6944M4864l044n030J9624k744k3940l6696o910n07J9950p387
$$ -21455 -38761 -11817 33047 30003 24973 44597 41853 17913 -18783 -25693 -26200 -6250 -13637
23155a3637j7696m923k722j0583J4332k089l6165J6648M9053J483o0517k3876
$$ -13637 -31333 -36256 -38978 -49561 -35229 -37318 -73483 -56835 -7782 -6299 -66816 -90692
23143i0692M7248K4029j5440J3551P289K7689k2389j1400L3662l6119l2691L6792
$$ -90692 -43444 -19415 -34855 -21304 -14015 13674 -8715 -20115 13547 -22572 -55263 -18471
23131a8471J7480j2407R689K3145j5712k9142n060j7020l0527L1775K9304K1586
$$ -18471 -991 -13398 -3709 19436 3724 -25418 -30478 -47498 -78025 -46250 -16946 4640
23119D640k834r185j3037R919j088q577J8284l352p648j1706r693L5915J1823
$$ 4640 1806 -7379 -20416 -10497 -11585 -20162 -1878 -5230 -12878 -24584 -34277 1638 13461
23106A3461j7495K1333n794j6094j2340l4512l3779k8017K8846L0809J3640k5661
$$ 13461 -4034 17299 11505 -4589 -16929 -51441 -85220 -113237 -84391 -53582 -39942 -65603
23094f5603j0198J1648J2671K5719M7289j6939M98J3175J063l2555O307q056j2358
$$ -65603 -75801 -64153 -51482 -25763 21526 4587 5085 18260 19323 -13232 -6925 -14981 -27339
23081b7339J459J7468L1412J662k2519n242j8471K3778L605k2927Q10k780J3399
$$ -27339 -25880 -8412 23000 24662 2143 -3099 -21570 2208 5813 -17114 -16304 -19084 -5685
23068e685L0439Q623p697k0581k855M696L627l094l188J3743K7582l809j3944
$$ -5685 24754 33377 25680 5099 2244 6940 10567 7473 4285 18028 45610 41801 27857
23055B7857l7220j4840L2867q540m589Q801J9200m29j0754o222K1566J7865J6478
$$ 27857 -9363 -24203 8664 124 -4465 4336 23536 23107 12353 6131 27697 45562 62040
23042F2040j8821o4420l2167K9069L1290K3353j2980p396M917o978J300o577P790
$$ 62040 43219 -21201 -53368 -24299 6991 30344 17364 9968 14885 7907 9207 2630 10420
23029A0420j6664J2742j9093j93o100K888J1619j0684L8219j2573J22n443K4148
$$ 10420 -6244 6498 -12595 -12788 -18888 -16000 -4381 -15065 23154 10581 10703 5260 29408
23016B9408J5867P628K8653p667n9963m9325j7319J5291P027J5657L0590J0751
$$ 29408 45275 52903 81556 73889 13926 -35399 -52718 -37427 -30400 -14743 15847 26598
23004B6598m041j0299J348J981j5382j7414J4779j6017J0782J1553M656N049j3383
$$ 26598 22557 12258 13606 15587 205 -17209 -2430 -18447 -7665 3888 8544 13593 210
22991B10J3295L7292j1821k3p686l7952O153M7016l3542l0601J3801L1L5932l2042
$$ 210 13505 50797 38976 38953 31267 -6685 -532 46484 12942 -17659 -3858 -3827 32105 63
22977F3k9043K7602J1987j7955K1103R337j584P438l4817j4592L7427o287L1751
$$ 63 -28980 -1378 10609 -7346 13757 23094 21510 28948 -5869 -20461 16966 10679 42430
22964D2430o077q225J2794R882k0892q627k9656k7972K9114K0505O583Q271n616
$$ 42430 36353 28128 40922 50804 29912 21285 -8371 -36343 -7229 13276 19859 28130 22514
22951B2514k5080k0935j8335k4684L0186M9868j5676r955K8440R305k2937l7344
$$ 22514 -2566 -23501 -41836 -66520 -36334 13534 -2142 -12097 16343 25648 2711 -34633
22939c4633o889K8632M649j7718K2117L5903K209j8574j2583k293J0581K0240
$$ -34633 -41522 -12890 -8241 -25959 -3842 32061 34270 15696 3113 820 11401 31641
22927C1641K3322m731j8071k1897k758L68J4929r373J2198L1629r998k5057n2183
$$ 31641 54963 50232 32161 10264 7506 7874 22803 13430 25628 57257 47259 22202 -29981
22914b9981k3119K2319O4012L0279j0410k8135m2166k133K8844n232O118r791
$$ -29981 -53100 -30781 33231 63510 53100 24965 -17201 -19334 9510 4278 10396 605
22902F05j2049k6448M657K8827K398K8101q103k4628N674K6549L423k8628m9670
$$ 605 -11444 -37892 -33235 -4408 -2010 26091 17988 -6640 -966 25583 29006 378 -49292
22889d9292k7995J1985K0187R651o146J7724J4081k718l311J3486K1397O083R656
$$ -49292 -77287 -65302 -45115 -35464 -41610 -23886 -9805 -12523 -15834 -2348 19049 25132 34788
22876C4788J2012k3519m3920k8274J3498M1008j5611N09j5505k0109J9143J7669
$$ 34788 46800 23281 -20639 -48913 -35415 5593 -10018 -9509 -25014 -45123 -25980 -8311
22864h311K2856M2600k3344k5792K2831j9055j0667J8904l097j0977J0828K01
$$ -8311 14545 57145 33801 8009 30840 11785 1118 20022 16925 5948 16776 16977
22852A6977l3538j1619l409K777N824j55j1432J058p627Q939J5368N146o150J9123
$$ 16977 -16561 -28180 -31589 -28812 -22988 -23143 -34575 -33517 -41144 -32205 -16837 -11691 -17841 1282
22838A282K2687K8906m508l8803k8570O085K1254L3863K7574Q36p035L984j3879
$$ 1282 23969 52875 48367 9564 -19006 -12921 8333 42196 69770 70606 63571 67555 53676
22825E3676j7713k5370k7096l4766J3701J4527P771K85K2790J1580n619K2599
$$ 53676 35963 10593 -16503 -51269 -37568 -23041 -15270 -14985 7805 19385 13766 36365
22813C6365J2372j117j0158l2477o761k622M2722p108n3912J1179J5850J0471
$$ 36365 48737 47620 37462 4985 -1776 -4398 38324 31216 -22696 -11517 4333 14804
22801A4804k3346l8360J4514J4166J5930K4755k1136m1267J9512J0724K167J9949
$$ 14804 -8542 -46902 -32388 -18222 -2292 22463 1327 -39940 -20428 -9704 -7537 12412
22789A2412J4861N838j6748j9557K1393j2437p890M1252k3432k1787J3783k540
$$ 12412 27273 33111 16363 -3194 18199 5762 -2128 39124 15692 -6095 7688 5148
22777E148r167Q376N873J5662k2615m5739k2845M9106J7746m3128J9028k5064
$$ 5148 -4019 4357 10230 25892 3277 -42462 -65307 -16201 1545 -41583 -22555 -47619
22765d7619O73M7821J927J524J0748k5064n328q953j7230j2445l2R923N575Q660
$$ -47619 -46946 875 2802 4326 15074 -9990 -15318 -24271 -41501 -53946 -53978 -44055 -38480 -29820
22751b9820Q238L8212o159k0134j9747J0304N038M7214K7682l6979k4954j1106
$$ -29820 -21582 16630 10471 -9663 -29410 -19106 -14068 33146 60828 23849 -1105 -12211
22739a2211K2266J929k942P424M149k9910M393J1510o578j5363m1637K3569J8401
$$ -12211 10055 11984 9042 16466 20615 -9295 -4902 6608 30 -15333 -56970 -33401 -15000
22726a5000l5021l130M4177j2743k5535K4407R322p056l669q46P013L431p815
$$ -15000 -50021 -53151 -8974 -21717 -47252 -22845 -13523 -20579 -24248 -25094 -18081 -14650 -22465
22713b2465J5047J1983r20k283J4844j2379k6014J9719L8514k1543n9934l2323
$$ -22465 -7418 4565 3645 1362 16206 3827 -22187 -2468 36046 14503 -45431 -77754
22701g7754J9801J0216O011K2691L2870l533r164J9274l2035m805K0034k0987
$$ -77754 -57953 -47737 -41726 -19035 13835 10302 1138 20412 -11623 -16428 3606 -17381
22689a7381K775L5224j0183m4369K546J1897M7670r57k7488K9996R000k942n2318
$$ -17381 -14606 20618 10435 -33934 -31388 -19491 28179 27222 -266 29730 38730 35788 -16530
22676a6530r957K8177L0311l2385P725n006q120r100m691P730k5201k3237r093
$$ -16530 -26487 1690 32001 -384 7341 2335 -5785 -14885 -19576 -11846 -37047 -60284 -69377
22663f9377J1802J1090J4595l829j3448k1186N0710L0642M7273L2841l1144m1642
$$ -69377 -57575 -46485 -31890 -35719 -49167 -70353 -19643 10999 58272 91113 59969 18327
22651A8327j0850J423k3635j2791Q488n888j1292L5481p809K0326K0245j5479
$$ 18327 7477 8900 -14735 -27526 -19038 -24926 -36218 -737 -8546 11780 32025 16546
22639A6546k000L3493j2100Q927k9344q524M2205k6572k5414j6482L916o799J0298
$$ 16546 14546 48039 35939 44866 15522 6998 49203 22631 -2783 -19265 -15349 -22148 -11850
22626a1850Q482j8386o639m516L2220j2555J0409J7459m024l624l7560k7493K7004
$$ -11850 -3368 -21754 -28393 -32909 -689 -13244 -2835 14624 10600 6976 -30584 -58077 -31073
22613c1073M5943M357l5250N662j0882k5928k0197k217k8887J2975L5298q446
$$ -31073 14870 19227 -16023 -10361 -21243 -47171 -67368 -69585 -98472 -85497 -50199 -58645
22601e8645l6399o213j5980K6892N7749M4371R41k7237N124K4522r826k7687J7592
$$ -58645 -95044 -101257 -117237 -90345 -32596 11775 12716 -14521 -9397 15125 5299 -22388 -4796
22588d796J7055L7835k5888l028J7994j1443L8225K6098J1718o061r0855R267
$$ -4796 12259 50094 24206 21178 39172 27729 65954 92052 103770 97709 6854 16121
22576A6121J1216n806k4641j0386p040j8615l3888K8330K4081r247j6566l1537
$$ 16121 27337 21531 -3110 -13496 -20536 -39151 -73039 -44709 -20628 -29875 -46441 -77978
22564g7978k262N1241L0542j0476j6316p467k59M487k018K6949r284k2263L240
$$ -77978 -80240 -28999 1543 -8933 -25249 -32716 -32975 -28488 -30506 -3557 -12841 -35104 -31864
22551c1864J0999J849j1934j065j609k0681P403K8921N7877l1970m6666R748L4910
$$ -31864 -20865 -19016 -30950 -32015 -33624 -54305 -46902 -17981 39896 7926 -38740 -28992 5918
22538E918K4541r118k8089k2146O202k1224J4337P442L4433p897m871n609R284
$$ 5918 30459 21341 -6748 -28894 -22692 -43916 -29579 -22137 12296 4399 -472 -6081 3203
22525C203r327L282j1237P65J1975J9738k3207j3195j8176k2612n755K2408J196
$$ 3203 -6124 -2842 -14079 -13314 -1339 18399 -4808 -18003 -36179 -58791 -64546 -42138 -40942
22512d0942K3483q958j9869k7764K1988M9336j0296q057K586o588J9281q980r795
$$ -40942 -17459 -26417 -46286 -74050 -52062 -2726 -13022 -21079 -18493 -25081 -5800 -14780 -24575
22499b4575K994J0084j58L6432j4874l8719l2947J0403L7j6065N7641K9819j3553
$$ -24575 -21581 -11497 -11655 24777 9903 -28816 -61763 -51360 -51323 -67388 -9747 20072 6519
22486F519l9730J5174o844q791j4888M597K6295K7794j2524O624M705k9482n764
$$ 6519 -33211 -18037 -24881 -33672 -48560 -43963 -17668 10126 -2398 4226 8931 -20551 -26315
22473b6315J9583J9620K7528J1518k274l233J1981m8958l8394k7255J7641L001
$$ -26315 -6732 12888 40416 51934 49660 46427 58408 9450 -28944 -56199 -38558 -35557
22461c5557m77K1905l3327J9976Q102j5753n012l267j4466J2470j0453J5426Q382
$$ -35557 -36034 -14129 -47456 -27480 -19378 -35131 -40143 -43410 -57876 -45406 -55859 -40433 -32051
22448c2051J7774J8925n689J753J0667j8073J5884M978J2004j9891J0005k5423
$$ -32051 -14277 4648 -1041 712 11379 -6694 9190 14168 26172 6281 16286 -9137
22436i137j1205K3496N409J192K2375J5040q240j624K4613J426J0839k6680j5923
$$ -9137 -20342 3154 8563 9755 32130 47170 38930 37306 61919 63345 74184 47504 31581
22423C1581j6356j7810q574L6310l552k294r460k9689k6468j0723K7951K3160
$$ 31581 15225 -2585 -11159 25151 21599 19305 9845 -19844 -46312 -57035 -29084 -5924
22411e924N856r696k1699n459n363p98l157J0656L3703Q030K373m3609j7771J5852
$$ -5924 -68 -9764 -31463 -36922 -42285 -43083 -46240 -35584 -1881 6149 8522 -35087 -52858 -37006
22397c7006L5596K1593K8601p349k7386j0474L2203K3098K2269j1900l6662n9280
$$ -37006 -1410 20183 48784 41435 14049 3575 35778 58876 81145 69245 32583 -26697
22385b6697n0079q542N0778N7288l812K799k3922l6520Q974J9560J0600N3953
$$ -26697 -76776 -85318 -34540 22748 18936 21735 -2187 -38707 -29733 -10173 427 54380
22373E4380J628k9475j3113O721q219j6334l041L796L7497N969n691K383l0966
$$ 54380 56008 26533 13420 20141 11922 -4412 -7453 -3657 33840 39809 34118 36501 5535
22360E535j198K4652N36R87q381j1638J0075J9965j8897q890k803p853J6219j641
$$ 5535 4337 28989 29525 30512 22131 10493 20568 40533 21636 12746 9943 2090 18309 16668
22346A6668k5364m2773j5387L9320L5599M8951m1518j905K2448J1033k5922n6909
$$ 16668 -8696 -51469 -66856 -27536 8063 57014 15496 13591 36039 47072 21150 -35759
22334c5759m366J7818L0124J4797r870m160o033l3368R410j6827j6330n168J3040
$$ -35759 -40125 -22307 7817 22614 12744 8584 2551 -30817 -21407 -38234 -54564 -59732 -46692
22321d6692R824J7052K4383K7962M340j1194k0048J3333K2811k1665J5214k788
$$ -46692 -36868 -19816 4567 32529 36869 25675 5627 18960 41771 20106 35320 32532
22309C2532k1852R974m747l5754J4865O550p761j9780k500O670K1430r434j992
$$ 32532 10680 20654 15907 -19847 -4982 1568 -6193 -25973 -28473 -21803 -373 -9807 -11799
22296a1799q16J8537L552o2298o113M2246L0332p785O727J3320k7864j0802j277
$$ -11799 -12615 5922 9474 -52824 -58937 -16691 13641 5856 12583 25903 -1961 -12763 -14040
22283a4040n95q976o677K1371K3092L2645K2088k0443n2464k4532J258l55J5949
$$ -14040 -14635 -23611 -30288 -8917 14175 46820 68908 48465 -3999 -28531 -27273 -27628 -11679
22270a1679k1259j5590L1357K4105P303m748l779K7925j6041k0408J1157l1614
$$ -11679 -32938 -48528 -17171 6934 14237 9489 5710 33635 17594 -2814 8343 -23271
22258b3271n7923L0758J3045k4202J6162O8807j1541q816K928J9748L5571P692
$$ -23271 -81194 -50436 -37391 -61593 -45431 23376 11835 3019 5947 25695 61266 68958
22246F8958J412l5076m7318j1392R820K9184J7648K1766j8767m1346j6715Q367
$$ 68958 70370 35294 -12024 -23416 -13596 15588 33236 55002 36235 -5111 -21826 -13459
22234a3459J1891q503k5546K8151J2714L2081L831k5567k6063l7451P135J0331
$$ -13459 -1568 -10071 -35617 -7466 5248 37329 41160 15593 -10470 -47921 -40786 -30455
22222c0455L4731L455J7638k311J843o420J4819l1967k3474L4672L0523k5346
$$ -30455 4276 7731 25369 23058 24901 18481 33300 1333 -22141 12531 43054 17708
22210A7708K0207J0757n5719l6029Q562J0911j0890J7210N1085n252k1765k3896
$$ 17708 37915 48672 -7047 -43076 -34514 -23603 -34493 -17283 33802 28550 6785 -17111
22198a7111J6858K637n745L7808M6277N386n5138M81J606j1834K8799j5752p662
$$ -17111 -253 2384 -3361 34447 80724 86110 30972 31453 33059 21225 50024 34272 26610
22185B6610m433j3261j3665Q416J3423l0941l2477J6101M3448M13j8973K32K5393
$$ 26610 22177 8916 -4749 3667 17090 -13851 -46328 -30227 13221 13634 -5339 -5107 20286
22172B0286l6431j6870j2023j5219j2580J0338m275R784m617j7715M0752N2607
$$ 20286 -16145 -33015 -45038 -60257 -72837 -62499 -66774 -56990 -61607 -79322 -38570 14037
22160A4037J5497n2733m9679K2195J9203q60k1346k9809M8321q551j3646K2951
$$ 14037 29534 -23199 -72878 -50683 -31480 -32340 -53686 -83495 -35174 -43725 -57371 -34420
22148c4420M4680L0210J1260K1260k3559j0402J7722k3062k1507j0924j1249j0737
$$ -34420 10260 40470 51730 72990 49431 39029 56751 33689 12182 1258 -9991 -20728
22136b0728j6042J6782j3915l2039K5950O8635K9741q226J8588j2748j6801m757
$$ -20728 -36770 -19988 -33903 -65942 -39992 28643 58384 50158 68746 55998 39197 34440
22124C4440o6377l5679P144J6981K0492J1451L1741m6803l1769M3033L3657j6071
$$ 34440 -31937 -67616 -60472 -43491 -22999 -11548 20193 -26610 -58379 -15346 18311 2240
22112B240k5526L2560L5588k7702O16K7143p015k4601j7379O49J697J1349K0318
$$ 2240 -23286 9274 44862 17160 17776 44919 37904 13303 -4076 -3427 -1730 9619 29937
22099B9937J9369J1516r731l1292J6567k881l5735k1691k3465N632K4519J6007
$$ 29937 49306 60822 51091 19799 36366 33485 -2250 -23941 -47406 -41774 -17255 -1248
22087a248k2990L720K8894O022p549j6922j1441M127r986k3010q932L3895L2705
$$ -1248 -24238 -20518 8376 14398 6849 -10073 -21514 -17387 -27373 -50383 -59315 -25420 7285
22074G285m72M07r517L3784M910k8150M143o432O73J940k9196p229j0790j9273
$$ 7285 6813 7220 -2297 31487 36397 8247 12390 5958 6631 8571 -20625 -27854 -38644 -57917
22060e7917J2597J7808j7096K8114J7585J608j3020k7498j4004K564Q456j300
$$ -57917 -45320 -27512 -44608 -16494 1091 2699 -10321 -37819 -51823 -49259 -40803 -42103
22048d2103K8164L2197L1964j7136n1055O663K974j849l268J8687k1960j9995
$$ -42103 -13939 18258 50222 33086 -17969 -11306 -8332 -10181 -13449 5238 -16722 -36717
22036c6717l1669n306N4585J5986J395o751k0488J8113j0051O187J6219L249J3788
$$ -36717 -68386 -73692 -19107 -3121 -1726 -8477 -28965 -10852 -20903 -14716 1503 4752 18540
22023A8540J2834L215K0044k1459k5727O349K9208J5127j4320j3494m7634j5404
$$ 18540 31374 34589 54633 33174 7447 13796 43004 58131 43811 30317 -17317 -32721
22011c2721J3714J3243j6442j3582j3329L4233q089l6742j502J4165K4607L2825
$$ -32721 -19007 -5764 -22206 -35788 -49117 -14884 -22973 -59715 -61217 -47052 -22445 10380
21999A0380N2402k7421l2816J7278j8053m182L2833J3675p060l4155j0225r57
$$ 10380 62782 35361 2545 19823 1770 -2412 30421 44096 37036 2881 -7344 -8301
21987h301k2694L1619J2562k3420M862j2305J2771K0985Q424l4386j3395K080
$$ -8301 -30995 624 13186 -10234 -5372 -17677 -4906 16079 24503 -9883 -23278 -21198
21975b1198j0822j9370j9850L020L3281K1140K9368l0786k029J5447k4829K4672
$$ -21198 -32020 -51390 -71240 -68220 -34939 -13799 15569 -15217 -17246 -1799 -26628 -1956
21963a956J4778m534k110l2074r489N939J0972j7472J06k4199k600L9815M951
$$ -1956 12822 8288 6178 -25896 -35385 -29446 -18474 -35946 -35840 -60039 -62639 -22824 -17873
21950a7873l4784j5418J7692K3029J2383o906K4558K5723P33n4999m044L1523
$$ -17873 -52657 -68075 -50383 -27354 -14971 -21877 2681 28404 29137 -25862 -29906 1617
21938A617r348J7528J2263k384o086Q298m2205L056q48K1351L54j7002M671J1288
$$ 1617 -7731 9797 22060 19676 13590 21888 -20317 -17261 -18109 3242 3596 -13406 -8735 2553
21924B553j954k2488K8314P170k896M000L1131k4525k1703J0352L2701q674l195
$$ 2553 599 -21889 6425 13595 10699 14699 45830 21305 -398 9954 42655 33981 30786
21911C0786k6288k3512R588L0503N201J0488j7898j5931l273J4592P868K4699
$$ 30786 4498 -19014 -9426 21077 26278 36766 18868 2937 -336 14256 22124 46823
21899D6823k7689n3785j3906N274K988P811n529J6814K1214N61K3129n268k1892
$$ 46823 19134 -34651 -48557 -43283 -40295 -32484 -38013 -21199 15 576 23705 18437 -3455
21886c455J7977k7871L6243J6771j9127J7667j0840j1496j7937J8652l8404l3709
$$ -3455 14522 -13349 22894 39665 20538 38205 27365 15869 -2068 16584 -21820 -55529
21874e5529J6431J7101j875J0259R079k8784K3791J6322Q366m7352j8959L4436
$$ -55529 -39098 -21997 -23872 -13613 -4534 -33318 -9527 6795 15161 -32191 -51150 -16714
21862a6714J7167n367k1219j8374J4988R307j1011K9605N522j841J5161K0604
$$ -16714 453 -4914 -26133 -44507 -29519 -20212 -31223 -1618 3904 2063 17224 37828
21850C7828r453P398N662k4939o326K803K6050N905j3590l360k550J1472j7623
$$ 37828 28375 35773 41435 16496 10170 12973 39023 44928 31338 27978 25428 36900 19277
21837A9277k898J5160n444n5579j7232O293K9309M2619r656m7063k5090K3069
$$ 19277 16379 31539 26095 -29484 -46716 -40423 -11114 31505 21849 -25214 -50304 -27235
21825b7235M3528J8076L0438Q237j1120p766k7136k3115J6569J0129p816j5381
$$ -27235 16293 34369 64807 73044 61924 54158 27022 3907 20476 30605 22789 7408
21813G408l8666j367J3098P141M3420J5943J131k6966l1059K4421R16k3080K4187
$$ 7408 -31258 -32625 -19527 -12386 31034 46977 48108 21142 -9917 14504 15420 -7660 16527
21800A6527L3482l7951l7710K5707L9159K4221j7426J177K703m298j5510j2124
$$ 16527 50009 12058 -25652 55 39214 63435 46009 47186 49889 45591 30081 17957
21788A7957k2520k8664L0719O953M205r771K7257k2826l9021J1886J8053M3380
$$ 17957 -4563 -33227 -2508 4445 8650 -1121 26136 3310 -35711 -23825 -5772 37608
21776C7608N874n2487j0231R901k0551J6284q174J637L442P207k0301K6990K8072
$$ 37608 43482 -9005 -19236 -9335 -29886 -13602 -21776 -20139 -16697 -9490 -29791 -2801 25271
21763B5271j957j8449o733M6417K7080K952p03o780j6989j4515J0008k7762K039
$$ 25271 23314 4865 -1868 44549 71629 74581 73878 67098 50109 35594 45602 17840 19879
21750A9879M3518J1186k9777j7305m4119m228O21R546L4742j561k4249q926n61
$$ 19879 63397 74583 44806 27501 -16618 -20846 -20225 -10679 24063 22502 -1747 -10673 -11234
21737a1234O573K3004K1756j7036j9622n278J379k3027J6244J5375j109k8890
$$ -11234 -4661 18343 40099 23063 3441 -1837 -458 -23485 -7241 8134 7025 -21865
21725b1865j3370L0593l175j3629L772j08k4447O65j9928j5326N7520M8253J5634
$$ -21865 -35235 -4642 -7817 -21446 -17674 -17782 -42229 -41564 -61492 -76818 -19298 28955 44589
21712D4589j4658j4632k5711k0089J8458J2162rJ340k4540k7924l204O1380P30
$$ 44589 29931 15299 -10412 -30501 -12043 119 110 1450 -23090 -51014 -54218 7162 7892
21699G892K410J4781o210Q775M507l981L9987k0651k4394R751k5654j2554m5633
$$ 7892 10302 25083 18873 27648 32155 28174 68161 47510 23116 32867 7213 -5341 -50974
21686e0974k4024k0186J5901L6516J7390P980M7040K2643l8645j2832J0237L425
$$ -50974 -74998 -95184 -79283 -42767 -25377 -17397 29643 52286 13641 809 11046 14471
21674A4471R932p248j9586L8747J2625p152j3542l7215j6731J3071M2098K6706
$$ 14471 24403 17155 -2431 36316 48941 41789 28247 -8968 -25699 -12628 29470 56176
21662E6176k8503R437L0581l6424m3938O202P454O019L488l0644l623J152j230
$$ 56176 27673 37110 67691 31267 -12671 -6469 985 7004 10492 -20152 -23775 -22623 -23853
21649b3853r310j304J7612K8628J8332j0985m5101J9040O072P358N257O263k130
$$ -23853 -33163 -34467 -16855 11773 30105 19120 -25981 -6941 -869 6489 11746 18009 15879
21636A5879j692l59Q923K764J2096J0362r091J1883j8130k8723M101K0561J1003
$$ 15879 14187 13828 22751 25515 37611 47973 38882 50765 32635 3912 8013 28574 39577
21623C9577m9599j7217J1513j792o9J5742R029k714N314M221m494j4051j882l47
$$ 39577 -10022 -27239 -15726 -17518 -17587 -1845 7184 4470 9784 14005 9511 -4540 -6422 -6769
21609f769J2779q275q210J9346l9388k8096J9296O6J0452M7348K0470k4581m6144
$$ -6769 6010 -2265 -10475 8871 -30517 -58613 -39317 -39251 -28799 18549 39019 14438 -31706
21596c1706k1490L3747J6038l5324j463l263K0429p498l3745L8631K7846j9502
$$ -31706 -53196 -19449 -3411 -38735 -40198 -43461 -23032 -30530 -64275 -25644 2202 -17300
21584a7300J2631J4980q440j9009J7736p507j0284j8456R162M118M3208L8660
$$ -17300 -4669 10311 1871 -17138 598 -6909 -17193 -35649 -26487 -22369 20839 59499
21572E9499l0189m0964L436n718k9144j0413K4540J77L73L0530j6151m1292M4203
$$ 59499 29310 -11654 -8218 -13936 -43080 -53493 -28953 -28776 -28403 2127 -14024 -55316 -11113
21559a1113M4847k7159l1144r709M211J9551o749l7362j0334J1317K0980J5538
$$ -11113 33734 6575 -24569 -34278 -30067 -10516 -17265 -54627 -64961 -53644 -32664 -17126
21547a7126j7294j7115m787j0098l177L9634R062J6159M7665K9339k8126l2330
$$ -17126 -34420 -51535 -56322 -66420 -69597 -29963 -20901 -4742 42923 72262 44136 11806
21535A1806m491J4429J6540N879R497J3682l8356j4793m483L564k0586K1187K4630
$$ 11806 7315 21744 38284 44163 53660 67342 28986 14193 9710 13274 -7312 13875 38505
21522C8505O003k5192J1979Q673K1246L497j5306j8007m8056M210L2242L3569
$$ 38505 44508 19316 31295 39968 61214 64711 49405 31398 -16658 -12448 19794 53363
21510E3363Q53K15j433j3644n057K4963M076k4539k0536P675J8662l9067k9093
$$ 53363 54216 54431 52998 39354 34297 59260 63336 38797 18261 25936 44598 5531 -23562
21497b3562k0109M0141K189n660J6359j7659k715q159Q00P174j6068p572J5265
$$ -23562 -43671 -3530 -1341 -7001 9358 -8301 -11016 -19175 -18375 -11201 -27269 -34841 -19576
21484a9576Q6125J1315j3698j5095N762J0130k6058o180J9509L6767q454j172
$$ -19576 66549 77864 64166 49071 54833 64963 38905 32725 52234 89001 80547 79375
21472G9375k8172l4322j9467J5361L8204j1344j7583m1216m0403l421M416J8930
$$ 79375 51203 16881 -2586 12775 50979 39635 22052 -19164 -59567 -62988 -58572 -39642
21460c9642J8206n311l3670J3680L2508L0353K4441k2182m3588j9485P87L4840
$$ -39642 -21436 -26747 -60417 -46737 -14229 16124 40565 18383 -25205 -44690 -43903 -9063
21448i063J7009q997R599J2911L0007O820o3155m6041k7260J912j2129L3096L3021
$$ -9063 7946 -1051 8548 21459 51466 58286 -4869 -50910 -78170 -76258 -88387 -55291 -22270
21435b2270M1373J2864l072j3820l7676m2996P829N4648L1853k3658j6904J8404
$$ -22270 19103 31967 28895 15075 -22601 -65597 -57768 -3120 28733 5075 -11829 6575
21423F575K1485p598K697l6813j2510l611j4512J8935J8534j2342l98l534J7475
$$ 6575 28060 20462 23159 -13654 -26164 -29775 -44287 -25352 -6818 -19160 -19558 -23092 -5617
21410e617Q271L5153K2255l0765P121k1317k2391n741J6460J2998J1859l9484
$$ -5617 2654 37807 60062 29297 36418 15101 -7290 -13031 3429 16427 28286 -11198
21398a1198l6486Q231J3569j464M358N832J9317j5556j7193l943M463j1052K1211
$$ -11198 -47684 -39453 -25884 -27348 -22990 -17158 2159 -13397 -30590 -34533 -30070 -41122 -19911
21385a9911K4891r604k7278O73M957K3890J0127j6488j9726j447K5028M99m011
$$ -19911 4980 -4624 -31902 -31229 -26272 -2382 7745 -8743 -28469 -29916 -4888 -4389 -8400
21372h400J4509J720K4142J050Q951j1611k9160l5603j8647J2536L0363K6680
$$ -8400 6109 7829 31971 33021 41972 30361 1201 -34402 -53049 -40513 -10150 16530
21360A6530J1083p498k6663j0762K2192L6679M453l6691o536J4556j0139O665
$$ 16530 27613 20115 -6548 -17310 4882 41561 46014 9323 2787 17343 7204 13869
21348A3869j3803j1506j6871l1980L27K52K4225m6495j2425K9684K2864J2102
$$ 13869 66 -11440 -28311 -60291 -59964 -59712 -35487 -81982 -94407 -64723 -41859 -29757
21336b9757J2713j083l347q149j691k7957o679M4672M5547J9629k3938J468K2272
$$ -29757 -17044 -18127 -21474 -29623 -31314 -59271 -65950 -21278 24269 43898 19960 21428 43700
21323D3700j0648l8408k6064K8009J2358m3580m96K4765M6401L2672J3098Q392
$$ 43700 33052 -5356 -31420 -3411 8947 -34633 -35129 -10364 36037 68709 81807 90199
21311I0199k0740L4041N716l3583m5014q908N979k911M46P208j7329l036j379
$$ 90199 69459 103500 109216 75633 30619 21711 27690 24779 25225 32433 15104 12068 10689
21298A0689j4336R424p388R837Q324O036j5660Q559k0592j2638j9520L0031K9868
$$ 10689 -3647 5777 -1611 8226 16550 22586 6926 15485 -5107 -17745 -37265 -7234 22634
21285B2634O699j2727j8872l5883j308J7293k1755L1506L9217k274J4776k152
$$ 22634 29333 16606 -2266 -38149 -39457 -22164 -43919 -12413 26804 24530 39306 37154
21273C7154j4433k8861L3755k884n170m33M9238l4881l9412L9304L8872j1429
$$ 37154 22721 -6140 27615 24731 19561 19128 68366 33485 -5927 33377 72249 60820
21261F0820l5668k3534n052N347L4204K113k4322k3909k0278J7244K538N88L2708
$$ 60820 25152 1618 -3434 1913 36117 38230 13908 -10001 -30279 -13035 -10497 -9909 22799
21248B2799j4452l2599j497J7908K528r094M677L3078M362J61R678k8036j2336
$$ 22799 8347 -24252 -25749 -7841 -5313 -14407 -9730 23348 27710 27871 37549 9513 -2823
21235b823l6238J7815K5923k1599j0166K0162j9147k8313K2593M2118K2294j2945
$$ -2823 -39061 -21246 4677 -16922 -27088 -6926 -26073 -54386 -31793 10325 32619 19674
21223A9674K143J4509K826j0993j1448k7966j8003J1060M040J2780J2114l4440
$$ 19674 21817 36326 39152 28159 16711 -11255 -29258 -18198 -14158 -1378 10736 -23704
21211b3704r837P458P196K9952K1541j7244m393n149J9364j3349k1130L7258o695
$$ -23704 -33541 -26083 -18887 11065 32606 15362 10969 5820 25184 11835 -9295 27963 21268
21198B1268m6845j0677N17o49N724L7650n636l4784j1042K9926K6212j5273Q207
$$ 21268 -25577 -36254 -35737 -36386 -30662 6988 1352 -33432 -44474 -14548 11664 -3609 4598
21185D598K8829o1n112q198P293j2843L1848K6780J2122j8537j1641j6347l0075
$$ 4598 33427 33366 28254 20056 27349 14506 46354 73134 85256 66719 55078 38731 8656
21172H656J0360J7286j7967o688Q395J256k264J6917k4242j8834J0013J9930L771
$$ 8656 19016 36302 18335 11647 20042 21298 19034 35951 11709 -7125 2888 22818 26589
21159B6589L3418k2801k7967m1214k4714n592L9495M0946K8294r327j0868r032
$$ 26589 60007 37206 9239 -31975 -56689 -62281 -22786 18160 46454 37127 26259 17227
21147A7227l4903j9031J1169M5867J5189k3274o323j0900P949K0672j9251j1863
$$ 17227 -17676 -36707 -25538 20329 35518 12244 5921 -4979 2970 23642 4391 -7472
21135g472j0130J0500o888k245j4703k5060J2799J5317l486J6670M988K8320K6576
$$ -7472 -17602 -7102 -13990 -16235 -30938 -55998 -43199 -27882 -31368 -14698 -9710 18610 45186
21122D5186k8847j873k6675l8922m102K0345O560K6533K7048j7384r690J3251
$$ 45186 16339 14466 -12209 -51131 -55233 -34888 -28328 -1795 25253 7869 -1821 11430
21110A1430J7895J5902J3158m5183k9557l3037K7028M5271K4399l8304j3390J500
$$ 11430 29325 45227 58385 13202 -16355 -49392 -22364 22907 47306 9002 -4388 -2888
21098b888k072J7006K3758N469K7234n2467o7707o761K7934N1188L3258r407j1830
$$ -2888 -4960 12046 35804 41273 68507 16040 -51667 -58428 -30494 20694 53952 44545 32715
21085C2715j660j8888j4206n7855r092K0669K0077L4309K1091K2754j5612L843
$$ 32715 31055 12167 -2039 -59894 -68986 -48317 -28240 6069 27160 49914 34302 38145
21073C8145k8543j1411l351k5226k610P492q459j8537K3950O7654j1493j6930
$$ 38145 9602 -1809 -5160 -30386 -32996 -25504 -33963 -52500 -28550 39104 27611 10681
21061A0681k7445n5740l835K1627J0531N7943l764k6207L6511r240Q840L0271
$$ 10681 -16764 -72504 -76339 -54712 -44181 13762 9998 -16209 20302 11062 19902 50173
21049E0173K4501j7139O60n002j4602O126K1993J5143J9856R642j1367m860j4122
$$ 50173 74674 57535 58195 53193 38591 44717 66710 81853 101709 111351 99984 95124 81002
21036H1002j9154j2922J364J1772l9682o1455J4558K3488J7294K5140j8189n4380
$$ 81002 61848 48926 50290 62062 22380 -39075 -24517 -1029 16265 41405 23216 -31164
21024c1164k1598K1498M601L7381N6171J5328l4207j8781K12l8780k4508K3000
$$ -31164 -52762 -31264 -26663 10718 66889 82217 48010 29229 29441 -9339 -33847 -10847
21012a0847K3769j5245N218L510K502j3991j1655J0329Q273l1l0439K4995L6939
$$ -10847 12922 -2323 2895 6405 8907 -5084 -16739 -6410 1863 1832 -28607 -3612 33327
20999C3327n982k8471l9409M454K7382J4933k8222k6317K9986J2751l9291K8291
$$ 33327 27345 -1126 -40535 -36081 -8699 6234 -21988 -48305 -18319 -5568 -44859 -16568
20987a6568L4537J6317j1195p253J2878L356N955L0016j0228k9197k0489j9766
$$ -16568 17969 34286 23091 15838 28716 32072 38027 68043 57815 28618 8129 -11637
20975a1637n0815R637j3383j7531K4682j8220o755J8576O283j15J6231J8934k670
$$ -11637 -62452 -52815 -66198 -83729 -59047 -77267 -84022 -65446 -59163 -59278 -43047 -24113 -26783
20962b6783N1911J9574q011l1352l190K0649L2831j590J3776j832j1246k7545
$$ -26783 25128 44702 36691 5339 2149 22798 55629 54039 67815 65983 54737 27192
20950B7192J1562M6119J668k1785q515K593k425j6010L940j2814l002L2234J415
$$ 27192 38754 84873 86541 64756 56241 58834 56409 40399 44339 31525 28523 60757 62172
20937F2172j9901M4455K9771j8852j8568k6284j2796K5643n6k6762K4073L8639
$$ 62172 42271 86726 116497 97645 79077 52793 39997 65640 65584 38822 62895 101534
20925A01534L6082o7483m2557L3201j5489l3596o876J1341o335p381K0905R390
$$ 101534 137616 70133 27576 60777 45288 11692 4816 16157 9822 2441 23346 32736
20913C2736N338j0183n564r863n522k8369J0057J6806J449J3352Q307k6114L1390
$$ 32736 38074 27891 22327 12464 6942 -21427 -11370 5436 6885 20237 28544 2430 33820
20900C3820J5450j060O257Q839j0884q458l3525j9780j3009l1225J3132L0686
$$ 33820 49270 48210 54467 63306 52422 43964 10439 -9341 -22350 -53575 -40443 -9757
20888i757P849k7019k587N0462N067m0384J0683J3425L0633J5489k6148k1655
$$ -9757 -1908 -28927 -31514 18948 24015 -16369 -5686 7739 38372 53861 27713 6058
20876F058k694j2825j2928p023J1189l2361J6801N1441k660l1188m786L467J9414
$$ 6058 3364 -9461 -22389 -29412 -18223 -50584 -33783 17658 14998 -16190 -20976 -17509 1905
20863A905j1474K1907J3915j0200j6755J3890r987k4698m950J9718O246k8629
$$ 1905 -9569 12338 26253 16053 -702 13188 3201 -21497 -26447 -6729 -483 -29112
20851b9112K5966L5144k2054k9508K4222L1165j4906L866L0286L8504j914l6525
$$ -29112 -3146 31998 9944 -19564 4658 35823 20917 24783 55069 93573 91659 55134
20839E5134j39m7975L49K6019r725j693j2788K2173M1758j5799l4583l3957Q251
$$ 55134 54995 7020 7369 33388 23663 21970 9182 31355 73113 57314 22731 -11226 -2975
20826b975N8172k0690K626L0067J8654m102J0849l2138k9989j3525M2597J172
$$ -2975 55197 34507 37133 67200 85854 81752 92601 60463 30474 16949 59546 60718
20814F0718j8767N462J2557j6318k4788j0832j7202J0451J6350Q452l3613K435
$$ 60718 41951 47413 59970 43652 18864 8032 -9170 1281 17631 26083 -7530 -5095
20802e095J7784j1990P499J9215l1294n655l2998j9932K1171L8848p032m1401
$$ -5095 12689 699 8198 27413 -3881 -9536 -42534 -62466 -41295 -2447 -9479 -50880
20790e0880r076J7219K5796Q535M8324J8196r914O864P0746Q508k7848n2759J395
$$ -50880 -59956 -42737 -16941 -8406 39918 58114 48200 55064 125810 134318 106470 53711 55106
20777E5106j4914J6029N372k3483l0512j264M3636N1585l9816j1608J3189R52
$$ 55106 40192 56221 61593 38110 7598 6334 49970 101555 61739 50131 63320 64272
20765F4272j4289k7919J4685J016q175K0812j4104k0343k4882J9658J4471L5002
$$ 64272 49983 22064 36749 37765 29590 50402 36298 15955 -8927 10731 25202 60204
20753F0204j530j5896k2751l0816O353k0687j156J9233L2050J8076j1799J8438
$$ 60204 58674 42778 20027 -10789 -4436 -25123 -26279 -7046 25004 43080 31281 49719
20741D9719L4778k0711k6282j3199j1154l0123M4486K4621M372j5938m3609L6275
$$ 49719 84497 63786 37504 24305 13151 -16972 27514 52135 56507 40569 -3040 33235
20729C3235m983j1254K5434k9391k8716l29k2133m5024M2105L3976q792o901M1248
$$ 33235 28252 16998 42432 13041 -15675 -16004 -38137 -83161 -41056 -7080 -15872 -22773 18475
20716A8475J1786P473J638l4681O556K6551K0630k5419j657j0969j5718l101L4973
$$ 18475 30261 37734 39372 4691 11247 37798 58428 33009 31352 20383 4665 1564 36537
20703C6537j8991m436M232J13j4375j6582j920L3998J3211K4314J1820r570N717
$$ 36537 17546 13110 17342 17455 3080 -13502 -15422 18576 31787 56101 67921 58351 64068
20690F4068O546K6900k3263k4361O962j8069j2793K1129J4939k8649k4035l1115
$$ 64068 70614 97514 74251 49890 56852 38783 25990 47119 62058 33409 9374 -21741
20678b1741l3754Q056N5685J7263P711q676j975J401K8081K2013j8983R438m780
$$ -21741 -55495 -47439 8246 25509 33220 24544 22569 23970 52051 74064 55081 64519 59739
20665E9739j2022K7368k776L2572j5290l0448j5551L1509J0737l7107l7546l0351
$$ 59739 47717 75085 72309 104881 89591 59143 43592 75101 85838 48731 11185 -19166
20653a9166j3180J8282J4481j2733n746J457N5577L4693l8246j1372m0193M628
$$ -19166 -32346 -14064 417 -12316 -18062 -16605 38972 73665 35419 24047 -16146 -11518
20641a1518K5018L8079J6279l5790j4165M970k0394j9809K5881N0282J666K2973
$$ -11518 13500 51579 67858 32068 17903 22873 2479 -17330 8551 58833 60499 83472
20629H3472K724j1398q110L6304M867j4788k2177p395r418J3917j6826p4808l1874
$$ 83472 86196 74798 66688 102992 107859 93071 70894 63499 54081 67998 51172 -23636 -55510
20616e5510k5777J693N951J7347N0521P773J4439J6148j1931P080J3542j0797
$$ -55510 -81287 -79594 -73643 -56296 -5775 1998 16437 32585 20654 27734 41276 30479
20604C0479j5285J3403J9064P95l9163l3438K5558J4515q374k539Q97K1945L8946
$$ 30479 15194 28597 47661 48456 9293 -24145 1413 15928 7554 5015 5912 27857 66803
20591F6803M0552K6721k2194k1660k7821j6816J6491j7475o801p513l444j3885
$$ 66803 107355 134076 111882 90222 62401 45585 62076 44601 37800 30287 26843 12958
20579A2958K0753L2353j3495j4458J6477l2342l382L7933J6236J3483J006j4010
$$ 12958 33711 66064 52569 38111 54588 22246 18864 56797 73033 86516 87522 73512
20567G3512RK014r627j0820k3074k7757k3251J2487M8627L0291L8279l8570k7736
$$ 73512 73521 75535 65908 55088 32014 4257 -18994 -6507 42120 72411 110690 72120 44384
20554D4384J3284k5K726L984k1965o230j5802j3243n930l5913N013N448K9306
$$ 44384 57668 57643 60369 64353 42388 36158 20356 7113 1183 -34730 -29717 -24269 5037
20541E037L3341M2269r364k7603L5732J9658l0591k5128k5484j946L6885J9986
$$ 5037 38378 80647 71283 43680 79412 99070 68479 43351 17867 15921 52806 72792
20529G2792j4611l03J0387P70j5947k4998O170J6570K1468K6968J2870l3463p9048
$$ 72792 58181 57878 68265 69035 53088 28090 34260 50830 72298 99266 112136 78673 -375
20516c75k3195j6870K9556N22m987j2248M3753K1069k2209j0855J2396M7660J4863
$$ -375 -23570 -40440 -10884 -10362 -15349 -27597 16156 37225 15016 4161 16557 64217 79080
20503G9080l5607j3941L6649J2290j3024l9199j343J2852j6129L773Q614j9632
$$ 79080 43473 29532 66181 78471 65447 26248 24905 37757 21628 25401 34015 14383
20491A4383k8860N0210J7074m9021j7922K3620L0176P008K7731j5683k496k2165
$$ 14383 -14477 35733 52807 3786 -14136 9484 39660 46668 74399 58716 56220 34055
20479C4055J5812J5145K1978L276j4554Q581m599l755l379J6354j695K752l5129
$$ 34055 49867 65012 86990 90266 75712 84293 79694 75939 72560 88914 87219 89971 54842
20466E4842o944N49K2281L4590J0462j2694k7219m2449k771K3232P895n083J0527
$$ 54842 47898 48447 70728 105318 115780 103086 75867 33418 30647 53879 61774 56691 67218
20453F7218J9087j2623k0534L0184k1548r098r163J682j6500l6378J6739j327
$$ 67218 86305 73682 53148 83332 61784 52686 43523 45205 28705 -7673 9066 7739
20441G739j5294K492K1848m19j7289k8811k72K2702j0031J0693J7007L7693k7432
$$ 7739 -7555 -5063 16785 16366 -923 -29734 -30006 -7304 -17335 -6642 10365 48058 20626
20428B0626n2670L6437M2281L982J0962n578k1299m929k0543l5154j3181J4583
$$ 20626 -32044 4393 46674 50656 61618 56040 34741 29812 9269 -25885 -39066 -24483
20416b4483L9726K6446m100j9045j0035K6141q883j6443K7516j6100L373N717
$$ -24483 15243 41689 37589 18544 8509 34650 25767 9324 36840 20740 24113 29830
20404B9830Q824j2506L648J6572k2769J6309M3179K5045n1751l640J7423N512
$$ 29830 38654 26148 29796 46368 23599 39908 83087 108132 56381 52741 70164 75676
20392G5676m8007k6190K2444J4290M7276M2657k0627j4483j7916j8418J1699L11
$$ 75676 27669 1479 23923 38213 85489 128146 107519 93036 75120 56702 68401 68712
20380F8712K9008j429j0051k4227j3268j722K3729M7146L5091J9160k574l7122
$$ 68712 97720 96291 86240 62013 48745 47023 70752 117898 152989 172149 169575 132453
20368A32453m7894l4833k4169R036L724Q270l4544k9463k2330j6774M1807L6284
$$ 132453 84559 49726 25557 34593 38317 46587 12043 -17420 -39750 -56524 -14717 21567
20356B1567k0608j0751r799k0870k0697N1621M6149O845J9727J7283J5779N221
$$ 21567 959 -9792 -19591 -40461 -61158 -9537 36612 43457 63184 80467 96246 101467
20344A01467J959l3043k2965o711m033P409j0570j8937o702L1068P042l5700k4616
$$ 101467 103426 70383 47418 40707 36674 44083 33513 14576 7874 38942 45984 10284 -14332
20331a4332J8570J9400L7826J8582k1463J5805k0092R233J0697j5511l1456q308
$$ -14332 4238 23638 61464 80046 58583 74388 54296 63529 74226 58715 27259 18951
20319A8951K7691L5578k2504J6533L532j4159j2344k0236n3335m625M9739L3566
$$ 18951 46642 82220 59716 76249 79781 65622 53278 33042 -20293 -24918 24821 58387
20307E8387o969j0473k1222q882Q504L118k0005L758M5183L1627n5017l4106N993
$$ 58387 51418 40945 19723 10841 19345 22463 2458 6216 51399 83026 28009 -6097 -104
20294a04J0382L1147k3201K147M1201P100n948j2755L5562n854n6082l7350R827
$$ -104 10278 41425 18224 20371 61572 68672 62724 49969 85531 79677 23595 -13755 -3928
20281c928q65Q684L0105J0642k308O812K8672m0416n8925J9032J2252k0057K7807
$$ -3928 -4793 3891 33996 44638 42330 49142 77814 37398 -21527 -2495 9757 -10300 17507
20268A7507J7743j7347j5201n625J0074K175J3174L9715J3879k0371m1681k4097
$$ 17507 35250 17903 2702 -2923 7151 9326 22500 62215 76094 55723 14042 -10055
20256a0055K5090j8059m242Q454L100Q931L80k7016j5337L4925J2347K8545Q794
$$ -10055 15035 -3024 -7266 1188 4288 13219 13599 -13417 -28754 6171 18518 47063 55857
20243E5857J7463j1609j5621j383p132k1677K7832O0395j1895J5167q269q559
$$ 55857 73320 61711 46090 44707 37575 15898 43730 104125 92230 107397 99128 90569
20231I0569J5920k76J3155K4822j7397j1019k0312m3301M118k2380K4804K4936
$$ 90569 106489 106213 119368 144190 126793 115774 95462 52161 56279 33899 58703 83639
20219H3639j0687J839J4292l8166k2428M1181Q256j6561j7057n586P034j093l5275
$$ 83639 72952 74791 89083 50917 28489 69670 77926 61365 44308 38722 45756 44663 9388
20206I388m9006m2037R339j0979P982j0113M5812M9918L5644j563O093K0618l0845
$$ 9388 -39618 -81655 -72316 -83295 -75313 -85426 -39614 10304 45948 44385 50478 71096 40251
20193D0251r161J4388l3261J5615j9525j2177J010O62K508J1512J0261N0997J9532
$$ 40251 31090 45478 12217 27832 8307 -3870 -2860 -2198 310 11822 22083 73080 92612
20180I2612m1825k696o355j4330k9507j1645L1812K4643R698q812L297L4665J5816
$$ 92612 50787 48091 41736 27406 -2101 -13746 18066 42709 52407 43595 46892 81557 97373
20167I7373J35k5352j0324M839N635j1142l112R748j4077j2972J9535j4516N312
$$ 97373 97508 72156 61832 66671 72306 61164 58052 67800 53723 40751 60286 45770 51082
20154E1082M8930j1017o287j5022k5040j5291k850j5286J3724L470K1552J0228
$$ 51082 100012 88995 82708 67686 42646 27355 24505 9219 22943 26413 47965 58193
20142E8193m7703J0654N9547L10k1622j4920M966R160L2911q861j0039k093J1495
$$ 58193 10490 21144 80691 81001 59379 44459 49425 58585 91496 82635 72596 70503 81998
20129H1998j4878p322P29p498J1122p469k975j3011J3068J6330J6538M517J4066
$$ 81998 67120 59798 60527 53029 64151 56682 53707 40696 53764 70094 86632 91149 105215
20116A05215k6968l2273R734j8094K7540J9929J1901j7915m9704k8112O947J7159
$$ 105215 78247 45974 55708 37614 65154 85083 96984 79069 29365 1253 8200 25359
20104B5359k0148j7407R063K4206L070L1217p463m2468L338K1220N79J2459L070
$$ 25359 5211 -12196 -3133 21073 24143 55360 47897 5429 8767 29987 30566 43025 46095
20091D6095M512J1287N101l3582j5914K4155L3459M7339n428k5766L884J176p699
$$ 46095 50607 61894 66995 33413 17499 41654 75113 122452 117024 91258 95142 96318 88619
20078H8619k4024k6759n04K2878l730R373Q532j0329J579J6963j160j1899L0250
$$ 88619 64595 37836 37332 60210 56480 65853 74385 64056 65635 82598 81438 69539 99789
20065I9789N985k3696K668l0364j2820L8399j5263j4885k2638J5098J8593K4195
$$ 99789 105774 82078 84746 54382 41562 79961 64698 49813 27175 42273 60866 85061
20053H5061L1016K3456m5499k0238J116L0882l456M441l9911k9066l0521j584
$$ 85061 116077 139533 94034 73796 74912 105794 102338 106779 66868 37802 7281 5697
20041E697k19K4185J4661K947R042M8500J7471j0816j2283m4562j8650j9183J0589
$$ 5697 5478 29663 44324 47271 56313 104813 122284 111468 99185 54623 35973 16790 27379
20028B7379L6962K2383K3121K489j9883k6566L5199j2097j3452k2702q501l441
$$ 27379 64341 86724 109845 112334 92451 65885 101084 88987 75535 52833 44332 40891
20016D0891J6149J2341k511j4764j2408m1250K0784L4748J4179o970j7770J9555
$$ 40891 57040 69381 66870 52106 39698 -1552 19232 53980 68159 61189 43419 62974
20004F2974K6251l1610J2777k9421P223L3371K7189k4065l9557k5931K9656J3029
$$ 62974 89225 57615 70392 40971 48194 81565 108754 84689 45132 19201 48857 61886
19992F1886j2535J8360L0042k9578m5676J7383P306K0450k6579P371q481P852
$$ 61886 49351 67711 97753 68175 22499 39882 47188 67638 41059 48430 39949 47801
19980D7801K034j944l2957O6388N5169k4637J092j5937k5865j4338P219j2924
$$ 47801 49835 47891 14934 81322 136491 111854 112946 97009 71144 56806 64025 51101
19968E1101j261l4150J3716j4092Q423K0036M8114J7089l3862k6417K2214Q625
$$ 51101 49840 15690 29406 15314 23737 43773 91887 108976 75114 48697 70911 79536
19956G9536J1630j9941q982R222J0478M308K990J3335K5939j5617o7221k6793
$$ 79536 91166 71225 62243 71465 81943 86251 89241 102576 128515 112898 45677 18884
19944A8884L0417K0692j8730M9894j827k7797j6458J9046J9752J2634l5125m4523
$$ 18884 49301 69993 51263 101157 99330 71533 55075 74121 93873 106507 71382 26859
19932B6859m316l680J5779J5828M2778K6284k4708N68L5190N023k2778k3864j8807
$$ 26859 22543 18863 34642 50470 93248 119532 94824 95392 130582 135605 112827 88963 70156
19919G0156k216M738j2004K5920K5240p255N06j0280k2712j0901j8851j11L5261
$$ 70156 67940 72678 60674 86594 111834 104579 105085 94805 72093 61192 42341 42230 77491
19906G7491J2423J6468p740J4956J2772K92M119J9406J0190j6300N069k4839j3149
$$ 77491 89914 106382 98642 113598 126370 126662 130781 150187 160377 144077 149146 124307 111158
19893A11158m0298q859J0886M0335q315j5107J321N215k8586M981k629J1668N897
$$ 111158 70860 62001 72887 113222 104907 89800 91121 96336 67750 72731 70102 81770 87667
19880H7667j1191J2209j5962K4987L3355j3171j3815J0248j7730k1230K8715N0292
$$ 87667 76476 88685 72723 97710 131065 117894 104079 114327 96597 75367 104082 154374
19868A54374L466m3342l3428K9842L6522k9534L4993L2277j6233m1057j695k0361
$$ 154374 157840 114498 81070 110912 147434 117900 152893 185170 168937 127880 126185 105824
19856A05824l4327J1762Q011j9361n65l0746L5532O0919J8747o8153l1205L3353
$$ 105824 71497 83259 91270 71909 71344 40598 76130 137049 155796 87643 56438 89791
19844H9791m420l2470M530K2479R374n032j6628M166j41k1429N46J2388J3703
$$ 89791 85371 52901 57431 79910 89284 84252 67624 71790 71649 50220 50766 63154 76857
19831G6857J2539J0236n800p080j6006r738qR161K0170p140Q135M879J5730j47
$$ 76857 89396 99632 93832 86752 70746 61008 61000 70161 90331 83191 91326 96205 111935 111788
19817A11788J2885k573m957j1777k7566L7959M3479K3202l2549l8452j5211K3945
$$ 111788 124673 122100 117143 105366 77800 115759 159238 182440 149891 111439 96228 120173
19805A20173j6940J8521L9159K7921j1392K4355j792o082L1639N7301M7634P2157
$$ 120173 103233 121754 160913 188834 177442 201797 200005 193923 225562 282863 330497 402654
19793D02654J22470J23843J14565O0227P1275O8464N6316k4564r8996j05867q6940
$$ 402654 525124 648967 763532 823759 895034 963498 1019814 995250 896254 790387 703447
19782G03447n9686K955J7940J55081K53508J40834n7931r3047j66043k00422j57705
$$ 703447 643761 646716 664656 819737 1073245 1214079 1156148 1063101 897058 696636 538931
19771E38931q1510m3461k6335m4325n9553j639J0504j9052l7190k2090j4435p119
$$ 538931 457421 413960 387625 343300 283747 282108 292612 273560 236370 214280 199845 192726
19759A92726j0683K8914K0287l2250l3684K9726L1062M6997N6864J8592O8162
$$ 192726 182043 210957 231244 198994 165310 195036 226098 273095 329959 348551 416713
19748D16713P4902P6160Q9713N7488L7023L7310n0654m8870L2720K6602P6307
$$ 416713 491615 567775 657488 714976 751999 789309 738655 689785 722505 749107 825414
19737H25414J02420L9604K190K3940M4683O8855J7990k9748O600J1849l5822j04397
$$ 825414 927834 967438 969628 993568 1038251 1107106 1125096 1095348 1101948 1113797 1077975 973578
19725I73578j50391j65277j23038p0100o0595m0008k3070n1534p3845l8285j8459
$$ 973578 823187 657910 534872 464772 404177 364169 341099 289565 215720 177435 158976
19714A58976r689j1963J8294M632r087N918q406k363K84r042j7947J6727J836
$$ 158976 149287 137324 155618 160250 151163 157081 148675 146312 146596 137554 119607 136334 138170
19701A38170J6574p727l9846M360K0822K5589L4619P490J5038J0359m7075J8141
$$ 138170 154744 147017 107171 111531 132353 157942 192561 200051 215089 225448 178373 196514
19689A96514M2673k895J4426o016K7014J9268j6679k9564R420r277j3580M402
$$ 196514 239187 236292 250718 244702 271716 290984 274305 244741 254161 244884 231304 235706
19677B35706K9630N876j9469k2429J1556L3262N4954R3759R8625M8374J6092M4670
$$ 235706 265336 271212 251743 229314 240870 274132 329086 422845 521470 569844 585936 630606
19665F30606N3402J1667k4946o3272r1940o6684p3993p9631j1634K4237q743J4916
$$ 630606 684008 695675 670729 607457 515517 448833 374840 295209 283575 307812 299069 313985
19653C13985L8134P8995J00609R364l0121m3042m7555l3532j0236J3653Q7744
$$ 313985 352119 431114 531723 541087 510966 467924 420369 386837 376601 390254 477998
19642D77998M7167L792k3417k4392k6484K141L1412N6350J0373l0914r3287q6001
$$ 477998 525165 528957 505540 481148 454664 456805 488217 544567 554940 524026 430739 344738
19630C44738o1999k6720j6114j859J1520m732j2627K2705Q059M8843Q0637M9765
$$ 344738 282739 256019 239905 238046 249566 244834 232207 254912 262971 311814 392451 442216
19618D42216O2590O7364J2368l8068l0817j2587n8980k6762M4328J01676Q1542
$$ 442216 504806 572170 584538 546470 515653 503066 444086 417324 461652 563328 644870
19607F44870M8461N8264K2274K4496J4577o8528r4295p7202r3306r0767o4805
$$ 644870 693331 751595 773869 798365 812942 744414 650119 572917 479611 388844 324039
19596C24039m8307l153q739j5531k2859L40n705N0800P1097J6402l6234k0843
$$ 324039 275732 272579 263840 248309 225450 225790 220085 270885 341982 358384 322150 301307
19584C01307n954n8462m0407o415K0309q176j9683J0369L4152J1970L7109l6916
$$ 301307 295353 236891 196484 190069 210378 202202 182519 192888 227040 239010 276119 239203
19572B39203j9528l2490J0051K7817k8577j1587R890n737n875k2295N491L8958
$$ 239203 219675 187185 197236 225053 196476 184889 194779 189042 183167 160872 166363 205321
19560B05321j7179L983k4683K722L461p777J5708K1392K7580j3073l6810m1372
$$ 205321 188142 192125 167442 170164 173625 165848 181556 202948 230528 217455 180645 139273
19548A39273j5684J7937R252M0848J0560K5427J5550K4277j1550M026L041k089
$$ 139273 123589 141526 150778 191626 202186 227613 243163 267440 255890 259916 262957 260868
19536B60868J8220p018j8642j0748K6576m881K2112M5010O876O161J4446O3182
$$ 260868 279088 272070 253428 242680 269256 264375 286487 331497 338373 344534 358980 422162
19524D22162L0992j1214k1923O512r15N372j9868l6311r508j6372K3926n191o809
$$ 422162 453154 441940 420017 426529 425614 430986 411118 374807 365299 348927 372853 367662 360853
19511C60853l632l9951n5624j0295J8036J6584j057O420j8484K4313K4116J4P212
$$ 360853 357221 317270 261646 251351 269387 285971 284914 291334 272850 297163 321279 321293 328505
19498C28505j5440m553P1295O1824O1193J10920R4169J56294J25755O7531L1020
$$ 328505 313065 308512 379807 441631 502824 613744 707913 864207 989962 1057493 1088513
19487A088513P8701Q2899J3182l0619m0411L0416K7429o5723q8810o623L7058
$$ 1088513 1167214 1250113 1263295 1232676 1192265 1222681 1250110 1184387 1095577 1088954 1126012
19476A126012J3252l0435j02192r3856o6972o9507j06144q4493n3003N001K8651
$$ 1126012 1139264 1108829 1006637 912781 845809 776302 670158 585665 532662 537663 566314
19465E66314k8170k9450o056M003r010O404p906o6991k8730J2882L3645l6637
$$ 566314 538144 508694 502638 506641 497631 504035 496129 429138 400408 413290 446935 410298
19453D10298j9784L8216L7511Q564n491j9537o31J2005M9740O1527O1694Q9288
$$ 410298 390514 428730 466241 474805 469314 449777 449146 461151 510891 572418 634112 723400
19441G23400J43603J57375J21915J48493R1333k3554j06979n4812j6570K9046
$$ 723400 867003 1024378 1146293 1294786 1386119 1362565 1255586 1200774 1184204 1213250
19431A213250J7457q332k825O5432N189j00898j71627j44770j08185j08751q9151
$$ 1213250 1230707 1222375 1219550 1284982 1290171 1189273 1017646 872876 764691 655940 566789
19420E66789o4403j8691K2808o239n0976n343o213j6385K2494K2172m8489o0860
$$ 566789 502386 483695 506503 500264 449288 443945 437732 421347 443841 466013 417524 356664
19408C56664J8051m0364L2252O79k9828l3840l7422m6827j3723M9434N1183n858
$$ 356664 374715 334351 366603 367282 337454 303614 266192 219365 205642 255076 306259 300401
19396C00401J0572K7826O805j0086L0739K8299j1711J446M3292J6463M9842J7526
$$ 300401 310973 338799 345604 335518 366257 394556 382845 384291 427583 444046 493888 511414
19384E11414L1413m7133m903N3911j8291k4849k2418k7610J6743L4961k9810l9876
$$ 511414 542827 495694 490791 544702 526411 501562 479144 451534 468277 503238 473428 433552
19372D33552J304L9103K3036L9007J09568R3834O5517K7407K5248l5354n8629
$$ 433552 434856 473959 496995 536002 645570 739404 804921 832328 857576 822222 763593
19361G63593q2844k9115L3114K1495j6118m4478l5518k6246N681N0211N8539J7871
$$ 763593 680749 651634 684748 706243 690125 645647 610129 583883 589564 639775 698314 716185
19349G16185j9941P057N2552K5814l684N4053L9468J6420Q199o227M5156O7291
$$ 716185 696244 703301 755853 781667 777983 832036 871504 887924 896123 889896 935052 1002343
19337A002343J29170J82828K01786K60882L57723L62312J03755r0340k17180k76740
$$ 1002343 1131513 1314341 1516127 1777009 2134732 2497044 2600799 2510459 2293279 2016539
19327B016539k14269j91998j62879j9016J5196J38k2644n2579n2823o140J0923
$$ 2016539 1802270 1610272 1447393 1428377 1443573 1443711 1421067 1368488 1315665 1309525 1320448
19316A320448K3702L7585O1582Q5408O2021J22387R8897R2349P8597M4128P3161
$$ 1320448 1344150 1381735 1443317 1528725 1590746 1713133 1812030 1904379 1982976 2027104 2100265
19305B100265J12307J37310J36573J76325K75618K95723L14766L03225L51040
$$ 2100265 2212572 2349882 2486455 2662780 2938398 3234121 3548887 3852112 4203152
19296D203152M68559M56819L63649L95273M89846M27792K90434L89446N83425
$$ 4203152 4671711 5128530 5492179 5887452 6377298 6805090 7095524 7484970 8068395
19287H068395O49992P98581J011240J272726J603801K086305K821848L794183
$$ 8068395 8718387 9516968 10528208 11800934 13404735 15491040 18312888 22107071
19279B2107071N200909P471619J1471570J8417999K6867812K7748031J5481106
$$ 22107071 27307980 34779599 46251169 64669168 91536980 119285011 134766117
19272A34766117R629654J3653950J1637990m130482j4392575j2167550p306758
$$ 134766117 144395771 158049721 169687711 165557229 151164654 138997104 131690346
19265A31690346J188760J4732593K3583131J8591150P555515j0963684k5389588
$$ 131690346 132879106 147611699 171194830 189785980 197341495 186377811 160988223
19258A60988223k9104081k8854432k5865283k0248871j4184148r579516o623078
$$ 160988223 131884142 103029710 77164427 56915556 42731408 33151892 26528814
19251B6528814m685065l245957k247987j543535j107695o84248k90480m1737J57583
$$ 26528814 21843749 18597792 16349805 14806270 13698575 13014327 12723847 12682110 12839693
19242A2839693K35163K84440L28096L23086M09996O77294R42690J126057J507477
$$ 12839693 13074856 13359296 13687392 14010478 14420474 15097768 16040458 17166515 18673992
19233A8673992K027050K621453L655517N394369Q509245J4126420K2821009K9958952
$$ 18673992 20701042 23322495 26978012 32372381 40881626 55008046 77829055 107788007
19225A07788007K1681568L694649j369586J015025P021750J6536459J5691407
$$ 107788007 129469575 133164224 131794638 132809663 139831413 156367872 172059279
19218A72059279J333432j006135O585566J1914463N698567m863354j294579M979481
$$ 172059279 173392711 172386576 178972142 190886605 196585172 191721818 190427239 195406720
19210A95406720l554692k1928559k7216251k5504144k5014165k2547133j7616252
$$ 195406720 191852028 169923469 142707218 117203074 92188909 69641776 52025524
19203E2025524j2630115q920501o448161m778073l407819k379402j709177j367384
$$ 52025524 39395409 30474908 24026747 19248674 15840855 13461453 11752276 10384892
19195A0384892j038842o88988m65847m30211m18267k80014k35221l98071m44715
$$ 10384892 9346050 8657062 8191215 7761004 7342737 7062723 6827502 6429431 5984716
19186E984716l76958l86378l75586m52648m63102l77817l17507k49005j59590
$$ 5984716 5607758 5221380 4845794 4393146 3930044 3552227 3234720 2985715 2826125
19177B826125r1733j7033M6791j0581p6639Q678P7317J66542L33271M79130M59635
$$ 2826125 2734392 2717359 2764150 2753569 2676930 2685608 2762925 2929467 3262738 3741868 4201503
19166D201503K03843J10211J50221L38691M58239K63924J69985M02614P50643
$$ 4201503 4405346 4515557 4665778 5004469 5462708 5726632 5896617 6299231 7049874
19157G049874O64417J13781k20145k82975n51819r46741j035005q77764p39774
$$ 7049874 7714291 7828072 7607927 7324952 6773133 5826392 4791387 3913623 3173849
19148C173849o29141m53867k51416j73148j34133m9050o8544r2521p4692m1755
$$ 3173849 2544708 2090841 1839425 1666277 1532144 1483094 1414550 1322029 1247337 1205582
19138A205582o2169j6155K6021J5333j5372q9340p2710k5609l2136p7489r5117
$$ 1205582 1143413 1127258 1153279 1168612 1153240 1063900 991190 965581 933445 855956 760839
19127G60839l9049l8389o1421m9347m9210L1904L4624M3717J0849P978M1610J30146
$$ 760839 721790 683401 621980 572633 523423 555327 589951 633668 644517 652495 694105 824251
19115H24251K10969J43871P8405l8354j12453q8941j09937j19681q0897o5355
$$ 824251 1035220 1179091 1257496 1219142 1106689 1017748 907811 788130 707233 641878
19105F41878m2178J227p940j0416N767M5348N95j794L9832M3819J4892J597L068
$$ 641878 599700 600927 592987 582571 588338 633686 634281 632487 672319 716138 731030 732627 735695
19092G35695L6297N1348J2407J8559J2435K2509M8878R752k7672K966j6695O1346
$$ 735695 771992 823340 835747 854306 866741 889250 938128 947880 920208 923174 906479 967825
19080I67825L1560l3786o3567n905k8397l7643m680k1820p1116j4150M4831L5132
$$ 967825 999385 965599 902032 896127 867730 830087 825407 803587 732471 718321 763152 798284
19068G98284M5580K7422J0159l215n2905j7876M986k8397J6539O549k7000J605
$$ 798284 843864 871286 881445 878230 825325 807449 812435 784038 800577 807126 780126 781731
19056G81731k3992j390M4910n352m2769m7349m3712j0717J0707N7447O9913P4186
$$ 781731 757739 756349 801259 795907 753138 705789 662077 651360 662067 719514 789427 863613
19044H63613R9732N9708k8798m5610o5467m5243L3408R7328M5975J8856L6942
$$ 863613 963345 1023053 994255 948645 883178 837935 871343 968671 1014646 1033502 1070444
19033A070444N8715N4321J0808m763M2470Q0135J36162K60740L48032L06667P8440
$$ 1070444 1129159 1183480 1194288 1189525 1231995 1312130 1448292 1709032 2057064 2363731 2442171
19022B442171j27625j68543k10707j73437j51871l7252J7818K1061j2891k6649
$$ 2442171 2314546 2146003 1935296 1761859 1609988 1572736 1590554 1611615 1598724 1572075
19012A572075k9488j8849J3555P9994O5520P3064P0193R6940O6897J03963O1767
$$ 1572075 1542587 1523738 1537293 1617287 1682807 1755871 1826064 1923004 1989901 2093864 2155631
19001B155631R7148J59053J76634K11523K19252K35249K58210K69407M00038M70793
$$ 2155631 2252779 2411832 2588466 2799989 3019241 3254490 3512700 3782107 4182145 4652938
18991D652938M73517M55908N10385N02579M46305M00023N75914P72739R14539
$$ 4652938 5126455 5582363 6092748 6595327 7041632 7441655 8017569 8790308 9704847
18982I704847R98222J188099J508269J955126K594387L374690M467003O312665
$$ 9704847 10703069 11891168 13399437 15354563 17948950 21323640 25790643 32103308
18974C2103308R769290J6010723K4630165K8745944J8769727R237600J1907033
$$ 32103308 41872598 57883321 82513486 111259430 130029157 139266757 151173790
18967A51173790J3380582J288255j1153412q731809k43832P230809M303945r513933
$$ 151173790 164554372 165842627 154689215 145957406 145713574 152944383 157248328 147734395
18959A47734395j3070812r054664l730313M324708N482591q085373j6387000j6717626
$$ 147734395 134663583 125608919 121878606 126203314 131685905 123600532 107213532 90495906
18951I0495906j7624064j7303544j3940791r629318o267387m104545k950239k165875
$$ 90495906 72871842 55568298 41627507 31998189 25730802 21626257 18676018 16510143
18943A6510143j374841p79798l56786l8872K26561L00024J97183K77828N95489
$$ 16510143 15135302 14355504 13998718 13959846 14186407 14486431 14683614 14961442 15556931
18934A5556931J026091J484104J829919J985812K257854K777006L483253M448434
$$ 15556931 16583022 18067126 19897045 21882857 24140711 26917717 30400970 34849404
18926C4849404O228303R483407J5230407K4872260L6962671M1932776L1663606
$$ 34849404 41077707 50561114 65791521 90663781 127626452 169559228 201222834
18919B01222834J6998059l147624j8978302k2796092j9721311j0406851M860955
$$ 201222834 218220893 215073269 196094967 173298875 153577564 143170713 148031668
18912A48031668J7560071J2695768J221057L516750P317693m412522k2934804
$$ 148031668 165591739 178287507 179508564 183025314 190343007 185930485 162995681
18905A62995681k7122243k5113030k4479420k1884100j6984468j1949322q288205
$$ 162995681 135873438 110760408 86280988 64396888 47412420 35463098 27174893
18898B7174893n856948m178170l011047k122514j478184j094488p64411m97367
$$ 27174893 21317945 17139775 14128728 12006214 10528030 9433542 8669131 8171764
18890H171764l81941k95677k65502j74567j76105j89434q9507J90333M50368M51994
$$ 8171764 7789823 7494146 7228644 7054077 6877972 6688538 6599031 6789364 7239732 7691726
18880G691726L57720K72931j16672n67712o31823m32424j53230J41761K03981
$$ 7691726 8049446 8322377 8205705 7637993 7006170 6573746 6420516 6562277 6766258
18871F766258j28116k22706j43323l07454o55712p73599o69124n48524m96602
$$ 6766258 6638142 6415436 6272113 5964659 5308947 4535348 3866224 3317700 2821098
18862B821098m34710k91607j44299q6840j21065q6709k0949P8851J09671K47923
$$ 2821098 2386388 2094781 1950482 1863642 1742577 1655868 1634919 1713770 1823441 2071364
18852B071364M47657O28369N31649R2387k47950l38528m33661m79694m15404k54060
$$ 2071364 2519021 3147390 3679039 3771426 3523476 3184948 2751287 2271593 1856189 1602129
18842A602129j25060p7117k4426m311L3761J13149J78869J40364J5552m8943o4727
$$ 1602129 1477069 1399952 1375526 1371215 1404976 1518125 1696994 1837358 1852910 1803967 1739240
18831A739240p8100j2768J29179J20980L5568p6133j54625k15839j92493j20391
$$ 1739240 1661140 1648372 1777551 1898531 1934099 1857966 1703341 1487502 1295009 1174618
18821A174618r6851o8206n1177K1036O6386J20063J20825M299p1585r6701j35823
$$ 1174618 1077767 1009561 958384 979420 1045806 1165869 1286694 1290993 1219408 1122707 986884
18810I86884j25734r3900q0363l4472K17j8689l5385j6484L1375k1110m094l4098
$$ 986884 861150 767250 686887 652415 652632 633943 598558 582074 613449 592339 588245 554147
18798E54147n5897L3604O4534N2118R6511J06791O0844L2195R389J0280J644N3854
$$ 554147 498250 531854 596388 648506 745017 851808 912652 944847 954236 964516 966160 1020014
18786A020014O6270O9203N4775O9217J3077n7857j0563l9111k0213P223j985o3229
$$ 1020014 1086284 1155487 1210262 1279479 1292556 1234699 1224136 1185025 1164812 1172035 1170050 1106821
18774A106821q6741n8148n4129n2603k4795j8847J8916M8235O5793L7855L7150
$$ 1106821 1020080 961932 907803 855200 830405 811558 830474 878709 944502 982357 1019507
18763A019507M8280Q6599J48180N8526J3444o8875p7487k5876J4385J12652J94699
$$ 1019507 1067787 1154386 1302566 1361092 1374536 1305661 1228174 1202298 1216683 1329335 1524034
18752A524034K76637K10069Q9337M6216P6825J3720n5738j19131j24670r4009
$$ 1524034 1800671 2010740 2100077 2146293 2223118 2236838 2181100 2061969 1937299 1843290
18742A843290p2802r8844k0995r8437j51453j30245j33679j19176j21369q1389
$$ 1843290 1770488 1671644 1650649 1552212 1400759 1270514 1136835 1017659 896290 814901
18732H14901m2354J9281O2773O6300J54306K23623J61132J21729R9105o2192k01297
$$ 814901 772547 791828 854601 920901 1075207 1298830 1459962 1581691 1680796 1618604 1417307
18721A417307k17332j81897j41526j64244j34448n2543m9394j5290J522J3374
$$ 1417307 1199975 1018078 876552 712308 577860 525317 475923 460633 462155 475529
18711D75529K7355M9343N1279Q7977J31252K22736K33336J77809J80017J58738
$$ 475529 502884 552227 603506 691483 822735 1045471 1278807 1456616 1636633 1795371
18701A795371J11620J28363J11961M1808q123o0233r5326o146Q9566J45917K6713
$$ 1795371 1906991 2035354 2147315 2189123 2181000 2120767 2025441 2019295 2108861 2254778 2281491
18690B281491r0257p3111j43825k21041k60458k02728k01751k09380j24496n7582
$$ 2281491 2191234 2118123 1974298 1753257 1492799 1290071 1088320 878940 754444 696862
18680F96862j2050q980k5361m6642k7208Q359j3222J6804j0863J9040k90k2149
$$ 696862 684812 675832 650471 603829 576621 584980 571758 588562 577699 596739 596449 574300
18668E74300j8386m5354l3152j5440j3396k0563k4370m110K1383M4743R74k424
$$ 574300 555914 510560 477408 461968 448572 428009 403639 399529 420912 465655 466629 464205
18656D64205J4092l94m0764o0017l0123k9048j3873q458L4242n290J8613K5592
$$ 464205 478297 477903 437139 377122 346999 317951 304078 295620 329862 324572 343185 368777
18644C68777k2958J2979Q420J5123L2453J7341J3680M0979k1903j931J9859j082
$$ 368777 345819 358798 367218 382341 414794 432135 445815 486794 464891 462960 482819 481737
18632D81737J1907K926R129L536k6551j8387j5149Q092K3168K6738J19867N8717
$$ 481737 493644 496570 505699 509235 482684 464297 449148 457240 480408 507146 627013 685730
18620F85730j1888k4676K9214k7310l9440m641j8124J9799K3513k3564k2296m6484
$$ 685730 673842 649166 678380 651070 611630 606989 588865 608664 632177 608613 586317 539833
18608E39833l2488m4408o7957m5934j8882Q048n780O877l66l0538j2565k2273
$$ 539833 507345 462937 394980 349046 330164 338212 332432 339309 338943 308405 295840 273567
18596B73567J9372o910M1116L7505L4229N4211l755l4133j1054J7878m2j9870
$$ 273567 292939 286029 327145 364650 398879 453090 449335 415202 404148 422026 421984 402114
18584D02114J3229L0143O428K2795M1622K6807k6003q163n632j5147K2568N2052
$$ 402114 415343 445486 451914 474709 516331 543138 517135 508972 503340 488193 510761 562813
18572E62813J3659r547q318j4223L521k2680j5704M4853L0804m0825k3555p596
$$ 562813 576472 566925 558607 544384 547905 525225 509521 554374 585178 544353 520798 513202
18560E13202k4983j6162J6279m2621r224R9785J03588P0130q164o9719l4756j5478
$$ 513202 488219 472057 488336 445715 436491 536276 639864 709994 701830 632111 597355 581877
18548E81877j0541K1459L8462R4149O2484r132l1542j2742Q195L3605J1817j8885
$$ 581877 571336 592795 631257 725406 787890 778758 747216 734474 742669 776274 788091 769206
18536G69206j1293M218j1179p3501k3777Q557J8706K2560O4241M3393M7438P5671
$$ 769206 757913 762131 750952 677451 653674 662231 680937 703497 767738 811131 858569 934240
18524I34240l28l6224L1482N7670L0503M6528L3775N6991O0988O6653M1766K1827
$$ 934240 933912 897688 929170 986840 1017343 1063871 1097646 1154637 1215625 1282278 1324044 1345871
18512A345871K7011N0261O2182Q6139J28930K22054L00112K40295K25174K83196
$$ 1345871 1372882 1423143 1485325 1571464 1700394 1922448 2222560 2462855 2688029 2971225
18502B971225L51784L26534J80646k1734l2070j6293k8988J48397L93597M94463
$$ 2971225 3323009 3649543 3830189 3808455 3776385 3760092 3731104 3879501 4273098 4767561
18492D767561M88284K60193K2592J9543Q4997J69073L71394N85654R30771J312328
$$ 4767561 5255845 5516038 5538630 5558173 5643170 5812243 6183637 6769291 7700062 9012390
18482I012390J750013K517618L807907N896740R661605J4636053J5770120O339730
$$ 9012390 10762403 13280021 17087928 22984668 32646273 47282326 63052446 69392176
18474F9392176l010205n377630o391702o280201l223836K575341J0230913J6345929
$$ 69392176 66381971 61004341 54612639 48332438 45108602 47683943 57914856 74260785
18466G4260785J1399880k720505r011382j0643103j2391713j1930887r220335
$$ 74260785 85660665 82940160 73928778 63285675 50893962 38963075 29742740
18459B9742740o272588m081687k480736j360313o91606m87016o67129n62340m37872
$$ 29742740 23470152 19388465 16907729 15547416 14855810 14368794 13701665 13139325 12701453
18450A2701453m17996k68733J28897N56197Q05944P12510M65729M85469O49086
$$ 12701453 12283457 12014724 12143621 12699818 13505762 14218272 14684001 15169470 15818556
18441A5818556Q48640J079639J422685K108384L042902M322473O250314R073767
$$ 15818556 16667196 17746835 19169520 21277904 24320806 28643279 34893593 43967360
18433D3967360J3842361K2318346L4930603M3596988K9829466M408374q058438
$$ 43967360 57809721 80128067 115058670 158655658 188485124 192893498 184835060
18426A84835060j6873647k1602816j8043300q057080O589933K1592835K3191185
$$ 184835060 167961413 146358597 128315297 120258217 126848150 148440985 171632170
18419A71632170L804498q892037q365526r460899j7562309k2924401k0251258
$$ 171632170 175436668 166544631 158179105 148718206 131155897 108231496 87980238
18412H7980238j7084337j5035431j2243790q989121o171092m050006k398862j409082
$$ 87980238 70895901 55860470 43616680 34627559 28456467 24406461 22007599 20598517
18404B0598517r70843q02360m44598l4857n1173k86459j55124K74383P20443R67654
$$ 20598517 19627674 18825314 18380716 18345859 18294686 18008227 17853103 18127486 18847929 19815583
18394A9815583R27906O85733O76756J040898J591045K371232L483937M996090
$$ 19815583 20743489 21429222 22105978 23146876 24737921 27109153 30593090 35589180
18386C5589180P006829J0512159J6795040K7325569L9854597L9686108J3258298
$$ 35589180 42596009 53108168 69903208 97228777 137083374 176769482 190027780
18379A90027780r753641j5991246j9316089j9539681j3069573k114322J1029939
$$ 190027780 180274139 164282893 144966804 125427123 112357550 110243228 121273167
18372A21273167K7961179N1261336O8902760M6463249n717052k9640155l6473523
$$ 121273167 149234346 200495682 269398442 315861691 310144639 280504484 244030961
18365B44030961m2394671l9682393k8008567j3046207L260038K1405678L4875201
$$ 244030961 201636290 161953897 133945330 120899123 124159161 145564839 180440040
18358A80440040K3346409p412706k1824666k5785555k9785149k9052577k3227819
$$ 180440040 203786449 196373743 174549077 148763522 118978373 89925796 66697977
18351F6697977j6394511j1217056p739432n389554l713501k431825j524606q97560
$$ 66697977 50303466 39086410 31346978 25957424 22243923 19812098 18287492 17389932
18343A7389932n13631l54404m01384n62040m47210k01892J27720L95060N76581
$$ 17389932 16876301 16521897 16120513 15558473 15111263 14909371 15037091 15432151 16008732
18334A6008732O71907Q43436J168135J634571K359278L361996M802864O765104
$$ 16008732 16680639 17524075 18692210 20326781 22686059 26048055 30850919 37616023
18326C7616023J0000414J5675578K2884118K5416904K0490776K1988133K4732093
$$ 37616023 47616437 63292015 86176133 111593037 132083813 154071946 178804039
18319A78804039Q101037j2864844j7433191j6175223j3262568l981228J1387481
$$ 178804039 186905076 174040232 156607041 140431818 127169250 123188022 134575503
18312A34575503K5596093K5469022M409434j7653066k4649036k7516184k8554339
$$ 134575503 160171596 185640618 190050052 172396986 147747950 120231766 91677427
18305I1677427k4634950j8051146j2227862q263535n688816l942189k761598j952839
$$ 91677427 67042477 48991331 36763469 28499934 22811118 18868929 16107331 14154492
18297A4154492j491675j140115q29765p14098o48286n19772l03274j68031m556
$$ 14154492 12662817 11522702 10692937 9978839 9330553 8810781 8507507 8339476 8334920
18288H334920J53594K51116K31280J36179J68162L76538O49901R55977J472248
$$ 8334920 8488514 8739630 8970910 9107089 9275251 9651789 10301690 11257667 12729915
18279A2729915K206892L186357M728954P492720J2121850J6480106J2194330M5078
$$ 12729915 14936807 18123164 22852118 30344838 42466688 58946794 71141124 71186202
18271G1186202n651267o737649p609534o301063j876296M485664R397002N982372
$$ 71186202 65534935 58797286 51187752 44886689 43010393 47496057 56893059 62875431
18263F2875431l468552p340711q325874r430530q941417o923874m786071l197850
$$ 62875431 59406879 52066168 43740294 34309764 25368347 18444473 13658402 10460552
18255A0460552k172658j467152j052995p81006n91066m42868k93752l36824k85893
$$ 10460552 8287894 6820742 5767747 4986741 4395675 3952807 3659055 3322231 3036338
18246C036338j95700j29979j29393o5364O4341J4597K3817q6689j79991k22047
$$ 3036338 2840638 2710659 2581266 2515902 2580243 2594840 2618657 2531968 2351977 2129930
18236B129930k43336j77212q3051M2886N0251k6639p7437j18442j18673j25452
$$ 2129930 1886594 1709382 1626331 1669217 1719468 1692829 1615392 1496950 1378277 1252825
18226A252825j01699q1927o4720q4238q8597m6315j1010j8843Q747l9452p044
$$ 1252825 1151126 1069199 1004479 920241 831644 785329 774319 755476 764223 724771 717727
18215G17727L756n0682m5009j0435J9121j660o6503l1071L4385M9770J1671j9746
$$ 717727 721483 670801 625792 615357 634478 632818 566315 535244 569629 619399 631070 611324
18203F11324l4362l2859j9182j010r684j8827N0807L43K6105O4649K9698r931
$$ 611324 576962 544103 524921 523911 514227 495400 546207 546550 572655 637304 667002 657071
18191F57071J6340K2943k6973l8468l2533L0506K7696K603k1926j4067M658p122
$$ 657071 673411 696354 669381 630913 598380 628886 656582 659185 637259 623192 627850 620728
18179F20728j2060j33533r1877o4275N2K4048m950N626M518K711j5890J5592l2610
$$ 620728 608668 475135 383258 318983 319035 343083 338133 343759 348277 350988 335098 350690 318080
18166C18080j995l246k6071n966K7999P214M921M5321L17K1133j1577L5525K7844
$$ 318080 316085 312839 286768 280802 308801 316015 320936 366257 366574 387707 376130 411655 439499
18153D39499j6020k0128j9892n1875j2265L7827J2992M7375N8901P2227J9752
$$ 439499 423479 403351 383459 331584 319319 357146 370138 417513 476414 548641 568393
18142E68393k9519J8332K4648j744k9915j1229L4523K0445J2194L3365K1458J9287
$$ 568393 538874 557206 581854 580110 550195 538966 573489 593934 606128 639493 660951 680238
18130F80238L3791M9979O8459O1803R1771J24026J39894J76168K48650K47530
$$ 680238 714029 764008 832467 894270 986041 1110067 1249961 1426129 1674779 1922309
18120A922309L22020L51988M21345N81988P24102R23596J277592J933522L024134
$$ 1922309 2244329 2596317 3017662 3599650 4323752 5247348 6524940 8458462 11482596
18111A1482596N156253R232152J5183074J6972987N016599o032407q146295r768567
$$ 11482596 16638849 25871001 41054075 58027062 63043661 57011254 48864959 39096392
18103C9096392j0577542q822773o083471l943756k598735j735180j271722r43882
$$ 39096392 28518850 19696077 13612606 9668850 7070115 5334935 4063213 3119331
18095C119331o66611n08141l75704k29743j86909j41378j11291j08461p4132m9034
$$ 3119331 2452720 1944579 1568875 1339132 1152223 1010845 899554 791093 716961 667927
18085F67927m6516n0878n3211k8365l2132k0447j992k1610m2486l825k4700l7021
$$ 667927 621411 570533 517322 488957 456825 436378 434386 412776 370290 366465 341765 304744
18073C04744P068m793n6907l5663J228J2139K3859p103j030K3965l322l6540m7268
$$ 304744 311812 307019 250112 214449 215677 227816 251675 244572 243542 267507 264185 227645 180377
18060A80377j9658l4399k7670k1683j4108L621J7390O791k1946j0720j9465K0678
$$ 180377 160719 126320 98650 76967 62859 66480 83870 90661 68715 57995 38530 59208
18048E9208k241R614J8521n575j1071n5755k1873K0752o030L7428N0595o309J1906
$$ 59208 56967 66581 85102 79527 68456 12701 -9172 11580 5550 42978 93573 87264 99170
18035I9170l4703j7363l2243k8634K023K8876M5518r715J589P209O377n3856k7186
$$ 99170 64467 47104 14861 -13773 -11750 17126 62644 52929 54518 61727 68104 14248 -12938
18022a2938r922j8960Q0307P1207K0964l8902l5349J440j9846l5017k1025j6787
$$ -12938 -22860 -41820 38487 109694 130658 91756 56407 57847 38001 2984 -18041 -34828
18010c4828J896j7818L980r343K0249N2336m315n734j7715m5564l6917N720K7547
$$ -34828 -32932 -50750 -46770 -56113 -35864 16472 12157 6423 -11292 -56856 -93773 -88053 -60506
17997f0506R489k5696J7628M3256r651N336J3904n758K4288J0794J1074M296N433
$$ -60506 -51017 -76713 -59085 -15829 -25480 -20144 -6240 -11998 12290 23084 34158 38454 43887
17984D3887l166N922K8860J2979J3508O406J7425J2535l4174l5961l204L370l2126
$$ 43887 40721 46643 75503 88482 101990 108396 125821 138356 104182 68221 65017 68387 36261
17971C6261j9543P230j2888K4158l027k1963l6327j780K2147M3762P1595O4298
$$ 36261 16718 23948 11060 35218 32191 10228 -26099 -27879 -5732 38030 109625 173923
17959A73923L8053M8261J06694J70902J03689J0070p4632m3226k8912L8494Q2676
$$ 173923 211976 260237 366931 537833 641522 651592 576960 533734 504822 543316 625992
17948F25992R7201O2871p1289q7979j19194j20557o4841p0283o3779j2674m1525
$$ 625992 723193 786064 714775 626796 507602 387045 322204 251921 188142 175468 133943
17937A33943k4846j4286L0508L6220J3264R701J5139J5726j1526n326m5780l1463
$$ 133943 109097 94811 125319 161539 174803 184504 199643 215369 203843 198517 152737 121274
17925A21274K3842J1088j7265p848K0927K0443J8317J240j00k8836j6824K8852
$$ 121274 145116 156204 138939 131091 152018 172461 190778 192018 191918 163082 146258 175110
17913A75110K6292R1926R4219J14212J06835M7925K3304O8793Q5731J13455J49551
$$ 175110 201402 293328 387547 501759 608594 656519 679823 748616 834347 947802 1097353
17902A097353P6483j9768q5838q8316l6279l0612j2577k7259r4197p9524j19886
$$ 1097353 1173836 1154068 1068230 979914 943635 913023 900446 873187 778990 699466 579580
17891E79580j19175j13908r7873n6703n204j7624j6775j3706K4919L2422k136
$$ 579580 460405 346497 248624 191921 186717 169093 152318 138612 163531 195953 193817
17880A93817l3519l3131j7561J2690l6283N342K3489r402l3270M845K4713j7053
$$ 193817 160298 127167 109606 122296 86013 91355 114844 105442 72172 77017 101730 84677
17868H4677O949M0739K3620K736M3746R5929R6746J23705J62707K13058J94768
$$ 84677 91626 132365 155985 158721 202467 298396 395142 518847 681554 894612 1089380
17857A089380Q1451J0458q854k6396j9405L6658P8886J9474r824r9452j73061
$$ 1089380 1170831 1181289 1172435 1146039 1126634 1163292 1242178 1261652 1251828 1152376 979315
17846I79315k05610j62231j50647j63827j22609J8608l4506l7539j4951j9736
$$ 979315 773705 611474 460827 297000 174391 192999 158493 120954 106003 86267
17836H6267p809K4169L8586J7436l1910J3138j3329k7059l1263o828j603K7005
$$ 86267 78458 102627 141213 158649 126739 139877 126548 99489 68226 61398 59795 86800
17824H6800m3624k3488L9334J8481J3695O8265N1618K4722M8764P0579J22768
$$ 86800 43176 19688 59022 77503 91198 159463 211081 235803 284567 355146 477914
17813D77914J47241J33141L0723J4352P6789J17443J12504Q8619K8195l7374j23424
$$ 477914 625155 758296 789019 803371 880160 997603 1110107 1198726 1226921 1189547 1066123
17802A066123n5753k3446k3590n7095j27468j40320j30274j08872j28057p0337
$$ 1066123 1010370 986924 963334 906239 778771 638451 508177 399305 271248 200911
17792B00911m3514n1376k7778n6962l3744j422o473j795J8493j6788j1275J650
$$ 200911 157397 106021 78243 21281 -12463 -13885 -20358 -22153 -3660 -20448 -31723 -30073
17780c0073L6037M8090Q743k8728j5147j099O047R160J6668m0923Q389n907K3690
$$ -30073 5964 54054 62797 34069 18922 17823 23870 33030 49698 8775 17164 11257 34947
17767C4947K4736J0915L0134O0589P7967R8328J21639M1421k4519J4452k4530
$$ 34947 59683 70598 100732 161321 239288 337616 459255 500676 476157 490609 466079
17756D66079k2862L6445N4965J7769n6248p1036p2084p1716m2473p1238o8324
$$ 466079 443217 479662 534627 552396 496148 425112 353028 281312 238839 167601 99277
17745I9277m6518m0765L077K8635j4931o03L249k1789l0969l940M920J4547l065
$$ 99277 52759 11994 15071 43706 28775 28172 31421 9632 -21337 -25277 -20357 -5810 -8875
17732h875p010o472K842J7933L4035k3550o194M339N4472J2226m4245l5705K9566
$$ -8875 -15885 -22357 -19515 -1582 32453 8903 2709 7048 61520 73746 29501 -6204 23362
17719B3362J3724k6682k1311J3544N555J4057j3713l4896J427j5012n390K6529
$$ 23362 37086 10404 -10907 2637 8192 22249 8536 -26360 -24933 -39945 -45335 -18806
17707a8806P065l4008J8690K1232K0850J5846j5185j3985p67j9364l2216J8994
$$ -18806 -11741 -45749 -27059 -5827 15023 30869 15684 1699 932 -18432 -50648 -31654
17695c1654L2111j0559J523K9200l334j2806k9650q238m280J0775K9528K1305
$$ -31654 457 -10102 -8579 20621 17287 4481 -25169 -33407 -37687 -26912 2616 23921
17683B3921J7845M571j7979l4401m7561K6595J3315j5829j3968l344m141o55J3861
$$ 23921 41766 46337 28358 -6043 -53604 -27009 -13694 -29523 -43491 -46835 -50976 -51631 -37770
17670c7770r67L1478J5817l8100k7433j4995J9980J1851J8193O058n276L0390
$$ -37770 -38737 -7259 8558 -29542 -56975 -71970 -51990 -40139 -21946 -15888 -21164 9226
17658I226M5460q953J2312Q695k9296l6718l4952j8126j2124L0008Q083k6375
$$ 9226 54686 45733 58045 66740 37444 726 -34226 -52352 -64476 -34468 -26385 -52760
17646e2760Q364K2453K5341m189q663j847l5922K2027L0667R537k9440j0417k233
$$ -52760 -44396 -21943 3398 -791 -9454 -11301 -47223 -25196 5471 15008 -14432 -24849 -27082
17633b7082J2209r644k0861N825K8529P091j2178o315K5899K638k3826J5786J8317
$$ -27082 -14873 -24517 -45378 -39553 -11024 -3933 -16111 -22426 3473 6111 -17715 -1929 16388
17620A6388k682k9853m7063l4980j2978M6784J7549K0760L5306J649m9139j3306
$$ 16388 13706 -16147 -63210 -98190 -111168 -64384 -46835 -26075 9231 10880 -38259 -51565
17608e1565K6964k38m2640j0610J6875J4414O74J8004J8055j122l7415l4530K4655
$$ -51565 -24601 -24839 -67479 -78089 -61214 -46800 -46126 -28122 -10067 -11189 -48604 -83134 -58479
17595e8479K3562r71J2336j0551k3770l191L3829L3844J8414j1949l2864j2687
$$ -58479 -34917 -35888 -23552 -34103 -57873 -61064 -27235 6609 25023 13074 -19790 -32477
17583c2477J3863l1744M832K2289J1343J7911q61n188J5137n5954k3178L2283
$$ -32477 -18614 -50358 -45526 -23237 -11894 6017 5156 -32 15105 -40849 -64027 -31744
17571c1744k557m165J581k8526K3160J2771J6070k6368k4332K7632M292K2548
$$ -31744 -34301 -38466 -36885 -65411 -42251 -29480 -13410 -39778 -64110 -36478 -32186 -9638
17559i638K2685P660P156j1459n1852l1808J7148J2232K0838j0246l8467K065
$$ -9638 13047 20707 27863 16404 -35448 -67256 -50108 -37876 -17038 -27284 -65751 -63686
17547f3686L2090r39k3078P883n3865j582L4519L8773J6703N928k3085k8151k3478
$$ -63686 -31596 -32535 -55613 -47730 -101595 -103177 -68658 -29885 -13182 -7254 -30339 -58490 -81968
17534h1968k5532N1448L9136l20J424J3669J8277L2317j1307m6127p931J8855
$$ -81968 -107500 -56052 -16916 -17236 -15812 -2143 16134 48451 37144 -8983 -16914 1941
17522A941O557m316J6065K7873j3433k7976o330j4505k1478j6816K2748L214n925
$$ 1941 8498 4182 20247 48120 34687 6711 381 -14124 -35602 -52418 -29670 -26456 -32381
17509c2381m467q218J7879J2128M2017j2767m3312m8090j6938J5478M5449P093
$$ -32381 -36848 -45066 -27187 -15059 26958 14191 -29121 -77211 -94149 -78671 -33222 -26129
17497b6129k239j7881M217k2474L058n771q241K0148K3743L646p887k6582n213
$$ -26129 -28368 -46249 -42032 -64506 -61448 -67219 -75460 -55312 -31569 -27923 -35810 -62392 -67605
17484f7605k600J6071k465O650M2367N1678j794o2880l1439l9360q684L3061J2556
$$ -67605 -70205 -54134 -56599 -49949 -7582 44096 42302 -20578 -52017 -91377 -100061 -67000 -54444
17471e4444k5206M182l9136J5124N4678J3624J8968J9746k199K433j271j1028
$$ -54444 -79650 -75468 -114604 -99480 -44802 -31178 -12210 7536 5337 7770 6499 -4529
17459d529J828j7024j7165J7854L5986M1037K4941j8814k964j3736m643J334j901
$$ -4529 -2701 -19725 -36890 -19036 16950 57987 82928 64114 61150 47414 42771 44105 42204
17446D2204j0614k465N4620O4645J04127N3831l4530m4284l620J626p9403o4908
$$ 42204 31590 29125 83745 148390 252517 306348 271818 227534 223914 225540 146137 81229
17434H1229j9135j6384k3219n9790l6446K421L7046j0163o974l291O338m07p703
$$ 81229 62094 45710 22491 -37299 -73745 -71324 -34278 -44441 -51415 -54706 -48368 -48775 -56478
17421e6478K3148m16N091j7051P986r182O2586j87k1457k1017j1594j8301o205
$$ -56478 -33330 -33746 -28655 -45706 -37720 -46902 15684 15497 -5960 -26977 -38571 -56872 -63077
17408f3077L0544L4842J7962k6385r313p435j5950k5495j1516J4270J8142L6838
$$ -63077 -32533 2309 20271 -6114 -15427 -22862 -38812 -64307 -75823 -61553 -43411 -6573
17396f573R233O631n941k6897m2081j2638K0203L9526R444o423Q917r766n267
$$ -6573 2660 9291 3350 -23547 -65628 -78266 -58063 -18537 -9093 -15516 -6599 -16365 -21632
17383b1632J0378j1995k7035M469l0186k3661L7955k030J5194q90j601o633p203
$$ -21632 -11254 -23249 -50284 -45815 -76001 -99662 -61707 -63737 -48543 -49433 -51034 -57667 -64870
17370f4870j7152m892N9202M0114M199l5722k2956J8027j7418o977o051K387J154
$$ -64870 -82022 -86914 -27712 12402 16601 -19121 -42077 -24050 -41468 -48445 -54496 -52109 -50955
17357e0955p031P257L5216k9429j4708K3242j3327Q51r012j8762L3808K7976K4982
$$ -50955 -57986 -50729 -15513 -44942 -59650 -36408 -49735 -48884 -57896 -76658 -42850 -14874 10108
17344A0108m1615k8278P320j0879j3517K6966N015L7332K3679j3920K7185J8717
$$ 10108 -31507 -59785 -52465 -63344 -76861 -49895 -44880 -7548 16131 2211 29396 48113
17332D8113j1447k890J5203l055m9878j8372P203P509j8672k2972J121j2738O798
$$ 48113 36666 33776 48979 45924 -3954 -22326 -15123 -7614 -26286 -49258 -48137 -60875 -54077
17319e4077L530j6097O67j1196L7851K8974j1363n187J5678K2949j9938J2123
$$ -54077 -50547 -66644 -65977 -77173 -39322 -10348 -21711 -26898 -11220 11729 -8209 3914
17307C914O496k0219k0510K5174K1496j0721O126L1410k9250n583J9648l6446
$$ 3914 10410 -9809 -30319 -5145 16351 5630 11756 43166 13916 8333 27981 -8465
17295h465k0264J7729K460L770Q088J3582k3383m3099K1440K4457L9428O843k0548
$$ -8465 -28729 -11000 -8540 -4770 3318 16900 -6483 -49582 -28142 -3685 35743 42586 22038
17282B2038J9889j4633k7019j9427j609K050K0699J1896j8956J4763K684n606
$$ 22038 41927 27294 275 -19152 -20761 -18711 1988 13884 -5072 9691 12375 6769
17270F769k3612L2486J027J8205N706l0677n974j6138J0416K3791m6889j6696
$$ 6769 -16843 15643 16670 34875 40581 9904 3930 -12208 -1792 21999 -24890 -41586
17258d1586J2770j4344k8651l716K2300r415J2444m652O92J7737J3478j4514j936
$$ -41586 -28816 -43160 -71811 -75527 -53227 -62642 -50198 -54850 -54158 -36421 -22943 -37457 -39393
17245c9393K4149j5560k591l5720n7903L2388K3085K6081L3409m2408m1887L0327
$$ -39393 -15244 -30804 -33395 -69115 -127018 -94630 -71545 -45464 -12055 -54463 -96350 -66023
17233f6023Q709J2405r834j9764J2415L0870K3621J5150p842k5040k7570J6262
$$ -66023 -57314 -44909 -54743 -74507 -62092 -31222 -7601 7549 -293 -25333 -52903 -36641
17221c6641L8802k1281l3620j227p107P606Q908l5171k2099K1198J4310k6416
$$ -36641 2161 -19120 -52740 -53967 -61074 -53468 -44560 -79731 -101830 -80632 -66322 -92738
17209i2738K8682M0051Q412K8928j1123r380J8860l2032j9594K4082l1522O179
$$ -92738 -64056 -24005 -15593 13335 2212 -7168 11692 -20340 -39934 -15852 -47374 -41195
17197d1195P7723R719k3660l6942P370J2275K6264K774m8581j5836J7343L3201
$$ -41195 36528 46247 22587 -14355 -6985 5290 31554 34328 -14253 -30089 -12746 20455
17185B0455K6715J4767n715k5601l783l2529j5544j8233k0126k8853R395j225
$$ 20455 47170 61937 56222 30621 26838 -5691 -21235 -39468 -59594 -88447 -79052 -80277
17173h0277K2979j725Q848N4291o449l2596j7723K0059Q345q48j8216k1538l137
$$ -80277 -57298 -59023 -50175 4116 -2333 -34929 -52652 -32593 -24248 -25096 -43312 -64850 -67987
17160f7987l601L1378l7J6718J1841M400Q006n0694K4359K9520J909j5938j0615
$$ -67987 -71588 -40210 -40247 -23529 -11688 -7288 718 -49976 -25617 3903 5812 -10126 -20741
17147b0741k6223j4887J8965J3721P455M5277j6473n6476j569J2352K6323L7181
$$ -20741 -46964 -61851 -42886 -29165 -21710 23567 7094 -49382 -50951 -38599 -12276 24905
17135B4905L829l9051k8069O44m411J8308K0115k3897j4649J9598J9908k1887
$$ 24905 28734 -10317 -38386 -37742 -42153 -23845 -3730 -27627 -42276 -22678 -2770 -24657
17123b4657j2514K9644l2996k6428k0463K499P430J6467Q112J9337k747j1909
$$ -24657 -37171 -7527 -40523 -66951 -87414 -84915 -77485 -61018 -52906 -33569 -36316 -48225
17111d8225L730j762j6668M0869L475k2395r661n932M947k0769j0743l3609J0082
$$ -48225 -44495 -46257 -62925 -22056 -18581 -40976 -50637 -56569 -51622 -72391 -83134 -116743 -106661
17098a06661L2617L3043j0592J5277K054K2640K6611j6071k1716m2027j7847o779
$$ -106661 -74044 -41001 -51593 -36316 -34262 -11622 14989 -1082 -22798 -64825 -82672 -89451
17086h9451N4791L6092k1818l34N598K64Q795j3079m0445J3717Q524J0672k3332
$$ -89451 -34660 1432 -20386 -20720 -15122 -14858 -6063 -19142 -59587 -45870 -37346 -26674 -50006
17073e0006J0550m14M67P768q574J3278M734p954J086k1803J822m23K9510j2700
$$ -50006 -39456 -39870 -39403 -31635 -40209 -26931 -22197 -30151 -29065 -50868 -49046 -49469 -19959 -32659
17059c2659k8626K3446J5783m524P101J7623p217j3760M605j4164k4399L5758
$$ -32659 -61285 -37839 -22056 -26580 -19479 -1856 -9073 -22833 -18228 -32392 -56791 -21033
17047b1033J0268r842j4174j9483L374M0522K7324j3326j1249q080n323K6346
$$ -21033 -10765 -20607 -34781 -54264 -50890 -10368 16956 3630 -7619 -15699 -21022 5324
17035E324j6801j3032K4710M084o8885m1049r265K1493N4244L0490k2667N79L861
$$ 5324 -11477 -24509 201 4285 -64600 -105649 -114914 -93421 -39177 -8687 -31354 -30775 -26914
17022b6914N966j836o004K8007N052j9731j4669j6520r279k147J2734l1299K4181
$$ -26914 -20948 -22784 -28788 -781 4271 -15460 -30129 -46649 -55928 -58075 -45341 -76640 -52459
17009e2459L4774R705m2235j9689R992r240j6733p047J5793J3170K298J0113K5761
$$ -52459 -17685 -7980 -50215 -69904 -59912 -69152 -85885 -92932 -77139 -63969 -61671 -51558 -25797
16996b5797K7842J6634k9991k7361M499j1070m595M921j2215L2722k3100m487
$$ -25797 2045 18679 -11312 -38673 -34174 -45244 -49839 -44918 -57133 -24411 -47511 -51998
16984e1998J9902J4122K651J754j636l8766j5510K721M2011K4944l9858K163k337
$$ -51998 -32096 -17974 -15323 -13569 -15205 -53971 -69481 -66760 -24749 195 -39663 -37500 -39837
16971c9837J234J1169P876J439m2739q886M1331L1946K1611l7730k100k3143n414
$$ -39837 -38603 -27434 -19558 -18119 -60858 -69744 -28413 3533 25144 -12586 -14686 -37829 -43243
16958d3243j1544K2453n069P104K6687j7858l2223O836L469J3674q996R772J2359
$$ -43243 -54787 -32334 -37403 -30299 -3612 -21470 -53693 -46857 -43388 -29714 -38710 -28938 -16579
16945a6579J0757M833K3727k209j6778k1472k5831j8811K4053j7293J1972R453
$$ -16579 -5822 -989 22738 20529 3751 -17721 -43552 -62363 -38310 -55603 -43631 -34178
16933c4178N7792j164j9850L718R574j780q345n0356l576J3649k1940l588j5747
$$ -34178 23614 22450 2600 6318 15892 14112 5767 -44589 -48165 -34516 -56456 -60044 -75791
16920g5791L2697L4259Q325k8719P508J3312J7956J3697j1655l1799m124j7520
$$ -75791 -43094 -8835 -510 -29229 -21721 -8409 9547 23244 11589 -20210 -24334 -41854
16908d1854J8655J1438j185l5797l1239R459M4732m742M64N254P925l2049k1042
$$ -41854 -23199 -11761 -12946 -48743 -79982 -70523 -25791 -30533 -30069 -24815 -16890 -48939 -69981
16895f9981j5080j6980J0645K1752J1433L2631K1012n741l6617R543K6944k80
$$ -69981 -85061 -102041 -91396 -69644 -58211 -25580 -4568 -10309 -46926 -37383 -10439 -10719
16883a0719o121j1570j4929j1588r124l5029K819M3525L0174k0079J2517j5977
$$ -10719 -16840 -28410 -43339 -54927 -64051 -99080 -96261 -52736 -22562 -42641 -30124 -46101
16871d6101j5966L42l3724r5K7922j046j4120l0986J5285L0815R363k1754M0666
$$ -46101 -62067 -61725 -95449 -95544 -67622 -68668 -82788 -113774 -98489 -67674 -58311 -80065 -39399
16858c9399J6346k0932r195r991p102j4054j5318O883Q669q804l129P249P219
$$ -39399 -23053 -43985 -53180 -63171 -70273 -84327 -99645 -92762 -84093 -92897 -96026 -88777 -81558
16845h1558L9141J4572r169J1479l4930L070L0175P964o8m437j3742k878K7755
$$ -81558 -42417 -27845 -37014 -25535 -60465 -57395 -27220 -19256 -19324 -23761 -37503 -40381 -12626
16832a2626K1588m041j7431j7470L379k4294m1899J0640M6745L1550o620j2930
$$ -12626 8962 4921 -12510 -29980 -26601 -50895 -92794 -82154 -35409 -3859 -10479 -23409
16820b3409k1082Q544K2039L332J5808j2721n187m0549L6386J6432P813k0435
$$ -23409 -44491 -35947 -13908 -10576 5232 -7489 -12676 -53225 -16839 -407 7406 -13029
16808a3029k239l1662R924L2012L584k6168k1521m3442j268L4074K3087L2980
$$ -13029 -15268 -46930 -37006 -4994 -1410 -27578 -49099 -92541 -93809 -59735 -36648 -3668
16796c668r029L721l1008p1078O297M5130k4047K1589M2163L2338P867P053K5305
$$ -3668 -12697 -8976 -39984 -111062 -104765 -59635 -83682 -62093 -19930 12408 20275 27328 52633
16783E2633R13J4310l1145k3172K056k0330J1112k7904p54J9887m733R510J5406
$$ 52633 53546 67856 36711 13539 15595 -4735 6377 -21527 -22281 -2394 -7127 2383 17789
16770A7789k5270m8201o606j4223K7708j1258j3946N800P771M3115J6675M938
$$ 17789 -7481 -55682 -62288 -76511 -48803 -60061 -74007 -68207 -60436 -17321 -646 4292
16758D292m92k215j1202j6967J4638J409k4966j7308r100K0417J5199l928j5534
$$ 4292 3800 1585 -9617 -26584 -11946 -10537 -35503 -52811 -61911 -41494 -26295 -30223 -45757
16745d5757P640J5320k8359J246J9278R698J699j065J0522J6647J0672J9790l1432
$$ -45757 -38117 -22797 -51156 -49910 -30632 -20934 -19235 -20300 -9778 6869 17541 37331 5899
16732E899l2013m620M0177N019k3616j5731m459j9379J4362N4212J6675K514m336
$$ 5899 -26114 -30734 9443 14462 -9154 -24885 -29344 -48723 -34361 19851 36526 39040 34704
16719C4704o010l9755J5647j0785k5360J8975J82j3837j026K1032K8875r220K792
$$ 34704 28694 -11061 4586 -6199 -31559 -12584 -12402 -26239 -27265 -6233 22642 13422 16214
16706A6214L12j6704O539P194K5187L4203j3987l5312J127J7135j1016n8705j4013
$$ 16214 16526 -178 6361 13555 38742 72945 58958 23646 24773 41908 30892 -27813 -41826
16693d1826J012j2952O560J4634R386l9N11k736l5330j9722L7653M2415M8642
$$ -41826 -40814 -53766 -47206 -32572 -23186 -23225 -22714 -25450 -60780 -80502 -42849 -434 48208
16680D8208k5414k6664k6326l2562K6760J9176l484K987J6023k229k981K6224
$$ 48208 22794 -3870 -30196 -62758 -35998 -16822 -20306 -17319 -1296 -3525 -6506 19718
16668A9718K7070j4622j9842m7242k647J8148L191J1367K4008j1839l4350l2186
$$ 19718 46788 32166 12324 -34918 -37565 -19417 -16226 -4859 19149 7310 -27040 -59226
16656e9226j1692L2365J2646K9015J4767l0808j4341M6183L7960k5623n122l0009
$$ -59226 -70918 -38553 -25907 3108 17875 -12933 -27274 18909 56869 31246 26124 -3885
16644c885M270N346j0790j150p962m163K5619K5244K2797M08n3980j5044l8784
$$ -3885 385 5731 -5059 -6209 -14171 -18334 7285 32529 55326 55734 1754 -13290 -52074
16631e2074j5435L3464M6782J095j5321k2925p411J5027k726J3541J9309j4079
$$ -52074 -67509 -34045 12737 13832 -1489 -24414 -31825 -16798 -19524 -5983 13326 -753
16619g53l6501k4845J4091J0871L7683L9876J4572q137l5951k4543k252m0561
$$ -753 -37254 -62099 -48008 -37137 546 40422 54994 46857 10906 -13637 -15889 -56450
16607e6450l7212K0273J3249m746K4011p040m743K2462j69R966o644K6p348l249
$$ -56450 -93662 -73389 -60140 -64886 -40875 -47915 -52658 -30196 -30365 -20399 -27043 -27017 -34365 -37614
16593c7614J8144K358R801J9904j8802l3164P025R762k4205m702R876K6684K9759
$$ -37614 -19470 -17112 -7311 12593 -6209 -39373 -32348 -22586 -46791 -51493 -41617 -14933 14826
16580A4826j2528j2567J5886n939l3818j519J2493j8607m659J495K0297N870J6703
$$ 14826 2298 -10269 5617 -322 -34140 -35659 -23166 -41773 -46432 -44937 -24640 -18770 -2067
16567b067J7763P97p283P327J2080J3349o485J1279N223m4995k8702N920K0411
$$ -2067 15696 16493 9210 16537 28617 41966 35481 46760 51983 6988 -21714 -15794 4617
16554D617R854N440j0356l2679q516J5317J8562L5237m0131l2859k0476L1453
$$ 4617 14471 19911 9555 -23124 -31640 -16323 2239 37476 -2655 -35514 -55990 -24537
16542b4537P077j0543N4072J7250j0566K4597J0165n8248l412k0426N405k3283
$$ -24537 -17460 -28003 26069 43319 32753 57350 67515 9267 5855 -14571 -9166 -32449
16530c2449r106L521J3608j895J1214L9082j2837l6976p480n402K5540j4878j3741
$$ -32449 -41555 -38034 -24426 -26321 -15107 23975 11138 -25838 -33318 -38720 -13180 -28058 -41799
16517d1799k4498q059P585L1532o348o732Q658k319M2421j3287o740j4900q837
$$ -41799 -66297 -74356 -66771 -35239 -41587 -48319 -39661 -41980 441 -12846 -19586 -34486 -43323
16504d3323k7391p666J1062J0065P095M636j7967J1373M7q209K6496q069l6471
$$ -43323 -70714 -78380 -67318 -57253 -50158 -45522 -63489 -52116 -52069 -60278 -33782 -41851 -78322
16491g8322q733p625L9155J6501p570K7102o485Q698J9381j0591J6573m6222q469
$$ -78322 -87055 -94680 -55525 -39024 -46594 -19492 -25977 -17279 2102 -8489 8084 -38138 -46607
16478d6607L1147L5990J369o891j1730k1400n672l2814r72Q871J224L0000J9822
$$ -46607 -15460 20530 21899 15008 3278 -18122 -23794 -56608 -57580 -48709 -47485 -17485 2337
16465B337J387l3413k2651K033K4336K8947l3049j9994K1580k499l8123j9328
$$ 2337 3724 -29689 -52340 -50307 -25971 2976 -30073 -50067 -28487 -30986 -69109 -88437
16453h8437N6763M3668L139K1738L300j9762m3255k6035L0894K6003P066N594
$$ -88437 -31674 11994 15133 36871 40171 20409 -22846 -48881 -17987 8016 15082 20676
16441B0676J7435m67j1346K1303K2629n6258j8672J9441J1896K215J2928P191
$$ 20676 38111 37644 26298 47601 70230 13972 -4700 14741 26637 28852 41780 48971
16429D8971r339l7814k8989k6008K5928K173j1036M077K6382L3593j9957j5618
$$ 48971 39632 1818 -27171 -53179 -27251 -25078 -36114 -32037 -5655 27938 7981 -7637
16417g637j1606p348J0652j4015J4761K4600r431n7807n402L9505j7121k729M3595
$$ -7637 -19243 -26591 -15939 -29954 -15193 9407 -24 -57831 -63233 -23728 -40849 -43578 17
16404A7R302o534l4719n5170M368Q434k314N7495J1390L002n498R559j8489k1595
$$ 17 9319 2785 -31934 -87104 -82736 -74302 -76616 -19121 -7731 -4729 -10227 -668 -19157 -40752
16390d0752J1631O656L385j9949k8431L0875M316J5962j429K7M2454j3803l0019
$$ -40752 -29121 -22465 -19080 -39029 -67460 -36585 -32269 -16307 -17736 -17709 24745 10942 -19077
16377a9077o396J6637J2966J5258J4307M0039K2447J1006l470l1013k0235l8579
$$ -19077 -25473 -8836 4130 19388 33695 73734 96181 107187 103717 72704 52469 13890
16365A3890j5355j3401j7411m344K6510K4214M384L944k0520l2373j036l3922
$$ 13890 -1465 -14866 -32277 -36621 -10111 14103 18487 22431 1911 -30462 -31498 -65420
16353f5420P788K6411m3060k6298M2259K0084L7892J1736K0515j5811n2068k5047
$$ -65420 -57632 -31221 -74281 -100579 -58320 -38236 -344 11392 31907 16096 -35972 -61019
16341f1019K5746J4728L6627L0007l2965j3151r624j9964q5J3015j6120K3307
$$ -61019 -35273 -20545 16082 46089 13124 -27 -9651 -29615 -29700 -16685 -32805 -9498
16329i498J2011L32j8591J0341K4824N798l3067j6708l1263j637j831J4626L7833
$$ -9498 2513 2845 -15746 -5405 19419 25217 -7850 -24558 -55821 -57458 -59289 -44663 -6830
16316f830r488k3902j8751n827n639K1672K0856j8137p519L0396J7258l4169J0493
$$ -6830 -16318 -40220 -58971 -64798 -70437 -48765 -27909 -46046 -53565 -23169 -5911 -40080 -29587
16303b9587J5788N116m3862K7846N9919M941L366k7252l0768R104M9968K9508
$$ -29587 -13799 -8683 -52545 -24699 35220 40161 43527 16275 -14493 -5389 44579 74087
16291G4087m36k1657k0486q468l3440J0106J3450J8395K1129k666m2420m3931
$$ 74087 73651 51994 31508 23040 -10400 -294 13156 31551 52680 50014 7594 -36337
16279c6337j9021O000K0077j7741j0440K3527M8862j063k6477n514L9010L974
$$ -36337 -55358 -49358 -29281 -47022 -57462 -33935 14927 13864 -12613 -18127 20883 24857
16267B4857k3846o0316J8102M0174N741O687o386P0J6915j2356q066k3154n839
$$ 24857 1011 -59305 -41203 -1029 4712 11399 5013 5083 21998 9642 1576 -21578 -27417
16254b7417r832j3382M1351K7402j6784l4907P977J409K0817j0539j0854J5616
$$ -27417 -37249 -50631 -9280 18122 1338 -33569 -25592 -24183 -3366 -13905 -24759 -9143
16242i143L8874k034J1575j4619k6299r602l3885m230M2483L041j3109L272j4779
$$ -9143 29731 27697 39272 24653 -1646 -11248 -45133 -49363 -6880 -3839 -16948 -13676 -28455
16229b8455j3081J1314l649n925Q260o545J439j6787o296L5071M5887k298J2716
$$ -28455 -41536 -30222 -33871 -39796 -31536 -38081 -36642 -53429 -59725 -24654 21233 18935 31651
16216C1651M28k1591P221K3904m543k4154o0962l1562J4869M8747K2354J5513
$$ 31651 32079 10488 17709 41613 37070 12916 -48046 -79608 -64739 -15992 6362 21875
16204B1875j2369j5342j3482l968L536J7360K5024J6322k8792o4767O956J3844
$$ 21875 9506 -5836 -19318 -23286 -19750 -2390 22634 38956 10164 -54603 -47647 -33803
16192c3803j3096m079L5134K8751J3835k1784m9496N826J204j234K5873K5543
$$ -33803 -46899 -50978 -15844 12907 26742 4958 -44538 -38712 -37508 -38742 -12869 12674
16180A2674J1010o657R457r385p314o543m298l455j1649j6668J5867j2694R400
$$ 12674 23684 17027 26484 17099 9785 3242 -1056 -4511 -16160 -32828 -16961 -29655 -20255
16167b0255j1517k6703j4917O951l3448J2471M8843K2221l138p31Q100l6852k6799
$$ -20255 -31772 -58475 -73392 -66441 -99889 -87418 -38575 -16354 -19492 -20223 -12123 -48975 -75774
16154g5774L6577L1076J6222L0168q361l1788K158m3502j5647N22J6446M3209
$$ -75774 -39197 -8121 8101 38269 29908 -1880 278 -43224 -58871 -58349 -41903 1306
16142A306k7807l5561K3550K2291K8960j0592n632k9710j8606j4K3334L1170L2295
$$ 1306 -26501 -62062 -38512 -16221 12739 2147 -3485 -33195 -51801 -51815 -28481 2689 34984
16129C4984J2522p701l9390n8856J8538M374j2625J1517K0496m9660n716K0549
$$ 34984 47506 39805 415 -58441 -39903 -35529 -48154 -36637 -16141 -65801 -71517 -50968
16117e0968j3652n914M4797K1179j9783n8j4468J5184K3025n221J1130K0125J8735
$$ -50968 -64620 -70534 -25737 -4558 -24341 -24399 -38867 -23683 -658 -5879 5251 25376 44111
16104D4111q603o238l8141J6271l514k271m1696J636O449N927j2030j7459O772
$$ 44111 35508 29270 -8871 7400 3886 1615 -40081 -38445 -31996 -26069 -38099 -55558 -48786
16091d8786J8835K2774K1038q869m5446p08O909M9810J1425k7892j0394J5067
$$ -48786 -29951 -7177 13861 4992 -40454 -41162 -34253 15557 26982 -910 -11304 3763
16079C763K2525j7111m6358l0566j3863J8515M1776n150q850J1895M635K0093
$$ 3763 26288 9177 -37181 -67747 -81610 -63095 -21319 -26469 -35319 -23424 -18789 1304
16067A304J7361l217q599J5869l224j2351q839o21l65O368J897j3149J5087N546
$$ 1304 18665 15448 6849 22718 19494 7143 -1696 -2317 -2682 3686 5583 -7566 7521 13067
16053A3067l636j300J0116k6044m0933J0691M3651N952K2093j6465l1275k516
$$ 13067 9431 8131 18247 -7797 -48730 -38039 5612 11564 33657 17192 -14083 -16599
16041a6599R395k1624L6320K0999j642k5506k8434m2008j4038J5948M0520L5628
$$ -16599 -7204 -28828 7492 28491 26849 1343 -27091 -69099 -83137 -67189 -26669 8959
16029H959l4729k520j326p109K0479J5318L275l2119k6616j2564j1300K4840K7747
$$ 8959 -25770 -28290 -29616 -36725 -16246 -928 2347 -29772 -56388 -68952 -80252 -55412 -27665
16016b7665j5365K7864L2929j6796k7127q123K2793M3564J3462l3829l1147k3858
$$ -27665 -43030 -15166 17763 967 -26160 -34283 -11490 32074 45536 11707 -19440 -43298
16004d3298L775M7633L0836J1634J3030p412j9440k3051K0381j1448k6026m743
$$ -43298 -39523 8110 38946 50580 63610 56198 36758 13707 34088 22640 -3386 -8129
15992h129K782L5504J1338l7166k381k768J2960J6193r946j2805k7642J6587J3253
$$ -8129 -5347 30157 41495 4329 1948 -820 12140 28333 18387 5582 -22060 -5473 7780
15979G780k3677P691K1901J3552J4338k2441l8696j1063P292N595J8915M9761
$$ 7780 -15897 -8206 13695 27247 41585 19144 -19552 -30615 -23323 -17728 1187 50948
15967E0948j532l2523r807J682j3752K1994Q936l474r427r474j8284J2292J9304
$$ 50948 49416 16893 7086 8768 -4984 17010 25946 22472 13045 3571 -14713 -2421 16883
15954A6883M6367j4439l947N644l9785k2078J7485L0841N16k3189L009k7694k15
$$ 16883 63250 48811 44864 50508 10723 -11355 6130 36971 37487 14298 17307 -10387 -10602
15941a0602m2321J6922O7904q147O927J8551k0664j1270k0462m859L0996L1172
$$ -10602 -52923 -36001 31903 23756 30683 49234 28570 17300 -3162 -8021 22975 54147
15929E4147k3964l5304r268P824k5479k2429o336J3836R821O003n734J3460j0851
$$ 54147 30183 -5121 -14389 -6565 -32044 -54473 -60809 -46973 -37152 -31149 -36883 -23423 -34274
15916c4274l4269K9749K5044L3642j2643J2436r3m339n934K3148m070J4432r032
$$ -34274 -68543 -38794 -13750 19892 7249 19685 19592 15253 9319 32467 28397 42829 33797
15903C3797r512j2352M456m241k0023k0588M474J0872p125j5K5651k080L616k7526
$$ 33797 24285 11933 16389 12148 -7875 -28463 -23989 -13117 -20242 -20257 5394 3314 6930 -20596
15889b0596K8190l663l1177L752J0994j3546k6936R008L7438K4314j7414L018
$$ -20596 7594 3931 -27246 -23494 -12500 -26046 -52982 -43974 -6536 17778 364 3382
15877C382l225J0285p439J5271j3311M471k4013Q699J9735k2917k9915k9395j9061
$$ 3382 157 10442 3003 18274 4963 9434 -14579 -5880 13855 -9062 -38977 -68372 -87433
15864h7433L2478L1411k4673L430J7365K7649N413J2757m458K708J5934k7221
$$ -87433 -54955 -23544 -48217 -44787 -27422 227 5640 18397 13939 16647 32581 5360
15852E360Q32J3499q772K7883M244j4806l2812k7511m5844K9454m521j1900O034
$$ 5360 6192 19691 10919 38802 43046 28240 -4572 -32083 -77927 -48473 -52994 -64894 -58860
15839e8860L4841J173j4735L2129m817J3387J9780j3868l0283j1051l1005J8948
$$ -58860 -24019 -22846 -37581 -5452 -10269 3118 22898 9030 -21253 -32304 -63309 -44361
15827d4361r798o22J6171L188k3579J426j4833Q929K7436J3822K867j9251r437
$$ -44361 -54159 -54781 -38610 -35422 -59001 -57575 -72408 -63479 -36043 -22221 -19354 -38605 -48042
15814d8042q269L584j1343k9898M23K8028K5938L5582o389J2723j7492J3570K0977
$$ -48042 -56311 -52727 -64070 -93968 -93545 -65517 -39579 -3997 -10386 2337 -15155 -1585 19392
15801A9392l6118J995K6811Q347l3864m9789K4970L8540J5629N553K3076k6825
$$ 19392 -16726 -14731 12080 20427 -13437 -63226 -38256 284 15913 21466 44542 17717
15789A7717k8215k9408N997J9324L3836L0870q678J5518k9028o0377o1120P920
$$ 17717 -10498 -39906 -33909 -14585 19251 50121 41443 56961 27933 -32444 -93564 -85644
15777h5644Q518L112K0021N5706j1841K1001N0923J6931r019k7952j7442J541
$$ -85644 -77126 -74014 -53993 1713 -10128 10873 61796 78727 69708 41756 24314 25855
15765B5855k2336J842m981J384j7256k9088l0868K0562K3336m6288n831L2188
$$ 25855 3519 5361 380 1764 -15492 -44580 -75448 -54886 -31550 -77838 -83669 -51481
15753e1481p199J1698l206l5263J0030J4338K8042p254R934j670M093m8100j8061
$$ -51481 -58680 -46982 -50188 -85451 -75421 -61083 -33041 -40295 -30361 -32031 -27938 -76038 -94099
15740i4099K0636M7358j6256m0056L1191J8378J3094J5738L5959k4704j2591K3941
$$ -94099 -73463 -26105 -42361 -82417 -51226 -32848 -19754 -4016 31943 7239 -5352 18589
15728A8589j2824o067j7151M894k0139M6638R881k8673j9061p476j2159K3948
$$ 18589 5765 -302 -17453 -12559 -32698 13940 23821 -4852 -23913 -31389 -43548 -19600
15716a9600J5146j0380p4K1162j1565L1745j7667k1199j6867J4233J059J911m840
$$ -19600 -4454 -14834 -14908 6254 -5311 26434 8767 -12432 -29299 -15066 -14007 -12096 -16936
15703a6936J182J142N551j087N0892R569j2628J3159K5394m2045j1442o102k6039
$$ -16936 -15754 -14612 -9061 -10148 40744 50313 37685 50844 76238 34193 22751 16649 -9390
15690i390Q511J3899J7714l0469k120p794K198K8026R165O402k4863K7683o932
$$ -9390 -879 13020 30734 265 -1855 -9649 -7451 20575 29740 36142 11279 38962 32030
15677C2030l5891j0103m45k9578k0173P450L3496K4434J9809j477j2173m4037
$$ 32030 -3861 -13964 -14409 -43987 -64160 -56710 -23214 1220 21029 19552 7379 -36658
15665c6658J6974L4518K250J0122r124R871M0356r140l1399J367l2048o425Q802
$$ -36658 -19684 14834 17084 27206 18082 27953 68309 59169 27770 29137 -2911 -9336 -534
15652e34K3861n676k1678N934R790L973m421K5821L386m2392l1993J4678J5464
$$ -534 23327 17651 -4027 1907 11697 15670 11249 37070 40456 -1936 -33929 -19251 -3787
15639c787j4617k658k0851l90M3533r780l4386O13j866l9298j2165K5355K7413
$$ -3787 -18404 -21062 -41913 -42303 1230 -8550 -42936 -42323 -44189 -83487 -95652 -70297 -42884
15626d2884k0041P889L705L0071J9701L4323l3137o1075k5777L1646N0843N772
$$ -42884 -62925 -55036 -51331 -21260 -1559 32764 -373 -61448 -87225 -55579 -4736 1036
15614A036j2457K2926j6695r924j1126J4749j0499Q614P950q530L3252J7714K439
$$ 1036 -11421 11505 -5190 -15114 -26240 -11491 -21990 -13376 -5426 -13956 19296 37010 39449
15601C9449n738l9830J16K3898p212K1145L7522J543m8066n1194o714P935L509
$$ 39449 33711 -6119 -6003 17895 10683 31828 69350 70893 22827 -28367 -35081 -27146 -23637
15588b3637K312j982j3100r976K7784R45K634J0826j6474j2474M724m76K0375
$$ -23637 -21325 -23307 -36407 -46383 -18599 -17654 -15020 -4194 -20668 -33142 -28418 -28894 -8519
15575h519J906J7J0840N258j957j5983M264j0327j7200J6065k0305N168K9668
$$ -8519 -6613 -6596 4244 9502 7545 -8438 -4174 -14501 -31701 -15636 -35941 -30773 -1105
15562a105J4133L786m3521j2773k6802J2123L9348O843O7444m146k1436l1826
$$ -1105 13028 16814 -26707 -39480 -66282 -54159 -14811 -7968 59476 55330 33894 2068
15550B068j8419L6716j0443k6948l8454j0149O7287N2097j5617l2339j8386j1057
$$ 2068 -16351 20365 9922 -17026 -55480 -65629 1658 53755 38138 5799 -12587 -23644
15538b3644k9465m317P069J5497j5K8683K5563j8869j883P543j9487o997r138
$$ -23644 -53109 -57426 -50357 -34860 -34875 -6192 19371 502 -1381 6162 -13325 -20322 -29460
15525b9460L4514q193K3784M213k012j830l887j5674J13K9937P260k1809m3481
$$ -29460 5054 -3139 20645 24858 22846 21016 17129 1455 1568 31505 38765 16956 -26525
15512b6525m0154J6173l6134j9597O012L2627R133K0049J5267K0519p650M171
$$ -26525 -66679 -50506 -86640 -106237 -100225 -67598 -58465 -38416 -23149 -2630 -10280 -6109
15500f109K6704L5764K4588n4266k0842L5542j7389m5941j035J2777O500J8203
$$ -6109 20595 56359 80947 26681 5839 41381 23992 -21949 -22984 -10207 -3707 14496
15488A4496j7281k954J3206p224j4171N0659j9475k3541R390j8106M368K562j6959
$$ 14496 -2785 -5739 7467 243 -13928 36731 17256 -6285 3105 -15001 -10633 -8071 -25030
15475b5030n354j1943j4580K6386j2334J6668o867K1097K6525j5063j3382j6970
$$ -25030 -30384 -42327 -56907 -30521 -42855 -26187 -33054 -11957 14568 -495 -13877 -30847
15463c0847r235J951j9895M086J8211J2177k243l5716N70K7888P918J1232M576
$$ -30847 -40082 -38131 -58026 -53940 -35729 -23552 -25795 -61511 -60941 -33053 -25135 -13903 -9327
15450i327M2744j7507m5117J3289q283J4031K2789O599j5206n3926N012J5581
$$ -9327 33417 15910 -29207 -15918 -24201 -10170 12619 19218 4012 -49914 -44902 -29321
15438b9321j3461K811M6372K5405j6616j5566k9074k724J2460j0790j7540J2010
$$ -29321 -42782 -39971 6401 31806 15190 -376 -29450 -32174 -19714 -30504 -48044 -36034
15426c6034k0495l6795R926O100m797J886N3212M7669J0862P413Q153j0642j4073
$$ -36034 -56529 -93324 -83398 -77298 -82095 -80209 -26997 20672 31534 38947 47100 36458 22385
15413B2385L8922J4672l6951o0960J3725q695o753L584K3208m990k992o893m1593
$$ 22385 61307 75979 39028 -21932 -8207 -16902 -23655 -20071 3137 -1853 -4845 -11738 -53331
15400e3331P806J3537K485K2072K358j6268k9538j3831M2408j3384k2995k5637
$$ -53331 -45525 -31988 -29503 -7431 -5073 -21341 -50879 -64710 -22302 -35686 -58681 -84318
15388h4318J5807K0888M7908N739j4056J1195O939J4218K4108l0300Q918j0003
$$ -84318 -68511 -47623 285 6024 -8032 3163 10102 24320 48428 18128 27046 17043
15376A7043k6464J3874k568j294k2894k1840J0391J5646j2517k495j9673J6875
$$ 17043 -9421 4453 1885 591 -22303 -44143 -33752 -18106 -30623 -33118 -52791 -35916
15364c5916O2647J9001k4372J277r60k9214l6311k1843j1870R666P4236L8676
$$ -35916 26731 45732 21360 22637 21677 -7537 -43848 -65691 -77561 -67895 6341 45017
15352D5017J9661j3018k7315j3089q731O893M8007J0243l2425m0651m1475p424
$$ 45017 64678 51660 24345 11256 2525 9418 57425 67668 35243 -5408 -46883 -54307
15340e4307J6908J9733R245M0892j311j0930j6604N851J8445k4612j9853K519
$$ -54307 -37399 -17666 -8421 32471 31160 20230 3626 9477 27922 3310 -16543 -14024
15328a4024j6013j8260L4692L3555l3816k0016q79N19J5351K2021k1261J6932
$$ -14024 -30037 -48297 -13605 19950 -13866 -33882 -34761 -34242 -18891 3130 -18131 -1199
15316a199j9927J454m133M7803j6052j4180P789L7257J161m0851l7447J3151K0735
$$ -1199 -21126 -19672 -23805 23998 7946 -6234 1555 38812 39973 -878 -38325 -25174 -4439
15303d439J8548r275n3954k3366j2319J5415L2441j543J6693k8204m512K5339
$$ -4439 14109 4834 -49120 -72486 -84805 -69390 -36949 -38492 -21799 -50003 -54515 -29176
15291b9176L7408K9986n1088k1930J5316L4699k8066M3278l941n32L0343J7120
$$ -29176 8232 38218 -12870 -34800 -19484 15215 -12851 30427 26486 25954 56297 73417
15279G3417q586r008K423k9620l6889m1529k1695N8772J6857k0388N08N090M2233
$$ 73417 64831 55823 58246 28626 -8263 -49792 -71487 -12715 4142 -16246 -15738 -10648 31585
15266C1585K3352j1429k6783n546j1794J3322N021J9483J2327M408j5926N320
$$ 31585 54937 43508 16725 11179 -615 12707 17728 37211 49538 53946 38020 43340
15254D3340J8999m7338K2868k117j6258lJ8908j5769q011j0271j9556K5674L0193
$$ 43340 62339 15001 37869 35752 19494 19491 38399 22630 14619 4348 -15208 10466 40659
15241D0659l5016k1916L0890r329J743J324k5383j7414K2036j5236r179K3722
$$ 40659 5643 -16273 14617 5288 7031 8355 -17028 -34442 -12406 -27642 -36821 -13099
15229a3099j6483j5570K3624j0871K6898J2480J5204K8960J2611K365Q720k2442
$$ -13099 -29582 -45152 -21528 -32399 -5501 6979 22183 51143 63754 66119 74839 52397
15217E2397l2964k0138l0207p886K0308K0793k9696j629J1483J3891m959K4890
$$ 52397 19433 -705 -30912 -38798 -18490 2303 -27393 -29022 -17539 -3648 -8607 16283
15205A6283q929k6070j0702k285r216k523M6162J5177l140j504m086k7134l2005
$$ 16283 7354 -18716 -29418 -31703 -40919 -43442 2720 17897 14757 13253 9167 -17967 -49972
15192d9972J4527J444j0454L5155J4134j0299n8421J0802L0469N333j7277K020
$$ -49972 -35445 -34001 -44455 -9300 4834 -5465 -63886 -53084 -22615 -17282 -34559 -32539
15180c2539j2866l452Q520M288M4140l033q207m5936P266K8720j1008l1445R655
$$ -32539 -45405 -48857 -40337 -36049 8091 5058 -3149 -49085 -41819 -13099 -24107 -55552 -45897
15167d5897M7296J0642k16l2791k1085J0731P410K7164M3138P928o1870o0131
$$ -45897 1399 12041 11825 -20966 -42051 -31320 -23910 3254 46392 54320 -7550 -67681
15155f7681j5341j0422L659J6537k304K0562K8367L6734J0618M858p591O733j3316
$$ -67681 -83022 -93444 -89785 -73248 -75552 -54990 -26623 10111 20729 25587 17996 24729 11413
15142A1413l885k5484Q549J8344r031q871J1796j1664K3117P68l6386q956m268
$$ 11413 7528 -17956 -9407 8937 -94 -8965 2831 -8833 14284 15052 -21334 -30290 -34558
15129c4558j6656O463M1455Q46n876L321Q886q362k251K5477j2510j5710m528
$$ -34558 -51214 -44751 -3296 -2450 -8326 -5005 3881 -4481 -6732 18745 6235 -9475 -14003
15116a4003j3281K9490O6648J8453j2510p895k1695K948n00J7236Q807k4427L510
$$ -14003 -27284 2206 68854 87307 74797 66902 45207 48155 47655 64891 73698 49271 52781
15103E2781k907r844O155j8115n1451m642L0820K2837o003RO05O634l254j5423
$$ 52781 49874 40030 46185 28070 -23381 -28023 2797 25634 19631 19640 20245 26879 23625 8202
15089H202m1353K2314K8785o558l3956M917L5967M409L258J2559J7318K2257j0357
$$ 8202 -33151 -10837 17948 11390 -22566 -17649 18318 22727 25985 38544 55862 78119 67762
15076F7762n684l2714J7036m699m9659n3294k6215J8830N3452L204M9581K5991
$$ 67762 62078 29364 46400 41701 -7958 -61252 -87467 -68637 -15185 -11981 37600 63591
15064F3591l407M921k719j9608J3281M497P962k5096j2974J6714J835l019K6635
$$ 63591 60184 65105 62386 42778 56059 60556 68518 43422 30448 47162 48997 45978 72613
15051G2613J481m7796k7161j5398K6506J0968j0028k7480m3247M0611L1494k3423
$$ 72613 74094 26298 -863 -16261 10245 21213 11185 -16295 -59542 -18931 12563 -10860
15039a0860K7186K0577J8108l0613m6083l2981K1501J3562j8385l944K3154K3654
$$ -10860 16326 36903 55011 24398 -21685 -54666 -33165 -19603 -37988 -41932 -18778 4876
15027D876j0507l4964J5102L0821j7073L248N5647M946n39r60m803j5047l9568
$$ 4876 -5631 -40595 -25493 5328 -11745 -8497 47150 52096 51557 50597 45794 30747 -8821
15014h821k3788l3333j0934J9297J2685J3703J479n666K750J9303J0326Q421m9825
$$ -8821 -32609 -65942 -76876 -57579 -44894 -31191 -29712 -35378 -32628 -13325 -2999 5422 -44403
15001d4403k3245l7101L9650k1556j3836M0740j074J175P779L7554M6169m784
$$ -44403 -67648 -104749 -65099 -86655 -100491 -59751 -60825 -59650 -51871 -14317 31852 27068
14989B7068M5938Q095k2478j6303j6572l85J4803L785L3166j7692P35j872q345
$$ 27068 73006 81101 58623 42320 25748 25363 40166 43951 77117 59425 60160 58288 49943
14976D9943j4655j2313m1084L795l044k0606L4042K9884j6944R358j774O398k1716
$$ 49943 35288 22975 -18109 -14314 -17358 -37964 -3922 25962 9018 18376 16602 23000 1284
14963A284M111Q607l578j0852j218l3139j4305R509k5923o801R548l592q07J848
$$ 1284 5395 14002 10424 -428 -1646 -34785 -49090 -39581 -65504 -72305 -62757 -66349 -67156 -65308
14949f5308J8323J7800L0244R052j4487k1553j6825k9126k197K7392K8114J6603
$$ -65308 -46985 -29185 1059 10111 -4376 -25929 -42754 -71880 -74077 -46685 -18571 -1968
14937a968l1924j6116M1793L5425J8468l8275p1492M112K3296j2927j5137R028
$$ -1968 -33892 -50008 -8215 27210 45678 7403 -64089 -59977 -36681 -49608 -64745 -55717
14925e5717N5213J6412l2896n416q594M3031M6887J7038J3231P002l1511k7562
$$ -55717 -504 15908 -16988 -22404 -30998 12033 58920 75958 89189 96191 64680 37118
14913C7118J124l4015L0454K9321k7584k6476J6315K055n684O579j2510n6083
$$ 37118 38242 4227 34681 64002 36418 9942 26257 28312 22628 29207 16697 -39386
14901c9386j4277J3816L2013J929r864J518q615q50q365m725j6887k3940R559
$$ -39386 -53663 -39847 -7834 -5905 -15769 -14251 -22866 -23716 -32081 -36806 -53693 -77633 -68074
14888f8074L1211K6448M099j8764J6500K7033K5707l2157l6829N156J7313M673
$$ -68074 -36863 -10415 -6316 -25080 -8580 18453 44160 12003 -24826 -19670 -2357 2316
14876B316r497l348N192K1295K8555O995j3509l3293q027K410J0188l3357k0981
$$ 2316 -7181 -10529 -5337 15958 44513 51508 37999 4706 -3321 -911 9277 -24080 -45061
14863d5061L2372L4172l0650j3405J8204K7443k5940j6317J7386O849j913k2024
$$ -45061 -12689 21483 -9167 -22572 -4368 23075 -2865 -19182 -1796 5053 3140 -18884
14851a8884K924N992N6883K969m630L0932J1452n1775n6775j8914o707L1794J4221
$$ -18884 -15960 -9968 46915 49884 45254 76186 87638 35863 -20912 -39826 -46533 -14739 -518
14838e18J1172l1612K9724L429l7891p197K6789K0942L1800K1976k6122k9377
$$ -518 10654 -20958 8766 12195 -25696 -32893 -6104 14838 46638 68614 42492 13115
14826A3115n0615k0742l254k6726L651Q286K8746L9341k1150o162J5996k282J2217
$$ 13115 -37500 -58242 -61496 -88222 -84571 -76285 -47539 -8198 -29348 -35510 -19514 -21796 -9579
14813i579O159o205j2623q114m237K0958J2793M1541P861j3739j5168l7024p009
$$ -9579 -3420 -9625 -22248 -30362 -34599 -13641 -848 40693 48554 34815 19647 -17377 -24386
14800b4386K0682j7992M01J3158P327k3507l4853k35M6159L9569k6719k3416j7848
$$ -24386 -3704 -21696 -21295 -8137 -810 -24317 -59170 -59405 -13246 26323 -396 -23812 -41660
14787d1660K0946l7244o580L5633M5963L2682k0922l0794k0831k0740J0925M695
$$ -41660 -20714 -57958 -64538 -28905 17058 49740 28818 -1976 -22807 -43547 -32622 -27927
14775b7927K1532J0809Q798o125J1035K949J2536O958j7042p708j2162M296N026
$$ -27927 -6395 4414 13212 7087 18122 21071 33607 40565 23523 15815 3653 7949 12975
14762A2975k9699k0954m908P921N1L6661L9730J1146j3382K2524N3114M2462m6909
$$ 12975 -16724 -37678 -42586 -34665 -34614 2047 41777 52923 39541 62065 115179 157641 110732
14749A10732k3303k4719l8471k785J5110o323J0827J4240j1652k3739L903k3001
$$ 110732 87429 62710 24239 21454 36564 30241 41068 55308 43656 19917 23820 819
14737H19O473K7317J2319m5416j0583J1712J3061k4371M003K3957k0312m196j7616
$$ 819 7292 34609 46928 1512 -9071 2641 15702 -8669 -4666 19291 -1021 -5217 -22833
14724b2833J5508n956k3263k8215j9812J9943Q483M147J6115P246k2021O938k1115
$$ -22833 -7325 -13281 -36544 -64759 -84571 -64628 -56145 -51998 -35883 -28637 -50658 -43720 -64835
14711f4835N83K5281L9812J8890K4801j7073j4402J1091j589L4079n477j2997
$$ -64835 -64252 -38971 841 19731 44532 27459 13057 24148 22559 56638 51161 38164
14699C8164j8127j7295J268K9621K9933R73r012O277k735J4992J1877k4763m8280
$$ 38164 20037 2742 4010 33631 63564 64537 55525 61802 59067 74059 85936 61173 12893
14686A2893q911J3546N812K193J639p672R681O150j5921k4187J968O247J052k7347
$$ 12893 3982 17528 23340 25533 27172 19500 29181 35331 19410 -4777 -2809 3438 4490 -22857
14672b2857J1082J7223j6807J7871L3413J1298r52j4187M220K847j6058k4411
$$ -22857 -11775 5448 -11359 6512 39925 51223 50271 36084 40304 43151 27093 2682
14660B682R366J1493k406k9215m8524j7242J3389L4051o555o413k518O675N719
$$ 2682 12048 23541 21135 -8080 -56604 -73846 -60457 -26406 -32961 -39374 -41892 -35217 -29498
14647b9498M324n97p930K2310K0336K0555L2201K7158k5905k0632j4963j2116
$$ -29498 -25174 -25771 -33701 -11391 8945 29500 61701 88859 62954 42322 27359 15243
14635A5243K6501k0236p616j4988K2710R853J873k5369n4513j5822L3950L395
$$ 15243 41744 21508 13892 -1096 21614 31467 33340 7971 -46542 -62364 -28414 -25019
14623b5019L2856J7016O661k822K260J4811k0595o9692l8835L3348J8989j7144
$$ -25019 7837 24853 31514 28692 30952 45763 25168 -44524 -83359 -50011 -31022 -48166
14611d8166m168M8058M718l0822R069P292J8258L6694m1535l35J1244L858l2469
$$ -48166 -52334 -4276 442 -30380 -21311 -14019 4239 40933 -602 -937 10307 14165 -18304
14598a8304Q807j007j62J7763j9069K7330J9102K0352k1682K181l171j6545k6539
$$ -18304 -9497 -10504 -10666 7097 -11972 15358 34460 54812 33130 35311 32140 15595 -10944
14585a0944l0105j5942L1061L7020K8624K621k5978k390j8565k201K762m845J1713
$$ -10944 -41049 -56991 -25930 11090 39714 42335 16357 13967 -4598 -6799 -4037 -8882 2831
14572B831L0652J4408k7952k0394K0987k1796j2610m098m15k073J4207K7310K2759
$$ 2831 33483 47891 19939 -455 20532 -1264 -13874 -17972 -18387 -20460 -6253 21057 43816
14559D3816k4705k2597J5122j1286j0573J8523j9640L0266K8120L473o634k4751
$$ 43816 19111 -3486 11636 350 -10223 8300 -11340 18926 47046 50519 43885 19134
14547A9134Q313J3852J222l0355k8230j097m324J3138j8052J4319l945J0382L6250
$$ 19134 27447 41299 42521 12166 -16064 -17161 -21485 -8347 -26399 -12080 -16025 -5643 30607
14534C0607l0176m5660K3372j886N868Q541J2005M1285J0766j3315l1362j2660
$$ 30607 431 -45229 -21857 -23743 -17875 -9334 2671 43956 54722 41407 10045 -2615
14522b615R966k9805j2709N984L5167K0616k5740m3815J9034K564L3404K3567
$$ -2615 7351 -22454 -35163 -29179 5988 26604 864 -42951 -23917 -21353 12051 35618
14510C5618K7207L2361l4070o4922O294K1360O428o67K7495O509m9742n7698J3684
$$ 35618 62825 95186 61116 -3806 2488 23848 30276 29609 57104 63613 13871 -43827 -30143
14497c0143L1134p332j9886K5109Q251K1715k567J4544J6115k9784k1737N381
$$ -30143 991 -6341 -26227 -1118 7133 28848 26281 40825 56940 27156 5419 10800
14485A0800J486k8467j5142P375Q31J6470J6454Q578M170O509l6286k9558L23
$$ 10800 12286 -16181 -31323 -23948 -23117 -6647 9807 18385 22555 29064 -7222 -36780 -36457
14472c6457l462K3823L9788M2542j1646k2065m2994J5277r489p242q852N232L0305
$$ -36457 -39919 -16096 23692 66234 54588 32523 -10471 4806 -4683 -11925 -20777 -15545 14760
14459A4760K8918j1728l0589k9082J0420L6090o068m4609J8518L631o464j2885
$$ 14760 43678 31950 1361 -27721 -17301 18789 12721 -31888 -13370 -9739 -16203 -29088
14447b9088J5169n865M042k1286j544j5012J6353L6555m9360k31k503O389M6327
$$ -29088 -13919 -19784 -15742 -37028 -38572 -53584 -37231 -676 -50036 -50267 -52770 -46381 -54
14434e4M3976k8954Q134j0686n059l0510j8696j830L6671q784k2282J2858M5810
$$ -54 43922 14968 23102 12416 7357 -23153 -41849 -43679 -7008 -15792 -38074 -25216 20594
14421B0594M4650J086k5717m9472O991K7329n665l7565p591N335P346j68k9589
$$ 20594 65244 66330 40613 -8859 -1868 25461 19796 -17769 -25360 -20025 -12679 -12847 -42436
14408d2436J6900L6805O86R81p279J6539m1023j4590R479j5804Q59O177J3480
$$ -42436 -25536 11269 11955 12936 5657 22196 -18827 -33417 -23938 -39742 -38883 -32706 -19226
14395a9226J1770M7462K1097P34k5581j8737M252K1609M1296R23k741r721k5560
$$ -19226 -7456 40006 61103 61837 36256 17519 21771 43380 84676 85599 82858 73137 47577
14382D7577k0030l2945l692j3640L6353N97K436l8526J0473J9239j2080j8092
$$ 47577 27547 -5398 -9090 -22730 13623 14220 16656 -21870 -11397 7842 -4238 -22330
14370b2330L1258j62M408m61L339R929j5715j620R192o890J0674K2887P353k9109
$$ -22330 8928 8766 13174 12713 16052 25981 10266 8646 17838 10948 21622 44509 51862 22753
14356B2753k145l6614r07R16j8885M1289J4628n052j0802l3883L8868j059R199
$$ 22753 20608 -16006 -16913 -15997 -34882 6407 21035 15983 5181 -28702 10166 9107 18306
14343A8306m2570k5157q917O379J8562L228K9166P23j1256J2067m087j3799j3084
$$ 18306 -24264 -49421 -58338 -51959 -33397 -30169 -1003 -280 -11536 531 -3556 -17355 -30439
14330c0439j885K758L4399L1340J8888l9457k8778k0529K6709j8134q735J1648
$$ -30439 -32324 -29566 4833 36173 55061 15604 -13174 -33703 -6994 -25128 -33863 -22215
14318b2215P435L658J6189J6906J3470n398j879K2704m969m2798j8157O330J3275
$$ -22215 -14780 -11122 5067 21973 35443 30045 28166 50870 45901 3103 -15054 -8724 4551
14305D551m355m1203k2850O134M5882O1949q80k5871m8237J72K0995j9916l583
$$ 4551 196 -41007 -63857 -57723 -11841 50108 49228 23357 -24880 -24708 -3713 -23629 -27212
14292b7212M0263n759J9681O184j3171k812j8858O8736L3388m4581m9876k0246
$$ -27212 13051 7292 26973 33157 19986 17174 -1684 67052 100440 55859 5983 -14263
14280a4263J9004M264M227j7269l9525j2373K5585N3957j0530J1086K79l0309
$$ -14263 4741 9005 13232 -4037 -43562 -55935 -30350 23607 13077 24163 24442 -5867
14268e867J3832K262j0381k8594M1993n99k2729l9935J6469K149O840J0735M1822
$$ -5867 7965 10227 -154 -28748 13245 12646 -10083 -50018 -33549 -31400 -24560 -13825 27997
14255B7997K918j1710l038M293K1189k017m2895k6910l411J1251m720K0230M0611
$$ 27997 30915 19205 16167 20460 41649 39632 -3263 -30173 -33584 -22333 -27053 -6823 33788
14242C3788J5208n258m3101l6365J8600J6974J05J6514L0250q409J3171k1804
$$ 33788 48996 43738 637 -35728 -17128 -154 -49 16465 46715 38306 51477 29673
14230B9673j9959L381N391L871L9549j9542j4630J5129r132j5940N654p060k6683
$$ 29673 9714 13095 18486 22357 61906 42364 27734 42863 33731 17791 23445 16385 -10298
14217a0298k3608J1386K9555M349n089K0967q439K5050L8404n2446k7459l627
$$ -10298 -33906 -22520 7035 11384 6295 27262 18823 43873 82277 29831 2372 -1255
14205a255O625J6547M6569J3208m4287l974l7033j6276j6892j0206K7843j4898
$$ -1255 5370 21917 68486 81694 37407 33433 -3600 -19876 -36768 -46974 -19131 -34029
14193c4029L251n12m989K0663l454L969j6625J2284K5737J8769Q14J4448l6488
$$ -34029 -30778 -31290 -36279 -15616 -19070 -15101 -31726 -19442 6295 25064 25878 40326 3838
14180C838Q894M380K8455K0920m0395k3601O76O9176L4925m4545l3731K1267l4437
$$ 3838 12732 17112 45567 66487 26092 2491 3167 72343 107268 62723 28992 50259 15822
14167A5822k6897j8901n323k6988l3702n064J6780N4600J9405n755J5292K0895
$$ 15822 -11075 -29976 -35299 -62287 -95989 -101053 -84273 -29673 -10268 -16023 -731 20164
14155B0164q120k8613j0925J0528k4396q715J4314J6103N231L4013L58k2600Q778
$$ 20164 12044 -16569 -27494 -16966 -41362 -50077 -35763 -19660 -14429 19584 19942 -2658 6120
14142F120M5552K8625l9055o502Q156J1206j5272n1662m8588k2432L1461L1329
$$ 6120 51672 80297 41242 34740 42896 54102 38830 -12832 -61420 -83852 -52391 -21062
14130b1062q591J8377L5603k7750L4371J5943l2340n0873q185k6091k2908P81
$$ -21062 -29653 -11276 24327 -3423 30948 46891 14551 -36322 -44507 -70598 -93506 -92725
14118i2725J3010M2175J9902k6725r281j6773L094K5836L1892j8203K0039L5414
$$ -92725 -79715 -37540 -17638 -44363 -53644 -70417 -67323 -41487 -9595 -27798 -7759 27655
14106B7655N276m848j3534K0333J6008l6281m8691m002L1306K9761P319j843l469
$$ 27655 32931 28083 14549 34882 50890 14609 -34082 -38084 -6778 22983 30302 28459 24990
14093B4990k9603j0145J5213J250k1285j6162Q635Q312M994J2944n163j4395K7737
$$ 24990 -4613 -14758 455 1705 -19580 -35742 -27107 -18795 -13801 -857 -6020 -20415 7322
14080G322M7528J0083k0892m5934O157J8398M431J9220L8760o171j2453r987m526
$$ 7322 54850 64933 44041 -1893 4264 22662 27093 46313 85073 78902 66449 56462 51936
14067E1936K0950J5433J8959r02k8564o1746l0573J8459o38j6243r127m134J0398
$$ 51936 72886 88319 107278 106376 77812 16066 -14507 3952 3314 -12929 -22056 -26190 -15792
14054a5792L6864K3837q633l2874m0003j1148N0872N0361j7262n7973k9019L0153
$$ -15792 21072 44909 36276 3402 -36601 -47749 3123 53484 36222 -21751 -50770 -20617
14042b0617K8249l1941j4376n986k3723J9519K4422P198J9377p696j7353K5256
$$ -20617 7632 -24309 -38685 -44671 -68394 -48875 -24453 -17255 2122 -5574 -22927 2329
14030B329L8456n62m828O131k2154l9936n035j8464J4040L127K4901n611j6404
$$ 2329 40785 40223 35395 41526 19372 -20564 -25599 -44063 -30023 -26896 -1995 -7606 -24010
14017b4010K8161K5386J0656J9646j7136n7473l254j4238P260M0653n440J527
$$ -24010 4151 29537 40193 59839 42703 -14770 -18024 -32262 -25002 15651 10211 11738
14005A1738K5003n5250k6014k408k022K454L5323M7860J4394n017k6724l8656
$$ 11738 36741 -18509 -44523 -46931 -48953 -46499 -11176 36684 51078 46061 19337 -19319
13993a9319N011k2768K996N6028k9054l0929L3106M2988J446l8522j3088M826
$$ -19319 -14308 -37076 -34080 21948 -7106 -38035 -4929 38059 39505 983 -12105 -7279
13981g279J3092l0758N104k828r783j8129R426j131j9791k717L3188m928K8662
$$ -7279 5813 -24945 -19841 -22669 -32452 -50581 -41155 -42286 -62077 -64794 -31606 -36534 -7872
13968g872N066L9779J1791j7609k0970k3865q23j8838n920M731J8420J2293J7931
$$ -7872 -2806 36973 48764 31155 10185 -13680 -14503 -33341 -39261 -34530 -16110 -3817 14114
13955A4114j1172L1540o369M7198j0742n0930m9015j4092K9379L3493q542j5376
$$ 14114 2942 34482 28113 75311 64569 13639 -35376 -49468 -20089 13404 4862 -10514
13943a0514n989K8904K7357m88l1982L560Q957J6279k1778p068J705k784l092
$$ -10514 -16503 12401 39758 39270 7288 10848 19805 36084 14306 7238 8943 6159 3067
13930C067j6901j2877L1149L2693m629P86p366m1125m1132K744O3478J4917k1260
$$ 3067 -13834 -26711 4438 37131 32502 33288 25922 -15203 -56335 -53591 9887 24804 3544
13917C544k9290k0895j8351j3352k0049K3401M0723N938j434L8892K7179j622
$$ 3544 -25746 -46641 -64992 -78344 -98393 -74992 -34269 -28331 -29765 9127 36306 34684
13905C4684m876q384j1792O130n333k1261j9531J0914m543L3095m776m600l396
$$ 34684 29808 21424 9632 15762 10429 -10832 -30363 -19449 -23992 9103 4327 -273 -3669
13892c669K680k8858L019M277N087n594l4994K6034K0695l1219l2669K8932N6293
$$ -3669 -989 -29847 -26828 -22551 -17464 -23058 -58052 -32018 -11323 -42542 -75211 -46279 10014
13879A0014L7912j7147j9826P745N47J3838j6491K781J8702q688m6892n659K8079
$$ 10014 47926 30779 10953 18698 19245 33083 16592 19373 38075 29387 -17505 -23164 4915
13866D915L6177K0319j8061l044J5929j2320k9676j9740M6976j4401o809M3082
$$ 4915 41092 61411 43350 40306 56235 43915 14239 -5501 41475 27074 20265 63347
13854F3347J4546K144n1252m4896K4483j7870k7422p550M2949L9622L956l5907
$$ 63347 77893 80037 28785 -16111 8372 -9498 -36920 -44470 -1521 38101 42057 6150
13842F150k620K5541L4203O165l648k1811j2105j7752M123K08m6849j8204N590
$$ 6150 3530 29071 63274 69439 65791 43980 31875 14123 18246 18454 -28395 -46599 -41009
13829d1009L296m302K4213r74l9232k476L3034K1234Q769J909Q41N3160J9758
$$ -41009 -37713 -42015 -17802 -18776 -58008 -60484 -27450 -6216 2553 4462 5303 58463 78221
13816G8221k0742j8919K7878j0308k1793K4905p000N942n983l5607k3366j4185
$$ 78221 57479 38560 66438 56130 34337 59242 52242 58184 52201 16594 -6772 -20957
13804b0957k6746j4274L144j7199l416L8704J4530K8259K2162O680J0316k5480
$$ -20957 -47703 -61977 -58833 -76032 -79448 -40744 -26214 2045 24207 30887 41203 15723
13792A5723M187l7316j0432J1817o058j4196r39J5930P915K6499j3234k8054k1416
$$ 15723 19910 -17406 -27838 -16021 -22079 -36275 -37214 -21284 -13369 13130 -104 -28158 -49574
13779d9574J671J2470J5917K1517J0492k540L1323K5934o83j0158k4742m3208
$$ -49574 -47903 -35433 -19516 2001 12493 9953 41276 67210 66527 56369 31627 -11581
13767a1581j1480L9052L2413K8850O647r500k4376n5391j7758L4569q718j0905
$$ -11581 -23061 15991 48404 77254 83901 74401 50025 -5366 -23124 11445 2727 -8178
13755h178K0988p030K5262N9564p958j0743n3084l9000l4199M848K0400r051L3379
$$ -8178 12810 5780 31042 90606 82648 71905 18821 -20179 -54378 -49530 -29130 -38181 -4802
13742d802l77P816R431j6715r596L224k6945k042M5602M0101J9232J87o8323l492
$$ -4802 -5179 2637 12068 -4647 -14243 -11019 -37964 -40006 5596 45697 64929 65116 -3207 -6699
13728f699J92R44K9982L0997K2757q984r90L867m456L0664k391Q3p153k1523o038
$$ -6699 -6507 -5563 24419 55416 78173 69189 68199 72066 67610 98274 95883 95966 88813 67290 61252
13713F1252J908N072j2798j2260j8131n1586j1589r29P305K5623K2809j4606K2293
$$ 61252 63160 68232 55434 43174 25043 -26543 -38132 -39061 -31756 -6133 16676 2070 24363
13700B4363j7504k3212Q444Q52j0382p489k5038K6423K0915Q801n0829k8452Q2244
$$ 24363 6859 -16353 -7909 -7057 -17439 -24928 -49966 -23543 -2628 6173 -44656 -73108 9136
13687I136O65J6059J6229j01j8505L7040K990j8990m1184j0084P09N135m752L049
$$ 9136 9801 25860 42089 41988 23483 60523 63513 44523 3339 -6745 -6036 -901 -5653 -2604
13673b604k089p006J7698l9954k902K6422j1177k4277j1641J7386J0848j4155
$$ -2604 -4693 -11699 5999 -33955 -36857 -10435 -21612 -45889 -57530 -40144 -29296 -43451
13661d3451K1339n569o845j7937K1944J4183k5629M2206K0821J2048l6129n123
$$ -43451 -22112 -27681 -34526 -52463 -30519 -16336 -41965 241 21062 33110 -3019 -8142
13649h142k4736L1693M0471P547k0421j4320k4295k5559L6935j0163p674L0476
$$ -8142 -32878 -1185 39286 46833 26412 12092 -12203 -37762 -827 -10990 -18664 11812
13637A1812Q421K6697P701K693k638m4255l9467J9932L6660k8344j2014L4630
$$ 11812 20233 46930 54631 57324 54686 10431 -29036 -9104 27556 -788 -12802 21828
13625B1828M0991o382J9450J1854r72j333j8945P253J0994k1514l0391R802j3568
$$ 21828 62819 56437 75887 87741 86769 85436 66491 73744 84738 63224 32833 42635 29067
13612B9067k0016l6248k4722j9522N9606K8605R783o812P589K1230k463m5241
$$ 29067 9051 -27197 -51919 -71441 -11835 16770 26553 19741 27330 48560 46097 856
13600H56p434n959n838O2592L4492j4490o46k569l5042j6794L7604J6365r175
$$ 856 -6578 -12537 -18375 44217 78709 64219 63573 61004 25962 9168 46772 63137 53962
13587E3962J794J9777k3814k258l2862k0942o82j0105k3070j414J8254M65j88
$$ 53962 55756 75533 51719 49461 16599 -4343 -5025 -15130 -38200 -39614 -21360 -20895 -21083
13574b1083O400j0318j2613j192L6940L1088J544J5155N77j5203n333l2142J4565
$$ -21083 -14683 -25001 -37614 -38806 -1866 29222 30766 45921 46498 31295 25962 -6180 8385
13561H385K724k6352M400L5586J2790j6435J1180j1426j1832j1281J7808L4796
$$ 8385 11109 -15243 -10843 24743 37533 21098 32278 20852 9020 -2261 15547 50343
13549E0343q81k8457k8471j6550L9804j3965l2020Q961K8707Q819O963J9618l2610
$$ 50343 49462 21005 -7466 -24016 15788 1823 -30197 -21236 7471 16290 23253 42871 10261
13536A0261K0872j5652l2887q599j9850K2729N322J2156N481O642l6706k0997
$$ 10261 31133 15481 -17406 -26005 -45855 -23126 -17804 -5648 -167 6475 -30231 -51228
13524e1228L7514K3549p593j1070K4598P084j5527j2077K9175K1413k0508J3069
$$ -51228 -13714 9835 2242 -8828 15770 22854 7327 -4750 24425 45838 25330 38399
13512C8399l565k6806K2429J3167O954l5432j856j414j4456J0106j021k2560j562
$$ 38399 34834 8028 30457 43624 50578 15146 13290 11876 -2580 7526 6505 -16055 -17617
13499a7617O358j6033Q261M6416J0844k2859m099l712j4545L204K1719L84j060
$$ -17617 -11259 -27292 -19031 27385 38229 15370 11271 7559 -6986 -3782 17937 18321 17261
13486A7261K6378R458l5596k4678K2989j4202m1168l3983p303J0246L8192K2797
$$ 17261 43639 53097 17501 -7177 15812 1610 -39558 -73541 -80844 -70598 -32406 -9609
13474i609N10o636j5505K2547K5000J0842J8595O257q828p892j0633N559K0705
$$ -9609 -9099 -15735 -31240 -8693 16307 27149 45744 52001 43173 35281 24648 30207 50912
13461E0912k657l6237j6524k5857L1687k564k3901j0887l5780K38N2962K2899
$$ 50912 48255 12018 -4506 -30363 1324 -1240 -25141 -36028 -71808 -71570 -18608 4291
13449D291j5423l1220l5003J8855O9621J9623l5509r360k6005J2201J3497j4071
$$ 4291 -11132 -42352 -77355 -58500 11121 30744 -4765 -14125 -40130 -27929 -14432 -28503
13437b8503k4151o819J5943L0459l3664J6367J4722j3971k066J5347p285J9432
$$ -28503 -52654 -59473 -43530 -13071 -46735 -30368 -15646 -29617 -31683 -16336 -23621 -4189
13425d189L5272J6230k3618j8520m867L866k3709l1878M7558J3724O186k2151
$$ -4189 31083 47313 23695 5175 308 4174 -19535 -51413 -3855 9869 16055 -6096
13413f096k039m646p60j8709l904K2382n9127L087J7485J325J5035j3270L5304
$$ -6096 -8135 -12781 -13541 -32250 -36154 -13772 -72899 -69812 -52327 -51002 -35967 -49237 -13933
13400a3933Q643M147K1676j2451k2870n287j2876j3634j3437J8679J4187K1859
$$ -13933 -5290 -1143 20533 8082 -14788 -20075 -32951 -46585 -60022 -41343 -27156 -5297
13388e297j0322j0821K1606L8074R966o570n5763p5046N739j0381R256O6817K7862
$$ -5297 -15619 -26440 -4834 33240 43206 36636 -19127 -94173 -88434 -98815 -89559 -22742 5120
13375E120Q573j017j7388K507r640l1480J5154J4626p74N1074K2717j9430q454
$$ 5120 13693 12676 -4712 -2205 -11845 -43325 -28171 -13545 -14319 36755 59472 40042 31588
13362C1588j5112J18L2430K2580l7318j6291j9065m108J0483j8315o6449j4131
$$ 31588 16476 16594 49024 71604 34286 17995 -1070 -5178 5305 -13010 -79459 -93590
13350i3590N8045K1928L866L2062L630l3660P768N1107L4816J2574q61n5725l4492
$$ -93590 -35545 -13617 -9751 22311 25941 -7719 49 51156 85972 98546 97685 41960 7468
13337G468p458j0681l0554k4820R00M2132O6245L7782k6688j3575j0056R82o448
$$ 7468 10 -10671 -41225 -66045 -65145 -23013 43232 81014 54326 40751 30695 31677 25229
13324B5229K3908J3577q627n560k8020l5234j7833K8215j716L374k8996r321J3455
$$ 25229 49137 62714 54087 48527 20507 -14727 -32560 -4345 -6061 -2687 -31683 -41004 -27549
13311b7549K6011J5326l101q388k9492K5366Q697J2573l054K473j3898j0016K6957
$$ -27549 -1538 13788 10687 2299 -27193 -1827 6870 19443 16389 18862 4964 -5052 21905
13298B1905L0102q453p763j3623q174n839j136j4476J4600j7714l1286k0016k08
$$ 21905 52007 43554 35791 22168 13994 8155 7019 -7457 7143 -10571 -41857 -61873 -62081
13285f2081M6416M3749K2792l3120k4854k354Q377L7676k1255j6785j6151J7094
$$ -62081 -15665 28084 50876 17756 -7098 -9452 -1075 36601 15346 -1439 -17590 -496
13273d96N594l0048J2143N2576K7098q005q284r596k1034j5286J3841K4234n7375
$$ -496 5098 -24950 -12807 39769 66867 58862 50578 40982 19948 4662 18503 42737 -14638
13260a4638m3326P463K5702k4215Q975J5888k0219J6165M3005K461J3569O146
$$ -14638 -57964 -50501 -24799 -49014 -40039 -24151 -44370 -28205 14800 17261 30830 36976
13248C6976n6981l0427J9765J1046J245l8074o563m0098M594L5805M4307L637
$$ 36976 -20005 -50432 -30667 -19621 -18376 -56450 -63013 -103111 -98517 -62712 -18405 -14768
13236a4768K8449P186o127j0329R914j0527m3094Q003N0683J373j5176R88N182
$$ -14768 13681 20867 14740 4411 14325 3798 -39296 -31293 19390 20763 5587 6575 11757
13223A1757O180K3271r30n9769o475K7077J2407J5864j2454R64j2503l9090J267
$$ 11757 17937 41208 40278 -19491 -25966 1111 13518 29382 16928 17892 5389 -33701 -32434
13210c2434K703L516K632j8932j2442J0900J8875l762m068P757J4585l193P52
$$ -32434 -29731 -26215 -23583 -42515 -54957 -44057 -25182 -28944 -33012 -25255 -10670 -13863 -13111
13197a3111L1615K568m0013n762J7635m1234l5295K6910L7189p367k0994N97N5398
$$ -13111 18504 21072 -18941 -24703 -7068 -48302 -83597 -56687 -19498 -26865 -47859 -47262 8136
13184H136K0459k1876k9822k3027o007K2087J615k0262K8398M8191J861j3880
$$ 8136 28595 6719 -23103 -46130 -52137 -30050 -28435 -48697 -20299 27892 29753 15873
13172A5873k63J3056k5887k1169L5760J694K1761J8048K6920j0506j1130J0582
$$ 15873 15610 28666 2779 -18390 17370 19064 40825 58873 85793 75287 64157 74739
13160G4739J0826j7085l9939j5705j0151m4243K7601J1216J984P237l267O265
$$ 74739 85565 68480 28541 12836 2685 -41558 -13957 -2741 -757 6480 3213 9478
13148I478j1156j08L8763l616p082N372N131j979o468Q700o36l1831J4280P653
$$ 9478 -1678 -1786 36977 33361 26279 31651 36782 34803 28335 37035 36399 4568 18848 26501
13134B6501r258J8884l412k4267k753K7166R161k1486o21r693k6088K7393J6690
$$ 26501 17243 36127 32715 8448 5695 32861 42022 20536 19915 10222 -15866 11527 28217
13121B8217j5135j8489K2627j3017J97m4257K4358J2369Q716l872O287M0772j5000
$$ 28217 13082 -5407 17220 4203 4400 -39857 -15499 -3130 5586 1714 8001 48773 33773
13108C3773Q784K6709L5138L042n3800k9530J4076M142j0563j2325q466k6395
$$ 33773 42557 69266 104404 107446 53646 24116 38192 42334 31771 19446 10980 -15415
13096a5415o566L9105K0480J3070J2891J1902m723l2889J644j4723k288j0973
$$ -15415 -21981 17124 37604 50674 63565 75467 70744 37855 39499 24776 22488 11515
13084A1515k3438j337k39j0952k0091q887j2562R063K2566O2575J2289K2715k6986
$$ 11515 -11923 -13260 -13499 -24451 -44542 -53429 -65991 -56928 -34362 28213 40502 63217 36231
13071C6231k9073R97m326k1244k5008m092J3526K4290K5612k069l3837j0231K6184
$$ 36231 7158 8155 3829 -17415 -42423 -46515 -32989 -8699 16913 14844 -18993 -29224 -3040
13058c040q736L3517J9382l4337k0081k6410n469J2414J3539k1402K0444K5424
$$ -3040 -11776 21741 41123 6786 -13295 -39705 -45174 -32760 -19221 -40623 -20179 5245
13046E245j6635M8061N1994m0187k9849l8554l5090O072Q953K0513M758P099L251
$$ 5245 -11390 36671 88665 48478 18629 -19925 -55015 -48943 -39990 -19477 -14719 -7620 -4369
13033d369k1434J2019N0883K9790m2714l807K160l7216J9191K0934j6801j1819
$$ -4369 -25803 -13784 37099 66889 24175 20368 22528 -14688 4503 25437 8636 -3183
13021c183o653P285m515P825l7964J3701K0209L698l320j9572r782j3383J2278
$$ -3183 -9836 -2551 -7066 759 -37205 -23504 -3295 403 -2917 -22489 -32271 -45654 -33376
13008c3376q26Q798K6634O966l9548M207R894j9239P048M2450k130N841o299p818
$$ -33376 -34202 -25404 1230 8196 -31352 -27145 -17251 -36490 -29442 13008 10878 16719 10420 2602
12994B602o045j6686N072k3441r098k2960j8153J3099N7360j8118p085J1612R172
$$ 2602 -3443 -20129 -15057 -38498 -47596 -70556 -88709 -75610 -18250 -36368 -43453 -31841 -22669
12981b2669J9536j3661P593j6665k2065j0190L3705K2569m0612j9243J5138j71
$$ -22669 -3133 -16794 -9201 -25866 -47931 -58121 -24416 -1847 -42459 -61702 -46564 -46735
12969d6735O969K7030L93M744L7895J3297k6323K6464j4746l6162N896n683O148
$$ -46735 -39766 -12736 -12343 -7599 30296 43593 17270 43734 28988 -7174 -1278 -6961 -813
12956h13j2116N458k6631J2199N985m072L3878J3180L7719l3805k1436q561J5049
$$ -813 -12929 -7471 -34102 -21903 -15918 -19990 13888 27068 64787 30982 9546 985 16034
12943A6034k989J6126J5299l251k5316n8692j6426K745J3416L567P924K2728L0620
$$ 16034 13045 29171 44470 41219 15903 -42789 -59215 -56470 -43054 -39487 -31563 -8835 21785
12930B1785J2540l5265k4558r012J9294j4744O190m75O077k1363N711n269K3742
$$ 21785 34325 -940 -25498 -34510 -15216 -29960 -23770 -24245 -18168 -39531 -33820 -39089 -15347
12917a5347K5925k5258n459J7213j9812l2646p466K3796j3495j1337M7436L8159
$$ -15347 10578 -14680 -20139 -2926 -22738 -55384 -62850 -39054 -52549 -63886 -16450 21709
12905B1709K2583j1125K7059k1529k2853j1134J8198R863j172J450j1794R223
$$ 21709 44292 33167 60226 38697 15844 4710 22908 32771 31599 33049 21255 30478
12893C0478j8642j3264J1335K1868J2748l126m8175j4735L3937n718r778R801
$$ 30478 11836 -1428 9907 31775 44523 41397 -6778 -21513 12424 6706 -3072 6729
12881F729J2042N251k1263J0046j9777j0565j4455M11k601Q328j4818j2000J8491
$$ 6729 18771 24022 2759 12805 -6972 -17537 -31992 -31581 -34182 -25854 -40672 -52672 -34181
12868c4181J3932l068J3233P613n648k910k6606m8327L298K7326J2061j4446M97
$$ -34181 -20249 -23317 -10084 -2471 -8119 -11029 -37635 -85962 -82664 -55338 -43277 -57723 -57226
12855e7226L2090K452j9562P82o488K5327N5849l592m2739k3115K3500J2860l5256
$$ -57226 -25136 -22684 -42246 -41464 -47952 -22625 33224 29632 -13107 -36222 -12722 138 -35118
12842c5118N298L9649L2255O065n0889k4971k3711L2708J6190J0456K1078q759
$$ -35118 -29820 9829 42084 48149 -2740 -27711 -51422 -18714 -2524 7932 29010 20251
12830B0251k5838J1107J7312o385J2829j8695J1216j5832N679l620j4000j3211
$$ 20251 -5587 5520 22832 16447 29276 10581 21797 5965 11644 8024 -5976 -19187
12818a9187l323L021J9373J1002j1543k981Q687K336j5401P400K5484M3525n504
$$ -19187 -22510 -19489 -116 10886 -657 -3638 5049 7385 -8016 -616 24868 68393 62889
12805F2889k7053k4890k517J2212J1241J7533J4381L0332j1396m7347l6968J956
$$ 62889 35836 10946 8429 20641 31882 49415 63796 94128 82732 35385 -1583 373
12793C73J5761K671J1601j3271r6J1488r861M124K4929n822J074J0524j7545k1351
$$ 373 16134 18805 30406 17135 17039 28527 18666 22790 47719 41897 42971 53495 35950 14599
12779A4599j6401N942k9766J941K7470j6205k6074K6808R836Q857l3111k1775
$$ 14599 -1802 4140 -25626 -23685 3785 -12420 -38494 -11686 -1850 7007 -26104 -47879
12767d7879J3258J9844J8763P759l0267J3158L5389n103q671j9458q605J618K1861
$$ -47879 -34621 -14777 3986 11745 -18522 -5364 30025 24922 16251 -3207 -11812 -10194 11667
12754A1667J3141J3878M764l41q188o951L248J8259j9131m4968k4078J1280q871
$$ 11667 24808 38686 43450 43109 34921 27970 31218 49477 30346 -14622 -38700 -27420 -36291
12741c6291j9866k2736r20M9655J4569K013r258j042J420Q446k768K5237Q775
$$ -36291 -56157 -78893 -79813 -30158 -15589 -13576 -22834 -23876 -22456 -14010 -16778 8459 17234
12728A7234L0467m6871k6863m217K1031J8627l0057k9922P649j4958o485L3452
$$ 17234 47701 830 -26033 -30250 -9219 9408 -20649 -50571 -42922 -57880 -64365 -30913
12716c0913N5215q054J0257K4331L2949j8794J917k7848l6831P631o035k6607
$$ -30913 24302 16248 26505 50836 83785 64991 66908 39060 2229 9860 3825 -22782
12704b2782l5931j9346J7788L6696R549J628M161J1012j3191K1946L7949j4504
$$ -22782 -58713 -78059 -60271 -23575 -14026 -12398 -8237 2775 -10416 11530 49479 34975
12692C4975m040j5701l6280J0072N1765O1004P233p307m3589j2958P820O859J7716
$$ 34975 30935 15234 -21046 -10974 40791 101795 109028 101721 58132 45174 52994 59853 77569
12679G7569k1452k6409p694l2166k9331Q917L4386O477J9519L0824k5680m8041
$$ 77569 56117 29708 22014 -10152 -39483 -30566 3820 10297 29816 60640 34960 -13081
12667a3081j6485K9217K6514J5784j4048J4126n784p983j8926m3375J032L8731
$$ -13081 -29566 -349 26165 41949 27901 42027 36243 28260 9334 -34041 -33009 5722
12655E722o395J0239L857k5374o151O981l690K5768J9131j3691l9971j1995M956
$$ 5722 -673 9566 13423 -11951 -18102 -11121 -14811 10957 30088 16397 -23574 -35569 -30613
12642c0613L7899M8821k6724l9110j7639O0845L154J1514j40n645j1285R60J4753
$$ -30613 7286 56107 29383 -9727 -27366 33479 36633 48147 48007 42362 31077 32037 46790
12629D6790j719j9033p01k2016L392L151K6543k4901k4340l1426P717K6671K7343
$$ 46790 45071 26038 25337 3321 6713 9864 36407 11506 -12834 -44260 -36543 -9872 17471
12616A7471J7686p433j6900k1686K9474K7224k2628l0974J6647k0163k1551K3062
$$ 17471 35157 27724 10824 -10862 18612 45836 23208 -7766 8881 -11282 -32833 -9771
12604i771L7380r634l2295J4461L4487L4945k1027j6626k098o421M3946n263l4025
$$ -9771 27609 17975 -14320 141 34628 69573 48546 31920 29822 23401 67347 62084 28059
12591B8059l4997R424J5489j5811J1260J8029m0032O920J2900J552M957q999M3523
$$ 28059 -6938 2486 17975 2164 13424 31453 -8579 -1659 11241 12793 17750 8751 52274
12578E2274k653j3955N919k4476q400K8342J6691l7681k9852R538K9813l0816
$$ 52274 49621 35666 41585 17109 8709 37051 53742 16061 -13791 -4253 25560 -5256
12566e256j1445J6453k2788o134L5002O144m949k816l228q958M99k7116k3152
$$ -5256 -16701 -248 -23036 -29170 5832 11976 7027 4211 983 -7975 -7476 -34592 -57744
12553e7744K1554J7046J3363k5067J0805J3119K7608J9485L9797L3266P19l5369
$$ -57744 -36190 -19144 -5781 -30848 -20043 -6924 20684 40169 79966 113232 113951 78582
12541G8582m8823q626J7257k9145k2263m979K6425j3711O387M914m3966k6595
$$ 78582 29759 21133 38390 9245 -13018 -17997 8428 -5283 1104 6018 -37948 -64543
12529f4543Q297l9171L7292M2076J2628n270L1806r356R481l674k2848p866l8504
$$ -64543 -56246 -95417 -58125 -16049 -3421 -8691 23115 13759 23240 19566 -3282 -11148 -49652
12516d9652n120K5622K8210j5583m8740J0012L9450l347j973L2396Q377j2011
$$ -49652 -54772 -29150 -940 -16523 -65263 -55251 -15801 -19148 -21121 11275 19652 7641
12504G641L963m652l5326R442K2912q002r716K5957L3885K3192m1714m907j4552
$$ 7641 11604 6952 -28374 -18932 3980 -4022 -13738 12219 46104 69296 27582 22675 8123
12491H123k7622m947L0181k7696j5557J3369L9444K795o685n597J1103J3072j6871
$$ 8123 -19499 -24446 5735 -21961 -37518 -24149 15295 18090 11405 5808 16911 29983 13112
12478A3112p20J4638l1545J1285R706k0325K0052k9732r562M2732L406k3791j1613
$$ 13112 12392 27030 -4515 6770 16476 -3849 16203 -13529 -23091 19641 23047 -744 -12357
12465a2357k2451o844J5110l5782r576P546K659R230M1474J0935N554L1593j501
$$ -12357 -34808 -41652 -26542 -62324 -71900 -64354 -61695 -52465 -10991 -56 5498 37091 35590
12452C5590j8452K7214l6820l4403J7642L5863k339k8258l0001K4306K5559n91
$$ 35590 17138 44352 7532 -26871 -9229 26634 24295 -3963 -33964 -9658 15901 15310
$$ [...]
##END NTUPLES=NMR SPECTRUM
##END=
