##TITLE=Analysis number 313312
Compound Code rf 03759
Project Code adrs
Chemist Name prosynth
##JCAMPDX= 6.0         $$ Bruker NMR JCAMP-DX V2.0
##DATA TYPE= NMR SPECTRUM
##DATA CLASS= NTUPLES
##ORIGIN= Bruker BioSpin GmbH
##OWNER= NMR
$$ XWIN-NMR		Version 3.5
$$ Fri Sep  2 13:40:06 2005 GMT Daylight Time (UT+1h)  MAYBRIDGE\NMR@NMR_250MHZ
##.OBSERVE FREQUENCY= 250.131544655141
##.OBSERVE NUCLEUS= ^1H
##.ACQUISITION MODE= SIMULTANEOUS (DQD)
##.ACQUISITION SCHEME= undefined
##.AVERAGES= 16
##.DIGITISER RES= 18
##SPECTROMETER/DATA SYSTEM= dpx250
##.PULSE SEQUENCE= zg30
##.SOLVENT NAME= DMSO
##.SHIFT REFERENCE= (INTERNAL, DMSO, 0, 16.522)
##AUDIT TRAIL= $$ (NUMBER, WHEN, WHO, WHERE, WHAT)
$$ ##TITLE= Audit trail, XWIN-NMR		Version 3.5
$$ ##JCAMPDX= 5.01
$$ ##ORIGIN= Bruker BioSpin GmbH
$$ ##OWNER= NMR
$$ C:\u/data/dgb/nmr/ADRS/8960/pdata/1/auditp.txt
$$ ##AUDIT TRAIL=  $$ (NUMBER, WHEN, WHO, WHERE, WHAT)
(   1,<2005-09-02 13:39:49.36 +100>,<MAYBRIDGE\NMR>,<NMR_250MHZ>,
      <created by zg, POWCHK disabled, PULCHK disabled
       configuration hash MD5:
       62 19 C7 07 E1 42 D1 B7 37 6C 3D D0 77 39 F9 E6
       data hash MD5: 64K
       42 DB BF 1D F5 1C 4D 11 AB D2 FB 1B C3 F8 72 D8>)
(   2,<2005-09-02 13:40:00.27 +100>,<MAYBRIDGE\NMR>,<NMR_250MHZ>,
      <Start of raw data processing
       ef LB = 0.3 FT_mod = 6 PKNL = 1 SI = 32K 
       data hash MD5: 32K
       DC 0B BF 45 D7 B2 76 97 5E CE 28 17 97 CA 6E A8>)
(   3,<2005-09-02 13:40:01.78 +100>,<MAYBRIDGE\NMR>,<NMR_250MHZ>,
      <apk 
       data hash MD5: 32K
       B4 BC 15 06 76 7B 46 70 B0 81 C3 64 F1 1E 88 B7>)
(   4,<2005-09-02 13:40:02.50 +100>,<MAYBRIDGE\NMR>,<NMR_250MHZ>,
      <abs ABSG = 5 
       data hash MD5: 32K
       BB 62 EE F0 78 76 43 0D C7 8F 34 13 60 F0 14 85>)
$$ ##END=
$$ 
$$ hash MD5
$$ 5B 24 BC 96 4B B8 60 15 AE 22 3A E9 66 BA DE 1E
##$RELAX= 
##$RELAX= 
##$RELAX= 
##$RELAX= 
##$RELAX= 
##$RELAX= 
##$RELAX= 
$$ Bruker specific parameters
$$ --------------------------
##$DU= <C:\u>
##$EXPNO= 8960
##$NAME= <ADRS>
##$PROCNO= 1
##$TYPE= <nmr>
##$USER= <dgb>
##$AMP= (0..31)
100 100 100 100 100 100 100 100 100 100 100 100 100 100 100 100 100 100 
100 100 100 100 100 100 100 100 100 100 100 100 100 100 
##$AQSEQ= 0
##$AQ_mod= 3
##$AUNM= <au_zg>
##$AUTOPOS= <27 >
##$BF1= 250.13
##$BF2= 250.13
##$BF3= 250.13
##$BF4= 250.13
##$BF5= 500.13
##$BF6= 500.13
##$BF7= 500.13
##$BF8= 500.13
##$BYTORDA= 1
##$CFDGTYP= 0
##$CFRGTYP= 5
##$CHEMSTR= <none>
##$CNST= (0..31)
1 1 145 1 1 1 1 1 1 1 1 1 1 1 1 1 1 1 1 1 1 1 1 1 1 1 1 1 1 1 1 1 
##$CPDPRG= <>
##$CPDPRG1= <>
##$CPDPRG2= <>
##$CPDPRG3= <>
##$CPDPRG4= <mlev>
##$CPDPRG5= <mlev>
##$CPDPRG6= <mlev>
##$CPDPRG7= <mlev>
##$CPDPRG8= <mlev>
##$CPDPRGB= <>
##$CPDPRGT= <>
##$D= (0..31)
0 1 0 0 0 0 0 0 0 0.06 0 0 0 0 0 0 0.0002 0 0 0 0 0 0 0 0 0 0 0 0 0 0 
0 
##$DATE= 1125664788
##$DBL= (0..7)
120 120 120 120 120 120 120 120 
##$DBP= (0..7)
150 150 150 150 150 150 150 150 
##$DBP07= 0
##$DBPNAM0= <>
##$DBPNAM1= <>
##$DBPNAM2= <>
$$ [...]
##$SUBNAM7= <"">
##$SUBNAM8= <"">
##$SUBNAM9= <"">
##$SW= 20.6930455092707
##$SWIBOX= (0..15)
0 0 3 0 0 0 0 0 0 0 0 0 0 0 0 0 
##$SW_h= 5175.983436853
##$TD= 65536
##$TD0= 1
##$TE= 295.16
##$TE2= 300
##$TE3= 300
##$TEG= 300
##$TL= (0..7)
0 120 120 120 120 120 120 120 
##$TP= (0..7)
150 150 150 150 150 150 150 150 
##$TP07= 0
##$TPNAME0= <>
##$TPNAME1= <>
##$TPNAME2= <>
##$TPNAME3= <>
##$TPNAME4= <>
##$TPNAME5= <>
##$TPNAME6= <>
##$TPNAME7= <>
##$TPOAL= (0..7)
0.5 0.5 0.5 0.5 0.5 0.5 0.5 0.5 
##$TPOFFS= (0..7)
0 0 0 0 0 0 0 0 
##$TUNHIN= 0
##$TUNHOUT= 0
##$TUNXOUT= 0
##$USERA1= <user>
##$USERA2= <user>
##$USERA3= <user>
##$USERA4= <user>
##$USERA5= <user>
##$V9= 5
##$VALIST= <valist>
##$VCLIST= <CCCCCCCCCCCCCCC>
##$VD= 0
##$VDLIST= <DDDDDDDDDDDDDDD>
##$VPLIST= <PPPPPPPPPPPPPPP>
##$VTLIST= <TTTTTTTTTTTTTTT>
##$WBST= 1024
##$WBSW= 4
##$XGAIN= (0..3)
0 0 0 0 
##$XL= 0
##$YL= 0
##$YMAX_a= 328758
##$YMIN_a= -285980
##$ZGOPTNS= <>
##$ZL1= 120
##$ZL2= 120
##$ZL3= 120
##$ZL4= 120
##$ABSF1= 16.522
##$ABSF2= -4.171173
##$ABSG= 5
##$ABSL= 3
##$ALPHA= 0
##$AQORDER= 0
##$ASSFAC= 0
##$ASSFACI= 0
##$ASSFACX= 0
##$ASSWID= 0
##$AUNMP= <proc_1d>
##$AZFE= 0.1
##$AZFW= 0.1
##$BCFW= 0
##$BC_mod= 0
##$BYTORDP= 0
##$COROFFS= 0
##$CY= 12.5
##$DATMOD= 1
##$DC= 0
##$DFILT= <>
##$DTYPP= 0
##$F1P= 14.0000005364418
##$F2P= -0.99999901652339
##$FCOR= 0.5
##$FTSIZE= 32768
##$FT_mod= 6
##$GAMMA= 0
##$GB= 0
##$INTBC= 1
##$INTSCL= 1
##$ISEN= 128
##$LB= 0.3
##$LEV0= 0
##$LPBIN= 0
##$MAXI= 10000
##$MC2= 0
##$MEAN= 0
##$ME_mod= 0
##$MI= 0
##$NCOEF= 0
##$NC_proc= -3
##$NLEV= 6
##$NOISF1= 0
##$NOISF2= 0
##$NSP= 0
##$NTH_PI= 0
##$NZP= 0
##$OFFSET= 16.522
##$PC= 1
##$PHC0= -84.8327
##$PHC1= 11.37453
##$PH_mod= 1
##$PKNL= yes
##$PPARMOD= 0
##$PSCAL= 4
##$PSIGN= 0
##$REVERSE= no
##$SF= 250.13
##$SI= 32768
##$SIGF1= 0
##$SIGF2= 0
##$SINO= 400
##$SIOLD= 32768
##$SREGLST= <1H.DMSO>
##$SSB= 0
##$STSI= 32768
##$STSR= 0
##$SW_p= 5175.98343685301
##$SYMM= 0
##$S_DEV= 0
##$TDeff= 65536
##$TDoff= 0
##$TI= <Analysis number 999999
Compound Code 99
Book Reference 9
Project Code 9>
##$TILT= no
##$TM1= 0
##$TM2= 0
##$TOPLEV= 0
##$USERP1= <user>
##$USERP2= <user>
##$USERP3= <user>
##$USERP4= <user>
##$USERP5= <user>
##$WDW= 1
##$XDIM= 32768
##$YMAX_p= 303646024
##$YMIN_p= -508648
$$ End of Bruker specific parameters
$$ ---------------------------------
##NTUPLES= NMR SPECTRUM
##VAR_NAME=  FREQUENCY,     SPECTRUM/REAL,   SPECTRUM/IMAG
##SYMBOL=    X,             R,               I
##VAR_TYPE=  INDEPENDENT,   DEPENDENT,       DEPENDENT
##VAR_FORM=  AFFN,          ASDF,            ASDF
##VAR_DIM=   32768,         32768,           32768
##UNITS=     HZ,            ARBITRARY UNITS, ARBITRARY UNITS
##FACTOR=    0.157963299565203, 1,           1
##FIRST=     4132.6476996994, 0,             0
##LAST=      -1043.33573715361, 0,           0
##MIN=       -1043.33573715361, -508648,     0
##MAX=       4132.6476996994, 303646024,     0
$$ Real data points
##PAGE= N=1
##DATA TABLE= (X++(R..R)), XYDATA
$$ [...]
$$ plain form
16457 -3326 44612 25232 15738 28545 26874 -35382 -36186 17312 41617 36258 24095 -18647 -63298
16444 -63298 -51614 -32692 -58540 -54412 -47267 -12840 180 17257 11084 24869 43011 -18967
16432 -18967 -11363 -5061 -18188 6516 31177 -18063 -57288 -66896 -35022 22711 2132 -19131
16420 -19131 3743 -285 -35591 -56155 -20899 -5776 1022 -29503 -75518 -36047 18109 -6683
16408 -6683 -49535 -46221 -47161 -47921 -32391 -14854 6512 27794 -18629 -51904 9039 19523 -6394
16395 -6394 -27873 -32385 -23765 -28571 -26693 -12726 -4282 -2411 7933 26891 83112 58049 21490
16382 21490 -18373 -53639 -85264 -25487 -26071 -53622 -60849 -20911 20172 -1392 -36479 -32989
16370 -32989 5328 9446 10676 -16325 -36969 2251 25000 50779 34328 3598 11934 -3291
$$ packed form
16457c326M7938j9380r494J2807j671o2256q04N3498K4305n359j2163m2742m4651
16444f3298J1684J8922k5848M128P145L4427J3020J7077o173J3785J8142o1978
16432a8967P604O302j3127K4704K4661m9240l9225r608L1874N7733k0579k1263
16420a9131K2874m028l5306k0564L5256J5123O798l0525m6015L9471N4156k4792
16408f683m2852L314r40p60J5530J7537K1366K1282m6423l3275O0943J0484k5917
16395f394k1479m512Q620m806J878J3967Q444J871J0344J8958N6221k5063l6559
16382B1490l9863l5266l1625N9777n84k7551p227L9938M1083k1564l5087L490
16370c2989L8317M118J230k7001k0644L9220K2749K5779j6451l0730Q336j5225
$$ plain form
16358 -3291 -35333 -39274 -38158 -3362 12776 13689 21306 45098 -3409 -50843 -25976 -49426 -71168
16345 -71168 -45085 -8400 -29138 -22252 5264 -4835 -38556 -14951 -62698 -81033 -34222 -66978
16333 -66978 -95961 -69683 -21367 1718 9422 14462 2335 8963 8760 25331 44331 18462 6108
16320 6108 -11953 -16878 11945 18252 24962 -2504 -7454 10109 -1030 7489 34933 12517 -7572
16307 -7572 16176 21961 -1936 -30807 -20130 -7463 6696 62 -7816 709 -33862 -15357 -2201
16294 -2201 -22147 -13148 14542 -2357 -44549 -43185 -79817 -58999 -26991 -32139 -35390 -40232 -54401
16281 -54401 -78617 -38426 -16776 -18559 -11741 -19819 -57408 -76480 -54262 -35694 -29480 -29626 -45689
16268 -45689 -64782 -59198 -46223 -79448 -80713 -74888 -58809 -58359 -41229 -54107 -58338 -113822 -78981
$$ packed form
16358c291l2042l941J116L4796J6138R13P617K3792m8507m7434K4867k3450k1742
16345g1168K6083L6685k0738O886K7516j0099l3721K3605m7747j8335M6811l2756
16333f6978k8983K6278M8316K3085P704N040j2127O628k03J6571J9000k5869j2354
16320F108j8061m925K8823O307O710k7466m950J7563j1139Q519K7444k2416k0089
16307g572K3748N785k3897k8871J0677J2667J4159o634p878Q525l4571J8505J3156
16294b201j9946Q999K7690j6899m2192J364l6632K0818L2008n148l251m842j4169
16281e4401k4216M0191K1650j783O818q078l7589j9072K2218J8568O214j46j6063
16268d5689j9093N584J2975l3225j265N825J6079M50J7130j2878m231n5484L4841
$$ plain form
16255 -78981 -47890 -34579 16396 13266 29780 28715 35038 15709 168 -13622 -59796 -50581
16243 -50581 1307 8270 -49564 -49113 3089 14260 -12968 10823 41489 29849 22888 30999 14827
16230 14827 -12361 -10144 43089 43348 1523 2667 12466 7736 22153 31525 16573 32675 48650
16217 48650 41695 -6216 -16311 13470 -2111 -41907 -42453 1545 32199 26911 -29530 -23225 -4479
16204 -4479 2521 -13244 7305 46329 59954 54864 102192 124623 47919 14253 31265 17672
16192 17672 -7060 -7745 1391 -3826 -1545 -6343 15685 42414 25624 22470 47899 69043 30320
16179 30320 -4191 32839 41838 18645 8057 9909 6531 -45229 -56899 -57677 -50532 -28624 -9461
16166 -9461 -7098 -28174 -10484 -8112 28276 883 -11388 -25364 -23473 -12267 10030 10850 14675
$$ packed form
16255g8981L1091J3311N0975l130J6514j065O323j9329j5541j3790m6174R215
16243e0581N1888O963n7834M51N2202J1171k7228K3791L0666j1640o961Q111j6172
16230A4827k7188K217N3233K59m1825J144R799m730J4417R372j4952J6102J5975
16217D8650o955m7911j0095K9781j5581l9796n46M3998L0654n288n6441O305J8746
16204d479P000j5765K0549L9024J3625n090M7328K2431p6704l3666J7012j3593
16192A7672k4732o85R136n217K281m798K2028K6729j6790l154K5429K1144l8723
16179C0320l4511L7030Q999k3193j0588J852l378n1760j1670p78P145K1908J9163
16166i461K363k1076J7690K372L6388k7393j2271j3976J891J1206K2297Q20L825
$$ plain form
16153 14675 21790 21488 13927 15068 3252 -8967 -15771 -22231 -28730 -41251 -53511 -20666 -19701 -21722
16139 -21722 -35736 -41730 -56355 -49895 -56362 -48748 -42066 -22631 28617 63335 32257 42283 39356
16126 39356 12982 22220 42274 29004 8011 -9613 -14150 -29443 -16610 7228 9367 -6150
16114 -6150 32195 45505 68134 59543 30467 25354 20935 27847 46844 58988 70108 44780 38021
16101 38021 63443 70231 64987 29128 18448 11791 -15526 -36888 -24496 -21381 -27723 11337 7789
16088 7789 12731 11347 -2445 -19596 -30095 -994 8359 -46991 -34400 9272 5033 9869 -22590
16075 -22590 -64386 -89561 -61532 -53238 -30035 -2006 -29303 -32135 -36313 -63092 -68538 -55623
16063 -55623 -60021 -35381 -29583 1163 -5679 -22223 -57165 -38404 -50337 -85709 -48737 4885
$$ packed form
16153A4675P115l02p561J141j1816j2219o804o460o499j2521j2260L2845R65k021
16139b1722j4014n994j4625O460o467P614O682J9435N1248L4718l1078J0026k927
16126C9356k6374R238K0054j3270k0993j7624m537j5293J2833K3838K139j5517
16114f150L8345J3310K2629q591k9076n113m419O912J8997J2144J1120k5328o759
16101C8021K5422O788n244l5859j0680o657k7317k1362J2392L115o342L9060l548
16088G789M942j384j3792j7151j0499K9101R353n5350J2591M3672m239M836l2459
16075b2590m1796k5175K8029Q294K3203K8029k7297k832m178k6779n446J2915
16063e5623m398K4640N798L0746o842j6544l4942J8761j1933l5372L6972N3622
$$ plain form
16051 4885 28753 37042 35138 -18788 -37888 -13442 -5028 -6720 -35951 -64803 -63176 -50286 -27452
16038 -27452 -26932 6660 -17394 -41150 -43370 -26576 -15923 1268 8466 7475 9373 7934 27761
16025 27761 71577 81056 43535 40604 11267 -19194 -25559 12310 26711 14506 1354 -60296
16013 -60296 -87020 -62245 -113842 -79478 -38631 -45171 -65927 -46474 -11309 13759 35510 42610
16001 42610 44613 36643 58898 54827 52278 44368 -6946 4710 22662 40639 49930 53615 56958
15988 56958 84292 44350 1079 -19371 -44212 -37250 -44061 -64980 -27536 -17245 -17952 1673
15976 1673 59479 72962 32960 -14997 -8572 22391 -2047 -12047 -10656 18252 60904 59415
15964 59415 22605 -3961 -5361 6069 28845 1804 -58565 -46476 -19668 -18744 2953 -5813
$$ packed form
16051D885K3868Q289j904n3926j9100K4446Q414j692k9231k8852J627J2890K2834
16038b7452N20L3592k4054k3756k220J6794J0653J7191P198r91J898j439J9827
16025B7761M3816R479l7521k931k9337l0461o365L7869J4401j2205j3152o1650
16013f0296k6724K4775n1597L4364M0847o540k0756J9453L5165K5068K1751P100
16001D2610K003p970K2255m071k549p910n1314J1656J7952J7977R291L685L343
15988E6958K7334l9942m3271k0450k4841O962o811k0919L7444J0291p07J9625
15976A673N7806J3483m0002m7957O425L0963k4438j0000J391K8908M2652j489
15964E9415l6810k6566j400J1430K2776k7041o0369J2089K6808R24K1697q766
$$ plain form
15952 -5813 -3605 18138 48596 49297 30508 29758 5656 18925 41565 -34305 -83955 -86153 -91256
15939 -91256 -64639 -43613 -20601 13419 14223 15907 23838 42661 39375 21163 -22205 -57442 -55433
15926 -55433 -66207 -73705 -47933 -23806 -36487 -57200 -51816 3633 6928 -7915 -34728 -22628
15914 -22628 6742 -8546 2467 1621 -16448 211 37180 9371 -40073 -51240 -17237 -20951
15902 -20951 5216 12540 -2094 -8606 -27288 -22642 -5107 22736 50052 61806 37553 50421
15890 50421 54417 59189 57399 40240 -788 -14080 -22899 -27991 -19567 -29559 -24426 -64290 -58256
15877 -58256 -60872 -91338 -109818 -68420 -26958 -48250 -38318 -6448 -25028 -47865 -61867 -64209
15865 -64209 -8227 3860 28489 74736 81984 40833 18279 7136 900 -68803 -97883 -54344
$$ packed form
15952e813K208K1743L0458P01j8789p50k4102J3269K2640p5870m9650k198n103
15939i1256K6617K1026K3012L4020Q04J684P931J8823l286j8212m3368l5237K009
15926e5433j0774p498K5772K4127j2681k0713N384N5449L295j4843k6813J2100
15914b2628K9370j5288J1013q46j8069J6659L6969k7809m9444j1167L4003l714
15902b0951K6167P324j4634o512j8682M646J7535K7843K7316J1754k4253J2868
15890E0421L996M772j790j7159m1028j3292q819n092Q424r992N133l9864O034
15877e8256k616l0466j8480M1398M1462k1292R932L1870j8580k2837j4002k342
15865f4209N5982J2087K4629M6247P248m1151k2554j1143o236o9703k9080M3539
$$ plain form
15853 -54344 15182 27023 3675 19709 39934 37944 -1598 5284 9452 -44370 -83694 -112048
15841 -112048 -96672 -57715 -4635 6712 -9883 -20999 -50845 -15357 11904 18456 21871 24802
15829 24802 -3349 -17619 -76775 -79529 -56047 -30927 -5888 -43192 -43451 -57960 -42624 -62357
15817 -62357 -86026 -68898 -26051 -13828 -3439 8105 -40561 -33378 -7179 -10462 -45407 -62937
15805 -62937 -51997 1251 -18480 -26679 3225 25105 43707 46016 45556 26525 -30734 -32474 7624
15792 7624 12366 14937 -4288 -9676 -36952 -38849 -44710 -59226 -53041 -21429 4647 -6852 -7346
15779 -7346 15049 34581 25239 1014 -5250 -6247 -7198 47659 94522 92161 16945 -10876 -10744 14700
15765 14700 10390 -11396 -32007 -60767 -35353 -32535 -57509 -26297 5489 31022 29254 -7423
$$ packed form
15853e4344O9526J1841k3348J6034K0225j990l9542O882M168n3822l9324k8354
15841a12048J5376L8957N3080J1347j6595j1116k9846L5488K7261O552L415K931
15829B4802k8151j4270n9156k754K3482K5120K5039l7304k59j4509J5336j9733
15817f2357k3669J7128M2847J2223J0389J1544m8666P183K6199l283l4945j7530
15805f2937J0940N3248j9731q199K9904K1880J8602K309m60j9031n7259j740M0098
15792G624M742K571j9225n388k7276j897n861j4516O185L1612K6076j1499m94
15779g346K2395J9532r342k4225o264r97r51N4857M6863k361p5216k7821J32K5444
15765A4700m310k1786k0611k8760K5414K818k4974L1212L1786K5533j768l6677
$$ plain form
15753 -7423 -15601 4960 9452 11157 19759 41833 6443 -29065 -52363 -32292 40902 32742 24286
15740 24286 35556 11134 -1729 15577 43213 59618 28474 -2325 -8317 3949 -4526 14310
15728 14310 8734 44578 80086 24164 -37930 -40253 11734 36261 50058 22930 -28691 -64737
15716 -64737 -46633 22624 27345 -23477 -34952 -73827 -111527 -62814 -64621 -61357 -46459 -55779
15704 -55779 -54902 -33324 -35269 -56650 -65134 -60855 -84087 -74733 -45930 -40430 -10096 43431 74480
15691 74480 63811 16364 13924 11863 -45325 -60213 -46773 -30042 -28675 -50881 -53161 -31806
15679 -31806 8327 13229 31200 10543 30070 3939 -36660 -19019 23476 43605 19730 42145
15667 42145 75373 64020 28612 -19602 -26355 -43918 -35081 -17582 7518 14896 36055 59242
$$ packed form
15753g423q178K0561M492J705Q602K2074l5390l5508k3298K0071P3194q160q456
15740B4286J1270k4422j2863J7306K7636J6405l1144l0799n992J2266q475J8836
15728A4310n576L5844L5508n5922o2094k323N1987K4527J3797k7128n1621l6046
15716f4737J8104O9257M721n0822j1475l8875l7700M8713j807L264J4898r320
15704e5779Q77K1578j945k1381q484M279k3232R354K8803N500L0334N3527L1049
15691G4480j0669m7447k440k061n7188j4888J3440J6731J367k2206k280K1355
15679c1806M0133M902J7971k0657J9527k6131m0599J7641M2495K0129k3875K2415
15667D2145L3228j1353l5408m8214o753j7563Q837J7499K5100P378K1159K3187
$$ plain form
15655 59242 46452 15027 23760 17671 -37674 -44567 -8655 -23895 -16048 -25481 -39996 -64675 -83852
15642 -83852 -71419 -32599 16559 59336 39927 3804 17630 30287 14927 -3427 -16062 -37715
15630 -37715 -43985 -42036 -50312 -53367 -55793 -79366 -78244 -88698 -79524 -46862 -4783 44689 51255
15617 51255 8426 -30763 -1975 39964 14108 -28576 10422 26954 -3184 -46515 -53393 -46982
15605 -46982 -40610 -17193 -6183 18170 -22549 -53214 -49835 -37827 -25587 -45990 -63010 -47955
15593 -47955 -5893 13083 -27291 -54510 -46549 -39821 -26327 -54537 -57760 -34118 1317 -2583
15581 -2583 -12603 -30075 -25120 -12082 18495 38714 7960 17278 8402 -6390 -31789 -4094
15569 -4094 -9523 -44831 -70844 -49369 -48808 -84706 -69448 -59641 -58767 -84975 -63721 -75982 -45996
$$ packed form
15655E9242j2790l1425Q733o089n5345o893L5912j5240P847r433j4515k4679j9177
15642h3852J2433L8820M9158M2777j9409l6123J3826J2657j5360j8354j2635k1653
15630c7715o270J949q276l055k426k3573J122j0454R174L2662M2079M9472O566
15617E1255m2829l9189K8788M1939k5856m2684L8998J6532l0138m3331o878O411
15605d6982O372K3417J1010K4353m0719l0665L379J2008J2240k0403j7020J5055
15593d7955M2062J8976m0374k7219P961O728J3494k8210l223K3642L5435l900
15581b583j0020j7472M955J3038L0577K0219l0754R318q876j4792k5399K7695
15569d094n429l5308k6013K1475N61l5898J5258R807Q74k6208K1254j2261K9986
$$ plain form
15556 -45996 -57229 -72797 -22995 -21220 -4195 18473 68161 86161 57003 43697 56313 22704
15544 22704 -14437 -18071 -843 13507 16332 8740 -3774 -14495 11467 1709 -28352 -35224 -19997
15531 -19997 -10840 -13169 -36476 -23996 -9729 -30430 -43704 -20957 -36614 -56757 -42579 -29897
15519 -29897 -16084 -5186 -12390 -43220 -65370 -54356 -41136 -15553 -31273 -63805 -37024 -50013
15507 -50013 -51651 -34721 -6490 21892 -31028 -19900 -19370 -24241 -22002 21371 18516 -28166 -37753
15494 -37753 -35583 -53722 -61211 -47975 -22759 1315 -5500 -16377 -7217 -2613 11570 -11880 -19920
15481 -19920 -46752 -57941 -76167 -66105 -30411 -8088 -56759 -44995 -13808 9164 14601 -5751
15469 -5751 -35192 -28345 -21601 -23967 -8655 1297 9904 32497 23382 34881 66898 56445 67608
$$ packed form
15556d5996j1233j5568M9802J775J7025K2668M9688J8000k9158j3306J2616l3609
15544B2704l7141l634J7228J4350K825p592j2514j0721K5962r758l0061o872J5227
15531a9997R157k329k3307J2480J4267k0701j3274K2747j5657k0143J4178J2682
15519b9897J3813J0898p204l0830k2150J1014J3220K5583j5720l2532K6781j2989
15507e0013j638J6930K8231K8382n2920J1128N30m871K239M3373k855m6682r587
15494c7753K170j8139p489J3236K5216K4074o815j0877R160M604J4183k3450q040
15481a9920k6832j1189j8226J0062L5694K2323m8671J1764L1187K2972N437k0352
15469e751k9441O847O744k366J5312R952Q607K2593r115J1499L2017j0453J1163
$$ plain form
15456 67608 42634 -8001 -29544 -37094 -61998 -52941 -61426 -64887 -42291 -38191 -5000 -14977 21040
15443 21040 30577 31663 52986 38090 9999 -21290 -37204 -12828 -4933 4915 13109 39623 -11909
15430 -11909 -31227 4368 -12703 -47290 -41353 -18147 -26318 -67929 -102397 -30930 -7403 8021
15418 8021 26892 41108 28004 20148 5065 11741 -1366 -9266 13940 -53260 -48791 4270 31997
15405 31997 44808 62118 81877 27744 35833 53803 64539 41902 16885 -8306 -24129 -73762
15393 -73762 -82765 -96993 -117965 -110933 -98751 -77454 -40337 -42623 -72931 -82526 -74880 -61290 -43613
15380 -43613 2819 -10543 -51754 -86804 -9987 5914 -14864 -5140 -20753 -3087 -15828 -41442
15368 -41442 -46321 -31655 -16912 30509 55416 24463 -3008 -71348 -83960 -109785 -91991 -42251
$$ packed form
15456F7608k4974n0635k1543p550k4904R057q485l461K2596M100L3191r977L6017
15443B1040R537J086K1323j4896k8091l1289j5914K4376P895R848Q194K6514n1532
15430a1909j9318L5595j7071l4587N937K3206q171m1611l4468P1467K3527J5424
15418H021J8871J4216j3104p856j5083O676j3107p900K3206o7200M469N3061K7727
15405C1997J2811J7310J9759n4133Q089J7970J0736k2637k5017k5191j5823m9633
15393g3762r003j4228k0972P032J2182K1297L7117k286l0308r595P646J3590J7677
15380d3613M6432j3362m1211l5050P6817J5901k0778R724j5613J7666j2741k5614
15368d1442m879J4666J4743M7421K4907l0953k7471o8340j2612k5825J7794M9740
$$ plain form
15356 -42251 -18907 -17151 928 -48042 -38823 24050 18761 26361 35822 13364 -18187 -19926 -431
15343 -431 -32265 6924 -1760 -24173 -8371 22791 22820 2300 -39864 -24333 6857 33988 24118
15330 24118 -39702 -76167 -495 25909 -5756 8866 29686 11774 -47188 -67906 -44488 -45540
15318 -45540 -84072 -123857 -82829 -80677 -83380 -64106 -51090 -24113 21354 24386 -23472 -13038
15306 -13038 17785 3219 -15163 3851 11624 39043 7856 -4585 245 -11909 5241 16309
15294 16309 -18275 -10956 34799 64983 57303 51106 15080 6449 1104 29202 59682 17089 -10902
15281 -10902 -8032 11255 30532 77303 17610 -23370 -4707 -442 -33971 -46155 8694 12598
15269 12598 -29556 -36809 -8383 -1144 18292 -39713 -28736 -40999 -73711 -76095 -28998 -37363
$$ packed form
15356d2251K3344J756J8079m8970R219O2873n289P600R461k2458l1551j739J9495
15343d31l1834L9189q684k2413J5802L1162K9k0520m2164J5531L1190K7131r870
15330B4118o3820l6465P5672K6404l1665J4622K0820j7912n8962k0718K3418j052
15318d5540l8532l9785M1028K152k703J9274J3016K6977M5467L032m7858J0434
15306a3038L0823j4566j8382J9014P773K7419l1187j2441M830j2154J7150J1068
15294A6309l4584P319M5755L0184p680o197l6026q631n345K8098L0480m2593k7991
15281a0902K870J9287J9277M6771n9693m0980J8663M265l3529j2184N4849L904
15269A2598m2154p253K8426P239J9436n8005J0977j2263l2712k384M7097q365
$$ plain form
15257 -37363 -76477 -46986 -23265 -65226 -98939 -107546 -98333 -63305 -24524 -32107 -37722 -37291 -18584
15244 -18584 -17310 12167 32603 13806 2760 16552 -46295 -84619 -59605 -9396 14043 -12625
15232 -12625 8332 4199 -37479 -7637 24591 49405 48375 2772 -46876 -25020 -9820 -24749
15220 -24749 -20978 -17059 -28945 -35519 -49573 -37825 -35597 -27812 -20051 -69867 -27126 -26930 -24180
15207 -24180 -11268 22167 51928 15231 1777 -1944 -2954 -2 -15320 -31020 -40304 1132
15195 1132 -13515 -29268 -21155 -18527 -20802 6382 -1795 18524 -21486 -86496 -94051 -62607 -56646
15182 -56646 -49558 -38015 -41492 -14140 13911 -13042 -31481 -24500 -10332 3606 5716 -6598
15170 -6598 -48488 -47515 -71721 -42788 -26129 17364 15532 -7633 -1276 -4173 -90156 -139276 -136278
$$ packed form
15257c7363l9114K9491K3721m1961l3713q607R213L5028L8781p583n615M31J8707
15244a8584J274K9477K0436j8797j1046J3792o2847l8324K5014N0209K3439k6668
15232a2625K0957m133m1678K9842L2228K4814j030m5603m9648K1856J5200j4929
15220b4749L771L919j1886o574j4054J1748K228P785P761m9816M2741J96K750
15207b4180J2912L3435K9761l6697j3454l721j010K952j5318j5700r284M1436
15195A132j4647j5753Q113K628k275K7184q177K0319m0010o5010p555L1444N961
15182e6646P088J1543l477K7352K8051k6953j8439O981J4168J3938K110j2314
15170f598m1890R73k4206K8933J6659M3493j832k3165O357k897q5983m9120K998
$$ plain form
15157 -136278 -101522 -97129 -100970 -111745 -72710 -25493 15870 72 -16312 -13714 -7793 15685
15145 15685 35216 37770 32052 33731 19727 -4548 -50193 -33288 -36774 -48394 -29177 -13313
15133 -13313 -17673 31472 45868 25382 23294 31073 20911 6020 627 -48806 -40980 -17309 -23314
15120 -23314 26660 38353 66668 28671 21847 56225 27063 -12666 -17498 -28989 -17429 -28952
15108 -28952 -72617 -90141 -69838 -65548 -19058 -1669 -11706 4068 21605 50 -56974 -84113
15096 -84113 -36245 10633 11137 -3252 18736 1154 7913 -2856 -22376 -12510 28766 72846
15084 72846 42543 14182 16945 37394 50790 -2477 -26740 -22653 -22232 -2799 -1631 -8450 -26183
15071 -26183 -17965 12233 40315 36632 67215 43390 16083 1237 2988 25243 25369 -2836 -17803
$$ packed form
15157a36278L4756M393l841j0775L9035M7217M1363j5798j6384K598N921K3478
15145A5685J9531K554n718J679j4004k4275m5645J6905l486j1620J9217J5864
15133a3313m360M9145J4396k0486k088P779j0162j4891n393m9433P826K3671o005
15120b3314M9974J1693K8315l7997o824L4378k9162l9729m832j1491J1560j1523
15108b8952m3665j7524K0303M290M6490J7389j0037J5774J7537k1555n7024k7139
15096h4113M7868M6878N04j4389K1988j7582O759j0769j9520R866M1276M4080
15084G2846l0303k8361K763K0449J3396n3267k4263M087M21J9433J168o819j7733
15071b6183Q218L0198K8082l683L0583k3825k7307j4846J751K2255J26k8205j4967
$$ plain form
15058 -17803 -26558 -14877 19313 23650 56575 73437 31859 11860 17164 4632 -27308 -1054
15046 -1054 25762 25487 -16418 -35550 4990 -17621 -24905 -45188 -10287 -30647 -60172 -46657
15034 -46657 -21863 -28050 -22226 8915 1746 -33500 -37735 -35149 -27425 9853 19474 -31591 -23866
15021 -23866 -36379 -44996 -53503 -72286 -43533 -60018 -66304 -34360 -45477 -40359 -59347 -68691 -70344
15008 -70344 -61236 -52694 -73842 -78967 -89419 -48804 -26721 -11609 24326 -259 -37450 1231
14996 1231 25594 6294 6895 2984 50320 69571 73246 92239 102209 109213 91183 52755 21981
14983 21981 -4847 25495 40958 8075 -36064 -42841 -38988 -74690 -83332 -73408 -66645 -23066 28832
14970 28832 53760 57559 40894 25833 -7257 -35592 -36927 -23341 -16192 -12262 -9646 -12326 -32211
$$ packed form
15058a7803q755J1681L4190M337L2925J6862m1578j9999N304j2532l1940K6254
15046a054K6816k75m1905j9132M0540k2611p284k0283L4901k0360k9525J3515
15034d6657K4794o187N824L1141p169l5246m235K586P724L7278R621n1065P725
15021b3866j2513q617q507j8783K8753j6485o286L1944j1117N118j8988r344j653
15008g0344R108Q542k1148n125j0452M0615K2083J5112L5935k4585l7191L8681
14996A231K4363j9300O01l911M7336J9251L675J8993R970P004j8030l8428l0774
14983B1981k6828L0342J5463l2883m4139o777L853l5702q642R924O763M3579N1898
14970B8832K4928L799j6665j5061l3090k8335j335J3586P149L930K616k680j9885
$$ plain form
14957 -32211 -8232 -3222 10309 10923 7374 -9083 -19255 -44066 -32998 -17043 -11994 -25700 -3402
14944 -3402 12518 -2463 -35453 -27306 -29915 -61937 -15473 2415 18022 -913 -51991 -41126
14932 -41126 -49943 -53186 -9146 -33342 -53353 -42647 -48137 -42021 -56305 -38419 -16187 -19590 -13809
14919 -13809 -34037 -51527 -49216 -55688 -88304 -57923 -34958 -13928 -20338 8945 7877 -37549
14907 -37549 -44045 -23864 -14266 -30187 -57186 -52319 -31934 -10437 -14012 -5111 14863 -7208 -10665
14894 -10665 -318 -22253 -29885 -17272 7771 -2498 -23519 -21156 -31374 -81420 -80620 -59048
14882 -59048 -66587 -59549 -66967 -62045 -49580 -8848 -27216 -52732 -43173 -5201 -10207 6506 16515
14869 16515 51055 78749 88331 60142 46365 46223 16400 894 11689 -10601 -56052 -61553
$$ packed form
14957c2211K3979N010J3531O14l549j6457j0172k4811J1068J5955N049j3706K2298
14944c402J5920j4981l2990Q147k609l2022M6464J7888J5607j8935n1078J0865
14932d1126q817l243M4040k4196k0011J0706n490O116j4284J7886K2232l403N781
14919a3809k0228j7490K311o472l2616L0381K2965K1030o410K9283j068m5426
14907c7549o496K0181R598j5921k6999M867K0385K1497l575Q901J9974k2071l457
14894a0665J0347k1935p632J2613K5043j0269k1021K363j0218n0046Q00K1572
14882e9048p539P038p418M922J2465M0732j8368k5516R559L7972n006J6713J0009
14869A6515L4540K7694R582k8189j3777j42k9823j5506J0795k2290m5451n501
$$ plain form
14857 -61553 -17448 15368 11951 6338 1422 38695 46042 13769 19074 2667 23331 42150 29979
14844 29979 14645 14470 -4565 -34087 -44795 -9292 -11828 -34649 -23937 -18038 -595 -21620
14832 -21620 -31532 15569 49978 51248 71615 98969 117082 62978 18120 -47644 -13495 64772
14820 64772 22397 -36853 -47773 -41618 -64108 -53959 -50299 -16672 -23976 -16793 27548 38598
14808 38598 26521 7835 892 16084 -1118 -31944 20305 9021 -2851 -3758 7162 4798
14796 4798 -20630 -18460 -13561 18707 57440 57143 7652 -41239 -12226 17671 8106 -26801 -37836
14783 -37836 -67585 -65312 -38421 -31311 -887 5307 25989 -24880 -63305 -75836 -51130 -44267
14771 -44267 -78917 -75308 -60419 -45961 -19873 19321 37676 46881 24368 -6552 -26659 -14908
$$ packed form
14857f1553M4105L2816l417n613m916L7273P347l2273N305j6407K0664J8819j2171
14844B9979j5334j75j9035k9522j0708L5503k536k2821J0712N899J7443k1025
14832b1620r912M7101L4409J270K0367K7354J8113n4104m4858o5764L4149P8267
14820F4772m2375n9250j0920O155k2490J0149L660L3627p304P183M4341J1050
14808C8598j2077j8686o943J5192j7202l0826N2249j1284j1872r07J0920k364
14796D798k5428K170M899L2268L8733k97m9491m8891K9013K9897r565l4907j1035
14783c7836k9749K273K6891P110L0424O194K0682n0869l8425j2531K4706O863
14771d4267l4650L609J4889J4458K6088L9194J8355R205k2513l0920k0107J1751
$$ plain form
14759 -14908 -26744 -42165 -12459 11388 44376 41618 11965 -17679 -4129 36573 24383 -16693
14747 -16693 -27334 -27911 -40103 -62470 -73482 -26605 650 3694 -4022 -20454 -3304 1467 42217
14734 42217 56599 26918 19989 3759 -24218 20022 30303 -17322 -96466 -88762 -75858 -52550
14722 -52550 -27772 -53964 -47688 -32995 -29351 11182 -18052 -65258 -96792 -88139 -54843 -37000
14710 -37000 -48776 -41162 -19409 3537 15221 -31633 -41202 -46732 -46882 -34087 -32272 -25049 -30132
14697 -30132 -45421 -21196 -30791 -85018 -55944 -19530 -33541 -40553 -1448 24644 32125 -6977
14685 -6977 -31503 -14882 8818 59003 36641 -40554 -65253 -38910 8419 -8646 -50282 -70594
14673 -70594 -67465 -45400 -12863 28437 56948 18707 -24727 -33546 6689 32161 53246 55931
$$ packed form
14759a4908j1836j5421K9706K3847L2988k758k9653k9644J3550M0702j2190m1076
14747a6693j0641n77j2192k2367j1012M6877K7255L044p716j6432J7150M771M0750
14734D2217J4382k9681o929j6230k7977M4240J0281m7625p9144P704J2904K3308
14722e2550K4778k6192O276J4693L644M0533k9234m7206l1534Q653L3296J7843
14710c7000j1776P614K1753K2946J1684m6854r569n530j50J2795J815P223n083
14697c0132j5289K4225r595n4227K9074L6414j4011p012L9105K6092P481l9102
14685f977k4526J6621K3700N0185k2362p7195k4699K6343M7329j7065m1636k0312
14673g0594L129K2065L2537M1300K8511l8241m3434q819M0235K5472K1085K685
$$ plain form
14661 55931 26223 30893 10639 -31124 -52391 -36494 -11403 336 -18272 -36841 -39013 -42435
14649 -42435 -83956 -65054 -22006 -8624 -10160 43367 83733 70954 52918 26483 9533 2193
14637 2193 21758 -2131 2849 34493 -3442 -25364 -48319 -40879 19839 30493 46033 80231
14625 80231 35450 -10879 -36046 -47146 -68223 -60238 -51271 -48197 -52167 -82251 -109082 -67433
14613 -67433 -59887 -36802 -40634 -44622 -52465 -59810 -58385 -29713 8389 27972 -7586 -775 -24209
14600 -24209 -14675 -5786 -18569 -61222 -75575 -78222 -48561 -61382 -19517 -7058 -8967 -12483 -8382
14587 -8382 -43618 -24429 15021 41032 24581 19210 1040 -13203 16841 26491 15536 17977
14575 17977 9201 7570 -2568 -24432 -21207 12036 26604 18554 28668 50349 54947 9909 10741
$$ packed form
14661E5931k9708M670k0254m1763k1267J5897K5091J1739j8608j8569k172l422
14649d2435m1521J8902M3048J3382j536N3527M0366j2779j8036k6435j6950p340
14637B193J9565k3889M980L1644l7935k1922k2955P440O0718J0654J5540L4198
14625H0231m4781m6329k5167j1100k1077P985Q967L074l970l0084k6831M1649
14613f7433P546K3085l832l988p843p345J425K8672L8102J9583l5558O811k3434
14600b4209R534Q889j2783m2653j4353k647K9661j2821M1865J2459j909l516M101
14587h382l5236J9189L9450K6011j6451n371j8170j4243L0044R650j0955K441
14575A7977q776j631j0138k1864L225L3243J4568q050J0114K1681M598m5038Q32
$$ plain form
14562 10741 24055 36568 43259 21610 -22994 -3554 19235 6945 30861 58535 67901 56222
14550 56222 32455 38770 68549 101068 97508 61185 50525 33881 2160 -31766 -36535 -39142
14538 -39142 -18802 6622 10241 -7787 -67732 -67136 731 17852 461 13375 49546 27274
14526 27274 6057 -8495 -18670 -18610 -28758 -34027 -16650 -35372 -28501 -27092 -42309 -55958 -14946
14513 -14946 29066 30714 12861 -48876 -100815 -111295 -103919 -97532 -102009 -86774 -118925 -106567
14501 -106567 -65034 -33002 -88608 -89118 -56642 -44554 -32339 -41347 -51266 -12191 13465 14038 -7399
14488 -7399 -38544 -8542 15283 -2656 -40250 -100957 -68790 -49431 -64179 -52285 -32809 -5215
14476 -5215 -17217 14835 907 1202 40083 16069 -2513 -16259 -37121 -11972 12318 19630
$$ packed form
14562A0741J3314J2513O691k1649m4604J9440K2789j2290K3916K7674R366j1679
14550E6222k3767O315K9779L2519l560l6323j0660j6644l1721l3926m769k607
14538c9142K0340K5424L619j8028n9945N96O7867J7121j7391J2914L6171k2272
14526B7274k1217j4552j0175O0j0148n269J7377j8722O871J409j5217j3649M1012
14513a4946M4012J648j7853o1737n1939j0480P376O387m477J5235l2151J2358
14501a06567M1533L2032n5606n10L2476J2088J2215r008r919L9075K5656N73k1437
14488g399l1145L0002K3825j7939l7594o0707L2167J9359j4748J1894J9476K7594
14476e215j2002L2052j3928K95L8881k4014j8582j3746k0862K5149K4290P312
$$ plain form
14464 19630 -15744 -89 -5206 10743 6150 45116 77629 42618 660 -26263 -29157 -22598
14452 -22598 -32711 -56749 -37925 -25214 -41332 -32618 -35765 -69746 -67868 -51567 -4690 8768
14440 8768 21359 49894 38972 -7683 -3496 23283 31132 41239 28349 32676 19807 41322
14428 41322 38350 29308 50074 21700 -11094 5704 -10466 -26860 22454 17112 9228 -527 -21180
14415 -21180 -41391 -62463 -24115 29301 45322 20254 -19770 -38773 -70406 -67045 -28408 -2335
14403 -2335 -4590 -3266 -17451 2012 -4731 -25011 -42392 -1864 -5027 -31461 -28779 -18283 -4497
14390 -4497 6054 9817 23992 25888 28387 22961 26382 7859 -46181 -37346 -27505 -34710 -51358
14377 -51358 -37606 -37703 -5866 77580 113694 123006 111390 96441 104006 154357 109471 75292 66628
$$ packed form
14464A9630l5374J5655n117J5949m593L8966L2513l5011m1958k6923k894O559
14452b2598j0113k4038J8824J2711j6118Q714l147l3981J878J6301M6877J3458
14440H768J2591K8535j0922m6655M187K6779P849J0107j2890M327j2869K1515
14428D1322k972r042K0766k8374l2794J6798j6170j6394M9314n342p884r755k0653
14415b1180k0211k1072L8348N3416J6021k5068m0024j9003l1633L361L8637K6073
14403b335k255J324j4185J9463o743k0280j7381M0528l163k6434K682J0496J3786
14390d497J0551L763J4175J896K499n426L421j8523n4040Q835R841p205j6648
14377e1358J3752r7L1837Q3446L6114R312j1616j4949P565N0351m4886l4179q664
$$ plain form
14364 66628 84973 105602 108420 101903 152642 179407 206492 276195 370749 508572 682459 877782
14352 877782 1045888 1126403 1112656 1036843 853923 687993 560995 422808 333975 255035
14342 255035 202432 169571 152616 110722 105469 121784 150710 116903 74574 119143 107366 81076
14330 81076 84257 92660 97745 72703 75847 85946 71150 36204 40270 -469 934 -38207 -12042
14317 -12042 28818 6317 -6707 8728 25407 46665 -6482 -31772 -16144 14780 9704 -4782
14305 -4782 -18593 -12271 25622 29927 16317 10905 15735 9436 40905 96764 104800 87448 32940
14292 32940 -38006 -19087 -6938 -474 14140 -1685 -19671 10920 16526 12755 1794 21001
14280 21001 71494 84910 63580 44914 33652 10891 -15259 -5060 3324 14922 55419 58852
$$ packed form
14364F6628J8345K0629K818o517N0739K6765K7085O9703R4554J37823J73887J95323
14352H77782J68106Q0515j3747p5813j82920j65930j26998j38187q8833p8940
14342B55035n2603l2861j6955m1894n253J6315K8926l3807m2329M4569j1777k6290
14330H1076L181Q403N085k5042L144J0099j4796l4946M066m0739J403l9141K6165
14317a2042M0860k2501j3024J5435J6679K1258n3147k5290J5628L0924n076j4486
14305d782j3811O322L7893M305j3610n412M830o299L1469N5859Q036j7352n4508
14292C2940p0946J8919J2149O464J4614j5825j7986L0591N606l771j0961J9207
14280B1001N0493J3416k1330j8666j1262k2761k6150J0199Q384J1598M0497L433
$$ plain form
14268 58852 43126 42705 4202 -12020 -7430 19046 7428 19826 -15774 23397 40976 25308
14256 25308 27745 24454 60919 51167 7871 24813 -9373 -17310 11473 29183 977 -10454
14244 -10454 -14029 -14036 4221 -7903 13293 10693 2530 -20028 -3030 10580 -10680 -18889 14944
14231 14944 20774 12274 11044 19884 24 -36712 -76388 -94909 -50108 -7645 18813 18429 32567
14218 32567 23920 -1114 -569 -20321 -51010 -44687 -16365 -28218 3706 16327 -5562 -14179 -3726
14205 -3726 8152 40276 45983 20601 -2071 -9045 -24286 -31774 -14975 -3798 -37288 3937
14193 3937 25031 -3800 1412 17285 -3571 -24427 -16944 2868 -14909 -8253 17425 7570 -8707
14180 -8707 -49113 -53461 -85995 -77564 -34890 -25830 -35227 -38818 38061 26952 1217 3677 -23715
$$ packed form
14268E8852j5726m21l8503j6222M590K6476j1618J2398l5600L9171J7579j5668
14256B5308K437l291L6465r752m3296J6942l4186p937K8783J7710k8206j1431
14244a0454l575pJ8257j2124K1196k600q163k2558J6998J3610k1260q209L3833
14231A4944N830q500j230Q840j9860l6736l9676j8521M4801M2463K6458l84J4138
14218C2567q647k5034N45j9752l0689O323K8322j1853L1924J2621k1889q617J0453
14205c726J1878L2124N707k5382k2672o974j5241p488J6799J1177l3490M1225
14193C937K1094k8831N212J5873k0856k0856P483J9812j7777O656K5678r855j6277
14180h707m0406m348l2534Q431M2674R060r397l591P6879j1109k5735K460k7392
$$ plain form
14167 -23715 -51643 -9988 -3471 -11993 -31271 -23111 -49068 -36639 -9604 5272 6587 -11209
14155 -11209 -56003 -49171 -21825 -7038 -35566 -34663 -37556 -62943 -93241 -80978 -60357 -82271
14143 -82271 -59436 -54253 -40027 -53938 -63383 -55299 -42112 -12258 -53915 -88243 -69644 -41117
14131 -41117 -32928 -5748 -10385 -17650 -41312 12684 -8658 -89791 -98661 -85816 -100877 -79366
14119 -79366 -61484 -62946 -71172 -60636 -42422 -26573 -4177 27574 73246 56279 38041 2541
14107 2541 -19107 -39555 -51636 -34216 -36247 -51754 -55821 -78682 -105433 -62456 -49545 -71858
14095 -71858 -73771 -64324 -74045 -78238 -68716 -51012 -62215 -62012 -59756 -66695 -33015 -13281 -6262 13611
14081 13611 55455 73527 59695 -21612 -48622 -66862 -89790 -68499 -40037 -31210 -15374 -30427
$$ packed form
14167b3715k7928M1655O517q522j9278Q160k5957J2429K7035J4876J315j7796
14155a1209m4794O832K7346J4787k8528R03k893k5387l0298J2263K0621k1914
14143h2271K2835N183J4226j3911r445Q084J3187K9854m1657l4328J8599K8527
14131d1117Q189K7180m637p265k3662N3996k1342q1133q870J2845j5061K1511
14119g9366J7882j462q226J0536J8214J5849K2396L1751M5672j6967j8238l5500
14107B541k1648k0448j2081J7420k031j5507m067k2861k6751M2977J2911k2313
14095g1858j913R447r721m193R522J7704j1203K03K256o939L3680J9734P019J9873
14081A3611M1844J8072j3832q1307k7010j8240k2928K1291K8462Q827J5836j5053
$$ plain form
14069 -30427 -82207 -87190 -100616 -61941 -13595 25273 9852 12059 24494 -350 -11334 -22823
14057 -22823 -24199 -38951 -50352 -14592 11529 -10323 -21423 -17100 -6713 25523 25142 -13759
14045 -13759 -35043 -58468 -70965 -53655 -24923 -23310 6352 30207 10381 -3592 28737 5832
14033 5832 -30584 -52256 -77663 -46871 -38449 -49719 -50993 -72949 -57608 -87097 -101674 -89901
14021 -89901 -47785 2775 -44189 -43360 -1974 8267 -14797 -4937 -20532 -34814 -35334 -15833 -52122
14008 -52122 -30030 -20565 -48926 -84889 -59007 7882 -8393 -16241 -8183 18484 53023 45590
13996 45590 19918 -37044 -38558 -25295 -29031 -24983 -33687 -52397 -29660 -28308 -47486 -22026 -26036
13983 -26036 -55790 -38534 -20748 -47803 18045 26399 -10773 -29682 -40510 -39966 -23185 -44357
$$ packed form
14069c0427n1780m983j3426L8675M8346L8868j5421K207J2435k4844j0984j1489
14057b2823j376j4752j1401L5760K6121k1852j1100M323J0387L2236l81l8901
14045a3759k1284k3425j2497J7310K8732J613K9662K3855j9826j3973L2329k2905
14033E832l6416k1672k5407L0792Q422j1270j274k1956J5341k9489j4577J1773
14021h9901M2116N0560m6964Q29M1386J0241k3064R860j5595j4282n20J9501l6289
14008e2122K2092R465k8361l5963K5882O6889j6275p848Q058K6667L4539p433
13996D5590k5672n6962j514J3263l736M048q704j8710K2737J352j9178K5460m010
13983b6036k9754J7256J7786k7055O5848Q354l7172j8909j0828N44J6781k1172
$$ plain form
13971 -44357 -13111 17857 -792 -36711 -13898 22787 45389 26593 21264 20001 19661 34100
13959 34100 71685 60540 14110 30183 48830 28605 -17223 -2709 20800 28334 10065 -38733
13947 -38733 -81932 -66287 -38049 -15933 -653 -26487 -54911 -50207 -67026 -36571 892 25809
13935 25809 66067 52618 50876 49281 4489 15428 48159 64474 10368 16924 -4592 -37878
13923 -37878 -24861 -19919 -14798 -12975 -12759 -48628 -76101 -33628 -53542 -38562 870 22501 9916
13910 9916 4190 -11470 1252 46426 25075 -15334 -62021 -58281 -63620 -59210 -28807 2629 248
13897 248 22444 81940 99943 85383 35426 2930 4894 17515 9898 6305 -25791 -5305 17987
13884 17987 16573 -48444 -46780 -11294 -13321 -21183 -19824 -2824 -20557 -21383 -13882 20601 2721
$$ packed form
13971d4357L1246L0968j8649l5919K2813L6685K2602j8796n329j263l40J4439
13959C4100L7585j1145m6430J6073J8647k0225m5828J4514K3509P534j8269m8798
13947c8733m3199J5645K8238K2116J5280k5834k8424M704j6819L0455L7463K4917
13935B5809M0258j3449j742j595m4792J0939L2731J6315n4106O556k1516l3286
13923c7878J3017M942N121J823K16l5869k7473M2473j9914J4980L9432K1631j2585
13910I916n726j5660J2722M5174k1351m0409m6687L740n339M410L0403L1436k381
13897B48K2196N9496J8003j4560m9957l2496J964J2621p617l593l2096K0486K3292
13884A7987j414o5017J664L5486k027p862J359J7000j7733q26P501L4483j7880
$$ plain form
13871 2721 -29927 -31168 -73355 -75358 -44876 -39004 -11088 14261 -44883 -8074 46817 18617
13859 18617 2089 -10706 21006 6267 -44062 -13391 18101 23669 19505 -39232 -40765 -355
13847 -355 -41499 -35390 -33496 -29238 -10650 -17198 -44714 -64876 -66493 -67876 -58154 -37702 -49095
13834 -49095 -54947 -31230 -7646 -14908 903 27965 11551 -2459 -16199 -13384 6926 26970
13822 26970 16532 5601 14044 13306 2912 9601 20490 22661 6710 -35833 -9775 -15330 1054
13809 1054 -5630 -10943 -31033 -73659 -102879 -100926 -38089 -505 15723 37514 8726 -16493
13797 -16493 -10226 -14977 -13847 11719 -1367 19836 58298 34106 36580 4157 -14350 174
13785 174 24736 -1862 -18637 6720 32019 21849 -9196 -7881 -8957 -36500 -45302 -19290 13967
$$ packed form
13871B721l2648j241m2187k003L0482N872K7916K5349n9144L6809N4891k8200
13859A8617j6528j2795L1712j4739n0329L0671L1492N568m164n8737j533M0410
13847c55m1144O109J894M258J8588o548k7516k0162j617j383R722K0452j1393
13834d9095n852K3717K3584p262J5811K7062j6414j4010j3740K815K0310K0044
13822B6970j0438j0931Q443p38j0394O689J0889K171j5951m2543K6058n555J6384
13809A054o684n313k0090m2626k9220J953O2837L7584J6228K1791k8788k5219
13797a6493O267m751J130K5566j3086K1203L8462k4192K474l2423j8507J4524
13785A74K4562k6598j6775K5357K5299j0170l1045J315j076k7543q802K6012L3257
$$ plain form
13772 13967 6706 -58264 -99779 -62845 -37142 -41556 -25037 -29537 -18607 -17335 17175 -9608
13760 -9608 -39953 -42589 -29841 -13097 -16985 -11935 -18147 -18507 -25752 -20837 -39478 -39143 -28816 -5549
13746 -5549 -2587 45501 58437 18587 35755 61894 40332 41332 15954 11850 -21113 -16908 11585
13733 11585 31454 -30543 -61360 -63066 -48101 -6036 5126 -21730 4791 26409 -7640 -16856
13721 -16856 3800 -52295 -92359 -94382 -36324 -26735 -27360 10077 21366 -24704 -66006 -34120
13709 -34120 -31558 -46287 -71705 -37685 -12499 1818 -20060 -19800 -15262 -3749 -9976 -15288 -38042
13696 -38042 -72185 -41878 -4902 -2012 12720 25241 14876 21979 42138 51974 30891 -3814
13684 -3814 -10704 -17600 -30619 -38849 -38011 -30636 -10386 -72268 -37308 -30804 -60456 -53164 -24273
$$ packed form
13772A3967p261o4970m1515L6934K5703m414J6519m500J0930J272L4510k6783
13760i608l0345k636J2748J6744l888N050o212l60p245M915j8641L35J0327K3267
13746e549K962M8088J2936l9850J7168K6139k1562J000k5378m104l2963M205K8493
13733A1585J9869o1997l0817j706J4965M2065J1162k6856K6521K1618l4049r216
13721a6856K0656n6095m0064k023N8058R589o25L7437J1289m6070m1302L1886
13709c4120K562j4729k5418L4020K5186J4317k1878K60M538J1513o227n312k2754
13696c8042l4143L0307L6976K890J4732J2521j0365P103K0159R836k1083l4705
13684c814o890o896j3019q230Q38P375K0250o1882L4960O504k9652P292K8891
$$ plain form
13671 -24273 11661 22934 78138 91728 27758 21996 34441 6114 -40840 -36154 -28388 -36262
13659 -36262 -39047 -45103 -97264 -89497 -33009 -8254 -8659 -15341 -49314 -84488 -78264 -44803 -1119
13646 -1119 19693 -23267 -43777 -71520 -94405 -82615 -32374 -17052 -6810 -335 2321 -23382
13634 -23382 -10298 8209 -15305 -25190 26729 32927 -17875 -15764 -23175 -62267 -30641 18707
13622 18707 647 -8294 -10798 30226 40563 36901 5630 19555 29268 9460 -88 3709 20963
13609 20963 1187 36189 2412 -30344 -10567 14945 1589 -28269 -39390 -49792 -46839 243
13597 243 6522 9674 -10906 -40660 -41906 -29559 -19001 -11708 -7940 23471 15371 -9376 -59811
13584 -59811 -97941 -95668 -79582 -37378 6637 -16236 -24873 -13876 -1810 1229 6159 10674 -8502
$$ packed form
13671b4273L5934J1273N5204J3590o3970n762J2445k8327m6954M686P766p874
13659c6262k785o056n2161P767N6488K4755m05o682l3973l5174O224L3461M3684
13646a119K0812m2960k0510k7743k2885J1790N0241J5322J0242O475K656k5703
13634b3382J3084J8507k3514r885N1919O198n0802K111p411l9092L1626M9348
13622A8707j8060q941k504M1024J0337l662l1271J3925R713j9808r548L797J7254
13609B0963j9776L5002l3777l2756J9777K5512j3356k9858j1121j0402K953M7082
13597B43O279L152k0580k9754j246J2347J0558P293L768L1411q100k4747n0435
13584e9811l8130K273J6086M2204M4015k2873q637J0997J2066L039M930M515j9176
$$ plain form
13571 -8502 -44371 -62245 -96307 -131914 -63356 -15266 -33535 -35654 -1130 20048 -16348 -7018
13559 -7018 2715 18366 47961 35277 14729 10139 -16781 -70215 -40449 -45101 -63584 -22618
13547 -22618 16013 8323 21310 22449 44264 89097 96601 51496 -83 20802 35285 62395
13535 62395 48080 52682 58365 58733 37536 -13055 -29190 -35044 -45076 -49108 -66589 -99840 -111851
13522 -111851 -52600 -34593 -41430 880 16237 -17958 -58091 -73392 -19944 32828 22972 8921
13510 8921 16975 15096 3729 -8577 -87443 -117769 -87308 -91986 -87834 -46128 -745 -23001 -58356
13497 -58356 -70543 -57979 -35740 -12070 22056 27745 -1033 17528 19611 20120 18214 13750 -27266
13484 -27266 -67239 -76679 -67394 -88020 -107112 -54170 -28593 -28950 -15921 1019 26659 21429 -15414
$$ packed form
13571h502l5869j7874l4062l5607O8558M8090j8269k119L4524K1178l6396R330
13559g018R733J5651K9595j2684k0548m590k6920n3434K9766m652j8483M0966
13547b2618L8631p690J2987J139K1815M4833P504m5105n1579K0885J4483K7110
13535F2395j4315M602N683L68k1197n0591j6135n854j0032m032j7481l3251j2011
13522a11851N9251J8007o837M2310J5357l4195m0133j5301N3448N2772r856j4051
13510H921Q054j879j1367j2306p8866l0326L0461m678M152M1706M5383k2256l5355
13497e8356j2187J2564K2239K3670L4126N689k8778J8561K083N09j906m464m1016
13484b7266l9973r440R285k0626j9092N2942K5577l57J3029J6940K5640n230l6843
$$ plain form
13471 -15414 -5487 -28553 -32639 -15273 -16656 -32700 -7868 22169 40859 18096 -25113 -25419 11199
13458 11199 37521 10185 -27668 -5474 -4052 -27458 -37667 -18164 -3745 29211 6400 -38927
13446 -38927 -52080 -51341 -33915 22124 18687 12854 16495 12365 23278 51111 36574 25276 7514
13433 7514 24694 31044 16646 21642 16493 6861 27368 36128 41087 32380 37361 14535 -360
13420 -360 3531 -32566 -39719 -32137 -7904 -18978 -5241 12845 29714 42092 22710 -19941 -43663
13407 -43663 -53397 -94965 -72997 6989 19581 -906 -31494 -13193 -18903 -57384 -19304 -6543
13395 -6543 8049 57688 66441 50689 45485 27155 -9252 -4015 -25665 5717 52790 65449
13383 65449 63729 73059 54419 21759 6915 38766 56560 64348 59514 6942 -31781 -37717 -28676
$$ packed form
13471a5414R927k3066m086J7366j383j6044K4832L0037J8690k2763m3209l06L6618
13458A1199K6322k7336l7853K2194J422k3406j0209J9503J4419L2956k2811m5327
13446c8927j3153P39J7426N6039l437n833L641m130J0913K7833j4537j1298j7762
13433G514J7180O350j4398M996n149r632K0507Q760M959q707M981k2826j4895
13420c60L891l6097p153P582K4233j1074J3737J8086J6869J2378j9382m2651k3722
13407d3663r734m1568K1968P9986J2592k0487l0588J8301n710l8481L8080J2761
13395f543J4592M9639Q753j5752n204j8330l6407N237k1650L1382M7073J2659
13383F5449j720R330j8640l2660j4844L1851J7794P788m834n2572l8723n936R041
$$ plain form
13370 -28676 -35031 -83181 -102941 -88845 -72753 -58290 -46290 -15890 10687 -74 8307 37520
13358 37520 69213 81448 64266 54518 19954 -26271 -5144 -6736 -3594 707 -3603 -3571 18089
13345 18089 36127 85029 85009 41610 39211 42358 33534 52805 44477 32690 29179 8560 3472
13332 3472 17169 -7951 18391 -18303 -69604 -74088 -34956 -31139 -47519 -13801 -7400 36689
13320 36689 39823 50199 72117 68968 60602 44629 58923 57189 38906 44263 37328 18372 39341
13307 39341 78480 84002 71436 36973 25360 22922 -2713 -19578 26526 42880 67249 69734
13295 69734 48470 25396 -3984 52642 46422 14549 27324 59616 13246 21401 34558 51237
13283 51237 20750 40173 69388 60896 57056 66201 84716 86350 45199 27573 70505 55164
$$ packed form
13370b8676o355m8150j9760J4096J6092J4463J2000L0400K6577j0761Q381K9213
13358C7520L1693J2235j7182r748l4564m6225K1127j592L142M301m310L2K1660
13345A8089J8038M8902k0m3399k399L147q824J9271q328j1787l511k0619n088
13332C472J3697k5120K6342l6694n1301m484L9132L817j6380L3718O401M4089
13320C6689L134J0376K1918l149q366j5973J4294j734j8283N357o935j8956K0969
13307C9341L9139N522j2566l4463j1613k438k5635j6865M6104J6354K4369K485
13295F9734k1264k3074k9380N6626o220l1873J2775L2292m6370Q155J3157J6679
13283E1237l0487J9423K9215q492l840R145J8515J634m1151j7626M2932j5341
$$ plain form
13271 55164 60337 56437 22765 23462 51995 48811 56538 41002 892 16244 40880 110926 155795
13258 155795 98085 40283 9755 20393 7466 34324 66186 29189 7802 56100 97174
13247 97174 74686 58329 54110 80984 75220 67648 64010 75492 120924 107619 86025 68981
13235 68981 66002 65129 87451 76253 50266 45961 49419 57159 66003 60201 44547 23188 18646
13222 18646 8893 45823 44128 25366 56973 84102 78807 51503 47814 52583 42831 27013 25008
13209 25008 15323 16626 29439 102541 112469 57540 29043 16705 22617 40828 36328 58984 61866
13196 61866 70216 80761 86905 122104 122700 71270 60299 56035 67490 55873 27764 25953 4150
13183 4150 42001 97967 102811 80210 41476 25254 78238 116913 131929 134441 119939 109294
$$ packed form
13271E5164N173l900l3672O97K8533l184P727j5536m0110J5352K4636P0046M4869
13258A55795n7710n7802l0528J0638j2927K6858L1862l6997k1387M8298M1074
13247I7174k2488j6357m219K6874n764p572l638J1482M5432j3305k1594j7044
13235F8981k979q73K2322j1198k5987m305L458P740Q844n802j5654k1359m542
13222A8646r753L6930j695j8762L1607K7129n295k7304l689M769r752j5818k005
13209B5008r685J303J2813P3102R928n4929k8497j2338N912J8211m500K2656K882
13196F1866Q350J0545O144L5199N96n1430j0971m264J1455j1617k8109j811k1803
13183D150L7851N5966M844k2601l8734j6222N2984L8675J5016K512j4502j0645
$$ plain form
13171 109294 111111 118395 98708 55110 64116 79801 77772 110143 109729 32335 -1223 48904 49979
13158 49979 22807 16516 38203 57036 80822 105977 106171 94629 116348 117450 117250 90649 62599
13145 62599 77049 115146 90784 62111 67802 80363 70928 60686 75521 82862 106658 136357
13133 136357 128656 125905 152710 133626 121803 128770 105341 93134 106018 81678 76159 53466
13121 53466 35952 53563 85123 73574 70479 80258 49004 54088 78241 104906 93122 87268
13109 87268 88885 76178 75927 100002 96421 80996 116260 134871 152464 152544 146846 125260 106910
13096 106910 41778 3386 22380 46428 63472 102642 72920 74708 59400 24658 17008 62507
13084 62507 75046 112186 88344 61896 30391 46049 72356 86660 96863 73053 64113 96006
$$ packed form
13171A09294J817P284j9687m3598R006J5685k029L2371m14p7394l3558N0127J075
13158D9979k7172o291K1687J8833K3786K5155J94j1542K1719J102k00k6601k8050
13145F2599J4450L8097k4362k8673N691J2561r435j0242J4835P341K3796K9699
13133A36357p701k751K6805j9084j1823O967k3429j2207J2884k4340n519k2693
13121E3466j7514J7611L1560j1549l095R779l1254N084K4153K6665j1784n854
13109H7268J617j2707k51K4075l581j5425L5264J8611J7593Q0n698k1586j8350
13096A06910o5132l8392J8994K4048J7044L9170k9722J788j5308l4742p650M5499
13084F2507J2539L7140k3842k6448l1505J5658K6307J4304J0203k3810q940L1893
$$ plain form
13072 96006 107636 81967 53957 58773 97893 112788 94192 117716 146295 185974 160004 156389
13060 156389 125472 129318 115524 130923 141700 72574 19365 84249 125600 156126 161012 145116
13048 145116 129754 80391 64460 48138 45601 40108 54651 65485 66951 60595 91293 83584
13036 83584 42243 10789 68056 143402 108381 77764 69607 63293 56808 65667 55482 35423
13024 35423 35128 42905 88443 113933 102955 92738 92051 106145 88979 80543 57199 41568 62905
13011 62905 39173 36621 36376 34954 76125 94620 79389 63946 37305 63085 73512 47929
12999 47929 58393 55351 35874 41016 58019 87745 85912 59057 32981 15523 21200 84326
12987 84326 100085 96764 80913 48264 60849 84961 89733 71398 31565 -1211 28843 28484
$$ packed form
13072I6006J1630k5669k8010M816L9120J4895j8596K3524K8579L9679k5970l615
13060A56389l0917L846j3794J5399J0777o9126n3209O4884M1351L0526M886j5896
13048A45116j5362m9363j5931j6322k537n493J4543J0834J466o356L0698p709
13036H3584m1341l1454N7267P5346l5021l0617q157o314o485Q859j0185k0059
13024C5423k95P777M5538K5490j0978j0217o87J4094j7166q436k3344j5631K1337
13011F2905k3732k552k45j422M1171J8495j5231j5443k6641K5780J0427k5583
12999D7929J0464l042j9477N142J7003K9726j833k6855k6076j7458N677O3126
12987H4326J5759l321j5851l2649J2585K4112M772j8335l9833l2776L0054l59
$$ plain form
12975 28484 65166 105489 126376 165398 133724 117768 82609 32464 40133 64026 57206 62289
12963 62289 76070 86105 79234 65353 48389 67520 118840 116617 63466 62254 71037 61537 40607
12950 40607 10445 -10289 -8318 -15331 -23112 20427 23469 41598 72620 58584 38565 23757
12938 23757 38618 58585 68493 100741 143509 146998 135912 112601 66596 42246 22760 46434
12926 46434 50776 75481 84565 93058 79177 71394 49969 17779 26860 52485 69750 99214 98139
12913 98139 91959 140137 151693 137734 81619 44254 35714 66333 98436 110416 120582 90552
12901 90552 37824 8025 14317 49135 87028 79985 9379 -40804 -10838 25656 43463 60484
12889 60484 56729 54310 40816 59554 86476 104646 129238 129240 143359 170247 237638 321838 336764
$$ packed form
12975B8484L6682M0323K0887L9022l1674j5956l5159n0145P669K3893o820N083
12963F2289J3781J0035o871j3881j6964J9131N1320k223n3151j212Q783r500k0930
12950D0607l0162k0734J971p013p781M3539L042J8129L1022j4036k0019j4808
12938B3757J4861J9967R908L2248M2768L489j1086k3311m6005k4350j9486K3674
12926D6434M342K4705R084Q493j3881p783k1425l2190R081K5625J7265K9464j075
12913I8139o180M8178J1556j3959n6115l7365q540L0619L2103J1980J0166l0030
12901I0552n2728k9799O292L4818L7893p043p0606n0183K9966L6494J7807J7021
12889F0484l755k419j3494J8738K6922J8170K4592KJ4119K6888O7391Q4200J4926
$$ plain form
12876 336764 312512 250984 180569 128173 104509 72495 94888 101918 97650 85451 58638 50622
12864 50622 72745 83628 55538 20591 19540 74554 37424 51098 63570 59925 49046 76810
12852 76810 98460 116812 123411 117401 93109 78350 82398 96914 99442 87006 72819 61165
12840 61165 75789 100020 119525 156768 125252 137448 175262 202905 221289 235167 279561 341433
12828 341433 329505 280235 214537 214530 207753 162334 124433 135544 140440 168790 187665 208668 236471
12815 236471 225585 238925 234244 269462 298405 345339 395344 489188 562786 687449 808038
12804 808038 941496 1178527 1466560 1805620 2381238 3288427 4699846 6904603 10159618
12795 10159618 13927771 16184197 15135906 11767381 8361768 5823889 4125948 3044140
$$ packed form
12876C36764k4252o1528p0415n2396k3664l2014K2393P030m268j2199k6813q016
12864E0622K2123J0883k8090l4947j051N5014l7130J3674J2472l645j0879K7764
12852G6810K1650J8352O599o010k4292j4759M048J4516K528j2436j4187j1654
12840F1165J4624K4231J9505L7243l1516J2196L7814K7643J8384J3878M4394O1872
12828C41433j1928m9270o5698po777m5419l7901J1111M896K8350J8875K1003K7803
12815B36471j0886J3340m681L5218K8943M6934N0005R3844P3598J24663J20589
12804H08038J33458K37031K88033L39060N75618R07189J411419K204757L255015
12795A0159618L768153K256426j048291l368525l405613k537879j697941j081808
$$ plain form
12787 3044140 2364171 1875501 1516173 1258174 1097434 981626 883405 756381 651959 581506
12777 581506 510377 452188 437797 391310 348685 340388 352194 317131 281041 284852 252524 240910
12765 240910 214284 218620 237069 224125 193422 191228 179721 147602 180328 207975 217264 202318
12753 202318 220644 159791 99820 97107 75996 116512 147399 140208 119115 92516 88376 81057
12741 81057 80151 94436 115009 102702 115562 119509 124463 133863 116137 102560 110562 101322 53407
12728 53407 47539 49703 48124 51125 49022 33546 70941 92388 98551 119025 121730 107830 126921
12715 126921 149946 108756 69869 77659 72720 57952 41750 37914 50067 92745 67627 64532
12703 64532 80212 70700 86496 130699 97412 107656 113039 114714 93406 66623 56430 8677
$$ packed form
12787C044140o79969m88670l59328k57999j60740j15808r8221j27024j04422p0453
12777E81506p1129n8189j4391m6487m2625q297J1806l5063l6090L811l2328j1614
12765B40910k6626M336J8449j2944l0703k194j1507l2119L2726K7647R289j4946
12753B02318J8326o0853n9971k713k1111M0516L0887p191k1093k6599m140p319
12741H1057r06J4285K0573j2307J2860L947M954R400j7726j3577Q002r240m7915
12728E3407n868K164j579L001k103j5476L7395K1447O163K0474K705j3900J9091
12715A26921K3025m1190l8887P790m939j4768j6202l836J2153M2678k5118l095
12703F4532J5680r512J5796M4203l3287J0244N383J675k1308k6783j0193m7753
$$ plain form
12691 8677 20851 48516 58365 92759 151012 161406 167943 161648 195547 229211 221059 196247 173387
12678 173387 150575 140605 105311 103184 103872 83347 81016 65347 80062 82881 58639 83505 93576
12665 93576 98541 120624 131353 144010 145687 85319 59572 77849 58599 76004 112670 126832
12653 126832 103550 38437 60862 78238 66954 66505 86457 79639 73978 72426 79404 71183 45127
12640 45127 61551 88026 111247 113624 143419 154308 150109 102618 91857 56885 74762 91296
12628 91296 134565 127817 87142 69783 50586 41287 47955 64254 98748 83325 92006 115804
12616 115804 86637 91220 111538 94853 91531 81569 89657 121459 93505 82877 104104 104842 103570
12603 103570 76579 39325 28750 57474 37759 56058 58428 6578 -9002 23457 32564 79103
$$ packed form
12691H677J2174K7665R849L4394N8253J0394O537o295L3899L3664q152k4812k2860
12678A73387k2812r970l5294k127O88k0525k331j5669J4715K819k4242K4866J0071
12665I3576M965K2083J0729J2657J677o0368k5747J8277j9250J7405L6666J4162
12653A26832k3282o5113K2425J7376j1284m49J9952o818n661j552O978q221k6056
12640D5127J6424K6475K3221K377K9795J0889m199m7491j0761l4972J7877J6534
12628I1296M3269o748m0675j7359j9197r299O668J6299L4494j5423Q681K3798
12616A15804k9167M583K0318j6685l322r962Q088L1802k7954j0628K1227P38j272
12603A03570k6991l7254j0575K8724j9715J8299K370n1850j5580L2459R107M6539
$$ plain form
12591 79103 62735 58593 42729 40277 40953 73250 61898 68136 79420 60340 91332 141720 156661
12578 156661 111201 75304 79850 72704 79674 61211 54921 55798 88994 119325 64565 38069 21949
12565 21949 36909 80875 70727 47276 60672 81306 120054 123501 85220 57553 82501 93501
12553 93501 75174 66055 47308 54815 54409 107788 120981 148474 118172 69213 77110 41950 3550
12540 3550 3146 15585 37005 48374 45057 46890 36971 87879 133605 131222 135262 145313 174784
12527 174784 132575 60617 43541 42176 71253 115578 112457 88288 98004 100144 92761 92159 73196
12514 73196 66026 23863 28778 45985 57363 90764 93131 124819 119480 150601 182786 203709
12502 203709 162665 120914 90616 91026 134346 117727 60450 46469 86534 111959 113003 181548
$$ packed form
12591G9103j6368m142j5864k452O76L2297j1352O238J1284j9080L0992N0388J4941
12578A56661m5460l5897M546p146O970j8463o290Q77L3196L0331n4760k6496j6120
12565B1949J4960M3966j0148k3451J3396K0634L8748L447l8281k7667K4948J1000
12553I3501j8327r119j8747P507m06N3379J3193K7493l0302m8959P897l5160l8400
12540C550m04J2439K1420J1369l317J833r919N0908M5726k383M040J0051K9471
12527A74784m2209p1958j7076j365K9077M4325l121k4169R716K140p383o02j8963
12514G3196p170m2163M915J7207J1378L3401K367L1688n339L1121L2185K0923
12502B03709m1044m1751l0298M10M3320j6619n7277j3981M0065K5425J044O8545
$$ plain form
12490 181548 161897 117021 128122 163052 145210 126247 115574 72650 67642 83794 124197 133428
12478 133428 151752 198558 195134 170721 149357 117855 134793 137470 84422 75530 64808 11041
12466 11041 19199 39730 79804 114559 131914 134545 125958 101490 101217 95881 48629 42275 84590
12453 84590 110737 58906 65774 104191 92276 99075 102290 118059 112984 132197 108445 118873
12441 118873 139367 140763 123583 138504 128078 129721 151554 177031 158200 131101 135796 126435
12429 126435 64523 72399 92871 91339 91428 111254 156228 165088 165172 149760 150036 178747 176547 163009
12415 163009 163553 167284 184946 147795 162897 224109 264189 235391 192047 157383 178238 189112
12403 189112 185192 179808 162085 167687 135741 163624 198643 159248 145417 171134 178534 206583
$$ packed form
12490A81548j9651m4876J1101L4930j7842j8963j0673m2924n008J6152M0403R231
12478A33428J8324M6806l424k4413k1364l1502J6938K677n3048q892j0722n3767
12466A1041Q158K0531M0074L4755J7355K631q587k4468k73n336m7252o354M2315
12453H4590K6147n1831O868L8417j1915O799L215J5769n075J9213k3752J0428
12441A18873K0494J396j7180J4921j0426J643K1833K5477j8831k7099M695r361
12429A26435o1912P876K0472j532Q9J9826M4974Q860Q4j5412K76K8711k200j3538
12415A63009N44L731J7662l7151J5102O1212M0080k8798m3344l4664K0855J0874
12403A89112l920n384j7723N602l1946K7883L5019l9395j3831K5717P400K8049
$$ plain form
12391 206583 246429 238391 189381 185822 215148 208339 222268 223518 180472 164783 200083 197496
12379 197496 206390 221144 226631 225591 208193 188565 180174 167199 167720 168716 154516 124464 145207
12366 145207 179974 194103 217066 200076 178566 164802 184141 178662 154511 164667 186918 229691
12354 229691 196771 148330 159104 164311 170188 169197 191071 190601 170765 144719 157441 151783 167391
12341 167391 181635 166521 168945 178694 200205 215495 235054 210815 223855 239201 269062 233779
12329 233779 193943 237019 204040 186564 182056 199979 200403 243784 276304 317378 370599 387241
12317 387241 360492 328807 317557 265109 215465 201835 211714 218514 266346 263405 227594 256530
12305 256530 250850 287831 302243 299635 268778 253556 253984 241712 246466 247151 234892 246112 238868
$$ packed form
12391B06583L9846q038m9010l559K9326o809J3929J250m3046j5689L5300k587
12379A97496Q894J4754N487j040j7398j9628q391j2975N21R96j4200l0052K0743
12366A45207L4767J4129K2963j6990k1510j3764J9339n479k4151J0156K2251M2773
12354B29691l2920m8441J0774N207N877r91K1874m70j9836k6046J2722n658J5608
12341A67391J4244j5114K424R749K1511J5290J9559k4239J3040J5346K9861l5283
12329B33779l9836M3076l2979j7476m508J7923M24M3381L2520M1074N3221J6642
12317C87241k6749l1685j1250n2448m9644j3630R879O800M7832k941l5811K8936
12305B56530n680L6981J4412k608l0857j5222M28j2272M754O85j2259J1220p244
$$ plain form
12292 238868 281219 314451 289277 288812 319171 308854 278406 279779 258491 255405 272271 258159
12280 258159 245827 227358 190047 202383 217436 239068 257766 250183 236844 221769 241241 278776
12268 278776 286083 286559 269674 301379 334059 334165 311819 278241 301558 321490 300811 291213 318085
12255 318085 331963 334159 326473 335366 315584 316417 322631 323626 330468 334032 302160 308874 320876 338191
12241 338191 356895 364148 367638 322717 309289 354452 387155 406450 404297 375868 340242 375971
12229 375971 456314 432413 380108 381157 394616 469401 467054 442846 408968 393182 415565 410527
12217 410527 382191 406529 437641 417622 412079 444097 443189 428250 429536 446843 461424 442594
12205 442594 422599 474575 495979 486739 491035 499035 473796 481157 499198 517985 484924 458598
$$ packed form
12292B38868M2351L3232k5174m65L0359j0317l0448J373k1288l086J6866j4112
12280B58159j2332j8469l7311J2336J5053K1632J8698p583j3339j5075J9472L7535
12268B78776P307M76j6885L1705L2680J06k2346l3578K3317J9932k0679r598K6872
12255C18085J3878K196p686Q893j9782Q33O214R95O842L564l1872O714J2002J7315
12241C38191J8704P253L490m4921j3428M5163L2703J9295k153k8429l5626L5729
12229C75971Q0343k3901n2305J049J3459P4785k347k4208l3878j5786K2383n038
12217D10527k8336K4338L1112k0019n543L2018r08j4939J286J7307J4581j8830
12205D42594j9995N1976K1404r240M296Q000k5239P361J8041J8787l3061k6326
$$ plain form
12193 458598 478112 482504 500719 520402 546475 553989 554764 533110 500062 502122 481741 506796
12181 506796 541845 561348 536187 500422 469738 451425 488635 543665 595479 609202 593757
12170 593757 577837 572477 588942 606900 619547 639233 625770 624044 644313 655793 653356 670778
12158 670778 673436 678360 677616 671699 710021 708243 708515 688582 673289 637966 598730 591562 600513
12145 600513 609239 628697 620080 643394 707301 730084 735078 733437 714069 724426 782167 835946
12133 835946 849225 814456 835241 824933 826872 828857 829340 847420 834050 857320 867941 813902
12121 813902 753613 767362 804812 835634 839393 853048 821906 834494 871553 905612 916656 933926
12109 933926 925504 964643 985850 988155 979573 970485 983395 971890 963227 936855 947180 974640
$$ packed form
12193D58598J9514M392J8215J9683K6073P514P75k1654l3048K060k0381K5055
12181E06796L5049J9503k5161l5765l0684j8313L7210N5030N1814J3723j5445
12170E93757j5920n360J6465J7958J2647J9686j3463j726K0269J1480k437J7422
12158F70778K658M924p44n917L8322j778K72j9933j5293l5323l9236p168Q951
12145F00513Q726J9458q617K3314O3907K2783M994j641j9368J0357N7741N3779
12133H35946J3279l4769K0785j0308J939J985M83J8080j3370K3270J0621n4039
12121H13902o0289J3749L7450L0822L759J3655l1142J2588L7059L4059J1044J7270
12109I33926q422L9139K1207K305q582r088J2910j1505q663k6372J0325K7460
$$ plain form
12097 974640 1009893 1023987 1002285 1007693 1051529 1068363 1071190 1071965 1110001 1115549 1107790 1119275 1132818
12084 1132818 1191093 1248981 1265364 1253125 1276532 1298251 1323259 1363401 1379459 1355111 1310731
12073 1310731 1299572 1322594 1295035 1305052 1323610 1367312 1431362 1453244 1456397 1464044 1511279 1548397
12061 1548397 1545037 1489433 1475665 1501130 1514687 1546170 1581958 1625258 1649597 1644587 1643598 1633013
12049 1633013 1668950 1688587 1693971 1703709 1717705 1756896 1789866 1787934 1766706 1782080 1802406 1822715
12037 1822715 1842290 1866388 1884567 1891753 1919587 1948455 1992353 2038538 2061399 2046586 2045447 2070994
12025 2070994 2112965 2199944 2234123 2217928 2175536 2204811 2222637 2246560 2256122 2289746 2334689
12014 2334689 2372602 2418358 2450201 2408323 2415807 2422137 2456592 2502524 2553792 2568220 2570377 2601644
$$ packed form
12097I74640L5253J4094k1702N408M3836J6834K827P75L8036N548p759J1485J3543
12084A132818N8275N7888J6383j2239K3407K1719K5008M0142J6058k4348m4380
12073A310731j1159K3022k7559J0017J8558M3702O4050K1882L153P647M7235L7118
12061A548397l360n5604j3768K5465J3557L1483L5788M3300K4339n010r89j0585
12049A633013L5937J9637N384R738J3996L9191L2970j932k1228J5374K0326K0309
12037A822715J9575K4098J8179P186K7834K8868M3898M6185K2861j4813j139K5547
12025B070994M1971Q6979L4179j6195m2392K9275J7826K3923R562L3624M4943
12014B334689L7913M5756L1843m1878P484O330L4455M5932N1268J4428K157L1267
$$ plain form
12002 2601644 2606717 2613974 2642003 2693703 2733816 2770187 2801042 2854208 2860650 2896142 2942878 2951117
11990 2951117 2952908 2991778 2983908 3009940 3067414 3094046 3109752 3132695 3162893 3213872 3278940 3272958
11978 3272958 3275501 3302240 3351513 3354885 3379867 3416370 3447420 3498864 3576967 3589584 3587525 3598911
11966 3598911 3598772 3619447 3636092 3684061 3686236 3732731 3758202 3783330 3853060 3890145 3891684 3873386
11954 3873386 3866640 3907328 3930579 3909746 3949169 3981235 4034734 4089885 4059654 4038805 4032636 4064763
11942 4064763 4122592 4136363 4144032 4153172 4173398 4188558 4169621 4164777 4132182 4114799 4155821 4206470
11930 4206470 4202964 4169428 4172591 4192185 4224359 4229414 4204478 4218535 4261962 4290334 4273552 4207826
11918 4207826 4186048 4196248 4199845 4217753 4213960 4230763 4188552 4151751 4144845 4162680 4105442 4093936
$$ packed form
12002B601644N073P257K8029N1700M0113L6371L0855N3166O442L5492M6736Q239
11990B951117J791L8870p870K6032N7474K6632J5706K2943L0198N0979O5068n982
11978C272958K543K6739M9273L372K4982L6503L1050N1444P8103J2617k059J1386
11966C598911j39K0675J6645M7969K175M6495K5471K5128O9730L7085J539j8298
11954C873386o746M0688K3251k0833L9423L2066N3499N5151l0231k0849o169L2127
11942D064763N7829J3771P669R140K0226J5160j8937m844l2595j7383M1022N0649
11930D206470l506l3536L163J9594L2174N055k4936J4057M3427K8372j6782o5726
11918D207826k1778J0200L597J7908l793J6803m2211l6801o906J7835n7238j1506
$$ plain form
11906 4093936 4082051 4111383 4152460 4108775 4041423 3989528 3969928 3958750 3953815 3968811 3956297
11895 3956297 3965555 3970482 3925953 3872962 3793702 3743298 3770021 3754897 3736466 3693203 3633526 3588275
11883 3588275 3560388 3551138 3550452 3539027 3517065 3478972 3401874 3398184 3410033 3395606 3364274 3339015
11871 3339015 3314022 3267265 3221783 3204183 3216714 3187131 3140981 3090550 3064434 3046058 3023262
11860 3023262 2993998 2958141 2923926 2886839 2876481 2861248 2846215 2793904 2800348 2789069 2740209
11849 2740209 2686733 2662082 2637800 2589525 2555910 2551430 2553476 2549319 2527135 2502114 2465793 2463112
11837 2463112 2442487 2422782 2411670 2385080 2279863 2234828 2250542 2281487 2268261 2234560 2199046
11826 2199046 2197733 2191579 2093777 2027781 2012040 2041755 2029600 2016139 1984399 1971547 1982745 1948241
$$ packed form
11906D093936j1885K9332M1077m3685o7352n1895j9600j1178m935J4996j2514
11895C956297R258M927m4529n2991p9260n0404K6723j5124j8431m3263n9677m5251
11883C588275k7887r250o86j1425k1962l8093p7098l690J1849j4427l1332k5259
11871C339015k4993m6757m5482j7600J2531k9583m6150n0431k6116j8376k2796
11860C023262k9264l5857l4215l7087j0358j5233j5033n2311O444j1279m8860
11849B740209n3476k4651k4282m8275l3615m480K046m157k2184k5021l6321k681
11837B463112k0625j9705j1112k6590j05217m5035J5714L0945j3226l3701l5514
11826B199046j313o154r7802o5996j5741K9715j2155j3461l1740j2852J1198l4504
$$ plain form
11814 1948241 1939708 1915581 1932935 1901420 1820492 1794027 1810612 1815359 1814624 1779308 1774565 1730842
11802 1730842 1677728 1692055 1724908 1713335 1708994 1683710 1675906 1704492 1687713 1668845 1607798 1607691
11790 1607691 1591917 1555768 1536567 1512237 1447184 1412820 1403334 1386933 1384815 1395911 1411024 1414612
11778 1414612 1424279 1407446 1364166 1345961 1301233 1251977 1268837 1286693 1282414 1290224 1243461 1240355
11766 1240355 1257736 1242304 1242566 1246822 1224914 1176842 1150749 1166993 1184655 1168909 1139839 1133912
11754 1133912 1136592 1144107 1166153 1120733 1121945 1131792 1110610 1057338 1001361 1028490 1065198 1045218
11742 1045218 1016243 1005906 973825 971341 981928 971045 964232 929687 905451 886614 849674 877587
11730 877587 932900 953415 945773 911345 853442 866276 870508 856695 876852 912600 914352 881468
$$ packed form
11814A948241q533k4127J7354l1515q0928k6465J6585M747p35l5316m743m3723
11802A730842n3114J4327L2853j1573m341k5284p804K8586j6779j8868o1047j07
11790A607691j5774l6149j9201k4330o5053l4364r486j6401k118J1096J5113L588
11778A414612R667j6833m3280j8205m4728m9256J6860J7856m279P810m6763l106
11766A240355J7381j5432K62M256k1908m8072k6093J6244J7662j5746k9070n927
11754A133912K680P515K2046m5420J212R847k1182n3272n5977K7129L6708j9980
11742A045218k8975j0337l2081k484J0587j0883o813l4545k4236j8837l6940K7913
11730H77587N5313K0515p642l4428n7903J2834M232j3813K0157L5748J752l2884
$$ plain form
11718 881468 830376 802484 774231 758176 820492 853632 796427 735729 741861 739588 714747 702131
11706 702131 673761 695302 713248 697658 693029 667910 612775 594849 618221 655311 671378 651580
11694 651580 660994 660530 627316 625564 638477 633397 622618 637562 638295 647410 692640 637082 642064
11681 642064 707703 697144 672641 676841 644607 630681 637357 631947 621321 645813 666429 678517
11669 678517 696650 722335 766446 773293 766302 748194 725468 756662 773901 800747 878077 977952
11657 977952 1023223 1053181 1133058 1217425 1298320 1499551 1742069 1980577 2286669 2724205
11647 2724205 3356709 4220282 5423060 7127684 9556820 12635640 15734218 17610661
11639 17610661 17218354 14781399 11637663 8878877 6804122 5298950 4227216 3494906
$$ packed form
11718H81468n1092k7892k8253j6055O2316L3140n7205o0698O132k273k4841j2616
11706G02131k8370K1541J7946j5590m629k5119n5135j7926K3372L7090J6067j9798
11694F51580R414m64l3214j752J2913n080j0779J4944P33R115M5230n5558M982
11681F42064O5639j0559k4503M200l2234j3926O676n410j0626K4492K0616J2088
11669F78517J8133K5685M4111O847o991j8108k2726L1194J7239K6846P7330R9875
11657I77952M5271K9958P9877Q4367Q0895K01231K42518K38508L06092M37536
11647B724205O32504Q63573J202778J704624K429136L078820L098578J876443
11639A7610661l92307k436955l143736k758786k074755j505172j071734p32310
$$ plain form
11631 3494906 2964893 2551719 2171950 1871765 1652207 1476384 1353887 1248044 1163632 1096986
11621 1096986 1089234 1015244 923483 864455 813901 742022 701483 710522 723389 662404 592786 597607
11609 597607 591086 541913 566793 566667 490734 451865 458075 461069 463923 463191 488501 469496 423889
11596 423889 450550 455971 432677 428755 473066 448413 423164 403324 381416 402936 422838 456200
11584 456200 440540 396979 400519 417681 421992 453358 465388 401386 310637 261558 276894 291715
11572 291715 320223 350430 326220 311052 362004 356751 331849 336869 340094 348459 333899 362988
11560 362988 371557 371058 353681 312822 260736 291391 299654 284643 288908 315707 298943 285853
11548 285853 278456 261274 290376 278449 247827 227408 199790 203044 197192 220592 177865 169934
$$ packed form
11631C494906n30013m13174l79769l00185k19558j75823j22497j05843q4412o6646
11621A096986p752p3990r1761n9028n0554p1879m0539R039J2867o0985o9618M821
11609E97607o521m9173K4880j26p5933l8869O210K994K854p32K5310j9005m5607
11596D23889K6661N421k3294l922M4311k4653k5249j9840k1908K1520J9902L3362
11584D56200j5660m3561L540J7162M311L1366J2030o4002r0749m9079J5336J4821
11572B91715K8508L0207k4210j5168N0952n253k4902N020L225Q365j4560K9089
11560C62988Q569m99j7377m0859n2086L0655Q263j5011M265K6799j6764j3090
11548B85853p397j7182K9102j1927l0622k0419k7618L254n852K3400m2727p931
$$ plain form
11536 169934 185336 242153 248615 202558 196255 212803 188187 202374 212260 212270 254390 274582 254881
11523 254881 226598 216332 205205 203674 207395 231369 226159 217639 239990 246651 235313 222912
11511 222912 220662 238715 244580 264119 282648 268748 248650 266612 228552 197524 207751 195809
11499 195809 207806 204240 188558 162130 140064 129397 155038 149392 110274 113483 84265 89928
11487 89928 110873 95268 87219 95835 132991 126958 172299 176930 142475 142629 175778 215209 213379
11474 213379 181933 184614 203456 188971 143900 125964 103311 96553 146517 198768 236665 207832
11462 207832 182413 190965 147593 154204 186110 136648 129014 138353 130721 114283 104530 84496 131049
11449 131049 126087 103543 92785 137845 150823 112838 95420 49711 60854 95377 104005 126938
$$ packed form
11536A69934J5402N6817O462m6057o303J6548k4616J4187R886J0M2120K0192j9701
11523B54881k8283j0266j1127j531L721K3974n210q520K2351O661j1338j2401
11511B22912k250J8053N865J9539J8529j3900k0098J7962l8060l1028J0227j1942
11499A95809J1997l566j5682k6428k2066j0667K5641n646l9118L209k9218N663
11487H9928K0945j5605q049Q616L7156o033M5341M631l4455J54L3149L9431j830
11474B13379l1446K681J8842j4485m5071j7936k2653o758M9964N2251L7897k8833
11462B07832k5419Q552m3372O611L1906m9462p634R339p632j6438r753k0034M6553
11449A31049m962k2544j0758M5060J2978l7985j7418m5709J1143L4523Q628K2933
$$ plain form
11437 126938 159330 175306 151091 162765 152575 150511 155535 175845 176801 146572 128438 133241
11425 133241 136739 120436 122337 112021 111063 93457 71415 105445 135375 130452 134284 124707 70474
11412 70474 102903 118979 130785 65820 55046 112348 129208 110328 59588 30093 27877 75470
11400 75470 71032 60867 73873 142341 170378 175567 112786 85129 88688 85339 75455 53663 56834
11387 56834 57224 94272 69741 50279 55042 46716 77912 88018 42290 63236 107396 114596 100957
11374 100957 70532 68398 90953 106798 80917 55505 34650 10026 21682 61579 47303 9038
11362 9038 13326 19370 21001 26065 41169 51239 24970 15287 12135 24250 -2068 -31806 -37913
11349 -37913 -74071 -45523 -14579 26377 46473 23059 31501 59505 54117 59425 63125 64403 46385
$$ packed form
11437A26938L2392J5976k4215J1674j0190k064N024K0310R56l0229j8134M803
11425A33241L498j6303J901j0316r58j7606k2042L4030K9930m923L832r577n4233
11412G0474L2429J6076J1806o4965j0774N7302J6860j8880n0740k9495k216M7593
11400G5470m438j0165J3006O8468K8037N189o2781k7657L559l349r884k1792L171
11387E6834L90L7048k4531j9462M763q326L1196J0106m5728K0946M4160P200j3639
11374A00957l0425k134K2555J5845k5881k5412k0855k4624J1656L9897j4276l8265
11362I038M288O044J631N064J5104J0070k6269r683l152J2115k6318k9738o107
11349c7913l6158K8548L0944M0956K0096k3414Q442K8004n388N308L700J278j8018
$$ plain form
11336 46385 29303 16195 15816 52558 97975 91084 71655 89315 57657 29801 48827 91309
11324 91309 72664 13207 30393 26366 27626 19438 49340 18914 21892 43745 72044 38022
11312 38022 13618 -15387 -36458 -4790 14602 47315 53617 45230 36392 6988 -2624 1526 6804
11299 6804 11925 13076 -3460 -19032 -11301 13136 9792 4905 26863 166 7889 5011 -35426
11286 -35426 -79266 -78292 -11460 41921 31373 -6026 -8002 3764 11117 -4953 5240 39077
11274 39077 9879 -46044 -55488 -34586 -25928 1795 -2233 -9719 11855 253 -24841 -5292
11262 -5292 17905 12890 -4263 -41809 -102787 -100361 -19811 22946 27939 12950 25935 28602 44979
11249 44979 46269 20654 20049 16642 5691 -28522 -56125 -69483 -60046 -32782 4400 20111 25904
$$ packed form
11336D6385j7082j3108l79L6742M5417o891j9429J7660l1658k7856J9026M2482
11324I1309j8645n9457J7186m027J260q188K9902l0426K978K1853K8299l4022
11312C8022k4404k9005k1071L1668J9392L2713O302q387q838k9404r612M150N278
11299F804N121J151j6536j5572P731K4437l344m887K1958k6697P723k878m0437
11286c5426m3840R74O6832N3381j0548l7399j976J1766P353j6070J0193L3837
11274C9077k9198n5923r444K0902Q658K7723m028p486K1574j1602k5094J9549
11262e292K3197n015j7153l7546o0978K426Q0550M2757M993j4989J2985K667J6377
11249D4979J290k5615o05l407j0951l4213k7603j3358R437K7264L7182J5711N793
$$ plain form
11236 25904 53244 81956 39098 39683 20126 15473 -3612 -12795 28568 54249 28631 -7710
11224 -7710 32005 66436 114168 90054 29654 1554 19556 26320 16204 -1830 -1143 -22281
11212 -22281 -33286 -52098 -37977 -29533 -45673 -59031 -54953 -78625 -55891 -7509 5919 24157
11200 24157 88909 104354 83644 63892 72332 94241 47395 9100 -4950 8280 -4505 -22252
11188 -22252 -44694 -35408 -16651 7569 8858 -16616 -35221 -44286 -35868 -15003 -13564 -83542 -89585
11175 -89585 -87435 -86929 -92530 -86415 -56960 -48814 -45462 -19974 11077 -8239 -33159 -1631 -12043
11162 -12043 -35778 -29968 -68146 -77886 -100684 -97984 -108568 -107765 -65709 -53640 -35553 -70004 -71315
11149 -71315 -41672 -40046 -36845 -91008 -113680 -75202 -51805 -86736 -116207 -113908 -92689 -79211
$$ packed form
11236B5904K7340K8712m2858N85j9557m653j9085r183M1363K5681k5618l6341
11224g710L9715L4431M7732k4114o0400k8100J8002O764j0116j8034O87k1138
11212b2281j1005j8812J4121Q444j6140j3358M078k3672K2734M8382J3428J8238
11200B4157O4752J5445k0710j9752Q440K1909m6846l8295j4050J3230j2785j7747
11188b2252k2442R286J8757K4220J289k5474j8605r065Q418K0865J439o9978o043
11175h9585K150N06n601O115K9455Q146L352K5488L1051j9316k4920L1528j0412
11162a2043k3735N810l8178r740k2798K700j0584Q03M2056J2069J8087l4451j311
11149g1315K9643J626L201n4163k2672L8478K3397l4931k9471K299K1219J3478
$$ plain form
11137 -79211 -58275 -44794 -77089 -112047 -83565 -45514 -52120 -31808 -43881 -61319 -52979 -45989
11125 -45989 -29864 -52149 -88980 -102989 -97330 -88618 -126985 -121829 -108679 -117029 -124690 -85557 -70573
11112 -70573 -78877 -73449 -102421 -99253 -91751 -66490 -112270 -119644 -113567 -108445 -126019 -130357 -127961
11099 -127961 -124416 -124910 -98829 -125251 -148954 -121797 -75270 -52597 -99919 -133636 -115852 -96294
11087 -96294 -68030 -82389 -85105 -89231 -47460 -58059 -107780 -122886 -104506 -65139 -48975 -61175
11075 -61175 -61545 -81264 -78634 -82410 -88533 -105899 -123251 -86292 -53536 -77141 -86498 -48672 -25813
11062 -25813 -13286 17428 33167 57024 77551 104140 80821 80906 92726 83201 99712 155962
11050 155962 256120 371838 514776 721963 950528 1131545 1267565 1421857 1538568 1515642
$$ packed form
11137g9211K0936J3481l2295l4958K8482L8051o606K0312j2073j7438Q340O990
11125d5989J6125k2285l6831j4009N659Q712l8367N156J3150q350p661L9133J4984
11112g0573q304N428k8972L168P502K5261m5780p374O077N122j7574m338K396
11099a27961L545m94K6081k6422k3703K7157M6527K2673m7322l3717J7784J9558
11087i6294K8264j4359k716m126M1771j0599m9721j5106J8380L9367J6164j2200
11075f1175l70j9719K630l776o123j7366j7352L6959L2756k3605r357L7826K2859
11062b5813J2527L0714J5739K3857K0527K6589k3319Q5J1820r525J6511N6250
11050A55962J00158J15718J42938K07187K28565J81017J36020J54292J16711k2926
$$ plain form
11040 1515642 1396055 1245228 1088518 899800 758197 601424 458794 387682 419678 368534
11030 368534 324897 303840 299139 252072 228896 194306 186706 172355 149027 165500 218873 230197
11018 230197 208396 196187 188959 166554 135067 127322 102953 91758 127598 159405 157545 167357
11006 167357 134216 105258 125945 130489 133303 95586 40666 42795 17260 23344 32730 18897
10994 18897 -11320 -54394 -64764 -8077 -4864 -13952 -27498 -39663 -51132 -48031 -50672 -68830
10982 -68830 -85553 -134897 -123649 -118350 -150387 -157571 -146055 -158152 -120488 -108988 -129630 -134567
10970 -134567 -145214 -148613 -136386 -134527 -150011 -143278 -160479 -141642 -97652 -102879 -166019 -103808
10958 -103808 -79201 -78766 -110624 -121794 -71656 -54304 -71951 -128724 -184980 -201147 -206760 -199704
$$ packed form
11040A515642j19587j50827j56710j88718j41603j56773j42630p1112L1996n1144
11030C68534m3637k1057m701m7067k3176l4590p600j4351k3328J6473N3373J1324
11018B30197k1801j2209p228k2405l1487p745k4369j1195L5840L1807j860R812
11006A67357l3141k8958K0687M544K814l7717n4920K129k5535O084R386j3833
10994A8897l0217m3074j0370N6687L213r088j3546j2165j1469L101k641j8158
10982f8830j6723m9344J1248N299l2037p184J1516j2097L7664J1500k0642m937
10970a34567j0647l399J2227J859j5484O733j7201J8837M3990n227o3140O2211
10958a03808K4607M35l1858j1170N0138J7352j7647n6773n6256j6167n613P056
$$ plain form
10946 -199704 -183696 -150333 -155529 -169069 -167780 -167649 -160536 -175221 -166378 -116488 -137945 -153820 -187907
10933 -187907 -177725 -156924 -144469 -147568 -127069 -125497 -171278 -185847 -207880 -229416 -219717 -226764
10921 -226764 -191349 -141395 -118606 -120320 -110917 -138788 -121461 -131573 -146700 -178328 -191770 -179494
10909 -179494 -175793 -153290 -179122 -170283 -135412 -91137 -78933 -102559 -121731 -97261 -57646 -18863
10897 -18863 17743 12882 19002 17362 17656 -29116 -94427 -150091 -174923 -169539 -156398 -117472 -130340
10884 -130340 -161514 -164600 -155251 -184237 -205447 -230237 -209644 -219930 -221509 -201601 -215649 -204175
10872 -204175 -239691 -244735 -224698 -230681 -200814 -175382 -184388 -146280 -156090 -195069 -207793 -207229 -190743
10859 -190743 -242163 -254573 -217447 -179717 -165487 -161924 -195716 -201935 -235370 -274901 -259499 -219274
$$ packed form
10946a99704J6008L3363n196j3540J289J31P113j4685Q843M9890k1457j5875l4087
10933a87907J0182K0801J2455l099K0499J572m5781j4569k2033k1536R699p047
10921b26764L5415M9954K2789j714R403k7871J7327j0112j5127l1628j3442J2276
10909a79494L701K2503k5832Q839L4871M4275J2204k3626j9172K4470L9615L8783
10897a8863L6606m861O120j640K94m6772o5311n5664k4832N384J3141L8926j2868
10884a30340l1174l086R349k8986k1210k4790K0593j0286j579J9908j4048J1474
10872b04175l5516n044K0037n983K9867K5432r006L8108r810l8979j2724N64J6486
10859a90743n1420j2410L7126L7730J4230L563l3792o219l3435l9531J5402M0225
$$ plain form
10847 -219274 -189816 -166549 -160964 -128635 -112011 -105686 -143743 -194465 -242662 -285814 -242908 -208636
10835 -208636 -198164 -237376 -307872 -345910 -350529 -390510 -395204 -385743 -362888 -380270 -397219 -408319
10823 -408319 -430920 -467418 -457137 -438931 -426621 -392357 -365602 -361354 -333046 -387205 -384952 -382680
10811 -382680 -389444 -403647 -391453 -399248 -450244 -478114 -476757 -464428 -468084 -483311 -508648 -501097
10799 -501097 -420816 -349129 -273121 -176777 -115154 -90211 -63007 -14820 -18973 -63042 -57251 -104143
10787 -104143 -132228 -164841 -162700 -152252 -171897 -194501 -210141 -243717 -272281 -262067 -263622 -271885
10775 -271885 -262721 -245850 -233810 -224781 -195151 -192155 -142767 -111491 -129945 -137999 -146406 -134877
10763 -134877 -115842 -122192 -130631 -151184 -190584 -188487 -196931 -188395 -216792 -249200 -297863 -319524
$$ packed form
10847b19274K9458K3267N585L2329J6624O325l8057n0722m8197m3152M2906L4272
10835b08636J0472l9212p0496l8038m619l9981m694R461K2855j7382j6949j1100
10823d08319k2601l6498J0281J8206J2310L4264K6755M248K8308n4159K253K272
10811c82680o764j4203J2194p795n0996k7870J357J2329l656j5227k5337P551
10799e01097Q0281P1687P6008R6344O1623K4943K7204M8187m153m4069N791m6892
10787a04143k8085l2613K141J0448j9645k2604j5640l3576k8564J0214j555q263
10775b71885R164J6871J2040R029K9630K996M9388L1276j8454q054q407J1529
10763a34877J9035o350q439k0553l9400K097q444Q536k8397l2408m8663k1661
$$ plain form
10751 -319524 -254904 -213074 -239731 -286070 -304644 -277250 -242226 -212410 -198486 -190602 -191599 -191947
10739 -191947 -230908 -285943 -278733 -273115 -239138 -221365 -182029 -207079 -211669 -265187 -270502 -160999
10727 -160999 -141980 -172762 -205293 -238560 -231392 -185789 -162685 -160823 -118801 -85880 -70406 -61289
10715 -61289 -72583 -139990 -168232 -177588 -176937 -166940 -191317 -205346 -156925 -83616 -33095 -10489
10703 -10489 31161 24036 45795 100563 165085 187693 229464 236895 236098 214480 243546 277624
10691 277624 280155 298556 327254 332885 337895 391249 466399 547072 628010 721359 820590 958141
10679 958141 1112511 1267298 1427792 1531797 1694711 1830654 2042274 2313385 2614827 2938110
10669 2938110 3314324 3781948 4386872 5175043 6132165 7390273 9045250 11188749 13563881
$$ packed form
10751c19524O4620M1830k6657m6339j8574K7394L5024K9816J3924P884r97l48
10739a91947l8961n5035P210N618L3977J7773L9336k5050m590n3518n315J09503
10727a60999J9019l0782l2531l3267P168M5603K3104J862M2022L2921J5474R117
10715f1289j1294o7407k8242r356O51R997k4377j4029M8421P3309N0521K2606
10703a0489M1650p125K1759N4768O4522K2608M1771P431p97k1618K9066L4078
10691B77624K531J8401K8698N631N010N3354P5150Q0673Q0938R3349R9231J37551
10679I58141J54370J54787J60494J04005J62914J35943K11620K71111L01442L23283
10669B938110L76214M67624O04924P88171R57122J258108J654977K143499K375132
$$ plain form
10660 13563881 15766497 17789627 19919945 22003277 23549187 24592355 25904275 27754505
10652 27754505 30187904 33737885 39364850 48272238 62058945 83011128 113482263 152690981
10644 152690981 193718432 228784737 259444838 287938034 303646024 295788151 271746058
10637 271746058 243966269 212311569 173390797 133474444 100624178 76861752 60361129
10630 60361129 48804703 40505997 34417199 29795711 26165646 23303658 21155341 19511349
10622 19511349 18223859 17331851 16879512 16739595 16981009 17662234 18925083 20762802 22897314
10613 22897314 24764365 25625747 25346180 24254055 23056484 22276152 22270605 23248618 25459725
10604 25459725 29105515 34092972 39676408 44257435 46053552 44677801 41344552 37803775
$$ packed form
10660A3563881K202616K023130K130318K083332J545910J043168J311920J850230
10652B7754505K433399L549981N626965Q907388J3786707K0952183L0471135L9208718
10644A52690981M1027451L5066305L0660101K8493196J5707990p857873k4042093
10637B71746058k7779789l1654700l8920772l9916353l2850266k3762426j6500623
10630F0361129j1556426q298706o088798m621488l630065k861988k148317j643992
10622A9511349j287490q92008m52339j39917K41414O81225J262849J837719K134512
10613B2897314J867051Q61382k79567j092125j197571p80332n547R78013K211107
10604B5459725L645790M987457N583436M581027J796117j375751l333249l540777
$$ plain form
10596 37803775 35270664 34261509 35085426 37893484 42710847 49287498 56274342 61214898
10588 61214898 61775195 57649923 51028132 44376565 39125525 35740103 34267828 34690194
10580 34690194 36809251 40199752 43723637 45556180 44303330 40132266 34604487 29346783
10572 29346783 25245373 22445226 20897853 20373749 20644719 21365110 22031279 21988077 20743697
10563 20743697 18419195 15599642 12895222 10614945 8807426 7427015 6405138 5639160
10555 5639160 5047228 4592820 4190916 3864696 3620214 3421856 3225839 3071969 2930910
10546 2930910 2790473 2631717 2478694 2366197 2266957 2178294 2105849 2062401 1983708 1926873
10536 1926873 1880443 1844370 1828385 1815006 1771680 1742029 1765430 1725936 1671912 1617622 1590736
$$ packed form
10596C7803775k533111j009155Q23917K808058M817363O576651O986844M940556
10588F1214898N60297m125272o621791o651567n251040l385422j472275M22366
10580C4690194K119057L390501L523885J832543j252850m171064n527779n257704
10572B9346783m101410k800147j547373n24104K70970P20391O66169m3202j244380
10563B0743697k324502k819553k704420k280277j807519j380411j021877p65978
10555E639160n91932m54408m01904l26220k44482j98358j96017j53870j41059
10546B930910j40437j58756j53023j12497r9240q8663p2445m3448p8693n6835
10536A926873m6430l6073j5985j3379m3326k9651K3401l9494n4024n4290k6886
$$ plain form
10525 1590736 1592098 1558600 1480937 1457360 1461624 1508286 1529227 1520932 1583377 1697950 1768385 1771984
10513 1771984 1804222 1790948 1738504 1721118 1709180 1657865 1578856 1443941 1342698 1277585 1201873
10502 1201873 1167386 1148015 1152409 1116688 1037611 992228 956558 928080 901648 834004 804417
10491 804417 756647 733100 731557 737449 717667 705918 717445 749294 837489 922054 979978 1021975
10479 1021975 1014573 1040264 1052921 1087611 1079102 1077086 1086102 1083789 1085054 1070100 1027176 972171
10467 972171 957790 948029 928800 960485 936228 881284 881769 895510 888277 861969 885132 944512
10455 944512 924245 961417 928618 889160 924407 889870 855459 851211 826637 785312 744109 703720
10443 703720 721161 740820 702694 675750 664314 659572 656446 642785 583621 541279 549069 592292
$$ packed form
10525A590736J362l3498p7663k3577M264M6662K0941q295O2445J14573P0435L599
10513A771984L2238j3274n2444j7386j1938n1315p9009j34915j01243o5113p5712
10502A201873l4487j9371M394l5721p9077m5383l5670k8478k6432o7644k9587
10491H04417m7770k3547j543N892j9782j1749J1527L1849Q8195Q4565N7924M1997
10479A021975p402K5691J2657L4690q509k016R016k313J265j4954m2924n5005
10467I72171j4381r761j9229L1685k4257n4944M85J3741p233k6308K3163N9380
10455I44512k0267L7172l2799l9458L5247l4537l4411m248k4574m1325m1203m0389
10443G03720J7441J9659l8126k6944j1436m742l126j3661n9164m2342P790M3223
$$ plain form
10431 592292 622779 633480 669238 656333 649117 631513 613524 665418 686272 631870 621059 637055
10419 637055 653088 626391 555855 539617 538755 584279 598601 560236 536623 546772 585814 624686
10407 624686 582124 568617 587901 566401 606773 624053 650208 646837 637043 614267 556635 538149
10395 538149 567269 591462 573540 562221 576464 583309 565447 540956 550652 536230 553906 551794
10383 551794 513811 495728 547132 567056 584071 538119 499208 491096 484744 474555 451599 418210
10371 418210 403168 405643 413244 388732 385032 377644 437616 461399 468625 470400 466762 453007 459925
10358 459925 426758 406247 391015 422763 420921 377545 369458 412165 416119 377526 364742 412968
10346 412968 436352 427406 449839 459361 444205 448714 467417 454582 428904 411011 442317 442647
$$ packed form
10431E92292L0487J0701L5758j2905p216j7604j7989N1894K0854n4402j0811J5996
10419F37055J6033k6697p0536j6238q62M5524J4322l8365k3613J0149L9042L8872
10407F24686m2562j3507J9284k1500M0372J7280K6155l371r794k2776n7632j8486
10395E38149K9120K4193j7922j1319J4243O845j7862k4491R696j4422J7676k112
10383E51794l7983j8083N1404J9924J7015m5952l8911q112o352j0189k2956l3389
10371D18210j5042K475P601k4512l700p388N9972K3783P226J775l638j3755O918
10358D59925l3167k0511j5232L1748j842m3376q087M2707L954l8593j2784M8226
10346D12968K3384q946K2433R522j5156M509J8703j2835k5678j7893L1306L30
$$ plain form
10334 442647 395630 384617 376661 348613 332514 346731 325604 298424 285345 298872 282449 285451
10322 285451 305222 348302 360673 334291 313369 316898 311690 302911 300249 296325 260636 279153
10310 279153 294322 330723 355345 332807 318640 318152 306979 329631 301900 291610 296677 285220
10298 285220 320718 358704 356483 346975 354672 318709 275815 249686 253759 258078 286407 323056
10286 323056 315810 300023 290406 298201 331689 348398 306054 281375 315403 305412 320061 349008
10274 349008 376397 400217 404460 376368 333339 332724 308252 264865 245049 212557 245695 287800
10262 287800 304887 303115 297737 299868 303898 330760 347907 345635 359050 385633 370942 363227 382608
10249 382608 382737 359780 369752 400438 419508 428488 435174 463504 559970 645021 757636 930832
$$ packed form
10334D42647m7017j1013p956k8048j6099J4217k1127k7180j3079J3527j6423L002
10322B85451J9771M3080J2371k6382k0922L529n208q779k662l924l5689J8517
10310B79153J5169L6401K4622k2538j4167m88j1173K2652k7731j0290N067j1457
10298B85220L5498L7986k221r508P697l5963m2894k6129M073M319K8329L6649
10286C23056p246j5787r617P795L3488J6709m2344k4679L4028r991J4649K8947
10274C49008K7389K3820M243k8092m3029o15k4472m3387j9816l2492L3138M2105
10262B87800J7087j772n378K131M030K6862J7147k272J3415K6583j4691p715J9381
10249C82608J29k2957R972L0686J9070Q980O686K8330R6466Q5051J12615J73196
$$ plain form
10237 930832 1130524 1363347 1535600 1679966 1813646 1895158 1811731 1628295 1478823 1323742
10227 1323742 1110564 881225 734448 624761 518775 489642 496608 430117 386490 371604
10217 371604 335482 329003 317484 297180 316624 341013 373730 343932 296052 259413 258167 272955
10205 272955 270559 275679 267735 240334 201741 216525 226568 234330 237689 248020 248530 204030 203453
10192 203453 235595 247719 266497 271814 263324 238897 218767 246364 272342 300151 297220 293424
10180 293424 292587 302526 306570 299958 275389 302191 331247 321416 330718 325765 328256 343793 352872
10167 352872 361377 377244 403324 438459 444498 435492 434751 410807 400819 405820 416735 410002 387505
10154 387505 444710 518464 553636 525555 501534 499656 481391 464518 438528 416524 450614 509677
$$ packed form
10237I30832J99692K32823J72253J44366J33680Q1512q3427j83436j49472j55081
10227A323742k13178k29339j46777j09687j05986k9133O966o6491m3627j4886
10217C71604l6122o479j1519k0304J9444K4389L2717k9798m7880l6639j246J4788
10205B72955k396N120p944k7401l8593J4784J0043P762L359J0331N10m4500n77
10192B03453L2142J2124J8778N317q490k4427k0130K7597K5978K7809k931l796
10180B93424q37R939M044o612k4569K6802K9056r831R302m953K491J5537R079
10167C52872Q505J5867K6080L5135O039r006p41k3944r988N001J0915o733k2497
10154C87505N7205P3754L5172k8081k4021j878j8265j6873k5990k2004L4090N9063
$$ plain form
10142 509677 528227 582469 570683 508278 443278 453483 448580 448657 431447 410470 384306 399802
10130 399802 399899 393684 394023 330749 296093 308868 352321 395002 394080 388043 382243 445786 409020
10117 409020 416041 405559 343313 337456 317815 259697 274767 251118 233869 227320 202215 212606
10105 212606 242453 281925 263497 203531 183184 188895 202132 221184 230947 234535 201906 152603
10093 152603 160787 183181 192452 175393 156881 155458 162966 190484 192518 161058 193717 198784 200825
10080 200825 190236 203474 192651 178321 154689 168053 166697 193113 169964 145800 148971 170669
10068 170669 181264 175385 173081 181838 222886 246060 237044 220468 222539 203266 121582 106530
10056 106530 130213 156452 148848 136642 98668 98098 98960 133118 140722 144801 133186 137125 158592
$$ packed form
10142E09677J8550N4242j1786o2405o5000J0205m903P7j7210k0977k6164J5496
10130C99802R7o215L39o3274l4656J2775M3453M2681r22o037n800O3543l6766
10117D09020P021j0482o2246n857j9641n8118J5070k3649j7249o549k5105J0391
10105B12606K9847L9472j8428n9966k0347N711J3237J9052R763L588l2629m9303
10093A52603Q184K2394R271j7059j8512j423P508K7518K034l1460L2659N067K041
10080B00825j0589J3238j0823j4330k3632J3364j356K6416k3149k4164L171K1698
10068A70669J0595n879k304Q757M1048K3174r016j6576K071j9273q1684j5052
10056A06530K3683K6239p604j2206l7974n70Q62L4158P604M079j1615L939K1467
$$ plain form
10043 158592 181926 201743 173984 125579 105837 152439 158731 157315 170155 199893 223636 236954
10031 236954 233942 226819 207741 190691 245856 252135 200693 206014 185271 143122 134605 131717 137050
10018 137050 157897 161315 176223 194552 170465 201767 229121 204190 194659 184969 149310 122663
10006 122663 139371 156228 171851 185929 165455 118010 92104 83209 88021 111164 111425 91104
9994 91104 78569 86030 117214 115090 97213 109285 122486 106124 141105 165678 163686 149213
9982 149213 94160 78357 162056 219102 258288 271158 215088 141442 125324 152226 144221 116160
9970 116160 95704 85715 84662 99187 140596 176435 206734 201366 165979 132261 98759 68730
9958 68730 96114 108392 146555 148920 135049 147229 154016 151622 162470 178759 163716 93204
$$ packed form
10043A58592K3334J9817k7759m8405j9742M6602O292j416J2840K9738K3743J3318
10031B36954l012p123j9078j7050N5165O279n1442N321k0743m2149q517k888N333
10018A37050K0847L418J4908J8329k4087L1302K7354k4931r531r690l5659k6647
10006A22663J6708J6857J5623J4078k0474m7445k5906q895M812K3143K61k0321
9994I1104j2535P461L1184k124j7877J2072J3201j6362L4981K4573j992j4473
9982A49213n5053j5803Q3699N7046L9186J2870n6070p3646j6118K6902q005k8061
9970A16160k0456r989j053J4525M1409L5839L0299n368l5387l3718l3502l0029
9958F8730K7384J2278L8163K365j3871J2180O787k394J0848J6289j5043p0512
$$ plain form
9946 93204 44162 30706 107577 149166 162580 129198 103961 57091 63352 49066 69227 113977
9934 113977 99574 105672 104227 90671 98499 130533 185676 195470 185122 162962 137516 127187
9922 127187 117730 119380 124747 145615 130393 108309 93295 93409 136985 165395 144965 99208 62871
9909 62871 35482 57238 91446 99648 121634 137639 73813 93915 100537 129856 106644 82531
9897 82531 72189 90625 117822 127157 152182 176761 186366 238013 205841 158977 146239 126692
9885 126692 126147 150768 125806 51787 121274 129952 107387 89847 99542 127879 135600 101295 99916
9872 99916 114913 90143 84170 67534 88644 86557 75892 88479 108221 112350 118290 86939 67878
9859 67878 63259 45476 78889 83041 78951 83902 68751 84236 116467 120799 118949 100116 103202
$$ packed form
9946I3204m9042j3456P6871M1589J3414l3382k5237m6870O261j4286K0161M4750
9934A13977j4403O098j445j3556P828L2034N5143R794j0348k2160k5446j0329
9922A27187r457J650N367K0868j5222k2084j5014J14M3576K8410k0430m5757l6337
9909F2871k7389K1756L4208Q202K1986J6005o3826K0102O622K9319k3212k4113
9897H2531j0342J8436K7197R335K5025K4579R605N1647l2172m6864j2738j9547
9885A26692n45K4621k4962p4019O9487Q678k2565j7540R695K8337P721l4305j379
9872I9916J4997k4770n973j6636K1110k087j0665J2587J9742M129N940l1351j9061
9859F7878m619j7783L3413M152m090M951j5151J5485L2231M332j850j8833L086
$$ plain form
9846 103202 108126 106296 114315 123358 163312 181274 183878 167332 131345 137074 157914 122418 84105
9833 84105 64943 82674 65617 29979 31019 42108 63390 78057 103670 93108 98940 113477
9821 113477 119324 126561 128957 114597 116243 118028 99660 115219 114761 107381 101379 109262 99867 63719
9807 63719 40770 23025 9696 57841 102345 75692 68180 49056 51234 105887 129956 156107
9795 156107 163211 140224 152560 146117 144830 124799 126766 121696 95615 93952 59076 49788 21705
9782 21705 30911 77294 92645 81015 71041 101208 115204 92667 61128 38038 22949 19512
9770 19512 65218 87390 94861 85539 80560 55825 29627 77363 73942 94563 121603 119241 83438
9757 83438 61562 69663 108751 131233 124259 111943 128596 147118 165786 135784 124813 132945
$$ packed form
9846A03202M924j830Q019R043L9954J7962K604j6546l5987N729K0840l5496l8313
9833H4105j9162J7731j7057l5638J040J1089K1282J4667K5613j0562N832J4537
9821A13477N847P237K396j4360J646J785j8368J5559m58p380o002P883r395l6148
9807F3719k2949j7745j3329M8145M4504k6653p512j9124K178N4653K4069K6151
9795A56107P104k2987J2336o443j287k0031J967n070k6081j663l4876r288k8083
9782B1705R206M6383J5351j1630r974L0167J3996k2537l1539k3090j5089l437
9770A9512M5706K2172P471r322m979k4735k6198M7736l421K0621K7040k362l5803
9757H3438k1876Q101L9088K2482o974j2316J6653J8522J8668l0002j0971Q132
$$ plain form
9745 132945 163769 165358 110519 93322 152832 123335 89055 86667 81981 85031 102341 89014
9733 89014 58112 53623 64299 82538 98203 91995 83077 104962 134749 123031 95886 91421 109390
9720 109390 133922 114428 113152 111380 136563 167847 126029 77193 15315 11337 39794 51617
9708 51617 72248 78053 32640 44179 37125 73390 101096 99514 117092 117044 86880 53503 91727
9695 91727 128391 80050 48744 54459 65661 67752 99770 86837 55267 55650 79062 106123 103193
9682 103193 75429 46015 81415 103368 119080 120422 147720 164509 118509 90929 73725 58927
9670 58927 58811 78132 89402 147629 127840 80068 84288 94998 80168 70466 80014 59117 36925
9657 36925 92531 81931 56472 74270 119219 111768 127094 131805 154975 233857 269247 233636
$$ packed form
9745A32945L0824J589n4839j7197N9510k9497l4280k388m686L050J7310j3327
9733H9014l0902m489J0676J8239J5665o208q918K1885K9787j1718k7145m465J7969
9720A09390K4532j9494j276j772K5183L1284m1818m8836o1878l978K8457J1823
9708E1617K0631N805m5413J1539p054L6265K7706j582J7578m8l0164l3377L8224
9695I1727L6664m8341l1306N715J1202K091L2018j2933l1570L83K3412K7061k930
9682A03193k7764k9414L5400K1953J5712J342K7298J6789m6000k7580j7204j4798
9670E8927j16J9321J1270N8227j9789m7772M220J0710j4830r702R548k0897k2192
9657C6925N5606j0600k5459J7798M4949p451J5326M711K3170P8882L5390l5611
$$ plain form
9645 233636 177084 165201 150604 139275 96176 117746 103030 61677 51542 81565 90794 91126
9633 91126 80864 36335 45405 88065 72908 57054 78640 64442 50542 102933 115843 112838
9621 112838 126081 69668 67158 99500 61128 46119 73166 80936 55605 26875 47246 81543
9609 81543 89642 118487 80656 87570 82857 75002 66742 70349 26945 20874 96903 105050 78267
9596 78267 70303 61982 70378 107779 97902 68206 61651 48189 74281 91218 82443 66159 62677
9583 62677 48833 40097 65160 58398 37480 42617 57654 46505 65224 34295 25139 68817 139248
9570 139248 133469 117667 128106 152064 105276 38122 45064 67682 49265 62597 116461 111414
9558 111414 104172 107026 67072 53970 59246 65393 50510 59726 44029 15127 -7601 6489 48738
$$ packed form
9645B33636n6552j1883j4597j1329m3099K1570j4716m1353j0135L0023R229L32
9633I1126j0262m4529R070M2660j5157j5854K1586j4198j3900N2391J2910l005
9621A12838J3243n6413k510L2342l8372j5009K7047P770k5331k8730K0371L4297
9609H1543Q099K8845l7831O914m713p855q260L607m3404o071P6029Q147k6783
9596G8267p964q321Q396L7401r877k9696o555j3462K6092J6937q775j6284l482
9583F2677j3844q736K5063o762k0918N137J5037j1149J8719l0929r156M3678P0431
9570A39248n779j5802J0439K3958m6788o7154O942K2618j8417J3332N3864n047
9558A11414p242K854l9954j3102N276O147j4883R216j5697k8902k2728J4090M2249
$$ plain form
9545 48738 65289 37530 182 -8423 30639 65402 62084 62248 46478 49396 22855 -491 25424
9532 25424 73032 73759 47934 67045 84107 80706 112329 127489 84452 61518 61780 65273 63255
9519 63255 61733 46312 37497 59432 57039 54770 -6542 -4460 -2163 -27531 -4299 34432 45997
9506 45997 56751 38014 37477 35585 31948 3724 -32627 -30612 -1325 44237 72190 54513 16025
9493 16025 -14585 13737 39937 47102 85249 115079 144638 103624 94893 109703 52309 19310
9481 19310 -8361 35091 34678 40900 21759 64368 63476 108296 110533 109221 83425 7734 17921
9468 17921 49381 82826 38351 43252 32618 30542 61077 58659 24549 6561 26343 31981 48514
9455 48514 81075 62609 84096 100611 102895 108870 80743 71218 81893 98032 117098 101642
$$ packed form
9545D8738J6551k7759l7348q605L9062L4763l318J64j5770K918k6541k3346K5915
9532B5424M7608P27k5825J9111J7062l401L1623J5160m3037k2934K62L493k018
9519F3255j522j5421q815K1935k393k269o1312K082K297k5368K3232L8731J1565
9506D5997J0754j8737n37j892l637k8224l6351K015K9287M5562K7953j7677l8488
9493A6025l0610K8322K6200P165L8147K9830K9559m1014q731J4810n7394l2999
9481A9310k7671M3452m13O222j9141M2609q92M4820K237j312k5796p5691J0187
9468A7921L1460L3445m4475M901j0634k076L0535k418l4110j7988J9782N638J6533
9455D8514L2561j8466K1487J6515K284N975k8127r525J0675J6139J9066j5456
$$ plain form
9443 101642 93017 33683 23226 100242 120179 89887 68650 44800 35434 28213 2375 -1757
9431 -1757 57194 89396 61976 58007 89276 125677 97828 36994 57281 81246 48905 47553
9419 47553 45714 27895 1487 5743 50772 47509 51035 51399 58991 52685 60671 81656 88992 95322
9405 95322 62919 37894 10630 13998 55235 69553 58564 41006 24367 42809 17772 -8006
9393 -8006 11069 -10672 44663 76031 67274 61829 45853 76027 115441 110402 66436 37739 72594
9380 72594 108015 89725 83502 95259 73730 44405 25774 14542 41648 73145 49236 7560
9368 7560 25600 77387 103379 111381 91834 72878 60838 52466 64521 67542 62596 44229 17630
9355 17630 34751 47489 59342 57967 17186 65077 45034 24970 80856 109829 106876 64681
$$ packed form
9443A01642q625n9334j0457P7016J9937l0292k1237k3850r366p221k5838m132
9431a757N8951L2202k7420l969L1269L6401k7849o0834K0287K3965l2341j352
9419D7553j839j7819k6408M256M5029l263L526L64P592o306P986K0985P336O330
9405I5322l2403k5025k7264L368M1237J4318j0989j7558j6639J8442k5037k5778
9393h006J9075k1741N5335L1368q757n445j5976L0174L9414n039m3966k8697L4855
9380G2594L5421j8290o223J1757k1529k9325j8631j1232K7106L1497k3909m1676
9368G560J8040N1787K5992Q002j9547j8956j2040q372J2055L021m946j8367k6599
9355A7630J7121J2738J1853j375m0781M7891k0043k0064N5886K8973k953m2195
$$ plain form
9343 64681 36120 41672 50509 61569 78439 78006 53741 13001 19937 36238 63982 76329 62762
9330 62762 70536 32834 38690 53248 53546 31796 48508 51024 55247 43883 2407 26556 52804
9317 52804 59249 24932 18438 52048 42007 47759 53907 44274 -23771 -10162 7584 610 13282
9304 13282 42468 36079 5746 20576 36014 78462 119526 119140 110670 88570 67925 31493 46647
9291 46647 86637 69306 44713 69236 71424 41859 69321 80348 70447 64409 96972 51544
9279 51544 44409 66061 44231 10071 24178 23331 30341 45177 68980 78818 73375 103157 72242
9266 72242 79397 110509 63353 42343 44115 57442 55261 20881 8368 -10445 -14439 11495 19639
9253 19639 24058 23006 35259 63606 66910 32267 -29 7450 27212 83918 81233 36668 45315
$$ packed form
9343F4681k8561N552Q837J1060J6870m33k4265m0740O936J6301K7744J2347j3567
9330F2762P774l7702N856J4558K98k1750J6712K516M223j1364m1476K4149K6248
9317E2804O445l4317o494L3610j0041N752O148r633o8045J3609J7746o974J2672
9304A3282K9186o389l0333J4830J5438M2448M1064l86q470k2100k0645l6432J5154
9291D6647L9990j7331k4593K4523K188k9565K7462J1027r901o038L2563m5428
9279E1544p135K1652k1830l4160J4107q47P010J4836K3803R838n443K9782l0915
9266G2242P155L1112m7156k1010J772J3327k181l4380j2513j8813l994K5934Q144
9253A9639M419j052J2253K8347L304l4643l2296P479J9762N6706k685m4565Q647
$$ plain form
9240 45315 45359 41334 32405 17630 19509 75881 142867 114500 86492 44274 18359 34467 73686
9227 73686 46139 8408 -396 -4744 5767 27844 20243 48317 66822 51738 23624 52110
9215 52110 60535 36928 55934 92886 92248 99697 102179 106502 93216 80536 86917 112941 90947
9202 90947 54683 71442 58681 53239 15664 -14491 1943 4951 11021 42595 26900 -21058
9190 -21058 -33604 24789 59973 81397 83113 94233 62936 23356 -14505 -11018 31299 53871
9178 53871 33091 19330 43592 47237 55676 67158 42576 35423 34339 47983 27623 8239 -2851
9165 -2851 23285 56896 29097 36243 50297 42216 67214 81576 54739 37078 7957 -19150
9153 -19150 -10828 3143 29250 25445 73147 109201 72692 49409 48895 6694 3661 9789 23353
$$ packed form
9240D5315M4m025q929j4775J879N6372O6986k8367k8008m2218k5915J6108L9219
9227G3686k7547l7731q804m348J0511K2077p601K8074J8505j5084k8114K8486
9215E2110Q425k3607J9006L6952o38P449K482M323j3286j2680O381K6024k1994
9202I0947l6264J6759j2761n442l7575l0155J6434L008O070L1574j5695m7958
9190b1058j2546N8393L5184K1424J716J1120l1297l9580l7861L487M2317K2572
9178E3871k0780j3761K4262L645Q439J1482k4582p153j084J3644k0360j9384j1090
9165b851K6136L3611k7799P146J4054q081K4998J4362k6837j7661k9121k7107
9153a9150Q322J3971K6107l805M7702L6054l6509k3283n14m2201l033O128J3564
$$ plain form
9140 23353 13474 44140 61241 31654 37889 73367 41796 -15137 -628 21250 48439 81464
9128 81464 92228 84999 87549 77507 38350 17853 71161 89380 84296 78039 35392 24546 23805
9115 23805 58372 51975 70455 68393 8688 -11547 9674 15240 13347 59530 60019 80433 76760
9102 76760 44767 11770 6821 35947 23100 14704 8530 33891 65073 77932 62744 21944
9090 21944 22962 38552 38069 51213 44836 23689 24905 44235 46955 58686 35561 -143 -34171
9077 -34171 -12978 30127 44935 28205 -16771 -5628 20234 54868 78452 60873 68840 21950
9065 21950 -2484 25871 30723 46447 73169 87421 98248 77567 28912 28954 36505 27803 38112
9052 38112 62842 52434 70052 68014 64232 69525 70023 47281 23118 27069 12596 32339 72201
$$ packed form
9140B3353r879L0666J7101k9587O235L5478l1571n6933J4509K1878K7189L3025
9128H1464J0764p229K550j0042l9157k0497N3308J8219n084o257m2647j0846p41
9115B3805L4567o397J8480k062n9705k0235K1221N566j893M6183M89K0414l673
9102G6760l1993l2997m949K9126j2847q396o174K5361L1182J2859j5188m0800
9090B1944J018J5590m83J3144o377k1147J216J9330K720J1731k3125l5704l4028
9077c4171K1193M3105J4808j6730m4976J1143K5862L4634K3584j7579P967m6890
9065B1950k4434K8355M852J5724K6722J4252J0827k0681m8655M2P551q702J0309
9052C8112K4730j0408J7618k038l782N293M98k2742k4163L951j4473J9743L9862
$$ plain form
9039 72201 58066 19175 12953 -10073 10815 32693 55707 18089 -3448 7766 19793 16446
9027 16446 25131 12251 30617 64276 42514 -19655 -59564 -7052 29504 67385 124042 119238
9015 119238 100756 99323 67064 81542 88369 78929 60298 67810 82221 70206 -584 -37575
9003 -37575 2095 39771 54513 79335 84044 83681 84811 73343 100481 74387 54675 40572 34467
8990 34467 64579 55513 60313 54522 44150 30042 35793 -12886 -903 31601 49106 51769 72777
8977 72777 67038 59156 90767 87319 30176 29893 35048 43689 51864 46445 -7903 -47210 -67229 -30187
8963 -30187 21570 28408 -21067 -47280 -1684 57601 89571 81409 53487 40162 23808 -53842
8951 -53842 -70179 -38819 -27197 10940 32529 31935 27085 30785 25172 22523 19766 36671 54483
$$ packed form
9039G2201j4135l8891o222k3026K0888K1878K3014l7618k1537J1214J2027l347
9027A6446Q685j2880J8366L3659k1762o2169l9909N2512L6556L7881N6657m804
9015A19238j8482j433l2259J4478O827r440j8631P512J4411j2015p0790l6991
9003c7575L9670L7676J4742K4822M709l63J130j1468K7138k6094j9712j4103o105
8990C4467L0112r066M800n791j0372j4108N751m8679J1983L2504J7505K663K1008
8977G2777n739p882L1611l448n7143k83N155Q641Q175n419n4348l9307k0019L7042
8963c0187N1757O838m9475k6213M5596N9285L1970q162k7922j3325j6354p7650
8951e3842j6337L1360J1622L8137K1589n94m850L700n613k649k757J6905J7812
$$ plain form
8938 54483 84228 81975 59956 28218 75525 89930 42516 -5491 -18171 38686 64456 45197
8926 45197 -734 22780 48351 70887 66974 48926 17907 22911 15348 24143 29580 60286 71493
8913 71493 70699 80379 83424 26450 29155 5969 -14854 -9354 -27760 18281 -9542 -20372 -39648
8900 -39648 -12003 15065 32994 28936 34484 39814 73574 50230 -20823 -43861 11537 67378
8888 67378 16468 1250 10878 6244 1692 35571 67626 28517 -8719 5190 -4946 -15170
8876 -15170 7049 39088 69849 61753 67040 67710 88792 85198 105329 117925 94756 50184 69802
8863 69802 67463 54395 38916 30430 -1449 -16082 8475 27033 57265 26822 25878 56668 50912
8850 50912 49172 31848 30555 64786 83870 93945 56783 69545 83742 68992 54523 6833
$$ packed form
8938E4483K9745k253k2019l1738M7307J4405m7414m8007j2680N6857K5770j9259
8926D5197m5931K3514K5571K2536l913j8048l1019N004p563Q795N437L0706J1207
8913G1493p94R680L045n6974K705k3186k0823N500j8406M6041k7823j0830j9276
8900c9648K7645K7068J7929m058N548N330L3760k3344p1053k3038N5398N5841
8888F7378n0910j5218R628m634m552L3879L2055l9109l7236J3909j0136j0224
8876a5170K2219L2039L0761q096N287O70K1082l594K0131J2596k3169m4572J9618
8863F9802k339j3068j5479q486l1879j4633K4557J8558L0232l0443r44L0790n756
8850E0912j740j7324j293L4231J9084J0075l7162J2762J4197j4750j4469m7690
$$ plain form
8838 6833 -28273 -32596 -917 -13646 -43032 -595 5777 -26962 16716 34891 55526 104739
8826 104739 85468 35879 -18190 -1645 42011 46120 53790 48290 17584 4625 24714 33388
8814 33388 23877 23166 39584 35364 7443 19106 34605 47295 37571 37131 48511 30371 18840
8801 18840 27332 41221 62302 64856 32857 47547 82606 84901 88450 80618 115265 43772 -20512
8788 -20512 -14449 32407 13947 4786 37312 38742 71418 56718 54614 82995 76754 74790 57874
8775 57874 55597 68004 80878 80017 44540 25067 45654 53231 49060 45376 31057 24490 28230
8762 28230 5466 15702 2804 5 -13691 -2073 5711 25567 5981 9622 24726 -12
8750 -12 -6248 18274 37633 47063 21572 17271 43956 9015 1828 8831 -12850 28543 67845
$$ packed form
8838F833l5106m323L1679j2729k9386M2437O372l2739M3678J8175K0635M9213
8826A04739j9271m9589n4069J6545M3656M109P670n500l0706j2959K0089Q674
8814C3388r511p11J6418m220k7921J1663J5499J2690r724m40J1380j8140j1531
8801A8840Q492J3889K1081K554l1999J4690L5059K295L549p832L4647p1493o4284
8788b0512O063M6856j8460r161L2526J430L2676j4700k104K8381o241j964j6916
8775E7874k277J2407J2874q61l5477j9473K0587P577m171l684j4319o567L740
8762B8230k2764J0236j2898k799j3696J1618P784J9856j9586L641J5104k4738
8750a2o236K4522J9359R430k5491m301K6685l4941p187P003k1681M1393L9302
$$ plain form
8737 67845 50944 38496 51259 57885 83355 94503 81834 81249 79091 34210 10338 36246 51058
8724 51058 43960 42939 73392 41109 34170 35104 24280 3614 -15973 -18029 -19090 8915 28006
8711 28006 31358 67831 49410 22280 20496 7113 -356 -17717 -29596 -5218 24782 2250
8699 2250 -5020 18837 12842 29005 12455 -15605 41769 31884 35610 73326 97209 74351 51519
8686 51519 4195 -3060 -4017 16102 9962 -37256 -56331 -8974 16990 2647 -8093 10862 5247
8673 5247 16644 49217 13501 -22574 2461 40286 47836 42698 23193 -5599 9304 13832 24304
8660 24304 60180 62190 89270 71817 68239 67507 67198 56900 72117 17085 16564 31396 3982
8647 3982 20514 4189 37223 43910 59300 98397 159318 99815 55578 60312 44410 41478 43960
$$ packed form
8737F7845j6901j2448J2763O626K5470J1148j2669n85k158m4881k3872K5908J4812
8724E1058p098j021L0453l2283o939R34j0824k0666j9587k056j061K8005J9091
8711B8006L352L6473j8421k7130j784j3383p469j7361j1879K4378L0000k2532
8699B250p270K3857n995J6163j6550k8060N7374r885L726L7716K3883k2858k2832
8686E1519m7324p255r57K0119o140m7218j9075M7357K5964j4343j0740J8955n615
8673E247J1397L2573l5716l6075K5035L7825P550n138j9505k8792J4903M528J0472
8660B4304L5876K010K7080j7453l578p32l09j0298J5217n5032n21J4832k7414
8647C982J6532j6325L3034O687J5390L9097O0921n9503m4237M734j5902k932K482
$$ plain form
8634 43960 46245 52337 88262 84392 43806 40225 21178 -15347 -39892 -38446 -57569 -58641 23264
8621 23264 18834 -1351 -41625 -82643 -67266 -15715 6989 35156 25642 17676 56445 94549
8609 94549 68259 6354 -29374 -36079 -34251 -10899 -2189 26101 40426 6819 -36548 -28293 -6182
8596 -6182 40612 71550 79583 63146 34918 78406 56818 -5956 -15528 -15342 -23552 4500 22299
8583 22299 -15810 -8844 20314 51277 73761 56716 25336 -24411 -35322 -29136 6978 44223
8571 44223 58162 41175 -9254 16460 19572 8122 21887 8851 13197 64321 78034 66278
8559 66278 50004 63791 40873 -13930 -43048 -41040 -12231 17872 34962 30699 6151 -5999
8547 -5999 22816 54136 25844 -2076 37639 82941 69179 29319 16885 27267 20246 -2502
$$ packed form
8634D3960K285O092L5925l870m0586l581j9047l6525k4545J446j9123j072Q1905
8621B3264m430k0185m0274m1018J5377N1551K2704K8167r514p966L8769L8104
8609I4549k6290o1905l5728o705J828K3352Q710K8290J4325l3607m3367Q255K2111
8596f182M6794L0938Q033j6437k8228M3488k1588o2774r572J86q210K8052J7799
8583B2299l8109O966K9158L0963K2484j7045l1380m9747j0911O186L6114L7245
8571D4223J3939j6987n0429K5714L112j1450J3765j3036M346N1124J3713j1756
8559F6278j6274J3787k2918n4803k9118K008K8809L0103J7090m263k4548j2150
8547e999K8815L1320k8292k7920L9715M5302j3762l9860j2434J0382p021k2748
$$ plain form
8535 -2502 -22763 -1057 -21447 -26859 -28031 -24028 -190 7224 21221 61850 44052 18050 8322
8522 8322 33216 51815 77405 109559 110518 82125 46447 67174 48582 43261 11367 10430 16221
8509 16221 38702 50665 354 -30568 -12565 3396 59841 57406 76005 39019 26314 6096
8497 6096 5344 450 -14364 -12284 13223 39634 -384 -12300 -9063 4265 56400 57111 63530 58473
8483 58473 53474 42201 12225 15455 -9344 -37897 -66967 -45247 -20080 136 33301 28796
8471 28796 49418 75456 69843 51425 31699 14891 49764 71712 51134 24849 19567 47213
8459 47213 66348 39658 13312 -26359 -35906 -58297 -79317 -79395 -25544 -13339 4491 23079 14420
8446 14420 18599 13790 38050 36612 93277 157011 172657 92578 46229 34964 41781 13175 -19083
$$ packed form
8535b502k0261K1706k0390n412j172M003K3838P414J3997M0629j7798k6002r728
8522H322K4894J8599K5590L2154R59k8393l5678K0727j8592n321l1894r37N791
8509A6221K2481J1963n0311l0922J8003J5961N6445k435J8599l6986j2705k0218
8497F096p52m894j4814K080K5507K6411m0018j1916L237J3328N2135P11O419n057
8483E8473m999j1273k9976L230k4799k8553k9070K1720K5167K0216L3165m505
8471B8796K0622K6038n613j8418j9726j6808L4873K1948k0578k6285n282K7646
8459D7213J9135k6690k6346l9671r547k2391k1020p8N3851J2205J7830J8588q659
8446A4420M179m809K4260j438N6665O3734J5646q0079m6349j1265O817k8606l2258
$$ plain form
8433 -19083 -16397 -3176 23431 31082 -13295 -30864 -18057 18917 33262 49836 78369 73659
8421 73659 42317 -7944 -45316 -29208 -37820 -69115 -43601 -27057 -6565 -20145 -56573 -30835
8409 -30835 -17514 12718 23 -14705 1524 15710 -23729 -43463 -13100 9180 -9910 11516
8397 11516 24273 29722 27920 55550 31673 26339 67910 24752 -6877 -30487 -12909 -18175 -17145
8384 -17145 -60085 -58354 -32513 -30432 5169 55239 76288 79596 66924 70541 46985 56548 61565
8371 61565 3840 -14407 4619 63794 71824 46895 61534 85049 87402 63906 74249 83132
8359 83132 62576 32081 27417 -1946 12933 4852 8393 22115 4671 42564 67571 34641
8347 34641 -1360 12665 6051 -7024 -53198 -40616 4229 36232 62683 64219 54526 47825 77603
$$ packed form
8433a9083K686J3221K6607P651m4377j7569J2807L6974J4345J6574K8533m710
8421G3659l1342n0261l7372J6108q612l1295K5514J6544K0492j3580l6428K5738
8409c0835J3321L0232j2695j4728J6229J4186l9439j9734L0363K2280j9090K1426
8397A1516J2757N449j802K7630k3877n334M1571m3158l1629k3610J7578n266J030
8384a7145m2940J731K5841K081L5601N0070K1049L308j2672L617k3556R563N017
8371F1565n7725j8247J9026N9175Q030k4929J4639K3515K353k3496J0343Q883
8359H3132k0556l0495m664k9363J4879q081L541J3722j7444L7893K5007l2930
8347C4641l6001J4025o614j3075m6174J2582M4845L2003K6451J536r693o701K9778
$$ plain form
8334 77603 112558 99826 30972 17658 7025 7357 48804 47450 39984 -6159 -17297 -13982 16025
8321 16025 35032 25021 -835 8386 23075 40850 32154 11943 13855 -591 13454 18496 22894
8308 22894 37944 77870 64524 71476 76743 54452 14216 20673 8850 1151 -1829 -35268 -81222
8295 -81222 -42716 -13126 -74 -11090 -21408 -28475 -21855 -17266 -32207 -74804 -67089 -45790 -47756
8282 -47756 -12438 67428 123083 105189 50203 30549 42590 45356 18232 7959 23601 20521
8270 20521 22425 46057 79448 78532 63489 2596 -71111 -57986 -30146 -16664 -11722 -13681 -15539
8257 -15539 -1024 38250 75889 114245 97156 65332 56247 59504 16827 -9778 -22768 22460
8245 22460 -5976 -42310 -10771 2414 -20388 -44329 -24722 -51773 -33083 -31987 -64321 -44105
$$ packed form
8334G7603L4955j2732o8854j3314j0633L32M1447j354p466m6143j1138L315L0007
8321A6025J9007j0011k5856R221J4689J7775q696k0211J912j4446J4045N042M398
8308B2894J5050L9926j3346O952N267k2291m0236O457j1823p699k980l3439m5954
8295h1222L8506K9590J3052j1016j0318p067O620M589j4941m2597P715K1299j966
8282d7756L5318P9866N5655j7894n4986j9654J2041K766k7124j0273J5642l080
8270B0521J904K3632L3391r16j5043o0893p3707J3125K7840J3482M942j959j858
8257a5539J4515L9274L7639L8356j7089l1824r085L257m2677k6605j2990M5228
8245B2460k8436l6334L1539J3185k2802k3941J9607k7051J8690J096l2334K0216
$$ plain form
8233 -44105 -1860 -6777 -56554 -71093 -33952 -23702 27239 55693 31310 25572 33887 43168 29488
8220 29488 30206 14598 33624 51490 31783 4772 1481 5276 19766 26082 20984 4056 30033
8207 30033 52941 51391 53851 54150 23715 19868 28055 484 -11051 16376 12724 9520 -11065
8194 -11065 -13141 -19406 13730 20190 -10091 -50021 -46766 -55841 -66282 -29558 -4384 21919 53034
8181 53034 70030 33222 51392 78986 67676 48974 106858 123940 79460 41337 10851 23025
8169 23025 29139 1823 -12700 -85 25687 41192 58584 19417 18085 31017 46976 45412
8157 45412 33453 44539 37015 10240 -8037 -89 5745 36442 61731 97775 65304 25219
8145 25219 -4179 5356 10908 35496 63424 65038 59263 79151 26687 -11264 15921 -3480 15381
$$ packed form
8233d4105M2245m917m9777j4539L7141J0250N0941K8454k4383n738Q315R281j3680
8220B9488P18j5608J9026J7866j9707k7011l291L795J4490O316n098j6928K5977
8207C0033K2908j550K460K99l0435l847Q187k7571j1535K7427l652l204k0585
8194a1065k076o265L3136O460l0281l9930L255r075j0441L6724K5174K6303L1115
8181E3034J6996l6808J8170K7594j1310j8702N7884J7082m4480l8123l0486J2174
8169B3025O114k7316j4523J2615K5772J5505J7392l9167j332J2932J5959j564
8157D5412j1959J1086p524k6775j8277P948N834L0697K5289L6044l2471m0085
8145B5219k9398R535N552K4588K7928J614n775J9888n2464l7951K7185j9401J8861
$$ plain form
8132 15381 840 -35304 -14974 -29288 -23911 28034 27021 14107 -14950 -29942 -40098 -39469 -27267
8119 -27267 32430 51224 63039 58979 1843 -25823 -5016 -2884 -1105 2564 -17737 -24201 2143
8106 2143 89 30349 10190 -2436 53850 50978 38629 21391 1426 2037 4339 15171 57188
8093 57188 37286 23904 -14286 -43414 -67184 -14229 28219 -719 15857 11335 -40999 -51592
8081 -51592 -43125 7597 14893 -16341 -37855 5093 20512 31121 21616 31617 46573 41306 1128
8068 1128 -24647 -30198 -39754 -77167 -62312 -10499 18353 29913 33782 17831 -36629 -50101 -3622
8055 -3622 79 18493 -5764 -33125 -76873 -80445 -64136 -43376 -30355 -46047 -31468 -15000
8043 -15000 -22933 -8155 17651 6582 45959 51335 47981 46007 74438 48036 11306 26803 32046
$$ packed form
8132A5381j4541l6144K0330j4314N377N1945j013j2914k9057j4992j0156O29J2202
8119b7267N9697J8794J1815m060n7136k7666K0807K132J779L669k0301o464K6344
8106B143k054L0260k0159j2626N6286k872j2349j7238j9965O11K302J0832M2017
8093E7188j9902j3382l8190k9128k3770N2955M2448k8938J6576m522n2334j0593
8081e1592Q467N0722P296l1234k1514M2948J5419J0609r505J0001J4956n267m0178
8068A128k5775n551r556l7413J4855N1813K8852J1560L869j5951n4460j3472M6479
8055c622L701J8414k4257k7361m3748l572J6309K0760J3021j5692J4579J6468
8043a5000p933J4778K5806j1069L9377N376l354j974K8431k6402l6730J5497N243
$$ plain form
8030 32046 19116 19246 14127 7925 -19883 -38632 -21845 35195 10629 -29977 -38339 -38893 -55192
8017 -55192 -36700 -61180 -26976 51907 97410 84990 84426 64076 46901 88718 57217 29783
8005 29783 36854 27583 16208 15691 36622 89781 103391 88600 60935 9365 1292 35629 58945
7992 58945 9090 -31021 -18504 -13925 -2664 -19802 -18805 15165 38637 18907 27777 28360 28172
7979 28172 24912 48173 48400 8442 -10744 -83081 -92710 -44270 7465 14918 -24382 -44800 -41048
7966 -41048 -38549 -90521 -84649 -35446 -36715 -63964 -11116 18045 24671 30445 17220 -6793 5502
7953 5502 11689 27551 -19908 -1730 7364 7591 35384 39830 29525 -1617 2226 -9991 -28632
7940 -28632 -61163 -55013 -62564 -48245 -35372 -41702 -43655 -23363 -15025 -37274 -75292 -45841 -34011
$$ packed form
8030C2046j2930J30n119o202k7808j8749J6787N7040k4566m0606q362n54j6299
8017e5192J8492k4480L4204P8883M5503j2420n64k0350j7175M1817l1501k7434
8005B9783P071r271j1375n17K0931N3159J3610j4791k7665n1570q073L4337K3316
7992E8945m9855m0111J2517M579J1261j7138R97L3970K3472j9730Q870N83j88
7979B8172l260K3261K27l9958j9186p2337r629M8440N1735P453l9300k0418L752
7966d1048K499n1972N872M9203j269k7249N2848K9161O626N774j3225k4013J2295
7953E502O187J5862m7459J8178R094K27K7793M446j0305l1142L843j2217j8641
7940b8632l2531O150p551J4319J2873o330j953K0292Q338k2249l8018K9451J1830
$$ plain form
7927 -34011 -24757 -9842 1781 6613 10145 -14345 1272 16494 8437 -10777 -19890 -19742 -65431
7914 -65431 -49770 -12908 -14224 -6655 1941 -17966 -61047 -84397 -95736 -68457 -60635 -42508 -11128
7901 -11128 -12233 -16029 -40593 -18576 -31120 13936 39298 12053 1736 25185 31696 25045 -12253
7888 -12253 -24621 -14833 -26783 1204 37221 27593 -16469 24109 43564 42315 15778 -1828
7876 -1828 -10418 -17348 -2193 37937 -2174 -3893 32796 -12611 -40757 -20149 -13811 -6387 -4338
7863 -4338 -36757 -61456 -50644 -26091 -49896 -68643 -48648 -49732 -63614 -63332 -23831 26890 17259
7850 17259 -16016 -7364 -25412 -35536 -65327 -53845 -65492 -53124 -14537 -13447 -49520 -31669
7838 -31669 184 -14841 -12837 -6029 -11727 -42604 -49720 -65433 -57960 -25654 4097 -12421 -12182
$$ packed form
7927c4011R254J4915J1623M832L532k4490J5617J5222q057j9214r113J48m5689
7914f5431J5661L6862j316P569Q596j9907m3081k3350j1339K7279P822J8127L1380
7901a1128j105l796k4564K2017j2544M5056K5362k7245j0317K3449O511o651l7298
7888a2253j2368R788j1950K7987L6017r628m4062M0578J9455j249k6537j7606
7876a828q590o930J5155M0130m0111j719L6689m5407k8146K0608O338P424K049
7863d338l2419k4699J0812K4553k3805j8747J9995j084j3882K82L9501N0721r631
7850A7259l3275Q652j8048j0124k9791J1482j1647J2368L8587J090l6073J7851
7838c1669L1853j5025K004O808n698l0877p116j5713P473L2306K9751j6518K39
$$ plain form
7825 -12182 9568 -10448 20563 20718 35568 46548 40641 28199 46922 63300 7631 -30125
7813 -30125 -50185 -55347 -86648 -85544 -77710 -5642 8170 1738 -20245 -64300 -57515 -37123 -3776
7800 -3776 -17677 -41214 -54203 -60226 -75239 -62980 -44244 -35211 -20852 -32751 -36535 -23548 -9056
7787 -9056 19711 -7652 -15137 -9297 -7971 30005 36676 49152 46197 24634 26303 2800 -5038
7774 -5038 -13097 -24333 -11738 -3330 -25146 -23220 -22437 -24684 -13441 7657 7354 -41368 -60607 -71543
7760 -71543 -79419 -91959 -72260 -42867 -16549 -2760 -57586 -59957 3318 -2719 -63475 -46368
7748 -46368 -5563 3573 12406 29780 30183 28558 32264 -2007 21199 39534 28466 39501 11062
7735 11062 -24982 -27746 -31879 -61542 -32782 -27737 8177 64676 85733 83151 82879 67442 41417
$$ packed form
7825a2182K1750k0016L1011J55J4850J0980n907j2442J8723J6378n5669l7756
7813c0125k0060n162l1301J104P834P2068J3812o432k1983m4055O785K0392L3347
7800c776j3901k3537j2989o023j5013J2259J8736R033J4359j1899l784J2987J4492
7787i056K8767k7363p485N840J326L7976O671J2476k955k1563J669k3503p838
7774e038q059j1236J2595Q408k1816J926P83k247J1243K1098l03m8722j9239j0936
7760g1543p876j2540J9699K9393K6318J3789n4826k371O3275o037o0756J7107
7748d6368M0805R136Q833J7374M03j625L706l4271K3206J8335j1068J1035k8439
7735A1062l6044k764m133k9663K8760N045L5914N6499K1057k582k72j5437k6025
$$ plain form
7722 41417 19685 -11305 -25901 7520 5979 25408 52520 40123 -17506 -72788 -65306 -41833
7710 -41833 -40319 39694 72035 67884 67125 21601 -9668 31990 10487 13803 48185 60950 48811
7697 48811 -11302 -33765 -20613 -5583 18484 35954 19351 12065 -14807 -16758 -8677 2761
7685 2761 373 7263 7322 -37156 -54759 -19153 1218 47059 56461 10106 -1688 -8164 -11974 -24147
7671 -24147 -30615 -44864 -27961 -1728 -52069 -82697 -58647 -60280 -11396 -21865 -56747 -76621
7659 -76621 -93807 -118194 -60669 -9648 713 -4258 21619 14265 -11666 -93 -6484 -32338
7647 -32338 -48422 -13049 7133 28579 52220 52449 28856 34251 41448 28359 55404 66376 89150
7634 89150 78018 62341 56098 25563 2032 -22072 -351 17441 43379 29913 7143 6935
$$ packed form
7722D1417k1732l0990j4596L3421j541J9429K7112j2397n7629n5282P482K3473
7710d1833J514Q0013L2341m151p59m5524l1269M1658k1503L316L4382J2765j2139
7697D8811o0113k2463J3152J5030K4067J7470j6603p286k6872j951Q081J1438
7685B761k388O890N9m4478j7603L5606K0371M5841R402m6355j1794o476l810j2173
7671b4147o468j4249J6903K6233n0341l0628K4050j633M8884j0469l4882j9874
7659g6621j7186k4387N7525N1021J0361m971K5877p354k5931J1573o391k5854
7647c2338j6084L5373K0182K1446K3641K29k3593N395P197j3089K7045J0972K2774
7634H9150j1132j5677o243l0535k3531k4104K1721J7792K5938j3466k2770k08
$$ plain form
7622 6935 -13069 -61476 -69538 -61804 -34447 -38850 -32727 18968 28809 24185 21573 9535 -40093
7609 -40093 -63824 -17993 6779 6719 -16621 -47219 -17732 -12593 -48371 -64885 -34224 -19316 -20317
7596 -20317 -32053 -73916 -85649 -52354 -17156 -15247 -32501 -16224 -7091 -1801 12285 25327
7584 25327 19176 17009 11900 -23871 -30293 -12296 12138 19603 30934 31182 26513 -3172 -42291
7571 -42291 -39111 2659 10143 35988 20524 -15890 -31252 -43689 -23573 2566 9532 -17747
7559 -17747 -57836 -69564 -62570 -99423 -116568 -92841 -69040 1619 30028 15390 31734 88622
7547 88622 49277 -3637 18109 59340 72623 -2255 -8474 -4661 -12911 -14045 -30304 -62921 -53114
7534 -53114 -44874 -41761 -38089 -14352 -33347 -79412 -84080 -49306 -7471 -43125 -77748 -80253 -21422
$$ packed form
7622F935k0004m8407q062P734K7357m403O123N1695R841m624k612j2038m9628
7609d0093k3731M5831K4772o0k3340l0598K9487N139l5778j6514L0661J4908j001
7596b0317j1736m1863j1733L3295L5198J909j7254J6277R133N290J4086J3042
7584B5327o151k167n109l5771o422J7997K4434P465J1331K48m669k9685l9119
7571d2291L180M1770P484K5845j5464l6414j5362j2437K0116K6139O966k7279
7559a7747m0089j1728O994l6853j7145K3727K3801P0659K8409j4638J6344N6888
7547H8622l9345n2914K1746M1231J3283p4878o219L813q250j134j6259l2617R807
7534e3114Q240L113L672K3737j8995m6065m668L4774M1835l5654l4623k505N8831
$$ plain form
7521 -21422 28235 26461 33527 17970 32148 38967 30796 -4668 -24871 -19347 24096 43697 -4997
7508 -4997 -21144 -14639 -35356 -38683 -45637 -36015 -34706 -28206 11684 39619 41716 42613 52254 43364
7494 43364 28856 30094 38117 52692 60309 72604 64958 68819 42551 13100 -1388 17964 10331
7481 10331 -60581 -64301 -27521 15427 46749 32950 52689 47767 41290 -2709 20673 38390
7469 38390 18484 39843 69031 56873 16441 -35329 -26191 -22422 29386 -4576 -16424 5910
7457 5910 -1398 -30754 -58007 -54216 -70263 -77030 -51770 7783 18213 -23754 -10813 20133 27244
7444 27244 -4740 16399 57030 76651 129750 103061 74652 86534 57990 -27150 -41425 -28004
7432 -28004 -34683 -52319 -61716 -37500 -29359 -23275 6270 -1819 6448 65275 54708 41430 50945
$$ packed form
7521b1422M9657j774P066j5557J4178O819q171l5464k0203N524M3443J9601m8694
7508d997j6147O505k0717l327o954R622J309O500L9890K7935K097Q97R641q890
7494D3364j4508J238Q023J4575P617J2295p646L861k6268k9451j4488J9352p633
7481A0331p0912l720L6780M2948L1322j3799J9739m922o477m3999K3382J7717
7469C8390j9906K1359K9188j2158m0432n1770R138L769N1808l3962j1848K2334
7457E910p308k9356k7253L791j6047o767K5260N9553J0430m1967J2941L0946P111
7444B7244l1984K1139M0631J9621N3099k6689k8409J1882k8544q5140j4275J3421
7432b8004o679j7636r397K4216Q141O084K9545q089Q267N8827j0567j3278R515
$$ plain form
7419 50945 -3929 -19005 -15610 -20860 -9673 -17972 -12873 30851 64342 27236 -32197 -46579 -32663
7406 -32663 -21276 -41313 -20097 -60979 -71897 -44578 -1185 -10195 30796 40032 -3636 17390
7394 17390 55254 37438 29502 51836 131960 152037 104325 74005 69563 106818 105279 32973
7382 32973 26648 10009 -16373 4064 22026 15860 5913 -7580 19808 28636 -13796 -4103 37355
7369 37355 43900 37554 38546 40752 71934 46913 5559 -20844 -32889 -38097 -43377 -10139 32492
7356 32492 1268 22924 23727 997 11646 27854 16099 10374 18260 51371 76232 60136 51263
7343 51263 43322 26097 26283 20861 15165 16280 5028 14742 38838 55273 36573 16142 54569
7330 54569 42521 -8782 9383 60217 85143 49765 30545 45553 39630 43398 3489 3707 21771
$$ packed form
7419E0945n4874j5076L395n250J1187q299N099M3724L3491l7106n9433j4382J3916
7406c2663J1387k0037K1216m0882j0918K7319M3393r010M0991R236m3668K1026
7394A7390L7864j7816p936K2334Q0124K0077m7712l0320m442L7255j539p2306
7382C2973o325j6639k6382K0437J7962o166r947j3493K7388Q828m2432R693M1458
7369C7355O545o346R92K206L1182k5021m1354k6403j2045n208n280L3238M2631
7356C2492l1224K1656Q03k2730J0649J6208j1755n725P886L3111K4861j6096q873
7343E1263p941j7225J86n422n696J115j1252R714K4096J6435j8700k0431L8427
7330E4569j2048n1303J8165N0834K4926l5378j9220J5008n923L768l9909K18J8064
$$ plain form
7317 21771 50232 55550 4588 -27632 -34247 -2613 36060 65360 78615 84127 68748 43109
7305 43109 44330 56862 36615 -22186 -28628 -9555 9381 23385 11452 29160 -1722 -8718
7293 -8718 2161 10000 16195 15996 24355 42853 21963 225 -28353 -53147 -7419 16061 17927
7280 17927 27826 -998 -3664 19990 41288 42604 30578 -14064 -12975 32793 61485 45214 6268
7267 6268 1656 20568 -24417 -59513 -20448 3747 13233 9153 3458 22498 20290 -7206 -22600
7254 -22600 55775 113336 77958 37836 20996 12519 -9503 -14070 -9042 -39095 282 12718
7242 12718 20445 -21137 -52150 -72048 -39983 -1713 -6974 -28657 -41150 -34296 -36174 -25562 -17388
7229 -17388 -37333 -28721 -10301 3844 8966 9438 39177 911 -28895 -15075 10014 4361 -26765
$$ packed form
7317B1771K8461N318n0962l2220o615L1634L8673K9300J3255N512j5379k5639
7305D3109J221J2532k0247n8801o442J9073J8936J4004j1933J7708l0882o996
7293h718J0879P839O195j99Q359J8498k0890k1738k8578k4794M5728K3480J866
7280A7927R899k8824k666K3654K1298J316j2026m4642J089M5768K8692j6271l8946
7267F268m612J8912m4985l5096L9065K4195R486m080n695J9040k208k7496j5394
7254b2600P8375N7561l5378m0122j6840q477k2022m567N028l0053L9377J2436
7242A2718P727m1582l1013j9898L2065L8270n261k1683j2493O854j878J0612Q174
7229a7388j9945Q612J8420J4145N122M72K9739l8266k9806J3820K5089n653l1126
$$ plain form
7216 -26765 4341 44969 13719 10103 9977 15998 -795 -1880 12038 -8375 -25260 -36895 -54864
7203 -54864 -36387 -12504 -15949 -16631 -14482 -62737 -55168 -42327 -38403 -48383 -53624 -33142 -21521
7190 -21521 -11079 -26623 -30121 -9976 -21732 -39259 -40658 -15515 -29003 -31947 -4139 10495
7178 10495 55497 85205 93471 56214 12270 29836 37751 22573 1082 500 2562 -14140 -10992
7165 -10992 10853 -14646 -38717 -62617 -49042 -73935 -75282 -72855 -23588 -34559 -10259 44501
7153 44501 55576 28186 3820 -30256 -65758 -78599 -120373 -92319 -28823 -6896 15401 29118
7141 29118 14573 5890 35088 55998 25701 640 -5519 12588 -20166 -912 -1132 16403 5375
7128 5375 -19364 -29413 -47734 -47366 -11234 27389 50792 30491 40468 55457 55376 -3039 -41170
$$ packed form
7216b6765L1106M0628l1250l616j26O021j6793j085J3918k0413j6885j1635j7969
7203e4864J8477K3883l445o82K149m8255P569J2841L924r980n241K0482J1621
7190b1521J0442j5544l498K0145j1756j7527j399K5143j3488k944K7808J4634
7178A0495M5002K9708Q266l7257m3944J7566P915j5178k1491n82K062j6702L148
7165a0992K1845k5499k4071k3900J3575k4893j347K427M9267j0971K4300N4760
7153D4501J1075k7390k4366l4076l5502j2841m1774K8054O3496K1927K2297J3717
7141B9118j4545q683K9198K0910l0297k5061o159J8107l2754J9254k20J7535j1028
7128E375k4739j0049j8321L68L6132L8623K3403k0301R977J4989q1n8415l8131
$$ plain form
7115 -41170 -13350 -26052 -50236 -84673 -85433 -68287 -60095 -48911 -38239 -57647 -46650 -31519
7103 -31519 -64660 -70790 -51481 -59336 -68643 -88298 -99642 -40652 1996 -20345 -799 4693 -4762
7090 -4762 1088 -29764 -38518 -13245 -4049 -44131 -31934 -54560 -46141 -25197 -40576 -58530 -50135
7077 -50135 -76563 -75457 -88456 -79851 -29294 -15899 -19372 -22622 -12044 30080 25622 2609 9509
7064 9509 2039 5449 -14565 16254 -6649 -10677 6027 -1913 -45137 -59265 -78658 -90034 -50431
7051 -50431 -16877 27505 37807 35339 33421 8504 589 -4408 8685 4197 -7736 4214 2719
7038 2719 6534 26116 49857 40706 15080 61428 73623 61041 17062 13161 -16005 -29388 -45061
7025 -45061 -47755 -31443 -13224 -14610 -10590 -14939 -25233 -30912 24067 4816 40750 54267 17579
$$ packed form
7115d1170K7820j2702k4184l4437p60J7146Q192J1184J0672j9408J0997J5131
7103c1519l3141o130J9309p855r307j9655j1344N8990M2648k2341J9546N492r455
7090d762N850l0852q754K5273R196m0082J2197k2626Q419K0944j5379j7954Q395
7077e0135k6428J106j2999Q605N0557J3395l473l250J0578M2124m458k3013O900
7064I509p470L410k0014L0819k2903m028J6704p940m3224j4128j9393j1376L9603
7051e0431L3554M4382J0302k468j918k4917p915m997J3093m488j1933J1950j495
7038B719L815J9582K3741r151k5626M6348J2195j2582m3979l901k9166j3383j5673
7025d5061k694J6312J8219j386M020m349j0294n679N4979j9251L5934J3517l6688
$$ plain form
7012 17579 -24889 -36169 -13072 -35255 -47278 -82524 -105367 -65056 -42739 -10295 14525 35811
7000 35811 17368 -15170 -17755 -21915 -5281 -12300 -14276 -9665 12880 21075 9822 17393 11914
6987 11914 12624 3047 -15846 -40517 -27843 -6796 5737 -12793 -25384 -23383 -26633 4494 -13344
6974 -13344 -41373 -43462 -20773 6996 2520 -31846 -18526 3951 31928 27054 12247 -16105
6962 -16105 -36382 -28599 -34859 -70994 -78721 -61443 -26762 773 -11288 30548 38948 50306 11317
6949 11317 -12729 -49909 -46940 -3658 19000 16128 27130 35009 29457 24358 39667 1923 -37743
6936 -37743 -63638 -53034 -54471 -72540 -49291 -31529 -39429 -42378 -36417 -34725 2951 16081 -6835
6923 -6835 -43221 -45134 -49002 -41937 -21432 -38420 -27517 -27523 -42633 -29374 -13128 -8291 -24565 -14074
$$ packed form
7012A7579m2468j1280K3097k2183j2023l5246k2843M0311K2317L2444K4820K1286
7000C5811j8443l2538k585m160J6634p019j976M611K2545Q195j1253P571n479
6987A1914P10r577j8893k4671J2674K1047J2533j8530j2591K001l250L1127j7838
6974a3344k8029k089K2689K7769m476l4366J3320K2477K7977m874j4807k8352
6962a6105k0277P783o260l6135p727J7278L4681K7535j2061M1836Q400J1358l8989
6949A1317k4046l7180K969M3282K2658k872J1002P879n552n099J5309l7744l9666
6936c7743k5895J0604j437j8069K3249J7762p900k949N961J692L7676J3130k2916
6923f835l6386j913l868P065K0505j6988J0903oj5110J3259J6246M837j6274J0491
$$ plain form
6909 -14074 -15317 -22778 -3135 981 5113 15597 6118 -3896 -27831 -27770 -39822 -20170 4770
6896 4770 -1364 2665 10282 30747 21116 -2559 -27326 -61706 -39832 -35243 -2078 28797 -6976
6883 -6976 -22558 -42551 -37786 -31565 -25696 -18448 -33612 -10288 29015 8941 -14366 -16700 -29582
6870 -29582 -41320 -50981 -57811 -64504 -48530 -38011 -19509 10353 31063 -7487 1635 -4223 -47915
6857 -47915 -80733 -90518 -64115 -41435 -3616 46419 61053 44173 30434 -27597 -83347 -79105
6845 -79105 -71347 -54912 -38139 -63656 -58997 -43106 13219 -1328 -39995 -69578 -67207 -27508
6833 -27508 17733 39053 22176 1151 -37104 -8675 29162 42997 3060 -25822 -14171 697
6821 697 -9721 -5666 -33129 -48388 -28338 -11080 -6912 -12649 -36719 -70679 -55020 -30418 -40597
$$ packed form
6909a4074j243p461J9643M116M132J0484r479j0014k3935O1j2052J9652K4940
6896D770o134M029P617K0465r631k3675k4767l4380K1874M589L3165L0875l5773
6883f976j5582j9993M765O221N869P248j5164K3324L9303k0074k3307k334j2882
6870b9582j1738r661o830o693J5974J0519J8502K9862K0710l8550R122n858m3692
6857d7915l2818r785K6403K2680L7819N0035J4634j6880j3739n8031n5750M242
6845g9105P758J6435J6773k5517M659J5891N6325j4547l8667k9583K371L9699
6833b7508M5241K1320j6877k1025l8255K8429L7837J3835l9937k8882J1651J4868
6821F97j0418M055k7463j5259K0050J7258M168n737k4070l3960J5659K4602j0179
$$ plain form
6808 -40597 -41745 -57804 -73315 -34774 28814 45490 34745 55310 40981 14367 -2578 20669
6796 20669 34360 -35277 -97689 -92378 -35761 13374 17464 -2238 11423 28901 -5538 10233
6784 10233 32876 48755 54524 14763 20703 55664 51979 7281 -29616 -29715 -10496 -9057 -3113
6771 -3113 -15055 -22026 8599 -4717 15495 -9628 -26748 -64383 -39121 -10316 -16459 -16672 -13607
6758 -13607 3227 10972 25041 33765 17386 2935 10129 -47581 -91592 -117968 -113879 -114063 -80659
6745 -80659 -40342 -53278 -43931 -25730 9906 21312 19461 4447 7595 352 26452 8573 22208
6732 22208 21572 -1772 4583 -4202 18746 -26862 -37148 -29736 -30781 -32436 -27362 13334 33915
6719 33915 59727 66324 56711 3063 9286 28062 30124 19676 51032 26871 -8417 12730 -23528
$$ packed form
6808d0597j148j6059j5511L8541O3588J6676j0745K0565j4329k6614j6945K3247
6796B0669J3691o9637o2412N311N6617M9135M090j9702J3661J7478l4439J5771
6784A0233K2643J5879N769l9761N940L4961l685m4698l6897r9J9219J439N944
6771c113j1942o971L0625j3316K0212k5123j7120l7635K5262K8805o143k13L065
6758a3607J6834P745J4069Q724j6379j4451P194n7710m4011k6376M089j84L3404
6745h0659M0317j2936R347J8201L5636J1406j851j5014L148p243K6100j7879J3635
6732B2208o36k3344O355q785K2948m5608j0286P412j045j655N074M0696K0581
6719C3915K5812O597r613n3648O223J8776K062j0448L1356k4161l5288K1147l6258
$$ plain form
6706 -23528 -26310 -6861 -3985 2936 17294 -24569 -54940 -99952 -112969 -89789 -70475 -37222
6694 -37222 -14736 20582 41598 -11212 -18946 -32788 -33975 -12332 -15229 -12382 -12896 -9387 17525
6681 17525 14646 1939 12015 -18322 -21401 -10740 454 24977 34869 30479 31074 -9009 -50591
6668 -50591 -39362 -9537 -17467 -8318 12494 17626 35294 46117 44508 40048 40993 70034 49615
6655 49615 5699 14705 10045 15976 21705 20272 7095 21307 36043 20165 -30736 -40609 -13224
6642 -13224 45763 82293 77950 33176 -47332 -60594 -20732 -15959 17477 46189 33549 10177
6630 10177 7197 -17624 -13645 27993 34481 69929 106151 117713 47202 5306 21241 3689
6618 3689 16866 -13434 -41599 -27137 45 -8529 -67859 -37384 16956 4901 948 26603
$$ packed form
6706b3528k782J9449K876O921J4358m1863l0371m5012j3017K3180J9314L3253
6694c7222K2486L5318K1016n2810p734j3842j187K1643k897K847n14L509K6912
6681A7525k879j2707J0076l0337l079J0661J1194K4523R892m390N95m0083m1582
6668e0591J1229K9825p930R149K0812N132J7668J0823j609m460R45K9041k0419
6655D9615m3916R006m660N931N729j433j3177J4212J4736j5878n0901r873K7385
6642a3224N8987L6530m343m4774q0508j3262L9862M773L3436K8712j2640k3372
6630A0177k980k4821L979M1638O488L5448L6222J1562p0511m1896J5935j7552
6618C689J3177l0300k8165J4462K7182q574n9330L0475N4340j2055l953K5655
$$ plain form
6606 26603 20137 14297 29199 29124 24188 -7888 -44497 -32997 -25824 -47299 -4494 -13145 -5866 32113
6592 32113 44512 45078 40180 45301 55311 25709 3795 -13256 -55575 -24107 10561 21783 13146
6579 13146 10751 38851 55912 33042 7841 24943 21701 -2548 -8421 -28820 -30669 -28497 -14347
6566 -14347 -48753 -32177 35992 35317 24179 42975 34964 17732 -4314 -14889 -33588 -42322 -53194
6553 -53194 -36787 -33764 8066 -2857 -21898 -22733 838 27167 3158 30124 47981 23732
6541 23732 -4145 198 16831 26402 2715 -19400 -5811 -626 6590 4847 -19894 -41735 -46896
6528 -46896 -79980 -30997 -16356 -40527 -34093 -27256 -8494 -25353 -46260 -21619 2677 9466
6516 9466 46805 58524 57246 60714 52028 50987 76369 58794 54838 27007 31104 29137 46974
$$ packed form
6606B6603o466n840J4902p5m936l2076l6609J1500P173k1475M2805q651P279L7979
6592C2113J2399N66m898N121J0010k9602k1914j7051m2319L1468L4668J1222q637
6579A3146k395K8100J7061k2870k5201J7102l242k4249n873k0399j849K172J4150
6566a4347l4406J6576O8169o75j1138J8796q011j7232k2046j0575j8699q734j0872
6553e3194J6407L023M1830j0923j9041q35K3571K6329k4009K6966J7857k4249
6541B3732k7877M343J6633R571k3687k2115J3589N185P216j743k4741k1841n161
6528d6896l3084M8983J4641k4171O434O837J8762j6859k0907K4641K4296O789
6516I466L7339J1719j278L468q686j041K5382j7575l956k7831M097j967J7837
$$ plain form
6503 46974 31781 24473 -3430 -24586 -24821 -40225 -2657 21825 34347 31928 44379 21733 -13527
6490 -13527 19681 315 3648 -11103 -48993 -57399 -52155 -36789 -30006 -38145 -53737 -30187 -47221
6477 -47221 -85875 -104360 -81006 -47522 -43174 -50816 -27617 -23463 7054 -3814 5080 -7155 -1906
6464 -1906 -31910 -57874 -59371 -19880 -15175 -18313 -20743 -3194 -4416 -15834 -5098 -29044 -44086
6451 -44086 -46772 -45960 -62189 -38491 -54241 -80107 -65287 -68245 -83511 -76985 -82033 -106772 -100692
6438 -100692 -88288 -28828 5298 83305 83649 38383 5758 -2232 -34749 -36121 -33969 -30917 18031
6425 18031 -8275 -53860 -48707 -7065 35417 28273 -18686 -60037 -60840 -61419 -87231 -60162 -17627
6412 -17627 -31158 -59336 -47436 -15122 -34716 -22082 -14423 15417 22307 -24266 -54082 -43362
$$ packed form
6503D6974j5193p308k7903k1156k35j5404L7568K4482J2522k419J2451k2646l5260
6490a3527L3208j9366L333j4751l7890q406N244J5366O783q139j5592K3550j7034
6477d7221l8654j8485K3354L3484M348p642K3199M154L0517j0868Q894j2235N249
6464a906l0004k5964j497L9491M705l138k430J7549j222j1418J0736k3946j5042
6451d4086k686Q12j6229K3698j5750k5866J4820k958j5266O526n048k4739O080
6438a00692J2404N9460L4126P8007L44m5266l2625p990l2517j372K152L052M8948
6425A8031k6306m5585N153M1642M2482p144m6959m1351q03n79k5812K7069M2535
6412a7627j3531k8178J1900L2314j9594J2634P659K9840O890m6573k9816J0720
$$ plain form
6400 -43362 -47630 -53587 -19385 -32449 -32269 -25569 -18973 -33908 -53201 -71289 -89426 -115393 -141270
6387 -141270 -133272 -65526 -26689 -58567 -62708 -77769 -51952 -31368 -10398 6705 7249 -5064
6375 -5064 -68127 -85035 -103467 -83316 -51764 -29723 -71549 -76762 -58369 -38724 -40999 -69582
6363 -69582 -87321 -23599 -52066 -108479 -124078 -84337 -19073 12472 23906 14928 3409 26089
6351 26089 24423 21708 29010 51029 66369 46949 18306 7372 -18656 -58616 -60009 -12698 12139
6338 12139 -13315 -46001 -72862 -90510 -62838 -42574 -44948 -515 36555 24835 37625 41
6326 41 -31718 -38015 18483 41779 11536 13837 -8894 14391 46950 9146 -44887 -30167 -17333
6313 -17333 8311 3393 -14899 -3500 29623 13573 -11290 -59828 -65891 -35366 -45483 -50820
$$ packed form
6400d3362m268n957L4202j3064J80O700O596j4935j9293j8088j8137k5967k5877
6387a41270P998O7746L8837l1878m141j5061K5817K0584K0970J7103N44j2313
6375e064o3063j6908j8432K0151L1552K2041m1826n213J8393J9645k275k8583
6363f9582j7739O3722k8467n6413j5599L9741O5264L1545J1434q978j1519K2680
6351B6089j666k715P302K2019J5340j9420k8643j0934k6028l9960j393M7311K4837
6338A2139k5454l2686k6861j7648K7672K0264k374M4433L7070j1720J2790l7584
6326D1l1759o297N6498K3296l0243K301k2731K3285L2559l7804n4033J4720J2834
6313a7333K5644m918j8292J1399L3123j6050k4863m8538o063L0525j0117n337
$$ plain form
6301 -50820 -41996 -5200 16762 -16415 -19144 -6179 -47674 -67795 -63423 -20514 -850 -23460
6289 -23460 -40475 -40243 -2155 -18764 -23421 -12709 -25063 -27740 -45071 -46567 -43886 -44109 -498
6276 -498 -5925 -28513 18809 11512 -39652 -5769 38305 29616 -154 -24901 -21033 -12251 -8930
6263 -8930 30430 16287 23834 13408 3420 3538 8808 1621 -12795 7715 9742 24850 19619 -18481
6249 -18481 -40083 -50990 -63092 -36133 20307 20318 -8955 -30943 -43655 -99935 -110562 -100431
6237 -100431 -98494 -114202 -118761 -65053 -55776 -45765 -18066 -13001 6620 41672 -4575 -6198 -729
6224 -729 -8107 -43137 -35569 -24705 -49272 -47808 -57653 -36275 -16180 23793 47630 55839 49804
6211 49804 27912 -4349 -26125 13971 6659 -50976 -62330 -37885 -44001 -52063 -16412 -17846 10203
$$ packed form
6301e0820Q824L6796K1962l3177k729J2965m1495k0121M372M2909J9664k2610
6289b3460j7015K32L8088j6609m657J0712j2354k677j7331j496K681k23M3611
6276d98n427k2588M7322p297n1164L3883M4074q689k9770k4747L868Q782L321
6263h930L9360j4143P547j0426r988J18N270p187j4416K0510K027J5108n231l8100
6249a8481k1602j0907j2102K6959N6440J1k9273k1988j2712n6280j0627J0131
6237a00431J937j5708m559N3708R277J0011K7699N065J9621L5052m6247j623N469
6224g29p378l5030P568J0864k4567J464r845K1378K0095L9973K3837Q209o035
6211D9804k1892l2261k1776M0096p312n7635j1354K4445o116q062L5651j434K8049
$$ plain form
6198 10203 -3438 -36894 -28809 -12047 20851 -9636 -23196 -16670 -52215 -52935 -41537 -48646 -5045
6185 -5045 20621 -14645 -40971 -36898 -49179 -13235 302 -13396 -52913 -69941 -58817 -40426
6173 -40426 -46273 -71828 -83832 -57916 9458 42072 11433 3017 797 -48315 -44683 -785 49288
6160 49288 65892 62463 34669 -5177 -24684 -52769 -24151 -33798 -23170 -5830 4900 -8485
6148 -8485 14345 43923 12922 996 2889 4442 -16804 -24944 -8629 6276 26977 31237 -16067
6135 -16067 -14847 8367 24609 16296 -3884 -8460 58806 75082 63260 20770 -2293 -16115
6123 -16115 -18508 -10765 -3274 -52891 -73240 -70605 -66128 -77316 -90676 -116387 -124161 -129862 -59073
6110 -59073 -22144 -39634 -59343 -73485 -77223 -64112 -71017 -58325 -52950 -56416 -54932 -46930 -54926
$$ packed form
6198A0203j3641l3456Q085J6762L2898l0487j3560O526l5545p20J1398p109M3601
6185e045K5666l5266k6326M073j2281L5944J3537j3698l9517j7028J1124J8391
6173d0426n847k5555j2004K5916O7374L2614l0639q416k220m9112L632M3898N0073
6160D9288J6604l429k7794l9846j9507k8085K8618r647J0628J7340J0730j3385
6148h485K2830K9578l1001j1926J893J553k1246q140J6315J4905K0701M260m7304
6135a6067J220K3214J6242q313k0180m576O7266J6276j1822m2490k3063j3822
6123a6115k393P743P491m9617k0349K635M477j1188j3360k5711p774n701P0789
6110e9073L6929j7490j9709j4142l738J3111o905J2692N375l466J484Q002p996
$$ plain form
6097 -54926 -48759 -29523 -4056 -35686 -33637 -20594 -11998 26499 22 -12623 -38788 -29165 29515
6084 29515 35707 51801 5502 4346 -8505 -27775 13074 39529 25043 6084 -27645 -32286
6072 -32286 -32008 -63165 -53156 -25196 14678 15592 12149 35581 26268 106 28869 -6426 -22819
6059 -22819 -50425 -72568 -60638 -55467 -31607 2207 4922 -306 -13163 26794 44050 18439
6047 18439 -120 1535 349 -43992 -69950 -54527 -76641 -59746 -24235 -12350 25602 25547 10936
6034 10936 44955 39125 14765 668 -7811 -26911 -22073 -7406 -12690 -37869 -31128 -30851 -19217
6021 -19217 -862 -677 -38730 -27845 -25668 -81885 -119771 -80477 -57684 -55042 -67061 -113310 -106093
6008 -106093 -100073 -58063 -35194 -37050 -30067 6188 -3819 -38109 -64847 -44134 -9692 23848
$$ packed form
6097e4926O167J9236K5467l1630K049J3043Q596L8497k6477j2645k6165R623N8680
6084B9515O192J6094m6299j156j2851j9270M0849K6455j4486j8959l3729m641
6072c2286K78l1157J0009K7960L9874R14l443K3432r313k6162K8763l5295j6393
6059b2819k7606k2143J1930N171K3860L3814K715n228j2857L9957J7256k5611
6047A8439j8559J655j186m4341k5958J5423k2114J6895L5511J1885L7952n5j4611
6034A0936L4019n830k4360j4097q479j9100M838J4667n284k5179O741K77J1634
6021a9217J8355J85l8053J0885K177n6217l7886L9294K2793K642j2019m6249P217
6008a06093O020M2010K2869j856O983L6255j0007l4290k6738K0713L4442L3540
$$ plain form
5996 23848 8797 -7000 -35382 -6567 14926 -27721 -44157 -27714 -11761 -5117 -20982 -34495
5984 -34495 -11075 -5333 22065 20309 20539 649 10753 20757 18627 7960 -31124 -1338 -19592
5971 -19592 -35123 -10502 3844 -13674 -24827 -30996 -33077 -48961 -39054 -34258 -81352 -80593 -2493
5958 -2493 15669 16856 6480 3836 -1364 21199 28958 -50781 -63038 -8684 120 -33544 -24726
5945 -24726 -18083 -6843 -32235 -50765 -39617 -41096 -23078 4289 -12671 -16158 7183 20167
5933 20167 6326 -21620 -42151 -18335 -39119 -61605 -64794 -33264 10107 10872 23268 31941 57941
5920 57941 49100 29821 33264 23483 68644 56260 18852 134 -19655 -3039 59312 63743 68581
5907 68581 53312 21887 -12700 -30015 -12402 -18209 -33393 -14528 -29394 -41808 -4904 -31854
$$ packed form
5996B3848j5051j5797k8382K8815K1493m2647j6436J6443J5953O644j5865j3513
5984c4495K3420N742K7398j756K30j9890J0104J0004k130j0667l9084K9786j8254
5971a9592j5531K4621J4346j7518j1153o169k081j5884R907M796m7094P59P8100
5958b493J8162J187j0376k644n200K2563P759p9739j2257N4354Q804l3664Q818
5945b4726O643J1240k5392j8530J1148j479J8018K7367j6960l487K3341J2984
5933B0167j3841k7946k0531K3816k0784k2486l189L1530M3371P65J2396Q673K6000
5920E7941q841j9279L443r781M5161j2384l7408j8718j9789J6616O2351M431M838
5907F8581j5269l1425l4587j7315J7613n807j5184J8865j4866j2414L6904k6950
$$ plain form
5895 -31854 -47268 -18434 -40601 -42210 -41568 -323 -32224 -107031 -117553 -98079 -30441 20834
5883 20834 5692 -20466 -18635 427 13636 -1852 -3910 21525 14336 -12957 -37029 -36561 -15574
5870 -15574 4408 38787 65970 86545 87072 75767 47251 46124 68470 32546 -2828 3468 41582
5857 41582 74527 81016 30669 -884 -10573 -18881 -22300 -31193 -53105 -87313 -85658 -83128 -68317
5844 -68317 -51814 7997 27293 -20410 -37517 -29887 -32290 -26299 -52482 -46184 -51842 -1656 24175
5831 24175 282 -46988 -71751 -89628 -56028 -60681 -13586 15723 -12462 11399 995 18036
5819 18036 10348 -23953 -39132 -12124 -885 1911 -16242 -6777 -1681 -20466 -106 66961 59021
5806 59021 -8035 9632 29877 13822 -27790 -50338 -36547 -38399 -31605 -12425 1920 -35403
$$ packed form
5895c1854j5414K8834k2167j609O42M1245l1901p4807j0522J9474O7638N1275
5883B0834j5142k6158J831J9062J3209j5488k058K5435p189k7293k4072M68K0987
5870a5574J9982L4379K7183K0575N27j1305k8516j127K2346l5924l5374O296L8114
5857D1582L2945O489n0347l1553r689q308l419q893k1912l4208J655K530J4811
5844f8317J6503N9811J9296m7703j7107P630k403N991k6183O298n658N0186K5831
5831B4175k3893m7270k4763j7877L3600m653M7095K9309k8185K3861j0404J7041
5819A8036p688l4301j5179K7008J1239K796j8153R465N096j8785K0360O7067p940
5806E9021o7056J7667K0245j6055m1612k2548J3791j852O794J9180J4345l7323
$$ plain form
5794 -35403 -50488 -56339 -42062 -32321 -13786 -3263 -19350 -34631 -48755 -36535 -22599 -2451
5782 -2451 -8371 6614 6960 36080 63165 45910 14319 19495 28935 3018 13338 -16419 -7423
5769 -7423 -49489 -49332 -55404 -67666 -58379 -36295 -24858 -12321 -42852 -15990 -3980 -21262 -6787
5756 -6787 25062 2888 -27145 -25414 -44945 -59450 -61278 -39611 -9940 -18624 671 -9346 -69466
5743 -69466 -91185 -107107 -81721 -82731 -52737 -5878 -17486 -59196 -49404 -55710 -42046 16168
5731 16168 -2097 -23585 -32452 -52692 -46301 -3846 -18712 -35043 -88225 -116443 -80032 -44984
5719 -44984 -31330 -6217 -2371 -6872 -9514 -35990 -46496 -64457 -59985 -67654 -35276 -18322 -2146
5706 -2146 -16998 -33530 -17612 -38368 -55057 -51535 -31740 -21404 -19104 8555 24961 9706
$$ packed form
5794c5403j5085n851J4277R741J8535J0523j6087j5281j4124J2220J3936K0148
5782b451n920J4985L46K9120K7085j7255l1591N176R440k5917J0320k9757Q996
5769g423m2066J57o072j2262R287K2084J1437J2537l0531K6862J2010j7282J4475
5756f787L1849k2174l0033J731j9531j4505j828K1667K9671q684J9295j0017o0120
5743f9466k1719j5922K5386j010K9994M6859j1608m1710R792o306J3664N8214
5731A6168j8265k1488q867k0240O391M2455j4866j6331n3182k8218L6411L5048
5719d4984J3654K5113L846m501k642k6476j0506j7961M472p669L2378J6954J6176
5706b146j4852j6532J5918k0756j6689L522J9795J0336K300K7659J6406j5255
$$ plain form
5694 9706 -817 12623 -12482 -18973 935 -14164 -72905 -52924 -23086 -45067 7587 8348 -9863
5681 -9863 3381 -11948 -44520 -28547 -36036 17511 67803 27443 -12310 -13053 -3978 13934 19944
5668 19944 19702 37336 28736 2472 6568 -2807 -22003 -11658 6070 6946 -14776 -42389 -43356 -57297
5654 -57297 -55612 -35626 -45546 -43803 -54203 -54444 -5211 19335 32781 11759 -21768 -12702 -14739
5641 -14739 -33547 -35240 -9628 -2806 -30943 3033 11100 25143 140 15435 -7766 -44194
5629 -44194 -38911 -6872 -14532 -26157 -43887 -71177 -72953 -84115 -67915 -41774 -54960 -24493
5617 -24493 -8123 -8322 -24184 -43798 -12274 -17703 -30427 -65206 -67944 -93523 -99048 -69410 -27119
5604 -27119 -25207 -38348 -17877 -7400 -24363 -22611 -19000 -47536 -63895 -67163 -52293 -42674 -42098
$$ packed form
5694I706j0523J3440k5105o491J9908j5099n8741J9981K9838k1981N2654P61j8211
5681i863J3244j5329l2572J5973p489N3547N0292m0360l9753p43R075J7912O010
5668A9944k42J7634q600k6264M096r375j9196J0345J7728Q76k1722k7613r67j3941
5654e7297J685J9986r920J743j0400k41M9233K4546J3446k1022l3527R066k037
5641a4739j8808j693K5612O822k8137L3976Q067J4043k5003J5295k3201l6428
5629d4194N283L2039p660j1625j7730k7290j776j1162J6200K6141j3186L0467
5617b4493J6370j99j5862j9614L1524n429j2724l4779k738k5579n525K9638M2291
5604b7119J912j3141K0471J0477j6963J752L611k8536j6359l268J4870R619N76
$$ plain form
5591 -42098 -49854 -46225 -36408 -33097 4397 38565 45751 39543 28005 7511 -14594 -51775 -44847
5578 -44847 -17803 30883 -26347 -92962 -101514 -78711 -88164 -53452 -26470 -23843 -28803 -24673 -13512
5565 -13512 7519 2557 -33483 -43792 -13598 -4258 -19984 -33001 -47204 -82540 -78131 -50534
5553 -50534 -55748 -33108 -11334 914 -31897 -73835 -88125 -98160 -66939 -41702 -75639 -74014
5541 -74014 -330 19096 -2513 -24167 -29291 -10353 -19473 -56089 -62367 -50697 -57412 -47893 -39419
5528 -39419 -29856 -14598 1802 51234 41717 19321 38184 40853 18807 6239 -3957 -51417
5516 -51417 -87347 -52933 -22773 -9659 9174 9165 -472 10693 -4135 26454 39683 20631 -16968
5503 -16968 -59720 -14959 -18947 -8371 17274 28335 26931 46362 29839 -6095 -43849 -26529
$$ packed form
5591d2098p756L629R817L311L7494L4168P186o208j1538k0494k2105l7181O928
5578d4847K7044M8686n7230o6615q552K2803r453L4712K6982K627m960M130J1161
5565a3512K1031m962l6040j0309L0194R340j5726j3017j4203l5336M409K7597
5553e0534n214K2640K1774J2248l2811m1938j4290j0035L1221K5237l3937J625
5541g4014P3684J9426k1609k1654n124J8938r120l6616o278J1670o715R519Q474
5528c9419R563J5258J6400M9432r517k2396J8863K669k2046j2568j0196m7460
5516e1417l5930L4414L0160J3114J8833rr637J1165j4828L0589J3229j9052l7599
5503a6968m2752M4761l988J0576K5645J1061j404J9431j6523l5934l7754J7320
$$ plain form
5491 -26529 -13982 4953 59499 54472 55666 4163 -46635 -56320 -61119 -39360 3760 -14415 -589
5478 -589 -4359 -25087 -13611 134 -8782 -37933 -75901 -78439 -57524 -17451 -14875 28562 17221
5465 17221 -9729 58062 68335 19167 -8388 15150 35214 36402 7656 -7286 -8606 14320
5453 14320 4938 3406 -44769 -79311 -64718 -32142 -48439 -28120 -9529 -60510 -55984 -43047
5441 -43047 -47227 -11968 -9881 -10224 -32761 -62722 -89606 -86354 -108681 -120111 -140178 -145461 -101740
5428 -101740 -50330 7614 -12608 1410 3458 -19223 13252 -5611 18907 27103 19205 -31628
5416 -31628 -33278 -35723 -11636 6429 27948 41313 27651 43413 -11300 -32871 -26372 -20460 3932
5403 3932 14950 -949 9582 16068 5448 33684 18039 13622 3386 -28386 -67493 -82208
$$ packed form
5491b6529J2547J8935N4546n027J194n1503n0798r685m799K1759M3120j8175J3826
5478e89l770k0728J1476J3745q916k9151l7968k538K0915M0073K576M3437j1341
5465A7221k6950O7791J0273m9168k7555K3538K0064J188k8746j4942j320K2926
5453A4320r382j532m8175l4542J4593L2576j6297K0319J8591n0981M526J2937
5441d3047m180L5259K087l43k2537k9961k6884L252k2327j1430k0067n283M3721
5428a01740N1410N7944k0222J4018K048k2681L2475j8863K4518Q196p898n0833
5416c1628j650k445K4087J8065K1519J3365j3662J5762n4713k1571O499N912K4392
5403C932J1018j5899J0531O486j0620K8236j5645m417j0236l1772l9107j4715
$$ plain form
5391 -82208 -44241 -18627 21732 -13139 -19703 -11642 -25688 -19682 15053 22653 27275 3770 -6641
5378 -6641 -37875 -45233 -52687 -54358 -43281 -27784 -13233 1917 4866 -18423 -50275 -62208 -52139
5365 -52139 -56957 -78062 -74417 -49640 -23874 -23895 -22481 -13319 454 -6123 -12069 -26151 -20009 -8819
5351 -8819 -8803 -12572 -13686 17857 18507 3458 17032 16119 -6606 -24059 -26180 -72002 -55460 -39566
5337 -39566 -27619 -6611 17940 47906 18963 36347 8998 -26628 -10865 -4968 -20500 -19540
5325 -19540 -28971 -58291 -44915 -8186 630 12962 45768 61498 50766 35848 13866 -11089
5313 -11089 -13647 -12463 -452 1335 -36105 -23915 -11906 17050 17378 8663 -3258 -31930 -26901
5300 -26901 -3928 5828 -59560 -76878 -38014 9000 -26132 -27251 -43994 -29219 -16360 -11620
$$ packed form
5391h2208L7967K5614M0359l4871o564Q061j4046O006L4735P600M622k3505j0411
5378f641l1234p358p454j671J1077J5497J4551J5150K949k3289l1852j1933J0069
5365e2139m818k1105L645K4777K5766k1J414R162J3773o577n946j4082O142J1190
5351h819J6l769j114L1543O50j5049J3574r13k2725j7453k121m5822J6542J5894
5337c9566J1947K1008K4551K9966k8943J7384k7349l5626J5763N897j5532R60
5325a9540r431k9320J3376L6729Q816J2332L2806J5730j0732j4918k1982k4955
5313a1089k558J184J2011J787l7440J2190J2009K8956L28q715j1921k8672N029
5300b6901K2973R756o5388j7318L8864M7014l5132j119j6743J4775J2859M740
$$ plain form
5288 -11620 794 26696 29239 9778 -24409 -38909 -48275 -51352 -39775 -32526 -32251 -19035 29491
5275 29491 34237 -1661 -6135 25475 7377 -37802 -18283 -4025 -28359 -24496 -24857 -55553 -60502
5262 -60502 -81778 -77399 -52213 -27115 -41737 -87518 -57970 4875 26601 -1176 -11230 15272
5250 15272 36791 -7477 -25422 -43924 -34860 -25235 -41689 -13518 1465 -15793 -32102 -57295
5238 -57295 -30315 -20010 -21293 -45780 -60311 -59233 -84806 -59211 -74108 -88864 -50067 11380
5226 11380 12080 6377 -4980 1650 33289 20206 29973 -9742 -56623 -34440 -27390 -4633 21694
5213 21694 27971 -19087 -21734 18328 67494 67538 25190 -9005 27560 11043 1992 -7708 -40761
5200 -40761 -43415 -28616 4959 2134 -4930 -26450 -43208 -38127 -24780 3926 24555 11970 -1289
$$ packed form
5288a1620J2414K5902K543j9461l4187j4500r366l077J1577P249K75J3216M8526
5275B9491M746l5898m474L1610j8098m5179J9519J4258k4334L863l61l0696m949
5262f0502k1276M379K5186K5098j4622m5781K9548O2845K1726k7777j0054K6502
5250A5272K1519m4268j7945j8502R064R625j6454K8171J4983j7258j6309k5193
5238e7295K6980J0305j283k4487j4531J078k5573K5595j4897j4756L8797O1447
5226A1380P00n703j1357O630L1639j3083R767l9715m6881K2183P050K2757K6327
5213B1694O277m7058k647M0062M9166M4m2348l4195L6565j6517r051r700l3053
5200d0761k654J4799L3575k825p064k1520j6758N081J3347K8706K0629j2585j3259
$$ plain form
5187 -1289 -7955 -40512 -37598 -47624 -10139 -13038 -499 9579 -287 24664 16057 2936 9624
5174 9624 56184 44547 18521 12226 21340 22740 21553 -15415 1776 18423 26938 32061 -19971
5161 -19971 -34073 -29088 -14122 -29671 -7285 17570 10690 14121 -15841 -61746 -35326 -6585
5149 -6585 -6414 4177 -16585 -11194 10240 -22267 -51341 -8085 33881 32596 14905 12019 -17266
5136 -17266 -30118 1159 14440 -16001 -13775 -31833 -50436 -9997 -7727 -10976 9646 24489
5124 24489 33517 1415 -42053 -89729 -39221 13848 38110 29063 14274 -491 -28949 -19868
5112 -19868 -5180 -36303 -55782 -41338 -35953 -41232 -41553 -45329 -57728 -92792 -44514 -42558 -42949
5099 -42949 -42163 -22901 10682 16158 41276 35214 82801 128388 94161 24926 -835 16111 23572
$$ packed form
5187a289o666l2557K914j0026L7485k899J2539J0078r866K4951q607j3121O688
5174I624M6560j1637k6026o295R114J400j187l6968J7191J6647Q515N123n2032
5161a9971j4102M985J4966j5549K2386K4855o880L431k9962m5905K6420K8741
5149f585J71J0591k0762N391K1434l2507k9074M3256M1966j285j7691k886k9285
5136a7266j2852L1277J3281l0441K226j8058j8603M0439K270l249K0622J4843
5124B4489R028l2102m3468m7676N0508N3069K4262r047j4789j4765k8458R081
5112a9868J4688l1123j9479J4444N385n279l21l776j2399l5064M8278J956l91
5099d2949P86J9262L3583N476K5118o062M7587M5587l4227o9235k5761J6946P461
$$ plain form
5086 23572 26524 153 -30019 -56031 -84468 -47234 -33257 -32459 -428 -1666 -5409 11895 21500
5073 21500 -10868 -10855 29741 56809 10890 -6672 -10714 -26094 -66549 -50016 -12098 -25678 -19956
5060 -19956 -21929 -35970 -41302 -37623 -25634 -50615 -44091 -23689 10069 59414 55354 43735 6029
5047 6029 -8969 -8739 -16456 4333 27740 39083 4692 33249 63193 48802 52126 38570 -2807
5034 -2807 2472 9508 -13466 -40246 -47468 -2076 15546 13833 471 17855 19103 3465 29620
5021 29620 53623 68888 60954 70308 72512 40423 17068 940 4283 31342 49773 44878 32040
5008 32040 15715 -10166 -6436 -16441 -8921 16801 18126 6289 -9185 -12040 -45567 -66188 -52565
4995 -52565 -14705 20659 22268 8102 2135 37978 11487 9439 15323 50219 85326 109543 102602
$$ packed form
5086B3572K952k6371l0172k6012k8437L7234J3977P98L2031j238l743J7304R605
5073B1500l2368J3M0596K7068m5919j7562m042j5380m0455J6533L7918j3580N722
5060a9956j973j4041n332L679J1989k4981O524K0402L3758M9345m060j1619l7706
5047F029j4998K30p717K0789K3407J1343l4391K8557K9944j4391L324j3556m1377
5034b807N279P036k2974k6780p222M5392J7622j713j3362J7384J248j5638K6155
5021B9620K4003J5265p934R354K204l2089k3355j6128L343K7059J8431m895j2838
5008C2040j6325k5881L730j0005P520K5722J325j1837j5474k855l3527k0621J3623
4995e2565L7860L5364J609j4166n967L5843k6491k048N884L4896L5107K4217o941
$$ plain form
4982 102602 117333 94735 74531 27879 6327 -53868 -38659 -37514 -3698 9324 11281 23960
4970 23960 6568 27447 62696 74342 31196 49898 111563 88837 30231 -14744 -2353 1755
4958 1755 18493 17514 -9304 -32583 -55943 -51825 -43462 -47954 -59363 -18867 22709 10061 -12417
4945 -12417 -13163 -15777 616 15712 -43203 -33188 -7218 -13464 -27324 -17230 -19301 -6183 -13787
4932 -13787 10362 23518 -21711 -40328 -69860 -103023 -100687 -75858 -44553 -31070 -21559 -26475
4920 -26475 -31150 -46663 -75311 -67559 -42748 -21964 -574 -4355 -10021 -28210 -24588 3079 13266
4907 13266 -6278 -36573 -25072 -11105 -2979 -43134 -34192 -29885 939 19701 30383 76391
4895 76391 61807 41247 -8208 -26212 7294 8547 12943 8936 -1620 45654 58041 31737
$$ packed form
4982A02602J4731k2598k0204m6652k1552o0195J5209J145L3816J3022J957J2679
4970B3960j7392K0879L5249J1646m3146J8702O1665k2726n8606m4975J2391M108
4958A755J6738r79k6818k3279k3360M118Q363m492j1409M0496M1576j2648k2478
4945a2417p46k614J6393J5096n8915J0015K5970o246j3860J0094k071J3118p604
4932a3787K4149J3156m5229j8617k9532l3163K336K4829L1305J3483R511m916
4920b6475m675j5513k8648P752K4811K0784K1390l781n666j8189L622K7667J0187
4907A3266j9544l0295J1501J3967Q126m0155Q942M307L0824J8762J0682M6008
4895G6391j4584k0560m9455j8004L3506J253M396m007j0556M7274J2387k6304
$$ plain form
4883 31737 -34677 -15146 -9549 -34521 -48987 -54614 -32858 -8744 -18914 -61079 -78541 -52256
4871 -52256 -27249 -594 35220 66057 51509 -8918 -54628 -70354 -58368 -49832 -42224 -16311
4859 -16311 -1824 -11003 -38680 -73395 -61613 -41464 -37989 -50656 -62907 -29497 -9904 -20412
4847 -20412 -30888 11498 7246 -27157 -48852 27321 80798 83854 31924 -16798 -57280 -64787
4835 -64787 -44187 -1597 -818 -17134 3992 38861 36098 65339 28244 1571 -25643 -20404 -24820
4822 -24820 -42722 -49111 -19421 -25564 -7365 -38109 -72355 -93868 -97813 -109442 -126946 -82671
4810 -82671 -62299 -43499 -1330 -16269 -31265 -20351 4560 13600 32800 11778 3206 -10040
4798 -10040 -20218 -46310 -51713 -76758 -72286 -69831 -58723 -28184 -6503 -3128 15905 44771 -8299
$$ packed form
4883C1737o6414J9531N597k4972j4466n627K1756K4114j0170m2165j7462K6285
4871e2256K5007K6655L5814L0837j4548o0427m5710j5726J1986Q536P608K5913
4859a6311J4487r179k7677l4715J1782K0149L475j2667j2251L3410J9593j0508
4847b0412j0476M2386m252l4403k1695P6173N3477L056n1930m8722m0482p507
4835f4787K0600M2590P79j6316K1126L4869k763K9241l7095k6673k7214N239m416
4822b4820j7902o389K9690o143J8199l0744l4246k1513l945j1629j7504M4275
4810h2671K0372J8800M2169j4939j4996J0914K4911R040J9200k1022q572j3246
4798a0040j0178k6092n403k5045M472K455J1108L0539K1681L375J9033K8866n3070
$$ plain form
4785 -8299 -70620 -70925 -59890 -21744 6552 23355 38054 85365 92473 48787 19746 -274 -43185
4772 -43185 -45738 -22846 11593 18358 19629 9545 -15469 -30612 -2273 14562 11559 -19207 -49777
4759 -49777 -50996 -59489 -40308 -29687 -4526 -7837 7248 -25294 -35418 -39579 -45404 -67270 -30820
4746 -30820 -20456 -27781 -18181 -23817 -33686 -41992 -30208 16030 40769 13818 37728 52815 70597
4733 70597 79377 94731 50977 12664 -2311 -19090 -8771 11194 7429 35704 -2957 -14117
4721 -14117 -21831 -48829 -56000 -10642 960 -15015 -20929 -38555 10478 45396 57535 46337
4709 46337 18434 -2319 3169 1443 20030 19821 -12439 -18833 6377 44257 21212 10695 9800
$$ packed form
4785h299o2321l05J1035L8146K8296J6803J4699M7311P108m3686k9041k0020m2911
4772d3185k553K2892L4439O765J271j0084k5014j5143K8339J6835l003l0766l0570
4759d9777j219q493J9181J0621K5161l311J5085l2542j0124m161n825k1866L6450
4746c0820J0364p325R600n636r869q306J1784M6238K4739k6951K3910J5087J7782
4733G0597Q780J5354m3754l8313j4975j6779J0319J9965l765K8275l8661j1160
4721a4117p714k6998p171M5358J1602j5975n914j7626M9033L4918J2139j1198
4709D6337k7903k0753N488j726J8587k09l2260o394K5210L7880k3045j0517q95
$$ [...]
##END NTUPLES=NMR SPECTRUM
##END=
