##TITLE=Analysis number 312914
Compound Code sb 01239
Project Code adrs
Chemist Name stores
##JCAMPDX= 6.0         $$ Bruker NMR JCAMP-DX V2.0
##DATA TYPE= NMR SPECTRUM
##DATA CLASS= NTUPLES
##ORIGIN= Bruker BioSpin GmbH
##OWNER= NMR
$$ XWIN-NMR		Version 3.5
$$ Thu Aug 18 14:07:19 2005 GMT Daylight Time (UT+1h)  MAYBRIDGE\NMR@NMR_250MHZ
##.OBSERVE FREQUENCY= 250.131544655141
##.OBSERVE NUCLEUS= ^1H
##.ACQUISITION MODE= SIMULTANEOUS (DQD)
##.ACQUISITION SCHEME= undefined
##.AVERAGES= 16
##.DIGITISER RES= 18
##SPECTROMETER/DATA SYSTEM= dpx250
##.PULSE SEQUENCE= zg30
##.SOLVENT NAME= CDCl3
##.SHIFT REFERENCE= (INTERNAL, CDCl3, 0, 16.522)
##AUDIT TRAIL= $$ (NUMBER, WHEN, WHO, WHERE, WHAT)
$$ ##TITLE= Audit trail, XWIN-NMR		Version 3.5
$$ ##JCAMPDX= 5.01
$$ ##ORIGIN= Bruker BioSpin GmbH
$$ ##OWNER= NMR
$$ C:\u/data/dgb/nmr/ADRS/8150/pdata/1/auditp.txt
$$ ##AUDIT TRAIL=  $$ (NUMBER, WHEN, WHO, WHERE, WHAT)
(   1,<2005-08-18 14:07:00.81 +100>,<MAYBRIDGE\NMR>,<NMR_250MHZ>,
      <created by zg, POWCHK disabled, PULCHK disabled
       configuration hash MD5:
       62 19 C7 07 E1 42 D1 B7 37 6C 3D D0 77 39 F9 E6
       data hash MD5: 64K
       C1 98 BB 96 39 27 EB 77 95 5E 1A 20 15 4A 6A 9C>)
(   2,<2005-08-18 14:07:10.85 +100>,<MAYBRIDGE\NMR>,<NMR_250MHZ>,
      <Start of raw data processing
       ef LB = 0.3 FT_mod = 6 PKNL = 1 SI = 32K 
       data hash MD5: 32K
       2B 33 B4 13 82 78 65 E5 55 D0 CE 01 B1 C6 B0 3A>)
(   3,<2005-08-18 14:07:12.89 +100>,<MAYBRIDGE\NMR>,<NMR_250MHZ>,
      <apk 
       data hash MD5: 32K
       35 00 2E 44 53 B0 86 E8 62 98 D2 A7 C8 F8 2D 65>)
(   4,<2005-08-18 14:07:13.58 +100>,<MAYBRIDGE\NMR>,<NMR_250MHZ>,
      <abs ABSG = 5 
       data hash MD5: 32K
       A6 CC 2F 27 4A 2E 45 3E A0 ED B9 14 CE A6 2E B4>)
$$ ##END=
$$ 
$$ hash MD5
$$ 85 64 F2 C7 42 5D 31 F6 F4 79 6C B4 AF 70 DE EC
##$RELAX= 
##$RELAX= 
##$RELAX= 
##$RELAX= 
##$RELAX= 
##$RELAX= 
##$RELAX= 
$$ Bruker specific parameters
$$ --------------------------
##$DU= <C:\u>
##$EXPNO= 8150
##$NAME= <ADRS>
##$PROCNO= 1
##$TYPE= <nmr>
##$USER= <dgb>
##$AMP= (0..31)
100 100 100 100 100 100 100 100 100 100 100 100 100 100 100 100 100 100 
100 100 100 100 100 100 100 100 100 100 100 100 100 100 
##$AQSEQ= 0
##$AQ_mod= 3
##$AUNM= <au_zg>
##$AUTOPOS= <24 >
##$BF1= 250.13
##$BF2= 250.13
##$BF3= 250.13
##$BF4= 250.13
##$BF5= 500.13
##$BF6= 500.13
##$BF7= 500.13
##$BF8= 500.13
##$BYTORDA= 1
##$CFDGTYP= 0
##$CFRGTYP= 5
##$CHEMSTR= <none>
##$CNST= (0..31)
1 1 145 1 1 1 1 1 1 1 1 1 1 1 1 1 1 1 1 1 1 1 1 1 1 1 1 1 1 1 1 1 
##$CPDPRG= <>
##$CPDPRG1= <>
##$CPDPRG2= <>
##$CPDPRG3= <>
##$CPDPRG4= <mlev>
##$CPDPRG5= <mlev>
##$CPDPRG6= <mlev>
##$CPDPRG7= <mlev>
##$CPDPRG8= <mlev>
##$CPDPRGB= <>
##$CPDPRGT= <>
##$D= (0..31)
0 1 0 0 0 0 0 0 0 0.06 0 0 0 0 0 0 0.0002 0 0 0 0 0 0 0 0 0 0 0 0 0 0 
0 
##$DATE= 1124370419
##$DBL= (0..7)
120 120 120 120 120 120 120 120 
##$DBP= (0..7)
150 150 150 150 150 150 150 150 
##$DBP07= 0
##$DBPNAM0= <>
##$DBPNAM1= <>
##$DBPNAM2= <>
$$ [...]
##$SUBNAM7= <"">
##$SUBNAM8= <"">
##$SUBNAM9= <"">
##$SW= 20.6930455092707
##$SWIBOX= (0..15)
0 0 3 0 0 0 0 0 0 0 0 0 0 0 0 0 
##$SW_h= 5175.983436853
##$TD= 65536
##$TD0= 1
##$TE= 295.16
##$TE2= 300
##$TE3= 300
##$TEG= 300
##$TL= (0..7)
0 120 120 120 120 120 120 120 
##$TP= (0..7)
150 150 150 150 150 150 150 150 
##$TP07= 0
##$TPNAME0= <>
##$TPNAME1= <>
##$TPNAME2= <>
##$TPNAME3= <>
##$TPNAME4= <>
##$TPNAME5= <>
##$TPNAME6= <>
##$TPNAME7= <>
##$TPOAL= (0..7)
0.5 0.5 0.5 0.5 0.5 0.5 0.5 0.5 
##$TPOFFS= (0..7)
0 0 0 0 0 0 0 0 
##$TUNHIN= 0
##$TUNHOUT= 0
##$TUNXOUT= 0
##$USERA1= <user>
##$USERA2= <user>
##$USERA3= <user>
##$USERA4= <user>
##$USERA5= <user>
##$V9= 5
##$VALIST= <valist>
##$VCLIST= <CCCCCCCCCCCCCCC>
##$VD= 0
##$VDLIST= <DDDDDDDDDDDDDDD>
##$VPLIST= <PPPPPPPPPPPPPPP>
##$VTLIST= <TTTTTTTTTTTTTTT>
##$WBST= 1024
##$WBSW= 4
##$XGAIN= (0..3)
0 0 0 0 
##$XL= 0
##$YL= 0
##$YMAX_a= 406269
##$YMIN_a= -509608
##$ZGOPTNS= <>
##$ZL1= 120
##$ZL2= 120
##$ZL3= 120
##$ZL4= 120
##$ABSF1= 16.522
##$ABSF2= -4.171173
##$ABSG= 5
##$ABSL= 3
##$ALPHA= 0
##$AQORDER= 0
##$ASSFAC= 0
##$ASSFACI= 0
##$ASSFACX= 0
##$ASSWID= 0
##$AUNMP= <proc_1d>
##$AZFE= 0.1
##$AZFW= 0.1
##$BCFW= 0
##$BC_mod= 0
##$BYTORDP= 0
##$COROFFS= 0
##$CY= 12.5
##$DATMOD= 1
##$DC= 0
##$DFILT= <>
##$DTYPP= 0
##$F1P= 14.0000005364418
##$F2P= -0.99999901652339
##$FCOR= 0.5
##$FTSIZE= 32768
##$FT_mod= 6
##$GAMMA= 0
##$GB= 0
##$INTBC= 1
##$INTSCL= 1
##$ISEN= 128
##$LB= 0.3
##$LEV0= 0
##$LPBIN= 0
##$MAXI= 10000
##$MC2= 0
##$MEAN= 0
##$ME_mod= 0
##$MI= 0
##$NCOEF= 0
##$NC_proc= -3
##$NLEV= 6
##$NOISF1= 0
##$NOISF2= 0
##$NSP= 0
##$NTH_PI= 0
##$NZP= 0
##$OFFSET= 16.522
##$PC= 1
##$PHC0= -86.4654
##$PHC1= 15.81412
##$PH_mod= 1
##$PKNL= yes
##$PPARMOD= 0
##$PSCAL= 4
##$PSIGN= 0
##$REVERSE= no
##$SF= 250.13
##$SI= 32768
##$SIGF1= 0
##$SIGF2= 0
##$SINO= 400
##$SIOLD= 32768
##$SREGLST= <1H.CDCl3>
##$SSB= 0
##$STSI= 32768
##$STSR= 0
##$SW_p= 5175.98343685301
##$SYMM= 0
##$S_DEV= 0
##$TDeff= 65536
##$TDoff= 0
##$TI= <Analysis number 999999
Compound Code 99
Book Reference 9
Project Code 9>
##$TILT= no
##$TM1= 0
##$TM2= 0
##$TOPLEV= 0
##$USERP1= <user>
##$USERP2= <user>
##$USERP3= <user>
##$USERP4= <user>
##$USERP5= <user>
##$WDW= 1
##$XDIM= 32768
##$YMAX_p= 526670644
##$YMIN_p= -282025
$$ End of Bruker specific parameters
$$ ---------------------------------
##NTUPLES= NMR SPECTRUM
##VAR_NAME=  FREQUENCY,     SPECTRUM/REAL,   SPECTRUM/IMAG
##SYMBOL=    X,             R,               I
##VAR_TYPE=  INDEPENDENT,   DEPENDENT,       DEPENDENT
##VAR_FORM=  AFFN,          ASDF,            ASDF
##VAR_DIM=   32768,         32768,           32768
##UNITS=     HZ,            ARBITRARY UNITS, ARBITRARY UNITS
##FACTOR=    0.157963299565203, 1,           1
##FIRST=     4132.6476996994, 0,             0
##LAST=      -1043.33573715361, 0,           0
##MIN=       -1043.33573715361, -282025,     0
##MAX=       4132.6476996994, 526670644,     0
$$ Real data points
##PAGE= N=1
##DATA TABLE= (X++(R..R)), XYDATA
$$ [...]
18580D9152M424m236J950M99N62j0949M06Q213J1768J0962N022O106r437j3445
18566F0997n210R733Q174j2861j3869l226O687J1239k14j3449R768l878o961k84
18552D6646P686J7675l172p119M174k381o845L666j258M268n3n84J3231j5977
18538E9957j3242K111J9311P964j2166J944O513q774j1991M402j2822P463N659
18525E6329P066r304K441K0202J0320L895p578O31l019j3118j829Q362Q970r550
18511G3818M34r569k073O718R564O3k784Q068L47N03m475L996n054J4443J0153
18496A04152j9423j0518m920j752K891k575Q568o618j3478J74R550o9J1469K788
18482H0239j7896o004N368q774L910k801K45J981N228n923l337P368K0668K1459
$$ plain form
18580 49152 53576 49340 51290 51789 52351 41402 41808 50021 61789 72751 77773 83879 74442 60997
18566 60997 55787 65520 73694 60833 46964 43738 50425 61664 61450 48001 57769 53891 46930 46646
18552 46646 54332 72007 68835 61716 65890 63509 56664 60330 59072 63340 63287 62703 75934 59957
18538 59957 46715 48826 68137 76101 63935 65879 72392 63618 51627 56029 43207 50670 56329
18525 56329 63395 54091 56532 76734 87054 90949 83371 84002 80983 67865 66036 74398 83368 73818
18511 73818 74252 64683 62610 69328 78892 78955 76171 84239 84586 85089 80614 84610 79556 93999 104152
18496 104152 84729 74211 69291 67539 70430 67855 76423 69805 56327 56501 66051 65982 77451 80239
18482 80239 62343 56339 61707 52933 56843 54042 54287 56268 61496 55573 52236 59604 80272 101731
18468A01731R057N511o777j5750r006j467M695o637o115O62j3767o631K816N329
18454F3651J7853J0843j9092O707J2497p071j2055j1419N958p596j0995n617k63
18441D3401j1556m655J1698J0976l915k402J6754J7685M047L576n419O046N186
18428I1422q1m183m155O815K002k620j0036r778j0329k01m635k145K0779O12j286
18413G2181K622M981J2044J1041O658j7232j6377j480p876l316J033J1180J6577
18400I2036J1294J7449k133K675R258J613k675M978k316r596j9382O459p40o482
18386A02438Q323k285M025K0082R864K0452J3782j5326j4168p212J6947J4669
18374A71591k893J3052J5634J0858Lj3233R10r950r112j4232j278R080J785j5431
$$ plain form
18468 101731 110788 116299 109522 93772 84766 83299 87994 81357 75242 75904 62137 55506 58322 63651
18454 63651 81504 92347 73255 79962 92459 85388 73333 61914 67872 60276 49281 43664 43401
18441 43401 31845 27190 38888 49864 45949 43547 60301 77986 82033 85609 80190 86236 91422
18428 91422 91341 87158 83003 89818 91820 89200 79164 69386 59057 58856 54221 52076 72855 73467 72181
18413 72181 74803 79784 91828 102869 109527 92295 75918 74438 66562 63246 64279 75459 92036
18400 92036 103330 120779 118646 121321 130579 132192 129517 134495 132179 122583 103201 109660 108920 102438
18386 102438 110761 108476 112501 132583 142447 162899 176681 161355 147187 139975 156922 171591
18374 171591 168698 181750 197384 208242 208245 195012 195922 185972 176860 162628 161350 170430 172215 156784
18360A56784k092O210r616j1755p213K681L652n220j7761o481Q926J7978J3317
18347A49410N154J3421J2306J5825L964j3369J0006J9888J5687L2116j2869j8484
18335B33055j3579j8672p411j853k290m570j299m039l607J343k743N405Q208l605
18321A84343n779N438L192j1640j8396j50R712J6172m415L747Q305p080j3651
18308A69798J2620K594j5348j8285o586j555L944J488J1678M676k787R462m585
18295A67114J5329J156o086n163j9185P118J7451q151J1607Q725Q377j4115j049
18282A83128J4631J255J304m272P318J2719Q251N321p155o363j670J189L613J257
18268B20526J2402r85k833J7418J5169m898k505n169r876k010J0441L371J2404
$$ plain form
18360 156784 154692 160902 151286 139531 132318 134999 138651 133431 115670 109189 118115 136093 149410
18347 149410 154564 167985 180291 196116 200080 186711 196717 216605 232292 264408 251539 233055
18335 233055 219476 200804 193393 191540 189250 184680 183381 179342 175735 177078 174335 179740 187948 184343
18321 184343 178564 184002 187194 175554 157158 157008 166720 182892 178477 182224 190529 183449 169798
18308 169798 182418 185012 169664 151379 144793 143238 147182 148670 160348 165024 162237 171699 167114
18295 167114 182443 183599 177513 172350 153165 160283 177734 169583 181190 189915 198292 184177 183128
18282 183128 197759 199014 200318 196046 203364 216083 224334 229655 222500 216137 214467 215656 219269 220526
18268 220526 232928 231943 229110 246528 261697 256799 254294 249125 239249 237239 247680 251051 263455
18255B63455R787J2501P589l246j6983j0352j0687n108L452M376L069N746J1545
18242B75144K8995K7477J0546n652q425j0813N683M222L268K0032J4333Q016q763
18229C64063k652N470l539L226j528J2765O584j3840j1028L08K9184J7074L823
18216D09910P675Q417K772J0665N660J4469K9459L7341L2026J1545M523P479L451
18203E85392L141p77M981J9250R022J4666j082P14J1368P489J8548K2678K3563
18190G18953K3226O273M376K5880P686J7274m71J7383J8344K2049L3635K8898
18178I23506K1027J9547K3869N6417N5291L8890L6386L0643N2681M9467L0191
18167A337915L0585L3136M3744O3686P8264R0884P9224R1461J00483R8227J20765
$$ plain form
18255 263455 273242 285743 293332 290086 273103 262751 252064 246956 250408 254784 257853 263599 275144
18242 275144 304139 331616 342162 336510 328085 317272 322955 327177 330445 350477 364810 372826 364063
18229 364063 361411 366881 363342 366568 365040 377805 384389 370549 359521 359829 389013 406087 409910
18216 409910 417585 426002 428774 439439 445099 459568 489027 526368 558394 569939 574462 581941 585392
18203 585392 588533 587756 592737 611987 621009 635675 634593 635307 646675 654164 672712 695390 718953
18190 718953 742179 748452 752828 778708 786394 803668 803197 820580 838924 860973 894608 923506
18178 923506 944533 964080 987949 1044366 1099657 1138547 1174933 1205576 1258257 1307724 1337915
18167 1337915 1368500 1401636 1445380 1509066 1587330 1678214 1757438 1848899 1949382 2047609 2168374
18156B168374J35116J44967J52163J78145K15613K24522K00729J79488J54261
18147C753378J31442J32985J55006K03796K39153K55251L01944L55014L99272
18138E927241M26746M80604N69003O54437P13682P62450Q13297Q86593J006157
18129A2240210J151699J326700J534643J790299K158500K754051L717540N142388
18121C1816030P163193R700959J2089834J2335308Q353306R21837o670264j1870943
18113F3839260j2884556j0302271o654421l528306j071109Q22249J264658m24794
18105C1060710j896346l161875l520106k293820j135667m92436j32652Q0645K78339
18096A8786792M90099P32958R86990J269743J585237K027723K732834L831955
$$ plain form
18156 2168374 2303490 2448457 2600620 2778765 2994378 3218900 3419629 3599117 3753378
18147 3753378 3884820 4017805 4172811 4376607 4615760 4871011 5172955 5527969 5927241
18138 5927241 6353987 6834591 7403594 8058031 8771713 9534163 10347460 11234053 12240210
18129 12240210 13391909 14718609 16253252 18043551 20202051 22956102 26673642 31816030
18121 31816030 38979223 48680182 60770016 73105324 81458630 82380467 75710203 63839260
18113 63839260 50954704 40652433 33998012 30469706 29398597 30220846 31485504 31060710
18105 31060710 29164364 26002489 22482383 20188563 19052896 18560460 18427808 18508453 18786792
18096 18786792 19276891 20009849 20996839 22266582 23851819 25879542 28612376 32444331
18088C2444331N438896P616449J0255894J2441629J2062590P152409r42059q788426
18080G7681713j3816721j4386855j1540104q057241n416419l766120k733007k017832
18072A5947414j543625j207722r56763p58288o17877n36908n01281m80358m69166
18063H875426m40040l77285l41469k64180k03379j80526j40244q4412m0287R966
18053F813570Q014q2817j86161k79382l67232m13258m09008l78641l46349l16848
18043D041888k80798k52779k29469k21592j94515j61884j57991j53433j41754
18034B247673j34245j31336j32484j25208j04831q1607r5843p2777o9441p7169
18024A222732o7327p6524o1916m4808m5922m7687o0875m8001n1910m8823n3295
$$ plain form
18088 32444331 37883227 45499676 55755570 68197199 80259789 87412198 86470139 77681713
18080 77681713 63864992 49478137 37938033 29880792 24464373 20698253 17965246 15947414
18072 15947414 14403789 13196067 12239304 11481016 10863139 10326231 9824950 9344592 8875426
18063 8875426 8435386 8058101 7716632 7452452 7249073 7068547 6928303 6843891 6803604 6813570
18053 6813570 6821584 6738767 6552606 6273224 5905992 5492734 5083726 4705085 4358736 4041888
18043 4041888 3761090 3508311 3278842 3057250 2862735 2700851 2542860 2389427 2247673
18034 2247673 2113428 1982092 1849608 1724400 1619569 1537962 1442119 1369342 1299901 1222732
18024 1222732 1155405 1078881 1016965 972157 926235 878548 817673 769672 717762 668939 615644
18013F15644n3907l1180l4442k9483j6159k4906k8334k0863k6832l3326n427j0041
18001C00744j7329k1909q792k0737k4458l6703j7394J57M98k382j3548O856P359
17988A52362M370l059j8987j3978m298j0728j2068o900p073o257j5090o344j0577
17975D1373l098L294j789O563n764o766K726j6053M694j0276p881O326o114j375
17961E860Q327J2024L661N497M798R129K0136K5153R748n558p431j9684j4625
17948E7035N447j484l894j1251q934M076Q431p755r186k125M393K6931M981m269
17934F2396j0325K896n737l178J3107K117j1365r245J067L095N232n010L909k426
17920D6533l910J408L352Q180l7l376N877O015Q249j3555q481m848J3799J3704
$$ plain form
18013 615644 561737 530557 496115 466632 450473 425567 397233 376370 349538 316212 310785 300744
18001 300744 283415 261506 252714 231977 207519 170816 153422 153579 154077 151695 138147 145003 152362
17988 152362 156732 153673 134686 120708 116410 105682 93614 86714 79641 73384 58294 51950 41373
17975 41373 38275 41569 39780 46343 40579 33813 36539 20486 25180 14904 7023 13349 7235 5860
17961 5860 14187 26211 29872 35369 40167 49296 69432 94585 104333 98775 91344 71660 57035
17948 57035 62482 60998 57104 45853 36919 40995 49426 41671 32485 30360 34753 61684 66665 62396
17934 62396 52071 54967 49230 46052 59159 61276 49911 40666 41733 44828 50060 45050 48959 46533
17920 46533 42623 44031 47383 55563 55526 52150 58027 64042 72291 58736 50255 45407 59206 72910
17906G2910L420l192n583M082j2944j6559j436r248j1570J2516Q274j303r389
17893B9978j6156j113J1591m226j449n418l326p794n52J0530M770r874j7910O41
17879a0308k553l484P588N0j2465l142J4579J1124k029j0603j42j773N68K398
17865a0192O204J5946j3328k110o298j0264n805j92P349O050n592l44k906J757
17851a9725j2789r345j5770k991J5583L412N991M207n497K071q619l281j012J9655
17837b8110n335j0738j4913j0669K874J806J3427N420n195O813P685M548J552
17824c0835j4026n214R705K93n301J0605J2281j670o756l546j262j860Q127J1414
17810a8045j3822l163l66O895J606N101n815p672L78Q391N284J7062O590J5580
$$ plain form
17906 72910 76330 73138 67555 71637 58693 42134 40698 31450 19880 32396 40670 39367 29978
17893 29978 13822 12709 24300 20074 18625 13207 9881 2087 1535 12065 16835 6961 -10949 -10308
17879 -10308 -12861 -16345 -8757 -8707 -21172 -24314 -9735 1389 -640 -11243 -11385 -13158 -12590 -10192
17865 -10192 -3988 11958 -1370 -3480 -9778 -20042 -25847 -26039 -18690 -12640 -18232 -18576 -21482 -19725
17851 -19725 -32514 -41859 -57629 -60620 -45037 -41625 -35634 -31427 -36924 -34853 -43472 -46753 -47765 -28110
17837 -28110 -33445 -44183 -59096 -69765 -66891 -65085 -51658 -46238 -51433 -44620 -36935 -32387 -30835
17824 -30835 -44861 -50075 -40370 -40077 -45378 -34773 -22492 -24162 -30918 -34464 -35726 -37586 -29459 -18045
17810 -18045 -31867 -35030 -35396 -28501 -26895 -21794 -27609 -35281 -34903 -26512 -21228 -4166 2424 18004
17796A8004J1557Q772M278j5101k0974q106N543J0304r969M414J3535j4754P468
17783A4971M092k894p542k342r194J599K2056k978R72J046l691M747K770k050
17769B1562r260j3270Q33r15J3674J7185O429R704n01K660q450j5614q690n851
17755I496J6n85j191L957K705L060m262q001l232k937j3339M299J6381M44J1087
17740A7898K009q009m384M543r652j9758n980J3644N413L700J0057r228q189J749
17726f187J1454j163j0092o466N14M223k011P171J311R173o553m447J800K952
17712A679j0449n731j085Q79M996J0069q280j4397O546k24k559M577K256O929
17698d794j0950j223L176J2499qk733N860Q41P329j414K715J3299M25n179m868
$$ plain form
17796 18004 29561 38333 42611 27510 6536 -1570 3973 14277 4308 8722 22257 7503 14971
17783 14971 19063 16169 8627 6285 -2909 -1310 20746 17768 18740 19786 16095 20842 23612 21562
17769 21562 12302 -968 -135 -1050 12624 29809 36238 45942 45441 48101 39651 24037 15347 9496
17755 9496 9512 8927 7736 11693 14398 17458 13196 5195 1963 -974 -14313 -10014 6367 6811 17898
17740 17898 19907 11898 7514 12057 2405 -17353 -23333 -9689 -4276 -576 9481 253 -7936 -6187
17726 -6187 5267 4104 -5988 -12454 -11940 -7717 -9728 -2557 -1246 7927 1374 -3073 -1273 1679
17712 1679 -8770 -14501 -15586 -14707 -9711 358 -7922 -22319 -15773 -15997 -18556 -13979 -11723 -4794
17698 -4794 -15744 -16967 -13791 -1292 -1300 -4033 1827 2668 9997 8583 11298 24597 25022 19843 14975
17683A4975j5402o112j5070L347O588L402m125j386j5882J346J2383M532Q773
17670b631R658j5311j1057J546O353N370n097m91l872L334R038j392J8883N710
17656B0041L574k548j1938j5883k124N674K231q017n484R471j1225j592J5091
17643b729r802m666m866P486O455j655J1125j179j1099j587k694J3956Q097m477
17629B365L178K939p689j4558j1223j239J6233J3712J4030p985l670L262N619
17616A4974K472j9460j0527K189P275o615r355R354J1778R319q284j149Q533o2
17602A0442m38j030l381O922P276m873r929n612j0801R298N216j0702O12o531
17588a3531O229R449M035K2808O521k125j4473j1692j5513r324J7992J0471R021
$$ plain form
17683 14975 -427 -6539 -21609 -18262 -11674 -8272 -12397 -13783 -29665 -28319 -15936 -11404 -2631
17670 -2631 7027 -8284 -19341 -17795 -11442 -6072 -11169 -11660 -15532 -12198 -3160 -4552 14331 20041
17656 20041 23615 21067 9129 -6754 -8878 -3204 -973 -8990 -14474 -5003 -16228 -17820 -2729
17643 -2729 -12531 -17197 -22063 -14577 -8122 -9777 1348 169 -10930 -12517 -15211 -1255 6842 2365
17629 2365 5543 8482 793 -13765 -24988 -26227 -9994 3718 17748 9763 6093 9355 14974
17616 14974 17446 -2014 -12541 -10352 -3077 -9692 -19047 -9693 2085 11404 3120 1971 10504 10442
17602 10442 10004 8974 5593 12515 19791 14918 4989 -623 -11424 -2126 3090 -7612 -7000 -13531
17588 -13531 -7302 2147 6182 28990 35511 33386 18913 7221 -8292 -17616 376 10847 19868
17575A9868j0256j3887j0667J0503K763M649J1233J9421j0954J223J044j0288
17563A4652j585m766J0007L960K724j0718n757K7070m97n998Q563J0474O868k403
17549E2594l657K446J0296l703J96J7685K078M596R185J830k259J2896K4032J9379
17535A47594K7942K4847K8906M8277P0248N1063K9602j1121k4691n2226o9681
17524B70760n1359l2040k2923q321r975q008j3140j646L810O421r579q514J1160
17511A26646P016K491R581m783k410k223R125J6661J8632J3812K9083N3390O3677
17498C40698P3636P7552P6303J8192j3655l5997n1569m2671o000K0729M9043O9166
17486E75427K2210j7714o0165p8748q3207p4359m5379k6327j2970k0274j0423
$$ plain form
17575 19868 9612 -4275 -14942 -4439 -1676 2973 14206 33627 22673 23896 24940 14652
17563 14652 13067 8301 18308 22268 24992 14274 8517 35587 35090 29092 37655 48129 54997 52594
17549 52594 48937 51383 61679 57976 58172 75857 77935 82531 91716 93546 91287 104183 128215 147594
17535 147594 175536 200383 229289 277566 347814 398877 428479 417358 392667 340441 270760
17524 270760 219401 187361 164438 156117 146142 138134 124994 123348 127158 133579 124000 115486 126646
17511 126646 133662 136153 145734 140951 138541 136318 145443 162104 180736 194548 223631 277021 340698
17498 340698 414334 491886 568189 586381 572726 536729 485160 442489 436489 457218 506261 575427
17486 575427 597637 579923 519758 441010 357803 283444 238065 211738 198768 178494 168071
17475A68071m118j5284k298k800k281j1635L883N759n512J1211J3943J403J5924
17462A76266J1538k340q300J6965J0714J9361L8569O4570P7619O2204J5957j5327
17450D67796m7597q6077p2796n0260l7697j8072j3062p28J4264K946K804j0607
17438A50914k5235j6692j6052j5063J920N868n935j0142J05J3008l693k309Q57
17425G7551p213k976q747j1221O09j722J8528L772j8524j3933r745K096O033N821
17411D0329p170l71P089K929m24k894o619p794L631J4596j175J422K153L686J240
17396E0628j3290k3213j1781Q151R96n799Q699L376q836J0445J5070o046o836
17383B1564R195Q852O889K5o102m797K035K351N85j1513p180O613N477J369L796
$$ plain form
17475 168071 163953 148669 146371 143571 141290 129655 133538 139297 133785 144996 158939 160342 176266
17462 176266 187804 185464 177164 194129 204843 224204 262773 327343 404962 467166 483123 467796
17450 467796 420199 334122 261326 211066 173369 155297 142235 141507 155771 158717 161521 150914
17438 150914 125679 108987 92935 77872 79792 85660 79725 69583 69688 82696 79003 76694 77551
17425 77551 70338 67362 58615 47394 48003 46281 64809 68581 50057 36124 26379 28475 34508 40329
17411 40329 33159 32788 39877 42806 42382 39488 32869 25075 28706 43302 42127 43549 45702 49388 50628
17396 50628 37338 14125 2344 10495 11491 5692 14391 17767 8931 19376 34446 28400 21564
17383 21564 30759 39611 46500 46525 40423 35626 37661 40012 40597 29084 21904 28517 33994 35363 39159
17368C9159k074p480q889j861j905M934J016j0257j123J8092N188R98l43M757
17354D0212O355q890l791l318r770O061Q533K766O341m933R658O821j0021j2022
17340C4002l964P44l836n616j178L721L8k372p642l752p29J5252J792j9673R11
17325G698J0212N961Q585M002K551j3215j002J1669Q704J907q864j7323m748N635
17311B1772l070o041Q810R318P896J3740j0629q609p852l716R493K287m966p92
17297B7641O136J2029j3052j4162O829J349Q41j2254J683r50n416l741j665j847
17283C421N05n080j985j3987o836P215J1910J0208R782Q758J7869O697M053L008
17269E5538r433m419L457m704l50q027n093J594Q612K713k958j724M228M694m744
$$ plain form
17368 39159 37085 29605 20716 18855 16950 21884 22900 12643 11520 29612 34800 35798 35455 40212
17354 40212 46567 37677 33886 30568 20798 26859 35392 38158 44499 39566 49224 56045 46024 34002
17340 34002 30038 30782 26946 21330 20152 23873 23911 21539 13897 10145 9416 24668 26460 6787 7698
17325 7698 17910 23871 32456 36458 39009 25794 24792 36461 45165 47072 38208 20885 16137 21772
17311 21772 18702 12661 21471 30789 38685 52425 41796 33187 25335 21619 31112 33399 28433 27641
17297 27641 33777 45806 32754 18592 25421 26770 27611 15357 17040 16090 10674 6933 5268 3421
17283 3421 3926 -1154 -3139 -17126 -23962 -16747 -4837 5371 15153 23911 41780 48477 52530 55538
17269 55538 46105 41686 45143 40439 40089 32062 26969 28563 37175 39888 36930 35206 39434 44128 39384
17254C9384o47l984q898k2168O422K6318O425J043j3314j7083j0061P18J2732
17241A6887J8645J0534J6472M377M943J8654K400o808r952k784o450j5972n935
17228D5011M779O965J0839P325P441J0989Q623p673n531O587J0502J4006N52L132
17214A23547J1612K3139P765M805O119o274j9844j2814p082j0371j3325j0920
17202I6357q34P828o593l623l31J8749J015n635J686J363j71J7262N430l044l299
17187A26160J5512M770p217j1803j3297J1226J1027N787J4599K2280K533r270
17175A72307O21r1n42j1066o188l401q636j8200k11N927j0997K546N324N860J3428
17160A46681J711j4232p159k279nl59P94Q854J7309N188j1542n278J4791K054
$$ plain form
17254 39384 38737 34753 25855 3687 10109 36427 42852 43895 30581 13498 3437 4155 16887
17241 16887 35532 46066 62538 66915 71858 90512 92912 86104 76152 73368 66918 50946 45011
17228 45011 49790 56755 67594 74919 82360 93349 101972 94299 88768 95355 105857 119863 120415 123547
17214 123547 135159 158298 166063 170868 176987 170713 150869 138055 130973 120602 107277 96357
17202 96357 95523 103351 96758 93135 92804 111553 112568 106933 108619 109982 109811 127073 132503 129459 126160
17187 126160 141672 146442 139225 127422 114125 125351 136378 142165 156764 179044 181577 172307
17175 172307 172928 172837 172295 161229 155041 151640 143004 124804 124593 130520 119523 122069 127393 133253 146681
17160 146681 148392 134160 127001 124722 124717 124358 125152 134006 151315 156503 144961 139683 154474 156528
17146A56528j3257j5675l666J4672n195m873k786J1258J4824j0542o642M846Q411
17133A47903P588N579j0619j2701m567N082J6956P65r288K668P359m41j0518j0189
17119A35577m016J7825J3650J3783p889j3963r444n372L677J375p153Q331J4532
17106A60913Q820j4387j0760q491M865O426N272M129Q786J4524Q076j375j2591
17093A74207j201J6731J7233j934j2655L636o996j5363k825J6111L1654M2484
17081B61082J4634r717p410j263K492O192p466N431L283M390N513J4262R912j1939
17067B89396j4291J9734K0600M42j3190q344O952J9779K4032K6504j537m537J6181
17054C81721J3406P63r374K686K3328M3676M5219J7030k134p469k808j570p495
$$ plain form
17146 156528 143271 127596 123930 138602 133407 128534 125748 137006 151830 141288 134646 139492 147903
17133 147903 155491 161070 150451 137750 133183 138265 155221 155986 146698 149366 156725 156284 145766 135577
17119 135577 131561 149386 163036 176819 168930 154967 145523 140151 143828 145203 138050 146381 160913
17106 160913 169733 155346 144586 136095 140960 147386 152658 156787 165573 180097 188173 186798 174207
17093 174207 173006 189737 206970 205036 192381 196017 189021 173658 170833 186944 218598 261082
17081 261082 275716 265999 258589 257326 259818 266010 258544 263975 267258 271648 277161 291423 301335 289396
17067 289396 275105 294839 315439 315881 302691 294347 301299 321078 345110 371614 370077 365540 381721
17054 381721 395127 395890 386516 389202 412530 456206 501425 518455 516321 508852 506044 504474 496979
17041D96979O523R546P646J2017R625M038J1513Q544P723n2K2671J4604J6949
17028F28326P213J0450J4564K9366P901l865P694K3973L8555K7581L8327M6478
17016H76563L4110J9575L9950M4093L2315L9974K9679K8056M4236M6368K9485
17005A264404M0902N4083O4170Q1076P1524Q5164Q3207J03621J10134J20978J26515
16994B205778J33299J37130J47433J75762J67838J73612J70571J99566K22676
16985C733665K38368K85419L28532L77446L98211L98442L88096L83660L86494
16976F918333M67029O13614P24149P75968Q22959R05897J038055J226748J449135
16967A4941887J646690J856661K182892K852560M041813N815727Q314499J1708450
$$ plain form
17041 496979 503502 513048 520694 532711 542336 546374 557887 566431 574154 574102 596773 611377 628326
17028 628326 635539 645989 660553 689919 697820 693955 701649 725622 764177 791758 830085 876563
17016 876563 910673 930248 970198 1014291 1046606 1086580 1116259 1144315 1188551 1234919 1264404
17005 1264404 1305306 1359389 1423559 1504635 1576159 1661323 1744530 1848151 1958285 2079263 2205778
16994 2205778 2339077 2476207 2623640 2799402 2967240 3140852 3311423 3510989 3733665
16985 3733665 3972033 4257452 4585984 4963430 5361641 5760083 6148179 6531839 6918333
16976 6918333 7385362 7998976 8723125 9499093 10322052 11227949 12266004 13492752 14941887
16967 14941887 16588577 18445238 20628130 23480690 27522503 33338230 41652729 53361179
16959E3361179J5108448J4805336P082596l326844j1877048j6879854j5027276
16952D3246537j0183605o358567m046138k674315j741336j152972p96284n64495
16944A5728825m08203k69441j04180J06493L19123M94762O05399O78917P86442
16935A7938137R53561J119120J300036J498793J879755K601100L833796N611236
16927C6735534Q028777J1196115J4123404J3062560N079157m684429j2515411
16920G1025707j6583462j4183739r559998o116980m074553k853345k077827j539461
16912A4036342j183948r54749q07256p06404o32110n26635m13332l05363k50765
16903H255780k32307k12066k20515k32526k47397k26401k02008j49471r4809n0381
$$ plain form
16959 53361179 68469627 83274963 90357559 87030715 75153667 58273813 43246537
16952 43246537 33062932 26704365 22658227 19983912 18242576 17089604 16293320 15728825
16944 15728825 15320622 15051181 14947001 15053494 15372617 15867379 16472778 17151695 17938137
16935 17938137 18891698 20010818 21310854 22809647 24689402 27290502 31124298 36735534
16927 36735534 44764311 55960426 70083830 83146390 88225547 83541118 71025707
16920 71025707 54442245 40258506 30698508 24581528 20506975 17653630 15575803 14036342
16912 14036342 12852394 11897645 11090389 10383985 9751875 9225240 8811908 8506545 8255780
16903 8255780 8023473 7811407 7590892 7358366 7110969 6884568 6682560 6533089 6438280 6387899
16893F387899p2703j86368k92954l45126l39997l41092l20652k85134k69387k45293
16883C689193k30944k33036k09958j90606j63663j47870j38505j27596j05804
16874B141211j20924j24776j25029j22265r7158q2231p6382p4966p1091n8832
16864A187557n5761o5732p1749o7016m3263n6870m1260l2735n5545k9967k7882
16853F39777m2974k8378k5260l6101l3443l8093l6957k5230k3420p831j5798l1269
16841B95023j5156o381j3844k4933m282K67m871j8588o655j989j9835J983N926
16828A86665o948n90j8997k0010j8266j2016q81q013j5810j2550J013J403p684
16815F7316n761j4689j2685l473m361p747J8717K883j0002l828J140j2666j766
$$ plain form
16893 6387899 6315196 6128828 5835874 5490748 5150751 4809659 4489007 4203873 3934486 3689193
16883 3689193 3458249 3225213 3015255 2824649 2660986 2513116 2374611 2247015 2141211
16874 2141211 2020287 1895511 1770482 1648217 1551059 1468828 1392446 1317480 1246389 1187557
16864 1187557 1131796 1066064 994315 927299 884036 827166 785906 753171 697626 667659 639777
16853 639777 596803 568425 543165 507064 473621 435528 398571 373341 349921 342090 326292 295023
16841 295023 279867 273486 259642 234709 230427 230694 225823 207235 200580 198591 178756 180739 186665
16828 186665 179717 179127 160130 140120 121854 109838 108957 100944 85134 72584 73597 75000 67316
16815 67316 61555 46866 34181 30708 26347 18600 37317 40200 30198 26370 27510 14844 13078
16802A3078J0694R832P664J6143K1084Q421K0627R089N89j0534j7784L865j886
16789I0882P1q680N12L723j461j6621j2903n954m320M087R652J515P628R803N534
16774H3468L552j1387j2188M926J0353q323J3612J3624p427n960n793N502O478
16761I0437J365p484j528m879k13J796j152K486N936N0j0360n436l851p245p606
16746E2316K769J1179J1868k563j1484p355o571O672m61l486O585r876M12l231
16732D6774q577j0946j0526j894J44R115J1279R723L582l125P841j1077j5800
16719B6513o937M374K864r314j5696J2682j212l366m410Q931j1497j581r2J889
16705C148J0305Q929Q071l690j1092j8089r120P598J5854J0930M873p504n421
$$ plain form
16802 13078 23772 33604 41268 57411 78495 86916 107543 116632 117221 106687 88903 92768 90882
16789 90882 90953 82273 82785 86508 85047 68426 55523 49569 45249 49336 58988 60503 68131 77934 83468
16774 83468 87020 75633 63445 68371 78724 70401 84013 97637 90210 84250 78457 83959 90437
16761 90437 91802 84318 82790 77911 77698 79494 78342 80828 86764 86814 76454 71018 67167 59922 52316
16746 52316 55085 66264 78132 75569 64085 56730 50159 56831 56370 52884 59469 49593 50005 46774
16732 46774 38197 27251 16725 14831 14975 24090 35369 45092 48674 45549 53390 42313 26513
16719 26513 19576 23950 26814 17500 1804 14486 13274 9908 5498 14429 2932 1351 1259 3148
16705 3148 13453 22382 30453 26763 15671 -2418 -11538 -3940 11914 22844 27717 20213 14792
16692A4792o328j8524j1990L150J3156K09N101N410r762j6009P357L992l122R821
16678b747J0826L292j666n9O022O033q816o195j1983N159O511q300m609K693M274
16663D35P086l040j596Q348m664j0317j6554J0336P272l306K109k081m322O366
16649c928j275l441k010J442M075M639N568N940P242r23M879q14J7147J7357O535
16634F2433p717K837m526j9577j2297j4778m395j4684j0577J4719J2599L27N511
16621I875J6026p81o933J0929P801j920P596n11J827Q185L676j7183j1333M615
16607C1869Q6m937N345K6480J6951l381J113P323n48q7o474j9111j1537k0264
16593B2828k206P330k724M519Q446K902J2032J606j2476N432J498N116l517q06
$$ plain form
16692 14792 8464 -10060 -22050 -18900 -5744 -5535 -434 4976 -4786 -20795 -13438 -9446 -12568 -2747
16678 -2747 8079 11371 9705 9646 15668 21701 12885 6690 -5293 -134 6377 -1923 -6532 -3839 435
16663 435 7521 4481 2885 11233 6569 -3748 -20302 -9966 -2694 -6000 -3891 -5972 -10294 -3928
16649 -3928 -5203 -8644 -10654 -9212 -5137 -498 5070 11010 18252 17329 22208 21394 38541 55898 62433
16634 62433 54716 57553 53027 33450 21153 6375 1980 -12704 -23281 -8562 4037 4364 9875
16621 9875 25901 25120 18187 29116 36917 34997 42593 42082 43909 52094 55770 38587 27254 31869
16607 31869 31955 27018 32363 58843 75794 72413 73526 80849 80301 80214 73740 54629 43092 22828
16593 22828 20622 27952 25228 29747 38193 41095 53127 54733 42257 47689 49187 54303 50786 49980
16579D9980l384r753K968N36j0963k0982q542J2187Q089p21R098K184m419n752
16565B0526n656P081P298j2313n398p141J1134P030L84j5015o178L220J4366Q724
16551B8062j4541o801J4021P740L978j7127q336Q683J2145K878o196j1053L824
16538A7277M917r95L367j3338p060J1344j2916J340P101N628P297j1257K569J3340
16524B8614Q381o065J856j324n391k166O89q272k840q01K298J7933J918K230o163
16509C0897l167q20m981K260J481N212p537j3118m969J031J1647k396j0311J0386
16495A5615J0410k721M134R270j3069j4753j549M911O522M966J840m167J258N297
16481B7964K136p840m37M813m668N509l187m934K184o382n654N403J2730J573
$$ plain form
16579 49980 46596 36843 39811 40347 29384 8402 -140 12047 20136 19415 28513 30697 26278 20526
16565 20526 14870 21951 29249 16936 11538 4397 15531 22561 22945 7930 1752 4972 19338 28062
16551 28062 13521 6720 20741 28481 32459 15332 6996 15679 27824 30702 24506 13453 17277
16538 17277 22194 21199 24566 11228 4168 15512 2596 3936 11037 16665 23962 12705 15274 28614
16524 28614 36995 30930 32786 31462 26071 23905 24594 16322 13482 12681 14979 32912 34830 37060 30897
16509 30897 27730 26910 21929 24189 25670 30882 23345 10227 5258 6289 17936 15540 5229 15615
16495 15615 26025 23304 27438 36708 23639 8886 7337 12248 18770 23736 25576 21409 22667 27964
16481 27964 30100 22260 21823 26636 21968 27477 24290 19356 21540 15158 9504 14907 27637 29210
16467B9210J778O516M643o997j5819J0094J0857N378P6p147j356k565P116J241
16453D3025R535j976J319R056l76K19K020N263r874p115J3275J0655L89L121J3061
16438I1597m84N259k350j535K354p682L304J3466K1638J5307J5161K1701L5356
16425B13092O0154O9685Q3629P2548J8628k7667o4082q5052p4211m1484l6028
16414A89212k9045j9928q115k4615l986N20k173l11Q166J2394M222k512p73J07
16400A23163K734N490J224J6003Q941J823J1356N3026M6976M2738O8930O6171
16388D48575L8786J2147l3601p6319p1312o7924m4094m4501l0651j0204N454J56
16376A26512j0970k882r530J419n541j6098N349N119K521o786n581N301k32j827
$$ plain form
16467 29210 30988 37504 42147 35150 19331 29425 40282 45660 45736 38589 37233 34668 41784 43025
16453 43025 52560 50584 51903 60959 60583 60802 62822 68085 58211 51096 64371 75026 75415 78536 91597
16438 91597 91113 96372 94022 92487 94841 87159 90463 103929 125567 140874 156035 177736 213092
16425 213092 273246 342931 426560 499108 517736 490069 425987 340935 266724 225240 189212
16414 189212 160167 140239 132124 107509 103523 104043 101870 101559 109725 122119 126341 123829 123056 123163
16400 123163 125897 131387 132611 148614 157555 159378 170734 223760 270736 313474 382404 448575
16388 448575 487361 499508 465907 389588 318276 250352 206258 161757 131106 120902 126356 126512
16376 126512 115542 112660 103130 104549 99008 82910 88259 93378 95899 89113 83532 88833 88601 86774
16362H6774N998j56K539m540j2545n647M518Q559l452M813L434Q386j3778o366
16348G8537n641m256M870q720r543P809J6424L2m709j3714j1320O192P441M517
16334F7919l949l911j0583m34P103j093J7380o19j8436l878J7099L771J417q486
16320F3300j3508O469j252O98L482Q57l482n841q441j3060o612n57K3284J4128
16306E9465m132o500q535L643J3209J2170O766k269j2131j1138R120P053l633
16293F3088O839K283Q9l921M079M780r29j4896q801k565N231J6587R253j1649
16279F9468K958j787p11N239m8r57j936p594K181l055J1866L408j0858j573L759
16264G0360k766L819j412k889Q85j4541n604R146M190M366n196K259N762j210
$$ plain form
16362 86774 92772 92616 95155 90615 78070 72423 76941 85500 82048 86861 90295 98681 84903 78537
16348 78537 72896 68640 73510 64790 55247 63056 79480 79512 74803 61089 49769 55961 63402 67919
16334 67919 63970 60059 49476 49042 56145 55052 72432 71813 53377 49499 66598 70369 71786 63300
16320 63300 49792 56261 55009 55707 59189 60046 56564 50723 42282 29222 22610 22053 45337 59465
16306 59465 55333 48833 40298 43941 57150 69320 76086 73817 61686 50548 59668 66721 63088
16293 63088 69927 72210 72299 68378 72457 77237 76308 61412 52611 50046 55277 71864 81117 69468
16279 69468 72426 70639 69928 75167 75119 74162 72226 64632 66813 63758 75624 79032 68174 66601 70360
16264 70360 67594 71413 70001 67112 67997 53456 47852 56998 61188 65554 60358 62617 68379 67169
16250F7169l557J404L362J1800o96l553J666q164j5615J033J910L683L092N025
16236F8559N186j7314q404J369J5623Q063O088j999n320P509R139k227m387o477
16222G5408j074j120q4J41M664J5159P803r717l827j1669j306j87j646J6608M597
16207I3750n180M962K980l156m159j1439p93J3393N888M461j752k60L562j3412
16193H8845k751m193N836J5367J2468k1342j2313n609N701N166l27l959Q086N431
16179I6406Q225q23j6443J684P022M660n080o729P290J4427k905K476O13p659
16165A03164p36L549p58O175Q566k2032j393K424j3255P351R679q044J8294J5166
16151A28150j0118n116O945j882L986j2941k514K692j774L800m517M755k43o480
$$ plain form
16250 67169 63612 65016 68378 80178 79482 75929 77595 69431 53816 54849 56759 60442 63534 68559
16236 68559 73745 56431 48027 49396 65019 73082 79170 77171 71851 79360 88499 86272 81885 75408
16222 75408 74334 73214 73130 73271 77935 93094 100897 91180 87353 75684 74378 74191 72545 89153 93750
16207 93750 88570 93532 96512 93356 89197 77758 76965 90358 96246 100707 98955 98695 102257 88845
16193 88845 86094 81901 87737 103104 115572 94230 81917 76308 82009 87175 86848 82889 90975 96406
16179 96406 104631 103808 87365 89049 96071 100731 95651 88922 96212 110639 107734 110210 110823 103164
16165 103164 102428 105977 105219 111394 119960 97928 96535 98959 85704 93055 102734 94690 112984 128150
16151 128150 118032 112916 119861 117979 121965 109024 106510 109202 107428 111228 106711 111466 111223 104743
16137A04743j662n575J2551Q506P698J1718q056n900j4975q483J3575P787R77
16124A22904j1410j2943L418J0873J773R192N29N080P598m970M290r455j0113
16111A16766m540O651J2016J2675o076o675P197N625j2984j4713n672J0500K5401
16098A46171P883j274o199l863J4010l335q103o20Q900o17o016j0108L621K055
16084A42505p792N102J3423K694J0338J1678o501p529L898K270j0431j5881o232
16071A37542J218J0623N211O385J686P348n702j0598l597P666L713j2437r590
16058A39468N913L565m401J2507L306L921k333o276m183R626O620K737N263j4008
16044A61725p252O912k981l526J3449J6000M447l02K927K72k611K40J340k540
$$ plain form
16137 104743 103081 97506 110057 118563 126261 137979 129923 124023 109048 100565 114140 121927 122904
16124 122904 111494 98551 101969 112842 114615 123807 124336 129416 137014 132044 136334 126879 116766
16111 116766 112226 118877 130893 143568 137492 130817 138014 143639 130655 115942 110270 120770 146171
16098 146171 154054 152780 146581 142718 156728 153393 145290 144670 153570 152953 146937 136829 140450 142505
16084 142505 134713 139815 153238 155932 166270 177948 171447 163918 167816 170086 159655 143774 137542
16071 137542 138760 149383 154594 160979 162665 170013 164311 153713 150116 157782 161495 149058 139468
16058 139468 145381 148946 144545 157052 160358 164279 161946 155670 151487 161113 167733 170470 175733 161725
16044 161725 154473 161385 158404 154878 168327 184327 188774 188472 191399 191671 189060 189300 190640 188100
16030A88100J997l76O609Q86l650N556o83M450j5408K042J1740k119j46j5320
16016A83678O418Q718Q573o648j9522P735o757j785l993j4107j351O503k970K2741
16002A87233J9525M410l465O384p33J20r077j5554q215k50M332K547j256K153
15988A88154N991J0871q27K627q60M331J6452l988n787O805q970o768j236l53
15974B06442J29J0148P170Q148o536l780Q007j410j3811j460P080J1164o62n383
15960B25246j580N952Q697R100q668j2588p284j109J3610O352p704N740L425o12
15946B38577J1666P651j800Q9l315n398m517r37j041N577P852j553r779n787K322
15931B39607O430J0595l732L737N748J7478J2532l897j6055Qj0787L283R153l174
$$ plain form
16030 188100 190097 189721 196330 197216 193566 199122 198439 202889 187481 189523 201263 199144 198998 183678
16016 183678 190096 198814 207387 200739 181217 188952 182195 180410 176417 162310 160959 167462 164492 187233
16002 187233 206758 211168 207703 214087 213354 213474 204397 188843 180628 180378 184710 187257 186001 188154
15988 188154 194145 205016 204189 206816 205956 210287 226739 222751 216964 223769 214799 208031 206795 206442
15974 206442 206571 216719 223889 232037 225501 221721 229728 228318 214507 213047 220127 231291 230629 225246
15960 225246 223666 229618 238315 247415 238747 226159 218875 217766 231376 237728 230024 235764 239189 238577
15946 238577 250243 257894 256094 256183 252868 247470 242953 242016 240975 246552 254404 252851 243072 237285 239607
15931 239607 246037 256632 252900 256637 262385 279863 292395 288498 272443 272451 261664 264947 274100 270926
15917B70926k153p55n620L093J85K678J0577N478P899L626p333o570J631p290
15903B76372j703O507Q997J0712k071J668N643N79j2126Q286J2552j1238j3254
15890B90924o314n879k643L288J1103J9807N493J4553j270j6017l086K522M714
15877C17195j639m529j2744L005l081q218J1088P186Q811P063j1941r221M064
15864C07039p986O769j967o641J3004K1402M173k837M478O714O290O973r995K074
15850C49490Q365k101L119m690r096J1603J3817k4091j1740J3190j3262p671P107
15837C34040J9030N248q289j3683m849N642P256Q885J3238P15o117r21N386j4133
15823C51448l729P299P129J598Q72n032P887l927j3047J9132N717N131M250J6031
$$ plain form
15917 270926 268773 268018 262398 265491 265676 268354 278931 284409 292308 295934 288601 282031 283662 276372
15903 276372 274669 281176 290173 300885 298814 300482 306125 306704 294578 302864 315416 304178 290924
15890 290924 284610 278731 276088 279376 290479 310286 315779 330332 329062 313045 309959 312481 317195
15877 317195 315556 311027 298283 301288 298207 289989 301077 308263 317074 324137 312196 302975 307039
15864 307039 299053 305822 303855 297214 310218 331620 335793 332956 337434 344148 350438 357411 347416 349490
15850 349490 357855 355754 358873 354183 345087 356690 370507 346416 334676 347866 334604 326933 334040
15837 334040 353070 358318 350029 336346 331497 337139 344395 353280 366518 367233 361116 360195 365581 351448
15823 351448 347719 355018 362147 363745 364617 359585 367472 363545 350498 369630 375347 380478 384728 400759
15809D00759J1170J933n850n1m780M065K0411R287r175j8875j2666O738P350K938
15795D13254k1018l346n78p001J830N546K810k643Q716J261n565N028J1069M100
15781D13463M069M518J5195M771j836R232l62j3598k924J1159L986l707k20L485
15767D47231k357j0004N470M039l101k751j793j283r538N231Q285M47J6494J3474
15753D69844n305q420o269O289k424m898J379O820J024J7257R88J0947K475J681
15739D91388j575K372j67M550j2841L211J6265L86n408Q200n584O742J2927P68
15725E21234j6554j4257k876m100Q827R997N411K754Q416n754O511l010j2816
15712E03783J31O274O329K0870J8093j4620j0824L785K648J2756l668j457j394
$$ plain form
15809 400759 411929 413862 408012 407961 403181 407246 427657 436944 427769 408894 396228 402966 410316 413254
15795 413254 392236 388890 388312 381311 383141 388687 391497 388854 397570 398831 393266 398294 409363 413463
15781 413463 417532 422050 437245 442016 440180 449412 449050 435452 432528 443687 447673 443966 443746 447231
15767 447231 444874 434870 440340 444379 441278 438527 436734 435451 425913 431144 439429 439876 456370 469844
15753 469844 464539 456119 449850 456139 453715 448817 450196 457016 458040 475297 476285 487232 489707 491388
15739 491388 489813 492185 492018 496568 483727 486938 503203 503589 498181 506381 500797 507539 520466 521234
15725 521234 504680 490423 487547 483447 492274 502271 507682 510436 518852 513098 519609 516599 503783
15712 503783 503914 510188 516517 537387 555480 540860 530036 533821 536469 549225 545557 544100 542706
15699E42706Q863J0783o779K034J7564K499J1116P354q626j3128n219J1534Q389
15686E89090n359R821j847q574j5784j5430R963L1631J2710N909L266q919J3328
15673F19805J3569j277K05J0093k438K429j064j331l225J149J583K614o99K851
15659F44264n657o80N447P546j4634J419P569k150J6373K2764J6097P207N09J365
15645G07439J3228j8541l119J3188J5516q73M802P788j995j229r132P767J5227
15632G50066J0696Q947Q028n351k365P659R235o183N029K032l062J0598N868p955
15618G93242j0659k584R752K1308J2782N03J4252K3302J2073r620r856J984O420
15605H62899J1092L613L687J3368R151k206K0797J890K120L615N749J4256J2524
$$ plain form
15699 542706 551569 562352 555573 557607 575171 577670 588786 596140 587514 574386 569167 580701 589090
15686 589090 583731 593552 591705 583131 567347 551917 561880 593511 606221 612130 615396 606477 619805
15673 619805 633374 632097 632302 642395 639957 642386 641322 639991 636766 637915 639498 642112 641413 644264
15659 644264 638607 637927 643374 650920 636286 637705 645274 643124 659497 682261 698358 705565 706074 707439
15645 707439 720667 702126 699007 712195 727711 726838 731640 739428 737433 736204 727072 734839 750066
15632 750066 760762 769709 777737 772386 770021 777680 786915 780732 785761 787793 784731 795329 801197 793242
15618 793242 782583 779999 789751 811059 823841 824344 838596 861898 873971 864351 854495 856479 862899
15605 862899 873991 877604 881291 894659 903810 901604 922401 924291 926411 930026 935775 950031 962555
15592I62555L551m062j5583J3370L0946j521o825J856J0982J2445L806K1961K0177
15579A053658J6377J856P597J8355P020Q346N264M104L690M804J4541K1335P748
15566A174695J2432K3812J6573J9031J1398J2571J5031J6064K5038L1853L7624
15555A396122K6217M6539M9956M4369M2726J8093m985j518P89j4819j7998j8260
15543A567231j6884k3431j9379q501j8161j58Q184M414j2978M62P910L858N996
15530A498563J5592J9492J0106R616J2016O597K2675l831j1880J8527J7136J4760
15518A629369J3420J4951J9025P109l79M604N679K2932L0093M882L667K1384J2122
15505A788858R772K558J1643J8715K1202K0822K3117R37P606J0526J2345J6504
$$ plain form
15592 962555 966106 962044 946461 959831 990777 989256 982431 984287 995269 1007714 1011520 1033481 1053658
15579 1053658 1070035 1071891 1079488 1097843 1104863 1113209 1118473 1122577 1126267 1131071 1145612 1166947 1174695
15566 1174695 1187127 1210939 1227512 1246543 1257941 1270512 1285543 1301607 1326645 1358498 1396122
15555 1396122 1422339 1468878 1518834 1563203 1605929 1624022 1619037 1617519 1618308 1603489 1585491 1567231
15543 1567231 1550347 1526916 1507537 1499036 1480875 1480717 1488901 1493315 1480337 1480799 1488709 1492567 1498563
15530 1498563 1514155 1533647 1543753 1553369 1565385 1571982 1594657 1590826 1578946 1597473 1614609 1629369
15518 1629369 1642789 1657740 1676765 1683874 1683495 1688099 1693778 1716710 1746803 1751685 1755352 1776736 1788858
15505 1788858 1798630 1801188 1812831 1831546 1852748 1873570 1896687 1897624 1905230 1915756 1928101 1944605
15493A944605L0671J0748P637K7330J7759K077k43K3112O760R556K2823M2171
15481B145006J6062K0215J9003K2446J3630J6603L019J7363J9330K917K7461M4504
15469B367559K9350K4085K2834R063K0490K6732L4144L4198K6727K1351J3109
15458B629642J9111L0127M1690K4936K4520L5266K4034K6283M7592M2937K7310
15447B973448K5112K8018J7272K5983L0959L1218L6363M6367L8788L1508L4202
15436C319238L4562L1687M0158L8878K6203K8930N7655N2625M5479M8082K3395
15425C746892N2966M8010M9572L9405M8879M7698L1850L9630L7618N0663N2599
15414D245782N1974N3921O3164O0133O3900N8273M5831P2568Q0856O5460N1780
$$ plain form
15493 1944605 1975276 1986024 1993661 2020991 2038750 2040827 2040584 2063696 2070456 2080012 2102835 2145006
15481 2145006 2161068 2181283 2200286 2222732 2236362 2252965 2255984 2273347 2292677 2295594 2323055 2367559
15469 2367559 2396909 2420994 2443828 2452891 2473381 2500113 2534257 2568455 2595182 2616533 2629642
15458 2629642 2648753 2678880 2720570 2745506 2770026 2805292 2829326 2855609 2903201 2946138 2973448
15447 2973448 2998560 3026578 3043850 3069833 3100792 3132010 3168373 3214740 3253528 3285036 3319238
15436 3319238 3353800 3385487 3425645 3464523 3490726 3519656 3577311 3629936 3675415 3723497 3746892
15425 3746892 3799858 3847868 3897440 3936845 3985724 4033422 4065272 4104902 4142520 4193183 4245782
15414 4245782 4297756 4351677 4414841 4474974 4538874 4597147 4642978 4715546 4796402 4861862 4913642
15403D913642N4483N8744O3295O9962O6864O6830P4420P0153O7627Q2139P4310
15392E662469Q1586Q0045P5321P9546Q1498Q3604R4908P9254Q2607R5101R5107
15381F591046R3649R4086J12774J11926J01552J14178J06151R7764J12693J22323
15371G658142J22245J33028J14470J06028J38049J59886J36524J14233J21197
15362H803802J40005J50333J46353J48523J50676J48808J49063J68152J59736
15353A0165451J65045J79963J69360J79644J90354J81685J88392J97541J91319
15344A1808754J97444J97996K07917K16309K09404K23500K30293K29763K29915
15335A3751295K35175K26141K30541K48989K66325K63061K53401K60459K69618
$$ plain form
15403 4913642 4968125 5026869 5090164 5160126 5226990 5293820 5368240 5438393 5506020 5588159 5662469
15392 5662469 5744055 5824100 5899421 5978967 6060465 6144069 6238977 6318231 6400838 6495939 6591046
15381 6591046 6684695 6778781 6891555 7003481 7105033 7219211 7325362 7423126 7535819 7658142
15371 7658142 7780387 7913415 8027885 8133913 8271962 8431848 8568372 8682605 8803802
15362 8803802 8943807 9094140 9240493 9389016 9539692 9688500 9837563 10005715 10165451
15353 10165451 10330496 10510459 10679819 10859463 11049817 11231502 11419894 11617435 11808754
15344 11808754 12006198 12204194 12412111 12628420 12837824 13061324 13291617 13521380 13751295
15335 13751295 13986470 14212611 14443152 14692141 14958466 15221527 15474928 15735387 16005005
15326A6005005K72807K74522K75781K85101K81314K77413K90599L12991K98239
15317A8573772K93111L09813L14274L08178L19306L07185L14131L19090L04401
15308B1363261L06322L02984K98445L16356L09198L10558L05437K94136L01468
15299B4108165K92908K91990K90680K66332K66515K69033K61736K41275K26702
15290B6515336K18203K22507J96053J95433J89786J65438J52364J39521J36393
15281B8131034J12833Q9666R5548P4256O0658L4036J4537J4259q048k4590m5172
15270B8549017n7521o2135q0634r0107j01935j20150j49013j48787j57355j76812
15260B7404568j88338j88002k08361k22198k18462k34408k38937k62569k61348
$$ plain form
15326 16005005 16277812 16552334 16828115 17113216 17394530 17671943 17962542 18275533 18573772
15317 18573772 18866883 19176696 19490970 19799148 20118454 20425639 20739770 21058860 21363261
15308 21363261 21669583 21972567 22271012 22587368 22896566 23207124 23512561 23806697 24108165
15299 24108165 24401073 24693063 24983743 25250075 25516590 25785623 26047359 26288634 26515336
15290 26515336 26733539 26956046 27152099 27347532 27537318 27702756 27855120 27994641 28131034
15281 28131034 28243867 28333533 28429081 28503337 28563995 28598031 28612568 28626827 28618779 28594189 28549017
15270 28549017 28491496 28429361 28348727 28258620 28156685 28036535 27887522 27738735 27581380 27404568
15260 27404568 27216230 27028228 26819867 26597669 26379207 26144799 25905862 25643293 25381945
15251B5381945k51989k64549k86636k89245k83826k76707k78058k89749k78758
15242B2882428k93782l19175l06473k97114k90038k93923l09939l09237k97016
15233B0165731k91913l04578k91006k89574k92581k80548k81864k81467k70454
15224A7581746k87353k88509k74320k64277k69873k65598k59353k54977k45310
15215A5172176k40412k34930k33567k31754k32176k32116k42142k30096k15838
15206A3079145k18565k15214k00939j96964k16312k05594j91018j95736j98732
15197A1240071j85492j84752j87160j62424j65921j71559j59821j62816j56689
15188I703437j55330j63377j60791j48659j42488j45232j31406j25131j40624
$$ plain form
15251 25381945 25129956 24865407 24578771 24289526 24005700 23728993 23450935 23161186 22882428
15242 22882428 22588646 22269471 21962998 21665884 21375846 21081923 20771984 20462747 20165731
15233 20165731 19873818 19569240 19278234 18988660 18696079 18415531 18133667 17852200 17581746
15224 17581746 17294393 17005884 16731564 16467287 16197414 15931816 15672463 15417486 15172176
15215 15172176 14931764 14696834 14463267 14231513 13999337 13767221 13525079 13294983 13079145
15206 13079145 12860580 12645366 12444427 12247463 12031151 11825557 11634539 11438803 11240071
15197 11240071 11054579 10869827 10682667 10520243 10354322 10182763 10022942 9860126 9703437
15188 9703437 9548107 9384730 9223939 9075280 8932792 8787560 8656154 8531023 8390399
15179H390399j34573j36320j29714j29059j21960j17611j09832j10551j22008
15170G278771j19451j05311r7399j04410j05404r9885r3513r9330j03792r6330
15160F253946p7528r3397q0200q2787q4441p2701q4263r2787r1741p1885o6903
15149E355313o6152p5229o8993p3303p3895p0241n9066m7014o2321o1301o2877
15138D634921n4577o8827p1197o4580n3673m9573m0618n2633l3181m8634o5423
15127D032005n9157n2740m5085n3563m9975l3025m3304m3272m3029l9709l3809
15116C535337m0948l6585j9664l8259m8028n5887k4125k2062n9600m0463k8721
15105C120995m2199m3321l3762j7975j4962l9040k3483k1923k8821l7991l8745
$$ plain form
15179 8390399 8255826 8119506 7989792 7860733 7738773 7621162 7511330 7400779 7278771
15170 7278771 7159320 7054009 6956610 6852200 6746796 6646911 6553398 6454068 6350276 6253946
15160 6253946 6176418 6083021 6002821 5920034 5835593 5762892 5678629 5585842 5494101 5422216 5355313
15149 5355313 5289161 5213932 5144939 5071636 4997741 4927500 4868434 4821420 4759099 4697798 4634921
15138 4634921 4580344 4511517 4440320 4375740 4322067 4272494 4231876 4179243 4146062 4097428 4032005
15127 4032005 3972848 3920108 3875023 3821460 3771485 3738460 3695156 3651884 3608855 3569146 3535337
15116 3535337 3494389 3457804 3438140 3399881 3351853 3295966 3271841 3249779 3190179 3149716 3120995
15105 3120995 3078796 3035475 3001713 2983738 2968776 2929736 2906253 2884330 2855509 2817518 2778773
15094B778773k8133k4701l2475k4123k4741l3502m278k6955m1013k7932l1350
15083B479570l5895j9841j2716k1199l3977l2646k4172j8999r046k8112l1839
15072B211128k4734k2717j1656q803j4429l3967k9914n641k4081l0496l1073j4599
15060A959018j7421k1339j4402j1746o208n599j3730k4230j8442j6681q322q41
15048A800057n218l0190l7466q259j2533k909k279j6805r475j8308k7558j1402
15036A617655j8670o362o148q074l56j9948j5483j6199p060j2132j1749j0968
15024A484506r985j6564j1449r810J0149N012r328j0295o586m962l381p590j7631
15011A392086O620j4017J874J1308J4860J1105K6994K6844K6782J6875K1429J7325
$$ plain form
15094 2778773 2750640 2725939 2693464 2669341 2644600 2611098 2606820 2579865 2538852 2510920 2479570
15083 2479570 2443675 2423834 2411118 2389919 2355942 2323296 2299124 2280125 2271079 2242967 2211128
15072 2211128 2186394 2163677 2152021 2143218 2128789 2094822 2064908 2059267 2035186 2004690 1973617 1959018
15060 1959018 1941597 1920258 1905856 1894110 1887902 1882303 1868573 1844343 1825901 1809220 1800898 1800057
15048 1800057 1794839 1764649 1727183 1718924 1706391 1703482 1701203 1684398 1674923 1656615 1629057 1617655
15036 1617655 1598985 1592623 1586475 1578401 1578045 1558097 1542614 1526415 1519355 1507223 1495474 1484506
15024 1484506 1474521 1457957 1446508 1436698 1446847 1451859 1442531 1432236 1425650 1420688 1417307 1409717 1392086
15011 1392086 1398706 1384689 1386563 1397871 1412731 1423836 1450830 1477674 1504456 1521331 1542760 1560085
14999A560085j773j2280l2002m7785l4356m2858n0518n0914n0239k7253j7926
14988A192181k2192j6535Q87j0962j2754K267M292p862j4792k8285q595j6872
14976A060778j0962k021O120q184j5293j2969j3955J731j720r629r155j7227j9295
14963I48219L572q011j473J419j0014k0396k252j296j4083n846p79L829N281j5336
14949H82834j7609j1527J529L393l331j5688j7583r041j4448j66M73R544k706
14936H05674m934r652l464L187k861j3876j3524l289o920o434k5666n421Q723
14923G21543kN735p76M13o570p048r208p161j152O164j1802j2963r209K20R03
14908F69087o343p397L841l662k3589j2003K261N448l508o882r76n519j1887K776
$$ plain form
14999 1560085 1558312 1546032 1514030 1466245 1431889 1389031 1338513 1287599 1237360 1210107 1192181
14988 1192181 1169989 1153454 1154341 1143379 1130625 1132892 1137184 1129322 1114530 1086245 1077650 1060778
14976 1060778 1049816 1047795 1053915 1045731 1030438 1017469 1003514 1005245 1003525 993896 984741 967514 948219
14963 948219 951791 943780 942307 943726 933712 913316 911064 909768 895685 889839 889060 892889 898170 882834
14949 882834 865225 853698 855227 858620 855289 839601 822018 812977 798529 798363 798836 808380 805674
14936 805674 800740 791088 787624 790811 787950 774074 760550 757261 750341 743907 718241 712820 721543
14923 721543 721541 727276 726500 726913 720343 713295 704087 696926 695774 701938 690136 677173 667964 668184 669087
14908 669087 662744 655347 659188 655526 631937 619934 622195 627643 624135 617253 616277 610758 598871 601647
14894F01647O764q16j5126q315j0925j003o294j3949J4399M185P38L166P07q010
14880E67168j0119j1372m131M899k204l1750m148J5166M527p166l271l891p334
14867E06374P65J2478k716j7474l453j543n594m570O770j0041q21q187q968R038
14853D72058r8j3196j4065J853N166j5190j0647l772J3069P877j1287L178L06
14840D35252J149j367N30j752K618L484k59j0758j1356K46K1591J641o559j4529
14826D19931r903N716J571j1716r089n912L449J2467r992j1456L391M668p423
14813C85702m471O27K743o680p845l006q571J5696K0160j2417q506j3378j5491
14800C44563N417R049J2146j073j907N893J222j964j1442p721n373j0833j638
$$ plain form
14894 601647 608411 607595 592469 584154 573229 572226 565932 551983 566382 570567 571305 574471 575178 567168
14880 567168 557049 545677 541546 546445 544241 512491 508343 523509 528036 520870 517599 513708 506374
14867 506374 507139 519617 516901 499427 495974 494431 488837 484267 491037 480996 480175 471988 463020 472058
14853 472058 471960 458764 444699 446552 451718 436528 425881 422109 435178 443055 431768 434946 435252
14840 435252 436401 435034 435564 433812 436430 439914 439655 428897 417541 417787 439378 441019 434460 419931
14826 419931 410028 415744 417315 405599 396510 390598 394047 406514 396522 385066 388457 393125 385702
14813 385702 381231 381858 384601 377921 370076 367070 358499 374195 394355 381938 373432 360054 344563
14800 344563 349980 359029 371175 370102 368195 374088 375310 373346 361904 354183 348810 337977 336339
14787C36339O649j552L651P799P893r950j0133j0570k897j266j5470m449J2005
14774C18049p301m690J1304K808q50m422M102r4r937J024j5075J1854Q894n872
14760C09794j2888L820K030q240K299J0961j2666k598K72j3061q464r706J538
14747B63091Q10L866k669n683Q683j1483O382Q388m833J2543Q804j2188j3232
14734B62479j1389P127Q219j1888m034M31L413J596q51j2324j0001k611L60p940
14720B22587L193m224l062J7099M421j3045n081R738J1637K164p139Q201r162
14707B37327j3415m422k633p65o844J1413K582k30j1820l891O751o887L77M248
14693B11791j2467p210J1018J5046m405j5531k367p933P440J6540J4652j227k741
$$ plain form
14787 336339 342988 341436 345087 352886 360779 350829 340696 330126 327229 325963 310493 306044 318049
14774 318049 310748 306058 317362 320170 319320 314898 319000 318906 308969 309993 294918 306772 315666 309794
14760 309794 296906 300726 302756 294516 296815 307776 295110 292512 292784 279723 271259 261553 263091
14747 263091 263901 267767 265098 259415 268098 256615 262997 271385 266552 279095 287899 275711 262479
14734 262479 251090 258217 266436 254548 250514 250945 254358 255954 255103 242779 232778 230167 230527 222587
14720 222587 225780 221556 218494 235593 240014 226969 221888 231626 243263 245427 238288 246489 237327
14707 237327 223912 219490 216857 216092 209248 220661 223243 223013 211193 207302 214053 207166 207543 211791
14693 211791 199324 192114 203132 218178 213773 198242 195875 187942 195382 211922 226574 225347 222606
14680B22606j4640j964K845m867j211N252N274p686j1707k534M598N709j2249
14667A89426m135L981k477n070n264O055L806q394j6055R760J0038O308Q047R996
14653B06022n145K277l330r251l126N119j3115q533m14L380R756m153p880j5650
14639A55957K3J115L298L856Q197M525m362q363M722J682k596j9142J3078J4584
14625A76574j2360m80p082J1966O285q091k157j2771o971J5224K971p466j2377
14612A43265m304J2572K0663n228j0162j2579j753P985L059M481J4118q969j5970
14599A47178n748k520k481m103R218n677K082J4825l612n298n674l286l304j0116
14585A21484m510J1882P059j0615o396N819k933J458o290L568N10M700n56l447
$$ plain form
14680 222606 207966 206002 208847 203980 202769 208021 213295 205609 193902 191368 195966 201675 189426
14667 189426 185291 189272 186795 181725 176461 182516 186322 177928 161873 171633 181671 187979 196026 206022
14653 206022 200877 203154 199824 190573 187447 192566 179451 170918 170504 173884 183640 179487 171607 155957
14639 155957 155980 157095 160393 164249 172446 176971 172609 164246 168968 170650 168054 148912 161990 176574
14625 176574 164214 163734 156652 168618 174903 166812 164655 151884 144913 160137 163108 155642 143265
14612 143265 138961 151533 172196 166968 156806 144227 142474 150459 153518 157999 172117 163148 147178
14599 147178 141430 138910 136429 132326 141544 135867 137949 152774 149162 143864 138190 134904 131600 121484
14585 121484 116974 128856 135915 125300 118904 124723 121790 123248 116958 120526 121036 125736 125180 121733
14571A21733k429N938N585j780o213M23k116l343n895L032M202q163o643n207
14557I9124J822J2812q380L981j639l592L068R71K291J196P256N030q126Q414
14543A24228P439L6q061p944J743q950L477k424l149K658k036m727o680l413K550
14528I4747M172Q184K593j0273O945K078J926J4118J192M860j901K466j8371r410
14514A03326o37J4616P215n402o210N596m658n010l822o106j509j344j0338O152
14500I1869J4026j867r132j0465j0587J4955J795p902j527Q326m003n053j2204
14487F8231p2J4460J6488l392K468M557q315N24r83l722M164l365l603r832o721
14472G0887R70J553J1488M316J1436J2557p933p715n051q421o455L88K612m233
$$ plain form
14571 121733 119304 125242 130827 129047 122834 123257 121141 117798 111903 114935 119137 110974 104331 99124
14557 99124 100946 113758 105378 109359 107720 104128 107196 108167 110458 111654 118910 123940 115814 124228
14543 124228 131667 131703 123642 115698 117441 108491 111968 109544 106395 109053 107017 102290 95610 92197 94747
14528 94747 98919 107103 109696 99423 106368 108446 110372 124490 125682 130542 128641 131107 112736 103326
14514 103326 102689 117305 124520 119118 112908 118504 113846 108836 105014 98908 97399 96055 85717 91869
14500 91869 105895 104028 94896 84431 73844 88799 90594 82692 81165 89491 85488 80435 68231
14487 68231 68159 82619 99107 95715 98183 102740 94425 94949 93966 90244 94408 91043 87440 77608 70887
14472 70887 71857 73410 84898 89214 100650 113207 105274 97559 92508 84087 77632 78020 80632 76399
14458G6399o191j1203r242N949J4109k813m682N926J1654L301L269o717O402J535
14444H7696j7231J37L288M451l51l7O269J678l02q049o947k208n587j772J6473
14429G7508L827M450j26k339J016j676j5022J544J2104P374j5003k479l378j714
14415F6086M966N557p46M080J775l375j1809j1745n354q048j191J4720k512o046
14401D6358l232p74J6002J0594P808j7338m346L186P11j0925N272K510L73P983
14387F4182J1322p899k063l470j1105OL980J6307l974j0730j2383J2177J5191
14374G1541O617J282q080m706p235Q185j1292j0282L564j941L207r979J161m558
14360C7484j3436k92J0155J6246P939n761j5916l34L859l342R67R138K500N121
$$ plain form
14458 76399 70208 59005 49763 55712 69821 67008 62326 68252 79906 83207 86476 79759 86161 87696
14444 87696 70465 70602 73890 78341 77990 77953 84222 85900 85598 77549 70602 68394 62807 61035 77508
14429 77508 81335 85785 85659 83320 84336 82660 67638 69182 81286 88660 73657 71178 67800 66086
14415 66086 71052 76609 75863 79943 81718 78343 66534 54789 49435 41387 40196 54916 52404 46358
14401 46358 43126 42352 58354 68948 76756 59418 55072 58258 58969 48044 53316 55826 56199 64182
14387 64182 75504 67605 65542 62072 50967 50973 54953 71260 67286 56556 44173 56350 71541
14374 71541 78158 79440 71360 66654 59419 67604 56312 46030 49594 47653 50860 40881 42042 37484
14360 37484 24048 23756 33911 50157 58096 52335 36419 36085 39944 36602 37569 46707 49207 54328
14346E4328m189J634N8r410k396M774m631k435J041J9597K2477L953j4953o511
14332F3337j44n129j295p340N057J179j782l130J838K520K433o968k891J43k21
14317D7607r206j946K1269Q80J180n394r592J0780J1837R68q8k050P912q662p863
14302E7632r75q682j4826l602R961N544J670j2387P608p872l762J5801M546j495
14288D9161j341r017n843n479L770J665j868m32M135q29P186J1644n924o899L991
14273D3920q40j763l285q227n50J3316O006l663L024q42l10k1202n429j669J609
14258B0095o467R096O522O910J101J0886n652K556M067j3331j8105L751K797r975
14244A4251p003N926J5904J496j864m252L448J724M366j834n037L501M793r970
$$ plain form
14346 54328 50139 51773 51831 42421 40025 44799 40168 37733 38774 58371 80848 84801 69848 63337
14332 63337 63193 58064 56769 49429 54486 55665 53883 50753 52591 55111 57544 50576 47685 47828 47607
14317 47607 38401 36455 57724 58604 59784 54390 44798 55578 67415 68383 68295 66245 74157 65495 57632
14302 57632 56657 47975 33149 29547 39508 45052 46722 34335 41943 34071 30309 46110 50656 49161
14288 49161 47820 38803 32960 27481 31251 32916 31048 30616 34751 33922 41108 52752 46828 39929 43920
14273 43920 43080 41317 38032 29805 29255 42571 48577 44914 47938 47096 46786 25584 20155 18486 20095
14258 20095 13628 22724 29246 36156 37257 48143 42491 45047 49114 35783 17678 21429 24226 14251
14244 14251 7248 13174 29078 30574 28710 24458 27906 29630 33996 32162 27125 30626 35419 25449
14230B5449j6950Q088Q540K019R517l341M969J239n464K461O90j780q446L053
14216C0044Q561Q288L16j5346K187L629M273j9105j5847K516Q271K599Q219m55
14202B8150J3728j327l301j3345l566o47J571k838L140M196o99R941J0607J2607
14188E8217O647q695k033m199q416j027k549J049k540j7668l023o898m961L854
14174G758r64J8291J0743M734j4325n443J438O953J2441J1960n499r771l068p698
14160B7550j36n869J1904P553M857r627j1747J934p050j0912Q360J2539r62m756
14146B3638N550j937j1649J27Q036M720L314j5126P169J414k67p715j2841o527
14132b094O59L209Q550m676N33M860q651m685M150l83p571j2449J8703J9429P627
$$ plain form
14230 25449 8499 16587 25127 27146 36663 33322 38291 39530 34066 36527 37217 35437 26991 30044
14216 30044 38605 46893 47209 31863 34050 37679 41952 22847 7000 9516 17787 20386 28605 28150
14202 28150 41878 40551 37250 23905 20339 19692 21263 18425 21565 25761 25062 35003 45610 58217
14188 58217 64864 56169 54136 49937 41521 40494 37945 38994 36454 18786 15763 8865 3904 7758
14174 7758 6794 25085 35828 40562 26237 20794 22232 29185 41626 53586 48087 38316 35248 27550
14160 27550 27414 21545 33449 41002 45859 36232 24485 26419 19369 8457 16817 29356 28394 23638
14146 23638 29188 27251 15602 15729 23765 28485 31799 16673 23842 25256 24989 17274 4433 -2094
14132 -2094 -1435 1774 10324 5648 6181 11041 2390 -2295 1855 1472 -6099 -18548 155 19584 27211
14117B7211l825O321l267j0576K059N66o225n026m563N955J4654P060j0564r16
14103A8864J335j2655j0369k735J0483R604Q52Q71R577n521l224q394r787R772
14089H673K991k393j09K0666j4350j1801m041R497J2983r10j4577J02N134j820
14075A0045R208r434M29N682N19n01K600K765p129P768N979r66j4747r534O112
14060H796j1284J2354R50N727Q781l905o086j0413K088q06J015M797l055j1673
14046b714M417j351L523O226l212k288k109M943j756R297l159o321R307M83l939
14031A1347r579o424J0159K804j4085j4250l055J9386J0164Q638O59O756J659
14018B4179M976j0919l713j572k951j1061n728j4332K0589J9843m184p471j996
$$ plain form
14117 27211 23386 29707 26440 15864 17923 18489 12264 7238 2675 8630 23284 30344 19780 18864
14103 18864 20199 7544 -2825 -5560 4923 14527 15379 16250 25827 20306 17082 8688 -1099 8673
14089 8673 11664 9271 9162 29828 15478 3677 -364 9133 22116 21206 6629 6731 11865 10045
14075 10045 19253 9819 10248 15930 16449 15948 18548 21313 14184 21952 27931 26965 12218 2684 8796
14060 8796 -2488 9866 10816 16543 25324 21419 15333 4920 7008 6202 7217 12014 8959 -2714
14046 -2714 1703 352 3875 10101 6889 4601 2492 7435 5679 14976 11817 5496 14803 15286 11347
14031 11347 1768 -4656 5503 8307 -5778 -20028 -23083 -3697 6467 15105 15764 22520 24179
14018 24179 29155 18236 14523 12951 10000 -1061 -6789 -21121 -532 19311 15127 7656 5660
14005E660p209M223J2027m034J678J347L383q13j577j711k191k166l379J1625
13991A6863K540k12q84q231k561J828J0286j61L951P246j7723j5212J2074l156
13977F648o078J2034k049n221p325l624j027L940Q009m229p882J1311n742o420
13963g655L537R641J488M720L099J056n121j4469k505j0186K491P806J3106J0040
13949A7048k505k145J0561J862j0675r422P129O943j3386r49l566J1266O935L148
13935B2244K271p410j6840j4533n290L616P423N63R716J9521Q659l456j2160p998
13921F326j5551m166J3646O269M081N511O139j4480m530J7670M953L108j871P32
13907B7837j8413k159n99p194R16r189L794N180m430N194k646p201K198P97p108
$$ plain form
14005 5660 -1549 2674 14701 10667 12345 13692 17075 16262 14685 12974 10783 8617 5238 16863
13991 16863 19403 19191 18307 10076 7515 9343 19629 19468 23419 30665 12942 -2270 9804 6648
13977 6648 570 12604 10555 5334 -1991 -5615 -6642 -2702 5307 1078 -6804 4507 -1235 -7655
13963 -7655 -4118 5523 7011 11731 14830 15886 10765 -3704 -6209 -16395 -13904 -6098 7008 17048
13949 17048 14543 12398 22959 24821 14146 4724 11853 18796 5410 4461 895 12161 19096 22244
13935 22244 24515 17105 265 -14268 -19558 -15942 -8519 -7956 1760 21281 29940 26484 14324 6326
13921 6326 -9225 -13391 255 6524 10605 16116 22255 7775 3245 20915 25868 28976 27105 27837
13907 27837 9424 7265 6666 -528 388 -8801 -5007 173 -4257 937 -1709 -8910 -6712 -5915 -13023
13892a3023m189O362p460j7944R59R545L738j180N292J2076K0187J892K695j5955
13878B995j8075K225J0945R858k150M24n864l153J4071o17K005m961m313N113
13864H503R752m234l845j2293o010K384J362J2915M587L838p95M180N619o372
13850A9591K998Q020J1125j6226k5456m812J0993J6289M537j5959j5208q94R534
13837D532P72j3O10q627j433r00N020J823M047r803l973K0528Q589m409n412n765
13821E586j3512r760N846J3410j355p69M51N538l52K274K318L006l621l982j941
13806C137K475k320l998k232J7426n090p183J9303M772j766k918j6213p261M298
13792B430N251J1737j23o048M961O694n390j2611r050q299P308M270j1449j36
$$ plain form
13892 -13023 -17212 -10850 -18310 -36254 -35295 -25750 -22012 -23192 -17900 -5824 14363 16255 18950 2995
13878 2995 -15080 -12855 -1910 7948 5798 6222 358 -2795 11276 10659 12664 7703 3390 8503
13864 8503 18255 14021 10176 -2117 -8127 -5743 -4381 8534 13121 16959 16164 20344 25963 19591
13850 19591 22589 30609 41734 25508 52 -4760 6233 22522 27059 11100 -4108 -5002 4532
13837 4532 5304 5291 5901 -2726 -4159 -5059 -39 1784 5831 -3972 -7945 12583 21172 16763 11351 5586
13821 5586 -7926 -17686 -11840 1570 215 -554 -103 5435 5083 7357 9675 12681 9060 5078 3137
13806 3137 5612 3292 -706 -2938 14488 9398 2215 21518 26290 24524 21606 5393 -1868 2430
13792 2430 7681 19418 19295 13247 18208 24902 19512 6901 -2149 -10448 -3140 1130 -10319 -10455
13778a0455J2374m203K465p274K904J058M03M828Q910n111L354M887R187j1014
13764A2313r984N474J149j6710P48J1500o078j4894r108J9461J0189Q914j7156
13751d182r971m78R887j70m348K783J5462N472j3112j6633Q942J4245L648O690
13737A8235J4326j077j9841q138J3908L159k104j4714p76n009m150M543J0935
13724I297J711n779K335j0088n945N225J9775J2202k5888j2452R746N58O406l407
13710C696p532N7R12j2916j4273J5694J3857K78q690L317l81L680m329m416O292
13695d754J1845j2247k55m495P532l671k582J330j1175r434J829k250P40P339
13681b0248o056K291N423J62J3761p458p077Q110L848K52p997N030J0954P380
$$ plain form
13778 -10455 1919 -2284 181 -7093 -4189 -3131 -2728 2100 11010 5899 9253 14140 23327 12313
13764 12313 2329 7803 8952 -7758 -7010 4490 -1588 -16482 -25590 -6129 4060 12974 -4182
13751 -4182 -14153 -14631 -4744 -4914 -9262 -6479 8983 14455 1343 -15290 -6348 7897 11545 18235
13737 18235 32561 31484 11643 3505 17413 20572 18468 3754 2978 -2031 -6181 -1638 9297
13724 9297 11008 5229 7564 -2524 -8469 -3244 16531 28733 2845 -9607 139 697 7103 3696
13710 3696 -3836 -3779 -2867 -15783 -30056 -14362 -505 -227 -8917 -5600 -5981 -2301 -6630 -11046 -4754
13695 -4754 7091 -5156 -5411 -9906 -2374 -6045 -8627 -7297 -18472 -27906 -26077 -28327 -27587 -20248
13681 -20248 -26304 -24013 -18590 -18428 -4667 -12125 -19202 -11092 -7244 -6992 -14989 -9959 995 8375
13667H375J795j1326o466J95K070l495N936m230j002M880J4509q226j1979j578
13653a0542p095M325J2082J011K490N326m070p833p594r71q283O568j555K022
13639a4119J1298Q352J0217P118j034p653j4836r897j001J1726P138p404l899
13626c994m536N307j370k657n670J288L267l728j0483K492R425O717M910k950
13612a982J0090n294j3754l457j2051J9949J301q61j977M204L854n653l248m477
13598a3356J007J2407j744P792K64j2785m814P623N502l242j792j2327j418k834
13584a9717J4036o70j104m110l224l138J4413Q143n567l733m744K201j9202p485
13570c3901J3412m917m813J6680L237k101p309K48N64J2582J0828j1363L471O720
$$ plain form
13667 8375 10170 -1156 -7622 -7427 -5357 -8852 -2916 -7146 -8148 -3268 11241 3015 -8964 -10542
13653 -10542 -17637 -13312 -1230 -219 2271 7597 3527 -4306 -11900 -12871 -21154 -14586 -16141 -14119
13639 -14119 -2821 5531 15748 22866 21832 14179 -657 -10554 -11555 171 7309 -95 -3994
13626 -3994 -8530 -3223 -4593 -7250 -12920 -11632 -8365 -12093 -22576 -20084 -10659 -3942 968 -1982
13612 -1982 8108 2814 -10940 -14397 -26448 -6499 -5198 -6059 -8036 -3832 22 -5631 -8879 -13356
13598 -13356 -12349 58 -1686 6106 6370 -6415 -11229 -3606 1896 -1346 -3138 -15465 -16883 -19717
13584 -19717 -5681 -6351 -7455 -11565 -14789 -17927 -3514 4629 -938 -4671 -9415 -7214 -26416 -33901
13570 -33901 -20489 -25406 -30219 -13539 -10302 -12403 -19712 -19464 -18900 -6318 4510 -6853 -3382 3338
13556C338p072J301j610K586k160N113j988J252n280n927j3985L353j476j3581
13542c6136N773M625J803K0450J6609O368n305m007q15l558J583j318m68o538
13528i34p162K61O600M76P776o165k0709M619J0225K321j4393p444J7968P924
13514A363J809n637q91j5130p125J7126j843m687J812Q603o872O85J0977j1672
13500a1482k833Q418J3771q008j0775m0J0161Q403j3240m176p860L457J4054J6723
13486A6573o221m854m872j309M54l075K597n087r17j113j3511N995J3398r393
13472a1335n912J1363o970M554M562P283j1898j567L734K068R602N406n334j1304
13458e748r392M125O116k529o04L508J00r55O675K566j3636k774J468M023P935
$$ plain form
13556 3338 -3734 -2433 -4043 -1457 -3617 1496 -492 760 -4520 -10447 -24432 -21079 -22555 -36136
13542 -36136 -30363 -25738 -23935 -3485 13124 19492 14187 10180 9365 5807 7390 6072 5604 -934
13528 -934 -8096 -7835 -1235 -759 7017 852 -19857 -15238 -5013 -2692 -17085 -24529 -6561 1363
13514 1363 3172 -2465 -3356 -18486 -25611 -8485 -10328 -15015 -13203 -4600 -11472 -10787 190 -11482
13500 -11482 -14315 -5897 7874 -134 -10909 -10949 -788 7615 -5625 -9801 -17661 -14204 -150 16573
13486 16573 10352 5498 626 -683 -229 -3304 -707 -5794 -6711 -7824 -21335 -15340 -1942 -11335
13472 -11335 -17247 -5884 -12854 -8300 -3738 3545 -8353 -9920 -6186 -4118 5484 10890 5556 -5748
13458 -5748 -15140 -11015 -4899 -7428 -8032 -4524 -4424 -5379 1296 3862 -9774 -12548 -11080 -7057 878
13443H78j5944Q91J6258m322j0665J0194n295n482J7167k064j5066K876K394K907
13429e273j0311j0979L206P017o496M311L414J2538j0936j8281O93N025n976K543
13415b9505J3319K317J5553n340r265m226r162O015R412r0m767J2958P776j2762
13401g767o714p564K0O055m89L745K146J2483R698K164N975o143j218p260K859
13386G990q755n695J605j0375j391O613Q463n717k4086l190K274M579P122P300
13372a3263N399r254J795O750j2196L780J5250J0017L065J721L6p140j1754K018
13358c776M353r59r629n423O457Q256p236m077J993l726J1258J0439N28j955k386
13343D117L746k01q425j7177J0186K766J1664m072k0554m638P762J1785o84m296
$$ plain form
13443 878 -15066 -14175 2083 -2239 -12904 -2710 -8005 -13487 3680 1616 -13450 -10574 -8180 -5273
13429 -5273 -15584 -26563 -23357 -16340 -22836 -18525 -15111 -2573 -13509 -31790 -31097 -26072 -32048 -29505
13415 -29505 -16186 -13869 1684 -3656 -12921 -17147 -26309 -20294 -10882 -10972 -15739 -2781 4995 -7767
13401 -7767 -14481 -22045 -22025 -15970 -16459 -12714 -10568 1915 11613 13777 19752 13609 12391 5131 7990
13386 7990 -765 -6460 -4855 -15230 -16621 -10008 -1545 -7262 -31348 -34538 -32264 -27685 -20563 -13263
13372 -13263 -7864 -17118 -15323 -8573 -20769 -16989 -1739 8278 11343 13064 13100 5960 -5794 -3776
13358 -3776 577 -382 -10011 -15434 -8977 -721 -7957 -12034 -10041 -13767 -2509 7930 8458 6503 4117
13343 4117 7863 7662 -763 -17940 -7754 -4988 6676 2604 -17950 -22588 -14826 -3041 -3725 -8021
13329h021K99N526J4311j1686j4387p51k919J598P883j4619J6306P160l220J1598
13315I078j004j0692j5076M67N917J0341Q210P895j5896p22J1981j2803r449q300
13301b0053M96J1021J7341K536m444M179k824n525k955m773j275q17N427k932
13287d598L415Q143M510n240P745J1321j2314k0305j430P600j0232k748O293k864
13273a0704J34l283n012j455M506J8401N834J95p027N98P442j966n372j5227j2338
13258b5274Q97N020k912P87J7804J7584k424n262k454j0421M549J952O709k100
13244D455O514o09o623Q156J89j8783m429m069m781N288M153J8144P267O017n905
13229A4984Q504q513M685O80r690M697K223Q00J035j2629r518j5971o107l10K6423
$$ plain form
13329 -8021 -7722 -2196 12115 429 -13958 -14709 -17628 -16030 -8147 -22766 -6460 700 -2520 9078
13315 9078 8074 -2618 -17694 -17227 -11310 -969 7241 15136 -760 -1482 10499 -2304 -11753 -20053
13301 -20053 -19557 -8536 8805 11341 6897 11076 8252 2727 -228 -5001 -6276 -7093 -1666 -4598
13287 -4598 -1183 6960 11470 6230 13975 25296 12982 -7323 -8753 -1153 -11385 -14133 -7840 -10704
13273 -10704 -10570 -13853 -18865 -20320 -15814 2587 8421 8616 1589 2187 9629 7663 2291 -12936 -25274
13258 -25274 -24377 -19357 -22269 -21482 -3678 13906 11482 6220 3766 -6655 -2106 -154 6555 4455
13244 4455 10969 10360 3737 11893 12082 -6701 -11130 -15199 -19980 -14692 -10539 7605 14872 20889 14984
13229 14984 23488 14975 19660 20340 10650 15347 17570 18370 19405 6776 -2742 -18713 -24820 -25130 1293
13214A293n79m047O459Q228o449j920K977R391j850M87L817j5067j2828M443M475
13199a170J157O306J0656j073r036P269p85R696O492j6691j8627L111n28q43o213
13184a0279M162L578J1468Q204J362m539O393p065k536r545l433M598l414L220
13170B174Q559P442L818R632L113q962R846J7573p969j1100p914m793J7712J5856
13156E4987J0793m673k226L729j1521K2215J2412o646O89k264J5229K1336q571
13143A05489j1877M611J9551Q91J7556J1386J1699J7342K8150J3292o213K1638
13131B33515L6580K1942K5740L2157M5950M4498O4801M8555N7561J06462J23956
13120H41717J54797K35147L35008M74517N14950K83658n9649l50416n58523n07833
$$ plain form
13214 1293 714 -3333 3126 11354 4905 2985 5962 15353 13503 13990 17807 2740 -10088 -5645 -1170
13199 -1170 -13 6293 16949 15876 6840 14109 13324 23020 29512 12821 -5806 -2695 -3223 -4066 -10279
13184 -10279 -6117 -2539 8929 17133 18495 13956 20349 13284 10748 1203 -2230 2368 -1046 2174
13170 2174 10733 18175 21993 31625 34738 25776 35622 53195 45226 34126 26212 21419 39131 54987
13156 54987 65780 61107 58881 62610 51089 73304 85716 79070 79759 77495 92724 114060 105489
13143 105489 93612 98223 117774 118665 136221 147607 159306 176648 204798 218090 211877 233515
13131 233515 270095 292037 317777 349934 395884 440382 505183 553738 611299 717761 841717
13120 841717 996514 1231661 1566669 2041186 2556136 2839794 2780145 2429729 1871206 1363373
13110A363373l42368k18169j45871j02015p0573n4990n3225k1726m53r850k7034
13099C17099k0520k6636k903m076J99r812k4177k4768J569J91j245p367r176q15
13085A87563r545j945j663q052p698m053R563p408j3301r738j4114j1603j073
13072A06933l869P965j1733r649o956P162j015p820k9902p766q01M534P548m949
13058D9682J375L203p31k048r184P371N067k468k780m100N466O72K588K96M268
13043E8677j6379k2220q90J0092J4439O377j685Q777o557J035l313j1798m080
13030C2475m992J219j5827j0220p006L315M988M222Q696o062l430p304j309j285
13016b520p256O70p424n032R240j073l386j7404L428J4306Q489j188O115J5021
$$ plain form
13110 1363373 1021005 802836 656965 554950 484377 429387 376162 354436 353983 344133 317099
13099 317099 296579 269943 267040 262964 263163 253351 229174 204406 205975 206166 204921 197554 188378 187563
13085 187563 178018 176073 174410 166358 158660 154607 164170 156762 143461 133723 119609 108006 106933
13072 106933 103064 111029 99296 89647 82691 89853 88838 81018 51116 43350 42549 47083 54631 49682
13058 49682 51057 54260 53529 51481 42297 49668 54735 52267 49487 45387 50853 51525 54113 54409 58677
13043 58677 42298 20078 19188 29280 43719 50096 48411 57188 50631 51666 48353 36555 32475
13030 32475 27483 28702 12875 2655 -4351 -1036 3952 8174 16870 10808 7378 74 -1235 -2520
13016 -2520 -9776 -9106 -16530 -21562 -12322 -13395 -16781 -34185 -30757 -16451 -7962 -9150 -3035 11986
13002A1986j1471k3766o604r820M103J8945q786n167M205k182O342j5j0266p615
12988d0111l988q982N65q520k035j7054j7526m8j2583m1557m0491m9030l5165
12975b76525n500M2955Q2843P9641N7180M2025K0464k087j5329J332J0549J6916
12963E4464O073J5808P004J2540j462n248J1551j9682j1437M509J3928P225m308
12950I0965k209n261Q865q384j6482J919K832L879J3928J0060k214j4092j9154
12937F4652j0308N559J6263J313J5319O731j371J0871J0349j4049j5841n366K453
12924H6575J1082L804L941J7650J3964K8629L0249K4136K3439K4540K4012J6395
12912C08416N2634O4363P1990O2547L1579l3556m0233n7348p5951n7915m2948
$$ plain form
13002 11986 515 -23251 -29855 -39675 -35572 -16627 -25413 -30580 -26375 -28557 -22215 -22230 -32496 -40111
12988 -40111 -44099 -53081 -52516 -61036 -63071 -80125 -97651 -97699 -110282 -151839 -192330 -241360 -276525
12975 -276525 -282025 -239070 -156227 -76586 -19406 22619 43083 40996 25667 26999 37548 54464
12963 54464 60537 76345 83349 95889 94427 89179 100730 81048 69611 74120 88048 95273 90965
12950 90965 88756 83495 92360 83976 67494 69413 72245 76124 90052 100112 97898 83806 64652
12937 64652 54344 59903 76166 77479 92798 99529 98158 109029 119378 105329 89488 84122 86575
12924 86575 97657 101461 105402 123052 137016 165645 195894 220030 243469 268009 292021 308416
12912 308416 361050 425413 497403 559950 591529 557973 517740 460392 384441 326526 283578
12901B83578l8821k8990j7687j7067M1j1460k8762j6700q577M040R799J6206O620
12888A52220o209p287j104Q371O819p145j8704j0047R610Q756q320j2755K738
12875A16943R068K181Q042l974P030J1789J8246M839n697r106N375O584n493j3580
12861A52247J136m08L533M783J7150K3463J7022M752k80m391J3584K3869K6929
12848B83389L1259J3667l6054n5936j2583j8776n2531q334K5089J8960K071j9678
12836A70543k3283j07O864K436J0867J0709J1446N328l937n529J1649J328q678
12823A89636j5284l722Q020j0900j8592R381O629K287L1100L3404K6170R877j7562
12810B50444l4590K253P703J7731K4295R082J6808J7131J1874n075j0756q888
$$ plain form
12901 283578 244757 215767 198080 181013 181054 169594 140832 124132 115555 119595 129394 145600 152220
12888 152220 146011 138724 137620 145991 152810 145665 126961 116914 126524 135280 126960 114205 116943
12875 116943 126011 128192 136234 132260 139290 151079 169325 174164 168467 159361 164736 171320 165827 152247
12861 152247 153383 152975 156508 161291 178441 201904 218926 223678 223398 219007 232591 256460 283389
12848 283389 314648 328315 292261 236325 223742 204966 152435 144101 169190 188150 190221 170543
12836 170543 147260 147153 154017 156453 167320 178029 189475 194803 190866 185337 196986 198314 189636
12823 189636 174352 170630 178650 167750 149158 158539 165168 167455 198555 231959 258129 268006 250444
12810 250444 215854 218107 225810 243541 267836 276918 293726 310857 322731 317656 306900 298012
12798B98012Q204J3228K1049J8491J4520Q278L3745M6224L8163J7974N571k4680
12786D98779m9936m3967l0615k3551N227m451J21321K96697J63074l9923p6213
12775H16442q4391m3394k3003o516r916q216J542J4886K668n570P288q799o384
12762F46637M438J948R294M760p739p52J035J3142L6645N1919N9882M4362N3786
12749I19357O5950N0686M3129N9024N6134M4417K4057K7909M0878K9132J2823
12738A373496K1543J4325K1137K6727M1720M8230M1200N4318P0161O2896P2081
12727A847834O5189O7219P9405O9326P2397N7872O4682N3731M5525N5630O4526
12716B543336P8785P7555P1389J11725J52804J79938J89540J68735J59664J54848
$$ plain form
12798 298012 306216 319444 340493 358984 373504 381782 415527 461751 499914 517888 523459 498779
12786 498779 448843 404876 374261 350710 355937 351486 472807 769504 932578 892655 816442
12775 816442 732051 688657 665654 659138 649222 641006 642548 657434 660102 654532 661820 653021 646637
12762 646637 651075 653023 662317 667077 659338 658586 659621 672763 709408 761327 821209 865571 919357
12749 919357 985307 1035993 1079122 1138146 1194280 1238697 1262754 1290663 1331541 1360673 1373496
12738 1373496 1395039 1409364 1430501 1457228 1498948 1547178 1588378 1642696 1712857 1775753 1847834
12727 1847834 1913023 1980242 2059647 2128973 2201370 2259242 2323924 2377655 2423180 2478810 2543336
12716 2543336 2622121 2699676 2771065 2882790 3035594 3215532 3405072 3573807 3733471 3888319
12706C888319J58883J66169J85272K01558K26441K60461L04002L33568L66270
12697F090943M20652M68191N16018N49617N76175O15376O61628P02073P58499
12688A1359172Q00259Q15211Q34166R06412J000839J093666J173618J258497J376403
12679B0618243J518075J693764J872586K053116K275066K540685K886429L343411
12671C8801375L874957M451776N060070N755536O459721P151218Q081558R117941
12663H8754152J0166988J2057375J5696634K2070131L1862633M5985160O6233808
12656B92826881Q9667909R4839236M9336618j5093963o4071488j02927086r4925261
12649B49652846o3637770l9745315k5861444j8013279j3022262r652598p385539
$$ plain form
12706 3888319 4047202 4213371 4398643 4600201 4826642 5087103 5391105 5724673 6090943
12697 6090943 6511595 6979786 7495804 8045421 8621596 9236972 9898600 10600673 11359172
12688 11359172 12159431 12974642 13808808 14715220 15716059 16809725 17983343 19241840 20618243
12679 20618243 22136318 23830082 25702668 27755784 30030850 32571535 35457964 38801375
12671 38801375 42676332 47128108 52188178 57943714 64403435 71554653 79636211 88754152
12663 88754152 98921140 110978515 126675149 148745280 180607913 226593073 292826881
12656 292826881 382494790 477334026 526670644 511576681 447505193 344578107 249652846
12649 249652846 186015076 146269761 120408317 102395038 89372776 79720178 72334639
12642G2334639n821827m915834m318157l819243l421306k858498k231774j792477
12634D3155523j549059j391526j195313r52550p45901n39849l56400k18035N2429
12625C6259319L13384J95758n54040j347266j807738j957954j918044j828124
12617B7355295j740150j634363j530876j444950j339488j198731j093223j017468
12609A6356046r36910q65390p89681p35319o97162o72018o42768o00898n61698
12600I854202n16993m87076m36769m01924l47931l00854k96441l19443l19754
12591F427017l26998l23342k95050k73700k44812k47986k20517k00439j76158
12582D118015j76037j68013j50703j43441j39514j05145j21953j26023j03172
$$ plain form
12642 72334639 66512812 61596978 57278821 53459578 50038272 47179774 44948000 43155523
12634 43155523 41606464 40214938 39019625 38067075 37321174 36781325 36424925 36206890 36259319
12625 36259319 36572703 36768461 36214421 34867155 33059417 31101463 29183419 27355295
12617 27355295 25615145 23980782 22449906 21004956 19665468 18466737 17373514 16356046
12609 16356046 15419136 14553746 13764065 13028746 12331584 11659566 11016798 10415900 9854202
12600 9854202 9337209 8850133 8413364 8011440 7663509 7362655 7066214 6746771 6427017
12591 6427017 6100019 5776677 5481627 5207927 4963115 4715129 4494612 4294173 4118015
12582 4118015 3941978 3773965 3623262 3479821 3340307 3235162 3113209 2987186 2884014
12573B884014j17796j04506j23375j31268j19513j20858j01387r4295p5220p0204
12563A825592q5501p0692n3592m3879l2620m4550m0290m1959k6554j4830m4867
12552A326258n0045m0300n5919p0254o7282n6767m8335l2933l9078m3516m0480
12541G81349k7642j1526k115L347k687k352j5091r942R02m268L357J0199L1725
12528G55256O2733P7604P6164O288k0877N602j655j8937j8771N348L6524L8605
12516A003884M7767M2115M7485O7498P1160J01591J39465J95927K80955M11434
12506B409281O11485P81531P15400K69747k38503o37499q35273o60704m18539
12497A996926k88799j71310j00720q5014m3598n2996n1191l9983l7424k9042m1214
$$ plain form
12573 2884014 2766218 2661712 2538337 2407069 2287556 2166698 2065311 1971016 1895796 1825592
12563 1825592 1740091 1669399 1615807 1571928 1539308 1494758 1454468 1412509 1385955 1371125 1326258
12552 1326258 1276213 1235913 1179994 1109740 1042458 985691 937356 904423 865345 821829 781349
12541 781349 753707 742181 740066 743413 740726 738374 723283 713341 714243 709975 713332 723531 755256
12528 755256 817989 895593 971757 978045 957168 962770 961115 942178 923407 928755 965279 1003884
12516 1003884 1051651 1093766 1141251 1208749 1279909 1381500 1520965 1716892 1997847 2409281
12506 2409281 3020766 3802297 4517697 4787444 4548941 3911442 3076169 2415465 1996926
12497 1996926 1708127 1536817 1436097 1351083 1307485 1254489 1203298 1163315 1125891 1096849 1055635
12486A055635k1688j3576j5798j0354j9516j5542j1734o929j7796j345J5666K654
12474I39677Q366j0021j3345k7829l5727l3131k7163m140p381k1445n7029n2594
12462F58238j9929k7740n6785k5666J1544P014q997r278n918k4956M07J6802N730
12449E20466m924j2988q988k1015l4962k0625j3147Q391R154q562k993j0440r694
12436C89673o738j7274j0176j2117j6251r164q120j4912l623j3101k0719j1081
12424B46397j6386q696r812R739K38j0065J5959Q315L35l427o354R3L747R877
12410B39960O423m257j5334J073J4724J3375n407j5365P699J3161O303N602k4159
12397B43798k5592k2575j5736j3359l050N796q513p41m214j0612j5358j99o95
$$ plain form
12486 1055635 1033947 1020371 1004573 994219 974703 959161 947427 940498 922702 921357 937023 939677
12474 939677 948043 938022 924677 896848 861121 827990 800827 796687 789306 767861 710832 658238
12462 658238 638309 610569 553784 528118 539662 546676 537679 528401 522483 497527 497934 514736 520466
12449 520466 515542 502554 493566 472551 437589 416964 403817 412208 421362 412800 409807 399367 389673
12436 389673 382935 365661 355485 343368 327117 317953 309833 294921 291298 278197 257478 246397
12424 246397 230011 221315 211503 221242 221480 211415 227374 235689 236024 232597 226243 226336 230083 239960
12410 239960 246383 242126 226792 227865 242589 255964 250557 235192 242891 256052 262355 267957 243798
12397 243798 218206 195631 179895 166536 163486 169282 160769 160028 155814 145202 129844 129645 128950
12384A28950N497n43k0423k1230j6068j2455l394m327l956R591M109j783R450
12371G3418L250o805n273O926J0790O762P542J6218J0568j5180k1935k42N92P935
12357I4566J997O783k272m641J7728O700k438O639J8290J0472R198J3573O775
12344A83370k090K925j861k390j709J2719P648K8322K9661M9563Q7063P2633L6402
12331E02256j7255o7376m3154m0805m9534j8749p048k074m427o928j6092l138
12319B25676k697K51O13l970j6898J986j1028l923m326K645K768r320p760k72
12305A73745O249k617L670p307q434q93j070M950J6019k42Q657L479j0852j2009
12291A73345n048m044J2656k843l841o573n68r835K1l132K880o936O022k3658
$$ plain form
12384 128950 134447 133904 113481 92251 76183 63728 60334 56007 52051 61642 65751 63968 73418
12371 73418 76668 69863 64590 71516 82306 89068 96610 112828 123396 108216 86281 86039 86631 94566
12357 94566 96563 103346 101074 96433 114161 120861 118423 125062 143352 153824 163022 176595 183370
12344 183370 181280 184205 182344 179954 178245 190964 198612 226934 256595 306158 393221 465854 502256
12331 502256 485001 417625 374471 333666 284132 265383 258335 256261 251834 244906 228814 225676
12319 225676 222979 223230 223843 219873 202975 204961 193933 190010 185684 188329 191097 181777 174017 173745
12305 173745 179994 177377 181047 173740 165306 164413 163343 168293 184312 184070 192727 196206 185354 173345
12291 173345 168297 164253 176909 174066 170225 163652 163084 153249 153270 150138 153018 146082 152104 128446
12277A28446q104P463J107j0988r858J118l003j6673M8L760K216Q131m686j6159
12263H2818j0449k144N380R01j0807L697R739k816j0273J1514n014j2015O010
12250F6541M829J25L895j352l592L72l065J848R900O84k531J4027q359k1515n81
12235F1226p804R87J6913J4350J2383R879k548j690j800J0398M148J2160N933
12222A34535n383J481m92J3418Q882q639J430o173j1251L572J321J2552J5929
12209A61182J2932R481P720O475J5064L8092K6121K075O705K6077L2848L1500
12197C76272L5117M8281P1926O6267O3272R5708J24756J60920K39075L56357M70431
12186B108382N17285K67237r0684l67700n52423m89484l33147k06250j44823j02498
$$ plain form
12277 128446 120342 127805 128912 117924 108066 109184 106181 89508 89556 93316 95532 103663 98977 82818
12263 82818 72369 70225 75605 76506 65699 69396 79135 76319 66046 77560 72546 60531 66541
12250 66541 71370 71495 75390 74038 70446 70818 67753 69601 79501 80185 77654 91681 83322 61807 61226
12235 61226 53422 54409 71322 85672 98055 107934 105386 103696 101896 112294 116442 128602 134535
12222 134535 129152 130633 130141 143559 152441 143802 145232 139059 127808 131380 132701 145253 161182
12209 161182 174114 183595 191315 197790 212854 250946 277067 279142 285847 311924 344772 376272
12197 376272 411389 459670 531596 597863 661135 756843 881599 1042519 1281594 1637951 2108382
12186 2108382 2625667 2892904 2802220 2434520 1882097 1392613 1059466 853216 708393 605895
12176F05895p4094m6826l0045l8184j6722j8521j8784j9067k4309j6096j1066
12165B92181k6342l300q225J1920j782n902r906j0338r13O203R907J12o630l995
12151B42990m943j1220o467j6999j7731p607l004r091o191J0389K075j8112R409
12138A63498p873n987j2552k1182Q639Q291L233j3214O588K854j2442m074N250
12125A21029N384m897n357l750P649P796Q32K406o131q829R690k844j9957K17
12111A03238N756j4600n678L668j3346R782K1964J3461m607j488L746j788n078
12098A15030j6796J0589J8007m458q77p385j7407L689K436m752r07n19m172J268
12084I3746o005r919m15l229j73n395j2687n366k603L041L523P466J5360n217
$$ plain form
12176 605895 531801 484975 454930 416746 400024 381503 362719 343652 319343 303247 292181
12165 292181 265839 262539 254314 266234 264452 258550 248644 238306 237393 243596 253503 253615 246985 242990
12151 242990 238047 226827 220360 203361 185630 178023 175019 165928 159737 170126 172201 154089 163498
12138 163498 155625 149638 137086 115904 124543 132834 136067 122853 129441 132295 119853 115779 121029
12125 121029 126413 121516 116159 112409 120058 127854 128686 131092 124961 116132 125822 122978 103021 103238
12111 103238 108994 94394 88716 92384 79038 88820 110784 124245 119638 118150 121896 120108 115030
12098 115030 98234 108823 126830 122372 121495 114110 96703 100392 102828 98076 97169 96650 92478 93746
12084 93746 87741 77822 77407 74178 74005 68610 55923 50557 47954 50995 54518 61984 77344 72127
12070G2127k753p691k9112k117J8438J4180J0720j315j6642O98J0565K533L412
12057G3043j4267j1065Q024J1173k22m513o821j3856O595N331N228q976p450m532
12043C7692m566J903K358Q095K59N64j8023j2904R564L338j1964n036o448K3028
12029B7860J7r848J4329J2036l214N928n851o403j2683l572j65M10N982J157K789
12014B8772j1679q747M767O170k930r215k603L913p944m467J7913J5557r611P27
12000B0623P941R494m963l128r003j3727M378J6779n476l150o609M105k473O888
11986B1679Q473m742J0073m155k683O382j2115K056Q607p815K344k858j5402r47
11972H897J0377M471K260O285R050N064q439j729l267k511j6835q063k887J1312
$$ plain form
12070 72127 69374 61683 32571 30454 48892 63072 73792 72477 55835 56533 67098 69631 73043
12057 73043 58776 47711 55735 66908 66686 62173 55352 41496 48091 53422 58650 49674 42224 37692
12043 37692 33126 35029 37387 45482 45741 46305 28282 15378 24942 28280 16316 11280 4832 27860
12029 27860 27877 18029 32358 44394 41180 47108 41257 34854 22171 18599 18434 18844 24826 25983 28772
12014 28772 17093 8346 13113 19283 16353 7138 4535 8448 504 -3963 13950 29507 19896 20623
12000 20623 28564 38058 33095 29967 20964 7237 11615 28394 22918 19768 13159 17264 14791 21679
11986 21679 30152 25410 35483 31328 28645 35027 22912 24968 33575 25760 28104 25246 9844 8897
11972 8897 19274 23745 26005 32290 41340 46404 37965 36236 32969 30458 13623 5560 2673 13985
11958A3985q979j4681j815J3426J5572J3329M321m30r420q131j3376n84P768J0304
11944B1289q82Q528o500k2792o859o144j749N874L215p467N882J5185M345j5088
11930c163M869J5594J0233j0670N00m930l452Q371M965K438M299J2631Q902p624
11916D2963k4416o23K328K858o118q356N98J5506J4503J0674O63j2506k809o692
11902B8573j3615m313m692r110O25j318L055K67j974Q392J1271N264o523N021
11888B0923M226r93j833O372q876l146J5022J049p917K9N428O755J219p054n024
11873B6180j0314K186J4833k194k3075j4411K071Q323P352k849O12m413o252J626
11859c25P80j026J2246k004j1915m066P800m361j0829j798Q942O729L582L258
$$ plain form
11958 13985 5006 -9675 -11490 1936 17508 30837 35158 34728 25308 17177 3801 3217 10985 21289
11944 21289 20407 28935 22435 -357 -7216 -13360 -15109 -9235 -6020 -13487 -7605 7580 11925 -3163
11930 -3163 1706 17300 27533 16863 17363 12433 8981 17352 22317 24755 29054 41685 50587 42963
11916 42963 18547 17924 20252 23110 16992 8636 9234 24740 39243 49917 50580 38074 35265 28573
11902 28573 14958 10645 5953 -3157 -2532 -3850 -795 -528 -2502 5890 17161 22425 15902 20923
11888 20923 25149 24156 22323 28695 19819 16673 31695 32744 24827 24856 30284 37039 38258 31204 26180
11873 26180 15866 18052 32885 30691 7616 -6795 -4724 3599 10951 8102 8714 4301 -1951 -325
11859 -325 455 -571 11675 9671 -2244 -6310 1490 -2871 -13700 -15498 -6556 173 3755 7013
11845G013J6672l441K585j3263p868M406P70j426l110Q77j0027L787J3744n62
11831A0157P307n407o799r611k295J002J1025Q741r330o610P378J640Q321M439
11817A9958l542j3904L078j866r677j7986Q717Q518N42j207J0219O891j734n984
11803B023J1817J0184o171j470K466N35l351o432o13r193M349N254o623j344J392
11788B823k601J854L605M888j5762M337R161o53K493q568j4132K133Q136R8j4450
11773a6638K94J3437J4454J4176N65l520r82k0406n859R082J8567o009o909J282
11759A1534j392j2987M62P289O863J1540J0852m3m624N348r498j6971L960P449
11745A9782J117m764n158k242L256k185J810l073r245j0814R412K512j0626J1654
$$ plain form
11845 7013 23685 20244 22829 9566 1698 6104 6874 5448 2338 3215 -6812 -3025 10719 10157
11831 10157 17464 12057 5258 -4353 -6648 -5646 5379 14120 4790 -1820 5558 7198 15519 19958
11817 19958 16416 2512 5590 3724 -5953 -23939 -15222 -6704 -6162 -7369 2850 9741 8007 2023
11803 2023 13840 24024 17853 16383 18849 19384 16033 9601 8988 -205 4144 9398 2775 1431 2823
11788 2823 222 2076 5681 10569 -5193 -856 8305 7652 10145 1577 -12555 -10422 -2286 -2188 -16638
11773 -16638 -16344 -2907 11547 25723 26288 22768 21786 1380 -4479 4603 23170 17161 10252 11534
11759 11534 10142 -2845 -2383 4906 11769 23309 34161 34118 29494 34842 25344 8373 12333 19782
11745 19782 20899 16135 10977 8735 11991 9806 11616 8543 -702 -11516 -2104 408 -10218 1436
11731A436K067L075j978J2149k844j3919l704N235m91l856Q717m564q175O551
11717c01J0463n972j106q409j611J0778J4852l738J312K734n567n572j0317K908
11703D54p84M453Q529O701k979r818L87j61J7093l814n048O886J0435n882k2013
11688D439n547Q286M313j0080L033N150L531L683P363J0428j4407j0276o688P264
11674A0492j196q151Q941k324l844J0937J801P277o032k7198l405Q076l898O287
11660b237J3207m295j20L386L332l498J0511K375r938l235j030j0008O287J1196
11646A5933M812j234K056j9648n153n675n86J3697L526J183L506O095J834j7961
11632B385R506j540K154M905k01R170r587j6207k128J709O589q090K771J5283
$$ plain form
11731 1436 3503 6578 4600 16749 13905 -14 -3718 1517 1026 -2830 5887 1323 -6852 -301
11717 -301 10162 4190 3084 -5325 -6936 3842 18694 14956 16268 19002 13435 7863 -2454 454
11703 454 -330 4123 12652 19353 16374 6556 6943 6782 23875 20061 15013 21899 32334 26452 4439
11688 4439 -1108 7178 11491 1411 4444 9594 13125 16808 24171 34599 20192 9916 3228 10492
11674 10492 9296 1145 10086 7762 3918 14855 16656 23933 17901 -9297 -12702 -4626 -8524 -2237
11660 -2237 10970 6675 6555 9941 13273 9775 20286 22661 12723 9488 8458 -1550 4737 15933
11646 15933 20745 19511 21567 1919 -3234 -8909 -9495 4202 7728 8911 12417 18512 20346 2385
11632 2385 11891 10351 12505 17410 17209 26379 16792 585 -1543 166 6755 -1335 1436 16719
11618A6719j008j1431j4281M117J168L060N8M763m269j524k823J4426N707O231
11604B0913j425l019P836o717K065k830j1466q104j412k050q671l26J0527Q828
11590D149o353K449J0828m314m225R6J0087K124j1090Q121K664K537q266j1932
11576c125J4034J2715l468j2762R35J718N062R887j3072j4354J318j931n124j0794
11562a8961K897Q046L936k984m453J0964K484m68k135r834O229O102R421j765
11548I479K39K733J1836O828R04k110q723m710J0152M785j953J3441l381J2173
11534E1693J4019J4719L933m377m677O844J1223J5010J3393L0990K8015L0845
11522B11630L5897J6752Q486j0617l7344j7874o706L716K0684K9177J5941l246
$$ plain form
11618 16719 15711 4280 -10001 -5884 -4716 -1656 -1598 3165 -1104 -2628 -5451 8975 14682 20913
11604 20913 19488 16469 24305 17588 19653 16823 5357 -2747 -4159 -6209 -14880 -15206 -4679 4149
11590 4149 -2204 245 11073 6759 2534 2630 12717 14841 3751 11872 14536 17073 8807 -3125
11576 -3125 10909 23624 20156 7394 8329 10047 15109 24996 11924 -2430 -1112 -3043 -8167 -18961
11562 -18961 -16064 -8018 -4082 -7066 -11519 -555 1929 1461 -674 -10508 -4279 1823 11244 9479
11548 9479 9718 12451 24287 31115 32019 29909 21186 16476 26628 31413 29460 42901 39520 51693
11534 51693 65712 80431 84364 79987 75310 82154 93377 108387 121780 152770 180785 211630
11522 211630 247527 264279 272765 262148 224804 206930 200224 203940 224624 253801 269742 266496
11510B66496j6475k1610l5565k6938l1528k9560j0085r755M638O914m875r191
11498H2466J565m299J2810J4334P930K803j4884j0732N571J359P0P351J9542J8173
11484A44059J9351K044o24K0119L1545O619J7505L6974N7106N7635M6246L7078
11472D75657K7938J2838K695K2510K9718K5653K3587M1249M4957N1665M8159L536
11460H10162m1478j00723j25046j07447q5517m9743l4407k9185k1567j1279q680
11449A95090j5275k0150j0460p190k908N241j125l618N151J618j275J0055J1367
11436A66521J4607J2389Q933q851j1556L640O526P933M781L812K4454L2765L2286
11423B98240M3355N6444O0977P7545N3257J2849m908j7526j6586J5524K4907J2956
$$ plain form
11510 266496 250021 228411 192846 165908 134380 104820 94735 84980 89618 96532 91657 82466
11498 82466 84031 79732 92542 106876 114806 117609 102725 91993 97564 98923 98993 106344 125886 144059
11484 144059 163410 165454 164830 184949 216494 223113 240618 277592 334698 392333 438579 475657
11472 475657 503595 516433 519128 541638 571356 597009 620596 661845 706802 758467 806626 810162
11460 810162 768684 667961 542915 435468 349951 300208 265801 236616 215049 203770 195090
11449 195090 179815 159665 149205 142015 139107 144348 143223 139605 144756 146374 145099 155154 166521
11436 166521 181128 193517 202450 193599 182043 185683 192209 200142 204923 208735 233189 265954 298240
11423 298240 341595 398039 459016 536561 589818 602667 597759 580233 563647 579171 604078 617034
11411F17034k4154p4220r3048p9921o6881m3012l6223j5949q093j4023j7299l1345
11399A12866o594J8354l422n259j2451r55O33p564j4005j960K751N866k0065q682
11385E9513K303J2881K761q33q68n783j2212j591M670l367k0624q297N829k896
11371C1486m244N255n187q238K874K0547j14j3430m929j1227j0020J0837Q014
11358B1624m286K413K39l892M50Q27M659p158K762n977m991L085O018J1299Q572
11343C5644m927p162k669j0187j6377n47J1086m097o895P136O433j111J651p183
11329G95J3542n37k3331P057N470k894m415j3921m775O721J4703J7079j1901j264
11315B329P007k80o624k629j393M710K8Q655L604K177l815n087q078p009j1089
$$ plain form
11411 617034 592880 518660 425612 345691 278810 235798 199575 183626 175533 161510 144211 112866
11399 112866 106272 124626 121204 115945 103494 102539 103172 95608 81603 79643 82394 88260 68195 59513
11385 59513 61816 74697 77458 76625 75757 69974 57762 56171 60841 57474 36850 28553 34382 31486
11371 31486 27242 32497 27310 19072 21946 42493 42379 28949 24020 12793 2773 13610 21624
11358 21624 17338 19751 19990 16098 16548 17375 22034 14876 17638 11661 6670 9755 15773 27072 35644
11343 35644 30717 23555 20886 10699 -5678 -6225 4861 764 -6131 1005 7438 6327 7978 795
11329 795 14337 13800 -9531 -2474 2996 102 -4313 -18234 -23009 -16288 -1585 15494 3593 2329
11315 2329 9336 9056 2432 -197 -1590 3120 3148 11803 15407 17584 13769 8682 604 -6405 -17494
11300a7494P389M321o779Q279Q561Q301n150k40M526P279q361o549N545j849n972
11285A807J4105R896j1318p519P54r73r106M699J101M924m20p314j5554L756k60
11270a1422M584p466J2444K541m858Q084M572n19R74O880M943J2434J0290j5688
11256B7793p583M259J1618J5241M765m101k940m694j436P434p941M078K4892k017
11242F9368P82N085M578P386J2410P027K087M829K2989K8038J6186K2209L4642
11229B37616M0654N6819N4812M9869N7411M1180K6923J1058j4229j2790K795p496
11217E44622l7440n9967m9694n1902m7113m2208l3899k2445j4969j5566k858l093
11205A63468n926q283R894j2107r468r306K1n163K6786J073n826M468J1005O203
$$ plain form
11300 -17494 -10105 -5784 -12563 -4284 4277 12578 7428 7188 11714 18993 10632 4083 9628 7779 1807
11285 1807 15912 25808 14490 6971 7725 6752 -2354 2345 3446 8370 7950 636 -14918 -11162 -11422
11270 -11422 -6838 -14304 -1860 681 -4177 3907 8479 7960 8934 15814 20757 33191 43481 27793
11256 27793 20210 24469 36087 51328 56093 51992 49052 44358 42922 50356 42415 46493 71385 69368
11242 69368 70150 75235 79813 87199 99609 106636 108723 113552 136541 164579 180765 202974 237616
11229 237616 278270 335089 389901 439770 497181 538361 565284 576342 562113 549323 552118 544622
11217 544622 507182 447215 397521 345619 298506 256298 222399 199954 184985 169419 166561 163468
11205 163468 157542 149259 159153 147046 137578 128272 128293 123130 149916 150989 145163 149631 160636 166839
11191A66839J1833r330n87J2732J6817K1795Q986K4211K2983K7486K9749N0044
11179C83558P5575Q9659P8326O8432P1933Q424k9432m1419k9313l5731l6533l5998
11167E67481k8865j7114k0088l3455k1160k8420l8870m4202n0048l1035k1841
11156B32383j2793q797j6466j1457j2008k1853j7789R932j379L885n752k407M180
11143A39679l587M317o819N416l458P640n655j453M142J491M253J2073P678P646
11129A73363K6221K8218K7221K0859N423o656K954q817o151q257J653m21L815
11116B59425J1335n945k0141k3750k6705j8337r005j5670k0663k5391j0124o132
11104H8897P15j3275r776r004k88L610n388M196q153j5050j2261P303J0959j042
$$ plain form
11191 166839 178672 169342 168755 181487 198304 220099 229085 253296 276279 303765 333514 383558
11179 383558 459133 548792 627118 695550 767483 775907 746475 705056 675743 640012 603479 567481
11167 567481 538616 521502 501414 467959 446799 418379 379509 335307 285259 254224 232383
11156 232383 219590 210793 194327 182870 170862 149009 131220 141152 139773 143658 137906 135499 139679
11143 139679 136092 140409 133590 139006 135548 143188 137533 136080 140222 141713 145966 158039 165717 173363
11129 173363 199584 227802 255023 275882 281305 274649 277603 268786 262635 254378 256031 255610 259425
11116 259425 270760 264815 244674 220924 194219 175882 166877 151207 130544 105153 95029 88897
11104 88897 89612 76337 66561 57557 57269 60879 55491 59687 51534 36484 24223 31526 42485 41443
11090D1443o171j619L385O297j5574J2284K802j090l79N294P395j6805n469l515
11076B8278K90N510j094p20p141p396r315O220m622l416K786J8923l940j8391
11062E972J1698K560m872n534Q439n204L788m452r107j5552k297J2333Q315o710
11048f23m835K677R478J5573n259J2489p253L550J675j1553j1013o307m936n800
11034a2137R574Q195M982p991r045N276J3683K188j0424j4069r65m651o98l803
11020a9885Q825n916N053K2103J0062O800j6587l460J44l457p631J1282J4403
11007B1736J3374k177q804j4330k531k745J443m32L336j322k852o169J3250K5149
10993C6926k516j3122l539j1159L980L722o965j6353r59P919J068J733J946j886
$$ plain form
11090 41443 35272 33653 37038 43335 27761 40045 42847 41757 41378 46672 54067 37262 31793 28278
11076 28278 28568 34078 32984 32264 25123 17727 8412 14632 10010 6594 9380 28303 24363 5972
11062 5972 17670 20230 15358 9824 18263 13059 16847 12395 3288 -12264 -14561 -2228 6087 -623
11048 -623 -5458 -2781 6697 22270 17011 29500 22247 25797 27472 15919 4906 -1401 -6337 -12137
11034 -12137 -2563 5632 10614 2623 -6422 -1146 12537 14725 4301 -9768 -10733 -15384 -16082 -19885
11020 -19885 -11060 -16976 -11923 10180 20242 27042 10455 6995 7139 3682 -3949 7333 21736
11007 21736 35110 32933 24129 9799 7268 4523 5966 5534 8870 7548 4696 -1473 11777 36926
10993 36926 34410 21288 17749 6590 10570 14292 7327 -9026 -9985 -2066 -998 735 2681 795
10979G95l517p11K812L725O356N060r397j3436k64r600p106J502J2475R903N934
10964D531%l52n338l186M923J0749l948j2345O656j2929p350M861K014j0528P36
10949b1506p88n46J2136O971L118l045N28L792j5996p61O055k800n346J534Q89
10934a5765R371M893m167m904l074j17q872j6376R297Q051O653N89J3223p980
10920i178l334j282Q707n9p254O596J9990r403k5918q419P255J1656J7976L869
10906A1202j6142o301P707Q635o211q043o320Q704K188m897N401L046J3422L527
10892A5918M93p678k116n516j156J4972l146j6350J632P924q351j1372L4J2323
10878b389R392p865j203j324q66o500r668J4625Q403P968L052k088m948j1154
$$ plain form
10979 795 -2722 -3433 -621 3104 9460 14520 5123 -8313 -8577 -18177 -25283 -23781 -11306 -1403 4531
10964 4531 4531 4179 -1159 -4345 578 11327 7379 -4966 1690 -11239 -18589 -13728 -11714 -22242 -21506
10949 -21506 -22294 -22840 -10704 -3733 -615 -3660 -3132 660 -15336 -16097 -10042 -12842 -18188 -16654 -15765
10934 -15765 -6394 -1501 -5668 -10572 -13646 -13763 -22635 -39011 -29714 -21663 -15010 -14421 -1198 -9178
10920 -9178 -12512 -13794 -5087 -5146 -12400 -5804 14186 4783 -21135 -29554 -22299 -10643 7333 11202
10906 11202 -4940 -11241 -3534 5101 -1110 -9153 -15473 -6769 -4581 -9478 -4077 -1031 12391 15918
10892 15918 16411 8733 6617 1101 -55 14917 11771 -4579 -2947 4977 -3374 -14746 -14712 -2389
10878 -2389 7003 -862 -2065 -3389 -4255 -10755 -20423 -5798 2605 10573 13625 11537 6589 -4565
10864d565l709n660l789J0885L51q343L824P268N828P21m401R986J2685l903j2148
10849E030l100M298J6492j3262K392j705K599n270j0753r031P364O840L564P039
10835A2497R692L32p65j251j4332j6222l133j33N588P774Q992Q684L542j0044
10821A1221l097M124q692Q34k049j1203J2338Q753p948L490N480L680j2365m927
10807c61j229N198o549k830j500Q46m594m561J3789l305j896N269P080j9717j03
10792a4463J5514J2739j4371r275R878M79p840o645M434l021O936p666L868L382
10778f051J3348R67l891j8194L435L154P782K340Q101m327l395J2305O147l771
10764A7950j1751j023q019P33K489q786K320J408j622J9524J1333r292j3205m528
$$ plain form
10864 -4565 -8274 -13934 -17723 -6838 -6487 -14830 -11006 -3738 2090 2811 -1590 8396 21081 17178 5030
10849 5030 1930 6228 22720 9458 11850 10145 12744 7474 -3279 -12310 -4946 1894 5458 12497
10835 12497 22189 22521 21756 20505 6173 -10049 -13182 -13315 -7727 47 9039 17723 21265 11221
10821 11221 8124 12248 3556 4390 2341 -8862 3476 12229 4281 7771 13251 16931 4566 -361
10807 -361 -1590 3608 -2941 -5771 -7271 -6425 -11019 -15580 -1791 -5096 -6992 -1723 5357 -14360 -14463
10792 -14463 1051 13790 -581 -9856 22 501 -7339 -13984 -9550 -12571 -5635 -13301 -9433 -6051
10778 -6051 7297 8264 4373 -13821 -10386 -7232 550 2890 10991 6664 3269 15574 21721 17950
10764 17950 6199 5176 -2843 -2110 379 -8407 -6087 -4679 -6301 13223 24556 15264 2059 -2469
10750b469j1059J395K514L015n623r950o233J6136K071l8M981P859J4476j1166
10736E909o07K543j225p018p689o326k169K1074R329K170l468J232M79L50N226
10721A9810J1825m161k0564j4893o197Q964R55j964q3M304J3579p749n486j800
10707c460J732J1443L200j1580q460l413N762L387K804N063m555M884j5039K186
10693f046j40j126m522n847J7032K3737J4029j9657k2374q434M456l826N997O735
10679A4o604R29r117k350j71L720J2668N297J290P980R78J0012r94M47j4060j60
10663I879J0124n930r418P541m867n87K046j176l806l899o855P348K151O38J416
10648D605l863j908J2347M296o158q21K432M251K12j6941O690J1234l391q848
$$ plain form
10750 -2469 -13528 -12133 -9619 -6604 -12227 -22177 -28410 -12274 -10203 -10241 -5260 2599 17075 5909
10736 5909 5302 7845 6620 -398 -8087 -14413 -16582 4492 13821 15991 12523 13755 14234 14584 19810
10721 19810 31635 27474 6910 -7983 -14180 -5216 -4261 -6225 -6308 -2004 11575 3826 -1660 -3460
10707 -3460 -1728 9715 12915 1335 -7125 -10538 -4776 -1389 1415 6478 1923 6807 -8232 -6046
10693 -6046 -6186 -7312 -11834 -17681 -649 23088 37117 17460 -4914 -13348 -8892 -12718 -6721 14
10679 14 -6590 -5661 -14778 -17128 -17299 -13579 -911 4386 5676 13656 14634 24646 23652 24099 10039 9879
10663 9879 20003 14073 4655 12196 7329 6742 8788 7612 3806 -93 -6948 400 2551 3189 4605
10648 4605 742 -1166 11181 15477 9319 8498 10930 15181 15393 -1548 5142 16376 12985 4137
10634D137p490p206P171n285n524R435N868l317P007J078K435j0378p392M044
10620e417M800M303K616m809m220P03m865R278P876J2572J2111j1629k0779j2699
10606a0159j616l234l654J857j602m262p465M295q170J185J1978r3J0133J4614
10592C807ok852n114p009P839k68l003j1733o412L605J9962J1255j7132L329J053
10577b679k232j457q472Q015N474q100j7249o116k396J6614K2633N416j4678k3140
10563b8367o56J559J529R392J4234l647J2387k886p880l10n689P594k726L502
10549a964k024n049l338O599p558k60N977O44K458R656J8345M410k43P868o378
10534B9143j1180m609j4441N248J7113J3150n469o031l954l896j527n745m275
$$ plain form
10634 4137 -3353 -10559 -3388 -8673 -14197 -4762 1106 -2211 4796 5874 8309 -2069 -9461 -5417
10620 -5417 -617 3686 6302 1493 -2727 -2024 -6889 2389 10265 22837 34948 23319 2540 -10159
10606 -10159 -11775 -15009 -18663 -16806 -18408 -22670 -30135 -25840 -34010 -32825 -20847 -20940 -10807 3807
10592 3807 3801 949 -4165 -11174 -3335 -3603 -6606 -18339 -24751 -21146 -1184 10071 -7061 -3732 -2679
10577 -2679 -4911 -6368 -14840 -6825 -1351 -9451 -26700 -32816 -35212 -18598 4035 9451 -5227 -28367
10563 -28367 -29023 -27464 -25935 -16543 -2309 -5956 6431 3545 -4335 -4645 -10334 -2740 -5466 -1964
10549 -1964 -3988 -9037 -12375 -5776 -13334 -13594 -7617 -6973 -4515 5141 23486 27896 27653 35521 29143
10534 29143 17963 13354 -1087 4161 21274 34424 28955 22924 18970 15074 13547 7802 3527
10521C527j7806Q195N804P305k792l5190m701J8162J7594Q645p271p610Q147R020
10507A1029q358M771J884m363j4250m502R160j1208J206M848J22o60N017l979
10493i283R027J7414j037k476o620r058j4513M908N936J998M257j9687j0001O617
10479b2518J3586O774k435N292O47P719j961p173K943l891k326l96L997R21l776
10464b597p942l504j4120k34J5363J0306N245K5270k90j2297k645j658p834m410
10450a347m841l276k309l210Q882M864K259R577m302m505j0754J1841M85m889
10436a525j0832j2123K570L300K802J551Q06M974q085J2144k56l2p140M622R618
10421B394J3105J672j5014l716J1031j138m677n299l627j2645k994L526K776k026
$$ plain form
10521 3527 -14279 -6084 -280 7025 4233 -30957 -35658 -17496 98 8743 1472 -6138 2009 11029
10507 11029 2671 7442 9326 4963 -9287 -13789 -4629 -15837 -14631 -9783 -9661 -10321 -5304 -9283
10493 -9283 -256 17158 16121 13645 7025 -2033 -16546 -11638 -5702 -3704 553 -19134 -29135 -22518
10479 -22518 -8932 -2158 -4593 699 1346 9065 7104 -69 2874 -1017 -3343 -3739 258 1179 -2597
10464 -2597 -10539 -14043 -28163 -28397 -13034 -2728 2517 27787 27497 15200 12555 10897 3063 -1347
10450 -1347 -6188 -9464 -11773 -14983 -6101 -1237 1022 10599 6297 1792 -8962 2879 3364 -1525
10436 -1525 -12357 -24480 -21910 -18610 -15808 -14257 -13451 -8477 -16562 -4418 -4674 -4706 -11846 -7224 2394
10421 2394 15499 17171 2157 -1559 9472 8334 3657 -1642 -5269 -17914 -20908 -17382 -14606 -16632
10407a6632J1478J3420r875j746k315L03Q91k335R319j274J3538L311l065k907
10393A2111o306j1891j2201q801J1897J0574j52K943J875l318n706j6524l92L612
10379b2279n149P52M440J494l06j1038J8016K736r541K879K203R698J0068Q232
10365A2205r192j3082j5133P035k814K337O977Q9o938r01P477M844J132n096j6628
10350b7688M35l133j436l236J0490J8272J6380J414r139n516m82q296R11p843
10336a8867k2722j371J2924O252j3488R8K641K583J560M975n11N313K308N164
10322a3141J6409Q847j2550j2786J786P519J0439p88m583j566O574n604O02P496
10308H654m901j5015j225j3250P850R443j144p591j3313L118J0682J4601N319
$$ plain form
10407 -16632 -5154 8266 -1609 -3355 -5670 -5367 -4476 -6811 2508 1234 14772 18083 15018 12111
10393 12111 5805 -6086 -18287 -27088 -15191 -4617 -4769 -1826 49 -3269 -8975 -25499 -25891 -22279
10379 -22279 -27428 -26676 -22236 -20742 -21048 -32086 -14070 -11334 -20875 -17996 -15793 -6095 3973 12205
10365 12205 3013 -10069 -25202 -18167 -20981 -18644 -11667 -11578 -18516 -19417 -11940 -7096 -5964 -11060 -27688
10350 -27688 -27253 -30386 -31822 -35058 -24568 -6296 10084 11498 2359 -3157 -3639 -11935 -11024 -18867
10336 -18867 -41589 -42960 -30036 -23784 -37272 -37174 -34533 -31950 -30390 -25415 -25926 -20613 -18305 -13141
10322 -13141 3268 12115 -435 -13221 -11435 -3916 6523 5735 1152 -414 6160 556 1158 8654
10308 8654 3753 -11262 -12487 -25737 -17887 -8444 -9588 -17179 -30492 -27374 -16692 -2091 3228
10295C228j7646j0104N704Q012N452k764k2q827o247q966J3346Q138L126q860
10281a6430m324q324Q422J9022J2726p920j9489J666M477m064p623p981M202M025
10267b1615J974k664J908l160O891o427j46R069M931R444k698J238K875k054r104
10252i538k938O844Q725K727P94m745K203m790o060m16J075Q768Q882o166r615
10237d250J138o734k04J3003O081o817q447j1750k467J988J091Q599p330P227
10223h872O180K977m390M21j2378K246J455L654P399j917j517p487j50M945K767
10208d667N077O615M966J950J949j160r070j05M061M115m287k183n505K315o539
10193b468o088M121o074P904K829l076J1386j164q326l230q07O276L942m215m847
$$ plain form
10295 3228 -14418 -24522 -18818 -10806 -5354 -8118 -8140 -16967 -23214 -32180 -18834 -10696 -7570 -16430
10281 -16430 -20754 -29078 -20656 -1634 11092 3172 -16317 -14651 -10174 -14238 -21861 -29842 -25640 -21615
10267 -21615 -19641 -22305 -20397 -23557 -16666 -23093 -23239 -14170 -9239 205 -2493 -1255 1620 -434 -9538
10252 -9538 -12476 -5632 3093 5820 6614 1869 4072 -718 -6778 -7194 -6119 2649 11531 5365 -4250
10237 -4250 -3112 -9846 -10050 2953 9034 2217 -6230 -17980 -20447 -18459 -17368 -8769 -16099 -8872
10223 -8872 -2692 285 -4105 -3684 -16062 -13816 -12361 -8707 -1308 -3225 -4742 -12229 -12379 -7434 -4667
10208 -4667 410 7025 11991 13941 15890 14730 5660 5555 9616 13731 9444 7261 1756 4071 -2468
10193 -2468 -8556 -4435 -10509 -2605 224 -2852 8534 7370 -956 -4186 -4993 1283 5225 1010 -3837
10178c837m56j1551P781o118J0910K3399j561r928j1621q413Q000K0486n476r947
10164A668N412n93k377j0945j2312J0126O958Q652K902n416R275r035p298j761
10150d744M649j2849L523J8017L010O984j919j3735k544J0341q05j6469M066k494
10136d969j0481p023J696N209K618J251n168Q957J0926R555j4119M503M499J388
10122H842R050Q842J0681j2326r398O393p900j040j1796L01Q05J96j7692j91Q448
10107f785Q048j022q059n41J159j397r411Q134R639P433o997j2463R2j1184j612
10092b4966J6149m79K070J886L573p553o922L810O185m866j094m546q145K461
10078b2437J1051P153M412m369n284r365N115J4482M262o557o898n8O671L509
$$ plain form
10178 -3837 -4293 -15844 -8063 -14181 -3271 20128 18567 8639 -2982 -11395 -3395 17091 11615 1668
10164 1668 7080 6487 4110 -6835 -19147 -9021 -2063 6589 9491 4075 13350 4315 -2983 -4744
10150 -4744 -95 -12944 -9421 8596 11606 18590 16671 2936 392 10733 9928 -6541 -2475 -4969
10136 -4969 -15450 -22473 -20777 -15568 -12950 -11699 -16867 -7910 3016 12571 -1548 2955 7454 8842
10122 8842 17892 26734 37415 25089 15691 22084 14184 13144 1348 1649 2454 2650 -15042 -15233 -6785
10107 -6785 1263 241 -7818 -8359 -7200 -8597 -18008 -9874 -235 7198 201 -12262 -12170 -23354 -24966
10092 -24966 -8817 -9296 -7226 -5340 -1767 -9320 -16242 -12432 -6247 -11113 -12207 -16753 -24898 -22437
10078 -22437 -11386 -4233 179 -4190 -9474 -18839 -13724 758 5020 -1537 -8435 -8493 -1822 1687
10064A687J0652k109o83j2888k99P867J3625p001n806O504p475q749m986J1093
10050A432Q373j2084O412O714j0277j5214J3715J5316j907l209M07r684q402P47
10036g661M564j1847J1487Q661N368j4158k544J3070j710j533l56P528J55N905
10022A6929j0313k1796q685J1520O093M516j774o762J1531M230j4912j4288j1287
10009c4998J4189J5440M379j0455q248k090Q73n928m901P520K217q93J991N341
9995a5563j115Q304N32o91L527k386J9590M657j4879o092M731R515k731J161m185
9980D375l160O995O352q511N050n64r616o916j132M693n737j1521Q59P054K0543
9965H764N602P902N383o258q51l225o905n497j2864p932k71M13O050N10q782o075
$$ plain form
10064 1687 12339 10230 9547 -3341 -3640 4227 17852 10851 5045 11549 4074 -4675 -9661 1432
10050 1432 9805 -2279 4133 10847 570 -14644 -929 14387 12480 9271 9678 -6 -8408 -7661
10036 -7661 -3097 -14944 -3457 5204 10572 -3586 -6130 6940 5230 3697 3341 10869 11024 16929
10022 16929 6616 -15180 -23865 -12345 -6252 -1736 -3510 -10272 1259 5489 -9423 -23711 -34998
10009 -34998 -20809 -5369 -990 -11445 -19693 -21783 -20910 -26838 -31739 -24219 -22002 -22895 -20904 -15563
9995 -15563 -16678 -8374 -7842 -8533 -5006 -7392 12198 16855 1976 -4116 615 10130 7399 8560 4375
9980 4375 1215 8210 14562 6051 11101 10537 921 -5995 -7127 -2434 -8171 -19692 -18833 -11779 8764
9965 8764 14366 22268 27651 21393 20542 17317 10412 4915 -7949 -15881 -16152 -15739 -9689 -9179 -17961 -24036
9949b4036j837J4027J543N790j419n28M554P827P770j8789k04O827P952r087o845
9934f455k631P461J506r009j2639J4032J5188P844j4173m89q371K64r143J2421
9920d194M350N622q43r944L489p311j99n195j618Q620n15N969J1629K39k314J018
9904H803J091k560Q129l544j4062j705l45m647p337k410k819K28J36K148R17J073
9888a6904J677k599J983j44M30o074q024j434r85O659J7582N954j1099o290J4276
9873d992J6431J5199j005Q01j8101p370o167n57N623K646K0005R160j5327J418
9859A7764o698m797N885Q096m560j6442k311l251R202K44j108L68R572J897k029
9844A1832J1828l819q800j584p078Q95m560m342j911j873l421M176O959k897r98
$$ plain form
9949 -24036 -25873 -11846 -10303 -4513 -5932 -6460 -1906 5921 13691 -5098 -5302 1525 9477 390 -6455
9934 -6455 -9086 -1625 -119 -9128 -21767 -7735 7453 15297 1124 635 -7736 -7472 -16615 -4194
9920 -4194 156 5778 4935 -5009 -1520 -8831 -9030 -14225 -15843 -7223 -7738 -1769 9860 10099 7785 8803
9904 8803 9894 7334 15463 11919 -2143 -3848 -4193 -8840 -16177 -18587 -21406 -21178 -21042 -18894 -17977 -16904
9888 -16904 -15227 -17826 -15843 -15987 -15557 -21631 -29655 -31089 -32074 -25415 -7833 -1879 -12978 -19268 -4992
9873 -4992 11439 26638 25633 26434 8333 963 -5204 -5761 -138 2508 22513 31673 16346 17764
9859 17764 11066 6269 12154 20250 15690 -752 -3063 -6314 2888 3132 2024 2392 11964 13861 11832
9844 11832 23660 19841 11041 9457 2379 3274 -1286 -5628 -7539 -9412 -12833 -8657 -1698 -4595 -5593
9829e593K505j222P175K649j16j1612M80J4400O258l341r004j179q731r323J402
9814a5252J093J7537J2565K835O2j1494j2664J791j956l810o179k064p747M260
9800b1023k166M488L187Q846k58n297L975j795j083J6940k119J58j671J1563L95
9785A4140j2410p507R743O75j5486j1901J1205O645J490K388j258J0534j355O931
9771A3834r68m505L566j153n61k425j5068r007j91J1254P778R45l065J599R829
9756A1862q340j5001r953r835O823J1937K69J3021N03P324j201j1375r977J000
9742a2943J2457J0802n210N171j236Q784L965n805l369L830q786o784K12p169
9728f081J2409j068m934N451r15K20N83P375o057m213r160J454J2705J0785l898
$$ plain form
9829 -5593 -3088 -4310 2865 5514 5398 -6214 -5734 8666 14924 11583 2579 1400 -7331 -16654 -15252
9814 -15252 -14159 3378 15943 18778 18840 7346 -5318 -3527 -5483 -9293 -15472 -17536 -25283 -21023
9800 -21023 -23189 -18701 -15514 -6668 -6926 -12223 -8248 -10043 -11126 5814 3695 3853 2182 13745 14140
9785 14140 1730 -5777 3966 4641 -10845 -22746 -11541 -4896 -3406 -1018 -2276 8258 6903 13834
9771 13834 12866 8361 11927 10774 10213 7788 -7280 -16287 -16478 -5224 2554 3499 434 2033 11862
9756 11862 3522 -11479 -21432 -31267 -24444 -12507 -12238 783 1286 8610 7409 -3966 -13943 -12943
9742 -12943 -486 10316 5106 10277 9041 17825 21790 15985 12616 16446 7660 876 1088 -6081
9728 -6081 6328 5260 326 5777 4862 5082 5665 13040 6983 2770 -6390 -4936 7769 18554 14656
9713A4656j1883j8195J808J863m887J0503J1208O590N952n443k1538r281j1632
9700c0279J2579O223j1654m705q034L776J7760R220M773J000k724k009r145J0197
9686c022m406L908Q617k59L634L153r875j0947m226j949J7897J1479M223j608
9672A6619n852k101J541l290q760j3189J399J1999K29r824k646j975R221O772
9658A43M025l920j662k840j0063J9329J2021p516j4052j1462K040J5952J363j0853
9644g495J722N891j5615J981J6271N374Q16N987K54p679j1831k098n437J7620
9630E761K177q855j241p434o894K756j209L14J1738N445O568O31j675p21M29m9
9614G741p220J005L043k699L395R50p759j599p867r445j784J1048J787R020J4615
$$ plain form
9713 14656 2773 -15422 -13614 -11751 -16638 -6135 5073 11663 17615 12172 -9366 -18647 -30279
9700 -30279 -17700 -11477 -23131 -27836 -35870 -32094 -14334 -5114 -341 659 -2065 -4074 -13219 -3022
9686 -3022 -7428 -3520 5097 4838 8472 11625 1750 -9197 -13423 -15372 2525 14004 18227 16619
9672 16619 10767 8666 10207 6917 -1843 -15032 -13633 -1634 -1405 -11229 -13875 -15850 -6629 143
9658 143 4168 248 -1414 -4254 -14317 5012 17033 9517 -4535 -15997 -13957 1995 3358 -7495
9644 -7495 -5773 118 -15497 -13516 2755 8129 8945 14932 15186 7507 -4324 -6422 -11859 5761
9630 5761 7938 -917 -2158 -9592 -16486 -13730 -14939 -14625 -2887 2558 9126 9757 8082 7361 7790 7741
9614 7741 521 1526 4569 1870 5265 6215 -1544 -3143 -11010 -20455 -22239 -11191 -9404 -384 14231
9599A4231J0909l712r146m404p689R814N789J421j4285o165N824J3040L873m796
9585A4704J778l721q117J0762J3026N29j4582r025j255p887k362N366Q906L409
9571A1531j2754J263K085o796P227J0112j53o724k402J5157J0361j1966p650R269
9557A8560N73J876J765k866p459Q540J8772j4130j1485q043O02m73j58n781r549
9542i256k924Q536K468P179K459J460J0050j1296p404J4212N771n458q30L580
9528A8547K38j1980r88n384k114M768l145M74J3593K3206p372J961l341j0932
9514A7531Q835j6568q062P279L338r993n144R271R171K747p144J7737J1258q469
9500C1787o454Q344q884j3498j1698K178j3018K148J2724P505P373P95J2188n065
$$ plain form
9599 14231 25140 21428 12282 7878 189 10003 15792 17213 2928 -3237 2587 15627 19500 14704
9585 14704 16482 12761 4644 15406 28432 28961 14379 5354 4099 -3788 -6150 -784 8122 11531
9571 11531 -1223 40 2125 -4671 2556 12668 12515 5791 3389 18546 28907 16941 9291 18560
9557 18560 19133 21009 22774 19908 12449 20989 39761 25631 14146 6103 6705 6232 6074 293 -9256
9542 -9256 -12180 -3644 -1176 6003 8462 9922 19972 8676 1272 15484 21255 15797 14967 18547
9528 18547 18785 6805 5817 433 -1681 3087 -58 416 14009 37215 29843 31804 28463 17531
9514 17531 26366 9798 1736 9015 12353 2360 -2784 6487 15658 18405 11261 28998 40256 31787
9500 31787 25333 33677 24793 11295 -403 1775 -11243 -9095 3629 11134 18507 19302 31490 26425
9486B6425r956q874M392J0441j307p00j2019j0642k795N026N579N107Q306j675
9472A7308N780R817L539j026l909k41p081j5100l335j2109N291P744Q5J0529N792
9457B3084k720j1120J641O976Q19q77J282r099n31J3555R896L899J0755O190o031
9442D7719k167n315j5864j0455P476J2523M873J832Q86Q865L102j1703J835L949
9428D7556j4200j2554O544J0418k646J0585p303j3924J86O295K291P457J6040
9415E6745J11N405L032O39o56m390j7385O068J5005n419p159O781R379j4940r951
9400D3265L831Q902J7410m082J707N998l802m708M154P429l038P44j419N983n239
9385G7135m339J6108Q86j1715n221J7974J1795n038l577O952R464J105J448L718
$$ plain form
9486 26425 16469 7595 11987 22428 21121 20421 8402 -2240 -5035 -9 5570 10677 18983 17308
9472 17308 23088 32905 36444 35418 31509 31268 24187 9087 5752 -6357 -1066 6678 6763 17292 23084
9457 23084 20364 9244 10885 17861 18680 17803 19085 9986 9455 23010 32906 36805 47560 53750 47719
9442 47719 45552 40237 24373 13918 21394 33917 38790 40622 41508 50373 53475 41772 43607 47556
9428 47556 33356 20802 27346 37764 35118 45703 38400 24476 24662 30957 33248 40705 56745
9415 56745 56856 62261 65293 65932 65276 60886 43501 49569 64574 59155 51996 58777 68156 53216 43265
9400 43265 47096 55998 73408 69326 71033 77031 73229 68521 72675 80104 77066 77810 76391 82374 77135
9385 77135 72796 88904 89790 78075 72854 90828 102623 97585 94008 100960 110424 111529 112977 116695
9371A16695L113P089N11j78r390K468J7469J1645R639q338M431R637J2732J6439
9357A93962Q107j4543J361J2478K659q94K1431K0132K197J0896P456N104J4246
9344B84592R076k020J1002J3603J1485P916N391R709J1962K08J0908K1544P274
9331D02650J0488K5795L2007K9230J9128L242J4130K0062J8628M0131L7756L2384
9319F85631L0417J8291J2513J3659K8404L1336K8920K8448L4785L7152L2083L3604
9307A015243K8232J8998K6600J3214J3349K1886J1160p220k713K3097P516j0401
9295A158961j3465j0367l126j521j1265k9900q591j4076k6490l8354k2985l0159
9283I48662l0041j8276k2004l6647j4797K816m650l4184m0286l4956k2614j4629
$$ plain form
9371 116695 119808 126897 127408 127230 117840 120308 137777 149422 159061 150723 155154 164791 177523 193962
9357 193962 202069 187526 188887 201365 204024 203130 224561 244693 246890 257786 265242 270346 284592
9344 284592 293668 291648 302650 316253 327738 335654 341045 350754 362716 362924 373832 395376 402650
9331 402650 413138 438933 470940 500170 519298 522540 536670 556732 575360 615491 653247 685631
9319 685631 716048 734339 746852 760511 788915 820251 849171 877619 912404 949556 981639 1015243
9307 1015243 1043475 1062473 1089073 1102287 1115636 1137522 1148682 1141462 1138749 1161846 1169362 1158961
9295 1158961 1145496 1135129 1132003 1130482 1119217 1089317 1080726 1066650 1040160 1001806 978821 948662
9283 948662 918621 900345 878341 841694 826897 829713 825063 790879 750593 715637 693023 678394
9271F78394j6424j7519o234k0672k3230l2080j9051k5632j8114o726k683n466
9259D84563j3223r213j707j3604k7587n545o232j5639k9877l052o384j4839m970
9246C32691r125j1701o295l25m767k0122J666r689j4572q002j2943n378M814j6682
9232B19570k3179j2180k80p35j4513j593l985q767J963M455L927J748l550K053
9218A64934q307k642j5904k469j2614k169J4064J5197r541j8893k0932N717J7571
9205A24012l396P663L91m375k1554r042L128R803m43n037j4284k686M353j013
9191H7520r19r646j3703j0638p004n976Q295J1856N874m119M039M87N32j2852
9177E3746p07K191p746Q64L535J3594Q961Q07j407p417j4237j893L503k65O421
$$ plain form
9271 678394 661970 644451 638217 617545 594315 562235 543184 517552 499438 492712 490029 484563
9259 484563 471340 462127 460420 446816 419229 413684 407452 391813 361936 358884 352500 337661 332691
9246 332691 323566 311865 305570 305245 300478 280356 282022 272333 257761 249759 236816 231438 236252 219570
9232 219570 196391 184211 183931 183196 168683 167090 163105 154338 156301 160756 164683 166431 162881 164934
9218 164934 156627 153985 138081 135612 122998 120829 134893 150090 140549 121656 100724 106441 124012
9205 124012 120616 128279 128670 124295 102741 93699 96827 106630 106187 101150 86866 84180 88533 87520
9191 87520 86601 76955 63252 52614 45610 39634 47929 59785 65659 61540 65579 66066 66598 53746
9177 53746 53039 55230 47484 48348 51883 65477 74438 75245 73838 66421 52184 50291 53794 53529 59950
9162E9950P356p56J451j3266j7864J1813q486L409N157n336j0242K546K448R440
9148D7620P03j0974Q97p61k400N622O30o620M837m421P724j1437j0230o60K994
9133B3524j562m288M687p044j680K455J972j182r342l248M599Q349K374J93l162
9118A6645J4708J1504j219p933p3k670j0580k939O212J0568J3225l58j3276o139
9104B7675P321Q195j0229q280K893K379N26j9379j96M309O922J2673j432j783
9090C1594J8014m266j0612p527n897j925M827O897j1242j563N830O690m811r900
9076A6109j1359l659K485P917K688R768M22m245p557Q279O841q931n859q17J5652
9061B7734K0718q276j1391r824N913N116q365p140J0446J4691j2677j9593p668
$$ plain form
9162 59950 67306 66550 68001 54735 36871 48684 40198 43607 48764 43428 33186 35732 38180 47620
9148 47620 48323 37349 38246 37485 35085 40707 41337 34717 39554 35133 42857 31420 21190 20530 23524
9133 23524 21962 17674 22361 15317 13637 16092 18064 16882 7540 4292 8891 17240 19614 19807 16645
9118 16645 31353 42857 41638 33705 33632 30962 20382 17443 23655 34223 47448 47090 33814 27675
9104 27675 34996 43191 32962 24682 27575 29954 30480 11101 10905 15214 22136 34809 33377 31594
9090 31594 49608 45342 34730 27203 21306 19381 24208 31105 19863 18300 24130 30820 26009 16109
9076 16109 4750 1091 3576 11493 14181 23949 24371 20126 12569 20848 27689 18758 12899 12082 27734
9061 27734 48452 40176 28785 18961 24874 29990 21625 14485 24931 39622 26945 7352 -316
9048c16p015j264J8068R640J55N039k950p964J330k968r19l92j0684o349R103
9033B514o99J270n050q224j1235J2419J2779K759O552L429l642O626n679K489
9019A6308R413m164j9527p794k31Q458J0302M21j9729J1446J1714j067j0570Q251
9005A3231l118q651J656j0212q531M647J0920K0601O247j4239k2759M440K880
8992b888N609Q9r279K587k313J776R611J6935P165j056P400k875p933n177j8386
8977A265q094L319P474R191j4861J0602P686n368K802j4235j3239Q184N177n907
8963f004K666J0497n280R790Q887o294J339n213j3969p07P460O326L211o131m509
8948B069j487n888J1456m019J588qk769m993P302R620j205j9508r578r76J5913
$$ plain form
9048 -316 -7331 -8595 9473 19113 19268 24307 21357 13393 14723 11755 10836 10444 -240 -6589 2514
9033 2514 1815 3085 -1965 -10189 -21424 -9005 3774 6533 13085 16514 12872 19498 13819 16308
9019 16308 25721 21557 2030 -5764 -5995 2463 12765 13186 -6543 4903 16617 15550 4980 13231
9005 13231 10113 1462 3118 -7094 -15625 -10978 -58 20543 26790 12551 -10208 -5768 -2888
8992 -2888 2721 2810 -6469 -3882 -6195 -4419 5192 22127 29292 28236 35636 32761 24828 19651 1265
8977 1265 -6829 -3510 3964 13155 -1706 8896 16582 11214 14016 -219 -13458 -5274 -97 -6004
8963 -6004 -3338 7159 1879 11669 20556 14262 15601 10388 -3581 -4288 3172 9498 12709 6578 2069
8948 2069 582 -5306 6150 2131 3719 3711 942 -4051 3251 12871 11666 -7842 -17420 -18396 -2483
8933b483n497M59N100o771m056Q922J0098L682j6562q527N042N93J1581k634P337
8918F284M154J1787j2832j4156J497P438N047k388L518J016j0683m717p875n603
8904a7513K772J0900o976j776O089J020k647J787pj2636J367r25O10J177J0722
8889f036K035j0847J609O811K921O310O498o898p257L05J1389O302K369L831j8339
8874A003n136N812P074n918m632J737R196Q864J0873j8084j0148R711l15J932
8860A1969n154q758K057J3660R471p166j0279j0601p5n365p949J7200m804K180
8846c614l231r576m48l656J4191J8966L417j7016j9516j685J2708R891O05N555
8832F591J817l513M703J4574l506q349j2091K981R33j0518j10j836L543J0005
$$ plain form
8933 -2483 -7980 -7521 -2421 -9192 -13248 -4326 5772 9454 -7108 -15635 -10593 -10000 1581 -1053 6284
8918 6284 10438 22225 9393 -4763 -3266 4172 9219 6831 10349 11365 682 -4035 -11910 -17513
8904 -17513 -14741 -3841 -10817 -12593 -6504 -5484 -8131 -6344 -6351 -18987 -17620 -18545 -17935 -16758 -6036
8889 -6036 -4001 -14848 -13239 -6428 -3507 2803 9301 2403 -4854 -4549 6840 13142 15511 19342 1003
8874 1003 -4133 1679 8753 2835 -1797 -60 9136 18000 28873 10789 641 10352 10037 11969
8860 11969 6815 -1943 114 13774 23245 16079 5800 -4801 -4876 -10241 -18190 -990 -5794 -3614
8846 -3614 -6845 -16421 -16869 -20525 -6334 12632 16049 -967 -20483 -22168 -9460 431 1036 6591
8832 6591 8408 4895 9598 24172 20666 12317 226 3207 4140 -6378 -6488 -8324 -4781 5224
8818E224J0219m549p570O527j2185M746m366M451N682N200r36j1229j408m058
8804d252k081p58M65K275K250J005L407o90J2678l055j7160M909M483o033L758
8789A201J069J179K242n341R615n707j3771k5074l022J9053J0279J0733l136n763
8775f443O218M396o984O15J1588r99j560j6035j4159j275K256N628o761k250k792
8760b8557q539J0785J5840P773J6073m061j2359L177J353q902N247K0732K170
8747B0732j0402q722q032J1184J9369k229m20k017o961J292o251l043O637n023
8733F114j2612K249m003n573j219Q476J0000j612j227M977n507Q375j870q810
8719b242n818Q699K496Q19m98K090L527n043j8627K162Q275J657J440J271q257
$$ plain form
8818 5224 15443 10894 3324 9851 -2334 2412 -1954 2497 8179 13379 12443 1214 -194 -4252
8804 -4252 -6333 -7091 -6626 -4351 -2101 -1096 2311 1621 14299 11244 -5916 -1007 3476 -2557 1201
8789 1201 2270 3449 5691 350 9965 4258 -9513 -34587 -37609 -18556 -8277 2456 -680 -6443
8775 -6443 -225 4171 -2813 -2198 9390 8391 6831 -9204 -23363 -24638 -22382 -16754 -23515 -25765 -28557
8760 -28557 -37096 -26311 -10471 -2698 13375 9314 -3045 132 1485 -7417 -2170 18562 20732
8747 20732 10330 1608 -6424 4760 24129 21900 21480 19463 12502 13794 7543 4500 11137 6114
8733 6114 -6498 -4249 -8252 -13825 -15044 -6568 3432 1820 593 5570 63 8438 6568 -2242
8719 -2242 -8060 639 3135 3954 3456 5546 9073 4030 -14597 -12435 -4160 -2503 -1063 208 -8049
8704h049PR81K074L864K875k998j1655N141J0942N442j4530L372L804P873N233
8689A4376j0084q086J1107m441j180r11l268M583k025J099P639P979Q410k895
8675B2303l327r185l541j505k628n607L53q574n966J851M040J5052r91k542j275
8660a542j053J0067l664o43N127o013n651n763L449K293l679K917K0330o330q747
8645A098l952J1868L757p807o493J523j0144J805o24k112Q864J1682K521p126
8631D860j015j1927N24J0674N030n738j3951n807J9744J4925j0766q712J6722
8618A4563J9340k272m651k1098N719O78m288J385m312K11k380m647j243K396n703
8603f302k677p636k696J5880M972J4761m191m353L030J95R007m946o838p173o610
$$ plain form
8704 -8049 -8042 -7061 -4987 -1123 1752 -1246 -12901 -7760 3182 8624 -5906 -2534 1270 9143 14376
8689 14376 4292 -3794 7313 2872 1692 781 -2487 2096 71 1170 8809 16788 25198 22303
8675 22303 18976 9791 6250 4745 2117 -3490 -3137 -11711 -17677 -15826 -11786 3266 2275 -267 -1542
8660 -1542 -2595 7472 3808 3165 8292 2279 -3372 -9135 -5686 -3393 -7072 -4155 16175 9845 1098
8645 1098 -2854 9014 12771 4964 -1529 -6 -10150 -8345 -8969 -11081 -2217 9465 11986 4860
8631 4860 3845 -8082 -7558 3116 8146 2408 -11543 -17350 2394 17319 6553 -2159 14563
8618 14563 33903 31631 26980 5882 11601 12279 7991 9376 5064 5275 2895 -1752 -2995 -599 -6302
8603 -6302 -8979 -16615 -19311 -3431 1541 16302 12111 7758 10788 10983 19990 15044 8206 1033 -5577
8588e577R642M98M31j4495j174Q744j557K694p720O814O868R58l617n806l342
8573f639n63N656K688l182r814n152J3668J2308Q946j4847p028l091j411J635
8559f826j2205l988J1452J6974j75r237K183J324n399L105p258m499N743K616
8545f190j0916L197J5490J0327N545k506L836p318j1603q416m74k292K243L251
8531e826M784K758n724K408L102K3975P12m616p314p659j2418L000L869r925N456
8516c418l412P521R892Q752m768k516k879r804p081o77r949p574J2356J951K374
8501i232o95n390r18q416j673o507J2469K611n451j092j0188L534J2957J2313
8487e678K190N801r515j059Q331r37K41K722j872k916J7168j942j2427p525o553
$$ plain form
8588 -5577 4065 4563 4994 -9501 -10675 -1931 -3488 -794 -8514 -1700 5168 6126 2509 -3297 -6639
8573 -6639 -7202 -1546 1142 -2040 -11854 -17006 -3338 8970 17916 3069 -3959 -7050 -8461 -6826
8559 -6826 -19031 -23019 -11567 5407 5232 -4005 -1822 -498 -5897 -2792 -10050 -14549 -8806 -6190
8545 -6190 -17106 -13909 1581 11908 17453 14947 18783 11465 -138 -8554 -9028 -11320 -9077 -5826
8531 -5826 -1042 1716 -4008 -1600 1502 25477 26189 21573 14259 6600 -5818 -2818 1051 -8874 -3418
8516 -3418 -6830 691 10583 19335 14567 12051 9172 -632 -7713 -8390 -18339 -25913 -13557 -11606 -9232
8501 -9232 -9927 -15317 -16235 -24651 -26324 -32831 -20362 -17751 -23202 -24294 -34482 -30948 -17991 -5678
8487 -5678 -3488 2313 -7202 -8261 70 -867 -626 2096 224 -2692 14476 12534 107 -7418 -13971
8472a3971Q253J2567J249O212o261n462L101P172o564M480k481M342K10j6069
8458c222o719P062j1704P942Q799Q038m04M135N638l276N534M407p072k420P195
8443B3933j0847j1084p700R345Q946o29J4474m220m200q264l771k777n561P669
8429E314N978l69J2331P513P096j5480l685L268j4498l418m670L520o329p841
8415a1270K029M616J8954J4641q205j0915l839o58M359r56L787J4036J569J470
8401B9618j0394j5247m454j2993J1851J3692O841J3777j3354k3709k931M256N803
8388B756J3070J1089J2576L742L470j0606k5218k771R021q914K021l013q902R55
8374g24p449R584J0505J355J0722M459k752j6913j5065o616p979J0258J2192O127
$$ plain form
8472 -13971 -5718 6849 8098 14310 8049 2587 5688 12860 6296 10776 8295 12637 12847 -3222
8458 -3222 -9941 -2879 -14583 -6641 2158 10196 9792 13927 19565 16289 21823 26230 19158 16738 23933
8443 23933 13086 2002 -5698 3647 12593 11964 26438 22218 18018 9754 5983 3206 -2355 5314
8429 5314 11292 10923 23254 30767 37863 22383 18698 21966 7468 4050 -620 2900 -3429 -11270
8415 -11270 -9241 -4625 14329 28970 20765 9850 6011 5353 9712 8756 12543 26579 28148 29618
8401 29618 19224 3977 -477 -13470 -1619 12073 18914 32691 19337 -4372 -7303 -3047 2756
8388 2756 15826 26915 39491 43233 46703 36097 10879 8108 17129 8215 10236 7223 -1679 -724
8374 -724 -8173 1411 11916 13271 23993 28452 25700 8787 -6278 -12894 -20873 -10615 1577 7704
8360G704L027k17M698O616k963j7409J5066J7171m00l067J0295k31l866j5719
8346B0705m298N850j3492r609k234K080R4n427m048l480J9826P537r552m893n377
8331f318K994N447P32q193j052J3381J3040J828p386j1259L983P744j0788o017
8317a864j1794J2629J3753N488m770n516r030J145J0198k579q618M3R491M870
8303A3446j0854k815l15n727l547j7147R353J4629k753p380M487l011m99Q434
8289c699M239r624m582r791J6493J0341j654j079j611q122m712P401J4231J390
8275I221o74p797j3591M770l991L940J0844p890j8886p816O662J1363O766q381
8261a5460O60l5k91n774l837Q718O425q063n527M082J2170R62p053L452J0685
$$ plain form
8360 7704 10731 10514 15212 21828 18865 1456 16522 33693 33293 30226 40521 40290 36424 20705
8346 20705 16407 22257 8765 -844 -3078 -998 -904 -6331 -10379 -13859 5967 13504 3952 -941 -6318
8331 -6318 -3324 2123 2855 -5338 -6390 6991 20031 21859 14473 3214 7197 14941 4153 -1864
8317 -1864 -13658 -1029 12724 18212 13442 7926 -1104 41 10239 7660 -958 -915 8576 13446
8303 13446 2592 -223 -538 -6265 -9812 -26959 -17606 -2977 -5730 -13110 -8623 -11634 -12133 -3699
8289 -3699 540 -9084 -13666 -23457 -6964 3377 1723 644 -967 -9089 -13801 -6400 7831 9221
8275 9221 8547 750 -12841 -8071 -12062 -8122 2722 -5168 -24054 -31870 -25208 -13845 -7079 -15460
8261 -15460 -14800 -14835 -15126 -20900 -24737 -16019 -9594 -17657 -23184 -19102 -6932 -5970 -13023 -9571 1114
8246A114J3594J38N332k393k885k767l832q719p660J470K354j0033K84R800M484
8231B81p646p583q314J3373J1872k855k861M358m887J141J2609J2479j236l264
8217A7467j5526j1705Q983K130l056Q249q275p016m175j436o6J3307J1906N611
8203A6398j1844j1337p845P486P07o203R71L243P351j488j413r522Q955n678j7209
8188b7428j64M270P247N903J614Q408J87q147n835k171j485N734K425m653j6291
8173c0386J155J721J7529J0968o831j0766m807J1779J6258n789o575k280q73K625
8159f272O110j836n776P180N913l677p368k599Q31R362L837o047n117j0224Q588
8144g095J357j6048L346r045J0219K2209M225J667n436j2918o63r64j0198P727
$$ plain form
8246 1114 14708 14846 20178 17785 14900 12133 8301 -418 -8078 -6608 -4254 -14287 -14003 -4203 281
8231 281 -7365 -14948 -23262 -9889 1983 -872 -3733 625 -4262 -3121 9488 21967 20731 17467
8217 17467 1941 -9764 -781 1349 -1707 6542 -1733 -8749 -12924 -14360 -14426 -1119 10787 16398
8203 16398 4554 -6783 -14628 -7142 -6435 -12638 -11667 -8424 -1073 -2561 -3974 -13496 -4541 -10219 -27428
8188 -27428 -27592 -23322 -16075 -10172 -8558 -150 37 -8110 -13945 -16116 -17601 -11867 -9442 -14095 -30386
8173 -30386 -29231 -27510 -9981 987 -5844 -16610 -21417 -9638 6620 831 -5744 -8024 -8897 -6272
8159 -6272 -162 -1998 -7774 -594 5319 1642 -5726 -8325 -7494 1868 5705 -342 -5459 -15683 -7095
8144 -7095 -5738 -21786 -18440 -27485 -17266 4943 9168 10835 5399 -7519 -8182 -9146 -19344 -11617
8130a1617N074J0309L288J3668J3766M07n426j082j1016j7029P631j662o608L505
8116C208J213j223J4081M281J1106o656q075O81R91q30o273j817l300j406J3659
8101A9640J1269m602n799p496n877k128p078J1878p687j5425k557M016j3870L11
8087b5405J6860j146o311m949R903J3976K528q859q619J5656J891l943n394j163
8073d975j1557J4715J0433L92j1451k699Q936m501j363R878K527j0071m822m677
8059i235L504N497q17q181J4759J4146j1074j1699Q083j934J349l709j4405M253
8045i463m334M844K501M934N797M829P44m275n280k315m91o56j225l190l390L288
8029g682O732l594j008J2455J3608j3419l782o84o889Q588J982O105J9085O919
$$ plain form
8130 -11617 -6543 3766 7054 20722 34488 34895 29469 28387 17371 342 7973 6311 -297 3208
8116 3208 4421 3198 17279 21560 32666 26010 17935 18616 19607 18777 12504 10687 7387 5981 19640
8101 19640 30909 26307 20508 13012 7135 5007 -2071 9807 2120 -13305 -15862 -11846 -25716 -25405
8087 -25405 -8545 -9691 -16002 -20951 -11048 2928 5456 -3403 -12022 3634 5525 1582 -3812 -4975
8073 -4975 -16532 -1817 8616 9008 -2443 -5142 3794 -707 -2070 7808 10335 264 -4558 -9235
8059 -9235 -5731 -234 -1051 -9232 5527 19673 8599 -3100 4983 3049 4398 689 -13716 -9463
8045 -9463 -13797 -8953 -6452 -1518 4279 9108 9852 5577 297 -2018 -2509 -3165 -4390 -7580 -10970 -7682
8029 -7682 -950 -4544 -5552 6903 20511 7092 3310 2626 -4263 4325 6307 12412 31497 38416
8015C8416q546k5015j6022n781N820J6524R696J2667n302m756m064K100M966R055
8001B9758j1037n953j1086k120p694j7163R6L3285m78p115L027K858J0093O831
7987B3302n033j0233q601l404p407j6219J1362J5120J613k052J914m562L342R706
7973H848N661j0890j0924p22J3452P918m831o863K338J5671k184j6879M841l544
7959A892m541j778J5445n355o703N575J87k183j2330o62j2258J4010J3162P627
7945A2088k1024o781Q931Q641j136M586J1995q173k338j5195K9J0242p183J1072
7931E754M279M857k424k803r021p290n043J0891Q435K474P469l873R407P597o287
7916B4422j7274j8596R839J1117K475j3175j5712L178P527M293K891L691l136
$$ plain form
8015 38416 29870 4855 -11167 -16948 -11128 5396 15092 27759 22457 17701 13637 15737 20703 29758
8001 29758 18721 12768 1682 -438 -8132 -25295 -25199 8086 7608 493 3520 6378 16471 23302
7987 23302 18269 8036 -565 -3969 -11376 -27595 -16233 -1113 500 -1552 362 -4200 -858 8848
7973 8848 14509 3619 -7305 -8027 5425 13343 8512 1649 3987 19658 17474 595 5436 1892
7959 1892 -2649 -4427 11018 5663 -1040 4535 4722 2539 -9791 -10453 -22711 -8701 4461 12088
7945 12088 -8936 -15717 -6786 1855 719 5305 17300 9127 6789 -8406 -8377 1865 -5318 5754
7931 5754 10033 14890 12466 9663 642 -6648 -11691 -800 7635 10109 17578 13705 23112 30709 24422
7916 24422 7148 -11448 -1609 9508 11983 -1192 -16904 -13726 -6199 -1906 985 4676 1540
7903A540K554j0234k061J007Q157O840m528M831k99j2492j247Q935P811J012j5120
7888c294j6432J4828K0643J3229j1386j5344r946J3650J932k014o286l741J0738
7875F577P293q37l828q226j2105N937l349K94O542R679M10k790o287o771p317
7860a4778J5056K647J580L641O95N017l018O789L947k293L849k621j1412M494
7846A3593k684m077K800k430k1263j1476J3493N853Q470o02P470J1116k604j5502
7832B157j1649M052M9N708J7390k10k0997O762K1019j298O738m448k1234k4298
7818b0259J849J0755j064q902Q823J2189q560J948P787J3345m479M011O609K98
7804B4350L582m982j7519p014J903Q006K55M818p918n046N807q488j2960J311
$$ plain form
7903 1540 4094 -6140 -8201 -7194 963 7803 3275 8106 7807 -4685 -5932 3003 10814 11826 -3294
7888 -3294 -19726 -4898 15745 28974 17588 2244 -7702 5948 7880 5866 -420 -4161 6577
7875 6577 13870 13033 9205 979 -11126 -5189 -8538 -8244 -1702 7977 8387 5597 -690 -7461 -14778
7860 -14778 278 2925 4505 8146 8841 13858 10840 17629 21576 19283 23132 20511 9099 13593
7846 13593 10909 6832 9632 7202 -14061 -25537 -12044 -6191 2279 1677 9147 20263 17659 2157
7832 2157 -9492 -5440 -5391 317 17707 17497 -3500 3262 24281 22983 29721 25273 4039 -20259
7818 -20259 -18410 -7655 -8719 -17621 -8798 3391 -5169 -3221 4566 17911 13432 17443 24052 24350
7804 24350 27932 22950 5431 -1583 320 8326 8581 13399 5481 435 6242 -2246 -15206 -13895
7790a3895n866J3017l245Rr91J1280O417m897j0530k861O47J8565M443o516j0155
7775d578K61R84L812R399J2643J0012m912j3607j3135l518J3069r194l111j077
7761b952l887J3938Q101r343N008K0334k324L797j540k2370k4076j3175K2379
7748f110J2073m327l685j84r776R477J1333o997k486j2691j0062J7664K13k0138
7734b5696n208Q325J3574l022J363R636J1783J797n033j1481j363L457Q244J317
7720G693k669m114O45K207J205j165O156O957j45j979j1108j5451q232J0322J7309
7705G631p194k556J20l226m723Q174K081J3872Q005L61m600j7363j4420k076Q359
7690g555K938n88r795l790R551n532j4930o771K7345J3202q013m372r34J2446
$$ plain form
7790 -13895 -19761 -6744 -9989 -9980 -10971 309 6726 1829 -8701 -11562 -10915 7650 12093 5577 -4578
7775 -4578 -4317 -3333 479 9878 22521 32533 27621 14014 879 -2639 10430 1236 -1875 -2952
7761 -2952 -6839 7099 15200 5857 10865 31199 28875 32672 31132 8762 -15314 -28489 -6110
7748 -6110 5963 1636 -2049 -2233 -12009 -2532 8801 1804 -682 -13373 -23435 -5771 -5558 -25696
7734 -25696 -30904 -22579 -9005 -12027 -10664 -1028 10755 12552 7519 -3962 -5325 -1868 6376 7693
7720 7693 5024 910 1555 3762 4967 3802 9958 16915 16770 14791 3683 -11768 -20000 -9678 7631
7705 7631 437 -2119 -1999 -5225 -9948 -1774 307 14179 22184 22545 17945 582 -13838 -15914 -7555
7690 -7555 -4617 -5205 -15000 -18790 -9239 -14771 -29701 -36472 -9127 4075 -3938 -8310 -9244 3202
7676C202j7653n879P147K910q253m718M092K719K082K574n00j138j475l370m667
7661b2927L887n11J552M833J4842N61J665J729l989n152J293j52o222n100R914
7646c777L962k843P869J2110r609k977o670o953o185m773L448j667J3010M218
7632h37n342O691L473j0530m014k059j8376m309K6034J9953p329n649J0368m825
7618C249m5J0088p470L42j2796n728P544J1882j0027K023L569R33M761M959o853
7603F431j1014M820K349o422J2085J0052J203k775j0907n861l108P494J1636j1433
7589D550n575M415K034k141M337l494K387J2423q285l906l128k61P74L572m440
7574C262n793N416n222O951K124o806r242j148J824k3620r95J7326J250J1884
$$ plain form
7676 3202 -14451 -20330 -13183 -10273 -18526 -23244 -19152 -16433 -14351 -11777 -12277 -13415 -14890 -18260 -22927
7661 -22927 -19040 -19551 -17999 -13166 1676 2237 3902 5631 1642 -3510 -2217 -2369 -8591 -13691 -3777
7646 -3777 185 -2658 5211 17321 7712 4735 -1935 -8888 -15073 -19846 -16398 -18065 -5055 -837
7632 -837 -6179 512 3985 -6545 -10559 -12618 -30994 -35303 -9269 10684 3355 -2294 8074 3249
7618 3249 3204 13292 5822 6164 -6632 -12360 -4816 7066 -2961 -938 2631 3564 8325 13284 6431
7603 6431 -4583 237 2586 -3836 8249 18301 19504 16729 5822 -39 -3147 4347 15983 4550
7589 4550 -1025 3390 5424 3283 7620 4126 6513 18936 10651 6745 3617 3356 4130 7702 3262
7574 3262 -2531 2885 -2337 4614 6738 -68 -9310 -10458 -8634 -32254 -33249 -15923 -14673 -2789
7560b789J702Q43O628J545p969q561Q66J7322o12j5593J045J0932N558L907k107
7545A2717p216j4023o332O247J911K466l591L710l591m639J819M685o275k611
7531a4723K675P310L476k709j2636j0009K01j1631K1063J5152L202k056j208l221
7517e114r487j676n561p719J0221J4332J9524l632K138m476j2210p873L08L234
7503g991L840k431j0256j571L036n163J539J5867L093q143J176J2659R308n190
7489I773Q9q554l700O547Q746n713j5262q43q193n695M38K598R650M405l86p830
7473a3930n576O086m671K542J3082j0577M245P697m016r220m162J0494J5808M357
7459A2159p911j7842l253P630k32j211M033m105j514O838R954m638K57n852J239
$$ plain form
7560 -2789 -1087 -244 6384 7929 -40 -8601 -7735 9587 8975 -6618 -5573 5359 10917 14824 12717
7545 12717 5501 -8522 -14854 -8607 -6696 -4230 -7821 -4111 -7702 -12341 -10522 -5837 -12112 -14723
7531 -14723 -12048 -4738 -1262 -3971 -16607 -26616 -26415 -38046 -16983 -1831 1371 -685 -1893 -5114
7517 -5114 -14601 -16277 -21838 -29557 -19336 -5004 14520 10888 13026 8550 -3660 -11533 -11225 -7991
7503 -7991 -4151 -6582 -16838 -18409 -15373 -20536 -18997 -3130 -37 -8180 -7004 5655 14963 9773
7489 9773 9862 1308 -2392 4155 12901 7188 -8074 -8917 -17110 -22805 -22367 -19769 -10119 -5714 -6100 -13930
7473 -13930 -19506 -13420 -18091 -15549 -2467 -13044 -8799 -1102 -5118 -14338 -18500 -8006 7802 12159
7459 12159 4248 -13594 -16847 -9217 -9449 -10660 -6627 -10732 -12246 -5408 4546 -92 165 -5687 -4448
7444d448q195m564O321m333n362l29P529Q35L832M128Q458J1728n038o720j5624
7429a1782l674J2344O795L050Q942l388k1365j6416M99k408N738j882P546K393
7415a3608q910r73N507r60o737J285Q430n982l675O898J0695J6025J1440r705
7401I730L58j0407j1326O381O594J908n754j4353O685J3205j5323o527p222j0408
7387c6459m964K0022K0795J1093o604m458j2728p484J70J5474P097m417J212O566
7373E315O379M800J659K067p503m048l984N196j4240N915K673l910K223J1739
7359A4281J0723k2599j4972L689P957J5483O167M60o50L22j0716j2672j165j91
7345c883p537R626R018j1604R362q676r353k95P115P672J2962o726j5637q366
$$ plain form
7444 -4448 -12643 -17207 -10886 -15219 -20581 -20910 -13381 -12546 -8714 -4586 3872 15600 10562 3842 -11782
7429 -11782 -15456 -3112 3683 6733 15675 12287 -9078 -25494 -24995 -27403 -21665 -23547 -16001 -13608
7415 -13608 -22518 -23491 -17984 -18944 -25681 -24396 -15966 -21948 -25623 -18725 -8030 7995 19435 9730
7401 9730 10088 -319 -11645 -5264 1330 3238 -2516 -16869 -10184 3021 -12302 -18829 -26051 -36459
7387 -36459 -41423 -21401 -606 10487 3883 -575 -13303 -20787 -20617 -5143 1954 -2463 -1251 5315
7373 5315 11694 16494 18153 20220 12717 8669 4685 9881 -4359 1556 4229 319 2542 14281
7359 14281 25004 2405 -12567 -8878 -921 14562 20729 21189 20539 20861 10145 -2527 -3692 -3883
7345 -3883 -11420 -1794 7224 -4380 4982 -3694 -13047 -13342 -6227 1445 14407 7681 -7956 -16322
7331a6322L828K701j1113L803p685m826m158m767J0888R363j822L825K696J1029
7317b560k81n871J231J882N83l978K11o517j1454J3912J4649M856n447j4766n923
7302a9473R108K0415L883l734L650q54l406M540O736m267j9093L728O515R662
7288A7410o25j9122l324n511M20J33K455J1964O532J412k161j2787M657O371q713
7273h89j077l234m846j4665r2J4957j827k11p766o101L037o862o77l973j951L607
7257c2570L741J5770M118L033R03N827j0227k606K36J688O660J20R280M934k855
7242H052J541L262k519j5903k765j1089j996p825M1J2904Q732M643J0939O355
7228A4372J6483K3152n026j3200o883r518q114k5395m538Q628p160M229J4419
$$ plain form
7331 -16322 -12494 -9793 -20906 -17103 -24788 -29614 -33772 -38539 -27651 -18288 -20110 -16285 -13589 -2560
7317 -2560 -2841 -8712 -7481 -5599 -5016 -8994 -8783 -15300 -26754 -12842 1807 6663 1216 -13550 -19473
7302 -19473 -10365 10050 13933 10199 13849 12995 9589 14129 20865 16598 -2495 1233 7748 17410
7288 17410 16785 -2337 -5661 -11172 -10752 -10619 -8164 3800 10332 11744 9583 -3204 1453 7824 -889
7273 -889 -1966 -5200 -10046 -24711 -24803 -9846 -11673 -11884 -19650 -25751 -22714 -29576 -30253 -34226 -36177 -32570
7257 -32570 -28829 -13059 -8941 -5908 -5005 822 -9405 -12011 -11775 -10087 -3427 -3307 5973 10907 8052
7242 8052 9593 12855 10336 -5567 -8332 -19421 -21417 -29242 -29201 -16297 -7565 -2922 8017 14372
7228 14372 30855 54007 48981 35781 28898 19380 11266 -14129 -18667 -10039 -17199 -12970 1449
7215A449L177m093Q236N132k5517j231N506J993r965j498O202L79J1054O280O70
7200G774K231l230n927K370j1037o9J3078L268P577J2831j4851j4882j1423j0200
7186b2490j915K914O39p00O654L399k851r02N537J74l531M969j3729K36J2563
7171i033J5626L27j113n450K157j474j2911j0227J9276J7363L379k3613j1441
7158a7134Q368p10j541M668o70L212j3965J552J0909p925j6867k428N072J2033
7144a5426N592L469J4343N018k3289r989P270Q183P100o572J506J1743J4923K531
7130B6402j1827n362m093j2102J10J2064q141o229J114m001Q220n71Q506N355
7116I445n575j3786O43O033m96K198K580j2952k440R38k588m087R862J1250K964
$$ plain form
7215 1449 4626 533 8769 13901 -11616 -12847 -7341 -5348 -15313 -16811 -10609 -10230 824 7104 7774
7200 7774 10005 6775 848 3218 -7819 -7888 5190 8458 16035 28866 14015 -867 -12290 -22490
7186 -22490 -24405 -21491 -20852 -21552 -14898 -11499 -14350 -15252 -9715 -9541 -13072 -8103 -21832 -21596 -9033
7171 -9033 6593 6920 5807 357 2514 1040 -11871 -22098 -2822 14541 17920 -5693 -17134
7158 -17134 -8766 -9476 -11017 -6349 -7019 -3807 -17772 -16220 -5311 -13236 -30103 -32531 -27459 -15426
7144 -15426 -9834 -6365 7978 12996 -10293 -20282 -13012 -4829 2271 -4301 -2795 8948 23871 26402
7130 26402 14575 9213 5120 -6982 -6872 5192 -2949 -9178 -8064 -12065 -3845 -4416 4090 9445
7116 9445 3870 -9916 -9273 -3240 -3736 -1538 1042 -11910 -14350 -13412 -16000 -20087 -10225 1025 3989
7101C989j8882q064l541J2736K0719r684Q77L882j2659o433p619J6827R394j348
7087A94l58J213J6620O296p540n622r095M904o682r438j5739r635J3006P457k334
7072a6753R75K4306j898k450R377l323j7117j2214l188J745O741m871l56Q682
7058a0344j573Q351L547J0463R72L50K611O843q036j4898L146J0864O653J1179
7044C0128p554L678J1779j1647o821k811n132k071J128j72q901q191O050Q424
7030G887J4149r355o874q859q512J77J3369Q532J101m92o672J044m076j1092P524
7015b149M789L707P38J0608N666J993k397l968J482K614m303k117l426n432L96
7000H201j875o798P379J5812l446j7714j5761N082j280l091M472Q677N656o597
$$ plain form
7101 3989 -14893 -22957 -26498 -13762 6957 -2727 -1850 2032 -10627 -17060 -24679 -7852 1542 194
7087 194 -164 1049 17669 23965 16425 10803 1708 6612 -70 -9508 -25247 -34882 -21876 -14419 -16753
7072 -16753 -15778 8528 6630 4180 13557 10234 -6883 -19097 -22285 -20540 -13799 -18670 -19026 -10344
7058 -10344 -11917 -3566 -19 10444 11416 11766 14377 21220 13184 -1714 1432 12296 18949 30128
7044 30128 22574 26252 38031 26384 19563 16752 11620 9549 10677 10505 1604 -6587 -537 7887
7030 7887 22036 12681 5807 -3052 -11564 -11387 1982 10514 11615 11123 4451 5495 1419 -9673 -2149
7015 -2149 2640 6347 7085 17693 23359 25352 22955 18987 20469 23083 18780 16663 13237 7805 8201
7000 8201 6326 -472 6907 22719 19273 1559 -14202 -9120 -10400 -13491 -9019 -342 5314 -1283
6986a283o896m28J8462q72n333J790J025J653m581q862J0336j284J1117Q034Q106
6971C0984J2852j1266q577j5330j9679k203m243k504p47r657j120P522J3219m594
6957a5343O827J632M919j645j923J2730p279j6470m452O587J807J0005R948j1585
6943d242k4885j566k089J0741J0483J2937J1278L115j2048j575J249m04j2741
6930i747K731K865n20J653k738R323O760p663j4477K792j62J58M825n248j5253
6915b4701K96J0818J1276M159r465r019J2948J508J162K699j1439m812J2629O523
6901D582j1651l761n374J8854n368j4662p529O570p419M424J6093N761J642m405
6887b243m259l791k828n341J7786l735O339k227n258r83j0226k944k879L944P638
$$ plain form
6986 -1283 -8179 -8607 9855 8983 3650 5440 6465 8118 3537 -5325 5011 3727 14844 22878 30984
6971 30984 43836 32570 23993 8663 -11016 -13219 -17462 -19966 -20713 -30370 -31490 -23968 -10749 -15343
6957 -15343 -8516 -6884 -1965 -3610 -5533 7197 -82 -16552 -21004 -14417 -12610 -2605 7343 -4242
6943 -4242 -29127 -30693 -32782 -22041 -11558 1379 12657 15772 3724 2149 3398 2994 -9747
6930 -9747 -7016 -4151 -4671 -3018 -5756 3567 10327 2664 -11813 -9021 -9183 -9025 -4200 -9448 -24701
6915 -24701 -24405 -13587 -2311 1848 -7617 -16636 -3688 -2180 -1018 1681 -9758 -14570 -1941 4582
6901 4582 -7069 -10830 -16204 2650 -2718 -17380 -24909 -18339 -25758 -21334 -5241 520 2162 -2243
6887 -2243 -6502 -10293 -13121 -18462 -676 -4411 1928 -299 -5557 -6540 -16766 -19710 -22589 -18645 -11007
6872a1007m275N208q43M146P285Q310n943j2186k891J2922J9927m538O79k732
6858A4062l769j9349j0910p361m729J8345J1002q458m360L887m825L650L455k466
6844a1826J8191J936o173k065l056J4294N094j1145L909O063m797L56j375l117
6830F289J1549P208q186j1297j4510N57j970M905J518N24r82j4986k316K731L679
6815a5287N239j0312r525J0727J646Q230J7698J1483o419r089q321j953J551R883
6801E551N935k482N206q397n240K553l407P737k917r342R400P133q763j2293j188
6786a0514J2613j972q859j2904Q227p383K37r644j20J0186K6M065Q193Q529L073
6771C753L020k085Q26q714l541k604O269O40L010o521n154O62J830O359J4310
$$ plain form
6872 -11007 -15282 -10074 -10917 -6771 514 8824 2881 -9305 -12196 726 20653 16115 16794 14062
6858 14062 10293 -9056 -19966 -27327 -32056 -13711 -2709 -11167 -15527 -11640 -16465 -12815 -9360 -11826
6844 -11826 6365 8301 2128 63 -2993 11301 16395 5250 9159 15222 10425 10781 9406 6289
6830 6289 17838 25046 16860 5563 -8947 -8390 -10360 -5455 -3937 -3413 -4395 -19381 -21697 -18966 -15287
6815 -15287 -10048 -20360 -29885 -19158 -17512 -9282 8416 19899 13480 4391 -3930 -5883 -4332 5551
6801 5551 11486 9004 14210 5813 573 3126 -281 7456 4539 -4803 4597 11730 2967 -9326 -10514
6786 -10514 2099 127 -8732 -21636 -13409 -20792 -20555 -30199 -30319 -20133 -20107 -16042 -7849 680 3753
6771 3753 6773 4688 5514 -3200 -6741 -9345 -3076 -2436 574 -5947 -11101 -10439 -8609 -2250 12060
6756A2060O735n07m328j6157n241o027q66R539K76K44J697k813k627J818k426
6741h623n100P742r74o636N310L947j795L24m34P461j2575R448R425k987r192
6726d659N557L207j226K061p519m392j1200l854J1041N039n473K396J926J177
6712e919l34j976j326L022j1547k05O420J0628K013j2053n392R003L637j71n774
6697i974p28J714L378m392N80M29k009J0245Q061j2626q138m064J1065q112r82
6682a5553J1562O541l406N872M356Q760r302p034o572O709J4150N153r348j2053
6668a65o548j6365j5836L741J4023J0617N260N050r24j5406M442K821K338K089
6654d863J328J923n691J42J5544k513j575K98m11M888j0265Q48m438m632k4K934
$$ plain form
6756 12060 18795 18288 13960 -2197 -7438 -13465 -14331 -4792 -4516 -4272 -2575 -5388 -8015 -6197 -8623
6741 -8623 -13723 -5981 -6955 -13591 -8281 -4334 -6129 -5805 -6239 1222 -11353 -1905 7520 4533 -4659
6726 -4659 898 4105 2879 4940 -2579 -6971 -18171 -22025 -10984 -5945 -11418 -9022 -7096 -5919
6712 -5919 -6253 -8229 -9555 -6533 -18080 -18285 -11865 -1237 776 -11277 -16669 -7666 -4029 -4200 -9974
6697 -9974 -10702 -8988 -5610 -10002 -9422 -8993 -11002 -757 7304 -5322 -13460 -17524 -6459 -14571 -15553
6682 -15553 -3991 2550 -856 5016 9372 18132 8830 1796 -4776 1933 16083 21236 11888 -165
6668 -165 -6713 -23078 -38914 -35173 -21150 -10533 -5273 -223 -1147 -16553 -12111 -9290 -6952 -4863
6654 -4863 -3535 -1612 -7303 -7161 8383 5870 4295 4593 4182 9070 -1195 -347 -4785 -9417 -9441 -6507
6638f507l462n338J1774R520N196K342j0727m045L350K446M02j5072q459J299
6624a7281K496J768l384J3334r434J631n230j0775J2066J0193l950o908J0341
6611e133L257k702P8L35k397J1436P216j5085q852R369p758n950r024O243L87
6596a8580R649O842j0057k634J747R82p49O331J232L453l555Q031J480k542n195
6581c565n696m912P972P449j747m650K252R900M588m520l859L181o886o025o56
6566g174R82M943M272N69J0140M441o471m681q466r970L720j1738j214J1786L573
6551e288k221P106n184M17M435O738J0083P172P666j0319j1159L219j4917r388
6537a1640n021j387O361Q800Q12L242k584M872P334k48P213j4366l912J3020n385
$$ plain form
6638 -6507 -9969 -15307 -3533 5987 11183 13525 2798 -1247 2103 4549 4951 -10121 -18580 -17281
6624 -17281 -14785 -13017 -16401 -3067 -12501 -10870 -16100 -26875 -14809 -4616 -8566 -15474 -5133
6611 -5133 -1876 -4578 -4500 -4165 -6562 4874 12090 -2995 -11847 -2478 -10236 -16186 -25210 -18967 -18580
6596 -18580 -8931 -2089 -12146 -14780 -13033 -12051 -12800 -6469 -5237 -1784 -5339 2692 4172 1630 -3565
6581 -3565 -9261 -14173 -6201 1248 -499 -5149 -2897 7003 11591 7071 3212 6393 -493 -6518 -7174
6566 -7174 -6192 -1249 3023 3592 13732 18173 11702 7021 -1445 -11415 -7695 -19433 -20647 -8861 -5288
6551 -5288 -7509 -403 -5587 -5170 -735 6003 16086 23258 30924 20605 9446 12665 -2252 -11640
6537 -11640 -16661 -18048 -11687 -2887 -2075 1167 -1417 3455 10789 10541 17754 3388 -524 12496 7111
6522G111r720n990n179j439J1502J3040n205o483n741k726M580M449J1599j0022
6508b24n989N259j0678p389P322j1782p216R330M541K370O648L030j1890J439
6494a5229j07k212k493o230q552L32R991J1221Q186k472k627r795j343K79n722
6479b6773P845Q411J0789m035j558m613r38r586k995M240n352J152o741M983J7584
6464g587K74J454L245R69j2445r763J7250O381m071m189l642L976J95N071l551
6449f433q707J190l661j0417l362P711Q375O870J1949O564k969m129K542j1640
6435f117J603P622k295K0187P866j6887j1285k822j398o974k502q609j503K583
6421b0531J362J17J9167J1219J933q693M594j0234K327k239k659J25K937l127
$$ plain form
6522 7111 -2609 -8599 -13778 -15217 -3715 9325 4120 -2363 -8104 -10830 -6250 -1801 9798 -224
6508 -224 -6213 -954 -11632 -19021 -11699 -23481 -30697 -21367 -16826 -14456 -7808 -4778 -16668 -15229
6494 -15229 -15336 -17548 -20041 -26271 -34823 -34491 -24500 -13279 -5093 -7565 -10192 -19987 -21330 -21051 -26773
6479 -26773 -18928 -10517 272 -3763 -5321 -9934 -10872 -20458 -23453 -19213 -24565 -23413 -30154 -25171 -7587
6464 -7587 -7313 -5859 -2614 -1645 -14090 -23853 -6603 -222 -4293 -8482 -12124 -8148 -7953 -2882 -6433
6449 -6433 -15140 -13950 -17611 -28028 -31390 -23679 -15304 -8434 3515 10079 7110 2981 5523 -6117
6435 -6117 -4514 3108 813 21000 28866 11979 694 -2128 -3526 -10500 -13002 -21611 -23114 -20531
6421 -20531 -19169 -19052 115 11334 13267 4574 9168 -1066 1261 -978 -3637 -3512 -575 -3702
6407c702m318o2j0650o746K494L379J0014O514k80j439r33M267l264m715J564
6392g877N284q789n580J0400R862J1589Q46m127O44r088n685J0696R02j5807q55
6377g585J2412r122P99O333K584p164k636q264L887J5014N247l844O432K021R70
6362A7084k74R259L166o587j2978j5553k687P414l759J5841K107j7576o618J1866
6348G05P202R72J530j1911q09p26n861J2961N082K380M746n527L983q806j9139
6333a3218K001M534L017n264M876J4805L663j2916k3631P028J4207J364j10J5599
6319A5955J486j5551o274K309j1703l407K264J1512M696P757k54k006J681N246
6305A3711o997r174j422N010K945m978n107M516L37J8565Q641q518j3623j4034
$$ plain form
6407 -3702 -8020 -8082 -18732 -25478 -22984 -19605 -9591 -3077 -3357 -4796 -5729 -1462 -4726 -9441 -7877
6392 -7877 -2593 -11382 -16962 -6562 3300 14889 15735 11608 12252 3164 -2521 8175 9077 -6730 -7585
6377 -7585 4827 -4295 -3496 2837 5421 -1743 -4379 -12643 -8756 6258 11505 7661 14093 16114 17084
6362 17084 16810 26069 29235 22648 9670 -5883 -8570 -1156 -4915 10926 13033 -4543 -11161 705
6348 705 7907 8879 10409 -1502 -2311 -3037 -8898 4063 9145 11525 16271 10744 14727 5921 -13218
6333 -13218 -11217 -6683 -3666 -8930 -4054 10751 14414 1498 -22133 -15105 -898 466 356 15955
6319 15955 17441 1890 -4384 -2075 -13778 -17185 -14921 -3409 1287 9044 8790 6784 8465 13711
6305 13711 6714 -2460 -3882 1128 4073 -905 -6012 -1496 -1159 17406 26047 17529 3906 -10128
6291a0128k987k261K938R992N059q12j1070K28m699o969Q372j266j0055J4802
6277h856P811K453j3963l03P247K064l451L399L572l757N05N908k002p889j746
6262i008L022p024r047L503R253Q890j4973o664K30j441J7429J5427j6045J538
6248d910N420j2975N029J277l530Q046m84J8p774J455K347j3035l483J158R755
6233a1686N475q955L03n039N33J7760J2757m161k5750o813M971L699p563J0550
6219a3919Q475k165L957L398K93l581J3221P023o137k686o066j6309k881J3441
$$ plain form
6291 -10128 -13115 -15376 -12438 -2446 2613 1801 -9269 -9041 -13740 -20709 -12337 -13603 -23658 -8856
6277 -8856 -1045 1408 -12555 -12858 -5611 -3547 -6998 -3599 -27 -3784 -3279 2629 627 -7262 -9008
6262 -9008 -5986 -13010 -22057 -18554 -9301 -411 -15384 -22048 -21818 -23259 -5830 9597 -6448 -4910
6248 -4910 510 -12465 -7436 -6159 -9689 -1643 -2127 -2109 -9883 -8428 -6081 -19116 -22599 -21441 -11686
6233 -11686 -6211 -15166 -14863 -19902 -19369 -1609 11148 6987 -18763 -25576 -20605 -16906 -24469 -13919
6219 -13919 -5444 -7609 -3652 -254 39 -3542 9679 16702 10565 7879 1813 -14496 -17377 -3936
$$ [...]
##END NTUPLES=NMR SPECTRUM
##END=
