##TITLE=Analysis number 307360
Compound Code sb 01463
Project Code qc-cat
Chemist Name ddc weighroom
##JCAMPDX= 6.0         $$ Bruker NMR JCAMP-DX V2.0
##DATA TYPE= NMR SPECTRUM
##DATA CLASS= NTUPLES
##ORIGIN= Bruker BioSpin GmbH
##OWNER= NMR
$$ XWIN-NMR		Version 3.5
$$ Thu Apr 28 12:10:52 2005 GMT Daylight Time (UT+1h)  MAYBRIDGE\NMR@NMR_250MHZ
##.OBSERVE FREQUENCY= 250.131544655141
##.OBSERVE NUCLEUS= ^1H
##.ACQUISITION MODE= SIMULTANEOUS (DQD)
##.ACQUISITION SCHEME= undefined
##.AVERAGES= 16
##.DIGITISER RES= 18
##SPECTROMETER/DATA SYSTEM= dpx250
##.PULSE SEQUENCE= zg30
##.SOLVENT NAME= CDCl3
##.SHIFT REFERENCE= (INTERNAL, CDCl3, 0, 16.522)
##AUDIT TRAIL= $$ (NUMBER, WHEN, WHO, WHERE, WHAT)
$$ ##TITLE= Audit trail, XWIN-NMR		Version 3.5
$$ ##JCAMPDX= 5.01
$$ ##ORIGIN= Bruker BioSpin GmbH
$$ ##OWNER= NMR
$$ C:\u/data/dgb/nmr/ADRS/2480/pdata/1/auditp.txt
$$ ##AUDIT TRAIL=  $$ (NUMBER, WHEN, WHO, WHERE, WHAT)
(   1,<2005-04-28 12:10:30.52 +100>,<MAYBRIDGE\NMR>,<NMR_250MHZ>,
      <created by zg, POWCHK disabled, PULCHK disabled
       configuration hash MD5:
       62 19 C7 07 E1 42 D1 B7 37 6C 3D D0 77 39 F9 E6
       data hash MD5: 64K
       28 A3 B6 CB 69 5D F7 E4 07 E7 D2 16 60 D7 5D 65>)
(   2,<2005-04-28 12:10:42.51 +100>,<MAYBRIDGE\NMR>,<NMR_250MHZ>,
      <Start of raw data processing
       ef LB = 0.3 FT_mod = 6 PKNL = 1 SI = 32K 
       data hash MD5: 32K
       B3 88 5C 57 55 EC 57 BB 33 16 C4 3C B3 BF BF 04>)
(   3,<2005-04-28 12:10:45.27 +100>,<MAYBRIDGE\NMR>,<NMR_250MHZ>,
      <apk 
       data hash MD5: 32K
       49 83 AD A3 1A 17 4A 0B CE 3C D3 8E FA 01 88 81>)
(   4,<2005-04-28 12:10:46.17 +100>,<MAYBRIDGE\NMR>,<NMR_250MHZ>,
      <abs ABSG = 5 
       data hash MD5: 32K
       95 3A 86 45 51 18 6C E3 0A F7 8C 62 BB 60 76 DB>)
$$ ##END=
$$ 
$$ hash MD5
$$ 6B 89 55 85 B2 CD 18 AF CA 3A 5B D7 59 26 BC 8A
##$RELAX= 
##$RELAX= 
##$RELAX= 
##$RELAX= 
##$RELAX= 
##$RELAX= 
##$RELAX= 
$$ Bruker specific parameters
$$ --------------------------
##$DU= <C:\u>
##$EXPNO= 2480
##$NAME= <ADRS>
##$PROCNO= 1
##$TYPE= <nmr>
##$USER= <dgb>
##$AMP= (0..31)
100 100 100 100 100 100 100 100 100 100 100 100 100 100 100 100 100 100 
100 100 100 100 100 100 100 100 100 100 100 100 100 100 
##$AQSEQ= 0
##$AQ_mod= 3
##$AUNM= <au_zg>
##$AUTOPOS= <22 >
##$BF1= 250.13
##$BF2= 250.13
##$BF3= 250.13
##$BF4= 250.13
##$BF5= 500.13
##$BF6= 500.13
##$BF7= 500.13
##$BF8= 500.13
##$BYTORDA= 1
##$CFDGTYP= 0
##$CFRGTYP= 5
##$CHEMSTR= <none>
##$CNST= (0..31)
1 1 145 1 1 1 1 1 1 1 1 1 1 1 1 1 1 1 1 1 1 1 1 1 1 1 1 1 1 1 1 1 
##$CPDPRG= <>
##$CPDPRG1= <>
##$CPDPRG2= <>
##$CPDPRG3= <>
##$CPDPRG4= <mlev>
##$CPDPRG5= <mlev>
##$CPDPRG6= <mlev>
##$CPDPRG7= <mlev>
##$CPDPRG8= <mlev>
##$CPDPRGB= <>
##$CPDPRGT= <>
##$D= (0..31)
0 1 0 0 0 0 0 0 0 0.06 0 0 0 0 0 0 0.0002 0 0 0 0 0 0 0 0 0 0 0 0 0 0 
0 
##$DATE= 1114686629
##$DBL= (0..7)
120 120 120 120 120 120 120 120 
##$DBP= (0..7)
150 150 150 150 150 150 150 150 
##$DBP07= 0
##$DBPNAM0= <>
##$DBPNAM1= <>
##$DBPNAM2= <>
$$ [...]
##$SUBNAM7= <"">
##$SUBNAM8= <"">
##$SUBNAM9= <"">
##$SW= 20.6930455092707
##$SWIBOX= (0..15)
0 0 3 0 0 0 0 0 0 0 0 0 0 0 0 0 
##$SW_h= 5175.983436853
##$TD= 65536
##$TD0= 1
##$TE= 295.16
##$TE2= 300
##$TE3= 300
##$TEG= 300
##$TL= (0..7)
0 120 120 120 120 120 120 120 
##$TP= (0..7)
150 150 150 150 150 150 150 150 
##$TP07= 0
##$TPNAME0= <>
##$TPNAME1= <>
##$TPNAME2= <>
##$TPNAME3= <>
##$TPNAME4= <>
##$TPNAME5= <>
##$TPNAME6= <>
##$TPNAME7= <>
##$TPOAL= (0..7)
0.5 0.5 0.5 0.5 0.5 0.5 0.5 0.5 
##$TPOFFS= (0..7)
0 0 0 0 0 0 0 0 
##$TUNHIN= 0
##$TUNHOUT= 0
##$TUNXOUT= 0
##$USERA1= <user>
##$USERA2= <user>
##$USERA3= <user>
##$USERA4= <user>
##$USERA5= <user>
##$V9= 5
##$VALIST= <valist>
##$VCLIST= <CCCCCCCCCCCCCCC>
##$VD= 0
##$VDLIST= <DDDDDDDDDDDDDDD>
##$VPLIST= <PPPPPPPPPPPPPPP>
##$VTLIST= <TTTTTTTTTTTTTTT>
##$WBST= 1024
##$WBSW= 4
##$XGAIN= (0..3)
0 0 0 0 
##$XL= 0
##$YL= 0
##$YMAX_a= 508261
##$YMIN_a= -466443
##$ZGOPTNS= <>
##$ZL1= 120
##$ZL2= 120
##$ZL3= 120
##$ZL4= 120
##$ABSF1= 16.522
##$ABSF2= -4.171173
##$ABSG= 5
##$ABSL= 3
##$ALPHA= 0
##$AQORDER= 0
##$ASSFAC= 0
##$ASSFACI= 0
##$ASSFACX= 0
##$ASSWID= 0
##$AUNMP= <proc_1d>
##$AZFE= 0.1
##$AZFW= 0.1
##$BCFW= 0
##$BC_mod= 0
##$BYTORDP= 0
##$COROFFS= 0
##$CY= 12.5
##$DATMOD= 1
##$DC= 0
##$DFILT= <>
##$DTYPP= 0
##$F1P= 14.0000005364418
##$F2P= -0.99999901652339
##$FCOR= 0.5
##$FTSIZE= 32768
##$FT_mod= 6
##$GAMMA= 0
##$GB= 0
##$INTBC= 1
##$INTSCL= 1
##$ISEN= 128
##$LB= 0.3
##$LEV0= 0
##$LPBIN= 0
##$MAXI= 10000
##$MC2= 0
##$MEAN= 0
##$ME_mod= 0
##$MI= 0
##$NCOEF= 0
##$NC_proc= -3
##$NLEV= 6
##$NOISF1= 0
##$NOISF2= 0
##$NSP= 0
##$NTH_PI= 0
##$NZP= 0
##$OFFSET= 16.522
##$PC= 1
##$PHC0= 133.0072
##$PHC1= 7.064071
##$PH_mod= 1
##$PKNL= yes
##$PPARMOD= 0
##$PSCAL= 4
##$PSIGN= 0
##$REVERSE= no
##$SF= 250.13
##$SI= 32768
##$SIGF1= 0
##$SIGF2= 0
##$SINO= 400
##$SIOLD= 32768
##$SREGLST= <1H.CDCl3>
##$SSB= 0
##$STSI= 32768
##$STSR= 0
##$SW_p= 5175.98343685301
##$SYMM= 0
##$S_DEV= 0
##$TDeff= 65536
##$TDoff= 0
##$TI= <Analysis number 999999
Compound Code 99
Book Reference 9
Project Code 9>
##$TILT= no
##$TM1= 0
##$TM2= 0
##$TOPLEV= 0
##$USERP1= <user>
##$USERP2= <user>
##$USERP3= <user>
##$USERP4= <user>
##$USERP5= <user>
##$WDW= 1
##$XDIM= 32768
##$YMAX_p= 434769789
##$YMIN_p= -272590
$$ End of Bruker specific parameters
$$ ---------------------------------
##NTUPLES= NMR SPECTRUM
##VAR_NAME=  FREQUENCY,     SPECTRUM/REAL,   SPECTRUM/IMAG
##SYMBOL=    X,             R,               I
##VAR_TYPE=  INDEPENDENT,   DEPENDENT,       DEPENDENT
##VAR_FORM=  AFFN,          ASDF,            ASDF
##VAR_DIM=   32768,         32768,           32768
##UNITS=     HZ,            ARBITRARY UNITS, ARBITRARY UNITS
##FACTOR=    0.157963299565203, 1,           1
##FIRST=     4132.6476996994, 0,             0
##LAST=      -1043.33573715361, 0,           0
##MIN=       -1043.33573715361, -272590,     0
##MAX=       4132.6476996994, 434769789,     0
$$ Real data points
##PAGE= N=1
##DATA TABLE= (X++(R..R)), XYDATA
$$ [...]
19729 2058 3984 4116 7263 14876 19063 11253 9912 8901 7426 7209 4936 2867 -3915 -4758 -717
19714 -717 5014 8001 863 -4110 -5734 -3238 5278 5890 6280 3208 -556 -4402 -5716 -8676 -20401
19699 -20401 -20596 -13960 -11559 -9506 -8900 -8036 -9244 -4135 -3063 -6482 -1312 3632 5882 2398 1661
19684 1661 3586 2344 1670 -636 -1656 -1031 4059 7404 11119 8481 2638 1076 954 4745 1406
19669 1406 -957 527 1767 -3891 -11304 -15278 -12553 -7752 -6427 -3655 -5219 -5446 -2483 -518 -2260
19654 -2260 -12518 -14254 -9998 -7879 -9475 -9284 -7726 -8607 -12411 -14004 -9946 -5587 399 6759 7583
19639 7583 2849 1435 3257 -965 -3032 58 1748 -2390 -1623 -5145 -8424 -6996 -5820 -4874 -8758
19624 -8758 -10230 -9954 -10588 -13811 -14005 -10450 -10273 -7985 -10925 -9389 -8547 -3065 -479 -9586 -6918 -1699
19608 -1699 -11514 -12113 -7732 -1357 -5957 -10674 -6021 -3359 -5446 -8843 -12685 -10683 -5961 -3558 -4532
19593 -4532 -3119 -3974 -6413 -3916 -486 -1527 -7698 -3449 1741 1434 4962 7296 -1414 -3896 -8862
19578 -8862 -7519 -8034 -2511 2041 1356 3418 7875 1942 1785 4832 6523 5546 4411 5409 8755 3049
19562 3049 509 -4361 -7502 -2626 3478 -1242 -190 -5175 -14157 -16204 -12309 -11122 -10273 -7724 -5572
19547 -5572 -2099 2218 -436 -6302 -5373 -5583 -3383 -3296 -5510 -5885 -1798 419 694 -680 -4415 -1929
19531 -1929 1461 1365 957 426 -776 -3979 -3540 5608 -590 -7027 -7377 -10227 -9569 -2496 -1682 4758 3886
19514 3886 4870 3609 -2368 -516 5952 7212 7868 2165 61 -4589 -8460 -5402 -6197 -7561 -7709 -4587
19498 -4587 2798 8398 10730 3870 -1990 -7489 -1966 177 -2284 1631 1597 1458 2385 7484 7259 3085
19482 3085 114 1529 6161 -2429 -3166 944 4012 -351 -2046 4975 5038 3092 -4160 -4685 -302 2558
19466 2558 4107 195 -4956 -1832 524 22 -127 1636 1962 -914 1723 3937 6001 4539 4018 -1038
19450 -1038 -2511 -408 4642 449 2170 1817 -302 -6867 -9903 -14683 -14801 -11955 -8951 -4293 -4329 -3728
19434 -3728 -6395 -13181 -16057 -8400 -3441 -3434 692 9786 18060 18400 13811 6887 2239 411 286 677
19418 677 -816 -4397 -5256 -4127 -4722 -10552 -11585 -7943 -6246 -7595 189 2419 4538 3571 3487 -2991
19402 -2991 -2095 4262 3520 1837 3489 5608 -1200 -6974 -3828 -1287 -1530 -6840 -11844 -5174 -2621
19387 -2621 185 -383 -4014 -5288 1979 5463 5964 1458 2916 3500 675 -4613 -8902 -10499 -1790
19372 -1790 4832 5358 -4642 -6119 -399 -2146 -4656 -3447 -1756 -6943 -10449 -7406 -5380 1979 628
19357 628 158 -1643 -4354 -10485 -12535 -8021 -5217 -395 1916 4130 -874 5383 5216 2843 -1252
19342 -1252 250 -1956 -7116 -1140 3024 2674 4828 2169 -2462 -2449 -1145 178 1728 -619 -4311
19327 -4311 -422 4811 -260 -2864 -6039 -1186 2794 -1855 -5215 -5519 -8151 -7100 -8448 -12146 -13161
19312 -13161 -4612 -568 -617 -3384 -1472 2490 -3048 643 216 -3445 -1001 630 -892 241 -414
19297 -414 -135 42 -4651 -3027 -547 -1141 -1392 -5966 -11125 -5183 2616 2559 5469 525 -3718 5980
19281 5980 8644 4183 4601 3113 -1799 -1766 1288 3496 7200 10456 8153 3551 2216 1054 609 -99
19265 -99 -3375 -463 4248 2931 1197 -4676 -12515 -12690 -6342 2231 3748 2153 2531 3114 1291 -11042
19249 -11042 -13538 -7937 -4493 -20 -3145 -7920 -8814 -11379 -5663 -1598 -3346 -3332 -310 5762 4396
19234 4396 2487 -481 1818 3373 3066 4827 968 -6670 -6609 5522 5268 6155 11403 7012 6383 3406
19218 3406 3079 -1876 -2513 3114 408 1237 -1078 -5257 -1007 5432 4751 6838 2476 -5646 -7484 -3039
19202 -3039 -5504 -1372 1786 -179 2030 6157 6802 7597 2585 -3422 -4574 -5536 -3048 -7193 -1332
19187 -1332 3521 5551 7956 5827 5135 3108 1318 -295 2986 3650 7048 13706 10255 5349 -174
19172 -174 1048 752 -39 -6772 -4401 -4740 -7921 -6983 -16047 -20080 -16412 -3899 1971 5010 4205 -496
19156 -496 -1661 5288 1551 -29 180 3002 4983 1283 -2863 -9673 -6154 -1184 -1030 -282 4304 3810
19140 3810 -2769 -5199 -4327 2445 5017 -1960 -7506 -11247 -7014 -4176 -655 -2718 -6951 -5917 -4624
19125 -4624 -3961 -1993 1034 1217 349 -1181 -1100 1475 243 -3046 3357 3525 1931 -2502 -5984 -3369
19109 -3369 -740 -7076 -4847 -2144 30 -634 -7 1430 2529 4145 -342 -3183 -3914 -2715 -6188
19094 -6188 -4811 136 -320 -7550 -5228 347 -1423 -7159 -13404 -8890 -1154 1686 2618 1505 3521
19079 3521 8077 14306 10843 5741 2065 -889 2187 3375 -268 2113 5714 7773 3067 6180 5173
19064 5173 1584 1595 -1155 -2269 -1377 1721 1361 -706 -720 -1738 7110 9621 6366 1175 -3024 -2220
19048 -2220 -2350 -7302 -10515 -8747 -1729 5172 3992 6606 6320 9107 9553 5032 3626 -2576 -4799
19033 -4799 -2236 6162 10511 11454 3563 6581 3669 1831 -1509 -3433 -1301 711 3144 3760 -2922
19018 -2922 -6111 -8998 -7479 -6102 -1180 2686 3127 3268 2306 5529 8910 4158 415 -3731 -4680 -8578
19002 -8578 -7270 -5359 -266 -1058 -2205 -5374 -10658 -7499 -6738 -7744 -6576 -3807 -2088 -4123 -8093
18987 -8093 -7464 -5650 -5638 -1646 590 -413 337 2238 5241 -2165 1898 2769 -3347 -4990 -3014 -1062
18971 -1062 -2102 301 4206 6526 8168 4692 -1554 -5789 -4019 -2602 3343 7507 9706 13678 13122
18956 13122 5574 2421 1005 3853 7323 4410 3869 6525 12126 15664 9940 9107 9265 6805 3343
18941 3343 283 1715 498 -2601 -2410 -5174 -775 2594 -2125 -8213 -6335 -833 4851 6198 6020
18926 6020 5650 -2247 -4333 -4370 -6948 -5963 -5302 -8617 -7804 -4039 -1033 826 -876 -1069 6989 6578 1545
18909 1545 -3095 -4481 -3128 -3207 -641 1054 -1651 -220 515 2391 3816 798 -8645 -13597 -14904
18894 -14904 -11173 -14694 -16122 -13823 -6032 -5270 -3646 -4981 -5623 -714 3274 3471 -4947 -3378 3626
18879 3626 1664 1163 7484 6054 1471 4484 2600 892 4096 -780 -3097 -7003 -5933 -3639 -3250
18864 -3250 197 1385 -3148 -2600 -505 -1611 -328 4108 835 -3742 2479 6917 7117 4093 -292
18849 -292 -1000 1939 -274 -1476 3359 1363 -1971 -7234 -8010 -5931 -6909 -13199 -16717 -6328 -1375
18834 -1375 -4541 -8645 -7081 -255 885 7584 9291 2381 -457 2543 887 -1850 -2815 -2736 697
18819 697 -2660 -4293 -2777 -892 -2066 -5306 -5104 266 -426 -2231 -158 5105 5448 5469 -855 -9902
18803 -9902 -20063 -18982 -13621 -7399 -3951 -1961 -3934 -4720 -1967 -2557 -1683 -5291 -725 -3615 -3057
18788 -3057 -2397 5375 8466 2879 -3161 -8194 -9931 -12029 -11768 -9888 -4656 4226 6419 7966 11238
18773 11238 8618 1582 -3435 486 5104 20945 37092 40918 39304 39125 33488 25606 16279 8795
18759 8795 6167 6335 2871 735 -4607 -6484 -6926 3036 16316 17345 12542 9470 6261 -1939 -6943
18744 -6943 -5075 -924 -788 573 2629 -1373 -1533 5419 5389 5400 9097 4601 -7122 -8327 -8759 -14221
18728 -14221 -16809 -13756 -10820 -5551 -3612 -184 -5920 -12451 -10152 -3786 -3522 -1901 -5269 -3596 3550
18713 3550 853 -2764 2039 7252 5200 4905 4751 1551 -3063 -9164 -1332 2977 5394 3692 -1721
18698 -1721 -4345 -6412 -7896 -7286 -3948 -2001 -3371 -6144 -4646 -5856 -8014 -11975 -9755 -14525 -10332
18683 -10332 -4474 -2228 -2154 -1607 -3033 -6944 -10276 -7982 -3740 -1092 2186 5677 12196 9921 6424
18668 6424 5827 5346 7991 4495 -3282 -9446 -10558 -7242 -767 -671 -6378 4010 5091 8429 8301 6497
18652 6497 6723 5623 3307 3089 -1740 -7045 -5996 5424 2743 -4971 -1814 2801 -815 -7721 -9874
18637 -9874 -7997 -6190 -3194 -3549 -646 2184 -570 -1476 932 -290 -6359 -6425 -5813 -7425 -5404 -635
18621 -635 6557 6930 9164 11392 9548 7877 8833 4571 801 -513 1556 1388 5581 7970 7497 11513
18605 11513 10148 4523 -50 -6929 -5813 -517 -1787 -1251 1495 7842 12333 7589 7808 6739 2562
18590 2562 -2232 -4375 -4253 2881 635 -2176 1205 6394 7207 7617 2978 -1579 47 -2338 -5413
18575 -5413 -1599 360 -5182 -7895 -2840 1368 3180 4398 4436 2276 5176 2073 -1575 -5875 -1802
18560 -1802 -1227 1441 3433 -1225 -628 -865 -6108 -8781 -8078 -6814 -7345 -357 -1527 -6188 -3967 2121
18544 2121 4758 6302 8615 8927 6109 -231 -571 4436 3603 3599 2403 1820 3505 1086 3149 5593
18528 5593 2671 5247 4651 2082 -2311 -6831 -1074 342 -6192 -10789 -5285 -2018 6265 4092 9263
18513 9263 5951 5657 8298 5884 -2100 -4300 1848 6980 6148 404 -4750 -6650 -7168 -10952 -11711 -13999
18497 -13999 -7732 -5275 -3914 4052 7678 7117 7074 8155 1464 -3819 -6227 -2319 -576 3679 9425
18482 9425 3043 647 2419 153 877 -4366 -4784 -5754 -4224 794 -5939 -7948 75 5276 297
18467 297 15 5178 5904 6228 5481 3599 648 2628 -537 -3633 -7132 -5594 -65 5344 1948 -1065
18451 -1065 -2529 -4780 -1114 -6214 -11066 -8662 -2906 -4439 -4671 -184 -543 729 -2167 778 1739
18436 1739 -193 7056 11691 5519 3101 5338 3843 6081 4084 829 -1659 96 5281 8403 6374
18421 6374 3362 -2182 -3073 555 59 3724 2310 5807 6594 8024 7892 6309 6908 3021 3764 199
18405 199 -9264 -9281 -2155 657 3419 8975 10634 13201 15529 16267 11207 3637 3011 8454 12837 7720
18389 7720 6115 7876 10225 6302 3862 4085 4521 5864 4344 5828 2722 -2414 -4875 -7316 -8149
18374 -8149 -7476 -2811 -164 4595 6098 9003 -993 -10075 -7110 3157 5259 8170 11268 10301 8000
18359 8000 4462 13070 17037 18173 12461 439 -5019 -7305 -14796 -9737 1194 3165 -2351 603
18345 603 3023 3798 10845 6024 3043 5214 8096 5070 4075 5092 7169 2964 -2379 -4012 6729
18330 6729 7861 2533 -1464 -2890 2094 2413 3898 8352 4218 3849 -224 -3671 -4680 -5947 -9187
18315 -9187 -13419 -9852 -156 3744 -1289 -13035 -15393 -11740 -10308 -11917 -13764 -9464 -6957 -2103
18301 -2103 9351 12434 6220 703 3740 2518 3557 4290 1279 -111 -3911 -4299 -1461 -413 -327
18286 -327 -4196 -7063 -10804 -14938 -12894 -6780 -1006 -581 -2673 -3478 2266 129 -3786 -1043 6385
18271 6385 8318 9131 11884 8151 2049 3424 7043 7772 6541 8530 13075 10270 5929 335 -5627
18256 -5627 -3842 -4754 -7797 -11688 -9822 -3736 -4583 -1938 188 3792 4595 1942 4469 8529 -1773
18241 -1773 -7050 -10175 -12584 -9007 -195 7181 10451 8448 6992 8372 4602 3533 -744 -5594 -4182
18226 -4182 2768 4829 5116 2441 -2248 88 8050 7908 2239 3756 7879 8889 10264 16375 22015
18211 22015 28223 40517 57209 66635 62424 47287 34155 24867 19097 16960 20104 19149 15087 9811
18197 9811 3336 3004 6890 2103 5598 8971 6407 1621 659 -2865 -1257 4069 2367 -2159 -2940
18182 -2940 -473 4167 3769 4225 1879 -2216 2091 9657 10319 9372 9803 8753 7654 3239 1261 2060
18166 2060 8017 11493 13693 13693 10045 5284 -2825 -461 3652 11402 16045 13482 12664 11963 14783 17394
18150 17394 16252 20525 20138 16134 15159 17423 22342 19274 14775 21793 29241 40025 50765 50940 51947
18135 51947 57004 60943 60546 59791 67765 77660 87224 93987 102042 108434 115666 122085 135063 150798
18121 150798 170722 207535 261057 317258 380335 469591 607694 814872 1141944 1663863 2472323
18110 2472323 3791649 5930567 8445514 9082648 8455158 7596076 6264128 4754334 3416140
18101 3416140 2520528 2023053 1701243 1430940 1211056 1031999 884226 755874 640326
18092 640326 545075 472136 413470 354716 301706 262303 230954 203700 184644 164048 141528
18081 141528 125494 111079 94200 84788 77001 67019 60903 55796 48972 37835 33278 30458 27854
18068 27854 24267 19569 20487 27694 29911 30063 27628 24792 16781 10079 2661 3090 7839 10050 10788
18053 10788 8982 13796 18805 17002 9652 2067 11146 20726 24079 16593 13296 13375 16021 20648 12710
18038 12710 9739 5327 -1595 -1225 526 325 -1763 -2577 -3205 1893 6351 5003 5465 2955 -1550 1226
18022 1226 1304 1582 -557 -2256 -4357 -6194 -1288 -358 2405 7786 6527 -848 -7098 -10752 -4355 -31
18006 -31 3127 6618 5772 -2672 -7466 -1347 6417 9602 7602 3531 -1927 740 2912 2847 9432 10055
17990 10055 6801 2929 1441 913 4063 417 -3146 -3844 -2451 -6391 -12987 -9347 -2189 2367 1476
17975 1476 2241 264 -1103 1139 2926 4052 1915 -1676 2243 3682 954 -3186 -743 1804 4056
17960 4056 -1363 -4617 -5638 -7548 -7472 -7380 -6904 2315 5608 1238 -3484 -2623 9566 20718 26073 19401
17944 19401 4032 -4558 -11121 -12188 -7683 -5555 -6140 -9310 -8889 -5177 -5780 -1775 849 -7616 -12018
17929 -12018 -12792 -7066 1822 -3016 -6891 367 3086 1699 873 -712 -3314 -4285 -7318 -11944 -12169
17914 -12169 -13034 -8570 -10316 -13676 -7937 -6313 -6784 -7446 -9466 -12707 -16117 -12872 -2156 4921 8989
17899 8989 1779 -10004 -10863 -9208 -16896 -14070 -9834 -5257 -4636 -6375 -10783 -8415 -3845 -1806 -4653
17884 -4653 -7556 -1561 -4184 -6898 -886 3879 -574 -10286 -13069 -15620 -13176 -6580 252 2759 3304
17869 3304 -414 -4231 -4230 -3703 -1826 -1071 -3209 -153 -2166 -1778 1139 -889 -6990 -5139 -8315 -11842
17853 -11842 -9126 -8629 -4857 -5907 -6302 -4414 -12640 -11798 -7346 -5915 -8628 -7200 -3709 -957 -1867
17838 -1867 -1809 -1613 583 -1296 -4021 -7374 -6973 -3433 -9469 -14209 -16735 -13565 -3473 -3740 -6989 -5963
17822 -5963 -8994 -7803 -16402 -19836 -15253 -13856 -14797 -7897 -4455 -1140 -5137 -2443 -1835 260 -4126
17807 -4126 -9123 -12854 -11834 -5109 643 11943 3120 -8040 -6180 -1159 -8028 -13340 -9385 -4328
17793 -4328 -2760 -4809 -4157 -2530 -1391 -2059 -1602 -6090 -10422 -11383 -8086 -7289 -9092 -5540 1036 -832
17777 -832 -2858 -5995 -10591 -7764 -12229 -18845 -20249 -13771 -9397 -1549 5196 7183 10234 9089 8973
17762 8973 7089 243 -137 -1781 -8584 -4101 -6329 -11667 -11244 -3853 2501 1033 -5078 -10739 -9712
17747 -9712 -8018 -2465 -1009 497 1157 819 2547 2713 763 -1120 1310 2437 3458 3110 276 -375
17731 -375 -2293 -5500 1370 1183 5085 1804 497 4471 2337 932 -4868 -7509 -7561 -9867 -10378 -7517
17715 -7517 -11082 -14256 -9409 -4133 -1640 1374 534 -237 -3845 -4844 440 -127 -1660 -7192 -6029 -4037
17699 -4037 -3359 -4590 -1840 -2901 -14214 -15791 -11564 -6733 -2591 -3270 -2499 -1055 4743 4556 3385
17684 3385 5587 3126 937 5147 9465 6254 2818 1663 5715 8986 11256 4700 -3874 2227 7351
17669 7351 11526 6193 2815 -859 -6978 -11264 -13302 -9905 -327 2748 -2815 1145 947 -1987 -2682
17654 -2682 -2063 -11829 -16838 -13914 -12320 -13059 -14582 -10242 -9477 -5591 2706 3985 -2020 -3725 -6813
17639 -6813 -12096 -13101 -10054 -12660 -4960 -3516 -3360 -7292 -5266 3358 5765 2413 4729 3851 -7167
17624 -7167 -5765 -9103 -10936 -6658 -4471 -1904 -705 -659 -2861 484 1502 6494 9250 5061 -1125
17609 -1125 -4655 -6761 -3273 -1149 -6469 -2830 -40 -3701 -5442 -10306 -9104 -10737 -12954 -2005
17595 -2005 5408 836 -9895 -15512 -18016 -17210 -13087 -13353 -8319 -5012 -4984 -670 1746 -6907 -10316
17580 -10316 -5401 -4346 238 -1599 575 6080 5203 -1794 -917 6591 11529 7868 3920 690 2345
17565 2345 2155 -414 238 -1209 -2996 -3079 -4654 -4417 213 3308 438 -4691 -5121 -7611 -5992 -3131
17549 -3131 -2215 -6964 -107 10013 8930 7351 3158 4086 2063 5671 9502 1537 -4854 -3089 6556
17534 6556 14057 18470 21175 28952 25671 19012 12941 7545 5327 7704 910 665 2372 638 -1525
17519 -1525 -2311 4898 1223 -1878 -5752 -12371 -13320 -16019 -12937 -7459 -4145 -308 -2200 2603 2276
17504 2276 -3365 -7458 -9459 -3745 3861 -4420 -8756 -6767 -9445 -10001 -5217 -763 3165 10625 13406
17489 13406 19944 25491 21745 19477 18378 15145 8050 -2636 -1430 4783 5265 5957 3557 5319 9786
17474 9786 15133 10269 4828 252 70 417 2184 1142 -2648 -5235 -10624 -12450 -14368 -10579 -8671
17459 -8671 -6175 -8057 -11977 -6818 155 4660 5547 4149 -194 5926 6371 -5252 -5391 1046 4999
17444 4999 10427 16459 28492 43356 59885 61072 60484 51876 39577 36951 34721 34190 32650 20154
17430 20154 11623 9540 -648 2795 6874 5109 669 -1365 -1473 -299 2967 9911 13221 4786
17416 4786 -3790 -2376 -758 -8756 -10869 -6871 -6591 -7393 -13913 -15184 -18144 -19691 -8607 -5084 -9579
17401 -9579 -2847 -2499 -4627 -2898 461 -470 -1240 -774 414 5098 15161 20325 15868 11460 4952
17386 4952 3997 4885 -121 -4544 -2126 4652 5428 254 -2065 -2696 -4997 -5167 -2487 -2189 -5326 -2494
17370 -2494 -4928 -4101 -9589 -10608 -8835 -7761 -7293 -6944 -2505 3026 1210 -5333 -7754 -9746 -9181 -10501
17354 -10501 -9758 -10608 -3814 -2591 -2238 -3023 3085 8963 9037 7470 1379 -2712 -2418 -3487 5921 9766
17338 9766 634 -1523 1873 4710 3933 855 478 -1428 -7134 -11232 -13603 -13903 -10635 -9976 -5937 534
17322 534 3422 2501 -5969 -3827 657 -2663 -4738 -6002 -4089 -4748 488 -473 -473 -2308 -2654 -2646 -2405 284
17304 284 -5670 -8896 -8996 -7284 351 -1755 -1827 -4449 -630 733 -3383 -3097 -8428 -10056 -1974 211
17288 211 -2239 -7234 -5629 -3268 -1113 -1767 -7331 -12479 -10014 -5017 -3739 -862 -1207 -892 -5243 -4125
17272 -4125 -2995 -5373 -2553 695 -5840 -5310 -7205 -9233 -3236 -4747 -11823 -8414 -2926 2747 -631
17257 -631 -2700 227 3542 -1983 -3264 -5274 -5638 -4424 -9025 -10894 -8031 -3652 981 -3915 -1452
17242 -1452 2262 3081 4550 -2178 -5154 -5772 4713 6823 15028 13154 3949 -2256 -7425 -9305 -4197
17227 -4197 613 258 -1111 -5737 -9655 -11940 -7415 -9923 -13667 -5248 -6497 14 4142 6790 5204
17212 5204 558 1103 -336 -4387 -6936 -4111 -1065 -2312 -10047 -11760 -5887 756 7261 10087 12557
17197 12557 9083 6629 4392 -5103 -9968 -2271 -451 -4389 -3088 382 -3406 -6150 -9013 -1916
17183 -1916 4529 9245 1337 -2624 324 -3846 583 3716 5002 1492 991 -1198 255 -2187 -1760
17168 -1760 289 1662 5740 -24 -9816 -9633 -5940 -6929 -4556 -3747 -2513 -4248 -8156 1585 2664
17153 2664 534 -4015 -10239 -10869 -4956 -2880 -335 -1395 -401 1798 -1093 -619 -4117 -4390 -966 2298
17137 2298 5669 4009 -929 -4914 -5681 1624 -632 -1840 -1817 -102 -7997 -10074 -7788 -8960 -4654
17122 -4654 -5001 -6914 -9599 540 5201 -2045 -11408 -14738 -15927 -11227 -5681 -1216 -7088 -13897 -16399
17107 -16399 -9951 -4134 -2394 -8015 -14614 -10105 -9072 -4752 -6172 -5451 -118 581 -6198 -6340 -7212
17092 -7212 -3248 -1661 -6162 -6271 -6513 -7599 -7386 860 2349 -1906 -4952 -9445 -11625 -8563 -4326
17077 -4326 -1659 -2148 -7698 -13685 -16408 -6373 -3715 -1106 3506 2641 -745 -5163 -3603 -4056 -1320
17062 -1320 3197 -4368 -9360 -5195 -5893 -5021 -192 -1804 -8089 -4056 2914 8799 5579 1283 -1454
17047 -1454 -8579 -7769 -7365 -8055 -9512 -14086 -15011 -13862 -4046 1754 1338 1262 1104 653 -3621 -3953 -4580
17030 -4580 -2927 -482 -1283 287 2137 -446 -6446 -7881 -3306 -3918 -4267 1098 25 -864 4824 4786
17014 4786 -2206 -8640 -4053 -86 852 -2804 33 5700 5903 3353 1539 4226 9760 11582 6835
16999 6835 292 133 2601 6188 6601 3496 -4167 -5930 -5126 -7842 -9901 -5602 -5374 -4804 -1198 -4979
16983 -4979 -7175 -505 1621 1319 -1668 -2140 -236 2567 3737 738 4401 2740 635 5404 5410 2796
16967 2796 4934 1537 2104 139 -6401 -7276 -7479 -7956 -10934 -15490 -16122 -15135 -7656 -2033 214 -196
16951 -196 -1689 -1322 2672 -4139 -5112 -4430 -7698 -13680 -13658 -6799 -6520 -8866 -13285 -10792 -3825 2051
16935 2051 2399 -3679 -2498 -4020 -7989 -8331 -11506 -13577 -19589 -21700 -12505 -6056 -3132 -1280 -2059
16920 -2059 -8658 -12776 -10160 -8896 -241 7566 7603 4932 5383 2095 -4657 -2130 1239 7391 7147 5986
16904 5986 -1195 -6925 -5949 -11392 -10431 -5451 -992 1657 -3804 -5710 -5217 -7643 -5405 -3605 -10215
16889 -10215 -4394 5511 9093 5704 4840 7591 5744 5613 3646 275 1821 8992 8603 8837 3900
16874 3900 -1207 -2280 -5810 -10573 -4368 2502 3694 701 -4550 -5989 -7820 -8154 -6823 -10797 -9048
16859 -9048 -5454 -9874 -16970 -13067 -2381 -1503 -1805 -47 2701 1754 5046 10670 10484 3577 87
16844 87 1658 4157 3307 -838 1706 3533 -6504 -10541 -14669 -12365 -13613 -15780 -8172 -572 717
16829 717 -207 -2410 -5536 -13119 -18833 -11056 -10228 -9181 -6417 -3887 -6782 -7450 -7250 -10353 -14079 -9330
16813 -9330 -6948 -8030 -7677 -806 -2770 -5767 -9796 -6693 -7056 -8676 -7710 -13033 -10702 -8401 -9801
16798 -9801 -7511 -2318 -6333 -11181 -10005 -10402 -6189 -2497 -577 403 6192 7372 1518 1105 616 2201
16782 2201 1819 -2235 -5736 -11185 -8346 -1160 1013 -3273 -2805 -1638 -4300 -4906 -5210 -2305 -6853 -10863
16766 -10863 -11158 -8562 -5152 -5639 -1374 4119 2554 195 -3329 -5105 -9912 -12979 -12183 -9145 -8383
16751 -8383 -10099 -9171 -3615 -3567 -3475 -8308 -10904 -9346 -8576 -3796 -1424 534 -3703 -12814 -14466 -17593
16735 -17593 -12366 -8701 -4179 1382 -5017 -3241 5 950 597 2870 4907 5091 8176 9353 906
16720 906 -9826 -6279 -6937 -10864 -12351 -13670 -15464 -8529 -5091 -4098 -5145 -4461 -8565 -15721 -12801
16705 -12801 -9915 -7922 -9926 -3916 -1104 631 934 646 -5695 -7086 -7882 -14102 -18700 -14756 -12001
16690 -12001 -9075 -11769 -22619 -25577 -18963 -8892 -4108 -3645 -8794 -11377 -6279 -5922 -8947 -6563
16676 -6563 -5562 -5285 -3864 -846 1807 456 -7409 -9967 -12247 -9653 -7570 -13931 -16680 -7952 -5339
16661 -5339 -7553 -99 5359 5708 5302 4704 608 -3027 -927 2011 8339 8230 7468 9166 9956 8762
16645 8762 2993 -2027 -4247 -2227 -2143 -940 323 -5270 -3433 2910 5572 4130 4199 3066 2677 -2945
16629 -2945 -4978 -4283 476 4115 6435 8558 2322 -1097 -3667 -5144 -2974 -7812 -15853 -17629 -11177
16614 -11177 -10354 -10830 -10616 -1113 701 -3227 -6758 -6569 -4136 -5138 -2480 -7107 -14129 -17800 -11344
16599 -11344 -8574 -13457 -16877 -12150 -5164 -6320 -7361 -8123 -9151 -5720 -88 -5747 -4875 -3355 -4908
16584 -4908 -4517 -3166 -2732 -4312 -7835 -1204 2287 1617 845 5769 4429 3178 1396 -4783 -7524 -4052
16568 -4052 -4450 -5858 -11780 -9651 -2126 -1767 -7204 -7049 -1436 2104 -1041 -6799 -9585 -10605 -11206 -5811
16552 -5811 -2062 -8046 -12397 -13982 -12634 -7129 -5299 -11770 -13294 -9640 -9512 -13645 -14412 -13365 -12939
16537 -12939 -3812 7012 5925 1956 -1509 -2174 -4612 -3273 -2141 -698 -565 -1610 -1927 -1450 740
16522 740 1637 4213 -146 -2738 -6806 -6737 -6042 -834 4614 1544 -900 4992 4719 1318 -2463 -3822
16506 -3822 -8152 -10539 -8264 -11751 -10652 -5885 2926 3971 5667 3288 -3398 -8126 -7069 -2395 -4512
16491 -4512 95 -1651 -3577 -1112 4344 45 -2358 -2722 -11279 -16619 -15357 -10894 -3184 1346 2741
16476 2741 6619 5719 5697 2463 -7055 -5688 38 -1383 -3714 -3424 -2501 -2892 -3169 -1418 -2941 -5857
16460 -5857 -5386 -7253 -6535 -5742 -5931 -1554 2993 3992 4627 2835 362 -773 1598 1854 941 1723 3773
16443 3773 3702 -1293 -7282 -5312 -3435 -7431 -5621 -1040 183 -3072 -457 9838 5451 3730 4104
16428 4104 5548 10800 11270 10289 6066 2689 -867 -580 -811 -4607 -8113 -7232 -5945 -8890 -8971 -563
16412 -563 2096 1300 2461 -6846 -8887 -8844 -11552 -7369 -853 -2854 -7085 -8362 -12587 -8435 -9139 -11971
16396 -11971 -9836 -7889 -4274 -8170 -7560 -6650 -5493 -3099 -867 -2020 4878 3909 -1128 -2916 2569
16381 2569 8733 5435 2232 1909 7721 8705 2695 1293 2486 3650 3463 4010 5670 3433 6219 9522
16365 9522 12267 7610 7512 4105 2193 84 320 5531 1163 1712 3901 3343 8462 8511 2792 -150
16349 -150 -371 -2342 -7955 -7 8027 9778 4780 5603 9715 8264 7774 6940 4579 -2986 -9711 -11458
16333 -11458 -13630 -10644 -6638 -8127 -3714 -3925 -3422 -5870 -9348 -6686 -5751 -3681 -5426 -2680 1713
16318 1713 2562 2841 4121 2612 2192 3229 416 -631 4456 2252 -2323 397 4741 7757 6167
16303 6167 11899 16249 13687 12140 14563 16086 10123 6734 12285 8398 6826 8757 9609 15887 16750
16288 16750 19549 10525 2024 8529 10750 6229 517 3638 1746 2910 1960 434 1917 2007 6648
16273 6648 6907 -157 -2431 -1124 1244 3553 -591 -6963 -4298 -2148 -4113 -7266 -7943 -431 5931
16258 5931 7617 6817 5290 10331 16934 9828 -764 -2685 -735 -3526 3546 11599 19292 14967 9754
16243 9754 5194 6602 4809 3953 4486 8713 -899 -3017 1170 1326 -6119 -11924 -9435 -4359 -5132 -2908
16227 -2908 -5118 -9096 -9284 -671 3978 946 -4202 -4685 -1559 51 4817 8496 12070 11509 6779
16212 6779 -35 -5948 -3755 -1003 4901 7657 12817 13418 9901 1111 -2590 -5897 -7141 -12555 -10704
16197 -10704 -6455 -4069 -10748 -9897 -1850 3652 6233 2757 -1622 -720 166 5691 7436 5579 -593
16182 -593 -2452 -2287 5334 7263 6905 7454 6004 2034 -5330 -13391 -12246 -12932 -5572 -6591 -9055 -11172
16166 -11172 -6228 -6270 -2785 1685 2576 2977 4645 669 -976 -5 -746 -4146 -5861 -3054 -493 5455
16150 5455 5703 4241 932 -3851 -3053 -6385 -7340 -3670 -636 3136 6515 9124 13302 13083 8770 1905
16134 1905 1595 -1332 -4159 -3100 -2915 -6201 -8436 -9654 -9970 -6947 -4356 -6311 -4073 -1026 -3557
16119 -3557 -2919 849 -5749 -11181 -12799 -11037 -4333 -180 -3637 -4209 4199 10454 9619 9238 13364 7338
16103 7338 6583 -1206 -7854 -4594 1039 5002 100 -1428 4644 1943 -2123 -3478 -6358 -3900 -1664
16088 -1664 1846 2445 2053 686 -6981 -9503 -4994 2100 305 -256 -3715 -2842 -6524 -6302 -3117 -5247
16072 -5247 -3125 -7802 -14398 -15210 -7148 -4281 -7081 -12069 -7216 -9778 -16634 -10341 -3499 -1328 -8648
16057 -8648 -10068 -7964 -3566 -6580 -7551 -10701 -12552 -15018 -8124 -3260 -4833 -8391 -9815 -8236 -8652
16042 -8652 -7824 -2911 -3168 -1853 -3566 -7226 -9734 -7405 -14802 -16656 -20905 -19478 -10103 -5315 -2087
16027 -2087 499 4357 6739 1424 -1334 -7025 -9262 -4657 -2407 -66 -4355 -11848 -4783 205 2105
16012 2105 -1190 93 629 7847 9007 3058 -2236 -7633 -5012 -1156 -3187 -8592 -7257 -6409 -5789
15997 -5789 -6141 -5900 -4102 2872 6637 -2095 -6545 -6932 -7471 -2577 1877 -3262 -4366 -3621 -4412 -2930
15981 -2930 -5375 -5799 -10697 -13365 -12365 -5132 4117 11768 9244 6307 3281 -2375 -9274 -8500 -7123
15966 -7123 -5156 -3495 -5183 -8539 -7721 -3645 -1206 -6396 -11468 -10560 -5606 -7284 -2020 -290 1314
15951 1314 75 -2882 -6274 -2258 -32 -3738 -5628 -11486 -11118 -7912 1275 1486 3310 2577 -4409
15936 -4409 -9377 -12580 -17864 -17268 -12679 -7894 -4558 0 -4282 -10847 -13541 -14384 -12879 -11712 -12477
15921 -12477 -5966 -1005 -1994 -3848 -9763 -11072 -13162 -20524 -18546 -7858 -6656 -3516 -3696 -1929 -2630
15906 -2630 -5242 -7279 -8122 -6081 -3346 -4790 -3566 -3327 -7529 -9436 -3039 -180 1054 -1218 -6336
15891 -6336 -3523 -1775 -2443 -1418 -489 -4599 -2852 -4951 -11796 -15942 -14668 -5862 1452 -950 -1511
15876 -1511 250 -6273 -11522 -10365 -6036 -5282 -6305 -8459 -11690 -6498 -2048 -822 2201 2166 -3967
15861 -3967 -4977 -7343 -6259 -6574 -4654 -469 -3489 2047 5320 3895 -1699 -3154 -1972 1553 3758
15846 3758 -6301 -12677 -6838 -6672 -11938 -6658 10123 23021 16191 12786 7248 5136 12138 9271
15832 9271 4734 64 6966 5715 -181 -2512 -2279 -6495 -9365 -12592 -10602 -7364 -4409 -12634 -15903
15817 -15903 -9589 -5249 -8487 -10818 -9597 -3303 -4369 -8647 -10308 -10685 -11510 -11261 -6458 -2459 865
15802 865 -728 -2949 3256 9102 4267 -8122 -10650 6933 19975 15745 17648 15227 7792 6500
15788 6500 2433 -3971 -7258 -2924 64 -3770 -11596 -10781 -8118 -5526 -2187 -577 -4367 -7270 -7730
15773 -7730 -15106 -19134 -10622 -7395 -9465 -6551 -10345 -16972 -11138 -10093 -15607 -11189 -3170 6639 5645
15758 5645 5810 5948 1091 -8083 -12225 -14524 -9614 -11111 -12224 -16837 -13416 -9082 -10111 -8937 -454
15743 -454 5325 6094 2340 658 333 -2084 -5462 -9349 -15446 -18415 -14773 -10686 -2598 -4333 -6544
15728 -6544 -6592 -2611 -2064 -1294 4822 2486 1781 2980 -2033 -7539 -11526 -7877 -2829 -5197 -1681 -3591
15712 -3591 -1285 1682 1480 -448 -2391 1238 -648 -8306 -10943 -4903 -3329 -1232 -2987 -2320 -2187
15697 -2187 -950 -1832 -1996 -5892 -2082 112 -2455 -857 -2256 -517 1961 1246 3679 3659 32 -9435
15681 -9435 -12504 -10287 -10215 -8710 -5428 -5840 -16475 -16845 -15839 -11967 -5390 -6262 -7659 -3682 -2594 3250
15665 3250 6070 1905 -711 -6239 -3911 2476 6220 9197 13964 14444 6481 -549 -7649 -10427 -11977
15650 -11977 -16375 -17007 -16584 -17105 -12983 -10881 -8826 -6549 -3673 -69 2506 4654 -1043 -1631 -902 -4997
15634 -4997 -7023 -3917 -4014 -6902 -11961 -6884 -4578 -4930 -7984 -6527 -3110 2084 4427 4009 6951 3975
15618 3975 3809 1541 1695 6459 7068 3028 -1132 4883 5902 -3425 -3262 -3799 -5330 -3311 -3257 -8101
15602 -8101 -7966 -5912 -7720 -13437 -11944 -6381 -499 203 -1812 5440 842 -2637 -7952 -7797 -5567
15587 -5567 -668 -1133 -3359 -7475 -7204 -6402 -9664 -15290 -16213 -12008 -9359 -13160 -8974 -6881 -4231 -2041
15571 -2041 -2256 -3279 -623 -4185 -770 3686 -33 -2955 -2694 -6800 -2198 -357 -4449 -889 -4004
15556 -4004 -6301 -6929 -6913 -4689 -2196 -4297 -9316 -6952 -5758 -5260 -8091 -7623 -5231 -2644 -9011 -13836
15540 -13836 -15274 -12397 -5578 -7833 -14554 -9506 -2579 -1603 -4613 -10333 -6225 -439 -8226 -9575 -6091
15525 -6091 -7104 -6793 -3139 2182 6683 5821 5242 2301 1337 588 -7405 -7960 -4580 -4992 -7779 -2440
15509 -2440 -5014 -5708 -7832 -11765 -6963 -8093 -9835 -10868 -13663 -14249 -15277 -15772 -9201 -5970 -2528
15494 -2528 -1587 2488 -1115 -10999 -10534 -8826 -9158 -7152 -8530 -9951 -9533 -6365 -5164 -7895 -8728 -9560
15478 -9560 -13804 -13656 -13386 -12186 -8974 -2529 -1181 -2251 -4188 -5018 -10157 -12840 -12784 -10170 -7946 -5544
15462 -5544 -4657 82 2980 9012 5963 6866 382 1376 -1745 -7465 -10234 -12923 -13850 -10220 -10361 -9960
15446 -9960 -10692 -7958 -6985 -8463 -5954 -10323 -6724 3615 -471 -5321 -3742 -4309 -3746 -5429 -5508 -12402
15430 -12402 -10124 282 4447 3174 -1677 -8171 -7998 -5511 -3910 -2909 -5123 -10016 -9838 -8624 -11087
15415 -11087 -8246 -6973 -8827 -10839 -6681 -9533 -13888 -14181 -17367 -16774 -15036 -9434 -2476 -3126 -5855
15400 -5855 -6677 -1619 -3543 -8270 -7607 -8877 -7852 -7547 -9365 -13689 -15503 -10791 -14461 -16298 -13003
15385 -13003 -12507 -5611 -4055 -2190 -7367 -11295 -9490 -1930 2246 -2374 -3019 -4919 -2914 -2003 -23
15370 -23 3684 8095 9429 3392 -1986 -1660 -3427 -4519 -3591 -2955 -3921 -3956 -1995 -3725 1378 339 -1725
15353 -1725 -4060 -8686 -1466 3340 4832 4843 4951 464 2488 7533 889 -4642 -6029 -12150 -15602
15338 -15602 -18978 -18101 -17197 -15510 -16269 -14625 -11684 -8029 -1059 -2163 -6109 -9175 -6744 -8912 -12345
15323 -12345 -11872 -8897 -3643 1819 9046 9151 3524 -3349 -6939 -10671 -12946 -12999 -3356 -3795 -5362 -4011
15307 -4011 -4147 -5890 -8481 -6654 1229 2978 -193 -247 -1308 -3920 -3056 3519 6993 10065 9770 1943
15291 1943 -795 -231 -10055 -10589 -7277 -6743 -7975 -7284 -5298 -4412 -526 -464 -3646 -7455 -9873 -14642
15275 -14642 -18762 -15852 -14861 -13840 -9608 -6002 -2982 -1776 -4342 -8408 -7757 -6212 -9397 -3651 -2094
15260 -2094 -4609 -5711 -10210 -8395 -6256 -82 2114 -230 -2849 -4295 -5187 -9924 -17324 -14229 -5601
15245 -5601 -1 204 1124 1667 -503 -5243 -10513 -507 4382 1483 -4237 -9368 -7286 -11497 -7018
15230 -7018 -8528 -10923 -5720 1490 8253 907 -7119 -4697 -3244 1583 -220 -3277 -5906 -12981 -9139
15215 -9139 -3747 -7492 -11878 -11128 -6346 -636 -1221 -4171 -1916 2055 -6293 -6345 -4241 -2383 22 -1740
15199 -1740 -9883 -929 955 -4572 -10752 -11090 -2762 -3780 -5069 -7317 -7149 -4145 -4837 -6658 -5825 -5255
15183 -5255 -2218 -2465 -2915 -3013 -2679 -4337 -5748 -10290 -14999 -10968 -4058 3153 6047 8565 5785 4238
15167 4238 7693 9641 4182 -3096 2109 5315 6246 9216 7415 7478 9763 5655 2258 729 1886
15152 1886 1234 -5562 -12593 -6517 -3520 -278 917 5358 12782 6851 -2402 -5459 -7295 -10592 -5739
15137 -5739 -6098 -7977 -12605 -10784 -8032 -8485 -8042 -5285 -6505 -8944 -6165 -370 1508 1378 4333 5008
15121 5008 7208 4122 3180 2640 1451 2374 -4118 -9458 -9266 -8236 -3331 -1107 1835 6514 3606 3090
15105 3090 -2195 -9941 -11969 -3962 2460 -1032 388 2322 -561 -6888 -9754 -11095 -3750 2326 -1699
15090 -1699 -4342 529 -1090 -3408 -3227 -8257 -8204 -7199 -11356 -11312 -4390 433 -254 -3043 -8644 -3141
15074 -3141 7405 11955 12299 12591 3179 4294 14426 12996 6911 5187 -1644 -848 -2718 -2766 -3155 -7652
15058 -7652 -6069 -5552 -1009 4798 4413 7168 5971 7544 4405 -2576 -5743 -5492 -2146 -7373 -8436
15043 -8436 -6843 -425 -14 4762 2856 2494 9600 10254 3391 60 -1687 1954 1344 249 4589 5054
15027 5054 5837 3909 726 1199 -552 -261 2008 8532 13106 7317 8150 6559 6339 6654 3018 1648
15011 1648 -1220 -737 2899 4284 6268 7332 7256 6824 7301 10425 11675 8520 4745 542 -4257 -7428
14995 -7428 -13246 -3195 6274 9714 11003 11202 5742 -217 2897 6213 2507 2509 3298 -2016 -5829 -5710
14979 -5710 -1773 2935 5717 6069 8597 7917 7884 7615 9574 12703 18594 17435 13151 3441 -3217 1896
14963 1896 1557 1603 1390 2369 -1831 -9711 -10215 -4974 -4390 -7145 -12325 -14051 -12311 -4026 127 189 1805
14946 1805 4934 2989 -226 -6296 -5623 -4927 -6162 -7034 -770 4694 9370 8712 982 -2100 -3455 420
14930 420 -3829 -7566 -4396 -5749 -7037 -12705 -10484 144 2387 2139 2895 2808 -3293 -7292 -7542 -5865
14914 -5865 -5285 -2888 -827 1976 1153 1271 4504 -386 -4183 -87 1676 2158 8925 6372 5558 4124
14898 4124 4747 6973 7896 9781 8900 5813 85 -1864 1330 -1456 -4545 2047 4599 6548 7651
14883 7651 1425 -3770 -3623 -2440 3904 -265 557 3404 6757 7940 8298 6781 -1486 -7136 -9278
14868 -9278 -8244 -7780 -368 1482 2427 3860 5432 7979 10663 11061 10555 2489 700 1954 1253 -5387
14852 -5387 -5747 -1980 -8483 -13066 -14758 -5535 -1813 -2493 -3257 78 -4835 -6448 -8992 -7561 -9338
14837 -9338 -6837 -10203 -14061 -11013 -8968 -11018 -13007 -8515 -3677 1474 7798 7692 342 -3880 -5170
14822 -5170 -9139 -7358 -4359 -4164 -7922 -11606 -12766 -9215 -2341 592 -1216 -5738 784 6596 536
14807 536 -3353 -479 1816 -917 4627 1998 -785 3041 8384 8496 3533 719 4993 8405 8244
14792 8244 3348 -1630 -8047 -5674 -828 -858 4145 -1371 -2180 3601 4359 -225 -3321 -1485 2218 -2366
14776 -2366 -4005 630 9104 3504 -2346 -8614 -5653 -5 2859 689 3339 2390 -3363 -3648 -4893
14761 -4893 -3398 42 1188 4660 10277 10140 4088 2504 -2093 -575 6760 4178 766 -1776 2039
14746 2039 -221 996 6941 5495 4358 3638 7792 8082 3312 998 -1334 -3400 -238 -3525 -1782
14731 -1782 -7988 -10876 -9979 -11277 -13736 -10328 -2656 -3890 -2552 -4842 -751 1804 3676 6414 -2239
14716 -2239 -7611 -6309 -33 10043 7421 3025 -639 -2100 -3097 4051 3454 1420 -6413 -5430 -1624
14701 -1624 -42 -3063 4002 5985 4932 562 3924 -910 -4661 -3213 -6183 -1778 4637 3407 3644
14686 3644 4368 7312 6687 4408 -859 -5649 -3197 -990 -1543 -5026 -2543 -2593 -494 -817 -2862 -6440
14670 -6440 -1891 4693 8662 11559 7147 1934 -2981 -6521 -2779 -2919 -3809 -3464 2011 348 -3869
14655 -3869 -5179 -4743 -2956 -1784 -3791 -4645 -1350 1944 -1813 -1205 -3314 -5270 -1436 1416 -1237
14640 -1237 -1450 -3910 -4440 -1170 -426 -5654 -6447 -3031 -2670 1512 8351 2688 -3510 169 -2926 -6875
14624 -6875 -6692 -6699 -6287 -1935 -1204 3157 5172 -878 -388 2036 -2483 -3586 -2063 -1009 4065 8060
14608 8060 9740 11868 4802 -1516 -2909 -2904 -89 -1681 -238 2266 -5206 -5104 -1066 -178 -3620 -3302
14592 -3302 3693 6918 8322 15284 14983 12477 12598 10811 3300 682 3821 13013 7972 -2431 -6101
14577 -6101 -5375 -3010 -6803 -2839 5543 9686 12737 11066 7750 8295 6804 5206 2340 4339 4500
14562 4500 6095 2705 -628 3713 8942 3744 -2994 -4724 -7351 -6286 -1434 3559 4677 13030 11819
14547 11819 8261 1909 -6023 -4574 -1424 762 1563 6627 8146 5773 6819 7882 5661 5254 7696
14532 7696 8643 16316 13568 5052 6210 4239 872 3884 8366 7790 9024 7912 7293 4183 2511
14517 2511 311 4910 7561 517 -2562 -878 6814 14126 8202 7839 7591 4333 8104 12933 10258
14502 10258 2325 2260 7453 6300 6568 509 -2603 342 503 -4881 -3516 6240 9963 6634 3839
14487 3839 5180 1118 5354 9081 8512 11512 8611 9542 9190 9835 15304 9010 4141 -250 2356 8312
14471 8312 6433 6662 8502 9678 7676 7438 7708 3412 1064 1624 -1622 -611 -2495 -5381 -485 8094
14455 8094 6709 7323 6210 2872 2520 5166 5518 6415 2598 -3411 -2988 -1601 2403 8923 11685 4173
14439 4173 -1589 2502 2482 1136 -2579 -2906 3121 1432 2860 3139 4830 4554 699 1212 0 -2185
14423 -2185 -2012 910 -2677 -3859 1469 6889 7432 4319 4289 2653 5472 5324 1644 1870 7658 9395
14407 9395 5649 6408 -1071 1800 1755 -73 -3003 -5809 -10315 -6316 -4727 -4943 829 5313 9758 6570
14391 6570 11472 12897 8386 992 566 8420 6339 4741 11810 5647 1266 697 -4017 -3024 -1890
14376 -1890 725 6128 9881 13281 13528 14378 8093 7474 8376 10256 12707 15357 16730 16913 17267 14959
14360 14959 12164 8104 4398 5536 6040 5009 1896 9634 10085 3639 2959 3822 3024 -981 -2391 -3409
14344 -3409 -2583 3815 -349 -11103 -9580 -11830 -12831 -2277 4061 2960 -1148 -2135 2322 2246 4806
14329 4806 6640 10655 4899 -638 396 6150 10742 4913 3526 5529 2749 -203 -4828 3632 4364
14314 4364 1732 -2136 -5628 -11482 -8414 -6262 292 6784 17835 16692 14067 7083 747 3870
14300 3870 5952 7118 5452 1941 -1789 230 -246 -8044 -6838 -779 6934 4090 4968 1888 1249
14285 1249 5344 11002 10159 8441 9796 6643 -1640 -7520 -4727 -1379 3337 4237 7327 12928 14411
14270 14411 7093 -6400 -10361 -11072 -7719 696 6263 3380 1019 1083 -746 1663 4725 3249 1077
14255 1077 4755 13693 16530 14925 8401 7771 7616 8612 5591 6933 9441 12835 5725 1557 2471 2447
14239 2447 -948 4949 -280 -3673 -660 3763 8395 8517 8549 5157 7431 8235 6861 5297 -1674 -4670
14223 -4670 -2124 2888 5344 9742 10280 3902 3748 7442 9904 9139 10732 10849 13739 10913 8194 11366
14207 11366 8323 577 3177 7068 8903 3153 1082 1945 3121 1796 -2225 1439 4523 9430 11098
14192 11098 6443 3237 3516 7099 9913 10981 10632 7073 4568 5090 8202 13145 9527 32 -3524
14177 -3524 3635 4773 9282 12175 14706 13422 12809 12810 13629 9397 4258 6576 4113 -2089 -4985 -863
14161 -863 4599 5981 4128 5401 12950 14577 8357 4882 2987 3201 10872 12700 15262 16721 11765
14146 11765 3875 2138 2964 4402 3237 2080 4380 10050 12419 5325 -1807 -5236 -3652 91 119
14131 119 332 8333 10061 10505 7084 6157 3544 -1904 -2547 870 4376 3712 -517 2513 3442 7712
14115 7712 12164 11705 8655 6572 2523 1103 2900 129 4427 306 -2601 4671 8522 7726 10731
14100 10731 9693 8773 3965 1976 3365 4688 8771 3448 5447 5827 904 -3318 508 9349 15249
14085 15249 12638 10300 7127 6869 10047 10487 12961 11154 8415 6550 7676 17542 18956 17945 15434
14070 15434 12006 11739 10624 8651 11155 14204 10008 6089 10664 13796 3411 6316 9669 8679 5995
14055 5995 4807 10232 12033 10258 14572 16009 10388 13232 12010 10526 6403 7432 6215 8106 10697
14040 10697 10234 8217 7692 2363 -3450 2586 8849 8610 5023 3383 2128 7726 14017 13519 10699
14025 10699 10940 16494 18870 15860 10811 10768 15538 15046 6750 -1548 -621 2108 2765 3667 11284 12402
14009 12402 8970 6100 395 1624 6504 6209 978 -2654 -3832 -1335 1519 2627 2824 7028 11457
13994 11457 14952 19129 16157 11173 14573 13167 6142 10732 12430 9972 11733 13665 17106 16794 7280
13979 7280 5792 6545 11507 13728 12993 11040 11280 16198 15848 13793 10252 11893 14254 15372 19778 23521
13963 23521 26281 25164 22814 16243 16884 16765 21550 27048 27794 29206 26041 17821 14160 15085 11962
13948 11962 8457 10863 13631 17300 14881 9042 7622 9923 12993 11359 16073 13636 9837 12209
13934 12209 15495 10993 12053 18543 20740 17166 16378 18323 15288 10682 6790 7066 11444 12786 5780
13919 5780 3206 3969 7800 9606 13153 9125 2928 5382 8652 12716 9940 10917 13877 16919 17415
13904 17415 21116 22886 16353 17202 21710 20464 20693 19929 18183 15044 9149 4614 3069 11862 15574
13889 15574 19394 19339 18594 11069 8956 11519 11819 15547 17237 16933 12407 13507 8085 7333 11247 15330
13873 15330 21509 18851 14220 6936 6774 13684 18816 17166 16507 15332 14148 17538 23004 27287 31590
13858 31590 36298 32850 28419 25168 23740 25912 30009 34775 37223 38912 40094 44389 39843 41803
13844 41803 50369 60535 72840 83785 99496 125972 165888 236528 335840 400315 397923 342296
13832 342296 270643 210169 166086 140220 125837 107405 97654 96868 97266 93888 88101 79186 76814
13819 76814 65084 52689 42356 42720 50679 51243 52611 46983 44340 46249 50668 55638 62837 67698
13805 67698 75913 77259 78515 84658 95016 104502 124122 144494 163665 199651 246085 320649 439218
13792 439218 627347 904751 1158784 1207479 1064858 847641 648590 500040 407571 345571
13782 345571 306034 274823 248275 222694 195487 164964 140695 118162 106673 102006 94681 84688
13770 84688 81410 78241 71946 70042 69741 70311 70836 68164 71763 71464 81288 86660 83121 91071 100924
13755 100924 111197 125970 148826 175453 204756 252896 316639 416911 590323 849637 1135768
13744 1135768 1231930 1120456 900806 679181 520975 424597 367330 319263 284190 249540
13734 249540 213269 178029 149485 129495 109155 87592 72568 63669 68721 64486 55840 52854
13722 52854 47393 44529 38652 41905 45046 46292 41585 39015 37032 35559 42203 48074 48367 48753 52849
13707 52849 59862 71611 87301 120808 177866 251579 351017 455005 491926 453629 381288 303726
13695 303726 243027 203152 178068 158965 138596 120662 106094 102681 104546 99769 90751 101534
13683 101534 116475 96599 82691 84031 70268 52178 40539 32590 29987 26976 22644 21391 20005
13670 20005 14149 9372 7631 6310 5389 -2300 -9141 -15288 -21649 -22781 -18533 -3474 53438 127908
13656 127908 175258 197290 198012 183180 163591 147683 138044 131718 132550 130628 127937 122280 111668
13643 111668 97420 87534 93045 104366 106104 115219 135554 166644 174021 159242 135425 119033
13631 119033 106935 93282 84705 80192 82935 92952 96749 93041 93561 89050 76811 71283 64565
13618 64565 58899 41217 32771 22931 27923 73773 150196 213300 240337 234214 218698 198539 186391
13605 186391 180231 180710 182539 180772 185748 180241 172189 162057 156933 153285 150954 149265 161355 186654
13591 186654 216780 222493 205926 191292 179740 173733 169831 167100 172699 187314 208875 225751
13579 225751 241960 254202 243827 230560 221725 212501 200858 170995 138557 116027 109695 116880
13567 116880 131346 150678 158803 167385 170240 170504 168498 165881 163285 166089 163363 157415 155185 156803
13553 156803 163415 164527 166645 174185 182346 194300 196781 195273 191542 184260 176849 163845 159160 164077
13539 164077 171671 179464 191997 207061 225451 250612 269148 269269 251954 242947 231159 224601 206464
13526 206464 172261 140065 117750 109358 108927 106668 104731 108914 121332 132318 143043 154004 162030
13513 162030 166267 176324 182442 188681 190035 192064 197829 202376 202557 195884 200917 209307 216737 218190
13499 218190 214619 213200 225904 243929 249019 240206 226439 217427 206894 206508 216920 232748 247366
13486 247366 244282 242064 235183 229023 220247 201394 187245 178172 176464 176699 181584 182129 186999 189815
13472 189815 200322 212194 227311 240006 243086 247354 248659 259466 275887 288069 297945 302354
13460 302354 302792 307506 313791 323553 334073 330805 331374 350585 381184 416463 445877 454521 422743
13447 422743 379908 347293 326161 314501 328533 346374 354392 359266 354136 349268 349844 351795 354776
13434 354776 359388 364227 371850 377115 386841 401375 412216 426817 447991 457146 467580 476157 484257
13421 484257 487321 496134 510895 521543 535103 551093 558951 560520 565124 573184 581707 591241 607232
13408 607232 636504 682644 737938 786655 816142 817005 808129 802998 813935 842158 887251 948084
13396 948084 1008303 1064241 1109994 1164962 1235929 1323108 1423336 1526585 1637633 1770349 1932266
13385 1932266 2131099 2374638 2692001 3116114 3692316 4457419 5398647 6563847 7992131
13376 7992131 9692395 11870329 14889055 19421260 26765389 38973076 56284399 69742362
13368 69742362 70585772 61265037 48046944 36530009 28621957 23461663 19945620 17573494
13360 17573494 15919282 14421466 12879597 11401131 10077373 8922098 7946367 7159881
13352 7159881 6539292 6064713 5694980 5406152 5207641 5103442 5089617 5149696 5257058 5406955
13342 5406955 5629209 5946439 6375952 6951995 7734327 8835942 10373592 12466199 15166097
13333 15166097 18525672 22720101 27754341 34015544 42516818 54997604 74774681 107232271
13325 107232271 156232787 204408194 216039322 193333980 153865292 116009290 89140061
13318 89140061 71844245 60177700 52152511 46705458 42159067 37413559 32713556 28401776
13310 28401776 24583371 21303779 18555039 16278377 14425054 12916114 11680477 10664758
13302 10664758 9872989 9283955 8843622 8519264 8289725 8174897 8191455 8357583 8682182
13293 8682182 9205986 10036002 11311279 13141839 15605104 18731471 22690786 27510106
13285 27510106 33443147 41366141 52804088 70673370 99983453 145960775 198660115
13278 198660115 220631808 204358720 166480503 126193926 95982261 76421113 63400799
13271 63400799 54396388 48308875 43577061 38742283 33833761 29252517 25173047 21639923
13263 21639923 18652889 16157749 14093537 12384388 10953832 9750570 8746450 7934497
13255 7934497 7272065 6712137 6231700 5841957 5539576 5327104 5206417 5165147 5233197 5477265
13245 5477265 5905701 6546810 7409479 8547847 9985955 11788075 14205015 17665943 23058727
13236 23058727 32000278 46607588 64928218 75376034 72377701 60453310 46435567
13229 46435567 35264766 27813883 22878226 19484636 17177501 15430140 13736527 12012339
13221 12012339 10402917 8968398 7717096 6658743 5765089 5016063 4388544 3856583 3397921
13212 3397921 3019094 2706633 2445500 2218205 2011159 1825538 1662677 1522010 1400824
13203 1400824 1294608 1214135 1156179 1098059 1022145 930587 839502 766425 711280 688742 658399
13192 658399 626636 598692 576108 553504 525550 483703 445671 418698 396956 378958 369489 358957
13180 358957 346956 335499 325023 321538 314552 312673 311050 313233 309583 300653 296439 290842 279151
13167 279151 266478 265543 267579 264178 252228 239076 235781 241896 247778 249915 254695 266148 280248
13154 280248 281298 246990 200630 171830 158375 159569 163774 167014 173999 179199 180027 182914 176680
13141 176680 164063 156716 146009 137606 128656 122952 114481 116675 117922 116133 116208 120833 125317 135313
13127 135313 150166 168555 173994 167447 156040 145850 135447 130535 119437 113182 104983 102704 100961
13114 100961 101794 106370 113721 118153 114976 117979 102526 83211 74325 72630 71501 68629 64549 73441
13100 73441 96265 129063 156172 169530 162480 141471 113339 91539 81283 77581 70344 60762
13088 60762 49443 43539 49344 62924 76846 81680 85143 88782 94764 97513 100209 100105 86833 78233
13074 78233 72093 66488 61341 62225 57916 51911 48311 46688 45432 40141 32643 29552 28608 30255 30417
13059 30417 28228 21616 14661 15218 32847 67523 103272 133464 144746 129756 101686 72983 56065
13046 56065 42488 29450 18141 13138 11677 9309 6208 5620 2656 3932 14985 42469 65431
13033 65431 80419 96953 109219 125654 154296 189775 217843 227817 212901 178741 143336 113653
13021 113653 93902 77489 58449 47050 35861 23990 6772 -16403 -40654 -66490 -76613
13010 -76613 -66382 -42712 -13265 15334 19866 6534 -4940 -15417 -20969 -25522 -34018 -35695 -44721
12997 -44721 -49568 -55803 -65257 -75157 -84039 -86146 -64166 -2146 85084 182683 277353 360692 418024
12984 418024 432198 405016 358661 306212 251834 210650 178514 150335 128560 115262 100162
12973 100162 76861 53785 31460 12863 -12415 -45724 -72749 -86492 -86571 -62755 -39193 -25411
12961 -25411 -24947 -28397 -27283 -27654 -27429 -30815 -45609 -56476 -65205 -67980 -69366 -67651 -69492 -81050
12947 -81050 -90463 -64648 4793 95293 184745 236289 252212 237117 203806 168394 143048 124690
12935 124690 120695 107230 95929 88879 84385 85276 88057 93820 75181 53392 45438 41390 34111
12922 34111 21654 19668 21770 25480 30532 34132 30532 34464 36952 32382 27733 23208 18267 13938
12908 13938 3267 -1967 -2277 931 6399 10128 10038 25921 49910 76424 116539 169518 243748
12895 243748 339530 407104 406495 357855 283218 221860 179847 151209 131084 114772 105375 100992
12883 100992 96424 93698 83612 75584 78473 77038 75460 78436 79528 73735 60381 51456 57620 62529
12869 62529 58770 59348 63537 58787 50173 52400 59499 56818 62037 79271 97867 109437 131474 155957
12855 155957 187146 237442 308140 416713 598348 871213 1132579 1191182 1062059 845642
12845 845642 637965 484902 390066 328126 290537 265809 244219 215746 189958 169091 148352
12834 148352 129523 114143 99860 87957 79876 79440 78324 76915 79469 82964 73118 65613 69220
12821 69220 67818 63427 60124 65177 65867 71344 80099 93276 112963 128506 148734 178180 217053
12808 217053 284533 387445 548040 796791 1080426 1202889 1109910 900673 681618 519285
12798 519285 410552 341072 293153 252540 230352 211268 185817 163124 143283 122318 106923
12787 106923 94934 85217 76836 72263 63413 57074 55127 52325 43480 41655 45569 46236 42285 32152
12773 32152 31669 30432 37786 37950 35717 41489 49862 56850 64119 79030 101913 134808 182659 264643
12759 264643 354902 410012 388023 316612 239802 187321 147823 116075 101027 87188 84546 83338
12747 83338 73390 62365 52824 40386 29859 31049 37142 41699 33691 31923 32859 29935 27612 20484
12733 20484 19024 21900 24693 18382 12266 12213 18603 15680 12633 11408 6957 1623 2178 6198 7279
12718 7279 11510 13462 10960 12213 13264 12997 14172 10556 6421 4107 -901 -159 6291 5107 1107
12703 1107 -2613 -1903 -3190 -8203 -8073 -6979 -5390 -6197 -1756 -2808 633 4811 260 -3549 -5331
12688 -5331 -4626 -4933 779 8096 7349 3305 8693 9379 -1940 -10408 -11642 -13273 -11491 -5721 -1340
12673 -1340 3021 852 -5734 -6574 -2984 -4944 -6533 2679 -1479 -8385 -5796 3525 5302 2453 4001
12658 4001 5701 -3046 -7562 -6660 -7556 -10734 -12393 -6396 3681 4525 -2590 -5072 -3966 -7033 -3419
12643 -3419 249 -722 1060 -2409 -8633 -7565 -2552 -4916 -6349 -7531 -4578 -704 -682 -3939 -8236
12628 -8236 -8852 -7011 -8126 -9709 -12887 -15394 -14013 -11562 -10122 -5290 -11176 -4831 3666 1637 2098
12613 2098 -1523 -7620 -7583 -3163 -4810 -10623 -2210 2759 1372 -1855 -7894 -10243 -11201 -7755 -3346
12598 -3346 -8654 -14288 -9521 -4864 3320 4768 2913 5374 7497 16101 22761 27570 36190 50227
12584 50227 81133 130711 194261 214202 194364 148932 101841 72962 59021 49636 40583 30791
12572 30791 20464 22391 22779 19323 21505 19674 10812 9323 9253 9356 6261 2401 -2441 -8911 -10127
12557 -10127 -6659 -3344 -2590 -7409 -4358 374 7284 8991 3909 -2515 -1235 -4701 -8689 -8892 -4832
12542 -4832 -9614 -15569 -11674 -10915 -9252 -4117 -3025 -3893 2567 1310 -3272 -12439 -10396 -8725 -12158
12527 -12158 -9800 -5050 1126 5139 -2092 -2312 -781 2374 7078 2854 523 4690 14375 13725 7528
12512 7528 6988 11254 14209 22122 26990 25667 26826 27327 27089 31315 30538 25025 23125 19130 10804 2821
12496 2821 -2263 1825 572 -2957 -2866 -1190 1822 8712 12741 11189 5675 1719 -322 3735 5313
12481 5313 6390 6336 5903 3253 1002 -853 658 3774 955 8274 4700 6261 16783 25366 27733
12466 27733 29638 29635 43030 62818 84379 104362 125231 134141 122888 100253 77754 61412 54231
12453 54231 49735 45723 37039 29403 22727 17509 16400 11173 5386 2077 -269 2916 2689 -5222 2501
12438 2501 13229 15253 17295 18398 13876 7953 5695 2838 -490 -1252 -142 -1274 1127 7292 14456
12423 14456 18321 28107 36721 45306 58740 65823 81490 97226 107150 111404 103426 89051 79990
12410 79990 64776 47732 39544 32811 26560 29170 22304 18072 18656 18204 13248 10895 11535 10972 10856
12395 10856 9511 7668 4896 -2520 20 4914 5795 4755 7189 4779 11523 14671 9301 14752 21632
12380 21632 24465 18252 22767 39308 51115 54112 64230 78767 96706 117213 137148 143718 135593
12367 135593 116806 98943 82761 73006 66984 57972 51459 42584 33995 33483 29038 26668 23201 21748
12353 21748 15073 12193 11625 10764 16396 16047 19797 22483 25421 23902 25111 21389 26070 33927 34704
12338 34704 29994 28092 39490 54710 71176 89836 110176 137070 173339 202591 213024 210474
12326 210474 193414 166662 142635 117575 95655 82364 71934 64483 54843 50517 48867 45686
12314 45686 40234 34932 28009 25850 22327 19035 20895 24415 22280 22463 20207 17927 15178 14736 13693
12299 13693 17323 19336 21031 19907 19123 18649 26570 35962 47539 64249 81298 105323 113133 110839
12285 110839 101144 89450 82943 67973 61364 55621 50688 45239 41431 36591 32250 25761 21316 17063
12271 17063 20337 21784 15797 11368 4187 1740 903 5679 8210 5405 9302 5357 22 -2478 -3865
12256 -3865 -2629 -330 -4324 -6867 -6812 -12838 -15564 -14057 -8624 -8769 -12861 -7876 -2232 359 7033
12241 7033 4535 1623 1423 11745 13095 13098 14006 13571 15423 14811 9814 8312 4683 5790 4511 4090
12225 4090 4732 -1548 -3583 -3156 -2837 -9241 -6178 -2327 212 4149 3965 4329 1283 -318 532 -2188
12209 -2188 -6166 -7187 -6032 -241 3902 1911 -3637 -699 -4067 -9238 -11695 -18925 -17901 -7467
12195 -7467 -907 -4902 -10722 -11430 -6799 -488 -1003 -2319 -8382 -10336 -11502 -17341 -12371 -4142 -8011
12180 -8011 -7974 -10689 -6709 -3481 -7225 -8027 -5254 -3413 -5489 -7289 -2440 -176 -6553 -4869 -1698
12165 -1698 -3572 -6278 -7073 -3819 -4389 -3991 -5822 -10135 -14807 -8129 -10739 -15724 -15163 -16512 -22475 -23311
12149 -23311 -17959 -10704 -10310 -7812 -6856 -4350 -3300 -509 374 8600 11990 9720 13587 14882 8460
12134 8460 6364 4686 -3782 -5485 -6136 -2847 -2382 -4860 -7081 -9314 -13938 -11289 768 3223 3282
12119 3282 3462 2295 1339 -6559 -4865 -690 62 -3744 -6893 -6410 -2805 -4942 -6883 -1839 -3083 -5224
12103 -5224 -4175 -6476 -6382 -11785 -12962 -8502 -4995 -8790 -4890 -947 860 -2575 -4493 514 726
12088 726 -1662 -7839 -7929 -6314 -9327 -5779 -8960 -11827 -9161 -3713 4580 9734 3663 3994 5693 2965
12072 2965 817 2240 4441 2208 2447 6544 155 537 2280 -5193 -6459 -1338 3515 -381 -4678
12057 -4678 -4361 -395 5093 7082 1512 -5880 -6941 -6405 -8635 -8942 -13027 -13207 -3311 -1563 6493 15290
12041 15290 15700 9506 1634 -1007 533 4207 5884 7628 -443 2012 1476 1861 5338 3821 4269
12026 4269 -213 -964 -1530 -1246 1868 3870 7455 3970 2464 263 3605 6655 10442 11991 16286
12011 16286 19548 18855 17292 10009 6084 6565 6551 9283 11155 13397 19029 26411 29875 33481 40689
11996 40689 48159 50373 54393 65753 74558 86220 105373 138264 201628 310247 478090 751528
11984 751528 1109410 1442950 1518382 1405221 1296799 1135446 913038 687636 511224 396509
11974 396509 316265 261650 221626 187763 168268 147216 121578 104104 90560 81894 72402 57857
11962 57857 47233 38130 33038 34683 26399 24410 24469 19406 14134 12986 11854 14454 12763 12975 5452
11947 5452 -2449 -2924 -2116 1486 10855 11881 4854 3907 1424 1642 -2903 -7824 -4284 -259 3517 6413
11931 6413 7196 7604 3897 -2631 -1002 -3603 -5652 -7433 -9046 -6704 -4625 -2578 -9919 -8343 -4648
11916 -4648 -2729 1233 -7839 -12222 -11064 -12533 -14561 -9658 -8660 -5138 125 980 2914 5778 6483
11901 6483 1138 1191 -1134 2448 8437 6609 2173 4711 7965 2489 150 -4793 -11006 -11084 -10451 -3776
11885 -3776 -4313 -4928 1206 5944 5238 1922 -4186 -2312 2046 4416 6750 1303 494 -3767 -5503 -6906
11869 -6906 -9128 -7307 -490 250 3255 4775 -4195 -5793 -5340 -7523 -5835 -6333 -7746 -9217 -7277
11854 -7277 -7863 -2764 -2134 -1254 -206 -2058 -1225 -3469 -9382 -7520 -5360 -8534 -430 3506 1171 -6186
11838 -6186 -5088 1426 5558 1637 -1548 -1549 -8610 -11373 -9897 -5316 -9568 -14091 -10286 -10781 -12771 -9938
11822 -9938 -6767 -9034 -7568 -10790 -9812 -7814 -12805 -15619 -12869 -7906 -7499 -8645 -4717 1760 2029
11807 2029 -3620 -15139 -16870 -6276 -1905 3406 -706 -6185 -5806 -6354 -2697 -60 -2575 -8707 -11020
11792 -11020 -10948 -12074 -8031 659 647 -5323 -4020 432 -3675 -5638 -1929 -4497 -8534 -5157 1843
11777 1843 6231 13699 5862 3170 2915 508 -284 -6088 -12584 -9907 -6170 -3787 -6738 -9493 -10570
11762 -10570 -13421 -11163 -5150 -5234 -1657 -751 -7834 -13841 -7103 -311 -1883 -2838 49 -351 -3717 -7343
11746 -7343 -9588 -10204 -7768 -10694 -3736 -5386 -9967 -5849 -607 390 -3692 83 5792 11630 8483
11731 8483 2942 3689 10104 10672 5906 -1707 -9983 -8594 -7518 -10236 -7305 -4234 -2064 -2284 -2782 -4487
11715 -4487 -5123 -5726 -4424 -9377 -9786 -4686 -1341 313 -21 5498 4686 7614 9634 6403 7869 8711
11699 8711 4235 3225 9116 13564 9083 2606 -2424 3346 1329 2579 4813 4792 -3782 -9062 -7380
11684 -7380 -962 6901 9196 9382 9929 9941 5495 5393 5102 6045 4856 -2521 -4688 -2656 608 7645
11668 7645 2970 4067 1711 1642 2220 -2664 -3437 75 -2783 603 3283 -3090 -7646 -5559 2855 7926
11652 7926 7076 3886 3136 4411 2127 4661 2814 -3629 -4103 1744 7188 8659 3822 -788 -2848
11637 -2848 884 2841 1427 3191 5152 8235 6128 2531 -1974 -13656 -12625 -10510 -9549 -9277 -7580
11622 -7580 -564 448 -5751 -10941 -4537 -1344 -1834 -11823 -15223 -12821 -14152 -15914 -13169 -10481 -11796
11607 -11796 -10896 -6902 -2690 -2707 -1849 -4503 -2412 -3965 -10174 -10779 -9223 -11899 -9558 -16542 -19453 -11372
11591 -11372 -999 3302 2496 3972 11161 14391 16009 11108 5974 3543 2250 6357 4756 1658
11577 1658 -2533 -4586 -5000 -8212 -5619 -4350 -1784 1945 1781 2637 7063 5578 1068 3889 5326
11562 5326 -1038 -2350 -1805 4615 1457 2569 23 -639 -882 1519 2479 5948 -807 -1282 -1271 -3427
11546 -3427 -1575 6571 8339 8463 5108 3902 1163 -7190 -12908 -15626 -18004 -16451 -18593 -17912 -18999
11531 -18999 -25622 -29042 -30645 -25339 -18062 -20055 -25403 -31531 -30530 -35465 -46287 -50236 -51039 -52624
11517 -52624 -56239 -52850 -53395 -52299 -52374 -59498 -68856 -83458 -95984 -101867 -102369 -90319 -44006 55928
11503 55928 132857 172969 203204 220471 222949 211678 189970 166910 152300 138727 127814 113370
11491 113370 101279 100410 104464 110693 117321 127541 140627 169428 205985 223031 209417 191718
11479 191718 179229 154736 130571 115456 101825 93027 91054 77208 63737 57632 49121 48895 47466
11466 47466 42372 41332 43616 45584 47457 46167 45035 44954 45371 45844 43429 44560 47928 46159 46725 48772
11450 48772 50963 55447 60706 54907 47833 40988 42141 46710 43213 37455 34447 30170 29163 25034
11436 25034 31335 34063 38020 49775 57418 70341 84671 101437 116133 139442 167350 179980
11424 179980 204109 212448 213588 188443 169321 168319 155270 131099 108453 88454 65002 48362
11412 48362 41866 38792 40542 41591 42404 45882 43259 50431 53176 60175 64448 54182 52952 53144 56282
11397 56282 62069 59764 61796 68382 70639 64876 59037 53347 41512 36597 36244 34080 30702 37575
11383 37575 34489 32818 34275 37552 40886 44564 39224 30105 25864 16430 6215 -4588 -14546 -19979
11369 -19979 -20688 -15079 -10170 -297 11500 28585 43710 62155 75106 81831 85455 87324 84954
11356 84954 84719 89814 95699 108541 114628 119790 121811 117402 115861 119103 116051 112526 116080 119766
11342 119766 123385 122305 124006 124488 123235 123662 134549 153587 181992 225877 306658 436980 636727
11329 636727 951525 1344500 1655634 1638413 1500997 1381197 1185135 940586 715734 551367
11319 551367 448749 370778 314608 273488 249813 238216 221153 205400 200181 198432 189842 175244
11307 175244 172559 175655 169807 170569 173188 174017 191599 231544 282726 330459 339336 330848 345634
11294 345634 345703 316879 288798 259685 229317 197044 181287 177292 176243 174905 180355 179885 177001
11281 177001 183292 197843 210972 216928 225703 231547 236902 239033 237699 234102 229475 229049 232863 235857
11267 235857 238520 243075 242867 230651 206676 199199 197370 178725 162175 163592 161754 152630 147487
11254 147487 147985 148300 136081 129020 141274 157453 173546 189242 210219 226802 237957 247608 252395
11241 252395 261655 275773 290731 300978 300429 289209 282431 275715 275116 288093 311067 347248 382843
11228 382843 423591 466621 489997 510617 525382 528357 528306 524215 528733 539519 592989 650669 657518
11215 657518 689791 706233 688397 699877 738887 768564 802025 853128 923772 1011011 1098470
11204 1098470 1174872 1246376 1318196 1385130 1461504 1557878 1664135 1792518 1935446 2071442
11194 2071442 2241388 2465214 2729895 3014197 3318262 3693144 4175074 4777238 5532127
11185 5532127 6386757 7122345 7926812 8976252 10245410 11868749 14231907 17885114 23678690
11176 23678690 33261739 49440884 76405507 120157087 181940519 246403527 275516278
11169 275516278 256238354 236532024 213910424 178233419 137985019 102421442 77635513
11162 77635513 61961675 50685709 42266133 35882827 30821220 26582680 23041411 20203657
11154 20203657 17905894 15751408 13780526 12061860 10500081 9134564 7969736 6987010
11146 6987010 6161836 5472855 4880550 4367277 3915131 3519737 3166476 2841050 2559586
11137 2559586 2319208 2089400 1888775 1709051 1542299 1393779 1264840 1138346 1046377 1005661
11127 1005661 1004160 989267 953584 914048 828591 745277 690488 640446 580264 530691 499685
11116 499685 470023 438509 409933 384143 369313 364985 370862 385821 402428 411950 404724 389156
11104 389156 365311 336737 319259 307472 291195 272715 263336 259982 258742 256766 257941 254810 260408
11091 260408 259510 250634 252448 265749 274474 277221 282070 273576 244294 224447 219193 205800 177707
11078 177707 163420 170205 177884 167969 160723 160916 154054 148574 145819 143274 138008 128239 124651 122943
11064 122943 117263 109759 104124 99441 101678 102020 107795 112643 116336 114242 113405 120267 127006 128417 127740
11049 127740 143622 176855 219580 244876 242662 211303 144212 96335 65990 71733 68600 69128
11037 69128 72308 76310 70614 64575 65156 69839 74779 78140 83995 94896 106643 115338 121012 135307
11023 135307 143393 155688 163156 174836 203954 253465 332899 467068 685166 1013955 1388610
11012 1388610 1616921 1527276 1403263 1270626 1066111 824631 614569 472275 380699 315159
11002 315159 264732 221695 185376 163244 138146 111078 95641 78008 61364 54429 53865 52434
10990 52434 45533 34693 32666 30500 22910 10503 3956 565 -3058 -7534 -10647 -12977 -14314 -8981
10976 -8981 4266 25249 42991 52442 55845 66595 81003 87726 85669 80295 78847 68353 54920
10963 54920 41410 32033 34077 39427 41009 32896 25916 27945 31431 24179 20593 20968 24074 24443 19115
10948 19115 5780 -929 -3878 -11861 -12661 -13721 -16361 -18082 -19942 -14982 -351 3163 870 5136
10934 5136 8773 12709 12143 10678 8765 8139 12297 16466 19292 19283 20245 21952 24065 15081 14382 12207
10918 12207 6079 7580 18417 20920 21161 16236 6346 5708 3471 1963 5654 10377 11548 10435 14330
10903 14330 21981 19305 9399 1348 2653 1597 1729 10500 10929 -2177 -12937 -13653 -10277 -10893 -10037
10888 -10037 -7114 -1701 3250 -3657 -9425 -9548 -8962 -6028 -7154 -11696 -13164 -14038 -13089 -16153 -24730
10873 -24730 -25437 -18945 -20363 -19261 -25525 -36416 -35973 -34316 -36642 -48849 -65270 -80985 -106414 -135757
10859 -135757 -168580 -192361 -185193 -171314 -155014 -132365 -116344 -103222 -97680 -89871 -86474 -88604
10847 -88604 -91764 -98145 -113875 -125678 -138881 -157616 -179869 -203810 -228630 -235754 -183803 -106802
10835 -106802 -52457 -3346 43610 75996 92928 94440 95161 92363 84719 81824 78928 73106 64425
10822 64425 61170 62550 58723 60108 63049 63100 53836 49158 51107 49122 60634 61689 64632 70258 63747
10807 63747 50180 32820 23224 15481 10790 13158 12101 15976 20962 20423 18311 18175 13153 11093
10793 11093 15847 23237 28228 21198 15020 18473 27169 25187 19222 14085 10868 6655 5263 -517
10779 -517 -3319 3601 12167 16148 15702 13499 11080 5234 1740 2620 8679 5115 5586 14242 15558 30448
10763 30448 31804 23724 19474 11432 3565 2347 -1872 -6164 -2042 3963 3262 -4549 -7917 -7599 -5848
10748 -5848 -1139 2581 3660 -3992 -5649 -5087 -4709 -2047 924 -1857 -5628 -6123 -3093 2417 4250
10733 4250 6281 3142 4441 11808 17382 15144 13150 3806 -4066 544 8233 6261 6407 5329 1909
10718 1909 2201 9935 14582 13380 17295 15695 10899 7396 3924 -5745 -8524 -7527 -723 3121 -23
10703 -23 -1277 600 1076 4278 3815 3352 869 627 -1849 -7459 -12290 -12754 -11939 -7828 -2865 -9485 -11310
10686 -11310 -7220 -5655 -8551 -9490 -8275 -3673 4008 905 2804 4165 -1091 -6696 -6176 -8035 -5832
10671 -5832 -2976 -3581 17 -379 -1380 327 1002 980 1310 2693 1096 -1074 -6000 -5282 967 2587
10655 2587 1582 4582 6342 2916 -698 -1629 -4212 -7793 -7723 -8387 -5432 -6090 -9594 -7655 -9112 -11142
10639 -11142 -7499 -10996 -13635 -5761 -3525 -10919 -13577 -17450 -16563 -9420 -3887 616 -104 1225 6509
10624 6509 2922 -6244 -7305 -1237 -2860 -6611 -1602 -2791 -3687 -4923 -11683 -10540 -6344 -10143 -10800
10609 -10800 -6540 -8294 -3426 3810 8442 5347 4711 3119 8049 4701 -4649 -10045 -9166 -10596 -11673
10594 -11673 -7508 -3441 -3469 -6414 -8291 -8459 -11702 -16481 -14077 -17698 -21246 -17175 -11103 -9636 -8659
10579 -8659 -5579 -3039 -5784 -7313 1967 9703 3656 371 1497 1262 -1317 2128 4318 2294 -1825
10564 -1825 2857 7792 6285 -3018 -3673 -1095 4822 253 685 6459 6915 9303 6082 1888 -614
10549 -614 -243 3937 5062 2111 -104 -2254 -977 -316 -2719 -7942 -5345 -5577 -10206 -7278 62 -1980
10533 -1980 -3477 -4681 -3596 -7995 -5468 -8130 -18583 -18335 -19235 -16420 -13966 -15918 -17457 -8018 500
10518 500 3095 2457 3360 -1310 -2543 -3160 -11464 -10705 -9230 -13110 -16256 -8691 -562 1674 7544 7614
10502 7614 6154 -3033 -3977 -3391 -2477 -1764 -1362 -2465 -130 -2394 -4975 -6187 -8362 -12865 -5964 -2618
10486 -2618 -4834 -1731 544 1347 6600 13333 18190 30910 38529 37788 30445 21487 11075 7972 8014
10471 8014 5505 3064 154 -2020 -1486 3545 4809 3162 471 -8958 -10212 -4476 -1335 -6114 -7563
10456 -7563 -13975 -12509 -10887 -7405 -722 8613 5265 1939 -854 -2001 955 3251 -2003 -9299 -10012
10441 -10012 54 935 23 -3790 -5635 -765 1641 645 614 -2297 -3690 -3371 -6833 -7428 -4912 -6664
10425 -6664 -2794 -4946 -6416 -5512 5605 10706 7742 2909 4763 -926 -2203 -9661 -9853 -7436 -11998
10410 -11998 -11371 -7584 -5501 -6832 -6664 -7352 -12128 -11152 -6506 -3502 830 6564 -457 -2192 -417
10395 -417 -5228 941 4833 3714 218 1780 8773 9780 8051 2452 -3904 -2039 -443 6118 9018
10380 9018 9820 6392 10075 9582 10426 12828 15002 12691 14356 20491 14712 17922 21772 29475 31590
10365 31590 34389 41238 46466 51267 55961 67252 86974 119486 165010 257518 417362 667018
10353 667018 1015099 1374091 1525274 1433626 1331045 1188453 971507 740228 543819 415973
10343 415973 331205 273896 227614 189797 164597 143474 124380 102569 82271 70513 60561 52957
10331 52957 41099 34291 34677 26048 23190 14645 7585 10385 12452 10823 17825 14832 16109 19184
10317 19184 19776 14807 9976 11821 8314 4250 6893 6777 4997 3631 1315 1269 4664 8105 7532 15552
10301 15552 14346 6168 -1997 -1537 -4683 -11660 -13849 -15203 -8539 -993 -4773 -6350 -10783 -7139 -5183
10286 -5183 -2035 1262 -2954 -2029 -2209 -1917 447 -2717 -1826 -2650 -4357 -8913 -11555 -717 -568 -2341
10270 -2341 -4859 -6570 -7277 -5372 -6335 -9943 -7927 -8509 -4692 -1698 -6615 -6068 -6466 -8575 -9076 -5994
10254 -5994 -743 -1528 -5827 -9958 -15502 -14411 -4961 -1797 -1365 -4869 -6722 -7721 -5898 -2235 -5196
10239 -5196 -3370 5057 363 -2770 -2906 100 3507 3138 6562 155 -3966 -2780 8967 10410 6075
10224 6075 3024 3214 754 -2049 529 814 137 6760 3315 366 -1500 -1491 -154 1213 4912 5509
10208 5509 1683 1214 -4161 -2217 203 744 1111 4228 9306 8831 15191 14565 13411 20461 28598 28824
10192 28824 22612 12753 12136 8344 2708 -1232 3244 10774 8912 8535 4348 -4482 -10677 -7621 -2988
10177 -2988 -5137 -3085 697 7641 5637 -1766 -8288 -6658 2134 5673 6083 -1042 -3839 -1363 4986
10162 4986 3780 5164 3138 3122 1845 -3803 -401 7251 15340 10900 -252 -6733 -4554 -3071 -3982
10147 -3982 -3572 1681 2280 774 -1480 -6516 -4686 851 3562 2009 -8127 -10926 -4234 -4012 -4751
10132 -4751 -2602 -4349 -2721 -653 -1292 -2787 -1881 -936 -4059 -2881 5600 5641 -3696 -5864 -2 7479
10116 7479 9235 8087 15354 15273 6123 7114 10010 4247 123 2660 3620 3199 954 -3482 -6772 -5221
10100 -5221 -3045 1127 3229 -1866 -780 6005 3201 -2900 -8814 -8818 -4764 -1625 2283 5607 2903
10085 2903 -304 -1875 1409 4556 -1170 -7225 -12020 -9165 -6557 -3430 -5093 -8534 -8774 -7059 -7696
10070 -7696 -4038 -4944 -2396 -1985 3449 10247 16430 16648 10292 2210 -1067 -4084 -2767 -6390 -1455
10055 -1455 3771 5854 4874 6468 3919 3119 8856 12008 14002 10741 6941 3965 5261 1951 1186
10040 1186 2854 2740 580 -4321 -9646 -12555 -10608 -10273 -8874 -10776 -2941 362 1874 -2839 -2297
10025 -2297 828 -577 -6793 -8244 -2859 -912 -1809 -2285 -3246 -2806 -7130 -11752 -15071 -7444 -1563 1479
10009 1479 794 2784 1027 6486 7868 -1111 -3583 -432 4255 13452 17896 18219 28715 51523 72010
9994 72010 71609 60063 45876 36994 29440 23179 25904 25320 20535 12107 10432 7900 12704 11569 4652
9979 4652 3478 7088 16921 21317 23290 27453 22042 18165 15365 13986 9059 632 4963 5490 1526
9964 1526 3019 701 3153 8503 4187 -3394 -10482 -12158 -3221 104 -1664 205 1043 -1313 -6062
9949 -6062 -5749 4184 3038 2367 3382 6860 7580 3547 -601 3418 9764 12957 8636 6474 9980 6966
9933 6966 4791 9769 14639 14153 8341 11502 15243 8682 10267 8023 15314 22125 17518 8760 3086
9918 3086 5375 3244 1282 -2585 -4309 -6756 -6572 -6005 -1046 -1056 -7027 -6390 -3253 -5508 -6005 -4055
9902 -4055 -4380 -2608 -3143 3565 4398 9734 13430 16563 11660 8867 11042 16843 18326 11607 9242 8362
9886 8362 9678 5609 5324 2957 8135 7919 4745 1515 -2291 -4028 -6075 -489 6425 1587 -2421
9871 -2421 3295 1659 2027 4674 8624 9451 13598 23955 32100 44718 57715 59303 49365 40734 30022
9856 30022 20215 18135 17920 15872 13142 5152 6723 5764 8363 11860 18462 21500 18992 15403 14135
9841 14135 12209 9216 10900 12434 10999 9447 9991 9813 13158 16980 20647 14626 6385 5394 5597 9074
9825 9074 5260 10943 15117 21144 24912 26304 26953 28813 27423 32893 49399 72381 101403 131260
9811 131260 149500 147069 134225 118954 110584 110821 117713 134117 169967 220080 257930 278944 305195
9798 305195 338076 394535 501678 701083 1022883 1433630 1787895 1937179 1828158 1548480
9788 1548480 1213894 924742 713686 574803 487182 423780 373101 329318 286519 244614 207779
9777 207779 177570 160855 151026 135901 130142 128964 130575 137011 150806 163109 160605 140753 120961
9764 120961 108592 97563 89201 83535 95829 119150 133645 123015 102655 74493 56967 49422
9752 49422 42500 37867 27247 25030 26095 20764 16702 19401 24189 21754 19066 18309 16467 16002 17819
9737 17819 13188 11223 10464 15854 10308 7910 10043 8461 5166 7933 7322 8677 10777 7046 8600
9722 8600 12788 15742 16493 5722 -898 -256 -5364 -5964 -7259 -1117 2052 2418 3298 -231 -1188 1646
9706 1646 4277 8211 6610 -355 -4293 -5750 -955 791 -1371 -1847 1143 8562 11404 6453 261
9691 261 3779 6654 7210 5388 1191 -4872 -10006 -4286 2394 7260 9386 4944 3352 2958 8643 9071
9675 9071 7113 923 1897 -2548 -6331 -1754 1579 -1927 -1670 557 7263 3757 -4308 -4357 3511 4217
9659 4217 6670 6723 11156 14021 11041 1892 -431 5705 3328 3177 3662 5401 2863 -1705 -283 2147
9643 2147 926 962 -1033 -450 -1847 -7493 -5283 100 3336 6046 11443 6909 8411 5787 -4645
9628 -4645 -6617 -2889 2200 6700 11881 14844 14816 8015 7431 6096 7134 4233 -938 -6937 -1996 5253
9612 5253 8437 12248 9194 6119 5570 195 5088 8472 14287 11679 8341 6296 8635 13273 8338
9597 8338 502 3559 11209 17347 13818 11349 9839 8661 4894 4063 3137 8044 10002 6007 13926
9582 13926 12012 9130 6538 8220 7467 3960 2715 6817 11121 9758 9315 13359 11219 12476 10612
9567 10612 12065 17745 22034 11875 10605 10404 12394 14178 15981 16904 14104 15571 19651 21756 19201
9552 19201 16058 10870 10062 16927 22662 24363 23223 25933 25241 15968 14160 13316 16393 18206 22644
9537 22644 20566 24331 26262 15646 10497 13701 9362 6722 10576 15703 15173 16929 13237 14028 16473
9522 16473 19117 18092 19166 23268 25429 19809 18680 12593 4830 6597 9152 15323 12750 12948 9251
9507 9251 8837 11453 13543 12721 13216 10250 7788 7324 6378 8433 8329 6352 9495 11589 10248 10113 10973
9490 10973 11794 18170 17159 11875 10891 17691 15979 15552 9435 5237 8518 10227 12699 12436 6117 11596
9474 11596 14464 9941 6441 5812 6204 8123 8557 9894 15748 18128 19107 18829 10881 12932 14761 13502
9458 13502 11953 12104 10737 13058 10847 10126 17760 23610 26783 25982 22060 22616 18803 19192 19047 10655
9442 10655 8552 17258 20624 19184 15725 15039 18569 19478 23178 25381 24318 20950 25352 27567 27519 26017
9426 26017 29218 28746 25687 26494 26066 28062 26709 23372 20082 20107 17547 19845 24564 32718 33752 31341
9410 31341 33577 31466 29497 29135 26106 26461 36203 43861 40584 35395 36756 33096 32723 30506 34208
9395 34208 39966 40340 33829 33606 43601 48508 47067 45238 48216 50131 48339 44940 44755 40880 39606
9380 39606 47240 55108 58003 54630 60874 60653 57267 62869 63803 62508 68922 70107 73027 73087 74725 70932
9364 70932 70471 68969 67721 74949 80077 78011 83303 88097 93548 97160 98848 101416 104235 100449 95756
9349 95756 104143 99733 99566 107163 113537 121687 122738 128949 135463 144050 153235 161019 166044 165932 173266
9334 173266 185013 192165 197236 203138 212722 233376 243825 251347 263631 271778 285023 300722 310889
9321 310889 327959 346974 362318 379665 394866 413117 438514 464605 487410 509793 529798 564337
9309 564337 603367 630359 662201 699593 722022 742260 766741 788220 809877 833969 855045 870112
9297 870112 883154 895707 899213 903948 905842 909092 907505 901429 891371 875080 852281 825049 797051
9284 797051 775327 751018 724070 697527 662197 634189 606841 582454 554355 524579 498478 473901
9272 473901 447440 425445 403539 379978 362630 353406 339079 326541 312196 293477 276765 261282
9260 261282 245239 231877 215572 203934 198990 193924 190082 188382 182833 179668 177451 174438 170444
9247 170444 161086 152158 152262 146744 144906 139276 131213 130915 138115 138461 130756 127931 124656 118568 116888
9232 116888 117413 117528 115631 114740 109453 111244 109435 102868 94258 88442 82437 73328 68669 69995 72555
9217 72555 72405 77442 74687 76493 83681 79608 78822 79023 80076 78561 80444 76332 74404 73146 62229
9202 62229 61852 69770 78796 82438 89232 91174 90495 95231 99006 99755 102454 104850 100985 98938 97053
9187 97053 91216 77040 75248 80831 92436 93289 85548 72315 62839 61022 60726 57633 55795 51585
9173 51585 50944 49980 49604 50941 56518 52394 53860 61639 65510 69432 68855 61685 65036 70954 72000 77956
9157 77956 91743 100537 111474 125904 131180 129626 128999 130797 136505 145393 142946 136164 120887 109396
9143 109396 102876 91919 87131 84537 88574 90129 83324 80882 86754 89251 88096 94033 91353 87566
9129 87566 86326 82711 81657 88835 94279 96658 97941 85888 83907 82713 88303 104581 120729 126402
9115 126402 149396 170331 191225 209950 235938 265535 291185 324304 369783 445632 572376
9104 572376 780078 1089788 1353864 1393389 1238771 994453 771761 614333 511652 442143
9094 442143 394783 366799 341269 309957 287471 268998 248511 224449 198106 174375 161101 151749
9082 151749 143032 133187 130159 128999 129857 131908 132363 141589 160965 177699 188149 206733 239365 265120
9068 265120 279969 294215 310194 340853 394502 468626 559083 692805 907635 1266320 1847407
9057 1847407 2454739 2632794 2393906 1931091 1463438 1122538 902121 751305 652745 587759
9047 587759 534583 475913 407852 344065 289489 249632 206981 169541 143662 127978 118489 149056
9035 149056 224852 289540 329598 340542 323018 300367 292862 290281 284038 274104 269367 268954 273257
9022 273257 282757 291432 304076 328287 370137 416037 480732 591739 772046 1034293 1320131
9011 1320131 1436771 1335590 1101623 854013 667920 543572 459688 397012 351067 303699
9001 303699 249377 199746 158664 132261 105793 79449 52783 35848 22687 20797 74072 218709
8989 218709 351213 432099 464789 449291 406667 368177 352275 345573 335084 335192 339751 344630
8977 344630 345069 332201 313482 298015 296080 301509 312029 338562 391082 423337 410128 376729
8965 376729 346712 315446 283378 263607 248640 250801 257681 271321 275800 277834 277980 260210 238567
8952 238567 224601 222080 206489 168898 130260 110543 120451 167964 233965 286664 310325 307766
8940 307766 290195 282352 284808 280943 272839 270855 273781 275464 273052 265722 260789 258463 264656 271375
8926 271375 272922 276226 292682 317978 320924 303853 278091 260599 254534 259089 270173 287575 321042
8913 321042 366420 405287 435966 458658 446760 424176 412647 406020 380026 316639 246167 192973
8901 192973 169775 158321 150028 144118 142665 149326 160601 171912 190676 204462 210234 207747 210246
8888 210246 210419 213680 223248 228836 232607 235416 233939 235656 242384 245328 240553 227799 216980 213839
8874 213839 212271 217969 229283 238182 251024 264692 289675 315746 338066 354806 352547 344764 345738
8861 345738 345105 332724 298166 252592 208508 175354 156434 149441 148976 165574 182681 194360 213583
8848 213583 238882 258926 272086 284048 289319 293242 297607 304969 320528 339290 353593 363448 365851
8835 365851 372201 384944 402970 412962 426599 454306 500100 541682 562414 547728 502004 457178
8823 457178 415377 397968 403895 419509 429722 439074 455627 464474 466152 459454 462634 465868 468236
8810 468236 457544 444137 441676 441982 436855 435493 439660 449702 464158 477581 482712 487785 497322
8797 497322 510051 531536 554564 568794 574045 577202 581145 598545 613438 619580 622309 647528 704219
8784 704219 784076 866139 929290 932997 875441 805172 750674 715188 710640 744860 784361 811517
8772 811517 821812 826951 835073 849017 867984 889024 905756 908350 913169 921077 939834 965537 993078
8759 993078 1024766 1054160 1071873 1083544 1090859 1089211 1087228 1100060 1110658 1115642 1133943 1169368
8747 1169368 1203437 1229392 1238323 1235429 1244948 1267632 1307112 1369998 1449315 1543269 1648022 1743245
8735 1743245 1802974 1865712 1945662 2032235 2144638 2286462 2442361 2610315 2788831 2958091
8725 2958091 3143974 3383613 3679367 3998680 4314466 4664622 5095650 5630970 6320794 7235532
8715 7235532 8458443 9918155 11497447 13345857 15757159 19128026 23676334 29528151
8707 29528151 37239948 47969395 64044061 90112454 133429961 192658840 229985947
8700 229985947 223877573 189229442 145613560 109358742 85236865 69506887 58717926
8693 58717926 51381623 45973580 40797515 35773922 31399900 27759724 24750533 22225972
8685 22225972 19956960 17906707 16137921 14696119 13554559 12726185 12190428 11907839 11800131
8676 11800131 11800225 11945803 12289025 12864603 13731556 15005185 16894637 19363204 22079084
8667 22079084 25281268 29489091 35522872 43894903 54705949 68785481 88082303 116410235
8659 116410235 161603280 237344873 350572083 434321348 434769789 377729872 296572796
8652 296572796 223541861 173098329 140079040 117246299 101574059 90478441 80210114
8645 80210114 70005114 60884376 53172507 46749872 41389420 36509080 31977466 27920616
8637 27920616 24432658 21536887 19199882 17353621 15898185 14714861 13719201 12903537
8629 12903537 12287467 11865411 11660387 11680009 11979833 12627385 13497500 14602861 16158609
8620 16158609 18507668 21942141 26567254 32665095 41022755 53202772 72480525 104834001
8612 104834001 156248710 208312857 222175344 200265548 160373792 120801847 92130240
8605 92130240 73579697 61033950 52355321 46313887 41157712 35995423 31273307 27260017
8597 27260017 23918745 21167117 18733715 16468962 14386082 12520428 10908558 9567608
8589 9567608 8475116 7585121 6831812 6165014 5569247 5049912 4602395 4223112 3894485
8580 3894485 3603031 3343415 3116934 2903210 2688086 2471727 2292181 2137658 2017190 1924362
8570 1924362 1823705 1716299 1637259 1589173 1547554 1493681 1410490 1323496 1270864 1256992 1267615
8559 1267615 1259099 1201579 1112749 1037774 996946 967357 952364 946857 966095 1015914 1107930 1177989
8547 1177989 1158381 1078147 982014 901531 852274 819757 776716 735686 704930 697208 697125 707387
8535 707387 717697 740346 768491 786231 749627 658312 578800 527598 514254 535192 550113 558328
8523 558328 556955 545177 532408 513585 504995 520958 578952 674536 733991 723038 657424 582226
8511 582226 542681 521818 513432 510204 516719 534148 557378 589090 615124 609908 581194 531196
8499 531196 480014 449533 420526 393648 367176 352764 348217 349756 351040 351752 359043 363256 351896
8486 351896 328314 291841 248953 214369 192203 184041 180938 179754 184679 191979 195239 192589 188109
8473 188109 199163 237205 284961 303556 283674 253015 233518 218519 211411 212136 227666 242787
8461 242787 257720 279760 295112 301034 308588 315353 307546 284401 253597 227939 210000 196462
8449 196462 192046 187368 183805 179723 169950 166185 161422 152830 145977 145667 138944 128932 121051 110632
8435 110632 97167 90713 82988 75981 75376 75573 74903 77094 81519 78403 75697 77803 85410 85038 81849
8420 81849 77623 78052 87090 105677 122023 135162 146627 151197 155123 152952 146964 143823 136273 120511
8406 120511 108226 103862 102761 100394 89832 85454 82072 78283 69900 66552 66214 59161 48830 29996
8392 29996 20610 3639 -32015 -52187 -57613 -46193 -31670 -13608 367 4740 6553 111 -10003
8379 -10003 -9437 -9618 -10161 -17436 -32856 -43650 -48132 -60737 -79201 -89560 -95947 -68482 -12263 39830
8365 39830 80340 103309 112964 108610 100187 95613 89751 84684 73634 72156 66232 56379 49383 47371
8351 47371 46077 39656 11497 -14089 -41124 -88673 -147843 -187673 -187453 -158118 -122739 -95049 -74218
8338 -74218 -59665 -60253 -68435 -72656 -79471 -89672 -96766 -104446 -120626 -141326 -160922 -179383 -209820
8325 -209820 -247606 -272590 -223538 -111777 -589 86639 140454 173184 180415 175712 176444 172960
8313 172960 166837 167354 172341 169057 165076 158940 160781 169547 170280 176344 181991 194756 207405 225425
8299 225425 265502 361818 556579 867655 1186668 1280615 1163177 931932 703806 540023
8289 540023 426561 350271 296000 259641 223512 180863 144376 110605 78194 44769 11522
8278 11522 10650 54416 109538 144052 165383 180291 187794 181181 176835 170793 165808 170821 181280
8265 181280 193353 200569 208571 220835 235531 255177 269933 302952 353701 409754 499634 631682
8253 631682 821462 1140816 1688507 2335691 2591721 2403190 1962629 1500887 1156596 930218
8243 930218 766645 653502 576771 514008 459615 411069 366556 329012 295357 261608 230822
8232 230822 208061 191832 176659 164601 153198 146047 136059 126135 118888 111623 115668 120139 113436
8219 113436 110642 124924 130504 142139 153625 161140 168161 189148 221989 261367 319154 402321
8207 402321 544381 788331 1099514 1282619 1242406 1049030 814241 626493 496471 405668
8197 405668 347599 306777 276079 251444 227362 204033 180072 165964 154039 137523 116296 100528
8185 100528 94500 96423 97959 89827 85346 72951 63604 57677 48008 46245 46830 46950 51200 52875 53736
8170 53736 55057 56715 47663 42246 41414 42213 48898 54123 61745 63148 62611 65669 71224 71492 64239 60489
8154 60489 55694 51103 50437 48476 50504 50719 54231 53703 51170 50335 49774 50008 48752 48410 47853 48103 48897
8137 48897 41861 39615 40480 42723 42156 36512 30234 37432 44059 44514 42860 39701 44484 50365 48590
8122 48590 44759 36176 32704 36143 34304 33820 33156 34541 36087 37491 43653 46291 48654 48442 51532
8107 51532 57056 61091 65366 67945 69789 69512 74831 83568 92243 99222 100393 93220 89205 88745 94263
8092 94263 100038 110819 121990 139425 167558 208382 261630 326838 393868 467534 517683 526276
8080 526276 508110 462181 399043 333167 274062 224602 193047 175474 156511 140926 137001 126770
8068 126770 121287 110635 96864 89949 84136 84221 79928 83961 89056 97355 102272 103795 110850 125207
8054 125207 140343 145256 144806 145845 140689 129504 122467 121954 128166 145113 160910 177231 219160
8041 219160 278808 361422 480082 635664 812457 946451 994651 954320 837375 690691
8031 690691 552359 446524 373451 318507 277081 244186 218597 198678 180430 165314 149588
8020 149588 129138 113782 111170 109734 104792 91615 77854 79449 81027 77756 84497 85096 86010 88689
8006 88689 92813 92268 85039 81062 79437 85352 92462 91713 97565 114646 135479 165989 207283 257844
7992 257844 306193 343533 378805 388278 378806 356121 319551 282857 237495 188923 158975 135319
7980 135319 117676 100759 94782 93285 79523 69010 67284 63274 58312 54731 44729 33323 30133
7967 30133 35200 38531 31440 27856 26870 17077 14855 20580 20219 25035 32687 31836 27093 26418 25499 22931
7951 22931 17803 16196 16704 23523 23172 19282 24139 17139 10288 15663 21350 17429 20843 24517 27035
7936 27035 28568 24527 13015 9305 7540 6718 12152 20992 17448 10887 12379 13126 18496 22884 14672
7921 14672 12685 19877 23492 22681 20684 16196 5167 2579 6585 12678 16626 16618 12694 13988 13212 22499
7905 22499 26074 24400 22673 21370 21447 22599 19215 20190 28502 30455 26641 23681 23004 18153 15912 21763
7889 21763 24309 22560 26760 19660 15260 17490 17917 16585 16009 11413 12170 14239 14499 15557 19464 18894
7873 18894 18026 18562 18284 19618 19062 16534 16465 19452 17882 13030 12108 11282 7754 7528 2789 3146 7186
7856 7186 8643 12924 14335 17323 21074 22300 25590 25580 20508 21440 18156 15809 16873 20840 24086 23026
7840 23026 21037 24836 27196 25006 16053 11721 9098 12738 8240 2294 -2960 1029 1255 3566 5417
7825 5417 5973 7818 11679 15686 22744 17934 10031 6711 6746 8094 9964 10970 11927 14545 17447 13883
7809 13883 13279 11059 10902 9225 8159 3474 134 -882 636 1043 4116 4682 2217 2128 4050 10378
7793 10378 10221 7607 7800 11534 11152 10540 14149 7532 -1432 -4555 -4404 -8396 -6562 1268 2167 1294
7777 1294 4972 11999 14976 14347 13587 7892 8357 13595 11709 11072 14910 17281 15220 8304 2452 -1226
7761 -1226 2427 -3443 -5731 -747 -2104 1998 2156 3079 1175 4252 9609 7631 5972 236 -6256
7746 -6256 -3322 723 1470 4393 8976 6683 2734 2167 5996 580 -6489 -4997 -5723 -3183 -334 -1266
7730 -1266 2073 7420 6951 5547 3374 6651 5220 5343 1904 2186 -1631 -4305 129 5734 1864 -1637
7714 -1637 1964 5 215 3711 7494 13175 13061 5965 112 2011 8743 8292 10197 12927 12992 12874
7698 12874 13962 11888 7439 7975 856 -712 85 3470 4801 9514 10556 11233 11108 12603 6923 2893
7682 2893 5388 4570 2751 2377 -2501 -1097 -2296 -3063 210 697 3054 5509 8390 12120 9320 4234
7666 4234 -1386 -5554 -12251 -11217 -6148 -5692 -4012 -3320 786 3574 4281 3304 8008 14007 10978 7621
7650 7621 6013 7006 7344 637 7995 9811 3447 -2670 -1684 6040 10836 14052 12554 10900 9881 8364
7634 8364 7060 3200 2763 9415 13480 11462 8088 3961 1096 1836 3881 -821 -1494 1719 1066 7451
7618 7451 4231 2693 857 3068 5544 11976 10154 3103 4609 4163 -2833 -3682 2403 7867 11151
7603 11151 11795 14494 11934 5933 3725 9553 12017 8454 10062 8815 10303 11155 2123 -4445 2353
7588 2353 -1274 908 4680 2219 1079 2254 4135 5488 4973 2723 4653 7830 8201 5775 6162 -635
7572 -635 -6693 -6867 -1261 -222 131 3115 11549 17374 18729 9641 -1195 -4288 -4299 -3904 -2632 -5519
7556 -5519 -6211 -10178 -13090 -8962 -1673 0 2129 454 -945 -4741 -212 7245 5970 7811 11294
7541 11294 7298 -800 1114 7306 9595 13258 11273 7455 3233 -1299 1120 471 1395 7244 4975
7526 4975 969 4167 4819 3838 304 -96 -1281 2007 3528 7039 13197 8867 7815 9045 3916 -2380
7510 -2380 -5079 -6109 -4198 -6971 -9930 -3889 -4065 -4517 -4041 -510 -907 -1532 1717 5908 5490 2345
7494 2345 980 3813 10086 7425 -1078 -7315 -8956 -8936 -4142 2015 6893 6149 9623 9807 4662 3193
7478 3193 -4430 -10656 -8860 -5643 -9255 -7277 -5533 1114 5971 2470 1396 814 1708 -1630 3965
7463 3965 1027 -3458 -5748 -5327 -3877 -5079 -4624 -2577 -4328 -4528 -8764 -7779 -1175 6473 917 -605
7447 -605 1176 1708 -265 -4305 828 720 -2051 751 7125 6535 11624 14020 13466 16323 13702 -1083
7431 -1083 2304 9137 5866 2689 6270 10896 3437 -2723 -6336 -6412 693 1366 414 -3107 -6151 1984
7415 1984 4565 8997 2020 -1999 3086 5554 -1102 844 -256 -10976 -7158 -482 5050 9278 15726
7400 15726 9742 2437 -2571 -6336 -8974 -8776 -9780 -3691 3529 5097 3750 4095 5454 4385 1224
7385 1224 2049 3005 482 689 4358 -1275 -5759 -3346 -1105 -2887 2746 2299 1469 3237 612 -1521
7369 -1521 -2168 1844 4262 5601 11569 13172 8451 -852 -5554 -6508 -5666 -2255 -5758 -6414 -4286 2341
7353 2341 5548 2677 -5107 -11956 -5006 -3225 -660 2655 1445 1259 6399 2564 -1610 -702 -2272
7338 -2272 -3064 9780 15992 12739 5920 -761 -1238 -4844 -5427 -529 1412 -143 788 -2633 -3179 -2500
7322 -2500 -5874 -5834 -3172 481 -1411 -6723 -5965 -2175 -1323 2148 7203 1807 -3565 -3079 -7948 -6547
7306 -6547 -10619 -11395 -7189 992 3432 6389 5392 4972 7047 9638 9551 5184 5881 4485 3084 1613
7290 1613 117 -3513 305 7460 7769 5658 6053 5011 879 42 5561 8497 1698 -3463 -4800 -2822
7274 -2822 -2675 -5560 -1685 -329 5795 4438 -858 3725 4643 1040 4899 4237 -1365 -3549 4017 9605
7258 9605 8531 12578 13438 6355 5897 11527 13096 11997 10632 8003 8812 4805 2045 -1706 -3308 685
7242 685 4858 6315 3168 -2620 -3921 -2983 2765 3506 4220 4641 6385 9282 10247 7488 2131 -215
7226 -215 2495 5126 2153 -1823 -7568 -11561 -9075 -4226 -4069 -4550 -6229 -11708 -6894 1573 6464 1752
7210 1752 -4139 -2087 -2368 -3540 -1623 -2140 -5675 -6107 -11692 -8648 -4487 -1627 -650 -4319 -4150 1499
7194 1499 4977 7825 5697 3188 -344 1773 4909 1360 -80 1169 -3515 -3404 6879 1968 -3489
7179 -3489 -2447 -1201 1914 2974 3859 9543 9684 5443 -1377 -4838 -5790 -723 1759 6789 9046 5856
7163 5856 8006 8174 7317 6970 3194 3424 6604 5041 3114 499 -1947 -3827 -1959 -736 -3757 -521
7147 -521 -44 -4279 -3024 3986 6815 1745 -5196 -10505 -4624 -325 -715 -1093 -976 -3272 -2231 380
7131 380 -5474 -2319 1135 -2309 -4396 -4241 -6263 -3035 -2154 -8474 -8275 -1319 -191 -4886 -10060 -10843
7115 -10843 -1789 -336 -6537 -1627 11284 16843 5055 3521 9526 9994 8934 8293 8087 4916 5682
7100 5682 -1209 -2839 2554 -3137 -791 5257 4047 4984 -956 -7416 -4840 -369 -2993 -3128 -5118
7085 -5118 -904 475 5280 3422 1521 -1198 -5814 -9037 -9984 -15355 -10505 -611 -821 228 1275
7070 1275 6931 6601 4808 1670 3625 2998 -695 -10596 -7355 -1569 5377 5200 2487 -3683 -4677 -2207
7054 -2207 -4732 -8035 -9105 -7349 -8895 -6794 1258 1573 459 353 -798 -3115 -7838 -11179 -1923
7039 -1923 3588 2354 -6396 -6610 -300 2928 3936 6718 11223 13510 6288 2900 2248 1811 -2025 -8695
7023 -8695 -4972 -2664 -2418 402 2316 1782 4700 4562 -675 3848 6045 -870 -3776 -6595 -1758 -1197
7007 -1197 -4161 -2220 5081 108 -4768 -2923 -5869 -8524 -9907 -9504 -2398 147 -176 -3073 -5267
6992 -5267 -3795 878 2765 156 -5522 -172 5137 3080 6065 3137 2269 -3585 -3199 1466 4901
6977 4901 9536 9141 8066 11737 12741 2250 612 3522 3912 7043 7391 2288 -4608 -2583 6815
6962 6815 11182 1500 183 1721 -2509 -2704 -1431 -5872 -1057 1244 1462 1771 -3018 -1362 7051 12404
6946 12404 7032 4398 3387 1789 3658 3973 3607 2046 3595 -1354 -9464 -6876 -2455 216 -6301
6931 -6301 -11436 -8412 -6294 -1437 -1460 106 8402 6701 8959 7728 2146 -631 971 2067 2811 7609
6915 7609 8999 6810 8878 5037 -1924 -1571 1873 1084 503 4189 -1006 -1569 1567 -27 1084 1089 4234
6898 4234 1277 4824 6229 1646 -3215 -5996 -3923 -1927 -4962 -7040 327 6295 8809 7216 3009
6883 3009 -699 137 -1138 -5894 -6679 -3421 -478 1376 299 488 -1305 -5587 -4859 -2512 -4500 -6685
6867 -6685 -7611 -971 -765 707 6867 2707 3066 -1461 -6694 -10246 -14348 -9078 -7723 -11546 -5411 -1436
6851 -1436 -562 -709 4922 5724 4325 5313 6557 3047 -1562 -416 -3972 3339 9723 9177 6349 3883
6835 3883 5905 6222 8651 12473 13382 12941 6561 2092 -127 2314 -5156 -5615 -3777 -200 -1872 -1311
6819 -1311 -1329 2243 318 -1942 -553 -120 2752 4310 1783 1282 1959 3630 5512 5214 3627 6425
6803 6425 6347 10055 4816 -2304 -5339 -5807 -1257 -5424 -6483 -3106 -571 -1054 6166 12031 15521 13592
6787 13592 3954 -349 -5199 -14776 -15798 -2128 3114 3665 -4121 2283 3485 -5355 -2838 3075 679
6772 679 -3369 -3505 -7414 -9116 -9145 -6085 -5873 -6052 1210 3865 -853 -4492 -5562 -5590 -6253 -6450 -3807
6755 -3807 -3721 -2699 1232 1932 -2349 -9017 -13077 -7868 -6501 -3835 -4496 -4552 -3251 -1489 -1794 -4712 -9375
6738 -9375 -13227 -8767 -4258 -4390 -9803 -3627 -3223 -1191 4192 9778 7832 6106 7824 2986 -3382
6723 -3382 -503 -1436 1343 -1412 -4071 -6678 -9490 -6874 -3058 5494 10973 6584 1114 -5395 -6315
6708 -6315 -8126 -10082 -8419 -7879 -2478 1962 3845 6729 7920 11176 5431 -79 -4334 -6300 892
6693 892 2058 -1252 701 2026 5134 6804 8946 11101 5892 2776 9163 5510 388 -115 -628 -6795
6677 -6795 -4191 1534 814 68 -932 -1238 719 4812 5299 -1103 4390 8101 -577 -3666 -980 -1669
6661 -1669 -5707 70 2428 6215 -874 -2525 -1086 1631 3231 9391 8181 3041 4027 2362 -1123
6646 -1123 -5752 -9950 -10168 -9389 -2217 -5668 -13867 -10330 -4722 -4402 -4885 1892 -521 -6315 -3906 -1075
6630 -1075 3657 5977 5824 5677 1091 -1013 -826 5743 8583 7798 4312 6613 8351 3868 909 545
6614 545 2388 6674 8599 6368 -89 -5829 -2531 2872 -408 -304 -4141 110 3083 2851 5804 8705
6598 8705 9427 5251 -7412 -4271 -2342 -5982 -6043 -13430 -10892 -7190 -4654 -2956 -5206 -10282 -11600
6583 -11600 -9672 -8867 -9011 -9372 -5203 -3624 -1772 -1630 5868 56 -3171 418 5962 1080 -4221 3969
6567 3969 9600 4747 -4088 -4660 -5053 203 -2365 -1742 1764 -2671 -8737 -6945 -5829 -3549 -1342 -565
6551 -565 -4528 -8 10396 18332 22851 7773 3373 4985 -733 -2238 -2473 201 3219 3051 -7015
6536 -7015 -9387 -2444 -903 3372 5721 3963 5815 6832 3243 138 -2284 -4779 -9126 -6872 -6002
6521 -6002 -9977 -10827 -12318 -10581 -12758 -11838 -3872 -3350 -4192 3759 1067 -4227 -3216 725 -4337 -9809
6505 -9809 1495 19096 16086 10959 8032 1100 9860 11828 3153 -855 -1307 -8339 -12728 -15215 -12912
6490 -12912 -17330 -18824 -11593 -7449 -8071 -9573 -8144 -8726 -10168 -9138 -5916 -9216 -8718 -4560 -4684 -4805
6474 -4805 -3221 1375 6897 7387 7776 6227 5215 2728 -524 2177 1626 899 -418 -267 -7661 -6013
6458 -6013 -8994 -12848 -12998 -8907 576 2342 -8729 -12549 -12111 -8640 -8610 -9082 -8207 -5130 -3820 -2453
6442 -2453 -3808 -2213 2655 -3130 -9185 -11540 -14225 -9300 -5961 -4026 -1795 1015 -1093 663 6080
6427 6080 3341 -5275 -8230 472 4204 2366 4005 5792 2586 -1073 2668 2129 -564 -14160 -14767
6412 -14767 -13691 -15970 -11120 -8593 -6503 -10090 -6650 -6555 -1900 558 -6036 -4922 -3949 -2407 -552
6397 -552 5263 9419 5737 3868 2553 2978 2417 706 -4562 -8006 -14238 -15263 -11115 -9859 -10637 -15113
6381 -15113 -14928 -12472 -8193 -4784 -2536 -2949 362 7191 3332 -3109 -2532 4683 8362 2164 -907
6366 -907 -1548 -5488 -10859 -7983 -4762 -3661 190 6107 6737 4294 1947 2338 2945 7505 14296 16432
6350 16432 5965 1823 1940 2044 -1224 -6208 -10851 -8535 -2797 -5885 -9185 -1631 -1521 -210 -556
6335 -556 -3170 3774 7545 -563 -5093 -879 1174 3400 4395 5418 1577 1985 2058 2305 4038 -2310
6319 -2310 -3615 -6780 -7767 -5282 1077 4385 10305 11996 4799 -906 -123 1975 5143 2077 -867
6304 -867 1173 4308 347 -4831 -4224 -5975 -3994 -3935 -1954 1425 2442 4977 -2909 -34 4056 3855
6288 3855 4448 -720 -3566 -1925 4421 -1290 -8292 -12203 -13026 -4003 -1982 -4818 -2944 7745 10144
6273 10144 2920 -668 -3859 -3517 -3443 3438 2767 -291 2280 4231 7437 8234 6007 303 -2303 2083
6257 2083 3865 2927 861 193 311 6000 5604 -1381 -4730 -484 3745 -3312 -161 5029 8308 8836
6241 8836 8975 1066 -7481 -8861 -5525 -2473 -12222 -14390 -17385 -20029 -17666 -14614 -9354 -3383 1719
6226 1719 -255 -1704 829 2704 2038 585 -3933 -4541 -4404 -1255 2769 3703 -2229 -5547 -4364 193
6210 193 120 -1386 -3247 -877 -298 -1027 -2282 -5404 -10161 -3357 -116 -925 -7195 -8609 -6628 -2793
6194 -2793 -860 -467 3285 1702 4711 1081 -6845 2154 10272 9727 4669 -3088 -7530 -17618 -14600
6179 -14600 -7995 -40 -936 -2915 329 -3866 -8756 -5306 1097 -1773 -5720 -4827 1238 2641 5116
6164 5116 4941 7513 8750 8963 14011 10494 6046 3834 -1653 3228 -2071 -7557 -7490 -1167 -1392 -3425
6148 -3425 -4353 8576 9697 10546 19287 20777 37073 49789 33730 18572 1822 -8423 -7899 -3098
6134 -3098 781 -1213 3074 2304 730 -845 -6233 -4693 1095 6697 4475 5919 6302 -873 -3633
6119 -3633 -6436 -6755 -7914 -7122 -7821 -8108 -2043 -4556 -5278 -5890 1055 5040 424 1070 -954 -11318
6103 -11318 -19064 -9621 -5840 -12610 -6062 -4410 3754 13916 3537 -2690 -4355 -4340 -4481 -7562 -6281
6088 -6281 -8960 -7121 -6781 -4595 -511 546 -5813 -9603 -11987 -9391 -4550 135 -3433 -4058 204
6073 204 -1068 -3961 -5704 -6747 -2059 2115 -3049 -3162 -829 2221 1099 -3643 -7363 -4727 3814
6058 3814 2952 861 3758 -1584 -8491 -15803 -21889 -21145 -20670 -15404 -10605 -3084 1690 -2347 -4885 -11321
6042 -11321 -11329 -7214 -1602 6120 1257 -4070 -5776 -10807 993 1387 318 2309 6848 15745 18531
6027 18531 11634 8666 9162 10581 1887 -662 7903 8444 3019 2877 -1363 -3690 -4809 -4429 -850 -107
6011 -107 -4824 -2324 -2056 1550 5281 3514 -6233 -7830 -163 2424 -4439 -4718 -3317 -54 4751 1131
5995 1131 1991 3411 -1568 -7590 -5472 -3255 -185 1636 663 1592 3821 4414 2737 -7178 -5591 -1787
5979 -1787 -3892 -7772 -8199 -8509 -4776 3165 5486 4605 3428 4661 3054 1238 836 4516 1072 -2080
5963 -2080 -2320 -6743 -7939 -7023 -1191 -775 -1377 4002 4217 4298 1359 -1893 -5099 -9066 -6099 -326 -1361
5946 -1361 1196 -4756 -9166 -9462 -5252 -10173 -6363 -1907 643 -1665 -505 5955 3075 1551 2914
5931 2914 1914 -348 -186 -1786 -4120 -5452 -1320 857 -3993 -4432 -455 1961 50 2780 -123
5916 -123 -5678 -9431 -5828 -5650 -3162 -1668 3317 -5593 -8684 -3783 -6186 -3583 417 9576 12976
5901 12976 5986 879 -1284 -791 -449 2697 -917 -2231 851 -6783 -7405 2072 4 3686 6223
5886 6223 4586 5521 -1745 -8940 -5981 -7363 -10228 -3230 769 -2013 -5182 -754 848 -2098 -4277
5871 -4277 -10467 -10743 -9441 -9727 -3315 -701 -2103 1053 851 -3088 -753 1652 -2984 -5113 -5821 -6140
5855 -6140 -7587 -9914 -7631 -3719 -4861 -5416 -6774 -5590 -7460 -9122 -3975 3692 7112 2960 -1005
5840 -1005 -3592 -4921 -322 -814 -4150 -7189 -3888 4541 7570 6564 1619 -1070 -2374 -5900 -5825 -1942
5824 -1942 45 -61 3528 4296 12429 9299 6714 9110 5312 1563 -5877 -72 3837 2181 7117
5809 7117 410 -8828 -6472 -6008 -4408 -7126 -7447 -3883 1215 3609 3691 -1634 710 -1733 -1926 -2033
5793 -2033 -3377 -946 1996 1124 206 1042 -412 -27 -330 5331 9555 8710 1038 -738 385 -663
5777 -663 -496 1539 -1549 -1939 -2548 -6371 -2683 -6266 -6835 -4944 -5465 -8386 -12835 -14285 -14216 -9175 -5021
5760 -5021 -4217 -4911 -3179 -697 296 3253 4415 3249 -2659 -7474 -7837 338 5564 -430 10422 14752
5744 14752 8186 6941 3973 -6547 -11135 -4578 2136 5130 3561 7120 6937 6490 2794 998 2730
5729 2730 6546 8645 3547 4925 8705 2538 -766 5476 5133 1862 1764 8296 7852 444 876 -4602
5713 -4602 221 2588 -197 -2227 712 -1028 -4731 -2177 -4562 -3835 -657 -907 -4680 -9265 -10146 -11472
5697 -11472 -4294 -5450 -2612 -3728 -4497 -8739 -8389 -3346 -6113 -6420 -2965 -465 -7112 -10289 -4393
5682 -4393 -3692 -5875 -5520 -3645 366 3521 2353 4706 10003 12174 6364 3101 5932 7617 2719
5667 2719 2110 716 884 541 -1003 -1350 1508 877 1370 4464 1033 -460 -4575 -7063 -4582 1045
5651 1045 8324 3320 -2282 1212 -3919 -9891 -11493 -7998 -3350 -553 -2175 -6159 -8113 -7290 -6912
5636 -6912 -4059 -6248 -8308 -6731 -7424 -6245 -2710 -76 -599 -4907 -5089 -6383 -8218 -6753 -13691 -17332
5620 -17332 -8276 -1530 2300 3701 5415 8467 7555 2235 1912 2095 1993 -513 -4997 -11370 -8334 -9006
5604 -9006 -5703 -2961 287 6921 7422 4182 2189 7544 2446 -9352 -13822 -11810 -7606 -7262 -6085
5589 -6085 -6039 -1275 2481 5282 -1777 -8944 -16528 -14070 -11073 -8554 -4756 -834 -122 23 561 1402
5573 1402 -5019 -6098 -5070 -2344 -3943 -5282 -666 2076 7039 6357 4454 4974 -851 -1808 -3655 -10025
5557 -10025 -8578 -4199 -406 5390 2938 1275 -363 4275 3481 -2489 516 3031 109 -1070 71
5542 71 -696 -3220 -3469 -2738 -3230 -3891 -3448 1164 1456 -133 -2103 1141 6204 6225 2806 4811 11388 5040
5524 5040 -1837 -4261 -1898 126 -4873 -5434 -2430 -2607 -2773 -171 1486 1478 5186 12513 12041 10740 5446
5507 5446 4443 8211 187 -2893 -2231 458 1793 8026 6147 6200 3999 -141 -29 -2717 -412 2573
5491 2573 1973 2119 7468 10527 5865 453 -812 -1848 -975 -2227 -3037 905 3584 -961 -4453 -6517
5475 -6517 -6258 -9851 -1586 6617 6770 9271 6481 -2457 -3727 -4673 -6667 -4509 -7207 -10520 -14413 -6901
5459 -6901 1137 576 2885 -241 48 5358 10558 8177 6109 2232 3147 614 -1023 890 3152 4987
5443 4987 4370 2225 578 -2575 -5515 -2976 3591 5952 -1761 -7990 -9429 -3663 5054 4978 -88 -5928
5427 -5928 -5008 -4190 -4772 -4242 187 5023 4888 190 -1377 729 -1738 -1715 -2879 -3183 -2534 814 1716
5410 1716 4301 2382 2376 -1589 -5264 -5128 -3954 -2791 -6387 -4411 -7707 -3406 4332 3265 4550 7139
5394 7139 7598 1923 -4478 -7712 -8741 -8146 -8525 -9225 -6036 1040 3876 3779 3614 3531 4778 5453 5004 2492
5376 2492 -1108 2286 802 -2771 -4515 -9016 -9492 -7167 -202 -1186 -2669 -5315 -4166 -408 -1436
5361 -1436 -1427 -2598 -3370 -2448 -4970 1695 -1785 -7779 -7863 -5253 -450 3015 1698 -1858 -626 -4821 -2148
5344 -2148 2397 7167 8866 8011 6923 7774 1737 -1430 -1943 -1690 713 780 12102 15017 11628 7594
5328 7594 3630 -1537 458 4950 4004 315 -2981 -5693 -8946 -6527 -2463 -2463 -2060 -508 -2672 -2047
5312 -2047 1727 -1247 1000 3511 1366 1814 3249 2952 1784 -51 -2727 -712 -486 -747 -1023 -3246
5296 -3246 231 8526 14809 9804 6915 7159 5500 3214 3171 -345 -2689 -2285 -2060 -3702 -3903 -2485
5280 -2485 -398 4419 6524 3954 4289 1594 -2488 -11757 -13213 -10252 -3420 2437 -1470 -5218 -13130
5265 -13130 -9930 -5304 -6160 -1672 -130 641 -894 756 3206 -666 2754 5326 3043 -1812 -4655
5250 -4655 -8258 -5477 -2488 636 4033 2877 1654 4318 1738 6268 2504 1135 5019 7574 3914
5235 3914 4397 3485 9239 5257 2967 2820 4691 8530 7934 8995 9135 4512 1266 2258 3763 3265 1131
5218 1131 2548 1556 -5846 -6647 -8013 -6357 -4542 -3785 -274 1026 -2338 24 1185 -2182 -765 -2848
5202 -2848 -1001 -1471 -2911 2668 -494 -9460 -11843 -15613 -16402 -11889 -14415 -13933 -8434 -810 -962 -1200
5186 -1200 -228 -1535 -806 -2093 -1827 980 -2205 -5506 99 5198 1636 -3947 -1909 2264 5264 8013
5170 8013 8042 8405 7191 4952 -1788 53 2716 1295 -2991 1904 3775 6574 6754 2566 79 -2677
5154 -2677 -1793 93 2381 3507 2571 5815 4806 3499 -1598 -3039 -9208 -11397 -6019 263 669 -9289
5138 -9289 -7385 -4947 -7114 866 2427 785 1373 198 69 1772 2702 869 703 -1770 -2043 3558
5122 3558 297 -1246 1516 1406 -2663 -6181 -10929 -12338 -11111 -13574 -13999 -12699 -8895 -15252 -20013
5107 -20013 -16491 -10212 -10100 -7591 -6634 -4760 -4297 -9287 -5166 -9526 -6922 -4388 -9498 -10015 -8756 -8412
5091 -8412 -5907 -5886 -5764 -1062 1028 -40 -6012 -9656 -3394 -5378 -8389 -9171 -5537 -381 991 1534
5075 1534 -4766 -3821 -2810 -3645 163 7983 3750 1072 -2245 -5969 -5221 -8104 -8184 -7236 -4621 -5113 -11732
5058 -11732 -11238 -10484 -11036 -11332 -6878 -7337 -5898 -8819 -2660 -727 -3447 2093 -2844 -5751 -5023 2818
5042 2818 11974 12451 8907 6170 502 -6334 -9090 -8792 -10204 -8790 -6335 -6074 -4395 -3262 -3899 -3392
5026 -3392 -8055 -8526 -7245 -2392 -4432 -960 4530 6483 3341 4208 2116 1894 6952 4256 -916 -2223
5010 -2223 -1238 -3881 -2143 7529 264 2035 5944 6344 -298 1395 3263 4202 555 -7951 -2604 605
4994 605 -2981 -9719 -14598 -13155 -10379 -2178 2712 3088 2511 6085 -2589 -8243 -7586 2769 6005 3482
4978 3482 612 -1706 -3052 -1389 -4831 -5503 -2106 -2098 -1561 -3683 -4330 1258 -2432 -1520 -4955 -7624 -5121
4961 -5121 -2634 77 -1920 -5177 -4120 -3484 -3595 732 3721 1035 -886 -452 -5122 -6107 -8653 -11685
4945 -11685 -12382 -8193 -827 1708 -1444 -2755 1608 3668 3818 890 1317 1224 2633 -197 -3430 -4094
4929 -4094 -6702 -6228 344 571 6279 15118 14790 7738 5069 4965 6037 -40 -3950 -6938 28 6332
4913 6332 8910 7425 588 -6340 -11017 -10630 -12579 -10225 -8487 -2758 3699 2280 1101 5958 5435
4898 5435 -2073 -8069 -6481 -4522 -4885 -11256 -6648 -993 1101 6766 2768 -5978 -13705 -16439 -12939
4883 -12939 -10776 -7467 -3500 -5804 -4584 594 3625 6435 1186 314 -77 1635 5400 6972 4169
4868 4169 1664 -2202 330 185 2090 -101 -2666 -6987 -7286 -7763 -2284 4168 1430 -9385 -10421
4853 -10421 -3762 -6825 -5004 -4097 1959 1639 -3877 -9701 -11938 -12072 -10508 -11991 -10211 -4810 -2341
4838 -2341 -6794 -7223 -8518 -8352 -3347 3959 4019 3505 7130 6004 3208 1226 -6188 -9424 -3909 -3290
4822 -3290 -6487 -2927 2221 -190 -8146 -9861 -10333 -7451 -9129 -7861 -230 2737 -809 -4950 -7375
4807 -7375 -13318 -8129 -4953 -1295 -1437 -2891 -6366 -8729 -8974 -5881 -6481 -1798 -841 -1186 -1557 2607
4791 2607 -218 -1556 -865 -2555 38 -596 -3061 -4928 -3393 -3025 -8943 -9268 -4478 -6234 -1219 -3417
4775 -3417 -5106 -198 3694 -1460 -5369 -1708 -5142 -4558 -3057 -1395 -3111 -2997 -1657 -3486 -4942
4760 -4942 -2604 -842 -787 -3059 -2008 -3669 1074 -1119 1018 2175 905 -1307 -2861 4464 7744
4745 7744 5131 838 -1118 6119 2298 -2196 -7343 -1482 4128 4812 -1 -1642 5636 8293 2209
4730 2209 -3479 3734 6150 6976 5223 -177 -4288 230 -474 -2057 1147 907 176 7742 6197 4335
4714 4335 2682 -5532 -10017 -13897 -10667 -4647 -4541 -8326 -11351 -11963 -8492 -7711 -13328 -13006 -13011 -12141 -11779
4697 -11779 -6302 -5398 -5416 -16170 -20333 -16775 -15546 -10425 -9146 -4335 -2488 -2568 -6156 -4166 -7140 -3214
4681 -3214 -10666 -12112 -13173 -13988 -12713 -5188 -2390 -2018 -4667 -4964 684 -651 6954 11902 -470
4666 -470 -9522 -15069 -18055 -14034 -6879 -7262 -10919 -16887 -12966 -9876 -10799 -15727 -13921 -10521 -11598 -9639
4650 -9639 -9612 -9070 -3672 -474 -4500 -5563 -2812 -2852 -416 -1526 -1993 -2814 -1494 -5658 -2623 674 4406
4633 4406 486 -5516 -2926 -2382 -2491 -4216 -4011 -5084 -3352 -3023 -6275 -7868 -2826 2844 -1063 -4432
4617 -4432 -7615 -4566 -2270 -239 1549 5147 4993 -528 -2956 -1228 266 -590 488 -7588 -7240 -1730
4601 -1730 8978 10432 7540 1198 1350 2408 -1723 -4198 -5999 -7031 -2938 -3054 -3249 -4323 -5879
4586 -5879 -7918 -9623 -3031 1025 1528 1246 -5956 -4396 3532 8471 7585 3952 -916 -4882 -3452 -5920
4570 -5920 641 -72 1342 -1744 -5275 -7342 -1671 2112 2628 1921 -3431 -8317 -5893 -3170 1427 13
4554 13 -610 -1794 -2189 -1235 -3940 1924 5516 1076 2254 7873 8552 6102 -2220 -8922 -11080 -9136
4538 -9136 -8213 -8237 -5112 -4134 -5344 -9150 -10465 -11321 -10454 -6338 -8888 -6547 -7982 -6608 -976 3912
4522 3912 -13 849 2560 -1787 -360 3271 -1435 -1325 -1255 -1039 9135 9607 6374 4683 7935 9699
4506 9699 8328 1347 3743 4985 -2461 -9772 -9313 -3863 15 6573 8145 3456 756 -2767 -4373
4491 -4373 -4391 -2249 -9603 -15256 -13480 -11070 -8748 -7775 -4761 -4793 -5360 -2866 -4618 -1538 56 -3062
4475 -3062 -6870 -4707 6270 4862 373 3901 -72 5403 5943 205 -3462 -7551 -5086 -2662 3750
4460 3750 -184 -11303 -14301 -13049 -9865 -8032 -4389 1750 3696 4816 8213 13968 12346 6726 -1974
4445 -1974 -5537 2066 -1875 -4686 -714 3824 5388 6300 1874 3609 2977 4567 2162 -3282 -366
4430 -366 -760 -2623 1724 585 2145 1461 -2990 -3726 -1168 -1848 -2062 808 2084 5792 8611 11232
4414 11232 4354 2224 4699 4928 3129 -5496 -11826 -5240 -1217 -2912 -5948 -11734 -15144 -7034 -6930
4399 -6930 -9297 -6099 630 491 -1062 3992 3231 2832 2640 -3332 -3680 -7980 -12803 -8612 -6580 -9985
4383 -9985 -10222 -11163 -16225 -19337 -13223 -3906 2257 186 838 2458 6105 5795 8114 7137 -1627 -8922
4367 -8922 -10543 -8106 -9430 -12163 -9426 -6460 -3775 -3491 -6073 -6024 -3455 -262 -2629 -4126 -4067 -4827
4351 -4827 -335 7421 8075 7490 2949 -2106 -6117 -12833 -8538 -2221 -1192 -4687 -6586 -7627 -7764 -9257
4335 -9257 -16102 -18542 -12028 -12410 -15330 -8022 1582 4738 4608 -1208 -4531 -4164 -45 -497 -655 -4990
4319 -4990 -2013 2247 -863 -3285 1117 7799 11532 12664 9689 5021 -86 -5640 -15140 -14916 -7968
4304 -7968 -1906 -4269 -2481 274 -3013 -3543 -784 -3399 -5162 -136 2464 468 -3612 -5086 -10059
4289 -10059 -13306 -10506 -5225 -4826 -3901 -4840 -6539 -8274 -6965 -6188 -2533 5616 1767 -1811 -511 -3992
4273 -3992 223 186 -3990 -1780 705 2450 6603 5775 3552 3932 6262 1955 1507 -649 -8326 -8031
4257 -8031 -2554 5638 7335 3427 1319 35 -151 368 -2238 -2919 -982 6901 6897 6992 8927 6738 4753
4240 4753 -1977 460 5458 4305 -1860 -896 -4249 -3185 3749 -126 -7723 -5151 -4545 -574 5062
4225 5062 5294 7081 9680 9716 9703 5045 4087 1192 -7865 -11758 -13188 -12531 -6586 -7041 -3552 -8621 -10622
4208 -10622 867 4984 -2402 -3456 -4507 -3072 -854 -107 -3786 -2341 -363 3657 7735 4370 6251
4193 6251 10420 6016 -4864 -11864 -11037 -14542 -13925 -8317 -9468 -12222 -6803 -2390 -2549 -420 483 -969
4177 -969 -181 -1300 963 4395 2743 -718 -516 -1775 4866 5654 6241 7126 6719 7368 7623 5599 2500
4160 2500 1675 -2354 -7378 -8063 -5188 -3865 -857 6147 8020 4904 4755 7190 5800 11477 13541 11854
4144 11854 12403 8648 4577 1534 590 -3263 -1067 1012 3872 6119 -2429 -6428 -6 6919 15331
4129 15331 11506 3641 5602 1612 -2485 -4542 -1324 1900 1144 5936 6883 2183 -4008 -7134 -3778
4114 -3778 -830 2198 5081 2718 -4258 -9389 -6108 -837 -2852 -6833 -3736 5493 6184 4236 -1261
4099 -1261 -2539 -3004 2159 -108 -1007 -3609 -578 -387 -1965 1508 2875 2925 6386 1139 -3066 4005
4083 4005 6659 5044 5647 14171 23333 25987 15276 1074 -6242 -4424 -3796 -8672 -15372 -18962 -14973
4068 -14973 -8728 -7902 -7410 -6461 -4485 -1890 -1032 -1281 -5098 -8631 -5452 -6774 -556 6105 11756 9326
4052 9326 2896 6772 7057 3026 516 2301 -901 -8159 -4898 81 439 -1843 -1915 -6060 -14454 -29004
4036 -29004 -16473 13647 35137 44372 28165 4373 -8492 -3790 970 2651 2448 2207 -2649 -1864
4022 -1864 -445 1241 3757 5995 7257 1323 -2361 -2898 -3244 -4279 -4249 -4971 -7657 -11650 -13055 -3778
4006 -3778 2483 3991 718 -8739 -7461 -4834 -1420 -5053 -2778 -5727 -8250 -8090 -9979 -20562 -31333
3991 -31333 -26784 5935 32410 52370 41578 12989 -7589 -9462 -6030 -9249 -12748 -8986 -3726
3978 -3726 -4116 -5408 -6906 -7340 -941 -3002 -6267 -6586 -3760 -5472 -7971 -4271 -4267 -4706 -2820 653 494
3961 494 -5379 -12678 -9598 -6327 -7542 -7329 -6120 -355 6751 5881 2628 -475 5248 9248 9335 573
3945 573 2792 7565 16174 19608 16144 9235 9009 6297 2312 3034 3895 -13 2083 313 -4515 -7182
3929 -7182 -5465 -4975 -3938 -9428 -11605 -10567 -4334 596 -1557 -4683 -1322 1184 -1681 383 1423
3914 1423 450 1601 1326 -2580 -9240 -12438 -10276 -13713 -10571 -11009 -8396 -4003 2082 808 -8771 -6397
3898 -6397 1134 -60 670 8522 9435 4432 733 -3405 -5640 -1426 -2699 -4458 -3804 -2751 -4237 -2517
3882 -2517 1369 -3718 -6602 -2387 800 -2957 -492 1978 -301 -1788 -176 1209 -3237 -7529 -14858
3867 -14858 -13532 -10885 -8930 -4003 -7766 -11471 -7031 -1687 -781 -4324 -6747 -7571 -7374 -3708 -4041 -3838
3851 -3838 -5679 -6571 -1819 -599 -567 -1411 853 -2087 -3106 -6652 -8229 -7910 -6660 -998 2036 8213
3835 8213 10162 8930 767 -3325 -7428 -9350 -8509 -7782 -6655 -3494 -816 -771 -2527 -25 1086 1863
3819 1863 2042 615 2484 5270 661 -3196 -394 1127 2521 -392 -4086 -11613 -15504 -7943 -4342
3804 -4342 -5696 -5234 -7702 -9673 -8541 -5826 -2521 -1150 -4226 -4802 -1998 -5375 -7826 -670 6283
3789 6283 3002 -64 1176 -2277 -1491 -136 -2313 -2040 -123 -5041 -7464 -14656 -11045 -5530 -3156
3774 -3156 -2805 -3135 -3385 3426 5606 5004 2446 5740 1558 -7747 -10114 -8172 -8449 -4733 -5656 -3063
3758 -3063 2393 502 -3237 -1504 2262 -1531 -5745 -1607 1949 664 -2918 -2219 -3121 -3800 -1504 2666
3742 2666 5228 3535 2812 286 -5168 1378 7771 2386 295 6426 3826 -3831 -7461 -2797 -299
3727 -299 1810 -2115 -66 7325 11659 11867 8622 10196 14144 14334 3085 -3634 -3865 128 -1250 -13719
3711 -13719 -6488 844 3960 2450 4333 5191 8172 8578 9656 7114 3893 4424 2279 -7455 -14696
3696 -14696 -12780 -8500 -8134 -1496 5564 4911 5527 351 2032 -578 -5423 -8345 -6031 1543 6672
3681 6672 7647 3345 -8291 -13644 -12563 -8839 -5083 -2649 -5492 -9604 -7164 -4037 1699 -2358 -7028
3666 -7028 -8027 -6362 -7578 -4190 -1424 -1406 2689 1245 -4134 -3263 -162 1654 628 -8074 -7160 -5054
3650 -5054 -3887 -1034 2041 1308 -3555 -9799 -14161 -13466 -8193 -4835 -4028 -6472 -12362 -9055 -5440 144
3634 144 -1508 -2872 -7079 -8149 -10407 -7923 -2625 4175 2235 -4132 -419 486 -1211 -5585 -6325 -10937
3618 -10937 -8395 -7010 -12321 -12570 -6341 -10627 -11889 -8720 -10931 -11219 -2439 3078 3071 2289 1409 -8133
3602 -8133 -12118 -10021 -11588 -11680 -14411 -8516 -9808 -8963 -6126 -3404 -197 -1309 940 -3040 -10262 -10872
3586 -10872 -5521 -1831 -632 7937 7106 1486 -6113 -12018 -9440 -12115 -16107 -13243 -6049 918 -1977
3571 -1977 -7100 -7755 -3729 1856 -2112 -4606 -2528 -4966 2595 8813 9768 5587 2910 3477 5069 4254
3555 4254 2854 2469 -950 -3440 -8403 -15908 -20468 -18350 -7819 -6637 -11462 -8862 -960 12365 13344
3540 13344 12411 12882 8003 -2434 -3213 -3414 -1781 -3347 -8522 -8584 -7380 -5393 -3085 -9555 -4723 -4168
3524 -4168 -1698 -4370 -4798 -5655 -5400 -3294 1693 4176 0 -7355 -6361 -6387 -3787 -7398 -10989 -11755 -12370
3507 -12370 -17947 -14918 -11954 -1802 463 3053 4362 90 -3523 -1759 874 5020 5350 3356 -781
3492 -781 473 5877 3349 2851 2217 -800 -4242 -5789 -3211 -3238 -1642 -2315 -6554 -2518 -1087 340
3476 340 1299 -2156 -2420 1464 2036 3702 4423 2987 143 -1377 -7441 -5442 3236 4284 5272 -255
3460 -255 -3589 3292 6148 1809 -991 4503 8660 -25 -3482 -1979 -3826 -1138 3293 -5462 -5399 -3026
3444 -3026 -2391 -694 2936 1555 3343 3549 -942 2158 4169 -386 -7146 -11166 -12295 -10956 -12013
3429 -12013 -13868 -11722 -4565 -4177 -4521 -946 -4271 -6659 -5355 -10794 -11156 -8035 -5643 5667 3973
3414 3973 -2376 -3206 -2913 2402 3709 4039 5062 6621 2827 -2022 -4934 -5825 -8677 -12224 -9418 494
3398 494 4448 -936 821 1866 -149 2239 1605 1505 1960 847 2714 1430 -737 -1694 1481 3785
3382 3785 4736 5687 4471 6609 2347 -7248 -11908 -11847 -9896 -3879 -1953 -1978 -1248 -3611 1908 3870 5251
3365 5251 7300 11510 12574 10076 6154 8904 6760 5267 326 6893 6893 4275 1579 -4133 -2011 2706
3349 2706 2055 350 5166 1492 44 -2436 -7637 -7086 -9737 -9993 -12276 -8387 -11404 -3535 7149
3334 7149 3105 -2079 -2994 -1088 449 600 968 2434 -1535 -6372 -2286 7027 11085 9439 9502 5383
3318 5383 6962 5047 37 -590 3179 2099 3996 -718 -4509 -7318 -6406 -4012 -8597 -9616 -6306
3303 -6306 -641 -849 2417 10632 5465 -2160 3970 8700 4139 862 -502 -696 4506 7138 9120
3288 9120 5311 -1618 -3112 -628 -3211 -4410 -3173 -589 -667 6547 -701 -8504 -6923 -4563 -5414 -7942
3272 -7942 -11071 -9202 -5755 -2761 1225 -1154 -4330 -9487 -4371 -3352 -2869 364 4447 1088 -440
3257 -440 -4346 -2728 -2957 -1937 -116 1435 186 -1279 -851 1810 1012 -6669 -6527 -2507 108 1427
3241 1427 891 1997 1980 1886 4956 6903 -865 -5970 -7774 -10771 -4537 -4418 -4137 -6124 -5526 -5185 -1025
3224 -1025 2183 804 5310 3779 2632 978 3573 8952 6204 -882 -962 1135 4513 -2046 -5428
3209 -5428 -5698 -611 6405 3782 6119 3953 3572 2834 2428 -57 4896 2382 5169 4097 7023 2553
3193 2553 874 -628 1422 -918 -1048 -4750 -6814 -8242 -8261 -1877 258 -1823 -5970 -3742 3275 -2046
3177 -2046 -3891 2467 -778 -7302 -4979 4497 7837 5440 -1725 165 -839 -5620 -5911 -4539 -2141
3162 -2141 -748 -2293 -5416 -10420 -17448 -15188 -14230 -13090 -15098 -14443 -10879 -7302 -4647 -7292 -4969
3147 -4969 -413 6906 5987 -516 2146 1383 1047 -1865 904 3701 3242 4621 924 -1553 -2787 6036
3131 6036 12938 13405 10930 6601 9023 9339 2880 -2985 130 5891 5258 7952 11455 6652 44 2421
3115 2421 6066 4171 1778 -825 -1538 -1914 1813 6789 3325 1915 3459 2123 5914 3498 435
3100 435 5752 10270 10981 5501 4213 1410 -1769 -6753 -1802 2084 5443 6029 266 3536 2056 -1923
3084 -1923 -6167 -11254 -15663 -7487 -4820 -6380 -4686 2012 3488 1689 2791 5885 9100 11843 8609
3069 8609 4082 -4070 -224 4224 9575 7999 360 -7313 -10001 -7228 -6021 -8884 -5561 -6697 -1748
3054 -1748 5185 6318 3112 -596 -1572 -319 -1200 -2270 -3382 -6262 -13095 -15073 -4629 -1610 2873
3039 2873 6794 9722 8569 6624 5011 1714 -1797 1366 -473 -8549 -10026 -7343 -1965 -1561 -2062
3024 -2062 1910 4534 1360 6019 6348 1648 4729 5599 10820 11019 4692 -453 493 1187 -1942 -2974
3008 -2974 -4410 -1241 -973 -16 1001 9090 13699 11892 14444 11912 6443 5831 8709 10434 9781 6065
2992 6065 4595 2155 -2189 -2856 -553 3750 2650 -4416 -4090 3560 7380 9234 3442 223 -4254
2977 -4254 -8740 -13717 -8208 -7213 -7435 -2497 2133 4628 350 -4823 -1229 -1660 -2673 -18 1641 -1420
2961 -1420 -4356 -4668 -815 -1505 -3269 2632 4786 5773 7863 4908 6025 4130 683 -648 -608 -777
2945 -777 -5844 -5626 -4951 -2564 -334 570 -1508 -5174 -7045 -5285 -501 -838 -1594 -6089 -9492 -8570 -7471
2928 -7471 -9617 -8442 -2976 1183 -292 -465 -3039 -541 1831 196 -3919 -8351 -10193 -11016 -4092
2913 -4092 1039 1269 2714 5461 5938 4159 -174 -3979 -1289 2316 581 -796 -3125 -1963 5956
2898 5956 12273 14894 8389 7912 5600 3509 2936 3441 -83 -3641 -4147 -1359 -1480 2119 670 -1389
2882 -1389 -7447 -4391 806 5586 3267 -124 1071 -4013 -7541 -10758 -7575 -4781 -3453 -5487 -8175
2867 -8175 -8775 -4839 -7469 -8588 -8827 -13549 -7967 -5833 -11600 -14326 -16660 -15332 -10224 -7299 -7653 -8799
2851 -8799 -9225 -4311 -1913 1703 -1074 -5277 -2885 -1053 4866 8270 10747 8777 4741 3018 2539
2836 2539 -3486 -2766 -5105 -4680 -5602 -9367 -11901 -13578 -14116 -5055 -3555 -1924 1642 2168 4671 5995
2820 5995 -601 -6921 -2557 1765 4230 2754 -717 667 -2956 -399 -1482 -700 9890 17058 8738
2805 8738 4826 911 585 2745 2387 -8984 -11860 -6366 -4847 -767 7672 11648 3813 2689 4707
2790 4707 3594 3186 2229 2306 -4096 -8363 -7841 -4483 -1787 -4857 -2319 1827 10396 13594 6427 6234
2774 6234 2313 6168 11012 7314 1681 -652 205 -3534 -4646 -3675 -11337 -4584 2035 6307 -821
2759 -821 -1527 -1433 1643 2829 9031 3482 245 -2132 -2794 -6255 -8227 -3529 -3858 -2891 1987 5306 11511
2742 11511 9250 2371 1015 -7906 -3659 967 6614 6715 -438 -915 629 -1894 -2793 -2465 -2467 -1596 -5560
2725 -5560 -6796 -6552 -3352 -3322 -7127 -640 455 -6557 -4752 -3992 -4354 -2768 -3273 -6013 -7267 -14988
2709 -14988 -13475 -10700 -6386 -3610 -6415 -7710 2705 3197 -9 -3752 -5894 -3294 -3786 -6339 -3581
2694 -3581 -6905 -6618 -9441 -8400 -5818 -772 -326 2216 2372 -2411 -6808 -11701 -14152 -4101 1019
2679 1019 1052 -3947 -6678 -1774 987 907 2568 5904 5429 3927 380 -1453 -551 4081 3842 -1720 2119
2662 2119 5024 12857 10829 9644 6623 -1053 -5342 -4371 -2703 -4509 -8411 -5991 -2439 -3292 -8683
2647 -8683 -4471 -328 -3101 -3712 -8636 -8016 -8200 -12122 -11151 -2516 -2654 1164 3241 2073 3670 6578
2631 6578 11571 8825 5290 6654 6691 7198 3148 7329 8244 4844 772 -1731 -6083 -5109 -5596 4474
2615 4474 643 -4457 -1547 258 -4346 -11302 -8028 -4263 -1692 -1117 -851 1950 6975 5060 3328
2600 3328 681 -1664 3492 6727 -1528 -6084 -6560 -10574 -11388 -9568 -4718 -2051 -4408 -991 -1704 -2990
2584 -2990 -7656 22 1444 124 -3639 -6390 -6365 -2961 -1544 -625 -577 5174 4247 448 3985 4580 -388
2567 -388 250 4338 6678 8285 9039 6426 386 -1257 1956 -1015 -59 -1603 -745 -3683 -14173 -22204
2551 -22204 -20407 -15289 -16253 -12370 -10467 -5903 -390 772 1168 132 10 3241 4903 -183 2479
2536 2479 -780 -9378 -4127 1190 1826 -2086 -5996 -6437 -8826 -10351 -8427 -12198 -14082 -11978 -9946
2521 -9946 -9060 -5315 -11996 -9383 -5779 39 -3569 -7160 -1348 4580 3757 2309 4107 524 2543
2506 2543 5166 5511 4114 1859 -7847 -11435 -13406 -8086 -6182 -2654 5302 7122 -1350 -5635 -9142
2491 -9142 -2647 1967 -1070 -7227 -5383 8512 7103 6867 2910 -4095 -4211 -4488 2358 2730 6205 9669
2475 9669 2812 3192 -1195 -3663 -4187 -7599 -4111 -447 3821 5088 -253 1672 4306 10584 9432
2460 9432 8129 455 4865 4549 4166 3974 8154 2263 1753 -3812 -9281 -6136 208 6131 2187 -5145
2444 -5145 -7616 -6351 -4250 -7278 -3262 -4270 138 4858 5947 5431 -2115 265 2545 1597 -1200
2429 -1200 -3150 1590 9382 4999 -4310 -8347 -8702 -11906 -12603 -13207 -10222 -1869 4998 9236 5081 2084
2413 2084 2908 3785 -2505 -10500 -4323 -3820 -4478 2472 6250 8583 8326 6383 -873 -6555 -4713 -278
2397 -278 2088 5004 8732 6403 2711 1031 950 -7991 -7404 160 3337 4117 4799 2367 8813 11956
2381 11956 9305 7401 7867 -1332 -2960 2407 6677 2787 2430 4193 825 1629 5305 772 3353
2366 3353 3473 2014 3513 10787 11875 11907 6310 -2166 -4112 -2458 -15 2530 1091 -3173 -10099 -8290
2350 -8290 -5491 -4354 -3353 3215 7925 8842 4663 -2701 -4197 1554 2271 -1043 -4263 1204 6935
2335 6935 2605 -1004 450 2339 -4633 -5872 -2737 -6678 -10488 -8141 1789 6637 1443 -4380 -7068
2320 -7068 -7127 -7667 -4544 4226 4598 6367 5393 8314 8470 5793 4296 7319 9462 10141 6886 2455 5791
2303 5791 9995 2897 -3534 1730 2818 2115 1292 -1469 -6445 -5213 -5062 -1673 -1076 2910 1599 -2789
2287 -2789 1341 2702 4546 6772 7245 -2936 -4083 2269 6149 4743 -297 654 2830 -3208 -4130
2272 -4130 -3834 -1116 3109 -410 870 2445 -4258 -11479 -12085 -2245 1344 -2722 -4373 -10203 -4448
2257 -4448 -843 -7413 -6832 -1840 -1528 -2638 -7686 -7124 -4086 -9112 -6829 -705 245 -65 -4598 -4808
2241 -4808 -3883 1656 732 -368 2904 -1779 2403 7827 10173 8636 4769 4994 6675 946 5018 8093
2225 8093 4098 -140 -1793 -6148 -10256 -14235 -15911 -4194 2065 3526 6799 9573 6639 -4100
2211 -4100 -7667 -6032 1525 7359 1825 -6488 -4933 -3339 -5626 -3812 -2041 -676 1368 8064 6752
2196 6752 1060 -3127 -6144 -9094 -2484 749 4834 5755 3255 -3729 -562 2616 5499 266 -4117
2181 -4117 -5592 -1846 -4785 -2861 1486 -1468 -5590 -3485 -3289 752 1447 -7674 -4347 -149 -2035
2166 -2035 -3729 445 -318 -2035 -2500 -630 -1340 3143 1184 -878 -1214 746 -3696 -5977 -3918 -2821
2150 -2821 2059 -1349 -8578 -4200 -1315 -3718 -3908 -8926 -10945 -9411 -5760 -4251 -1270 1077 4314
2135 4314 11689 14915 7470 -1482 -3912 -5893 361 -640 1264 -4562 -10823 -5139 -644 -620 -709 -7207
2119 -7207 -4435 -3904 525 8876 6454 172 -680 3995 3913 2366 1780 -1665 -1536 4471 2144 -1686
2103 -1686 1895 8811 9353 9918 4013 336 1270 246 1702 2221 4126 5599 2032 565 -3009 -340
2087 -340 4453 -1502 -1140 -1717 -6251 -2902 990 5228 708 4838 8147 6709 6094 556 -4638 -3598
2071 -3598 2087 5272 5157 2528 5197 6850 1755 -7996 -2937 1541 297 -3245 -3243 -5234 -4190 -5597
2055 -5597 -2521 -1280 -3298 -3 2340 3309 -123 -4468 -2470 -3632 -259 1453 7535 12234 12952
2040 12952 8509 10528 7461 3154 5352 11919 4498 -5325 -12527 -7564 -2271 -2582 -4360 2015 -3599
2025 -3599 -7637 -6375 -233 923 489 461 966 -970 218 3711 458 -3674 -5072 -4404 -3628 -1465
2009 -1465 4819 4282 5687 7366 3887 1303 -142 281 1341 2336 -1734 -4757 -5723 -8874 -7682 -9350
1993 -9350 -5791 -1563 1117 2863 466 755 -4497 -1981 -1007 -2531 3331 5314 4063 5003 7069 11126
1977 11126 8265 3976 2839 7078 10894 5940 5236 6480 2824 7069 8438 6468 2873 500 5324
1962 5324 7840 7032 9287 8368 11321 9742 3768 992 2561 3740 2011 -4966 -11755 -6101 -7895
1947 -7895 -11772 -11404 -6241 -8504 -11680 -5735 579 2832 4752 3477 1749 -5426 -3629 -1410 1784
1932 1784 1261 -2867 -5418 -3253 -700 -455 -10966 -16302 -14403 -15666 -12152 -4885 -3242 3029 1395
1917 1395 581 669 -3954 -8114 -6528 -889 1261 -1821 399 2453 735 -4570 -4717 -9134 -9349 -5560
1901 -5560 -6913 -7459 -12985 -9702 -1043 696 6552 9345 3539 -1842 -1638 -2941 1296 6960 5812
1886 5812 5785 6609 12667 10192 1029 -5662 -14485 -16861 -12794 -2663 -1106 396 11076 11060 8282 10506
1870 10506 18212 18250 20867 17402 7850 1658 1598 518 -2100 -3117 3020 5616 -206 -1619 -1545 -5003
1854 -5003 -2195 -761 -4561 -312 2439 3134 3467 1853 6674 3507 1080 4548 -1535 -8985 -3631
1839 -3631 -8184 -7433 -6597 -4329 -1846 -6548 -1332 4069 -1302 -3963 -4792 -3773 429 -1409 -6545 -5273
1823 -5273 -9411 -10945 -8494 -3968 -1009 2424 5812 6281 1882 -3443 1304 12839 13533 11910 9148
1808 9148 6291 5459 -1204 -2893 -1059 6383 7957 5084 413 -6751 -4448 1145 4970 4788 1920
1793 1920 2793 833 663 -1232 -1608 304 504 2464 5920 6556 -1897 -1235 -949 -1422 -3415 -11993 -17095
1776 -17095 -11308 -3050 -3027 303 -1695 -1836 330 -692 -444 -2815 -2944 -2335 358 4077 5721 7333
1760 7333 6709 6400 4067 -83 -4398 -3409 -1225 -3529 -4922 -5811 -4286 -2388 -809 1437 -261 4005
1744 4005 4910 1530 5368 7042 7214 7145 7164 8280 6557 286 -286 978 3048 4785 7579 12963 10730
1727 10730 6504 5270 9213 5594 -3436 -1725 4256 8665 9901 11463 13321 7135 4562 2441 -149
1712 -149 -1613 -4258 -5286 -6201 -4464 -1476 842 1238 222 -889 -1481 -3312 -2544 -600 -485 2379
1696 2379 3392 1938 -2492 -382 -65 7394 4017 1520 4947 1254 1936 345 -137 -3411 1142 6023
1680 6023 2930 2825 -13 4886 8397 4795 -1953 954 -5210 -9870 -3732 -861 -979 -1387 -5990 -904
1664 -904 1149 -2205 -5485 -2412 -2143 -5001 -6259 -7664 -3777 -276 -4898 -7972 -5409 -2217 978
1649 978 8814 7966 4908 2582 2857 -296 -2417 -3590 -3378 -1938 -4462 -2502 4171 5071 -3645 -7880
1633 -7880 3010 5216 -1134 -3605 -9987 -9812 -4610 -4792 -5479 -9207 -14674 -16388 -9855 -698 -6474
1618 -6474 -13993 -5453 4175 8577 6413 7486 4451 10310 16290 18999 11833 2426 2943 5314 8666
1603 8666 8508 13072 9347 1251 -5762 -5887 -2711 981 -2291 -1841 -6663 -6204 -7249 -5360 -7060 -11201
1587 -11201 -6996 -3782 630 1669 7256 9709 17101 15155 8432 3986 2454 -937 304 805 -1374
1572 -1374 4183 4319 -1896 310 6014 4062 4812 -4517 -11532 -15231 -12560 -2893 2464 -133 6858
1557 6858 13362 9302 9167 6748 2178 -4407 280 5530 4795 -3147 -1727 -824 1452 2027 1309 -2056
1541 -2056 2928 7874 13852 18555 14454 9351 4063 -1643 -1787 -3667 -3133 1145 -2862 -1451 1102
1526 1102 -2505 -5283 -1533 865 -2790 -7295 -16825 -25472 -24808 -9797 -2620 4721 7288 2843 -607
1511 -607 2257 2465 3196 2028 4258 1516 -1081 1170 4554 6350 -1656 -3381 2296 4327 972 -860
1495 -860 -824 -7472 -4431 -4301 -2487 5411 7887 7021 8784 3777 3900 71 735 3533 -907 -2547 -2441
1478 -2441 3341 -896 -7261 -14437 -21918 -17574 -8530 -2669 -2604 906 -1720 -6350 -6691 -6019 -3946 -7491
1462 -7491 -2481 388 4194 8772 14666 13457 5880 5466 1850 43 2276 7422 10820 9302 7425
1447 7425 116 -5286 -5389 -7162 -4079 -207 771 -4400 -7241 -3328 -658 6761 8384 1130 2214
1432 2214 6564 8783 6383 5287 -3620 -9868 -6233 -5622 -2477 -3502 -956 4632 10447 450 -7771
1417 -7771 -5191 -6323 -2721 -201 2081 8056 11478 10377 8118 3887 7918 7709 5052 7347 8269
1402 8269 3938 9316 12434 12476 15144 16572 11365 6458 4958 -1071 869 6650 10383 2835 -9729
1387 -9729 -6854 -5406 -5067 -5017 537 4712 6527 8886 10186 10665 4454 2766 6338 7021 1275 -2966
1371 -2966 -6812 -7946 -5167 -6038 210 3705 6596 2092 3470 9337 7753 -4079 -11283 -8497 -5726
1356 -5726 -4454 -1719 5598 11472 19655 13396 4268 7963 7687 1886 1466 6189 7600 2078 1134 894
1340 894 -997 402 2664 6753 8608 8580 12742 21240 23495 13701 8067 6178 2733 475 -2208 -5172
1324 -5172 -7777 -9734 -11137 -8220 -2572 1245 671 -3800 570 7636 8496 6523 6512 6042 7454 4171
1308 4171 75 -5737 -6510 -2077 -1038 769 -736 1362 4387 6979 4871 -3888 -8416 -10055 -8678
1293 -8678 -11641 -11325 -3334 -481 -6112 -3744 6173 10087 6956 2759 539 2112 316 -2188 2369
1278 2369 1283 -952 6859 7243 9473 4629 -3562 -2817 -2856 1831 1473 2126 2073 6972 3947 2622 -47
1261 -47 -1425 -1416 -428 1489 -2692 -7743 -7555 -1293 -4264 1066 10468 8190 3532 -148 -460 813 6837
1244 6837 10854 8016 4154 733 216 3229 -650 2756 -2543 355 4668 2152 6237 6554 4689
1229 4689 7499 4068 8066 4486 3621 13218 10089 3432 -1404 -2791 9021 8594 2541 1852 5846
1214 5846 7395 4635 5803 5452 5385 348 -3074 -2985 414 1562 5160 -2161 -5980 -5115 -2757 -4453
1198 -4453 -2277 3228 4955 2940 -196 -651 5225 7489 4965 688 -7498 -9007 -4741 -2030 -991
1183 -991 1527 -361 -1764 1636 78 -2310 456 5860 4271 833 2452 766 59 4713 1356
1168 1356 1664 3548 8644 2656 -11646 -10624 -9448 -7794 -3316 -1652 -1161 7684 8719 5383 2400
1153 2400 4377 7200 3361 2037 2364 -1386 -3946 -198 5660 5110 -1787 -8038 -7164 3604 10306
1138 10306 5807 4312 2757 885 2502 6938 459 -2156 -3060 -5273 -9025 -1192 4787 5914 13051
1123 13051 12317 2888 -391 -1310 -3755 2726 6317 6437 -1034 -5847 1560 6380 7372 9749 3116 7041
1107 7041 7425 9258 12673 8919 6369 3804 1924 -1112 -2910 -4224 -2556 -2654 1709 3414 4422 -678
1091 -678 -2255 1021 -125 1520 -3899 -5916 -2522 -704 -304 -50 411 1698 6651 9507 8339 11231
1075 11231 10444 9479 12117 9613 8923 3826 360 4804 11258 14828 19264 18928 15078 12197 13283 13071
1059 13071 12113 10713 5174 509 -5281 -3783 1228 -3481 -7350 -7838 -6968 -8423 -10116 -6694 -5276
1044 -5276 320 518 1137 3350 7792 6906 5246 7186 5632 5828 4606 3227 4592 13761 8413 2924
1028 2924 4114 6888 6829 5420 3271 1226 -1716 1552 1886 2359 1652 -1356 -1898 2510 3433 8470 5827
1011 5827 3497 3832 5052 9408 8507 13817 13332 6675 3750 4500 3522 4700 -1333 2281 389 -4920
995 -4920 -5452 4012 6470 6164 -1159 -2387 208 -371 288 582 1888 -397 3812 7515 6959 5518 10743
978 10743 9770 8101 8231 -769 -2615 -2585 -1461 2495 3067 8320 9979 6848 8980 9294 12014 11055 10200
961 10200 8136 6815 5051 -632 -6106 -1201 5333 3032 1382 -159 -571 2359 5658 9255 5668
946 5668 5162 1496 -3389 -2677 -2990 -586 -1735 2933 10020 10550 7138 5602 5677 3008 1694 5274 1564
929 1564 1173 4631 4820 -914 13 3327 5162 4814 5782 3815 -2241 -3058 1918 4002 4855 7009 5424
912 5424 4679 4381 2535 219 -3352 1448 -35 -5815 -5851 -2806 -144 2453 7874 8770 4348 1288
896 1288 -857 -2178 -3416 979 4188 2827 3294 -2040 -2847 -6456 -2628 2297 6787 2596 -235 3211
880 3211 3806 5009 6253 340 1192 676 -537 1161 7828 16212 12474 4771 -3618 -5886 -1845 7632
864 7632 6693 -1092 459 7184 11316 10704 11893 8348 -739 709 2851 2422 3503 1900 2990 3361
848 3361 7714 4671 4356 1690 -104 4503 6031 4553 3068 6021 8810 5801 2076 1083 -3405 -1980
832 -1980 910 3632 5717 7908 9500 10404 3111 -2388 1106 -624 4847 7154 5953 7301 5101
817 5101 1965 143 -1620 -1236 -4268 -10527 -14343 -10046 -9146 1193 9175 7574 8663 3248 -1359
802 -1359 -1300 1425 -3944 -8260 -2615 -2556 -1374 -2898 -3286 -4715 -5854 -2751 -1419 -1293 677 5760 7590
785 7590 2936 6338 13679 9313 9864 6300 4176 2962 3286 4562 -2472 -791 -1945 -2406 1191 2083
769 2083 8028 8548 5214 2420 2648 6947 10896 6309 3851 3899 3203 -707 -4795 -3195 -1859 -519
753 -519 2059 916 4038 1807 -4486 -5600 -7320 -9329 -6823 -2943 926 -3200 -1125 -2397 -4733
738 -4733 1159 -1693 -2628 1036 -2073 3018 6292 3440 3817 1276 -2449 2735 3741 605 4396 8194
722 8194 5235 3314 702 -2257 -2942 -3809 -7267 -808 9119 5936 749 6148 10208 5742 4221 2169
706 2169 199 7955 10949 9610 7405 6496 7121 1704 -31 1745 491 963 4646 -132 -482 3442
690 3442 7941 8597 7905 12229 9416 -262 -6357 -8454 -6097 -9544 -11676 -7113 -1879 1233 8024 4918
674 4918 1452 1024 3240 3985 6998 4478 5861 7843 7151 1670 4699 819 -4392 -719 10177 11997
658 11997 5038 5358 7196 8440 3680 1810 667 1945 6106 5382 -3869 -7423 -4695 -8347 -17293
643 -17293 -15057 -13103 -7961 -3573 4996 5708 -224 -3837 -2089 1457 366 -4242 -4439 -9852 -9283 774
627 774 10710 15224 10857 4527 1784 3947 4589 181 -3945 -3576 -5908 -2568 4079 1642 1018 3630
611 3630 4357 790 8084 11887 7423 7852 9729 10694 6421 5960 1628 -4169 445 1524 1462 266 2394
594 2394 1028 -960 1048 3274 803 413 -3241 -4097 1210 246 -2796 -966 4786 2284 -7691 -5578
578 -5578 -3328 -6179 -4669 318 2613 5343 9839 8800 8450 7905 9327 11428 16314 12090 7418 7338
562 7338 6719 1198 3715 1735 -551 4093 4654 3769 958 -3164 -5790 -5440 -6919 -2280 -2752 -1945 2337
545 2337 3933 477 -1447 -215 1826 1607 -219 1726 9300 7919 9058 15068 8703 57 -9582
530 -9582 -13369 -1953 3689 -1039 -587 689 3356 11721 13695 12703 11457 7185 -3372 -7523 -10810
515 -10810 -2926 5600 10510 12340 3779 737 2185 -2459 -5634 -4673 -203 -1116 -3257 5586 6586
500 6586 2681 2455 5873 10185 6248 4608 8036 7952 4449 -5140 -9598 -8619 -5577 -5879 -5013 -6989 -9033
483 -9033 -2264 -1725 -2334 -1885 -1269 1334 248 417 -2000 -227 1465 3136 5815 4686 5207 8543 9684
466 9684 6821 4322 481 -8836 -10571 -5018 -3431 -6069 -6184 -1308 -1486 -1493 -3365 -342 3423 5524
450 5524 6090 4302 2690 2027 3985 2775 -3811 -10622 -5892 -9820 -12535 -4592 -3394 -6636 -2431 4915
434 4915 12079 10121 7152 5067 4623 6537 6894 6328 8234 2992 -1461 2113 5688 7496 7906 10052
418 10052 13851 10681 3083 1167 -827 1484 2807 4387 6598 8135 8655 12685 12708 6281 8231 6439
402 6439 4453 3661 4009 -1178 -6106 -14676 -10134 2818 11807 10775 2532 2346 7771 11576 9437 8862
386 8862 5760 8303 10667 11906 10982 9986 7699 1739 4310 5995 4395 791 6584 13335 7513 2771
370 2771 4784 5938 4274 2492 3838 1964 -513 1303 1457 -2824 -7645 -6441 -1857 -3114 -6831
355 -6831 -5890 -1973 107 -5344 -7537 -5033 -3331 -2000 -1882 -1515 623 6973 6531 -1042 -4836 -2718
339 -2718 -3715 -3161 -1137 1039 2294 5576 9251 6328 8115 10138 7622 3271 3329 3317 1565 -2482 875
322 875 4010 -620 -4194 -5793 -2035 2885 9775 7232 655 4413 9616 7797 5010 2804 6560
307 6560 7362 5380 6356 3530 3131 3048 4783 10907 12876 12004 5457 2739 3529 3600 2093 5744 7588
290 7588 8215 10886 2886 -1478 1500 4049 10387 9179 8622 3405 -510 2938 7784 3178 2121 4983
274 4983 -734 -6375 -5601 -1862 5313 10829 10705 9504 7488 4549 -167 -2546 2854 6979 3958 2453
258 2453 1248 2497 1846 7087 10602 8628 5327 9322 7778 2117 112 2706 -2756 -3235 4032 4869
242 4869 5360 4836 6165 7289 5237 4394 6286 6610 4170 1944 -46 -525 0 5404 6130 8036 6863
225 6863 4869 189 181 1712 1980 5480 7344 9608 13146 6593 3323 9293 8807 9005 10048 9514 8683
208 8683 10620 10475 5535 5970 8853 7565 2362 -5265 -5086 2499 6843 10097 5593 -373 -1570 -1376
192 -1376 -6760 -9694 -8900 1220 3597 2820 983 1707 4458 3664 1935 3186 8106 8861 6895 5786
176 5786 3354 4311 7484 7056 8664 11093 8191 6272 2394 -2539 -1831 1205 4350 2576 1757 311
160 311 -40 2368 3357 512 -629 2480 5597 6447 6514 4035 5223 7829 9692 7028 2651 5229 9187
143 9187 11793 6302 6844 4860 7001 8390 4764 3272 5952 2595 1758 2402 -1347 2575 3137 218
127 218 -3042 -2094 4282 6742 2040 2385 5382 8133 10171 9825 4945 4520 2332 -260 69 -3435 -77
110 -77 -1038 -767 979 580 2903 4550 2343 1823 1084 3828 2604 -1639 340 -763 -1956 3014 3624
93 3624 -2493 -6179 -4977 108 -448 -362 3536 6471 2012 -1618 -2685 -4192 -4135 -6250 -5438 -3261 2202
76 2202 1916 3333 5191 3080 2832 7026 10521 10681 6573 7940 12765 6356 3307 4725 3991 2909
60 2909 4131 7276 5142 4127 2730 3096 5980 8948 11376 10504 3210 3908 4433 3942 5117 6646 9531
43 9531 8745 4326 923 161 -1296 6471 11309 11286 8708 6806 7532 10444 10415 6326 1287 1611 4320
26 4320 7552 9013 6065 3446 4090 4052 2393 772 1710 1977 8162 5677 581 1858 9194 15095 15972
9 15972 11269 8245 3935 3002 3395 5797 3724 616 -1085
0 -1085
$$ Imaginary data points
##PAGE= N=2
##DATA TABLE= (X++(I..I)), XYDATA
32767 37477 37702 39551 36482 34739 35935 40415 43256 45448 45473 44099 44385 46446 44175 40363 39477 47627
32751 47627 53412 53418 56131 60079 58936 57721 53146 50722 51755 56131 56136 53252 54207 54018 58420 63805
32735 63805 62952 63389 65101 65632 64496 66169 65864 66228 66035 65635 67448 67953 71147 67032 65529 67402
32719 67402 71456 73536 75025 78480 77418 79139 77363 74856 75280 75605 72067 73082 74347 74118 82073
32704 82073 89444 87632 86968 88712 90933 88734 88485 90818 93736 95337 96286 97362 97978 97406 98586 100870
32688 100870 98422 97296 97252 98766 96956 93764 99634 106423 106799 105401 106161 101765 98520 99154 101028
32673 101028 105681 109146 112759 114603 111624 109256 111897 113507 113427 109833 111603 112095 114901 122071 127818
32658 127818 131061 127602 121937 124174 126054 124783 123107 119858 122906 127326 127590 125925 126506 125492 120485
32643 120485 119694 121163 123339 126714 129723 128704 124702 127215 131094 131404 127412 125365 130906 133165 137232
32628 137232 133467 131537 132585 139511 143215 143799 141346 143541 141657 138686 143460 146555 146022 144550 141680
32613 141680 143028 144110 147673 148114 142656 144332 150243 153541 155687 154238 152359 150517 149137 149542 152291
32598 152291 156792 158725 156968 160786 164571 160765 159600 166175 171627 174731 174745 175257 173810 169479 171498
32583 171498 167885 165139 169094 166055 164088 167463 172578 172876 173222 173049 175316 172703 170119 172178 177664
32568 177664 182728 184417 180310 181460 179850 175924 177042 177636 180087 184496 180949 183584 185639 187188
32554 187188 187104 185622 184770 185693 188975 184455 188243 188074 186066 187888 191492 192067 197903 199547 196217 194460
32538 194460 191144 194340 196533 199228 199293 198002 196671 196219 198567 194644 195724 196456 200251 203625 198743
32523 198743 196461 195722 193479 196760 198729 207313 211604 209494 206740 201999 203575 206037 208810 207995 210160
32508 210160 212962 211472 207194 206801 214608 218384 217646 216849 212603 215548 222288 219705 216489 216649 222676
32493 222676 221219 215544 208468 205840 204470 209847 212838 216909 218195 220189 220233 219809 214576 218357 224180
32478 224180 226831 219904 215351 211742 215055 216960 217638 214823 215700 223265 223214 226456 228468 234814 234898 237148
32462 237148 235754 231947 232164 232637 232344 232334 232205 233306 240489 239036 231802 228923 229496 227877 231292 229729
32446 229729 227261 225498 223677 225514 234095 237780 237545 236598 238527 235426 234337 234220 232507 235969 234413
32431 234413 224960 226673 238168 242100 243792 243382 239034 239448 242785 241753 242609 243964 246829 247892 249608
32416 249608 249826 248067 241806 238335 240086 236061 233152 232521 236208 247718 248522 244980 240324 240027 245320
32401 245320 250487 250492 245334 244174 245752 244238 247007 249209 253832 253465 256192 258246 251817 257224 258775
32386 258775 254293 253167 254705 252686 249988 251617 252403 258726 263247 261717 259179 253337 253316 258851 260571
32371 260571 259601 257761 258154 258918 257376 257138 261120 262419 262596 263812 267765 266552 263918 260687 258917
32356 258917 261367 262015 259935 263194 268555 269069 265400 261657 261389 263272 259651 260188 260977 260663 259427 255640
32340 255640 259252 263693 264826 269806 274262 274819 266224 259108 259438 259779 258007 261547 259109 260066 263837
32325 263837 267594 270837 264832 265469 264423 257475 253455 256862 268415 270968 267364 268506 267118 270342
32311 270342 278798 279464 270806 267511 270051 270091 272373 272126 275691 273231 271446 277502 280864 278638 278286
32296 278286 281187 276693 269250 268764 267959 265500 265783 271189 272354 272951 270660 273789 276568 281590 280823
32281 280823 275921 276858 273425 272102 279640 283082 284563 278580 277955 282223 277288 277678 281668 281678 275231
32266 275231 271181 269014 267372 272859 272930 274342 273570 277456 282676 289767 287081 279613 282240 283420 278072
32251 278072 275271 278012 277428 273987 271660 271721 278297 274893 273053 278367 280148 281057 279133 274047 268618
32236 268618 271641 276730 276403 273934 281661 291794 290346 287214 284300 283323 280584 277051 275557 278448
32222 278448 288687 288960 284528 284362 286166 280322 283291 287595 289749 288701 288395 285351 288987 284200 279034
32207 279034 278649 279230 279043 276680 278539 279680 280095 274201 279697 288237 285494 287335 285700 281366 277878
32192 277878 276789 279337 279052 281631 285477 289379 282156 275213 281532 286873 286644 282320 277434 277714 282032
32177 282032 284852 281041 277493 274990 272149 266020 268616 270341 277859 277919 280527 280513 280679 279774 285211 286733
32161 286733 288679 292882 295559 298618 299474 296515 291705 281237 280211 284021 284199 281327 287587 293479
32147 293479 292836 283700 276461 284117 286712 280587 277440 283478 287990 284778 284218 286575 285428 282087 279598
32132 279598 280873 284864 282912 289363 293251 297505 291337 287447 289971 289161 288485 290148 291894 284935 286575
32117 286575 284870 285562 282858 280140 282365 285699 281769 281528 284819 285623 289661 289897 286200 284560 283064
32102 283064 282946 280797 283114 290449 287725 288376 287093 290249 290044 286841 285502 278976 283957 288687 283393
32087 283393 279420 280790 280689 279686 280777 280756 282286 281978 288907 291086 287932 288483 291479 287600 292372
32072 292372 288676 278910 278772 279758 282972 279670 285862 289443 283167 278622 276790 275952 274797 276543 279649
32057 279649 280195 282649 277735 274163 275636 280729 280699 282500 283481 288351 290490 290491 289996 295428 293955 293597
32041 293597 292143 293242 294722 298733 289155 284962 287052 291654 289345 291511 290224 287819 282892 287044
32027 287044 293028 292180 288431 279676 277776 280711 282457 282660 285458 285913 284679 284083 287288 285904 282877
32012 282877 287415 288435 282991 277719 277547 283154 290669 292622 288088 283760 284358 287487 289374 288229 286055
31997 286055 285112 287588 289749 285272 283711 281626 280776 283872 289826 291365 290002 291086 294208 290162 292476
31982 292476 298705 299613 292254 289998 289601 290568 291977 299922 292027 284188 291979 294399 293320 291820 291296
31967 291296 289856 285091 284433 283444 285044 284057 283020 280980 280340 281274 285435 287529 290029 289712 284894 288854
31951 288854 289280 285255 283664 283495 287471 292322 296608 298249 292846 283500 284439 283081 286003 295440 292880
31936 292880 289538 289436 283488 283761 279223 271907 283254 292816 295753 298586 300791 293776 286001 285440 290607
31921 290607 292830 290134 287354 290087 292872 292623 292691 289446 290569 292115 296621 291363 283885 281108 284164
31906 284164 290618 290784 286897 291772 301491 302859 295764 295111 297031 289679 281809 274688 276367 280966 289676
31891 289676 290829 292952 292675 289176 283833 277737 274026 272276 272433 273960 276939 278983 276255 273299 281574
31876 281574 282641 281507 280307 278724 282963 290050 287350 286037 292639 294325 295507 289832 285942 290743
31862 290743 293285 289171 289036 285949 281512 290033 294377 297868 302704 288911 282984 286373 292104 295946
31848 295946 290437 285240 277043 272818 280892 287454 293579 298273 298931 296357 301598 304704 298824 296433
31834 296433 298067 300616 298052 292929 293646 288173 290694 295194 296020 294055 292149 297241 294240 290346 290218
31819 290218 294378 291177 289639 291687 291854 286896 288317 289624 287106 283086 284503 286253 284857 285910
31805 285910 291668 292126 298203 304856 306169 300345 294813 288121 294311 295281 290759 289179 287874 288694 291608
31790 291608 289445 289809 294578 292033 289585 289694 290122 292280 293024 294238 294960 294400 290968 288929 283368 279185
31774 279185 279478 283111 285709 292291 298672 302686 301553 297086 293223 287357 289122 300427 304565 301070
31760 301070 290953 295195 298888 302931 303960 299206 296436 293637 294767 300879 303568 305219 303701 298010
31746 298010 295428 299229 294392 293569 296173 298201 290877 289242 292664 296279 298096 298858 294093 290124 296802
31731 296802 304906 301461 293999 296315 300526 303305 301070 291119 277894 277983 286596 299380 303312 299814
31717 299814 294929 294166 296410 302119 298487 301938 298679 293236 292507 289899 290306 292366 294128 293462 295726
31702 295726 293554 291267 294321 295579 289911 286570 283732 282856 287347 291293 293750 296099 294591 292669
31688 292669 291524 289996 292263 302989 302389 296065 292957 293258 287920 283031 290087 295672 292295 290184
31674 290184 292651 293149 290713 291005 295282 299398 298299 297722 299884 301882 303873 296139 289809 288094 281454
31659 281454 277997 282538 284299 282713 279361 278849 286173 291483 293579 297352 297938 293779 290965 293895 295425
31644 295425 294881 295085 294478 288064 285335 285551 281851 283786 287831 289589 289178 294470 300664 299564 296697
31629 296697 294784 298755 296836 295308 296235 295754 297426 294868 296787 306546 300109 296727 296820 294674 292571
31614 292571 288698 293528 296360 295073 296241 295921 292569 293056 291141 289639 294859 297085 297237 300347 304226
31599 304226 305664 307108 303543 295922 297665 293807 296348 295883 295668 291836 287930 288821 295876 294842 293903
31584 293903 291880 288612 291450 293156 296583 303431 306144 298984 294584 292013 291902 291447 292490 294542 295522
31569 295522 291196 287689 290678 297556 302294 301144 298373 296081 294883 297019 299182 304497 302064 296933
31555 296933 298838 294502 293807 291853 281963 284276 287367 291870 288005 283597 280564 282674 283481 285210 280603
31540 280603 287902 300684 297390 291327 288262 288889 288902 287014 293281 296136 294502 298776 298479 290099 289267
31525 289267 287909 285290 284645 284293 293226 296582 295269 298329 301519 297034 293973 296412 300691 302555 294875
31510 294875 292053 294639 299546 299937 299285 292909 295524 298198 295480 291972 291990 291558 294428 294563 295351 294517
31494 294517 293034 298221 298173 295974 294375 297260 296580 290844 293346 295641 300092 302817 297575 296244 299905
31479 299905 294910 285725 290375 298611 294907 290631 292628 289577 285741 285883 291476 299844 301224 300153
31465 300153 295580 293830 292217 296173 296425 295533 298173 299043 295224 292724 292494 292234 294133 294115 297445 300213
31449 300213 301148 299725 301332 296678 303722 304684 307285 311436 310721 304907 297527 302672 306991 308138 304733
31434 304733 306101 305679 306018 303505 300422 298661 298313 295111 293830 295081 293164 296033 297150 294876 289672
31419 289672 290573 292891 294496 292991 298471 299736 298429 296568 297124 295401 291799 289057 286458 294052 302670
31404 302670 304365 300781 295593 293946 295643 297226 292288 288132 289945 292368 293756 296920 293202 294653
31390 294653 299075 304191 299328 297093 298817 302735 297631 299001 301214 298866 294995 289497 290003 290206 295385
31375 295385 303099 307861 308762 310227 306835 302998 299335 299031 293785 294679 300721 303452 307753 301814 302769
31360 302769 301714 295304 291493 285755 290300 289236 293807 289667 287414 289682 293375 298724 300720 299615
31346 299615 297057 298596 299948 303664 303120 305260 304288 303275 303404 298049 297515 301728 305410 302698 303633
31331 303633 304847 305219 304202 302763 297432 289883 288121 287233 295328 300392 302854 307336 302710 296105 290567
31316 290567 293541 293599 294543 292284 303240 311471 298868 293872 301204 303034 298263 294987 297779 296028
31302 296028 294923 296746 292841 289540 290810 289528 293417 294361 294000 297002 297866 295409 294203 297964 298789
31287 298789 293310 291172 296246 298308 299449 301149 297122 297191 307208 314270 309693 310522 312482 307747 301336
31272 301336 295864 292876 291539 292707 292539 290834 295049 300069 304378 307729 303101 302242 306956 309648 302711
31257 302711 301218 302210 302198 305701 306635 308883 301969 298048 299349 303764 308693 307391 305986 310411 307322
31242 307322 301082 299104 299404 300463 299749 301099 305159 302367 299864 294778 294960 298072 302580 304560 304612
31227 304612 303957 302969 300421 306116 307800 305527 299735 294632 296376 297012 294949 298343 303133 303705 303593
31212 303593 301488 294461 294670 287374 293727 299229 301026 300079 295473 295048 297069 302943 310396 313148 309219
31197 309219 309808 305950 300952 296572 294694 288467 289303 297965 301067 295353 293931 293277 298833 297083 292596
31182 292596 296643 303354 302436 305856 302608 297356 297090 298793 299989 299906 300419 295021 294671 298584 301925 302653
31166 302653 300662 299671 299278 302661 306682 305122 299436 299490 304919 310373 319183 312485 309939 307068 311632
31151 311632 307010 305490 301238 298997 303726 302695 303865 302068 300829 297136 297568 304693 306718 300516
31137 300516 299558 293929 288397 293901 289168 286362 284863 285490 292544 295648 298724 297105 294731 298529 296756
31122 296756 293492 295748 300047 300291 301903 304674 308174 303922 300844 300042 306073 312089 310961 307072 303985
31107 303985 304190 300685 298580 302213 304874 307168 301943 297194 295826 294182 292082 293729 299912 301831
31093 301831 302919 301714 302893 310742 310825 308630 305766 301107 301094 301666 301992 307132 300466 299564 296630 298397
31077 298397 297668 293371 297693 295727 293567 296564 292802 290843 298087 302118 303767 306976 310257 309939 310207
31062 310207 305739 304133 305357 301333 300924 304867 307075 304905 308098 304829 298454 291248 293113 287740
31048 287740 292048 298014 292700 293642 295121 295487 295226 298148 301853 297407 297782 305033 301414 303273 306360
31033 306360 308145 303877 297922 297491 295052 299483 303935 306496 306369 300086 302108 302480 297920 298054 300124
31018 300124 299190 301640 303093 303012 301147 298618 298922 293091 295298 298740 301268 305582 307544 307946 306729
31003 306729 306535 300110 300209 302922 299246 303659 311178 311359 304302 305478 304132 300483 303113 303242 306201
30988 306201 310838 307549 302078 299766 300923 298626 299657 302526 300536 298882 299958 298040 298268 296811
30974 296811 298578 303033 303028 299745 295333 300576 306191 305808 301467 305774 307151 304047 299864 301375 301231
30959 301231 305036 305059 301434 304024 312725 317509 312088 308244 308560 308397 305248 297989 296007 296983 301670
30944 301670 304460 302208 298183 300546 302398 302733 304514 303485 304482 302039 291993 289698 296836 302407
30930 302407 300221 299802 307140 312385 313713 309336 303388 303772 304896 302085 303372 303498 301807 300985 301672
30915 301672 300294 300377 296890 295453 294100 294907 295661 300444 301471 300677 294790 296901 301607 309894 310188 306528
30899 306528 300895 303450 309092 307247 303902 299292 295764 297538 295633 294002 293558 292563 292395 297354 300273
30884 300273 300151 308527 312422 310710 312666 311483 310694 306918 301738 304811 311539 311990 311343 311676 314490
30869 314490 315449 315107 306582 307196 311917 313418 309644 309876 310754 310079 307565 306781 301615 302860 305920 305054
30853 305054 309185 309164 309929 309957 309439 306925 302462 298886 298440 296580 298218 306207 306836 302184 302252 306721 312068
30836 312068 316623 315070 315821 310039 302031 303356 307510 308172 305798 308097 310134 303984 305874 305134 306927
30821 306927 303051 304654 309154 305940 309701 309407 304828 302709 301760 303501 306883 310686 309170 308515 302933
30806 302933 301739 305310 307813 308377 307537 306214 299612 299430 300413 300408 301176 299427 294902 299607 305301 304213
30790 304213 302308 301599 306570 310696 313631 311402 302746 298994 300855 305405 312264 316320 309217 305292
30776 305292 305724 304788 300523 302537 304127 300617 303575 310795 311871 306737 310152 310313 307596 302547 306331
30761 306331 309431 305968 298579 297478 303295 299719 301863 307328 311458 308468 302634 305600 309274 306201
30747 306201 308801 306885 303572 302803 298944 296156 297370 300552 297053 294083 299707 300705 300647 300506 305793
30732 305793 306505 309566 310237 305912 303789 302599 308261 305581 305877 310711 311758 311521 315533 311436 311044
30717 311044 310275 310022 309089 305707 309553 307553 305618 304620 300469 295395 292348 297277 305373 308207 307699
30702 307699 304159 308748 313597 309609 305082 299012 297156 300620 300329 305170 304298 307328 307808 309013 312580
30687 312580 314670 315162 315995 313324 310480 314025 318084 312205 308345 309774 302857 299608 306778 310567 310221
30672 310221 305432 304666 306577 305180 300966 299499 301567 303665 304601 302740 308928 310139 307666 306248 307371
30657 307371 308208 314313 311717 307776 303749 305035 304878 308117 310648 315847 320417 317162 317967 318878 321484
30642 321484 317960 317890 316456 315441 313621 313848 310387 306732 312393 315089 315375 317038 310956 303713 298602
30627 298602 300795 310193 321808 327426 321331 313601 303413 304694 312447 312763 313112 313853 311512 310834 313402
30612 313402 310689 308940 304485 295962 295426 297648 298348 303044 303762 305366 304978 302808 303261 302867 304296 304768
30596 304768 309101 302976 297157 298176 297296 300802 305567 305613 305328 306558 303699 308254 311107 305425 302908
30581 302908 304367 308582 305730 305199 305113 306867 312904 314890 309087 299993 300007 301082 305866 312846 314839
30566 314839 315823 305609 301886 306640 310541 316374 312478 312006 311378 310182 312934 311488 311589 306741 302077
30551 302077 303643 302522 297458 296223 293853 302100 312718 309904 305057 310951 314901 311371 312394 312875
30537 312875 309908 305519 302670 301611 307400 305668 299732 302391 309415 311470 308247 310598 316463 314735
30523 314735 311167 306339 305680 306018 304523 305510 304080 297484 300936 308972 315162 315480 310046 312778 316382
30508 316382 309926 306607 307689 310839 309294 305777 298014 303216 308855 314184 319232 315779 313288 315373
30494 315373 313532 314893 317442 310201 306740 306115 302410 300338 309971 317370 320056 322321 316467 312489
30480 312489 315384 317954 314395 315317 309424 301791 294862 299904 303448 302947 306272 310672 315308 310019 304312
30465 304312 306449 305524 304563 305614 308244 313770 311544 312873 314527 317599 315715 312796 307761 304873 309545
30450 309545 310072 308220 306984 314945 317478 314003 315203 319088 316881 318201 310235 308052 313407 311640
30436 311640 308457 310417 310103 303441 308691 319107 318583 317566 310848 312979 318126 322344 323500 326628
30422 326628 323807 313045 313915 313266 310816 310286 309335 309422 313226 314201 313225 312460 317873 322592 312086 314251
30406 314251 317868 318343 318313 318683 318031 322064 324961 320941 318975 321021 316128 314463 310778 308360 312293
30391 312293 313716 309224 307643 308975 307473 308340 308261 312609 315661 314011 316906 319677 325640 324124 317588
30376 317588 311757 315052 313336 315757 321893 327837 324749 323212 321794 316415 319520 323914 317920 314459
30362 314459 306538 304481 308472 312307 316444 321647 314788 315320 320729 320439 319719 318984 322177 321095 323328
30347 323328 323743 315582 316172 319032 313969 313849 309669 304272 311207 313780 318501 320080 319362 309714 313255
30332 313255 316554 315317 314939 309129 308593 313095 314712 309285 307156 309722 306816 307874 312444 312653 312474
30317 312474 312991 307350 311368 308841 308839 313025 313819 315186 316231 321835 323713 322765 317302 308153 308052 305306
30301 305306 309882 313118 320022 321907 317524 315658 321114 320265 315198 315753 313592 304602 305433 305692 305071
30286 305071 308134 311647 314870 313513 312290 313275 311555 312391 311589 310895 308121 307363 311416 312420 318996
30271 318996 320097 320931 317019 315503 314812 314150 316488 317758 317721 315773 312499 310656 308110 307047 308168
30256 308168 314599 315845 314578 318545 319932 321294 327818 326046 321135 315990 310167 307913 310285 308496
30242 308496 308817 311455 315738 314398 312592 314159 325844 323786 313969 315558 316172 314053 309757 305514
30228 305514 310065 309116 304344 306569 309596 307226 310716 323101 324876 319827 316304 313192 310645 307688
30214 307688 301666 303323 304338 311170 313292 312298 318759 319989 322629 319288 318994 323312 319953 316820 315141
30199 315141 321898 323346 319327 320761 321790 318377 318385 318528 314493 319487 320167 316666 313524 312977 311394 316335
30183 316335 318605 319500 321931 325088 317613 313107 309232 306356 312703 313436 313202 310246 314049 317526 311581
30168 311581 307754 310246 313393 316155 322166 321097 321467 322826 316222 315775 316280 313555 312420 310346 317577
30153 317577 319052 311525 306850 306183 306876 308734 309174 315443 316994 309247 306175 301762 304720 310673 310588
30138 310588 310646 312770 317367 315945 317095 321165 325447 322636 319572 319955 325898 327635 324164 315807 313588
30123 313588 309334 309330 311346 314207 319196 315109 310118 308826 311222 319458 322428 319856 317806 312333 310120
30108 310120 311782 315065 315368 313272 313895 313452 312850 315341 320872 326535 324470 318058 314858 314690 313116
30093 313116 315758 313846 314014 315207 313727 312285 311331 313791 316549 316384 318713 319411 321302 319310 317245
30078 317245 314752 318941 317761 315334 318614 314431 313775 314983 320833 324930 320083 314496 315629 319268
30064 319268 317415 315407 310351 306238 310613 315708 320154 321837 326928 323890 319511 321375 319439 313976
30050 313976 316145 318612 315873 313332 314315 315083 316174 315057 322370 323578 315953 312437 313733 314092 313234
30035 313234 309658 313388 314226 310154 305200 303559 309502 318196 315302 314091 314225 317221 312538 314449 316171
30020 316171 318338 312711 311262 315443 321854 324616 317490 313714 312280 310466 312056 318340 321051 318716
30006 318716 313643 312323 315902 320512 321996 321340 318942 322390 325718 322782 323932 324777 320733 318652 316702
29991 316702 309817 306689 304144 306927 311815 316090 318522 323238 326991 319506 315116 315050 313890 307798 305645
29976 305645 310516 320869 318604 316628 313871 317261 322750 322555 320567 316917 313849 312715 320889 321174
29962 321174 319146 323706 318999 317051 318379 315383 317867 319745 316778 318627 322473 323611 324047 318824
29948 318824 313721 317937 325285 325695 324246 323615 319203 318359 312502 304297 301138 306818 311937 310925 310057
29933 310057 310740 311135 310685 313279 316463 312556 312728 313042 318384 316406 308035 309247 309336 311267 315168 322081
29917 322081 321449 319871 320994 321139 317063 313247 308535 306678 310369 317382 319604 315371 313389 313712 313872
29902 313872 320931 322358 321852 327012 327707 326913 326438 325018 320644 315836 314515 319011 319635 325643 324700 321785
29886 321785 323141 321364 320110 315832 317936 317188 319821 318210 320163 319074 319077 313443 315783 319234 316980
29871 316980 319866 319557 315508 309327 312775 316633 322157 328024 323164 318103 322638 323668 319294 318722 319385
29856 319385 321087 322132 316166 311150 312075 320175 322203 314656 310389 311483 316348 321714 321567 315588 314171
29841 314171 314939 313317 310098 311610 313302 314564 317351 318503 317940 321888 328479 326418 324012 319099 313333
29826 313333 317467 313555 317617 320726 324083 320692 325670 328736 329617 329528 323694 321242 316981 317676 321578
29811 321578 325445 326876 326616 321915 319865 322307 320902 319883 322428 318415 324255 323000 317731 318488 316358
29796 316358 321954 327397 321653 318150 321874 323678 322902 324844 325155 327550 330580 326082 324372 324719 327941
29781 327941 326080 320962 316189 319247 323026 319846 313702 310482 317917 318072 317794 317844 320836 323518 324341
29766 324341 325868 318916 311158 309650 308479 310510 313625 315503 317066 324899 320386 315749 315904 314859
29752 314859 315440 319683 322252 319935 315537 315980 323179 318828 316311 317949 323200 327831 324174 320841 323987
29737 323987 321182 319945 325413 324508 319245 315178 318340 325158 321691 324315 327025 329730 332576 328383
29723 328383 329360 331205 330421 322391 322565 327713 329560 323101 314252 311491 314999 321247 323057 322793 321252
29708 321252 317497 324168 327484 323921 317913 322362 323740 321082 324535 320661 323116 325857 324663 324726 324132
29693 324132 318124 315658 317715 317199 316460 315817 315503 317751 326640 332173 334424 332904 330198 325977 322831
29678 322831 328483 331844 336958 334504 335105 338067 337466 330761 325550 330914 331718 328101 323741 319894 323455
$$ [...]
##END NTUPLES=NMR SPECTRUM
##END=
