##TITLE=Analysis number 311733
Compound Code sb 01678
Project Code qc-cat
Chemist Name new century
##JCAMPDX= 6.0         $$ Bruker NMR JCAMP-DX V2.0
##DATA TYPE= NMR SPECTRUM
##DATA CLASS= NTUPLES
##ORIGIN= Bruker BioSpin GmbH
##OWNER= NMR
$$ XWIN-NMR		Version 3.5
$$ Fri Jul 15 12:02:22 2005 GMT Daylight Time (UT+1h)  MAYBRIDGE\NMR@NMR_250MHZ
##.OBSERVE FREQUENCY= 250.131544655141
##.OBSERVE NUCLEUS= ^1H
##.ACQUISITION MODE= SIMULTANEOUS (DQD)
##.ACQUISITION SCHEME= undefined
##.AVERAGES= 16
##.DIGITISER RES= 18
##SPECTROMETER/DATA SYSTEM= dpx250
##.PULSE SEQUENCE= zg30
##.SOLVENT NAME= CDCl3
##.SHIFT REFERENCE= (INTERNAL, CDCl3, 0, 16.522)
##AUDIT TRAIL= $$ (NUMBER, WHEN, WHO, WHERE, WHAT)
$$ ##TITLE= Audit trail, XWIN-NMR		Version 3.5
$$ ##JCAMPDX= 5.01
$$ ##ORIGIN= Bruker BioSpin GmbH
$$ ##OWNER= NMR
$$ C:\u/data/dgb/nmr/ADRS/5910/pdata/1/auditp.txt
$$ ##AUDIT TRAIL=  $$ (NUMBER, WHEN, WHO, WHERE, WHAT)
(   1,<2005-07-15 12:02:01.75 +100>,<MAYBRIDGE\NMR>,<NMR_250MHZ>,
      <created by zg, POWCHK disabled, PULCHK disabled
       configuration hash MD5:
       62 19 C7 07 E1 42 D1 B7 37 6C 3D D0 77 39 F9 E6
       data hash MD5: 64K
       44 C8 FA 99 3F D6 63 48 7C 78 99 C4 0D 42 0F 6A>)
(   2,<2005-07-15 12:02:13.80 +100>,<MAYBRIDGE\NMR>,<NMR_250MHZ>,
      <Start of raw data processing
       ef LB = 0.3 FT_mod = 6 PKNL = 1 SI = 32K 
       data hash MD5: 32K
       EF 17 93 20 72 AC 88 42 57 7D 76 F4 B8 79 05 AA>)
(   3,<2005-07-15 12:02:15.64 +100>,<MAYBRIDGE\NMR>,<NMR_250MHZ>,
      <apk 
       data hash MD5: 32K
       BF B2 D7 36 66 DD 28 5D 64 C4 A5 5F A9 EE 38 66>)
(   4,<2005-07-15 12:02:16.39 +100>,<MAYBRIDGE\NMR>,<NMR_250MHZ>,
      <abs ABSG = 5 
       data hash MD5: 32K
       8A 3B A7 DD 4B 45 DC D8 3F 8F 21 FF 48 0F 5E B5>)
$$ ##END=
$$ 
$$ hash MD5
$$ 37 2C 34 3C 2E 75 C7 C1 38 3C DF D7 6D FA 6F CA
##$RELAX= 
##$RELAX= 
##$RELAX= 
##$RELAX= 
##$RELAX= 
##$RELAX= 
##$RELAX= 
$$ Bruker specific parameters
$$ --------------------------
##$DU= <C:\u>
##$EXPNO= 5910
##$NAME= <ADRS>
##$PROCNO= 1
##$TYPE= <nmr>
##$USER= <dgb>
##$AMP= (0..31)
100 100 100 100 100 100 100 100 100 100 100 100 100 100 100 100 100 100 
100 100 100 100 100 100 100 100 100 100 100 100 100 100 
##$AQSEQ= 0
##$AQ_mod= 3
##$AUNM= <au_zg>
##$AUTOPOS= <18 >
##$BF1= 250.13
##$BF2= 250.13
##$BF3= 250.13
##$BF4= 250.13
##$BF5= 500.13
##$BF6= 500.13
##$BF7= 500.13
##$BF8= 500.13
##$BYTORDA= 1
##$CFDGTYP= 0
##$CFRGTYP= 5
##$CHEMSTR= <none>
##$CNST= (0..31)
1 1 145 1 1 1 1 1 1 1 1 1 1 1 1 1 1 1 1 1 1 1 1 1 1 1 1 1 1 1 1 1 
##$CPDPRG= <>
##$CPDPRG1= <>
##$CPDPRG2= <>
##$CPDPRG3= <>
##$CPDPRG4= <mlev>
##$CPDPRG5= <mlev>
##$CPDPRG6= <mlev>
##$CPDPRG7= <mlev>
##$CPDPRG8= <mlev>
##$CPDPRGB= <>
##$CPDPRGT= <>
##$D= (0..31)
0 1 0 0 0 0 0 0 0 0.06 0 0 0 0 0 0 0.0002 0 0 0 0 0 0 0 0 0 0 0 0 0 0 
0 
##$DATE= 1121425320
##$DBL= (0..7)
120 120 120 120 120 120 120 120 
##$DBP= (0..7)
150 150 150 150 150 150 150 150 
##$DBP07= 0
##$DBPNAM0= <>
##$DBPNAM1= <>
##$DBPNAM2= <>
$$ [...]
##$SUBNAM7= <"">
##$SUBNAM8= <"">
##$SUBNAM9= <"">
##$SW= 20.6930455092707
##$SWIBOX= (0..15)
0 0 3 0 0 0 0 0 0 0 0 0 0 0 0 0 
##$SW_h= 5175.983436853
##$TD= 65536
##$TD0= 1
##$TE= 295.16
##$TE2= 300
##$TE3= 300
##$TEG= 300
##$TL= (0..7)
0 120 120 120 120 120 120 120 
##$TP= (0..7)
150 150 150 150 150 150 150 150 
##$TP07= 0
##$TPNAME0= <>
##$TPNAME1= <>
##$TPNAME2= <>
##$TPNAME3= <>
##$TPNAME4= <>
##$TPNAME5= <>
##$TPNAME6= <>
##$TPNAME7= <>
##$TPOAL= (0..7)
0.5 0.5 0.5 0.5 0.5 0.5 0.5 0.5 
##$TPOFFS= (0..7)
0 0 0 0 0 0 0 0 
##$TUNHIN= 0
##$TUNHOUT= 0
##$TUNXOUT= 0
##$USERA1= <user>
##$USERA2= <user>
##$USERA3= <user>
##$USERA4= <user>
##$USERA5= <user>
##$V9= 5
##$VALIST= <valist>
##$VCLIST= <CCCCCCCCCCCCCCC>
##$VD= 0
##$VDLIST= <DDDDDDDDDDDDDDD>
##$VPLIST= <PPPPPPPPPPPPPPP>
##$VTLIST= <TTTTTTTTTTTTTTT>
##$WBST= 1024
##$WBSW= 4
##$XGAIN= (0..3)
0 0 0 0 
##$XL= 0
##$YL= 0
##$YMAX_a= 391765
##$YMIN_a= -338018
##$ZGOPTNS= <>
##$ZL1= 120
##$ZL2= 120
##$ZL3= 120
##$ZL4= 120
##$ABSF1= 16.522
##$ABSF2= -4.171173
##$ABSG= 5
##$ABSL= 3
##$ALPHA= 0
##$AQORDER= 0
##$ASSFAC= 0
##$ASSFACI= 0
##$ASSFACX= 0
##$ASSWID= 0
##$AUNMP= <proc_1d>
##$AZFE= 0.1
##$AZFW= 0.1
##$BCFW= 0
##$BC_mod= 0
##$BYTORDP= 0
##$COROFFS= 0
##$CY= 12.5
##$DATMOD= 1
##$DC= 0
##$DFILT= <>
##$DTYPP= 0
##$F1P= 14.0000005364418
##$F2P= -0.99999901652339
##$FCOR= 0.5
##$FTSIZE= 32768
##$FT_mod= 6
##$GAMMA= 0
##$GB= 0
##$INTBC= 1
##$INTSCL= 1
##$ISEN= 128
##$LB= 0.3
##$LEV0= 0
##$LPBIN= 0
##$MAXI= 10000
##$MC2= 0
##$MEAN= 0
##$ME_mod= 0
##$MI= 0
##$NCOEF= 0
##$NC_proc= -4
##$NLEV= 6
##$NOISF1= 0
##$NOISF2= 0
##$NSP= 0
##$NTH_PI= 0
##$NZP= 0
##$OFFSET= 16.522
##$PC= 1
##$PHC0= -79.83724
##$PHC1= 4.714587
##$PH_mod= 1
##$PKNL= yes
##$PPARMOD= 0
##$PSCAL= 4
##$PSIGN= 0
##$REVERSE= no
##$SF= 250.13
##$SI= 32768
##$SIGF1= 0
##$SIGF2= 0
##$SINO= 400
##$SIOLD= 32768
##$SREGLST= <1H.CDCl3>
##$SSB= 0
##$STSI= 32768
##$STSR= 0
##$SW_p= 5175.98343685301
##$SYMM= 0
##$S_DEV= 0
##$TDeff= 65536
##$TDoff= 0
##$TI= <Analysis number 999999
Compound Code 99
Book Reference 9
Project Code 9>
##$TILT= no
##$TM1= 0
##$TM2= 0
##$TOPLEV= 0
##$USERP1= <user>
##$USERP2= <user>
##$USERP3= <user>
##$USERP4= <user>
##$USERP5= <user>
##$WDW= 1
##$XDIM= 32768
##$YMAX_p= 289241497
##$YMIN_p= -103161
$$ End of Bruker specific parameters
$$ ---------------------------------
##NTUPLES= NMR SPECTRUM
##VAR_NAME=  FREQUENCY,     SPECTRUM/REAL,   SPECTRUM/IMAG
##SYMBOL=    X,             R,               I
##VAR_TYPE=  INDEPENDENT,   DEPENDENT,       DEPENDENT
##VAR_FORM=  AFFN,          ASDF,            ASDF
##VAR_DIM=   32768,         32768,           32768
##UNITS=     HZ,            ARBITRARY UNITS, ARBITRARY UNITS
##FACTOR=    0.157963299565203, 1,           1
##FIRST=     4132.6476996994, 0,             0
##LAST=      -1043.33573715361, 0,           0
##MIN=       -1043.33573715361, -103161,     0
##MAX=       4132.6476996994, 289241497,     0
$$ Real data points
##PAGE= N=1
##DATA TABLE= (X++(R..R)), XYDATA
$$ [...]
28417A4335J5527r367J1387J2080l1696j0836K5129L2435j449q147o166p89l746
$$ 14335 29862 20495 31882 43962 12266 1430 26559 58994 57545 49398 43232 42443 38697
28404C8697j7638k3723j727N705J6561J34k4759K099J1902j6916L618J2720N124
$$ 38697 21059 -2664 -4391 1314 17875 18009 -6750 -4651 7251 -9665 -6047 6673 11797
28391A1797K484k202J5678M018K539K898P471r69j9360k1513N695J6513n559R110
$$ 11797 14281 12079 27757 31775 34314 37212 44683 43714 24354 2841 8536 25049 19490 28600
28377B8600k365j8914k8238k7162q647K4477J0072J2400Q563K3429J7129o403
$$ 28600 26235 7321 -20917 -48079 -56726 -32249 -22177 -9777 -1214 22215 39344 32941
28365C2941K240R391N936p691l0582k1862j3553J3575L2000j6988J8904p091K619
$$ 32941 35181 44572 50508 42817 12235 -9627 -23180 -9605 22395 5407 24311 17220 19839
28352A9839L01k7313N317J2712L216j3373j2173l006k5668J670R871l212J7825
$$ 19839 20140 -7173 -1856 10856 14072 699 -11474 -14480 -40148 -38478 -28607 -31819 -13994
28339a3994L963n625K3464J2726j7225k2539J6493P316J5613o885l811K7664k382
$$ -13994 -10031 -15656 7808 20534 3309 -19230 -2737 4579 20192 13307 9496 37160 34778
28326C4778k2759l355j0003L502L5876m221J4659k7792k1534J120p949l839J7748
$$ 34778 12019 8664 -1339 2163 38039 33818 48477 20685 -849 271 -7678 -11517 6231
28313F231p16k9180J769q957j6794K2043J6212J2551K339k2965r774O521K0329
$$ 6231 5515 -23665 -21896 -30853 -47647 -25604 -9392 3159 5498 -17467 -27241 -20720 -391
28300c91J3771j8536r383m174p495J1127p548J1945Q826J5816j3831P000O033
$$ -391 13380 -5156 -14539 -18713 -26208 -15081 -22629 -10684 -1858 13958 127 7127 13160
28287A3160j3594M155l124k0399J4377K3304n533J1202K1888r098l4388n743R442
$$ 13160 -434 3721 597 -19802 -5425 17879 12346 23548 45436 36338 1950 -3793 5649
28274E649K364k2178j9600J099O996Q290J2470p457J7594j6423J756k1462J6818
$$ 5649 8013 -14165 -33765 -32666 -25670 -17380 -4910 -12367 5227 -11196 -9440 -30902 -14084
28261a4084M614N060N290K9527k0678O633o569j8239J0808M710R13P930m361l299
$$ -14084 -9470 -4410 880 30407 9729 16362 9793 -8446 2362 7072 7985 15915 11554 8255
28247H255J775j1140J6275j080j6694j7922J0125J0491k169K1788J2488m211K924
$$ 8255 10030 -1110 15165 14085 -2609 -20531 -10406 85 -2084 19704 32192 27981 30905
28234C0905J1859k5740N764k0803j0934R937O860j868j7858k20m644n68L2429
$$ 30905 42764 17024 22788 1985 -8949 988 7848 5980 -11878 -12098 -16742 -17310 15119
28221A5119J4385j0923k9436m784n017J065n507k225j9916K2608K2017K4428j9186
$$ 15119 29504 18581 -10855 -15639 -20656 -19591 -25098 -27323 -47239 -24631 -2614 21814 2628
28208B628j979J4140P447r630m323J5542p738q561q429K535M233J192K7446K6999
$$ 2628 649 14789 22236 12606 8283 23825 16087 7526 -903 1632 5865 7057 34503 61502
28194F1502k4111j3859j1496n456l971r06j4318n686L210j9939J475J8009k466
$$ 61502 37391 23532 12036 6580 2609 1703 -12615 -18301 -15091 -35030 -33555 -15546 -18012
28181a8012k0978L558K0526K325N420L1J385l241j1066K4092K1916j0623L266
$$ -18012 -38990 -35432 -14906 -12581 -7161 -7130 -5745 -8986 -20052 4040 25956 15333 18599
28168A8599K0848j9623j956P829r475k0050J6403J8709k5814j5741K969J281m523
$$ 18599 39447 19824 17868 25697 16222 -3828 12575 31284 5470 -10271 -7302 -6021 -10544
28155a0544R634K0473P289j3383o620P902R71j2335P039P649o674j8663j961J6482
$$ -10544 -910 19563 26852 13469 6849 14751 15722 3387 10426 18075 11401 -7262 -9223 7259
28141G259k9447l0552J8672j3002M91K2416j0349l248K8081k4230r483J579L2115
$$ 7259 -22188 -52740 -34068 -47070 -46579 -24163 -34512 -37760 -9679 -33909 -43392 -41813 -9698
28128i698J8963k6345P700k7080l6092L9861K4864J6341J3171J6691j2573j601
$$ -9698 9265 -17080 -9380 -36460 -72552 -32691 -7827 8514 21685 38376 25803 24202
28116B4202l6286m6107j7045M8811L8932K7763O399n743k7699J1008J1356o277
$$ 24202 -12084 -58191 -75236 -26425 12507 40270 46669 40926 13227 24235 35591 29314
28104B9314n889j0765P986l453l0924r330M51K3768j0347j3775K273J5805o297
$$ 29314 23425 12660 20646 17193 -13731 -23061 -22610 1158 -9189 -22964 -20691 -4886 -11183
28091a1183O088j2416N211L198k3072J2361L5147M1000k3229j8397R471k2513
$$ -11183 -5095 -17511 -12300 -9102 -32174 -19813 15334 56334 33105 14708 24179 1666
28079A666p488j878J803J6753j5779L301J8252q315r228k6173r447o096J2546
$$ 1666 -5822 -7700 -5897 10856 -4923 -1622 16630 8315 -913 -27086 -36533 -42629 -30083
28066c0083M117Q717J7705J6045O705Q893J4368j6217P475N502k4175N732Q64
$$ -30083 -25966 -17249 456 16501 23206 32099 46467 30250 37725 43227 19052 24784 25648
28053B5648j2037k937j2865K4358r063p928o24l925P301L139j3706J7783J2874
$$ 25648 13611 10674 -2191 22167 13104 5176 4552 627 7928 11067 -2639 15144 28018
28040B8018Q72p100J0967J2123j9989n450j4325l569O361k0723K4104j1525k3849
$$ 28018 28890 21790 32757 44880 24891 19441 5116 1547 7908 -12815 11289 -236 -24085
28027b4085K6299L0429j7169j7988m929J3953J6685K251Q927Q320L7134J1990
$$ -24085 2214 32643 15474 -2514 -7443 6510 23195 25446 34373 42693 79827 91817
28015I1817l4119O032O382k5670j9809n686k4143k9297j3712q545L6459M3163
$$ 91817 57698 63730 70112 44442 24633 18947 -5196 -34493 -48205 -56750 -20291 22872
28003B2872J4532J2240O394j2553j1558k7962R093N468P715j817J9593J8287j4935
$$ 22872 37404 49644 56038 43485 31927 3965 13058 18526 26241 24424 44017 62304 47369
27990D7369l3521j2825j8621K1193q180k6792n579K1033K7391o690J1499N236
$$ 47369 13848 1023 -17598 3595 -4585 -31377 -36956 -15923 11468 4778 16277 21513
27978B1513q406O034k0650R188r566K4072J6077K285n438q181K877k5736l4083
$$ 21513 13107 19141 -1509 7679 -1887 22185 38262 40547 35109 26928 29805 4069 -30014
27965c0014K3292K1789k439M852k7521p470j4792J0984J6649K3201J1968K040
$$ -30014 -6722 15067 12628 17480 -10041 -17511 -32303 -21319 -4670 18531 30499 32539
27953C2539P832R29k1308r405l3n568j517L178p745L4283o295j4848k0648R678
$$ 32539 40371 41300 19992 10587 10554 4986 3469 6647 -1098 33185 26890 12042 -8606 1072
27939A072L780j5320p639O408k994m675N022L21l024R786K1840j2936j894k141
$$ 1072 4852 -10468 -18107 -11699 -14693 -19368 -14346 -14025 -17049 -7263 14577 1641 -253 -2394
27925b394n680j4853K8120m407L024J9276N251k6016k6076j2327O792j1380J7462
$$ -2394 -8074 -22927 5193 786 3810 23086 28337 2321 -23755 -36082 -29290 -40670 -23208
27912b3208J9817k2203j3947J1397K8638K083l56j0524J2265L067N707j8320k8365
$$ -23208 -3391 -25594 -39541 -28144 494 2577 2221 -8303 3962 7029 12736 -5584 -33949
27899c3949j3297J6030M4962k664K684j612p586j1564j3321L633J7039J5060J4153
$$ -33949 -47246 -31216 13746 11082 13766 12154 4568 -6996 -20317 -16684 355 15415 29568
27886B9568l773j0806j3851K2197Q256O99j2995k7803j9838j0442K3258J1669
$$ 29568 25795 14989 1138 23335 31591 32290 19295 -8508 -28346 -38788 -15530 -3861
27874c861j7585Q343J8260N159m214o358j5715R27K4479o336P942K101p279k115
$$ -3861 -21446 -13103 5157 10316 6102 -256 -15971 -15044 9435 3099 11041 13142 5863 3748
27860C748m099M895L678O202p810r517j4190R505J7934j0550l0149j2903K0089
$$ 3748 -351 4544 8222 14424 6614 -2903 -17093 -7588 10346 -204 -30353 -43256 -23167
27847b3167L5113j877K749q615j0105k1883p338J9007j4688K2060J3855j3957
$$ -23167 11946 10069 12818 4203 -5902 -27785 -35123 -16116 -30804 -8744 5111 -8846
27835h846K8063L634j4852j6568J5161J9282J2309r908l117R182l5842k9006J5481
$$ -8846 19217 22851 7999 -8569 6592 25874 38183 28275 25158 34340 -1502 -30508 -15027
27822a5027J9613K719k7629j0566J1506Q412k3080L4742J6619J1913j0063k2020
$$ -15027 4586 7305 -20324 -30890 -19384 -10972 -34052 690 17309 29222 19159 -2861
27810b861k529j3342K817m435J4907r314m970L373K3441j0644k3454k557K0026
$$ -2861 -5390 -18732 -15915 -20350 -5443 -14757 -19727 -16354 7087 -3557 -27011 -29568 -9542
27797i542J8280m271j7218P459J8668M348o16m908j3477R748J1921K0569K4160
$$ -9542 8738 4467 -12751 -5292 13376 17724 17108 12200 -1277 8471 20392 40961 65121
27784F5121j9958j9281j1682j2308r3L3705K7244k0913k2219j4697N990q702j5615
$$ 65121 45163 25882 14200 1892 1799 35504 62748 41835 19616 4919 10909 2207 -13408
27771a3408l05L2139K6007l7466j3659J2827Q840L842j4730q753L1491J3598k5068
$$ -13408 -13713 18426 44433 6967 -6692 6135 14975 18817 4087 -4666 26825 40423 15355
27758A5355J0783o592j5290r40K5915O088l1611n232K3344J3130j3233j6445O673
$$ 15355 26138 19546 4256 3316 29231 35319 3708 -1524 21820 34950 21717 5272 11945
27745A1945L151k3495r956j3793j5035O677Q666m326p370K9181K2706k2150l1907
$$ 11945 15096 -8399 -18355 -32148 -47183 -40506 -31840 -36166 -43536 -14355 8351 -13799 -45706
27732d5706P058K6262n255o989O019K158L519K2743N106m1390q544J3357K4277
$$ -45706 -38648 -12386 -17641 -24630 -18611 -16453 -12934 9809 14915 -26475 -35019 -21662 2615
27719B615M271j2389n715K2160J4747j5504k7102K368K9966O339k9932m848M6454
$$ 2615 6886 -5503 -11218 10942 25689 10185 -16917 -14549 15417 21756 -8176 -13024 33430
27706C3430K2089j8321j4203J531k3387j8346L1847O347o470L267k2275k5120
$$ 33430 55519 37198 22995 24526 1139 -17207 14640 20987 14517 17784 -4491 -29611
27694b9611O782M0793L54j1791k8046m099M59j5983r025M225k7981J2425J0984
$$ -29611 -22829 17964 18318 6527 -21519 -25618 -25159 -41142 -50167 -45942 -73923 -61498 -50514
27681e0514J1356j3576n942J8716M0103j5200M840K5625j8057N932K3289j5450
$$ -50514 -39158 -52734 -58676 -39960 143 -15057 -10217 15408 -2649 3283 26572 11122
27669A1122j2255p004J1968J3960J9517j3592l6346k9644O315k71p826J0826K9789
$$ 11122 -1133 -8137 3831 17791 37308 23716 -12630 -42274 -35959 -36230 -44056 -33230 -3441
27656c441J5531K6731K8580j0068l1829j8492k5793l560n790r612J2054L4427
$$ -3441 12090 38821 67401 57333 25504 7012 -18781 -22341 -28131 -37743 -25689 8738
27644H738K5725j4381k2646l0604L243J9510J6474j5164k331j945j028j4850L537
$$ 8738 34463 20082 -2564 -33168 -29925 -10415 6059 -9105 -11436 -13381 -14409 -29259 -25722
27631b5722L283q319P544J6801J4482L0480j3850k1570L2K3609J4717o544j519
$$ -25722 -22439 -30758 -23214 -6413 8069 38549 24699 3129 3161 26770 41487 34943 33424
27618C3424j3896l8676K785K7454p080o748P816J1333K811m035m1297M451J6018
$$ 33424 19528 -19148 -16363 11091 4011 -2737 5079 16412 19223 15188 -26109 -21658 -5640
27605e640r093l367J4209Q179j4971k491m971n503l414J7230M000J6401L8215
$$ -5640 -14733 -18100 -3891 4288 -10683 -13174 -18145 -23648 -27062 -9832 -5832 10569 48784
27592D8784l2359k9006j5410n110n640J139L7217j1884j3115o300J4306J0154
$$ 48784 16425 -12581 -27991 -33101 -38741 -37602 -385 -12269 -25384 -31684 -17378 -7224
27580g224m699n723L29N808J3556L0730L971m62k4992O068K1876k0114m522m922
$$ -7224 -11923 -17646 -17317 -11509 2047 32777 36748 36286 11294 17362 39238 19124 14602 9680
27566I680J5930j0813j5244j2327J5571J0302j5437M066N841K412r3l7136l3515
$$ 9680 25610 14797 -447 -12774 2797 13099 -2338 1728 7569 9981 9888 -27248 -60763
27553f0763M126K2819N628J2744J0262k3740J5798K6247L505j4630l4936K078
$$ -60763 -56637 -33818 -28190 -15446 -5184 -28924 -13126 13121 16626 1996 -32940 -30862
27541c0862k9084k132N236j394P176K5762M498j6701j9415L0223L2408R507j2197
$$ -30862 -59946 -62078 -56842 -58236 -51060 -25298 -20800 -37501 -56916 -26693 5715 15222 3025
27528C025l6450j250J8535m262J1207l090j8727m169J7525k3691P704K2544L269
$$ 3025 -33425 -34675 -16140 -20402 -9195 -12285 -31012 -35181 -17656 -41347 -33643 -11099 -7830
27515g830K4090L0041L897j6467j9758n555K0413L950j7881k1740o427N184K4908
$$ -7830 16260 46301 50198 33731 13973 8418 28831 32781 14900 -6840 -13267 -8083 16825
27502A6825k3847l986J4949J8254r01j1146n66K1767k154o474k8207j3674J7161
$$ 16825 -7022 -11008 3941 22195 21294 10148 9582 31349 29195 22721 -5486 -19160 -1999
27489a999L2771K0563j2501l8972j4594j9038r703J6013N813L542J5787r2k024
$$ -1999 30772 51335 38834 -138 -14732 -33770 -43473 -27460 -21647 -18105 -2318 -2410 -4434
27476d434J3198J8813K3q287m083q23r006K7965J794l62r715n943P917q526r645
$$ -4434 8764 27577 27600 19313 15230 14407 5401 33366 35160 34798 25083 19140 27057 18531 8886
27461H886L251P204j59m738l1123j5384j0053J1817J3458j1947M832p18N520N421
$$ 8886 12137 19341 19182 14444 -16679 -32063 -42116 -30299 -16841 -28788 -23956 -24674 -19154 -13733
27447a3733J546P408j8952n57J4707J0539J0116J9582L245j5125P386k7182j5800
$$ -13733 -12187 -4779 -23731 -24288 -9581 958 11074 30656 33901 18776 26162 -1020 -16820
27434a6820P013P777k7500j5303J5068M0413M5393j4966l8473L568L2455n695
$$ -16820 -9807 -2030 -29530 -44833 -29765 10648 56041 41075 2602 6170 38625 32930
27422C2930r943k572j5586m63p193j1589j0343K7464K5515k6087k251K1764P812
$$ 32930 22987 20415 4829 4366 -2827 -14416 -24759 2705 28220 2133 -118 21646 29458
27409B9458l681J373j3756j9940k937P420J0318N220j2266J6937K2287L58q276
$$ 29458 25777 27150 13394 -6546 -9483 -2063 8255 13475 1209 18146 40433 40791 32515
27396C2515l429k0853K9078m479j5605l7902r975K1137n436J582J9829l240j160
$$ 32515 29086 8233 37311 32832 17227 -20675 -30650 -9513 -14949 -13367 6462 3222 2062
27383B062K07p062r94M007j7205J6660J4454J3500n296p255o749k4760L224o299
$$ 2062 2269 -4793 -5787 -1780 -18985 -2325 12129 25629 20333 13078 6329 -18431 -15207 -21506
27369b1506R486k690K1768j354j1288k1922L046J2373J2946J4723j8422O705k3470
$$ -21506 -12020 -14710 7058 5704 -5584 -27506 -24460 -12087 859 15582 -2840 3865 -19605
27356a9605l133J7401q345p106l413k035m512j3355J5073J1051j0751Q12K9050
$$ -19605 -22738 -5337 -13682 -20788 -24201 -26236 -30748 -44103 -29030 -17979 -28730 -27918 1132
27343A132M0K8339J2247M946o606l5353j3902M520J947J1402J804J4192q385J2653
$$ 1132 1172 29511 41758 46704 40098 4745 -9157 -4637 -2690 8712 10516 24708 16323 28976
27329B8976Q945k4320j6867J5220J4578J4274q582J0110M578p158l6755l3753
$$ 28976 37921 13601 -3266 11954 26532 40806 32224 42334 46912 39754 2999 -30754
27317c0754m046K5789N225m352O677N696j2556j2960N318K8314R70j4300k49K3883
$$ -30754 -34800 -9011 -3786 -8138 -1461 4235 -8321 -21281 -15963 12351 13321 -979 -1228 22655
27303B2655L823r857M680k1778j7858J9330M638o933J2522P496j7533j8770k90
$$ 22655 26478 16621 21301 -477 -18335 995 5633 -1300 11222 18718 1185 -17585 -17875
27290a7875o814m51J2307J1797k613K2819J9950j4009J0308Q418k8065p905o707
$$ -17875 -24689 -25140 -12833 -1036 -3649 19170 39120 25111 35419 43837 15772 7867 1160
27277A160j5064j3713J5261j6849o074R054M0368N515l2126j2400J2432N099j3828
$$ 1160 -13904 -27617 -12356 -29205 -35279 -26225 14143 19658 -12468 -24868 -12436 -7337 -21165
27264b1165R533J1114K2309J2136J0384r191j8870k3000K1930j232N625j0544
$$ -21165 -11632 -518 21791 33927 44311 35120 16250 -6750 15180 13948 19573 9029
27252I029p522m884l730l447L28L0205p1m9345l0262J159K3202j329o920l691
$$ 9029 1507 -3377 -7107 -10554 -10226 19979 19908 -29437 -59699 -58540 -35338 -36667 -43587 -47278
27238d7278L9413P653p9J3418l90o74J7893j9050j0281j528K726J7248K6682J0735
$$ -47278 -7865 -212 -291 13127 12737 12063 29956 10906 625 -903 1823 19071 45753 56488
27224E6488j5626j4887m9979q363k0393K4449K5064l92l1499j9975J932K4778
$$ 56488 40862 25975 -24004 -32367 -52760 -28311 -3247 -3639 -35138 -55113 -53181 -28403
27212b8403j2242K0037q806J6965K2537o942j1765O041j2408m494M88j4572J1281
$$ -28403 -40645 -20608 -29414 -12449 10088 3146 -8619 -2578 -14986 -19480 -18992 -33564 -22283
27199b2283L827K1229J2323j3399j1855K3364K1389k875L691M053j1788r412k96
$$ -22283 -18456 2773 15096 1697 -10158 13206 34595 31720 35411 39464 27676 18264 17968
27186A7968q51j5493P302r079p263k3942j4494J0387K3709K1143J9463J1724J1977
$$ 17968 17117 1624 8926 -153 -7416 -31358 -45852 -35465 -11756 9387 28850 40574 52551
27173E2551K097k1621j8794K936J7084r007k1201j0795J6020K1140Q112j2529
$$ 52551 54648 33027 14233 17169 34253 25246 4045 -6750 9270 30410 38522 25993
27161B5993m703k4438j937k4213J1516R084J5404k2123J0107J5203k4190m592
$$ 25993 21290 -3148 -5085 -29298 -17782 -8698 6706 -15417 -5310 9893 -14297 -18889
27149a8889K4724R950j8274J255J6695j2650p554J6866L4374j1398o293m061P817
$$ -18889 5835 15785 -2489 -1234 15461 2811 -4743 12123 46497 35099 28806 24745 32562
27136C2562l213O368J0223j5625q048m42n293j5464J691q956k339Q575k816k2531
$$ 32562 29349 35717 45940 30315 22267 21825 16532 1068 2759 -6197 -8536 39 -2777 -25308
27122b5308J5072K968j9183j041M543k0226R308R338k4404R564L3681Q856k218
$$ -25308 -10236 -7268 -26451 -27492 -22949 -43175 -33867 -24529 -48933 -39369 -5688 3168 950
27109I50p649L533k5081Q653J988j1086k4370K0843M504L893J7337j720r189N283
$$ 950 -6699 -3166 -28247 -19594 -17606 -28692 -53062 -32219 -27715 -23822 -6485 -8205 -17394 -12111
27095a2111P706O915q695j6379J979j8685M385L2490M293j1609R206J4365K659
$$ -12111 -4405 2510 -6185 -22564 -20585 -39270 -34885 -2395 1898 -9711 -505 13860 16519
27082A6519q432p018k2845j5487m92P892m212j0656J0517J0641N190M140q543
$$ 16519 8087 1069 -21776 -37263 -37755 -29863 -34075 -44731 -34214 -23573 -18383 -14243 -22786
27069b2786P02K8176M1433J63k8073j1036r650L2909J0510l4956j0805K6261K6393
$$ -22786 -22084 6092 47525 47688 19615 8579 -1071 31838 42348 7392 -3413 22848 49241
27056D9241m416k1222p870L175n576P644q003k5509j4827L3874K4899j481m182
$$ 49241 44825 23603 15733 18908 13332 20976 12973 -12536 -27363 6511 31410 29929 25747
27043B5747K189j9937l3632j5855Q2J3909O39J0727Q515L235R662N929J5073r166
$$ 25747 27936 7999 -25633 -41488 -41406 -27497 -26858 -16131 -7616 -4381 5281 11210 26283 17117
27029A7117j6875j3917j3397R577l4914J8699K2542r58M226J7264j8935j3193
$$ 17117 242 -13675 -27072 -17495 -52409 -33710 -11168 -12126 -7900 9364 -9571 -22764
27017b2764J3889K4592J0690k701j4521k188j3673j1605K5283R395k3212O381
$$ -22764 -8875 15717 26407 23706 9185 6997 -6676 -18281 7002 16397 -6815 -434
27005d34K8063L0347j3863k2737J6901k1225k4801K171j1800K8878J379J5261
$$ -434 27629 57976 44113 21376 38277 17052 -7749 -5578 -17378 11500 12879 28140
26993B8140M39O52J8616k0762j9498L4432Q0q770k1852J752J1982r315j7184j4591
$$ 28140 28579 29231 47847 27085 7587 42019 42099 33329 11477 13229 25211 15896 -1288 -15879
26979a5879o267J5041K8988j2895j2872r636j2121j7616j077L0124K5430N657
$$ -15879 -22146 -7105 21883 8988 -3884 -13520 -25641 -43257 -44334 -14210 11220 16877
26967A6877M915j1749p445p481K936m601j400J2284j170j7771j0560k5338K5146
$$ 16877 21792 10043 2598 -4883 -1947 -6548 -7948 4336 3166 -14605 -25165 -50503 -25357
26954b5357M1052N959j2954j7149o689k2474P341K2231K2631J1283P806Q386M95
$$ -25357 15695 21654 8700 -8449 -15138 -37612 -30271 -8040 14591 25874 33680 42066 42561
26941D2561Q18J2016J132j636O111k0795N67l1756j7778K8088r16J862J3168j8156
$$ 42561 43379 55395 56527 54891 61002 40207 40774 9018 -8760 19328 18412 20274 33442 15286
26927A5286q531j74j4475K099O067j0866J6711J2005L463j9103m1146O235K197
$$ 15286 6755 6581 -7894 -5795 272 -10594 6117 18122 21585 2482 -38664 -32429 -30232
26914c0232J2101K8509j7627k670R949k960j3542K5966r435J532R853M460k3723
$$ -30232 -18131 10378 -7249 -9919 30 -2930 -16472 9494 59 1591 11444 15904 -7819
26901g819n705J0976L660k2783O15q025j5132J2251M2274Q115O080R414J2065
$$ -7819 -13524 -2548 1112 -21671 -21056 -29081 -44213 -31962 10312 18427 24507 33921 45986
26888D5986j7726k8904k1672j2952J2243J6585j059p612m800M3494J7419j7026
$$ 45986 28260 -644 -22316 -35268 -23025 -6440 -7499 -15111 -19911 23583 41002 23976
26876B3976k723K0176p426k6861k6892j8078K3779J0261n006j2654Q136P034N0675
$$ 23976 21253 41429 34003 7142 -19750 -37828 -14049 -3788 -8794 -21448 -13312 -6278 44397
26863D4397J3148j0752R188P697l5778j4476n486j3069p078p589j2849R88L8904
$$ 44397 57545 46793 55981 63678 27900 13424 7938 -5131 -12209 -19798 -32647 -31659 7245
26850G245J6282r553j3517p051n801l3309N834P63L8592J3204m372n612m19k337
$$ 7245 23527 13974 457 -6594 -12395 -45704 -39870 -39107 -515 12689 8317 2705 2286 -51
26836e1j1966K459m697j5469k275J412O436l994j4104J3862L4606j46k7051m302
$$ -51 -12017 -9558 -14255 -29724 -31999 -30587 -24151 -28145 -42249 -28387 6219 6073 -20978 -25280
26822b5280J6247K6044N765J8192R601q205r374q112J0588J0418k1141j9475K603
$$ -25280 -9033 17011 22776 40968 50569 42364 32990 24878 35466 45884 24743 5268 7871
26809G871N18J0091j5716J7542J7730J7962q264l3332k1540n993n532J609l72
$$ 7871 8389 18480 2764 20306 38036 55998 47734 14402 -7138 -13131 -18663 -17054 -17426
26796a7426j0410J0450N1676j675k4570L199K616k9794j650K976n172j0809O239
$$ -17426 -27836 -17386 34290 32615 8045 11244 13860 -15934 -17584 -14608 -19780 -30589 -24350
26783b4350J1814J3955K9947k5256l2786P670J0329j7972k4558j4153J7123J9863
$$ -24350 -12536 1419 31366 6110 -26676 -19006 -8677 -26649 -51207 -65360 -48237 -28374
26771b8374j670P998J916J7469K247k4164n737l0225J5503N6331L1792j9576j8674
$$ -28374 -30044 -22046 -20130 -2661 -414 -24578 -30315 -60540 -45037 11294 43086 23510 4836
26758D836j7073J2041J0428L032K6734L778m0499K419M0244J6268l5575m7520
$$ 4836 -12237 -196 10232 13264 39998 43776 3277 5696 45940 62208 26633 -20887
26746b0887l1894k454j4513J8737K2143J6229l057J6074k1619j2420L3322J4273
$$ -20887 -52781 -55235 -69748 -51011 -28868 -12639 -15696 378 -21241 -33661 -339 13934
26734A3934m378k2524j5663l748K744J6812K218K2624q83j3948j7730j0511J8885
$$ 13934 9556 -12968 -28631 -32379 -29635 -12823 -10605 12019 11136 -2812 -20542 -31053 -12168
26721a2168K0498K4110j3953k0646K247J6343M79p889k9105J732J1197J4079k889
$$ -12168 8330 32440 18487 -2159 88 16431 16910 9021 -20084 -18352 -7155 6924 4035
26708D035m830j6008n049K601K7625L8914j1479l9726j1192M909L706J7826K3589
$$ 4035 -795 -16803 -21852 -19251 8374 47288 35809 -3917 -15109 -10200 -6494 11332 34921
26695C4921k2759N293j7900j2535O955j1241P58J8486n959O047N66jJ5810J0449
$$ 34921 12162 17455 -445 -12980 -6025 -17266 -16508 1978 -3981 2066 2632 2631 18441 28890
26681B8890k4362k1387J586j2445k6480J1925K8640L786j0612o878P647L963o284
$$ 28890 4528 -16859 -15273 -27718 -54198 -42273 -13633 -9847 -20459 -27337 -19690 -15727 -22011
26668b2011k9501J7030K1942J3550j9566r271O339j0845J1267L4294p481Q455
$$ -22011 -51512 -34482 -12540 1010 -18556 -27827 -21488 -32333 -21066 13228 5747 14202
26656A4202N004j9171l5836k4603J5264J0376J1315N845l860J3687q34j1428N471
$$ 14202 19206 35 -35801 -60404 -45140 -34764 -23449 -17604 -21464 -7777 -8611 -20039 -14568
26643a4568L2496J5368l101N548j2641k4741M948J8898j6190j3670L581K7275
$$ -14568 17928 33296 30195 35743 23102 -1639 3309 22207 6017 -7653 -4072 23203
26631B3203N077o316M813j8362j8635K6805J3711Q832m949j5260j9266j2584k649
$$ 23203 28280 21964 26777 8415 -10220 16585 30296 39128 34179 18919 -347 -12931 -15580
26618a5580k0504p335j3853L298L0419K4298j3389q374J3227j4178j022K3408
$$ -15580 -36084 -43419 -57272 -53974 -23555 743 -12646 -21020 -7793 -21971 -22993 415
26606D15J5683K1029K13j2369l762K723o78j4376J4419Q033j8304j3784L607m706
$$ 415 16098 37127 37340 24971 21209 23932 23254 8878 23297 31330 13026 -758 2849 -1857
26592a857l398m297L3193M5398l652m1138l7101m40K6721J5496J1402k325j3074
$$ -1857 -5255 -9552 23641 69039 65387 24249 -12852 -13292 13429 28925 40327 38002 24928
26579B4928M015j2979k8207k3202K752J4941L7472n555J55N061L8804m4181k1400
$$ 24928 28943 15964 -12243 -35445 -32693 -17752 19720 14165 14320 19381 58185 14004 -7396
26566g396K2419l526K716J881J313j4076k1805j2554P23J4637m186J266Q835L594
$$ -7396 15023 11497 14213 16094 17407 3331 -18474 -31028 -30305 -15668 -19854 -18588 -9753 -6159
26552f159J0397k831l0474K3022J1815N403k531L145P195k6093k3962L4052J5250
$$ -6159 4238 1407 -29067 -6045 5770 11173 8642 11787 18982 -7111 -31073 2979 18229
26539A8229o744J3381O435l0844l0522J7407j4895j3134k006J3543L7758J4619
$$ 18229 11485 24866 31301 457 -30065 -12658 -27553 -40687 -42693 -29150 8608 23227
26527B3227k1462J6832q090j1899J402j149J363j6943m532L5395J3683j7434k6112
$$ 23227 1765 18597 10507 -1392 10 -1139 224 -16719 -21251 14144 27827 10393 -15719
26514a5719j5186o732k195Q463J6803N301o517r005l802J1766j2174j235K148
$$ -15719 -30905 -37637 -39832 -31369 -14566 -9265 -15782 -24787 -28589 -16823 -28997 -30232 -28084
26501b8084O177L8132J0550K013l616m419k343p192K3496n570j3531j3827j2899
$$ -28084 -21907 16225 26775 28788 25172 20753 18410 11218 34714 29144 15613 1786 -11113
26488a1113r994K5389L5228j8178J2301K6953j6237j1563J5014J3407l6754K755
$$ -11113 -21107 4282 39510 21332 33633 60586 44349 32786 47800 61207 24453 27208
26476B7208k4460l7752J4615L7385k822K326O103J2767J62j8453K73K584k6648
$$ 27208 2748 -35004 -20389 16996 14174 16500 22603 35370 35532 17079 17352 19936 -6712
26463f712j7880J86J0232M829J3429J7959m078k5045r867O060j5402P984J1392
$$ -6712 -24592 -24406 -14174 -9345 4084 22043 17965 -7080 -16947 -10887 -26289 -18305 -6913
26450f913K5808J7888J226j8431p585j3822n629J3994j524P15j7870k033J8055
$$ -6913 18895 36783 38009 19578 11993 -1829 -7458 6536 5012 5727 -12143 -14176 3879
26437C879R473P947j977j4803j5168j1411j0702l122R495K222k208k6368j0203
$$ 3879 13352 21299 19322 4519 -10649 -22060 -32762 -35884 -26389 -24167 -26375 -52743 -62946
26424f2946K0317L440J1358L663l4275m993J3464K2562K1624k6076r286J534K6788
$$ -62946 -42629 -39189 -27831 -24168 -58443 -63436 -49972 -27410 -5786 -31862 -41148 -39614 -12826
26411a2826K7329j9525k3210l745j3810K6039K4834K2115q293J2777K3485K582
$$ -12826 14503 -5022 -28232 -31977 -45787 -19748 5086 27201 18908 31685 55170 57752
26399E7752j3291k5276k3110q087K0376O142l1382l4617j6347K6178J0196N599
$$ 57752 44461 19185 -3925 -12012 8364 14506 -16876 -51493 -67840 -41662 -31466 -25867
26387b5867J6575j1045n655K5546L1644J530j1735j7403k9004m757O277J0545
$$ -25867 -9292 -20337 -25992 -446 31198 32728 20993 3590 -25414 -30171 -23894 -13349
26375a3349L2597M3287J847j6849l3360m1349k2420K2292j898r516J7346L2710
$$ -13349 19248 62535 64382 47533 14173 -27176 -49596 -27304 -29202 -38718 -21372 11338
26363A1338K5002R007J3941M568k2210m8188k5402K9861M2529J6319j2305j6876
$$ 11338 36340 45347 59288 63856 41646 -6542 -31944 -2083 40446 56765 44460 27584
26351B7584o541n081k0j683j5130k424J3386l180r413j0951L2899K1962k2543
$$ 27584 21043 15962 15942 14259 -871 -3295 10091 6911 -2502 -13453 19446 41408 18865
26338A8865j0930k0941k0944k5760k693K4169p477j835K5349r490K3572M884r833
$$ 18865 7935 -13006 -33950 -59710 -62403 -38234 -45711 -47546 -22197 -31687 -8115 -3231 -13064
26325a3064j9983j1615M449l7576N666K8856J8769K444r780J281O408P900J2695
$$ -13064 -33047 -44662 -40213 -77789 -72123 -43267 -24498 -22054 -31834 -30553 -24145 -16245 -3550
26312c550K9327j2962j7558J654k5343R952K1257J6745o862r926K484M503K876
$$ -3550 25777 12815 -4743 -3089 -28432 -18480 2777 19522 12660 2734 5218 9721 12597
26299A2597n106k6108j448M0696R655M800l9360l1038j5384N767L1371L4448J1876
$$ 12597 7491 -18617 -20065 20631 30286 35086 -4274 -35312 -50696 -44929 -13558 20890 32766
26286C2766R137j6627m4184m1332l740K0657j054J2341O549p52M4635K6826L1961
$$ 32766 41903 25276 -18908 -60240 -63980 -43323 -44377 -32036 -25487 -26239 18396 45222 77183
26273G7183k6764l7669j809J5229L50j1964k789J9138O965J4165k5260k5082j259
$$ 77183 50419 12750 10941 26170 26520 14556 11767 30905 37870 52035 26775 1693 434
26260D34J6610o871j3039p422J5164J3399J0418p774Q155J4200n605J4784j9256
$$ 434 17044 10173 -2866 -10288 4876 18275 28693 20919 29074 43274 37669 52453 33197
26247C3197o655K0186n904j8896j5525J3447j143m448k8046K8228K8847J3800
$$ 33197 26542 46728 40824 21928 6403 19850 18707 14259 -13787 14441 43288 57088
26235E7088l1228k7365j0938k7532K0373J7133l400M640j1911q808k345j6705
$$ 57088 25860 -1505 -12443 -39975 -19602 -2469 -5869 -1229 -13140 -21948 -24293 -40998
26223d0998j3402L6650K093l0185J9123K7661N997L2316Q579m417j6443Q049O557
$$ -40998 -54400 -17750 -15657 -45842 -26719 942 6939 39255 47834 43417 26974 35023 41580
26210D1580l862p189J0207J7374j7959k2462l242K491K0039j2094k1123l9051
$$ 41580 37718 30529 40736 58110 40151 17689 14447 16938 36977 24883 3760 -35291
26198c5291Q52k2874j513O161K1183J5326j419J629M95J0252J2164l398l2925
$$ -35291 -34439 -57313 -58826 -52665 -31482 -16156 -17575 -15946 -15451 -5199 6965 3567 -29358
26185b9358k0286L0726P352q38K4457K0524Q34j2378k0169j9469Q195M0609J2993
$$ -29358 -49644 -18918 -11566 -12404 12053 32577 33411 21033 864 -18605 -10410 30199 43192
26172D3192p123n1317k47J1366j0897P17J6595n478L856k052k551Q046l425j349
$$ 43192 36069 -15248 -15495 -4129 -15026 -14309 2286 -3192 664 -1388 -3939 4107 682 -667
26158f67r884J8358n723j5972R569K906k614l145o847J7529p213k1403K0751J8948
$$ -667 -10551 7807 2084 -13888 -4319 -1413 -4027 -7172 -14019 3510 -3703 -25106 -4355 14593
26144A4593k4975O47K333r117N735R258p85K874J0061j2016J4122K9904p593k805
$$ 14593 -10382 -9735 -7402 -16519 -10784 -1526 -2311 563 10624 -1392 12730 42634 35041 32236
26130C2236M261k5462k4745j1190J7475J5793K5203n204j3508k8411j3844J2303
$$ 32236 36497 11035 -13710 -24900 -7425 8368 33571 28367 14859 -13552 -27396 -15093
26118a5093O767J0762J7565L0992k366k0943M049K0125Q568j571j3459l2497n056
$$ -15093 -8326 2436 20001 50993 48627 27684 31733 51858 60426 58855 45396 12899 7843
26105G843k4783L109M762j2878M766m96l656J2276L413K4619J2372m673k5892
$$ 7843 -16940 -13831 -9069 -21947 -17181 -17677 -21333 -9057 -5644 18975 31347 26674 782
26092G82j2498l001q732L7389J4215j6233P400K8316j5847l930J2278j0355n061
$$ 782 -11716 -14717 -23449 13940 28155 11922 19322 47638 31791 27861 40139 29784 24723
26079B4723j6773R34n925O158J8084J0899j5712j7030k4300j4412j387O572K4505
$$ 24723 7950 8884 2959 9117 27201 38100 22388 5358 -18942 -33354 -34741 -28169 -3664
26066c664p270k9223k9323n824L5464K4721j396K2626J9671O662k3917j5857K4067
$$ -3664 -10934 -40157 -69480 -75304 -39840 -15119 -16515 6111 25782 32444 8527 -7330 16737
26053A6737j0632j9317J478l303k2186m102K8557N806L0447K0200j0670j0816
$$ 16737 6105 -13212 -11734 -15037 -37223 -41325 -12768 -6962 23485 43685 33015 22199
26041B2199k5843k0729j5560l352J7875j6095j6216L78N025M920O993r877J3968
$$ 22199 -3644 -24373 -39933 -43285 -25410 -41505 -57721 -57343 -52318 -47398 -40405 -50282 -36314
26028c6314j2078K3009J5881k422l55n673J3712P907m3889p283J8827k6866m0395
$$ -36314 -48392 -25383 -9502 -11924 -12279 -17952 -4240 3667 -40222 -47505 -28678 -55544 -95939
26015i5939L3093K8896K8951J6707j0603k9385m098K2686l438j8315J3896R497
$$ -95939 -62846 -33950 -4999 11708 1105 -28280 -32378 -9692 -13130 -31445 -17549 -8052
26003h052O449j3707n992j748J6117M7558R773m1286j9453m28p99J0196m513l63
$$ -8052 -1603 -15310 -21302 -23050 -6933 40625 50398 9112 -10341 -10769 -11568 -1372 -5885 -6248
25989f248Q34R561J6123j2287j5486j566O197J6062r178p311k504m423l90j2730
$$ -6248 -5414 4147 20270 7983 -7503 -9069 -2872 13190 4012 -3299 -5803 -10226 -10616 -23346
25975b3346m757J0910j2237K4805K2707j7565P230J7156O745J2495J3595k4367
$$ -23346 -28103 -17193 -29430 -4625 18082 517 7747 24903 31648 44143 57738 33371
25963C3371j6110K22n683J3007J6894k1964j7190k818l647j8435P346j2944j5527
$$ 33371 17261 17483 11800 24807 41701 19737 2547 -271 -3918 -22353 -15007 -27951 -43478
25950d3478N650l314J5412K6456n021j3189J9067J7600j0263O912L9505l705q099
$$ -43478 -37828 -41142 -25730 726 -4295 -17484 1583 19183 8920 15832 55337 51632 43533
25937D3533k8849j5103k6984K1024K4932K5714K278k6672l3951k6883J9285J6448
$$ 43533 14684 -419 -27403 -6379 18553 44267 46545 19873 -14078 -40961 -21676 -5228
25925e228n765l036J4927J1868l426k0287k0351P525K0466L4603j5402j1310K05
$$ -5228 -10993 -14029 898 12766 9340 -10947 -31298 -23773 -3307 31296 15894 4584 4789
25912D789J1429k6119o373L077K6272p205k7289j4138K8348L3296n173J1997n69
$$ 4789 16218 -9901 -16274 -13197 13075 5870 -21419 -35557 -7209 26087 20914 32911 32342
25899C2342k648k6346j0323J5930m040j6909K3547Q360m0214j5911L9166J6403
$$ 32342 29694 3348 -6975 8955 4915 -11994 11553 19913 -20301 -36212 2954 19357
25887A9357k247j6080k197n181l6303J1626J5616j490J144O931J0572K0387M532
$$ 19357 17110 1030 -1167 -6348 -42651 -31025 -15409 -16899 -15755 -8824 1748 22135 26667
25874B6667j2177j2272J831q384J460p061j0476o879J3810R228M077j4654P256
$$ 26667 14490 2218 4049 -4335 -2875 -9936 -20412 -27291 -13481 -4253 -176 -14830 -7574
25861g574j8817R057J7552K4750K662j0580j7140j721Q764j1837k7525j3191J889
$$ -7574 -26391 -17334 218 24968 27630 17050 -90 -1811 6953 -4884 -32409 -45600 -43711
25848d3711K4868J7181n165q602k1449j3441J5717L713J0003k9009N243K4784
$$ -43711 -18843 -1662 -6827 -15429 -36878 -50319 -34602 -30889 -20886 -49895 -44652 -19868
25836a9868l971o415R09J7389J2427Q548K1855r579l3992o909J0337M0255j673
$$ -19868 -23839 -30254 -29345 -11956 471 9019 30874 21295 -12697 -19606 -9269 30986 29313
25823B9313p155l1601k4637k586l744k000O238J1032n905L3690M748k9362J4207
$$ 29313 22158 -9443 -34080 -36666 -40410 -42410 -36172 -25140 -31045 2645 7393 -21969 -7762
25810g762j2239J7107L7725k2322j9403k7215K8553L4057n769j8709J1529R138
$$ -7762 -20001 -2894 34831 12509 -6894 -34109 -5556 28501 22732 4023 15552 24690
25798B4690K750k1766j3998J8754Q793k3208m068J7136Q54j3856p041j2513j959
$$ 24690 27440 5674 -8324 10430 19223 -3985 -8053 9083 9937 -3919 -10960 -23473 -25432
25785b5432L387Q847m034N229J7881k726O366j267R35K1641L357j8515l0201J2899
$$ -25432 -22045 -13198 -17232 -12003 5878 3152 9518 8251 9186 30827 34184 15669 -14532 -1633
25771a633J5519P391n092l690j660P588J7922M576q063n704k0469o737J2953P313
$$ -1633 13886 21277 16185 12495 10835 18423 36345 40921 32858 27154 6685 -52 12901 20214
25757B0214j8137j3639J831N27J3596q079r014J0807j3309m495j3861n436m697
$$ 20214 2077 -11562 -9731 -9204 4392 -3687 -12701 -1894 -15203 -19698 -33559 -38995 -43692
25744d3692K3444j6087O800J5341L5461q190j3757j3120j5114J038K3236k12L478
$$ -43692 -20248 -36335 -29535 -14194 21267 13077 -680 -13800 -28914 -27876 -4640 -4852 -1374
25731a374L745l592K397j2125J0013k585j2238J7147K5727J7049j2237R505Q522
$$ -1374 2371 -1221 1176 -10949 -936 -3521 -15759 1388 27115 44164 31927 41432 49954
25718D9954L102q591R311k437j4694k6922k2968j0147J1431o697q901N959L230
$$ 49954 53056 44465 53776 51339 36645 9723 -13245 -23392 -11961 -18658 -27559 -21600 -18370
25705a8370j7088J0353J1161j0103Q077K6881N619l439o599K1944k4608p841j1305
$$ -18370 -35458 -25105 -13944 -24047 -15970 10911 16530 13091 6492 28436 3828 -4013 -15318
25692a5318o132K949J5089J1138j6666p245L0674K7206j077l0515L44P752J9310
$$ -15318 -21450 -18501 -3412 7726 -8940 -16185 14489 41695 40618 10103 10447 18199 37509
25679C7509j9466j0148K859j3887k081M0K542k2465q104l725L1800L9594J7627
$$ 37509 18043 7895 10754 -3133 -5214 -5174 -2632 -25097 -33201 -36926 -5126 34468 52095
25666E2095j8534m0044j1693N247K322J7906Q580k958k759k7456j7644J2987J4427
$$ 52095 33561 -6483 -18176 -12929 -10607 7299 15879 12921 10162 -17294 -34938 -21951 -7524
25653g524l0111q58K5010J6719N418o266l341o645J5551J7603k61r10j649l0659
$$ -7524 -37635 -38493 -13483 3236 8654 2388 -953 -7598 7953 25556 25295 24385 22736 -7923
25639g923K912K4996J2714N207p212P512k7595l6654k406J775P426K4350n73k2978
$$ -7923 -5011 19985 32699 37906 30694 38206 10611 -26043 -28449 -26674 -19248 5102 4529 -18449
25625a8449L969J65K2284J9625J0888n488m0569n0159L344J9782K052J2499n194
$$ -18449 -14480 -14315 7969 27594 38482 32994 -7575 -57734 -54390 -34608 -32556 -20057 -25251
25612b5251J6670j78M158L105P231P783j3182M276k79M559j7248o765P502M243
$$ -25251 -8581 -8759 -4601 -1496 5735 13518 336 4612 4333 8892 -8356 -15121 -7619 -3376
25598c376O57J6310K4319k2400j9256n801P795k169J1144N577j2842m687J8372
$$ -3376 -2719 13591 37910 15510 -3746 -9547 -1752 -3921 7223 12800 -42 -4729 13643
25585A3643L721Q294p079k574j2737O897J5602J874o466l1034J1542K489J3867
$$ 13643 17364 25658 18579 16005 3268 10165 25767 27641 21175 -9859 1683 4172 18039
25572A8039j380m445k4108j8578R047J3208r771q505K8682J8861K7350Q916j6477
$$ 18039 16659 12214 -11894 -30472 -21425 -8217 -17988 -26493 2189 21050 48400 57316 40839
25559D0839P290r604j6292r260O169m753M069P522j4189j0753J1978J762p073
$$ 40839 48129 38525 22233 12973 19142 14389 18458 25980 11791 1038 13016 14778 7705
25546G705l011r411o487J9820j8814p273k482Q599J4132O634j57j2412l070m561
$$ 7705 4694 -4717 -11204 8616 -10198 -17471 -19953 -11354 2778 9412 9255 -3157 -6227 -10788
25532a0788r293k411P427k467N55k0017m915K4362K223k4922p793R394j0488K5717
$$ -10788 -20081 -22492 -15065 -17532 -16977 -36994 -41909 -17547 -15324 -40246 -48039 -38645 -49133 -23416
25518b3416M0632J569j6499K0641L6746J5634k7924j1467o165k9562k734j6244
$$ -23416 17216 18785 2286 22927 59673 75307 47383 35916 29751 189 -2545 -18789
25506a8789o873j4162K1320Q850J1485J2218J6116J65k1483r509R6j0935p018
$$ -18789 -25662 -39824 -18504 -9654 1831 14049 30165 30330 8847 -662 -566 -11501 -18519
25493a8519j981j3636k0114N540Q817P872J9826j529R828K6705J4063j6248k5897
$$ -18519 -20500 -34136 -54250 -48710 -39893 -32021 -12195 -13724 -3896 22809 36872 20624 -5273
25480e273L989J3027K4584j5732p186j936J3976m02j7773l127J5680m2365l3475
$$ -5273 -1284 11743 36327 20595 13409 11473 25449 25047 7274 4147 19827 -22538 -56013
25467e6013Q541N169Q718R852J3345J0725J7385K413l2337j8809J9373J6634j330
$$ -56013 -47472 -42303 -33585 -23733 -10388 337 17722 20135 -12202 -31011 -11638 4996 3666
25454C666k1217J4793K6081J1342J2423N509O568l0247k7645k7919l4349R695
$$ 3666 -17551 -2758 23323 34665 47088 52597 59165 28918 1273 -26646 -60995 -51300
25442e1300J3623j1382k0712N542J5189J4801L9227J9417Q88r939l6148k6190
$$ -51300 -37677 -49059 -69771 -64229 -49040 -34239 4988 24405 25293 15354 -20794 -46984
25430d6984J7182L7406j1461k1490P966K2865j4188J7000N642j5921k0868k40
$$ -46984 -29802 7604 -3857 -25347 -17381 5484 -8704 8296 13938 -1983 -22851 -23091
25418b3091N566k237J976J9947j4256j3593l132K6510J9738j0492j329k3035M735
$$ -23091 -17525 -19762 -17786 2161 -12095 -25688 -28820 -2310 17428 6936 5607 -17428 -12693
25405a2693m954J1191J4266j2303J191o523Q816L497p227j0136J0281K031k5140
$$ -12693 -17647 -6456 7810 -4493 -3302 -9825 -1009 2488 -4739 -14875 -4594 -2563 -27703
25392b7703J916K5563K8356j8680j6041j9058J068L4718Q539j4163m551L300n366
$$ -27703 -25787 -224 28132 9452 -6589 -25647 -24579 10139 18678 4515 -36 3264 -2102
25379b102p36r998p928r387J3294M2689K420n802l4819n150P390K8660Q760l2671
$$ -2102 -2838 -12836 -20764 -30151 -16857 25832 28252 22450 -12369 -17519 -10129 18531 27291 -5380
25365e380k2941j7915n445L1851Q375j3926P712N740K532Q401p698r131L567J6201
$$ -5380 -28321 -46236 -51681 -19830 -11455 -25381 -17669 -11929 -9397 -996 -8694 -17825 -14258 1943
25351A943n860k170J7772P256o286J0927J610j8201k3722p942K5646K201k9203
$$ 1943 -3917 -6087 11685 18941 12655 23582 25192 6991 -16731 -24673 973 3174 -26029
25338b6029m032o159L1056Q647J588j0510j1357J9132Q944o411j9256J9194K0604
$$ -26029 -30061 -36220 -5164 3483 5071 -5439 -16796 2336 11280 4869 -14387 4807 25411
25325B5411r602r115j7095J0527Q611O391M239l3605J151J8469n064j4447J4567
$$ 25411 15809 6694 -10401 126 8737 15128 19367 -14238 -13087 5382 318 -14129 438
25312D38J6713j2828j1020l310K1613j220j0169K7231K1319j7000J117P4J346
$$ 438 17151 4323 -6697 -10007 11606 10386 217 27448 48767 31767 32884 32958 34304
25299C4304j2521l12k0033Q455l535l2834n502K2616L2053n706k1656q867K064
$$ 34304 21783 21471 1438 9893 6358 -26476 -31978 -9362 22691 16985 -4671 -13538 -11474
25286a1474J878J8664J4220J0399j979k8863k3797j5883k6354K3892K7183J5696
$$ -11474 -9596 9068 23288 33687 31708 2845 -20952 -36835 -63189 -39297 -12114 3582
25274C582P115J6476n92r433J4367k5527p189K4974K4969J1911j7781n796j8943
$$ 3582 10697 27173 26581 17148 31515 5988 -1201 23773 48742 60653 42872 37076 18133
25261A8133k0413J4353O239r388n253l314J701K4363k3409M228J0285l5490l0641
$$ 18133 -2280 12073 18312 8924 3671 357 2058 26421 3012 7240 17525 -17965 -48606
25248d8606L721Q884J9678j2307j6122k5769Q958L6843J8579j6690p999j158Q497
$$ -48606 -44885 -36001 -16323 -28630 -44752 -70521 -61563 -24720 -6141 -22831 -30830 -31988 -23491
25235b3491K4627r518J03Q233j9020j9781P663m614K6466K1881J1229j3054o678
$$ -23491 1136 -8382 -8279 -46 -19066 -38847 -31184 -35798 -9332 12549 23778 10724 4046
25222D046N940P424p294j1353k186j168J8909N790j3137k1705j4072j2535k740
$$ 4046 9986 17410 10116 -1237 -3423 -4591 14318 20108 6971 -14734 -28806 -41341 -44081
25209d4081O90m041J0535K1470J5546J9827j1596q4K823K390Q454j0085O50J389
$$ -44081 -43391 -47432 -36897 -15427 119 19946 8350 8266 11089 13479 21933 11848 12498 13887
25195A3887k4105j3084K859J6784K6268K2054n10l9201j849M515k2475j6797j345
$$ 13887 -10218 -23302 -20443 -3659 22609 44663 44153 4952 3103 7618 -14857 -31654 -32999
25182c2999K1774P383J8773r957M292k126j2501j8967J892J0304n914M0256n725
$$ -32999 -11225 -3842 14931 4974 9266 7140 -5361 -24328 -22436 -12132 -18046 22210 16485
25169A6485j61N667k8071N516p536J2819P022K1655j4077j9003j5238M629l207
$$ 16485 16324 21991 -6080 -564 -8100 4719 11741 33396 19319 316 -14922 -10293 -13500
25156a3500K0342J4719R944k6544J7004L913l2104j604j831Q409R717J4480k809
$$ -13500 6842 21561 31505 4961 21965 25878 -6226 -7830 -9661 -1252 8465 22945 20136
25143B0136K6948M052k9985j9557P537j9562o234N205l1091j900J8206Q496K5868
$$ 20136 47084 51136 21151 1594 9131 -10431 -16665 -11460 -42551 -44451 -26245 -17749 8119
25130H119j9569K278q38J6460J8344q710j045J9309J7602J6132J1474k1033k7382
$$ 8119 -11450 -9172 -10010 6450 24794 16084 15039 34348 51950 68082 79556 58523 31141
25117C1141k4434k6269o073J0945J9249R363j4987j773J617r586O901j993n018
$$ 31141 6707 -19562 -25635 -14690 4559 13922 -1065 -2838 -1221 -10807 -3906 -5899 -10917
25104a0917L8490P474J2037Q117j6850k4186n661J4921K4740m523j6659J2439
$$ -10917 27573 35047 47084 55201 38351 14165 8504 23425 48165 43642 26983 39422
25092C9422q215l0779k5656k0813J1581J597K92O498L678L2162l860J9784l655
$$ 39422 31207 428 -25228 -46041 -34460 -32863 -32571 -26073 -22395 9767 5907 25691 22036
25079B2036r971J5427O615k0215j035j5265J3292o456k2411j9394p547J8122j523
$$ 22036 12065 27492 34107 13892 12857 -2408 10884 4428 -17983 -37377 -44924 -26802 -28325
25066b8325j1556p905M610j2354K6809K159M689p400M372J9572J6600l553K4187
$$ -28325 -39881 -47786 -43176 -55530 -28721 -26562 -21873 -29273 -24901 -5329 11271 7718 31905
25053C1905k4412k0560J6058N386n598k4041r157J0101K385Q682K4392J7483O086
$$ 31905 7493 -13067 2991 8377 2779 -21262 -30419 -20318 -17933 -9251 15141 32624 38710
25040C8710K1815l632k2841n988J5432M89j8723l2570j857K5094K6845l757L562
$$ 38710 60525 56893 34052 28064 43496 43985 25262 -7308 -9165 15929 42774 39017 42579
25027D2579j7044o099k2071o877J0282J2553k0262j3050R605j0176J0599J0950
$$ 42579 25535 19436 -2635 -9512 770 13323 -6939 -19989 -10384 -20560 -9961 989
25015I89M045N695J8586j326j0496j4049k7343K121N725J4075j3071P718j5573
$$ 989 5034 10729 29315 27989 17493 3444 -23899 -21778 -16053 -1978 -15049 -7331 -22904
25002b2904J2472P618O195L27q456j6952j9652n928K5049J5699K2867J6580j7716
$$ -22904 -10432 -2814 3381 3708 -4748 -21700 -41352 -47280 -22231 -6532 16335 32915 15199
24989A5199p941M770l569k1325J4486J6901J7230J0352k6632n438J8426l1642
$$ 15199 7258 12028 8459 -12866 1620 18521 35751 46103 19471 14033 32459 817
24977H17j0116K5020j393N173l100j6928O988K2128o135j5639J7073K5219O221
$$ 817 -9299 15721 14328 19501 16401 -527 6461 28589 22454 6815 23888 49107 55328
24964E5328k5762j1702k1521J2618N853j8227k2923k100P689o310o367J4973Q685
$$ 55328 29566 17864 -3657 8961 14814 -3413 -26336 -28436 -20747 -27057 -33424 -18451 -9766
24951i766K683p292K1372N429r573j6743k7346J2339N858r654K3232K8387Q803
$$ -9766 -7083 -14375 6997 12426 2853 -13890 -41236 -28897 -23039 -32693 -9461 18926 27729
24938B7729k2795J5811k0094o169K2177j043K0238Q194l0559k2905j449K5239
$$ 27729 4934 20745 651 -5518 16659 15616 35854 44048 13489 -9416 -10865 14374
24926A4374j4597k610p26q811M742K413m307j3519J3740j8297l815J700J025L1402
$$ 14374 -223 -2833 -3559 -12370 -7628 -5215 -9522 -23041 -9301 -27598 -31413 -29713 -28688 2714
24912B714J0132J5278K51l0715j6078R410p9P183P593j5848J6509J2478k0162
$$ 2714 12846 28124 28375 -2340 -18418 -9008 -9087 -1904 5689 -10159 6350 18828 -1334
24899a334k0593K503N299n622m577P706J567R945L1254K2625m4714j0509k0531
$$ -1334 -21927 -19424 -14125 -19747 -24324 -16618 -15051 -5106 26148 48773 4059 -6450 -26981
24886b6981K1831L7654J7651p233l3564k7992j1346J9464K277j7908k5732j405
$$ -26981 -5150 32504 50155 42922 9358 -18634 -29980 -10516 -8239 -26147 -51879 -53284
24874e3284K6247K1581q61J0387R297J0967l471k4046P423p828N990K1791O72
$$ -53284 -27037 -5456 -6317 4070 13367 24334 20863 -3183 4240 -3588 2402 24193 24865
24861B4865J6274o504j1881j0078l090J1103J2091K82l9574L587J3216l506j8552
$$ 24865 41139 34635 22754 12676 9586 20689 32780 33062 -6512 -2925 10291 6785 -11767
24848a1767L046K2272j9927j0000J5314L420m315J249j1679N432L0051j4909j2898
$$ -11767 -8721 13551 -6376 -16376 -1062 2358 -1957 -708 -12387 -6955 23096 8187 -4711
24835d711O10l370j0068Q833L2879L15j4915L968j1824r209j2396J218K1912K425
$$ -4711 -4101 -7471 -17539 -8706 24173 24488 9573 13541 1717 -7492 -19888 -18670 3242 5667
24821E667J163K4244J0239j0118p778j8786J6708K8862j4221l1663j7050m000
$$ 5667 6830 31074 41313 31195 23417 4631 21339 50201 35980 4317 -12733 -16733
24809a6733K6279L3274M144m6987k0185Q057k4519l1142K0347K2966R315R111
$$ -16733 9546 42820 46964 -23 -20208 -12151 -36670 -67812 -47465 -24499 -15184 -6073
24797f073M0912K6615l4633l0249j7721Q621K4990L2319J0566m2367l0868k768
$$ -6073 34839 61454 26821 -3428 -21149 -12528 12462 44781 55347 12980 -17888 -20656
24785b0656J1091L2845j0185j0439m232j0075N888K622j7484j952j2489l370L157
$$ -20656 -9565 23280 13095 2656 -1576 -11651 -5763 -3141 -20625 -22577 -35066 -38436 -35279
24772c5279K4005J5143M181J5962l195j8265k2928m1310j1849K4232O806J6599
$$ -35279 -11274 3869 8050 24012 20817 2552 -20376 -61686 -73535 -49303 -42497 -25898
24760b5898J0775J3809N94q743j8327J2957P571J1916j727k344J4576m219j2094
$$ -25898 -15123 -1314 -720 -9463 -27790 -14833 -7262 4654 2927 583 15159 10940 -1154
24747a154K895L5129j2234l5145j4381o421J8856J1695l035l070j0954O800m100
$$ -1154 1741 36870 24636 -10509 -24890 -31311 -12455 -760 -3795 -6865 -17819 -11019 -15119
24734a5119r038J5500J6677j3182q60j2541j4214J8258J4639k2888k0575r073
$$ -15119 -24157 -8657 8020 -5162 -6022 -18563 -32777 -14519 120 -22768 -43343 -52416
24722e2416O611K1694N741J0061J4103K381k7183m441J4753R420k078L027j7465
$$ -52416 -45805 -24111 -18370 -8309 5794 8175 -19008 -23449 -8696 724 -1354 1673 -15792
24709a5792n237J2432K467r269m458J868q733J0452n848K3159J8900k0369j482
$$ -15792 -21029 -8597 -6130 -15399 -19857 -17989 -26722 -16270 -22118 1041 19941 -428 -1910
24696a910M412P38K6913J5456K36k9366j7003r048k788J140J8380N54j0740j2855
$$ -1910 2502 3240 30153 45609 45845 16479 -524 -9572 -12360 -11220 7160 7714 -3026 -15881
24682a5881N722k072O168p482L877K1262o832j0566J2658J7865j5027j3937Q407
$$ -15881 -10159 -12231 -6063 -13545 -9668 11594 4762 -5804 6854 24719 9692 -4245 4162
24669D162j2986l1006Q816J2761r508M459J5837J1051Q123r505j2298K7016J5741
$$ 4162 -8824 -39830 -31014 -18253 -27761 -23302 -7465 3586 11709 2204 -10094 16922 32663
24656C2663o329J5783j6652M577J1314k0640k0500J759j3649j6799K668J1931
$$ 32663 26334 42117 25465 30042 41356 20716 216 1975 -11674 -28473 -25805 -13874
24644a3874L6476O473k802k8520k0180j346K48m186J8678m994j285J3298J0767
$$ -13874 22602 29075 26273 -2247 -22427 -23773 -23525 -27711 -9033 -14027 -15312 -2014 8753
24631H753P652P71j456J7696R323k0390Q207l194O069j4571j8129J038o840J2246
$$ 8753 16405 17176 15720 33416 42739 22349 30556 27362 33431 18860 731 1769 -5071 7175
24617G175O635j210j2492j9528k4887o656Q532K7773n36l054J426K7704j6819
$$ 7175 13810 12600 108 -19420 -44307 -50963 -42431 -14658 -15194 -18248 -16822 10882 -5937
24604e937j3805M1006J8487r957j7864j0398J5096J2408p940m9551j6658l961
$$ -5937 -19742 21264 39751 29794 11930 1532 16628 29036 21096 -28455 -45113 -49074
24592d9074M0461K9828k2205l3259j9644J2141K3624q130J2174q103L72J5940
$$ -49074 -8613 21215 -990 -34249 -53893 -41752 -18128 -26258 -14084 -22187 -21815 -5875
24580e875J4810M617o778j1266l179j7439j8859R921K0192P582J8128k590j3820
$$ -5875 8935 13552 6774 -4492 -7671 -25110 -43969 -34048 -13856 -6274 11854 9264 -4556
24567d556j7817l991R105J5426P402Q536J6381P373j1276k2376O909K624J1566
$$ -4556 -22373 -26364 -17259 -1833 5569 14105 30486 37859 26583 4207 11116 13740 25306
24554B5306J4119r377k6588O501p263O337L490R792j4261K7353M155j5476J3040
$$ 25306 39425 30048 3460 9961 2698 9035 12525 22317 8056 35409 39564 24088 37128
24541C7128k0411k5478J6670j8333k4103M325L7017J0846l446l60p792J04K0619
$$ 37128 16717 -8761 7909 -10424 -34527 -30202 6815 17661 14215 13855 6063 6167 26786
24528B6786k4873M759k4191o1061j0554K0827J5968J854J0231N2261J0982k8055
$$ 26786 1913 6672 -17519 -78580 -89134 -68307 -52339 -50485 -40254 12007 22989 -5066
24516e066p694N497o937N557P503R381m0480k566L1593J2675m668Q817J8006J0561
$$ -5066 -12760 -7263 -14200 -8643 -1140 8241 -32239 -34805 -3212 9463 4795 13612 31618 42179
24502D2179k0164j3524l568J1792j8420j6760j7236j7305K2788J8916M690j8123
$$ 42179 22015 8491 4923 16715 -1705 -18465 -35701 -53006 -30218 -11302 -6612 -24735
24490b4735m14m854J3195j936m839o608l403J9201K1943r096O772o566m839n481
$$ -24735 -25149 -30003 -16808 -18744 -23583 -30191 -33594 -14393 7550 -1546 5226 -1340 -6179 -11660
24476a1660q624n638J5428m759j3984J0038J6287L836j6852m048J9191K8012M762
$$ -11660 -20284 -25922 -10494 -15253 -29237 -19199 -2912 924 -15928 -19976 -785 27227 31989
24463C1989k3065K3324J0517k3378j3922J6772J1216n941j5629k233j4692J2874
$$ 31989 8924 32248 42765 19387 5465 22237 33453 27512 11883 9650 -5042 7832
24451G832J0879K2209Q72k4050M010k2314l5339j9123L5086J2104J8388n945j9705
$$ 7832 18711 40920 41792 17742 21752 -562 -35901 -55024 -19938 -7834 10554 4609 -15096
24438a5096l5221l464J4092L2008p84K019K6868P664o861k1833j5110j6407N621
$$ -15096 -50317 -53781 -39689 -7681 -8465 -6446 20422 28086 21225 -608 -15718 -32125 -26504
24425b6504L496k8071K6122M8504P528j0005q779k0466J6289K9382j047j8924
$$ -26504 -23008 -51079 -24957 23547 31075 21070 12291 -8175 8114 37496 36449 17525
24413A7525j3547k0752J7727m173j4208J9087j1878K6141j1520j0885L314p134
$$ 17525 3978 -16774 953 -3220 -17428 1659 -10219 15922 4402 -6483 -3169 -10303
24401a0303r968P214j8139O510J8390m250m762J1988j509j6772Q226L141j229
$$ -10303 -20271 -13057 -31196 -24686 -6296 -10546 -15308 -3320 -4829 -21601 -13375 -10234 -11463
24388a1463J7598P291J7117n096j8886J2229J3930J7466J1030p301q726k388j2178
$$ -11463 6135 13426 30543 25447 6561 18790 32720 50186 61216 53915 45189 42801 30623
24375C0623k6855k1722K9929P790j4279j921j2198J1270j3570K40m694J5999J0861
$$ 30623 3768 -17954 11975 19765 5486 3565 -8633 2637 -10933 -10693 -15387 612 11473
24362A1473l7007l383J6020K393j4145j4000J1256J0412L8112J946j7213o865
$$ 11473 -25534 -28917 -12897 -10504 -24649 -38649 -27393 -16981 21131 23077 5864 -1001
24350a001j4169J3791L963j8385o976J0656L091j6179R372k3859j400J0437n828
$$ -1001 -15170 -1379 2584 -15801 -22777 -12121 -9030 -25209 -15837 -39696 -41096 -30659 -36487
24337c6487N828q126j8144J1248J419M1978J2637J0525j2116j4764L252j828J0496
$$ -36487 -30659 -38785 -56929 -45681 -44262 -2284 10353 20878 8762 -6002 -2750 -4578 5918
24324E918o836j7869J998J8524R754J9562m391n687j2770k1155j1107L581J3358
$$ 5918 -918 -18787 -16789 1735 11489 31051 26660 20973 8203 -12952 -24059 -20478 -7120
24311g120J2490j5654J3624j1970k386P937M809J0422K478L814k9116n719J4772
$$ -7120 5370 -10284 3340 -8630 -11016 -3079 1730 12152 14630 18444 -10672 -16391 -1619
24298a619n973k78O108K6071J7582N94o689j3902N724O416J2809j1448M83R05
$$ -1619 -7592 -7870 -1762 24309 41891 42485 35796 21894 27618 34034 46843 35395 35878 36783
24284C6783q59j4444k2566k1907j0511P317j0257Q881J4249n737J872J586J8587
$$ 36783 35924 21480 -1086 -22993 -33504 -26187 -36444 -27563 -13314 -19051 -17179 -15593 2994
24271B994K8733J8340k8955k6494P155r483K2640n291J948K4253l682n702j3711
$$ 2994 31727 50067 21112 -5382 1773 -7710 14930 9639 11587 35840 32158 26456 12745
24258A2745M039q790M6773N62m7620l2588K0020r6l787l58J2318l075J1951j0228
$$ 12745 16784 7994 54767 55329 7709 -24879 -4859 -4955 -8742 -9100 3218 143 12094 1866
24244A866j0688j3936j3715L505J7424R498o907k4664j1690J9619K9097J8471
$$ 1866 -8822 -22758 -36473 -32968 -15544 -6046 -12953 -37617 -49307 -29688 -591 17880
24232A7880o424p53k1095j8700l440j4261K8072J0277k3125j2780J9554J0945
$$ 17880 11456 10703 -10392 -29092 -32532 -46793 -18721 -8444 -31569 -44349 -24795 -13850
24220a3850L2483P989j7263o122J8748O062Q665J9787k6856l4599j473j7721j0111
$$ -13850 18633 26622 9359 3237 21985 28047 36712 56499 29643 -4956 -6429 -24150 -34261
24207c4261M221j620J7202K8415k0531l3503J2125O063l309l928P125M0098J0968
$$ -34261 -30040 -31660 -14458 13957 -6574 -40077 -27952 -21889 -25198 -29126 -22001 18097 29065
24194B9065q305k1093L370K0104L7633p044l1842N463p305n789J0930k6354K462
$$ 29065 20760 -333 3037 23141 60774 53730 21888 27351 20046 14257 25187 -1167 1295
24181A295j2401l3077m93K1174p792J439P286L139j4147R08J4959K7223J18k0820
$$ 1295 -11106 -44183 -44676 -23502 -31294 -29855 -22569 -19430 -33577 -32669 -17710 9513 9631 -11189
24167a1189k0568p54O734J3000l64k2798k3086k896k1464k368K2119K4514k4745
$$ -11189 -31757 -32511 -25777 -12777 -13141 -35939 -59025 -61921 -83385 -85753 -63634 -39120 -63865
24154f3865l202J3570P821J1266L6135J0919J2933J655k7358r120j7554l119J5807
$$ -63865 -67067 -53497 -45676 -34410 1725 12644 25577 27232 -126 -9246 -26800 -29919 -14112
24141a4112K7231N970l1587j3158L933J8911L0505K260k8538k6105j409J1136
$$ -14112 13119 19089 -12498 -25656 -21723 -2812 27693 29953 1415 -24690 -26099 -14963
24129a4963j1442r740J3937J374L235R746q187L834J0324O82R364j3043J1397
$$ -14963 -26405 -36145 -22208 -20834 -17599 -7853 -16040 -12206 -1882 -1200 8164 -4879 6518
24116F518p352k6563M547Q934O468Q142j4999L655j1176O913n753Q575K3645J6790
$$ 6518 -834 -27397 -22850 -13916 -7448 694 -14305 -10650 -21826 -14913 -20666 -12091 11554 28344
24102B8344j768o397O81O576j9984m320j4315j0998l979K0251L5079J046n555
$$ 28344 26576 20179 20860 27436 7452 3132 -11183 -22181 -26160 -5909 29170 30216 24661
24089B4661j1286L070q772j2537q797k9294n255M281K9158K3117r198k7844j5627
$$ 24661 13375 16445 7673 -4864 -13661 -42955 -48210 -43929 -14771 8346 -852 -28696 -44323
24076d4323K7656J4617l077K8378k4716q000L6840K6232J2625j4593n6338k167
$$ -44323 -16667 -2050 -5127 23251 -1465 -9465 27375 53607 66232 51639 -4699 -6866
24064f866J6583r000p590L906J4039j6564K919o241K5125J0838o289k0224n467
$$ -6866 9717 717 -6873 -2967 11072 -5492 -2573 -8814 16311 27149 20860 636 -4831
24051d831N567j7222p220k722L0567K3155J1771j0506J0769j7934j2872o884k1277
$$ -4831 736 -16486 -23706 -26428 4139 27294 39065 28559 39328 21394 8522 1638 -19639
24038a9639j4397M926j9372o385J2675P522k373K1618k783J1663K0143q96J3627
$$ -19639 -34036 -29110 -48482 -54867 -42192 -34670 -37043 -15425 -18208 -6545 13598 12702 26329
24025B6329K954R576P022k0560o474j8776k4157Q473K3304k624j6565O79K1435
$$ 26329 29283 38859 45881 25321 18847 71 -24086 -15613 7691 5067 -11498 -10819 10616
24012A0616K0762O918K2423m252k6467K322J2175r384j1756J2920j5066l2177
$$ 10616 31378 38296 60719 56467 30000 32322 44497 35113 23357 36277 21211 -10966
24000a0966j9719P962q742n215L947J1018L4974M695n786K998n155Q455m780j464
$$ -10966 -30685 -22723 -31465 -36680 -32733 -21715 13259 17954 12168 15166 10011 18466 13686 12222
23986A2222J05j498K305p622N139R181r184n323o891J9151k010j7689q307j8759
$$ 12222 12327 10829 13134 5512 10651 19832 10648 5325 -1566 17585 15575 -2114 -10421 -29180
23972b9180j2218K8929J8812K4207R498j1102j6986q12O676J315p50p913n077
$$ -29180 -41398 -12469 6343 30550 40048 28946 11960 11148 17824 19139 18389 10476 5399
23959E399l347j3154L664J274j5022J5554Q527o51l165K1912M882J371j6075j5395
$$ 5399 2052 -11102 -7438 -6164 -21186 -5632 2895 2244 -921 20991 25873 27244 11169 -4226
23945d226L992J4057M341q575J7680o525p111k664J2262N947q239j3350R160J9327
$$ -4226 -234 13823 18164 9589 27269 20744 13633 10969 23231 29178 20939 7589 16749 36076
23931C6076j461r047j2389n054l60n323L795J0452n919N676K5245j3543M647k3189
$$ 36076 34615 25568 13179 8125 7765 2442 6237 16689 10770 16446 41691 28148 32795 9606
23917I606l6062l9066M77J9001J9891K7587N824L156N49L815J2878Q969q001J0075
$$ 9606 -26456 -65522 -65045 -46044 -26153 1434 7258 10414 10963 14778 27656 36625 28624 38699
23903C8699j883l8085Q88J6768l0253%J2309m848J008r621J2278j0838N516k811
$$ 38699 36816 -1269 -381 16387 -13866 -13866 -1557 -6405 -5397 -15018 -2740 -13578 -8062 -10873
23889a0873o009j4657p160K0215K5812J3229j794m737l0463r239M0868O778k4776
$$ -10873 -16882 -31539 -38699 -18484 7328 20557 18763 14026 -16437 -25676 15192 21970 -2806
23876b806o411Q380j8938j795P109Q336L579J5606J0895K4187j1612j2841j527
$$ -2806 -9217 -837 -19775 -21570 -14461 -6125 -2546 13060 23955 48142 36530 23689 22162
23863B2162r842M804J6029o45k4539k6916J2256J7908r243O116m438M147O536
$$ 22162 12320 17124 33153 32508 7969 -18947 -6691 11217 1974 8090 3652 7799 14335
23850A4335l630j5459j801j7729N841K6309j0931l570j7644R636J2814J8671P081
$$ 14335 10705 -4754 -6555 -24284 -18443 7866 -3065 -6635 -24279 -14643 -1829 16842 23923
23837B3923m789k8586r997M707P428L3579m691n123k2681j5194J262R425J9733
$$ 23923 19134 -9452 -19449 -14742 -7314 26265 21574 16451 -6230 -21424 -20162 -10737 8996
23824H996j1508j3172K526K9693J5183o061j0247J4836R101k4931j8636Q678R070
$$ 8996 -2512 -15684 -13158 16535 31718 25657 15410 30246 39347 14416 -4220 4458 13528
23811A3528M260K381o805q939k7046k1329P463L2138P233K3001j0930j268J8466
$$ 13528 17788 20169 13364 4425 -22621 -43950 -36487 -4349 2884 25885 14955 13687 32153
23798C2153j5255J2656L829l9997k4276J2964K0112L391q149j4782J606K8471
$$ 32153 16898 29554 33383 -6614 -30890 -17926 2186 5577 -2572 -17354 -15748 12723
23786A2723q763j9543K6930l251k5263J7868J3319m54P644J6826L751k9739k4531
$$ 12723 3960 -15583 11347 8096 -17167 701 14020 13566 21210 38036 41787 12048 -12483
23773a2483L011J7857p396J6034q312J2595K1233j5321m1670j2899L2608K3242
$$ -12483 -9472 8385 989 17023 8711 21306 42539 27218 -14452 -27351 5257 28499
23761B8499R387j8508k1800J5575L3594K122j9058l5902m724L5073j198N176r263
$$ 28499 37886 19378 -2422 13153 46747 48869 29811 -6091 -10815 24258 23060 28236 18973
23748A8973j1045k263j9453n950J0790p644k0644O0N083K1864M118m967J5834
$$ 18973 7928 5665 -13788 -19738 -8948 -16592 -37236 -37176 -32093 -10229 -6111 -11078 4756
23735D756J9745K748m310o692m142k2935o855J1054l2560q835K3207K0772j6444
$$ 4756 24501 27249 22939 16247 12105 -10830 -17685 -6631 -39191 -48026 -24819 -4047 -20491
23722b0491j2954O030J9856k1207n317N191m331K356K7424j1182j4998J3053J2493
$$ -20491 -33445 -27415 -7559 -28766 -34083 -28892 -33223 -30867 -3443 -14625 -29623 -16570 -4077
23709d077K1842r307j6166L46n81l857R231K5375q751l618J508K4480j0457k9204
$$ -4077 17765 8458 -7708 -7362 -7943 -11800 -2569 22806 14055 10437 11945 36425 25968 -3236
23695c236j0865M497n868j9611n148j1598J5766R605k823K3466K0756j8382k0873
$$ -3236 -14101 -9604 -15472 -35083 -40231 -51829 -36063 -26458 -29281 -5815 14941 -3441 -24314
23682b4314M359J6300k571N858P272p175N659l471J7938L320q314R419J7339J4349
$$ -24314 -19955 -3655 -6226 -368 6904 -271 5388 1917 19855 23175 14861 24280 41619 55968
23668E5968m2203k9576q164j2405M851K8852J0205P176K3844j881j6776j4586
$$ 55968 13765 -15811 -23975 -36380 -31529 -2677 7528 14704 38548 36667 19891 5305
23656E305N016P401R857k2140k0599J9325P970j0283o865j0239L51J6824j015
$$ 5305 10321 17722 27579 5439 -15160 4165 12135 1852 -5013 -15252 -14901 1923 908
23643I08j8042L646M451R040j1105J0719J4509M122M148j3251P660j3196m0012
$$ 908 -17134 -13488 -9037 3 -11102 -383 14126 18248 22396 9145 16805 3609 -36403
23630c6403j4049K3456Q023m564m26J8580M909J2491j8944j88k11J8230J333K2782
$$ -36403 -50452 -26996 -18973 -23537 -23963 -5383 -474 12017 -6927 -7115 -7326 10904 12237 35019
23616C5019J5225k19M394j7659j4166j0914k6931K1067j363l642L4272n45k1330
$$ 35019 50244 50025 54419 36760 22594 11680 -15251 5816 4453 811 35083 34538 13208
23603A3208j7446k5484j5343K8941K7596j8112k571m86m1513j0684K2385K5860
$$ 13208 -4238 -29722 -45065 -16124 11472 -6640 -9211 -9697 -51210 -61894 -39509 -13649
23591a3649K380q941K3410j5350l0412J1020J6879M98Q068j6874N1935K1504j1193
$$ -13649 -11269 -20210 3200 -12150 -42562 -31542 -14663 -14165 -6097 -22971 28964 50468 39275
23578C9275j6479k2522p303J1111q664l1778o677n97L12J3546J5409R071k8149
$$ 39275 22796 274 -7029 4082 -4582 -36360 -43037 -43634 -43322 -29776 -14367 -5296 -33445
23565c3445J8175Q024k72l035r096J9413L239J3387m7k6149O136J3551O444n522
$$ -33445 -15270 -7246 -7518 -10553 -19649 -236 3003 16390 16343 -9806 -3670 9881 16325 10803
23551A0803l238N200J0463K44m4472k4475O485J7272j6263J354J3958R373r299
$$ 10803 7565 12765 23228 23472 -21000 -45475 -38990 -21718 -37981 -36627 -22669 -13296 -22595
23538b2595o937J0597J780j199j1289J6197N175j3885m609K7286J5619P601p802
$$ -22595 -29532 -18935 -17155 -18354 -29643 -13446 -8271 -22156 -26765 521 16140 23741 15939
23525A5939L483k2616L936o647K034k619J4494M50J7629r078j1508k6231j059
$$ 15939 19422 -3194 742 -5905 -3871 -6490 8004 8454 26083 17005 5497 -20734 -21793
23512b1793j268j0981R64L0565J091j3039r788J037k1737J8945J4947K9727K3262
$$ -21793 -23061 -34042 -33078 -2513 -1422 -14461 -24249 -23212 -44949 -26004 -11057 18670 41932
23499D1932J3194j6852k6991J5104J9398q564j5044j9287k1997O257K2014j4904
$$ 41932 55126 38274 11283 26387 45785 37221 22177 2890 -19107 -12850 9164 -5740
23487e740O379L641j1581j9290J1375J9708N363K097k7656k027j2729j165L1062
$$ -5740 639 4280 -7301 -26591 -15216 4492 9855 11952 -15704 -17731 -30460 -31625 -563
23474e63K4002j7820m002J5406q263j1512m289o857j3456K0802J9672O238K767
$$ -563 23439 5619 1617 17023 8760 -2752 -7041 -13898 -27354 -6552 13120 19358 22125
23461B2125Q658j7250J6526L168j9168k8813K3519O224p226J9029J7424k815p154
$$ 22125 30783 13533 30059 33227 14059 -14754 8765 14989 7763 26792 44216 41401 34247
23448C4247l65J2768J4052l1479l6366j5203j8708J0298J4376K6620J7857Q358
$$ 34247 33882 46650 60702 29223 -7143 -22346 -41054 -30756 -16380 10240 28097 36455
23436C6455j4052j1031M324j0089j362J6669j1361l023J026Q205J6507j435k3130
$$ 36455 22403 11372 15696 5607 4245 20914 9553 6530 7556 15761 32268 30833 7703
23423G703m945j2722j1634r094K3886K0628m104l550j2820L7688J1451j0023l0338
$$ 7703 2758 -9964 -21598 -30692 -6806 13822 9718 6168 -6652 31036 42487 32464 2126
23410B126k9197J5999m01Q352J7571j816N705j1457J1580J8553l263K2857j4967
$$ 2126 -27071 -11072 -11473 -3121 14450 12634 18339 6882 18462 37015 33752 56609 41642
23397D1642n0577J011J4733K8137o440j4005p183J2941K76j6264O815O552K685
$$ 41642 -8935 -7924 6809 34946 28506 14501 7318 20259 20535 4271 11086 17638 20323
23384B0323J0534J811K667k6640l5147J7570K2892K3927m590j5389K225L029M124
$$ 20323 30857 32668 35335 8695 -26452 -8882 14010 37937 33347 17958 20183 23212 27336
23371B7336o513n612j069k4714R269J4491l4083J1359K0010j301J4394j2451l9662
$$ 27336 20823 15211 14142 -10572 -1303 13188 -20895 -9536 10474 9173 23567 11116 -28546
23358b8546m849M562L6945K114j3181M2507Q138k8725j8132n738K4674Q37j6582
$$ -28546 -33395 -28833 8112 10226 -2955 39552 47690 18965 833 -4905 19769 20606 4024
23345D024l885o587j7342j799j1628J4317K5721j1055r856m326j5667j4018K383
$$ 4024 139 -6448 -23790 -25589 -37217 -22900 2821 -8234 -18090 -22416 -38083 -52101 -49718
23332d9718P075L0168J7652k215p348o041N603J9460m57J506R07o186j05J5190
$$ -49718 -42643 -12475 5177 2962 -4386 -10427 -4824 14636 14179 15685 16592 10406 10301 25491
23318B5491j3563L2361M6600k3083Q8L479j3935l0164j4453J171j5999N164m518
$$ 25491 11928 44289 90889 67806 67894 71373 57438 27274 12821 13992 -2007 3157 -1361
23305a361J0290Q223K1324j9512l4642k0978l94j5204L280N195J7598O594J9203
$$ -1361 8929 17152 38476 18964 -15678 -36656 -37050 -52254 -48974 -43779 -26181 -19587 -384
23292c84j3708J521J811N028M014P658j7243K3946o84l848K4034K0170o394m786
$$ -384 -14092 -12571 -10760 -5732 -1718 5940 -11303 12643 11959 8111 32145 52315 45921 41135
23278D1135j2791m832j0866r6L147K0186K5461o431n285j2367J571k5572k1317
$$ 41135 28344 23512 12646 12550 15697 35883 61344 54913 49628 37261 38832 13260 -8057
23265h057J5405r061j4054M854j66j4254P028J5550j1519J8396L4697J6134L149
$$ -8057 7348 -1713 -15767 -10913 -11079 -25333 -18305 -2755 -14274 4122 38819 54953 58102
23252E8102k2138r506r35J955L0591l6015k7855p783K68j6393p452P246J4322
$$ 58102 35964 26458 25523 27478 58069 22054 -5801 -13584 -13316 -29709 -37161 -29915 -15593
23239a5593Q011K395J1860k5449J2327O615l571l286J3537O797J531r050K8003
$$ -15593 -7582 -5187 6673 -18776 -6449 166 -3405 -6691 6846 13643 15174 6124 34127
23226C4127J0810j7231p476j5573r219J3245J8401n880k1017Q236L7516J2619
$$ 34127 44937 27706 20230 4657 -4562 8683 27084 21204 187 8423 45939 58558
23214E8558k6973j0913J0952k0579m531J439n013O457l58j2176j6870p2L3094
$$ 58558 31585 20672 31624 11045 6514 7953 2940 9397 9039 -3137 -20007 -20079 13015
23201A3015K6600K3476k3475q269k3692j7J5773J3088J8152m124K519O872k4086
$$ 13015 39615 63091 39616 31347 7655 7638 23411 36499 54651 50527 53046 59918 35832
23188C5832j8392l915K896J4785p674l364j6266J179K5774J3391k1268K3392k1421
$$ 35832 17440 13525 16421 31206 23532 20168 3902 5081 30855 44246 22978 46370 24949
23175B4949k1369n652J428j4658j1458M463J0483L416p699j9593R351L6564Q0
$$ 24949 3580 -2072 -644 -15302 -26760 -22297 -11814 -8398 -16097 -35690 -26339 10225 10305
23162A0305N712L550j3147k8935J4248K250J6533M3000J3663l7868j5228Q737
$$ 10305 16017 19567 6420 -22515 -8267 -6017 10516 53516 67179 29311 14083 22820
23150B2820K0600m521j8139K473J4161j5682J5264J1661k6500P915j4094O236
$$ 22820 43420 38899 20760 23233 37394 21712 36976 48637 22137 30052 15958 22194
23138B2194K238J4775Q021j3971j4679j9159K499J6884p861O904J6642J1052K7753
$$ 22194 24432 39207 47228 33257 18578 -581 1918 18802 10941 17845 34487 45539 73292
23125G3292k8148k1178J1811j6092Q506Q31p734K9463J8646J2595J0782j867j9271
$$ 73292 45144 23966 35777 19685 28191 29022 21288 50751 69397 81992 92774 90907 71636
23112G1636k0526K640P898k1010j4296j0447k816J6879L9032n537j0744j1024
$$ 71636 51110 53750 61648 40638 26342 15895 13079 29958 68990 63453 52709 41685
23100D1685k241m198j9627k6966j5735J6243J5201K8757O963K214j1464J9720
$$ 41685 39444 35246 15619 -11347 -27082 -10839 4362 33119 40082 42296 30832 50552
23088E0552q454j7936o688J4479J802l402K654J8163o599j780N184P346n037J3374
$$ 50552 42098 24162 17474 31953 33755 30353 33007 51170 44571 42791 47975 55321 50284 63658
23074F3658Q321R278M629k55K3427l1774j6486k036k9783o802Q72K355j3796M692
$$ 63658 71979 81257 85886 85631 109058 77284 60798 58762 28979 22177 23049 25404 11608 16300
23060A6300K2197K2825J2698J2251J755p541k1691j5326Q429J9996J5119N93l0137
$$ 16300 38497 61322 74020 86271 88026 80485 58794 43468 51897 71893 87012 87605 57468
23047E7468m464J1229J3556M834j8601j2978N386L3023K082o282r019j901K1716
$$ 57468 53004 64233 77789 82623 64022 51044 56430 89453 91535 85253 76234 74333 96049
23034I6049O387J5937N081n350K0429J0685k2367K587L3222L1515M2023J7081
$$ 96049 102436 118373 123454 118104 138533 149218 126851 129438 162660 194175 236198 253279
23022B53279K4288K5551K7782J5888N5070N0981N5911N6580P6038J03525Q9856
$$ 253279 277567 303118 330900 346788 401858 452839 508750 565330 641368 744893 834749
23011H34749J10160J87366K17827K66599L37358M27866M21415M30045M16823L23459
$$ 834749 944909 1132275 1350102 1616701 1954059 2381925 2803340 3233385 3650208 3973667
23001C973667K78144K65605L08588K91284K36567R8697j20699l51629m43242l78499
$$ 3973667 4251811 4517416 4826004 5117288 5353855 5452552 5331853 4980224 4536982 4158483
22991D158483l17650k72577k80726l50263m30936m41715l58653k98329k23319
$$ 4158483 3840833 3568256 3287530 2937267 2506331 2064616 1705963 1407634 1184315
22982A184315j40000r4510p4977o3163m9967p3971n9887j3035j6171l4119k1902
$$ 1184315 1044315 949805 874828 811665 761698 687727 627840 614805 598634 564515 542613
22971E42613j1777l873j5861j3767j0628l3824k8027k3887k8217l7960k7899j7765
$$ 542613 530836 526963 511102 497335 486707 452883 424856 400969 372752 334792 306893 289128
22959B89128j9656k2777j6282k0429J7907K7587K604r386k552M560R223J3535
$$ 289128 269472 246695 230413 209984 227891 255478 258082 248696 246144 250704 259927 273462
22947B73462K139j0131l417m6924j290K0969k5557k6091J5969K037J6060j7900
$$ 273462 275601 265470 262053 215129 213839 234808 209251 183160 199129 201166 217226 199326
22935A99326O838K6563P486J1354K3890J7091m993N3202N8739K9132J5377J9133
$$ 199326 206164 232727 240213 251567 275457 292548 287555 340757 399496 428628 444005 463138
22923D63138O8496R2925J22392J47165J03778K2788o6190p8281m8505k1619N0350
$$ 463138 531634 624559 746951 894116 997894 1020682 954492 876211 827706 806087 856437
22912H56437J08781J78640J87947J91723J29822p4738k74338k75925j84723j04270
$$ 856437 965218 1143858 1331805 1523528 1653350 1578612 1304274 1028349 843626 739356
22902G39356k5051K5863M2556R3559J22176L2876r4012j89946j71491j10216n8254
$$ 739356 714305 740168 782724 876283 998459 1031335 937323 747377 575886 465670 407416
22891D07416k8815q78m579l3188K099j5172r977q237p531J6757K1748N5564O1737
$$ 407416 378601 377723 373144 339956 342055 326883 316906 308669 301138 317895 339643 395207 456944
22878D56944Q1925R7578R7310J14245J26217R0816L3369J761j3009l0955n9382
$$ 456944 538869 636447 733757 848002 974219 1065035 1098404 1100165 1087156 1056201 996819
22867I96819j10605j53920j48470j15508j01038m7055m0519m3624m2148j7366
$$ 996819 886214 732294 583824 468316 367278 320223 279704 236080 193932 176566
22857A76566k2698K1027j6101j6525J9076N031j7162K1151J607J955J0789j2045
$$ 176566 153868 174895 158794 142269 161345 166376 149214 170365 171972 173927 184716 172671
22845A72671j0206j5229J097K691j8397j1962j0303j2335K417J7808J4899J319
$$ 172671 162465 147236 148333 151024 132627 120665 110362 98027 100444 118252 133151 134470
22833A34470p275o619o978q518l592k000J5303K0601q731j7987k0475k4853n93
$$ 134470 127195 120576 113598 105080 101488 99488 114791 135392 126661 108674 88199 63346 62753
22820F2753k0065J1189L244q854k018K9277K7160j8619j8940k1824l5137L120
$$ 62753 42688 53877 57121 48267 46249 75526 102686 84067 65127 43303 8166 11286
22808A1286J2580p254R588J9104j1517j364r921j3754M506k062L6077J7574M686
$$ 11286 23866 16612 26200 45304 33787 32423 22502 8748 13254 11192 47269 64843 69529
22795F9529p097k3440K6986J5459o923k1450j4434N46J4228J4192n375j8241J4597
$$ 69529 62432 38992 65978 81437 74514 53064 38630 39176 53404 67596 62221 43980 58577
22782E8577P074M95j2365p771P99k751j429O118L8469K364j3183L206R229l5200
$$ 58577 65651 66146 53781 46010 46809 44058 42629 48747 87216 89580 76397 79603 88832 53632
22768E3632k2555L6328m273j9195j8411L898m504k3954J1831J9311J2472K1744
$$ 53632 31077 67405 63132 43937 25526 29424 24920 966 12797 32108 44580 66324
22756F6324Q974j1090r256J4946P10m773K002q385k2274K1108O569J6j9356J8716
$$ 66324 75298 64208 54952 69898 70608 65835 67837 59452 37178 58286 64855 64871 45515 64231
22742F4231L461j4681q754P171l013m993p394P793K9700J3886K687m604M616j1827
$$ 64231 67692 53011 44257 51428 48415 43422 36028 43821 73521 87407 90094 85490 90106 78279
22728G8279l2933k8877K9991J2112J7793O31p353k1601j5751o498K345J2437j81
$$ 78279 45346 16469 46460 58572 76365 76996 69643 48042 32291 25793 28138 40575 40394
22715D0394J1453j3835j9204l649K0693K0542J5326R992l910R841K141O465q164
$$ 40394 51847 38012 18808 15159 35852 56394 71720 81712 77802 87643 89784 96249 88085
22702H8085k0212l313j5693N257K2732r662r472J431N185K1802kj1212J883o699
$$ 88085 67873 64560 48867 54124 76856 67194 57722 59153 64338 86140 86138 74926 76809 70110
22688G0110N833j7702o300l271o237m170Q639K6659J8438j1021j3042k1513l078
$$ 70110 75943 58241 51941 48670 42433 38263 46902 73561 91999 80978 67936 46423 43345
22675D3345p499k548n70K3133q89p992L268k0399k6317M0K1429J0848m479L0307
$$ 43345 35846 33298 32728 55861 54972 46980 50248 29849 3532 3572 25001 35849 31370 61677
22661F1677P090R020J0049J892k4484j8736m367j5506j0806m320J9723K6573k0181
$$ 61677 68767 77787 87836 89728 65244 46508 42141 26635 15829 11509 31232 57805 37624
22648C7624J2819K1873l5558J7146M780J3644M224l2280j4008R084L8456L0232
$$ 37624 50443 72316 36758 53904 58684 72328 76552 44272 30264 39348 77804 108036
22636A08036J9342j7995j2870j5555O023j1935k0993J6531J6524J8838j5078j0008
$$ 108036 127378 109383 96513 80958 86981 75046 54053 70584 87108 105946 90868 80860
22624H0860k435K1490J9733l2398o616M558K3106M8679K4605K452J8163R789J3232
$$ 80860 78425 99915 119648 87250 80634 85192 108298 156977 181582 184034 202197 211986 225218
22611B25218q241k7979k3708L476K2147j2042J2450m320r395J1083K5278J777
$$ 225218 216977 188998 165290 168766 190913 178871 191321 187001 177606 188689 213967 215744
22599B15744l923m2158k951L7030j5661k8239m964K0860J5062n864j3060k8991
$$ 215744 211821 169663 166712 203742 188081 159842 154878 175738 190800 184936 171876 142885
22587A42885j9895j1265j7787K7625K7281j2564K7312l50m4427k6766l872j5973
$$ 142885 122990 111725 93938 121563 148844 136280 163592 163242 118815 92049 88177 72204
22575G2204O201m743K4101p640K193L3028J6952q063n502N505j9853j6248J2865
$$ 72204 78405 73662 97763 90123 92316 125344 142296 134233 128731 134236 114383 98135 111000
22562A11000K6076q890l9508j0411J9509J0970K0793J3496m140J0103m977J510
$$ 111000 137076 128186 88678 78267 97776 108746 129539 143035 138895 148998 144021 145531
22550A45531k925j7890J9989K4776J9150q645p321j6063o545P12P37O632j7207
$$ 145531 142606 124716 144705 169481 188631 179986 172665 156602 150057 150769 151506 158138 140931
22537A40931O256L4958K6590K2534K3575J7249j88J2514o460l1994j9264N467
$$ 140931 147187 182145 208735 231269 254844 272093 271905 284419 277959 245965 226701 232168
22525B32168N243k6980N247K1936J2035k2571k043O909k1351N016O974j1250k0656
$$ 232168 237411 210431 215678 237614 249649 227078 225035 231944 210593 215609 222583 211333 190677
22512A90677R764o11K3497j3646k9633J9529l438n32J6541J2702j1012K87J3075
$$ 190677 200441 199830 223327 209681 180048 199577 196139 195607 212148 224850 213838 214125 227200
22499B27200L1667L315J5969K6918J4782K7631L0214L2342K7962N9273P7459M6599
$$ 227200 258867 262182 278151 305069 319851 347482 377696 410038 438000 497273 574732 621331
22487F21331K3956L8970L7079J2064M5185N2803R950j913M7125M7449P9908O5940
$$ 621331 645287 684257 721336 733400 778585 831388 841338 839425 886550 933999 1013907 1079847
22475A079847L5576p600K392K9131J7406o0891q0477j5634K6180L7697K0474j6619
$$ 1079847 1115423 1107823 1110215 1139346 1156752 1095861 1015384 999750 1025930 1063627 1084101 1067482
22463A067482l7078k6538k1426Q1m5217n7098n8907M1J558q006M2980L9209K4705
$$ 1067482 1030404 1003866 982440 982521 937304 880206 821299 821340 822898 814892 857872 897081 921786
22450I21786K2797j598k390K2890M2712Q9586N3941P1282R1799J25734J36824
$$ 921786 944583 942985 940595 963485 1006197 1095783 1149724 1221006 1312805 1438539 1575363
22439A575363J72571J92137O1572l6026p3003l8324L9291Q4848J14119J59140
$$ 1575363 1747934 1940071 2001643 1965617 1892614 1854290 1893581 1978429 2092548 2251688
22429B251688K06555K68067K18989l456k60141l22352k32551q6587J7575O0931
$$ 2251688 2458243 2726310 2945299 2941843 2681702 2359350 2126799 2040212 2057787 2118718
22419B118718Q5303R7099J01522N4583k8283j40924j61206r1398m0343l014J3933
$$ 2118718 2204021 2301120 2402642 2457225 2428942 2288018 2126812 2035414 1995071 1992057 2005990
22408B005990Q304j7248n5P5315R7364M4949L1206K9394K8539N3760N3242L1213
$$ 2005990 2014294 1997046 1996991 2072306 2169670 2214619 2245825 2275219 2303758 2357518 2410760 2441973
22396B441973O0555O9152J04812R3649M7033R4326J45831J50433J68892J79595
$$ 2441973 2502528 2571680 2676492 2770141 2817174 2911500 3057331 3207764 3376656 3556251
22386C556251J73706K26799K51675K95638L72814M88251O11065P27677Q21143
$$ 3556251 3729957 3956756 4208431 4504069 4876883 5365134 5976199 6703876 7525019
22377G525019R22666J032881J088224J109141J139755J293106J595548J960655
$$ 7525019 8447685 9480566 10568790 11677931 12817686 14110792 15706340 17666995
22369A7666995K402809K876625L457605M235141N262112O501333P939515R927246
$$ 17666995 20069804 22946429 26404034 30639175 35901287 42402620 50342135 60269381
22361F0269381J2898390J6487744K0267637K4165212K4286696J2465712p956099
$$ 60269381 73167771 89655515 109923152 134088364 158375060 170840772 162884673
22354A62884673k1068862j5502439k279750Q791194J7984351K6198781L3805408
$$ 162884673 141815811 126313372 124033622 132824816 150809167 177007948 210813356
22347B10813356M0282932L4656542L488667l8116091n7923973m3270543k2027928
$$ 210813356 251096288 285752830 289241497 251125406 193201433 149930890 127902962
22340A27902962q003405R69712P245134J2355603J5724926J0538100p464979k7117971
$$ 127902962 119899557 120869269 128114403 140470006 156194932 166733032 159268053 132150082
22332A32150082l2428535k3195004j4025074q841423o137999m627078l504396
$$ 132150082 99721547 76526543 62501469 53660046 47522047 42894969 39390573
22325C9390573k616563j918169j394919j132712j395089j695612j754718j670329
$$ 39390573 36774010 34855841 33460922 32328210 30933121 29237509 27482791 25812462
22317B5812462j558593j380672j191800r85376q31894p35920p61952r20881j096028
$$ 25812462 24253869 22873197 21681397 20696021 19864127 19128207 18366255 17445374 16349346
22308A6349346j153699j066164r58255q86611p91905p19631o60159o00598n79559
$$ 16349346 15195647 14129483 13171228 12284617 11492712 10773081 10112922 9512324 8932765
22299H932765n62237n28531m72544m55895m27256l87720l84699l36519k64990
$$ 8932765 8370528 7841997 7369453 6913558 6486302 6098582 5713883 5377364 5112374
22290E112374k70242k68353k57821k36027j67041j63598j73646j71700j64548
$$ 5112374 4842132 4573779 4315958 4079931 3912890 3749292 3575646 3403946 3239398
22281C239398j37786j02084o0440o6650j7531J7086M1495L4404m5919j56962k34047
$$ 3239398 3101612 2999528 2939088 2872438 2854907 2871993 2913488 2947892 2901973 2745011 2510964
22270B510964j62798o3297n062N6298Q6579J11583J32903J33971k9973k75842
$$ 2510964 2348166 2284869 2279807 2336105 2422684 2534267 2667170 2801141 2771168 2495326
22260B495326l74385k56836j58380j08258m7686N58L3901N8085J8800q6632j98878
$$ 2495326 2120941 1864105 1705725 1597467 1549781 1550339 1584240 1642325 1661125 1574493 1375615
22249A375615k14237j59612q6041m1470o0014m9849m0453m4125j9421o089R499
$$ 1375615 1161378 1001766 915725 874255 814241 764392 723939 679814 660393 654304 663803
22238F63803J2964J0811l5930o3470N527K1301l0861k9618p8058m2938j520L4922
$$ 663803 676767 687578 651648 588178 593705 615006 584145 554527 476469 433531 432011 466933
22226D66933K8787J7045R803R378K5378j0783o5819j00436p7903l7202J7412L1378
$$ 466933 495720 512765 522568 531946 557324 546541 480722 380286 302383 265181 282593 313971
22214C13971L3092L0956P261k1988k8212k0528l8059m8652m8017k0797L4715K2380
$$ 313971 347063 378019 385280 363292 335080 314552 276493 227841 179824 159027 193742 216122
22202B16122R327J2186j0390J4411L9327P963l1004j5479j3277K4667K4139q087
$$ 216122 225449 237635 227245 241656 280983 288946 257942 242463 229186 253853 277992 269905
22190B69905L570K479J5621K7079j7581p887j0158k158J3583K1201o658K714k290
$$ 269905 273475 275954 291575 318654 301073 293186 283028 280870 294453 315654 308996 311710 309420
22177C09420L47l887k1714j9637k841k9004J8665L1801O864k1096M111p826k1330
$$ 309420 309767 305880 284166 264529 261688 232684 251349 283150 290014 268918 273029 265203 243873
22164B43873L796K2349K7386j7062N116J3968k1470N260k0340K1030p622j8793
$$ 243873 247669 270018 297404 280342 285458 299426 277956 283216 262876 283906 276284 257491
22152B57491j7524l075p028J5422j2184k006J9804j5150n961J1681R852K365j2902
$$ 257491 239967 236892 229864 245286 233102 231096 250900 235750 229789 241470 251322 253687 240785
22139B40785j2301l9787L242k7938k6182J060Q915j8435j5265M127n26L987l116
$$ 240785 228484 188697 191939 164001 137819 138879 147794 129359 114094 118221 117695 121682 118566
22126A18566K4465j6668j8525k2556J318Q034k7088K0130J2722j0049J6182J719
$$ 118566 143031 126363 107838 85282 86600 94634 67546 87676 100398 90349 106531 108250
22114A08250j4318k73r102j3333K2456j273K1390N159L489q228m0178j1985p382
$$ 108250 93932 93659 84557 71224 93680 92407 113797 118956 122445 114217 74039 62054 54672
22101E4672P444K064K1679K6908P0q028J5949j6545m8474j5069J4193N47j0583
$$ 54672 62116 64180 85859 112767 112837 104809 120758 104213 55739 40670 54863 55410 44827
22088D4827M431m574J213p515l454J5260j2988J2679M2237J779j8599k9066k7639
$$ 44827 49258 44684 45897 38382 34928 50188 37200 49879 92116 93895 75296 46230 18591
22075A8591K4310j7663m66J2365m36k237p909K5930J9029k1569n573J1322N707
$$ 18591 42901 25238 24772 37137 36701 34464 26555 52485 71514 49945 44372 55694 61401
22062F1401J4113K1740j980k1061q104J0591L5978p539k3113N367k4810k075o857
$$ 61401 75514 97254 95274 74213 66109 76700 112678 105139 82026 87393 62583 60508 53651
22049E3651J6406P857M700p88j588N108j2864j9880M197K5245o522R612J5240
$$ 53651 70057 77914 82614 81826 80238 85346 72482 52602 56799 82044 75522 85134 100374
22036A00374J0479j3210m433n678P619K0448n460k6782l723k1133P632j3837j3302
$$ 100374 110853 97643 93210 87532 95151 115599 110139 83357 79634 58501 66133 52296 38994
22023C8994J3456R702j4779j4400M349J794j588K1862n250J8220J7001m1747O111
$$ 38994 52450 62152 47373 32973 37322 39116 37528 59390 54140 72360 89361 47614 53725
22010E3725J2537J435k9213o047P165p63K1830j4920K507p994j6030R838r387
$$ 53725 66262 67697 38484 32437 39602 38839 60669 45749 48256 40262 24232 34070 24683
21997B4683q341R163p511K345j7738L828L224J4328K047J369J4305k765j9529
$$ 24683 16342 25505 17994 20339 2601 6429 9653 23981 26028 27397 41702 38937 19408
21984A9408k8378k655O82R311J1351J5363j3326k9320J434J3302Q626r26j8966
$$ 19408 -8970 -11625 -10943 -1632 9719 25082 11756 -17564 -16130 -2828 5798 4872 -14094
21971a4094n715o527M25q715k047P077K624r412j45K662J6633K1158K2886J7409
$$ -14094 -19809 -26336 -25911 -34626 -36673 -29596 -26972 -36384 -36529 -33867 -17234 3924 26810 44219
21957D4219J2126R441j7476j9559j6240K798k2269k917J4987q188N23q41q12k4041
$$ 44219 56345 65786 48310 28751 12511 15309 -6960 -9877 5110 -3078 -2555 -3396 -4208 -28249
21943b8249j0095j410R958p662K3135K2701J8123o112j8993k8795k0750K5802
$$ -28249 -38344 -39754 -29796 -37458 -14323 8378 26501 20389 1396 -27399 -48149 -22347
21931b2347k516j7210j9186K8720N2118P134k3163K6040J6164m262j5026k284
$$ -22347 -24863 -42073 -61259 -32539 19579 26713 3550 29590 45754 41492 26466 24182
21919B4182k0135M634k619O801k9601j1271J4611J5628J527R295O278n610k0359
$$ 24182 4047 8681 6062 12863 -16738 -28009 -13398 2230 3757 13052 19330 13720 -6639
21906f639j3519k27J5162K63j9658R278J5666J4362Q71j1757k096K9406J3796
$$ -6639 -20158 -20385 -5223 -4960 -24618 -15340 326 14688 15559 3802 1706 31112 44908
21893D4908k5185j342k0566m822L5406M898j8734n821M367K0425R593J5127L072
$$ 44908 19723 18381 -2185 -7007 28399 33297 14563 8742 13109 33534 43127 58254 61326
21880F1326k5190L461L7826n206k9981j8094j0460N033k6148N779L656R993m635
$$ 61326 36136 39597 77423 72217 42236 24142 13682 18715 -7433 -1654 2002 11995 7360
21867G360j8326R649J3555J9199l1587J0854J2084j933q145M322M897j9135R564
$$ 7360 -10966 -1317 12238 31437 -150 10704 22788 20855 12710 17032 21929 2794 12358
21854A2358r744n856o711J8921k6105n830K894J2300O616m072n471K9873L3747
$$ 12358 2614 -3242 -9953 8968 -17137 -22967 -20073 -7773 -1157 -5229 -10700 19173 52920
21841E2920k4871o507K0853J0996l0005M10J5837j4226j6141J67K3826J4144j679
$$ 52920 28049 21542 42395 53391 23386 23796 39633 25407 9266 9433 33259 47403 45724
21828D5724m684l176k220J1524l658P283J1823k2178k4190k466k427k0757j6547
$$ 45724 41040 37864 35644 47168 43510 50793 62616 40438 16248 13782 11355 -9402 -25949
21815b5949J4431O949p24K8534J728K5862J6452k9277j7282L1157l860q283K370
$$ -25949 -11518 -4569 -5293 23241 24969 50831 67283 38006 20724 51881 48021 39738 42108
21802D2108k299J6647K2243K0676r27j2603J6794K5567K226J8600O4412L8473
$$ 42108 39809 56456 78699 99375 98448 85845 102639 128206 130432 149032 213444 251917
21790B51917M1855Q6940J02692J21239J37052J56388O0751q8126j30038n8422
$$ 251917 293772 380712 483404 604643 741695 898083 958834 870708 740670 682248
21780F82248K2212P0405Q5314J36439J71819K30585J80233k8345k17774k97490
$$ 682248 704460 774865 860179 996618 1168437 1399022 1579255 1550910 1333136 1035646
21770A035646k00501q6092k3031K8817L1985O4606P1690K939o8198j16211j85579
$$ 1035646 835145 749053 726022 754839 786824 851430 923120 926059 857861 741650 556071
21759E56071j28751o7422k3530m9366k3848k1308O042o59l1747p945k6128k1244
$$ 556071 427320 359898 336368 287002 263154 241846 247888 247229 215482 207537 181409 160165
21747A60165m741J2100k4978n2891P758J9921N646q562j0436k0534j612p679k6690
$$ 160165 155424 167524 142546 89655 97413 117334 122980 114418 103982 83448 81836 74157 47467
21734D7467k4452Q186J6309J3392M187p537J113J5477j3705k2979k3753j1097
$$ 47467 23015 31201 47510 60902 65089 57552 58665 74142 60437 37458 13705 2608
21722B608K8188j3140r50R204j0209m22K0020j2863q015k4530J4220M5018K2035
$$ 2608 30796 17656 16706 25910 15701 15279 35299 22436 14421 -10109 4111 49129 71164
21709G1164k0943l322k6302j9257k765k12j5680j664Q3P109J6606J7129J4617
$$ 71164 50221 46899 20597 1340 -1425 -1637 -17317 -18981 -18898 -11789 4817 21946 36563
21696C6563M730K64k8529l0305j6934J5546R804l1170J7536M244j2116K1047Q459
$$ 36563 41293 41557 13028 -17277 -34211 -18665 -8861 -40031 -22495 -18251 -30367 -9320 -861
21683h61k3647k0070O917M4150n04n335j6449k7464k2876P366R896K5233l233
$$ -861 -24508 -44578 -37661 6489 5985 650 -15799 -43263 -66139 -58773 -48877 -23644 -26877
21670b6877P393K0860J0918J4855J966k137J0311j2935q844k5433P769J2043J6828
$$ -26877 -19484 1376 12294 27149 29115 26978 37289 24354 15510 -9923 -2154 9889 26717
21657B6717o257k1983k9026K3758K0448m391n624m48K904J5090j5606l881M234
$$ 26717 20460 -1523 -30549 -6791 13657 9266 3642 3194 6098 21188 5582 1701 5935
21644E935R591L592q997N373j4980l3482O279K2597O961m641J1075p486r950P69
$$ 5935 15526 19118 10121 15494 514 -32968 -26689 -4092 2869 -1772 9303 1817 -8133 -7364
21630g364J9695k701p513M715J2319o842p255o282r785J1136m237j6002J2469
$$ -7364 12331 9630 2117 6832 19151 12309 5054 -1228 -11013 123 -4114 -20116 -7647
21617g647N210o984j3678M70j439O983K2817L0431M178k6342j5274k0629j0647
$$ -7647 -2437 -9421 -23099 -22629 -24068 -17085 5732 36163 40341 13999 -1275 -21904 -32551
21604c2551k028J9077K102j1556L891j7174j870J0949l187j0854K8684j2452N256
$$ -32551 -34579 -15502 -13400 -24956 -21065 -38239 -40109 -29160 -32347 -43201 -14517 -26969 -21713
21591b1713m989j9332O899J5978j285J645J8532J1203J9883J1063k4882j213m0239
$$ -21713 -26702 -46034 -39135 -23157 -24442 -22797 -4265 6938 26821 37884 13002 11789 -28450
21578b8450k2935K9997O990P833O52j4003O117J1727l8690p120K1542j742k1599
$$ -28450 -51385 -21388 -14398 -6565 -5913 -19916 -13799 -2072 -40762 -47882 -26340 -28082 -49681
21565d9681R523J1968j3820j5501J9469j9103J0436K435K0714j2460l5241o56
$$ -49681 -40158 -28190 -42010 -57511 -38042 -57145 -46709 -44274 -23560 -36020 -71261 -71917
21553g1917K8482L4169M2896l136k0671J2218J588Q161l898j2239l7038l2565
$$ -71917 -43435 -9266 33630 30494 9823 22041 23629 31790 27892 15653 -21385 -53950
21541e3950K9538M4117Q492j1097l0170j7035J3029J1549Q75j7708J5655j0278
$$ -53950 -24412 19705 28197 17100 -13070 -30105 -17076 -5527 -4652 -22360 -6705 -16983
21529a6983j1431n028J2469K1269P614k7427J379J2453k5940J0511K5333j9767
$$ -16983 -28414 -33442 -20973 296 7910 -19517 -18138 -5685 -31625 -21114 4219 -15548
21517a5548j900o646J8342O734J0681J9291Q894k3655m5612J2204K2317k5839
$$ -15548 -17448 -24094 -5752 982 11663 30954 39848 16193 -29419 -17215 5102 -20737
21505b0737j968j4486q434K7850J0336J0830k316q019j1011j5648n13R79J9689
$$ -20737 -22705 -37191 -45625 -17775 -7439 3391 1075 -6944 -17955 -33603 -34116 -33137 -13448
21492a3448m046m429K1110K7205j3876q010K351J720m135l2825L964q665l20M080
$$ -13448 -17494 -21923 -813 26392 12516 4506 6857 8577 4442 -28383 -24419 -33084 -33404 -29324
21478b9324m174j1427K2622Q871Q400j6898K450N0732j790Q943l7774j7316j013
$$ -29324 -33498 -44925 -22303 -13432 -5032 -21930 -19480 31252 29462 38405 631 -16685 -17698
21465a7698O738L535K8672Q932k6419J293L9235j2607n559j5579l7842j3959K901
$$ -17698 -10960 -7425 21247 30179 3760 5053 44288 31681 26122 10543 -27299 -41258 -38357
21452c8357J3061K0757K899K957r035k7546k0539K5206J8382J4498N589J1802
$$ -38357 -25296 -4539 -1640 1317 -7718 -35264 -55803 -30597 -12215 2283 7872 19674
21440A9674q757l3248K493J3505J865M485j1247j2743K5478k3372k0765O473j0598
$$ 19674 10917 -22331 -19838 -6333 -4468 17 -11230 -23973 1505 -21867 -42632 -36159 -46757
21427d6757K9432K7985M370k5392r051R827J7074R72q328L0477O344j7891m872
$$ -46757 -17325 10660 15030 -10362 -19413 -9586 7488 8460 132 30609 36953 19062 14190
21414A4190o561R280J2125j727N060l373N074k438J1517j2308j5181j16k2871
$$ 14190 7629 16909 29034 27307 32367 28994 34068 31630 43147 30839 15658 15542 -7329
21401g329k4949L764p659l981M3407M7601L1487O277k6468k8147k0394l5340M47
$$ -7329 -32278 -28514 -36173 -40154 3253 50854 82341 88618 62150 34003 13609 -21731 -21284
21388b1284l45R701L1302J0548j9445j9302l2558K5682J8439J6586k198j1642
$$ -21284 -21629 -11928 19374 29922 10477 -8825 -41383 -15701 2738 19324 17126 5484
21376E484j09K307K73L581o219o786l4260J478J7268m732J1511M47l800k6908
$$ 5484 5375 7682 7955 11536 5317 -1469 -35729 -34251 -16983 -21715 -10204 -9757 -13557 -40465
21362d0465J6101K3120J6188Q836k8446q943M463l636k5817J1562J0416j4310
$$ -40465 -24364 -1244 14944 23780 -4666 -13609 -9146 -12782 -38599 -27037 -16621 -30931
21350c0931o963L8898j3878M266K1306O053R772k1615j201j0915J2798K5741N51
$$ -30931 -37894 1004 -12874 -8608 12698 18751 28523 6908 5707 -5208 7590 33331 33882
21337C3882k9678j6710m590k1008k7630J6552J9316l838j4229J3259P638J204
$$ 33882 4204 -12506 -17096 -38104 -65734 -49182 -29866 -33704 -47933 -34674 -27036 -25832
21325b5832K3070j3701j0490P880l821m213l1673j0593N664J9635O552J5250j368
$$ -25832 -2762 -16463 -26953 -19073 -22894 -27107 -58780 -69373 -63709 -44074 -37522 -22272 -23640
21312b3640j4649J0812J5018J745K7413M0152j9376m3164l1552R61K7092J8507
$$ -23640 -38289 -27477 -12459 -10714 16699 56851 37475 -5689 -37241 -36280 -9188 9319
21300I319J646j171j6592k3592j7618l506R245L29J8871Q969k884k885q208R755
$$ 9319 10965 9794 -6798 -30390 -48008 -51514 -42269 -41940 -23069 -14100 -16984 -19869 -28077 -18322
21286a8322J9327j1695L342o362k80J7129P110m189O245R071q729o572o16J3781
$$ -18322 1005 -10690 -7348 -13710 -13990 3139 10249 6060 12305 21376 12647 6075 5459 19240
21272A9240j2240j0833R67r692O636j5701k6899j049o088j1323L2320K8886J4348
$$ 19240 7000 -3833 -2866 -12558 -5922 -21623 -48522 -49571 -55659 -66982 -34662 -5776 8572
21259H572l4413l1118q405K8444L0471p428j9425J8704o823j8266q697n15J1927
$$ 8572 -25841 -56959 -65364 -36920 -6449 -13877 -33302 -14598 -21421 -39687 -48384 -48899 -36972
21246c6972J1861r758k2925j3057J3579L791J1654n460j5686J5671K2708R590
$$ -36972 -25111 -34869 -57794 -70851 -57272 -53481 -41827 -47287 -62973 -47302 -24594 -15004
21234a5004j2974K6398J592L713j1180j9443O880R25q34j6563J7713P876J887
$$ -15004 -27978 -1580 12 3725 -7455 -26898 -20018 -19093 -19927 -36490 -18777 -10901 -9014
21221i014J4278J1622M316j7168k8998k6093K1402K0255Q603j8453n967K946P741
$$ -9014 5264 16886 21202 4034 -24964 -51057 -29655 -9400 -797 -19250 -25217 -22271 -14530
21208a4530Q783K0804j7506k4784j3871J8657K8788m434q818k3870L197K2424
$$ -14530 -5747 15057 -2449 -27233 -41104 -22447 6341 1907 -6911 -30781 -27584 -5160
21196e160q809j1976K5303M7l1951Q143K8978q338j5281j7166q468J4424j988
$$ -5160 -13969 -25945 -642 -595 -32546 -24403 4575 -3763 -19044 -36210 -44678 -30254 -32242
21183c2242L0521O071P897j2981L442p66k2137L990L9078j881k9157J952K3634
$$ -32242 -1721 4350 12247 -734 2708 1942 -20195 -16205 22873 20992 -8165 -6213 17421
21170A7421l0928j1043L6674Q150k1982j4511j5611K296l092m600J4890L992k545
$$ 17421 -13507 -24550 12124 20274 -1708 -16219 -31830 -29534 -32626 -37226 -22336 -18344 -20889
21157b0889j7675j2921L2312J6848p688k7317J7726J2170J6073q616n4375j5415
$$ -20889 -38564 -51485 -19173 -2325 -10013 -37330 -19604 -7434 8639 23 -54352 -69767
21145f9767K6589K3544O844Q225K3622q878m32L795j0605J2441K8378q610j3507
$$ -69767 -43178 -19634 -12790 -4565 19057 10179 9747 13542 2937 15378 43756 35146 21639
21132B1639j5158k8499j4703O606L582k2750n326k664P322M121L1525J11J1338
$$ 21639 6481 -22018 -36721 -30115 -26533 -49283 -54609 -57273 -49951 -45830 -14305 -14194 -2856
21119b856n89k664J1631j302l118n2686j6874J5853K1028J6262j314P567k714
$$ -2856 -3445 -6109 5522 4220 1102 -51584 -68458 -52605 -31577 -15315 -16629 -9062 -11776
21106a1776l19q912K7062P340L994k439j1258l1965j8960l1521M254K6361J4891
$$ -11776 -12095 -21007 6055 13395 17389 14950 3692 -28273 -47233 -78754 -74500 -48139 -33248
21093c3248N930O687j754K5898J1538P58p106O461M249O645j4889k8668j0832
$$ -33248 -27318 -20631 -22385 3513 15051 15809 8703 15164 19413 26058 11169 -17499 -28331
21080b8331J8150r010l4426J7346L2650J7731k306j7395n221p760j6007J1420
$$ -28331 -10181 -19191 -53617 -36271 -3621 14110 11804 -5591 -10812 -18572 -34579 -23159
21068b3159J4479J3697q120k1707J363J2404L0058j9393J329Q061q947j8808J3002
$$ -23159 -8680 5017 -3103 -24810 -23447 -11043 19015 -378 951 9012 65 -18743 -5741
21055e741J8643K8654j910j1588r99n378k2510j1367K9330j432q767k2469M942
$$ -5741 12902 41556 39646 28058 27059 21681 -829 -12196 17134 15702 6935 -15534 -10592
21042a0592k4561k2307O637J4617j0829K5504K2508J1794j5112k3654J359J3479
$$ -10592 -35153 -57460 -50823 -36206 -47035 -21531 977 12771 -2341 -25995 -24636 -11157
21030a1157J4841L3297l1336j7637n613P8J4481p419K639K4041P856k0985m0311
$$ -11157 3684 36981 5645 -11992 -17605 -17527 -3046 -10465 -7826 16215 24071 3086 -37225
21017c7225J4954L1556k117K072m12j9836j289R547M472o530r939J638K2787J7186
$$ -37225 -22271 9285 7168 9240 8828 -11008 -12297 -2750 1722 -4808 -14747 -13109 9678 26864
21003B6864j0368j7987m645N664l795K52L574j0898j6205j4728J2394L2907q240
$$ 26864 16496 -1491 -6136 -472 -4267 -4015 -441 -11339 -27544 -42272 -29878 3029 -5211
20990e211k97K4306J0571j733P11L360J0385j8700l3299q715p255p228K8278K3897
$$ -5211 -5508 18798 29369 27636 28347 31707 42092 23392 -9907 -18622 -25877 -33105 -4827 19070
20976A9070j4861m050m357l822k5851J880N255M0888K3332J1453k3851l2314k3400
$$ 19070 4209 159 -4198 -8020 -33871 -31991 -26736 14152 37484 48937 25086 -7228 -30628
20963c0628J9195j1304j6649J1736N248L5924j4477p019J207M486j7996J3944
$$ -30628 -11433 -22737 -39386 -27650 -22402 13522 -955 -7974 -6767 -2281 -20277 -6333
20951f333K3111L3219R696j3326k3423o908m3298J1366M279J4587J3092p183j8872
$$ -6333 16778 49997 59693 46367 22944 16036 -27262 -15896 -11617 2970 16062 8879 -9993
20938i993K2440j3764k984p99j1214J6627J2215k7641K8384r456k9102j5637K189
$$ -9993 12447 -1317 -4301 -5100 -16314 313 12528 -15113 13271 3815 -25287 -40924 -38735
20925c8735M2906R17Q859R988r571j8811j1789j1496Q498M70k4415J3496K1688
$$ -38735 4171 5088 13947 23935 14364 -4447 -16236 -27732 -19234 -18764 -43179 -29683 -7995
20912g995j324n237K1832o273J2484m590j9101m304J5043K178n911j1144n103
$$ -7995 -9319 -14556 7276 1003 13487 8897 -10204 -14508 535 2713 -3198 -14342 -19445
20899a9445q416Q940L227k005j5691K960j611J3056J0984o727k3706l963j7876
$$ -19445 -27861 -18921 -15694 -17699 -33390 -30430 -32041 -18985 -8001 -14728 -38434 -42397 -60273
20886f0273r245K5264J4608J5538J7448R273J4235j071l2965Q306K409M246j6843
$$ -60273 -69518 -44254 -29646 -14108 3340 12613 26848 25777 -7188 1118 3527 7773 -9070
20873i070l5404l4599K470L1005qo345J0174p422O540M881K2849k6193P432J725
$$ -9070 -44474 -79073 -76603 -45598 -45606 -51951 -41777 -49199 -42659 -37778 -14929 -41122 -33690 -31965
20859c1965J7350K3360J4281j8026p979j0508k723j7387r857o875l859M2664K9184
$$ -31965 -14615 8745 23026 5000 -2979 -13487 -16210 -33597 -43454 -50329 -54188 -11524 17660
20846A7660Q27k881k3811m0700j4215L3628J7097N911n943p509J9335J7863k0000
$$ 17660 18487 15606 -8205 -48905 -63120 -29492 -12395 -6484 -12427 -19936 -601 17262 -2738
20833b738k3641J4309k28K22R107J8386k7103K577K0560j0077j1644J1892P541
$$ -2738 -26379 -12070 -12298 -12076 -2969 15417 -11686 -9109 11451 1374 -10270 1622 9163
20820I163J119j9652j3467K0318N434j0692r576O92L3739M268n375q26J4616J921
$$ 9163 10282 -9370 -22837 -2519 2915 -7777 -17353 -16661 17078 21346 15971 15145 29761 31682
20806C1682l7698q004K901J0913L2591J0733o237l4791J198Q110l590j1322k4176
$$ 31682 -6016 -14020 -11119 -206 32385 43118 36881 2090 3288 11398 7808 -3514 -27690
20793b7690J5189J8169N474K6233M376l7562m439j1475j6584j1218J8599K1482
$$ -27690 -12501 5668 11142 37375 41751 4189 -250 -11725 -28309 -39527 -20928 554
20781E54J2495N989j3417j0854J3528o579j7513j3390J3257K5910l048j8242N445
$$ 554 13049 19038 5621 -5233 8295 1716 -15797 -29187 -15930 9980 6932 -11310 -5865
20768e865L3783J0941l3381j4421q562J0845j900J1868J005o861j325p802n465
$$ -5865 27918 38859 5478 -8943 -17505 -6660 -8560 3308 4313 -2548 -3873 -11675 -17140
20755a7140J7930R732J4976M176k580k8045j5240j3622L562n622m7322M27R324
$$ -17140 790 10522 25498 29674 27094 -951 -16191 -29813 -26251 -31873 -79195 -78768 -69444
20742f9444M93K2971K6185L4136J9700K9063o357j4613m721k8184m085R71j9520
$$ -69444 -68951 -45980 -19795 14341 34041 63104 56747 42134 37413 9229 5144 6115 -13405
20729a3405J3554l996l108J833J6194m603k3923K1238Q366j4913k2772k646j2844
$$ -13405 149 -3847 -6955 -5122 11072 6469 -17454 3784 12150 -2763 -25535 -28181 -41025
20716d1025Q512K8731R16j3024o248k0965J8261r58J7290N311j1565m89K0023
$$ -41025 -32513 -3782 -2866 -15890 -22138 -43103 -24842 -25800 -8510 -3199 -14764 -15253 4770
20703D770l017K388N735j200o322j8410J768j2776P91K2748o063K476N653J2038
$$ 4770 1753 4141 9876 8676 2354 -16056 -14288 -27064 -26273 -3525 -9588 -7112 -1459 10579
20689A0579M357Q372K822m622j6521J813j1729M882k873Q269k3506k6179j0106
$$ 10579 14936 23308 26130 21508 4987 6800 -4929 -47 -2920 5349 -18157 -44336 -54442
20676e4442K6964R378o57j4711m092Q063K5679K119k7132O336K514j3137k7730
$$ -54442 -27478 -18100 -18757 -33468 -37560 -29497 -3818 -1699 -28831 -22495 -19981 -33118 -60848
20663f0848P522p799J0287J2307J7078J3715J6751J8896N43j5370O864l0552j7705
$$ -60848 -53326 -61125 -50838 -38531 -21453 -7738 9013 27909 28452 13082 19946 -10606 -28311
20650b8311J6733K120q227j276q965k944O44N41K5612K9099j0667l3563J8402
$$ -28311 -11578 -9458 -17685 -18961 -27926 -30870 -30226 -29685 -4073 25026 14359 -19204 -802
20637h02J2019j2246K422j010o792L4507m82K0386J3683k3166j4516j1537n120
$$ -802 11217 -1029 1393 383 -6409 28098 27616 48002 61685 38519 24003 12466 7346
20624G346j1764K3538m371o70J2559j6172r694l164R481j7964k704j791K759J2306
$$ 7346 -4418 19120 14749 14079 26638 10466 772 -2392 7089 -10875 -13579 -15370 -12611 -305
20610c05k3443N85j644O969K1630K2107o705j4111J4466J5196K1534j1835q311
$$ -305 -23748 -23163 -24807 -17838 3792 25899 19194 5083 19549 34745 56279 44444 36133
20597C6133p039m733j7118k969q008k5978k005k030r485o871M170j5483J139N850
$$ 36133 29094 24361 7243 4274 -3734 -29712 -31717 -33747 -43232 -50103 -45933 -61416 -60277 -54427
20583e4427J9105L9778L273K2392p464l4763j133J9304j425J6056L881L189j4099
$$ -54427 -35322 4456 7729 30121 22657 -12106 -13239 6065 4640 20696 24577 27766 13667
20570A3667n6984M382N1393J1702k5989k6229J3590o829P435J0674l137k04O269
$$ 13667 -43317 -38935 12458 24160 -1829 -28058 -14468 -21297 -13862 -3188 -6325 -6529 -260
20557b60q641J986n146J5697j2997j5126k2003K0755K2726o417p937m325K4062
$$ -260 -8901 -6915 -12061 3636 -9361 -24487 -46490 -25735 -3009 -9426 -17363 -21688 2374
20544B374O055o143k1097n412J2723j0178j0913l30l754R369N235J2721m263P796
$$ 2374 8429 2286 -18811 -24223 -11500 -21678 -32591 -32921 -36675 -27306 -22071 -9350 -13613 -5817
20530e817K493j6845j2432J8468J4661L933o87l0270o621o764N772J7942K1278
$$ -5817 -3324 -20169 -32601 -14133 528 4461 3774 -26496 -33117 -39881 -34109 -16167 5111
20517E111J0383J0515k3743n737J5823K4233m257l6344r641Q698M496r605K0458
$$ 5111 15494 26009 2266 -3471 12352 36585 32328 -4016 -13657 -4959 -463 -10068 10390
20504A0390K8302r176k941J096o231J3848j5254r972k3692o018J5606J560j2437
$$ 10390 38692 29516 26575 27671 21440 35288 20034 10062 -13630 -19648 -4042 -2482 -14919
20491a4919k264J3842J4995p783k1024j0346k3698J5281K8468K016J4642j8046
$$ -14919 -17183 -3341 11654 3871 -17153 -27499 -51197 -35916 -7448 -5432 9210 -8836
20479h836l3346K0567M296J0851J578j8210p94M0570m174j7773L822j0399j334
$$ -8836 -42182 -21615 -17319 -6468 -4890 -23100 -23894 16676 12502 -5271 -1449 -11848 -13182
20466a3182J1830L6917k6934j7075P525k681n603j0145n969Q554q397k013J5157
$$ -13182 -1352 35565 8631 -8444 -919 -3600 -9203 -19348 -25317 -16763 -25160 -27173 -12016
20453a2016j334j4471Q387Q730j5990o122Q248j2578j1954R955J2495O934J4400
$$ -12016 -13350 -27821 -19434 -10704 -26694 -32816 -24568 -37146 -49100 -39145 -26650 -19716 -5316
20440e316j3054J5389K0036q217k2622j1107J8091q179j2251j2233L1091j5841
$$ -5316 -18370 -2981 17055 8838 -13784 -24891 -6800 -14979 -27230 -39463 -8372 -24213
20428b4213n212J4530J7621j9277K953J5946n434j621j2667k3291K129O061R296
$$ -24213 -29425 -14895 2726 -16551 -13598 2348 -3086 -4707 -17374 -40665 -38536 -32475 -23179
20415b3179J8391L398j4575j3164J1643q809j3958n544q511P639P253K4785j5660
$$ -23179 -4788 -1390 -15965 -29129 -17486 -26295 -40253 -45797 -54308 -46669 -39416 -14631 -30291
20402c0291q154K1804j1677m431L2361J7591J826j5328j9287j1459K0288M416
$$ -30291 -38445 -16641 -28318 -32749 -388 17203 19029 3701 -15586 -27045 -6757 -2341
20390b341j2470j4653j0205O935O485L3644K9901J1435j2346J1520p750k8811
$$ -2341 -14811 -29464 -39669 -32734 -26249 7395 37296 48731 36385 47905 40155 11344
20378A1344l8356j3134l3559K4232J4913k661J1827r441J7256J6307Q37Q519j3038
$$ 11344 -27012 -40146 -73705 -49473 -34560 -37221 -25394 -34835 -17579 -1272 -435 8084 -4954
20365d954M713J3642n529J6466J6100K666J3184j9556k1975k7383j8989K6519
$$ -4954 -241 13401 7872 24338 40438 43104 56288 36732 14757 -12626 -31615 -5096
20353e096K6318n476R212r498r620l420j2924j765R644J383O324r341l112l191
$$ -5096 21222 15746 24958 15460 5840 2420 -10504 -12269 -2625 -1242 5082 -4259 -7371 -10562
20339a0562j5505j2937q296M313l47K4757j3300k9596K9048K2773N541k304j6232
$$ -10562 -26067 -39004 -47300 -42987 -43334 -18577 -31877 -61473 -32425 -9652 -4111 -6415 -22647
20326b2647j0814J3505K0985j3809K58l047L0012L7418m165k8448J614J0459k1618
$$ -22647 -33461 -19956 1029 -12780 -12522 -15569 14443 51861 47696 19248 20862 31321 9703
20313I703l0769R272M237K0510r48l3789L038K9436j5650K2780J3331j9367K0416
$$ 9703 -21066 -11794 -7557 12953 12005 -21784 -18746 10690 -4960 17820 31151 11784 32200
20300C2200j925M428j6078j3077L854J769m946J6993r213J7786j9429l070J1418
$$ 32200 30275 34703 18625 5548 9402 11171 6225 23218 14005 31791 12362 9292 20710
20287B0710J1466J8130K5327R58r761n076j2660m4067O76M757J0843J9507n690
$$ 20710 32176 50306 75633 76591 66830 61754 49094 5027 5703 10460 21303 40810 35120
20274C5120k4884o620J0913J0385r244L689r180k6500o890p298j3340K3093J382
$$ 35120 10236 3616 14529 24914 15670 19359 10179 -16321 -23211 -30509 -43849 -20756 -19374
20261a9374j4995k3903l78L1369J3501j1353j5237J5411J0478M007J2561J9489
$$ -19374 -34369 -58272 -58650 -27281 -13780 -25133 -40370 -24959 -14481 -10474 2087 21576
20249B1576j8119J7280j9308k5065k1231M033J5998J2371j4568k5987k2751n632
$$ 21576 3457 20737 1429 -23636 -44867 -40834 -24836 -12465 -27033 -53020 -75771 -81403
20237h1403N049K0182K6867K9017j651j0745k0512k9440M710J3998K5842R038
$$ -81403 -76354 -56172 -29305 -288 -1939 -12684 -33196 -62636 -57926 -43928 -18086 -9048
20225i048j7108P770K0120N363k2632k1447l52J897o234J3757k581Q839L057N723
$$ -9048 -26156 -18386 1734 7097 -15535 -36982 -37334 -35437 -41671 -27914 -30495 -21656 -18599 -12876
20211a2876l175J7706L6387P260k5647M005K1882J1283k7316k7012l5293l0593
$$ -12876 -16051 1655 38042 45302 19655 23660 45542 56825 29509 2497 -32796 -63389
20199f3389K1442K2117k734j2420J2510J5300j744j8618J5023J2118L059J4642
$$ -63389 -41947 -19830 -22564 -34984 -22474 -7174 -8918 -27536 -12513 -395 2664 17306
20187A7306J4921L296j7688j9596J2654Q556k0524m342r048q913M62k5121j7461
$$ 17306 32227 35523 17835 -1761 10893 19449 -1075 -5417 -14465 -23378 -22916 -48037 -65498
20174f5498K995P935O429J6771Q628j0909m768J044j0911j8378L705K0041M0811
$$ -65498 -62503 -54568 -48139 -31368 -22740 -33649 -38417 -37373 -48284 -66662 -62957 -42916 -2105
20161b105J3397k742k2595N190R639p8o54K5866J0612k05j2569n442j1250j3486
$$ -2105 11292 8550 -14045 -8855 784 706 52 25918 36530 36325 23756 18314 7064 -6422
20147f422k516k362n894j0212r531K691K4375L4079q07j6905j4599j5356R003
$$ -6422 -8938 -11300 -17194 -27406 -36937 -34246 -9871 24208 23401 6496 -8103 -23459 -14456
20134a4456k5631m676M0273j4177O758K1926j0283q99k4325N332M3532J7751n930
$$ -14456 -40087 -44763 -4490 -18667 -11909 10017 -266 -1165 -25490 -20158 23374 41125 35195
20121C5195j8162M309J7524j9573j9695R131K6762J2706j5029r120l3944j1691
$$ 35195 17033 21342 38866 19293 -402 8729 35491 48197 33168 24048 -9896 -21587
20109b1587P509n935l94L559J3046N153q122K7913j9569r947j1140P883J4253
$$ -21587 -14078 -20013 -20407 -16848 -3802 1351 -6771 21142 1573 -8374 -19514 -11631 2622
20096B622Q685j1664o937J1273k061r576K474J8371j4361k0010K8963P916k6658
$$ 2622 11307 -357 -7294 3979 1918 -7658 -5184 13187 -1174 -21184 7779 15695 -10963
20083a0963j6566M160q006j7499P300J9707R691R519O081J6507J801j6900J208
$$ -10963 -27529 -23369 -31375 -48874 -41574 -21867 -12176 -2657 3424 19931 21732 4832 6040
20070F040j949L122k8723K703M866J2295m065j0804n62k191J5272o140k4833K0545
$$ 6040 4091 7213 -21510 -18807 -13941 -1646 -5711 -16515 -17077 -19268 -3996 -10136 -34969 -14424
20056a4424Q666m832l134L4995j803j0542l293J7749J4669o778n213j5954j3455
$$ -14424 -5758 -10590 -13724 21271 19468 8926 5633 23382 38051 31273 26060 10106 -3349
20043c349P218N406P17J2199K437k3166k1790j1036J9438K707N741K2379j5220
$$ -3349 3869 9275 9992 22191 24628 1462 -20328 -31364 -11926 -9219 -3478 18901 3681
20030C681j7567O421J6238J2361p303l252J8941L396m3278m826J2461j0750O700
$$ 3681 -13886 -7465 8773 21134 13831 10579 29520 32916 -10362 -15188 -2727 -13477 -6777
20017f777l95J627j2582l6758k9923R896L8008J2651J4449L5091l0855k8492p009
$$ -6777 -7172 -5545 -18127 -54885 -84808 -74912 -36904 -24253 -9804 25287 -5568 -34060 -41069
20004d1069R706K9570K7991K860P740k4216k1379m288p911J4614j1343J5071M2151
$$ -41069 -31363 -1793 26198 29058 36798 12582 -8797 -13085 -20996 -6382 -17725 -2654 39497
19991C9497N852k1421k3972l7141J4173R680R107m415j5242k52J3827N0608j863
$$ 39497 45349 23928 -44 -37185 -23012 -13332 -4225 -8640 -23882 -24134 -10307 40301 38438
19978C8438l7982Q305K043O742j3647J540k8168P364J7193m90J4404L1570J4167
$$ 38438 456 8761 10804 17546 3899 5439 -22729 -15365 1828 1338 15742 47312 61479
19965F1479k2112j8030o908p890J5584r768J1678r372J811K1612k5910o951J9583
$$ 61479 39367 21337 14429 6539 22123 12355 24033 14661 16472 38084 12174 5223 24806
19952B4806Q237q790n259J0922j6801p761J318K7319K4685j40p236l2374K3496
$$ 24806 33043 24253 18994 29916 13115 5354 6672 33991 58676 58536 51300 18926 42422
19939D2422J667m993J0664J5217J2714j9885j9427j9400j5793l200K1564J248
$$ 42422 44089 39096 49760 64977 77691 57806 38379 18979 3186 -14 21550 22798
19927B2798m40K0119k0451J8029K5231j4995n426J4931k9453j9205j1031n539
$$ 22798 22358 42477 22026 40055 65286 50291 44865 59796 30343 11138 107 -5432
19915e432L286J4692J6568O461k3943q612l335j4741r47K0229J2856q04R593l003
$$ -5432 -2146 12546 29114 35575 11632 3020 -315 -15056 -16003 4226 17082 16278 25871 22868
19901B2868p108j5061j8126L716P190o874J7652O867J6724L786J7332l031o585
$$ 22868 15760 699 -17427 -13711 -6521 -13395 4257 11124 27848 31634 48966 45935 39350
19888C9350m622o313N413J734l760j8428k5821j0089j7813k882J3610Q009Q466
$$ 39350 34728 28415 33828 35562 31802 13374 -12447 -22536 -40349 -43231 -29621 -21612 -13146
19875a3146J1779k2842J8196o550J7875K3580J8583J3024j5685q662j7868R106
$$ -13146 -1367 -24209 -6013 -12563 5312 28892 47475 60499 44814 36152 18284 27390
19863B7390P566k3345j6580n496K417L425K6105J4577l7212k8579J5988K5679
$$ 27390 34956 11611 -4969 -10465 -8048 -4623 21482 36059 -1153 -29732 -13744 11935
19851A1935k6122j2765J4404K4251j4086J1706k42O684q573j384K6194j3566l987
$$ 11935 -14187 -26952 -12548 11703 -2383 9323 9081 15765 7192 5808 32002 18436 14449
19838A4449O363m724j1002K879j5705k8944L0673R384l8426j037L6908L4990J4380
$$ 14449 20812 16088 5086 7965 -7740 -36684 -6011 3373 -35053 -36090 818 35808 50188
19825E0188K0787j5196k5026m0398J4629r428n461L8121j2163j2115o563n540
$$ 50188 70975 55779 30753 -9645 4984 -4444 -9905 28216 16053 3938 -2625 -8165
19813h165j3290J9037J3051J8152M480k2126k9041k2476o630J5894J0058R13P354
$$ -8165 -21455 -2418 10633 28785 33265 11139 -17902 -40378 -47008 -31114 -21056 -20143 -12789
19800a2789j1980l6157J0039K4356J2844K6025P187j5690m2246R206J9905J6013
$$ -12789 -24769 -60926 -50887 -26531 -13687 12338 19525 3835 -38411 -29205 -9300 6713
19788F713r439P424j881j0593J4765n552k1102J1659j3534P15M080j0118N534
$$ 6713 -2726 4698 2817 -7776 6989 1437 -19665 -8006 -21540 -20825 -16745 -26863 -21329
19775b1329M108j1299L2049K8566J5974K953p148j5862J2632q411m467j3634j9632
$$ -21329 -17221 -28520 3529 32095 48069 51022 43874 28012 40644 32233 27766 14132 -5500
19762e500l046L1629J4001o74J7049n905Q18n887j1097n906p868m570j2724j8554
$$ -5500 -8546 23083 37084 36410 53459 47554 48372 42485 31388 25482 17614 13044 320 -18234
19748a8234p478J8770J7870N343J6564j157m183J0965J7562K0710k0738l762r444
$$ -18234 -25712 -6942 10928 16271 32835 31678 27495 38460 56022 76732 55994 52232 42788
19735D2788k8797n541N11K511J1605J1276k954l4207J2964J3052j8148l486j1875
$$ 42788 13991 8450 8961 11472 23077 34353 31399 -2808 10156 23208 5060 1574 -10301
19722a0301J0N901K5021K307P088K1725J0969L165j0556n7362m779K0446j2956
$$ -10301 -10291 -4390 20631 22938 30026 51751 62720 65885 55329 -2033 -6812 13634 678
19709F78j5250l230J8125J6291q732m791j9732j0998j2921j5057J7395K8156K2894
$$ 678 -14572 -17802 323 16614 7882 3091 -16641 -27639 -40560 -55617 -38222 -10066 12828
19696A2828J2823q443k778j600N495J3827n855l8979P547M0802M028k5718j0312
$$ 12828 25651 17208 14430 12830 18325 32152 26297 -12682 -5135 35667 39695 13977 3665
19683C665M870J316K2928j3764j1992J665p244N665j9504J5654K0429j5404j6680
$$ 3665 8535 9851 32779 19015 7023 8688 1444 7109 -12395 3259 23688 8284 -8396
19670h396M583J5026r930J291N737J7909K293k5550L334L6375n05L539l1348p985
$$ -8396 -3813 11213 1283 2574 8311 26220 28513 2963 6297 42672 42167 45706 14358 6373
19656F373o157k0719J7355Q193L770J2606j1929j8821j6494k0493K6136J4552
$$ 6373 216 -20503 -3148 5045 8815 21421 9492 -9329 -25823 -46316 -20180 -5628
19644e628J5361J1656J5618p764j1464O133k006j3572j6618k725J1781k046j5977
$$ -5628 9733 21389 37007 29243 17779 23912 21906 8334 -8284 -11009 772 -1274 -17251
19631a7251k4921P534K5068K1128j0460k3861K787j2734J51J8316N426l93K795
$$ -17251 -42172 -34638 -9570 11558 1098 -22763 -19976 -32710 -32559 -14243 -8817 -9210 -6415
19618f415Q638P012K1925K725k2604R169J443R361k0277r699K52O150J0549j9251
$$ -6415 2223 9235 31160 33885 11281 20450 21893 31254 10977 1278 1530 7680 18229 -1022
19604a022j7811o674K7511J609K1250m645n646J5223k984j5752P812j1676j5666
$$ -1022 -18833 -25507 2004 3613 24863 20218 14572 29795 26811 11059 18871 7195 -8471
19591h471R499K0527l883J5647l52j2601j2632K7561J2223l0200j0154K6614J0854
$$ -8471 1028 21555 17672 33319 32967 20366 7734 35295 47518 17318 7164 33778 44632
19578D4632N074j1251k8448J007q012j3948K9346N288N431m588J7186K348j302
$$ 44632 49706 38455 10007 11014 3002 -10946 18400 23688 29119 24531 41717 44065 42763
19565D2763j8493k2794K5731l455J4866j0425l4059j4688J3002j0191K4558N488
$$ 42763 24270 1476 27207 23752 38618 28193 -5866 -20554 -7552 -17743 6815 12303
19553A2303K029N027k1082J0103p233J7622O831J453J1430M1087N581l9625l8291
$$ 12303 14332 19359 -1723 8380 1147 18769 25600 27053 38483 79570 85151 45526 7235
19540G235l4942k1489L455J3005L8491M3731j7534l8610o703K3263K1912N229
$$ 7235 -27707 -49196 -45741 -32736 5755 49486 31952 -6658 -13361 9902 31814 37043
19528C7043K5319k7384j8194K3314P254k0258J0047j0312P357L3899J7171q635
$$ 37043 62362 34978 16784 40098 47352 27094 37141 26829 34186 68085 85256 76621
19516G6621L0Q785p258m9155k5657M467l831j1681p963K9804L1813j2863m5091
$$ 76621 76651 85436 78178 29023 3366 7833 4002 -7679 -15642 14162 45975 33112 -11979
19503a1979J1663O291L8543M8596k9992k0284R727K1341l8585k5867k5643j3166
$$ -11979 -316 5975 44518 93114 63122 42838 52565 73906 35321 9454 -16189 -29355
19491b9355L900j336K2088K8255J6283p145j9682j6347N953o721k929L3623m707
$$ -29355 -25455 -26791 -4703 23552 39835 32690 13008 -3339 2614 -4107 -7036 26587 21880
19478B1880l4535j3119l322L1531K0893m081o143L8512K4675N15K308j5783j2707
$$ 21880 -12655 -25774 -29096 2435 23328 19247 13104 51616 76291 76806 79114 63331 50624
19465E0624J3514k176j8263J0959j1542j3290J9032o952j4159K4345j131k1001
$$ 50624 64138 61962 43699 54658 43116 29826 48858 41906 27747 52092 50961 29960
19453B9960o007K242J9832n865p440K991j4445r60j5289J7308J7895j9690o585
$$ 29960 23953 26195 46027 40162 32722 35713 21268 20308 5019 22327 40222 20532 13947
19440A3947K0409K0566P540j5373j5850J1512j1873J9142M3731l840k9283Q779
$$ 13947 34356 54922 62462 47089 31239 42751 30878 50020 93751 89911 60628 69407
19428F9407j7514n925K12k264P629k7945j0797j032K4582J2152J169j0081J0867
$$ 69407 51893 45968 46180 43916 51545 23600 12803 11771 36353 48505 49674 39593 50460
19415E0460O595j6550j1355j1898L5745L3665K8872K5251p228k2970j4754k5314
$$ 50460 57055 40505 29150 17252 52997 86662 115534 140785 133557 110587 95833 70519
19403G0519l8475Q943K7946J1496O465L532j5706j0071J5675p193J9143L1422
$$ 70519 32044 40987 68933 80429 86894 90426 74720 64649 80324 73131 92274 123696
19391A23696n782k7275j1278o22L1404J1999k4199q568K4158k599Q22K5439J6116
$$ 123696 117914 90639 79361 78739 110143 122142 97943 89375 113533 110934 111756 137195 153311
19378A53311j4498J6276j5932r800j0892l058J5697q782r506m037R791K1328J5393
$$ 153311 138813 155089 139157 129357 118465 115407 131104 122322 112816 108779 118570 139898 155291
19365A55291L1444J9007n01q230K6838J6592p791R214L1985J1594J21K8696N5497
$$ 155291 186735 205742 205241 197011 223849 240441 232650 241864 273849 285443 285564 314260 369757
19352C69757P3164P1771K4891J8146M1312L1639O6468O9747Q9270J25448J26450
$$ 369757 442921 514692 539583 557729 599041 630680 697148 766895 856165 981613 1108063
19341A108063J27153R3847J15083J45589J37109J39083R9327P1010M9518K634
$$ 1108063 1235216 1329063 1444146 1589735 1726844 1865927 1965254 2036264 2085782 2088416
19331B088416k7294m3522n1807p5620q0240p7551r3685r7828j13918j44565j42874
$$ 2088416 2061122 2017600 1965793 1890173 1809933 1732382 1638697 1540869 1426951 1282386 1139512
19320A139512j10166r2871m3116m9416n4985q3300m0397m0475n8672m0419k7906
$$ 1139512 1029346 936475 893359 843943 788958 705658 665261 624786 566114 525695 497789
19309D97789j6485j4866m264j6010l4286l3542P39l5594j2359k1283m0544l8600
$$ 497789 481304 466438 462174 446164 411878 378336 379075 343481 331122 309839 269295 230695
19297B30695O430K9548q236q288k3784k9343J4450k2718m7761k9975j0701m2J0877
$$ 230695 237125 266673 258437 250149 226365 197022 211472 188754 140993 111018 100317 100275 111152
19284A11152K8091J0097j3764l4035O945J1880P80P732K3381R078l5618n146O698
$$ 111152 139243 149340 135576 101541 108486 120366 121146 128878 152259 161337 125719 120573 127271
19271A27271N321j1378j3592j490K6998j0049r220r831k3256P360J4000N732O224
$$ 127271 132592 121214 107622 106132 133130 123081 113861 104030 80774 88134 102134 107866 114090
19258A14090j8690j0890k181O449N030k0228k1266J3675J4265q511O890j5825
$$ 114090 95400 84510 82329 88778 93808 73580 52314 65989 80254 71743 78633 62808
19246F2808J5038K4509l2534k8377l4313q899J8547J2708o630J000K1481J0327
$$ 62808 77846 102355 69821 41444 7131 -1768 16779 29487 22857 23857 45338 55665
19234E5665k1296m257L0797J1139p014l9634k8736Q199J71L9561M9023P467l2353
$$ 55665 34369 30112 60909 72048 65034 25400 -3336 4863 5034 44595 93618 101085 68732
19221F8732m843l916R413K4315K431j7779k1763r892J0022j347Q943J2276J1118
$$ 68732 63889 59973 69386 93701 96132 78353 56590 46698 56720 55373 64316 76592 87710
19208H7710n372O801N4075M2572N2302R331l0845j8917l3727l3662K945J240l0387
$$ 87710 82338 89139 143214 185786 238088 247419 216574 197657 163930 130268 133213 134453 104066
19195A04066k5680K675J4226N17k2808q448K6708Q530k2445m050L8062K9890J3957
$$ 104066 78386 81061 95287 95804 72996 64548 91256 99786 77341 73291 111353 141243 155200
19182A55200N510o142k0995j1492R008q689R98l5123j8468K3833K7130J0105j534
$$ 155200 160710 154568 133573 122081 131089 122400 123398 88275 69807 93640 120770 130875 129341
19169A29341M981K1540q78j889L8304R174n58J6332J6598K2748k2857l9211l0041
$$ 129341 134322 155862 154984 153095 191399 200573 200015 216347 232945 255693 232836 193625 163584
19156A63584J1984M1256L8431M4201K7721k0463l6165j0868L0O471k8312m3171
$$ 163584 175568 216824 255255 299456 327177 306714 270549 259681 259711 266182 237870 194699
19144A94699l9267k5218K3605J7052j5779l3468l887j2100k1312l674J9654L0860
$$ 194699 155432 130214 153819 170871 155092 121624 117737 105637 84325 80651 100305 131165
19132A31165Q585K5153K6225n583k6474l4314J2040o198L590N743k9467j7319
$$ 131165 139750 164903 191128 185545 159071 124757 136797 130599 134189 139932 110465 93146
19120I3146K1721J7956K1908L0933K9002K5677M1830L3147M039L4699l863L824
$$ 93146 114867 132823 154731 185664 214666 240343 282173 315320 319359 354058 350195 354019
19108C54019L876J3487l976k2964m3670k7435j9362R73K077J4163P472j3719k0528
$$ 354019 357895 371382 367406 344442 300772 273337 253975 254948 257025 271188 278660 264941 244413
19095B44413l6085k4867j8846o457K611J7652j6042m3718j0270k895J0701J1506
$$ 244413 208328 183461 164615 158158 160769 178421 162379 118661 108391 105496 116197 127703
19083A27703J2187k1735l3451l890K1330J0917l802J7536k783k1239Q691j0282
$$ 127703 139890 118155 84704 80814 102144 113061 109259 126795 124012 102773 111464 101182
19071A01182R46L1104K193j4549P145K4407K7530l734l143k856J5500J0127K7366
$$ 101182 102128 133232 135425 120876 128021 152428 179958 176224 173081 170225 185725 195852 223218
19058B23218J1014J4034M230j3844q48k3922l6186j6020R471j0207j6349l632
$$ 223218 234232 248266 252496 238652 237804 213882 177696 161676 171147 160940 144591 140959
19046A40959j8166J5843R83j7870J7513K449k3135m247j7175k9171k773N699J3491
$$ 140959 122793 138636 139619 121749 139262 141711 118576 114329 97154 67983 65210 70909 84400
19033H4400J7644K1617k4062q082Q702j1869l5497m046L1387J7150J1248K744
$$ 84400 102044 123661 99599 91517 100219 88350 52853 48807 80194 97344 108592 111336
19021A11336q074o409R020k1654l3748O029K0451J7874L3947J2862k5587l1234
$$ 111336 103262 96853 105873 84219 50471 56500 76951 94825 128772 141634 116047 84813
19009H4813k3641j655l261Q947j9999P955L207K0756o94k0753r297k118K5717
$$ 84813 61172 59517 56256 65203 45204 53159 56366 77122 76428 55675 46378 44260 69977
18996F9977M562K915q499j5313L124L2851J5715J745q075k9410J1175j0665J0439
$$ 69977 74539 77454 68955 53642 56766 89617 105332 107077 99002 69592 80767 70102 80541
18983H0541j0051j262P259K163j8780n718k593l0307J0451J4240N670R586J848
$$ 80541 70490 69228 76487 78650 59870 54152 51559 21252 31703 45943 51613 61199 63047
18970F3047o946R854J7913l923j6053Q609J6453j2823k6629j0763J6605q921J2771
$$ 63047 56101 65955 83868 79945 63892 72501 88954 76131 49502 38739 55344 46423 59194
18957E9194J2282J4312j6090k0134k593J4499J23O674k0363J1244j681r370N000
$$ 59194 71476 85788 69698 49564 46971 61470 61593 68267 47904 59148 57467 48097 53097
18944E3097M041L776K285J6552O04l4727R126J6724K6046J6384p901r221j4789
$$ 53097 57138 60914 63199 79751 80355 45628 54754 71478 97524 113908 106007 96786 81997
18931H1997O51N393L5240J0724J0653J1184k514l4989m1576N040K8819P249J0336
$$ 81997 82648 88041 123281 134005 144658 155842 153328 118339 76763 81803 110622 117871 128207
18918A28207p412J3584K8073j2676M392j37p610L923M161N24j4260l890J4417
$$ 128207 120795 134379 162452 149776 154168 154031 146421 150344 154505 155029 140769 136879 151296
18905A51296J9645J3110O160J0887J8280k1533j5047L865r705l44J1541N5591
$$ 151296 170941 184051 190211 201098 219378 197845 182798 186663 176958 176614 188155 243746
18893B43746N2063n377L0579O988O833J0491N2259P5403Q7209O5604J8120n1051
$$ 243746 295809 290432 321011 327999 334832 345323 397582 472985 560194 625798 643918 592867
18881E92867l1294J3057N2549O8531J10281Q8817P7450p321l0544k2979M993m022
$$ 592867 561573 574630 627179 695710 805991 894808 972258 964937 934393 911414 916407 912385
18869I12385P425j858Q775J073M8752Q0615J22003J20973P0201l7241j25992j53815
$$ 912385 919810 917952 926727 927800 976552 1057167 1179170 1300143 1370344 1333103 1207111 1053296
18857A053296j50431j17470p1685m8437J5345N1549L3086Q988N7969N6033N5052
$$ 1053296 902865 785395 713710 665273 680618 732167 765253 774241 832210 888243 943295
18846I43295q023k1727o0131k8024j2389L8763O2155L8015k6880o1695M770N1567
$$ 943295 935272 913545 853414 825390 813001 851764 913919 951934 925054 863359 868129 919696
18834I19696O7796L9941j935l0437r0533q1854l3786k802L359L2163K5582J3869
$$ 919696 987492 1027433 1025498 995061 904528 822674 788888 786086 789445 821608 847190 861059
18822H61059k3425n549M7479N1461L9969o088o0280j24513j28297j13819n0607
$$ 861059 837634 832085 879564 931025 970994 964906 904626 780113 651816 537997 487390
18811D87390o019k1312l0744q719K6619l4728j4933j1307j2154j1772k1239n2558
$$ 487390 481371 460059 429315 420596 447215 412487 397554 386247 374093 362321 341082 288524
18799B88524K382l85O977j0986K8565J2123j8181j09J3525N461J0914j7620J907
$$ 288524 290906 290521 297498 286512 315077 327200 309019 308910 322435 327896 338810 321190 323097
18786C23097J2623m73k3258j7590j9951J5390o165j9280j7084m912n714N422J1496
$$ 323097 335720 335247 311989 294399 274448 289838 283673 264393 247309 242397 236683 242105 253601
18773B53601j1153o694K0159L2131n482J0894K7134L6073J2528n854l2282k7334
$$ 253601 242448 235754 255913 288044 282562 293456 320590 356663 369191 363337 331055 303721
18761C03721j7132j1995J1132j8131l7515J97M2448M348k8547M356l7360k1814
$$ 303721 286589 274594 285726 267595 230080 230277 272725 277073 248526 252882 215522 193708
18749A93708Q301J9620L0447J5905o918l424j952J0634J100J8663L0134J2543
$$ 193708 202009 221629 252076 267981 261063 257639 255687 266321 267421 286084 316218 328761
18737C28761l861k8128p448k3183K090J0605J2802J2688l0965l2971J1999Q028
$$ 328761 324900 296772 289324 266141 268231 278836 291638 304326 273361 240390 252389 260417
18725B60417l320j9644L356J7813J5348k602K248K3122q735l1067j3547K6643
$$ 260417 257097 237453 240809 258622 273970 271368 273616 296738 288003 256936 243389 270032
18713B70032J2047r581j6092o20K0052L1821L879r812R593K6061O4490M6605L2831
$$ 270032 282079 272498 256406 255786 275838 307659 311538 301726 311319 337380 401870 448475 481306
18700D81306O617J0256k2920n1507l7231J621K0578K716K1484M1550J9282N8719
$$ 481306 487923 498179 475259 423752 386521 388142 408720 411436 432920 474470 493752 552471
18688E52471Q7141O4580N2358r455o5684p0733n3031k7517L706M9908N2747K1180
$$ 552471 639612 704192 756550 747095 681411 610678 557647 530130 533836 583744 636491 657671
18676F57671L9362Q7433J27778J47357J48058R4599L3660o2718j38078r7419l5612
$$ 657671 697033 784466 912244 1059601 1207659 1302258 1335918 1273200 1135122 1037703 1002091
18665A002091K4205P2916J32983J73409K44128K58265L39905L20928J96809l3232
$$ 1002091 1026296 1099212 1232195 1405604 1649732 1907997 2247902 2568830 2765639 2732407
18655B732407k44200k56612j04486K1082J25643J49568J01393M6898O3849O8889
$$ 2732407 2488207 2231595 2127109 2148191 2273834 2423402 2524795 2571693 2635542 2704431
18645B704431R4563J44856K09765J57291k2586k40281l03882j49464J3620J28168
$$ 2704431 2798994 2943850 3153615 3310906 3288320 3048039 2744157 2594693 2608313 2736481
18635B736481J96117J59276J15542O3320m8476k74030l80380l14119j59217q4631
$$ 2736481 2932598 3091874 3207416 3270736 3222260 2948230 2567850 2253731 2094514 2009883
18625B009883p525Q2069J21615K06687K81365L25290K79275J73718Q4144K2928
$$ 2009883 2002358 2084427 2206042 2412729 2694094 3019384 3298659 3472377 3556521 3579449
18615C579449p4697j61632j69051m3536J17930K20908J88721l0819k51272k61983
$$ 3579449 3504752 3343120 3174069 3130533 3248463 3469371 3658092 3627273 3376001 3114018
18605C114018j13481k9650j4021l4547k7850k8167k2339K7078J02293K00565K76818
$$ 3114018 3000537 2970887 2956866 2922319 2894469 2866302 2843963 2871041 2973334 3173899 3450717
18594C450717K57577J4523l21431m77862m48333k90596j81654r0587m2625J4093
$$ 3450717 3708294 3722817 3401386 2923524 2475191 2184595 2002941 1912354 1869729 1883822
18584A883822Q3986J54175K06191K84589L51851L59187K30342l7451l76056n47866
$$ 1883822 1967808 2121983 2328174 2612763 2964614 3323801 3554143 3516692 3140636 2592770
18574B592770m66750k83301j52780q6585l7942m072N2349N0988O0668J30475J07759
$$ 2592770 2126020 1842719 1689939 1603354 1565412 1561340 1613689 1664677 1725345 1855820 1963579
18563A963579J5787j34773k36223j86800j36361q4709k7136L208L0891q113J2805
$$ 1963579 1979366 1844593 1608370 1421570 1285209 1200500 1173364 1176572 1207463 1199350 1212155
18552A212155K8405R023j817k9925k9559q409J5732N5614Q1991O7855R8633J66495
$$ 1212155 1240560 1249583 1247766 1217841 1188282 1179873 1195605 1251219 1333210 1401065 1499698 1666193
18540A666193J26010L8848l052o9084j30798j56174j54080j21027m3325J7239
$$ 1666193 1792203 1831051 1827999 1758915 1628117 1471943 1317863 1196836 1153511 1170750
18530A170750O2168Q5140J25074J61352J99907K16015J10999p4260k55231l26693
$$ 1170750 1232918 1318058 1443132 1604484 1804391 2020406 2131405 2057145 1801914 1475221
18520A475221j92475r6734r3799n7119l4574k7957M379J2358j7807k1115j9246
$$ 1475221 1282746 1186012 1092213 1035094 1000520 972563 976942 989300 971493 950378 931132
18509I31132k1597j7591l088n879R382k1533l0764l911J1046p89k089J8460Q752
$$ 931132 909535 891944 888856 882977 892359 870826 840062 836151 847197 846408 844319 862779 871531
18496H71531M0789L6604J0479M4891N0706N3828K6913P1116P6890J35221J88753
$$ 871531 912320 948924 959403 1004294 1055000 1108828 1135741 1206857 1283747 1418968 1607721
18485A607721J46387M0700q0395j58295r3730k8662k6900j9814l0456m1690J2178
$$ 1607721 1754108 1794808 1714413 1556118 1462388 1433726 1406826 1387012 1356556 1314866 1327044
18474A327044J8966K460N3761M0489J812N654j5514m79J6425K9513J8504J1312
$$ 1327044 1346010 1348470 1402231 1442720 1444532 1450186 1434672 1434193 1450618 1480131 1498635 1509947
18462A509947q014j3256j058K0895N843Q297r473r584R461K5241L4790K0589J6474
$$ 1509947 1501933 1488677 1487619 1508514 1514357 1522654 1513181 1503597 1513058 1538299 1573089 1593678 1610152
18449A610152M3529K3347L6598L6085M542J2373M5669M5859O0591O7422N9843
$$ 1610152 1653681 1677028 1713626 1749711 1754253 1766626 1812295 1858154 1918745 1986167 2046010
18438B046010N2743M9900P3436M6928j5488R972M3534K2094J7350K5017M4592
$$ 2046010 2098753 2148653 2222089 2269017 2253529 2263501 2307035 2329129 2346479 2371496 2416088
18427B416088N9603Q1822P8431K9290N3424O8664Q2072R6004R6263R1878J00259
$$ 2416088 2475691 2557513 2635944 2665234 2718658 2787322 2869394 2965398 3061661 3153539 3253798
18416C253798J01542R7870J05188J40306J55412J71446K35286L17436L62397M57795
$$ 3253798 3355340 3453210 3558398 3698704 3854116 4025562 4260848 4578284 4940681 5398476
18406E398476N29644O71705Q83377J094054J305188J477466J598711J245157J27513
$$ 5398476 5928120 6599825 7483202 8577256 9882444 11359910 12958621 14203778 14331291
18397A4331291j106080j456697q36769j87597K87192P29825J196708J707901K273685
$$ 14331291 13225211 11768514 10931745 10744148 11031340 11761165 12957873 14665774 16939459
18388A6939459K873407L277070L070892J652223o19215k650239l323125k772658
$$ 16939459 19812866 23089936 26160828 27813051 27193836 24543597 21220472 18447814
18380A8447814j540141m30327K59717P71509J229987J749572K309090K784379
$$ 18447814 16907673 16477346 16737063 17508572 18738559 20488131 22797221 25581600
18372B5581600L109702K895501J595740k89124j251332n24251P56617J747818
$$ 25581600 28691302 31586803 33182543 32893419 31642087 31117836 31874453 33622271
18364C3622271K622758L670602M982149O576705Q601952J1253644J4476611J7793732
$$ 33622271 36245029 39915631 44897780 51474485 60076437 71330081 85806692 103600424
18356A03600424K1258397K2625938J4355168m179086j9950897j9095978p668978
$$ 103600424 124858821 147484759 161839927 157660841 137709944 118613966 110944988
18349A10944988K002370Q729647J3066304J3170025R453604O006030N738061O271051
$$ 110944988 112947358 121677005 134743309 147913334 157366938 163372968 169111029 175382080
18341A75382080P498358J0776336O992982r265448k5495345k5861529j3614159
$$ 175382080 182880438 193656774 200649756 191384308 165888963 140027434 126413275
18334A26413275k650809M680873R162295R399104M453212k271527p165096r827438
$$ 126413275 123762466 128443339 137605634 147004738 151457950 149186423 142021327 132193889
18326A32193889j0450042o586332l66623N014823R006693J0371493P605316K781062
$$ 132193889 121743847 115157515 114790892 119805715 128812408 139183901 146789217 149570279
18318A49570279r03212l332064n644695m976631J373972R106757J5509710K0700343
$$ 149570279 148667067 145335003 139690308 134713677 136087649 145194406 160704116 181404459
18310A81404459K0385330Q001748r701335j7797908j0350650l481346l604241
$$ 181404459 201789789 209791537 200090202 182292294 171941644 168460298 164856057
18303A64856057o686064r645283j1564011j0061721l045073N009539J1248981
$$ 164856057 158169993 148524710 136960699 126898978 123853905 128863444 140112425
18296A40112425J5600141J4415935P42133k0088156l2669677k7383902j7024072
$$ 140112425 155712566 170128501 170870634 150782478 118112801 90728899 73704827
18289G3704827j0310461o683928m637002l269137k386859j715353r96545l61527
$$ 73704827 63394366 56710438 52073436 48804299 46417440 44702087 43705542 43344015
18281D3344015Q6584M55836M54948m49637k241154l825078l897564k772048j593806
$$ 43344015 43430599 43886435 44341383 43891746 41650592 37825514 33927950 31155902 29562096
18272B9562096p66782j94027J71168M68825Q55028J330528J743086J664801O26009
$$ 29562096 28795314 28601287 28772455 29241280 30096308 31426836 33169922 34834723 35460732
18263C5460732j339712l448037m574272m236853k988194j917832j213278p12149
$$ 35460732 34121020 30672983 26098711 21861858 18873664 16955832 15742554 15030405
18255A5030405k89197N4107L58678O18824Q35214O12729m17614j746668k434642
$$ 15030405 14741208 14795315 15153993 15772817 16608031 17220760 16803146 15056478 12621836
18246A2621836k068101j376952r10096o50610m99527m08323l56502l43686l10320
$$ 12621836 10553735 9176783 8266687 7616077 7116550 6708227 6351725 6008039 5697719
18237E697719k67756k34407k07786k43752k19366j96673j66153j89849j73183
$$ 5697719 5429963 5195556 4987770 4744018 4524652 4327979 4161826 3971977 3798794
18228C798794j86342j75987j19658j27023j26526j11464j06433j18294j28935
$$ 3798794 3612452 3436465 3316807 3189784 3063258 2951794 2845361 2727067 2598132
18219B598132j08334j13208j31158j25982j04833k9996q5595j01855q9425j05835
$$ 2598132 2489798 2376590 2245432 2119450 2014617 1984621 1899026 1797171 1707746 1601911
18209A601911k8825j4029p3315k7772l9070o2777p7811p6654m3602k6696Q56K2244
$$ 1601911 1573086 1559057 1485742 1457970 1418900 1356123 1278312 1201658 1158056 1131360 1132216 1154460
18197A154460L149m5577m4817m8359o5407k5137j1696n30q409j0890K4594K6250
$$ 1154460 1157609 1112032 1067215 1018856 953449 928312 916616 916086 907677 896787 921381 947631
18185I47631J1172j612k9006o0577j836K5362K945o684l5107k3756L391L654o194
$$ 947631 958803 957191 928185 867608 865772 891134 894079 887395 852288 828532 831923 835577 829383
18172H29383Q62J7786L5126r935o9954l9046k6641k0701K0614N5399K0805j0584
$$ 829383 830245 848031 883157 873222 803268 764222 737581 716880 737494 792893 813698 803114
18160H03114j3880k7651M739P611R773J002K2970O984J2090K0271J3023l0025
$$ 803114 789234 761583 766322 773933 783706 784708 807678 814662 826752 847023 860046 830021
18148H30021L067J3896l011k3891n411O086P764K690J0428J0269m641M8759M8533
$$ 830021 833088 846984 843973 820082 814671 820757 828521 831211 841639 851908 847267 896026 944559
18135I44559K1249M9057N6113N9228Q0820Q0088J16978J34708J40811J72367J85772
$$ 944559 965808 1014865 1070978 1130206 1211026 1291114 1408092 1542800 1683611 1855978 2041750
18124B041750J68644J74078J73965K09812K23168K74045L41739M40501N61051
$$ 2041750 2210394 2384472 2558437 2768249 2991417 3265462 3607201 4047702 4608753
18115D608753P45591R34204J279800J737963K424313L314150M210983N216328
$$ 4608753 5354344 6288548 7568348 9306311 11730624 15044774 19255757 24472085
18107B4472085O077968M295378j657329p775288q732044n386760k921690j687835
$$ 24472085 30550053 34845431 33188102 25412814 16680770 11294010 8372320 6684485
18099F684485j083373p38449n04059l66154k83744k24550j60752j49133j45809
$$ 6684485 5601112 4862663 4358604 3992450 3708706 3484156 3323404 3174271 3028462
18090C028462j52616j77884j53992n4320m9237j0271r349K7161K3440q8509j34528
$$ 3028462 2875846 2697962 2543970 2489650 2440413 2430142 2420793 2447954 2471394 2382885 2248357
18079B248357j36182j17484j12979q5483j16445r8157q1039q1673n0599m5325
$$ 2248357 2112175 1994691 1881712 1796229 1679784 1581627 1500588 1418915 1368316 1322991
18069A322991n4931k4776o4182n8576m6520o3802l9060r724l1023k1183m8986
$$ 1322991 1268060 1243284 1179102 1120526 1074006 1010204 971144 961420 930397 909214 860228
18058H60228r854K140L9943J7614l2599K5253N7894L8566K3970O049J3340R0388
$$ 860228 850374 852514 892457 910071 877472 902725 960619 999185 1023155 1029204 1042544 1132932
18046A132932J16618M8181m2953j27946q4610P550N3475L9925P1293P9954J8409
$$ 1132932 1249550 1297731 1254778 1126832 1042222 1049772 1103247 1143172 1214465 1294419 1312828
18035A312828p7345j44392j40480r7957p8620l8279k8689j8967k3780j4492L2873
$$ 1312828 1235483 1091091 950611 852654 774034 735755 707066 688099 664319 649827 682700
18024F82700R370l745j3169k6576k3619n370p29J5166L3461J870K936J1441j5777
$$ 682700 692070 688325 675156 648580 624961 619591 618862 634028 667489 669359 672295 683736 667959
18011F67959k4042k0890q072n899l6973j6226j4860J0419K6623K9675M738J9467
$$ 667959 643917 623027 614955 609056 572083 555857 540997 551416 578039 607714 612452 631919
17999F31919L4155J2459j1072J9326q639k1540m3925k2139R666j900L3697J9270
$$ 631919 666074 678533 667461 686787 678148 656608 612683 590544 600210 598310 632007 651277
17987F51277j4311l3261j1577K2894K5535j3812m3207j0488K1202j3923j3166
$$ 651277 636966 603705 592128 615022 640557 626745 583538 573050 594252 580329 567163
17976E67163Q26p698k94M214j1475q144Q352K3858J7058J0856L195J7630K8809
$$ 567163 567989 560291 559997 564211 552736 544592 552944 576802 593860 604716 607911 625541 654350
17963F54350L4336M2281J2265J1404j4254R730N7858L0458l0793m3483k4247J8778
$$ 654350 688686 730967 743232 754636 740382 750112 807970 838428 807635 764152 739905 758683
17951G58683L0507K3507N8356Q6227M3914N776k0038J1716N0887K2176k769k0238
$$ 758683 789190 812697 871053 957280 1001194 1006970 986932 998648 1049535 1071711 1068942 1048704
17939A048704j8281j3542p609Q328K8835n978J4033r553j1907K2972M6966K0968
$$ 1048704 1030423 1016881 1009272 1017600 1046435 1040457 1054490 1044937 1033030 1056002 1102968 1123936
17927A123936L8613L8666J8270j2762j8163K4198N8992K5779J612K6067L1697
$$ 1123936 1162549 1201215 1219485 1206723 1188560 1212758 1271750 1297529 1299141 1325208 1356905
17916A356905L7121P9011Q0317N0448J23795J09312J41738J65787J83191K03251
$$ 1356905 1394026 1473037 1553354 1603802 1727597 1836909 1978647 2144434 2327625 2530876
17906B530876K39967K96867L54802L48988L04913K81235K50849K72250L37000
$$ 2530876 2770843 3067710 3422512 3771500 4076413 4357648 4608497 4880747 5217747
17897E217747M19249N05528O13502Q35282J091262J420418J840118K434665L174925
$$ 5217747 5636996 6142524 6756026 7591308 8682570 10102988 11943106 14377771 17552696
17888A7552696M031110M816088N494307N514696L269408j621521o034785o533345
$$ 17552696 21583806 26399894 31894201 37408897 40678305 39056784 33021999 26488654
17880B6488654m173713j861582k39628R88317K057179L250189M674412O269283
$$ 26488654 22314941 20453359 20213731 21202048 23259227 26509416 31183828 37453111
17872C7453111P833201R239771R522073N591553l265947j1666909j3303715r380715
$$ 37453111 45286312 54526083 64048156 69639709 66373762 54706853 41403138 32022423
17864C2022423n405260k915836j360804k58262O02377J460487K328869L130210
$$ 32022423 26617163 23701327 22340523 22082261 22684638 24145125 26473994 29604204
17856B9604204L875761M227615K795649j150186n172340o200074m314134k376033
$$ 29604204 33479965 37707580 40503229 39353043 34180703 27980629 23666495 21290462
17848B1290462j359386q30463l78395k1070K19335L66638N44084Q81407J410440
$$ 21290462 19931076 19100613 18722218 18701148 18920483 19287121 19831205 20712612 22123052
17839B2123052K159577L061969M168944N597485P330412Q949020J0393638J1114955
$$ 22123052 24282629 27344598 31513542 37111027 44441439 53390459 63784097 74899052
17831G4899052Q312161k43698j0117916j3781732r924240m931934j430300J025429
$$ 74899052 83211213 82967515 72849599 59067867 49143627 44211693 42781393 43806822
17823D3806822L181070N498751Q258843J1451722J4646704J7527243J9226149
$$ 43806822 46987892 52486643 60745486 72197208 86843912 104371155 123597304
17816A23597304J4608646p92516j9538807k7685092k1697362j2909576p076196
$$ 123597304 138205950 137413434 117874627 90189535 68492173 55582597 48506401
17809D8506401l723175j544813K54288J958158L668150N335537O887033P976252
$$ 48506401 44783226 43238413 43492701 45450859 49119009 54454546 61341579 69317831
17801F9317831O446005k39980r151979j3680945j1125619o793865m049516k696733
$$ 69317831 75763836 75523856 66371877 52690932 41565313 34771448 30721932 28025199
17793B8025199j894822j321741j018736q57651o69574m27315j16473K97459Q22200
$$ 28025199 26130377 24808636 23789900 22932249 22262675 21835360 21718887 22016346 22838546
17784B2838546J427833K182844L050078L937353M742885N335727M689320J236916
$$ 22838546 24266379 26449223 29499301 33436654 38179539 43515266 48204586 49441502
17776D9441502l979308p131511o035712l427848j401285j6634J036248K006925
$$ 49441502 45462194 38330683 32294971 28867123 27465838 27449204 28485452 30492377
17768C0492377L175545M733129O509595Q164022R484883Q565247K384633p248682
$$ 30492377 33667922 38401051 44910646 53074668 62559551 71124798 73509431 66260749
17760F6260749j3592565j2261792p696924m194068k215610j119933l92263K96909
$$ 66260749 52668184 40406392 32709468 28515400 26299790 25179857 24787594 25084503
17752B5084503J171106K182883L159130L875137L676184J032909l517193o805878
$$ 25084503 26255609 28438492 31597622 35472759 39148943 40181852 36664659 29858781
17744B9858781o346620m035990k324315j362682r10539o40041n58357m85710m65996
$$ 29858781 23512161 19476171 17151856 15789174 14878635 14238594 13680237 13194527 12728531
17735A2728531n65955p08786q49703r17923q94906p72957o09148m78801l99950
$$ 12728531 12162576 11453790 10604087 9686164 8791258 8018301 7409153 6930352 6530402
17726F530402l32746l20339k86296k32080k51358k28659j76189j74105j22747
$$ 6530402 6197656 5877317 5591021 5358941 5107583 4878924 4702735 4528630 4405883
17717D405883j35476j65403k15377k59491k45924j45449j31429j13346o1392j5962
$$ 4405883 4270407 4105004 3889627 3630136 3384212 3238763 3107334 2993988 2932596 2916634
17707B916634R411O2257J27105J36082J55362J25178L9587j19914j85252j55866
$$ 2916634 2926045 2988302 3115407 3251489 3406851 3532029 3571616 3451702 3266450 3110584
17697C110584j16721l9384n8361M261M1231O3928J13579R2758J75422K90496M21549
$$ 3110584 2993863 2954479 2896118 2900379 2941610 3005538 3119117 3211875 3387297 3677793 4099342
17686D099342N61646O44535O80489O79841N62445K55932j35238n04246q01382
$$ 4099342 4660988 5305523 5986012 6665853 7228298 7484230 7348992 6844746 6043364
17677F043364r22634q71656p25424n38875l86473k71653j50319o8181m4515m3582
$$ 6043364 5120730 4249074 3523650 2984775 2598302 2326649 2176330 2108149 2063634 2020052
17667B020052k9367m1024p0944q6496r8577n6621p036q779j3613j9846p4519q4027
$$ 2020052 1990685 1949661 1878717 1792221 1693644 1637023 1629987 1621208 1607595 1587749 1513230 1429203
17655A429203q3157p6841n1793o9054j4893q699j8114r432k3801l71K554N920
$$ 1429203 1346046 1269205 1217412 1148358 1133465 1124766 1106652 1097220 1073419 1073048 1075602 1081522
17643A081522K8725M7638J7398J8391j510J2010J0926K1231N6171J15827J66929
$$ 1081522 1110247 1157885 1175283 1193674 1192164 1204174 1215100 1236331 1292502 1408329 1575258
17632A575258K66340L54151M06597M11991L23868J63582j4338k04221l23391l58595
$$ 1575258 1841598 2195749 2602346 3014337 3338205 3501787 3487449 3283228 2959837 2601242
17622B601242l89734l38573k76011j99229j06361l8899q717M8445N4624K8700
$$ 2601242 2211508 1872935 1596924 1397695 1291334 1252435 1243718 1292163 1346787 1375487
17612A375487k9999n0106o5112j05767o2347k1686k6057o338j6109k043n3095
$$ 1375487 1345488 1295382 1230270 1124503 1062156 1040470 1014413 1008075 991966 989923 936828
17601I36828p3708k7795l4818k4079n5246n6497m1646n5968l4804Q702j4487q89
$$ 936828 863120 835325 800507 776428 721182 664685 623039 567071 532267 540969 526482 525593
17589E25593k2911k5022k3347k0817j2458k4550j1562l2340l2157n033N175J7600
$$ 525593 502682 477660 454313 433496 421038 396488 384926 352586 320429 315396 320571 338171
17577C38171j9401l0741j7960k2071l868L5943L8022O233P177j664q556j4134
$$ 338171 318770 288029 270069 247998 244130 280073 318095 324328 331505 329841 321285 307151
17565C07151j7781O008J202J6478J5866K0011L8309M6346j6191k0277j7766j9342
$$ 307151 289370 295378 296580 313058 328924 348935 387244 433590 417399 397122 379356 360014
17553C60014k4198l3443q878K8237M9115M0645N1401M0498j3410j5202k6116m8395
$$ 360014 335816 302373 293495 321732 370847 411492 462893 503391 489981 474779 448663 400268
17541D00268k1961k2147l9445l972J0876Q885k808P596N8725j1600k5032m2149
$$ 400268 378307 356160 316715 312743 323619 332504 329696 337292 396017 384417 359385 317236
17529C17236k5336j5966q459m2725k3011K6276j825l0487o095p732J184J2365
$$ 317236 291900 275934 267475 224750 201739 228015 226190 195703 189608 181876 183060 195425
17517A95425Q984p71k0386l0819p654k767L34K9191Q113j8873N393n098Q464O745
$$ 195425 204409 203638 183252 152433 144779 142012 142346 171537 179650 160777 166170 161072 169536 176281
17503A76281K2978n577J68J2737l426k6770N571J6785N712N1786N4560L541o919
$$ 176281 199259 193682 193850 206587 203161 176391 181962 198747 204459 256245 310805 314346 307427
17490C07427j3169m2846l3906k3265k6355k3183j1575J4883J1751K709J7111J6504
$$ 307427 294258 251412 217506 194241 167886 144703 133128 148011 159762 162471 179582 196086
17478A96086N233K4071K2141l125j8333j8680m5141m7341q868k789K975j1208
$$ 196086 201319 225390 247531 244406 226073 207393 162252 114911 106043 103254 106229 95021
17466I5021J800J207j3929j2182k564j5863M00L027J1771k9820j3862J5328j742
$$ 95021 96821 98028 84099 71917 69353 53490 53890 56917 68688 38868 25006 40334 38592
17453C8592R412J8608K1506R175m776L2195L976O955Q610j3703l00P815K8106
$$ 38592 48004 66612 88118 97293 92517 124712 128688 135643 144253 130550 130250 138065 166171
17440A66171O6515J0084j0284n6460m4221m8321q906K2338k7849k9720o338K6861
$$ 166171 232686 242770 232486 176026 131805 83484 74578 96916 69067 39347 33009 59870
17428E9870m609p260l25J5486R780l7133k4767J777K1845P708p095r57p339j0001
$$ 59870 55261 48001 47676 63162 72942 35809 11042 12819 34664 42372 35277 34320 26981 16980
17414A6980k3360j5583J0298j3489r114J1860J9876K4889j3887k2170k685J849
$$ 16980 -6380 -21963 -11665 -25154 -34268 -22408 -2532 22357 8470 -13700 -16385 -14536
17402a4536O173K0072m040l5877j0873j5115J2165K4476J1164j7066n967j60J8214
$$ -14536 -8363 11709 7669 -28208 -39081 -54196 -42031 -17555 -6391 -23457 -29424 -29584 -11370
17389a1370L2731J5127n983K617j0634L2388K4030N859K208J1218J6603m5304
$$ -11370 21361 36488 30505 33122 22488 54876 78906 84765 86973 98191 114794 69490
17377F9490j6943n90K328q225L376O703k8204k2064j1297K769O297j1759j0458
$$ 69490 52547 51957 54285 46060 49436 56139 27935 5871 -5426 -2657 3640 -8119 -18577
17364a8577K9878M3900J8155P341j3355N26J3953M6165L6209M6524K4915n016
$$ -18577 11301 55201 73356 80697 67342 67868 81821 127986 164195 210719 235634 230618
17352B30618l1043k4434m0945l6487m384K7913j2956r219K8997L8386L9454M7727
$$ 230618 199575 175141 134196 97709 93325 121238 108282 99063 128060 166446 205900 253627
17340B53627O2725O7073J2904k5505n4154o5662p8136l7884J952j3200m979K2431
$$ 253627 316352 383425 396329 370824 316670 251008 172872 134988 136940 123740 118761 141192
17328A41192J2820K3083O86L2770L5302L3373j3250m2252m0387l7208j8745j2060
$$ 141192 154012 177095 177781 210551 245853 279226 265976 223724 183337 146129 127384 115324
17316A15324n451l919K8216L0000J7899o000K1493J1283j5927L0779K3676J4441
$$ 115324 109873 105954 134170 164170 182069 176069 197562 208845 192918 223697 247373 261814
17304B61814J7176J2584N8767N2205M1715j8782o9540p5890m4182n628M095N113
$$ 261814 278990 291574 350341 402546 444261 425479 355939 280049 235867 230239 234334 239447
17292B39447J6314J6071O9796O3238P1905J07492R4552O9801k3608j01812r9727
$$ 239447 255761 271832 341628 404866 476771 584263 678815 748616 725008 623196 523469
17281E23469q1299q1905o9552k4189k2300N537L9551K4722L9498M8536K3983K2661
$$ 523469 442170 360265 290713 266524 244224 249761 289312 314034 353532 402068 426051 448712
17269D48712k0222r3808o0410l9376m5828k8016J1235J3344L23j3098j1948j0658
$$ 448712 428490 334682 274272 234896 189068 161052 172287 185631 185954 172856 160908 150250
17257A50250J3602Q24j0937J2483k2636J0365L5419K1924O952M0737L0374p385
$$ 150250 163852 164676 153739 166222 143586 153951 189370 211294 218246 258983 289357 281972
17245B81972l1664k7193p691Q962J0037R91j6538l141k2749j3270J8927M3548
$$ 281972 250308 223115 215424 224386 234423 235414 218876 215735 192986 179716 198643 242191
17233B42191R1553P1681M089n2943p2447o6472k5550m183N439J2371J934m491
$$ 242191 333744 405425 409514 356571 284124 217652 192102 187919 193358 205729 207663 203172
17221B03172J0681J4634p558k0177P821j4445j1457l0055m1301j2171j1501k2928
$$ 203172 213853 228487 220929 200752 208573 194128 182671 152616 111315 99144 87643 64715
17209F4715k0346l374j772j258k9471p85J1044J127j5627j926J1909J6296j7492
$$ 64715 44369 40995 39223 37965 8494 7709 18753 19880 4253 2327 14236 30532 13040
17196A3040J2027m06j4709J1017J1269j3045k815p130p422j3783J0512Q310p217
$$ 13040 25067 24661 9952 20969 32238 19193 16378 9248 1826 -11957 -1445 6865 -352
17183c52M506m677o524N364J7938n070M107L966K519j855k2646n6338j4590K3187
$$ -352 4154 -523 -7047 -1683 16255 11185 15292 19258 21777 19922 -2724 -59062 -73652 -50465
17169e0465J4715L6818J3996j4899K2681n164j8101j0110j949J242k5862P091
$$ -50465 -35750 1068 15064 165 22846 17682 -419 -10529 -12478 -11236 -37098 -30007
17157c0007J1889J8898L1715Q65k6025r497j3997j801J2302K1150K924r899K1422
$$ -30007 -18118 780 32495 33360 7335 -2162 -16159 -17960 -5658 15492 18416 8517 29939
17144B9939J9910j1889j0764q582p512j3131l1379J595J8929J6977K6540p702
$$ 29939 49849 37960 27196 18614 11102 -2029 -33408 -31813 -12884 4093 30633 22931
17132B2931j6290j2934M306p344M040P937J7147J8937L180k2447l7341M784K0936
$$ 22931 6641 -6293 -1987 -9331 -5291 2646 19793 38730 41910 19463 -17878 -13094 7842
17119G842l6795l4627K6612K2161L269J4972j4760K356J2783J3205j1982j3333
$$ 7842 -28953 -63580 -36968 -14807 -11538 3434 -11326 -8970 3813 17018 5036 -8297
17107h297J6835P36j6959j2638J9241J4546j3785j9700R585K1581L791j063j9909
$$ -8297 8538 9274 -7685 -20323 -1082 13464 -321 -20021 -10436 11145 14936 13873 -6036
17094f036j2323O616M693J3430L973j4728k253k4957l0833J5733j0467J1436J1055
$$ -6036 -18359 -11743 -7050 6380 10353 -4375 -6628 -31585 -62418 -46685 -57152 -45716 -34661
17081c4661n426J2567P962j760N991M80J4445q185k1826Q340j2090j7523R356
$$ -34661 -40087 -27520 -19558 -21318 -15327 -14847 -402 -8587 -30413 -22073 -34163 -51686 -42330
17068d2330J3347j5010j1332L0638j3962k4792l6702J4247J3214o205P609J916
$$ -42330 -28983 -43993 -55325 -24687 -38649 -63441 -100143 -85896 -72682 -78887 -71278 -69362
17056f9362O43M136N246K1506J0704K3947L1700J2973m5977j6550J7751J331o17
$$ -69362 -68719 -64583 -59337 -37831 -27127 -3180 28520 41493 -4484 -21034 -3283 -1952 -2569
17043b569K4584j529l0139k9610o778J2291P119k1301m946q751R116L5503L5222
$$ -2569 22015 20486 -9653 -39263 -46041 -33750 -26631 -47932 -52878 -61629 -52513 -17010 18212
17030A8212N483j270k0904J1826o285k9483k6327j126K725J1518r674l6633O923
$$ 18212 23695 22425 1521 13347 7062 -22421 -48748 -49874 -47149 -35631 -45305 -81938 -75015
17017g5015K4455K8896K1256j381R601M577r336n835j6057j7842r408M605J638
$$ -75015 -50560 -21664 -408 -1789 7812 12389 3053 -2782 -18839 -36681 -46089 -41484 -39846
17004c9846J5763l449j7904n4748k977J8129J2605L2580N545o388k6884K6179
$$ -39846 -24083 -27532 -45436 -100184 -103161 -85032 -72427 -39847 -34302 -40690 -67574 -41395
16992d1395R882l976r425k577J8434K1687q740P249K316j6353l0813N919J1814
$$ -41395 -31513 -35489 -44914 -47491 -29057 -7370 -16110 -8861 -6545 -22898 -53711 -47792 -35978
16979c5978k0580N09J0421p63J3705M1288J400j4742K1784N875q54k2107k5094
$$ -35978 -56558 -56049 -45628 -46391 -32686 8602 10002 -4740 17044 22919 22065 -42 -25136
16966b5136n599N523r439k0523m510J5698L1856P031j3029k1692r71P856j6118
$$ -25136 -30735 -25212 -34651 -55174 -59684 -43986 -12130 -5099 -18128 -39820 -40791 -32935 -49053
16953d9053j3545K3733J0783p04K0467r56l3713K3766p998p662J0772J3517n345
$$ -49053 -62598 -38865 -28082 -28786 -8319 -9275 -42988 -19222 -27220 -34882 -24110 -10593 -15938
16940a5938P801r179k4680j5894J935J7668K0573j5732j5073J88J7720o471R588
$$ -15938 -8137 -17316 -41996 -57890 -55955 -38287 -17714 -33446 -48519 -48331 -30611 -37082 -27494
16927b7494Q320j9624k754O265N072L2509M981j1073l4967Q045J260j6263J869
$$ -27494 -19174 -38798 -41552 -35287 -30215 2294 7275 -3798 -38765 -30720 -29460 -45723 -43854
16914d3854J3933K6282K3407j975j0080j3991l327J8258r069n179k8290j1037
$$ -43854 -29921 -3639 19768 17793 7713 -6278 -9605 8653 -416 -5595 -33885 -44922
16902d4922K6754J3116k6517k4118j7109J3429L5518J9828J536J0124n280l350
$$ -44922 -18168 -5052 -31569 -55687 -72796 -59367 -23849 -4021 -2485 7639 2359 -991
16890i91l968J0058m899l2461l2613J6730K8350N376k3888k7459K9666L0018k7913
$$ -991 -4959 5099 200 -32261 -64874 -48144 -19794 -14418 -38306 -65765 -36099 -6081 -33994
16877c3994l2174j1177j7445K1039k159j254J5802Q319q582q937m901j2507p807
$$ -33994 -66168 -77345 -94790 -73751 -75910 -77164 -61362 -53043 -61625 -70562 -75463 -87970 -95777
16864i5777n344K9359K8146L9754J1028j6995l1636j6813j670M997m981J3250
$$ -95777 -101121 -71762 -43616 -3862 7166 -9829 -41465 -58278 -59948 -54951 -59932 -46682
16852d6682M49l940K0127L848P423l1970j1026J0565P539k472K8034j5970K1663
$$ -46682 -46233 -50173 -30046 -26198 -18775 -50745 -61771 -51206 -43667 -46139 -18105 -34075 -12412
16839a2412J2256M161o826r541j0070N261k720q740k967J218P038J0891k0585
$$ -12412 -156 4005 -2821 -12362 -22432 -17171 -19891 -28631 -31598 -30380 -23342 -12451 -33036
16826c3036L563j7037r576j8540J3814M317O296J6055M07j8439j5728J7907L4067
$$ -33036 -29473 -46510 -56086 -74626 -60812 -56495 -50199 -34144 -33737 -52176 -67904 -49997 -15930
16813a5930J3778Q742K838l991j5111l4622k6145j1169M4553J5338l784k3280
$$ -15930 -2152 6590 9428 5437 -9674 -44296 -70441 -81610 -37057 -21719 -25503 -48783
16801d8783j301J6629k718j6645k131J3724n387J198o450j500L6052P126m901
$$ -48783 -50084 -33455 -36173 -52818 -54949 -41225 -46612 -45414 -51864 -53364 -17312 -10186 -15087
16788a5087j115j2093j7076n234K7723M118N84l4539M258J5815M630L939P443
$$ -15087 -16202 -28295 -45371 -50605 -22882 -18764 -18180 -52719 -48461 -32646 -28016 -24077 -16634
16775a6634l514n080j877r412j075q687P707O338O410K8684q084o707k2276k6031
$$ -16634 -20148 -25228 -27105 -36517 -37592 -46279 -38572 -32234 -25824 2860 -5224 -11931 -34207 -60238
16761f0238Q185K0092K3761J3966J3018J3148p133k1124l436j4425K2498L209
$$ -60238 -52053 -31961 -8200 5766 18784 31932 24799 3675 239 -14186 8312 11521
16749A1521n643J7148L960j3832J1319m289j1761n906j0210k2612j0151L740K048
$$ 11521 5878 23026 26986 13154 24473 20184 8423 2517 -7693 -30305 -40456 -36716 -34668
16736c4668K5309l509k0144q326L5249P480j623j0351q698M644J7747L366J2220
$$ -34668 -9359 -12868 -33012 -41338 -6089 1391 -232 -10583 -19281 -14637 3110 6476 18696
16723A8696j615j5915N275O348Q341j1355k639j936Q140k2425j1327j2952K9650
$$ 18696 17081 1166 6441 12789 21130 9775 7136 5200 13340 -9085 -20412 -33364 -3714
16710c714p392j1392j1002n746L5923L4233k5661j4626J8093q306K198K554j0310
$$ -3714 -11106 -22498 -33500 -39246 -3323 30910 5249 -9377 8716 410 2608 5162 -5148
16697e148O90r52j4211P422j3574J8887K6413J348l568k370k0642l9464j6064
$$ -5148 -4458 -5410 -19621 -12199 -25773 -6886 19527 20875 17307 14937 -5705 -45169 -61233
16684f1233J183J9574J7650k835L0146J9723q586m480O880J491j9015j1566J1488
$$ -61233 -60050 -40476 -22826 -25661 4485 24208 15622 11142 18022 19513 498 -11068 420
16671D20J5110j8038n409N148j7119J0278M494J2692j3714M510k1138q150R687
$$ 420 15530 -2508 -7917 -2769 -19888 -9610 -5116 7576 -6138 -1628 -22766 -30916 -21229
$$ [...]
##END NTUPLES=NMR SPECTRUM
##END=
