##TITLE=Analysis number 307342
Compound Code sew 00285
Project Code qc-cat
Chemist Name endeavour
##JCAMPDX= 6.0         $$ Bruker NMR JCAMP-DX V2.0
##DATA TYPE= NMR SPECTRUM
##DATA CLASS= NTUPLES
##ORIGIN= Bruker BioSpin GmbH
##OWNER= NMR
$$ XWIN-NMR		Version 3.5
$$ Thu Apr 28 10:49:19 2005 GMT Daylight Time (UT+1h)  MAYBRIDGE\NMR@NMR_250MHZ
##.OBSERVE FREQUENCY= 250.131544655141
##.OBSERVE NUCLEUS= ^1H
##.ACQUISITION MODE= SIMULTANEOUS (DQD)
##.ACQUISITION SCHEME= undefined
##.AVERAGES= 16
##.DIGITISER RES= 18
##SPECTROMETER/DATA SYSTEM= dpx250
##.PULSE SEQUENCE= zg30
##.SOLVENT NAME= CDCl3
##.SHIFT REFERENCE= (INTERNAL, CDCl3, 0, 16.522)
##AUDIT TRAIL= $$ (NUMBER, WHEN, WHO, WHERE, WHAT)
$$ ##TITLE= Audit trail, XWIN-NMR		Version 3.5
$$ ##JCAMPDX= 5.01
$$ ##ORIGIN= Bruker BioSpin GmbH
$$ ##OWNER= NMR
$$ C:\u/data/dgb/nmr/ADRS/2440/pdata/1/auditp.txt
$$ ##AUDIT TRAIL=  $$ (NUMBER, WHEN, WHO, WHERE, WHAT)
(   1,<2005-04-28 10:49:00.29 +100>,<MAYBRIDGE\NMR>,<NMR_250MHZ>,
      <created by zg, POWCHK disabled, PULCHK disabled
       configuration hash MD5:
       62 19 C7 07 E1 42 D1 B7 37 6C 3D D0 77 39 F9 E6
       data hash MD5: 64K
       4A EB 22 66 30 1A E3 7C 19 62 E4 20 B8 32 D1 2F>)
(   2,<2005-04-28 10:49:12.92 +100>,<MAYBRIDGE\NMR>,<NMR_250MHZ>,
      <Start of raw data processing
       ef LB = 0.3 FT_mod = 6 PKNL = 1 SI = 32K 
       data hash MD5: 32K
       A8 E6 64 80 34 22 4D 0B E0 8B 1F 5F E7 01 6F 41>)
(   3,<2005-04-28 10:49:14.60 +100>,<MAYBRIDGE\NMR>,<NMR_250MHZ>,
      <apk 
       data hash MD5: 32K
       E9 D6 E7 8C 67 CD CA D7 6B 89 72 5E DC A7 D7 D9>)
(   4,<2005-04-28 10:49:15.32 +100>,<MAYBRIDGE\NMR>,<NMR_250MHZ>,
      <abs ABSG = 5 
       data hash MD5: 32K
       F8 29 14 FF ED 04 B6 6B 38 92 8A EF 9F 3D 14 B1>)
$$ ##END=
$$ 
$$ hash MD5
$$ F6 58 32 F3 93 A9 A7 8B 4F BC 7C 46 AB C1 8A 2C
##$RELAX= 
##$RELAX= 
##$RELAX= 
##$RELAX= 
##$RELAX= 
##$RELAX= 
##$RELAX= 
$$ Bruker specific parameters
$$ --------------------------
##$DU= <C:\u>
##$EXPNO= 2440
##$NAME= <ADRS>
##$PROCNO= 1
##$TYPE= <nmr>
##$USER= <dgb>
##$AMP= (0..31)
100 100 100 100 100 100 100 100 100 100 100 100 100 100 100 100 100 100 
100 100 100 100 100 100 100 100 100 100 100 100 100 100 
##$AQSEQ= 0
##$AQ_mod= 3
##$AUNM= <au_zg>
##$AUTOPOS= <11 >
##$BF1= 250.13
##$BF2= 250.13
##$BF3= 250.13
##$BF4= 250.13
##$BF5= 500.13
##$BF6= 500.13
##$BF7= 500.13
##$BF8= 500.13
##$BYTORDA= 1
##$CFDGTYP= 0
##$CFRGTYP= 5
##$CHEMSTR= <none>
##$CNST= (0..31)
1 1 145 1 1 1 1 1 1 1 1 1 1 1 1 1 1 1 1 1 1 1 1 1 1 1 1 1 1 1 1 1 
##$CPDPRG= <>
##$CPDPRG1= <>
##$CPDPRG2= <>
##$CPDPRG3= <>
##$CPDPRG4= <mlev>
##$CPDPRG5= <mlev>
##$CPDPRG6= <mlev>
##$CPDPRG7= <mlev>
##$CPDPRG8= <mlev>
##$CPDPRGB= <>
##$CPDPRGT= <>
##$D= (0..31)
0 1 0 0 0 0 0 0 0 0.06 0 0 0 0 0 0 0.0002 0 0 0 0 0 0 0 0 0 0 0 0 0 0 
0 
##$DATE= 1114681739
##$DBL= (0..7)
120 120 120 120 120 120 120 120 
##$DBP= (0..7)
150 150 150 150 150 150 150 150 
##$DBP07= 0
##$DBPNAM0= <>
##$DBPNAM1= <>
##$DBPNAM2= <>
$$ [...]
##$SUBNAM7= <"">
##$SUBNAM8= <"">
##$SUBNAM9= <"">
##$SW= 20.6930455092707
##$SWIBOX= (0..15)
0 0 3 0 0 0 0 0 0 0 0 0 0 0 0 0 
##$SW_h= 5175.983436853
##$TD= 65536
##$TD0= 1
##$TE= 295.16
##$TE2= 300
##$TE3= 300
##$TEG= 300
##$TL= (0..7)
0 120 120 120 120 120 120 120 
##$TP= (0..7)
150 150 150 150 150 150 150 150 
##$TP07= 0
##$TPNAME0= <>
##$TPNAME1= <>
##$TPNAME2= <>
##$TPNAME3= <>
##$TPNAME4= <>
##$TPNAME5= <>
##$TPNAME6= <>
##$TPNAME7= <>
##$TPOAL= (0..7)
0.5 0.5 0.5 0.5 0.5 0.5 0.5 0.5 
##$TPOFFS= (0..7)
0 0 0 0 0 0 0 0 
##$TUNHIN= 0
##$TUNHOUT= 0
##$TUNXOUT= 0
##$USERA1= <user>
##$USERA2= <user>
##$USERA3= <user>
##$USERA4= <user>
##$USERA5= <user>
##$V9= 5
##$VALIST= <valist>
##$VCLIST= <CCCCCCCCCCCCCCC>
##$VD= 0
##$VDLIST= <DDDDDDDDDDDDDDD>
##$VPLIST= <PPPPPPPPPPPPPPP>
##$VTLIST= <TTTTTTTTTTTTTTT>
##$WBST= 1024
##$WBSW= 4
##$XGAIN= (0..3)
0 0 0 0 
##$XL= 0
##$YL= 0
##$YMAX_a= 522950
##$YMIN_a= -553785
##$ZGOPTNS= <>
##$ZL1= 120
##$ZL2= 120
##$ZL3= 120
##$ZL4= 120
##$ABSF1= 16.522
##$ABSF2= -4.171173
##$ABSG= 5
##$ABSL= 3
##$ALPHA= 0
##$AQORDER= 0
##$ASSFAC= 0
##$ASSFACI= 0
##$ASSFACX= 0
##$ASSWID= 0
##$AUNMP= <proc_1d>
##$AZFE= 0.1
##$AZFW= 0.1
##$BCFW= 0
##$BC_mod= 0
##$BYTORDP= 0
##$COROFFS= 0
##$CY= 12.5
##$DATMOD= 1
##$DC= 0
##$DFILT= <>
##$DTYPP= 0
##$F1P= 14.0000005364418
##$F2P= -0.99999901652339
##$FCOR= 0.5
##$FTSIZE= 32768
##$FT_mod= 6
##$GAMMA= 0
##$GB= 0
##$INTBC= 1
##$INTSCL= 1
##$ISEN= 128
##$LB= 0.3
##$LEV0= 0
##$LPBIN= 0
##$MAXI= 10000
##$MC2= 0
##$MEAN= 0
##$ME_mod= 0
##$MI= 0
##$NCOEF= 0
##$NC_proc= -2
##$NLEV= 6
##$NOISF1= 0
##$NOISF2= 0
##$NSP= 0
##$NTH_PI= 0
##$NZP= 0
##$OFFSET= 16.522
##$PC= 1
##$PHC0= -74.20366
##$PHC1= 4.234704
##$PH_mod= 1
##$PKNL= yes
##$PPARMOD= 0
##$PSCAL= 4
##$PSIGN= 0
##$REVERSE= no
##$SF= 250.13
##$SI= 32768
##$SIGF1= 0
##$SIGF2= 0
##$SINO= 400
##$SIOLD= 32768
##$SREGLST= <1H.CDCl3>
##$SSB= 0
##$STSI= 32768
##$STSR= 0
##$SW_p= 5175.98343685301
##$SYMM= 0
##$S_DEV= 0
##$TDeff= 65536
##$TDoff= 0
##$TI= <Analysis number 999999
Compound Code 99
Book Reference 9
Project Code 9>
##$TILT= no
##$TM1= 0
##$TM2= 0
##$TOPLEV= 0
##$USERP1= <user>
##$USERP2= <user>
##$USERP3= <user>
##$USERP4= <user>
##$USERP5= <user>
##$WDW= 1
##$XDIM= 32768
##$YMAX_p= 414854378
##$YMIN_p= -237784
$$ End of Bruker specific parameters
$$ ---------------------------------
##NTUPLES= NMR SPECTRUM
##VAR_NAME=  FREQUENCY,     SPECTRUM/REAL,   SPECTRUM/IMAG
##SYMBOL=    X,             R,               I
##VAR_TYPE=  INDEPENDENT,   DEPENDENT,       DEPENDENT
##VAR_FORM=  AFFN,          ASDF,            ASDF
##VAR_DIM=   32768,         32768,           32768
##UNITS=     HZ,            ARBITRARY UNITS, ARBITRARY UNITS
##FACTOR=    0.157963299565203, 1,           1
##FIRST=     4132.6476996994, 0,             0
##LAST=      -1043.33573715361, 0,           0
##MIN=       -1043.33573715361, -237784,     0
##MAX=       4132.6476996994, 414854378,     0
$$ Real data points
##PAGE= N=1
##DATA TABLE= (X++(R..R)), XYDATA
$$ [...]
20698G9244j371k109L996L558L254N119l626j0083P47j96p296j608K084K620M685
20683G9018L601k645l562O458K983M294K331J760O788J5143N521M943O612J0317
20669A43562M792J061j183j496J957M432L194q5R93k02k642l389K627O321J618
20654A61560l311k875J078P084Q174K021L62p39j290M265K085O8K660M942L841
20639A89925j659J445l280Q37N377J0443J2773o50j934Q74L08P420J1589M195
20625B37663p72N53m315Q049R067M895Q666J1144P210K727R591J2749J1174J5096
20611C33497J2808J9553J6338R854Q245J4684R858J3499J0384N902N126J3896
20599D73644J3904J0969N098J2339J0000M118P310K538n20J23M382L125J582P70
$$ plain form
20698 79244 77873 75764 79760 83318 86572 91691 88065 77982 78729 78533 71237 69629 71713 74333 79018
20683 79018 82619 79974 76412 82870 85853 90147 92478 94238 101026 116169 121690 126633 133245 143562
20669 143562 148354 149415 148232 146736 148693 153125 156319 156234 157227 157025 154383 150994 153621 159942 161560
20654 161560 158249 155374 156452 163536 171710 173731 174093 173354 172064 176329 178414 178482 181142 186084 189925
20639 189925 188266 189711 186431 187268 192645 203088 215861 215211 213277 214151 214459 221879 233468 237663
20625 237663 236891 237444 233129 241178 250245 255140 263806 274950 282160 284887 294478 307227 318401 333497
20611 333497 346305 365858 382196 392050 400295 414979 424837 438336 448720 454622 459748 473644
20599 473644 487548 498517 503615 515954 525954 530072 537382 539920 539400 539523 543905 547030 548612 549382
20585E49382J488J137J884L602M03J0468N130P705O243O461L838M841M547J7146
20571F24275J8249J4499P607J9181K4152K9050K9407K3274J8320J5528J9759K5854
20559H69155K4405L3562K8397K0140K1927J8178K0887L2134K9951L2083L4970
20548A165789L9068M1041M3536M5439N3481O1065P0429Q6966R8027J05339R7975
20537A908155J16416J56452J57099J26933J23697J56060J74701J44147J34641
20528C198301J73002J98888J87517J87845K03869K21033K28692K47290K44022
20519E090459K66409K97231L41283L99761M63044N41296O30035P42513Q91302
20510I663333J064189J272191J527036J840298K231994K712658L292771M001528
$$ plain form
20585 549382 550870 552007 553891 557493 557896 568364 573494 581199 587442 593903 597741 602582 607129 624275
20571 624275 642524 657023 664630 683811 707963 737013 766420 789694 808014 823542 843301 869155
20559 869155 893560 927122 955519 975659 997586 1015764 1036651 1068785 1098736 1130819 1165789
20548 1165789 1204857 1245898 1289434 1334873 1388354 1449419 1519848 1606814 1704841 1810180 1908155
20537 1908155 2024571 2181023 2338122 2465055 2588752 2744812 2919513 3063660 3198301
20528 3198301 3371303 3570191 3757708 3945553 4149422 4370455 4599147 4846437 5090459
20519 5090459 5356868 5654099 5995382 6395143 6858187 7399483 8029518 8772031 9663333
20510 9663333 10727522 11999713 13526749 15367047 17599041 20311699 23604470 27605998
20502B7605998M874257N918963P105543Q370353R562853J0462702J0973114J1094440
20494I5968223J0587731R094104O662834L919832J272624j545441m607580p203114
20486A14149213q741729r400087r632866r505176q904763p951053o887477n918629
20478D7207433n116678m462473l899589l430275l033492k679281k369586k096835
20470B0119224j855039j636851j444125j278059j121877r86003q78677p82360
20462A0136233p01668o25469n80406n36999m83519m60948m33697m01703l61942
20453E549882l25126l06200k80195k35728k01074k14448k25964j87184j60586
20444C413377j82103k04071j79614j57903j58250j55333j32770j19269j05084
$$ plain form
20502 27605998 32480255 38399218 45504761 53875114 63437967 73900669 84873783 95968223
20494 95968223 106555954 115650058 122312892 126232724 127505348 125959907 121352327 114149213
20486 114149213 105407484 96007397 86374531 76869355 67964592 60013539 53126062 47207433
20478 47207433 42090755 37628282 33728693 30298418 27264926 24585645 22216059 20119224
20470 20119224 18264185 16627334 15183209 13905150 12783273 11797270 10918593 10136233
20462 10136233 9434565 8809096 8228690 7691691 7208172 6747224 6313527 5911824 5549882
20453 5549882 5224756 4918556 4638361 4402633 4201559 3987111 3761147 3573963 3413377
20444 3413377 3231274 3027203 2847589 2689686 2531436 2376103 2243333 2124064 2018980
20435B018980r6107q8613q9282q7126p9838o7613p2677p7382o5484n4818m6534
20424A193506n0394m7171m6795l4258l3651k9457l1038k4971k3248k7826j7491
20413H27206j6200k3849j5435k0383k6535j8819j8323j5204j7492j8911j8310
20402F17745j1810j7568k1440j9683j3449j2310q462j0425r673r866j5049j8139
20390D49871j4667j4317j1732j0613r079j0712o306k926n236j0356m686k470k376
20377C44395k549m061j145L402N859J1358K386P793L622j28Q075J0672P84k48
20363C90215p32l52k387m400l551n998q067l299j530m51J199n13J202m237m820
20348C52279O491J210L443k461r766n196o277r624j1634q067o712j274J649j602
$$ plain form
20435 2018980 1922873 1834260 1744978 1657852 1578014 1510401 1437724 1360342 1294858 1240040 1193506
20424 1193506 1143112 1095941 1049146 1014888 981237 951780 920742 895771 872523 844697 827206
20413 827206 811006 787157 771722 751339 724804 705985 687662 672458 654966 636055 617745
20402 617745 605935 588367 566927 547244 533795 521485 513023 502598 492925 483059 468010 449871
20390 449871 435204 420887 409155 398542 389463 378751 372445 369519 364283 353927 349241 346771 344395
20377 344395 341846 337785 336640 340042 345901 357259 359645 367438 371060 370932 379007 389679 390463 390215
20363 390215 389483 389131 386744 382344 378793 372795 364728 361429 359899 359448 360647 360134 361336 357099 352279
20348 352279 358770 359980 363423 360962 351196 346000 339723 330099 318465 310398 303686 302412 304061 302459
20334C02459j3934r522k032j754L12P97j2369r110l622r737j5127q565r646q599
20320A99551j404K866l889k737j1112q125k20J416L370m796L598k257l425p997
20306A64839L338P952l055l488k551n887k29R53J227n333q230K842J494m896k931
20291A46045M74o808m604Q160p953p017q290o13M155Q14p04n97J070J472k740
20276A22864j197l968J614J910n170k620j995K627L504j621j798O96J309K873
20262A19028j703m696l442j700J734k117k555J708j702k142J925M319N01j217
20248A07941j326n375n78l37M534q93j892k442K160N928L476j379l962M456k494
20233A07817l132Q33j093n219L46M466O142P44l241m559M132J576j297K515L251
$$ plain form
20334 302459 288525 279003 276971 275217 275529 276326 263957 254847 251225 241488 226361 217796 208150 199551
20320 199551 198147 201013 197124 194387 183275 175150 174930 176346 179716 174920 178518 176261 172836 164839
20306 164839 168177 176129 173074 169586 167035 161148 160919 161872 163099 157766 149536 152378 153872 148976 146045
20291 146045 146519 139711 135107 143267 135314 128297 120007 119394 123549 124363 123659 123062 124132 125604 122864
20276 122864 121667 117699 119313 121223 116053 113433 111438 114065 117569 115948 114150 114846 116155 119028
20262 119028 117325 112629 109187 107487 109221 107104 104549 106257 104555 102413 104338 108657 109158 107941
20248 107941 106615 101240 100662 100325 104859 103966 102074 99632 101792 107720 111196 109817 105855 110311 107817
20233 107817 104685 105518 104425 99206 99552 104018 110160 110904 107663 103104 107236 108812 107515 110030 113281
20218A13281j660n235p25M895M102L733J991J368M973P325K083K923K464M798
20204A46316O97J0663K595m898o473j037j02j007j432O237M010P067J711J98O032
20189A70577J678l403m692k514p632j5521j9255j4302k0514k1674k0892k2748
20177A9108k0984j6122l611k413r630j2198n40O521P802O939J073p760k300K610
20163c1505k815p582M160M864l754l99P348O849j936K203J782N633M345M563m754
20148a0998l790J453J119M3j966m315N197J1635n47l196n679r11p052J911R859
20133g237J398N858N915P107m649m233p32k225m10L107Q081l173J76p082p587
20118e686K361L968O455M50q44o596M144O592J2M937k505K043N118o81m40q585
$$ plain form
20218 113281 111621 106386 105661 110556 114658 118391 120382 121750 126723 134048 136131 139054 141518 146316
20204 146316 147013 157676 160271 155373 148900 147863 147761 146754 145322 151559 155569 162636 164347 164545 170577
20189 170577 172255 168852 164160 161646 154014 138493 119238 104936 84422 62748 41856 19108
20177 19108 -1876 -17998 -21609 -24022 -33652 -45850 -46390 -39869 -32067 -25128 -24055 -31815 -34115 -31505
20163 -31505 -34320 -41902 -37742 -32878 -36632 -37031 -29683 -22834 -24770 -22567 -20785 -15152 -10807 -6244 -10998
20148 -10998 -14788 -13335 -12216 -12173 -14139 -18454 -13257 -1622 -2169 -5365 -11044 -11955 -19007 -17096 -7237
20133 -7237 -5839 19 5934 13041 8392 4159 3427 1202 792 3899 11980 8807 8983 1901 -5686
20118 -5686 -3325 643 7098 7548 6704 108 4252 10844 10856 15793 13288 15331 20449 19768 19328 10743
20102A0743j216P581J620o441m187L58k919p01m420k066O686L834J0668j260o897
20087A1383k141n572j247Q27M667J808R54k601J735J437J126J309j641J91Q771
20072B1006K944p118l22L076N133P764q279j0290l277Q82Q548m224j570R451J471
20057B5195l04J91k417n815m583L189J258l147m426k536O00J400J120r53J597
20042A0369K507n746j519j458J45M509L026n689O62P019P940j393r019k510L411
20027A2254M767k816q449m112J632r84m417R06R584m207J158M270o548j0018J009
20012e971Q634K406n999N432P110l516k301o837J754R397m046n309K820L052M449
19997A1075n10L552J048p691r269m905P582J0489J745K195P012M857j769K50j363
$$ plain form
20102 10743 9527 17108 18728 12287 8100 8458 5539 4838 418 -1648 5038 8872 19540 18280 11383
20087 11383 9242 3670 2423 3250 7917 9725 10679 8078 9813 11250 12376 13685 12044 12235 21006
20072 21006 23950 16832 16510 19586 24719 32483 24204 13914 10637 11519 20067 15843 14273 23724 25195
20057 25195 24891 25082 22665 16850 12267 15456 16714 13567 9141 6605 7205 8605 9725 8772 10369
20042 10369 12876 7130 5611 4153 4298 8807 11833 6144 6806 13825 21765 20372 11353 8843 12254
20027 12254 17021 14205 5756 1644 3276 2292 -2125 -1219 8365 4158 5316 9586 3038 -6980 -5971
20012 -5971 2663 5069 -930 4502 11612 8096 5795 -1042 712 10109 6063 754 3574 6626 11075
19997 11075 10565 14117 15165 7474 -1795 -6700 882 11371 13116 15311 22323 27180 25411 25661 24298
19982B4298J770j5K328K937m589j794j165J121k497q00j624n187L505K730R47
19967B1965k98m418o998m078L675K326L449K250n778k011m22l709l431J793N515
19952I830J8437N811L521M200J595J296O781R031J2868J3825k63l695k740P26
19938H1223r294j9710j7233r990P091m102j0115k195K484k943o757Q68J744J682
19924A2753m398P26R784N129l208k860o082r692j77O079p856L622N827m28k928
19909F291M261J283l601o884p750l464l946L640N156Q441K111l513k019J257N739
19894G002k581l383q7k801K240l559K2j625p606P93R215R919j637J564j300n635
19878E41o41m619l460k997L631N613K782p01l749n996J886N483N546J558j9m560
$$ plain form
19982 24298 26068 26053 28381 31318 26729 24935 23770 24891 22394 21594 19970 14783 18288 21018 21965
19967 21965 21667 17249 10251 6173 9848 12174 15623 17873 12095 10084 9662 5953 2522 4315 9830
19952 9830 28267 34078 37599 41799 43394 44690 51471 60502 73370 87195 86932 83237 80497 81223
19938 81223 71929 52219 34986 24996 32087 27985 17870 15675 18159 15216 8459 9327 11071 12753
19924 12753 8355 9081 18865 23994 20786 17926 11844 2152 1975 8054 198 3820 9647 9219 6291
19909 6291 10552 11835 8234 1350 -6400 -9864 -13810 -10170 -5014 3427 5538 2025 6 1263 7002
19894 7002 4421 1038 951 -1850 390 -3169 -3147 -4772 -12378 -11585 -2370 7549 5912 7476 6176 541
19878 541 -100 -4719 -8179 -11176 -7545 -1932 850 149 -3600 -9596 -7710 -2227 3319 4877 4858 298
19862B98O405N272Q378m585j829o03q165N25l527o347L322Q063l666n040q773
19847a0272k682J2346K618N725M266J745k234J331j345q603J507j203m914J061
19833f54J2067M199m341K247N803n84o467p718l814n284j547M717L571P128M733
19818A4056M87r502o060j196j12N599O338M323Q09n683l143K401K60l251Q245
19803A3571P086n56r37q348k29J667L520l153n86J668J578P131J04J745J396n168
19787B0489J198K429L426M2M796l458j894Q266P805O649O652P660J4649J7468
19773I6177J7328J5036K1003K5386L4704L7368N2748N3000N5801N5782O0499O3396
19761E88228N4675L8371K1650N520r502k7994m4997n9944o0929m7550m8622m2057
$$ plain form
19862 298 6703 11975 20353 15768 13939 13336 5171 5696 2169 -4178 -856 7207 3541 -1499 -10272
19847 -10272 -12954 -608 2010 7735 12001 13746 11512 12843 11498 2895 4402 3199 -1715 -654
19833 -654 11413 15612 11271 13518 19321 18737 12270 4552 738 -4546 -6093 -1376 2195 9323 14056
19818 14056 14543 5041 -1019 -2215 -2327 3272 9610 13933 14742 9059 5916 8317 8577 5326 13571
19803 13571 20657 20101 19164 10816 10587 12254 15774 12621 12035 13703 15281 22412 22516 24261 25657 20489
19787 20489 21687 24116 27542 27584 32380 28922 27028 35294 43099 49748 56400 64060 78709 96177
19773 96177 113505 128541 149544 174930 209634 247002 299750 352750 408551 464333 524832 588228
19761 588228 642903 681274 702924 708444 698942 670948 625951 566007 505078 457528 408906 366849
19749C66849l7458m2223l9488l3891j7554j8318j4564k1641j6553j3917j4534
19738I6708j7741j1516p316m868j264l152L738J045r83Oo780n292o966j623n61
19723C3435Q05k604l95R34r938n6P000P21n465l527M068M149L718p195j94J67
19707B5623j019n881l915K460M025K947L385m387k380o779p581j619q51m049K70
19692B49O220K262k117k017m199O02l367L903K693j483q22L080j027j85k774p48
19676B70p89j560m37N3O710K633o385l215Q746l851L60Q58j89j803J211Q15O440
19659I867j262k600k225q105k386J678n382K068J0300J283o596K438J296K387
19645B761L239J809J364l739N4k133k591K8K281p528j334O743p54j538k668p633
$$ plain form
19749 366849 329391 287168 247680 213789 196235 177917 163353 141712 125159 111242 96708
19738 96708 78967 67451 60135 55267 54003 50851 54589 55634 54651 54657 47877 42585 35619 33996 33435
19723 33435 34240 31636 31241 32175 22237 22181 29181 29902 24437 20910 24978 29127 32845 25650 25456 25623
19707 25623 24604 18723 14808 17268 21293 24240 27625 23238 20858 14079 6498 4879 4028 -21 249
19692 249 6469 8731 6614 4597 398 1000 -2367 1536 4229 2746 1924 5004 3977 3792 1018 270
19676 270 -519 -2079 -2516 -2463 4247 6880 495 -2720 6026 2175 2535 3393 3204 1401 2612 3427 9867
19659 9867 8605 6005 3780 -4325 -6711 -5033 -10415 -8347 1953 3236 -3360 -922 374 2761
19645 2761 6000 7809 9173 5434 5488 3355 764 792 3073 -4455 -5789 954 200 -1338 -4006 -11639
19629a1639k536K901K774L871N663k232m33Q095k562m139r814n175L986M842J550
19614d848l936L499m26K881l850j651k726M124M352K643O125J0m353n816j453
19599e425J108j205L228P521N136q545p679p998m65L937J616P869N826Q10r555
19584c821j952p943n518J2918Q090r76q07k602n291p74M241L059m84m41k102M190
19568b13J502m421j111K665l699k187M175L502n851L674M116n243l249q53K651
19553d542K807r061M103J0690k335k898k356q75j238K623K432M380K132j046r874
19538e058j858J666J364k91o514k160o27M000J787m028o482J901N33N939N195
19523d633o610m136K095J1244m77l461Mr55k136R710L820q54o054o169J022q19
$$ plain form
19629 -11639 -14175 -11274 -8500 -4629 1034 -1198 -1631 6464 3902 -237 -10051 -15226 -11240 -6398 -4848
19614 -4848 -8784 -5285 -5711 -2830 -6680 -8331 -11057 -6933 -2581 62 6187 6197 1844 -3972 -5425
19599 -5425 -4317 -5522 -2294 5227 10363 1818 -5861 -13859 -14324 -10387 -8771 -902 4924 5734 -3821
19584 -3821 -5773 -13716 -19234 -6316 1774 798 -9 -2611 -7902 -8676 -4435 -1376 -1860 -2301 -4403 -213
19568 -213 1289 -3132 -4243 -1578 -5277 -7464 -3289 213 -5638 -1964 2152 -3091 -6340 -7193 -4542
19553 -4542 -1735 -10796 -6693 3997 1662 -1236 -3592 -4467 -5705 -3082 -650 3730 5862 4816 -5058
19538 -5058 -6916 -5250 -3886 -4177 -10691 -12851 -13478 -9478 -7691 -11719 -18201 -16300 -15767 -9828 -4633
19523 -4633 -11243 -15379 -13284 -2040 -2517 -5978 -5974 -6929 -9065 645 4465 3611 -2443 -8612 -7590 -8409
19507h409L418P144l737k306J639P95L32K083P36K442J951n127j384p424J222
19492f625M16L981K291k927O86Q031K4n924p717K197P075l924m207l034k102M815
19476f944Q333M702l738l076J067n554N57M076n710j67P647O392n80m377m7j47
19460B434j569L603m654j927l968K392K887L05q64r60k210m726r76J010J586j983
19444i620j086L405k212K179j238Q50J716J773L574k263l845P2k407k28q5O0Q404
19427i51L463k121j326J841%q41n043K258n188k489p60M763Q699K010o790J541
19411i34K255j36J921j998p660K746N58l839j198R40p799k625J963P561K883J744
19395c618l961l328k784K397K861R54j913k598m283K053K791K084r9J935O15l138
$$ plain form
19507 -8409 -4991 2153 -1584 -3890 -2251 -1456 -1124 959 1695 4137 6088 961 -423 -7847 -6625
19492 -6625 -6209 -2228 63 -2864 -2178 5853 5877 -47 -7764 -5567 1508 -2416 -6623 -9657 -11759 -6944
19476 -6944 1389 6091 2353 -723 344 -5210 -4653 -577 -6287 -6454 1193 7585 7005 2628 2581 2434
19460 2434 865 4468 -186 -2113 -6081 -3689 -802 -497 -1361 -2321 -4531 -9257 -10233 -9223 -7637 -9620
19444 -9620 -10706 -7301 -9513 -7334 -8572 -7722 -6006 -4233 -659 -2922 -6767 -6695 -9102 -9330 -9415 -9355 -951
19427 -951 2512 391 -935 906 906 65 -4978 -2720 -7908 -10397 -11157 -6394 2305 4315 -2475 -934
19411 -934 1321 1185 3106 1108 -6552 -3806 -3248 -7087 -8285 -7345 -15144 -17769 -15806 -8245 -5362 -3618
19395 -3618 -7579 -10907 -13691 -11294 -8433 -7479 -9392 -11990 -16273 -14220 -11429 -9345 -9444 -7509 -6894 -10032
19379a0032N46N741q58j542j773N30K181l892p363K810O720M301L108j39p426
19364g088J18K635m837j952N64m492L153R990O76l649L061J290n026l701l059
19349a2317k961K342M559L503K075l819K019j132L77J198r78l165j520N398M498
19334G7k64j046l994n792l691M213Q385L384j830n903k182J742K284M656l993
19319c954k978J449M096O22J31o571k950q22Q8Q946L677q114l445j513M509L269
19303c560Q98O47k661L548k349j156K226Q59j844r480n021K791J781M120p650
19288a6851k721J971p45K190K489O246R19K070j103M517M343O65j316j281J068
19273B461o252k359k06k077j734O337M02m08J590N11k956k333o086k887k191m170
$$ plain form
19379 -10032 -9486 -3745 -4603 -6145 -7918 -7388 -5207 -9099 -16462 -13652 -6932 -2631 477 338 -7088
19364 -7088 -6970 -4335 -9172 -11124 -10560 -15052 -11899 -1909 -1233 -4882 -1821 -531 -5557 -9258 -12317
19349 -12317 -15278 -12936 -8377 -4874 -2799 -6618 -4599 -5731 -5354 -4156 -5134 -8299 -9819 -4421 77
19334 77 -187 -1233 -5227 -11019 -14710 -10497 -2112 1272 -558 -6461 -8643 -6901 -4617 39 -3954
19319 -3954 -6932 -5483 -1387 -765 -634 -7205 -10155 -10977 -10889 -1943 1734 -6380 -9825 -11338 -6829 -3560
19303 -3560 -2662 -2015 -4676 -1128 -3477 -4633 -2407 -1548 -3392 -12872 -17893 -15102 -13321 -9201 -16851
19288 -16851 -19572 -17601 -18346 -16156 -13667 -7421 -6502 -4432 -5535 -1018 3325 3990 2674 1393 2461
19273 2461 -3791 -6150 -6356 -8433 -10167 -3830 -3428 -3836 -2246 -1735 -4691 -7024 -13110 -15997 -18188 -22358
19257b2358N316N279k348O25M081L647M168M445K83j528m298l608l141J771k796
19242a0462m999m496L59M832Q870N789l020m395o913p481J0722M002k637k778
19228a2607L600K578J450l40J306j0502n05J992q74j867R51M239J2595L578L390
19213H984k326j0466m066M720p8n141m583M315R598P328q50l781m143N46J813
19198A870n898L894L128j39l054q316m580K400N531M134m926k521N0L23N29L964
19182c611N763J029m967N45m923k402L452j136l500l437k146N125J667M860j4
19167c695k586M088J283j786j358p010L611j237l635k185J662P022N731l23l197
19152c615M081J682J673L294k721l925K320j68p323J434k57l049M01K505n71k267
$$ plain form
19257 -22358 -17042 -11763 -14111 -13486 -9405 -5758 -1590 2855 3138 1610 -2688 -6296 -9437 -7666 -10462
19242 -10462 -15461 -19957 -19598 -14766 -5896 -107 -3127 -7522 -14435 -21916 -11194 -7192 -9829 -12607
19228 -12607 -9007 -6429 -4979 -5319 -4013 -14515 -15020 -13028 -13902 -15769 -14818 -10579 2016 5594 8984
19213 8984 6658 -3808 -7874 -3154 -3232 -8373 -12956 -8641 957 8285 7435 3654 -489 57 1870
19198 1870 -4028 -134 2994 2855 -199 -8515 -13095 -10695 -5164 -1030 -5956 -8477 -8427 -8104 -7575 -3611
19182 -3611 2152 3181 -1786 -1241 -6164 -8566 -5114 -6250 -9750 -13187 -15333 -10208 -8541 -3681 -3695
19167 -3695 -6281 -2193 -910 -2696 -4054 -11064 -7453 -8690 -12325 -14510 -12848 -5826 -95 -418 -3615
19152 -3615 466 2148 3821 7115 4394 469 2789 2621 -4702 -3268 -3525 -6574 -6173 -3668 -4239 -6506
19136f506n487m63N198M157K292M941L98j282j661k727K516n265l465k19ml758
19120a1335k639n9L747O04J527M904L537P87K163k046o070n7N443l546r741N149
19104g632J4318J003m134r32k215j068N90n772n519M07m960J416L911R826L146
19089B385p454k180Q82n70n525m723K326K129L341O980J872l647l093J641L912
19074a724L795L237j375l456N9P098n54k24l736m563M089o820p937M187Q141l847
19058c630j877Q771J582k652j868l070o25k590m013l530k863l889p12M440O817
19043i709K289L605m65l168K437l905k481K234M727r07K717O92M403k230k206
19028a967K578m385r47K022n94K251L202K276m721k943J918j953k145m45L766
$$ plain form
19136 -6506 -11993 -12456 -7258 -3101 -809 4132 4530 3248 1587 -1140 1376 -3889 -7354 -7573 -7577 -11335
19120 -11335 -13974 -14033 -10286 -9682 -8155 -3251 286 1073 3236 1190 -4880 -4937 506 -3040 -12781 -7632
19104 -7632 6686 7689 3555 2623 408 -660 -70 -5842 -11361 -10954 -15914 -14498 -10587 -761 2385
19089 2385 -5069 -7249 -6367 -6937 -12462 -17185 -14859 -12730 -9389 -2409 -537 -4184 -7277 -5636 -1724
19074 -1724 2071 5308 3933 477 536 7634 7080 6856 3120 -1443 2646 -4174 -12111 -7924 217 -3630
19058 -3630 -5507 3264 4846 2194 326 -2744 -3369 -5959 -9972 -13502 -16365 -20254 -20966 -16526 -9709
19043 -9709 -7420 -3815 -4280 -7448 -5011 -8916 -11397 -9163 -4436 -5343 -2626 -1934 2469 239 -1967
19028 -1967 611 -3774 -4721 -2699 -3293 -1042 2160 4436 -285 -3228 -1310 -3263 -5408 -5853 -2087
19013b087O025K392k157L64k538J419K367J160M718n168p806o914n31j431R31
18998i256K965N822k47n706k986j14L53L545J586M575N512l415p680j2045q96
18983a7987N028N043L364l238L957K661n249k025Q724j744J177J943k40j233N09
18968F90R69q82j2560l742O934P279K557k411q937o203K762O319p251n774j297
18953b1547j510J0799P217L51p12K678j097N404M675p544k179j821m96J281Q13
18938c688K503j996J918p96J646j512m649J146m325Q92K512R58Q08n618l467K180
18922a1488K280k194J412L413K729k043k78q31n280m657N97N199Q260j305l168
18907g354K108M889k169o87N472j571J560k592m850k581O50k711k977M476N105
$$ plain form
19013 -2087 3938 6330 4173 4537 1999 3418 5785 6945 11663 6495 -1311 -8225 -8756 -10187 -9256
18998 -9256 -6291 -469 -716 -6422 -9408 -9522 -9169 -5624 -4038 537 6049 2634 -5046 -17091 -17987
18983 -17987 -12959 -7916 -4552 -7790 -3833 -1172 -6421 -8446 278 -1466 -289 1654 1414 181 690
18968 690 1659 777 -11783 -15525 -8591 -1312 1245 -1166 -10103 -16306 -13544 -7225 -14476 -20250 -21547
18953 -21547 -23057 -12258 -5041 -4690 -5402 -2724 -3821 1583 6258 -1286 -3465 -5286 -5782 -4501 -3688
18938 -3688 -1185 -3181 -1263 -2059 -413 -1925 -6574 -5428 -9753 -8861 -6349 -5391 -4583 -10201 -13668 -11488
18922 -11488 -9208 -11402 -9990 -6577 -3848 -5891 -6169 -7000 -12280 -16937 -16340 -11141 -2881 -4186 -7354
18907 -7354 -5246 -357 -2526 -3213 2259 688 2248 -344 -5194 -7775 -7125 -9836 -12813 -8337 -3232
18892c232Q007J296j701m937m866J420Q244o6m676N174J392k867J724O632k428
18877I116m361K64k548k805k491L587k206j207r380n539K516M537m217j699r35
18862a7368k405P993P260L059k752n947m764J641M046q75R22K793N533J806J363
18847B305j725o699r010K247L016k664M876L308n605K693K042j776k726L814k96
18832f200J567L572O199j242o831k922Q391K834o162m932j108m860R37L828r83
18817g912R65l884n83j298J510O044j641n247M275j615k631L286o41o86M809j477
18801f726j138L370O388K259j548o426l713m294l664L610M754L758j677K260M488
18786A701R0N072K743l801o256m536M974K649j071n400L779O058K957n401j955
$$ plain form
18892 -3232 4775 6071 4370 -567 -5433 -4013 4231 4165 -511 4663 6055 3188 4912 11544 9116
18877 9116 4755 5019 2471 -334 -2825 762 -1444 -2651 -12031 -17570 -15054 -10517 -14734 -16433 -17368
18862 -17368 -19773 -11780 -4520 -1461 -4213 -10160 -14924 -13283 -9237 -10112 -9190 -6397 -864 942 2305
18847 2305 580 -6119 -15129 -12882 -9866 -12530 -7654 -4346 -9951 -7258 -5216 -6992 -9718 -5904 -6200
18832 -6200 -4633 -1061 5138 3896 -2935 -5857 2534 5368 -794 -5726 -6834 -11694 -10757 -6929 -7912
18817 -7912 -6947 -10831 -11414 -12712 -11202 -5158 -6799 -12046 -7771 -9386 -12017 -8731 -9372 -10058 -5249 -6726
18801 -6726 -7864 -4494 1894 4153 2605 -3821 -7534 -11828 -15492 -11882 -7128 -3370 -5047 -2787 1701
18786 1701 1791 6863 9606 5805 -451 -4987 -13 2636 1565 -3835 -56 6002 8959 3558 1603
18771A603L748M742K442O778P95k252O902J0144m615j0009J030r497j0784K240
18757C267j124l06m807m126r83J302k786j635M419N696j228m708m856n798J08
18742a7565J17m44K37Q8J840j240J32N201J506Q92j314J525j007P467l894J26
18726f333K886j05k784j9n548l458K676P168k820j427J926K486l017M18j849L600
18710f200L783M538k568j444J764J978k604n981K627Q051l04j726K673k730K426
18695D283r61j563k202n002k35J937O155k411p869q94O387M618j677l672m514
18680g620J589L232j55L013J630p310k280J823L341r46k678M340K22l934l024
18665h757k760j488R343J746J047J054n357r94J932K022N775N713m772j216j192
$$ plain form
18771 1603 5351 10093 12535 19313 20108 17856 24758 34902 30287 20278 21308 11811 1027 3267
18757 3267 2143 1837 -2970 -7096 -8079 -6777 -9563 -11198 -6779 -1083 -2311 -7019 -11875 -17673 -17565
18742 -17565 -17448 -17892 -17655 -17567 -15727 -16967 -16835 -11634 -10128 -9236 -10550 -9025 -10032 -2565 -6459 -6333
18726 -6333 -3447 -3552 -6336 -6355 -11903 -15361 -12685 -5517 -8337 -9764 -7838 -5352 -8369 -7951 -9800 -6200
18710 -6200 -2417 2121 -447 -1891 -127 1851 -753 -6734 -4107 3944 3640 1914 4587 1857 4283
18695 4283 3322 1759 -443 -5445 -5680 -3743 2412 1 -7868 -8762 -2375 2243 566 -3106 -7620
18680 -7620 -6031 -2799 -2954 59 1689 -5621 -7901 -6078 -2737 -3683 -6361 -2021 -1799 -5733 -8757
18665 -8757 -11517 -13005 -3662 -1916 -869 185 -5172 -6166 -4234 -2212 3563 9276 4504 3288 2096
18650B096k491N815o378m023J2628l520o024N94m149n428o445j725J489L392J05
18635a4064m347k945Q580O851K687p70l60N417k576m438N52J111R798L225l093
18620E628o288p039l191M188J108j877q46k595K963m988N1N480P932M087K404
18605G017L234r622k789k038K179k21J855n249l821k711R95P376K431k11l147
18590d722j342M734k539j03k656K945r07N287L089m523r9j119L077l274N60k200
18574c792J816K885m85l424j816K77k30J158k097j821J820O264O661L19P70L22
18558H627q70n250M274K712q278n604K000M018l189m200O595M293j750o71J260
18543C967q902o036O332k59m938P562K510l89o057M320j267k267l813n658K868
$$ plain form
18650 2096 -395 5420 -958 -4981 7647 4127 -1897 -1303 -5452 -10880 -17325 -19050 -17561 -14169 -14064
18635 -14064 -18411 -21356 -12776 -5925 -3238 -4008 -4368 1049 -1527 -5965 -5413 -4302 5496 8721 5628
18620 5628 -660 -7699 -10890 -6702 -5594 -7471 -8317 -10912 -7949 -12937 -12886 -7406 526 4613 7017
18605 7017 10251 629 -2160 -4198 -2019 -2240 -385 -5634 -9455 -12166 -11171 -3795 -1364 -1575 -4722
18590 -4722 -6064 -1330 -3869 -3972 -6628 -3683 -4590 697 3786 -737 -836 -1955 1122 -2152 -1592 -3792
18574 -3792 -1976 909 424 -3000 -4816 -4539 -4769 -3611 -5708 -7529 -5709 555 7216 7535 8305 8627
18558 8627 7757 2507 6781 9493 1215 -4389 -2389 1629 -1560 -5760 835 5128 3378 2707 3967
18543 3967 -4935 -10971 -4639 -4898 -9836 -2274 236 -153 -6210 -1890 -3157 -5424 -9237 -14895 -12027
18528a2027R824O404m201J583L131j734m771l758P373J089m591K079O931J006
18514H338j316m445m320J48q1l603j898O09N587O162K366n878K680o134j872K351
18498a306K976l97j97n568P11j792p934p382L075n88J965L511P056K147M965L024
18482D266N98K704q21m520l547o578m048J359Q012L885K264q902q33P52m935l54
18466a0698L527l14K860L476K938R83j474p142m95k297K476k484M114L655L87
18451d88J511l28j200l818R16M080M128o510N79K872j104L51j772J621L148j287
18435B699l315j706M052M190j0746J307O959M30l72l005K236K370k225j29M690
18420G435k990Q3K827m616O8J652m764p896r795o3j254L255O748M647k807j953
$$ plain form
18528 -12027 -2203 4201 0 1583 4714 2980 -1791 -5549 1824 2913 -1678 401 7332 8338
18514 8338 7022 2577 -1743 -1595 -1676 -5279 -7177 -6568 -981 5181 7547 1669 4349 -1785 -3657 -1306
18498 -1306 1670 1273 1076 -4492 -3781 -5573 -13507 -20889 -17814 -18402 -16437 -12926 -5870 -3723 1242 4266
18482 4266 4864 7568 6747 2227 -1320 -7898 -11946 -10587 -2575 1310 3574 -5328 -6161 -5409 -10344 -10698
18466 -10698 -7171 -7485 -4625 -1149 1789 2772 1298 -5844 -6339 -8636 -6160 -8644 -4530 -875 -488
18451 -488 1023 695 -505 -4323 -3407 673 4801 -1709 -1130 1742 638 989 -783 838 3986 2699
18435 2699 -616 -2322 1730 5920 -4826 -3519 3440 3870 3498 493 2729 5099 2874 2745 7435
18420 7435 4445 4528 7355 2739 2807 4459 -305 -8201 -17996 -18059 -19313 -16058 -9310 -4663 -7470 -9423
18404i423M459K843L850P33p563j193J17k125k062r32N840M828o19L637k574m739
18388d923k880j051Q01J692m41o130l64R78K244M549L637j751K929M729J626l580
18372B065k697O123J064j998N104K820J275l396m930K290L619r16k192l375l228
18357A628j397m627n153J991l67L556j157k992k52q82O609J966k381J371L77K475
18341G65K546l962l066J055k085n047l949L868P97q80O065P471R22k726j667m269
18325d162J282N778m899k070J875N704m363j929n226m186K666J222J756o828j701
18310a5081M755j298l960O183J21j314M379M675j964o115J785M333L319l208m916
18295h306K384p55K864n454P253J372n370k306j742N669J197k401M159K978N239
$$ plain form
18404 -9423 -4964 -2121 1729 2462 -5101 -6294 -6177 -8302 -10364 -11296 -5456 -628 -1247 2390 -184 -4923
18388 -4923 -7803 -8854 -8053 -6361 -6802 -12932 -13296 -12318 -10074 -5525 -1888 -3639 -710 4019 5645 2065
18372 2065 -632 5491 6555 4557 9661 12481 13756 10360 5430 7720 11339 10423 8231 4856 1628
18357 1628 231 -4396 -9549 -7558 -7925 -4369 -5526 -8518 -8770 -9652 -3043 -1077 -3458 -2087 -1710 765
18341 765 3311 -651 -3717 -2662 -4747 -9794 -13743 -9875 -9078 -9958 -3893 3578 4500 1774 107 -4162
18325 -4162 -2880 2898 -2001 -4071 -2196 3508 -855 -2784 -8010 -12196 -9530 -8308 -6552 -13380 -15081
18310 -15081 -10326 -11624 -15584 -9401 -9280 -10594 -6215 -1540 -3504 -9619 -7834 -3501 -182 -3390 -8306
18295 -8306 -5922 -6677 -3813 -9267 -2014 -642 -6012 -8318 -10060 -4391 -3194 -5595 -1436 1542 6781
18280F781j546q660n758j545K655O31J680L854O964m756q74k477j251L764j831
18265b369L411L665m856n834o536O524P984K205p426o819K485Q414J1363J010
18251A3221l349j1515q180J530N349j086O989m613m896k719K234K677P81L535
18237d2j564P17L991J379K053n433l287K625K707k418J667N090L372J488J23L607
18221A6075j424o368l467l963R182J933q71M159m23q234m445Q02p360o544M917
18206f031K482P16j439O575n71K998O562K388k781n774M820k861q2o305j553K537
18190A681K075L744J452J59N53l649m540q167R83K006Q414J615l930Q03J127k084
18174B242p623N022O502M255l530l137Q990N246n672j302j38m354k321N139O395
$$ plain form
18280 6781 5235 -3425 -9183 -10728 -8073 -7442 -5762 -1908 5056 300 -574 -3051 -4302 -538 -2369
18265 -2369 1042 4707 -149 -5983 -12519 -5995 1989 4194 -3232 -10051 -7566 848 12211 13221
18251 13221 9872 -1643 -9823 -8293 -2944 -4030 2959 -1654 -6550 -9269 -7035 -4358 -3577 -42
18237 -42 -1606 -889 3102 4481 6534 1101 -2186 439 3146 728 2395 7485 10857 12345 12468 16075
18221 16075 14651 8283 4816 853 10035 11968 11097 15256 14833 6599 2154 2956 -4404 -10948 -6031
18206 -6031 -3549 -2833 -4272 2303 1732 4730 11292 13680 10899 5125 9945 7084 7002 697 -856 1681
18190 1681 3756 7500 8952 9111 9664 6015 1475 -6692 -5709 -3703 4711 6326 2396 3199 4326 2242
18174 2242 -5381 -359 6143 10398 6868 3731 12721 17967 12295 10993 10855 6501 4180 9319 15714
18159A5714N0K340K178O462k8o172o080j476L183L567j007P314l713o820L241
18144A8753J591N426Q863K585L741K633K678R91L992m085k781J2207J5423J1264
18130H3281M552r26R663J6746J5949J2561J5911K6311K9299M0613N7694P8420
18118C90074J06814J50447J89804K24696K87208M07512O23575J001540J520635
18109D902305J609600P52353J49669M53487K60959j236537j998051j360765p24574
18100B808446m27842l38564k76321k22495j81412j49664j36695j27179j20040
18091H28234j07924q8271p5752o4493o0513n1774m0371k9373k6464k6206k7220
18080B29873l3000j7161j4047j6356j4749j2666j0728m191m383p119r003j3039
$$ plain form
18159 15714 15764 18104 20282 26744 26716 20544 14464 12988 16171 19738 18731 26045 22332 15512 18753
18144 18753 20344 25770 34633 37218 40959 43592 46270 47261 51253 47168 44387 56594 72017 83281
18130 83281 87833 86907 96570 113316 129265 141826 157737 184048 213347 253960 311654 390074
18118 390074 496888 647335 837139 1061835 1349043 1756555 2380130 3381670 4902305
18109 4902305 6511905 7264258 7413927 7867414 8128373 6891836 4893785 3533020 2808446
18100 2808446 2380604 2042040 1765719 1543224 1361812 1212148 1075453 948274 828234
18091 828234 720310 632039 556287 491794 431281 379507 339136 309763 283299 257093 229873
18080 229873 196873 179712 165665 149309 134560 121894 111166 106975 102592 95473 86470 73431
18068G3431j3556p340m342k165j408l771j142J957l831m571m310N42K952R70o217
18053B7199p143R43k466P486P015l047p399j958j1735m122K056K805j285k715
18039E634L993p90N72p230l423j504P956L065j800k758M083r53J041N482j564
18024A1804o213n274N411m799k961l300k857o228P271L294j430K523M415K868
18010D524J09j465k02j123k45N58m771k766Q05k493k468N52j160M84j131L598
17994g194N795K225n81J11l475k320k203J72K981q54M445N618J619M213k557p3
17978G922j419l674N99L886L121j977q99m272J814J392K347L782r12K115J167
17963A4992l300n727j945o96R82j150o361n513r52k014M06k255k224K888P970
$$ plain form
18068 73431 59875 52535 48193 46028 44620 40849 39707 41664 37833 33262 28952 29494 32446 33416 27199
18053 27199 20056 20999 18533 26019 33034 29987 22588 20630 8895 4773 6829 9634 8349 5634
18039 5634 9627 8837 9409 2179 -1244 -2748 5208 8273 6473 3715 7798 6845 7886 13368 11804
18024 11804 5591 317 5728 929 -2032 -5332 -8189 -14417 -7146 -3852 -5282 -2759 1656 4524
18010 4524 4633 3168 2966 1843 1598 2156 -2615 -5381 -4576 -7069 -9537 -8985 -10145 -9661 -10792 -7194
17994 -7194 -1399 826 245 356 -3119 -5439 -7642 -7470 -4489 -5343 -898 4720 6339 10552 7995 7922
17978 7922 6503 2829 3428 7314 10435 8458 7559 3287 5101 6493 8840 12622 11710 13825 14992
17963 14992 11692 5965 4020 3324 4306 3156 -3205 -8718 -9670 -11684 -11278 -13533 -15757 -12869 -4899
17948d899M256r727k327K167Q424O367N264k841l265l914l873k546L858k803L181
17933b678M672P4k138J510k02n609p39n1L274J0130J374K911o30o805J114P298
17917A3505m776r725J503O50l618l421J833k645p44P1K143L729O23L263P411L33
17901A0135m306q921o657l841o4M183K384J73j754n791L13j161K009J9L289N275
17885d715k390O400k577j922N478l566o00p22j533J053K339K534m338m400L331
17870e628j993k675P388M031n581j323N090N912n169l727M763N036r04J677l627
17855C270J05l689m896J006m018M484L251P59O03q15O117j865M83n767j988M299
17839A339N699M847J044K844J225R68m620l005K359l650n682m740j0975l60n47
$$ plain form
17948 -4899 -643 -10370 -12697 -10530 -2106 4261 9525 6684 3419 -495 -4368 -6914 -3056 -5859 -2678
17933 -2678 1994 2068 -70 1440 1238 -4371 -5110 -5161 -1887 8243 9617 12528 11898 5093 6207 13505
17917 13505 8729 -996 507 1157 -2461 -5882 -4049 -6694 -7438 -7367 -5224 -1495 -872 2391 9802 10135
17901 10135 5829 -3092 -9749 -13590 -13654 -9471 -7087 -6914 -8668 -14459 -14146 -15307 -13298 -13279 -9990 -4715
17885 -4715 -7105 -705 -3282 -5204 274 -3292 -3892 -4614 -6147 -5094 -2755 -221 -4559 -8959 -5628
17870 -5628 -7621 -10296 -2908 1123 -4458 -5781 -691 5221 52 -3675 1088 6124 5220 6897 3270
17855 3270 3375 -314 -5210 -4204 -8222 -3738 -487 272 875 60 6177 4312 4795 -972 -2960 1339
17839 1339 7038 11885 12929 15773 16998 17966 13346 10341 12700 9050 3368 -1372 -12347 -12707 -13254
17824a3254M204P472k666P136P170P253K194j814p970j434p207J081q38j542k007
17809b222m211M86M331p341K167M642N963m145l655r89M324n683L078j932j1981
17794a7168K70M535K766K307o72L625L944j10j493j0237n874K625O464k509m201
17779a5728N110Q501N717r327m422L320M173N636p91o67l317j357j560k380J263
17764e829j58K571L237M739m343l097m876m353L46K249J42l303J697m101N904
17749i175N837j268M377l769j0695N229J563K128P188L760r55m141K62l237l520
17734f416j838m57l655k860p45k948j178Q084K874J895L81N059r98m503J777N698
17718A70l495k761M777J776n33o118l691J671m015k950L08O561M492O260n053
$$ plain form
17824 -13254 -9050 -1578 -4244 2892 10062 17315 19509 17695 9725 8291 1084 2165 1327 -215 -2222
17809 -2222 -6433 -5947 -1616 -8957 -6790 -2148 3815 -330 -3985 -4974 -650 -6333 -3255 -5187 -17168
17794 -17168 -16898 -12363 -9597 -7290 -7962 -4337 -393 -503 -1996 -12233 -18107 -15482 -9018 -11527 -15728
17779 -15728 -10618 -2117 3600 -5727 -10149 -6829 -2656 2980 2189 1522 -1795 -3152 -4712 -7092 -5829
17764 -5829 -5987 -3416 -179 4560 217 -2880 -7756 -12109 -11763 -9514 -9372 -12675 -10978 -15079 -9175
17749 -9175 -3338 -4606 -229 -3998 -14693 -9464 -7901 -5773 1415 5175 4220 79 341 -2896 -6416
17734 -6416 -8254 -8711 -12366 -15226 -15971 -18919 -20097 -12013 -9139 -7244 -6863 -1804 -2802 -7305 -5528 170
17718 170 -3325 -6086 -1309 467 -66 -6184 -9875 -8204 -12219 -15169 -14861 -8300 -3808 2452 -2601
17703b601K585K585p047j944K175L782j138k04k142L791j799n646l220L371P452
17688@J572p137J52L609j105k135R037k233L05J598l408K756j572L598J900K354
17672I291j359p193j325k640q64O771K694j709k773k47n33o128R23k302L264O81
17656c449o9j633r563l657J0295R392m164K262m347n657m5Q782J557l383j031
17641d710k24J913k855r46N48M2l17L287k472n908p988n479J296J1885M140m330
17625a2118P324O717m62p812n12N183k361n370n133K045l674N186L751K169J92
17610d875m685l425l082J0844R562M273q167n545k050m097O631L672J673K769
17596C498k342k613r51n116p506k741L635P082J796J07j605M40M620n45q967q005
$$ plain form
17703 -2601 -16 2569 -4478 -6422 -4247 -465 -1603 -1807 -3949 -158 -1957 -7603 -10823 -7452 0
17688 0 1572 -5565 -5413 -1804 -2909 -5044 3993 1760 2065 3663 255 3011 1439 5037 6937 9291
17672 9291 7932 739 -586 -3226 -4090 2681 5375 3666 893 646 113 -6015 -5092 -7394 -4130 -3449
17656 -3449 -3518 -5151 -14714 -18371 -8076 1316 -2848 -586 -4933 -10590 -10635 -1853 -296 -3679 -4710
17641 -4710 -4934 -3021 -5876 -6822 -6274 -6232 -6549 -3262 -5734 -11642 -19630 -25109 -23813 -11928 -7788 -12118
17625 -12118 -4794 1923 1461 -6351 -6863 -1680 -4041 -9411 -14544 -12499 -16173 -10987 -7236 -5067 -4875
17610 -4875 -9560 -12985 -16067 -5223 4339 8612 445 -5100 -7150 -11247 -4616 -944 729 3498
17596 3498 1156 -1457 -2408 -7524 -15030 -17771 -14136 -7054 -5258 -5151 -6756 -6316 -1696 -2241 -11208 -19213
17580a9213K726Q427L266P58N667K477m738o837n571K870R821j182o368J651p17
17565f963j977O725j021m849M895K408L580j895j118K732o288M324k662M156M141
17550F188P380Q109l915j2497l157O97k312j199O31j621N141K97n66k776q68m926
17534e394P34J615j113J412K470L699j668l810p99r20O341P44J152N157N493j296
17518A3817k645l094J136n970j183n29o410P57j5K556J549J915K843k2k881k173
17502c49l270M98J534K069o836p376L629N350k114K170k677m965j350J243K227
17487a0217Q791O901m20J440k691L277L881m553j954k206N79M669k219m090O789
17472G977N728J639l590n181j021L255m061m175k635n208Q672R367l006l330j689
$$ plain form
17580 -19213 -16487 -8060 -4794 -4036 1631 4108 -630 -7467 -13038 -10168 -347 -1529 -7897 -6246 -6963
17565 -6963 -8940 -2215 -3236 -8085 -3190 -782 2798 903 -215 2517 -3771 553 -2109 2047 6188
17550 6188 13568 21677 17762 5265 2108 2805 493 -706 -75 -1696 3445 3742 3176 400 -468 -5394
17534 -5394 -4660 -3045 -4158 -2746 -276 3423 1755 -2055 -2854 -3774 2567 3311 4463 9620 15113 13817
17518 13817 11172 8078 9214 3244 2061 1532 -4878 -4121 -4136 -1580 -31 1884 4727 4705 1824 -349
17502 -349 -3619 -3121 -1587 482 -6354 -13730 -10101 -4751 -6865 -4695 -7372 -12337 -13687 -12444 -10217
17487 -10217 -1426 5475 5055 6495 3804 7081 10962 6409 4455 2249 2828 7497 5278 1188 7977
17472 7977 13705 15344 11754 6573 5552 8807 4746 571 -2064 -7272 1400 10767 7761 4431 2742
17457B742M663M579m901k730m678K861K962J3535r119o215j25m47L587N095J1340
17442B3149P920N422k386J0705P02j129j1509r898k928N0J845o631k652l885m773
17427D002j58J180l7k5K631m001n165Q18O169l987q787K596M090j0087k200J273
17411a1688l364n07r27P616M196K598r73R26Q294n70o176K7J331L939l918k463
17395a659J285N332M064O84n188n967k37J914L467p605j721P338P658m786q207
17380c628o069J192O049L796N068n066M60L42K057q118n446o461J686o74K575
17365a2237O680l532l693N507K049n893l817R35P533N130K714N279M173k516n827
17350B485K517n759m28J422k47J460M882M318q53k963p190n450j791R11o32J223
$$ plain form
17457 2742 7405 11984 7083 4353 -325 2536 5498 19033 9914 3699 3574 3127 6714 11809 23149
17442 23149 31069 36491 34105 44810 45512 44383 32874 22976 20048 20098 21943 15312 12660 8775 4002
17427 4002 3844 5024 4987 4962 7593 3592 -1573 -755 5414 1427 -7360 -4764 -674 -10761 -12961 -11688
17411 -11688 -15052 -15559 -16486 -8870 -4674 -2076 -3049 -2123 6171 5601 -575 -548 783 4722 804 -1659
17395 -1659 -374 4958 9022 9706 4518 -1449 -1686 228 3695 -3910 -5631 1707 9365 4579 -3628
17380 -3628 -9697 -8505 -2456 1340 6408 1342 1802 2144 4201 -3917 -9363 -15824 -14138 -14812 -12237
17365 -12237 -5557 -9089 -12782 -7275 -5226 -11119 -14936 -14001 -6468 -1338 1376 6655 10828 8312 2485
17350 2485 5002 -757 -1185 237 -10 1450 6332 10650 9797 6834 -356 -5806 -7597 -6686 -7318 -6095
17334f095M203N012p922k256K876l836o187k91q24J582M301M720Q209R571l746
17319I317p156l827m069j14K156R73J060q157m084J5637O393N34o739o275J571
17304b780J676l88l36k264J110n244j0726o090M973P499K373L820K19J591L79
17289d188k140k974j328J49r98O593M168k669j860L716J730l470K473L171o787
17274d414o012M159l608L473j207r43R941j846l320k36J277K073m496n446k587
17259a3192J121j977j318L902L872K941K087k675L05n28l981l763N903R368K158
17244D223N098N59q412l385K859j327J481J526m18J116M033l57J09n626q650k90
17228g461j212m79O965N62O92K548R0k544m700J330K224L024M1m297n97K712l653
$$ plain form
17334 -6095 -1892 3120 -4802 -7058 -4182 -8018 -14205 -14496 -15320 -13738 -9437 -4717 3492 13063 9317
17319 9317 2161 -1666 -5735 -5849 -3693 -2720 -1660 -9817 -13901 1736 8129 8663 1924 -4351 -2780
17304 -2780 -1104 -1492 -1828 -4092 -2982 -8226 -18952 -25042 -20069 -12570 -10197 -6377 -6158 -4567 -4188
17289 -4188 -6328 -9302 -10630 -10481 -11479 -4886 -718 -3387 -5247 -1531 199 -3271 -798 2373 -4414
17274 -4414 -10426 -6267 -9875 -6402 -7609 -8552 1389 -457 -3777 -4013 -2736 -663 -5159 -10605 -13192
17259 -13192 -12071 -14048 -15366 -11464 -7592 -4651 -2564 -5239 -4934 -5462 -9443 -13206 -7303 2065 4223
17244 4223 9321 9880 1468 -1917 942 -385 1096 2622 2204 3320 7353 6996 7105 1479 -7171 -7461
17228 -7461 -8673 -9152 -2187 -1625 -933 1615 1705 -839 -5539 -4209 -1985 1039 1080 -3217 -3814 -1102 -4755
17211d755J928l618m658M991j173j747P23O377Q517p07o495l095K59m044J417
17196f080o326K024O107M527k258l607n44p12o859r35J472J25J705M367K181O713
17180A900l278j975K211n05M00j482J182J906l36j600m004q48p39j253m524K283
17164a0662M574K296j659j171k653O618j186L197k569o236r9j955N817M119K078
17149E09l25j616j601L418M143J912M265k505m852Q52l6K34L647o444j3705p435
17133a9539k134K696P150N508J783M719j584n469L941L636R27m959J88L492j132
17118g77j775m068K567p91m349o008l76K02O436J990m579N330J915m088J284N164
17102a923l31J611M710M319k393m453J987K50j882l028m043m060j254K224J240
$$ plain form
17211 -4755 -2827 -6445 -11103 -6112 -7285 -9032 -8309 -1932 6585 5878 -617 -3712 -3453 -7497 -6080
17196 -6080 -12406 -10382 -4275 252 -2006 -5613 -6157 -6869 -13728 -14663 -13191 -13066 -11361 -6994 -4813 1900
17180 1900 -1378 -3353 -1142 -1647 -1247 -2729 -1547 359 23 -1577 -5581 -6429 -7168 -8421 -12945 -10662
17164 -10662 -6088 -3792 -5451 -6622 -9275 -2657 -3843 -646 -3215 -9451 -9550 -11505 -5688 -1569 509
17149 509 184 -1432 -3033 385 4528 6440 10705 8200 3348 4200 4164 4398 8045 1601 -12104 -19539
17133 -19539 -21673 -18977 -11827 -6319 -4536 183 -1401 -6870 -2929 707 1634 -3325 -3137 355 -777
17118 -777 -2552 -6620 -4053 -4844 -9193 -15201 -15577 -15375 -8939 -6949 -11528 -6198 -4283 -8371 -7087 -1923
17102 -1923 -2254 -643 4067 8386 5993 1540 3527 3777 1895 -1133 -5176 -9236 -10490 -8266 -7026
17087g026k16K45P099J541m238j042Q4p964J667K611J948J0458p71m584q756l170
17071a2114J1355q43o098o44j435m512P570j732K627K708k194m50o67j46P159
17056E84K95o727Q81j131M479N793J819L134K942n202q290r067P529O932m752
17041g81j439N286m577k639L159L846M822o24l117p509K34r93n636o746k469O561
17025a2622Q206J293q45N343l719o042l384j42j808J338n593N112J3204R31q58
17010D14k760K859k320M14L738k535k969l084k140P484R563m006k41M20k998j3343
16994a1504O603N108J450j195n084l564n685L844M111L546M719r07q740k105l340
16979a2743O11K671Q660K822k134P29j467P001M330J396l369l859N481k014k651
$$ plain form
17087 -7026 -7242 -6997 102 1643 -2595 -3637 -3553 -11517 -9850 -7239 -5291 5167 4396 -188 -8944 -12114
17071 -12114 -759 -1602 -7700 -8344 -9779 -14291 -6721 -8453 -5826 -3118 -5312 -5762 -6429 -6575 584
17056 584 879 -5848 -4967 -6098 -1619 4174 5993 9127 12069 6867 -1423 -10490 -2961 3971 -781
17041 -781 -2220 3066 -1511 -4150 -991 2855 7677 7053 3936 -3573 -3339 -4332 -9968 -16714 -19183 -12622
17025 -12622 -4416 -3123 -3968 1375 -2344 -8386 -11770 -11912 -13720 -12382 -17975 -12863 341 1272 414
17010 414 -2346 513 -1807 -1393 2345 -190 -3159 -6243 -8383 -899 8664 4658 4417 4837 1839 -11504
16994 -11504 -4901 207 1657 462 -4622 -8186 -13871 -10027 -5916 -2370 2349 1442 -7298 -9403 -12743
16979 -12743 -12132 -9461 -801 2021 -113 616 -851 6150 10480 11876 8507 4648 10129 8115 5464
16964E464J216n899o507Q22L174L488R31m79M007N787O85p017J107J632m170o138
16948a897n40O582O289m105m523j2168j009L20O141P116k77r1M120l186l121J487
16932A138j334K779n302l620N520J445l993K246P672n238k378J643o73o66K743
16917A982P85o48J698l095N185K766j819o66q852m631n026K64K004P453K258r21
16901a263J408K518J637o09O658n949q708L267k048m476km500L037J017L593p18
16885e138P98n335M188M320m022k696L75K216L276L69m863j717J21J991M593K386
16869H62j356l856j358K979N052Q419J761L348O81k209o306j670r050j529J06
16854d126O57K155k211l989J668J2439K199N35N39L940j741k390l119m064m59
$$ plain form
16964 5464 6680 781 -5726 -4904 -1730 1758 2689 2210 6217 12004 12689 5672 6779 8411 4241 -1897
16948 -1897 -2437 4145 10434 6329 1806 -10362 -11371 -11051 -4910 2206 1929 1838 5958 2772 -349 1138
16932 1138 -196 2583 -2719 -6339 -819 626 -3367 -1121 6551 1313 -1065 578 -95 -761 1982
16917 1982 2767 2119 3817 722 5907 8673 6854 6188 -2664 -7295 -12321 -12057 -10053 -2600 -342 -1263
16901 -1263 145 2663 4300 3691 10349 4400 -4308 -1041 -3089 -7565 -7567 -12067 -9030 -8013 -4420 -5138
16885 -5138 -4340 -9675 -5487 -1167 -5189 -7885 -7510 -5294 -2018 -1649 -6512 -8229 -8108 -6117 -1524 862
16869 862 -494 -4350 -5708 -2729 2323 10742 12503 15851 16532 14323 8017 6347 -2703 -4232 -4126
16854 -4126 -3469 -1314 -3525 -7514 -5846 6593 8792 9327 9866 13806 12065 9675 6556 2492 2033
16839B033k163j23K763M572k866J790K620p328k207L342k92p137K0j196M012l325
16823e485J96M645o998M157P145m091n631N120o124L088K469j40n047j914L114
16808e496k441M180J0933M73n786N66o88l689m662L17N278L262l359k431o162
16793i705J760Q15k033K013N594l886k464L972N631n950p274L152J2162J55M499
16778H441l433N255J310n278m580k116L468J171l397L984n030k961K497P782M45
16763G558K513J073k026J85p079n418k223R22l734p582j447N026Q714M2n364l226
16747a2066L333j391N562K389L580J513m286K142o493l227L528M786J730m378
16733c278M734L265l316M463j07m293J006K422K220K572p12n314o534p760P394
$$ plain form
16839 2033 -130 -253 2510 7082 4216 6006 8626 1298 -909 2433 2141 -4996 -4976 -6172 -2160 -5485
16823 -5485 -5289 -644 -7642 -3485 3660 -431 -6062 -942 -7066 -3978 -1509 -1649 -6696 -8610 -5496
16808 -5496 -7937 -3757 7176 7649 1863 2429 1741 -1948 -6610 -6293 -1015 2247 -1112 -3543 -9705
16793 -9705 -7945 -7130 -9163 -7150 -1556 -5442 -7906 -3934 1697 -4253 -11527 -8375 3787 3942 8441
16778 8441 5008 10263 11573 6295 1715 -401 3067 4238 841 4825 -205 -3166 -669 7113 7558
16763 7558 10071 11144 9118 9303 2224 -3194 -5417 -4495 -8229 -15811 -17258 -12232 -3518 -3476 -8840 -12066
16747 -12066 -8733 -10124 -4562 -2173 1407 2920 -1366 776 -5717 -8944 -5416 -630 1100 -3278
16733 -3278 1456 4721 1405 5868 5761 1468 2474 4896 7116 9688 8976 3662 -2872 -10632 -3238
16718c238N882M76n164o253m83K393L80K182k581K274k516q72k247O772J21m803
16702g677l828K070M166p840p366J259Q976m88p35R079N263k88m683k132L530
16687f94L561l270L063O341o259q884q89J789J1112L416k047l533p549L293n16
16672a066m647l99o9o96q23O885R928k832r958j645N923L019L467l841k610J17
16656G53L077k300j647m366O91j484J176J819K596j30J762j1293p229L340K150
16641a1085N106Q18P909J367q28j0008J389J02m288L884k362J602o36m136M240
16626f926M218L230Q673J794l61n007j582m962m261J35L755P262m172q460J80
16611f484l361N46p40N790P711J940j0689p950j711M030J457J101K586L81o749
$$ plain form
16718 -3238 2644 3120 -2044 -8297 -8780 -6387 -6007 -3825 -6406 -4132 -6648 -7520 -9767 -2995 -2874 -7677
16702 -7677 -11505 -9435 -5269 -13109 -20475 -19216 -10240 -10728 -11463 -2384 2879 2591 -2092 -4224 -694
16687 -694 2867 -403 2660 9001 2742 -6142 -7031 -5242 5870 9286 7239 3706 -3843 -550 -1066
16672 -1066 -5713 -6112 -6181 -6877 -7700 -815 9113 6281 -3677 -5322 601 3620 7087 3246 636 753
16656 753 3830 1530 -117 -4483 -3792 -5276 -4100 -2281 315 185 1947 -9346 -16575 -13235 -11085
16641 -11085 -5979 -5161 2748 4115 3287 -6721 -5332 -5230 -9518 -5634 -7996 -6394 -7030 -11166 -6926
16626 -6926 -2708 522 9195 10989 10628 5621 4039 -923 -5184 -5049 -1294 5968 1796 -6664 -6484
16611 -6484 -9845 -9299 -10039 -4249 3462 5402 -5287 -13237 -14948 -10918 -9461 -8360 -5774 -5393 -12142
16596a2142j34J0320K839N166K773k67l334p984o70k808L655N337L230m645p862
16581f526K564Q134k599j220K474J095L682J410L817L539m095p615k385J046l697
16566c76J854l609R42R081J596l231l37l2l263K707J584J213m496l648J721L255
16550D961j863K96m399J493K671m704p342J561k205Q185j38l014m70O753N232
16535G017J939l499k998j984p333n472n663L911L426M628O577L323r47K078L75
16520E378l139l275m289N040P973K528k088j225J102m977l598K079o74m814j704
16505e683k336L696N176J62o918k062k872P679O111L994N729L406J439m494j7221
16490d194q226N022J565n739N881K878j841j98Q52J403L493j501k644o281Q05
$$ plain form
16596 -12142 -12276 -1956 883 6049 8822 8555 5221 -2763 -3433 -6241 -2586 2751 5981 1336 -6526
16581 -6526 -3962 4172 1573 353 2827 3922 7604 9014 12831 16370 12275 4660 2275 3321 -376
16566 -376 1478 -2131 -1189 7892 9488 6257 5920 5888 2625 5332 6916 8129 3633 -15 1706 4961
16550 4961 3098 3394 -1005 488 3159 -1545 -8887 -7326 -9531 -1346 -1484 -4498 -4968 1785 7017
16535 7017 8956 5457 2459 475 -6858 -12330 -17993 -14082 -10656 -6028 549 3872 2925 5003 5378
16520 5378 2239 -1036 -5325 -285 7688 10216 8128 6903 8005 3028 -570 1509 835 -3979 -5683
16505 -5683 -8019 -4323 853 1015 -5903 -7965 -10837 -3158 2953 6947 12676 16082 17521 13027 -4194
16490 -4194 -12420 -7398 -5833 -11572 -5691 -2813 -4654 -4852 -4000 -2597 896 -605 -3249 -9530 -8725
16475h725P41j981K183O263L921L261m002r324J741L644J37O31j166L387K0j901
16459a170r47j092k502K00l630M148O546j447l162m112N217L007N985N078k994
16444I125K476m727n019n740l427l317l674O625K559j048L682M825L275J440P492
16429A4547j557o177k970j056j413K188k379k524m267K612k718j406J359M127
16415a634J239j494m82O07m808J991L602l412J503O164J246p509n53L047N52l893
16399c834O112K9l368l256K73k028k301K329q28J374m56M52l453M111P847Q582
16383A1585o409j4234o050R292J126M625j800j2410j428l97J259j963K770N097
16369h937L215m783j460J108j701L145r98O494M676m196q965o123M717J410J0431
$$ plain form
16475 -8725 -7984 -9965 -7782 -1519 2402 5663 1661 -7663 -5922 -2278 -2141 -1510 -2676 711 731 -1170
16459 -1170 -2117 -3209 -5711 -5511 -9141 -4993 1553 106 -3056 -7168 -1951 1056 7041 12119 9125
16444 9125 11601 6874 1855 -3885 -7312 -10629 -14303 -7678 -5119 -6167 -2485 2340 5615 7055 14547
16429 14547 12990 6813 3843 2787 1374 3562 1183 -1341 -5608 -2996 -5714 -7120 -5761 -1634
16415 -1634 -395 -1889 -2371 -1764 -6572 -4581 -979 -4391 -2888 3276 4522 -2987 -3540 -493 59 -3834
16399 -3834 2278 2307 -1061 -4317 -4044 -6072 -8373 -6044 -6872 -5498 -5954 -5502 -8955 -4844 3003 11585
16383 11585 5176 -9058 -15108 -5816 -4690 -65 -1865 -14275 -15703 -16100 -14841 -16804 -14034 -8937
16369 -8937 -5722 -10505 -11965 -10857 -12558 -9413 -10411 -3917 759 -3437 -12402 -18525 -13808 -12398 -1967
16354a967k168m972k688L45M469J993J08M861p22K157K370J082J37n166j348L918
16338B409J63k209r16L16o473M4j405O1M640R09j199M811J984Q12N116q80K260
16321A0443k763p303r23M897j0449K517O29j341n573K930Q185O9m738J097m556
16306f879J410L016J462J663o391M08O66L161k524j857O793J135r572J096O759
16291C46k249o330k315L490J2561n13j762l385K477l470o71L068k687L85m748
16276e803k242M912n18K903o59l28N429N786k787n221L366m588m327p65l476O166
16260b152Q174L791K80J643m078n142p4k073J755p167j561k373m87r13K24L304
16244f849N974J314m050k504l805M241L078M146N397k955n080L289R915K01m681
$$ plain form
16354 -1967 -4135 -9107 -11795 -11450 -6981 -4988 -4880 -19 -741 1416 3786 4868 5005 -161 -1509 2409
16338 2409 2572 363 -553 -237 -6710 -6666 -8071 -8010 -3370 -2461 -3660 1151 3135 3947 9063 8183 10443
16321 10443 7680 377 -546 4351 -6098 -3581 -2952 -4293 -9866 -6936 1249 1318 -3420 -2323 -6879
16306 -6879 -5469 -2453 -991 672 -5719 -5311 -4645 -1484 -4008 -5865 928 2063 -7509 -6413 346
16291 346 -1903 -8233 -10548 -7058 5503 4990 3228 -157 2320 -1150 -1821 1247 -1440 -1055 -5803
16276 -5803 -8045 -3133 -3651 -748 -1407 -1735 3694 9480 6693 1472 4838 250 -4077 -4842 -8318 -2152
16260 -2152 6022 9813 10093 11736 7658 2516 2442 369 2124 -5043 -6604 -8977 -9464 -10377 -10153 -6849
16244 -6849 -875 439 -3611 -6115 -9920 -5679 -2601 1545 6942 3987 -1093 2196 12111 12312 7631
16229G631j1160J352J888k62M579K290k170l5k048r12L52m334j627o0J343j628
16213d801k208P598M018r13l61r81k378L848K425k474n403k501L72l2q063q5O404
16196e535K456j718K459M125O393M039o387J17J498j076k311n253k09o79J484
16181e97p49K985J859mk48J541l780j082o7L682L233k101L325Q396k50o129l659
16164F355K26L01o013O52n9K671n0k011l89P54o412J378l528p99j209m312P703
16147d742O027k070M30L500n349m932K394P453L258O404p0j1786l386p061M557
16132e373R544P614J576K083k232r730p286n62L607j058m747j892L153k557k156
16117a0016K414o76o21j199L044M31l315L91J899K897k307O523P781j906o857
$$ plain form
16229 7631 -3529 -2177 -289 -551 4028 6318 4148 4113 2065 1153 1505 -2829 -4456 -4516 -3173 -4801
16213 -4801 -7009 589 4607 3694 3333 2352 -26 3822 6247 3773 -1630 -4131 -3759 -3791 -11854 -11939 -5535
16196 -5535 -3079 -4797 -2338 1787 8180 12219 5832 5949 7447 6371 4060 -1193 -1402 -2081 -597
16181 -597 -1346 1639 3498 3494 3246 4787 1007 -75 -142 3540 6773 4672 7997 16393 16143 10014 6355
16164 6355 6581 6882 869 1521 1462 4133 4083 2072 1683 2437 -3975 -2597 -6125 -6924 -8133 -12445 -4742
16147 -4742 1285 -785 -355 3145 -2204 -7136 -4742 2711 5969 12373 12303 517 -2869 -9930 -5373
16132 -5373 4171 11785 13361 15444 13212 3482 -3804 -4366 -759 -1817 -6564 -8456 -5303 -7860 -10016
16117 -10016 -7602 -8278 -8899 -10098 -7054 -6623 -9938 -9547 -7648 -4751 -7058 -535 7246 5340 -1517
16102a517L043P402L513l838k505N54L663m645l625K019j566J2170L712J113k941
16087A6552o280q489o843K711O310n47J754K478L082k562n75O163M114l992p019
16072F857M892Q265k961j0866o395O247M119K108q885o517j288o608m3R479L671
16057B075r72J965n97m190p633K638J684Q324J859k28l195l975k453k371O516
16042e53L742J066l102n84K385K107j496j0433J048O478k618l730L239N398J212
16027D159l197o60M13K693l448j731K315J944M298J548j126l68M776o343m991
16012B82L061K636q316N67L120P408M06k368J212M525jj1905l386q337N797N988
15996F89L522j18N579M84K367n62L383Q45L567l762o483K300j813j532n494q057
$$ plain form
16102 -1517 1526 8928 12441 8603 6098 6652 10315 5670 2045 4064 2498 14668 18380 19493 16552
16087 16552 10272 1783 -5060 -2349 3961 3414 5168 7646 10728 8166 7591 13754 17868 13876 6857
16072 6857 11749 20014 17053 6187 -208 6039 10158 12266 3381 -3136 -4424 -11032 -11075 -1596 2075
16057 2075 1103 3068 2471 -1719 -9352 -6714 -5030 3294 5153 4925 1730 -2245 -4698 -7069 -553
16042 -553 3189 4255 1153 569 2954 5061 3565 -6868 -5820 658 -1960 -5690 -2451 2947 4159
16027 4159 962 302 715 3408 -40 -1771 544 2488 6786 8334 7208 6840 11616 5273 282
16012 282 3343 5979 -2337 -1770 1350 8758 9164 6796 8008 12533 12532 627 -2759 -11096 -5299 689
15996 689 4211 4093 9672 10156 12523 11961 15344 16189 19756 15994 9511 11811 9998 8466 2972 -5085
15980e085N10L097M262O693N958L89k102Q29k961n525p037P91K215K488K706k195
15964E033P75R69j137l739p302r868P038J0010M195L956l807l359N914J430M957
15949A5065m15L452j589J816k849n090j455N35j055m179K625L966K234p046o973
15934i58n604J195l621J458L662l245L551n69n177J466J572L817p22k200N754
15919C79O421k575k941O476Q659j063m034j1266j0753P502J2512J830K18j632
15905I733M452r22l054N007o399m348K181K301j990r67k144m352N78M965O099
15890A1140N110l625p466L5l089m962J092M953J353k711M174M488l64J068l384
15875G812k321M09k422m51m223K306L946j780n270J485j86p5L68o83J707O72n802
$$ plain form
15980 -5085 -4575 -1478 2784 9477 15435 15824 13722 14551 11590 6065 -972 -181 2034 4522 7228 5033
15964 5033 5808 6777 5640 1901 -5401 -15269 -8231 1779 5974 9930 6123 2764 8678 10108 15065
15949 15065 14650 18102 16513 18329 15480 10390 8935 9470 8415 4236 6861 10827 13061 6015 -958
15934 -958 -6562 -5367 -8988 -7530 -3868 -7113 -3562 -4131 -9308 -7842 -6270 -2453 -3175 -5375 379
15919 379 6800 4225 1284 7760 16419 15356 11322 56 -10697 -3195 9317 11147 11365 9733
15905 9733 14185 13263 10209 15216 8817 4469 6650 8951 6961 5994 3850 -502 76 5041 11140
15890 11140 16250 12625 5159 5194 2105 -2857 -1765 3188 4541 1830 6004 10492 10128 11196 7812
15875 7812 5491 5900 3478 3027 -1196 1110 5056 3276 -1994 -509 -695 -770 -402 -1085 622 1294 -4508
15858d508k148O339K913P98M142m383n455M024M000o13l635l045O98K679m404
15843b598M845L484L079m537k980K098M223L722k835K226N476l359m696j088l427
15828C633L077M126J315o60j518j733l434K579M422j343j403m278L657K724N79
15813A1743n22l059p568r59M957P307L104n157p044K150K496Q81p002m206l2J108
15797a803P142O159P906j209N81K243p25m101o167M25M379j193j383n000k880
15782D374J207K148M659k873l861M66j628j107k66p30l133J4K860K082J670N246
15766A1128k252l365n40l065P903L088l972K191K438K404p703l958K988m578J680
15751D387j400k293j73O499N761K367m882o12L257l522m921l882L019k32j552
$$ plain form
15858 -4508 -6656 -317 2596 3394 7536 3153 -2302 1722 5722 5109 1474 -1571 -873 1806 -2598
15843 -2598 2247 5731 8810 4273 1293 3391 7614 11336 8501 10727 16203 12844 8148 7060 3633
15828 3633 6710 10836 12151 11491 9973 8240 4806 7385 11807 10464 9061 4783 8440 11164 11743
15813 11743 11221 8162 594 -365 4592 11899 15003 9846 2802 4952 7448 8329 1327 -2879 -2911 -1803
15797 -1803 5339 11498 19404 18195 18776 21019 20294 16193 10026 10451 14830 13637 12254 7254 4374
15782 4374 5581 7729 12388 9515 5654 6120 4492 3385 3119 2389 -744 -730 2130 4212 5882 11128
15766 11128 8876 5511 4971 1906 9809 12897 8925 11116 13554 15958 8255 4297 7285 2707 4387
15751 4387 2987 694 521 7020 12781 15148 10266 9654 12911 9389 4468 586 3605 3373 1821
15736A821j638j229M520J147o20Q96K981l295j500K601R73l8k311l883M27M511
15720E363P921J143m981k579j469L430P35K140J098j186q391K028P087O207m681
15705A3865o910j1193j812M009M238J015m2J850l127m917j620K703j949K499L628
15690B237j317K818M442N627j613m480m88k653o55J283J269k430l654J227n382
15675c769N012m431J653J0878q6p92j442J483m953j018K731O91L551K317m276
15660G549o154J763p14J449n72R75M260M085J312m842m585l790k591k703O4O345
15644A851l28N066k282N86O050j155r54L984J000k520o375o289m466P71K903M746
15628B588N687l706k213N356L805K484o468j346L991J225l306L56M212l872m768
$$ plain form
15736 1821 183 -1046 3474 4621 4001 4897 7878 4583 3083 5684 6657 6619 4308 425 852 5363
15720 5363 13284 14427 9446 6867 5398 8828 9563 11703 12801 11615 3224 5252 12339 18546 13865
15705 13865 6955 -4238 -6050 -2041 2197 3212 3170 5020 1893 -3024 -4644 -1941 -3890 -1391 2237
15690 2237 920 3738 8180 13807 12194 7714 7226 4573 3918 5201 6470 4040 386 1613 -3769
15675 -3769 1243 -3188 -1535 9343 9257 8465 7023 8506 3553 2535 5266 5957 9508 11825 7549
15660 7549 1395 3158 2444 3893 3321 4296 8556 12641 13953 9111 4526 736 -1855 -4558 -4494 1851
15644 1851 1523 6589 4307 4893 10943 9788 8834 12818 13818 11298 4923 -1366 -5832 -5061 -2158 2588
15628 2588 8275 4569 2356 7712 11517 14001 7533 6187 10178 11403 8097 8453 12665 8793 4025
15613D025j202L171Q13L037K591m885J524j903j1839j748P354j609j397Q886M961
15598A1779M347Q190Q97j1866k592O273j467r255o128j482L462J04j040K271L117
15583F610K180l686L679L149L53o272L502L478l234l581K082o98j040o25m45N454
15567A0906L49j234N018o09m803P20m182q089K571N944m315l635k676J624K933
15552E22j19j373J043P012R8K856k466n631l282K875K576P46L547K76m02M193
15536A2471J981K666J384n019m791k162n041l499K323O248K408J566K660J689
15522A4884L042P47m818j143l187l785l48K062J897M723m992p161m014N414N801
15507I122L261K924J859l448o912l152p26j331P706P274p814k890o998j137J0664
$$ plain form
15613 4025 2823 5994 6807 9844 12435 7550 9074 7171 -4668 -6416 938 -671 -2068 6818 11779
15598 11779 16126 24316 25213 13347 10755 17028 15561 6306 178 -1304 2158 2262 1222 3493 6610
15583 6610 8790 5104 8783 11932 12285 6013 9515 12993 9759 6178 8260 7562 6522 5897 5452 10906
15567 10906 11255 10021 15039 14430 9627 10347 6165 -1924 647 6591 2276 -1359 -4035 -2411 522
15552 522 403 -970 73 7085 7183 10039 7573 1942 -1340 1535 4111 4857 8404 8680 8278 12471
15536 12471 14452 17118 18502 13483 8692 6530 1489 -2010 313 6561 8969 10535 13195 14884
15522 14884 17926 18673 13855 12712 9525 5740 5392 7454 9351 14074 9082 1921 -2093 3321 9122
15507 9122 12383 15307 17166 13718 6806 3654 2928 1597 9303 16577 8763 5873 -1125 -2262 8402
15492H402J524K058J591j418n424j204L757m84P93j16J559r583K981N154o764
15477B826J344K389j463J697N776j103L175M265J764J402p338o264M968M32n817
15462H053k290l655J033M620J2751M688l043j582n313k078J882l08K283M8m256
15447A2833P22j086k93J517J798P74q587p426J262J21K293P101j42K851M277l160
15431A4855m541K710M011n992q667P04Q698M92m434l421J143K734N23J296N194
15416A5305K085m395r17l982L413M713K172m909j927J285l603m039k992k493K187
15401A903N497j335k113O040N439K267J630J346J510l168j520k472r510K303k41
15386G576j624l497O545Q501j528n645M593J197l807P75L643M725N611q784l631
$$ plain form
15492 8402 9926 11984 13575 12157 6733 5529 9286 8802 9595 9479 11038 1455 4436 9590 2826
15477 2826 4170 6559 5096 6793 12569 11466 14641 18906 20670 22072 14734 8470 13438 13870 8053
15462 8053 5763 2108 3141 7761 20512 25200 22157 20575 15262 13184 15066 14758 17041 17089 12833
15447 12833 13555 12469 12176 13693 15491 16265 7678 252 1514 1635 3928 11029 10887 13738 18015 14855
15431 14855 10314 13024 17035 11043 2376 3080 11778 12270 7836 4415 5558 8292 8815 10111 15305
15416 15305 17390 12995 12078 8096 11509 16222 18394 13485 11558 12843 9240 5201 2209 -284 1903
15401 1903 7400 6065 3952 9992 15431 17698 19328 20674 22184 19016 17496 15024 5514 7817 7576
15386 7576 5952 2455 9000 17501 15973 10328 14921 16118 12311 13086 16729 21454 27065 18281 14650
15371A4650R1q61l399j1251o91O919M998O168K275m688l082k199N160M585R15
15356A9590j891L152l988m804j268N681K962o76k479n807L544k712J854N278p891
15341A0545n281N154O264k805L12O217Q75j014k426m169r131l877J104L936J3201
15326A8905K264m345n119l685pM096L935j096M6n416M16K785k331K672m367j757
15310F996j435m14K891R317L208k488m101k163L155j74n77n525k789L61L498L361
15294A3121j633o36k499K957J512J474Q45j587p867m936k577Q003K131l413J471
15279F366J912o5R50M986L372k589k302J491q93J091k615o00k008J045j371K40
15263I010J569L990k505K165n690k62O294m058M533K181l678M463J023q454k573
$$ plain form
15371 14650 14741 13880 10481 -770 -1461 5458 10456 16624 18899 14211 11129 8930 14090 18675 19590
15356 19590 17699 20851 16863 12059 10791 16472 19434 18758 16279 10472 14016 11304 13158 18436 10545
15341 10545 5264 10418 16682 13877 14189 20406 21281 20267 17841 13672 4541 664 1768 5704 18905
15326 18905 21169 16824 11705 8020 8013 12109 16044 14948 14994 9578 9994 12779 10448 13120 8753 6996
15310 6996 5561 5147 8038 17355 20563 18075 13974 11811 14966 14792 14215 8690 5901 6262 9760 13121
15294 13121 11488 10852 8353 11310 12822 14296 15141 13554 5687 751 -1826 6177 8308 4895 6366
15279 6366 8278 8213 9163 14149 17521 14932 12630 14121 13228 14319 11704 11104 9096 10141 8770 9010
15263 9010 10579 14569 12064 14229 8539 8277 14571 10513 15046 17227 13549 18012 19035 10581 8008
15248H008P130M245M41J655J188j126m273l716p020k861M548O489q66k932Q371
15233A9281O38J032m324k339j321O369N370K23k507q59Q88p519n093N600l761
15218A1678k226j376K031Q69k770K382J1145M865l030j141m615j1753n172K765
15204C652P567Q743Lo750l265L525K270M35O09J71k573n107L778L340l5L03K82
15187A6948j724m780o18N413k439J711M246M831m126m497L38K073m358n317M454
15172A2155L768K524J37K840k520k552N604Q844n368J118J44r136q087K766J485
15157A3722m799o51M705n782p468J039J2384R376m088k863k574j5P69M620p586
15142A0789J481P505m412q209L651L964k411m651Q6o29Q617L721l025q97M346
$$ plain form
15248 8008 15138 19383 19824 21479 22667 21541 17268 13552 6532 3671 8219 14708 13842 10910 19281
15233 19281 19919 20951 16627 14288 12967 19336 24706 24929 22422 21563 22451 14932 9839 15439 11678
15218 11678 9452 8076 10107 10976 8206 10588 21733 26598 23568 22427 17812 6059 887 3652
15204 3652 11219 19962 19965 13215 9950 13475 15745 16180 16789 16960 14387 9280 13058 16398 16363 16666 16948
15187 16948 15224 10444 9826 15239 12800 14511 18757 23588 19462 14965 15303 17376 13018 7701 12155
15172 12155 15923 18447 18584 21424 18904 16352 21956 30800 25432 26550 26694 17558 9471 12237 13722
15157 13722 8923 8272 12977 7195 -273 766 13150 22526 18438 15575 13001 12986 13755 18375 10789
15142 10789 12270 19775 15363 7154 10805 14769 12358 7707 7793 7164 15781 19502 16477 15580 19926
15127A9926L791l013K701p594n852N688m657j526Q887J0559L539k332n660J892
15113B6349L185l440j548j529J714j384N1O31M025m030k125L51k839O757N238
15098C1406L381m112q835J182J357l580k736l78M229J327j118n748n057k042M756
15083A4032j56M078Q197k145k230J384q979k032P642K088O63L030l127K735L001
15068B8181k636m017P83n887R7L380K817K171o027J07M760n947L03J4982o64p868
15052B4535L495m467n529L83M27m36J252O52j414k018K011n81j52j907k343n064
15036H844p85R9J709M121J740K806J256j66N92N021J972l816O68L20J1670J522
15020C7573p616r764n974P98j541Q607M752o57o174n801K215L635l431p37R62
$$ plain form
15127 19926 23717 20704 23405 15811 9959 15647 10990 9464 18351 28910 32449 30117 24457 26349
15113 26349 29534 26094 24546 23017 24731 23347 23398 24029 28054 24024 21899 22250 19411 26168 31406
15098 31406 34787 30675 21840 23022 24379 20799 18063 17685 21914 23241 22123 16375 11318 9276 14032
15083 14032 13876 17954 26151 24006 21776 23160 14181 12149 19791 21879 22542 25572 22445 25180 28181
15068 28181 25545 21528 22311 16424 16521 19901 22718 24889 18862 18969 23729 17782 18085 33067 32403 24535
15052 24535 28030 23563 18034 18417 18844 18408 19660 20312 18898 16880 18891 18310 18158 16251 13908 8844
15036 8844 8059 8158 9867 13988 15728 18534 19790 19624 20216 25237 27209 23393 24061 24381 36051 37573
15020 37573 29957 20193 14219 15017 13476 22083 26835 26178 20004 14203 16418 20053 16622 15885 16847
15005A6847j154j82N799L741K35q383J105m92J263J384l446q558m826L072L804
14990A0209L755k78j817j111N608l668J977M513O628N431M07k530m701m44k84
14975B3695j067j336l099J866l743p139K770l994L273M521m003m230N249k60O568
14960A9071j041j379K125J952l69P10l116O01J18N341N736K072j650p691j756
14945B0724L542M014k219m545Q181m624n410M49N277K843M186Q62L067k523r646
14930B4178j348k783R25K876K195R80m177k751K848O072n573l905j450M13O657
14915B5157j6k055O627O41L033J035K407k055n635j805m563K275P48j668M522
14900B8648j327k725Q088Q886k764o803l789k49l659l565o909k045K692l715N269
$$ plain form
15005 16847 15693 15511 21310 25051 25286 16903 18008 17516 18779 20163 16717 8159 3333 6405 10209
14990 10209 13964 13686 11869 10758 16366 12698 14675 19188 25816 31247 31654 29124 24423 23979 23695
14975 23695 22628 21292 18193 20059 16316 9177 11947 7953 11226 15747 11744 7514 12763 12503 19071
14960 19071 18030 16651 18776 20728 20359 21069 17953 18554 18672 24013 29749 31821 30171 22480 20724
14945 20724 24266 28280 26061 21516 29697 25073 19663 20112 25389 28232 32418 33280 36347 33824 24178
14930 24178 22830 20047 20972 23848 26043 27023 22846 20095 22943 29015 23442 19537 18087 18500 25157
14915 25157 25141 23086 29713 30354 33387 34422 36829 34774 29139 27334 22771 25046 25794 24126 28648
14900 28648 27321 24596 32684 41570 38806 32003 28214 27965 24306 20741 13832 11787 14479 10764 16033
14885A6033R342J880J1568K052o774J563k880j4059k419J1353Q082j25q836p624
14871A9156J276L010j481K890L119l97m006n588j222j028k321k452R612R005L775
14856C3348N387j105l761j137K465M58J649l257j066J6k417k665l883J227k732
14841B2527O467J523l181l471j900Q672K552r3n612m876M842M298j563K428N98
14826C3211n032J514l591q3j615J114k007q03N245O448k518k074m726l322M556
14811B6317J0422N49K283M556m116o821K358l720m002O899O209J454n901m804
14797C1683m863p727j57P053Q69K036K162o292o005L794O272L246P383P766p335
14782C9885j305M826n373j129L959o26q07k852q021k922P12r24k070O153m788
$$ plain form
14885 16033 25375 27255 38823 40875 34101 35664 32784 18725 16306 27659 35741 35616 26780 19156
14871 19156 20432 23442 21961 24851 27970 27573 23567 17979 16757 15729 13408 10956 20568 29573 33348
14856 33348 38735 37630 33869 32732 35197 35655 37304 34047 32981 32997 30580 27915 24032 25259 22527
14841 22527 28994 30517 27336 23865 21965 30637 33189 33096 27484 22608 27450 31748 30185 32613 33211
14826 33211 28179 29693 26102 26019 24404 25518 23511 22708 27953 34401 31883 29809 25083 21761 26317
14811 26317 36739 37288 39571 44127 40011 33190 35548 31828 27826 34725 40934 42388 36487 31683
14797 31683 26820 19093 18936 25989 26858 28894 31056 24764 18759 22553 28825 32071 39454 47220 39885
14782 39885 38580 43406 38033 36904 40863 40237 39430 36578 28557 25635 26347 25423 23353 29506 24718
14767B4718j779O77j255M763J727L663k27K43O754n158k279K92p791K585m223
14752B2710j619M883P37M706M94p22j130Q36k72J4l442n325k402Q62l654P820
14736B4496J0941j742j26p78O091K760q6k816n865k022K721J609j186j833M215
14721C6379R184j663P39l841m685j92m26J822M474k144P54j374Q45l005k860o216
14705B7791P22M710n17j367L847N618p26n402j661j933o31K0q85m895q42M099
14689B7948l213j10L771Q905J459l060L124k230J0054K377j0067l533j0701l712
14675B1012N992L184M354L908n277j700M036O203L541m701M161O404l914o446
14661D0757K826L663l579R2J18n903M208L603n770r905m045L789M344K469l28
$$ plain form
14767 24718 22939 23616 22361 27124 28851 32514 32287 32530 39284 34126 31847 32139 24348 26933 22710
14752 22710 21091 25974 26711 31417 31911 31189 30059 30895 30623 30637 27195 21870 19468 20330 16676 24496
14736 24496 35437 33695 33569 32791 38882 41642 41556 38740 32875 30853 33574 35183 33997 32164 36379
14721 36379 45563 43900 44639 40798 36113 35921 35495 37317 41791 39647 40401 39027 39872 36867 34007 27791
14705 27791 28513 33223 32706 31339 35186 40804 40078 34676 33015 31082 30451 30471 29586 24691 23849 27948
14689 27948 24735 24625 28396 37301 38760 35700 38824 36594 46648 49025 38958 35425 24724 21012
14675 21012 27004 30188 34542 38450 33173 31473 35509 41712 45253 40552 44713 51117 47203 40757
14661 40757 43583 47246 43667 43759 43877 37974 42182 45785 40015 30110 26065 29854 34198 36667 36339
14646C6339k286q41M343J21J923l369K898K802k060K433J355o388o558P24K633
14631C4069Q467N133m333j615k365N63j283O309k90k172M200O579K340J633O62
14616E7897nk939M276N268m324j736O817K027n078j154J074m610J033o257P43
14601E3032k862p088o929l163M733J234k1l007P26K05k757m741M995N535L194
14586D3086K823n66j160R86J737K34k988p02L375o7q621l947M304R699m820k473
14570D0900P900Q192O021o953m364k237m07p35J978n039p60K035M143m44L086
14555E3316J156m575K887N43K085J364j907q418p043K039M9L301J865N504K233
14540E4399n069n058M22J948P336P706J716n744j866J736m14q57j187m809k704
$$ plain form
14646 36339 34053 33212 37555 37676 39599 36230 39128 41930 39870 42303 43658 37270 30712 31436 34069
14631 34069 42536 47669 43336 41721 39356 39919 38636 44945 44655 42483 46683 53262 55602 57235 57897
14616 57897 57892 54953 59229 64497 60173 58437 65254 67281 62203 61049 62123 57513 58546 52289 53032
14601 53032 50170 43082 36153 32990 37723 38957 38936 35929 36655 36860 34103 29362 34357 39892 43086
14586 43086 45909 45343 44183 45169 46906 47140 44152 43450 46825 46758 38137 34190 38494 48193 43373 40900
14570 40900 48800 56992 63013 56060 51696 49459 49052 48317 50295 45256 44496 46531 50674 50230 53316
14555 53316 54472 49897 52784 53327 55412 56776 54869 46451 39408 41447 41496 44797 46662 52166 54399
14540 54399 49330 44272 44694 46642 53978 61684 63400 57656 55790 57526 57112 56255 55068 50259 47555
14525D7555q6N770O652N108j016j006j315n659k311M601k604M836J90k048N329
14510F3996l335K753K477N938L735P27j135O74l843n76K857K717J706j196l655
14495G3840J931M141M089L01M749M665J3891L447M927N91M123M143Q037Q847P537
14480A49259J0702K1775K7285M2541N5478O4893P9905J10637J60203K32119L07478
14469A262275K86263K06759K34199L03390J66650j64592k34615j24171j50194
14460A785964l12599l26296k18607j41184r6580q3279o4644n9891n0907m3602
14450C88375l5484m0034l1049k2169k2905j8430j7353r344j5776j2818j0566j0925
14438A41522k638n394r116k65J117j487o907j031j1214j2030m0m314o047r707
$$ plain form
14525 47555 47469 53239 59891 64999 63983 62977 61662 56003 53692 58293 55689 60525 60715 58667 63996
14510 63996 60661 63414 65891 71829 75564 76291 75156 75830 71987 71411 74268 76985 78691 77495 73840
14495 73840 75771 79912 84001 84302 89051 93716 107607 111054 115981 116572 120695 124838 132875 141722 149259
14480 149259 159961 181736 209021 251562 307040 371933 451838 562475 722678 954797 1262275
14469 1262275 1548538 1755297 1989496 2292886 2459536 2294944 2060329 1936158 1785964
14460 1785964 1473365 1147069 928462 787278 690698 607419 542775 482884 431977 388375
14450 388375 352891 312857 281808 259639 236734 218304 200951 191607 175831 163013 152447 141522
14438 141522 138884 133490 124374 124109 125226 123739 116832 115801 104587 92557 92517 88203 82156 72449
14424G2449M074k23l468l079k444N585J367j0357p083q3Q75M115L606N119l610
14409F6843j971M648J144o314l864M264K792k175j11m31j273K184K284N301N544
14394G8865P139k417k145k193k771m640J379L598L302Q988N43j517L108l31k469
14379H8439J382J484K866N94P293j495n209k25O075Q075K718n067K97n84L70k837
14363A04176k575L226j408j019j621M192L889K575P4j998M442j719L53J1751L711
14348A28049M666L185r80K385P619M913o371l626m123J465L794L253J698M542
14334A50469K717p19J1577p77k639L716P951P945O453Q46o24Q987L757l395m741
14319A91523j1203k622Q205P574Q251R108K739M084Q29L126Q185K45O390J7590
$$ plain form
14424 72449 76523 76300 72832 69753 67309 72894 74261 63904 56821 56738 57613 61728 65334 70453 66843
14409 66843 64872 69520 70664 64350 60486 64750 67542 65367 65256 64825 63552 65736 68020 73321 78865
14394 78865 86004 83587 81442 79249 76478 71838 73217 76815 80117 89105 89648 88131 91239 90908 88439
14379 88439 89821 91305 94171 94765 102058 100563 95354 95129 101204 109279 111997 106930 107227 106643 107013 104176
14363 104176 101601 104827 103419 102400 100779 104971 108860 111435 111509 109511 113953 112234 112587 124338 128049
14348 128049 132715 135900 134920 137305 144924 149837 143466 139840 135717 137182 140976 144229 145927 150469
14334 150469 153186 152467 164044 163267 160628 164344 172295 180240 186693 187539 186915 195902 199659 196264 191523
14319 191523 180320 177698 185903 193477 201728 210836 213575 217659 218488 221614 229799 230044 236434 254024
14305B54024J1207R241J5282K2665K4295K5497L0908K7628J8760q201l8251l4707
14293C58348l6490q8491j38548q8775m5575o0388o9556l1626J4046K9140J7561
14282a40354J2136J0651J2065P584O408R400J0547J0675Q580J3012R727O001J969
14269b1599O620J3801O339J778K40Q208Q499N465j817j389K039J735L709k130
14255C1498l300J558N191J3427J2346J3522J4493Q744P971J9477K6797K7132L9840
14242B18696M0964K8565J7328J1704O698m880J4649K2960J7464j2815k0046j6754
14230C24533j3620j7304k7900k7371k0579j7752j4870n23J207j5141j7000j1619
14218A42061p892r813n663n658L90L946R432n60r297q547m661m860n357j120K889
$$ plain form
14305 254024 265231 274472 289754 312419 336714 362211 393119 420747 439507 431306 393055 358348
14293 358348 321858 233367 94819 6044 -39531 -99919 -169475 -201101 -187055 -157915 -140354
14282 -140354 -128218 -117567 -105502 -97918 -91510 -82110 -71563 -60888 -52308 -39296 -29569 -23568 -21599
14269 -21599 -14979 -1178 5161 6939 7179 15387 23886 29351 27534 26145 28184 29919 33628 31498
14255 31498 28198 29756 34947 48374 60720 74242 88735 97479 105450 124927 151724 178856 218696
14242 218696 259660 288225 305553 317257 323955 319075 333724 356684 374148 361333 341287 324533
14230 324533 310913 293609 265709 238338 217759 200007 185137 184614 185821 170680 153680 142061
14218 142061 134169 124356 118693 113035 113425 117371 126803 126243 116946 108399 103738 98878 93521 92401 95290
14203I5290j635l219P666M156K347M480N683K1r82K499O805P10r174L602R232
14188A27481k183q755o008K037l104o88m566n830L458J614L262L10K445r287j1658
14173H8528l828j420l719n654J4425K0135J5053K0282K4887J5418P934R839R245
14160B11125J4875R329Q896R45L121J1785J0489l986n815p387P79m131o603o155
14146B37267q796r066M447P156J0717Q570J1730O353J3941Q130q263J51N844j1101
14132B77080j4919p104o292o350j999R712K478Q695J2216J1044J1477J8424O644
14119C21106M275J1009R090J7393P913j1976j2032J0369O025k4150k9417Q604
14107C18209M6534J5077J394L1002O4980N0419K3394J9548K6154L1299L2328K0184
$$ plain form
14203 95290 93655 90436 98102 102258 104605 109085 114768 114789 113807 116306 123111 123821 114647 118249 127481
14188 127481 125298 116543 110535 112572 109468 108780 104214 98384 101842 103456 106718 107028 109473 100186 88528
14173 88528 84700 83280 79561 73907 88332 108467 123520 143802 168689 184107 192041 201880 211125
14160 211125 226000 235329 244225 245170 248291 260076 270565 266579 260764 253377 254156 250025 243422 237267
14146 237267 228471 219405 223852 231008 241725 250295 262025 268378 282319 290449 282186 282337 288181 277080
14132 277080 262161 255057 248765 242415 240416 250128 252606 261301 273517 284561 296038 314462 321106
14119 321106 325381 336390 345480 362873 370786 358810 346778 357147 363172 339022 309605 318209
14107 318209 364743 379820 381214 412216 477196 527615 551009 570557 596711 628010 660338 680522
14095F80522K9008L0589L4212L6850L9743L4011J5605R871J667j0259n779p131
14083H88909j0210j2965k369o74j5711k0323j1911n676q359j2650j1273M39J1429
14070G88656m175j3405j0997k642n29p109j2310J192J2290J3648J8415K1616L2573
14057H37223L4558L8114M1392L9272L2693K8277K6731K6446K6035K5798L0874
14046A187413J9443J8403R656O416Q79j0058o678L166J2896J9723K4347L1175
14034A316781M4018N6472O1307N7729N7148P2021Q6438O9146O2261Q1978J04442
14023B069741J12171J07427J24824J39387J48502J63296J62651J62668J78321
14014C368988J81356K09554K46459K69965K89276L13245L75693M58273N36106
$$ plain form
14095 680522 709530 740119 774331 811181 850924 884935 900540 910411 912078 901819 896040 888909
14083 888909 878699 865734 863365 862691 846980 826657 814746 809070 800711 788061 776788 777227 788656
14070 788656 784481 771076 760079 757437 756908 749799 737489 738681 750971 764619 783034 804650 837223
14057 837223 871781 909895 951287 990559 1023252 1051529 1078260 1104706 1130741 1156539 1187413
14046 1187413 1206856 1225259 1234915 1241331 1242210 1232152 1225474 1228640 1241536 1261259 1285606 1316781
14034 1316781 1360799 1417271 1478578 1536307 1593455 1665476 1751914 1821060 1883321 1965299 2069741
14023 2069741 2181912 2289339 2414163 2553550 2702052 2865348 3027999 3190667 3368988
14014 3368988 3550344 3759898 4006357 4276322 4565598 4878843 5254536 5712809 6248915
14005F248915O32954P61670R68908J183503J290280J410194J774205K261974K596832
13996A9129435L053257M208286N806890P403164R099210J1671591J5718110K1973261
13988I8063204L1697319M5591702N5887059M6562541L1201149M1055019N0100419
13981D00158412J4695966l7545929l6666398j6777229k7322667n6820210n4755732
13974A84966213l5946270k2308660j6475433j3826342j1710561r770730q213482
13967F6714735p245740o627205n855548n069146m639943m259810l596387l022408
13959B6398548k772923k583025k205996j832035j579890j425722j300883j156870
13951A1541204j021821r14281q51978q00434p03913o14000n44054m78031m13985
$$ plain form
14005 6248915 6881869 7643539 8612447 9795950 11086230 12496424 14270629 16532603 19129435
13996 19129435 22182692 26390978 32197868 39601032 48700242 60371833 76089943 98063204
13988 98063204 129760523 175352225 231239284 277801825 309002974 350057993 400158412
13981 400158412 414854378 377308449 340642051 323864822 296542155 239721945 184966213
13974 184966213 149019943 126711283 110235850 96409508 84698947 74928217 66714735
13967 66714735 59468995 52841790 46986242 41917096 37277153 33017343 29420956 26398548
13959 26398548 23625625 21042600 18836604 17004569 15424679 13998957 12698074 11541204
13951 11541204 10519383 9605102 8753124 7952690 7248777 6634777 6090723 5612692 5198707
13942E198707l72197l32272l03773k58865k33169k15405k20138j99834j53206
13933B909848j44150j47477j51328j16664q8616r2854r1573r4385j02595j04812
13923A775394r8383j07619j19937j10438r6783q4683p8158p0266o0632m9291m0277
13912H58927l9893l7984l1286k0280m463K068r994r878M709J286p484p865j5972
13899F81891k2586k3832k3576k8446k9632k5943k8882j6816q367l507p330j3107
13887D49867j2260j3049j0186j8780j9621j6459k0255k6711l3463k0375j2335
13876B46373l797m67j0206o692L364l624n610J271O476M471L954J1133J0059K895
13862B59600K7349N9673M0791J8517L7670M9231J8761l669J7015k939k4139j6810
$$ plain form
13942 5198707 4826510 4494238 4190465 3931600 3698431 3483026 3262888 3063054 2909848
13933 2909848 2765698 2618221 2466893 2350229 2261613 2168759 2077186 1982801 1880206 1775394
13923 1775394 1677011 1569392 1449455 1339017 1242234 1157551 1079393 1009127 948495 899204 858927
13912 858927 819034 781050 749764 729484 725021 727089 717095 707217 711926 713212 705728 697863 681891
13899 681891 659305 635473 611897 583451 553819 527876 498994 482178 473811 470304 462974 449867
13887 449867 437607 424558 414372 395592 375971 359512 339257 312546 279083 258708 246373
13876 246373 242576 242109 231903 225211 228575 224951 219341 220612 227088 231559 235513 246646 256705 259600
13862 259600 286949 346622 387413 405930 443600 492831 511592 507923 524938 521999 497860 481050
13850D81050p979j3922j1825J210K857q684j883K0521J7282J8417J6640J0642
13838E24326J0543J0329J607N276n971o638n877j5457k3904n747M956j070j4584
13825D77789j1753L751j2111k7154l1516j5556k0546j6431j4075j4041j4793k1525
13813B82039k3380j6729j9996j6766j4467r219k622o859j0960j998o51k691N807
13800A61508j407O504M415J5466J1214J612Q326J46J767L769m12q277r370j5931
13786A79330j0722p428R17M063L781m94j324j0894l372K285j381r492r088N304
13772A41485R086N053J844n156o918j770o683o974j94l446O228M319Q16K568N008
13757A45266K420M561N324L485k601l084R15K644r826q595r708j698r84k941J0474
$$ plain form
13850 481050 473071 459149 447324 448534 451391 442707 440824 461345 478627 497044 513684 524326
13838 524326 534869 545198 546805 552081 546110 539472 533595 518138 494234 488487 493443 492373 477789
13825 477789 466036 469787 457676 430522 399006 383450 362904 346473 332398 318357 303564 282039
13813 282039 258659 241930 221934 205168 190701 181482 178860 172001 161041 159043 158392 155701 161508
13800 161508 160101 166605 171020 186486 197700 199312 207638 207784 209551 213320 212908 204631 195261 179330
13786 179330 168608 161180 162097 166160 169941 169447 168123 157229 153857 156142 154761 145269 136181 141485
13772 141485 150571 155624 157468 152312 145394 143624 136941 129967 129773 126327 132555 136874 137690 140258 145266
13757 145266 147686 152247 157571 161056 158455 155371 156286 158930 149104 140509 130801 129103 128119 125178 135652
13742A35652L095l709p38J0010M944n051l690J654r27o577N004k881N340N640
13728A47766k43j0580j3098p405l688O32J04N801R30K274P477Q293K965P606O507
13713A55341O857R660K002M661J7728N191r816k289L173m756p324n320j285o818
13699A67005p095M232K830N137J340K087L240l916J4338J8486J2568N109K067
13686B27428J7041J3510P536J1803J3120J4613K5566L4615K6629J8204j2189n1477
13674C46399n5803m0402p0781j27848j04472l2784m1232p0240m0621J4648K1205
13663b01931R699O343J2417J2978L684N682R87k298L897J269R469R880L351L152
13649a21421J2497N455J065l347O36k166L417O673L149p828r512K286P043J260
$$ plain form
13742 135652 138747 135038 134300 144310 149254 144203 140513 142167 141240 134663 139667 136786 142126 147766
13728 147766 147523 136943 123845 116440 112752 113384 113488 119289 120219 122493 129970 138263 141228 148834 155341
13713 155341 162198 171858 173860 178521 196249 201440 191624 189335 192508 187752 180428 175108 173823 167005
13699 167005 159910 164142 166972 172109 173449 175536 178776 174860 189198 207684 220252 225361 227428
13686 227428 244469 257979 265515 277318 290438 305051 330617 365232 391861 410065 397876 346399
13674 346399 290596 250194 179413 51565 -52907 -85691 -126923 -197163 -237784 -223136 -201931
13663 -201931 -192232 -185889 -173472 -160494 -156810 -151128 -150141 -152439 -148542 -147273 -137804 -127924 -124573 -121421
13649 -121421 -108924 -103469 -102404 -105751 -105115 -107281 -103864 -97191 -94042 -101870 -111382 -109096 -102053 -100793
13635a00793R297Q513P103k39K028M056M357M855Q23M45n42P628M599N406k227
13620d4691n277O9l754m057M820l082N228J0237R079k389l367P3m295O18N585
13605c5203O6K602M651M37j965J256L960L226j123o72j272k675M724Q263M008
13590i717n86l024J792K702K086l492o50O653L332J616n901R34K934j53J876M41
13574H43l341Q59M477K795k625l441M32Q3L814O135L562l836n602j795M145O240
13558A2745k800o634m652M707J3949O813j485p781M122K527M292N433J739L661
13544C6636o649l351P861L06J122L953k932m827k324j600o714l150l771l720K724
13529A3564q962p814Q200K110Q726M749l694N702N099K360l824l839K623k446
$$ plain form
13635 -100793 -91496 -82983 -75880 -76119 -74091 -70035 -65678 -60823 -60000 -59555 -60097 -52469 -47870 -42464 -44691
13620 -44691 -49968 -49899 -53653 -57710 -52890 -55972 -50744 -40507 -31428 -33817 -37184 -37111 -41406 -40788 -35203
13605 -35203 -35137 -32535 -27884 -27447 -29412 -28156 -24196 -20970 -22093 -22765 -24037 -26712 -21988 -13725 -9717
13590 -9717 -10303 -13327 -11535 -8833 -6747 -10239 -10889 -4236 -904 712 -5189 -4255 -1321 -1474 402 843
13574 843 -2498 -1639 2838 5633 3008 -433 -1 82 3896 10031 13593 9757 4155 2360 6505 12745
13558 12745 9945 3311 -1341 3366 17315 24128 22643 14862 18984 21511 25803 31236 32975 36636
13544 36636 29987 26636 34497 34803 35925 39878 36946 32119 29795 28195 21481 18331 14560 10840 13564
13529 13564 4602 -3212 4988 7098 15824 20573 16879 22581 27680 30040 26216 22377 25000 22554
13515B2554j777M137l793M116P596O729L561N978J2066J8307K1027K8940K9914
13502A59355L8340M4584O2085R2031J25931J77651K64975L22193K60018J87974
13492A735137K58265L07470O6079k28504j99667j06959k01277l35911k83473j90550
13482H20610j27858q5319o8670n7326m8915l9908l9739l8923k4737k2466l7003
13471B29746l9177k4801j6847j9595j6411r738j0500q320l939j662l010m543m066
13458F7137j0178j0954j167j943j991N690J031r426l494r851n941o94N153m330
13444A9042j4522J135N922P175M266o13M478p300o167p17m823l715J744P39l424
13429C220K788K942N242K643o60j158K646M578M691q008j0842O72O149J373j962
$$ plain form
13515 22554 20777 24914 21121 25237 32833 39562 43123 49101 61167 79474 100501 129441 159355
13502 159355 197695 242279 304364 396395 522326 699977 964952 1287145 1547163 1735137
13492 1735137 1993402 2300872 2366951 2138447 1938780 1831821 1630544 1294633 1011160 820610
13482 820610 692752 607433 538763 481437 432522 392614 352875 313952 289215 266749 229746
13471 229746 190569 165768 148921 129326 112915 103177 92677 84357 80418 78756 75746 71203 67137
13458 67137 56959 46005 44838 42895 40904 46594 47625 38199 34705 24854 18913 18219 23372 19042
13444 19042 4520 5655 11577 18752 23018 22405 26883 19583 13416 12699 7876 4161 5905 6644 3220
13429 3220 6008 8950 14192 16835 16175 15017 17663 22241 26932 18924 8082 8754 14903 16276 14314
13414A4314N524l751m548l534l707k241j899N219L993m206k203l476K285j970
13400b00j317L678k165q422L637N134l685J885L269n697l928M469P133k534k26
13385A031L319m0J159l640j734L940K781J883K069J601J133K94p40O203O298M294
13369B9851j542M864J4655J3629J5900J3798J7944L0353M2916O0446P8849J11226
13357D32889J30356J27972J01257N3264K2048k5423r1561j36399j32950r2500
13347C88953o5262m9497l7122k6900k5509j2342j8886j2375r144j3493r728q632
13335A00063p841o701j241k048r91J222l17O686J0707J0087P602J3290K1446L2593
13321A84557L7255N1248O0733P0480Q4875J11452J52084K22869L18426M03609
$$ plain form
13414 14314 19838 16087 11539 8005 4298 2057 158 5377 9370 5164 2961 -515 1770 -200
13400 -200 -1517 2161 -4 -8426 -4789 345 -3340 -1455 1814 -3883 -7811 -3342 3791 1257 1031
13385 1031 4350 4310 5469 1829 95 4035 6816 8699 10768 12369 13502 13796 13056 19259 25557 29851
13369 29851 28309 33173 47828 61457 77357 91155 109099 139452 182368 242814 321663 432889
13357 432889 563245 691217 792474 845738 867786 842363 750802 614403 481453 388953
13347 388953 323691 274194 237072 210172 184663 172321 153435 141060 131916 118423 108695 100063
13335 100063 92222 85521 84280 82232 81241 82463 82146 88832 99539 109626 117228 130518 151964 184557
13321 184557 221812 273060 333793 404273 489148 600600 752684 975553 1293979 1697588
13311A697588M21692L26187J93703R2072m5587k42267m12572m38532l39800k22588
13301A029896j48993j10230q5005p3490o8391n8372n5493m5677l7521l9372l2159
13290B75193k9473k3962j9125q454r593j2418m368M028K421K354P553R081J8642
13277B11879K8670M3404N5510N8775O6463P8083J02048J41490K07160K95792L85199
13266A674473M22258L54145K26958J26930O228j82497l86571m53918l73244k51543
13256A163219j70592j22766j12904r9595p6724o5459n8606n1218m6177m4186m0751
13245B74241l6108l2506j6021r853k0952j3696r414q821l608p404Q71O935Q723
13232A32387J4470J6675K5155J6738K6484L4995K8202K6295M3186Q0979J20250
$$ plain form
13311 1697588 2119280 2445467 2639170 2731242 2685655 2443388 2030816 1592284 1252484 1029896
13301 1029896 880903 770673 685668 612178 543787 485415 429922 384245 346724 307352 275193
13290 275193 245720 221758 202633 194179 184586 172168 167800 171828 174249 176603 184156 193237 211879
13277 211879 240549 283953 339463 398238 464701 542784 644832 786322 993482 1289274 1674473
13266 1674473 2096731 2450876 2677834 2804764 2810992 2628495 2241924 1788006 1414762 1163219
13256 1163219 992627 869861 756957 657362 580638 515179 456573 405355 359178 314992 274241
13245 274241 238133 205627 189606 179753 158801 145105 135691 126870 123262 115858 116729 123664 132387
13232 132387 146857 163532 188687 205425 231909 266904 295106 321401 364587 445566 565816
13221E65816J45226J28082R5887N4344J1523m4692j14602j44052j22562r6188
13211D78782o7683n2462m3635m4441l2900k6877k8502k5409k8244j5940l372m460
13199A04857r455j3455j0173j2303p300n768n771n095m316K765K40j640K270P205
13185D2061O095q53M184M000L503o001j6337p113K355o896m257j891K832P398
13171B9080L200k36j467L469Q483k606k600K815n572k864L474q000m414r41m170
13156A7651n091O122R183K517o977m493n08L621M414L398n843K880M844J669K138
13141C5525K961M436P572J552Q274K5677J9363Q330O584Q430q74r080o049k108
13127A10593N529p080k122R203l487m714J191L033K752P496k834o469J426P41
$$ plain form
13221 565816 711042 839124 935011 989355 1000878 956186 841584 697532 574970 478782
13211 478782 411099 358637 315002 270561 237661 210784 182282 156873 128629 112689 109317 104857
13199 104857 95402 81947 71774 59471 52171 46403 40632 35537 31221 33986 34226 32586 34856 42061
13185 42061 48156 47303 51487 55487 58990 52989 36652 29539 31894 24998 20741 18850 21682 29080
13171 29080 32280 32044 30577 34046 42529 39923 37323 40138 34566 31702 35176 27176 22762 21821 17651
13156 17651 12560 18682 27865 30382 23405 18912 18404 22025 26439 29837 23994 26874 31718 33387 35525
13141 35525 38486 42922 50494 52046 60320 85997 105360 113690 120274 128704 127830 118750 112701 110593
13127 110593 116122 109042 106920 116123 112636 107922 109113 112146 114898 122394 119560 113091 114517 115258
13113A15258M896m123m548n528j258j640o665j498l759p69l55l857R62J580L031
13098I1727N384P078J5029J3211K0578K5152M3068N0998M6004K4210P848J3749
13086C64036p948m2664m3747k0329r872n427p278N329P607L022O253N276N606
13073B59864P233M120J138J439l447o001l056n917j041r575k1043j5971j7945
13060A89798o681n611n990r950m718L345m261L115M733J3482J2930J9358K2841
13047B32391K5311M7456M6886K0708J5413J0563K029l3686m1224k8552j7170r58
13035B79167j629N499N544K041P135J0845N904N499J2936R698O757R689L329k913
13021C59501j015m04R996K1410J4584J6126K3547L3583M0799N6784R9565J39490
$$ plain form
13113 115258 120154 116031 111483 105955 104697 103057 96392 94894 91135 90366 90011 86154 87116 88696 91727
13098 91727 97111 104189 119218 132429 153007 178159 221227 272225 318229 342439 350287 364036
13086 364036 356088 313424 269677 249348 239476 234049 226771 232100 239707 242729 248982 254258 259864
13073 259864 267097 271217 272355 273794 270347 264346 261290 255373 254332 244757 223714 207743 189798
13060 189798 183117 177506 171516 161566 156848 160193 155932 159047 163780 177262 190192 209550 232391
13047 232391 257702 305158 352044 372752 388165 398728 400757 367071 325847 297295 280125 279167
13035 279167 277538 283037 288581 290622 297757 308602 314506 320005 332941 342639 349396 359085 362414 359501
13021 359501 358486 358082 368078 389488 404072 420198 443745 477328 518127 574911 674476 813966
13009H13966J78076K33337L10244M38657O62376R84046J297630J316674R76983
13000G211989N52942K94505j04096q00493j402721j407314j010741o18655m10339
12991B305077l15160k51012j94242j63583j43146j26987j16245j04065r1461q3989
12981G15187p2967o4336o3485m8871m0210m1243l9284l6631k9279k9217j9969
12970B29695k0231j6504j9845j2020j4840j6869j3645n578o453m576m463q669
12958H6002n372k938n148L956m368n503m768o647k001l161p627q826M790Q916
12944D7305P654J4446P170K0971K6847K7323K5157K1499K921j0145j4878k2333
12932A53937k6355k6829j8994j6474j0823m099m295k660k231Q060l168j2218j5960
$$ plain form
13009 813966 992042 1225379 1535623 1974280 2636656 3620702 4918332 6235006 7211989
13000 7211989 7764931 8059436 7955340 7154847 5752126 4344812 3334071 2715416 2305077
12991 2305077 1989917 1738905 1544663 1381080 1237934 1110947 994702 890637 799176 715187
12981 715187 642220 577884 514399 465528 425318 384075 344791 308160 278881 249664 229695
12970 229695 209464 192960 173115 161095 146255 129386 115741 110163 103710 99134 94671 86002
12958 86002 80630 77692 72544 76500 72132 66629 61861 55214 53213 50052 42425 33599 38389 47305
12944 47305 54959 69405 76575 97546 124393 151716 176873 198372 201293 191148 176270 153937
12932 153937 127582 100753 81759 65285 54462 50363 46068 43408 41177 49237 46069 33851 17891
12919A7891j705k150n172O51j965n572K588P985K92j210k437j2642k053K262J168
12904b069K630R76O448k892j875R84r73L14o498r0j036l710m318K605N239l990
12888h255j891q3M000o63r34Q67j764m228j663L713N614o29j056M236K993J497
12872A754o611m975N491k309q5L539L114l837J15K208P75O2k022K92N028o14O40
12855B565j668l558k687j529K528M534j668J7n614k361k51M56L962J450N179N363
12839F718n861j147O158k142l213J050J800k355j163j0155m196N239j180m349
12825a4796J176p66O89M565n22l496L87N92j87J09o522Q668R485k111j844n399
12809i972l063J377p83K720O785o539m035j746m770K604j409P162N012p453n44
$$ plain form
12919 17891 16186 14036 8864 9515 7550 1978 4566 12551 12843 11633 9196 -3446 -5499 -3237 -2069
12904 -2069 561 1537 7985 5093 3218 4202 3229 3543 -2955 -3045 -4081 -7791 -12109 -9504 -4265 -8255
12888 -8255 -10146 -10229 -6229 -6892 -7826 -6959 -8723 -12951 -14614 -10901 -5287 -5916 -6972 -2736 257 1754
12872 1754 -4857 -9832 -4341 -6650 -6735 -3196 -82 -3919 -3804 -1596 -821 -759 -2781 -2489 2539 1925 2565
12855 2565 897 -2661 -5348 -6877 -4349 185 -1483 -1466 -7080 -9441 -9692 -9236 -5274 -3824 1355 6718
12839 6718 857 -290 5868 3726 513 1563 3363 1008 -155 -10310 -14506 -9267 -10447 -14796
12825 -14796 -13620 -14386 -13697 -9132 -9654 -13150 -12763 -12171 -12358 -12249 -18771 -10103 -618 -2729 -4573 -9972
12809 -9972 -13035 -11658 -12441 -9721 -2936 -9475 -13510 -15256 -20026 -17422 -18831 -11669 -6657 -14110 -14654
12794a4654M27P053R698P61j174l207q698n45M363J349j386p22K423N782L980
12779E450R81k309M75k489n082l729l097J935p07l606J896r537j647K877l569
12764b2158n13P180K391o054N30Q790L046j131n943M471l196J849M392Q62p541
12749a3025J102M087M25K293m096n766k351P923L245n443k115J379J086K095J2022
12734B861K391j384n753m414j1043j078O006L113m513L518J827J522L116m569
12720h400M07l490o347N324j35R74M386J702J851m397j087j731L154J476n88j15
12704g016k475L784R24o32l858j30N232O157p607l380k044L941O12k262p445L024
12688a3175P489m323j1651n5K324m68N048J0255o40m10j73j133o258p67o00k158
$$ plain form
12794 -14654 -14227 -7174 2524 3285 2111 -1096 -9794 -10339 -5976 -4627 -6013 -6735 -4312 1470 5450
12779 5450 6431 4122 4597 2108 -2974 -6703 -9800 -7865 -8572 -12178 -10282 -19819 -21466 -18589 -22158
12764 -22158 -22671 -15491 -13100 -19154 -18624 -9834 -6788 -7919 -13862 -9391 -12587 -10738 -6346 -5484 -13025
12749 -13025 -11923 -7836 -7411 -5118 -9214 -14980 -17331 -9408 -6163 -11606 -13721 -12342 -11256 -9161 2861
12734 2861 5252 3868 -1885 -6299 -17342 -18420 -12414 -9301 -13814 -10296 -8469 -6947 -3831 -8400
12720 -8400 -7993 -11483 -17830 -12506 -12641 -11667 -7281 -5579 -3728 -8125 -9212 -10943 -7789 -6313 -6901 -7016
12704 -7016 -9491 -5707 -4783 -5415 -9273 -9403 -4171 1986 -5621 -9001 -11045 -7104 -6492 -8754 -16199 -13175
12688 -13175 -5686 -10009 -21660 -21715 -19391 -19859 -14811 -4556 -5196 -5606 -5779 -6912 -13170 -13937 -14537 -16695
12672a6695k184l778J558K464N072K53l330K790L462j417j392K360l861J021M473
12657i204l567j313J77m390m524J762N548J0376J85q663j814L424L857n153l981
12642a7280j586P545L627K229o48k320J420m315k558O525K169K161o121k983L772
12627h363K519l559J288O034O92q503o496k318J247Q058R18n925j271J428R939
12612d312M911q427m686K842k157L677J528k599o405M67N45J828j118M541J047
12597h318J420n80m544L317L866J638K458k755m123J1l244L147J29k476R7k95
12581a0252l480N026J650L83m039P36K033j904k120j2q48N43J58k549J040Q93
12565a2742J140k185l737m051N094q31J968Q581j266L465l257N62R064J198n948
$$ plain form
12672 -16695 -18879 -22657 -21099 -18635 -13563 -13310 -16640 -13850 -10388 -11805 -13197 -10837 -14698 -13677 -9204
12657 -9204 -12771 -14084 -13907 -18297 -22821 -21059 -15511 -5135 -4950 -13613 -15427 -12003 -8146 -13299 -17280
12642 -17280 -18866 -11321 -7694 -5465 -6113 -8433 -7013 -11328 -13886 -7361 -5192 -3031 -9152 -12135 -8363
12627 -8363 -5844 -9403 -8115 -2081 -1389 -9892 -16388 -18706 -17459 -9401 -8483 -14408 -15679 -14251 -4312
12612 -4312 599 -7828 -12514 -9672 -11829 -8152 -6624 -9223 -15628 -15161 -14616 -12788 -13906 -9365 -8318
12597 -8318 -6898 -7478 -12022 -8705 -4839 -3201 -743 -3498 -7621 -7610 -10854 -7707 -7578 -10054 -9957 -10252
12581 -10252 -13732 -8706 -7056 -6673 -10712 -9976 -7943 -9847 -11967 -11979 -12827 -12284 -12126 -14675 -13635 -12742
12565 -12742 -11602 -13787 -17524 -21575 -16481 -17312 -15344 -6763 -8029 -4564 -7821 -7259 1805 3003 -2945
12550b945k30L435m068l213l349o478J944o33m233k326P060L265J737O722J11
12535c201k87n148k828L670N627m40j917M772P320L292j2700p339K530J1073P561
12520A1985L667O48O783O546N784j565q171j1416o593k50r553j496K367M340r53
12505B123L120L262K214n159K374K983m755n240j213R7n41j753o83n98K588O93
12489d88o477l844K336j124k709l579m913M309M053L768l377J218O140o20J241
12474d066P77m298n196J883K49P81O34k78L435j726l795m665R23M414J955O513
12458b460M203o351K79K082Q36j497k755J110l185k742N845k64L99k208k674j477
12442a0859j029K291K048l075N573L481J167k050q667k185N286l556n276J914
$$ plain form
12550 -2945 -3175 260 -3808 -7021 -10370 -16848 -14904 -15537 -19770 -22096 -15036 -11771 -10034 -3312 -3201
12535 -3201 -3488 -8636 -11464 -7794 -2167 -2607 -4524 248 7568 10860 -1840 -9179 -6649 4424 11985
12520 11985 15652 16300 23083 29629 35413 33848 25677 14261 7668 7418 -2135 -3631 -1264 3076 2123
12505 2123 5243 8505 10719 5560 7934 10917 6162 922 -291 -194 -735 -2488 -3171 -3769 -1181 -488
12489 -488 -6965 -10809 -8473 -9597 -12306 -15885 -20798 -16489 -12436 -8668 -12045 -10827 -4687 -5307 -4066
12474 -4066 -3289 -7587 -12783 -10900 -10651 -9870 -9236 -9514 -6079 -7805 -11600 -16265 -15342 -10928 -8973 -2460
12458 -2460 1743 -4608 -4329 -2247 -1411 -2908 -5663 -4553 -7738 -10480 -4635 -4899 -4500 -6708 -9382 -10859
12442 -10859 -11888 -9597 -7549 -10624 -5051 -1570 -403 -2453 -11120 -13305 -8019 -11575 -16851 -14937
12428a4937Q464M68o48j222L076L192J908K874P94K179J3364J8524J5021Q234
12414F1291K649K922O497r828j2635j0290m382M60j056l641r900n081O18P30j565
12399A6789o298n36N55m985J6k490k556r9k566m951N435m219p423R48L925O537
12383a918P895j538J345P70m101K019L899p8k684Q657P534M446j792o334r91j112
12367A6017L540J3531J2660Q252M103p866r998Q67j0850p153q07l508L801L617
12353B6206o73R06J0110o17l494P605O757J234n77l309j703l980o578K895P867
12338D2649N07r057n870q620n83L816P779K192j179o615n951j916N88j861k18
12323A5661N741J558O472M544O697k270l483M002J836k375l359K461k183q615
$$ plain form
12428 -14937 -6473 -6005 -6653 -7875 -4799 -1607 301 3175 3969 6148 19512 38036 53057 61291
12414 61291 63940 66862 73359 63531 50896 40606 36224 36684 35628 31987 22087 17006 17624 18354 16789
12399 16789 10491 9955 10510 5525 5541 3051 495 396 -2170 -7121 -1686 -5905 -13328 -12380 -8455 -1918
12383 -1918 5977 4439 5784 6554 2453 4472 8371 8293 5609 14266 21800 26246 24454 18120 17129 16017
12367 16017 19557 33088 45748 54000 58103 50237 40239 41106 30256 23103 22296 18788 22589 26206
12353 26206 25533 26439 36549 35932 32438 40043 46800 48034 47457 44148 42445 38465 31887 34782 42649
12338 42649 43156 34099 28229 19609 19026 22842 30621 32813 31634 25019 19068 17152 17740 15879 15661
12323 15661 21402 22960 29432 33976 40673 38403 34920 38922 40758 38383 35024 37485 35302 26687
12309B6687p705o916K941l181r278l718l357K069P371O355J586p438o091l297
12295c972L065P867M466L488O01M87m257j824k617J967l233n948M957N686K30
12280A0963J100L08j420P421Q759J827Q69J1313J4547O564J2085J354L421l745
12266G5366p222j2315j1590j1641m481m200j538L967k03m198n970j1392q059m009
12252g485l849O807N404j872l449m889o031q22M640k811N936J1693K006j852k557
12237H69j254k680m286J742K129Q396P340L002J0093R981P221J2687R146l15K910
12222F6981M086j1309j4232j5546m253n529n306j578o3j85m519l335m314l466
12208b568m180K187P108q614p379K325j455M399m243n733M637K411p47Q103K219
$$ plain form
12309 26687 18982 12066 15007 11826 2548 -1170 -4527 -2458 4913 11268 12854 5416 -675 -3972
12295 -3972 -907 6960 11426 14914 15515 16002 11745 9921 7304 9271 6038 90 5047 10733 10963
12280 10963 12063 12371 10951 18372 27131 28958 29827 41140 55687 62251 74336 75690 79111 75366
12266 75366 68144 55829 44239 32598 28117 23917 22379 26346 26143 21945 15975 4583 -3476 -7485
12252 -7485 -11334 -4527 877 -995 -4444 -9333 -15364 -16186 -11546 -14357 -8421 3272 5278 3426 869
12237 869 -385 -3065 -7351 -5609 -3480 4916 12256 15258 25351 35332 42553 55240 64386 64071 66981
12222 66981 71067 59758 45526 29980 25727 20198 14892 13314 13251 13066 8547 5212 898 -2568
12208 -2568 -6748 -4561 2547 -6067 -13446 -11121 -12576 -8177 -12420 -18153 -13516 -11105 -11852 -3749 -1530
12193a530K028M813l575p95M421L423Q348j214L001R64k048J700J897n159p72
12178A5502N461M53m413n06m905m650j925l728J306k14l162j234M60m872l805
12163a0232R63K250N198o65l881J666k894l114j047K754O501l660o495m25L064
12148a0017K117k34q109l996K723J0060L058N886N283l985k872K03M259M931P022
12133A6329M566J0932J134n601n565k170n601o100k221r305n50m84k283m965l241
12118a5125O553O157J943J443L34n933m008N251O124j69l589K03M724r720p609
12103a3421r275P36P905J729k066l0j053O882Q771j837l152k083o89K354Q761
12088C532K235n365m600P12K916O497K064Q067Q075R052J9824K4349L4148L1830
$$ plain form
12193 -1530 498 5311 1736 941 5362 8785 17133 15919 18920 19884 17836 19536 21433 16274 15502
12178 15502 20963 21416 17003 16497 11592 6942 5017 1289 2595 2381 -781 -2015 -1555 -6427 -10232
12163 -10232 -9269 -7019 -1821 -2486 -6367 -4701 -7595 -10709 -11756 -9002 -2501 -6161 -12656 -13081 -10017
12148 -10017 -7900 -8134 -16243 -20239 -17516 -7456 -4398 1488 6771 2786 -86 117 4376 9307 16329
12133 16329 20895 31827 32961 27360 21795 19625 14024 7924 5703 -3602 -4152 -4636 -6919 -11884 -15125
12118 -15125 -8572 -2415 -472 971 1305 -4628 -8636 -3385 2739 2570 -1019 -816 3908 -5812 -13421
12103 -13421 -22696 -21960 -14055 -12326 -14392 -14422 -15475 -8593 178 -1659 -4811 -6894 -7583 -5229 3532
12088 3532 5767 402 -4198 -3486 -570 5927 7991 16058 24133 33185 53009 77358 111506 143336
12074A43336K3730Q226N187K796j0905l3931l9960k5362j0844r310p502l899p173
12061C4389q437p216n734k626k696n92j487K704R134L433P58n774j475M95p863
12046G013n002m066n848J008L538L712k913n06p23j422j36o185n17Q061L375o828
12030g439l095Q496M062j211n71K95Q245P050Q63L530N328R152O562J6212K7995
12015H5474M2203N4344N6032L6867J4444J2231R409k7925o7226n7865l7287j8233
12003A02468r593j1320j1116j5214j1566J1l577n708l015m770p072n658l121j211
11989I538k114k941L288K401L71J088k057J607L744o040m285j03k394k419K041
11974A725M934K983j0160k679N273o130m412L251L627N86p151j3234N597Q938
$$ plain form
12074 143336 167066 175292 180479 183275 172370 138439 98479 73117 62273 52963 45461 41562 34389
12061 34389 25952 18736 13002 10376 7680 7088 5601 8305 17439 20872 21630 15856 14381 14876 7013
12046 7013 2011 -2055 -7903 -6895 -3357 355 -2558 -3064 -3787 -5209 -5345 -11530 -12047 -3986 -611 -7439
12030 -7439 -10534 -2038 2024 813 242 537 8782 15832 16695 20225 25553 34705 41267 57479 85474
12015 85474 127677 182021 238053 274920 289364 301595 311004 283079 215853 157988 120701 102468
12003 102468 92875 81555 70439 55225 43659 43670 40093 34385 31370 26600 19528 13870 10749 9538
11989 9538 7424 4483 7771 10172 10543 11631 9574 11181 14925 8885 4600 4497 2103 -316 1725
11974 1725 6659 9642 -518 -3197 2076 -4054 -8466 -5215 -1588 -1002 -8153 -21387 -15790 -6852
11960f852j813m91J621M545K672l509k018j583j355K348l264l392j736J192j781
11945a5416N345M588q66r08J292k568k577m229l725k398N557P366O085j743p002
11930a1199L035K972j034j06P046k190j22K584p490l694j437k522L334l071K453
11915a1441L182j887q028P04P841L559K315j512m946l30M990P910J23m383j190
11900c093p748m658L005N194N63k620j640l916O263P73J504L656L958J145r351
11885f965q954n39K021L079L475M893m67o462L084J913M27L764l369m034j179
11870i313q32L449J1562N663p180l022M21m537l345L414L331R36p009q95N492
11855a865K439j053P316P19j864o91p344n116J801n098l209L009j557q029K474
$$ plain form
11960 -6852 -8665 -9156 -7535 -2990 -318 -3827 -5845 -7428 -8783 -6435 -9699 -13091 -14827 -13635 -15416
11945 -15416 -10071 -5483 -6349 -7257 -5965 -8533 -11110 -15339 -19064 -21462 -15905 -8539 -2454 -4197 -11199
11930 -11199 -8164 -5192 -6226 -6332 714 -1476 -1598 986 -6504 -10198 -11635 -14157 -10823 -13894 -11441
11915 -11441 -8259 -10146 -18174 -17470 -9629 -6070 -3755 -5267 -10213 -10543 -5553 2357 2480 -1903 -3093
11900 -3093 -10841 -15499 -12494 -7300 -6737 -9357 -10997 -14913 -8650 -7877 -6373 -2717 1241 2386 -6965
11885 -6965 -15919 -16458 -14437 -11358 -7883 -2990 -3457 -9919 -6835 -4922 -4495 -731 -4100 -8134 -9313
11870 -9313 -10145 -6696 4866 10529 3349 327 748 -3789 -7134 -3720 -389 547 -6462 -7357 -1865
11855 -1865 574 -479 6837 7556 5692 5001 -2343 -7459 -5658 -10756 -13965 -10956 -12513 -20542 -18068
11840a8068P662M629K303O182n795J442L218n954K757L379J798q02j417j555l249
11825c470k433l026K227k590j754Mn79k240N073L669p71N46o568m608l094N668
11809a3946J999l809J250M548P370L927m637o008L64L040j715K129K4k233P20
11794f977L272m59l246J795l89r22K544P133k224l498J151j542L367j318K48J329
11778B64M6j638M701n19o009N342J373J399j088m968r055N405J506J825J86n298
11762f528o704n447j758J0582L220K001J478M797m692J782O006j446l831j693
11748b233J833l699k041N879n18K609J084k393R7m52N47M162P205M548l531p26
11732A2371l062J36N663Q374O698q335L726O918P583K585k787k996k687o4J581
$$ plain form
11840 -18068 -10406 -5777 -3474 2708 -3087 -1645 1573 -4381 -1624 1755 3553 2751 1334 -221 -3470
11825 -3470 -5903 -8929 -6702 -9292 -11046 -11042 -11621 -13861 -8788 -5119 -5890 -5344 -11912 -16520 -19614 -13946
11809 -13946 -11947 -15756 -14506 -9958 -2588 1339 -3298 -9306 -8942 -5902 -7617 -5488 -5464 -7697 -6977
11794 -6977 -3705 -4164 -7410 -5615 -6004 -6926 -4382 2751 527 -2971 -1820 -3362 5 -1313 -1065 264
11778 264 310 -1328 3373 2854 -3155 2187 3560 4959 3871 -1097 -10152 -4747 -3241 -1416 -1230 -6528
11762 -6528 -13232 -18679 -20437 -9855 -6635 -4634 -3156 1641 -3051 -1269 4737 3291 -540 -2233
11748 -2233 -400 -4099 -6140 -261 -779 1830 2914 521 618 166 713 4875 12080 16628 13097 12371
11732 12371 9309 9445 15108 23482 30180 21845 25571 32489 40072 42657 39870 36874 34187 34123 35704
11717C5704O320N917p250n593P41l04j2191m013k05L744K107j684l434l236l851
11702A2772K046N255K832N225N395J730p50J515J762J820N140K915L729R151J0513
11687G1050J1886P042O488J0956N359O334Q724J0086Q741L945P985O631O599p503
11673A64323n241k584q554j0085r608J527n965j0064n216j3373o180r434p843
11660G1703K83j791R225L138L86l722l068j592l77M387P193J374P376R910J2419
11645A16844Q168J2369J3174Q738J1989N234J0001M363M825R326P32K276J581
11632B09620M76J524O11j386j0717o774p613P41p342j0192r909j3453j0907r453
11618A25226n074J824q073o849p071r681m023N92O156j1045j529Q279j871n58
$$ plain form
11717 35704 42024 47941 40691 35098 35839 35535 23344 19331 19126 22870 24977 23293 19859 16623 12772
11702 12772 14818 20073 22905 28130 33525 35255 34505 36020 37782 39602 44742 47657 51386 60537 71050
11687 71050 82936 89978 96466 107422 112781 119115 127839 137925 146666 150611 158596 165227 171826 164323
11673 164323 159082 156498 147944 137859 128251 129778 123813 113749 108533 95160 88980 79546 71703
11660 71703 71986 70195 79420 82558 82944 79222 76154 74562 74185 78572 85765 87139 94515 104425 116844
11645 116844 125012 137381 150555 159293 171282 176516 186517 190880 195705 205031 205763 208039 209620
11632 209620 210096 211620 212231 210845 200128 193354 185741 186482 179140 168948 159039 145586 134679 125226
11618 125226 120152 121976 113903 107054 99983 90302 86279 86871 93027 81982 80453 88732 86861 86303
11604H6303J690L975L125O090N835P226R02N348P792J1075J3097J960O377P140
11590A67935l993p659l68m572l522k74J717j4675r651j846J106n27m390j1128
11576A08153j4022j4122n310K749j459j5950m256j744J864j635j1394j725M05
11563D1554q366j06K430J024o89O585R13L862k527K207l587j59K386m870k181
11548C8476L818J342R394R136m2p469j1040m44K867n298p041j2628m623L236o049
11533A3635l525J740J937O258P657o769o339l650q061P45L229K626m148m10M907
11518I832K895k948m254J18k392Q89L152q73m643p009J727J828p38l955Q055m43
11502A241o68l670p60J941M574l837j50N658M79n963J864P198n227l133j829j4485
$$ plain form
11604 86303 87993 91968 95093 101183 107018 114244 115146 120494 128286 139361 152458 154418 160795 167935
11590 167935 163942 156283 155915 151343 147821 147547 149264 134589 124938 123092 124198 123671 119281 108153
11576 108153 94131 80009 74699 77448 75989 60039 55783 54039 55903 54268 42874 41149 41554
11563 41554 33188 33082 35512 36536 35847 42432 43345 47207 44680 46887 43300 43141 45527 40657 38476
11548 38476 42294 43636 53030 62166 62124 54655 43615 43171 46038 40740 33699 21071 16448 19684 13635
11533 13635 10110 11850 13787 20045 27702 20933 14594 10944 2883 3628 6857 9483 5335 4925 9832
11518 9832 12727 9779 5525 5643 3251 4140 7292 6419 1776 -5233 -3506 -1678 -2416 -6371 1684 1241
11502 1241 573 -3097 -3857 -1916 2658 -1179 -1329 4329 4808 -1155 709 7907 2680 -453 -2282 -16767
11486a6767N87N78M13L328n755l910N884Q1j827J2152O716J581J709o04m659p993
11470h486l134K048M303M657j588J52k906j196k289N101n513o446M454O511Q14
11455c518L058L499l107j1223p58M363P21m874l84L657L40J24L357L49J561n456
11439h291j547L374K579k317j0099j962P280L201l725O21k63K121r30r27O49j806
11423a2042k55M822O059J0339L235p613n305n778l399p00n74l002p66O891O560
11408a528L169K612n826n469m693m317N857K866Q85j691q70O877m545m161N972
11393d862N329R20K07q354m992jK87L959j818m626R249Q430J041m61m007L268
11377C569j08L333l78p370N882J164K511l954m228L137j642J926n535j843O298
$$ plain form
11486 -16767 -16180 -15602 -15189 -11861 -17616 -21526 -15642 -15561 -17388 -5236 1480 3061 4770 4166 -493 -8486
11470 -8486 -11620 -9572 -5269 -612 -2200 -2048 -4954 -6150 -8439 -3338 -8851 -15297 -10843 -4332 -3518
11455 -3518 -460 3039 -68 -11291 -12049 -7686 -6965 -11839 -12223 -8566 -8226 -8102 -4745 -4396 -2835 -8291
11439 -8291 -9838 -6464 -3885 -6202 -16301 -18263 -10983 -7782 -11507 -10886 -11149 -9028 -9958 -10885 -10236 -12042
11423 -12042 -12297 -7475 -1416 8923 12158 4545 -760 -6538 -9937 -10637 -11211 -14213 -14979 -8088 -1528
11408 -1528 1641 4253 -1573 -7042 -11735 -16052 -10195 -7329 -6444 -8135 -9005 -2128 -6673 -10834 -4862
11393 -4862 467 1387 1594 -6760 -11752 -11753 -11466 -7507 -9325 -13951 -4702 3728 4769 4308 301 3569
11377 3569 3461 6794 6416 -954 4928 6092 8603 4649 421 3558 1916 3842 -1693 -3536 2762
11362B762L99n148p503N701k475M323K46J73l157n689m86j53j531m0O17N601k915
11345i275J871M456j170J323L098J293k003M503k070n864L788n558o346q374L407
11330a6921M519q20M01K710L126q56m107J1319L272L062q077r917Q605M738j364
11315c10k064n616O34K467L170l257j500k948j25R040Q744J278p567k290M883
11300D539K41n799m162R41o481p110O930m453j465J593L154k630N349L385N790
11285a78j24n751j151M014l385j938K742k367J9J216N995J050n709j367l605Q949
11269a590l477l285L718j342K542l10o362n044j465j054K079j128Q55Q570M622
11254b671l095p992l195L789j63m144K812k108K338K025L116J796j137M385J222
$$ plain form
11362 2762 3161 -1987 -9490 -3789 -6264 -1941 -1695 -1522 -4679 -10368 -10854 -11007 -12538 -12578 -11961 -6360 -9275
11345 -9275 -7404 -2948 -4118 -2795 303 1596 -407 4096 2026 -3838 -50 -5608 -11954 -20328 -16921
11330 -16921 -12402 -13222 -12821 -10111 -6985 -7841 -11948 -629 2643 5705 -2372 -12289 -3684 1054 -310
11315 -310 -2374 -7990 -7356 -4889 -1719 -4976 -6476 -9424 -9549 -509 8235 9513 1946 -344 4539
11300 4539 4780 -1019 -5181 -4240 -10721 -17831 -10901 -15354 -16819 -15226 -12072 -14702 -9353 -5968 -178
11285 -178 -302 -6053 -7204 -3190 -6575 -8513 -5771 -8138 -8119 -6903 -908 142 -5567 -6934 -10539 -1590
11269 -1590 -5067 -8352 -4634 -5976 -3434 -3744 -10106 -15150 -16615 -17669 -15590 -16718 -15863 -7293 -2671
11254 -2671 -5766 -13758 -16953 -13164 -13327 -17471 -14659 -16767 -14429 -12404 -9288 -7492 -8629 -4244 -3022
11239c022m886k594K069j630K19l460k045J013j805M080M479K084N795K050o39
11224A708k91l109l0m938j63L214o731k288r36l11P910J124L47r245M033P723
11208a983L432J537J355l469m172J861k33L622M49K207j799l674l778j656M991
11193a310P01K387l610m28L759k151m453j285k753N654N289j318k175J905K879
11178C091k560m793N085m276j24O761J545m709q399m165j658Q949J874M506l252
11163b125p056L330O553k416L84m808J969O317k077k074K594m39q85o8k493M904
11147A610o95K797O04j708m489J704l200l047k983m321k720L085Q892N482O080
11132G091j353k205P8O401m96m094k142p535n618L705M385j208M608n273J235
$$ plain form
11239 -3022 -7908 -10502 -8433 -10063 -9844 -13304 -15349 -14336 -16141 -12061 -7582 -5498 297 2347 1708
11224 1708 1417 -1692 -1722 -6660 -6823 -3609 -10340 -12628 -13564 -13875 -5965 -4841 -4494 -13739 -9706 -1983
11208 -1983 1449 2986 4341 872 -3300 -1439 -1672 1950 2399 4606 2807 -867 -4645 -6301 -1310
11193 -1310 -609 1778 -1832 -2260 1499 -652 -5105 -6390 -9143 -3489 1800 482 -1693 212 3091
11178 3091 531 -4262 823 -3453 -3577 3184 4729 20 -8379 -12544 -14202 -5253 -3379 1127 -2125
11163 -2125 -9181 -5851 702 -1714 -1330 -6138 -4169 2148 71 -2003 591 152 -733 -801 -3294 1610
11147 1610 915 3712 4316 2608 -1881 -177 -3377 -6424 -9407 -13728 -16448 -13363 -4471 1011 7091
11132 7091 5738 3533 3611 10012 9516 5422 3280 -4255 -9873 -6168 -1783 -2991 1617 -3656 -2421
11117b421r99m89k462J17n643q524j066J1905M600M020j5K854M59J008m697l716
11101e069J998L188K291o445j565j863L009L611j704L611m101R94k447k948j433
11086h873m950p56l588O624L037J540J293R6J372J798j797p316q74O159L662k646
11070e219l098K761K802n02q502m715O101M381M061R9l205j831M785L149m942
11055c875l863j504L618j253j759N849l660k036P57K320Q124N415p571j714o41
11040a793n830k86K593j751L062N079K217m855r541l919J0430N214l258k06Q84
11025a960P901N322q943o563K802n545o462J988J1234P070j941n227l447K591
11011a180N240n523K526q19m080n48M552j218m312R38R842L016k115j954k148
$$ plain form
11117 -2421 -3420 -3909 -6371 -6254 -11897 -20421 -21487 -9582 -4982 -962 -977 1877 2336 3344 -1353 -5069
11101 -5069 -3071 117 2408 -4037 -5602 -7465 -4456 -845 -2549 1062 -3039 -2045 -4492 -7440 -8873
11086 -8873 -13823 -14579 -18167 -11543 -8506 -6966 -5673 -5577 -4205 -2407 -4204 -11520 -12394 -6235 -2573 -5219
11070 -5219 -8317 -5556 -2754 -3256 -11758 -16473 -10372 -5991 -1930 -1831 -5036 -6867 -2082 1067 -3875
11055 -3875 -7738 -9242 -5624 -6877 -8636 -2787 -6447 -8483 -7726 -5406 2718 8133 562 -1152 -1793
11040 -1793 -7623 -7909 -5316 -7067 -4005 1074 3291 -1564 -11105 -15024 -4594 620 -2638 -2844 -1960
11025 -1960 5941 11263 2320 -4243 -1441 -6986 -13448 -11460 -226 6844 4903 -324 -3771 -1180
11011 -1180 4060 -1463 1063 244 -3836 -4384 168 -1050 -5362 -4424 5418 8434 6319 4365 2217
10996B217o27j287m261O27O24K090O806J0173M069M313R191K816O237K456Q224
10981E3668O338P075R486K42M28m696j7645j1240j245j970q074k263Q0O453l827
10966C2810l149K825m574p000K30Q42j459k632J0155L640K99k983K001P750Q982
10951D7737R996J0554L966p217j179L572k610p077n820k295k360l072o954n455
10937C1786j1285l128L118L392J6Q40j892k398o366j1373k760l20k969L481J393
10922A535j07M524M772k959q929p521L519L900L378O755l366J409L838l453N285
10907A2580k336p642n761o649m342k743j865Q765N140k799n255p1J569J94L495
10892g720r8N452K717J559O213l428L6j954O702J1295J1816J8070J5629N086n909
$$ plain form
10996 2217 1590 303 -3958 -3331 -2707 -617 6189 16362 20431 24744 33935 36751 42988 45444 53668
10981 53668 60006 67081 76567 76809 77237 72541 54896 43656 42411 40441 32367 30104 30184 36637 32810
10966 32810 29661 32486 27912 20912 21142 21984 20525 17893 28048 31688 31987 29004 31005 38755 47737
10951 47737 57733 68287 72253 65036 63857 67429 64819 57742 51922 49627 47267 44195 37241 31786
10937 31786 20501 17373 20491 23883 23899 24739 22847 20449 14083 2710 -50 -370 -3339 142 1535
10922 1535 1428 5952 10724 7765 -1164 -8685 -5166 -1266 2112 8867 5501 6910 10748 7295 12580
10907 12580 10244 2602 -3159 -9808 -14150 -16893 -18758 -9993 -4853 -7652 -12907 -12978 -11409 -11215 -7720
10892 -7720 -7818 -2366 351 1910 8123 4695 4731 2777 9479 20774 32590 50660 66289 71375 65466
10877F5466J0598J0192j5055k0797j2091o933l338k845j98M872n650m495P9k430
10863A7375p058m404J925J717O80J124n353j0675p436o49O312K966l531n028k221
10848a4256K394R65M625P89k80k334K519K789k056j915m057J954P357j529l476
10833f511K31o279l236k106l560J652M575j352N069N405K333o078o64o75N98l426
10817a4024r36K197M757K924j22p915q415N487L443K124j967m266M35K632L527
10802a0119J4008M47r447J63j184o37n43J998M655K771q612l797K281j249k38
10787i503N055L266k830j259l809J52j355l188L45L915J941n290O01P049N256
10772C46N752j627j100j246m985l680k378J378K559l6j594K48r19J054R328K200
$$ plain form
10877 65466 76064 86256 71201 50404 38313 31380 28042 25197 24999 29871 24221 19726 19805 17375
10863 17375 10317 5913 7838 9555 10235 11359 6006 -4669 -12105 -12754 -6442 -3476 -7007 -12035 -14256
10848 -14256 -11862 -10897 -6272 -5483 -5763 -8097 -5578 -2789 -4845 -6760 -10817 -8863 -1506 -3035 -6511
10833 -6511 -6280 -12559 -15795 -17901 -21461 -19809 -15234 -16586 -11517 -6112 -3779 -9857 -10521 -11196 -10598 -14024
10817 -14024 -14960 -12763 -8006 -5082 -5204 -13119 -21534 -16047 -12604 -10480 -12447 -16713 -16278 -13646 -10119
10802 -10119 3889 4336 -5111 -4948 -6132 -6769 -7312 -5314 -659 2112 -6500 -10297 -8016 -9265 -9503
10787 -9503 -4448 -1182 -4012 -5271 -9080 -8928 -10283 -13471 -13126 -9211 -7270 -12560 -11959 -4910 346
10772 346 6098 4471 3371 2125 -2860 -6540 -8918 -7540 -4981 -5017 -6611 -6363 -7282 -6228 3100 5300
10756E300J130l300o44J258n555n836p28J542L366q43j299L873L643m76l962k055
10740d586j714M741J717R87p397k968K948Q822N722J365m695r80O810n39J691
10725A1924L833N070R248O190J0029K1923K4249K7405K0819M780P117J0023p767
10712A54843l5114l6122j7743r348q882n806p935o766r257n838n824j0160k068
10699f020N998Q350j1252K57L432L35l69K55N163L984m454n304O55n513m059J098
10683g444L400q99l043P62P03J502k084l641J727O352o71K819L87N70k151n595
10667g306j531L626o25n838L392K582P41p01J850J992L162l29r3P00k003n361
10651e742l065J260O685N943l609n501r880M825J1383o35j702O71r50q921k739
$$ plain form
10756 5300 6430 3130 2486 3744 -1811 -7647 -8375 -6833 -3467 -4310 -5609 -1736 1907 1431 -2531 -4586
10740 -4586 -6300 -1559 158 1145 -6252 -9220 -6272 2550 8272 9637 4942 3962 10772 10233 11924
10725 11924 15757 20827 30075 36265 46294 68217 92466 119871 140690 145470 152587 162610 154843
10712 154843 119729 83607 65864 56516 47634 41828 33893 27127 17870 12032 6208 -3952 -6020
10699 -6020 -22 8328 -2924 -2667 765 1100 731 986 6149 10133 5679 375 1030 -4483 -8542 -7444
10683 -7444 -4044 -4943 -7986 -7224 -6521 -5019 -7103 -10744 -9017 -2665 -3336 -517 -130 440 -1711 -7306
10667 -7306 -8837 -5211 -5836 -11674 -8282 -5700 -4959 -5660 -3810 -1818 1344 1015 922 1622 -381 -5742
10651 -5742 -8807 -7547 -862 5081 1472 -4029 -13909 -9084 2299 1664 -38 633 -317 -9238 -11977
10636a1977K050K767M458M973P799j489n993j431k621K957m847k392o996N731
10622g011L560J816j386o01M839O82r328j1115m394O92O069O661O628l352j216
10607g456L953K542L363j075j084l544j652L689k517K07N602j862o720N68q23
10592f809o044P50j42QN290j854j441n914l24k930j290J0351J2344P68j442m844
10576c523j438m854oK359Q411j240k396l176j850j904J011j570L578R49M501r22
10560b070J691K767k299n163k657M078r339l877M177K249j542N61j444j884N883
10545h869N111J855j84j943l166o351J070P244P55J109L25j922K395j909o14J862
10529c232j339q17J43O563L465j1742o59J529K222j757j585K870k143L726L348
$$ plain form
10636 -11977 -9927 -7160 -2702 2271 10070 8581 2588 1157 -1464 1493 -3354 -5746 -12742 -7011
10622 -7011 -3451 -1635 -3021 -3622 1217 1899 -7429 -18544 -22938 -22246 -16177 -9516 -2888 -6240 -7456
10607 -7456 -3503 -961 2402 1327 243 -3301 -4953 -1264 -3781 -3574 2028 166 -6554 -5986 -6809
10592 -6809 -12853 -12103 -12245 -12237 -6947 -8801 -10242 -16156 -16480 -19410 -20700 -10349 1995 2763 1321 -3523
10576 -3523 -4961 -9815 -9821 -7462 949 -291 -2687 -5863 -7713 -9617 -8606 -10176 -6598 -5649 -1148 -2070
10560 -2070 -379 2388 89 -5074 -7731 -3653 -12992 -16869 -12692 -10443 -11985 -11424 -12868 -14752 -8869
10545 -8869 -3758 -1903 -2087 -4030 -7196 -13547 -12477 -5233 -4478 -3369 -3044 -4966 -2571 -4480 -5094 -3232
10529 -3232 -4571 -5388 -5245 1318 4783 -6959 -7618 -6089 -3867 -5624 -7209 -4339 -6482 -2756 592
10514E92l932l700J98j362K103r95l48J477q321l406N345j541k783j112K038O928
10498h819L502l431m786O93O51L38P008j030k663p61l096L672J465q072q69Q570
10482g628J810N50M599M001k467m542q39r85J152k335m844L52K20l291R640J1624
10466G017P460k149q222l372k834J747P145m516p394k03m09m948J365O454q55
10451c714l284M533K852Q18K51J283J634K68K251M682O39j092m933m779j52l9
10435A218k717n995L421J680N43m754j852N636k094K89K094j853N95R27K407L971
10419C516N643m31o009k521m831M047K412L775M865J921k772J574j003m264N912
10404A1834Q124J399r295l641J326J423J380l966l238l821J154L4J84o864n90
$$ plain form
10514 592 -3340 -7040 -6842 -8204 -6101 -7096 -7444 -5967 -14288 -17694 -12349 -13890 -16673 -17785 -15747 -8819
10498 -8819 -5317 -8748 -13534 -12841 -12190 -11852 -4844 -5874 -8537 -9298 -12394 -8722 -7257 -15329 -16198 -7628
10482 -7628 -5818 -5268 -669 3332 865 -3677 -4516 -5501 -4349 -6684 -11528 -11176 -10956 -14247 -4607 7017
10466 7017 14477 12328 4106 734 -2100 -353 6792 2276 -5118 -5321 -5730 -10678 -9313 -2859 -3714
10451 -3714 -6998 -2465 387 1205 1456 2739 4373 4641 6892 11574 12213 11121 6188 1409 1257 1218
10435 1218 -1499 -7494 -4073 -2393 -1850 -6604 -8456 -2820 -4914 -4625 -2531 -4384 -3789 -2862 -455 3516
10419 3516 9159 8728 2719 198 -4633 -586 1826 5601 10466 12387 9615 11189 10186 5922 11834
10404 11834 19958 21357 12062 8421 9747 11170 12550 8584 5346 1525 2679 2713 2897 -3967 -4557
10389d557R40M560N422O279P425m506j2997o767K808m677J227L198M265j427l386
10374b193K28L883J077o135K938J860m291j899K358M244P94n99l197K43l090R08
10358b871K852N76m10J046l639n105L848N354J17J023m054r913J057L129k442
10343i432P472N749n638J69j440k086j206n084k68L824l621K23Q514O052j112
10328B116n082r814M593n49l824m246O687P777O98l901m760l60k097l891p135
10313b3788M614J817Q829l637l561L545r17J415Q595j179q873p71O173j737N68
10298h907K619K606n249r903L287O638l747O13J815J30M232J48K635o77K223K048
10282E11j022M27l527q45l84l558j484J534M547M21p645l265K540O183j779L53
$$ plain form
10389 -4557 -3617 943 6365 12644 20069 15563 2566 -4201 -1393 -6070 -4843 -1645 2620 1193 -2193
10374 -2193 -1965 1918 2995 -3140 -202 1658 -2633 -4532 -2174 2070 2864 2265 -932 -689 -3779 -2871
10358 -2871 -19 557 147 1193 -2446 -7551 -3703 1651 1768 2791 -1263 -11176 -10119 -6990 -9432
10343 -9432 -1960 3789 -1849 -1680 -3120 -5206 -6412 -11496 -11764 -7940 -11561 -11338 -2824 3228 2116
10328 2116 -2966 -12780 -8187 -8736 -12560 -16806 -10119 -2342 -1644 -5545 -10305 -10665 -12762 -16653 -23788
10313 -23788 -19174 -17357 -8528 -12165 -15726 -12181 -13098 -11683 -3088 -4267 -13140 -13911 -7738 -9475 -8907
10298 -8907 -6288 -3682 -8931 -18834 -15547 -8909 -12656 -12043 -10228 -10098 -5866 -5718 -3083 -3760 -1537 511
10282 511 -511 -84 -3611 -4456 -4840 -8398 -9882 -8348 -3801 -3380 -11025 -14290 -11750 -5567 -7346 -6993
10266f993m06j412l145J24N381L422K517L325j980n375M329J772k072l199l311
10251g023M049J926J048L339j766k499q443l113J577O249N544m04J772k584j180
10236a508o76n174j471k70m031k930M909N234q27k955J590n89J208J645K149r22
10220d618K27K734M697J528p723o548k390J1255K730k826Q65k370k309J930N536
10205B718k7p420m932m351l176L387J1244L339M175J492k02N675J91l406l757
10190D950j724k009J784q628m689L216N102N832j312k469l30n58K853K77J775
10175D070q048k363M727O345m315l425L788K289o264m780m405l03K484M966L080
10160b154k27M36j53J00N40o930r04P55P17O057O923K305J990J398J037l370k025
$$ plain form
10266 -6993 -7399 -8811 -11956 -11832 -6451 -3029 -512 2813 833 -4542 -213 1559 -513 -3712 -7023
10251 -7023 -2974 -1048 0 3339 1573 -926 -9369 -12482 -10905 -4656 888 484 2256 -328 -1508
10236 -1508 -2184 -7358 -8829 -9099 -13130 -16060 -11151 -5917 -6744 -9699 -8109 -8698 -7490 -5845 -3696 -4618
10220 -4618 -4391 -1657 3040 4568 -3155 -9703 -12093 -838 1892 -934 -69 -2439 -4748 -2818 2718
10205 2718 2691 -4729 -9661 -14012 -17188 -13801 -2557 782 4957 6449 6247 11922 12113 8707 4950
10190 4950 3226 1217 3001 -5627 -10316 -7100 -1998 3834 2522 53 -277 -835 2018 2295 4070
10175 4070 -3978 -6341 -1614 4731 416 -3009 779 3068 -3196 -7976 -12381 -12684 -10200 -5234 -2154
10160 -2154 -2381 -1945 -2098 -1998 -1458 -8388 -9292 -8537 -7820 -1763 5160 7465 9455 10853 11890 8520 6495
10143F495j426j120l511p322q02Q445M586q76p511l267p23P217p42p66M266l021
10127g8J642M06j063J818L299j347J800M426k437k008k879j081N50J01k643J107
10111A613M003j047p38m039o74o098o41m693j229M108k067J463n47K27M931M257
10095a171P345O621n370q431l736j270J335L598m342K931L233O280j839n116o964
10080f896k760R17L011M586k858r88k484j186P67M087l286m309j385j705j063
10065a5552R245P208M689j486o042l474J784m498l560k766O746O973M54L529K928
10050F178m69n664K644Q683j299l020j863L251P36l373p872K157K80J282l978
10035b327j809K382J035j292J750J353k806K627K726k906p274j191L852O330P05
$$ plain form
10143 6495 5069 3949 438 -6884 -7686 759 5345 4469 -3042 -6309 -7032 185 -557 -1323 2943 -78
10127 -78 1564 1970 907 2725 6024 4677 6477 10903 8466 6458 3579 2498 3048 3149 506 1613
10111 1613 5616 4569 3831 -208 -882 -6980 -7621 -12314 -13543 -9435 -11502 -10039 -10586 -10359 -5428 -1171
10095 -1171 6174 12795 7425 -1006 -4742 -6012 -4677 -1079 -5421 -2490 743 7023 5184 68 -6896
10080 -6896 -9656 -8739 -5728 -1142 -4000 -4988 -7472 -8658 -7891 -3804 -7090 -11399 -12784 -14489 -15552
10065 -15552 -6307 901 5590 4104 -1938 -5412 -3628 -8126 -11686 -14452 -7706 -733 -279 3250 6178
10050 6178 5709 45 2689 11372 10073 7053 5190 8441 9177 5804 -2068 89 369 1651 -2327
10035 -2327 -4136 -1754 -719 -2011 -261 1092 -1714 913 3639 733 -6541 -7732 -3880 2450 3155
10020C155l096L656N915j562m413k800p390k314n471K662J912P286P203l228l619
10005b104m121Q235K677N962j543P50l780n147Q23r57N154K066p223l177K105
9990b80K903l191j793P607m349M64M369j775n115m237L427J188M733K502k506
9975C947l454p607L905K166O538K032m797j333P179m130m518m228K848K73j105
9960b284r433l175O693L611J537L738m634K694N569K526j632m425K7M62K706r01
9944C079j2532m026l282N830K863L040j986k657j98J014Q68m632K921Q593p08
9929a813l400m093m265P876N501k976L048k516p82K315L319M841J592j711J168
9914H104n210J77k944p379N299m78m991N383j971q02K858O99j918K345o09n37
$$ plain form
10020 3155 59 3715 9630 8068 3655 855 -6535 -8849 -14320 -11658 -9746 -2460 4743 1515 -2104
10005 -2104 -6225 2010 4687 10649 9106 9856 6076 929 1752 795 5949 8015 792 -2385 -280
9990 -280 2623 -568 -2361 5246 897 1361 5730 3955 -1160 -5397 -1970 -782 3951 6453 3947
9975 3947 493 -7114 -3209 -1043 5495 7527 2730 1397 8576 4446 -72 -4300 -1452 -1179 -2284
9960 -2284 -11717 -14892 -8199 -4588 -3051 687 -3947 -1253 4316 6842 5210 785 812 1274 3980 3079
9944 3079 -9453 -13479 -16761 -10931 -8068 -5028 -7014 -9671 -9869 -8855 -7987 -12619 -9698 -1105 -1813
9929 -1813 -5213 -9306 -13571 -5695 -194 -3170 -122 -2638 -3420 -1105 2214 7055 8647 6936 8104
9914 8104 2894 3071 127 -7252 -1953 -2431 -7422 -2039 -4010 -4812 -1954 -1255 -3173 -828 -1437 -1974
9898a974N026k33m273k093p675l804k044N990Q286N39n55k130j599K304J395o27
9882c467L778M281K586q880n56M76o020J219K999n28q535n464K119J01l048L358
9866a5581O419M486K983J871p9O428N252k784q33k798q946l723p3l963l510K182
9850a2669M086L433L443k405N040M435l36L075l142l096L736m3k073n68k911K224
9834B229o15m31l559M89M874k602l450J157M560J546k430L4r924k987L316O537
9818a256R56n584L477O784j334J665K638k34J489o53m422Q015O459l063m676j884
9802H377L839k260K676k026m196m8J254K993m885j554l482o709Q75L377Q898K618
9786I747q225m203P859J219j0280q302k847L191M163N117k60j031N875M664L094
$$ plain form
9898 -1974 3052 2819 -1454 -3547 -11222 -15026 -17070 -11080 -2794 -2255 -2810 -4940 -6539 -4235 -2840 -3467
9882 -3467 311 4592 7178 -1702 -2258 -1782 -7802 -6583 -3584 -4112 -12647 -18111 -15992 -15891 -18939 -15581
9866 -15581 -9162 -4676 -1693 178 99 6527 11779 8995 8162 5364 -3582 -7305 -7378 -11341 -14851 -12669
9850 -12669 -8583 -5150 -1707 -4112 928 5363 5027 8102 4960 1864 5600 5557 3484 2916 5 2229
9834 2229 1614 1183 -2376 -1887 2987 385 -3065 -1908 2652 4198 1768 1802 -8122 -11109 -7793 -1256
9818 -1256 -300 -5884 -2407 4377 3043 4708 7346 7112 8601 7948 3526 11541 18000 14937 10261 8377
9802 8377 12216 9956 12632 10606 6410 6362 7616 10609 5724 4170 688 -6021 -5146 -1769 7129 9747
9786 9747 1522 -2681 5178 6397 -3883 -12185 -15032 -11841 -7678 -2561 -2821 -3852 2023 6687 9781
9771I781l576q509J038K765O445J96l274l743p26k054L160J750J328M718m898
9756D401j1202P02J240n23j547N548j334k175O174L125L559P192l972r694n149
9741c655J444P27j733n671o958n550R907N157k323K804R75m290j413m561J65J872
9725a3103O615N630Q595O147k318k246q395l601K60K262K695k20o267J213m548
9710g281m666M596R468L45K450L685Q86l701o275n48n231p076P982N626m282m53
9694d475n59P63N083k161l023M042L391q519k72q93k735M496L373K999L315K431
9678G256q872l888N717j812p190O11N970k619N021J56j056L712J846K679l455
9663D076j147N171J624l446m046j98J166L201o460k194K434L671k258l63M475
$$ plain form
9771 9781 6205 -2304 -1266 1499 7944 8140 4866 1123 397 -1657 1503 3253 4581 9299 4401
9756 4401 -6801 -6099 -4859 -5382 -6929 -1381 -2715 -4890 1284 4409 7968 15160 11188 1494 -3655
9741 -3655 -2211 -1484 -3217 -8888 -15846 -21396 -11489 -6332 -8655 -5851 -4876 -9166 -10579 -15140 -14975 -13103
9725 -13103 -6488 -858 7737 13884 11566 9320 925 -2676 -2416 -154 2541 2321 -3946 -2733 -7281
9710 -7281 -11947 -7351 2117 2462 4912 8597 9483 5782 -493 -1041 -6272 -13348 -5366 260 -4022 -4475
9694 -4475 -5034 -4271 812 -1349 -4372 -330 3061 -5458 -5730 -6623 -9358 -4862 -1489 1510 4825 7256
9678 7256 -1616 -5504 213 -1599 -8789 -8178 -2208 -4827 194 350 -706 3006 4852 7531 4076
9663 4076 2929 8100 9724 6278 2232 2034 3200 6401 -59 -2253 181 3852 1594 1231 5706
9648E706o127k715p74k344N401N926k331L483J1257n074p014p487J869m674M181
9633g17L260N062l61m400n235K423P132K959m873m790l179M07K323K542K561o60
9617D454N738Q910m395j2765K767M287M651Q230m070M673R221M089l915M01M436
9602C6712q54m72K343k808m112L254j500k214m17N295L13p634J361J0858J2353
9587E2478P964P629J8736K2171K6620M1267M1972L8066K4831J1935m1j3631m0000
9574B39997n0545l3739k8799k5023j3992j3549m127J010n977j0426m690p509j3217
9561B9414P474L523o530k667K56k149n807J559L79p129m130J868R569J1558Q704
9546D5892J0254L677n972j472m376J912o40k47M662J1341Q646J6583K5950L8527
$$ plain form
9648 5706 -421 -3136 -3910 -6254 -853 5073 2742 6225 17482 12408 5394 -2093 -224 -4898 -717
9633 -717 2543 7605 7244 2844 -2391 32 7164 10123 5250 460 -2719 -2312 11 2553 5114 4454
9617 4454 10192 19102 14707 1942 4709 8996 13647 21877 17807 22480 31701 35790 31875 32276 36712
9602 36712 35858 35386 37729 34921 30809 34063 32563 30349 29932 35227 35540 27906 29267 40125 52478
9587 52478 60442 68071 86807 108978 135598 176865 218837 256903 281734 293669 293628 279997 239997
9574 239997 189452 155713 126914 101891 87899 74350 70223 71233 65256 54830 50140 42631 29414
9561 29414 36888 40411 33881 31214 31470 29321 23514 25073 25452 18323 14193 16061 25630 37188 45892
9546 45892 56146 59823 53851 52379 48003 49915 49275 49028 53690 65031 73677 90260 116210 154737
9532A54737M1292M2158L5330J9019L747j3132l4003m8702m4767k8764k1873j2301
9520I2741j608M73l273m803n578P8l471p24q418r614m948m643J095J527j28m479
9504D4227p110n823n82l048P3n873r65j568J432L375o82l752j655N128Q268L192
9488C4637J983J137p850l961j105J223J425m14L558M394K867N640R617L898R755
9473F6804O869N691N582Q097K1344K5865L1867M5049P5088R2393J02180J38108
9461F24937K17492L42144N37020O50390L87030O9231J51183J63530l52160p90562
9451B000235n75982l09693j78637j35610j09685q8025p5069n4223m9000m8494
9441C75817m9618m5009l9249l4899k3906j7885j4478j1101j1646j6343j7462j2434
$$ plain form
9532 154737 196029 238187 273517 292536 296283 283151 249148 200446 155679 126915 105042 92741
9520 92741 91133 91606 88333 83530 77952 78030 74559 73835 65417 55803 50855 46212 47307 48834 48706 44227
9504 44227 37117 31294 30712 27664 27737 21864 20899 19331 20763 24138 23456 19704 18049 23177 31445 34637
9488 34637 36620 37757 29907 25946 24841 26064 27489 27075 30633 35027 37894 43534 53151 57049 66804
9473 66804 73673 79364 84946 93043 114387 140252 172119 217168 292256 384649 486829 624937
9461 624937 842429 1184573 1721593 2371983 2759013 2828244 2979427 3142957 2790797 2000235
9451 2000235 1424253 1114560 935923 800313 690628 602603 527534 473311 424311 375817
9441 375817 326199 281190 241941 207042 183136 165251 150773 139672 128026 111683 94221 81787
9429H1787j3562r700M417K614o462o652o157k060j008l969m343q086l125k21p427
9414A6046L257m5k60L865N69l209k339K958n160o775L091L227k164J604M69K090
9398A7224L090l010j973l887m236o37m011k396n9n558K139K158K968P724L889
9383A3425j976k856j816m045L431J632j299l175J17mj593k62m58k198j973j356
9367d406m002J532M355l334P01N604P432l95m907J331k57n119j303l258J158l62
9351e230p85J230O483M498Q100o8p531l870M617m126j474L223J326L611n292n878
9335a166l093O710J984j745J164J401j0680n36L513K139K675N197J672N16m851
9320D900m93k771M48M142%k468j843L79N660o14k416n85m803r02L458J389J117
$$ plain form
9429 81787 68225 58525 62942 65556 59094 52442 46285 44225 43217 39248 34905 26819 23694 23473 16046
9414 16046 19303 19258 18998 22863 23432 20223 17884 20842 15682 8907 11998 15225 13061 14665 15134 17224
9398 17224 20314 17304 15331 11444 7208 6571 2560 164 105 -5453 -3314 -1156 1812 9536 13425
9383 13425 11449 8593 6777 2732 6163 7795 6496 3321 3438 3434 1841 1579 1121 -1077 -3050 -4406
9367 -4406 -8408 -6876 -2521 -5855 -5154 450 7882 7487 2580 3911 3654 -1465 -2768 -6026 -4868 -5230
9351 -5230 -6015 -4785 1698 6196 14296 14228 6697 2827 7444 3318 1844 5067 6393 10004 4712 -1166
9335 -1166 -4259 2451 4435 2690 3854 5255 -5425 -5961 -2448 -309 2366 7563 9235 9751 4900
9320 4900 4407 1636 2084 6226 6226 3758 1915 2294 7954 7340 4924 4339 -464 -1366 2092 3481 4598
9303D598p14M335O861k10n991m186j733P633N791l155l995O45k484J504K500j2568
9287a169l366N259Q065j477q393l865p079N289M328k276J892j950J467l784j374
9272h433p84l928K89j345N937L590K492K969J587J797j24Q637k265q911p076k220
9256g788K194J025L501q4P3Q594L263L831j68m610j985L751Q509k970q046l358
9240E732R06p78l895l941m727J379K979M483J148n57N298N014l604m375l662o49
9224G51J933p76k107L010J178k124k701n929K798K434m367k039O68N912l906J113
9208d152N094J225L715j523j0111j974J558K636L226j649K790N159n724r6L126
9193C300M396l667k582q30L73n889Q668M315l302M773L770q350m794N564j87j295
$$ plain form
9303 4598 3884 8219 15080 14870 8879 4693 2960 10593 16384 13229 9234 9879 7395 8899 11399 -1169
9287 -1169 -4535 724 8789 7312 -1081 -4946 -12025 -6736 -2408 -4684 -2792 -4742 -3275 -7059 -8433
9272 -8433 -9217 -13145 -12856 -14201 -8264 -4674 -2182 787 2374 4171 4047 12684 10419 1508 -5568 -7788
9256 -7788 -5594 -4569 -1068 -1152 -1079 7515 10778 14609 14441 9831 7846 11597 20106 17136 9090 5732
9240 5732 6638 5860 1965 -1976 -6703 -5324 -2345 2138 3286 2729 8027 13041 9437 5062 1400 751
9224 751 2684 1908 -199 2811 3989 1865 -836 -6765 -3967 -1533 -5900 -7939 -7271 -1359 -5265 -4152
9208 -4152 942 2167 5882 4359 -5752 -7726 -6168 -3532 -306 -1955 835 5994 270 174 3300
9193 3300 7696 4029 1447 617 990 -4899 3769 8084 4782 9555 13325 4975 181 5745 5558 4263
9177D263M690J03o089L910k91L514M075r080k963l07m657k135J296L411J311n18
9161E33p039l364k640j822O315Q349L769K913j967m773m022P401k330l53n429
9146d459O19K807K400n130m899o64K379o155K180J182m049k56k93J695k84l10
9130a3237M771M436j130j940j83Q940N987J048L167M331N68L164p584k813k45
9115I280O54o338q018K82N016K308J183J355n231J164J539m596k114k008L939
9100a585m111L105K988L136o387k669M149p13M018N134j372l516o613J604N508
9085B676J792k250N42j120n942j734J08J407L024K74K004j082M878l603k075N854
9069D753O334N05M5K370m27l709J980J47l324j0213K898N625Q212p109p186K376
$$ plain form
9177 4263 8953 9056 2967 6877 6586 10100 14175 5095 2132 1825 -2832 -4967 -3671 -260 1051 533
9161 533 -6506 -9870 -12510 -14332 -8017 332 4101 7014 5047 274 -3748 3653 1323 970 -4459
9146 -4459 -3840 -1033 1367 -3763 -8662 -9326 -6947 -13102 -10922 -9740 -13789 -14045 -14338 -12643 -12927 -13237
9130 -13237 -8466 -4030 -5160 -7100 -7283 1657 7644 8692 11859 16190 16758 19922 12338 9525 9280
9115 9280 9934 3596 -4422 -4140 876 3184 4367 5722 491 1655 3194 -1402 -3516 -5524 -1585
9100 -1585 -5696 -2591 397 3533 -2854 -5523 -1374 -2087 1931 7065 5693 2177 -4436 -2832 2676
9085 2676 4468 2218 2760 1640 -4302 -6036 -5928 -4521 -1497 -1223 781 -301 4577 974 -1101 4753
9069 4753 11087 11592 11637 14007 13580 9871 11851 11998 8674 -1539 1359 6984 15196 8087 901 3277
9053C277K266L035M533K028n089k122o84l577k291K025j698M889l582l961k092
9038c043P87Q54n171l105J848J4127R781m860M40j768m652p271P148L364M240
9023A2719M134P296Q067L976k287k853l742n513j1289p150p18J03L784J0938K291
9008A9756j2645q63L733k330l878O60L831n274o424l809J1854M635m012l272k763
8993h01M98K857L601M223l955j0496j826Q374N389J580O686j153n843P871P494
8978B4499N453K693Q8p001o108J134K543n167o988r648j790M946L66m200p115
8963f295J0009J0963k280o134l809q42M077m503J894L858j916O544N412j230p718
8948H030p420l363K883M238Q589K856n157J24O479M251k731k149p665n465P263
$$ plain form
9053 3277 5543 8578 13111 15139 10050 7928 7244 3667 1376 3401 1703 6592 3010 -951 -3043
9038 -3043 -2256 -1402 -6573 -9678 -7830 6297 16078 11218 11658 9890 5238 -2033 5115 8479 12719
9023 12719 16853 24149 32216 36192 33905 31052 27310 21797 10508 3358 2640 2743 6527 17465 19756
9008 19756 7111 6248 9981 7651 3773 4433 8264 2990 -3434 -7243 4611 9246 5234 1962 -801
8993 -801 -303 2554 6155 10378 6423 -4073 -5899 2475 7864 9444 16130 14977 9134 17005 24499
8978 24499 29952 32645 32733 25732 19624 20758 23301 18134 11146 1498 -292 4654 5020 820 -6295
8963 -6295 3714 14677 12397 6263 2454 1612 5689 1186 3080 6938 5022 11566 16978 15748 8030
8948 8030 610 -2753 130 4368 12957 15813 10656 10780 17259 21510 18779 16630 8965 3500 10763
8933A0763J2090m51o419J018k624l4l174m197l887M806K266N313J1595R068L324
8918C9457M227L093k237n104k66J630m72l683m737j743M955O504L455k380L668
8903D6367j05o086q392j2416J205P579M566m320n474j801m034o864j274J468p49
8888I670J047k88M503J770K917j772m534o282K873P540J1209J3922J4926J6268
8874G3769J3028P194k485k482j0051k2428j1958k309k781L411O622J0076J5083
8861G4689J2470P332P425p82q517j6952k0844j1259q059l891m533N12L828o50
8847C0769o644m354n131l307n04L251L086j748k999m99n968K600P381l275l495
8832I163k606O772R939Q406J0680o813o279k617m35m594K39n0k329P194N777Q807
$$ plain form
8933 10763 22853 22402 15983 17001 14377 14343 11169 6972 3085 7891 10157 15470 27065 36133 39457
8918 39457 43684 46777 44540 39436 39170 40800 40328 36645 31908 30165 35120 41624 45079 42699 46367
8903 46367 46262 40176 31784 19368 20573 28152 32718 28398 22924 21123 17089 10225 8951 10419 9670
8888 9670 10717 10429 14932 16702 19619 17847 13313 7031 9904 17444 28653 42575 57501 73769
8874 73769 86797 93991 91506 89024 78973 56545 44587 42278 39497 42908 49530 59606 74689
8861 74689 87159 94491 101916 101134 92617 75665 54821 43562 35503 31612 27079 27591 31419 30769
8847 30769 24125 19771 14640 11333 10829 14080 17166 15418 12419 11920 5952 8552 15933 12658 9163
8832 9163 6557 13329 23268 31674 42354 35541 29262 26645 26210 21616 21855 21805 19476 26670 32447 41254
8816D1254J2691J223L216O586r920j0761l795p561o860k83l057q582m431L329
8802A3049o43j103K014j902m926L920L232K206j613k276j798j354J38O825N206
8787B0975J214p004m936J31K330P064q91j434l153o66K697N462o752l118N764
8772A7683J602m758J80Q000K342n052l064j129l08k194K77M359l32J213k017N63
8756A7365Q577J471m469r819J440M719m547m08J361R68J641M020Q91j394J3K402
8740B4231m175n70k510L474L414m535n139O89N575L251j313J70J6809K083p828
8725C3626p887q572p74l84K801L527P368L860J174k61Q771Q97L262K420l486j997
8709D4345j217J715o166j042L442M610J0288J754l14o874n041J491o91J395Q63
$$ plain form
8816 41254 53945 55168 58384 64970 55050 44289 40494 32933 26073 25790 22733 14151 9720 13049
8802 13049 12406 11303 13317 11415 6489 10409 13641 15847 14234 11958 10160 8806 8944 15769 20975
8787 20975 22189 15185 10249 10380 12710 19774 18883 17449 14296 13630 16327 21789 15037 11919 17683
8772 17683 19285 14527 14707 22707 25049 19997 16933 15804 15496 13302 13579 17938 17606 18819 16802 17365
8756 17365 25942 27413 22944 13125 14565 19284 14737 14329 15690 16658 18299 22319 23210 21816 21829 24231
8740 24231 20056 19486 16976 20450 23864 19329 14190 14879 20454 23705 22392 22562 39371 41454 33626
8725 33626 25739 17167 16393 16009 18810 22337 29705 33565 34739 34478 43249 44146 47408 49828 46342 44345
8709 44345 43128 44843 38677 37635 41077 45687 55975 57729 57415 50541 45500 46991 46300 47695 48558
8694D8558N087P094k303k073M031M444Q429J196P126J5439J0212M076R099J6112
8680A36527J4317K0567K4388L0869M5197O7227P6535R1970J22657J81600K76669
8669A088523M06661N42221M94454K38183J01379J34014m3299m72692o26219m45721
8659A417504k56438j67575j34349j02706q0338o9028o0065m2781l3621m4240l9805
8648C86558k7590j2756j3197l408N321L29j401L621J0663k826n519O060J8856
8635C64711L1022M9535N2689O4228Q9824J12617J17103J52358K05204L03362M65793
8624B008446P28188J045183J075072N63767J85451K76387P9887q15876j290278
8615C856227r65187n70679l55690k74825k25036j71616j38293j06006r2232r2172
$$ plain form
8694 48558 53645 60739 58436 56363 60394 64838 73267 74463 81589 97028 107240 111316 120415 136527
8680 136527 150844 171411 195799 226668 271865 339092 415627 507597 630254 811854 1088523
8669 1088523 1495184 2037405 2531859 2770042 2871421 3005435 2962136 2489444 1863225 1417504
8659 1417504 1161066 993491 859142 756436 676098 607070 547005 504224 470603 426363 386558
8648 386558 358968 346212 333015 329607 334928 335257 333856 337477 348140 345314 339795 345855 364711
8635 364711 395733 445268 497957 562185 652009 764626 881729 1034087 1239291 1542653 2008446
8624 2008446 2736634 3781817 4856889 5420656 5606107 5882494 5962381 5146505 3856227
8615 3856227 2891040 2320361 1964671 1689846 1464810 1293194 1154901 1048895 956663 864491
8605H64491q1673p0828n7768m0675k3303j5062J740p193j8362j5764j1010j9095
8593E05498l4981k3495R33K2736L2186L6493K7045M7270P2804P0228P2748J12621
8581I42086J76397K46258L39939M84313N38214L18201N6109O7555M3226k99333
8571B912965o27880n52744l47968k08317j47785j12783r5639p2683n6061m4235
8561F46870l9580l3356k3046j2107n761J282P446J0326K1800J6603O170K028P70
8548E99445j8512j2216k366N331K913k83J0731J3274J7341K4134L5401O8843R5099
8535H39135P5102L1868L6196J9505o4047j26469j07890q8923q1484o0300m0807
8524D31886l6214k9294k2118j2439j0405l187k877q135O672J8340J5134J5015
$$ plain form
8605 864491 782818 711990 654222 613547 590244 575182 576922 569729 551367 535603 524593 505498
8593 505498 470517 447022 447955 470691 502877 539370 566415 613685 686489 756717 829465 942086
8581 942086 1118483 1364741 1704680 2188993 2727207 3045408 3101517 3169072 3212298 2912965
8571 2912965 2285085 1732341 1384373 1176056 1028271 915488 819849 747166 691105 646870
8561 646870 607290 573934 550888 538781 533020 534302 541748 552074 573874 590477 596647 598675 599445
8548 599445 580933 568717 566351 571682 574595 574312 585043 598317 615658 639792 675193 744036 839135
8535 839135 914237 946105 982301 1001806 937759 811290 703400 614477 532993 472693 431886
8524 431886 395672 366378 344260 331821 321416 318229 315352 307217 313889 332229 347363 362378
8512C62378K2703K7265L5075K9064L1404K9141K5134K1119K9157K3549J2803j256
8500F47536m608j6236k7978k4874k4315k4755j8273M241J8244L1502K5089N646
8488E91219R73Q15l3843o7007o6411n2763m1916l5246k7495k1957k0507j5124
8476B10738j3280j023o026j838N352n192P673K883o805n596Q124J9661J4735J5341
8462B44747J2583J0734J6948K2262J1767N87n169q439j9064k0976j5576j3589
8450B36815k1042j6798j6213j7723p043j5003j3661j0960r578l167m515j0162
8438I0950l638l647m937m499k594j2785o976l025j625p83M601O382n311q285j075
8423D2753k080M654k488j1426j125N122j476P183R00r39j743p852m915J345K582
$$ plain form
8512 362378 385081 412346 447421 476485 507889 537030 562164 583283 612440 635989 648792 647536
8500 647536 642928 626692 598714 573840 549525 524770 506497 510738 528982 560484 585573 591219
8488 591219 592192 593007 559164 492157 425746 372983 331067 295821 268326 246369 225862 210738
8476 210738 197458 196435 190409 188571 193923 188731 196404 199287 192482 186886 195010 214671 229406 244747
8462 244747 257330 268064 285012 307274 319041 319628 314459 306020 286956 265980 250404 236815
8450 236815 215773 198975 182762 165039 157996 142993 129332 118372 108794 105627 101112 90950
8438 90950 87312 83665 78728 74229 71635 58850 51874 48849 47224 46441 51042 57424 52113 43828 42753
8423 42753 40673 45327 42839 31413 30288 35410 33934 41117 42017 41078 39335 31483 26568 27913 30495
8408C0495N821j191o059j159N511Q020R364R711r13P00J2057J1396J5913K0242
8394A19908J8919K7886M9257O2698O9190P8496O5149L8601K0424L467k7991o7376
8382D58628q1340o5527m7735l9813k8165k6164k4394j2630j6270j1538n891k580
8370I6581k496k087j0075o697o288m556o337L627P902J173J425P247O295K309
8356H8023Q751P729K554Q29J4592K9761K5884M3796N2768O0842P7669J25744J56861
8343F95803J61193J17001O8688L9189r860q8834j50780j61691j35207r8917o3483
8332C73102n0674m1030k5179k2742k2478k3165j6293j7500j7767j9099q410r709
8320I9056q156j623j993l341q696O5J126o480k545l318j612P4J084L088O205O417
$$ plain form
8408 30495 36316 35125 29066 27907 33418 41438 50802 60513 59600 60300 72357 83753 99666 119908
8394 119908 138827 166713 215970 278668 347858 426354 491503 530104 550528 553995 526004 458628
8382 458628 377288 311761 264026 224213 196048 169884 145490 132860 116590 105052 99161 96581
8370 96581 94085 91998 81923 75226 68938 64382 58045 61672 69574 70747 72172 79419 85714 88023
8356 88023 96774 104503 107057 107886 122478 152239 178123 221919 274687 335529 413198 538942 695803
8343 695803 856996 973997 1042685 1081874 1072014 983180 832400 670709 535502 436585 373102
8332 373102 322428 281398 256219 233477 210999 187834 171541 154041 136274 117175 108765 99056
8320 99056 90900 89277 87284 83943 75247 75312 76438 69958 67413 64095 62483 62557 63641 66729 72934 79351
8304G9351J7377K5195K4680K2961M0876N8498O7823P6182N6511K9910K1282L90
8292E21036m7897p7880p8774o0563m4680l3239k5383k1200k2753j0835j2401q655
8280G6776k315k624p824j3880p025q476m669k28K164O813k222m949q250o419l340
8265A3532j236O322N65k353M051R63o572k018K33j093j237q572k186j526K855
8250A728M892K661k3o646n6K781m415n968M195L211M854j520n225l672o393j387
8234a0983L920K957O440J294j433M27k401k340M595N59j485L557L955M733k479
8219A1316o49P386J041L568N989N109L367L057l046j1152j1755L319K368l524
8205A6394j1246J214K460o12j987m975L37m353p08M689J271l646p244m902K733
$$ plain form
8304 79351 96728 121923 146603 169564 210440 268938 336761 412943 469454 499364 520646 521036
8292 521036 473139 395259 316485 255922 211242 178003 152620 131420 108667 97832 85431 76776
8280 76776 74461 71837 64013 50133 43108 34632 29963 29735 31899 38712 36490 31541 23291 16872 13532
8265 13532 12296 18618 19183 16830 20881 21844 15272 13254 13487 12394 11157 2585 399 -1127 1728
8250 1728 6620 9281 9258 2612 2556 5337 922 -5046 -851 2360 7214 5694 469 -3203 -9596 -10983
8234 -10983 -7063 -4106 2334 3628 2195 2622 221 -2119 2476 3035 1550 5107 9062 13795 11316
8219 11316 10667 18053 19094 22662 28651 33760 37127 40184 37138 25986 14231 17550 19918 16394
8205 16394 5148 6362 8822 8210 6223 1248 1585 -2768 -3476 1213 2484 -1162 -8406 -13308 -10575
8190a0575P168O176Q386m863l733K143O55Q62J502k235p023j411K93M762q25J562
8174B844J049O152R559N428O71j0946k124M315j253L28q308n376J189j466k143
8159h1k981n023M099J614L590P722m465l486j916j285n0j155L420J756O53o4m315
8142a967n804J391J361J542j021L664M467L096q908q845j66R098N083J281o975
8127b703n027L546L674j313j424m440M184M806m692J930L967m543O32n53o059
8112h015n876J044Q059L557Q5r05j559J972J235K276J774q9k927o633N626k983
8096c359n306L506l770l35Q873J530p943q125K508P675K66l26r06Q6P076K925
8080D375m73m375j605m241J821J636r87J547k755n195J426N515J746O195p11j993
$$ plain form
8190 -10575 -3407 2769 11155 6292 2559 4702 5357 6219 7721 5486 -1537 -2948 -2655 2107 1282 2844
8174 2844 3893 10045 19604 25032 25703 14757 12633 16948 15695 16023 7715 2339 3528 2062 -81
8159 -81 -3062 -8085 -3986 -2372 1218 8940 4475 989 -927 -2212 -2262 -3417 3 1759 2412 2348 -1967
8142 -1967 -7771 -6380 -5019 -3477 -4498 -834 3633 6729 -2179 -11024 -11190 -2092 2991 4272 -2703
8127 -2703 -7730 -4184 -510 -1823 -3247 -7687 -3503 1303 -3389 -1459 2508 -2035 -1403 -1956 -8015
8112 -8015 -13891 -12847 -4788 -1231 -1146 -2051 -3610 -1638 -403 1873 3647 3558 631 -6002 -376 -3359
8096 -3359 -8665 -5159 -8929 -9264 -391 1139 -6804 -14929 -12421 -4746 -4480 -4806 -5712 -5626 1450 4375
8080 4375 3902 -473 -2078 -6319 -4498 -2862 -3849 -2302 -5057 -10252 -8826 -3311 -1565 4630 3919 1926
8064A926m348o103J326O02l78P436K621M275M515n677l995l298J213P744K805
8049A0664K77o846j788o2L357k68j570L472l064L614n96j0152m070N454j113o237
8033h928J047P420N297L04m079k183K284M008N618n999o485L805R80J639M078
8018H806L457R11k990j4030L208K887N237P882O225j3376j92K629m920p888L5
8003b119K202Q881L673j0667n495J30L130M02L397M02M015k581j742O383q641
7988A370L53M543J918N852J058p301r25J145J397P044M840n404r862j774K610
7973F864N786M024l765p927l350n360K46L645r79K813K929P303m793k812L229
7958G853J335j385J095j359l681n22j104Q96k046m333l567K114j959J3Q994K862
$$ plain form
8064 1926 -2422 -8525 -7199 -6597 -6975 461 3082 7357 11872 6195 2200 -1098 115 7859 10664
8049 10664 10941 4095 2307 2245 5602 5334 3764 7236 4172 7786 7190 -2962 -7032 -1578 -2691 -8928
8033 -8928 -7881 -461 4836 5140 1061 -1122 1162 5170 10788 4789 -1696 2109 3089 4728 8806
8018 8806 12263 13174 10184 -3846 -638 2249 7486 15368 21593 8217 8025 10654 5734 -2154 -2119
8003 -2119 83 8964 12637 1970 -3525 -3395 -265 137 3534 3936 7951 5370 3628 10011 1370
7988 1370 1723 6266 8184 14036 15094 7793 6868 8013 9410 16454 21294 15890 6028 4254 6864
7973 6864 12650 16674 12909 4982 1632 -3728 -3482 163 -816 1997 4926 12229 7436 4624 7853
7958 7853 9188 7803 8898 7539 3858 3336 2232 3128 1082 -3251 -6818 -4704 -6663 -6650 2344 5206
7942E206l778l15P83K111P829M503K990l101j003p493k084l540j201k850n29P644
7926E172N473l204j414l855J071n065k049l993O31k763M624O419j393l163L332
7911a77O759K871k717K284K416N7o014K92J255P386K745m774K227m62m901m336
7895D911P16r64j085M854P91K593J263k733n902n615O803L239J783l886Q93M371
7879A2032M719j101m971o744M72L037L962J539J85J442l616k198J160m240o742
7864a064l135Q96L92K674n5j055o68L957L803l130p10q6k338m512K621Q90m53
7847a973n04l82J106k849L682L464M596N443J692m785n851l171m008N433K965
7832D858j427k032J14L239j090L821K697l494p312n092P06p47O60J745J099k270
$$ plain form
7942 5206 1428 1113 1896 4007 11836 16339 19329 16228 15225 7732 5648 2108 907 -1943 -2472 5172
7926 5172 10645 7441 6027 2172 3243 -1822 -3871 -7864 -7233 -9996 -5372 1047 -346 -3509 -177
7911 -177 6582 9453 6736 9020 11436 11493 5479 5771 7026 14412 17157 12383 14610 14148 9247 4911
7895 4911 5627 4663 3578 8432 9223 11816 13079 10346 4444 -1171 5632 8871 10654 6768 7661 12032
7879 12032 16751 15650 10679 3935 4407 7444 11406 12945 13130 14572 10956 8758 9918 5678 -1064
7864 -1064 -4199 -3303 -2911 -237 -292 -1347 -2015 1942 5745 2615 1905 1819 -519 -5031 -2410 -1520 -1973
7847 -1973 -2477 -2859 -1753 -4602 -920 2544 7140 12583 14275 9490 3639 468 -3540 1893 4858
7832 4858 3431 1399 1513 4752 3662 7483 10180 6686 -626 -5718 -5012 -5759 -5099 -3354 -2255 -4525
7816d525l881j495P674Q454n46j423j040k006M962m281K457J2045Q08p482r088
7801F33l487M62K615K480L188J136J780P410l006q488j13N591j244m798l964k034
7785a839j612N636J278PK753r24k255K777j566L140m79j0972n357l849j837P975
7769g124j673j76L886j78l280R5M859J285K722N026M018l786l473l945m406k734
7753h884L430k023k227N825n19J024P37k007L38L713L875L820p86n220l994J073
7737a825L419p926N09L673O216k803l506j339O066R6j515J900m882o475L768j359
7721e983M52O33K285j37L933L762m247k533M00m174j518k90p865L604N224M233
7705b221Q0n640j623m17J904P630M67L330j104q519n591K335J014k940j78K730
$$ plain form
7816 -4525 -8406 -9901 -2227 6227 5681 4258 3218 1212 6174 1893 4350 16395 17203 9721 633
7801 633 -2854 -2392 223 2703 5891 7027 8807 16217 13211 4723 4610 10201 8957 4159 195 -1839
7785 -1839 -3451 2185 3463 3470 6223 5299 3044 5821 4255 7395 6916 -4056 -9413 -13262 -15099 -7124
7769 -7124 -8797 -8973 -5087 -5265 -8545 -8450 -3591 -2306 416 5442 9460 5674 2201 -1744 -6150 -8884
7753 -8884 -5454 -7477 -9704 -3879 -4398 -3374 -2637 -4644 -4306 -593 3282 7102 6316 1096 -2898 -1825
7737 -1825 1594 -6332 -5823 -2150 4066 1263 -2243 -3582 2484 2580 1065 2965 -1917 -8392 -4624 -5983
7721 -5983 -5531 -4898 -2613 -2750 1183 4945 698 -1835 -1435 -5609 -7127 -7417 -15282 -11678 -6454 -2221
7705 -2221 -2141 -7781 -9404 -9821 -7917 -287 180 3510 2406 -6113 -11704 -9369 -8355 -11295 -11473 -8743
7689h743R095K11k432j073R3o146J588M038K2M038m359l906l386l157m07l36q054
7672b2914J583N519J420K347N949j226L924J511r34k101j834L874p48J501N13
7657a616J985M952O055J706j0951m009N52J201j60L00N26k590K521P6N662j912
7641D298o635M223M913n055k178j759l841j514m836m30k957M748J2204P418p450
7626A149o995m864N5k191O826k275r089J782L630k893R69J494K172Q194O007j476
7610B495k959k803k059l680L145P210J0642j665k596k474K378k479n079m70J220
7595H26M094L939J22j718J30n458K615N015k059j231q328J139P274r949q711K323
7579i977P924L132K137K918N374p2j1176j3050k64O906M264j372n452k76q69j48
$$ plain form
7689 -8743 352 563 -1869 -2942 -2849 -8995 -7407 -3369 -3347 691 -3668 -7574 -10960 -14117 -14524 -14860 -22914
7672 -22914 -21331 -15812 -14392 -12045 -6096 -7322 -3398 -1887 -2821 -4922 -6756 -2882 -3630 -2129 -1616
7657 -1616 369 5321 11376 13082 2131 -1878 -1326 -125 -285 15 541 -2049 472 548 6210 4298
7641 4298 -2337 1886 6799 1744 -434 -2193 -6034 -7548 -12384 -12814 -15771 -11023 1181 8599 1149
7626 1149 -5846 -10710 -10655 -12846 -6020 -8295 -17384 -15602 -11972 -14865 -13896 -12402 -10230 -2036 3971 2495
7610 2495 -464 -3267 -5326 -9006 -5861 1349 11991 10326 7730 5256 7634 5155 76 -394 826
7595 826 4920 8859 8981 7263 7393 1935 4550 9565 7506 6275 -2053 -914 6360 -3589 -12300 -9977
7579 -9977 -2053 1079 3216 6134 11508 11436 260 -12790 -13054 -6148 -1884 -3256 -8708 -8984 -9853 -10001
7563a0001L338L200O185l759n014k275L259l406j426M325L493O62p452n1R07J335
7547f680J023k314J686R663J311o008j477K624M798M850m751o850M554P910p657
7532B682l102Q105k26j205K893m802l522o115m470O145P683K286m131m722l36
7517b837P141k432m859O96k573M37L478j039l1M817p70n353K077L542N79L033
7501E906j145L669n08j640l283n950P73L482l594m665J899J975q81l4K403M315
7485B722k852k333N562k073j0467n896O748P259K722j131J529K963L323k376j412
7470D288o241J548L913J259r184o070l194r97N743j064j277O730R253r79j0640
7455f912q323K11J0802Q380M351m655K645p326K988O690J05k088k064J437j297
$$ plain form
7563 -10001 -6663 -3463 2722 -1037 -6051 -8326 -5067 -8473 -9899 -5574 -2081 -1419 -8871 -8922 -8015 -6680
7547 -6680 -5657 -7971 -6285 3378 4689 -1319 -2796 -172 4626 9476 4725 -2125 2429 10339 2682
7532 2682 -420 7685 7459 6254 9147 4345 823 -5292 -9762 -3617 4066 6352 2221 -2501 -2837
7517 -2837 4304 1872 -2987 -2291 -4864 -4427 -949 -1988 -2019 2798 2028 -3325 -1248 2294 2873 5906
7501 5906 4761 8430 7922 6282 2999 -2951 -2178 1304 -2290 -6955 -5056 -3081 -3962 -3996 -1593 2722
7485 2722 -130 -2463 3099 1026 -9441 -15337 -8589 -1330 1392 261 1790 4753 8076 5700 4288
7470 4288 -1953 -405 3508 4767 -4417 -10487 -13681 -14678 -8935 -9999 -11276 -4546 4707 3728 -6912
7455 -6912 -15235 -15024 -4222 4158 8509 3854 6499 -827 2161 8851 8956 6868 4804 6241 4944
7440D944k096K368Q35n100L104j261p243J990K799L548l410O44k24j392p221k800
7424a0515m8o1J346L58R630J783o211j0640m062O103P726K742K488K707l280N82
7408F48k207K03l663K574N236n195Q78l770l903O440M502jl756j990k255N30r06
7391f635k278K574N87O84N918L426o137l177J77L90j2m227j058N74L006J142m610
7374i656l838M264O564j642J772j265K284K323k547o978P402l169m497P265j032
7359b750L041j577j0182l026L676J24R92N527l084k214M349L407Q300Q954J677
7344A7214k601J456J267o557m383l129Q58J288m812o307L128O109n536j311O247
$$ plain form
7440 4944 2848 5216 6051 951 4055 2794 -4449 -2459 340 3888 478 1122 898 -494 -7715 -10515
7424 -10515 -10563 -10624 -9278 -8920 710 2493 -3718 -14358 -18420 -12317 -4591 -1849 639 3346 66 648
7408 648 -1559 -1356 -5019 -2445 2791 -2404 -1526 -5296 -9199 -2759 1743 1742 -2014 -4004 -6259 -5729 -6635
7391 -6635 -8913 -6339 -5752 -5068 850 4276 -1861 -5038 -4861 -4471 -4483 -8710 -9768 -9194 -6188 -5046 -9656
7374 -9656 -13494 -9230 -2666 -4308 -2536 -3801 -1517 806 -1741 -8719 -1317 -4486 -8983 -1718 -2750
7359 -2750 291 -1286 -11468 -14494 -10818 -10694 -9702 -4175 -7259 -9473 -5124 -1717 6583 15537 17214
7344 17214 14613 16069 17336 10779 6396 3267 4125 5413 601 -5706 -2578 3531 -2005 -3316 2931
$$ [...]
##END NTUPLES=NMR SPECTRUM
##END=
