##TITLE=Analysis number 312090
Compound Code sew 02738
Project Code adrs
Chemist Name prosynth
##JCAMPDX= 6.0         $$ Bruker NMR JCAMP-DX V2.0
##DATA TYPE= NMR SPECTRUM
##DATA CLASS= NTUPLES
##ORIGIN= Bruker BioSpin GmbH
##OWNER= NMR
$$ XWIN-NMR		Version 3.5
$$ Mon Jul 25 12:38:56 2005 GMT Daylight Time (UT+1h)  MAYBRIDGE\NMR@NMR_250MHZ
##.OBSERVE FREQUENCY= 250.131544655141
##.OBSERVE NUCLEUS= ^1H
##.ACQUISITION MODE= SIMULTANEOUS (DQD)
##.ACQUISITION SCHEME= undefined
##.AVERAGES= 16
##.DIGITISER RES= 18
##SPECTROMETER/DATA SYSTEM= dpx250
##.PULSE SEQUENCE= zg30
##.SOLVENT NAME= DMSO
##.SHIFT REFERENCE= (INTERNAL, DMSO, 0, 16.522)
##AUDIT TRAIL= $$ (NUMBER, WHEN, WHO, WHERE, WHAT)
$$ ##TITLE= Audit trail, XWIN-NMR		Version 3.5
$$ ##JCAMPDX= 5.01
$$ ##ORIGIN= Bruker BioSpin GmbH
$$ ##OWNER= NMR
$$ C:\u/data/dgb/nmr/ADRS/6480/pdata/1/auditp.txt
$$ ##AUDIT TRAIL=  $$ (NUMBER, WHEN, WHO, WHERE, WHAT)
(   1,<2005-07-25 12:38:19.60 +100>,<MAYBRIDGE\NMR>,<NMR_250MHZ>,
      <created by zg, POWCHK disabled, PULCHK disabled
       configuration hash MD5:
       62 19 C7 07 E1 42 D1 B7 37 6C 3D D0 77 39 F9 E6
       data hash MD5: 64K
       6B CB 25 5D 15 B9 A8 52 77 32 C6 EA 05 27 74 50>)
(   2,<2005-07-25 12:38:35.14 +100>,<MAYBRIDGE\NMR>,<NMR_250MHZ>,
      <Start of raw data processing
       ef LB = 0.3 FT_mod = 6 PKNL = 1 SI = 32K 
       data hash MD5: 32K
       F5 99 FB 5F F3 BA 88 E5 B5 3E 2B 56 FB A9 BE EF>)
(   3,<2005-07-25 12:38:39.25 +100>,<MAYBRIDGE\NMR>,<NMR_250MHZ>,
      <apk 
       data hash MD5: 32K
       B9 BE 7B 3F EA 21 1C 7D F5 49 BD 49 53 E8 F6 CE>)
(   4,<2005-07-25 12:38:40.71 +100>,<MAYBRIDGE\NMR>,<NMR_250MHZ>,
      <abs ABSG = 5 
       data hash MD5: 32K
       84 8C E0 59 37 F0 A8 01 5E B5 8A 25 BC 32 61 71>)
$$ ##END=
$$ 
$$ hash MD5
$$ A0 0C 00 AF 57 A8 0D 3B 3C 08 A2 28 30 A8 E1 6D
##$RELAX= 
##$RELAX= 
##$RELAX= 
##$RELAX= 
##$RELAX= 
##$RELAX= 
##$RELAX= 
$$ Bruker specific parameters
$$ --------------------------
##$DU= <C:\u>
##$EXPNO= 6480
##$NAME= <ADRS>
##$PROCNO= 1
##$TYPE= <nmr>
##$USER= <dgb>
##$AMP= (0..31)
100 100 100 100 100 100 100 100 100 100 100 100 100 100 100 100 100 100 
100 100 100 100 100 100 100 100 100 100 100 100 100 100 
##$AQSEQ= 0
##$AQ_mod= 3
##$AUNM= <au_zg>
##$AUTOPOS= <17 >
##$BF1= 250.13
##$BF2= 250.13
##$BF3= 250.13
##$BF4= 250.13
##$BF5= 500.13
##$BF6= 500.13
##$BF7= 500.13
##$BF8= 500.13
##$BYTORDA= 1
##$CFDGTYP= 0
##$CFRGTYP= 5
##$CHEMSTR= <none>
##$CNST= (0..31)
1 1 145 1 1 1 1 1 1 1 1 1 1 1 1 1 1 1 1 1 1 1 1 1 1 1 1 1 1 1 1 1 
##$CPDPRG= <>
##$CPDPRG1= <>
##$CPDPRG2= <>
##$CPDPRG3= <>
##$CPDPRG4= <mlev>
##$CPDPRG5= <mlev>
##$CPDPRG6= <mlev>
##$CPDPRG7= <mlev>
##$CPDPRG8= <mlev>
##$CPDPRGB= <>
##$CPDPRGT= <>
##$D= (0..31)
0 1 0 0 0 0 0 0 0 0.06 0 0 0 0 0 0 0.0002 0 0 0 0 0 0 0 0 0 0 0 0 0 0 
0 
##$DATE= 1122291497
##$DBL= (0..7)
120 120 120 120 120 120 120 120 
##$DBP= (0..7)
150 150 150 150 150 150 150 150 
##$DBP07= 0
##$DBPNAM0= <>
##$DBPNAM1= <>
##$DBPNAM2= <>
$$ [...]
##$SUBNAM7= <"">
##$SUBNAM8= <"">
##$SUBNAM9= <"">
##$SW= 20.6930455092707
##$SWIBOX= (0..15)
0 0 3 0 0 0 0 0 0 0 0 0 0 0 0 0 
##$SW_h= 5175.983436853
##$TD= 65536
##$TD0= 1
##$TE= 296.16
##$TE2= 300
##$TE3= 300
##$TEG= 300
##$TL= (0..7)
0 120 120 120 120 120 120 120 
##$TP= (0..7)
150 150 150 150 150 150 150 150 
##$TP07= 0
##$TPNAME0= <>
##$TPNAME1= <>
##$TPNAME2= <>
##$TPNAME3= <>
##$TPNAME4= <>
##$TPNAME5= <>
##$TPNAME6= <>
##$TPNAME7= <>
##$TPOAL= (0..7)
0.5 0.5 0.5 0.5 0.5 0.5 0.5 0.5 
##$TPOFFS= (0..7)
0 0 0 0 0 0 0 0 
##$TUNHIN= 0
##$TUNHOUT= 0
##$TUNXOUT= 0
##$USERA1= <user>
##$USERA2= <user>
##$USERA3= <user>
##$USERA4= <user>
##$USERA5= <user>
##$V9= 5
##$VALIST= <valist>
##$VCLIST= <CCCCCCCCCCCCCCC>
##$VD= 0
##$VDLIST= <DDDDDDDDDDDDDDD>
##$VPLIST= <PPPPPPPPPPPPPPP>
##$VTLIST= <TTTTTTTTTTTTTTT>
##$WBST= 1024
##$WBSW= 4
##$XGAIN= (0..3)
0 0 0 0 
##$XL= 0
##$YL= 0
##$YMAX_a= 292372
##$YMIN_a= -391709
##$ZGOPTNS= <>
##$ZL1= 120
##$ZL2= 120
##$ZL3= 120
##$ZL4= 120
##$ABSF1= 16.522
##$ABSF2= -4.171173
##$ABSG= 5
##$ABSL= 3
##$ALPHA= 0
##$AQORDER= 0
##$ASSFAC= 0
##$ASSFACI= 0
##$ASSFACX= 0
##$ASSWID= 0
##$AUNMP= <proc_1d>
##$AZFE= 0.1
##$AZFW= 0.1
##$BCFW= 0
##$BC_mod= 0
##$BYTORDP= 0
##$COROFFS= 0
##$CY= 12.5
##$DATMOD= 1
##$DC= 0
##$DFILT= <>
##$DTYPP= 0
##$F1P= 14.0000005364418
##$F2P= -0.99999901652339
##$FCOR= 0.5
##$FTSIZE= 32768
##$FT_mod= 6
##$GAMMA= 0
##$GB= 0
##$INTBC= 1
##$INTSCL= 1
##$ISEN= 128
##$LB= 0.3
##$LEV0= 0
##$LPBIN= 0
##$MAXI= 10000
##$MC2= 0
##$MEAN= 0
##$ME_mod= 0
##$MI= 0
##$NCOEF= 0
##$NC_proc= -3
##$NLEV= 6
##$NOISF1= 0
##$NOISF2= 0
##$NSP= 0
##$NTH_PI= 0
##$NZP= 0
##$OFFSET= 16.522
##$PC= 1
##$PHC0= -92.67749
##$PHC1= 16.88009
##$PH_mod= 1
##$PKNL= yes
##$PPARMOD= 0
##$PSCAL= 4
##$PSIGN= 0
##$REVERSE= no
##$SF= 250.13
##$SI= 32768
##$SIGF1= 0
##$SIGF2= 0
##$SINO= 400
##$SIOLD= 32768
##$SREGLST= <1H.DMSO>
##$SSB= 0
##$STSI= 32768
##$STSR= 0
##$SW_p= 5175.98343685301
##$SYMM= 0
##$S_DEV= 0
##$TDeff= 65536
##$TDoff= 0
##$TI= <Analysis number 999999
Compound Code 99
Book Reference 9
Project Code 9>
##$TILT= no
##$TM1= 0
##$TM2= 0
##$TOPLEV= 0
##$USERP1= <user>
##$USERP2= <user>
##$USERP3= <user>
##$USERP4= <user>
##$USERP5= <user>
##$WDW= 1
##$XDIM= 32768
##$YMAX_p= 284517672
##$YMIN_p= -201649
$$ End of Bruker specific parameters
$$ ---------------------------------
##NTUPLES= NMR SPECTRUM
##VAR_NAME=  FREQUENCY,     SPECTRUM/REAL,   SPECTRUM/IMAG
##SYMBOL=    X,             R,               I
##VAR_TYPE=  INDEPENDENT,   DEPENDENT,       DEPENDENT
##VAR_FORM=  AFFN,          ASDF,            ASDF
##VAR_DIM=   32768,         32768,           32768
##UNITS=     HZ,            ARBITRARY UNITS, ARBITRARY UNITS
##FACTOR=    0.157963299565203, 1,           1
##FIRST=     4132.6476996994, 0,             0
##LAST=      -1043.33573715361, 0,           0
##MIN=       -1043.33573715361, -201649,     0
##MAX=       4132.6476996994, 284517672,     0
$$ Real data points
##PAGE= N=1
##DATA TABLE= (X++(R..R)), XYDATA
$$ [...]
24139 103294 128025 154303 181580 234753 307383 297069 225012 202458 226198 229117 273141 275701
24127 275701 303064 306956 296275 311363 287642 302919 287413 260513 250410 214110 176170 174358
24115 174358 167546 146346 161879 175551 229723 231910 225560 224766 186800 145311 149630 144820 219999
24102 219999 240865 215638 223542 244833 211497 212355 254681 292704 334725 332976 284609 275767
24090 275767 325423 367841 365745 354488 316353 300680 312569 304722 289502 295366 314397 308172
24078 308172 303626 297706 306506 299981 308439 305639 330301 316840 303934 314337 344935 353078 348799
24065 348799 348740 314881 277778 309910 356491 410906 460566 445119 397162 378143 362679 395540
24053 395540 404505 443855 497752 484593 489308 513810 512255 477769 461400 468530 490774 526780
24041 526780 509466 519112 454157 429871 433275 422455 430768 495923 514242 487579 504183 546796
24029 546796 520753 504701 489682 466509 514229 520338 485280 484411 465824 464907 493363 531541
24017 531541 579087 641059 665373 636620 604897 617178 636893 666602 666247 648606 645900 680803
24005 680803 685889 695625 686517 693355 694652 691107 694708 728868 739739 757069 787235 762206 832523
23992 832523 903483 960729 983730 1023516 1069412 1108095 1084182 1059556 1035192 1067464 1081099
23981 1081099 1113302 1142423 1180937 1254254 1325257 1341185 1330643 1381487 1468165 1494370 1523184
23970 1523184 1564550 1624314 1725612 1735067 1712214 1740773 1836129 1970067 2053567 2128022 2232177
23959 2232177 2317105 2397911 2501173 2575090 2609233 2732270 2872243 2983363 3165295 3353384
23949 3353384 3530878 3738304 3910519 4170951 4440473 4704981 4980236 5307569 5702392
23940 5702392 6087046 6510820 6998727 7577460 8236242 8917844 9693499 10617613 11700701
23931 11700701 12985044 14425566 16042502 17974584 20237385 22853636 25854563 29378560
23923 29378560 33310702 37647275 42344490 47123465 51431230 54834034 56836850 57072264
23915 57072264 55399226 52184325 47927988 43160360 38242267 33580436 29327049 25533914
23907 25533914 22346866 19525024 17111443 15112207 13293726 11765761 10479605 9388012
23899 9388012 8403266 7542832 6820059 6192688 5654468 5137997 4665330 4271499 3912761
23890 3912761 3613471 3352084 3151824 2902486 2662542 2412664 2223621 2142169 2121205 1990142
23880 1990142 1853290 1750598 1623760 1501155 1411685 1296664 1214695 1150857 1114001 1045108
23870 1045108 963238 950412 934035 875054 810656 767958 746099 703397 650571 627926 598588
23859 598588 583598 584997 574360 525370 525550 499201 470923 442169 405707 378364 348307 339824
23847 339824 333978 347544 337030 322839 310058 314408 307975 319429 290422 271991 260644 262502
23835 262502 212791 219638 219205 186104 192453 193887 220046 207142 183458 182029 181692 209452 214680
23822 214680 203670 211743 152661 103964 155896 171246 152364 153905 151129 166694 182999 160710
23810 160710 121582 86542 105390 72363 65134 56235 58650 86490 125874 134016 127220 100863
23798 100863 162533 187865 136090 131147 136326 156046 119785 61143 16912 20389 -22689 -27087
23786 -27087 -14464 -13406 -25620 712 22245 55273 81532 28704 65208 119622 99194 2003
23774 2003 35693 72443 48938 18938 -24450 -55253 -27346 7108 -7366 -46029 -62678 -49500
23762 -49500 -6355 -35688 -28046 13708 36038 -423 -38797 -15604 -20602 9125 8860 8023 -10951
23749 -10951 -9280 12100 39669 143993 145540 90913 39204 38861 53463 89851 105213 81528
23737 81528 64606 52059 66725 38096 51751 101365 67573 59231 61852 54911 68919 71416
23725 71416 64744 91632 68664 84764 67928 106385 114571 135303 140587 97219 78374 35500
23713 35500 -29714 -28160 -23410 -21128 -68449 -92132 -94630 -107973 -89543 -86083 -59589 -38619 -53077
23700 -53077 -65158 -80861 -47156 -19198 -11781 -10917 -10216 -8279 -31396 -42962 -4020 -31865 -28674
23687 -28674 -56241 -71192 -44771 -21668 -16092 -16332 20847 15758 -4562 -32222 -30398 4470 18501
23674 18501 23714 -13144 -31523 14568 30575 20444 17929 36380 -35268 -4554 22554 7699
23662 7699 206 39837 65444 64981 38451 37396 -10147 17482 1420 918 -15904 -30942 -79348
23649 -79348 -94650 -58484 -85455 -52417 16593 9129 28834 12548 -4424 -6252 -14830 -35989
23637 -35989 -42676 -79359 -80383 -48935 -17724 2196 2573 34343 17462 35876 45705 42903 -6829
23624 -6829 -38514 -32170 -47315 -39168 -4348 -28052 -21204 -7814 7367 -20119 -28131 -37488 21153
23611 21153 15324 -5190 -14186 -39962 -25951 30453 2726 -37408 -29804 7294 20328 9016
23599 9016 -2566 26241 6523 -16468 -25786 26002 4759 2161 25082 16532 -5397 -1669 -41138
23586 -41138 -67798 -87467 -59253 -34923 33446 35543 -8579 -25553 -29418 -18390 -25249 -13232
23574 -13232 -7029 -9558 -30327 -39784 -54819 -22726 -7688 -12859 -6788 6875 21102 8723 -1258
23561 -1258 5455 23412 20437 23985 38668 -4160 -61077 -52602 -40284 -14809 46883 38617 13060
23548 13060 -21121 -11030 -21613 -45854 -21869 -7587 -18693 315 -5945 -2139 -50160 -25708
23536 -25708 -13461 -59582 -43203 -50485 -74487 -93676 -59518 -61141 -89097 -100987 -49248 -36652
23524 -36652 -12891 29043 63302 8261 -14221 -47985 -30118 6202 14178 -25471 -19576 15711
23512 15711 40854 27071 6978 -28056 13655 48409 55245 56245 39785 -6613 -63323 -40847
23500 -40847 7181 29365 40787 60094 64751 103382 105699 88059 58765 66310 76577 73021
23488 73021 7303 -42403 -25170 24726 34368 3687 4786 -24480 -46278 -30627 4865 80818
23476 80818 82462 78125 88983 49971 56271 66042 33761 -2315 33685 90782 120053 116696 85958
23463 85958 91838 117781 134044 143101 113477 100054 73707 35211 21601 31784 38641 38171 31142
23450 31142 40667 85413 64790 69829 103233 100733 75711 66435 51325 36891 61820 50499
23438 50499 24810 20547 19690 24254 54173 69968 44752 42501 67816 58308 57958 39174 39621 36193
23424 36193 54892 64284 35295 35263 56098 29481 28980 47831 33418 16299 64973 66090 55987
23411 55987 41908 47675 74641 24196 26818 6280 25726 124385 187930 152270 79266 53127
23399 53127 49023 37776 49755 68512 48642 45022 69352 73923 99431 62773 46735 49610
23387 49610 55873 39077 52930 78085 129542 102528 78418 70250 50612 55307 81908 74128
23375 74128 27066 28591 89415 88690 38823 50756 72200 47407 33094 37895 33261 82970 58820
23362 58820 25971 39104 59019 49107 67361 71351 42184 3278 -1337 -4362 3064 5828 -28328
23349 -28328 -64695 -45259 -16843 -6079 -9025 -59514 -83524 -79043 -30614 -3316 -8747 -25076
23337 -25076 32274 72106 30058 -13983 -18871 -8140 7271 15695 48218 54511 45330 22459
23325 22459 24660 44356 54975 78487 61073 37351 57255 51584 104081 88622 76414 73056
23313 73056 28835 32859 72252 68367 45016 47011 77914 80567 101016 118409 96006 28189
23301 28189 12913 81631 138941 165477 130517 79988 15230 21594 32861 31456 39361 49337
23289 49337 72896 67323 30754 -10075 -22818 -9179 17220 62756 107108 94174 82688 119673
23277 119673 99588 52140 -13030 7420 38801 47585 1471 -16707 -15165 -5063 -4992 9752
23265 9752 9905 58044 55583 33228 57895 58286 32048 -13135 -48580 -40404 580 40712 78080
23252 78080 73427 62514 52655 34398 -8578 -16393 21229 35061 -9175 -32494 -38708 -70690
23240 -70690 -124361 -108721 -80694 -66922 -42820 -35691 -32846 -137 -676 -27865 -34433 -59829 -85623
23227 -85623 -63261 -20608 -44056 -45149 -40634 -25670 -24212 17709 17692 -1400 -4673 8468 13634
23214 13634 6183 -28100 -27305 -12772 -21706 -12880 4945 7114 -1315 24494 8278 -12425 -46624
23201 -46624 -72769 -58868 -65112 -94486 -123726 -101000 -36241 -3863 24993 16051 -34933 -63821
23189 -63821 -31165 -6768 -6744 4361 32400 35432 -7268 462 -16404 -44467 -62187 -39187 -7023
23176 -7023 -43088 -50742 -66625 -44800 -65910 -81787 -64760 -58468 -47449 -57365 -92065 -65235
23164 -65235 -81278 -80113 -73243 -48932 -64257 -25419 -7395 1692 -8686 -28178 -35576 -54922
23152 -54922 -80540 -49869 -1804 22540 74598 31703 -53467 -48248 -102933 -134584 -80577 -74900
23140 -74900 -64855 -46867 -60912 -102850 -101512 -78175 -105313 -65100 -29019 -36124 -63480 -94104
23128 -94104 -74856 -47800 -36455 -18631 -1095 50075 67207 61032 37985 11089 -3093 -26743
23116 -26743 -43261 -29551 49474 61517 17437 -40089 -70291 -56149 -45883 52 -11268 -9186
23104 -9186 17454 80341 57175 12120 66928 50896 -15011 -22253 -8616 -11176 -6295 8696
23092 8696 -5598 8191 -14092 -38510 -12399 22098 -21971 -76484 -77895 -13435 34374 49024
23080 49024 48405 94773 140241 144488 103043 45131 28909 54516 76188 40854 5208 35858
23068 35858 87338 151768 182108 167139 116423 63788 65976 142453 192886 157467 140751 117706
23056 117706 106177 140736 171800 119620 64089 48874 46982 67510 87087 73624 56975 61009
23044 61009 10522 -65517 -66939 -37522 -16179 -11336 -1343 -46244 -12136 5954 13893 -6554
23032 -6554 -26380 -10781 -12053 -1659 -17200 -45891 -1498 -31313 -17252 -13027 18885 42570
23020 42570 22276 -35518 -41152 -48946 -62064 -50818 -42156 -29271 -47240 -47025 -42609 6143 46954
23007 46954 47021 64010 56213 35573 4674 3702 -24900 3162 34244 -25193 -25870 -3890 -15769
22994 -15769 -21248 -22351 -13026 -15311 -8663 2948 -4043 -9441 -26555 -24817 -15342 32329 30581 21156
22980 21156 7286 -51342 -49277 -73 30927 10157 -41705 -31395 -2914 -31137 -14087 5651
22968 5651 14871 -18284 -22465 13360 43334 35246 -3717 22908 -29728 -82231 -154464 -172038
22956 -172038 -122005 -62403 -38108 -102935 -107881 -67218 -37314 -6124 17222 -1015 -25724 -64101
22944 -64101 -69763 -83642 -45746 -21741 -18303 -27547 -72954 -88696 -74000 -54433 -41026 -30124
22932 -30124 -63842 -125693 -87250 -87109 -95954 -80640 -81951 -90801 -85761 -59915 -81848 -77506 -17474
22919 -17474 748 -23879 -40968 -50552 -63509 -20237 -23650 -82279 -104167 -22616 -13177 -45630
22907 -45630 -86206 -75210 -1598 31600 19635 -2437 -22562 -35135 2117 51752 19975 -11726
22895 -11726 -31358 -35578 -18706 -27909 -77712 -107667 -42875 -23435 -50503 -36074 -13158 -5203
22883 -5203 -15542 3840 9787 7992 6113 24175 82668 43467 -20986 -93753 -105405 -85161
22871 -85161 -46871 -27297 -30065 14308 54 -49942 -57908 -18840 -15083 -17252 487 -23873
22859 -23873 -52843 -70624 -93948 -45691 -17209 11457 -13745 -63652 -43273 -31948 -7608 14081
22847 14081 30732 -4924 -15825 -50044 -72511 -70427 -41281 -7046 1180 -24985 -47332 -51125
22835 -51125 -43748 -28230 -39804 -27028 -31592 -42595 -48932 -50677 -27501 -7580 -30556 6539
22823 6539 -33289 -70979 -63887 -40432 -12571 -29101 -57068 -39704 -5071 7028 -28544 -46620
22811 -46620 -57052 -9489 34341 22723 10290 45220 56762 54948 18725 -19156 -32751 5860
22799 5860 -35992 -43884 3068 11975 -1527 -28708 -78785 -140085 -169654 -129261 -45083 599
22787 599 630 -43764 -55672 -142879 -133289 -96453 -98858 -67179 -19292 -17469 -41127 -46596 -14746
22774 -14746 23575 10087 -43401 -48841 -41976 -7140 34235 4565 -8190 17728 19179 -7398
22762 -7398 -33104 3511 10846 61374 41676 18958 -15320 -46166 -40940 -36663 3024 -1615 -15714
22749 -15714 -24017 -66111 -69975 -67698 -38526 -43715 -78421 -64975 -9344 -8313 -15304 -38047 -20258
22736 -20258 -5118 14158 26050 29909 51102 30292 7461 17460 -8961 -1087 45429 62404
22724 62404 77334 35616 21173 -9559 -5594 -13783 -72753 -56496 -48643 -74520 -75239 -72552 -78328
22711 -78328 -87940 -56385 -30551 -5301 -424 6778 -5519 -29132 -8714 11532 -28648 -55286
22699 -55286 -36092 -41018 -95011 -128486 -78356 -36537 8191 -26109 -81394 -38911 -25726 -34274
22687 -34274 -19127 -36826 -35506 -26174 -43490 -26500 -1471 2866 7503 17618 -15722 -50305
22675 -50305 -19909 -932 1116 10517 3717 -15946 -55228 -57148 -40708 -548 1517 -19158 12819
22662 12819 -12367 -27633 -9833 10001 -51021 -50413 -75281 -29072 36347 15773 21073 41088
22650 41088 12401 15634 1258 22947 29003 11350 22400 20159 -40637 -79176 -48209 -40330
22638 -40330 -44744 -40268 -42948 -18373 -38608 -67700 -76119 -103534 -146190 -119348 -99007 -77286
22626 -77286 -52566 -40176 -30661 -63614 -79837 -90256 -97950 -35748 -18734 -26228 -15565 -43793
22614 -43793 -13584 27286 69647 48785 8041 5893 -34613 -50193 -17096 -11425 -42945 -46620
22602 -46620 -20019 -13109 -19972 -59881 -60290 7715 5831 -82081 -96408 -97662 -90825 -52688 -75449
22589 -75449 -117274 -104280 -43642 -52274 -44770 -30386 -11882 -34201 -46257 -63830 -62814 -53773
22577 -53773 -28046 -6892 -44810 -39558 -65084 -81956 -64125 -93148 -71236 -38693 -29692 16309
22565 16309 49519 20113 -31321 -66516 -34358 -53784 -81141 -67502 -67967 -53682 -45565 -26209
22553 -26209 12334 -3635 -11541 5704 -34670 -47004 2636 10193 15869 -15342 -16100 -13683 -6719
22540 -6719 -4243 -30714 -41328 -33451 -1344 -4933 -7131 -12489 -30886 -33496 -27836 -22722 -4654
22527 -4654 24209 9951 32689 42023 44857 15478 -26606 -30434 -23418 -28721 -24117 -11471 -37125
22514 -37125 -8881 13078 -11266 -19197 7791 5660 14219 1476 -45555 -44155 -51082 -72917 -8629
22501 -8629 35022 27639 11921 11284 45048 94874 88257 18152 -20540 -34280 -55908 -42313 -54757
22488 -54757 -59169 -45463 -49147 -58784 -75808 -51555 -6717 349 -38298 -20841 17563 54161
22476 54161 39895 -14445 -55902 -44141 -48303 -37404 5400 10449 18363 -26022 -39148 -65541
22464 -65541 -92604 -105676 -106075 -84019 -61621 -21387 -21350 -25053 -43974 -58792 -13781 -3780 -16432
22451 -16432 -2041 -17535 -71345 -103146 -110245 -70275 -58732 -35581 -1078 -18820 -42365 -72671
22439 -72671 -72387 -24412 6906 -2699 -34462 -55396 -44237 -60325 -29250 -36694 -94011 -46857
22427 -46857 -5802 -3654 -5704 -30827 -21602 -11997 -972 -24954 1710 6358 -28568 -17037 -14864
22414 -14864 -47250 -48939 -80613 -46889 5658 3848 4457 -27006 -2519 14689 47076 16218
22402 16218 12911 13256 -6077 -35871 -54051 -37170 -33061 -7369 -65506 -92253 -53294 -13436
22390 -13436 -551 -14999 -29510 -41983 -28864 -29557 -31537 -66373 -95974 -109110 -48369 -37439
22378 -37439 -37250 -1450 -28295 -9722 30184 13256 -40534 -32216 -30513 -30078 -17138 5973 -4330
22365 -4330 -662 -7478 -16502 -37287 -72567 -59049 -53131 -57841 -64476 -71912 -35512 -204 23999
22352 23999 -19625 -80213 -79447 -58901 -47417 -42342 -27032 -9992 -41492 -29205 -49486 -56250
22340 -56250 -71464 -62090 -12724 8779 19928 37033 69638 57379 -7215 -58015 -55566 -47648
22328 -47648 -58624 -30314 -24323 -42356 -30072 -2268 -24051 -57062 -44662 -6619 32107 15132
22316 15132 784 -25169 -6472 34740 38579 13184 2869 -6512 -9696 -42230 -16365 -33247
22304 -33247 -36944 -29188 -79049 -97076 -80015 -21345 -4277 -56850 -91695 -81352 -98702 -92055
22292 -92055 -96922 -127256 -101573 -54282 -16890 33579 22081 28041 7621 47897 106966 117175
22280 117175 27420 -8551 2438 -23356 -44413 -44252 -38776 -85942 -92577 -88730 -44728 -23455
22268 -23455 2098 6772 2484 -3232 -32710 -97966 -118815 -90336 -70593 -73811 -37736 -976
22256 -976 7522 -4096 -73388 -53392 -48030 -77028 -83593 -44022 -5509 -22692 -35330 -20019 18717
22243 18717 44826 42481 44495 53699 72697 52832 8562 -6924 -1717 -12745 -2542 35534
22231 35534 34652 28143 -2302 9488 -1185 2376 6496 17192 -42569 -83414 -68121 -39572 -42759
22218 -42759 -70615 -103657 -45769 -12781 -24282 4191 -6531 4018 39702 -11805 -45327 -41994
22206 -41994 -44969 -7030 18624 13864 28381 18135 -17140 -52017 -20341 760 4773 11556
22194 11556 15331 4281 50911 56582 62611 89069 71530 74350 53346 33187 22540 343
22182 343 -33199 -14204 -24456 -115004 -127911 -60079 -30595 -21955 -18742 -64415 -72489 -60546 -4482
22169 -4482 7535 -25075 -25184 -31147 -68679 -12681 9748 38425 49207 77096 120526 84426
22157 84426 19025 -19764 -43254 -1349 12328 -17606 -38080 -31525 943 1896 -29956 -40540
22145 -40540 -28958 -8738 33902 54982 54884 20232 -12255 -28322 -14944 30111 -7035 -50224
22133 -50224 -43331 -43658 -57110 -76007 -74971 -29076 19053 -15372 -73977 -107307 -72770 -27206
22121 -27206 -20792 -76511 -83383 -20628 -6521 -74529 -101308 -33872 1088 -61847 -82349 -85334
22109 -85334 -64309 -31108 -32791 -62840 -56409 -47116 -23039 -19603 -15093 11613 12507 -16777 -29946
22096 -29946 -8879 -13744 -49606 -48484 -3500 -32386 -55411 -48171 -23258 -36705 -52380 -10929
22084 -10929 -9981 -30473 -17237 -29200 -8165 5267 11143 -8105 -16333 -29408 -32092 -9064 -9643
22071 -9643 -19954 2301 21197 -24586 -38867 -25283 12422 23385 2733 10042 -15471 -53935
22059 -53935 -100013 -128857 -55858 -3470 -11543 -2570 -21102 -46852 5123 25025 64326 68409
22047 68409 29949 46403 28301 39523 21641 5059 -38538 -59700 -54645 -62724 -55693 -19397
22035 -19397 -41702 -67061 -39686 -46627 -62515 -48146 -95006 -108248 -35207 -11322 -18051 -65161
22023 -65161 -57750 -50008 -9732 -25512 -28760 -42395 -65188 -66855 -43833 -42559 -83595 -85594 -102220
22010 -102220 -44434 -13200 -27581 1093 34825 65715 105651 77081 56391 -10588 30626
21999 30626 45954 26830 935 -30878 -49756 -43910 -48564 -109249 -130708 -114835 -87358 -120869
21987 -120869 -117243 -77462 -34142 -1898 8997 -9400 12959 12770 4370 -17097 -7958 -6710 -11172
21974 -11172 -30523 -60669 -51123 -57384 -85698 -60740 -47809 -49524 -38427 -28450 36822 51930
21962 51930 24402 9600 13889 21469 -12737 -46496 -65777 -74254 -84278 -49597 -78134 -91292
21950 -91292 -74621 -95680 -78550 -32776 32451 14083 -7519 996 1575 25537 18995 -13127
21938 -13127 -12452 -4346 -57729 -67710 -52350 -14074 19414 32412 28913 -6198 -36865 -50467 -41287
21925 -41287 -42172 -82625 -78232 -29778 -51339 -64755 -26193 5645 -27466 -28860 -15735 -20167 -55199
21912 -55199 -40963 28818 38290 34697 30109 -4441 7534 47532 26443 -5630 -14406 4029
21900 4029 -20051 -4879 6880 16057 62068 72441 54295 37592 94214 118646 96186 121568
21888 121568 136977 104082 42916 8289 -18268 -24138 -14498 16885 19556 5899 -1527 23120
21876 23120 12285 5727 -16237 -72100 -15773 32626 -12376 -40495 -43953 -49324 -70173 -49065
21864 -49065 -62500 -12945 9225 8383 -18741 -53192 -22201 11219 -11320 -17709 14224 3392
21852 3392 33254 28870 36163 24389 21380 23435 18837 12623 58419 63931 71800 40165 -27603
21839 -27603 -11186 67679 62850 17685 22826 55799 28295 -1564 -25830 -42072 -25356 10692
21827 10692 -10679 12120 73523 73761 15032 13469 9172 -41286 -62640 -88065 -102032 -56751
21815 -56751 -11936 -1611 -2442 6175 -9488 -1233 6078 25194 39692 43646 35650 21745 39907
21802 39907 76142 51397 49778 85426 118919 115089 111905 112079 115351 84471 98040 109269 97575
21789 97575 110726 103309 71677 29588 -3675 31252 77608 27958 23209 50773 2068 2832
21777 2832 10396 5773 25400 57477 53219 22497 32 -34865 -32563 -34272 -51639 -47100 -33352
21764 -33352 -12312 -5457 5639 26366 20384 29016 28033 3084 -23444 -29686 -36147 -13499 22933
21751 22933 44639 2983 -18564 -3196 15035 24938 23764 23848 -27156 -5898 5889 44778 16396
21738 16396 30042 6670 -25771 -56968 -85241 -67858 -29455 -36491 -21388 670 27229 44700
21726 44700 66991 66904 44496 50766 34327 62317 52956 26671 2106 -8673 -32605 -73730 -91714
21713 -91714 -57991 -7921 21230 5713 18242 31586 34930 -4535 -36762 -55015 -54639 10294
21701 10294 -14998 -26268 -24729 13511 -5255 -6157 -34956 -38756 -31303 -22601 -32394 -38112 -21492
21688 -21492 1444 3183 -47603 -65489 -33428 -27540 12295 14442 -27249 -25534 -9351 -5946 -12583
21675 -12583 32495 33663 41801 8011 25441 16296 -19138 -39462 -50343 -48281 -57876 -59748 -61979
21662 -61979 -83482 -43578 -37821 -17628 -13366 -29825 -68858 -113757 -98695 -76908 -58223 -21967
21650 -21967 2846 -9874 -24023 14582 -1111 -35488 -20530 -15064 -612 -2787 -46192 -45236
21638 -45236 -34671 21690 65270 -3277 -17897 11346 -10723 -19321 -20987 -35469 -38692 -32175
21626 -32175 -5478 1105 -1159 1279 -19307 -10086 -6144 -45078 -106157 -123154 -80056 -56373 -12641
21613 -12641 -11554 -9955 -15699 -8416 -7170 -25331 -40475 -42848 -26314 -23187 6444 -11356 -7923
21600 -7923 -41287 -65240 -3786 45473 28218 20309 6103 22476 54558 73081 113133 115199
21588 115199 114176 54537 -31311 -11520 -11684 -49255 -77079 -97887 -36961 16269 41375 57686
21576 57686 70521 30785 7630 -38517 -24986 -54662 -56364 -84940 -113747 -126554 -60090 3357
21564 3357 7476 20062 22268 14102 -2819 -49604 -50346 -39102 -29629 -3194 -7648 2102 -18829
21551 -18829 -51569 -59390 -40440 -83409 -113122 -51054 10987 7298 27120 49191 47088 43227
21539 43227 -8012 -57276 -37558 -25858 -6664 23328 16718 38266 26030 22590 49517 72002
21527 72002 76315 33188 28206 39626 11463 -27340 -22222 6087 -21199 -27312 22141 40158
21515 40158 6045 -30354 -41355 -18784 -23076 -31329 -29682 -26765 -54070 -73119 -32755 -1666
21503 -1666 9572 7601 -13891 -52814 -46561 -24611 -34778 -35312 -44523 -32541 -50228 -39961 11419
21490 11419 45185 29434 19766 23989 50351 24093 -6660 -23283 -61002 -30037 -9257 4927
21478 4927 17920 610 -31084 -50021 -52904 -70949 -47002 -23832 10062 14266 25810 14557
21466 14557 -18400 29547 68216 75388 70529 66996 29843 27947 -27501 -12891 -13898 -62995 -57501
21453 -57501 -59498 -32934 -41093 -56838 -54177 -22447 31603 24803 25235 63103 51179 33844 -43480
21440 -43480 -78346 -42999 -25131 -2848 31540 56490 49935 16717 29070 -17491 -40282 -5933
21428 -5933 -24005 -42415 -51398 -16607 -50320 -27170 -23841 -32526 -46660 -50787 -64957 -85105 -44469
21415 -44469 -6590 57741 60897 75375 48414 41220 63644 69088 17435 9554 -8790 -20868
21403 -20868 28945 30526 -16468 -50799 -10791 -2947 8045 -16586 -48714 -24562 58722 21571
21391 21571 -18603 11025 39507 -14296 -28451 -33859 -43635 -24013 3993 -48362 -31740 10158
21379 10158 38133 44453 13108 -35602 -37324 -45173 -59396 -36901 -9020 -15921 -4140 -39607
21367 -39607 -61115 -45560 -2140 -3508 8578 29482 -28685 -17281 22138 11347 -28395 -9538
21355 -9538 -7942 -21341 1339 -18406 -93 -2700 -14209 37012 61521 54983 38381 58741
21343 58741 48437 -12664 -44509 -53747 -36344 -4090 -836 -7836 -376 -2120 -26086 -14197 -20142
21330 -20142 -36516 -84962 -67135 -55134 -30537 1141 -17516 -57494 -103198 -100490 -89744 -20008
21318 -20008 25356 24716 31250 9444 -33089 -35509 -14017 -19333 -13614 -73 12110 -9410 757
21305 757 53863 44248 27430 634 -16775 6947 19501 39668 36462 -16067 -37848 -59725
21293 -59725 -61395 -79128 -72007 -26938 2329 -17032 -60465 -65676 -18545 9619 -27887 -49411
21281 -49411 -13717 -30989 -47037 -28515 -20153 4265 -25548 -50444 -70384 -104753 -98265 -33477
21269 -33477 55694 76384 60424 50906 27132 43613 20909 5494 14685 -4809 -11133 -21112
21257 -21112 -25787 -38148 -102041 -104295 -95340 -73158 -48143 -20992 18990 38152 22320 4695
21245 4695 -94090 -130502 -85587 -45068 -41570 -48418 -64012 -92539 -53231 13491 -609 12591
21233 12591 -1256 7491 3039 -47161 -48542 -34165 -61315 -82003 -49585 -104236 -123990 -121617
21221 -121617 -109698 -60014 -72102 -85704 -86359 -31274 -36779 -51552 -30516 -56523 -75440 -67283
21209 -67283 -55734 -58434 -70270 -41803 -20412 -13131 -30975 -34499 -44893 -31823 -19358 4547
21197 4547 26269 40185 21203 -51 12819 39831 22641 -5854 -28384 -19249 -599 45257
21185 45257 36056 4470 -36073 -7038 18401 -151 2929 -36161 -23169 -4581 12904 9820
21173 9820 11554 12496 -3540 -13354 -14896 -5419 20382 11254 -9487 4366 -4088 -56322 -64916 -74466
21159 -74466 -86817 -17804 -1812 -18259 -41535 -39999 -7695 -27201 -12586 -155 -19094 9918
21147 9918 7555 12265 40218 56428 39332 3447 -7845 10832 18790 444 -11848 -27274
21135 -27274 -71425 -105321 -92583 -78907 -40018 14739 56909 47873 18790 -35251 -59343 -19261
21123 -19261 40388 67283 36190 36388 67816 90611 57693 100986 63762 50452 52216 80114
21111 80114 144183 185954 295853 331575 383382 442122 466436 510244 490463 421626 394294
21100 394294 346958 287518 199449 135844 116052 112165 64737 44183 44672 79783 68588 61043
21088 61043 69766 50269 47929 24222 17355 22951 -17965 -14964 10414 17042 2692 -80477 -124972
21075 -124972 -108002 -72603 -56528 -91550 -83233 -69472 -29734 -19228 -33235 -26712 -42395 -29929
21063 -29929 -26249 -48956 -82501 -32077 -33501 9029 58294 50585 35133 59151 51387 -3502
21051 -3502 -10140 30035 31379 23871 11736 -26404 -52690 -8547 26926 607 -25612 -63758
21039 -63758 -58543 -37259 -68000 -84418 -70972 -100200 -107859 -95889 -36598 312 26924 5203
21027 5203 -29785 -25382 -1307 21398 16846 14554 -17867 -18970 -9750 9846 28500 35994 2809
21014 2809 -5401 -25892 16191 45039 10557 -12694 22560 -7154 25213 23312 30257 36999 21906
21001 21906 19696 -17050 -54475 -48858 -45680 -43534 -14744 -22571 -24392 2141 -12028 -24742 -34283
20988 -34283 -64860 -82435 -49082 1831 30297 -14421 17597 44837 61269 6897 -47395 -68378
20976 -68378 -37830 -25928 -30976 -20708 -13748 -40711 -14176 -30839 -44857 8200 47445 20684
20964 20684 7045 28991 61602 34178 -16740 -51575 -32739 -13037 21521 23565 67397 33118
20952 33118 19625 13884 -18971 -19658 -14136 16226 44841 65383 94620 114402 81920 74605 22044
20939 22044 -513 5577 -8405 -20280 -45920 -59751 -46781 -15642 -42993 -31702 -27665 -49205
20927 -49205 -81911 -81640 -35221 -41535 -58695 -34898 14045 37635 41776 28993 99551 119543
20915 119543 95398 81276 48873 51791 82393 104158 136739 152971 123171 67517 91839 92829
20903 92829 44265 31526 73302 53427 56198 71433 4603 -31079 -69509 -23675 1089 59711
20891 59711 99500 69929 -3999 -46236 -57628 -30347 -10938 13361 22692 13179 9950 -54717
20879 -54717 -99758 -99334 -85717 -63983 -71131 -65383 -62774 -58398 -57117 -53806 -60983 -38265 -8219
20866 -8219 20157 85773 110759 118020 137810 116817 127184 201922 212248 187197 169956 160011
20854 160011 137086 146083 113714 51881 21744 7396 -10284 72 -45857 -60614 -29433 -41717
20842 -41717 -60560 -106996 -143281 -150330 -129527 -135334 -137273 -91865 -42399 -36157 -14640 -43756
20830 -43756 -58750 -63252 -64443 -87135 -108257 -42444 7169 -11833 -28926 -51938 -14378 6178
20818 6178 5753 6362 -7714 -6596 -7705 -25630 -10001 -37279 -58682 -58287 -40387 14831 35985
20805 35985 9313 25621 9651 5120 -33199 -54433 1960 17010 11453 6736 -10933 -9851
20793 -9851 17745 9555 5418 27380 82631 70438 74264 44215 52258 2159 18537 87633 90046
20780 90046 56405 63767 59648 118626 130480 107024 130997 161909 155218 170775 173099 119371
20768 119371 72384 36948 8900 56094 68870 47069 29381 68929 62134 20754 43005 29477
20756 29477 26731 45904 39998 65518 83108 56454 -7592 -21687 -838 -24312 -72925 -64630
20744 -64630 -124478 -126937 -65116 -32030 -45725 -18499 -13583 -51174 -28715 46720 17816 -22176
20732 -22176 -10322 7248 55879 28613 4204 47874 37733 -23423 -56988 -45181 -31874 -72635
20720 -72635 -77359 -53451 -28446 976 -9288 -30416 -88453 -81948 -32471 -17570 -25766 17791
20708 17791 18828 10015 3985 -21679 -19858 -28663 -15704 -9762 28587 17037 -24202 -88580 -116541
20695 -116541 -85255 -78361 -71812 -6646 -14025 -1372 48115 48470 -17282 -36610 -34455 -51927 -48188
20682 -48188 -59469 -70443 -47286 -11585 -12963 22150 32911 -3856 606 -15754 -53349 -25494
20670 -25494 -23076 -38314 -18127 -36754 -74064 -59957 -60202 -74672 -45623 -76941 -83286 -25407
20658 -25407 -20779 -347 20620 -7432 -77041 -92603 -84427 -33540 -24229 -12231 -34700 -52842
20646 -52842 -23779 -29642 -32270 -67054 -100983 -93499 -75232 -91582 -74739 9313 69725 49609
20634 49609 20681 32267 69520 82133 47856 -6089 -29529 30736 35427 -1298 -38139 -59443
20622 -59443 -46134 -16783 9796 24505 59720 95151 58631 38187 54561 28397 52899 154717
20610 154717 177492 189942 165045 137349 162102 122461 119800 157910 127571 75625 50991 41662
20598 41662 80510 97676 142683 140603 80832 25042 -22362 -5881 1875 -55317 -52910 -67265
20586 -67265 -90699 -53100 40059 58942 54512 30349 -21228 -38875 -9892 14446 42051 115
20574 115 9613 32348 17605 13099 16029 -27401 -1202 27866 38618 -15056 -54986 -16969 2706
20561 2706 -8616 -25512 -22985 -33307 -26656 -25328 -38621 -14585 -13486 -29326 -20629 -13572 33506
20548 33506 55802 34568 13755 -29953 -63301 -62583 -49939 -42581 -21655 -2770 32869 3066
20536 3066 28766 34118 38168 23516 46827 31406 47954 51889 2143 -4030 28310 -12728 -74638
20523 -74638 -50374 -46017 -70469 -57445 -66193 -58433 -43986 2408 65142 57252 1946 -28938
20511 -28938 -31106 15218 34345 58642 60037 22455 -25281 -76694 -95138 -89035 -105934 -117099
20499 -117099 -123550 -104771 -58464 -13397 7948 46304 43073 55848 1509 -91485 -127550 -79721
20487 -79721 -33787 -8087 -13695 -748 32255 -15760 -55460 -22238 7156 -14846 -6634 13951
20475 13951 6519 -26058 -40074 -40648 -6158 24179 30662 17916 34382 17652 -11891 16832
20463 16832 -29736 -30970 -64152 -97279 -36032 -27224 -4390 12425 9488 -13996 -27221 -15803
20451 -15803 5739 -3071 -7874 -818 -42888 -86713 -73128 -95107 -62833 449 51256 36872
20439 36872 3804 5923 12954 -6598 -15523 7939 -15219 -44089 -30739 -67972 -41311 67722
20427 67722 37504 2169 -14870 5643 -12938 -40203 -27436 -12309 4876 28550 7570 -10492
20415 -10492 -54109 -133714 -151886 -98311 -71077 -72924 -60846 -52306 -39709 -24031 -15263 -38618
20403 -38618 -74617 -57608 -69392 -53804 -45716 -51542 -60596 -22789 -7147 -25714 -16809 -33089
20391 -33089 -57034 -28122 -55692 -87956 -78681 -54944 -25297 -6146 -39787 -31326 -22010 -17138
20379 -17138 -8811 19571 65395 84936 74105 58200 94043 92131 33215 -8276 15444 23058
20367 23058 17092 24079 16664 40414 57489 78104 82118 43159 36732 -47169 -103680 -138278 -108710
20354 -108710 -64842 35199 44925 28948 -69228 -114501 -103880 -90048 -77822 -98015 -125105
20343 -125105 -84116 -760 -3763 40477 35618 29572 20925 -14048 -43554 -89850 -65581 -20845
20331 -20845 -17728 -29277 -65368 -73197 -86338 -94480 -81111 -76938 -99457 -97554 -80364 -28040 -6342
20318 -6342 -17072 -69566 -100237 -78908 -107270 -60096 2946 59151 39204 25478 31079 20995
20306 20995 -13137 -8843 17204 23916 28606 14675 36048 -22271 -60141 -58445 -63246 -81952 -65964
20293 -65964 -32939 -2174 17947 -17234 -23512 893 21626 -21037 -18905 -4184 -2323 -5425
20281 -5425 25858 35619 15951 4575 43866 24298 -59740 -73928 -28420 -9819 -13228 -48890
20269 -48890 -69409 -53076 -68633 -73142 -54429 -15013 -8094 -36551 -81289 -121218 -107744 -97063
20257 -97063 -61952 -91015 -103458 -95930 -70484 -37712 18991 -29576 -101452 -89155 -74682 -53027
20245 -53027 -71604 -55670 -22540 2108 12295 29228 43112 4352 -50134 -58835 -118340 -114508
20233 -114508 -102615 -77004 -68855 -104732 -101357 -90508 -103155 -76566 -116270 -114430 -88904 -82892
20221 -82892 -97997 -33894 -19628 -33697 -14199 5855 -15082 -25208 -45174 -26661 -27389 -9809
20209 -9809 -1913 -8188 -37189 -51644 -101558 -51036 -54425 -63855 -102389 -110406 -97398 -91693 -95832
20196 -95832 -24555 -5883 38326 96999 108425 29691 -17078 -23033 -51684 -50975 -8453 -26249
20184 -26249 -12816 -11944 -16257 989 -8579 -63553 -62734 -69343 -61667 -51945 -74134 -94754 -41684
20171 -41684 -26418 -19927 -15545 22263 13793 -37708 -68042 -74111 -12022 6291 12987 8608 -43132
20158 -43132 -64997 -34243 31038 79095 19938 8664 6770 11174 -32585 -41508 -22983 3095
20146 3095 361 -66066 -52226 -79054 -39197 13951 17011 -3383 34362 42456 -15429 695
20134 695 32874 -7461 -51330 -37178 -37277 -10367 14173 25435 13422 7886 -25790 -43832 -27796
20121 -27796 -39871 -7755 21812 27786 -17 -36803 -25941 -11776 -19286 -56649 -25250 -13170
20109 -13170 -57915 -114494 -43158 559 -53436 -48376 -40324 -52613 -43206 -24354 -34532 -45436
20097 -45436 -50844 -12055 20022 8131 -37408 -64524 -99530 -86279 -60800 -35378 -36571 -44089
20085 -44089 -28264 -75035 -120850 -149324 -107077 -100857 -56335 -4826 -6152 30680 64106 29303
20073 29303 -37714 760 527 -26753 -53555 -52102 -36333 -27137 -6051 4266 -35592 -40520 -42209
20060 -42209 -85842 -53055 -21318 -39911 -41627 -64231 -82060 -117890 -122358 -90674 -69728 -44845
20048 -44845 -13986 -10577 -35199 -65562 -69471 -38306 -21815 8746 -38660 -60672 -57814 -79009
20036 -79009 -78183 -73369 -56530 -36079 -39709 -34796 16310 36635 53726 31517 4261 -58689 -45945
20023 -45945 -9027 21763 39521 11796 -18364 -29442 -49497 -31061 -31213 -37424 -25504 -21328
20011 -21328 -29061 5006 -14292 -62206 -81724 -5396 21295 -12784 -20063 -31881 -54812 -61554
19999 -61554 -57764 -50747 -42379 -70521 -93053 -76561 -72369 -46079 -70869 -73847 -51299 -29811 -11805
19986 -11805 33716 13978 -32529 -5105 62776 53514 19384 12701 43405 72591 35985 -25799
19974 -25799 -14801 -856 18497 10448 -60601 -121223 -126859 -95256 -103069 -103422 -35650 11563 -7382
19961 -7382 -28909 -45875 -47187 -38539 -37804 -69336 -35040 -23571 -68826 -53862 -52427 -70881 -77945
19948 -77945 -73515 -53686 -47342 -26009 11271 27349 35485 -13851 -42991 -53121 -67495 -57181
19936 -57181 -44523 -50983 -68141 -34720 16071 -5178 -55198 -73502 -26760 -13711 -25915 -4727
19924 -4727 19523 7637 -12326 10696 37106 -834 -18107 -34498 -15195 8362 42093 70357
19912 70357 28127 41993 69264 81403 115028 82192 72736 27665 32976 25198 2780 -38101
19900 -38101 -28302 9095 18653 12088 60664 44048 -1600 -28334 -19437 -39182 -22454 -8422
19888 -8422 -55580 -36628 -28804 -3468 28849 45475 23222 10023 -29686 -54552 -78838 -78946
19876 -78946 -72613 -48319 -57098 -32878 -48000 -91067 -62130 -5315 3649 15759 1412 895 41972
19863 41972 75689 24424 68629 116248 82744 48391 33711 14453 -37046 -63039 -74296 -51616
19851 -51616 -64964 -62033 -27268 4793 417 -30998 -75743 -98928 -54174 -33724 -59977 -41777
19839 -41777 -48632 -69145 -45053 -21211 -36745 -57987 -16347 10717 -7309 -42209 -35100 -8299
19827 -8299 -48932 -21877 12453 -18811 -59871 -33318 19863 24018 -13490 -15244 -4220 21390
19815 21390 -5114 -39650 -29388 -2423 -12255 -39483 -49144 -40353 -66334 -66608 -12566 -30538 -69794
19802 -69794 -72723 -40993 19355 27492 397 -20465 -14390 -41370 -82365 -93081 -95865 -94837 -56685
19789 -56685 -33066 -41833 -51778 -32541 -8138 -11134 -17245 -14927 2091 52582 34851 41072 38656
19776 38656 83670 103731 42577 -26880 -23878 15224 16701 -6090 -46412 -73114 -52092 -7397
19764 -7397 -7291 -29986 -20108 -22813 -46567 -24627 9824 54152 99438 83418 53851 35221 56964
19751 56964 48646 14535 17355 -49622 -61694 1301 18936 32181 19566 13702 10733 -1986
19739 -1986 8098 -21562 -7801 -41424 -72088 -22472 13444 -253 -30031 -2744 20002 25732
19727 25732 21814 65121 58724 61574 85914 77656 33280 13026 38272 28600 21474 22152 40251
19714 40251 101020 142100 207035 333159 520644 645733 690760 666267 668934 660274 649265
19703 649265 643502 741988 731834 623451 496479 394827 349439 366134 379301 372320 318214
19692 318214 270580 238500 258077 276331 248205 147967 80727 62598 16645 -32204 -48574
19681 -48574 -11079 29449 81643 161633 118560 108333 100195 78448 76880 62517 77455 99855
19669 99855 174581 183068 193487 186888 174737 131144 125565 155318 172916 227223 365066 496537
19657 496537 612249 683046 793373 956500 990785 875550 670462 527709 438851 379035
19647 379035 478441 631239 690752 661080 530376 390032 339222 286957 245098 230673 186153
19636 186153 159074 126602 49405 9223 -1044 7985 5161 31994 58495 63225 61026 18087
19624 18087 -2710 -44699 -48405 -28082 -70308 -46159 32310 46145 30472 18282 -22102 -3367
19612 -3367 9089 24150 38901 -13627 -45706 -55322 -38303 -6915 -43767 -47952 -52021 -73515
19600 -73515 -42310 -36859 -54910 -58694 -72992 -85851 -35157 7155 13076 17294 -25618 -37862
19588 -37862 -12914 -12506 -12519 -3390 -20074 -33088 -26166 3464 63154 81219 34407 -4665 -33855
19575 -33855 -29794 -1863 19986 -21647 6437 -1674 -35027 -63971 -55261 -64087 -56616 -53976 -69993
19562 -69993 -33877 -56070 -92354 -104996 -18665 19414 -2136 3081 -13833 42512 11336 13916
19550 13916 5100 -37031 -27934 -28807 -33082 27825 98069 89844 54157 16932 35189 31439 42354
19537 42354 31968 -2483 -30850 8532 43951 48268 24699 -16595 -58892 -69067 -68015 -49587
19525 -49587 36248 44429 -1233 17284 49783 77426 97245 86744 48433 54196 24628 -10140
19513 -10140 -37422 -57591 -73368 -92274 -21389 46607 43894 54156 52445 14770 -28307 -28958
19501 -28958 -20621 -31197 -49764 -31163 22666 -9387 1378 25106 48480 -10327 -17986 4922
19489 4922 16118 -13649 -24000 -5535 11305 -4026 -26169 -1289 -42098 -80564 -96284 -66288
19477 -66288 -41987 -57639 -28547 5220 30592 12849 -21995 -39179 2759 40486 63870 16820
19465 16820 5308 -36257 -39634 1815 -10925 55747 60213 32183 30863 20807 -11920 8270
19453 8270 10904 -18943 -34809 -42773 -43846 -45968 -24699 17303 -20329 -110991 -141983 -122824 -66165
19440 -66165 1377 18659 -1384 4200 10888 -9825 -42357 -33564 11654 28896 44895 57008
19428 57008 55965 27003 55305 76550 81436 48548 33798 -18997 -66709 -78733 -82526 -82863 -52078
19415 -52078 -40465 -32966 -27103 -878 11211 -20032 -22876 -30028 -32219 -8418 26670 28788 11731
19402 11731 64362 92733 67520 58406 33878 -22474 -3569 19647 13404 -26976 -62400 -24607
19390 -24607 9646 49123 12990 -47916 -25194 -24535 8301 26173 -50691 -60744 3651 4833
19378 4833 -23705 -33239 -10207 15887 41434 11168 -4860 26906 -11951 -45258 -2118 11020
19366 11020 2091 -8896 -16478 -5778 51653 86032 60484 88944 46912 -66840 -74135 -52537
19354 -52537 -80954 -81629 -71227 -98733 -97957 -59267 -94 44670 38010 545 -25901 -29491 -10911
19341 -10911 -44408 -64617 -66097 -100802 -104464 -66256 -40132 -31193 -35753 -16719 -2340 -20076
19329 -20076 -21551 6795 -4055 -31641 -31535 -1825 610 15962 14968 -54577 -106345 -113862 -136000
19316 -136000 -107051 -37303 3373 49099 71387 17293 -9851 -2453 -16500 -3794 29716 30825
19304 30825 10896 41062 19331 17901 26017 -41870 -68699 -50722 -13858 -20509 -13274 -11252 3049
19291 3049 17955 32373 13470 29424 54639 39158 47626 68700 62086 48134 7329 -932
19279 -932 28877 20976 -23733 -18571 -13233 -38461 -46308 -4475 15862 13784 23177 38895 63120
19266 63120 101932 128358 112158 93522 88914 101553 147902 164459 144629 115848 51372 41638
19254 41638 83119 96879 82434 61975 48211 72778 63558 59823 35152 9126 32288 20868
19242 20868 -26179 -49362 -45392 -11594 2293 22411 61288 -14107 -2186 9099 -16207 -38382
19230 -38382 -63297 2083 17806 -17566 -41226 -44068 -40653 -33119 20663 61604 47147 -20567
19218 -20567 -49697 129 -14971 16424 37913 46143 53855 40755 27728 18304 -8926 23344
19206 23344 40351 29522 9538 -20110 -18645 67886 117098 105839 97793 51568 -13802 -21169
19194 -21169 -17626 -54013 -46974 21408 44010 38096 50209 27981 17171 49555 41158 65055
19182 65055 104167 167920 140262 113518 125618 101751 113135 132297 72814 38073 20254 -27504
19170 -27504 -37611 -33582 -41005 -19703 -36050 -36372 9694 -5851 1282 -22411 -26414 -5750 12387
19157 12387 14051 41820 33214 -11126 -7814 8060 -6175 -1254 39677 69539 65487 68702 67116
19144 67116 61008 51709 34764 16079 -23258 -52792 -58147 -5306 19776 37738 49306 13466
19132 13466 -65956 -71952 -73333 -44931 -50926 -747 43719 53088 105491 161104 143868 152734 202641
19119 202641 233669 246571 263802 231141 242524 274619 255273 165566 106918 82967 112714
19108 112714 108724 134963 148256 130545 89538 35116 7372 15804 14518 -20278 24539 37395
19096 37395 26190 16079 46961 45160 56368 72724 71885 53884 25643 -8885 -1513 -10055 36066
19083 36066 31084 115316 134564 145094 166289 161517 132479 127846 119390 156698 207955 218178
19071 218178 294396 431329 505324 535514 579225 620431 597924 521064 460273 410838 324288
19060 324288 267130 184999 120686 119901 162793 177956 147517 104450 76957 59340 35932 46818
19048 46818 31443 29867 8513 -6212 -53228 -55018 -80841 -84895 -37643 -13310 9273 39371
19036 39371 37922 55077 85360 82793 93672 173999 214385 249454 254148 293308 229872 172236
19024 172236 169946 197128 287382 436165 501291 506330 508185 490029 484074 521192 518033 476628
19012 476628 382606 302846 260526 190343 173488 183814 112669 50602 91526 115870 110192 102196
19000 102196 107858 117936 90606 121225 125811 97045 51988 77912 97824 95484 114242 104052
18988 104052 168336 211887 209765 238398 279078 324100 350357 362392 331121 268580 190690 127470
18976 127470 73711 100186 116620 122997 102513 85443 53981 47356 56567 99553 158332 201819
18964 201819 261827 339516 412042 435099 418288 293351 188403 157838 155951 171776 148312
18953 148312 107262 103630 104920 58782 19359 64192 80078 114148 140734 164468 206905 259472
18941 259472 303873 311862 282392 301882 288695 215107 218791 235516 260124 284312 304241 359279
18929 359279 385113 380909 339517 240100 176142 188717 231099 192258 151270 38427 24875
18918 24875 47367 72710 52861 -2156 -16557 -892 -10553 -44133 -62977 -68522 -38308 23442
18906 23442 52470 64257 59048 84790 70245 68116 74647 112893 118337 92645 75199 72577 87824
18893 87824 99337 109877 144744 131809 116316 141496 166675 187308 226494 218270 236927 219316
18881 219316 176161 171020 126237 94711 46319 -2471 -43685 -61845 -63709 -22361 11279 -17219
18869 -17219 49442 105166 60276 24288 32242 44319 82866 111715 151390 141876 172787 186238
18857 186238 147620 93980 76092 44218 61758 124505 156530 224831 361792 489240 589239
18846 589239 643994 651275 615960 538550 458254 385141 358372 330173 313838 274171 236440 266422
18834 266422 310262 286481 250308 243638 210047 225339 191403 108069 70810 97065 69406 46668
18822 46668 33557 -19100 -22068 30170 37014 8664 35186 56942 80420 89627 83746 108727
18810 108727 135701 117148 170508 207283 212707 299783 380352 465828 544212 586115 573458 550466
18798 550466 512592 612774 717334 718529 717866 761747 869505 912535 859657 803771 663732
18787 663732 526527 451216 393581 319220 243243 182495 181585 223763 186180 152628 135733 141867
18775 141867 121427 109591 72328 69148 56995 45954 -8936 -7653 20715 23675 27791 84055
18763 84055 115180 109453 125247 172241 217557 260417 223120 212146 197474 144774 156494 198311
18751 198311 222107 249865 272758 284074 327378 370863 373199 367750 354663 335926 337074 328488
18739 328488 285929 233242 193530 182444 185782 141732 126054 170706 208621 222861 168022 131010
18727 131010 174483 142958 118662 98102 102913 133685 130958 80384 58805 91925 118104 68831
18715 68831 70558 152536 135806 33308 -9611 18572 -7168 8042 44823 102535 142264 114406
18703 114406 41757 48752 72220 70915 78119 104264 123772 61875 45991 20764 35770 74224
18691 74224 109689 107291 136104 146393 99811 97565 115139 123199 108398 104935 141528 97548
18679 97548 93984 94945 49193 22672 31561 73081 57614 60855 84824 136990 167454 172356 154584
18666 154584 156866 120113 102499 122791 143985 118841 129465 175067 159641 106371 138542 159008
18654 159008 154793 209047 220746 215022 203581 251422 294018 283603 295863 338312 359767 427788
18642 427788 515641 562364 558374 541514 488631 402499 330244 306168 267888 231481 186200 177753
18630 177753 154730 181689 152580 122565 164857 186084 146851 125765 131567 179315 205986 195869
18618 195869 192403 234284 229608 228647 216155 183401 170779 181855 181343 152202 110849 108236 132762
18605 132762 168342 200271 217459 317337 393158 427205 449363 438782 422177 443118 523090
18594 523090 546552 538616 543009 516671 523406 550640 582306 620874 615283 572283 556850 524560
18582 524560 492138 425701 337515 275205 264910 228715 213419 190253 201780 204034 166404 174831
18570 174831 194969 238584 258251 270110 270174 243893 260603 249789 276580 296553 291775 235159
18558 235159 258067 273948 273967 240546 234979 230939 190942 170418 242805 291061 270648 259747
18546 259747 270136 312812 328509 338374 316391 315222 323345 331133 360027 313524 232177 221079
18534 221079 256880 220530 192335 172787 185348 215613 208283 227771 230511 172241 162985 167629
18522 167629 164608 195280 234242 279641 299989 344790 338980 296659 318576 360651 358394 368943
18510 368943 412169 425087 429193 448267 468400 562166 608886 633369 707717 879612 1023239
18499 1023239 1096872 1131497 1134654 1147717 1122446 1092832 1033015 945130 961357 1002671 1012775
18488 1012775 1058906 1129302 1211199 1310655 1464150 1626081 1795011 2020847 2332111 2763123
18478 2763123 3302368 4026008 4933375 6248695 8147331 11063292 15776956 23617108 35969915
18469 35969915 50575111 61317544 66800286 66588055 58528291 45700282 33018514 23238273
18461 23238273 16500096 11952503 8915672 6864194 5370772 4280711 3470437 2899137
18453 2899137 2462871 2188340 2009902 1916133 1933218 1920330 1912849 1973193 2000112 1978339 1927145
18442 1927145 1866615 1814548 1772769 1811950 1840981 1856899 1862565 1839651 1800675 1778740 1792300
18431 1792300 1823556 1915356 2074226 2248541 2491577 2861463 3312287 3912303 4701479 5796761
18421 5796761 7390837 9856889 13728386 20005015 30459413 45518931 60203047 69205711
18413 69205711 72898610 69168825 57533990 43046448 30432521 21297590 15125096 10963821
18405 10963821 8212880 6350922 5039249 4063400 3388690 2839915 2486283 2253461 2035258
18396 2035258 1841106 1605568 1373179 1174812 1032144 901821 813120 812144 848666 875946
18386 875946 955924 979356 999846 1046190 1023507 1001826 954114 820287 626115 509491 451769
18375 451769 335875 284052 185916 167786 146048 147731 152275 125546 114544 132207 136726 71318
18363 71318 22891 49034 69388 109279 152566 155957 180039 156367 174113 173412 154698 135983
18351 135983 140426 205549 231454 209484 279519 384794 447682 380486 311181 309578 274327 214526
18339 214526 181739 136274 95303 64795 60501 25896 52917 59058 54789 86393 117777 132412
18327 132412 138137 123624 87976 44469 34589 38683 69307 109050 53573 5881 -4835 7238
18315 7238 51744 75774 75763 63225 69136 78769 55856 81214 85484 7238 16660 34168 70273
18302 70273 74263 117462 129741 114650 110331 70676 32329 16131 28948 70140 66017 64452
18290 64452 91942 123228 106679 44687 2747 -19974 -910 -9668 -12260 33775 84958 95906
18278 95906 132719 139745 121974 41211 23463 -19767 -4306 -6964 -44562 -55474 -55128 -94170
18266 -94170 -117493 -67877 -20495 17035 23235 -21036 -30229 20820 -13040 -48430 -36452 -46648
18254 -46648 -49517 -2140 28189 13793 16852 -8096 -24548 -13586 -25755 10227 19705 14011
18242 14011 -4127 33274 48832 9855 19346 36672 3535 -41864 -34617 -14530 -11833 12710
18230 12710 14776 48887 60737 115443 158228 166702 164650 149031 119146 82746 78888 29936
18218 29936 53087 72433 72473 78647 108129 75959 23278 -14227 59412 75812 80231 100420 96431
18205 96431 54714 -25596 -5341 39814 17266 21352 32192 20752 17109 22354 42249 29236
18193 29236 -10461 -4767 13383 26420 67934 42872 51359 92833 124307 139636 127601 98923
18181 98923 56942 30564 62283 92412 104504 110833 94872 68775 82007 79137 133600 108995
18169 108995 97595 64092 59297 70289 72466 60047 93432 101790 71663 35309 57488 20318
18157 20318 10131 52758 65145 71297 52763 11488 3480 25907 40796 45668 61378 44529
18145 44529 56470 27742 -608 28596 30194 46354 8972 6590 46841 56465 47271 76567
18133 76567 93613 114986 117563 112745 124311 98499 69907 53292 50366 73269 93134 83084
18121 83084 67546 78031 122718 86048 68180 97272 117724 126173 69725 55012 82970 72513
18109 72513 48597 65113 76057 79721 -1888 -5054 -36850 -14303 -2787 875 -9869 24800
18097 24800 49361 61306 16319 35558 36409 59315 68757 17466 -34441 -56312 -9791 -30842
18085 -30842 -59418 -17480 19594 34574 79459 78816 45411 13073 -1437 -27188 -59415 -56726
18073 -56726 -26258 -10442 -9849 21070 28982 56230 84063 106413 125031 87611 68683 23136
18061 23136 12860 34378 84740 130938 153902 158585 136158 94628 87697 111523 112057 105465 154375
18048 154375 210654 235568 188646 125260 111640 102876 69071 62679 46836 54735 51981 16340
18036 16340 -7328 -8600 5996 51476 55122 -668 -39249 -22291 -16997 14333 25394 6158
18024 6158 19569 58470 74856 63471 36211 7993 -23745 -10580 26515 22324 29062 69334
18012 69334 59321 32494 -9292 -8306 46125 139773 182699 233511 236777 280010 271762 248056
18000 248056 225515 188485 143749 155020 127687 165597 229093 212572 172358 178256 118187 76261
17988 76261 46820 102410 126033 106543 79279 81124 52686 47112 25670 766 16872 2605
17976 2605 31547 56411 48897 21152 -16021 32436 39917 60704 49199 27235 72952 108861
17964 108861 2427 -42915 19256 59351 32483 26297 52545 64028 46725 39129 17111 30143
17952 30143 72381 113153 144592 185676 254750 276255 329982 439866 409516 346430 297568
17941 297568 276043 237134 174321 146792 176084 205349 249787 288388 264736 197150 130984
17930 130984 104217 84462 99764 52371 2241 34682 67435 87714 93580 72829 67203 64394
17918 64394 121285 107222 66147 47315 11648 -13424 -43561 -36269 4835 90812 81519 57235
17906 57235 52283 5457 54133 92315 65275 25553 52015 87209 103527 131878 193854 282984
17894 282984 333534 379426 412505 425313 393968 317832 262252 294322 262122 208170 208517 154480
17882 154480 149435 139543 107056 131294 127100 125924 156694 183947 185574 181842 173606 155754 141152
17869 141152 119826 137414 111322 87257 111475 116939 107258 65232 87189 128881 128526 100064
17857 100064 90102 102235 84499 67514 59726 92568 65932 49708 13017 -5914 991 -27039
17845 -27039 1980 28841 50466 40024 11852 -17833 -49653 -25775 -32823 -13727 11277 31197
17833 31197 73567 99811 105595 118729 98777 88851 90667 121114 120573 97490 66321 -3379 10639
17820 10639 60708 110954 97178 93838 99859 83290 53010 42764 14878 1513 3688 43226
17808 43226 33728 14268 -10571 -10452 -13805 -16189 25060 11921 21854 15902 51468 35199 23815
17795 23815 22265 19305 54976 64656 23351 -31912 -37449 -8149 -14548 -23417 -40621 -43450 -21331
17782 -21331 -57028 -75745 -114729 -102044 -44206 -11442 -11875 -21784 -4133 19195 68807 75857
17770 75857 91536 101168 113384 60971 -2079 -7930 37132 -3402 -39338 -53962 -18909 9073
17758 9073 14238 -1371 36114 68432 50416 56387 101767 111681 98701 106959 76199 77274 76281
17745 76281 73132 75478 63090 67983 51988 27744 52284 74658 42418 46158 65732 71998 23812
17732 23812 -24409 -44623 -51295 -47299 -85903 -68228 -5209 17744 37699 5976 -73487 -96468
17720 -96468 -49187 -3659 43732 26890 42124 96504 122534 158783 160955 152900 81500 58255
17708 58255 48248 -3772 -23098 -13823 75354 126059 93759 46880 8956 -16514 16467 80141
17696 80141 114063 148819 132294 66613 53876 62954 60677 77268 96734 99514 123370 73713
17684 73713 56748 81345 87109 103032 100205 87461 61185 41849 38354 24078 -32983 -50667
17672 -50667 -4641 -2081 -19155 13393 -38 12421 85815 84277 96694 50557 -4303 9013
17660 9013 50782 58098 45277 34206 59499 64325 14589 19309 67371 77761 47716 -15956
17648 -15956 -21350 22297 43214 68099 94060 74526 -3569 1069 3615 -82258 -85730 -30123
17636 -30123 20351 51602 22377 21435 13142 -3886 19590 35218 33040 35525 52785 63067 53263
17623 53263 67302 80011 118800 92639 62549 58918 60431 60982 81691 84931 24981 46868 76533
17610 76533 61771 47881 56958 57013 66620 58629 63991 89387 90343 116154 131105 90968 78691
17597 78691 34302 -10756 -24398 -33838 -10904 32132 75675 103874 90627 86410 117732 170640
17585 170640 177644 209263 245838 269313 236443 219548 157449 93797 48605 48613 88940 147466
17573 147466 224051 280612 309201 331305 281563 278205 234713 173293 98182 83243 117832 144450
17561 144450 155602 171799 174225 137625 95935 53345 73685 97530 128843 97357 90115 83516
17549 83516 33906 76572 135380 150967 125882 96043 104173 84671 86641 110966 100287 113375
17537 113375 114810 99763 85658 87625 70941 101896 128089 123540 161417 228338 213470 218388
17525 218388 196528 141976 97193 77510 89845 113833 137461 181775 235355 232377 190054 172305
17513 172305 156184 154339 159905 149956 107298 102590 123654 148451 128277 114480 85108 69653
17501 69653 47097 41138 82100 42717 19155 -3385 6137 83701 67290 106802 115082 88973
17489 88973 48781 47027 51843 57837 14010 37298 57532 160739 189575 139605 107322 68711
17477 68711 30087 23229 50971 62947 47473 53148 95133 67185 25510 34265 32429 -11922
17465 -11922 -12569 13694 24288 -1279 9143 48867 63151 68316 102166 121593 147605 202856
17453 202856 222152 227811 216577 148265 139658 126519 140339 150301 174485 216638 260884 285125
17441 285125 342795 377920 419550 411888 360012 315372 297297 274990 256333 252102 221088 237136
17429 237136 276160 378531 452497 426573 408815 388190 362327 333318 300328 259252 265423
17418 265423 225683 169479 116320 112363 127195 80637 40043 -1976 -12291 -10262 -52508 -65584
17406 -65584 -28267 23108 60717 82405 93509 87916 106010 119548 98246 73945 42803 25328
17394 25328 28390 23170 24904 85 -3995 45591 52075 31520 38427 62660 105146 138146 139275
17381 139275 116783 111872 118145 151421 177953 187710 179674 181050 164286 211245 245367 301665
17369 301665 320107 321578 367287 387982 379311 302605 246992 233604 214717 183589 239518 323385
17357 323385 428307 496512 509215 428875 405815 360079 317961 280113 256608 269917 214287
17346 214287 140730 125413 159409 172155 142749 105495 68126 40122 36829 32662 82300 55556
17334 55556 35282 57731 93480 144532 165159 212975 205929 192593 172621 149276 151130 167114
17322 167114 159935 140579 113034 123539 131023 134622 133467 133864 117600 63951 75275 73489 52546
17309 52546 73551 64429 57647 43748 96706 109738 122044 133887 116041 97667 71376 103930
17297 103930 156336 147058 100655 40963 16021 20310 22987 51340 54535 70161 62027 37126
17285 37126 27511 35500 53387 91982 90410 101716 107605 60276 81039 142109 173133 170557 131330
17272 131330 91949 68045 111967 114236 81306 66650 69620 101614 163462 267264 286420 207944
17260 207944 193478 175026 149308 158146 174016 170310 195790 212209 209863 218564 248563 275653
17248 275653 262448 226436 198410 173986 123363 69342 45113 66492 78398 112985 172753
17237 172753 147463 113634 68175 90349 125253 96053 95444 92564 75710 64747 106632 131387
17225 131387 115006 129809 149175 119948 133802 182893 203862 203397 222619 234664 234659 237398 288331
17212 288331 322526 357871 379469 388138 348843 381015 399842 407423 333185 324212 355132 384446
17200 384446 374442 447929 468071 478581 467992 503983 450616 373684 334229 288363 248176
17189 248176 319535 390609 397287 360390 354839 379128 385877 413123 459940 424605 330400 296689
17177 296689 290675 312044 266360 266324 252388 228696 244378 250546 268296 222309 246900 289591
17165 289591 291979 290103 289332 224392 209625 173031 183058 235698 269473 302985 295362 258269
17153 258269 282748 300817 229064 214725 258248 276949 254454 285821 336330 385182 434021
17142 434021 405305 361255 352626 315298 276397 304955 308004 293227 290154 303387 372140 400900
17130 400900 432074 442259 454813 494281 511078 518057 500354 482264 507775 508929 498508 538226
17118 538226 526193 466851 402883 419087 470423 455651 463546 478897 450771 471381 513446 491918
17106 491918 508435 511971 513458 508592 525509 504946 501943 551333 615567 630110 666702 772665
17094 772665 859109 874119 835172 840385 834309 913136 973003 1016753 1164654 1309912 1469331
17083 1469331 1649995 1841296 1999461 2131140 2245711 2437311 2855806 3476696 4382839
17074 4382839 5797151 8066389 11691609 17602782 26574321 36619365 41343870 38142610
17066 38142610 30735633 23346274 17859330 14449551 12962655 13106529 15071619 19464249
17058 19464249 27260935 38277360 47282706 47540059 40219490 30486109 21987953 15734232
17050 15734232 11486981 8654021 6737766 5361836 4369996 3624285 3109944 2840406 2707919
17041 2707919 2565859 2386882 2219307 2063388 1899657 1771237 1737896 1719896 1733321 1804333
17031 1804333 1901141 1990560 2147975 2318456 2389592 2466514 2654785 2929724 3321794 3831680
17021 3831680 4675760 6138242 8495304 12358437 18526672 27233403 34822252 35924254
17013 35924254 31079910 24219321 18359210 14375534 12166522 11552808 12528280 15390478
17005 15390478 20985118 30278507 41519785 47475180 44006785 34994334 25483937 17975382
16997 17975382 12746693 9240772 6921041 5346990 4205252 3482678 3003356 2644277
16989 2644277 2358052 2091730 1892716 1698248 1549189 1408940 1302780 1151141 1059805 1039637
16979 1039637 1064619 1110846 1114864 1063441 1016625 1018235 980104 948267 898169 834909 732296
16968 732296 727678 733347 684947 666021 688425 725843 711051 740121 764885 763849 780969 845966
16956 845966 863427 862932 842041 832288 833465 888891 982732 1005753 1035903 1088600 1163338 1242431
16944 1242431 1340706 1430116 1579878 1802469 2054892 2355844 2730393 3108131 3463803 3878325
16934 3878325 4389998 5074773 5911634 7005485 8595378 11070937 15033122 21826954 33029280
16925 33029280 48694844 64036548 74458346 79948206 77309118 65876273 51313872
16918 51313872 38907069 30672601 26630831 26685891 31181918 40699803 53025144 61970425
16910 61970425 65510707 63990911 55963966 43855182 31784445 22306308 15710517 11440178
16902 11440178 8714410 6971380 5841332 5067949 4453697 3934810 3401319 2903321 2455920
16893 2455920 2026153 1681113 1446457 1218981 1035183 910162 837281 791264 732367 667535
16883 667535 613661 610651 556027 533630 542990 534430 485903 480823 490986 474179 477027 404124
16871 404124 354061 351587 353416 331533 321638 312409 319305 294471 293658 279027 302075 336057 366528
16858 366528 413640 453062 483664 513187 535647 555628 553894 480832 444795 468757 522575 593282
16846 593282 644035 684576 706000 750318 773729 781522 718650 631318 533764 440341 400740 368879
16834 368879 308386 216679 168451 174988 179459 225995 261856 259051 187541 159220 163602 135486
16822 135486 118609 74957 79438 116043 153496 167620 165378 163875 156062 193844 246981 231809
16810 231809 210860 225078 188863 137093 145506 198865 237309 271858 280992 225670 292412 306928
16798 306928 287484 337156 459368 523473 445646 357843 377790 412629 376589 317691 239408
16787 239408 169116 115283 106318 102351 77197 29195 6506 46190 23002 41269 29916 11609
16775 11609 73438 73308 36047 28533 59501 102767 92102 84993 72705 98324 90491 117853 119932
16762 119932 110722 128185 133595 186346 232846 260097 334094 383605 322025 262030 247174 217699
16750 217699 183349 145872 136782 146014 185598 239257 330303 356629 364003 420789 414444 357858
16738 357858 244769 173683 182669 186379 171945 161701 153468 193929 218937 217635 211523 193960
16726 193960 189692 124741 106037 130011 127524 66003 89459 190744 263355 246063 246264 249640
16714 249640 252651 201457 181266 180292 172074 146689 165647 159940 177935 212695 260424 240529
16702 240529 243739 267399 310258 301216 267982 196953 159169 192463 167554 151432 127105 150152
16690 150152 142453 227722 277973 272871 247021 258158 242370 230777 226255 206821 170300 145715
16678 145715 172750 197787 152086 106532 146450 138729 124624 124258 184070 167375 162201 133670
16666 133670 83128 108457 117912 84449 85080 111914 144047 121726 105774 94701 84076 59021
16654 59021 91432 116660 82641 56042 35791 19852 50506 68723 107496 128020 165339 182375
16642 182375 100408 125773 126364 115439 111128 121823 147884 205213 196060 193584 250739 228020
16630 228020 179393 215050 360024 417095 372731 351604 323135 296513 284497 311349 298214
16619 298214 199907 168607 171375 220507 215380 210068 245268 248960 227373 201699 221376 241219
16607 241219 165128 93036 57350 57392 31177 30096 65244 91189 75012 91482 89081 89853 109212
16594 109212 114532 123387 121575 135259 152411 142566 106992 61254 49967 51048 33519 77579
16582 77579 80139 87607 103779 133503 158340 153784 180845 219947 204052 203976 202312 172290 159675
16569 159675 126562 56755 35270 28667 37372 119465 161273 131192 104367 148471 172230 113064
16557 113064 106562 112214 156260 142368 126219 152390 208584 235390 248630 224850 194685 180425
16545 180425 115613 95210 121171 121790 140398 168983 204942 199990 237298 265874 246416 206876
16533 206876 128104 96444 96347 90546 100894 125091 101140 47883 54046 55635 49750 69887 97639
16520 97639 143917 196371 235295 276004 256820 199951 214042 146911 82200 99359 125586 116269
16508 116269 90246 166967 206767 226429 290948 361778 430363 405007 352812 340308 333760 310900
16496 310900 301593 310843 340477 310741 226353 165599 170068 158176 121401 108192 94683 36150
16484 36150 78941 104647 122155 175695 241651 260749 209601 161636 138244 112698 111324 126003
16472 126003 126480 132718 112772 83764 36108 45619 66695 55434 28306 22902 20553 31722 58425
16459 58425 62965 122094 148331 108877 105246 53624 62134 111454 118895 140163 153096 139798
16447 139798 127153 116080 106061 93870 37945 26300 68092 62932 60730 63088 94329 125493
16435 125493 131153 156660 189410 258825 345164 450377 505176 618885 662347 651823 612781
16424 612781 506762 378308 288826 271553 225268 202324 220818 188395 105724 84029 83331
16413 83331 69168 104691 175023 244857 285824 258656 239229 233074 196931 232839 346552 441387
16401 441387 481224 431342 398883 330551 237641 220288 250135 253841 295045 355498 383229 383926
16389 383926 443007 480739 475630 453621 461721 489080 456176 368995 381702 336981 252804 242931
16377 242931 226438 204270 179981 188626 209199 196538 178016 189215 157905 136088 95067 85784
16365 85784 127117 151210 151158 156071 129672 108312 97530 97471 58217 40415 53145 65999 71379
16352 71379 38763 39897 66273 86686 108263 112768 95617 3545 -53834 -20335 16510 47403
16340 47403 63360 80408 105554 50650 -7804 -17968 16622 22231 42703 66108 68845 125021
16328 125021 116802 151518 193240 186058 184537 183220 205807 188906 160711 130485 113060 110366
16316 110366 94300 49233 77038 152618 137402 82360 80106 109704 118117 109292 84563 53659
16304 53659 67514 59472 43886 5388 -16062 15683 25592 37019 84757 83891 56840 35589
16292 35589 40962 37416 64128 41653 53818 55776 66723 45499 31462 59396 83344 117617
16280 117617 86944 79666 25154 1753 31032 -15193 -47190 -54181 -30591 -47780 -18339 17755
16268 17755 -15435 -23659 -23317 -16892 -46784 -60899 -55538 -83705 -69103 -68299 -94138 -50693 9767
16255 9767 18247 45285 74091 74073 91249 118368 153180 163878 145075 114527 157676 174015 84297
16242 84297 18550 -12052 12718 25913 70072 29584 42674 43939 39084 36616 57089 95345
16230 95345 159622 186613 135519 90366 105075 123756 64505 10760 -18961 -47177 -78917 -61131
16218 -61131 -27169 -62005 -84262 -78532 -57969 -33338 -8132 -34529 -74247 -58814 -54065 -51381
16206 -51381 -38887 -14452 -1140 -42454 -53087 -25819 -29938 -15897 -63534 -93708 -52179 9518
16194 9518 19281 29903 2591 -33991 -32996 -14773 -28931 -31682 -50213 -21367 32487 15541 -11810
16181 -11810 9009 64990 103678 101938 111542 63865 19681 572 -9034 3000 6255 -8283
16169 -8283 -61110 -40328 -2643 23616 48931 -5832 -24688 -4080 -13093 6489 31945 7457
16157 7457 -28146 -27480 25888 16447 -13666 -7343 19786 -1052 -8372 1302 -1404 31069 80117
16144 80117 91893 90401 52576 -40333 -79115 -61511 -42097 -36451 -27919 4809 6069 4060 21177
16131 21177 31136 35448 59681 47157 26460 -7092 831 5910 -15543 -34151 -42642 -58806 -41748
16118 -41748 -39891 -42292 -40649 7198 34043 6357 -45161 -77218 -89315 -65622 -45087 -41732
16106 -41732 11176 10279 -41577 -64339 -58035 -12531 12900 -10825 -49405 -14729 42904 46059
16094 46059 38287 96271 75409 76070 91757 56844 37633 21121 -13588 4322 7176 -31820
16082 -31820 -44171 -46537 -14985 26156 11310 -20376 -76079 -111442 -102111 -51723 -39244 -22175
16070 -22175 -20728 -15699 -16622 -27073 -13034 8363 48197 101500 82421 61554 39206 -10315
16058 -10315 -56705 -86641 -68777 -50747 -42424 -6756 38025 38648 -20247 -33830 -4733 -29873
16046 -29873 -50445 -72322 -106120 -76224 -18772 -22968 -83715 -101126 -106112 -156011 -193778 -166654
16034 -166654 -101942 -6003 41851 52996 18787 5905 12838 -7615 -44574 -63568 -54040 -47896
16022 -47896 -28977 -9942 -18550 1992 -16569 -54786 -57232 -90938 -60834 713 44870 10910
16010 10910 -39688 -42465 -70742 -76685 -93774 -64877 -35710 -21442 -30535 -105887 -163079 -141363
15998 -141363 -68811 -12225 -31873 -49803 -37970 -32530 -32009 -50202 -34832 -33255 -57579 -33286
15986 -33286 -11719 -13159 -32874 -58011 -71182 -72422 -49407 -55992 -53489 -4297 19146 36363
15974 36363 7160 -9257 -9170 -37163 -39186 -4662 35897 8299 -30724 -44253 -56417 -33612
15962 -33612 -7695 -35132 -27689 -26359 -48019 -13556 9231 14906 6246 -21802 -26943 4382 -24079
15949 -24079 -19060 -39120 -73027 -70858 -60282 -123826 -69902 -8276 35702 44925 15187 -46052
15937 -46052 -27408 -7299 -38520 -40350 -7764 -28943 -61578 -39717 -52643 -34645 -34591 -57894
15925 -57894 1241 36193 -13477 -81588 -74767 -70816 -23231 -14680 -1050 -40943 -80958 -81889 -107934
15912 -107934 -76261 -106617 -108456 -76754 -54384 -69931 -52988 -108094 -37291 9555 -14715 -21277
15900 -21277 -17181 -5797 -29703 -26045 -68089 -68009 -50419 -21238 -37378 -51315 -20775 23756 35677
15887 35677 11553 -18813 -23826 16550 5747 -3308 12453 -2554 -26076 -75353 -38402 -3101
15875 -3101 32811 25644 -30270 -30841 -43792 -63792 -81275 -40552 -2972 732 9090 -15971 -41910
15862 -41910 -10648 16048 1901 3872 -15175 -16917 -21300 -54150 -108061 -132678 -136000 -79547
15850 -79547 -73675 -63753 -43292 -100500 -124295 -96126 -57659 -23217 -38363 -5674 43857 57759
15838 57759 40616 6835 -28376 -36705 10376 25868 9409 -31245 -52561 -28852 -33471 -29961
15826 -29961 -33385 -67978 -111453 -88977 -82333 -58984 -29508 -9632 -10628 9930 4413 -22815 -49409
15813 -49409 -72974 -85707 -62737 -53969 -89141 -113335 -104274 -82075 -83609 -87890 -25478 16318
15801 16318 39334 6259 -24000 -27788 -21754 -17038 -32314 -18935 11936 -6354 -47242 -64458
15789 -64458 -76736 -86818 -37883 21221 -11982 -43939 -29367 -9573 -56173 -87007 -48335 -2520
15777 -2520 -24292 -44269 -53144 -74767 -56782 131 -18155 -58530 -35689 -47738 -19959 11602
15765 11602 29577 -4433 5720 58621 78883 31550 -46202 -77808 -87201 -96527 -116291 -92909
15753 -92909 -34976 23754 7800 -46275 -30402 39013 67425 20561 -7484 27138 12733 -16165
15741 -16165 -52006 -48822 -12188 -8779 -15513 867 38516 83921 100845 63926 61312 90945
15729 90945 122210 125166 143055 146382 157660 188305 150828 95917 14082 -3095 38386 59749
15717 59749 54669 40294 54149 65561 39693 57460 118617 79029 53292 68949 135325 128291
15705 128291 109263 152333 161274 172551 167254 135963 121249 108361 97616 64932 25931 -2878
15693 -2878 -35049 4073 34266 29493 42126 56664 51603 5982 9050 13407 -13700 -24693 -15961
15680 -15961 -61168 -74049 -46189 -31534 -48877 11308 17496 35285 5497 -27455 6616 -8243
15668 -8243 7349 -5865 -7888 -29535 -59591 -59839 -579 -4418 -43268 -25540 -4884 7503 -3988
15655 -3988 3929 36865 29796 -1671 -19782 -21 -39413 -58096 -16663 5104 13676 -1948
15643 -1948 -2621 -1937 21450 31590 -12925 -18603 -20066 -21472 -7407 -4655 -622 11246 11588 6705
15629 6705 -51223 -88068 -53016 -41832 -58231 -14791 9852 15163 -12213 -68701 -67344 -52786
15617 -52786 -59321 -89762 -74501 -44395 -41813 -37051 -33158 -43998 -75356 -28596 11580 -4259
15605 -4259 -32354 -30174 3655 2648 -11981 -41960 -32521 -37846 -5221 869 -28686 -589 -39944
15592 -39944 -55516 -69301 -42894 -20021 -7463 25308 33398 14435 -33080 -74610 -32913 22274
15580 22274 75073 75276 43338 23022 7400 -30858 -11072 -24841 -50787 -54787 -49745 -50431 -74671
15567 -74671 -114494 -93596 -44334 27137 16241 -3722 -27508 -2388 27829 -1953 -22440 -67650
15555 -67650 -65455 -22493 20447 -9526 -69825 -134700 -125428 -51491 -400 -60718 -94094 -85233
15543 -85233 -63565 -40914 -35598 -47737 -41609 -57347 -64545 -34429 14256 42491 74086 60838
15531 60838 11649 -38252 -37751 -62480 -19976 3391 -8512 -11162 17573 -11284 -30998 -9272
15519 -9272 -37220 -10916 72653 83298 69859 32858 3387 -3092 -6390 -4888 -3389 -213 -18815
15506 -18815 -23990 -36252 -10579 -12556 6803 24870 19807 -2842 29093 74309 54317 53555 57312
15493 57312 7002 38022 113009 159631 184191 131914 117503 150369 207161 329567 399765
15482 399765 435605 512331 600996 668350 773774 900677 854288 820004 750063 667123 595421
15471 595421 502023 366121 327108 265381 182540 162329 161181 102192 105386 135461 153995 113501
15459 113501 52938 12694 8149 42371 48816 44886 4352 -5278 267 16095 18874 -15910 -41940
15446 -41940 -11781 -3200 -48082 -95018 -11694 32266 -19653 -42782 -71173 -53920 -19280 -19085
15434 -19085 -2815 -9101 -23047 -1793 50166 18987 -46170 -50188 -51517 -75765 -44863 -2768
15422 -2768 30157 44111 59269 44570 33127 6954 -7767 -6110 -45294 -69557 -56265 -35734
15410 -35734 -34957 18490 -12879 -65926 -77133 -42476 2274 41720 43050 21835 -3174 -31642
15398 -31642 -7785 15933 27292 11191 -12962 -49942 -58192 -68706 -52050 -13508 -40578 -2830
15386 -2830 24494 15167 13477 -1940 -52205 -106315 -114607 -103785 -111668 -103595 -44057 -42805 -72743
15373 -72743 -65577 -91628 -105608 -101594 -74128 -44679 -10420 14805 19756 13251 11451 -7919 20618
15360 20618 -7581 -34894 -32210 -46986 -51306 -38874 -51352 -65459 -88776 -102206 -133379 -109199
15348 -109199 -19465 36625 -37149 -80179 -54288 -50498 -91855 -131453 -97042 -49407 7505 20933
15336 20933 -1092 -46662 -69003 -66845 -71378 -83277 -98501 -88482 -44854 -53518 -14400 -25208
15324 -25208 -44838 -19494 55248 25391 -37380 -15291 33010 73102 73727 41034 -29933 -76056
15312 -76056 -68338 -21890 -24558 -64925 -88657 -54413 107 2128 -40404 -67281 -48789 -64790
15300 -64790 -66686 -59723 -18216 -45945 -63660 -23012 -36869 -50036 -34392 -56336 -90538 -39900
15288 -39900 -18580 32928 -11944 -44351 -64511 -51584 -62165 -77381 -93955 -98576 -84870 -64842
15276 -64842 -47005 -60114 -53092 -43192 -49329 -41276 -66536 -69821 -73673 -86681 -57870 -18936 -24025
15263 -24025 -20274 -37347 -79915 -150783 -151660 -128347 -57415 15206 55808 46857 17244 5157
15251 5157 -22193 -1061 10009 -4380 -21259 -20292 34361 105195 104647 39016 -2752 8007 33010
15238 33010 19905 -12469 -62723 -90055 -61739 -44501 -53531 -44613 -38423 -51720 -65829 -34685
15226 -34685 -6683 43471 58495 25826 27851 53798 20398 -64577 -63547 1486 -47689 -98795
15214 -98795 -131488 -146080 -160167 -93121 -49597 -48662 -70423 -103786 -134333 -109333 -94056 -108199
15202 -108199 -119826 -77419 -3367 2917 8076 24124 62845 53276 9698 -38544 -49768 -10330
15190 -10330 -8420 -16375 -10929 6405 -18228 -38571 24478 63427 9118 5362 7003 -25712 -37779
15177 -37779 -57093 -50090 -45104 -28215 -20363 -48533 -43838 -38320 21717 17884 4358 -8574 -30409
15164 -30409 -85019 -90026 -58383 -29569 -15242 -10846 -4820 -82165 -125271 -79891 -51887 -25889
15152 -25889 -5104 3228 21182 4964 -15079 -23870 -50026 -45401 -18551 -27003 -52029 -78893
15140 -78893 -39769 -3841 -738 -52178 -77593 -91735 -61578 -32586 -12021 -43597 -56424 -15512
15128 -15512 -685 6685 35168 -2150 6929 51674 40624 2525 -50778 -74808 -35798 13174
15116 13174 8790 -19333 -7850 26560 14843 -23215 -6498 17120 -28852 -84834 -81152 -30189
15104 -30189 13728 13644 9880 -9480 -638 2582 -22468 -9205 25920 -28779 -44492 -59900 6592
15091 6592 44390 76010 57320 40246 46633 -7463 -67928 -61641 -35168 -45325 -82363 -112986
15079 -112986 -83463 -54380 -22926 -17210 -49145 -65172 -72329 -73692 -72206 -47283 18278 21973
15067 21973 -14416 -23491 -15712 17308 45029 47422 36283 24137 -13270 -7972 38500 45689 77942
15054 77942 40049 4024 -43084 -14445 23156 -10847 -24865 2448 8611 -31324 -58733 -66645
15042 -66645 -23795 -10973 28494 33503 18640 -53302 -98347 -89266 -86174 -98323 -52361 -51819 -43950
15029 -43950 -28320 -6565 46258 54657 44365 2553 -78346 -122496 -111443 -63559 -83565 -67275
15017 -67275 -39042 10630 13579 -1246 -33480 21655 72746 32679 -711 -26274 -3289 -1088
15005 -1088 28288 68057 1166 -28920 -11407 -11734 -22940 -31417 10515 31133 -3445 -52162
14993 -52162 -28995 18596 15756 -34542 -79949 -90111 -74978 -68597 -39931 41912 59957 28077
14981 28077 5315 4191 9623 -27936 -13089 24221 27444 2000 -3999 -3905 20359 20218 -31371
14968 -31371 -72941 -82373 -71074 -88252 -108907 -81460 -62516 -35566 -63747 -124072 -129915 -77204
14956 -77204 -72786 -67917 -33673 -18199 -59411 -52157 -48666 -87993 -100932 -90061 -65866 -21086
14944 -21086 -38705 -81023 -93179 -58823 -68382 -14530 -27406 -97754 -140280 -61955 -2426 28633
14932 28633 10559 32790 17525 27757 70393 32826 20074 -31966 -62719 -104263 -101915 -39180
14920 -39180 33101 59329 22253 -5003 5034 54082 65940 90364 59939 37501 16941 -36997
14908 -36997 -30193 -42206 -82852 -88395 -84574 -44420 -33220 -69838 -75205 -53581 -5485 -43795
14896 -43795 -53984 -28844 1557 10343 32629 48668 45747 11315 -29564 -53293 -43201 -23669
14884 -23669 -49106 -74773 -73171 -41502 -46377 -65118 -30172 -39429 -69468 -51471 -109021 -89688
14872 -89688 -49091 -104556 -88861 -122292 -115397 -65766 -53399 -46986 -73113 -98531 -49919 -48169
14860 -48169 -75503 -72366 -54595 -59053 -33960 544 12310 -3420 -4691 -3055 -30746 -25572 7873
14847 7873 46596 68301 56285 16712 1385 -13426 -41974 -5146 16402 24086 -16852 -41356
14835 -41356 -82898 -87509 -72753 -46011 -94652 -73601 -66826 -47430 -39219 31682 61330 42583
14823 42583 -32241 -64573 -49912 -22405 2988 519 -6528 479 3942 -749 25047 23567 1119
14810 1119 23245 41712 68540 20953 -49366 -68928 -52334 -24165 23741 60861 62624 -7844
14798 -7844 -47450 -30372 -21542 4532 48240 43736 43511 12092 -35045 -16395 3020 4846 -5141
14785 -5141 -55446 -83850 -93520 -46773 -10394 4648 -811 5436 15805 33766 45030 15192
14773 15192 -54865 -91580 -100554 -92217 -68287 -37366 -29975 -53976 -13808 -20023 -65364 -69537 -51121
14760 -51121 -62521 -88935 -25301 -15860 -29387 -17111 -59394 -30428 -843 25353 42211 24059
14748 24059 21641 -13694 -60069 -43699 -19460 -26200 -45829 -36516 -14979 -15103 -47920 -61608 -86012
14735 -86012 -105753 -106784 -92673 -60411 -31917 -19817 -4552 22491 25292 12484 2610 -39817
14723 -39817 -79400 -17148 30905 41443 82129 56042 -31500 -50576 -76884 -75442 -39759 -39014
14711 -39014 -51487 -81392 -109117 -112514 -48151 -31213 -43590 -60171 -31073 -25657 -13737 -16372
14699 -16372 -30672 -21525 17656 80175 61910 48813 40748 41754 7995 -24918 -75262 -51909
14687 -51909 1342 -22550 -91972 -85157 -35622 -99189 -107260 -62112 -18179 -38281 -39117 -19891
14675 -19891 -22029 -56 60518 58909 32870 -1909 -22161 -10969 7508 11324 -16529 -34522
14663 -34522 -8426 7863 1039 332 13290 -32797 -46596 -40712 -50731 -48452 -11656 -18054 23713
14650 23713 33864 26555 46443 54461 57376 22795 -66386 -81951 -62697 -42193 -6940 -37983
14638 -37983 -59163 -42835 -40312 -51579 -54207 -48719 -74606 -19319 9732 -12552 -1444 747
14626 747 3289 -5872 10658 21013 8707 23411 41081 33425 27887 -9368 19714 52186 -9165
14613 -9165 -84338 -76670 -47342 -10444 -31897 328 -19772 -41086 -36492 -28331 -9650 57541
14601 57541 45945 46999 42796 58754 70722 74168 14585 -16070 12454 27207 23919 24017 7599
14588 7599 -18188 -39178 -54563 22849 87457 89583 79911 89187 83137 39270 33738 71378 62934
14575 62934 37744 39234 29608 64476 27893 36338 98688 102067 119253 124426 167354 224443 206805
14562 206805 213509 280352 337108 380389 445768 588315 747712 967261 1180536 1347607 1336750
14551 1336750 1207973 1040091 859102 731562 603403 485581 423892 328376 232388 164335
14541 164335 156272 143363 93304 27119 -5860 -18275 -19655 -46352 -35049 -9599 17939 48232
14529 48232 15272 -18249 -18671 8657 4567 -57239 -77322 -89248 -64775 -22885 -6707 -4673
14517 -4673 -49075 -43833 -14718 -16872 -43208 -69826 -58475 -13037 -33112 -55038 -55064 -84864 -98451
14504 -98451 -51357 38129 51354 15730 60990 93426 96922 62104 32170 11140 -20215 -77765
14492 -77765 -70073 -87533 -102444 -57454 -28489 -17160 -8344 1939 37067 65988 50961 91468
14480 91468 105453 64967 49714 19515 -2773 16881 18120 11435 -27843 -12937 5963 23257
14468 23257 34947 -27316 -38161 -1651 37172 20411 11373 7465 30658 21558 -1756 9621
14456 9621 35780 66259 60210 36108 22128 7356 15735 36915 43526 49373 61126 63951 85574
14443 85574 89324 55237 84084 84157 54990 12273 900 26554 45493 22175 -7903 16747
14431 16747 31885 17989 9242 6111 29363 66678 46008 73635 74757 100899 162544 153106
14419 153106 105535 48092 27278 81516 89166 100031 82178 59314 47091 6612 20708 54323
14407 54323 87736 85549 78455 75673 90414 109371 97263 139198 175968 124963 88499 143243
14395 143243 166237 119668 96259 57421 54985 68840 87717 115015 98688 20065 -18710 -4724
14383 -4724 11555 24092 6721 -6653 -50932 -64625 -32400 -31137 -10352 28070 76066 116733
14371 116733 109703 95295 41595 -25391 5512 6297 9932 23029 45547 63130 95432 37172
14359 37172 -712 36209 36563 41733 70063 28687 -9239 -17763 -24540 36098 86953 93313 71954
14346 71954 26418 33925 76646 94783 95792 96055 33377 38627 72006 71872 45197 37274 36533 54603
14332 54603 90747 111067 172215 203956 151165 142975 140154 111997 146420 185775 166770 153833
14320 153833 142437 81683 67210 95664 81218 71208 55876 50865 77214 69419 44948 57251
14308 57251 87728 122070 89270 32861 2655 51083 82359 69057 84842 66369 70682 31870
14296 31870 -1588 -8820 -2088 -20753 -5139 23691 25008 13860 -18580 7736 42160 47931
14284 47931 57225 56395 50657 12216 -3232 -15211 -21939 -22719 32266 59227 5131 -76257 -182577
14271 -182577 -185686 -201649 -184374 -120304 -66144 -55896 -75100 -45580 -32252 -39339 -24297 39273
14259 39273 68074 45213 21047 13043 -28177 -31178 -63574 -60607 -25277 65301 155377 170459
14247 170459 140310 186851 197689 178287 134055 107151 93353 91870 103323 101310 72986 52147
14235 52147 41041 40695 42631 53173 63916 69431 59221 35515 45660 40916 75309 113161 107246
14222 107246 87838 177618 249212 227238 125750 104140 168028 199321 210922 202485 167709
14211 167709 174020 228644 231553 303696 332265 447235 611785 728156 779682 773067 706207
14200 706207 593892 441501 305613 181388 133250 128682 148717 124282 85178 147141 174825
14189 174825 220991 233092 246225 141535 119394 148105 166425 205934 265593 279978 284937
14178 284937 284148 283953 307988 334145 332303 289718 231153 172420 177880 186658 219288 232553 221117
14165 221117 252656 242047 239964 217572 159515 158934 176013 200684 238333 226659 237140 266190
14153 266190 256473 271030 281358 313738 370735 397447 379175 377529 395147 379129 361436 366845
14141 366845 412579 483034 531927 496292 506616 518963 478216 427318 442840 497286 526609
14130 526609 542546 583670 597561 599813 643829 688764 759023 783043 836615 870339 874170 853267
14118 853267 872111 945800 948414 976762 1080695 1153018 1229497 1304719 1359537 1454644 1531965
14107 1531965 1696443 1834030 1916829 2031446 2218841 2417957 2576821 2737293 2944962 3273543
14097 3273543 3603492 4030872 4460172 4902435 5554351 6356801 7328099 8524547 10080659
14088 10080659 12030035 14371580 17049164 20068429 23857129 29170456 37143829 49388591
14080 49388591 68400375 98137821 143239237 203087315 260195318 284517672 264884752
14073 264884752 217678862 165387085 121187981 88362006 65503879 49945003 39338508
14066 39338508 31981758 26647501 22595014 19232902 16344448 13832659 11716509 10021290
14058 10021290 8628957 7548714 6701462 6009464 5427029 4917367 4492752 4107475 3736358
14049 3736358 3391098 3101133 2897862 2692558 2492039 2305756 2143609 2002657 1923891 1859360
14039 1859360 1777867 1677587 1614420 1575921 1512720 1471192 1408965 1314646 1223949 1116665 1093336
14028 1093336 1035271 1013109 1021157 959896 877515 812848 833800 824831 821512 828036 778995 745514
14016 745514 756043 774911 736086 697086 652322 611173 599671 591412 575823 566545 566348 605748
14004 605748 632998 565063 511267 557078 583315 612295 614020 622951 568893 533880 528323 522081
13992 522081 497437 508008 603525 666709 712867 833044 1066325 1376065 1624658 1778382
13982 1778382 1718535 1498492 1153358 949299 799006 677014 600371 536693 513768 479288
13972 479288 441519 410185 394796 385229 394191 398741 374850 301469 278891 260462 244301 269288
13960 269288 303816 334813 354480 401531 448660 490556 513908 481966 450789 426618 403499
13949 403499 405161 326621 281462 261460 247299 238283 248491 192312 152230 142810 192061 168711
13937 168711 113892 105785 98189 148085 210328 157489 103866 99321 123674 142836 207435 235022
13925 235022 210139 190368 230770 269034 282128 286556 280303 249807 244698 241725 210992 221152
13913 221152 150351 101468 141396 137984 115908 117549 121290 144120 95517 85330 87238 97233
13901 97233 85660 95911 128601 139088 140966 134005 153865 188404 231233 266630 291059 324926
13889 324926 314813 262975 174165 155516 153253 158641 168278 165629 155059 195784 225733 215535
13877 215535 139842 104320 90295 45826 53586 56897 61485 40585 63279 60157 60791 106414 121161
13864 121161 104602 124557 144350 104948 81881 76863 91305 106960 134102 140966 130857 94319
13852 94319 74931 90344 106169 111575 88773 79957 127408 134763 95286 76834 79653 90115
13840 90115 122770 86630 84651 56306 48585 111956 163150 194958 233668 181475 114054 83020
13828 83020 81981 108922 145753 161196 173426 168251 142054 155659 165201 180278 188225 188874 199573
13815 199573 178056 151499 128850 132926 105464 101414 120971 135632 111904 125530 178050 177767
13803 177767 168600 149903 128836 120039 94560 136972 170596 172870 140488 117397 131677 144737
13791 144737 187415 202694 174912 211826 259381 243257 250784 204862 198226 213765 186852 108736
13779 108736 108509 105537 98577 131302 157155 164504 201949 226991 245715 194633 156210 67273
13767 67273 65533 106911 118968 115264 80287 61211 91017 177533 195605 161505 149058 121167
13755 121167 75474 69319 86987 102263 50258 57211 77750 89843 81317 74622 113645 97147
13743 97147 54855 -22311 -31549 43323 59372 43734 92731 89272 46635 35948 39245 34170
13731 34170 43638 51925 77523 106601 127282 114472 82799 80354 113243 116597 75794 78623 92174
13718 92174 102336 140520 143145 132401 110281 39107 -33343 15365 35337 44594 38867 23864
13706 23864 33393 62419 72270 42393 56897 80026 44348 28629 90229 137763 122612 84618
13694 84618 63926 -5104 19642 64113 42821 1453 25789 81 -26267 17779 29913 29379
13682 29379 10803 16348 67370 68003 41373 6904 74395 91131 73371 54101 45801 97437
13670 97437 107132 74577 97627 111227 185821 236989 202276 171262 147238 120513 119089 141527
13658 141527 140700 133266 121078 126161 106117 77396 79097 103432 117101 108178 146651 191850 183563
13645 183563 93332 79701 108479 103116 99012 83715 65656 58137 65174 41658 19099 9149
13633 9149 -16292 -3827 -9856 964 10631 27737 36290 35094 55985 98943 119053 95033 37977
13620 37977 78689 101309 92627 89233 95337 115523 176551 235128 247324 250771 235605 200999
13608 200999 172117 225646 257012 316873 338697 353229 346947 361710 388971 399064 434915 457384
13596 457384 555570 689912 899961 1104607 1250927 1369862 1386419 1297499 1124348 928474
13586 928474 752772 640632 540960 426501 339283 279756 291993 285400 252434 183779 136652
13575 136652 132863 149714 134179 127710 157711 138272 104852 157963 159186 141700 126496 154097
13563 154097 164377 194227 277821 307483 286893 211282 189578 174193 179061 149918 137796 113035
13551 113035 166888 176577 202727 281178 290371 291973 281296 284401 254811 222763 181264 137691
13539 137691 110758 114181 180625 198765 238336 324531 340938 287326 315837 324467 334507 334082
13527 334082 353485 348406 329168 297361 282663 276917 231355 163975 132246 95994 103382 82026
13515 82026 58751 30473 21462 42459 63008 53882 100279 146784 149365 186553 247470 276579
13503 276579 265619 231636 179495 185054 224307 258411 270877 321412 298594 243205 220793 224481
13491 224481 225672 207848 187391 121719 94449 103985 118625 149782 108463 96027 140952 111374
13479 111374 80056 55136 59769 21444 -8280 -40108 -19571 32181 43255 77169 81668 40128
13467 40128 55516 68017 35976 14869 15640 -13665 3585 24338 39896 27062 75365 145974
13455 145974 122960 132863 107128 85556 92713 68520 43990 7889 91660 111541 69422 40105
13443 40105 5893 38226 53737 24445 3730 2020 26376 38299 18937 8933 15858 26229
13431 26229 47392 45986 89174 123428 61754 38077 49541 32966 17741 -2019 -10431 8768
13419 8768 13282 13905 -1151 -19565 -3357 59205 46137 25732 13743 -19529 -443 2488 6852
13406 6852 51355 22901 -14542 15443 48610 12134 -57 -28133 10332 72867 52431 69053
13394 69053 132836 240211 309692 396588 409884 329582 227020 178104 144267 136382 156479
13383 156479 146915 103566 151919 164693 105391 63931 37194 34482 35023 5142 4933 43211 31584
13370 31584 -18205 -47605 -34017 -19403 -3842 21917 42598 10787 27939 23676 6515 15901
13358 15901 -5384 10310 18000 -1130 8284 63074 35528 -6886 -833 -9422 9340 -27 -35125
13345 -35125 -13955 10944 3895 34066 67726 65031 51097 2898 -39702 3526 44747 55904
13333 55904 49572 63842 86862 116254 110365 122133 94796 31923 -37959 -13456 29604 35798
13321 35798 47180 34692 25641 2268 29556 49161 12076 30705 19597 1660 -4899 22972
13309 22972 19525 20045 17002 6264 -2362 -11511 2466 -9603 -53092 -64680 -88072 -21616 -41287
13296 -41287 -86272 -90100 -27068 21146 32059 -261 -13610 2554 44369 31651 -15015 17736
13284 17736 32113 -29859 -58582 -82080 -75439 -17612 28777 15515 55737 57055 37463 29659
13272 29659 48902 60551 32316 -3084 -7393 19993 30529 29273 38286 -3545 -11669 2062
13260 2062 -2447 -14033 34952 42919 44686 20126 22071 -20519 -23857 28947 44350 53559 43017
13247 43017 54062 52319 87412 76964 70954 33469 3766 4403 6236 -8351 16836 -3796 -50124
13234 -50124 -66811 -77496 -35318 -14705 -38630 341 25603 23190 32498 26982 -4180 2527
13222 2527 5281 3396 14249 11477 45613 49363 4989 -25838 -8980 6435 -37628 -23473 16177
13209 16177 15615 5246 -22615 14602 29864 20079 -41671 -27954 -229 -11362 -36062 -49470
13197 -49470 -42312 -35089 -52165 6109 14652 -46953 -44655 9067 42079 38626 14072 -12928 -13012
13184 -13012 17950 35386 72121 54686 37851 51857 33271 17329 903 -14760 716 -4749
13172 -4749 -58626 -51679 -8681 -7434 -42074 -40745 19117 22010 43366 69105 70396 55112 70824
13159 70824 57968 9544 617 25829 84081 61952 33756 30159 25593 36314 17839 11562
13147 11562 -16383 -39128 -31671 -14623 14206 73993 95736 48939 5945 34273 7613 30378
13135 30378 65785 85502 87386 24601 -43346 -74043 -25809 19951 76866 74250 24228 -13568
13123 -13568 -3850 7442 30852 -1847 -27100 -59697 -57467 -32294 -28055 -20351 42295 -12057
13111 -12057 -35208 -52033 -21976 -2262 18512 31448 -5203 -17887 -3612 13354 7536 35314
13099 35314 40886 41632 40487 -9217 -9349 -12477 10713 35525 25108 15705 14443 36637 42400 46413
13085 46413 51605 37210 85351 99050 33713 11818 16298 18860 54657 58263 55913 42643 36179
13072 36179 35198 -14530 -50170 -57088 -83532 -24885 -1994 -44517 -24277 17760 21867 10899
13060 10899 25704 39209 36439 38476 50621 80947 22073 -23021 -15263 -36464 -53906 -31815
13048 -31815 -3815 19511 -14861 -73167 -63445 -56322 -47076 3636 10292 -37716 -71393 -80755 -80075
13035 -80075 -31679 -13916 2973 -32801 -64135 -44940 32890 47012 2973 -13066 -32465 -36318
13023 -36318 -48618 -11264 72857 82142 39082 35403 -771 -50979 -69981 -39612 -8227 25436
13011 25436 6589 43266 -12105 -69044 -74562 -29915 -21515 -21915 15626 -7420 -32555 -48656
12999 -48656 -11753 58204 17678 10677 38752 18568 -53084 -46134 -28626 -67564 -91924 -81818
12987 -81818 -63985 -11812 20923 36057 55965 88452 38284 29071 -8591 -9135 2482 29136
12975 29136 34376 -25176 -77107 -60959 -30343 26144 21133 -4600 1891 32007 13459 8811
12963 8811 4402 20343 10663 48591 55495 82167 74340 40871 -4337 -8212 21754 16111 -3111
12950 -3111 856 42755 37233 2590 -18829 -63213 -53664 -25697 -28134 -66846 -96026 -69066 -56502
12937 -56502 -82267 -55668 -69993 -83223 -22300 22416 32835 40739 -5648 -25381 -19270 17820
12925 17820 17051 18725 -11370 -17709 19171 60931 9242 -29582 -12775 42257 25203 -20268
12913 -20268 -11360 -3703 -46265 -83572 -40102 -17177 -24783 -1885 9621 -60112 -75936 -69476
12901 -69476 -60741 -26590 19086 10886 -2456 23547 28662 15856 23801 15051 -4931 -19166 -15106
12888 -15106 -24561 -12503 -11749 -27006 -55288 -22550 -58030 -63062 -63230 -45959 367 -5735 -36915
12875 -36915 -58423 -78824 -76475 -50813 -63284 -72830 -61629 10500 18664 29005 13614 50105
12863 50105 60361 23494 20796 13849 15032 16349 5308 -1402 -1935 -22228 -42975 -23172 -4818
12850 -4818 -15596 28344 61031 63460 34566 -19037 -22590 -28574 -7451 26864 14416 -30005
12838 -30005 -57511 -82713 -84988 -57715 -27510 -16558 6762 -30813 -27343 -35950 -53393 -49707
12826 -49707 -29363 15456 -26605 -75073 -109049 -102181 -102002 -68176 -53475 -118155 -147295 -91522
12814 -91522 -68677 -7936 62965 51752 12023 -54778 -38972 -57229 -100774 -57262 -5072 -30386
12802 -30386 -50043 -36557 16669 432 -23753 -8318 -2174 -32911 -58183 -30180 -21624 -69919
12790 -69919 -84348 -71366 -67945 -80038 -40847 -5868 -59106 -45506 -49415 -52723 -80341 -58165
12778 -58165 -20918 -44115 -37021 -21982 493 28105 29468 10013 25365 21682 -2785 -41991
12766 -41991 -38878 19646 44195 6277 -13164 -12482 -37034 -5197 27306 24268 12440 -1232
12754 -1232 16451 17363 16044 5132 -29104 -49142 -14479 -10043 -25896 -33562 -18502 -47449 -69056
12741 -69056 -41796 -18482 6417 19496 -13865 -33061 21880 88495 69107 60293 31106 50959
12729 50959 84097 85916 67965 48787 -7001 -47431 -50504 -16306 8286 27668 -23245 -23297 -31440
12716 -31440 -37101 -13628 -69230 -31395 -4463 -8397 -37936 -19958 -44726 -54762 -57470 -6086
12704 -6086 18896 7803 -990 -13041 -12487 -43193 -65836 -42776 -18568 6469 -9110 18811
12692 18811 63989 58371 -561 -92924 -128224 -96197 -58551 -4309 25597 24672 -12171 -48020
12680 -48020 -1754 9298 -24182 -63443 -3468 2701 -13876 -81658 -77642 -91341 -90065 -20750
12668 -20750 -31496 -39286 -17473 -26959 -55290 -79806 -89955 -74632 -77620 -122070 -117051 -128999
12656 -128999 -89315 -49180 -40493 -13231 -7297 -3441 -2544 9826 17475 62804 53295 -34962 -59966
12643 -59966 -45675 -33135 -38400 -12899 -10681 -50648 -44491 -2985 -39314 -51504 -16032 48341
12631 48341 25693 -28048 -41286 -26971 -14240 -17606 -63309 -111254 -70565 -33379 -7390 -10985
12619 -10985 -32261 -72898 -125295 -94894 -49666 -9525 -18214 -36839 -39685 -2936 1732 -31971
12607 -31971 19990 17458 19804 11122 -26022 -64813 -33949 -78404 -130085 -98607 -44373 3144
12595 3144 18982 4555 -6881 19753 17316 11473 -19613 -51521 -10438 31210 12266 4609
12583 4609 70510 85700 58978 37647 25828 -9314 13941 6621 -22430 2417 14517 -600
12571 -600 29474 2486 -29048 -18110 -14947 13244 57297 43963 6171 -50762 -94794 -69323
12559 -69323 -40743 864 -22393 -25741 -10021 19147 1244 3477 -6334 1376 60 -26590 -14757
12546 -14757 -18312 -16859 18095 7791 3391 -15107 -710 -19825 -6452 -33746 -81492 -80993 -63231
12533 -63231 -36356 -54249 -44837 -42129 -19899 28844 23840 -27346 -46748 -22669 -3365 -15782
12521 -15782 -16029 3292 -13038 3366 -21506 29972 36139 10555 -19907 -40400 -61241 -58480
12509 -58480 -46952 -14237 -39213 -48689 -52688 -53290 -11595 17625 -4665 -7468 -15274 -24087 -29626
12496 -29626 -45661 -17580 -21267 -53125 -76142 -55712 -27957 31910 40445 57351 23047 -316
12484 -316 -8245 3689 -6973 -14411 5610 5829 11635 -17338 -68905 -64205 -20968 -19463 -39518
12471 -39518 -38742 15651 81404 72932 57394 42958 44295 24966 12487 -21614 -35091 -21436
12459 -21436 -56762 -50127 -50394 -68614 -86132 -95541 -63966 -47732 -43624 -22848 -74688 -111301 -96128
12446 -96128 -125052 -160261 -142046 -116353 -114909 -91453 -88004 -43607 1603 -2037 -28471 -26541
12434 -26541 896 -43946 -17728 57913 55209 5968 14349 35533 24731 -42893 -43253 -42184 -28972
12421 -28972 20370 54965 42817 4585 -2328 14376 -55295 -63416 -47432 -20055 -39410 -90666
12409 -90666 -68369 -30924 -47675 -47267 -60857 -54349 -10226 7188 -42293 -89083 -55611 -61040
12397 -61040 -56116 -60396 -45526 -29623 -22291 -22147 -16771 -13061 -21301 -30476 -20365 -37163 -29062 1429
12383 1429 12681 -34146 -112604 -60082 -18291 -26478 -34342 -617 -13343 -32406 -55221 -67008
12371 -67008 -97758 -79627 -81453 -96668 -104854 -78012 -4120 3670 -95959 -147622 -90676 -84668
12359 -84668 -84738 -100965 -100436 -52077 -33147 -52579 -82384 -91641 -76917 -37946 -16071 -32813 -23651
12346 -23651 -1045 -8792 12096 21469 15556 34222 34468 22966 -17392 -49294 2799 1169 -37930
12333 -37930 -42849 -37786 -11347 6558 49996 45083 75389 69729 43083 -4655 6516 -37254
12321 -37254 -24217 -313 -11344 14649 30292 36227 19151 19963 39995 32102 35931 2958 2586
12308 2586 4146 16631 2679 -2936 11644 -3529 -45028 7968 42629 7949 -52699 -47949
12296 -47949 -67155 -58021 -53767 -37492 -78103 -57924 13821 52737 42811 27877 -16545 19880
12284 19880 51839 42993 4997 1112 5582 9453 17934 22272 31541 -22417 -44360 685 -47682
12271 -47682 -26156 -10059 28347 51071 29387 31545 33221 4100 -7404 14186 -3935 -28985
12259 -28985 -54465 -47498 -22189 -33568 -72101 -72738 -65055 -71645 -93611 -62666 -20684 -35866 -40302
12246 -40302 36004 37889 19403 -24518 -3548 2271 14784 9923 -46492 -50302 -46824 -47425 -41190
12233 -41190 -13265 36950 -16321 -65334 -108118 -38690 -4210 -24016 -27082 -3181 11303 -25057
12221 -25057 31464 69684 73780 34918 44167 30399 -19786 -50868 -71697 -56192 18310 22362
12209 22362 27213 28119 -5453 -43884 -11093 51559 36858 54900 74913 45179 11956 24756
12197 24756 26965 46380 45507 17436 6088 28566 67011 86469 106397 85503 78113 67894
12185 67894 19634 47068 43315 44150 25135 50069 96173 106183 84884 90477 92927 118940 103447
12172 103447 98846 90445 67024 22787 11349 7389 -9352 -25075 9413 18220 -12538 -3635
12160 -3635 -12163 32402 95082 116311 129863 124605 91103 75549 53940 -3253 -40383 16757
12148 16757 16675 43856 83007 36428 -2269 -1218 15963 8879 80 25654 95035 107171 105503
12135 105503 105007 105283 97491 96745 70628 67118 35523 38605 41140 94071 106664 105138 140494 125471
12121 125471 87696 19458 10398 -7796 7983 47467 100284 97113 117687 166887 180028 185091
12109 185091 193896 177727 148883 95825 52070 54913 45191 21771 66036 92961 126196 136721
12097 136721 124930 106486 152301 168860 135149 86816 114655 165061 144845 148597 203425 222795
12085 222795 195608 198981 256500 310872 338380 373683 334275 315613 289977 263579 248014 254480
12073 254480 240185 253723 289780 337444 331078 394116 425007 432257 426455 437345 436644 430979 428889
12060 428889 389844 417924 430256 408734 403452 456805 488456 545241 638469 747250 840778
12049 840778 837371 808145 722474 608162 491755 415445 347708 347142 347350 349910 368846 380769
12037 380769 432793 486018 553744 548498 499632 452011 424846 386658 345925 319924 289839 278506
12025 278506 323184 365980 397694 379207 366198 381271 410661 346087 321009 343348 332455
12014 332455 307090 288937 235167 229397 232718 290211 301079 264446 265903 299353 349320 394617
12002 394617 412714 395960 390362 409819 456572 444279 443526 515438 546913 585375 641925 704863
11990 704863 726284 740302 751946 744321 746438 739920 742701 726776 743804 845132 873352 870342
11978 870342 933141 974732 1033344 1056412 1119891 1108426 1164793 1260717 1367555 1414148 1439930
11967 1439930 1500265 1609815 1677852 1751287 1814233 1894757 1998109 2133746 2286370 2480510
11957 2480510 2646182 2777370 2973593 3151511 3399405 3638769 3934497 4244167 4566386
11948 4566386 4925199 5335248 5807432 6321810 6880341 7553634 8366489 9313765 10387215
11939 10387215 11664331 13213959 14978920 17151565 19823567 23184188 27342983 32610215
11931 32610215 39509054 48492664 60422063 76479681 98097050 126657953 162562243
11924 162562243 203198617 240280110 261504943 259030165 235726501 201424987 165526150
11917 165526150 133410872 106970253 86099826 70000468 57589588 47931601 40320420
11910 40320420 34235727 29371139 25418538 22236700 19597080 17429992 15595107 13986213
11902 13986213 12636342 11521462 10567060 9689944 8897588 8202893 7597456 7095515 6628751
11893 6628751 6194144 5818508 5513386 5183579 4935302 4701175 4469530 4283463 4034947
11884 4034947 3797714 3642274 3543616 3444725 3295670 3151732 3018150 2845265 2684180 2590611
11874 2590611 2485657 2396167 2300376 2226549 2124676 2026828 1937740 1871109 1805398 1679562 1644291
11863 1644291 1602003 1565488 1541414 1474917 1369974 1301184 1228133 1228101 1243879 1233521 1226173 1204906
11851 1204906 1137319 1126561 1143221 1118024 1058320 1057255 1057068 1070780 1078895 1081363 1055329 998833
11839 998833 959705 903265 883747 805121 789070 772092 734069 729404 690063 686991 722493 702583
11827 702583 726154 694340 709993 672574 628404 647987 588969 568899 528192 539075 594477
11816 594477 615898 596979 558710 574782 573415 540535 588584 594117 573949 566737 569618 610197
11804 610197 614642 619995 688946 706398 696182 743003 770964 749173 669810 593831 506626 467517
11792 467517 417940 351241 310297 304209 232104 216639 284072 280477 271350 249778 239445 242626
11780 242626 228918 248797 237978 238126 291832 281904 247016 276434 283448 309366 355546 298756
11768 298756 238592 235358 240317 185949 203473 267563 316442 311372 258652 218057 190502 218983
11756 218983 258580 264286 247811 289225 265648 238957 237762 204148 178328 162894 171226 120446
11744 120446 157549 144653 151657 135454 196383 233138 245848 277961 276871 236186 247078 309339
11732 309339 355929 395422 388002 364933 349272 324050 317160 306170 276981 239118 222662 156342
11720 156342 114079 119507 113418 129755 111581 124172 111565 95068 136436 183296 183524 186419
11708 186419 184959 177977 164419 219529 238630 186735 199689 229792 207041 205771 235245 249814
11696 249814 230827 255133 269464 234353 158992 136686 153534 143267 126252 108580 92663
11685 92663 124071 116659 110285 84003 70761 98485 145668 178367 219122 174741 120099 111963
11673 111963 108551 163057 203853 200247 187665 199465 160283 147746 111956 115578 161060 129967
11661 129967 73843 57693 94682 81940 55109 21602 24809 87445 102073 88958 79525 106230
11649 106230 115165 119263 163412 144264 75342 76784 130248 137843 145364 114939 37454 34124 61891
11636 61891 63684 112379 127763 130618 145595 149480 166910 168240 117666 117805 114299 105211 60486
11623 60486 3538 -3434 65236 71941 51952 43091 44479 63063 58438 44020 41221 35544 33380
11610 33380 89055 81689 33225 46061 89824 105270 36758 39928 78301 48932 31902 72641
11598 72641 75883 55454 60240 102215 90044 14478 7710 72201 106442 99839 65248 85182
11586 85182 113782 122183 128100 156016 124626 66066 135630 116395 74472 53809 15398 -1325
11574 -1325 -5290 4279 14453 32807 22338 -57755 -51089 -25959 356 51139 112108 130428
11562 130428 149633 140672 80641 27950 28503 48016 26981 38311 34253 29836 31949 28202 49360
11549 49360 34965 52175 47430 34143 45863 84450 77071 71273 87848 120922 172154 128930
11537 128930 43484 5590 2967 -11953 -40275 -8962 83738 119108 86414 79089 60133 50043
11525 50043 18489 42653 105366 92293 40549 17428 74371 97092 82466 81518 40585 50890
11513 50890 70302 57591 19912 54557 94548 156197 139373 153734 128932 133710 225087 294484
11501 294484 351387 494874 813653 1332965 2224764 3183281 3536206 3100169 2359352 1630770
11491 1630770 1064808 684965 517654 375693 295075 228217 234985 219603 205147 199373 202786
11480 202786 198876 223876 260541 237579 230861 214955 172932 133490 113205 100315 69406 13819
11468 13819 11 83261 146368 175314 196331 124991 71774 42322 7481 12313 58527 41302
11456 41302 24673 13907 -18302 -8713 3030 48277 53962 51057 61688 68160 61568 75683 35345
11443 35345 45643 35355 -12054 15279 -5795 36260 46100 11124 -13790 -78089 -14103 -7406
11431 -7406 -26878 -31571 -34627 -37588 -17569 9969 31904 30552 73000 72799 75920 67160 37872
11418 37872 24720 8656 13812 32393 48691 70027 70369 82518 85146 27405 -17278 17576
11406 17576 27387 12189 -2597 13845 48832 55758 66625 57682 55841 96349 129102 127272 47942
11393 47942 14837 3340 -11402 31561 10011 12443 -51858 -85680 -46853 -52095 -28605 -17034
11381 -17034 -17606 -3198 16684 63772 112187 95952 34268 38509 20898 -60977 -114667 -139580
11369 -139580 -131363 -64479 -39501 -1248 84176 121292 112598 95962 40474 -33434 -50134 -59233
11357 -59233 -41640 -5925 27994 34944 29654 33039 40270 14845 10749 44454 31039 49688 61032
11344 61032 27741 -3175 -61528 -119879 -108091 -86886 -62154 -46011 -45810 -65710 -70222 -54392
11332 -54392 117 24871 14356 16323 53031 60774 54849 22312 -14787 -30762 -50828 -47421
11320 -47421 -31924 -9376 22842 -4678 -6568 -49292 -67600 -36894 8782 41501 37130 44951
11308 44951 38438 21316 9348 13044 25564 33774 60946 2184 -35474 -47621 -35156 -31658
11296 -31658 -36468 10575 52044 52337 39253 53511 29659 42694 44389 21025 34429 -3972
11284 -3972 -13517 -46847 -63560 -94436 -104208 -54615 -67530 -55444 -28805 -24080 1858 -4935 20197
11271 20197 44293 27992 -15964 -8014 39592 107655 90935 81129 34372 25675 -2332 -46525
11259 -46525 -43813 34509 68508 64406 74393 50569 16038 -3561 -29943 26139 42869 74984
11247 74984 50360 23657 4603 -7545 -40875 -37312 41860 26091 893 -6052 -34471 8762
11235 8762 39111 21538 -31794 -43212 9575 12029 6977 45126 46360 70751 64257 42620 -1786
11222 -1786 -42265 -64056 -62724 -51158 -38008 -44806 -39322 -4529 -8238 -16320 -61542 -58758 -40441
11209 -40441 -61372 -54028 -12177 -27240 -21165 6613 12006 -18024 17084 37247 20623 48147
11197 48147 43696 40545 23600 1521 -9511 -25169 -53938 -47704 -47307 -33800 10947 20552 -30498
11184 -30498 -8851 -17222 -36834 -27081 -55291 -43141 -16772 -58259 -67511 -72102 -40142 -8438
11172 -8438 42420 59672 62516 31118 1379 -12395 -32154 -57962 -72684 -84986 -66647 -111102
11160 -111102 -110215 -61414 -27474 -32418 -7072 24730 53538 44396 251 -13489 -39782 -69155
11148 -69155 -86230 -58066 -61264 -84218 -89315 -60330 -32998 -48846 -101339 -123424 -116733 -137107
11136 -137107 -124831 -86585 -78123 -74000 -21770 -25053 -11448 -13288 3232 -9502 -10672 396
11124 396 14810 28142 20557 -364 -9716 9079 -8842 38040 32153 -29154 -40076 -24400 -22826
11111 -22826 21934 37471 52731 49062 16832 18269 8571 6929 -16082 -40139 -49596 -53474 -15352
11098 -15352 21989 -16858 3078 27563 29623 -16051 -29917 -12542 -38054 -2128 43867 48778
11086 48778 11038 -5980 53236 112603 79404 10513 -16425 -65057 -48452 -2519 64668 60287
11074 60287 42857 -16433 -36567 -24106 3967 6391 -53900 -95097 -70092 -66915 -92510 -105119
11062 -105119 -95683 -81235 -53360 -63866 -79700 -50719 -46034 -44993 -56171 -72522 -13884 6059
11050 6059 12376 29680 9059 -5101 -981 45780 103324 84188 69157 57101 74961 37267
11038 37267 36924 68265 76934 90736 166715 212503 218719 152921 207881 211550 177729 122286 156413
11025 156413 183806 213681 201037 212386 308999 395258 437171 406571 368614 279238 181031
11014 181031 192130 232355 190514 160150 203395 246455 244188 191891 177310 144443 120375 83261
11002 83261 49707 25646 27085 64395 103372 58424 4951 32745 36526 12158 34251 28034
10990 28034 28250 22685 23775 20149 17913 7447 -7044 -8408 -16617 -46450 -55440 -45770 -29876 14014
10976 14014 49951 47821 -15551 -45276 -73231 -120869 -53122 3124 -48336 -36575 -17736 15607
10964 15607 51511 40065 37495 -279 7943 7384 -5726 -13686 4673 17042 17041 -10741 -69037
10951 -69037 -60364 -31229 -64761 -73126 -77024 -106367 -128412 -95619 -57101 -45881 -43902 -55557
10939 -55557 -69910 -80079 -114099 -143348 -131146 -78846 -51492 -98845 -65097 -44762 -23865 -46562
10927 -46562 -78515 -101207 -107156 -45731 30429 8045 -8728 -14781 -34524 2390 49690 33863
10915 33863 5139 -13044 -13895 -5670 275 14145 -10311 39594 56638 52719 12938 -38375 -23015
10902 -23015 11750 14332 -18797 -20011 -28319 -91030 -63217 -9986 -4047 -44117 -39062 4967 -22518
10889 -22518 -71078 -59622 -20537 955 37003 26270 32368 67727 45539 15095 -46072 -7233
10877 -7233 23013 27435 3195 -6852 20055 3649 -9814 17066 37135 56376 23093 -17531
10865 -17531 -47043 -21681 -11282 44869 53065 10167 -1807 -25519 -11041 -14089 14467 18456
10853 18456 -54030 -101812 -89695 -70256 -28344 -18046 24942 39792 19901 -22124 -66854 -134721
10841 -134721 -157916 -100788 -30732 -7722 70132 63941 54985 -25592 -37745 -58212 -63847 -65455
10829 -65455 -111453 -125552 -100856 -73045 -87314 -6252 4430 -29825 -62731 -143597 -138341 -141867
10817 -141867 -114534 -81699 -69011 -52305 -75982 -88241 -34109 -25904 -30939 -10119 -4309 -12323
10805 -12323 -44132 -117142 -113158 -130291 -125083 -151331 -102493 -49269 -44036 -48052 -65293 -60048 -53233
10792 -53233 -116366 -148404 -114138 -109357 -127501 -107793 -129604 -138524 -116740 -124952 -83316 -76384
10780 -76384 -28772 -26554 -73957 -78784 -98232 -83783 -71966 -52955 -49363 -65989 -102641 -79441
10768 -79441 -61249 -101099 -106837 -66907 -72972 -94448 -114983 -95855 -75076 -88918 -99041 -70069
10756 -70069 -71478 -38425 -20095 -10179 -50700 -51309 -33355 -34005 -19584 6548 -35347 -109545 -132428
10743 -132428 -70914 -27601 -38416 -46974 -9833 3726 -820 -5437 4157 374 -1171 31654 82968
10730 82968 131260 147335 126642 145098 115386 34635 23513 28750 51264 81974 109806 107133
10718 107133 88335 137399 140827 136346 189475 176154 71901 8086 34086 60004 63222 64624
10706 64624 67684 83267 42924 52155 67984 60780 61868 48263 18209 10752 30547 24574 28887
10693 28887 -18196 -63931 -40904 -8614 -4374 -19859 -20220 -64993 -84261 -46323 -24104 -30108
10681 -30108 -35584 -68990 -57019 -34978 -17330 -45529 -36793 -52715 -86463 -123763 -117746 -93390
10669 -93390 -100601 -96107 -94854 -72957 -63246 -17335 -50227 -82614 -52553 -58439 -14163 38923 36400
10656 36400 7318 -25751 -81569 -67022 -85534 -129499 -97812 -67325 -78882 -44782 33474 83070
10644 83070 108112 120485 108385 107873 121618 145910 198324 207885 195808 249042 293736 322157
10632 322157 413735 530637 679624 804341 898912 982723 1177683 1387090 1605530 1926225
10622 1926225 2323433 2915013 3779521 5032664 6813610 9206617 12164656 15382900 18448115
10613 18448115 20643903 21428569 20958946 19878865 18896074 18473130 18956003 20675733 23959356
10604 23959356 28998453 35522521 42062943 46293508 46834506 44304189 40415492 36752763
10596 36752763 34407199 33947971 35637434 39791597 46413884 54761631 62538660 66420203
10588 66420203 64807468 58969394 51439482 44386252 39101844 35952559 35048842 36338480
10580 36338480 39598110 44019218 47748051 48589600 45755312 40365589 34247461 28780498
10572 28780498 24657477 21960224 20590776 20386009 21122522 22186839 22809455 22240787 20275216
10563 20275216 17429805 14303874 11464294 9117790 7297446 5904059 4829477 4029424
10555 4029424 3492995 3055801 2696940 2443402 2126644 1960363 1846979 1684334 1507311
10546 1507311 1348381 1228721 1153765 1082598 994429 947110 923039 878226 794107 769987 753907
10535 753907 735764 741443 706164 697690 686607 678693 674885 648741 614825 579078 543981 554306
10523 554306 579157 529227 497709 455042 426476 435619 468066 488016 484589 480143 471196 473214
10511 473214 435615 415729 364481 324418 306174 257157 247031 234780 227873 289997 351968 320211
10499 320211 315667 303821 301720 312805 311909 287723 318582 370428 438880 451346 453524 439253
10487 439253 336651 308252 306037 268891 241277 269322 291397 309695 325236 328931 296966 285728
10475 285728 281559 285355 256107 234760 215898 208328 225873 235565 265953 282991 278186 245287
10463 245287 244952 234613 232400 202989 179281 174783 177553 168988 178647 175165 206867 219878 232678
10450 232678 226025 217740 178335 156237 172320 161421 137431 132388 109677 69841 67384 114875
10438 114875 131987 117815 101643 91755 93573 54299 34671 62126 81828 61080 93286 98655
10426 98655 71819 72717 99952 129848 103748 101560 102469 105605 119964 105195 83046 102379 111426
10413 111426 83577 103297 146800 140060 173238 143440 107970 156004 165798 169090 159143 140924
10401 140924 110840 108984 140918 129349 112691 173712 203386 179741 120672 122497 163495 167089
10389 167089 162165 208969 199939 173674 132545 141548 130547 97221 75509 80811 112806 115210
10377 115210 133816 100789 49646 31113 61815 120380 66821 4407 -9007 21658 70465
10366 70465 75159 70899 84986 132871 88847 76777 90928 158197 145324 154014 114237 77025
10354 77025 70579 67399 91290 91647 126847 91591 85318 94206 138585 110095 55732 61170 106406
10341 106406 86625 25281 -41311 -58034 -7979 15715 29540 40772 33623 35525 7629 21789
10329 21789 52752 62027 82579 86713 82114 98180 146432 158006 141804 134810 112286 123226
10317 123226 71826 88354 102089 70874 62575 45360 57457 48825 42819 57984 31042 6538
10305 6538 25514 5646 12158 12498 17900 47582 93721 91863 50132 38396 33003 62578 71783
10292 71783 65655 11015 24262 53304 19137 20828 64775 88224 113411 96305 51426 10460
10280 10460 27197 98447 83741 69543 110145 108131 106613 107722 82264 72211 56576 77399
10268 77399 69538 33861 33022 43287 31384 44441 58983 46449 18911 11327 43547 73842
10256 73842 61926 31490 30427 53152 52558 53694 64303 3635 18068 4297 167 35006 44258
10243 44258 51989 89473 71310 58266 36684 15001 -32076 -46426 -28959 -51745 -52460 -27961
10231 -27961 -7831 -10550 -4833 37929 35124 29094 46858 63367 44684 31030 24955 38738 43083
10218 43083 10776 68289 82588 102981 58800 43040 48006 99759 183200 201343 178001 140415
10206 140415 121808 101454 97378 76564 43565 37024 40328 72543 125294 147074 138746 99883
10194 99883 71836 65102 54635 55729 32299 68923 73888 80532 128852 133336 110117 94412 57281
10181 57281 23709 39386 53648 59255 57705 79746 89046 98403 130197 101310 112185 136760
10169 136760 126116 166007 252067 267107 232122 231369 257989 274114 271683 194670 155001 183944
10157 183944 244197 282055 315337 363048 379640 387519 390225 349863 300322 228106 160144 183931
10145 183931 222443 200325 208116 256848 304795 341797 290903 245898 190395 119111 87767 64093
10133 64093 50201 91985 95558 127540 135097 172654 216216 243798 164902 124377 112934 89050
10121 89050 72223 75495 73999 88719 98804 64067 52280 55879 38651 22542 -3299 -30856
10109 -30856 -75487 -81516 -71663 -81464 -74600 -5049 66593 127048 137797 110997 71049 75003 60206
10096 60206 38023 37663 75615 50648 46699 49247 10333 5989 -6653 25717 27733 58263 55663
10083 55663 64835 53769 4541 -10177 -27954 -61442 -51627 -35633 -25355 9742 15833 10600
10071 10600 2016 -20006 -183 45807 50948 26119 39763 49261 24435 -37106 -41056 -40838 -7341
10058 -7341 63004 88435 145175 150720 145257 108831 88306 49310 -10581 -5663 12908 39171
10046 39171 43678 59565 61266 30110 -5322 -17776 -45196 -59797 -29098 -12797 35310 3096
10034 3096 -42491 -77599 -45460 -53235 -79351 -56424 -63410 -22768 16964 29025 5405 -36175
10022 -36175 -34262 -46228 34574 65658 77593 92963 73989 42709 10924 12530 49015 59384
10010 59384 16477 1480 20030 30410 22666 10857 45850 75740 67050 40061 32278 17135
9998 17135 12334 53484 46425 16719 11689 8861 -14187 -31671 -14718 38564 44751 71744 23000
9985 23000 -26748 -42921 -24442 -2383 2919 -13960 -10223 12178 -208 -16672 9973 -2298
9973 -2298 12490 12010 7994 18905 68087 84435 70441 19531 6222 -491 -34507 2839 30532
9960 30532 19673 -559 -19172 233 18468 3192 -31207 -14629 -30680 -9782 24900 30490
9948 30490 9596 -5114 1927 33540 36671 85488 40722 53982 36451 -38098 -88884 -68418
9936 -68418 -21850 8834 -30466 -14348 1364 4308 42774 109452 150968 158420 108833 66952
9924 66952 69521 31371 30616 61493 83218 111723 108479 82788 61336 18960 39292 51764 -1382
9911 -1382 -17662 -3215 17090 12534 -49051 -91162 -23753 44678 75032 104085 98757 60002
9899 60002 95505 43503 -8414 -20720 4651 75545 60080 55995 91076 102080 77886 39858
9887 39858 10391 43811 26040 -38464 -59249 -6798 5144 5958 -10778 -728 11355 33690
9875 33690 58150 49024 -4270 -37020 -18188 78 31591 38510 8545 6283 29779 64447
9863 64447 54632 30988 -7234 4581 29307 75350 81989 38511 37472 71379 86602 61730
9851 61730 78246 50102 24531 5132 29011 29836 44631 41012 48177 73415 87381 73857 39003
9838 39003 41105 29036 16732 22176 17383 -6524 29840 4113 7507 68653 81488 28647 31576
9825 31576 62968 74913 59947 -986 -13887 -23137 -25973 -86368 -103638 -47549 -2386 -1724 -19758
9812 -19758 -63541 -63085 -70620 -72050 -35524 -40049 -55156 -61619 -68540 -94987 -106382 -85451 26474
9799 26474 45346 42595 16769 -56571 -102495 -91550 -61736 -22835 13322 18736 64653 54886
9787 54886 13659 5309 22552 50000 53358 39023 4863 2415 -38405 -40318 -12980 10537 -2708
9774 -2708 -20364 19804 62338 54540 75901 99881 112811 103137 61730 60099 55049 32747 -45528
9761 -45528 -77055 -75185 -34999 18713 45563 22082 7787 -38217 -61210 838 13541 8413
9749 8413 -1089 39157 89830 101907 129212 88915 -1496 -22898 -9622 9228 53991 66733
9737 66733 22830 -21787 -1909 427 39409 46257 -39285 -52836 -19805 7452 15653 1553
9725 1553 -28066 -45574 -52996 -30810 -22230 -51749 -61164 -19286 -34857 -80500 -38330 -58766 -109185
9712 -109185 -102686 -74177 -17120 -19175 11683 29970 86753 83970 58376 70174 67649 27821
9700 27821 7733 4611 -21311 -51186 -39307 -57441 -78156 -85620 -57350 -14851 -7257 19274
9688 19274 20408 20730 35662 99356 106479 23186 3612 8043 7226 43365 25365 -22829 -10489
9675 -10489 -9525 -14945 -28834 172 -54222 -51923 -20354 -16900 16005 23353 3768 19282 27687
9662 27687 38310 27462 23145 29177 -6275 17968 16132 -3734 -4757 18744 89206 129040 86061
9649 86061 86283 59934 21307 6507 10337 37172 25624 51831 100324 95085 83979 90804 34988
9636 34988 -29755 -54712 -74619 6655 380 -10172 30128 59454 70507 121015 95604 86225
9624 86225 72380 76580 62367 38498 39898 65124 61707 69654 70993 29633 21933 66456 106832
9611 106832 58414 -12902 13474 57672 77385 70842 52628 65751 15059 -34902 -100829 -131011
9599 -131011 -71390 -63260 -52775 -3683 50419 55476 64968 50052 30217 38970 53492 42854
9587 42854 32699 -7447 -4774 -27121 -18302 -8285 13332 17276 36788 89898 133482 164541
9575 164541 133548 100771 96750 104245 53873 19669 23632 40586 63604 66887 53176 50265 38309
9562 38309 82071 81094 50069 35032 -1674 -25814 7538 -22403 -65773 -83504 -44693 -66428
9550 -66428 -64643 -80322 -83210 -56958 -57765 -35464 11641 -4352 -29179 -34606 -17977 9012 48433
9537 48433 61806 25520 12132 9356 14979 28435 29782 61069 88643 81312 37245 -19362 -10134
9524 -10134 -24450 -34477 -58903 -80463 -7626 17264 22282 50143 36538 8976 -623 -42132
9512 -42132 -17257 -13563 12546 6646 18821 40008 16862 -4989 14194 43173 46297 54003 7185
9499 7185 -1634 46103 76690 51433 32752 35623 77188 112324 113060 91377 46853 20284 -20396
9486 -20396 -37506 -15775 -18663 -22091 -34579 -11189 -1649 59452 86363 58370 59656 83220 78520
9473 78520 32996 -12478 -18706 -59826 -32855 -21419 -33050 -51483 -52441 -25755 -890 50133
9461 50133 48855 17057 38499 94956 87065 62846 35299 26199 28987 49442 70804 81567 -1185
9448 -1185 -40850 6340 50739 52539 28019 -52 -47692 -12803 848 446 7426 21780 -12086
9435 -12086 -13181 55 2066 8265 28681 77608 51984 37729 28499 38914 24302 47445 2992
9422 2992 -19378 -28393 -13868 3637 -6283 28420 39752 61946 110948 68734 12353 -67767
9410 -67767 -59530 -31225 9852 31428 1451 256 16993 38321 45588 -22936 -41877 -47547 -15176
9397 -15176 20616 15193 18892 21766 -7106 -10538 -17037 12547 26800 60537 57976 64733 76047
9384 76047 44177 -17460 -49861 -31926 5517 33218 18357 14970 48158 23941 4572 5184
9372 5184 26098 47917 74444 52401 24310 52726 61710 102433 97289 51726 -32756 -55505
9360 -55505 -50041 -2192 85214 74273 44726 52374 19075 -44493 -63882 -58229 -38997 -6857
9348 -6857 20925 57604 38466 23782 35448 2688 -38135 -40598 -71176 -79785 -89217 -27091 14535
9335 14535 -45091 -51475 -49427 -59933 -36775 -42347 -69301 -95480 -67837 -1864 38974 22493
9323 22493 -23896 -49342 -42578 -29998 -13000 -31703 2139 -8149 -6565 939 63456 73730
9311 73730 36886 41476 -5362 -20171 24731 -3385 9082 44670 70703 89563 91759 61313
9299 61313 44224 22446 41810 80314 61886 27682 3686 -32427 -53784 1309 39197 -2086
9287 -2086 46809 29586 -11188 -47734 -30258 27075 46367 49581 88817 71996 31684 -17020
9275 -17020 -28022 9077 39208 29032 26534 -25957 -24882 -12718 -29067 -35673 -11298 11811
9263 11811 53281 32659 -11568 -25714 -41054 -40946 -30153 -67177 -64657 -31992 -41155 -87684 -106169
9250 -106169 -39907 -36523 -40325 -44782 -59400 -34572 6540 -15110 -7062 20028 47149 15338
9238 15338 22185 -17076 -44594 -58745 -26068 -66020 -72992 -45855 -26400 -38369 -5290 20346
9226 20346 -35305 19874 37635 -5558 -19928 -30494 11548 -13387 -82549 -100128 -87428 -68250
9214 -68250 -105700 -74066 -66895 -36420 -22077 -874 21074 -7219 -26148 -6859 23657 17165
9202 17165 18026 19538 41752 36927 60121 56511 37800 29054 46813 74333 37303 -1246 -4007
9189 -4007 -43271 -45175 -53327 29225 46710 -11204 -64870 -51139 -15249 -1366 -16599 -67405
9177 -67405 -111108 -97941 -79978 -71752 -43871 -15684 2185 20053 12014 -23403 -733 12200
9165 12200 15405 51965 62192 62942 101303 94603 61121 52019 57197 3878 46736 61932 39303
9152 39303 -14174 -33893 -49513 -44949 -34259 -16559 -6726 12936 43183 53467 28565 -3241
9140 -3241 -6343 28837 -14684 -51252 -69074 -47262 -16111 51306 65006 33389 43150 -9971
9128 -9971 -61890 -81810 -66451 -14547 77434 96495 53702 -22776 -45414 -17980 9173 77948
9116 77948 110643 74128 25609 1640 -36948 -44207 -47310 -40086 -33445 -47298 -86860 -70240 -23571
9103 -23571 1469 -20540 -46782 2226 47072 38394 25694 -19551 -20173 47448 88063 93188 74482
9090 74482 76567 59383 79967 76061 31764 365 -38071 -59453 -100161 -54999 -34638 -44868
9078 -44868 -41267 -40320 -36578 42444 37939 -19054 -44281 -1245 -26834 -32804 -8376 -7078 -28160
9065 -28160 -29541 2474 -7854 -36582 -42859 -46941 -33995 -21418 -39353 -25255 -4446 12445
9053 12445 -12759 -36081 -89535 -87770 -75310 -20506 -4332 -3256 -19505 36897 32942 -9873
9041 -9873 -12980 -27376 -73468 -84562 -64201 17787 41453 22238 19315 -8380 -9978 -8205 15339
9028 15339 8366 7984 22477 58741 82001 32093 -50464 -33689 10187 37990 30133 -8686 -14497
9015 -14497 -17811 -44486 23862 29027 -8225 -45947 -21094 -150 2970 19417 17655 43293 45688
9002 45688 48748 31052 52772 33378 15049 29159 16642 24981 82505 104387 84515 12471
8990 12471 -14817 -10752 7294 15229 32125 39349 30274 24212 58881 47203 42260 -10406 26883
8977 26883 81141 27242 28755 55437 32054 9877 20243 2076 -21667 -22552 -36738 -11982
8965 -11982 17212 42593 26230 -11281 3590 30848 25700 6881 17404 13980 11576 36144
8953 36144 15872 -24095 -10743 59249 65911 17762 -16643 9893 18901 -357 -44670 -63571
8941 -63571 -65169 54819 96935 49119 75269 103775 104248 102577 86841 28642 -50088 -61161
8929 -61161 -67943 -62475 -12442 -9011 -17842 5670 -19441 -22096 -39532 -69382 -30004 -28647 -51283
8916 -51283 -85268 -61125 -82618 -103195 -86724 -73680 -30126 -23341 31477 78429 50407 -618
8904 -618 -23685 -40212 -76932 -77873 -48190 -28279 -37433 -68326 -20155 8509 1753 -9986 -9442
8891 -9442 -21765 3518 52064 57883 -5717 -12061 3631 -12769 14597 51012 72461 48053
8879 48053 14564 -13343 29970 6396 8909 -3068 -3202 28134 24520 33575 39890 14589 21765
8866 21765 52242 -5495 -57366 -76215 -46039 -2986 -31015 -28276 7402 31875 58363 34716
8854 34716 15516 -4933 -20724 -2604 89198 118457 37342 -36893 -31198 17639 53422 41432
8842 41432 25801 35465 75115 70226 33320 -12566 -12001 16035 63395 99448 93304 65833 8744
8829 8744 -21485 -33444 -7391 -31947 -48555 -50556 -58034 -35636 -12775 -14356 -39025 -20053 6228
8816 6228 -20548 -16739 27328 46396 50534 93059 26316 18863 19615 27729 64692 37159 32207
8803 32207 9870 -41195 -92630 -52918 -20176 -8539 -24191 -20278 -59303 -82913 -24053 1478
8791 1478 40349 76788 42154 32503 46805 5277 -9329 6188 51388 68282 37610 65704
8779 65704 40511 -14845 -8152 32856 43052 46241 34299 -11593 -45446 -14978 31089 9829
8767 9829 14488 13355 -12522 3724 14832 -21737 4629 5374 -24563 -42796 -63798 -84777 -62340
8754 -62340 -20645 11006 17028 21162 8421 -19966 7987 12520 17642 49871 50401 11231 24841
8741 24841 30553 -3790 -36704 1679 23848 40545 33208 28266 49602 68161 44833 30192
8729 30192 32128 21359 33180 37263 31175 -32154 -66232 -52721 -18577 -5899 -12864 -31227 1571
8716 1571 34346 -10615 -19033 -27516 -8799 1367 666 1029 16325 -24564 -46248 -69853 5645
8703 5645 -17704 -26508 -29453 -41367 -46651 -60742 -55379 -24077 -16873 8469 7954 27916 38782
8690 38782 38720 15735 -19485 -23934 -10423 -29548 -9831 -14852 -47442 -10411 1825 -1346 5221
8677 5221 -48083 -68806 -28366 -13153 30226 45930 -6546 -10503 -10420 5229 -871 -53031 -92137
8664 -92137 -96771 -109704 -87144 -37559 -19143 2189 18154 29625 67156 103217 94899 34422
8652 34422 18952 18939 -13203 1906 10911 35684 25801 32947 71043 71090 26492 -3796 -22363 -39555
8638 -39555 -2034 33828 52385 29633 61172 68355 13553 60501 79164 57567 25289 -12027
8626 -12027 -18538 -7220 -51808 -29385 11801 21455 -34462 -57550 -57978 -58118 -28388 -5637 12751
8613 12751 14309 18766 27699 1597 -32123 -69425 16846 50026 51542 44559 -19352 -49673 -17274
8600 -17274 -4049 -11648 -20543 -33189 -31144 15425 77962 41137 22797 7966 -44674 -22946
8588 -22946 9789 21594 26025 56237 47864 33150 -2466 12333 9095 -9234 49192 111090
8576 111090 105261 100868 59663 12397 4090 53867 48709 -6258 4618 31735 -7153 7200
8564 7200 91329 75153 50533 7470 -26195 -53561 -39282 -21404 -13330 -6 -21553 -49572
8552 -49572 -36824 -6895 66446 66386 -1128 -52450 -82113 -63858 -67650 -72736 -82488 -73037 -65122
8539 -65122 -54615 -35929 -5089 11314 42401 17433 -38682 737 23886 11157 -1187 -30091
8527 -30091 -18502 -25187 -15438 -77114 -55054 -32690 -66139 -85537 -58932 -30925 -31402 -72606 -67580
8514 -67580 -44342 -19509 -26245 -36986 -5999 -2828 3917 7343 26005 -29888 -34233 17733 54762
8501 54762 74134 83038 68932 55266 22177 -22819 -53586 -81647 -15135 14397 29488 89140
8489 89140 85822 39347 16623 -29799 -84850 -83746 -60543 -36182 -31242 14726 38560 81124
8477 81124 103978 101430 116635 163949 95923 22081 51568 64081 -12234 -4748 33344 23010
8465 23010 40597 50433 56878 35026 50252 62063 -19520 -71383 -22337 34415 96881 90149
8453 90149 97242 91383 57132 47959 83902 91993 107040 91736 74702 61460 34291 70018 74320
8440 74320 74718 79217 58554 33817 7634 37184 101012 112484 75026 80547 133421 182192 184662
8427 184662 101683 97296 97361 81535 41324 24593 31583 50866 18269 53573 73038 70543 99013
8414 99013 56545 -9509 -5779 23131 81594 94939 65469 55582 50013 25168 -30827 13075
8402 13075 33189 43402 37052 50007 50354 87567 86655 95924 104874 109949 85772 108376 144743
8389 144743 197312 202501 284182 431695 508549 623779 773189 895239 1024758 1297375 1902351
8378 1902351 3068417 5184743 8163858 10169907 9672857 7599387 5372064 3690588
8370 3690588 2585957 1870694 1459683 1121184 812249 680180 642944 616028 564207 453978
8360 453978 446755 414405 386457 324535 281771 287752 340191 371130 355477 301357 272670 263756
8348 263756 306917 326792 343438 386290 483204 745670 1094574 1324457 1297223 1040603 751614
8337 751614 537036 410133 347922 350541 314799 227264 151799 97335 101257 103730 87165 108288
8325 108288 96476 80000 67244 83802 100490 114311 80077 64626 20718 19355 20927 31954
8313 31954 57090 69681 63957 96939 106984 119716 206914 238909 256227 256649 299548 330750
8301 330750 415656 617749 1031692 1790895 2462095 2529013 2156830 1615345 1090780 722689
8291 722689 494101 350686 275671 186573 161867 166665 121862 78515 61915 50432 54968 39177
8279 39177 21088 82530 95562 62090 46959 31339 8811 54199 54769 45336 40271 60087 56750
8266 56750 58527 63843 71163 102631 84973 124652 123463 99197 126999 157733 237622 375145
8254 375145 712775 1073126 1223834 1062702 773502 538406 378355 229754 150356 109401
8244 109401 71554 96159 64685 82352 86447 71084 51736 23170 61551 100706 78974 23257
8232 23257 -10407 8035 25906 -21053 -62556 -55258 -59847 -29352 6036 -21497 14231 27211
8220 27211 13061 -10579 -18937 -8345 13167 65374 87768 63597 18081 -10634 20066 35694
8208 35694 15354 19547 -38690 -64817 -42427 -14583 -28936 -35985 -22910 -2430 -28832 -51465
8196 -51465 -53147 -17074 -43307 -23496 22253 -27106 -35084 -43710 -32163 23439 69962 41323
8184 41323 9679 11668 29696 43636 55549 31984 41843 34340 31804 48474 43357 7512 -45735
8171 -45735 -59849 -22440 19450 25512 21005 14181 -12914 -26149 -46506 -75620 -78202 -50825 -25217
8158 -25217 8709 22287 9283 26085 52094 79612 91616 101606 93644 125072 112282 86613
8146 86613 67472 58456 44067 54261 51188 8890 6004 40450 38284 5345 -29493 -35697 -41678
8133 -41678 -62069 -68614 -53018 -62438 -52227 -45346 -53607 -41006 -56640 -31714 29745 33876 72999
8120 72999 84549 57215 389 -12806 -1700 -11759 -4702 -10484 -40336 -49487 -42011 -53583 -38772
8107 -38772 -16781 -25200 -32575 -48052 -46281 -23356 741 28612 7793 -25582 22877 57759
8095 57759 24900 -11414 -44026 -21212 2250 6851 17863 2489 -1080 -34292 -13890 -18209
8083 -18209 -26054 -4734 42086 44863 -1383 31970 24188 -41967 -25669 -15282 -39638 -14866
8071 -14866 -9007 10857 32624 34933 17113 10369 -3252 -10299 39632 36802 34609 25373 19402
8058 19402 -1726 19667 15171 43247 45618 21529 2404 -5936 5782 -5053 -22032 -21579 -29774
8045 -29774 -92869 -100994 -42098 -39384 -38238 -32131 4559 23963 28214 14128 4880 22132 40254
8032 40254 37463 7447 17995 14045 -55836 -69630 -37804 -19063 -8969 -37264 -6425 29891
8020 29891 43743 6867 -19661 -31611 -6716 -10976 -19468 27054 18729 -41772 -77647 -109133
8008 -109133 -96260 -64677 -70381 -36982 -38658 -58187 -71394 -58913 -32613 -54250 -55939 -44824
7996 -44824 -4638 22876 -26873 -43253 -5259 1871 -43308 -59885 -33905 -4107 8744 -41421
7984 -41421 2545 26042 45856 99478 133636 159187 128492 109904 104580 82362 69139 92626
7972 92626 95156 108266 123480 116088 90090 71846 110205 87828 20179 317 -14034 -10187
7960 -10187 4712 39489 131029 182319 101162 74903 48202 562 40904 62365 64753 40421
7948 40421 41030 73683 30493 10196 -4848 10317 -22543 -52314 27080 54858 64205 35277
7936 35277 28680 6708 -30237 -26327 37430 95946 119597 75783 57306 35388 23203 16386
7924 16386 4853 15604 9584 36112 75275 112225 104551 75064 35207 -1432 -22860 -61585
7912 -61585 -33215 -16724 -2065 437 59099 93682 41028 56805 82947 55547 60175 42906
7900 42906 30951 51051 83139 68744 52941 30721 24864 50827 79016 76666 110992 117075
7888 117075 78852 116682 123503 137886 137447 128811 88638 40942 20535 54577 51971 71187 54689
7875 54689 -27732 -6030 -1546 -12745 9497 -21868 -28678 -4900 3573 18722 39718 2257
7863 2257 36598 41696 27814 46433 53736 58821 23243 6585 4176 -10391 5338 29960 -31936
7850 -31936 -11700 17781 26363 49714 51385 45404 70022 32658 27162 85176 74939 28532 17469
7837 17469 -26226 -44700 -62002 -39846 -12404 -53162 -85932 -82089 -68897 -44069 -13015 -28750
7825 -28750 3170 12369 -30250 -67259 -69472 -39203 2995 -23841 -37310 -63136 -40742 -10353
7813 -10353 32546 61977 91508 86824 79881 68564 9135 -6074 -6898 8625 18907 33347 22225
7800 22225 14899 -15512 6199 7881 14175 -11836 10313 29384 12544 -36613 -30499 -8980 -17318
7787 -17318 -23921 -6005 -21973 -38616 -38543 -42951 -60983 -40560 -52294 -81468 -103679 -71348 -50398
7774 -50398 -20409 -4743 -21881 -52581 -90955 -67053 -11038 4441 7511 3326 -10764 -21587
7762 -21587 -26472 -29051 -36022 -30943 1003 -5270 -5829 -26440 -23316 -6780 -404 -9765 -21724 -30696
7748 -30696 -6062 17211 2580 -26581 4076 14990 61350 23446 -52768 -47175 -11149 -7408
7736 -7408 -29506 -50780 -63477 -34771 2339 31057 27925 3130 -44032 -35498 15597 51786
7724 51786 25154 32734 6140 -16722 -1946 -17318 -11370 8017 17330 29809 63757 46955
7712 46955 47982 46455 19277 12322 -28597 -32650 -23831 14344 33942 11742 -13671 -24693 -1443
7699 -1443 7475 32477 26530 17385 16752 -3394 23420 46229 18204 -7717 -23201 -53961 -33551
7686 -33551 -21226 -29867 -8155 12270 26233 31722 25529 48921 128952 128499 78425 20219 11420
7673 11420 10483 -26063 -20085 -22182 -28358 -40688 -40778 -24551 -9177 8732 10264 22478 -20095 -32978
7659 -32978 -14008 -33714 -71061 -102259 -52468 -16883 2980 -37808 -30843 988 5649 -33362
7647 -33362 10284 34136 32180 40840 29452 -9554 -2057 -12651 -18569 15894 1702 16888 9520
7634 9520 -316 17078 69805 48286 20821 151 -11443 51080 92027 72833 4855 -27085
7622 -27085 -48331 -38811 -2959 -49068 -12414 -4916 -58549 -67785 -62814 -67412 -85579 -76725 -37241
7609 -37241 6120 -3284 -22616 16682 27970 -811 -22558 -38593 -57290 -55302 -38884 -41824
7597 -41824 -82575 -116183 -130173 -121405 -111154 -60304 -42726 -29306 18973 57926 34987 -18142
7585 -18142 -46207 -10882 19463 4142 10880 -5308 4499 -33940 -100343 -67342 -40953 -37238
7573 -37238 -59992 -52841 -60593 -66465 -22910 25454 33748 711 -45480 -48131 -18926 5385 -66122
7560 -66122 -45578 -15889 2299 46425 32889 15712 1507 -14600 33163 101872 101059 43994
7548 43994 19966 8023 26068 73616 62539 27266 -2694 -53437 -45376 -24699 15985 47944
7536 47944 51646 17866 -3927 24361 49470 24739 85 -30453 47 42103 37405 -11808
7524 -11808 7364 35847 44851 59473 48001 50993 14108 10063 -23365 -39925 -26409 -54686
7512 -54686 -53394 -60499 -41761 -47530 -53898 -44783 -36561 -50088 -43124 -43957 -35045 -1032 10825 15810
7498 15810 11109 -14813 -41316 -56151 -49661 -49013 -13240 20745 -11248 -24718 -33268 -3971 -50259
7485 -50259 -30508 -5093 -6281 -37366 -61127 -20933 -30201 -23200 -20463 -7509 -17919 -58791 865
7472 865 67633 86235 100979 141589 89155 35494 29691 60170 26307 -11696 -17280 -39701 -19469
7459 -19469 -99 -49252 -14744 7556 11331 -21989 -30650 -24777 -67531 -62365 -37730 16521 51924
7446 51924 36922 -21707 -39315 -31284 -53667 -12643 -30545 -13148 27810 46075 36127 46715
7434 46715 38305 -2908 2711 20971 20427 21547 32494 45165 65025 1872 -19052 1454 -20774
7421 -20774 23110 82287 72870 40274 27418 13139 33768 40573 27010 10710 -21227 -75647
7409 -75647 -19755 6077 -26097 -36527 -41535 -71854 -72741 13663 24102 -16451 -65255 -20265
7397 -20265 -7632 -34393 -78951 -48870 7895 29215 61474 32810 31116 40724 55904 49385
7385 49385 62752 34260 17078 43117 25688 29301 11879 7595 1994 5701 30218 47269 33726
7372 33726 49416 24301 -1227 -46909 -65857 -39094 -10432 -1576 -30526 -25199 -42155 -43089 -45236
7359 -45236 -66054 -69304 -44005 -29690 -42953 -21604 49606 54927 40118 36484 84304 75302 22115
7346 22115 1576 -58546 -52895 -28333 -82524 -94157 -72626 -83334 -58689 -71744 -54271 -9052
7334 -9052 8503 -7753 29540 61493 35994 -8108 -24993 -46672 -15083 -34500 -41677 -36088
7322 -36088 37250 -17091 -93563 -88778 -68302 -46218 -44864 21185 19019 262 -8317 -24550 -17495
7309 -17495 -20519 2511 15821 -549 2116 20852 16474 -5310 -17000 -36860 23888 22330 -10362
7296 -10362 -49451 -91853 -41000 -29304 1048 6666 -30854 11481 13144 16957 17070 1449 13847
7283 13847 -432 -26643 -45956 -19730 56126 61053 21396 -11170 -16410 -4097 -12413 25827
7271 25827 49851 27847 32194 11761 -29410 -155 34102 -2114 394 8854 15654 13021 -6084
7258 -6084 -18241 -4542 19744 -52821 -89472 -61935 -78727 -98493 -116133 -99677 -61015 -55540
7246 -55540 -34629 -55507 -56423 -41883 5891 17316 20932 -42328 -51132 -43062 -72478 -37340 29996
7233 29996 38470 15866 -26296 8773 42768 52733 11612 -105 31955 36791 -28608 -36663 -10530
7220 -10530 -10438 19630 51888 82813 83429 57030 35080 6990 5951 26150 -12225 -54053 -76429
7207 -76429 -88167 -103247 -91690 -77542 -99708 -91378 -63083 -91596 -157847 -154504 -95310 -34089
7195 -34089 -30807 -12931 1929 -15689 -15209 -37524 17963 38627 6902 21831 -7002 -19429
7183 -19429 -23354 -5271 10368 45018 54686 42370 19741 -1861 17431 36953 39723 10692
7171 10692 -2226 5081 28045 11861 11600 2084 -3446 -24872 -54305 -105467 -29391 -32119 -42716
7158 -42716 1820 22918 27500 22916 -55814 -108688 -65132 -35975 -38383 -32966 -18644 40141 65766
7145 65766 57580 56459 48812 40614 22165 -4908 5258 -13641 -14853 -7309 11441 15027 -963
7132 -963 -16622 -29706 6475 36065 17998 56397 67990 22791 15286 11424 25515 13375 14763
7119 14763 8197 32404 53814 64902 65766 82055 64932 32032 66376 93023 90744 81283 40543
7106 40543 39588 43983 71663 88032 63327 -28786 -96277 -86515 -32145 15589 -3476 27657 38068
7093 38068 9039 33943 56630 60070 77849 62023 -14122 -31254 -4404 -26790 9050 44240
7081 44240 64131 54071 49402 69049 33354 -1723 34481 -6685 -20933 -58351 -41733 -71249
7069 -71249 -38843 11247 26646 21527 18345 23562 -17874 -26647 -6196 -24054 -25945 -11295 8246
7056 8246 -6426 -34002 -7445 34612 31162 -20581 -19757 42072 65823 19807 -35562 -79988 -51729
7043 -51729 25773 47184 33133 19625 541 8483 21084 -3167 10361 24453 29466 -19030
7031 -19030 -38798 -96507 -88869 -84950 873 48597 51043 71016 39525 9595 -31847 -59220
7019 -59220 -37886 -27876 -9732 -67397 -93171 -72705 -8951 -9847 -31729 -29980 22282 -13287
7007 -13287 -24086 10155 26605 -35748 -61370 -57198 -43857 1906 -25461 6114 59050 23856
6995 23856 11799 -13689 1 -9028 -25351 12243 31416 45383 49609 62848 50631 33817
6983 33817 56712 40775 37607 -35846 -68386 -67577 -50501 -66611 -66622 -50728 -23572 -969 9983
6970 9983 -39697 -72569 -52206 -32066 -27034 -9887 -34141 -63511 -19633 -37521 -23984 -13185
6958 -13185 13170 14690 27592 16081 -295 -11662 -30838 -4941 45952 29043 -15101 13941
6946 13941 171 -3571 22340 25145 13153 23018 -6829 -77362 -87440 -91325 -75536 -63325 -71990
6933 -71990 -59293 -1050 36490 -25584 -42023 20232 10758 -13221 -57814 -23444 -1283 19089
6921 19089 35541 16434 -1828 58429 84636 78127 35364 26516 33602 29171 23180 -11220 13956
6908 13956 50864 10375 4537 8512 12330 -20154 -73354 -82682 -51200 -62554 -73487 -93884 -87986
6895 -87986 -50814 -49657 -8654 17492 19051 -42823 -45187 -34761 -58740 -72086 -54901 -42844
6883 -42844 -33620 -8991 -31504 -27922 -59968 -47412 -24857 -65882 -95988 -93591 -57550 -4896
6871 -4896 22681 13307 25613 72240 74088 60393 53735 -23237 -57910 -54869 -39960 -2276 31041
6858 31041 49917 38358 6180 -5769 -15501 -21194 -29253 -46309 -38862 -5811 25421 25623 35514
6845 35514 88387 34481 7273 4165 16026 39512 22036 20336 48507 31567 -42306 -83161
6833 -83161 -27507 35863 61670 59931 52023 -8493 -77611 -68941 -35923 -32705 -54976 -74878 -63650
6820 -63650 -6462 -36058 -64505 -76664 -28447 -10490 -29981 -97201 -77492 -69546 -66619 -94971
6808 -94971 -85295 -53472 5313 60339 56116 46491 -2593 -10291 68084 74113 9276 5430 27282
6795 27282 43030 46535 50747 16583 -14238 -33243 -43384 -49307 -78673 -98783 -38485 9121
6783 9121 -7001 -54635 -52279 13441 5432 -6161 19342 79358 116356 83766 73222 24993
6771 24993 10563 -6603 -20778 -9158 -9326 -35893 -52204 -22835 1121 -27902 -91482 -64665
6759 -64665 -13486 -10645 -35415 -18399 -1254 -13708 -43104 -10378 55748 84667 81335 45845
6747 45845 -28095 -83462 -99789 -50829 7332 27510 47679 56916 14776 -43044 -70487 -90815
6735 -90815 -86359 -116959 -69233 -24239 4814 37325 28482 8367 -26846 -41399 -26966 -54768
6723 -54768 -76610 -38067 -56008 -74491 -38700 -17260 -7447 -495 -7728 -27050 -54669 -48012 -20009
6710 -20009 55002 51489 28356 16037 17078 -22084 -88062 -98554 -32888 25442 -24486 -32443
6698 -32443 -1604 -13788 -20944 -45984 -51063 -22475 -6103 7274 17256 -4076 24655 4434
6686 4434 20608 28711 22539 67377 119662 56146 -8451 2732 10068 -24937 -23370 18625 33490
6673 33490 51282 24815 -33962 -15035 -1557 947 -22325 6159 28668 25924 20198 -12513
6661 -12513 -23783 -53339 -47523 -61068 -45582 -37911 -1468 -1274 -48290 -37827 15373 -11761 -48424
6648 -48424 -15066 6743 -10489 -30323 -6286 9511 -55279 -88727 -106632 -89109 -54508 -45454
6636 -45454 -30040 -21295 16642 56935 75398 91587 60561 1919 -1349 23963 -666 -26364
6624 -26364 -28292 -43576 -52638 -37133 -13997 -38166 -24740 -11892 -38111 -66614 -60482 -6499
6612 -6499 21875 52872 27739 3417 29932 74085 13277 -26156 2819 -6056 -31059 -36649
6600 -36649 -84150 -81690 -25192 -1310 -4339 -39022 -48976 -18011 -23518 -18838 -23231 1910 59990
6587 59990 64101 53468 2037 19507 46565 34721 -3027 -37421 -46561 -48576 217 29088
6575 29088 45410 73775 48732 -17111 -34135 -24467 -49381 -104115 -121534 -57615 -21406 4268
6563 4268 25099 25411 -21777 -40392 -11903 -50646 -53805 35092 24106 -15169 -35641 -30684 18587
6550 18587 18169 -3098 -43266 -26986 -7552 -31714 -55605 -93090 -79691 -31235 6500 -12338
6538 -12338 -100669 -119646 -109810 -65788 -15061 -2186 -13213 -45474 -59285 -84262 -45571 -26624
6526 -26624 -9919 -729 -5043 -19532 -10707 -2008 -20658 -37452 -31896 -77664 -65393 -58373 -68162
6513 -68162 -57376 -85454 -26236 -8849 -65246 -56955 -10487 4579 -5274 -27073 -15311 26506
6501 26506 35412 22256 -28909 -50669 -44536 -41234 -32843 -26854 -25451 -33962 -57587 -64818 -64783 7263
6487 7263 68190 58699 12578 20028 60709 58054 58900 44260 47376 54579 29992 -19604 -47057
6474 -47057 -60776 -41716 -13695 -293 -9468 14614 -3654 -31377 -23501 14638 -2054 30829
6462 30829 60493 63999 17930 -31737 -45977 -14498 7446 -12650 -30139 -49663 3587 55548
6450 55548 7183 -11854 -4047 -12745 -19125 -70553 -62662 -39818 -34765 -37207 -38963 -14928 -37750
6437 -37750 -48183 -43270 6305 6063 10548 33345 80030 31765 -511 27620 48452 34823 18121
6424 18121 -21831 -36371 -50056 -14129 49605 -5367 -38086 -36728 -20559 -19345 -35980 -26640
6412 -26640 -19863 -33265 -86604 -44582 -58496 -94376 -132014 -93416 -68879 -23782 50 -6337
6400 -6337 -34575 12841 47091 5491 -56770 -62758 -67406 -65668 -97027 -99207 -74051 -33003 -16693
6387 -16693 16005 41771 43915 32223 76357 132442 87482 -24433 -25935 5600 -46923 -10254
6375 -10254 46098 78673 56346 38994 72633 40511 47918 65653 73593 54453 35914 15224
6363 15224 20565 15545 7681 43630 80279 75422 27872 23820 50384 84629 98185 41249 40159
6350 40159 24958 8487 8064 -2725 -7481 -31109 -27244 -14426 12989 20782 44356 45588 -2735
6337 -2735 -34036 -61808 -93477 -63160 -35989 -18017 6678 18986 -55665 -60760 -71398 -47652
6325 -47652 4835 30801 18657 -25748 -68435 -77506 -86028 -53918 -34607 -11196 -39640 -25892
6313 -25892 -29552 -49213 -44707 -21205 10600 34044 49130 62402 26500 -9130 8939 -15663
6301 -15663 -2604 14569 40741 23860 -7313 8660 -2558 -2878 -9209 5927 2984 29679 11297
6288 11297 -36255 -58605 -79856 -100734 -65292 -37831 -23562 -8377 -53627 -52653 -48985 -77695
6276 -77695 -38787 -36708 -41307 -32014 -40551 -58273 -72976 -83605 -65146 -40090 -12596 -37509 -25925
6263 -25925 -37506 -19173 -21583 -12193 -26919 -23219 -11748 43650 56147 34960 7145 11723 23379
6250 23379 18739 18082 -12985 -35395 -14256 34632 52522 8740 -29762 -19193 5029 -1148 9180
6237 9180 53601 1649 -22349 27571 71338 54105 15077 -13037 -32251 -42211 -40593 -49118 -29579
6224 -29579 -33644 12783 29855 11418 -48360 -63236 -22351 -27816 -31356 -14925 12932 10905 2988
6211 2988 31282 56043 10120 -6063 -21852 39326 51752 26603 22626 31674 12051 -48298
6199 -48298 -6293 65170 30481 -21524 -9695 29574 27938 -2095 9624 29285 -1430 7995
6187 7995 50327 67488 85584 78721 37981 43868 83268 2752 -5172 24290 28243 39146 69106
6174 69106 31529 -2117 37055 23987 -33376 -61102 -41328 -62817 -58517 -52722 -60639 -44993
6162 -44993 -40694 62016 85441 63796 28471 3418 24045 9012 -27225 -22154 40383 53776
6150 53776 27474 -8301 -7984 11192 2477 4043 -5723 -7968 26357 2537 -22756 -28765 197
6137 197 34385 47503 -29178 -30404 5692 8646 30343 72173 65429 10330 10878 26598 30860
6124 30860 48537 40144 32308 45986 71942 9938 -19103 -51723 -74382 -41092 -50760 -60278 -10589
6111 -10589 -32186 -53996 -23215 -2245 -5215 -61564 -74987 -65819 -7258 3064 11001 -35509
6099 -35509 -32398 -58310 -88875 -103979 -102820 -61777 -20181 -50797 -52714 15810 -13501 -16600 -8032
6086 -8032 -30085 -75280 -44322 -59420 -45949 -43193 107 5561 29697 13335 -6789 33124
6074 33124 31511 35839 32619 -9919 -62342 -74007 -23903 57613 59996 -4658 -24615 -16257 2959
6061 2959 -321 -83522 -113653 -56848 -32904 11742 49940 65531 28281 -5646 5132 -10435
6049 -10435 30825 57465 65050 57141 38059 20376 -9935 -21618 -10866 -28254 -12885 -26243
6037 -26243 -46919 -8184 5683 36785 72651 77124 39030 40275 -4665 -11633 -11956 -38173 -56298
6024 -56298 -74991 -22538 18738 13936 54056 88367 59511 26202 -21195 -48713 -1536 -44644
6012 -44644 -49850 -1870 -279 -34248 -41117 -52398 -51300 12014 11967 -899 3290 -220 -20117 -26396
5998 -26396 -14891 9795 3100 13314 -885 -19424 -24328 -11888 29250 66293 72728 69689 66871
5985 66871 42686 -12472 -5768 19306 -129 4600 5198 -1386 6444 -8640 -41908 -32843 1268
5972 1268 32920 79011 111240 97086 57164 1614 24605 32470 31337 13109 16351 19885 28333
5959 28333 55773 95017 107887 61568 46853 53320 38237 44340 38353 29517 27618 -7512 -32591
5946 -32591 -40495 -41960 -2907 14698 14504 15297 24314 17690 103333 89068 75829 74525 65734 51433
5932 51433 11862 12072 5665 -1069 -23254 274 -29067 -18230 22340 50309 47877 59537 42374
5919 42374 7371 4742 -9176 -7921 24126 35934 -2284 8578 53815 78797 65669 68008
5907 68008 22479 -3393 15225 17230 30244 11498 -65600 -68163 1931 -3457 -755 9094 39157
5894 39157 26339 -23225 -57344 -52131 -77410 -66477 -8302 33760 12919 5479 -25838 -28121
5882 -28121 7932 3610 -40145 -21619 17780 29810 472 38840 105915 61915 -657 7892
5870 7892 56823 29116 -41744 -11517 13310 1109 -21228 -42679 -6691 9143 26956 51692
5858 51692 43743 21166 -13323 -26993 -12519 5583 6587 9821 37193 29976 17334 49422 8425
5845 8425 -29385 -32250 -36735 -22338 12670 2890 -3566 12069 -50459 -85446 -55191 -3793 -34380
5832 -34380 -58506 -36260 -26087 -19038 -21814 47060 88792 59938 38185 38987 1516 -15509 -19370
5819 -19370 -15749 -39010 -25706 -10443 -8595 -4452 2073 -25406 -43118 -41656 -57423 -53689 -62097
5806 -62097 -32779 -31482 -45905 -17161 3668 851 32516 24112 17410 23901 60859 69678 7675
5793 7675 -43599 -78559 -70634 -34703 -49731 -48062 -4908 12830 10589 12956 37265 47072 53209
5780 53209 28666 4968 34008 84156 49380 7720 21681 17152 -15647 -4525 -9109 54950
5768 54950 55934 9254 36383 61884 64290 41876 19688 3673 37715 69716 41380 -17205
5756 -17205 -69058 -57539 -39487 -40992 -46372 -83007 -56711 -13255 -20939 -29060 2183 28685 -1689
5743 -1689 6283 34417 31022 19811 -30773 -48381 -19283 13956 -35616 -57292 -10049 43029
5731 43029 45336 -18391 -79001 -80786 -73652 -67007 -80522 -96395 -118529 -133011 -106209 -95271 -65325
5718 -65325 -41323 -5014 -9880 -66683 -69402 -78741 -110196 -85673 -32868 -38480 -15764 4820 -1494
5705 -1494 -19883 -36475 -69037 -68306 -42462 -42760 -30842 -11448 -39886 -33015 -15518 -19224 8150
5692 8150 40681 10999 -31745 -75328 -58056 -18189 26725 75517 66798 39308 20466 -8436
5680 -8436 677 35229 -10528 -21253 3772 7703 -5641 38567 42668 18463 -150 -31368 -71639
5667 -71639 -29178 53547 65408 58415 60193 29475 15377 17039 -4635 -17621 23752 50848
5655 50848 27284 57790 61885 72194 14569 -29147 -34483 -21524 -78458 -102859 -116388 -108823
5643 -108823 -48938 -2868 14258 -1104 3416 35180 33843 -3855 -42502 -47810 -56759 -52970 -30025
5630 -30025 -35199 -11297 29479 39012 50233 30052 -2318 20611 51116 56503 57474 51074 38869
5617 38869 1754 5067 1148 -29014 -35932 -43868 -57253 -21772 22860 4465 -6987 2377 46602
5604 46602 63794 -23 -40079 -45849 16713 48949 46714 39970 40474 47918 22099 12688 27647
5591 27647 -15487 -26709 -1863 22621 54678 56976 26062 23906 48917 30575 25008 -13393
5579 -13393 -36118 -46811 -18520 6926 17167 23031 27975 30230 29584 35324 44793 32737 35704
5566 35704 73455 73095 103273 136552 123110 62751 23775 11315 31540 49218 30448 8319
5554 8319 -63166 -142393 -82645 -9756 -10220 31811 26991 3426 25767 21634 12610 15864 -2447
5541 -2447 -33050 -28066 -45523 -82465 -56061 -45003 -45746 -25064 -41656 -57374 -55128 -16342 -26849
5528 -26849 -35584 -49895 -50397 -21901 -10601 -10701 428 -22948 -28911 -25025 56267 78906 68854
5515 68854 2137 -9786 14014 -10285 -27855 -42146 -23803 -11361 2322 -31781 -52992 -60415
5503 -60415 -28444 6027 -8282 14685 34780 23114 2896 -27595 -18231 -8315 -21018 -593
5491 -593 47462 56556 38615 30799 61943 50193 15298 36452 61687 46701 74841 111663 99462
5478 99462 67454 52104 26422 4797 -3306 9020 22788 46872 73085 25088 -16677 -1432
5466 -1432 -8714 -30860 -42890 -34361 -54574 -14418 -14806 -20760 -23001 -6438 -20452 -46700 -35360
5453 -35360 -13826 -19855 -66314 -52546 -46383 -261 44255 51786 59004 35770 30565 37740 56652
5440 56652 25527 29835 26490 -33547 -69636 -51446 -32769 -30857 -52720 -60454 -82366 -35805 -7564
5427 -7564 -11503 -15786 -34903 -94313 -119372 -110235 -61650 -1407 74835 73291 3705 4013 67268
5414 67268 72700 33035 13207 2268 20285 -18839 -71938 4407 62415 75607 13328 -37061
5402 -37061 -32770 -105041 -153275 -103496 -47844 2966 -21742 -79794 -86030 -59702 -45720 -18974
5390 -18974 18113 33668 18675 7406 33499 32121 20080 14329 12095 -5827 30835 34091 15354
5377 15354 -27955 -47645 -38764 -12198 -36970 8094 38911 49926 42711 18884 26587 23021 55313
5364 55313 87903 45590 25454 24615 2295 -49715 -64081 -75650 -107876 -88064 -54879 -44505
5352 -44505 -53148 -96438 -100592 -36869 66077 80911 41904 2621 -42784 -54955 -56033 -53967
5340 -53967 -35041 -61782 -95026 -106076 -86713 -33051 26756 25113 -4808 -41621 -87323 -69573
5328 -69573 -39563 -58037 -43707 -78532 -50169 29484 16210 -31345 -80286 -54135 -15921 -5548
5316 -5548 -48734 -105469 -96152 -59893 -29003 -39702 -65210 5889 -32277 -84530 -92130 -64735
5304 -64735 -26925 36297 29882 5218 -16853 7667 31671 30938 -11144 -39923 -50055 -44823 -22383
5291 -22383 -31310 -35065 -56648 -60296 -10960 11615 29655 32827 10035 -44296 -68876 -43870 -42770
5278 -42770 -43429 -42373 -35227 -23058 -3655 -70632 -108379 -76651 -59953 -49954 -18662 -31146 -23481
5265 -23481 51447 40837 39059 13315 -32704 -62385 -24167 -33946 -47228 -70233 -66310 -29256
5253 -29256 -742 -4975 -42225 -62723 -64727 -647 26081 23183 -443 27827 46813 33088
5241 33088 19826 -5510 -52125 -22184 -4193 -59152 -57030 -25701 -22405 -54955 -45705 -23624
5229 -23624 -24778 -8665 -51262 -49813 -20037 -43524 -47060 47849 105987 98923 79260 58997 43493
5216 43493 7114 -16363 -21847 20384 62113 43780 10766 63392 12879 -2165 -15157 -6561
5204 -6561 -7699 -19161 -63989 -90425 -73936 3984 64222 92908 72803 54430 9967 -45260
5192 -45260 -51226 -40816 -28226 -10789 -38893 -8691 -30692 -31196 -75331 -94807 -61843 -47146
5180 -47146 -44732 -42050 -48016 -60590 -38313 -55861 -63372 -49020 -89905 -52177 -14776 -3084 -7900
5167 -7900 23608 23682 3694 -10238 -15258 16200 28871 -38904 -45853 -61173 -46437 -62321 -45506
5154 -45506 -27907 -57697 -87114 -69317 -18355 3856 -3650 -30760 -42895 -46046 -40765 -27528
5142 -27528 11683 44031 53590 81209 100042 79073 46098 45317 40338 63145 35549 -4334 11202
5129 11202 49858 46336 45607 38100 32356 48540 41235 5808 -15899 29896 91316 99854 49018
5116 49018 44225 48909 42957 55255 86950 70953 40480 -14023 -10985 -6067 -46401 -64106 -38344
5103 -38344 -45811 -21425 -2549 33706 71492 70554 16219 -12942 -9383 -17708 21118 46508 47878
5090 47878 51054 -1873 -1871 36395 -6316 -55474 -19784 -4035 -14565 -24068 14150 22959 10989
5077 10989 -28287 -90920 -116302 -91077 -48046 -60810 -103348 -132613 -75064 -27109 -24068 -13915
5065 -13915 -18870 -27665 6339 44529 18674 32042 13170 -20056 -32154 -35133 -29514 -35178 -55932
5052 -55932 -23459 -10103 -19985 28924 47078 12773 -12175 -38653 -28197 -43936 -7466 48914
5040 48914 69981 60335 -5121 2875 23138 69265 86693 45589 33124 40575 -5485 -48858
5028 -48858 -28222 -6320 23918 -4244 4199 40044 38222 41057 18479 -21126 -36756 16715
5016 16715 65726 44238 28151 39876 60021 81812 81479 96802 82155 34294 37273 31543 7600
5003 7600 20787 38812 52695 57128 -12466 -56008 -58668 -39414 -39348 -48135 -53959 -42994 -25161
4990 -25161 56818 81602 54453 2798 -19510 -6364 -45827 -3383 45213 -239 -54424 -25872
4978 -25872 34719 -8659 -1108 55936 68419 75903 57885 -9980 -30344 -31471 -14817 -33138
4966 -33138 -55749 -64993 -92991 -137533 -90590 -40501 -53545 -68691 -43373 -20264 43746 66238
4954 66238 54326 34633 12832 -18824 -37153 -28337 -22616 -44407 -83418 -87839 -16446 -44449
4942 -44449 -91643 -74474 -92335 -66684 -43695 -46108 -19863 1814 -22214 -34891 -40668 -64754
4930 -64754 -79285 -27034 17139 46967 44627 2610 -43011 -9840 -13192 -56338 -70565 -38095
4918 -38095 -14877 19302 23444 -20672 -15213 -542 40639 23856 -18314 -56945 -26254 -17739
4906 -17739 28311 63767 68557 50730 27538 -779 2084 155 2871 -1204 -42015 -76216 -91610
4893 -91610 -64702 -46180 -1472 -38319 -40051 -26353 -24400 12382 45291 37431 37830 63177 86045
4880 86045 100553 54907 8591 -2079 -11913 39308 47036 72552 46612 59595 81096 29590
4868 29590 14082 22785 16722 -26372 -17607 15247 26106 37595 33362 20905 17062 9067 -8242
4855 -8242 1273 5054 26577 60209 50252 26304 52156 37663 14017 31735 73690 104764 100772
4842 100772 37295 13496 48213 48851 6545 15688 8325 -25046 -21031 -31630 -6683 11585 -12976
4829 -12976 -26527 -40490 -49247 -59735 -100316 -103475 -100648 -83985 -38333 -30796 -90620 -118636 -111772
4816 -111772 -99158 -59465 -15287 2876 -3753 -25362 -29947 -103190 -96047 -67411 -33775 -20698
4804 -20698 434 -44593 -37591 -11928 -12107 -13819 17186 63270 93650 71044 30500 19813 -12276
4791 -12276 1799 16774 -33922 -94045 -88816 -90091 -68782 -80433 -74094 -56752 -55054 -44724 -34465
4778 -34465 -33663 6640 -17298 -55646 -104819 -128346 -107925 -112450 -101416 -114098 -158729 -182013
4766 -182013 -169771 -78452 -24351 -43605 -85373 -72937 -32574 -42449 -45174 -59264 -38860 -17615
4754 -17615 8815 34210 35308 5880 16883 48483 9385 -17286 23757 20333 19615 -5397 -44891
4741 -44891 -80330 -48736 -38002 -6997 33606 21443 -13357 -35099 -28832 -29847 -38382 -50038
4729 -50038 -57999 -75214 -65746 -64015 -76061 -84012 -59292 -15249 -13643 -48125 -27060 -69269 -39086
4716 -39086 -14615 -36030 -57595 -49920 -27263 -29737 -3435 74219 130339 103556 52439 -12278
4704 -12278 -7112 16427 39682 10178 -33875 2910 6675 45672 69477 67686 65051 30774 -8887
4691 -8887 41810 66002 40181 20872 30669 26731 62980 100634 75868 880 -31788 -30224 3217
4678 3217 -10943 -14700 -19451 -34333 -41765 -42282 -20734 -32178 -78751 -57999 14278 72224 62714
4665 62714 25852 55593 71694 66795 71745 70500 28155 31576 19277 19214 -13461 -916 -972 -10467
4651 -10467 12794 2619 -17612 -16438 -35450 -32997 -58209 -77846 -98581 -83825 -43148 -21024
4639 -21024 -37592 -31768 -21534 -19134 -29818 -54241 -66961 -49820 -42926 -71100 -85802 -55251
4627 -55251 -53239 -30572 -6855 19948 81318 74486 31362 28595 76789 63394 68789 47208 -266
4614 -266 67871 125836 71179 34850 34390 39926 81370 105232 96259 29885 1433 4433 -8520
4601 -8520 7911 22903 74380 91905 75790 22041 4718 17298 5356 -20570 41489 35335
4589 35335 31193 47453 34879 24927 4858 40531 52782 103 30020 52363 30992 16702
4577 16702 10215 10200 28388 7928 30842 368 -47781 -87859 -111614 -80025 -69513 -87475 -105794
4564 -105794 -59813 -2027 7245 -42357 -37382 -41103 3562 34434 33487 70361 64155 64891 78210
4551 78210 98374 108649 79979 74305 27896 6059 1676 31024 39171 14879 10818 199 -26295
4538 -26295 24271 48560 64088 65491 21944 -30335 -37829 -12892 42138 39593 59401 68803 30888
4525 30888 -19473 -36800 -1818 50776 72760 71474 17613 3051 39479 40110 11336 26418
4513 26418 -9745 -8623 46523 87838 67067 46304 47958 27297 -7398 -27710 -83302 -97360
4501 -97360 -71562 -40614 -12701 -30106 -23208 -67356 -106533 -132903 -63270 -9292 -25941 -20717
4489 -20717 -41556 -32282 23430 52365 58518 -24 -50301 -66101 -54685 -28055 29181 28158
4477 28158 44713 69456 71055 10060 -25322 -30172 -7764 16863 14412 -1003 17196 39751
4465 39751 27023 36135 30056 14935 -8553 29758 72654 90315 100526 94333 86017 104939 66196
4452 66196 32160 27854 41927 59069 38577 -5702 -291 3007 5105 10589 -11828 -23506 -17234
4439 -17234 -22307 -70663 -76109 -45190 -44163 -73057 -59752 -45190 -34617 -17163 -64777 -92302
4427 -92302 -42007 22148 74802 78377 61564 47519 87327 75196 19035 -13684 -46870 -89462
4415 -89462 -75313 -44200 -24087 -66829 -69923 -27928 -6232 19495 15152 -12328 32096 71231
4403 71231 61077 61283 9653 7195 -23846 -38134 5566 -28847 -61582 -38760 13521 6432 -35971
4390 -35971 -53942 -94817 -61689 -48461 -27209 -42591 -33157 27200 69781 77697 54339 33788
4378 33788 31668 56839 41895 24241 28176 -18013 -41760 -43658 -53164 -47621 -6989 -28177 -18465
4365 -18465 -17272 -50851 -98804 -128311 -131257 -87540 -49220 -26498 -47021 -16633 -46109 -83708
4353 -83708 -107607 -87489 -85257 -69936 -100302 -82799 -78611 -52428 -13739 2515 -36159 -47701
4341 -47701 -71602 -18044 17113 -38943 -43333 -8605 7534 29746 1240 -15510 -15587 -29081 -34757
4328 -34757 -81840 -67076 -49797 -30661 -31337 -19121 61557 74767 39271 15882 19742 13647 -31585
4315 -31585 -45184 -49686 -49101 -68576 -100981 -97336 -81935 -79020 -82695 -58729 -5960 -8905 -44706
4302 -44706 -11859 7691 -20121 -13074 8450 40685 60080 49824 12862 1184 -45548 -87914
4290 -87914 -69728 -52983 -27446 -32672 -23081 -41184 -59971 -93158 -90536 -36614 -31834 -2661 47448
4277 47448 24945 -958 -2320 29011 39713 14574 -10964 -5646 -10458 -36096 -10096 33322
4265 33322 -8515 -46714 -61559 -3602 -20446 -48799 17542 65809 54839 14458 -26470 -21366
4253 -21366 -15365 -5748 -21776 -26399 -24749 -48630 -75041 -96638 -69491 -75452 -70393 -41632 5207
4240 5207 39555 6228 -45149 -113829 -85295 -32602 -17097 -10436 -12275 -50646 -73493 -89448
4228 -89448 -114321 -122704 -115768 -99655 -57460 -52771 -47879 -30028 19796 36406 -9523 -4722 -5394
4215 -5394 -17868 -70878 -98184 -104424 -96287 -49607 -17619 15746 37385 14590 -7129 -6924 16753
4202 16753 16978 53463 20037 11879 1155 17657 10419 8024 -12928 -43225 -69677 -60897 -45060
4189 -45060 -50177 -79278 -75447 -114847 -173702 -117210 -92048 -103062 -61479 -73766 -83791 -73684
4177 -73684 -44597 9758 64355 44806 5204 -44814 -47756 -35594 -54394 -39383 -32738 -16231
4165 -16231 7891 -4466 -39445 847 -8028 -15360 -39765 -55300 -32373 -37579 -35179 -32572 -22955
4152 -22955 -68016 -30868 -7630 -42431 -75026 -30811 -21096 -26070 27156 54996 54231 45269 17331
4139 17331 19541 34851 43101 4536 -28004 -23813 14990 51867 27835 13925 34531 34463 -46057
4126 -46057 -53121 -16499 -38096 -55773 -33402 -3404 10733 52108 70755 48814 14491 4259
4114 4259 28981 15688 -15198 61507 62685 44794 40304 6497 23934 39992 23297 1335
4102 1335 -5707 -27012 201 20657 -4676 16105 33581 9859 -36311 -42708 -38200 -15616 -4907
4089 -4907 -39164 -50535 -24264 -37822 -13785 -21853 -25186 -34686 -24552 25445 -24252 -38226 15503
4076 15503 45874 56701 49409 -1069 6701 -39900 -81703 -81376 -63417 -74852 -89813 -57660 21718
4063 21718 8251 -20123 -28544 -14058 -17145 3768 23277 13401 -35039 -89213 -78028 -47054
4051 -47054 -86351 -75026 -21579 -37479 -60799 -44134 4997 -16881 -44023 -49582 -29733 -18918
4039 -18918 -25821 -49316 -68610 2037 9510 -48334 -63252 -33941 20716 49690 49708 34373 39339
4026 39339 58382 45716 37049 60921 93470 107985 6218 -60287 -21600 -21559 -29309 5160 11714
4013 11714 14564 -9848 -46851 -75182 -62946 -12345 10018 4643 10602 -13517 -61969 -91868
4001 -91868 -83291 -57925 32736 52846 33113 42201 17881 -11074 -14558 -35846 -64529 -64269 -50491
3988 -50491 -4042 36159 66706 52287 888 -17708 -14802 -330 -5999 -4019 15148 -20602
3976 -20602 -23676 15869 15465 28563 89705 74118 -725 14824 -30049 -69665 -66745 -57141 -65897
3963 -65897 -4377 9778 7067 -20150 6620 34490 25534 -29479 -60571 -48285 -25836 -13889
3951 -13889 -25543 794 24845 -2848 -902 18476 28351 10510 -25278 -40368 -39317 -40930 -49874
3938 -49874 3834 6426 -46068 -70226 -39301 -34428 3250 57796 65426 17110 1922 -21182
3926 -21182 -42471 -19201 17801 58552 62538 49263 39646 69454 45629 44043 14979 -27189
3914 -27189 -24234 -24529 2757 24290 -1336 -7791 9001 -5798 -41780 -62466 -58726 -14394 38903
3901 38903 19361 38575 21715 1235 29127 44469 67505 68855 62645 -2631 -45963 -12455
3889 -12455 -1701 -20642 -35123 -35033 -40239 -18723 -50701 -47735 -38503 -8570 -14709 -20562 10754
3876 10754 43115 58804 132780 155697 109162 56823 34335 62547 77899 90405 74092 97471
3864 97471 62439 38313 30073 46499 25176 29345 36 16170 38692 25085 49813 95134
3852 95134 123571 77427 14729 4086 -6094 -27050 -10206 -7053 -10297 -34503 -42115 -16936
3840 -16936 45283 60784 24931 13408 58568 62223 13969 4151 -24757 -20015 7327 5874 2552
3827 2552 -9873 3513 -2127 -51002 -59886 -59017 -44418 -25295 -16144 -15716 -5278 -12021 -35798 -5057
3813 -5057 -66824 -40798 2690 13070 -16270 9736 20840 3932 -12846 -24912 -28678 -49309
3801 -49309 -3563 19744 -18081 -34182 41063 49829 32368 -8244 -27334 -13197 -937 -38678
$$ [...]
##END NTUPLES=NMR SPECTRUM
##END=
