##TITLE=Analysis number 309196
Compound Code sew 02869
Book Reference 409/126/4
Project Code adrs
Chemist Name peted
##JCAMPDX= 6.0         $$ Bruker NMR JCAMP-DX V2.0
##DATA TYPE= NMR SPECTRUM
##DATA CLASS= NTUPLES
##ORIGIN= Bruker BioSpin GmbH
##OWNER= NMR
$$ XWIN-NMR		Version 3.5
$$ Tue May 31 10:39:11 2005 GMT Daylight Time (UT+1h)  MAYBRIDGE\NMR@NMR_250MHZ
##.OBSERVE FREQUENCY= 250.131544655141
##.OBSERVE NUCLEUS= ^1H
##.ACQUISITION MODE= SIMULTANEOUS (DQD)
##.ACQUISITION SCHEME= undefined
##.AVERAGES= 16
##.DIGITISER RES= 18
##SPECTROMETER/DATA SYSTEM= dpx250
##.PULSE SEQUENCE= zg30
##.SOLVENT NAME= CDCl3
##.SHIFT REFERENCE= (INTERNAL, CDCl3, 0, 16.522)
##AUDIT TRAIL= $$ (NUMBER, WHEN, WHO, WHERE, WHAT)
$$ ##TITLE= Audit trail, XWIN-NMR		Version 3.5
$$ ##JCAMPDX= 5.01
$$ ##ORIGIN= Bruker BioSpin GmbH
$$ ##OWNER= NMR
$$ C:\u/data/dgb/nmr/ADRS/3640/pdata/1/auditp.txt
$$ ##AUDIT TRAIL=  $$ (NUMBER, WHEN, WHO, WHERE, WHAT)
(   1,<2005-05-31 10:38:32.54 +100>,<MAYBRIDGE\NMR>,<NMR_250MHZ>,
      <created by zg, POWCHK disabled, PULCHK disabled
       configuration hash MD5:
       62 19 C7 07 E1 42 D1 B7 37 6C 3D D0 77 39 F9 E6
       data hash MD5: 64K
       39 DE E5 F5 41 B1 AC EC 9E 34 6A F8 4C 7A 51 77>)
(   2,<2005-05-31 10:38:51.02 +100>,<MAYBRIDGE\NMR>,<NMR_250MHZ>,
      <Start of raw data processing
       ef LB = 0.3 FT_mod = 6 PKNL = 1 SI = 32K 
       data hash MD5: 32K
       69 87 09 43 DB 27 40 57 A9 3D AE 07 4E F9 78 DA>)
(   3,<2005-05-31 10:38:57.17 +100>,<MAYBRIDGE\NMR>,<NMR_250MHZ>,
      <apk 
       data hash MD5: 32K
       25 58 69 04 15 2B A9 01 D2 CD 18 AB E4 BE 95 2F>)
(   4,<2005-05-31 10:38:59.18 +100>,<MAYBRIDGE\NMR>,<NMR_250MHZ>,
      <abs ABSG = 5 
       data hash MD5: 32K
       C6 29 8D 09 1A 78 01 CB 74 5E 75 33 D9 56 20 36>)
$$ ##END=
$$ 
$$ hash MD5
$$ 8F F2 41 B1 E4 F6 18 F4 53 56 1B AE 82 55 3C B0
##$RELAX= 
##$RELAX= 
##$RELAX= 
##$RELAX= 
##$RELAX= 
##$RELAX= 
##$RELAX= 
$$ Bruker specific parameters
$$ --------------------------
##$DU= <C:\u>
##$EXPNO= 3640
##$NAME= <ADRS>
##$PROCNO= 1
##$TYPE= <nmr>
##$USER= <dgb>
##$AMP= (0..31)
100 100 100 100 100 100 100 100 100 100 100 100 100 100 100 100 100 100 
100 100 100 100 100 100 100 100 100 100 100 100 100 100 
##$AQSEQ= 0
##$AQ_mod= 3
##$AUNM= <au_zg>
##$AUTOPOS= <32 >
##$BF1= 250.13
##$BF2= 250.13
##$BF3= 250.13
##$BF4= 250.13
##$BF5= 500.13
##$BF6= 500.13
##$BF7= 500.13
##$BF8= 500.13
##$BYTORDA= 1
##$CFDGTYP= 0
##$CFRGTYP= 5
##$CHEMSTR= <none>
##$CNST= (0..31)
1 1 145 1 1 1 1 1 1 1 1 1 1 1 1 1 1 1 1 1 1 1 1 1 1 1 1 1 1 1 1 1 
##$CPDPRG= <>
##$CPDPRG1= <>
##$CPDPRG2= <>
##$CPDPRG3= <>
##$CPDPRG4= <mlev>
##$CPDPRG5= <mlev>
##$CPDPRG6= <mlev>
##$CPDPRG7= <mlev>
##$CPDPRG8= <mlev>
##$CPDPRGB= <>
##$CPDPRGT= <>
##$D= (0..31)
0 1 0 0 0 0 0 0 0 0.06 0 0 0 0 0 0 0.0002 0 0 0 0 0 0 0 0 0 0 0 0 0 0 
0 
##$DATE= 1117532311
##$DBL= (0..7)
120 120 120 120 120 120 120 120 
##$DBP= (0..7)
150 150 150 150 150 150 150 150 
##$DBP07= 0
##$DBPNAM0= <>
##$DBPNAM1= <>
$$ [...]
##$SUBNAM7= <"">
##$SUBNAM8= <"">
##$SUBNAM9= <"">
##$SW= 20.6930455092707
##$SWIBOX= (0..15)
0 0 3 0 0 0 0 0 0 0 0 0 0 0 0 0 
##$SW_h= 5175.983436853
##$TD= 65536
##$TD0= 1
##$TE= 295.16
##$TE2= 300
##$TE3= 300
##$TEG= 300
##$TL= (0..7)
0 120 120 120 120 120 120 120 
##$TP= (0..7)
150 150 150 150 150 150 150 150 
##$TP07= 0
##$TPNAME0= <>
##$TPNAME1= <>
##$TPNAME2= <>
##$TPNAME3= <>
##$TPNAME4= <>
##$TPNAME5= <>
##$TPNAME6= <>
##$TPNAME7= <>
##$TPOAL= (0..7)
0.5 0.5 0.5 0.5 0.5 0.5 0.5 0.5 
##$TPOFFS= (0..7)
0 0 0 0 0 0 0 0 
##$TUNHIN= 0
##$TUNHOUT= 0
##$TUNXOUT= 0
##$USERA1= <user>
##$USERA2= <user>
##$USERA3= <user>
##$USERA4= <user>
##$USERA5= <user>
##$V9= 5
##$VALIST= <valist>
##$VCLIST= <CCCCCCCCCCCCCCC>
##$VD= 0
##$VDLIST= <DDDDDDDDDDDDDDD>
##$VPLIST= <PPPPPPPPPPPPPPP>
##$VTLIST= <TTTTTTTTTTTTTTT>
##$WBST= 1024
##$WBSW= 4
##$XGAIN= (0..3)
0 0 0 0 
##$XL= 0
##$YL= 0
##$YMAX_a= 386143
##$YMIN_a= -313237
##$ZGOPTNS= <>
##$ZL1= 120
##$ZL2= 120
##$ZL3= 120
##$ZL4= 120
##$ABSF1= 16.522
##$ABSF2= -4.171173
##$ABSG= 5
##$ABSL= 3
##$ALPHA= 0
##$AQORDER= 0
##$ASSFAC= 0
##$ASSFACI= 0
##$ASSFACX= 0
##$ASSWID= 0
##$AUNMP= <proc_1d>
##$AZFE= 0.1
##$AZFW= 0.1
##$BCFW= 0
##$BC_mod= 0
##$BYTORDP= 0
##$COROFFS= 0
##$CY= 12.5
##$DATMOD= 1
##$DC= 0
##$DFILT= <>
##$DTYPP= 0
##$F1P= 14.0000005364418
##$F2P= -0.99999901652339
##$FCOR= 0.5
##$FTSIZE= 32768
##$FT_mod= 6
##$GAMMA= 0
##$GB= 0
##$INTBC= 1
##$INTSCL= 1
##$ISEN= 128
##$LB= 0.3
##$LEV0= 0
##$LPBIN= 0
##$MAXI= 10000
##$MC2= 0
##$MEAN= 0
##$ME_mod= 0
##$MI= 0
##$NCOEF= 0
##$NC_proc= -4
##$NLEV= 6
##$NOISF1= 0
##$NOISF2= 0
##$NSP= 0
##$NTH_PI= 0
##$NZP= 0
##$OFFSET= 16.522
##$PC= 1
##$PHC0= -60.81213
##$PHC1= -11.56633
##$PH_mod= 1
##$PKNL= yes
##$PPARMOD= 0
##$PSCAL= 4
##$PSIGN= 0
##$REVERSE= no
##$SF= 250.13
##$SI= 32768
##$SIGF1= 0
##$SIGF2= 0
##$SINO= 400
##$SIOLD= 32768
##$SREGLST= <1H.CDCl3>
##$SSB= 0
##$STSI= 32768
##$STSR= 0
##$SW_p= 5175.98343685301
##$SYMM= 0
##$S_DEV= 0
##$TDeff= 65536
##$TDoff= 0
##$TI= <Analysis number 999999
Compound Code 99
Book Reference 9
Project Code 9>
##$TILT= no
##$TM1= 0
##$TM2= 0
##$TOPLEV= 0
##$USERP1= <user>
##$USERP2= <user>
##$USERP3= <user>
##$USERP4= <user>
##$USERP5= <user>
##$WDW= 1
##$XDIM= 32768
##$YMAX_p= 428203138
##$YMIN_p= -909335
$$ End of Bruker specific parameters
$$ ---------------------------------
##NTUPLES= NMR SPECTRUM
##VAR_NAME=  FREQUENCY,     SPECTRUM/REAL,   SPECTRUM/IMAG
##SYMBOL=    X,             R,               I
##VAR_TYPE=  INDEPENDENT,   DEPENDENT,       DEPENDENT
##VAR_FORM=  AFFN,          ASDF,            ASDF
##VAR_DIM=   32768,         32768,           32768
##UNITS=     HZ,            ARBITRARY UNITS, ARBITRARY UNITS
##FACTOR=    0.157963299565203, 1,           1
##FIRST=     4132.6476996994, 0,             0
##LAST=      -1043.33573715361, 0,           0
##MIN=       -1043.33573715361, -909335,     0
##MAX=       4132.6476996994, 428203138,     0
$$ Real data points
##PAGE= N=1
##DATA TABLE= (X++(R..R)), XYDATA
$$ [...]
28278 63300 38126 40271 65100 35943 24231 46440 37890 -19483 -26391 48143 110912 68772
28266 68772 71679 63328 26500 -41313 -25397 32949 50130 103736 179239 157563 109641 2140
28254 2140 -26695 6908 83701 45245 -480 6863 -46867 -70847 2120 48904 -2774 17418
28242 17418 37078 26545 -6062 39736 57872 38160 55925 131744 159693 186679 135617 43530
28230 43530 -44504 -80811 -80412 -27024 4533 -17365 -36152 -4766 -76746 -108521 -92171 -208943
28218 -208943 -264199 -233532 -189225 -114410 -621 94172 90481 59970 148465 130917 92687
28207 92687 50410 -30496 -59510 -80935 -31615 -32171 6044 33216 68577 69557 23822 -43877
28195 -43877 -40509 -34433 24024 83807 127608 33086 25650 86964 44437 -1515 -37245 -16216
28183 -16216 -44269 -91829 26040 41875 54240 103093 38523 -13654 -13377 15254 -16336 17661
28171 17661 10135 -27874 -60839 -66095 45083 60150 -94024 -141672 -179 164072 144149
28160 144149 37817 34898 -8215 -89405 -90126 -41055 -72821 -60720 31816 24353 1187 -27083
28148 -27083 -39778 -45636 -110115 -119763 -99621 -140500 -131291 -69053 -82064 -60636 53761 53345
28136 53345 11160 -76262 -71871 -27357 33969 28616 52198 48226 96576 128526 128380 152466 77841
28123 77841 25570 40111 40591 96739 111750 5998 -11255 47818 71931 85061 114971 73148
28111 73148 -20048 -106190 -35214 11785 45323 24434 -1258 -51819 -2836 48401 18658 -83485
28099 -83485 -161739 -104944 -93706 -82991 -89011 5780 6035 -6601 -27255 -23625 8145 -75541
28087 -75541 -147231 -163196 -72347 -52541 -34925 -90099 -83520 -61629 33976 180705 139700 164054
28075 164054 142607 107769 -7833 -38065 38894 93364 32903 15274 -18420 -17054 -19439 45956
28063 45956 74892 83218 24465 8157 67197 50798 -11113 -143553 -158935 -72414 -31955 -53245
28051 -53245 -15318 51551 74083 10547 3657 -10046 -31717 -45866 -21917 30632 78771 56552
28039 56552 37052 100646 113943 44546 68333 81802 39720 -64966 -119236 -124575 -154540 -145814
28027 -145814 -91623 -48280 -9599 -11437 -124096 -134491 -93374 -99028 -112797 -83708 -99664 -117007
28015 -117007 -97497 18179 51564 25035 5398 -5269 33813 89324 77402 21859 30899
28004 30899 30154 72431 93367 6625 15168 126347 190579 86309 95553 105853 81965 93004
27992 93004 156208 136660 145389 113052 58666 73802 88635 121598 101630 10795 27072 -20208
27980 -20208 -46232 -57936 -38850 35362 21009 8305 14179 54096 133278 115693 109801 11271
27968 11271 -36482 -42332 -49802 48399 79987 56778 83203 82647 80211 81649 37201 25837 10874
27955 10874 43410 27844 20600 74239 -45672 -7240 83680 131288 47412 38572 10053 38032
27943 38032 11810 -27197 68005 164918 142273 56635 75156 -41724 -24437 50443 9013
27932 9013 30511 12853 22520 14455 55595 113184 107540 78400 66491 55180 33593 46280
27920 46280 31375 66938 61853 50686 -18346 -50882 -46288 -35808 18862 98390 67220 65046
27908 65046 115810 104318 6323 25890 -18440 -78671 -52126 26647 34453 28834 -25445 -56441
27896 -56441 -9439 34495 -13663 -80080 -140267 -121410 -17762 -16572 -19602 -40605 -73748 -59474
27884 -59474 22240 -2927 -9124 3736 -2072 -38012 -36051 -28989 -88079 -146902 -85870 12076
27872 12076 96074 145692 162317 111236 63857 63625 61177 30030 95502 49513 53555 62533 100310
27859 100310 83758 21857 38761 57925 85532 62835 -3095 41802 155491 169494 68328
27848 68328 -16060 -23975 -12296 22272 95217 109377 124815 124317 44939 8934 -94032 -49570
27836 -49570 896 12347 35494 28283 97057 177469 59013 -4984 -29009 -15827 18086 64252
27824 64252 31853 -12325 -56853 -58737 -100911 -99806 -108229 -105794 -83692 -48392 -25554 -24851 34582
27811 34582 40744 23310 16898 71502 68091 24225 -9709 -7173 49459 87101 35437 48588
27799 48588 102066 70299 64528 -13205 -93146 -104590 -80301 -103676 -157735 -121951 -96097 -75421
27787 -75421 -6582 82068 69678 76150 69232 55037 75492 72093 92994 73628 81269 83055 113710
27774 113710 143301 49534 5355 -1752 3085 14019 -28441 -99372 -125746 -152305 -120079 -5751
27762 -5751 6328 -66343 -166473 -167309 -69815 -14413 -68093 -63526 -92502 -75795 -63199 -88711
27750 -88711 -8762 45496 71610 25662 -2018 -1271 2618 -64067 -110860 -77117 -16612 -26744
27738 -26744 3172 49256 91997 -15671 -95145 -105217 -50546 33646 -2536 -71075 -52941
27727 -52941 -34482 -114722 -90904 -37526 -73451 11329 -26445 -119940 -218672 -160584 -123870 -200397
27715 -200397 -158954 -51902 1334 -52007 -107389 -82575 -36814 -7049 23212 33516 59657
27704 59657 117044 83997 74935 92542 60086 41143 84290 36952 60862 161956 124418 34235
27692 34235 -53821 -59502 -42644 77988 97904 164532 146287 74953 83173 58515 34661 106189
27680 106189 57478 75595 93108 32346 62949 107250 19964 -11183 7502 586 -6121 76032
27668 76032 109329 130686 50325 -25547 -66549 -86135 -44035 51385 122406 104089 95915 22267
27656 22267 -35647 -40078 -52743 744 88484 129969 110810 66690 19849 -37075 -42036 17239
27644 17239 21524 50440 4898 -59105 17742 84408 76876 73441 70651 55675 45985 51249 38512
27631 38512 -29408 -54209 4155 56608 40171 53631 33503 19453 22722 62629 101174 21525
27619 21525 -20540 63775 164175 191513 120076 30000 16835 10672 -8644 -47934 -8128 -22692
27607 -22692 -37381 73009 82792 45820 46955 151048 196993 134808 63596 -14062 -59179 -75978
27595 -75978 -76827 -117014 -106901 -126643 -136525 -144610 -77704 -64599 -2476 43212 70035 112827
27583 112827 58306 12707 -88314 -100201 -52927 -25967 -19764 -48736 50006 85987 -26189
27572 -26189 -87097 -78508 -50556 8792 19429 -4706 -89814 -15903 40979 52613 -8990 -39197
27560 -39197 -55512 -50803 -10268 33466 -11809 -3839 49718 1504 1363 34935 -821 -40532
27548 -40532 -56367 -85350 11324 122357 202307 64284 -75772 -26451 -45061 -89540 -79737
27537 -79737 23270 55288 -25432 -105277 -108287 -177632 -124404 11613 55683 121018 168466
27526 168466 57569 -7726 21808 36 2069 39617 9009 36699 137293 163541 77636
27515 77636 26188 30478 -50662 -85649 -30277 6082 -77679 -45277 89553 104724 71994 -33123
27503 -33123 -56336 -10244 5539 106548 118566 -29637 -37040 -48993 -30875 -61697 -93753
27492 -93753 -62235 15490 28015 14551 -15032 -98581 -85892 -77073 -146762 -122152 -113361 -182792
27480 -182792 -68327 53519 17063 -19088 15084 20217 -18816 -51272 -36964 -23885 -44425
27469 -44425 -43027 -9599 61120 81142 26369 -21508 -25035 -9179 2551 4447 2530 28185
27457 28185 103132 78558 38119 67782 12352 -10269 -31815 -30949 7216 -6240 -5502 -45187
27445 -45187 -68510 29821 43233 10240 43261 79568 90437 44528 -2600 -8635 10510 70271
27433 70271 -29300 -83445 -72417 -26320 27751 64 16403 39493 72101 76219 83044 99211
27421 99211 118360 69740 7882 -35622 -26673 -20625 30481 78958 62315 39977 43193 66015
27409 66015 156500 51596 -56303 -111766 -132512 -97393 -101449 -93502 13677 21555 68282 52918
27397 52918 49448 5630 48479 113885 125295 91893 114345 94719 74958 51656 18620 30905
27385 30905 73463 46241 70659 55465 2886 -21185 -62111 -89915 -86138 -63204 -37299 31392
27373 31392 130435 90717 39876 12507 -38197 -52060 -62176 -7444 -31364 -54066 31695 66550
27361 66550 16714 -18752 31248 39556 -26869 -6615 52000 109618 94470 -24488 -81059 -70722
27349 -70722 -49279 -94190 -91942 -91019 -25044 -27514 -2773 49222 8394 -71073 -182077 -213391
27337 -213391 -159825 -84788 -87179 -120601 -88523 -35292 -87300 -74831 -81554 -154305 -172449 -128352
27325 -128352 -60679 -51490 -82079 -95250 -41369 14332 75936 -40771 -91729 -98108 -68382 -43235
27313 -43235 -43603 -50407 5000 62629 37586 52373 22482 -13708 191 -24071 -39154 -123607
27301 -123607 -139466 -71113 19843 38367 -80 -75585 -55085 -11355 46862 19241 3114
27290 3114 -33105 27033 82704 81530 109692 59676 -45006 -79789 -71567 -121174 -101808 -79007
27278 -79007 -7823 -26937 -16502 -40889 -28619 -39406 -37124 -23875 45915 59010 -12416 43758
27266 43758 56975 25517 -5406 19010 -82497 -139646 -76015 23682 88243 116315 96526
27255 96526 4757 -47668 -161 -49447 -70486 -61634 -79010 -108935 -50906 -7469 44412 30440
27243 30440 72033 31519 80686 69262 68726 3708 -18370 24751 62825 121483 84650 126408
27231 126408 110154 -15273 -45113 -44166 -65117 -100848 -118649 -64605 22017 100367 107596 107249
27219 107249 70293 61349 56042 125058 214327 153713 152498 160910 67440 3187 -17137 -83568
27207 -83568 -118843 -35340 27998 -50529 -45311 -67479 -3896 -27974 35753 66809 2095 -44194
27195 -44194 -144479 -224877 -165005 -126973 -193690 -136690 -62289 -31388 -43096 -120228 -90603
27184 -90603 -66251 -33422 -5059 -1638 -1605 972 48939 93754 -28001 -211639 -139596 -51836
27172 -51836 -118077 -120847 -41056 -21898 -44595 70138 150630 148098 76025 65088 58545 -31928
27160 -31928 -26327 -17251 -111273 -170518 -105978 -73676 -47361 -56004 -23842 -34661 -5359 51867
27148 51867 68002 14662 -43643 -95454 -141380 -94190 -101028 -74960 21787 37344 11036 63713
27136 63713 143967 95254 -9437 -70996 -62313 -74501 -134449 -148023 -51964 22547 90931 152651
27124 152651 89960 -8108 -132110 -100615 63466 79326 68884 6906 21464 15449 48193
27113 48193 16022 -72358 -27647 23990 57143 121369 93781 62868 57632 48528 67137 78990
27101 78990 56861 82573 133887 134305 119523 151798 159927 190969 148564 85617 -17267 -20360
27089 -20360 33571 67064 76476 40992 14262 99257 94899 55002 122276 196134 210446 197631
27077 197631 100897 64016 55168 23897 -58624 -36181 -28905 29341 77830 37774 15779 63891
27065 63891 54181 111061 209591 240328 192419 152525 111143 89840 98438 19403 32762 41936
27053 41936 6090 -3759 -15277 -25659 -89336 -132562 -99155 58404 126513 46452 -14462 7449
27041 7449 49362 -60349 -195532 -219230 -188334 -176189 -90865 65382 -2568 35102 118032
27030 118032 152361 114780 52553 11653 -19416 38974 97073 142252 67274 -80543 -68500
27019 -68500 12867 78293 104829 84813 91663 51204 -29605 -71421 -31819 -6923 16600 68067
27007 68067 12237 20174 -31064 4134 5565 59998 47174 17283 -2221 92206 152570 85360
26995 85360 -42954 -16100 -40159 -24045 -35637 -76494 -96812 -44411 39102 53186 24931
26984 24931 48314 67920 -2897 -65417 -81670 -66245 2254 -6799 -23109 -9691 35963 37725
26972 37725 -2765 39450 116726 197007 123637 21949 26080 -51414 9379 65799 82715 48711
26960 48711 -38115 -51245 -14374 -70053 -87830 -66583 -52369 -71640 -26697 98873 162288
26949 162288 113898 43437 -51 -54295 35200 144387 107841 29312 -48161 -53192 -46195 -28871
26937 -28871 1203 29500 10184 -872 49750 69773 49204 42520 98207 97308 79218 52713
26925 52713 26277 -28078 6205 -1885 76573 162365 114672 65196 25902 59304 178528 174684
26913 174684 56946 -17809 -19176 20124 16820 -27385 -90989 -167358 -138968 -2848 71926
26902 71926 96273 76944 64805 85586 77479 47269 46493 25582 33400 38031 17346 52293 63480
26889 63480 21671 51669 100941 94861 132195 146621 80052 56692 85468 83282 109849 107712
26877 107712 100867 99941 105377 48834 25301 -15441 49964 86472 43305 19066 23074 70235
26865 70235 79314 99589 72392 -38533 -116028 -95927 -95782 -135366 -192156 -104811 -52881 -40141
26853 -40141 -59926 -134164 -140058 -78855 -63819 -139516 -164476 -142935 -58589 35851 110431 82666
26841 82666 56173 23815 30648 67981 88237 137979 191045 166565 70458 -21702 -101165 -203087
26829 -203087 -269530 -245266 -160142 -143142 -112260 -43977 -9273 22417 -29339 -22254 -5127 48345
26817 48345 -22943 -100834 -131543 -90524 20704 22173 -50024 -58390 -69705 361 31225 9473
26805 9473 62774 109070 149350 115115 38663 -95948 -80612 -8953 24880 -9779 -131736
26794 -131736 -155870 -121892 -57931 -43447 -61567 -66671 -57233 -81345 -92630 -23146 26369 -8832
26782 -8832 -3270 6962 -14235 -114283 -40754 -6525 -29964 21045 47933 51790 -2772 -74561
26770 -74561 -92755 -8010 49860 59214 28782 48807 -4373 -124875 -101785 -111719 -3983 29555
26758 29555 23324 -13950 -44463 -83236 -159489 -116318 -33155 -17562 -22261 7208 25542 -30460
26746 -30460 -123098 -101811 -72437 -58156 -9163 -40951 4861 22649 22775 938 -685 -73395
26734 -73395 -90228 9463 5799 -85334 -29085 -16475 -34561 -17299 52144 112353 167311 90160
26722 90160 17908 34851 122676 115014 105774 9189 440 130 -14111 7323 -25668 -54192 -69810
26709 -69810 -51756 -1209 96991 141784 108533 22627 -54087 -45359 37702 51837 48708 99507
26697 99507 145279 125913 37679 -62321 -89405 -88896 -142498 -133236 -78193 85499 74837 73767
26685 73767 69193 65948 45567 90590 107905 147633 125316 131458 37146 -114796 -43857 -34428
26673 -34428 -12612 -20261 -37567 -99666 -101337 -82207 -33638 -22395 -11719 9329 18760 -750
26661 -750 -41635 -65802 -25592 32369 -37558 -70158 -2499 87027 118640 133733 116820 49858
26649 49858 24939 21466 30909 38367 118 -75873 -10701 125983 85619 -19494 -50689 -65592
26637 -65592 -48825 -42363 -61099 -81363 -22664 94273 112845 36734 43511 20800 30135 75804
26625 75804 80858 133403 65508 77753 117161 151550 66455 19713 14091 41591 79892 80248
26613 80248 1937 16585 15933 -2924 81963 181875 205263 114276 -16107 -5814 96865 128767
26601 128767 117749 120741 141633 173496 167974 65544 12759 45964 2796 -49859 -43493 -62633
26589 -62633 -7347 22009 74397 59591 20950 63087 131489 209778 168805 118534 154975 214981
26577 214981 245529 141996 88693 -22201 -68914 -84329 -112814 -77631 -33806 -8963 -10193
26566 -10193 -375 -47739 -28210 -13259 -57589 -69667 25053 38715 64530 50626 53421 -61869
26554 -61869 -27667 7302 -16665 17246 -62329 -141132 -126520 -72502 -82154 -146561 -135510 -14337
26542 -14337 -20384 -19382 13587 36360 68283 62282 55449 9220 -30987 -14524 95596 86612
26530 86612 154645 150450 111153 110167 24188 -46077 -47879 25526 49949 -20589 11644 11712 -25184
26517 -25184 2570 5973 10814 389 11384 -69912 -65515 -68029 -30253 45907 60285 -18818
26505 -18818 -86210 -35526 32699 34190 20193 12615 -85563 -91246 -111264 -174294 -129126 -156643
26493 -156643 -131076 1722 23095 28763 72597 -30843 -92776 -73416 -51786 -2008 -94345
26482 -94345 -88411 38011 33260 -29816 7876 14820 29124 34039 44549 77634 123708 91280
26470 91280 25965 -48091 -117362 -118655 -73531 -56018 -27233 18820 35546 103462 169921 133289
26458 133289 32545 -79278 -99776 -99862 -114727 -66212 -4120 -27318 -88537 -89962 -51780 62085
26446 62085 83471 64030 48816 31895 19524 25201 25087 -11146 -66942 -149357 -183612 -174693
26434 -174693 -73573 -8216 -41949 -6765 -21312 32442 9949 44191 136817 156750 121732
26423 121732 44774 79562 43424 20432 -5317 15535 121390 179207 126105 146896 169981
26412 169981 82137 50409 -21556 -66052 29748 118365 106318 45867 3784 -645 -64452 -62463
26400 -62463 -71668 -159317 -119083 -40905 12521 -51359 -34450 17026 30958 29078 21296 11473
26388 11473 131332 150440 109259 103690 88556 174102 263859 187394 75991 -32723 -59095
26377 -59095 18112 37767 71413 72545 53295 -33288 -41831 -72458 -70256 -20666 18253 23999
26365 23999 53873 51859 94606 129239 88625 87589 145157 207121 222947 185554 191222 158062
26353 158062 77894 35335 73072 57784 -55317 -121955 -187743 -129991 -45136 -8936 -25502
26342 -25502 -50737 -56255 -66723 -68313 -19059 13592 114828 87680 67582 11318 -27934 -120257
26330 -120257 -147334 -23112 -54514 -33669 37106 121453 38285 -50423 -114395 -77549 -46056
26319 -46056 -33307 -11148 37224 49086 59451 100695 13158 -51485 -18581 -41375 -12396 -8907
26307 -8907 -33399 -123316 -158725 -102162 -48320 -23506 -52736 -9565 32274 116868 127442 80653
26295 80653 10356 9788 -67809 -88273 -78357 -78987 -46715 -22999 -78048 -76695 -79347 2128 67677
26282 67677 95899 60956 -6977 -126708 -124338 -112831 -96862 -101060 -28970 -29413 -13070 -60234
26270 -60234 -95360 -89082 -71184 -49246 -60475 -70125 -83645 -58293 -87328 -131024 -152956 -112724
26258 -112724 -137085 -161824 -98878 -66921 -67463 -36359 7904 -2542 -3457 -33706 -144897 -187568
26246 -187568 -214574 -230597 -186996 -104002 -21871 -62281 12484 38164 110839 165332 47335
26235 47335 -26528 37378 62561 32878 41852 84346 26037 -32638 -100650 -44030 3243 63979
26223 63979 14912 -43991 -18080 19022 51702 61326 -20507 5546 25206 19063 12906 7084
26211 7084 92442 34215 58511 42545 -22555 -38562 20175 71687 82696 87808 45251 50437
26199 50437 36662 29155 19992 -36955 -6685 2849 11317 -2622 -28773 -64769 6361 52789
26187 52789 30418 24903 73664 70245 -16147 -58215 -52205 -121985 -181609 -189148 -167083 -78070
26175 -78070 19318 -21401 -55921 61306 151235 151430 98091 -11238 -85041 -56614 53825
26164 53825 141823 160794 84757 49552 167162 225160 133959 24634 -25822 -210 40085
26153 40085 23351 2065 69305 136038 152924 119565 78161 15829 76576 58929 40854 57941
26141 57941 145778 215970 141258 42064 33777 55827 33012 69448 52635 4594 21444 44256
26129 44256 89388 124964 54799 92189 99245 94026 36869 46929 25281 -8792 -22503 -32180
26117 -32180 -99207 -76922 -113941 -117256 -133567 -151911 -152392 -55421 -46373 -17981 -9959 -101844 -85382
26104 -85382 -68855 -91016 -11435 39180 13082 20022 77733 60295 19963 -15674 -42304 -67814
26092 -67814 -43121 -40107 -27108 -10373 19406 33684 9934 21516 113312 83290 -727 -57452
26080 -57452 -40014 -91151 -79338 -58674 -18701 26415 25754 -28946 -75037 -64789 -87970 -33863
26068 -33863 -52191 -37423 -61888 -44647 11843 46812 54502 74272 55762 29798 35836 -19299
26056 -19299 -86863 -25622 14133 28856 -50372 -147858 -131802 -114924 -48953 -66390 -79084 -95616
26044 -95616 -107975 -14313 -5364 -28302 -15505 -92033 -139452 -110475 -160348 -169255 -109453 -40752
26032 -40752 56470 -7303 -20518 -44240 -82922 -115719 -120114 -116392 -121903 -27383 5215 -17411
26020 -17411 7229 -38792 14485 18760 -23089 -65604 -85861 -74624 -58270 -13702 57794 13235
26008 13235 -1416 85081 116762 109796 86500 30499 12900 44353 102724 66541 32728 -5202
25996 -5202 -22516 -46587 52341 48051 10401 -38924 -32533 18410 28459 48960 48429 -23096 -14192
25983 -14192 19138 64681 49935 6940 -20551 -6496 26482 17971 -19317 -30657 -299 -18304
25971 -18304 -26944 -4617 79430 103184 121491 114956 134981 43460 -53078 -38423 23942 128018
25959 128018 83513 115005 164457 119605 80803 60665 -34201 -99688 -11374 88799 69162
25948 69162 40957 60040 131931 114683 11996 17135 33515 96246 32600 61445 44591 15364
25936 15364 -30926 49795 132962 163088 183926 166632 107938 141472 87289 2639 -80442 -93168
25924 -93168 -123595 -148659 -66218 41771 -9851 -79713 -130879 -110603 -72749 69338 144014
25913 144014 108761 28902 51577 74183 42731 -29272 -60176 -127577 -100515 -43189 35633
25902 35633 -23728 -45725 -74580 -44357 -42864 -108806 -126744 -120981 -101477 8028 139698 87939
25890 87939 85274 59185 -58865 -49910 -23380 -18398 15448 17133 -4550 -29427 -36375 -45995 -63173
25877 -63173 -16267 49278 89561 29666 -45634 -80162 -66847 5836 69507 -25517 -33222 26900
25865 26900 -67054 -210505 -214095 -156585 -89577 16537 -12907 6721 45222 57376 50925 -13475
25853 -13475 -32479 -57614 -61977 -99620 -62092 -47095 -6729 22245 10617 12083 -53722 -104278
25841 -104278 -10495 71854 116737 98505 92015 89860 32362 -4248 -33854 -32491 -102289 -75025
25829 -75025 -47147 -18810 -122025 -124691 -187117 -145347 -30354 53635 59804 41613 34494 69060
25817 69060 59055 -57470 -140061 -213663 -156441 -40879 48852 142870 81934 81198 69948 120735
25805 120735 95716 55999 46202 82922 107600 192634 190293 111785 41309 1460 50861 40598
25793 40598 72855 34440 -77135 -140036 -168767 -161555 -97621 -21404 5564 14532 -76057 -47311
25781 -47311 -23117 -28067 -88036 -87631 -6906 87842 75640 -17363 -5117 9564 14049 -41752
25769 -41752 -52598 18247 64369 8938 33557 141905 110182 -7653 -18178 74744 78421
25758 78421 68545 14197 -6899 4708 35125 -75560 -75919 -58984 -142504 -156183 -135197 -134340
25746 -134340 -123767 -98644 -137048 -82372 -35397 19422 17507 6800 -25009 9239 30322 122084
25734 122084 59318 -38754 -86061 -52049 -8359 17392 41121 72220 104783 97833 93753 54482
25722 54482 2008 9209 30590 105834 176000 242848 259026 188373 25653 -95718 -130028
25711 -130028 -118074 -121261 -53825 -14066 64355 77608 48284 -25682 -31254 -51649 -24697 51880
25699 51880 44221 14597 84724 152453 148198 102855 56674 72882 28489 575 7987 -52914
25687 -52914 -95126 -104837 -113657 -39125 -20172 17227 62458 47879 69522 91161 78982 71903
25675 71903 39327 21141 54770 80217 34223 -513 29172 41965 181770 116414 95181
25664 95181 123283 23071 51836 98895 118887 81214 26105 -37085 -42823 -22811 -18244 -47
25652 -47 37138 82142 63862 32889 102052 90107 42885 -37367 -94564 -126107 -144107 -86480
25640 -86480 -62637 5528 -35730 -81827 -71302 -46281 -42121 -57043 -72819 -40378 -90006 -125855
25628 -125855 -24314 120005 111842 11280 42272 63679 39561 -27118 -82494 -77760 -46746
25617 -46746 -39854 -9738 73645 130507 85581 -937 -17247 -36395 -45950 -38461 -37631 -73641 -120918
25604 -120918 -69053 18793 -8599 -50042 -17312 -37676 -113487 -51995 20467 17490 58229 35380
25592 35380 16587 -106718 -98496 -3776 97156 154294 87388 96553 93548 89775 120316 148788
25580 148788 159214 129420 106825 96196 14310 -54555 56713 60783 81526 -5960 10127
25569 10127 9646 108425 124802 58420 -24298 -36593 -67021 -30148 -20819 4667 81733 170046
25557 170046 177568 198247 129287 84272 70209 43741 30233 49532 33476 15959 -21609 -33409
25545 -33409 40176 87338 74038 38803 52702 34011 32582 91794 53307 22102 13120 29376
25533 29376 -16141 -73665 -78862 32873 152868 104768 61467 67429 -9726 -115379 -94777
25522 -94777 -83611 -106786 -31506 -24174 22463 140389 115861 35603 32093 48567 33132 77672
25510 77672 98036 78704 74695 127596 30127 -5635 39324 24391 -35044 16047 -18137 -44234
25498 -44234 -40780 -164783 -163443 -107055 -112988 -115721 -57779 -34412 -34496 -32197 -8202 52352 -4103
25485 -4103 -13173 -60973 -128982 -88227 -87545 -111169 -72034 -91364 -49246 -52477 -99674 -79005 32739
25472 32739 39005 24107 48719 -29352 -17471 -23622 -17338 3222 -14930 -76735 -116506 -84186
25460 -84186 -91945 23145 80353 44404 -49671 -13047 -4649 -16686 -34785 -81507 -59248 -71979
25448 -71979 -25475 -38246 -71780 -69253 -14053 37713 36333 18816 94734 79412 97084 114202
25436 114202 171746 192172 145144 71433 -33628 -107043 -139347 -65852 6250 41174 -11617
25425 -11617 -44608 -85381 -114680 -85570 -51620 -50646 -44208 -104732 -143978 -99820 -6162 -21900
25413 -21900 -74192 -110262 -83643 -77706 -75500 -54505 -33720 24340 25246 40007 65074 -41214
25401 -41214 -46306 44374 67474 -14136 -84362 -28339 -46897 -36910 10675 65908 132710 126536
25389 126536 82786 70085 -5073 -27571 -39565 -21040 -7812 -50372 -33502 36455 46302 84772
25377 84772 54535 15190 -8237 -8135 13264 44538 36359 108303 74449 24881 6578 20555
25365 20555 75694 57409 -36145 -67697 -24283 -41367 -68970 -45327 8697 30391 1622 17125
25353 17125 -48737 -52470 -49622 9419 -4569 51518 84660 63898 14759 84163 164150 150005
25341 150005 110260 19395 19935 -80100 -145854 -141457 -78967 -18575 39289 53575 86599 130952
25329 130952 109232 24065 -33137 -4956 18847 6988 99728 89494 68433 119880 116388 123326
25317 123326 75484 -29357 -106150 -116837 -74643 -20169 -45151 -30556 -71383 -72064 -117364 -141006
25305 -141006 -33156 -95951 -151817 -116361 -64690 -8351 -73660 -93238 -147503 -215511 -192584
25294 -192584 -186914 -101701 415 -20288 -81840 -51448 49424 5318 -59010 -62398 -28783
25283 -28783 80285 14796 28735 61503 61320 4640 45661 57532 98831 75516 29149 2776
25271 2776 9324 -28420 -13180 -57940 13704 63015 40053 62735 74880 94935 102511 159044
25259 159044 167803 191849 226900 157310 83903 3066 -38119 -52669 -111981 -145831 -174072 -141848
25247 -141848 -25711 65261 -15842 -32283 7971 -35637 -1961 73742 18534 -34901 41457
25236 41457 45274 -75759 -69323 37725 104176 32922 -37463 -31413 25651 -14655 -71942 -53430
25224 -53430 -6799 112293 113480 95834 26987 -21976 -46731 -25922 -22715 -167 -22229 -113069
25212 -113069 -136061 -66592 -96509 -126264 -65670 -37924 -40573 49544 11704 14932 -45353 -11463
25200 -11463 3513 -27996 -23227 -5204 -3096 -31750 -58199 -56725 -27078 48728 153659 120177
25188 120177 55769 46602 -20377 10312 -22009 -57836 -50929 49808 104369 64582 36718 32678
25176 32678 12749 46383 55294 33748 5866 42949 44968 66789 49846 104855 76895 2670
25164 2670 -28456 39709 36940 -37462 -76340 -19703 56385 38947 34827 51207 77335 118373
25152 118373 55722 1037 -26165 -135444 -152064 -114919 -43345 -28896 -81801 -46271 -24060
25141 -24060 -80577 -100153 -45842 50924 94226 60033 29492 43381 5069 -72639 -64017 -69824
25129 -69824 -90845 -12668 38311 59253 50567 -3452 -39843 -54101 32458 16290 -55681 3228
25117 3228 -791 -42442 -66743 -76921 -2902 14458 40131 -65891 -162325 -155309 -67229 -2976
25105 -2976 50621 102233 75682 -54051 -53093 54557 54746 67524 51569 -40465 -80660 -113060
25093 -113060 -9135 -27431 -91737 -61130 -23730 -116242 -177155 -136136 19672 22109 4775
25082 4775 35140 37221 56933 33173 -33577 26660 69059 144355 128641 39269 25456 68585
25070 68585 42938 27281 -22611 -97485 -111323 -53763 83742 69720 94429 112832 133206
25059 133206 133200 120633 113021 50036 22206 30138 14271 65908 3095 37969 109876 123106 137292
25046 137292 72894 24707 27862 -33423 -30611 65014 76400 126041 110106 53088 50584 -54372
25034 -54372 -34194 -36904 -87183 -26708 25032 38682 80738 60185 22435 -15771 -6499 -20847
25022 -20847 12651 96968 46237 -15468 -9734 52759 79080 47051 120594 119394 87060 93460
25010 93460 6556 -56224 -35737 -54609 -71354 -24073 10313 118739 111492 65302 36115 -38265
24998 -38265 -18012 -10908 -89758 -82605 -13315 22720 -19132 -83695 -85881 -56096 -78237 5344
24986 5344 52782 6686 23763 41241 24778 -7670 -10732 1968 -2622 29783 25649 -15718
24974 -15718 17439 13949 8305 -20964 25268 55558 -49871 -161579 -126965 -43090 26831 -43313
24962 -43313 -68073 -39993 -60278 -66335 -41691 -22210 49436 108625 155434 145153 94359 118966
24950 118966 74629 22892 -37196 -17813 -45221 -57596 -71060 -76261 -44189 -110505 -143944 -52512
24938 -52512 -31206 -10464 65588 115921 84065 -8621 9459 55313 89187 20175 -41989 37984
24926 37984 -6823 22 -41485 -76658 -2697 -16249 7436 6024 33796 -362 10016 45956
24914 45956 -17353 -18576 20721 105176 114065 30278 21499 87994 16981 -11641 -42718 -13622
24902 -13622 -10474 6919 -33409 -66727 -87106 -102033 -32847 -975 5551 70222 83866 21038
24890 21038 20412 104263 149101 94236 -7884 -51776 -14369 -40323 -54918 -23633 -48553 -79953
24878 -79953 -41127 -93470 -214093 -273858 -305590 -175702 -10246 39267 52544 2027 14728
24867 14728 99656 31417 -64983 -8344 19142 -14415 -21723 -15036 37528 11701 -32923 -487
24855 -487 18805 25046 39011 -35134 -63073 -76171 -125174 -162061 -127655 -135164 -85575 -60908
24843 -60908 -69694 -45297 4284 43176 -33638 -65698 -93976 -25504 13848 -4571 -13251 -9022
24831 -9022 57370 80000 55040 48733 104589 26258 20959 95354 140954 85418 58793 103641
24819 103641 83986 1453 -41324 4789 102501 103446 56262 173598 121137 35567 -39201 -29745
24807 -29745 -8426 -27879 -53540 -38449 39686 132991 95400 -8317 -8722 35122 -32348 -40221
24795 -40221 45601 62389 30661 -43870 10999 26093 -25842 -84333 -80695 -26606 -25688 -21591
24783 -21591 5701 36286 20317 -91613 -163494 -195450 -113232 -12678 -70652 -139075 -156263
24772 -156263 -54607 -43961 -63963 -88926 -121373 -90531 -39146 15562 41256 24817 -14740
24761 -14740 -9834 40228 66138 41273 -10944 -75014 -13900 -6842 -118385 -133142 33929 87530
24749 87530 -51790 -142792 -68063 -29948 -17027 -18371 -99617 -112882 -13502 -24478 41914 44332
24737 44332 62123 96597 98796 -33111 -46849 13245 54399 94090 45675 -18025 -58627 -74084
24725 -74084 -75766 -149967 -157701 -102900 -169507 -76564 42886 84952 87529 49473 35763 76198
24713 76198 100793 86531 -8839 5476 57992 17145 -37182 -89387 -97118 -42867 40415 14192
24701 14192 18305 14432 -71411 -13922 7441 76336 120014 92734 40070 -4030 -19457 52205
24689 52205 -60485 -123998 -113549 -101931 -80707 -3560 52827 -9822 -9821 -49934 -20243 40913
24677 40913 -7618 -22629 -25373 54148 12146 47675 10161 -81263 -117310 -64598 -12533 -61170
24665 -61170 -88404 -92699 -103097 -63394 24577 23566 -10919 -17657 56148 81325 -38866 -124953
24653 -124953 -71999 -16830 63319 89547 149910 151086 101325 28652 -401 1181 45829 47097
24641 47097 9617 -30743 -85739 -121729 -92704 -46158 -29172 -3223 1563 -43355 -84021 -28539
24629 -28539 37772 -914 -30017 -42169 -101399 -116122 -53220 -19364 -61465 -52268 -61007 -54272
24617 -54272 -17830 13094 -32444 -5106 45320 41723 67595 28375 -23336 -91044 -138472 -156138
24605 -156138 -88159 -21982 59668 24850 -90203 -82021 -26607 -88259 -86597 -16369 17794 -25489
24593 -25489 -46219 -61860 -27745 53270 55021 125477 186339 130178 56035 57208 59539 30045
24581 30045 73174 89030 57459 34472 -13902 -19013 39680 30844 -29361 78757 144298 92878
24569 92878 81019 30070 -32071 -23484 13534 166270 121767 38690 61026 -10249 700 22694
24557 22694 26998 50316 130524 68392 -41089 -41734 -27629 -33948 -9500 -112686 -74019 -34927
24545 -34927 -52575 -104845 -125369 -164964 -125478 -58282 -53592 -35181 33882 79451 35686 66402
24533 66402 95764 66475 -22169 -48454 -97352 -39859 -37743 -9919 53671 92833 57319 -2326
24521 -2326 -130519 -164587 -125270 -40521 69158 186742 263513 231774 196340 107175 64106
24510 64106 -9195 -71742 -92816 -7423 -18374 -641 -79652 -69478 -94092 -49683 -47374 -58248
24498 -58248 -63952 -92318 -33321 58695 75692 60930 84092 73423 -12559 -11800 -27284 -59438
24486 -59438 -42487 19409 15217 30005 -11192 -15353 14080 -54329 -59549 -95514 -118212 -103513
24474 -103513 -185311 -144876 -57562 -11848 -8006 75964 89219 77705 44785 -14636 85149 127296
24462 127296 1599 -13229 24947 75160 66651 25338 -5668 -14547 136309 180763 66097
24451 66097 -14633 -26542 -42946 -1043 73359 84188 -26932 4635 51653 81100 65252
24440 65252 -587 -107903 -37147 19522 -36853 -70870 30251 115089 66152 29779 4240
24429 4240 -55792 4521 -33270 -50152 13346 46125 -39790 -11521 -3297 -84776 -129906 -151717
24417 -151717 -112761 -87951 -28200 37 55290 49828 46831 51180 -14039 -17319 -30198 -61883
24405 -61883 -103549 -105976 -48160 -20903 -50851 -74507 -65087 -48099 -49886 -69206 -7596 36471
24393 36471 59026 82816 68353 -6724 -62117 11897 45198 28273 48702 -32482 -43062 61139
24381 61139 8059 -51880 4685 -7641 -33316 -13094 28659 -45072 -115100 -122781 -134750 -70987
24369 -70987 -17331 -74525 -36705 -12782 -85704 -48713 -15074 12015 -43473 -188080 -215616
24358 -215616 -156440 -153135 -82600 -51116 -33256 -16283 -44891 -106732 -87669 -7846 100886
24347 100886 182949 96673 73743 95288 93203 10858 -30776 -52699 -50018 -28181 20319 118628
24335 118628 160205 127493 101271 26217 -73783 -44364 -76207 -108969 -150903 -105038 -47866
24324 -47866 -65167 -59647 818 53221 60124 60596 122650 75114 -50021 -127244 -87743 -53882
24312 -53882 -91388 -65592 -42533 -28422 73928 183421 203886 127652 17537 -34953 -61091
24301 -61091 33461 80954 70464 35557 -20222 -65958 -75438 -62299 20940 64707 92531 44850
24289 44850 75535 72017 97642 117251 119756 69984 61157 104242 69879 22112 55270 126973
24277 126973 132170 28511 -38426 -77878 -45051 21593 53005 144220 63489 -12486 45608
24266 45608 56622 136849 155981 146471 107259 86219 72176 2298 9244 60583 85305 30943
24254 30943 24918 36249 41477 41280 13888 73605 198792 155137 -27902 -108466 -169333 -174797
24242 -174797 -35212 10545 -7656 1708 32999 61376 -36243 -86727 -183582 -216325 -100674
24231 -100674 -37792 -36310 -28132 1663 -38534 -68355 -79898 -9183 -38150 -100883 -81178 -103019
24219 -103019 -169101 -256878 -217991 -140516 -82577 -53474 -57645 -71154 -82791 -115452 -108185 -87713
24207 -87713 -108074 -134992 -134405 -123871 -44032 -13880 74532 110003 61885 -8246 -56836 -68215
24195 -68215 -25406 45585 26556 30162 53283 96520 81123 45737 96879 108747 83918 9934
24183 9934 20330 42671 -51844 -140675 -142175 -22949 78167 74853 43498 64733 124550 83442
24171 83442 34252 62772 110006 81093 93144 137327 99628 97065 113565 23189 -33063 -98576
24159 -98576 -115947 -94322 -95437 -5180 44852 -62752 -57654 -11310 44045 104595 64318 1129
24147 1129 -35519 -140939 -110211 -109530 -61966 -339 -36620 -19734 58759 90733 38994 68162
24135 68162 29947 12246 38501 39848 45604 75299 43718 41259 -15645 -71101 -128977 -90177
24123 -90177 -42375 -51026 -69026 -80824 -78027 -61663 -43854 -48255 111 41804 -31497 -24653
24111 -24653 24993 11953 -69477 -134006 -108916 -36969 63616 -14694 -38965 -58502 -123248
24100 -123248 -102152 -76891 -62427 49574 97380 90460 19337 62007 42242 -5847 -20536
24089 -20536 -24800 19870 38887 44981 94347 146390 125008 75219 -49634 -144618 -120634 -68013
24077 -68013 -63534 -43431 -25432 -144601 -92861 -22199 -10786 -42727 -53715 -146496 -200743 -94852
24065 -94852 -53487 -13548 54386 27737 -46497 -81932 -97116 -118770 -83919 -56541 -68922 -73065
24053 -73065 -156766 -72868 -103064 -88304 -23842 -48984 -75430 -67444 18856 -113663 -85707 1260
24041 1260 21259 60711 604 -117494 -97402 -20099 -54000 -98208 -135389 -125184 -158804 -149268
24029 -149268 -126808 -74313 -75791 -94709 -26659 -48934 -10948 -88 -75688 -156130 -94584 -35313
24017 -35313 -39294 -10103 -26034 -33007 17848 -19852 -547 33487 45819 19131 55894 54560
24005 54560 65639 75343 75264 73589 -6626 -85694 -129568 -178693 -180578 -90495 -20171 32971 75149
23992 75149 101289 891 -38331 34055 6886 -18811 -46173 23086 -54631 -90353 -59873
23981 -59873 -42333 -22306 -35972 -21036 -44157 -7650 -17508 53645 69783 -406 -17174 -4503
23969 -4503 69251 91386 107097 98930 45810 55127 28303 21550 65809 45223 -31934 -23606 36613
23956 36613 71154 151797 168903 159380 14878 -16484 -1148 -54216 17999 71498 72902 96720
23944 96720 87220 57351 89384 67216 5840 43181 -8350 -18223 -131999 -212894 -169478 -82141
23932 -82141 -9622 -4710 4212 45147 90600 15286 -16057 2289 32441 42971 -11428 -31256
23920 -31256 18691 48718 28807 -113 22944 -2117 -3624 -67075 -132113 -141265 -89556 -121743
23908 -121743 -95275 -13938 17356 46393 -7209 -7339 -8696 25029 -29878 -41099 -1459 58587
23896 58587 126243 103670 26443 -32317 -68155 -75123 -68758 -23241 62048 34522 -32630 -73953
23884 -73953 -149037 -194444 -113178 -16682 19953 991 15980 57950 47765 39086 40382 5275
23872 5275 17414 -10371 -66124 -30816 -13512 30622 86064 76745 -40774 -26938 22042 1218
23860 1218 70825 58604 53531 79090 50259 2963 -31138 15407 28228 -3894 -108667 -138478
23848 -138478 -29459 -11438 -72567 -62710 -47784 -15906 9660 -80321 -62324 -77002 33331
23837 33331 45038 47290 49302 21302 9423 13741 71322 148540 57867 -60089 -46876 8875
23825 8875 63176 111031 48346 39266 90010 27835 -2187 9372 37668 39446 21608 -44137
23813 -44137 -45411 35452 34665 96182 94734 82149 21178 -25346 -54276 -17777 30533 43121
23801 43121 75340 130236 119567 134478 5080 8836 -5137 19615 -1691 -54673 -112037 -59835
23789 -59835 -31010 -62384 -42226 -92779 -84297 -147680 -85584 -100527 -81551 10223 84662 78411
23777 78411 12634 67961 89987 53111 -62861 -191035 -178449 -61762 36511 52798 -15025
23766 -15025 10104 61856 44892 40870 52920 10677 38965 51199 10221 -78827 -79958 -49597
23754 -49597 37618 108479 70831 -11466 -117621 -90336 -55249 -54018 -29619 -16300 43583 113796
23742 113796 122312 90452 57799 30546 27393 32920 -13737 -2060 -11637 -42683 -44868 -76020
23730 -76020 -49545 9189 34164 -8370 -103083 -133822 -182523 -173957 -97099 -108496 -109711 -48379
23718 -48379 -24575 -46194 -50683 -60538 5569 78811 25863 38303 -6988 -72697 -49468 -57579
23706 -57579 -74517 8776 96868 53047 -34802 -155149 -134267 6524 7000 -85374 -181825 -136043
23694 -136043 -44607 -52065 -32483 49310 94535 73506 11159 17564 3602 -15191 -34400 -42356
23682 -42356 -28097 -14209 49774 104529 103030 70508 27634 36403 52217 85913 82055 129227
23670 129227 79892 50462 60115 -17352 3399 -19725 -44061 -61991 -18330 40876 15926 -37645
23658 -37645 -35842 -101012 -22230 -10575 -38435 -38710 -78069 -103635 30716 46512 23324 -44462
23646 -44462 -28450 -46272 -52642 -19504 33133 -32406 -30570 -69673 -135479 -227587 -233545 -234349 -195784
23633 -195784 -155978 -195798 -130040 -10501 26824 9984 -37787 -84889 -32617 58898 80669
23622 80669 17466 -5483 -34894 -2228 22563 8910 50785 77047 90330 45702 45770 68796
23610 68796 51943 18704 -47777 -41390 22326 99084 31525 9135 -14445 -74594 -80695 -64055
23598 -64055 13299 85969 131751 145418 145283 95637 74390 63398 13954 7913 64011 67240
23586 67240 10123 -40842 1529 70877 19309 -60268 -76136 -46798 68089 64548 -69688
23575 -69688 -48690 -5905 11902 97418 114330 92089 46936 -7223 -15720 -7034 -14564 83629
23563 83629 87306 93875 -7297 -78837 2644 -9496 -15859 31979 39202 78198 -28493 -56002
23551 -56002 5398 94097 146368 15141 -37843 -84732 -101239 -48882 -16696 15628 17822 -55136
23539 -55136 -100938 -84965 7009 34583 7311 -77078 -83206 -40908 -24061 95621 92328 44983
23527 44983 101357 103793 27132 -27204 38585 30423 42159 127176 120428 104233 54677 85675
23515 85675 183160 164084 104875 14068 -27247 6469 84942 75088 84162 97948 86514 76231
23503 76231 32080 -37446 -19297 44809 -2862 3336 -8186 23878 101706 18537 -14187 -9627
23491 -9627 1012 -53149 -96738 -18292 -6058 48918 85372 90584 48222 -39444 -106139 -54731
23479 -54731 41043 116491 82744 19626 -88296 -176558 -109352 -53724 49400 34401 64259
23468 64259 68439 79155 51152 -36737 -68674 -5927 5650 -70608 -135615 -116720 -92223 -45738
23456 -45738 -8407 18758 46344 13644 -2131 8643 -16878 27468 30031 1606 -20703 -9503
23444 -9503 -54186 -66249 -37516 -33103 31194 -23618 -66413 -15240 -68067 -23198 64086 -7520
23432 -7520 -34397 -26663 -29294 -30171 -36040 -19881 -12076 -7771 -13030 -68358 -80018 9457 185606
23419 185606 168542 43586 69577 32443 -32171 -29891 -40905 -30413 -78755 -33419 -53017
23408 -53017 -54995 4881 -95029 -59238 -47438 3834 118247 213334 164108 67235 -31946 -53720
23396 -53720 -45932 11884 -4147 30053 103787 33774 -68926 -186730 -75942 -33050 -1040
23385 -1040 32783 -12232 29756 83880 70987 -11565 -23670 -42803 -69821 -39834 -9607 21987
23373 21987 65859 140563 179832 143587 109779 -5127 -99810 -104113 -106465 -61598 -104604 -146041
23361 -146041 -120064 -107585 -5555 -11242 -41460 -164637 -215556 -121959 -125666 -108355 -123708
23350 -123708 -136809 -113607 -42371 4746 -16092 17349 62478 39965 35495 -34369 -46959 -101488
23338 -101488 -128548 -130862 -67641 39157 57116 79725 39963 -42798 -87108 -86387 -58507 -91143
23326 -91143 -87440 -125964 -153685 -80180 14730 19232 -45498 -29425 48556 18990 -58401 -62573
23314 -62573 41340 74761 14855 4562 15603 35856 28574 -14511 -2348 -47179 -38938 8366
23302 8366 51476 32410 55069 5276 -76032 -75178 -33450 -57252 -22707 -6203 4822 95895
23290 95895 96335 43616 3987 16661 47187 50069 -9736 -33617 -49602 -9192 -38051 -60269
23278 -60269 -13385 41143 53200 -17688 -23139 -20177 27548 76776 105807 105699 104080 45584 -3693
23265 -3693 -53334 -99255 -127872 -87172 -102752 -128680 -46064 31118 49796 70087 60069 -34643
23253 -34643 -29889 -13450 33362 147291 125263 7721 29198 91714 111180 81627 99265
23242 99265 107026 -2309 -60157 -10655 62062 98468 40065 69897 131739 143351 156272 146683
23230 146683 81544 116272 29363 -67087 -17910 41519 49725 44397 -1470 -2210 39790 21212
23218 21212 29753 60227 125663 153816 76943 -13857 -20087 -32245 5879 46754 66838 80464
23206 80464 25206 -79218 -70928 -38826 -47865 -50091 -39306 -35866 -13974 -8467 -17008 -13209 -4038
23193 -4038 28610 40576 57999 -2987 -79938 -61644 -68986 -61292 -35467 -12127 -1002 67978
23181 67978 93603 70712 91510 108116 138114 56608 -12337 -6254 30792 49046 31939 46446
23169 46446 40164 43246 89724 116120 20771 -49136 -41934 -59462 20952 96466 73562 -5411
23157 -5411 37896 -6564 -75281 -107101 -99065 -96927 -95402 -81864 -37794 -12093 -48185 -76975
23145 -76975 -106550 -111461 -143903 -136988 -76041 -88565 -74629 -22151 -23703 -11638 75271 74928 51048
23132 51048 -28107 -19853 3453 -12478 -42959 -58406 -519 1272 5606 -67525 -31002 101099
23120 101099 68638 33340 5388 14007 12241 -69869 -99969 -88787 -52360 -12869 28728 -18426
23108 -18426 -72949 -30065 16261 -23763 -39223 124042 111695 9096 -5979 -51866 9344
23097 9344 80297 166264 123220 20141 -52465 347 64835 60828 6771 -7305 -51329 -80186
23085 -80186 -70476 -179522 -136284 -60620 -100402 -112269 -66949 -90963 -85336 -60165 -10558 69472
23073 69472 126307 82023 73568 -25842 -55389 -46671 -60155 -54994 -41620 11377 66835 97029
23061 97029 81616 52112 28700 75550 30700 6025 -43432 -94117 -31235 -38730 50041 111806
23049 111806 92964 89961 -54762 -114904 -95837 -35423 7006 86699 171617 187007 153774
23038 153774 104744 30085 43651 32505 12950 -27900 -150439 -161790 -112697 -32045 28067
23027 28067 -46302 -102937 -117935 -53671 -35809 -55406 -45327 25545 -48733 -96720 -55067 -22203
23015 -22203 72693 140872 22398 45381 62860 74164 49727 122394 109397 -10115 -105867
23004 -105867 -77310 99913 146065 109245 103813 91346 137642 114241 67386 44207 19750
22993 19750 -4929 -61649 -138354 -160270 -132461 -119808 -40413 28384 -93085 -204170 -89664
22982 -89664 -39294 18210 -23652 -17821 9537 41980 7783 17765 32766 -1325 -72657 -134750
22970 -134750 -106891 -105589 -96983 -26278 67144 97650 48528 -83916 -110990 -48271 -118222 -65498
22958 -65498 -40598 769 25824 -16266 -9530 39846 -453 25646 96136 78383 55504 100688
22946 100688 98371 10160 -25170 24559 54257 97412 -14060 -18072 -16257 5173 -46631 -144844
22934 -144844 -152016 -111925 -113125 -107540 -65570 1939 105179 100167 143677 95944 -29913 -133832
22922 -133832 -111037 -68498 56135 118594 62686 60037 -27800 -47445 -954 31245 80310
22911 80310 75268 71305 89819 90360 85401 -12448 -26900 18954 38253 14529 86634 103216 71478
22898 71478 31043 -6963 -30846 -33461 -11838 -78243 -76617 -55753 -101457 -54170 -31657 88
22886 88 -53748 -64133 -117978 -153734 -136532 -73602 -63500 -61204 -97603 -69382 -67672 -140197 -49749
22873 -49749 -19966 -33594 -41687 -109423 -143889 -94013 -99211 28983 48367 -6399 51707 13814
22861 13814 5327 -15499 -41878 -17930 -287 25646 -31044 -53191 -28743 7246 1259 -32730
22849 -32730 -40185 -30737 -63862 -122680 -166606 -122269 -100446 -78271 -38969 -11745 51779 139093
22837 139093 132340 59927 23664 -20565 6882 21699 11327 62701 71339 116966 37779 -32934
22825 -32934 -59072 -5520 6588 -23737 -21707 18996 33243 68798 68604 25734 48358 151418
22813 151418 69546 -3823 19832 -2079 14392 85023 94017 22911 -20255 20737 63181 106883
22801 106883 103625 59206 41252 51333 -2536 34511 14697 -32916 25779 71175 87970 66899
22789 66899 74409 71464 27963 37221 28958 71402 96368 80056 67671 85448 14591 -50811
22777 -50811 -82423 -129983 -108172 -109941 -104208 -65497 12117 33958 16024 -70794 -134365 -91610
22765 -91610 -4609 65689 7582 4804 -24563 -13887 -23223 -66713 -90371 -154213 -160724 -66741
22753 -66741 29134 10701 -5330 30009 123490 100194 6620 -1623 101665 118904 86918 37593
22741 37593 3667 -44936 -22939 10388 -4647 -28913 23093 23112 29575 76130 65849 38287
22729 38287 18216 2796 -61490 -133965 -92182 -67445 -8040 12906 65616 25921 -25377 95866
22717 95866 84221 9988 526 -6570 -4292 -57918 -42733 -82098 -10467 72680 76823 74390 101986
22704 101986 39960 -20414 7677 22201 -25544 -93954 -65757 3552 53462 71808 39462
22693 39462 26714 -50436 24350 27837 11703 11242 46087 48175 -29473 -69381 -98678 -55221
22681 -55221 21775 63966 99702 87085 12143 55483 92153 55144 -78529 -142161 -112313
22670 -112313 -18187 60558 77791 73847 49858 -41283 -20451 -16243 8133 -18661 -41283 32430
22658 32430 -3468 -64914 -15623 -70844 -67197 -58399 -99673 -66391 -31388 -92460 -101058 -94856
22646 -94856 -57911 24626 6425 66700 137873 78512 33766 46006 66661 24613 -57559 -21987
22634 -21987 27707 61784 68761 87226 68759 57236 -5648 -1202 -14372 24132 -25272 -19507
22622 -19507 2559 -12050 63539 135894 89449 66419 93962 129314 84317 72092 75717 67363
22610 67363 65237 110502 78769 42174 -28680 -42388 -41347 -2198 24349 48289 122803 133866
22598 133866 32876 -121353 -89907 6498 86382 173578 152403 34087 -5551 -33234 -50225
22587 -50225 47726 123070 135081 94312 103270 124379 54625 -14840 -30819 17178 27086 91799
22575 91799 58799 11976 -68401 -63574 26950 38251 12916 -41143 -93824 -120815 -137916 -27028
22563 -27028 5090 -8225 16394 -6453 26084 68832 11943 9000 41225 54811 27360 6946
22551 6946 33756 72077 76521 29967 -29358 1371 9664 -11068 -41706 -62759 -33309 -40768
22539 -40768 20066 15001 24777 -17438 -39884 -41738 -34225 -36488 -133417 -175899 -94054 -59487 -37366
22526 -37366 -7761 -99352 -175594 -220028 -196335 -129017 -77325 -22985 -457 -31458 -36199 34426
22514 34426 47883 12635 -17805 -29378 -2297 49473 93477 80164 55736 64306 96905 128734
22502 128734 102900 -7828 -12606 42436 78824 130420 -4950 -126327 -118103 -93149 -88213
22491 -88213 -78946 -64128 -151337 -240811 -192614 -44112 -16741 -6155 -30384 -24264 2026 31453
22479 31453 43480 50182 35336 37820 10885 -4398 -23248 99160 171156 192112 209063 106631
22467 106631 -21554 -140192 -67909 37383 -87073 -208904 -134358 -68150 -41297 -40522 -46346
22456 -46346 -39280 -103669 -136139 -156720 -94074 -37665 40934 60010 25671 29188 58630 -33509
22444 -33509 -49625 -35542 -82422 -88652 -6185 -26891 -54143 -24189 4458 -15057 38231 107449
22432 107449 37755 -13990 15470 -18216 28248 7543 12407 25401 -25634 8341 86 36768
22420 36768 16285 -1742 -82442 -150125 -102248 -94893 -186331 -117721 -39497 -1084 7136 28064
22408 28064 78217 9754 -102448 -144409 -98733 -74040 -121282 -67898 -33047 -35220 -77672 -48382
22396 -48382 -113141 -171025 -162922 -192782 -129649 -44727 -23584 -17720 -104403 -181118 -225372 -218937
22384 -218937 -132716 -62188 -88741 -137586 -187850 -189967 -95158 -14166 80822 72627 -35836 -68925
22372 -68925 -43210 8500 50394 -59362 13651 35198 21076 29545 37153 20173 157 35950
22360 35950 -4956 -46895 -2851 -12368 -56044 -25247 -16853 676 22886 -114 71316 26451
22348 26451 -26141 50694 109505 14856 -49934 -83025 -74834 -37430 -45813 -101657 -83941 -68927
22336 -68927 -14240 29646 -66860 -173025 -169042 -145721 -80651 -66803 -136875 -129305 -81924 -68118
22324 -68118 -69580 -15533 -53287 -87996 -49381 44965 -10389 -99782 -42718 -82884 -95639 -73284
22312 -73284 -35995 -45475 -24255 -31984 -100781 -55755 -29378 -53942 -74925 -55626 -20623 -52477
22300 -52477 -2544 -1658 -5278 23463 83075 81951 39505 -13020 -56686 -117446 -92591 25745
22288 25745 -15006 -61971 -75254 -99037 -86100 -43561 56583 26574 48882 248 -98834
22277 -98834 -141430 -123220 -45423 -40050 -105152 -9426 57601 26519 422 -9200 2725 40995
22265 40995 -39439 -39395 -73247 -54306 -57555 -50699 -71787 -126324 -94409 -21636 19163 26427 -34332
22252 -34332 -124451 -185625 -177850 -170333 -162344 -145250 -69094 -88214 -156613 -184046 -134074 -69974
22240 -69974 39618 57290 -64474 -113221 -111837 -12166 142343 65441 -18471 -33315 -12946
22229 -12946 -37139 -69554 23359 137739 128323 93584 30519 17226 -74170 -199418 -197893 -51461
22217 -51461 24668 12690 26426 57547 96874 65156 1805 -73361 -104339 -72009 -39731 -67328
22205 -67328 -53421 -10849 -92208 -213213 -185419 -105886 -107702 -102722 -123403 -45911 -1053 -33623
22193 -33623 -82256 7237 57075 38506 35258 81120 48232 38513 18224 49093 41554 46092
22181 46092 17390 -56580 -49673 -16327 -39841 -87403 -111535 -83768 -69575 -56919 10257 13785
22169 13785 616 -65682 52458 69338 37802 48783 -27254 -147889 -177926 -132202 -88320
22158 -88320 -32590 54515 52489 31016 20095 -12377 8884 38210 91069 93777 74873 52320
22146 52320 49090 67722 32671 25452 -3697 5603 13693 -76381 -68053 -77105 -89116 -80187 -15257
22133 -15257 17463 45129 24514 -87539 -142260 -136563 -79725 39374 57873 -31433 -133042
22122 -133042 -216023 -147500 -165983 -156582 -117845 -65977 -75257 22671 72383 67099 18596 74640
22110 74640 126561 51874 -30860 -38980 8324 7683 -800 16589 -10557 56144 33379 21319
22098 21319 -20032 28816 106389 80163 37105 -11501 7419 115923 38408 -44268 -32264
22087 -32264 53140 27331 84307 53865 -9031 -49463 -54777 -24651 16742 81193 133642 77088
22075 77088 -10669 -82892 -40736 102364 79538 24652 2077 22373 51057 9947 -90835
22064 -90835 -99633 -82222 -33028 -20168 17104 28142 76480 -5240 -97409 -86962 -92654 -102746
22052 -102746 -97975 -146030 -155246 -82244 -97566 -171672 -144070 -114066 -33055 55819 29160 -4615
22040 -4615 6946 -5387 -24738 -82574 -67558 -43533 -28271 -85870 -103028 -115662 -93245 -112060
22028 -112060 -60217 17503 5442 9299 -52646 -25671 15797 19265 80488 81343 34639 82076
22016 82076 190000 190625 124117 56692 70250 40635 -47872 -69817 -127330 -155188 -154877 -163663
22004 -163663 -97021 -80138 -111043 -76093 -50761 -99421 -86204 38013 89178 7498 -29502
21993 -29502 17430 39770 120464 156715 184263 114350 -3299 -66126 -29185 1082 105621
21982 105621 119948 23127 109636 165276 124533 70365 75443 54298 29216 -42876 -46652 -50322
21970 -50322 -100619 -55413 -799 42493 40903 24912 -9784 -63213 -93095 -36741 7941 2433
21958 2433 -38089 -28420 -235 -17958 -27988 -12270 -46422 -114833 -164056 -138128 -98584 -41483
21946 -41483 -6597 95981 108984 89846 39694 97119 95821 54912 30765 12805 56386 53416
21934 53416 54257 64660 71700 106013 108647 73247 36738 -2325 -25245 -78029 -56598 -27379
21922 -27379 -33191 -15974 -16062 -59265 -64189 -19409 66712 51848 145 56021 24271 582 69313
21909 69313 30173 50902 84690 8871 -90807 -87493 -81083 -79926 -130503 -239960 -218371 -133093
21897 -133093 -136927 -83559 -31365 81440 16346 -18162 31746 11996 -14051 -18956 -14821 17165
21885 17165 29395 16907 47394 76029 26881 -13906 -61603 -54758 -102772 -70717 9731 69243
21873 69243 41803 12372 -23532 -41037 -62438 15577 -5953 -60481 -93919 -40798 -7481 23720
21861 23720 -31227 -51353 -58612 -58407 -14876 34604 123116 66343 -52082 -90047 12043 48478
21849 48478 23299 35100 -2234 36854 46411 -36221 -59254 -42322 8087 31941 130890 146655
21837 146655 184667 148112 125296 92961 24551 30238 94088 68836 -2575 -31132 76855
21826 76855 128529 142515 137241 126038 48927 19458 -24905 -110360 -89762 44413 112160 75582
21814 75582 95760 74947 796 -44504 -21229 -54937 -115731 -121939 -121463 -140090 -152808 -179023
21802 -179023 -117992 -63401 -69858 -18120 -25407 -121918 -84843 -21896 48945 -64945 -107492 -34731
21790 -34731 -46744 -3905 -62635 -32754 6554 57673 16190 5867 -149849 -188415 -49995
21779 -49995 -62918 -14695 45004 46308 42273 30528 60793 64176 23771 19229 -51161 -15438
21767 -15438 -694 -22607 42155 80656 34204 -51147 -82571 -54395 3849 -54936 -131634 -86853
21755 -86853 -123761 -115191 -93042 -21577 43602 24426 70540 38313 -2679 -67204 -103192 -83360
21743 -83360 -115855 -181929 -107167 24103 19249 15475 -41974 -74356 1807 7953 -21008 -58895
21731 -58895 -62811 -60496 11891 -4359 -29010 6635 2493 -37172 8396 13283 -52379 -30640
21719 -30640 13374 -18617 -45692 -46163 57659 82856 43204 62773 9554 -16622 -9982 -47085
21707 -47085 -65509 -17014 52470 91172 74623 59063 -17847 -31214 22979 -3931 -68669 -22132
21695 -22132 66106 13129 -12243 33343 88210 179460 197141 77613 13953 -19780 -68894
21684 -68894 -54973 41657 71169 -41696 -40479 -7448 42066 76190 -23420 -87916 -117158 -86871
21672 -86871 -114222 -156346 -136685 -98367 -169200 -168947 -27077 32117 -51640 -37772 -104295 -120157
21660 -120157 -59340 -22688 1686 39359 69400 61497 70395 22441 43408 67457 -16442 -41096
21648 -41096 27543 14749 -51787 -94014 -115281 -88835 -113562 -116267 -117293 -77342 -62884 606
21636 606 -48459 -79447 -78577 -68539 -58066 -16746 -45963 -151 62682 42609 60171 53257 78431
21623 78431 115422 174040 81216 -13958 -145120 -168529 -130989 -80150 -84841 -21593 -21104 -16181
21611 -16181 -51290 -11408 -1132 -9159 -20249 26089 -25069 -45055 -107769 -102122 -140543 -179553
21599 -179553 -110746 -124330 -183187 -148068 -81845 -37358 9787 -16663 -23987 42693 34101 55889
21587 55889 90337 109933 69189 -1948 -65511 -95880 -82310 -100687 -56375 -12313 -12932 -5882
21575 -5882 14002 11475 20912 31079 -67820 -110372 -101297 -76393 -126871 -160445 -138124 -54005
21563 -54005 -65715 -51956 -150921 -143719 -74520 -90437 -83215 -137041 -94177 -753 -26454 -36023
21551 -36023 45487 103955 55092 18399 -18435 -60647 43098 63461 6916 -1574 13205 -39437
21539 -39437 -52236 -56995 -44742 -14886 66952 31678 2998 58035 67979 73023 -2394 -108529
21527 -108529 -117356 -147631 -127498 -30481 -42711 38121 136813 127508 81078 42502 67615 94155
21515 94155 93422 72409 60666 64992 56318 20794 -31637 -45846 -23289 43860 65358 85135
21503 85135 124722 138275 97345 -31332 -83378 -63491 -93715 -56342 -10688 66501 40442
21492 40442 -47312 -39450 -20452 -43351 -81460 -113384 -95556 -34325 -27374 14162 46651 -167
21480 -167 -20206 22871 26200 -4306 -45391 -40705 -64513 -64843 -60566 21071 -4971 -43772 -69927
21467 -69927 -111446 -12317 21480 -6199 -59839 -46217 -10895 -29740 -29500 -18996 -30034 -44033
21455 -44033 26560 15305 -82681 -118247 -64012 7699 1192 23276 54194 24130 -60328 -89722
21443 -89722 -91316 -99515 -56095 -5138 -45589 -125810 -76163 -68015 -103459 -90615 -15457 -10957
21431 -10957 26763 6176 -87084 -72911 -62628 -99188 -121297 -49432 19657 70378 41360 31903
21419 31903 60449 105332 61265 2079 62328 131381 42530 15863 7483 -55351 -68992 -52386
21407 -52386 -71231 -63302 -86162 -73487 -100277 -135177 -140261 -139953 -166189 -107222 -68677 -28634
21395 -28634 3465 59552 66810 1286 95583 133007 72507 -2036 9284 -26195 -36768 -40096
21383 -40096 -51945 -6294 -20075 -3119 28525 -39530 -63660 -33293 -30506 -31064 -88167 -51073
21371 -51073 -1956 -20827 14 28422 63014 55334 -19911 -79033 -114886 -53816 -49428 -4902
21359 -4902 61325 39067 87748 74839 2988 -28191 -7089 -64106 -135094 -51124 14326 59842
21347 59842 69609 -20741 -44471 -50333 -108383 -145619 -38283 -45248 -102269 -145442 -163597 -110584
21335 -110584 -27498 -47351 2802 77632 132313 117051 79724 -19909 -45668 4416 -1112 -87098
21323 -87098 -127688 -46329 -84739 -87196 -45585 -47757 -43765 -56938 -35323 -37381 -42459 -22517 -5168
21310 -5168 62980 80792 -24708 -99939 -58342 -32122 -940 39505 -54924 -89927 -76782 -44455
21298 -44455 -29480 -6355 -48910 -49230 -59159 -10331 -41595 -4744 70117 92653 43081 58425
21286 58425 23080 18287 83310 121062 92306 95357 53611 -67707 -111581 -84613 -11460 -30305
21274 -30305 38565 108419 178548 107168 -13278 -77628 -79786 -32790 -5573 -17762 56936 79395
21262 79395 43936 -147 57764 70524 -7941 -10869 -83726 -52996 36807 119740 37007 -67441
21250 -67441 -24473 30809 67850 64941 83555 101517 92352 123762 50962 46604 167897 209722
21238 209722 66809 -19589 -84228 -70790 -21152 108520 104207 66554 50320 46569 53723 128362
21226 128362 121940 119108 145313 98238 90791 73381 -23847 -6259 41102 104242 128737 123142
21214 123142 115654 41472 27258 80462 129143 20821 -96083 -156322 -207701 -83183 81572
21203 81572 79884 -62896 -55427 -3536 15060 7488 -34686 -165802 -244894 -197650 -190717 -155193
21191 -155193 -80309 -37223 -60061 -117645 -131511 -56332 -32324 -13897 -19888 -20005 1915 -54590
21179 -54590 -107004 -44994 58257 95286 52020 -8591 -35329 -5146 19431 60533 53566 3909
21167 3909 -30750 -68317 47088 138476 162856 181404 86676 15589 -13446 -9235 4113 9991
21155 9991 -18973 -68658 -126219 -129641 -74524 -87815 -95100 -57578 -94971 -71038 -56003 -84414
21143 -84414 -122991 -133927 -10656 13288 -32038 -45391 -54583 23194 -8509 -62022 -98630 -3351
21131 -3351 102297 138043 40633 -86630 41836 78418 59851 42278 5686 26768 89911
21120 89911 95682 135022 174955 129002 50103 23846 43699 -43975 -106953 -89267 -61306 -89804
21108 -89804 -49710 -107690 -28526 35467 -55575 -82661 28033 85447 -13906 -125378 -111085
21097 -111085 -62293 -39227 -5756 -51824 -47389 -37873 735 -11611 -27096 -12461 -5959 -54450
21085 -54450 -112273 -98060 -89218 -51337 -18098 -60380 -21197 1879 61227 -35280 -51804 10558
21073 10558 -52613 -47595 12718 -7541 -5427 -12544 -28191 -6121 -34662 -23363 5705 -76043
21061 -76043 -79175 -32410 -11007 -14185 -26313 83222 138220 48911 -63813 -169663 -164843 -95565
21049 -95565 -52620 -88386 -92674 -122185 -83458 -77431 -34019 -7402 -17278 -2653 728 -79776
21037 -79776 -30264 -52429 -61440 1656 60881 67573 15556 -81707 -61977 -47785 -33158 -40292
21025 -40292 9384 8018 -6006 20475 -45183 -65355 21897 22054 31924 23269 -50896 -89662 -80524
21012 -80524 -12285 2725 -21521 -39305 -23241 -3610 -1516 -24839 29831 67699 109845 94019
21000 94019 -19668 26534 87680 89591 48057 7793 -23368 -48543 6250 54851 141245 143932
20988 143932 49920 -25415 -43742 -555 -13161 -30223 -8409 -33682 -45092 -27593 22733
20977 22733 2646 -32837 -48599 -126895 -226563 -133358 -26774 14242 61731 69428 61121 13506
20965 13506 238 33610 10309 -27154 -38858 80899 160144 170541 235135 201474 198565 106327
20953 106327 10259 -68797 -109308 -52509 -55866 -56299 -65763 -110657 -78103 -2324 31874 60971
20941 60971 54840 -2328 -58834 -52075 -16101 -39881 19183 100631 172595 126389 70790 123582
20929 123582 75201 81032 174311 169199 132489 131415 123799 41405 -18677 -78698 -82883 -82873 -107875
20916 -107875 -95175 -44446 49870 81259 98758 60862 -13424 -43511 -89290 -112712 -177731
20905 -177731 -174876 -234655 -315954 -281394 -196628 -122722 -14066 60944 17271 19720 37910 9083
20893 9083 -5916 18978 56406 16056 -46928 -55426 2791 30800 68470 86803 88037 75133
20881 75133 -22771 -61102 -55330 -112487 -113807 -12979 32680 -3821 69364 127250 51695 -10695
20869 -10695 -61041 -36508 21946 118821 94687 -43743 -85662 -67400 -59761 -8862 41136 50001
20857 50001 83451 43376 -11593 -136404 -179538 -139193 -86129 -60937 -5287 57390 51714 29252
20845 29252 -19727 -19729 51936 65777 -30018 -86554 -94360 -84633 -101130 -104033 -54580 -13576 55471
20832 55471 53447 81974 42733 3819 1013 41183 47147 118485 153506 181599 56349 3363
20820 3363 100968 137298 50199 47934 43242 10998 37821 1916 -61937 15359 68387 84782
20808 84782 44806 -51225 29227 90327 55480 -13099 -24890 -45853 49634 127074 63240 59919
20796 59919 58290 17497 4676 35804 77377 26833 36131 81052 103532 51981 42074 118913
20784 118913 134966 93831 49750 -6597 28704 37867 34708 -40069 -15641 -35013 -102313 -96798
20772 -96798 -36123 -10674 141136 224724 180075 125977 121459 12626 16107 -23994 -56983 -24794
20760 -24794 7775 -5506 -33222 69752 81409 42774 -49835 -111291 -93159 -60402 -17154
20749 -17154 19542 72380 72803 -13161 -24983 -46589 -113874 -206817 -194644 -127950 -100120 -76737
20737 -76737 -70169 -98084 -107638 -118883 -19129 21187 37178 33796 21782 66957 68846 145621
20725 145621 87419 37487 9668 -7874 -27405 50543 166204 152914 99175 193618 141194
20714 141194 107118 -80628 -170962 -61991 -34784 17994 -19419 -37318 -57770 -58789 24763
20703 24763 66771 58548 47979 62810 -25513 -99102 -69220 -53594 -49863 3911 -12947 17528
20691 17528 14462 10656 21758 -79137 -40194 17620 89202 218594 235255 118803 39274
20680 39274 71891 79098 44688 -26817 -90980 -52865 3652 17039 -32746 -5368 10529 27232
20668 27232 10272 -47116 -106256 -111764 -12294 -12786 56641 60361 70269 62575 -59073 -77857 3355
20655 3355 27331 13971 55589 16946 -83402 -153630 -75818 3803 -101516 -122599 -105484
20644 -105484 -101246 -67871 -57855 31149 86918 -529 -121386 -88343 -116501 -69957 36443
20633 36443 -50762 -137939 -83441 26901 33391 91225 67150 11689 -98897 -82750 -70953
20622 -70953 -103434 -78488 -6498 53294 143867 201183 142682 64488 13649 -15679 -38800 -76695
20610 -76695 -19617 86392 85247 87534 -663 -15191 19119 44797 62168 9020 -26395 22717
20598 22717 48939 28744 -54264 -161552 -198241 -171556 -161863 -126084 -70302 -56814 -88102 -66607
20586 -66607 767 36755 41922 61215 21960 25811 72047 -28156 -125953 -66767 22438 4575
20574 4575 -33542 -91576 -14156 9589 -41726 -46411 -154 31528 21306 36665 -26473 9791
20562 9791 52302 111865 84207 18346 13913 54157 69674 60989 16089 -59598 -55986 -55422 14741
20549 14741 64592 21003 3380 -18565 -2736 50642 -57274 -142269 -174072 -135065 -31071
20538 -31071 122237 22727 -32693 -40746 275 83818 108690 101788 107600 105462 76920 65601
20526 65601 63001 53027 37692 41621 57584 -19752 -32653 10760 59904 113711 70762 36244
20514 36244 -6887 -27461 -88225 -159065 -132700 -56327 -4747 22969 25078 -6617 -51440 -22830
20502 -22830 30084 25261 53790 90237 31718 37354 -5713 -66640 -48792 -32373 -45596 -53803
20490 -53803 -85063 -15059 -38493 -107344 -106341 -62308 -51885 -72488 -86111 -38910 32794 40348
20478 40348 69266 50109 -58309 -107432 -28988 32569 -2515 -45433 -28234 -73243 -156697
20467 -156697 -144656 -73099 -33186 18027 -32734 -37036 -25761 50220 60770 55993 66301 75428
20455 75428 57549 70046 142560 89091 -20569 -54019 14861 90961 56768 26092 -86431
20444 -86431 -89282 -68527 -124249 -98887 -92648 -45476 -58415 -76213 -82010 -74428 -121523 -60630
20432 -60630 -51245 -49908 -4396 46484 35061 43321 125433 143598 97848 55885 13835 56449
20420 56449 96827 59101 36227 -80440 -138208 -187533 -193388 -147375 -125377 -157328 -102398 -79564
20408 -79564 -41490 20575 85052 32683 5855 -49115 -31343 -11416 -82710 -154114 -202852 -169165
20396 -169165 -142085 -51012 -44059 -99259 -91000 -80322 -31021 -10734 -159694 -296213 -238609
20385 -238609 -124676 -38408 -58720 -107166 -71022 -121208 -133027 -70522 -15712 7121 -9143
20374 -9143 33916 29288 -723 -79224 -70868 -14472 -6422 -95367 -104661 -48959 -43124 -29031 58727
20361 58727 115395 134971 94102 -13767 -76145 -111946 -12622 98283 50428 25510 29281
20350 29281 -51557 -81822 -146670 -95683 -39087 -33175 22972 -13890 -88607 -46011 11143 34486
20338 34486 -12408 -22178 20003 54931 33207 18520 76504 115387 62938 28772 9206 -29399
20326 -29399 19142 3312 31450 35535 8841 -44087 -8877 -29614 -28984 -8680 -59190 -98932
20314 -98932 -54176 -64785 -96210 -58049 -90862 -83021 -20496 47426 -9118 40827 60425 91050
20302 91050 48437 34715 7101 10873 35423 107725 28780 -110039 -56842 -80309 -167673 -128383
20290 -128383 -4301 20117 -55285 -30203 22647 87952 32090 81959 32902 -42318 -75538
20279 -75538 -108428 -63617 -11060 -26555 -16193 -7687 1408 16838 65307 142218 56719 43016
20267 43016 79970 76365 101491 86366 82514 67260 22811 -69038 -87295 -60525 -29304 48122
20255 48122 97294 51127 41088 21180 25365 -18299 -85621 -81647 -11711 35705 -26984 56871
20243 56871 144209 53804 -109139 -152737 -66044 -22988 -8045 -6566 68169 42757 83015 96935
20231 96935 35695 89477 126260 67212 9696 -51832 -56563 -48517 -72399 -68074 6050 36093
20219 36093 -7555 60005 134422 122961 14832 -4492 38244 -91892 -117300 -87050 -19698
20208 -19698 -34690 -25404 -74970 -114144 -70327 -97839 -104697 -26462 42549 83433 84607 15224
20196 15224 -58309 -70766 -59245 -56691 -61294 -29483 -26849 -84865 -161943 -86663 -2537 27785
20184 27785 37950 51293 143152 107958 11121 -106 14680 7977 71534 89883 53977 -13675
20172 -13675 -29054 -89460 -35885 -57587 -7134 1099 22757 11954 47049 77837 -39027 -100502
20160 -100502 -105210 -44747 -36999 -124370 -191110 -150740 -75844 -14492 23257 84765 103937 98888
20148 98888 115482 -13470 -27095 -34586 -34695 -51360 -62080 -55974 -33912 -5625 -9809 -73278
20136 -73278 -106569 -5941 44022 3392 -6452 -50967 -102232 -93463 -110864 -70926 -65826 -12899
20124 -12899 51581 152296 128835 26911 37180 11080 -31947 -27987 -12909 -56398 -102227
20113 -102227 -92900 -55992 51404 78165 75277 22870 11887 73618 114126 62886 45668 43899
20101 43899 -6935 24410 5629 15428 17945 65356 68693 3670 -31900 -11563 24461 -24355
20089 -24355 -7253 19036 47350 50688 -27072 -6979 -14897 -36763 -11104 55844 54436 129125
20077 129125 159654 132000 8801 -22313 35211 104878 163064 107914 66341 119507 79817
20066 79817 42466 7607 -9764 -61353 -54314 12810 31280 33650 -4885 -41565 53053 -15259
20054 -15259 -81884 -40178 1202 54928 97557 89083 78746 76004 68583 33003 64321 80161
20042 80161 36435 37277 -15446 -5057 111133 98518 36924 53856 6009 32002 156432 163092
20030 163092 60668 24638 65672 92949 47496 -9685 -16466 -28274 -23801 -27361 -1314 56521
20018 56521 53216 17571 -49781 -101611 -96608 -65308 80861 149641 111753 15796 34023 48617
20006 48617 62703 39828 34180 22912 47898 35692 64886 100962 33001 82218 30448 -55536
19994 -55536 -77082 -24507 -27015 4937 21075 -67746 -69499 42431 1593 -59299 -65371 23168
19982 23168 75197 92506 96546 78877 25663 -20337 -11934 -47450 -109986 -105467 -88148 -24346
19970 -24346 -36329 -29476 -98467 -92140 -64389 -50025 -104345 -55133 10822 80195 74247 96003
19958 96003 58448 4752 36437 60423 50314 3467 -40984 24699 33524 -13249 16697 100927
19946 100927 96148 54626 120443 145000 97305 110073 108237 37697 22607 -10068 -25570 -52311
19934 -52311 -46531 -56759 -44894 -22907 41824 143624 182609 190334 132486 124608 82824 30711
19922 30711 94047 74111 -9567 -47560 -28583 18533 53464 82022 98424 166800 128442 -17447
19910 -17447 -32217 -37789 -108332 41534 130064 83738 36570 7895 68854 82590 84286 56488
19898 56488 -29737 -71899 -49780 1412 16253 8114 27787 85608 50634 -658 1831 29800
19886 29800 31621 -34589 -35506 -23749 -85875 -39712 -1481 7338 61766 24997 78107 86247 7107
19873 7107 -12254 82492 63582 36384 54297 162345 174239 127605 21258 15217 88079 138669
19861 138669 147896 75294 119302 68096 18904 5153 -5178 57566 99276 73211 76301 100879
19849 100879 71694 -2347 -32529 -10556 14000 -92889 -159427 -131699 -44700 5692 -12270
19838 -12270 -10209 41620 28184 61966 71727 50321 -17354 -53531 -95249 -181733 -211536 -179291
19826 -179291 -142072 -134935 -69495 25056 95302 94079 103344 23307 -18702 22312 -14611 -90844
19814 -90844 -106911 -101379 -76462 41563 47820 -2062 20725 80470 52293 75415 57737 -9582
19802 -9582 -10481 -3404 -50263 -55139 -22073 67248 64556 29297 34791 -8757 -30492 -57996 -6456
19789 -6456 27119 103195 186385 100595 12971 59920 111791 19006 -39544 -77532 -114910 -114818
19777 -114818 -39277 -19913 -32872 -51146 23035 -24425 -2325 59609 40800 123327 237923
19766 237923 270886 242665 230380 255653 215739 110220 77339 44405 -845 3990 18014
19755 18014 98168 110702 58385 38742 -80425 -66191 26223 59285 -15510 -138468 -136540
19744 -136540 -42589 88549 69580 -16422 -15682 17793 -85686 -7996 40905 116334 150960
19733 150960 118640 75719 49260 38332 6480 -86065 -90138 -17542 -14323 -26380 -67583 -45930
19721 -45930 79947 68470 -52657 -55471 -15838 4682 -30811 -68139 -31663 -4442 -586 84326
19709 84326 74655 33077 111862 106204 61004 73853 22873 84033 226723 286051 295266 276986
19697 276986 244750 178021 219712 409171 667176 772147 815319 875423 840929 694712 542742
19686 542742 474958 481962 571475 660238 724517 756160 745733 612967 500878 432916 395844
19675 395844 424097 508068 516455 394690 298590 259234 238554 225795 186522 74257 34210
19664 34210 87845 29609 160180 189779 114750 110443 139192 99050 83234 122251 152271 166750
19652 166750 178586 159460 73371 -9228 11188 26167 4913 70898 109411 152998 116465
19641 116465 79511 59601 64207 -13011 -50550 -29936 28649 21265 37298 73540 81282 112467
19629 112467 108654 158781 154344 135386 196623 221342 175053 303305 389484 308064 128458
19618 128458 68006 44154 29582 16600 -3787 28149 54198 11757 31982 -26983 -6474
19607 -6474 56105 109741 59441 7363 108160 119993 123787 135135 135787 178822 134723 78022
19595 78022 52023 -15093 -36691 -869 8214 658 -1143 6852 60539 21700 76298 110861
19583 110861 157379 132998 94926 23907 -41999 17881 91552 67886 650 -17080 -53890
19572 -53890 -85999 -154078 -154129 -103455 -9701 52361 -4141 -106870 -136334 -123574 -10916 34489
19560 34489 -65859 -74178 -27891 5889 20253 60733 38433 7938 -34521 -72320 -103421 -142726
19548 -142726 -86567 48251 27887 -5407 -39915 -53551 -43757 -28947 -69839 -44325 35815
19537 35815 111699 110807 27789 -96125 -44425 69214 55069 16497 -51438 -30894 -52309 -127554
19525 -127554 -146730 -52444 35391 107079 122353 37938 53373 80189 128570 58804 -24606
19514 -24606 5161 -27511 -73772 -3865 66648 36058 45487 70041 52454 13437 26345 19891
19502 19891 54377 28882 -12924 1586 -9384 -67879 -73313 -147660 -181881 -124297 -103047 -88483
19490 -88483 -36064 -9409 -40767 -48440 -49643 -31639 -22699 -47666 -34712 -71479 -39897 -66289
19478 -66289 -160742 -233816 -238755 -193895 -127734 -41957 -148960 -205933 -258071 -241233 -306260 -363202
19466 -363202 -313256 -212255 -143705 36474 73320 19515 -56600 -173929 -281268 -365091 -421630
19455 -421630 -245114 -78379 -12636 27882 42272 -16427 -44300 -60770 -60437 35085 120450
19444 120450 164759 164303 199652 166849 109667 118123 86974 121928 185502 190055 163441 95563
19432 95563 146764 157306 104827 95031 45086 81841 203166 236091 257198 233768 226193 163548
19420 163548 130551 106828 119115 60002 100363 142600 168484 131851 127490 87571 102497 118276
19408 118276 157224 251892 206120 196167 190157 161743 149453 123759 154719 189635 160769 226600
19396 226600 266272 287886 221677 189412 156893 201715 147920 166225 242249 343828 353905
19385 353905 293058 251138 216386 183284 187318 150234 154650 184686 179370 201151 148603 25861
19373 25861 40861 86877 147080 112096 45440 44650 146506 231361 255336 287361 336760 259357
19361 259357 192645 152490 133241 123734 120253 194305 229070 186756 180244 107732 69930 118400
19349 118400 55959 24227 152312 264183 185857 61374 72253 117277 122265 62008 78879
19338 78879 96024 108389 113292 67716 78689 -5806 -53949 -21213 14183 -32889 -32332 -19177
19326 -19177 -85747 -868 -559 -9303 -83477 -90431 -73998 -93697 -137074 -92899 24858 124184
19314 124184 46965 -22048 14550 97625 90109 114513 106326 28074 -41848 -80543 -74027 1619
19302 1619 89632 174819 225794 178139 33422 -63370 -100512 -101712 -24786 46840 57551 56488
19290 56488 34650 -33446 -134639 -174856 -145871 -95918 -81016 -76305 -90606 -95968 -19391 98721
19278 98721 94509 3570 5204 48023 74613 140629 205163 190677 265088 326926 319138 412587
19266 412587 515232 527178 487268 405221 361657 308334 374036 457563 505632 592378 639932
19255 639932 588039 500635 434897 417449 424393 488920 509703 515262 522880 573246 559815 519773
19243 519773 426348 340925 322061 269803 293379 331177 344228 358874 393179 354324 291788
19232 291788 358141 469833 490468 519425 525660 447524 409037 377722 393047 349225 297824
19221 297824 301810 224925 221150 271202 274433 339012 349935 335490 238920 284294 432398 471332
19209 471332 512220 477181 378717 339207 407221 429056 427202 448504 439153 418248 428450 556946
19197 556946 605582 595279 533633 490384 483718 481605 539484 594345 598881 680499 845162 853224
19185 853224 766510 829489 980813 1121156 1162557 1143662 1086576 1158207 1193027 1371108 1569278
19174 1569278 1849753 2013816 2134255 2135317 2061554 2024689 2059267 2240699 2604987 3081637
19164 3081637 3666840 4302077 4804337 5055603 5369983 6036302 7117222 8783152 11445103
19155 11445103 15684349 22398041 32318815 44323172 55091575 59949914 56249060 49485768
19147 49485768 45878053 47731561 56479946 74211010 102798506 136247379 161954020
19140 161954020 162763319 135600802 104893285 85556385 78024931 81252753 96424061
19133 96424061 123143206 152206167 169422416 156982680 121201531 88283711 67468987
19126 67468987 55910148 51013525 51843474 57233653 63238159 64365768 55909989 42413694
19118 42413694 31270133 23924825 18965504 15207989 12292429 10264396 8918545 8040683
19110 8040683 7464667 7115983 6607494 6025096 5537953 5059336 4679284 4427772 4291507
19101 4291507 4199077 4211019 4100015 3870445 3542166 3248961 2985899 2841419 2735338 2744025
19091 2744025 2789116 2713000 2529980 2395263 2297127 2165883 2109820 2102848 2019226 1937204 1851152
19080 1851152 1743070 1710942 1668912 1580614 1449185 1315359 1257912 1309993 1261333 1179555 1206472
19069 1206472 1159217 1028730 930392 941112 963101 851705 850767 868892 832945 759274 721861
19058 721861 675681 657965 728985 601709 568406 591033 571371 557186 506539 453592 383486
19047 383486 414501 522530 559600 549940 483068 398050 304701 269966 332990 398663 367384
19036 367384 350298 322195 258623 248054 217169 173401 196299 311268 323771 285247 239535
19025 239535 234641 258912 250859 143692 106177 242259 381541 365858 327689 309048 377736
19014 377736 334971 274284 260496 227458 220563 242159 197683 249962 332773 371137 381880 313091
19002 313091 224958 200147 242048 304580 383473 443352 474910 567056 607369 643883 779772
18991 779772 958768 1147018 1193793 1113571 1003479 954300 915522 1007660 1244062 1505897
18981 1505897 1738396 1897644 1875311 1743385 1588119 1429844 1363074 1315005 1430178 1689271
18971 1689271 1936781 2047323 1870187 1475814 1167275 923507 887242 866133 927107 1035177
18961 1035177 1077164 1010328 1023639 965832 811915 802460 817404 827927 842671 771702 771878 837290
18949 837290 854039 790608 782180 806871 782832 720103 749653 813223 744625 773858 905170
18938 905170 1030134 1061337 1089555 1121988 1161964 1174987 1165362 1079269 1009477 992304 1002522
18927 1002522 1028772 904552 725336 667690 647920 504511 458290 535852 660021 805029
18917 805029 915035 974928 1035123 1055645 964679 842093 803879 889486 959893 896120 934995
18906 934995 1042001 1099121 1160252 1341421 1544772 1780695 2132594 2526582 2892522 2945271
18896 2945271 2640510 2431185 2455342 2701094 3223712 4142797 5286160 6381613 6812886
18887 6812886 6147295 4999615 4135719 3692681 3717783 4179640 4968964 5880106 6479159
18878 6479159 6292746 5229202 4080967 3278995 2881677 2685266 2676387 2752721 2924045 3040270
18868 3040270 2760712 2240534 1831249 1609668 1463839 1305850 1204146 1091798 992271 953563
18858 953563 1020062 1072160 1056606 1067907 1008100 993897 970922 1004279 1023182 955128 903457
18847 903457 836176 736923 623834 590184 622549 689320 708845 771199 762093 786170 782910 807790
18835 807790 759646 656062 599019 589958 587930 612759 670495 692332 681850 563709 431346
18824 431346 380942 404988 399495 441448 505640 410802 393808 484845 631149 688997 702315
18813 702315 680648 527711 457602 435398 415930 470218 560774 653716 781373 723415 608484
18802 608484 511510 472806 451445 515959 510173 445305 423610 461739 503437 440438 429509 407206
18790 407206 395433 369014 344324 328794 352237 279982 205950 195695 209519 117721 108309 150582
18778 150582 129446 103162 129154 181775 240261 212263 178487 219714 232014 255081 458965
18767 458965 743485 969532 1073203 887222 577403 339911 99783 -66495 -60854 -155487
18757 -155487 -214348 -241422 -322461 -279125 -192537 -181332 -91399 -10095 22680 35870 -14033
18746 -14033 -67400 -49517 -68954 -128893 -284997 -445988 -653630 -844224 -909335 -828690 -664973
18735 -664973 -488189 -281977 -75438 11678 124260 227899 238408 174192 111034 -56662
18725 -56662 -30575 20313 32365 84756 64837 132055 118347 136543 191946 242915 201635 174164
18713 174164 115221 -14646 -84138 -42614 -48356 -16926 43048 74158 77269 112978 121741 128787
18701 128787 231496 217107 252491 293242 328620 268253 238212 320155 379752 425709 376531
18690 376531 406799 478929 483668 440155 340962 415808 453071 444235 559840 617778 628135 557997
18678 557997 617295 629305 654195 572766 567113 613663 654073 664237 599090 635011 672558 663438
18666 663438 682862 695050 603669 560417 621596 642336 577182 537317 543570 581825 639620 686954
18654 686954 678634 620947 649485 687199 744154 691818 610795 518921 501131 599510 699255 637820
18642 637820 652141 725393 753137 790723 794901 823878 758440 752478 808277 806459 807631 761470
18630 761470 754119 753484 783499 837699 852755 750471 657012 585447 570015 482994 339548 334260
18618 334260 329698 415287 473411 466396 457915 458805 439049 497481 569378 616131 547231 534075
18606 534075 550290 498193 394585 396064 489799 458180 383792 338746 302484 426947 526053
18595 526053 599367 618631 629690 635280 644093 658168 795580 992938 1176990 1266908 1289936
18584 1289936 1331704 1200311 1092331 1048289 1135662 1141360 1188561 1323788 1433005 1491323 1342140
18573 1342140 1112160 962484 887105 801620 767297 731170 727411 844827 837975 780929 742706
18562 742706 731726 810147 806592 826365 851001 903779 891499 947541 1052737 1091351 1002993
18551 1002993 1017820 1050340 1040145 985736 1007141 992929 1040654 1152692 1203809 1255996 1335503
18540 1335503 1399050 1485273 1538402 1726848 1870072 1932636 1879225 1881419 1846411 1805329 1718685
18529 1718685 1651067 1746100 1910072 2020796 2016784 2011416 1961523 1924468 1805222 1820580 2027592
18518 2027592 2278669 2438547 2600386 2912318 3180420 3273009 3288095 3309903 3368831 3511234
18508 3511234 3540699 3548210 3421253 3170533 2950855 2836958 2691276 2688486 2714917 2730936 2812926
18497 2812926 3000706 3206122 3348886 3434025 3515628 3637802 3703106 3738548 3791544 3833692
18487 3833692 3901546 4092063 4314039 4604580 5001691 5510661 6295402 7291632 8537116
18478 8537116 10117582 11628856 12809626 13918250 15371236 17287882 19291985 20565913
18470 20565913 20308009 19575708 19660537 20489663 21336340 21294925 20669996 20832801 22618475
18461 22618475 26223353 32068078 40578858 52508892 67921135 83730258 93323199 91249778
18453 91249778 82354756 73009616 62589981 51767081 44002790 41030207 42956522 49918520
18445 49918520 61631798 74905771 84294176 83794290 75361275 67408590 63745832 63399327
18437 63399327 64934434 68753527 76539326 89660571 109492870 136477146 168293901
18430 168293901 196532743 209221050 200313358 176193377 148205763 123177892 105948272
18423 105948272 98849917 101882031 113769931 130822479 148319688 162297628 177967780
18416 177967780 208660490 260711846 327140126 390724420 427121706 428203138 405459244
18409 405459244 373583103 338716837 300712875 265283819 233605079 203728833 179517900
18402 179517900 164946379 159773379 161272291 165072756 166112094 163853900 163465158 166150750
18394 166150750 169505714 172807468 176226854 178290170 177829047 176251373 176721370 182036536
18386 182036536 192347269 204932251 215107549 219934645 218064796 209604219 198640073
18379 198640073 187822132 176441693 165050780 155360779 148051361 143623872 141352097
18372 141352097 137540193 129826771 119423297 108901931 100995896 97488395 98308971 101800227
18364 101800227 106026889 109888154 111942363 111128303 107131155 100398615 92336006 84323172
18356 84323172 77456328 72413511 69341707 67500698 65910788 64083393 61775378 59316603
18348 59316603 57277860 55954852 55252832 54252920 52228121 49433695 47250932 46682277
18340 46682277 47787386 50059114 52593269 54700359 55988702 56226674 55228900 53286181
18332 53286181 50311122 46449932 42286669 37816959 33337653 29668822 26946684 25284392
18324 25284392 24776377 25203236 26289328 27775243 29299243 30711395 31847455 32207660
18316 32207660 31262861 29067796 26053662 22331205 18559553 15318247 12757785 10813875
18308 10813875 9350384 8356294 7734938 7364564 7173849 7079047 7033086 6941901 6779560 6516494
18298 6516494 6224036 5910440 5517951 5027097 4661924 4339300 4040817 3792824 3650363
18289 3650363 3547473 3547428 3618330 3574069 3582148 3560443 3477166 3416324 3420202 3497620 3558773 3645292
18277 3645292 3666000 3625315 3558766 3358601 3083256 2816811 2634785 2416773 2138630 1986835
18267 1986835 1923593 1780722 1640129 1586936 1584315 1570842 1528241 1559217 1508850 1442908 1449898
18256 1449898 1498616 1428230 1328016 1337759 1379053 1304213 1254451 1327904 1307993 1350724 1411776
18245 1411776 1389316 1255823 1179594 1153543 1221126 1360559 1412459 1387854 1464204 1562149 1584301
18234 1584301 1549416 1591629 1659905 1722099 1652135 1633950 1670528 1589166 1516783 1467826 1498639
18223 1498639 1565974 1598211 1514708 1367137 1231995 1236294 1239874 1172123 1081557 994655 1027527
18212 1027527 1109298 1147455 1246670 1341820 1470293 1479643 1444862 1472437 1540466 1522035 1502002
18201 1502002 1375491 1289989 1317441 1277519 1366170 1297950 1166967 1226441 1472335 1627996
18191 1627996 1732249 1774479 1659970 1548463 1403585 1256644 1124045 1087183 1090790 1034411
18181 1034411 1026017 1019326 1073320 1126443 1165223 1194627 1190700 1283705 1294468 1151922 1011139
18170 1011139 925644 812058 794661 782178 764202 759330 826389 839099 758153 727165 702989
18159 702989 725993 811354 827940 787175 738512 742208 831985 814973 720509 709996 751826 747078
18147 747078 752674 799444 846342 872279 925610 1033715 1068618 1144646 1253724 1403570 1486638
18136 1486638 1429590 1390000 1369577 1423016 1463189 1571467 1704392 1895166 2128595 2286022
18126 2286022 2414034 2522369 2633175 2741470 2994997 3394666 4013593 4686663 5649638
18117 5649638 6911154 8473293 10636105 13945830 19507387 29519550 48018223 80488750
18109 80488750 124874465 165579163 181389929 147221088 96927125 62194138 42045392
18102 42045392 29595571 21393630 15817145 11989556 9318731 7469593 6240450 5401824
18094 5401824 4868206 4411835 4065987 3830996 3606958 3557697 3526315 3460274 3419746 3275977
18084 3275977 3134957 3097092 2992117 2850188 2715813 2585673 2420215 2278248 2220375 2166193
18074 2166193 2035479 1938540 1845540 1696070 1695978 1757359 1720751 1701495 1657898 1634813 1602242
18063 1602242 1656914 1739051 1653455 1626164 1642058 1629300 1657320 1739029 1799669 1754466 1679003
18052 1679003 1609354 1488730 1412338 1412067 1462869 1394606 1300882 1218532 1209891 1157181 1094198 1103086
18040 1103086 1074443 1013929 1058724 1062651 1018700 935663 827303 754738 729576 733139 764736
18029 764736 764955 837401 772480 698180 710717 598558 579367 617280 607208 597319 572790 573183
18017 573183 559219 537183 487649 390448 360868 475681 470288 465432 415744 444909 457052 516629
18005 516629 542947 460802 414805 346126 322220 351204 448474 444698 329355 301470 241676
17994 241676 217000 248782 286607 343857 382306 378147 454363 413721 407191 389403 304785 253243
17982 253243 287222 275517 253286 165740 289278 345300 304549 290518 317623 406583 457289
17971 457289 471437 558639 652954 691560 773986 881262 875831 803595 727877 652782 583474
17960 583474 563188 551784 488288 447840 423454 532890 690332 734161 770429 756038 746691
17949 746691 733856 680353 658466 749485 894415 926930 931282 919163 906205 921226 921952 902862
17937 902862 880002 853937 802420 788674 677358 586721 547653 537673 665974 826970 882068
17926 882068 919888 875215 781115 722786 798602 901334 1076772 1265403 1330564 1387302 1339380
17915 1339380 1304943 1368774 1396403 1358609 1272904 1218044 1338555 1423364 1419148 1240411 1067115
17904 1067115 974846 958530 963305 901644 848721 795822 755027 732417 738345 822661 975539
17893 975539 1040906 941496 831120 829075 866147 923253 966340 1006452 1082952 1106367 1017462
17882 1017462 914217 913033 920159 933259 1012668 1080179 1074904 969876 965828 991132 981540 1011929
17870 1011929 921115 890411 973516 1177583 1288337 1293106 1338530 1416886 1454108 1373928 1314050
17859 1314050 1242021 1192288 1132581 1022408 1009349 993728 1069410 1081988 988919 984936 898363
17848 898363 788829 772258 740972 761403 830337 857871 872321 910845 976337 966524 956289
17837 956289 1008339 888151 860289 832553 848384 904898 917098 910048 905344 905485 895729 888044
17825 888044 929783 1041168 1133805 1336384 1510694 1754087 2081205 2260279 2315591 2200131
17815 2200131 1904966 1589007 1332273 1088353 946374 862876 803321 694964 650762 527322
17805 527322 523902 628406 656619 620375 479981 438030 424396 373711 296405 217976 258596
17794 258596 259030 214541 192590 205153 206221 125121 22626 49946 108396 175570 260818 396829
17782 396829 651459 679661 487437 358522 320887 318525 277186 252344 181582 120202 42319
17771 42319 110394 216672 233318 204811 127317 96025 79690 41164 52547 110644 128794
17760 128794 80219 87312 141323 163756 78790 13980 -593 81596 102608 113674 115953 104284
17748 104284 105244 128175 103387 64388 136411 100315 62174 48633 6022 -37386 84791 173610
17736 173610 158247 190593 247159 200419 188822 219522 206768 152576 60087 42463 64359
17725 64359 119934 126614 103854 123333 142411 131365 81199 44519 8846 -78850 -88851 -53420
17713 -53420 12931 116553 136339 20535 -88100 -65899 -22182 -17490 -11026 12375 80741
17702 80741 89826 44126 54550 20816 13436 37828 42986 32165 10210 125585 249034 243575
17690 243575 164724 162524 188202 239094 258910 181949 173992 107535 63859 54810 55626 83050
17678 83050 35997 109937 66000 15866 -100867 -52421 36604 137886 170966 168813 85792
17667 85792 86912 110519 154481 150354 160518 140983 81370 63694 66745 -29689 37697 42517
17655 42517 280 -80921 -88272 -8069 45218 99295 75253 83068 34655 -46573 -7615 43613
17643 43613 669 -22324 -23917 5684 -7141 -39682 -82599 -114822 746 65098 35845 -28397
17631 -28397 -32630 -7658 -25552 -1642 10814 58872 19132 31864 1988 -77354 -124642 -137944
17619 -137944 -48603 -18355 39569 44403 86582 111145 173979 50361 -40566 -19754 -55108
17608 -55108 -39645 -38725 -136071 -115128 -121683 -85880 25985 92885 99459 9651 1309 28869
17596 28869 -39157 -19158 83708 31202 -28354 -27420 -72217 -102497 -77879 -60927 -100087 -112469
17584 -112469 -35604 22072 68300 56407 42678 9258 -36885 -80137 -111922 -87021 -23121
17573 -23121 -1917 71248 78920 -33508 46091 111601 75027 49496 21174 -32722 -51521 -55418
17561 -55418 -50659 -172558 -207429 -137807 -75615 -27261 -56345 -35830 -25659 -9813 27282 35383
17549 35383 36887 4054 12533 44827 80736 124806 96243 9988 -95768 -107368 -89103 -33323
17537 -33323 -25077 -60849 33999 80086 1334 7473 24460 -35466 -44574 -121588 -108112 4988
17525 4988 86480 -9296 -142559 -102126 -22681 -33427 -10644 111965 128976 108044 131514
17514 131514 143692 114387 72966 72548 159280 41184 -53296 -55869 -26966 -27517 -53912 52895
17502 52895 127875 77636 -48515 -114523 -81788 -35436 1802 -19834 -7615 -2733 39617 19314
17490 19314 7567 34229 60096 82790 122372 131806 95574 77690 92626 108715 112348 136958
17478 136958 113530 162156 166651 130459 44453 29295 174088 202195 96457 64826 44975
17467 44975 43671 82156 105258 87023 93052 26605 24230 4237 3205 58763 80951 110869
17455 110869 75228 129267 62725 -54434 -67398 -2417 15174 53122 90970 94383 87345 299221
17443 299221 542568 753916 897362 761646 465887 173832 51975 37728 21150 41553
17433 41553 95171 63787 -8467 -15733 -42811 -47772 -14266 -45513 -60927 -120896 -190553 -227906
17421 -227906 -303331 -269797 -232690 -100914 -58964 -20905 -53587 -101415 -169028 -135575 -103326
17410 -103326 -41154 -69062 -108481 -83731 -94572 -115585 -200908 -176666 -87044 -16944 -38317
17399 -38317 -21950 18182 -41251 -83819 -89753 27600 32819 37874 122189 86919 71510 1066
17387 1066 44172 116960 6446 -19518 63219 74539 -84903 -45451 -46636 -83726 -116180 -117572
17375 -117572 -75224 -54442 -66051 -36597 53347 132832 63931 -63039 -161248 -80136 -49431
17364 -49431 -147914 -142634 -46302 58353 83069 -24558 -19550 -3767 -109423 -153342 -191688
17353 -191688 -28006 79998 68860 67314 69579 62724 134580 83349 16065 -4622 30937 77485
17341 77485 82752 102992 85466 47988 -36001 -47975 -51082 -61997 -79801 -51906 -55823 -58344
17329 -58344 -35227 -49228 -31701 -6116 11884 17193 -18901 -3217 1251 28047 59064 21390
17317 21390 71758 118675 93949 45746 -23525 -11908 -5014 -62101 -35663 -89587 -136186 -153476
17305 -153476 -117053 -44695 5727 -68931 -65423 518 2065 -16482 804 -54500 -52332 -72961
17293 -72961 32185 69954 38910 49563 -104458 -148365 -99974 -42794 4440 10198 33598
17282 33598 -5663 -55384 -42750 -70282 -106796 -95581 -31839 -30472 -59000 -6330 -12468 -48751
17270 -48751 -137504 -128539 -85552 -78705 -92891 -99402 -53444 -96546 -72386 -122944 -113093 -107336 -64709
17257 -64709 -33575 -42824 -69922 -162322 -165957 11222 42707 30696 3951 -48728 -12462 68935
17245 68935 143474 167806 148836 145464 180800 211736 148934 80814 -53298 -147415 -129166 -105298
17233 -105298 -71793 -92564 -152878 -176572 -112288 -51946 -43764 -20454 22812 48673 13021 -43251
17221 -43251 -35041 58891 126959 77085 -6826 -16496 26695 17044 -5888 -38915 -40779 6630
17209 6630 17008 45160 9699 -6420 25711 36602 -52468 -84244 -34753 -57259 -13897 8856
17197 8856 -43149 13710 31569 20579 29659 53005 25290 -15860 -55071 -63942 -36961 -51505
17185 -51505 -39661 -128141 -112771 -43082 -18109 -23434 -13128 -5292 -56182 -53940 -72236 27292
17173 27292 2510 -70986 -39187 -52366 58908 127209 212642 246706 259856 317289 291948
17162 291948 298073 226239 230595 318863 312732 345075 338542 268209 261473 270102 251060 285568 253556
17149 253556 133191 111833 81237 111642 130606 155292 64317 32268 49683 51463 55657 75156
17137 75156 76745 113854 125766 57963 25003 -7990 -58529 -76030 -75684 -53765 -35517 -59723
17125 -59723 -29560 -7080 37555 -6881 -66040 -55262 -82139 -32298 -32666 -66149 -68756 -71367
17113 -71367 2715 92788 8229 -49374 -97965 -91911 -66023 -13588 12735 52381 54368 42358
17101 42358 19850 -43950 -35884 -45143 14552 29725 83283 51176 71380 109865 88140 42608
17089 42608 103036 102862 128839 118330 98308 35426 -31198 -64152 -42900 -103670 -151960 -187053
17077 -187053 -168299 -105172 -77882 -92855 -140796 -141600 -120674 -63325 -33014 -955 69730 -16836
17065 -16836 -42638 -42130 16459 97953 51927 50676 36602 -27388 -35213 -54857 -74575 -50823
17053 -50823 -84969 -62327 -83963 -32897 58294 100136 93203 39998 -63072 -83341 -106792 -111491
17041 -111491 -41648 23097 60617 2875 -109583 -130123 -100422 -7797 27177 -22625 -99964
17030 -99964 -127316 -93936 -142409 -114321 -113955 -99936 -128060 -96687 -148173 -172152 -132593 -102793
17018 -102793 -70054 -34951 -44363 -48579 -7496 -36660 -73804 -71096 -74272 -62854 -110746 -48295
17006 -48295 109825 124364 104231 187345 102280 67354 -2049 -88582 -94166 -115570 -81452 -33541
16994 -33541 -12168 -43973 -34107 -8528 -27423 -94749 -124382 -177416 -192770 -156165 -114715 -88868
16982 -88868 -100565 -55490 71270 47693 -45391 -69021 -90466 -98068 -93508 -131666 -167606 -101879
16970 -101879 -166382 -159450 -121161 -116076 -37991 8811 -23667 -63110 -48659 -14389 65621 89571
16958 89571 26592 -107229 -183896 -228326 -173104 -125499 -145365 -163448 -144476 -135933 -110382 -121160
16946 -121160 -116884 -48150 -7669 -54054 -50387 5446 -41830 2544 82851 121049 87603 63733
16934 63733 10949 27168 39941 68470 100327 6545 22095 -8295 -46605 -4599 -13084 -12372
16922 -12372 30809 42330 -34830 27420 48800 46809 -44850 -173597 -161443 -107052 -115495 -101608
16910 -101608 -75216 -59639 -46817 -90160 -38052 -58853 -67750 -62558 -89007 -111884 -137328 -121937
16898 -121937 -58505 6191 45463 118499 73352 18906 2059 -71384 -80305 -34359 -16576 -6305
16886 -6305 3852 -11147 42930 -23336 -87784 -85029 -64898 -99770 -168416 -163935 -128727 -84005
16874 -84005 -100497 -101957 -144530 -151843 -130554 -68541 -125037 -162749 -92437 -56243 -104220 -125644
16862 -125644 -121650 -72118 -70274 -71602 -8071 46008 -64641 -152350 -100654 -66582 -7355 -58966
16850 -58966 -78583 -39916 -10014 -57397 -75983 -153259 -166722 -98526 -123495 -99998 -88203 -31564
16838 -31564 -37987 -31842 15853 26737 13275 -202 22419 60742 139639 116990 63952 16436
16826 16436 -27238 -69735 -66655 -100088 -104609 -57780 23761 -36830 -96734 -202390 -199121 -134684
16814 -134684 -57164 -41231 -6679 29794 79896 73198 37709 66496 93644 118339 85777 128369
16802 128369 93583 58777 38972 -35660 -14490 -24070 -63233 -34 45334 131775 96522 74753
16790 74753 98991 47496 67991 18671 -43314 -20264 -10120 6567 7710 75696 44848 68704
16778 68704 30768 52229 110735 93362 55469 8494 -11014 48436 25467 -26550 -162817
16767 -162817 -162822 -137670 -59168 57980 3781 -76990 -96492 -111065 -150525 -175231 -137828 -75108
16755 -75108 -75586 -62698 -102658 -99199 -111578 -65060 -25816 42745 137854 94253 28151 61183
16743 61183 198619 126739 26498 -24200 -91018 -100962 22258 -9157 -419 -8206 -22335 -15876
16731 -15876 -14211 -39410 -57560 -130594 -178668 -174276 -14846 49903 20403 104225 114218 70392
16719 70392 31600 26216 -13584 -89537 -155828 -203708 -177896 -185305 -248225 -188723 -124481 3594
16707 3594 39146 -34469 -141103 -199867 -133349 -21432 -21450 30586 -11927 -74935 -6798 22581
16695 22581 -1346 -7067 -9813 8164 9486 10061 -41278 -88078 -90426 -154396 -149654 -83293 5725
16682 5725 79294 62788 10375 44404 25814 -24242 -15690 -46108 -25227 14074 -41358 -116794
16670 -116794 -97679 -37528 -125666 -47413 21947 -10632 -34811 8144 29875 53073 95325
16659 95325 9173 -138866 -90722 -19747 -54707 -102347 615 -19614 -75724 -124560 -156493
16648 -156493 -25068 -52646 -47119 16442 63737 -1200 -7414 52061 40957 27884 20648 28880
16636 28880 44377 130483 84261 26989 -8562 -34026 -84227 -76610 -145026 -99602 -38703 8877
16624 8877 25307 36497 54859 -46937 -129927 -134849 -103708 -71779 -75334 -60501 -108396 -139823
16612 -139823 -88806 -90255 -154104 -166591 -103271 -9517 20905 16754 -933 5400 28864 43819
16600 43819 26226 -50312 -66931 -58200 -10895 -57688 -112020 -113790 -120510 -87168 -98319 -91082
16588 -91082 -84386 -58711 -59518 36682 78435 41731 40991 27379 37011 52271 5754 -42318 17321
16575 17321 95290 77829 -2011 -26505 -46560 -90863 -90665 -14255 50541 14931 -6292 97364
16563 97364 34856 -52601 -62855 -52076 -18034 211 -24197 -56331 -72682 -111620 -103030 -53474
16551 -53474 -42783 37383 73102 95744 136653 15946 -75714 -51943 48832 102620 22033
16540 22033 -127769 -68751 52701 90854 68730 13164 -48709 -49742 -67142 37530 79357
16529 79357 55109 33398 29932 7970 62851 70373 117817 91304 63987 18596 -34190 -91922
16517 -91922 -76302 -128004 -125162 -94576 -42127 -98806 -74444 -40559 -29639 20211 31981 28158
16505 28158 25157 2177 -45100 -44946 -15258 56989 43163 -4680 120716 192432 63520 71795
16493 71795 23835 -1226 -66690 -112813 -109389 -100536 -46317 68295 88230 94059 77118 87109
16481 87109 102658 21402 86699 91258 47000 11228 56436 61325 53119 6028 -29060 -18912
16469 -18912 -9146 16654 120257 162071 52005 -1076 10398 77645 113728 72541 25857
16458 25857 -44868 -63604 -10244 9063 11299 27154 -12251 12520 51420 126207 148426 77933
16446 77933 22883 36025 -11109 -77239 -8922 -27733 -10359 129 24167 -53701 -133556 -105352
16434 -105352 -8124 -3357 -55663 -69680 -72689 -22543 -50324 -112233 -137020 -204257 -111785 -39532
16422 -39532 -48261 36205 49300 -37115 -6708 29433 82120 116349 -13223 -17872 -23899 -26234
16410 -26234 -30860 10502 616 -53542 25845 71485 25180 -26189 -33910 -12313 34700 83926
16398 83926 81177 132839 75918 21452 643 37934 68617 76868 56555 18759 5038 160204
16386 160204 214334 169259 29239 11613 55781 39781 12992 45566 -13649 -17435 45665
16375 45665 8030 -51416 -43830 6702 15509 9123 -1983 66008 94236 36345 6030 44071
16363 44071 -27060 -83559 -36314 -3481 7924 -9632 -22540 -88205 -113427 -120986 -130723 -104137
16351 -104137 5305 -10177 -4284 -7963 42844 19227 -98144 -101659 -49399 -71520 -17583 11676
16339 11676 3016 43148 32256 -6823 -27361 -49709 -46619 -52048 -96248 -24755 33738 -23001
16327 -23001 -2232 -69685 -110397 -28831 34951 25083 14224 -44820 -35988 29780 16267 -48809
16315 -48809 60452 144972 145084 21345 -10298 57955 85669 80420 22247 8451 -24838 -20635
16303 -20635 -19219 -83903 -163032 -126749 -84100 -28481 54490 3283 60259 105940 94421 88834
16291 88834 138759 174994 99872 -2028 -101544 -124986 -169404 -116041 2675 30830 -56221
16280 -56221 -119704 -32147 63012 78844 54947 -20229 7623 23954 6056 59328 37260 -17728
16268 -17728 -65816 -113130 -94978 -42274 -151058 -185423 -68679 7052 -1234 -79809 -184169
16257 -184169 -169732 -148670 -144611 -116509 -103011 -109349 -73391 -54009 -53913 -3060 5015 47195 -47896
16244 -47896 -52954 -42988 -33381 15 46980 28882 63714 -4758 -64099 -66157 -8587 -2347 -66241
16231 -66241 -67274 -57645 -73632 -16521 -49342 -42420 19283 42489 25397 2872 -94782 -55274
16219 -55274 -38719 39779 90641 68288 -11268 8631 18896 4086 -6486 -15483 -46208 -83831
16207 -83831 -96856 -66788 67689 37173 -59200 -24660 -1318 13394 590 24291 85342
16196 85342 91636 108352 150912 161281 90289 65298 54218 15824 6937 34307 71561 73819
16184 73819 26205 -35578 -46765 -90387 -130678 -98505 -1894 24959 -84873 -121305 8550
16173 8550 71275 80244 -10516 -53290 -21792 -68410 -74956 -61761 -151516 -102514 -119272 -126484
16161 -126484 -10995 -2539 21182 60228 49931 44703 -7660 10976 35624 34105 21634 99570
16149 99570 150153 83635 13183 -32009 4724 -19359 -50470 -39530 21626 45517 132172 178392
16137 178392 202008 72080 -77712 -123942 -128785 -100989 -87486 -31160 -51798 -80097 -94583
16126 -94583 -123122 -12569 36791 2879 5933 40187 142574 85732 -58259 15567 9783
16115 9783 -71730 -13436 178347 244403 203308 111790 39730 117332 144310 143266 172415 105517
16103 105517 76176 89974 69714 40919 -44386 -100221 -54527 -34802 -61872 -93459 -742
16092 -742 39334 42126 19894 23284 37767 -37103 13873 121131 30244 -68115 4519 107230
16080 107230 34740 -62022 -92960 -111406 -107731 -121713 -138243 -130275 -74155 -81298 -93250 -110535
16068 -110535 -102644 -103342 -173855 -64797 -5052 33183 26775 6526 -38826 -113449 -88724 -95778
16056 -95778 -135658 -246044 -157403 -1235 1775 -101331 -35264 30270 61537 60484 -9372
16045 -9372 -27071 -28484 -57911 -53913 43269 45118 56625 80216 84124 63191 -7778 -10931 8516
16032 8516 34487 24842 9880 -56455 -17939 -30911 -52448 -60010 -17408 2358 86000 84124
16020 84124 29138 65546 -21002 -17832 53368 29290 69966 90877 71450 15742 -13158 -31699
16008 -31699 -3434 -17054 -18489 96609 142590 181096 201813 195469 100973 65980 116173 81000
15996 81000 -7230 27903 37769 54051 60368 71945 55613 2398 33562 93491 47158 -76319
15984 -76319 -146841 -157625 -141517 -76317 -43676 -24167 -23279 10425 101491 70615 33950 94922
15972 94922 118873 32797 -34038 16263 85952 80038 30452 -26973 -38078 27682 37930 -6605
15960 -6605 -19362 -22992 -12611 -39028 -4978 100048 109608 -21366 -64867 -72936 -172031 -127828
15948 -127828 75285 113642 124357 82181 54532 81790 23782 -6857 -34476 38883 43217
15937 43217 38803 130976 174881 152224 100122 109283 110446 101769 29521 -50600 -8191 27188
15925 27188 16052 -5521 5523 -4231 -7683 32351 76896 119387 35365 12358 -39852 -31441
15913 -31441 -19804 -1080 13414 -131775 -185857 -172378 -148536 -146259 -30739 9587 51329
15902 51329 60805 31167 22386 15279 1485 23193 -11564 49696 65177 -17872 -66703 -59488
15890 -59488 -27660 19412 21596 10534 -2340 58329 125166 172192 226764 183105 18540 -82943
15878 -82943 -63354 -60642 -78733 -75611 -76401 -58622 4723 13172 -17077 -32605 8722 55745 88589
15865 88589 79039 72767 33882 -13483 -31973 -5742 101774 89972 165915 150742 60530 9615
15853 9615 -15044 73490 93359 76135 101482 78264 17886 -5518 34446 75472 77020 -5273
15841 -5273 -111460 -36772 -49734 -66285 -61848 -133046 -210191 -189369 -131723 -182481 -197730 -144877
15829 -144877 -37095 50730 123971 32786 -52933 -117775 -140101 -96572 357 17424 22613
15818 22613 -24513 -32841 -34916 -95332 -64782 -24160 -64758 -93755 -125283 -99401 -106970 -115222
15806 -115222 -177020 -185710 -149827 -75570 1299 39048 46734 48563 23895 -19835 -9951 12643
15794 12643 -3589 31130 -29341 -53745 -14228 -49111 -153508 -105946 -30462 -30613 -107082 -94523
15782 -94523 -75600 -29703 22961 80370 68021 41247 9202 -34925 -55519 -50289 -131391 -212265
15770 -212265 -144575 -119401 -97528 -93557 -73704 -50823 -32605 5000 31942 86930 100337 73565
15758 73565 96114 88174 25150 -34248 -74217 -115978 -125002 3263 -48986 -68313 10845 68221
15746 68221 39523 -30491 -39705 -15214 48150 120065 167137 158918 84108 23563 -13287 -47595
15734 -47595 -64980 -58164 -13651 19109 72136 90128 55805 3239 -57261 -67753 -97465 -66555
15722 -66555 -35110 12175 13432 45781 11310 -4378 11370 11073 23278 -2504 -64237 -32275
15710 -32275 -73449 -91864 -99276 -65166 -83164 -72455 -101939 -194871 -147885 -101642 -99903 -111822
15698 -111822 -90923 -26201 -52276 -101507 -95586 -68219 -168070 -153656 -25609 75690 -29788
15687 -29788 -7591 39992 5216 -87939 -114347 -76562 -60310 56205 120921 118281 85456 52669
15675 52669 62460 10186 -10907 543 30773 -43435 -90951 -123439 -119013 -49074 -111952 -102437
15663 -102437 -109494 -57599 19772 -5948 -48020 -50676 24343 1512 -105433 -86696 -9386 -1801
15651 -1801 -42723 -43944 -8911 -22187 -77342 -123773 -67145 -38217 -17259 -58244 -41503 -62143
15639 -62143 -112825 -107930 -44024 -60717 -7281 -9525 -55699 -116282 -140661 -99771 -30623 -32641
15627 -32641 -21024 35162 -42586 -35562 39111 58225 2850 -55887 -80420 -48600 -58085 -121842
15615 -121842 -144197 -76464 -43389 -25415 21855 -47350 -72598 -83892 -27441 -13306 -64605
15604 -64605 -23201 32063 25257 -66252 -76809 -36113 -79584 -34060 -22617 -66004 -48074 -42833
15592 -42833 -72921 -44795 19442 24771 29617 43621 12983 -25203 -66800 -114656 -128462 -97596
15580 -97596 -51552 -45002 10064 50465 19353 -27444 -13362 25100 -12433 -13814 46011 54768
15568 54768 98748 100478 49555 -526 -36918 22024 -75883 -58731 -18909 17390 9947 -59694
15556 -59694 -42949 -57 3228 -1930 -64388 -110918 -78813 -62721 -30063 -35031 -97905 -130955
15544 -130955 -148460 -143671 -49291 35562 86149 65046 -2569 20668 91302 116227 50463 -120781
15532 -120781 -124627 -31166 21765 8905 -19804 -32987 -4169 -16169 -48128 -60631 -46650 -23182
15520 -23182 50880 90572 29124 48312 99255 90444 131743 130878 -17501 -100355 -83957 -69436
15508 -69436 -92143 -20228 -37903 -89369 -119488 -54928 -38444 -78885 -120027 -92992 11425
15497 11425 50316 -2686 23935 -8720 -65912 -33700 36933 -28706 -23452 -29103 -39608 1021
15485 1021 74967 138278 70127 -695 -31615 11618 61005 98608 40885 26471 -43534 -110005
15473 -110005 -107783 -39023 34976 109555 150356 129897 71888 1112 -41117 9669 46462 10535
15461 10535 -49319 -25013 -42758 -111592 -158714 -115878 -45238 -25470 -4822 -40440 -114895 -185332
15449 -185332 -134857 -43842 -57431 -84991 -64666 -74226 -97305 -166979 -175911 -105053 -18620 -16083
15437 -16083 -1197 36891 69852 130346 55295 15113 28949 12117 5014 -29524 -50 84823
15425 84823 -2509 -6832 28047 47692 3183 -47407 -2635 86069 101367 119278 75683 43932
15413 43932 47223 51893 10019 -41674 19368 23399 19160 -20788 -57247 -23011 -10986 -46290
15401 -46290 -35723 -62938 -45443 -19697 -53095 -52476 -16542 -2422 -54546 -115299 -121043 -124442
15389 -124442 -175948 -162452 -111311 -82128 -32440 2486 -13964 -16167 72471 83260 63496 -11127
15377 -11127 -31807 19269 121195 99214 33550 3625 -64280 -37736 89499 66407 76209
15366 76209 -12545 -104486 -114215 -3755 26732 9800 53684 39382 -14323 -69795 -110265 -135347
15354 -135347 -82694 -20066 59039 93723 43591 -58991 -114129 -118011 -29162 43238 174988
15343 174988 220586 168968 49732 15326 99733 153532 160233 119110 84125 112463 78870
15332 78870 87796 177823 122836 86336 40444 -27248 -27611 -76941 -18554 77001 71086 93824
15320 93824 112474 74671 80517 199546 181919 123297 89690 64052 14900 56624 91719 94338
15308 94338 25295 6576 -23455 -61419 -37045 -55345 52303 68074 52306 40130 4879
15297 4879 31787 93350 97906 200067 203973 113344 73354 1805 -51132 41719 91011 85168
15285 85168 16467 -26629 -42783 -98593 -141474 -83512 -38705 37354 43143 -37550 -128024 -146984
15273 -146984 -114428 -66497 58439 134107 129976 106691 -8477 -11990 9585 -44948 -149692
15262 -149692 -68284 -39158 -94169 -79587 12466 42932 15588 26728 20873 16938 -18475 -43482
15250 -43482 -91375 -65273 -83298 -46199 -10631 -37765 -105283 -76739 703 18864 -37628 45866
15238 45866 88243 75335 74644 53667 39296 17455 2731 -17904 -58047 -66883 -57191 -109805
15226 -109805 -83242 2913 55446 100660 114387 100522 64344 -33404 -97835 -76471 -38616
15215 -38616 -41741 -42898 -66717 -64273 -33819 22680 25683 112080 143367 142748 86395 75955 82356
15202 82356 81734 33248 11371 -39408 -20276 -46108 -86086 -80405 -21201 43723 49903 37411
15190 37411 48891 119143 83086 4097 -32927 -39319 -43297 -89429 -91679 -44379 28150 54633
15178 54633 66279 19230 11 43051 4131 36101 43572 56881 52552 -3810 985 39021
15166 39021 72794 84307 -9422 -77979 -103386 -77170 -76830 -151526 -125668 48093 138464 56240
15154 56240 -23924 -75018 -82801 -52079 -27580 -49097 -113715 -106626 -69506 -17464 69 6195
15142 6195 -34128 -10949 63588 113613 83052 -36621 86 -2471 23343 -9951 -30072 -26699
15130 -26699 18263 38651 -10368 -52316 -43335 -19096 -44050 16388 7916 25837 4588 30507
15118 30507 52139 36029 2019 36252 84913 72210 50874 6264 -36403 -120948 -184048 -159086
15106 -159086 -75701 -100484 -122046 -68745 -83074 -98690 -100459 -138983 -138680 -145544 -66013 4736
15094 4736 57745 40417 31757 20624 -57134 -100434 -53568 8230 40966 -20515 -50923 2718
15082 2718 -9871 -86489 -42749 24264 29695 10000 51960 56853 52836 39812 75858 86464
15070 86464 55355 42812 132853 179841 157488 76430 23787 22291 -6056 -32075 14380 -11095
15058 -11095 88 -30516 29525 32460 42222 25647 17486 42677 59876 78942 89954 91020
15046 91020 91889 135567 110235 67336 9120 18980 85510 44139 -3468 16827 -1515 2150
15034 2150 2295 21626 32222 -38236 10747 -793 68267 102155 38205 -29517 -55247 -14787
15022 -14787 -45936 -24695 -92036 -165487 -90199 -8879 -23513 -50608 -106768 -40527 -3391 -22325
15010 -22325 65698 183016 10085 -115724 -82839 -37923 -15411 15050 -8656 -17927 73513
14999 73513 99446 102522 46332 20329 -21143 38186 106925 196872 244519 296150 326403 444587
14987 444587 495509 488356 383985 311865 311155 279902 279534 202847 127861 151072 142524 172711
14975 172711 118184 33776 106844 113484 76268 52807 42965 55989 -24034 -35992 10142 -32578
14963 -32578 -103144 -1287 39896 -10617 -68493 -29551 20453 52318 -22131 -89417 -56159
14952 -56159 -38190 -103039 -117639 -19472 33907 -45684 -79740 -23841 -12055 -2132 -38802 21976
14940 21976 7748 -66060 -23886 -46973 -80518 -52579 -46526 -100475 -85068 -49030 -8467 48580
14928 48580 -23973 32248 73243 114020 132625 50303 14104 11672 -71327 -94341 -68462 -105646
14916 -105646 -105136 -46574 111 -69835 -33949 307 16187 5355 8182 68809 73622 34663
14904 34663 3077 -47610 -5656 46682 49905 91589 75490 46323 37721 52080 90301 139747
14892 139747 101686 143913 164858 130154 22941 -104174 -105754 -25975 2524 1361 5222 -4857
14880 -4857 50410 119635 162324 265759 244375 109494 -76114 -161949 -79811 3098 13180
14869 13180 10347 -11412 -86010 -50715 -1148 3147 -56841 -79223 -48169 20044 5416 -46123
14857 -46123 -53725 -43566 -85343 -37935 8429 -57009 -90381 -46371 25711 87708 133886 192613
14845 192613 171876 59490 35885 1507 543 67508 164578 223313 134926 108455 -232
14834 -232 -13214 59696 32668 -61067 -75606 -94982 -128463 -67391 -25312 54189 27226 44680
14822 44680 16281 -66597 5382 -9158 23037 126370 113984 50530 -34234 -15745 43902
14811 43902 30633 -22834 -29434 28638 54453 -32993 -75889 -4145 -25164 5117 101016 71787
14799 71787 31176 -37294 -9634 20863 45896 51742 4254 -4999 55212 43843 -3363 -8184
14787 -8184 53929 -30483 -167019 -64612 37404 -23421 -28378 5923 26147 13351 -43771
14776 -43771 -134719 -107342 14314 -19648 -22951 -82978 -50743 -53983 -93830 -51324 -17155 14197
14764 14197 -27489 -79986 -112418 -48437 -20077 90425 137852 169845 127912 152825 213960
14753 213960 197521 159342 51865 25357 74318 63737 -9314 15681 58180 116387 102555
14742 102555 44394 -12548 12716 -27056 -108331 -177530 -128815 -51885 -60290 9945 73672 44078
14730 44078 -22086 -66117 -99419 -33771 -26770 51052 50263 29568 -22062 -1546 27378 -26799
14718 -26799 -43417 -63390 -9179 -12517 -58811 -3231 21438 32235 12314 -22350 -72381 -13811
14706 -13811 30536 -24382 -45373 -68254 -21905 -6911 -7181 47235 79180 37576 -66427 -69474
14694 -69474 -51633 -53888 5366 49135 61959 47667 92537 102282 130461 122117 95230 43845
14682 43845 -24411 -46067 -102079 -134262 -88506 -101536 -100497 -56486 -76468 -115994 -132455 -204984
14670 -204984 -188062 -81978 -32089 -105504 -168078 -156071 -118213 -100599 -28733 -133720 -128233
14659 -128233 -144053 -164240 -92496 -51462 -81756 -82937 26594 40365 73138 70685 126895 156670
14647 156670 73831 76126 22977 25022 47914 130302 239434 365346 405549 386522 323512
14636 323512 243528 216769 159534 193605 176416 -16568 -95759 -17734 45650 -22989 1988
14625 1988 9415 2485 -42272 -8886 8441 27996 21138 17418 53113 61107 71672 11937 -10303
14612 -10303 53399 95769 145120 158395 152985 222152 94183 87608 73674 141293 71266 -8733
14600 -8733 -43406 3012 32136 -26771 -31583 -14641 15786 51009 101086 66234 98147 27614
14588 27614 -73952 923 118573 53533 -42760 -134911 -81930 -12814 58882 89600 40759
14577 40759 -27834 23842 16139 8950 -53274 -57123 -9678 46778 77029 115048 147376 77942
14565 77942 -14868 24018 100512 25084 -28718 16388 30747 59455 84409 50715 47052 25314
14553 25314 -41881 -17706 2121 -69294 -64789 5019 63228 3254 -15028 -30408 -5478 76749
14541 76749 120336 22323 19546 29393 -65170 -78553 -49786 -40861 -40885 -5290 33574 16097 19716
14528 19716 -4925 71127 182727 174316 122572 48143 54989 22117 -34293 -15362 70662 80853
14516 80853 96266 37935 -22585 -12915 18922 8675 -30044 -3403 -4112 -41271 -40656 -17892 -111471
14503 -111471 -96116 -54640 -81157 -143547 -151610 -101433 -20879 -16256 -62642 -50577 51022 67394
14491 67394 67490 56693 57210 25296 -3126 49857 -270 -56902 -62704 -45513 52934 111456 178976
14478 178976 141734 23454 -53783 -57570 -152483 -73945 22138 23402 -75799 -136252 -162605 -188775
14466 -188775 -86225 39458 101429 77753 44137 61415 -21543 -108770 -66440 -70183 -62358
14455 -62358 -33661 -5419 49999 112637 68848 -24703 -32778 19862 12326 -20042 -33767 -21602
14443 -21602 -43200 -132097 -115562 -72967 -45813 -72430 -79312 10994 -7883 -92695 -177017 -134463
14431 -134463 -94995 -60215 -22237 36807 24426 46059 50685 26272 84778 123208 44082 4673
14419 4673 -44423 11305 83702 129532 97697 -16576 -61994 -16228 27564 22526 71601 91146
14407 91146 51652 8878 6841 6463 66661 81895 97304 75508 -46459 -62975 -121630 -118471
14395 -118471 -91652 -90011 -20827 -42186 -17999 32240 41487 87890 105588 98675 141423 119538
14383 119538 37455 -33388 -54319 -44909 -46742 1049 95615 87953 39976 51897 -53912 -72476
14371 -72476 51366 174292 195812 125378 82894 19136 -849 47749 78341 63590 60851
14360 60851 74221 70296 77766 54663 42615 48471 12249 9884 30253 -53880 -6156 82249
14348 82249 130915 125605 -6004 -34324 -4103 17432 -19175 -75860 -96078 -125321 -121447 -69093
14336 -69093 54914 128171 133913 54007 11604 -15661 53086 -33715 -86013 -63026 -49933 -84716
14324 -84716 -87033 -78736 -99192 -81103 -98315 -48367 -58313 -34606 -68608 -123537 -106009 -69017
14312 -69017 -10960 57903 22922 8712 -70384 -57292 -75686 -72199 -33738 -17663 -3909 32641
14300 32641 17407 -1838 60917 38544 -26140 10937 -17564 -11974 -46759 -50609 -73613 -150011
14288 -150011 -88218 -21318 -9856 38281 1958 -4264 28011 68492 24768 3688 -11821 12186
14276 12186 -20649 -15255 4235 -289 29773 52696 33725 -27575 -59650 -92097 -67328 -43576
14264 -43576 18230 -17155 -97775 -110706 -43195 22422 71895 148389 155308 86218 2426 -61461
14252 -61461 -5018 41789 312 -25489 -25027 -24002 -78850 -11885 10894 30739 24288 61816
14240 61816 61266 7216 -44758 26969 38021 20209 61234 48953 4205 -19184 21994 47430
14228 47430 13529 -62593 -121100 -53435 -30315 -118708 -140258 -96926 42950 153888 152014
14217 152014 90539 77047 75268 121176 104514 112263 182375 144106 92735 137785 71163 32789
14205 32789 39076 75273 1303 -58880 48792 137337 83959 44610 13907 17619 -71416 -91367
14193 -91367 -65509 -28047 -253 65674 109673 58113 19643 81117 139373 83500 21324 7587
14181 7587 -28197 -67098 -43491 -25968 -31063 36876 -45603 -52884 -13230 -38730 9536 42002
14169 42002 124726 37382 46932 103209 124442 100805 52311 4668 3717 27706 -41661 -44273
14157 -44273 52696 120004 77117 70493 57788 -19922 79860 78280 47158 77631 80366 146509
14145 146509 133984 107590 51107 -41256 4995 -41865 -59637 9593 20873 -87348 -116744
14134 -116744 -197294 -236835 -135622 13623 10894 23704 18666 2984 -32802 -70280 -55756
14123 -55756 -18332 21550 -27085 -82172 -72085 -42084 9209 67658 77033 -13057 -46607 3971
14111 3971 70615 66379 5172 -62657 -56708 -40611 294 1380 16400 35738 -29295 -56275
14099 -56275 -34012 -24021 622 22936 36527 96972 89415 55586 26808 21205 -3591 37552
14087 37552 34101 -13726 -25931 14524 68905 42328 42471 49625 45497 12414 21497 -58686 -54273
14074 -54273 26559 82091 101520 74675 -1573 -16522 -56319 -39971 -36838 -66387 -75730 -79374
14062 -79374 -35293 37453 52681 86499 79073 70627 12891 -22286 9661 14979 -35776 -34466
14050 -34466 29066 17526 14798 -4807 -3272 25637 -73418 -72218 24381 32602 -5260 16612
14038 16612 19763 -10166 -38279 -97750 -103934 -37424 17209 -24472 -68244 -81741 -91281 -79468
14026 -79468 6797 60491 67752 61099 95143 109553 149067 64239 -33743 -84903 -135326 -125765
14014 -125765 -90540 -70588 -100129 -86789 -37153 6096 80902 23564 -45020 -112273 -62283
14003 -62283 1334 -20853 -61367 -3085 123321 173380 161364 150068 90612 66265 -38518
13992 -38518 -29385 17318 59494 24766 -26011 47540 30783 -20849 -18908 108012 159983 167937
13980 167937 91580 64067 89288 63026 53504 -60296 -92499 -148512 -111745 -25957 26876
13969 26876 84991 60520 -15159 22437 44009 -25996 -64250 -31672 29499 29794 1404 -3898
13957 -3898 -32659 -82710 -101723 -42974 -28629 -105846 -142517 -30776 57476 90406 94138 91040
13945 91040 87575 69796 27416 41454 34288 -35292 -73656 -60647 -68208 -48763 20534 54194
13933 54194 33235 22649 -52038 -165768 -75071 -13065 6918 51979 69830 54484 63288 74804
13921 74804 111489 74622 33576 9085 31161 69911 99476 9761 48894 131606 167056 226997
13909 226997 188821 39859 -7450 1397 45868 31264 -2546 -33872 -88556 -29897 -26521 5371
13897 5371 843 -5604 58659 98185 83119 20887 52790 34711 29662 -3674 616 42878 60914
13884 60914 -9845 -65006 -102228 -66205 -36746 -42483 14631 101404 5152 -81198 -44579 -39721
13872 -39721 -52808 -25286 -5554 5404 50527 -19276 -61799 -6111 -20434 4279 45186 23826
13860 23826 -30932 -105453 -62097 14411 37798 72446 106310 51953 14389 -50159 -59936 16370
13848 16370 23817 -17829 -48308 -77107 -114260 -85629 -19418 49308 31283 27368 -1952 -50801
13836 -50801 -27115 25614 -15900 28159 88944 -22544 -2960 84965 105175 25523 -29604
13825 -29604 -62009 -16450 56937 55929 -40082 -11108 70481 -41624 -45153 -32005 -22126 -67693
13813 -67693 -69857 -106210 -167173 -196883 -101708 3694 30143 -10395 -21590 -32528 -13433 9312
13801 9312 827 32684 16861 -43626 -73686 -72908 -8536 11193 -28243 -9798 -31900 -34753 -29048
13788 -29048 19441 38330 -76419 -111841 -44837 8851 -12268 -77602 -94386 -87669 -142435 -226667
13776 -226667 -268230 -218313 -171986 -162026 -113848 -38111 -2378 -23300 -57681 -86711 -55623 53080
13764 53080 51887 -23611 16465 20702 43318 66594 115304 73237 15748 -56084 -81652 -10775
13752 -10775 98868 135110 91661 8518 -125198 -100251 -3122 36460 24244 -65905 -39201
13741 -39201 -5225 8622 17590 76776 93100 121774 139294 106266 159079 95414 130983 136646
13729 136646 72589 -4650 -3533 -94981 -56962 49759 59953 -26184 -59295 -132434 -63742
13718 -63742 43430 86318 28682 -18977 26335 14007 -59064 -111755 -84287 -57897 16857
13707 16857 46174 65724 51518 115139 64836 13001 -98971 -104750 -57210 39677 58000 30528
13695 30528 4420 -28497 -70961 -25171 -2421 52970 17047 -82206 -110528 -77136 -50643 8933
13683 8933 81098 64203 42416 60820 83007 -21317 -72693 -134722 -141288 -120516 -111024 -91040
13671 -91040 -126895 -25330 17471 -16551 31206 90617 -47299 -97265 -99989 -45427 -44967 -56204
13659 -56204 -118273 -154667 -135969 -88507 -143476 -120976 -36328 -22301 20012 9814 -36240 -17536
13647 -17536 38142 68396 -523 -39589 -38340 -47779 -30953 -39475 -78047 -171569 -176569 -200706
13635 -200706 -150004 -87099 -111574 -46156 18185 -15680 -88716 -165447 -210829 -216427 -191412 -210798
13623 -210798 -189414 -109828 -74686 -78070 21359 69494 35547 63465 79069 80321 72340 59009
13611 59009 79062 -22770 -34649 -107440 -168079 -128126 -42811 -32796 -48270 -24453 96610
13600 96610 124347 114446 50095 17478 17370 50506 102294 117061 91159 -63750 -73236 18260
13588 18260 31616 20486 38684 12457 -54426 34916 69756 132 -75868 -145690 -124617 -70508
13576 -70508 19411 -10132 -80302 -55803 -47196 -32671 14869 -5340 -45322 31403 80373 87062
13564 87062 -3291 -34548 -63023 -590 97813 137825 99891 100143 56565 44524 80595 87946
13552 87946 35974 31499 46913 26805 9230 -33650 -74543 13137 82734 79714 35823 81486
13540 81486 68058 26782 24067 4594 -632 50394 -27326 -118082 -99578 -77277 22672 71335
13528 71335 40811 20168 -6619 5176 3378 -44150 -4046 -17089 18502 74208 -4671 16379
13516 16379 38218 84144 49154 -104139 -104025 -59855 -2695 161546 241076 96344 88465 40566
13504 40566 -17496 -75643 -30252 58350 45474 32234 775 5097 15966 -4343 -12084 14449
13492 14449 1846 -86056 -22606 53106 61826 107080 114714 183168 179466 76501 19168 15690
13480 15690 29954 -25743 -55974 -64632 -60140 -34031 -44357 -91857 -101719 -182111 -194312 -95746
13468 -95746 -48855 29338 45248 10598 7564 73470 121341 136999 171034 152860 43238 -26218
13456 -26218 20333 -1227 80770 176294 142534 54112 20081 8327 64595 62665 42788 101187
13444 101187 126950 -7008 -37719 40747 44226 22414 -20863 -37156 -19019 -21859 -75610 -98191
13432 -98191 -36490 37157 107835 115079 95956 31583 -10274 31684 118373 142070 135112 189575
13420 189575 215716 237233 243136 177022 87502 157540 237375 207313 128746 101607 -7515
13409 -7515 -50309 -38410 5 22493 62330 116212 158533 101264 46101 -50048 -115374 -127731
13397 -127731 -114862 -98462 7647 23807 8184 18970 51101 37907 -14024 25255 34175
13386 34175 -23429 -81215 -88371 -31777 -37508 -10912 9258 -7321 -58445 -36050 22229 72470
13374 72470 84575 97754 87683 38762 -25488 66530 98679 204041 186830 106789 53435
13363 53435 68979 71322 -10657 -4692 -41538 -36287 -17862 -44998 38095 120490 107330 121246
13351 121246 119907 55620 85382 95432 120407 116064 53686 -17958 -43190 -81938 -6637 -7332
13339 -7332 10970 60539 168393 117080 42179 -44945 -25925 -16066 -43691 -21224 -88601 -36001
13327 -36001 -49087 2943 37453 -128 -12111 -27716 -33813 44811 71413 54337 15146 49578
13315 49578 62166 66640 102420 183804 238673 343421 270834 266813 233781 225494 49067 -59267
13303 -59267 -86448 -27521 57788 45643 10171 75278 75651 41688 19698 11860 8698 -44243
13291 -44243 3152 10921 16061 48568 39453 112586 87529 65731 47595 -3383 -8341 37358
13279 37358 -52682 -120530 -61179 -19338 -27618 18372 -43105 -131187 -152280 -42922 -10214 -17645
13267 -17645 -38249 -84371 -41357 -37717 -28265 283 -23607 13074 77938 122808 170961 161690
13255 161690 47696 -44290 -69899 -50064 22511 24402 67932 56811 -23123 -79951 -39176
13244 -39176 -78631 -155750 -191213 -174306 -131661 -79501 -24986 38278 44049 9533 40713 28361
13232 28361 30075 76482 86884 -30522 -20361 -9581 -50840 -63966 -32181 -29918 11045 26039
13220 26039 -11478 -30904 -84027 -95369 -133115 -67761 -48173 -85186 -121402 -106807 -54909 6762
13208 6762 -28364 -43157 -7179 69913 79984 142277 116795 14002 34409 111364 133030 110151
13196 110151 -2222 -48751 56742 144954 78454 27375 77301 147630 137745 120007 115087
13185 115087 119580 39966 13424 -30754 -119747 -147193 -9251 97281 141923 93700 7141
13174 7141 16281 40316 40793 -35486 -15043 131979 173705 136335 37246 89911 124093 148802
13162 148802 194091 224269 234130 127568 125915 138562 75116 19156 62067 39881 109184 188533
13150 188533 124648 88536 175394 162964 77788 42028 39958 50654 118148 152324 125942 123837
13138 123837 54185 -17175 16473 17721 2665 23657 39580 44547 36559 -284 -57626 -42074
13126 -42074 43147 120250 84341 33461 68025 133396 70191 33208 29964 16684 49276 89798
13114 89798 52912 45772 80565 104378 113093 58185 -21181 -57074 2569 70109 67306 16732
13102 16732 110484 156997 93732 52919 39400 -3223 -32424 -19030 9857 99117 158646 130772
13090 130772 165320 174990 138500 115118 72006 12687 49925 51148 62593 95430 83043 133130
13078 133130 154225 83101 22918 48724 124874 167629 119641 61404 9769 59347 95858
13067 95858 63761 40208 21205 93424 79687 -25839 -54358 -34050 88344 110150 176279
13056 176279 97062 51737 23508 26143 6160 35652 49713 48394 45272 144468 153486 92187
13044 92187 36606 71313 74268 75132 78756 54563 -17863 10560 104201 127556 78463 19966
13032 19966 31695 67597 156597 176920 61824 80755 75255 20326 51201 19238 -27906 -26103
13020 -26103 -42441 -85944 -116492 -7528 85413 125500 131391 111106 98676 148971 167309 196399
13008 196399 122658 98818 68078 182463 174760 135365 85271 46156 -50018 -31745 -31737 -24283
12996 -24283 42371 71964 81501 93174 114318 181664 215052 261978 243423 218266 282008 406310
12984 406310 554570 559308 521088 461981 391845 403314 401263 412826 432116 349778 283265 289700
12972 289700 228202 227802 195520 235814 217460 181348 105170 37187 19607 68828 51399 16973
12960 16973 -10017 -3275 156494 169620 118436 115757 96513 106833 143589 212491 178075 97450
12948 97450 58000 21583 146128 171611 170454 164240 153921 173229 209947 183605 157382 147158
12936 147158 73010 9327 71678 121863 177832 228662 206843 122984 166320 198963 196147 153671
12924 153671 146948 150146 238424 268462 317874 267001 234281 207239 195931 326531 305679 259780
12912 259780 272795 216753 136805 184677 244231 222401 272830 282705 203454 166852 169122 149118
12900 149118 239048 296475 201620 174125 223250 192409 222251 332293 360610 349008 438604
12889 438604 549461 525305 451341 410938 389738 426977 432973 435379 455783 546958 597542 667710
12877 667710 734079 868995 1001273 1111769 1058170 908503 770089 804500 861348 931631
12867 931631 1013951 1052543 1124288 1204663 1295601 1404354 1570855 1891692 2189400 2370439
12857 2370439 2547586 2887330 3361076 4048144 4984158 6512142 9137989 13503927 20485624
12848 20485624 29924799 39073811 43734839 39335579 28758673 19158689 12830781 8886420
12840 8886420 6309789 4577321 3475995 2747227 2244837 1867249 1589502 1384608 1283776
12831 1283776 1104004 984268 942810 915022 852852 756563 751232 673143 621061 521711 438626
12820 438626 457032 402503 237684 210509 219063 262946 279935 190904 171564 189669 252186
12809 252186 212647 141100 178648 210549 243469 218600 229069 211174 159588 198677 212176
12798 212176 173008 180286 187022 150533 200971 265566 341617 391521 461455 473529 456622 545222
12786 545222 518196 509679 490590 430116 269691 139614 187325 171958 191010 178175 88703
12775 88703 36333 70806 50437 82819 -6335 -79338 -45196 22388 68673 -62 -96487 -137324
12763 -137324 -51429 -76585 -170798 -180482 -100849 -10147 44373 19643 6263 14221 18923 73399
12751 73399 42185 38408 36067 -54837 -55296 -29495 -23071 13297 9997 -111747 -131915 -72513 -118165
12738 -118165 -110748 -62538 -36224 -22115 78856 126916 103787 29740 49547 96594 150853
12727 150853 200996 195669 208447 185711 3762 -47127 -72999 -2114 27284 47752 100608
12716 100608 87398 77396 122915 161351 168459 153534 79144 21312 25721 60658 34911 48574
12704 48574 131380 85442 23043 2176 36128 96728 117588 101425 129100 152437 186731 264712
12692 264712 253509 234728 223019 253303 316420 230187 146769 83048 54908 58222 30536 -19588
12680 -19588 25413 66169 102862 148100 118459 68359 104887 106288 122825 140763 104136 51539
12668 51539 52704 100494 97937 48058 63252 109120 113734 117278 18980 -52377 -37318 -17309
12656 -17309 -69752 -205050 -169955 -134287 -115118 -85693 -76333 -61109 -29349 -45340 -11628 13174
12644 13174 48307 79535 28314 -7503 -23403 47407 114768 84322 56303 141909 244442
12633 244442 204275 181231 278376 289593 318730 308690 220491 80501 41823 24644 116718
12622 116718 135091 59287 70271 179724 197207 268826 332376 348789 385513 393494 425297
12611 425297 529749 626601 734211 844399 871656 835009 852653 852482 837333 846550 903799
12600 903799 885519 827716 632251 518648 476027 419919 424914 392500 285427 250140 305047
12589 305047 316894 464474 660970 980944 1292916 1593993 1605531 1295678 858049 543238
12579 543238 378574 324107 254352 166546 106247 84075 62838 84697 121656 127742 63772
12568 63772 97089 132932 59986 102474 149607 155139 147573 128213 107252 46991 -17419 83218
12556 83218 216786 208345 194023 192340 173646 129402 24467 -32881 132707 247154 246459 231105
12544 231105 241642 238981 221658 204125 187954 134354 92709 96201 87282 20297 -51050 -39689
12532 -39689 2627 -3650 19808 72768 186118 195429 135802 120187 100907 131205 141109 108347
12520 108347 102546 131653 156600 148067 206643 181423 185559 250174 239580 204596 164101 176405
12508 176405 172701 117349 99083 125489 104570 146239 133097 29422 -55262 -51241 -56057 -25353
12496 -25353 67689 181515 159258 67671 32563 144628 161565 123416 34324 -38835 -51535
12485 -51535 -41742 -5009 119017 78522 -23140 -40965 -56231 -53021 -60465 -23674 -10819 4035
12473 4035 -3383 -68487 -209997 -168626 -27197 -16019 70384 138408 137544 66223 44789 88531
12461 88531 47457 119298 141936 140163 130962 101428 135582 194869 237560 284537 263316 257277
12449 257277 301346 338422 405281 392818 373347 280584 305644 242611 204359 168495 105440
12438 105440 76474 5973 -53484 -81491 -112057 -64073 -36437 -15085 33417 190455 307370
12427 307370 331447 458991 509258 362177 247254 138733 105362 67924 32907 54019 107616
12416 107616 226471 164872 134971 138407 96825 45553 72042 97636 28711 -64700 78820
12405 78820 104481 45923 1039 -44999 -103801 -23574 -56537 -106666 -117690 -68477 7909 107343
12393 107343 106774 34843 -7581 -55361 1906 41207 59794 21575 23268 60747 137667 198123
12381 198123 206359 256844 254630 200165 191708 328704 543301 682159 654567 607646 530185
12370 530185 341618 214609 233100 294367 175602 107225 39108 93248 284149 468195
12360 468195 685708 860040 938877 898460 843187 699710 583312 476107 458329 461211 298240
12349 298240 183371 188321 223704 252392 253608 278680 255260 191363 145387 96994 31619 83316
12337 83316 162213 118513 112425 109298 81133 60983 32103 76450 85148 55762 54212 66322
12325 66322 71892 147664 194739 81244 43134 65239 1496 81047 243516 298894 267175
12314 267175 230904 336150 414704 528412 702661 925870 1023848 993437 836505 640528
12304 640528 448054 325773 157645 104267 162682 146958 45377 44523 117518 180495 235509
12293 235509 196507 62347 22407 20279 -33969 -57154 -55057 -21123 -420 35968 36920 6732
12281 6732 63888 155305 276207 310439 191015 149532 179972 281269 377086 435440 385320
12270 385320 361318 309161 307555 258490 234265 168011 163573 250010 288594 230854 202094 113626
12258 113626 31950 80050 65531 63131 94411 122697 159184 128301 116608 64511 -16926 -103001
12246 -103001 -74235 -35058 77063 84350 71800 75201 82840 79993 39703 32437 -14958 -19447
12234 -19447 -9124 -63417 -86070 -51512 -14830 21866 67405 27749 -53664 -78367 -1591 22127
12222 22127 2572 -30053 -69736 -75106 -105208 -99006 -78060 -110203 -59848 41730 125012 123554
12210 123554 106759 156980 22792 -43201 16707 111850 58477 17529 54028 38886 53485
12199 53485 -4652 -101672 -20619 67459 67991 61067 77283 27085 -15073 12004 66899 111317
12187 111317 67348 30337 -32854 -78606 -63618 -89790 -55988 13156 82620 120888 99262
12176 99262 66589 117544 102816 31905 65749 25889 71628 -39779 -164257 -126004 -56477
12165 -56477 6450 50293 128894 53343 -22926 -24143 -25450 19035 177894 245058 260253 276157
12153 276157 164162 51325 63207 97505 87065 103141 125647 148322 190621 209386 105980
12142 105980 67075 53589 33393 48915 86170 110985 98225 5203 39429 43214 41857 -328
12130 -328 46953 29455 96636 105544 198084 220710 230109 199361 218747 220637 270152 282633 194890
12117 194890 114725 53257 89556 77176 22172 50070 116785 110934 120919 69656 60020 48124
12105 48124 38291 17567 6345 4076 63101 110319 74701 79683 57694 -46832 -131356 -160881
12093 -160881 -77863 -90479 -89825 -75799 -14324 17871 20830 -1491 -25462 -41886 76957 101147
12081 101147 46939 1456 -17263 36386 59289 45982 83507 82540 108433 123521 187746 238270
12069 238270 203996 228436 188071 41368 -55610 -34279 -6701 56896 28371 90100 62769
12058 62769 25064 -15886 -27584 43230 43257 64130 189829 240298 192533 145654 87459 71743
12046 71743 110478 52789 92507 98645 87264 7536 46055 103982 63341 -28278 -148475 -126833
12034 -126833 -157050 -49900 39831 37014 -28553 -4135 71191 9141 -32891 2968 2432 -27955
12022 -27955 14671 47560 5994 -69723 -31921 5977 12647 144265 148609 146807 38850 2027
12010 2027 25434 23867 22659 -1516 4059 -42757 -126306 -40987 103150 119673 112926 112735 89105
11997 89105 94186 76961 39771 9827 -17343 26516 52430 118470 52376 48005 63833 112382
11985 112382 41842 -31731 17856 78418 115288 42424 -1326 -28797 -37010 24631 94286 107246
11973 107246 109839 90718 135229 99014 92385 64975 70301 39046 -8625 -3569 26501 -27160
11961 -27160 56857 117992 101011 57636 118439 65037 62540 39202 24000 -32149 50978 55186
11949 55186 11508 21993 3807 -72222 -97694 -44627 -5043 -48252 -57772 -62915 14493 -2765
11937 -2765 10065 84216 7990 -16230 -19521 34054 87828 49383 59810 40329 48222 109594
11925 109594 206743 159252 46769 57709 74075 96977 81972 87975 80646 55189 81229 54884
11913 54884 60819 14009 8753 -11341 9043 15629 42679 62109 556 -32255 -7968 -39913
11901 -39913 -85589 -81094 -112452 -91668 -96416 -110015 -85008 -88429 -171860 -148818 -54418 12344
11889 12344 30077 40015 50736 11569 -47670 8918 36422 122658 126240 136311 182454 176807
11877 176807 138028 93976 49645 38751 -21104 -60766 -81646 -165965 -158409 -59029 15776 -9213
11865 -9213 -75140 -80400 -126984 -104657 -43204 -50341 -264 104917 177890 167779 100022 34127
11853 34127 -14233 91914 95126 71084 34639 -19606 -35905 -27099 -38692 -79460 -30519 -53814
11841 -53814 -123484 -114757 -99058 -114947 -118093 -74827 35742 79364 56707 -123 -67127 -125391
11829 -125391 -111722 -129773 -160911 -110496 -129621 -186491 -120663 -80900 -49672 -83264 -162080
11818 -162080 -145891 -140406 -156691 -150134 -148711 -95712 8881 100015 32327 -58609 -47358 26121
11806 26121 -54645 -146138 -146256 -113262 -14458 20442 -46153 -25877 -1276 34560 23439 36204
11794 36204 6632 -40431 18442 55506 57476 130515 161579 118411 52343 61768 98845 120160
11782 120160 76340 -2626 21048 -1175 -54878 -127048 -71550 92639 106249 28925 2587
11771 2587 -79874 -180768 -140055 -97297 -32254 22026 -48029 -94158 -97151 -2388 -1587 -31267
11759 -31267 -11957 -5153 67472 70630 -8357 6417 5733 -96288 -149181 -93770 -11970 -68575
11747 -68575 -55841 -31185 -66639 -53297 -16126 -4478 44066 16666 57596 108316 182392 145575
11735 145575 58138 14017 41911 65271 -8245 -56349 -10301 -77309 -126459 -33888 49665
11724 49665 15321 -115408 -165172 -108647 -7203 56770 56709 73704 31410 -1495 -33101 49819
11712 49819 -20636 56074 116111 41760 12206 31452 38072 -9859 -49188 -17639 48426 18441
11700 18441 6358 -22223 -28877 -56804 39368 85330 129503 80194 -49543 -38678 -35307 -82743
11688 -82743 -112086 -44556 -62938 -28799 120581 84234 71622 80029 91341 79130 34639 10606
11676 10606 29688 52395 28971 7410 -47997 -88177 -79162 24495 -44871 -162014 -145982
11665 -145982 -101364 -21836 102662 58019 3391 13121 -6868 -11257 -33559 -11498 -23042 -96508
11653 -96508 -54984 -24395 -32384 -55784 -29889 -47834 -29451 -2404 26521 98253 95111 67846
11641 67846 96475 68400 82370 97542 88690 100657 62777 -19357 -53348 -15702 3263 -78680
11629 -78680 -100001 96124 146404 6480 -69524 33032 117224 111015 113787 103409 54778
11618 54778 3024 -61409 -41179 -20618 -51493 -124290 -207475 -234412 -220730 -116467 -59726
11607 -59726 12632 26491 24187 93966 111359 108060 24149 -22187 -10095 3943 -55859 -63823
11595 -63823 30050 78300 18623 -15077 -35910 37193 -42167 -80150 -114650 -17517 5986 23694
11583 23694 -14878 10844 13396 30594 72497 68762 43984 -69096 -181611 -95804 37640
11572 37640 99452 17369 -68688 -127031 -173479 -228986 -233480 -56045 -61687 -125803 -174815 -226130
11560 -226130 -208794 -53837 4556 -15503 -38709 36328 24894 -83454 -181485 -186879 -136009
11549 -136009 -91996 -75771 -126380 -136638 -121206 -152200 -90224 -22385 14520 39239 121391
11538 121391 138983 66748 57344 -31359 -85602 -59780 -33731 -41974 19994 -31902 -121835 -64176
11526 -64176 14907 18379 -4422 -35244 -21537 3461 11520 92646 80615 7855 -98668 -73258
11514 -73258 -100133 -38807 -1489 -60493 -68077 -106211 -78738 -78863 -21521 -37847 -36095 -75065
11502 -75065 -121162 -128304 -88806 -93829 -60633 -55937 -87265 5170 -57914 -58778 -29968 -104509 -142783
11489 -142783 -138598 11766 103919 91267 113994 129873 56755 7646 -63144 -69376 -40844 -17838
11477 -17838 -17586 -22072 -16451 -23758 5530 -29384 -100551 -161684 -141888 -70823 -34185 -1511 89413
11464 89413 119114 79213 81185 121259 100901 57358 -1145 -55493 -29006 -21883 -28509 -121220
11452 -121220 -162095 -217233 -186198 -153533 -92607 -125128 -103156 -65052 -56446 -26615 64228 93018
11440 93018 37234 31118 46275 100870 65188 5051 -53046 -8455 15773 -16258 19593 -43458
11428 -43458 -22656 2803 -25576 -55301 -49344 11142 -29785 -79964 -106759 -75361 5580 15027
11416 15027 -28084 70010 30537 33362 34138 -53174 -132615 -127929 -89253 -35981 15945 93633
11404 93633 135627 108084 48467 -45927 3028 -48981 -112096 -93041 -64809 -70220 -69690 -39436
11392 -39436 -37813 -12240 -23079 -51579 34853 -26231 -102087 -83970 -85210 -63380 -59314 -62060
11380 -62060 -67939 -72166 -24255 13383 77142 8483 -9558 28103 9064 7201 -3575 10094
11368 10094 32259 96965 132019 106551 22042 41069 65191 60220 139190 67887 17117 33801
11356 33801 71484 -1255 -83805 -98196 -78874 -36422 -44518 -59642 -65415 -132744 -83493 -102733
11344 -102733 -78832 26010 2949 -69133 -44807 31413 9795 36134 104 59729 180460
11333 180460 196528 55362 -48694 -117359 -111790 -50409 -30394 -23806 -99720 -135962 -247029
11322 -247029 -323533 -279605 -137171 -132963 -137585 -190651 -187138 -165555 -104906 -113097 -101288 -26331
11310 -26331 75225 70094 21156 -53946 -62803 -21658 3107 2898 -10633 -3851 -86136 -108573
11298 -108573 -88065 -31907 35040 69893 11789 -80563 -138285 -94853 -28104 -52824 -23520
11287 -23520 -52491 -93011 -32333 -14382 -17266 -24180 -24411 -4658 -54610 -49921 -58211 -62246 -95327
11274 -95327 -97752 -63244 -49340 -46085 -70043 -134531 -39487 -5082 -52392 -89424 -193674 -136723
11262 -136723 -39927 -17987 -32777 -72832 -132970 -131845 -157243 -200368 -183868 -157833 -115899 -121886
11250 -121886 -62434 -28784 -32673 -51937 -33946 -50893 -49840 -2328 44499 -30596 -65230 -29143
11238 -29143 -28822 -75898 -71740 -129829 -62909 39414 10534 11834 -66471 -19719 91465 90432
11226 90432 15851 -4464 89560 117556 -20892 -22904 -20136 -46851 -77540 -43320 -77751 -112350
11214 -112350 -43703 -11331 -103564 -68329 -31232 18995 72393 27271 62801 14306 -43742
11203 -43742 12007 55933 74759 -72642 -104766 -112391 -150029 -101394 61829 86208 -12021
11192 -12021 5069 112901 46952 -36256 -68258 -73009 -27130 6535 26361 25885 78735 67336
11180 67336 71898 17416 -52955 -48003 16193 34742 -33584 -77300 -66886 -4443 -25025 -133721
11168 -133721 -161265 -159084 -72460 52499 8025 43119 116380 77492 -5167 -84845 -85954 -100295
11156 -100295 -90662 -80781 -69687 -68012 -80350 -101456 -109849 -95030 -109020 -104571 -55264 -77441
11144 -77441 -52237 22598 44057 88155 77063 94374 85319 69619 43890 13496 3489 44642
11132 44642 125520 132834 138475 34592 -10794 1807 -49185 -54585 -54393 35199 24188 -28712
11120 -28712 -69666 -78330 9770 46468 35693 28214 -59294 -136715 -158444 -74599 -51112 -21887
11108 -21887 -38262 -14042 -40283 -32376 23556 40255 107580 86763 14184 17093 -73699 28842
11096 28842 90888 60883 34442 -99063 -115711 -39571 31646 -33157 -58719 -121416 -62632
11085 -62632 60473 32814 -36215 -59404 -89814 -61526 -35352 -60025 -49724 -45638 -108380 -139133
11073 -139133 -152047 -120483 -50848 -31284 3511 33675 69691 107312 27210 -76922 -60862
11062 -60862 -97586 -148024 -128941 -149919 -122598 -47572 -84355 -114456 -110754 -136146 -162181 -139998
11050 -139998 -148538 -106356 -10617 -55872 -17831 27707 -7898 -46537 -9215 35084 -68630
11039 -68630 -136914 -52529 -39955 -44884 -29150 27275 24794 -50172 -54789 -76316 -158485 -149370
11027 -149370 -65947 24662 38571 -16834 -32143 68486 117317 25169 3912 64069 56623
11016 56623 21412 -44898 -40163 34186 -3195 -3520 6573 -29315 -68840 -69607 -117538 -106793 -74962
11003 -74962 -77468 -86096 -103193 -159406 -187650 -153287 -77416 -116040 -151196 -190519 -165791 -95016
10991 -95016 -1928 -22062 -9011 26076 62334 -4686 -35272 -30780 -67499 -24927 -4776 -75208
10979 -75208 -114023 -51778 -45144 -67576 -59821 -43490 -38955 -77149 -121787 -67854 31813 30294
10967 30294 -33586 15071 26085 26612 80052 37097 63061 97690 47688 28886 -52148 -30130
10955 -30130 -29215 42121 58994 113997 168453 86013 -20571 -83142 -91495 -30883 -8242 13888
10943 13888 15644 83133 123728 101926 112550 128268 130564 116736 105607 82765 75959 46267
10931 46267 -69932 -127145 -173094 -185634 -90322 -8153 10340 23848 31399 21413 -12075 43241
10919 43241 58529 -56188 -68164 -27751 -2469 -25739 -87949 -56435 19534 42265 63107
10908 63107 84825 133128 124738 96447 111481 206816 173083 95710 39406 57983 78181 41924
10896 41924 18474 1789 5394 39513 19071 34849 62165 85009 120311 162284 55774 -59851
10884 -59851 -117193 -90659 -66159 4401 -7028 -24357 -40064 -131488 -103327 -59289 -44518 -56982
10872 -56982 -61440 -25826 19613 14611 21014 4557 29563 30541 39230 -27799 -17640 -10792 62533
10859 62533 13564 -87953 -66851 -29726 -29913 -65198 -112758 -135581 -53991 -13447 75240 105323
10847 105323 51689 -37628 -97863 -105784 -60669 -59690 7108 19856 39844 3399 22311 -15769
10835 -15769 -79185 -52667 -19622 -79243 -95384 -19821 -10002 -33645 -99814 -96108 -74398 -100856
10823 -100856 -34629 -12746 -20137 -27032 -80624 -39077 -44042 -83575 -97480 -59820 15109 42775
10811 42775 -61559 -96519 -111784 -102238 -96181 -99065 -93779 -30875 -16528 -15990 54021 76768 -21152
10798 -21152 -43234 -44646 -45985 -61235 -80820 -68574 -60381 -27534 -58424 -109282 -141801 -144514
10786 -144514 -21825 75489 133146 105434 100026 101945 63284 66885 100748 132015 12306 -54202
10774 -54202 12955 265 -48650 -15322 61929 48425 8297 -35888 -34674 -48519 -65012 37304
10762 37304 67301 36755 18629 -23712 -33913 -36923 -17585 45338 41476 19731 40323 21523
10750 21523 -31044 -48668 -4544 21186 34784 78570 95060 69195 14516 11812 37370 15868
10738 15868 -44438 -46304 -12387 24192 18759 46238 51992 4266 -54575 -52325 3480 60819
10726 60819 91158 98374 6739 -45976 -34786 -45273 -139878 -115427 8800 43610 60987 110869
10714 110869 56546 49890 63284 107447 98837 71007 22274 35743 54498 54386 22968 -8058
10702 -8058 -87339 -76983 45880 93094 116669 117019 139341 50013 -79637 -55470 16048 55243
10690 55243 89250 113973 86653 159831 171884 178054 128797 103997 117795 164594 113761 109048
10678 109048 106743 74068 50330 67364 101462 84173 39633 -28100 -54730 -37214 -32024 -6259
10666 -6259 -28066 -43788 -2089 3781 20042 81536 -10160 -65552 -69630 -70184 -36116 -15680 -5801
10653 -5801 12400 14663 21606 33119 52954 65410 56934 62861 69244 117190 40482 -21853 25519
10640 25519 38819 -1938 12064 55360 63073 88435 110407 191150 126835 90712 110376 64615
10628 64615 39569 11755 14669 61610 37818 20853 -24704 -110353 -90882 25521 -4572 40870
10616 40870 90059 127053 153989 133025 117630 113159 -45106 -74977 -24724 37307 88553 20042
10604 20042 -44958 -7253 -3842 -2192 56808 99956 27340 19246 -6377 -75991 -119123 -187944
10592 -187944 -203585 -182607 -72308 21405 22245 11370 52378 113133 123081 48915 32168 32690
10580 32690 8144 2558 33106 80995 140905 155462 35360 -53435 1685 -73766 -11398 95189
10568 95189 175304 210483 223129 128886 13507 73684 73430 67590 114596 76756 65071 96811
10556 96811 153231 168831 142348 71228 -39355 -10985 90112 74110 45735 23651 40086
10545 40086 -10762 -61972 -52371 -51776 -110386 -125158 -89747 -35456 -8863 27014 34417 -38036
10533 -38036 -55036 12547 2437 6821 38262 51900 58071 -25148 -68489 -42684 28683 -30308
10521 -30308 -24453 -67835 -97587 -35367 -105089 -145409 -143166 -37165 58183 29215 32838 -5429
10509 -5429 -66799 -24670 26751 60288 61148 57905 67649 1991 -24362 -20866 -4813 137389 170117
10496 170117 78665 30126 70634 21438 -5807 -32358 -56799 -25580 35579 13051 33620
10485 33620 -2541 -38734 -91435 -102399 -124663 -53905 -120927 -72112 83890 78398 19044 -2907
10473 -2907 57360 28717 29425 -11698 -87052 -124499 -19407 -4655 19266 14743 48 76399
10461 76399 72730 63517 98852 88474 75779 142591 69914 39420 148597 107353 -20314 -99575
10449 -99575 -81213 -8540 -33393 -2421 -44778 -97382 -90274 -63245 -56207 4460 98709 131891
10437 131891 115507 63959 -11098 -14602 -35580 4045 11576 74580 138366 116035 116354 43598
10425 43598 -45048 -85413 -122064 -57484 -22528 8234 31738 23756 33466 -17977 -68294 -58425
10413 -58425 -63134 -27620 -1023 -37620 -77574 -30081 -52637 -134257 -140856 -143290 -125276 -98377
10401 -98377 -118342 -129866 -31720 89864 125685 49674 -36823 22654 113285 47559 25455
10390 25455 9866 46306 62313 10046 -29861 -28235 -29206 -29165 19209 -17295 -27742 -50294 29806
10377 29806 127013 120891 159083 192219 148222 117911 194876 132251 105421 164694 182504 181814
10365 181814 202160 166692 155047 187250 105516 23649 49294 46034 -17839 27932 108380 129287
10353 129287 117783 106729 121796 217257 185089 193992 197385 185221 265957 185799 70937 47680
10341 47680 -7694 -31705 78891 66164 37063 58994 166109 173221 157098 92617 87619 175429
10329 175429 174916 126697 171361 221276 155703 51010 13441 111575 172672 203042 148199 51404
10317 51404 -79821 -93605 -53620 -47508 -25024 -7269 6349 41852 136824 92996 27315 56539
10305 56539 78078 135420 30445 16988 108356 127076 10837 -9574 -15607 6441 873 57498
10293 57498 34267 56975 100175 67718 26239 57357 138683 175362 184445 188998 254888 329903
10281 329903 386609 393091 434158 531504 692476 743029 821884 876945 859332 928398 1080167
10270 1080167 1247953 1336113 1413158 1568108 1624242 1704035 1612958 1373976 1157935 912122
10260 912122 701104 482229 365240 328822 300349 253917 254694 301338 243612 120698 79736
10249 79736 174401 148310 65847 49148 69983 106090 162428 183865 133711 33154 22712
10238 22712 83348 180961 155376 140574 50403 15757 -34276 -34780 22993 36381 53916 -16432
10226 -16432 28598 54438 39203 48868 -5222 55152 142006 174863 141543 202539 184597 171770
10214 171770 238616 255943 238800 257203 230957 276723 337840 298103 224109 217564 148157 95616
10202 95616 143532 207157 205841 147994 106176 107875 185835 136468 133526 115482 177942 104928
10190 104928 52725 112003 207577 197881 200926 221829 112549 101320 220701 237369 164861
10179 164861 157783 177704 163792 174538 209272 237045 238610 188110 244977 358035 477919
10168 477919 536052 552411 632157 686322 730010 747081 612697 443920 315823 262888 212089
10157 212089 168789 198237 155899 52578 38434 91624 80303 84853 71943 70977 94910 77686
10145 77686 86529 114217 98642 51829 -3919 -38309 -26070 -25413 86333 161272 90265 85421
10133 85421 5913 -29760 -9604 26387 1945 37837 21515 68029 101182 97125 91492 75515
10121 75515 55341 8828 -12569 -17335 -5089 4621 -54142 2543 92492 106753 85963 83772
10109 83772 82405 417 -75586 -106259 -87250 19640 104924 76511 83254 8338 -104889 -83127
10097 -83127 -73248 -46658 -9528 -45924 -30295 483 98220 154348 117958 47006 64227 112362
10085 112362 176340 94298 21266 -26026 -107499 -121167 -127293 -48806 30084 51984 142991 109738
10073 109738 70639 69609 104978 133638 53013 -15404 -26551 79946 123949 112831 110601 78444
10061 78444 -25676 -104961 -159832 -118431 -88643 -114917 -33532 10019 6633 87544 105248 58437
10049 58437 113288 67695 -69124 -68956 -15108 -28763 -33772 -9671 -29744 75901 83340 77084
10037 77084 44202 -1499 -20957 -10474 82465 158408 203598 151815 80223 44421 32781 23383
10025 23383 68323 131608 136829 212232 244303 167512 108560 50616 70905 -33408 -26132 54334
10013 54334 58811 68866 86815 135839 136228 67528 11401 55971 113461 214173 242282 159974
10001 159974 63719 59915 43339 102920 50179 23407 60437 101579 102770 122014 96688 134284
9989 134284 189466 194123 175597 105003 106190 111067 81414 -9771 95652 167450 91278 81243
9977 81243 72812 83394 118207 122612 244477 244894 163127 209514 209981 238025 257304 276916 285928
9964 285928 258172 159005 151551 219971 271016 229773 80314 22940 -14559 18045 81071 42207
9952 42207 60502 145471 226679 295027 202072 151936 145728 81593 96543 112153 80892 54173
9940 54173 -15958 -9269 76080 71412 79901 98917 141852 183364 221631 127062 79493 82424 63332
9927 63332 114073 194181 203294 216415 156838 89957 146567 255354 233730 217127 169923 155393
9915 155393 146991 22515 13008 34271 156921 229430 212142 88281 -17284 3136 54923
9904 54923 87871 107336 87974 140303 139851 109973 99154 175068 240687 178512 139327 140247 87409
9891 87409 57129 115060 140984 182019 149136 80009 27197 9263 11614 12517 43786 87111
9879 87111 131199 99300 71112 167249 297422 178378 113751 88816 75526 69429 16431 104104
9867 104104 200711 166262 84608 146941 155971 138287 116755 118988 110224 155813 22838 -60443
9855 -60443 -58402 -68886 -44180 -96094 -111269 -27939 38258 119890 138864 150470 183209 149476
9843 149476 132853 188773 101637 120711 147546 152228 198221 251624 239495 218066 230567 177483
9831 177483 99281 123841 83375 96487 94474 168827 184306 158568 195916 110633 28151 63277
9819 63277 162892 170878 149657 142970 52153 -14872 41641 51802 21141 123125 128975 178711
9807 178711 217267 170294 161271 160098 74957 42400 43833 141965 157186 210210 151186 5279
9795 5279 35746 153784 173206 197203 224184 261512 266361 234393 235581 209685 156330 -3688
9783 -3688 -74545 -96807 47532 175740 182394 199253 138909 129399 219963 260383 206669 154806
9771 154806 105525 42020 56193 126238 116628 161207 207573 215061 166995 179773 198910 226038
9759 226038 219239 224265 207723 231504 276020 240824 155150 168242 113089 44592 89786 176523
9747 176523 237550 273802 209103 189408 178289 198886 235585 213084 202836 199954 208925 233610
9735 233610 271263 264291 280776 284707 190275 143467 127963 180473 175631 126340 170931 193138
9723 193138 239029 244634 211878 185140 223764 261547 183653 105112 158447 166485 132241 280664
9711 280664 340470 336801 336961 330369 266169 204054 249071 274632 206993 192521 209724 191186
9699 191186 268168 341560 334435 315847 303726 309359 375235 359754 264348 272613 317358 356316
9687 356316 293653 261030 327615 320379 271519 261105 227882 227079 253697 257909 261501 278085 278548
9674 278548 280925 266101 283573 334518 276612 203631 168920 203746 220057 233270 260159 277536
9662 277536 252697 229129 217799 264715 232339 162769 174314 165826 180670 199411 181157 154848
9650 154848 211567 284661 218411 212804 340184 346525 294438 299821 316711 279539 282608 338015
9638 338015 308881 229159 201852 176938 272455 286044 290889 337622 315938 302131 287952 249468
9626 249468 210544 165039 196346 246376 301641 244068 200191 167427 219191 274562 288072 317877
9614 317877 359429 337935 358268 314007 394202 379163 321709 285964 257434 280374 242028 267687
9602 267687 348941 344554 323021 294518 288472 256955 270698 314971 307093 282815 315379 261412
9590 261412 178650 182707 239815 321453 306539 277671 267595 290254 294555 295823 296545 309120 278735
9577 278735 276589 312398 267313 295902 298200 300725 364346 410633 422699 397327 403802 384809
9565 384809 415196 392536 411500 384712 434803 447487 447569 471757 368769 369560 380227 358392
9553 358392 290960 318214 358443 415804 510357 494605 425955 369170 376367 440592 443233 407389
9541 407389 442129 382338 466449 483761 459532 460225 446835 479576 449980 363473 364797 395290
9529 395290 382677 434452 496068 477999 462452 372700 351273 292327 329648 410419 405919 414234
9517 414234 424117 484078 446717 406353 367404 358746 247943 200441 218376 199693 297312 414386
9505 414386 349437 382015 439641 442066 408309 374975 419224 468247 444543 446719 383191 313411
9493 313411 330065 418414 506436 537482 523925 452559 418427 465937 513189 504717 508451 479717
9481 479717 512647 530961 589718 595404 566585 538033 535361 577560 570661 506496 467773 472772
9469 472772 526966 599324 639698 503603 452807 545991 511510 465323 437288 481259 512716
9458 512716 594466 657656 587947 430889 407713 478044 464857 454874 484765 486966 423099 441224
9446 441224 472050 472630 556785 611594 567217 568823 600677 575348 484654 419535 331231 367534
9434 367534 505430 569724 536187 488432 518751 522911 506834 519097 573656 663619 778927
9423 778927 690428 613957 598517 627962 614626 646512 787450 849586 795227 700097 683043
9412 683043 682612 706795 652381 681083 735084 678909 619747 646088 750927 780134 753335 766523
9400 766523 680619 586027 673384 698832 703835 726916 737319 757834 693807 697606 725705 666544
9388 666544 654973 655581 710644 733605 725215 779205 733026 705849 721732 680863 635096 688456
9376 688456 693771 665957 573314 650653 698040 721506 665939 743499 779194 631855 640916 741235
9364 741235 805125 723476 707730 694334 662952 650524 674421 776873 766974 695393 717371 703895
9352 703895 738461 736385 719621 682846 631083 639297 632650 606807 574658 691636 820072 841431
9340 841431 785838 742449 744088 737618 749812 740518 671744 562469 600868 673035 685187 734392
9328 734392 800615 828161 832348 819582 820441 743477 781493 844128 943305 1029495 904192 748952
9316 748952 691733 717115 727146 749833 742859 826143 881297 885984 924444 942937 936563 788012
9304 788012 703520 699899 692957 711895 635047 673010 809334 940272 880702 842163 851685 880583
9292 880583 902955 854423 724453 736565 837416 888874 835018 837422 837698 936656 953092 891181
9280 891181 870908 848505 883648 891860 828245 807756 858395 904894 928705 940059 972202 937404
9268 937404 895864 863350 882504 852999 891539 894899 825415 789798 743509 792783 756001 802141
9256 802141 855230 830862 846408 918596 944154 923740 920382 899952 929496 936218 975890 1010831
9244 1010831 979605 898411 914502 925342 922107 929222 885166 824617 802967 822740 855599 835709
9232 835709 833133 942200 939999 892180 905603 853000 846075 887630 813382 784704 706453 675724
9220 675724 705069 698415 644596 661330 714077 748475 807986 841396 862532 901481 915931 909000
9208 909000 881743 909565 991574 984268 1012507 1023246 992891 904360 751411 676423 693659 708014
9196 708014 752285 785778 817932 884737 859660 775349 731050 767523 817640 879436 922731 960931
9184 960931 1023571 1006910 1011274 1008307 956853 858587 865176 891129 872572 923096 950256 914502
9172 914502 848912 794072 802590 850371 803907 803045 848600 800518 806509 811284 717803 709793 749220
9159 749220 799616 822079 826109 825594 879971 796654 731072 763630 833447 898693 886688 951544
9147 951544 858813 739578 735916 772895 803160 787778 760710 736270 780565 854672 892987 851629
9135 851629 802126 759137 766605 785345 782365 804312 747083 810430 808699 717459 738041 802002
9123 802002 778848 708957 855194 933154 870566 882608 852152 843219 758482 700397 683890 737694
9111 737694 714302 715932 764861 790285 688199 623941 697221 784036 839017 812028 787963 735663
9099 735663 719418 711831 700490 693497 696596 621707 596764 689244 779604 871041 774486 699959
9087 699959 637131 661557 694925 804176 742736 760416 831165 814721 760723 732318 718414
9076 718414 696523 676851 615331 656594 678549 643446 591282 658257 651816 585645 608631 604453
9064 604453 599974 547976 485004 478263 551334 542924 441621 464530 447634 381856 443321 563136
9052 563136 663550 613062 519031 481425 500513 476044 532828 614625 649031 650850 599744 518447
9040 518447 526107 493119 574264 581035 589844 565736 585093 588906 526510 523921 450454 391440 393057
9027 393057 480763 587026 663906 689395 652094 607587 617581 638274 594353 555698 557921 523612
9015 523612 501027 497375 466864 457795 504179 481525 423967 444083 430286 472199 460477 363294
9003 363294 363467 384579 332194 290435 285767 262294 319594 401386 527367 530173 543403 603661
8991 603661 515231 465667 471504 385072 394197 378534 384307 405871 406042 398784 375160 375826 412482
8978 412482 408363 379313 440558 502449 512996 503538 406957 400445 454845 388006 369082 372144
8966 372144 317961 387452 385874 391725 468104 490949 425078 403707 387834 265925 279828 360077
8954 360077 413647 448997 455652 412623 424589 507153 482959 437164 335023 308888 294110 250047
8942 250047 267231 268240 285904 341808 373473 269727 305090 335906 341795 325832 310115 417183
8930 417183 430175 490822 455643 460359 415374 382182 378521 336140 355591 367399 326971 278412
8918 278412 281678 253836 245193 264339 244151 222778 219468 260432 324775 298691 280706 238206
8906 238206 232757 265702 265485 236994 190831 188638 223626 245770 250368 244073 227729 210916 164761
8893 164761 159258 198914 259352 245722 240429 244621 272131 266177 273801 319542 323995 279249 234806
8880 234806 289478 333632 375756 379781 235744 200691 256938 224443 182074 196522 298523
8869 298523 345994 332306 324941 295767 314061 382200 344846 323063 302686 233165 201976 296458
8857 296458 345548 279527 294105 328381 208636 144802 162236 279246 319064 350567 332816
8846 332816 253818 209943 176859 202234 292338 309165 306207 291836 300435 341616 379062 279173
8834 279173 174389 173150 164319 212309 288093 219653 135595 73259 114370 192176 190978 257948
8822 257948 291786 270237 157487 154106 146501 117540 136399 167505 163770 171829 203076 171947
8810 171947 150771 161533 208765 207282 206826 194349 160847 190923 194089 140293 112551 111357 62690
8797 62690 -20134 -61703 -60923 -45996 58666 83883 101687 132325 176801 255787 185496 138623
8785 138623 161772 217019 158414 113978 31787 79191 120485 82979 105842 102103 126385 106023
8773 106023 16703 81386 89444 138689 176270 179919 159587 184137 153835 117656 115381 113028
8761 113028 63235 144346 213423 239274 191993 147842 136180 104745 74067 70771 109142 108162
8749 108162 113383 118829 83051 78866 98585 152935 165383 93175 77543 86443 71278 106610
8737 106610 166039 89690 94644 84724 128193 204876 199998 164786 235178 218904 224429 221483 241490
8724 241490 162740 102312 104230 96920 67283 145788 267562 300656 213372 240673 202325 142266
8712 142266 106955 104540 167948 223005 255674 205818 148390 139828 21288 -101750 -135894 -10572
8700 -10572 17251 -55905 -30976 71766 86740 119036 102323 49902 66124 110508 212736
8689 212736 207721 207789 259437 247020 203072 119766 29065 -2820 6572 73994 134708 172462 148726
8676 148726 187978 250556 180022 119958 176616 161486 120770 187360 250521 215969 161241 105549
8664 105549 109713 97379 77455 -11119 -32100 -30567 37150 125290 106206 149689 142873 211939
8652 211939 234279 145562 158288 190132 261816 301447 313817 195269 85065 148132 219614
8641 219614 320598 256731 128745 31529 62418 72677 105413 140276 111167 57571 137091
8630 137091 252722 279616 233641 178278 164382 156629 207476 134461 142205 80592 179181 226361
8618 226361 199380 257871 314699 209028 195614 214733 284047 355985 395193 375397 320409
8607 320409 258368 295377 390752 467060 449527 370736 318630 230247 165552 92357 162775 182444
8595 182444 207705 222322 180814 166401 195463 178451 205788 147225 204928 169564 99015 38497
8583 38497 39335 91817 111861 123858 157496 83594 122639 153944 172321 138075 55591 141389
8571 141389 204219 136744 134259 74488 20461 -9187 -22680 1947 -18496 -10784 13547 70467
8559 70467 111006 94920 -6908 10654 126787 114570 73184 85739 104042 208941 206571
8548 206571 184214 214897 258763 308139 182916 78954 65078 136092 110393 29183 35354
$$ [...]
##END NTUPLES=NMR SPECTRUM
##END=
