##TITLE=Analysis number 307171
Compound Code spb 06264
Book Reference 358/115/1
Project Code adrs
Chemist Name mikem
##JCAMPDX= 6.0         $$ Bruker NMR JCAMP-DX V2.0
##DATA TYPE= NMR SPECTRUM
##DATA CLASS= NTUPLES
##ORIGIN= Bruker BioSpin GmbH
##OWNER= NMR
$$ XWIN-NMR		Version 3.5
$$ Fri Apr 22 10:48:03 2005 GMT Daylight Time (UT+1h)  MAYBRIDGE\NMR@NMR_250MHZ
##.OBSERVE FREQUENCY= 250.131544655141
##.OBSERVE NUCLEUS= ^1H
##.ACQUISITION MODE= SIMULTANEOUS (DQD)
##.ACQUISITION SCHEME= undefined
##.AVERAGES= 16
##.DIGITISER RES= 18
##SPECTROMETER/DATA SYSTEM= dpx250
##.PULSE SEQUENCE= zg30
##.SOLVENT NAME= DMSO
##.SHIFT REFERENCE= (INTERNAL, DMSO, 0, 16.522)
##AUDIT TRAIL= $$ (NUMBER, WHEN, WHO, WHERE, WHAT)
$$ ##TITLE= Audit trail, XWIN-NMR		Version 3.5
$$ ##JCAMPDX= 5.01
$$ ##ORIGIN= Bruker BioSpin GmbH
$$ ##OWNER= NMR
$$ C:\u/data/dgb/nmr/ADRS/2060/pdata/1/auditp.txt
$$ ##AUDIT TRAIL=  $$ (NUMBER, WHEN, WHO, WHERE, WHAT)
(   1,<2005-04-22 10:47:42.01 +100>,<MAYBRIDGE\NMR>,<NMR_250MHZ>,
      <created by zg, POWCHK disabled, PULCHK disabled
       configuration hash MD5:
       62 19 C7 07 E1 42 D1 B7 37 6C 3D D0 77 39 F9 E6
       data hash MD5: 64K
       F9 CD 86 8C D2 49 F8 84 3A 8C 03 A1 06 43 D1 6C>)
(   2,<2005-04-22 10:47:54.93 +100>,<MAYBRIDGE\NMR>,<NMR_250MHZ>,
      <Start of raw data processing
       ef LB = 0.3 FT_mod = 6 PKNL = 1 SI = 32K 
       data hash MD5: 32K
       3E E7 69 13 3F 5A 37 AA C5 13 0D DB 51 36 29 C0>)
(   3,<2005-04-22 10:47:56.65 +100>,<MAYBRIDGE\NMR>,<NMR_250MHZ>,
      <apk 
       data hash MD5: 32K
       3E 20 B1 29 D4 B7 1A B2 7D 56 79 8E 41 FA 9E E5>)
(   4,<2005-04-22 10:47:57.37 +100>,<MAYBRIDGE\NMR>,<NMR_250MHZ>,
      <abs ABSG = 5 
       data hash MD5: 32K
       DA FC 6F DC 13 DB 95 2B EF D2 2B DD 83 45 C2 F3>)
$$ ##END=
$$ 
$$ hash MD5
$$ 9C 93 00 BE 13 9E BC 70 36 D7 27 B7 01 E5 A5 30
##$RELAX= 
##$RELAX= 
##$RELAX= 
##$RELAX= 
##$RELAX= 
##$RELAX= 
##$RELAX= 
$$ Bruker specific parameters
$$ --------------------------
##$DU= <C:\u>
##$EXPNO= 2060
##$NAME= <ADRS>
##$PROCNO= 1
##$TYPE= <nmr>
##$USER= <dgb>
##$AMP= (0..31)
100 100 100 100 100 100 100 100 100 100 100 100 100 100 100 100 100 100 
100 100 100 100 100 100 100 100 100 100 100 100 100 100 
##$AQSEQ= 0
##$AQ_mod= 3
##$AUNM= <au_zg>
##$AUTOPOS= <11 >
##$BF1= 250.13
##$BF2= 250.13
##$BF3= 250.13
##$BF4= 250.13
##$BF5= 500.13
##$BF6= 500.13
##$BF7= 500.13
##$BF8= 500.13
##$BYTORDA= 1
##$CFDGTYP= 0
##$CFRGTYP= 5
##$CHEMSTR= <none>
##$CNST= (0..31)
1 1 145 1 1 1 1 1 1 1 1 1 1 1 1 1 1 1 1 1 1 1 1 1 1 1 1 1 1 1 1 1 
##$CPDPRG= <>
##$CPDPRG1= <>
##$CPDPRG2= <>
##$CPDPRG3= <>
##$CPDPRG4= <mlev>
##$CPDPRG5= <mlev>
##$CPDPRG6= <mlev>
##$CPDPRG7= <mlev>
##$CPDPRG8= <mlev>
##$CPDPRGB= <>
##$CPDPRGT= <>
##$D= (0..31)
0 1 0 0 0 0 0 0 0 0.06 0 0 0 0 0 0 0.0002 0 0 0 0 0 0 0 0 0 0 0 0 0 0 
0 
##$DATE= 1114163261
##$DBL= (0..7)
120 120 120 120 120 120 120 120 
##$DBP= (0..7)
150 150 150 150 150 150 150 150 
##$DBP07= 0
##$DBPNAM0= <>
##$DBPNAM1= <>
$$ [...]
##$SUBNAM7= <"">
##$SUBNAM8= <"">
##$SUBNAM9= <"">
##$SW= 20.6930455092707
##$SWIBOX= (0..15)
0 0 3 0 0 0 0 0 0 0 0 0 0 0 0 0 
##$SW_h= 5175.983436853
##$TD= 65536
##$TD0= 1
##$TE= 295.16
##$TE2= 300
##$TE3= 300
##$TEG= 300
##$TL= (0..7)
0 120 120 120 120 120 120 120 
##$TP= (0..7)
150 150 150 150 150 150 150 150 
##$TP07= 0
##$TPNAME0= <>
##$TPNAME1= <>
##$TPNAME2= <>
##$TPNAME3= <>
##$TPNAME4= <>
##$TPNAME5= <>
##$TPNAME6= <>
##$TPNAME7= <>
##$TPOAL= (0..7)
0.5 0.5 0.5 0.5 0.5 0.5 0.5 0.5 
##$TPOFFS= (0..7)
0 0 0 0 0 0 0 0 
##$TUNHIN= 0
##$TUNHOUT= 0
##$TUNXOUT= 0
##$USERA1= <user>
##$USERA2= <user>
##$USERA3= <user>
##$USERA4= <user>
##$USERA5= <user>
##$V9= 5
##$VALIST= <valist>
##$VCLIST= <CCCCCCCCCCCCCCC>
##$VD= 0
##$VDLIST= <DDDDDDDDDDDDDDD>
##$VPLIST= <PPPPPPPPPPPPPPP>
##$VTLIST= <TTTTTTTTTTTTTTT>
##$WBST= 1024
##$WBSW= 4
##$XGAIN= (0..3)
0 0 0 0 
##$XL= 0
##$YL= 0
##$YMAX_a= 400420
##$YMIN_a= -367069
##$ZGOPTNS= <>
##$ZL1= 120
##$ZL2= 120
##$ZL3= 120
##$ZL4= 120
##$ABSF1= 16.522
##$ABSF2= -4.171173
##$ABSG= 5
##$ABSL= 3
##$ALPHA= 0
##$AQORDER= 0
##$ASSFAC= 0
##$ASSFACI= 0
##$ASSFACX= 0
##$ASSWID= 0
##$AUNMP= <proc_1d>
##$AZFE= 0.1
##$AZFW= 0.1
##$BCFW= 0
##$BC_mod= 0
##$BYTORDP= 0
##$COROFFS= 0
##$CY= 12.5
##$DATMOD= 1
##$DC= 0
##$DFILT= <>
##$DTYPP= 0
##$F1P= 14.0000005364418
##$F2P= -0.99999901652339
##$FCOR= 0.5
##$FTSIZE= 32768
##$FT_mod= 6
##$GAMMA= 0
##$GB= 0
##$INTBC= 1
##$INTSCL= 1
##$ISEN= 128
##$LB= 0.3
##$LEV0= 0
##$LPBIN= 0
##$MAXI= 10000
##$MC2= 0
##$MEAN= 0
##$ME_mod= 0
##$MI= 0
##$NCOEF= 0
##$NC_proc= -5
##$NLEV= 6
##$NOISF1= 0
##$NOISF2= 0
##$NSP= 0
##$NTH_PI= 0
##$NZP= 0
##$OFFSET= 16.522
##$PC= 1
##$PHC0= -82.7456
##$PHC1= 8.884631
##$PH_mod= 1
##$PKNL= yes
##$PPARMOD= 0
##$PSCAL= 4
##$PSIGN= 0
##$REVERSE= no
##$SF= 250.13
##$SI= 32768
##$SIGF1= 0
##$SIGF2= 0
##$SINO= 400
##$SIOLD= 32768
##$SREGLST= <1H.DMSO>
##$SSB= 0
##$STSI= 32768
##$STSR= 0
##$SW_p= 5175.98343685301
##$SYMM= 0
##$S_DEV= 0
##$TDeff= 65536
##$TDoff= 0
##$TI= <Analysis number 999999
Compound Code 99
Book Reference 9
Project Code 9>
##$TILT= no
##$TM1= 0
##$TM2= 0
##$TOPLEV= 0
##$USERP1= <user>
##$USERP2= <user>
##$USERP3= <user>
##$USERP4= <user>
##$USERP5= <user>
##$WDW= 1
##$XDIM= 32768
##$YMAX_p= 503323070
##$YMIN_p= -417002
$$ End of Bruker specific parameters
$$ ---------------------------------
##NTUPLES= NMR SPECTRUM
##VAR_NAME=  FREQUENCY,     SPECTRUM/REAL,   SPECTRUM/IMAG
##SYMBOL=    X,             R,               I
##VAR_TYPE=  INDEPENDENT,   DEPENDENT,       DEPENDENT
##VAR_FORM=  AFFN,          ASDF,            ASDF
##VAR_DIM=   32768,         32768,           32768
##UNITS=     HZ,            ARBITRARY UNITS, ARBITRARY UNITS
##FACTOR=    0.157963299565203, 1,           1
##FIRST=     4132.6476996994, 0,             0
##LAST=      -1043.33573715361, 0,           0
##MIN=       -1043.33573715361, -417002,     0
##MAX=       4132.6476996994, 503323070,     0
$$ Real data points
##PAGE= N=1
##DATA TABLE= (X++(R..R)), XYDATA
$$ [...]
24063i6649L0371K1682l7244M4742l2087J11363n257q8574n9040k1172m1643l7894
24051b11402J19377Q2083J37872O7954j25140r5934m4619J7950O7919k6655j45475
24040a56070p3316M0668P2280L8746N8421J3838j1205K3433j6506l0897l9957
24029h0565k045l3536K416Q9747N3974P3003K4679n122j4350r114O0474P7375
24017B36936j64177r5870M1806M2380M0761N5535n1260n9319m5651P4393Q3585
24006A59119L3640M830j15682R8584o3305j86095k33804L172J44385J09372J41643
23995I5859P5808k9162j5299r8014p4266J8979j4460o7731O2504J58142O6251
23984A78611p2710M4234j3868N5872L4692k7989p4246k2036O3128N7403o049M8018
$$ y = [-96649, -66278, -44596, -81840, -37098, -69185, 42178, 36921, -51653, -110693, -131865, -173508, -211402, -92025, -9942, 127930, 195884, 70744, -25190, -69809, -51859, 16060, -10595, -156070, -229386, -188718, -116438, -77692, -19271, -5433, -16638, 6795, -9711, -40608, -80565, -82610, -116146, -113730, -23983, 29991, 102994, 127673, 122551, 108201, 99087, 159561, 236936, 72759, -23111, 18695, 61075, 101836, 157371, 106111, 46792, 1141, 75534, 159119, 192759, 197589, 81907, 180491, 117186, -68909, -302713, -299541, -155156, -45784, 95859, 171667, 142505, 127206, 29192, -45074, -26095, -40555, -108286, -45782, 112360, 178611, 105901, 150135, 136267, 192139, 226831, 198842, 124596, 102560, 165688, 223091, 217042, 265060]
23972B65060j07375m5204P7474j05033j7796K824r1944N8279J10086j03587n4173
23961a1389N1308k3999L79K3826p642N54m7790J36129J0702J5847j60099m2303
23949e4477J38286k1748j02588o5566q988L4714M4906J2597M1881J3860j9989
23938A2888J2773J9406R2620M5648l623l376J5482k4935o5771q0383j00209r0071
23926a69551J25153K20472J7842j7596j3444q3016j22381j9826J0853J04583N829
23915E8918J34168J2917Q127m8386o9665p1466k8990p1761q3412K3804R7348Q0704
23903D2306j50662j27495R0190Q1353L5684L0256M5810L7220m9366o0211P5476
23892E0561M2337p2734q6062k2956L7490J0481j3589L3824r3804o0127J8977L0838
$$ y = [265060, 157685, 112481, 189955, 84922, 67126, 69950, -21994, 36285, 146371, 42784, -11389, 39919, 15920, 16299, 40125, 32483, 33037, -14753, 121376, 132078, 147925, -12174, -54477, 83809, 62061, -40527, -106093, -115081, -80367, -35461, -22864, 19017, 32877, 12888, 25661, 45067, 137687, 183335, 179712, 176336, 191818, 166883, 101112, 20729, -79480, -169551, -44398, 176074, 193916, 176320, 162876, 79860, -42521, -62347, -51494, 53089, 58918, 193086, 206003, 214130, 165744, 96079, 24613, -4377, -76138, -159550, -135746, -38398, 42306, -108356, -235851, -145661, -64308, -28624, 1632, 47442, 84662, 35296, -24915, 50561, 92898, 20164, -65898, -88854, -51364, -40883, -54472, -20648, -114452, -174579, -155602, -124764]
23880a24764k1212n9389J16702L3548K9309L7534O9093J2570j4103q172L8064
23869A09180L2411l9153K1823p0821j37977l074J14997O2983K0102j48573o4936
23858a03038L2376K5097j05196L3332Q747J02698J40630q7727o1214j57171m3247
23847b14713P3679M4502L5589L5514K5462K9547N3152j7716r0728M7916j6500
23836E704q1333L4924J5957N2952j16951j07736O6451J9795k6377M2309J30620
23825C6315J48590p0887j07537n1888J27718J00780j70311j04048J239P0138J17678
23814I7787m5962p8478N0729r588K5188J8050K8277j17262l6119Q2812J7696p1789
23802c8659O1662P5106p8377r1222n3715R4056K4474n8415k9362N4192L9125N5177
$$ y = [-124764, -145976, -205365, -88663, -55115, -25806, 11728, 80821, 93391, 79288, 71116, 109180, 141591, 102438, 124261, 53440, -84537, -87611, 27386, 90369, 110471, -38102, -103038, -70662, -45565, -150761, -117429, -108682, -5984, 134646, 46919, -14295, -171466, -214713, -141034, -96532, -60943, -25429, 33, 29580, 82732, 65016, -25712, 22204, 5704, -75629, -40705, -24748, 28204, -88747, -196483, -130032, -110237, -136614, -94305, 36315, 184905, 114018, 6481, -45407, 82311, 183091, 12780, -91268, -90029, -19891, 97787, 51825, -26653, 24076, 14488, 39676, 57726, 86003, -31259, -67378, 15434, 33130, -38659, 23003, 98109, 19732, -71490, -125205, -31149, -6675, -65090, -94452, -40260, -1135, 54042]
23790E4042P2353K4891j09945l4649K2720j713L4822J5754o2698l8756K8249O9968
23778G5038J8875j13636l4349J26505K6223j48657o6099m5370J1812r5339O7022
23767a77975J36182K5113k5171J82100L1059r7773J5357n7221K2274k5771j7426
23756A0748J0794P0044N8885n108j99216m9222J18314J41680o2824J4719M1646
23745A50460o9435J21594J07648k8566j78699j12733k8151J9335j1125J1179O7667
23734D9174n2263q09l4545m7952M814J18159M1838p5427n7411R4462o52l1076
23722H312k7543q0531r9649J24374L4711K6070M0217j1663K7953M786n6527n5347
23710f4837L0277R64k7069L6934j30903q7927j637J2298P5801P2478j1800j3656
$$ y = [54042, 126395, 151286, 41341, 6692, 29412, 27699, 62521, 78275, 15577, -23179, 5070, 75038, 93913, -19723, -54072, 72433, 98656, -50001, -116100, -161470, -149658, -244997, -177975, -41793, -16680, -41851, 140249, 171308, 73535, 88892, 31671, 53945, 28174, 10748, 21542, 91586, 150471, 145363, -53853, -103075, 15239, 156919, 94095, 108814, 150460, 81025, 202619, 310267, 281701, 103002, -9731, -37882, -18547, -29672, -18493, 49174, -3089, -3898, -38443, -86395, -81581, 36578, 78416, 2989, -54422, 40040, 39388, 8312, -19231, -99762, -199411, -75037, -40326, -14256, 25961, 14298, 42251, 47037, -9490, -64837, -34560, -33596, -60665, -23731, -154634, -242561, -244198, -231900, -156099, -83621, -95421, -109077]
23698a09077L3581N2948J19537M6185r029l2941j27630k919M1286j9721j7571
23687b5351j520J18697K7384l7401o1616n8119p9666l3074K4870K4739J8513O2239
23675b0305m8992p4745K8828m7364R710Q6483J45000K6417l5894p1716J8249k5182
23663i511J22840L834l2998k5186J4140p7677J5627R6558m980j64091j26809J06885
23651h1368P2307m2091n065M5554O1541o1339M0149M6357j6369K1688j3519o578
23639F1267O2746j5645j42769n7322K5334P4349M7426M903L0075q1992j6794l7532
23627d5954j09945J17249J62284Q3920n7077m7998j4529n31j6053o7892l9315
23616c5841O355L792N6048Q1432l6814n1371m2309l9847O580r2216M0386J12325
$$ y = [-109077, -75496, -22548, 96989, 143174, 134145, 101204, -26426, -29345, 11941, -7780, -25351, -26871, 91826, 119210, 81809, 20193, -37926, -117592, -150666, -125796, -101057, -82544, -20305, -69297, -144042, -115214, -162578, -152868, -66385, 78615, 105032, 69138, -2578, 15671, -9511, 113329, 117163, 84165, 58979, 73119, -4558, 11069, 107627, 102647, -61444, -188253, -81368, -9061, -51152, -56217, -10663, 50878, -10461, 29688, 76045, 59676, 81364, 67845, 61267, 124013, 108368, -34401, -91723, -66389, 7960, 55386, 60289, 90364, 8372, -8422, -45954, -155899, -38650, 123634, 207554, 150477, 102479, 87950, 87419, 71366, 3474, -35841, -29486, -25694, 30354, 111786, 74972, 23601, -18708, -58555, -51975, -144191, -103805, 8520]
23604H520o478j5414O9843n8087j6374R6984j11339J0086K8832m9870n1440Q2852
23592a1885J35711j591n6474k0596q2609L3833o5075p2341J07394P286j46314
23581a72661P770L8183M4344J8045J6352J21276o5475p8381n7279K7698J11887
23570A1759k5573J8228m4243l8158r4651P1952O7199P3608P2533n7498R409K9922
23558I4487L1553j18765j10857R3314o8257k3294J33851O3336K0988Q6044m5459
23547A56941o1205l3738l3799Q6255N967k7691K1574N8279k6852l3811k04541
23536i2621j07697J8244J10164J03774N322M1849q0075j19389n336M1617J51265
23525F7117O3081l1694L3026o443p1961n9661l7019L9331n2738k3990J20717O9688
$$ y = [8520, 2042, -13372, 56471, -1616, -17990, 78994, -32345, -22259, 6573, -43297, -94737, -11885, 123826, 122235, 65761, 45165, -37444, -3611, -68686, -141027, -33633, -26347, -172661, -164891, -126708, -82364, -64319, -47967, 73309, 7834, -70547, -127826, -100128, 11759, -13814, 4414, -39829, -77987, -172638, -100686, -33487, 40121, 112654, 55156, 64565, 94487, 126040, 7275, -103582, -10268, -78525, -101819, 32032, 95368, 116356, 202400, 156941, 95736, 61998, 28199, 114454, 120421, 92730, 114304, 172583, 145731, 111920, -92621, -200318, -182074, -71910, 31864, 37186, 79035, -1040, -120429, -125765, -84148, 67117, 130198, 98504, 131530, 125087, 53126, -6535, -43554, -4223, -56961, -80951, 39766, 109454]
23513A09454L3009j52826l7312Q1972j5235j2690K0902l0952P3105M6884L9178
23502A55489R1485P7876k6394j44118j46840k1343J17500O2902j10802p7818K5817
23491C754K6185l2921l3749p0142M6040R6033k5368J9881N680J12426J23658p3616
23479A97861l8751M018L1057q4825N4819l9441j70072L7069O3800N0946O2892
23468A69373j29700o4584L0308M3364j8423O7331L2397n7154m5772O2201N0611
23457A39952k1373P756J08924J1784k8220n7432j07066O639k7821j01183R2916
23446B4876L2277j7510j11203J20031Q1487N490q7644n1074J04101L1391q6073
23435D6149m4830K1715j8778k11671n9572J83582O4543n3260P0720r677Q8836
$$ y = [109454, 142463, -10363, -47675, 34297, 19062, 6372, 27274, -3678, 69427, 116311, 155489, 246974, 324850, 298456, 154338, 7498, -13845, 103655, 166557, 55755, -22063, 3754, 29939, -2982, -36731, -106873, -60833, 35200, 9832, 29713, 35393, 147819, 271477, 197861, 159110, 163128, 194185, 109360, 164179, 124738, -45334, -8265, 55535, 106481, 169373, 39673, -24911, 5397, 48761, 30338, 97669, 130066, 72912, 27140, 89341, 139952, 118579, 126335, 235259, 247043, 218823, 161391, 54325, 60964, 33143, -68040, 24876, 57153, 39643, -71560, 48471, 129958, 135448, 47804, -3270, 100831, 132222, 46149, 1319, 23034, 4256, -207415, -266987, -83405, -18862, -72122, -1402, -11079, 77757]
23424G7757m5792j40458k0231R5883P9742O1859q1880k2860R2620j10354j43710
23413a57424m4681J94251J66496M6175J7524n1547j14129j01400k1098L3820l6348
23402f8361L0186q446n0665Q4018j839N8261J9996R351L8081j2371O6416Q826
23390A73453j25532j05635K4884Q3951q4980j6944l5360M9590O6705M7411j15063
23379c7520j0954m2874n15P1107J09637Q2794p5514J5625P1050Q2275r415j17141
23367A38555J267P9918l8138J885j7049j20010K3507l3554l5843l1493O064J112
23355b3779k8777l3644l6802j00681N8622k0672j7656N2023K6401R1226J02922
23344F9183o3790n2394q0330r3032K1423J03468n2786N3740R5530L3707K4478
$$ y = [77757, 31965, -108493, -128724, -32841, 46901, 108760, 26880, 4020, 96640, -13714, -157424, -202105, -7854, 158642, 204817, 222341, 170794, 56665, -44735, -65833, -32013, -68361, -38175, -46621, -97286, -13268, -15107, 43154, 63150, 72501, 110582, 98211, 164627, 173453, 47921, -57714, -32830, 51121, -33859, -50803, -86163, -36573, 30132, 77543, -37520, -48474, -91348, -91863, -20756, 88881, 171675, 96161, 111786, 182836, 265111, 255696, 138555, 139822, 219740, 181602, 183487, 166438, 46428, 69935, 36381, 538, -30955, -24891, -23779, -52556, -86200, -123002, -223683, -165061, -185733, -203389, -151366, -124965, -33739, 69183, 5393, -47001, -127331, -220363, -198940, -95472, -148258, -94518, 1012, 34719, 59197]
23333E9197j05915n1484r571j1780L9119K8926r9748q2225J37727N0835l6893
23322h1812o5105J9737N9457J14928L3035o0635p5379M5342J02400J0415j7806
23311H4577j01987O2342j668L9499J1732M2666N4703j4440P0019p2257L028o584
23299A71630q2971K0956R3614j7152j09557J4592j02162K3673r2267M4065O3138
23288B7559K2311N1153l2242j58106l0849Q9062K948M0438O575l2862o4120Q9804
23276A1671M0906J963l3110M6706M277j04109m8588J03687P9354M494J9925O0208
23264A87384p8070n2380O587j06349R704j1316j4692N1364O3417J04007k0376
23253A39280p1185q2545l2287J1379n3263O36K1068K2946Q8341M9174M2762K5778
$$ y = [59197, -46718, -98202, -107773, -119553, -80434, -51508, -151256, -233481, -95754, -44919, -81812, -146917, -127180, -67723, 47205, 80240, 19605, -55774, -10432, 91968, 102383, 84577, -17410, 44932, 43264, 82763, 94495, 137161, 191864, 177424, 247443, 175186, 178214, 171630, 88659, 109615, 203229, 186077, 76520, 91112, -11050, 12623, -79644, -35579, 27559, 49870, 101023, 68781, -89325, -120174, -31112, -28164, 12274, 18849, -14013, -78133, 11671, 52577, 54540, 21430, 68136, 72413, -31696, -80284, 23403, 102757, 107251, 127176, 187384, 109314, 56934, 63521, -42828, -33124, -44440, -59132, -7768, 55649, 159656, 139280, 68095, -14450, -46737, -35358, -88621, -87985, -66917, -43971, 44370, 93544, 136306, 162084]
23241A62084k1892K8169o8049q0954P6480L2839p1767p1422O5566J23708q6475
23230H8287k614Q4101q4345o2400m1892j751Q567M09J93031K2526p7542j13953
23218A2424o0008k8933m42J03702J28957M5349n7217p8336L3199L3764j29710
23207B749O3183J4454q0729K9487R5130k2692m8980j7981j26994k7453J30316
23196A0490R6870J38317m0534k02868o6010M7049J34284J0531p1498N1738M3411
23185A51780m7204K7298N585o0333J23887l5519j11040l3265J66973P4108p0087
23174A92183L7895J7547j1683K8522r0275k8507l2332j0119l1469n6916J1698
23163B6544L2931J8899k9133p4647P0133M088L5907R7768J02536k581j51556j4664
$$ y = [162084, 140192, 168361, 100312, 19358, 95838, 128677, 56910, -14512, 51054, 174762, 88287, 85673, 169774, 85429, 23029, -18863, -20614, -12047, -11638, 181393, 203919, 126377, 12424, -47584, -76517, -76959, 26743, 155700, 201049, 143832, 65496, 98695, 132459, 2749, 65932, 80386, -343, 29144, 124274, 101582, 52602, 34621, -92373, -119826, 10490, 107360, 245677, 205143, 2275, -63735, -16686, 117598, 128129, 56631, 108369, 151780, 104576, 131874, 137459, 77126, 201013, 165494, 54454, 21189, 188162, 262270, 192183, 230078, 247625, 235942, 264464, 174189, 145682, 113350, 103231, 71762, 14846, 26544, 59475, 78374, 49241, -25406, 44727, 48815, 84722, 182490, 285026, 282445, 130889, 116225]
23151A16225L4335m4072r6404M2508o567m3439n091j4447J1766j13124M00J80677
23139F2767j4682p369J24815o1933m0767K1759P5990R102Q4386j89776l9788o1155
23127c6651Q740l4963N2202J02591Q9815L3533m4349m6380J59587m2438j47032
23116I4655J6578L4435o9885m0613q6529j45863k2128n7269N2700K2620J7864
23105a83435P7726J75113R2089p6374Q647j4130p6935M836N342k027O6011R1677
23093A68540l3774N0880j41313j57510R6192K0150l9041l4458J4372P7268q432
23082A2874K5040o9034K7410J21407j366j6734k0075m6597R9978j2804p2980J11736
23070A58855J19632p7515n3827R0J07104P4927K6992m3919p9417l2587q6927J8838
$$ y = [116225, 150560, 106488, 10084, 52592, 46025, 2586, -2505, -16952, -5186, -118310, -117910, 62767, 48085, 40716, 165531, 103598, 62831, 84590, 160580, 169682, 254068, 64292, 24504, -36651, -27911, -62874, -10672, 91919, 181734, 215267, 170918, 124538, 284125, 241687, 94655, 111233, 145668, 75783, 35170, -51359, -197222, -219350, -276619, -223919, -201299, -183435, -105709, 69404, 161493, 85119, 93766, 79636, 2701, 7537, 12879, 10852, 76863, 168540, 134766, 185646, 44333, -113177, -16985, 3165, -35876, -70334, -55962, 21306, 12874, 37914, -31120, -3710, 117697, 116331, 99597, 79522, 32925, 132903, 120099, 47119, 158855, 278487, 200972, 147145, 147235, 254339, 329266, 356258, 312339, 232922, 200335, 113408, 132246]
23058A32246J37502R0489j08287o1291J8244P3107k9395o93M6375K3841P1918
23047C94056p3016q5042j4052j29725j27766P442k1062N8684J04657P691l2081
23036H9786m3903J29129Q4074j4084N3031j10090l9151j02760r8462R8985Q7653
23025A34208P3826M4571M6723o4782j21071q2549Q899K09968j1553k09065j7998
23014A1177J5282o8482M3006j6164q2244M4823J37721J16362k5021P616j9390
23003A64686P503P1144r315k6579J3030m9943j27388K0156R9796j5620Q1293l8448
22991A90315J7612L5922J6603l7457j07906o3543K1419q686q3054J08803J40546
22980B30574J6606n9494m8488j11392l9929Q6335j9053n9589j10771O2914J22349
$$ y = [132246, 269748, 360237, 251950, 190659, 208903, 282010, 252615, 251922, 298297, 322138, 394056, 321040, 235998, 221946, 92221, -35545, -28103, -49165, 9519, 114176, 121867, 89786, 45883, 175012, 259086, 245002, 298033, 187943, 148792, 46032, -52430, 46555, 134208, 208034, 252605, 299328, 234546, 113475, 30926, 39825, 249793, 238240, 29175, 11177, 26459, -42023, 983, -15181, -97425, -52602, 85119, 201481, 176460, 184076, 164686, 172189, 243333, 234018, 207439, 220469, 170526, 43138, 63294, 163090, 147470, 228763, 190315, 207927, 243849, 260452, 222995, 115089, 51546, 72965, 64279, -18775, 90028, 230574, 247180, 187686, 139198, 27806, -12123, 74212, 55159, -4430, -115201, -52287, 70062]
22969G0062k4535L9322R108j8210P34p1092J2577J8739J54744J04324n6345J614
22957B41042j80707j52569O1570N8321M2911J02049J9687p3632J21227P53q0023
22946A60629K5572P4598L760m4803L065p8759o3791Q7198j6055r0979J0058J96340
22934B66833R7824q7217n1195m0227l2397K8582n6898o2536j9491P562L1766J13171
22922A95777J5971R301m7309l0047j23q788O2442L5977j0952N9405k9086R919
22910B62487j04907K3682N7008r7680o2540o1910J13687Q7619O406k7132L0989
22899B27709J5257j0791O9873q9218j2108J31983p2145r1763k1222j59736j53825
22888a65986J91506N9059j290n0039q9455k6739M1430O4286O1463J3204j03763
$$ y = [70062, 45527, 84849, 93957, 75747, 76481, 5389, 17966, 36705, 191449, 295773, 239428, 241042, 60335, -92234, -30664, 27657, 70568, 172617, 192304, 118672, 239899, 240652, 160629, 186201, 260799, 264559, 219756, 222821, 144062, 80271, 167469, 151414, 60435, 70493, 266833, 364657, 277440, 226245, 186018, 153621, 182203, 125305, 62769, 43278, 50840, 82606, 195777, 211748, 221049, 173740, 143693, 143570, 134782, 197224, 233201, 222249, 281654, 252568, 262487, 157580, 181262, 238270, 140590, 78050, 16140, 129827, 217446, 223852, 196720, 227709, 242966, 232175, 302048, 212830, 200722, 332705, 260560, 168797, 147575, -12161, -165986, 25520, 84579, 83289, 33250, -56205, -82944, -41514, 22772, 84235, 97439, -6324]
22877f324O694J17901L5726m8552o6807l4603J4231L4537l4812p0698j504R3507
22865C9296J07841J10741j7798o2602j08600q1581r0494R1784R2230N4617J37101
22854B72535n5646k0192L9261r8327Q5886j9456o7941o7665Q2626l6862k9441
22843H4778K2642J8451m4940M4304P4484Q0201P9263j5960o3178j02208L1026
22832B08863q5236j9881M9848m9901q386r5153P4534R4461P1510j5460r1945j7219
22820A16035P4139N0264N8120M1202j39718J9050k629j2242k6019j01448n5747
22809B1007M1437Q1482L185n7340j7685L5811q3756J1597J04931R7807o7877o980
22797A63619J7405M5377j481N2695j48621n1212Q8164J41758J7110j16989l6931
$$ y = [-6324, 370, 118271, 153997, 105445, 38638, 4035, 18266, 52803, 17991, -52707, -54211, 39296, 147137, 257878, 240080, 177478, 68878, -12703, -103197, -11413, 80817, 135434, 272535, 216889, 196697, 235958, 137631, 223517, 204061, 136120, 68455, 151081, 114219, 84778, 107420, 125871, 80931, 125235, 199719, 279920, 359183, 343223, 280045, 177837, 208863, 123627, 103746, 153594, 103693, 95307, 154, 74688, 169149, 240659, 225199, 133254, 116035, 190174, 240438, 298558, 339760, 200042, 219092, 216463, 204221, 178202, 76754, 21007, 62444, 143926, 147111, 89771, 72086, 107897, 24141, 35738, 140669, 238476, 170599, 163619, 181024, 226401, 224920, 277615, 128994, 77782, 165946, 307704, 324814, 207825, 170894]
22786A70894q85J617J8922l6276m3499k3999j9933p9969O5386N0775m2657r8493
22774c8117p5053M2807L4449R0198M3425n8459L9988P4821K6669N3483O2685J2007
22762C08903J1111L0859M610k3432j0079k416j5498j31142J06786l0382o0550
22751A88770J7702J8857o4097R6181J1299j18121K2876O2134J4757K9993L3526
22740C13877K4071j09960j61410l9379J25235L43R3400R1917q0863j57005r9746
22729D80M9552M9918m2665K3252M7736M8427k0805P2622Q3507K7979o8229k3167
22717B48607j8003Q770l7826l1634L7282R123J1455M0847k6206L967J9164p892
22705B57654M4818n2537K478Q6130k8222n2078l1392k2848J21371p241k64188
$$ y = [170894, 170009, 171626, 190548, 154272, 110773, 86774, 66841, -13128, 52258, 103033, 60376, -38117, -113170, -70363, -35914, 54284, 97709, 39250, 79238, 154059, 180728, 234211, 296896, 308903, 320014, 350873, 355483, 332051, 321972, 319556, 304058, 172916, 279702, 249320, 188770, 206472, 225329, 161232, 257413, 268712, 150591, 173467, 235601, 250358, 280351, 313877, 337948, 227988, 66578, 27199, 152434, 152777, 246177, 338094, 257231, 100226, 480, 50032, 99950, 57285, 80537, 128273, 176700, 155895, 228517, 312024, 340003, 271774, 248607, 230604, 239374, 201548, 169914, 207196, 216319, 227774, 268621, 242415, 246382, 265546, 257654, 302472, 249935, 252413, 338543, 310321, 258243, 226851, 204003, 325374, 318133, 53945]
22694E3945r4368M4825J16302j1783j3957M8732O6223M2978k3919J1191p7868
22683A62301o1734Q6053J11439l5046l3616n3768M7293O4790n0356J071J03754
22672C42181q1665p0269J2523J36014M1453j9658k6713Q366m8275l2447K8951
22661B90461O140M3777l7957m8028L0046m5806J1623K0426O7691K1614R495J8546
22649C88028l0135L4140O4980L5485j8311r8262k21447j15433j4032O8306O6167
22638A59486R5186R9056j48476q04Q3437p0414l8132J15567J2925N0774n2305
22627C06300o7432Q3768L617j71209r306k6801O691R0466J33705J6271j0094O1613
22615D17589n5814p8582N0402Q3213o9922L4988m092m4188j30925j42163l1891
$$ y = [53945, -40423, 4402, 120704, 108921, 94964, 143696, 209919, 252897, 228978, 240169, 162301, 100567, 186620, 298059, 263013, 229397, 175629, 222922, 287712, 237356, 238427, 342181, 260516, 190247, 202770, 338784, 380237, 360579, 333866, 342232, 293957, 261510, 290461, 296601, 340378, 302421, 254393, 284439, 238633, 250256, 270682, 338373, 359987, 369482, 388028, 357893, 392033, 457013, 492498, 474187, 375925, 154478, 39045, 25013, 93319, 159486, 254672, 353728, 205252, 204448, 287885, 217471, 179339, 294906, 307831, 358605, 306300, 238868, 322636, 326253, 155044, 145738, 118937, 125628, 216094, 349799, 366070, 355976, 417589, 361775, 283193, 333595, 416808, 346886, 381874, 377782, 333594, 202669, 60506, 28615]
22604B8615P3439m7173M1873J5111Q7224R4854l2267m4188o7243k806N3371P609
22592B08419q2226P9222O702K8895O7258n3303P573Q7829l1636q2957j08601Q1068
22580B08243o219K7081P4549K7353j01184l97N9553Q0472m943l0016J09207r746
22568D33953Nm1261O3636l8670J17142j3350J2704n8376r427k1265j18218K3492
22556C50365n3389m810J27110n9804p4150O2082J1538k995O1566J0593l8198K3293
22544D13201p8282p5174J25947P9981j11238n0009j903l3118o1531p0912J14041
22533B51003O8308N1204l1892P08j3735j14269J9879J1606P3341K9185r5149K3010
22521B73199L4697j23211P4361J55500N1709j66599j44191O0464Q8234J33913
$$ y = [28615, 102054, 54881, 96754, 111865, 199089, 293943, 261676, 217488, 150245, 147439, 200810, 208419, 126193, 205415, 212117, 241012, 308270, 254967, 262540, 350369, 318733, 235776, 127175, 208243, 202024, 229105, 303654, 331007, 229823, 229426, 288979, 369451, 364508, 334492, 443699, 433953, 433958, 392697, 456333, 417663, 534805, 521455, 534159, 475783, 466356, 445091, 326873, 350365, 296976, 292166, 419276, 359472, 285322, 347404, 358942, 355947, 417513, 428106, 389908, 413201, 334919, 259745, 385692, 465673, 354435, 304426, 302523, 269405, 207874, 136962, 251003, 319311, 370515, 338623, 339331, 325596, 211327, 231206, 242812, 316153, 345338, 250189, 273199, 307896, 184685, 259046, 414546, 466255, 299656, 155465, 215929, 304163, 438076]
22511D38076l4557q7042k4456K7673m4295n5633m4183J46034R0325j04077j5473
22500B92392R760L6108l7317M7735M9138p7008p3267n9282J02274J46545K1354
22489D58432q4571q806m6248J6321N8355p9259l2983K1012L1691j2754j5283J23074
22477D28981O7824M4916p3786R5K0281l5040o7361j11276j5209n09R5461R2014
22465D46391o9336j24582m4243J22765Q0153j0155J00962M9630J68070j9776o7173
22454F32706j35285o1383M2153j18778j73000J23144J2748k5914L1440m3514m6325
22443B37992J06042L5013K5561J06601p3797j22854R1552K42878J75815l1623
22433G93180p2940p6611j40936K3959m4025o5440P189N7514M7826M327N3408L2891
$$ y = [438076, 403519, 316477, 292021, 319694, 275399, 219766, 175583, 321617, 411942, 307865, 292392, 302152, 338260, 300943, 348678, 397816, 320808, 247541, 188259, 290533, 437078, 458432, 373861, 365055, 318807, 335128, 393483, 314224, 281241, 302253, 333944, 321190, 305907, 428981, 496805, 541721, 467935, 468030, 488311, 453271, 385910, 274634, 259425, 258916, 354377, 446391, 377055, 252473, 208230, 330995, 411148, 400993, 501955, 551585, 719655, 699879, 632706, 497421, 436038, 478191, 359413, 186413, 309557, 322305, 296391, 327831, 284317, 237992, 344034, 379047, 404608, 511209, 437412, 314558, 406110, 648988, 824803, 793180, 720240, 643629, 502693, 526652, 482627, 417187, 424376, 481890, 529716, 534043, 587451, 620342]
22421F20342j2965N0663k9460m9149p4568q6193J586J37156Q1533o1775r9118
22410D78052k3782K1360l228M1094l1270j17506O6096Q2587k7007q2704O1933
22399D65625M3520o4098K2697j7857O437N3866J8552J3113O5404j79745l4711
22388C92803M7377R5920j74705k1799Q5160j8287q1211k3108J65212j3978k6814
22377D26570p6106L7639Q6365n5311j18978L2842J6832o7261J1116j1547P2164
22366C54325J25282J14493J00913J6533l026m7487j8586k3557l3023m8796L9042
22355E76113l4994j17437K8704J8267J32284L4290K9418J23291M5425j39823j21639
22344E73899R585P3064K0234n8370O7402O9188n2924m0062N1457P7795Q2108l2913
$$ y = [620342, 607377, 658040, 628580, 579431, 504863, 418670, 420256, 557412, 638945, 577170, 478052, 454270, 475630, 472402, 513496, 482226, 364720, 430816, 513403, 486396, 403692, 465625, 509145, 445047, 467744, 449887, 456324, 510190, 528742, 541855, 607259, 427514, 392803, 440180, 536100, 361395, 339596, 424756, 406469, 325258, 302150, 467362, 453384, 426570, 350464, 388103, 474468, 419157, 300179, 333021, 349853, 282592, 293708, 282161, 354325, 479607, 594100, 695013, 711546, 708520, 661033, 642447, 618890, 585867, 537071, 576113, 541119, 423682, 452386, 470653, 602937, 637227, 666645, 789936, 835361, 695538, 573899, 583484, 656548, 676782, 618412, 685814, 755002, 702078, 662016, 713473, 791268, 873376, 840463]
22332H40463o9120j2265n0058Q2549j28053m7907r427J889j92K0442R4291o5545
22320F57067r6174R541Q0035L6449q698k00000j18501L9528K32873J50985R3633
22309H76738p7030j74528J021J47893J57920L6179o1521q3841K9540P8768N322
22298I36461r22j3876r8024j09157O6095m5505j15101O2717Q010K6943L9336m3159
22286G13818m6066l2306Q830J15122m7188j0131J38379l3298p2859R231J14734
22275H58266p9044M1190q9746r1853R330M4233Q678O2318J23429l7063j19284
22264G30454q113O9787j1507m8687k9735r7714n3511J24365Q6784m6033j7951
22253F98139j2462L5272K8418j446l4564j1606O1614N0471k1314m5151m043N6399
$$ y = [840463, 771343, 759078, 709020, 791569, 663516, 615609, 606182, 608071, 607879, 628321, 722612, 657067, 560893, 570434, 650469, 686918, 678220, 478220, 359719, 399247, 632120, 783105, 876738, 799708, 625180, 626201, 774094, 932014, 968193, 906672, 822831, 852371, 931139, 936461, 935539, 921663, 823639, 714482, 780577, 735072, 619971, 682688, 690698, 717641, 756977, 713818, 667752, 635446, 644276, 759398, 712210, 702079, 840458, 807160, 734301, 743532, 858266, 779222, 820412, 730666, 638813, 648143, 692376, 701054, 763372, 886801, 849738, 730454, 722341, 792128, 780621, 731934, 702199, 604485, 550974, 675339, 762123, 716090, 698139, 685677, 720949, 749367, 747921, 713357, 701751, 763365, 813836, 792522, 747371, 743328, 799727]
22241G99727m1172k9988O8987o5037k7926J62959j5447k4487O8803m1020l2736
22230H22663j0864k4769n3346J5943K4080n7150O1178n6482l1697L6293L8820
22219G64669k309r4530J0637K5968J16368P2019l5133l5276q3357k7637r667k7101
22207F74651J48822J53413N0193R793J4790k8650j07187m4920J02929Q2244m8065
22196A008013k4501L4724J6679L3127o7770J9805N9283j4516P754J1400R2800
22185A176798l6463K6429q9797L7886N7458k9658j26882o0037J5191K594k0720
22174I52799M2821J39128R7161K3601n8625p9469j13264o3577R3859l9288R287
22163A004433l7877j05039J6710N3071J47519J00663J15968J8069r1817k0077
$$ y = [799727, 758555, 728567, 797554, 732517, 704591, 867550, 852103, 827616, 896419, 855399, 822663, 811799, 787030, 733684, 749627, 773707, 716557, 777735, 721253, 689556, 725849, 764669, 762360, 667830, 678467, 704435, 820803, 892822, 857689, 822413, 739056, 711419, 701752, 674651, 823473, 976886, 1027079, 1036872, 1051662, 1023012, 915825, 870905, 973834, 1056078, 1008013, 983512, 1018236, 1034915, 1068042, 1000272, 1020077, 1079360, 1064844, 1072598, 1083998, 1176798, 1140335, 1166764, 1076967, 1114853, 1172311, 1142653, 1015771, 955734, 970925, 973519, 952799, 995620, 1134748, 1231909, 1255510, 1196885, 1117416, 1004152, 940575, 1034434, 995146, 1004433, 966556, 861517, 878227, 931298, 1078817, 1179480, 1295448, 1313517, 1221700, 1201623]
22153A201623j2011j15671q8788K067k3988M9134N2018R4831p9633r2052n4892
22142I32638J51021O3675M4282N993L5131n7975m657l9112k4033J02235J1649
22131A220847r3340l3411L5868o0671N0736J5625J03762p6479K9734M4628L5692
22120A272991j3546J02131O7881m5084p8993R934n623p5541j06247l8721J16602
22109A205784O3961k3503O1981J58516K0306J5250n4384o6475n6535J55406P9772
22098A560079K8460j66757j07430n6842O31K12296K6561n5886j12335O4960J14080
22087A507817K1264m2353L4937M488p02j911o6778l4683M7949P1002o4492j60366
22075A316172m6533k0836M5095P1099Q2742L7323K6211m7116l4443k3611K2334
$$ y = [1201623, 1189612, 1073941, 985153, 987220, 963232, 1012366, 1064384, 1159215, 1079582, 987530, 932638, 1083659, 1147334, 1191616, 1197609, 1232740, 1174765, 1170108, 1130996, 1106963, 1209198, 1220847, 1127507, 1094096, 1129964, 1069293, 1120029, 1135654, 1239416, 1162937, 1192671, 1237299, 1272991, 1259445, 1361576, 1429457, 1384373, 1305380, 1315314, 1309691, 1234150, 1127903, 1089182, 1205784, 1269745, 1246242, 1308223, 1466739, 1487045, 1502295, 1447911, 1381436, 1324901, 1480307, 1560079, 1588539, 1421782, 1314352, 1257510, 1258141, 1470437, 1496998, 1441112, 1328777, 1393737, 1507817, 1529081, 1486728, 1521665, 1526153, 1525451, 1523540, 1456762, 1422079, 1470028, 1541030, 1476538, 1316172, 1269639, 1248803, 1293898, 1364997, 1447739, 1485062, 1511273, 1464157, 1429714, 1406103, 1428437]
22064A428437K20J07141N6060P1263O3679k732p2744j3382J8861r6698j13607
22053A446498K5482k6278O2706r139L6810m9460L7067m3793j19062R8823P970
22042A467624N6831R2934k7073O2988O1982N8868l9240p3388j9570J44608K5928
22031A812492r4354j204Q9872k669j8543k4788r121l9259K0251R6591J13507n2994
22019A889781O094J8120O540J548R1647j19800m4782N8160m1316M6345Q2813m9721
22007A945429J217J04862j0866l768j28711J01419J04051J1391p9382J8883L1793
21996B096318r7505M7456J04291N6702L6394M3233J29170n3955p2249K2702Q8768
21985B401325K5938q6959N4555J02533J20704o60q2039n3798k14443n4622M2879
$$ y = [1428437, 1428657, 1535798, 1591858, 1663121, 1726800, 1724068, 1651324, 1637942, 1656803, 1560105, 1446498, 1471980, 1445702, 1508408, 1499269, 1536079, 1486619, 1523686, 1479893, 1360831, 1459654, 1467624, 1524455, 1617389, 1590316, 1653304, 1715286, 1774154, 1734914, 1661526, 1641956, 1786564, 1812492, 1718138, 1716934, 1806806, 1804137, 1785594, 1760806, 1751685, 1712426, 1732677, 1829268, 1942775, 1889781, 1895875, 1913995, 1920535, 1922083, 2013730, 1893930, 1849148, 1907308, 1865992, 1912337, 1995150, 1945429, 1946646, 2051508, 2040642, 2036874, 1908163, 2009582, 2113633, 2125024, 2045642, 2064525, 2096318, 1998813, 2046269, 2150560, 2207262, 2243656, 2286889, 2416059, 2362104, 2289855, 2312557, 2401325, 2427263, 2340304, 2394859, 2497392, 2618096, 2617436, 2535397, 2481599, 2267156, 2212534, 2255413]
21974B255413P2473j3785L7265J7514M0855L3663J41902J62951M9294k2656m5
21963B774844r25j48164r7616Q2702O7835k0335L1876J04201o3338j8874N6205
21952B768411M4392L6486o3673O740J15503M445M4070J2772r4690P8435J49693
21941C102584P9840n2345R279q9511R005j8969l8778J8889M8886O1935R2096R0527
21929C313438Q200O863l3216N4437p1209n2655J47458K30572K1914j8865p6348
21918C530589j83083j53302j225J17743J92945P6110p9538j44090R294J09695
21908C475138M461J12503J7705J01535m5596J44805L418M5610J22315O8286K6141
21897D076321J06241N9942j13001j11688J7970j474P882R8573K8534j66626M3309
$$ y = [2255413, 2327886, 2314101, 2351366, 2368880, 2409735, 2443398, 2585300, 2748251, 2797545, 2774889, 2774844, 2773919, 2625755, 2528139, 2610841, 2678676, 2658341, 2690217, 2794418, 2731080, 2712206, 2768411, 2812803, 2849289, 2785616, 2792356, 2907859, 2912304, 2956374, 2969146, 2874456, 2952891, 3102584, 3182424, 3130079, 3139358, 3049847, 3058852, 3039883, 3001105, 3019994, 3068880, 3130815, 3222911, 3313438, 3321638, 3328501, 3295285, 3349722, 3278513, 3225858, 3373316, 3603888, 3625802, 3606937, 3530589, 3347506, 3194204, 3192979, 3310722, 3503667, 3579777, 3500239, 3356149, 3365443, 3475138, 3479599, 3592102, 3609807, 3711342, 3665746, 3810551, 3813969, 3859579, 3981894, 4050180, 4076321, 4182562, 4242504, 4129503, 4017815, 4035785, 4034311, 4042193, 4140766, 4169300, 4002674, 4045983]
21886D045983K00095J26874l6060O1590j7411p3796K4362J56095R3391k3354O6982
21875D624751K4989L4832N2113O6579Q4668J11569m1411p9037k5407P9245M5605
21864D978496n637o2846Q824j9760P6436N5990R3505R5184Q4254J16099J44711
21853E565256K5296R8408J264j33022p8087P6191J3530L7231M6449Q0816J46801
21842E880133R928K1786N8938J09159J86039J13011N2763l9942K2593Q7269Q6021
21831F587698m7831k7134J10281Q9780R9169k4389O5881K2218J79207O9593q0886
21820G043587K7042Q9974J89533l4150M0449J30646J450M4928J50348J35655O4781
21809G884243J33768J40308n567k8766m316j8195J30914K14988R1089Q7837J68053
$$ y = [4045983, 4246078, 4372952, 4336892, 4398482, 4381071, 4307275, 4331637, 4487732, 4581123, 4557769, 4624751, 4649740, 4684572, 4736685, 4803264, 4887932, 4999501, 4958090, 4879053, 4853646, 4932891, 4978496, 4972859, 4910013, 4918837, 4899077, 4975513, 5031503, 5125008, 5220192, 5304446, 5420545, 5565256, 5590552, 5688960, 5690224, 5557202, 5479115, 5555306, 5568836, 5606067, 5652516, 5733332, 5880133, 5890061, 5911847, 5970785, 6079944, 6265983, 6378994, 6431757, 6391815, 6414408, 6501677, 6587698, 6539867, 6512733, 6623014, 6712794, 6811963, 6787574, 6853455, 6875673, 7054880, 7124473, 7043587, 7070629, 7160603, 7350136, 7315986, 7356435, 7487081, 7488531, 7533459, 7683807, 7819462, 7884243, 8018011, 8158319, 8152752, 8123986, 8119670, 8101475, 8232389, 8447377, 8538466, 8626303, 8794356]
21798H794356R1010M9030P8543J17928P0900O4881J01796P7574O8122j12610n3476
21787I348054J06798K18345J58230N9686Q5941J69961J17926J33771J29797J42880
21777A0671389J24042K03673J18085J45948Q3159J15708K02124J83428K04748
21768A2052304J43818P5368j1435Q1812K85089J62988L8412J74746K23148Q9266
21758A3315516J27952K28133J90178J77658J99715J12315J16754K27581L15845
21749A5011647J71166K17937J19745K10170K29887J86314J79923K37397K66174
21740A6830360J90687R3901J20469K69560L10435L23035K18082J76418K07348
21731A8740295K24804L14852L53154K44359L62431K67996K60411J97873K14149
$$ y = [8794356, 8885366, 8934396, 9012939, 9130867, 9201767, 9266648, 9368444, 9446018, 9514140, 9401530, 9348054, 9454852, 9673197, 9831427, 9891113, 9977054, 10147015, 10264941, 10398712, 10528509, 10671389, 10795431, 10999104, 11117189, 11263137, 11346296, 11462004, 11664128, 11847556, 12052304, 12196122, 12271490, 12260055, 12341867, 12626956, 12789944, 12828356, 13003102, 13226250, 13315516, 13443468, 13671601, 13861779, 14039437, 14239152, 14351467, 14468221, 14695802, 15011647, 15182813, 15400750, 15520495, 15730665, 15960552, 16146866, 16326789, 16564186, 16830360, 17021047, 17114948, 17235417, 17504977, 17815412, 18138447, 18356529, 18532947, 18740295, 18965099, 19279951, 19633105, 19877464, 20239895, 20507891, 20768302, 20966175, 21180324]
21722B1180324K94663M33802K63367K55058L63974M48905M10604M14358K96752
21713B4361807K97201M08597L62997M32949M33400N57914M29674L60046K70851
21704B7915436N63749N93906M20512L82045M80753M41315O39963O24542O07817
21695C2670038N43359O32030N93044O42913P00163P73705O40883N73966P38988
21686C8509089Q68395P51213O99540Q37775R33118R53766Q35631Q00355R05432
21677D6094314R31000R98231J093214J231137J142940J025783J006456J178619
21669E4701694J193845J122733J221403J400158J534021J411108J316184J462882
21661F5364028J479937J563899J557352J528844J715146J892909J933048J930101
$$ y = [21180324, 21474987, 21908789, 22172156, 22427214, 22791188, 23240093, 23650697, 24065055, 24361807, 24659008, 25067605, 25430602, 25863551, 26296951, 26854865, 27284539, 27644585, 27915436, 28479185, 29073091, 29493603, 29875648, 30356401, 30797716, 31437679, 32062221, 32670038, 33213397, 33845427, 34438471, 35081384, 35781547, 36555252, 37196135, 37770101, 38509089, 39377484, 40128697, 40828237, 41666012, 42599130, 43552896, 44388527, 45188882, 46094314, 47025314, 48023545, 49116759, 50347896, 51490836, 52516619, 53523075, 54701694, 55895539, 57018272, 58239675, 59639833, 61173854, 62584962, 63901146, 65364028, 66843965, 68407864, 69965216, 71494060, 73209206, 75102115, 77035163, 78965264]
21653G8965264K005964J881369J989657K200742K190419K103988K114663K275463
21645I5727529K420139K427753K447894K599466K586067K691245K859067K950187
21637A16709347K853157K869008K986237L058084L132946L244202L183638L252750
21629A41289369L302501L326450L296488L274420L366007L124056L147607L232918
21621A67359816L208947L290527L176672K907855K919740K784304K622088K695568
21613A90965517K484816K201132K093786J929306J810417J512949J282960J158041
21605B05438924Q75571N70245K52352J70089m5276l46157n18396o22664q89909
21596B04884779j252588j585076j728410j752219j943619k103222k276884k381931
$$ y = [78965264, 80971228, 82852597, 84842254, 87042996, 89233415, 91337403, 93452066, 95727529, 98147668, 100575421, 103023315, 105622781, 108208848, 110900093, 113759160, 116709347, 119562504, 122431512, 125417749, 128475833, 131608779, 134852981, 138036619, 141289369, 144591870, 147918320, 151214808, 154489228, 157855235, 160979291, 164126898, 167359816, 170568763, 173859290, 177035962, 179943817, 182863557, 185647861, 188269949, 190965517, 193450333, 195651465, 197745251, 199674557, 201484974, 202997923, 204280883, 205438924, 206314495, 206884740, 207137092, 207307181, 207261905, 206915748, 206397352, 205774688, 204884779, 203632191, 202047115, 200318705, 198566486, 196622867, 194519645, 192242761, 189860830]
21588A89860830k460794k744136k850663k976924k901832k959031l193606l224080
21580A66549764l129248l153504l209866l164046l143449l174343l150213l178882
21572A41246213l195515l110843l124364k968702k839775k998689k933019k694247
21564A17381059k684355k741247k689756k589528k436654k420453k369959k367527
21556I7081580k261341k295913k224073k104816k198670k067219j982736j928075
21548H0018737j847297j742106j795353j872502j664761j635618j513714j393918
21540F6553468j528693j467138j550560j308291j198264j203654j357405j246456
21532E5693007j136789j114814j135610j227926j109853j081451r05514r58889
$$ y = [189860830, 187400036, 184655900, 181805237, 178828313, 175926481, 172967450, 169773844, 166549764, 163420516, 160267012, 157057146, 153893100, 150749651, 147575308, 144425095, 141246213, 138050698, 134939855, 131815491, 128846789, 126007014, 123008325, 120075306, 117381059, 114696704, 111955457, 109265701, 106676173, 104239519, 101819066, 99449107, 97081580, 94820239, 92524326, 90300253, 88195437, 85996767, 83929548, 81946812, 80018737, 78171440, 76429334, 74633981, 72761479, 71096718, 69461100, 67947386, 66553468, 65024775, 63557637, 62007077, 60698786, 59500522, 58296868, 56939463, 55693007, 54556218, 53441404, 52305794, 51077868, 49968015, 48886564, 47981050, 47022161]
21524D7022161r65518r71716r13425p67566p28350q95079q39668o12313p96669
21515C9531857q11741p66239o65566o84895o58266o82697n90283o06720n19993
21506C3545457o37498n85335n40114n44009n98294n58986n60398m68518m58914
21497B8593391n35704n23792n24968m59446l59244l65917l55788m44065n15490
21488B4508977k69770l41530k96029m01212l41986l03348l89228l52458l19271
21479B1494145l37770l09116k63990k99042k42721l40369k87260k86812k63602
21470A8863463k68920k54452j90481k67240k65534k28203k57548j28835j67629
21461A6834621l20013j91665j45972k29158k67303k98933l04500j92405j02348
$$ y = [47022161, 46056643, 45084927, 44171502, 43403936, 42675586, 41780507, 40940839, 40328526, 39531857, 38720116, 37953877, 37288311, 36603416, 35945150, 35262453, 34672170, 34065450, 33545457, 32907959, 32322624, 31782510, 31238501, 30640207, 30081221, 29520823, 29052305, 28593391, 28057687, 27533895, 27008927, 26549481, 26190237, 25824320, 25468532, 25024467, 24508977, 24239207, 23897677, 23601648, 23200436, 22858450, 22555102, 22165874, 21813416, 21494145, 21156375, 20847259, 20583269, 20284227, 20041506, 19701137, 19413877, 19127065, 18863463, 18594543, 18340091, 18149610, 17882370, 17616836, 17388633, 17131085, 17002250, 16834621, 16514608, 16322943, 16176971, 15947813, 15680510, 15381577, 15077077, 14884672, 14782324]
21452A4782324j76250j97913k75775k73952p4578k24235j83551k42365k05341
21443A2928364j11382o9851j29101r5670k06825k05844j1625j62739j77496j16958
21433A1640873j00056j23787j64412j14396j17302j40556R192j52315j01710q8148
21423A0547383p2256m9279j36639k06684r6725n8052k33121j33640j27652p0566
21413I362769N8709j16672j51041j2389M0906j54343j66924r5068j33721m6799
21403H585427o8411j39694o3175n7288n2595j83556j83218P982L4038j15141j5976
21392G748393j09095j32747j06312q3556r1675q4983n0489L3655q150j17412q2435
21381F915194j39669l6820J5843r7777n3097p8160p4738r4694l2625p537O778
$$ y = [14782324, 14606074, 14408161, 14132386, 13858434, 13783856, 13559621, 13376070, 13133705, 12928364, 12816982, 12747131, 12618030, 12522360, 12315535, 12109691, 12098066, 11935327, 11757831, 11640873, 11540817, 11417030, 11252618, 11138222, 11020920, 10880364, 10889556, 10737241, 10635531, 10547383, 10475127, 10425848, 10289209, 10082525, 9985800, 9927748, 9694627, 9560987, 9433335, 9362769, 9421478, 9304806, 9153765, 9141376, 9182282, 9027939, 8861015, 8765947, 8632226, 8585427, 8517016, 8377322, 8314147, 8256859, 8204264, 8020708, 7837490, 7845472, 7879510, 7764369, 7748393, 7639298, 7506551, 7400239, 7316683, 7225008, 7140025, 7089536, 7123191, 7115041, 6997629, 6915194, 6775525, 6738705, 6754548, 6656771, 6603674, 6525514, 6450776, 6356082, 6323457, 6315920, 6322698]
21370F322698n8913l3823o6303j8221n4578j72340j2126p3025n6332o1050p287
21359E708700O3196K1686o9742m7498o1708n2112o8362l501J2350o0359l1721
21348E410929j54356j20732l4651o8871L9878N0452o2006n6298M6803l7788q0451
21337D932909q2482j2232K5820n9531j31495P5993K9738l2089q9194j03187j6831
21326D537419m6714R9543j25205p9610q5965p6819l3608j28856K4067R3416M1569
21315D219237M7274j18767j07157j2599j5451J02037Q901k3562n2997m8994k9369
21304C968553r4249j2443J8377j30056N4030L977n6262j1933k6991p8119p9217
21293C555667k8094q9709j9541N1162l8894j17954M8387N7793J2590j02620m3913
$$ y = [6322698, 6263785, 6229962, 6163659, 6145438, 6090860, 5918520, 5906394, 5833369, 5777037, 5715987, 5708700, 5771896, 5793582, 5723840, 5676342, 5614634, 5562522, 5494160, 5490659, 5503009, 5442650, 5410929, 5256573, 5135841, 5101190, 5032319, 5072197, 5122649, 5060643, 5004345, 5051148, 5013360, 4932909, 4850427, 4838195, 4864015, 4804484, 4672989, 4748982, 4778720, 4746631, 4657437, 4554250, 4537419, 4490705, 4590248, 4465043, 4385433, 4299468, 4222649, 4189041, 4060185, 4084252, 4177668, 4219237, 4266511, 4147744, 4040587, 4027988, 4012537, 4114574, 4123475, 4099913, 4046916, 3997922, 3968553, 3874304, 3861861, 3880238, 3750182, 3804212, 3808189, 3751927, 3739994, 3713003, 3634884, 3555667, 3527573, 3437864, 3418323, 3469485, 3430591, 3312637, 3361024, 3418817, 3431407, 3328787, 3284874]
21282C284874n2717q8025j4020l7058m3925L2043M365L0087j6065o526q8899p6594
21270B927540l5605l9364j33139o5786L8948L8635r107o156J73082J38530j04271
21259B923307j28599p207L4174p0154j31581K3332M7310J8746l6514o3268o7357
21248B542189Q740O2173k0692j46984R690M5804k0948o4640J6486J5415j3776
21237B433457J34q1390j9193J8649k0053J22660N9152l4460q3408m0958j9688
21226B334902n7354j2775k9005n8615n7479K9624O2617N1325R3616j2131j2347
21215B332378K321m7144k1302j32343k7239O2701n4919k8258j4865p1759k5431
21204A974140m5459l9534q5468L1269R3145L8643k177j05726k5091M5505R5783
$$ y = [3284874, 3232157, 3144132, 3130112, 3093054, 3049129, 3081172, 3085537, 3115624, 3099559, 3093033, 3004134, 2927540, 2891935, 2852571, 2719432, 2653646, 2692594, 2731229, 2722122, 2715966, 2889048, 3027578, 2923307, 2794708, 2787501, 2821675, 2751521, 2619940, 2643272, 2690582, 2709328, 2672814, 2609546, 2542189, 2550929, 2613102, 2592410, 2445426, 2455116, 2500920, 2479972, 2415332, 2431818, 2447233, 2433457, 2433591, 2352201, 2333008, 2351657, 2331604, 2454264, 2513416, 2478956, 2395548, 2354590, 2334902, 2277548, 2264773, 2235768, 2177153, 2119674, 2149298, 2211915, 2263240, 2356856, 2344725, 2332378, 2334699, 2287555, 2266253, 2133910, 2106671, 2169372, 2114453, 2086195, 2071330, 1999571, 1974140, 1928681, 1889147, 1803679, 1834948, 1928093, 1966736, 1964559, 1858833, 1833742, 1879247, 1975030]
21193A975030L063m1601L3175o221o1104n6704Q9882N4746K4087L436l0151m1876
21181A945762J336j19396k8386p548o5289M7457o0140Q0689O7933l3437o1129
21170A767852r2610j13609l2058O8117Q4334N2383k3667m4729m6597P172Q6712
21159A713300Q0027l2016j79509J1383Q3230Q01r6228j44203J1953J21849m2108
21148A528479O2088K6999k7960R3759J51038q2174K79l9078j15651j20729j07251
21137A369799K1120o818k9823L6243Q315k1464l5086j1093l180j0663r4266P7574
21125A300658O0211O2642J18632j21657l6068O3925n9948j9156L4487L1031j3609
21114A421148j7492o4976r670N763N7333J4777j30959m1193j3076k9497p8206
$$ y = [1975030, 1978093, 1936492, 1969667, 1963446, 1902342, 1845638, 1935520, 1990266, 2014353, 2017789, 1987638, 1945762, 1947098, 1827702, 1799316, 1791768, 1726479, 1773936, 1713796, 1794485, 1862418, 1828981, 1767852, 1675242, 1561633, 1529575, 1597692, 1682026, 1734409, 1710742, 1666013, 1619416, 1626588, 1713300, 1793327, 1761311, 1581802, 1593185, 1676415, 1677216, 1580988, 1436785, 1448738, 1570587, 1528479, 1590567, 1617566, 1589606, 1683365, 1834403, 1752229, 1752508, 1713430, 1597779, 1477050, 1369799, 1390919, 1384101, 1354278, 1390521, 1398836, 1377372, 1342286, 1331193, 1328013, 1317350, 1223084, 1300658, 1360869, 1423511, 1542143, 1420486, 1384418, 1448343, 1388395, 1369239, 1403726, 1434757, 1421148, 1403656, 1338680, 1329010, 1334773, 1392106, 1406883, 1275924, 1234731, 1221655, 1192158, 1113952]
21103A113952J87982J32104k6427r7108j01967M9578L9287p5562k9284k5871J0917
21092A177601P4201m4021l8270j00656j0736q052l7484J50186M4420j43680o8698
21081I94811p1189K8039L9261N945J2134L47J6183l1479m1633l3308J08827P4653
21069A102591n5437j10457m6087J81583Q0745O013J8531r2047j06612M23n8505
21058I20741K8242j2407n3039J09594l3989j10500j31276O3154M1023M7450N3839
21047I22832L4415j9032m221O6215O1092K4495j19895l9242R4996j13085n830
21036I02740R3366K7510m6951l4146N2069M8058M0946O8721q1558o7197k4278
21025I79280L3476j21165M3627r930j33885R152p497Q4018k9593l1301n118M729
$$ y = [1113952, 1301934, 1434038, 1407611, 1310503, 1208536, 1258114, 1297401, 1221839, 1192555, 1166684, 1177601, 1251802, 1207781, 1169511, 1068855, 1058119, 1050067, 1012583, 1162769, 1207189, 1063509, 994811, 923622, 951661, 990922, 996867, 1009001, 1009348, 1025531, 994052, 952419, 919111, 1027938, 1102591, 1047154, 936697, 890610, 1072193, 1152938, 1158951, 1177482, 1085435, 978823, 979246, 920741, 948983, 936576, 883537, 993131, 959142, 848642, 717366, 780520, 821543, 868993, 922832, 957247, 938215, 933994, 1000209, 1061301, 1085796, 965901, 926659, 1021655, 908570, 902740, 996106, 1023616, 976665, 942519, 994588, 1042646, 1083592, 1152313, 1070755, 1003558, 979280, 1012756, 891591, 935218, 925288, 791403, 800555, 793058, 877076, 847483, 816182, 811064, 815793]
21013H15793l807P8733k6378J481o4003m1321k0072J5043P6287o3572R2856M7166
21001I08206O3393K3106r9215j909p0679o6644q341k1409p9272o6052P6589J20223
20989G77996O920P546p7370j6858O0905N8892l0844p0544L279m0726M7157m4339
20977F82014L0592p0883p9435M0112k8624N7182J35051j0691q119J0692n193n9669
20965F93029j3771k7155j06131J9770J34482m2876K0632Q7981N4734l5542j926
20954G83227R2317j3915n3047j16423N833m6583o2147j17976r7262r856N6443
20943D20611R9245N4268r4608L2132L6537o4561P199Q2503J22785J5001l5405
20932F75707p3245M9096q4446m5959o976J42371p855Q46j15271K3155Q6679k3624
$$ y = [815793, 811986, 890719, 864341, 865822, 801819, 760498, 740426, 755469, 831756, 768184, 861040, 908206, 971599, 994705, 895490, 893581, 822902, 756258, 747917, 726508, 647236, 581184, 657773, 777996, 784916, 792462, 715092, 698234, 759139, 818031, 787187, 716643, 719922, 679196, 726353, 682014, 712606, 641723, 562288, 602400, 573776, 630958, 766009, 755318, 747199, 757891, 752698, 693029, 679258, 652103, 545972, 565742, 700224, 657348, 677980, 765961, 820695, 785153, 783227, 875544, 861629, 808582, 692159, 697992, 651409, 589262, 471286, 374024, 364168, 420611, 519856, 574124, 479516, 511648, 548185, 483624, 490823, 573326, 696111, 711112, 675707, 602462, 651558, 567112, 521153, 514177, 656548, 648693, 649539, 534268, 557423, 644102, 620478]
20920F20478r4767m3542J23758N5136j01195n4454J36891j18844J9991Q1221p7292
20909E47381K9722l0010k8463P3211N9925q0663l4198J40239M8669n4068m1419
20898F30326k4943O2116R8187K163q7865l1382K9592K8919j35588p2447m5588
20887D53490l8552j2105Q9633N8671M1638N3246o4571k2800o6598p9603P5035
20876D87484J34703m519j21416o3032l7232l7665j321n6431q944J25555O5011
20865D82193Q8550j040k5920n6169j30726j9907j2841O1000J1260Q3311j629m8269
20853D29813m0884L433k425N6263Q7701R8633r728m5067j22686k0290l9207j0484
20841C85072J5954L5890M7753J08359l4434r1742R1080J20047r7943j73321k767
$$ y = [620478, 525711, 482169, 605927, 661063, 559868, 505414, 642305, 523461, 543452, 624673, 547381, 577103, 547093, 518630, 591841, 651766, 571103, 536905, 677144, 725813, 671745, 630326, 605383, 667499, 765686, 767849, 679984, 648602, 678194, 707113, 571525, 499078, 453490, 414938, 402833, 492466, 551137, 592775, 646021, 581450, 558650, 492052, 412449, 487484, 622187, 617668, 496252, 433220, 395988, 358323, 357002, 300571, 291627, 417182, 482193, 570743, 569703, 543783, 487614, 356888, 336981, 324140, 385140, 396400, 479711, 478082, 429813, 388929, 392362, 389937, 446200, 533901, 632534, 622806, 577739, 455053, 434763, 395556, 385072, 401026, 436916, 484669, 593028, 558594, 466852, 557932, 677979, 580036, 406715, 403948]
20830D03948r40M2792q2467L00p398k9330q5769q670N0219J38238r3849L3360
20818C60434Q6429J289l4684j25715n1943J44836k0765N3506P2299n1337l945
20807D30404j4036r3676k7317P4498j8508M0943Q0490k0042j7970Q876q0200o3203
20795C00259k2446o434l017q666L3748j2338R8608m2208o19J5938P4285J08494
20783E35604p2665j14965n9925j7404L7501M9994k6503K0879O5125O2903J5213
20772D95757J5995L1861j29745q5759j9709l4703N9M0628K6347K3769J3888m3282
20760C35106K4162R2481n9361m340Q5198J3896k5588m9269j48980o1240J61455
20749C63520J4731N2488L5557n0199m1120j14432L4936p8777j8364L9301R3340
$$ y = [403948, 403008, 445800, 363333, 363633, 356235, 326905, 241136, 232466, 282685, 420923, 327074, 360434, 446863, 448152, 413468, 287753, 235810, 380646, 359881, 413387, 485686, 434349, 430404, 416368, 322692, 295375, 369873, 351365, 392308, 472798, 452756, 434786, 443662, 363462, 300259, 277813, 271379, 268362, 259696, 293444, 281106, 379714, 337506, 336887, 352825, 427110, 535604, 462939, 347974, 288049, 270645, 308146, 358140, 331637, 352516, 417641, 480544, 495757, 511752, 543613, 413868, 328109, 308400, 273697, 273756, 314384, 340731, 364500, 378388, 335106, 359268, 451749, 392388, 388048, 473246, 487142, 461554, 412285, 263305, 202065, 363520, 378251, 430739, 466296, 416097, 374977, 260545, 295481, 216704, 198340, 237641, 330981]
20738C30981k7923J12677P8899p5568q3257R4360K0805m3622M6178j01337l0266
20727C21927k1925p251o2544J1847M938j3511J6503N3228j25196N4642L9362N3509
20715C25529j4047Q2421m2904J5126L9536L3589J12433j53622j15513L9146j23348
20704A98346j26679j2385J59084k7297l5090J8225L5319J7443N3955O6896j8260
20693C29557o6206l3709l9964N1235J021n139Q1448O7351K8959o9187O0587L4995
20681D40948j55966j8222l6630k3812L2435l3699m5437K6838L0649p2J8095R6125
20669C31252m6182r073k1162L6092R8911R100l7269O094k0522M4170p91n6660
20657C33960m2295M9364j5730l9343m8327J01955l718n3129k7881R7943Q0692
$$ y = [330981, 303058, 415735, 494634, 419066, 335809, 430169, 450974, 407352, 453530, 352193, 321927, 300002, 292751, 230207, 242054, 246992, 233481, 249984, 303212, 178016, 232658, 272020, 325529, 311482, 393903, 350999, 366125, 405661, 439250, 551683, 398061, 282548, 321694, 198346, 71667, 59282, 218366, 191069, 155979, 174204, 209523, 226966, 280921, 347817, 329557, 263351, 229642, 189678, 240913, 241934, 236795, 318243, 385594, 414553, 345366, 405953, 440948, 284982, 266760, 230130, 206318, 238753, 205054, 159617, 186455, 217104, 217032, 235127, 331252, 285070, 275997, 254835, 290927, 389838, 398938, 361669, 367763, 347241, 391411, 390620, 333960, 291665, 341029, 325299, 285956, 237629, 339584, 335866, 282737, 254856, 352799, 433491]
20646D33491j6445p1456j01339L7057Q938k6143N6553Q0171j23663j20631k583
20635A53950J38630Q3332N8660M7302j13204n392L0823l9271p0008j40151P7566
20624B22237M1491J6109R8391m6760k04964k2759N9355Q9510m6984j17161j54682
20613f6217N8928J74202j3158L4312K0724N3014j20379L8840Q4513N1094N8584
20602C74457p3483r5816N1932n5612O9544N231p7461m5971P8682k9255p8870L3603
20590A56981N1405r8210J5247J34215L1083J5482N433l6714o4092J01711K3042
20579C35583j07592m4478j3448L4014J04260r3747q9076l5544L7334l0969r593
20568H6744k0510J384K21448N8252J4674m3670M1450J8103M4876p7753j38179
$$ y = [433491, 417046, 345590, 244251, 281308, 290246, 264103, 320656, 400827, 277164, 156533, 153950, 292580, 375912, 434572, 481874, 368670, 363278, 394101, 354830, 284822, 144671, 222237, 263728, 279837, 378228, 331468, 126504, 103745, 163100, 252610, 205626, 88465, -66217, -7289, 166913, 153755, 188067, 208791, 261805, 141426, 180266, 264779, 315873, 374457, 300974, 205158, 257090, 201478, 271022, 276253, 198792, 152821, 231503, 202248, 123378, 156981, 208386, 110176, 125423, 259638, 290721, 306203, 311636, 274922, 210830, 312541, 335583, 227991, 183513, 170065, 204079, 308339, 214592, 125516, 89972, 127306, 96337, 86744, 66234, 67618, 289066, 347318, 361992, 318322, 359772, 377875, 422751, 344998, 206819]
20557B06819p8298j4342k7031j48836N5708J28939K995J128L8788M4050L9958
20546B49878L5840l9172j02872q6693l764j6944R5270J6287o4303N5883q2613
20535E6797Q6733O2618j40036m1085J46122J76312P6060o2022K8791p3185j0517
20524C06588q73j8361q3243n0519k4378N7039k8006r3173o5540P4281l7943J2044
20512D7916P2504k0918j32253L1416N9046M4341o5906J02233J15985K01110q9521
20501C65953n5619o610M3948K8158o7857m1917J42728K4588k5625j50534j11603
20490A45610k6507K0330n7095l81M296R1126j0346j3176o7190K2068K8352m0528
20478I6559j03662R9339J18453K4847r4284j4035J10684L8721n8980J9472j27378
$$ y = [206819, 128521, 114179, 87148, -61688, -5980, 122959, 125954, 127082, 165870, 209920, 249878, 285718, 246546, 143674, 56981, 53217, 36273, 131543, 147830, 83527, 139410, 56797, 143530, 206148, 66112, 25027, 171149, 347461, 423521, 361499, 390290, 317105, 306588, 305715, 287354, 204111, 153592, 129214, 186253, 158247, 65074, -466, 73815, 35872, 47916, 120420, 99502, -32751, -1335, 57711, 102052, 36146, 138379, 254364, 455474, 365953, 310334, 303724, 347672, 375830, 307973, 266056, 408784, 433372, 407747, 257213, 145610, 119103, 139433, 82338, 81957, 86253, 177379, 167033, 153857, 86667, 108735, 137087, 96559, -7103, 92236, 210689, 235536, 141252, 127217, 237901, 276622, 217642, 237114, 109736]
20467A09736k2988k2627n0078m9138L2603N5930k974m4535O0144o6338l6263O0785
20455B4257J44983J4586N498o186L6042k568j38492n2074P0546J07198l8504K0861
20443A86147n0992o8559M557L2397m4189r221L6719M4337J22777N1543l5496J379
20431B71399j20158L365K622j16057N418N3113J0796m2620j53866J5560R4966
20420B4538J04550R1534J4436r284n1399M8281l307j8285J5259M60o7579p5140
20408G4064M8835L1537K8282l1587j814l1424r6042q2536J16800J19716j54889
20397B0942q7164J10372R3347K9737n4996j2000p1204L5319K7938m750L4598k2057
20385A00082k5547K2667N1305j26418j4456N5332R309o6528n1668J58188N8876
$$ y = [109736, 86748, 64121, 14043, -35095, -2492, 53438, 50464, 5929, 66073, -265, -36528, 24257, 169240, 183826, 189324, 183138, 219180, 216612, 78120, 26046, 96592, 203790, 165286, 186147, 135155, 66596, 71153, 103550, 59361, 50140, 86859, 131196, 253973, 305516, 270020, 271399, 151241, 154606, 157228, 41171, 46589, 99702, 110498, 67878, -85988, -70428, 24538, 129088, 220622, 235058, 225774, 174375, 222656, 219349, 201064, 216323, 216783, 149204, 74064, 122899, 154436, 182718, 151131, 149317, 117893, 21851, -60685, 56115, 175831, 20942, -66222, 44150, 137497, 167234, 112238, 100238, 29034, 64353, 92291, 87541, 122139, 100082, 74535, 97202, 148507, 22089, 7633, 62965, 72274, 5746, -45922, 112266, 171142]
20374A71142p9644J179J00328L294q9498J12325M1466o0052r5479Q2256P7885
20363B65202j8406l5436l8904M3164o1999r1490O62J876k2643M249N5542n385
20351I6432n4914n6478n7064K9343J00863M1045N2019R3217n9927o7013N8737
20340A76260M9930k1307r5898p0436J4946n3569j2319J4722K9019j21445p092
20329i7189J69930J64656j2130j20428O6892j970n6855p1967n9576J07139J470
20318H9972J2454R1130J15426l6750N5951P4701L7344j03525r012j21614k7839
20307A78238q474q7920p0829k1597m13R9199L4190k22229p4364J93080N2248n3554
20295A7575J9377k1953k452N4731k1P7830J23689n0108O9602J92602k9341q4860
$$ y = [171142, 91498, 92677, 193005, 196299, 106801, 219126, 260592, 200540, 105061, 187317, 265202, 246796, 211360, 172456, 215620, 153621, 62131, 62793, 64669, 42026, 46275, 101817, 96432, 41518, -14960, -72024, -42681, 58182, 99227, 151246, 244463, 184536, 117523, 176260, 226190, 204883, 108985, 38549, 53495, -74, -12393, 2329, 31348, -90097, -97189, 72741, 237397, 225267, 104839, 171731, 169761, 112906, 40939, -18637, 88502, 89972, 102426, 193556, 308982, 272232, 328183, 402884, 440228, 336703, 327691, 206077, 178238, 169764, 81844, 11015, -10582, -10995, 88204, 122394, -99835, -174199, 18881, 71129, 17575, 36952, 14999, 12547, 67278, 67257, 145087, 268776, 218668, 288270, 480872, 451531, 366671]
20283C66671k0638n2354L5661J9689j31511n2930J268n4063N2537j5713l9813
20272A08804j56878l1603K4301M2162j074J2865J00134l0746k5373j6969J7243
20261D2866l5775J30711R7921n5359j8308j04453K6161L9645M0582l5716J05947
20250B34222R723o5302k5282k0993k0410R9977O465J2181J18658p5284K882l6245
20238B40592j6333O9946o7185N8724j33961j02666m2156N4338K4907O1961M9613
20227A97780j3769m8713O175M8536n5667P34p030n2552j2544K635n2084J8465
20215C1966m2631L0910l797O2565J09752L5916j3497l2147j0073j5986m7445l951
20203A01582N5769O5985n3760j75183J3162l972K1092J04924Q5101k6246r7493
$$ y = [366671, 346033, 293679, 329340, 349029, 217518, 164588, 165856, 111793, 164330, 148617, 108804, -48074, -79677, -55376, -13214, -14288, -1423, 98711, 67965, 42592, 25623, 42866, 7091, 137802, 235723, 180364, 162056, 57603, 83764, 123409, 163991, 128275, 234222, 243945, 178643, 153361, 132368, 111958, 211935, 218400, 230581, 349239, 273955, 276837, 240592, 224259, 294205, 227020, 285744, 151783, 49117, 6961, 61299, 86206, 148167, 197780, 184011, 135298, 141473, 190009, 134342, 135076, 128046, 75494, 62950, 65585, 13501, 31966, -10665, 20245, 16448, 79013, 188765, 224681, 211184, 179037, 168964, 152978, 105533, 101582, 157351, 223336, 169576, -5607, 7555, 3583, 24675, 129599, 214700, 188454, 90961]
20192I0961j5433p5922q8741m4479N4344N6443J20011j440k2862K1472J6116o2872
20180D7598K2527J06536L3830n1559M276J3727j84125j09875r6770N5193K20779
20169F2137L9952J2486P110p3095m5835Q4227j6576L7044o8835m5653L1267n9193
20157c4964j9093l5913J0630Q4191J12882K6075j36136M6215L8500m5666L7287
20146H4008o87j06142k3155M4973M224j8088o660o9016M5584O0437j1756N0818
20134E4540Q3273J6201k6205k1476O008k1095k0466J1013p6146K831J26389m0809
20122I4058J5583q187k3418j13162q0159P0844J26046m2362n6163J7032l6349
20111c6237N4955K4299K9630R8362j1553R340O0459m284j65023m4750N4841m1014
$$ y = [90961, 75528, -394, -89135, -133614, -79270, -22827, 97184, 95744, 72882, 94354, 110470, 47598, 70125, 176661, 210491, 158932, 163208, 176935, -7190, -117065, -213835, -158642, 62137, 102089, 114575, 121685, 48590, 2755, 86982, 70406, 107450, 38615, -7038, 24229, -34964, -54057, -89970, -79340, 4851, 117733, 143808, 7672, 53887, 92387, 46721, 84008, 83321, -22821, -45976, -1003, 3221, -14867, -21527, -90543, -44959, 15478, 3722, 54540, 137813, 154014, 127809, 106333, 112341, 91246, 70780, 81793, 5647, 8478, 134867, 94058, 109641, 101454, 78036, -35126, -115285, -44441, 81605, 39243, -16920, 112, -36237, 18718, 43017, 72647, 171009, 159456, 168796, 229255, 224971, 59948, 15198, 70039, 29025]
20099B9025r7022M1050L0187O3613Q9635l9983P9447j7279L3605k5038j3783o4072
20087A09385m7439R285M6373Q0811j4570j45142m2154R8677J32194N5785p9260
20076B03945p4467n5693k6305p8922K585m9786m1712L8795J21763J37677l8286
20065A39594r3439p6914j1622J0488P7643j13565O2870J1058K1919J0197K6315
20054F4544o6374m0898Q9674N3003j23486l9586J08183P231j7500K0266k2971
20043C2086k957l2376J7749J00595L1830j13048J6257Q7151K9355p065L3640p6585
20031A16632j09960Q7973J1751j45863l1741l7223o7533P5923m3393N3510P8829
20020a1095J13821Q5821R7687j06669j73397o7765N5863N8406O1417L3199P6877
$$ y = [29025, -67997, -26947, 3240, 66853, 156488, 116505, 195952, 178673, 212278, 187240, 173457, 109385, 61946, 71231, 117604, 198415, 183845, 38703, -3451, 95226, 227420, 283205, 203945, 129478, 73785, 47480, -31442, -28857, -78643, -120355, -81560, 40203, 177880, 139594, 46155, -30759, -42381, -31893, 45750, -67815, -4945, 6113, 28032, 38229, 64544, -1830, -42728, 46946, 99949, -23537, -63123, 45060, 52291, 34791, 55057, 32086, 29129, -3247, 14502, 115097, 146927, 33879, 50136, 137287, 166642, 159577, 193217, 116632, 6672, 94645, 106396, -39467, -71208, -108431, -175964, -100041, -143434, -89924, -11095, 102726, 188547, 286234, 179565, 6168, -61597, -5734, 52672, 114089, 147288, 224165]
20009B24165o1766M2961j8714p6011m5498o7633Q043O0691o2625J02704j4328
19998I1989r0882O567J8184j4930M0375k1531M9680L8113O8192k1452J132r799
19986A55638J23082k7564p8204k563O613p3856l3803o3243O1956J32117J05042
19975C05215J2775L0615j1891m3581q2339j3759K6333J0299k0360p5818q2045
19964E5444N100r9293p0496Q0082R4453J3432n6900k8307N741P4568P3574l0438
19952A16960J3832m2308K9729O400j14246l6101O8330M3559n1845K0951M8986
19941A04247m0649o259O1215K6302p5106p2697j11843K7715r6o1069J16464J36472
19929A04696o4487J2282j2467o366J3074O4003k2613K4552R969L9708j4634j45973
$$ y = [224165, 162399, 205360, 186646, 110635, 65137, -2496, 5547, 66238, 3613, 106317, 91989, 1107, 7674, 25858, 10928, 51303, 29772, 79452, 117565, 185757, 164305, 165437, 155638, 278720, 251156, 172952, 170389, 177002, 103146, 69343, 6100, 68056, 200173, 305215, 317990, 348605, 336714, 293133, 210794, 197035, 223368, 233667, 213307, 137489, 55444, 60544, -38749, -109245, -29163, 65290, 78722, 21822, -6485, -744, 73824, 147398, 116960, 130792, 88484, 118213, 124613, 10367, -25734, 42596, 86155, 34310, 55261, 104247, 63598, 57339, 118554, 144856, 69750, -2947, -114790, -87075, -87171, -148240, -31776, 104696, 40209, 52491, 40024, 33658, 46732, 110735, 88122, 112674, 122643, 162351, 147717, 1744]
19917A744Q8358k876K1859O4708o9938k1056l1873M9886M4518J4733M5612O2421
19905B68096r5434k7071L9209M148q4388k11435P047m7475j45542j6548Q3886
19894b25507M6888J12575k8465R6757j2250j04473J73241N9455n8129o7218j16306
19883a23432P7475O3057p429n529R00M1618J02769k9781o9469j3942J1425Q7034
19871A34696J21608J9377l8282r8970j39626j3355M8511K6866J22971O1874r1698
19860A53972Q889O334m8318J3993k8688n9184j35517j02004J69711J8433L5953
19849C3574K6177M6112n7367Q4701O723j16117l0476K5590o249N1643r1094q9180
19837a15963r806P5447J56415K9042j5012R4004r0593m1938p4730k9597j2371
$$ y = [1744, 90102, 87226, 109085, 173793, 103855, 82799, 50926, 100812, 145330, 160063, 205675, 268096, 172662, 145591, 184800, 188948, 104560, -106875, -99828, -147303, -292845, -309393, -225507, -178619, -66044, -94509, 2248, -10002, -114475, 58766, 118221, 60092, -7126, -123432, -45957, 17100, 9671, 4142, 5042, 46660, 149429, 119648, 50179, 36237, 47662, 134696, 256304, 275681, 237399, 138429, -1197, -14552, 33959, 60825, 183796, 245670, 153972, 162861, 169195, 120877, 134870, 106182, 46998, -88519, -190523, -20812, -2379, 33574, 59751, 105863, 48496, 133197, 139920, 23803, -6673, 18917, 12668, 64311, -26783, -115963, -125769, -50322, 106093, 135135, 120123, 214127, 123534, 81596, 6866, -22731, -35102]
19826c5102J38316O1524O0031j13146q6319p5300J1026P4838R744o5809j40640
19815a60837L3800M4843J135Q6254J01482J08424J8567r1982q2984l1622M0594
19804F7674p832N5276J20815o4940j21152p2789J42824L2282o8477r5219P4280
19793F2742J21641j6769m5909M8351J0364k4043m8324n5423O7422P7402m5428
19782A52026m8672r6131k08024J4435R1500P5546M2183o9168k4042P3997L9116
19771D2766n4460L2573J25647P164l0080j57060o6457J05557K50540L3838j31284
19760A58744q3040J19878J2580l6065o8338p0910N1050j4207N0277J5669M472
19749A40110j143p0196J2952P9583o812q8984r953J15415K0451J13707k0457j37591
$$ y = [-35102, 103214, 164738, 224769, 111623, 25304, -49996, -38970, 35868, 45612, -20197, -160837, -127037, -82194, -81059, 5195, 106677, 215101, 233668, 141686, 58702, 27080, 67674, 59842, 115118, 235933, 170993, 49841, -22948, 119876, 152158, 83681, -11538, 62742, 184383, 167614, 121705, 170056, 180420, 156377, 108053, 52630, 120052, 197454, 152026, 103354, 7223, -200801, -186366, -94866, -19320, 22863, -46305, -70347, 3650, 42766, -11694, 20879, 146526, 153690, 123610, -33450, -99907, 5650, 256190, 290028, 158744, 75704, 195582, 208162, 172097, 103759, 32849, 83899, 69692, 119969, 135638, 140110, 138967, 68771, 81723, 161306, 154494, 65510, 55557, 170972, 191423, 305130, 284673, 147082]
19737A47082M4897m3597j05824J1065q3940K1450M2112M5339K7893q3202K3144
19726D6419L0165k8964J05741K1788r6649n1850j5091n7381K1171J36490N8102
19715A69941R167q5732n8115l1289k5401R1490n6044P9750R5809m9346j07318
19704C2912j68759R087K06921J61986m7714j9009M1871j29159K537Q2470n2541
19693A20602N5952l180o2293l9016J31508N4722j36232m6318L3904Q8168N3579
19682B51396l8102k3122L0228J30362P7158J43498J59705l8569L1205L4446J23440
19671H81645M7679j05175j0404m6954j51051M8p2623O4637J50089p0895R6171
19660G83167J13186Q9441M6206N6476l1107j49544j28722j9737j8809Q1179J5704
$$ y = [147082, 191979, 148382, 42558, 53623, -30317, -8867, 33245, 78584, 106477, 23275, 46419, 76584, 47620, 153361, 175149, 78500, 26650, 11559, -45822, -24651, 111839, 169941, 179108, 93376, 35261, 3972, -21429, 70061, 14017, 93767, 189576, 140230, 32912, -135847, -126760, 80161, 242147, 194433, 175424, 217295, 88136, 90673, 173143, 120602, 176554, 173374, 111081, 72065, 203573, 258295, 122063, 75745, 109649, 197817, 251396, 213294, 190172, 220400, 350762, 427920, 571418, 731123, 692554, 723759, 758205, 881645, 929324, 824149, 813745, 766791, 615740, 615788, 543165, 607802, 757891, 686996, 783167, 896353, 985794, 1032000, 1088476, 1057369, 907825, 779103, 759366, 740557, 821736, 837440]
19649H37440j41835j00453j7713j37945j12281J0698l8122K5253o4016l3241O6397
19638B94182M2723j00123o9119o9146K2984J1958J05970N4626R4873J0544K1598
19627D21070O0879M4870o1728L9750r46n6351M8122R2742J89156J26861q6891
19616H17534O3425O4483J19682L7244J08192j7700k0757k394L5698J6754J9645
19605A241806l1312N5900n7614q1196j01130o7737j0558m2716n4982j07314j88094
19594E55053q0048M5677P980j05280j9148o4860j09951L000k3769K6404r687n0496
19582A74875J60547j08745k3368m6658R8848K3753q2949o0788j25077L3900J03080
19571A47418Q0284R2982M6363j12107m8929J2188J08252r7930j112P0492L4060
$$ y = [837440, 695605, 595152, 577439, 439494, 327213, 337911, 299789, 325042, 261026, 227785, 294182, 336905, 236782, 167663, 98517, 121501, 133459, 239429, 294055, 388928, 399472, 421070, 481949, 526819, 465091, 504841, 503895, 447544, 495666, 588408, 777564, 904425, 817534, 880959, 945442, 1065124, 1102368, 1210560, 1192860, 1172103, 1169709, 1205407, 1222161, 1241806, 1210494, 1266394, 1208780, 1127584, 1026454, 958717, 948159, 905443, 850461, 743147, 555053, 475005, 520682, 528662, 423382, 404234, 339374, 229423, 232423, 208654, 235058, 225371, 174875, 335422, 226677, 203309, 156651, 255499, 279252, 196303, 135515, 10438, 44338, 147418, 227702, 320684, 367047, 254940, 206011, 218199, 326451, 228521, 227409, 297901, 331961]
19560C31961Q6414j49068j27997O8293N0614j8472m4149j43647m6837J6116J02816
19549A26044N7963K7085m3454J8992R389j18799m9473L9956J2591N697j1227P924
19537H2688n9975J0598Q111j16349j2170Q3364J56875K437n7398N6014M5308J3624
19525B13127p1634O1554J45051L986o4807l8847j09282L4852J14548N6840m135
19514C41253k7538j28221k7246K3099J9149J5473J2223K8087j14932k1770j54745
19503c5168n8377J77326O0145j23023o0109L2633J27229o721Q965O2794M1993
19492B27687j905j74300l9122M0776O7288K4106j05005j39187j7184M7958R6774
19481B7886O4990J1177O9534L0276O5704o8758k5087P8242J90686o0535o5903
$$ y = [331961, 418375, 269307, 141310, 209603, 260217, 241745, 197596, 53949, 7112, 23228, 126044, 184007, 211092, 167638, 186630, 196019, 77220, 27747, 67703, 80294, 85991, 74764, 82688, 22713, 33311, 41422, -74927, -87097, -3733, 153142, 155579, 98181, 154195, 199503, 213127, 141493, 203047, 348098, 352084, 287277, 248430, 139148, 174000, 288548, 345388, 341253, 313715, 185494, 158248, 181347, 200496, 215969, 228192, 256279, 141347, 119577, -35168, -93545, 83781, 143926, 20903, -39206, -6573, 120656, 113935, 122900, 185694, 227687, 225782, 51482, 12360, 53136, 120424, 144530, 39525, -99662, -116846, -68888, 27886, 92876, 104053, 173587, 203863, 269567, 200809, 175722, 253964, 444650, 384115, 318212]
19470C18212j76380k3075J17437L5116o5645L1432M703R9309M6096q4415j11056
19459A91734j32146o3343P7258J22463P2210J11231j08726q526l1104m4401L9373
19448B26023Q2192N527o0944j10210o3355j4906P8507J12886j8752O7109J8740
19437C22817o0725k1760k8723q2984M6890J47103P7805J24090L1613J6128l2163
19426E40091j86275M0099L05R1213O1996J56092J28205O7252J425j26629j24161
19415F49613M1727J80606Q2811J6513R1560O7644L2048O8008N3310q386l00244
19404I75210j46700q8630j8500n9612j20101J43655J97747M8293k8860p3798o8950
19393G59754j35973n7080k0145k8559m9780j13957k9621J31251J31943O4694n6372
$$ y = [318212, 141832, 118757, 236194, 271310, 205665, 237097, 241800, 341109, 387205, 302790, 191734, 59588, -3755, 73503, 195966, 268176, 379407, 270681, 262155, 231051, 186650, 226023, 308215, 313742, 252798, 142588, 79233, 64327, 142834, 255720, 236968, 304077, 322817, 262092, 240332, 211609, 128625, 175515, 322618, 400423, 524513, 556126, 572254, 540091, 353816, 393915, 394220, 485433, 547429, 703521, 831726, 898978, 900403, 773774, 649613, 691340, 871946, 954757, 971270, 1062830, 1130474, 1162522, 1230530, 1283840, 1275454, 975210, 828510, 739880, 721380, 661768, 541667, 685322, 883069, 931362, 902502, 828704, 759754, 623781, 566701, 546556, 517997, 468217, 354260, 324639, 455890, 587833, 652527, 596155]
19382E96155J28346j4899N0210J312j040J2646J5773M055k142P7983m0781K0517
19370H48135J7144m7063L5799J81296J77268L20732J68407Q7871r9507l8977j32300
19359A518805j19238j20210q2772k023r4104R0373O5599J14229J37048m0321j00614
19348A366772J7662M1135j04113j57697j04211j47911q7277n6978o511K2128j06041
19337F76958m0874J6952P1007n3365o1741r4665j05762k0999o2223r51O4421O9515
19325D58273K0279j655m7060j4706M5785m6755j51295o162L9394J70689l3520
19314D33267k889J2485k4364K2368j6619n9963Q078R1636Q3720n2728l4725k7895
19302D32371O0665j8444p9456n7265K5422Q0439l7291o7928J20649J45899m9263
$$ y = [596155, 724501, 709602, 759812, 761124, 760084, 772730, 788503, 792558, 790416, 868399, 827618, 848135, 865279, 818216, 854015, 1035311, 1212579, 1533311, 1701718, 1789589, 1690082, 1651105, 1518805, 1399567, 1279357, 1196585, 1194562, 1100458, 1190831, 1256430, 1370659, 1507707, 1467386, 1366772, 1384434, 1425569, 1321456, 1163759, 1059548, 911637, 824360, 767382, 760871, 782999, 676958, 636084, 653036, 724043, 670678, 608937, 514272, 408510, 387511, 325288, 324337, 388758, 458273, 478552, 476897, 429837, 415131, 460916, 414161, 262866, 256704, 296098, 466787, 433267, 430378, 442863, 418499, 440867, 424248, 364285, 372363, 463999, 547719, 494991, 460266, 432371, 493036, 474592, 395136, 337871, 363293, 443732, 406441, 338513, 459162, 605061, 555798]
19291E55798m6240j0270o8162j08215J12730P2539L4427J05568M9608K2181L9682
19280G59646P1164Q0934O6608o636K8541J37297n8193j5115r5482r9959j14154
19269G54651j12538j05452n094J11466Q1364p9336J03419O4143j37485j09414
19259E65724N8836J03244J14110j06897j04370n8396j09935k0184O4470Q4240
19249E90842N8941J1425r179k4762L9754Q0750J564P7800J33019j558k7553j1482
19237I19561l2384K3508Q2747K1144o106l74n2752J13428J3065p9292m8882M3219
19225I96882J03398M0676O6371P132K08335J77291J9320L406M682j05299o0817
19214A461377r5508j22244j15770P3382L8995J685P992o844P963L2753O6960J19114
$$ y = [555798, 509558, 499288, 431126, 322911, 435641, 508180, 542607, 648175, 697783, 719964, 759646, 830810, 911744, 978352, 971716, 1000257, 1137554, 1079361, 1064246, 968764, 868805, 754651, 642113, 536661, 531567, 643033, 724397, 645061, 748480, 812623, 675138, 565724, 624560, 727804, 841914, 735017, 630647, 572251, 462316, 442132, 506602, 590842, 649783, 661208, 652029, 627267, 667021, 747771, 749335, 827135, 960154, 958596, 931043, 919561, 887177, 910685, 993432, 1014576, 1008470, 1008096, 955344, 1068772, 1081837, 1002545, 953663, 996882, 1100280, 1140956, 1207327, 1214459, 1422794, 1600085, 1619405, 1622811, 1627493, 1522194, 1461377, 1365869, 1243625, 1127855, 1201237, 1240232, 1241917, 1249909, 1243065, 1251028, 1283781, 1350741, 1469855]
19202A469855O5135R5137o5914j04316N4835N5927M8484K8256J20443O0814P1312
19191A899968Q1858J09769L0960J26828J45341K45703K59627K19870K11111M07227
19181C738262N21144N33652L97351K95977K97205K42530J92052J33214J14877
19172F466264K06812M62411O07631P76553J198312J551442K106906K842474L826157
19163B0044962M965832N569585M588152J837841j031472k044235j560843n58143
19155C1811679J065927K655515M477303P045623J0576011J5993893K4414142L6916477
19147A34956570N2517970O2838316N2468292K0948198r422241k6768113l6258721
19140B51280271m0884203l8064027k9267095j8468980q788162j101844M553244
$$ y = [1469855, 1534990, 1630127, 1564213, 1459897, 1514732, 1570659, 1619143, 1647399, 1767842, 1828656, 1899968, 1981826, 2091595, 2122555, 2249383, 2394724, 2640427, 2900054, 3119924, 3331035, 3738262, 4259406, 4793058, 5190409, 5486386, 5783591, 6026121, 6218173, 6351387, 6466264, 6673076, 7135487, 7743118, 8519671, 9717983, 11269425, 13376331, 16218805, 20044962, 25010794, 30580379, 35168531, 37006372, 35974900, 33930665, 32369822, 31811679, 32877606, 35533121, 40010424, 47056047, 57632058, 73625951, 98040093, 134956570, 187474540, 250312856, 302781148, 323729346, 314307105, 287538992, 251280271, 210396068, 172332041, 143064946, 124595966, 115807804, 114705960, 119259204]
19133A19259204Q135797P576227M83511r813111j7027360j8203893j5477016j1537462
19125F3395897q184122n763677m040823l106175k811818k699534k245732j661806
19117C2882210j272190r52878o26647L2992P45375J256821J984813K854474M225737
19108D1130707O291605R187608J3094657J7654209K0846408J8702000R677899
19101A36585093j653133q806190r185857m608255K501622J1288126K2251734L6743564
19093A85116704N4558345P1101512P8116688P0162431M4267390l391109n6467187
19086D43464774q5203612q2102647o2590075m2527213k7889328j8406640j2232350
19079A12512909q283695n835727m240541k154686L87432J771772m97895o024047
$$ y = [119259204, 127395001, 134971228, 135454739, 125641628, 108614268, 90410375, 74933359, 63395897, 55211775, 49448098, 45407275, 42301100, 39489282, 36789748, 34544016, 32882210, 31610020, 30657142, 30030495, 30063487, 30808862, 32065683, 34050496, 36904970, 41130707, 47422312, 56609920, 69704577, 87358786, 108205194, 126907194, 136585093, 134931960, 126125770, 116939913, 112331658, 114833280, 126121406, 148373140, 185116704, 239675049, 310776561, 388893249, 459055680, 503323070, 499931961, 443464774, 358261162, 276158515, 213568440, 171041227, 143151899, 124745259, 112512909, 104229214, 98393487, 94152946, 91998260, 92385692, 94157464, 93659569, 87635522]
19071H7635522j0774533j2176781j0625647q286887o259316m653398l419150k676109
19063B8763701k265771j983386j660729j537793j380700j162450q75434r96250
19055A6901188j064176j274654j341655j314245j132882r12565q09193p31056
19047H320762m68585m86461m74786m63247l48242k90109k67289j54866k15703
19038E151474k65399l22064j73536j14336j50264j56354j18743k23133j84017
19029C443628j44193j05633j63525m5549n6635j28757J46337Q0366p0974o1213
19019B893852m1365P2287k2734n0506k3141j43900j84341p5584p5640p4904q9895
19008B184129k3895J03154J05557P3773Q5375k1311J1076r4938j55749o3689M7593
$$ y = [87635522, 76860989, 64684208, 54058561, 45771674, 39512358, 34858960, 31439810, 28763701, 26497930, 24514544, 22853815, 21316022, 19935322, 18772872, 17897438, 16901188, 15837012, 14562358, 13220703, 11906458, 10773576, 9861011, 9051818, 8320762, 7852177, 7365716, 6890930, 6427683, 6079441, 5789332, 5522043, 5367177, 5151474, 4886075, 4564011, 4390475, 4276139, 4125875, 3969521, 3850778, 3627645, 3443628, 3299435, 3193802, 3030277, 2984728, 2928093, 2799336, 2945673, 3026039, 2955065, 2893852, 2852487, 2924774, 2902040, 2851534, 2828393, 2684493, 2500152, 2424568, 2348928, 2274024, 2184129, 2160234, 2263388, 2368945, 2442718, 2528093, 2506782, 2517858, 2422920, 2267171, 2203482, 2251075]
18997B251075j25048k31932j76446m2700J7712J6264J6402j346o3319k9378m7074
18986A584210j10214k6928M3712Q4470q0038q3332k7714n6955J5477N0431N1015
18975A444134K7704M7511m8748n7302k693J54290R8110l7172L9860P4365M7746
18964A787805R5065J59413K8032j63627r3371j02189n3721j67329j89118J01627
18954A402587M990n9232K1839J27637k6646r4714J41426J19652k2639r48q4420
18943A529532q3024j02603j74370n3229N9271J22105J46898P998J4408J14131
18933A581117j9083q1140M848J58359J33927j6971N2111J46698P2989R0472k1343
18922B101984k9945L4775R4739J37128K23594K86894J87217J38190J54399J20198
$$ y = [2251075, 2126027, 1894095, 1717649, 1674949, 1692661, 1708925, 1725327, 1723981, 1660662, 1631284, 1584210, 1473996, 1447068, 1490780, 1575250, 1495212, 1411880, 1384166, 1327211, 1342688, 1393119, 1444134, 1471838, 1519349, 1470601, 1413299, 1410606, 1564896, 1663006, 1625834, 1665694, 1740059, 1787805, 1882870, 2042283, 2070315, 1906688, 1813317, 1711128, 1657407, 1490078, 1300960, 1402587, 1407577, 1348345, 1370184, 1497821, 1471175, 1376461, 1517887, 1637539, 1614900, 1613952, 1529532, 1446508, 1343905, 1169535, 1116306, 1175577, 1297682, 1444580, 1452578, 1466986, 1581117, 1562034, 1480894, 1485742, 1644101, 1778028, 1761057, 1813168, 1959866, 2032855, 2123327, 2101984, 2072039, 2106814, 2201553, 2338681, 2562275, 2849169, 3036386, 3174576, 3328975, 3449173]
18912C449173J57989J38568K30548J61711L10208L30361M28052M42485M57291
18903F106386P06835Q44255J025686J253540J490732J595135J740216J877999
18895A6640784K333744L558904N152111P457597R590523R428110O139892J609541
18887F1911206j760983k970348k252731j65998K586758N671053R379248J4223405
18879H6621610K1831356L3804345N2578245P5934770R0344514P7778871M2234569
18872D81128280K451277l4809480o0202722o6731897n9392329m6118699l1712004
18865A84612426j8867254q831904j655551L595424N539928J625958o672626j4415981
18857A44930420j8896832j9641406j7474642j3812443j0230644p260618n217812
$$ y = [3449173, 3607162, 3745730, 3976278, 4137989, 4448197, 4778558, 5206610, 5649095, 6106386, 6813221, 7657476, 8683162, 9936702, 11427434, 13022569, 14762785, 16640784, 18974528, 22533432, 27685543, 35143140, 44733663, 54161773, 60301665, 61911206, 60150223, 57179875, 54927144, 54761146, 57347904, 63018957, 72398205, 86621610, 108452966, 142257311, 194835556, 270770326, 361114840, 438893711, 481128280, 483579557, 448770077, 388567355, 321835458, 262443129, 216324430, 184612426, 165745172, 156913268, 155257717, 158853141, 164393069, 166019027, 159346401, 144930420, 126033588, 106392182, 88917540, 75105097, 64874453, 57613835, 52396023]
18850E2396023l867044l336628l092983k775932k401172k239716j706049r96900
18842C1979599n81544l63487J18883Q44748J864573L280571N046723P714123J1302944
18833F1207133J4897453J6101304J2404191N373152j147730m760990m900912j593006
18825I7580595M595003J3660071K4985989L6062916M2233719M3335371M1311628
18818C03765292K8223138j356257l0346822m6464642n0937986m5159679l3631715
18811A24091329k2490615j4820042j0103222p217443n664106m809053l622514
18804E5364334j989275n58873l59027j914547m047915n234600n550736m992118
18796C0717243l972386k950120k239502j724431j657352j645531j698347j475682
$$ y = [52396023, 48528979, 45192351, 42099368, 39323436, 36922264, 34682548, 32976499, 31979599, 31398055, 31034568, 31153451, 31998199, 33862772, 37143343, 42190066, 49904189, 61207133, 76104586, 92205890, 104610081, 109983233, 108835503, 104074513, 99173601, 97580595, 102175598, 115835669, 140821658, 176884574, 219118293, 262453664, 303765292, 331988430, 330632173, 300285351, 253820709, 202882723, 157723044, 124091329, 101600714, 86780672, 76677450, 69460007, 63795901, 58986848, 55364334, 53375059, 52816186, 52457159, 50542612, 46494697, 41260097, 35709361, 30717243, 26744857, 23794737, 21555235, 19830804, 18173452, 16527921, 14829574, 13353892]
18788A3353892j298847j118696r20641q46981q05956o98620n28633m69385k93502
18779F372631m41096l74296k97323l05077k57858k36562k42332k28559k20180
18770C769348l11303j69219P047n4309j23961n6925O958M0134p1341j97419k99970
18759B539040j55716o6011j00020l083N1484O2263l8123L048Q181L5254n3061
18748B283256l2451Q6838l3523j70317j19332k330j37378k44024j82549j91612
18738A256578J293K40252Q2806j7567r2526k19305j00197L1755J21296j1862l0891
18727A261632n6239j91256k3680n9282J06922r7662k5999O3697k4896l1355m5647
18716H76235j09243j09051O687R381l2807M9917J16682Q338n3553Q940M7376Q1221
$$ y = [13353892, 12055045, 10936349, 10015708, 9168727, 8362771, 7664151, 7135518, 6666133, 6372631, 5931535, 5557239, 5259916, 4954839, 4696981, 4460419, 4218087, 3989528, 3769348, 3458045, 3288826, 3295873, 3241564, 3117603, 3060678, 3067636, 3107770, 3036429, 2839010, 2539040, 2383324, 2317313, 2217293, 2214210, 2265694, 2327957, 2289834, 2292882, 2301063, 2336317, 2283256, 2250805, 2337643, 2304120, 2133803, 2014471, 2012141, 1874763, 1630739, 1448190, 1256578, 1257871, 1498123, 1580929, 1563362, 1470836, 1251531, 1151334, 1183089, 1304385, 1292523, 1261632, 1205393, 1014137, 990457, 931175, 1038097, 940435, 914436, 978133, 953237, 921882, 876235, 766992, 657941, 664628, 674009, 641202, 691119, 807801, 816139, 762586, 771526, 818902, 900123]
18704I00123Q27o2065O9772O4829o9301j8166L599M1099L1825J15201J24549N7780
18692A260072K9243L0658j23259k09241k03907o8620J8233p2712n8311n5974j60004
18681C86178k249Q3011J11378L0626J5037r0787M036J41804l8019l3495j39851
18670D67669o4332R1390j30774j36967K9589q207K8066K23470J11592j78370j74293
18659B58833R3216J28174M5010n9508j00219k3875J22490J0528M3688K4291l6845
18648E05783j09882l0296J11989J23647O9838n7858j27181o6794o5427M3871O1727
18637D59417L5438K5676P529q0684K7567n0518l2371J03603K7439j1464P9327
18626E90959j3187J45052J98057J60774P0930J41291J83099M4686O2922K9039
$$ y = [900123, 900950, 838885, 908657, 973486, 904185, 886019, 889618, 930717, 962542, 1077743, 1202292, 1260072, 1289315, 1319973, 1196714, 987473, 783566, 714946, 733179, 660467, 602156, 546182, 386178, 383929, 466940, 578318, 608944, 623981, 533194, 537230, 679034, 641015, 607520, 467669, 403337, 494727, 363953, 226986, 256575, 248368, 276434, 499904, 611496, 433126, 258833, 352049, 480223, 525233, 465725, 365506, 341631, 464121, 474649, 518337, 542628, 505783, 395901, 365605, 477594, 601241, 671079, 613221, 486040, 419246, 353819, 397690, 459417, 494855, 520531, 528060, 447376, 474943, 424425, 392054, 495657, 523096, 511632, 590959, 577772, 722824, 920881, 1081655, 1152585, 1293876, 1476975, 1521661, 1584583, 1613622]
18616A613622r9111j49591n9812N8726M2457N0411O769o933l0389N8573K19640
18605A704362R5595k1029j3462l3852j14691j09429k05286j80814r3178k86o5820
18594I62110j18468K7966q0456n0108K35j16480k2586Q007p2482R212J9089j6326
18582E49713j9547n8426j9539l7944J16244m2231q8735J6456J69253J03187o6255
18571F22176n2247o6408J48609R1563m7564j5131J64053R2899J41105n1007R036
18560A037084R7658l6153k8051k7879m8232o745M3081J26186j06388o8534J13603
18549A095630O0054O3584L7827q8842q9599j50715k11068j71206o475M3598M2180
18538F24968J17746l9775r5632j67925n6619J1786p1208j01934n9103m0592P371
$$ y = [1613622, 1514511, 1364920, 1305108, 1363834, 1406291, 1456702, 1463471, 1456538, 1426149, 1484722, 1704362, 1799957, 1778928, 1765466, 1731614, 1616923, 1507494, 1302208, 1121394, 1028216, 1027930, 962110, 843642, 871608, 791152, 741044, 741279, 624799, 602213, 610220, 537738, 546950, 566039, 549713, 530166, 471740, 452201, 414257, 530501, 488270, 399535, 415991, 585244, 688431, 622176, 569929, 503521, 652130, 743693, 696129, 680998, 845051, 937950, 1079055, 1028048, 1037084, 1134742, 1098589, 1070538, 1042659, 994427, 987682, 1030763, 1156949, 1050561, 982027, 1095630, 1155684, 1219268, 1257095, 1168253, 1078654, 927939, 716871, 545665, 539190, 582788, 624968, 742714, 702939, 607307, 439382, 382763, 394549, 323341, 221407, 162304, 121712, 129083]
18527A29083j737J4822r3834O1399O9833j37602l1859J52385O0796N4000o1694
18516B15592p2254R5577N7975j64163o1033R4177m936n6007j3394r59j14616k8220
18504e2261J24172p8402q6699J0615P1214P700J21418J1546J8165m3896N0791
18493A54363L1522p4734k9181p2864K6753j6817q358M7989O6837J4062O4317L4791
18481B38680Q8983J45124O9691j27887j52625l0939j636k6723n12m106K3395j7624
18469B03821m6384r8131K2324J13839Q977k06518k2125J15960m564p6974n586
18458D639L1799R1955K2260p718j8871j9396o1668l0725j29650m443P4162l1559
18446g9215m0505R1851M9803o4640r6704j59883j2629R8398K529J3360M1147N4792
$$ y = [129083, 127346, 142168, 48334, 109733, 179566, 41964, 10105, 162490, 223286, 277286, 215592, 143338, 238915, 296890, 132727, 71694, 165871, 160935, 104928, 91534, 90575, -24041, -52261, 71911, -6491, -93190, -82575, -11361, -3661, 117757, 129303, 147468, 103572, 154363, 185885, 111151, 81970, 9106, 35859, 19042, 10684, 58673, 125510, 139572, 203889, 238680, 327663, 472787, 542478, 414591, 261966, 231027, 229391, 202668, 202156, 198050, 221445, 203821, 157437, 59306, 81630, 195469, 204446, -2072, -24197, 91763, 87199, 10225, 4639, 36438, 128393, 150653, 142935, 124064, 104668, 43000, 12275, -117375, -121818, -47656, -79215, -119720, -27869, 21934, -42706, -139410, -299293, -311922, -213524, -210995, -197635, -156488, -101696]
18434a01696P4318j1223l4956P8749L7393L1275j09806j12827J06204k4863j37628
18423b05060m7808J16968J05320L1005n6798l511M1375L2953R4477N2234j19891
18412D1264j69241k5258J01425M0579N3704Q688m0101j37783j86408R1649K33486
18401A2004J24271M38j16404o5807R0322K0313r849j9578O0557m7236o4275k6976
18389d2220q67P259j0072R5485J8005q4191o8376K868N6299J33991L4546n1362
18377I1365p9431N84L2043r7039n7441k250J04225N9843Q2240J6229j2473j2199
18365A25696O9556J0996o7696n5372R717J09254o4691m8546L4375l0838O1482
18354A53933J47718j4603K0002J82324n1237n5296M1006Q8447J43828j6186J53105
$$ y = [-101696, -27378, -38601, -73557, 5192, 42585, 73860, -35946, -148773, -42569, -67432, -205060, -252868, -135900, -30580, 425, -56373, -59884, -18509, 14444, 108921, 161155, 41264, -127977, -153235, -51810, -11231, 42473, 51161, 11060, -126723, -313131, -221482, 12004, 136275, 136713, 20309, -45498, 44824, 65137, 55288, 35710, 96267, 49031, -15244, -42220, -43087, -35828, -45900, 49585, 67590, -16601, -84977, -82109, -25810, 108181, 142727, 91365, 11934, 12518, 44561, -52478, -109919, -112169, -7944, 51899, 134139, 150368, 137895, 125696, 195252, 206248, 138552, 83180, 92897, 202151, 137460, 88914, 123289, 92451, 153933, 301651, 287048, 307050, 489374, 438137, 382841, 423847, 512294, 656122, 639936, 793041]
18343G93041K31395M366K0694J34749J5670l3382p131l7431J63145l3989J9421
18332A270548R3702p4214j11698l4060K9295j12860j06022o3078p6976M626K1013
18321H40276l1770j70510q2203k5429l0280l7725J3326O4360O3628m3422o2835
18310D97416l4379n9872j39882R221O8594R7112p4761r663L1822K7835j2698N7413
18298D58158N8905j3495L3030R9023R7283L4854r2887J2991L3063J19601P4760
18287I15286J32651Q6407j0406j09333j15107j06779o3986m8631j86798j16053
18277C77251K0999j7654J91924M4685M0930J41466K04822O9662j31617p2474j81885
18266F88109r6401j33774L0068n7370m0029K7498l1798q3120j751n1825p7513
$$ y = [793041, 1024436, 1028802, 1049496, 1184245, 1199915, 1166533, 1159402, 1121971, 1285116, 1251127, 1270548, 1364250, 1290036, 1178338, 1144278, 1173573, 1060713, 954691, 891613, 814637, 819263, 840276, 808506, 637996, 555793, 530364, 500084, 462359, 475685, 540045, 603673, 560251, 497416, 463037, 403165, 263283, 272504, 341098, 438210, 363449, 353786, 385608, 413443, 400745, 458158, 517063, 503568, 536598, 635621, 732904, 767758, 674871, 687862, 720925, 840526, 915286, 1047937, 1134344, 1123938, 1014605, 899498, 792719, 728733, 680102, 493304, 377251, 398250, 380596, 572520, 617205, 658135, 799601, 1004423, 1074085, 942468, 869994, 688109, 591708, 457934, 488002, 430632, 390603, 418101, 386303, 303183, 301432, 249607, 172094]
18255A72094k4761q400k6166j7098N4859q7314l1723p2008K6070J93939P3300
18244B52792k9220M6351j30639r9673L3606m0269J4903K0611o4373k4746L2694
18233A2037j01498k026K6204l9336m756N3659n2917q381O651L519J21397L9165
18221E3718N5110N1092n4905j23970k473K8208o8587m0803J71213j1418J6332
18210G3517Q3817J1831j51964j1247n2105R6850K5733L3337q8715r6031M9281
18199b5696M227j19125m1577J08218J01654q1909k068k9876K4275K14696M4605
18188A97424m5166j39369j52356N2509Q6024j42602j00675J59296J77176r623
18178H2638m2687j9329Q3850J8108L9398L1491o9274m6659j1911n3466K5841L3452
$$ y = [172094, 147333, 138933, 112767, 95669, 150528, 63214, 31491, -40517, -14447, 179492, 252792, 223572, 269923, 139284, 39611, 73217, 32948, 47851, 68462, 4089, -20657, 12037, -89461, -91487, -65283, -104619, -109375, -55716, -108633, -117014, -110363, -106844, 14553, 53718, 108828, 159920, 105015, -18955, -21428, 6780, -61807, -102610, 68603, 57185, 73517, 157334, 169165, 17201, 5954, -46151, 50699, 76432, 109769, 21054, -74977, -25696, -21469, -140594, -182171, -73953, 27701, -54208, -56276, -86152, -61877, 152819, 197424, 152258, 12889, -139467, -86958, -934, -143536, -244211, -84915, 92261, 82638, 39951, 20622, 104472, 122580, 161978, 193469, 124195, 77536, 65625, 12159, 38000, 71452]
18166G1452J7025m6479j5023O999K2066M3j21899o0370m2090J55048Q6333k3730
18154D9375j3246j3877j2335R5881M8759K464l8635j01940n6194l905L1172K38889
18142B26408J29603n4940j3184p7824r6124N2182M3748j04262m7152j9400m795
18131C4260q2352j7749j2769O7709n6538P627R5494M5398j8531l701r0319r1728
18119a23199O3254J3756k3563k4391j2353N288Q7541L7715K5609j00034M9465
18108i12R0683K5315LJ52849k736j75593j35229M6161q630m1522r8065l6792J40726
18095d3742M7839q3483k4132N8149m8075k8309R0197R0068k8828M2909l8037j6461
18083A8095m5843l2022m7625l487N6023K4855L0711k2206m9555J07660P0568M1393
$$ y = [71452, 88477, 41998, 26975, 33974, 56040, 56083, -65816, -126186, -168276, -13228, 73105, 49375, 36129, 22252, 9917, 105798, 154557, 157021, 118386, 16446, -39748, -43653, -12481, 226408, 356011, 301071, 287887, 210063, 113939, 166121, 209869, 105607, 58455, 39055, 34260, -48092, -65841, -78610, -10901, -67439, -59812, 35682, 81080, 62549, 58848, -31471, -123199, -59945, -46189, -69752, -94143, -106496, -101208, -13667, 24048, 49657, -50377, -912, 89771, 115086, 115089, 267938, 265202, 89609, -45620, 541, -8089, -49611, -147676, -184468, -43742, 4097, -79386, -103518, -45369, -93444, -121753, -31556, 58512, 29684, 72593, 34556, 18095, -27748, -59770, -107395, -110882, -54859, -30004, 707, -21499, -71054, 36606, 107174, 148567]
18071A48567o0743p5555j3167R4287o0881j913k4960k6831O978L858k2629O2358
18059B9369P3698J2205j01860m3577r9166n0022L0837O8462j6749l1844r440k0657
18047a58744P781j1406J49390P2667M1090j65473o1544m746J51511M9491j5344
18036E4673L4367J08989q4351n8214n6226j10091J13926L1817q2715J6875K0880
18025a0070M4696O5447q858j47948j21536J9459J11696K0081j31513r5187o2356
18014c16089O2569J67679L7089O4932K3140m576o0931M2421L451q55k2692p727
18002a1589J71043N6565j00034o8383m1913n4148q5825K6055Q5433L0102r4051
17991h6745j4029J74981Q7002j03085j39659M576O1642r3095k7038l3810L6574
$$ y = [148567, 87824, 12269, -898, 93389, 32508, 30595, 5635, -21196, -14218, -10360, -32989, 29369, 103067, 115272, 13412, -30165, -129331, -179353, -148516, -80054, -96803, -128647, -138087, -158744, -150963, -162369, -12979, 59688, 100778, -64695, -126239, -130985, 20526, 70017, 54673, 89040, 198029, 113678, 55464, -762, -110853, 3073, 34890, -47825, -30950, -10070, 34626, 100073, 91215, -56733, -178269, -158810, -47114, -27033, -158546, -253733, -316089, -253520, -85841, -48752, 16180, 39320, 34744, -26187, 16234, 19685, 18830, -3862, -11589, 159454, 216019, 115985, 47602, 5689, -48459, -134284, -108229, -22796, 7306, -86745, -100774, 74207, 161209, 58124, -81535, -76959, -15317, -108412, -135450, -169260, -132686]
17980a32686L1379n2592N8240P4332L7438l4245L7515j6379N655m0606l5641J1990
17968e5600P2216j16994j8902L9250n1735R1021J16612p7227q3747M3503J35295
17957I3692N0272j0520j61659j60725n8770J21405Q0593M5782M7832O5551K0188
17946A33641j00574R801j5960j61521p2482O2557O1318m6219K8097l1219n1026
17935a83587O4440J04922M3049K9268q5392k2869K7418j03165m1471J520L3496
17924a32371N0073R2879k929j418j05367j18484K3674Q6670M1661k113q0587R7344
17912e0968L0616o8360j33314J13312m7455q3625M8747O9384O2255L7143p368
17901b9633j4737J8982O8209m1325J37371j7140M6360j1167l3052R318n2993R664
$$ y = [-132686, -101307, -153899, -95659, -21327, 16111, -18134, 19381, 3002, 8657, -31949, -67590, -55600, 16616, -100378, -119280, -80030, -131765, -40744, 75868, -1359, -85106, -41603, 93692, 143964, 133444, -28215, -188940, -247710, -126305, -45712, 70, 47902, 113453, 133641, 33067, 42868, 26908, -134613, -207095, -144538, -83220, -129439, -101342, -132561, -183587, -119147, -14225, 28824, 58092, -27300, -50169, -22751, -125916, -167387, -165867, -132371, -82298, 10581, 7652, 6234, -99133, -217617, -193943, -107273, -65612, -67725, -148312, -50968, -20352, -88712, -222026, -108714, -156169, -239794, -191047, -121663, -59408, -22265, -29633, -44370, -25388, 42821, 1496, 138867, 121727, 168087, 156920, 123868, 133186, 80193, 89857]
17889H9857J6841p9373o8903N1530Q0792r503K4671k2771r5137O1792J36660j7061
17877A69395j05189N4588m2245j7583N4674l3356j4121M2303m4489q6265R5430
17866G3142J0382m1485O0124P5812n0619M8140M7384m7980j04652r0180o14M0602
17854B0056o2507j25570K1611l4825O4187R8758p419m2606K7575R224j540J28741
17842I5685j193j55996q1735O3392k2362L3192k6651m4572p7346n6224J08712
17831a65098J45364m5541n0579R2983K20503k2939n3557r2336n8598K874Q8928
17820F2004m6019m0736K8688L9245n4522L7293J42279L9815J2729L488k4093j33338
17808F6833k09821j7872P8004J7939P9911j8170O3377M0559j11177k5653L4683
$$ y = [89857, 106698, 27325, -41578, 9952, 90744, 81241, 105912, 83141, -11996, 49796, 186456, 169395, 64206, 118794, 76549, 58966, 113640, 80284, 66163, 108466, 63977, -22288, 73142, 83524, 42039, 102163, 177975, 127356, 175496, 222880, 174900, 70248, -19932, -20546, 20056, -42451, -168021, -146410, -181235, -117048, -18290, -25709, -68315, -40740, -31516, -33056, 95685, 94492, -61504, -143239, -79847, -102209, -69017, -95668, -140240, -217586, -273810, -165098, -19734, -65275, -115854, -22871, 197632, 174693, 121136, 28800, -29798, -26924, 62004, 15985, -24751, 3937, 43182, -11340, 25953, 168232, 208047, 220776, 224264, 200171, 66833, -142988, -160860, -82856, -64917, 14994, -3176, 60201, 100760, -10417, -36070, -1387]
17797a387l3577k3926L1407M3110o3659R50N6561M4991L4007p6209J6995q6179
17785e6916j51223N0838J571l8764M3571j1763P5672j5995P3835J01932P922J0972
17773I1652M9006j2449j18554m0247l7931j8502L3404L4608J9265q5769n3352
17762a38869J3169O5050l2548M5689j4260J043P2894k6605o9711L5498K10033
17751A61383J61962m7971k1101k3494j22776n3372P2927J10247N6574j8737m9632
17740B26010k3572p4128j31039j2401M960K4465k7973Q3286J8791n0844j30760
17729i3205L045J13678J13075q8909k01644l6971l2641J18337N791K5165j48259
17718b22538O4280M8622M6372m1964Q7924M4846l8194m0533r0831q225R5791N7869
$$ y = [-1387, -34964, -58890, -27483, 15627, -48032, -47082, 9479, 54470, 88477, 12268, 29263, -56916, -208139, -157301, -155730, -194494, -150923, -162686, -87014, -103009, -29174, 72758, 80680, 91652, 140658, 128209, 9655, -30592, -68523, -87025, -53621, -19013, 252, -85517, -138869, -125700, -60650, -93198, -47509, -61769, -60726, 12168, -14437, -84148, -48650, 161383, 323345, 275374, 254273, 230779, 108003, 54631, 127558, 237805, 294379, 275642, 226010, 202438, 128310, -2729, -15130, -10170, 14295, -13678, 69608, 88399, 37555, -93205, -90160, 23518, 136593, 47684, -153960, -190931, -223572, -105235, -99444, -74279, -222538, -158258, -109636, -63264, -105228, -17304, 27542, -10652, -51185, -142016, -150241, -54450, 3419]
17706C419P1865k5965k6978Q5705L2525l3505J7020P2484q7109j05609k8214M9636
17694B5274L7960q6100j30175m1902N7135J21272j34327q3076L9592J07005N4061
17683c3281N4472p1863k9246o2532J5670J01796J16598K0687j32020j00831j27717
17672b48267P9120Q3634J391l359M9984P1402o8304n6626M0682j2874m2260O5622
17660c9855P3837J9423q2326N8368K1369n6349k1788O2449k0965q3794o3042J6864
17648a15809k7770J406o26N7803j3975J01273J01598n3998L4698L5719K813o5222
17636E7910K1270k6872O046K6000o4650k1191J20067j7009r7057n8882P6533j9871
17624B294r8852J0971M9604l7925n0986L9702J92424l2661o2401K0012l7375K0803
$$ y = [3419, 75284, 49319, 22341, 108046, 140571, 107066, 124086, 196570, 109461, 3852, -24362, 25274, 63234, -22866, -153041, -194943, -137808, -16536, -150863, -233939, -194347, -87342, -33281, 21191, -50672, -79918, -142450, -126780, -24984, 91614, 112301, -19719, -120550, -248267, -169147, -85513, -84122, -87481, -37497, 33905, -34399, -91025, -50343, -63217, -105477, -39855, 33982, 53405, -28921, 29447, 50816, -5533, -27321, 35128, 14163, -69631, -132673, -115809, -143579, -142173, -142799, -84996, -98971, 2302, 103900, 49902, 84600, 120319, 123132, 57910, 79180, 52308, 58354, 84354, 19704, -1487, 118580, 101571, 4514, -54368, 22165, 2294, -96558, -85587, -35983, -73908, -124894, -85192, 107232, 74571, 12170, 32182, -5193, 15610]
17612A5610J46624J0332m5723n9768j38778p9599M2622J05440o037K6685Q2925
17601A00333k6001m0801O6366Q787j16270J4714Q1968j9984k1362o854R2688N250
17589A38834j01119k5208k1280n1609M3734J12698K649m2327k4738j9529J5841
17578B7946r8011m9295R7912j2270o3513p2924O2083L5175M6042K3463N3961l4876
17566A5693n3859j8645J3577p5158N2081K1934M5039K8425M4417o4418m3116J4781
17554a9249J30323m118o6225l3245j4345j06317l2715J01498j0407l7046J9802
17543g2044R1802N937L3286k5501k1346r8726k5985j3111J23Q9657m3813m4047
17531a23768R0911N1705l4408n49k8336N676M8030P9056r5113q2850M2366L9373
$$ y = [15610, 162234, 172566, 126843, 67075, -71703, -151302, -108680, -3240, -9277, 17408, 100333, 74332, 33531, 99897, 108684, -7586, 7128, 89096, 69112, 47750, 40896, 133584, 138834, 37715, 12507, -8773, -60382, -16648, 96050, 98699, 56372, 31634, 12105, 27946, -70065, -119360, -21448, -33718, -97231, -170155, -108072, -72897, -26855, -3392, 50569, 15693, -38166, -56811, -43234, -118392, -66311, -44377, 662, 29087, 73504, 9086, -34030, -19249, 111074, 106956, 40731, 7486, -6859, -113176, -145891, -44393, -54800, -91846, -72044, 19758, 25695, 58981, 33480, 12134, -86592, -112577, -125688, -125565, -35908, -79721, -123768, -32857, 18848, -15560, -16109, -44445, -38769, 9261, 88317, -6796, -89646, -47280, -7907]
17519g907n9414m1244K1366J01898L4663J4007O5578n980o5985o8000m0567q1082
17507a32667M286P4148m9981N4925K1765m3102n219J62450J37894P0969j958j51941
17495A41569j00343r6451M4799J10458O1634j31747j7222j7449j4436n1232j10134
17484a80554K3293N0567n3171o6268J03815J20935O6088L9008M5538o5292j45378
17473f1419K5363p6938J8784n008p4532R1879N2399j37327l6945j9944j33628
17462c57316R1408J46396K0552m2552P6418N4514J8680r2772M6950O4648P3746
17451A00672N9282r5314j2484K3002n9888p7571q557Q9114j0004l9785p1027P315
17439i5245k8572r809O7646P4017Q9525P4637N63q1344m9334j584q7386l0401
$$ y = [-7907, -67321, -108565, -87199, 14699, 49362, 63369, 128947, 122967, 56982, -11018, -51585, -132667, -128381, -54233, -104214, -49289, -27524, -70626, -75845, 86605, 224499, 295468, 293510, 141569, 41226, -55225, -10426, 100032, 161666, 29919, 12697, -4752, -19188, -70420, -180554, -157261, -106694, -159865, -226133, -122318, -1383, 64705, 103713, 149251, 83959, -61419, -36056, -112994, -94210, -99218, -173750, -81871, -29472, -166799, -203744, -223688, -357316, -265908, -119512, -98960, -141512, -65094, -10580, 8100, -84672, -37722, 26926, 100672, 159954, 64640, 52156, 75158, 15270, -62301, -70858, 18256, 8252, -31533, -102560, -95245, -123817, -133626, -65980, 8037, 97562, 172199, 172762, 91418, 42084, 40500, -46886, -77287]
17427g7287j9898q2291k0637R8559P9075j0907k9917L5310K0217n3498k2274Q1896
17415a652J17742N1498N4077k6794n3789r5648k7153k9003o6300k0556R2499j11167
17403a16246r3079J27300J74141l3679l8972Q3208n3181q1620N8703n5022j08198
17392a36645P5902P1216l3370r2174r3988p6208k2862Q845J890P5971J28877O746
17380h5800O351m9059m1199r2255j16137J05808J05539J82188O1727q4812o3956
17369g1605L3405Q0458L8492l6139J4102r3616Q102P2794J03617p107j07801q845
17357B5857Q8585k7653j4273L1631l2079m2393k3147J17047N0788k2405k1583
17346A30375k84215m8153N5539k3579K9852J05170k6617l0633m8195L1240L4928
$$ y = [-77287, -97185, -179476, -200113, -101554, -22479, -33386, -63303, -27993, -7776, -61274, -83548, -1652, 116090, 167588, 221665, 194871, 141082, 45434, 18281, -10722, -77022, -97578, -5079, -116246, -209325, -82025, 92116, 58437, 19465, 102673, 49492, -32128, 26575, -28447, -136645, -60743, 10473, -22897, -115071, -209059, -285267, -308129, -299284, -297394, -221423, -92546, -85800, -79449, -128508, -169707, -261962, -378099, -272291, -166752, 15436, 77163, -7649, -71605, -38200, 42258, 80750, 44611, 58713, -34903, -26801, 45993, 149610, 142503, 34702, 25857, 114442, 86789, 72516, 104147, 72068, 29675, 6528, 123575, 174363, 151958, 130375, -153840, -201993, -146454, -170033, -140181, -35011, -61628, -92261, -140456, -109216, -74288]
17335g4288L1468k719o1202Q446K5691j552N883J88l4106L4950J29224l3461j06294
17322g7772j30414P2821P7751J9180L9748j23999p2775K9702O7906N2293p7535
17311a23094q540R0046K8846O3185R936q5275j04844R3538n474L8213N2975O9441
17299A18953m4635K181P479j13846Q3841J6562p9862k1149l4642l3822l7273K25505
17287H9292J1741p8892n9003M2229K1322K8651o500j8902r4000J1405L1437p972
17275b9192k9823o8125Q3602O0266J11445n2841j03681P1386m6163p9766O4393
17264a8499O6828r248m8612J18741n226p8087n0543m3454O133n3079J21477J78944
17252A85375N0401n9798J67k4188L4071N2855L2140l5655r6838O4499q4440j6088
$$ y = [-74288, -42820, -45539, -106741, -98295, -72604, -74156, -68273, -68085, -102191, -67241, 61983, 28522, -77772, -208186, -135365, -57614, -38434, 1314, -122685, -195460, -165758, -97852, -45559, -123094, -131634, -41588, -12742, 50443, 60379, -24896, -129740, -36202, -41676, -3463, 49512, 118953, 74318, 76499, 83978, -29868, 53973, 70535, -9327, -30476, -65118, -98940, -136213, 89292, 101033, 22141, -36862, 5367, 26689, 55340, 48840, 29938, -64062, -52657, -21220, -29192, -59015, -127140, -43538, 16728, 128173, 75332, -28349, 43037, -3126, -82892, -18499, 48329, 39081, -9531, 109210, 103984, 25897, -24646, -68100, -61967, -115046, 6431, 185375, 235776, 175978, 176145, 151957, 186028, 238883, 271023, 235368, 138530, 203029, 118589, 102501]
17240A02501q5561j47547K6498J0667J27063J11096k080r3656R346K5599n828
17229G8098N1167p2596r8609j6567K3289R7073K8613j0701Q5176J6997n6160n1598
17217G4182j17990M461J0046L7054N1818R1593m617J7119K0725k9343m6695m7468
17205F0885n876l867m5410P810M6389M359k4088M0968Q7192L7350j48241r0196
17193c2725r285m135K4695j4096k7389J76j7049r689P66Q207n6200L9759m6317
17180a43282J16167Q6672r1217o4642l7444k1153J650p3349m4964k3038J25212
17169a69388J80117j7679o0007M0776M7641l5083j1602j54506j08935N6322J29762
17158a02582O1113J0308J7918N5164J1338M7774K5763N8408r8607j10121k3527
$$ y = [102501, 16940, -130607, -104109, -93442, 33621, 144717, 142637, 48981, 58327, 83926, 78098, 129265, 56669, -41940, -58507, -35218, 61855, 90468, 79767, 164943, 181940, 125780, 74182, -43808, -39347, -29301, 7753, 59571, 151164, 146547, 163666, 184391, 155048, 108353, 60885, 55009, 51142, 5732, 13542, 59931, 64290, 40202, 81170, 168362, 205712, 57471, -32725, -42010, -46145, -21450, -35546, -62935, -62759, -79808, -89497, -88731, -80524, -136724, -96965, -143282, -27115, 59557, -31660, -96302, -133746, -154899, -153249, -226598, -271562, -294600, -169388, 10729, -6950, -66957, -26181, 21460, -13623, -25225, -179731, -288666, -232344, -102582, -41469, -31161, -13243, 41921, 53259, 101033, 126796, 185204, 86597, -23524, -47051]
17147d7051L913O8858j06396o1166J871J4506m9107M201J07700M32n5750M6903
17135g1086k7409q1716J25617K2354k7173O4825r748n3115N3027M4514p6219r7886
17123a34015o7844P2424P0481J6057K3568L9628K345p0231q2052p4039O4980M2829
17111i5869j4148L2386O4564j5479p5786k6888N6635j3558q5223L4850O3151l5145
17099a10510q3350J06649m8821K335J13742Q032n3172J56032p7599q1889K1516
17088d7035Q0965j1130m2037M4215j0764k0050r394P9616j5968n9342J08566O3983
17076A61625l157K1141J25319K4660n5326j42885p2134o0127m9056n1770J3252
17065h8458J27446J78859n7742j43337j14981n2608K7064J20628P6683l3167j02131
$$ y = [-47051, -43138, 25720, -80676, -141842, -139971, -125465, -174572, -170371, -62671, -62239, -117989, -71086, -98495, -180211, -54594, -32240, -59413, 5412, -4336, -57451, -4424, 40090, -36129, -134015, -201859, -129435, -58954, -42897, -19329, 20299, 22644, -47587, -129639, -203678, -138698, -95869, -110017, -77631, -13067, -28546, -104332, -131220, -74585, -88143, -173366, -138516, -75365, -110510, -193860, -87211, -136032, -133697, -19955, -11923, -65095, 90937, 13338, -68551, -47035, 33930, 22800, -19237, 24978, 14214, -5836, -15230, 64386, 48418, -10924, 97642, 161625, 158468, 179609, 304928, 329588, 274262, 131377, 59243, -884, -49940, -101710, -88458, 38988, 217847, 160105, 16768, -98213, -150821, -123757, -3129, 73554, 40387, -61744]
17054f1744K2439R9672J6485L7204n4183M3183j27251r8168J08596O9200k8507
17043B6926q5316r4743P7877J32857p5361n380J69453K2885n0353r184q2196r5812
17031f8347q1664O1229J96315O9468j5699K55k5664o042j1482L4927q8186p8572
17019a3462P2447R8630O5633p0889j34491j06599r359J7565j07292J19098L4917
17008c3802N2677Q5673q4534k2435j013O2002P4154m0391m9514o3359k2877j6525
16996e9944N1791J3716j07209K2452L4146Q6243q1603q8762Q9015M2184l0855
16985b8826m9408L3972n4323k1853J22758J04800m9466j8671j1424k0137J178
16974H600K9558j3224J007L3958K509j73024l1760k8477m369R1053k4609M4905
$$ y = [-61744, -39305, 60367, 76852, 114056, 59873, 103056, -24195, -122363, -13767, 55433, 26926, -58390, -153133, -75256, 57601, -17760, -23140, 146313, 169198, 118845, 109661, 27465, -68347, -150011, -88782, 107533, 177001, 161302, 161557, 135893, 129851, 118369, 153296, 65110, -13462, 58985, 157615, 223248, 152359, 17868, -88731, -98090, -80525, -187817, -68719, -33802, 18875, 104548, 20014, -2421, -3434, 58568, 132722, 92331, 42817, -20542, -43419, -59944, -8153, 5563, -101646, -79194, -45048, 41195, -40408, -129170, -40155, 2029, -28826, -78234, -44262, -98585, -120438, 2320, 107120, 57654, 38983, 27559, 7422, 8600, 38158, 24934, 25941, 59899, 62408, -110616, -142376, -170853, -175222, -84169, -108778, -63873]
16962f3873l6972n870l5579q9699P0785J01106l1878q5697q7841N6837Q6935L3521
16950h8225O0086P8308Q0325j7496J6243l4544j10794j12230m7555K2221j879
16939a55540J00288O9428n8677j00373k5654J41451R3035l5738j27833J07608
16929G995M1972R0514j257o6168j5823n8561j25207K3788P8072P966Q321K7086
16917A8698O9114L4062j8923j6660r1494m67n1386r292L713L2071l5727q1468
16905a47759J15836J5083j09642k5411j6487j7736K7391k8557R4463J68595M9052
16894A24828K0920j19877m1010O7501r5638K0258O0186m8768k4038O4136j05355
16883g6857J2521L8687m9077J728M784j31634K8341J00990n3344k9034O0003P3948
$$ y = [-63873, -100845, -106715, -142294, -231993, -161208, -60102, -91980, -177677, -265518, -208681, -121746, -88225, -28139, 50169, 130494, 112998, 129241, 94697, -16097, -128327, -175882, -153661, -155540, -55252, 14176, -44501, -144874, -170528, -29077, 63958, 28220, -99613, 7995, 49967, 140481, 139224, 73056, 57233, -1328, -126535, -102747, -24675, -16709, -8388, 18698, 87812, 121874, 102951, 86291, -5203, -5670, -57056, -66348, -62635, -30564, -66291, -147759, -31923, -16840, -126482, -151893, -168380, -186116, -158725, -187282, -92819, 75776, 124828, 145748, 25871, -15139, 52362, -43276, -23018, 37168, -11600, -35638, 28498, -76857, -64336, -25649, -74726, -72998, -68214, -199848, -171507, -70517, -123861, -152895, -92892, -18944]
16871a8944Q329j44466j3254p5782P1791J60297R8639K3993q1757m3467J7466
16860B845M0466N084j35200n758J54199m9337J292O996m9715l9788l0381N5423
16848d3874j4460l5985M1604l2461N5728N5460L3401o7755n1481P9103O3938N06
16836H3724j22235p3359J19415k4010m1167M7991L7613K5394m3363J1830P8963
16825A00796N3327l0651k7301N5966O716n3458R716j44572p0503l449K1889j0708
16813i2232p5776k0319O1979K0951m4775J1528O4361J5319K0980O0553K5109j13959
16801f6281R1025J65761r2398l7652o0348P44j7355R985m5821j097l3509R4832
16789G886M164Q2311J02232P6565j61378j31484l5110O9691L762p9885q465M222
$$ y = [-18944, -10615, -155081, -168335, -244117, -172326, -12029, 86610, 110603, 28846, -14621, 2845, 43311, 48395, -86805, -92563, 61636, 12299, 13591, 20587, -29128, -68916, -99297, -43874, -58334, -94319, -52715, -85176, -29448, 26012, 59413, -8342, -59823, 19280, 83218, 83724, -38511, -111870, 7545, -16465, -57632, -9641, 27972, 53366, 10003, 21833, 100796, 154123, 123472, 96171, 152137, 158853, 105395, 115111, -29461, -99964, -103413, -81524, -92232, -168008, -188327, -126348, -105397, -150172, -138644, -74283, -58964, -37984, 22569, 47678, -66281, 24744, 190505, 98107, 60455, 107, 851, -16504, -6519, -52340, -53437, -86946, 7886, 12050, 94361, 196593, 273158, 111780, -19704, -54814, 14877, 18639, -61246, -69711, -65489]
16777f5489J4004l3608N7251O0225k5111J6558P0904l9224P0359l1678j56902
16766f2711o4405L9971j5025P8826k3564j32307J5180J10547Q4146N6013J5240
16755A01911P5919N7526J5314l8353p7266n806j21172m539q6496r684Q0053N6164
16743D3571m1376j26211R824J24796J8882J6714k4895l3781n9540J8042P5188
16732B1214P193M3915K1296k3524j660k0002O173L5281j2484m5842Q3816P4190
16720A89566r3295r0888J1538k392J02694k2698q2669P6044J9195O203l1120M5870
16708A28048M2583k9926l609L6136j4886p8338j22182r1172k7187O8676J09182
16697A7325j2219Q3745N6939J2793o2143L3721l8046m7432m3003K6008N5774M2487
$$ y = [-65489, -51485, -85093, -27842, 32383, 7272, 23830, 94734, 55510, 125869, 94191, -62711, -127116, -87145, -102170, -23344, -46908, -179215, -164035, -53488, 30658, 86671, 101911, 177830, 235356, 250670, 212317, 135051, 129245, 8073, 3534, -82962, -92646, -12593, 43571, 2195, -124016, -114192, 10604, 29486, 46200, 21305, -12476, -72016, -53974, 21214, 28407, 72322, 93618, 70094, 68434, 48432, 54605, 89886, 77402, 31560, 115376, 189566, 96271, 5383, 16921, 14529, 117223, 94525, 11856, 87900, 107095, 113298, 82178, 128048, 170631, 140705, 137096, 173232, 158346, 80008, -42174, -133346, -160533, -91857, 17325, 5106, 88851, 145790, 158583, 96440, 130161, 92115, 44683, 1680, 27688, 83462, 125949]
16685A25949j01731j3140n5334l6435l1570R7806m1004q4507j01489J7167N2004
16674a72284J43488P4679p5053j09998P4421J25381J04386n5428j19456q3277
16664i3141j43084J00482L3186k5127r09J15720O7761J03205j59371j40903J5989
16653a26192Q4395M0381l4896J21942R5468J12800n6442j60575j94112P694J4456
16642i5081k1485q2656o1038K8528J4526J39768P8652K3339l6366r3398n5101
16631a60312o1868q511O7453M7938k1612M2947M9273J8217R6652P5561J1730K0655
16619A78123M6167K1785j14090j8307j1181m1377r5642k2284K3397R5977j162
16608F1406Q241M2266j10252p2527n9379J1343L8538j7761k832R5865j918q6309
$$ y = [125949, 24218, 11078, -44256, -80691, -112261, -14455, -55459, -139966, -241455, -224288, -172284, -28796, 45883, -29170, -139168, -64747, 60634, 165020, 109592, -9864, -93141, -236225, -135743, -102557, -127684, -128593, -12873, 54888, 158093, -1278, -142181, -126192, -41797, -1416, -36312, 85630, 181098, 293898, 237456, 76881, -117231, -109537, -95081, -116566, -199222, -260260, -231732, -217206, -77438, 1214, 24553, -11813, -105211, -160312, -222180, -230691, -163238, -115300, -136912, -93965, -44692, -26475, 70177, 145738, 157468, 178123, 224290, 246075, 131985, 113678, 102497, 61120, -34522, -56806, -33409, 62568, 61406, 69647, 111913, 1661, -70866, -130245, -118902, -80364, -98125, -100957, -5092, -7010, -93319]
16596i3319M5568k9682j10664j47352k1512J28408J52838Q4653Q1584O296J2832
16585A09650q4096k02692M7097K4034O4870J29Q0837Q1533l8084k5652j0872Q373
16573E5127J8812L203q0851o5631j8193r534O705O3415M2608o3718l0775J08980
16561C0148N7954n3991q646K4667o1706J730j22712m5090K5677P649J00756m0557
16549h4121J04991R2564L8428q1904l0460m3383P3421j93365j26939J06205L8060
16538a06503k2761K1297J11298M4989q4011j8595M1040J5315m399N8255r2284
16527c6359J9503M6641m2170o2091P4292M3326P1013j04441p9541m2606j347L396
16515a10384M4046l3751Q9792l6036j17562j2336Q0429K5403R0636O1178K3629
$$ y = [-93319, -47751, -77433, -188097, -335449, -356961, -228553, -75715, 8938, 90522, 96818, 109650, 25554, -177138, -130041, -106007, -41137, -41008, 39829, 121362, 83278, 57626, 46754, 55127, 73939, 77142, -3709, -69340, -87533, -97067, -90362, -26947, 15661, -48057, -78832, 30148, 88102, 34111, 25465, 50132, -11574, -9844, -132556, -177646, -151969, -144320, -43564, -84121, 20870, 113434, 151862, 69958, 39498, -3885, 69536, -123829, -250768, -144563, -106503, -129264, -107967, 3331, 48320, -35691, -54286, -13246, 2069, -2330, 55925, -36359, -16856, 29785, -12385, -74476, -184, 43142, 114155, 9714, -69827, -112433, -113780, -110384, -66338, -100089, -10297, -46333, -163895, -176231, -95802, -70399, 20237, 81415, 105044]
16504A05044p2013k1441l1057j20018n7322k569N7266M4728L1601l2818L5107
16493f3492P9281L6020r9040K3965j5418j10274k7874M9872j7204j12627n844
16482b62635N9272R0045L6350l0428K9790m3343K0467L6259n8379J015N768p983
16470a23802K3650K2786O4505n6036m7367r249J03618J11563Q1235J0709j0832
16459A70780j04427j44040K1763J02972r896j13210p8303J12812J53492j30590
16449a8647n749K7219p2728j0566J397L3321o0714N59Q4846N0706q980j21500
16437a00836L6382j0779n0323j0981M7132Q7218o2342j7094J31269O5031p4155
16426D0522M163j16812k5144o096O1118L8164O0934k8932l700m6461q2453O5248
$$ y = [105044, 33031, 11590, -19467, -139485, -196807, -199376, -142110, -97382, -65781, -98599, -63492, 15789, 51809, -47231, -23266, -38684, -148958, -176832, -126960, -144164, -256791, -262635, -203363, -113318, -76968, -107396, -77606, -120949, -100482, -64223, -122602, -121587, -115819, -123802, -100152, -77366, -12861, -68897, -116264, -125513, -21895, 89668, 170903, 181612, 170780, 66353, -77687, -55924, 47048, 37152, -76058, -154361, -41549, 111943, -18647, -24396, 2823, -69905, -80471, -79074, -45753, -106467, -105908, -21062, 29644, 20664, -100836, -64454, -75233, -125556, -136537, -89405, -2187, -64529, -81623, 49646, 114677, 40522, 44685, -72127, -97271, -103367, -42249, -4085, 56849, 27917, 24217, -22244, -104697, -39449]
16414c9449P4240J1911M1223L9101n9488l2378o5746p6094q746L3819L474m2638
16402a20771j00845n4406O7350O0640R5118P3857N3933p1198M6836J4266K1799
16391H6579m584L0287q5205l8172l1981r0502q1499j2035Q9660P3932k7199K0004
16379g0715N285j3193j12202k4501J40118O4133M5169O7081m1160j02562j5822
16368e8369J5264n5111K3298J08601M7708p0012p8113K4367R5016K4844j01449
16357b3956j08323O9264M147o9440q1475N8337P5726n4516K8048J16391n7967
16346d3764P468l5770M3294K8524L8746m6621l8032l1141o0094K2730J25503K3203
16334C4046p8455p2863p9189m33L8085J92212l3614l2931L1334n4602R571L8588
$$ y = [-39449, 34791, 46702, 87925, 127026, 67538, 35160, -30586, -106680, -115426, -81607, -78133, -120771, -221616, -276022, -208672, -148032, -52914, 20943, 74876, 3678, 50514, 64780, 86579, 81995, 112282, 27077, -11095, -43076, -133578, -215077, -227112, -137452, -63520, -90719, -70715, -65430, -78623, -190825, -215326, -75208, -11075, 34094, 101175, 60015, -42547, -58369, -43105, -98216, -74918, 33683, 81391, 11379, -66734, -42367, 52649, 77493, -23956, -132279, -63015, -58868, -128308, -209783, -151446, -75720, -130236, -102188, 14203, -43764, -36296, -72066, -28772, -248, 38498, -8123, -46155, -77296, -137390, -114660, 10843, 34046, -44409, -117272, -196461, -196894, -158809, 33403, -211, -33142, -1808, -56410, -46839, -8251]
16322h251M4367M6026m8479p0017r864K1178J406j58510o8365O3959J30010J44500
16310H7960l0495J9561q2677q6848K7386l6499P2657j9569Q984J8296Q82J6463
16298c899l2476q9670p0031j8280J26233R0980j13485l0428R7372N6630j1644
16287A302o5778M1998M5389n3293n2029Q2700R2158j09624j01188R4910O7680
16276D4225J8861q3391o8960P3056l807o6435k1900J1644L3677k4908o4937K0994
16264a31881J2756M2343R2507L9128o9253J9672n1885q5837N1796O5402R4984
16253G9732O3951j54195j67075j9671R9733L3509j4578j18515o2266P0376J27418
16242f1581k5789J57373m3826j3561R111n1603L3186p712m0775o2043q3007p3872
$$ y = [-8251, 36116, 82142, 33663, -36354, -46218, -25040, -23634, -182144, -250509, -186550, -56540, 87960, 57465, 77026, -5651, -92499, -65113, -101612, -28955, -48524, -39540, -21244, -20362, -3899, -36375, -126045, -196076, -214356, -88123, 2857, -110628, -141056, -43684, 12946, 1302, -64476, -22478, 22911, -30382, -82411, 289, 92447, -17177, -118365, -23455, 44225, 63086, -20305, -89265, -16209, -20016, -86451, -108351, -96707, -63030, -87938, -152875, -131881, -119125, -76782, 15725, 54853, -14400, 5272, -46613, -132450, -80654, -15252, 79732, 143683, -10512, -177587, -197258, -97525, -64016, -78594, -197109, -259375, -188999, -61581, -87370, 70003, 26177, 12616, 21727, -29876, 3310, -4402, -45177, -107220, -190227, -264099]
16230b64099O0440J2533k6567J02099J31885O8852o0190o0784L4902n5623P2148
16219A5596k2494R6718N7800M4956p1519m9220o0672J48102Q2938j24023L3902
16208A52084K1426o7574j13360N1223k7484L8967P1350Q488j0052J8670o0487
16197H3251j6358L9483j81977r9879k9286J35186J10363j17368k5157R0678O3476
16186E2412J0026r6710j59516J02754J20220N7662j7173r2120m4744j16624l7132
16175b20945J02903J31761K5373j0649l9546M5424K9682l0997n7119q6195J888
16164a08420p4027j7342j7493R179N4236J07652J2599M4340r079r4919j10245
16153b03519J16100J01214o913k0321J09792J8151J5702o6151j00011K5731k316
$$ y = [-264099, -203659, -191126, -217693, -115594, 16291, 85143, 24953, -35831, -929, -56552, 15596, -6898, 89820, 147620, 192576, 121057, 71837, 11165, 159267, 242205, 118182, 152084, 173510, 105936, -7424, 43799, 16315, 55282, 126632, 135120, 125068, 143738, 83251, 66893, 106376, -75601, -175480, -204766, -69580, 40783, -76585, -101742, -11064, 52412, 62438, -34272, -193788, -91034, 29186, 86848, 69675, -22445, -67189, -183813, -220945, -118042, 13719, 39092, 28443, -11103, 34321, 64003, 33006, -24113, -110308, -108420, -182447, -199789, -217282, -208103, -153867, -46215, -33616, 10724, 1645, -93274, -203519, -87419, 13795, 6882, -13439, 96353, 114504, 130206, 64055, -35956, -10225, -12541]
16142a2541p9533k6016k8850q920o2937K5700J42886m8655j57549L7204J53705
16131f5506J84842l6875j48955j11965P8132J4263q3267j02424J38306J96464
16121F3015J5960o9465m5451j45606K1022N2270Q761o1810n5101J15393J46559
16110D5547N5654q6760r2439Q33J1477n6376M4676j7600J4752m0065P2892J17011
16098F9602L9221O3582o6552p3336j252L4722K86K4263j21671L2940K3490L7918
16086F3213N827N044N9138K9350o0710l4936m7652K7876L1840r9876m5318m6965
16074a13169k2342l4310l139m5142k4860P1708J17488L7342O596Q0575j7990P861
16062F0618m9240m9911L382J226K7653m4071o0575l0477J35625k198r719q2179
$$ y = [-12541, -92074, -118090, -146940, -155860, -218797, -193097, -50211, -98866, -256415, -219211, -65506, 119336, 82461, -66494, -178459, -100327, -86064, -169331, -271755, -133449, 63015, 78975, 9510, -35941, -181547, -160525, -108255, -99494, -161304, -216405, -101012, 45547, 101201, 14441, -77998, -77165, -65688, -122064, -77388, -94988, -80236, -120301, -47409, 69602, 108823, 172405, 105853, 32517, 31265, 65987, 66273, 90536, -31135, 1805, 25295, 63213, 69040, 74084, 133222, 162572, 101862, 66926, 19274, 47150, 78990, -20886, -66204, -113169, -135511, -169821, -172960, -218102, -242962, -171254, -53766, -16424, -9828, 70747, 52757, 60618, 11378, -38533, -35151, -33925, -6272, -50343, -110918, -141395, -5770, -7968, -17687, -99866]
16050i9866K2048J07556M050k7750j01463O2113K4786n2106k3804k2892L601j1465
16038a15192L5531Q1354l4550L1533O6772m6570l8869J7606n8094j1692O8783
16027c388p9399m982R2641J08170m7165l7295o4507j24355J0057J639k5424k7908
16015b01916p1536M7241K0169J26738J2367L9519j6661l9517O3605K3050p9855
16004g6796K1517o1069l1055M5234J0136q241K8977L4724L1323j06961J7733K9179
15992f5299J7674n2508l5667r6816p0813J04215J15150P1784P3126n3534n9711
15981e2399L2357Q8879m8285k7707l0650K1078n569J0478N3048P2601M5190j24058
15969C4963l8941J2939p1263J21265p3696n9135L1403L7027j29073m175L9426
$$ y = [-99866, -77818, 29738, 33788, 6038, -95425, -33312, -8526, -60632, -84436, -107328, -103727, -115192, -79661, 1693, -32857, -1324, 65448, 18878, -19991, -2385, -60479, -72171, -3388, -82787, -87769, 4872, 113042, 65877, 28582, -35925, -160280, -150223, -148584, -174008, -201916, -273452, -226211, -206042, -79304, -66937, -27418, -44079, -83596, -19991, 3059, -76796, -55279, -116348, -147403, -102169, -92033, -100274, -71297, -36573, -5250, -112211, -94478, -65299, -47625, -100133, -135800, -232616, -303429, -199214, -84064, -12280, 60846, 7312, -52399, -20042, 68837, 20552, -7155, -37805, -16727, -22296, -11818, 41230, 113831, 159021, 34963, -3978, 8961, -62302, 58963, -14733, -73868, -42465, -5438, -134511, -138686, -99260]
15958i9260M5820l0393j08870o349N4830k5868J32830N7912n7443k2469l977r7654
15946a60891J16100m0848J1412o0752K8195j8159P1678N0528L5588m6529L088
15935a0590n4212o1454P7032o0284R122j6203O1046p4074M3085Q8540n4388L0436
15923b1944J4698j21865O1143N7751m1131K198J06119j2054l3062l3711p8842
15912a00700N5559J2975J29631m6046p9873q7190J3120M4497J09894n433l5690
15901A0744j23694k1745j0136P1331j1657m2552O7467k694L1905P386O6999J6961
15889F0315J5550j7609j8254j3460J6905l6013M0074P6812k2254l958J0962j14855
15877e785R1631L2572M0898n858N894N1959j38147j08255K185j1380R080k9860
$$ y = [-99260, -53440, -83833, -192703, -199052, -144222, -170090, -37260, 20652, -36791, -59260, -63237, -160891, -44791, -85639, -74227, -134979, -106784, -124943, -53265, -2737, 32851, -13678, -10590, -64802, -126256, -49224, -109508, -100386, -116589, -55543, -129617, -86532, 2008, -52380, -21944, -7246, -129111, -67968, -10217, -51348, -49150, 56969, 44915, 11853, -21858, -100700, -45141, -32166, 97465, 51419, -28454, -115644, -102524, -58027, 51867, 46434, 10744, -112950, -134695, -144831, -73500, -85157, -127709, -60242, -62936, -31031, -23645, 43354, 60315, 75865, 58256, 40002, 26542, 43447, 7434, 47508, 124320, 102066, 98108, 109070, -5785, 85846, 118418, 159316, 153458, 159352, 211311, 73164, -35091, -32906, -44286, -35206, -65066]
15865f5066o3645o4706m8872J00531p4406l2122L7833J30550n547J4802k4401
15854i5049J79432J24754o2165j82354l1505N0181J40647k5800o3731J2105l0276
15843A6239k4551O3097q783r1794o827p4395J29282J12844j03959r5824P7057
15832g614l8102p804N683k4170j17502o3368J51310n2910j4893r9600o9232J3930
15820c24272O1335J33227J38657M1439l9680p0042n2711q9584n4959P9395J3652
15809a63543L7897K14256K3468j25889q2520M5537l6462l7422L9832K74O3949
15798b0623R4924J9058j03495l0102K6907N961r7533l1666L997L3857J09442J69093
15786A79820N7330j19996j91885p1042o2348M233R2485J3082L1430P1049L5139
$$ y = [-65066, -128711, -193417, -242289, -141758, -216164, -248286, -210453, -79903, -85450, -70648, -95049, 84383, 209137, 146972, -35382, -66887, -16706, 123941, 98141, 34410, 46515, 16239, -8312, 54785, 46002, -45792, -52619, -127014, 2268, 115112, 11153, -84671, -7614, -45716, -53520, -47837, -72007, -189509, -252877, -101567, -154477, -169370, -268970, -338202, -324272, -262937, -129710, 8947, 50386, 10706, -59336, -112047, -201631, -256590, -177195, -163543, -125646, 88610, 112078, -13811, -96331, -50794, -87256, -124678, -84846, -84572, -20623, 74301, 93359, -10136, -40238, -13331, -7370, -104903, -136569, -132572, -98715, 10727, 179820, 237150, 117154, -74731, -145773, -208121, -203888, -111403, -98321, -66891, 4158, 39297]
15775C9297j09260k8891J00540k593q6217J71010J14851j38456j36810J147k5547
15764a00929O4922L8570q2614q0723J60539l3764q3752j2823R9848j2354m9960
15753i3040M4915N7060J7102j21032n6477M1914M957l252P8014j462o5029l9998
15741a36328k5178O9289Q2327j10092M0831J47914O484n2409O2388N7383K5781
15730A68390L8309J3687j21460j53952J7521N4832J4903J7122K5256q561J8240
15719H4287o1316k5871n1850l5234j3061q1424K134M7567j4914J19996N0547M2706
15707F3567J055M2370j68449o3129K5166m9179k2694N1431J60414q9091J6331
15696c2208J42844j3089k5268j46474o7750k9184J1960N4807l1251j5052o0685
$$ y = [39297, -69963, -98854, 1686, -907, -87124, 83886, 198737, 60281, -76529, -75382, -100929, -36007, 2563, -80051, -160774, -235, -33999, -117751, -130574, -30726, -43080, -93040, -48125, 8935, 26037, -94995, -151472, -109558, -104601, -107853, -29839, -31301, -96330, -136328, -161506, -92217, -9890, -119982, -79151, 68763, 75247, 22838, 85226, 142609, 168390, 206699, 220386, 98926, -55026, -37505, 17327, 32230, 49352, 74608, 66047, 84287, 22971, -2900, -54750, -89984, -103045, -184469, -182335, -134768, -149682, -29686, 20861, 63567, 64622, 106992, -61457, -124586, -99420, -148599, -171293, -119862, 40552, -48539, -32208, 110636, 97547, 72279, -74195, -141945, -171129, -159169, -104362, -135613, -150665, -211350]
15685b11350O0018J59897n4987J0234M1296j74701M7696N4547K4828L8495L5650
15674C1623Q2994J15128K229j33621o1732R257m6337Q953j2795J18896k6062p2212
15662A6321k0268N8576j0050l8137K981m4518r8649Q8727L1940o3968L3136L4540
15650i369J7799M7136j8011k3673M9800J0945L238K9439r7814K9372l8403r815
15638i356K4522K454M4868L5488m2622p6101j8530o114q0085l41j11O0931N4866
15625a0131o1435j25239R661K1067j0192L2495j2397K1619k0014m688K9154o4758
15613a94858J8232J22935J0824M7573l6919o0091P5918Q3752J8371J13509n911
15602A93335j5208J6232K1476r5772j71072p606Q6782Q4193L4298N8397K8358
$$ y = [-211350, -151332, 8565, -46422, -36188, 5108, -169593, -121897, -67350, -42522, -4027, 31623, 114617, 229745, 231974, 98353, 36621, 45878, -459, 8494, -4301, 114595, 88533, 16321, -3947, 54629, 44579, 6442, 9423, -35095, -133744, -45017, -13077, -77045, -43909, -9369, 8430, 55566, 37555, 13882, 63682, 74627, 77865, 107304, 9490, 38862, 459, -9356, 15166, 17620, 62488, 97976, 55354, -20747, -39277, -45391, -125476, -125817, -125928, -64997, -10131, -71566, -196805, -187144, -166077, -176269, -143774, -156171, -134552, -154566, -159254, -130100, -194858, -176626, -53691, -42867, 4706, -32213, -92304, -16386, 67366, 85737, 199246, 193335, 178127, 194359, 215835, 120063, -51009, -58615, 28167, 112360, 146658, 205055, 233413]
15591B33413l7476q0851r3458p6866J12605o803p920K4980m2059p2543N9314J2335
15579B4671j36658p8511K2798O6990M3129J6859n8612r1183K7351P1844J0981
15568h0341O1266Q994K7628Q438m193L2689j32751o5603p2690j1284Q1571J09073
15556c7203J11042M6490m8471o3677j209P8023o6789q0085K7653j7776Q9972L5264
15544G3234M644m280q3127J3944j22148q3722Q2527K23170L6589l0087l452m5316
15532F1976j21087j0452M1762m71J34531J8598j73386q3308J16135n5671p3708
15521a45081O7107L4885m9886N0849M6710l7139n712J29480j16641p5761r4724
15510a95913k0790M1459Q1211M8510m6749m6008l8891M8919J1198n1674j8811
$$ y = [233413, 195937, 115086, 21628, -55238, 57367, 50564, 42644, 67624, 25565, -46978, 12336, 24671, -111987, -190498, -167700, -100710, -57581, -40722, -99334, -190517, -163166, -91322, -80341, -19075, -10081, 17547, 25985, 21792, 54481, -78270, -143873, -216563, -227847, -146276, -37203, 73839, 120329, 71858, 8181, 6972, 84995, 18206, -61879, -34226, -52002, 37970, 73234, 77878, 73598, -9529, 4415, -117733, -201455, -118928, 104242, 140831, 110744, 107292, 61976, -59111, -69563, -27801, -28272, 106259, 124857, -48529, -131837, -15702, -71373, -145081, -77974, -43089, -92975, -42126, 4584, -32555, -38267, 91213, -25428, -101189, -195913, -216703, -175244, -94033, -45523, -92272, -138280, -177171, -128252, -117054, -168728, -187539]
15499a87539Q3501N5428O9906k0763M0247J17034N5203j01312j8600K0518m1656
15488G1967N2626j4504M6729l1251o1005m5891j91010n0870N9369L9918Q3531
15477d0391r5267p5162j346J09883O5846J3699r909N4492n4566j63855L7355r001
15465a68222q610O8468Q3334m0060n2855M6469Q4122J8398r17N5608K6424q640
15453A03519n4606n2408K4124o257q8321o4724O4978J44771o9652n6649m0207
15442i5432K622O9054J3596o5642L8836J08850O6702q1909j33983m9926Q7550
15431c9682J1092J1711N1181J60312q649j26338j58063L9115J34421k1365M5610
15420I9345q8236k8242l8790j31524O7750P9752J65314R3818o2123j06871q0112
$$ y = [-187539, -104038, -48610, 21296, 533, 40780, 157814, 213017, 111705, 93105, 113623, 71967, 124593, 110089, 156818, 125567, 64562, 18671, -172339, -223209, -163840, -123922, -40391, -135658, -210820, -212166, -102283, -36437, -22738, -32647, 21845, -32721, -196576, -159221, -168222, -176832, -108364, -25030, -65090, -117945, -71476, 12646, 31044, 30127, 85735, 112159, 103519, 48913, -3495, 20629, 14372, -73949, -138673, -73695, 71076, 1424, -55225, -95432, -92810, -23756, -10160, -75802, -36966, 71884, 138586, 56677, -77306, -127232, -39682, -28590, -16879, 34302, 194614, 185965, 59627, -98436, -59321, 75100, 53735, 99345, 11109, -17133, -55923, -187447, -119697, -39945, 125369, 219187, 157064, 50193, -29919]
15409b9919J6230M3431o8054N7964M0754j8705j08059N7989J47198l1595j51173
15398d3939l4840L4321p5600J02130Q7129l0219M5308K1951P0019M9429m3769
15387A81920q5003r6784q56k3018J887k2943m694M9965O8821k1594Q1107Q0761
15375B09569o3889J4416l0987n6099Q861j8741p701Q87j6905K1605Q6209M4529
15363A91754o3533r9906j06j03878L6253L0245m8222r7026P2459j6370J454J74936
15351G8060O4051k6015j9863n2775l9037K0287m5794r8217J8962J1024J18529
15340B9212R6668p0732j52529m8224q2632R6973J92277L7941M2640j04j19598
15329B1892r2495P1335K4134m0427L2062L5539j8844r8861o4479K0613K8060m8078
$$ y = [-29919, -13689, 29742, -38312, 19652, 60406, 41701, -66358, -8369, 138829, 107234, -43939, -78779, -44458, -120058, -17928, 69201, 38982, 84290, 106241, 176260, 225689, 181920, 96917, 133, -723, -23741, -21854, -44797, -49491, 474, 69295, 47701, 128808, 209569, 145680, 160096, 129109, 73010, 81871, 63130, 55429, 56316, 39411, 61016, 147225, 191754, 128221, 28315, 28209, -75669, -39416, -9171, -57393, -154419, -81960, -98330, -96876, 78060, 142111, 116096, 96233, 43458, 4421, 24708, -21086, -119303, -100341, -89317, 29212, 125880, 55148, -97381, -145605, -228237, -131264, 61013, 98954, 141594, 141490, 21892, -70603, 732, 24866, -15561, 16501, 52040, 33196, -65665, -130144, -109531, -81471, -129549]
15317a29549L3528k5763P7554R1288o6847j25332N0673R0796J7647k3991j28941
15306a38937r853M4893j5576J73579N1876l727J578n7930n1432j3073p6498l6051
15294a31151k333J23161l1055J5871j4035j04755Q9282M1773n613K6123l3939
15283b6671j15419K0752J7366K1248o116J7648J5131K5178j17199j29622l1899
15272c09603p2968j8590J58653J29557J06798r3523P783L7294m3158o8862J0981
15261a55638J03655Q7980m7531j13639Q051J23171n1474N1062L808q0483Q8504
15250A7466O6674j0001l4242p0860j5148j1549P6855O1443l0781n8158j87072
15239a95373j25496O3210K02387J06517N0057j07574p1270J8953J14113M1842
$$ y = [-129549, -96021, -121784, -44230, 47058, -19789, -145121, -94448, -3652, 13995, -9996, -138937, -148790, -103897, -119473, 54106, 105982, 102255, 103833, 45903, -5529, -18602, -95100, -131151, -133484, -10323, -41378, -25507, -39542, -144297, -55015, -13242, -18855, 7268, -26671, -142090, -121338, -103972, -82724, -88840, -71192, -56061, -30883, -148082, -277704, -309603, -382571, -401161, -242508, -112951, -6153, -99676, -91893, -54599, -97757, -166619, -155638, -51983, 35997, -11534, -125173, -117122, 6049, -45425, 5637, 9445, -71038, 17466, 84140, 74139, 39897, -30963, -46111, -57660, 19195, 80638, 49857, -8301, -195373, -320869, -257659, -55272, 51245, 101302, -6272, -77542, -58589, 55524, 97366]
15229I7366l8998J02391P5561J34370m0966k17222j57750M0084K2821O8878Q183
15218I4718M9415l1554n3370l0176o1695l8985l5342L6819L6163Q3037P129j85610
15206a29451j0641L3604J02291P1566K8155K9302J4624M1659M8511m2137j89607
15195b124k3991j8633L2784N1161L5527j08366m1545k1470n0493J8187J25969
15184b994O7157p444m5832p1124p2287L1091L3809k6323L7463J3092j03245q9664
15172b36301N417N6402j9317J80095J83762R158R616M1079j29552m0421q8892
15161b8954J7550j4801j3736l6612p4041J0518O9530P119q634o0918j20668N1283
15149b02364O3838J06641n4593J5914Q0697n6272l7959m6380Q2594k9533m2096
$$ y = [97366, 58368, 160759, 236320, 370690, 329724, 112502, -45248, -5164, 17657, 86535, 94718, 144133, 112579, 59209, 29033, -32662, -71647, -106989, -70170, -34007, 49030, 56159, -129451, -140092, -106488, -4197, 67369, 95524, 124826, 139450, 181109, 229620, 187483, -2124, -26115, -44748, -11964, 39197, 74724, -33642, -75187, -96657, -147150, -128963, -2994, 64163, 56719, 10887, -60237, -132524, -101433, -67624, -93947, -56484, -43392, -146637, -236301, -230884, -174482, -193799, -13704, 170058, 179216, 188832, 229911, 100359, 59938, -28954, -11404, -26205, -39941, -76553, -150594, -140076, -70546, -63427, -72061, -132979, -253647, -202364, -138526, -31885, -86478, -70564, 10133, -46139, -84098, -130478, -47884, -77417, -119513]
15138a19513o1727J49276Q5285j58k5226n366Q0966k4128p4329r480P8598k9183
15126D5015K7191L7911r2391r8628Q2264J62876J2838l1952k6444l5844J7789
15115A00625N7517p0114n5467q000p1024j265M7519J3742L2443p9030r2140p2851
15103a98045N9157M8699M4210m5233k0316Q79J02720q3055k562Q7108Q1409k4226
15091E0745j4978k0184m4010m1598J39258P3800j09227k1501r1559r8670J42381
15080c5543O3008k29287J04653q154o6503J04004K4980q4777k0167n2356q2894
15069b83036Q9987N063K9769Q0898j638j3428N3687j09595J3501o5732n7097M0606
15057b17015J50228O1671p3530j09079o487J13338P2451J58574P3844j5423k02677
$$ y = [-119513, -181240, -31964, 53321, 53163, 27937, 22571, 103537, 79409, 5080, -4400, 74198, 45015, 72206, 110117, 17726, -80902, 1362, 164238, 177076, 145124, 118680, 82836, 100625, 158142, 88028, 32561, 24561, -46463, -47728, -209, 13533, 45976, -33054, -125194, -198045, -138888, -90189, -45979, -91212, -111528, -110649, -7929, -90984, -93546, -6438, 74971, 50745, 35767, 15583, -28427, -70025, 69233, 143033, 33806, 12305, -79254, -177924, -35543, 27465, -201822, -97169, -105323, -171826, -67822, -42842, -127619, -147786, -200142, -283036, -193049, -187986, -158217, -77319, -78957, -92385, -38698, -148293, -134792, -200524, -257621, -217015, -66787, -5116, -78646, -187725, -194212, -80874, -8423, 150151, 223995, 208572, 5895]
15046E895j18035l954J1143J17855O9775J839r1614k9273N919L6465k0342q1566
15034i5893k5279R8978J30938J05014L6381J5422o9291k3631m1254j14536j39076
15023a22227N2401K6101l672p5472K884J28002J03591n9661l5942N2235l3694
15012C4546P3214K5346m0752j9824l2202O7235n209p5958j20381M7931N3080p8746
15000g1720l0311R4214J33281j2326p1101q1129j16219O8356M9682o6878J2018
14989i2133O1865L9137J9179j02530j24464j0206J44388O5545J304M4917p2869
14978b5867n9109M1156K0842o3761M3512K3902N967L3899r9570J9732K2834n324
14966d1787p6311J11087J47127m3027p0451k4206r0656Q4665P0180j10219q4835
$$ y = [5895, -112140, -116094, -104951, 12904, 82679, 84518, -7096, -36369, -30450, 6015, -14327, -95893, -121172, -22194, 108744, 213758, 250139, 265561, 196270, 172639, 131385, 16849, -122227, -69826, -43725, -47397, -122869, -119985, 8017, 111608, 51947, 16005, 68240, 34546, 107760, 133106, 92354, 72530, 40328, 107563, 102354, 26396, -93985, -46054, 7026, -71720, -102031, -7817, 125464, 113138, 42037, -39092, -155311, -86955, -37273, -104151, -92133, -30268, 8869, 28048, -74482, -198946, -209152, -64764, 781, 2085, 47002, -25867, -84976, -43820, -22978, -86739, -43227, -19325, -13358, 20541, -79029, -59297, -36463, -41787, -118098, -7011, 140116, 97089, 26638, 2432, -88224, -3559, 66621, -43598, -128433]
14955a28433n1706P0472J48855L7754r102J3195j32055q3381J8486K3731L3249
14944e8935O6444P3938L2296L1557R499p1413m9944j10380j38941J15285J39008
14933C8414R8420k6453m9360N0651J324J431j5326q9129J7733k7567j315j64138
14921a65315J9386M6723k3422M476P0008q551j19795M8146m219J5406j2797L8470
14909i1484J1765P130K5431J12788K7120J0151m2886j2636M5064J02205J59547
14898C54195Q372o9366R005j04784j16837L6678n08j4102p2151r2982n1078M8578
14886f4980Q6471L9502p8890o4555J8145r980m3037J8369r1865O7787P1961P0279
14874A9207o8741J904J3938N8796L4473J01878m4949j79427k10631m7116q053
$$ y = [-128433, -180139, -109667, 39188, 76942, 67840, 81035, -51020, -134401, -115915, -92184, -58935, 7509, 81447, 113743, 145300, 154799, 83386, 33442, -76938, -215879, -100594, 38414, 136834, 110381, 61021, 111672, 112996, 114427, 99101, 9972, 27705, 138, -1177, -165315, -145929, -99206, -122628, -118152, -48144, -56695, -176490, -128344, -132563, -117157, -129954, -91484, -79719, -72589, -47158, 65630, 92750, 102901, 60015, 47379, 92443, 194648, 354195, 362567, 293201, 302206, 197422, 80585, 117263, 116755, 102653, 30502, -62480, -113558, -64980, 21491, 60993, -17897, -82452, -64307, -74287, -117324, -98955, -190820, -123033, -51072, 19207, -49534, -47630, -33692, 25104, 59577, 161455, 116506, -62921, -273552, -320668, -328721]
14863c28721J66052J74758k529l4845N3906L5789m8182N43P7073L9853p7951j14554
14851e8808M2246q691j27779J6590R7680P2017r8945j3878k0132j08712M3685
14840a64727M656J07267M458p3446j21401J38179J71680O2674p592p1385L0151
14829H0514q650J0022p4815m7744m0100n3155K2214p9160N7305J02354J00405
14818F9190N6902m9255m7436k4714n9822j28512N4106K9691K213k8092K5977K0851
14806g8901M592J0858Q1031n7692p8283P9318k4729K1954M2121p6686p7120O538
14794a46999j1439J12083r0111R2223l305J42563L2640j08255o0868p3630J1605
14783a03493n2293j2244P0887L1733p6227j67145K1973O2589J80527q4506j10223
$$ y = [-328721, -162669, 12089, 9560, -25285, 28621, 64410, 16228, 16771, 93844, 133697, 55746, -58808, -16562, -25253, -153032, -136442, -38762, 33255, -65690, -79568, -99700, -208412, -164727, -160071, -52804, -48346, -121792, -243193, -105014, 66666, 129340, 121748, 50363, 80514, 71864, 81886, 7071, -40673, -80773, -133928, -111714, -190874, -133569, -31215, 69190, 126092, 76837, 29401, 4687, -55135, -183647, -129541, -99850, -97637, -125729, -99752, -78901, -74309, -63451, 17580, -40112, -118395, -39077, -63806, -41852, 269, -76417, -153537, -146999, -158438, -46355, -136466, -44243, -47548, 95015, 127655, 19400, -41468, -115098, -103493, -155786, -168030, -97143, -65410, -141637, -308782, -286809, -224220, -43693, -128199, -238422]
14772b38422M9741Q4584J2969K1755n1842J0599L0020J21544K4015j97009Q9777
14761d2269P860o9976j5666O0471P6059q8915J413K4664N0529J12583n5102p9038
14749a7387k0457o7132l5611m57k8012M0072N8084l7568n0627J7240M6383L7151
14737e8321J7938K4968n5679M9655k0869p8341L7059l0389j01148m9412O5790
14726a98749l121Q0049L6230J1210Q7611Q7379K0316j06436M0350J1973j05666
14715c8854n559r08O4278r7236o3468J2680K5795M6622o9675m9069L9252J1393
14703a24749M3410J2457q0854j1152M3104K7771n7906m261O0593J01955O23o5303
14691e4312n8931L7387J3135j5946M0712K8740k0580l8069J02946P6504k3373
$$ y = [-238422, -188681, -104097, -91128, -69373, -121215, -110616, -80596, 40948, 64963, -132046, -42269, -34409, -104385, -120051, -59580, 16479, -72436, -71023, -46359, 4170, 116753, 61651, -17387, -37844, -104976, -140587, -141044, -169056, -128984, -70900, -108468, -159095, -141855, -95472, -58321, -40383, -15415, -71094, -21439, -42308, -120649, -83590, -113979, -215127, -264539, -198749, -201870, -121821, -85591, -74381, 13230, 100609, 120925, 14489, 54839, 66812, -38854, -44413, -45321, 18957, -78279, -141747, -129067, -103272, -56650, -126325, -175394, -136142, -124749, -81339, -68882, -149736, -160888, -117784, -90013, -147919, -152180, -91587, 10368, 10991, -54312, -113243, -75856, -62721, -78667, -37955, -9215, -29795, -67864, 35082, 111586, 88213]
14680H8213m7518n7774L5220O5863q5117n0734L177m7492P246j7085q5563N5439
14668a36125J43205p4269o0829K7647P9592J48434r6223q5568j7082j4054p517
14657i2789J6204n7057m4028O1900M1918n0869Q0944P5746L9328J5403l2004j60867
14645a06171J8835J73072m3276j63855j15308J81912J76917l0109j00125J20682
14635A12574l5660j06385P3892j79659l4281Q6974J63501K5545r773M6953k4422
14624A19259l6287l0722k9293o1371l0986m0093K455J13853m232j1907N7248J02382
14612A50306j08916r7907J3786J6063r9066P3044R4615j0172o0839l66O0382j07633
14600g6703J8140J78444j3443j12128o1378j12368J3577j6821P0162L1259k0575
$$ y = [88213, 40695, -17079, 18141, 84004, -1113, -51847, -48670, -96162, -88916, -106001, -191564, -136125, 7080, -67189, -128018, -100371, -20779, 127655, 31432, -54136, -71218, -85272, -92789, -76585, -133642, -177670, -115770, -73852, -124721, -43777, 31969, 71297, 86700, 54696, -106171, -87336, 85736, 42460, -121395, -236703, -54791, 122126, 92017, -8108, 112574, 76914, -29471, 44421, -135238, -169519, -82545, 80956, 106501, 96728, 143681, 119259, 82972, 52250, 22957, -38414, -69400, -109493, -107038, 6815, 2583, -9324, 47924, 150306, 41390, -56517, -42731, -26668, -125734, -52690, 41925, 31753, -29086, -29452, 30930, -76703, -58563, 119881, 106438, -5690, -67068, -179436, -165859, -182680, -112518, -81259, -101834]
14589a01834J1837Q9186J3202K8915j08954q2968N0864J04364J10101n8579l0925
14578B5209N0310L3567j3912m4071j13997q483m4517Q9640M3547J06196r8998
14567B4491Q7797j7149j02824o2811k9239J0380l3755P354N8808N1181n3694j04542
14555a64003J0882J7147L4873r2576l5273J34635n4192l8857M1931o658M9559
14544a02532K2830J12778m0969p2998m2908l5776P4140k392j3402n258o4116J2410
14532a58193N1688R5080J15089J3132n5365K6332L3657m2678P594L0029o9189
14521D7176n5771R5084M2585L2987k4366l8197m7761L977m0602j08933K683L0271
14509f0867r546K4281m7129j9263O4222o3566p160q9901J5667P4778J15007K8879
$$ y = [-101834, -89997, -811, 12391, 41306, -67648, -150616, -99752, 4612, 114713, 56134, 25209, 75519, 109086, 95174, 51103, -62894, -71377, -115894, -26254, 17293, 123489, 24491, 112288, 95139, -7685, -70496, -99735, -89355, -123110, -115756, -56948, -5767, -59461, -164003, -153121, -135974, -101101, -193677, -228950, -94315, -148507, -187364, -145433, -152091, -102532, -79702, 33076, -7893, -80891, -123799, -159575, -85435, -87827, -101229, -106487, -170603, -158193, -106505, -11425, 103664, 116796, 61431, 87763, 121420, 78742, 86336, 116365, 47176, -8595, 86489, 129074, 162061, 137695, 99498, 51737, 55714, 15112, -93821, -91138, -60867, -70413, -46132, -93261, -112524, -48302, -111868, -119028, -208929, -193262, -118484, -3477, 25402]
14497B5402j3048l4091j7232Q6829J9088p221j1090k5499k1417n6906k8274N0901
14485c2558L8327q093n3465n9164j18667k433K0391M641M9190N6131J10461j38364
14473a33603n0683J07461n46J3108k942R6852M265k9081j06704Q392J1015L0437
14461e2029p1997p6561R5185l9584k4473M6228J08959M7466O1420P7105p9684
14450I2035j10642r1655L1484O6214J01622n4276K2716o9127l7659m132L8872
14439a4548O5291o7194o488m8341Q8104l9482r9470o71o4079k535J6430O1401
14427a11582R5880J4011M2020J6997J23722L2872k21152j10782K4223P8082J23500
14416A07791j4039j53717l7366J40683O6306r0776p4019q540K7836l0385J0813
$$ y = [25402, 12354, -21737, -38969, 47860, 66948, 59727, 48637, 23138, 1721, -55185, -83459, -32558, 5769, -2324, -55789, -114953, -233620, -236053, -215662, -211021, -161831, -105700, 4761, -133603, -184286, -76825, -77371, -64263, -67205, 29647, 33912, 4831, -101873, -93481, -82466, -52029, -124026, -200587, -105402, -144986, -169459, -123231, -14272, 33194, 94614, 171719, 92035, -18607, -110262, -78778, -12564, 89058, 34782, 57498, -11629, -49288, -53420, -14548, 50743, -16451, -22939, -71280, 16824, -22658, -122128, -122799, -186878, -189413, -172983, -111582, -15702, -1691, 40329, 57326, 181048, 213920, -7232, -118014, -93791, -15709, 107791, 93752, -59965, -97331, 43352, 109658, 18882, -55137, -63677, -35841, -66226, -55413]
14405e5413J1792R4155p7398k2540r0172q8302J13387J11057o9414j4967k0899
14394a08714J0038n1426M3567M3264L228M6941O7876l3090p900n7866m3757o2810
14382a50649m9316K8441O2979M9081R813M5689N12j01602j38713P603J30096P6891
14370b9175l5509j1949j9745q1951j55371P0170J94580R0790K949M405j01261
14359g2067n9970N8042P473P0244k5733J7518P6132r35p6990j58341P747k7275
14347a84155N0589J4730N4357L8672r0036J2764P8802L0445N0799m1573j43670
14336a28276K9762N1110O4482O4104K5874l6005J7894j3332l6277j20882k5370
14325a06916J5565J55270K7668n1557j14093k0243j6628K6185J56996l163j8684
$$ y = [-55413, -43621, 50534, -26864, -49404, -139576, -227878, -114491, -3434, -72848, -87815, -108714, -98676, -150102, -106535, -63271, -60043, -13102, 54774, 21684, 13784, -44082, -87839, -150649, -199965, -171524, -108545, -59464, -49651, -3962, -3450, -105052, -243765, -236162, -106066, -29175, -64684, -76633, -96378, -178329, -333700, -263530, -68950, 21840, 24789, 29194, -72067, -132037, -73995, -66522, 3722, -22011, -4493, 71639, 70704, -6286, -164627, -156880, -184155, -133566, -118836, -64479, -25807, -115843, -103079, -24277, 6168, 56967, 15394, -128276, -98514, -47404, 17078, 81182, 107056, 71051, 88945, 75613, 39336, -81546, -106916, -91351, 63919, 91587, 40030, -74063, -94306, -110934, -84749, 72247, 69084, 50400]
14314E0400r536q8880r4282Q0009J46005N6158n5337n5075k222k8930o4586n3408
14302a19684J91914Q3920J6446j08274n1475j7846j2947j4694j7835l0665L6485
14291d4655J06287p0902n1785o67Q2466Q7573l4767j09885O0961M6829j09985
14280c8530o8679J9711J5645j1535m9566K7128J37204Q9875j2494r044q8765k0131
14268i181K6001O7696O6730L8932j09517j27094k9164J32602J05244l0484q4836
14257D6929q4016J37829J3812k089m4021j0655K2094o9l5877J2031N1122j7590
14245H9500j30496r7626Q7184N4005j41847K192J53106O0123l5052k3864Q2916
14234A00141q1417j13708l9075J02948M5998O2888r6680m7147j4784N8682J0576
$$ y = [50400, 40864, -48016, -142298, -62289, 83716, 139874, 84537, 29462, 27240, -1690, -66276, -119684, 72230, 156150, 172596, 64322, 12847, -4999, -17946, -32640, -50475, -81140, -44655, 61632, -9270, -61055, -61722, 20744, 108317, 73550, -36335, 24626, 71455, -38530, -107209, -87498, -71853, -83388, -132954, -105826, 31378, 121253, 108759, 99715, 10950, -9181, 16820, 84516, 151246, 190178, 80661, -46433, -75597, 57005, 162249, 131765, 46929, -37087, 100742, 114554, 112465, 68444, 57789, 79883, 79814, 43937, 55968, 107090, 89500, -40996, -138622, -51438, 2567, -139280, -137088, 16018, 76141, 41089, 17225, 100141, 18724, -94984, -134059, -31111, 14887, 77775, -18905, -66052, -80836, -22154, -11578]
14223a1578o7937L9796r283K1707k4822K177j03215j05048M1895J08260R7802
14212a0246J0107q5366p2303P2193J5190L2343m4181J9429k1143n8781M8309p1405
14200a65854k1016p7792M3291J12949J07064J5077J0036p2791o6892J8484M6730
14189e0714k1915k793J14668l506K0132j33609j11794l1970J0896J11451q3428
14178a82582j3124R0690N6283N5589j1586k282p368j45274m8650J11962n4351
14167a50693m0363J41096K0185m3918n8649J2263l1569m1301J20128P0345j4450
14156a6926K0947J22434J3526j11652n08n6013n1685N2891M9648j62528l4489
14145a74355L095P6833K3633m8478l08M7370O875o3734l4539R8467J6700K3486
$$ y = [-11578, -79515, -39719, -49002, -27295, -52117, -49940, -153155, -258203, -216308, -108048, -10246, -139, -85505, -157808, -85615, -70425, -38082, -82263, -62834, -83977, -142758, -94449, -165854, -186870, -264662, -221371, -108422, -1358, 13719, 23755, -49036, -115928, -97444, -50714, -72629, -75422, 39246, 35740, 55872, -77737, -189531, -221501, -210605, -99154, -182582, -195706, -105016, -48733, 6856, -4730, -7012, -14380, -159654, -208304, -96342, -150693, -191056, -49960, -29775, -73693, -132342, -120079, -151648, -192949, -72821, -2476, -16926, 4021, 126455, 139981, 28329, 27821, -28192, -79877, -26986, 22662, -139866, -174355, -171260, -94427, -70794, -119272, -119580, -72210, -65335, -129069, -163608, -65141, -48441, -24955]
14133b4955Q7826K049m8287k8966M1153P176N7872R354m6661J9960N3973k2740
14121A07754J15660O1138j27038n0080m2678q1984j50336O0232J74736K8205O5506
14110A61115q5944j8997j64834K6791J4775R2645j4760Q883M1072L3118r2615
14099A249l6774p1503o5968L0637M6583j7933J1034J1354J86127O8404N0555n7343
14087A56422j15312n3068J2828n94P8999m4580O466k3064k8708j97991K4139J61452
14075b3011N8838o4l0862r3976j05728N88O0705Q080N2732J5750M8001Q0673m1873
14062B9853J8813O7559o4474m0967o0328r7317J14522J21592n8779o6232m4276
14051h0034P168n7991Q4892O2511p5099j3578O9244J0715M6503o8728j4498j1526
$$ y = [-24955, 62871, 64920, 16633, -12333, 28820, 35996, 93868, 103222, 56561, 76521, 130494, 107754, 223414, 284552, 157514, 107434, 64756, -17228, -167564, -107332, 67404, 95609, 161115, 75171, 56174, -108660, -81869, -67094, 25551, 10791, 19674, 60746, 93864, 1249, -35525, -107028, -172996, -142359, -95776, -113709, -102675, -91321, 94806, 163210, 213765, 156422, 41110, -11958, 870, 276, 79275, 34695, 41161, 18097, -10611, -208602, -184463, -23011, 35827, 35763, 4901, -89075, -194803, -194215, -133510, -125430, -72698, -56948, -8947, 71726, 29853, 48666, 116225, 51751, 10784, -49544, -146861, -32339, 89253, 30474, -35758, -80034, -72866, -130857, -45965, 16546, -58553, -72131, -2887, 7828, 54331, -14397, -28895, -40421]
14039d0421P3717L6006q842j09191q0162N8687J7454P3393k3899K6587J8112m1307
14027A34j17716l8529N4877J425l8548K6291N4009n8724R8327K4565J1495o0615
14015d3009P3738P0500J8984q1445j44833L3471J83594O8248p9214p2206m7653
14004a9825p1561l2415o8192N7982J86156m7217j07239l5408J08907P1671J7664
13993F0523P3838Q777j23451k7303M2791L1093p1493j05640L5451L9644o0229
13982i5999J51927R5197j7112j65808o3976n2764N1586J60762l1599l0078o9684
13971f7548O253P759K5915k2020l723L2267j43111j40969J09588J45266J32045
13960H1722L2456o2623j3115J0096M0434Q2752M769j28776k0499m4407l4223N905
$$ y = [-40421, 33296, 69302, 60460, -48731, -128893, -70206, -52752, 20641, -3258, 23329, 41441, 134, -117582, -156111, -101234, -99809, -138357, -112066, -58057, -116781, -18454, 6111, 17606, -43009, 30729, 101229, 120213, 38768, -106065, -72594, 111000, 179248, 100034, 27828, -19825, -91386, -123801, -191993, -134011, 52145, 4928, -102311, -137719, -28812, 42859, 60523, 134361, 143138, 19687, -7616, 35175, 66268, -5225, -110865, -75414, -35770, -95999, 55928, 151125, 134013, -31795, -95771, -148535, -96949, 63813, 32214, 2136, -67548, -61295, -53536, -27621, -49641, -53364, -21097, -164208, -305177, -195589, -50323, 81722, 114178, 51555, 38440, 48536, 88970, 171722, 176491, 47715, 27216, -17191, -51414, -45509]
13948d5509l741q061n9200J4724N589N3612L819j998q6036r2369J58942K4971
13936c5257j9320j065L0201o186l3856q9947K6901O2499Q7696L0971j05915o8898
13924a22176O1384J4157p3758k1651J21699J8754L1892r5564l5876J0682k5217
13913a15674O7737m341K508l2290r6182N3016L8038J2872N0022K548J30563p240
13901A01577j32827P877K3347j06030n98J43563k8540p1096J9861l0310R4840
13890B1664L6842K8854n2097k8814k69K6527m7278L1061J03648j04390q1823m3361
13878a09436j3000K0569L7149J17905L3540q3204j6984J2134j9661J8437n8547
13867f1098j51027j2004P6775P8522j11798l2912N6603P6403l0942o077M5704
$$ y = [-45509, -49250, -57311, -116511, -101787, -96198, -42586, -38767, -40765, -126801, -219170, -60228, -35257, -54577, -55642, -25441, -31627, -65483, -155430, -128529, -66030, 21666, 52637, -53278, -122176, -60792, -46635, -120393, -142044, -20345, -1591, 30301, -65263, -101139, -90457, -115674, -47937, -52278, -49770, -82060, -178242, -125226, -87188, -74316, -24294, -21746, 108817, 101577, -31250, -23373, -26, -106056, -106654, 36909, 8369, -62727, -42866, -73176, 21664, 58506, 87360, 35263, 6449, 6180, 32707, -14571, 16490, 120138, 15748, -66075, -109436, -122436, -101867, -64718, 53187, 86727, 3523, -13461, -1327, -20988, -2551, -61098, -212125, -224129, -147354, -68832, -180630, -213542, -156939, -80536, -111478, -117555, -71851]
13856g1851k0240j7203L4089L19L3502K6057m7074L5827J9199J9765M4784M3316
13844A00490J8020J22338r520j05331j23013l1971R58l364N4770K1078N2042J0529
13832A07026m5915n2508J44693m5985o2961N5406K2705o5773k1595p7527j06899
13821a49333J4035Q2885O8795R8055k9183P3888M8771j9564n8139j26135m2987
13810c8912O8759P3631q1244J1603j9227J13747m7208n4902P1190k182j19510
13799b4255P397j3225l9006M4159K5421l8789M2967m9179r7286P858J64531N9034
13787H9627k6173j09557k4642Q4867J17466M0486j06097r47J2388j7426l3887
13776B6105n8386j4239j4454o4729r7923k9916k4389O1948J66809L2812j9117
$$ y = [-71851, -92091, -109294, -75205, -74886, -41384, -15327, -62401, -26574, -7375, 12390, 57174, 100490, 118510, 240848, 231328, 125997, 2984, -28987, -28029, -31393, 23377, 44455, 96497, 107026, 61111, 8603, 153296, 107311, 44350, 99756, 122461, 56688, 35093, -42434, -149333, -135298, -52413, 16382, 114437, 85254, 159142, 207913, 188349, 130210, 4075, -38912, 29847, 103478, 22234, 33837, 14610, 128357, 81149, 26247, 97437, 95255, -24255, -16858, -30083, -69089, -24930, 491, -38298, 4669, -44510, -141796, -133938, 30593, 89627, 63454, -46103, -70745, 14122, 131588, 172074, 65977, 65030, 77418, 59992, 26105, -32281, -46520, -60974, -125703, -223626, -253542, -277931, -215983, -49174, -16362, -35479]
13765c5479M0952n9476n5064p5121r953P1539P6144K5831j1750M0709P2887o9653
13753A1566l5404J39599m4174j05188l8854o5753k0151n5430k7090N0928M5496
13742a44455J4763l0617l4748Q8901R9716M5558M5977n8954m4447K2724j8377
13731a3959M3974N2826M8825j95986q1668Q4743Q2944m8985q8689M007k8476K5383
13719a15061J50602O7458K4675j16766q1239N68M1148J4554q4392K9149r385p8780
13707a57469K4319l5868O5978J0393K4328K6721l1810J03752m0223m6553j2384
13696f8816J27749n1706l3507l837O9476m7349k6638M3616J3325o7427j01793
13685a46907L198M0125O530Q6719q027n8624M4770O0555O5023p7972j13661j282
$$ y = [-35479, 5473, -54003, -109067, -184188, -194141, -122602, -46458, -20627, -32377, 8332, 81219, 11566, -23838, 115761, 71587, -33601, -72455, -138208, -158359, -213789, -240879, -189951, -144455, -129692, -160309, -195057, -106156, -6440, 39118, 85095, 26141, -18306, 4418, -13959, 30015, 82841, 131666, -64320, -145988, -61245, 21699, -27286, -115975, -111968, -140444, -115061, 35541, 102999, 127674, 10908, -70331, -69763, -28615, -14061, -98453, -69304, -78689, -157469, -133150, -169018, -103040, -92647, -68319, -41598, -73408, 30344, -9879, -56432, -68816, 58933, 7227, -26280, -30117, 39359, -7990, -34628, 8988, 22313, -45114, -146907, -143709, -103584, -97054, -10335, -18362, -76986, -32216, 28339, 93362, 15390, -98271, -99553]
13673i9553J2023J0105J51257P2186M3745m1225j02260o2808K649P6715j298m4120
13661A7416j19515R751j19271j26121J79016M5065n8401O0514J6224N4938K9781
13650a0603n1935p7775l3025R1715J8902R6665k7953j46280J8440R0k6442p304
13638a55505J9187M0846J41417J04488j04759n5257r2097j12607P3594m9060J07249
13627h2504K8070o4889o0365j8174J11167j5932l4721r1830r4067r3757R9573
13616c17429J01741o909J2065J32133R6203l6117j0647m6196k9625M8403K7511
13605b8867M2129J61680P6127j0350l0775m5368o1833M9417N6769p0873l6305
13594A01751l0226n1861o256q472k709k0522N4579P0102j948j0503j22529j00754
$$ y = [-99553, -87530, -77425, 73832, 146018, 189763, 148538, 46278, -16530, -13881, 62834, 61536, 17416, -102099, -92348, -211619, -337740, -158724, -113659, -172060, -111546, -95322, -40384, -10603, -62538, -140313, -173338, -81623, -62721, 33944, 5991, -140289, -121849, -121759, -148201, -155505, -136318, -95472, 45945, 150433, 45674, -9583, -101680, -214287, -140693, -189753, -82504, -54434, -119323, -179688, -197862, -86695, -102627, -137348, -229178, -323245, -417002, -317429, -215688, -222597, -210532, -78399, 17804, -18313, -28960, -75156, -104781, -56378, -28867, 13262, 174942, 251069, 240719, 209944, 164576, 102743, 152160, 208929, 138056, 101751, 71525, 19664, 13408, 4936, 2227, -18295, 36284, 106386, 104438, 93935, -28594, -129348]
13582a29348M4202M6946O8425P6802p6300j6779J07641L8912L9618l4407K8829
13571A94541M9315J0619r3013q9454n3901J56521m840j23463M9765N5878N4654
13560B06622K0298j24634j05914N2886l4143k8045J1274N3746R4566o9298j8280
13549E9078q090j14896l3027J2036j2533R745n7554j4303L1210R9531L3509J0530
13537A5236J63400l599j46746j71588J6332J82044n2576o424P7057Q5658j056
13526A57738j6329J6689q8327o6422P852M6650L6718j3930o9321l7430M8370J42262
13514A64520j55362n1641O4050l6639m0042M6556P9058k0744L460q7047j80091
13503b13922N7456P1356L3136k5319o0427N5652J13364Q5086L9140M0528P5562
$$ y = [-129348, -85146, -38200, 30225, 107027, 30727, 13948, 121589, 160501, 200119, 165712, 194541, 243856, 254475, 161462, 72008, 18107, 174628, 169788, 46325, 96090, 151968, 206622, 226920, 102286, -3628, 49258, 15115, -12930, -1656, 52090, 146656, 77358, 59078, 50988, -63908, -96935, -84899, -97432, -87687, -145241, -159544, -128334, -28803, 4706, 15236, 178636, 175037, 28291, -143297, -126965, 55079, 2503, -3921, 73136, 158794, 157738, 141409, 158098, 69771, 3349, 11201, 57851, 94569, 80639, 11318, -26112, 22258, 164520, 9158, -42483, 21567, -15072, -55114, -8558, 70500, 49756, 53216, -33831, -213922, -156466, -85110, -51974, -77293, -137720, -82068, 31296, 116382, 155522, 196050, 271612]
13492B71612j08740q5647j71258Q3108J85970J1326r8563j0132Q5795J37011k0896
13481B79586j65790m7289L9097r500M879M5199j58944l6413j0864n4088K9541
13470h4586M886m7054R1842J6585k8539q17j9665J18366j0076l3511p4317J1428
13458e5458M8106p5285p6082k7507L1507O5405n463j50834K5591J31133M8770
$$ y = [271612, 162872, 77225, -94033, -10925, 175045, 186371, 87808, 77676, 163471, 300482, 279586, 113796, 66507, 105604, 96104, 100983, 146182, -12762, -49175, -60039, -114127, -84586, -79700, -126754, -34912, -18327, -46866, -47683, -67348, 51018, 40942, 7431, -66886, -55458, -7352, -82637, -158719, -186226, -154719, -89314, -94777, -245611, -220020, -88887, -40117]
$$ [...]
##END NTUPLES=NMR SPECTRUM
##END=
