##TITLE=Analysis number 310950
Compound Code spb 07738
Project Code adrs
Chemist Name fudan
##JCAMPDX= 6.0         $$ Bruker NMR JCAMP-DX V2.0
##DATA TYPE= NMR SPECTRUM
##DATA CLASS= NTUPLES
##ORIGIN= Bruker BioSpin GmbH
##OWNER= NMR
$$ XWIN-NMR		Version 3.5
$$ Tue Jun 28 10:31:20 2005 GMT Daylight Time (UT+1h)  MAYBRIDGE\NMR@NMR_250MHZ
##.OBSERVE FREQUENCY= 250.131544655141
##.OBSERVE NUCLEUS= ^1H
##.ACQUISITION MODE= SIMULTANEOUS (DQD)
##.ACQUISITION SCHEME= undefined
##.AVERAGES= 16
##.DIGITISER RES= 18
##SPECTROMETER/DATA SYSTEM= dpx250
##.PULSE SEQUENCE= zg30
##.SOLVENT NAME= CDCl3
##.SHIFT REFERENCE= (INTERNAL, CDCl3, 0, 16.522)
##AUDIT TRAIL= $$ (NUMBER, WHEN, WHO, WHERE, WHAT)
$$ ##TITLE= Audit trail, XWIN-NMR		Version 3.5
$$ ##JCAMPDX= 5.01
$$ ##ORIGIN= Bruker BioSpin GmbH
$$ ##OWNER= NMR
$$ C:\u/data/dgb/nmr/ADRS/4890/pdata/1/auditp.txt
$$ ##AUDIT TRAIL=  $$ (NUMBER, WHEN, WHO, WHERE, WHAT)
(   1,<2005-06-28 10:31:00.80 +100>,<MAYBRIDGE\NMR>,<NMR_250MHZ>,
      <created by zg, POWCHK disabled, PULCHK disabled
       configuration hash MD5:
       62 19 C7 07 E1 42 D1 B7 37 6C 3D D0 77 39 F9 E6
       data hash MD5: 64K
       EF CF 5B 63 A3 B5 80 24 A6 7E 33 4D 1B CB F9 D1>)
(   2,<2005-06-28 10:31:11.50 +100>,<MAYBRIDGE\NMR>,<NMR_250MHZ>,
      <Start of raw data processing
       ef LB = 0.3 FT_mod = 6 PKNL = 1 SI = 32K 
       data hash MD5: 32K
       B1 00 B4 22 E6 E2 5B 13 23 04 DE 94 FD 38 BE AD>)
(   3,<2005-06-28 10:31:13.35 +100>,<MAYBRIDGE\NMR>,<NMR_250MHZ>,
      <apk 
       data hash MD5: 32K
       4A 06 FB 1D 94 6E 54 26 84 2E F9 85 33 15 7F DC>)
(   4,<2005-06-28 10:31:14.10 +100>,<MAYBRIDGE\NMR>,<NMR_250MHZ>,
      <abs ABSG = 5 
       data hash MD5: 32K
       DC 84 0F F8 A7 09 A1 80 78 F4 EE 6E 6B A5 F5 01>)
$$ ##END=
$$ 
$$ hash MD5
$$ 2F E2 AA CE DC 58 72 D3 2D 1C 19 7C 51 0E A4 F5
##$RELAX= 
##$RELAX= 
##$RELAX= 
##$RELAX= 
##$RELAX= 
##$RELAX= 
##$RELAX= 
$$ Bruker specific parameters
$$ --------------------------
##$DU= <C:\u>
##$EXPNO= 4890
##$NAME= <ADRS>
##$PROCNO= 1
##$TYPE= <nmr>
##$USER= <dgb>
##$AMP= (0..31)
100 100 100 100 100 100 100 100 100 100 100 100 100 100 100 100 100 100 
100 100 100 100 100 100 100 100 100 100 100 100 100 100 
##$AQSEQ= 0
##$AQ_mod= 3
##$AUNM= <au_zg>
##$AUTOPOS= <15 >
##$BF1= 250.13
##$BF2= 250.13
##$BF3= 250.13
##$BF4= 250.13
##$BF5= 500.13
##$BF6= 500.13
##$BF7= 500.13
##$BF8= 500.13
##$BYTORDA= 1
##$CFDGTYP= 0
##$CFRGTYP= 5
##$CHEMSTR= <none>
##$CNST= (0..31)
1 1 145 1 1 1 1 1 1 1 1 1 1 1 1 1 1 1 1 1 1 1 1 1 1 1 1 1 1 1 1 1 
##$CPDPRG= <>
##$CPDPRG1= <>
##$CPDPRG2= <>
##$CPDPRG3= <>
##$CPDPRG4= <mlev>
##$CPDPRG5= <mlev>
##$CPDPRG6= <mlev>
##$CPDPRG7= <mlev>
##$CPDPRG8= <mlev>
##$CPDPRGB= <>
##$CPDPRGT= <>
##$D= (0..31)
0 1 0 0 0 0 0 0 0 0.06 0 0 0 0 0 0 0.0002 0 0 0 0 0 0 0 0 0 0 0 0 0 0 
0 
##$DATE= 1119951059
##$DBL= (0..7)
120 120 120 120 120 120 120 120 
##$DBP= (0..7)
150 150 150 150 150 150 150 150 
##$DBP07= 0
##$DBPNAM0= <>
##$DBPNAM1= <>
##$DBPNAM2= <>
$$ [...]
##$SUBNAM7= <"">
##$SUBNAM8= <"">
##$SUBNAM9= <"">
##$SW= 20.6930455092707
##$SWIBOX= (0..15)
0 0 3 0 0 0 0 0 0 0 0 0 0 0 0 0 
##$SW_h= 5175.983436853
##$TD= 65536
##$TD0= 1
##$TE= 295.16
##$TE2= 300
##$TE3= 300
##$TEG= 300
##$TL= (0..7)
0 120 120 120 120 120 120 120 
##$TP= (0..7)
150 150 150 150 150 150 150 150 
##$TP07= 0
##$TPNAME0= <>
##$TPNAME1= <>
##$TPNAME2= <>
##$TPNAME3= <>
##$TPNAME4= <>
##$TPNAME5= <>
##$TPNAME6= <>
##$TPNAME7= <>
##$TPOAL= (0..7)
0.5 0.5 0.5 0.5 0.5 0.5 0.5 0.5 
##$TPOFFS= (0..7)
0 0 0 0 0 0 0 0 
##$TUNHIN= 0
##$TUNHOUT= 0
##$TUNXOUT= 0
##$USERA1= <user>
##$USERA2= <user>
##$USERA3= <user>
##$USERA4= <user>
##$USERA5= <user>
##$V9= 5
##$VALIST= <valist>
##$VCLIST= <CCCCCCCCCCCCCCC>
##$VD= 0
##$VDLIST= <DDDDDDDDDDDDDDD>
##$VPLIST= <PPPPPPPPPPPPPPP>
##$VTLIST= <TTTTTTTTTTTTTTT>
##$WBST= 1024
##$WBSW= 4
##$XGAIN= (0..3)
0 0 0 0 
##$XL= 0
##$YL= 0
##$YMAX_a= 364664
##$YMIN_a= -246835
##$ZGOPTNS= <>
##$ZL1= 120
##$ZL2= 120
##$ZL3= 120
##$ZL4= 120
##$ABSF1= 16.522
##$ABSF2= -4.171173
##$ABSG= 5
##$ABSL= 3
##$ALPHA= 0
##$AQORDER= 0
##$ASSFAC= 0
##$ASSFACI= 0
##$ASSFACX= 0
##$ASSWID= 0
##$AUNMP= <proc_1d>
##$AZFE= 0.1
##$AZFW= 0.1
##$BCFW= 0
##$BC_mod= 0
##$BYTORDP= 0
##$COROFFS= 0
##$CY= 12.5
##$DATMOD= 1
##$DC= 0
##$DFILT= <>
##$DTYPP= 0
##$F1P= 14.0000005364418
##$F2P= -0.99999901652339
##$FCOR= 0.5
##$FTSIZE= 32768
##$FT_mod= 6
##$GAMMA= 0
##$GB= 0
##$INTBC= 1
##$INTSCL= 1
##$ISEN= 128
##$LB= 0.3
##$LEV0= 0
##$LPBIN= 0
##$MAXI= 10000
##$MC2= 0
##$MEAN= 0
##$ME_mod= 0
##$MI= 0
##$NCOEF= 0
##$NC_proc= -5
##$NLEV= 6
##$NOISF1= 0
##$NOISF2= 0
##$NSP= 0
##$NTH_PI= 0
##$NZP= 0
##$OFFSET= 16.522
##$PC= 1
##$PHC0= -73.01725
##$PHC1= 2.353598
##$PH_mod= 1
##$PKNL= yes
##$PPARMOD= 0
##$PSCAL= 4
##$PSIGN= 0
##$REVERSE= no
##$SF= 250.13
##$SI= 32768
##$SIGF1= 0
##$SIGF2= 0
##$SINO= 400
##$SIOLD= 32768
##$SREGLST= <1H.CDCl3>
##$SSB= 0
##$STSI= 32768
##$STSR= 0
##$SW_p= 5175.98343685301
##$SYMM= 0
##$S_DEV= 0
##$TDeff= 65536
##$TDoff= 0
##$TI= <Analysis number 999999
Compound Code 99
Book Reference 9
Project Code 9>
##$TILT= no
##$TM1= 0
##$TM2= 0
##$TOPLEV= 0
##$USERP1= <user>
##$USERP2= <user>
##$USERP3= <user>
##$USERP4= <user>
##$USERP5= <user>
##$WDW= 1
##$XDIM= 32768
##$YMAX_p= 447006806
##$YMIN_p= -616579
$$ End of Bruker specific parameters
$$ ---------------------------------
##NTUPLES= NMR SPECTRUM
##VAR_NAME=  FREQUENCY,     SPECTRUM/REAL,   SPECTRUM/IMAG
##SYMBOL=    X,             R,               I
##VAR_TYPE=  INDEPENDENT,   DEPENDENT,       DEPENDENT
##VAR_FORM=  AFFN,          ASDF,            ASDF
##VAR_DIM=   32768,         32768,           32768
##UNITS=     HZ,            ARBITRARY UNITS, ARBITRARY UNITS
##FACTOR=    0.157963299565203, 1,           1
##FIRST=     4132.6476996994, 0,             0
##LAST=      -1043.33573715361, 0,           0
##MIN=       -1043.33573715361, -616579,     0
##MAX=       4132.6476996994, 447006806,     0
$$ Real data points
##PAGE= N=1
##DATA TABLE= (X++(R..R)), XYDATA
$$ [...]
29018 -244665 -237190 -150778 -134498 -164222 -242696 -202439 -217741 -184280 -143870 -118087 -76280 -211251
29006 -211251 -84695 15211 -1466 61260 63867 87121 -69298 -53983 18829 92848 93849
28995 93849 -3166 -27865 39071 121506 90086 -6436 -160628 -126068 71870 115042 96873
28984 96873 -3040 -11492 67165 22915 -82458 -159237 -197619 -211885 -68154 61570 176295
28973 176295 155050 103124 115942 164458 107924 26289 -28322 113378 145836 128342 229326
28962 229326 223078 205855 288668 254199 234532 153635 38829 -88344 -5498 -11424 -44872
28951 -44872 11065 121980 215433 181897 -97539 -103825 90709 339286 420386 270522 179125
28940 179125 51711 40256 72057 170924 153529 105862 197548 192120 294371 198079 38974
28929 38974 -92451 -61306 -148352 -261202 -36994 77845 79004 -2815 60514 144492 240650
28918 240650 329453 293721 224636 65099 -125749 -62966 -65167 -185967 -291840 -205069 -124395
28907 -124395 -221361 -123155 -111562 -50090 -54440 37671 37076 -69443 6855 85802 23448 -60241
28895 -60241 83606 50082 36318 99982 142613 237807 121674 97 -20272 57713 40263
28884 40263 151173 105870 72159 18306 60857 50710 -58422 -89463 -79557 -254644 -300166
28873 -300166 -201461 -121010 -43262 -22205 120178 13240 -100107 -13077 -135444 -268134
28863 -268134 -246880 -191264 -166549 -171145 -44935 -35397 -98131 31765 97888 20336 -184682
28852 -184682 -113973 38344 -91772 -119782 28454 150919 197072 31789 47882 126524
28842 126524 219676 263750 179256 180608 159106 128030 45703 -120208 -178707 -74133 -34314
28831 -34314 186337 316775 270210 238460 241183 -87134 -335570 -202185 139890 251852
28821 251852 204286 113742 49011 84451 -11107 -221097 -180277 -145452 -57612 -171796 -175417
28810 -175417 -1846 97096 48189 -5780 -29081 12179 7232 -87053 -65296 -154934 -264014
28799 -264014 -104118 53341 203807 347415 320665 210069 187814 191807 -15527 -121485
28789 -121485 -104261 -34064 65856 22740 -118839 -189100 -195605 -197318 -103596 -101228 -13831 -24742
28777 -24742 -50386 6048 8063 61358 88534 -10816 -48060 42808 -17221 240 31631 4471
28765 4471 -113617 -179126 -232633 -97135 111951 62205 10810 138929 125736 133801 170223
28754 170223 142305 219004 310332 147217 46679 1947 210922 261924 291493 542148 363078
28743 363078 273946 246901 6119 -223168 -252410 -72672 -51741 16405 191770 74955
28733 74955 -31344 23016 93823 273114 222562 319894 184589 -11786 -70325 -132791 29061
28722 29061 44969 11639 -37740 -5050 25285 -8886 -62405 -54922 -72660 -61020 -12834 39952
28710 39952 79753 170322 185569 109107 -60507 -148016 -54170 6366 -47052 -47162 19688 5916
28698 5916 -78376 -154937 -52158 -146011 -193503 -145343 -36486 1704 -9700 52011 159605
28687 159605 294459 146558 121731 -86180 -103234 -18301 200152 261955 125437 -8060
28677 -8060 129279 371458 276452 155976 137798 200882 325075 245510 -13739 -292837 -273064
28666 -273064 -262565 -17731 24299 23070 23592 11077 -206631 -313829 -89058 61091 75798
28655 75798 231131 359481 196553 198262 264326 266202 197800 106909 122007 40719 104502
28644 104502 173979 132725 134818 115822 -31515 -362156 -375762 -323957 -358021 -575091 -353477
28633 -353477 -67909 12514 61461 13710 29466 74457 -44302 -106757 38835 193357 215507
28622 215507 206160 217815 72430 81721 83908 17314 102359 143069 211710 160618 55958 -54763
28610 -54763 -221864 -306633 -195167 -88332 84512 194530 306240 167343 -26241 -18779
28600 -18779 -6152 103769 283478 235634 -80108 -89650 3562 -57159 -111124 -160108 -157965
28589 -157965 -94644 -77051 -44338 -97385 128894 265616 48976 -26164 -10714 -79597 -108193
28578 -108193 -97787 -28086 13715 15070 172659 265979 93135 -144958 -135594 -18299 196892
28567 196892 163261 101829 -15668 -38400 -119725 -243148 -88666 60448 -14699 -132223
28557 -132223 -228643 -220599 -119660 -48309 -47624 -101208 -79068 139085 235090 246668 57755
28546 57755 12733 -138903 -107591 -113629 -35286 -34141 -181828 -181109 -186587 -358618 -189750 -101997
28534 -101997 -73769 7579 70192 -27157 -208321 -148222 -33678 38956 39504 30566 21015 -158083
28522 -158083 -196202 -73413 -146384 -98645 -63266 -65589 -37427 -235429 -195215 -122376 57840
28511 57840 197894 298327 178154 21937 -58492 -172117 -41186 50121 145943 254188
28501 254188 242479 94222 101494 89162 -47723 -13339 1988 -84779 -46032 -25272 142581
28490 142581 172980 139521 83803 138206 111525 22614 -9018 37892 93949 74942 100595
28479 100595 30414 171517 111268 -11313 -15511 -151915 -65380 108909 315525 240209 101496
28468 101496 153859 237117 100226 -152540 -248391 -374044 -254241 -257891 -260894 -180081 -131185
28457 -131185 -264369 -23864 121431 14062 -62433 -75414 -173470 -45621 -113833 -145357
28447 -145357 -103263 -136316 -287238 -447253 -496874 -447677 -393148 -386498 -372297 -264313 -88889
28436 -88889 -79611 -117755 -27924 102686 165992 154548 128747 149157 67698 -155108 -228833
28425 -228833 394 117866 -5757 -126150 -21101 15414 370 87564 108435 148604
28415 148604 220896 222624 348591 276853 197908 98593 -19898 107985 183881 150398 156823
28404 156823 117450 -28678 -156955 -203019 -178359 -276371 -246139 -97696 -164328 -106472 -7169
28393 -7169 69571 160406 263676 274579 247280 143210 54754 5062 30033 54947 15033
28382 15033 -40412 17663 83834 14723 -11991 79528 130644 143395 229187 199068 228240 160038
28370 160038 127143 97588 34312 41837 216565 246509 57554 -53714 166323 209920 61222
28359 61222 104500 44176 -72005 -76901 -102828 -90445 -73920 -173900 -224057 19018 229054
28348 229054 122810 -20862 -208644 -117667 213581 483553 570959 397245 338541 170957
28338 170957 2815 161466 156117 238878 288442 280006 326290 290802 100651 -109107 -374451
28327 -374451 -348842 -232515 -148469 -219993 -166336 -147014 -97940 -63530 -4962 -28045 190185
28316 190185 251816 178967 246416 220345 151470 151477 118294 46221 133474 69514 -155994 -140073
28304 -140073 -116211 -121667 -57120 60435 10848 -70965 -262040 -175307 -43149 34650 -15062
28293 -15062 117368 -53391 -193936 -192218 26770 168937 -11511 -123678 -149491 -126460
28283 -126460 -165072 -120582 -31468 -15594 184271 134117 4049 -12337 138408 311318 137181
28272 137181 30515 167608 69183 -30628 -14168 -136181 -33106 87757 215094 133649
28262 133649 144758 131540 88621 122451 153766 60297 1454 65890 1891 -180358 -3784
28251 -3784 120175 180869 120150 222945 229491 206110 239224 303190 417520 439730 504120
28240 504120 503726 339808 307600 311388 318387 330394 142548 -102031 -80214 -9452 34236 96024
28228 96024 120217 111691 232189 170655 64476 125895 160220 232968 108619 -60388 -1403
28217 -1403 27444 -7638 -154775 -168948 -37712 118388 59826 191665 165205 10682 -150965
28206 -150965 -39993 -2977 -36001 -117427 -126442 -76432 38603 69390 -52409 -31441 -58461
28195 -58461 -119436 -193901 -186660 -190713 -213375 -57907 83397 118655 219520 256623 175304
28184 175304 93830 -15763 -88083 -29300 44045 129814 129413 110859 -16875 -9306 5416 -78384
28172 -78384 -172543 -171679 -141589 -188959 -134846 -106787 -58791 32366 -81534 -27830 219555 188972
28160 188972 100731 -3950 -144333 -92170 77089 186563 77979 85411 71328 -86609
28150 -86609 -110409 114588 162488 127554 -32057 1678 135421 30926 -49312 114485 251074
28139 251074 127518 80674 145927 201521 208496 178574 110696 97815 196269 114756 -35369
28128 -35369 -84321 -14201 80893 84666 92006 29675 8222 101377 28007 21658 20768 12168 -105417
28115 -105417 -209271 -180715 -234169 -359147 -397319 -218683 33209 143900 257675 314679
28105 314679 333373 327249 309853 357424 406841 395743 373053 374632 420523 243300 137628
28094 137628 46646 27942 71666 -8263 162430 97895 -4777 99108 78605 140264 142617
28083 142617 152447 179193 67215 -372 -16750 36639 60154 9041 -141028 -185768 -52639
28072 -52639 51818 -143003 -347608 -195918 -166239 -138913 -96784 61145 94472 236497
28062 236497 243888 102213 -19056 -135642 -136465 -13660 49719 61152 25902 170887 151153
28051 151153 -57813 -63620 207221 432073 452298 336970 410239 361636 249384 138539
28041 138539 98715 136298 133864 142311 32832 -69649 -227620 -213970 -154994 -147939 67289
28030 67289 139489 230563 127867 -83486 -44468 34623 66370 183536 100137 34793 112416
28019 112416 -13716 -120999 500 123165 7418 51052 210633 274224 179630 -71570
28009 -71570 -150264 -61569 -26169 -59869 -80106 -96134 4942 104723 81218 40100 -12226
27998 -12226 -66265 -77182 -157595 -189406 -41104 103072 153795 -47312 -149493 -224856 -327373
27987 -327373 -292941 -217654 -31855 -40899 -78894 -258583 -95668 -35603 -65256 -143845 -115323
27976 -115323 -64439 -56249 -71808 -51814 63783 -116365 -45511 44764 21408 -8569 -72129
27965 -72129 -25283 39867 111240 45242 192839 232661 -87028 -104301 -356 77224 181146
27954 181146 233507 199209 151875 21220 7405 142762 170114 167732 75101 74284 176248
27943 176248 199346 -66965 -39853 116950 155724 -133404 -275972 -302159 -65184 122796
27933 122796 11148 -30420 173952 464858 503663 448874 228222 232566 271566 227212 114654
27922 114654 29633 67020 100190 79087 -18589 128129 252889 338069 359511 166990 -5519
27911 -5519 -163289 -86981 -66375 -136521 -198069 -284004 -339201 -244421 -107735 -119184 -133700
27900 -133700 -84968 -83070 -136858 -206783 -364037 -332421 -160210 -174729 -86488 56307 46421
27889 46421 79973 157821 257647 192469 6719 -80698 -180973 -100632 148858 276170 199236
27878 199236 107397 74877 116188 93105 32706 -31247 -152598 -54629 -22725 40194 122391
27867 122391 -7317 -103077 -220245 -144754 -215625 -226597 -37298 88124 -67492 -122210
27857 -122210 -13654 118409 176907 130684 50496 58664 -61432 -102369 -106761 90441 256733
27846 256733 199209 204779 223707 67840 39661 36643 64596 64723 141412 205622 179703 106064
27834 106064 -7587 -105290 -87557 -47760 108662 -4188 -81961 6733 94414 22533 38085
27823 38085 -42767 -114948 -179502 -53198 -82802 -129818 -93116 -90459 -122181 -90161 -44506 -197607
27811 -197607 -189472 -13325 -84694 -210839 -149040 -1822 229255 357685 283412 188983 167455
27800 167455 187239 137716 144704 -75146 -275509 -233891 -233467 -273126 -168547 -182249 -191127 -207027
27788 -207027 -120902 -101084 -98701 -16551 -63601 -271736 -223605 -141312 -130434 -106039 -133970
27777 -133970 -110633 -87876 44217 85197 99573 71085 -41472 -106496 -89360 9117 -15520
27766 -15520 -117796 -145972 -38137 72745 44060 123475 91183 -50818 -58939 36253 -19918
27755 -19918 -15885 45760 66621 171242 66679 79457 73003 175746 104819 101004 172282 156594
27743 156594 91375 176404 68046 5189 2857 -119256 -106706 -28007 -79268 -40794 -57569
27732 -57569 -164422 -39865 -121004 -140305 -60250 83564 77811 93929 5564 -34266 167352
27721 167352 297515 270104 305295 200659 95148 -8788 -65492 -147102 -120264 21305
27711 21305 120936 30650 -78462 -149809 -145919 -83395 -34098 15310 -106825 -60248 32571
27700 32571 -15914 -67870 -13535 -13070 -100980 -261173 -90883 -28013 -45328 -51833 65111 95205
27688 95205 197473 335450 160720 108785 53593 12506 111106 138747 -74775 -215704 -208947
27677 -208947 -106674 17366 124188 -4040 -53431 -86258 -102910 -54839 19830 -89164
27667 -89164 -214718 -117367 -158217 -236329 -151593 -120245 -117912 -110202 -254256 -343322 -301308 -249530
27655 -249530 -188437 -183124 -230591 -210452 -61711 -6924 -16922 11485 -1538 -57271 2926 -63773
27643 -63773 -173155 -431649 -348055 -180170 -74732 -28040 10181 12409 34918 -55674 -212098
27632 -212098 -215854 -226177 -109067 24239 23956 24252 -92083 -53058 -39804 56839 222016 102978
27620 102978 -164824 -289416 -290304 -182229 -81070 -88500 44060 119324 103723 58548 74747
27609 74747 133701 24898 -158889 -203145 -264996 -279632 -31131 4291 123650 140474 103515
27598 103515 221808 167510 87219 169585 103550 88170 -36399 -103949 -50852 -67800 46283
27587 46283 259456 385910 490285 449641 235370 10305 -1547 29380 143787 21616
27577 21616 -41296 -166116 -277302 -152814 -18475 -11812 100580 47925 -90448 28912
27567 28912 192813 241011 46225 -98168 -84874 -176523 -101216 98224 113924 78689 106599
27556 106599 22515 -3381 -16477 76522 18999 127246 178716 148102 118108 -3523 -79109
27545 -79109 -18324 38657 82775 73783 82532 84337 6210 8694 -3304 54625 134993 251190
27533 251190 101436 88763 252123 100037 17915 61092 95745 61208 -110695 -109010 -50406
27522 -50406 -63063 -114289 -189191 -254493 -52444 -71939 28840 -3944 -184594 -148128 9619
27511 9619 -61158 -101775 -55463 -10273 9654 135391 187356 234708 148996 43241 -10003
27500 -10003 -13148 -10799 23870 -702 67277 192668 68972 -45759 1657 -144223 -228811
27489 -228811 -161598 -233287 -127807 -157824 -194283 -48646 33928 -70743 -96332 109441 -105772
27478 -105772 -91712 98363 67704 35615 173861 120706 -20230 103054 194861 217490 255907
27467 255907 149230 72592 -22124 -169649 -172104 -36137 78188 123866 133194 114271 39529
27456 39529 41377 73527 62124 84805 1598 -97840 10204 -26426 94341 258931 293046
27445 293046 99288 108875 211818 215420 207806 65614 51631 119908 48408 -45328 -9531
27434 -9531 -13275 39284 110762 84178 246658 235940 195798 10645 20082 -17381 7865 69333
27422 69333 84165 180279 58610 66181 292035 294847 242022 103736 68381 88506 -51976
27411 -51976 -183954 -172443 -85955 86881 205606 183781 110375 111996 4825 -176782 -344786
27400 -344786 -340632 -149234 108452 198265 222157 115240 -59204 -28043 16314 -24044 -81058
27389 -81058 -187535 -93861 -6906 6029 51615 16142 -19234 -76181 -176125 -154133 -77729
27378 -77729 48145 53740 76061 130910 236094 154378 -44629 18744 -38241 -151518 -209971
27367 -209971 -93939 73085 75269 63391 40076 108974 15178 136860 28820 -95478 75730
27356 75730 217241 188416 11901 33789 166456 233404 182054 68892 66069 81466 69376
27345 69376 -104834 -115071 -290138 -303927 -273664 -307006 -289816 -139595 -162039 -103904 -67268
27334 -67268 19257 -35008 67820 43553 -14331 -79320 -179850 -91507 -37050 75324 121318
27323 121318 89578 -60531 -136596 -213552 -121081 -88533 -127510 -170483 -225922 -199420 -71889
27312 -71889 -170308 -237054 -165427 -99113 -52640 107164 139026 -44276 -83030 -11716 -13229
27301 -13229 -30733 -36951 71168 24667 -131226 -290796 -412052 -443987 -195094 19881 -75704
27290 -75704 -84231 -222442 -232747 -159825 106431 183065 8066 -206935 -194815 -83806 -138866
27279 -138866 -180262 -128711 -40473 126107 119366 245071 226033 104046 30099 -104194 -123084
27268 -123084 1182 -46268 -10725 -43389 -117131 -122655 -169236 -174239 -220915 -110879 54086
27257 54086 114909 95865 -51040 -128887 47878 10606 8690 -103497 -208854 -185399 -39008
27246 -39008 -101040 -195452 -156230 -97262 -52007 -121851 -79936 -30749 81292 159986 24831
27235 24831 -18216 31030 173045 235769 31575 -86722 17176 85776 173767 320231 216553
27224 216553 133354 143712 -110900 -205518 -66255 -80444 -140185 -128472 79274 283105 346781
27213 346781 280764 172641 120075 -18060 -10149 101497 117453 146844 158943 244123 305087
27202 305087 132474 33009 -23805 9608 -53258 -138718 -62187 49888 100284 50134 43320
27191 43320 72013 -3766 69852 278106 176817 -50700 26865 75540 141801 133432 21350
27180 21350 25287 98109 26186 62695 35681 19062 84671 1608 -16689 -149385 -42487
27169 -42487 -21881 34638 9310 36396 -106134 58924 271578 199710 200858 71469 -102332
27158 -102332 -132778 60968 210599 36035 96385 256340 175650 -70211 -408722 -489515
27148 -489515 -298157 -228732 -207627 -205658 -153797 94387 241099 1786 -59863 -40768 -195349
27137 -195349 -155209 -32903 207165 342601 146476 -108510 -92478 8277 141625 79963
27127 79963 -102154 -100620 -152433 -147365 -53056 -21739 -123990 -216870 -88157 36484 58982
27116 58982 176840 98110 71688 -27302 54617 48417 -19828 68215 87016 99503 90761 -111104
27104 -111104 -213423 -283010 -170261 -13336 39997 43208 23035 72445 -18452 -35451 2035
27093 2035 77326 -3217 -91475 -43352 -69607 -38509 44587 -51083 9788 63239 313838 335783
27081 335783 45732 -40258 20385 45721 -85337 -82676 -137545 -174441 -127513 -208952 -232138
27070 -232138 -215762 -130764 -89199 18071 -92953 -277749 -260938 -119777 13848 214247
27060 214247 86933 -115454 -26044 -38657 38685 32857 190877 133687 88513 186547 176423
27049 176423 181036 37119 40790 -43069 -147490 -55408 2523 -19625 -178223 -332262 -62097
27038 -62097 106180 143895 125308 67561 15750 31761 179433 165790 78439 -14081 94621
27027 94621 264539 293409 135087 59350 90834 70738 21061 101464 165815 157655 143189
27016 143189 122273 136555 242399 157527 47965 63856 -31133 -105578 -45791 -72011 -66833
27005 -66833 -19041 -147798 -114324 -38374 -170647 -127496 81456 111144 63524 -51138 -134639
26994 -134639 -125755 -32598 -129596 -72537 -140471 -196921 -352882 -281573 -156734 -60942 98257
26983 98257 55572 75863 228055 98174 -5049 11121 18314 -19405 5387 -41063 136243
26972 136243 211517 58590 47968 132517 59412 72788 17236 96237 159559 21444 -120129
26961 -120129 -164214 -276812 -180791 42050 -3044 47939 76613 -15393 -167288 -174289 -145311
26950 -145311 35820 98289 -27205 -111206 -205764 -235719 -149135 -21642 155434 212703 105846
26939 105846 -93534 -81927 43281 182431 225347 233734 219135 172833 139867 102563 64006
26928 64006 50329 15332 71413 20196 -33479 51425 42812 -97987 -209736 -143430 -96189
26917 -96189 99689 140895 231415 230425 110613 66725 82661 58315 -65087 -42688 74295
26906 74295 89195 6462 -127509 -19326 64053 116563 33700 8117 146876 242147 240415
26895 240415 231445 306809 213685 84994 111234 218582 -4212 -267454 -209307 -122201 -72003
26884 -72003 25122 -9294 -97133 -214777 -261399 -275150 -227472 -186571 -199599 -184337 -127650
26873 -127650 -134518 12038 25359 24137 -70192 18712 70758 202692 198405 202286 76419 -53682
26861 -53682 -50908 -6754 101451 85945 -124803 -269803 -179297 -162852 -304095 -338377 -264043
26850 -264043 -131440 -58992 -74670 -60063 -130399 -145399 -54773 28648 7631 52434 -10706
26839 -10706 -23576 404 3699 67256 119683 11853 -85675 -196109 -273314 -257750 -201152
26828 -201152 -223089 -57902 26479 -72873 -198611 -176381 -193691 -233671 -78395 -30859 -35523
26817 -35523 109947 342261 292375 218935 135790 136287 180600 128540 92877 75289 -101011
26806 -101011 37805 102553 13835 22237 23869 54232 149504 92145 98029 108235 100166 -22473
26794 -22473 -44009 -25216 -18170 172970 258421 148576 -3556 -55143 -73909 120320 103930
26783 103930 18886 -29114 -88263 -70247 -73739 -83402 -128365 -20340 79094 123711 232430
26772 232430 184799 186084 120888 -61261 -75963 29956 117126 144100 167579 114607 73018
26761 73018 192676 278989 342859 283863 96373 5228 -113671 -280961 -379062 -416867 -389736
26750 -389736 -301818 -161331 -177561 -208382 -66395 96132 107940 91945 97205 4223 73685
26739 73685 58126 56433 19323 36809 100851 -40792 -125581 -105061 -152137 -140463 -751
26728 -751 117687 62827 200934 188072 -18354 -55670 -214442 -322563 -221405 -166456 -243592
26717 -243592 -317577 -143133 -108716 -74670 -6939 7430 -42151 -252137 -218081 -223020 -144620
26706 -144620 -55163 -132337 -190685 -142889 33580 54112 112990 195253 175378 79804 22708
26695 22708 -13663 -521 -980 -117796 -110922 32577 60543 110338 82834 30801 21116 -81909
26683 -81909 -152084 -132093 -146807 -5575 72508 -7584 -62930 10548 157864 186697 309224
26672 309224 397069 158135 -37634 -84738 -84715 42720 81443 -25120 -19331 -63199 -13529
26661 -13529 57727 148462 286643 418995 370337 356491 189162 5480 -100691 -86623 -65660
26650 -65660 -98624 -120500 -107634 -32280 18861 28575 59073 -64940 -202744 -167931 -13168
26639 -13168 71496 -4890 -72822 -55055 -97007 -31071 -80979 -16483 90851 23772 -201383
26628 -201383 -249942 -374415 -424720 -455179 -263904 -135464 30085 152119 175718 133122
26618 133122 184295 239500 251716 265484 142057 51479 -100122 -138773 -58646 -7330 -91719
26607 -91719 -141882 -72289 14413 -86200 -226371 -311415 -350954 -333136 -336203 -256222 -57233
26596 -57233 -14863 113827 88716 24081 -5268 -20657 -157317 -109545 -31474 -119925 -241310
26585 -241310 -407664 -384731 -304108 -265292 -122108 -34375 -135316 -179635 -191435 -207662 -139846
26574 -139846 -84614 52472 143685 211868 233754 107321 11827 -171177 -173702 -264478 -436180
26563 -436180 -464538 -468952 -375329 -256525 -100840 -61196 -27893 7791 -93339 -81327 -210782
26552 -210782 -366856 -442534 -342020 -279703 -210064 -227258 -132209 14436 209781 254421 176405
26541 176405 67477 196526 318099 305749 232981 308667 284104 193713 206670 169387 122911
26530 122911 -87162 5822 112488 -45140 -146500 -161672 36292 31953 130877 -8255
26520 -8255 84885 154620 94548 121006 123205 112732 129471 39086 -55929 -117301 -181758 -241724
26508 -241724 -114989 -40157 -168350 -245333 -357023 -189725 90697 -80545 -216516 -151081
26498 -151081 -195122 -287232 -440519 -469356 -363556 -331779 -195752 -150647 -58415 -61457 -101146
26487 -101146 -153458 -226657 -82345 -84005 -118402 -39970 -122226 -236523 -88876 52556 164915
26476 164915 198737 229153 267205 247984 357116 159623 -26308 -21489 71246 136029 131464
26465 131464 -47754 -66726 -159519 -215684 -177506 -123975 -104579 74837 11353 -103394 -110197
26454 -110197 -138910 -194991 -163182 -159750 35686 133763 140277 284983 398568 220514 76558
26443 76558 124366 132747 192877 294843 285442 268772 301123 71921 -81815 -163179 -237642
26432 -237642 -291997 -236516 -52284 15521 24057 -802 -51972 -2868 13228 4852 -70393 -172271
26420 -172271 -101327 150963 217880 39565 32316 -555 -38701 -60608 107967 11467 -119560
26409 -119560 -61385 -64605 56806 326467 329228 174007 66547 22350 2368 -34080 -28829
26398 -28829 152591 237407 187433 124681 57791 51406 92240 27575 -66723 -62147 -3044 89392
26386 89392 303927 392420 146564 227494 223792 57661 -97027 -87895 36852 53329 -70131
26375 -70131 -88450 -17993 153301 209191 237380 64282 -151193 -342139 -461706 -442545 -263092
26364 -263092 -2846 70272 127149 146393 89 -69448 -187431 90563 289574 218232
26354 218232 261144 474972 504509 470541 383723 206556 102763 141242 240297 278789 187553
26343 187553 296835 257448 278300 282399 297265 349934 270849 39259 -21746 -50251 -132915
26332 -132915 -75024 49361 92321 80887 32496 -66402 -170070 -263857 -58333 162591 191726
26321 191726 105125 184378 102239 -41706 -33265 -56850 1990 -22075 -44346 -43846 132287 121319
26309 121319 33219 -85512 60804 38701 154535 190856 78040 56167 -29987 -206235
26299 -206235 -151783 -79691 22588 113563 60979 64992 59138 27213 225612 273352 214052
26288 214052 131375 43980 -68687 -123044 -194184 -177643 -156101 -138742 -698 44841 -22166
26277 -22166 -64276 -142558 -132412 -168367 43923 144020 2729 14902 14968 -40569 -54731 134148
26265 134148 260857 187219 85467 44972 -53029 2687 -2252 -43375 123891 232995 307118
26254 307118 290997 122565 -39853 -154829 -248889 -330670 -240830 -218381 -54871 102661
26244 102661 -63957 -2618 207607 283516 287454 221785 54676 99347 160800 185367 269137
26233 269137 380402 339077 252347 224954 126842 40476 -65710 -202042 -98226 -36268 -69597
26222 -69597 -42552 -66661 -42353 95439 60418 -29128 -148966 -71403 -69581 -172562 -145360
26211 -145360 12582 100302 15015 -23226 -38562 27800 61431 -44302 -85118 -91567 -117253
26200 -117253 -187872 -208058 -153704 -179661 -99923 94485 3928 -52973 -103855 -2088 76168
26189 76168 -61561 -131701 -260178 -183158 -60548 137928 164195 115409 95472 -92392 -60084
26178 -60084 41936 119408 165563 156904 254905 182363 30532 23926 177 125893 200764
26167 200764 133972 -14645 -55867 -1097 15465 2853 102317 234531 360515 377889 328298
26156 328298 262009 271661 361114 343271 205507 142457 106266 121281 148568 82911 -81744
26145 -81744 -147668 -80327 -57818 31945 98553 175244 287238 156785 59011 -242818 -254749
26134 -254749 72642 151257 20369 -23743 -106009 -221521 -236225 -114786 -57269 -110967 -232271
26123 -232271 -123536 -11283 19630 -61675 -103708 -145455 -27379 45954 98521 171773 146874
26112 146874 159050 314533 387824 293632 151697 -99758 -286585 -219858 -188017 -143291 -75524
26101 -75524 -129076 -148917 -67669 23364 33638 -97516 18004 58085 -625 -36474 -66640
26090 -66640 13815 322095 388258 100764 100850 100500 -8090 -180734 -144895 -143732 10454 6499
26078 6499 -73744 -203814 -275558 -270180 -125096 -147710 -189252 -40222 -68199 -281375 -294382
26067 -294382 -236610 -113407 -19604 -24570 -48777 -132322 -24013 42025 -33075 -81634 -25545
26056 -25545 23959 -58051 -71257 -136237 -99971 -264923 -215964 -72376 -122767 -341275 -245194
26045 -245194 -173160 -161283 -17551 157919 256661 119214 44013 10395 -83093 -53212 -93665
26034 -93665 -217489 -209159 54824 217188 303390 244641 148969 144889 165213 193492 -42166
26023 -42166 -252591 -195866 -3251 -24316 42020 166503 -38903 -92839 -89794 -126333 -208545
26012 -208545 -84794 -29734 -39108 -31088 -15516 -52300 -69209 -93432 -81018 -102355 -194336 -137687
26000 -137687 -108084 -149746 24332 142612 163303 246204 229295 131669 68551 7711 80787
25989 80787 112536 24366 103664 32398 8267 -178912 -158862 -119046 -11645 -7388 54343
25978 54343 241838 256907 191045 25145 39885 163442 29630 -89265 -51501 -15196 -22194
25967 -22194 -80326 -63322 -117031 -178654 -282994 -321711 -121638 13814 48368 -27075 -143430
25956 -143430 -16361 45728 33349 -5374 -118692 -153463 -34074 -881 129260 233174
25946 233174 285303 33372 -54954 56373 35812 9964 18070 -33080 -127433 -64708 -115567
25935 -115567 -144424 -87049 27225 87260 18246 -176197 -215585 -1328 -26298 45154 2505
25924 2505 -138817 -110138 -42635 85554 -52860 -137437 38279 -33336 -179276 -107918 -139476
25913 -139476 -111271 -77700 -142129 -157024 3007 55647 2065 33239 131110 349476 257214
25902 257214 -76969 -65538 256298 334716 235365 245892 429090 497202 434967 275669 313928
25891 313928 224576 27257 -111951 -82995 57451 1804 -3069 1352 49892 31907 -105299
25880 -105299 -142653 -118418 -160515 -157944 97888 173050 49904 -71592 -292245 -251675 43210
25869 43210 155291 223094 184690 51092 -160437 -308075 -243000 -226533 -317769 -198947 -26897
25858 -26897 134247 132120 -90362 -263059 -143207 -159608 -179667 -100001 12951 127711 135966
25847 135966 1708 20559 29662 -67672 53235 -76805 -147159 -119085 -149648 -153350 -50733
25836 -50733 107405 -21452 -135514 -113945 -124065 -150213 -134926 -61479 69808 122689 18278
25825 18278 -27355 -29852 -109875 -218359 -147642 -76446 -13122 163862 190370 144586 70532
25814 70532 75606 -47627 -176638 -159993 -130665 -44165 -179955 -228844 -276043 -168244 28754
25803 28754 53961 96272 115004 148418 173476 36465 -46798 -115723 12103 90666 13359
25792 13359 -46610 -158287 -258554 -176904 8421 -10737 65542 239927 188018 39518 9687
25781 9687 63718 121253 179189 114763 49344 -43215 -114670 -6329 -27131 -131436 -130927 -132181
25769 -132181 53453 103657 31314 92731 89111 56035 222653 192262 -54016 -72672 101646
25758 101646 99590 32062 14296 -81101 -113230 -189166 -88828 75244 122275 15190 184034
25747 184034 158240 140062 37590 1915 -51569 -288035 -361390 -211831 -136703 -163319 -200367
25736 -200367 -211114 -68280 33615 -49613 -56290 44016 185524 232913 45046 6577 -115399
25725 -115399 -212546 -132913 -44083 77406 177242 4271 -202095 -77034 -17478 47530 37952
25714 37952 12681 -124350 -64719 87773 210852 108561 38549 -229980 -379852 -268919
25704 -268919 -196632 113771 239547 210565 29113 -56882 -125715 -205776 -70681 109921
25694 109921 9863 25242 -80126 -151139 -171600 -30317 77682 111460 178024 111587 21541
25683 21541 -7689 -98723 -68126 25029 190812 114914 -26420 -36430 -15529 125757 -25847
25672 -25847 -200546 -13337 118979 112560 106776 185600 227651 116664 -149411 -164094 29690
25661 29690 58645 42067 69336 38690 96524 199035 29728 -129100 -105672 -81784 -92453
25650 -92453 -55528 -13663 5069 50819 115034 185169 201153 65939 -71202 -229747 -257937
25639 -257937 12167 -12346 -186770 -213774 -66949 64922 842 78155 50573 -73146
25629 -73146 525 39954 190199 167433 5601 -69251 -108460 -25185 -120389 -110227 -2134
25618 -2134 55557 7673 -77843 32432 14844 -15309 108063 149670 175551 196816 265098
25607 265098 259185 191787 32290 -63586 71838 103886 -95965 -81108 33567 32969 159191
25596 159191 79992 50447 147738 19407 -44445 -169164 -189844 -128408 -96421 -23723 -25385
25585 -25385 -41061 -147620 -247261 -178312 30595 172169 186412 125262 -74145 -246064 -271442
25574 -271442 -195069 -135258 -8700 63839 59870 128288 157144 103172 74599 115240 151372
25563 151372 233433 80886 -3534 -726 7190 -5785 -64739 -96983 -96548 -100726 -73717 102740
25551 102740 120095 115396 65054 124014 -21044 41740 864 -69713 -114941 -34173 55462
25540 55462 -12514 -73574 -124515 -66629 15210 56913 127879 41302 -55183 -50605 7149 -30338
25528 -30338 11465 152592 348535 339909 71428 79970 54774 -69031 24283 131613 -105375
25517 -105375 -35398 78643 10688 46989 83509 380 -253740 -433829 -348674 -224344 -167092
25506 -167092 -189008 -41000 148501 208982 254542 157554 -78056 -38008 177550 262345 30973
25495 30973 -55449 -11656 132013 241480 210581 131432 133350 243800 353948 133385 39135
25484 39135 -31008 -137022 -224156 -235085 -165490 -185653 -115994 -74457 -80439 -52681 72573
25473 72573 150706 214469 95662 -48506 -179988 -63779 10720 155009 186641 346922
25463 346922 476402 326992 44241 -80741 -14282 166133 103229 -150919 -314816 -212394
25453 -212394 -176787 -62829 -24427 -175965 -123834 -37202 -64719 11756 73308 3448 -145982
25442 -145982 -222519 -228592 -234064 -187175 -51305 2851 118696 107204 95375 57064 -49972
25431 -49972 10643 152438 60264 33707 92611 151738 125149 27002 -9117 -101389 -142591
25420 -142591 -47827 -66995 131471 276083 38510 -25689 43735 133241 190921 167754 52637
25409 52637 150265 51190 -124249 -26543 47130 8181 1289 19264 14810 41990 -8522 -126834
25397 -126834 -82096 -66561 -70081 72852 234803 244896 238133 139117 265523 333926 121981
25386 121981 128147 84096 136885 151457 10851 -58827 -122627 -218936 -125964 52757 168426
25375 168426 76435 -58561 -56847 97632 266217 231217 15728 -100871 -132114 -48545 -24270
25364 -24270 -115717 -78279 -69654 -96525 -43646 -15089 -22259 -22996 51557 120213 101129 93537 109880
25351 109880 122313 176056 192279 113002 158568 283531 201543 97330 -62367 -175528 -210116
25340 -210116 -3754 148869 -4292 -82231 -113610 -198971 -100840 -3274 60233 107942 -72851
25329 -72851 -95650 -100769 -63696 112825 215986 201212 271787 171213 -117334 -46100 -126848
25318 -126848 -227794 -119779 9232 28048 -116397 -169544 -167609 -152312 -89670 -215784 -200381
25307 -200381 -20810 -59227 -33860 12762 -56015 -202022 -208857 -177068 -189916 -213438 -205949
25296 -205949 -144809 -15894 -41178 -106775 -24174 -39185 -123393 -275607 -247040 -220734 -74470
25285 -74470 -74498 -37805 61662 -63991 -217086 -74300 8945 -135289 31930 94302 -78115
25274 -78115 -142839 -155907 -65819 97579 120166 132521 50562 174370 282924 217041 -6438
25263 -6438 -104511 -20043 52319 103388 206938 45254 -89788 50565 13353 43733 -80877
25252 -80877 -118217 -173138 -108641 -82450 36669 147199 182053 32505 -22311 -1977 -27922
25241 -27922 -10689 -228118 -276338 -160931 -104269 -118610 -152826 -258909 -245443 -108468 -42914
25230 -42914 51021 115754 194186 107468 21673 -110295 -227108 -131020 -56023 -72439 -50382
25219 -50382 -76643 -82228 -37446 -58434 13737 -152762 -119478 128510 99253 -19144 -12133
25208 -12133 68625 22730 -117981 44755 2889 -108772 -30256 -147487 -131567 -221556 -118959
25197 -118959 -17395 20495 36667 -51218 -49443 -50899 68438 -11229 -60285 140853 261835
25186 261835 94983 -48651 -161239 -101405 -109381 -48906 -15494 -5810 -2037 -34616 61788
25175 61788 146278 126660 -104890 -60842 126377 78866 118368 27813 -99297 -97658 -94071
25164 -94071 12343 198976 349296 301301 180458 74460 70640 73560 -157443 -152896 -63586
25153 -63586 132808 104902 206116 204717 95673 106839 132021 148592 22050 -70583 -78156
25142 -78156 -42401 -162706 -276771 -375595 -422746 -197896 -76129 -91440 -309865 -312707 -129033
25131 -129033 -73744 20400 193384 173150 188614 288418 205655 101845 121099 164419 158362
25120 158362 182236 212562 174624 56331 42082 48928 -6372 -51284 -45726 -47785 7658 -8681
25108 -8681 -52089 19267 193751 176431 48502 -36151 74682 121095 140249 167009 15482
25097 15482 21890 70967 140674 -12454 -9237 54926 34580 154710 180260 122143 -41780
25086 -41780 -124854 -168848 -214847 -95655 -45680 55493 43652 91206 36941 -194678 -246198
25075 -246198 -206112 -94460 -43251 -107705 -110899 -45444 71387 37573 -65617 -60658 94885
25064 94885 206789 193308 12107 -40557 192606 253002 185136 186961 135696 99722 9624
25053 9624 -153420 -149870 -126372 -260172 -117126 4306 -10820 -183933 -98801 -4956 34246
25042 34246 113697 242387 302551 156488 149139 209154 345681 386479 303224 85064 4747
25031 4747 -41008 -653 -118931 -163892 -229230 -159924 24344 119177 81271 -6471 114321
25020 114321 307069 383996 399905 418306 376983 330216 404113 322519 93201 -27186 -229509
25009 -229509 -12361 -68531 -103199 -130005 -30847 -70442 -226004 -254297 -76541 117388 185643
24998 185643 166677 112107 44679 118329 214119 216752 310698 296353 163005 5984 2667
24987 2667 22946 -144682 -301313 -295054 -249339 -197009 -344453 -250186 -262245 -377340 -210282
24976 -210282 -99412 84811 113547 -153627 -432169 -377005 -224758 -178165 -305589 -371647
24966 -371647 -451356 -423257 -169225 -15080 7974 61104 108044 209361 299891 294182 216726
24955 216726 140503 -24532 -168550 -136986 -3660 194459 277161 328726 467747 589384
24945 589384 408757 160866 -145545 -196051 -238613 -227071 -197935 -147064 -48167 -21905 28807
24934 28807 -70478 -111080 -1013 -63637 -127147 -79278 20027 22643 -69921 -269441 -348605
24923 -348605 -283157 -56311 98681 9325 -116131 -205254 -261592 -81652 46492 31942
24913 31942 -397185 -419422 -187492 -227969 -118908 20301 -54735 -22353 72226 34914 -44531
24902 -44531 37950 186983 245175 151502 150767 119892 28036 149235 129047 28855 -75224
24891 -75224 -70236 -28982 -708 57176 64585 -10461 85696 100814 -20868 -13553 72658 119330
24879 119330 -20970 -167455 -73381 37338 89693 173942 176106 166816 178517 149235 180143
24868 180143 118448 132527 5120 -48282 -57882 -130800 -209763 -173754 -242598 -377553 -301929
24857 -301929 -130048 -129966 -115501 -82174 48322 78692 -61459 -23416 -4876 47415 108412
24846 108412 98007 120955 194490 386708 445764 448597 288733 240844 222600 114494 34646
24835 34646 -42700 -55838 51653 81940 -28123 -155392 -214659 -45474 -16763 -19179 12858
24824 12858 59144 -22787 -212893 -274705 -288783 -294185 -176732 -52842 -12206 -31558 95006
24813 95006 147523 -40613 -100962 -52750 147640 227196 82250 -81772 -158940 -113722 5692
24802 5692 129513 49085 31636 -8485 -176858 -221157 -196873 -64199 -43684 -104340 -196615
24791 -196615 -10953 42676 -7184 50231 99395 98313 39656 69012 114310 37557 -124038
24780 -124038 29381 201450 287201 213631 -137067 -340224 -180082 -79073 -60747 -50199
24770 -50199 -226615 -266586 -133788 -23265 -78001 -79457 -64917 123278 221715 147438 115586
24759 115586 181294 212922 19424 -51226 68959 86721 -48632 -123553 -32972 -32215 -34255
24748 -34255 -110095 -20506 -32927 -258025 -249056 -185867 -283172 27088 77854 107924 137113
24737 137113 -32039 -149570 -25453 59455 126646 127117 -91168 -208917 -77050 -12039 12289
24726 12289 -801 117825 70443 3385 80118 209345 191882 232228 106485 -97073 -104967
24715 -104967 56291 130479 161977 126306 125760 30796 28012 14331 92882 -10192 -76030 -121828
24703 -121828 -64003 -66880 -62942 -88363 -214887 -116348 -139903 -13392 -46665 -20426 88109
24692 88109 118217 27658 -96277 -47471 12513 -27319 30914 15633 160085 266911 235815
24681 235815 146630 -56111 -20013 -2358 -56254 94755 169294 254062 291612 265978 265755
24670 265755 155154 -47757 -125941 -168388 -86049 96597 143865 35214 -72097 -141541
24660 -141541 38689 -34330 -170054 -10609 32867 46749 -66946 64658 277995 372446
24650 372446 463188 334325 273024 126894 246286 220403 50532 128558 234559 268313
24640 268313 266388 249176 314319 254754 323525 406402 301059 232232 303276 231838 139961
24629 139961 165864 275731 250636 111590 -40184 17943 239694 195022 107591 -32462
24619 -32462 -109465 -10901 197503 215512 18830 -20947 94899 59688 -24742 134072 201533
24608 201533 11459 -114206 -157946 -6876 -62882 -159561 -249869 -248540 -75171 112707 120466
24597 120466 117232 139314 219368 162507 -52274 -113804 168219 178341 -62076 -103207 -39465
24586 -39465 -1520 -87988 -268733 -159715 -53957 -20912 82499 31379 -192074 -297173
24576 -297173 -363959 -282807 -161844 -85577 -36559 -29552 -36377 -88115 -136267 -154208 -38565
24565 -38565 88976 50257 -96632 -165224 -155873 -119180 -71395 92940 70569 -5244 -23676
24554 -23676 -8803 17452 -40816 -70139 54276 70646 117565 88060 46512 -33659 -50526
24543 -50526 58933 -5613 -598 69322 133416 54800 20927 -74470 -206181 -200869 -172356 -85468
24531 -85468 89206 13269 56534 140063 258912 279521 243797 215384 114985 29938 44726
24520 44726 244183 234531 70576 5612 11084 92536 122612 160391 157562 263602 112715
24509 112715 -109360 -227225 -104804 -58051 145215 452784 354044 200353 124217 66520
24499 66520 -1144 84904 204260 109105 68075 -97901 -49832 80227 212224 267489 96456
24488 96456 159143 210967 191163 83058 88794 81577 7991 -223225 -193515 -21406 50881
24477 50881 88896 81222 46547 -62477 -97592 -88095 -23254 32150 78783 -47350 -46112 23083
24465 23083 -7629 28310 69517 -68862 -83726 -65095 -33636 -29960 -75393 -119499 -222787
24454 -222787 -136198 -115060 -223485 -132806 33711 6169 -90248 -149476 -104925 30367 135907
24443 135907 146645 -57987 -133074 -119369 -137497 -281817 -336421 -228575 -101877 -93020 -18001
24432 -18001 70704 -201680 -262935 -284565 -262223 -133041 -123010 -5182 22837 23829 97595
24421 97595 52165 -12071 -117676 -161543 -236883 -98600 -21037 28992 62033 -103809 -324403
24410 -324403 -139877 -49484 82956 20248 -175100 -153171 -82046 -40369 -68321 -113607 -119744
24399 -119744 -144850 -16769 -5196 -151080 -212775 -130366 -59705 23265 152546 79253 69125
24388 69125 -76616 -251539 -96847 -159789 -375788 -357171 -141214 -92732 -157035 -138070 -96586
24377 -96586 -62384 -174404 -181301 44829 244919 274324 286446 233509 65277 37713 -60199
24366 -60199 -157925 -139932 -165388 -65746 -75960 -5673 159730 176612 254248 -28987 -116279
24355 -116279 92559 128246 235200 338104 370335 422647 394451 339442 126472 -32371
24345 -32371 -76963 43889 57065 101510 84596 309263 439766 280859 108585 42564 53158
24334 53158 -55954 -103311 75100 61680 -50265 -100056 15186 106909 111623 -108 -180375
24323 -180375 -77269 -37213 -72895 59822 7603 -77406 -16068 -31065 49195 59983 119565
24312 119565 138260 87530 49557 149370 -25873 -187975 -228918 -136941 5967 -61053 -82880
24301 -82880 -144455 -191157 -373917 -245862 -140681 -62156 -171244 -208950 -32440 59143 104316
24290 104316 54168 -90111 -311833 -261249 -305828 -271599 -85137 -202094 -293626 -355179 -241877
24279 -241877 -34315 92119 132227 162170 156159 166123 263650 86565 67148 34446 39822
24268 39822 170587 194780 63654 70474 115510 238994 252737 250581 334549 80318 -87560
24257 -87560 -98163 -78438 -191805 -98270 -86264 12799 111710 102007 113791 124509 207281 130847
24245 130847 74534 69171 5 10706 -37198 -177634 -231565 -216250 -103415 -23324 1220
24234 1220 -13703 -5866 -56859 128210 190658 27529 36861 145953 -28001 10261 -112530
24223 -112530 -150035 -132043 -30870 -12574 -72404 -24571 -15351 -10984 -12000 177634 232059 201464
24211 201464 64607 84307 22577 47410 194284 164797 238829 234025 168403 49603 12271
24200 12271 12503 38335 274880 246353 111744 169041 -28807 -144672 -118455 -114222 -106189 -233913
24188 -233913 -143817 -137881 -74819 7695 79186 240333 241735 162835 84586 11840 18181 -6957
24176 -6957 63540 40947 -14281 -126479 -217868 -155323 -79356 29650 68188 45667 86318
24165 86318 129227 104761 97266 44166 -102292 -292600 -192200 -23523 -179737 -326885 -280890
24154 -280890 -356168 -215022 -32717 -14578 -73079 -157334 -48888 -39978 -105643 -156706 -53512
24143 -53512 -58694 -70802 -55037 43649 232755 373125 233177 -25655 -106411 -92564 -80899
24132 -80899 -88519 -168927 -50234 80599 40742 -38664 36143 52645 15133 -53056 -190231
24121 -190231 -76524 126415 52383 18124 -13160 -33863 -74164 -55345 -66813 -117083 -131816
24110 -131816 -310710 -287474 -225027 -57769 -143974 -294324 -281375 -65351 64533 -45053
24100 -45053 -133364 -68555 47057 13141 -264496 -184382 -69554 -36772 -37191 -17178 59196
24089 59196 -57836 -42717 -9701 83696 -75430 -181001 -139097 -39842 -35198 -21329 -25088
24078 -25088 81163 53950 60147 -115315 -59511 24519 55885 127337 131387 104691 85194 52569
24066 52569 163762 143852 30139 205 -33512 81485 63813 -11729 -69984 -676 -64418
24055 -64418 -23435 40663 49366 -176893 -328330 -189504 -103143 -183344 -203979 -268060 -286585
24044 -286585 -306721 -396561 -484650 -455545 -263533 -236738 -165174 -43818 184580 58331 -108184
24033 -108184 -42211 14973 64550 -31710 47758 57014 -3447 -99177 109297 133027 -104650
24022 -104650 -247610 -29071 -95191 -103528 -72885 -50177 9025 -54559 -49636 3206 144478
24011 144478 82779 55360 109631 129243 158171 155265 96748 34581 43372 68260 -85263 -140577
23999 -140577 120065 113533 59060 -124834 -223992 -281486 -331034 -406693 -393381 -373155 -236240
23988 -236240 -272968 -211765 -237078 -55759 19799 -74619 105948 84640 90036 14004 -20320
23977 -20320 119024 184286 65740 -138463 -181910 -104069 -204072 -103318 186229 254435
23967 254435 166231 165942 166108 3219 -101155 -179410 -279080 -63041 63535 83238 -114612
23956 -114612 -271618 -148829 -57481 -32653 -46263 -74754 -67873 2153 -21357 46453 207321
23945 207321 310498 235113 135709 219488 265375 32107 -155662 -219882 -139115 -115792 27611
23934 27611 101357 194201 179167 111556 6987 -84187 37815 161967 128377 97473 97491 2840
23922 2840 -174931 -163294 -162501 -101597 -87425 -107483 -132068 -138364 -135940 -77839 -81136 -166214 -133549
23909 -133549 -64203 -73988 10516 -68492 -103532 -52653 109596 324865 408665 446699 249528
23898 249528 122036 294571 279150 257394 135718 23487 -36910 -94519 -189429 -107663 -44178
23887 -44178 29813 48526 106633 23108 61298 -121526 -237960 50879 99651 128317 -18891
23876 -18891 -152874 -116626 -127028 -127356 12647 2453 -76938 45413 46715 61148 37967 72906
23864 72906 120826 162457 146051 219898 248934 121438 233890 264182 144591 -38154 -58046
23853 -58046 -85423 -124925 -29490 136923 144659 162375 100978 -63297 -38901 17750 87779
23842 87779 102184 17388 -81272 -210745 -244341 -270873 -12171 97086 -13780 -76097 -29512
23831 -29512 209 -32688 -14220 105329 30163 -74267 -18481 8651 -73290 -17806 9592
23820 9592 50595 90509 15123 -175546 -218547 -56667 135424 198470 130801 74679 32892
23809 32892 145992 139927 28477 -73303 -153546 -18466 194880 290937 238448 351010 122412
23798 122412 58864 141975 -4310 -174362 52821 190380 177571 138327 137633 97132 9558
23787 9558 193834 62733 2002 111699 -24255 -11770 56646 133939 132158 84458 -15860
23776 -15860 -10016 56601 29253 -14202 -54448 -5264 -36875 -92743 -123613 -22045 131631
23765 131631 56380 22085 99119 103505 -132746 -251126 -147868 -50203 -71550 118053 145089
23754 145089 122172 189331 7129 -144555 -160723 -147456 -212971 -303596 -257293 -173249 -175503
23743 -175503 -137696 -34279 -132698 -112184 -103878 -70910 -806 114243 178810 165070 338523
23732 338523 436665 453674 423657 233450 17385 -79087 -120964 -32099 30858 192428 67865
23721 67865 -141110 -29192 -158303 -107405 -104553 -197025 -67268 42816 -92524 -279399
23711 -279399 -246518 -111933 28585 -5549 -121055 -100635 -135622 -84856 -67097 -174668 -238080
23700 -238080 -135069 -114691 -246193 -401990 -391213 -254734 -88103 -39387 -58531 -69980
23690 -69980 34695 -42325 -144901 -180401 -209781 -120033 -61519 -63660 -97134 -147421 -178033
23679 -178033 -97776 -10647 -145396 -154927 -290899 -298706 -90205 -98431 -138542 -153526 -152250 -87030
23667 -87030 52458 4537 -47632 -271837 -482068 -398849 -219456 -45420 61632 210557
23657 210557 270319 266274 291576 276129 145974 33921 23336 51977 24970 15591 -17806
23646 -17806 -11416 27515 223852 182223 33187 58650 309763 207981 -30496 -50185 91011
23635 91011 38832 -104707 -81818 -95495 81478 77352 45458 182709 183013 180355 139773 116474
23623 116474 49787 108609 148822 284192 197779 133314 73162 21747 -39985 -97233 -173189
23612 -173189 -295101 -227388 -22162 70475 74073 17900 -15202 21242 -46122 -160541 -182700
23601 -182700 -139799 -157689 -19215 89288 137566 227732 19117 -51019 51546 50427 102329
23590 102329 63620 -51118 -166111 -101028 -8852 37419 -24774 -70298 -89176 38462 156058
23579 156058 121559 -16418 17073 -101726 -220743 -88760 -52590 16794 21590 -29425 197724
23568 197724 194257 16061 66043 218103 363218 401969 234741 263986 246772 18427 -273011
23557 -273011 -331351 -278365 -356490 -283796 -120362 122937 121164 273982 324180 267936 241266
23546 241266 203320 80695 34642 79617 52100 -103926 -182882 -161884 39258 172819 207430
23535 207430 265487 287616 149049 -77082 -166550 -65084 -162169 -212626 -114637 -99688 18493
23524 18493 51866 125650 69189 95933 -34227 -202960 -135562 -187994 -231923 -65130 31753
23513 31753 172322 222264 132437 276927 202937 68761 -30281 -108522 -194539 -137789 -137912
23502 -137912 -183728 -195717 -56771 -47009 -17376 113460 146606 42574 -79485 -178120 -172202
23491 -172202 -129815 -100113 -109888 -284354 -303212 -192818 -17732 81986 109999 102965 94940
23480 94940 178900 341203 229360 -12807 -68619 122499 208037 200828 165833 -26351 -120893
23469 -120893 -28972 -72891 -167517 -258793 -331776 -286581 -313732 -215795 -93589 42307 129112
23458 129112 152569 39330 -82771 89758 -4499 -238268 -173574 -115165 -158479 -31364
23448 -31364 -31768 -166265 -173550 -181220 -203314 -251861 -285122 -249058 -88631 90270 179760 256399
23436 256399 301105 49583 28947 119757 44691 70775 29746 -85413 -54759 55919 148266
23425 148266 2563 -182782 -187221 -10887 -10731 -71493 -23692 -92539 -166229 80184 109888
23414 109888 -1696 3692 -2921 51019 66367 -8794 -100083 -110220 -119440 -228210 -214897 -37347
23402 -37347 -51913 -5167 64245 -47705 -50218 17427 203073 243073 107124 6527 11385
23391 11385 28139 50963 -22398 -7807 141891 146264 104060 179594 81063 -52681 -132994
23380 -132994 -129779 -211579 -273784 -201961 -321096 -342212 -220178 -186674 -246654 -111567 163740
23369 163740 62547 -144710 -275591 -111543 72234 -39703 -94907 49540 -44607 78676
23359 78676 168067 136867 -3310 11911 74279 159237 380527 338792 206829 127068 45126
23348 45126 -74902 -35662 -117459 -148988 -46683 3599 -122343 -153124 -180511 -236171 -329657
23337 -329657 -327703 -213189 -168423 -243612 -205213 -18215 -139304 -125368 -52374 -129043 -101340
23326 -101340 -87194 -149849 -232760 -371403 -487578 -473616 -328084 -323300 -185308 -28039 -25353
23315 -25353 -22257 -44596 -347809 -292010 -164317 -39565 15997 118033 137870 238572 254959
23304 254959 203620 86051 250872 268389 349511 248654 75916 170417 32597 -61121
23294 -61121 -28433 29328 97790 177851 145470 -80737 -131626 -23792 -7024 -31846 -78888
23283 -78888 -4980 70111 35680 -22173 -26168 -157876 -126488 5062 104298 9120 -141142
23272 -141142 -194154 -32059 218948 160658 -8520 -108759 -150579 -229412 -300245 -211447 -100635
23261 -100635 -83227 8852 19849 232231 279454 278739 354830 277389 219925 189100 73230
23250 73230 -53679 -24535 224132 277994 280690 -31193 -284588 -316281 -230211 -105070 -151596
23239 -151596 -208435 -93618 -6768 -31046 -49316 -770 -110685 -104696 -155386 -217342 -137377
23228 -137377 40045 140880 135793 248170 215323 74817 52027 105680 303352 401171 417988
23217 417988 384166 339228 280485 48990 66241 61776 148854 63318 107446 144741 195916
23206 195916 225954 147625 168697 239017 221336 183649 137500 74175 97658 81858 137444
23195 137444 171478 9329 143381 182925 175852 -42017 -187361 -261575 -201669 -250389 -212006
23184 -212006 -73440 -91010 -165067 -104748 134467 169078 104817 83542 228897 183461 121122
23173 121122 101057 60930 65608 -4424 7680 163161 176706 83549 24118 89128 66708
23162 66708 33948 -84284 42405 196401 -50700 -148104 -255185 -314216 -120802 17629
23152 17629 21075 19448 247790 167905 84054 108852 62032 -29717 -79580 -151345 -264506 -240312
23140 -240312 -32744 -107781 -149679 -135850 -131396 -77880 -49597 75492 30811 65110 -22960
23129 -22960 -57833 -13811 35965 28973 -164061 -41133 -87588 -139654 42175 53697 -68990
23118 -68990 -68244 17159 -33754 -85562 -85027 -44174 -86126 19532 71391 65742 -48933 -69274
23106 -69274 2050 -55443 -187777 10288 113166 -77085 -259082 -131203 -69919 -29359
23096 -29359 7428 150356 93617 103624 72909 60802 93129 150305 35867 17086 -69569
23085 -69569 30952 70266 26316 -165632 -102598 -249 62096 116547 42615 13532 -14202
23074 -14202 111510 166794 172221 107261 12014 -224089 -157424 -101318 -245405 -322387 -271323
23063 -271323 -190607 -171375 -106828 -209481 -375517 -193871 -32673 -17473 -66054 -68221 92778
23052 92778 107627 139443 204376 143542 169651 189083 206415 68995 -11770 -54955 -47635 -36992
23040 -36992 -65140 -70481 -24773 55860 -62123 -94082 -126775 -13694 -22294 -158440 -304590
23029 -304590 -283316 -385435 -347628 -357884 -234735 -51952 14714 -121531 -83554 -80702 -147840
23018 -147840 -154232 -93719 -137530 -134123 -118028 -136849 -176725 -238163 -156280 -110483 -189105 -218243
23006 -218243 -152866 -64344 120840 195979 214853 159351 -21581 -206853 -239595 -260138 -200878
22995 -200878 33305 183909 153703 158847 145452 15949 5959 -5648 52940 -120368 -75342
22984 -75342 21177 44356 -54950 -221306 -83881 -66250 -91037 7792 190362 123737 -14361
22973 -14361 -140183 -148232 -159102 -197556 -177664 -176291 -144904 95489 -9819 -121659 -135618
22962 -135618 -51029 126416 154910 129841 81284 117465 278082 444548 424615 313163 233972
22951 233972 80874 -53172 -92317 19971 -22115 -122370 -9311 95185 -23972 -125135
22941 -125135 -66800 -115337 -152733 -163417 -175879 -64321 -140347 -103242 -133337 -93520 -86053
22930 -86053 -249586 -346078 -320697 -227784 -195710 -214568 -138857 -309893 -433058 -326162 -204010
22919 -204010 -178059 -148044 -86221 -36306 -110185 -184931 -85334 42834 -9322 23974 25200
22908 25200 27815 72569 -35618 -101278 -79532 86695 237862 262049 174159 46935 67363
22897 67363 293608 288907 102226 -109553 -110827 -34307 34000 154919 80899 42146 -44454
22886 -44454 -135699 39070 167379 107703 -45357 -167695 -125402 21727 -70763 -201408
22876 -201408 -154411 -258998 -287657 -194830 -108462 84005 30455 -7804 157201 189424 265875
22865 265875 299887 155155 67910 99829 -34211 -113068 -100353 -80948 -163410 -185017 -131748
22854 -131748 -147863 -243859 -227364 -146916 -67551 -17304 12550 9923 126021 76506 102152
22843 102152 -7513 -147358 99397 198456 63416 11114 59764 132089 37777 -72835
22833 -72835 -29610 -186309 -135255 15510 -40962 45116 180097 156560 -433 -85826 39280
22822 39280 -57466 56743 213430 247039 3015 -102157 114927 267826 280479 103189
22812 103189 -252437 -304763 -205593 -169721 -71051 -167421 -107133 -197757 -282338 -271347 -111145
22801 -111145 43367 88932 -73038 -272886 -229258 -175610 -129113 1842 -62689 -90085 -77665
22790 -77665 -168229 -256196 -131743 -186571 16523 62909 31512 -76877 -77744 75810 270159
22779 270159 407608 307709 168974 74111 58126 -39624 -47650 -18359 -149934 -116254 -15903
22768 -15903 85883 168834 259272 267159 20449 -106604 -104378 -100405 -245398 -280929 -144758
22757 -144758 -235619 -216836 -149196 29649 143889 -11928 -36190 -23745 -90843 -56489 60312
22746 60312 -26207 -880 73926 83491 63722 -45951 -96626 -255489 -324352 -278274 -333803
22735 -333803 -326711 -146138 31849 -179876 -164352 -191574 -197607 -113137 -19494 59485 -45872
22724 -45872 96760 182947 244183 145660 -153887 -244222 -178206 -167558 -124808 -35664 46432
22713 46432 38456 1011 -30913 58114 54356 -28492 -47745 -139388 14763 114909 10252
22702 10252 -41653 26134 -94667 -189396 -124100 -67074 -152499 -161374 -164920 -280787 -161446
22691 -161446 -117453 -46202 38332 -84891 -267833 -261138 -164809 -270098 -199830 28491 91039
22680 91039 -63535 -183795 -136237 -159751 -114596 -144732 -114059 19654 47332 84960 -68875
22669 -68875 -70917 28155 161303 99335 61019 114474 251657 213841 -647 -156530 -48017
22658 -48017 16046 -30134 -27792 21985 76596 136620 43822 77170 90965 188339 114324 117361
22646 117361 222611 427846 376241 207383 25155 39716 241243 242954 197249 179114 125083
22635 125083 130739 200127 73682 -7670 -25512 -124536 -129795 -81366 -17308 42852 -150185
22624 -150185 -254901 -195457 -134004 30450 97593 131535 71245 119510 -20498 -46784 -88274
22613 -88274 12680 -1081 -10886 12775 102009 44625 -32497 88123 229497 213725 241213
22602 241213 180155 104786 -16012 -65653 93007 66906 -81033 -47662 -3751 173341 212774
22591 212774 67899 -77946 -79749 -168214 -163631 -159161 12918 -112784 -417893 -301399 -208211
22580 -208211 -14196 173904 169057 109633 -29844 -47717 -132008 -232138 -264663 -120823 -92474
22569 -92474 -4742 319681 336425 47047 -57594 101883 192236 51706 81954 63933 179317
22558 179317 120534 -5334 -19122 139052 100771 55249 -36009 -116161 -43158 -18018 107702
22547 107702 91545 -59119 -90392 -67939 -6604 25387 67039 176917 219800 189340 199635
22536 199635 141541 118289 -17328 -157926 -215920 -180163 -280750 -215435 -187335 -36819 -63299
22525 -63299 -62673 -38291 -178736 -188197 -161616 -132738 -109441 -178567 -76783 -117950 -95116 -108359
22513 -108359 -86835 -26444 9455 -33173 -101235 -7968 29553 -104112 -87486 83116 173978
22502 173978 143589 229155 206467 226584 42742 -92106 -170955 -1810 38161 115319 364560
22491 364560 422758 493089 533953 391705 132364 6236 -240305 -233387 -103722 -111388 -104139
22480 -104139 -8244 -114211 -113344 -82149 -78832 94286 64587 29080 224000 226792 214272 253140
22468 253140 45967 -29724 134343 89420 3707 107657 230905 248737 109036 106754 119512
22457 119512 -43570 -58677 -41424 -101778 -8413 43589 41824 -38909 -101468 -311452 -384531
22446 -384531 -350170 -292864 -19773 217941 228918 281935 335927 377602 337406 274566 206724
22435 206724 75586 55114 -61418 -9584 102411 173292 -100638 -56410 -107512 -138538 -133002
22424 -133002 -179422 -136966 88713 145447 70926 41345 -63254 -58372 -234190 -375836 -226541
22413 -226541 39564 44682 160419 145115 64716 -12530 9177 20322 181337 119309 112077
22402 112077 56880 -8546 -148864 -109076 80772 120463 213387 228047 118034 -118898 -62326
22391 -62326 -109035 -164707 -116728 -75089 -106855 -155869 20406 213637 -7088 -101192 -43287
22380 -43287 45546 29597 74716 13158 22923 246712 337873 133339 -100398 -309706 -374347
22369 -374347 -145080 120444 259173 249410 147792 4609 -100095 -85572 51703 52062 -64617
22358 -64617 -66035 110518 164136 -25112 -109992 -235662 -256273 -216514 -211184 -268417 -228844
22347 -228844 -157484 -166948 -199295 3953 79054 -28296 -187929 -234099 -268692 -254279 -303016
22336 -303016 -192165 -187177 -44564 -18625 -71673 -214105 -173797 8523 108235 42423 -45635
22325 -45635 -70629 -6668 32947 123356 193113 230625 64889 64749 185674 304559 164667
22314 164667 80527 138179 179392 238621 304520 325089 183941 87092 137861 351617 358515
22303 358515 160299 25964 -121268 -142430 -257293 -206393 -132633 -125969 -110634 -43561 32595
22292 32595 -29193 24206 71265 -1452 -11341 -77177 -343987 -348763 -259289 -285864 -288101 -91523
22280 -91523 -3032 -143233 -202854 -113492 -114175 -140434 -82057 -7747 6817 -255887 -288535 -76139
22268 -76139 -2674 -84345 21055 24680 -9571 125978 160699 11747 -88934 -60246 61131
22257 61131 222762 134933 70464 47148 126292 80362 -29135 -18497 17426 5494 54810
22246 54810 -7241 -72867 -127589 -90681 -171258 -217126 -155844 -219627 -340984 -347327 -176899
22235 -176899 -117521 -122321 -152776 -197093 -96344 -24782 -55450 63309 19356 -97417 -149572
22224 -149572 1748 95835 -50176 -205634 -184637 -6986 -56624 30899 124464 22667
22214 22667 -112301 -77801 64075 131015 208189 164270 -30059 -143506 -185860 -100045 -162149
22203 -162149 -222459 -281772 -149395 -20816 51972 24160 -4025 71504 22962 -60066 -139499
22192 -139499 -189566 -234989 -187389 -13012 -20205 -78837 -101852 -103341 -296376 -419283 -331496
22181 -331496 -271414 -201105 -132439 -187572 -147395 -104405 -118730 -179447 -210365 -340157 -413292
22170 -413292 -356213 -290587 -422749 -453282 -436801 -378207 -358772 -288954 -148260 -35404 -45245
22159 -45245 51290 87775 -71161 -246070 -225889 -212343 -221165 -240330 -183421 -248905 -429303
22148 -429303 -325023 -134320 -40560 93747 -68771 -162484 -154386 -234906 -302243 -212560 -209928
22137 -209928 -354624 -240499 -204967 -166502 -132939 -74237 -138656 -218869 -301551 -323587 -231939
22126 -231939 -97378 -69549 -193325 -285084 -145797 -193789 -227112 -106549 193009 184053 130813
22115 130813 207307 245602 217573 -12863 41362 64819 98287 64152 -62036 -50197 -105735
22104 -105735 57691 13944 69160 48053 -78832 -54019 -15268 -145491 -164626 -159882 -95019
22093 -95019 -192336 -334146 -434545 -235595 -113784 -62483 -94363 -160251 26881 120137 65388
22082 65388 -7103 -21512 19626 55691 89553 -34582 -71140 -187589 -229072 -32076 -35064
22071 -35064 -95901 33803 223514 298115 276189 12597 61300 123973 90645 192472 134404
22060 134404 22564 -162584 -158604 -135992 -102522 -47802 -50218 -12051 187112 277998 238488
22049 238488 95371 56960 83925 74736 69243 22155 42880 25505 -77716 -163388 -214676
22038 -214676 -245489 -220729 -133207 12086 177764 222651 -21117 -74785 -34583 68105 138260
22027 138260 223256 239267 141802 52442 -29153 -147778 -161341 -76209 -143984 -130909 49162
22016 49162 135110 21635 -48113 -86961 -103669 -141830 -177456 -30661 30985 -87079 -104869
22005 -104869 -59271 -66590 -49342 97916 143319 282949 221906 83574 203077 277040 146141
21994 146141 10259 -122876 -141753 -48575 68876 7439 32904 -20295 -52118 -126222 -38373
21983 -38373 63938 126600 159730 252563 130625 -58317 -175931 -18626 35408 114238 224926
21972 224926 211069 117202 -8218 -1789 23951 56007 207107 130984 28426 51765 226598
21961 226598 316395 193834 198917 155037 217020 121309 -59281 -4402 38002 -74714 -82085
21950 -82085 -1545 49003 -57588 -11098 41572 95908 94578 95154 11485 6743 -43044 -76822
21938 -76822 3380 -34508 -19617 193270 416537 386537 245391 95633 63115 129101 79192
21927 79192 183864 299982 223712 61731 61353 190521 251256 151599 38046 -153121 -77265
21916 -77265 -21539 97603 -190898 -506659 -442483 -331482 -75556 -115516 -168193 -196482 -232670
21905 -232670 -206431 -244210 -214426 -40206 18842 -10474 17327 82043 142152 33713 59006
21894 59006 68499 78674 -76479 -52072 -92986 -126059 -170820 -139999 6690 126155 100050
21883 100050 72976 46842 4222 -23331 -108591 -160403 -224094 -111999 17706 34188 -71017
21872 -71017 -245756 -206280 -132888 -35284 54691 -60376 -204386 -175594 -113920 28092 68218
21861 68218 35219 -1095 3190 -11561 68883 186146 173132 112634 93140 -44597 -103317
21850 -103317 -117152 -138710 -13559 268424 208435 23003 -87349 -157823 -171304 -114653 -120812
21839 -120812 3258 79602 21763 19574 10474 -21143 47753 -63650 -14304 -90082 -90951 -34975
21827 -34975 130192 294541 221568 179478 201203 46586 -13946 76169 -37632 29057 130206
21816 130206 145827 218215 131207 101988 134634 29854 -23432 64549 183007 -100130 -292389
21805 -292389 -73752 47615 -91426 47261 137558 6859 -207039 -272572 -191123 -77550
21795 -77550 55064 78341 31137 -78269 37590 89045 -76812 -158363 -43919 86983
21785 86983 172327 174792 163098 55034 -56017 -44171 -89246 -26202 74438 195426 200365
21774 200365 140171 230182 484609 417495 312047 176805 1095 -27096 -47489 -99514 -102043
21763 -102043 6730 5084 -34035 -133139 -88292 -64688 -195776 -89615 33057 14085 -154281
21752 -154281 -12484 159817 294732 137389 106474 79422 46183 143808 228671 178789 106668
21741 106668 -29460 -122162 -180084 -95054 117934 112248 -1185 -35926 -138377 -229850 -100046
21730 -100046 -4669 11668 -64996 -94384 -108469 -185299 -133411 -26305 60560 -47224 -80731
21719 -80731 55137 77612 81286 213666 233035 141607 -1718 62900 73378 -91859 -149095
21708 -149095 -190584 -184619 -101520 -58576 -28203 -83000 -145184 -98409 -172640 -383517 -491221
21697 -491221 -317805 -30062 105557 -36565 -74936 -95982 -252862 -134024 43123 54911
21687 54911 26886 -19025 34469 59168 76646 175482 193834 138366 107893 -35338 -43814 -53528
21675 -53528 150827 61454 -70505 -88392 -27796 -57506 -109438 -201962 -24577 173119 275163
21664 275163 282762 260453 38627 -137783 -114005 -65987 51629 101367 33967 -60746 -8458
21653 -8458 33754 85809 -14354 -153014 -104379 -59812 -132435 -81146 -135798 -247633 -380164
21642 -380164 -276137 -231945 -239944 -85252 42103 89581 82639 40310 76839 164182 168866
21631 168866 131431 64548 -157636 -59496 -15666 -29338 91162 181467 -178780 -428088 -327629
21620 -327629 -86653 59886 90664 -1587 -24949 -90916 -90500 -16218 -70776 -176726 -182187
21609 -182187 -77600 86720 124762 220706 253599 12483 -19628 111948 170641 87271 -41450
21598 -41450 20536 24294 67288 114176 48557 114892 298928 274136 84191 -64874 -95488
21587 -95488 -135623 -36954 160734 261254 247688 218753 222170 141755 -36311 -215229 -265565
21576 -265565 -201609 -72531 18495 243494 193455 -34580 -125159 -48761 -21369 35582 -40341
21565 -40341 -179234 -97784 53332 -2529 -178064 -259962 -231210 -115926 -29084 -69553 -27225
21554 -27225 18642 122324 46547 42071 36598 -150638 -115930 30130 193004 195315 -58051
21543 -58051 -117839 -3600 -20047 -58341 -26145 9449 78083 120488 165861 182156 79359
21532 79359 -62570 49555 119281 139173 180536 151780 177116 173310 61715 7014 -322
21521 -322 67453 104069 82293 -48258 -38736 -84905 -159269 -197863 -141718 -58488 -33076 36678
21509 36678 43973 -4685 -214460 -303089 -180267 -76788 -49728 27798 159654 296510 178960
21498 178960 71783 44112 -5556 -71245 -2235 -88727 -185640 -186949 -139004 -57462 22205
21487 22205 -29219 124994 44136 48034 -16926 22333 75776 118922 99414 112091 73440 -10093
21475 -10093 -49296 -7734 87687 28588 91487 243952 321617 194949 87419 -84360 -92494
21464 -92494 74821 277885 324180 317804 187769 132888 107840 121473 160359 257442 194359
21453 194359 24838 27825 214093 145967 -143643 -85366 -120845 -23510 215970 346525 187966
21442 187966 -24706 -152382 -110042 -100217 -69695 57440 179067 74455 7407 -70047 -177952
21431 -177952 -221430 -136250 -132877 -94210 -90503 -104680 -7205 12761 -19090 150485 308235
21420 308235 260241 136507 62467 22971 27447 55771 113332 169604 168587 96563 -57962
21409 -57962 -75329 -98807 60684 27579 -46074 44353 15560 -265619 -198233 -91168 -39217
21398 -39217 52870 -22972 -159552 -69217 -161910 -138959 36010 99983 3522 -114582 -90455
21387 -90455 -107472 -162393 -130623 -40509 -24746 -20471 -77407 -45222 10198 -177278 -102685 23609
21375 23609 -110833 -172437 -131847 -82408 106232 123242 -13747 98177 174091 31051 -99238
21364 -99238 -125258 -224131 -196598 -57916 15987 122667 73103 53802 -33895 -129279 -197767
21353 -197767 -181935 -108250 -193402 -403470 -317471 -67794 -169339 -344256 -214582 -170414
21343 -170414 -263923 -110381 -225306 -222342 -132070 -91209 -124038 -30136 42995 244487 406669
21332 406669 356299 194581 40207 73278 99440 -18052 -102681 -223825 -66650 195641
21322 195641 308483 415574 497604 400176 187540 45841 45640 106207 -50339 -21438 -49136
21311 -49136 5750 -24068 -88774 62269 124258 -11444 -5632 60137 94280 24187 26278 -50015
21299 -50015 -189504 -261548 -159256 54504 9370 37758 -209341 -301563 -348402 -166649 8813
21288 8813 57618 26213 -19941 126312 261671 198791 43856 119419 292075 199255 59964
21277 59964 -59117 -131427 -117563 -138469 -25796 410 4876 -93855 -226290 -282836 -256474
21266 -256474 -201897 -146466 -55809 -106071 -143343 -240215 -163904 -118860 27970 67154 34884
21255 34884 -99203 -64251 48588 -49671 -135544 -229754 -183143 -56370 -154178 -221156 -99201
21244 -99201 140068 263925 244287 249787 259497 11169 -53823 25109 38441 60446 -81225
21233 -81225 -74172 -60379 -886 50720 166124 103340 103264 102400 175200 303465 298370 192109
21221 192109 97563 39238 -95158 84548 185050 74758 19874 3501 -47708 38291 195808
21210 195808 212887 167217 187742 195743 243835 131691 -8803 95976 39352 -98330 -143764
21199 -143764 -200890 -114941 19863 -36976 -30160 35074 -5681 16908 86298 214163 224880
21188 224880 191539 189417 280124 362971 282070 161404 9843 -43475 -52986 56600 25285
21177 25285 25710 12563 -167532 -218116 -168314 -150678 -200350 -12419 53649 131335 129759 25657
21165 25657 48239 220846 129342 -59797 -158576 11161 208807 337870 396991 252603
21155 252603 299865 262668 68184 13860 -60244 -54691 85716 122434 17076 149217 181420
21144 181420 70026 86014 59773 14308 -19486 -111592 -251208 -195129 -146486 -237409 -174597
21133 -174597 34283 186253 304820 235239 -36320 1220 54190 105808 114104 92178 261784
21122 261784 357662 281558 201463 106924 40037 33509 -40455 -61368 9443 88691 110981 154112
21110 154112 26661 -24265 -41153 -20064 186962 192417 30217 188244 212329 273084 213632
21099 213632 82838 68859 56698 214298 392945 326995 264166 201910 274873 294528 327642
21088 327642 131834 -3265 -91224 -145488 -145821 24971 126898 139082 99923 -50721 -81840
21077 -81840 60057 144125 236981 285720 341877 323202 198457 46756 -32685 -119326 -152226
21066 -152226 -103686 -142424 -116009 -70897 -3711 -120599 -100788 -13497 -28439 -25431 -51051
21055 -51051 -82816 52052 103479 55389 85106 -26923 -154261 7371 3866 -66882 -66766
21044 -66766 -44691 134109 175992 40248 98748 169836 151702 -9962 -133501 -83889 30504
21033 30504 94176 132933 -50653 -101181 -120607 -147282 -129798 30284 214025 286288 250651
21022 250651 142671 21319 -1090 -30289 -53041 -101773 -112261 -78411 -159996 -67975 6574
21011 6574 -13179 -132716 -129353 -125593 -96610 -36293 110126 105359 52278 139833 227765 315744
20999 315744 175411 40674 44869 224741 335786 321727 309111 203018 107036 -62208
20989 -62208 -223500 -213302 -241891 -207450 -35579 -20531 132000 322974 255959 205059 27556
20978 27556 -66310 -64106 9641 15176 13442 89771 66125 111926 66673 20251 2002 96704
20966 96704 159756 287984 310610 337280 223115 209273 242543 298383 267988 163497 137484
20955 137484 272162 244807 288674 389512 273089 177030 286948 9260 -145760 -97805
20945 -97805 -13643 23932 66550 9866 68962 70827 130500 105214 26495 -114368 -146940 -180719
20933 -180719 -138096 -22562 -100918 -177724 -204779 -280281 -154967 -111690 -32704 62668 53861
20922 53861 201450 262142 166818 96908 115671 194492 196442 138546 151021 54364 -86052
20911 -86052 -127189 -200020 -209269 112081 280819 129862 -16534 -42754 -24324 -134222 -212887
20900 -212887 -225332 -245282 -247130 -174301 82026 23187 66014 73796 27637 36306 21737 -37808
20888 -37808 -110064 -111673 -117243 -170161 16834 -71990 -104176 -69929 -30546 -32055 -15933 44702
20876 44702 187302 194227 110337 46226 -1368 -32424 39617 15142 19338 50826 119599 186261
20864 186261 110947 12180 -42193 -78841 21772 -2098 78339 136853 127202 45144 29337
20853 29337 -62209 -99045 -4195 24524 -51892 60111 130688 89802 183206 217915 149887
20842 149887 162213 136301 48261 -99204 -81537 -43445 -56643 -14232 -54481 -206224 -175929
20831 -175929 -79737 5655 104870 126523 11955 -207682 -241695 -76059 24726 30202 -20948
20820 -20948 -108236 -199042 -192124 -147040 -163838 -164337 -91366 -81561 -67588 -118845 -72145 115938
20808 115938 172600 197538 155587 93191 60460 131919 254759 241086 259805 321112 297870
20797 297870 376188 412652 435296 380679 446993 456003 297335 225146 142793 35290 -24716
20786 -24716 -74649 -93958 70197 206285 110821 6022 52015 210481 256662 127866 -112340
20775 -112340 -261147 -206729 -85373 -109038 56413 103031 113797 -18087 -21831 -81345 -152999
20764 -152999 -50874 20990 -105147 -61173 -111424 -87967 21304 98902 91697 -71550 -64994
20753 -64994 -78342 4393 -2588 177690 116616 118474 241604 147140 180696 290025 290028 319697
20741 319697 354648 276055 259628 249951 147684 99380 78260 278920 359254 291226 277793
20730 277793 200858 159990 164503 -91516 -122690 40114 172724 261668 295066 369473 219360
20719 219360 33165 -96389 -4373 99949 74533 17573 154014 161059 148176 190482 118877
20708 118877 -12716 40736 -31755 -59978 87617 179911 164107 135872 -76260 -184399 -58881
20697 -58881 51789 -173146 -84172 135120 190580 -11870 -129526 -203540 -302972 -79845
20687 -79845 138392 130085 147384 235997 236329 278391 301624 211040 172800 123979 132588 -50216
20675 -50216 -90624 -96982 -1838 162580 302630 297225 236422 144035 51260 -116865 -36647
20664 -36647 62690 158509 211540 227880 77603 -213896 -198246 73687 105683 -5707 58781
20653 58781 154917 237780 166821 206047 309628 429008 479217 373628 246474 280441 100056
20642 100056 20317 143077 167451 93207 -11065 30921 102079 131053 117041 65645 78395
20631 78395 -82666 -92514 -66503 -69352 16170 124600 179196 364156 471431 270192 360597
20620 360597 279817 79858 48807 94617 32560 -48109 -177569 104156 400369 404524 456111
20609 456111 370246 135153 326 -90950 -80373 -259570 -240316 -154078 100066 94311 11973
20598 11973 -83155 -23111 9726 79607 88269 252013 291650 344440 188032 25267 -33423
20587 -33423 -148596 -177887 -59204 3081 44150 134344 82965 92181 103386 63040 118026
20576 118026 87028 -1065 -40751 -40905 56036 262 103593 243622 161433 202327 296397
20565 296397 263852 256329 111575 -94937 -189252 5988 136405 44507 82974 155091 204932
20554 204932 204641 236357 190259 311779 271085 262872 206532 31729 148290 157043 212560 316703
20542 316703 246605 45800 -188732 -140268 -38467 45188 143102 142034 -21976 -144686 -237772
20531 -237772 -143329 -27641 -5929 108518 -102646 -214013 -72756 34043 278862 248950
20521 248950 156043 61218 -203208 -107931 165589 72819 -9940 -76667 -79632 78295 85342
20510 85342 146320 10944 -105557 -65725 -165482 -232222 -143281 13361 93875 133502 160247
20499 160247 152244 95851 70462 133533 208205 250582 351219 255201 83123 54879 150163
20488 150163 187804 146463 66512 177030 269804 237219 239657 163346 259147 209030 6297
20477 6297 32391 57220 -60807 -234367 -224014 -157380 6277 33790 40119 158288 127745
20466 127745 44509 -40456 -78948 147956 153016 272901 273656 135176 38134 -119249 -133395
20455 -133395 -147140 156996 452606 407258 273027 218185 176469 189614 137045 75182 12911
20444 12911 -53945 41729 -32861 -186539 -169717 -230375 -316657 -22458 144436 45957 18902
20433 18902 33485 -87818 -83880 -55369 2197 -84069 -364048 -595011 -410594 -119773 -92126
20422 -92126 -153502 -152478 -92495 -45972 58146 186217 158611 135617 54391 47792 40215 243283
20410 243283 313504 243505 159653 66154 22370 9833 92711 53531 -78457 -25245 74845
20399 74845 114205 94342 265722 384983 351852 235678 179406 226669 147944 -56124 -127984
20388 -127984 -36713 -23095 -40928 19076 62765 190165 217050 372306 306048 236685 127813
20377 127813 35711 157945 65824 -21024 -134833 -261077 -309518 -414066 -226317 -11624
20367 -11624 103168 111682 42003 -16577 -165557 -131309 -146596 -190592 -104137 -119766 20586
20356 20586 285597 378995 411530 257636 93071 136034 82728 15950 190879 294834 146939
20345 146939 55468 77630 84919 55798 77497 50102 34537 38409 181330 334570 329499 337324
20333 337324 339602 299758 163111 107534 110151 139470 231560 290261 289738 254636 293600 239274
20321 239274 189865 254499 276765 261319 276626 193322 235204 357433 457383 341987 117065
20310 117065 218758 250988 182801 311807 364969 361688 324653 325914 341754 308318 259571
20299 259571 278293 297783 223175 211208 98425 167489 190874 193462 293723 315910 142733
20288 142733 204368 182217 40631 48997 58081 -25945 105817 184351 97486 58746 45534
20277 45534 81295 203367 252262 236426 226489 289495 280583 194914 228186 156038 128370 148340
20265 148340 150913 17486 -161872 -248697 -62411 62872 -109463 28198 214758 250452
20255 250452 243943 314055 397311 348305 245291 285101 269143 225423 283891 257587 220856
20244 220856 171617 161634 229966 233550 240011 208710 286086 251846 156543 375533 501138 418587
20232 418587 293055 404055 536620 706242 789800 867985 1074977 1416354 1505040 1320589
20222 1320589 1042927 899145 811871 723998 878533 907852 1113544 1206520 1311655 1172617
20212 1172617 1048593 926352 984471 983391 676077 572429 606332 624006 632060 641748 730122
20201 730122 506289 565728 568449 489852 347191 509802 582722 557363 632888 797122 802930
20190 802930 857107 816120 758288 861372 942437 1057136 1087406 1298235 1391225 1505817 1620115
20179 1620115 1747847 1801044 1853052 1930699 2101422 2266155 2358654 2259498 2008085 1871876
20169 1871876 1702634 1607461 1529422 1427695 1459565 1451730 1510162 1526531 1392302 1204213 1054132
20158 1054132 829094 631109 481342 700140 948815 1094029 986381 929191 925640 1020216
20148 1020216 1099028 1174757 1141371 1072066 1031607 909557 965311 973917 926717 886637 685594
20137 685594 610473 822235 872411 912209 1126748 1412921 1535841 1396675 1241618 1230826
20127 1230826 1316620 1458833 1447328 1393902 1435059 1431723 1344339 1473796 1367593 1135610 985402
20116 985402 785968 856414 819693 719557 479375 557433 678722 660229 588575 502585 446851
20105 446851 458788 493907 608692 451569 230714 274540 443619 534447 527890 413184 411105
20094 411105 340844 254105 226097 206992 177387 341027 491628 478874 351311 345261 440636
20083 440636 355291 277938 233108 314705 228934 185417 239506 202896 159569 70409 149751
20072 149751 99543 26973 132800 321311 431409 426232 101988 -76359 34797 150762
20062 150762 381514 362314 314276 260163 325252 149434 66473 120410 222151 248080 422584
20051 422584 565296 376648 305321 442690 424444 348570 445880 301490 318144 402514 322757
20040 322757 443188 472805 497161 574474 665538 518061 516275 510477 456190 473312 620459
20029 620459 551379 330718 311903 309040 354691 522083 511574 440829 326900 359106 388519
20018 388519 352550 263177 245697 137252 176126 39284 190211 302609 343631 363292 336509
20007 336509 417935 345384 248685 231717 122778 147304 155666 392434 450417 293440 194054
19996 194054 146454 183562 37181 -26121 -44077 -33420 90299 203101 223715 184447 302943
19985 302943 292869 276658 479506 587941 418764 164337 284266 293453 344740 351349 193652
19974 193652 -41429 7552 128554 274091 376512 286524 302580 265692 241056 408478
19964 408478 475033 422513 356924 422803 410632 397697 339244 230356 317185 317458 344470 288180
19952 288180 430150 411764 373173 489811 613027 447951 285426 320676 560169 691321
19942 691321 700948 619267 590445 561075 458596 565904 615529 462702 365248 439556 279120
19931 279120 155937 65049 -55372 -114257 -88973 12935 -12057 30472 81967 153238 250841
19920 250841 202098 69090 98659 267435 324313 381886 394363 342663 477271 413488 426710
19909 426710 524966 604378 449608 435979 382950 511399 565778 472491 506016 462288 553275
19898 553275 669191 782532 920811 1184915 1202402 1176722 974529 958339 1009364 1160303
19888 1160303 1119856 1010067 771979 794173 721710 556104 536323 572135 625158 589252 452229
19877 452229 504123 587874 594455 602508 728345 784814 785677 993668 1030485 899187 908533 946338
19865 946338 969052 919855 719089 637343 603291 610124 734438 807139 747422 688874 672526
19854 672526 587515 489883 669309 686785 658897 580218 551921 464981 567890 749922 643019
19843 643019 597102 706180 767634 703411 670783 530410 381435 374265 525527 531069 617306
19832 617306 672727 873301 954104 951334 757246 699930 750637 828295 825549 787986 585469
19821 585469 527605 546163 646794 606335 764476 952247 1126290 1132193 1143030 1173127 1117698
19810 1117698 1053910 907680 897888 967706 1074692 1071239 1161111 1207837 1347468 1191286 911939
19799 911939 870349 762429 793722 945206 1005001 943436 903239 983226 941338 974649 1004207
19788 1004207 1134791 1191838 1175129 1137761 986527 979342 1193953 1276158 1111508 1105671 1264284
19777 1264284 1496644 1568881 1578599 1651591 1815424 2043610 2092837 2057358 2113740 2185395 2390264
19766 2390264 2565090 2543233 2694079 2963333 3031972 2906276 2914851 2972191 3016209 3010201 3143502
19755 3143502 3287759 3151451 3188739 3424908 3493680 3485284 3571530 3565015 3513870 3468839 3337389
19744 3337389 3484812 3727138 3902096 4073897 4328073 4503138 4732421 4927589 4895480 4969769
19734 4969769 5187601 5272753 5515089 5971647 6332837 6536934 6890309 7040700 7218734 7750214
19724 7750214 8319800 8589560 9050300 9663468 10219239 11145315 12295191 13602720 15008564
19715 15008564 16503404 17801864 19095290 20386128 21627843 22805703 24095571 25411559
19707 25411559 26894810 28211174 29407720 30683043 31868896 33131749 34597009 36382566
19699 36382566 38863395 41984655 46334996 52280042 60745495 72996853 91175853 117040272
19691 117040272 147707590 171040454 177223662 165837371 142147444 121510872 112012445
19684 112012445 112400686 121494607 140111868 166393698 189597220 195971118 183265461
19677 183265461 155607983 126841861 107006839 95028505 87568719 82656350 79356276
19670 79356276 77171296 76181644 76075949 76679438 77895037 79534656 81099764 82698956
19662 82698956 84475021 86267070 88290534 90513997 92721703 95233320 98260411 101730610
19654 101730610 105479886 110198454 116913014 127413141 143851412 168469512 201441815
19647 201441815 233643090 250936780 252109802 242023197 233931006 243080009 275251214
19640 275251214 332978859 406450978 447006806 401921661 318863374 259903595 227537502
19633 227537502 212451187 210677795 221510501 243276316 264882575 270751600 257011026
19626 257011026 226014517 191033521 165731740 149468226 138703226 131354293 125872150
19619 125872150 121895285 119130247 117304179 116491540 116066456 115874430 115609901 114922128 113771208
19610 113771208 112408015 111276822 111038118 111690768 112836956 114416770 116102843 118733431
19602 118733431 123948877 133414705 149417568 174271047 206609443 234051112 243126930
19595 243126930 233666945 211664514 192460958 187798678 198079235 219297363 238490400
19588 238490400 239420255 221048966 188643393 154599473 129743635 112646156 100329803
19581 100329803 91033196 83735754 78140014 73559088 69627295 66262153 63554400 61070289
19573 61070289 59019884 57327715 55754503 54222039 52669992 51356963 50413319 49646685
19565 49646685 49133180 48880734 48276754 47073695 45540240 43914445 42390499 40965423
19557 40965423 39836410 38590189 37155760 35373848 33525134 31689095 29872486 28100003
19549 28100003 26368180 24888318 23445154 22175959 21073084 20082794 18980311 17721684
19541 17721684 16643109 15687208 14857231 14097125 13364224 12938318 12255796 11532484 10903982
19532 10903982 10419210 9952546 9322409 8625447 8212966 7974555 7601901 7194701 6845730
19523 6845730 6509052 6494338 6250730 6025591 5811888 5668278 5579303 5324658 4982837 4717154
19513 4717154 4510714 4296163 4053066 3864027 3686668 3672929 3543019 3404144 3337329 3308377
19503 3308377 3119262 3029432 3121873 3207996 3053077 2894270 2878389 2756725 2664741 2717879
19493 2717879 2694509 2574148 2512884 2467605 2267877 2210957 2164913 2132329 2085345 2017185 2003957
19482 2003957 1906497 1952795 2069232 2074039 2083247 2162822 2249164 2286806 2328676 2309462 2193089
19471 2193089 2121073 2112843 2145416 2237511 2216371 2149773 2096717 2060845 1994606 2009375 2210320
19460 2210320 2237366 2179757 2280467 2475212 2277518 2033961 1921395 2069162 1985883 1793736
19450 1793736 1832562 2003847 1956450 1890448 1963067 1918586 1820912 1832309 1915463 2136691 2099830
19439 2099830 1881796 1709904 1702053 1784952 1790283 1963518 1989596 1878097 1887441 2005686 1990191
19428 1990191 2023682 2101776 2119286 2018174 1950490 1957916 1802103 1570084 1477129 1573484 1722965
19417 1722965 1672633 1699407 1670851 1625633 1622903 1510002 1309146 1156765 1463912 1497629 1529221
19406 1529221 1516823 1440563 1452277 1315168 1302165 1415649 1417516 1377607 1317915 1431185 1499557
19395 1499557 1543240 1424512 1344560 1302299 1424079 1411372 1247094 1027757 1107344 1344587
19385 1344587 1317453 1231322 1269766 1161837 1301089 1469385 1468138 1439702 1294438 1002547
19375 1002547 701329 799376 888251 740941 840238 846545 827135 914916 897635 918911 894772
19364 894772 728639 529970 408599 261124 292852 547071 569751 597385 682995 668325
19354 668325 752983 790621 760222 815250 1020726 1172245 1264028 1365208 1331132 1038869 910873
19343 910873 975269 1004015 1040057 1004428 844711 782751 806309 794249 836099 862074 879015
19332 879015 935290 895139 887364 856593 806848 637123 547122 609184 559202 541428 492168
19321 492168 501545 557268 605886 661564 594999 654206 664947 660852 512567 340240 446827
19310 446827 466752 476325 537977 625594 715040 725030 677595 535967 626852 736873 766468
19299 766468 871059 784104 550599 522420 528951 490487 451599 502508 580296 627418 548060
19288 548060 599504 619285 529329 386945 348291 473713 539291 483695 584705 513954 388664
19277 388664 522570 603302 467915 303940 168975 304702 329537 460409 348152 258788
19267 258788 263103 282336 464866 371164 210542 169106 360067 588932 566922 447546 338919
19256 338919 298219 261946 516305 694904 796258 782993 721735 583841 535745 396420
19246 396420 363463 310533 207700 336370 399774 341062 364402 453083 523135 528126 492128
19235 492128 591772 499266 407079 608511 773726 854722 679000 503254 337067 348163
19225 348163 457850 576108 598335 652098 572281 379751 274652 312053 336759 369630 454011
19214 454011 531437 619118 672060 802534 784364 864392 958390 993637 934978 665757 450903
19203 450903 581143 698148 803660 925649 866498 827321 742846 465928 439525 521920
19193 521920 603664 568887 559517 633331 709995 577635 653644 665141 510154 451269 492565
19182 492565 572514 692477 627588 475290 468086 525100 520307 600527 552723 576802 563891
19171 563891 592273 671907 638606 632745 702665 782413 717164 661594 680364 812371 854341
19160 854341 1073873 1103852 1434166 1529690 1571351 1465391 1636035 1728276 1759901 1873901
19150 1873901 1848615 1798919 1723196 1579315 1458997 1337248 1426999 1384465 1264262 1196215
19140 1196215 1244767 1337922 1447384 1440100 1477943 1406374 1342879 1268163 1274764 1227107 1017342
19129 1017342 842861 791987 700548 829460 885959 830388 817147 860885 957828 993840 984932
19118 984932 1088136 1347260 1253706 1254840 1217836 1183740 1190738 1416561 1723109 1722498 1822397
19107 1822397 1887984 2053844 2150671 2171376 2089281 2163930 2266492 2325518 2546688 2752519
19097 2752519 2615129 2451372 2155960 1825426 1585762 1480867 1608590 1710562 1806585 1907349
19087 1907349 1723984 1650834 1495219 1232066 1081073 1051379 1013985 973598 879739 865545
19077 865545 836119 978417 1076291 978929 877263 619323 636556 823919 906416 948294 956601
19066 956601 827348 780026 747077 895229 1048529 1035423 981451 966152 1269062 1495275
19056 1495275 1706129 1573355 1362568 1189776 1029861 945079 1127036 1398209 1551075 1488453
19046 1488453 1264541 1092638 870469 784846 607982 609102 654877 548394 354558 314045
19036 314045 472011 551464 313802 199904 390749 546396 562725 549213 488584 369594
19026 369594 372050 474830 607707 405712 380222 469006 376510 486122 510963 470150 445719
19015 445719 423337 448677 488195 222367 281962 323237 351481 471259 483056 429702 242520
19004 242520 98015 172913 168805 223374 187874 21951 -145706 -62304 90092 92845 177790
18993 177790 393235 421661 445687 438432 477999 280491 157852 163761 162127 -48563 -70784
18982 -70784 109784 130565 27960 32904 106121 70418 20501 140951 216333 133147 116536
18971 116536 81661 139979 204775 66424 -131542 -203537 -123798 -39886 40102 -22696 -198414
18960 -198414 -262462 -244820 -181348 31571 305992 437257 264727 20864 -32713 179920
18950 179920 353705 432689 279449 240106 362139 226045 122259 189556 265128 336523
18940 336523 269020 143377 20079 22391 258818 402766 232369 293543 354855 298914 185012
18929 185012 224647 38551 -166734 -87241 7374 65054 82706 202866 228870 229247 139126
18918 139126 147388 214950 224281 126178 123263 19787 11589 -48595 -59382 30250 141184 118905
18906 118905 85543 235448 217096 371706 489447 462185 433007 306953 239986 388241
18896 388241 467791 520006 490628 527362 673873 820318 720251 658068 756581 741498 659740
18885 659740 660976 625096 467686 347050 524030 561856 541759 539914 430540 343224 446173
18874 446173 267261 197850 166696 52672 111505 238238 202916 278399 554609 527149 541327
18863 541327 511867 504639 334328 245490 241235 353792 365504 166955 344947 401460 361377
18852 361377 337807 315934 516158 606061 663358 478116 470308 552400 571543 481163 542942
18841 542942 654555 620640 582999 597925 595057 672754 551029 561969 504005 611880 728499
18830 728499 741492 529803 565699 760469 832923 827024 999507 1213147 1063267 831979
18820 831979 715494 721842 666073 787919 932276 847095 790003 898907 1072613 1154383 827397
18809 827397 634422 746641 836424 682109 658442 877156 983929 976664 954186 1072320
18799 1072320 1086842 1042564 895474 718977 727609 854001 1100931 1180257 1174722 1189576 1122504
18788 1122504 909317 794501 666418 725014 844869 935974 1031383 1085516 1293037 1262008
18778 1262008 1273772 1416368 1688297 1879110 1871938 1696519 1705882 1898195 1961722 2286357
18768 2286357 2576173 2797896 2968778 2949073 2902116 2719081 2527089 2416419 2216644 2053072
18758 2053072 1972459 1928057 2108162 2183448 2147675 2208355 2035024 1978704 2149405 2270311
18748 2270311 2388653 2521203 2495993 2427847 2318457 2277445 2360708 2392077 2399718 2200324 2305125
18737 2305125 2553643 2731854 2899990 2966712 3030384 3284527 3393630 3656922 3864254 3805415
18727 3805415 3691430 3610045 3775225 3950675 4234861 4352761 4551323 4681132 4811497 5123090
18717 5123090 5460803 5809394 6004633 6432898 7055685 7265898 7527444 7948996 8447687
18708 8447687 9098167 9870125 10815386 11819362 12693313 13454398 14274231 14975054 15689166
18699 15689166 16270325 16610031 16984024 17453443 18204406 19042401 20192539 21638900 23611270
18690 23611270 25871302 29077257 33978903 41767131 53675534 70585993 89734280 99124971
18682 99124971 90553376 76595167 68959336 68683960 74679693 84876790 94334920 97941252
18674 97941252 92634028 78965948 64514315 54402928 47806989 43370099 40312958 38249411
18666 38249411 36813411 35773614 34935729 34574326 34752443 35156457 35872756 36805826 37839038
18657 37839038 39040308 40295313 41637417 43302436 44757395 45915113 47087709 48031597
18649 48031597 48774045 49420906 50253796 51763872 53717307 56323811 59596704 63850242
18641 63850242 70042894 79662537 94665539 117020734 145043680 167142311 170198357
18634 170198357 164798089 164117190 164223992 164598863 169356787 179854782 189602472 184400934
18626 184400934 170417231 163233755 158066862 141550723 118080865 99440199 86954481
18619 86954481 78096126 71789211 67104956 63428749 60447356 57982525 56177814 54845091
18611 54845091 54021586 53411970 53292385 53368610 53649722 54055515 54269430 54547814 54901858
18602 54901858 55057103 55129420 54955007 54751891 54500291 54101849 53869866 54009913 54235601
18593 54235601 54940357 56100038 57933268 61480247 67891662 78415057 94921485 115763240
18585 115763240 130699541 124866158 106248707 92554791 87621519 89981064 99491147
18578 99491147 114795095 127112115 121081541 99406529 79259129 66002970 57278893
18571 57278893 51045192 46140886 42325122 39433278 36960528 34786003 33098598 31683764
18563 31683764 30494626 29557558 28706547 27916274 27041571 26295134 25895420 25756871 25530988
18554 25530988 25094709 24825074 24630035 23954833 23178294 22569946 21902464 21147416 20691931
18545 20691931 20184904 19459305 18471414 17400471 16452737 15601313 14553163 13633222 12798223
18536 12798223 12105169 11494183 10856277 10208834 9521614 8776382 8216514 7948691 7796094
18527 7796094 7490337 7111419 6758585 6292405 5917080 5780430 5596983 5288659 4953396
18518 4953396 4819692 4617078 4466054 4300928 4102600 4021867 3794763 3567075 3451871 3264990
18508 3264990 3081157 2997871 3065877 2954506 2837935 2788372 2865382 2691988 2524348 2642049
18498 2642049 2635470 2606071 2563058 2456278 2334861 2234033 2072267 1900320 1768322 1694275
18488 1694275 1605441 1489279 1456108 1258570 1197800 1291668 1289367 1346611 1378768 1240088 1036720
18477 1036720 986761 953598 873395 789538 816148 1047883 1217236 1333537 1300182 1250635 1365650
18466 1365650 1435413 1376904 1412486 1308133 1126428 1194844 1393746 1606562 1778560 1513281
18456 1513281 1175461 1110513 1214462 1380852 1519413 1543220 1546626 1590471 1495774 1488896 1488937
18445 1488937 1425213 1441010 1312326 1353785 1424086 1349646 1349051 1328644 1322617 1231241 1145089 1296434
18433 1296434 1188514 1103429 961419 925449 1089681 1223571 1315156 1350431 1244701 1060586
18423 1060586 1065014 1093424 1214014 1332765 1340816 1217455 1267515 1143340 921057 1050775
18413 1050775 1137710 1147296 1173910 981196 988345 1101067 1092810 1050078 1141446 1183969 1255517
18402 1255517 1238672 1215918 1219199 1184133 1149195 1187179 1378151 1367876 1291575 1519998 1581016
18391 1581016 1636917 1579143 1618027 1650341 1687833 1713479 1667091 1824520 1812108 1696705 1626162
18380 1626162 1688853 1827909 2051492 2208472 2271285 2299993 2209276 2290583 2349499 2330382 2246786
18369 2246786 2289272 2378533 2458962 2466965 2412756 2386904 2330015 2476830 2679060 2690275 2691783
18358 2691783 2605743 2378034 2416159 2476427 2619856 2596783 2651985 2916056 3207126 3362742
18348 3362742 3416090 3446870 3550817 3706768 3836106 3993868 4045659 4281833 4506550 4825981
18338 4825981 5039044 5380581 5691860 5729052 5714661 6037985 6543664 7121200 7819874 8539913
18328 8539913 9283086 10040952 10888950 11657755 12509489 13421446 14357646 15151834 15938853
18319 15938853 16848998 17664913 18265309 18631748 19171123 20026292 21120840 22490785 24008311
18310 24008311 25848199 28452652 31872618 36471433 42962053 52361380 66732714 87146963
18302 87146963 109556804 118734323 105560142 85724775 73014060 67358681 66640731 70567144
18294 70567144 80205150 96225098 116375297 128730696 118285941 94758526 75912685
18287 75912685 64012095 56461740 51357370 47808702 45487056 43713016 42447646 41763404
18279 41763404 41811061 42157915 42627686 43249642 44062270 44827946 45555366 46527105 47515203
18270 47515203 48696230 49912305 50781189 51343642 51811026 52430652 53550583 55359803 57930674
18261 57930674 61629837 66720454 73786779 83740396 97942170 118533978 145031141 169312095
18253 169312095 180803600 182731351 173441093 151748914 132664235 124481684 126277577
18246 126277577 136069477 150914684 167067792 182013549 189165761 180075211 153301348
18239 153301348 123639965 102748716 89083626 79753020 72897575 67799934 63984283
18232 63984283 60921700 58507795 56547765 55145919 54260519 53529271 52940062 52711755 52681083
18223 52681083 52783847 52821349 52894642 52814266 52493248 51952077 51440348 50997288 50583967 50522694
18213 50522694 51079622 52399872 54514273 57483071 61818094 68341436 77945160 90083834
18205 90083834 99878619 100443561 93164452 82351543 72150976 65934874 63662954 65211840
18197 65211840 71029313 81650890 95073975 102141470 92788027 74829530 60646669
18190 60646669 51368380 45123680 40581403 37303150 34730986 32795912 31035166 29321715
18182 29321715 27770766 26520882 25401966 24744576 24170369 23608622 23181425 22841680 22410807
18173 22410807 22023922 21600350 21174550 20857241 20239553 19677475 18934630 18338739 17834061
18164 17834061 17412618 17189473 16870713 16533812 16051854 15243365 14313373 13602011 12970734
18155 12970734 12267875 11719843 11270218 10784715 10315983 10018654 9821318 9872591 9766551
18146 9766551 9463882 9202122 9031608 8854153 8679613 8539057 8606746 9028342 9452382 9663526
18136 9663526 9984315 10414108 11092671 11945529 12932635 14037086 15284168 16456013 17275272
18127 17275272 17430209 17652802 18069216 18237149 18054278 17879427 17706061 17631675 18020770
18118 18020770 19009175 20698891 23194848 26817254 32299514 40463501 52754416 72103722
18110 72103722 102112842 142757552 178878337 173801028 131829732 94505369 72070297
18103 72070297 58151579 48811495 42345494 37923157 34683045 31887748 29621561 27840015
18095 27840015 26316030 24910410 23719629 22927009 22265767 21629984 20984246 20420219 19827290
18086 19827290 19271159 18774573 18292918 17927771 17710304 17789074 17972305 18315239 18764957
18077 18764957 18961291 19064003 18944494 18569583 17903874 17093509 16028674 14800618 14038340
18068 14038340 13443332 12860069 12125065 11327273 10525353 9963232 9494677 9056032 8601272
18059 8601272 8174114 7569078 7187209 6810335 6388955 6007438 5703268 5512163 5528170 5567090
18049 5567090 5393969 4990225 4643380 4407755 4243089 4009973 3699562 3737871 3781005 3654674
18039 3654674 3631027 3445559 3117812 2987164 2683546 2673551 2574036 2474708 2338584 2164623
18029 2164623 2137464 1980984 1727249 1642411 1585256 1569864 1389040 1438418 1385454 1310420 1300186
18018 1300186 1256669 1094982 1122337 1091827 1165878 1003409 954329 1091484 1169935 1271081
18008 1271081 1230346 1142414 975346 819895 689247 725543 798654 820137 918421 822133 597315
17997 597315 716430 960789 1148262 1054534 945400 882017 788358 736950 532448 529538 531559
17986 531559 506010 509217 527802 484258 470197 484246 396821 296128 503329 723889 767712
17975 767712 762454 677801 648664 797447 689458 546105 518149 574361 722625 815979 646017
17964 646017 580286 524214 385380 382618 334044 284167 310826 257703 196644 223019 287497
17953 287497 323258 402409 494158 659612 751524 751270 701967 666695 637342 434560 423951
17942 423951 412700 442387 431889 401804 423990 455217 525861 415554 449038 512157 610972
17931 610972 625884 621787 595361 545824 516956 464460 581962 579112 559431 564607 736803 731590
17919 731590 528978 421790 446529 390802 451790 401025 502236 705835 671931 420359
17909 420359 182109 154587 194421 294627 245761 274169 207631 177725 275955 337989 169156
17898 169156 152909 256058 278493 194908 198276 259839 307486 271618 146867 114576 195923
17887 195923 389211 340864 299098 338679 298583 275405 289189 207703 328380 296227 221391
17876 221391 271958 183243 116574 100665 221742 307115 356543 418964 402690 318285 340577
17865 340577 312489 317535 229984 213386 234887 174780 33266 -12088 135496 282495 209828
17854 209828 67167 120364 166724 236484 336834 364870 274986 112934 112461 114564 -12656
17843 -12656 -131498 -160040 -141761 -772 128689 181446 205986 37256 -26904 -8265 13236
17832 13236 98753 114274 34197 -151685 -107089 -46771 -127443 -170641 -235983 -203839 28840
17821 28840 141642 227016 245736 104702 86815 119404 28460 82853 67155 42922 69362
17810 69362 124956 99864 13455 40009 165792 124260 66294 137302 288386 394459 559003
17799 559003 722379 584731 299561 345496 431881 381281 90979 171993 234783 237521 274428
17788 274428 337630 365473 270132 401532 394773 428907 459527 487735 549968 627751 477477
17777 477477 504927 496365 573156 615337 693996 683017 664013 745550 895432 747635 637302
17766 637302 508770 459620 462873 327683 122089 171804 178909 201322 334742 298819 307295
17755 307295 296260 317700 466224 514309 526511 393345 345130 380830 340560 314814 442097
17744 442097 419868 287170 280679 422515 533399 547047 512946 419100 336190 244215 428145
17733 428145 693188 1062383 1064387 862920 704380 754465 581806 465567 512865 580266
17723 580266 779827 902438 794117 724498 562375 415318 344635 338871 472445 451272
17713 451272 319045 417376 626874 544243 407782 261457 349688 275986 188153 216315 156184
17702 156184 114554 173320 207407 135755 108086 80210 130104 237532 267517 223054 308405
17691 308405 402435 522280 392006 375535 320165 518466 847996 984282 961035 960765 923489
17680 923489 690843 528912 478835 406923 386996 368034 410963 424523 591663 535794 323861
17669 323861 295732 178845 190461 229941 239629 277932 159057 111018 -39726 134337 105827
17658 105827 -61646 -2390 30082 -22460 -146904 -73147 11009 116708 197182 22345 -153549
17647 -153549 -179971 -277334 -97438 103671 228723 184110 -62059 -255537 -226103 -145863
17637 -145863 -12895 97958 215543 256193 142491 -8673 -18035 36326 36240 -123257 -82819
17626 -82819 -31202 2480 61200 -22319 -44569 -94525 -216249 -310459 -321233 -233469 -110269
17615 -110269 -46313 -44925 1194 48770 -7679 -233088 -308126 -181634 -25786 -137660 -142405
17604 -142405 -58920 10457 -19130 -101833 -149915 -143111 -255212 -345020 -255104 -208380 -62826
17593 -62826 -214525 -144983 24881 -28670 -26966 35021 79113 -54768 -143109 -145539 53257
17582 53257 28752 -84256 -146530 -159988 -69474 -48428 34013 -77795 -74273 22712 -143549
17571 -143549 -135587 32400 55971 -11014 163355 194268 71188 104316 96098 98150 96989 179642
17559 179642 97693 -51153 3984 52619 -29857 -127970 -86129 -211430 -88973 -46601 -75440
17548 -75440 -54105 -91037 -296699 -329979 -298537 -276393 -121682 -127652 -278683 -174927 -48677
17537 -48677 22188 75469 156045 187735 244938 150114 95375 -57585 -131267 2567 31963
17526 31963 -27624 -16431 -20939 -142805 -104410 -169830 -290090 -317425 -52422 33260 53513
17515 53513 278998 449850 379509 219360 227370 226896 74799 -148518 17949 -47117 -126902
17504 -126902 -133537 -45941 -21541 -94791 -71227 28649 -30977 29299 52273 61409 15054 -90452
17492 -90452 -113901 30327 125131 196912 -65382 -171780 -172074 -224831 -211240 -128507 -167419
17481 -167419 -259107 -191374 -61044 18623 96238 39863 22173 36466 -114965 -173148 -15880
17470 -15880 105061 111116 99892 75799 109877 181460 184474 164907 76471 -14190 107173 163454
17458 163454 125233 82985 107854 97594 109522 19690 -59035 15803 70900 211869 122085
17447 122085 -135668 -87896 96332 332176 616135 961377 1030726 839703 755841 628864
17437 628864 567577 585814 528889 435383 106734 -35719 -60827 -69662 -283518 -187799 48014
17426 48014 98751 121102 59706 32633 45669 114983 58473 209580 156578 73419 222432
17415 222432 69750 -180771 -240651 -215495 -286430 -256780 -134607 44520 225840 446830
17405 446830 453995 281912 223891 105163 107207 85701 13205 116032 210317 213744 232773
17394 232773 222402 152987 20688 -232971 -264560 -281108 -291788 -153413 3830 74218 124467
17383 124467 151809 -26257 -15867 -50512 -10812 43546 -60258 67737 117056 54235 -80804
17372 -80804 34155 33430 98532 -23629 -78727 -120309 -168954 -80266 -100733 -60066 -117949 -148979
17360 -148979 -74655 -42494 -16720 117030 63680 77060 37103 18080 56181 165970 169548
17349 169548 66517 -15543 -187307 -46043 -29822 -196688 -270914 -360298 -306847 -218128 -190267
17338 -190267 -152814 -273344 -369385 -364409 -263547 -97180 -109277 -115247 -34776 -92362 115446
17327 115446 291086 99922 32365 -72073 -52960 -85629 -138530 -87888 -90250 -141796 -218838
17316 -218838 -118579 115382 239668 146045 -27695 -59794 -167203 -229452 -163613 -303324
17306 -303324 -280577 -171827 -57710 -139601 -200092 -204689 -84767 -91452 -234691 -60051 -26344
17295 -26344 -288105 -284121 -209730 -152763 -185803 -140406 5087 -27263 128536 156344 213272
17284 213272 142383 42221 30743 15898 -42417 -137310 -156461 -140017 -146030 -49309 -58040 -82451
17272 -82451 7564 -38517 -180720 -139777 -168790 -295637 -261250 -132794 28559 -25493 48491
17261 48491 141017 60406 135331 206573 242976 150323 74352 -74221 -91094 -207510 -290524
17250 -290524 -121860 45345 61834 127244 90947 65763 -20489 70918 13163 -78223 -70729
17239 -70729 -94124 19167 37643 59525 80989 7125 -110676 -50833 42997 23236 -26834
17228 -26834 55356 22023 124658 225447 189548 8948 -148111 -307522 -232953 -71837
17218 -71837 -85873 -113941 -58938 -100398 -142577 7086 118064 63654 -102217 -108490 -151569
17207 -151569 -131068 -69001 -145834 -245101 -133906 517 226303 364453 309173 159847
17197 159847 79175 161792 164666 117047 122773 103111 146998 26282 -160805 -216285 -265476
17186 -265476 -219891 -43873 -57650 -34080 -24780 -5393 102627 122079 -91191 -159896 -130776
17175 -130776 125022 203691 -53363 -229891 -116027 -14808 -176677 -223314 -230437 -215095
17165 -215095 -345947 -318072 -269444 -366756 -230031 -191928 -62511 127576 163649 86517 -78837
17154 -78837 -161980 -71209 1220 -115615 -169310 -176150 -308743 -302230 -117122 56984 249943
17143 249943 103835 -153632 -162785 -55415 -19271 5220 158693 145704 100682 -84041 -166139
17132 -166139 -102326 -11882 30017 19489 -61718 -103268 -215068 -224706 -193877 -133027 -6522
17121 -6522 16092 -9354 -92223 -61707 103499 -29623 -136332 -177906 -192407 -127891 -148559
17110 -148559 -48336 99607 -28756 -98558 -164525 -141809 -30144 -45734 -94654 -237230
17100 -237230 -284251 -317010 -331172 -289159 -67138 41200 -154123 -345547 -379970 -328515 -217412
17089 -217412 -167325 73861 242052 342110 292830 321550 380086 314998 40779 -233723
17079 -233723 -304321 -231278 -73683 -59575 -117848 -137469 -278786 -243163 -166899 -195805 -153
17068 -153 -83165 -140973 -104729 -113223 -43992 -56805 -132849 -116274 51572 54908 -84456 -222074
17056 -222074 -256771 -260666 -215898 -204559 -140384 -107926 -136119 -60820 -102599 18697 15510 -76037
17044 -76037 -154182 -67941 -35464 -140356 -195133 -134174 -108492 -127464 -21456 14493 40533
17033 40533 11261 103938 205026 181852 38959 51433 -8916 84819 148975 89746 -44736
17022 -44736 -102825 -97134 -139749 -243384 -257722 -304391 -348531 -295096 -234328 -142587 28063
17011 28063 222747 202773 257716 397229 355759 308375 187325 40966 107392 209797 197390
17000 197390 178798 55572 165668 276271 182229 131323 171329 152618 30182 -18999 -152671
16989 -152671 -170598 -195482 -167179 -5403 135427 129494 -74671 -92349 -35665 -292248 -313720
16978 -313720 -84951 36249 -72266 -53311 110497 36114 -24822 81712 28179 -165931
16968 -165931 -119061 86419 277951 221533 162908 -18045 -123068 -83895 -10975 -151758
16958 -151758 -231352 -81232 2969 -75091 -100150 -141043 -115727 -5355 -91853 -71104 -26507
16947 -26507 53682 65736 14027 -89788 -92348 -95481 -96371 14349 9264 34815 -1427 46717
16935 46717 71639 -52088 -22633 -170846 -120783 -132455 -28016 109931 130070 71469 -62487
16924 -62487 37481 7841 -21978 -87857 -101938 -227575 -177389 -56082 -72095 -118121 -97419
16913 -97419 -147586 -63709 -54069 -81992 -206895 -234795 -170563 -133646 3648 -128119 -248484
16902 -248484 -158914 -311971 -365228 -513819 -530392 -320958 -306832 -266840 -239432 -237416 -163906
16891 -163906 12921 99302 133978 173513 206289 159801 181052 264663 166241 6002 -68545
16880 -68545 -148690 -166348 -148837 -58815 -44651 -68657 62512 48538 -95897 -128410 -153365
16869 -153365 -6325 78525 162170 110039 102682 17376 -70623 -18399 78400 50994 68129
16858 68129 130497 210976 37690 -254850 -338192 -212311 -99207 -68858 14939 152235 81482
16847 81482 116626 234741 238168 259728 120202 -11179 -35340 -86380 32479 164345 195447
16836 195447 94705 -156258 -365612 -160534 -22451 129105 339730 327616 106937 26791
16826 26791 202035 272091 40731 -163754 -226558 -134394 -15358 38636 199034 229209 112121
16815 112121 102961 234196 189939 111146 -11909 -130926 -93766 -77065 -172355 -210334 -236285
16804 -236285 -203812 -338236 -242628 -107326 -79497 -58298 8054 -12191 -207790 -256868 -78888
16793 -78888 -150859 -112907 -77781 -77626 -98756 -119380 -198019 -164488 -71796 -133629 -143130 -73430
16781 -73430 -52244 -6026 30523 66524 45624 -65166 -222347 -352370 -390007 -188020 -205374
16770 -205374 -114172 58930 -188116 -207965 -85151 -36331 -4674 -27795 -27928 -116202 -133553
16759 -133553 -93031 45286 14250 -48247 122020 101834 -72941 -60350 -98916 -114696 -62046
16748 -62046 51599 46888 -93065 -125631 -52688 -14798 -58471 70389 163780 99671 -7123
16737 -7123 14057 70154 266501 247190 315605 313175 -8498 -94620 -168699 -101602 381
16726 381 -129326 -111081 -120578 -136344 -92041 23114 61216 51513 129922 275756 278396 145350
16714 145350 107520 104372 250996 180715 -6344 -85697 -106729 -88946 -35310 -280101 -307870
16703 -307870 -150397 28456 155690 135581 -135073 -317327 -97123 -37084 -164724 -103029
16693 -103029 -35001 8015 -150292 -236645 -287411 -283937 -282481 -204579 -100878 -6259 97308
16682 97308 45176 105593 36538 -24359 -132983 -277707 -386730 -362635 -311232 -167672 -45277
16671 -45277 -132204 -101546 -86266 -193093 -210131 -224554 -264273 -222239 -213335 -201305 -160461 -90723
16659 -90723 -68236 -240964 -380590 -293298 -184210 -239561 -178090 -67913 -64497 35143 42580
16648 42580 44075 56388 284959 343841 213332 -6651 -176095 -208683 -191789 -295013 -259729
16637 -259729 -264461 -77130 51745 13073 -116447 -122608 59241 55343 -20526 -87157 -109978
16626 -109978 -102297 -52395 127832 226770 141124 1135 -17504 -39103 54586 129341 254838
16615 254838 259217 244541 113986 88336 92205 144049 105256 19354 -25648 3666 -103843
16604 -103843 -84460 -88442 -89601 69927 134486 109312 63527 193080 375838 314520 304465
16593 304465 237802 112826 89339 90745 -19892 101852 42604 28165 86116 154350 173740
16582 173740 68035 -19004 8082 112040 126424 20786 -40824 -108049 -150166 -142440 -35700
16571 -35700 -9651 38490 83218 -77665 -303945 -347694 -335562 -137821 -52592 96009 -80751
16560 -80751 -13495 -83307 7036 -22714 -59655 -115891 -120764 -199459 -109780 30745 -31515 7147
16548 7147 41068 -91928 -101748 -216323 -270144 -395134 -305541 -88043 -174368 -57020 73837
16537 73837 40937 -205921 -205190 -76577 11930 -15404 14964 -70176 -267419 -239582 -245510 -266964
16525 -266964 -279075 -461066 -340668 -165937 -236039 -161046 -95589 -105953 -22049 -105113 -74503
16514 -74503 149179 61694 -21013 -116919 -112017 -25171 60243 -57966 -130701 -12456 34342
16503 34342 -67899 51822 180174 150205 6797 -84284 -309915 -392590 -313370 -345541 -356543
16492 -356543 -283165 -88174 77880 -88180 -151745 -68164 -154001 -299207 -414333 -355011
16482 -355011 -190336 -130882 -9201 89238 155730 170241 53668 46405 -177768 -372898 -249626
16471 -249626 -82186 -35039 139266 274012 329189 197600 85963 -19429 -13656 -50484
16461 -50484 33652 96031 48501 -77430 -153517 -58032 154967 200381 110187 183288 198466
16450 198466 89198 156009 102894 -2534 24080 81313 120094 32665 -139737 -208519 -191024
16439 -191024 -34185 84647 522 76215 213916 220131 -47127 -99131 12082 112389
16429 112389 165278 193071 132223 96870 82024 253154 292934 150697 56868 103951 85088
16418 85088 241645 331698 162493 166493 48243 -42372 87776 157843 88903 41181 -32371
16407 -32371 -126982 -105751 -168134 -146612 -163920 -163590 -162432 -159400 -188996 -231249 -160154 -239141
16395 -239141 -215045 -192618 -143928 -85479 54301 114211 100451 80980 194383 126155 -59597
16384 -59597 -90981 -109696 -92339 -55657 55286 103898 4216 -42314 -70260 -200314 -185214
16373 -185214 -8933 149761 103211 103377 94301 153131 81873 48359 57847 -35232 -201646 -200378
16361 -200378 -90720 19810 10623 -6217 88465 242365 163881 87839 52370 31151 -128173
16350 -128173 -81278 -12414 -44870 89200 232623 163377 -20268 -43824 66452 -14873 -99392
16339 -99392 -261283 -85514 -8884 -92674 -175105 -118400 -89675 -13019 41310 217469 306905
16328 306905 317569 100962 -26553 -40098 -112580 -126975 -32124 -1567 126063 58640 -25643
16317 -25643 34997 180801 151979 -75871 -200790 -60931 -48866 -192414 -325560 -338296
16307 -338296 -179330 -37845 90192 170211 152970 -44744 6423 137019 167005 14468
16297 14468 -36465 -63847 -176998 -257640 -74233 65097 142979 110550 71062 34696 -79172
16286 -79172 -59639 -95231 -142442 -345830 -412501 -217564 -60912 49797 -42853 -143717 -153744
16275 -153744 -107235 -260645 -83448 23804 -71321 -90919 -156602 -33388 118291 146642
16265 146642 232816 117042 92916 14282 -4228 -110307 -241967 -196730 -5571 91258 133680
16254 133680 -137277 -140069 -56319 -34139 46411 2945 23755 -153129 -196727 -64658 -148366
16243 -148366 -313499 -186298 57525 134256 50057 -79059 -224562 -428666 -441902 -337351
16233 -337351 -274513 -50913 234042 185639 66560 32564 -3507 -92576 -131233 110088 98160
16222 98160 118704 -64304 -34443 74920 21990 7718 -129663 -55975 178428 189837 -41157
16211 -41157 33572 124488 110931 -17958 -75932 -82701 -67309 163918 218761 249549 89385
16200 89385 144588 281973 168057 119694 260206 300797 45981 -113589 -133522 -218266 -218761
16189 -218761 -158292 -22200 -88804 -125376 -217789 -185612 -179055 -67695 19467 -12483 -219939
16178 -219939 -304421 -216923 -69076 -86102 -282544 -459869 -429746 -240393 -166957 -251280 -327491
16167 -327491 -297822 -103223 37368 158662 97660 -135969 -132844 -97003 -18677 246047 386381
16156 386381 460366 471384 336003 133088 133831 157105 222884 192493 215131 95664 -138828
16145 -138828 -75819 117324 74251 72161 99186 -1187 -55679 -182273 -184861 -18713 135292
16134 135292 -56761 -94715 -1809 117878 122685 12621 -112753 -140794 135563 208928 149700
16123 149700 134425 5875 -21828 -138395 -66253 50194 84770 126487 62865 -67364 -13513
16112 -13513 31848 -18496 42048 8727 -105381 -216684 -111935 80988 82008 56506 -45767
16101 -45767 -83875 -57812 -134504 -141911 -78719 -86 24193 13324 -41487 52183 46968 -26035
16089 -26035 -127676 -189843 -42505 -9675 -38280 -18039 -71234 -248935 -348300 -452530 -296359
16078 -296359 -61733 85865 -2666 11641 -24239 -31445 149449 199688 314856 225489 83370
16067 83370 144227 -62988 -174041 -165256 -229218 -158035 -34969 31917 75828 107496 8357
16056 8357 -82688 -94393 -98190 -110131 -123154 -160173 -206959 -128820 -127533 -107588 70742 87268
16044 87268 73248 -20927 -118938 -176228 21438 229405 58175 62325 141244 52489 -109831
16033 -109831 5157 -14468 -207522 -80491 -142531 -153771 17621 -91179 -128350 -44844
16023 -44844 -66954 17259 25511 -100829 -196556 -192828 -279307 -216792 -61282 58036 124428
16012 124428 128079 220991 228560 54233 -182684 -151415 -115238 34064 84481 64209 12005
16001 12005 -83759 -84385 85016 140117 142372 117487 147776 -88030 -164761 -215787 -299485 -231834
15989 -231834 -26222 36303 73160 -48244 -2978 -93930 -265961 -237921 -18640 5336 -104446
15978 -104446 -182926 -176819 -116793 -42291 -71070 56666 155974 33298 43014 142236 131993
15967 131993 -33981 -190173 -294862 -283744 -157220 11834 57081 58400 213520 316250
15957 316250 167660 115805 104463 81683 44278 64231 101380 102990 -3061 -37037 103491
15946 103491 48536 236485 273215 194980 81770 120504 93140 112889 270835 303658 312529
15935 312529 188697 112842 88132 26941 -49171 -48464 -52383 -188967 -188095 -160471 -88566 -54897
15923 -54897 50195 144032 148365 95729 200690 71135 17593 94647 49747 -17175 14454
15912 14454 -19119 -113448 -116966 -145231 -180521 -200040 -291401 -373698 -250512 -128384 -12545
15901 -12545 -57215 -157128 -122129 -172564 -87092 -91291 -135045 -50147 -44039 -60870 -61854 36604
15889 36604 -18235 -137092 -220097 -366519 -212939 -60094 -43492 19013 123826 121494 62493
15878 62493 -112358 -75738 131047 254683 112913 -20807 -17811 -11628 35163 57778 10450
15867 10450 103191 -41679 -178725 -248909 -238868 -259012 -410875 -354004 -67153 107577 72368
15856 72368 112140 153503 28567 119066 122346 219 -30041 -87476 81063 174725 -55269
15845 -55269 -108474 -94547 -20922 -82569 -192524 -124208 -9919 56531 4989 46340 85225
15834 85225 115042 -79959 -146654 -357735 -313536 27773 311317 576815 556997 258264
15824 258264 73217 21857 28392 1390 -37615 -104283 -28466 -2620 -151994 -316161 -224900
15813 -224900 3802 2566 -6362 -120032 -82918 -258801 -372193 -318343 -295192 -206115 -99743
15802 -99743 38115 138169 78603 -6371 44452 176592 200759 161049 66592 16938 -62701
15791 -62701 -68122 -39420 -147259 -224911 -228876 -306004 -279455 -155257 -85313 -194036 -205360
15780 -205360 -112010 -80522 22783 111857 65610 7666 49096 -13440 89633 115827 3789
15769 3789 -42206 -55032 -25032 -49747 -151763 -250015 -127917 81931 133307 121781 43658
15758 43658 -61660 -140495 -56302 99960 226282 168771 143041 -20226 -175754 -217719 -184929
15747 -184929 7972 -12546 -175156 -178776 -147274 61694 238663 111897 53455 18614 -56840
15736 -56840 4196 -49354 -89413 21211 58343 -160329 -247171 -130415 -174364 -43206 111629
15725 111629 207370 174493 192493 58571 -144330 -323557 -238782 -60931 56017 73059
15715 73059 38235 114157 231075 41130 -98890 -10520 99347 135540 172947 101188 -83525
15704 -83525 31030 65802 1577 -62276 38277 -34693 -160205 -211438 -124488 135095 172631
15693 172631 3634 -217846 -204362 -25502 59346 72529 67233 -42282 -85743 -35984 105186
15682 105186 246100 144378 252135 242131 212135 132640 -37486 -38100 14985 -60493 -121998
15671 -121998 90331 -28194 -32371 -121854 -198431 -57184 15264 69534 -61050 -17443 -41811
15660 -41811 679 89961 91830 -15805 -27886 22261 -111267 -245115 -331553 -451804 -355508
15649 -355508 -152952 -189710 -266294 -133239 -14660 99844 112433 107024 -3830 58712 204180
15638 204180 394364 196689 113524 117213 67048 53582 49441 -91827 -81608 -48092 -158839
15627 -158839 -286079 -245661 -17668 235197 259707 245343 240154 143227 159981 249654 183129
15616 183129 9351 -32448 -130258 -249049 -263643 -149530 -205900 -374154 -316867 -114928
15606 -114928 39938 46836 42613 15889 29198 1994 -167029 -169297 -76923 -127286 -116290 -27480
15594 -27480 -66043 -188667 -277765 -48903 194497 111690 45959 100842 84958 -80217 -241292
15583 -241292 -37520 199372 183788 27059 -147577 -139789 37231 49613 75098 84756 -1456
15572 -1456 2111 109471 27696 -50998 -40031 20177 -67303 -69488 38646 141319 -49348
15561 -49348 -36150 80018 149665 249207 338949 366997 314109 201535 33511 -84925 -87697
15550 -87697 -79420 -176445 -84571 142972 116979 -66478 -327742 -426329 -341369 -161620 -48167
15539 -48167 40088 17548 44 58853 64492 2584 1152 -40791 -104295 -108408 -108834 -15650 103233
15526 103233 154961 127237 12442 -35378 31967 142510 242304 146373 171322 144311 5762
15515 5762 -66718 -65537 -119828 12184 77622 -10408 -19411 88733 59913 171718 275009
15504 275009 145637 262600 120653 -7661 -64104 -90442 -8120 205061 57678 -120961
15494 -120961 -137484 -99507 -33170 64572 -21227 -191725 -126005 130982 125982 6096 -63542
15483 -63542 -173923 -160336 -212530 -258846 -157137 27866 37173 -38062 35600 154352 143495
15472 143495 77404 15742 29292 -39211 -34779 -97214 -64638 -25836 10102 -92302 11444
15461 11444 113509 -2949 2429 158749 181048 -13884 -162526 -270145 -320931 -252559 -206184
15450 -206184 -177960 74336 117848 13796 144537 118776 186952 71198 103580 302339
15440 302339 254132 245785 296724 240583 122140 62524 24847 -38965 -99302 -18959 262185
15429 262185 279243 271621 114962 -39019 -318802 -335237 -265302 -133736 -16140 4043 -85478
15418 -85478 -197726 -194325 -157546 -209730 -162636 -184254 -72290 107739 175001 -50863 -212750
15407 -212750 -189401 -154521 -175153 -75752 -92680 -113992 -80598 -140181 -92002 -160112 18733
15396 18733 215053 232414 90213 192469 77837 -122712 -171158 -50815 -160618 -111840
15386 -111840 -155430 -190680 -66674 -94518 -224359 -88782 56526 98477 144809 134989 42211
15375 42211 -75898 -79716 -47403 82646 59382 -20213 -6693 -24454 -158123 -413705 -403214
15364 -403214 -276705 -373102 -176891 -84583 -162007 -319909 -252119 -34251 194822 139919
15354 139919 -78617 44103 49832 28309 127430 36443 17037 128588 187551 201327 152977
15343 152977 141573 98116 18685 -25207 10910 32701 -20200 80335 298806 445411 439453
15332 439453 477953 475952 381182 391872 250958 168012 157659 109712 36159 -63846 -175317
15321 -175317 -104949 -127232 -188589 121371 259912 200051 173573 137991 111717 57836 28358
15310 28358 -56961 -27551 86759 209442 46712 -76013 -1165 159303 194446 252045 189946
15299 189946 216934 204645 80930 9673 -112126 -33872 32140 245681 342757 176450 -82468
15288 -82468 -122064 -15212 67767 -59097 -87703 -65233 23971 166073 297759 402691 497420
15277 497420 347939 138707 -58217 -98501 95064 154790 233995 256194 231590 168535 130858
15266 130858 79302 57291 63485 250091 301351 264255 283935 179204 250254 245316 172394
15255 172394 -84652 -182628 -121355 -56859 -55027 -75134 -65575 -28255 145222 306250 267965
15244 267965 112965 -22017 54649 155934 172257 -5662 -54429 -83443 -14430 14544 99190
15233 99190 66079 -53500 -166427 -88393 -115413 83446 320793 349108 217000 42230
15223 42230 10054 -17586 -2491 209 251757 372005 243012 272159 87339 -46154 69550
15212 69550 275861 289904 232660 285016 197712 21888 -94369 4559 22346 29347 109755
15201 109755 67597 -48323 -240863 -232829 -82282 -119914 -33717 5547 -28592 65738 188919
15190 188919 252564 304300 299906 171498 144292 6 -73161 -90756 60995 90521 140670
15179 140670 101449 148889 137386 262398 426704 475462 353027 354509 272440 158142 231994
15168 231994 224342 120648 109725 174337 89683 2965 -171571 -97657 39045 187198 271979
15157 271979 137363 -92302 -207336 -176968 -115919 44804 7968 21839 -47392 -173894
15147 -173894 -252806 -203374 16781 77078 21854 26851 -69155 -24827 24452 -71061 -20284
15136 -20284 184589 72745 136490 133764 -17775 -22684 52557 231365 313741 198319 23700
15125 23700 67546 172368 109382 -55344 -67145 -70329 16666 151560 -31129 -140269 -222841
15114 -222841 -305424 -314773 -189302 -107245 -109608 -161220 -168261 -44946 -92913 -147749 -112003 -190988
15102 -190988 -82178 -50562 -116608 -88567 -7116 119113 245688 235544 233299 237562 169969
15091 169969 83091 24516 1628 63689 68269 -112524 -268699 -377939 -543990 -507096 -441210
15080 -441210 -261667 -75540 9439 -24909 -61226 -59193 -27623 -64498 -82006 -135225 -149388
15069 -149388 -177239 -130264 -55291 -24962 -66803 50265 20761 -8477 -16833 -15080 -55545 -182826
15057 -182826 -262873 -380706 -293203 -248887 -91635 -10214 21528 -30345 -40997 104673 129931
15046 129931 183552 110100 38834 70111 79890 213355 174088 34787 -18790 -40444 175199
15035 175199 193574 205667 109422 -137605 -235043 7705 87309 -4484 -88731 -62396 -29310
15024 -29310 -125028 28487 81930 26488 -59562 -9752 185305 176103 97389 79283 -136095
15013 -136095 -325032 -446595 -306114 -213754 -242147 -161102 -87156 -158601 -145925 -12763 108005
15002 108005 -46367 -47865 25333 152683 235230 206975 48898 -126456 -223729 -210613 -103334
14991 -103334 -78914 -14341 -34598 -186475 -240651 -94036 48907 -44163 -86515 39109 53779
14980 53779 -36315 -131533 -137744 -111998 -74960 -74323 -125498 -138772 -74845 -33815 -20627 122038
14968 122038 190607 26060 93235 239752 145918 56045 78354 219214 175506 115659 235241
14957 235241 293974 263738 93409 18070 -1037 -92460 -6332 -59484 -211577 -157145 -61081
14946 -61081 -63265 -89669 -22461 106890 115644 276765 179550 167050 15927 45248 273306
14935 273306 265028 183537 169024 2212 -96406 -200195 -153381 73065 67917 165006 271814
14924 271814 194793 78667 12365 30295 93439 134552 140518 87265 129098 223640 267017
14913 267017 98454 55767 117980 181296 134539 31544 -151369 -157240 45709 120441 14738
14902 14738 -156995 -187984 -158017 39509 1641 19964 169399 110110 229251 239182 262944
14891 262944 102571 -52351 -106508 -68287 82534 229493 385004 585080 645097 455870
14881 455870 372625 370146 286750 253177 145242 37205 -40426 -53215 -12808 -31083 -66325
14870 -66325 -12688 197296 249616 198086 118511 2526 54805 28316 78424 50254 -97418
14859 -97418 -183912 -4148 263759 232103 325130 329295 94539 -137251 -137660 -33623 54014
14848 54014 121820 197833 92332 12644 -57701 35339 19334 -66736 -52847 48725 -3468
14837 -3468 -34354 19371 84749 178840 109226 149633 286483 347695 345349 233495 234874 375375
14825 375375 109057 -123075 -161550 -23904 5592 -20296 17769 -40773 105237 168042 82142
14814 82142 -3424 -7107 -24472 73017 227290 335062 326549 244087 96157 35516 88365
14803 88365 -34969 -125864 -133537 -219107 -150487 -118980 -233947 -174427 -58157 -85981 6386
14792 6386 55167 152557 84625 -147125 -211915 -262346 -320489 -185437 -37222 285487 411826
14781 411826 310898 356757 345262 144827 42036 41211 235719 265143 230155 151108 199048
14770 199048 164876 131139 61192 91839 36640 81772 131199 207721 357210 489205 501415
14759 501415 368483 234471 137155 39932 101906 -63997 -119239 -191646 -198051 -127857 -142215
14748 -142215 -145221 -61096 4935 -26261 -9880 -60486 -68369 -4073 45836 -1580 21161 113985
14736 113985 184762 246964 316285 212121 63394 -34106 48404 222890 169464 -17919 43291
14725 43291 -71840 -280154 -207727 -26728 -29083 72558 72822 33325 147125 156382 149191 156973
14713 156973 81247 139496 220394 46438 -72408 -22298 -118422 -191773 -190086 -71749 -31485
14702 -31485 27881 24338 -179381 -379308 -307871 -110183 -83945 -119549 14779 -78166 -127372
14691 -127372 -181968 -30608 1548 121694 246987 160710 -42187 -9782 107152 64764
14681 64764 -74314 -158728 -145202 -27482 -28005 -155311 -266822 -188016 -87717 -142837 -146452
14670 -146452 -104555 -53185 -163409 -290385 -215065 -158423 -90426 34272 138320 18379
14660 18379 -190469 -43296 96643 129750 -13820 -15206 -107173 -120311 29704 163499 194984
14649 194984 147487 25421 -94541 -188044 -269761 -229842 -156152 -134177 -60801 82593 -111169
14638 -111169 -267083 -169093 -150537 46600 129659 17676 -117756 -76963 -142926 -124399 -111278
14627 -111278 -68662 55634 14556 -111269 -267421 -267284 -234906 -140271 -105446 -159343 7229
14616 7229 78147 152107 147619 212944 255842 304644 302269 263065 269884 116975 135619 219654
14604 219654 209957 115444 4671 999 -158498 -161093 -152450 -135644 -91691 -355541 -258240 -151583
14592 -151583 -118185 -29723 18139 -31106 -177104 -59085 109367 177584 125518 106375 167824
14581 167824 98957 14417 -68457 -94591 220280 179895 -69252 -136599 16922 24769 31197
14570 31197 113717 194958 285063 251759 114883 157824 175092 189848 155655 130622 53929
14559 53929 134257 218394 211450 106555 -81834 -219027 -218965 -147393 -247040 -224934 -191234 -140894
14547 -140894 -233503 -277311 -39521 68981 55861 55084 116649 194972 170119 58897 -29785
14536 -29785 41875 35038 -110848 -136823 -135545 -111296 -15577 34876 75662 258431 207224 120573
14524 120573 113218 61004 41470 77002 34973 -46756 -186235 -229487 -131174 -182163 -236458
14513 -236458 -206277 -119811 13343 -84349 -162057 -239737 -75381 9728 -204809 -176826 -159345
14502 -159345 -200614 -183463 -147493 -92488 -30555 -174222 -115248 -21873 -67468 -154708 -223886
14491 -223886 -223919 -65426 -91851 -127707 124413 258180 222294 308001 416554 272482 96836
14480 96836 85273 72539 23327 85492 130356 119659 179523 204607 147442 73521 136730 205162
14468 205162 145786 15635 94129 15818 11296 18268 108000 120745 147749 95148 5588 97779
14456 97779 275433 81983 -84939 -110145 141187 204367 149902 -18608 -39193 -61464 784
14445 784 10649 7178 9955 -86321 -80983 -87868 -39549 6199 -12838 -257568 -341662 -236638 -141685
14432 -141685 -31839 -159326 -108535 -9438 -83801 -40311 -169144 -317421 -399959 -230795
14422 -230795 -21050 4477 120670 154935 206744 296486 196610 123510 99919 110734 158535
14411 158535 209940 113791 -23291 -117036 -283694 -230992 -127295 61804 -117356 -119976 67798
14400 67798 -14645 -113047 -154377 -174291 -34299 -54671 2635 234719 241958 301242 287225
14389 287225 134763 -57203 68336 153878 18502 27599 -4590 55145 116108 -31072 -87603
14378 -87603 18922 43857 243219 227529 267018 279536 175768 245958 238642 215184 151912
14367 151912 258576 278129 193039 161480 64466 -58878 43700 -23639 -2502 70950 18594
14356 18594 -143064 -162978 -187468 -91638 4304 77854 -7325 -95790 -26180 140251 126702
14345 126702 -20123 -40133 -95197 -152844 -28132 238827 299810 94667 -54641 -1480
14335 -1480 25413 10075 5534 119081 240665 245362 219148 127739 277589 262106 -45619
14324 -45619 -63287 -57179 -7923 27656 -49498 -105913 129671 9589 -58807 -25687 2666
14313 2666 171804 158454 -37938 91742 190846 177003 156186 203236 139396 39839 -163322
14302 -163322 -136114 10803 3418 -22357 -63327 -93625 -94260 -104422 -64619 -75428 -8861 -69081
14290 -69081 -5762 65899 -33204 -182644 -114533 -71253 -296483 -296951 -18968 37131 74037
14279 74037 144430 13569 -115729 58352 113591 15979 132243 201337 52114 -38654 64948
14268 64948 172403 113545 75059 9401 -182478 -239431 -136921 -51684 -34098 -41570 -128772
14257 -128772 -285357 -133314 72633 25867 -52925 -109024 -6299 133578 159163 375099
14247 375099 429357 252743 225181 256744 133947 136213 266598 191092 47607 -88824 -9031
14236 -9031 114212 68786 95533 10267 -60933 -130606 -103095 -1539 -195278 -217768 -181529
14225 -181529 -113855 -32382 8675 -56631 -35036 -55913 30416 -1698 -101342 -191950 57840
14214 57840 112357 239766 336053 284876 210561 76155 86152 20356 -80986 -181728 -278391
14203 -278391 -68233 -54852 57273 67129 58417 80434 38541 -83687 -55266 134232 -79260
14192 -79260 -207486 -195995 -197917 -263413 -197680 -140749 -169220 -195073 -203888 -152404 -112695 -20687
14180 -20687 -88321 -94692 20851 9818 -98282 -20532 -26851 -81985 536 119105 30461
14169 30461 -41808 -186195 -139075 20089 111423 53626 -60079 -63869 117874 281659 321119
14158 321119 230105 7010 -74531 -139593 -65732 101435 173181 243165 262189 55988 -53989
14147 -53989 86624 -13672 74730 141526 -15853 -112167 -142332 -160565 -24679 123681 31080
14136 31080 -8739 41121 10630 -178332 -166198 -159720 -224826 -252612 -175870 -147740 -93678 -75832
14124 -75832 -25173 88314 77047 -24555 78574 96888 29572 -61774 -53131 -136756 -237411
14113 -237411 -308803 -237511 -158554 -144676 -103177 -117927 -44172 -11391 -66089 -18653 -30523
14102 -30523 16670 -49311 -121432 -220804 -272977 -213459 25833 62851 184909 154207 25864
14091 25864 -63323 -3073 117321 127516 324327 327964 365340 242814 74215 107419 21759
14080 21759 -28677 -55449 126555 49770 -87552 -243999 -247771 -25037 -103263 -48197 129365
14069 129365 160448 27366 -22955 -44307 -4221 -12695 120660 171592 327549 365212 347163
14058 347163 359455 163685 7356 40138 23382 62091 -11149 62061 169112 275217 195543
14047 195543 167892 165246 -60276 -120594 -31693 62361 25307 -83262 -86068 -153324 -65677
14036 -65677 114572 173775 55087 47124 112784 212935 312020 332584 346065 329400 217626
14025 217626 9011 -93485 -83324 -29895 -101892 -65757 -64414 -63855 18646 122569 141827
14014 141827 -4771 -80664 -70661 -5183 63299 60896 107547 175035 68225 125621 84794
14003 84794 -57140 -375 98258 -97898 -151679 73016 238008 312140 206556 167224 143885
13992 143885 161860 173785 102378 138623 -70138 -130157 26916 -91715 -142512 -28201 27216
13981 27216 -34948 24726 220028 147373 126736 61083 -138997 -169080 -105403 15752 93632
13970 93632 116517 -16474 -93400 -77608 -112347 -37245 -26567 -191069 -115713 124693 186873
13959 186873 185081 112925 158593 21973 -139745 -247338 -234948 -117358 44653 58676 -51450
13948 -51450 62718 82205 149906 135086 -32901 -217528 -228622 -166800 37539 20132 132929
13937 132929 64600 -192437 -290216 -266064 -41427 105225 244825 156020 103303 38639 33859
13926 33859 -7716 48532 139571 136316 -4920 -152319 -247440 -159134 -41010 20611 59151
13915 59151 102133 -32385 5873 -27886 -17257 -107784 -84743 6059 37586 -35514 -149736
13904 -149736 -128807 -63884 19824 -10017 185198 226376 174907 55444 -114624 -4713 92614
13893 92614 68253 43341 -64756 1229 261576 194752 141624 178556 73776 87747 191389
13882 191389 414094 383370 286186 108949 54056 151248 73803 -29329 -31278 9651 -99910
13871 -99910 -103088 115686 57664 -48460 -105390 -6063 18586 -109337 -76628 -49131 -24446
13860 -24446 48898 42592 30395 -1650 4645 -41430 -19508 103826 -5651 17376 64465 54592
13848 54592 74614 165938 184060 124512 175543 188983 142385 154151 99542 13175 -90287
13837 -90287 -247765 -286766 -241393 36980 -1728 -153886 -257987 -333198 -278995 -184069 -101969
13826 -101969 -10659 -35319 -92836 -72230 -121440 -173312 9302 -11906 -200672 -105950 -44670
13815 -44670 -70921 -79922 -25388 17569 -51129 -120226 -30530 78225 37225 -35387 -105413 -141918
13803 -141918 -105194 -110246 41509 208906 115317 15233 -231383 -350738 -274428 -181706 -150418
13792 -150418 -224366 -307663 -299675 -142182 60927 138736 260341 212509 25033 68846 205673
13781 205673 204161 115285 -81077 -92008 11170 78242 71017 -85571 -49925 -33921 -52689
13770 -52689 -67686 -94199 11173 178179 318262 217924 207682 199231 188121 256579 176377
13759 176377 124752 -4636 -47712 49079 188884 116040 304132 410662 316354 186735
13749 186735 179233 8002 -150967 -58016 61692 10433 -43427 -96444 -59458 2771 -90347
13738 -90347 -46113 44481 -358 -60881 29015 -42908 -44743 -70555 -123787 -53720 1445 6720
13726 6720 -16854 7032 139824 138021 75311 -38338 -34628 -16671 -115311 -124592 -109699 85825
13714 85825 213216 215561 186657 131994 109810 90200 73221 37990 289926 388404 122619
13703 122619 -23819 -12906 -119923 -181285 -176729 -116682 -17578 64259 -80081 -52901 21261
13692 21261 -107022 -261165 -132227 125015 173766 206468 -36509 -193838 -114854 82128
13682 82128 258002 232750 244571 86320 -119092 -85077 105209 228302 109840 34219
13672 34219 166013 16279 -2740 17129 -50327 76881 155226 221114 223838 129328 17068
13661 17068 33913 26466 52044 126679 59137 -72550 -221549 -161728 141259 142565 53839
13650 53839 88737 143457 155786 131951 -144678 -179678 80146 366058 439741 161537 -105653
13639 -105653 -44211 23543 -50861 -195865 -246912 -155803 57417 202636 226334 171459 92027
13628 92027 138180 131027 124911 -40184 104049 -4401 -88356 -82004 72162 140935 316084
13617 316084 425097 390516 177036 201848 242709 146030 41751 -19675 67534 215109 305957
13606 305957 255890 234009 197980 93159 55573 -16662 17987 3060 64166 -14609 -192563
13595 -192563 -73391 -6731 -136836 -282956 -263704 -220747 -217860 -111363 60829 71857 -70420
13584 -70420 -50858 -57531 -203537 -205334 -75278 -237660 -224624 -142171 -116648 -70388 30297
13573 30297 138160 103714 -88925 -72077 35675 -160821 -25995 1401 -51150 -2449 -79353
13562 -79353 -33943 -89956 -45815 -37729 -56236 -53012 2426 -33981 -101364 -176516 -238542 -141871
13550 -141871 -125861 -198884 -230384 -123173 -27983 37351 -1049 -66955 -91715 -54883 109937
13539 109937 188966 149817 193250 204237 194246 144938 161266 142652 -58352 -215452 -118144
13528 -118144 -929 63743 -10150 13217 160042 114902 11205 34792 -18443 44324 237291
13517 237291 482490 595285 454472 219633 67589 62894 -22898 51001 17095 71740 118810
13506 118810 212497 147068 -83045 -165764 -199728 -37056 245404 271418 81767 17216 -91809
13495 -91809 -103078 -28321 108719 278546 200109 11624 47826 246480 246665 96580 1713
13484 1713 -48242 -146299 -155071 -244658 -230739 -5624 -38233 -17723 23932 -12595 -106025 -134943
13472 -134943 -63451 -16646 72204 -86230 2417 70258 3681 -123014 -279024 -298834 -248318
13461 -248318 -60573 37326 15328 -144513 -123516 -208750 -128267 -105417 -116471 -86331 -16776
13450 -16776 66790 85602 49050 133502 171893 148690 165628 116062 27663 -30577 101411
13439 101411 205525 128261 131526 8535 -204951 -217399 -100775 -157166 -95637 54623 -106253
13428 -106253 -128283 -158676 -117798 49568 1831 -96984 48817 158955 -13608 -120063
13418 -120063 -39443 137835 120385 75399 23985 -51187 58422 46135 -18067 -57173 -120853
13407 -120853 -122540 33182 286745 313778 395488 308407 211230 155455 185331 115088 85376
13396 85376 -11872 -35236 -9430 -34394 -15187 101216 154576 311108 237117 53848 167846
13385 167846 211368 173829 175905 101204 171191 207311 166011 181887 100502 48155 151800
13374 151800 172523 74881 17059 93202 6629 -109878 -200689 -208103 14250 41567 -60115
13363 -60115 -112608 -177268 -169753 -195156 -137908 46578 51829 61219 165552 191559 153580 -1435
13351 -1435 -85519 22802 273869 210579 99050 85778 -55357 -215393 -99246 9066
13341 9066 52525 -28136 38938 -97444 -95229 -34021 34931 -92861 -40739 76406 121736
13330 121736 -14638 -142303 -278219 -397619 -312097 -247622 -256706 -173412 -79451 -30356 -33529
13319 -33529 62866 102029 74998 170433 63841 -24406 -26562 -1828 61046 28042 -135847
13308 -135847 -135674 -60246 -133304 -138129 -119056 -38494 -102773 -69942 -33132 -113620 -98682 75986
13296 75986 141663 59446 187286 210461 167515 247481 22419 -116380 -4939 19109 2553
13285 2553 26665 26759 -141023 -121267 -3355 87276 236446 312353 344143 212956 -60688
13274 -60688 -25852 149444 84134 -64841 -71265 -40035 -76992 -243691 -327617 -321374 -229114
13263 -229114 -107064 -987 44632 -55651 -92231 -32180 -34103 -17619 6688 127224 123053
13252 123053 242896 246377 225095 148932 122317 157108 272165 248301 275406 145182 112350
13241 112350 96477 73632 169621 260331 264962 177943 25024 -168471 -275515 -146350 -148164
13230 -148164 -273107 -188978 -106411 23046 74027 -59773 -17162 -33161 -134429 -194570 -107430
13219 -107430 112864 156908 140899 -18027 -43285 -91626 -158049 -178186 -42286 123145 67765
13208 67765 -41914 -3678 107025 177155 99768 -99911 -210116 -185625 -162601 -202779 -96620
13197 -96620 -1037 201084 96512 -117669 -204925 -272862 -160026 -23474 120448 228762
13187 228762 295772 359649 200433 147359 196135 25834 86275 27059 -117 -56717 52809
13176 52809 118602 47827 29183 3251 -116219 -68690 -26513 -54578 16314 154657 94324
13165 94324 -27255 -9218 151168 175946 -63876 -119917 -134802 -225982 -255104 -335143 -88604
13154 -88604 98619 59873 -121190 -44266 2455 -160469 -217598 -81780 7160 20565 4794
13143 4794 107374 203410 188441 78134 -6442 55171 117364 -98131 -156860 -50703 129715
13132 129715 149754 173360 1982 -70229 -290953 -260755 26284 -8807 -74549 8972 91298
13121 91298 -15320 -72274 -32879 -198714 -314027 -208244 -119998 -99475 -207890 -251756 -158689
13110 -158689 -223893 -273107 -175739 -171031 -150273 -88616 -37705 40732 12879 -40914 -83166 -47416
13098 -47416 10988 17626 -49282 -95804 -43168 -46376 51237 71052 154981 107318 -142963 -133520
13086 -133520 -30606 21764 118995 146205 65721 -42685 100243 135575 54430 -73473 -167022
13075 -167022 -80600 107613 241866 336196 288736 218027 193520 214725 29704 -67308 -114883
13064 -114883 -180515 -207601 -96582 -120978 -130963 13095 186115 54772 -18232 -148049 -189509
13053 -189509 -93060 -14022 -23498 -37266 -203993 -244136 29398 88731 86195 85437 -10955 65799
13041 65799 -194338 -384270 -99872 18652 -53799 74745 57916 37803 82090 127067 86889
13030 86889 120467 -69664 -27978 25497 -189175 -165147 -112884 -62780 -53201 -38811 44954
13019 44954 2955 122405 133207 20288 -104481 52143 187196 115562 80757 -105126
13009 -105126 -183742 -74655 -69145 -212074 -259496 -170005 -26858 22533 -16640 -47018 -105304
12998 -105304 -238641 -257650 -106965 38019 236502 367880 265216 177284 -52313 67183
12988 67183 237988 182450 263548 -3211 -46166 56757 144887 265347 234330 180047 -1367
12977 -1367 -186127 -166019 -148598 -33125 35553 -17954 -71816 -110235 -100389 -131816 -111116 -110144
12965 -110144 -49596 6019 52287 25257 -108596 -273650 -317008 -221229 -47540 98755 9861
12954 9861 -163430 -79264 77541 193440 98889 -8083 -98675 -115117 -66388 -77810 68396
12943 68396 155138 132433 19410 -191335 -170375 -97978 -26672 38084 46199 70185 246691
12932 246691 167361 -12854 -75521 25482 -11939 131117 -44191 -36938 92102 110982 78474
12921 78474 179327 143960 99713 110516 212750 76785 -130482 -356645 -341876 -244030 -50218
12910 -50218 87028 133315 112941 116463 41935 110807 151480 99796 3514 13299 -168114 -197173
12898 -197173 -121609 -192177 -75962 59040 125951 69317 161637 151302 142837 172037 407011
12887 407011 311834 139547 96798 155131 200977 196546 137838 95998 -83691 -211311 -129149
12876 -129149 -161427 -149646 -86322 -44664 -56625 -77261 120410 167314 234068 307797 145423
12865 145423 23345 -14369 114008 15554 -73190 36720 122594 -33694 -90655 -104869 -12310
12854 -12310 77254 -25407 63426 19579 -77219 -76688 -127089 -211013 -192498 -198814 -153857 -98631
12842 -98631 -154876 -192696 -102091 -133655 -34102 260422 287753 142998 74073 63798 -72648
12831 -72648 -162732 -121223 -104058 -79729 77890 18563 61403 196323 45893 -78506 -119015
12820 -119015 77367 279685 340702 152298 42395 -20259 -148677 -231673 -62044 44867
12810 44867 -66729 -23006 -73616 -12332 19549 -62784 -148413 -151510 -96966 120893 214640
12799 214640 235974 314724 388046 279447 106826 36505 113377 18612 -253185 -318244 -134895
12788 -134895 -116609 -122873 -59365 -19269 146316 367492 189658 36330 -26475 -107284 -166584
12777 -166584 -148423 -67804 74203 66043 46523 103855 154084 80535 -59211 -112313 -53469
12766 -53469 112117 -15235 -109486 -62241 -130840 -280579 -201388 -45596 -6198 -103118 -117558
12755 -117558 -107246 -46682 -355 129784 134897 219192 262042 109351 -45832 -56328 -1236
12744 -1236 -65252 -43076 70125 73365 152897 176739 79887 -164588 -144345 -152198 -194499 -296605
12732 -296605 -216553 -134280 -31249 226654 185844 203587 185089 153176 90245 -52446 -120343
12721 -120343 -28771 -1650 40267 6158 -91288 6711 54267 199755 72053 55505 -90324
12710 -90324 -72757 89502 97403 142024 205840 -9917 -83285 8445 188297 122373 2749
12699 2749 182705 238102 264700 78626 -174587 -215344 -167197 -179371 -92148 -11265 47260
12688 47260 132569 164103 192307 147691 144595 22859 -132470 -31692 103991 241087 230725
12677 230725 173134 201193 -3067 -68404 -37369 -160295 -89169 -117196 -112986 -141128 -26560
12666 -26560 63873 -117792 -157248 -95148 -92062 -186748 -174423 -160119 -200845 -191971 -141970 -117147
12654 -117147 -76806 -73189 -93709 30008 50216 25834 -143111 -171476 -45065 -128053 -295034
12643 -295034 -270450 -269957 -207489 -210461 -163468 -24611 40220 37347 68557 75275 -76278 -14367
12631 -14367 -71267 -95340 2915 -43377 -5443 -52312 -69277 -26370 -66055 -76397 -127995 -131061
12619 -131061 -178830 -137520 -134654 -96943 -132763 -197450 -2138 102158 -3221 -130465 -23090
12608 -23090 39563 6634 59442 -30910 -100217 -9867 251404 196010 -25026 21726 19739
12597 19739 76798 109843 291802 248437 83634 88062 60329 163495 358944 386603 254759
12586 254759 127092 17015 -51857 -97823 -175320 -102623 35355 97246 70651 132095 125265
12575 125265 175483 192868 199776 98392 -15716 -76325 28805 26838 -54199 -169724 -188603
12564 -188603 -99718 -31134 -71945 -150813 -146523 -283245 -321608 -167117 101234 314228 380296
12553 380296 158547 9200 63759 118109 33067 -131200 -135823 -13943 96638 130890 90626
12542 90626 148761 -5219 60803 81074 90975 67986 39669 1815 -5970 51347 -72356 -37129
12530 -37129 -29380 -24830 22470 113562 111889 246818 189919 -48585 -281036 -185642 -35609
12519 -35609 -59638 -25317 -144360 -194116 -148752 49761 188415 187851 133062 103448 56008
12508 56008 65091 62780 33616 55476 -82455 -117884 -70858 105275 38611 -33121 -41842 51482
12496 51482 157494 102460 53306 150761 96268 -41713 18917 21312 -32241 -71455 -5143
12485 -5143 35223 38085 -168012 -311593 -223207 -248936 -65567 158644 214326 119312 191159
12474 191159 66422 5651 -35187 -117413 -106703 -102650 -108749 57506 66514 -70403 -90256
12463 -90256 -11568 25132 104012 13551 90904 168353 300509 222128 208281 218629 112812
12452 112812 74165 137340 127467 200905 194230 368290 241055 24052 57625 69968 53395
12441 53395 -3736 74631 249662 247821 216729 162801 59509 -74522 -66613 121216 127427
12430 127427 132623 -9364 -177037 -155343 -132595 -132532 -174863 -111283 -36581 74171 9855 -179613
12418 -179613 -354592 -330378 -224830 -205755 -160333 -68146 -126191 -99480 82702 166365 47992
12407 47992 40360 126734 254305 230792 -32860 -79655 138449 71139 99796 120402 61026
12396 61026 -22235 -17431 -37772 -6873 -61400 -183523 -243858 -194934 -210872 -267219 -332335 -184877
12384 -184877 -190866 -232940 -91183 112029 63382 -3906 21630 118280 204939 160878 -27203
12373 -27203 -40438 117904 199324 131378 181497 52341 -192109 -128033 -90736 -101782 -14957
12362 -14957 -73766 -126687 -31085 151622 203490 67963 -98648 -270773 -335586 -368297 -232207
12351 -232207 -159498 -197226 -289430 -121593 69479 53907 -102002 -32256 -169185 -241328 -193757
12340 -193757 -146954 -148045 -40482 112494 68641 -23745 3995 4458 32280 207905 200991 39275
12328 39275 -86555 -145967 -190985 -96343 36834 -176631 -338106 -201241 21882 147163
12318 147163 35823 -84885 -71914 57599 14264 250950 445524 225295 38902 3358
12308 3358 11959 18855 43567 30032 66431 198650 96055 -117930 4836 54542 -59606
12297 -59606 -54737 -65439 -42791 -130799 -166324 -105882 2390 -58303 -62618 -49754 -82984 -119867
12285 -119867 56998 220819 185405 72732 -116426 -129474 -177522 -191276 -248226 -114452
12275 -114452 -64934 -80061 84217 72765 33 42856 -29908 -49132 -120828 24496 189363
12264 189363 205088 91713 97646 149994 -13521 -38505 40231 -14996 -153987 -186438 -112757
12253 -112757 -30298 -247748 -215755 -265954 -133752 -85647 -174012 -196256 -160034 -186176 -180878
12242 -180878 -242564 -94576 125785 201125 281413 463901 424923 239218 179268 174021 145091
12231 145091 141259 -54304 -74916 -96493 -299034 -250089 -385461 -421143 -301900 -239179 -217078
12220 -217078 -73924 210971 197074 60684 87518 255931 445194 545784 475537 443689
12210 443689 420224 302388 113967 -47121 -89522 -66411 -16080 -162738 -196742 -225538 -157278
12199 -157278 -145365 -98504 -58197 -56976 -38724 33773 33214 37368 -5297 30354 20962 70862
12187 70862 78800 59451 94047 -1204 -127643 -48078 113372 21969 -166245 -178572 -186758
12176 -186758 43839 82720 269736 136356 -45129 -167336 -207803 15485 81510 101391
12166 101391 -39204 24769 -41593 -142377 -43535 41914 167539 247344 233119 81992 -9616
12155 -9616 89009 266048 186232 80322 36487 -73678 -257699 -364839 -132074 28601
12145 28601 83303 35675 84017 -6961 -58803 -52620 -170654 -276055 -280900 -118798 98782
12134 98782 184279 114922 148264 62812 269309 184660 90584 253290 177448 19326 19117
12123 19117 72500 141091 196158 217527 268105 255524 209619 236885 278418 117998 62355
12112 62355 75754 164394 228239 248507 272763 113622 -49050 14606 108451 -35570 -2974
12101 -2974 -83734 -288572 -373795 -434666 -238337 -94521 -143293 -208823 -254586 -33325 87896
12090 87896 -31790 -148909 -151519 -141880 50205 183397 95340 25530 -41121 -82293 -220151
12079 -220151 -203946 -180863 -93505 24251 220885 230231 169420 77323 145895 156750 245276
12068 245276 137905 242344 229285 106377 -23657 74 53281 43507 -1385 -130753 -129436
12057 -129436 -95295 -74554 7370 -51343 -94288 -94433 -94322 -85714 -59723 49619 182302 -59743
12045 -59743 -264582 -229806 -189748 -155114 -253706 -206781 -44018 62056 87673 -24215 -220386
12034 -220386 -166847 -140122 -96373 -67318 -76977 -190100 -172138 -212545 -246539 -212128 -60909
12023 -60909 180413 68758 -170246 -273947 -257553 -94603 -52101 -5284 79809 133631 145333
12012 145333 39325 -42876 52005 117159 175682 98484 8771 -65578 -135977 -149621 -103338
12001 -103338 33170 81632 -79134 -108418 93761 114060 169641 327692 262866 258252 191820
11990 191820 135141 -35420 78019 117447 50242 -6187 40633 109826 17853 36083 -26405
11979 -26405 -60448 62834 14557 13077 -87733 -168211 -177488 -217829 -227186 -107174 -63578 20866
11967 20866 110047 172417 283152 299191 399993 400608 245718 205648 68529 18468 82713
11956 82713 -99235 -293724 -330300 -277530 -233655 -235203 -192111 -359367 -317254 -271971 -353819
11945 -353819 -288413 -51542 122007 -998 -306301 -290547 -175329 -156557 -251088 -210309
11935 -210309 -70741 21710 -29629 -149727 -131484 -225069 -200974 -18068 137245 294966
11925 294966 228442 127445 114225 236429 241077 -110745 -326540 -222561 -234202 -56269
11915 -56269 143924 210595 112879 -137093 -133493 -83052 -31244 75149 26403 -12805 -116073
11904 -116073 -124453 45273 137349 -34364 11400 17524 19301 182785 208689 139382 20328
11893 20328 -1295 91550 205081 400372 307381 65793 68282 158003 269484 122194 13101
11882 13101 84764 132754 104878 13674 -48745 27393 2602 26848 47504 -74194 -171406
11871 -171406 -14830 42684 -32098 -100542 -228534 -449867 -369433 -161392 2438 106552
11861 106552 340455 315007 146726 229051 81812 144309 71211 5571 34766 -21472 -135242
11850 -135242 -117853 -28940 -31408 -98247 -175685 -207774 -223875 -144006 -72121 -136725 -262065
11839 -262065 -230078 -197915 -191816 -152102 -154405 -232423 -159433 34038 5912 12959 -130923 -237937
11827 -237937 -127165 -28675 83141 10690 -26878 -221991 -260700 -130284 -41299 -4272 28875
11816 28875 92318 149687 161685 112479 137507 134107 153423 115594 -67197 -183684 -56414
11805 -56414 -3136 8819 68787 76084 -70399 -95961 -121813 -111014 -115285 54786 -74999
11794 -74999 61073 128325 186457 226914 295214 244324 364163 255630 174686 83122 144170
11783 144170 277459 291534 294128 245173 159827 58279 22654 -86673 -64673 88153 31670
11772 31670 -139411 -217317 -93400 148964 283776 -5367 -20787 -23886 173192 317916
11762 317916 253389 212311 217443 180601 74793 186106 133265 139121 197601 165752 97077
11751 97077 -82730 -117620 -125894 -202695 -171192 -100321 -280726 -143597 -104828 44752 -26471
11740 -26471 -121766 -62963 100035 55786 133964 98614 62881 74123 87357 65641 -32832
11729 -32832 108615 209566 238234 270202 163966 8439 -110067 -113819 -3133 181412
11719 181412 179425 21848 -39068 -79426 18628 161758 199864 165564 151163 104973 109647
11708 109647 137 -76174 -23340 24777 49769 12130 -21769 -47777 -110936 43940 36639
11697 36639 -32789 11405 251100 300099 233545 198354 228927 81699 31009 51945 79924
11686 79924 23819 198568 239627 121200 98932 20024 30989 110428 113634 6742 -35020
11675 -35020 5611 100421 67208 -22866 36222 176769 248827 171399 97402 65369 -31071
11664 -31071 49026 25759 78063 152781 206317 185118 88561 19894 -22073 63080 7732 -84428
11652 -84428 5394 -19751 23568 207194 191510 72518 -81031 -194234 -174702 -33818 217725
11641 217725 351445 318061 144997 24126 12026 98324 84152 21437 -132982 -200376 -42228
11630 -42228 -73405 -142880 -124631 -25551 44918 20946 -36639 -42592 89095 203392 292537
11619 292537 164159 4592 134910 77482 -47502 -49298 -21957 1473 18532 95051 -33843
11608 -33843 -35766 47953 51016 36621 -42691 -338824 -534142 -515415 -362416 -263128 -171884
11597 -171884 -89236 -65004 73524 107819 19129 30257 -18920 -111788 -160545 -238635 -295631
11586 -295631 -184518 -58783 -101789 -16595 118856 104862 153863 -64560 -96149 75615
11576 75615 191003 111455 1477 157299 230761 111407 227056 172601 58418 61960 28412
11565 28412 -103829 -154892 -152774 -183279 -30975 37844 -41829 173262 123059 10634 32557
11554 32557 257700 386239 259028 39886 -62851 -113127 -118585 -259572 -143961 -79157
11544 -79157 -220937 -97790 1876 26067 120889 114338 -13510 -59327 66386 146456 226409
11533 226409 180329 -32994 -91695 -71051 -132095 -228830 -127723 -44486 30105 104886 27553
11522 27553 -71015 8632 31299 74582 198967 -2125 -220592 -36615 104958 6957 14262
11511 14262 -2578 35989 -42724 -167462 -149431 -31615 96109 128940 162668 215586 130502
11500 130502 -39655 -25133 -47799 -91845 -233727 -221335 -176962 -63916 -67607 -194990 -234182
11489 -234182 -45341 -8575 -40190 -76221 -152022 -24991 -22872 -129080 -94477 110421 44280
11478 44280 -32746 -75362 -115937 -38859 175832 146592 136316 87108 -110104 -238246 -298600
11467 -298600 -163539 -60836 51524 37089 -92642 -9493 134803 139747 102285 113629 7664
11456 7664 2256 -41092 -122301 -223981 -64319 213809 239894 83021 -58918 -191756 -289487
11445 -289487 -177039 65242 55162 51763 47687 -58790 -18240 54727 156674 160527 120287
11434 120287 -44328 -36855 -3691 -47347 -13605 -63546 -10355 198661 284126 203525 81927
11423 81927 31174 5109 103260 221014 161942 102040 194817 209654 92901 -47015 -33746
11412 -33746 36576 24756 -12268 21186 27191 -68258 -85691 -82033 -157425 -166778 -207968 -226055
11400 -226055 -267990 -201150 -246683 -215832 -139658 -127098 -112472 -93421 -173813 11181 148382
11389 148382 93639 65853 112422 -20840 -23954 76264 91424 155725 178578 76902 -70936
11378 -70936 -209828 -137971 -80263 -128287 -83654 -120484 -60544 12316 -57815 -152201 -39406
11367 -39406 -3179 -105263 -217963 95519 274496 120636 42302 163880 72229 3368
11357 3368 26513 137391 186213 75583 53519 56070 -36857 -82169 -91000 -73098 -11405 8411
11345 8411 -27352 -60024 1260 2846 -31320 -103520 -229061 -186636 -253208 -135655 -830
11334 -830 21833 -78863 -89585 -18542 -43740 42813 56528 -24261 75972 99698 292479
11323 292479 365935 289733 44657 -72136 -32471 -35894 -12167 46672 157819 414847 376526
11312 376526 393667 278115 258415 170080 85141 -84271 -91911 -65809 19490 28858 91801
11301 91801 28021 -100804 -138544 -148507 -70878 29652 -191928 -106799 -28672 121927 125600
11290 125600 17718 -100078 -57055 -104687 -196830 -185263 30137 -41530 -206849 -154878 -61404
11279 -61404 54778 149919 231649 165141 95261 -41703 15440 56560 -62707 -203323 -128794
11268 -128794 24205 100923 106243 -82631 -189349 -49802 27309 -10665 -49167 -23590 83081
11257 83081 163495 68212 -55811 -1855 -25115 -103384 -25160 82806 171237 45418 -154922
11246 -154922 -269794 -158030 -87527 -143097 -69907 -56004 76902 144400 104813 -101135 -169719
11235 -169719 -118204 35927 21297 51546 30827 -126832 -125633 8900 191562 218992 115251
11224 115251 9080 17662 180072 244970 294328 235241 81069 18985 96080 122367 111005
11213 111005 138531 114506 -25667 -85776 -10806 -23505 -204133 -255621 -157893 -55838 127569
11202 127569 117020 132456 12962 -3512 -31260 -103022 -20259 -130243 -208135 -83758 32276
11191 32276 -87873 -283491 -47570 -4381 -79766 -28086 177997 94688 -35166 -36106 -36685
11180 -36685 -212597 -187786 -140888 -84153 -69867 -97409 -124744 72391 181253 169154 148024
11169 148024 64860 71188 7536 -81299 -106879 -36377 -154615 -288012 -176280 -3131 3647
11158 3647 88221 132398 208630 57070 -5524 -57526 -36261 -27627 33993 68871 67361 -23382
11146 -23382 -155319 -85091 22276 101552 261632 206284 209184 109976 -10909 -91315 -170113
11135 -170113 -253174 -316028 -376782 -419982 -240989 -188979 -293628 -158727 -42352 10960 -79032
11124 -79032 -155783 -311239 -265956 17225 73559 28025 -12033 -175666 -228739 -252564 -180509
11113 -180509 -104239 -60494 4514 82733 180375 37282 -69005 -54192 -52469 -120012 -253075
11102 -253075 -286786 -154579 -87309 45806 35139 73929 68032 65574 160656 141826 -58834
11091 -58834 -100714 -18000 -29813 -24448 -42916 -192009 -173537 -203152 -243853 -225120 -199957 -216137
11079 -216137 -243872 -215442 -121957 -126741 -14364 148301 -61358 -122916 -131541 -132439 -267498
11068 -267498 -361396 -363742 -215280 -114730 10998 99753 10050 3868 -66475 -100980 -32699
11057 -32699 121813 305517 218539 309448 312586 184895 139999 104145 68021 133218 139312
11046 139312 188003 145079 126008 23609 -86443 -179271 122155 305689 304387 299306 172505
11035 172505 124716 138194 166112 270790 286030 18136 -113126 -163861 -236663 -199745 -170939
11024 -170939 -164757 -342491 -303020 -81245 -169262 -187323 -162023 -147264 -156649 -104303 -59727
11013 -59727 -62299 -46113 -62512 20247 77008 45674 -69503 -49610 67203 326832 159438
11002 159438 -57536 161000 108759 82767 53705 100998 26615 17121 63703 -113557 -74574
10991 -74574 58679 249937 129771 82896 -24575 56988 20316 -182316 -236017 -192918 -119785
10980 -119785 -185512 -150045 -108222 97643 115002 99893 -76133 46262 138457 -10542 -3585
10969 -3585 -117029 -144391 -111951 8808 -47949 -73722 -121437 -135360 36501 205275 222086
10958 222086 195037 179366 214285 287623 302000 255180 27304 5983 95905 166598 108362
10947 108362 -32705 -47717 3251 -16537 -114291 -172539 -41292 -41899 -183257 60478 23823
10936 23823 -88356 -98827 46447 32956 54702 -47466 -231510 -87473 8332 126306
10926 126306 136330 192109 9678 -83947 -129046 -269738 -303675 -260297 -189641 -239886 -124045
10915 -124045 118408 181629 201409 116985 12428 -169300 -106057 -111140 -80671 -119255 -49961
10904 -49961 -120160 -157345 -74854 29557 61724 191691 217585 54258 69496 216620 252561
10893 252561 118116 -21623 -191068 -287832 -162819 9943 145852 136285 14270 33164
10883 33164 37625 11648 -43728 -46003 36106 223414 118567 70183 -20138 -57785 -17641 -43747
10871 -43747 -154949 -181608 -4130 283117 236108 152094 -82235 -175527 -46860 1715 151999
10860 151999 173659 136214 145973 -42477 -198024 -225418 -72850 -62299 -18761 75881 52045
10849 52045 84682 173527 -28495 -103994 -128764 -94954 -81463 68069 11242 57543 117293
10838 117293 74946 181835 175508 54654 -84304 27435 133001 194958 117384 150771 220725
10827 220725 50769 -115929 31637 137690 -22488 -88608 -114045 -159316 -198145 -119699
10817 -119699 -119050 -153169 -6048 97646 223346 89237 8836 36928 15506 24193 -18709
10806 -18709 9795 14552 -16927 -69082 -189423 -280199 -193636 -5019 -5916 106488 120527 -29972
10794 -29972 90382 38214 -38658 -188051 -266190 -162754 -179949 -197644 -29946 -53604 -100317
10783 -100317 -83832 -55966 169145 305188 372263 377035 315440 134517 -8224 -52666 -126354
10772 -126354 56749 119322 -32294 -48571 -40541 37799 -103777 -231569 -226179 -206163 -104006
10761 -104006 69964 -122641 -202514 -12157 41336 -47663 -192096 -139122 -83097 5353 -76467
10750 -76467 -105504 -87108 12393 90482 105059 -25058 -38617 163903 158163 67288 29306
10739 29306 5322 97191 51680 -44425 -122904 -170990 -101438 -129990 -118386 -135212 -197580 -117068
10727 -117068 -88627 -11367 150504 222342 165189 53905 -116341 -233753 -227560 -174252 -28932
10716 -28932 92854 159641 86574 67476 132761 164337 215189 428991 603489 640543 461350
10705 461350 257812 135582 77707 271364 238405 169670 128282 76345 173729 104160 -162034
10694 -162034 -334813 -304614 -247226 -193553 32366 -37618 -165081 -225032 -315842 -309939 -161736
10683 -161736 -109118 -153665 -273918 -268145 -254430 -210777 -302282 -380415 -226757 239 -10816
10672 -10816 29986 -56530 -98683 -97252 -49405 115652 214100 236160 240849 167384 73874 -40252
10660 -40252 -106884 -166713 -228306 -244602 -169033 -32037 86677 150301 -48823 -108051 -111213
10649 -111213 -269731 -339727 -277418 -155293 -119936 -31273 84744 -4878 53108 143016 105404
10638 105404 6515 -229874 -337611 -248020 -259652 -213614 48025 129307 144537 193182 211972
10627 211972 183764 247092 221326 157963 59018 87646 135223 39407 -176193 -218075 -132155
10616 -132155 -4589 82822 4026 -162615 105750 199729 145286 122886 22073 -110496
10606 -110496 -145566 -146436 -100332 -25304 -53686 -30592 -106531 -124212 -201179 -71073 -72600 -30186
10594 -30186 -72074 6481 28325 -64285 -157046 -68118 8210 177668 169159 -17124 53336
10583 53336 149923 176876 10600 -30761 80112 191192 16573 -65324 -150335 -205974 -74203
10572 -74203 95231 88135 -1062 -92800 -125915 -64971 -138036 -256538 -287954 -253573 -215172
10561 -215172 66918 276875 234880 182432 -103999 -181287 -89168 86669 -2666 -128747
10551 -128747 -13821 70894 8052 -133839 -57512 6033 34751 -3686 42987 161507 219481
10540 219481 276914 158902 -2424 -12984 -99166 -40785 16647 60974 -99660 -100731 -25202
10529 -25202 87816 163830 191917 74785 -13051 220167 161365 55012 155895 189408 157799
10518 157799 151262 11610 5583 -66559 -119350 -147734 22096 128537 48060 106155 47648
10507 47648 -98588 34468 166455 38025 -1922 -99242 -15061 28386 38366 -62837 69884
10496 69884 113808 52201 84369 24085 -117075 -106164 40394 46384 5750 20685 1415
10485 1415 139681 261582 223680 -26010 -14142 27813 56862 17871 10162 5152 39754 -2490
10473 -2490 -32962 12844 76149 41796 16145 140883 23943 -84332 -166361 -116259 -171804
10462 -171804 -181224 -225978 -167893 -53245 -167718 -163370 -72413 -101567 -256207 -294013 -197658
$$ [...]
##END NTUPLES=NMR SPECTRUM
##END=
