##TITLE=Analysis number 312982
Compound Code tl 00280
Project Code adrs
Chemist Name endeavour
##JCAMPDX= 6.0         $$ Bruker NMR JCAMP-DX V2.0
##DATA TYPE= NMR SPECTRUM
##DATA CLASS= NTUPLES
##ORIGIN= Bruker BioSpin GmbH
##OWNER= NMR
$$ XWIN-NMR		Version 3.5
$$ Mon Aug 22 13:17:44 2005 GMT Daylight Time (UT+1h)  MAYBRIDGE\NMR@NMR_250MHZ
##.OBSERVE FREQUENCY= 250.131544655141
##.OBSERVE NUCLEUS= ^1H
##.ACQUISITION MODE= SIMULTANEOUS (DQD)
##.ACQUISITION SCHEME= undefined
##.AVERAGES= 16
##.DIGITISER RES= 18
##SPECTROMETER/DATA SYSTEM= dpx250
##.PULSE SEQUENCE= zg30
##.SOLVENT NAME= CDCl3
##.SHIFT REFERENCE= (INTERNAL, CDCl3, 0, 16.522)
##AUDIT TRAIL= $$ (NUMBER, WHEN, WHO, WHERE, WHAT)
$$ ##TITLE= Audit trail, XWIN-NMR		Version 3.5
$$ ##JCAMPDX= 5.01
$$ ##ORIGIN= Bruker BioSpin GmbH
$$ ##OWNER= NMR
$$ C:\u/data/dgb/nmr/ADRS/8310/pdata/1/auditp.txt
$$ ##AUDIT TRAIL=  $$ (NUMBER, WHEN, WHO, WHERE, WHAT)
(   1,<2005-08-22 13:17:24.24 +100>,<MAYBRIDGE\NMR>,<NMR_250MHZ>,
      <created by zg, POWCHK disabled, PULCHK disabled
       configuration hash MD5:
       62 19 C7 07 E1 42 D1 B7 37 6C 3D D0 77 39 F9 E6
       data hash MD5: 64K
       AB C0 70 E4 83 36 D3 78 68 5C 44 7B 0F DE B4 D7>)
(   2,<2005-08-22 13:17:36.11 +100>,<MAYBRIDGE\NMR>,<NMR_250MHZ>,
      <Start of raw data processing
       ef LB = 0.3 FT_mod = 6 PKNL = 1 SI = 32K 
       data hash MD5: 32K
       0E 6D 2C 07 03 99 9B 49 77 BC 5A FD 62 07 9D AC>)
(   3,<2005-08-22 13:17:38.52 +100>,<MAYBRIDGE\NMR>,<NMR_250MHZ>,
      <apk 
       data hash MD5: 32K
       F6 E4 1A 8C 77 20 49 2E 18 5D BC 42 8B 34 E5 F8>)
(   4,<2005-08-22 13:17:39.25 +100>,<MAYBRIDGE\NMR>,<NMR_250MHZ>,
      <abs ABSG = 5 
       data hash MD5: 32K
       71 D6 ED 0F 77 8B 4C 70 6C 18 7C 92 C5 95 BA 95>)
$$ ##END=
$$ 
$$ hash MD5
$$ EB 71 E1 B8 DF E0 21 C6 64 42 49 EA F9 FF 97 3F
##$RELAX= 
##$RELAX= 
##$RELAX= 
##$RELAX= 
##$RELAX= 
##$RELAX= 
##$RELAX= 
$$ Bruker specific parameters
$$ --------------------------
##$DU= <C:\u>
##$EXPNO= 8310
##$NAME= <ADRS>
##$PROCNO= 1
##$TYPE= <nmr>
##$USER= <dgb>
##$AMP= (0..31)
100 100 100 100 100 100 100 100 100 100 100 100 100 100 100 100 100 100 
100 100 100 100 100 100 100 100 100 100 100 100 100 100 
##$AQSEQ= 0
##$AQ_mod= 3
##$AUNM= <au_zg>
##$AUTOPOS= <17 >
##$BF1= 250.13
##$BF2= 250.13
##$BF3= 250.13
##$BF4= 250.13
##$BF5= 500.13
##$BF6= 500.13
##$BF7= 500.13
##$BF8= 500.13
##$BYTORDA= 1
##$CFDGTYP= 0
##$CFRGTYP= 5
##$CHEMSTR= <none>
##$CNST= (0..31)
1 1 145 1 1 1 1 1 1 1 1 1 1 1 1 1 1 1 1 1 1 1 1 1 1 1 1 1 1 1 1 1 
##$CPDPRG= <>
##$CPDPRG1= <>
##$CPDPRG2= <>
##$CPDPRG3= <>
##$CPDPRG4= <mlev>
##$CPDPRG5= <mlev>
##$CPDPRG6= <mlev>
##$CPDPRG7= <mlev>
##$CPDPRG8= <mlev>
##$CPDPRGB= <>
##$CPDPRGT= <>
##$D= (0..31)
0 1 0 0 0 0 0 0 0 0.06 0 0 0 0 0 0 0.0002 0 0 0 0 0 0 0 0 0 0 0 0 0 0 
0 
##$DATE= 1124713043
##$DBL= (0..7)
120 120 120 120 120 120 120 120 
##$DBP= (0..7)
150 150 150 150 150 150 150 150 
##$DBP07= 0
##$DBPNAM0= <>
##$DBPNAM1= <>
##$DBPNAM2= <>
$$ [...]
##$SUBNAM7= <"">
##$SUBNAM8= <"">
##$SUBNAM9= <"">
##$SW= 20.6930455092707
##$SWIBOX= (0..15)
0 0 3 0 0 0 0 0 0 0 0 0 0 0 0 0 
##$SW_h= 5175.983436853
##$TD= 65536
##$TD0= 1
##$TE= 295.16
##$TE2= 300
##$TE3= 300
##$TEG= 300
##$TL= (0..7)
0 120 120 120 120 120 120 120 
##$TP= (0..7)
150 150 150 150 150 150 150 150 
##$TP07= 0
##$TPNAME0= <>
##$TPNAME1= <>
##$TPNAME2= <>
##$TPNAME3= <>
##$TPNAME4= <>
##$TPNAME5= <>
##$TPNAME6= <>
##$TPNAME7= <>
##$TPOAL= (0..7)
0.5 0.5 0.5 0.5 0.5 0.5 0.5 0.5 
##$TPOFFS= (0..7)
0 0 0 0 0 0 0 0 
##$TUNHIN= 0
##$TUNHOUT= 0
##$TUNXOUT= 0
##$USERA1= <user>
##$USERA2= <user>
##$USERA3= <user>
##$USERA4= <user>
##$USERA5= <user>
##$V9= 5
##$VALIST= <valist>
##$VCLIST= <CCCCCCCCCCCCCCC>
##$VD= 0
##$VDLIST= <DDDDDDDDDDDDDDD>
##$VPLIST= <PPPPPPPPPPPPPPP>
##$VTLIST= <TTTTTTTTTTTTTTT>
##$WBST= 1024
##$WBSW= 4
##$XGAIN= (0..3)
0 0 0 0 
##$XL= 0
##$YL= 0
##$YMAX_a= 539118
##$YMIN_a= -493016
##$ZGOPTNS= <>
##$ZL1= 120
##$ZL2= 120
##$ZL3= 120
##$ZL4= 120
##$ABSF1= 16.522
##$ABSF2= -4.171173
##$ABSG= 5
##$ABSL= 3
##$ALPHA= 0
##$AQORDER= 0
##$ASSFAC= 0
##$ASSFACI= 0
##$ASSFACX= 0
##$ASSWID= 0
##$AUNMP= <proc_1d>
##$AZFE= 0.1
##$AZFW= 0.1
##$BCFW= 0
##$BC_mod= 0
##$BYTORDP= 0
##$COROFFS= 0
##$CY= 12.5
##$DATMOD= 1
##$DC= 0
##$DFILT= <>
##$DTYPP= 0
##$F1P= 14.0000005364418
##$F2P= -0.99999901652339
##$FCOR= 0.5
##$FTSIZE= 32768
##$FT_mod= 6
##$GAMMA= 0
##$GB= 0
##$INTBC= 1
##$INTSCL= 1
##$ISEN= 128
##$LB= 0.3
##$LEV0= 0
##$LPBIN= 0
##$MAXI= 10000
##$MC2= 0
##$MEAN= 0
##$ME_mod= 0
##$MI= 0
##$NCOEF= 0
##$NC_proc= -4
##$NLEV= 6
##$NOISF1= 0
##$NOISF2= 0
##$NSP= 0
##$NTH_PI= 0
##$NZP= 0
##$OFFSET= 16.522
##$PC= 1
##$PHC0= 127.5384
##$PHC1= 6.460487
##$PH_mod= 1
##$PKNL= yes
##$PPARMOD= 0
##$PSCAL= 4
##$PSIGN= 0
##$REVERSE= no
##$SF= 250.13
##$SI= 32768
##$SIGF1= 0
##$SIGF2= 0
##$SINO= 400
##$SIOLD= 32768
##$SREGLST= <1H.CDCl3>
##$SSB= 0
##$STSI= 32768
##$STSR= 0
##$SW_p= 5175.98343685301
##$SYMM= 0
##$S_DEV= 0
##$TDeff= 65536
##$TDoff= 0
##$TI= <Analysis number 999999
Compound Code 99
Book Reference 9
Project Code 9>
##$TILT= no
##$TM1= 0
##$TM2= 0
##$TOPLEV= 0
##$USERP1= <user>
##$USERP2= <user>
##$USERP3= <user>
##$USERP4= <user>
##$USERP5= <user>
##$WDW= 1
##$XDIM= 32768
##$YMAX_p= 260713742
##$YMIN_p= -52224
$$ End of Bruker specific parameters
$$ ---------------------------------
##NTUPLES= NMR SPECTRUM
##VAR_NAME=  FREQUENCY,     SPECTRUM/REAL,   SPECTRUM/IMAG
##SYMBOL=    X,             R,               I
##VAR_TYPE=  INDEPENDENT,   DEPENDENT,       DEPENDENT
##VAR_FORM=  AFFN,          ASDF,            ASDF
##VAR_DIM=   32768,         32768,           32768
##UNITS=     HZ,            ARBITRARY UNITS, ARBITRARY UNITS
##FACTOR=    0.157963299565203, 1,           1
##FIRST=     4132.6476996994, 0,             0
##LAST=      -1043.33573715361, 0,           0
##MIN=       -1043.33573715361, -52224,      0
##MAX=       4132.6476996994, 260713742,     0
$$ Real data points
##PAGE= N=1
##DATA TABLE= (X++(R..R)), XYDATA
$$ [...]
14128a6598J5408P336l936k452l147m565r628N705j082m280l419j446N71N365
14114a6168J40k958J0049J6993j1537j5159N088j768K421k150M193o581N551J310
14100a0576k789o564K169J2698n076j732Q887L763q002j8860j1187K0748J5696
14087h25J0913l46q270o524L249j1102p621r420J7064P355k813j625N647m220
14073h538q983o702J654r095Q454R411P845J145q390o554m213q379J1181N495
14059a5669P703P347P160P596n618q882N236l749q637j227J4360N42j982K239
14045F419k445m103N052L774k646M020Q761j1817j5485N428M786L304N252J1505
14031B1805J41j0544j8744j608J528P84l08m791n135M621K755M956J6572o92M834
$$ plain form
14128 -16598 -1190 6146 2210 -242 -3389 -7954 -17582 -11877 -12959 -17239 -20658 -22104 -21533 -16168
14114 -16168 -16028 -18986 -8937 8056 -3481 -18640 -13552 -15320 -12899 -15049 -10856 -17437 -11886 -10576
14100 -10576 -13365 -19929 -17760 -5062 -10138 -11870 -2983 780 -7222 -26082 -37269 -16521 -825
14087 -825 10088 9742 1472 -5052 -1803 -12905 -20526 -29946 -12882 -5527 -8340 -9965 -4318 -8538
14073 -8538 -17521 -24223 -22569 -31664 -23210 -13799 -5954 -4809 -13199 -19753 -23966 -32345 -21164 -15669
14059 -15669 -7966 -619 6541 14137 8519 -363 4873 1124 -7513 -8740 5620 6162 4180 6419
14045 6419 3974 -129 4923 8697 6051 10071 18832 7015 -8470 -3042 1744 5048 10300 21805
14031 21805 21946 11402 -7342 -8950 -7422 -6638 -6946 -11737 -16872 -12251 -9496 -4540 12032 11340 16174
14016A6174O19j5062j513l789N394K770L763j55j516j4025q510m344n954M631
14002b1517J3773O245M104q785j3826l866J7016J853R076j391K254j871M217j416
13988E866n049k168j323m907K039m861K957R374j5730Q8L228K536K360P551j0193
13973h232Q084N914O27j1751j0838k875J617P089P006r745Q77K2951J0176p096
13959A3804Q215M800j4699n063j2058m948K897J0283j798L96P776o733N580K61
13945H713P776M159J819J009j7642r417o294j3338m233K991J1930R442J863j0675
13931a1897l055r79J9465L36j550o347j2214L597J2095Q605j493k737n676J091
13917g59M70n83n287k235J0065M485J522J160k099n591j079P067o814K821j39
$$ plain form
14016 16174 16793 1731 218 -3571 1823 4593 8356 8201 6685 -7340 -15850 -20194 -26148 -21517
14002 -21517 -7744 -1499 2605 -6180 -20006 -23872 -6856 -5003 4073 2682 4936 3065 7282 5866
13988 5866 817 -1351 -2674 -7581 -5542 -10403 -7446 1928 -13802 -13714 -10486 -7950 -5590 1961 -8232
13973 -8232 -148 5766 6393 -5358 -16196 -19071 -17454 -10365 -3359 -13104 -12227 10724 20900 13804
13959 13804 22019 26819 12120 7057 -5001 -9949 -7052 3231 1433 1829 9605 2872 8452 8713
13945 8713 16489 20648 22467 23476 5834 -3583 -9877 -23215 -27448 -24457 -12527 -3085 -1222 -11897
13931 -11897 -14952 -15931 3534 3870 2320 -4027 -16241 -12644 -549 8056 6563 3826 -1850 -759
13917 -759 -289 -872 -6159 -8394 1671 6156 7678 8838 6739 1148 69 7136 322 3143 3004
13902C004o773M127K818o083p662j0856l518P432K3412M297j0007j4454J0263
13889d000J5386n397q265r250k943q810j7190K442R34P440J0922J0383r10k399
13875a1657N889j657r682L456L309l468K377L616k363Q790J0375m88l475m588
13861D34j530l070q420o224r4J51O836m76O862m999O712M018P721j637m618m622
13845b956K925j5825l818K263k456J4207P130l912o893m908J0724J704M462k301
13831C46J372J429o760j640Q75k478K0725L815k0598n774l217J0573O389o421
13817a364j8020r865M713J882K651n675j0475P737J5930O881m807L349n954l973
13803a6990k506n92P900J346J545Q705L283j351q356M297J885k807m809K361J810
$$ plain form
13902 3004 -3769 358 3176 -2907 -10569 -21425 -24943 -17511 5901 10198 191 -14263 -4000
13889 -4000 11386 5989 -2276 -11526 -14469 -23279 -40469 -38027 -37093 -29653 -18731 -8348 -9258 -11657
13875 -11657 -5768 -7425 -17107 -13651 -10342 -13810 -11433 -7817 -10180 -1390 8985 8497 5022 434
13861 434 -1096 -4166 -12586 -18810 -18904 -18753 -11917 -12393 -5531 -10530 -3818 200 7921 6284 1666 -2956
13845 -2956 -31 -15856 -19674 -17411 -19867 -5660 1470 -2442 -9335 -14243 -3519 -1815 2647 346
13831 346 1718 3147 -3613 -5253 -4378 -6856 13869 17684 -2914 -8688 -11905 -1332 5057 -1364
13817 -1364 -19384 -29249 -24536 -22654 -20003 -25678 -36153 -28416 -12486 -5605 -10412 -7063 -13017 -16990
13803 -16990 -19496 -20088 -12188 -10842 -9297 -592 2691 1340 -7016 -2719 -834 -3641 -8450 -6089 -4279
13788d279M404q80n901j1449Q191Q075j645m566O539m773R107Q7j3294M10Q009
13773a965k413P370Q77p940j2103N529J7444J853O945j0752m250N63m963O133
13759B328K302K720K910j4524q093l999p75N195o17k239R371R289M197Q99k246
13744F718j0035p440J984p794k594j680o085k321P653M695J2434k678m580N632
13730f091N885L879l886L663l818j523q45O432J0547k154j9588o139J6123N838
13716H323J708K196K233k475p225l379l917P32J068K921m379k289O080j727k957
13701c087k230j4415J608L184q616Q876L780q295K943j649k495J416J1452N989
13687a539k2206O35J2698J0931Q548n669j133l381N789q61p23J48l046r328l993
$$ plain form
13788 -4279 125 -755 -6656 -18105 -9914 -1839 -3484 -8050 -1511 -6284 2823 2910 -10384 -9974 -1965
13773 -1965 -4378 2992 3869 -4071 -16174 -10645 6799 8652 15597 4845 595 1158 -3805 2328
13759 2328 4630 7350 10260 -4264 -12357 -16356 -17131 -11936 -12553 -14792 -5421 3868 8065 8964 6718
13744 6718 -3317 -10757 -8773 -16567 -19161 -20841 -26926 -29247 -21594 -16899 -4465 -7143 -11723 -6091
13730 -6091 -206 3673 -213 3450 -368 -1891 -2736 3696 14243 12089 -7499 -13638 2485 8323
13716 8323 10031 12227 14460 11985 4760 1381 -2536 -1804 -736 2185 -2194 -4483 1597 -130 -3087
13701 -3087 -5317 -19732 -18124 -14940 -23556 -14680 -10900 -19195 -16252 -17901 -20396 -18980 -7528 -1539
13687 -1539 -23745 -23110 -10412 519 9067 3398 2265 -1116 4673 3812 3089 3237 191 -9137 -13130
13672a3130J085o957M541O564p922k612L969n92L854J3904p903m8n458j248m16
13657a2369p286q07Q119O666M267J705n066K89q199p682k433M560N630M585L980
13642d041p815K368M824j3099n243j874L944M33K768k467j3926m619R895O788
13628b2064R068Q91j8504p685n479K76J000J0967J4483m34j0285O369L425p17
13614a8689j6148n604K2294J1323k253p986P087J915o638k165n528P32p323J4000
13600a4983Q240j0473L704P196P097L465j7783k914m947M407J5593J849k768L117
13586H00j2224Q361K560j2783n04J0702J8416L127p722l871j1159n80l574j3898
13572b2349j3549l438m355J6050N325N455m572l846R77p976r216o111J8848J8318
$$ plain form
13672 -13130 -12045 -19002 -14461 -7897 -15819 -18431 -14462 -15054 -11200 2704 -5199 -5247 -10705 -11953 -12369
13657 -12369 -19655 -20462 -12343 -5677 -1410 295 -4771 -4482 -12681 -20363 -22796 -18236 -12606 -8021 -4041
13642 -4041 -11856 -9488 -4664 -17763 -23006 -24880 -20936 -20503 -17735 -20202 -34128 -38747 -28852 -22064
13628 -22064 -12996 -12105 -30609 -38294 -43773 -43497 -42497 -31530 -17047 -17481 -27766 -21397 -17972 -18689
13614 -18689 -34837 -40441 -18147 -6824 -9077 -17063 -9976 -8061 -14699 -16864 -22392 -21660 -28983 -14983
13600 -14983 -6743 -17216 -13512 -6316 781 4246 -13537 -16451 -21398 -16991 -1398 451 -2317 800
13586 800 -11424 -3063 -503 -13286 -13790 -3088 15328 18455 10733 6862 -4297 -4877 -8451 -22349
13572 -22349 -35898 -39336 -43691 -27641 -22316 -16861 -21433 -25279 -24302 -32278 -41494 -47605 -28757 -10439
13558a0439P226n434L135o214k199K1388q78r457q22J1442J899m861m306k521
13544b041L313J0873o18q810J383l425l204m084O935j476n189J577Q755N353p974
13529A368o491n21L555m59K534k320P098M257q337q543M971k152j862J096O0K960
13513b786P596k977k733j4950j2370J547M54J541P411M597L579k554J3666K0121
13499B2142o773j0271o720k508p593P73J0475L925q345P00o325k585J6319J443
13485D657P083M864j0624J452l45M154k118j6730r131k658N386P742P081m961
13471d148l345o847r195n902R864J4486N415k14j717o511R108l577L002j1673
13457a1254o171L418N075P752n824j0766m826P435m766k997j0018N268M856J3587
$$ plain form
13558 -10439 -3213 -8647 -5512 -11726 -13925 7463 6585 -2872 -3694 7748 9647 4786 480 -2041
13544 -2041 1272 12145 11527 2717 4100 675 -2529 -6613 322 -1154 -6343 -4766 3989 9342 1368
13529 1368 -5123 -5644 -2089 -2548 -14 -2334 4764 9021 684 -7859 -2888 -5040 -6902 -5806 -5746 -2786
13513 -2786 4810 1833 -900 -15850 -28220 -26673 -26219 -24678 -17267 -12670 -9091 -11645 2021 22142
13499 22142 15369 5098 -1622 -4130 -11723 -10950 -475 3450 -4895 -4195 -10520 -13105 3214 4657
13485 4657 11740 16604 5980 7432 7087 11241 9123 -7607 -16738 -19396 -14010 -6268 813 -4148
13471 -4148 -7493 -14340 -23535 -29437 -19573 -5087 328 114 -1603 -8114 994 -2583 419 -11254
13457 -11254 -17425 -14007 -8932 -1180 -7004 -17770 -22596 -15161 -19927 -22924 -32942 -27674 -22818 -9231
13443i231Q654L93L56O69l405n249P085l068k137J302K563k343j6130k780O917
13428a6404K320N297J35j3856J3119k583l300m035j2059N916L042l317J422K2370
13414a933P483n707L174P85p541J189K298j2603l826p518J0426Q618p171m963
13400a7289K523o89P443K304l54J3067l736p189m696k956L876j5311M164L806
13386a5037q116Q58L196R46l983l786J6071m52j8142r374R794J835N994M496j322
13371a7022L030Q083k169j4461l935M097j446L334J1441J957j382J6N451J0308
13357G302q045m4L513l331r409j9052L42K5333J1117Q084K964o595r157K877p70
13342E129j8124j3184M569O907K821J5081M549N505j1489j4325n306J6092O500
$$ plain form
13443 -9231 -577 -184 172 841 -2564 -7813 -728 -3796 -5933 -4631 -2068 -4411 -20541 -23321 -16404
13428 -16404 -14084 -8787 -8652 -22508 -9389 -11972 -15272 -19307 -31366 -25450 -22408 -25725 -24303 -1933
13414 -1933 5550 -157 3017 3802 -3739 -2550 -252 -12855 -16681 -24199 -13773 -5155 -12326 -17289
13400 -17289 -14766 -15455 -8012 -5708 -6062 7005 3269 -3920 -8616 -11572 -7696 -23007 -18843 -15037
13386 -15037 -23153 -22295 -19099 -18153 -22136 -25922 -9851 -10303 -28445 -37819 -28025 -26190 -20196 -15700 -17022
13371 -17022 -13992 -5909 -8078 -22539 -26474 -22377 -23823 -20489 -9048 -7091 -8473 -8457 -3006 7302
13357 7302 -743 -787 2726 -605 -10014 -29066 -28724 -3391 7726 15810 18774 12179 3022 5899 5129
13342 5129 -12995 -26179 -21610 -14703 -11882 3199 7748 13253 1764 -12561 -17867 -1775 4725
13329D725J3048k0316p800M119R660J1986Q401L266N046o407m894k780q832o795
13315B427k053k874O51r099L754Q841r060p701J4079J6174m457l552J7180O671
13301C0981o535j1291o173P537p207k0674J1015J6536J363o201J835l93q198K940
13287E535r931L186J2689M4m550j5820M055J5779J3754O277p57K556J3298M179
13273E0294l443J0423L0995J1045J5458L1964M5420M7331N9596P8493Q2172N1458
13261E11206J3315k1832q9310j21357q7630m9646l5165j8608p341j0310p831j1626
13249F3865j172j825O349P210N599j5084m746N840R798P328k84K142k402Q116
13235I0734R477J0851J0237p320P682K8142J4163P344K8780M1344N0243N3943
$$ plain form
13329 4725 17773 -2543 -10343 -6224 3436 15422 23823 27089 32135 25728 20834 18054 9222 2427
13315 2427 374 -2500 -1849 -10948 -7194 1647 -7413 -15114 -1035 15139 10682 7130 24310 30981
13301 30981 24446 13155 6982 14519 7312 -13362 -2347 14189 15552 9351 11186 10793 2595 5535
13287 5535 -4396 -1210 11479 11523 6973 -8847 -4792 10987 24741 31018 30261 32817 46115 50294
13273 50294 46851 57274 88269 99314 114772 146736 192156 239487 299083 377576 459748 511206
13261 511206 524521 502689 413379 292022 204392 154746 119581 100973 93632 83322 75491 63865
13249 63865 62693 60868 67217 74427 80026 64942 60196 66036 75834 83162 82878 85020 82618 90734
13235 90734 100211 111062 121299 113979 121661 149803 163966 171310 200090 241434 291677 345620
13223C45620P9858J12633J41602J70045K21185K61065K15138Q7401m8265k86749
13213A299533m07502k93982j68273q8266n6833m2098l3379j1480j5468r015k0084
13202A53153j0368l428r560O896j831p72k891P807M892Q357L577Q938R708J1668
13188A86146J5885J027O570R080O623J161K1205L7287L7220O2561P5413J03734
13176E63912J39543J71286K24185K53846K31998J12599k7846k57837m11999l23248
13166F76439j81814j08799n2086l4062l3662l4185j2654j5006k0357j6494j5899
13155A51421p619l548K221N659O063N26n045L339K592O89l124p096L608q54O566
13140A55398J921n677J58R782l70Q891J3046J9942K7020L9675N4713P7341Q3205
$$ plain form
13223 345620 425478 538111 679713 849758 1070943 1332008 1547146 1634547 1586282 1299533
13213 1299533 892031 598049 429776 341510 284677 242579 209200 197720 182252 173237 153153
13202 153153 142785 139357 129797 136693 134862 134090 131199 139006 143898 152255 155832 164770 174478 186146
13188 186146 202031 203058 209628 218708 225331 226492 247697 284984 322204 384765 460178 563912
13176 563912 703455 874741 1098926 1352772 1584770 1697369 1669523 1411686 999687 676439
13166 676439 494625 385826 333740 299678 266016 231831 219177 204171 183814 167320 151421
13155 151421 143802 140254 142475 148134 154197 154723 149678 153017 155609 156298 153174 146078 149686 148832 155398
13140 155398 157319 151642 151800 161582 161212 170103 183149 203091 230111 269786 324499 401840 485045
13127D85045N3912K4907L07o9780j30273j14096p2721l7622k7607l3849j2409
13116F5814L976j2943o571M255m518K088J6409l568O960L545O052n344n767O730
13102G7118n035k645O916l114j0792r560l622j520k012l196q301p373j5083R401
13088B1182M145O634n179j2150J5569L085q22p316j0655J0365J4421n264k0877
13075A3138J746L313L80q749j0644K607M797J555p757m016m8N211J0205q51J9275
13060C0162J5310N330o281j9108q335p676J429J0818K295k2612K187m4O358J0276
13046B0109n354q615l09N601m288n232k070n48K68j005P182J0563O620j162n884
13031A5876l874O696J564K557n984j2982R290N81m615r063j0752q86J3723Q497
$$ plain form
13127 485045 538957 563864 564171 494391 364118 250022 177301 139679 112072 78223 65814
13116 65814 69790 56847 50276 54531 50013 52101 68510 64942 71902 75447 81499 76155 70388 77118
13102 77118 72083 69438 76354 73240 62448 52888 49266 47746 45734 42538 34237 26864 11781 21182
13088 21182 25327 31961 26782 14632 30201 33286 32464 25148 14493 24858 39279 34015 13138
13075 13138 14884 18197 18577 9828 -816 1791 6588 8143 386 -3630 -3678 1533 11738 10887 30162
13060 30162 45472 50802 44521 25413 17078 9402 10831 21649 23944 1332 3519 3475 9833 20109
13046 20109 14755 6140 5831 11432 7144 1912 -158 -706 -438 -1443 5739 16302 22922 21760 15876
13031 15876 12002 18698 20262 22819 16835 3853 13143 13724 9109 46 -10706 -11592 2131 10628
13017A0628q780n312M216P09K251m651m069o102l787P957K900l958J5616q005
13003c87o239J20l81M853j871r089j2023J1721L103j790m752j637O028q815q37
12988b1996N060o789M528N114O1J394J550o580m264l365J4278J6372j958q036
12974d631k516o190j6414M4J8861Q276r595l755J0381J6562L666n241m777n499
12960h28o165m005j701K205M996M088j928o887m857J408m032O06j161N35P200
12945a0526J394j737j4511j3317P434J6683J3530L215p90J006p996j1321O194
12932a0742L06J1772n823j5927K674n610j366O483Q41k479N859J0542n463O472
12918b461q22j0824o195j902m262j5844J702J9830K719j1381j787J3967K1372
$$ plain form
13017 10628 1848 -3464 752 1461 3712 -939 -5008 -11110 -14897 -6940 -4040 -7998 7618 -387
13003 -387 -6626 -6506 -6887 -2034 -3905 -12994 -25017 -13296 -10193 -11983 -16735 -18372 -12344 -21159 -21996
12988 -21996 -16936 -23725 -19197 -14083 -14022 -12628 -11078 -17658 -21922 -25287 -11009 5363 3405 -4631
12974 -4631 -7147 -13337 -29751 -29707 -10846 -2570 -12165 -15920 -5539 11023 14689 9448 4671 -828
12960 -828 -6993 -10998 -12699 -10494 -5498 -1410 -3338 -10225 -15082 -13674 -17706 -17100 -18261 -17726 -10526
12945 -10526 -9132 -10869 -25380 -38697 -31263 -14580 -1050 2165 1375 2381 -5615 -16936 -10742
12932 -10742 -10436 1336 -4487 -20414 -17740 -23350 -24716 -18233 -17392 -19871 -14012 -3470 -8933 -2461
12918 -2461 -3283 -14107 -20302 -22204 -26466 -42310 -40608 -20778 -18059 -29440 -31227 -17260 4112
12905D112P478r390N143j5746m766P99r803P200k655k192O716m180K773j407k688
12890a8606L611J4708J363j0074j3802n12J2334R705m539l497J727l362L604N157
12876b183l001r401l01J2291m32j913R638l302j148K019n861p706J8056J8610
12862B5366o784q640j5210q534L194l672l363N117N436O373j0046k0681O261K0098
12848e085q02O166N168M256p779o124J6219J34k657j0885n927n272J0001p551
12834a0138k053J1890L165j6428j0578L366J0639p518j484j277L667o900o007
12821b9656k553K005J0995J1487q738n741p81R749L871k252L214L506m740j1088
12807b0722k509m72Q939J0019N625R235j0765j914o116j624O070p039k317L956
$$ plain form
12905 4112 11590 2200 7343 -8403 -13169 -12370 -22173 -14973 -17628 -19820 -13104 -17284 -14511 -15918 -18606
12890 -18606 -14995 -287 1076 -8998 -22800 -23312 -10978 -1273 -5812 -9309 -7582 -10944 -7340 -2183
12876 -2183 -5184 -14585 -14886 -2595 -3027 -4940 4698 1396 248 2267 -3594 -11300 6756 25366
12862 25366 18582 9942 -5268 -13802 -10608 -14280 -17643 -12526 -7090 -717 -10763 -31444 -25183 -5085
12848 -5085 -5887 279 5447 9703 1924 -4200 12019 12153 9496 -1389 -7316 -12588 -2587 -10138
12834 -10138 -12191 -301 2864 -13564 -24142 -20776 -10137 -17655 -19139 -20416 -16749 -23649 -29656
12821 -29656 -32209 -30204 -19209 -7722 -16460 -22201 -22982 -13233 -9362 -11614 -8400 -4894 -9634 -20722
12807 -20722 -23231 -23703 -14764 -4745 880 10115 -650 -2564 -8680 -10304 -4234 -11273 -13590 -9634
12793i634o043m282Q150K539k239j231p991j371j1910J603R548J0826l984j521
12779a7540k228J0946R167l834o962j2893n439M043J2414J778j268j574k632r968
12765b5990R132L991K307j4078M937M043k792j1072Q540Q925N222O209r357O297
12751c686o861P554J3347j45o082p417r560N143J5546j0917q106Q428l530j1379
12737a7665J91J0567M804j4037j7611L899J0614J0706o023J151m646j0811M090
12724b4771J0415J7566M153o509j687o205j1254l380n102k383J0417k096o071
12711b6907L867J0565K290r016l101O903L223K172J1026J2954Q017j0371p876
12698C746j911q321o871J1435O056k296l625M128j2211j7929p478K069J4393J725
$$ plain form
12793 -9634 -15677 -19959 -11809 -9270 -11509 -12740 -20731 -22102 -34012 -32409 -22861 -12035 -16019 -17540
12779 -17540 -19768 -8822 345 -3489 -10451 -23344 -28783 -24740 -12326 -10548 -11816 -13390 -16022 -25990
12765 -25990 -16858 -12867 -10560 -24638 -19701 -15658 -18450 -29522 -20982 -12057 -6835 -626 -9983 -3686
12751 -3686 -10547 -2993 10354 10209 4127 -3290 -12850 -7707 7839 -3078 -11184 -2756 -6286 -17665
12737 -17665 -17474 -6907 -2103 -16140 -33751 -29852 -19238 -8532 -14555 -13404 -18050 -28861 -24771
12724 -24771 -14356 3210 7363 854 -833 -7038 -18292 -21672 -26774 -29157 -18740 -20836 -26907
12711 -26907 -23040 -12475 -10185 -19201 -22302 -15399 -12176 -10004 1022 13976 21993 11622 3746
12698 3746 1835 -6486 -13357 -1922 4134 1838 -1787 2341 -9870 -27799 -35277 -33208 -18815 -17090
12684a7090q079r82l204J2801J1510n720M45R423O46p110K386k378K114R735l135
12669A362j3289n469m054n169Q575k841j0264J752j882R294O556J1574L764q976
12655i067k083O364L274j6513j7100n802P034J1261J3372Q013J81j4015K63J3722
12641a096J0103k434K534j4946j3938P936p684r363l807o777J0533J0935J044
12628a6960Q23q512J0986J9463q835q276k275O341L912j0523j1505J1446J6494
12615B579k81n522j4088q219L755J6855J3659j0787j0706o89J0510j566M111K168
12601A779k705L301L399p146m552j4273o418K2444K637N152J7029M978q145j6515
12587I65j029r675k0250r480J3826P045J700m443P031l713m674M459L380M413
$$ plain form
12684 -17090 -25169 -26151 -29355 -16554 -5044 -10764 -10319 -896 -250 -7360 -4974 -7352 -5238 4497 1362
12669 1362 -11927 -17396 -21450 -26619 -18044 -20885 -31149 -29397 -31279 -21985 -15429 -3855 -91 -9067
12655 -9067 -11150 -4786 -1512 -18025 -35125 -40927 -33893 -22632 -9260 -1247 -1066 -15081 -14818 -1096
12641 -1096 9007 6573 9107 -5839 -19777 -11841 -19525 -28888 -32695 -39472 -28939 -18004 -16960
12628 -16960 -16137 -24649 -13663 5800 -3035 -11311 -13586 -7245 -3333 -13856 -25361 -13915 2579
12615 2579 2298 -3224 -17312 -25531 -21776 -4921 8738 -2049 -12755 -13444 -2934 -4500 -389 1779
12601 1779 -926 2375 5774 -1372 -5924 -20197 -26615 -4171 -1534 3618 20647 25625 17480 965
12587 965 -64 -9739 -29989 -39469 -25643 -18598 -16898 -21341 -14310 -18023 -22697 -18238 -14858 -10445
12573a0445M061o042J62j360n695p282L816j0424R147J5739K604l927j1255m325
12559b5226M446O378j1524O217L203p911J459o798n537O179n628Q340L289J2412
12545a0701O821J543L684N503M84K231k338l958j1761P99P835j815K197j988p00
12530b164j1434o462p895j0845P948R647J930J0879J4670o820r839o591J0162
12517f814J1151l230j2208k330m63P634J0012L305p811r735R190O02P438p434
12503f93o213M619o197J163j1034q425R60K1677M308o913q399M89M61N763J3842
12488E408J5468j945j6090j2085n940l229K656J0963O424j368j903J730p48R589
12474H930j2911o279j0375P530K4847R916j8056j6427o814o323J416J2144R509
$$ plain form
12573 -10445 -6384 -12426 -12264 -13624 -19319 -26601 -22785 -33209 -24062 -8323 -5719 -9646 -20901 -25226
12559 -25226 -20780 -14402 -25926 -19709 -16506 -24417 -22958 -29756 -35293 -29114 -34742 -26402 -23113 -10701
12545 -10701 -3880 -2337 1347 6850 7334 9565 7227 3269 -8492 -7693 142 -1673 524 -1464 -2164
12530 -2164 -13598 -20060 -27955 -38800 -30852 -21205 -19275 -8396 6274 -546 -10385 -16976 -6814
12517 -6814 4337 1107 -11101 -13431 -13894 -6260 3752 7057 -754 -10489 -1299 -697 6741 -693
12503 -693 -6906 -2287 -8484 -7321 -18355 -26780 -25820 -4143 165 -6748 -15147 -14658 -14197 -8434 5408
12488 5408 20876 18931 2841 -9244 -15184 -18413 -15757 -4794 1630 262 -1641 89 -659 8930
12474 8930 -3981 -10260 -20635 -13105 11742 21658 3602 -12825 -19639 -25962 -24546 -12402 -2893
12461b893j3074n44J7870Q654k485j4377j481R268O668L241m965p978p382j20
12447i598O954j224q68n586O476r32J1955p302j4472n690o297j1186J1560J1684
12433a4526Q242N644k020J1884N346o486j6724m466J0787P29k283N848q958l950
12419a0933k044j6551O609K0162K760k3080j4198O993J0430J8403n107L839r704
12406a2421o851l998l838l941k332J628R052l472O406J4713J5337o925k2677J135
12392a8184k837o939J3125J6999n361l904J0177j3693r350O58M383j30k555J3089
12378d522M522Q63n220q900J52L353l808j672M199R855P469j680r109o229J670
12363i057O550n525p348j235m073M388J1032Q583l044p515p025o287Q136K642
$$ plain form
12461 -2893 -15967 -16511 1359 10013 7528 -6849 -8330 938 7606 10847 5882 -2096 -9478 -9598
12447 -9598 -2644 -3868 -4736 -10322 -3846 -4778 7177 -125 -14597 -20287 -26584 -37770 -26210 -14526
12433 -14526 -6284 -640 -2660 9224 14570 8084 -8640 -13106 -2319 -1590 -3873 1975 -6983 -10933
12419 -10933 -12977 -29528 -22919 -2757 3 -23077 -37275 -30282 -19852 -1449 -6556 -2717 -12421
12406 -12421 -19272 -23270 -27108 -31049 -33381 -31753 -22701 -26173 -19767 -5054 10283 3358 -19319 -18184
12392 -18184 -21021 -27960 -14835 2164 -3197 -7101 3076 -10617 -19967 -19309 -14926 -15056 -17611 -4522
12378 -4522 0 863 -4357 -13257 -13105 -9752 -13560 -15232 -11033 -1178 6291 4611 -4498 -10727 -9057
12363 -9057 -2507 -8032 -15380 -16615 -20688 -16300 -5268 3315 271 -7244 -14269 -20556 -12420 -9778
12349i778l274r759j0224q632J5507J4980N44P269l525m244J130j3963J4061N046
12335d862j0905p847n879J2463l254n207o205r10K270R513M062j858n674R295
12321a4998J083J702P851K636j0582J963p893O94k349p51R614L464R746n827r889
12306a3536J3156n864K640O788p587q704j780Q124P68j2227j07M945K828J1604
12292A048L501n879M486j025n442j3898P21J3264m346K886L223j5595m456J2706
12278h806N337J539K506q234j593q052j3713J821K516R661J245K990P356o75O30
12263e472P54M593k60L496R439n347M576k145q298J634J2537L787r251j394J029
12248I678L772o675j0152K3r42O878M082j112N740Q378k4656p011M197K112o685
$$ plain form
12349 -9778 -13052 -22811 -33035 -41667 -26160 -11180 -10636 -3367 -6892 -11136 -10006 -23969 -9908 -4862
12335 -4862 -15767 -23614 -29493 -17030 -20284 -25491 -31696 -32606 -30336 -20823 -16761 -18619 -24293 -14998
12321 -14998 -13915 -12213 -4362 -1726 -12308 -10345 -18238 -17544 -19893 -20644 -11030 -7566 2180 -3647 -13536
12306 -13536 -380 -6244 -3604 3184 -4403 -13107 -14887 -6763 -5995 -18222 -18329 -13384 -10556 1048
12292 1048 4549 -1330 3156 2131 -3311 -17209 -16488 -3224 -7570 -4684 -1461 -17056 -21512 -8806
12278 -8806 -3469 -1930 576 -7658 -9251 -17303 -31016 -29195 -26679 -17018 -15773 -12783 -5427 -6102 -5472
12263 -5472 -4718 -125 -385 3111 12550 7203 11779 9634 1336 2970 15507 19294 10043 8649 9678
12248 9678 13450 6775 -3377 -3354 -4296 2582 6664 5552 11292 19670 -4986 -11997 -7800 -5688 -12373
12233a2373o656N332j0644r837j464Q146p549j0306J0568j21J7842J0185p827
12220a4704J919N841N714j4341r569l948N61N810J8218J0943L23n076k039L435
12206C087M255j9805m674j615L25K108J7089O047P579J038j2466m496l680m475
12192i683R22K956m449P156M306l83L789k212j2164n318j798N038N263j2656n155
12177b4388K296L891K196J1428J7155q900m948K297j1401K616q64j1124L226M063
12163a2457j628j471o946L061k251p033n94L448k396j149L860P252J838J325J840
12148a3301M006J078J1709m513k062m711k907M983L180R815R711q475p351k492
12134a330n023o646k839J4137J9846j0386j2268k873j1512q713r195L005J1933
$$ plain form
12233 -12373 -19029 -13697 -24341 -34178 -35642 -27496 -35045 -45351 -34783 -34904 -17062 -6877 -14704
12220 -14704 -12785 -6944 -1230 -15571 -25140 -29088 -28527 -22717 -4499 6444 6767 1691 -348 3087
12206 3087 7342 -12463 -17137 -18752 -18427 -16319 770 6817 14396 15434 2968 -1528 -5208 -9683
12192 -9683 -8761 -5805 -10254 -3098 1208 825 4614 2402 -9762 -15080 -16878 -11840 -6577 -19233 -24388
12177 -24388 -22092 -18201 -16005 -4577 12578 3678 -1270 1027 -10374 -7758 -8622 -19746 -16520 -12457
12163 -12457 -14085 -15556 -22502 -19441 -21692 -28725 -29319 -25871 -28267 -29416 -25556 -18304 -16466 -15141 -13301
12148 -13301 -9295 -8217 3492 -1021 -3083 -7794 -10701 -5718 -2538 7277 16988 8513 1162 -1330
12134 -1330 -6353 -12999 -15838 -1701 18145 7759 -4509 -7382 -18894 -27607 -36802 -33797 -21864
12121b1864L609l020r089L329J0098m146K527K094J0594l80Q86k075J906L358
12107b173K478m711p73j186K034r874J759M781k498J199L617J2485N905j026N532
12092A7549j2976j2629Q079m837M955J0178O072j0485k228O142r433J1870J028
12079A3285p793j243n067j7530k909O996l140J7607N670j172j4893j0475L112
12066a7552N907m791j3573o319P085K0535J749j581j1232j4975K819J3288J566
12053a7074l388J112J0750P711O46n360p393r145n12L962O365N542J059R758P260
12038A1293O738k955j7607O484j2110O66O712p667p846L690m03k099J4960n595
12024e739o158J0877L640m494j6105O730M87J5912P442j4150l134K116J1362K722
$$ plain form
12121 -21864 -18255 -21275 -30364 -27035 -16937 -21083 -18556 -16462 -5868 -6248 -5362 -7437 -5531 -2173
12107 -2173 305 -4406 -5179 -6365 -4331 -14205 -12446 -7665 -10163 -8964 -5347 7138 13043 12017 17549
12092 17549 4573 -8056 23 -4814 141 10319 16391 5906 3678 9820 387 12257 13285
12079 13285 5492 4249 -818 -18348 -21257 -14261 -17401 206 5876 4704 -10189 -20664 -17552
12066 -17552 -11645 -16436 -30009 -36328 -29243 -8708 -6959 -8540 -19772 -34747 -31928 -18640 -17074
12053 -17074 -20462 -19350 -8600 -889 -243 -5603 -12996 -22141 -22653 -18691 -12326 -6784 -5725 4033 11293
12038 11293 18031 15076 -2531 3953 -8157 -7491 -779 -8446 -16292 -12602 -13005 -15104 -144 -5739
12024 -5739 -11897 -1020 2620 -1874 -17979 -11249 -10762 5150 12592 -1558 -4692 -2576 8786 11508
12010A1508o647l63j1966n009k420K951J4738R797L55r227p775q240R91N101M236
11995a970N4q412k972n392n961J1488N514r36k156o414m866M146l57P797L628
11980f809o425k753P131J060j339L714m370P013r030j4468j003P354N117j0838
11966b5646K402J4532Q996R61J2159l260j0403o198K322q671J4793M383p023n064
11952e717O392J823M787j1936j598Q712N726r587j8827m759J815J764P156j0371
11938b4620j1912Q736r840L790J8074Q207m724n15k451K816K484n202j515l219
11924a9891l781k69L985Q265o045L863R103L784J748O700m130P121n367n375j5143
11909a5432q514l545N234J1836l289r348j1240K402P246L78l459j545R726L67
$$ plain form
12010 11508 4861 4498 -7468 -12477 -14897 -11946 2792 12589 12944 3717 -4058 -12298 -11307 -6206 -1970
11995 -1970 -1916 -10328 -13300 -18692 -24653 -13165 -7651 -8587 -10743 -17157 -22023 -17877 -18234 -10437 -6809
11980 -6809 -13234 -15987 -8856 -7796 -9135 -5421 -9791 -2778 -11808 -26276 -27279 -19925 -14808 -25646
11966 -25646 -23244 -8712 284 1245 13404 10144 -259 -6457 -4135 -12806 1987 6370 -653 -5717
11952 -5717 675 2498 7285 -4651 -6249 2463 8189 -1398 -20225 -24984 -23169 -21405 -14249 -24620
11938 -24620 -36532 -27796 -37636 -33846 -15772 -7565 -12289 -12804 -15255 -12439 -9955 -15157 -16672 -19891
11924 -19891 -23672 -23941 -19956 -11691 -17736 -13873 -4770 -986 762 7462 3332 10453 5086 -289 -15432
11909 -15432 -23946 -27491 -22257 -10421 -13710 -23058 -34298 -31896 -24650 -24272 -27731 -29276 -19550 -19183
11895a9183P921k989K929K01o035P9j5874O127J4884J4870L412j5952M970R960
11881E320r791j0753p617J4487m06k629O544J1886P996j1901j7661m203K27j4242
11867c2743r424J106O925K0302J845j4348P087Q198m235J687P530N102r198R703
11853d63J9817J9648O901m28p559j1896K4543L4886L0357L4541K4701L812n083
11840A73777o916k4388m3599k0325j3405p24k600j556p980L082M293Q94j3978
11827D6575J4933K2966K3910K7501J7633J0795K3986N1490N8941M1606K6560n626
11815C61270l4113l7346m8073n3551m4337l1006p649q2J2562J6415K2383J7002
11803A73475K4160M7671M3741M6530L8662L2649J318m0607k9701j5967q693j148
$$ plain form
11895 -19183 -11262 -14251 -11322 -11121 -17156 -17077 -32951 -26824 -11940 2930 6342 -9610 -4640 5320
11881 5320 -4471 -15224 -22841 -8354 -8760 -11389 -4845 7041 15037 3136 -14525 -18728 -18501 -32743
11867 -32743 -42167 -41061 -34136 -13834 -11989 -26337 -19250 -11052 -15287 -13600 -6070 -968 -10166 -463
11853 -463 19354 39002 45903 45475 37916 26020 50563 85449 115806 150347 175048 178860 173777
11840 173777 166861 142473 98874 78549 65144 64420 61820 60264 52284 55366 59659 60553 46575
11827 46575 61508 84474 108384 135885 153518 164313 188299 239789 298730 340336 366896 361270
11815 361270 327157 289811 241738 188187 143850 112844 105195 105113 117675 134090 156473 173475
11803 173475 197635 245306 289047 335577 374239 406888 408206 367599 337898 321931 313238 312090
11791C12090j518j5282j5451l6441m1661k2217M767J7060J4956J2536L2249N5632
11779C16720N3055P4109Q3746Q2368P2201K5555k1544m6329j03451j31201j05785
11768B99444p9419l4056j7882j5293k761k442J242J0147J3159K0629K0623J8709
11756B32100J6827L7323N6469O5159M7138M1001n831j9895j3699l8175m9550k6936
11744C41931m9899n7919l5517j2203j2010n769j4731N105Q609J8818L2982O0984
11732B80381M2006L5217J6515j0992l7983m4045o6136m9224k7371k9351j8441
11721I0576p713M50L708N487j049p660J334k425J09L494m195J9792K1099K4052
11707A47059L1346K2130J3784j3756l4400m5420k9200j4805n421k2895j3061p65
$$ plain form
11791 312090 310572 295290 279839 243398 201737 179520 184287 201347 216303 228839 261088 316720
11779 316720 369775 443884 527630 609998 682199 707754 686210 639881 536430 405229 299444
11768 299444 220025 185969 168087 152794 150033 147591 148833 158980 172139 192768 213391 232100
11756 232100 248927 286250 342719 407878 455016 496017 490186 470291 456592 418417 368867 341931
11744 341931 292032 234113 198596 186393 174383 168614 153883 158988 167597 186415 219397 280381
11732 280381 322387 357604 374119 363127 325144 281099 214963 165739 138368 109017 90576
11721 90576 82863 83313 87021 92508 91459 83799 85133 82708 82817 86311 82116 101908 123007 147059
11707 147059 178405 200535 214319 200563 166163 120743 91543 76738 71317 48422 35361 34596
11695C4596J297k1097j4801N095R401J1561l195j9538n018L824q841K503j14j7009
11681b1336Q987J8206j786k836M205J5444J1618r689j3519Q145R092j0545q502
11668G484j2368N176P634L509k862n491P115m672j5913L152J2383j380r581K435
11654c379L429L040R322J9257O204J0245k773Q60j81j2404m449m828Q86j966r514
11639A3749Q84R474k090n436n01j1652K641O350o585o410R003O104J983N040J0630
11624C3184J8421m84q850k1000k581J3008P391N064n447M336o954j9682J224n035
11610A2595k19j2866o177R710J3472R624P40l873L117K89K693n349l159k485p319
11595A0793K699k763l777M897J5160P907j8661j9022L202M548k556M758O219K279
$$ plain form
11695 34596 35893 14796 -5 5090 14491 26052 22857 3319 -1699 2125 -6716 -4213 -4327 -21336
11681 -21336 -12349 5857 4071 1235 5440 20884 32502 22813 9294 17439 26531 15986 7484
11668 7484 -4884 292 7926 11435 8573 3082 10197 5525 -10388 -7236 5147 3767 -5814 -3379
11654 -3379 50 3090 12412 31669 37873 48118 45345 46205 46024 33620 29171 24343 25229 23263 13749
11639 13749 14633 24107 22017 16581 16080 4428 7069 13419 6834 424 9427 15531 17514 22554 33184
11624 33184 51605 51121 42271 21271 18690 31698 39089 44153 38706 43042 36088 16406 17630 12595
11610 12595 12376 -490 -6667 3043 16515 26139 26879 23006 26123 26412 29105 23756 20597 18112 10793
11595 10793 13492 10729 6952 11849 27009 34916 16255 -2767 435 4983 2427 7185 13404 15683
11581A5683o527m495J2716K686o840J1115M537O015J7006r702J438O071l450j392
11567D4861j629j2794k424p043m42K71j405M351q583J5273M325r470q060o812
11553A0419K10K049j13K299L599n145p8J1114j978Q792L90j5336n850j8714m391
11538a2733R289L724L191j514l047M95J5889n513j1248O914k537j802o158Q355
11524C305K9201Q846r879J0210O706j0516n982J638r864k292q082j1905R144J5857
11510B6387J316k761j2283J0995L460j077N799Q111L381L900o847j502q519j2067
11496A8293J124p248m846k164k053o687P949K778J0329J3920R124O658j858m133
11482D1186J7886M897l333J5456N790Q374q92j6432j0694j5287p294j2190j4792
$$ plain form
11581 15683 9156 4661 17377 20063 13223 24338 28875 34890 51896 42194 43632 49703 46253 44861
11567 44861 43232 30438 28014 20971 20529 20800 19395 23746 15163 30436 34761 25291 17231 10419
11553 10419 10629 12678 12565 14864 18463 13318 13240 24354 22376 31168 31558 16222 10372 -8342 -12733
11538 -12733 -3444 280 3471 1957 -1090 -595 15294 9781 -1467 5447 2910 1108 -5050 3305
11524 3305 32506 41352 31473 41683 48389 37873 31891 33529 23665 21373 13291 1386 10530 26387
11510 26387 27703 24942 12659 23654 27114 26037 31836 39947 43328 47228 40381 38879 30360 18293
11496 18293 19417 12169 7323 5159 3106 -3581 4368 7146 17475 31395 40519 47177 45319 41186
11482 41186 59072 63969 60636 76092 81882 90256 89364 72932 62238 46951 39657 27467 12675
11469A2675R723J7471N070M61P289K430K968J2965J1010M319P63O69N663J4774
11455A08250p974j4398J69q607o240r60o144l698M138p18J5317J8358J357J2304
11441A11154K0991J0118K35R604R19J365j0559j0854j896j7481n880m430j3314
11428H9972j1776j4359n345o374O786J5634J2824j1463J8730J4983K60L009n68
11415A12313R363Q271J0607N204k146o052p545j0754q139j3196o324m4l879m715
11401H2964r46j2084k6331P198J6605L3668J6416M530J2033J1125J2272N49j8240
11388A39759j6720l031j1487n220r295q015P455K491R682J9871J1110N904J384
11375A43888M120M639j694l710m689R35J9708J2911j705p956j1152r047l765J679
$$ plain form
11469 12675 22398 39869 44939 45400 52689 55119 58087 71052 82062 86381 87144 87813 93476 108250
11455 108250 100276 85878 86047 77440 71200 70240 64096 60398 64536 63818 79135 97493 98850 111154
11441 111154 132145 142263 142498 152102 153021 154386 143827 132973 131077 113596 107716 103286 89972
11428 89972 78196 63837 58492 52118 58904 74538 87362 75899 94629 109612 109872 112881 112313
11415 112313 121676 129947 140554 145758 143612 137560 130015 119261 111122 97926 91602 91558 87679 82964
11401 82964 82018 69934 43603 50801 67406 101074 117490 122020 134053 145178 157450 157999 139759
11388 139759 123039 120008 108521 103301 94006 85991 93446 95937 105619 125490 136600 142504 143888
11375 143888 148008 152647 150953 147243 142554 143489 163197 176108 174403 166447 155295 146248 142483 144162
11361A44162r828p565L610J4697R609P593J7646K7098K1936J4820J1417O958P53
11348B62906J1753j2638j0036J2667J4985R765J7691K760j942q909o918k672J0412
11335B99824K617O758J0772J9716J0649o925p892n61J0079Q699O328J1664J5261
11322C86989O481k2857j2986O346J055J5800K1559L1086M2624K9493L1465M1955
11310E79010Q125P47M870l732L898N925M11J2485n700j160J1477J0434Q116J9223
11296F54129J4097J8219K2211N2157O0735O1756P6698Q5697P9622N7947L8602
11285A221870j1593o0898m6669n449n281M685K7438M5440N9855N9876P1552J05831
11273A466657J07873J11433J16542J26388J59070J78757K05296K17982K14558
$$ plain form
11361 144162 134334 126769 130379 145076 154685 162278 179924 207022 228958 243778 255195 262153 262906
11348 262906 274659 262021 251985 264652 279637 289402 307093 309853 307911 299002 292084 289412 299824
11335 299824 302441 309199 319971 339687 350336 343411 335519 334958 345037 353736 360064 371728 386989
11322 386989 393470 370613 357627 363973 365028 380828 402387 433473 476097 505590 537055 579010
11310 579010 587135 587882 592752 589020 592918 598843 599254 611739 606039 604879 616356 626790 634906 654129
11296 654129 668226 686445 708656 760813 821548 883304 960002 1045699 1125321 1183268 1221870
11285 1221870 1210277 1149379 1102710 1097261 1091980 1096665 1124103 1169543 1229398 1289274 1360826 1466657
11273 1466657 1574530 1685963 1802505 1928893 2087963 2266720 2472016 2689998 2904556
11264B904556K24692K53051K92270L70244M44118N44054P25188R59108J253231
11255G970512J694585K253143K925808L703181M666182N486217M568293K101058
11247C5368979l26124n139925p833977n641311l118008j704039r21610m42870
11239A0241115r8524J74606L93493O08120Q74489J182844J601687K208406K999311
11230B0185547L986621N179251O630824Q166092Q609624P331979N900468R03749
11222F6894155n252477o615395r194409j0294793o973322l701995j696357m52671
11214B2712736M87263J383319K366839L472762M839517O422812Q325688J0113565
11206F0124501R662392P689790L773148l836597p867578q476993o224560j715106
$$ plain form
11264 2904556 3129248 3382299 3674569 4044813 4488931 5032985 5758173 6717281 7970512
11255 7970512 9665097 11918240 14844048 18547229 23213411 28699628 33267921 35368979
11247 35368979 35042855 29902930 22068953 16427642 13309634 11605595 10683985 10241115
11239 10241115 10142591 10317197 10710690 11318810 12193299 13376143 14977830 17186236 20185547
11230 20185547 24172168 29351419 35982243 44148335 52757959 60089938 65990406 66894155
11222 66894155 61641678 55026283 45831874 35537081 28563759 24861764 23165407 22712736
11214 22712736 23199999 24583318 26950157 30422919 35262436 41685248 50010936 60124501
11206 60124501 69786893 77476683 81249831 77413234 69545656 61068663 54844103 53128997
11198E3128997J737629K473540J068019o87950m811789p032403m329571r60473
11190D0585999J588759L715071N851435Q327038J0876920J1919204J1823100J1913412
11182A06600938R751111O513384J731147k914855j3584579k4856184k1437435
11175F1803527j3077912p704732m764170k969991j757341q80572k61898L05194
11167C0692105R58473J723906K760188M086321N663687P545126R732804J1282672
11159G4445282J0495556Q802422L568513k834926n301161p861280q111485p273446
11151F5929475j0265600j1043458p394488m102228k089373p92171K43421J352412
11143C1837990K537057L863307N449601P298633Q814482P814295O061428K662806
$$ plain form
11198 53128997 54866626 57340166 58408185 57720235 52908446 45876043 41546472 40585999
11190 40585999 42174758 45889829 51741264 60068302 70945222 82864426 94687526 106600938
11182 106600938 116352049 122865433 124596580 121681725 108097146 83240962 61803527
11175 61803527 48725615 41020883 36256713 33286722 31529381 30648809 30386911 30692105
11167 30692105 31650578 33374484 36134672 40220993 45884680 53429806 63162610 74445282
11159 74445282 84940838 93743260 97311773 94476847 89175686 81314406 73202921 65929475
11151 65929475 55663875 44620417 37225929 33123701 31034328 30242157 30485578 31837990
11143 31837990 34375047 38238354 43687955 50986588 59801070 67615365 73676793 76339599
11135G6339599n431821q783277r289768j0700896q796469n709574l629586k379690
11127B1618518j647733j224352r01428o64693m61830j92053P6583L77891Q19586
11118A7800489J377811K057635K867321L768705M822040N471146L876605J243396
11110D3285148j890704p364078q890207o075802l636175k322852j630504j205950
11102A0268876r07632o96801n91201m99800m38986l86342l25362k92676k66393
11093E863683k48100k39255k64056k40731j90376j49004r9823o8646q4592j44850
11083D134250k00009k05810j89849j88689j73434j69610j63446j79934j64052
11074B499417j39245j30571r1520r2220q9598q2229r4652q7110o9833p3090p1441
$$ plain form
11135 76339599 70907778 62124501 52834733 42133837 33337368 27627794 23998208 21618518
11127 21618518 19970785 18746433 17845005 17180312 16718482 16526429 16603012 16980903 17800489
11118 17800489 19178300 21235935 24103256 27871961 32694001 38165147 42041752 43285148
11110 43285148 41394444 34030366 25140159 19064357 15428182 13105330 11474826 10268876
11102 10268876 9361244 8664443 8073242 7573442 7134456 6748114 6422752 6130076 5863683
11093 5863683 5615583 5376328 5112272 4871541 4681165 4532161 4432338 4363692 4279100 4134250
11083 4134250 3934241 3728431 3538582 3349893 3176459 3006849 2843403 2663469 2499417
11074 2499417 2360172 2229601 2138081 2045861 1956263 1874034 1779382 1692272 1622439 1549349 1477908
11063A477908p0573n7739n0712m9304m7585l5955l5168m1810m6955l9506m2448
11052I60153l7914n2233n6314k3857l0043j2880r277k6353j7516k4430j9250j5310
11040F34776j4582j2693j7708j1876J312O264j53l081L241p01j4792k3269O75
11027E47413J6255J0779J2214K574m312N246j8635m6858l2224k1301l0187l225
11015D37739O887L676p176j6900m842q762k0199k0586j5346m146Q169R316j5472
11002C52358k890J9599m125l482K7O075N065j438o008r08j882J1368J8841j7419
10988C75181j9477r615M709R370j2835k2482k4065p950j49k647o068P167Q01j825
10974B90115J444Q827k507q668j920R060J608j1077m560j6532o686M012o64j2240
$$ plain form
11063 1477908 1407335 1349596 1298884 1249580 1201995 1166040 1130872 1089062 1042107 1002601 960153
11052 960153 922239 870006 813692 789835 759792 746912 737635 711282 693766 669336 650086 634776
11040 634776 620194 607501 589793 577917 579229 585493 585340 582259 585500 584799 570007 546738 547413
11027 547413 563668 574447 586661 589235 584923 590169 571534 524676 492452 471151 440964 437739
11015 437739 444626 448302 441126 424226 419384 410622 390423 369837 354491 350345 358514 367830 352358
11002 352358 349468 369067 364942 361460 361487 367562 372627 371189 365181 364273 362391 373759 392600 375181
10988 375181 355704 346089 350798 360168 347333 324851 300786 292836 292687 290040 283972 291139 291940 290115
10974 290115 291559 300386 297879 289211 287291 296351 297959 286882 282322 265790 259104 263116 262452 250212
10960B50212j2466n815J2597Q357m015q840n670j9487l699J1214m012J689M935
10947B25000L817J5615j0427j9957q341k528J897J3699J2978Q66p929j882J798
10934B24606N243l924K358Q80r711j5393k912l081j0512k1969j1594m08r26J535
10920A54192L40j1120M23N42N164j3073j4826l469O328M218K441J1480L042o927
10906A38755n971n454J924p145J2666R21m075l765K192j5876j467L354J0875O045
10892A32979k712M283j628k491m539n827j7532Q59J0666r87j1520m291M734j0719
10878I1275p854Q940P132l415J2524J963J1113J4443J749j6571j0328j2595r691
10865H8685Q290J3739L796q961J56q611n482j0568N795J219j8667o794M20R478
$$ plain form
10960 250212 237746 231931 244528 252885 248870 240030 234360 214873 211174 222388 218376 220065 225000
10947 225000 228817 244432 234005 214048 205707 203179 205076 218775 231753 232619 224690 222808 224606
10934 224606 229849 225925 228283 229163 219452 204059 201147 198066 187554 165585 153991 153583 152657 154192
10920 154192 154532 143412 143835 144377 149541 136468 121642 118173 124501 128719 131160 142640 145682 138755
10906 138755 132784 127330 129254 122109 134775 135696 131621 127856 130048 114172 112705 116059 126934 132979
10892 132979 130267 134550 132922 130431 125892 120065 102533 103392 114058 113071 101551 97260 101994 91275
10878 91275 83421 92361 99493 96078 108602 110565 121678 136121 137870 121299 110971 98376 88685
10865 88685 96975 110714 114510 105549 105705 97094 91612 81044 86839 88058 69391 62597 63017 72495
10851G2495J2613p75K070Q527P118j0561L795N24j0928P62O898M074p445j1243
10837G7924J967j0466J288j805R52q875r838J4344R247P912j2408o422j18K683
10823F6385J1075j069J760k808l867j541r61p018o84J4508m157n379j9188n184
10809D1872O651M717k680o35J5081P686o588k6687j2689j0767O618J3508R49p627
10795B9409R812m925m139l985Q86J683O02q554m081m131q687j511J3555O559r37
10780B1556L309j2780k915J4465r708L008j855K650p516O49P056R336M21r246
10766A8430Q614J590j9837K467O682j816l832k514j088n418N572l240L830l857
10752E583r47J4013J3788o176J234J530M178p730M051j270r039r719o76q651q500
$$ plain form
10851 72495 85108 84333 86403 94930 102048 91487 95282 95806 84878 85640 92538 96612 89167 77924
10837 77924 79891 69425 70713 68908 69860 60985 51147 65491 74738 82650 70242 63820 63702 66385
10823 66385 77460 76391 78151 75343 71476 69935 68974 61956 61272 75780 71623 66244 47056 41872
10809 41872 48523 53240 50560 49925 65006 72692 66104 39417 26728 15961 22579 36087 37036 29409
10795 29409 39221 34296 30157 26172 27058 28741 29343 20789 16708 12577 3890 2379 15934 22493 21556
10780 21556 24865 12085 9170 23635 13927 16935 15080 17730 10214 10863 17919 27255 27676 18430
10766 18430 27044 28634 8797 11264 17946 16130 12298 9784 8696 3278 8850 5610 9440 5583
10752 5583 4636 18649 32437 26261 27495 29025 33203 25473 29524 28254 19215 9496 8820 169 -8331
10737h331j026N021m924N034J0157K732M945N443m932K824k869K49J941l151o040
10722G073J846j184k038o776M029J2062K4k544j592R369J2216j5718J1405J4592
10708D2764J975j946m362n047j9508l24O644J242m445p209m925P352O524m893
10694A3842o888j286K657J561Q773J2570J008m727J575J9339K4517K128j6448
10681E8621j9232n219j714q753p340k386L985K79M51l599p080J0742J2411M520
10667C5686J3214J2750J9615j4549j9919q76l176J7005M099m199L530j2602N853
10654E6431M480J8167K4778K4352K7076K9552J6870N921j263j5037k9773l0776
10642A30778j6609m213j8182m648P132J2605j710r088j2427O962K2770J5934J4556
$$ plain form
10737 -8331 -9357 -4336 -9260 -4226 5931 8663 13608 19051 14119 16943 14074 14323 16264 13113 7073
10722 7073 8919 7735 5697 -1079 2950 15012 15036 12492 10900 20269 32485 16767 28172 42764
10708 42764 44739 42793 38431 33384 13876 13552 20196 21438 16993 9784 4859 12211 18735 13842
10694 13842 6954 5668 8325 9886 18659 31229 32237 27510 29085 48424 72941 75069 58621
10681 58621 39389 34170 32456 23703 16363 13977 17962 18241 18692 15093 8013 18755 31166 35686
10667 35686 48900 61650 81265 66716 46797 45921 42745 59750 63849 59650 63180 50578 56431
10654 56431 60911 79078 103856 128208 155284 184836 201706 207627 206364 191327 161554 130778
10642 130778 114169 109956 91774 87126 94258 106863 105153 96065 83638 90600 113370 129304 143860
10629A43860J1510L4854M1190M1742O1680M8738J5362q58l0708k5848m6812o8545
10617B26165m0373q783k7753k1359M989J6124K1881J9505K5707K3283M0477M6212
10605C26075M7972L3554K8685J825l8167m8139l7365j7053k332K1520P715J214
10593C25504l45o268k8761j0442N916N472K9762M6251M7508N4004N9877M0612
10581E69090L8985N1079J9318q542o0305j28897j27133q9891m8981r483j3908
10570A91332j6604q316n990J434K160N924J8801K9270L3057L5533N2478P4383
10558D13462P3997O1630L0748o175n2884n1876l8722m6458p0322p4980l4706j5034
10546A88680j7127j6248j3451R204J2851K4646L0901L7476M0970N7091M4142K1224
$$ plain form
10629 143860 155370 190224 231414 273156 334836 383574 398936 398078 367370 341522 294710 226165
10617 226165 185792 177009 149256 127897 132886 149010 170891 190396 216103 239386 279863 326075
10605 326075 374047 407601 436286 438111 399944 351805 314440 297387 295055 316575 324290 325504
10593 325504 325159 318891 290130 279688 285604 291076 320838 367089 414597 468601 528478 569090
10581 569090 608075 659154 678472 669930 609625 480728 353595 263704 214723 205240 191332
10570 191332 174728 166412 160422 161856 164016 169940 188741 218011 251068 286601 339079 413462
10558 413462 487459 549089 579837 573662 520778 468902 430180 383722 313400 238420 203714 188680
10546 188680 171553 155305 141854 151058 163909 188555 219456 256932 297902 354993 399135 420359
10534D20359J1132l2744p5265p7935n2106j4916k7538l0736j2575j1575o767j5427
10522G3907J2231J550o209L740J9768J0842Q760L225J9013L4178M2977K7399j3081
10509B38300p198l0748m6107m0182l3807j4273j976o368p730K827R0K29L454j5003
10495D1508j0549j800j0487J1776o500k613j2096P380P898R32r683J30j368L418
10481A7946K502J745p139N061m710k275j330q990p841M522K0926P065l758P90
10467B4514r60r658m223j8631n622N786O74m463j95J6882O66J105n023j9654N906
10452a2896J3068l441L163L87M023J0043o160l4l451m967j366M3j48r194l160
10437a4090k667K509P234P05J1485j60q752Q500Q483J327r241q923K468m914J1209
$$ plain form
10534 420359 431491 398747 323482 245547 193441 178525 150987 120251 107676 96101 89334 73907
10522 73907 86138 87688 81479 85219 104987 115829 124589 127814 146827 181005 223982 251381 238300
10509 238300 231102 200354 154247 114065 80258 65985 64009 57641 49911 52738 52828 53057 56511 41508
10495 41508 30959 29159 18672 30448 23948 21335 9239 16619 24517 25449 15766 15896 14528 17946
10481 17946 20448 22193 15054 20115 15405 13130 11800 2810 -5031 -509 20417 27482 23724 24514
10467 24514 23554 13896 9673 -8958 -14580 -8794 -8120 -12583 -12778 4104 4770 5875 852 -18802 -12896
10452 -12896 172 -3269 -106 281 4304 14347 8187 8153 4702 -265 -1631 -1588 -1736 -10930 -14090
10437 -14090 -16757 -14248 -7014 -6309 5176 5016 -3736 4764 13247 14574 5333 -3590 -1122 -6036 5173
10422E173R843N625q715o807q69j0709J9495J1824m523k517L711n369j464O143
10408B0841M489K233n704j3792L393j0611o281n694j262j44r249q801J0082R55
10394a9545J190j782O790J0108J4935k296k807r603m39q960J551K0106J0804q772
10380A1280o281k104O354p875p947N969J0829j5749j9303O867M967O80J2420J1267
10366A1374q038j2841J929N084P02K425O329J1760J327j6818q339r004J152L877
10352i081P030j9888k428J6418l687n56M961K654j065q149j45Q420j6603r197
10338c1316J6532P543R166K75j1819J645L550J333L226J6048K671K277k54n419
10324A5458l234J229q419k7420j2557J7751J1321M057J479L70o222P707O622j060
$$ plain form
10422 5173 15016 20641 11926 5119 4250 -6459 13036 24860 20337 17820 21531 16162 14698 20841
10408 20841 25330 27563 21859 8067 11460 849 -5432 -11126 -12388 -12532 -21781 -30582 -20500 -19545
10394 -19545 -18355 -20137 -13347 -3239 11696 9400 6593 -3010 -3449 -12409 -10858 9248 20052 11280
10380 11280 4999 2895 9249 1374 -6573 -604 10225 -5524 -24827 -17960 -12993 -12313 107 11374
10366 11374 3336 -9505 -7576 -2492 -1790 635 6964 18724 20051 3233 -5106 -14110 -12958 -9081
10352 -9081 -2051 -21939 -24367 -7949 -11636 -12192 -7231 -4577 -5642 -13791 -13936 -5516 -22119 -31316
10338 -31316 -14784 -7241 1925 2200 -9619 -7974 -4424 -3091 135 16183 18854 21131 20877 15458
10324 15458 12224 13453 5034 -22386 -34943 -17192 -5871 -1814 -335 35 -6187 1520 8142 7082
10310G082j3537m310o336N276J1168K678N449o17N77o174j0160m464J2625J4397
10296A3654r853j8556j4059j0884J9548j674N645Q888M75J11O755N620j793O044
10282I921Q217q660k927r653o236K839o099o342J2753J8417o620j0426m712J078
10268h450k31L518L144L985j3806r659J678J6031p76J600O03o729r022m66p633
10253b6213k85O473J2923O356p257o338J850j422L067J1290J0046m894m838P74
10239A532q037O42M647j0762j6009l1K810R201p052p825K285K046Q605n437M295
10224a9090q012n820r889J460M899K82J0696k536n10Q665k928J4998N509m476
10210f752P692r870j2570Q050P95l978l734O273J012M005k075N552M484q380j6973
$$ plain form
10310 7082 -6455 -10765 -17101 -11825 -657 2021 7470 6853 7430 1256 -8904 -13368 -743 13654
10296 13654 3801 -14755 -28814 -39698 -20150 -21824 -16179 -7291 -6816 -6705 50 5670 3877 9921
10282 9921 18138 9478 6551 -3102 -9338 -6499 -12598 -18940 -6187 12230 5610 -4816 -9528 -8450
10268 -8450 -8681 -5163 -2019 1966 -11840 -21499 -19821 -3790 -4566 -2966 -2363 -9092 -18114 -18580 -26213
10253 -26213 -26498 -20025 -7102 -746 -8003 -14341 -12491 -13913 -10846 444 10490 5596 758 1532
10239 1532 -6505 -5863 -1216 -11978 -27987 -28018 -25208 -16007 -23059 -30884 -28599 -26553 -17948 -23385 -19090
10224 -19090 -27102 -32922 -42811 -41351 -36452 -36170 -25474 -28010 -28520 -19855 -22783 -7785 -2276 -6752
10210 -6752 940 -8930 -21500 -13450 -12655 -16633 -20367 -14094 -13082 -9077 -11152 -5600 -1116 -9496 -26469
10195b6469m852n962r50J0712L556m312O347K694J787L688q002j199L404M737
10181a4821K689L46r689l299Q066N353K064j0548l343J4513o940o401J737m605
10167b4878J301n246r457p780N517R674J4939L779J2468P471n463q870j716j749
10153a0010o877l959N937q486q14J5516K2467R187r170l796j1670r177J4254l944
10139e42q974J2946M195P409J730L0j1892O7L242L757J3208p477k099J997k939
10124A4658m146p276n26m71j4393M892M323o463p622q571N245J5350J5907m256
10110F651j7775j738j6907k771J3914K1034n997p949r463j508J0622k187k901
10097a6975L471m241j6468p099J193K2996J0647K719k292q803o134r704k560J2917
$$ plain form
10195 -26469 -31321 -37283 -38233 -27521 -23965 -28277 -21930 -19236 -17449 -13761 -21763 -22962 -19558 -14821
10181 -14821 -12132 -11786 -21475 -24774 -16708 -11355 -9291 -19839 -23182 -8669 -15609 -22010 -20273 -24878
10167 -24878 -23577 -28823 -38280 -46060 -40543 -30869 -15930 -12151 317 7788 2325 -6545 -8261 -10010
10153 -10010 -16887 -20846 -14909 -23395 -24209 -8693 13774 22961 13791 9995 -1675 -10852 3402 -542
10139 -542 -9516 3430 7625 15034 16764 16794 4902 4969 8211 11968 25176 17699 15600 17597 14658
10124 14658 10512 3236 2710 2239 -12154 -7262 -2939 -9402 -17024 -25595 -20350 -5000 10907 6651
10110 6651 -11124 -12862 -29769 -32540 -18626 2408 -3589 -11538 -21001 -22509 -11887 -14074 -16975
10097 -16975 -13504 -17745 -34213 -41312 -40119 -17123 -6476 -3757 -6049 -14852 -20986 -30690 -33250 -20333
10083b0333J3596R843n583j3591P060J2307k246n492l349l34P210j761l127r469
10069a5269J932n593r745k536Q324J3782J0131j3508Q6K977N154N968J1336n979
10055G060k2082p752K0660J781j4795J154J462N525L258l556M074j2815m334K610
10041a7750j2057r54K475L902M761l28L798Q967r785k498j4583P908L535N711
10027a6898j011L808n1N584P049j6426O667Q183r034k665o2m45k158N320j646
10012a3785J988j227p213O210Q044J1321m052j4776k44K694K64Q27O089r658j3536
9997b7054M946J1464p114q858L969Q14N436J0065k2440j1497L033J3403J6155
9984g678m020j3601q896Q516J481j4336q742j162P483J4254J3421q148j5465l987
$$ plain form
10083 -20333 -6737 3106 -2477 -16068 -9008 3299 1053 -4439 -7788 -8122 -912 -2673 -5800 -15269
10069 -15269 -13337 -18930 -28675 -31211 -22887 -9105 1026 -12482 -12396 -9419 -4265 1703 13039 7060
10055 7060 -15022 -22774 -2114 -333 -15128 -13974 -12512 -6987 -3729 -7285 -3211 -16026 -20360 -17750
10041 -17750 -29807 -30761 -28286 -24384 -19623 -19951 -16153 -7186 -16971 -19469 -34052 -26144 -22609 -16898
10027 -16898 -17909 -14101 -14152 -8568 -1519 -17945 -11278 -3095 -12129 -14794 -14856 -15301 -17459 -12139 -13785
10012 -13785 -11797 -13024 -20237 -14027 -5983 5338 1286 -13490 -13734 -11040 -10776 -9949 -3860 -13518 -27054
9997 -27054 -22108 -10644 -17758 -26616 -22647 -21833 -16397 -6332 -28772 -40269 -37236 -23833 -7678
9984 -7678 -11698 -25299 -34195 -25679 -24198 -38534 -47276 -48438 -40955 -26701 -13280 -21428 -36893 -40880
9970d0880J6732P149o894o850n740L50k39J021m430l812N90K621Q499K514k193
9955c1562L755R306M087m684n088L803M275j063k319J2438j518j68J78P78K030
9940e752r88l308J1232p346Q672O585n465j5127j2869j1934o29R682R625N729
9926a1893l684K009m867J1279k629j1783o267O306r48p458n306j22R460M56K50
9911b5197q47r93J5566J1051O904J041P592k4548j5491N442J583N626O231J1786
9897E746l583k3352K944J3820J4208L583p895l615r43j0403j4179j1504O020K706
9883b6447J0134R793p294P227J3341j5552Q52l551l777Q014J98p35L634o712m907
9868a5782n052l229Q66n813j3254J072J0008Q015l760q90J5015K2393J3609o615
$$ plain form
9970 -40880 -24148 -16999 -23893 -30743 -36483 -36133 -36372 -35351 -39781 -43593 -43003 -40382 -31883 -29369 -31562
9955 -31562 -27807 -18501 -14414 -19098 -24186 -20383 -16108 -17171 -19490 -7052 -8570 -8738 -8560 -7782 -5752
9940 -5752 -6740 -10048 1184 -6162 2510 9095 3630 -11497 -24366 -36300 -36929 -27247 -17622 -11893
9926 -11893 -15577 -13568 -18435 -7156 -9785 -21568 -27835 -21529 -22477 -29935 -35241 -35363 -25903 -25447 -25197
9911 -25197 -26044 -27037 -11471 -420 6484 7525 15117 -9431 -24922 -19480 -17897 -12271 -6040 5746
9897 5746 2163 -21189 -18245 -4425 9783 13366 5471 1856 913 -9490 -23669 -35173 -29153 -26447
9883 -26447 -16313 -6520 -13814 -6587 6754 -8798 -7946 -11497 -15274 -7260 -7062 -7797 -4163 -10875 -15782
9868 -15782 -20834 -24063 -23197 -29010 -42264 -41192 -31184 -23169 -26929 -27819 -12804 9589 23198 16583
9854A6583q963k784n260k0666N156r36j5499p866n550j957P871J0484J4923l780
9840a8244j3711k919j904R937P679j0905Q89K220M42J0416J9994J125j138K231
9826F112l931n000p840J20K413O276O798l413j1758p383j110k464n9l987K246
9811b2980j0324J836J152q83l029j071o94J3587J0854j102j0043J848M749n904
9797b2004o856j2351R783N18j091N281N360P739m502k467p15j108q633l996K470
9782c2572J4401o288k264R392o516j47l128j755q657J499J1619P990m372j3753
9768c4551q284L075N811K3676m377K380j4752j1624J09J8414M067j1374r116K596
9754c3950O311J3172Q40n035Q188M484k0005L770n263O767P832P097L100q19j
$$ plain form
9854 16583 7620 4836 -424 -21090 -15934 -16870 -32369 -40235 -45785 -47742 -39871 -29387 -14464 -18244
9840 -18244 -31955 -34874 -36778 -26841 -19162 -30067 -29178 -26958 -26516 -16100 3894 5019 3881 6112
9826 6112 2181 -2819 -10659 -10539 -8126 -1850 4948 1535 -10223 -17606 -18716 -21180 -21239 -25226 -22980
9811 -22980 -33304 -31468 -30316 -31199 -34228 -35299 -35993 -22406 -11552 -12654 -22697 -20849 -16100 -22004
9797 -22004 -28860 -41211 -31428 -30910 -32001 -26720 -21360 -13621 -18123 -20590 -21305 -22413 -31046 -35042 -32572
9782 -32572 -18171 -24459 -26723 -17331 -23847 -23994 -27122 -28877 -37534 -36035 -24416 -16426 -20798 -34551
9768 -34551 -42835 -39760 -33949 -10273 -14650 -12270 -27022 -38646 -38537 -20123 -16056 -27430 -36546 -33950
9754 -33950 -27639 -14467 -13627 -18662 -10474 -5990 -25995 -22225 -27488 -20721 -12889 -5792 -2692 -3511 -3512
9739c512R940P256j8497p545j0824L433o316K351l793K93j500Q470j119N900j853
9724a7316m127k1608O896J1185M418Q726L153l869n329J843j3568N497R478m920
9710a9541j9209J0517L086O842p462K420K238R336J6874l56p143l312j238p368
9696a4316k1634j0137l278J2972P545J3007J5279R924J979j782l314p269j7662
9683a8686j7323r513Q060J5422J5415J526r690o070l594K544O205p476m899l225
9669c1304P954J3683M966n950j8480j1232P870J0902o08q535M520M925n138q230
9655c4657O594M493K491N251n599M770N946k638j8279m500j007m665N407J2214
9641b4179J0425o791L028J7208o659j0477O143J5932O22j9045o091J787k0494
$$ plain form
9739 -3512 6428 13684 -4813 -12358 -23182 -19749 -26065 -23714 -27507 -27214 -28714 -20244 -21363 -15463 -17316
9724 -17316 -21443 -43051 -36155 -24970 -20552 -11826 -8673 -12542 -17871 -16028 -29596 -24099 -14621 -19541
9710 -19541 -38750 -28233 -25147 -18305 -25767 -23347 -21109 -11773 5101 4745 -2398 -5710 -6948 -14316
9696 -14316 -35950 -46087 -49365 -36393 -28848 -15841 -562 9362 11341 9559 6245 -1024 -18686
9683 -18686 -36009 -45522 -37462 -22040 -6625 -5099 -14789 -20859 -24453 -21909 -15704 -23180 -28079 -31304
9669 -31304 -23350 -9667 -4701 -10651 -29131 -40363 -32493 -21591 -22199 -30734 -26214 -21289 -26427 -34657
9655 -34657 -28063 -23570 -21079 -15828 -21427 -16657 -10711 -13349 -31628 -36128 -37135 -41800 -36393 -24179
9641 -24179 -13754 -20545 -17517 -309 -6968 -17445 -11302 4630 5252 -13793 -19884 -18097 -38591
9628c8591j0526R253Q786O065p853r866O318J1557J480O06Q377o043j2194J2795
9614a9836M700n064K136Q383N371p43K114L756L631j2845k0371l770n861J4976
9600b3423J3180p341o932j137M812O563j4765O53P007J1132J3542J622r765m628
9586i480L66L942N457r18l760n357n143j8295K482K308p482l203J3265N447L620
9571a6751Q850P76K955j7107l208k3J0835r640j67P077l071p84l290k308l473
9556b9329p143P019L564j743M927R502n175j0564q94M527j39J0649k3p19q665
9541b4206q926q007j51m09M874J7229J660n153J651j2033m277N845M480q7j6142
9526d3652J7O314L264Q58Q83J2080K143j0851N579P554n350n979o521M850J1894
$$ plain form
9628 -38591 -49117 -39864 -31078 -25013 -32866 -42732 -36414 -24857 -23377 -22771 -14394 -20437 -32631 -19836
9614 -19836 -15136 -20200 -18064 -9681 -4310 -5053 -2939 817 4448 -8397 -28768 -32538 -38399 -23423
9600 -23423 -10243 -17584 -24516 -25653 -20841 -14278 -29043 -28390 -21383 -10251 3291 4913 -4852 -9480
9586 -9480 -9114 -5172 285 -633 -4393 -9750 -14893 -33188 -30706 -28398 -35880 -39083 -25818 -20371 -16751
9571 -16751 -7901 -7125 -4170 -21277 -24485 -24508 -13673 -23313 -23480 -16403 -19474 -20258 -23548 -25856 -29329
9556 -29329 -36472 -29453 -25889 -27632 -22705 -13203 -18378 -28942 -29836 -25309 -25448 -14799 -14822 -15541 -24206
9541 -24206 -33132 -41139 -41290 -41699 -36825 -19596 -17936 -23089 -21438 -33471 -37748 -31903 -27423 -27510 -43652
9526 -43652 -43635 -37321 -34057 -33199 -32316 -20236 -18093 -28944 -23365 -15811 -21161 -27140 -33661 -28811 -16917
9511a6917K420n615N965O102r282N248K336N748q01J2542l208k7928O03J6461
9497f326l917p985n370k85l538Q752K908Q679O555q188l715J583Q764J0711M852
9482A3480k1314j0010K794r170J971K825m039L551n82P784O848J886M714K769
9468C507Q261j356j5726o768M924j985M197P105n535j3185j285J063j933K578
9454a6138m998R354K116j1020L99J7425J4294j4920j9212l756m392O242J1064
9441a3542l480p813N608p80p535N852O605M999P503J841o985j0537Q74J0067N977
9426a346k318j3400n613P744J046j965M21M207m062q012J2502L109P17L620l169
9411f519m893P968j5991p875K642R468o830k286J162k038p781l762Q854J8051
$$ plain form
9511 -16917 -14497 -20112 -14147 -8045 -17327 -12079 -9743 -3995 -4796 7746 4538 -23390 -22787 -6326
9497 -6326 -10243 -18228 -23598 -23883 -27421 -18669 -15761 -7082 -527 -8715 -12430 -10847 -2083 8628 13480
9482 13480 -7834 -17844 -15050 -24220 -22249 -19424 -23463 -19912 -20494 -12710 -5862 -3976 738 3507
9468 3507 11768 10412 -5314 -12082 -7158 -9143 -4946 2159 -3376 -16561 -17846 -16783 -18716 -16138
9454 -16138 -21136 -11782 -9666 -20686 -20287 -2862 11432 -3488 -22700 -26456 -30848 -24606 -13542
9441 -13542 -17022 -24835 -19227 -20007 -27542 -21690 -15085 -10086 -2583 -742 -7727 -18264 -17390 -7323 -1346
9426 -1346 -3664 -17064 -22677 -14933 -13887 -15852 -15431 -11224 -15286 -23298 -10796 -7687 -6970 -3350 -6519
9411 -6519 -11412 -3444 -19435 -27310 -24668 -15200 -22030 -24316 -23154 -25192 -32973 -36735 -27881 -9830
9397i830R166o71J4638R470l247m355O581Q61Q903O421j944j5501L190o197j5596
9382A889M114j9431J067J7798M441k0r552j345p64j05o59K595n151K274Q91p957
9366i915p251J7059K5386j084l955j6883j6828q250R484L655N026j554q354N853
9352g611K76N754k303K11j685N990k390p819O672J1251p823j021l2k75L096l799
9336a508N643p01N1J1877J0933j0792j0196M917K0171K1655J336j4561L383L249
9322D5457j0347K83M449J1747J3452M43j3275j2012p629j0144j2581O35N916k301
9308A4093p969p592K672M387r557m977j6280m672J896J8497q80o99M884Q255l816
9293a758k140R72m419k786k215k553p951j1050R086J5348o537M027M658J0869
$$ plain form
9397 -9830 -664 -1335 13303 22773 19526 15171 21752 22613 31516 37937 35993 20492 23682 17485 1889
9382 1889 6003 -13428 -12361 5437 9878 9858 306 -1039 -1803 -1908 -2567 28 -5123 -2849 -1958 -9915
9366 -9915 -17166 -107 25279 24195 20240 3357 -13471 -21721 -12237 -8582 -3556 -5110 -13464 -7611
9352 -7611 -7335 -1581 -3884 -3673 -5358 632 -1758 -9577 -2905 8346 523 -498 -530 -805 2291 -1508
9336 -1508 4135 3434 3485 15362 26295 15503 5307 10224 30395 52050 53386 38825 42208 45457
9322 45457 35110 35393 39842 51589 65041 65484 52209 40197 32568 22424 9843 10478 16394 14093
9308 14093 6124 -1468 1204 5591 -3966 -8943 -25223 -29895 -27999 -9502 -10382 -11081 -6197 2058 -1758
9293 -1758 -3898 -2926 -7345 -10131 -12346 -14899 -22850 -33900 -24814 -9466 -16003 -11976 -7318 3551
9279C551R882O585j9322k4634j111k76N093K804R263m01M208L316L75j9009M335
9264a5341k649k958J2724L269K755j706j447L650n196r919j1739r565J2146J3777
9250a2199N78q251k651J3595M709J19m037N454k174j1955J679Q44K106o545l402
9235b2130P535M379k241k996j228j759l959p115q419L650J9060J1374j664p063
9221a2576n110n561j109P819j455K275Q146M596m058P935M77O276N447P68m183
9206I687m414J0164J2391N617j3798j4438l707l849j0582m998O911k731J1921
9193a826J1742q57j1563J097P840p79n963J996l15k488p103n204m308J036J0100
9178f595n497j4760M825M687P84R441Q020j7309p597J6819J1111L252j2359j843
$$ plain form
9279 3551 13433 20018 696 -23938 -25049 -25325 -20232 -17428 -8165 -8566 -4358 -1042 -667 -19676 -15341
9264 -15341 -17990 -20948 -8224 -4955 -2200 -3906 -5353 -1703 -6899 -16818 -28557 -38122 -25976 -12199
9250 -12199 -11621 -19872 -22523 -8928 -4219 -4100 -8137 -2683 -4857 -16812 -15133 -14289 -12183 -18728 -22130
9235 -22130 -14595 -10216 -12457 -15453 -16681 -18440 -22399 -29514 -37933 -34283 -15223 -3849 -5513 -12576
9221 -12576 -17686 -23247 -24356 -16537 -17992 -15717 -7571 -2975 -7033 902 1379 7655 13102 13870 9687
9206 9687 5273 15437 27828 33445 19647 5209 1502 -2347 -12929 -17927 -11016 -13747 -1826
9193 -1826 9916 9059 -2504 -1407 6433 5654 -309 1687 1372 -1116 -8219 -13423 -17731 -16695 -6595
9178 -6595 -12092 -26852 -22027 -17340 -16556 -7115 905 -16404 -24001 -7182 3929 7181 -5178 -7021
9164g021J3696M279q43J0043j130l523k099k396J706Q089O277o744O720J858Q808
9149C7720o237n688j673J3805l435j7495k0960R304J2197N438k638J3191J2914
9136D6443J165m706r713k208M268L311j4234m353n061l808J1933M07J1531K763
9122C7738m312J149j456N466L265J608l538J8252l61K326N784K268N281O461K496
9107H2427J9702J5517J0842J5684J3036R545K0026L6481K9310K5150K4990M3372
9095C46082O9430N6729N3623N0143O5524Q1318J02328J22900J63261J86835K75341
9084A573514M10950N92713P70011R97141J311358J746028K255769K043964P99268
9075A2500716J45862k082473l801946k523267j264739o75430m25574k97149j84456
$$ plain form
9164 -7021 6675 10954 10111 20154 19024 15501 13402 11006 12712 20801 27078 20334 27054 28912 37720
9149 37720 31483 25795 24122 37927 34492 16997 -3963 5341 17538 22976 20338 33529 46443
9136 46443 47608 42902 33189 30981 35249 38560 24326 19973 14912 11104 23037 23444 34975 37738
9122 37738 33426 34575 33119 38585 41850 43458 39920 58172 57811 60137 65921 68189 73470 79931 82427
9107 82427 102129 117646 128488 144172 157208 166753 186779 223260 252570 277720 302710 346082
9095 346082 415512 472241 525864 576007 641531 722849 825177 948077 1111338 1298173 1573514
9084 1573514 1984464 2577177 3347188 4344329 5655687 7401715 9657484 11701448 12500716
9075 12500716 12646578 10564105 6762159 4238892 2974153 2298723 1873149 1576000 1391544
9066A391544j30341j18458r8101p2651p0016o2789k3047m4047l8865j4256k3433
9055F95540k4064j3230J441J6654K1294J0533p820k7021k9773l7109m3489n5775
9043E07181m2405l4677l0251l0995l0577k3249k3629k676j5853j5940n721j6559
9031B34649j8913q538k1666j1057o528j3697O475q148j4415k0753n484J1543k40
9018A23228m978j2945q704j1370m221l47j1913r911R27J474k867Q494m903j5139
9004D6825k092m063K930O626J0196k671j5400j1716p347m08M908M925j4992j6841
8990H80K098Q116J3303J0797j2573j6561M677J2662P533k27j0342K553r132K863
8976A6647L533Q678R70r585p603L107R517J1815j126m425L952J1032j2446q946
$$ plain form
9066 1391544 1261203 1142745 1044644 971993 901977 839188 816141 772094 733229 718973 695540
9055 695540 671476 658246 659687 676341 697635 708168 700348 673327 643554 606445 562956 507181
9043 507181 464776 430099 399848 368853 338276 315027 291398 288722 272869 256929 251208 234649
9031 234649 215736 207198 185532 174475 167947 154250 160725 152577 138162 117409 111925 123468 123228
9018 123228 118250 105305 96601 85231 81010 80663 68750 58839 59766 61240 58373 66867 61964 46825
9004 46825 44733 40670 43600 50226 60422 57751 42351 30635 23288 22880 27788 32713 17721 880
8990 880 2978 11094 24397 35194 22621 6060 10737 23399 30932 30705 20363 22916 13784 16647
8976 16647 20180 28858 29828 20243 12640 15747 25264 37079 35953 31528 35480 46512 34066 25120
8962B5120J376j6072j3806r05O161l533Q113N895o752J976n552L715o223k914
8948c401j231K61J873r319n216J2792R834L800p520l392P152L557j8844L234J0647
8933D227O742K914J720p608q386k812j3211k053L484K230J0266p733j499k434
8919a4153l950N124K0308j175K394K853k630P66J2984J431l807j6386j0793j4450
8905b1484J1218Q275j592m315j0141N857J742n054J0676J1359j2706j4190j2022
8892c2377L250R562R26K499J3682K7276O668k2766r214L399L164J003J6816O202
8878C0090m249O172n203L467n240j2052n141j1918j7015K920Q886P18j621l416
8864a3602j32J282m786k401J713K999K687J6696Q460o119p855k1431k291J2436
$$ plain form
8962 25120 26496 10424 -3382 -4287 1874 -1659 6454 12349 5597 7573 2021 5736 -487 -3401
8948 -3401 -4632 -4371 -2498 -11817 -17033 -4241 5593 9393 1873 -1519 5633 9190 -9654 -6420 4227
8933 4227 10969 13883 15603 7995 -391 -3203 -16414 -18467 -14983 -12753 -2487 -10220 -11719 -14153
8919 -14153 -18103 -12979 7329 6154 8548 11401 8771 9537 22521 23952 20145 3759 -7034 -21484
8905 -21484 -10266 -1991 -3583 -7898 -18039 -12182 -10440 -15494 -4818 6541 -6165 -20355 -32377
8892 -32377 -29127 -19565 -18639 -16140 -2458 24818 31486 8720 -494 2905 6069 7072 23888 30090
8878 30090 25841 32013 26810 30277 25037 12985 7844 -4074 -21089 -18169 -9283 -8565 -10186 -13602
8864 -13602 -13734 -12452 -17238 -19639 -17926 -14927 -12240 4456 12916 6797 -1058 -22489 -24780 -12344
8850a2344J881K0890J22j1259r839J168q6k178M386J5976P257n327k351m367j3597
8835i668M778R43P223L073j4960o515K94N782J921l959K69R535K71r262p662K301
8819a5636P863o473n504j220m071K749K3205L064j162k808j1800J6128J3978L729
8805B2042j2647k994m378j8708m698R093O678l102K607L434k594j348P704N596
8791F685L12M355j067j4588n492J4935N954m454o790R884k768j719Q370m294k239
8776G084j1669o462K381n027J0844J2521K542m706j4285K793m822l449j934J4613
8762D24J5673J960J746R817p574n031j378R917m167j2733r843J0982n513q905
8748d625q686N143M962M179m429J0015K497O48J3257k141Q11J469L730j886R44
$$ plain form
8850 -12344 -10463 10427 10549 -710 -10549 -9381 -9467 -11645 -7259 8717 15974 10647 8296 3929 -9668
8835 -9668 -4890 -3947 3276 6349 -8611 -15126 -14832 -9050 -7129 -11088 -10819 -1284 -1013 -10275 -17937 -15636
8819 -15636 -7773 -14246 -19750 -20970 -25041 -22292 913 3977 2815 7 -11793 4335 18313 22042
8805 22042 9395 6401 2023 -16685 -21383 -12290 -5612 -8714 -6107 -2673 -5267 -6615 1089 6685
8791 6685 6997 11352 10285 -4303 -9795 5140 11094 6640 -150 9734 6966 5247 13617 9323 7084
8776 7084 -4585 -11047 -8666 -13693 -2849 9672 12214 7508 -6777 -3984 -8806 -12255 -14189 424
8762 424 16097 18057 19803 29620 22046 17015 15637 25554 21387 8654 -1189 9793 4280 -4625
8748 -4625 -13311 -8168 -3206 973 -3456 6559 9056 9704 22961 20820 21631 23100 26830 24944 25888
8733B5888j7228n909J4859q44O456J6649o044M73N023o146p422P47J1593k850
8719C5245j0290j9280l811J6857J0302j5067p472k247J5705K583J0121J3295j0707
8706C5234n840j0052M377J5047J7772p78J4278J0645J4541O684P973K0605J3184
8693A43670J8975K1380L683K0906K0804L9901M5577P0757R2258J23624J53708
8682G55243K10730K56203K73833J90754O5010j04008l53031m06259k73196j51327
8672D63952r6528o8826m0765j1282q432k3465p237k926p145Q036O474q441O36
8659B04051O334L763P191N985Q050J7166K6211K8199J3675K9856L6252M0446M5088
8646D72267N0106N9542N4327Q4119R7457J18884J44693J86315K84963L83296M79008
$$ plain form
8733 25888 8660 2751 17610 16766 23222 39871 33827 34300 39323 33177 25755 26502 38095 35245
8719 35245 24955 5675 1864 18721 29023 13956 6484 4237 19942 22525 32646 45941 35234
8706 35234 29394 19342 23719 38766 56538 55760 70038 80683 95224 101908 109881 130486 143670
8693 143670 162645 184025 187708 208614 229418 269319 314896 385653 477911 601535 755243
8682 755243 965973 1222176 1496009 1686763 1751773 1647765 1294734 888475 615279 463952
8672 463952 367424 298598 257833 246551 238119 214654 207417 204491 197346 205382 211856 203415 204051
8659 204051 210385 214148 221339 227324 235374 252540 278751 306950 320625 350481 386733 427179 472267
8646 472267 522373 581915 636242 720361 817818 936702 1081395 1267710 1552673 1935969 2414977
8635B414977N68799L99759J63021j14666o90161q53498n65812l28450j85715j20864
8625F87390q2306n0068l0322j2133k229J1228J4177O510k225r608k8760j8498
8613D83156L177J2639J5770M7228O9054O7479N1944K8445m498l6644o2117n9768
8601F15865k6097k277m085K8378N0629N8647Q9106J24636J69387K03540K40702
8590A548431K62626J93575P3706j7036k47879l72103k52177j35293q2017o4017
8580I07816n3609p4536o7622m2333j9234j4700j9078k1871q978n007L289R431
8568E93568M899L43l3333l3286l396K0737L3053L7242N3230P6015P6108N6949
8556H82129N3373K7842J925m557k954K1261L5386J2475j2945l8252n8509n6638
$$ plain form
8635 2414977 2983776 3383535 3546556 3431890 2741729 1888231 1322419 993969 808254 687390
8625 687390 605084 555016 524694 512561 510332 521560 535737 542247 540022 530414 501654 483156
8613 483156 486333 498972 514742 561970 631024 698503 750447 778892 774394 737750 675633 615865
8601 615865 589768 587491 583406 611784 662413 721060 810166 934802 1104189 1307729 1548431
8590 1548431 1811057 2004632 2078338 2061302 1813423 1441320 1189143 1053850 971833 907816
8580 907816 854207 779671 712049 669716 650482 635782 616704 594833 585855 580848 584137 593568
8568 593568 598467 598810 565477 532191 528795 549532 582585 619827 673057 749072 825180 882129
8556 882129 935502 963344 965269 960712 957758 979019 1014405 1026880 1013935 975683 917174 860536
8544H60536j9252K8946K8808m75j5614m5051o8380l6478K183K0836L7451K3565
8532H17075J0023j8205m1695m2545k1289l187M011m085l8255k2903R20J8171L3277
8519F91313L9288O9041P9011L8278J6327j4703m2592n1619l6004k376K6430O3884
8507H76278J03883J34278J43840J22834R1394j817j12541j85036j91217j36399
8497H45497n3806o511L9756O2176P8122Q9086Q1870O5263K7823l8384o4326n7019
8485A069547j12642j23899r9609o9235m4453k4215j6539p178J4443P662J7680
8474F11562L0387N1096O5903Q1999J03305J12257R6560M4655k8500r9389j28329
8463I41506p7105l1122j11M6321M5640L0298j0256o7080r5083m8387l178J5665
$$ plain form
8544 860536 841284 870230 899038 898563 882949 837898 769518 733040 735223 756059 793510 817075
8532 817075 827098 808893 767198 724653 703364 700177 704188 700103 661848 638945 639865 658036 691313
8519 691313 730601 799642 878653 916931 933258 918555 875963 824344 788340 785964 812394 876278
8507 876278 980161 1114439 1258279 1381113 1472507 1470690 1358149 1173113 981896 845497
8497 845497 791691 785180 824936 887112 965234 1054320 1136190 1201453 1229276 1190892 1126566 1069547
8485 1069547 956905 833006 733397 664162 619709 595494 578955 571777 586220 593882 611562
8474 611562 641949 693045 758948 840947 944252 1056509 1153069 1197724 1169224 1069835 941506
8463 941506 864401 833279 833168 879489 925129 955427 945171 878091 783008 734621 731443 747108
8451G47108J0609K0119j60j059K0214N0419R7859J27148J47922J10641K9817q4279
8439A276358j96976k22548j67360q6974n7862n4161l1318j8292j4730q967l398
8428D13772L043J6725R308L0325K8647P439p891k5944k8317k3994j9748n016l266
8415C95083J1524J2938K6075K4131L2352N1886P5474J08765R7612N9522k715n8921
8403H33726r1180p6213j5529L4757N9972N2915L0414J2988m9277j12443j23809
8392E56321p5821m9119l3744k0712k1818k5736n577j2874n002j7794l531Q897
8380B93490P594j970J181r338j625L509P550M268r534j33J9645J3900M486K6666
8366C59689K0511J9817L1510M3470M1131J8987l019m0851o8515o0160m5177k8805
$$ plain form
8451 747108 757717 777836 777676 776617 796831 847250 945109 1072257 1220179 1330820 1360637 1276358
8439 1276358 1079382 856834 689474 602500 544638 490477 459159 440867 426137 417170 413772
8428 413772 416815 433540 442848 473173 501820 509259 501368 475424 447107 423113 403365 398349 395083
8415 395083 406607 419545 445620 469751 502103 553989 629463 738228 835840 895362 892647 833726
8403 833726 742546 666333 650804 685561 745533 798448 828862 841850 792573 680130 556321
8392 556321 480500 431381 397637 376925 355107 329371 323794 310920 305918 288124 284593 293490
8380 293490 301084 299114 300295 290957 289332 292841 300391 304659 295125 294992 314637 328537 333023 359689
8366 359689 380200 400017 431527 474997 516128 535115 532096 491245 422730 362570 317393 288588
8354B88588j1704k1851q854J453j0531j1123j9091k19N053L442P996J7638O970
8341B47767R651J0592O457k1830k5057j0149r721M687J3375k203r883L24j4671
8328A99339j7749J3575k515p867k969L320Q636J0652l238J831p460J665J0426
8315B07646j225J0765O326j2599J1436J8612j997N61J8849J3484J3382Q121J0050
8302C03411N342M071J4320N505K798J2460M327M770N426K0204J0196L508J6348
8289D12686N995m025M830k437J2356J7521N657O957o176J168K248J017J730J5201
8275D74728M679J3104K73l379j5554j9535j5464J0079M317j8554j3192j0978j1866
8262C98658k138l370q08P159Q240P186m818p850L929P186J3603J278l818J1437
$$ plain form
8354 288588 276884 255033 246179 247632 237101 225978 206887 206668 211721 215163 223159 240797 247767
8341 247767 257418 268010 274467 252637 227580 217431 207710 212397 225772 223569 213686 214010 199339
8328 199339 181590 195165 192650 184783 181814 185134 193770 204422 201184 203015 195555 197220 207646
8315 207646 206421 217186 223512 210913 222349 240961 238964 239525 258374 271858 285240 293361 303411
8302 303411 308753 312824 327144 332649 335447 347907 352234 357004 362430 382634 392830 396338 412686
8289 412686 418681 414656 419486 417049 429405 446926 452583 459540 453364 454532 456780 457797 459527 474728
8275 474728 479407 492511 492784 489405 473851 454316 438852 448931 453248 434694 421502 410524 398658
8262 398658 396520 393150 392342 399501 407741 414927 410109 402259 406188 413374 426977 428255 424437 435874
8248D35874K975O954N419J9208J165j3589j1119l660O430O557N828o44j278r56
8234D59164P058M545O092K0719K6253R465K1214J8463O110K490o748k323K023
8221E74525P173J438J5873K3215K1709K3572L5913M5962M5275L6069J3710j4528
8209H29906m0178l3527l0024k1582L575K1219K1459K3041K9082K5473K7187L7657
8197H93288K6951J9565L2941M7797L5674J1724j6071m1983o2075l6566j0297J5591
8185I16539k203k443k129K796K7509K2415J9586L3686K7984J8781K1601K3785
8173A107907L1062L0165J5241K3182K0367M145J7908L6606K5397K0108L5127K8512
8161A395727K1148L860J7918M9940M5180M0514M5662L848J7815M0999M1367L7930
$$ plain form
8248 435874 438849 445803 451222 470430 471595 458006 446887 443227 449657 456214 462042 461398 460120 459164
8234 459164 466222 470767 476859 497578 523831 533296 554510 572973 579083 581573 574825 572502 574525
8221 574525 581698 583136 599009 622224 643933 667505 703418 749380 794655 830724 844434 829906
8209 829906 789728 756201 726177 704595 708170 729389 750848 773889 802971 828444 855631 893288
8197 893288 920239 939804 972745 1020542 1056216 1067940 1051869 1009886 947811 911245 900948 916539
8185 916539 914336 911893 909764 912560 940069 962484 982070 1015756 1043740 1062521 1084122 1107907
8173 1107907 1138969 1169134 1184375 1207557 1227924 1232069 1249977 1286583 1311980 1332088 1367215 1395727
8161 1395727 1416875 1420735 1438653 1488593 1533773 1574287 1619949 1623797 1641612 1682611 1723978 1761908
8149A761908M4825L9745L7330N6340O2190N0581N1675M1896P1662R5404J03256
8138B416812J23413J56727J94279K45500L01216L83652M50671N48153N77251M04675
8128E802349J68212j41749n50435o03929l72314j81843q6683J3914P9962J24866
8118D252350J54898K13229K58271L12796L78683M22478M85096N52736O14803P03694
8108H349034Q62972J056848J278113J568194J941303K277955K381230K110362
8100B1826011J543979L11700j142438j859696k347923k342047j537874o51413
8092A3800299m4268M22490Q28399R36451O50691K67036l73529r63399p20484m4093
8082A4759593N46529J013973J455824J916351K377313K777132K828868K479845
$$ plain form
8149 1761908 1806733 1846478 1883808 1940148 2002338 2052919 2104594 2146490 2218152 2313556 2416812
8138 2416812 2540225 2696952 2891231 3136731 3437947 3821599 4272270 4820423 5397674 5802349
8128 5802349 5970561 5828812 5278377 4674448 4302134 4120291 4033608 4047522 4127484 4252350
8118 4252350 4407248 4620477 4878748 5191544 5570227 5992705 6477801 7030537 7645340 8349034
8108 8349034 9212006 10268854 11546967 13115161 15056464 17334419 19715649 21826011
8100 21826011 23369990 23681690 22539252 20679556 18331633 15989586 14451712 13800299
8092 13800299 13756031 14178521 15006920 15943371 16594062 16861098 16487569 15524170 14803686 14759593
8082 14759593 15306122 16320095 17775919 19692270 22069583 24846715 27675583 30155428
8074C0155428J859918N87580o70081j172358j787251k476339k110914j096870
8066B3289113k22972M53888R99864J502286K073660K708455L437666M315693N317048
8057D3874701O464486P734661Q917808R348720Q490788P070995N058989L688484
8049A00649632N585838R200453J1091035J0653592Q392166L010362j944484l275107
8041A43363487m349666l816175Q68702O836119J0967509J1801156J0739115Q513494
8033A84923741O024619Q295071J4283787J7489015J6056789J1289411K351309
8026B60713742n138096n564409n556134o020349k226812J470297K997156M861542
8018B45536937M742263R41181m342724q853571r234033r824521j2333405j2390597
$$ plain form
8074 30155428 32015346 32602926 31932845 30760487 28973236 26496897 24385983 23289113
8066 23289113 23066141 23520029 24519893 26022179 28095839 30804294 34241960 38557653 43874701
8057 43874701 50339187 58073848 66991656 76340376 84831164 91902159 96961148 100649632
8049 100649632 106235470 115435923 126526958 137180550 145572716 148583078 146638594 143363487
8041 143363487 139013821 135197646 136066348 142902467 153869976 165671132 176410247 184923741
8033 184923741 190948360 199243431 213527218 231016233 247073022 258362433 260713742
8026 260713742 255575646 250011237 244455103 238434754 236207942 237678239 240675395 245536937
8018 245536937 250279200 251220381 246877657 238024086 228790053 218965532 206632127 194241530
8010A94241530j2470705j1462946o472706j273358M17096p80620l994907p754944
8002A50448440p363302k554562L038044P103458P873733O165475L447438j026787
7994A67131937k299415J131390L988724M922886K547241j014801p16955J041643
7986A76732650J147943J314415K278861K986931l010016r474710q687063r489664
7978A53799347r319125k570127N660609J2359804J5995937J5437564J3136294
7971B04500303N107081o929858j1266415j3952968j4361686o894173J566206M405840
7963A62174330K730726o11004p979533j0136956l146607M763743Q874762Q417311
7955A65086772O839031J036746p709591r098204r402968j1115186o360009J191371
$$ plain form
8010 194241530 181770825 170307879 163835173 162561815 162978911 162198291 158203384 150448440
8002 150448440 143085138 140530576 143568620 150672078 158545811 164711286 168158724 167131937
7994 167131937 164832522 165963912 169952636 174875522 177422763 176407962 175691007 176732650
7986 176732650 177880593 179195008 181473869 184460800 181450784 171976074 163289011 153799347
7978 153799347 144480222 141910095 147570704 159930508 175926445 191364009 204500303
7971 204500303 209607384 202677526 191411111 177458143 163096457 156202284 157768490 162174330
7963 162174330 164905056 164294052 156314519 146177563 143030956 147794699 156669461 165086772
7955 165086772 171925803 172962549 165252958 156154754 146751786 135636600 129276591 130467962
7947A30467962N805801O897503P017521N193390K991905L212662N078900K222209
7939A68887853m957221n417157m720051o461610l475807k59054l72991l116412
7931A40107550r135872j0114305m112664K644693P893298R920996P669237M476605
7923A49349538j474158o972017l589433K794469M161492K386634j771647q742617
7915A36142261q382599j128675N576175Q007551O812911M933929p61336o651365
7907A44548852o544908o193494j0102949r388340l301055J30236p77637l410808
7899A04959897r400139j4252974j2516038r411215p649785n827202m160054l035067
7891C8707423k412189k061135j767594j610862j473838j226196j035319r62051
$$ plain form
7947 130467962 136273763 143171266 150188787 155382177 158374082 161586744 166665644 168887853
7939 168887853 163930632 158513475 153793424 147331814 143856007 143596953 143223962 140107550
7931 140107550 130971678 120857373 116744709 119389402 127282700 137203696 144872933 149349538
7923 149349538 147875380 140903363 137313930 140108399 144269891 146656525 144884878 136142261
7915 136142261 127759662 126630987 132207162 140214713 147027624 151961553 151200217 144548852
7907 144548852 138003944 131810450 121707501 112319161 109018106 109148342 108370705 104959897
7899 104959897 95559758 81306784 68790746 59379531 51729746 45902544 41742490 38707423
7891 38707423 36295234 34234099 32466505 30855643 29381805 28155609 27120290 26158239
7883B6158239j000314r64642q61542q00626p47790o37744n03969l45956k03024
7874B0092632j39166r8079o6985j26119l10516m69985o35278o21368k66241J79437
7864A7538332O59663J190305J764331K411529K865525K548703J941633Q48933
7856C1768954j567975k878403k939646l682366l587043k384419j363883p39462
7848A2625757l59276p7748J70792M16797M35320J43047k56776q39909j436637
7839A0821367j430620j048506o98990m57411l06123k06502r8699k0317J8630J907
7829F574736o8711j45486k95820m42813m11048l08587k28679j72634j64773j68499
7819D167686j64248j43246j26434j09032j15629j12579r8151j01858q8079q6463
$$ plain form
7883 26158239 25157925 24193283 23331741 22531115 21783325 21145581 20641612 20295656 20092632
7874 20092632 19953466 19855387 19788402 19662283 19351767 18881782 18246504 17625136 17358895 17538332
7864 17538332 18197995 19388300 21152631 23564160 26429685 28978388 30920021 31768954
7856 31768954 30200979 27322576 24382930 20700564 17113521 14729102 13365219 12625757
7848 12625757 12266481 12188733 12359525 12776322 13211642 13354689 13097913 12258004 10821367
7839 10821367 9390747 8342241 7643251 7185840 6879717 6673215 6574516 6554199 6572829 6574736
7829 6574736 6506025 6360539 6064719 5621906 5210858 4902271 4673592 4500958 4336185 4167686
7819 4167686 4003438 3860192 3733758 3624726 3509097 3396518 3298367 3196509 3108430 3021967
7809C021967p5879o3391o1550n1784o8855o8033n9792o1783n2367l8451l7737
7798B382345m8084l3732n4353n8227j1936j3155j7438j8824n48K405j1675k0296
7786B096482l3641p2240q9760p7569l2076k3261l2575m6659m6404j3935j5858
7775A612504j6988j7270o332l8938k9615k1331k9264o254n512m647n180l3597
7763A397576k4588k206j5816j6407P653J97j6859p478j8895n573P8j2011q803
7750A276868l558r843N306J1169o0P863K5728K6302J5404L0546M3430M1128J2210
7737A482493j7934m2026o1791p2035n9984m8483m0678k3997r097j4564j8768j2894
7725A060242K562K895l814m645Q488K537j6440J517K714p767k0340l4483j5019
$$ plain form
7809 3021967 2946088 2882697 2821147 2769363 2700508 2632475 2572683 2510900 2458533 2420082 2382345
7798 2382345 2334261 2300529 2246176 2187949 2176013 2162858 2145420 2126596 2126048 2128453 2116778 2096482
7786 2096482 2062841 1990601 1900841 1823272 1791196 1767935 1735360 1688701 1642297 1628362 1612504
7775 1612504 1595516 1578246 1571914 1532976 1503361 1482030 1452766 1446512 1441000 1436353 1431173 1397576
7763 1397576 1372988 1370782 1354966 1338559 1346212 1346409 1329550 1322072 1303177 1297604 1297682 1285671 1276868
7750 1276868 1273310 1263467 1268773 1279942 1279882 1287745 1313473 1339775 1355179 1385725 1429155 1470283 1482493
7737 1482493 1464559 1422533 1360742 1288707 1228723 1180240 1139562 1115565 1106468 1091904 1073136 1060242
7725 1060242 1062804 1065699 1061885 1057240 1065728 1068265 1051825 1053342 1056056 1048289 1027949 993466 978447
7712I78447j452q021j4374R061j771j1993j4088q390O368j357k9113l2171k2262
7699H48884j2244j1265k4978j0109N292q206m999q310j2231l760j2093j0588k247
7686G33146O163Q73j0826n683k4780k8566j1161p936L354k036n181j865n268L428
7672F43662k341j5244N641O162m085l372j1078j2253n68R363k999j1359O26P844
7658F09999M078j0579j4574j2168l966l215k699J5402j5335j8711l212j6207k0518
7645E08295o184m84M277n890j7662q099m047j644J2919j2984l611O872O976j6595
7631D62139m191j9959k1798J133K4796K135l819K60j3265n143L583k317o596r329
7617D07629J404J071l019j844r134p480J9852O46m870J7697N3j2509k897J0352
$$ plain form
7712 978447 976995 968974 954600 963661 961890 949897 935809 927419 933787 932430 903317 871146 848884
7699 848884 836640 825375 800397 790288 795580 787374 782375 774065 761834 758074 745981 735393 733146
7686 733146 739309 740182 729356 723673 698893 670327 659166 651230 654584 652548 647367 645502 640234 643662
7672 643662 641321 626077 631718 637880 633795 630423 619345 607092 606524 615887 612888 601529 602155 609999
7658 609999 614077 603498 588924 576756 572790 569575 566876 582278 566943 548232 545020 528813 508295
7645 508295 502111 501627 505904 500014 482352 474253 470206 468562 481481 468497 464886 471758 478734 462139
7631 462139 457948 437989 416191 417324 442120 444255 440436 440696 427431 422288 425871 423554 416958 407629
7617 407629 409033 410104 407085 405241 396107 388627 408479 409125 404255 421952 422005 409496 406599 416951
7603D16951N628L221L188P104k203K1526J3369L0020L5131L7334L6427K3105O712
7590F37513L914k9172n3124o1827m2493l3895r197q091k5173p939R836M098J3802
7577C98252M362K353J0834J4113L0800K7057M2487L4488L5188L0820J7454K435
7565F50643k0641l7755l4711p139J4979M2539P1132O9752P7603L2001J946j2804
7553H47545o8882q1448p2422k9823P735J571K5289L1594N880j9797k8873k6241
7541E92128j7614J4788M642N186K2167N5090Q0317R0566P1953M6141J1058j8717
7529I57705n5621o5800l8210l309J3682J6258p593j3373l0474l6851n9935k2078
7517F54401j6367J1983L7992N4233O7583O9087N4995M2058L3895n819k2010j339
$$ plain form
7603 416951 422579 425800 428988 436092 433889 455415 468784 498804 533935 571269 607696 630801 637513
7590 637513 641427 612255 559131 497304 454811 420916 411719 403628 378455 370516 380352 384450 398252
7577 398252 402614 404967 415801 429914 460714 487771 530258 564746 599934 630754 648208 650643
7565 650643 630002 592247 557536 550397 565376 607915 679047 748799 826402 858403 860349 847545
7553 847545 778663 697215 624793 594970 602705 604276 629565 661159 667039 647242 618369 592128
7541 592128 574514 589302 593944 599130 621297 676387 756704 847270 919223 965364 976422 957705
7529 957705 902084 836284 798074 794765 808447 824705 817112 803739 773265 736414 676479 654401
7517 654401 638034 650017 688009 742242 809825 878912 933907 975965 1009860 1004041 982031 980692
7505I80692L2327P0098R3086Q5108M1703k2178j14233j45276j02746k6311l474
7494H88796L9811N9459P6556O9816M0810K9893k1143l5222m3309m4318p7617j02353
7482H81179o6286l3835o576k0278l6579l5037r394j0598J4487L7782M8881P3103
7470H36849O9347R5647J05221J06243P7788K1725m6991j09897p5081k9264L9232
7459A090819P5664J06063R8982N7011P104l5130o9538l0187j1506o300k2868n7995
7447A202119n8977j9689J4824K0549J9902n961k0389l2040n1012p7211j04623
7436H87492j08519p5156l9427k8693j0348J6808L000J2615K4184K6661M5444N6047
7424H10108Q1049R5633J17402R0079K7514l3947p9102j01684p5290l0692j3556
$$ plain form
7505 980692 1013019 1083117 1176203 1261311 1303014 1280836 1166603 1021327 918581 892270 888796
7494 888796 928607 988066 1064622 1134438 1175248 1205141 1183998 1148776 1105467 1061149 983532 881179
7482 881179 814893 781058 774482 754204 717625 682588 673194 662596 677083 714865 763746 836849
7470 836849 906196 1001843 1107064 1213307 1291095 1312820 1265829 1155932 1080851 1051587 1090819
7459 1090819 1166483 1272546 1371528 1428539 1435643 1400513 1330975 1300788 1289282 1282982 1260114 1202119
7447 1202119 1143142 1123453 1138277 1158826 1178728 1172767 1152378 1120338 1069326 992115 887492
7436 887492 778973 703817 664390 635697 625349 642157 645157 657772 681956 708617 754061 810108
7424 810108 891157 986790 1104192 1194271 1221785 1187838 1108736 1007052 931762 901070 887514
7413H87514j3809j5913K2869M0928N0013O4568N2646J4767k6821o5008q5208o9081
7401H57465o2418l2847Q793M9253N3855P8941M6515K6868k29j6208l1970k6600
7389I51418l4070o5823j02034j01549p6862l3653k8675k0962j2808j6639r31J9207
7377D76619Q553J0651J3614L0189K7647L3256o635l0671n5848l4688q719n862
7365D58106P431K2886P267K0258M9917L9865K6415r63o508k0778k7260q797N9
7352E67898l703j2877l886J0829K6079N6349L9758M073k5271q5599r9119q4237
7340C90294m9200k5786j5878n884j1109k8874n123o110m088O353P531j23l042
7327B48961m846k326k098k517j471l981q337j879O505J0790J8756O916J8666J4550
$$ plain form
7413 887514 873705 857792 880661 921589 971602 1036170 1088816 1103583 1076762 1011754 926546 857465
7401 857465 795047 762200 770993 820246 874101 953042 999557 1026425 1026196 1009988 978018 951418
7389 951418 917348 851525 749491 647942 571080 537427 508752 487790 474982 458343 457412 476619
7377 476619 485172 495823 509437 539626 567273 600529 593894 563223 507375 472687 463968 458106
7365 458106 465537 488423 495690 515948 565865 605730 632145 631182 624674 603896 576636 567839 567898
7352 567898 564195 551318 547432 558261 584340 640689 680447 684520 659249 573650 474531 390294
7340 390294 341094 315308 299430 293546 282437 253563 248440 242330 238242 244595 252126 252003 248961
7327 248961 244115 241789 239691 237174 235703 231722 223385 221506 228011 238801 257557 264473 283139 297689
7313B97689J6431J6414K7844J7768M82k3390m8061m9926l4989j8958j1436o063
7301A83805m02J0707M900j2453r602n710q843Q592O196J882n928J468j2148j0448
7287A52016k826J2807N555o333K384l790L998j4408p44k155L303J010o964o168
7273A37685o021j3777J688J8396J2952L104J248o029j495l988o066j315q644q154
7259A19584j6747Q144K0317O559j803m74n12Q99k933m849O389N981j2293L668
7245A31930N628n611q999l35k964j369o628j2664J717K022n146R848J8581p160
7231A18850l784O235o103j2458j4236m057J4689J6993N137J558O608o541q814
7218A14077k2780q102O427j4377k68P688m4Q183J4875J694J024O983j0792j762
$$ plain form
7313 297689 314120 330534 358378 376146 376628 353238 305177 255251 220262 201304 189868 183805
7301 183805 183403 194110 199010 186557 176955 171245 162402 170994 177190 179072 173144 174612 162464 152016
7287 152016 149190 161997 167552 161219 163603 159813 163811 149403 148659 146504 149807 150817 143853 137685
7273 137685 131664 117887 119575 137971 150923 154027 155275 149246 147751 143763 137697 136382 127738 119584
7259 119584 102837 110981 131298 137857 136054 135580 135068 135967 133034 128185 134574 140555 128262 131930
7245 131930 137558 131947 122948 122613 119649 118280 111652 98988 100705 102727 97581 107429 126010 118850
7231 118850 115066 121301 115198 102740 88504 84447 99136 116129 121266 122824 129432 122891 114077
7218 114077 91297 83195 89622 75245 74977 82665 82621 90804 105679 107373 108397 115380 104588 102826
7204A02826J810m013r867M671L530j2102J0132M553j136Q936q417o112o148j852
7190H6811j332R137R554j4154n523P275Q247j3q166N211O430o187o133o135O064
7175I1086n692j8137P285J7372L952p876j115n528j382J75J0399J4601O88j3094
7161I2734o868n073N958m920p118k612N772Q859j65O520j35n017O594l099j8048
7146G3382q168J0092o392l277N265J2560P685q118k170P544j1121n282M56n83
7132G1873j209l504J953N670l380q41m987L809M612j0180j54j297O683J170m17
7117F9801N425K332q559j4752O77P904J1760j159q016O609R344K111j5376j128
7103F6973L022k170L682O850l410k303O285J0764m568m417j6531j378J1865J5321
$$ plain form
7204 102826 104636 100623 90756 95427 98957 86855 96987 101540 100404 109340 100923 94811 88663 86811
7190 86811 85479 94616 104170 90016 84493 91768 100015 100002 91836 97047 103477 97290 91157 85022 91086
7175 91086 85394 67257 74542 91914 95866 87990 86875 81347 79965 80140 90539 105140 105828 92734
7161 92734 85866 80793 86751 81831 74713 72101 77873 86732 86567 93087 92952 87935 94529 91430 73382
7146 73382 65214 75306 68914 65637 70902 83462 91147 83029 80859 88403 77282 72000 72456 71873
7132 71873 70664 67160 69113 74783 71403 70562 65575 69384 73996 63816 63662 62365 69048 70218 69801
7117 69801 75226 77558 68999 54247 54924 62828 74588 73429 65413 72022 81366 83477 68101 66973
7103 66973 69995 67825 71507 78357 74947 72644 78929 89693 85125 80708 64177 62799 74664 89985
7089H9985p756n043l895j4063l026K784J1811J895j909j9920j6033K801N926J3914
7075E7471R927P282k380l91O717o974J1154n564j0507J1150K323J875q486j4472
7061E9125l887O171J0801L955j678l949o1m215k204k20r397L164J321K543M273
7046F5742J865J8921n559q966j4364j8357P408Q359M823J772O896o713n217j984
7032E4626n989R301J9294j904k806n831j1895j0070Q069K737o32J579O57N324
7018F2460l318M474K750K08J0302l483n349N76N184K528k908P333K893l967k291
7003G7392O669N958M239j4745l530P92j3052k921O129R29l67k314r433o896J435
6988E0285J419K885J361O732J0717R745j9225j2917j4503J3299J9378o902j1552
$$ plain form
7089 89985 82229 77186 73291 59228 56202 58986 70797 72692 70783 50863 34830 37631 43557 57471
7075 57471 67398 74680 72300 71909 78626 71652 82806 77242 66735 77885 80208 82083 73597 59125
7061 59125 55238 61409 72210 76165 74487 70538 70477 66262 64058 63838 54441 57605 58926 61469 65742
7046 65742 67607 86528 80969 72003 57639 39282 46690 55049 59872 61644 68540 61827 56610 54626
7032 54626 48637 57938 77232 75328 72522 66691 54796 44726 52795 55532 54900 56479 57136 62460
7018 62460 59142 63616 66366 66574 76876 73393 68044 68620 73804 76332 73424 80757 83650 79683 77392
7003 77392 84061 90019 94258 79513 75983 76775 63723 60802 66931 67860 67493 65179 55746 48850 50285
6988 50285 51704 54589 55950 62682 73399 83144 63919 51002 36499 49798 69176 62274 50722
6975E0722l180R454J1856j5243j9313N361J2895p904n305n955q530l732N904k283
6961B4747M515J987J1935L074J169L668o739o498k318j093J2986K3113o313k1004
6947D3229k278O01Q504n503o022N756R54n839j181L206J7186Q75K929O564N398
6932G4379j910j1736n445q426o278L553P924K585J114j0257k365L960R901K194
6918E9193J054O45k33m222j733m909j3576j0477L477J2646J0876K498P563L686
6904F6488k0500j6229J587K0865O626l696r039l87J2608m324j5123J866N775J1536
6890E8053m217l980j3170J704J9540N055J295R14k5018r53K0454k496J73m507
6876E2847k8095l312R807J1438P835J363k152l816L910k273j892K971K4295J1867
$$ plain form
6975 50722 47542 56996 68852 53609 34296 39657 52552 44648 39343 33388 24858 21126 27030 24747
6961 24747 29262 31249 43184 46258 47427 51095 44356 37858 35540 34447 47433 70546 64233 43229
6947 43229 40951 41552 50056 44553 38531 44287 45241 39402 38221 41427 58613 59488 62417 68981 74379
6932 74379 72469 60733 55288 46862 40584 44137 52061 54646 55760 45503 43138 47098 56999 59193
6918 59193 60247 60892 60659 56437 54704 49795 36219 25742 29219 41865 52741 55239 62802 66488
6904 66488 45988 29759 31346 52211 58837 55141 46102 45715 58323 53999 38876 40742 46517 58053
6890 58053 53836 49856 36686 38390 57930 62985 64280 65194 40176 39223 59677 57181 57354 52847
6876 52847 24752 21440 31247 42685 50520 51883 49731 45915 49825 47552 45660 48631 72926 84793
6862H4793j5378n851Q741o909j1042j1294L082k270K500o638m90n843j64j1891
6848B1346j625R098J0637J0685K244J0066M377j5734k7035r761J0375M264P47
6835B9684o59L236K580j466L657p808j0656K599O288J6614j125n964k08l202M856
6820C8426J82r852J479O448m957Q799N33j7984m034k796J3712P514q730J155K365
6805C2260Q243n54M350R896o401O230j6184J4886O019M104j1947r201j6003j0315
6791A5383L108Q421J0443j825p071n161J9002n187r637M525k666r551O122K5378
6777E1284L05r177p008k24N412k044N666n691m955n240J292N184M969M902R180
6762E3855J350l864n25l12o422P484j171r440m685k580j9968p797J0816K3569
$$ plain form
6862 84793 69415 63564 72305 65396 54354 43060 46142 43872 46372 39734 39244 33401 33237 21346
6848 21346 19721 28819 39456 50141 52385 62451 66828 51094 24059 14298 24673 28937 29684
6835 29684 29025 32261 34841 33375 37032 29224 18568 21167 27455 44069 42944 36980 36772 33570 38426
6820 38426 38608 28756 30235 36683 31726 40525 41058 23074 19040 16244 29956 37470 28740 29895 32260
6805 32260 40503 39949 44299 54195 47794 54024 37840 52726 58745 62849 50902 41701 25698 15383
6791 15383 18491 26912 37355 35530 28459 23298 42300 37113 27476 32001 29335 19784 25906 51284
6777 51284 51589 42412 35404 35180 40592 38548 44214 38523 33568 28328 29620 34804 39773 44675 53855
6762 53855 55205 51341 50816 50504 44082 51566 50395 40955 36270 33690 13722 5925 16741 40310
6748D0310J6502R03L85j165q784r072r087q429r394m90n11L802J1718L883J3861
6733D4432J4050L702r076j3269q98Q387q321m614L315J839q351m130K701N336
6719C5103P007j651J027K354P236j0384R670m04Q95l925q288N51k494J935J2470
6704E1102O202k88j1131j6146m430N13O308R791L128N94r656K907J3453r32k1602
6689B9813K439k409J957R938J077r45P200J8508N221J916P815j0119j3101M285
6675F3595K2867J698k909N753L24O236K5549J3156l661j1235n004p967q177k3766
6661G6459j7337m680j4141r586J0386M278o426p032k684n57r94L475p732Q578
6647C2007J9315J7063j86j5494j3116j720J957p141P904L795k214m354l874J1580
$$ plain form
6748 40310 56812 57715 58100 56935 48151 39079 29992 21563 12169 11679 11168 14970 26688 30571 44432
6733 44432 58482 62184 53108 39839 38941 47328 39007 34393 37708 39547 31196 27066 29767 35103
6719 35103 42110 40459 41486 43840 51076 40692 50362 49958 50853 46928 38640 39191 36697 38632 51102
6704 51102 57304 57016 45885 29739 25309 25822 32130 41921 45049 45643 35987 38894 52347 51415 29813
6689 29813 32252 29843 31800 41738 42815 41870 49070 67578 72799 74715 82530 72411 59310 63595
6675 63595 86462 88160 85251 91004 91328 97564 123113 136269 132608 121373 116369 108402 100225 76459
6661 76459 59122 54442 40301 30715 41101 45379 38953 31921 29237 28680 27686 31161 23429 32007
6647 32007 51322 68385 68199 52705 39589 37869 39826 32685 40589 44384 42170 37816 33942 45522
6633D5522N991m726N493O53n966J630M708J00j4569p746k743P691M196n224Q258
6618D3268q22j0979N781J586k883j1548J0104J1302r400L176n769M956P774m643
6604D1903m438r71O050N424j6454m418O721n114R980J0586o0j2733o422k146j818
6589B6090k557m118Q531J0915n869j1407m074o627j395j557J9299M096q399L6
6575B2964J0268j800Q319l852l85n337j8992q772J0941Q868k454R392J0197J083
6561D0440n156J621J603l610O422j229j4160m894L963L514L271r137k197J277
6547B1728K323j77m948J4570R797o988m464M729o646o261j2605j011J7725J3420
6533D1192L197k70j1000J565M106r393p872l828p074L566m206m904J0492J2542
$$ plain form
6633 45522 51513 46787 52280 52933 46967 48597 53305 53405 38836 31090 28347 36038 40234 35010 43268
6618 43268 42446 31467 37248 38834 35951 24403 34507 45809 36409 39585 33816 38772 46546 41903
6604 41903 37465 36494 42544 47968 31514 27096 33817 28703 38683 49269 49209 36476 30054 27908 26090
6589 26090 23533 19415 27946 38861 32992 21585 17511 10884 9489 7932 27231 31327 22928 22964
6575 22964 33232 31432 39751 35899 35514 30177 11185 2413 13354 22222 19768 29160 39357 40440
6561 40440 35284 36905 38508 34898 41320 40091 25931 21037 25000 28514 31785 22648 20451 21728
6547 21728 24051 23874 18926 33496 43293 36305 31841 36570 29924 23663 11058 10047 27772 41192
6533 41192 44389 44119 33119 34684 38790 29397 21525 17697 10623 14189 9983 5079 15571 28113
6519B8113q73q469o82L035j0267j3807L629K3300lQ372J2083j3j601J0730n892
6504D7655j5602j733J580J748q670N122R996K959q276K003k203r083J114j465
6490B5145L555r125j2730l37J2905R726m726K847N642q884p270o804J447j2076
6476f85M26J0523J983M441R746j921m496N001P609J66q976M396Q046l806k8404
6461D049j216R795J3699L531Q361j0110k4152j079K624j720L435M943L171J4846
6447C0177k778j1001J1557K4882J257k1301n890n083O04j1349n209J5687J0829
6434C2382l957k893K46O29j2988J520J2370m385l205N667k713j1163j1135J6510
6420A6885J2972o837j497j90M847r049n515N712O465J886K682r47m082M422J1570
$$ plain form
6519 28113 27240 18771 18089 21124 10857 -2950 679 23979 23976 32348 44431 44418 42817 53547 47655
6504 47655 32053 30320 31900 33648 24978 30100 40096 43055 34779 36782 34579 25496 26610 25145
6490 25145 28700 19575 6845 6508 19413 29139 24413 27260 32902 24018 16748 9944 11391 -685
6476 -685 -259 10264 12247 16688 26434 24513 20017 25018 32627 32793 23817 28213 36259 32453 4049
6461 4049 2833 12628 26327 29858 38219 28109 3957 2878 5502 3782 7217 12160 15331 30177
6447 30177 27399 16398 27955 52837 54094 32793 26903 21820 22424 11075 5866 21553 32382
6434 32382 28425 25532 25778 26407 13419 14939 27309 22924 19719 25386 22673 11510 375 16885
6420 16885 29857 23020 21523 21333 26180 17131 11616 17328 23793 25679 28361 27414 23332 27754 39324
6405C9324k389j4347m975J5809o291K722R54N181j8364r568J7175Q599k288P9
6391C1621j5690k483O352N677q583n291j6422n230l759J9471Q832j0814r887J6073
6377I867J1924P351P039j2487p050O719j0840q067K649M148K261j3716q838m20
6363i460L869J1692P649O263O533o264j0720l145Q00o806p327j572R651K1152
6349B2315J364m921qN911O96K113k604j770m064M424N779r074j2798N011J7605
6334B9979R168o715j2729O89J3174k886N721o499K42N039r034J0037R994j4031
6320C2149r617J4192j561r855o845J4405J1763J285j4994j6950k498L008J1380
6307B5862K659p218j777J0450J8210L975j5633j1071o839M858q862q985J2358
$$ plain form
6405 39324 36935 22588 17613 33422 27131 29853 30807 35988 17624 8056 25231 33830 31542 31621
6391 31621 15931 13448 19800 25477 16894 11603 -4819 -10049 -13808 5663 14495 3681 -6206 9867
6377 9867 21791 29142 36181 23694 16644 23363 12523 4456 7105 11253 13514 -202 -9040 -9460
6363 -9460 -5591 6101 13750 20013 26546 20282 9562 6417 7217 411 -6916 -8488 1163 22315
6349 22315 23679 18758 18750 24661 25357 27470 24866 23096 19032 23456 29235 20161 7363 12374 29979
6334 29979 39147 32432 19703 20392 33566 30680 36401 29902 30144 35183 26149 36186 46180 32149
6320 32149 22532 36724 35163 25308 18463 32868 44631 45916 30922 13972 11474 14482 25862
6307 25862 28521 21303 19526 29976 48186 52161 36528 25457 18618 23476 14614 5629 17987
6294A7987J3460j0145J343R838j06n048M552K12L331M593o439j0961q471p105
6280G041k512L607j9598J911J2954N999l16j603N786L055R517J6413M377j3013
6266C3618k5006k362M826J2163k026o957n765j388k828j607L877J3191J6612j339
6252C5009J3571l652M070J7956j4829k5680R64M166o814M00Q878j296m619p710
6238B0414j4104N286J3040m979j5733J4009J0555R035R01o83l387p795j9671j2138
6224e250O254N962J156Q776O641k601L616n537j6940m297J608M495q960l2J3667
6209H558J8565m299q339m710J561M425J2407K549o230l379m448o620N875N971
6195B1886P046l002j0982k056J375M984m050o175k507K665L004m164m490O035
$$ plain form
6294 17987 31447 21302 22645 32483 32377 27329 31881 32093 35424 40017 33578 22617 14146 7041
6280 7041 4529 8136 -11462 -9551 3403 9402 9086 7483 13269 16324 25841 42254 46631 33618
6266 33618 8612 6250 11076 23239 21213 14256 8491 7103 4275 2668 6545 19736 36348 35009
6252 35009 48580 44928 48998 66954 52125 26445 27409 31575 24761 25161 34039 32743 28124 20414
6238 20414 6310 11596 24636 19657 3924 17933 28488 37523 38424 37741 34354 26559 6888 -5250
6224 -5250 1004 6966 8122 16898 23539 20938 24554 19017 2077 -2220 -612 3883 -5077 -5109 8558
6209 8558 27123 22824 14485 9775 11336 15761 28168 30717 24487 21108 16660 10040 15915 21886
6195 21886 28932 25930 14948 12892 14267 19251 15201 9026 6519 9184 12188 8024 3534 9569
6181I569R696N551l024k695M374J913j5702r372k569K0781R30O936J0314J2791
6167D9493K88j2051m611m96o503l985m569Q14P899N610k376j2549k713K151q745
6152G657L732J647m581N380M794p195L732L921K12j1719k292J632N808J288J909
6137A5925l429q659K111R733j2652k265J1426L316l438j937q309o109O006n323
6123c604p668l64J1137R874M197n529q812O42N666J2140R395j5939j7033K416
6109c482O104Q631J878M963q079j139J0300K224o453k917K924J1182M108o15j0095
6094A9534J4594M164j1517o415P554m798o441P366m81p260L695j003Q974m597
6080B3369j0276p088r395j7808k58M707J3877n5o648J5522J2087N247O283p82
$$ plain form
6181 9569 19265 24816 21792 19097 23471 25384 9682 310 -2259 18522 19452 26388 36702 49493
6167 49493 49781 37730 33119 32623 26120 22135 17566 18380 26279 31889 29513 16964 14251 16402 7657
6152 7657 11389 13036 8455 13835 18629 11434 15166 19087 19299 7580 5288 6920 12728 14016 15925
6137 15925 12496 3837 5948 15681 3029 764 12190 15506 12068 10131 1822 -4287 1719 -3604
6123 -3604 -11272 -11636 -499 9375 13572 8043 -769 -127 5539 17679 27074 11135 -5898 -3482
6109 -3482 2622 11253 13131 18094 10015 8876 19176 21400 14947 12030 14954 26136 30244 29629 19534
6094 19534 34128 38292 26775 20360 27914 23116 16675 24041 23560 16300 19995 18992 27966 23369
6080 23369 13093 6005 -3390 -21198 -21456 -16749 -2872 -2927 -9575 5947 18034 23281 29564 28782
6066B8782O119R780p00j1824r870m904k4334l372o535j220n043L923K0668N063
6052F533j0436m26P731O751K851J1839j0253J49N713K697N331J912m951K129J0659
6037C8229L446n574o028q228j177K612J5956J893j1330j4780J489J0923O0K64
6023B7755o875K250j4281o305l209p779J788P378O940M354j944J065O991j414
6009A6714j4842O532J5477m239q897J31J874N108P524j5556q909m792L348K571
5995B044L581m637M51p205J390J3616r5K148o605j5924J2280K0743M249L967P231
5980C7234k087m092j7405J0004L910r849m763Q839O211j573m559R03N65j094q170
5965A4074j9520j2677O301J0049J6094N104j8966l60J0229r80O151N943j4053
$$ plain form
6066 28782 34901 44681 43981 32157 22287 17383 -6951 -10323 -16858 -18078 -23121 -19198 1470 6533
6052 6533 -3903 -4329 3402 10153 13004 24843 14590 14739 20452 23149 28480 30392 25441 27570 38229
6037 38229 41675 36101 30073 21845 20668 23280 39236 41129 29799 15019 16508 27431 27491 27755
6023 27755 20880 23130 8849 2544 -665 -8444 -6656 722 7662 12016 10072 11137 18128 16714
6009 16714 1872 8404 23881 19642 10745 10876 12750 17858 25382 9826 917 -3875 -527 2044
5995 2044 5625 988 1439 -5766 -4376 9240 9145 11293 4688 -11236 1044 21787 26036 30003 37234
5980 37234 35147 31055 13650 23654 27564 17715 12952 21791 28002 26429 21870 22773 23338 22244 14074
5965 14074 -5446 -18123 -11822 -1773 14321 19425 459 99 10328 9348 15499 21442 7389
5952G389j7249M305K440L93P476j0931l978j54L329K827O804L196J0012L238j79
5937A8918L065q759j4158M1l325K388N502J7753j696j3541j16j0990J053J3589
5923I724J704L458q775L063P818J3679L407r578r347j0889J745K477Q179k144
5909A4521j3581L900m446K495K635j5821o286J5639N941R850p888j528L147Q259
5895A6837J320n033j2060p698R19J6206J6578j1682j965J966l361p814r041K320
5881b508J2113J6727l651q531q490p665P362J0282O451k377J122l278o828J8041
5867B8770J290j4350q361n43L890N849Q072j043j064j3361q677R339K339j3307
5853a157j7343L868O694K699k947Q425J3392N334P226n768j3851R063Q427L074
$$ plain form
5952 7389 -9860 -5555 -3115 -2722 4754 -6177 -10155 -10309 -6980 -4153 2651 5847 15859 19097 18918
5937 18918 21983 13224 -934 -893 -4218 -1830 3672 21425 19729 6188 6072 -4918 -3865 9724
5923 9724 11428 14886 6111 9174 16992 30671 34078 24500 15153 4264 6009 8486 16665 14521
5909 14521 940 4840 394 2889 5524 -10297 -16583 -944 4997 14847 6959 5431 8578 16837
5895 16837 18157 13124 1064 -6634 -5715 10491 27069 15387 13422 15388 12027 4213 -4828 -2508
5881 -2508 9605 26332 22681 14150 5660 -2005 5357 15639 22090 19713 20835 17557 10729 28770
5867 28770 30060 15710 7349 6806 10696 16545 24617 23574 22510 9149 472 9811 12150 -1157
5853 -1157 -18500 -14632 -7938 -5239 -8186 239 13631 18965 26191 20423 6572 15635 24062 27136
5839B7136k370K299q871o269o316O387Q07m397n041o745K848M434J274p496j0213
5824a2533K06L65r45j424k347N961J1622J2795O822l18p55N641R155o908n322
5809B2015m873J644O054j672J1348L364p22j1631p385j5322K993J1631p652j157
5795H635J4147j3948m495Q716O620L994j837k2897k215K139Q564O408J2101j289
5781B4643q101q660r40j0268k607J0979Q899m637K200P017K926o988j9832j1766
5767a7135N294m67k787J5310P337J0173k839R571L144j9335k4411n55J5873Q470
5753G643K654K011k555k489l663l470K959N556P11J0265J8039N280j9336j7181
5739F424l267O678J434j0156r414L970J1998j2j2645o66J0254J0291j0180K033
$$ plain form
5839 27136 24766 27065 18194 11925 5609 11996 12803 8406 3365 -3380 -532 3902 5176 -2320 -12533
5824 -12533 -12327 -11962 -12907 -14331 -16678 -10717 905 13700 20522 20204 19449 25090 34245 27337 22015
5809 22015 17142 18786 24840 23168 34516 37880 37158 25527 18142 2820 5813 17444 9792 8635
5795 8635 22782 8834 4339 13055 19675 23669 21832 -1065 -3280 -1141 7423 13831 25932 24643
5781 24643 16542 7882 6942 -3326 -5933 5046 13945 9308 11508 18525 21451 14463 -5369 -17135
5767 -17135 -11841 -12308 -15095 215 7552 17725 14886 24457 27601 8266 -16145 -16700 -827 7643
5753 7643 10297 12308 9753 7264 3601 131 3090 8646 9357 19622 37661 42941 23605 6424
5739 6424 3157 9835 11269 1113 -8301 -4331 7667 7655 -4990 -5656 4598 14889 4709 6742
5725F742J1419j0617q820O739m193L599O674o550o063k959L112L453K238J996
5711F770J4431K140m103j1720J552J1831O141p54j101o696j1962Q100L70j0668
5697D331j6013P703O261m79O856K900J280O55J385l494o529k049m032q661M638
5682e248K484M616R790n584k5509Q269J6461M952m507N867m072k250o8Q179j994
5667A1386l690K813Q13p359r01J0292n196p810m309O107J0538O381o63L888n373
5652A6917K066o11p140j994L258M975r148o265Q498N675n766l625M714J2620M037
5637B8211j1317M70N575k022j15r006n753K948k525l555K631j559J597K927p674
5622H33P065J7423n88n217p49k947l449n11p122j255K879K859L337r953p4j705
$$ plain form
5725 6742 18161 7544 -1276 5463 1270 4869 11543 4993 -1070 -4029 -917 2536 4774 6770
5711 6770 21201 23341 19238 7518 9070 20901 27042 26288 25187 18491 6529 14629 14999 4331
5697 4331 -11682 -3979 2282 1803 8659 11559 12839 13494 14879 11385 4856 2807 -1225 -9886 -5248
5682 -5248 -2764 1852 11642 6058 -19451 -11182 5279 10231 5724 11591 7519 5269 5201 13380 11386
5667 11386 7696 10509 11322 3963 3062 13354 8158 348 -3961 2146 12684 19065 18402 22290 16917
5652 16917 18983 18372 11232 9238 12496 17471 8323 2058 10556 16231 10465 6840 11554 24174 28211
5637 28211 16894 17364 22939 20917 20802 11796 6043 8991 6466 2911 5542 3983 5580 8507 833
5622 833 7898 25321 24733 19516 18767 15820 12371 11860 4738 3483 6362 9221 12558 2605 2531 826
5606H26J133p507J477q37M725P135o975J009r757q555M408J5538J1060J736p267
5591H149j0754J798O82M228L143r36l217k512l76m964k510j1948R029J1229n719
5576d678q268j1523M644Q464K637M846J9510J8335n590j5767K738J3490N556r528
5562B4866l668M320J3367Q593q824r135p716j1347j4275j813N175L119m920j1910
5548a4168q06J3252P803M57O477L332P621L157j4291j9930j3959K0641J6318N243
5534B1147P225j6944J903L460O98M428N249l016j492k198j5263l454K74R942N681
5519A7640o606K806O91n138O536j2338k147J5319j383j2165K415K052J1756l885
5505A5553O460j1082j1788O796O441K429k935n03P450p728l759N130L332r687
$$ plain form
5606 826 1959 -5548 -4071 -4908 -183 6952 -23 986 -8771 -17326 -12918 2620 13680 15416 8149
5591 8149 -2605 -807 -125 4103 7246 6310 3093 581 205 -4759 -7269 -19217 -10188 1041 -4678
5576 -4678 -12946 -24469 -19825 -11361 -8724 -3878 15632 33967 28377 12610 15348 28838 34394 24866
5562 24866 21198 25518 38885 47478 38654 29519 21803 10456 -3819 -5632 -457 2662 -2258 -14168
5548 -14168 -14974 -1722 6081 6538 13015 16347 23968 27125 12834 -7096 -21055 -414 15904 21147
5534 21147 28372 11428 13331 16791 17489 21917 27166 24150 22658 20460 5197 1743 2017 11959 17640
5519 17640 11034 13840 14531 9393 15929 3591 1444 16763 15380 3215 5630 7682 19438 15553
5505 15553 22013 10931 -857 5939 12380 14809 11874 11371 18821 11093 7334 12464 15796 6109
5491F109O831J5828p120j480L277j0202P541j190j807K208J5216l478j4191L234
5477B0776L59j3718m589k950k565J238J099O928p572q876p78J2138L291n380r08
5462a507J3332k2j032j0868k913N056N133n961p143l609R291J878m588l825J0852
5447D074Q598M371n527k867j0131m746j831R303Q586J903k059R900o975n904P405
5432A4100l297j6091n235J6994Q133j57j3523j2398n753n333J3314J5742k387
5419D109j1229l26j618P482m651j032l646l541J775J2235j314n844P740J105o364
5404e119J901j437l366K000P301J0366K881n198O65N834n502R063M166n464m713
5389A3378k2321N87N85M376J2067N002o529M308q636k70L180m568P008j0168j177
$$ plain form
5491 6109 12940 28768 21648 20168 23445 13243 20784 19594 17787 19995 35211 31733 17542 20776
5477 20776 21135 7417 2828 -122 -2687 -1449 -350 6578 -994 -9870 -10648 1490 4781 -599 -1507
5462 -1507 11825 11803 10771 -97 -3010 2046 7179 1218 -5925 -9534 -243 1635 -2953 -6778 4074
5447 4074 12672 17043 11516 8649 -1482 -6228 -8059 1244 9830 11733 9674 19574 12599 6695 14100
5432 14100 10803 -5288 -10523 6471 14604 14447 924 -11474 -17227 -22560 -9246 6496 4109
5419 4109 -7120 -7446 -9064 -1582 -6233 -7265 -10911 -14452 -12677 -442 -1756 -7600 140 1245 -5119
5404 -5119 -3218 -4655 -8021 -6021 1280 11646 14527 9329 9994 15828 10326 19389 23555 18091 13378
5389 13378 -8943 -8356 -7771 -3395 8672 13674 7145 11453 2817 2547 5727 1159 8167 -2001 -3178
5374c178J1745Q548j0060j1120M920n097L450M549P99q216j2955J591J2457J806
5360g61K009L439J0268Q440k610j0457o054j3018k1169m32K0145J1240O295M615
5346A1950m325l40Q091K687P339J033j3687q708k517r447n691o637J0247J5395
5332E390O745r871j193r640J0489J55P48q459k673k52j1808M599J2545J1151M080
5317A2006j2079m704k025R539k682m604O33K3594j0670o412m034m381M549L361
5303B091n32p221k81K004M506j719j928r299m597o719J5956J3710N601q652j3784
5288a0864j069l100l730J626J2156O668j5804R257N956P7j732M445L652P184m278
5273A0444r919q05P872J0795J6530l10j6317j6234k089J764q968j5126K691P035
$$ plain form
5374 -3178 8567 17115 7055 -4065 855 -4242 -792 3757 4556 -3660 -16615 -15024 -2567 -761
5360 -761 1248 4687 14955 23395 20785 10328 4274 -8744 -29913 -30345 -10200 1040 7335 11950
5346 11950 7625 7285 15376 18063 25402 26435 12748 4040 1523 -7924 -13615 -20252 -10005 5390
5332 5390 12135 2264 1071 -8569 1920 2075 2823 -5636 -8309 -8561 -20369 -15770 -3225 7926 12006
5317 12006 -73 -4777 -6802 2737 55 -4549 -3916 19678 9008 2596 -1438 -5819 -1270 2091
5303 2091 1559 -5662 -5943 -3939 567 -1152 -3080 -12379 -16976 -23695 -7739 5971 11572 2920 -10864
5288 -10864 -11933 -15033 -18763 -17137 -4981 1687 -14117 -4860 1096 1173 -559 3886 7538 14722 10444
5273 10444 525 -280 7592 18387 34917 34607 18290 2056 -33 1731 -7237 -22363 -19672 -12637
5259a2637Q239M134K130N480L474L059o317m876j2008l955N713M773Q856R445
5245A5510l137o174P241M67r195n517m601l961J1604J073o278k0709m90L414l7
5230b0790J1085J8965m170l704n301j2273j185K8284J3126n116o093l175k83l604
5216E766n780K110n711n308o867R614J6171J119N376J5388q418j266Q503k475
5202B8222r681j1868k770m756o741K1823J0330n726q411j500J0273O135k886j0538
5188A1906k252o6k0311p928J7923J7205l620o042k291j2086k229q075J5013n232
5174h085r609O495O027J330P570J1313j610n669P815J231j5419q128J3846R904
5160A7011p843k640K751j806J996K336L589L95k724j119j0467q566j543P524j477
$$ plain form
5259 -12637 -4398 -264 1866 7346 10820 13879 7562 2686 -9322 -13277 -7564 -2791 6065 15510
5245 15510 12373 6199 13440 13907 4712 -805 -5406 -9367 2237 3310 -2968 -23677 -24167 -20753 -20790
5230 -20790 -9705 9260 5090 1386 -3915 -16188 -17373 10911 24037 18921 12828 9653 9370 5766
5216 5766 -14 2096 -3615 -8923 -15790 -6176 9995 11114 16490 31878 23460 22194 30697 28222
5202 28222 18541 6673 3903 -853 -7594 14229 24559 18833 10422 8922 19195 25330 22444 11906
5188 11906 9654 9588 -10723 -18651 -728 16477 12857 6815 4524 -7562 -9791 -17866 -2853 -8085
5174 -8085 -17694 -11199 -5172 -3842 3728 15041 13431 7762 15577 16808 1389 -6739 7107 17011
5160 17011 9168 6528 9279 7473 9469 11805 15394 15789 13065 11946 1479 -7087 -8630 -1106 -2583
5145b583j2255m018R561K0985K985L089p230j1J636O403n640M352k800j5990j1246
5130a2762R199J4833k822J667k169K133j2348p495J0429k173K704m78m094j022
5116d398M418N056J373l578n687J488j317O352M374k775p685n388L77K2573J0061
5101B5244o838r348K423n447j2574o057n002Q983J2390P489K63r225J335m088
5087d52L540L841j1436l858o222j044j224j304L04l26Q295J015L467L325n03M338
5071A756J788M022Q764K522j0649k160P172o199r201J2473J8779N52q092k999
5057A8528j2323j862l116k899J653K727K367p586M688m304j2631m375N239p215
5043b1109p9Q191J6413Q018P693j5498k025r742Q980L572j5554p516K0656M315
$$ plain form
5145 -2583 -14838 -18856 -9295 11690 14675 17764 10534 10523 12159 18562 12922 17274 14474 -1516 -12762
5130 -12762 -3563 11270 8448 10115 7946 10079 -2269 -9764 665 -1508 1196 718 -3376 -4398
5116 -4398 20 5076 6449 2871 -2816 -1328 -2645 3707 8081 5306 -2379 -7767 -7390 15183 25244
5101 25244 18406 9058 11481 6034 -6540 -12597 -17599 -8616 3774 11263 11526 2301 3636 -452
5087 -452 3088 6929 -4507 -8365 -14587 -15631 -16855 -18159 -17855 -18181 -9886 -8871 -5404 -2079 -2582 1756
5071 1756 3544 7566 16330 18852 8203 6043 13215 7016 -2185 10288 29067 29619 21527 18528
5057 18528 6205 4343 1227 -1672 -19 2708 5075 -2511 2177 -2127 -14758 -19133 -13894 -21109
5043 -21109 -21188 -12997 3416 11434 19127 3629 1604 -8138 842 4414 -11140 -18656 2000 6315
5029F315K641r55o568j006q585N680J8337l788j3004o032j0802P335O890N945
5015B403n242m08q392N512R26o001j2399K1932J2655n583j8900q768J1743Q812
5001a710J0583J2161k003l67R77r889J073O122p131N499J2369j3651Q720j196
4987B1557k6968j7176J4212j071M284J2720J5896Q167j1134K66M810o315j2200
4974G048j4334J034L975J4224r28j417q438J779J387j636j523j170r41R47L027
4959C034O470J0008j379j7147j193N015j72M472o451L15j940l155l739P747p73
4944A112m055K420ml4K82N887L661R651p845o037K559p957r840L181M692j1207
4928a3534l941J5351R203J740j1872O551J2198j5089p428k104j1970k582J2947
$$ plain form
5029 6315 8956 8001 1433 427 -8158 -2478 15859 12071 -933 -6965 -17767 -10432 -3542 2403
5015 2403 -2839 -3247 -11639 -6127 -5201 -11202 -23601 -1669 10986 5403 -13497 -22265 -10522 -1710
5001 -1710 8873 21034 19031 18664 19641 9752 10825 16947 9816 15315 27684 14033 22753 21557
4987 21557 -5411 -22587 -8375 -9446 -5162 7558 23454 31621 20487 20753 25563 19248 7048
4974 7048 -7286 -6252 -2277 11947 11019 9602 1164 2943 4330 2694 1171 1 -940 7 3034
4959 3034 9504 19512 18133 986 -207 4808 4636 9108 2657 2972 1032 -2123 -5862 1885 1112
4944 1112 -2943 -523 -527 -561 -279 5608 9269 18920 11075 5038 7597 -360 -10200 -7019 -2327 -13534
4928 -13534 -17475 -2124 7079 8819 -3053 3498 15696 607 -6821 -8925 -20895 -23477 -10530
4915a0530J0987l639o237j910J2269J6957L874P589m63k08o270k912k637J536
4901A8406j1363o972N62J034k97q133J5863J246j3690K098N143k103J616n77M100
4886F933M093M609O413M34m029p52p848o608J4441J9609K344j4360p890q713o200
4871B476L770J2494J201j2765p013j367L262J1723P967N405O940J7m350K615j0244
4856B2131l349l810j6634O524n60q383J0284m229l921K482k165j9349P001N08
4842a3470k862K204J0391J0326K189N345M995q477p706Q819Q480k422j026L08
4828A7094p804r133j1442j0140m883Q627J1625L12r335J1059J5326L856j712l37
4814A3113m13p350o008K17m800J2712q008o655L085J4229j276n092j0679k94m274
$$ plain form
4915 -10530 457 -3182 -9419 -11329 940 17897 21771 29360 28897 28689 22419 19507 16870 18406
4901 18406 7043 71 633 1667 1370 -6763 9100 10346 -3344 -1246 3897 1794 3410 2833 6933
4886 6933 11026 15635 22048 22482 18453 17701 9853 3245 17686 37295 39639 25279 17389 8676 2476
4871 2476 6246 18740 19941 7176 163 -1204 2058 13781 21748 27153 34093 34110 29760 32375 22131
4856 22131 18782 14972 -1662 4862 4302 -4081 6203 1974 -1947 535 -1630 -20979 -13978 -13470
4842 -13470 -16332 -14128 -3737 6589 8778 14123 19118 10641 2935 11754 20234 17812 16786 17094
4828 17094 9290 157 -11285 -21425 -26308 -17681 -6056 -5744 -15079 -4020 11306 15162 13450 13113
4814 13113 12700 5350 -658 -441 -5241 7471 -537 -7192 -4107 10122 8846 3754 -6925 -7219 -11493
4799a1493N262J0774j1840j6R24K744J0590J8750K634L636O729j4879j1889o540
4785E386K319M747o114M511j242m75L784M103N333P092n602j9038j0662j8990
4771b4848j6067J9534J7282R938l647N71J0429o657k688J0833N031O70n051p159
4757H171j1701L859J1151m365O442l978M260J0012J8246L344j831n889nn36l703
4742C3477n735j1479o362K0678l196k4665p722j140j0706J2435N121k620O706
4729D792O743p914l023n963j1781r148m572Q241j916q686J7950K2416P097J1963
4715B6199j3646j8653n637r40q594m561P943N913J140M2J0604O964O420k418j2046
4700a270p240M087J3986J0106L499p097J195M840p541j3023l723l404L329J3159
$$ plain form
4799 -11493 -6231 4543 -7297 -7313 -6389 -3645 6945 25695 28329 31965 38694 23815 11926 5386
4785 5386 7705 12452 6338 10849 9607 9132 12916 17019 22352 29444 23842 4804 -5858 -24848
4771 -24848 -40915 -21381 -4099 5839 2192 2763 13192 6535 3847 14680 19711 20381 15330 8171
4757 8171 -3530 329 11480 7115 13557 9579 13839 23851 42097 45441 43610 37721 37716 37180 33477
4742 33477 27742 16263 9901 30579 27383 2718 -5004 -6144 -16850 -4415 706 -1914 4792
4729 4792 11535 3621 598 -5365 -17146 -26294 -30866 -22625 -24541 -33227 -15277 7139 14236 26199
4715 26199 12553 -6100 -11737 -12677 -21271 -25832 -17889 -11976 -10836 -10794 -190 6774 13194 10776 -1270
4700 -1270 -8510 -4423 9563 19669 23168 16071 17266 22106 14565 1542 -2181 -5585 -2256 10903
4686A0903j3947j9636o776k914j136J8038M946o762M866J1484l446K76P027p996
4672e073j2311O7N145L70L389o315L222N022R695L465k24p847O54j261P6o623
4656h549J1979j504j1098K411m189J58K433J25Q343L979o393L803O687J823j1686
4641a678j5384j5341K0598J3867N488j2532j6555j635r972P454J8804R059P889
4628A0062P187m230q972k520l336L922J3584L941n06n550r772j3957p027J955
4614a5219N33L207N611J1559j6109k0504P288M548R065J921n629J3845R592n688
4600D020J834K0571j54j4949j0807j857J5733M557j2261r73n581p628L04L90J4282
4585G481L996r088o246R854Q805l810j6392O271K447O952J5789j8042j5242L024
$$ plain form
4686 10903 -3044 -22680 -29456 -32370 -33506 -15468 -10522 -17284 -12418 -934 -4380 -4104 2923 -5073
4672 -5073 -17384 -17317 -12172 -11802 -8413 -14728 -11506 -6484 3211 6676 6452 -1395 -741 -2002 -1926 -8549
4656 -8549 3430 1926 -9172 -6761 -10950 -10792 -8359 -8234 109 4088 -2305 1498 8185 10008 -1678
4641 -1678 -17062 -32403 -11805 2062 7550 -4982 -21537 -23172 -33144 -25690 -6886 2173 10062
4628 10062 17249 13019 4047 1527 -1809 2113 15697 19638 19132 13582 3810 -10147 -17174 -15219
4614 -15219 -14686 -11479 -5868 5691 -10418 -30922 -23634 -19086 -10021 -8100 -13729 116 9708 4020
4600 4020 5854 26425 26271 11322 515 -1342 14391 18948 6687 5714 133 -7495 -7191 -6801 7481
4585 7481 11477 2389 -3857 5997 14802 10992 -5400 871 3318 10270 26059 8017 -7225 -4201
4571d201n87N607K5492K497l244J833J320j7053l0845n853J6556l469M096J0326
4557B475M619o544L589k634m589M394r841l134M168R05O760J5089l004j830O839
4542A7262M619k4003j5828m884J4638J3126j9455r002J2226J1325M015Q43r13
4529C969R144n86m964j5894o654J3075L968K597N964k0297p768K4N388J2181l595
4514c448J204K838J5017J593j4672l640J0657M896O472J906J4153j4328k6036
4501c388R095J929l266J39j0182n244L233k276m43P94J5873R715j440q985j6388
4486a0834r177Q497J7059R353J236P876K543k2087r852N103L644j9077r326J4558
4472a0484R455r878R509J0702o065j1453m249K2470J0533Q964k030k2469k1469
$$ plain form
4571 -4201 -4788 819 26311 28808 25564 27397 28717 11664 -19181 -25034 -8478 -11947 -7851 2475
4557 2475 7094 550 4139 1505 -3084 1310 -8531 -11665 -7497 -6592 168 15257 12253 10423 17262
4542 17262 21881 -2122 -17950 -22834 -8196 4930 -14525 -23527 -11301 24 4039 4882 3969
4529 3969 13113 12527 7563 -8331 -14985 -1910 2058 4655 10619 -9678 -17446 -17422 -12034 147 -3448
4514 -3448 -2244 594 15611 17204 2532 -1108 9549 14445 20917 22823 36976 22648 -3388
4501 -3388 5707 7636 4370 4509 -5673 -10917 -7684 -9960 -10403 -9609 6264 15979 14539 5554 -10834
4486 -10834 -20011 -11514 5545 14898 16134 24010 26553 4466 -5386 -283 3361 -15716 -25042 -10484
4472 -10484 -1029 -10907 -1398 9304 3239 -8214 -12463 10007 20540 29504 27474 5005 -16464
4459a6464r475M442R741J3553J2026m919N391j2239o341L265K2119P24j0240k107
4445I476j0659j8725M756J2491O806k00n186J800J6469O670r540j2440J418j2525
4431i389O154P289Q234o800j6844j1559k301M176j725N094p65K944J7150J4548
4417A6206J5419k430j5901O541n237k226m362k0675m566J0118J1057l765l051
4404b872k191J0607J580p283o637o233K611n683P896n138K36Q235K3889O231l259
4389B1989n922r661o694J705J0550K83J318r377k1464m46J4597m75O901K176o416
4374i36k615j502k4028J2899J6410J901j98j272M183P241m746j7734n918o978
4360b3293R062k908j292J5177J1435r02r244M536o816J4284J440J0576l810L484
$$ plain form
4459 -16464 -25939 -21497 -11756 1797 13823 8904 14295 2056 -4285 -1020 21099 21823 11583 9476
4445 9476 -1183 -19908 -15152 -2661 4145 3945 -1241 559 17028 23698 14158 1718 3136 -9389
4431 -9389 -3235 4054 12288 5488 -11356 -22915 -25216 -21040 -22765 -17671 -18436 -15492 1658 16206
4417 16206 31625 29195 13294 19835 14598 12372 8010 -12665 -17231 -7113 3944 179 -2872
4404 -2872 -5063 5544 7124 -159 -6796 -13029 -10418 -16101 -8205 -13343 -13107 -4872 19017 25248 21989
4389 21989 16067 6406 -288 1417 11967 12250 13568 4191 -17273 -17719 -3122 -3597 3304 5480 -936
4374 -936 -3551 -5053 -29081 -16182 228 2129 1931 659 4842 12083 7337 -10397 -16315 -23293
4360 -23293 -14231 -17139 -18431 -3254 8181 7279 -1965 2571 -4245 10039 11479 22055 18245 21729
4346B1729P838J038m383r261n862p508J0209j1867o14Q664j0806j2902n234J0836
4332h123J3165L612p412l789K245J698j110o373n418p538J5146N772L864L33k244
4317C828M769K450j2386j647R780L07k660j2305p197M804k703k690J7171P241
4303H762r708k3800p532Q365O947J4031K638P885m134q556p525M470K033P664
4289A540J4710j2473j676j80j6337m036N659N131J344j890j0207R512R093j108
4275i18L885J3761K625p247K262p300p37j910j4586j1394M881P205M123O970R26
4260B546j4216j3399J3880M725q151J2069Q135K432m161p53Q721j471p544K76
4246C089o993j1474r834N618M812P285J1511J2285n701j9250n420M271j67o120
$$ plain form
4346 21729 29567 30605 26222 16961 11099 3591 13800 1933 1319 9983 -823 -13725 -18959 -8123
4332 -8123 5042 8654 1242 -2547 -302 1396 286 -6087 -11505 -19043 -3897 1875 5739 6072 3828
4317 3828 8597 11047 -1339 -2986 6794 7101 4441 -7864 -15061 -10257 -12960 -15650 1521 8762
4303 8762 -946 -24746 -32278 -23913 -16966 -2935 -297 7588 3454 -5102 -12627 -8157 -6124 1540
4289 1540 16250 3777 2101 1921 -14416 -18452 -12793 -7662 -6318 -8208 -18415 -8903 190 -918
4275 -918 2967 16728 19353 12106 14368 7068 6331 4421 -10165 -21559 -16678 -9473 -5350 1620 2546
4260 2546 -11670 -25069 -11189 -6464 -14615 -2546 5589 8021 3860 3107 11828 10357 2813 3089
4246 3089 -3904 -15378 -25212 -19594 -14782 -7497 4014 16299 10598 -8652 -14072 -9801 -9968 -16088
4232a6088J0343O351j057j8699j598L981R278P890q068k3158n977Q818Q337M220
4218a5427J1361K631J325J0246j1220n184L838p03n357M728M523m020k390P517
4204A868L133j3810O70L778M354R899q363q303m212j161q819l342Q057J4358K1214
4189A9321J2182j168j0825j2822m994Q141L371o205n477j9442j2485J4094J4931
4176a378J187N342m55j1045q412m275J0176J3369K424l291j1576j879N120J2546
4162G853L262j5992n707Q429J629Q377M871j0230m730J1178O937j1080j2665j1109
4148a8977M672Q822J375q112K134J3261N908o197r60J5796o473j9211K495j698
4134g165L505N683Q836k816o284P63l121n701M894M74m381o581J4288L628j1117
$$ plain form
4232 -16088 -5745 606 -451 -19150 -20748 -16767 -7489 401 -7667 -30825 -36802 -27984 -19647 -15427
4218 -15427 -4066 -1435 -110 10136 -1084 -6268 -2430 -3133 -8490 -3762 761 -3259 -5649 1868
4204 1868 5001 -8809 -8139 -4361 -7 9892 1529 -6774 -10986 -12147 -20966 -24308 -16251 -1893 19321
4189 19321 31503 30335 19510 6688 1694 9835 13206 7001 1524 -17918 -30403 -16309 -1378
4176 -1378 -191 5151 4696 -6349 -14761 -19036 -8860 4509 6933 3642 -7934 -9813 -4693 7853
4162 7853 11115 -4877 -10584 -2155 -526 7851 12722 2492 -2238 8940 15877 4797 -7868 -18977
4148 -18977 -14305 -5483 -4108 -12220 -10086 3175 9083 2886 1926 17722 11249 -7962 -5467 -7165
4134 -7165 -3660 2023 10859 8043 1759 2522 -599 -6300 -1406 -932 -5313 -11894 2394 6022 -5095
4119e095r488l173M583M842J791p518l898j017K0106J2277M9q091m894p33Q194
4104G935M602N12p156q573J875J571p694p689N755N195k05l572L984O937J986
4089E463q853o800L587P158p668l497M989P726j1863k480m733j0051m622l931
4075c5575J5886M232l988J1435n411q583J2594l459l217J1622J3584o109j6572
4062a3561j2825Q151Q182J134K434R163j1774L454Q52j8986M117O095l248N258
4048a1554K900R608K07k155l854n991o202o543o285M310J0186k842m917Q143J3328
4033a661j1906l746J2479O324j2598j8274l414R488K2781L730O807L85N164l778
4019A1781l901j1776j1181q257n185J5162j635Q80M262P48J3233M987p052l05
$$ plain form
4119 -5095 -14583 -17756 -13173 -8331 -6540 -14058 -17956 -18973 1133 13410 13459 5368 474 -259 7935
4104 7935 12537 13049 5893 -2680 -805 766 -6928 -14617 -8862 -3667 -3872 -7444 -3460 3477 5463
4089 5463 -3390 -10190 -6603 555 -7113 -10610 -5621 2105 -9758 -12238 -16971 -27022 -31644 -35575
4075 -35575 -19689 -15457 -19445 -8010 -13421 -22004 -9410 -12869 -16086 -4464 9120 3011 -13561
4062 -13561 -26386 -18235 -10053 -8919 -6485 2678 -9096 -5642 -4790 -23776 -19659 -13564 -16812 -11554
4048 -11554 -8654 954 1161 -994 -4848 -10839 -17041 -23584 -29869 -25559 -15373 -18215 -23132 -14989 -1661
4033 -1661 -13567 -17313 -4834 1490 -11108 -29382 -32796 -23308 -527 3203 10010 10395 15559 11781
4019 11781 7880 -3896 -15077 -23334 -28519 -13357 -14992 -14112 -9850 -9102 4131 9118 2066 1761
4005A761l85P270J066o495K84k136j9546J88J6054L135K019q320n586r262k015
3990b1968j0834N768J6157J4130m013r55l873j4866m72J0451p28J2568n403q885
3976a2923J2739L94m870r962P228M442j1393Q821M68k144J2829l927n768l180
3962g246j3086p91J1378N702L026L01n914o323J2935J1262j1200k2621J3390R977
3948G90l953K98m912p910J71L964j325k71O246N703M811J571q528r058j146k614
3932a6163J798J8948j1506j3107K157K417o37N448O312o791j892K358M166K946
3918c546K301k834j240o896r52q646M016L538q928k198l362Q953K1677L771k344
3903C310o255P105P568N329k199Q49R704n207j9044j5697k1273l63L739M327J0521
$$ plain form
4005 1761 1376 8646 9712 3217 3501 1365 -18181 -17993 -1939 1196 3215 -5105 -10691 -19953 -21968
3990 -21968 -32802 -27034 -10877 3253 -760 -1715 -5588 -20454 -20926 -10475 -11203 1365 -4038 -12923
3976 -12923 -184 210 -4660 -14622 -7394 -2952 -14345 -5524 -5056 -7200 5629 1702 -4066 -7246
3962 -7246 -20332 -21123 -9745 -4043 -1017 -716 -6630 -12953 -18 11244 44 -22577 -9187 790
3948 790 -3163 -2865 -7777 -15687 -15516 -11552 -12877 -13148 -6902 -1199 3612 5183 -3345 -12403 -13549 -16163
3932 -16163 -14365 4583 -6923 -20030 -17873 -15456 -16093 -10645 -4333 -11124 -13016 -10658 -6492 -3546
3918 -3546 -1245 -4079 -5319 -12215 -13167 -21813 -17797 -14259 -23187 -25385 -28747 -19794 1883 5654 3310
3903 3310 -2945 4160 11728 17057 14858 15707 25411 20204 1160 -14537 -35810 -36173 -32434 -28107 -17586
3888a7586J5619n441j1030J3327N438N193j5047j0217J3708L493J254R522O544
3875A4777l847M34L791j0873J922o829n318J997n259j1218L285q263j0740j331
3861c7472P667J7451L412m380k1117K248K2671J2983l364P930p0r954j4685n146
3847b1826K702P967J7004Q72m982l898R359j1545n300l385k987j307Q939Q095
3833b92j542r735l284L471p099o903L878J690N544R988j255k976P58m180R510
3818b427R433r498l515n29o060J029N162l918j1638J8087R422R06m098k393j660
3803a697J2159j2663j8996K135J1261L876M259p629l282R26M533N703J0263k736
3789H112o820J816J694P743K179j3786j2513J0306j1818m439R681P983q013k120
$$ plain form
3888 -17586 -1967 -7408 -18438 -5111 327 5520 -9527 -19744 -6036 -2543 -1289 8233 14777
3875 14777 10930 11364 15155 4282 6204 -625 -5943 -3946 -9205 -20423 -17138 -25401 -36141 -37472
3861 -37472 -29805 -12354 -8942 -13322 -34439 -32191 -9520 3463 99 8029 7959 -1995 -16680 -21826
3847 -21826 -19124 -11157 5847 6719 1737 -2161 7198 -4347 -9647 -13032 -16019 -17326 -8387 -292
3833 -292 -1834 -11569 -14853 -11382 -18481 -25384 -21506 -19816 -14272 -4284 -5539 -8515 -7757 -11937 -2427
3818 -2427 7006 -2492 -6007 -6536 -12596 -11567 -6405 -10323 -21961 -3874 5548 6454 2356 -37 -1697
3803 -1697 10462 -2201 -21197 -19062 -7801 -3925 334 -7295 -10577 -9651 -5118 585 10848 8112
3789 8112 1292 3108 4802 12545 14724 938 -11575 -1269 -13087 -17526 -7845 138 -7875 -9995
3775i995K414L013l421j296J5777L594K640M59j562J94k183n488l543j2253p118
3760a8768M738J982n954n833l926p683J079Q688J4565J0312K609j4419j0565j0870
3746c4045M600J6486p494l863j151n63K949N185L784R611p96Q645P975n250K91
3731F364j527J18n029q308j665J5657Q221O65p10k086N058L645j1612j4372j7233
3716b2814Q028q513r033o70K4182J1019M670q611j4435k06p764j2847P388J7732
3702a1874Q886K716n88J126j0700q019j913N563R568J1804j1067k786l314j085
3688a1683M722J0410J0982o05p150r175r455j543P158l551O537J5154n553m903
3674A345N000M885K182r502m015J4134l261q336M188j2205J496j982J6587n500
$$ plain form
3775 -9995 -7581 -4568 -7989 -9285 6492 10086 12726 13185 11623 11817 9634 4146 603 -11650 -18768
3760 -18768 -14030 -12048 -18002 -23835 -27761 -35444 -34365 -25677 -11112 -800 1809 -12610 -23175 -34045
3746 -34045 -29445 -12959 -20453 -24316 -25467 -26030 -23081 -17896 -14112 -4501 -5297 3348 11323 6073 6364
3731 6364 4837 4955 -74 -8382 -10047 5610 13831 14496 13786 11700 16758 20403 8791 -5581 -22814
3716 -22814 -14786 -23299 -32332 -33002 -8820 2199 6869 -1742 -16177 -16383 -24147 -36994 -29606 -11874
3702 -11874 -2988 -272 -860 266 -10434 -18453 -20366 -14803 -5235 6569 -4498 -7284 -10598 -11683
3688 -11683 -6961 3449 14431 13826 6676 -2499 -11954 -13497 -6339 -9890 -3353 11801 6248 1345
3674 1345 6345 11230 13412 3910 -105 14029 10768 2432 6620 -5585 -4089 -6071 10516 5016
3660E016k734j324j5334p723R124J0980L407k488l545j0987q899Q433O707N96
3646h771q68m857j165P388n301n601j184J0451J6940O187k937m967j8803j9231
3632c2719J0169P430l840j464K880O699J4703j7621j4200J3348P774N51r66R307
3618B051M519j2428M100q35j2386p724J0066J4819o11O272r209k530Q918M866
3604I888m115j542K089J5153l490j2083m655L366J923o762O786J681p679O92q870
3589g618j3703p60J2401O705J7103M356o406p461O402K428N166M555j0513j6956
3575d301n120k956j0058Q423J3814J13j1685p954J1544J8299K219j0391n107n282
3561h442P621J6012n252j1574J958P771p475j1485k274O154l55j5087R709P702
$$ plain form
3660 5016 2282 958 -14376 -22099 -12975 -1995 1412 -1076 -4621 -15608 -24507 -16074 -9367 -8771
3646 -8771 -9639 -14496 -15661 -8273 -13574 -19175 -20359 -9908 7032 13219 10282 5315 -13488 -32719
3632 -32719 -22550 -15120 -18960 -20424 -17544 -10845 3858 -13763 -27963 -14615 -6841 -6290 -7256 2051
3618 2051 6570 -5858 -1758 -2593 -14979 -22703 -12637 2182 1571 7843 -1366 -3896 5022 9888
3604 9888 5773 4231 6320 21473 17983 5900 1245 4611 6534 -228 6558 8239 560 1252 -7618
3589 -7618 -21321 -22081 -9680 -2975 14128 18484 12078 4617 11019 13447 18613 23168 12655 -4301
3575 -4301 -9421 -12377 -22435 -14012 -198 -85 -11770 -19724 -8180 10119 12338 1947 -3160 -8442
3561 -8442 -821 15191 9939 -1635 323 8094 619 -10866 -13140 -6986 -7341 -22428 -12719 -5017
3547e017K349O825k479j655J2160j4212j9325o586J9477J6165P719K441n415q251
3533D196L358j0167j8788m022J8636J2619q350l648P15o355l884l226K55J5395
3519c266J6796j0514p299j269M593j874J942P976r715j216M795j0961N542K91
3505d179N497K920j2108r167M798J0867R64L091l251o112j7573L851n846L132
3491b3116K2451k47j0189q275N603P059j0225o88Q064O641o025O794J918M171
3477C936M550l249l735K530P655j3414l768p116r068L090M921Q444p610p94L826
3462i802M959p999j3594R218Q565K538j617K108j556n00m227r650j607l30m675
3447b8169M608l78N997L563j3455q033J4616L608N66R792n818m053O922n05M92
$$ plain form
3547 -5017 -2668 4157 1678 23 12183 -2029 -21354 -27940 -8463 7702 15421 17862 12447 4196
3533 4196 7554 -2613 -21401 -25423 -6787 5832 -2518 -6166 -5451 -11806 -15690 -18916 -18661 -3266
3519 -3266 13530 3016 -4283 -5552 -959 -2833 -891 7085 -2630 -3846 949 -10012 -4470 -4179
3505 -4179 1318 4238 -7870 -17037 -12239 -1372 -408 2683 -568 -6680 -24253 -20402 -26248 -23116
3491 -23116 -665 -912 -11101 -19376 -13773 -6714 -16939 -17627 -9563 -2922 -8947 -2153 -235 3936
3477 3936 8486 5237 1502 4032 11687 -1727 -5495 -12611 -21679 -18589 -13668 -5224 -12834 -13628 -9802
3462 -9802 -4843 -12842 -26436 -17218 -8653 -6115 -7732 -5624 -7180 -7680 -11907 -21557 -23164 -23494 -28169
3447 -28169 -23561 -23939 -17942 -14379 -27834 -35867 -21251 -17643 -17077 -7285 -13103 -17156 -10234 -10739 -10247
3432a0247j834N382j311l363j291O526O113j494q61l122p281k942J4697n842j5259
3417b2129J4912M770M465J0765n954k399p206K7O438k563p924L492J0267q993
3403b032j2440L656j81r436k468l233q995p633O140J8737o168k083J0454m431
3389b0113m525l558J6290J0074O746n029k40L580j1097r852Q049J4106J451N887
3375A1769j9657j6778j1088N035J5056J2547K459M259j597m001j2865O127O919
3362a815j4099q293K818J3305N720j0816o402K933J2700j882O969Q105r671j0988
3348a1416M04N756Q698n60j415P430P73p082J95j2009l488Q350j423l37k267r787
3332a8178q846p458P822R079j762m387j800J2760J9429N680L26p6j1444p071N484
$$ plain form
3432 -10247 -12081 -6699 -8010 -11373 -12664 -6138 -25 -1519 -2380 -5502 -12783 -15725 -1028 -6870 -22129
3417 -22129 -7217 -2447 2018 12783 6829 4430 -2776 -2749 3689 1126 -6798 -3306 6961 -2032
3403 -2032 -14472 -10816 -10997 -20433 -22901 -26134 -35129 -42762 -36622 -17885 -24053 -26136 -15682 -20113
3389 -20113 -24638 -28196 -11906 -1832 4914 -115 -355 3225 -7872 -17724 -9675 4431 5882 11769
3375 11769 -7888 -24666 -35754 -30719 -15663 -3116 -657 3602 2005 -1996 -14861 -8734 -1815
3362 -1815 -15914 -24207 -21389 -8084 -2364 -13180 -19582 -16649 -3949 -5831 1138 9243 -428 -11416
3348 -11416 -11012 -5256 3442 2882 1467 8897 9670 2588 2783 -9226 -12714 -4364 -5787 -6124 -8391 -18178
3332 -18178 -27024 -34482 -26660 -17581 -19343 -23730 -25530 -12770 6659 12339 12665 12589 1145 -5926 -442
3317d42r520Q278R858L14l326k835m63r962j4870m313l02Q671J8297M906k12M412
3301H491o769N830m49j3668r298k326J2779O018p650j9676m36J5253J1707Q887
3287H693j0398q204k41J2031K181j600n174J2552P834r845j704o384p743l328
3273a1330j603M512K740N56j562j170R135j6492j1077R095J0548R11J5126Q393
3259A7782j8963k3904J2763P559K715L687r310p149L252O586m278R983L705k5048
3245b0620j0055J3314K631J8309P463j3850N166j17l728R880L419r377n793q450
3231a1808J844p988l946j997P962N937o186O522j368k976M146m342J975N066r889
3216a7048n880J5973J2908r745Q307j3524j0046j4302M761j559p45K5388L917
$$ plain form
3317 -442 -9962 -1684 8174 8488 5162 2327 1864 -8098 -22968 -27281 -27583 -18912 -615 4291 4079 8491
3301 8491 1722 7552 7103 -6565 -15863 -18189 -5410 608 -7042 -26718 -27154 -11901 -194 8693
3287 8693 -1705 -9909 -10150 1881 4062 2462 -2712 9840 17674 7829 6125 -259 -8002 -11330
3273 -11330 -12933 -8421 -5681 -5125 -6687 -7857 1278 -15214 -26291 -17196 -6648 -5737 9389 17782
3259 17782 -1181 -25085 -12322 -4763 -2048 1639 -7671 -14820 -11568 -4982 -9260 723 4428 -20620
3245 -20620 -30675 -17361 -14730 3579 11042 -2808 2358 2241 -1487 8393 11812 2435 -3358 -11808
3231 -11808 -9964 -17952 -21898 -23895 -15933 -9996 -16182 -9660 -11028 -14004 -9858 -14200 -12225 -7159 -17048
3216 -17048 -22928 -6955 5953 -3792 4515 -9009 -19055 -33357 -28596 -30155 -30900 -5512 -1595
3203a595j5244J705J1466P092p35k263j2687o664P740K071P308J1717M596L221
3189A7728L420n821n032m257j3071k819l383k31J2049J7289k621q561J2743n153
3175A2280m820O596j7762j249O261j526q068j993N762N54k733q396k018R59n685
3160b1838J625jO398j949M103j1981k665J3095M54q713l803q480q005J1815K1091
3145h854J49o279K428J122J5850J1974M88P064M886m592o857k489j6111j442K647
3130a6N775m492j7249n622J0812O029L101J32l76O339m603M951L434l334r180
3115d299k833j0294m968J265P109P227J8650Q131j0917o925j0856j1862l654J263
3101b2963Q377OJ3557o252K396R373J2873p977k576K721N032l433M060l339l669
$$ plain form
3203 -1595 -16839 -15134 -3668 3424 2689 426 -12261 -18925 -11185 -9114 -1806 9911 14507 17728
3189 17728 21148 15327 10295 6038 -7033 -9852 -13235 -13466 -1417 15872 13251 4690 17433 12280
3175 12280 7460 14056 -3706 -4955 1306 -220 -8288 -10281 -4519 -3965 -6698 -15094 -17112 -16153 -21838
3160 -21838 -20213 -20214 -13816 -15765 -11662 -23643 -26308 -13213 -12759 -21472 -25275 -33755 -41760 -29945 -8854
3145 -8854 -8705 -14984 -12556 -11434 4416 16390 16878 23942 28828 24236 17379 14890 -1221 -2663 -16
3130 -16 5759 1267 -15982 -21604 -10792 -4763 -1662 -1530 -1906 4433 -170 4781 8215 4881 -4299
3115 -4299 -7132 -17426 -22394 -21129 -14020 -6793 11857 19988 9071 2146 -8710 -20572 -24226 -22963
3101 -22963 -14586 -14580 -1023 -7275 -4879 4494 17367 9390 6814 9535 14567 11134 15194 11855 8186
3086H186m628j806O10j6013R32K2087k267j8119r416K936L588K439j1501p788
3072c0760k119O917p976l114J7531K0965R064n290l453Q46R735j1995j6667M294
3058a2022l718M05N442k617P809J5645l883k204j0556k801Q678j0309j0635j786
3044b2552J0057Q012J2383L169j4410n499k389k4759K837Q774N695O679k514j493
3030a6010m467O25L362N994J9250o527k1497k0687K50q81R963J2792N771J1032
3016a030l225k415J1328J6477o553o342l555n942j0429p051O961k085q004r325
3002c1190P208O963J2280J4737k855m311l1r949m598j769N481M760K440N124r713
2987e423k825m025r950p366o525n622P713N440P246Q549M142J453N316l974r082
$$ plain form
3086 8186 3558 1752 2362 -13651 -12719 9368 7101 -11018 -20434 -17498 -13910 -11471 -22972 -30760
3072 -30760 -32879 -25962 -33938 -37052 -19521 1444 10508 5218 1765 2611 12346 351 -16316 -12022
3058 -12022 -15740 -15335 -9893 -12510 -4701 10944 7061 4857 -5699 -8500 178 -10131 -20766 -22552
3044 -22552 -12495 -4483 7900 11069 -3341 -8840 -11229 -35988 -33151 -24377 -18682 -12003 -14517 -16010
3030 -16010 -20477 -19852 -16490 -10496 8754 2227 -19270 -39957 -39707 -40588 -30625 -17833 -12062 -1030
3016 -1030 -4255 -6670 4658 21135 14582 8240 4685 -1257 -11686 -18737 -11776 -13861 -21865 -31190
3002 -31190 -23982 -17019 -4739 9998 7143 2832 2801 -7148 -11746 -13515 -8034 -3274 -834 4290 -5423
2987 -5423 -8248 -12273 -22223 -29589 -36114 -41736 -34023 -28583 -21337 -12788 -8646 -7193 -1877 -5851 -14933
2972a4933l060P234K0007r560l603R881K201j1723M08p177j831P56Q378J1873
2958H851J292l857r880p229l583j19k644K688N414J083K404p239K882J975p074
2943a5036L45K6897Q81j5757p419P171M98J413q382K436l701n061R52K916o963
2928a8810O995j580j199O999r888j0588O158O905Q87J5311r122k0974q199N472
2914c1633N018k137O82J5952J5719R363K266k0233j3762O430M525k476j0555R17
2900a9924P357M94j972J0818N266j3998n401N867O490K534p490J728r719p796
2886b5746M141N607j709J800l212L057q9k025J1213n294o527P397J611p410n351
2871b2537m543K320N981P970j922j0261k544o132J4570Q184j195n736L967Q569
$$ plain form
2972 -14933 -17993 -10759 9248 -312 -3915 5966 8167 -3556 -3148 -10325 -12156 -11400 -3022 8851
2958 8851 10143 6286 -3594 -10823 -14406 -14525 -17169 -14481 -9067 -7984 -5580 -12819 -9937 -7962 -15036
2943 -15036 -14691 12206 13087 -2670 -10089 -2918 -2420 -1007 -9389 -6953 -10654 -15715 -14763 -11847 -18810
2928 -18810 -11815 -13395 -14594 -7595 -17483 -28071 -21913 -15008 -14121 1190 -7932 -28906 -37105 -31633
2914 -31633 -26615 -28752 -28070 -12118 3601 12964 15230 -5003 -18765 -12335 -7810 -10286 -20841 -19924
2900 -19924 -12567 -12073 -14045 -3227 2039 -11959 -17360 -11493 -5003 -2469 -9959 -8231 -17950 -25746
2886 -25746 -21605 -15998 -17707 -15907 -19119 -16062 -16151 -18176 -6963 -12257 -18784 -11387 -9776 -17186 -22537
2871 -22537 -27080 -24760 -18779 -10809 -12731 -22992 -25536 -31668 -17098 -8914 -10109 -15845 -11878 -3309
2857c309k935Q660Q411k301j3678p813O854O086p14K816J866j0310k0559K216
2843b4710J699K869j0038M247J8524J7564N958k0272q061p690o131J6830J2073
2830B862k380O516J92k990L698N259j3020j3201l824q387R862K927r058o270J4127
2815a3687L784L937M53O935j08Q263P640j2356r910l397j2108j59J0324R469m191
2800e111O50L815L504M988J298j3965k2036q490P015R050M201o146N113Q229r182
2785a7067J0963k888N900J046m549q074J3825J2634o086k08L899j1980j99j1826
2771a4610k533O095K561J7976r017j4652P524J0684o67m693q198l116j2953o31
2757b6230K488l577Q164J1523J5234o310j7206N502J0125L442Q527j4874k1711
$$ plain form
2857 -3309 -6244 2416 10827 8526 -5152 -12965 -6111 -25 -739 2077 3943 -6367 -26926 -24710
2843 -24710 -23011 -20142 -30180 -25933 -7409 10155 16113 -4159 -12220 -19910 -26041 -9211 2862
2830 2862 482 6998 7190 4200 7898 13157 137 -13064 -16888 -25275 -15413 -12486 -21544 -27814 -13687
2815 -13687 -9903 -5966 -5513 1422 1314 9577 17217 4861 -5049 -8446 -20554 -20713 -10389 -920 -5111
2800 -5111 -4461 -646 2858 7846 9144 -4821 -26857 -35347 -28332 -19282 -15081 -21227 -16114 -7885 -17067
2785 -17067 -6104 -8992 -3092 -2046 -6595 -14669 -844 11790 5704 5496 9395 -2585 -2784 -14610
2771 -14610 -17143 -11048 -8487 9489 472 -14180 -6656 4028 3361 -1332 -9530 -12646 -25599 -26230
2757 -26230 -23742 -27319 -19155 -7632 7602 1292 -15914 -10412 -287 3155 11682 -3192 -24903
2744b4903Q970J3634Q24j838J841K335q000K344J094n846l936j1833n619l677
2730c4610J2715M835L178L319n840r29l392J441O25L297M568J8881K095j0361
2716a78n254p240R56O623J578j458K27k208R16j0470R638J3438Q073j1078r874
2701f311j222R47J7890R395r524j5815k565R337K789k826O754k73K013j2129q861
2686a0401p059j700J1394N905J026Q857j806l485K377K449Q399M579R20q426j26
2671A2903O004K602K012m916j3053j0203j3185q40R682m024n805N755q834J0023
2657a1879J1478q038m39o303r400J0215P063k62k954j894J2276o157q193M243
2643a0244J662k123N220K130P803K588R418P61r846K364k399l660l886l714J1179
$$ plain form
2744 -24903 -15933 -2299 -1475 -3313 -1472 863 -7137 -4793 -3699 -9545 -13481 -25314 -30933 -34610
2730 -34610 -21895 -17060 -13882 -10563 -16403 -17332 -20724 -19283 -18658 -15361 -10793 8088 10183 -178
2716 -178 -5432 -12672 -11716 -5093 -3515 -4973 -4746 -6954 -6038 -16508 -6870 6568 14641 3563 -6311
2701 -6311 -7533 -6586 11304 20699 11175 -4640 -7205 2132 4921 2095 8849 8576 10589 -1540 -10401
2686 -10401 -17460 -19160 -7766 -1861 -835 8022 6216 2731 5108 7557 15956 20535 21455 13029 12903
2671 12903 18907 21509 23521 18605 5552 -4651 -17836 -18676 -8994 -13018 -18823 -13068 -21902 -11879
2657 -11879 -401 -8439 -8878 -15181 -24581 -14366 -7303 -7565 -10519 -12413 -137 -6294 -14487 -10244
2643 -10244 -8582 -10705 -5485 -3355 4448 7036 16454 17215 7369 9733 7334 3674 -212 -3926 7253
2628G253L282P380r44j2877j2007j126J2829k02l648j2829o667J4746J3152q251
2614I1j62R255K616m835n630r751j0219o123K710K0789J0248n236O580m299l314
2599B720J2021O218j2466m417j4016o091k635p434J1777P485P397M879j0213j0933
2585a5708m84J322J1154J4451j448k1648l698O398P883J334N66l576n848l403
2571a2705o150Q769L092q514O044j128L272J0670P034l885n900n655r321j765
2557a6142N218Q761K368j693J299R46k58K587L931o248n918J0230L518j0603q252
2542a0256J5635L519l002M401N037L856p209j4333O668L882j0352r48J0861k499
2528E260k686M02j421m061k393J2770r358l748J1760o169j0769N759L272l043
$$ plain form
2628 7253 10535 17915 16971 4094 -7913 -9039 3790 3588 -60 -12889 -19556 -4810 8342 91
2614 91 -71 9184 11800 6965 1335 -8416 -18635 -24758 -22048 -1259 8989 3753 10333 6034 2720
2599 2720 14741 20959 8493 4076 -9940 -16031 -18666 -26100 -14323 -6838 559 5438 -4775 -15708
2585 -15708 -16192 -14870 -3716 10735 9287 -12361 -16059 -9661 -1778 -444 122 -3454 -9302 -12705
2571 -12705 -18855 -10086 -6994 -15508 -9464 -10592 -7320 3350 10384 6499 599 -5056 -14377 -16142
2557 -16142 -10924 -2163 205 -1488 -189 757 499 3086 7017 769 -5149 5081 8599 -2004 -10256
2542 -10256 5379 8898 5896 10297 15334 19190 11981 -2352 4316 8198 -2154 -3102 7759 5260
2528 5260 2574 2976 1555 -2506 -4899 7871 -1487 -5235 6525 356 -10413 -4654 -1382 -4425
2514d425l33j94J146K462p348j936R346K491N714k473j308L590J661r741k134
2499c482j537K613J4114Q624K055K989L273O58j9595j1627n506o647J3887K962
2485B781j3878p057L700J2458K0376o58q475j658J4022O94m25l646j0745j092
2471F397k355n814J672O923p799j2430n836m292M845M830P87k22m30J0489K282
2456i53m265m129j3023J155P668K506l246j2613N48o51n032J0263J7334K42k647
2441f843O001j909j3034j0012J4228P136L329P561n32j1345O690L432k726n46
2427A430j7914j0132r111N24N903J033L267M330N289K2126J2857J218p564j2780
2413D76o917J564O871P176J449j19k626k923k599l876k581o205N224J5673J650
$$ plain form
2514 -4425 -4758 -4952 -3806 -1344 -8692 -10628 -1282 1209 6923 4450 3142 6732 8393 -1348 -3482
2499 -3482 -5019 -2406 11708 20332 22387 25376 28649 29307 9712 -1915 -7421 -14068 -181 2781
2485 2781 -11097 -18154 -14454 -1996 18380 17722 9247 7589 21611 22305 21880 18234 7489 6397
2471 6397 4042 -1772 -100 6823 -976 -13406 -19242 -23534 -18689 -13859 -13072 -13294 -13724 -3235 -953
2456 -953 -5218 -9347 -22370 -21215 -13547 -11041 -14287 -26900 -26352 -27003 -32035 -21772 -4438 -4196 -6843
2441 -6843 -842 -2751 -15785 -25797 -11569 -4433 -1104 6457 5925 -5420 1270 4702 1976 1430
2427 1430 -16484 -26616 -35727 -35203 -29300 -28267 -25000 -20670 -15381 6745 19602 20820 13256 476
2413 476 -6441 -4877 1994 9170 10619 10500 7874 4951 2352 -1524 -4105 -10310 -5086 10587 12237
2398A2237N077l731j2674j7728k690O703K0452J519l322j650K464k455p743j5457
2384a8998m305n83M878R297P686j2464K529l46m421J4550J398r437o183j1745
2370b8144q720J3546P297R882N241n007j0312o943l64p725j0172J98P433J8259
2356a5531K87K271n649Kj0479J6357J2069J322P492j0402j1563R221O263P262
2342H922l733k846l612J764N367o640m58l353p610M003k513l572J4704N022j228
2327D217k842J282m923K701J865J0109M50r019Q194m671p912N430m899j0205k291
2312a2514M711J286K014J1753r207m544l493P375o561R37j600N85m508j488M06
2297a4848J236k09q108j234N927M785K619q371J6151P875k4760j6364Q651K2020
$$ plain form
2398 12237 17314 13583 909 -16819 -19509 -12806 7646 9165 5843 4193 6657 4202 -3541 -18998
2384 -18998 -23303 -23886 -19008 -9711 -2025 -14489 -11960 -12306 -16727 -2177 -779 -10216 -16399 -28144
2370 -28144 -36864 -23318 -16021 -6139 -898 -5905 -16217 -23160 -23524 -31249 -41421 -41223 -33790 -15531
2356 -15531 -15244 -12973 -18622 -18620 -29099 -12742 -673 649 8141 -2261 -13824 -4603 1660 8922
2342 8922 5189 2343 -1269 495 5862 -778 -1236 -4589 -12199 -8196 -10709 -14281 423 5445 4217
2327 4217 1375 2657 -2266 435 2300 12409 12859 3840 12034 7363 -549 4881 -18 -10223 -12514
2312 -12514 -7803 -6517 -4503 7250 -1957 -6501 -9994 -2619 -9180 -8243 -9843 -9258 -13766 -15254 -14848
2297 -14848 -13612 -13821 -21929 -23163 -17236 -12451 -9832 -18203 -2052 5823 -18937 -35301 -26650 -4630
2283d630L532j0101l328j957J970M775P315l827Q069n478N93M242Q60j1008j2171
2268b1144p885P671J2510j665O869O238n971r070k011P712N473l000k378J956
2254d695J3569R790j3294r256J1368J0171L808n720o420k680j4548l396m254M298
2240a1259J0642m224J2143K349j1944L108L937m216j7885p173J0546j1392p022
2227c2390J8562J7015R947l683n867n487j8928K135L438l61n45m93J0065k289
2213h881O95O477k538m455M930J4559j969j5047q783J174n266j0161n056j2159
2199d6480Q177K2537R978J0565n395q868j353r914O639R868R137J3753J216j3042
2185F818p274p224q095M000O987K812j1530k507J408L145n213J042k179k93O714
$$ plain form
2283 -4630 -1098 -11199 -14527 -16484 -14514 -9739 -2424 -6251 1818 -3660 -3067 1175 2035 -8973 -21144
2268 -21144 -29029 -21358 -8848 -10513 -3644 2594 -3377 -12447 -14458 -6746 -1273 -4273 -6651 -4695
2254 -4695 8874 18664 5370 -3886 7482 17653 21461 15741 9321 6641 -7907 -11303 -15557 -11259
2240 -11259 -617 -4841 7302 9651 -2293 815 4752 536 -17349 -24522 -13976 -25368 -32390
2227 -32390 -13828 3187 13134 9451 3584 -1903 -20831 -18696 -15258 -15619 -16164 -16657 -6592 -8881
2213 -8881 -8186 -1709 -4247 -8702 -3772 10787 8818 -6229 -15012 -13838 -19104 -29265 -34321 -46480
2199 -46480 -38303 -15766 -5788 4777 -618 -9486 -10839 -20753 -14114 -4246 4891 18644 19860 6818
2185 6818 -456 -7680 -15775 -11775 -4788 -1976 -13506 -16013 -14605 -11460 -16673 -15631 -17810 -18103 -11389
2170a1389O57L876R256L652K140p551k046j0942Q613R325n356j2019n712m288
2156b1784Q620J5069L759l650k534j3252M466Q590J735R929N76j6113j1673Q540
2142g722J4647m073j1897p213j939Q848k521O262L034l54n448q29K0015O609J518
2127A8937l128j1318r561R881P856p299J743O709K280p553K879K295j894r090
2113B737j4243K634M343R316P190j1096o513j215J3411n453j3571N0J91L395N422
2098c402J16J8307N725n106r830j7060p438o431J0815Q527j2204k456O016J1629
2084b792o6P538J3333n410r760r64L381O190R818j24j1602j0960o35R902m047
2069C802L17j0424j4121j59j600q406N269J4600L623J4533O782J78q070n114j0516
$$ plain form
2170 -11389 -10732 -6856 2400 6052 8192 641 -1405 -12347 -3734 5591 235 -11784 -17496 -21784
2156 -21784 -13164 1905 5664 2014 -520 -13772 -9306 -716 1019 10948 11524 -4589 -16262 -7722
2142 -7722 6925 2852 -9045 -16258 -18197 -9349 -11870 -5608 -2574 -2928 -8376 -9205 10810 17419 18937
2127 18937 15809 4491 -5070 4811 12667 5368 7111 13820 16100 8547 11426 13721 11827 2737
2113 2737 -11506 -8872 -4529 4787 11977 881 -5632 -6847 6564 1111 -12460 -12410 -12219 -8824 -3402
2098 -3402 -3286 15021 20746 15640 5810 -11250 -18688 -25119 -14304 -5777 -17981 -20437 -14421 -2792
2084 -2792 -2858 4680 18013 12603 2843 1879 5260 11450 21268 21144 9542 -1418 -2053 7849 3802
2069 3802 4119 -6305 -20426 -20585 -22185 -30591 -25322 -10722 -7099 7434 14216 14394 6324 1210 -9306
2054i306J199J2312R287l821n436l040N849O742j729q36O187j0251k160k610P264
2039I651n221r804K65j0673p569R436l962M533j0693J0524J7076p713R59K898
2025b93R16Q260p343j3097J2760j257m30Q109P984o998j4469J6059L962p055J1607
2010A8715m582p919q947N882M970n828l775n939j782q18j4498K89m84L247j234
1995b2703Q621K085p2l47j0017m922K420M338J0820p451n437L209O676J473R513
1980a794J8874q89r238l751L567O41M651k514P196n398j2211p043j2549l088J0298
1965a3248P005K832K496m017l876m778L391M373O684Q311k320j1357n612q913
1951a9029k602K7241J6306p958l886L071M161m66k548l824p47M892o523j1466
$$ plain form
2054 -9306 -8107 4205 13492 9671 4235 1195 7044 13786 12057 11221 17408 7157 4997 2387 9651
2039 9651 4430 -5374 -5109 -15782 -23351 -13915 -17877 -13344 -24037 -13513 3563 -4150 -3191 -293
2025 -293 623 8883 1540 -11557 1203 -54 -484 7625 15609 8611 -5858 10201 14163 7108 18715
2010 18715 14133 6214 -2733 3149 8119 2291 -1484 -7423 -9205 -10023 -24521 -24232 -24716 -21469 -22703
1995 -22703 -14082 -11997 -12069 -12416 -22433 -27355 -24935 -20597 -9777 -17228 -22665 -19456 -12780 -11307 -1794
1980 -1794 17080 16191 6953 3202 6769 7410 12061 9547 16743 11345 -866 -7909 -20458 -23546 -13248
1965 -13248 -6243 -3411 -915 -4932 -8808 -13586 -10195 -5822 862 9173 6853 -4504 -10116 -19029
1951 -19029 -21631 5610 21916 13958 10072 13143 17304 16838 14290 10466 9719 14611 8088 -3378
1937c378N123O026P801k838k818K092j166m859j5872r402Q572L927P141J834k809
1922f26o322N653N641n213J615q060M624J9277J1200j0088m514M881J0059j6060
1908A2067j0838O964m510r527KN887j3916l21P969N801K35Q104R811J2295r525
1893B0498j0986O568K236j333q59o670j4339l445L141l613j2153j0569O308Q109
1879a7107K3427Q318n584o493j647q456q24R577P825o802o945r578j577M900j0621
1864b1587o50K676o870J1751K4680P747J583j5292j5136N222K580j033l43J375
1850c297k601N850L11l462r01J01J5971r220p293k235m27J87P8J0097n082j7J4982
1833A3042M102j1737j758p580j2433n116O589r44k76J4555m618M275J1435P14
$$ plain form
1937 -3378 1745 7771 15572 12734 9916 12008 10842 5983 -9889 -19291 -10719 -6792 349 2183 -626
1922 -626 -6948 -1295 4346 -867 748 -7312 -2688 16589 27789 17701 13187 18068 28127 12067
1908 12067 1229 8193 3683 -5844 -5842 45 -13871 -14192 -6223 -422 -187 7917 17728 30023 20498
1893 20498 9512 16080 18316 16983 16124 9454 -4885 -8330 -5189 -8802 -20955 -31524 -25216 -17107
1879 -17107 6320 14638 9054 2561 914 -7542 -8366 1211 9036 2234 -4711 -14289 -15866 -10966 -21587
1864 -21587 -22237 -19561 -26431 -14680 10000 17747 19330 4038 -11098 -5876 -3296 -4329 -4672 -3297
1850 -3297 -5898 -48 263 -3199 -4100 -3999 11972 2752 -4541 -6776 -7203 -7016 -6938 3159 -1923 -1940 13042
1833 13042 17144 5407 3649 -3931 -16364 -21480 -14891 -15835 -16111 -1556 -6174 -1899 9536 10250
1819A0250o799J607j726L682m328j8437Q431J8956J3035P802K892j0306j1972
1806A3087j6576j3599n836r82M344O397N222J7193N326J9q746n132L38O749k100
1791E704K415L517N600N536m509K837j2062k1069j1220R249J2917J5760l211L99
1777A1863n868j6428j3637K113J0598P295j1189n523L727O725P640J4501K776
1764A4593m733M537O694m877r082r770P80r38j472Q893j040M762Q879r021p335
1749H70N879O590l672J480l39q856N32l852m426r313j1304j384J1765R288O873
1734A31K837K980L668p644K042K50Q703k030p519p739j803O075m048o053P332
1719b818m460j0500o744O310J8992Q700m405j7759L365L442P026n528r158q188
$$ plain form
1819 10250 3451 5058 3332 7014 2686 -15751 -7320 11636 24671 32473 35365 25059 13087
1806 13087 -3489 -17088 -22924 -23906 -19562 -13165 -7943 9250 14576 14595 5849 717 1055 7804 5704
1791 5704 8119 11636 17236 22772 18263 21100 9038 -12031 -23251 -14002 -1085 14675 11464 11863
1777 11863 5995 -10433 -24070 -21957 -11359 -4064 -15253 -20776 -17049 -10324 -2684 11817 14593
1764 14593 9860 14397 21091 16214 7132 -2638 -1858 -2796 -4268 4625 3585 8347 17226 8205 870
1749 870 6749 13339 9667 11147 10808 1952 2484 -1368 -5794 -15107 -26411 -27795 -16030 -6742 131
1734 131 2968 5948 9616 1972 4014 4264 12967 10937 3418 -4321 -6124 -49 -4097 -10150 -2818
1719 -2818 -7278 -17778 -24522 -18212 780 9480 5075 -12684 -9319 -5877 1149 -4379 -13537 -21725
1705b1725k016l213J3577Q926J4146J0013j1986l891p763j9916j2005J1501J3861
1692a0491J0392n197q12L359P413J5979o8n664j7508k681P972J9244J1150L756
1678C6844r020k1665J015Q228k432k699P645p586p162R878R256r173j7616q175
1664a2662p734Q749J2276N335L539j3709n165L530L974m154K318L411Q439n89
1650G558j6053o339j0038N803L582r304n015J6026P387N154l135R341N805O605
1636A7377j3236j1617k82K053J214n863J0141J3716N824j3773j8206J1238M669
$$ plain form
1705 -21725 -23741 -26954 -13377 -4451 9695 19708 7722 3831 -3932 -23848 -35853 -24352 -10491
1692 -10491 -99 -5296 -6108 -2749 4664 20643 20575 14911 -2597 -5278 2694 21938 33088 36844
1678 36844 27824 6159 7174 15402 12970 10271 17916 10330 3168 13046 22302 13129 -4487 -12662
1664 -12662 -20396 -11647 629 5964 9503 -4206 -9371 -5841 -1867 -6021 -3703 -292 8147 7558
1650 7558 -8495 -14834 -24872 -19069 -15487 -24791 -29806 -13780 -6393 -1239 -4374 4967 10772 17377
1636 17377 4141 -7476 -7758 -5705 -4491 -10354 -213 13503 19327 5554 -12652 -1414 3255
$$ [...]
##END NTUPLES=NMR SPECTRUM
##END=
