##TITLE=Analysis number 310863
Compound Code tl 00808
Book Reference 358/130/2
Project Code adrs
Chemist Name mikem
##JCAMPDX= 6.0         $$ Bruker NMR JCAMP-DX V2.0
##DATA TYPE= NMR SPECTRUM
##DATA CLASS= NTUPLES
##ORIGIN= Bruker BioSpin GmbH
##OWNER= NMR
$$ XWIN-NMR		Version 3.5
$$ Fri Jun 24 10:40:25 2005 GMT Daylight Time (UT+1h)  MAYBRIDGE\NMR@NMR_250MHZ
##.OBSERVE FREQUENCY= 250.131544655141
##.OBSERVE NUCLEUS= ^1H
##.ACQUISITION MODE= SIMULTANEOUS (DQD)
##.ACQUISITION SCHEME= undefined
##.AVERAGES= 16
##.DIGITISER RES= 18
##SPECTROMETER/DATA SYSTEM= dpx250
##.PULSE SEQUENCE= zg30
##.SOLVENT NAME= DMSO
##.SHIFT REFERENCE= (INTERNAL, DMSO, 0, 16.522)
##AUDIT TRAIL= $$ (NUMBER, WHEN, WHO, WHERE, WHAT)
$$ ##TITLE= Audit trail, XWIN-NMR		Version 3.5
$$ ##JCAMPDX= 5.01
$$ ##ORIGIN= Bruker BioSpin GmbH
$$ ##OWNER= NMR
$$ C:\u/data/dgb/nmr/ADRS/4790/pdata/1/auditp.txt
$$ ##AUDIT TRAIL=  $$ (NUMBER, WHEN, WHO, WHERE, WHAT)
(   1,<2005-06-24 10:39:44.39 +100>,<MAYBRIDGE\NMR>,<NMR_250MHZ>,
      <created by zg, POWCHK disabled, PULCHK disabled
       configuration hash MD5:
       62 19 C7 07 E1 42 D1 B7 37 6C 3D D0 77 39 F9 E6
       data hash MD5: 64K
       3D 80 03 87 CB 12 65 0D 0B 54 BF AF 44 45 78 39>)
(   2,<2005-06-24 10:40:01.79 +100>,<MAYBRIDGE\NMR>,<NMR_250MHZ>,
      <Start of raw data processing
       ef LB = 0.3 FT_mod = 6 PKNL = 1 SI = 32K 
       data hash MD5: 32K
       FA 4A B8 30 61 6B 7F 9A 99 9A CB 46 9A 34 CB A9>)
(   3,<2005-06-24 10:40:07.52 +100>,<MAYBRIDGE\NMR>,<NMR_250MHZ>,
      <apk 
       data hash MD5: 32K
       BE FD 33 3D B9 17 1F 08 7A D6 94 C8 11 42 00 84>)
(   4,<2005-06-24 10:40:09.14 +100>,<MAYBRIDGE\NMR>,<NMR_250MHZ>,
      <abs ABSG = 5 
       data hash MD5: 32K
       CA 52 DD E2 29 F3 39 F1 B9 74 02 BD 8D 07 68 D2>)
$$ ##END=
$$ 
$$ hash MD5
$$ AE 56 2A C4 F7 1C 37 18 5B F3 9B 5C 8C 14 4F A0
##$RELAX= 
##$RELAX= 
##$RELAX= 
##$RELAX= 
##$RELAX= 
##$RELAX= 
##$RELAX= 
$$ Bruker specific parameters
$$ --------------------------
##$DU= <C:\u>
##$EXPNO= 4790
##$NAME= <ADRS>
##$PROCNO= 1
##$TYPE= <nmr>
##$USER= <dgb>
##$AMP= (0..31)
100 100 100 100 100 100 100 100 100 100 100 100 100 100 100 100 100 100 
100 100 100 100 100 100 100 100 100 100 100 100 100 100 
##$AQSEQ= 0
##$AQ_mod= 3
##$AUNM= <au_zg>
##$AUTOPOS= <13 >
##$BF1= 250.13
##$BF2= 250.13
##$BF3= 250.13
##$BF4= 250.13
##$BF5= 500.13
##$BF6= 500.13
##$BF7= 500.13
##$BF8= 500.13
##$BYTORDA= 1
##$CFDGTYP= 0
##$CFRGTYP= 5
##$CHEMSTR= <none>
##$CNST= (0..31)
1 1 145 1 1 1 1 1 1 1 1 1 1 1 1 1 1 1 1 1 1 1 1 1 1 1 1 1 1 1 1 1 
##$CPDPRG= <>
##$CPDPRG1= <>
##$CPDPRG2= <>
##$CPDPRG3= <>
##$CPDPRG4= <mlev>
##$CPDPRG5= <mlev>
##$CPDPRG6= <mlev>
##$CPDPRG7= <mlev>
##$CPDPRG8= <mlev>
##$CPDPRGB= <>
##$CPDPRGT= <>
##$D= (0..31)
0 1 0 0 0 0 0 0 0 0.06 0 0 0 0 0 0 0.0002 0 0 0 0 0 0 0 0 0 0 0 0 0 0 
0 
##$DATE= 1119605982
##$DBL= (0..7)
120 120 120 120 120 120 120 120 
##$DBP= (0..7)
150 150 150 150 150 150 150 150 
##$DBP07= 0
##$DBPNAM0= <>
##$DBPNAM1= <>
$$ [...]
##$SUBNAM7= <"">
##$SUBNAM8= <"">
##$SUBNAM9= <"">
##$SW= 20.6930455092707
##$SWIBOX= (0..15)
0 0 3 0 0 0 0 0 0 0 0 0 0 0 0 0 
##$SW_h= 5175.983436853
##$TD= 65536
##$TD0= 1
##$TE= 295.16
##$TE2= 300
##$TE3= 300
##$TEG= 300
##$TL= (0..7)
0 120 120 120 120 120 120 120 
##$TP= (0..7)
150 150 150 150 150 150 150 150 
##$TP07= 0
##$TPNAME0= <>
##$TPNAME1= <>
##$TPNAME2= <>
##$TPNAME3= <>
##$TPNAME4= <>
##$TPNAME5= <>
##$TPNAME6= <>
##$TPNAME7= <>
##$TPOAL= (0..7)
0.5 0.5 0.5 0.5 0.5 0.5 0.5 0.5 
##$TPOFFS= (0..7)
0 0 0 0 0 0 0 0 
##$TUNHIN= 0
##$TUNHOUT= 0
##$TUNXOUT= 0
##$USERA1= <user>
##$USERA2= <user>
##$USERA3= <user>
##$USERA4= <user>
##$USERA5= <user>
##$V9= 5
##$VALIST= <valist>
##$VCLIST= <CCCCCCCCCCCCCCC>
##$VD= 0
##$VDLIST= <DDDDDDDDDDDDDDD>
##$VPLIST= <PPPPPPPPPPPPPPP>
##$VTLIST= <TTTTTTTTTTTTTTT>
##$WBST= 1024
##$WBSW= 4
##$XGAIN= (0..3)
0 0 0 0 
##$XL= 0
##$YL= 0
##$YMAX_a= 547023
##$YMIN_a= -463536
##$ZGOPTNS= <>
##$ZL1= 120
##$ZL2= 120
##$ZL3= 120
##$ZL4= 120
##$ABSF1= 16.522
##$ABSF2= -4.171173
##$ABSG= 5
##$ABSL= 3
##$ALPHA= 0
##$AQORDER= 0
##$ASSFAC= 0
##$ASSFACI= 0
##$ASSFACX= 0
##$ASSWID= 0
##$AUNMP= <proc_1d>
##$AZFE= 0.1
##$AZFW= 0.1
##$BCFW= 0
##$BC_mod= 0
##$BYTORDP= 0
##$COROFFS= 0
##$CY= 12.5
##$DATMOD= 1
##$DC= 0
##$DFILT= <>
##$DTYPP= 0
##$F1P= 14.0000005364418
##$F2P= -0.99999901652339
##$FCOR= 0.5
##$FTSIZE= 32768
##$FT_mod= 6
##$GAMMA= 0
##$GB= 0
##$INTBC= 1
##$INTSCL= 1
##$ISEN= 128
##$LB= 0.3
##$LEV0= 0
##$LPBIN= 0
##$MAXI= 10000
##$MC2= 0
##$MEAN= 0
##$ME_mod= 0
##$MI= 0
##$NCOEF= 0
##$NC_proc= -4
##$NLEV= 6
##$NOISF1= 0
##$NOISF2= 0
##$NSP= 0
##$NTH_PI= 0
##$NZP= 0
##$OFFSET= 16.522
##$PC= 1
##$PHC0= -96.78218
##$PHC1= 25.64298
##$PH_mod= 1
##$PKNL= yes
##$PPARMOD= 0
##$PSCAL= 4
##$PSIGN= 0
##$REVERSE= no
##$SF= 250.13
##$SI= 32768
##$SIGF1= 0
##$SIGF2= 0
##$SINO= 400
##$SIOLD= 32768
##$SREGLST= <1H.DMSO>
##$SSB= 0
##$STSI= 32768
##$STSR= 0
##$SW_p= 5175.98343685301
##$SYMM= 0
##$S_DEV= 0
##$TDeff= 65536
##$TDoff= 0
##$TI= <Analysis number 999999
Compound Code 99
Book Reference 9
Project Code 9>
##$TILT= no
##$TM1= 0
##$TM2= 0
##$TOPLEV= 0
##$USERP1= <user>
##$USERP2= <user>
##$USERP3= <user>
##$USERP4= <user>
##$USERP5= <user>
##$WDW= 1
##$XDIM= 32768
##$YMAX_p= 292456845
##$YMIN_p= -281624
$$ End of Bruker specific parameters
$$ ---------------------------------
##NTUPLES= NMR SPECTRUM
##VAR_NAME=  FREQUENCY,     SPECTRUM/REAL,   SPECTRUM/IMAG
##SYMBOL=    X,             R,               I
##VAR_TYPE=  INDEPENDENT,   DEPENDENT,       DEPENDENT
##VAR_FORM=  AFFN,          ASDF,            ASDF
##VAR_DIM=   32768,         32768,           32768
##UNITS=     HZ,            ARBITRARY UNITS, ARBITRARY UNITS
##FACTOR=    0.157963299565203, 1,           1
##FIRST=     4132.6476996994, 0,             0
##LAST=      -1043.33573715361, 0,           0
##MIN=       -1043.33573715361, -281624,     0
##MAX=       4132.6476996994, 292456845,     0
$$ Real data points
##PAGE= N=1
##DATA TABLE= (X++(R..R)), XYDATA
$$ [...]
25106G04R382K1886l759m490k9458l3781k5180k5053L7014P1169j0547n1194m5084
$$ 704 10086 31972 28213 23723 -5735 -39516 -64696 -89749 -52735 18434 7887 -43307 -88391
25093h8391K5460N590k8744K0764N1088L9874l853n2037q674m7729K0260N8323
$$ -88391 -62931 -57341 -86085 -65321 -14233 25641 21788 -30249 -38923 -86652 -66392 -8069
25081h069J7792k0596K1250K8278P8899L1517l6546l1119m7867l0146J822P231
$$ -8069 9723 -10873 10377 38655 117554 149071 112525 81406 33539 3393 5215 12446
25069A2446J0750k5786J6680M8880L080p1335J4448K9926l5031l4572J2202k4062
$$ 12446 23196 -2590 14090 62970 66050 -5285 9163 39089 4058 -30514 -18312 -42374
25057d2374K2967Q382L1430J5109p4976k0981O6947J8723o2826m2945J3563k4328
$$ -42374 -19407 -11025 20405 35514 -39462 -60443 6504 25227 -37599 -80544 -66981 -91309
25045i1309j3923P3945M289L0476m858n8853m3461J498j0655k395K2104O912q602
$$ -91309 -105232 -31287 -26998 3478 -1380 -60233 -103694 -102196 -112851 -115246 -93142 -86230 -94832
25032i4832M952P40K4451j4017k3097M2421M8989L0210j594m7941r292j6789M6042
$$ -94832 -89880 -89140 -64689 -78706 -101803 -59382 -10393 19817 18223 -29718 -39010 -55799 -9757
25019i757j0613l0676q517K5796l4423k848N8250K9943l6080L256l7957k8148
$$ -9757 -20370 -51046 -59563 -33767 -68190 -71038 -12788 17155 -18925 -15669 -53626 -81774
25007h1774m6378K1205M4589L1825R168J2613J8292J1024K1575m8222n8131l0776
$$ -81774 -128152 -106947 -62358 -30533 -21365 -8752 9540 20564 42139 -6083 -64214 -94990
24995i4990p2774J847O3355J4931L9394r304k5161M0466L9362N0522j4280k6366
$$ -94990 -167764 -165917 -102562 -87631 -48237 -57541 -82702 -42236 -2874 47648 33368 7002
24983G002l7906o3883P5330O6920o831O09l2376j5511p609j4827J8739l4801J985
$$ 7002 -30904 -94787 -19457 47463 40632 41241 8865 -6646 -14255 -29082 -10343 -45144 -43159
24970d3159O8713l7739o0644k0502M5917N255j0483j1448Q1239M3598l1054j2030
$$ -43159 25554 -12185 -72829 -93331 -47414 -42159 -52642 -64090 17149 60747 29693 17663
24958A7663j5634l8998k7586l737o416L2095K1054l985p629K3554j244l5234L2262
$$ 17663 2029 -36969 -64555 -68292 -74708 -42613 -21559 -25544 -33173 -9619 -10863 -46097 -13835
24945a3835M3240K1268l748o6392n8552j3224j1928M6016L3886m3871j9625K5047
$$ -13835 29405 50673 46925 -19467 -78019 -91243 -103171 -57155 -23269 -67140 -86765 -61718
24933f1718P7327K8478k1349j8371l1659m0395j3285J8631r296k4032P0434K4191
$$ -61718 15609 44087 22738 4367 -27292 -67687 -80972 -62341 -71637 -95669 -25235 -1044
24921a044J2878l6906j7848L6327k0049M4329j559l4884r307k426j3958L8512
$$ -1044 11834 -25072 -42920 -6593 -26642 17687 16128 -18756 -28063 -30489 -44447 -5935
24909e935k1123P13J1272k508L3033n5274k983R524L9087n064m0506J5404j562
$$ -5935 -27058 -26345 -15073 -17581 15452 -39822 -42805 -33281 5806 742 -39764 -24360 -25922
24896b5922j6479q3265j6171N4987J3640k0022o928k4066Q153m787k0364j6022
$$ -25922 -42401 -125666 -141837 -86850 -73210 -93232 -100160 -124226 -116073 -120860 -141224 -157246
24884a57246M8732M0629K0287L8473K3612L8076j029l5228J1817J7243m7838k6901
$$ -157246 -108514 -67885 -47598 -9125 14487 52563 51534 16306 28123 45366 -2472 -29373
24872b9373j9582m8140J6369P7008K6250j9780n1492l5657k0967j491l632O7672
$$ -29373 -48955 -97095 -80726 -3718 22532 2752 -48740 -84397 -105364 -106855 -110487 -42815
24860d2815K2746j9226j067M2946N1244l5469L9906R593q2317l4511p78J7084
$$ -42815 -20069 -39295 -40362 2584 53828 18359 58265 67858 -14459 -48970 -49748 -32664
24848c2664k7495j781j2455k6348L578M1176J0615k9078L0377N8538J027j8166
$$ -32664 -60159 -61940 -74395 -100743 -97165 -55989 -45374 -74452 -44075 14463 15490 -2676
24836b676q1066q622J1159M5218L8386P3684k4069K5K3557j443M3413l4795n6090
$$ -2676 -83742 -92364 -81205 -35987 2399 76083 52014 52039 75596 74153 117566 82771 26681
24823B6681K7693m1535r8395L694L3757Q9138J0314q9657n1916N7193J9710m8603
$$ 26681 54374 12839 -85556 -81862 -48105 41033 51347 -38310 -90226 -33033 -13323 -61926
24811f1926j2290M0772N1847M4272R329k5154r5730m723J7752l8564n3854m2800
$$ -61926 -74216 -33444 18403 62675 72004 46850 -48880 -53603 -35851 -74415 -128269 -171069
24799a71069J9460R3297N2474L2866m142l4903j02118o4949k1099P7047L2616
$$ -171069 -151609 -58312 -5838 27028 22886 -12017 -114135 -179084 -200183 -123136 -90520
24788i0520P7003M900n050k0674k3593L3345L0631J0974o3222m1779j4238k4752
$$ -90520 -13517 -8617 -13667 -34341 -57934 -24589 6042 17016 -46206 -87985 -102223 -126975
24776a26975O2856O9177p746N5205J0713j8786n8750J055k5264M7036J0813l4289
$$ -126975 -64119 5058 -2688 52517 63230 44444 -14306 -13251 -38515 8521 19334 -14955
24764a4955k0840L0076K6755n0049l0377J8686J0240q388r068k8585L2289P7550
$$ -14955 -35795 -5719 21036 -29013 -59390 -40704 -30464 -38852 -47920 -76505 -44216 33334
24752C3334R3982l7215r5568p0358K0688K6190o1622P004N3392M7753n1329k5657
$$ 33334 127316 90101 -5467 -75825 -55137 -28947 -90569 -83565 -30173 17580 -33749 -59406
24740e9406k2369J8633L3289K8647j1577l2940O9085r588q3761k6337L392K4056
$$ -59406 -81775 -63142 -29853 -1206 -12783 -45723 23362 13774 -69987 -96324 -92932 -68876
24728f8876M2224J3446L5091p630j3140j3914p616k8966J0104J1802L8895R94
$$ -68876 -26652 -13206 21885 14255 1115 -12799 -20415 -49381 -39277 -27475 11420 12414
24716A2414j980k12m4085M74l101n3661j921N7084L4565K8596m4044k7506k7936
$$ 12414 10434 10222 -33863 -33389 -36490 -90151 -92072 -34988 -423 28173 -15871 -43377 -71313
24703g1313l631M7701K4707l07J3849p2628m5234k5721J6164R719J9393K2494
$$ -71313 -74944 -27243 -2536 -2843 11006 -61622 -106856 -132577 -116413 -106694 -87301 -64807
24691f4807j1056L673Q807J4560K7839K6630n5595j864j3342J0264L785n1498
$$ -64807 -75863 -72190 -63383 -48823 -20984 5646 -49949 -51813 -65155 -54891 -51106 -102604
24679a02604q218J5771J5660j8441l5780M6566O0909k8559q842J4433j1863J7527
$$ -102604 -110822 -95051 -79391 -97832 -133612 -87046 -26137 -54696 -63538 -49105 -60968 -43441
24667d3441m7446o030Q3302O8671J6218q9528k2418L1489L9211J07278m8766r5876
$$ -43441 -90887 -96917 -13615 55056 71274 -18254 -40672 -9183 30028 137306 88540 -7336
24655g336m3743o350o736M1329J1421N4332l7678j5490J5159L965l848k6217M0477
$$ -7336 -51079 -57429 -64165 -22836 -11415 42917 5239 -10251 4908 8873 5025 -21192 19285
24642A9285K5066m1610m1158l5267K7675j4184k0419J2518O8778L610k3238q842
$$ 19285 44351 2741 -38417 -73684 -46009 -60193 -80612 -68094 684 4294 -18944 -27786
24630b7786K066m675k6697M0194l466j5877j1986O9702K1510j6422j3082l0015
$$ -27786 -25720 -30395 -57092 -16898 -20364 -36241 -48227 21475 42985 26563 13481 -16534
24618a6534L3556k9722k7294j7066j1648L049k6322K9819N1167K65J6090J222
$$ -16534 17022 -12700 -39994 -57060 -68708 -65659 -91981 -62162 -10995 -10730 5360 6582
24606F582O850Q319L5822M3675n1749n0409k7645n8793l543K3117L3776Q5572
$$ 6582 13432 21751 57573 101248 49499 -910 -28555 -87348 -90891 -67774 -33998 51574
24594E1574j4082r3819j286L0208k2171n8940k3321j6101j1005N4653L8790M3417
$$ 51574 37492 -56327 -57613 -27405 -49576 -108516 -131837 -147938 -158943 -104290 -65500 -22083
24582b2083n7630k4950k9029k8179P7230k525P112M8201J3879M530n5829L9568
$$ -22083 -79713 -104663 -133692 -161871 -84641 -87166 -80054 -31853 -17974 -13444 -69273 -29705
24570b9705M09L3302J0990o3152n2754K5043K3494k636L6966K6899k5844k4858
$$ -29705 -29296 4006 14996 -48156 -100910 -75867 -52373 -55009 -18043 8856 -16988 -41846
24558d1846N392R984m4965o6120M7589j3823N7252O7267j4622k885o2407N733
$$ -41846 -36454 -26470 -71435 -137555 -89966 -103789 -46537 20730 6108 3223 -59184 -53451
24546e3451J2521J5371J7494K747j6290k2852K655R3423K7241N514k8293o2401
$$ -53451 -40930 -25559 -8065 -5318 -21608 -44460 -41805 51618 78859 84373 56080 -6321
24534f321j8163j5218J1292j3751j7824l0983K5292K990K1578P45l6701N3543
$$ -6321 -24484 -39702 -28410 -42161 -59985 -90968 -65676 -62686 -41108 -40363 -77064 -23521
24522b3521K7313j8996l7359K937N0423Q2472L3376m9253p9605n6465K6245k6945
$$ -23521 3792 -15204 -52563 -49626 797 83269 116645 67392 -12213 -68678 -42433 -69378
24510f9378k1750N812P4171J19112k0895k3218J613k7510k4915J6218J1475L8438
$$ -69378 -91128 -85316 -11145 107967 87072 63854 65467 37957 13042 29260 40735 79173
24498G9173L895n2880r8112p034O1379L7073L904o4547m4380J0792L4980N0613
$$ 79173 83068 30188 -67924 -74958 -13579 23494 27398 -37149 -81529 -70737 -35757 14856
24486A4856L5366k920j7313l0211j1864l2239m7394M997J5428J2440L3979n7597
$$ 14856 50222 47302 29989 -222 -12086 -44325 -91719 -86722 -71294 -58854 -24875 -82472
24474h2472N308J9289J2532M3372n0858j3921L3259M8715P6287Q020N781l5476
$$ -82472 -77164 -57875 -45343 -1971 -52829 -66750 -33491 15224 91511 99531 105312 69836
24462F9836J6311o1572j01851m9571M2005L3777k5409o3572K6559K3012l1176
$$ 69836 86147 24575 -77276 -126847 -84842 -51065 -76474 -140046 -113487 -90475 -121651
24451a21651j0172N9305L8953Q821j0397N897l8305Q2421N5921j2191j8562m9943
$$ -121651 -131823 -72518 -33565 -24744 -35141 -29244 -67549 14872 70793 58602 40040 -9903
24439i903O322L1972Q2260k2226n5274p0059j6122l975l7688o1933P4550N2871
$$ -9903 -3581 28391 110651 88425 33151 -36908 -53030 -57005 -94693 -156626 -82076 -29205
24427b9205j0049j8801J720K1020M7171j3597l5427l0578M0643P9579L8458K694
$$ -29205 -39254 -58055 -56335 -35315 11856 -1741 -37168 -67746 -27103 52476 90934 93628
24415I3628j05458l0515M784L9914N449l4350k5432K3639m0882L9064K0574l0837
$$ 93628 -11830 -42345 -37561 2353 7802 -26548 -51980 -28341 -69223 -30159 -9585 -40422
24403d0422j7611j6598O7374L9030n113o0869J1433L2882k2804O269M4105N5065
$$ -40422 -58033 -74631 -7257 31773 26660 -34209 -22776 10106 -12698 -6429 37676 92741
24391I2741o4891n1429L6119j384N847L4140M3825o7883q3172k3813K5411K3145
$$ 92741 27850 -23579 12540 11156 17003 51143 94968 27085 -56087 -79900 -54489 -31344
24379c1344l8291l8149N2552O6387N6162K7317n3140o7963K3143J5033j6954l8077
$$ -31344 -69635 -107784 -55232 11155 67317 94634 41494 -26469 -3326 11707 -5247 -43324
24367d3324K2701m9048L363j854L8199L4210J6669O074o822o6723l8856J8321
$$ -43324 -20623 -69671 -66308 -68162 -29963 4247 20916 26990 20168 -46555 -85411 -67090
24355f7090L8960J8045O37J3391L3196j6395q8692l35M1919m2119K5099O9902
$$ -67090 -28130 -10085 -9448 3943 37139 20744 -67948 -68283 -26364 -68483 -43384 26518
24343B6518m8728p8041K8271J7893m1666J6685k1534m1320K7288M4458j4418N3942
$$ 26518 -22210 -100251 -71980 -54087 -95753 -79068 -100602 -141922 -114634 -70176 -84594 -30652
24331c0652L3963k8631k7541N0487j8055m2977L6894j2234o5817l9658R0518N732
$$ -30652 3311 -25320 -52861 -2374 -20429 -63406 -26512 -38746 -104563 -144221 -53703 -47971
24319d7971J5487J8442k28J819p023j1784P3679P583l8801j5150j5426k5365L1228
$$ -47971 -32484 -14042 -14270 -12451 -19474 -31258 42421 50004 11203 -3947 -19373 -44738 -13510
24306a3510L7262l1497j4453j9369R681k8633j6579l1786M5795K5407J0351J9780
$$ -13510 23752 -7745 -22198 -41567 -31886 -60519 -77098 -108884 -63089 -37682 -27331 -7551
24294g551R5565R639l221k6627n9126m7914K6916L4389o337n0059M9091j6103
$$ -7551 88014 97653 94432 67805 8679 -39235 -12319 22070 15733 -34326 14765 -1338
24282a338o129j5026L587M3917o849n2212o0937P1486M0916j6725m1963M7320
$$ -1338 -7467 -22493 -18906 25011 18162 -34050 -94987 -23501 17415 690 -41273 6047
24270F047J1540l8972J8021K3919K1870o6860J1189L588p868k6509L1694O1867
$$ 6047 17587 -21385 -3364 20555 42425 -24435 -13246 -9658 -17526 -44035 -12341 49526
24258D9526k6771j814o3826l6898Q5709J9082k8235P254M3332k5191m7922K7482
$$ 49526 22755 20941 -42885 -79783 5926 25008 -3227 4027 47359 22168 -25754 1728
24246A728M3913k9436P790J4383p034o8227L23J1517k6711j6060M234P704k2108
$$ 1728 45641 16205 23995 38378 31344 -36883 -36560 -25043 -51754 -67814 -63580 -55876 -77984
24233g7984O174J8261J1513j6895n3734K8174J4291k488L4269L0312J1599l3473
$$ -77984 -71810 -53549 -42036 -58931 -112665 -84491 -70200 -72688 -38419 -8107 3492 -29981
24221b9981J2948K5447j4263P463j6628j9332L6188P01N3433k1481m4552j6498
$$ -29981 -17033 8414 -5849 1614 -15014 -34346 1842 2543 55976 34495 -10057 -26555
24209b6555n649l6980K8514l3j4378j0279K552O254J754J0801l9721k0372k936
$$ -26555 -32204 -69184 -40670 -40703 -55081 -65360 -62808 -56554 -54800 -43999 -83720 -104092 -107028
24196a07028k287j69k9991O399k893P4763O5668K077q808k2631P8836O1468o9067
$$ -107028 -109315 -109484 -139475 -133076 -135969 -61206 4462 6539 -2269 -24900 53936 115404 46337
24183D6337o3302J3465O035K605k05j2955r093K4308j0027J996J1333J4064M4814
$$ 46337 -16965 -3500 2535 5140 4935 -8020 -17113 7195 -2832 -836 10497 24561 69375
24170F9375k110l6831n926k4195n0622j7191M7695K5857O026m4986j2925L0077
$$ 69375 67265 30434 24508 313 -50309 -67500 -19805 6052 12078 -32908 -45833 -15756
24158a5756J0072n6937j0759N5388J4697j956r232M1266K3191n1757n5599q499
$$ -15756 -5684 -62621 -73380 -17992 -3295 -5251 -14483 26783 49974 -1783 -57382 -65881
24146f5881m1259j372N2526J9551L2727n175p048J1688j3611l260J2662m0518
$$ -65881 -107140 -108512 -55986 -36435 -3708 -8883 -15931 -4243 -17854 -21114 -8452 -48970
24134d8970L239m504J5380K802l525l5931J1060L9463j5733l1541J912r672o227
$$ -48970 -45731 -50235 -34855 -32053 -35578 -71509 -60449 -20986 -36719 -68260 -66348 -76020 -82247
24121h2247L4159K5390J949l4308q92J0057O2976l4303p4314N5497M3953J446
$$ -82247 -48088 -22698 -20749 -55057 -55949 -45892 17084 -17219 -91533 -36036 7917 9363
24109I363k4190n292j0068m0769k3515n896K2769J3508K9241J6281l9958O58J1895
$$ 9363 -14827 -20119 -30187 -70956 -94471 -100367 -77598 -64090 -34849 -18568 -58526 -57868 -45973
24096d5973L1958L9487J0024l6675j2787L2953J6929J8329J8038O039j6944J7056
$$ -45973 -14015 25472 35496 -1179 -13966 18987 35916 54245 72283 78322 61378 78434
24084G8434j5496l5873L9528j1693o4029L0670J9781R186k3816n2290m3187P877
$$ 78434 62938 27065 66593 54900 -9129 21541 41322 50508 26692 -25598 -68785 -60908
24072f0908j7999L3683R798m9407O2800N9101n7551k445M5799k8718k9406j770
$$ -60908 -78907 -45224 -35426 -84833 -22033 37068 -20483 -22928 22871 -5847 -35253 -37023
24060c7023M845J6231J8492J3267n6395k915M936n00k4839J468L2132P508j6147
$$ -37023 -32178 -15947 2545 15812 -40583 -43498 -38562 -39062 -63901 -62433 -30301 -22793 -38940
24047c8940J3140p818M3899k2153k5736O062r276K831O6632k2650m2293K6928
$$ -38940 -25800 -33618 10281 -11872 -37608 -31546 -40822 -37991 28641 5991 -36302 -9374
24035i374M4799k4129l0559m1240j9507m6230m190J8717j0464K1715N9366K9540
$$ -9374 35425 11296 -19263 -60503 -80010 -126240 -130430 -111713 -122177 -100462 -41096 -11556
24023a1556l1170o3831r85j7350M0873l5164L9795j6923M2731k4717K9648L6106
$$ -11556 -42726 -106557 -107542 -124892 -84019 -119183 -79388 -96311 -53580 -78297 -48649 -12543
24011a2543j7608J4413n414j0562q906m306K1689L6651K2367r737L5962J7584
$$ -12543 -30151 -15738 -21152 -31714 -40620 -44926 -23237 13414 35781 26044 62006 79590
23999G9590M5900J1020j1054p2422J2458q361L3448J8641m7544q336L4539p3096
$$ 79590 125490 136510 125456 53034 65492 57131 90579 109220 61676 53340 87879 14783
23987A4783p7011o158N0027K7321M4947k3151m7937l37K5158k4639N0868L3396
$$ 14783 -62228 -68386 -18359 8962 53909 30758 -17179 -17516 7642 -16997 33871 67267
23975F7267K021m8493n6305K685p8j6930r021J6002L9931p08r696M5855N222m7608
$$ 67267 69288 20795 -35510 -32825 -32903 -49833 -58854 -42852 -2921 -3629 -13325 32530 37752 -9856
23961i856k6668k5239l8825k1205L3526M6162l0328K8263M8323K272k9822L6729
$$ -9856 -36524 -61763 -100588 -121793 -88267 -42105 -72433 -44170 4153 6425 -23397 13332
23949A3332L768m585o5153l2301K5106j1099Q373O573N6886k2463M0498O3331
$$ 13332 17100 12515 -52638 -84939 -59833 -70932 -62559 -55986 900 -21563 18935 82266
23937H2266j9322L1687K5656j9857m8568p2753k0998l1148J9255P5122k338L6172
$$ 82266 62944 94631 120287 100430 51862 -20891 -41889 -73037 -53782 21340 19002 55174
23925E5174M4105N170l3355n0961j5639m2737j6770L967q220j2959K6881N4261
$$ 55174 99279 104449 71094 20133 4494 -38243 -55013 -51046 -59266 -72225 -45344 8917
23913H917J0378J4996K8025L634o8736m9556N4572J3790n9211J353l905K2888
$$ 8917 19295 34291 62316 65950 -2786 -52342 2230 16020 -43191 -41838 -45743 -22855
23901b2855l4183L7036J3852J7316l8524J3274k6381k6165O9768q711l3861k4024
$$ -22855 -57038 -20002 -6150 11166 -27358 -14084 -40465 -66630 3138 -5573 -39434 -63458
23889f3458K5911Q3617j1630K0542K2451K6188j4017j8367o1043R701O5946p855
$$ -63458 -37547 46070 34440 54982 77433 103621 89604 71237 10194 19895 85841 77986
23877G7986n3285K6390K2589Q849k7896j0098j5862N104k5191K4303m8167j2836
$$ 77986 24701 51091 73680 82529 54633 44535 28673 33777 8586 32889 -15278 -28114
23865b8114j1447k8316P8433L3507j3372l5785l0063N9022L1929J9868k1008P589
$$ -28114 -39561 -67877 10556 44063 30691 -5094 -35157 23865 55794 75662 54654 62243
23853F2243K3990j1740J370k0243k9044j4159J5776m1377m9947m703O3429M9193
$$ 62243 86233 74493 75863 55620 26576 12417 28193 -13184 -63131 -67834 -4405 44788
23841D4788j9161n0946K0346K6086K1578K6259m343j00772j1303j2295K1695K4116
$$ 44788 25627 -25319 -4973 21113 42691 68950 64607 -36165 -47468 -59763 -38068 -13952
23829a3952J8722m7531K71O1013j1070p872n3354m0135R337N9987N3400M4108
$$ -13952 4770 -42761 -42490 18523 7453 -419 -53773 -93908 -84571 -24584 28816 72924
23817G2924M542j1093k7908M3126K8509K2590j0659N645j2793o9298m1524l9826
$$ 72924 77466 66373 38465 81591 110100 132690 122031 127676 114883 45585 4061 -35765
23805c5765O762L2853J9342k3252m4115J9428P0098k0207o1967m0061N0518J1183
$$ -35765 -29003 3850 23192 -60 -44175 -24747 45351 25144 -36823 -76884 -26366 -15183
23793a5183L8976j4353J7266J2576m43j1891M2398N0942J9167K3172r355n94m9422
$$ -15183 23793 9440 26706 39282 38839 26948 69346 120288 139455 162627 153272 152678 103256
23780A03256l4659m7294K160j6930N2260M1948k2434j3083k4266m9978m7788J8090
$$ 103256 68597 21303 23463 6533 58793 100741 78307 65224 40958 -9020 -56808 -38718
23768c8718J2718M5926N2215k4549l8803j1788l2236p722O4381o279l9190J4515
$$ -38718 -26000 19926 72141 47592 8789 -2999 -35235 -42957 21424 15145 -24045 -9530
23756i530J5537L0514J108l3712l8237N896K0368K418J2474m2502m9277L5483
$$ -9530 6007 36521 37629 3917 -34320 -28424 -8056 -5638 6836 -35666 -84943 -49460
23744d9460l164L650N9041K088l7536J1274o301j0087j1734J4250K5635m6870
$$ -49460 -52624 -48974 10067 12155 -25381 -14107 -20408 -30495 -42229 -27979 -2344 -49214
23732d9214K276M0909L1114M755n026j9652P347J5415L756q226j15m5450m4205
$$ -49214 -46938 -6029 25085 29840 24814 5162 12509 27924 31680 23454 23339 -22111 -66316
23719f6316m0355P4171Q0041n1674P287l3632k5665Q665K8888N32m4545m0867
$$ -66316 -106671 -32500 47541 -4133 3154 -30478 -56143 -47478 -18590 -18058 -62603 -103470
23707a03470m356j8000K4322O0815N6222k2239Q210P1801k6832r052M8108J753
$$ -103470 -107826 -125826 -101504 -40689 15533 -6706 1504 73305 46473 37421 85529 87282
23695H7282j9587l0911J9866n016Q859O040J1017o640J2877m685l5418N4275J558
$$ 87282 67695 36784 56650 51634 60493 66533 77550 70910 83787 79102 43684 97959 99517
23682I9517o254M948l0031m6318j9653K2087M6204N6673K8279p3209p6193K0791
$$ 99517 93263 98211 68180 21862 2209 24296 70500 127173 155452 82243 6050 26841
23670B6841K8961p3116k2828j419r326k1074J2313P8301O9747J2287L2623J3212
$$ 26841 55802 -17314 -40142 -41561 -50887 -71961 -59648 18653 88400 100687 133310 146522
23658A46522j9860l3481j7229j5263j7743K2506j9156L3471J6415m1914p1458
$$ 146522 126662 93181 75952 60689 42946 65452 46296 79767 96182 54268 -17190
23647a7190j579k3197k409n461o030M9856M1045j0556k0698k1585k7022Q0140
$$ -17190 -18769 -41966 -44375 -49836 -55866 -6010 35035 24479 3781 -17804 -44826 35314
23635C5314M354o7896k4346J9952O6049J9630m0386n989N6762K396j4671k2879
$$ 35314 39668 -28228 -52574 -32622 33427 53057 12671 6682 63444 65840 51169 28290
23623B8290n9114K3998K5168m03J4624j2489J441L4996J1158k4889k1768n1434
$$ 28290 -30824 -6826 18342 17939 32563 20074 21515 56511 67669 42780 21012 -30422
23611c0422q693M6905L8897O8440l9640m0610K8315K4138k4913l2302n6429O0047
$$ -30422 -39115 7790 46687 115127 75487 34877 63192 87330 62417 30115 -26314 33733
23599C3733J8161m1559j1728J7598K343k7379l1721L6016K3760K8550q6580K8536
$$ 33733 51894 10335 -1393 16205 18548 -8831 -40552 -4536 19224 47774 -38806 -10270
23587a0270N4928j2696p6835r142o868L5508J0854O8987O992n5571l9634k1378
$$ -10270 44658 31962 -44873 -54015 -60883 -25375 -14521 54466 61458 5887 -33747 -55125
23575e5125O3798L2551L352P5802j7283o889m6919o9326j0839L2626Q143k042
$$ -55125 8673 41224 44576 120378 103095 96206 49287 -20039 -30878 1748 9891 7849
23563G849J3044l8840k3p022n229J2867n1192L7024J8923o809q097J5150n42M2125
$$ 7849 20893 -17947 -17970 -24992 -30221 -17354 -68546 -31522 -12599 -19408 -27505 -12355 -12897 29228
23549B9228N9337m452j5120m1150m9204L9872j3119j6044K6980M9452J23K0701
$$ 29228 88565 84113 68993 27843 -21361 18511 5392 -10652 16328 65780 65903 86604
23537H6604M1112m6674k418j2850j7775q609J9214L3343O4177J2701q8958n2368
$$ 86604 127716 81042 78624 65774 47999 39390 58604 91947 156124 168825 79867 27499
23525B7499m94j9071m971k6576Q296M2237O0109J1785M0702J102n4062m2466l1108
$$ 27499 27005 7934 2963 -23613 -15317 26920 87029 98814 139516 140618 86556 44090 12982
23512A2982k7481k181k2279L6854O705l3296k4110Q2711L8569j613l7312j2980
$$ 12982 -14499 -16680 -38959 -2105 4600 -28696 -52806 29905 68474 66861 29549 16569
23500A6569k8757P641N7956M3402N3466l1700o7531l3271R863L471N658K0300
$$ 16569 -12188 -4547 53409 96811 150277 118577 51046 17775 27638 31109 36767 57067
23488E7067N461O455j3551j9249m2621k0194M7485K0161o4342J0232N296j1138
$$ 57067 62528 68983 55432 36183 -6438 -26632 20853 41014 -23328 -13096 -7800 -18938
23476a8938P565K2753j7934k2941M3641n846L4067N9790m570k2008L1505n7946
$$ -18938 -11373 11380 -6554 -29495 14146 8300 42367 102157 97587 75579 107084 49138
23464D9138n8561K3592K0279Q212n8356k4042l7775P1733L1155r812j7105n5004
$$ 49138 -9423 14169 34448 42660 -15696 -39738 -77513 -5780 25375 15563 -1542 -56546
23452e6546m890L3162J2648R63K2436L0648k8512k0459k0710K429N9870P6798
$$ -56546 -61436 -28274 -15626 -14663 7773 38421 9909 -10550 -31260 -28831 31039 107837
23440A07837k9051j2039K9419L5630l1354o8787l2749l9584P916J7172K2501J8184
$$ 107837 78786 66747 96166 131796 100442 31655 -1094 -40678 -32762 -15590 6911 25095
23428B5095k7066m1922j0955L9956L5944p486J9063L9113K0582j5294k4030k6922
$$ 25095 -1971 -43893 -54848 -14892 21052 13566 32629 71742 92324 77030 53000 26078
23416B6078p0811j7344N1402K4666o059P9440L238l6970J6743J2086J4616j3871
$$ 26078 -44733 -62077 -10675 13991 7932 87372 90610 53640 70383 82469 97085 83214
23404H3214p8502l0838K2832J6876l6498p150J4580m315N0757j6091o926M0378
$$ 83214 4712 -26126 -3294 13582 -22916 -30066 -15486 -19801 30956 14865 7939 48317
23392D8317k7534l6039J2695P9613P5329m6144p7469k176J9995M752k5022m996
$$ 48317 20783 -15256 -2561 77052 152381 106237 28768 26592 46587 51339 26317 21321
23380B1321L5738R2855p3072n7899K009L9963K3959J6614o2090l458J0882k0223
$$ 21321 57059 149914 76842 18943 20952 60915 84874 101488 39398 35940 46822 26599
23368B6599l2998J2176J9398O649J5403M6410J6148n9980k7235n3429M00o178
$$ 26599 -6399 5777 25175 31824 47227 93637 109785 49805 22570 -30859 -30459 -36637
23356c6637p0598j1739R1544N6590J6310l0552K998J1695k2852J3157J5130J6151
$$ -36637 -107235 -118974 -27430 29160 45470 14918 17916 29611 6759 19916 35046 51197
23344E1197Q9930q048m4038m2719J3328P211k6374J5648L0600L0284J8487l6883
$$ 51197 141127 133079 89041 46322 59650 66861 40487 56135 86735 117019 135506 98623
23332I8623l2567J7407m5664n556J1611o645J2836M0521O2579q3368n9859J1256
$$ 98623 66056 83463 37799 32243 43854 37209 50045 90566 153145 69777 9918 21174
23320B1174J727N0650k9999J6898K1251K041m041j8704j9246J7425l8841m5290
$$ 21174 22901 73551 43552 60450 81701 83742 79701 60997 41751 59176 20335 -24955
23308b4955j1122P4514o585j9409L8301J6832M2526O73o4751K9377L8005K6952
$$ -24955 -36077 38437 31852 12443 50744 67576 110102 110775 46024 75401 113406 140358
23296A40358r79m5726l4374J2134M6852j0131l1313j8998o048k8938m5286j1524
$$ 140358 139379 93653 59279 71413 118265 108134 76821 57823 51775 22837 -22449 -33973
23284c3973n020p132K2121n6963p176O4621P6410L3226j0750k7622k2006n5067
$$ -33973 -38993 -46125 -24004 -80967 -88143 -23522 52888 86114 75364 47742 25736 -29331
23272b9331n671K4364L1640K6318n2012n1431M8877P7486k4632k5472P943K0722
$$ -29331 -35002 -10638 21002 47320 -4692 -56123 -7246 70240 45608 20136 28079 48801
23260D8801K1885P353n7918m7686l3663L9929L9835l9981L308N6596J1478m1345
$$ 48801 70686 78039 20121 -27565 -61228 -21299 18536 -21445 -18137 38459 49937 8592
23248H592K3465k3675l2491l4965k8708K8994J2645K7400L5069O6221O317j6903
$$ 8592 32057 8382 -24109 -59074 -87782 -58788 -46143 -18743 16326 82547 88864 71961
23236G1961N462k8832o3833j8885j1765J305l636l998l276k2027l5357O0829J7387
$$ 71961 77423 48591 -15242 -34127 -45892 -44587 -48223 -52221 -55497 -77524 -112881 -52052 -34665
23223c4665M0991l1833j2815k2421k8500o331N6801O4323k4959J6053R550L3457
$$ -34665 6326 -25507 -38322 -60743 -89243 -95574 -38773 25550 591 16644 26194 59651
23211E9651j8191n4371N7210K421q5312J3768K3169m5558o9070J6295N1377L4545
$$ 59651 41460 -12911 44299 46720 -38592 -24824 -1655 -47213 -116283 -99988 -48611 -14066
23199a4066J3888M1694L5573k8238q4219L2757K3445k2600J9872l2146m6742k2551
$$ -14066 -178 41516 77089 48851 -35368 -2611 20834 -1766 18106 -14040 -60782 -83333
23187h3333P478N8259j6911L3945J0245j442k5756P94K0057m852o038K3163m4062
$$ -83333 -75855 -17596 -34507 -562 9683 8241 -17515 -16721 3336 -1516 -7554 15609 -28453
23174b8453j7071L57J3655Q879J2779l0935j1108l2623N108J5094L9320L7110
$$ -28453 -45524 -45167 -31512 -22633 -9854 -40789 -51897 -84520 -79412 -64318 -24998 12112
23162A2112J4495O3927k1730o7009j6298k4833m2349J676P5013K8150J7985k7219
$$ 12112 26607 90534 68804 1795 -14503 -39336 -81685 -80009 -4996 23154 41139 13920
23150A3920O437K0498l8544K1601m4854l8853Q1480L0790l410o2253j6050J401
$$ 13920 20357 40855 2311 23912 -20942 -59795 21685 52475 49065 -13188 -29238 -27837
23138b7837N822j5278L5176m3984j0101Q668Q192M8875l5233k8092L1834k706
$$ -27837 -22015 -37293 -2117 -46101 -56202 -47534 -39342 9533 -25700 -53792 -21958 -24664
23126b4664Q088O9082L2803o678l69l1996l5340q0851K178L7952k4637k4130j9693
$$ -24664 -16576 52506 85309 78631 78262 46266 10926 -69925 -67747 -29795 -54432 -78562 -98255
23113i8255L0186N8575J5367j9569R422n4078j4352Q5854P5297N398l6443m0755
$$ -98255 -68069 -9494 5873 -13696 -4274 -58352 -72704 13150 88447 93845 57402 16647
23101A6647l0109n1806K9900O6960j1489l5172K0559J1209J4081m4080n6743o203
$$ 16647 -13462 -65268 -35368 31592 20103 -15069 5490 16699 30780 -13300 -70043 -76246
23089g6246j3842K1712O1864O7769o212k0426l444R554j1318L1142m53q2799l8421
$$ -76246 -90088 -68376 -6512 61257 55045 34619 31175 40729 29411 60553 60100 -22699 -61120
23076f1120k5698j4195J8970K7380J293O239L0848Q845J1055J3582L6842m8256
$$ -61120 -86818 -101013 -82043 -54663 -53370 -47131 -16283 -7438 3617 17199 54041 5785
23064E785J1712R010m0461k427p930m2411N0034O9176K4958L453J2606K0442l8750
$$ 5785 17497 26507 -13954 -16381 -24311 -66722 -16688 52488 77446 80899 93505 113947 75197
23051G5197o0064o2187J1652K6068k3361J3408M3216M0044l7632p0810m8826M2523
$$ 75197 15133 -47054 -35402 -9334 -32695 -19287 23929 63973 26341 -44469 -93295 -50772
23039e0772J7315L7233Q339O798L3747m8719n2717L7175N179j3838Q41l3461j2302
$$ -50772 -33457 3776 12115 18913 52660 3941 -48776 -11601 -6422 -20260 -19419 -52880 -65182
23026f5182O2279K0080M330J5973n5498N568k9994m2284l9182O9785L5029m0147
$$ -65182 -2903 17177 21507 37480 -18018 -12450 -42444 -84728 -123910 -54125 -19096 -59243
23014e9243O536L7157j3664L2543N5274J4815o0645k6707j0253L0243Q076J7574
$$ -59243 -52707 -15550 -29214 3329 58603 73418 12773 -13934 -24187 6056 14132 31706
23002C1706N304o1153p5856N1971l097J5310J9135O2412M9001m680r8295m0045
$$ 31706 37010 -24143 -99999 -48028 -51125 -35815 -16680 45732 94733 90053 -8242 -48287
22990d8287L8883K0955P215K3622R158j5971m5452j8999k5171P793P2826J2022
$$ -48287 -9404 11551 18766 42388 51546 35575 -9877 -28876 -54047 -46254 26572 38594
22978C8594P870m5304K3596J7036n2132l5852J7038R134R2467K5891q8858o1539
$$ 38594 46464 1160 24756 41792 -10340 -46192 -29154 -20020 72447 98338 9480 -52059
22966e2059k7744L1354L4007J963m9308m5215M3820M8138j0016K6566M9762K2712
$$ -52059 -79803 -48449 -14442 -12479 -61787 -107002 -63182 -15044 -25060 1506 51268 73980
22954G3980r830L111j2646m5762M855n255Q23J5185K994K7962M2378l665j3919
$$ 73980 64150 67261 54615 8853 13708 8453 9276 24461 27455 55417 97795 94130 80211
22941H0211l6409K8071j6899M3792m8930q0772N2692K9379J6833j1910n3975J7493
$$ 80211 43802 71873 54974 98766 49836 -30936 21756 51135 67968 56058 2083 19576
22929A9576m6890M9433K3383l8950N3299k0668o1020p911P249K1420l359K5552
$$ 19576 -27314 22119 45502 6552 59851 39183 -21837 -29748 -22499 -1079 -4438 21114
22917B1114k336J5402j6145K7608J4648l8190o9733M0855N7186M4332k7555m4306
$$ 21114 18778 34180 18035 45643 60291 22101 -47632 -6777 50409 94741 67186 22880
22905B2880p0830K5990K8764j1402l8919K3102j6323m0414J1439J5320N2631k366
$$ 22880 -47950 -21960 6804 -4598 -43517 -20415 -36738 -77152 -65713 -50393 2238 -128
22893a28l7376m4777l9276m1614N0712N3530J9227N913N077l024K363j3744j701
$$ -128 -37504 -82281 -121557 -163171 -112459 -58929 -39702 -33789 -28712 -31736 -29373 -43117 -44818
22880d4818L5937j2900R025Q4463P1819k8391m8122j0537p6087P467K14l4725
$$ -44818 -8881 -21781 -12756 71707 143526 115135 67013 56476 -19611 -12144 -11930 -46655
22868d6655J6459M573l3919K5729M3283M7594K3282m1471l3192K3883k0370R489
$$ -46655 -30196 -25623 -59542 -33813 9470 57064 80346 38875 5683 29566 9196 18685
22856A8685o361k7062n710j9209n3943J0574J5771J6430J4664L5015J9104o925
$$ 18685 12324 -14738 -20448 -39657 -93600 -83026 -67255 -50825 -36161 -1146 17958 11033
22844A1033K5026J2442M3522n5454L139j1603p1852k0809J1169M9251K2979K5346
$$ 11033 36059 48501 92023 36569 39708 28105 -43747 -64556 -53387 -4136 18843 44189
22832D4189K733l1142k1859J1242j0908n087m3973N9705R0361Q159j9696k020
$$ 44189 46922 15780 -6079 5163 -5745 -10832 -54805 4900 95261 103420 83724 81704
22820H1704l2151j7571o757n91P2598J8590j43907Q87N4839L54N6346M8748l8585
$$ 81704 49553 31982 25225 24634 97232 115822 -28085 -27198 27641 27995 84341 133089 94504
22807I4504o8581l1229L8675J2020J907j5643m3408K1327L2688J1424n9851m767
$$ 94504 25923 -5306 33369 45389 47296 31653 -11755 9572 42260 53684 -6167 -10934
22795a0934K9882M016j2267l2032P79L1433k0229N9156k0092j6795J8005k917
$$ -10934 18948 22964 10697 -21335 -20556 10877 -9352 49804 29712 12917 30922 28005
22783B8005K111K140l4426K6076j2002l0029o6435q3549L2030L2862M9388L1778
$$ 28005 30116 32256 -2170 23906 11904 -18125 -84560 -168109 -136079 -103217 -53829 -22051
22771b2051N9293K7134j17666r8651j9813M4621J32116R477m2946l8020l7983
$$ -22051 37242 64376 -53290 -151941 -171754 -127133 4983 14460 -28486 -66506 -104489
22760a04489K1013L9350M2700j2304n8213J8874L5205R967j9533p111N3606P618
$$ -104489 -83476 -44126 -1426 -13730 -71943 -53069 -17864 -7897 -27430 -34541 19065 26683
22748B6683J7602j0604K0250l598k6331o1489k587j4402J1232L9923n8438j1494
$$ 26683 44285 33681 53931 50333 24002 -37487 -40074 -54476 -43244 -3321 -61759 -73253
22736g3253p14J7034J9830k0824K1005J6108J0840J3051M9009m693o7560l1956
$$ -73253 -73967 -56933 -37103 -57927 -36922 -20814 -9974 3077 52086 47393 -20167 -52123
22724e2123N2386N2526l159m1243l9032l578R885j6615m5142P018K8998K5970
$$ -52123 263 52789 49630 8387 -30645 -34223 -24338 -40953 -86095 -79077 -50079 -24109
22712b4109j7233j3125K9491q285J3928J3247R767J9326J524j197j0029J0570
$$ -24109 -41342 -54467 -24976 -33261 -19333 -6086 3681 23007 24531 23334 13305 23875
22700B3875K1476M625q4061Q561K9285r935M5640K5029n6807p1684L5644Q3688
$$ 23875 45351 49976 -34085 -25524 3761 -6174 39466 64495 7688 -63996 -28352 55336
22688E5336j3101m0803o1240L7479K2839L0326L3844R725J7478j4734m7547k4625
$$ 55336 42235 1432 -59808 -22329 510 30836 64680 74405 91883 77149 29602 4977
22676D977r796M430k1551m0999N7581J8882o400J5368K4291m3357R263k8099M3547
$$ 4977 -4819 -389 -21940 -62939 -5358 13524 7124 22492 46783 3426 12689 -15410 28137
22663B8137Q221j0871M0077K6813k9470m1668k1872K7833k2534J2409K6217R934
$$ 28137 36358 25487 65564 92377 62907 21239 -633 27200 4666 17075 43292 53226
22651E3226O266k3871M2418j4387l3274J9043m803o1045j51K1538j6453l6394
$$ 53226 59492 35621 78039 63652 30378 49421 44618 -16427 -16578 4960 -11493 -47887
22639d7887K4203K0340k0102l1024k9870O7140M6713n0901k3659L2802L2127n8862
$$ -47887 -23684 -3344 -23446 -54470 -84340 -17200 29513 -21388 -45047 -12245 19882 -38980
22627c8980j7691J8070M1895j4443k1118N2988R5471N1034n8102p0418o6035j0487
$$ -38980 -56671 -38601 3294 -11149 -32267 20721 116192 167226 109124 38706 -27329 -37816
22615c7816M6681N6345J1716k9238l5665j8908M92n7251l8620N4863J18007L187
$$ -37816 8865 65210 76926 47688 12023 -6885 -6393 -63644 -102264 -47401 70606 73793
22603G3793k6028k663J9953L4735o3102n5602K9556k256k6832J8429P2287k3249
$$ 73793 47765 45102 65055 99790 36688 -18914 10642 8386 -18446 -17 72270 49021
22591D9021k4950j8056j3315N8985K7384j7540o2436m550n062L3016P06m6135
$$ 49021 24071 6015 -7300 51685 79069 61529 -907 -5457 -10519 22497 23203 -22932
22579b2932R761O6189m6198q5066J6169O8441K5323L2846N7595o2418J2465l563
$$ -22932 -13171 53018 6820 -78246 -62077 6364 31687 64533 122128 59710 72175 68612
22567F8612m6605k4094M409K390O208k429j5075P189M9713M7829m9027l7914K4814
$$ 68612 22007 -2087 2322 4712 10920 8491 -6584 605 50318 98147 49120 11206 36020
22554C6020M8230J1489p2057O521L3525K226l0890m2440j870m5557J0631r091
$$ 36020 84250 95739 23682 30203 63728 65954 35064 -7376 -9246 -54803 -44172 -53263
22542e3263J7819P7282L9421j8035k6163m1555J633o441j6502O256o919Q7831
$$ -53263 -35444 41838 81259 63224 37061 -4494 -2861 -9302 -25804 -19548 -26467 61364
22530F1364O6880l5541n465J9832L1360l8218k6787J7683K2387k598k6562l1065
$$ 61364 128244 92703 87238 107070 138430 100212 73425 91108 113495 110897 84335 53270
22518E3270j869J3393j1157n5193m0504k8576J1045O6536L6799K3398P1864k1029
$$ 53270 51401 64794 53637 -1556 -42060 -70636 -59591 6945 43744 67142 139006 117977
22506A17977k1707o9295j1926L1407M2475j4544n8899k5322P065J1577J8039l1090
$$ 117977 96270 26975 15049 46456 88931 74387 15488 -9834 -2769 8808 26847 -4243
22494d243L8375N0583J3071P946K1866j9769Q795n8640m9483J8829K6242J3336
$$ -4243 34132 84715 97786 105732 127598 107829 116624 57984 8501 27330 53572 66908
22482F6908J569m0957l2521J9617j4104j5327l3574L9987j2587J1666M1098j3777
$$ 66908 68477 27520 -5001 14616 512 -14815 -48389 -8402 -20989 -9323 31775 17998
22470A7998L1698k253n5448J0871K8209L00K246J835k9700L5960n4188o4972j8664
$$ 17998 49696 47443 -8005 2866 31075 31375 33621 35456 5756 41716 -12472 -77444 -96108
22457i6108M7221Q9502j5939n264o054r0602j9976J8675K3462K9079N804J1557
$$ -96108 -48887 40615 24676 19412 13358 -77244 -97220 -78545 -55083 -26004 -20200 -8643
22445h643k6873L1185L8576N4912L0998P861j2323m37O134j5311l5675n5187k5425
$$ -8643 -35516 -4331 34245 89157 120155 128016 115693 115256 121390 106079 70404 15217 -10208
22432a0208j4966L9855M4214j599o835k8033N003n7012K0661K5624J8740m0755
$$ -10208 -25174 14681 58895 57296 50461 22428 27431 -29581 -8920 16704 35444 -5311
22420e311l8033j9190N7701O5775Q258L0697r682l7659k0486q5244j3605M8130
$$ -5311 -43344 -62534 -4833 60942 69200 99897 90215 52556 32070 -53174 -66779 -18649
22408a8649P4086M4643M1536j8011o4037k4988l7243j6286Q63J6286J6098l94
$$ -18649 55437 100080 141616 123605 59568 34580 -2663 -18949 -18086 -1800 14298 13904
22396A3904K7405p610j222j0286k424R4620M1970l6635n6561k1267k622J03J9966
$$ 13904 41309 33699 32477 22191 19767 114387 156357 119722 63161 41894 39272 39375 59341
22383E9341p548r664j8153j9384o409k6731j2500p554J7117J7622Q857n559j7700
$$ 59341 51793 42129 23976 4592 -1817 -28548 -41048 -48602 -31485 -13863 -5006 -10565 -28265
22370b8265K638j6039k9437M7295r573l0809O0529L1540K279m1378j1323Q204
$$ -28265 -25627 -41666 -71103 -23808 -33381 -64190 -3661 27879 30158 -11220 -22543 -14339
22358a4339m10j0573K5334K6624Q096L9063J7102M5066k5915l3551k6592j5831
$$ -14339 -14749 -25322 12 26636 34732 73795 90897 135963 110048 76497 49905 34074
22346C4074M3049M8217K3580M5660j9998k9077K7126o9432q4848l3401l4922N1181
$$ 34074 77123 125340 148920 194580 174582 145505 172631 103199 18351 -15050 -49972 1209
22334A209P2970L0085l1861J2002m5873J2176r198K1316j543j3612k1753k2401
$$ 1209 74179 104264 72403 84405 38532 50708 41510 62826 61283 47671 25918 3517
22322C517k5249N5960M8199j8991P218j5514m1704K2631L846n608J6189L2039
$$ 3517 -21732 34228 82427 63436 70654 55140 13436 36067 39913 34305 50494 82533
22310H2533j7293k9793j791l0351M216M6493j3210m5097k5211j4739K6501L7698
$$ 82533 65240 35447 33656 3305 7521 54014 40804 -4293 -29504 -44243 -17742 19956
22298A9956m288M2582L8693J7859q4720N4379L8565k9219l2523K8962L927m4994
$$ 19956 15668 58250 96943 114802 30082 84461 123026 93807 61284 90246 94173 49179
22286D9179J1873K4180j3025m7277j5430n2422o5923J3100O4395J3531K9730J9108
$$ 49179 61052 85232 72207 24930 9500 -42922 -108845 -95745 -31350 -17819 11911 31019
22274C1019k451J8926K0163j412m630n6621m0727R411o419M682k3177j3994j4551
$$ 31019 28568 47494 67657 66245 61615 4994 -35733 -26322 -32741 -28059 -51236 -65230 -79781
22261g9781n1595M4758P1056K5700j8072N4632P5557J2446m5629o4188n117m0592
$$ -79781 -131376 -86618 -15562 10138 -7934 46698 122255 134701 89072 24884 19767 -20825
22249b0825N7625O4775n481m2641l9360l5635j2420J5842l1722l5377K0190J3671
$$ -20825 36800 101575 96094 53453 14093 -21542 -33962 -18120 -49842 -85219 -65029 -51358
22237e1358N2774L3668j8891k1987m3009q415k0405O88M9035L2382M4499n5176
$$ -51358 1416 35084 16193 -5794 -48803 -57218 -77623 -76935 -27900 4482 48981 -6195
22225f195l6605K4236L6100R946M521j2506j638k1451j6164l2683J1947J4702
$$ -6195 -42800 -18564 17536 27482 32003 19497 17859 -3592 -19756 -52439 -40492 -25790
22213b5790L1369J3029m2034K3468k3483J6746J7919J3265k6093p997n195K2121
$$ -25790 5579 18608 -23426 42 -23441 -6695 11224 24489 -1604 -9601 -14796 7325
22201G325L0964P67J0891J1046p375j8701M6963k7865K0030L5588K3195k7331
$$ 7325 38289 39056 49947 60993 53618 34917 81880 54015 74045 109633 132828 105497
22189A05497p8182K2812Q5351j4821n6182k9640J3606r15m1777j879J0537l813
$$ 105497 27315 50127 135478 120657 64475 34835 48441 47526 5749 3870 14407 10594
22177A0594j5073K5979M0658j1395p5199J7293L5524J3150m0838l2080K6677l69
$$ 10594 -4479 21500 62158 50763 -24436 -7143 28381 41531 693 -31387 -4710 -5079
22165e079n0335J7431J3027P032L4305j6723J1069O9918O9177j7614k4251J6891
$$ -5079 -55414 -37983 -24956 -17924 16381 -342 10727 80645 149822 132208 107957 124848
22153A24848j4292p2889p6716J8149N7190L6427l052M3840p0992q7557k6808L1447
$$ 124848 110556 37667 -39049 -20900 36290 72717 69665 113505 42513 -45044 -71852 -40405
22141d0405M8313P9958K6599p8846r5085K7926J6603J1178K0765p042q94P586
$$ -40405 7908 87866 114465 35619 -59466 -31540 -14937 -3759 17006 9964 9070 16656
22129A6656K8182L2613J6765j635P017r97r464j03204l2684P4718K8491k0052
$$ 16656 44838 77451 94216 92581 99598 98601 89137 -14067 -46751 27967 56458 36406
22117C6406J1846J7472M6373l3617o3682n6989K9090O1461n7050k8076k8156J8589
$$ 36406 48252 65724 112097 78480 14798 -42191 -13101 48360 -8690 -36766 -64922 -46333
22105d6333K5580q0j2619N866L7598P1303j265o6476K057q278j78l716K8895L3421
$$ -46333 -20753 -20833 -33452 -27586 10012 81315 80050 13574 15631 7353 7175 3459 32354 65775
22091F5775M666l300M6399K1946J6232L961n4409m7708O0699j7718n0107k4907
$$ 65775 70441 67141 113540 135486 151718 155679 101270 53562 114261 96543 46436 21529
22079B1529k5074M4640M8123m9455o7720k4634k4496k4503m430P9205M4379K9054
$$ 21529 -3545 41095 89218 39763 -27957 -52591 -77087 -101590 -106020 -26815 17564 46618
22067D6618k7802K6028j8245l8627j7633J0702j3236K0069j1472N8095j6645m8766
$$ 46618 18816 44844 26599 -12028 -29661 -18959 -32195 -12126 -23598 34497 17852 -30914
22055c0914j3229k8937j7831J2732O4747J9544k1317N7333N0548q1685J4596L9507
$$ -30914 -44143 -73080 -90911 -78179 -13432 6112 -15205 42128 92676 10991 25587 65094
22043F5094m2261p56J0938o265q6604j7168p129J4114l9173l2655N3459P8329
$$ 65094 22833 22077 33015 26750 -59854 -77022 -84151 -70037 -109210 -141865 -88406 -10077
22031a0077J4064N098k7526k6308j034O3603K9487R933j1513l0253o2519l5123
$$ -10077 3987 9085 -18441 -44749 -45783 17820 47307 57240 45727 15474 -47045 -82168
22019h2168L3204N2776P1327O588m8098J5693O299p2601k9358L150K3861k6797
$$ -82168 -48964 3812 75139 81727 33629 49322 55621 -16980 -46338 -43188 -19327 -46124
22007d6124n947m7931n1971O3431M7805K5100r844M2928J4377l5312K3255L1637
$$ -46124 -52071 -100002 -151973 -88542 -40737 -15637 -25481 17447 31824 -3488 19767 51404
21995E1404k9945K4496j9660j1026j0639j8618L9242O9544L417k1436l8229l6662
$$ 51404 21459 45955 26295 15269 4630 -13988 25254 94798 98215 76779 38550 1888
21983A888K1140J6943o517k7803m061P780k8072N003K0345O0610O932L860k2987
$$ 1888 23028 39971 33454 5651 1590 9370 -18702 -13699 6646 67256 74188 78048 55061
21970E5061N20l5753j8105M0174K4117l8408K1733j7690k4302k5601L684J4733
$$ 55061 55581 19828 1723 41897 66014 27606 49339 31649 7347 -18254 -14570 163
21958A63k3048O225l2181j4846L3848L9092K4352J8715p9606J4895p561K9313
$$ 163 -22885 -16660 -48841 -63687 -29839 9253 33605 52320 -27286 -12391 -19952 9361
21946I361L8948O117j0362M1727K5652L5346j1569j19513j06777K1831K8074L6805
$$ 9361 48309 54426 44064 85791 111443 146789 135220 15707 -91070 -69239 -41165 -4360
21934d360J8127M951m282J9006K4549l3837j8646l2023P739L1909l067k5479k91
$$ -4360 13767 18718 14436 33442 57991 24154 5508 -26515 -18776 13133 10066 -15413 -15704
21921a5704K6352K981l2988k7988N5872j5285j7365l2581K8866R233J5977m1019
$$ -15704 10648 13629 -19359 -47347 8525 -6760 -24125 -56706 -27840 -18607 -2630 -43649
21909d3649m9752K4630M2700L6587P3967K2930j3196J3988n2222j7553N4677o2610
$$ -43649 -93401 -68771 -26071 10516 84483 107413 94217 108205 55983 38430 93107 30497
21897C0497k1297M5907j7712n5141o049k8616J9429O6565J6354o77R879k3075
$$ 30497 9200 55107 37395 -17746 -23795 -52411 -32982 33583 49937 49260 59139 36064
21885C6064j2187K1485J5146l7514n9814l938M1767L1210L6761K6989J2900n2826
$$ 36064 23877 45362 60508 22994 -36820 -40758 1009 32219 68980 95969 108869 56043
21873E6043j1471j561o0452M8926k5141j4913M6374j3265q28j189N213l1491R802
$$ 56043 44572 43011 -17441 31485 6344 -8569 37805 24540 23712 22523 27736 -3755 6047
21860F047j988j3486J6540M0881p8565Q015L4218q003K1351j0791j3025L2721
$$ 6047 4059 -9427 7113 47994 -30571 -22556 11662 3659 25010 14219 1194 33915
21848C3915K2598n021o3142M3599J8653J6409k4712P000N7278L161o2265k0259
$$ 33915 56513 51492 -11650 31949 50602 67011 42299 49299 106577 109738 47473 27214
21836B7214l95R066J9625M9874K4264j4964P3055K1455n0617r7613k0537k5877
$$ 27214 26819 35885 55510 105384 129648 114684 187739 209194 158577 60964 40427 14550
21824A4550J9921m4692l206o800J1376P5487J0734l792O074k606n0412j6311K2033
$$ 14550 34471 -10221 -13427 -20227 -8851 66636 77370 73578 79652 77046 26634 10323 32356
21811C2356L4094j1621l3698j8261N3190L5958r107l1907O2894k2924k6125o2250
$$ 32356 66450 54829 21131 2870 56060 92018 82911 51004 113898 90974 64849 2599
21799B599K4591K8206m6323J5452K2341k0874P932j3238M721J0183j0827m2532
$$ 2599 27190 55396 9073 24525 46866 25992 33924 20686 25407 35590 24763 -17769
21787a7769L8055M592n3759k4779j9580j194j4400M682M8149R4171M4697k6115
$$ -17769 20286 24878 -28881 -53660 -73240 -74434 -88834 -84152 -36003 58168 102865 76750
21775G6750j5307o353m4667m9912K1012M3873m9855q90L6340k4350M596m464O8925
$$ 76750 61443 55090 10423 -39489 -18477 25396 -24459 -25349 10991 -13359 -8763 -13227 55698
21762E5698M8448o678l4245p1865m4681O411N6960K0900p146j7946L6468M3964
$$ 55698 104146 97468 63223 -8642 -53323 -46912 10048 30948 23802 5856 42324 86288
21750H6288k7115n1707J0507M9012m4951k0668L3858O335m5174l1605N2648O4585
$$ 86288 59173 7466 17973 66985 22034 1366 35224 41559 -3615 -35220 17428 82013
21738H2013l8745l5609M145J5228J0466j9882j7365o327n181O704M6457k5964
$$ 82013 43268 7659 11804 27032 37498 17616 251 -6076 -11257 -4553 41904 15940
21726A5940J9346P700p115K064J4212J712J6261N299j8298n9241Q255O573q5150
$$ 15940 35286 42986 35871 37935 52147 53859 70120 75419 57121 -2120 6135 12708 -72442
21713g2442m5007N8795K5281R4152M4780K4329n4892P824j033j8132m1478K3260
$$ -72442 -117449 -58654 -33373 60779 105559 129888 74996 82820 81787 63655 22177 45437
21701D5437k5551K6973K8502m8678k7080k9656k933M5970Q8255L3685m7885m2726
$$ 45437 19886 46859 75361 26683 -397 -30053 -32986 12984 101239 134924 87039 44313
21689D4313n2117p6872m5124N01M4452J07342Q7703P218k391m3789j0413N923
$$ 44313 -7804 -84676 -129800 -129299 -84847 22495 110198 117416 115025 71236 60823 66746
21677F6746O359J1268J12o4678n471J9887o314N404J2770j041K652M6283P03l0281
$$ 66746 73105 84373 84485 19807 14336 34223 27909 33313 46083 45042 47694 93977 94680 64399
21663F4399k2305j726j8085n108k8900J2208M1832J2276j6843P85K249J1999l8265
$$ 64399 42094 40368 22283 17175 -11725 483 42315 54591 37748 38533 40782 52781 14516
21650A4516j1975P7752L5652m7453k5966K1365L4863j4130k0571n8778m3313j4324
$$ 14516 2541 80293 115945 68492 42526 63891 98754 84624 64053 5275 -38038 -52362
21638e2362J3714L0295o376k626K1330J0872K1336M5598O339p105l5414j4243
$$ -52362 -38648 -8353 -14729 -17355 3975 14847 36183 81781 88120 81015 45601 31358
21626C1358l1028m3311j4277L4705N4943l0218J0882K3127l1035p3364j0064L7940
$$ 31358 330 -42981 -57258 -22553 32390 2172 13054 36181 5146 -68218 -78282 -40342
21614d0342J6824K5997K0767l8867n1036J01940L5952K2934J688l4357j9586J2359
$$ -40342 -23518 2479 23246 -15621 -66657 35283 71235 94169 95857 61500 41914 54273
21602E4273m0106k5442K0006L6507k1195K9904L0884k2998J7962P846j038L8051
$$ 54273 14167 -11275 8731 45238 24043 53947 84831 61833 79795 87641 86603 124654
21590A24654m4005n2613q58P0085k164m3581m2175n8789L5839Q509J5944j1104
$$ 124654 80649 28036 27178 97263 95099 51518 9343 -49446 -13607 -5098 10846 -258
21578b58k7141K5698J7194m9202j3751M839O1840Q1706K5829n523p9669m0000
$$ -258 -27399 -1701 15493 -33709 -47460 -42621 19219 100925 126754 121231 41562 1562
21566A562K0683K6251j252O157O2565o057l2844J506l5419N680N2775j7772r152
$$ 1562 22245 48496 47244 53401 115966 109909 77065 78571 43152 48832 101607 83835 74683
21553G4683L6407J8466q340l7620l4619k9184L0736M4635j258j0093q94j975k2484
$$ 74683 111090 129556 121216 83596 48977 19793 50529 95164 93906 83813 82919 80944 58460
21540E8460n016K354N382l6978k6893K6217M0781R001J399j8712l3302k4983J6564
$$ 58460 53444 55798 61180 24202 -2691 23526 64307 73308 74707 55995 22693 -2290 14274
21527A4274O923O3194m407m5671j4962l0183L7852J2949J4942K95j8333j0021
$$ 14274 21197 84391 79984 34313 19351 -10832 27020 39969 54911 55206 36873 26852
21515B6852K3835K6632k6533M8402n154K4184j9334m4809k5229k2402j1938M0601
$$ 26852 50687 77319 50786 99188 94034 118218 98884 54075 28846 6444 -5494 35107
21503C5107m3188J2322N8720J13573L9419o9673J4605N5363M1641j06495j7646
$$ 35107 -8081 4241 62961 176534 215953 146280 160885 216248 257889 151394 133748
21492A33748j4424m0342k7993L4345L879J5136r177P78J816o8083j4821j3904
$$ 133748 119324 78982 50989 85334 89213 104349 95172 95950 97766 29683 14862 958
21480I58R967J8883P284L0176j5562k3842n0008K878l3374P4402N7836j9920l5746
$$ 958 10925 29808 37092 67268 51706 27864 -22144 -19266 -52640 21762 79598 59678 23932
21467B3932J3828J6199N1699L5890l1643n1781j1943J8264L753k7653j4198K9757
$$ 23932 37760 53959 105658 141548 109905 58124 46181 64445 68198 40545 26347 56104
21455E6104P6920L6124j5207l869k9236k676j5736O471K3281p4226j9368J5239
$$ 56104 133024 169148 153941 150072 120836 118160 102424 108895 132176 57950 38582 53821
21443E3821J9761L9152J7128o3812q268Q9605J405R741O231j6889k592n4036j2362
$$ 53821 73582 112734 129862 66050 57782 147387 148792 158533 164764 147875 145283 91247 78885
21430G8885K878l094R339J458L9149r377m3511K1955k8794j6940L5516N392J4449
$$ 78885 81763 78669 88008 89466 128615 119238 75727 97682 68888 51948 87464 92856 107305
21417A07305j6586n9744k9127J4618J1991j1706k5638P7428N8912l3272m8252
$$ 107305 90719 30975 1848 16466 28457 16751 -8887 68541 127453 94181 45929
21406D5929O4371j0630J7156j8031j4595k138m1585k1539j2557J1073M6444R367
$$ 45929 110300 99670 116826 98795 84200 82062 40477 18938 6381 17454 63898 73265
21394G3265M8098L055k0476L7273n5632j8714J773O93m0286j5765l857l9864P0392
$$ 73265 121363 124418 103942 141215 85583 66869 68642 69335 29049 13284 9427 -30437 39955
21381C9955J8766R353L4818k5471Q793J5144j0474k4502L8684J969j2490l97p1140
$$ 39955 58721 68074 102892 77421 86214 101358 90884 66382 105066 107035 94545 94148 23008
21368B3008p3350N325K8509k931j5752Q2528K9103K4244o579l6430k667Q194R6967
$$ 23008 -50342 -45017 -16508 -19439 -35191 47337 76440 100684 94105 57675 55008 63202 160169
21355A60169P3425j3455j9974n3365j31662l9182j7995N6017L0697M992K007n5249
$$ 160169 233594 220139 200165 146800 15138 -24044 -42039 13978 44675 49667 51674 -3575
21343c575N7965M2182k7383k8846l3439j445L1168K4944k5504q198Q802L9039
$$ -3575 54390 96572 69189 40343 6904 5459 36627 61571 36067 27869 36671 75710
21331G5710k2607m5562M7809J1145L4077j3366K3207K9408n3742j016k3514j0190
$$ 75710 53103 7541 55350 66495 100572 87206 110413 139821 86079 85063 61549 51359
21319E1359N8514R6456Q05o1390n9553L948N7072N9814m9765m0736K359j6558
$$ 51359 109873 206329 207134 145744 86191 90139 147211 207025 157260 116524 118883 102325
21307A02325J0249J1868j2785k6713m82k9950R358Q604m0978L8727o851k6386
$$ 102325 112574 124442 111657 84944 84462 54512 63870 72474 31496 70223 63372 36986
21295C6986L4482M4837O0121j3927l1833Q125j7348k8355j9842j5337L637k0856
$$ 36986 71468 116305 176426 162499 130666 138791 121443 93088 73246 57909 61546 40690
21283D0690r3784k1596M5443k3819L767j2991J01741P2207J961J3956j3205j0315
$$ 40690 -53094 -74690 -29247 -53066 -49299 -62290 39451 111658 113619 127575 114370 104055
21271A04055K7497R261j2606m8458K8846M6279p5726m0712O7230L7627M790q636
$$ 104055 131552 140813 128207 79749 108595 154874 79148 38436 105666 143293 148083 139447
21259A39447M7850l0443m9595k7978O786J2156K783M7527L372m5165k2482O729
$$ 139447 187297 156854 107259 79281 86067 98223 101006 148533 151905 106740 84258 90987
21247I0987P828p6818J3075p930K1148N9040L357K8599J6486k5263o5537o4887
$$ 90987 98815 21997 35072 27142 48290 107330 110687 139286 155772 130509 64972 85
21235H5k6143O3604O7188L3601j5060o1747J575o0715m3437O1015O0578J4145
$$ 85 -26058 37546 104734 138335 123275 61528 63103 2388 -41049 19966 80544 94689
21223I4689L7722k6206n3941M9913q719J4273K1156l5777q220L8789o0215j7464
$$ 94689 132411 106205 52264 102177 93458 107731 128887 93110 84890 123679 63464 46000
21211D6000J8572L0681j1340J3875n8207o405O468M0790p008J8337K5585m7409
$$ 46000 64572 95253 83913 97788 39581 33176 39644 80434 73426 91763 117348 69939
21199F9939k4279p679m285m739K7208r167K4399j9952L1796M4461K148j6361j6525
$$ 69939 45660 37981 33696 28957 56165 46998 71397 51445 83241 127702 129850 113489 96964
21186I6964j8201l7534L110j5227O901l6347O0675M9923m2875l1749j2150p909
$$ 96964 78763 41229 44339 29112 36013 -334 60341 110264 67389 35640 23490 15581
21174A5581O6802n0112K2962N5496l9684m7202M2125N7416o8094n2458q0050L2967
$$ 15581 82383 32271 55233 110729 71045 23843 65968 123384 55290 2832 -77218 -44251
21162d4251R9691N1744J9589k0948J1234o5961J571O062J459M8375Q756K0163
$$ -44251 55440 107184 126773 105825 117059 51098 52669 58731 60190 108565 117321 137484
21150A37484q169J742J2851n0072j4264m1464R275K2249J4694l1074j9236j1635
$$ 137484 129315 131057 143908 93836 79572 38108 47383 69632 84326 53252 34016 22381
21138B2381K7142L6658k0665l43m714j2247m2726J2659K6269q241J2425j4767
$$ 22381 49523 86181 65516 65173 60459 48212 5486 18145 44414 36173 48598 33831
21126C3831j203J1432L585K031p437K6561J9078K1369O160M811k2566k0416J1977
$$ 33831 32628 44060 47645 49676 42239 68800 87878 109247 115407 120218 97652 77236 89213
21113H9213L9864k1105J2708P8750m0236n2128n6028j9746N9778L2044n0011j2737
$$ 89213 129077 107972 120680 199430 159194 107066 51038 31292 91070 123114 73103 60366
21101F0366L2231K5730l7243j12785L1456O4805J3174K001K5432L9531j0293k2245
$$ 60366 92597 118327 81084 -31701 -245 64560 77734 79735 105167 144698 134405 112160
21089A12160o5573l453L5581l7638M3137l2308l7301L4347K8337L91K0577L0245
$$ 112160 46587 43134 78715 41077 84214 51906 14605 48952 77289 77680 98257 128502
21077A28502l7027J5714K6021J7617m7236r453r3223m9888M3146M3390k8232l5571
$$ 128502 91475 107189 133210 150827 103591 94138 915 -48973 -5827 37563 9331 -26240
21065b6240M3022O0297O0437L5857K8778j9168k9965l567k3364j5469k87K1733
$$ -26240 16782 77079 137516 173373 202151 182983 153018 149451 126087 110618 110331 132064
21053A32064j5925L685L377m4253l4011l40O58M3487J990J8603M2345k1833l6041
$$ 132064 116139 119824 123201 78948 44937 44597 45255 88742 90732 109335 151680 129847 93806
21040I3806k0286K0662k5827m6269L6176O3673m2180k8259R452O4356J899M0087
$$ 93806 73520 94182 68355 22086 58262 121935 79755 51496 60948 125304 127203 167290
21028A67290M8927k6585k2409n8522r4796l0930L6199M0417L1936N123M198J4449
$$ 167290 216217 189632 167223 108701 13905 -17025 19174 59591 91527 96650 100848 115297
21016A15297J2258L4218J188K0010k1302m7973p0922m0085k5063L0287O1988O816
$$ 115297 127555 161773 162961 182971 161669 113696 42774 2689 -22374 7913 69901 76717
21004G6717l3288K3308j4970K827K5012L9115L6713k7981m4297k1527L2337L0535
$$ 76717 43429 66737 51767 54594 79606 118721 155434 127453 83156 61629 93966 124501
20992A24501O5668m23l3839o9559R917m5311j5429J5854J1810m4661m2194J753
$$ 124501 190169 189746 155907 86348 96265 50954 35525 51379 63189 18528 -23666 -21913
20980b1913J8629L9077K1864r403K002M5098L6573m5501k0168K7011P7535L2484
$$ -21913 -3284 35793 57657 48254 50256 95354 131927 86426 66258 93269 170804 203288
20968B03288j9469j1061m8795l8420k2419k4779j6812K9321K7390k0835j6801
$$ 203288 183819 172758 123963 85543 63124 38345 21533 50854 78244 57409 40608
20957D0608K5657L1427l602P534L7719L4798k5016l5014o443O1445k1174n4274
$$ 40608 66265 97692 94090 101624 139343 174141 149125 114111 107668 169113 147939 93665
20945I3665j0532j160m4271J5425M5741O253L3283L515O376k0552K9947J8425
$$ 93665 83133 81973 37702 53127 98868 105121 138404 141919 148295 127743 157690 176115
20933A76115o3069n6968o9791M1195N1121j5156L4180m8398j1239m7268K9610
$$ 176115 113046 56078 -13713 27482 78603 63447 97627 49229 37990 -9278 20332
20922B0332N5891k370K3428j565K5174J7097L1831J391k4202j9229k9255L795
$$ 20332 76223 73853 97281 95716 120890 137987 169818 171209 147007 127778 98523 102318
20910A02318q904N972K6025L873J2159L044n6107j9414J1746N1948J9037P600
$$ 102318 93414 99386 125411 129284 141443 144487 88380 68966 80712 132660 151697 159297
20898A59297m5616k887j8278p0110k4059K3240K7361M2657L2586N1495j7276o9077
$$ 159297 113681 110794 92516 22406 -1653 21587 48948 91605 124191 175686 158410 89333
20886H9333R998L0365K4814l2545l9217l0497K7556Q448m0391L9656M224j619
$$ 89333 99331 129696 154510 121965 82748 52251 79807 88255 47864 87520 91744 90125
20874I0125j5252Q542o405L5825N2798k4235l5074j794l3282o3693m9228J7344
$$ 90125 74873 83415 77010 112835 165633 141398 106324 104530 71248 7555 -41673 -24329
20862b4329O4265L0600L027K3323M7660J1243l3847l5661p352L6387o707j0864
$$ -24329 39936 70536 73563 96886 144546 155789 121942 86281 78929 115316 108609 97745
20850I7745j9775o271m953L8212J10013R098j02652n756J9794M7687L5306l1243
$$ 97745 77970 71699 66746 104958 214971 224069 121417 115661 135455 183142 218448 187205
20838A87205o5293m469n7815k4261L5821K0787r19k6783l9476m6431P8694J8143
$$ 187205 121912 117443 59628 35367 71188 91975 91056 64273 24797 -21634 57060 75203
20826G5203L2822J9420R122M5971L41k9954K501L0883J048r79M131L4394o6979
$$ 75203 108025 127445 136567 182538 182879 152925 155426 186309 187357 186378 190509 224903 157924
20813A57924k2505L167o0462K338P8853J8173j7667m4601n0068K2167l3697j2495
$$ 157924 135419 138586 78124 80462 159315 177488 159821 115220 65152 87319 53622 41127
20801D1127N0995K3894j4455j1957R177j8566M7680n1222o7687K7659N1719l0797
$$ 41127 92122 116016 101561 89604 98781 80215 127895 76673 8986 36645 88364 57567
20789E7567O623L3468J6537M484j3663k7881l6729L0081R400N4193j536L0049
$$ 57567 64190 97658 114195 118679 105016 77135 40406 70487 79887 134080 132544 162593
20777A62593K9036l2452m2357n933M8541j625n6899K7333j3636l0758J4104P709
$$ 162593 191629 159177 116820 110887 159428 157803 100904 128237 114601 83843 97947 105656
20765A05656J7913j738J5349L399j1614J2991P4205J5950p6469P117M7009o2883
$$ 105656 123569 121831 137180 140579 128965 141956 216161 232111 155642 162759 209768 146885
20753A46885m261P8123n839m9574o5285j1961M1919j0734k0981L9189K8806M239
$$ 146885 142624 220747 214908 165334 100049 88088 130007 119273 98292 137481 166287 170526
20741A70526j5512l180j974j7437m876q4962O251M8273K9050L4797j6455l6548
$$ 170526 155014 151834 149860 132423 127547 42585 48836 97109 126159 160956 144501 107953
20729A07953M4359m9643O590L7884J8255p895k3452l0688l0706k1292k4552P5709
$$ 107953 152312 102669 109259 147143 165398 157503 134051 103363 72657 51365 26813 102522
20717A02522K24K3926k0473j2312N658j8994K2132l3434n4167K4960M1326l8622
$$ 102522 102746 126672 106199 93887 99545 80551 102683 69249 15082 40042 81368 42746
20705D2746k8027M1415K1935j8264O1225j2038k2718K2387k3185k9047m937L5258
$$ 42746 14719 56134 78069 59805 121030 108992 86274 108661 85476 56429 51492 86750
20693H6750L7802M6355k0542J982m9153l1498l8635j6318J3177k1554L3779N2096
$$ 86750 124552 170907 150365 152347 103194 71696 33061 16743 29920 8366 42145 94241
20681I4241J8898j0903M466K2748J3568q19k4353j3562j9319K6927M5498q652
$$ 94241 113139 102236 106702 129450 143018 142199 117846 104284 84965 111892 157390 148738
20669A48738m3869n5702L7736J4944M4682j8965M958l2952j6424P6737m7476p520
$$ 148738 104869 49167 86903 101847 146529 127564 132522 99570 83146 159883 112407 104887
20657A04887J8235O9009K09J5835K7083m2522k3717m9901r206q821J945k8454
$$ 104887 123122 192131 192340 208175 235258 192736 169019 119118 109912 101091 103036 74582
20645G4582l2632J6511N2162M459P775Q423L0225K5080L599K72j0001p3629n0923
$$ 74582 41950 58461 110623 115082 122857 131280 161505 186585 190184 190456 180455 106826 55903
20632E5903L1027N0077j8508J2915K2531k0260m1967P100m6018R883L5655M9754
$$ 55903 86930 137007 118499 131414 153945 133685 91718 98818 52800 62683 98338 148092
20620A48092k0104o0362k5341p071K5377P8424Q1899O9340l3796p5170k0065k1438
$$ 148092 127988 67626 42285 35214 60591 139015 220914 290254 256458 181288 161223 139785
20608A39785j8265n984J036L7064l0294L2846P9151o353J8789M084n1421n7184
$$ 139785 121520 115536 116572 153636 123342 156188 235339 228986 247775 251859 200438 143254
20596A43254j7616m4566M072M9058j9828J3296N0404k1805j3155o264O932j4356
$$ 143254 125638 81072 85144 134202 114374 127670 178074 156269 143114 136850 143782 129426
20584A29426L298p3546M0658K4159j031j3717m0627K6858L3993K333J7963K1207
$$ 129426 132724 59178 99836 123995 122964 109247 68620 95478 129471 131804 149767 170974
20572A70974j8705o9348n442k0759K8476k0827M1572Q584J8679J1419N5691n252
$$ 170974 152269 82921 77479 56720 85196 64369 105941 114525 133204 144623 200314 195062
20560A95062j6653m7213q387L0243p960N2762p378l9757l7335k5848o845P634
$$ 195062 178409 131196 122809 153052 145092 197854 190476 150719 113384 87536 80691 88325
20548H8325l7532L8021P922J1211N7903l6900l391O5349q502l5548o652l879n394
$$ 88325 50793 88814 96736 107947 165850 128950 125559 190908 182406 146858 140206 136327 130933
20535A30933J500J6406m4757K6523J796m0045k7733J7642L5136l365l3893l968
$$ 130933 132433 148839 104082 130605 132401 92356 64623 82265 117401 114036 80143 76175
20523G6175o365O4104Q4803p745j7371k9488o9496q206K5862J5553J3848M0776
$$ 76175 69810 133914 218717 210972 193601 164113 94617 86411 112273 127826 141674 182450
20511A82450M613m4598L6478N0788K0791k7904m9752l9778J2436M2804n3460m8237
$$ 182450 187063 142465 178943 229731 250522 222618 172866 133088 145524 188328 134868 86631
20499H6631K9551Q118L3423R154k954N0803Q2933l3435n1042J849K8974k9614
$$ 86631 116182 124300 157723 166877 163923 214726 297659 264224 213182 215031 244005 214391
20487B14391m1421j1350j8291m5036%J8211m302j156K2974l8185J3896M9132J5036
$$ 214391 172970 161620 143329 98293 98293 116504 112202 111046 134020 95835 109731 158863 173899
20474A73899L8169N377K897p8923n2288L674Q9946M3948J1899Q258j7228j5810
$$ 173899 212068 217445 220342 141419 89131 92805 182751 226699 238598 246856 229628 213818
20462B13818L3665p278k1995j5801l4172n6768L7318K8443J4596k5259L0457Q0430
$$ 213818 247483 240205 218210 202409 168237 111469 148787 177230 191826 166567 197024 277454
20450B77454p2472m3096k9893n424J0286L3542p3222l2939J9181J5348O664j0651
$$ 277454 204982 161886 131993 126569 136855 170397 97175 64236 83417 98765 105429 94778
20438I4778o866J7801j6056P4608k8267n4530J216P2262L9727m4627l6637J0438
$$ 94778 87912 105713 89657 164265 135998 81468 82684 154946 194673 150046 113409 123847
20426A23847R498J2541K2443N495p230p24l8191k8645J6515m0277m3857K2766
$$ 123847 133345 145886 168329 173824 166594 165870 127679 99034 115549 75272 31415 54181
20414E4181N4313r587K5805j7745J391L8874L9658M0542J357q2565l568J0707
$$ 54181 108494 98907 124712 106967 108358 147232 186890 227432 228789 146224 142656 153363
20402A53363M1953J8685l9286r4453K0971N2398M0928r392l0521J2996j4259j1288
$$ 153363 195316 214001 174715 80262 101233 153631 194559 185167 154646 167642 153383 142095
20390A42095L2869k9896k9524K747M0604L6809J3316m5376j7550K1139M7655K3038
$$ 142095 174964 145068 115544 118291 158895 195704 209020 163644 146094 167233 214888 237926
20378B37926n306l1616L3321P3286l1305K6324J2578l3060K415q559j1523j9895
$$ 237926 232620 201004 234325 307611 276306 302630 315208 282148 284563 276004 264481 244586
20366B44586J2054n0769r142l7438L780O9324m5926n0464K8818M3563j933K4247
$$ 244586 256640 205871 196729 159291 163071 232395 186469 136005 164823 208386 206453 230700
20354B30700J4157j9113m4946q274j1150L7146L627o563N2965o366j5196O636
$$ 230700 244857 225744 180798 172524 161374 198520 202147 195584 248549 242183 226987 233623
20342B33623o0516K2788K1794k481O806O3245P591l9021J8427L3151m8244o5945
$$ 233623 173107 195895 217689 215208 222014 285259 292850 253829 272256 305407 257163 191218
20330A91218L2184O6696o794o7522k8076N3999L1446J5990K9277J3697l1296n5823
$$ 191218 223402 290098 283304 215782 187706 241705 273151 289141 318418 332115 300819 244996
20318B44996r392J049N630m01j5070j7078l8946l1264k300N4129j7845M836j214
$$ 244996 235604 236653 242283 241882 226812 209734 170788 139524 137224 191353 173508 178344 177130
20305A77130p02J4042K309J0161O1412j7147r045p1973j8787N1945L0690P6914
$$ 177130 176428 190470 192779 202940 264352 247205 238160 166187 147400 199345 230035 306949
20293C06949L1429l0511j7647J266P382J8695J4333J3654l8795l7528J1947J3023
$$ 306949 338378 307867 290220 291486 298868 317563 331896 345550 306755 269227 281174 294197
20281B94197K7262o727k5753k5257J9560M3874k1468L1551q99l4414q736L8858
$$ 294197 321459 314732 288979 263722 283282 327156 305688 337239 336340 301926 293190 332048
20269C32048J8604m8863p6843L957R7591J5686o3428k4321M1325q054K2230O232
$$ 332048 350652 301789 224946 228903 326494 342180 278752 254431 295756 287702 309932 316164
20257C16164l0359m4321L2780m0269K9368j0573k2715M6204M1527L0002o9599
$$ 316164 285805 241484 274264 233995 263363 252790 230075 276279 317806 347808 278209
20246B78209o9127K6744L2210K1886J3403m6584P741p130L7912L4006K011l4845
$$ 278209 209082 235826 268036 289922 303325 256741 264482 257352 295264 329270 331281 296436
20234B96436J1402L5909K3918k4233J0233O2000k608p1787o8200m0449J00598
$$ 296436 307838 343747 367665 343432 353665 415665 413057 341270 273070 232621 333219
20223C33219J2322o5486k630j7881k0707N3083P0499n5214q0064N4691O4277j7212
$$ 333219 345541 280055 277425 259544 238837 291920 362419 307205 227141 281832 346109 328897
20211C28897j7544N278M217L5114N5707m2051k8938l5998J817J0574J3214J1845
$$ 328897 311353 316631 320848 355962 411669 369618 340680 304682 306499 317073 330287 342132
20199C42132J4837j1667j1401j4461j7751L2381L6202P323M8396k0697o7930L404
$$ 342132 356969 345302 333901 319440 301689 334070 370272 377595 425991 405294 337364 340768
20187C40768M9993O2592J19205J00667L1943L475L119K5830r226m3955J2280K6600
$$ 340768 390761 453353 572558 673225 705168 708643 711762 737592 728366 684411 696691 723291
20175G23291L3281l4422k551M4839K5943J1793O0571l884k6748L2973r2911p8686
$$ 723291 756572 722150 719599 764438 790381 802174 862745 858861 832113 865086 772175 693489
20163F93489l4163M2695j5655m3548n0931k4801L3241J4351M4092j7213m3467
$$ 693489 659326 702021 686366 642818 591887 567086 600327 614678 658770 641557 598090
20152E98090N6046o696n1714p4493m8231k9877k9140k1726K7m573O2491L4467
$$ 598090 654136 647440 595726 521233 473002 443125 413985 392259 392286 387713 450204 484671
20140D84671j1203J0151l3530n5053M5297Q3578J6667P427l1709L229j0382J0960
$$ 484671 473468 483619 450089 395036 440333 523911 540578 548005 516296 519525 509143 520103
20128E20103K3224K8539J6953k7456j1506J4669J3866J4909P9046O4018M6458
$$ 520103 543327 571866 588819 561363 549857 564526 578392 593301 672347 736365 782823
20117G82823O6613k8929j6084J8255L1662L1855j7057k0436p891q754o084n184
$$ 782823 849436 820507 804423 822678 854340 886195 869138 848702 840811 832057 825973 820789
20105H20789L7940P9886J3799M420K615M870l4268p3303r104r428p7204p0448
$$ 820789 858729 938615 952414 956834 959449 964319 930051 856748 847644 838216 761012 690564
20093F90564J7297K7848j2719J4365m16K696k6871J5051l204m1773p234Q3030
$$ 690564 707861 735709 722990 737355 736939 739635 712764 727815 724611 682838 675604 758634
20081G58634Q0623N9137l1431K416J845J4429K9651R4509M701p7558o1969n3945
$$ 758634 839257 898394 866963 869379 871224 885653 915304 1009813 1014514 936956 874987 821042
20069H21042J0440M0135M630p909K7338M6239m2287m8078J0959j9625M4349P7148
$$ 821042 831482 871617 876247 868338 895676 941915 899628 851550 862509 842884 887233 964381
20057I64381K794p2164p4292n5208J1561M0870M6736K5760l1830j04379j5896
$$ 964381 967175 895011 820719 765511 777072 817942 864678 890438 858608 754229 738333
20046G38333P9158M196k4036K4703m128l097N597M4099J8973Q3951J8071Q596
$$ 738333 817491 821687 797651 822354 818226 815129 820726 864825 883798 967749 985820 994416
20034I94416j4985K7135j7777q2528l6126l4446k8065L4100M5487p820Q0140M3468
$$ 994416 979431 1006566 988789 906261 870135 835689 807624 841724 887211 879391 959531 1002999
20022A002999M6077Q990k0712K1024K3937n9095k6621K9631N5036P8486k0956
$$ 1002999 1049076 1058066 1037354 1058378 1082315 1023220 996599 1026230 1081266 1159752 1138796
20011A138796k4324N0645o14J2488k0155k0565q01K1712O4651p2610j13378K6266
$$ 1138796 1114472 1165117 1164503 1176991 1156836 1136271 1135470 1157182 1221833 1149223 1035845 1062111
19999A062111L2866n1658j20355l2487m822M3113K7313N4845Q3445O6080Q0968
$$ 1062111 1094977 1043319 922964 890477 885655 928768 956081 1010926 1094371 1160451 1241419
19988A241419R7569K4395Q960p378J1424o0980L074L6334K008m4228n4314n2194
$$ 1241419 1338988 1363383 1372343 1364965 1376389 1315409 1318483 1354817 1356825 1312597 1258283 1206089
19976A206089n7984q0207q7677O526k9098N7750n6612j27580O874J6560k8785
$$ 1206089 1148105 1067898 980221 986747 957649 1015399 958787 831207 838081 854641 825856
19965H25856M884J4k5750J8338q175J1164R321k4492o7263m009L4106j7248n623
$$ 825856 830740 830754 805004 823342 815167 826331 835652 811160 743897 739888 773994 756746 751123
19952G51123J5641k8828J279M9929M958J6766l4951k046J0531N64L7996j9264
$$ 751123 766764 737936 739215 789144 794102 810868 775917 773871 784402 784966 822962 803698
19940H03698M3836P9254M9982N858K7407N2112K0043k3356n4685k9711j6763j8052
$$ 803698 847534 926788 976770 982628 1010035 1062147 1082190 1058834 1004149 974438 957675 939623
19928I39623m0663r7998k2932K5251r130k4457k4074q042O3048P1563p2013m9401
$$ 939623 898960 800962 778030 803281 794151 769694 745620 737578 800626 872189 800176 750775
19916G50775L4158M976J4695k1665J7352l401k15n6322q3270N1231M5803P7843
$$ 750775 784933 789909 804604 782939 800291 796890 796675 740353 657083 708314 754117 831960
19904H31960J8806j4141l4169Q826K4102Q373L2292o465r023J9082N9679j5121
$$ 831960 850766 836625 802456 811282 835384 843757 876049 869584 860561 879643 939322 924201
19892I24201j3346q803O829n420j006N9107m0110R626L5018J9055N903O0106K544
$$ 924201 910855 902052 908881 903461 902455 961562 921452 931078 966096 985151 991054 1051160 1053704
19879A053704j2349j3769o1514J3284K0479k7126J2801j1776l5533L794J0437
$$ 1053704 1041355 1027586 966072 979356 999835 972709 985510 973734 938201 941995 952432
19868I52432l2576l2274K1456q773j3720L1018K3053K4785J0837M1243L6764j1364
$$ 952432 919856 887582 909038 900265 886545 917563 940616 965401 976238 1017481 1054245 1042881
19856A042881q3172m396N7699n132J4954O8054k462l174N0414q997n8955M663
$$ 1042881 959709 955313 1013012 1007880 1022834 1090888 1088426 1085252 1135666 1126669 1067714 1072377
19844A072377J18589K0637Q735L4958K9967j133J2492j4381Q619R8343l215O2232
$$ 1072377 1190966 1211603 1220338 1255296 1285263 1284130 1296622 1282241 1290860 1389203 1385988 1448220
19832A448220O0775N9356J12216M8750N3409Q6132q016L4905R1290J97099K34860
$$ 1448220 1508995 1568351 1680567 1729317 1782726 1868858 1860842 1895747 1987037 2184136 2418996
19821B418996J94252K74627M24419N16702M41308K34307K9462j69269k60974j95181
$$ 2418996 2613248 2887875 3312294 3828996 4270304 4504611 4534073 4364804 4103830 3908649
19811C908649k12471k29584j90531j01907j1534J7086o0390l3757l7271n1826
$$ 3908649 3696178 3466594 3276063 3174156 3162622 3179708 3119318 3085561 3048290 2996464
19801B996464j55021j52197j78593j23348o4419L96j4056k6630l4093J0100J1659
$$ 2996464 2841443 2689246 2510653 2387305 2322886 2323282 2309226 2282596 2248503 2258603 2270262
19790B270262q17l7862J305R650O0995J7720m264L9520O5964N667Q034M0602J29291
$$ 2270262 2269445 2231583 2232888 2242538 2303533 2321253 2316989 2356509 2422473 2428140 2436174 2476776 2606067
19777B606067J39861J49116J77831K12788J66194P7560P763n2329J0006J27366
$$ 2606067 2745928 2895044 3072875 3285663 3451857 3529417 3537180 3484851 3494857 3622223
19767C622223J88597K37346L60944M62590N43069N39665N50594M17333N2110l92973
$$ 3622223 3810820 4048166 4409110 4871700 5414769 5954434 6505028 6922361 6974471 6581498
19757F581498o22085o39455n17703l31027l21842k07911j04896m8891m9804K5178
$$ 6581498 5959413 5319958 4802255 4471228 4149386 3941475 3836579 3787688 3737884 3763062
19747C763062M0346J3746j9066j01412j24417n036J9777J1346J3311l6020q2793
$$ 3763062 3803408 3817154 3798088 3696676 3572259 3567223 3587000 3598346 3611657 3575637 3492844
19736C492844n0473n9768M0343N6626k8050j4698j6456K7944K5471k5359k3071
$$ 3492844 3442371 3382603 3422946 3479572 3451522 3436824 3420368 3448312 3473783 3448424 3425353
19725C425353l2246q8892L612L3914n2141j8879K6719m1037l0259j0786j4063
$$ 3425353 3393107 3304215 3307827 3341741 3289600 3270721 3297440 3256403 3226144 3215358 3201295
19714C201295k5660P094Q7762O9102M6620J3136L6020N849n075L075M4612p2893
$$ 3201295 3175635 3182729 3270491 3339593 3386213 3399349 3435369 3441218 3436143 3439218 3483830 3410937
19702C410937N308R3937P6060N0463J02321P4739L3821J7046Q5605J03498R3418
$$ 3410937 3416245 3510182 3586242 3636705 3739026 3813765 3847586 3864632 3950237 4053735 4147153
19691D147153Q8855O8184R0007J18807O6565N7822L260q38J7495N5963Q2527O6611
$$ 4147153 4236008 4304192 4394199 4513006 4579571 4637393 4640653 4639815 4657310 4713273 4795800 4862411
19679D862411N6670L2114P9884M7220M6004R2909O7128L9818J55228J79798J62684
$$ 4862411 4919081 4951195 5031079 5078299 5124303 5217212 5284340 5324158 5479386 5659184 5821868
19668E821868J93343J66671J31554K41693K00369J90384K61193K95690L52657
$$ 5821868 6015211 6181882 6313436 6555129 6755498 6945882 7207075 7502765 7855422
19659G855422L93242M65136N32288N78017O05828O46690P27395Q39874Q69828
$$ 7855422 8248664 8713800 9246088 9824105 10429933 11076623 11804018 12643892 13513720
19650A3513720R60702J026457J153587J361871J707039K235824K775528L519603
$$ 13513720 14474422 15500879 16654466 18016337 19723376 21959200 24734728 28254331
19642B8254331M579049N897008P483977Q728760Q468491O217279L292658K104303
$$ 28254331 32833380 38730388 46214365 54943125 63411616 69628895 72921553 75025856
19634G5025856L066532M959138O045856N274656L543318K910746L035605J588365
$$ 75025856 78092388 83051526 89097382 94372038 97915356 100826102 103861707 105450072
19626A05450072j942920m205074l365738r61828O62503l11848l845225p443813
$$ 105450072 103507152 99302078 95936340 94974512 95637015 95325167 91479942 84036129
19618H4036129q696679q081615o621459n174328m122887l216494k562647k096114
$$ 84036129 75339450 67257835 60636376 55462048 51339161 48122667 45560020 43463906
19610D3463906j722650j309661j147060j054846q37937p67387p59339n88199n17473
$$ 43463906 41741256 40431595 39284535 38229689 37391752 36624365 35865026 35276827 34759354
19601C4759354l99050l07876l24204l03081l37553k45334k01002k20744k34054
$$ 34759354 34360304 34052428 33728224 33425143 33087590 32842256 32641254 32420510 32186456
19592C2186456j03626r0342k0103N8358j4400J8832R7399K44749L82166N66354
$$ 32186456 32082830 31992488 31972385 32030743 32016343 32035175 32132574 32377323 32759489 33325843
19582C3325843P85299J129885J501686K068696K874878L932837N322468O912113
$$ 33325843 34111142 35241027 36742713 38811409 41686287 45619124 50941592 57853705
19574E7853705Q067667Q017616O531869M857757L988852K770680K07318k487586
$$ 57853705 65921372 73938988 80470857 85328614 89317466 92088146 92295464 89807878
19566H9807878l274274k109449N28485L706821O998183R417082R145679N477209
$$ 89807878 86533604 84424155 84952640 88659461 95657644 105074726 114220405 119697614
19558A19697614J243629o35217j877647m945533q787640j0555035r946787q209497
$$ 119697614 120941243 120306026 118428379 113482846 104695206 94140171 84193384 75983887
19550G5983887o303025m756560l433061k397552j542642p76495Q6415J087652
$$ 75983887 69680862 64924302 61491241 59093689 57551047 56774552 56860967 57948619
19542E7948619J961090K880798L531953L909502L691928K225396j008411m181101
$$ 57948619 59909709 62790507 66322460 70231962 73923890 76149286 75140875 70959774
19534G0959774n355642m869285l724373k565404j751766j192175p56083l97608
$$ 70959774 65604132 60734847 57010474 54445070 52693304 51501129 50745046 50347438
19526E0347438j8002J91012j8168o45452j422077j850678j883070j621971j302683
$$ 50347438 50329436 50520448 50502280 49856828 48434751 46584073 44701003 43079032 41776349
19517D1776349r54626o85013n82027l52691r6916M2224J91957K31718Q0360l069
$$ 41776349 40821723 40136710 39554683 39201992 39105076 39147300 39339257 39570975 39651335 39648266
19507C9648266L3207J38074L33165M66031O52450R76252J335079J795150K326556
$$ 39648266 39681473 39819547 40152712 40618743 41271193 42247445 43582524 45377674 47704230
19498D7704230K724272L139771L713376M501771N489520O798635Q618761J0997357
$$ 47704230 50428502 53568273 57281649 61783420 67272940 74071575 82690336 93687693
19490I3687693J4403419J8752775K3615135K7283322K7401547K3177366J7404058
$$ 93687693 108091112 126843887 150459022 177742344 205143891 228321257 245725315
19483B45725315J2292486P356086M214793K940578J311442P95711L569921O912927
$$ 245725315 258017801 265373887 269588680 272529258 273840700 274636411 278206332 285119259
19475B85119259O409222R28364o803197j2978780j5898784j7630932j9791740
$$ 285119259 291528481 292456845 285653648 272674868 256776084 239145152 219353412
19468B19353412k1200421k0060264j7087245j3936470j0996271q723061p038331
$$ 219353412 198152991 178092727 161005482 147069012 136072741 127349680 120311349
19461A20311349n732584m716058l785639k955419k210904j525346r61690m15207
$$ 120311349 114578765 109862707 106077068 103121649 100910745 99385399 98423709 98008502
19453I8008502P3254N42471J046300J681704K471584L419808M758747O687740
$$ 98008502 98081756 98624227 99670527 101352231 103823815 107243623 112002370 118690110
19445A18690110R318941J2130793J4065321J3065785P968651J441690k639698
$$ 118690110 128009051 140139844 154205165 167270950 175239601 176681291 174041593
19438A74041593m934980q194484j1994235j4034278j3620726j1897958r914873
$$ 174041593 169106613 160912129 148917894 134883616 121262890 109364932 99450059
19431I9450059q149092o668283n462333m496105l731932l256130l072327l182541
$$ 99450059 91300967 84632684 79170351 74674246 70942314 67686184 64613857 61431316
19423F1431316l137474k903057k550329k154801j987311j942105j870123j698850
$$ 61431316 58293842 55390785 52840456 50685655 48698344 46756239 44886116 43187266
19415D3187266j432233j272362j035399q45519p26526o72456o43179o95566p07082
$$ 43187266 41755033 40482671 39447272 38601753 37875227 37202771 36559592 35864026 35156944
19406C5156944p45142p61272q24653q85649q83917p53032p30389o41830n67078
$$ 35156944 34411802 33650530 32825877 31940228 31056311 30303279 29572890 28931060 28363982
19397B8363982m64164k28414M6168L37582P09485J308045K108724K986597L653787
$$ 28363982 27899818 27671404 27717572 28055154 28764639 30072684 32181408 35168005 38821792
19388C8821792L270664J582279j67534r83483j377679k288584l368177l783828
$$ 38821792 42092456 43674735 43507201 42523718 41146039 38857455 35489278 31705450
19380C1705450l524728k905286k353514j932721j540414j225826j001844r13521
$$ 31705450 28180722 25275436 22921922 20989201 19448787 18222961 17221117 16307596
19372A6307596p87025p03699n39958m53190l47898k61587k48674k68285j74617
$$ 16307596 15520571 14816872 14276914 13823724 13475826 13214239 12965565 12697280 12522663
19363A2522663k26749k72606k15368k60297k01888j56287j46017J1346M9770O5141
$$ 12522663 12295914 12023308 11807940 11547643 11345755 11189468 11043451 11054797 11104567 11169708
19353A1169708J14248J02095P136p6596k80372m41479m33300n27886n86031o11937
$$ 11169708 11283956 11386051 11393187 11316591 11036219 10594740 10161440 9633554 9047523 8435586
19343H435586n31495n06436m31704l64721k65136k27236k48033k66553k34651
$$ 8435586 7904091 7397655 6965951 6601230 6336094 6108858 5860825 5594272 5359621
19334E359621j52629j45741p4787n5215n7882j9710J4945n151J2308l4912l4224
$$ 5359621 5206992 5061251 4986464 4931249 4873367 4853657 4868602 4863451 4875759 4840847 4806623
19323D806623R2189J32422J92576J91174J75280J11063J01566J92893J22016P1485
$$ 4806623 4898812 5031234 5223810 5414984 5590264 5701327 5802893 5995786 6117802 6189287
19313F189287L0473j5945l4001m6752q0125n665J26751J52864J08457P5471J04816
$$ 6189287 6219760 6203815 6169814 6123062 6042937 6037272 6164023 6316887 6425344 6500815 6605631
19302F605631M5109j27059j10737j79601k69050k60227k46749k08852o0355K1238
$$ 6605631 6650740 6523681 6412944 6233343 5964293 5704066 5457317 5248465 5188110 5209348
19292E209348N9659R6610J73228J40540M9553p5623j43159j50778k67643k62154
$$ 5209348 5269007 5365617 5538845 5679385 5728938 5653315 5510156 5359378 5091735 4829581
19282D829581j58043r7567r4692o6423j7948o8611k6589O7041J86353K30564K13417
$$ 4829581 4671538 4573971 4479279 4412856 4394908 4326297 4299708 4366749 4553102 4783666 4997083
19271D997083K72312K35598J59776J28295L6990j19986k02383k55819k98904k28455
$$ 4997083 5269395 5504993 5664769 5793064 5830054 5710068 5507685 5251866 4952962 4724507
19261D724507k18722j59822r3067q8069l1971L667L6213K1667m9050J3618r729
$$ 4724507 4505785 4345963 4252896 4164827 4132856 4136523 4172736 4194403 4145353 4158971 4149242
19250D149242r8882j82941k35458k14980k34906j96856j49033j42443r1987r9705
$$ 4149242 4050360 3867419 3631961 3416981 3182075 2985219 2836186 2693743 2601756 2502051
19240B502051j03907r0312l6670j01767j01293j43030o5992k1693Q103j6724n0997
$$ 2502051 2398144 2307832 2271162 2169395 2068102 1925072 1859080 1837387 1845490 1828766 1777769
19229A777769o1916k3299K979p8388m0407O046o1953o4957q1554j4604m2514j17639
$$ 1777769 1715853 1692554 1695533 1617145 1576738 1582784 1520831 1455874 1374320 1359716 1317202 1199563
19217A199563q3461K3581l0722l4773n1309r4060L9587n0584p4175J5131k9989
$$ 1199563 1116102 1139683 1108961 1074188 1022879 928819 968406 917822 843647 858778 828789
19206H28789n9785m3220k6047k0237J5790n7472m9692O0497r664m542L1446m7682
$$ 828789 769004 725784 699737 679500 695290 637818 588126 648623 638959 634417 665863 618181
19194F18181j8262m2372k7836R656k2104m2172j1262k3129L4616j4562m4459j3520
$$ 618181 599919 557547 529711 539367 517263 475091 463829 440700 475316 460754 416295 402775
19182D02775K7823J8796K0704J5421n7897j4294K1859L402n9078j9737N6077l3905
$$ 402775 430598 449394 470098 485519 427622 413328 435187 438589 379511 359774 415851 381946
19170C81946L0231L0524j4134l3083L8762N1878m0923M19j8344q697m7277n2382
$$ 381946 412177 442701 428567 395484 434246 486124 445201 445620 427276 418579 371302 318920
19158C18920m9009J834P5335N831k4998K6412m0413K8509l7904L4272p529k851
$$ 318920 269911 271745 347080 352911 327913 354325 313912 342421 304517 338789 331260 328409
19146C28409k0999J397j0442m1336J9986J8242o6123l9313L6341Q0437N1128r763
$$ 328409 307410 308807 298365 257029 277015 295257 229134 189821 226162 306599 357727 347964
19134C47964j5282R13n6k4475k4476r348K3212K4732l3452l3404j0041K0662k8470
$$ 347964 332682 333595 333539 309064 284588 275240 298452 323184 289732 256328 246287 266949 238479
19121B38479J502K6801J6291P349r129k9132n028r758J844L2499j8414q2762q3185
$$ 238479 239981 266782 283073 290422 281293 252161 247133 237375 239219 271718 253304 170542 87357
19108H7357J3992O2607J4379N0569J9041k5015N8189k2209m5833l8220J2321M778
$$ 87357 101349 163956 178335 228904 247945 222930 281119 258910 213077 174857 187178 191956
19096A91956N6073M1300l0795N6262P5642j6810M4950N9040J3743n5267p5451
$$ 191956 248029 289329 258534 314796 390438 373628 418578 477618 491361 436094 360643
19085C60643L263N3984Q9924M5807M5782L1667M8918L2129j1036m1681j528m5467
$$ 360643 363906 417890 507814 553621 599403 631070 679988 712117 701081 659400 657872 612405
19073F12405p0687n2982j1590m7971l2927k7937j3544l5063J9353l8511l2868
$$ 612405 541718 488736 477146 429175 396248 368311 354767 319704 339057 300546 267678
19062B67678n1169O19K7450O555n6578o6432J6094j2273K0850O9900K3613m1304
$$ 267678 216509 217128 244578 251133 194555 128123 144217 131944 152794 222694 246307 205003
19050B05003j9123L7086J1964M237Q175J1554L5390M174r694k3906M4595J3621
$$ 205003 185880 222966 234930 239167 247342 258896 294286 298460 288766 264860 309455 323076
19038C23076l1017n0611N231K8281M218k9889J110K6287M5453N1498N4383j7878
$$ 323076 292059 241448 246679 274960 279178 249289 250399 276686 322139 373637 428020 410142
19026D10142l6475J5721O0998O4213R0525M0407k9473l995J0179l253j7436n0618
$$ 410142 373667 389388 450386 514599 605124 645531 616058 612063 622242 618989 601553 550935
19014E50935l2100j579K7771K1649J3535K2772M5111l7752l9905l7612k2508j4632
$$ 550935 518835 517256 545027 566676 580211 602983 648094 610342 570437 532825 510317 495685
19002D95685J7246n5688j4470j7432O0159m259q0610q6662J409n0178P956P903
$$ 495685 512931 457243 442773 425341 485500 481241 400631 313969 315378 265200 273156 281059
18990B81059O1236L2907j3187n6641k6708M4276K9731p950l706M6739M7150K0585
$$ 281059 342295 375202 362015 305374 278666 322942 352673 344723 341017 387756 434906 455491
18978D55491K0823L9651M8559N7015K915R243n784n3739j613n54j2795N326n0
$$ 455491 476314 515965 564524 621539 624454 633697 627913 574174 572561 572007 559212 564538 564488
18965E64488J5121L7772m2041r260M3566P3530O7926Q177k6600J4329Q483L2629
$$ 564488 579609 617381 575340 566080 609646 683176 751102 759279 732679 747008 755491 788120
18953G88120j7757r1120L1874J4156l4326o5637q4463n9805k9576q5723K1596
$$ 788120 770363 679243 711117 725273 690947 625310 540847 481042 451466 365743 387339
18942C87339j1019j0624k2188q0282q256M3475Q747L5112K7528K0698n4466p863
$$ 387339 376320 365696 343508 263226 254970 298445 307192 342304 369832 390530 336064 328201
18930C28201p804l0673P3466l173l5347N5852O3831N1558N1389M6041J4215L9237
$$ 328201 320397 289724 363190 360017 324670 380522 444353 495911 547300 593341 607556 646793
18918F46793J3253k4899J5677l926k391n9040K1409J559O5793N9744N9711L1499
$$ 646793 660046 635147 650824 646898 644507 585467 606876 608435 674228 733972 793683 825182
18906H25182Q5787J05219L6787J517k3188l8709J1441p268l2449p1840j07759
$$ 825182 910969 1016188 1052975 1054492 1031304 992595 1004036 996768 964319 892479 784720
18895G84720n864p2907r2330n5857o3573p455J2354k3665m9212m7493N971p774
$$ 784720 778856 705949 613619 557762 494189 486734 499088 475423 426211 378718 384689 376915
18883C76915P645k334L3815L6957l5945m3968l6441n958L553K087M771k2333q871
$$ 376915 384560 382226 416041 452998 417053 373085 336644 330686 334239 336326 341097 318764 309893
18870C09893J3762m5272L427J8019O6806J4015l3501K8l3066j2600K7719n8199
$$ 309893 323655 278383 281810 299829 366635 380650 347149 347177 314111 301511 329230 271031
18858B71031j3193K0341M6945K8163P2964N7401M5125K1070m3898l7386o9073
$$ 271031 257838 278179 325124 353287 426251 483652 528777 549847 505949 468563 399490
18847C99490k9419m7411n0738j9293L747o1748n4247k3529m741n6427J9584M3708
$$ 399490 370071 322660 271922 252629 256376 194628 140381 116852 112111 55684 75268 118976
18835A18976L737L4064j5578l3525o7584j229j4394n798j3010o917n2989L6737
$$ 118976 122713 156777 141199 107674 40090 38861 24467 18669 5659 -1258 -54247 -17510
18823a7510J00381R6516k5870j9951m4589r6321k7808m4925j0433M4047K2833
$$ -17510 82871 179387 153517 133566 88977 -7344 -35152 -80077 -90510 -46463 -23630
18812b3630L4541M2560Q558j5472j527L531q461k2666l0386L470K4058K8743o5848
$$ -23630 10911 53471 62029 46557 45030 48561 40100 17434 -12952 -9482 14576 43319 -22529
18799b2529n720K6973r187L6564j4191J6714m898r604N2187K6972k707j053o6110
$$ -22529 -28249 -1276 -10463 26101 11910 28624 23726 14122 66309 93281 90574 89521 23411
18786B3411j4053N9202J9454p3082o1622L8502L9561M289O8111L0551m8876j12450
$$ 23411 9358 68560 88014 14932 -46690 -8188 31373 35662 103773 134324 85448 -27002
18774b7002m663K1918J2950l143L9271J6986l2007m8520J1653L2366P4817l258
$$ -27002 -31665 -9747 3203 60 39331 56317 24310 -24210 -12557 19809 94626 91368
18762I1368k4291m5113n5914R2663O1130k3724J102j3513j7050k7199K3402J8060
$$ 91368 67077 21964 -33950 58713 119843 96119 97221 83708 66658 39459 62861 80921
18750H0921r427Q375k6746P449K3788K562J5030M0261P18m3044J5809j6846n311
$$ 80921 71494 79869 53123 60572 84360 86922 101952 142213 142931 99887 115696 98850 93539
18737I3539l3288J5272N7270M5263K1804k3615l8921J4834K2895j792m0915J190
$$ 93539 60251 75523 132793 178056 199860 176245 137324 152158 175053 173261 132346 133536
18725A33536K5317L3959m702m2310j9151m384n686k1610M2377K9893j8870N2378
$$ 133536 158853 192812 188110 145800 126649 122265 116579 94969 137346 167239 148369 200747
18713B00747O860o713M3756J00055O5655j8993K2999K2396J22400R9715J08891
$$ 200747 207607 200894 244650 344705 410360 391367 414366 436762 559162 658877 767768
18702G67768J09189J24800J13737J02071J54895K16341J26378P9201N5432L7820
$$ 767768 876957 1001757 1115494 1217565 1372460 1588801 1715179 1794380 1849812 1887632
18692A887632J2390j8950o3792j14512j51644k01131j79133r3240r1076r1706
$$ 1887632 1900022 1881072 1817280 1702768 1551124 1349993 1170860 1077620 986544 894838
18682H94838l8866m8774m6992q3057J8165J1648j12642l8480j8392j7255j5155
$$ 894838 855972 807198 760206 677149 695314 706962 594320 555840 537448 520193 505038
18671E05038M2612J4428k9678K7966l9761N8599O1818K2073J3605M7496Q8409
$$ 505038 547650 562078 532400 560366 520605 579204 641022 663095 676700 724196 812605
18660H12605J30561j025N434Q7679J68187J39236J46731J39835J77198J69715
$$ 812605 943166 942141 947575 1035254 1203441 1342677 1489408 1629243 1806441 1976156
18650A976156J41043J83599K13716J38630J72940J07274N7165Q0625j2202p8878
$$ 1976156 2117199 2300798 2514514 2653144 2826084 2933358 2990523 3071148 3058946 2980068
18640B980068j20619j26949j28462k01939k28322k08626j46324p0553j76833j29511
$$ 2980068 2859449 2732500 2604038 2402099 2173777 1965151 1818827 1748274 1571441 1441930
18630A441930r1535k9944m3773r2051m7413K4723n4647m9366r63J0197M7596K1170
$$ 1441930 1350395 1320451 1276678 1184627 1137214 1161937 1107290 1057924 1056961 1067158 1114754 1135924
18618A135924Q156j5792O162o382m5230j1749J2177m3445o3869l7335r411q0971
$$ 1135924 1144080 1128288 1134450 1128068 1082838 1071089 1083266 1039821 975952 938617 929206 848235
18606H48235k2328J8576J4666J9083K6783j7074M7531P3214M3429J9167P5474
$$ 848235 825907 844483 859149 878232 905015 887941 935472 1008686 1052115 1071282 1146756
18595A146756J42788N7192J43318J16604J4946m1523j448j4429l557l7409n4524
$$ 1146756 1289544 1346736 1490054 1606658 1621604 1580081 1578633 1564204 1560647 1523238 1468714
18584A468714j33541r7894j19306r0771q4539p3966r1709j06077n7942J8262r0922
$$ 1468714 1335173 1237279 1117973 1027202 942663 868697 776988 670911 612969 631231 540309
18573E40309q5790J4330q600o5653k0634K6288n5507l2990R770L4266m2152n4101
$$ 540309 454519 468849 460249 394596 373962 400250 344743 311753 321523 355789 313637 259536
18561B59536J4392p155N5802n5883o1269P32J5873K9204j9795j890n840l7061
$$ 259536 273928 266773 322575 266692 205423 206155 222028 251232 231437 229547 223707 186646
18549A86646l3979M9711k3069k6336j9779j2968m9009k924K4699j9588J0964J6201
$$ 186646 152667 202378 179309 152973 133194 120226 71217 68293 92992 73404 84368 100569
18537A00569m8240k8208l7465O658j1146M2746J6736K429r231k2385o1941R889
$$ 100569 52329 24121 -13344 -6686 -17832 24914 41650 44079 34848 12463 -49478 -39589
18525c9589J6490l0388k4249k755N96J2973j1425O350J5231P269L7930j7763l983
$$ -39589 -23099 -53487 -77736 -80491 -79895 -66922 -78347 -71997 -56766 -49497 -11567 -29330 -33313
18512c3313j7280N9317n014o277K8557P7514Q677p3135j03210k9785M0056j7166
$$ -33313 -50593 8724 3710 -2567 25990 103504 112181 39046 -64164 -93949 -53893 -71059
18500g1059l547m957L285L6277k6210J9739L4650o718L1146R334k1726M725n3430
$$ -71059 -74606 -79563 -76278 -40001 -66211 -46472 -11822 -18540 12606 21940 214 4939 -48491
18487d8491m8585l4768m4106L5364L2585J5800L9937J02668L2859K0701l6073
$$ -48491 -97076 -131844 -175950 -140586 -108001 -92201 -52264 50404 83263 103964 67891
18476F7891l5111n0846q436l6311n4545J5906M5675O9435K5540o80O900Q744m2209
$$ 67891 32780 -18066 -26502 -62813 -117358 -101452 -55777 13658 39198 38518 45418 54162 11953
18463A1953j3400l063r0531j990K0190J0581J7819R30m2636k4451L3421k7425
$$ 11953 -1447 -4510 -95041 -97031 -76841 -66260 -48441 -47511 -90147 -114598 -81177 -108602
18451a08602J6756J619M6475J7305O285l0808J887J2412q079j890J2852o151L7501
$$ -108602 -91846 -90227 -43752 -26447 -20162 -50970 -49083 -36671 -44750 -46640 -33788 -39939 -2438
18438b438L681o1320J1046M3703K8642M2957P861j5630l4385J0391n889l945L3531
$$ -2438 1243 -60077 -49031 -5328 23314 66271 74132 58502 24117 34508 28619 24674 58205
18425E8205j1332L3624J0406M9747N7133P2144R1696P0523P6141R5751J13233
$$ 58205 46873 80497 90903 140650 197783 269927 361623 432146 508287 604038 717271
18414G17271L3345k7080o5371j56269j13094m4114m5381o7765q2751J9316P0277
$$ 717271 750616 723536 658165 501896 388802 344688 299307 231542 148791 168107 238384
18403B38384N902o5023l1510k8357k607m7299l901L801k3938K3682L2367p534
$$ 238384 244286 179263 147753 119396 116789 69490 65589 69390 45452 69134 101501 93967
18391I3967J4286K7549N30p8328m5058m5218O414J9892n668M2984m964Q670J6883
$$ 93967 108253 135802 136332 58004 12946 -32272 -25858 -5966 -11634 31350 26386 35056 51939
18378E1939n1117k3748k1623M5501L8524k7352L3090j414q3870j8657J4762M649
$$ 51939 822 -22926 -44549 952 39476 12124 45214 43800 -40070 -58727 -43965 -39316
18366c9316K2161J7634l8075m6057l5242O2302O4706k2379l5281L2000K5507K0082
$$ -39316 -17155 479 -37596 -83653 -118895 -56593 8113 -14266 -49547 -17547 7960 28042
18354B8042J0979o34k2330k8776n5718K7597J8811K178J4552m4618M741M104k4055
$$ 28042 39021 38387 16057 -12719 -68437 -40840 -22029 -19851 -5299 -49917 -45176 -41072 -65127
18341f5127j383m300j957K2855K061P152J7801K6477N5576P381R661M537L8249
$$ -65127 -66510 -70810 -72767 -49912 -47851 -40699 -22898 3579 59155 66536 76197 80734 118983
18328A18983k9484m8057m8537K737j9652P295m9791n64j2824O0120J5815p3674
$$ 118983 89499 41442 -7095 -4358 -24010 -16715 -66506 -67070 -79894 -19774 -3959 -77633
18316g7633J4442K5714J3506k3419J9029J8921M301J8495j5167N383k9286n9169
$$ -77633 -63191 -37477 -23971 -47390 -28361 -9440 -5139 13356 -1811 3572 -25714 -84883
18304h4883l3392j7834j3935j617K1744N6408J5254K8101L9073p78p7244m6837
$$ -84883 -118275 -136109 -150044 -151661 -129917 -73509 -58255 -30154 8919 8141 -69103 -115940
18292a15940J2321M9927j5292o2040K3789J7768m1582j5232O765O9222M9428p447
$$ -115940 -103619 -53692 -68984 -131024 -107235 -89467 -131049 -146281 -139516 -70294 -20866 -28313
18280b8313o7108q746N0299K4906p679k829m071J1437j1435K0245K0065l245K7819
$$ -28313 -95421 -104167 -53868 -28962 -36641 -39470 -43541 -32104 -43539 -23294 -3229 -6474 21345
18267B1345l2912l3883j7543l0371J1911j2159j3310K3076N9358K6884n3616K55
$$ 21345 -11567 -45450 -62993 -93364 -81453 -93612 -106922 -83846 -24488 2396 -51220 -50965
18255e0965K1376j8502Q960k5910j3409R5008J9595K7685R856j0101r25M0241
$$ -50965 -29589 -48091 -39131 -65041 -78450 16558 36153 63838 73694 63593 62668 102909
18243A02909l3087k0636o5304j9109K2068N3595J1963q731m0549K1923J0242j1459
$$ 102909 69822 49186 -16118 -35227 -13159 40436 52399 43668 3119 25042 35284 23825
18231B3825J2554l1258p382M289j3109n9176n803q545l623P950P0666K0083J2393
$$ 23825 36379 5121 -2261 2028 -11081 -70257 -76060 -84605 -88228 -80278 -9612 10471 22864
18218B2864p5770k0450O3540K5549l4101l263K6553L8286j7844l3991q3501L7843
$$ 22864 -52906 -73356 -9816 15733 -18368 -21631 4922 43208 25364 -8627 -92128 -54285
18206e4285R441L9873P600k5746p805k7143j7519K7189Q090j1811o59k3841K749
$$ -54285 -44844 -4971 2629 -23117 -30922 -58065 -75584 -48395 -40305 -52116 -52775 -76616 -73867
18193g3867K8299M7323L173m5229M352K0531j8819l7882k0648L584J203j0171
$$ -73867 -45568 1755 4928 -40301 -35949 -15418 -34237 -72119 -92767 -89183 -87980 -98151
18181i8151L2165N0099M924M507O1277J4606j8316K6056j3753l2267K725J6976
$$ -98151 -65986 -15887 -10963 -6456 54821 69427 51111 77167 63414 31147 33872 50848
18169E0848k1872k3713J2997k8158m6376K0604j542n4871J0840Q0212R62j380
$$ 50848 28976 5263 18260 -9898 -56274 -35670 -37212 -92083 -81243 -1031 -69 -1449
18157a449P199k87k5053K0995K094j5574O4905J3619l1978n6017j2509J0565L3328
$$ -1449 5750 5463 -19590 1405 3499 -12075 52830 66449 34471 -21546 -34055 -23490 9838
18144I838l6038k5605J6771L289J9589M2934k8352R73j9944J3931l7452m2668
$$ 9838 -26200 -51805 -35034 -31745 -12156 30778 2426 3399 -16545 -2614 -40066 -82734
18132h2734L2468M3897j4037j2469l5887K3015N8200j2920l2360p507j381J5410
$$ -82734 -50266 -6369 -20406 -32875 -68762 -45747 12453 -467 -32827 -40334 -41715 -26305
18120b6305j2854M0016L3632n731L2824l4570j4024m1888J9965j1904N5417O0269
$$ -26305 -39159 857 34489 28758 61582 27012 12988 -28900 -8935 -20839 34578 94847
18108I4847l9726m2446J9675q636l3184n465l585M4689L7385j1551k7760k4509
$$ 94847 55121 12675 32350 23714 -9470 -14935 -18520 26169 63554 52003 24243 -266
18096b66k2383K0316K8628J5378j0282J2617L8188l4215k4026m1247P529k5093
$$ -266 -22649 -2333 26295 41673 31391 44008 82196 47981 23955 -17292 -9763 -34856
18084c4856n1495j5622N8921L7949l094K6108l1225k0481Q346P8117J2531n8258
$$ -34856 -86351 -101973 -43052 -5103 -8197 17911 -13314 -33795 -25449 52668 65199 6941
18072F941k5102N8196n3204l574J6648l4603K2867k8718j9258j6391L0892K5020
$$ 6941 -18161 40035 -13169 -16743 -95 -34698 -11831 -40549 -59807 -76198 -45306 -20286
18060b0286k1176l5579r249O3485N3088j0198p672r848Q292L621N880K6312n2373
$$ -20286 -41462 -77041 -86290 -22805 30283 20085 12413 2565 10857 14478 20358 46670 -5703
18047e703m1400O573Q910K2906M6189l1200k6746N5574N4552j838k0443n1562
$$ -5703 -47103 -40530 -31620 -8714 37475 6275 -20471 35103 89655 87817 67374 15812
18035A5812r064k2772k4107Q139k3206j3293P102N2448k3824P823j1722O450K6774
$$ 15812 6748 -16024 -40131 -31992 -55198 -68491 -61389 -8941 -32765 -24942 -36664 -30214 -3440
18022c440M3911O3621l9691k2797o986l1895J6764j7399K5920k2288K0081L5125
$$ -3440 40471 104092 64401 41604 34618 2723 19487 2088 28008 5720 25801 60926
18010F0926J7460l4130m5238l9531j4664l5589l933K7122p64k6924P4680M1549
$$ 60926 78386 44256 -982 -40513 -55177 -90766 -94699 -67577 -68341 -95265 -20585 20964
17998B0964J2805k4038l5925O972N1903k1225n5465k8119N229Q353K3821R206
$$ 20964 33769 9731 -26194 -19222 32681 11456 -44009 -72128 -66899 -58546 -34725 -25519
17986b5519n9856m0385N9686q413M6101k9031J2449O6876j2975m6662l172k6779
$$ -25519 -85375 -125760 -66074 -74487 -28386 -57417 -44968 21908 8933 -37729 -40901 -67680
17974f7680l2747P5626J8243K878K1501k542J1460m0589n7782M7124M1303K0927
$$ -67680 -100427 -24801 -6558 -3680 17821 15279 26739 -13850 -71632 -24508 16795 37722
17962C7722J5297k0491r2130K3200K3272J8791K0902j6811k5601R168j2834L012
$$ 37722 53019 32528 -59602 -36402 -13130 5661 26563 9752 -15849 -6681 -19515 -16503
17950a6503j2990L5306L0205p731J0053L3317j3224R34K493o6171j6192m6900
$$ -16503 -29493 5813 36018 28287 38340 71657 58433 59367 61860 -4311 -20503 -67403
17938f7403n0885J4687L9301O743L6974O8794o1470l0007N455Q756L2786M3665
$$ -67403 -118288 -103601 -64300 -57557 -20583 48211 -13259 -43266 -37811 -29055 3731 47396
17926D7396o7519n9967k8994k6081R1885O1517J841J6030L6317P943L3631k6789
$$ 47396 -20123 -80090 -109084 -135165 -43280 18237 20078 36108 72425 80368 113999 87210
17914H7210m2415o180m3269k7075N7671r179j5131J2386m0789o2613L6860L1664
$$ 87210 44795 38615 -4654 -31729 25942 16763 1632 14018 -26771 -89384 -52524 -20860
17902b0860m4495J1178j8519J0863m4374j609K6280M8846P4601K7221L5725r750
$$ -20860 -65355 -54177 -72696 -61833 -106207 -107816 -81536 -32690 41911 69132 104857 95107
17890I5107K999J7302K7468K4191m9967k1235P8695K3041q9817k8955J2999k1272
$$ 95107 98106 115408 142876 167067 117100 95865 174560 197601 107784 78829 91828 70556
17878G0556K2606k3569q509K6245l8583Q551N6557L0268m5994K207J3596q467
$$ 70556 93162 69593 61084 87329 48746 57297 113854 144122 98128 100335 113931 105464
17866A05464Q994p0970k170r929L9238J8608L5403j8883q4395j5121K0684K8260
$$ 105464 114458 43488 41318 31389 70627 89235 124638 105755 21360 6239 26923 55183
17854E5183M5340l4374q2823j7653J431K0048j8508k2344K444p937J9309M9842
$$ 55183 100523 66149 -16674 -34327 -32896 -12848 -31356 -53700 -51256 -59193 -39884 9958
17842I958J2093k7611l3047M7630r824p844P579k3472R156K7188L7562q4L9548
$$ 9958 22051 -5560 -38607 9023 -801 -8645 -1066 -24538 -15382 11806 49368 49284 88832
17829H8832j9047L0455M022j4384j5967l3053J8326j3471K1396m9834o7320j9533
$$ 88832 69785 100240 104262 89878 73911 40858 59184 45713 67109 17275 -50045 -69578
17817f9578P4j7795K1989K7124J9451p300k357q026k1056j7417N2095j6385k4091
$$ -69578 -69504 -87299 -65310 -38186 -18735 -26035 -28392 -36418 -57474 -74891 -22796 -39181 -63272
17804f3272O7286o5278m7287L7826j3060L3965O6058O0992m5251q1928R668M60
$$ -63272 4014 -61264 -108551 -70725 -83785 -49820 16238 77230 31979 -49949 -40281 -39821
17792c9821n7248j9300L2316M8253M8007j8089k3166L4179J2702P934J5615l118
$$ -39821 -97069 -116369 -84053 -35800 12207 -5882 -29048 5131 17833 25767 41382 38264
17780C8264K0901j1612m2535k8608L3715M3180K4200j7153o6090k2370p159j0519
$$ 38264 59165 47553 5018 -23590 10125 53305 77505 60352 -5738 -28108 -35267 -45786
17768d5786j3650L3020L73l0427o161j9510M5329M4266O9403k0437n6777k6509
$$ -45786 -59436 -26416 -26043 -56470 -62631 -82141 -36812 7454 76857 56420 -357 -26866
17756b6866n2643k7549L7809J3626L729j338l4320L3074P233q526q83N1551L6599
$$ -26866 -79509 -107058 -69249 -55623 -51894 -53232 -87552 -54478 -47245 -55771 -56654 -5103 31496
17743C1496j1569N629q0850k4729M5275P125K0684J5342L9115J3017j089p7145
$$ 31496 19927 25556 -55294 -80023 -34748 -27623 -6939 8403 47518 60535 59446 -17699
17731a7699n7322J0924k7742K6645J7729l5950K1552K7551O105J1798L9806J3875
$$ -17699 -75021 -64097 -91839 -65194 -47465 -83415 -61863 -34312 -28207 -16409 23397 37272
17719C7272m4282p3499k5537O0146N5506j0733K7751k8034m3662L1849J1365j8390
$$ 37272 -7010 -80509 -106046 -45900 9606 -1127 26624 -1410 -45072 -13223 -1858 -20248
17707b0248l5395p2202K1717P5791O4012r122q0433l3467l2589L0726l2485K510
$$ -20248 -55643 -127845 -106128 -30337 33675 24553 -55880 -89347 -121936 -91210 -123695 -121185
17695a21185p342l3125J6973J1664N1310J8184m2515M0348K5989k9302M055N7263
$$ -121185 -128527 -161652 -144679 -133015 -81705 -63521 -106036 -65688 -39699 -69001 -64946 -7683
17683g683k805l6246m5842K734o570k5708j6270l1101R3800R2203J4413m5769
$$ -7683 -10488 -46734 -92576 -89842 -96412 -122120 -138390 -169491 -75691 16512 30925 -14844
17671a4844q1141n2898M5069N7345j465M166O004n558j7818r485J246M2556k204
$$ -14844 -95985 -148883 -103814 -46469 -47934 -43768 -37764 -43322 -61140 -70625 -69379 -26823 -29027
17658b9027K642L089L2804J4728r416k1283m0448k311M6860j8895K102l329o3436
$$ -29027 -26385 -23296 9508 24236 14820 -6463 -46911 -49222 -2362 -21257 -19155 -22484 -85920
17645h5920k1200r14k2336M431J9323N1191l62R624m2791m1011M4990J6917J0579
$$ -85920 -107120 -108034 -130370 -125939 -106616 -55425 -55787 -46163 -88954 -129965 -84975 -68058 -57479
17632e7479n2821k6480q71N964R0364M4729J4734P891m0578K0298O9499p712m3534
$$ -57479 -110300 -136780 -137651 -131687 -41323 3406 18140 26031 -14547 5751 75250 67538 24004
17619B4004J4027N6445M886l946m3165j6206j8612K6812m6733k4748K6636K548
$$ 24004 38031 94476 99362 95416 52251 36045 17433 44245 -2488 -27236 -600 1948
17607A948j4942j9417m9889j9381J9075M2718J2596p844M1809L0269k4527m4606
$$ 1948 -12994 -32411 -82300 -101681 -82606 -39888 -27292 -35136 6673 36942 12415 -32191
17595c2191n357J9949l3452M5205L4357l4836N0709k8797r336K2510Q315J6171
$$ -32191 -37548 -17599 -51051 -5846 28511 -6325 44384 15587 6251 28761 37076 53247
17583E3247Q628J8716J2784O3768J1726j2850m40k5061R580l3325Q923j5812j9244
$$ 53247 61875 80591 93375 157143 168869 156019 155579 130518 140098 106773 115696 99884 80640
17570H0640j9578M4697j4080j164m7918K686m64m0400k8737O374o624M051o7694
$$ 80640 61062 105759 91679 90515 42597 45283 44819 4419 -24318 -17944 -24568 -20517 -88211
17557h8211j8290K1754o790J3111J3015L4761O875O1130K5465l9547p6279M75
$$ -88211 -106501 -84747 -91537 -78426 -65411 -30650 -23775 37355 62820 23273 -53006 -52531
17545e2531j3929M9271L1570l650k691J5503J2879k0267l0497L02j04l7781L7851
$$ -52531 -66460 -17189 14381 10731 8040 23543 36422 16155 -14342 -14040 -14144 -51925 -14074
17532a4074N0847O194J1770j6331J1074R610k6625m8705j516p811m2789k3392
$$ -14074 36773 42967 54737 38406 49480 59090 32465 -16240 -17756 -25567 -68356 -91748
17520i1748Q77N9701M4848n8647m2599K4433k2350K5028j5668k6192K4091p54
$$ -91748 -90871 -31170 13678 -44969 -87568 -63135 -85485 -60457 -76125 -102317 -78226 -78980
17508g8980J2335k179k3594K9024L7413K7749n6139k0909J5920K47Q10J4351K793
$$ -78980 -66645 -68824 -92418 -63394 -25981 1768 -54371 -75280 -59360 -59113 -58303 -43952 -41159
17495d1159J4239n3952K3043J1157N043l7902N5285L5834m4235n3275N5426p829
$$ -41159 -26920 -80872 -57829 -46672 -41629 -79531 -24246 11588 -32647 -85922 -30496 -38325
17483c8325n3814k080q903r389Q3011N0662j3305r086p799J2225l448n3469o0449
$$ -38325 -92139 -94219 -103122 -112511 -29500 21162 7857 -1229 -9028 3197 -251 -53720 -114169
17470a14169O3974N0448M738j4404j9818j0323j0285O3899K4780k1897l5949l7496
$$ -114169 -50195 253 4991 -9413 -29231 -39554 -49839 14060 38840 16943 -19006 -56502
17458e6502O40L0708m8653J4863J5029k4486M522j5358k9720M783K2713K9194
$$ -56502 -55862 -25154 -73807 -58944 -43915 -68401 -63879 -79237 -108957 -104174 -81461 -52267
17446e2267K1248l4815j8282n2796K8776N260N9756l1443m0013R1728k4456m8757
$$ -52267 -31019 -65834 -84116 -136912 -108136 -102876 -43120 -74563 -114576 -22848 -47304 -96061
17434i6061j2238k5128o7696J3026R1954J742K7889k1820K3991J5573K3665J214
$$ -96061 -108299 -133427 -201123 -188097 -96143 -94401 -66512 -88332 -64341 -48768 -25103 -23889
17422b3889K0548O259m0213m3364L8673N9626l2225k1299q0950m81O9928N9732
$$ -23889 -3341 2918 -37295 -80659 -41986 17640 -14585 -35884 -116834 -117315 -47387 12345
17410A2345J5875j6691n9521j9401j3649L0529K351m1383J7061R0421J9808j4350
$$ 12345 28220 11529 -47992 -67393 -81042 -50513 -48162 -89545 -72484 17937 37745 23395
17398B3395L3536k5748j4120j4862k6478L0356K0996r3647n9093J3720J597k0793
$$ 23395 56931 31183 17063 2201 -24277 6079 27075 -66572 -125665 -111945 -110348 -131141
17386a31141l3754j7744Q848K013L6018L5147J064J5464K5523J4229L4346J1880
$$ -131141 -164895 -182639 -173791 -171778 -135760 -100613 -99549 -84085 -58562 -44333 -9987 1893
17374A893O032n7795j9915K6077K9105L9125m1280o680j0604J788l2789l5630
$$ 1893 7925 -49870 -69785 -43708 -14603 24522 -16758 -23438 -34042 -32254 -65043 -100673
17362a00673J2475J2791K721j6946J4745J3236k4115k0972J8495J8943M248M6417
$$ -100673 -88198 -75407 -72686 -89632 -74887 -61651 -85766 -106738 -88243 -69300 -65052 -18635
17350a8635m7952n4235J9747P0161M0544J0966o9552k2858N0965p578j4133L733
$$ -18635 -66587 -120822 -101075 -30914 9630 20596 -48956 -71814 -20849 -28427 -42560 -38827
17338c8827J7036l7434k0555p0786j5014N0358j0257K8997j8454k7147K6245n05
$$ -38827 -21791 -59225 -79780 -150566 -165580 -115222 -125479 -96482 -114936 -142083 -115838 -116343
17326a16343n1193k2473K9904K6349L704l484Q2715p281m0957k0298M7817K7897
$$ -116343 -167536 -190009 -160105 -133756 -130052 -133536 -50821 -58102 -99059 -119357 -71540 -43643
17314d3643j0945p0837J2692l2723K2688K6895M1780j9821j6806q046m3684P901
$$ -43643 -54588 -125425 -112733 -145456 -122768 -95873 -54093 -73914 -90720 -98766 -142450 -134549
17302a34549L3557k8740J1146L622K3908j3187M173K2992L3316O506m9863j4258
$$ -134549 -100992 -129732 -118586 -114964 -91056 -104243 -100070 -77078 -43762 -37256 -87119 -101377
17290a01377n8612J0738L5019O8369J9221O236L0046K8962n1449m4063j4417m1963
$$ -101377 -159989 -149251 -114232 -45863 -26642 -20406 9640 38602 -12847 -56910 -71327 -113290
17278a13290k9753n1192K16M1530J588J239K5702j148k7553K7428L5252J0217
$$ -113290 -143043 -194235 -194019 -152489 -150901 -149662 -123960 -125108 -152661 -125233 -89981 -79764
17266g9764K9615m7890n2483L026J8886p728K8227j3369k5464m3849N7945j4869
$$ -79764 -50149 -98039 -150522 -147496 -128610 -136338 -108111 -121480 -146944 -190793 -132848 -147717
17254a47717J1667L9384M347k3077j9487N2426K6591j3541l3769K6500Q65m7691
$$ -147717 -136050 -96666 -92319 -115396 -134883 -82457 -55866 -69407 -103176 -76676 -75811 -123502
17242a23502N807N4244L093O358N8030l6158q0662K829k5679k1500o6551L629
$$ -123502 -117695 -63451 -60358 -54000 4030 -32128 -112790 -109961 -135640 -157140 -223691 -220062
17230b20062L1225M7490M4566N5573R216K028m1321M3457R759r197q6498m650
$$ -220062 -188837 -141347 -96781 -41208 -31992 -29964 -71285 -27828 -18069 -27266 -113764 -118414
17218a18414p288M6582J2574q942K9622j2798k0427K6795j0703l5039N3754L736
$$ -118414 -125702 -79120 -66546 -75488 -45866 -58664 -79091 -52296 -62999 -98038 -44284 -40548
17206d0548j4436p3993k0329r845j5795J8238K5519j7185J0922k4493n391O0587
$$ -40548 -54984 -128977 -149306 -159151 -174946 -156708 -131189 -148374 -137452 -161945 -167336 -106749
17194a06749L1775j2320L3829P4341Q194l0532j8286m961K6609K6415k2615l0593
$$ -106749 -74974 -87294 -53465 20876 29070 -1462 -19748 -24709 1900 28315 5700 -24893
17182b4893o0543l5292K9148j8120K2613K7200r784j3314j5664k939k0993O6308
$$ -24893 -85436 -120728 -91580 -109700 -87087 -59887 -69671 -82985 -98649 -101588 -122581 -56273
17170e6273Q6382l2440p0598l4928M0780L3182j9096m225k4680m8518J221K7923
$$ -56273 30109 -2331 -72929 -107857 -67077 -33895 -52991 -57216 -81896 -130414 -129193 -101270
17158a01270M0329N2716l4204o9380K0273J773M3269L6172o661n7206p7585j8946
$$ -101270 -60941 -8225 -42429 -111809 -91536 -89763 -46494 -10322 -16983 -74189 -151774 -170720
17146a70720j2848l637J3718K9356K0472K5654j2056k7176k7862P093n058L9526
$$ -170720 -183568 -187205 -173487 -144131 -123659 -98005 -110061 -137237 -165099 -158006 -163064 -123538
17134a23538O7766J5167m7870K4710K1790k2238O9328L5096k2797J8568J4413
$$ -123538 -55772 -40605 -88475 -63765 -41975 -64213 5115 40211 17414 35982 50395
17123E0395k5538l4837J5104O316o2731k5859K3355k7631J9930j4059j6491l4600
$$ 50395 24857 -9980 5124 11440 -51291 -77150 -53795 -81426 -61496 -75555 -92046 -126646
17111a26646n913M4545l4827l6700m807N0938M2679j00721n2367j8297J0131j9845
$$ -126646 -132559 -88014 -122841 -159541 -164348 -113410 -70731 -171452 -223819 -242116 -231985 -251830
17099b51830L307J26074J07124k8813J2581N7488q851R144k3999o4377l773k3752
$$ -251830 -248523 -122449 -15325 -44138 -31557 25931 17080 26224 2225 -62152 -65925 -89677
17087h9677J8753N0499J7294K0116k9460o6816n593P00L6021l8793P489J6615
$$ -89677 -70924 -20425 -3131 16985 -12475 -79291 -84884 -84184 -48163 -86956 -79467 -62852
17075f2852N909o1709J3812K5709J0851K2669J9532j2121m6896j962o754L8049
$$ -62852 -56943 -118652 -104840 -79131 -68280 -45611 -26079 -38200 -85096 -87058 -93812 -55763
17063e5763M9268l4976M0209Q875m9803k035L9544o09o2221j0609K7941M3016
$$ -55763 -6495 -41471 -1262 7613 -42190 -44225 -4681 -5290 -67511 -78120 -50179 -7163
17051g163J3072J2561m8635k7720r410j0303K903l110L3431J3591o587m2655J8217
$$ -7163 5909 18470 -30165 -57885 -67295 -77598 -74695 -77805 -44374 -30783 -37370 -80025 -61808
17038f1808K4269j8930o0209k5796N8415O2840r25K1880K706J2056o5344m6823
$$ -61808 -37539 -56469 -116678 -142474 -84059 -21219 -22144 -264 2442 14498 -50846 -97669
17026i7669K1705j5521k6595m6814L0157J9828Q347l4654p032k0945L5476Q0557
$$ -97669 -75964 -91485 -118080 -164894 -134737 -114909 -106562 -141216 -148248 -169193 -133717 -53160
17014e3160P926m8637p437M2485r916J9114P0428n8184o2817k399L4032J4558
$$ -53160 -45234 -93871 -101308 -58823 -68739 -49625 20803 -37381 -100198 -102597 -68565 -54007
17002e4007l2863p6627j07103K3991O5621j4078P0407Q2085K7272L1809n2420
$$ -54007 -86870 -163497 -270600 -246609 -180988 -195066 -124659 -42574 -15302 16507 -35913
16991c5913L1492l2028k6696j279K1807j6764P580P063J9831N680m1972l6722
$$ -35913 -4421 -36449 -63145 -64424 -42617 -59381 -51801 -44738 -24907 -19227 -61199 -97921
16979i7921Q668k5235L5406O0475k231m105j417q9153m4617l5464o521L0847K5516
$$ -97921 -89253 -114488 -79082 -18607 -20838 -24943 -26360 -115513 -160130 -195594 -202115 -171268 -145752
16966a45752m3858N8127L8216j4307O7627k7053m5120K0853K3722m5786j9155
$$ -145752 -189610 -131483 -93267 -107574 -39947 -67000 -112120 -91267 -67545 -113331 -132486
16955a32486J4142M6128P5654O6944n7128p5188m133o1257k7930J5909j0853J711
$$ -132486 -118344 -72216 3438 70382 13254 -61934 -66067 -127324 -155254 -139345 -150198 -148487
16943a48487J3874J1429l6554l6628K4406K4252O9636L0231r8878j6223L1540
$$ -148487 -134613 -123184 -159738 -196366 -171960 -147708 -78072 -47841 -146719 -162942 -131402
16932a31402N0968O5762j6489j7042j7926O2571M8958p63j08287N33K9163n3520
$$ -131402 -80434 -14672 -31161 -48203 -66129 -3558 45400 44637 -63650 -63117 -33954 -87474
16920h7474k3828K1848J4097L482j2489K2048J1256j0919M8857N0437k2599j4040
$$ -87474 -111302 -89454 -75357 -71875 -84364 -62316 -51060 -61979 -13122 37315 14716 676
16908F76k6031m1206k3681L1560O960m999o763N4793P8526j5608o4174m8647M083
$$ 676 -25355 -66561 -90242 -58682 -51722 -56721 -63484 -8691 69835 54227 -9947 -58594 -54511
16895e4511J6492N0055M5206j9557l5589j1280R129M4588m4352l7082o2964O2538
$$ -54511 -38019 12036 57242 37685 2096 -9184 -55 44533 181 -36901 -99865 -37327
16883c7327N9568m3073m7969m8144L0575M9255K6115k7032o5927l9326K6371M2418
$$ -37327 22241 -20832 -68801 -116945 -86370 -37115 -11000 -38032 -103959 -143285 -116914 -74496
16871g4496L7520O8111K5182m1623j03858q3560K3405O4345L3876l006m1357l2392
$$ -74496 -36976 31135 56317 14694 -89164 -172724 -149319 -84974 -51098 -54104 -95461 -127853
16859a27853L119M883k4684k4681n2259L6232R0531P3528L5985j0936l1790k1353
$$ -127853 -124734 -119851 -144535 -169216 -221475 -185243 -94712 -21184 14801 3865 -27925 -49278
16847d9278R451K4203J017j4178o72M901P112O34l9460K803M0680J4768n865J9032
$$ -49278 -39827 -15624 -14607 -28785 -29457 -24556 -17444 -16810 -56270 -53467 -12787 1981 -3884 15148
16833A5148p6528n9004J1782p479M0092L4057k2469m7582N8627Q3475J5285m260
$$ 15148 -61380 -120384 -108602 -116081 -75989 -41932 -64401 -111983 -53356 30119 45404 41144
16821D1144q1489o1293P610K4941n532L6362m527K6356K1563l6272j4417L755
$$ 41144 -40345 -101638 -94028 -69087 -74619 -38257 -42784 -16428 5135 -31137 -45554 -41799
16809d1799L056k7995l1211K755N004K2830j6971l1493J0913p224j4541L3516
$$ -41799 -38743 -66738 -97949 -95194 -90190 -67360 -84331 -115824 -104911 -112135 -126676 -93160
16797i3160O9923l4799p772K3054O521P924k737j3877p2129p325L9669r732r685
$$ -93160 -23237 -58036 -65808 -42754 -36233 -28309 -31046 -44923 -117052 -124377 -84708 -94440 -104125
16784a04125j2987j5106K0206p95j8977l290J7387J8419N0113K1139j9431L7155
$$ -104125 -117112 -132218 -112012 -112807 -131784 -135074 -117687 -99268 -49155 -28016 -47447 -10292
16772a0292l632n1696K3237j3163J5102P123M8474p4479j681K3280l039K2840
$$ -10292 -13924 -65620 -42383 -55546 -40444 -33321 15153 -59326 -61007 -37727 -40766 -17926
16760a7926J9377j2269n6993l3963M563J0089L5032k057l9250L768M4554L1884
$$ -17926 1451 -10818 -67811 -101774 -97211 -87122 -52090 -54147 -93397 -89629 -45075 -13191
16748a3191O488J9137J1798P8993O766l1921N40l1015o6695j4693K7360K9039
$$ -13191 -6703 12434 24232 103225 109991 78070 78610 47595 -19100 -33793 -6433 22606
16736B2606j9872o3029m6222o8709p000n091K6122K9448J00222O6457l6420J606
$$ 22606 2734 -60295 -106517 -175226 -182226 -187317 -161195 -131747 -31525 34932 -1488 118
16724A18l4064p9175K7911m0722k4462N4524L0196J7146N157n6386k8515J279
$$ 118 -33946 -113121 -85210 -125932 -150394 -95870 -65674 -48528 -43371 -99757 -128272 -126993
16712a26993j4543k5004J5492M1890L8221L9245m7280j2577j2612k9826j4986
$$ -126993 -141536 -166540 -151048 -109158 -70937 -31692 -78972 -91549 -104161 -133987 -148973
16701a48973J1913K2331l8437K4827J8051K6861O2904P758n3186m118J1727k4188
$$ -148973 -137060 -114729 -153166 -128339 -110288 -83427 -20523 -12765 -65951 -70069 -58342 -82530
16689h2530L226J8412o778j8268k8473n3387J0120M727P3268K621l3704l9231
$$ -82530 -79304 -60892 -67670 -85938 -114411 -167798 -157678 -152951 -79683 -77062 -110766 -149997
16677a49997K7849J8525j0206k549j4012k8557M2314J7760J7722k9979k5422k1304
$$ -149997 -122148 -103623 -113829 -116378 -130390 -158947 -116633 -98873 -81151 -111130 -136552 -157856
16665a57856M92q886n8643M1989K4922M602j589J7787J3560j0971M1358j8926
$$ -157856 -157364 -166250 -224893 -182904 -157982 -153380 -154969 -137182 -123622 -134593 -93235 -112161
16653a12161M9938O8826m1891l4038K1020N1050k96n3389j9258K3520O3869k0485
$$ -112161 -62223 6603 -35288 -69326 -48306 2744 2448 -50941 -70199 -46679 17190 -3295
16641c295l8289L183M5345k5240k7382O294l2989m7840K956n8006j5672M6193
$$ -3295 -41584 -38401 6944 -18296 -45678 -39384 -72373 -120213 -117257 -175263 -190935 -144742
16629a44742J4074J8480L5573M6966K3504o248r7156j5329J7031j6922M3965O6500
$$ -144742 -130668 -112188 -76615 -29649 -6145 -12393 -109549 -124878 -107847 -124769 -80804 -14304
16617a4304k151n4669o0312O4815q546n5680O3852P651J199j1073L0495R851K967
$$ -14304 -16455 -71124 -131436 -66621 -75167 -130847 -66995 -59344 -58145 -69218 -38723 -28872 -25905
16604b5905n8381o284K8336j1384R653m5208k5853J9166j9655j9598J6182P9453
$$ -25905 -84286 -90570 -62234 -73618 -63965 -109173 -135026 -115860 -135515 -155113 -138931 -59478
16592e9478m1398m7619M1511K3494j3483n4239m1982k3329N9867M6956k452J4400
$$ -59478 -100876 -148495 -106984 -83490 -96973 -151212 -193194 -216523 -156656 -109700 -112152 -97752
16580i7752M6924m7380J050k730l8917N0911j1177K5336M5629Q461m8590k029
$$ -97752 -50828 -98208 -97158 -99888 -138805 -87894 -99071 -73735 -28106 -19645 -68235 -70264
16568g0264k0028O3552M0620J4907j0897m2692j9107l4195j1438R160M4010P252
$$ -70264 -90292 -26740 13880 28787 17890 -24802 -43909 -78104 -89542 -80382 -36372 -29120
16556b9120n3159L1850q76J3555q2580P754N954l3816K05J2432M1365k0182k3631
$$ -29120 -82279 -50429 -51305 -37750 -120330 -112576 -106622 -140438 -140233 -127801 -86436 -106618 -130249
16543a30249J6552q178j3352J6257L7834m0160J852L0158m3O0403k9753m6259
$$ -130249 -113697 -121875 -135227 -118970 -81136 -121296 -119444 -89286 -89329 -28926 -58679 -104938
16531a04938O6498P8290L4551m2905q9858n1817M5769q498N5925M3597K51l0917
$$ -104938 -38440 39850 74401 31496 -58362 -110179 -64410 -72908 -16983 26614 26865 -4052
16519d052o8734L558p056N6119L5721k7146m926p3392k1020k0222n659J6042j4356
$$ -4052 -72786 -69228 -76284 -20165 15556 -11590 -16516 -89908 -110928 -131150 -136809 -120767 -135123
16506a35123J0735J0631L8114j7547m5845l1854R275J8886O1109L5886k0166j7729
$$ -135123 -124388 -113757 -75643 -93190 -139035 -170889 -161614 -142728 -81619 -45733 -65899 -83628
16494h3628M582j6407k3160K4972N0036J9506j767j0966l3199k4517L657j9602
$$ -83628 -79046 -95453 -118613 -93641 -43605 -24099 -25866 -36832 -70031 -94548 -90891 -110493
16482a10493k4096M0810n4642L5077J307K1111J7271l5471J3732J0938J4097l8773
$$ -110493 -134589 -93779 -148421 -113344 -112037 -90926 -73655 -109126 -95394 -84456 -70359 -109132
16470a09132k8929J6606N2758L540j9654k3514k6568J0047L6018k4013k304J7554
$$ -109132 -138061 -121455 -68697 -65157 -84811 -108325 -134893 -124846 -88828 -112841 -115145 -97591
16458i7591k862j1719L5501k1726l0381K5778N6159q844l0786Q02N9849r520l7248
$$ -97591 -100453 -112172 -76671 -98397 -128778 -103000 -46841 -55685 -86471 -85669 -25820 -35340 -72588
16445g2588l3200m6728L3380m896K6048K0268j8580j3043m1619j305P0597L6539
$$ -72588 -105788 -152516 -119136 -124032 -97984 -77716 -96296 -109339 -150958 -152263 -81666 -45127
16433d5127j8346j9027L4428L815L9779N965j7832j2692l9961O12N2457M668p3456
$$ -45127 -63473 -82500 -48072 -44257 -4478 1487 -16345 -29037 -68998 -68386 -15929 -11261 -84717
16420h4717J3243k1850k348O4587M8460j294l3240J6730K1707j3930q1538k5667
$$ -84717 -71474 -93324 -95672 -31085 17375 16081 -17159 -429 21278 7348 -74190 -99857
16408i9857j4732m4031L9916r756l6250j412K0224N4173O0335J5331l5936k0177
$$ -99857 -114589 -158620 -118704 -128460 -164710 -166122 -145898 -91725 -31390 -16059 -51995 -72172
16396g2172L8885J9654o8294l8305J1551O2923L0771K0735J1420m5933K127n1339
$$ -72172 -33287 -13633 -81927 -120232 -108681 -45758 -14987 5748 17168 -28765 -26638 -77977
16384g7977p0428L0534M3286J214j6804j7635M79J2076J1094K2534K7155N465
$$ -77977 -148405 -117871 -74585 -73371 -90175 -107810 -107331 -95255 -84161 -61627 -34472 -29007
16372b9007q0654j5544L3080k736N7877k1400o4193l5512M0479p15J8900j3845
$$ -29007 -109661 -125205 -92125 -94861 -36984 -58384 -122577 -158089 -117610 -118325 -99425 -113270
16360a13270J2404L2896k3829o624J5897K7287K2790r593K7067M6174k2754k2941
$$ -113270 -100866 -67970 -91799 -98423 -82526 -55239 -32449 -42042 -14975 31199 8445 -14496
16348a4496N729n5989n2455l417j1471L540M9438R9400L6088o0086r4614q875
$$ -14496 -8767 -64756 -117211 -120628 -132099 -128559 -79121 20279 56367 -3719 -98333 -107208
16336a07208M8619N4269k9644n0589R760R6127R981J1208j8218m8188M125J4036
$$ -107208 -58589 -4320 -33964 -84553 -74793 21334 31315 42523 24305 -23883 -19758 -5722
16324e722n1139l7184l8177n7184j8747r016l3092L1219J01569N1622j2971n2134
$$ -5722 -56861 -94045 -132222 -189406 -208153 -217169 -250261 -219042 -117473 -65851 -78822 -130956
16312a30956j1462M7604J7208M2668K7663k9475m0505j5146L782J1392Q2962O3839
$$ -130956 -142418 -94814 -77606 -34938 -7275 -36750 -77255 -92401 -88619 -77227 5735 69574
16300F9574l6901n9947q1654K2296N5330j511j5638L4580J1912K2742m954l5921
$$ 69574 32673 -27274 -108928 -86632 -31302 -32813 -48451 -13871 -1959 20783 15829 -20092
16288b0092k0828k2151j002j0627L5837k5535k5617N2390l528p231p405l5692
$$ -20092 -40920 -63071 -64073 -74700 -38863 -64398 -90015 -37625 -41153 -48384 -55789 -91481
16276i1481M179k0393l7184O694o686j3273L8649R0090k0287q5814n6221R32L8573
$$ -91481 -87302 -107695 -144879 -138185 -144871 -158144 -119495 -29405 -49692 -135506 -191727 -190795 -152222
16263a52222K2532K3662L7159m635l1792j6022m6L6427k6114j0072K1849K6301
$$ -152222 -129690 -106028 -68869 -73504 -105296 -121318 -121364 -84937 -111051 -121123 -99274 -72973
16251g2973K6629K6568O308r320p7566l1715j8229k294K1714J8880k2006R124
$$ -72973 -46344 -19776 -13468 -22788 -100354 -132069 -150298 -152592 -130878 -111998 -134004 -124880
16239a24880j0027k114J0253N6142j8771o3433j6108j326L5017J3687k3070K2922
$$ -124880 -134907 -137021 -126768 -70626 -89397 -152830 -168938 -170264 -135247 -121560 -144630 -121708
16227a21708M6711j1106N5528N6768j3831l9219k8901k5296j5276K9607K2039
$$ -121708 -74997 -86103 -30575 26193 12362 -26857 -55758 -81054 -96330 -66723 -44684
16216d4684j983K9457J5947k4863n1909l376n814J9981p145j5781N8667N2912
$$ -44684 -46667 -17210 -1263 -26126 -78035 -81411 -87225 -67244 -74389 -90170 -31503 21409
16204B1409k2676k5175r668k9179n486O2015J4051l8965J4462m6071k15M2412
$$ 21409 -1267 -26442 -36110 -65289 -70775 -8760 5291 -33674 -19212 -65283 -65498 -23086
16192b3086q544j5456j4167J0289K961R68K488J0944N098K0583j9168l4212q9452
$$ -23086 -31630 -47086 -61253 -50964 -48003 -47035 -44547 -33603 -28505 -7922 -27090 -61302 -150754
16179a50754o8741L8653M0003l188J1303l0182m4912N9039N8975k8975J9788j8625
$$ -150754 -219495 -180842 -140839 -144027 -132724 -162906 -207818 -148779 -89804 -118779 -98991 -117616
16167a17616j7286R876L6622j5205O210K616P558j7423L2455K6015o3410o4674
$$ -117616 -134902 -125026 -88404 -103609 -97399 -94783 -87225 -104648 -72193 -46178 -109588 -174262
16155a74262k2302Q3078N28M132M4419J9184j85m500j9391r390l2439L9169L1988
$$ -174262 -196564 -113486 -112958 -108826 -64407 -45223 -45408 -49908 -69299 -78689 -111128 -71959 -39971
16142c9971O087j9960k8396n0842l408L7704n7732m3180O2635N2433L8104n396
$$ -39971 -33884 -53844 -82240 -133082 -136490 -98786 -156518 -199698 -137063 -84630 -46526 -51922
16130e1922K8938J5146l6075J9313N2882J0321M661L0546o08o671p9774j6714
$$ -51922 -22984 -7838 -43913 -24600 28282 38603 43264 73810 73202 66531 -13243 -29957
16118b9957M3619J9468m3757j02328l9101L5134Q4584l1462j424M5303k8874m2932
$$ -29957 13662 33130 -10627 -112955 -152056 -116922 -32338 -63800 -65224 -19921 -48795 -91727
16106i1727M5198J3527m5029k5938k0781l5915j388K5933r5l1931N5979M0963
$$ -91727 -46529 -33002 -78031 -103969 -124750 -160665 -162053 -136120 -136215 -168146 -112167 -71204
16094g1204r16M482J2431Q936k3609k3452M0578j8086o5116M2462O1871K1164
$$ -71204 -72120 -67638 -55207 -46271 -69880 -93332 -52754 -70840 -135956 -93494 -31623 -10459
16082a0459J9746k6143M5083j1919p5529Q047L4451k3544M5j3040k6214n2380
$$ -10459 9287 -16856 28227 16308 -59221 -51174 -16723 -40267 -40222 -53262 -79476 -131856
16070a31856M149J9859l7207O0311L8400J6110q4121m065J690M1268L3973m4275
$$ -131856 -127707 -107848 -145055 -84744 -46344 -30234 -114355 -118420 -116730 -75462 -41489 -85764
16058h5764o6228N6868k8628J4782j3562k1533L0568k625L033L9368L3476K2239
$$ -85764 -151992 -95124 -123752 -108970 -122532 -144065 -113497 -116122 -113089 -73721 -40245 -18006
16046a8006l5824k6413k6352P245K518j398L2647k0457K250N5047J421k5439J4793
$$ -18006 -53830 -80243 -106595 -99350 -96832 -98230 -65583 -86040 -83790 -28743 -27322 -52761 -37968
16033c7968N4797k5478p5799L827L5288j8157m852K6197J8244k0617j216M047
$$ -37968 16829 -8649 -84448 -80621 -45333 -63490 -68342 -42145 -23901 -44518 -45734 -41687
16021d1687n276M970l5569J598K3805p059j7276J5123j4430l4889P3196M9688
$$ -41687 -46963 -41993 -77562 -75964 -52159 -59218 -76494 -61371 -75801 -110690 -37494 12194
16009A2194p4960k9867J2385M2196K2139P669J6146k3192R112k3805k2552m6349
$$ 12194 -62766 -92633 -80248 -38052 -15913 -8244 7902 -15290 -6178 -29983 -52535 -98884
15997i8884q811O301j7822k1273O779O6402q720J0104k925k9805J0738N761J0517
$$ -98884 -107695 -101394 -119216 -140489 -133710 -67308 -76028 -65924 -68849 -98654 -87916 -82155 -71638
15984g1638k1843m4355O1052J6947O523n7957m0264l4090P4245P5043k1525n66
$$ -71638 -93481 -137836 -76784 -59837 -53314 -111271 -151535 -185625 -111380 -36337 -57862 -58428
15972e8428K0381J6037o5951k8966J7228J9910K3440L551l4174j6362q6582J2897
$$ -58428 -38047 -22010 -87961 -116927 -99699 -79789 -56349 -52798 -86972 -103334 -189916 -177019
15960a77019M9658k4614L1315O7667J8428k6796J3703m1256m0959j9101L5311
$$ -177019 -127361 -151975 -120660 -52993 -34565 -61361 -47658 -88914 -129873 -148974 -113663
15949a13663K9706K0640M217j2693m1982m8037k0891p007M4683J9518O7881J5268
$$ -113663 -83957 -63317 -59100 -71793 -113775 -161812 -182703 -189710 -145027 -125509 -57628 -42360
15937d2360m3893r223J6998J830k1830K6940J1581r48N6796k5305P25J7827M364
$$ -42360 -86253 -95476 -78478 -76648 -98478 -71538 -59957 -60905 -4109 -29414 -28689 -10862 -6498
15924f498l7702l1035L7031J7582R29n2988K4982J3104k2143o976n0045n752k0609
$$ -6498 -44200 -75235 -38204 -20622 -19693 -72681 -47699 -34595 -56738 -63714 -113759 -119511 -140120
15911a40120k5595k5105m9336K0430K7480j7763J6240L1298O6068J9130k3641
$$ -140120 -165715 -190820 -240156 -219726 -192246 -210009 -193769 -162471 -96403 -77273 -100914
15900a00914n3852L4086L6760j0554K379k3089K0025L131q944K3430j0262J2063
$$ -100914 -154766 -120680 -83920 -94474 -92095 -115184 -95159 -92028 -100972 -77542 -87804 -75741
15888g5741j027L2226M4636M1330k8379m0205j9693j3688k6100k9492L0986P7962
$$ -75741 -76768 -44542 94 41424 13045 -27160 -46853 -60541 -86641 -116133 -85147 -7185
15876g185P743q8347r719j6098j3219j2819K5318J0983N454O5700R085N2423K922
$$ -7185 558 -87789 -97508 -113606 -126825 -139644 -114326 -103343 -97889 -32189 -23104 29319 32241
15863C2241j8375j9051j1066k8083k4897m1381j4967m5198M2390O9486j328K4641
$$ 32241 13866 -5185 -16251 -44334 -69231 -110612 -125579 -170777 -128387 -58901 -60229 -35588
15851c5588k7184l2829K986j2161l0070O7511J1583j2400N1005j1808k9612o4784
$$ -35588 -62772 -95601 -92615 -104776 -134846 -67335 -55752 -68152 -17147 -28955 -58567 -123351
15839a23351J5023M0531J1324j3316J6691K1973q9059k5738m3076l0637L3310
$$ -123351 -108328 -67797 -56473 -69789 -53098 -31125 -120184 -145922 -188998 -219635 -186325
15828a86325O3170K9551L5295m5277n3378K3694M1506M3916N5700K817J2725l1726
$$ -186325 -123155 -93604 -58309 -103586 -156964 -133270 -91764 -47848 7852 10669 23394 -8332
15816h332q0157k7979L0347J8347J2209M8179K5162n7651k1039n4445K5948M6463
$$ -8332 -88489 -116468 -86121 -67774 -55565 -7386 17776 -39875 -60914 -115359 -89411 -42948
15804d2948j571K1707j9064k8232l8245O012M0220q245K152L6745o56J2624L1828
$$ -42948 -44519 -22812 -41876 -70108 -108353 -102341 -62121 -70366 -68214 -31469 -32125 -19501 12327
15791A2327m3592o4801Q023k5727Q717O712m186K0891L3399N3275m3217l6517
$$ 12327 -31265 -96066 -88043 -113770 -105053 -98341 -102527 -81636 -48237 5038 -38179 -74696
15779g4696m9956N3737L2130k6927N76o879l5871O469j4010M3362J8444l3651
$$ -74696 -124652 -70915 -38785 -65712 -65136 -72015 -107886 -101417 -115427 -72065 -53621 -87272
15767h7272q1828K576N2567J7244m5826j4710N9413Q8776O7588o4636n8880k3403
$$ -87272 -169100 -166524 -113957 -96713 -142539 -157249 -97836 -9060 58528 -6108 -64988 -88391
15755h8391l6799K4362p658o065N3760l6138m0709r92N632J8393M4113L5265j7519
$$ -88391 -125190 -100828 -108486 -114551 -60791 -96929 -137638 -138630 -132998 -114605 -70492 -35227 -52746
15742e2746j0508L5845O9543l2593j3470q403K0881n226l1978o5880j985J578
$$ -52746 -63254 -27409 42134 9541 -3929 -12332 8549 3323 -28655 -94535 -96520 -94942
15730i4942l3955L1392M4581j502K5349m4975j1571m1874J6913J8958P7023M4339
$$ -94942 -128897 -97505 -52924 -54426 -29077 -74052 -85623 -127497 -110584 -91626 -14603 29736
15718B9736J1025l2193J5077m857j3483l2960k4086l7416M2006L4505R424M707
$$ 29736 40761 8568 23645 18788 5305 -27655 -51741 -89157 -47151 -12646 -3222 1485
15706A485m9862J5624k1306k9006M7001J9136j00527l156L1270K6461k854J2698
$$ 1485 -48377 -32753 -54059 -83065 -36064 -16928 -117455 -120611 -89341 -62880 -65734 -53036
15694e3036R5622J7441l2850m3192j9832m8293K2854k0343j5726M6432j7009J014
$$ -53036 42586 60027 27177 -16015 -35847 -84140 -61286 -81629 -97355 -50923 -67932 -66918
15682f6918L3793l7716J995K4677M683N2868j3811K4573k2948m7835K9680k3204
$$ -66918 -33125 -70841 -68846 -44169 -39486 13382 -429 24144 1196 -46639 -16959 -40163
15670d0163p021o441j2880J015m8054j1165J4798J7884O6418L0107R613q3221
$$ -40163 -47184 -53625 -66505 -65490 -113544 -124709 -109911 -92027 -25609 4498 14111 -69110
15658f9110n827J5628r346K4871N9901k6434R741n3288J3460K9212L92m486o045
$$ -69110 -74937 -59309 -68655 -43784 16117 -10317 -576 -53864 -40404 -11192 -10800 -15286 -21331
15645b1331j5108J0114k9814j8635j5469k4783K917L5895M6964J3569K2410k2253
$$ -21331 -36439 -26325 -56139 -74774 -90243 -115026 -112109 -76214 -29250 -15681 6729 -15524
15633a5524l962l7744J7022K4588k494l0112j728K0017k636P859j6149r3824j8025
$$ -15524 -19486 -57230 -40208 -15620 -18114 -48226 -49954 -29937 -32573 -24714 -40863 -134687 -152712
15620a52712M8483M871M6678L8335k5725J0721m6358Q451k9583P944O520K9355
$$ -152712 -104229 -99358 -52680 -14345 -40070 -29349 -75707 -67256 -96839 -88895 -82375 -53020
15608e3020l507n8696J4215J6186k7471j3475L2912K8055K9930n4666m2840o0232
$$ -53020 -56527 -115223 -101008 -84822 -112293 -125768 -92856 -64801 -34871 -89537 -132377 -192609
15596a92609K888K5320N2914M2483N279m19L4373Q1665P842m6300k1909j9783
$$ -192609 -189721 -164401 -111487 -69004 -63725 -64144 -29771 51894 59736 13436 -8473 -28256
15584b8256K5265K1870n1374J046n1248o00J1093k6166M9572M8506k0010K4894
$$ -28256 -2991 18879 -32495 -31449 -82697 -83297 -72204 -98370 -48798 -292 -20302 4592
15572D592n3425l5829O1586L6498l9526p4082L9837K6125k6142m2244n3178k1582
$$ 4592 -48833 -84662 -23076 13422 -26104 -100186 -60349 -34224 -60366 -102610 -155788 -177370
15560a77370P849K2941j1776j2096K9179J5156l8370K9449N1321J7659J5899n517
$$ -177370 -169521 -146580 -158356 -170452 -141273 -126117 -164487 -135038 -83717 -66058 -50159 -55676
15548e5676n2341K0875M7919k5111l3642J9838L14M5844L1806o5073Q642P1269
$$ -55676 -108017 -87142 -39223 -64334 -97976 -78138 -77824 -31980 -174 -65247 -56605 14664
15536A4664j4831k8849J6218K3940r3345j03823l1560L3447R1269o273K0853l2943
$$ 14664 -167 -29016 -12798 11142 -82203 -186026 -217586 -184139 -92870 -99143 -78290 -111233
15524a11233M384M1299K1335j7950J0335l737K0817L3707l2481q3543J2597P028
$$ -111233 -106849 -65550 -44215 -62165 -51830 -55567 -34750 -1043 -33524 -117067 -104470 -97442
15512i7442j3416l0550K5958L4593P754J1245J352N1325K2043m5220k3797J0950
$$ -97442 -110858 -141408 -115450 -80857 -73103 -61858 -60506 -9181 12862 -32358 -56155 -45205
15500d5205l6370N063L7696L0920K0344q0525n8392L0170K4453M4065J5944k3777
$$ -45205 -81575 -76512 -38816 -7896 12448 -68077 -126469 -96299 -71846 -27781 -11837 -35614
15488c5614l3391L3043P1708J2439n6077k4122m5829o2534L6975K0935j0244N6204
$$ -35614 -69005 -35962 35746 48185 -7892 -32014 -77843 -140377 -103402 -82467 -92711 -36507
15476c6507l7786N448N4443L9783j6015n2142l6214M8220O9226p5032j13147j7791
$$ -36507 -74293 -68845 -14402 25381 9366 -42776 -78990 -30770 38456 -36576 -149723 -167514
15464a67514M9256P4387N0695K2941m275J4685n095k8211j8666J3905J5565j3616
$$ -167514 -118258 -43871 6824 29765 25490 40175 35080 6869 -11797 2108 17673 4057
15452D057k7220r692J5872k885M3610J7081J6228j9876n1552n7330n2361l8326
$$ 4057 -23163 -32855 -16983 -19868 23742 40823 57051 37175 -14377 -71707 -124068 -162394
15440a62394Q261P3365N1683n385m9938m6361N074k1874K0181Q5922k3190p2235
$$ -162394 -154133 -80768 -29085 -34470 -84408 -130769 -125695 -147569 -127388 -41466 -64656 -136891
15428a36891L5891r862N361K1591O955M1917J8863K0121l226j8014M3173L610
$$ -136891 -101000 -110862 -105501 -83910 -76955 -35038 -16175 3946 720 -17294 25879 29489
15416B9489m0283k0238J587k8206L4832O9133k5608n1875o688P4000l4304n2912
$$ 29489 -10794 -31032 -29445 -57651 -22819 46314 20706 -31169 -37857 36143 1839 -51073
15404e1073M2906j0910k0969l1024k2863K6114n084l9432j6816M2987N5300K9993
$$ -51073 -8167 -19077 -40046 -71070 -93933 -67819 -72903 -112335 -129151 -86164 -30864 -871
15392h71m966k2287r190J4573N5213N928k7138m0065J8971l4855j0704o151M9609
$$ -871 -5837 -28124 -37314 -22741 32472 38400 11262 -28803 -9832 -44687 -55391 -61542 -11933
15379a1933P8491r2213n5717M3459l9785n231o2392M4379M0152o264M6495j834
$$ -11933 66558 -25655 -81372 -37913 -77698 -82929 -145321 -100942 -60790 -67054 -20559 -22393
15367b2393l4232j5478L876k6125J9197K7674L8920L575j4764l6819m0357J9921
$$ -22393 -56625 -72103 -68227 -94352 -75155 -47481 -8561 -4986 -19750 -56569 -96926 -77005
15355g7005L6862J1523n877k5282R625J7363j5692n23M2804M4366l2220m2363
$$ -77005 -40143 -28620 -34497 -59779 -50154 -32791 -48483 -49006 -6202 38164 5944 -36419
15343c6419m4131j4216L2757J0267k3501j4737K1215j6953k5695k8727P127J7283
$$ -36419 -80550 -94766 -62009 -51742 -75243 -89980 -68765 -85718 -111413 -140140 -133013 -115730
15331a15730O304j5130M8815N2159R454k7260k6140R23J7123K5009n234j389L7935
$$ -115730 -109426 -124556 -75741 -23582 -14128 -41388 -67528 -66605 -49482 -24473 -29707 -31096 6839
15318F839J1700Q360m0393n1027j2969n7141l1834J1357R5078M7604n995L459
$$ 6839 18539 26899 -13494 -64521 -77490 -134631 -166465 -155108 -60030 -12426 -18421 -14962
15306a4962k8459L1212L890M4305K5579j8250P802L8248l860o5503q3143n0375
$$ -14962 -43421 -12209 -8319 35986 61565 43315 51117 89365 85505 20002 -63141 -113516
15294a13516K7692J4923l9742l5918J1238K0854L5329K4126J367k2542k5700J9116
$$ -113516 -85824 -70901 -110643 -146561 -135323 -114469 -79140 -55014 -53647 -76189 -101889 -82773
15282h2773N508m2595j9010M7013K9736J02456l62r3808K9948l6952P549M951
$$ -82773 -77265 -119860 -138870 -91857 -62121 40335 39973 -53835 -23887 -60839 -53290 -48339
15270d8339j0591J1978N5454K5066m6287N806N574o734l9904j7446o95O995n3
$$ -48339 -58930 -46952 8502 33568 -12719 -6913 -1339 -8073 -47977 -65423 -66118 -59123 -59176
15257e9176k5103j2619l5038N2350M4906q103J5168p804K7618j6368n582M9605
$$ -59176 -84279 -96898 -131936 -79586 -34680 -42783 -27615 -35419 -7801 -24169 -29751 19854
15245A9854o705J1987L443p767k0832r1657M6702K4364m8761k8137L3712L752
$$ 19854 13149 25136 28579 20812 -20 -91677 -44975 -20611 -69372 -97509 -63797 -60045
15233f0045K4132L3889j4179J9400K8904Q51k5770j8072J9112M1944j0983l9613
$$ -60045 -35913 -2024 -16203 3197 32101 32952 7182 -10890 8222 50166 39183 -430
15221d30J0904J9464m5578l9998L8815K2691j7771l1537n2457j447Q2016R1763
$$ -430 10474 29938 -15640 -55638 -16823 5868 -11903 -43440 -95897 -97344 -15328 76435
15209G6435j0873n8006r6147J070P955J0174N641r18n2971N403O5377p078M5409
$$ 76435 65562 7556 -88591 -87521 -79566 -69392 -63751 -64669 -117640 -112237 -46860 -53938 -8529
15196h529l1042k8560j2695Q891O3569K1195M0212m2517o5348K3880L0681N1928
$$ -8529 -39571 -68131 -80826 -71935 -8366 12829 53041 10524 -54824 -30944 -263 51665
15184E1665J9776n5623o4647n2281K5005k3990l4898O8780K8767k0769m2831j0666
$$ 51665 71441 15818 -48829 -101110 -76105 -100095 -134993 -66213 -37446 -58215 -101046 -111712
15172a11712P6223Q8313r091k3093k028J6668L2661k5050k5138M7139q725j1597
$$ -111712 -35489 52824 43733 20640 18612 35280 67941 42891 17753 64892 56167 44570
15160D4570l2494J8807O2548q3207j7324p89q5218J4437K0502k4344k7807R1316
$$ 44570 12076 30883 93431 10224 -7100 -7889 -93107 -78670 -58168 -82512 -110319 -19003
15148a9003L4727J1534M233p3809P233N2571m9079J2666k7402j5745K3446p916
$$ -19003 15724 27258 31491 -42318 -35085 17486 -31593 -18927 -46329 -62074 -38628 -46544
15136d6544n0160n45L5088Q138k1157N688N7182j8711J1413J8408k9102j9737
$$ -46544 -96704 -97249 -62161 -54023 -75180 -69492 -12310 -31021 -19608 -1200 -30302 -50039
15124e0039J0052J9928k1433L0965Q102k3985j8239j4040q226J1326K7779j6432
$$ -50039 -39987 -20059 -41492 -10527 -2425 -26410 -44649 -58689 -66915 -55589 -27810 -44242
15112d4242L2213L7031l3835l2663L3700N0166n064M546L8186j5429l7264K0676
$$ -44242 -12029 25002 -8833 -41496 -7796 42370 37306 41852 80038 64609 27345 48021
15100D8021q86o7330J9515k368r069j5951l6242N799O7173M7159l4230n8962k8260
$$ 48021 47135 -20195 -680 -3048 -12117 -28068 -64310 -58511 8662 55821 21591 -37371 -65631
15087f5631L6508O264k969j8526k4728l122n7012m2344r661O5702L6077J8961
$$ -65631 -29123 -22859 -25828 -44354 -69082 -72204 -129216 -171560 -181221 -115519 -79442 -60481
15075f0481M8857J8596n6274J2473K4208N11j9335n9631K4111J6037M165J02070
$$ -60481 -11624 6972 -49302 -36829 -12621 -12110 -31445 -91076 -66965 -50928 -46763 55307
15063E5307j3354r045m2114j0292j4350J383j5548l4165L8115K5290k4300L3774
$$ 55307 41953 32908 -9206 -19498 -33848 -32465 -48013 -82178 -44063 -18773 -43073 -9299
15051i299N4340k779Q720M435K6324J3885p1552o0848J4494L1890K949k90l4091
$$ -9299 45041 42262 50982 55417 81741 95626 24074 -36774 -22280 9610 12559 12269 -21822
15038b1822l1552k6065O4908M1301J3521j4618k4260r0480l1761J6283k013N2152
$$ -21822 -53374 -79439 -14531 26770 40291 25673 1413 -89067 -120828 -104545 -106558 -54406
15026e4406P656J0489J1272k2820K7234l415R219L0745J3869K4107M221Q37k6953
$$ -54406 -46750 -36261 -24989 -47809 -20575 -23990 -14771 15974 29843 53950 58171 59008 32055
15013C2055m7782l4529J9115J3799L2698l2316k9149k5702J8704N0816J8503R608
$$ 32055 -15727 -50256 -31141 -17342 15356 -16960 -46109 -71811 -53107 -2291 16212 25820
15001B5820R992K1274j1070m7588l6239R830N9111m9266m6981M5609k9678J2339
$$ 25820 35812 57086 46016 -1572 -37811 -27981 31130 -18136 -65117 -19508 -49186 -36847
14989c6847J203K2718L8856q901o2135R827J17k0025p163L5313k5401K0579j3991
$$ -36847 -35644 -12926 25930 17029 -45106 -35279 -35162 -55187 -62350 -27037 -52438 -31859 -45850
14976d5850J3552M3213j9003k2976l5140k6811J640J4634j865p5718J7665P9743
$$ -45850 -32298 10915 -8088 -31064 -66204 -93015 -91375 -76741 -78606 -154324 -136659 -56916
14964e6916K7993O554K3204j0421K3955M4651j1735p3904j7355R840r353m631
$$ -56916 -28923 -22369 835 -9586 14369 59020 47285 -26619 -43974 -34134 -43487 -48118
14952d8118K4650J3497M608K2100o3012m2751o118l2235M5608O8472P3858l5947
$$ -48118 -23468 -9971 -5363 16737 -46275 -89026 -95144 -127379 -81771 -13299 60559 24612
14940B4612k1740J8278J0542l9531k3310k5115l9840L3433J2120j3260L8745p905
$$ 24612 2872 21150 31692 -7839 -31149 -56264 -96104 -62671 -50551 -63811 -25066 -32971
14928c2971k9359L3392L1021j6927l5365j5385N7331K6529p575j9682P8239O1843
$$ -32971 -62330 -28938 2083 -14844 -50209 -65594 -8263 18266 10691 -8991 69248 131091
14916A31091l6825m3736l7111q4961k0476N6016O234J4382o738M3158L7638m3339
$$ 131091 94266 50530 13419 -71542 -92018 -36002 -29768 -15386 -22124 21034 58672 15333
14904A5333p3705l7248R5063J3669n9253R943K60m7264R225J8795j6815j2608
$$ 15333 -58372 -95620 -557 13112 -46141 -36198 -35938 -83202 -73977 -55182 -71997 -84605
14892h4605K827N4514l668j7731O767j4992l4701L1864n7504M6844J2402k3192
$$ -84605 -81778 -27264 -30932 -48663 -41896 -56888 -91589 -59725 -117229 -70385 -57983 -81175
14880h1175j597K039K2269n717l5957j1760m451M3459J8834n773J0308L1175O528
$$ -81175 -82772 -80733 -58464 -64181 -100138 -111898 -116349 -72890 -54056 -59829 -49521 -18346 -11818
14867a1818O640q796n4274r485L827l281Q370j1231k1888n0119l2975j6995j5161
$$ -11818 -5178 -13974 -68248 -77733 -73906 -77187 -68817 -80048 -101936 -152055 -185030 -202025 -217186
14854b17186K0835P4483L5465K0786Q672J7762n7190J5917M9597K0496L0993j1114
$$ -217186 -196351 -121868 -86403 -65617 -56945 -39183 -96373 -80456 -30859 -10363 20630 9516
14842I516r372j5214J5038J9396k583K88j2658M0219K9764M366J0921j6217j6476
$$ 9516 144 -15070 -32 19364 16781 17069 4411 44630 74394 78760 89681 73464 56988
14829E6988M234K3194l945m7544l3793K3041O792k3067K5441m9602k6663R6960
$$ 56988 61222 84416 80471 32927 -866 22175 28967 5900 31341 -18261 -44924 52036
14817E2036J8341m4119m1117r882p78j7007k3781L0043j082j1078L0721K7586
$$ 52036 70377 26258 -14859 -24741 -25519 -42526 -66307 -36264 -37346 -48424 -17703 9883
14805I883o267J495J52J9070K0402m6308L4780J2735k4320p1882j1895N6318L1310
$$ 9883 3616 5111 5263 24333 44735 -1573 33207 45942 21622 -50260 -62155 -5837 25473
14792B5473k5398o0071j6523O230J2371K7610j0937R59l7993l9271J6204k1379
$$ 25473 75 -59996 -76519 -70289 -57918 -30308 -41245 -40286 -78279 -117550 -101346 -122725
14780a22725k1901L4890Q7322M9281J206P225m6600O534J1910p5025m6314P6113
$$ -122725 -144626 -109736 -22414 26867 28073 35298 -11302 -4768 7142 -67883 -114197 -38084
14768c8084o307K0004K4654j7136K1610J3607j5528M2449m0833L2712J3580n3822
$$ -38084 -44391 -24387 267 -16869 4741 18348 2820 45269 4436 37148 50728 -3094
14756c094L2057N7103N4907n0859j04589j5770O647L3565k4503k8871R679K0905
$$ -3094 28963 86066 140973 90114 -14475 -30245 -23598 9967 -14536 -43407 -33728 -12823
14744a2823l3703l6093n035K7591L028k2380j5603K0216M0585N3501m0755M0435
$$ -12823 -46526 -82619 -87654 -60063 -57035 -79415 -95018 -74802 -34217 19284 -21471 18964
14732A8964p897m3554l4834J1031k6829k8880L0913j7458o7391L3356N4462k2308
$$ 18964 11067 -32487 -67321 -56290 -83119 -111999 -81086 -98544 -165935 -132579 -78117 -100425
14720a00425j6828j1621L4807l827L8901K8024k0662K053p9259n5480M0074Q8426
$$ -100425 -117253 -128874 -94067 -97894 -58993 -30969 -51631 -49578 -128837 -184317 -144243 -55817
14708e5817k9977k2089O5358L3434m4942l486M2553j3830R164m546K508o093K0636
$$ -55817 -85794 -107883 -42525 -9091 -54033 -57519 -14966 -28796 -19632 -24178 -21670 -27763 -7127
14695g127j6452j1202j2327Q020p033q2808J5059K990N9041P1246l636q1207m6752
$$ -7127 -23579 -34781 -47108 -39088 -46121 -128929 -113870 -110880 -51839 19407 15771 -65436 -112188
14682a12188j079P9179J8811l3087m6842M9437Q7828k8459n0285m5385m19J0348
$$ -112188 -113267 -34088 -15277 -48364 -95206 -45769 42059 13600 -36685 -82070 -82489 -72141
14670g2141O8754K3982k7614l8193o0454k654M6138o472L3148M3754m0849j8333
$$ -72141 -3387 20595 -7019 -45212 -105666 -108320 -62182 -68654 -35506 8248 -32601 -50934
14658e0934K462j8926N4211N498l2198j2319j5380k3005M9502r73J4174k4783
$$ -50934 -48472 -67398 -13187 -7689 -39887 -52206 -67586 -90591 -41089 -42062 -27888 -52671
14646e2671n385R773M0814L998j4318K0902k3342m9252K7172K7975m1302k3772
$$ -52671 -58056 -48283 -7469 -3471 -17789 3113 -20229 -69481 -42309 -14334 -55636 -79408
14634g9408O0401M7572L9443k7117l9253m1474k6076N834O9965R6704l6623n6843
$$ -79408 -19007 28565 68008 40891 1638 -39836 -65912 -60078 9887 106591 69968 13125
14622A3125M6433J7934O426j0343k8434q9055l6727K8111m28N5391k7763j6217
$$ 13125 59558 77492 83918 73575 45141 -43914 -80641 -52530 -52958 2433 -25330 -41547
14610d1547K2234J6257K9906J8684k2901m8211p301j1377k8868J204m6268J9729
$$ -41547 -19313 -3056 26850 45534 22633 -25578 -32879 -44256 -73124 -71920 -118188 -98459
14598i8459K0737J8030O70K1268K0078O149R54O748k0379m1220J2169M2459N7289
$$ -98459 -77722 -59692 -59022 -37754 -17676 -11527 -10573 -3825 -24204 -65424 -53255 -10796 46493
14585D6493j9620o1408K1635l9828L6371j0326Q443L9761r974m9734j1475k826
$$ 46493 26873 -34535 -12900 -52728 -16357 -26683 -18240 21521 11547 -38187 -49662 -52488
14573e2488O5109j4916k5862j2268k2480M3083K4562l1881m7309l8473k9150J2100
$$ -52488 12621 -2295 -28157 -40425 -62905 -19822 4740 -27141 -74450 -112923 -142073 -129973
14561a29973L0036O1058N1468l5020o6737M4058N5421M3529P327k1235n3792N528
$$ -129973 -99937 -38879 12589 -22431 -89168 -45110 10311 53840 61167 39932 -13860 -8332
14549h332N0399k7817l8240K1774M0986K6233k7753o8138K8895l6671r6768m0404
$$ -8332 42067 14250 -23990 -2216 38770 65003 37250 -30888 -1993 -38664 -135432 -175836
14537a75836O5844Q4324k8608K0980J9552j085m3078M6289N0793l0686m4398J0921
$$ -175836 -109992 -25668 -54276 -33296 -13744 -14829 -57907 -11618 39175 8489 -35909 -24988
14525b4988j0374k2733R1989K7582k8865O14N796N89l4333L354K0898j4604o8131
$$ -24988 -35362 -58095 33894 61476 32611 33225 39021 39610 5277 8631 29529 14925 -53206
14512e3206m0134q10M0357M666j189N3434L7157L0129l4070p2917K5819L9444
$$ -53206 -93340 -94150 -53793 -49127 -50316 3118 40275 70404 36334 -36583 -10764 28680
14500B8680k7630k9045K8481K0495l759L571P243m0225J6403k9346l9055l0538
$$ 28680 1050 -27995 486 20981 17222 20793 28036 -12189 4214 -25132 -64187 -94725
14488i4725L7947k0859j1452R0333R17l3659J1116j8092r169R522O403L0285l5542
$$ -94725 -56778 -77637 -89089 1244 2161 -31498 -20382 -38474 -47643 -38121 -31718 -1433 -36975
14475c6975J1484n929k7972O8411l0957k6613K2024k375J2318J8784k0302k0988
$$ -36975 -25491 -31420 -59392 9019 -21938 -48551 -26527 -28902 -16584 2200 -18102 -39090
14463c9090P713K833N306k533P17P332M5512N828l4277Q917k4797m0287K1183
$$ -39090 -31377 -28544 -23238 -25771 -25054 -17722 27790 33618 -659 8258 -16539 -56826 -35643
14450c5643J9697j5339m808l0287L5550K9018K0416K1334j6394N298L3363k4048
$$ -35643 -15946 -31285 -36093 -66380 -30830 -1812 18604 39938 23544 28842 62205 38157
14438C8157p2564l2268l1663k4391N4397K0743m5037j6807J3297J8209N2028k2859
$$ 38157 -34407 -66675 -98338 -122729 -68332 -47589 -92626 -109433 -96136 -77927 -25899 -48758
14426d8758j0454q574L2553j9180J7642J0074J8658N5699O55o549n2095K260P291
$$ -48758 -59212 -67786 -35233 -54413 -36771 -26697 -8039 47660 48315 41766 -10329 -8069 -778
14413g78m3299m4361o5531L1366P2409Kk6409j6417M5879K3280K6168M5797J2908
$$ -778 -44077 -88438 -153969 -122603 -50194 -50192 -76601 -93018 -47139 -23859 2309 48106 61014
14400F1014M758m4249k8898l7329j2822L5173K702N6869k161l4639o5084m4554
$$ 61014 65772 21523 -7375 -44704 -57526 -22353 -19651 37218 35057 418 -64666 -109220
14388a09220L7382Q7833j3010k7335k909M803L1889J0468q109l6767K274M3254
$$ -109220 -71838 15995 2985 -24350 -27259 -22456 9433 19901 11792 -24975 -22701 20553
14376B0553L0067K5028j378m6120l0637j5646L8682l7639M574J4079J1624N952
$$ 20553 50620 75648 74270 28150 -2487 -18133 20549 -17090 -12516 1563 13187 19139
14364A9139j383n2722O757J6688L8581R84m8286p6469J0529N4791K6147M969j3184
$$ 19139 17756 -34966 -28209 -11521 27060 28044 -20242 -96711 -86182 -31391 -5244 -275 -13459
14351a3459K8653J7663n1337j9503j3945L8929M7390j7328o6574Q401M4638j7518
$$ -13459 15194 32857 -18480 -37983 -51928 -12999 34391 17063 -49511 -41110 3528 -13990
14339a3990P546L6233n6555o6538l286j2704l5351N1632O6375M6558k5551o1357
$$ -13990 -6444 29789 -26766 -93304 -96590 -109294 -144645 -93013 -26638 19920 -5631 -66988
14327f6988O053M5722J1720k717j5103N7880M0054P862n8920o6804j3187k8467
$$ -66988 -60935 -15213 -3493 -6210 -21313 36567 76621 84483 25563 -41241 -54428 -82895
14315h2895L9237O8503L7258k0994o1134J8709n338l4017L948J8866J8525l1760
$$ -82895 -43658 24845 62103 41109 -20025 -1316 -6654 -40671 -36723 -17857 668 -31092
14303c1092k5778K6462j1071L32l3621M6707L7038l7283J8567l3259N9646O746
$$ -31092 -56870 -30408 -41479 -41147 -74768 -28061 8977 -28306 -9739 -42998 16648 23394
14291B3394j7681J7964P260r266L508M8232j1215J201k843m5587l2180m7438k2521
$$ 23394 5713 23677 30937 21671 25179 73411 62196 63397 60554 14967 -17213 -64651 -87172
14278h7172k6179L3455L2950J9665P721J617p795n964j7938j7761J7120j3732
$$ -87172 -113351 -79896 -46946 -27281 -19560 -17943 -25738 -31702 -49640 -67401 -50281 -64013
14266f4013Q766O9845Q146R721j4873k5673m1429K010L5825M3972o9188n0798
$$ -64013 -55247 14598 22744 32465 17592 -8081 -49510 -47500 -11675 32297 -36891 -87689
14254h7689k232k5112O28L6793K5752N1503N8124N9672o520j06463J7584R631
$$ -87689 -89921 -115033 -114405 -77612 -51860 -357 57767 117439 110919 4456 22040 31671
14242C1671l2338O211J1775j7056n3544r845L660R132j7647j9843L5631l8027
$$ 31671 -667 5544 17319 263 -53281 -63126 -59466 -50334 -67981 -87824 -52193 -90220
14230i0220l8463M1954K6367j2419k43l1451L4395J7768J1307L7623L8745n8299
$$ -90220 -128683 -86729 -60362 -72781 -73024 -104475 -70080 -52312 -41005 -3382 35363 -22936
14218b2936k6451p154m884q3222j2020M0259Q9668O052K2567M4408l4590J3649
$$ -22936 -49387 -56541 -61425 -144647 -156667 -116408 -26740 -20688 1879 46287 11697 25346
14206B5346L8373P5498l0097n3680j8359m9532n2297P1225j2224l3432R454l5384
$$ 25346 63719 139217 109120 55440 37081 -12451 -64748 6477 -5747 -39179 -29725 -65109
14194f5109j3271M8670M3879m257M589j7035o44n965k0060j917K1841K2713q807
$$ -65109 -78380 -29710 14169 9912 14501 -2534 -3178 -9143 -29203 -31120 -9279 13434 4627
14181D627n9204K1184L1742o051l0798M87k420J5827O754M8482m607P686L2980
$$ 4627 -54577 -33393 -1651 -7702 -38500 -38013 -40433 -24606 -17852 30630 26023 33709 66689
14168F6689k46l9878p0251P731P9521k0863k5797o018O8921O79l6278k7914j712
$$ 66689 66443 26565 -43686 -35955 43566 22703 -3094 -9112 59809 60488 24210 -3704 -5416
14155e416N09j8952n9138N0876M1313J0090l5373r342q574J1115m2640n6037o647
$$ -5416 -4907 -23859 -82997 -32121 9192 19282 -16091 -25433 -34007 -22892 -65532 -121569 -128216
14142a28216O1800L0152o675K4162k4443K0748k8106m7262j3438J0786L1878N1534
$$ -128216 -66416 -36264 -42939 -18777 -43220 -22472 -50578 -97840 -111278 -100492 -68614 -17080
14130a7080M9990J5177k0337k8017L556m871M9617p346J1218m3566N118M4593
$$ -17080 32910 48087 27750 -267 3289 -1582 48035 40689 51907 8341 13459 58052
14118E8052R207L284l720M0766q143j3959J6568l3647q0597K219M0465K4705L6551
$$ 58052 67259 70543 66823 107589 99446 85487 102055 68408 -12189 -9970 30495 55200 91751
14105I1751L9711n5558p3885m0993K6435J3525J5941L6656j2272m1237l2645J3753
$$ 91751 131462 75904 2019 -38974 -12539 986 16927 53583 41311 74 -32571 -18818
14093a8818O0423K8630p1172r496J00181J7217J737m2809k8470J0218L0193L5266
$$ -18818 41605 70235 -937 -10433 89748 106965 108702 65893 37423 47641 77834 113100
14081A13100j9027j5212m7166m3502O795j7656n6197J3837M494O7289K2131M4433
$$ 113100 94073 78861 31695 -11807 -5012 -22668 -78865 -65028 -60534 6755 28886 73319
14069G3319J9967J922n4722o0908k9273k0223K525L5217j1562j5871N7704K0420
$$ 73319 93286 95208 40486 -20422 -49695 -69918 -67393 -32176 -43738 -59609 -1905 18515
14057A8515k5668M984N7952j0146o8835J5387j1499l007k823k3789j2001m065
$$ 18515 -7153 -2169 55783 45637 -23198 -7811 -19310 -22317 -25140 -48929 -60930 -64995
14045f4995j0420N5886L6108n1564n0794L1147K8482m858L4145J0731j9988l4258
$$ -64995 -75415 -19529 16579 -34985 -85779 -54632 -26150 -31008 3137 13868 -6120 -40378
14033d0378N7687K6581n7379o6872m845R1122J03141p388l2622k7203o6513l0762
$$ -40378 17309 43890 -13489 -80361 -85206 5916 109057 101669 69047 41844 -24669 -55431
14021e5431L8972k1856K7668N1951K9104L269j9244k9296m5815K8675k7037n374
$$ -55431 -16459 -38315 -10647 41304 70408 73677 54433 25137 -20678 7997 -19040 -24414
14009b4414P5605o6715l3693O410K7668K9329j5476k5247l4302j2450R0008J7072
$$ -24414 51191 -15524 -49217 -42807 -15139 14190 -1286 -26533 -60835 -73285 16723 33795
13997C3795k7861N1434P760J6074L369l0765J8930N4728q8020q5872p334P7912
$$ 33795 5934 57368 65128 81202 84571 53806 72736 127464 39444 -46428 -53762 24150
13985B4150M2734j3339l027o467j3283J6684k4936p4283N377P871P1722Q2045
$$ 24150 66884 53545 50518 44051 30768 47452 22516 -51767 -46390 -38519 33203 115248
13973A15248K20J7699Q818p7911m5865n8088p05N9552L9181L0441J2897l696n2888
$$ 115248 115468 133167 141985 64074 18209 -39879 -40584 18968 58149 88590 101487 97791 44903
13960D4903j4478k3517J0474K1101P583n2466k1758K9820r304J2411K2646K1041
$$ 44903 30425 6908 17382 38483 46066 -6400 -28158 1662 -7642 4769 27415 48456
13948D8456k2910l5785k0266P3995k079l4075l4576k3321K6038P9661K0954k0823
$$ 48456 25546 -10239 -30505 43490 41411 7336 -27240 -50561 -24523 55138 76092 55269
13936E5269N0055L2903m3657l6772N619L443q2738n0736O44k0255O8075Q6689
$$ 55269 105324 138227 94570 57798 63417 66860 -15878 -66614 -65970 -86225 -18150 68539
13924F8539N321m0664O6995P5701n2991l8802n7449O4L741O309M786l7248m7662
$$ 68539 73860 33196 100191 175892 122901 84099 26650 26714 30455 36764 41550 4302 -43360
13911d3360k361J693m6875K939K1076j6138K0236O1716K0113l4423L2978k0574
$$ -43360 -45721 -44028 -90903 -87964 -66888 -83026 -62790 -1074 19039 -15384 17594 -2980
13899b980l1292N8441J9j445j4695K3553L4975k055l5558m0250p1342L4126R841
$$ -2980 -34272 24169 24188 22743 8048 31601 66576 64521 28963 -11287 -82629 -48503 -38662
13886c8662j6581J1556P2548j0297j7303Q993q128j9560o2526J1987P6714M2059
$$ -38662 -55243 -43687 28861 18564 1261 10254 2126 -17434 -79960 -67973 8741 50800
13874E0800j9168N370J4172l8237J8672J8998l6214J2244O052J4468q120J6093
$$ 50800 31632 37002 51174 12937 31609 50607 14393 26637 32689 47157 39037 55130
13862E5130j179l4751k0590R115K7282M1974j6480k7482k6176k9954K9990L7102
$$ 55130 53951 19200 -1390 7725 35007 76981 60501 33019 6843 -23111 6879 43981
13850D3981J2487m8461j2889q616m8032P3237N9008n237j9691K119m62n7494L344
$$ 43981 56468 8007 -4882 -13498 -61530 11707 70715 65478 45787 47906 47444 -10050 -6706
13837f706N6202J3537L0497j6864l569M262J2241l6140n902L3481Q378p359m0110
$$ -6706 49496 63033 93530 76666 73097 77359 89600 53460 47558 81039 89417 82058 41948
13824D1948k3651J2202N076j7533k4156K8447K4425k879j2535m2506l7254n202
$$ 41948 18297 30499 35575 18042 -6114 22333 46758 43879 31344 -11162 -48416 -53618
$$ [...]
##END NTUPLES=NMR SPECTRUM
##END=
