##TITLE=Analysis number 311098
Compound Code tl 00952
Project Code adrs
Chemist Name endeavour
##JCAMPDX= 6.0         $$ Bruker NMR JCAMP-DX V2.0
##DATA TYPE= NMR SPECTRUM
##DATA CLASS= NTUPLES
##ORIGIN= Bruker BioSpin GmbH
##OWNER= NMR
$$ XWIN-NMR		Version 3.5
$$ Thu Jun 30 14:21:45 2005 GMT Daylight Time (UT+1h)  MAYBRIDGE\NMR@NMR_250MHZ
##.OBSERVE FREQUENCY= 250.131544655141
##.OBSERVE NUCLEUS= ^1H
##.ACQUISITION MODE= SIMULTANEOUS (DQD)
##.ACQUISITION SCHEME= undefined
##.AVERAGES= 16
##.DIGITISER RES= 18
##SPECTROMETER/DATA SYSTEM= dpx250
##.PULSE SEQUENCE= zg30
##.SOLVENT NAME= DMSO
##.SHIFT REFERENCE= (INTERNAL, DMSO, 0, 16.522)
##AUDIT TRAIL= $$ (NUMBER, WHEN, WHO, WHERE, WHAT)
$$ ##TITLE= Audit trail, XWIN-NMR		Version 3.5
$$ ##JCAMPDX= 5.01
$$ ##ORIGIN= Bruker BioSpin GmbH
$$ ##OWNER= NMR
$$ C:\u/data/dgb/nmr/ADRS/5130/pdata/1/auditp.txt
$$ ##AUDIT TRAIL=  $$ (NUMBER, WHEN, WHO, WHERE, WHAT)
(   1,<2005-06-30 14:21:24.41 +100>,<MAYBRIDGE\NMR>,<NMR_250MHZ>,
      <created by zg, POWCHK disabled, PULCHK disabled
       configuration hash MD5:
       62 19 C7 07 E1 42 D1 B7 37 6C 3D D0 77 39 F9 E6
       data hash MD5: 64K
       A3 60 4A 7B 72 38 9F 0B 6A 0A 6B 0B FE F0 17 4C>)
(   2,<2005-06-30 14:21:36.75 +100>,<MAYBRIDGE\NMR>,<NMR_250MHZ>,
      <Start of raw data processing
       ef LB = 0.3 FT_mod = 6 PKNL = 1 SI = 32K 
       data hash MD5: 32K
       FA 9E BE 4F AD A6 12 4E 4C 35 0B 3C 87 86 54 C6>)
(   3,<2005-06-30 14:21:38.57 +100>,<MAYBRIDGE\NMR>,<NMR_250MHZ>,
      <apk 
       data hash MD5: 32K
       BB F9 38 F2 69 AB 17 B1 7B BF 2A CB 9F 4F FA 3B>)
(   4,<2005-06-30 14:21:39.30 +100>,<MAYBRIDGE\NMR>,<NMR_250MHZ>,
      <abs ABSG = 5 
       data hash MD5: 32K
       0B 45 75 86 20 3B CF 7C A0 63 DC 1B BF 57 A9 B7>)
$$ ##END=
$$ 
$$ hash MD5
$$ 40 C8 47 2B 0C CD 57 97 C7 40 C8 A5 C9 24 00 5F
##$RELAX= 
##$RELAX= 
##$RELAX= 
##$RELAX= 
##$RELAX= 
##$RELAX= 
##$RELAX= 
$$ Bruker specific parameters
$$ --------------------------
##$DU= <C:\u>
##$EXPNO= 5130
##$NAME= <ADRS>
##$PROCNO= 1
##$TYPE= <nmr>
##$USER= <dgb>
##$AMP= (0..31)
100 100 100 100 100 100 100 100 100 100 100 100 100 100 100 100 100 100 
100 100 100 100 100 100 100 100 100 100 100 100 100 100 
##$AQSEQ= 0
##$AQ_mod= 3
##$AUNM= <au_zg>
##$AUTOPOS= <49 >
##$BF1= 250.13
##$BF2= 250.13
##$BF3= 250.13
##$BF4= 250.13
##$BF5= 500.13
##$BF6= 500.13
##$BF7= 500.13
##$BF8= 500.13
##$BYTORDA= 1
##$CFDGTYP= 0
##$CFRGTYP= 5
##$CHEMSTR= <none>
##$CNST= (0..31)
1 1 145 1 1 1 1 1 1 1 1 1 1 1 1 1 1 1 1 1 1 1 1 1 1 1 1 1 1 1 1 1 
##$CPDPRG= <>
##$CPDPRG1= <>
##$CPDPRG2= <>
##$CPDPRG3= <>
##$CPDPRG4= <mlev>
##$CPDPRG5= <mlev>
##$CPDPRG6= <mlev>
##$CPDPRG7= <mlev>
##$CPDPRG8= <mlev>
##$CPDPRGB= <>
##$CPDPRGT= <>
##$D= (0..31)
0 1 0 0 0 0 0 0 0 0.06 0 0 0 0 0 0 0.0002 0 0 0 0 0 0 0 0 0 0 0 0 0 0 
0 
##$DATE= 1120137683
##$DBL= (0..7)
120 120 120 120 120 120 120 120 
##$DBP= (0..7)
150 150 150 150 150 150 150 150 
##$DBP07= 0
##$DBPNAM0= <>
##$DBPNAM1= <>
##$DBPNAM2= <>
$$ [...]
##$SUBNAM7= <"">
##$SUBNAM8= <"">
##$SUBNAM9= <"">
##$SW= 20.6930455092707
##$SWIBOX= (0..15)
0 0 3 0 0 0 0 0 0 0 0 0 0 0 0 0 
##$SW_h= 5175.983436853
##$TD= 65536
##$TD0= 1
##$TE= 295.16
##$TE2= 300
##$TE3= 300
##$TEG= 300
##$TL= (0..7)
0 120 120 120 120 120 120 120 
##$TP= (0..7)
150 150 150 150 150 150 150 150 
##$TP07= 0
##$TPNAME0= <>
##$TPNAME1= <>
##$TPNAME2= <>
##$TPNAME3= <>
##$TPNAME4= <>
##$TPNAME5= <>
##$TPNAME6= <>
##$TPNAME7= <>
##$TPOAL= (0..7)
0.5 0.5 0.5 0.5 0.5 0.5 0.5 0.5 
##$TPOFFS= (0..7)
0 0 0 0 0 0 0 0 
##$TUNHIN= 0
##$TUNHOUT= 0
##$TUNXOUT= 0
##$USERA1= <user>
##$USERA2= <user>
##$USERA3= <user>
##$USERA4= <user>
##$USERA5= <user>
##$V9= 5
##$VALIST= <valist>
##$VCLIST= <CCCCCCCCCCCCCCC>
##$VD= 0
##$VDLIST= <DDDDDDDDDDDDDDD>
##$VPLIST= <PPPPPPPPPPPPPPP>
##$VTLIST= <TTTTTTTTTTTTTTT>
##$WBST= 1024
##$WBSW= 4
##$XGAIN= (0..3)
0 0 0 0 
##$XL= 0
##$YL= 0
##$YMAX_a= 402039
##$YMIN_a= -520768
##$ZGOPTNS= <>
##$ZL1= 120
##$ZL2= 120
##$ZL3= 120
##$ZL4= 120
##$ABSF1= 16.522
##$ABSF2= -4.171173
##$ABSG= 5
##$ABSL= 3
##$ALPHA= 0
##$AQORDER= 0
##$ASSFAC= 0
##$ASSFACI= 0
##$ASSFACX= 0
##$ASSWID= 0
##$AUNMP= <proc_1d>
##$AZFE= 0.1
##$AZFW= 0.1
##$BCFW= 0
##$BC_mod= 0
##$BYTORDP= 0
##$COROFFS= 0
##$CY= 12.5
##$DATMOD= 1
##$DC= 0
##$DFILT= <>
##$DTYPP= 0
##$F1P= 14.0000005364418
##$F2P= -0.99999901652339
##$FCOR= 0.5
##$FTSIZE= 32768
##$FT_mod= 6
##$GAMMA= 0
##$GB= 0
##$INTBC= 1
##$INTSCL= 1
##$ISEN= 128
##$LB= 0.3
##$LEV0= 0
##$LPBIN= 0
##$MAXI= 10000
##$MC2= 0
##$MEAN= 0
##$ME_mod= 0
##$MI= 0
##$NCOEF= 0
##$NC_proc= -4
##$NLEV= 6
##$NOISF1= 0
##$NOISF2= 0
##$NSP= 0
##$NTH_PI= 0
##$NZP= 0
##$OFFSET= 16.522
##$PC= 1
##$PHC0= -84.22782
##$PHC1= 4.791746
##$PH_mod= 1
##$PKNL= yes
##$PPARMOD= 0
##$PSCAL= 4
##$PSIGN= 0
##$REVERSE= no
##$SF= 250.13
##$SI= 32768
##$SIGF1= 0
##$SIGF2= 0
##$SINO= 400
##$SIOLD= 32768
##$SREGLST= <1H.DMSO>
##$SSB= 0
##$STSI= 32768
##$STSR= 0
##$SW_p= 5175.98343685301
##$SYMM= 0
##$S_DEV= 0
##$TDeff= 65536
##$TDoff= 0
##$TI= <Analysis number 999999
Compound Code 99
Book Reference 9
Project Code 9>
##$TILT= no
##$TM1= 0
##$TM2= 0
##$TOPLEV= 0
##$USERP1= <user>
##$USERP2= <user>
##$USERP3= <user>
##$USERP4= <user>
##$USERP5= <user>
##$WDW= 1
##$XDIM= 32768
##$YMAX_p= 504533471
##$YMIN_p= -302459
$$ End of Bruker specific parameters
$$ ---------------------------------
##NTUPLES= NMR SPECTRUM
##VAR_NAME=  FREQUENCY,     SPECTRUM/REAL,   SPECTRUM/IMAG
##SYMBOL=    X,             R,               I
##VAR_TYPE=  INDEPENDENT,   DEPENDENT,       DEPENDENT
##VAR_FORM=  AFFN,          ASDF,            ASDF
##VAR_DIM=   32768,         32768,           32768
##UNITS=     HZ,            ARBITRARY UNITS, ARBITRARY UNITS
##FACTOR=    0.157963299565203, 1,           1
##FIRST=     4132.6476996994, 0,             0
##LAST=      -1043.33573715361, 0,           0
##MIN=       -1043.33573715361, -302459,     0
##MAX=       4132.6476996994, 504533471,     0
$$ Real data points
##PAGE= N=1
##DATA TABLE= (X++(R..R)), XYDATA
$$ [...]
14134a29192p6722R69J09161J4611J9731q3882l5673k2888J0224N5787J04456
14123c3418J02900m572k1827J1105R947m7723J889Q485K8755L2953M03N9795n7288
14110I1404j28303N7377p630l6414k2343p9303L1495J9343N9996K2816j0267p6984
14098g8813r6083K1431M5451L6276p998K517L435m0947j9004n1431K2521L6462
14086a26183O9376J4791k5857k8774j1081J9220j2316P7563R803m0870J2220M0005
14074b103l7627n613P2728j8127p6519j095K5911R0757M5722L1928n2229o6502
14062G231R157o1058n4481k6580j609j4074K0906P2899N6802M6041O2078j12693
14050D619n0860l9192n5492O0361L8103K4297k0918j40399m970N5030L0496n0744
$$ y = [-129192, -205914, -204945, -95784, -81173, -61442, -145324, -180997, -203885, -193661, -137874, -33418, 69482, 64910, 43083, 54188, 64135, 16412, 18301, 26786, 55541, 88494, 88897, 148692, 91404, -36899, 20478, 12848, -23566, -45909, -125212, -93717, -74374, -14378, 8438, -1829, -78813, -174896, -153465, -108014, -71738, -79736, -77219, -73784, -114731, -133735, -185166, -162645, -126183, -56807, -42016, -67873, -96647, -107728, -88508, -100824, -23261, -13458, -54328, -42108, -2103, -39730, -45343, 27385, 9258, -67261, -68356, -42445, 48312, 94034, 125962, 73733, 7231, 16388, -44670, -99151, -125731, -127340, -141414, -120508, -47609, 9193, 55234, 117312, 4619, -46241, -85433, -140925, -80564, -42461, -18164, -39082, -179481, -184451, -129421, -98925, -149669]
14038a49669N5441P5173J13862n4845m8460p1187m3459K750O0594M2410N4365
14027C6975j6335p6797o8054l2434L8689o020L13P9775Q8839K7405p725m6494
14015A8137r7250l751L1756M455L2698k7103o0944K1127o544R4993P3690O4056
14003A45320K4955p7251n4610R934p001l7167j04654L1878L165J7154J8574j7874
13991d7577N593K8711o012M030L3594l0405l1698M5793k9827M9423J2064q7092
13979e3403m8596k6863R9732P0416r6775n3432K4134l9803j5869Q3363J7118L9643
13967c35o3476j5310m5677l3466k0760O3537L343L4936J4655L5664P845J1204
13955g840p1081o4115N4415M6677J959k6604L1787o7610m4737M9619K5791N9410
$$ y = [-149669, -94228, -19055, 94807, 39962, -8498, -79685, -123144, -120394, -59800, -17390, 36975, 20640, -56157, -124211, -156645, -117956, -123976, -123663, -43888, 44951, 72356, 64631, 18137, -79113, -82864, -51108, -46653, -13955, -41058, -102002, -80875, -87419, 7574, 81264, 145320, 170275, 93024, 38414, 48348, 41347, 4180, -100474, -68596, -65431, -48277, -29703, -47577, -41984, -13273, -19285, -15255, 18339, -12066, -43764, 2029, -27798, 21625, 33689, -53403, -101999, -128862, -29130, 41286, -55489, -108921, -84787, -124590, -140459, -57096, -39978, -335, -63811, -79121, -124798, -158264, -179024, -115487, -112144, -77208, -62553, -26889, -19044, -7840, -78921, -143036, -88621, -41944, -39985, -66589, -34802, -102412, -147149, -97530, -71739, -12329]
13943a2329N9397o4960j07125n6561J6923R5653R737r205M9953O9890L1116L3385
13931A15874o657N0384N3400m1405r6145n0193O4976L8622m9310q1132k8264k163
13919c2013n9784L2414M6468p4486q206P9739n8406j4196J0286J7862O0419l524
13907c427m3212K0945O71q2378N0774J10023J24792j08583o0887R83l4302M6715
13895B2114M6586l1378p078n0756l9648m5969J0860J3636k05J4839M1196j879
13883b7682J8692l5032J1710r6873r8169J3006L7078m5280j6842L8034K4394j4655
13871a91619Q7511N3128l570M3933p158o8143k0432P2191N4085L0767L3711m4784
13859C9620o2209j5512p854L9387J9176m8205K7451k4100l5881j4362M9998R2624
$$ y = [-12329, 47068, -17892, -125017, -181578, -164655, -69002, -59265, -68470, -18517, 51373, 82489, 115874, 109217, 159601, 213001, 171596, 75451, 25258, 90234, 128856, 79546, -1586, -29850, -32013, -91797, -59383, -12915, -87401, -95607, -15868, -74274, -88470, -78184, -60322, 97, -3427, -46639, -25694, -25023, -107401, -56627, 53396, 178188, 69605, 8718, 9701, -24601, 22114, 68700, 37322, 30244, -20512, -60160, -106129, -95269, -81633, -81838, -66999, -25803, -27682, -8990, -44022, -32312, -129185, -227354, -214348, -177270, -222550, -239392, -201358, -176964, -191619, -104108, -50980, -54550, -10617, -17775, -85918, -106350, -34159, 19926, 50693, 84404, 39620, -22589, -38101, -45955, -6568, 12608, -35597, -8146, -32246, -68127, -82489, -32491, 60133]
13847F0133j0418J6028p1347n8329K9020L4935k9293J2300K2050l4721j2695j7393
13835e9730l4344p5337J3823L0109K1402l1445P1945m4860o6830J4953j9533K512
13823a77335K5034J0702N6612J19533m1858q2688O2897J31172M390o7315r435
13812C1709K0669n2650M5176K4673O1922J4680p3555n8404m1518p8217N7405l1379
13800g9489l120M9093j0617J1132O3728L80L4221O83N9884m6176j28331K9374
13788a9238P2159m3147k6272n9247J9910K475J2989L0764j608N0969N6838n2640
13776D3952j7133n2913p727L0309m0935m4350Q7980K5963k5338n2878N3395O1714
13764F2039q6805j2388m2869K1748j7618k0845j9314q7678J2388Q6787m9248l7654
$$ y = [60133, 49715, 65743, -5604, -63933, -34913, 22, -29271, -16971, 5079, -29642, -42337, -59730, -94074, -169411, -155588, -125479, -104077, -135522, -63577, -108437, -175267, -160314, -179847, -177335, -152301, -141599, -84987, 34546, -7312, -90000, -27103, 104069, 108459, 41144, 31709, 52378, -272, 44904, 69577, 131499, 146179, 72624, 14220, -27298, -105515, -48110, -79489, -82609, -33516, -44133, -33001, 30727, 31107, 65328, 66011, 125895, 79719, -48612, -19238, 52921, 9774, -16498, -75745, -55835, -53360, -40371, -9607, -11215, 39754, 96592, 43952, 26819, -26094, -33821, -3512, -44447, -88797, -817, 25146, -192, -53070, 325, 62039, -24766, -37154, -80023, -58275, -75893, -96738, -116052, -203730, -191342, -104555, -153803, -191457]
13752a91457j5381O9302L2670P6436M1704r7896p7728M0747J9050L8928j7613
13741h1238O2149N7707n67J8263j2142J0495p2061q084k2073l1736N8872k3420
13729d3835k9199k6451K1887K6571J372N2122p088J671p077N2594L3849q4782
13717h366l4759m0241L8936M4709p4096r6660M2074O1341J6473M8088k3498m0953
13705f6952j09246k6963N1113O6269r502n297n245m1630L0537L9439K0560m0018
13693i6935m352k9539J5407J25233P6230k3956m1949j3776k8598l7969n1186l3221
13681a44611J05572N2788K100j6931j5308k8507l1702L0564k2540K0038n857N7998
13669C604j856n8855L2383P8770m1871k22l9755J9807K481K4974K9585l2208J8186
$$ y = [-191457, -206838, -137536, -104866, -28430, 13274, -84622, -162350, -121603, -102553, -63625, -81238, -19089, 38618, 38051, 56314, 44172, 54667, -17394, -25478, -47551, -79287, -20415, -43835, -73034, -99485, -77598, -51027, -49655, 2467, -4621, -2950, -10027, 42567, 76416, -8366, -43125, -83366, -44430, 279, -73817, -170477, -128403, -67062, -50589, -2501, -25999, -66952, -176198, -203161, -152048, -85779, -95281, -100578, -105823, -147453, -116916, -77477, -56917, -96935, -101287, -130826, -115419, 9814, 86044, 62088, 20139, 6363, -22235, -60204, -111390, -144611, -39039, 13749, 15849, -1082, -16390, -44897, -76599, -46035, -68575, -48537, -54394, 3604, 1748, -57107, -24724, 54046, 12175, 11953, -27802, -7995, -5514, 19460, 49045, 16837, 35023]
13656C5023J3416m8761k8598N4167q7331q3289K2310Q6430M6282j7897n3065K3974
13644c7339p463k033L7175J6452k5969o8698l4143J00393J04337K5496k4137k9300
13632E4771j2693J6252m8366p4533M3075l5600l1381R574J5459m144p0648n376
13620a43610J9633O6688N7865M555o9362O830O976m1417O2455k5245m6679m5147
13608a46458O4535P7890L1585n4476l6815l5407L6168Q46m1967J8437K4424m7674
13596a08912J2532K9863m8141j03285k6651P439P2332q116J6251M5827P794k3448
13584a26515r6477n6122j6973O8464J15166M0928r617m7672l6609K5882K2173
13573a17372L0638j5388m1033P0544N2952K255J1392k1047M717j1454J5785N8950
$$ y = [35023, 48439, -322, -28920, 25247, -62084, -145373, -123063, -36633, 9649, -8248, -61313, -37339, -44802, -46835, -9660, 6792, -19177, -87875, -122018, -21625, 82712, 108208, 84071, 54771, 42078, 58330, 9964, -64569, -21494, -57094, -88475, -78901, -63442, -67586, -138234, -143610, -123977, -57289, 576, 5131, -64231, -57401, -50425, -91842, -29387, -54632, -101311, -146458, -81923, -4033, 27552, -26924, -63739, -99146, -62978, -62132, -104099, -85662, -61238, -108912, -96380, -66517, -114658, -217943, -244594, -237155, -164823, -172939, -156688, -110861, -103067, -126515, -222992, -279114, -296087, -227623, -112457, -71529, -81146, -128818, -165427, -139545, -117372, -86734, -102122, -143155, -72611, -19659, -17404, -6012, -27059, -22342, -33796, -18011, 40939]
13561D0939k5309l9252n009n3305n9391K5643J15061L5277L3101M9786M7452l6799
13549A28194j35212q5453o285M1148p2333L7897R379L7527L0954O954l595k3326
13537c4151k516L9565j9452O4580J2835k4834L3877O676m2461k8980m2345J4579
13525b2627L6546j9099n4476k7398O6110J2613j15516m4142M2119M8475P5321
13514b074k138K4423p6530k1057J8M6774o0952k9805j37R559j7995l5050O892
13501a58072q884L0183Q3074L1668Q3695j8755j9381L033l6652o1146m9188n6507
13489a76932N8400P2942L8115M6473M4881p4034k7640m1255J8047M13m8869k5233
13477a14692M8412O1896N0001K9078M1838j0230l8897r6055K2834Q6935R1134
$$ y = [40939, 15630, -23622, -28631, -81936, -141327, -115684, -623, 34654, 67755, 117541, 164993, 128194, -7018, -92471, -98756, -57608, -129941, -92044, -82665, -45138, -14184, -7230, -10825, -34151, -36667, 2898, -16554, 48026, 60861, 36027, 69904, 76580, 34119, 5139, -37206, -22627, 13919, -5180, -59656, -87054, -20944, -8331, -123847, -167989, -125870, -77395, -2074, -4212, 20211, -56319, -77376, -77358, -30584, -91536, -121341, -121478, -111919, -129914, -164964, -158072, -166956, -136773, -53699, -22031, 61664, 42909, 23528, 26561, -10091, -71237, -120425, -176932, -118532, -45590, -7475, 38998, 83879, 9845, -17795, -59050, -41003, -40590, -89459, -114692, -66280, -4384, 45617, 74695, 116533, 106303, 67406, -28649, -5815, 81120, 172254]
13466A72254k87j34112q2138L3789k4939o8913O6148R0237j754P177K047l8281
13454B1228L9071M3077O8048L6887j01449k6324L97j7109p394m8991m9016j9592
13442f1167P002L1039m4592k0754J6482k6088K5907L9302R9201L9717k307J5646
13430A19388J0515j2924n1656o3769n9736J1660O0113N4217o3386k6426n8188
13419h0192O5815M1043L2135L4416K235j27359j0419K8594O4963Q7973J4121p7883
13407G5442q1084L7142J428l513l2844o174M5048P5499o8578J8503K1234n6439
13395B5664p018n511n5370j1607O3714O0756J2950J7737o1442R213K3945O0064
13383A33095K2470r4556K7104Q2065j04185n5741K4705p453N626M4240O3612N414
$$ y = [172254, 171967, 37855, -44283, -10494, -35433, -104346, -38198, 52039, 50285, 57462, 59509, 21228, 60299, 103376, 171424, 208311, 106862, 80538, 80935, 63826, 56432, 7441, -41575, -61167, -54165, -23126, -67718, -88472, -71990, -98078, -72171, -32869, 66332, 106049, 103742, 119388, 129903, 116979, 65323, 1554, -58182, -46522, 13591, 67808, 4422, -22004, -80192, -14377, 26666, 58801, 93217, 95452, -31907, -42326, -13732, 51231, 139204, 153325, 75442, -5642, 31500, 32928, 29415, -3429, -9603, 35445, 110944, 42366, 60869, 82103, 25664, 18646, 13135, -42235, -53842, 9872, 70628, 83578, 101315, 39873, 49086, 73031, 133095, 155565, 61009, 88113, 170178, 65993, 10252, 34957, 27504, 33130, 77370, 140982, 146396]
13371A46396N4811M3000P4902K7470m7899j11973n5342N026l5257j2330K760r221
13359H2343j69J6308l559j2352Q0439M6713q164K3216k3226k5016n8185L1506
13347A49854P5293l2109n018P9876m648o073o2055k5165k7112M790J4197M2969
13335B04799n4449k7157N1924P304l3423j8321k9504j29960k0941J35015K9346
13324A14633j2435L1935m368n0642q5758k6822O6768K7809K000O8461K6720n9246
13312I9055j02246L4891O5305k8314n0070q8946j9877L6574K0924O659j8027k0365
13300f4437J65121N0641K0767p774p9840r2421k1834N3919M3718l2331o998P2492
13288A01023l7231q1697l8080m2062J7609M9663K0083N4230K0003l1031k3366
$$ y = [146396, 201207, 244207, 319109, 346579, 298680, 186707, 131365, 136391, 101134, 88804, 91564, 82343, 82174, 98482, 94923, 82571, 163010, 209723, 201559, 224775, 201549, 176533, 118348, 149854, 225147, 193038, 188020, 267896, 263248, 257175, 195120, 169955, 142843, 147633, 161830, 204799, 150350, 123193, 175117, 182421, 148998, 130677, 101173, -28787, -49728, 85287, 114633, 102198, 134133, 129765, 79123, -6635, -33457, 33311, 61120, 63120, 131581, 158301, 99055, -3191, 31700, 97005, 68691, 18621, -70325, -90202, -53628, -32704, -26045, -44072, -64437, 100684, 151325, 172092, 164318, 84478, -7943, -29777, 24142, 67860, 35529, 28531, 101023, 63792, -17905, -55985, -98047, -80438, -30775, -10692, 43538, 63541, 32510, 9144]
13277I144N4301O12q7373k8065J25572Q3257p00K2105K4529k5560j20860m5332
13265A1630j0363m3303m0700P181m2840J3404J48024L7217l8467L7540J1988k7442
13253F3869r5531L2172L5935J9444K9106j1763k0825m4937N7270N1512l5292Q4668
13241A65628L4329m4341J6710j6992r8926q1993M1089M2113M26o2176J5585O5058
13229G6510L2222K4055J0338o4069l7491m2960l8241P6527J48534o1662l9742
13218H4021N1421Q4886L6010q0578n9751o9385p15k1217j2319j2181p7437P5458
13206a787Q500O448Q107L4125P5863J5501m1964n6133l2587M6918M3086m3859
13194F2218l4762n9129Q7147R7095k4419K3540R604j0417m5992O998Q8425k4426
$$ y = [9144, 63445, 64057, -23316, -51381, 74191, 157448, 156748, 178853, 203382, 177822, 56962, 11630, 1267, -42036, -82736, -75555, -118395, -104991, 43033, 80250, 41783, 79323, 91311, 63869, -31662, 510, 36445, 55889, 84995, 73232, 52407, 7470, 64740, 116252, 80960, 165628, 199957, 155616, 172326, 155334, 56408, -25585, 15504, 57617, 58043, -4133, 11452, 76510, 108732, 132787, 143125, 79056, 41565, -1395, -39636, 36891, 185425, 123763, 84021, 135442, 220328, 256338, 175760, 116009, 46624, 45909, 24692, 12373, 192, -77245, -1787, 6713, 13161, 21268, 55393, 131256, 146757, 104793, 48660, 16073, 62991, 106077, 62218, 27456, -31673, 55474, 152569, 128150, 151690, 161294, 150877, 104885, 111883, 200308, 175882]
13182A75882L445Q551k0477N3873R8183k2705o1508p9167m5617N1903p6020n9813
13170B6530P7168Q9801O6200l8880J4244l6988j5231K1937m7391j5832P1502l6416
13158A76644K5335P6158r705K5070k1722M9867n119l2029j2300l9689p1803n0848
13146A09859K6524j421J4878J1503K6243L9417M6257K88P4073q610m0924K5001
13134C23088N4818J17382m4974j1547l282P2264r347k452L3335J8935n1294k9506
13122D67420r8163j1953O6029P2802L3614j4666j4823J0575L4715P1733N8648
13111F75931j5974o5812k5812K3654j690j8062j271m1880P909P380M7831N4282
13099F46486M6789k2071L4788J13529J5393j838J9325R6777J6944q4686r653L2113
$$ y = [175882, 179327, 187878, 167401, 221274, 319457, 296752, 235244, 156077, 110460, 162363, 86343, 26530, 103698, 193499, 259699, 220819, 235063, 198075, 182844, 204781, 157390, 141558, 213060, 176644, 201979, 278137, 268432, 293502, 271780, 321647, 316528, 284499, 272199, 232510, 160707, 109859, 136383, 134962, 149840, 161343, 187586, 227003, 273260, 273548, 347621, 339011, 298087, 323088, 377906, 495288, 450314, 438767, 435485, 507749, 498402, 495950, 529285, 548220, 496926, 467420, 369257, 357304, 423333, 496135, 529749, 515083, 500260, 510835, 545550, 617283, 675931, 659957, 594145, 568333, 591987, 590297, 572235, 570964, 529084, 536993, 544373, 592204, 646486, 693275, 671204, 705992, 819521, 834914, 833076, 852401, 949178, 966122, 881436, 871783, 903896]
13087I03896R639J0939Q846R9033N0699k1512J02816M9610m380J7104J5033J07225
13075A348948K3144L1053j764J1688N3828M9376M6506Q9019J4064j7094N7091
13064A705859J12937R803J08080J82034Q5719M3715M9881J3955J62571R9251J17542
13053B691347J42983J0837L4115J35173J76929J65903K00944K88153J84178J88385
13043D218947J31515K16020K16738K64428K54113K05385K09421J13799J73214
13034F003580K84266L40947L55843K59698K28639L10817M06393L58579K11166
13025H759928K11533K57324K45687K49900K57377K92118K69770L37746L60683
13016A1242066K73594L03344K60065K24205K24435K21477K00391K40564J68391
$$ y = [903896, 913535, 924474, 933320, 1032353, 1083052, 1061540, 1164356, 1213966, 1209586, 1226690, 1241723, 1348948, 1372092, 1403145, 1401381, 1413069, 1466897, 1516273, 1562779, 1651798, 1665862, 1648768, 1705859, 1818796, 1828599, 1936679, 2118713, 2204432, 2248147, 2298028, 2311983, 2474554, 2573805, 2691347, 2834330, 2845167, 2879282, 3014455, 3191384, 3357287, 3558231, 3846384, 4030562, 4218947, 4350462, 4566482, 4783220, 5047648, 5301761, 5507146, 5716567, 5830366, 6003580, 6287846, 6628793, 6984636, 7244334, 7472973, 7783790, 8190183, 8548762, 8759928, 8971461, 9228785, 9474472, 9724372, 9981749, 10273867, 10543637, 10881383, 11242066, 11515660, 11819004, 12079069, 12303274, 12527709, 12749186, 12949577, 13190141, 13358532]
13007A3358532K24887K37766L36423J65510R2554J02268J44397N8092P3491Q6852
12997A4880772J44891J41006R3582M1306P4634P1787m8793r1385o0801l5041n9216
12986A5152742q6116j03249n6722p0683n0548k5987j09667j13250n4992j70969
12976A4310559j24827K7878j16512j63039j85829k25737j24453n7926q5224j35198
12966A3119692p950j3314j54434j24367N7734M7982q960k5644j5859m3218M7544
12955A2879206O7703Q5872O7804Q8351J52200P0213P9698N6920J19750J80687
12945A3848404J48181J61345J95437K03911J28864R4528Q8910J64085J15815K27294
12935A5376774K24691J71627M6128J72162K48545J43207J17984R3027J68868Q3356
$$ y = [13358532, 13583419, 13821185, 14157608, 14323118, 14415672, 14517940, 14662337, 14720429, 14793920, 14880772, 15025663, 15166669, 15260251, 15301557, 15376191, 15447978, 15399185, 15307800, 15246999, 15211958, 15152742, 15066626, 14963377, 14906655, 14835972, 14785424, 14759437, 14649770, 14536520, 14481528, 14310559, 14185732, 14213610, 14097098, 13934059, 13748230, 13522493, 13398040, 13340114, 13254890, 13119692, 13111742, 13098428, 12943994, 12819627, 12877361, 12925343, 12916383, 12890739, 12874880, 12831662, 12879206, 12946909, 13032781, 13100585, 13188936, 13341136, 13411349, 13491047, 13547967, 13667717, 13848404, 13996585, 14157930, 14353367, 14557278, 14686142, 14780670, 14869580, 15033665, 15149480, 15376774, 15601465, 15773092, 15819220, 15991382, 16239927, 16383134, 16501118, 16594145, 16763013, 16846369]
12925A6846369J13828J58429J72060N7885O4543Q9667J28215L8598j9244j1989
12915A7638361j4855k2481j30317r6759l0434j7433j03673j54984j56926r5195
12905A6815304l9152j02964k36077j80253k19393k36674k46087q0661j73149k00711
12895A5100183k05139k88612k71297k09799k08434k85931l09722l32464k61026
12886A2727759k06771l17521l30698k59912k12662k77539l28108k45895k79064
12877A0269589k21144j96280j94046j28066k05383k51652k62412k38933k49112
12868H322561j88266j00399k08467k48469q6325j68320k67567k27663k28089k55848
12858F343148k48586j49921j09339j08726p6663m9452j50272j48945j58172j95749
$$ y = [16846369, 16960197, 17118626, 17290686, 17348571, 17413114, 17502781, 17630996, 17669594, 17650350, 17638361, 17623506, 17601025, 17470708, 17373949, 17343515, 17326082, 17222409, 17067425, 16910499, 16815304, 16776152, 16673188, 16437111, 16256858, 16037465, 15800791, 15554704, 15474043, 15300894, 15100183, 14895044, 14606432, 14335135, 14125336, 13916902, 13630971, 13321249, 12988785, 12727759, 12520988, 12203467, 11872769, 11612857, 11400195, 11122656, 10794548, 10548653, 10269589, 10048445, 9852165, 9658119, 9530053, 9324670, 9073018, 8810606, 8571673, 8322561, 8134295, 8033896, 7825429, 7576960, 7490635, 7322315, 7054748, 6827085, 6598996, 6343148, 6094562, 5944641, 5835302, 5726576, 5649913, 5600461, 5450189, 5301244, 5143072, 4947323]
12848D947323j13099j77891j67067j45080j21978j48456j24003j03766q7796j03337
12838C654850j16456o7314p4758j06922j13099j85971r4224K2238L2062q1796
12828B868610j08370j15431o8975n2686n6814j6166l2996o2342j57985j44678
12818B052167j20856J07405N3740m0946j18053o6657l1570o6130n1053l327j3546
12807A701174n3285j7532r0058l4295l0183p3080M8036l1853p268L252n1184j28713
12795A235011n2867O8625J3519o3921j2229P4206l7239k4770J48J0377p5812k4770
12783A110278j23407o6278j7720m3649L364O7079P7622j8892j4442J56j0809K2584
12771I85886J4949j01838r9986J3651K7951m631n3664k3491J5866K1290R9786
$$ y = [4947323, 4834224, 4656333, 4489266, 4344186, 4222208, 4073752, 3949749, 3845983, 3758187, 3654850, 3538394, 3471080, 3396322, 3289400, 3176301, 2990330, 2896106, 2918344, 2950406, 2868610, 2760240, 2644809, 2575834, 2523148, 2466334, 2450168, 2417172, 2354830, 2196845, 2052167, 1931311, 2038716, 2092456, 2051510, 1933457, 1866800, 1835230, 1769100, 1718047, 1714720, 1701174, 1647889, 1630357, 1540299, 1506004, 1475821, 1402741, 1450777, 1418924, 1411656, 1414908, 1363724, 1235011, 1182144, 1250769, 1264288, 1200367, 1188138, 1262344, 1225105, 1200335, 1200483, 1210860, 1135048, 1110278, 986871, 920593, 902873, 859224, 862588, 929667, 1007289, 988397, 973955, 974111, 963302, 985886, 1000835, 898997, 799011, 812662, 840613, 835982, 782318, 758827, 774693, 795983, 895769]
12760H95769j0907o5475j35327q8381P2638O7227r713m8837n0682o1141M4883
12749F10054N3708n481K0274q461p4669J3903L6569M2819p0065j07536l8575Q1866
12737E54406J617M5390k4305l3368K5571j2908j3632m3326P0155L4531K6864L090
12725F34085O450o3692J5088k8145N063p3624o8547j22405O241P1352K9871J6326
12713D28063K2593L667n2671K2446P2961q1080l2068l4614J158K0875m3836Q804
12701C36298N4351J8153K3495P4113p780J605o801k5778j9828m4434m1569l2030
12689C29795k2822l7578N7963n1296k8773R3715Q9747p1494j01914l4420j6074
12678B06849N9477n304m0082j5376o1590P565J12778N5917k1995O294n5915m5632
$$ y = [895769, 884862, 819387, 684060, 595679, 668317, 735544, 725831, 676994, 626312, 565171, 610054, 663762, 658281, 678555, 670094, 595425, 609328, 645897, 688716, 618651, 511115, 472540, 554406, 556023, 601413, 577108, 543740, 569311, 556403, 542771, 499445, 569600, 604131, 630995, 634085, 640535, 576843, 591931, 563786, 568849, 495225, 426678, 304273, 310514, 381866, 411737, 428063, 450656, 454323, 401652, 424098, 497059, 415979, 383911, 349297, 350455, 371330, 327494, 336298, 390649, 408802, 432297, 506410, 498630, 500235, 493434, 467656, 447828, 403394, 361825, 329795, 306973, 269395, 327358, 276062, 247289, 341004, 430751, 359257, 257343, 222923, 206849, 266326, 261022, 220940, 205564, 143974, 151539, 264317, 320234, 298239, 304533, 248618, 202986]
12666B02986L6168J8779O9023j8574M7660L8497J5856m9236q1899l6398N5812
12655B98674M5352J8614M2223n8494n3119L1173n4713R244K736m3084r9990l452
12643A35164P471j4123L6171L5372J5448o390p5080K3002K7166l8371M5950K6317
12631B18097n028o942O657K937j3303M2028l198p258K8558m6586M8042O2859O141
12618C33004j4322M818N4664N9674j4326j2861o5310j06080m4078J03240K874
12607C01297Q0435P2567n7177N6988j1637j3751o7580O324M4547P8792M3270j02605
12595D31470r4891j1084m708k8111J2687j0357P3241R1602l4346n2515L1717N8151
12583D62856N7250m6239k5470K353Q194k3371J2846K0513j8043k367O7073O1194
$$ y = [202986, 239154, 257933, 326956, 308382, 356042, 394539, 410395, 361159, 279260, 242862, 298674, 344026, 362640, 404863, 346369, 293250, 324423, 269710, 278954, 281690, 238606, 138616, 135164, 142635, 128512, 164683, 200055, 215503, 209113, 134033, 157035, 184201, 145830, 191780, 218097, 213069, 206127, 212784, 215721, 202418, 244446, 241248, 233990, 262548, 215962, 264004, 326863, 333004, 318682, 323500, 378164, 437838, 423512, 410651, 345341, 239261, 195183, 298423, 301297, 381732, 454299, 397122, 454110, 442473, 428722, 361142, 367466, 412013, 490805, 534075, 431470, 336579, 325495, 320787, 292676, 305363, 295006, 368247, 459849, 425503, 372988, 404705, 462856, 520106, 473867, 448397, 450750, 458944, 435573, 448419, 468932, 450889, 448522, 515595, 576789]
12571E76789j509j04928q3621l1435j4415l45J5178N8149O2404j2378q3845j6746
12559C63298J1121K4932L0835O2732O9909L8667o7216r5423J20578O6364o784
12548F19013K2445n279n9832n6094o0345k8556O5695K6688j2699m355j1043m2545
12536D53093j133K8965O9043n7043n1249m28M5347j3668R403N1589k6948q8764
12524D18207M3361M9966o1942j02399p3162O867J7925P4742Q6210P0180k893J9646
12512E46708k5250r7521N100m7722l1245n5399o1552q7364J439L2170q331L2026
12500B03059N2932L1652M2732r81k4682j082M5869k88k0891N663n3178m6109J07219
12487C41915M5472q432j1432k1067J0717k5437q2177j8137N7250o638j2082J8548
$$ y = [576789, 575280, 470352, 386731, 355296, 340881, 340536, 355714, 413863, 476267, 463889, 380044, 363298, 374419, 399351, 430186, 492918, 562827, 601494, 534278, 438855, 559433, 625797, 619013, 641458, 636179, 576347, 520253, 459908, 431352, 497047, 523735, 511036, 506681, 495638, 453093, 451960, 480925, 549968, 492925, 441676, 441248, 486595, 472927, 482330, 533919, 506971, 418207, 461568, 511534, 449592, 347193, 274031, 280898, 298823, 373565, 459775, 529955, 527062, 546708, 521458, 423937, 429037, 381315, 350070, 294671, 233119, 145755, 147194, 179364, 171033, 203059, 255991, 287643, 330375, 329394, 304712, 303630, 349499, 349211, 328320, 333983, 280805, 234696, 341915, 387387, 378955, 367523, 346456, 357173, 331736, 249559, 231422, 288672, 282034, 269952, 288500]
12475B88500o3741r015K7718O1654j191j4831m7076j7428j0898k5039k5605O8603
12463B31651O4293l2329k4708n2981O971K2785l9803J9521N4936k8580M5523P711
12451B74990p0954q4134J1071l0301m1723M1634R0668M2372m8734L576L8813K2955
12439B50233L4560q3697j7313Q0478l1570n4777m7456k4312J3573M2690L6099
12428A98508o6377r3338l3095n3893P012j5741R5780m5233m4175L5943L7729r534
12416A3586j4214m0137L2172m9529Q888N1504q815L6490N5140p7j3249j8207K8254
12403H1806j0803K2667r417P4939M685n9413k5127M0668L5537q6732K0538J11666
12391B01014N9526m3461j00301n0415M0000K2647r9425m8055j7521n547J09287
$$ y = [288500, 224759, 215744, 243462, 305116, 303925, 289094, 242018, 224590, 213692, 188653, 163048, 231651, 295944, 263615, 238907, 185926, 192897, 215682, 175879, 195400, 250336, 221756, 267279, 274990, 204036, 119902, 130973, 100672, 58949, 100583, 191251, 233623, 184889, 188465, 227278, 250233, 284793, 201096, 183783, 264261, 232691, 177914, 130458, 106146, 119719, 162409, 198508, 132131, 38793, 5698, -48195, -41183, -56924, 38856, -6377, -50552, -14609, 23120, 13586, -628, -40765, -8593, -58122, -49234, 2270, -6545, 29945, 85085, 85008, 71759, 53552, 81806, 71003, 93670, 84253, 159192, 163877, 104464, 79337, 120005, 155542, 68810, 89348, 201014, 260540, 217079, 116778, 66363, 106363, 129010, 29585, -18470, -35991, -41538, 67749]
12380F7749l1678k9209l2508P8244O5005P282m3058p8917m9745J3240M5669l0159
12368a8085N4792j622m5876j0459K1713N2221J624m956O3519p0051q4901L6947
12356e134p21j9435P0987M8354N8160P1549K8736n9517j02851j7829m2657j7914
12344A1728m2960J9363P636Q816O5105M5984L7238k5699l6610M493l9088m7131
12332H875j3636j5556m8675o376O6052k0888n1165m6308L1374O0044J6896o5039
12320h4402J2216K2672J6907L194R757L6712K2211K824k8391m1375O4482J8688
12308E5495j0252l6978o1466k8002Q1444L7907K3026j06224J2266J7021j7437
12297c3200l5390j7337O6469O5471L5154m8665o5884L8277l3510J976J5540J6371
$$ y = [67749, 36071, 6862, -25646, 52598, 117603, 124885, 81827, 2910, -46835, -33595, 12074, -18085, 36707, 35085, -10791, -21250, 463, 52684, 54308, 49352, 112871, 42820, -42081, -5134, -5855, -25290, 45697, 94051, 152211, 223760, 252496, 192979, 90128, 72299, 29642, 11728, -31232, -11869, -4233, 4583, 69688, 115672, 152910, 127211, 90601, 95094, 56006, 8875, -4761, -20317, -68992, -75368, -9316, -30204, -81369, -127677, -96303, -36259, -19363, -84402, -72186, -49514, -32607, -29413, -19656, 17056, 39267, 42091, 13700, -27675, 36807, 55495, 45243, 8265, -53201, -81203, 241, 38148, 61174, -45050, -32784, -15763, -33200, -68590, -85927, -19458, 46013, 81167, 32502, -33382, 4895, -28615, -26639, -11099, 5272]
12285E272m2844k2233J6885K5535J9165J1264J3445R3553O3200n6480k1824n5657
12273D9281n1506M3490M8894l5304K4671m1391m9169p051l1702L7588j2090k8263
12261e2552L0535P7079L8665m5088o2310J8170p523o9882j1562N2508J01116K8257
12249I7413K30j35957j13166m729l5002J25534K8043K4666N4449m8072o4535J1108
12237f0018j8591m8614L9963P4757K9292M0580K3333K6071j28262l4458M8399
12226g548L8563R5971O1115q631n356K4696N942J6469K7151q1034j01153M5676
12214A11861m8680j3479Q9155r7412l1946J6502m2610m338N8420l3757l807L6301
12202C6210M4018P810o1877j11830l0401M9371J61145O5914l8135k1987l1736
$$ y = [5272, -37572, -59805, -42920, -17385, 1780, 13044, 26489, 120042, 183242, 126762, 104938, 49281, -2225, 41265, 90159, 54855, 79526, 38135, -11034, -18085, -49787, -12199, -24289, -52552, -22017, 55062, 93727, 48639, -13671, 4499, -3024, -72906, -84468, -31960, 69156, 97413, 97643, -38314, -151480, -156209, -191211, -65677, -37634, -12968, 41481, -6591, -71126, -60018, -78609, -127223, -87260, -12503, 16789, 57369, 80702, 106773, -21489, -55947, -7548, 31015, 126986, 188101, 179470, 174114, 198810, 204752, 221221, 248372, 167338, 66185, 111861, 63181, 49702, 138857, 41445, 9499, 26001, -16609, -20947, 37473, 3716, -91, 36210, 80228, 88038, 26161, -85669, -116070, -66699, 94446, 160360, 122225, 100238, 68502]
12191F8502m7230n4549R0914n8689j9697Q306N5641K9080M8335K5713K8L9709
12179A86063Q8513j4562L143j0587J3093P4730Q5485j0334j09088o6278q735J3070
12167B44513L2372n8846k574j28507r6120J04209K9074o5738n3555n6345k3170
12156g4687M025O053j742J5918k8618M6119M9619J9512j2074j6854l340o9417
12144f5486l8704M3753j7104O701O9563N999K4534k744J9317k9360K5746J2351
12132E4566n7807J553k3468L2774L1251q3566p4103M8339J2396o509K6572L3663
12120d339L2667K1388J0354R1727k8631n9669J2695R813K1112J4810K7160m3873
12108A05214m1433j0011k8043O1861j1827k6464n6756J0634j3089o5857K1081
$$ y = [68502, 21272, -33277, 57637, -1052, -20749, -12443, 43198, 72278, 120613, 146326, 146354, 186063, 274576, 260014, 263157, 252570, 265663, 340393, 425878, 415544, 306456, 240178, 231443, 244513, 276885, 218039, 215465, 86958, -9162, 95047, 124121, 58383, 4828, -51517, -74687, -70662, -64609, -66351, -50433, -79051, -32932, 16687, 36199, 24125, 7271, 3931, -65486, -104190, -60437, -77541, -70840, -1277, 4722, 29256, 26512, 45829, 16469, 42215, 54566, -3241, -1688, -25156, 7618, 38869, -44697, -118800, -70461, -58065, -64574, -38002, -4339, 28328, 49716, 60070, 151797, 123166, 63497, 76192, 86005, 107117, 121927, 149087, 105214, 63781, 53770, 25727, 87588, 75761, 49297, -7459, 3175, -9914, -75771, -54690]
12097e4690j3498O0292K1122o9685K8361M7381R944p134N9755l9766j6328j7609
12085H145J5961M8143K4608j3637n4746o6418M2585J6882L4292M5377q260l6300
12073E6632o4739l7542k9283r248O2637Q781J7837J8931N2605M106q352N3670
12061A26035K9673M1950L4812l1411J561l8761k6311r696M8592j1751n5746L8931
12049A47878O795k5256m8351N7163J00686K3502k1860l6413m658k2028o8887N270
12037A13841J88744k9532Q214N6116Q397n9775q4762j6053K16k2096k0942k1034
12025A21334L1435k448J486J5199j9731J4588R2594L8261L8650n2787P5156N6642
12013D10379j488M205J9296O5596P1164J9448j1580M1084k0103k898K2180J5497
$$ y = [-54690, -68188, -7896, 13226, -56459, -28098, 19283, 29227, 22093, 81848, 42082, 25754, 8145, 24106, 72249, 96857, 83220, 28474, -37944, 4641, 21523, 55815, 101192, 92932, 56632, -8107, -45649, -74932, -84180, -21543, -12762, 5075, 24006, 76611, 80717, 72365, 126035, 155708, 197658, 232470, 201059, 202620, 163859, 137548, 127852, 176444, 164693, 108947, 147878, 154673, 129417, 81066, 138229, 238915, 262417, 240557, 204144, 199486, 177458, 108571, 113841, 302585, 273053, 281267, 337383, 345780, 286005, 201243, 185190, 185406, 163310, 142368, 121334, 152769, 150321, 151807, 167006, 147275, 161863, 254457, 292718, 331368, 278581, 353737, 410379, 408891, 413096, 432392, 497988, 569152, 588600, 577020, 618104, 598001, 595103, 617283, 632780]
12001F32780N5244M7337l4024P3732J8092m887L519p3903J0848P3934J155j4376
11989G89451L3833J17901N3712n8220r0372p1420j3762O0546N7211L8882R4019
11978A011781O1412l6822M2508K6221N115O7677O6924P1840J19072k4854m5498
11967A365376M178M7754J7409L1167O5029O7689K5654L4917j4183N6818J24078
11956A825886L9553P5113J91963J43410J16236N3390J36561J55714J02974J43151
11946B983951K23842K16461K77225K79572K10063L03497L58224M84399N11405
11937E848639O14434P51946Q86227R95420J295813J501237J865906K429341L079723
11928A9268686L926071M988318O386259Q175434J0095533J2062545J3424196J3230339
$$ y = [632780, 688024, 735361, 701337, 775069, 793161, 788274, 791793, 717890, 728738, 802672, 803827, 789451, 823284, 941185, 994897, 936677, 846305, 774885, 761123, 821669, 878880, 917762, 1011781, 1073193, 1036371, 1078879, 1105100, 1110215, 1177892, 1244816, 1316656, 1435728, 1410874, 1365376, 1369554, 1417308, 1434717, 1465884, 1530913, 1598602, 1624256, 1659173, 1644990, 1701808, 1825886, 1865439, 1940552, 2132515, 2275925, 2392161, 2445551, 2582112, 2737826, 2840800, 2983951, 3207793, 3424254, 3701479, 3981051, 4191114, 4494611, 4852835, 5337234, 5848639, 6463073, 7215019, 8101246, 9096666, 10392479, 11893716, 13759622, 16188963, 19268686, 23194757, 28183075, 34569334, 42744768, 52840301, 64902846, 78327042, 91557381]
11920I1557381J1165235P461913K793936k597716p514767j0573809j1309620j0172318
11912G0810235q534551o849526n440240m250467l301058k576053k029346j688252
11904C6140742j509196j243544q71873o61446o40310n40474l81163l33307k62056
11895B9697373p6154q5281j30486p8918m8138j08934q6257l32606n01324o13441
11885B7635834p15750q66254q83016q19382q14428q18180q04258p59512o06353
11876B0548701o24226o03068o23825o65877o60202p84433q25124p82588p10859
11867A4268499o55051n91985n79938o60222n79078n01983m93806m45863m24381
11858I336192m26186m51296m19844l85368l77040l34909j98732k52130k12502
$$ y = [91557381, 102722616, 110184529, 112978465, 110380749, 102865982, 92292173, 80982553, 70810235, 62275684, 55426158, 49985918, 45735451, 42434393, 39858340, 37828994, 36140742, 34631546, 33388002, 32516129, 31854683, 31214373, 30673899, 30292736, 29959429, 29697373, 29621219, 29535938, 29405452, 29326534, 29278396, 29169462, 29083205, 28750599, 28249275, 27635834, 26920084, 26053830, 25170814, 24351432, 23537004, 22718824, 21914566, 21155054, 20548701, 19924475, 19321407, 18697582, 18031705, 17371503, 16587070, 15761946, 14979358, 14268499, 13613448, 13021463, 12441525, 11781303, 11202225, 10700242, 10206436, 9760573, 9336192, 8910006, 8458710, 8038866, 7653498, 7276458, 6941549, 6742817, 6490687, 6278185]
11849F278185k14921k35650k07706j91395k17248k65639k36318j89414k43977
11840D275917j61467j37285j66618j29276j04372k71910j07647j34508j41846
11831B920988j29881j13339r4933q1916j08056k4229o9711r5368r0504k3411l9326
11820B050314j36792r9109n6260K9173p4780j68837o0614j26936j6763K6911j33013
11809A233294k8298J3906m0015n1296N622M5946o7537m3203l9755N6629m2469
11798A042824J6564N1954q715l2733n7451m1286P2861K4085o1014r9209n6496
11787H51384j5500l2367l7498l1889k67J3032K5884o3455q3283r7768l919J07758
11775F32112N2473k7244j7800j02883l7158m3464J200l9186m1427l2019K9193
$$ y = [6278185, 6063264, 5827614, 5619908, 5428513, 5211265, 4945626, 4709308, 4519894, 4275917, 4114450, 3977165, 3810547, 3681271, 3576899, 3304989, 3197342, 3062834, 2920988, 2791107, 2677768, 2582835, 2500919, 2392863, 2368634, 2298923, 2203555, 2113051, 2089640, 2050314, 1913522, 1814413, 1758153, 1787326, 1712546, 1543709, 1483095, 1356159, 1339396, 1366307, 1233294, 1204996, 1218902, 1178887, 1127591, 1133213, 1179159, 1111622, 1068419, 1028664, 1085293, 1042824, 1059388, 1111342, 1102627, 1069894, 1012443, 971157, 1044018, 1068103, 1007089, 907880, 851384, 835884, 803517, 766019, 734130, 733863, 746895, 772779, 709324, 626041, 528273, 524354, 632112, 684585, 657341, 639541, 536658, 499500, 456036, 457236, 418050, 376623, 344604, 373797]
11764C73797O6269J6404O5484j9596K6980J1291M9605O2535m561R050r0530m3845
11752E22883j455l0750M414L7255L8730M5481j549j5652m1230L0965M0271N2395
11740F81758o695N625M974k7134k7897K0410O2827M1265o0057j6605J7953J150
11728F97574m9111n1701N334q7111K2210l9981L2094O994l5869K2140j1039Q375
11716E19909J2285K8839RL2669J9846n4616j01994J8691L4539j5447K0785m2180
11704D73335l4304O0584R814n1235r1451o9315J186O747l872Q8854M8111m7734
11692C90720p4391K0624l2736N3223N4278j5745r9835L6482Q4660L7860o7184
11681C87956k2223j0732J6563p085l5600P145N696N6766N2325j8587o3629p5763
$$ y = [373797, 440066, 456470, 521954, 502358, 529338, 540629, 590234, 652769, 648208, 657258, 566728, 522883, 521428, 490678, 495092, 532347, 571077, 616558, 615009, 599357, 558127, 589092, 629363, 681758, 675063, 680688, 685662, 658528, 630631, 651041, 713868, 755133, 695076, 678471, 696424, 697574, 648463, 596762, 602096, 514985, 537195, 497214, 529308, 536302, 500433, 522573, 511534, 519909, 532194, 561033, 561042, 593711, 613557, 558941, 456947, 475638, 510177, 494730, 515515, 473335, 439031, 499615, 509429, 458194, 366743, 297428, 298614, 305361, 301489, 390343, 438454, 390720, 316329, 336953, 304217, 357440, 411718, 395973, 296138, 332620, 417280, 455140, 387956, 365733, 355001, 371564, 364479, 328879, 336024, 341720, 398486, 450811, 432224, 368595, 292832]
11669B92832k9752K3674N5642m1945n6420k4488k5799o0392j9205K6371k5211
11658A15307J0284j9275m5024n0465P0475K7407L0793L6066M3887J899L500k8421
11646A96433J5465j0434j19228M1528M7391N7820l9734r3790k6411K2637M7807
11635A39484N4780l723l1386m5216L3970L8785k395j13365m2838P4940P0142K0925
11623A94103n1954k7588m2201L1194Q8978k9206m8435j3478j730l1788K5532L4690
11611A28117J19427j9069n2420k0567N1897K4769M212l2015l0483j9954n3524
11600A00390L8761m0527k8797O559Q3350L2452j5010K3588j06973M3440m6783
11589I0450K8658L9312K620j1426N88L9354N1215k3117r147l6431K8425k3628
$$ y = [292832, 263080, 286754, 342396, 300451, 244031, 219543, 193744, 133352, 114147, 140518, 115307, 125591, 106316, 61292, 10827, 81302, 108709, 139502, 175568, 219455, 221354, 224854, 196433, 211898, 201464, 82236, 123764, 171155, 228975, 189241, 95451, 69040, 91677, 139484, 194264, 190541, 159155, 113939, 147909, 186694, 184299, 70934, 28096, 103036, 173178, 194103, 142149, 114561, 72360, 103554, 192532, 163326, 114891, 101413, 99683, 67895, 93427, 128117, 247544, 228475, 176055, 155488, 207385, 232154, 236366, 204351, 173868, 153914, 100390, 139151, 98624, 69827, 76386, 159736, 192188, 177178, 200766, 93793, 137233, 90450, 119108, 158420, 161040, 149614, 150202, 189556, 240771, 217654, 208507, 172076, 200501, 176873]
11577A76873q662O1461Q9476m3990m5905O829K6915J0086k237J2701n2398n7716
11565A73433r1856R977L8378k799k3692N022m4127l6911l0336j7897N2871l6771
11553d708J8540Q6673K7074m5417K7637J4522q919J7763j3968l8910j6895l236
11541F0156l7908j2773j5580K8373K0027j6387L4257P3964l597k7686M351j4079
11529I3118n0633L5945N4015j4103p4510L1170J9540l2221O6516Q3446J4792p7365
11517A49710l6901j4407L0580n979L3524M9444p1412m2326k2168q5169R417L4633
11505B8946m7878o4410L3148R3668M2844K510m8323N2058M689o7453l4247R7909
11493I3461M8201o137m5650p0231p0924j0852L0346N3069O1178K6660m3114p5487
$$ y = [176873, 168211, 229672, 319148, 275158, 229253, 236082, 262997, 273083, 270846, 283547, 231149, 173433, 81577, 91554, 129932, 127133, 103441, 108463, 64336, 27425, -2911, -20808, 32063, -4708, 13832, 100505, 127579, 82162, 109799, 124321, 115402, 133165, 119197, 80287, 63392, 60156, 22248, 9475, -6105, 22268, 42295, 25908, 60165, 134129, 130532, 102846, 107197, 93118, 42485, 78430, 132445, 118342, 43832, 75002, 94542, 62321, 128837, 212283, 227075, 149710, 112809, 98402, 128982, 123003, 156527, 205971, 134559, 92233, 70065, -15104, -5687, 28946, -18932, -83342, -50194, 43474, 86318, 88828, 40505, 92563, 97252, 29799, -4448, 93461, 141662, 135525, 89875, 19644, -51280, -62132, -31786, 21283, 82461, 109121, 66007, -9480]
11481i480J6989r954L9943M0066j22510K5201O7415m0565n347Q287P724Q4658
11469A02427l4824q7765k1775O0782O0876K8322K0431M0943k6428l6034L9248
11458A46203l2481m6757Q721J293M535j9431k8135l9308o271N9109M0355j6982
11446G0851l4260M82L1982O3844N0433L7871k8056M3338O965r7747l0615m1853
11434G3235n7793n1932Q800L8659N0214N1390l8172J7111J4204J8835R412K1477
11422A55440q4410n0456l4519m7471m1192R734j4790N2172J05606j7564l4520
11411a970K2161o4160q564N6017J6195K4011n3590o735O0747Q9540N0250J1101
11399A95003k7535L7952k7094o3626J3651M3434K8016O9996M9290m6357q5222
$$ y = [-9480, 7509, -2445, 37498, 77564, -44946, -19745, 47670, 7105, 1758, 10045, 17769, 102427, 67603, -20162, -41937, 18845, 79721, 108043, 128474, 169417, 142989, 106955, 146203, 113722, 66965, 75686, 76979, 81514, 62083, 33948, -5360, -11631, 47478, 87833, 70851, 36591, 37073, 69055, 132899, 183332, 221203, 193147, 236485, 243450, 145703, 115088, 73235, 15442, -36490, -27690, 10969, 61183, 112573, 74401, 91512, 105716, 124551, 133963, 155440, 71030, 20574, -13945, -61416, -102608, -92874, -107664, -55492, 50114, 32550, -1970, 20191, -43969, -52533, 3484, 19679, 43690, -9900, -16635, 44112, 133652, 183902, 195003, 167468, 205420, 178326, 114700, 128351, 171785, 199801, 269797, 319087, 272730, 187508]
11388A87508j212o2086m0221m486K0524J502O5884J17088l0578k8165o3620M5207
11376B07345J3437k5793n7717J006k3819J4269l5955J4930K5850K924O1n9807
11364G6731K5072q7976Q958M6215q563J667J11592o1857j269J5201n583K4031
11352A44219J1920k4755j7900m3280J4160L4946n590J6103l3669l8976j0502K3374
11340G0050J37293j4447j06499l8997q832R701k0436o565P0869J18940R822j3988
11328B06911J9334K2327o6764n3936M3556R8J0369k8280N4703k7068m7985L0205
11316A63470J1181j7136M1977k7177M753M3276m2103m2425N9364M7705n3223p9356
11304A10306q131k3117M6648K7665j5718K202K4692p3714k9272J4770O8165k5619
$$ y = [187508, 186296, 124210, 83989, 79503, 100027, 101529, 167413, 284501, 253923, 225758, 162138, 207345, 220782, 194989, 137272, 138278, 114459, 128728, 92773, 107703, 133553, 136477, 136538, 76731, 101803, 13827, 22785, 69000, 60437, 62104, 173696, 111839, 110570, 125771, 120188, 144219, 156139, 131384, 113484, 70204, 84364, 119310, 113720, 129823, 96154, 57178, 46676, 70050, 207343, 192896, 86397, 47400, 38568, 48269, 27833, 21268, 92137, 211077, 220899, 206911, 226245, 248572, 181808, 127872, 171428, 171526, 181895, 153615, 208318, 181250, 133265, 163470, 174651, 157515, 199492, 172315, 177068, 220344, 178241, 135816, 195180, 242885, 189662, 110306, 102175, 79058, 125706, 153371, 137653, 139855, 164547, 90833, 61561, 76331, 144496, 118877]
11292A18877K9778L9143j0267k5671m2833m9262L7563P7847L1075o5288l3533
11281A07429N6031N1148L7891p6088j0693l2899o024n8439L7132R4439J8328K0474
11269B38729n4890J3874K1888R514j27Q9326Q1723r911j40488j8306O5205P9345
11257C75882L2316r208l4493l9995L6441J0115j03984L2883j8945n6758J9759
11246B44013K4336J6961l2597L2759l9410r2110o8586J3766R5073L6536J4004
11235B44745K4433o3976l2383J0612M5239N1296J4011k8394O223j2433p6123m5923
11223A37327K3050P606N9649M0280K8165l4810j4443N9888j3004OM0578J02775
11211D37067P9766j86320n0115O6643n4519j9441K6474r1056n1523J03982P0429
$$ y = [118877, 148655, 187798, 177531, 151860, 109027, 59765, 97328, 175175, 206250, 140962, 107429, 163460, 214608, 252499, 176411, 165718, 132819, 126795, 68356, 105488, 199927, 218255, 238729, 183839, 197713, 219601, 229115, 228988, 318314, 400037, 390126, 249638, 231332, 296537, 375882, 408198, 398990, 364497, 324502, 360943, 371058, 267074, 299957, 281012, 224254, 244013, 268349, 285310, 252713, 285472, 246062, 153952, 85366, 99132, 194205, 230741, 244745, 269178, 205202, 172819, 183431, 228670, 279966, 293977, 265583, 271806, 259373, 183250, 137327, 160377, 167983, 227632, 267912, 296077, 261267, 246824, 306712, 293708, 293714, 334292, 437067, 516833, 330513, 280398, 347041, 292522, 273081, 299555, 208499, 156976, 260958, 331387]
11200C31387l2447n3022j8170M7363K9368o080j7080j8020j234N4992P4041L7437
11188D28535M114o9131j19572L2131J6319Q1174j2831l1866J5911J0976J8227
11177C73987K1762j2585j4261j1802K8312K9042q4980m7461J8366K3033K2392
11166C45805k512J6622P1367K084o7199m7916l3011L1744M9301k97m7174j0232
11154C08582K5248L2732J7405q648R8796O6826o2357M331Q2525L2375J2933k6457
11142E84291J1288p5188n9062N1918j13439K7376M6766m2302J01876L4713l3435
11131E34802k2763j0055J9752J6168L6264r670r1967n0013L8563Q6476P0262J0944
11119F28763l291l3967P457R0469Q5922J0481Q954r6113j25165l2463M2642K6875
$$ y = [331387, 298940, 245918, 227748, 275111, 304479, 298399, 281319, 263299, 262065, 317057, 391098, 428535, 432649, 363518, 243946, 276077, 292396, 373570, 360739, 328873, 344784, 355760, 373987, 395749, 383164, 368903, 357101, 385413, 414455, 329475, 282014, 300380, 323413, 345805, 343293, 359915, 431282, 433366, 366167, 318251, 285240, 316984, 366285, 365988, 318814, 308582, 333830, 366562, 383967, 375319, 474115, 540941, 478584, 482915, 565440, 597815, 610748, 584291, 595579, 520391, 461329, 513247, 399808, 427184, 473950, 431648, 533524, 568237, 534802, 512039, 501984, 521736, 537904, 574168, 564498, 472531, 422518, 461081, 547557, 617819, 628763, 625472, 591505, 598962, 689431, 775353, 785834, 794788, 698675, 573510, 541047, 583689, 610564]
11107F10564K326R1602R343J9107J6599j9200L9032O9898K3456r0967J5047n2032
11095G34775N079M0745j7508K9380N3425P254j036n2796o589J697P5520J00139
11083I70085p664k3841J0447K2296L2128j1701M1402M0114O165k4963l1791M7717
11071A070394L6073Q784n4919n1952J6776L1470M8706N1254Q1418N1459R0465
11060A379928J3217J5450K1342j6054N4628P1902j1874n3935J09515O6349J2256
11049A662724M3789R4570O6135L2891j2411o2053K911L5712M0704P4612J3673
11038A993257J43788R5392J25431L3031o069k4762j0479k9731N3647M9830R9671
11027B523006O0621M9638P9476K0272J07058N0893M0553K5483K8743L7745M2847
$$ y = [610564, 612890, 704492, 713835, 732942, 749541, 730341, 769373, 839271, 862727, 771760, 786807, 734775, 739854, 780599, 763091, 792471, 845896, 853150, 852114, 799318, 792729, 794426, 869946, 970085, 962421, 938580, 949027, 971323, 1003451, 991750, 1033152, 1073266, 1079431, 1054468, 1022677, 1070394, 1106467, 1115251, 1060332, 1008380, 1025156, 1056626, 1105332, 1156586, 1238004, 1289463, 1379928, 1393145, 1408595, 1429937, 1413883, 1468511, 1540413, 1528539, 1474604, 1584119, 1650468, 1662724, 1706513, 1801083, 1867218, 1900109, 1887698, 1825645, 1828556, 1864268, 1904972, 1979584, 1993257, 2137045, 2232437, 2357868, 2390899, 2384830, 2360068, 2349589, 2319858, 2373505, 2423335, 2523006, 2583627, 2633265, 2712741, 2733013, 2840071, 2890964, 2931517, 2957000, 2985743, 3023488, 3066335]
11016C066335N6671M8153J58821J06705P6183N6952J1104n252L3904j5611l7693
11005C556272O3424K1007P0124R4517M3663R9725J17021r168Q9224L6947N2374
10994D235130P7183R8288O5381P5605J9949M623J02901J21658J17063O2118K3727
10983E003626o112N7984M6111P0541O4555R2404J59572K00251l980m6703K8811
10972E667060J12392J44648Q3064P4220J08082R9623k4754L3169J23685J19680
10962F540869J07103P9484M8807Q5128P1441P3664O0254K3281P0226J47050K9649
10951G336956R9608J32620R1567P9236J32232J20153J4200j7555j6537O9140K8060
10940H069680N4982N7368O6011J31072K80745R8600M6196J23762J83151J25671
$$ y = [3066335, 3123006, 3171159, 3329980, 3436685, 3512868, 3569820, 3580924, 3575672, 3609576, 3593965, 3556272, 3619696, 3640703, 3710827, 3805344, 3849007, 3948732, 4065753, 4056585, 4145809, 4182756, 4235130, 4312313, 4410601, 4475982, 4551587, 4571536, 4576159, 4679060, 4800718, 4917781, 4979899, 5003626, 4997514, 5055498, 5101609, 5172150, 5236705, 5329109, 5488681, 5688932, 5684952, 5638249, 5667060, 5779452, 5924100, 6007164, 6081384, 6189466, 6289089, 6264335, 6297504, 6421189, 6540869, 6647972, 6727456, 6776263, 6861391, 6932832, 7006496, 7066750, 7090031, 7160257, 7307307, 7336956, 7436564, 7569184, 7660751, 7739987, 7872219, 7992372, 8006572, 7989017, 7972480, 8041620, 8069680, 8124662, 8182030, 8248041, 8379113, 8659858, 8758458, 8804654, 8928416, 9111567, 9237238]
10930I237238J32694J32666J24322K62111K52902J70712J46195K16022K07846
10921A0882708J77153J61044J84206J35748q884j2136Q4757K5530J12713R4138
10911A1836977M1905m4997k9418R7644J96861J65985J12111J24443J67594J90419
10901A2859524K18312K47182K44377K93510L19353K86201K93224K81683K62802
10892A5306168J49146Q5314Q6739M1172M0027K2717o8854j61635m7539l1321o8593
10881A5353341r8011l0237p8103J4422P1428M8233k0290L6932L1210O3062O3959
10870A5455946J11014J05901J18420J37501R6302P6947J30371J18373J37646K16481
10860A6704902J96100R7430J18832J52030K19953K02751K59383K51674J96835
$$ y = [9237238, 9369932, 9502598, 9626920, 9889031, 10141933, 10312645, 10458840, 10674862, 10882708, 11059861, 11220905, 11405111, 11540859, 11531975, 11519839, 11604596, 11630126, 11742839, 11836977, 11878882, 11833885, 11804467, 11902111, 12098972, 12264957, 12377068, 12501511, 12669105, 12859524, 13077836, 13325018, 13569395, 13862905, 14182258, 14468459, 14761683, 15043366, 15306168, 15455314, 15540628, 15627367, 15668539, 15708566, 15731283, 15662429, 15500794, 15453255, 15421934, 15353341, 15255330, 15225093, 15146990, 15161412, 15232840, 15281073, 15260783, 15297715, 15328925, 15391987, 15455946, 15566960, 15672861, 15791281, 15928782, 16025084, 16102031, 16232402, 16350775, 16488421, 16704902, 16901002, 16998432, 17117264, 17269294, 17489247, 17691998, 17951381, 18203055, 18399890]
10851A8399890K69001K12602J49886K6807m7510j59374j56691j39110k11665k92958
10841A8050878k62335j97543k41292p8954L9941J4105P8985O2500R9971K02047
10831A7768303K73401L68891L49877M72275M88128M12862M26808L63295L63361
10822B1287201J98027J12533k2430j64914k64040l67002l85235n93300m96959
10813A9303881l39878l68576m20479l55719l00632k00932k26172N121M5532n6939
10803A7085207R727L7966l7805o4056K6003R4563O7916Q6129J45373Q411Q339
10792A7467773o644m5850k8315k05868j75014j18731j36620r5049m3392r5933
10782A6516357q9290j21726j94020j88726j09229k37167j39769k92525l43958
$$ y = [18399890, 18668891, 18881493, 19031379, 19058186, 19010676, 18851302, 18694611, 18555501, 18343836, 18050878, 17788543, 17591000, 17349708, 17270754, 17310695, 17324800, 17403785, 17466285, 17566256, 17768303, 18041704, 18410595, 18760472, 19232747, 19720875, 20133737, 20560545, 20923840, 21287201, 21485228, 21597761, 21575331, 21410417, 21146377, 20779375, 20394140, 19800840, 19303881, 18964003, 18595427, 18174948, 17819229, 17518597, 17317665, 17091493, 17096614, 17142146, 17085207, 17094934, 17132900, 17095095, 17031039, 17057042, 17151605, 17219521, 17305650, 17451023, 17459434, 17467773, 17461129, 17415279, 17386964, 17181096, 17006082, 16887351, 16750731, 16655682, 16612290, 16516357, 16427067, 16305341, 16111321, 15922595, 15813366, 15576199, 15436430, 15143905, 14799947]
10773A4799947l24571l55014k75472k13135l03980k03161j78854j29122q6999
10764A2729639m7687K6077p6074p0507J08886J94843J78436J79769K00413J24589
10754A3548384K23287K23893J0586p0548k37939l78732l87901l04653l68295l79322
10744A1878760l73018l51766l14420l50886k50711j75008j54573j00807j67363
10735I640208j38135j35234j00662q1539q8233m7813O2628R4796M9701O3927p0442
10724I249202j19306m3827p6507j47557k05509k20984k62014k40132k58250k49854
10714G425262k52997j63093j59443k37876k89440j27289o4345j49790j40395P801
10704E848395j21068j81558j03716j36278j24753j05208j27541q0042P353k1135
$$ y = [14799947, 14475376, 14120362, 13844890, 13631755, 13327775, 13124614, 12945760, 12816638, 12729639, 12681952, 12708029, 12631955, 12561448, 12670334, 12865177, 13043613, 13223382, 13423795, 13548384, 13771671, 13995564, 14006150, 13935602, 13697663, 13318931, 12931030, 12626377, 12258082, 11878760, 11505742, 11153976, 10839556, 10488670, 10237959, 10062951, 9908378, 9807571, 9640208, 9502073, 9366839, 9266177, 9184638, 9096405, 9048592, 9111220, 9206016, 9255717, 9319644, 9249202, 9129896, 9086069, 9009562, 8862005, 8656496, 8435512, 8173498, 7933366, 7675116, 7425262, 7172265, 7009172, 6849729, 6611853, 6322413, 6195124, 6130779, 5980989, 5840594, 5848395, 5727327, 5545769, 5442053, 5305775, 5181022, 5075814, 4948273, 4868231, 4875584, 4854449]
10694D854449o5573j32919q6549M4k7967j06856j14612n7823j58684k02244m6435
10683C854831k7547J5070p486r0495r689N826o2961q8502r4306K2694q9698j15658
10671C312079l7991j6452j0124J508j625j14427q5103Q1672R754o7702j32162
10660B939427o3790N1593m1297r0132m2978M988N2897p6632k3277J54714n163
10649B860350m3077o9137l9629q1805l028J1233J9088M605O1072J5730K1490O2072
10637B818964N6615R7987R7976J4006J50850J57745J13641J83235K23018K65196
10627D179233L63697M94623P23393R31386J162599J566343J978703K379474K628534
10618A6407985K641268K349121J882059J269464N16877L04801M21173J079677
$$ y = [4854449, 4788876, 4655957, 4569408, 4569452, 4541485, 4434629, 4320017, 4262194, 4103510, 3901266, 3854831, 3827284, 3842354, 3834868, 3744373, 3734684, 3740510, 3677549, 3589047, 3494741, 3517435, 3427737, 3312079, 3274088, 3257636, 3247512, 3249020, 3247395, 3132968, 3047865, 3129537, 3139291, 3071589, 2939427, 2875637, 2927230, 2885933, 2795801, 2752823, 2757811, 2810708, 2734076, 2710799, 2865513, 2860350, 2817273, 2748136, 2708507, 2626702, 2623674, 2634907, 2653995, 2658600, 2719672, 2735402, 2756892, 2818964, 2875579, 2973566, 3071542, 3085548, 3236398, 3394143, 3507784, 3691019, 3914037, 4179233, 4542930, 5037553, 5760946, 6692332, 7854931, 9421274, 11399977, 13779451, 16407985, 19049253, 21398374, 23280433, 24549897, 25066774, 25371575, 25792748, 26872425]
10610B6872425K060867L194166M300851M960445M857843M012907K644148J063618
10602E3967270m55962j346696j167118J45958J928904L806203N381222O040656
10594F8300437N491197L903381J887092o98160l140161m399363m076596k636597
10586F4631230q02467Q41099K026268K584585K164224J139218k17610j984684
10578G0381863l483182m143612l678225k578683j480107p15526j32107J08020
10570E4278441n080n59830j176657j837906k413478k534704k396510k069908j703277
10561C9581091j462574j348001j266160j129743j113712j042299r09657q78472
10553C0430473p77353o34284o71641o73778o21732p40477q31365q41605q08229
$$ y = [26872425, 28933292, 32127458, 36428309, 41388754, 46246597, 50259504, 52903652, 53967270, 53511308, 52164612, 50997494, 51143452, 53072356, 56878559, 62259781, 68300437, 73791634, 77695015, 79582107, 78883947, 75743786, 71344423, 67267827, 64631230, 63828763, 64669862, 66696130, 69280715, 71444939, 72584157, 72366547, 70381863, 66898681, 62755069, 59076844, 56498161, 55018054, 54302528, 54170421, 54278441, 54273361, 53713531, 52536874, 50698968, 48285490, 45750786, 43354276, 41284368, 39581091, 38118517, 36770516, 35504356, 34374613, 33260901, 32218602, 31308945, 30430473, 29653120, 29018836, 28347195, 27673417, 27051685, 26311208, 25479843, 24638238, 23830009]
10544B3830009p63684q47919q65471p83362p33866o80084o95978n85986n69982
10535A7303677o11429p65486p03102p04404p20987n76122m69463o12383n42258
10526A1598043n40821l82132l64037n61055m98876l56454l50500l83804m51533
10517G708831l63272l01619l13159l49046k70082k38794l33293k87389k22562
10508E029615j99193k02120j25041j62260j68887j33781j64243j39605r5548r8046
10498C540891j14726j33233j55830j38412k3742p8539j05761j20016j17536j19550
10488B433546o4552k7906r6480j06212r7513l1783j6668r1749m6296j04658n7969
10477A691760j17351M598P3689n0117p0397m4394N5480O209l9166J5762k3336
$$ y = [23830009, 23066325, 22218406, 21352935, 20569573, 19835707, 19155623, 18459645, 17873659, 17303677, 16692248, 15926762, 15223660, 14519256, 13798269, 13222147, 12752684, 12140301, 11598043, 11057222, 10675090, 10311053, 9749998, 9251122, 8894668, 8544168, 8160364, 7708831, 7345559, 7043940, 6730781, 6381735, 6111653, 5872859, 5539566, 5252177, 5029615, 4830422, 4628302, 4503261, 4341001, 4172114, 4038333, 3874090, 3734485, 3638937, 3540891, 3426165, 3292932, 3137102, 2998690, 2974948, 2896409, 2790648, 2670632, 2553096, 2433546, 2368994, 2341088, 2244608, 2138396, 2040883, 2009100, 1992432, 1900683, 1854387, 1749729, 1691760, 1574409, 1579007, 1652696, 1602579, 1532182, 1487788, 1543268, 1549477, 1510311, 1526073, 1502737]
10466A502737p3495N2812m3348j55809r0355l4145M9633K8923R68o6792p7078
10455A094051q1787J1119N161K9987q7760J4685J2370N4504l618p3376J7617L0793
10443A023746o6763k4067K2228k7562L6958m9247j02556K3899J12855M7416o6414
10432I30493l9618J2508O8644p531M2580l11m5471O1912j6409m0980m5759J2955
10420I33013J9307r185K6900O2843K632k1331l6024j0290J40416Q5739j2296o287
10408A175437j05883m5373n7576L1018J5618n3761K6439O3531l597q992p0556
10397I66305j53729k9232n0427j477O3093m2287L7566K9550k6534L8569O3701
10386H95098p572n9633n7470k3028K1632J7040j21430m4479j2111K7261N6058
$$ y = [1502737, 1429242, 1482054, 1438706, 1282897, 1192542, 1158397, 1208030, 1236953, 1237921, 1171129, 1094051, 1012264, 1023383, 1028544, 1058531, 970771, 985456, 997826, 1052330, 1048712, 975336, 992953, 1023746, 956983, 932916, 955144, 927582, 964540, 915293, 812737, 836636, 949491, 996907, 930493, 890875, 903383, 972027, 964496, 1007076, 1006765, 961294, 1023206, 1006797, 965817, 920058, 933013, 952320, 943135, 970035, 1032878, 1035510, 1014179, 978155, 967865, 1108281, 1194020, 1181724, 1175437, 1069554, 1024181, 966605, 997623, 1013241, 959480, 985919, 1049450, 1045853, 1036861, 966305, 812576, 783344, 732917, 731440, 794533, 752246, 789812, 819362, 792828, 831397, 895098, 887526, 827893, 770423, 747395, 769027, 786067, 664637, 620158, 608047, 635308, 691366]
10375F91366r862L3036P040m3671O5634k1874N1238M6116q7996m5463K1140Q182
10363G14886m4040L3510l0111r2215q9561J0954R4287J18568j4565q9693o6425
10352E45595L0129Q323r601R215p2761l0054J08836K9688l3878j109k2406M571
10340E66548q7016K2670P551p4320q4449J5332M5075N5853L0492O962j9203m593
10328D80902J5516n0184o9339M4277k5787K6518n3669k8552o591M1212K5236J8247
10316D17786m7303n0628p8432n3305J6078J00976R0089k8518p3113n3050J4380
10305B54960K9374j9332n9365K1336O2862l473n9761k5159J9698L9893K0912K07
10293B82152p4669j5177M0722q511K0907P620K4899L2651j1196O0632J67996l213
$$ y = [691366, 681504, 714540, 721580, 677909, 743543, 721669, 772907, 819023, 731027, 685564, 706704, 714886, 670846, 704356, 674245, 582030, 492469, 503423, 597710, 716278, 701713, 612020, 545595, 575724, 584047, 574446, 583661, 510900, 480846, 589682, 619370, 585492, 584383, 561977, 566548, 479532, 502202, 509753, 435433, 350984, 366316, 411391, 467244, 497736, 504698, 485495, 480902, 496418, 446234, 376895, 421172, 395385, 421903, 368234, 339682, 333091, 374303, 399539, 417786, 370483, 319855, 241423, 188118, 204196, 305172, 395261, 366743, 293630, 240580, 254960, 284334, 265002, 205637, 226973, 289835, 286362, 226601, 201442, 221140, 261033, 281945, 282152, 207483, 192306, 233028, 224517, 245424, 253044, 277943, 310594, 299398, 360030, 528026, 524813]
10281E24813j4595q0494J5053O7932N1121M9624m4646k9427N7111J50849K3960
10270G71301j4769L5674m6824j22210P925j0581n5145J3757m6565l5789o0743
10259D36031r2143j8252n8076R0780O2458l31L5596n6305j13879n0211m1903J2379
10247B06144Q9635L8160M8916M8798k6742L0424K4799j6110m2411r0701m6172
10236B64740M6825N3831l736j4048m0475m2936P223K1917K3155N7193o479p7295
10224B89915J4728J6783l72j6275o3032M822j9612l7197n420Q760k1320R352l1392
10211A49740K6094J2706q5688Q108L8993o4153k258J5756l3245L0169J15187q163
10199B03246m3072j2807l0585q6950Q2640P4215p4087r693L2585n9882J4614O1320
$$ y = [524813, 510218, 429724, 444777, 512709, 563830, 613454, 568808, 539381, 596492, 747341, 771301, 756532, 792206, 745382, 623172, 631097, 620516, 565371, 579128, 532563, 496774, 436031, 343888, 325636, 267560, 358340, 420798, 420467, 456063, 399758, 285879, 235668, 193765, 206144, 295779, 333939, 382855, 431653, 404911, 435335, 460134, 444024, 401613, 310912, 264740, 311565, 365396, 361660, 347612, 307137, 264201, 271424, 293341, 316496, 373689, 367210, 289915, 304643, 321426, 321054, 304779, 241747, 246569, 226957, 189760, 184340, 193100, 171780, 181132, 149740, 175834, 188540, 102852, 110960, 149953, 85800, 83542, 99298, 66053, 96222, 211409, 203246, 160174, 147367, 116782, 29832, 112472, 186687, 112600, 102907, 135492, 75610, 90224, 151544]
10187A51544r3950O837Q0450K0854o313r227N6951k4794K7541M9103R34l5977
10175B23953j0385M5898O1948K3319P337L040N0430j6485O0619L0347j192J3837
10163D92666j9367m3931K4908L4607j0128M6239J22946l007m2337k0502K8394
10152F10488n7355m1503n4990j6290N594m8424K6902R1855O7897j3429k234k6978
10140E41533l0721L0511r785p758o1353j23859J175J02768J3404l0883j2919J9885
10128D31998o347q7026p7622N8577M209o0610L452L8924o1512n9998j5370K8260
10116A96935l4862K564P7805L7314k8533k7357L9173J7538j0899j6464j8883K5190
10104B59521j6835p5893N3746L5157N7260M0156K0767j0644o7630o2906P005j09932
$$ y = [151544, 57594, 64431, 144881, 165735, 159422, 150195, 207146, 182352, 209893, 258996, 259930, 223953, 213568, 259466, 321414, 344733, 352070, 355110, 405540, 389055, 449674, 480021, 478829, 492666, 473299, 429368, 454276, 488883, 478755, 524994, 647940, 644933, 602596, 582094, 610488, 553133, 511630, 456640, 440350, 445944, 397520, 424422, 516277, 584174, 570745, 568511, 541533, 510812, 541323, 531538, 523780, 462427, 338568, 339743, 442511, 455915, 425032, 412113, 431998, 425651, 338625, 261003, 319580, 323789, 263179, 266631, 305555, 244043, 184045, 168675, 196935, 162073, 164637, 242442, 279756, 251223, 223866, 263039, 280577, 269678, 253214, 234331, 259521, 242686, 166793, 220539, 255696, 312956, 353112, 373879, 363235, 295605, 232699, 239704, 129772]
10092A29772n7047M2799J1699N0392m452q6260k5567R1427R9873R167q2339n252
10080A74212M865l7251j1206P1944N5114l2006j20848r1045j5869P699K8916j6937
10068A7588L1596L3683L3431m7065q0985n2741K8303Q3224M4322j2O6892J5075
10056A73311q793j3381l7901k43o8558l1762k8613N5867O0008O3192k1212l1527
10044A10388m0590k7465o5214o5237j5307P138J08522N4780P6427n310j07845
10033C0287l1205m5791Q0272Q1774n0246l8703M4011N9183P2216l1021k9716j7331
10021A23730r1161M608J6659J09611N3922q1072j39410n0838l4178J7292m3811
10010a14648J08271N9586o6516L4100q111k6338n26J5933M309J2592K9517N4366
$$ y = [129772, 72725, 115524, 127223, 177615, 173163, 86903, 61336, 152763, 252636, 261803, 179464, 174212, 179077, 141826, 130620, 202564, 257678, 225672, 104824, 13779, -2090, 5609, 34525, 17588, 49184, 82867, 116298, 69233, -11752, -64493, -36190, 47034, 91356, 91344, 158236, 173311, 164518, 151137, 113236, 112993, 44435, 12673, -15940, 39927, 99935, 163127, 141915, 110388, 69798, 42333, -22881, -88118, -103425, -96287, 12235, 67015, 143442, 138132, 30287, -918, -46709, 33563, 115337, 65091, 26388, 70399, 129582, 201798, 170777, 141061, 123730, 32569, 37177, 53836, 163447, 217369, 136297, -3113, -53951, -88129, -70837, -114648, -6377, 53209, -13307, 20793, 12682, -13656, -14182, 1751, 6060, 18652, 48169, 102535]
9998A02535L0621L3374l057k371J0376j4028k0556k2444j9905m4178M8080N059
9986A03506o1830l2904p724K1547k8037N8529r412j35388l0054P0766J15222J7294
9974H1515n6111o6567M1531J16240l70l5527P483J8747J3098r7930m9803R8422
9962G0728J7747P4015M3694m7748j0069k4572n6304j2345n8049L3934J0906p6486
9950c4549l5843k862N2164N197L7008Q203K4907M0237p7647m6891r469J08332
9938F8787J31040m6294K0473j9195n8564J4728L1488p6472N772Q989m0870J243
9926D1125J9222O368N1711l494m2627K8778p5055j12094n5369L7980J8320M0998
9914d4137M5555l64j5083J1239K1787K6097j6078N0653N3128k6843r4065J2504
$$ y = [102535, 133156, 166530, 163473, 161102, 171478, 157450, 136894, 114450, 94545, 50367, 98447, 103506, 41676, 8772, 1048, 22595, -5442, 53087, 43675, -91713, -121767, -51001, 64221, 81515, 25404, -41163, 368, 116608, 116238, 80711, 88194, 106941, 120039, 22109, -27694, 70728, 88475, 162490, 206184, 158436, 148367, 123795, 67491, 55146, -2903, 31031, 41937, -34549, -70392, -73254, -21090, -15893, 21115, 29318, 54225, 94462, 16815, -30076, -39545, 68787, 199827, 153533, 174006, 154811, 96247, 110975, 142463, 65991, 71763, 80752, 39882, 41125, 60347, 66715, 118426, 114932, 72305, 101083, 26028, -86066, -141435, -103455, -85135, -44137, 1418, 1054, -14029, -2790, 18997, 45094, 29016, 79669, 132797, 105954, 11889, 24393]
9902B4393N27o7525P339k5847K2370R0243j4942J3935P3644k4082M1606M961r4264
9889E2358p5095J6106k1556j3333K0730M6876J8355n4737l4250n4921k3723Q9517
9877c3673L5648n4767l1119L933r147j7618O4114L2671q462l8085N6120O2677
9865F2292R742l7762j4408J0785m0903P344j7593j18772j9543P9951N4786N8061
9853C3980O192l4452n6210o233l2010K5197P774O6157j2515L2007J8551l2628
9841A5810N4136N987q2616r1543o0968L5914N9601l9952J18638M7209k0270j2183
9829B9763p4596M3044o1628o9943L355j0149N5833M0815R845m6038J7336J11390
9817D9027R3544j1945j635q9163k0864Q039p7774R721O1542k8371R4469K6665
$$ y = [24393, 24920, -42605, -35266, -61113, -38743, 51500, 36558, 50493, 124137, 100055, 141661, 146622, 52358, -22737, -6631, -28187, -41520, -20790, 26086, 44441, -10296, -44546, -99467, -123190, -33673, 1975, -52792, -83911, -79978, -89125, -106743, -42629, -9958, -18420, -56505, -385, 62292, 72034, 34272, 19864, 30649, -10254, -2910, -20503, -139275, -158818, -78867, -24081, 33980, 40172, 5720, -50490, -56723, -88733, -63536, -55762, 10395, -2120, 29887, 48438, 15810, 69946, 75933, -6683, -98226, -159194, -123280, -63679, -103631, 15007, 62216, 41946, 29763, -44833, -1789, -63417, -133360, -130005, -140154, -84321, -43506, -33661, -79699, -62363, 49027, 142571, 130626, 128991, 39828, 18964, 27003, -50771, -41050, 20492, -7879, 86590, 113255]
9805A13255m8090K4632K9682o1256j28728l3059P7365n219Q498K3838O7236M5035
9793A13189n3274M1290J0539n150M3461j6147l7819o6015q490K6825M840m3105
9781A0144r955m5736l3249J1198K4868K3287L3570n6321J3654N5039M5240o391
9769F5348K4199P415j2769l3151J5993m3890K1141n0659K010P187l1119K267K9256
9756C228k9910n902l8504K4161P1785K743O3353K741n4759l5381K1988l7817l8004
9743e0278K0271Q435P7336k522R4537l6324o2263L0360m416l0070k5840K216K0408
9730D1850p2177m280q9863J07792L8327p0540k0018N6712L3633n4637j8210K9945
9718b1466M6629l514J6891j0424k6612j2696P8965k0838m2259P732l6520j3289
$$ y = [113255, 65165, 89797, 119479, 58223, -70505, -103564, -26199, -31418, -22920, 918, 68154, 113189, 59915, 101205, 111744, 106594, 150055, 133908, 96089, 30074, 21584, 48409, 53249, 10144, 189, -45547, -78796, -67598, -42730, -19443, 14127, -42194, -28540, 26499, 71739, 65348, 89547, 96962, 84193, 51042, 67035, 23145, 44286, -6373, -4363, 2824, -28295, -26028, 3228, -26682, -32584, -71088, -46927, 24858, 27601, 90954, 93695, 38936, 3555, 25543, -12274, -50278, -30007, -21572, 55764, 53242, 147779, 111455, 49192, 79552, 75136, 45066, 19226, 21442, 41850, -30327, -34607, -124470, -16678, 21649, -48891, -68909, -12197, 21436, -33201, -51411, -21466, 25163, 21649, 38540, 28116, 1504, -11192, 67773, 46935, 4676, 12408, -24112, -37401]
9706c7401N3454n6443p3898J9503J03152Q6615O9126O3013o2523o7665n0986l857
9694D2090k2601N9287o2629m7708j5005Q7334J3654k5761k0499j9026q620K8879
9682I395n3663N2274M8227l6823M3082Q176l2662o8121L1773L4537Q952K3722
9670F8869L8584o3857j23068n5059P5566O1099O8425M8750n0317l0388N8776O8125
9658A65505L1654m6857J2965N6003M3353p4422L681J17857l9802m2291p5071o7942
9646H4633N6874L6233m5508l6560Q8388N2519p5805j52528K0865Q5765p775K7909
9634A35010M7606M7483n7140o9555m1454k095L0353K3453M4668o318O543j729
9622A56825L7215l6874P624J0879M4395O2591j921m9410l1726M8632q392k461
$$ y = [-37401, 16053, -40390, -114288, -94785, 8367, 94982, 164108, 227121, 164598, 96933, 45947, 42090, 19489, 78776, 16147, -31561, -46566, 40768, 54422, 28661, 8162, -10864, -19484, 9395, -44268, 8006, 56233, 19410, 62492, 70668, 38006, -30115, 1658, 36195, 45147, 68869, 107453, 43596, -79472, -134531, -58965, 2134, 70559, 119309, 68992, 38604, 97380, 165505, 197159, 150302, 163267, 219270, 262623, 188201, 191882, 309739, 269937, 227646, 152575, 84633, 141507, 177740, 132232, 95672, 184060, 236579, 160774, 8246, 29111, 114876, 107101, 135010, 182616, 230099, 172959, 103404, 61950, 59855, 90208, 113661, 158329, 152011, 158554, 156825, 194040, 157166, 164790, 175669, 220064, 282655, 280734, 231324, 199598, 248230, 239838, 237377]
9610B37377N0274p3091n1258P522L4828M480j7372n896O7434n6170j3112l645
9598A81371P9510M8825m0524j2510q444o480r205n904j5439j6471k4545J4912
9586A85096K4988K7049m8286J8175J05340N4573p8962J0250l0922q4490L104m5844
9574A40071J9608O9770P2412J8156J8892M1015o609q0655j14279p0957J6831J12027
9562B36282P6244q2818j5329J12564N7649j18628M5923M7044r2766o9059p167
9551A89939l2398q653O3842J660L978n274m0597l1018o6917q0179j3915J30816
9539A11284N7419p9579O3359K0011l568M5820n9526m4138K2999R1164K7975R2729
9527C45949P4760j4793p8829q6530J4180k8236r1628J8541M0247K5147j3048k363
$$ y = [237377, 287651, 214560, 163302, 170824, 205652, 210132, 192760, 186864, 254298, 198128, 185016, 181371, 260881, 309706, 269182, 256672, 248228, 241748, 232543, 226639, 211200, 194729, 170184, 185096, 210084, 237133, 188847, 207022, 312362, 366935, 287973, 298223, 267301, 182811, 185915, 140071, 159679, 229449, 301861, 320017, 338909, 379924, 373315, 292660, 178381, 107424, 124255, 236282, 312526, 229708, 214379, 326943, 384592, 265964, 311887, 358931, 266165, 197106, 189939, 157541, 148888, 212730, 214390, 218368, 213094, 172497, 141479, 74562, -5617, -19532, 111284, 168703, 89124, 152483, 172494, 168926, 214746, 155220, 111082, 134081, 225245, 253220, 345949, 420709, 405916, 327087, 240557, 254737, 226501, 134873, 153414, 193661, 218808, 205760, 203397]
9515B03397J1329n2969o696l4460m122L1229M0758K141l6964r8883k5114L0573
9503F0219Q0057l5157q2461m768K7114O3578K2492j1577k1077L3277L3426N1345
9491B16468K6050j23966r364Q824l9008N1710M5040q7402P705O0177L5080k898
9479A88416o2614J1592J14506J4769n7874k2378m4149K813p363K074N3185L1974
9467B24951P3369O5560j7025p7727j04424O7055P3937k9011R279q0184k1753M1648
9455B25675K0962l6704n0989m8484K0487K0922J7328K0390M4576k8418o2583M62
9443A43624P054M2605N3475M0725m1074P8868M8928j28033j14609p7480q657K3259
9431F8685P407Q621O9560L3132k9840k155m1717M140N6316K8107r694J17080j1081
$$ y = [203397, 214726, 161757, 155061, 120601, 116479, 147708, 188466, 190607, 153643, 54760, 29646, 60219, 140276, 105119, 22658, 17890, 45004, 108582, 131074, 119497, 98420, 131697, 165123, 216468, 242518, 118552, 109188, 118012, 79004, 130714, 175754, 88352, 96057, 156234, 191314, 188416, 125802, 137394, 251900, 266669, 208795, 186417, 142268, 145081, 137718, 139792, 192977, 224951, 298320, 363880, 346855, 269128, 164704, 231759, 305696, 276685, 285964, 205780, 184027, 225675, 246637, 209933, 158944, 110460, 130947, 151869, 169197, 189587, 234163, 205745, 143162, 143624, 150678, 193283, 246758, 287483, 246409, 325277, 374205, 246172, 131563, 54083, 45426, 68685, 76092, 84713, 154273, 187405, 157565, 155410, 113693, 117833, 174149, 202256, 192562, 309642, 298561]
9418B98561m4599K3025q4894q3293M1060k8953j31402M7975L0610N095N6374J5004
9406A44563l7553l0522k6208m402L5592p3824J055N2285M4820Q4807L6440L9098
9394B66151P8749K8221m0479p4481p1559m3342o4240n4492Q4318P9603P390l2576
9382A63263p937L9288j5972o568j7371O1356O1237q6670j7906L5167J03053M4585
9370C55525j628o8479o7M4560J5620j7729r0652K1490L8333o669k6501o9221K3200
9357B17782j3864P7818J17529j2375k4029J761O957k5687n1664M7433N1180m9050
9345C43791K1723m8059j00838K8024J25779O146m8004l3977j8049K426J0442j1573
9333B77831l4264J12159P7379P5196J8063p0344o0302K6328N348L8816J7580J3605
$$ y = [298561, 253962, 276987, 192093, 108800, 149860, 120907, -10495, 37480, 68090, 73185, 129559, 144563, 107010, 76488, 50280, 45878, 81470, 7646, 8701, 60986, 105806, 190613, 227053, 266151, 344900, 373121, 332642, 258161, 186602, 143260, 79020, 24528, 108846, 188449, 195839, 163263, 155326, 194614, 178642, 172074, 154703, 216059, 277296, 190626, 172720, 207887, 310940, 355525, 353897, 285418, 285351, 329911, 345531, 327802, 237150, 258640, 296973, 290304, 263803, 194582, 217782, 203918, 281736, 399265, 386890, 362861, 364622, 371579, 345892, 294228, 341661, 392841, 343791, 365514, 317455, 216617, 244641, 370420, 376566, 328562, 294585, 276536, 278962, 289404, 277831, 243567, 355726, 433105, 508301, 526364, 456020, 395718, 422046, 427394, 466210, 483790, 497395]
9321D97395Q2769J52324p0783j04738L7961J18760J66269l267Q731N7549k222
9310I40748N3133O9981J08467L7576Q1404R5203N8301j3741L1170M5081Q3598
9299A590921R9196J10581P8057N5860N4358Q4356Q7807J41453K07895J82379J55477
9288B848340J50587K53149J74122J99278K07587K28667K17493K63810K49302K57733
9278E050068K19177J68782K08466K04818J39141Q2332m079M4367J24581J34123
9268F371776J31985J62562L9457K05424K18719J40902L32378K89430L31826L44875
9258H569334K57107K06870J46570J90216J08486o0154L4776P3064p4584J9894
9248I471579L5273O3351N7139J28471J49128K13152K10408K23701K81808K80595
$$ y = [497395, 580164, 732488, 661705, 556967, 594928, 713688, 879957, 876690, 885421, 942970, 940748, 993881, 1063862, 1172329, 1209905, 1291309, 1386512, 1444813, 1431072, 1462242, 1507323, 1590921, 1690117, 1800698, 1878755, 1934615, 1988973, 2073329, 2161136, 2302589, 2510484, 2692863, 2848340, 2998927, 3252076, 3426198, 3625476, 3833063, 4061730, 4279223, 4543033, 4792335, 5050068, 5269245, 5438027, 5646493, 5851311, 5990452, 6072784, 6068705, 6113072, 6237653, 6371776, 6503761, 6666323, 6705780, 6911204, 7129923, 7270825, 7603203, 7892633, 8224459, 8569334, 8826441, 9033311, 9179881, 9370097, 9478583, 9418429, 9453205, 9526269, 9451685, 9471579, 9506852, 9570203, 9627342, 9755813, 9904941, 10118093, 10328501, 10552202, 10834010, 11114605]
9238A1114605K72144K81422J62840J41792J32510K22597J16902J43048L53335
9229A2941195M17341L97146M52292M05611N54490M64878M93395N92016N83858
9220A7302222N62387M63365M22091M39938N61120O31738O60049O09822P59495
9211B2412227R46549R04353Q43231R14445Q19791P68114P21851O50504O04581
9202B9585646O14236O38075N98011M07390L70377M76232L42454J87171L15981
9193C3535573L97738M98682L81185L37941M81310N03808N87871O10155O41933
9184C7976196N66022N27923M43080L84260K40762J25465m0718j48017k06246j93144
9174C9675583l61025l92429m83362m07677m35823n46321o43337p10645p35982
$$ y = [11114605, 11386749, 11668171, 11831011, 11972803, 12105313, 12327910, 12444812, 12587860, 12941195, 13358536, 13755682, 14207974, 14613585, 15168075, 15632953, 16126348, 16718364, 17302222, 17864609, 18327974, 18750065, 19190003, 19751123, 20382861, 21042910, 21652732, 22412227, 23358776, 24263129, 25106360, 26020805, 26840596, 27608710, 28330561, 28981065, 29585646, 30199882, 30837957, 31435968, 31843358, 32213735, 32689967, 33032421, 33219592, 33535573, 33933311, 34431993, 34813178, 35151119, 35632429, 36136237, 36724108, 37334263, 37976196, 38542218, 39070141, 39513221, 39897481, 40138243, 40263708, 40222990, 40074973, 39868727, 39675583, 39314558, 38922129, 38438767, 38031090, 37595267, 37048946, 36405609, 35694964, 34958982]
9165C4958982o55134n94991o22532o40435o23380n64648m86891l50220l82036
9156C0038715l97715l31332k74976k62095k64584q9155j5219L381m8289j1507
9146B8347224q892N3920O7549J69247J93178J07102J32088J03160k2923n2796
9136B9088857j90913l32459n24186n97014o86347o49803o47807n71842n54678
9127B4333808n98098l99590l53095k45776k22338o5180m7368L1703J45732J96737
9117B2776535K67248L40722M03565K99798K67075J90245O4710j24985k27578l19828
9107B3937507m16744n35056n89960o26285o31676o80212n99942o20679n69831
9098A8667122m94147m96981m95520m39346n16064n41951m16977l75783m41243
$$ y = [34958982, 34303848, 33708857, 33086325, 32445890, 31822510, 31257862, 30770971, 30420751, 30038715, 29641000, 29309668, 29034692, 28772597, 28508013, 28418858, 28403639, 28407020, 28358731, 28347224, 28338332, 28392252, 28459801, 28629048, 28822226, 28929328, 29061416, 29164576, 29141653, 29088857, 28897944, 28565485, 28041299, 27444285, 26757938, 26108135, 25460328, 24888486, 24333808, 23735710, 23336120, 22983025, 22737249, 22514911, 22449731, 22402363, 22434066, 22579798, 22776535, 23043783, 23384505, 23788070, 24087868, 24354943, 24545188, 24609898, 24484913, 24257335, 23937507, 23520763, 22985707, 22395747, 21769462, 21137786, 20457574, 19857632, 19236953, 18667122, 18172975, 17675994, 17180474, 16741128, 16225064, 15683113, 15266136, 14890353, 14449110]
9089A4449110m22917l93080l05621k98382l15557j77406j80537j82120k14143
9080A1959347j71113j86730j34678q1428r2860Q6564J00706J3205J001J33855
9070A1627869K01860K31608K71673K64404K80729K16179J47717J33837J05163
9061A3481039P7430P9481m7836j15023j96439j72873l2741k42770j95812j72956
9051A2461500k75838j91379j40966j39431j40551j26375m3910O6161P7662J07453
9041A1654326K17634L08582M64398L97760K12027K13279K13908K7654K6470j05496
9031A3630542r4248j46657j90030l28759l66572l96889m10399l49781l45546l70052
9021A0631609l87344l84705l28967k86053k88557k22178k76282k99864l04674
$$ y = [14449110, 14026193, 13633113, 13327492, 13029110, 12713553, 12536147, 12355610, 12173490, 11959347, 11788234, 11601504, 11466826, 11385398, 11292538, 11379102, 11479808, 11493013, 11494014, 11627869, 11829729, 12061337, 12333010, 12597414, 12878143, 13094322, 13242039, 13375876, 13481039, 13558469, 13637950, 13590114, 13475091, 13278652, 13105779, 13073038, 12830268, 12634456, 12461500, 12185662, 11994283, 11853317, 11713886, 11573335, 11446960, 11403050, 11469211, 11546873, 11654326, 11871960, 12180542, 12644940, 13042700, 13254727, 13468006, 13681914, 13709568, 13736038, 13630542, 13536294, 13389637, 13199607, 12870848, 12504276, 12107387, 11696988, 11347207, 11001661, 10631609, 10244265, 9859560, 9530593, 9244540, 8955983, 8733805, 8457523, 8157659, 7852985]
9012G852985k25734j89769p2902j78482j64189q1854j31641j05135q5165q5349
9002F532765j89464p4540n8429j64178j24937j35943j34442j10196n1027l6254
8992E453355m3502j7244J03020J3227j23503m7187P4153N1521R8362J53667Q7605
8981E803474K4975m2485j45374j07381j02550j33274j09785j34309j45616j03875
8971D803800j35948j17601n4335R559j03936n871n442N581L9660k3458m750P177
8959D414436N1596K206R2829J17477N2912l2921J1132r353p1904j07783k9674
8948D490953o2566j79746j20420q6487l5652l7628m1991l0446n2922o7244m8561
8937C727290M710o1035p6496J40219J15185M7340J04763L1595p0859p524R6900
$$ y = [7852985, 7627251, 7437482, 7364580, 7186098, 7021909, 6940055, 6808414, 6703279, 6618114, 6532765, 6343301, 6268761, 6210332, 6046154, 5921217, 5785274, 5650832, 5540636, 5489609, 5453355, 5409853, 5392609, 5495629, 5508856, 5385353, 5338166, 5412319, 5463840, 5562202, 5715869, 5803474, 5828449, 5785964, 5640590, 5533209, 5430659, 5297385, 5187600, 5053291, 4907675, 4803800, 4667852, 4550251, 4495916, 4505475, 4401539, 4395668, 4390226, 4395807, 4435467, 4412009, 4407259, 4414436, 4466032, 4468238, 4561067, 4678544, 4731456, 4698535, 4709667, 4700314, 4628410, 4520627, 4490953, 4428387, 4248641, 4128221, 4041734, 4006082, 3968454, 3926463, 3896017, 3843095, 3775851, 3727290, 3732000, 3670965, 3594469, 3734688, 3849873, 3897213, 4001976, 4033571, 3962712, 3955188, 4052088]
8926D052088J30659P2567m6308L6965o577M3663k3290K2375J53574L7121k5963
8915D446874M2385J22402j958j9738j8558O5899N849k8642K2270M0583P9276K4220
8903D780862K1116m07L9213p881O489J49439J42072R0068Q3931R15N302M8898
8891E360017J07912Q3230P8939O8436O9468J43644J85650J38067J0603R5057K07057
8880F548080J57160J66801K33535L07857L32755K23157K62224L30453M24965M56273
8870I443260M89236N32981O14843O97272P44871Q40650R93519J005891J182610
8861A6545133J517075J704310K015569K478672K905693L440065M130296N113774
8853C9850587O068952P272339Q999835J1269108J4396266J8920757K5195941L3616393
$$ y = [4052088, 4182747, 4255314, 4209006, 4245971, 4239394, 4283057, 4259767, 4282142, 4435716, 4472837, 4446874, 4489259, 4611661, 4609703, 4589965, 4571407, 4637306, 4643155, 4614513, 4636783, 4677366, 4756642, 4780862, 4801978, 4801571, 4840784, 4832903, 4839392, 4988831, 5130903, 5220971, 5304902, 5305817, 5311119, 5360017, 5467929, 5551159, 5630098, 5698534, 5768002, 5911646, 6097296, 6235363, 6245966, 6341023, 6548080, 6705240, 6872041, 7105576, 7413433, 7746188, 7969345, 8231569, 8562022, 8986987, 9443260, 9932496, 10465477, 11080320, 11777592, 12522463, 13363113, 14356632, 15362523, 16545133, 18062208, 19766518, 21782087, 24260759, 27166452, 30606517, 34736813, 39850587, 45919539, 53191878, 62191713, 73460821, 87857087, 106777844, 131973785, 165590178]
8845A65590178M4493523N6773020O6748691O7701771N6240268L6129430J0856590
8838E04533471j8832285m6404293o0307043n7500572m6387587l5025421k6068193
8831B14008077j9616984j4851612j1289056q837722p157888n899849m931477m093690
8823A37329799l590782l111186k595005k119588j553982j198223q91517o08575
8815A21660941l52389m1188P6067J33426J23566j42332p43409j639914k585738
8806A16489030l523233m053545m085496l992381l669315l370375l060124k671181
8798H8063380k430180k286871k269447k414791k766120l049614l330377l457674
8790F6058306l299350l017281k889600k782659k715231k530635k373614k242344
$$ y = [165590178, 210083701, 266856721, 333605412, 401307183, 457547451, 493676881, 504533471, 485701186, 439296893, 378989850, 321489278, 275101691, 240076270, 214008077, 194391093, 179539481, 168250425, 159412703, 152254815, 146354966, 141423489, 137329799, 133739017, 130627831, 128032826, 125913238, 124359256, 123161033, 122269516, 121660941, 121308552, 121267364, 121343431, 121476857, 121600423, 121458091, 120714682, 119074768, 116489030, 112965797, 108912252, 104826756, 100834375, 97165060, 93794685, 90734561, 88063380, 85633200, 83346329, 81076882, 78662091, 75895971, 72846357, 69515980, 66058306, 62758956, 59741675, 56852075, 54069416, 51354185, 48823550, 46449936, 44207592]
8782D4207592k170544j996125j808335j776989j652887j487552j471306j374356
8774C0469498j333253j266820j283187j203751j095913j047536r89119q41738
8766B1408181q59132q04510p39961p99849p77944o94168o50998o66591o33827
8757A4781201o53705n85500n04313n01252m09424m68811m39878m34222l87310
8748A0396786l93763m33562l42532k54871k60488l33430k65097k27071l55397
8739G530575k69405k50257j82717j85280j91355j36927j74520j99671j90219j39073
8729E611151j14287k05473j50497j07182j42055p2363l1884q1092o3966j6230
8719D626122O266p8252l0845m5184k05676j48269o6006q3163j22104j53712j15819
$$ y = [44207592, 42037048, 40040923, 38232588, 36455599, 34802712, 33315160, 31843854, 30469498, 29136245, 27869425, 26586238, 25382487, 24286574, 23239038, 22249919, 21408181, 20549049, 19744539, 19004578, 18204729, 17426785, 16732617, 16081619, 15415028, 14781201, 14127496, 13541996, 13037683, 12536431, 12127007, 11658196, 11218318, 10784096, 10396786, 10003023, 9569461, 9226929, 8972058, 8711570, 8378140, 8113043, 7885972, 7530575, 7261170, 7010913, 6828196, 6642916, 6451561, 6314634, 6140114, 5940443, 5750224, 5611151, 5496864, 5291391, 5140894, 5033712, 4891657, 4819294, 4787410, 4706318, 4642352, 4626122, 4632388, 4554136, 4523291, 4478107, 4272431, 4124162, 4058156, 3974993, 3852889, 3699177, 3583358]
8708C583358j16048j79430p6616j27037j54467j41936q9161J0583o2589k4267
8698B622390n0150O172J676p8222r3554r0053K4931O4843M1165l16j5798Q7006
8686B520090n114o3411m3885l2913K9098L776L3109J5832J9412J12521J1699O3667
8674B663881l0747p4940j8309N4868J02770L1644J6907m6636M573j9041J5598
8663B700568j5680K4682N0651J1404k8922n34J6850K2874N1608J8283j5428p6609
8651B759747o6708l5262K2188N952n241j10753k8776k3023K5628r7539j08529
8640B337684J21490J7497J426m349P6347k5277j27465j40752j17220q5753n8802
8629A994826k1702l479m4121q579N0749K4032R0982J9125q1955Q212J6296j21547
$$ y = [3583358, 3467310, 3287880, 3211264, 3084227, 2929760, 2787824, 2698663, 2709246, 2646657, 2622390, 2572240, 2578412, 2580088, 2501866, 2408312, 2318259, 2343190, 2408033, 2449198, 2448882, 2433084, 2520090, 2514976, 2451565, 2407680, 2374767, 2403865, 2407641, 2440750, 2456582, 2475994, 2588515, 2600214, 2663881, 2633134, 2558194, 2539885, 2594753, 2697523, 2729167, 2746074, 2699438, 2704011, 2684970, 2700568, 2684888, 2709570, 2760221, 2771625, 2742703, 2742169, 2759019, 2781893, 2833501, 2851784, 2836356, 2759747, 2693039, 2657777, 2679965, 2685917, 2680676, 2569923, 2541147, 2518124, 2543752, 2446213, 2337684, 2459174, 2476671, 2478097, 2473748, 2550095, 2524818, 2397353, 2256601, 2139381, 2053628, 1994826, 1973124, 1969645, 1925524, 1916945, 1967694, 1991726, 2082708, 2101833, 2019878, 2028090, 2044386, 1922839]
8617A922839j41430K5616L2280j30213o5108R501j0719J3781k5161l4328j47j1722
8605A585189J5384k3129m0781o3492k2571J9005J4657M5268r6180p0117m221k5531
8593A333481R6564M8559q2575J7123q4277O1304P8135n686l255n307k6775o2487
8581A364804L3181j22627Q481o579l1667o096n9038J1938n715l2240k1077m1050
8569A092315o746o3748k5150n8368k2548q4153j9484J1253r3529J8754N0974j3724
8557G85846p2002L9021M3953k5659j7634k2188K6966N0476L7401k9768n3609q7517
8545F75286j9859r5622m173J0818m8602j5965m8961O0878J43717N9899M5139O5431
8533H27986M6648L7735l089j8590k5791K5502M3335p759m413k6713n7756j4066
$$ y = [1922839, 1781409, 1807025, 1839305, 1709092, 1643984, 1653485, 1642766, 1656547, 1631386, 1597058, 1596911, 1585189, 1600573, 1577444, 1536663, 1473171, 1450600, 1469605, 1484262, 1529530, 1433350, 1363233, 1359012, 1333481, 1430045, 1478604, 1396029, 1413152, 1328875, 1390179, 1468314, 1462628, 1459373, 1454066, 1427291, 1364804, 1397985, 1275358, 1283839, 1277260, 1245593, 1239497, 1180459, 1192397, 1186682, 1154442, 1133365, 1092315, 1085569, 1021821, 996671, 938303, 915755, 831602, 812118, 823371, 729842, 748596, 799570, 785846, 713844, 752865, 796818, 771159, 753525, 731337, 758303, 808779, 846180, 816412, 762803, 675286, 655427, 559805, 555632, 566450, 517848, 501883, 452922, 513800, 657517, 717416, 762555, 827986, 874634, 912369, 909280, 890690, 864899, 890401, 933736, 925977, 921564, 894851, 837095, 823029]
8521H23029m8806J7643O1985k4085m2311K251k7088N798J7447k2918r391q4832
8509F68722m4924R3546J51012L4087J3958m081o572m5898N185p4174m096k9203
8497G57562p117j7014n7786l2959O9011R5289m7803k8708J7659M1486O3930n1617
8485H01933j3494j3067l3486l260P9945J6287l7397m2317l510k6639j02351k6519
8473E96125n3571J0710M3319J5603M3472k2196o7793j1604J03877l6835j13092
8462E08015j3328J03681O5007n3005j8548l2689R146K2098L3829Q2019N7741O6136
8450H30102J02076j6354M7832N0358Q4618J11224P7295J79096J94272J41962J43103
8439A945584J53973M2111Q7869J07752J2752r7914r9266k7903j05542j74766j46540
$$ y = [823029, 774223, 791866, 853851, 829766, 787455, 789706, 762618, 768416, 785863, 762945, 753554, 668722, 623798, 717344, 868356, 902443, 916401, 912320, 905748, 859850, 865035, 790861, 786765, 757562, 750445, 733431, 675645, 642686, 711697, 806986, 759183, 730475, 748134, 789620, 853550, 801933, 788439, 775372, 741886, 738626, 818571, 834858, 797461, 755144, 751634, 724995, 622644, 596125, 542554, 553264, 596583, 612186, 655658, 633462, 565669, 554065, 657942, 621107, 508015, 494687, 598368, 663375, 610370, 591822, 559133, 568279, 590377, 624206, 706225, 763966, 830102, 932178, 915824, 963656, 1014014, 1098632, 1209856, 1287151, 1466247, 1660519, 1802481, 1945584, 2099557, 2141668, 2229537, 2337289, 2350041, 2252127, 2152861, 2124958, 2019416, 1844650, 1698110]
8428A698110j17938p1344n0168n0722m4418j00205m3659l5797K461m2395l7665
8417A106260J0453j5729m8591j0251k379m6407o9912j0566P1470K3938n3068k5665
8405I29553M8450M6481r4o8428p2492m9777o6578J3373k3008l3023L6716J9543
8393G80716k8035M101J5362q599n1371r5926l9330J5003j8888N4405k2736J422
8381F06124M7411M1060J3981o1740o2258k5251j334n4435L589O6597m8806p7423
8369D47515k8691O1909j7999l0906N9018O5563L6859k7992k524j6531p9851o6037
8357D00333o193j5274K9154M4365L0213J9313j6250l5451J9568O2393l0771l0150
8345D71250k3244n5636k4433P2349K3815l1559r9114o8032L8327J383O222r500
$$ y = [1698110, 1580172, 1508828, 1458660, 1407938, 1363520, 1263315, 1219656, 1183859, 1186320, 1143925, 1106260, 1116713, 1100984, 1052393, 1042142, 1039763, 993356, 923444, 912878, 984348, 1008286, 955218, 929553, 978003, 1024484, 1024390, 955962, 883470, 833693, 767115, 780488, 757480, 724457, 761173, 780716, 752681, 756782, 772144, 763545, 712174, 616248, 576918, 591921, 573033, 627438, 604702, 606124, 653535, 694595, 708576, 646836, 584578, 559327, 557993, 503558, 507147, 573744, 524938, 447515, 418824, 480733, 462734, 431828, 490846, 556409, 593268, 565276, 562752, 546221, 466370, 400333, 394140, 378866, 408020, 452385, 482598, 501911, 485661, 450210, 469778, 532171, 501400, 471250, 448006, 392370, 367937, 440286, 464101, 432542, 333428, 265396, 303723, 305106, 311328, 301828]
8333C01828l9626Q7499j3972m194J2867O5507m3125m9779j12809l1781L8214N9281
8321B69910M7035j6581j7742p3928M1803N3672M0756m4857j0004l0951l7269m3680
8309A78164l1540L2283J04596J31297k5766m6299J5776l38n6257k5285r494L8655
8297C05792N4224M7095j9181K1798k4524j26297j14805j24k0847k3621L8837N9064
8285A97411Q6487M9573q7211r3444L0721L5782J8111K3961J4301R627n0312l9346
8273A95661O7776Q2191J0820p690n068m1432p8518M604N6002J2400j1120M4641
8261C30267P9338k0266O335k8073j7652L055l2921J4628L4983o1988o3974o0733
8249A82999O9084r1492K5267M2623K0024o211o0426L0750j5432m358N2453m1732
$$ y = [301828, 262202, 349701, 335729, 331535, 344402, 409909, 366784, 317005, 204196, 172415, 210629, 269910, 316945, 300364, 282622, 208694, 250497, 304169, 344925, 300068, 290064, 259113, 221844, 178164, 146624, 178907, 283503, 414800, 389034, 342735, 358511, 358173, 301916, 276631, 267137, 305792, 360016, 407111, 387930, 409728, 385204, 258907, 144102, 143978, 123131, 99510, 138347, 197411, 283898, 333471, 246260, 152816, 183537, 219319, 237430, 261391, 275692, 285319, 235007, 195661, 263437, 345628, 356448, 348758, 343690, 302258, 223740, 228344, 284346, 296746, 285626, 330267, 409605, 389339, 395674, 367601, 349949, 353004, 320083, 334711, 369694, 307706, 243732, 182999, 252083, 160591, 185858, 228481, 248505, 242294, 181868, 212618, 197186, 192828, 245281, 203549]
8237B03549l8451j7983O631J00213Q0938R42K0080k2739k6581n3641m307M0724
8225B89375l2259l649m0498O9998J19244J8039k155m1289j9730k4306k5580L9177
8213C46367l1261m9865K4976K2990j7332l428n2246J3725K4012l3968n2989L4670
8201B25651l2184o1497L8432n832M1974M5940K3492k8331j1580o9530L1493L0522
8189B28550K3241K0248N5523o9093j2188J6979M8559J9485n239J4706r368K768
8177C34171q6352j8841K0375k0733J8189k0242o0254Q3212K4681n4635q523K021
8165B13069L6759l364q4936K6718j7100M0337K4511l0456O8112q140R475M9450
8153C24435n5302N075J5048l4859J9342o2188j8725m3774r3942q6527J19986J21393
$$ y = [203549, 165098, 147115, 153746, 253959, 334897, 335839, 355919, 333180, 306599, 252958, 248651, 289375, 257116, 253467, 212969, 282967, 402211, 420250, 418095, 376806, 357076, 332770, 307190, 346367, 315106, 265241, 290217, 313207, 295875, 292447, 240201, 253926, 277938, 243970, 190981, 225651, 193467, 131970, 170402, 164570, 206544, 252484, 275976, 247645, 236065, 166535, 198028, 228550, 251791, 272039, 327562, 258469, 246281, 263260, 311819, 331304, 326065, 340771, 331403, 334171, 247819, 228978, 249353, 228620, 246809, 226567, 166313, 249525, 274206, 219571, 211048, 213069, 249828, 246464, 161528, 188246, 171146, 211483, 235994, 205538, 273650, 265510, 274985, 324435, 269133, 274208, 289256, 254397, 273739, 211551, 192826, 149052, 55110, -31417, 88569, 209962]
8141B09962k754l315k1726L776L601l974l4803l1412L7106Q086k8264n5685K7234
8128A07832r689K3344J5911O5283N8979l7322l7810J3915n0844j1982N539j787
8116A41369L9963l1078l5072m3345J7473N7108j3584o457n3246l4221Q1459K369
8104A22738j9379N3134r628j3620j4171L7982P2754l6518r1879n966O4731M4139
8092B04317J3749M0135l403P7438n2386r9826q6282J116j0826O778J0543M4472
8080A45825qK5545M4766n0903l9141Q8453L4036K0480q5423k8760O3566Q451M3560
8067B70447k5986N460K6587j7202p2575L0403K6721P475o6688n3322K3812m7113
8055A08019q5828J19080J24712J8002q6908r5234K509j815J2287N1620Q6888M0088
$$ y = [209962, 207208, 203893, 182167, 185943, 189544, 185570, 150767, 119355, 156461, 164547, 136283, 80598, 107832, 98143, 121487, 137398, 202681, 261660, 224338, 186528, 200443, 149599, 137617, 143156, 141369, 181332, 150254, 115182, 71837, 89310, 146418, 132834, 126377, 73131, 38910, 120369, 122738, 103359, 156493, 146865, 133245, 119074, 157056, 229810, 193292, 101413, 95447, 160178, 204317, 218066, 258201, 254798, 332236, 279850, 180024, 93742, 94858, 84032, 90810, 101353, 145825, 145817, 171362, 216128, 165225, 126084, 214537, 248573, 269053, 183630, 154870, 218436, 226887, 270447, 244461, 249921, 276508, 259306, 186731, 217134, 243855, 251330, 184642, 131320, 155132, 108019, 22191, 141271, 265983, 283985, 197077, 101843, 104352, 102537, 114824, 166444, 253332, 293420]
8043B93420m2964j01275m1582j136L1529k3854k7064j9564l1204l6482J21671
8032A21495m201j4334J4902L6372p8777k0785o2630m8728l2941j924P9225R3191
8020H0865r531P6199K4078J9978o0273k8639o335l7333L8726P6036j8045k9385
8008A26341K3008O5580M804m6215m1951P798P591J249N977j3071n8271j4472l5451
7995C2917L7240K2875R3559j0952j32251l6020K0035M5360O8218k606N1671K8523
7983B18569k269j3225k4142j0068m974Q6730l5061n2064K751N025k2431J6528
7971A65369l4951Q8687K3717m924R370K9735p7784M828M4016k0101j3711m7825
7959A66426q1091Q3448K9853m9158j7036O4883J57972K3113j08059p3268j9867
$$ y = [293420, 250456, 149181, 107599, 106463, 137992, 114138, 87074, 67510, 36306, -176, 121495, 117294, 102960, 117862, 154234, 75457, 54672, -7958, -56686, -89627, -91551, -12326, 80865, 71334, 147533, 171611, 191589, 131316, 102677, 96342, 59009, 97735, 173771, 155726, 126341, 149349, 214929, 219733, 173518, 131567, 139365, 146956, 148205, 154182, 141111, 82840, 68368, 32917, 70157, 93032, 186591, 175639, 43388, 7368, 27403, 72763, 140981, 138375, 190046, 218569, 216300, 203075, 178933, 168865, 163891, 250621, 215560, 163496, 166247, 171272, 148841, 165369, 130418, 219105, 242822, 237898, 247268, 277003, 199219, 204047, 248063, 227962, 214251, 166426, 85335, 168783, 198636, 149478, 132442, 197325, 355297, 378410, 270351, 197083, 177216]
7948A77216k0154k918o3175p3480K3907J31747o569l6246R045l1069l0144J10018
7936A88178K9126m8195j04568L527R1162o9289m6035o2196K8965J12290M9537
7925A72502n9268P459k7109m4194J7166r4257Q72J00657J17484O8362n294o6032
7913A88348k3339o4103k841J2753l2065n1366L8739N2585L3743P1193l6475j19351
7901F7821m7083P5647N1298k1500n4357o366j13193l3235J06145R7702R0116o061
7889B06934r2991k6552J9225k1068M083J4682k9259j747k171N1283K1706k362
7877A41763m5560j21816n5240J7343K1139O8072O7603m8677L3434L6809k3884
7866I0986r8164r6673l6356R30J22735J34947N3995l0538K2146J9896r05k9009
$$ y = [177216, 157062, 154144, 90969, 17489, 41396, 173143, 166574, 130328, 139373, 108304, 78160, 188178, 217304, 169109, 64541, 68068, 159230, 89941, 43906, -18290, 10675, 122965, 172502, 113234, 120693, 93584, 49390, 66556, -27701, -26829, 73828, 191312, 259674, 254380, 188348, 165009, 100906, 98065, 110818, 78753, 27387, 66126, 118711, 152454, 223647, 187172, 67821, 20738, 96385, 147683, 126183, 71826, 65460, -47733, -80968, 25177, 122879, 212995, 206934, 113943, 87391, 106616, 85548, 89631, 104313, 75054, 73307, 71136, 122419, 144125, 141763, 96203, -25613, -80853, -63510, -42371, 25701, 93304, 44627, 78061, 114870, 90986, -7178, -103851, -140207, -139277, -16542, 118405, 172400, 141862, 164008, 183904, 182999, 153990]
7854A53990l9610N638n0931m6196J6094K2117m8181J0985m152M056r324l7403
7842b2917K1805q043M872q1004L2758P5085j0475J8746J151n8019m6260l6451
7830a08752O7994L9828J6249Q7206N1706J9797l2315j15602l8562K8507j3189
7819B867K3747Q6358Q0742m4479j13106M9735j7972q310K5O4058n5153m3221l9785
7806a4494n6315M8906O9480L848L3745J4073L1697q7591L690K1831j3465m5954
7794I451M6382M1098j0813M766L6192k9199m5350K1516o27L7478m6240n0242n4858
7781d0446R1487J5341K5422o1553m772o6175J6934J9137N2063K4310L0498l5051
7769F7195q64n626m3760p9738j0664L8457j7286j9301N5362m163M2433L8377L0343
$$ y = [153990, 114380, 120018, 69087, 22891, 38985, 61102, 12921, 23906, 19754, 23810, 14486, -22917, -1112, -9155, -4283, -85287, -52529, 22556, 12081, 30827, 31978, -26041, -72301, -108752, -40758, -930, 15319, 102525, 154231, 174028, 141713, 26111, -12451, 16056, 2867, 26614, 112972, 193714, 149235, 36129, 85864, 67892, 59582, 59607, 123665, 68512, 25291, -14494, -70809, -21903, 47577, 51425, 85170, 99243, 130940, 43349, 47039, 68870, 55405, 9451, 55833, 96931, 86118, 90884, 127076, 97877, 52527, 74043, 73416, 110894, 64654, 14412, -40446, 51041, 66382, 91804, 30251, 25479, -40696, -23762, -4625, 47438, 71748, 102246, 67195, 66331, 60705, 16945, -62793, -73457, -35000, -52286, -71587, -16225, -20388, 22045, 60422, 90765]
7756I0765m895o3071M6887M561n3565n5061K6909K2902k1229O080K4658K1544
7744D6485l4088o5882Q691L0465p109j2251L273R8440K2367P4206K7723p4768
7732A17552K3452J5604L2794r1435l5169K4780K7040K76p3376K548L9388p410
7720G6044L2731k4697K46K8919m1147q6262o8987j0900L9772J41716K0421n6910
7708E0946j0924M2208Q183k6482J0500r870P397L3958N092K6316N1849j9655J6278
7695A85796m269p3029J0889M7662K5078L1242m9304o9805q4616q371M2760J3564
7683F7597o1326n3780P8458L2840j7755n0805M5953L849j6677K7519j1227M5857
7671I0503m7764p4226J6642O7077n626n181M2320n1010o9372j3544O0831p542
$$ y = [90765, 85870, 22799, 69686, 74247, 20682, -34379, -7470, 15432, -5797, 283, 24941, 46485, 12397, -53485, -44794, -14329, -21438, -33689, -30416, 68024, 90391, 164597, 192320, 117552, 141004, 156608, 189402, 97967, 62798, 87578, 114618, 114894, 41518, 44066, 83454, 76044, 108775, 84078, 84324, 113243, 72096, -14166, -83153, -94053, -54281, 87435, 107856, 50946, 40022, 82230, 90413, 63931, 74431, 64561, 71958, 105916, 111008, 137324, 189173, 169518, 185796, 181527, 108498, 119387, 167049, 192127, 223369, 174065, 104260, 19644, 11273, 54033, 67597, 6271, -47509, 30949, 63789, 46034, -4771, 41182, 45031, 28354, 55873, 44646, 90503, 42739, -31487, -14845, 52232, 46606, 41425, 83745, 32735, -36637, -50181, 10650, 3108]
7659C108P0238l7951o4836p811J57522M3320j7685K2480j469l4784l2912j299
7647I7921o1863k0484K7684K7631M9628O3677J6722k4318n3490P3330J4540n1557
7635A59421j82172l1806J128O6038R0671M138O4248n872k9497L3563O133o4916
7623A11077p8750j2155r096K795M5730J7141j3610j0452L0662N1497q0190n5500
7611h51k0646l0161j2021k3973r903P6704j9099m9008L273k8934p208Q8192J41813
7598A08178j8308Q633p5355n1659K7946j8354M3944L3843j2835J0235M6263j8906
7586H3625n0497q7048l6848M1819o225j6970l1079R7036P1125N122K6887Q7084
7574A84031J2126q6167k8431J4087l7706P258J1545j9130m5661P4084O7759q3900
$$ y = [3108, 73346, 35395, -29441, -37252, 120270, 163590, 145905, 168385, 166916, 132132, 99220, 97921, 36058, 15574, 43258, 70889, 120517, 184194, 200916, 176598, 123108, 196438, 210978, 159421, -22751, -54557, -53429, 12609, 103280, 107418, 171666, 165794, 136297, 169860, 175993, 111077, 32327, 20172, 11076, 13871, 59601, 76742, 63132, 52680, 83342, 134839, 54649, -851, -21497, -51658, -63679, -87652, -97555, -20851, -39950, -88958, -85685, -114619, -121827, -33635, 108178, 89870, 98503, 23148, -28511, -565, -18919, 25025, 58868, 46033, 56268, 102531, 83625, 33128, -53920, -90768, -48949, -55174, -72144, -103223, -6187, 64938, 70060, 96947, 184031, 196157, 109990, 81559, 95646, 57940, 65198, 76743, 57613, 11952, 86036, 153795, 69895]
7562F9895r7552m6070O2934L9192K6741J5279J5445L4190j25641j9870l4873Q7207
7550B6877L5982Q8086o0389o4371N452L1423n4960l0290P1659O438M6015k506
7538I9416j6761M3477L97k8742l0360n8774L0957Q6999N392l3893k3284K1858
7526I6682k2293k6893m6736J1608P3942j02068J2396N5763n464l7847p438O8124
7514F9776k4760l2159m239L9554N299p8523J1250O8084J3899N787M8234k7133
7502I5069l8779l245k8640j6598K4820Q349P5250M7577r1418j1747K3178L9497
7490A23313j5473m5880m1588m6995m2406N8485N9236L7568J868J13905K3970J4380
7478B40383o3055j22291M997p004l8256M7356r708J5205J2168K0096n949N279
$$ y = [69895, -27657, -73727, -10793, 28399, 55140, 70419, 85864, 120054, -5587, -25457, -60330, 26877, 62859, 150945, 90556, 26185, 31637, 63060, 8100, -22190, 49469, 55907, 101922, 99416, 82655, 126132, 126529, 97787, 67427, 8653, 39610, 126609, 132001, 98108, 74824, 96682, 74389, 47496, 760, 12368, 86310, -15758, -3362, 52401, 46937, 9090, 1652, 69776, 45016, 12857, 8618, 48172, 53471, -25052, -13802, 54282, 68181, 73968, 122202, 95069, 56290, 53045, 24405, 7807, 32627, 40976, 116226, 163803, 72385, 60638, 83816, 123313, 107840, 61960, 20372, -26623, -69029, -10544, 48692, 86260, 88128, 202033, 226003, 240383, 177328, 55037, 60034, 53030, 14774, 62130, 52422, 67627, 79795, 99891, 93942, 99221]
7466I9221o07q472L5853m0415L6510o2689R14l0686k5200k3503k3596m1121M4531
7453c9260M2839L0311j8410P6488J5779q3526P300m1813J10949O8907k5479j7832
7441A26253J9349m8836k8238M3638L4154P5532K6120J1388n3055l1759L3582o0197
7429A47931j05095o8861M9686j2908K8779J20193N2189k2108q3264m2222j4249
7418E0071j1379j3922j7069l066J4684n4223K8698M005J0810P0353l8097o4837
7406b3972N2631j15041J3502J7344l4789J7725N2669Q4366m3005j51229l8155
7395a67954L4753J20120o159N6788K7400J2005k2004L7424L9684L171J2434O0
7383A47722r595k0816p1714k7344P0223J2657m6794m2075j7278R933K5617N4974
$$ y = [99221, 98614, 90142, 125995, 85580, 122090, 59401, 60315, 29629, 4429, -19074, -42670, -83791, -39260, 3579, 33890, 15480, 91968, 107747, 24221, 31521, -10292, 100657, 169564, 144085, 126253, 145602, 96766, 68528, 112166, 146320, 221852, 247972, 259360, 206305, 174546, 208128, 147931, 42836, -26025, 23661, 10753, 39532, 159725, 211914, 189806, 106542, 64320, 50071, 38692, 24770, 7701, 4635, 19319, -34904, -6206, -2201, 8609, 78962, 40865, -23972, 28659, -86382, -72880, -55536, -90325, -72600, -19931, 64435, 21430, -129799, -167954, -133201, -13081, -19240, 37548, 64948, 76953, 54949, 92373, 132057, 135228, 147662, 147722, 138127, 117311, 45597, 18253, 88476, 101133, 54339, 12264, -5014, 4919, 30536, 85510]
7371H5510M1689l3228K9307O2623j4248J1743P519n7112o5462m8933M3962N2736
7359A16106r784l0549O167m7202m0566J0722k8635K1103J3970P934m3460l5579
7347e9773L2956K4102M5424q3751j3053N7106k1711p740r404M371K8753K2159
7335A9439p176J3744N5252k6229M6022n8022L2567j3471m1190N1021M8179q4625
7323C5511p5300p1490M4824J851o004l055M5036O0317J3606j01013k0253O9569
7311f401j1865o6381j0084N1043O5745M1713Q317m3455N5419L6791K5629r1128
7299E5343l7173j3939n9825N0763K9573p854k1611J0758J9994L4993J8468m5664
7287C3826j0205L8374P2756P8004P793q0031m6422j3210o7762n8679k3010J02976
$$ y = [85510, 127199, 93971, 123278, 185901, 171653, 183396, 190915, 133803, 68341, 19408, 63370, 116106, 106322, 75773, 81940, 34738, -5828, 4894, -23741, -2638, 11332, 19266, -24194, -59773, -26817, -2715, 42709, -41042, -54095, 3011, -18700, -26440, -35844, -31473, -2720, 19439, 12263, 26007, 81259, 55030, 101052, 43030, 75597, 62126, 20936, 71957, 120136, 35511, -39789, -111279, -66455, -64604, -70608, -73663, -28627, 31690, 45296, -55717, -75970, -6401, -18266, -84647, -94731, -43688, 22057, 63770, 72087, 28632, 84051, 120842, 146471, 55343, 18170, 4231, -55594, -4831, 24742, 16888, -4723, 6035, 26029, 61022, 79490, 33826, 23621, 61995, 134751, 212755, 220548, 140517, 94095, 80885, 13123, -45556, -68566, 34410]
7275C4410O1489N462q5653n5591L1766j3278o7880k5500N2530k3675R0301J3211
7263A7592q0998K3681N0103N5697l1496m7482o3573n1407O3187M7656K7079N5897
7251F5936n2539n3131J2097J5918n6300j0278O5055K4663L5963j3493j0993J5119
7239C8017P801n6717K5464R3296L9779j2583K3755o0075J0816K5103N2742l0489
7227A56909q3402j1536K7258L8596q028j0324k7172j5839N954j2766R8450P0528
7215B28628j50833j3267K5239p2022m6056N123o1673M0688O0571J438Q4472j2705
7203H9603p7920l5216k1258L3169R2206q287K3700j790m3448l8530M0159M2785
7191I5173l0902k0021m8095K0452O6075J2309L655o762q0128K1216O4250K5735
$$ y = [34410, 95899, 101361, 15708, -39883, -8117, -21395, -89275, -114775, -62245, -85920, 4381, 17592, -63406, -39725, 10378, 66075, 34579, -12903, -76476, -127883, -64696, -17040, 10039, 65936, 13397, -39734, -27637, -11719, -68019, -78297, -13242, 11421, 47384, 33891, 22898, 38017, 45818, -10899, 14565, 107861, 147640, 135057, 158812, 98737, 109553, 134656, 187398, 156909, 73507, 61971, 89229, 127825, 119797, 109473, 82301, 66462, 72416, 59650, 158100, 228628, 77795, 64528, 89767, 17745, -28311, -23188, -84861, -44173, 16398, 17836, 102308, 89603, 11683, -23533, -44791, -11622, 80584, 72297, 95997, 94207, 50759, 12229, 52388, 95173, 64271, 44250, -3845, 16607, 82682, 94991, 98646, 91884, 11756, 32972, 97222, 122957]
7179A22957k7905l1284n3904L3517n0213j04734k3966N9675P7466n129k2565m0673
7167f6758O762N9858L2738j3572K7604j3476q5079N753j7712L8494j2057o685
7155d4130N7968N3034K0775q2138p0027L4389K7365L9083O7672M2347L7064p7306
7143A06096m0019j4239M7742J4724l2925p0818j49123n5564M1040O3661J283O1193
7131b6949J3010N7398M6760J15780l3609n3901j0985o1254n3018k2147l8825M8184
7119a9556J1427o1039M7690P1637L1917k642k6591k0150j5534O1040L8011n4909
7107F1301l3379l4263N4188l697K1800K1393M4765l9358l4100K4027M8243M6333
7095A77253m2390l8365p7677m7300M2002R3261P798J7257o5768m4607n5301K0413
$$ y = [122957, 95052, 63768, 9864, 43381, -6832, -111566, -135532, -75857, 1609, -3520, -26085, -66758, -59996, -138, 32600, 19028, 46632, 33156, -51923, -46170, -63882, -25388, -37445, -44130, 13838, 66872, 87647, 5509, -64518, -30129, -2764, 36319, 103991, 146338, 183402, 106096, 66077, 51838, 99580, 114304, 81379, 10561, -138562, -194126, -153086, -89425, -88142, -26949, -13939, 43459, 90219, 205999, 172390, 118489, 107504, 46250, -6768, -28915, -67740, -19556, -8129, -69168, -21478, 50159, 82076, 79434, 52843, 32693, 17159, 78199, 116210, 61301, 27922, -6341, 47847, 44150, 65950, 87343, 132108, 92750, 58650, 82677, 130920, 177253, 134863, 96498, 18821, -28479, 13523, 106784, 114582, 131839, 66071, 21464, -33837, -13424]
7083a3424N5224m9361n3450M6901K3351P428o324O0081l7608Q50o3076p786P0462
7070C3268m6992k2386m919M2806M4709k0207k1007J2738j1122p1455L9783M8592
7058B3808J2701k3060o1790L1727J7708j614J02377q314k9072n5449o009J5235
7046A8248P2974n8728o1812K7510l9088j643L3450L015o227K4465N8781M9521
7034A20466K7749o0515l6990o243N2875q7997p888N956O3367Q4469M9728j8566
7022A86411j10823p860j3280n938N7733r6279p0225R2777K8870J7770l7051o4131
7010b2026j0677K687K7721M5347J5302J5457K9482m6808m3199M6547k7168K6257
6998E8922J1600m7850n993N5658J6230o728o404L2726L2437k6997r8537l9160
$$ y = [-13424, 41800, -7561, -61011, -14110, 9241, 16669, 10345, 70426, 32818, 33668, -29408, -37194, 33268, -13724, -36110, -41029, 1777, 46486, 26279, 5272, 18010, 6888, -64567, -24784, 23808, 36509, 13449, -48341, -16614, 1094, -520, 101857, 93543, 64471, 9022, 3013, 18248, 91222, 32494, -29318, -1808, -40896, -42539, -9089, -6074, -12301, 12164, 70945, 120466, 148215, 87700, 50710, 44467, 97342, 9345, 1457, 7413, 70780, 155249, 204977, 186411, 75588, 67728, 54448, 48510, 106243, 9964, -60261, 32516, 61386, 79156, 42105, -22026, -32703, -30016, -2295, 43052, 58354, 73811, 103293, 56485, 13286, 59833, 32665, 58922, 70522, 22672, 16679, 72337, 88567, 81839, 75435, 108161, 140598, 113601, 15064, -24096]
6986b4096m2072q2470k8478L825J527K5791K2725m746O317K8039J0819Q3803L305
6973D289n540K661R549k7260o2819l1672J7733L3408m9123N4600N4022j3608p8297
6960i2057N2480J24743j6213K1916p2840l5327m2781K4529N4512k2692o5627L0843
6948c8514J35664M7381k7007j6075j8885j2744j7043j4966j0136L6349L2162p567
6936H8619m5970j7452L0553n7984q290m4158K3855o7966p373J48704P2125n31
6924A14132m9770n1745k8083o1329K0210n610M5990J24098k1959L0004O7987o2838
6912A21087l9268l0162q1054l554k3706l990j778N3957j809k593O652J781j7948
6899b2385J6596l6018r570Q1814L9323o5405l1440n99j8297j6746K7605J5967
$$ y = [-24096, -66168, -148638, -177116, -173291, -171764, -145973, -123248, -127994, -121677, -93638, -82819, 984, 4289, -1251, 1410, 10959, -16301, -79120, -110792, -93059, -59651, -108774, -54174, -152, -13760, -92057, -39577, 85166, 68953, 90869, 18029, -17298, -60079, -35550, 18962, -3730, -69357, -38514, 97150, 144531, 117524, 101449, 82564, 69820, 52777, 37811, 27675, 64024, 96186, 88619, 42649, 25197, 55750, -2234, -10524, -54682, -30827, -98793, -106166, 42538, 114663, 114132, 64362, 12617, -15466, -76795, -56585, -62195, -16205, 107893, 85934, 115938, 183925, 121087, 81819, 51657, -29397, -32951, -56657, -60647, -62425, -8468, -10277, -12870, -6218, -4437, -22385, -5789, -41807, -51377, 30437, 69760, 4355, -27085, -27684, -45981, -62727, -35122, -19155]
6887a9155j5355Q806L6063l2918m272J9911n7576J0647j6226Q0959o438n9552
6875e5106k3275P7089P0134q2594K2977j30907q4489M5886J54047P8604J8635
6864I1001j5221j04038m1232J3113J8950O3332O7225j189q6951m5068k1267M6271
6852a5074R3149M5435p2360p7636n7436m2915N0919J2133L7590N039l4639n3351
6840a09146n4851K5143P4380R1626K2744m896n8982j9860O6692L3728J1435k0947
6828E7066j05205L3657L3728l1353j607n1365j716P8450O3588O2132J6491n0601
6816A03265o2984j4866k9295m1507P1968N7668k1672n2129p2067k859l5817o0053
6804a60348J05113K1236K4271j7749j2137O03n2796o41O6226M7649L1234q1264
$$ y = [-19155, -34510, -25704, 10359, -22559, -26831, -6920, -64496, -53849, -70075, 10884, 4446, -55106, -78381, -1292, 68842, -13752, 9225, -121682, -206171, -160285, -6238, 72366, 91001, 75780, -28258, -69490, -56377, -37427, 25905, 93130, 91941, 4990, -40078, -61345, -15074, 78075, 123510, 51150, -26486, -83922, -126837, -75918, -63785, -26195, -21156, -55795, -109146, -163997, -138854, -64474, 27152, 49896, 45000, -13982, -33842, 32850, 66578, 78013, 57066, -48139, -14482, 19246, -12107, -13714, -65079, -66795, 11655, 75243, 137375, 153866, 103265, 40281, 25415, -3880, -45387, 26581, 84249, 62577, 10448, -61619, -64478, -100295, -160348, -55235, -33999, -9728, -27477, -39614, -39011, -91807, -92448, -26222, 21427, 52661, -28603]
6792b8603J5986n4376m1115l5742j9100J7253J1957n6616K596J01297J03444L0350
6780D7331k0478j1243K2202m7837l7585m083M5094r051L496K9506p134m959o109
6767h50M2432q254j28787K5321J01458k1606M569o4645p0668M5510O2131j0666
6755b4055K1013N7596M723J6680r3892o0763m6833L0887K3409P9023m4702j563
6743c8477m5741P8194R743j5714L2461o06N698j3714k0783l9894L8059K380J9091
6730A0697n2936j6077O5463J6818M5372k4427r4742n882j2134p5837j3511M8666
6718a08530J16278N8135K4726j1083o3797M7662k3992q4456k0934m3924Q9946
6707a9969O7835K7448M8574m681l4983o4620J7782o915j9552j8982L9363P7064
$$ y = [-28603, -12617, -66993, -108108, -143850, -162950, -145697, -133740, -190356, -187760, -86463, 16981, 47331, 26853, 15610, 37812, -10025, -47610, -51693, -6599, -15650, -12154, 17352, 10218, 5259, -850, 41582, 33328, -95459, -70138, 31320, 9714, 14283, -50362, -121030, -75520, -13389, -24055, -3042, 54554, 59277, 75957, -17935, -78698, -125531, -94644, -71235, 7788, -36914, -38477, -84218, -6024, 3719, -11995, 20466, 19860, 25558, 11844, -8939, -48833, -10774, -8394, 10697, -42239, -58316, 7147, 23965, 69337, 44910, -49832, -55714, -67848, -143685, -157196, -108530, 7748, 65883, 90609, 79526, 15729, 63391, 39399, -45057, -65991, -109915, -19969, 47866, 75314, 123888, 119207, 84224, 19604, 37386, 30471, 10919, -8063, 31300, 108364]
6695A08364m0298o2613R4715N8805p015q9477q6907Q50P6434j5167o6894L1682
6683B479J16450p600p9444k5952K9746m4510K182l2885N3703L3580O400j1927
6671D2222l616K0725K5388R038J5010j995L7442J4834j4905J8811l7731m6935
6659G8288L6272Q124m5881m1578o233l5206j4707R240L7522r610k5472M673L2264
6646B7696J6960o9209n0592J4901j6766K2346Q3189Q2400k440n6589o175K6149
6634G1870N5258o3320l8447k4112M454l8788k3109P503M0500J5371N707M2513
6622E5400m0929r8143K3833Q6041J3268L896N4742N775n8561n1239m5148L3860
6610a7205K1884l6004j140k0260M2645K2618l5232n7576M8173J6312L4897N542
$$ y = [108364, 68066, 5453, 100168, 158973, 151958, 62481, -24426, -23576, 52858, 37691, -29203, 2479, 118929, 111329, 31885, 5933, 35679, -8831, -6649, -39534, 14169, 47749, 54149, 42222, 38606, 59331, 84719, 93757, 108767, 106772, 144214, 159048, 144143, 162954, 125223, 78288, 114560, 122684, 76803, 35225, 28992, -6214, -20921, -11681, 25841, 16231, -9241, -4568, 27696, 44656, -24553, -75145, -60244, -77010, -54664, 28525, 110925, 108485, 51896, 45721, 71870, 127128, 63808, 25361, 1249, 5703, -33085, -56194, -48691, -8191, 7180, 12887, 55400, 14471, -83672, -59839, 26202, 39470, 43366, 98108, 103883, 45322, -5917, -51065, -17205, 4679, -31325, -32465, -52725, -10080, 12538, -22694, -80270, -32097, -15785, 19112, 24654]
6598B4654L5264P0186r6252n7733K0912J8796N4131M9356o272o0915n6134r19
6586d926k7362K4509P609l761R811M6837K4476n785o9794N5077Q9911J2964k7173
6573A32393l4756k7482n2064L4258J1008O5680j5917m3951l9838m6612J282L956
6561a2043K654J8496L4351J7060l4612r069k0665n3119n149P9076Q5577k8157
6549G4400n002J0629L5786N1773m1734o3443n4556J07681L1318r7639L7863O877
6537I3953Q257n1241K8732j8151j2599O0905M089m4655p8570o49R2349n5175o9204
6524d1959m7953N5868J24050o2468n0720k8125O26j3285N115L7925k885N2747
6512B8936j8914K5472J40934j9247j75675j06230J0878K3759Q6448P7452r821
$$ y = [24654, 59918, 130104, 33852, -23881, -2969, 15827, 69958, 119314, 113042, 52127, -4007, -4926, -32288, -7779, -170, -3931, 5880, 52717, 77193, 71408, 1614, 56691, 146602, 159566, 132393, 97637, 70155, 18091, 52349, 63357, 129037, 113120, 69169, 29331, -17281, -15999, -12043, -9389, 9107, 43458, 60518, 25906, 16837, -3828, -56947, -62096, 16980, 102557, 74400, 69398, 80027, 115813, 167586, 125852, 62409, 7853, 115534, 146852, 49213, 87076, 93953, 102210, 50969, 79701, 61550, 48951, 109856, 113945, 69290, -9280, -9929, 82420, 27245, -41959, -89912, -34044, 90006, 27538, -23182, -51307, -50681, -63966, -58851, -20926, -23811, 28936, 10022, 35494, 176428, 157181, -18494, -124724, -113846, -90087, -3639, 73813, 63992]
6501F3992p2436m7400Q7836k2336n6353P22m6285o0794k0511J29397M6599J6628
6489A9059J1271K5973J2902o6444r8732Q621L7349K4322j3623R800K480l9514
6477f6536L099O7391J03360p13j20301n3754j2685m5153M3011J06936L2130J7474
6465G4259L676K721j7915l4350p8581p9380n502P4411P3546N4687k4132m7892
6453d452o6258j9365r715P3695J1839k1710j6895N5692K970L4135P6021K68j18154
6440a929J1215p5005M0618L4024M6199L2765m5116l4950q302n2836O322r525L350
6427e3170n3829K8854J22289J7625m7998L1140p8772k7143N9931Q4762O975q5629
6415E035k3256P8090P071k9452j4348k3922l852M0902o042m4780L6900l4490j42247
$$ y = [63992, -8444, -55844, 31992, 9656, -46697, -45975, -92260, -153054, -173565, -44168, 2431, 19059, 30330, 56303, 69205, 2761, -95971, -87350, -50001, -25679, -39302, -29502, -27022, -66536, -63437, 3954, 107314, 106601, -13700, -67454, -80139, -125292, -82281, 24655, 56785, 74259, 77935, 80656, 62741, 28391, -50190, -129570, -135072, -60661, 12885, 67572, 43440, -4452, -70710, -90075, -99790, -26095, -14256, -35966, -52861, 2831, 5801, 39936, 115957, 116225, -1929, 9286, -65719, -25101, 8923, 55122, 87887, 42771, 7821, -481, -53317, -46995, -56520, -53170, -106999, -78145, 44144, 61769, 13771, 44911, -33861, -61004, -1073, 83689, 90664, 5035, -18221, 59869, 66940, 37488, 23140, -782, -4634, 36268, 30226, -14554, 22346, -12144, -154391]
6402a54391N0396J00407L8595K6781K3055L0906J3678m8099l9495L2016m4342
6391B9507j3312n6545j05327o573K6789Q0748J06273m0763o8788p7624N6057R7684
6379B8126o8548K5955K0750K3337j7266k6921r937M2503K0586K1985r3995l7923
6367g1348L0983o2779r38R241j5817J8919M0879N2361L8269o665J9037M6886L6191
6354A35219n7647k4032k4745l1108M5156K2859r3782j9920K2650Q1288O9082K0807
6342A45827o5258o7984J3138o096m9892j4064L0442Q0982j2008k0402l1221P4846
6330G8310J1922q5643m2175K3936M0260m6553N8092J01909k0617j00827q5785
6319f7171l6310J0885M8484O5232L9597O1478n089k1866k567O3409L3377O5001
$$ y = [-154391, -103995, -3588, 35007, 61788, 84843, 115749, 129427, 81328, 41833, 73849, 29507, 16195, -40350, -145677, -152250, -125461, -44713, 61560, 20797, -47991, -125615, -69558, 28126, -40422, -14467, 6283, 29620, 12354, -14567, -24504, 17999, 38585, 60570, -33425, -71348, -40365, -103144, -104082, -94841, -110658, -91739, -50860, 1501, 39770, 33105, 52142, 99028, 135219, 77572, 53540, 28795, -2313, 42843, 65702, -28080, -48000, -25350, 55938, 125020, 145827, 80569, 12585, 25723, 19627, -30265, -44329, -13887, 67095, 55087, 34685, 3464, 78310, 90232, 4589, -37586, -13650, 26610, -19943, 38149, 140058, 119441, 18614, -67171, -103481, -92596, -44112, 21120, 60717, 122195, 117106, 95240, 92673, 156082, 189459, 254460]
6307B54460n6262n2659j09793J5795J2429p8103j1116n830j3198J4311O0481p053
6295B3462k288k9924l9448j8858J44573N3039P280r6647j6985j1672P5007l1775
6283E5764R3686J275j5970M0217p0128n1130o05J597m6620j8672P1749L6783N732
6270A03678k4977n5877m9367N9000K200q7864l7272P2061M8136r301M083J6488
6258D0988P596q4067l4963K0346L73p324l3618L8599N9038N3576J586n7664L780
6245H246K0146j3702k0836O290l7091M1729J32539K5948r7253l9632J1755q592
6233B9547n1503J2214R3967j6643o0798J6055m6644k4015k4283N0008J0061J11018
6221I8984M360n1834l1523m344m8268m9184K7590j0312J8432j2653M7385p131
$$ y = [254460, 198198, 145539, 35746, 51541, 63970, -14133, -25249, -31079, -44277, -29966, 30515, 23462, 21174, -8750, -48198, -67056, 77517, 130556, 137836, 41189, 24204, 12532, 87539, 55764, 149450, 150725, 134755, 174972, 104844, 53714, 53109, 54706, 8086, -10586, 61163, 97946, 103678, 78701, 22824, -26543, 32457, 34657, -53207, -90479, -18418, 29718, 20417, 24500, 40988, 48584, -35483, -70446, -50100, -49727, -57051, -90669, -52070, 6968, 60544, 62130, 4466, 8246, 28392, 14690, -6146, 144, -36947, 4782, 137321, 163269, 66016, 26384, 38139, 29547, -21956, -9742, 84225, 67582, 6784, 22839, -23805, -47820, -72103, -22095, -12034, 98984, 103344, 51510, 19987, 15643, -32625, -81809, -54219, -64531, -46099, -58752, -11367, -18498]
6209a8498L42l5608p8204n1376N9833J11797p433N6071j1242o3766L2478m584
6197a0190k4157Q1337L224q7867K877q735M8347n127o15N8768L3218q1643n1047
6184d1610n356m7700m99N7237K0558J11733J13122l4005j04328k4062m6464Q6603
6172H5229N1030l9922n7041k0874K5717j2986j5846L7880N8203o951J2968k3207
6160I4200q9385j7802N5951K187R459j4166o869M5514p7000L583Q1496o1383k3213
6147B572m1451m025L3883m5194J2346r005Q6552j0333l6901m8503L4639Q1653
6135E6233L808K7624n9200K795M5137j19990J2875J76681Q3985l6891r6447o4565
6123C2045J4065K4886R863L9984K7884k210Q61m0738j19345K2024m3889r3752
$$ y = [-18498, -18156, -53764, -131968, -183344, -123511, -11714, -19147, 36924, 25682, -38084, -5606, -10190, -34347, 46990, 50214, -37653, -34776, -43511, 4836, -291, -906, 57862, 91080, 9437, -41610, -46966, -94666, -95165, -37928, -17370, 94363, 207485, 173480, 69152, 45090, -1374, 85229, 136259, 96337, 39296, 18422, 44139, 31153, 15307, 53187, 111390, 104439, 117407, 94200, 4815, -12987, 42964, 45151, 54610, 40444, 33575, 79089, 2089, 5672, 87168, 25785, 2572, -38879, -42904, -9021, -54215, -41869, -50874, 35678, 25345, -11556, -60059, -25420, 56233, 60041, 87665, 28465, 31260, 76397, -43593, -30718, 145963, 229948, 193057, 96610, 32045, 46110, 70996, 80859, 120843, 148727, 146517, 147378, 106640, -12705, 9319, -34570, -128322]
6111a28322j9243O6821J7662J00809j2920p6020o5674j0307O0482L4K3184N4256
6099A0762N5102j8658J5267R067j8720m2584o9942J6363K9054Q6484K6523m5790
6087E2928j8539r334Q7011O8773m9637p1686l5884J3463M1117p0r1091k1630O0047
6074B5468l3118j03077J782K0802N8658Q5027N4489m1506m2557R326l2507m558
6062a771M7343J5866J0051j5730j3268L074j1378j8476o0015q45M1326N3521n9844
6049a0146K8303Q6958p340j39295p1685m4223L159O6968O8516R1443l6664j24448
6037h8454n1951m3033K671M89N1290Q6476J0608j3263k0487k7754O3162M9858
6025A9612J1475l7404o5551O9654P6739k3535l5869n340K5404k0391p4904r924
$$ y = [-128322, -147565, -80744, -63082, 37727, 24807, -51213, -116887, -127194, -66712, -66678, -43494, 10762, 65864, 47206, 62473, 71540, 52820, 10236, -59706, -43343, -14289, 72195, 98718, 52928, 34389, 25055, 112066, 180839, 131202, 59516, 23632, 37095, 78212, 78142, -12949, -34579, 25468, -7650, -110727, -108945, -88143, -29485, 55542, 110031, 68525, 25968, 35294, 2787, -1771, 45572, 61438, 71489, 55759, 42491, 45565, 34187, 15711, -44304, -45149, -3823, 49698, -10146, 18157, 105115, 97775, -41520, -113205, -157428, -154269, -87301, -18785, 72658, 35994, -88454, -140405, -183438, -180767, -180278, -128988, -42512, -31904, -45167, -65654, -93408, -30246, 19612, 31087, -6317, -71868, -2214, 74525, 50990, 15121, 9781, 35185, 14794, -60110, -70034]
6013g0034J9261p996r0208j05936J06704J08569M3560R1656P772j4358m736L9763
6001A24017l2613r1365n7084j4396j380J9670P124O903O6296J9558k0483K1209
5989D7456m580o1045j2954M6059R7923o2944o0474l5933p4130k6788j7455J08252
5977e6613J2962n0675l0155j3797L1452N8917P9625K9240q0098L5886j1902J3836
5965A8678N1425P0888m1409o7239m1606L2161J3426Q035q6095q7332n748K0838
5953a13978Q1423R76L4612K9715J0163o1778M8986m4415n4462O8579J2957l0725
5941a7947Q0078n0056m6611J0872N5845N278r9186j4322l522L3616J8973K4540
5929b442R813m5043n1533k7241n0090k7264J00376J07755M1189o2759j4417o0449
$$ y = [-70034, -50773, -58769, -148977, -254913, -148209, -39640, 3920, 95576, 103348, 88990, 84254, 124017, 91404, 39, -57045, -71441, -72821, -53151, -46027, -39124, 27172, 46730, 26247, 47456, 42876, -18169, -31123, 14936, 112859, 49915, -10559, -46492, -120622, -147410, -164865, -56613, -43651, -94326, -124481, -138278, -106826, -47909, 31716, 60956, -19142, 16744, 4842, 18678, 70103, 140991, 99582, 32343, -9263, 22898, 36324, 44359, -41736, -129068, -134816, -113978, -32555, -31579, 3033, 32748, 42911, -18867, 30119, -14296, -68758, -179, 12778, -17947, 62131, 12075, -34536, -23664, 32181, 37459, -61727, -76049, -79571, -45955, -26982, -2442, 7371, -37672, -89205, -116446, -166536, -193800, -93424, 14331, 55520, -7239, -21656, -82105]
5917h2105K7897J02896M0442m16J3837m3925p3071m946Q1407l1445j03176O3337
5905i268L3415N7297N0350o0924j15738m6259R7095J69010N6957k8535m4014P806
5893A67192j12859o9997N8732L0957r312M200m665J8968R0750m6069l8096k9680
5881F0121j1055k221q1145o3153J03821Q2766K1860o2721p8184J5893k6152m0893
5869h1063M307Q1782l3682M3851L2828r6321l9210M529R1064J2131j6059P605
5857A1762n487m7285o537K7390j1126k2837n87O2306L6742j5819M4288n4170n9932
5844d1292l9654M4148Q0532j920j18802m6326j003K1445J9808K1830M2639j4004
5832c2599k3733J2143K3541M2657l6410n0152m093J00756J8741j7277M1277r450
$$ y = [-82105, -54208, 48688, 89130, 88714, 102551, 58626, -14445, -19391, 62016, 30571, -72605, -9268, 24147, 81444, 131794, 70870, -44868, -91127, 5968, 174978, 231935, 203400, 159386, 167192, 54333, -15664, 43068, 74025, 64713, 68913, 64248, 83216, 173966, 127897, 89801, 60121, 49066, 46845, -34300, -97453, 6368, 89134, 110994, 48273, -29911, -14018, -40170, -81063, -76756, 5026, -28656, 15195, 48023, -48298, -87508, -82979, 8085, 20216, 4157, 11762, 6275, -41010, -47547, -20157, -31283, -54120, -54707, 7599, 44341, 28522, 72810, 18640, -41292, -80946, -36798, 43734, 41814, -76988, -123314, -124317, -102872, -83064, -61234, -18595, -32599, -56332, -44189, -20648, 22009, -14401, -64553, -68646, 32110, 50851, 33574, 74851, 65401]
5820F5401n6088L8538n7525p8528L1308K4400N0977m9359o9616J8952K9809K7294
5808b4437l4595J0929P0931P4803o4104m8797K4203j6428m9594J0521k5559l4391
5796a06518O1040M8729J3883K6895l8511J048N9151K5965Q504n1618R1761M1083
5784A81412r138n8606m8855m0905M836q262k1752K2633p4206k0986J5779K5332
5772c2718K4355l6312R497m8527j0672L2323N5207N5386K383M9902J2515j1344
5760A01995l2483k8935M1617j2215J026k2700r5860K3395N5946k3099p4480r4183
5748a59976k0887j1849O466M5098M199L1833P6313j4954k5950P2834k6822q0204
5736a03899k8114q964L260M8872j8524m1190L9615r692J9729J0319k7730n1211
$$ y = [65401, 9313, 47851, -9674, -88202, -56894, -32494, 18483, -30876, -100492, -81540, -51731, -24437, -59032, -48103, 22828, 97631, 33527, -15270, 8933, -7495, -57089, -46568, -72127, -106518, -45478, 3251, 17134, 44029, 5518, 6566, 65717, 91682, 100186, 48568, 140329, 181412, 172274, 113668, 64813, 23908, 28744, 20482, -1270, 21363, -52843, -73829, -58050, -32718, -8363, -44675, -35178, -83705, -94377, -62054, -6847, 48539, 50922, 100824, 113339, 101995, 69512, 40577, 82194, 69979, 71005, 48305, -47555, -24160, 31786, 8687, -65793, -159976, -180863, -192712, -186246, -141148, -136949, -105116, -28803, -43757, -69707, 3127, -23695, -103899, -132013, -140977, -137717, -88845, -107369, -148559, -108944, -118636, -98907, -88588, -116318, -167529]
5724a67529Q2130K5323N2752N2616K6977j5277n0954o661j8040m9932L7115K3755
5712g725J1632n8673o6537N6667Q1756J56030N491j09480m2873N0934j7776q8444
5700b8998m1894L4088K2852R4443p1699q1854R19J2965J6073P0470L0146L743
5688F1254l6514q7592j11204k0962J74299N4147p0002j3910n7266j518O6678K036
5676d0554m9730L9296P4941k8398l833M0812k6919L4121O2628j0510j06564n4260
5664f8970J3550M5029j5067R5353K4852m7584M279p3581r7212p968L3992j3015
5652a06342p0759M0111m2994k521J38962L8061q6847k5178L7178P4320O0237l6739
5640A7489j1937O6771J5751Q153J363j8191l5878N4608o291m0056J7469m880k3928
$$ y = [-167529, -85399, -60076, -7324, 45292, 72269, 56992, 6038, -623, -18663, -68595, -31480, -7725, 3907, -54766, -121303, -64636, 17120, 173150, 178641, 69161, 26288, 77222, 59446, -28998, -70892, -36804, -13952, 80491, 8792, -73062, -72143, -59178, -43105, 27365, 57511, 61254, 24740, -62852, -174056, -195018, -20719, 33428, -36574, -50484, -107750, -109268, -42590, -40554, -90284, -50988, 23953, -4445, -8278, 32534, 5615, 39736, 102364, 91854, -14710, -68970, -55420, -10391, -25458, 69895, 94747, 47163, 51442, -22139, -119351, -127319, -93327, -106342, -177101, -136990, -179984, -182505, -43543, -5482, -92329, -117507, -80329, -6009, 54228, 17489, 5552, 72323, 88074, 96227, 97590, 79399, 43521, 98129, 91838, 51782, 69251, 64371, 40443]
5627D0443p7682j3679K2617Q0728Q7008L9290l5358o6572j6908k6987J1940l2148
5615A2692n2973L707L5730K004n6629n447j0626j1766m1607P0655M2842J6808
5603E390m5653p9665O8950Q605p6131N3691M3542l5977P9423P7920j2097o1710
5591B6288r9965n7232P2205N0502K2505p0068m5538q658O924l147L984o0591J4205
5578a48586O8667J65587L0391k6622n4671q7565k0794Q4742J33664k3054l2420
5567H9339N168k8640p9308N1739L5249K4513k7472m5004m8169q9067K6271k1556
5555a06937J8876J6277P1508K6168L624N8595N7023k7693q2754p6300k3888j1701
5543g7202N4094O0903K9125N6418N281q3625o8479R5067K5503M3512m107k1471
$$ y = [40443, -37239, -50918, -28301, 52427, 139435, 178725, 143367, 76795, 59887, 32900, 44840, 12692, -40281, -36574, -844, 1160, -55469, -60916, -71542, -83308, -124915, -54260, -11418, 5390, -40263, -119928, -50978, -42373, -118504, -64813, -21271, -57248, 22175, 100095, 87998, 26288, -73677, -130909, -58704, -8202, 14303, -55765, -101303, -109961, -103037, -106184, -102200, -162791, -148586, -79919, 85668, 116059, 89437, 34766, -52799, -73593, 11149, 144813, 121759, 89339, 94507, 65867, -13441, 38298, 73547, 98060, 70588, 25584, -22585, -111652, -85381, -106937, -88061, -71784, -276, 25892, 29516, 88111, 145134, 117441, 34687, -41613, -65501, -77202, -23108, 37795, 66920, 123338, 128619, 44994, -23485, 71582, 97085, 140597, 136490, 115019]
5531A15019k1046m4593m3709O9710n7815n9586j184Q5415Q0569q8249j19621M0836
5519d4254L2291K9548N5124n5070n8700M6534J5914j500j4935n777J7806l804
5507A3177k7538J8214J16014o2293p9497q722K0535k0019p630p3803n1884j1170
5495a74616K54L1025M4317l1996m485P5344M3178o09L3169L5171j4273p6042o6519
5482a06082K3554N6405J491N0990P8676K2183O774m3632n5524l0406n4939j2569
5470f3079J2851k7359j9782L2454K4358j1207l4357M0251K9088j1120l4189O9877
5458G786j06345p3046L2832R3467L6534K5715N0537l9458n828R3508J9887q5471
5446E0118r639l5686M524L223K5592r086j04337k3874J04906O6326m5832r8873
$$ y = [115019, 93973, 49380, 5671, 75381, 17566, -42020, -43204, 42211, 122780, 34531, -85090, -44254, -11963, 17585, 72709, 17639, -41061, 5473, 21387, 19887, 4952, -825, 16981, 13177, -14361, 3853, 119867, 57574, -21923, -30645, -10110, -30129, -37759, -111562, -163446, -174616, -174362, -143337, -99020, -131016, -135501, -60157, -16979, -17588, 15581, 50752, 36479, -39563, -106082, -82528, -26123, -24632, 26358, 105034, 127217, 133991, 90359, 34835, 4429, -50510, -63079, -50228, -77587, -97369, -64915, -40557, -51764, -86121, -45870, -16782, -27902, -62091, 7786, -98559, -171605, -138773, -45306, -8772, 16943, 67480, 28022, 22194, 115702, 135589, 50118, 40479, 4793, 9317, 12540, 38132, 29046, -75291, -99165, 5741, 72067, 26235, -72638]
5434g2638j0605R4737l1812r1853j9055L2194M8451L1960m8738m1819M5743M9010
5422a4425N0391l1258o0433j08214L5057Q6262N7703L3145R199K446l7082m8478
5410b5687k812K9192l8544m6206r97K7791l8884j0470J06076N5172l2718l9033
5398a7120k1739L8301M9313m5608o2026o6854m1858J8689J8370J8516L3010m5179
5386a24185k6328K7631m692L890N8879J10412n974p3202r1513m5828Q379N3758
5374a08773M1681M5678N537N1155j4606m0382Q6952L2831j8252p2491n0698k8985
5362g0353P1902L1781j1871k0611k3564m1145k3910j4090J5342Q5476r5755q1111
5350a77909J3343Q3496J8306K7702J18593P2989L4947m3496o3037o0905J455Q654
$$ y = [-72638, -83243, 11494, -20318, -112171, -131226, -99032, -50581, -18621, -67359, -109178, -63435, -14425, 35966, 4708, -55725, -163939, -128882, -42620, 15083, 48228, 57427, 59873, 22791, -25687, -28499, 693, -37851, -84057, -85054, -57263, -96147, -106617, -541, 54631, 21913, -17120, -38859, -558, 48755, 3147, -58879, -125733, -167591, -148902, -130532, -112016, -79006, -124185, -150513, -122882, -127574, -123684, -64805, 45607, 39633, -33569, -125082, -170910, -162531, -108773, -67092, -21414, -15877, 35278, 20672, -19710, 67242, 100073, 81821, 9330, -41368, -70353, 1549, 33330, 21459, 848, -22716, -63861, -87771, -101861, -86519, -1043, -96798, -177909, -164566, -81070, -62764, -35062, 83531, 156520, 191467, 147971, 84934, 24029, 25484, 34138]
5338C4138R342J3971j3954L0087m9442m3503j6078j853J3264J5962k5567M9942
5326A6309K8393N5271O6441J0264l2956o9366j30583K6958K8153N5785M2781j3745
5314H3705k3085p7934m6797Q015P605J5083J6718q6934O768J12619M1890l7752
5302A9901m2873l7542K906L9845M8237M3218p1076k3128K728q0522Q907K3279
5290f6120M498O1284P081o0486n3514K7474Q1953p2132n0216N9259N6685O7326
5278F3092N906p0004q007l6207j5584M2197Q33j10028L3890O0076P725O9592K5834
5265F9315K8470q286j0509j08429o4955J52537q308m9859m3622j5484m7962l5892
5253a42984j6041M920P9049O1951O533m4959k9484m1429M609M3210m669l5923
$$ y = [34138, 43480, 57451, 43497, 73584, 24142, -19361, -35439, -37292, -24028, -8066, -33633, 16309, 44702, 99973, 166414, 176678, 143722, 74356, -56227, -29269, -1116, 54669, 97450, 83705, 60620, -17314, -64111, -56096, -48491, -33408, -16690, -103624, -96856, 15763, 57653, 19901, -22972, -60514, -57608, -17763, 30474, 73692, 2616, -20512, -17784, -98306, -89399, -66120, -61622, -338, 6743, -53743, -107257, -79783, 2170, -69962, -120178, -60919, -4234, 63092, 68998, -1006, -9013, -45220, -60804, -18607, -17774, -127802, -93912, -33836, -26111, 43481, 69315, 97785, 89499, 78990, -29439, -94394, 58143, 49835, -24, -43646, -59130, -107092, -142984, -159025, -154105, -75056, -13105, -6572, -51531, -81015, -122444, -117835, -74625, -79294, -115217]
5241a15217N2081l1500K0396M6401k6911N2407k4894p1217O9615l0877m746o370
5229g0832o5957K412N8714q649J362Q095l2320O473K9696q463p3477J17014J48021
5216A12089m863m7614l2982j4241K4916L1550L6279M2641L9697j12518j00279
5205b5325L0589P1718k0093n2181P91N8269l3822p2795P891P019l9873O1416K0599
5192A4203n3053l8847K936N2644n4293o5655Q013M1162J7325l407M1567l6428
5180g3833q8551L2748K8152j3877K7205j878O8172j4073k2344J3764Q2997J8499
5168E6981o7120p522L9756q5184k0365j8195l6635n1475p349o762Q0180Q8111
5156c5579J2822j2298k1761M2838j519K5982M551k2179l5585m7201O8227O0531
$$ y = [-115217, -63136, -94636, -74240, -27839, -54750, -2343, -27237, -98454, -28839, -59716, -64462, -70832, -136789, -134377, -75663, -84312, -82950, -74855, -107175, -100702, -71006, -79469, -152946, -35932, 112089, 107226, 59612, 26630, 12389, 37305, 68855, 105134, 147775, 187472, 74954, -25325, 5264, 76982, 56889, 4708, 5499, 63768, 29946, -42849, -34958, -27939, -67812, -6396, 14203, -38850, -77697, -74761, -22117, -76410, -142065, -134052, -92890, -75565, -78972, -37405, -73833, -162384, -129636, -101484, -115361, -88156, -90034, -21862, -35935, -58279, -44515, 38482, 56981, -10139, -17661, 22095, -63089, -83454, -101649, -138284, -189759, -197108, -203870, -123690, -35579, -22757, -35055, -56816, -13978, -15497, 10485, 15036, -7143, -42728, -89929, -21702, 38829]
5144C8829J2855M7940P5058l9449j7558q5120j5192J18626m5510j04095q501j4488
5132c6605M000L5128J1283m0545q20L8929J712k6627N710L7502q4306m9219o2031
5119a65889K9097j6299k5081M9335J6891J7487O4938N2091K8064J1339k1847k9489
5107A0637j1976k4808j7559K1619O2539l3781n2530K6073K5926j3062M7219K2505
5095F2802l1759q3131K3020N5019M1951K0099L5551J16500k1540j31438n6264
5084C0810n3925o7043M2324N3900K9477K6924K3417m8711j244N5889j27017j6468
5072e1667R7482J0227l9739j0810r2093J568M8099J3595J0315n1033O1354J9467
5060A6765m0330j2247O0931K1364m4374k7671q045L3276l4214n1286K9984k5752
$$ y = [38829, 51684, 99624, 174682, 135233, 117675, 32555, 17363, 135989, 90479, -13616, -22117, -36605, -32605, 2523, 13806, -26739, -27559, 11370, 13082, -13545, -7835, 29667, -54639, -103858, -165889, -136792, -153091, -178172, -128837, -111946, -94459, -29521, 22570, 50634, 61973, 40126, 10637, -1339, -26147, -43706, -22087, 40452, 6671, -45859, -19786, 6140, -6922, 40297, 62802, 31043, -52088, -29068, 25951, 67902, 88001, 123552, 240052, 218512, 87074, 30810, -23115, -90158, -47834, 6066, 35543, 62467, 85884, 37173, 35929, 91818, -35199, -51667, 45815, 56042, 16303, 5493, -86600, -85032, -36933, -23338, -13023, -64056, -2702, 16765, -23565, -35812, 25119, 46483, 2109, -25562, -33607, -331, -34545, -85831, -55847, -81599]
5048h1599N1556M4404O581K5069J2915K8374j30883l4697K1870L1279M0803j7567
5036a895k7654K6742K843M9799K2271l9282N536J5737o0861J931N1042M0395m7275
5023C9329r6296j03230K9751R5253N2542m4430l6792N3072K5058j10119p0574
5012a66436N227o617M0149K4177M5730k7769J5787m7774R351L6608j1663L2291
5000e0939N0993Q58m1096M8989m8271J4347m5639M7197M8622j9143p883N1005
4988D9040O2418l2616k3870l0164m0427n887Q2572j4623m2881l1645j2747K5380
4976a5450m3152j7189m354m2492J7060M1106P3260J6713O095Q8089o1258j16431
4964e8003j3817K8847M7494K0893K9367l8518j602R2723M9565j0616K6560o1547
$$ y = [-81599, -30043, 14361, 20942, 46011, 58926, 87300, -43583, -78280, -56410, -25131, 15672, -1895, -29549, -2807, 36, 49835, 72106, 32824, 38360, 54097, -6764, -4833, 46209, 86604, 39329, -56967, -160197, -130446, -35193, 17349, -27081, -63873, -10801, 14257, -95862, -166436, -161209, -167826, -127677, -103500, -57770, -85539, -69752, -117526, -108175, -71567, -83230, -50939, 54, 912, -40184, 8805, -39466, -25119, -70758, -23561, 25061, 5918, -1965, 49040, 111458, 78842, 54972, 24808, -15619, -21506, 61066, 46443, 3562, -28083, -40830, -15450, -58602, -75791, -80145, -122637, -105577, -64471, 8789, 25502, 31597, 119686, 58428, -58003, -71820, -42973, 4521, 25414, 54781, 16263, 14661, 107384, 156949, 146333, 172893, 111346]
4952A11346o3951j36212N959L8317Q648l5948L0088J2162K3316J05674M1116j17089
4940B3426j2513J6527l0533p170o3462J1482J255J1789O7534L3280o9572P588
4928a0369N349k1041J9800L0824m9759K0636K5401O7864L8290n7971p5867L1202
4916B4359m568n144j3146l5101J8262K4840O0750k4877k9074J3982n5868q8963
4904a14548o7957L0536O74K2290K3838L9347J9652k58L5747L2583J0192k7408
4892D688k2344k3718j3700n0713p3234N2034l6982m7620O2423R1979N3734K1920
4880A8467M491o3915j7523K5392n3327j8084N1507J2710k4738J3475M045J2438
4868c5062M4226P928O7537j9844j35771n3661q5085K7186R2037O4451P6513k0590
$$ y = [111346, 47395, -88817, -82858, -44541, -35893, -71841, -41753, -29591, -6275, 99399, 140515, 23426, 10913, 27440, -3093, -10263, -73725, -62243, -60988, -49199, 18335, 51615, -17957, -10369, -5020, -26061, -6261, 24563, -25196, -4560, 20841, 88705, 126995, 69024, -6843, 24359, 19791, 14647, 1501, -33600, -15338, 9502, 70252, 45375, 16301, 30283, -25585, -114548, -182505, -151969, -151295, -129005, -105167, -65820, -46168, -46426, -10679, 21904, 32096, 4688, -17656, -41374, -55074, -105787, -179021, -126987, -163969, -211589, -149166, -57187, -3453, 18467, 22958, -40957, -58480, -33088, -86415, -104499, -52992, -40282, -65020, -51545, -47500, -35062, 9164, 17092, 84629, 64785, -70986, -124647, -209732, -182546, -90509, -26058, 50455, 29865]
4856B9865j02603m1343J44999N2989k7804m0399Q8409M4611q8756n64l909r5783
4844d0288r1926K9470L5279N4260l0797J666K5305M672o1993J12688Q701o5235
4832a8198l2211O132L7259O1677j21119j05493m7839Q4967O3764J3521j1184l8489
4820a07213M7801L6282Q2642p8071L5586p1138j04923L218N3135M6665K8486K2232
4808e298r571j2158p71O7964k150K8236l2872p1390q7909J7007O4252K3863j3383
4795c4180O6129J913J3709J0571Q668k5373m5830O7781J24628j3116l9127o7257
4783F8516o3876l0580k8050j3424P3001M4532o2619l1323p0360m3373M5338K9113
4771h3105k3887j9192K1676j6923M0943J0976L1801J10443n9930r7588M0525j2254
$$ y = [29865, -72738, -114081, 30918, 83907, 56103, 15704, 104113, 148724, 59968, 59404, 55495, -40288, -132214, -102744, -67465, -13205, -44002, -42336, -17031, -12359, -74352, 38336, 47037, -18198, -50409, -44277, -7018, 54659, -66460, -171953, -219792, -134825, -71061, -57540, -68724, -107213, -59412, -23130, 59512, -18559, 17027, -54111, -159034, -155816, -102681, -56016, -27530, -5298, -14869, -27027, -27798, 40166, 38016, 66252, 33380, -38010, -125919, -108912, -44660, -20797, -34180, 31949, 33862, 47571, 58142, 66810, 41437, -4393, 63388, 188016, 174900, 135773, 68516, 4640, -25940, -53990, -67414, 5587, 50119, -12500, -43823, -114183, -157556, -112218, -83105, -106992, -126184, -104508, -121431, -80488, -69512, -37711, 72732, 12802, -84786, -44261, -56515]
4759e6515j2345J20701K8818n7408o6289P3974R6480J1132n743k5729j08565l114
4747d603o62L1240M7433M3610k1856l6472l8334p106N6294p064p977K9587m7982
4734C6108K6296J9175n0900l5486n236O1465Q5348r8280r3389l97k8767l6713
4722a20776J4020P0315J3520m3372j5196L0555J5741r99o7507o2433P1709J9427
4710g4996o8064O1585L0482n0721J6253O7038P5371p1930o0267n2111Q099O9191
4698e0070R445J3204N1410R8951k6090M6862o4860j33501n501J8522N3676M0152
4686E2200k9980o7037m3616m3280n5942n643L3590L4312J03139O2779J3938m2643
4674A1817M1621j7606l6318l4858M2322K2922J3836L8231q722k4140R079P2639
$$ y = [-56515, -68860, 51841, 80659, 23251, -43038, 30936, 127416, 138548, 132805, 107076, -1489, -4603, -5265, 25975, 73408, 117018, 95162, 58690, 20356, 13250, 69544, 62480, 54503, 84090, 36108, 62404, 81579, 30679, -4807, -10043, 51422, 136770, 38490, -54899, -55296, -84063, -120776, -106756, -36441, -22921, -66293, -81489, -50934, -35193, -36192, -103699, -166132, -94423, -74996, -143060, -81475, -50993, -101714, -85461, -18423, 56948, -14982, -75249, -127360, -119261, -50070, -40625, -27421, 23989, 122940, 96850, 143712, 78852, -54649, -60150, -41628, 12048, 52200, 22220, -44817, -88433, -131713, -187655, -193298, -159708, -125396, -22257, 40522, 54460, 11817, 53438, 35832, -486, -35344, 6978, 29900, 43736, 81967, 73245, 49105, 58184, 130823]
4662A30823k9951p6189l0894q3217J00806R7850l3721k6309N3636j3904m311n3563
4650C1056j00217Q897M5419K6802j04766J9565N5876M2447j12704j7180L814J02917
4638A926O0098j6126l2693k7555K3328M8398p1435j8852K6409n8790M9435N3435
4626C7578p2620o8926P1768L6926j6515m0759n9553q482M7006R2055J7258n2510
4614a6774J6542j6226M9880L4498k6167l238j4891q3064L7809l4704j5270J0757
4602f0848l0008L115n4126J00522J29073L5622j40689j10869J6733n922N2847
4591f4550N0568K6966L8122N9218m0742k0700L4257k0916m3086P02m0269R272
4579a1158M1066k147M7152K8097L9845m1420p0588N9338K2010m5763j1502q5142
$$ y = [130823, 100872, 24683, -6211, -89428, 11378, 109228, 75507, 49198, 102834, 88930, 84619, 31056, -69161, -60264, -14845, 11957, -92809, -73244, -17368, 25079, -87625, -104805, -100991, 1926, 62024, 45898, 13205, -14350, 8978, 57376, -14059, -32911, -6502, -65292, -15857, 37578, -35042, -103968, -32200, 4726, -11789, -52548, -112101, -120583, -73577, 18478, 35736, -16774, -232, -16458, 33422, 67920, 41753, 38515, 23624, -59440, -21631, -56335, -71605, -60848, -90856, -87741, -141867, -41345, 87728, 123350, -17339, -128208, -111475, -117397, -64550, -13982, 12984, 51106, 110324, 69582, 48882, 83139, 62223, 19137, 19839, -20430, -11158, 29908, 27761, 74913, 103010, 142855, 101435, 30847, 90185, 112195, 66432, 54930, -30212]
4567c0212o5935m9245J552M4232k2417J21715J9842N7034P7511o4058n6117J135
4555C5037l4169N4034K9276n9294m2187n8617j3412l7884J8889P3248m8058K8369
4543e4768n795L2215M0712l7821J4029J409k8898L460m4374k4526L1931K1867
4531e0559O8605N975K4132n5202k565l0552o031m2644K712j9720J9149J360o5937
4518a51277J7258J13567R9369j4176p3572k3869P0609j844m1098N787k239l8800
4506d0285l3420K863L2631P5262J0183m3986p1043O710M0704K2174q2926L8924
4494d2209J7571O334l3469r901m2855J2625L5371k6282j8506K2628N6909j7471
4482c9255l9349O723j2024j0109J17947K0396r9715p7556m4526N5103J4530M7198
$$ y = [-30212, -96147, -145392, -143840, -99608, -122025, -310, 19532, 76566, 154077, 90019, 33902, 35037, 868, 54902, 84178, 24884, -17303, -75920, -89332, -127216, -108327, -35079, -83137, -54768, -60563, -28348, 12364, -25457, -11428, -10019, -38917, -35457, -79831, -104357, -72426, -50559, 18046, 24021, 48153, -7049, -9614, -40166, -46197, -88841, -86129, -105849, -86700, -85340, -151277, -134019, -20452, 78917, 64741, -8831, -32700, 37909, 36065, -5033, 754, -1485, -40285, -73705, -70842, -38211, 37051, 47234, 3248, -67795, -61085, -20381, 1793, -81133, -42209, -24638, -18304, -51773, -61674, -104529, -91904, -56533, -82815, -101321, -78693, -21784, -39255, -78604, -71881, -83905, -94014, 23933, 44329, -55386, -132942, -177468, -122365, -107835, -60637]
4470f0637l958K6068L9067Q286l9211P2746J4243o6403r2318j7751L5887O1763
4458b2218O906l772j0748j2974R556M057k3499K5668M4303l6975k4765j2928j4678
4445g2067P0269N4198J07184r0895m1799L0324J6107J5582q218o1553p7478J2615
4433d5731J8669l2471q0191l4032J36281P0847J6461q2563p5999J4051O6629J33637
4421A05588M8806q0198k1102m4609k1444L4421j5502k6608k1618N3259K2365J5
4409C3373N2490q864p8940r1994M2583P8289R0859o2966k9504L7166O1343k4734
4397I9101M7023l9231j24167o8982M8023Q0420P0572O2966l5168m1907K4947k9032
4385I4565l5156N60j6606Q304J9010n8112k6449M1662m9954P765k5921R4670k4412
$$ y = [-60637, -64595, -38527, 540, 8826, -30385, 42361, 56604, -9799, -102117, -119868, -83981, -22218, -15312, -19084, -29832, -42806, -33250, -29193, -52692, -27024, 17279, -19696, -44461, -57389, -72067, -1798, 52400, 159584, 68689, 26890, 57214, 73321, 88903, 80685, 19132, -58346, -45731, -27062, -59533, -139724, -173756, -37475, 33372, 49833, -32730, -108729, -94678, -28049, 105588, 154394, 74196, 53094, 8485, -12959, 21462, 5960, -20648, -42266, 10993, 33358, 33373, 85863, 76999, -1941, -93935, -51352, 26937, 117796, 54830, 25326, 62492, 123835, 99101, 146124, 106893, -17274, -86256, -38233, 42187, 112759, 175725, 140557, 98650, 123597, 94565, 59409, 59969, 43363, 51667, 70677, 12565, -13884, 27778, -22176, -14411, -40332, 54338, 29926]
4372B9926q8759P400l0241J7687K0156l2229l1804M2752l5614j7293K1792J20044
4360B3817K0907p3609m0016J2057M3039l2670l8932l6317k591o8057j2517J7064
4348a87825N7763l0391l9571Q9531N0034M2427k1696o514O2193L818m7164o2527
4336h9922k2938J1532r893q345J6392M7765m1969k7897K7601M4970O263R41P995
4323c7505k9441j048Q7303O0894q03J7905N9694J0357j05014p490M4497r590J1863
4310A01622J9762l4056j59121n7845N9422Q8708n3184J5388k524l2613j6107P2787
4298B239P6216L6671j11575q5343J7819K0205K8841k0047O4185k0330m3825p5737
4286a10681p9518J20424J03997o2081M3185J0141m026p9254r292j0148L0394N8488
$$ y = [29926, -58833, -51433, -81674, -63987, -43831, -76060, -107864, -65112, -100726, -118019, -96227, 23817, 44724, -28885, -68901, -56844, -13805, -46475, -85407, -121724, -124315, -192372, -204889, -187825, -130062, -160453, -200024, -110493, -60459, -18032, -39728, -46242, 15951, 19769, -27395, -89922, -112860, -101328, -111221, -119566, -103174, -55409, -97378, -125275, -97674, -52704, -46441, -45500, -37505, -66946, -67994, 19309, 80203, 79400, 97305, 156999, 167356, 62342, 54852, 99349, 89759, 101622, 121384, 87328, -71793, -129638, -70216, 18492, -34692, -19304, -21828, -54441, -70548, 2239, 78455, 115126, 3551, -81792, -63973, -43768, -14927, -34974, 29211, 8881, -34944, -110681, -190199, -69775, 34222, -27859, 15326, 25467, 21441, -57813, -67105, -77253, -46859, 11629]
4274A1629Q611K9804L8216j18347p3291P1291L4562o3203o4369k1163O0849L5611
4262d9800K1982P1535J2405j992n826m730o4002m3140J7253L4538L7326K4125
4250D9674J6953r8792r6010J6840O5232P090l3638L9241O2428J0641k9319M338
4238A4678m6175L190l5699n1727n019k7781k559M7249M1979M4621j00946o1100
4226a79289O2206M5231q728O4456J4256J5398l0445J19550L0016j4673n0771K5327
4214I2534M8326r1996r7578J5241P0251k9683J2120K7514j6181o7184m7841K5691
4202e8786l3116j8230J9812n918J3680J4215q802m2945K24R2380J25234m5491
4190E2257l7112Q1850J20843O164m0243o5046j67803n8910j7661Q7187J05193
$$ y = [11629, 20240, 50044, 88260, -30087, -103378, -32087, 2475, -60728, -125097, -146260, -85411, -49800, -27818, 43717, 56122, 54130, 48304, 43574, -20428, -63568, -46315, -11777, 25549, 49674, 66627, -32165, -128175, -111335, -46103, -39013, -72651, -33410, 29018, 39659, 10340, 14678, -31497, -28307, -64006, -115733, -120752, -148533, -151092, -103843, -61864, -17243, -118189, -179289, -117083, -71852, -80580, -16124, -1868, 13530, -16915, 102635, 132651, 117978, 67207, 92534, 140860, 48864, -48714, -33473, 36778, 7095, 19215, 46729, 30548, -36636, -84477, -58786, -91902, -110132, -90320, -96238, -82558, -68343, -77145, -120090, -119866, -27486, 97748, 52257, 15145, 96995, 217838, 224002, 183759, 118713, -49090, -108000, -125661, -38474, 66719]
4179F6719j193K8704j3770n4106m3947m4459m1829l2888J0308L0193R3757Q5378
4167H2867j8369j11274j40767K7205M3085Q0249J24556J8711m8603n6862P7823
4156G8621l838m3351j36146m2977R1029R877M9118K8357j5674m7552J4752L7873
4144B0089r663n1312q5350n7540M0323P0124J5079J4396K6442l6686m8038Q4893
4132a7243n0899m5069K6322O358L122k9518O7987L4392r942n7668J4557J23741
4120F6140K9629p4672l0656j527l5235l4301L3610r943O0127J2020r3116q0200
4108a58124m7048O6140L9299K1982N5333j4181l1554q7421k8345J0336P197P5721
4096i0665m4796L3289J0011l5875j6437L4760K4910n4701j0052P5327M7995k7100
$$ y = [66719, 65526, 94230, 80460, 26354, -17593, -62052, -103881, -136769, -126461, -96268, -2511, 82867, 64498, -46776, -187543, -160338, -117253, -37004, 87552, 106263, 57660, 798, 78621, 74783, 31432, -104714, -147691, -56662, -46785, 2333, 30690, 15016, -32536, -17784, 20089, 10426, -40886, -126236, -183776, -143453, -73329, -58250, -43854, -17412, -54098, -102136, -17243, -68142, -113211, -86889, -80531, -77409, -106927, -38940, -4548, -14490, -72158, -57601, 66140, 95769, 21097, -9559, -11086, -46321, -80622, -47012, -56955, 3172, 15192, -77924, -158124, -205172, -139032, -99733, -77751, -22418, -36599, -68153, -155574, -183919, -173583, -166386, -90665, -135461, -102172, -92161, -128036, -144473, -109713, -84803, -139504, -149556, -74229, -26234, -53334]
4084e3334k9398j4111K4628p8786p6652Q1035p784k6676L2233j081L881N9218
4072h6827O3358m1184J5727M4905J3322n3786o1887n796L0332k0176j8109N5746
4060f4375j5015j4520M1942K936l3519P9508k5293p3872k2531J6452Q7747N8436
4048C7896M3056p7069o2339M1164M0249k0074m0993O5447N4907l5092l7561N6165
4036F5756J07335Q3013M7418J2151N056j23010j10594m5875m6285J2061p5676
4025f8650l8862Q308L8287M5327M6597m0603K9289l415P617M3017m4093j6015
4013F804j1222r10q1011q3548j8401O8758J38794P8775o5948p0017j3438l3828
4001h5192m178N8754l1679l8803M0117m639m0999j547M788k7430L9076L8738n8393
$$ y = [-53334, -82732, -96843, -72215, -151001, -227653, -146618, -154402, -181078, -148845, -149926, -146045, -86827, -23469, -64653, -48926, -4021, 9301, -44485, -106372, -112168, -81836, -102012, -120121, -64375, -79390, -93910, -51968, -49032, -82551, -3043, -28336, -102208, -124739, -108287, -20540, 37896, 80952, 3883, -58456, -17292, 22957, 2883, -38110, 27337, 82244, 47152, 9591, 65756, 173091, 256104, 303522, 315673, 320729, 197719, 87125, 41250, -5035, 7026, -68650, -107512, -99204, -60917, -15590, 31007, -9596, 19693, 16278, 23895, 66912, 22819, 6804, -4418, -5328, -86339, -169887, -188288, -119530, 19264, 98039, 32091, -37926, -51364, -85192, -89370, -30616, -62295, -101098, -60981, -65620, -106619, -108166, -103378, -130808, -91732, -52994, -111387]
3988a11387M6997M0302k6804k0894P1171Q7326K9747j26234L8658Q3807L2562
3977A45251n218m5094m975j42613j42590M4517J00747J4931o8331o3358L6192
3966a30541M6108K239Q967L7724K7164N807O6091l8280l4349K0478R750j2354
3954H804M5406l7133k9266l6289n8592k892K7482K3836O6854L5801j00038q0323
3942a36350K7790J2532p5604o1755j1713J27824j776L7420k7154O0645r58j9805
3930f8904K7787k0150l2858P884L0261K3970N3706o696r0322M6775J03832k640
3918G2645n1251m4236K8755L4935j0316k7415l8982k3687m0026J16240R1205J4976
3906A22843l3658k6858k1962m0704L9638K3123k7201p5206n9856l4258j6634R3854
$$ y = [-111387, -64390, -24088, -50892, -71786, -615, 86711, 116458, -9776, 28882, 112689, 145251, 140033, 94939, 89964, -52649, -195239, -150722, -49975, -35044, -103375, -166733, -130541, -84433, -82194, -73227, -35503, -8339, -2532, 63559, 25279, -9070, 11408, 21158, 8804, 54210, 17077, -12189, -48478, -107070, -109962, -82480, -58644, 8210, 44011, -56027, -136350, -108560, -96028, -171632, -233387, -245100, -117276, -119052, -81632, -108786, -48141, -49099, -68904, -41117, -61267, -94125, -86241, -55980, -32010, 21696, 15000, -75322, -28547, 75285, 72645, 21394, -22842, 5913, 40848, 30532, 3117, -35865, -59552, -99578, 16662, 107867, 122843, 89185, 62327, 40365, -339, 39299, 62422, 35221, -39985, -99841, -134099, -150733, -56879]
3894e6879j562J0198J0324q652M1898K6218j9410k0415m7917L7497L4806k3754
3882a7648Q433O6586J7257n4252n9806Q88L4824j7945L6410K8642j1419K9966
3870F1936l3865M2837K8934o8231j950K7652J0824j4394l2193l9712m3007m7634
3858a08803N2410K9186K7852M2780n27L8700M4878m8877n7768O2931q3888m3142
3846d4268J6873O6536m3850q598j9501q881O303o8821K6280N1710N6883l5574
3834d908l5713P3120M2673J0601m5701j7625J1277l7532k0569N2902O8820m764
3822I2581j7115n8306n7323o187P9061N8458m4500r8860m5812O5930Q98m3877
3810g5052J1430M441j0287Q0978m337K5338Q3675m9287J0040j2781N4933M846
$$ y = [-56879, -58441, -48243, -37919, -46571, -4673, 21545, 2135, -18280, -66197, -28700, 6106, -17648, -9215, 57371, 74628, 20376, -39430, -38542, -3718, -21663, 14747, 43389, 31970, 61936, 28071, 70908, 99842, 31611, 29661, 57313, 68137, 53743, 21550, -18162, -61169, -108803, -56393, -27207, 645, 43425, 42898, 81598, 126476, 77599, 19831, 82762, -1126, -44268, -27395, 39141, -4709, -13307, -32808, -41689, -35386, -104207, -77927, -26217, 30666, -4908, -40621, 32499, 75172, 85773, 40072, 22447, 33724, -3808, -24377, 28525, 97345, 92581, 75466, 17160, -40163, -46350, 32711, 91169, 46669, -52191, -98003, -32073, -31175, -75052, -63622, -59181, -69468, 11510, 7173, 32511, 116186, 66899, 76939, 64158, 119091, 123937]
3798A23937N593k7895K4257r7891k0212J36383m4803j08642q105n8202K692m0196
3786a13084J834J08490J10394l9973r3761m9258k8651l5588P8799P6609O3716
3775G9527J3678J1466m5429m1575n5104k8998J1797k3213K8452L8346j8898L3157
3763C206K2500M6451o1314l3140K8330l1613n4619k3586O3621P8074K1272k518
3751E6664K6753q3508k3978N2947M5086o5303n5694j5514o735j9442K4630M082
3739f0012K985k8352R7657N3861o4786m8028j04480m6615J0997J23378R1354K3029
3727E0988l5217l3009L443K1888R349o2754j0045O0537L4947J3254j4668k0806
3715A7907j31775Q6011K15691k3928j53436q4507L2359o77j2954o5340M2646M4801
$$ y = [123937, 129530, 101635, 125892, 28001, 7789, 144172, 99369, -9273, -17378, -75580, -72888, -113084, -111250, -2760, 107634, 67661, -26100, -75358, -104009, -139597, -60798, 15811, 79527, 93205, 104671, 59242, 17667, -37437, -66435, -54638, -77851, -49399, -11053, -29951, 3206, 25706, 72157, 10843, -22297, 6033, -25580, -80199, -103785, -40164, 37910, 59182, 56664, 83417, -91, -24069, 28878, 73964, 8661, -47033, -62547, -69282, -88724, -64094, -60012, -57027, -85379, 12278, 66139, 1353, -46675, -151155, -197770, -186773, -63395, 27959, 50988, 15771, -17238, -13795, 8093, 17442, -45312, -55357, 5180, 40127, 53381, 38713, 17907, -113868, -27857, 187834, 163906, 10470, -74037, -41678, -42355, -55309, -120649, -78003, -33202]
3703c3202R026R228L1586J0040p1689k1638K6765J2740j3917m749N112Q2937q360
3690C3879n6843n0220o6348J4759N4499m3145l1378J1830M8486M9087j0922n9880
3678a06196O8819O8178J4221p6143r9250l0044O5550J6411N196L8898o4299M8872
3666d9787J12932m2091r3469J5244k54o9962N0619K2367M0957M4393j9375k8142
3654a6568m5932n7788l8087O0784J3528L1717N0192N6891J5663o9849K3272k4480
3642f57l2081n4705P1787J4218n8288K9074R7553O1333m574p5321n8485n7072
3630f7218N8755L3130l9673k5545K5552Q9726J2954q3438l2169l9648M8507Q4116
3618F5049J3153K7178l9797p3070q7176O0848J9829J0024l4607J7136j8282m0350
$$ y = [-33202, -24176, -14948, 16638, 26678, -45011, -66649, -39884, -27144, -41061, -45810, -40698, 42239, 33879, -22964, -73184, -139532, -124773, -70274, -113419, -144797, -132967, -84481, -35394, -46316, -106196, -37377, 30801, 45022, -31121, -130371, -160415, -94865, -78454, -73258, -34360, -98659, -49787, 63145, 21054, -72415, -57171, -57425, -127387, -76768, -54401, -13444, 30949, 11574, -16568, -62500, -120288, -158375, -97591, -84063, -52346, -2154, 54737, 70400, 551, 23823, -657, -32738, -87443, -15656, -1438, -59726, -30652, 66901, 128234, 123660, 48339, -10146, -67218, -8463, 24667, -15006, -40551, -14999, 74727, 87681, 4243, -27926, -67574, -19067, 65049, 78202, 105380, 65583, -7487, -94663, -33815, -13986, -3962, -38569, -21433, -39715, -80065]
3606h0065R675n0519q2418j846K5234N4184M4724k4075q5299n428o630P9778K2725
3593i9960P139k1859K1321O4395k9141m9554k4437k0366J3069L2612Q3662K0302
3581b817j8344M0149K328j614n615m0943m853L3758K3069m0199L90l2813N4689
3568G185j7022l4262P884L8970L4928p4022l5663L8370P5448J2394j7522m3019
3556f331o7185k5446k0353l1286R101J3502q669K6976q1558k9752P8288P2932
3544f9781K5959L8775q4476n7299o0354K680K7029J49219M3050q1255J4602L6227
3532a5624J5611N05j5522L5214o097L841p2371O0016O6655m0194m3090l5209L1950
3519a4315j3532O491J5732l2170M9576L8314k9287o2664n3221K064j0460P3467
$$ y = [-80065, -70390, -120909, -203327, -205173, -179939, -125755, -81031, -105106, -190405, -195833, -202463, -122685, -99960, -92821, -114680, -93359, -28964, -58105, -107659, -132096, -152462, -139393, -106781, -23119, -2817, -21161, 18988, 21316, 19702, 14087, -26856, -31709, 2049, 25118, -15081, -14691, -47504, 7185, -9837, -44099, -36215, 2755, 37683, -36339, -72002, -33632, 41816, 54210, 36688, -6331, -73516, -98962, -119315, -150601, -141500, -127998, -136667, -109691, -191249, -221001, -142713, -69781, -43822, -5047, -89523, -146822, -207176, -204496, -177467, -28248, 14802, -66453, -51851, -15624, -13, 492, -15030, 20184, 14087, 17928, -54443, 5573, 72228, 32034, -11056, -46265, -14315, -27847, -21356, -5624, -37794, 11782, 50096, 20809, -41855, -95076, -93012, -103472, -30005]
3507c0005K6221o9408p0019L4077N5533L7302r750P6005L6728q363j7176J8156
3495G9301n7047m2989L7815J9251M474N0401m3058K5337o4677m985k2732j7595
3483c6504m5144L277L2023L2634J00620J3524j7367j8688j8083m2186l278m3468
3471d2640l4682P379M5826O2707L9202J5755p8099k2798l3923k4798q3674L3480
3459a16265Q7950K0204j988l1946N0851L5461l850m2368n0239P559L6231q3708
3447i2108J762M1828K9506O6029k314m4741n6336J9258J6146J3527n0987n6804
3435a15234R6612n558M7754M8446j2862j4038m8740j5627L0858L7403m8417j5965
3423a5368K6537N0056j440m358M0080M5598l4892m7776P0j05632k8653Q4706J0491
$$ y = [-30005, -3784, -73192, -143211, -109134, -53601, -16299, -26049, 49956, 86684, 78321, 61145, 79301, 22254, -20735, 17080, 36331, 40805, 91206, 48148, 73485, 8808, 3823, -18909, -36504, -81648, -78371, -46348, -13714, 86906, 100430, 83063, 64375, 46292, 4106, 828, -42640, -77322, -69943, -24117, 38590, 77792, 93547, 15448, -7350, -41273, -66071, -149745, -116265, -28315, -8111, -10099, -42045, 8806, 44267, 40417, -1951, -52190, -44631, -8400, -92108, -90346, -48518, -19012, 47017, 44703, -38, -56374, -37116, -20970, -7443, -58430, -115234, -18622, -24180, 23574, 72020, 59158, 45120, -3620, -19247, 11611, 49014, 597, -15368, 11169, 61225, 59785, 55427, 95507, 141105, 106213, 58437, 58507, -47125, -75778, 8928, 19419]
3410A9419p4552p263m0186K0060J8873K4750l0712j7408L9299p2096K7390K4925
3398f7501L2608L5593P8353L0846l3508m4752j5352j6750l3473L4522l4105J9637
3386a3882j4609n406k7229L4741p9340K3493P0577k1845p7556O4980J01362M1638
3374I6924m2791o0083J0526q070j3394l7091o6416O8481P6263m6939K6569K8221
3362C2200J8912O7407K5170J0294o2503j08507j20113j1989J14834J39691m6028
3351E9368o7843N1713L7990q2713N4786L9648l3334L1141J8784q523q062k9825
3339F3130p2907n5636k740J5490K3059O7191o481m0670k5910N1889K9803r453
3327C6765o1363m6762n920k6092L5711N8424k1344N2915m2964q2269l5206R398
$$ y = [19419, -55133, -62396, -102582, -82522, -63649, -38899, -69611, -87019, -47720, -119816, -92426, -67501, -34893, 700, 79053, 109899, 76391, 31639, 16287, -463, -33936, 586, -33519, -13882, -28491, -33897, -61126, -26385, -105725, -82232, -11655, -33500, -111056, -46076, 55286, 96924, 54133, -5950, 4576, -3494, -16888, -53979, -120395, -51914, 24349, -22590, 3979, 32200, 51112, 118519, 143689, 153983, 91480, -17027, -137140, -149129, -34295, 105396, 59368, -8475, 43238, 81228, -1485, 53301, 92949, 59615, 90756, 109540, 101017, 92955, 63130, -9777, -65413, -68153, -52663, -29604, 37587, 31106, -9564, -35474, 16415, 46218, 36765, -24598, -71360, -77280, -103372, -67661, -9237, -30581, 22334, -20630, -102899, -138105, -128707]
3315a28707M6354P6509k3680K5072P1788m0469r2313o8677L6523o2459M4082M7865
3303f8112l0873k1414P5694M0013K5821J1059N177j2628R877m1668l1907J7274
3291b1687k1543Q1285O726O962N6705o2189q4776m2216L6589P8100J6273L0957
3279H1186m1158m4524Q327l3194J6836M0908j1331l111K6841K265j8844q612Q7438
3266A03027J24445m0438j01734j08992l2588N7707M0816P2196N0817J9625l9350
3255A45531l4181J965J6139r3668o8129o0756Q580P4141Q1762L2006P9689k1176
3243A61903L7639n799o5054l3947l1722p2066k6381m0783m7532L3262n4543K7146
3231a17877O3359M8817n793R361J1459K5142k19q1348N586o7195j3347R3547J24361
$$ y = [-128707, -82353, -5844, -29524, -4452, 67336, 26867, -65446, -134123, -97600, -160059, -115977, -68112, -98985, -120399, -44705, -4692, 21129, 32188, 37365, 24737, 34614, -7054, -38961, -21687, -43230, 38055, 44781, 51743, 108448, 46259, -38517, -80733, -44144, 33956, 50229, 81186, 40028, -4496, 3831, -29363, -12527, 28381, 17050, 13939, 40780, 43045, 24201, 15589, 103027, 227472, 187034, 85300, -23692, -56280, 1427, 42243, 114439, 165256, 184881, 145531, 111350, 113315, 129454, 35786, -32343, -93099, -84519, -10378, 71384, 103390, 183079, 161903, 199542, 193743, 128689, 94742, 63020, -9046, -35427, -76210, -123742, -90480, -145023, -117877, -54518, -5701, -11494, -2133, 9326, 34468, 34249, -47099, -41513, -108708, -122055, -28508, 95853]
3218I5853k6464p2419j5367N2400N6234l5640p9760R237N8692P656o2833J5748
3206C337M9834O3305J1379j10152q6927L9011J03792L6740r920k6430o9453n6263
3194e1747M0097J07698k3191r2463m6616O0546N7326k9364n3356n931J09221l944
3182F8276J9332R279J0122J8552l9454o5226k289L618k4353q5310K5890Q7507
$$ y = [95853, 69389, -3030, -18397, 34003, 90237, 54597, -25163, -15926, 42766, 50422, -12411, 3337, 53171, 116476, 127855, 17703, -69224, -30213, 73579, 110319, 100399, 73969, 4516, -51747, -11650, 96048, 72857, -19606, -66222, -5676, 51650, 22286, -31070, -37001, 72220, 68276, 87608, 96887, 107009, 125561, 86107, 20881, 18592, 22210, -2143, -87453, -61563, 25944]
$$ [...]
##END NTUPLES=NMR SPECTRUM
##END=
