##TITLE=Analysis number 312051
Compound Code tl 01000
Project Code adrs
Chemist Name ugmt
##JCAMPDX= 6.0         $$ Bruker NMR JCAMP-DX V2.0
##DATA TYPE= NMR SPECTRUM
##DATA CLASS= NTUPLES
##ORIGIN= Bruker BioSpin GmbH
##OWNER= NMR
$$ XWIN-NMR		Version 3.5
$$ Fri Jul 22 10:28:15 2005 GMT Daylight Time (UT+1h)  MAYBRIDGE\NMR@NMR_250MHZ
##.OBSERVE FREQUENCY= 250.131544655141
##.OBSERVE NUCLEUS= ^1H
##.ACQUISITION MODE= SIMULTANEOUS (DQD)
##.ACQUISITION SCHEME= undefined
##.AVERAGES= 16
##.DIGITISER RES= 18
##SPECTROMETER/DATA SYSTEM= dpx250
##.PULSE SEQUENCE= zg30
##.SOLVENT NAME= CDCl3
##.SHIFT REFERENCE= (INTERNAL, CDCl3, 0, 16.522)
##AUDIT TRAIL= $$ (NUMBER, WHEN, WHO, WHERE, WHAT)
$$ ##TITLE= Audit trail, XWIN-NMR		Version 3.5
$$ ##JCAMPDX= 5.01
$$ ##ORIGIN= Bruker BioSpin GmbH
$$ ##OWNER= NMR
$$ C:\u/data/dgb/nmr/ADRS/6390/pdata/1/auditp.txt
$$ ##AUDIT TRAIL=  $$ (NUMBER, WHEN, WHO, WHERE, WHAT)
(   1,<2005-07-22 10:27:54.14 +100>,<MAYBRIDGE\NMR>,<NMR_250MHZ>,
      <created by zg, POWCHK disabled, PULCHK disabled
       configuration hash MD5:
       62 19 C7 07 E1 42 D1 B7 37 6C 3D D0 77 39 F9 E6
       data hash MD5: 64K
       BB E0 83 D0 4F 1D E6 1B AC 24 13 92 D0 18 EE 88>)
(   2,<2005-07-22 10:28:06.63 +100>,<MAYBRIDGE\NMR>,<NMR_250MHZ>,
      <Start of raw data processing
       ef LB = 0.3 FT_mod = 6 PKNL = 1 SI = 32K 
       data hash MD5: 32K
       50 BC 8A 72 26 4C DC 3F 22 2F 68 CA A0 F1 88 5A>)
(   3,<2005-07-22 10:28:08.54 +100>,<MAYBRIDGE\NMR>,<NMR_250MHZ>,
      <apk 
       data hash MD5: 32K
       2D A4 5C 3A 70 92 85 D0 17 B1 35 DC 3D A5 42 1B>)
(   4,<2005-07-22 10:28:09.21 +100>,<MAYBRIDGE\NMR>,<NMR_250MHZ>,
      <abs ABSG = 5 
       data hash MD5: 32K
       E9 6C 9B 66 3B 05 04 6A 6F 07 AD 83 78 E1 E2 03>)
$$ ##END=
$$ 
$$ hash MD5
$$ 92 D0 5D 5D 2A 1C B9 36 BA AA 39 B0 C5 37 C2 EC
##$RELAX= 
##$RELAX= 
##$RELAX= 
##$RELAX= 
##$RELAX= 
##$RELAX= 
##$RELAX= 
$$ Bruker specific parameters
$$ --------------------------
##$DU= <C:\u>
##$EXPNO= 6390
##$NAME= <ADRS>
##$PROCNO= 1
##$TYPE= <nmr>
##$USER= <dgb>
##$AMP= (0..31)
100 100 100 100 100 100 100 100 100 100 100 100 100 100 100 100 100 100 
100 100 100 100 100 100 100 100 100 100 100 100 100 100 
##$AQSEQ= 0
##$AQ_mod= 3
##$AUNM= <au_zg>
##$AUTOPOS= <9 >
##$BF1= 250.13
##$BF2= 250.13
##$BF3= 250.13
##$BF4= 250.13
##$BF5= 500.13
##$BF6= 500.13
##$BF7= 500.13
##$BF8= 500.13
##$BYTORDA= 1
##$CFDGTYP= 0
##$CFRGTYP= 5
##$CHEMSTR= <none>
##$CNST= (0..31)
1 1 145 1 1 1 1 1 1 1 1 1 1 1 1 1 1 1 1 1 1 1 1 1 1 1 1 1 1 1 1 1 
##$CPDPRG= <>
##$CPDPRG1= <>
##$CPDPRG2= <>
##$CPDPRG3= <>
##$CPDPRG4= <mlev>
##$CPDPRG5= <mlev>
##$CPDPRG6= <mlev>
##$CPDPRG7= <mlev>
##$CPDPRG8= <mlev>
##$CPDPRGB= <>
##$CPDPRGT= <>
##$D= (0..31)
0 1 0 0 0 0 0 0 0 0.06 0 0 0 0 0 0 0.0002 0 0 0 0 0 0 0 0 0 0 0 0 0 0 
0 
##$DATE= 1122024473
##$DBL= (0..7)
120 120 120 120 120 120 120 120 
##$DBP= (0..7)
150 150 150 150 150 150 150 150 
##$DBP07= 0
##$DBPNAM0= <>
##$DBPNAM1= <>
##$DBPNAM2= <>
##$DBPNAM3= <>
$$ [...]
##$SUBNAM6= <"">
##$SUBNAM7= <"">
##$SUBNAM8= <"">
##$SUBNAM9= <"">
##$SW= 20.6930455092707
##$SWIBOX= (0..15)
0 0 3 0 0 0 0 0 0 0 0 0 0 0 0 0 
##$SW_h= 5175.983436853
##$TD= 65536
##$TD0= 1
##$TE= 295.16
##$TE2= 300
##$TE3= 300
##$TEG= 300
##$TL= (0..7)
0 120 120 120 120 120 120 120 
##$TP= (0..7)
150 150 150 150 150 150 150 150 
##$TP07= 0
##$TPNAME0= <>
##$TPNAME1= <>
##$TPNAME2= <>
##$TPNAME3= <>
##$TPNAME4= <>
##$TPNAME5= <>
##$TPNAME6= <>
##$TPNAME7= <>
##$TPOAL= (0..7)
0.5 0.5 0.5 0.5 0.5 0.5 0.5 0.5 
##$TPOFFS= (0..7)
0 0 0 0 0 0 0 0 
##$TUNHIN= 0
##$TUNHOUT= 0
##$TUNXOUT= 0
##$USERA1= <user>
##$USERA2= <user>
##$USERA3= <user>
##$USERA4= <user>
##$USERA5= <user>
##$V9= 5
##$VALIST= <valist>
##$VCLIST= <CCCCCCCCCCCCCCC>
##$VD= 0
##$VDLIST= <DDDDDDDDDDDDDDD>
##$VPLIST= <PPPPPPPPPPPPPPP>
##$VTLIST= <TTTTTTTTTTTTTTT>
##$WBST= 1024
##$WBSW= 4
##$XGAIN= (0..3)
0 0 0 0 
##$XL= 0
##$YL= 0
##$YMAX_a= 374663
##$YMIN_a= -434970
##$ZGOPTNS= <>
##$ZL1= 120
##$ZL2= 120
##$ZL3= 120
##$ZL4= 120
##$ABSF1= 16.522
##$ABSF2= -4.171173
##$ABSG= 5
##$ABSL= 3
##$ALPHA= 0
##$AQORDER= 0
##$ASSFAC= 0
##$ASSFACI= 0
##$ASSFACX= 0
##$ASSWID= 0
##$AUNMP= <proc_1d>
##$AZFE= 0.1
##$AZFW= 0.1
##$BCFW= 0
##$BC_mod= 0
##$BYTORDP= 0
##$COROFFS= 0
##$CY= 12.5
##$DATMOD= 1
##$DC= 0
##$DFILT= <>
##$DTYPP= 0
##$F1P= 14.0000005364418
##$F2P= -0.99999901652339
##$FCOR= 0.5
##$FTSIZE= 32768
##$FT_mod= 6
##$GAMMA= 0
##$GB= 0
##$INTBC= 1
##$INTSCL= 1
##$ISEN= 128
##$LB= 0.3
##$LEV0= 0
##$LPBIN= 0
##$MAXI= 10000
##$MC2= 0
##$MEAN= 0
##$ME_mod= 0
##$MI= 0
##$NCOEF= 0
##$NC_proc= -4
##$NLEV= 6
##$NOISF1= 0
##$NOISF2= 0
##$NSP= 0
##$NTH_PI= 0
##$NZP= 0
##$OFFSET= 16.522
##$PC= 1
##$PHC0= 128.948
##$PHC1= 3.410752
##$PH_mod= 1
##$PKNL= yes
##$PPARMOD= 0
##$PSCAL= 4
##$PSIGN= 0
##$REVERSE= no
##$SF= 250.13
##$SI= 32768
##$SIGF1= 0
##$SIGF2= 0
##$SINO= 400
##$SIOLD= 32768
##$SREGLST= <1H.CDCl3>
##$SSB= 0
##$STSI= 32768
##$STSR= 0
##$SW_p= 5175.98343685301
##$SYMM= 0
##$S_DEV= 0
##$TDeff= 65536
##$TDoff= 0
##$TI= <Analysis number 999999
Compound Code 99
Book Reference 9
Project Code 9>
##$TILT= no
##$TM1= 0
##$TM2= 0
##$TOPLEV= 0
##$USERP1= <user>
##$USERP2= <user>
##$USERP3= <user>
##$USERP4= <user>
##$USERP5= <user>
##$WDW= 1
##$XDIM= 32768
##$YMAX_p= 496379312
##$YMIN_p= -58416
$$ End of Bruker specific parameters
$$ ---------------------------------
##NTUPLES= NMR SPECTRUM
##VAR_NAME=  FREQUENCY,     SPECTRUM/REAL,   SPECTRUM/IMAG
##SYMBOL=    X,             R,               I
##VAR_TYPE=  INDEPENDENT,   DEPENDENT,       DEPENDENT
##VAR_FORM=  AFFN,          ASDF,            ASDF
##VAR_DIM=   32768,         32768,           32768
##UNITS=     HZ,            ARBITRARY UNITS, ARBITRARY UNITS
##FACTOR=    0.157963299565203, 1,           1
##FIRST=     4132.6476996994, 0,             0
##LAST=      -1043.33573715361, 0,           0
##MIN=       -1043.33573715361, -58416,      0
##MAX=       4132.6476996994, 496379312,     0
$$ Real data points
##PAGE= N=1
##DATA TABLE= (X++(R..R)), XYDATA
$$ [...]
29971 4688 -2988 -3760 330 -5594 -12357 -12617 -6560 -9588 -4884 -5825 -5676 -6028 -4508 -897 -2936 -9890
29955 -9890 -11592 -8862 -2484 4815 8258 8372 1506 1772 -1535 -1249 7440 12050 4060 3400 7169 5481
29939 5481 -1404 -2606 8670 16605 12957 7944 10678 4406 -8360 -5980 975 6483 9709 2527
29925 2527 -317 -1116 10074 13237 6856 1115 -3537 -3263 -6503 -8467 -1001 -4397 -6072 -688 2036
29910 2036 -8120 -9333 -9773 -15340 -11711 -7828 1460 1036 -7636 -3836 660 -1077 -9206 -16215 -21812
29895 -21812 -10745 -8911 -5508 -3470 -1554 -609 4812 8846 1338 -10851 -18246 -20573 -16326 -13819
29881 -13819 -11565 -11044 -7546 -8025 -6562 -651 618 -5359 -4050 -3397 -4615 -11560 -15705 -14114 -7595
29866 -7595 -4122 -1021 -3288 2601 -6005 -14508 -13841 -8365 -3152 -4436 -7993 -16127 -18621 -14472 -3589
29851 -3589 -843 3205 -3417 -13703 -10899 -9830 -12292 -4742 -2239 1182 1590 2148 367 267 -5093
29836 -5093 -4037 4016 7236 913 -3787 -3643 -496 2969 5923 4478 -2990 -8461 -6765 -11100 -5721
29821 -5721 -3267 -1187 2404 -17 206 -1016 397 -6404 -11255 -11516 -14332 -16554 -15397 -9986 -12872
29806 -12872 -11176 -8481 -10375 -8268 -1176 -1596 -5330 -2896 541 -1837 -3443 -2521 -6286 -11876 -10495
29791 -10495 -6622 -2191 -138 -1733 87 2725 2149 -2447 -6583 -7866 -6424 -5066 -2182 -1743 -10501
29776 -10501 -15320 -9412 -6218 -6110 -6204 -1398 -5181 -3965 5358 6633 13040 15709 4979 -2245 -6236
29761 -6236 -2606 -3237 -946 1968 -2667 -2088 -2056 -361 915 -6961 -11007 -10514 -6947 -2911 -377 3848
29745 3848 4355 6966 8056 9279 6499 -8327 -11026 -8794 -8106 -6629 -2721 -3383 3544 -3635 -5574
29730 -5574 -8026 -10310 -17787 -20497 -17723 -16740 -9592 -13194 -12708 -7053 -6335 -8932 -5574 -478 3328
29715 3328 1996 -2072 -4342 -4088 -7133 -4606 -655 -2688 2890 10309 9695 4246 596 547 3525 4865
29699 4865 -4690 -9274 -2912 6853 9583 4516 -2396 -1621 3230 564 -3652 -5146 2855 3060 -1506
29684 -1506 -5287 -12116 -10856 -12296 -15503 -8287 -2530 -5806 -6817 -10377 -10155 -6226 -320 -1110 -6912
29669 -6912 -8842 -1585 3541 1840 4547 8575 10489 3377 1886 3781 5182 6045 -3279 -6665 -11930
29654 -11930 -11933 -6285 3286 9916 10684 9357 9397 5236 7353 11714 7878 7258 4543 493 -3176 -9079
29638 -9079 -6667 246 1236 -4237 -5088 -1708 1602 -7142 -9639 -7351 -823 -1953 -7317 -7147 3944
29623 3944 -388 -3277 2604 5721 310 -8212 -11795 -10774 -5792 -4474 -8212 -2426 -1156 241 2695
29608 2695 -2280 -2776 -6009 -8438 -8327 -12234 -12817 -9824 -8430 -12227 -8729 -2602 -942 222 737 645
29592 645 7728 11548 8877 285 -1051 -1877 -11118 -10342 -537 4400 5594 -2116 -9465 -8780 -2181 1746
29576 1746 10609 10884 10530 18710 21968 23135 18717 17019 15117 9654 2891 -2110 -4184 -2771 -778
29561 -778 6027 7557 9778 7421 6249 178 -1968 1457 -1234 -5044 -3532 -5875 -3269 -4818 -342
29546 -342 1738 4334 10157 9163 6544 4498 1514 1531 7579 14803 13488 6773 980 -872 -2988 -968
29530 -968 1075 2863 5189 11224 12994 14387 10249 13061 9874 9389 4333 842 3133 12796 21905
29515 21905 16674 13344 5273 -464 -3553 -3023 -4805 -8227 -3090 4298 1062 -122 -3441 -12306 -16113
29500 -16113 -13738 -4977 -6004 -10336 -8194 -6604 -2867 -3537 -3587 -1334 -724 -3717 -2839 -2615 -7996 -8647
29484 -8647 -7892 -4598 -7435 -14559 -10601 -2721 -5580 -12876 -9955 -10381 -3916 -7221 -7582 4561 3056
29469 3056 -4819 1426 8614 3927 -2845 -1077 4852 2285 706 -2566 637 741 -11789 -11352 -1716
29454 -1716 5343 6316 8518 3739 -2478 -4647 -8372 -11001 -16246 -11645 -10815 -7294 1755 3187 8340
29439 8340 9141 11010 6900 663 -5248 1284 11212 11085 -669 -4183 1386 -4729 -1705 -6051 -6480
29424 -6480 -1871 10399 15408 10097 713 2062 5728 -2481 -8218 -8704 -6364 -4335 -4416 -6680 -8177
29409 -8177 -651 4286 6015 884 1708 2417 4753 12953 13613 15125 15563 11670 11997 22298 27610 18379
29393 18379 6451 4870 -546 -3805 -3643 -3484 1108 -1113 1204 855 3688 3387 2368 406 1551
29378 1551 -1968 -1699 -3603 162 1101 -6412 -4616 221 4133 11227 8187 -4618 -9114 -4589 951
29363 951 1535 8154 17148 17009 5345 1654 -3310 -10032 -11929 -7617 -6535 -8974 -10071 -7602 -7287
29348 -7287 -9512 -6733 -4599 -3780 -7269 -1891 337 -613 -569 10254 11593 9546 4753 3708 3326 612
29332 612 -2967 4499 4664 -819 -9910 -5272 -2303 1053 699 6163 4596 780 2554 2292 4000 878
29316 878 3887 11645 11442 5690 5984 -1698 -9391 -2770 -1003 -322 -1415 951 3282 12605 19068 16235
29300 16235 10548 -804 -10361 -7028 1946 2500 4806 8350 13194 13894 13123 14168 3286 -4933 -5450
29285 -5450 -6694 5227 14694 11646 6253 785 -7224 -707 2254 7677 12007 6490 -5230 -5830
29271 -5830 1687 4565 -3690 -8372 -5713 -5123 -7063 -4037 3201 6836 5279 2385 2398 -1295 -8388
29256 -8388 -12719 -9299 -5533 -482 5341 1469 6193 1906 -9409 -9003 -3921 146 5717 4171 -1886
29241 -1886 -4828 -7282 -3076 4250 10555 10664 16441 10436 2535 2098 -908 -3946 -3943 2385 6876 7419
29225 7419 7938 8941 11796 12268 8877 4440 -6289 -5435 -5586 -74 5026 3798 -5103 -3922 -2742
29210 -2742 953 -6914 -10547 -9119 -5374 -13620 -18178 -9873 1210 921 -3087 -3425 -2675 -6733 -7383
29195 -7383 1188 4909 5563 -1909 -2365 -8610 -11392 -8760 -10973 -11902 -7846 403 3274 -191 -7453
29180 -7453 -12866 -8190 -4870 -1985 3107 -373 -2879 843 -4319 -15819 -17161 -12537 -8548 -6992
29166 -6992 -1317 -4570 -11565 -11522 -6672 -5384 -5782 1498 -1099 -3599 -968 5018 1998 3464 3778 -1327
29150 -1327 -3360 -19 3557 5740 935 -3373 1496 9353 12324 12129 12216 5254 6769 5336 3056
29135 3056 3233 6695 7803 15439 7354 -3405 878 6283 6880 8392 4491 6798 7557 10551 3924
29120 3924 -4110 -5483 8 2701 1413 847 -1231 -2803 -4430 -3335 -11172 -16369 -17507 -10262 229
29105 229 4478 -2378 -7165 -7670 -2782 -4654 -7572 -5301 -6415 -3927 -11230 -11466 -8033 -5810 -5920 -1854
29089 -1854 1977 1040 -4161 -3546 540 3459 2864 -869 2318 11074 12623 1556 -3119 -7009 -9513
29074 -9513 378 1009 556 3664 7023 7968 3828 -4192 -8955 -9964 -11622 -7874 -6451 -9892 -12843
29059 -12843 -5133 -2046 818 3706 6320 5689 3369 2343 647 4376 8358 6316 -3483 -3933 -296
29044 -296 -459 1106 1648 -5573 -4894 -2060 -1400 -6317 -13076 -8963 -6593 684 4577 -5004 -9632 -7229
29028 -7229 2666 3436 -2868 -3366 2743 1982 7140 10367 7259 1087 -4915 -5327 1353 1999 -3038 -9864
29012 -9864 -4535 -983 1982 5610 4088 -395 -434 4240 6518 -3517 -5236 -6312 -8951 -13201 -11192
28997 -11192 -5503 -3373 -2258 -405 -10958 -4318 -4490 -3824 771 -6825 -16634 -15620 -9675 -9942 -8938
28982 -8938 708 -4578 -9788 -13655 -12463 -6571 -4053 -5001 -1141 -4025 -6598 -7325 -11306 -3244 -624
28967 -624 -96 6149 5307 65 -1396 -3353 -961 5443 13689 17715 18916 12825 3626 1277 8767
28952 8767 9273 5275 1142 -4037 123 1798 -6142 -9150 -13467 -10847 -7081 -4777 -2246 -796 -2526
28937 -2526 -6759 -6421 409 2910 3109 8448 7208 5901 4132 5621 7758 1477 1483 81 3744 18378
28921 18378 20077 16157 10725 3117 3004 2663 -1377 -1467 -39 7405 13663 18470 18361 16544 22280 25157
28905 25157 21054 11015 3740 -3796 -3316 -7087 -8192 -7352 -7156 -3050 -5451 -1905 2915 -2875 -8135
28890 -8135 -5663 875 1494 2334 -3575 -5056 -6039 -1947 2725 4498 5061 8679 10315 5258 -205 3223
28874 3223 6098 5867 -500 -6942 -7093 910 7220 7179 6297 3091 -2065 -1243 -3137 -5548 -1399 2763
28858 2763 1212 -4565 -5979 -1690 -7895 -10017 -3787 2182 8925 7843 10839 8120 7508 5112 5795
28843 5795 -258 -4756 -871 -2790 -354 9570 5074 8541 6623 3228 -718 -1494 -3845 -8198 -9397
28828 -9397 -13848 -14844 -14799 -11144 -6211 -1210 5135 9832 6157 3773 -97 -1331 -7617 -13991 -7263
28813 -7263 -7706 -10137 -12875 -6499 -1682 6134 12542 11774 12311 3595 -850 -2000 -4305 -7790 -12513
28798 -12513 -15703 -13429 -7907 -8075 -6371 -4765 -1771 2384 1584 -10642 -17540 -14908 -11550 -9835 -2120
28783 -2120 12027 15052 15484 10247 382 82 -6190 -6170 -10373 -8030 -3097 262 -781 -573 2640 5646
28767 5646 11393 10897 10364 -560 -6396 -10737 -9416 -10961 -6189 1668 11592 5915 3335 6782 8113
28752 8113 11191 10722 1427 -5636 -8261 756 3634 484 4214 7483 14600 12933 8271 4847 6290
28737 6290 9020 3781 -1384 -2520 -9721 -3388 843 -5104 -3252 7239 673 -3217 -5272 -7604
28723 -7604 -10015 -15773 -16177 -10250 -16838 -15975 -11081 -6966 -1201 -1253 -5450 -6377 -7042 264 7848 10490
28707 10490 4188 296 -3079 -5450 -8289 -2927 672 6713 7198 4959 9503 10548 6215 4653 4107
28692 4107 735 3213 12052 10255 5435 6172 5647 1513 -5 1510 5418 4539 647 -2738 108
28677 108 10765 11754 9985 3323 -3205 912 -600 -6475 -6145 -370 -388 4432 -3521 -2465 561 594
28661 594 1501 -1739 -6932 -5382 -617 -5207 -6359 -12047 -10806 -7860 1771 -793 -4955 -4604 -4279 -2914
28645 -2914 -7111 1378 1140 -7150 -9476 -9903 -4915 -5263 2503 6276 3897 -319 2688 7809 11228
28630 11228 9439 5661 7586 8318 4034 7452 6315 -679 -4035 -4122 -2933 -9346 -5579 -2819 5908
28615 5908 10421 11947 6251 4162 9192 5272 1496 -1978 268 -4657 -3775 2130 5326 1580 -1569
28600 -1569 -190 -948 -8095 -10474 -5101 2882 848 -4122 -2742 -6480 -4931 -3026 -6204 -977 8680
28585 8680 15883 12354 5854 680 824 4396 5289 9526 12346 19077 13153 6478 7456 11275 17053
28570 17053 18008 10689 5834 10053 13101 7772 12646 16846 11484 9691 6711 6895 8483 10910 15310
28555 15310 16682 11409 6023 3840 5335 1435 -2206 -2142 3116 8953 7277 2173 -3244 -3393 3042
28540 3042 5178 1571 -1222 45 3112 2203 -346 -572 3965 6691 2515 -2906 -11120 -10500 -9114
28525 -9114 -12357 -5083 2578 -1067 -3728 2982 3208 -2801 1747 10501 5269 1486 6975 9048 7763
28510 7763 7078 8413 6323 984 -575 2470 2773 471 -1714 -12477 -14249 -800 8108 8228 151
28495 151 1184 -6287 -14346 -9938 -1593 -1246 4865 2851 -1660 780 -6843 -16735 -23314 -31664 -23860
28480 -23860 -19643 -9536 -7479 -2126 1666 -6557 -11804 -4724 -920 -7988 -11193 -9547 -10008 -10049 -8188
28465 -8188 -8244 -6403 -6595 -2028 3254 6564 4725 -6891 -7031 -393 1659 5895 10681 9828 494 -2240
28449 -2240 -965 -2747 3272 6466 6549 3799 2207 1628 903 2266 14043 17309 16041 11493 15446
28434 15446 15601 9572 4905 6770 10795 5398 -2535 -6126 -3662 5473 9912 5630 -3066 1724 4370
28419 4370 -304 -1536 -1359 72 5125 308 -6306 -2459 -288 -1691 -5044 -7243 -5880 -2948 1083
28404 1083 3563 5234 1274 1429 6836 12325 15795 10637 6740 4001 5271 9055 -50 -5781 -4530
28389 -4530 -5379 -4277 840 -172 -656 422 2488 8955 9313 -1352 -3239 -350 2738 8365 15075
28374 15075 14190 9217 14019 20126 20420 18809 13401 203 -4438 2588 6132 11675 9698 327 -4315
28359 -4315 -4571 -11533 -17710 -16470 -21315 -18721 -13367 -16501 -14217 -2528 1149 -1171 3372 -701 -6059
28344 -6059 -8095 -6693 -8850 -47 -944 -2804 -1396 -7395 -10532 -5953 -12629 -10600 -8184 -12814 -22596
28329 -22596 -18206 -12958 -13821 -16499 -12739 -12430 -15090 -17074 -13304 -11115 -6098 -65 5767 1125 1375
28314 1375 6608 8337 414 -4568 -2927 -1614 4691 7686 -2111 -7667 -9076 -4082 -2636 888 4184
28299 4184 -6798 -13045 -5181 -2070 -8716 -17003 -9821 -2187 -3975 -5892 -2517 -2866 -7119 -9146 -5879
28284 -5879 -2316 7848 13514 6296 10521 12371 4424 -1928 1723 9486 5724 4135 3252 1829 -177
28269 -177 -2144 6199 11827 5727 5871 8123 10839 15222 9458 6713 3667 -4969 -12960 -9043 6040
28254 6040 15471 12924 8013 6547 -3661 -13390 -12435 -7315 -5643 -463 9433 11877 5100 8547 12183
28239 12183 10004 6624 -548 -3657 -6093 -10661 -9240 -1637 859 2317 6000 2429 -1578 -4605
28225 -4605 -3710 -1729 -7842 -9425 -5584 -6486 1375 10846 5127 5443 2453 -1855 -4036 -9894 -12398
28210 -12398 -12093 -9759 -8020 -7015 5254 7632 8384 2970 -2048 -1611 -654 -3569 -1056 -3398 -5046
28195 -5046 -6096 -5541 67 2623 8961 7047 -5957 -7587 -3063 3001 4597 4225 5166 4189 900
28180 900 -1037 445 -803 -2978 -2524 -2068 -4919 -3578 -5763 -3238 2325 2382 -5221 -2821 -752 1940
28164 1940 -2961 -7467 -1396 -1936 -7197 -12517 -6658 -4426 -8036 -4198 -6136 -4850 -8718 -9230 -4249
28149 -4249 -5435 -12035 -7302 -5537 -12614 -14757 -14460 -11244 2755 8955 4975 3226 5047 8695 11487
28134 11487 14909 13486 5468 7056 14410 11171 -5892 -9118 -5523 -11706 -6793 8329 6689 3373
28120 3373 -2543 1218 10928 13853 14845 17255 16326 9998 6897 8026 590 -4032 -2066 -730 -333
28105 -333 6563 7141 4760 -686 -2525 -3088 1545 2218 235 353 2010 -6258 -2510 468 -2818 275
28089 275 513 9672 15229 8574 2201 -9180 -18433 -13631 -4361 -7865 -3232 5133 3823 120 3401
28074 3401 2988 -598 -1197 -6056 145 5482 4465 4359 3411 985 -5766 -9907 -9348 -9049 -11726 -8236
28058 -8236 -8347 -14514 -20726 -17556 -11686 -14852 -16954 -10768 -3883 -5084 -3976 3667 7838 -1335 -4007
28043 -4007 -1650 -5454 -6698 -11275 -10717 -14407 -18002 -12259 -3239 -1072 -1447 -1116 114 -481 -2229 8256
28027 8256 8104 7709 11195 8163 -575 -1540 -1946 1239 4288 -895 -2224 959 3428 2650 2831 872
28011 872 2804 9798 6279 -5579 -4224 -5570 -3633 521 4712 2565 479 5075 4999 433 -1572
27996 -1572 1204 5316 4192 5029 1267 -2097 -3551 -9780 -5589 -454 4543 -402 -2803 2998 2376
27981 2376 9885 12561 15250 16563 15830 507 -7524 -4704 -10122 -15913 -11459 -3331 3380 -236 -2726
27966 -2726 -1055 1205 23 6507 9506 7448 5451 4063 4579 11276 7482 -2660 -1392 -4737 -4399
27951 -4399 3664 5823 5385 6847 9569 9247 7944 4698 664 845 4531 3922 13594 12682 13674 10509
27935 10509 7893 357 -2649 -5803 -3378 -5481 -7652 -5785 -8012 -3645 -881 1094 5660 11967
27921 11967 2682 -1450 -5206 2696 8483 5206 4545 5867 5859 1132 2452 5385 5191 5783 3786 845
27905 845 882 4603 4076 -2349 -4201 4539 8702 1723 1212 2232 6010 10751 7386 8295 4919 7739
27889 7739 5632 2896 5443 3999 4134 3126 -4152 -11347 -2170 5818 -3814 -3428 -1582 2707 6933
27874 6933 4599 1375 -3251 1742 3237 3434 5832 5446 7674 -1685 -10456 -7818 -8362 -3842 6882
27859 6882 10386 4562 -2381 -1440 275 4819 256 -4345 511 9189 19729 22277 9481 761
27845 761 1602 10923 10634 19379 20524 12643 10646 8171 12654 11899 10218 6151 3280 -549 1731 6283
27829 6283 7459 6490 2607 6721 7223 9947 16273 14501 3331 -3308 -3354 -6561 -996 2092 3183
27814 3183 12233 20973 24829 19212 6986 -1488 -2222 -6793 -5364 -11786 -9737 -1152 6092 13939 15067
27799 15067 13890 15987 7272 -230 836 3625 -5087 -13300 -9243 -120 2598 8442 7326 2718
27785 2718 3671 7378 10229 11676 13826 11876 14998 9950 -1225 -5769 -4617 -4157 -4442 847 6874
27770 6874 4897 614 -3220 798 152 -994 2543 4435 -989 1727 3445 2119 3219 6089 6889
27755 6889 -1064 -6055 -6389 1297 242 -5419 -8047 -8893 25 2188 1416 9617 13245 3455 -5672
27740 -5672 -3751 -3827 -2686 -7144 -4966 2781 10505 7086 4262 9672 4490 -1128 -2066 835 -3234
27725 -3234 -8389 -4582 -3656 3518 8309 9275 7877 -3890 -2032 2432 1069 2920 4581 3149 9717
27710 9717 10553 9709 15308 13425 10565 5388 8650 14458 12643 6759 671 1263 4428 -859 2379
27695 2379 2874 2619 -2216 -4607 -12224 -12163 -9154 -8712 -6152 1579 16993 18048 8610 12746 8592 -9231
27679 -9231 -9497 -1093 2693 -3313 -3276 -1177 -205 -615 -1586 -5028 -1021 3469 4191 1968 -1499 3780
27663 3780 12023 10736 2818 8368 6704 -248 -11393 -10875 -11241 -13852 -13384 -3147 -1762 2094 3982
27648 3982 -710 -991 4911 2136 143 -1095 -1132 -2500 -10136 -11750 -4350 8838 9383 7281 12702
27633 12702 9599 6719 15005 18851 8470 231 -5617 -1303 8934 10023 9503 7109 3222 -3133
27619 -3133 -1006 4069 -274 230 -1162 -5125 -734 6781 1597 -6666 -4684 -3071 7783 10449 6436
27604 6436 4013 4315 1358 2915 5474 5511 1639 -11100 -15501 -7142 3951 4258 -1604 -4205 -2625
27589 -2625 -4023 -2937 -595 -482 -5546 -1854 1510 -2145 -3811 2547 2460 -1951 -10134 -6258 -331
27574 -331 -2732 -629 -2318 -3351 -1268 6076 9064 11756 13228 8052 8786 1911 2244 -867 2521
27559 2521 6014 12277 -488 -9112 -8724 -4854 -5853 -7880 -5667 -273 -2851 1645 11225 10815 3172
27544 3172 1187 1649 1064 -1048 -6360 -10895 -3649 2843 3264 8777 12197 14601 12103 699 4277
27529 4277 4521 5184 10222 10074 1815 -7312 -6749 -3488 -10735 -17227 -15295 -11718 -5427 -5519 2839 7288
27513 7288 7703 131 -1574 -6142 -11558 1409 1903 2004 1341 -148 3037 7512 3429 2620 2624 6916
27497 6916 6978 6989 9788 8823 11000 9222 -2522 -6879 -9263 -11323 -7924 -10655 -14436 -16604 -13847 -11069
27481 -11069 -8903 -3900 -3759 -11870 -9842 -3187 -21 -1035 -1180 -4072 -6607 -1800 2859 902 -3413
27466 -3413 -5147 3118 10600 13232 9037 4144 7141 7690 7352 3313 2268 6582 1762 -2882 -4199
27451 -4199 -6139 -1248 2066 6766 11712 6448 5363 9160 4580 5862 2622 -230 -2251 -4134 10
27436 10 -627 2541 7772 7171 5448 1381 -2191 -1891 -202 994 -1051 -1006 3315 -7208 -5365 -300
27420 -300 6715 3918 4882 7472 6643 9799 4309 -5159 -6008 -5607 -2641 -4740 -1729 -1458 -7495 -3723
27404 -3723 2040 1417 3340 -211 267 -3603 -8236 -9745 -11909 -7026 -3174 -5864 -6291 -5377 -9821 -6375
27388 -6375 -7958 -7150 -3114 -2113 -3648 -1984 -10531 -13328 -9378 -11956 -11326 -2618 3106 -444 -2283
27373 -2283 -8891 -6940 486 -1948 67 11015 8410 5102 5614 1414 -2990 697 8887 6597 3069
27358 3069 3505 8171 7901 4536 6801 13254 15987 15034 18023 11811 4118 2233 5379 2872 -1004
27343 -1004 1059 2336 7631 17332 15980 3106 -9585 -4906 -3980 -6976 -7353 -4630 -4315 -1548 10851
27328 10851 4331 -3985 -1135 2184 3573 -7333 -17958 -11062 560 7844 10082 222 3438 2799
27314 2799 -558 -7468 -9515 -9904 -5999 1046 -1412 -744 -1676 -3084 -7312 -11237 -13091 -12387 -1481
27299 -1481 -1288 364 2363 389 -5471 -4245 -5466 -6496 -2924 7490 11054 8006 -6894 -15930
27285 -15930 -20225 -18353 -8605 -2197 -5384 -7932 -9012 -10675 -11402 -11262 -4958 1795 4504 4656 -3350
27270 -3350 -12986 -4920 -5212 -6654 -5182 -2339 -4959 -8043 -10046 -11250 -13057 -8627 -8464 -5784 -494
27255 -494 6493 5548 8796 5950 -192 -3597 -7730 130 8633 5067 531 -4572 -8320 -3734 -1429
27240 -1429 -3556 1639 6715 10993 13893 2027 -11602 -7848 4226 18086 21210 13776 16037 19100
27226 19100 13613 6224 -2264 180 1274 9907 12806 13868 6330 -1698 -6525 -9020 -6436 -6662 -4699
27211 -4699 -9811 -4275 11 2603 1501 -895 1217 2236 -167 6823 8799 13645 11552 4420 2343
27196 2343 4808 3482 4087 2849 -3314 -4039 -1196 -3005 -4680 -432 -1186 -6470 -10444 -6704 -572
27181 -572 3029 612 4726 106 -4150 -1500 -5162 -7582 -7176 756 5297 5734 3269 6397 9001
27166 9001 3697 338 7761 6439 4694 6183 10551 10093 11032 5688 -4255 -10830 -10663 -7427 5601
27151 5601 13650 18437 20778 11996 4734 4897 2543 10112 10940 11548 9632 1889 5117 6922 4983
27136 4983 4733 3255 -491 -6546 -10893 -1159 11982 7579 4945 3196 -3258 -1482 6970 6212 6077
27121 6077 -1278 64 9476 9720 366 440 -3375 1820 867 -2426 154 -4985 -3884 190 3101 5445
27105 5445 1456 4372 2869 -3788 -5392 -5571 -7206 -34 -379 10950 12718 11089 7769 3406 1202
27090 1202 4681 4528 -386 4063 963 3559 6129 8997 2569 -2318 -4929 -9099 -3411 -989 88
27075 88 1407 -1035 1404 -515 -4741 -9739 -10970 -10740 -11199 -10429 -4028 -7556 -9750 -11847 -14110 -9317
27059 -9317 -7382 -2205 -3727 2340 1563 -7229 -17128 -13229 -9063 -11057 -14618 -15113 -7387 -6007 -5479
27044 -5479 -9709 -15880 -15008 -5361 3004 14546 14757 12818 17242 12139 11095 15866 9662 3074 9208
27029 9208 6263 1357 -1080 -4447 -4179 8406 12355 8718 -1673 -3930 -5761 -4930 -721 3976 5374
27014 5374 750 -4768 -5075 447 -2073 -1328 94 3992 4168 -2966 -6425 1505 12036 15522 10699
26999 10699 6240 2446 5131 7720 8625 9584 797 -6759 -8557 -6643 -4056 3782 6737 5088 1150
26984 1150 -6555 -6019 -5030 -9983 -4914 -796 8752 2532 -1944 -3591 -1013 5 -21 619 1443 10758
26968 10758 8128 -1488 -9016 -7362 -510 1593 3526 9524 11269 11916 4115 7510 2054 8579 9307
26953 9307 3446 909 4509 12954 24096 20945 9207 -70 2643 12602 15683 5270 -5892 -6826
26939 -6826 -3064 5289 7393 4445 7822 7615 3129 -2769 3393 12397 15173 13233 9566 11550 10530
26924 10530 9877 9792 8175 4891 -2544 3109 11068 12995 8969 2183 8490 11657 6328 -4287 -3579
26909 -3579 -2305 -1697 -1461 -1578 -3661 -4267 -946 -614 -174 -5226 -4730 -11381 -14612 -8575 1520 5917
26893 5917 2057 -6689 -7347 -6975 2958 5435 8447 13613 17423 18210 9200 2623 -2249 -5316 -716
26878 -716 -5106 -10889 -7096 -7635 -16127 -10414 -356 11124 16387 22159 11366 4227 7245 6946 38
26863 38 -3210 -801 3521 3847 -2122 -3094 -881 855 -1194 -4717 -2221 2254 1734 -10694 -6179 -2761
26847 -2761 -1996 3914 3020 4289 11954 17953 9598 3940 550 -4627 -5814 -5925 -3557 -9776 -5857
26832 -5857 1282 -98 -3810 -227 4438 5042 2860 -316 -3644 -6050 -7305 1461 6995 11085 17704
26817 17704 16942 15937 12481 8852 9188 9102 3448 4110 10113 10699 5802 1999 -1974 -9138 -7136 -1498
26801 -1498 -3295 -2742 -1681 -5994 -6716 -3533 -6375 -1410 7027 12708 7731 7417 5938 -480 -10053
26786 -10053 -9503 -10073 -13103 -8880 -4857 -4252 -2323 9368 10335 12137 9619 6904 3854 -323 3383
26771 3383 7758 3903 2868 -2360 -606 -7977 -10206 -13995 -17228 -15596 -6966 1582 2652 -5413 -3486
26756 -3486 -1662 -3509 -683 6889 6399 -707 -3994 -3425 -6706 -4796 -8735 -14735 -16369 -20589 -17525
26741 -17525 -6474 -453 3478 582 -3288 -8791 -12619 -12753 -10651 -1631 7105 8014 2545 1850 4456
26726 4456 10154 3940 8692 13333 8036 2468 3432 5629 7336 4995 5380 113 -1486 -2487 -1993
26711 -1993 5457 10723 15661 18747 18455 13681 13214 10642 2777 -530 -4836 -6641 -10557 -3360 897
26696 897 1377 -6417 -8958 -3044 -2199 -5468 -10856 -10408 -11412 -9721 -4180 -6043 -10704 -11630 -8199 -7858
26680 -7858 -7483 -9352 -5674 604 5464 1332 -478 -1078 -11472 -17843 -9736 567 -4775 -10959 -2829
26665 -2829 -2055 4791 8454 8059 3476 -4455 -5523 6851 5564 -780 -5146 -4503 1538 8594 5987
26650 5987 -304 -5583 -7035 -4427 -2333 1510 2048 2792 4831 2441 2345 1687 3325 4849 11659 14754
26634 14754 12820 6557 3643 -3450 -4879 -4131 2534 6672 6633 7361 6900 5836 6868 5550 -170 -4454
26618 -4454 594 -5028 -5548 -4393 -407 10644 14792 10736 6587 3069 707 5814 12672 11411 5056
26603 5056 -3693 -9531 -1717 8135 11990 7929 3455 -2318 3535 11555 5282 4310 4703 2600 4928
26588 4928 9811 7559 -2433 -7405 -14784 -11727 -7013 -2492 3368 6490 3375 -4878 -7988 -6793 6561
26573 6561 7086 7319 7089 3948 3748 3733 9526 6646 7773 5968 9787 6848 7536 11720 9349 1497
26557 1497 -5648 -3988 -1807 -3726 -7084 -1824 -1370 -1672 1742 4736 8324 13952 10025 3009 4859
26542 4859 4236 3233 5829 2810 2289 3212 9477 9188 1910 3087 1417 -1961 -3470 -4229 -4935 -11788
26526 -11788 -12066 -12489 -9711 -7312 -7579 -5695 -188 2891 -5563 -12053 -7715 -4482 -7170 -4572 1381
26511 1381 12564 23930 21796 18725 14207 12130 10670 12748 12052 6641 1937 -2642 -1875 -3379 -4644
26496 -4644 -8289 -5376 -1991 3072 1576 5198 8149 9616 8256 2659 -1492 2062 -5779 -9006 -6362
26481 -6362 -7104 1090 2967 2087 9103 12226 4375 -3534 -5751 3242 5657 -3309 -8668 -5939 -4765
26466 -4765 -6935 -2587 -302 6675 -438 -7529 -7340 177 4888 10828 6460 7494 12264 8776 3368
26451 3368 5484 4279 1663 6007 9042 8606 4860 -5260 -8630 -4457 -7661 -13437 -13761 -12247 -6150
26436 -6150 -8652 -1598 8580 10654 7200 7738 305 -6683 -7752 685 7722 6820 -243 1621 7673
26421 7673 10385 9673 12443 15484 2278 -1288 -1498 1754 9529 16307 18595 19772 7775 498 4427
26406 4427 14386 8033 284 -4412 -5502 -6162 -7431 -11586 -10222 -534 7359 9377 3896 41 -4214
26391 -4214 5197 4390 2094 4059 2955 -402 -2400 -2102 -1159 -3915 -2190 3428 2124 -5495 -13448
26376 -13448 -18780 -20133 -14717 -10010 -4682 1008 -959 -6519 -9086 -1243 131 -3268 -797 -6619
26362 -6619 -10787 -7194 -6689 -9679 -5615 3104 2160 -3747 -248 7032 3542 -1565 -7048 -1994 2866
26347 2866 2457 -1125 -7310 -8864 -2460 873 7350 5890 -2416 3995 4128 1888 2076 4724 13426
26332 13426 14116 13131 12992 -1711 -5355 -3947 2426 12827 14695 4602 -837 -4389 -3730 611 -2601
26317 -2601 -9192 -4238 -5102 -5982 1239 389 -6694 -5700 4311 2719 5880 6874 5274 4229 1818 -713
26301 -713 8300 10960 6636 11086 8109 5679 8997 6473 1924 -3319 -3492 -3304 161 544 -2619 3033
26285 3033 5969 1361 -2637 -7011 -13483 -11221 2299 7849 3810 4080 8064 16231 9786 4111 -178
26270 -178 253 578 -7608 -4100 -9178 -11074 -6176 -2258 2525 3712 1749 -1287 249 -243 -3337 -4022
26254 -4022 -5286 140 -3240 2182 3179 -2601 -6437 -11496 -13180 -10315 -6423 -2618 4686 5120 3149
26239 3149 1677 -3014 778 4588 9440 12518 8898 3090 4362 3648 9911 14602 12772 11872 9553
26224 9553 2140 349 1174 -5630 -8053 -3386 6131 6207 7162 7162 -182 -3364 -430 -3742 -7463 -3801
26208 -3801 -6320 -8340 5005 8442 10816 12523 5173 2061 -5043 -1616 2329 12781 15865 12487
26194 12487 3095 1388 -4489 -7275 -5323 -3335 -1170 -2545 -960 -5880 -3508 1709 2980 3417 3181
26179 3181 -2069 3495 7208 299 -2836 3777 6668 7945 8222 -2488 -2529 524 -4935 -8450 -4786
26164 -4786 -4662 -3449 -950 2134 -477 -3439 -1288 -1258 -6365 -10822 -12856 -8077 -812 -1054 401 10586
26148 10586 3927 77 -10131 -14598 -4374 5056 11459 14219 10898 6956 3729 -3905 -4845 -703
26134 -703 -1298 -2783 2116 3857 -1992 -1762 -5207 -3658 7814 9598 7270 -444 -5711 -8868 -8424
26119 -8424 -4337 -6005 -918 4124 6678 7242 6601 1953 -2327 -7578 -6245 -5117 1440 5914 -537
26104 -537 -4042 -7257 -11243 -12092 -12215 -17009 -19918 -14101 -6860 -3102 -7726 -6462 -1420 -878 -1020 -1922
26088 -1922 -3237 -1302 5735 5717 995 -4826 -2111 -72 111 -616 3083 7140 11841 7125 5541 3468
26072 3468 -2167 -3750 -93 6523 7990 6020 738 5296 3818 2986 517 12567 14510 9597 8120
26057 8120 5065 8305 4466 4854 6944 8394 5808 -1387 -5201 -4538 -4636 -267 1847 -784 -3365 -5071
26041 -5071 -5967 -13308 -19495 -15602 -7535 -724 1926 -2330 -4702 -10272 -12990 -5692 -3179 -4519 -11157
26026 -11157 -11842 -1899 -871 -617 -4896 -6141 1480 1769 -4073 -2885 -8676 -9079 -4498 -8207 -8287 -5615
26010 -5615 -2560 775 -1392 -2871 -664 7317 13706 10661 10804 15717 10702 4755 6388 9551 12067
25995 12067 12650 11410 3825 -3873 2753 6301 4867 8131 11008 8406 6296 1606 991 1575 -1233
25980 -1233 -12097 -13534 -2759 -1029 -8686 789 5086 -132 2984 3333 4173 7356 6291 11679 6259
25965 6259 -1109 -2144 -3887 -4428 -4196 -6815 -1723 6017 10367 8769 738 3241 -6586 -5753 -5946 -6506
25949 -6506 -5087 -7075 -10609 -7003 -398 1409 825 -2200 -4767 -6734 -9333 -7288 -7837 -9099 -674
25934 -674 -813 -2783 -2177 -160 -3591 -2909 -2749 -1027 -2264 -5556 -1381 1310 -7043 -9237 -8858 -7063
25918 -7063 -2643 8165 14044 6772 421 -548 -2859 3302 -2935 -8665 -6035 -3973 -4039 -5945 -5069
25903 -5069 -5777 -1674 1959 -389 2043 5339 2662 -4578 -4610 1620 6872 11415 7625 3069 6028
25888 6028 12462 12381 9572 3008 -1627 3215 7917 17173 18130 3144 -2084 -655 291 -1378 -5199
25873 -5199 -5510 -3604 236 -1821 -1508 6484 12674 15949 7147 4786 11315 13887 12463 9211 15049
25858 15049 11109 8212 3313 -1468 -818 -4181 -8926 -9240 -1059 3408 -534 550 3722 8279 12554
25843 12554 6636 6957 16913 24362 25807 16965 11960 9240 -718 -1075 187 -3962 -7044 -13009 -12828
25828 -12828 -9597 353 3105 2980 1369 705 631 5726 3390 -3479 -918 6463 9 -4225 -276
25813 -276 1729 -3977 -3397 -611 4432 3977 8448 16907 16834 10999 9088 12794 11593 -232 -2385 1025
25797 1025 4600 7225 3300 845 8722 8795 3086 7755 9872 10086 2954 7266 8408 9149 1887 -4361
25781 -4361 -155 8931 9438 7205 13620 11710 8022 6667 14210 13809 2534 2676 11546 5712 -2750
25766 -2750 -7464 -4669 -2817 1088 3517 7411 2937 4528 8750 11980 12694 2932 -5014 -3796 -4379
25751 -4379 2461 3822 2878 -3205 -3614 -5916 1695 5852 5790 376 -5686 -10209 -5083 2216 691 6961
25735 6961 7834 2810 -3639 645 -3189 -1664 -6769 -8286 -4680 -2414 -1006 -2136 1201 7306 3820
25720 3820 449 -158 -2630 2119 2997 1330 74 -3497 -7663 -10249 -8626 -1861 -1520 3436 5635
25705 5635 6376 2702 3580 333 6977 10293 11429 5583 5067 -1468 -5413 3987 5305 1614 5609
25690 5609 9667 8389 945 -528 -638 -4598 -8127 -7813 -6057 -8468 -10 6458 1809 7011 6079
25675 6079 3169 3684 282 -5658 -11241 -10075 -8543 -3538 3856 10309 8764 9747 11677 10298 14055
25660 14055 16579 7448 -510 -608 -3834 -4365 -2096 1426 3373 3254 7924 18738 13113 6944 -1354
25645 -1354 -1703 -990 -1177 -6143 -2398 111 -4760 -12458 -19709 -3422 7320 5068 3034 54 -7172
25630 -7172 -7248 -2490 29 -561 -4295 1265 -135 2063 6544 2559 -2719 -5973 -7238 5626 -4466
25615 -4466 -15673 -13560 -7102 -4488 -3184 920 3620 7338 1992 -1818 -2781 -1417 -1698 -7377 -9133
25600 -9133 -4290 3882 6813 6552 5404 786 7874 8994 6749 5212 3148 -314 7848 10606 10500
25585 10500 13087 13056 5850 -2973 -2390 -4436 -2150 7006 8075 14477 16920 16531 9998 5164 4248 10949
25569 10949 12190 9092 6836 1353 -90 -2508 -4016 -4498 -445 4986 10233 6617 -3096 -8425 -4193
25554 -4193 -5615 -9350 -10892 -14574 -18547 -14687 216 246 6242 6825 1959 -2922 -12001 -10586 -1523
25539 -1523 2166 -5565 -8335 -895 -5337 -7363 -11107 -11802 -11646 -11317 -11168 1230 7449 2422 2008 -396
25523 -396 -268 -5955 -3068 -4689 -3584 -722 6213 7027 2119 5208 2648 3703 1871 -4168 -199
25508 -199 2413 5594 4757 570 -2083 -4922 -6458 -7364 -2569 -2603 -6031 -7638 -3043 4074 8612 7683
25492 7683 5776 9612 12489 5069 1359 3964 4505 6856 4098 8382 9010 10917 13869 7475 9669
25477 9669 5284 1349 2298 -3056 4113 -4048 -11407 -5536 701 9127 6962 1318 3095 3967 -82
25462 -82 4696 7304 -889 -12360 -10610 -1948 -3033 -6457 -7379 -4949 -469 -1032 -2057 -3055 -7196 -4563
25446 -4563 -3106 -7025 -3873 4363 11523 2140 -756 -5292 -2623 2849 3094 -57 -5263 -7068 -7923
25431 -7923 -5942 259 1202 2920 4869 165 3527 5211 4548 2871 1181 -2645 -10211 -6604 -4215
25416 -4215 -6338 -3642 -677 -6185 -3598 -919 -1193 394 -3367 -6170 -3669 -3721 -9908 -7944 -5436
25401 -5436 506 -5757 -11876 -18540 -10300 -5496 -2177 1353 -948 -7655 -10379 -11413 -14352 -9487 -8875
25386 -8875 -9109 -9917 -10069 -1635 -171 -3957 -3377 480 6100 2726 1297 2278 -4543 -2255 1045 3139
25370 3139 6960 9486 8591 4831 1773 7729 13403 6782 14222 13362 12284 14108 16089 12468 16304
25355 16304 12606 11613 7709 4013 811 -7223 -6251 2572 11192 11699 14915 12774 3729 4028 -2968
25340 -2968 -3453 -688 6566 4409 6497 7574 4780 10969 12522 11544 7222 8325 7595 2823 -3368
25325 -3368 -3282 5394 11214 16015 16945 11925 15903 11855 9017 8996 4211 8203 3906 1557 8592 9723
25309 9723 14502 8682 8871 5120 4039 11792 8854 6502 1803 3148 -9650 -18115 -21940 -16446 -12369
25294 -12369 -8769 -1447 6886 9436 12344 14490 12882 11283 13051 6669 709 6720 8272 6370
25280 6370 7896 3147 455 5901 11653 12469 7855 7882 12069 9875 3704 -4564 -5042 -3481 -2502 -4682
25264 -4682 -3513 -687 3609 3602 -1737 -1859 1744 377 2499 874 -61 -4603 -1876 -1563 2468 613
25248 613 -2150 7311 7324 4212 4450 10794 7242 7075 -601 -780 -541 2223 2061 -1264 -2492 -10072 -17701
25231 -17701 -21245 -19429 -14157 -6830 -3852 -4812 -2495 -3764 -4665 -6899 -8811 -1913 8609 11526 9146
25216 9146 500 -3704 -771 7148 6287 -1846 3963 279 -2424 -4460 2545 2350 -5223 -15864 -21285
25201 -21285 -14743 -6159 -7784 -5410 -1252 -2471 4277 5307 -195 -2343 -4355 -10778 -17233 -17721 -18799
25186 -18799 -14129 -12035 -12201 -14285 -10517 -4890 -2565 6656 15090 21261 15594 8821 9670 11707 5714
25171 5714 6334 11997 9000 9163 15149 14438 5946 -2931 -1640 -5206 -4985 -416 -2970 -8155 -10438 -6735
25155 -6735 -7421 -5435 -6226 -2443 2314 3402 10563 20583 11282 1508 4434 7276 2023 554 9644
25140 9644 15046 12775 12999 5557 -3310 -7910 -1712 9013 7453 864 1065 -2914 -9468 -11349 -5964
25125 -5964 2379 429 -9415 -12500 -9044 -11700 -10715 -3431 -1713 926 -4925 -3176 9053 8819 6892
25110 6892 6436 5252 4140 -1701 -4023 1197 8048 12780 10075 333 -8308 -12780 -17105 -12882 -2910
25095 -2910 4803 1112 -7379 -14550 -13877 -10637 -6044 -2053 3283 9393 9206 3483 2696 -1354 436
25080 436 186 1884 333 793 1877 1437 -1843 -258 694 -7743 -12961 -10991 -9055 -10484 -3354 368
25064 368 1821 4557 -4401 -7613 -2657 3402 5804 10006 14581 14138 7881 5693 2178 906 4419
25049 4419 -3695 -9375 -2822 5334 9576 11382 10593 8344 9865 7235 13945 15730 14202 14804 17264
25034 17264 13991 10481 4911 3835 1172 -3424 -6938 -3355 -5263 -2098 6933 15130 15783 11348 4340
25019 4340 -114 4248 498 -5288 898 3594 4666 1635 -2885 -3811 -209 -6205 -3742 -3716 -3563 -1320
25003 -1320 4662 8808 5480 -857 216 -429 -3945 -704 8200 7533 -2918 -2663 1023 -3074 -786
24988 -786 1379 -8099 -2911 4433 3132 6062 7331 9280 5450 1253 -274 1424 2186 8664 9497
24973 9497 -8766 -17555 -12691 -7489 -4217 3497 8810 4047 6238 3571 -2638 2090 4487 8411
24959 8411 10274 7721 342 1870 7318 9779 9502 4453 2529 4451 2681 2369 -4335 -1587 158
24944 158 2586 672 -5225 -10026 -8653 -17641 -19834 -17092 -15925 -9229 -242 1479 4138 4689 -2626
24929 -2626 -7150 -2026 -986 -861 -6221 -6803 -6459 -5973 -6795 -7339 -7614 -4072 1207 3976 -1577 -2931
24913 -2931 483 213 297 -9210 -12788 -10300 -5824 -4270 -1232 -859 -15911 -7874 1266 32 922 3452
24897 3452 6968 9208 12372 14224 5122 3447 -1398 -6332 -6397 -6217 -3531 -11061 -18732 -12879 -6663
24882 -6663 8424 24649 21270 16801 17503 18897 15649 6626 -826 -5569 -4481 -6841 4976 6918
24868 6918 5124 4589 1928 -6309 -10896 -8820 -3868 1952 596 -5647 -7828 -5521 -4908 -411 2879
24853 2879 -323 -4260 -9385 -5896 -2761 -3935 2621 -1583 -1147 -7373 4463 3315 -6776 -6636 -3102
24838 -3102 4682 9653 5191 2563 1676 4401 5867 905 -2398 -4592 -8410 -8199 1614 13558 7519
24823 7519 797 -3622 -6743 -1806 -1776 -8934 -13387 -10836 -6664 -2386 4259 8164 6458 4577 2137
24808 2137 5034 10845 5357 -5747 -8129 -10719 -4395 4110 2675 2063 4599 7538 11899 7113 5688
24793 5688 17610 22468 13144 -341 -12614 -4552 4927 10792 11281 1589 -304 962 -4604 -1029
24779 -1029 7112 9478 6613 4589 740 4204 4479 4962 12707 9719 3731 4894 853 5995 9653
24764 9653 3778 3737 8694 6635 4359 3725 -2 4703 4067 -1945 -4644 -1236 -2234 2038 6919 5494
24748 5494 4177 9296 10555 8834 6243 4721 8030 11721 6052 6145 5827 3654 27 -740 3147 9454
24732 9454 11191 5067 6032 4246 -1016 -5020 -8333 -431 5811 3774 -3919 -1011 1786 4899 2904
24717 2904 7323 4141 1292 6300 6573 -1542 -4785 -6029 -2447 -1711 1081 2145 -5490 -7181 -5463
24702 -5463 -4628 -3501 -1561 1185 2440 7425 7636 10138 10647 15239 17059 12421 7345 9230 7388
24687 7388 -6971 -11723 -15184 -12894 -14082 -13221 -8181 -7790 -8969 -3170 3249 1383 -3797 -6371 4987
24672 4987 4570 2563 11005 16828 29189 26008 16266 11962 15843 11252 2713 587 2094 6728 5369
24657 5369 4873 10726 7396 -533 -6421 -2828 1411 -869 -2294 -3354 41 4591 2588 -1635 -4794
24642 -4794 -12056 -7588 2809 3214 2413 -2214 -6654 -11651 -5149 2601 1997 310 4302 -1245 -7320
24627 -7320 -8082 -6762 -4194 4014 8515 7806 7072 7872 9790 3033 -2599 591 4869 2810 9150 9927
24611 9927 8045 4576 3727 1972 -5884 2050 8470 2370 2065 -1780 -491 -1399 -199 -1813 -10139
24596 -10139 -18576 -16240 -11857 -7033 -5909 -8793 -12714 -950 2498 2559 8027 5193 60 6820 7234
24581 7234 -1909 -2263 -4247 -11950 -12925 -9681 1360 5048 3453 9127 13763 15053 13789 11807 13704
24566 13704 11294 -43 -72 2683 8633 11902 4435 -1411 -5038 -3104 882 6048 10754 5547 -2881
24551 -2881 -1732 2766 -948 -2351 -2058 -2791 1430 -217 -7778 -14844 -16377 -13053 -6292 4453 -3609
24536 -3609 -5599 -1855 -5504 -17180 -17548 -15444 -4803 -4909 -4631 -6835 -4027 1709 807 -3407 -4814
24521 -4814 -1832 -12 -844 1872 8720 16216 18307 12964 5081 -4444 -9100 -17949 -17178 -13552 -9373
24506 -9373 -319 -1300 -7363 -14232 -15072 -7368 -1039 6926 8891 8462 13792 1999 -6193 -7034 -1392
24491 -1392 5991 3347 3172 1347 1360 2184 -6506 -3327 8745 9678 5648 245 529 -1798 -13203 -13309
24475 -13309 -5403 -2707 -3443 -547 916 601 845 -3504 -5300 -4438 284 11646 10512 4157 5454
24460 5454 -3176 -3948 -6698 -8911 -12623 -12696 -3660 1461 827 1233 -4292 -3788 2363 3886 3696 12068
24444 12068 12114 9130 3858 -188 -1494 -1585 1506 -1262 -7385 -3792 4139 2625 4703 9747 14016
24429 14016 19080 21809 23739 20903 11535 3095 378 -1952 2416 3090 3977 10470 2624 -2736 -51
24414 -51 640 1506 -4957 -5914 -11540 -10946 -2866 8780 12867 19068 29308 27268 13563 3352 -3336
24399 -3336 -443 -3601 -589 4748 13169 16220 11909 929 -10259 -9290 -4421 269 6487 11245
24385 11245 6638 2048 -450 -7976 -10422 -5745 2402 4427 4315 2473 -3063 -10835 -6495 50 728
24370 728 -79 377 2676 -3655 -6855 -4718 -7698 -6770 -6276 -1502 -5120 -2646 -7229 -9495 -6662 -4675
24354 -4675 -3418 -4732 -2792 -1537 -7150 -13316 -7039 -2956 4082 2891 -6748 -13285 -14854 -13359 -3082
24339 -3082 3214 759 -5686 -16376 -16924 -17733 -14131 -3923 -2977 -5735 -3820 121 2297 -2604 -6677
24324 -6677 -2366 -9171 -7771 -2623 -7215 -9843 5128 5132 -726 5124 7218 2905 -3119 -18914 -27965
24309 -27965 -33269 -29793 -28914 -25681 -12949 -5211 7507 13383 14812 9007 11966 8666 939 -1941
24295 -1941 -1587 14761 18095 11798 11455 9878 10086 7689 10322 17508 28778 25358 10240 -4730
24281 -4730 -7730 -4945 1904 14752 16621 19194 11861 6881 6047 16657 23491 34267 29764 14824
24267 14824 5519 1031 1617 4919 15537 29431 30124 25146 26561 36231 41009 38561 23267 13605
24253 13605 13559 16699 20312 19341 24290 23333 6948 -4944 -9685 -6787 -4634 5423 8025 14625 16110
24238 16110 6501 297 1829 1577 18841 43640 72010 95487 107886 119651 119770 104022 72979
24225 72979 38894 6528 -28124 -50498 -58416 -47967 -29994 -9680 2900 6426 1403 -6930
24213 -6930 -3588 -3380 5180 7044 5035 -452 -12890 -21480 -21827 -25041 -14595 -7316 -8098 -13553 -16522
24198 -16522 -24737 -27366 -21320 -7205 -1445 441 -5067 -13419 -23391 -26044 -21365 -6350 5129 7086
24184 7086 2850 -8682 -26718 -22687 -11153 735 14139 15142 18303 23566 20071 9857 13145
24171 13145 12541 13944 15568 13108 13765 12559 7434 9012 19170 8294 -1063 -4234 -10096 -11312
24157 -11312 -12503 -15772 -16512 -7951 2106 8325 11461 20059 15262 9435 5359 3099 925 3325
24143 3325 -652 -2975 -12785 -15698 -9557 -4915 444 4972 10739 11266 11488 11213 5656 2150 5277
24128 5277 8614 16699 21301 15026 2411 -2615 330 5481 9031 8238 5059 3179 -1985 -7072 -5176
24113 -5176 6721 8395 18105 9844 -9099 -13261 -12811 -10445 1123 6816 8580 5705 2529 3100
24099 3100 -2646 -8377 -14257 -6583 7050 10159 6475 3665 -1521 -12426 -12822 -3607 3214 284
24085 284 -5103 -3346 -5116 -1841 -3129 937 -1713 -11085 -17520 -21123 -20129 -14411 -2022 8255 9082
24070 9082 4892 153 -9108 -9486 -8936 -11831 -12345 -3554 5814 4763 1 -2219 -8705 -2338 7677
24055 7677 2692 4690 3728 173 -7575 -1679 6693 13535 16449 15667 10249 14856 8280 5183 5528
24040 5528 4969 7546 4702 -1944 -7361 -6480 -13644 -15561 1636 4459 35 -3342 -3438 6016 2444
24025 2444 -2360 1172 5989 10175 8965 2361 -2901 -1271 2547 6193 9115 11596 3947 -2682 -2904
24010 -2904 1131 7041 3231 4886 6497 2515 -8793 -6083 2181 5168 642 -236 3082 5229 8443
23995 8443 7607 -3524 -8386 -14900 -14567 -13590 -6706 1504 9132 14302 16868 18348 18156 25416 24662 12763
23979 12763 3555 9538 9132 3757 4476 -7769 -7239 -3822 -1116 -2136 -4771 -2738 713 887 9064
23964 9064 8265 8362 2951 3446 7810 3104 -18 -2566 -19 -1414 5141 9901 6978 7912 12750 13231
23948 13231 10889 9876 13094 7429 1389 -1580 -739 -621 293 -2207 -7357 -3749 3691 6190 11633
23933 11633 14657 4052 -4379 -6269 -3537 -4848 -10200 -15894 -20458 -23004 -16616 -20284 -14105 -8669
23919 -8669 -5340 -10518 -15811 -18065 -11236 -6187 -4692 -5017 -7001 -5887 -8278 -17295 -17850 -15929 -6832
23904 -6832 9 2004 2733 -3728 -8285 -9618 -9588 -7684 -7047 -11471 -10033 -10363 -11576 -7192 -11011 -9553
23888 -9553 -10532 -15486 -14809 -5193 -937 3685 -5257 -4549 -1187 898 -3947 -8205 -9612 -11751 -16655
23873 -16655 -14230 -9759 -11784 -9536 -2548 1679 8390 11993 19161 14314 9286 5615 -4816 -2652
23859 -2652 3856 4505 4071 3862 4390 4619 9804 13838 8047 9942 14494 14123 9297 6277 6532 13110
23843 13110 17148 10096 4471 806 3641 5207 6932 2881 3414 2851 -2307 -6488 -2999 423 -437
23828 -437 4676 4782 1090 -1864 4296 13716 9763 4693 4355 2174 6834 8873 3805 -509 -1395 -1962
23812 -1962 -5309 -8952 -9402 -3515 -836 1281 8284 11604 13809 18620 21979 14743 8469 606 -3832
23797 -3832 3061 5549 1720 -353 -5191 -9156 -3266 6151 8001 10390 15546 19475 13503 10935 5737
23782 5737 -4484 -6291 -8808 -9557 -9358 -814 5046 7454 5859 908 -4645 -13247 -8824 402 -1139
23767 -1139 -7641 -10997 -14941 -10751 -5390 -2283 -3869 2128 -2669 -1059 -5287 -8888 -10439 -8088 2486
23752 2486 10110 6905 -5652 -12614 -16029 -14663 -7770 -5993 -10823 -10170 -9199 -4209 -2868 -4823 -2954
23737 -2954 3268 5835 11137 10837 11948 8749 823 -5113 -924 2483 -1446 6144 5390 5261 11998
23722 11998 9488 4006 4204 -5676 -12796 -10414 -1503 5450 12139 14571 8269 1829 -3443 -331 3104
23707 3104 -647 1008 2067 7832 5961 9908 6168 1061 -378 -5520 -5199 -4471 646 6635 11997
23692 11997 13388 4356 6677 5224 2346 2439 2931 6816 15413 15037 16926 14183 7844 4462 396
23677 396 -1265 -5753 -364 919 -2490 -8755 -5635 -7410 -5041 4178 12538 11895 7730 6300 14288
23662 14288 19540 8521 -8524 -15325 -17029 -9095 -118 5368 8235 3799 2198 1276 6999 7649
23648 7649 -3148 -7152 -175 707 3176 4692 3506 -2618 165 -502 3151 6496 10077 8157 4945
23633 4945 2598 -3272 -9408 -7901 4778 7136 9513 13155 5060 1920 914 625 -2688 -2732 5266
23618 5266 9721 863 -9517 -5238 481 -670 -6368 -9869 -12393 -12639 -15659 -10783 -4853 1936 13228
23603 13228 23325 31016 16973 7342 593 -3565 2355 10494 11185 7553 11455 16532 14938 14058
23589 14058 12081 11189 5834 1063 -3087 3867 2832 -2740 -3658 -2839 -5928 -6944 -4114 -7147 -4799
23574 -4799 -2591 585 -438 -932 648 2978 -2008 -4074 -11690 -8140 -1797 7620 10366 8579 3518
23559 3518 7404 7582 406 8474 16156 11123 11569 12231 2818 315 -871 -4307 -6636 5438 11050
23544 11050 7601 166 10597 15309 12893 14235 13667 21233 15349 2002 -1282 -2540 -6544 -6488 -5233
23529 -5233 -5092 -2238 2540 2286 -3821 -4420 -889 -3447 -4859 -5727 3538 7590 1211 -4020 -7502 -11813
23513 -11813 -13317 -8341 -1898 -4577 -216 6258 7645 5474 7285 12689 14124 7998 -4536 -3553
23499 -3553 -7458 -2931 1544 -3991 -6842 -904 109 -13516 -13447 -8034 626 -106 2629 1674 3772
23484 3772 2943 -3383 -3243 1713 -1240 1835 3541 -1568 1365 -3896 -8352 -7613 -3789 -5418 -7101
23469 -7101 -3571 3435 3232 3776 8804 10091 6165 4280 1381 1097 4504 4511 6373 10244 6542 807
23453 807 -1739 -15374 -11067 -3478 -3394 -15539 -19943 -16572 -7081 -4023 611 5944 9320 766 -4400
23438 -4400 -3337 -12170 -11925 -5863 -5552 -5905 -7489 -13018 -20435 -13823 1424 6969 6398 4461 620
23423 620 535 5612 6558 -4792 -8992 -4697 3157 9411 10831 10563 8880 5729 3301 -2260 -5706 1273
23407 1273 6007 -554 -6010 -5053 -5079 8031 2107 5359 14195 15657 8916 6135 6843 6957 4983 2849
23391 2849 14462 18111 15783 11077 4447 -4449 -3776 -3062 361 430 -431 1317 424 1681 6328 6317
23375 6317 -2805 -2978 -1033 -4035 -418 2212 7428 14649 14568 10756 7745 -969 -6465 -3148 -4998
23360 -4998 -12034 -6098 -352 3573 6657 3059 2197 7082 11267 5414 7018 314 -1233 458 2411
23345 2411 4508 4053 4681 4540 5892 5070 -466 1881 178 -5212 -2659 2706 10528 9544 2340 5684
23329 5684 1330 -386 211 730 8941 11073 -3413 -8160 -9817 -12088 -15950 -10198 1992 7564 10365
23314 10365 4590 5056 5960 4130 3351 -590 -547 4826 4182 -487 -9206 -6390 -1609 -3598 -4076 -1949
23298 -1949 -4542 -1410 -4031 -1055 2060 7191 13102 7115 -4439 -5449 -10999 -5181 -1629 11
23284 11 3351 984 -9823 -7541 1408 3601 -1510 -7746 -7203 1189 -2071 -883 -1652 1878 -7451
23269 -7451 -8261 -3139 4889 11922 9814 5825 277 -1336 -7130 -10075 -7713 -9400 -10830 -15797 -8182
23254 -8182 2282 6075 16743 22331 22628 16595 9231 3548 -1269 -6256 -8657 -9527 4365 15609
23240 15609 9846 4034 5426 11956 17225 16359 12694 9942 7679 -2651 -2085 6376 2940 -3360 -8577
23225 -8577 -5192 5218 6787 3751 5364 9783 7234 5491 9436 8788 4041 24 -805 -2934 -1969
23210 -1969 2446 3496 1555 -699 -4923 -6645 -5658 -2034 -163 13300 12358 4837 180 -316 -4047
23195 -4047 -4886 -8302 -8067 911 5346 -1489 -10197 -10730 -11344 -14056 -11980 -11031 -13667 -10779 -7619 -4277
23179 -4277 -7396 -2102 1391 25 1728 5709 1065 -5967 -9555 -4863 4569 5805 -1813 4058 7203
23164 7203 7829 10686 6511 5679 6904 15015 12416 15916 20481 20132 10216 6055 2957 8039 7905 3756
23148 3756 4702 3632 322 2567 -1071 -3156 -74 7385 6960 1667 -3112 -7042 -5926 1242 -1146
23133 -1146 2393 -587 745 2918 923 3231 -2380 -4811 -1049 -3248 -7263 -6962 -4839 -1376 -5001
23118 -5001 -1800 92 4066 3715 4870 8488 4649 3482 4260 -2892 -9110 -9803 -7715 -15110 -15088 -6776
23102 -6776 -4800 5500 11077 12788 17168 21271 20821 13107 7592 11514 13633 10354 5091 8612 4131
23087 4131 -4523 -321 -105 -1493 -2308 -4253 -10552 -17672 -11155 -11709 -9437 630 4837 440 -11742
23072 -11742 -8609 2650 7689 6696 -1104 -10596 -7375 -4524 -4884 -3595 -2264 -2981 3917 5345 -1063
23057 -1063 -5324 -544 3212 3302 5420 6870 9003 5094 1938 2751 8035 13747 12564 14587 11341
23042 11341 9876 -2085 -4357 164 2513 4309 2490 -7684 -6658 -6244 -9125 -12517 -17259 -10435
23028 -10435 -2366 2928 -1189 1903 2440 535 219 4783 -3777 -13055 -9489 -2020 -5058 -10038 -13025
23013 -13025 -5718 -3145 -7127 -5622 -8252 -7658 -4528 -7474 -6841 -3709 -5051 -4103 -7190 -6188 -2264
22998 -2264 -3901 -3714 -1671 -389 2905 5124 689 -4316 -6998 -7052 3821 9367 8091 -4011 -10165
22983 -10165 -5989 1759 8733 10083 8237 10985 11510 5200 7058 9726 1327 -4142 -428 6871 5752
22968 5752 608 -3639 -11470 -15021 -11690 -9569 -6880 -9819 -13557 -6633 1695 -2274 -7788 -8289 -4604
22953 -4604 -6175 -17802 -19444 -16629 -10457 -14823 -12262 -6303 -4531 -1880 4690 9409 2029 -10179
22939 -10179 -10628 -7509 -3089 -1472 5144 9220 3639 10989 11024 8294 4971 7730 6018 5515 10061
22924 10061 8139 4336 6066 4069 -865 -1814 8781 16198 13891 9795 1810 -9109 -9313 -8336 -9823
22909 -9823 -3981 1419 1874 -5249 -6416 -851 5530 8246 3408 2400 6001 4370 2857 1756 -2340
22894 -2340 -9034 -1720 7985 9266 830 -10475 -12145 -8729 -3187 2197 4413 1983 6541 11079
22880 11079 12833 8411 11372 10123 8523 10320 10433 14280 19349 11954 3993 -2622 -7331 -787 2401
22865 2401 4913 5386 9153 1783 -3352 -2776 -2066 5077 2335 1731 -2154 -7711 -6661 -3691 3336 9548
22849 9548 8695 -6411 -7734 5730 2392 -3680 -7670 -7590 -10003 -7953 -16503 -15920 -9110 -5977 -7536
22834 -7536 -4973 -3663 668 2604 -4328 -8774 -6023 -8471 -4732 2636 3578 866 -2009 -6771 -11103
22819 -11103 -9661 -4895 -3383 -3538 -3324 -6593 -7361 -4760 -423 5336 4108 984 -1999 913 11527
22804 11527 17308 12170 5764 -519 -544 104 4710 8479 7142 6722 7091 5246 5995 12700 18147 18145 13803
22787 13803 9944 5592 11315 20154 22118 14063 9305 7681 12583 11775 14233 14093 3370 -3290 -329
22772 -329 7153 8352 4309 -6285 -17248 -18855 -10362 -6120 -947 2829 7553 7139 922 -507 4658
22757 4658 1993 1957 -3509 -6286 -4897 -4434 5257 11238 10366 718 -3086 -2781 -3663 4390 3122 -495
22741 -495 2924 1381 4208 4694 14932 26113 16131 9565 3356 -4013 -7057 -10054 -4603 -915 2399
22726 2399 -3 422 -2344 -8983 -10032 -5948 -2578 3969 2389 767 -692 -1497 -6076 -63 721
22711 721 -1449 1921 7486 -163 -3807 -2314 -4045 -8543 -10728 -8085 -7882 -11767 -4561 3106 3833
22696 3833 -778 -1124 4356 597 -3640 -3712 -5603 -1569 -12958 -14456 -15998 -12881 -2846 3333 -1264
22681 -1264 -8197 -4004 691 2647 -863 -6427 971 3585 3718 11908 5092 -7614 -9092 6811
22667 6811 14255 15571 7295 3068 2471 5226 -4020 -4083 4642 6481 9201 11046 12807 16509 13171
22652 13171 6074 6219 2106 4168 2406 391 -5672 -5395 -1778 -6613 -7740 -7319 -4497 -3279 1618
22637 1618 3503 -1805 -1847 889 -629 2191 638 -3686 -2065 -4183 -8273 -11288 -10298 -3313 -9096
22622 -9096 -3863 39 -5004 -6706 2344 7101 2764 -1927 -1951 1311 6041 -1625 -4404 -1224 1199
22607 1199 -452 -6718 -5715 5934 -2219 -6583 -3450 -7919 -3314 7792 7244 -2004 -8729 -628
22593 -628 5813 7583 13357 7829 -2009 -5735 2904 4941 5227 8534 3548 4190 4080 5070 -1975 -62
22577 -62 1120 3005 3880 4620 -1489 -4749 3812 10220 3148 700 4365 6232 5945 6847 9680 8424
22561 8424 12530 14152 1542 -2786 -6190 -3141 2751 8603 8383 13546 9594 5103 2546 -2033 2683
22546 2683 5157 -2959 -5279 -5562 -1306 -1439 1582 2550 -1967 1198 2923 1158 790 1950 3135 840
22530 840 -1429 3798 684 -7518 -8362 -630 3256 10271 10899 10401 590 -4495 1871 8619 8576 12877
22514 12877 2689 -6190 -3058 524 3372 5325 -133 -1369 1072 2820 1258 -6917 3394 11434
22500 11434 12816 6501 11237 19526 19537 27953 36286 44856 53199 51577 43707 31861 18141 6259
22486 6259 -3667 -5548 -2615 614 2638 7348 7521 3498 -271 6752 10419 4675 2152 -1381 -4931
22471 -4931 1646 -1122 848 -1496 -6171 -3378 -6127 -7376 -2959 -4286 -6813 -10873 -13395 -9180 -7975
22456 -7975 -7768 -8308 -3577 3301 1716 7176 10650 7732 -1160 -575 982 7078 3869 139 -5795
22441 -5795 -6222 -7660 -3263 -949 -1192 2546 3871 2034 5061 3676 510 -1639 5532 12394 10941
22426 10941 3247 -6499 -12793 -7650 -6643 -3653 -4182 494 6765 11774 7062 1936 -6476 -7336 359
22411 359 3831 399 -2744 -600 1162 -3 -8953 -6440 4802 10249 7943 -908 -5425 -1999 2925
22396 2925 -3382 -3228 -5393 -6598 -6270 -3076 2084 4508 1610 -3900 -2937 2275 4129 1769 -2780
22381 -2780 -6921 -7438 -5383 -3872 -710 7780 9205 5918 3871 -3776 -9498 1798 3749 169 2553
22366 2553 -9110 -17199 -15329 -17318 -8599 4490 6351 3700 3273 2700 6146 10179 6445 2711 -2319
22351 -2319 -4237 -6720 -2466 -2944 -11883 -16841 -12469 -6540 820 -165 -672 120 -3658 -6475 -7573 -3082
22335 -3082 1994 3072 3039 1208 -4293 -5453 -6340 -7967 -6123 -2881 1123 2418 -2392 1263 4178
22320 4178 718 -4971 -2617 -551 -10491 -20378 -17235 -15220 -5928 -6116 -8652 -97 4250 4218 170
22305 170 -6154 -6068 -3663 -5045 -14564 -16486 -20321 -22464 -15001 -10569 -9694 -10232 -10159 -13649 -5883 -3236
22289 -3236 -7498 -8355 -14744 -11909 18 -7568 -14918 -4126 1264 8324 5712 -2820 -10911 -13569
22275 -13569 -15862 -14982 -18140 -20220 -25545 -20345 -18020 -20095 -14309 -13466 -12863 -9615 -2357 834 -398
22260 -398 -4174 -712 106 -4342 -7585 -5968 -2321 -675 -5746 -2661 4723 3895 2751 1109 -5648
22245 -5648 -5652 -3609 -5526 -25 2937 -2784 1074 -262 -496 547 -2418 -5182 -1478 -242 -2524 -5644
22229 -5644 -5119 -7442 -8760 -15233 -17616 -15967 -14951 -14937 -21808 -21937 -5847 5654 7047 3247 5099
22214 5099 11752 11763 7489 5566 8162 2087 874 834 1946 5198 5108 -2323 -5812 -8912 -13562 -16340
22198 -16340 -14321 -10611 -11298 -3492 799 1722 10131 5861 8794 5393 253 -5628 -7233 -2887 -867
22183 -867 191 -177 -4287 -12011 -13181 -14714 -6290 -7716 -9393 -4085 -8430 -11354 -2827 2939 5353
22168 5353 2562 -3474 -1750 -4220 -3892 -3240 -7851 -7639 -1399 -5293 -10222 -8788 -13601 -8589 328
22153 328 -3136 -1371 29 -1134 -3632 4856 10867 5457 1725 -6075 -13445 -14029 -7690 -10281 -6124
22138 -6124 -6446 -11267 -15518 -13332 -18495 -18120 -15143 -6015 -5114 311 6008 1820 -4115 -8809 1396
22123 1396 10296 8620 4605 4854 5439 11694 11220 1269 -2221 -673 -1079 -3888 -6343 -909 3038 2472
22107 2472 2223 -2516 -3542 154 3124 4214 4698 -6722 -7183 2243 3398 -5816 -8501 -8370 -4136
22092 -4136 -4585 -6905 -6740 -3481 -6458 -6596 321 10380 9091 5109 -2482 -6193 -9564 -4550 -6067
22077 -6067 -11573 -8351 190 2727 3027 6806 9344 11984 4595 -4965 -8725 -6738 -4989 -2429 -1665
22062 -1665 568 4519 7740 8230 4659 7514 8525 3943 4623 7972 6701 5899 3642 10205 10427 9495
22046 9495 5154 -4890 -6757 -10711 -17022 -12673 -215 4401 1785 665 -5913 -9431 -10170 -16195
22032 -16195 -12070 -10550 -15897 -8868 -1797 -4068 -3745 -3613 -9734 -15549 -4188 -2574 -4437 -8018 -11247
22017 -11247 -14195 -18108 -14801 -8087 -2926 -1262 -411 1483 -50 -7239 -5045 -5900 -4478 1352 260
22002 260 -9021 -13739 -10783 -11944 -7740 -3756 -7543 -14619 -16240 -11414 -5477 518 -3166 -11447 -11892
21987 -11892 -13022 -6721 -4489 1962 6271 8654 2931 -438 -5423 -5158 1805 1625 -8103 -11849 -17283
21972 -17283 -25356 -15349 -9247 -8442 -11720 -6333 1646 -1317 -1282 -4319 -7457 -10535 -14275 -15959 -10731
21957 -10731 -3263 1966 1892 3863 2710 3432 10919 11620 10740 896 -991 -1234 8121 12122 4779 -14
21941 -14 6626 10068 5454 1997 2256 842 589 1238 -1867 -989 521 -530 -2004 -5844 -11013 -9071
21925 -9071 -4247 3150 7289 8519 10181 6521 8063 2141 799 3043 7167 6682 2938 -7075 -5921
21910 -5921 -552 2674 -3958 -9183 -11473 -12732 -13207 -12386 -12292 -9291 -1111 -2710 -9647 -17680 -18562 -20850
21894 -20850 -15360 -7192 -12827 -6969 -4823 -3198 531 -3622 -7323 -12296 -8783 -4623 -12296 -17141
21880 -17141 -15661 -12233 -15710 -10406 -16609 -19172 -20766 -20889 -22323 -17999 -11731 -8609 -5670 -2495 -1230
21865 -1230 -4207 -7536 -6246 -8599 -11256 -5745 -6304 -4614 -3373 -2114 -618 7743 11701 10411 4978
21850 4978 7922 10653 808 562 -203 -5233 -142 -2673 -15014 -19503 -5494 -2991 -2847 -5363 -8603
21835 -8603 -10017 -10456 -14908 -13610 -9971 -10933 -942 528 680 -8354 -16477 -10268 -2457 -3340 -3294 -2046
21819 -2046 -1697 -4286 -10625 -5885 -1601 2711 6465 10215 12163 10722 -3391 -11469 -3431 -3516 -7253
21804 -7253 2194 7141 2191 -5369 -5804 -3325 169 6580 8422 8968 7005 424 -3963 -7352 -6378
21789 -6378 -9057 -3152 79 -4102 -6234 -7575 -8910 -5955 -1772 -1880 3271 -3933 -7512 235 7385
21774 7385 3771 2466 3871 3896 -3592 -11892 -18933 -13597 -7202 -1616 -2972 -1719 -1348 1942 4706
21759 4706 7136 5532 12200 13335 5363 9445 3323 -1147 -6059 -5868 -4095 -6006 -8596 -2576 -227
21744 -227 -4097 -4767 4228 4297 2557 1314 -534 -10773 -17002 -12675 -8437 -1784 -1580 -6175 -5239 -9057
21728 -9057 -10281 -10134 -9572 -8708 -10112 -11375 -6458 -7818 -9640 -9349 -8257 -7789 -1515 2037 1290 -1884
21712 -1884 -4766 -4512 -10858 -9180 -10374 -10730 -3567 -8208 -4690 1462 -365 -1393 -1793 -596 2830
21697 2830 5163 6365 4950 1415 182 -6913 -10570 -2776 -3794 -10846 -21123 -16167 -4290 4917
21683 4917 10395 6937 -2583 -792 2258 -668 -7147 -11714 -8869 -10295 -11670 -9163 -10830 -11166 -10300
21668 -10300 -11558 -12475 -16186 -21502 -16179 -4658 5329 -7220 -10599 -13538 -13105 -13826 -12685 -10834 -3759
21653 -3759 6735 4511 290 -517 -8983 -9399 -2184 3899 3778 9682 6780 5113 -1070 -3937 -2990
21638 -2990 3247 6089 4150 -5047 -3068 3887 11261 10499 4946 6866 -882 -2455 2715 4498 7780
21623 7780 6813 7265 7041 4884 7146 4943 8936 2224 -5621 -8082 -5877 -8796 -10405 -12563 -12069 -8177
21607 -8177 -3328 -218 -8483 -9007 -7962 -5209 -7153 3 -2452 -5057 -4449 -6073 -3097 -3162 -3605 -5174
21591 -5174 -2938 -1750 1847 1763 -2003 -3412 -4973 1795 3680 4311 1014 -3742 -5262 -4203 -11210
21576 -11210 -18961 -12419 -5147 -4374 -3154 -5439 -11704 -17514 -20990 -16270 -6613 -4463 -5070 3764 3591
21561 3591 -2778 -2512 -1025 -505 -489 -4253 -12100 -10325 -12568 -10158 -7621 -9417 -12520 -15111 -20999 -20370
21545 -20370 -19416 -17198 -9062 -3600 -5746 -3934 -421 2391 -1851 6018 10838 14304 14699 10276 3663
21530 3663 -3738 -8383 -8436 -9302 -7549 -6846 63 815 -8627 -14121 -13494 -17469 -17985 -17653 -15617 -11309 -1608
21513 -1608 6764 8790 9672 10389 4903 -7354 -14327 -12974 -11131 -2670 4577 1501 -3277 -4001 -10135
21498 -10135 -16971 -12660 -4574 -458 -257 -8028 -5473 -4466 -1377 -9970 -15561 -13921 -10707 -11928 -14259
21483 -14259 -13263 -8551 -12505 -12217 -10805 -9334 -4138 -3619 -3485 505 10381 11203 7403 6674 10289 5654
21467 5654 4320 3011 4992 6892 9552 3450 -3687 -2886 -3233 1218 873 -3446 -10366 -11563 -10621 -5202
21451 -5202 -1064 -4567 -11163 -1451 1056 -807 3461 -9263 -14997 -2877 -2144 -250 -1642 -3032
21437 -3032 2562 6485 3849 153 -4129 6782 15278 10343 -3059 -6909 -2733 -2319 2885 6352
21423 6352 1306 -6663 -6142 4122 -706 -6305 -9814 -7159 -7752 -4662 -3359 -13891 -19053 -12892 -3039
21408 -3039 2980 3930 -578 695 7996 6929 -582 -2293 7341 7218 1066 2384 1343 2410 -1002
21393 -1002 -12254 -6032 1088 10467 9140 4909 2148 -9882 -8905 -4422 -8682 -5023 -4376 -3920 6201
21378 6201 6198 732 -7112 -4127 -3735 -2368 -5024 -1777 -3172 1728 4624 -1387 -5044 -2218 -3574 4205
21362 4205 10122 10109 6191 -2876 -9879 -9197 -2942 -3899 -2980 7701 16761 10892 1067 -14092 -16460
21347 -16460 -8623 -7061 -13223 -23217 -23010 -17769 -12377 -2858 1172 4841 10436 6554 8002 9806 6674
21332 6674 1432 1395 9614 15040 8108 -4608 -11969 -2470 -77 -7013 -12712 -14726 -22052 -12935 -3217
21317 -3217 3312 971 -1618 -3694 5741 3392 -5775 -5904 -823 338 7045 6175 2148 4107 4111 5939
21301 5939 10333 2281 -5029 -11694 -18104 -12271 -3015 -3498 -3697 -2198 1994 4887 3209 4700 14456
21286 14456 15979 12725 7767 -8621 -18029 -15878 -10859 -6257 -9969 -5906 -8816 1277 12235 7981
21272 7981 1078 -930 -1902 -2529 -2810 -7123 -8489 -5797 -6334 -2652 -5314 -8535 -8626 -15059 -14845 -12974
21256 -12974 -13894 -6706 -3932 -532 -13506 -19560 -11780 -8601 -9587 -9926 -5013 -1407 -2819 -8205 -6542
21241 -6542 -6742 -11902 -11777 -3787 1069 -2115 -1962 -7508 -13668 -16956 -4167 -54 -1164 -1850 -3236
21226 -3236 203 -1004 -3417 -1656 -4624 -8615 -12234 -18509 -12643 -13922 -9480 -5336 -610 -3120 -6997
21211 -6997 -7004 -606 5517 10472 10355 13128 6020 7610 1151 1344 -3176 -5279 -662 3828 6517 2964
21195 2964 -4791 -5118 -3057 -5293 -7406 -4590 -1562 -7657 -8129 -9567 -4633 -4137 -8120 -4831 -4589 -3295
21179 -3295 -6125 -2016 -248 3144 3008 3649 630 -8774 -16007 -18348 -4974 -3355 -7709 -40 3083
21164 3083 -3311 -4874 -8453 -10363 -13180 -7880 -8821 -9608 -6816 1914 7585 3971 3949 3654 -1692 -5636
21148 -5636 3044 7008 10599 12002 7546 -505 -11494 -14732 -10573 -8053 -5352 -1410 -1444 -3747 -1306
21133 -1306 6193 2192 2956 1695 2773 5643 -6661 -12217 -3391 225 -134 -1424 2046 1515 -385
21118 -385 -1542 2091 6171 6256 11439 8638 843 5971 3546 3379 3783 -617 -3102 -4602 139 82
21102 82 1561 -1096 -11731 -13560 -12210 -12930 -15358 -9064 -2472 -2853 3623 6019 3456 7136 5205
21087 5205 -225 -2098 1921 3278 6769 1880 -2035 -1252 -25 9145 6108 956 -204 2698 1737
21072 1737 -182 2058 -7356 -14130 -8083 -13443 -19020 -14054 -9622 -2174 -403 3694 1614 180 4431
21057 4431 1475 -320 -2865 -4838 -5932 -5963 -10179 -19986 -22631 -19738 -18908 -17556 -13081 -13481 -17049 -18842
21041 -18842 -12432 -12673 -7814 -487 1210 -9693 -12173 -6642 -2418 -8619 -5175 -1335 -2877 -711
21027 -711 94 93 1759 5829 4047 3477 -3230 -9459 -17381 -24765 -11764 -2453 5265 -1892 -5988 -2563
21011 -2563 -7133 -6287 -2084 -5907 -10738 -6920 -5159 -5290 -10030 -7693 -5613 5543 4102 -2887 599
20996 599 627 1174 -1163 -208 -5744 -9281 -3970 -5819 -12516 -2958 -1363 -7414 -10524 -11153 -7296 -11214
20980 -11214 -7402 -1972 5470 7112 -4991 -4628 -1924 -7140 -7402 -5315 -7207 206 4975 1625 1256
20965 1256 -4805 -10163 -9915 -8792 -3959 -1247 522 3888 9604 7899 7151 10636 7382 3590 -3809
20950 -3809 -9454 -7458 -7750 -4440 -1889 3827 8722 3410 4291 1608 -9944 -10447 -7865 -6660 -6880
20935 -6880 -5102 -8066 -17605 -21563 -21167 -10002 8386 6548 3181 -1688 -3247 -2565 -1666 -6380 -5636
20920 -5636 -8839 -17064 -19324 -15469 -18354 -15160 -11492 -11063 -7517 959 1779 1347 -5586 -10592 -10114 -2802
20904 -2802 -350 -10030 -8008 -3737 -9377 -11080 -10103 -8463 -16401 -21566 -19474 -16925 -9000 -8000 -14144
20889 -14144 -18392 -14042 -5748 963 1449 1563 3300 419 -5363 -5914 -3768 -3614 -7464 -4644 5259
20874 5259 -5039 -19311 -19108 -15816 -8310 -1179 -10595 -9751 -4455 -3427 -7836 -13017 -10385 -7252 -7478
20859 -7478 -7132 -6124 -10749 -14445 -10084 -4484 -374 -1411 968 -1021 -339 -2640 -4618 -5468 -5473 1630
20843 1630 6238 2638 788 -193 -5198 -10889 -8542 -4647 -5131 -3887 -4452 -4916 -3594 -2558 -4748 -2316
20827 -2316 1631 3000 1685 141 -1637 -10113 -3114 -6232 -6984 -1240 -4830 -12940 -9927 -7897 -4041
20812 -4041 -1642 -2554 -9573 -18010 -10792 -9958 -8755 -8489 -4782 -9618 -10026 -11832 -4032 -1553 -7445 -14053
20796 -14053 -18942 -12381 -7292 -7617 -8597 -8346 -7403 -7991 -12405 -18284 -17616 -11374 -8237 -11125 -10403 -5144
20780 -5144 -4455 -7207 -2659 -6360 -10640 14 -2763 -3071 -2880 458 -3540 -14419 -12751 -9145 -1200
20765 -1200 5447 276 -244 -654 -5866 -7070 -13404 -8664 -1422 1417 -7584 -18884 -17141 -12684 -11262
20750 -11262 -17115 -19591 -13537 -7989 -7501 -5575 -6505 -8469 -1189 2267 -5 -1004 5598 8096 8659
20735 8659 7434 922 1760 4842 1819 -5039 -866 4220 803 -5179 -10766 -14120 -11349 -5818 -7172
20720 -7172 -10289 -11753 -4866 -511 -131 -4562 -7958 -8350 -10069 -6525 -3746 -1327 -2169 -6968 -12177
20705 -12177 -21079 -15347 -7872 -2077 -3220 -3900 -4996 2872 141 -10513 -13794 -3979 -3362 -2969 1159
20690 1159 -4650 -7214 -5341 -11622 -13350 -9843 -1273 4768 4580 2911 7893 15260 8086 140 -1592
20675 -1592 -4056 -5257 -7735 -2606 1460 -4140 -5360 -1417 -1155 -6459 -10395 -11795 -12094 -10194 -5325
20660 -5325 -6450 -10941 -12756 -7372 -3176 -3768 -3504 -7324 -8687 -10768 -10486 -10049 -12627 -8346 -7653 -13513
20644 -13513 -18121 -11961 495 2805 7636 8078 4754 8748 -928 -10731 -4582 -1612 -5371 -4972 -1746
20629 -1746 2009 -3829 -5926 -7451 -10350 -11619 -14969 -11832 -8366 -2309 -2778 -4532 2505 12589 12713
20614 12713 4118 6597 6852 4911 10559 11782 17123 18245 13782 7748 10423 10836 10178 1653 2396
20599 2396 -280 -5008 -2753 -4983 -6865 -7103 -13798 -9596 -11713 -15513 -17647 -20175 -17331 -18002 -18385
20584 -18385 -13553 -18374 -16469 -15390 -7026 -7086 -4594 -3059 1248 1314 3140 1261 -320 -2988 3235
20569 3235 5849 12725 12836 2845 -1545 -2354 -5635 -5298 -1834 8001 -162 -2277 2926 5092 3046
20554 3046 2809 -5424 -10177 -6287 -226 11961 16460 16370 13437 12271 6980 3337 4572 11108 7888
20539 7888 -2916 -8691 -4316 -2721 -390 1988 -2625 -8105 -8305 -5772 -9967 -12291 -15428 -14533 -10019
20524 -10019 -15754 -16182 -20889 -31334 -34598 -26310 -18135 -8483 -347 -2375 -5811 -1176 -23 3789
20510 3789 6251 5452 8311 13130 11089 4676 3352 7060 3954 -5552 -3793 -2068 109 5606 7275
20495 7275 12655 9474 3953 2986 4179 -2823 -3494 -5776 -16168 -16159 -2985 10120 11382 6874 3160
20480 3160 7379 8857 11122 9400 10271 8335 5835 5894 6891 -4833 -10361 -14274 -14931 -12753 -3347 -6955
20464 -6955 -14068 -14519 -13020 -19909 -15193 -10454 -9280 -12783 -7503 -3753 -220 -2353 -4676 -10 2645
20449 2645 386 6089 8232 1097 -8647 -8628 -14029 -13337 -3556 -6631 -4842 7729 3028 1434 2474
20434 2474 -1096 -8649 -15023 -11768 -2530 7102 3532 -2025 -5209 -7451 -4637 -9457 -16154 -13559 -10395
20419 -10395 -6969 4504 7322 6870 4479 3691 1661 -686 -3744 -2746 1985 9433 11199 5877 -3807
20404 -3807 -9697 -9753 -7212 -9953 -6108 -10866 -10592 -12245 -17767 -16961 -10629 -4197 -1811 -7953 -15784 -16763
20388 -16763 -7316 7257 2871 2976 7016 11643 2263 3298 7847 4455 3499 -3176 -14208 -13647 -3955
20373 -3955 7015 10910 14290 13101 2325 1338 2642 3742 5719 5919 9733 13178 7696 3724 7779
20358 7779 10136 3624 295 -2995 -4089 -3571 -9581 -12211 -4182 3552 3294 8516 8835 10593 6498
20343 6498 -1286 -8365 -2771 6521 2129 -2411 3505 1588 2944 767 -2255 -7034 -8974 -395 -2097
20328 -2097 -3199 -3085 -10467 -18084 -17193 -12238 -3782 -1366 -3806 -2261 -3350 -481 5114 10606 12468
20313 12468 14271 19320 12917 8245 6142 -422 -2522 -2805 -4274 -1267 969 -3485 -8860 -9360 -10487
20298 -10487 -7300 -8652 -8284 2225 3645 -2391 1906 6439 2314 1371 -3169 2525 4024 1537 -2301
20283 -2301 -9018 -8789 -7993 -15895 -23736 -26895 -19401 -11929 -13688 -17181 -6451 -5208 -9112 -4504 2225
20268 2225 699 -2416 -6044 430 -1911 -6482 -12368 -19477 -21030 -14296 -1136 -817 -9831 -6528 -593
20253 -593 4408 10025 16419 13401 7120 6939 2079 3509 5088 318 -3629 3685 5887 -3388 2369
20238 2369 11699 17812 12807 8876 5485 5895 10321 14643 11200 1176 7711 10750 2317 149 5733
20223 5733 9906 7279 7639 11746 19264 17179 14013 15838 15693 7556 -1427 -4068 -2466 2106 -2996
20208 -2996 -5165 -9540 -10850 -8779 -7976 -10429 -8205 3754 8750 11002 7546 5244 4734 3360 1125
20193 1125 3436 -1853 -2951 -3347 -4608 -7505 -3444 -3711 -1178 -251 463 -4776 -4481 -125 4709 4843
20177 4843 4697 -4074 -5005 2166 7256 5537 8579 9980 3706 -2301 -6835 -6424 -5317 -5837 -9696 -12555
20161 -12555 -8392 -11641 -8422 -328 478 -740 -2529 -2574 -9858 -7212 -5314 -6431 -7732 -7677 -4953 1202
20145 1202 3980 -710 -2810 -2947 -2579 65 -1491 -1154 -2085 -1697 4504 3437 -2814 -4740 6464 12027
20129 12027 13775 10154 -3134 -8247 -7338 -4649 -4822 -7866 -8167 -10312 -8670 -11152 -14776 -16537 -16734
20114 -16734 -15696 -12608 -5411 -5068 -5617 -5965 -13294 -8511 -9743 -12375 -18508 -14329 4114 6607 4362
20099 4362 434 -1772 634 3388 -591 -4755 -7852 -8118 -11646 -13791 -17086 -14712 -17269 -10637 -5791
20084 -5791 -5662 -5083 -8738 -15366 -13395 -4740 -3445 -3546 2227 1415 -1352 -4553 -5819 -12815 -13396 -15085
20068 -15085 -8817 -1238 -1659 -3075 -3203 -5112 -6530 -3016 -1655 -1482 4274 -245 -2454 -2336 -2692 -6090
20052 -6090 -9167 -942 -1872 -1745 7589 10943 7027 767 -3761 4000 9016 5458 4240 1341 1521
20037 1521 -3066 -2224 -7127 -6871 -2172 -4632 -5231 -5229 -10171 -4946 2178 8356 9772 6168 -2877 -9157
20021 -9157 -6289 -4379 -9492 -13004 -9175 -5480 -4558 -3162 -8657 -11254 -10476 -16405 -9489 3120 4931
20006 4931 -1479 -4384 -8269 -7914 -8904 -8727 -672 4198 -2342 -5359 -7218 -7470 -5900 1493 1328 2637
19990 2637 5093 -228 -1633 4765 7500 5125 -1888 2312 5205 7020 7807 1060 -1060 355 -894
19975 -894 3942 15616 17669 19066 8519 796 -5094 -10734 -11542 -4024 -28 -3550 -5498 -6259 -5175
19960 -5175 -5357 -9150 -13390 -12296 -1156 2337 3839 7832 11103 15358 10664 -166 -5566 -12151
19946 -12151 -15380 -12967 -10994 -14457 -18614 -6737 -4738 1527 2032 -5885 -9747 -7688 -7460 -11672 -12370
19931 -12370 -8695 -11155 -9444 -6225 -7386 -8743 -8163 -4594 -882 4878 6276 7077 10649 16456 18806
19916 18806 19947 19332 12670 6491 5120 11394 9020 6585 3576 5169 6316 7515 8508 13172 15333
19901 15333 13574 10238 20394 28312 32103 20928 15586 12889 11229 14273 17265 14685 9284 5721
19887 5721 -988 2703 9515 7659 5807 -811 838 1505 -3622 -1809 2318 7470 11904 12566 6624
19872 6624 -833 -5271 -7125 -2728 1387 5176 9207 8069 3813 5625 2243 -7494 -9525 -6744 -10668
19857 -10668 -3319 -95 -3105 -3057 -132 1998 4683 -453 -12861 -13947 -5420 -2051 2331 1219 -1852
19842 -1852 -1960 -5355 -6021 -4879 2511 6061 -1158 -3033 -7557 -3805 -2481 -1262 7645 7016 7935 14836
19826 14836 16423 12738 4633 33 2425 5030 3290 6101 4626 5982 5317 6695 7401 11764 10957
19811 10957 15470 11977 17545 14086 564 -2607 -2746 3794 7195 8298 15445 16297 10985 7232 6311
19796 6311 6004 5000 6677 8146 10759 15467 6056 3328 3740 -1174 -1483 -3172 -7695 -8803 -6576
19781 -6576 39 9704 15463 11109 4751 1277 -6099 -8814 -6843 5236 6182 3831 4629 10134 6705
19766 6705 4737 3600 -1482 644 -403 -1247 4740 3896 10663 6548 -2342 -2357 3452 2048 3229 3410
19750 3410 -4347 -4496 -6618 -8629 -3812 184 -2790 -7052 -4119 7079 5442 5624 9483 7298 -801
19735 -801 -9152 -11118 -14752 -12630 -6522 3359 9742 15742 11633 6513 4741 -260 -5597 134 -1355
19720 -1355 -3149 -2913 -5782 -2068 6752 5139 10846 11655 12888 8814 4069 7416 12592 9064 8512
19705 8512 4264 4089 10005 11916 9292 4795 523 2474 3071 -68 668 2413 7588 2779 -3915
19690 -3915 -6526 3911 7601 11234 2634 -12754 -11624 -3152 -3508 -3581 -2727 2499 3352 3173 121 -2156
19674 -2156 -1805 7701 12631 9289 -2203 -6281 -9881 -9444 -7244 1124 4465 1901 1206 -1347 1335
19659 1335 4867 -2211 -10409 -4672 -3581 747 5279 6906 4735 -327 -442 4213 8165 4737 8613
19644 8613 7662 10095 6288 3252 8113 9681 12844 13768 8509 11305 9095 19235 23527 11383 8039
19629 8039 2080 1703 -28 -4019 -8464 -5987 1939 5539 15362 22032 23099 20494 14359 3603 4638
19614 4638 1172 6433 4620 1115 591 2715 7258 14975 7905 4886 2765 6764 3280 1812 -2069
19599 -2069 -6458 -8978 -8225 -3373 -1809 1319 -1733 -3789 629 -6670 -6086 2664 289 634 4338
19584 4338 4547 -1656 -2053 -2013 -4029 5475 15708 14374 14997 12569 15205 14373 9051 8416 11608 2697
19568 2697 3287 7025 9362 21823 25068 23736 23646 20597 22182 22476 17730 12256 13464 9807 8632
19553 8632 6168 9349 16028 15784 14717 8325 7760 14495 20640 14098 3464 5978 6975 223 3863
19538 3863 9304 7999 3166 4996 9991 5287 1572 -3399 -3751 1594 -2681 1853 6007 12000 9399
19523 9399 9841 9581 4949 4215 6960 5328 -3144 -3449 -1004 4745 8102 8059 6943 2931 -1748 1006
19507 1006 4670 4944 1357 7932 3531 1266 -649 -4335 -42 12401 12774 11205 11245 13659 14076 11850
19491 11850 10807 16917 22760 20091 19140 12317 5885 5699 7215 1460 -1028 2920 4377 7462 6853
19476 6853 5848 8106 6500 2414 6942 5819 2884 4171 -411 124 6196 12465 10050 1224 1884
19461 1884 4121 2840 10287 10385 12041 11123 6318 7044 12697 15484 7912 5510 7152 10859 8303 2496
19445 2496 -999 -1029 -2177 127 6917 15812 20852 26544 29103 22136 14355 11898 8172 16215 16482
19430 16482 8754 -1457 1797 8093 6960 4292 -535 -329 -3072 216 2554 73 2676 8274
19416 8274 5595 7357 11664 7141 -402 615 2089 8202 9834 7444 655 7408 14412 12151 14331
19401 14331 17208 11158 9373 9819 12680 18752 16911 15756 10937 5955 3979 6499 1260 5582 12668
19386 12668 8305 9181 9109 9895 12065 10444 8117 5229 7189 9978 11449 9483 9545 4657 6267 10572
19370 10572 17465 25244 33512 28358 25022 28770 24430 21357 17886 12701 15669 18827 17452 8869
19356 8869 7697 6078 203 7659 7541 -1300 -10654 -5344 -3695 3902 13630 17090 11980 5389 9740
19341 9740 12116 19502 13906 7824 9946 12096 19236 27164 31593 22422 14480 14462 13745 13384 13634 13026
19325 13026 11128 8906 7385 14674 7251 2386 5844 14775 19362 26433 24664 22474 19882 16685
19311 16685 8235 1078 -1050 -2346 1081 -1782 -6159 -7888 -2633 -1891 -5784 -3899 -555 -4697 -9530
19296 -9530 -8117 303 -5334 -4531 2743 5930 12880 6411 -1098 5579 11162 24769 27958 23365 21964
19281 21964 22734 16916 15489 12808 7815 10296 17166 25425 29557 29781 35155 35263 31190 28762 30468
19266 30468 33224 36677 33367 24065 21685 30567 36043 38875 30342 32721 24127 17459 23003 20376
19252 20376 16999 22307 22118 18077 12100 19128 25192 21210 12306 4204 3497 1871 -3011 -2867 2382
19237 2382 7875 8416 2933 9141 15299 11663 13969 14990 12723 13696 9718 11844 22113 13981 4014
19222 4014 -1715 4507 12554 18782 20330 22083 17639 14975 14748 22480 36419 39440 38450 30650 26098
19207 26098 26405 20096 14794 13368 13308 19418 22660 20243 28254 30416 19957 11901 8085 6622 1239
19192 1239 9954 19517 15325 13983 15122 12112 7907 9878 18664 15502 4467 -7712 -8211 4907
19178 4907 14676 7753 7267 9446 8337 14800 11216 20832 20364 23353 25499 24774 25176 20352 17920 17500
19162 17500 20625 27101 30192 31132 28216 21886 18330 21547 19708 20098 21617 19645 13174 16236 17251
19147 17251 22283 29620 34210 42787 37490 34205 28418 23049 25971 31321 35763 39450 42073 35924
19133 35924 29856 24860 19707 15414 25989 40848 51075 47145 38178 31563 24441 22927 19126 21018
19119 21018 26912 32321 30210 25247 15738 8529 11015 21198 24365 29347 27756 25624 24293 27232
19105 27232 26315 22593 15595 13628 13912 12041 20625 35301 43099 40682 37209 44878 52674 54812 36360
19090 36360 25834 24578 25984 31023 39281 39496 34910 44424 48541 44138 36023 33798 38141 41893
19076 41893 41364 42952 35187 28927 20834 8999 8440 10560 10040 10019 12928 11055 9462 3753 6433
19061 6433 12429 23022 18888 18768 16053 17782 15278 12735 17408 20220 22965 24602 28380 29346 28332
19046 28332 24246 21255 16469 5271 8129 17157 19972 26868 30312 32846 30507 32056 27416 20968
19032 20968 28508 29648 28491 28171 32275 41022 37143 29398 30109 31515 33394 35630 32763 39047 36900
19017 36900 31003 30784 32647 29636 24124 24854 29592 26011 24146 25622 24997 20779 24067 21624 20287
19002 20287 21325 21439 15785 6866 2846 6551 12068 18676 22259 31237 38583 32591 23937 24269 20879
18987 20879 19034 18819 15872 20612 23553 20818 19411 19987 21837 17683 25745 32898 36740 35100 31406
18972 31406 26234 31402 35118 19136 14655 17668 16866 26304 32484 26935 19003 19697 31003 35090
18958 35090 36093 32369 31154 21994 21529 24844 26954 22145 25110 23330 17239 17948 17548 13634 11619
18943 11619 12348 18992 17408 20643 22754 23727 21537 16597 24182 34026 33713 29118 25440 23907 28442
18928 28442 29390 30603 30427 25406 21289 24437 20380 21172 22982 17617 21459 26398 20997 20108 20581 24590
18912 24590 26749 31896 30853 32129 33620 22976 20419 25735 22819 27741 34242 33900 34630 41387 34836
18897 34836 25982 28432 34603 36978 37834 35138 35486 38916 39545 34648 33307 31567 38786 45547 39958
18882 39958 40643 41973 43954 42087 46232 43477 43356 47653 51344 54229 54608 57096 57247 53918 50855
18867 50855 45540 40094 40578 42511 40097 39488 45677 44945 43734 41280 48667 44533 39520 40250 33912
18852 33912 28945 30352 37143 55183 55145 50201 34866 16127 11313 14470 23353 29263 34623 41125
18838 41125 48737 59511 61119 53252 47618 45871 44967 48408 49907 56601 57476 53952 52863 43928 36620
18823 36620 41521 45770 47455 50381 42827 43590 48671 46762 46148 45266 44330 46077 46439 56514 65712
18808 65712 66518 65629 65956 65325 59073 54833 57414 67851 74515 80937 84379 88494 80747 75499 69251
18793 69251 67715 74841 82097 96998 110839 132335 148155 164750 193051 223817 248998 256962
18781 256962 257488 260796 254063 244545 236690 235823 247125 260833 262068 245700 228924 239697 256681
18768 256681 285195 327978 354940 345993 313081 269370 226623 195664 178389 176131 178621 193570
18756 193570 209603 235721 256897 278674 302906 334955 369926 400620 431938 467500 493326
18745 493326 507648 517804 529837 541246 560567 602361 651408 692066 720498 743382 747923 757241
18733 757241 779022 804226 838205 867400 863505 833501 779915 726969 663908 607518 573725 567745
18721 567745 580721 599086 612855 607249 593418 569748 548083 533986 512927 493393 462301 437935
18709 437935 415891 397058 383405 375378 371490 385826 399079 411354 439130 460106 477908 495630
18697 495630 506002 533374 564214 587229 612245 632887 646488 649160 640656 640729 644639 658178 673477
18684 673477 676390 681115 699403 716809 710745 683617 649171 620270 586161 548244 518107 479129
18672 479129 434051 388825 347051 315453 284662 267863 254696 254470 255398 248830 244764 241916 242307
18659 242307 243848 235721 229759 214653 203624 190368 179711 173223 169916 169415 168037 172991 175655
18646 175655 181477 190556 196030 210082 230279 250601 277376 292363 302199 307919 308984 307245 313890
18633 313890 312083 301778 290679 262745 232907 211327 192011 178994 179507 186872 192248 186629 180597
18620 180597 188179 199094 201727 208971 218591 223975 222883 224826 220109 228830 241569 252278 266451
18607 266451 275860 271894 269186 268925 257218 232360 207354 190206 182813 168529 155059 139863 131705
18594 131705 136236 137083 134994 144467 146743 151158 155700 153342 159361 170053 190693 201399 206816 208855
18580 208855 199539 184729 167361 158865 152005 152880 150934 147659 138884 131089 125029 120052 109623 105987
18566 105987 122738 134492 142339 154048 164702 167753 165717 163525 157635 149226 146424 148428 147933
18553 147933 149335 151248 147624 137738 126701 121970 117221 114133 107719 112214 119571 128492 137752 136790
18539 136790 132295 125754 119779 121076 122425 130055 130615 130103 126369 124851 128135 138862 144187 155216
18525 155216 164693 163146 154193 149759 154620 152747 158348 164276 169085 166888 162379 156815 156013 170709
18511 170709 180148 178518 194904 223489 264601 305103 340301 356366 360542 353273 345857 338096 333949
18498 333949 333978 325179 314518 307274 299551 295056 291553 291865 279252 263290 253870 239481 233417 223259
18484 223259 224735 220798 222625 242121 268042 279060 283008 292516 311439 331752 356355 378018
18472 378018 398952 424824 451665 471750 483772 478564 447298 399528 361061 326706 302449 279819
18460 279819 256921 240326 232732 234622 242734 255187 263578 275758 280955 290665 301247 317658 328013
18447 328013 319980 308018 292385 269761 263942 262028 266998 261867 249998 253864 254578 258286 259274 255572
18433 255572 244168 228853 230635 229448 225694 225059 231439 239209 249042 261102 275617 293140 292903
18420 292903 286035 275256 269165 268162 279621 303444 329749 341055 354265 358876 353502 345813 329382
18407 329382 313599 298645 296205 304492 315134 319836 322892 323664 320670 322805 319156 319728 339878 377902
18393 377902 413165 451824 484662 495120 498443 493706 497864 506038 520589 540620 572020 598199
18381 598199 620732 653115 700675 754169 796565 833667 872737 904322 919722 920330 905504 893933
18369 893933 889174 888173 898297 930235 964376 988330 1014360 1028282 1032596 1028427 1010814 991540
18357 991540 980133 973031 969732 970200 975070 987074 1018581 1055078 1098420 1166478 1277930 1415345
18345 1415345 1555859 1653842 1673663 1606436 1436483 1206258 993845 834621 724630 685822
18335 685822 707360 758083 816898 885352 955832 1014851 1087178 1158074 1224628 1297137 1373183
18324 1373183 1455075 1547937 1632026 1705954 1769548 1803640 1808633 1815104 1839951 1882684 1957438 2068310
18312 2068310 2195141 2336852 2481974 2600171 2692292 2754664 2789724 2839614 2942170 3132507
18302 3132507 3470988 3974915 4489983 4771089 4780332 4689291 4668537 4873083 5314440 5843894
18292 5843894 6255585 6375034 6122293 5701893 5305302 5030226 4871144 4801240 4842658 5003680
18282 5003680 5264876 5496044 5583221 5550787 5495787 5473417 5503922 5580635 5708987 5907384
18272 5907384 6206700 6589015 7053862 7573500 8122059 8697561 9274319 9850611 10474634
18263 10474634 11232679 12198342 13432397 15042393 17216795 20125878 23613426 26938695
18255 26938695 29433899 31244051 32878612 35248442 39196740 45391315 54122199 65037135
18247 65037135 78121751 92977780 106550073 116665456 124193024 129078369 129799132 126973285
18239 126973285 122168640 117184859 114739539 116006314 118701325 117484247 111142293 103053512
18231 103053512 96216486 92562292 91848784 92144162 91922318 90889215 89149697 87930376
18223 87930376 88794770 93231360 102912619 120082317 148372970 192800050 257219373 338395546
18215 338395546 420334827 478823496 496379312 474234247 424253738 358174335 288119799
18208 288119799 224154022 171677621 132156411 104255741 85669976 74245909 68269302
18201 68269302 66289217 66834887 68180126 68070888 65224600 60363713 54599188 48966149
18193 48966149 44289366 40740506 38052508 36172789 34891561 33566861 31926702 30247678
18185 30247678 28752823 27690409 27211633 27289775 27934165 29421202 32198190 36556446 42089500
18176 42089500 47631693 51476701 52522261 50814890 46694155 41327038 35926580 31123649
18168 31123649 27282861 24468175 22553505 21384245 20962701 21473064 23193470 26378269
18160 26378269 30821834 35302465 37857684 37652257 35676049 33339642 31530590 30281846
18152 30281846 29427280 29106792 29169400 29083130 28814070 28691441 28896346 29459459 29963940 29647773
18142 29647773 28370120 26422624 23924392 21299671 18981060 17092892 15586918 14458784
18134 14458784 13838749 13845820 14476759 15416860 16145979 16322587 16096353 15876173 16197511 17486503
18124 17486503 19883781 23080693 26315293 28631317 29581495 29282506 27995773 26093520
18116 26093520 23653657 20896477 18372078 16499998 15525631 15540758 16782845 19689618
18108 19689618 23919578 26727694 25629926 22282749 18195427 14679833 12332455 10943786
18100 10943786 10151358 9623890 9303062 9280657 9512216 9760315 9867922 9960479 10220390 10743364
18090 10743364 11508907 12487025 13405886 13721423 13125383 11734829 9930686 8125895 6562317
18081 6562317 5332837 4453398 3850172 3443634 3171430 3012918 2961941 3002437 3173771 3524023
18071 3524023 4048356 4684594 5292389 5665272 5660940 5327847 4767654 4133144 3516820 2966839
18061 2966839 2508860 2158074 1887587 1702241 1579704 1494444 1439987 1419112 1410624 1411111 1418373
18050 1418373 1427429 1407802 1351862 1272869 1188844 1105706 1033675 956309 892676 843167 801656
18039 801656 772620 752422 727391 719865 720609 720449 706376 705690 698007 672537 649439 623185 587089
18026 587089 549005 517066 494540 479715 469703 451438 442048 436689 421892 396316 377065 349385
18014 349385 330422 328183 325292 321723 314884 312724 303883 296088 287456 283169 290556 294946 294312 289185
18000 289185 298096 305105 310674 324745 336667 340882 339926 341198 330488 315374 296641 281065 271183
17987 271183 263674 252248 246013 245027 242348 236994 223982 206427 187137 163436 147957 148092 146963
17974 146963 159125 172125 184806 190427 187180 186129 189607 193668 197804 195260 200349 203467 201684
17961 201684 203042 208953 199463 184529 169839 156005 158943 149614 143463 138529 139578 136099 131076
17948 131076 130794 132477 128338 129487 130315 128877 140844 149934 156449 166715 164528 153813 129952 108948
17934 108948 92792 85200 82682 77302 73465 66942 62444 54443 43599 28031 13797 5268 13317
17921 13317 34595 69184 105645 133202 154130 164989 164160 155507 146703 135767 130708 129760 124953
17908 124953 125269 121055 127988 124800 131942 148688 175890 190514 189974 189249 189969 188282 176425 173507
17894 173507 175442 175891 166135 158624 153073 152299 147230 141715 135248 128895 116738 109539 107864 106036
17880 106036 104968 107160 112030 107736 109044 110564 98772 87703 89584 93895 98923 106729 115222 123308
17866 123308 132749 139207 143705 144688 136047 118252 99660 87084 82079 71455 65530 65972 75873 85068
17852 85068 87960 86827 86550 88451 91893 97883 109923 99111 91951 86550 83463 80378 85354 92397
17838 92397 97165 82319 65439 62389 63478 69651 77223 84121 73100 63096 59682 60193 54088 46669
17824 46669 44697 53725 48996 39112 47196 57645 65582 64730 60790 52119 49441 65638 70883 57921
17810 57921 50878 48546 48776 50983 52085 67673 81508 82148 75943 70769 64072 60308 61626 62700
17796 62700 66906 65141 64077 67388 66775 68742 73497 74738 68389 65352 72649 81847 77907 79057 95493
17781 95493 106700 112597 132555 154697 180098 211551 251030 285243 315952 341081 352625 366908
17769 366908 383615 411690 448839 471481 473560 454126 417150 376764 345819 331497 331837 343350
17757 343350 363350 387173 419738 458355 490997 510063 523231 540196 562447 579851 589989
17746 589989 599462 613780 633662 661621 692344 709138 718233 727995 730412 717816 689189 654493
17734 654493 611755 561974 534267 530044 536194 552694 578230 610248 640022 660596 676198 684917
17722 684917 683673 681537 677358 678958 673960 675068 666469 658694 649319 633637 605932 592140 578051
17709 578051 564522 565429 574843 571496 571624 554153 527532 505757 478376 449484 428700 421151 430353
17696 430353 441042 459945 491820 525510 546317 561649 562720 544145 517314 493002 480564 475485
17684 475485 475455 465414 454908 464481 468702 462993 452789 441814 416492 384872 351646 311331 282415
17671 282415 261027 254523 269061 297778 318595 336565 340588 339623 336273 326788 318568 306969 293466
17658 293466 267622 241550 211693 185698 168088 159884 160056 172881 182340 180749 170956 175320 188152
17645 188152 204140 203657 202812 213489 220427 214663 204765 193121 187074 174514 164989 155660 145579
17632 145579 134906 140576 150179 159765 173915 182617 189029 202194 206310 209452 193728 185303 175086
17619 175086 157426 144832 135498 130174 127188 123191 116358 106890 116085 132943 147534 164461 170080
17606 170080 171999 167338 163877 165591 162489 141536 120512 110683 101640 90578 86621 92073 102041
17593 102041 105149 112792 121194 130259 144020 149580 145941 138813 131055 121397 114989 103751 92725
17580 92725 81753 71777 58677 49955 45775 47246 51502 60981 64984 63697 68611 86790 88259 83272
17566 83272 70980 62057 53926 42015 33132 27611 25941 30710 40146 36077 32257 27089 28712 32777
17552 32777 30503 25739 14787 15347 17534 15464 22008 28578 23840 24710 22103 15456 14733 13573 13078
17537 13078 14880 18388 21945 24633 31808 33438 28418 27224 28463 26957 21577 13560 5659 8522
17523 8522 6884 7472 11074 11533 11880 13339 10808 6342 -552 -62 8814 10285 3483 8358 10300 8078
17507 8078 4422 1308 -5832 -4075 6681 7840 12330 14843 7012 8588 8179 4809 2544 4442 3306
17492 3306 2477 2079 406 -5994 1151 5466 5077 10423 10762 9640 9845 11933 9180 2762 -117 4550
17476 4550 4692 661 8428 13080 9813 7595 8350 10769 938 -4477 -5307 -812 4509 6278 8680
17461 8680 8877 14810 13807 8355 3351 -714 -1134 -3766 -917 5167 13691 15357 15256 14215 18766
17446 18766 17655 26645 27439 26844 41129 62861 77715 76238 70591 53155 35850 32278 30851 26930
17432 26930 24673 16900 11892 10598 15287 7257 726 12136 15497 13758 14573 20107 16979 8511
17418 8511 10228 9392 11090 9935 8864 6840 2856 -747 8716 12928 10562 13270 16644 18025 15129
17403 15129 16132 18390 20225 19134 19029 15962 14442 11523 8837 9890 15980 10649 17857 17182 9247
17388 9247 1575 3528 7775 12636 14206 10439 3445 4565 -27 -656 4754 8766 1566 -7733 -8291
17373 -8291 -4493 -963 -2809 1378 1151 -2369 -3025 -3043 672 1728 10790 18793 12656 6841 11421 10831
17357 10831 19319 23874 20189 12591 5197 -2738 -1999 -2188 -4296 -4493 -8460 -5385 -7037 -12842 -14066
17342 -14066 -16529 -13783 -11367 -5949 6170 1604 -565 -708 1675 5080 4111 8199 6781 7850 12069
17327 12069 3244 331 4269 7091 5050 2160 1268 -796 -3188 -8963 -20223 -16233 -3386 760
17313 760 -2161 -4721 -5247 -6688 -14737 -14709 -16871 -23013 -17408 -14917 -17107 -13365 -10388 -12227 -14247 -8901
17297 -8901 -9828 -14517 -19735 -17711 -17154 -16031 -12727 -5020 -5569 -10986 -11128 -11212 -12847 -13894 -10826 -16303
17281 -16303 -9318 -403 -126 -6109 -9731 -14180 -17696 -11663 -3766 -3915 -4962 -5177 -11795 -15466 -22133
17266 -22133 -25624 -22012 -18569 -8318 -7129 -6228 -12918 -12404 -12464 -7991 -8814 -8570 -3438 -3052 -5079 -5325
17250 -5325 -10140 -11344 -14489 -14323 -11261 -5016 1160 1686 754 -4501 -8773 -3175 -2524 -2001 1443 -285
17234 -285 -5309 -9940 -5322 -2440 -3005 661 -4655 -8152 -4667 -3191 2250 -805 -5464 -5207 -2951
17219 -2951 1134 1019 -6349 -5492 4537 13579 10813 -533 -7340 -7033 -7631 -5950 -8010 -9702 -6561
17204 -6561 -3242 -11972 -14985 -16140 -11057 -10617 -9011 -15695 -11409 -5457 -3212 -5702 -9392 -11623 -11982
17189 -11982 -7041 -22 -4780 -4873 -2442 4920 6623 209 -5677 5015 7322 11412 7604 4363 -4062
17174 -4062 -8337 -4043 1286 2382 6310 3624 1737 -777 -2522 1221 -5673 -9193 -8531 -9731 -7062
17159 -7062 -7678 1297 -5598 -3446 -88 2226 4572 4314 -9348 -14740 -15015 -12222 -13682 -12117 -11900
17144 -11900 -11147 -11260 -17590 -14890 -10397 -12080 -18744 -14722 -13198 -9804 -6959 -1917 -1824 -183 -6339
17129 -6339 -3130 -1968 -1050 -4053 -4815 -2142 65 -4142 -2865 -5937 -10861 -10010 -10065 -9233 -1998 2660
17113 2660 3918 -782 -2106 -2499 -4976 -10862 -10568 -10373 -8354 -10874 -13757 -9165 -9461 -7919 5740
17098 5740 9024 9648 11562 8302 -431 -2114 3565 1883 52 -5232 -11586 -14862 -11858 -4707 -9876
17083 -9876 -9742 -1388 -717 -6934 -7308 -12172 -14042 -19113 -17659 -19965 -20750 -15773 -13237 -9490 -11468 -15096
17067 -15096 -5054 2354 -3346 -13801 -16332 -11066 -11508 -7009 3068 -2414 4232 4363 6650 6001
17053 6001 2767 -4219 -9611 -11541 -4483 2598 3883 -1731 -1148 -992 -948 -3067 -8318 -2669 4317 -111
17037 -111 -4281 -13314 -19027 -15150 -12173 -7629 -9785 -16244 -18672 -14232 -11983 -8960 -4690 -5733 -10583
17022 -10583 -7940 -3067 1749 1614 275 -1525 -7103 -19021 -25426 -17646 -9183 -4311 -4494 -7274 -5790
17007 -5790 -10840 -19913 -20439 -17458 -9824 -6875 168 -1106 -9479 -11728 -3805 -5202 -3773 -1687 -7208
16992 -7208 -13131 -9461 -8014 -5708 -3420 -5228 -15238 -17946 -21839 -16228 -9292 -12953 -16555 -14240
16978 -14240 -2804 -1507 -5376 -12039 -15194 -19950 -17654 -17621 -8505 -2797 792 8101 2630 -421 -4490
16963 -4490 -1557 -3515 -5727 -1547 2816 -2499 -8210 -8880 389 -539 -6260 592 875 665 -2307 -6041
16947 -6041 -5463 -6441 -4847 -1088 343 -196 -1314 -6712 -8682 -14335 -20015 -14542 -4530 -6971 -11152
16932 -11152 -7160 1085 -353 -4998 -1868 3153 4409 1092 -4404 -13664 -15085 -8419 -2419 1205
16918 1205 -2084 -3987 -4636 -1622 4315 4971 1732 -3558 -7877 -7023 -4323 -2198 -11986 -16434 -15225
16903 -15225 -9948 -8886 -14046 -12542 -8150 -7750 -6708 -10026 -14201 -9316 455 181 5670 6359 3233
16888 3233 3682 -8863 -7641 -2573 -318 7424 5442 -6009 -11738 -10814 -10149 -7953 -8980 -14536 -6145
16873 -6145 -1491 -5527 -10568 -11013 -6342 2205 1216 -1713 -3672 490 -6839 -4900 -10288 -10747 -4147
16858 -4147 -426 -1070 -215 7911 5960 1099 -6775 -13255 -10465 -2003 8045 10008 7831 790 -1063
16843 -1063 -7517 -10117 -7961 -7173 -6632 -6871 672 5221 659 -1754 -1346 -8392 -4312 -2643 -15046
16828 -15046 -20672 -12775 -11210 -5765 -1056 -8302 -4632 5377 5207 11595 13527 6345 -6578 -10180
16814 -10180 -10679 -7883 -5751 -5922 -1461 4089 3502 872 3436 1470 4753 2724 -127 -3533 -13012
16799 -13012 -10871 -1530 92 3444 11178 15674 21339 9309 -386 -2906 -6943 -11987 -14147 -10220
16785 -10220 -5439 -12181 -18336 -14739 -12322 -4699 -1398 -1992 -5234 -15360 -25684 -26783 -24438 -21364
16771 -21364 -18794 -17337 -16656 -13283 -12866 -6668 -7259 -8970 -13768 -18282 -22452 -22011 -18888 -14909 -12053
16756 -12053 -8880 -5335 -3940 -1479 -7483 -10159 -5182 190 -5972 -14337 -8417 -1686 162 3820
16742 3820 1278 -2487 -2879 -3027 -4469 -3296 -2764 1054 -1647 -260 -2188 -5637 -6867 -2255 -4851
16727 -4851 -3364 -2891 -2408 -263 -4250 -7854 -11721 -8524 -5195 -989 -1243 6323 -3039 -9648 -18918
16712 -18918 -17682 -4965 5595 -2449 -10105 -13043 -8775 -1799 -2596 -3737 -1940 3432 3366 -5195 -12040
16697 -12040 -8248 -3832 -9533 -15807 -14652 -17139 -16703 -11748 -2500 -3116 -7465 -3779 -3705 -11627 -18514
16682 -18514 -16031 -8900 -3868 -8592 -13369 -16861 -15239 -17125 -20726 -19126 -13753 -14423 -13539 -8258 -7181
16667 -7181 -9239 -10432 -4140 -1247 -1330 -6134 -10394 -12040 -11257 -9020 -17249 -25745 -13559 -3528 -2836
16652 -2836 -6391 -7987 -6599 -2760 1555 7769 4103 -1622 3124 4080 -2507 -6190 -9929 -6366 -6326
16637 -6326 -2843 -4204 -15203 -14725 -183 -4216 -5802 -6136 -15065 -14643 -10775 -5650 -941 751 -2692
16622 -2692 -13519 -16163 -11713 -4362 -7191 -13916 -10677 -8909 -6047 3349 6442 311 1089 -748 -1690
16607 -1690 938 -638 -4588 -6131 926 7983 9953 10435 4939 -11232 -8540 -1729 -3246 -5534 -7678
16592 -7678 -4825 -4482 4192 2099 -6050 -7098 -6378 -6409 -2226 -4443 -8084 -11236 -11522 -7009 -3039 -7432
16576 -7432 -9402 -8696 -9241 -14231 -13106 -16881 -21957 -19830 -21831 -17131 -7533 -4062 -4669 -7297 -7915 -6492
16560 -6492 -9573 -6000 -10510 -13340 -8091 -5242 -5744 -315 2912 5113 2140 679 -2509 -8660 -12111
16545 -12111 -8691 -7062 -4377 -3406 -782 4457 9251 10456 -1617 -9146 -11271 -10960 -7476 -2843 -1829
16530 -1829 4238 1346 -14301 -13507 -8221 -4471 -3097 -1733 -6483 -12035 -16591 -6018 -4141 -4386 -3605
16515 -3605 -4098 -2190 -1279 -3013 -3146 -2758 -10809 -9478 -8586 -11447 -11579 -11451 -9301 2721 -2173 -14583
16499 -14583 -13982 -9699 -895 3083 3398 -10078 -18419 -12642 -2996 717 -1149 -8825 -14149 -8366 -5671
16484 -5671 -6839 -1413 -779 -2140 11 3353 1489 4334 6290 1009 5577 7238 -1062 -9265 -11975
16469 -11975 -9138 -3168 -2258 -3122 -1472 -9618 -12754 -12356 -4880 -3943 -2579 973 1526 3195 -5827 -4704
16453 -4704 3047 12628 9279 102 -7954 -5621 -15103 -11714 -9111 -13015 -11089 -5791 -3417 -1178 -4470
16438 -4470 -3626 1314 -3999 -6722 -2033 6473 8964 -1543 -11534 -15898 -12198 -12088 -12774 -12561 -12032 -15776
16422 -15776 -11841 -17056 -14154 -1543 2314 16 -3571 -6380 -8778 -13688 -11703 -7006 -1911 -3148
16408 -3148 -8999 -4263 -8090 -10913 -12874 -13757 -5049 -3759 -6441 -6089 -9200 -15110 -23518 -15665 -8951
16393 -8951 -9215 -9637 -17474 -15477 -5863 2584 -3663 -5569 825 9314 7855 6682 8491 1311 -3904
16378 -3904 -5341 -5381 -9257 -10923 -11974 -11271 -9136 -6178 -7495 -14932 -12762 -7487 -1981 -3338 -9198
16363 -9198 -6649 -3756 -1434 -1005 -6079 -3764 -11701 -16688 -13488 -12752 -14113 -4496 2675 6091 1056
16348 1056 -8334 -12232 -19098 -22617 -12793 -6969 -3095 -2284 1720 8163 588 -2318 -686 -742 -10356
16333 -10356 -17442 -12065 -5962 -3376 -5275 -6424 -13769 -11487 -7940 -599 4325 3845 -3270 -5761 3198
16318 3198 2237 -2828 -4798 -7096 -6034 3107 8138 11096 18841 9842 4197 -2992 1506 -2735 -8440
16303 -8440 -11600 -7805 -3169 -864 -1459 -4436 -7399 -6388 -12071 -14736 -16427 -19618 -18790 -15347 -13414
16288 -13414 -8893 -8451 -4638 -1970 3216 4815 -1338 -11499 -22650 -20267 -16113 -11084 -4430 -2937
16274 -2937 -14400 -18359 -12308 -12921 -19467 -14880 -8709 -15899 -17222 -9466 -4337 -3516 -4253 -12845 -13160
16259 -13160 -12844 -12018 -10222 -11192 -9995 -5242 -657 9105 13711 10625 8985 5416 -480 -8037 -10567
16244 -10567 -8110 -3979 -4228 -6473 -200 6896 2396 -3764 -4702 -6772 -10870 -9061 -2332 4014 8048
16229 8048 -5872 -11518 -9304 -3174 -2148 -7594 -16480 -18481 -19550 -17696 -7525 -930 25 -2986
16215 -2986 -13364 -19418 -17563 -6674 -1502 1400 -5170 -7728 -10062 -4222 -7066 -6574 -2674 -3882
16201 -3882 -4879 -290 1960 2449 4695 -1740 -14026 -18750 -11288 -10054 -13751 -8100 693 5895 -46
16186 -46 72 -725 -2422 -11887 -12405 -14182 -14833 -7257 -3868 -4695 -1347 -2561 -8852 -3257 -2077 -6353
16170 -6353 -13932 -10177 -1776 -1647 -5156 -1168 -6506 -10912 -7490 -6759 637 -2397 -4985 2111 -1740
16155 -1740 -8598 -12950 -14779 -9953 -6864 -7083 -7503 -10348 -13206 -6944 1693 2528 3512 3496 3735 5493
16139 5493 11614 10400 7515 4346 -3730 -6567 5252 -1854 -14664 -22047 -28000 -27331 -19450 -15554
16125 -15554 -8389 -11588 -12062 -13439 -13312 -11994 1882 9605 14180 14063 10894 8502 7446 10126 -4186
16110 -4186 -6484 -8403 -9321 -10606 -12661 -16121 -17556 -14329 -12768 -12873 -8050 -6421 -2009 -400 -5667
16095 -5667 -5676 -7369 -12098 -12098 -11729 -10249 -12813 -12831 -10544 -15880 -23739 -21199 -6160 -3281 -9462 -12411 -11980
16078 -11980 -14572 -12647 -2825 2538 3834 1671 -6972 -8668 -7713 -9700 -12044 -7094 1759 -2185 -5840
16063 -5840 -6819 -8079 -11057 -19840 -17545 -9386 -10434 -8731 -5547 -7355 -6647 -3439 2193 174 3753
16048 3753 -203 -6185 -9805 -7617 3318 1752 -8008 -11164 -9497 -13635 -12756 -19370 -16798 -16656 -17700
16033 -17700 -9863 -15098 -20040 -12334 -5251 -13572 -10853 -12864 -7612 -3556 -109 6648 10750 12189
16019 12189 9454 12213 8853 13754 14154 4659 -9504 -11866 -6119 -4382 -2647 515 863 71 1253
16004 1253 -4751 -6338 609 3525 1518 -4184 -3984 -1984 -3501 -4567 926 1640 -3634 3018 9117
15989 9117 7869 1367 2457 6339 1399 -6417 -8770 -4305 74 1762 2332 -875 -3342 -3789 -1582
15974 -1582 -7779 -9961 -10501 -10554 -11985 -11530 -8846 -5097 -1558 -5862 -4597 -6547 -9727 -18659 -22583 -25567
15958 -25567 -20695 -10038 -578 4051 8399 14359 12484 12706 6103 1564 -1492 -1305 9036 10993
15944 10993 7863 10334 252 2681 -380 -8125 -12180 -7953 -6009 -3686 4348 7042 190 -8043
15930 -8043 -9108 -6180 -7967 -11746 -8865 -15364 -19079 -22558 -15411 -11541 -13188 -9655 -12574 -16602 -14806
15915 -14806 73 6136 8122 9730 10111 63 -8914 -7502 -7963 -4354 -13623 -13573 -18947 -16190 -4692
15900 -4692 -1037 -5882 -7041 -4195 -9184 -7221 1926 2275 -3552 -4602 3 3321 7428 6110 -2483
15885 -2483 -8417 -8885 -3921 4544 10176 13021 11974 12470 10098 -6246 -15184 -17342 -17878 -12809 -8463
15870 -8463 -8469 -6280 -7622 -7044 -1884 -3827 -6975 -12323 -16682 -19120 -12834 -11869 -15302 -10902 -2955 -991
15854 -991 -5409 -7706 -4308 2384 -133 -6027 -5399 -11800 -14863 -16766 -16596 -9866 -6391 -3912 -4094 -4383
15838 -4383 1053 1134 -5196 -11855 -11065 -1865 3242 1847 -294 -5066 -6128 -6882 -4155 447 11344
15823 11344 12410 15952 24697 24431 27101 28322 20013 7905 2761 7478 6200 1896 3898 11919
15809 11919 12852 12818 9038 -11684 -23696 -16593 -13022 -16704 -10550 -2041 -8842 -15905 -14983 -13246 -14273
15794 -14273 -15486 -19243 -10799 -12174 -15244 -19047 -13944 -12353 -6737 -3827 -5683 -12198 -5662 -3504
15780 -3504 -10310 -19943 -24252 -17741 -7146 1410 965 -4855 -5599 3497 4199 -9 -7268 -9757 -11453
15765 -11453 -16570 -17870 -16835 -6435 -225 1492 -5059 -6519 -11341 -12881 -6208 3794 5863 5822
15751 5822 1596 -8871 -10898 -6249 -4659 -2715 -991 -6321 -11136 -9046 -422 -1048 -3877 747 -3930
15736 -3930 -9454 -13208 -16419 -20081 -19136 -10249 -1511 -5267 -7723 -16865 -15228 -12045 -11565 -7488 -464
15721 -464 -4775 -10270 -11760 -11523 -11529 -2201 -3001 -9521 -18307 -18497 -5463 -4926 -9188 -3787 -584 -9198
15705 -9198 -4717 3331 -1221 -9164 -11735 -4898 -5615 -7297 -5034 -6664 -14343 -11074 -7816 104 4138
15690 4138 277 6362 10435 3083 -6773 -10183 -4428 -1058 -3600 -12101 -12751 -5678 -3388 -8847 -11388
15675 -11388 -9043 -8348 -14478 -15149 -8003 -6045 -2713 1416 -986 -8548 -15850 -15549 -1749 11160 10008
15660 10008 6180 2288 -4221 -5851 465 890 -4199 -4146 -7686 -16492 -12563 -28 -7785 -11692 -11439
15645 -11439 -11029 -13289 -13221 -5592 -10186 -14213 -7175 -7767 -5398 -9119 -9346 -3830 -2273 -4661 -6738 -8543
15629 -8543 -7501 -5239 -10037 -10355 -14413 -6781 -2528 2406 4088 4671 4709 -876 -7949 -5495 2195 6056
15613 6056 11111 3824 7052 5582 775 -1475 -1919 -1957 4398 1361 -12013 -7740 -9145 -3748 -1588
15598 -1588 3302 -839 -1791 -1993 -1133 6535 8912 5071 -3121 -952 1329 3455 3706 1365 -5374 -4688
15582 -4688 -5263 -5483 -5374 -11067 -3540 3167 2584 -3042 -5179 -3213 -4743 -9418 -11077 -12210 -9011 -935
15566 -935 3067 12477 17825 16823 7911 9456 3489 1084 -2123 -1057 -3309 -3262 515 -5283 -11465
15551 -11465 -12092 -18248 -22395 -15212 -13920 -15248 -10345 -8145 -9291 -14969 -15399 -2290 -3083 -11109 -13304
15536 -13304 -20426 -16357 -8185 -6966 -6344 -3118 -1490 -5485 -6627 -2459 1238 5194 6623 5699 1323
15521 1323 -3330 -1898 3439 4861 -232 6139 7896 6076 2654 -6347 -14383 -8280 2530 2716 1583
15506 1583 -95 -3561 2 2611 3052 -2499 -2741 194 -7142 -15307 -8611 -6831 -7199 -6560 -7447 -5552
15490 -5552 -7039 -16050 -13579 -12148 -19917 -24665 -18792 -15135 -13039 -16465 -13203 -13488 -17127 -17395 -10712
15475 -10712 -10657 -8947 -1472 2397 9871 7839 -3798 -7510 -7169 -3556 -644 -3664 -8896 -11820 -8607
15460 -8607 -4178 -10359 -9565 -93 -3024 323 334 3837 3597 4319 6685 5499 -1391 -3949 -4054 -2904
15444 -2904 2073 1114 -8723 -7235 1396 10288 13034 4077 -180 1181 1372 -224 587 -2102 -9617
15429 -9617 -11310 -7400 -9859 -14663 -13604 -12240 -11442 -2725 -10216 -7775 -3167 -3368 -3095 1133 378 554
15413 554 5807 5825 7210 2638 6105 3764 -2736 466 1228 1812 3610 2084 1158 5393 6547 1744
15397 1744 -3035 -10674 -6024 -1852 -2430 -7578 -12137 -8912 -9229 -6367 -7652 -7017 -760 1346 598 3749
15381 3749 759 -2636 -9479 -10114 -2157 4028 3350 -2552 -1756 -1547 -1020 -2560 -6554 -10037 -7034 -2419
15365 -2419 -484 7193 7451 7294 -1022 -8009 -9867 -3123 -47 -3874 -7407 -15914 -12540 -2084 3397
15350 3397 -6981 -9239 -9380 -9314 -2167 10485 9844 9262 8460 6432 6927 10338 9778 3822 -6825 -6050
15334 -6050 866 -639 3281 6843 4287 937 1617 4595 8930 5678 2715 1206 -1564 -8677 -6094
15319 -6094 -3113 -5940 -2485 1191 -434 -7934 -9124 -8549 -6658 -10364 -4895 -467 -8079 -15494 -14824
15304 -14824 -10452 -13102 -22010 -14239 -7540 -2544 -491 -576 -1851 -967 -10112 -5172 -3620 -224 -2772
15289 -2772 -3156 5651 10231 6374 949 3239 8194 4145 -671 -754 2385 4949 2986 2128 7941 3796
15273 3796 -2932 -6231 -2877 -5510 -6583 -5043 -1821 2539 2008 -400 -74 3496 3426 271 -622 6518
15257 6518 9363 10646 6644 2471 4706 1456 -10499 -13443 -14438 -11689 -128 -3205 -4317 -6897
15243 -6897 -2935 -6432 3356 1110 -10720 -11917 -11330 -7514 3508 3627 4787 -113 -6366 -6596 4567
15228 4567 2659 -4116 -4872 -6478 -11354 -8056 -10858 -11533 -6709 -4388 -5248 -10096 -10790 -13353 -17872 -15952
15212 -15952 -11449 -6487 -3362 -4139 -8624 -8955 -4486 279 3291 -3160 -3762 385 3927 -936 567
15197 567 1189 -2542 -5701 -4235 870 3931 2924 -4533 -4159 -6300 -533 104 -4571 -9624 -11705 -12238
15181 -12238 -14871 -21324 -14219 -14615 -11380 -13062 -17710 -18173 -16963 -18275 -16021 -17092 -10094 -4776 -4444
15166 -4444 -6611 -9819 -10881 -1231 4178 5203 10594 23326 27828 18798 18069 14823 4900 -1886 -12557
15151 -12557 -24022 -28005 -21760 -10969 -8139 -3619 -8378 -11671 -105 -4505 -8868 -2024 2497 5350
15137 5350 3442 3093 4829 6434 247 4968 9041 2796 -8386 -5410 -92 -1683 -6812 -9254 -4426
15122 -4426 -6116 -13729 -10094 -4658 -2204 -4450 -2663 736 80 -5102 2813 9689 12816 11796 9416
15107 9416 7363 11903 12393 8223 4694 -1707 -12300 -4285 3313 1733 -5177 -3691 -6621 -6571 -7408
15092 -7408 -4187 -1437 -5896 -4278 -1118 1824 -1709 -2396 -4613 -936 -4180 -1859 1938 -1879 -1889
15077 -1889 -8511 -7710 -1176 -1471 -9541 -6049 -4578 -5943 -4928 -12690 -10584 -9021 -6610 2520 404
15062 404 6931 6353 1657 -4045 -3355 -396 -2651 -7477 -1035 2086 3116 2108 661 1346 10208 12900
15046 12900 5159 548 -2761 637 10737 13068 -1231 -3646 1264 4549 5499 3375 -5161 -9130
15032 -9130 -14210 -15746 -15717 -9234 -5864 10 -502 -5237 -4246 -3282 864 -3022 -3514 -5946 -6205 -92
15016 -92 -5014 757 8772 6784 -899 -5807 -5913 -6496 -5318 -6435 334 6728 5801 -3184 -2378 405
15000 405 2293 4651 2568 -1837 3056 -1570 357 -5805 -4730 -3139 -7989 -18456 -29838 -21519
14986 -21519 -9039 -5843 -8832 -560 1716 2411 3109 -884 -3649 -1633 -954 1993 4396 1812 1430
14971 1430 4791 1493 -2663 4447 10948 9381 12428 12727 9016 -4078 -7264 -4786 2559 7906 3757
14956 3757 1031 -3147 -8053 -14908 -11395 -2119 2669 1426 7390 10456 14300 12246 -782 -10830
14942 -10830 -13748 -13426 -16138 -18244 -11129 -3246 1178 904 -4575 -5385 -7028 -596 806 -5104 -7907
14927 -7907 2443 5075 5515 591 -2346 -2572 -5506 -8741 -651 4679 2832 4625 1569 2723 -922
14912 -922 -2469 -192 2846 8511 962 -9154 -13453 -12290 -2359 869 -2356 3564 -1290 -5333 -9771
14897 -9771 -6642 -10297 -12521 -8530 -5269 -6863 -8013 -2464 3739 6934 -1848 -5190 -3204 5197 13962
14882 13962 10218 6099 -395 -5447 -937 2900 372 -1381 -7674 -10053 -8943 -12145 -8598 -2248
14868 -2248 -3061 1622 3312 -2518 -2706 -3411 -795 2701 2263 1576 6227 9677 6025 6522 6806 13952
14852 13952 10782 11389 16766 11889 4550 8042 4901 6638 4083 -2444 -5092 4378 4578 974 -2844
14837 -2844 -8164 -7663 3432 7298 3883 3645 11564 13397 5969 4300 7497 11520 -298 -9387 -2559
14822 -2559 -2215 -4740 -1714 4635 6500 9152 9785 7610 13137 23953 28702 21703 11166 8875 15828
14807 15828 10084 4610 -306 -5409 -6019 818 -1943 -186 -249 -5042 -3327 1856 10900 14134 18668
14792 18668 13370 5547 6256 7530 5130 1162 3945 1348 2890 6822 74 -5490 -8850 -9688 -7215
14777 -7215 -1974 -3295 2458 2063 7003 8268 6954 812 -8975 -10443 -9400 -10819 -4489 -2890 -10963
14762 -10963 2610 11022 7486 8210 4782 10784 15002 11504 12074 -714 -831 5635 8147 10169 6290
14747 6290 4337 5769 8595 12846 18559 17569 13149 11726 10125 11489 19764 18725 6944 7867 9284
14732 9284 5204 2060 -4149 -5536 5600 13719 18413 11807 14074 11869 9527 12327 11204 18411
14718 18411 16321 11407 13916 25879 25070 12472 5874 3709 4551 750 -4389 -2806 -1327 4651
14704 4651 9623 6158 1621 5737 1340 -225 -2643 4872 1789 219 -14 2808 7511 10099 6923
14689 6923 4420 6725 11332 9554 3183 4884 4234 -2411 -3380 -3162 489 3475 2841 6730 11984 18005
14673 18005 18770 14495 12127 7429 2523 -4146 -6778 4775 13149 15741 19429 20860 25803 24816 17458
14658 17458 9279 13463 3313 2698 8403 5478 2322 393 4455 7768 10010 9990 4328 10007 11631
14643 11631 11613 9813 9394 5574 -2054 3931 14977 17843 22368 18350 18368 14631 16064 22629 29253
14628 29253 32175 31152 29226 22994 21719 21336 13422 9878 5131 809 1523 3993 6728 -409 -2840
14613 -2840 -7882 -7242 -799 3220 2682 5230 2608 6040 6659 6254 4693 3921 10710 13487 8913 9058
14597 9058 12976 8385 3306 1831 -4777 -8450 -10812 -11608 -10465 -6994 -3486 2410 5716 15827 21005
14582 21005 20949 20103 11562 9053 3313 6512 10395 10361 12475 17572 12667 5655 -2552 -847 3802 6091
14566 6091 9278 15664 14586 14728 10993 9202 8899 11617 12604 16222 11745 12949 13087 8608 6578 3160
14550 3160 9401 8175 3797 4344 562 -3419 -3584 2345 11216 8375 8997 550 1112 -706 -7903 -2455
14534 -2455 -1336 -412 -5508 -1603 1743 5995 4833 -1688 -412 1915 3816 6739 7280 12207 16917
14519 16917 16872 15508 16640 19387 15622 8927 13861 13097 12276 11754 6658 5190 4361 -2387 -1810 -767
14503 -767 6938 4051 4540 4411 -977 -4651 -878 6466 7780 6759 6692 7986 11158 7825 5182 2499
14487 2499 8217 12145 2349 1383 7328 8642 13626 16279 12649 17087 19311 9111 1863 6491 5508
14472 5508 1739 3405 9153 14077 10629 3547 5009 2438 3776 1872 5337 11342 11824 3252 6018
14457 6018 5242 3086 507 -1909 -1321 6776 15783 14344 8820 13268 19757 20667 13905 6838 9737
14442 9737 14101 10032 13425 19516 21579 18970 14882 6616 6363 10517 12335 20097 19649 14294 9484
14427 9484 6467 6478 17088 20372 14093 7515 6232 9941 13325 23651 23181 20942 17208 15809 12444
14412 12444 2275 1171 -647 -3355 7498 9439 3222 1787 -3853 -724 6793 13415 20773 18799
14398 18799 18682 19716 9532 7423 9087 12048 12761 9926 5326 8933 13634 10353 6254 781 7422
14383 7422 3835 181 3750 3041 5351 11223 12981 12696 11455 8628 4093 16226 29807 27838 18317
14368 18317 18811 17592 25113 17132 7048 10001 15663 12691 15529 16603 17709 25411 21103 15926
14354 15926 10471 9456 10169 12987 20369 22839 15307 16347 19271 17596 24824 21782 21587 22546 16551
14339 16551 16475 21263 24916 32880 33165 30253 21596 17075 17024 9721 10314 16028 20408 15854 15346 18981
14323 18981 17185 11033 9794 8526 15935 18699 10325 6575 5393 9900 15676 21630 19803 20552 20098
14308 20098 15404 9848 7865 13137 6036 737 8511 16286 18979 14642 8149 10484 21466 22064
14294 22064 21666 11269 1091 -2670 -1589 4330 4964 3077 2388 7297 16398 21183 21893 12763 11629
14279 11629 14334 17114 17972 16559 14202 20494 23205 23998 21752 18999 12990 10279 12597 18080 24768
14264 24768 18557 12820 7026 1922 -7259 771 4942 9964 12620 14896 13595 10319 4043 -1566
14250 -1566 2425 4414 5698 1738 -1301 2098 16066 24617 17748 14274 17324 16020 13701 18612
14236 18612 25070 21436 19916 17823 9874 8980 13468 18457 17852 13730 9001 -404 -721 -1571 452
14221 452 3513 442 2290 8092 16957 20938 22596 18917 9975 11500 12618 17985 17855 16326 11522
14206 11522 5607 1999 4352 412 4898 13999 18687 12656 14051 20032 23496 26977 22678 17217
14192 17217 13678 14040 11361 12144 14147 13648 10144 14210 23314 23821 23418 21048 18186 14032 19987 24272
14176 24272 19143 15518 14243 9007 12029 12358 16310 17015 22817 22889 27159 29641 18277 20324 23664
14161 23664 19668 20946 19001 19962 22071 22804 24012 17672 12040 13682 12876 14090 22257 20058 18386
14146 18386 16544 8017 4043 9195 8463 3589 -134 -5368 2575 15647 12792 9850 11255 5869
14132 5869 3564 6057 9291 9367 11819 17964 22168 23233 19039 12972 16856 22178 26760 22966 18906
14117 18906 18020 18629 21185 23518 25157 21197 16304 6558 6048 7200 11631 15016 11996 18743 21828
14102 21828 17940 12665 13679 14509 18023 21689 22078 20873 17110 24475 17376 16417 13270 8734 15877
14087 15877 31846 31354 29961 24531 21912 27596 28768 23295 19806 16376 18734 17181 12001 15571
14073 15571 16905 9789 4620 10650 10270 8075 11420 17068 8660 -1106 -6057 7970 10792 8000
14059 8000 11099 11936 23074 22018 21395 24536 19695 20493 26421 24705 20028 19600 22306 25359 34282
14044 34282 33024 24489 20919 12862 23706 29499 30176 27072 20913 17061 15440 16969 17365 25190 29341
14029 29341 25286 23443 27215 29378 26329 34155 36989 39696 40591 32363 27174 24378 18198 13540 17496
14014 17496 17790 15466 23353 27148 27435 24709 20104 17410 24991 33072 29611 29453 27397 21282 15583
13999 15583 26090 27839 19316 16306 22675 23904 16400 19290 25923 25123 30869 33911 29134 31892
13985 31892 33955 32572 34358 31247 35610 34327 22192 21050 32237 29735 24862 29016 28036 19628
13971 19628 24437 19477 18760 20956 17891 21781 23936 25723 28033 21773 23778 23965 26481 27638 31078
13956 31078 34051 27516 23745 20487 21198 24596 28792 35395 32540 28307 32548 29810 24974 25916 31455
13941 31455 30856 23924 28568 35061 38506 41706 40137 37878 38667 35631 30949 26275 29568 30811 35081
13926 35081 35872 35637 34557 29298 27312 34541 39835 38719 38283 34809 34165 31198 28596 28455 32003 37789
13910 37789 46416 44357 36880 39440 40367 37024 32948 34853 37078 43700 49232 56720 62390 65148 70918
13895 70918 79401 93084 111368 131204 169751 229619 305760 396294 467805 482363 438914 364177
13883 364177 290376 229303 171022 123769 93124 74914 67699 61141 51084 48858 48507 45521 40600
13870 40600 39276 40392 36423 27510 28608 27268 30837 30628 32033 32942 30750 26145 23021 21533 26011
13855 26011 25137 27279 32771 35949 35451 32732 33341 30597 27793 29287 31271 33346 37545 38983 34577
13840 34577 33327 34930 32053 29743 29747 36123 37783 38738 36797 32103 30309 29382 27975 30935 28033 29812
13824 29812 34072 33012 35637 39196 34310 29637 28488 22380 19959 25835 29986 29381 30705 30154 31944
13809 31944 38857 46351 42108 32752 20433 21807 25451 34239 33054 32644 26395 21470 23945 30034
13795 30034 39568 39411 36567 33837 30494 26254 25789 22814 28710 33798 34261 30071 20859 23577 22278
13780 22278 24291 34165 41526 38466 27369 17812 17852 19314 18253 23157 29705 37510 38307 34055 33712
13765 33712 35105 33442 28093 18713 12027 9924 12721 21538 26347 28385 19388 17598 24813 30164
13751 30164 25248 26760 31415 31761 34260 43414 49030 44329 40042 48308 49436 41128 40913 41069 32048
13736 32048 29595 33812 37240 40945 49508 48269 45089 46217 39499 35309 36051 42238 50694 46338 37460
13721 37460 36931 36108 32682 35851 38381 39052 42370 46881 37810 33924 29954 26721 32633 27560 32301
13706 32301 31327 32200 40112 47487 51633 52171 41743 42434 40980 38421 36249 38511 46607 50759 54894
13691 54894 55848 47352 45164 45872 38722 36702 43457 40995 34386 35127 38930 40232 34918 34081 36999
13676 36999 41640 43752 48286 55551 55949 52689 41305 40419 46160 48099 42395 50983 55800 57904 53488
13661 53488 49949 47839 52395 54133 54231 45073 39856 43837 49360 56131 55409 60910 65593 65534 68718 72718
13645 72718 78162 85121 80613 74109 72550 68158 65907 59841 61127 63518 65108 57482 57807 53433 55055
13630 55055 56965 59426 56004 53211 46343 46800 52782 48167 46909 54557 50697 41751 48096 47045 53532
13615 53532 59267 59987 55660 52651 51588 47594 52008 58855 61260 58372 50925 41542 43304 42469 44680
13600 44680 47492 48018 45889 39787 36878 41228 42926 43267 45188 47048 43785 43832 51260 43097 37318
13585 37318 41071 45118 49730 50053 52840 49739 49995 56849 55711 56792 56430 53294 56077 59920 52519
13570 52519 46837 46972 58227 61603 60021 50498 46680 48772 46727 50189 53716 53463 56155 59633 65555
13555 65555 71214 62915 55510 48441 49753 58452 55030 51660 49496 52573 49819 52048 55668 59422
13541 59422 61476 58820 58684 62285 60257 52454 52736 55445 60091 62936 51281 44090 42347 42843 41028
13526 41028 41198 46693 55304 64351 59250 51617 50016 52701 50323 43136 49716 51771 44770 44825 43670
13511 43670 51556 55992 54711 56481 53712 53341 59723 63458 63716 61593 59352 54758 50015 52690 58206
13496 58206 53304 47013 47774 49088 54186 56437 57407 60440 59254 70517 74144 69188 66442 68166 56629
13481 56629 50244 48773 53384 58290 62378 61024 61224 55943 49762 54197 60011 63682 65567 66696 65558
13466 65558 59337 58855 66520 69401 78017 78899 68894 63095 64991 64646 61927 62773 59818 62297 62119
13451 62119 57955 50076 51701 56908 63310 53442 47587 53295 50970 59075 66503 59666 60360 64143 70087
13436 70087 64315 60880 56240 53037 53467 53963 54628 50294 50613 54844 54425 56408 58263 56039 53622 53394
13420 53394 59604 58683 65001 67692 60977 61823 72459 81654 78938 78030 79175 79977 83213 78195 72848
13405 72848 70371 72437 72653 70461 71244 71783 77382 72134 70538 63500 66290 65326 59110 67727 69538
13390 69538 68851 67994 63316 59289 57244 59307 64924 60351 63108 67039 70068 67094 62734 67430 71906
13375 71906 83654 91451 84977 72756 70192 66145 69432 79190 81069 83204 79691 76573 72572 69483
13361 69483 79646 86837 88749 92060 95196 96553 91890 83235 83228 78954 69110 64371 69614 71982 75905
13346 75905 75985 80387 86221 87896 80461 72422 72864 78661 78436 81381 77481 76671 84528 92021 88968 92338
13330 92338 91904 93245 101842 101864 96832 93588 87672 87192 82279 86890 97973 101805 110646 125984 133484
13315 133484 144690 157802 174095 183735 180283 175101 172349 167540 160521 154606 149255 153406 159986
13302 159986 165125 171894 190258 209228 214999 210169 207181 202408 202426 208153 211879 219145 220497 213035
13288 213035 204885 189983 177030 168223 158093 164364 170647 184425 202154 216038 216852 211106 188368
13275 188368 178054 162658 146750 129324 120533 118509 118122 116233 114303 107905 107746 108939 100735 100979
13261 100979 102513 103701 101273 98352 107685 110192 112629 112133 113405 113390 117730 125205 130724 134126 152299
13246 152299 170739 176850 182899 199469 221888 253124 260232 250735 246400 236734 223478 223993 226376
13233 226376 221960 228516 245769 254251 260484 271722 280916 289760 286303 288111 292813 295458 309236
13220 309236 317280 312237 294468 278395 259304 249963 237062 226068 224668 225526 229977 238266 244086
13207 244086 255718 266512 260977 251303 229970 214944 195173 174958 158873 154126 147936 143693
13195 143693 141225 145499 139669 136637 131119 130267 133969 137041 131469 128952 133018 138385 138974 141389 142949
13180 142949 146398 157395 175796 187112 183974 181305 167914 156231 154473 146400 131127 116037
13168 116037 112336 118552 120175 121960 124485 119395 122815 120983 118452 114237 121573 120778 120476 119560 110641
13153 110641 108379 107383 117821 127432 131974 134320 138621 139229 135034 136119 139427 141805 144731 144210 145476
13138 145476 144543 143670 152301 163415 175362 189682 199195 207795 203487 203846 200329 192684 180774 167743
13124 167743 164706 166313 167288 162605 168753 166071 168124 178545 198253 210206 221591 230962 234218
13111 234218 224428 214576 206601 204377 196572 190748 183909 175059 177330 181140 196405 214003 221540 225271
13097 225271 220986 212337 212572 205539 201073 202975 211162 227208 234348 242419 248030 245308 236924 234735
13083 234735 238081 247289 253643 274037 296634 301466 299285 292794 283678 273104 263686 257777 253952
13070 253952 248065 248869 247083 256801 275450 289689 308433 325669 332463 323252 313838 306968 300210
13057 300210 291772 280436 285954 287342 292708 299365 300333 298915 286879 288943 299959 296467 294371 296204
13043 296204 304535 309329 305628 310399 312016 311141 309239 302902 309346 311569 317271 320245 313094 318777
13029 318777 327087 337454 344703 348175 333443 317405 307926 314158 325806 340539 352279 366508
13017 366508 394163 412320 407039 402726 393531 397484 414871 445058 473665 488485 486043 478523 470846
13004 470846 468730 473594 475336 475584 466108 454232 446592 434959 428978 435084 450019 470699 484602
12991 484602 484097 470001 441509 417704 402661 396223 393750 390508 388629 385687 382396 375678 362394
12978 362394 351629 344094 346284 346294 346299 344415 345710 337646 332241 331302 340245 356728 370135 383008 376979
12963 376979 364079 359087 340852 324915 311838 303970 301615 308595 318550 324210 330369 335197 333275
12950 333275 337728 340827 335431 329918 323037 324727 339135 372790 414481 468622 524142 562059 587961
12937 587961 590950 583098 558260 530169 505962 483511 471334 460533 461981 467039 486356 512632
12925 512632 549594 599246 640388 667753 679892 679403 658841 632520 611958 587255 570348 559656
12913 559656 546774 536848 524524 501008 492033 481182 479259 492997 513833 539255 560849 572808
12901 572808 580652 585264 588251 582039 577739 586675 602022 613487 633574 651583 674822 702104 715457
12888 715457 724130 742350 775236 815473 869623 919499 977853 1046320 1105225 1143047 1192766 1242606
12876 1242606 1303502 1377067 1470763 1589310 1728369 1892560 2097701 2347557 2629222 2958567
12866 2958567 3344916 3819965 4440548 5292430 6485427 8145040 10337645 12968515 15729453
12857 15729453 18121368 19606055 19890583 19057244 17465562 15660980 14144400 13255581
12849 13255581 13212848 14091786 15863831 18270367 20783423 22785891 23732415 23517150 22460290
12840 22460290 21208310 20486495 20730665 21888063 23442124 24643262 24800221 23681477
12832 23681477 21503882 18819725 16289511 14386178 13383828 13388135 14393534 16208204
12824 16208204 18401986 20343914 21378244 21092244 19495255 16941930 14010636 11222886
12816 11222886 8870351 7057875 5740300 4820605 4195602 3772520 3493033 3304362 3176142
12807 3176142 3082008 3022292 2993012 3006976 3059903 3147216 3273371 3458574 3689472 3957605
12797 3957605 4282536 4672021 5136713 5725969 6508256 7574600 9055681 11153925 14062917
12788 14062917 17882972 22355272 26845932 30493553 32450086 32364201 30510639 27606495
12780 27606495 24569858 22165227 20909275 21092283 22826774 25970443 29965850 33916412
12772 33916412 36806455 37889353 37152681 35242764 33212867 32127536 32494719 34088927
12764 34088927 36101756 37423124 37169896 35153738 31804475 27956769 24492183 22021738
12756 22021738 20863847 21153215 22807572 25443434 28335058 30600607 31409501 30354933
12748 30354933 27592728 23707104 19454777 15474235 12127997 9518500 7576701 6167256
12740 6167256 5162429 4437770 3892911 3468066 3118993 2820804 2575261 2359367 2188892
12731 2188892 2046012 1927270 1836734 1765747 1700319 1629539 1560019 1484310 1407546 1340823 1277813
12720 1277813 1233198 1213541 1208682 1203091 1190117 1182800 1178704 1172300 1173267 1185787 1200005 1212230 1211405
12707 1211405 1211237 1200433 1181421 1171111 1156606 1141626 1137630 1140502 1135407 1126605 1105237 1082239
12695 1082239 1070357 1078011 1096719 1109390 1113017 1112197 1095196 1073951 1055542 1039786 1041569 1051175
12683 1051175 1078321 1115398 1151579 1199303 1268393 1351057 1448014 1548186 1658465 1792132 1946351
12672 1946351 2123923 2346747 2607842 2899970 3221368 3580383 3970571 4412576 4984505
12663 4984505 5773100 6901479 8387946 10022301 11357461 11957743 11632049 10565042 9174172
12654 9174172 7834551 6771980 6053639 5682386 5629118 5900809 6522726 7553616 9016445
12645 9016445 10714634 12183051 12931597 12714238 11678811 10252162 8829884 7672473
12637 7672473 6862055 6372052 6140417 6129546 6348284 6797527 7499728 8498624 9912980
12628 9912980 11926839 14743766 18426958 22529465 26055484 27938578 27635047 25476287
12620 25476287 22377487 19256256 16721692 15015753 14121096 13945478 14403157 15547875
12612 15547875 17599454 20718083 24578607 28124165 30089348 29723634 27244841 23642682
12604 23642682 19976548 16974143 14987516 14083494 14208088 15142089 16409650 17383515 17635925
12595 17635925 17134893 16264649 15585018 15524447 16302759 17785099 19481047 20774764 21297705
12586 21297705 21115040 20670824 20383071 20345465 20301756 19944704 19154591 18162975 17408950 17315212
12576 17315212 18162567 19860729 21889088 23479435 24079584 23673169 22786835 22166889 22444599
12567 22444599 24190863 27959814 34309910 43226816 53020887 60231408 61914312 57925777
12559 57925777 50406515 41981965 34555189 28972512 25334720 23409153 22953465 23911199
12551 23911199 26471664 31047512 37989471 46911055 55978407 61757842 61245362 55006366
12543 55006366 45779699 36214223 28059907 21861951 17453073 14415455 12324877 10890114
12535 10890114 9972439 9474635 9367407 9680249 10521736 12002916 14126440 16544780 18535424
12526 18535424 19417895 18901216 17245826 15095979 13002119 11305844 10133043 9477013
12518 9477013 9304961 9588641 10385254 11782677 13789140 16108849 18085193 19068049 18726359
12509 18726359 17264122 15260673 13280698 11681295 10583615 9945414 9685018 9751242 10148496
12500 10148496 10906540 12122952 13965680 16711412 20821062 26870431 34976675 43790149
12492 43790149 50499754 53199554 51552401 46238235 39233196 32336579 26644594 22599390
12484 22599390 20135083 19061393 19212077 20610178 23524185 28368329 35269115 43152676
12476 43152676 49536076 52348181 50823372 45287210 37586490 29678609 22798935 17467673
12468 17467673 13570937 10784786 8768986 7286213 6172281 5337580 4721852 4261739
12460 4261739 3868284 3527681 3242889 3003724 2814722 2681667 2582373 2502243 2419271 2331428
12450 2331428 2236478 2143697 2066963 2017038 1988392 1966276 1946790 1941048 1944368 1964808 2018392 2100279
12438 2100279 2200979 2317012 2451153 2601871 2774662 2975486 3220308 3523866 3917989
12429 3917989 4427646 5084630 5930951 7081960 8734712 11233411 14952909 19774416 24201975
12420 24201975 25941872 24514793 21167825 17258899 13821340 11256463 9558026 8581771
12412 8581771 8164999 8217009 8742913 9863149 11777607 14698742 18446485 21910876 23368332
12403 23368332 22173965 19133947 15396687 11905386 9091981 7022293 5557792 4518298
12395 4518298 3766272 3196070 2764653 2437761 2176648 1965791 1793066 1652627 1536580
12386 1536580 1444182 1370779 1307671 1242131 1198177 1177367 1157950 1133136 1113286 1109514 1104600 1104651
12374 1104651 1110425 1126971 1152930 1187880 1226161 1248948 1255383 1248625 1226484 1187329 1150024 1119218
12362 1119218 1091333 1065324 1036914 1011434 1011364 1001092 982420 970122 963529 965901 984904 1004521
12350 1004521 1012060 1018472 1011662 998484 983716 973850 957220 951817 963093 989378 1016310 1045150
12338 1045150 1078800 1105746 1130337 1162959 1210370 1272562 1354752 1463933 1576532 1674549 1739614
12327 1739614 1748917 1713054 1640654 1558718 1504947 1488737 1487617 1491485 1488457 1465966 1415165 1348844
12315 1348844 1290730 1252368 1248493 1277598 1323313 1377527 1450764 1534261 1638332 1760261 1871102
12304 1871102 1929743 1946091 1940972 1942686 1987043 2059439 2114242 2118483 2086466 2057532 2037152 2044758
12292 2044758 2066491 2091658 2106198 2113191 2111158 2115570 2123135 2135047 2147327 2155143 2158137 2153508 2154298
12279 2154298 2175261 2224702 2306451 2427466 2585772 2784880 3020581 3300767 3635125 4064771
12269 4064771 4619406 5356356 6430039 8068091 10654405 14515841 19212180 22880953
12261 22880953 23607358 21603851 18217132 14667078 11676552 9403308 7800145 6699576
12253 6699576 5930879 5379365 4956584 4625222 4369691 4192827 4090748 4057360 4071603 4142404
12243 4142404 4259876 4417750 4626864 4885820 5178137 5494061 5826285 6170497 6539516
12234 6539516 6989361 7580003 8383812 9526686 11181821 13582913 16797614 20196063 22336790
12225 22336790 22403305 20961632 18987284 17288546 16274517 16041443 16545152 17701100 19501129
12216 19501129 21940451 24951584 28408003 32044947 35638974 39136090 42696951 46721873
12208 46721873 51788651 58645992 68344424 82429794 103207841 133734275 176698690
12201 176698690 231217913 289356326 337679456 365013073 367413302 347844979 314753982
12194 314753982 277073638 242316078 216807423 201524346 189519818 172364742 148953305
12187 148953305 123123369 99094277 79528922 64818139 54076980 46101476 39939587
12180 39939587 35040793 31088445 27857186 25277539 23353970 22070559 21385855 21212057
12172 21212057 21491991 22258731 23631601 25834382 29166815 34056340 41205172 51752239
12164 51752239 67008236 86786314 106801769 119725972 121558832 114995898 106460489
12157 106460489 102059726 104608184 110958542 113295469 106559809 92335970 75006774 58545251
12149 58545251 45162924 35255707 28291679 23488192 20178067 17899787 16305771 15166140
12141 15166140 14360591 13842370 13584873 13575913 13815939 14357870 15311214 16836181 19189933
12132 19189933 22792486 28383542 37140740 50244703 67184272 83273748 91240249 87845446
12124 87845446 75944820 60564411 45866724 34024227 25401777 19464303 15425367
12117 15425367 12609525 10574450 9054716 7859665 6888013 6098213 5455755 4940906 4542358
12108 4542358 4232097 3987736 3797678 3665988 3604029 3594558 3628210 3686549 3760220 3857292 4005786
12097 4005786 4263645 4688370 5355023 6393961 8050303 10654429 14272533 18037647 20247439
12088 20247439 19897497 17459086 14119449 10874510 8279067 6429085 5170336 4317814
12080 4317814 3717521 3281685 2962354 2741529 2587599 2504012 2472316 2466176 2456737 2422380 2358620
12069 2358620 2285211 2216785 2174576 2165687 2198984 2283290 2427166 2649430 2982485 3500844 4349516
12058 4349516 5764320 7998147 11021616 13971986 15429889 14757396 12552651 9797564
12050 9797564 7252363 5271576 3879617 2963447 2357581 1955210 1688147 1513777 1394401
12041 1394401 1303298 1241118 1203185 1174947 1144923 1112867 1063225 1010253 938649 850397 768983
12030 768983 718298 695202 683107 684978 676534 650556 629677 615077 604739 587054 561726 533360
12018 533360 500794 470148 436541 417485 398247 376617 363847 349543 334064 325805 327389 332707
12006 332707 345539 354333 360932 363400 372194 379043 375007 366882 351446 315456 276737 247712 223094
11993 223094 201581 192582 180986 177619 176227 173287 181209 189362 190232 201763 202571 202335 211027 221537
11979 221537 230809 235486 234850 224534 216629 212225 224171 248409 263722 282714 298627 314645 318887
11966 318887 315617 294339 266557 247416 231263 220447 212201 200191 200573 201869 200840 203654 220241
11953 220241 237967 258664 270005 275021 277231 272130 253343 230745 227222 220885 210609 197584
11941 197584 186513 180579 170107 160718 156836 145247 130800 123830 117746 120649 124642 120768 121760
11928 121760 116378 103028 83146 63630 43785 37003 31067 25307 20726 17017 7227 -2065 -2400
11915 -2400 -2975 -1368 2456 -7746 -8733 -12777 -28453 -40099 -43875 -45767 -37250 -14335 3334 8044
11901 8044 6563 17550 25326 27950 26573 33327 28988 30972 37017 37690 44118 43047 34735 41150 51287
11886 51287 54455 55080 56725 57863 63875 70772 66061 61971 60012 63735 63941 56622 51536 44416 29034
11871 29034 22664 23820 19636 16920 23427 35533 36923 34092 39663 44798 51113 60554 65008 68122
11857 68122 70722 77315 71652 70677 73421 75822 78654 75639 78063 80470 76485 75276 83934 95121
11843 95121 96833 90834 83253 83294 80017 76201 84442 84005 89184 87304 92465 95360 95273 88758 90613 91804
11827 91804 87647 83268 75094 72485 72689 75903 77108 72460 72106 67615 69002 72115 66690 59694 50494
11812 50494 51699 56448 59442 64296 65187 66387 64218 54180 55301 49073 49336 54778 50587 57541 67567
11797 67567 78288 92663 103065 114770 130293 149501 170491 191944 219910 243345 265544 293722
11785 293722 331195 389203 457188 539624 650427 797643 997121 1250697 1509458 1720502
11775 1720502 1818289 1795198 1686967 1504170 1285675 1062454 845642 662051 509668 405433
11765 405433 332183 280088 249113 226753 209004 189781 176335 155176 133013 122106 112832 98396
11753 98396 89203 80907 78598 90412 106628 112561 117290 114943 108323 96331 80185 69487 64505
11740 64505 62548 63407 66310 76527 73502 77880 81415 80410 76874 71350 61203 65545 75438 77858
11726 77858 82100 80092 84125 97147 104978 101549 108426 130303 146269 166106 197348 244645 312603
11713 312603 404558 506160 576494 587595 532864 448641 365041 295004 230303 183393 158006
11702 158006 136907 111529 92037 83612 87782 91579 89789 95978 111234 124799 139042 159047
11690 159047 188431 220822 264474 322232 391824 464828 526815 559409 552892 512646 472864 453803
11678 453803 462719 504781 567205 618526 611383 554024 474536 396961 317387 254892 215666 180584
11666 180584 155222 133969 128789 119197 110084 111265 121656 129774 130225 136083 148139 168859 201265
11653 201265 252337 313710 389910 453045 480228 464216 423704 355990 286026 223420 175184
11642 175184 149960 126472 104224 90194 85585 76639 63671 57289 50742 48977 43774 45084 44690
11629 44690 44315 41957 41217 43579 47268 43659 45017 47692 46224 44002 52989 57294 56153 56689 68284
11614 68284 78755 95253 114743 118545 116653 107274 93499 76566 72783 70381 73176 74040 76800
11601 76800 89052 94984 101478 119510 143334 160399 168923 170787 167254 164173 166272 161298 164831
11588 164831 170946 185565 197055 214646 235572 251838 265993 275251 284866 283485 278714 275677 262015
11575 262015 239313 230841 219980 206208 198125 196022 190794 192672 183650 171979 162039 142656 118025
11562 118025 105297 98289 84231 75374 76068 72166 67901 63224 66522 65431 55523 59208 72837 87994
11548 87994 95577 102036 108547 110944 117397 122590 132914 157236 190559 226326 229802 216625 192016
11535 192016 179766 167121 150405 143595 154541 163531 173867 196934 224413 261554 304275 358123
11523 358123 413292 455404 470010 482619 491312 495882 495359 501449 505446 517267 524046 515277 500470
11510 500470 485364 459291 440895 421151 405671 391490 397943 423946 463913 511720 550520 582621
11498 582621 608340 624747 623385 600725 563902 523578 484029 427999 378626 330757 286629 259288
11486 259288 251984 253498 267586 289497 327603 376698 433168 484296 533212 574054 594164 583125
11474 583125 546498 503758 456978 406523 360473 318152 280209 246547 229611 212664 199470
11463 199470 203719 226902 256730 288659 311490 318101 325037 332617 336854 344182 350196 354468 354329
11450 354329 339428 296773 252726 212907 188117 172038 160564 153791 150059 146622 158884 179740
11438 179740 209760 240175 294853 359272 412512 438951 423233 375176 308817 245248 204234
11427 204234 177471 150537 126414 116925 117891 108452 109922 115342 118672 119350 114957 104241 101604 104691
11413 104691 98580 94125 94211 98970 102953 104782 96253 94098 106508 120608 125029 126171 131068 142900
11399 142900 161870 173993 187658 214066 246337 300100 375219 467271 536417 559892 552676 513916
11387 513916 450970 384288 311587 257631 232906 204301 177537 166168 154866 153322 155490 154899
11375 154899 158605 163234 164104 152081 142817 142127 150021 152961 149782 159284 160694 164914 167781 174378
11361 174378 176911 183940 190868 204891 211031 223911 237507 267101 306220 357289 424857 520899
11349 520899 638294 764173 870537 920795 903047 833515 742863 658677 591509 557936 561891
11338 561891 594741 640650 660188 638668 589131 525098 447776 378373 332356 299994 274246
11327 274246 250766 237597 231679 232652 230994 230609 236283 244128 246497 250640 247890 245147 242334 241903
11313 241903 244269 260031 278394 295970 328626 364498 394465 449992 520529 595413 674412 733294
11301 733294 770917 784579 797046 822992 878962 946468 1001942 1034218 1036705 1017067 998258 991938
11289 991938 980686 952632 903471 854562 824081 818317 831915 868144 916326 962554 989324 974321
11277 974321 921457 846192 770496 699888 629458 575148 536077 521361 511925 498201 490848 489842
11265 489842 491289 514193 555676 606639 652937 694717 727723 737616 719442 687384 654406 617250
11253 617250 594215 596203 627623 675152 724126 757908 748559 700142 638703 581395 535202 501824
11241 501824 481835 477060 482465 504226 534000 562095 586626 609290 624890 618350 609899 602902
11229 602902 596650 598616 608089 622269 640690 654921 662368 668216 673139 672595 681794 678813 678345 681315
11215 681315 690451 701219 715334 734949 755032 780183 814137 852768 881396 902649 920890 934230
11203 934230 934817 943975 957412 965953 987698 1010780 1058918 1134612 1232985 1353630 1503159 1654584
11191 1654584 1782168 1877914 1938126 1971857 1998714 2025704 2067500 2126280 2217846 2349773 2519583
11180 2519583 2728434 2997911 3330534 3748762 4278072 4966179 5866272 7056253 8651561
11171 8651561 10785252 13474212 16563312 19711022 22540473 24620046 25658382 25732303
11163 25732303 25092333 24211626 23672872 23939354 25221914 27398890 30183433 33172842 35876955
11154 35876955 37894802 38948373 38901552 37788904 35731664 33046808 30086732 27247220
11146 27247220 24979416 23645601 23386675 23996845 25029518 25946606 26142338 25257854 23292630
11137 23292630 20449879 17156174 13934464 11110934 8833674 7098668 5818721 4870687
11129 4870687 4168650 3642027 3246366 2950121 2727348 2559581 2447156 2377102 2336221 2311603
11119 2311603 2305685 2325152 2358141 2394814 2442673 2523066 2626186 2755418 2925936 3135007 3393991
11108 3393991 3717991 4110798 4593607 5199236 5970728 6993804 8405945 10361137 12985822
11099 12985822 16238429 19818171 23287442 26168377 27991551 28623305 28276769 27380381
11091 27380381 26538647 26359507 27243781 29249604 32100495 35379514 38576753 41167955
11083 41167955 42786830 43214038 42424862 40532129 37780779 34558141 31286080 28415683
11075 28415683 26406997 25524293 25743864 26677805 27783664 28427581 28049740 26459879 23807519
11066 23807519 20432738 16839216 13505494 10694632 8483478 6811951 5557224 4620597
11058 4620597 3919186 3370822 2943031 2593346 2305091 2071366 1882336 1727940 1593589
11049 1593589 1474441 1369033 1283029 1204508 1135723 1071734 1018520 973230 942178 910881 875964
11038 875964 850486 832363 803504 763396 728553 703272 673243 644935 635693 625787 611935 592537
11026 592537 571303 553954 536669 516175 504753 482932 465782 452676 440422 426896 418988 413886
11014 413886 411840 413376 417167 415411 417032 429740 427529 419763 403100 387776 369128 347655 339251
11001 339251 340888 348729 358533 363378 377989 400345 424340 440735 448074 436841 423314 406694
10989 406694 389477 367703 352256 343857 343045 349014 342489 342307 341534 343355 341790 342525 349623 351835
10975 351835 361998 378509 410311 451866 486885 518413 547796 579240 625165 699118 796824
10964 796824 891208 946410 933994 863532 784083 710732 668759 647854 632287 627263 621666 604076
10952 604076 569359 535480 513576 489081 474071 468199 481442 507497 531625 571399 624377 695204
10940 695204 786392 906623 1018183 1094049 1130646 1144535 1179889 1246939 1301479 1307460 1245274
10929 1245274 1158659 1071966 1011765 965854 923551 892146 861516 819353 791928 770627 748411
10918 748411 729886 733965 744122 758788 776282 800085 833385 876365 938972 1036162 1165164
10907 1165164 1289749 1380488 1398845 1357538 1289062 1228412 1192321 1191567 1229883 1294030 1366341
10896 1366341 1450978 1540813 1642201 1761110 1902908 2078134 2284776 2534975 2855494 3268996
10886 3268996 3778226 4407841 5227793 6329095 7767529 9487151 11263079 12790611 13918179
10877 13918179 14524938 14600608 14345669 14085161 14151183 14803254 16197619 18310904 20973156
10868 20973156 23837842 26495452 28611694 30024639 30581114 30212772 29194411 27844800
10860 27844800 26378668 25128170 24407275 24359150 24952300 26073340 27481293 28730685 29481110
10851 29481110 29521524 28633480 26784487 24219016 21282474 18414454 16003100 14279067
10843 14279067 13313937 13009813 13130645 13320556 13313012 12926068 12012010 10624022 9027196
10834 9027196 7499299 6199067 5184988 4448848 3938582 3589115 3343749 3153390 3000028
10825 3000028 2877386 2793991 2745175 2745921 2784131 2863180 2981095 3145307 3352597 3611310 3945757
10814 3945757 4372074 4923955 5653356 6664824 8075066 9936316 12158091 14384278 16222639
10805 16222639 17478397 18063827 18011206 17609768 17268824 17399095 18320193 20206772 23019967
10796 23019967 26465912 30070883 33273188 35645767 37023648 37291189 36460798 34914352
10788 34914352 33075531 31289195 29942180 29369324 29622129 30545006 31973135 33598450
10780 33598450 34900703 35488414 35167306 33757150 31318496 28172920 24730367 21458519
10772 21458519 18745071 16826906 15757636 15429050 15541163 15664419 15498383 14860532 13648839
10763 13648839 11960894 10068989 8240158 6651216 5378094 4388757 3633193 3065548
10755 3065548 2623314 2284288 2024912 1814699 1641792 1491405 1374339 1273807 1201631 1139251
10745 1139251 1078299 1027532 972845 918760 874303 832830 779399 739491 709013 685377 670696
10734 670696 658490 642600 635285 629311 614788 599566 579835 561682 546323 532197 524598 514790
10722 514790 510494 517148 525969 547295 568678 571574 571535 551395 517187 479091 441469 407812 382683
10709 382683 361755 338856 324127 319905 305147 289364 280928 269982 254991 241324 229499 220774
10697 220774 221248 218559 219159 234124 252111 259132 262709 261645 248397 242207 231553 222354 210882
10684 210882 207473 196417 195139 200369 211364 225450 233907 239544 243606 247330 251827 251331 240682
10671 240682 230875 231961 231565 226585 234325 252574 268372 283856 303751 319086 323381 319715 320336
10658 320336 320516 319221 318194 319501 317514 325212 322976 330657 344797 358514 374914 381287 381395 374686
10644 374686 369939 358257 335788 316318 309043 306445 307414 309971 313364 316769 318583 313655 313628 323693
10630 323693 330194 349954 384958 447532 518123 580853 617687 627601 605030 544566 464563 391776
10618 391776 325621 275686 241287 207803 188051 175342 165090 166627 177772 184894 197909 216608
10606 216608 232844 246651 264980 267543 261569 260469 262654 254549 246356 243521 231662 222742 231016
10593 231016 240683 244247 247626 256048 274294 301751 349870 413118 497559 585277 652841 682067
10581 682067 677235 633697 553810 467098 393626 333999 287938 256456 226019 210708 203425 188974
10569 188974 177887 174930 171932 174668 174692 177089 175700 180296 189990 207353 220932 233046 242827 257605
10555 257605 286889 329407 393172 487743 595889 699710 761213 778990 741524 669061 586632
10544 586632 516196 483300 483716 506491 553928 635495 737651 855491 974699 1087240 1181335
10533 1181335 1251387 1266318 1225878 1116370 971621 830870 710711 620131 560429 521355
10523 521355 517036 517157 548604 614543 695650 772428 813260 794691 736844 661961 597440 547539
10511 547539 517101 496887 478072 456667 451529 446086 453796 485648 553037 641106 744869 818156
10499 818156 848184 854180 837762 807676 774012 738084 697792 639308 569111 487601 410971 345361
10487 345361 294969 253607 233062 214380 200769 194357 184129 177425 178027 176235 171481 169484 174743
10474 174743 183172 190652 192306 212428 244037 271819 299383 336103 356546 353526 352871 343476 324807
10461 324807 312143 296933 283672 270168 254984 247510 251074 258162 281365 315447 339759 364320
10449 364320 385193 383834 367442 344955 315452 297585 285033 286490 284242 289164 295930 309736
10437 309736 333257 353161 362416 356204 346053 330409 318274 299245 274603 265131 257537 257603 260967
10424 260967 264628 266910 277668 289524 310074 334964 347977 345060 336531 320890 308036 293090
10412 293090 279431 273066 265998 256148 248807 231531 220485 217821 201590 180133 167131 157700 148022
10399 148022 130967 127125 125890 118774 126891 136987 143324 142973 141600 138503 134586 136215 140367 137161
10385 137161 128390 132967 142855 148029 147736 155783 167206 179082 188266 196001 203548 212622 212384 213656
10371 213656 213980 215385 208744 202170 202737 207724 228684 249654 276870 296795 309590 320498 323534
10358 323534 329271 330559 318606 304166 299566 297072 293885 293977 297715 310302 313620 315225 322450 327493
10344 327493 323172 308777 294846 277443 274511 271778 264704 264031 267179 269790 275815 277224 275429 279586
10330 279586 279497 278189 274116 271173 279080 287462 290553 289788 285803 269897 255969 243082 229778 216196
10316 216196 207663 205184 202887 199765 196025 200221 206403 207519 208885 214110 218899 221474 238283 259035
10302 259035 267898 264999 268651 263399 246865 228848 214051 209827 207268 199927 193950 200068 203002
10289 203002 213261 221531 229011 240145 259336 276239 287044 297800 307259 327541 362088 399292
10277 399292 430251 457133 478923 496031 489827 474283 445303 410693 387554 365056 350087 334694
10265 334694 327359 325238 326667 332387 336761 344484 357266 378039 397045 429944 459004 470385 494638
10252 494638 526014 549109 558265 564304 562751 558555 556450 563621 560870 564894 564093 573749 579456 575774
10238 575774 566773 562197 568423 578057 585430 587925 591919 603637 601522 606479 607017 611909 614462 619639
10224 619639 636681 662178 701050 743071 802758 876563 949341 1038052 1141156 1250292 1370267
10213 1370267 1492215 1623669 1762177 1911953 2091709 2307658 2569454 2884508 3248879
10204 3248879 3682294 4197140 4841473 5664521 6775926 8330185 10496968 13417899 16984654
10195 16984654 20707288 23858690 25806882 26146019 24805153 22140183 18820397 15517642
10187 15517642 12678520 10478849 8914450 7883893 7249844 6944564 6931094 7201806 7788164
10178 7788164 8781450 10346342 12687294 15885127 19666199 23306881 25975268 27088733
10170 27088733 26364456 23920946 20354338 16485727 12951937 10066866 7885311 6316842
10162 6316842 5210576 4417763 3845593 3431187 3120848 2881811 2689735 2545943 2443844
10153 2443844 2376494 2328103 2290323 2267961 2261386 2269306 2299809 2356257 2426890 2519817 2646467
10142 2646467 2783440 2936611 3125907 3357475 3630240 3961699 4370373 4872216 5480203
10133 5480203 6239756 7189533 8407846 10041808 12319142 15489712 19718616 24859078
10125 24859078 30382334 35645435 39966034 42581036 42992333 41255237 37821796 33252250
10117 33252250 28230438 23441042 19368622 16240336 14068742 12728111 12079084 12033670
10109 12033670 12573504 13792567 15834387 18871768 22921001 27668777 32580532 37022249
10101 37022249 40316627 41792985 41112681 38470735 34316400 29234409 23912720 18995165
10093 18995165 14859479 11626856 9201300 7431758 6142105 5187276 4465408 3914757
10085 3914757 3485278 3148883 2880627 2660795 2487459 2332973 2209960 2105873 2017419 1936315
10075 1936315 1867049 1812772 1780483 1766328 1766164 1785920 1841071 1910631 2006964 2130521 2277445
10064 2277445 2449461 2670142 2934643 3264862 3674436 4209124 4938629 5969028 7454900
10055 7454900 9588059 12449067 15748651 18842788 21064585 21953900 21299260 19231362
10047 19231362 16316298 13257066 10576795 8493012 7021572 6050774 5463271 5160827
10039 5160827 5095369 5248764 5631794 6291665 7306575 8804773 10880519 13438989 16116273
10030 16116273 18360720 19665568 19728307 18498530 16232718 13458807 10700036 8320527
10022 8320527 6432788 5012081 3984378 3235684 2685933 2271830 1959100 1715926 1527393
10013 1527393 1375205 1254014 1155063 1064475 986188 919446 877083 837595 804381 761597 725001
10002 725001 682631 651064 623256 615488 612351 601218 587037 566087 538302 507728 474906 435455
9990 435455 395507 362416 328697 311216 304985 307741 305436 316672 323050 321601 324221 329907 332779
9977 332779 331108 334935 338867 336641 332133 318956 296256 280095 273808 271209 257980 240920 227661
9964 227661 222718 231641 232317 229964 232253 232750 238729 241185 255848 264970 268292 270745 279172 286125 284640
9949 284640 287527 302230 307312 312896 313222 318303 329748 337866 349567 354065 359483 372473 391613
9936 391613 407142 418221 433153 442244 437398 426543 417770 416256 414752 418627 432347 445408 458864
9923 458864 462778 454270 449642 451053 448733 444367 433447 420596 410311 406770 415946 429431 440026
9910 440026 460410 472168 492511 516094 537213 556917 573205 600087 636221 666227 699512 736157
9898 736157 777666 817394 862240 910463 974105 1040165 1106713 1172886 1252834 1352756 1476407
9887 1476407 1613838 1762962 1942023 2145593 2374391 2646641 2983169 3396309 3894008 4489459
9877 4489459 5203951 6084173 7187222 8581786 10423977 12950771 16507744 21410812 27693908
9868 27693908 34781496 41499564 46513735 48761579 47749424 43739644 37685367 30855451
9860 30855451 24365535 18885451 14624197 11476719 9206529 7565664 6358054 5442733
9852 5442733 4733038 4180214 3733549 3368276 3065823 2814581 2602688 2432789 2290409 2179119
9842 2179119 2091026 2023080 1972219 1938777 1916596 1918597 1928083 1948357 1989940 2044675 2102934 2177867
9830 2177867 2265239 2368304 2495932 2635193 2792583 2971391 3172010 3400350 3651074 3958154
9820 3958154 4324087 4741064 5242643 5841449 6558741 7423794 8482244 9805802 11511997
9811 11511997 13777411 16878291 21136401 26784783 33661596 40989045 47560510 52256718
9803 52256718 54382872 53940667 51723609 49141043 47607090 47836165 49495963 51471895
9795 51471895 52426054 51333249 47788257 42161412 35417986 28645812 22659029 17831223
9787 17831223 14148425 11424784 9403302 7891702 6755884 5878301 5198723 4652823 4197691
9778 4197691 3810263 3480449 3194517 2936631 2704247 2503167 2336204 2192327 2066621 1967877
9768 1967877 1896685 1837032 1794052 1760837 1745658 1743555 1762570 1788892 1817169 1855982 1909544 1972800
9756 1972800 2052672 2146067 2255901 2380844 2537252 2705833 2905891 3151971 3450936 3812928
9746 3812928 4254366 4816627 5510370 6372923 7490747 8971446 11006114 13870880 17836098
9737 17836098 22973750 28924542 34773453 39339622 41629162 41123635 37903840 32731013
9729 32731013 26743088 20987270 16098014 12301557 9505476 7487986 6037135 4970387
9721 4970387 4181955 3579013 3111119 2730507 2419860 2154070 1914538 1704112 1532924 1384892
9711 1384892 1254100 1148066 1068353 1006164 952545 907738 871220 831191 782980 734145 686590
9700 686590 634153 587406 551555 514825 487381 460733 442412 426118 417470 408028 405706 411607
9688 411607 423987 440663 459069 472345 483141 491836 495838 490439 476510 457081 434911 402033
9676 402033 366690 345476 320464 295451 275433 255460 234308 224849 219868 209910 188641 160757
9664 160757 142501 129528 115183 104527 93315 84140 74588 69951 66548 65269 56475 55682 57880
9651 57880 59985 58159 53620 56965 62049 67389 61383 57522 59406 61424 72058 76500 90758 105566
9637 105566 114473 124447 143299 158736 167176 161892 142978 121673 107693 87051 73891 70905 66895
9624 66895 67555 70127 72660 76342 80204 91882 94595 101374 117604 132209 149220 171918 183093
9611 183093 190525 189393 183419 172837 163925 146161 119861 95366 69467 53697 45468 31930 26458
9598 26458 16727 6998 2852 -2599 -2470 5534 8632 11337 9051 9809 5585 -150 -5337 -3226 -9801
9583 -9801 -10839 -3430 -620 -6132 -1758 6852 10101 2857 -9136 -11612 -14794 -11582 -10721 -11939 -10941
9568 -10941 -12709 -14243 -20848 -20435 -13357 -4699 -2705 -1384 3981 7171 -1086 -5796 -8226 -9431 -7588
9553 -7588 944 9447 8617 3839 967 3793 2583 -1478 2282 -5621 -3762 -2903 -3123 -8706 -12648 -16805
9537 -16805 -17685 -15818 -8605 -15139 -8642 1589 277 -1293 -3020 -261 -4138 -7121 -8220 -12088 -16895
9522 -16895 -25182 -22833 -25416 -30013 -28284 -20521 -18239 -24353 -31829 -44071 -42551 -37717 -34168 -33216 -39877
9507 -39877 -37374 -40024 -37670 -24878 -21166 -22146 -25197 -22761 -24966 -22638 -14072 -2551 -2746 -5556 -6877
9492 -6877 -4509 -2915 3408 584 3369 6967 11193 10312 3120 3599 6576 6528 11276 12289 10441 374
9476 374 -1663 -6886 -13211 -15377 -11443 -14615 -7586 -385 -1218 11144 20071 19421 22522 24707 17120
9461 17120 25369 40936 53148 70381 90846 94364 108550 138670 158224 185410 207010 220292
9449 220292 217488 207147 189428 159740 121790 87875 66020 53382 40838 33334 19729 7365
9437 7365 4278 7694 11900 8241 -465 -8800 -10500 -6769 -3567 -1826 -3578 408 -434 -8051 -10042
9422 -10042 -8773 -9026 -4805 4826 -2205 255 3045 -1076 -931 -6256 -4311 -3889 1016 8269 10443
9407 10443 2913 2675 14228 19345 19867 23213 26240 34083 42943 52458 69660 78761 87638 114222
9393 114222 142363 183554 213808 237367 262188 284810 284222 271157 270484 269740 275062 283603 287970
9380 287970 292088 289865 262863 228427 199097 169872 129684 95618 75231 72897 65906 47800
9368 47800 37605 33436 19490 7152 5188 9965 12750 12236 7395 8380 15330 17978 15571 11140
9354 11140 8605 11019 17119 16626 13213 10757 13162 15769 16805 20788 16422 18416 27119 22640 8709
9339 8709 2948 6489 4547 6355 10740 13348 18552 23091 16942 14342 21485 28200 36692 47244 57253
9324 57253 71925 94383 117329 151139 180697 206858 215826 212812 209078 194690 162399 131836
9312 131836 105052 75511 53758 41184 32768 26937 31206 24202 15431 18541 20797 20265 10665 8215
9298 8215 9620 12235 13337 8543 -3635 -12556 -14921 -6641 -2168 -4249 -7765 -6598 -11057 -8547 -10515
9283 -10515 -7550 -5740 -2348 1573 5849 10487 9439 5444 5426 6699 -467 6164 15539 10677 7676
9268 7676 3089 -6764 -16733 -22748 -12901 -3268 -86 685 3706 -2215 -16153 -13393 -9408 -7554 -5105
9253 -5105 877 -1023 -3193 4725 8224 6933 3776 248 -4754 -5348 -6432 -6320 -3164 -1388 7283
9238 7283 4065 -6494 -14524 -16786 -22437 -27635 -33900 -31070 -29864 -30902 -19236 -13365 -14538 -12777
9224 -12777 -8047 -12426 -16937 -10136 -6458 -8535 -5950 -6202 -13553 -16556 -22446 -19925 -11068 -9604 -9605 -13618
9208 -13618 -20644 -17922 -20684 -26314 -26016 -23338 -22685 -18921 -11648 -14283 -5040 -4759 -5875 -10924 -19876
9193 -19876 -17450 -16017 -14067 -13038 -7560 -5002 -5035 -10071 -6321 -8793 -10651 -3747 -9590 -11721 -11909
9178 -11909 -9598 -1491 3193 238 66 4192 708 -9980 -18090 -21129 -19558 -12149 -16739 -15046 -12427
9163 -12427 -16745 -18527 -24097 -21972 -17993 -18905 -18477 -14456 -13120 -18427 -27383 -21426 -13030 -14032 -14195
9148 -14195 -11110 -15026 -17923 -24739 -29705 -20623 -18516 -18497 -21192 -17906 -6897 -6089 -7023 -8164 -13171
9133 -13171 -22044 -22093 -21874 -21401 -15150 -16400 -17546 -13324 -1309 1146 -6629 -12847 -15022 -17026 -18081
9118 -18081 -19957 -24906 -15160 -3686 -3702 -7372 -9368 -17491 -19229 -24752 -16639 -13979 -11363 -4608 4313
9103 4313 5043 4041 389 439 4428 220 942 -5236 -11864 -15889 -15143 -21987 -21557 -15838 -18206 -18518 -9039
9086 -9039 -7447 -12571 -9365 -5800 -3472 -5419 -3408 842 -523 4578 3678 -3303 -6690 -11120 -10969
9071 -10969 -143 -1707 -11638 -17606 -21835 -9514 -5885 -5191 -139 2763 2208 955 1160 3459 4746
9056 4746 -3625 -10221 -12345 -10765 -12805 -8340 2176 2565 3761 -250 1679 -4191 -4877 -1755 -1919
9041 -1919 -7126 -1904 -3626 -5500 -780 2348 1157 -840 -7054 -7796 -6556 -4349 -9033 -16517 -11574
9026 -11574 -8201 -13901 -20189 -16274 -17180 -16398 -8965 -9300 -6866 -4452 1874 11390 9509 9109 9842 5370
9010 5370 8924 1584 -11451 -9508 -5244 -3791 -7735 -5592 -7646 -1953 1462 -4398 -8296 -11265 -14465
8995 -14465 -11255 -5799 -4898 -6178 -1236 2725 1917 2099 1528 -2466 -5234 -563 -122 -3051 -2880 -2946 -5532
8978 -5532 -5212 -8301 -918 1979 5505 3633 9271 9468 3413 2926 2132 8566 11464 4672 2450 5011
8962 5011 3260 1636 91 1416 -3124 -6293 -1791 -5220 -7882 -7663 -7762 -6388 -7577 -6378 268 -82
8946 -82 -364 -4888 -1135 150 -8382 -14215 -13127 -7636 -6344 -2228 1100 -1118 -1051 4640 -5613 -12850
8930 -12850 -16847 -16090 -11667 -6615 -4606 -6450 -10076 -12311 -7372 -5622 -4491 -1548 3274 2323 -2495
8915 -2495 -9606 -12266 -7211 -3306 -8762 -6918 -12062 -11068 -4754 4346 2599 4020 3372 4474 1420
8900 1420 -4362 -7316 -9968 -7781 -9442 -9648 -3331 -7389 -9826 -13628 -15546 -13720 -4422 790 6855
8885 6855 8844 8589 12071 6221 1146 -6804 -8728 -10084 -8983 -7374 -1242 -2497 -4408 -8529 -8108
8870 -8108 2411 2072 -3944 -6030 -5073 -3735 -1601 -3575 -5191 -4823 -6731 2263 4044 3290 -1731 -8269
8854 -8269 -11653 -13406 -10223 -9106 -2730 -2604 -8999 -9322 -9119 -2308 -4359 -4241 -4643 -12212 -10684 -1642
8838 -1642 1834 -3705 -7246 -6731 -12468 -8446 -973 -4024 436 -1297 3431 12554 16053 7914 3350
8823 3350 2371 7034 8114 1399 380 303 5442 8686 9459 17372 22415 17997 14715 9455 8384 4682
8807 4682 3539 9822 6723 3696 10191 7326 10184 3831 5098 4152 2754 4917 8237 7232 6719
8792 6719 14454 17393 12395 13085 16913 20497 14989 16217 23330 22579 19967 17711 11458 5521 1540
8777 1540 4062 10500 13503 9916 6495 -859 1555 6320 9798 16808 23106 24755 21659 16644 19539
8762 19539 22615 25822 22444 17773 15273 17175 22254 26789 27107 21445 19929 22138 20771 20529 13710
8747 13710 12462 17750 19569 27546 30487 21965 23150 28272 28578 20716 24824 34004 38958 38018 33733
8732 33733 32851 36240 27051 17837 25673 35314 39105 37391 34465 25787 21843 23258 28106 42305 45196
8717 45196 46168 50042 52456 52243 47178 40641 40794 42891 43602 45341 47661 47562 48790 46994 40864 45563
8701 45563 48243 49725 43390 41193 49109 55993 56071 58914 63903 59635 54455 62788 68553 62086 64913
8686 64913 65349 66116 69984 73347 69944 65027 69461 75783 82864 83809 85251 91461 91439 93813 98603 99461
8670 99461 108995 135245 152150 161703 163521 152737 143885 141859 138919 132476 125703 130548 137081 144871
8656 144871 156481 157153 168334 172579 182153 187349 195471 207505 222963 235440 249639 261840 281885
8643 281885 305427 321725 339726 358941 381784 399117 422550 436471 435535 426365 413430 389126
8631 389126 365046 337755 313613 295785 273915 255471 257776 275312 293105 298228 282271 256360
8619 256360 216460 180541 150447 131010 123154 119428 115375 106452 96532 92870 99387 97217 89475
8606 89475 84506 85917 83531 80799 80562 84487 83424 90524 93789 95385 103134 109074 107690 109301 104033
8591 104033 97961 93709 84813 72330 71931 79238 81070 80045 83373 93957 112858 132342 139070 142910
8577 142910 142702 136102 121816 109686 95177 85872 71972 66244 59424 62382 61363 59207 58923 57746
8563 57746 57667 60831 58145 50879 51105 50075 56824 56671 59643 66678 79870 107283 141697 154953 149221
8548 149221 134638 114791 95639 83272 72403 64743 64642 53953 46050 45071 45783 39706 38513 40824
8534 40824 41533 51674 58205 59085 52120 47880 49166 52812 52523 61388 67129 62109 60034 54351 49824
8519 49824 55568 58748 52873 52333 56003 57569 53142 50406 49885 45199 46187 46746 52886 63515 58976
8504 58976 59797 56221 48166 48566 39706 34472 27967 28687 32863 29629 25121 20202 18191 19164 15527 17905
8488 17905 20824 27608 30763 30971 27359 29481 32815 31435 25197 20333 19555 15433 19431 14635 19421
8473 19421 20045 20184 24293 24054 23725 22845 23049 17985 19267 28795 27889 15920 10231 11658 17473 20787
8457 20787 26581 21048 7271 13808 22919 26039 24773 23677 16735 15641 14450 20788 19843 19773 18850
8442 18850 16598 18126 19117 14890 9095 5937 12923 13951 12525 10081 10483 13701 14533 9134 8259 16799
8426 16799 24027 19186 14193 8071 9122 9373 9024 7247 6313 8599 8426 17448 23822 23022 24403 22277
8410 22277 20056 16377 16759 13169 9448 7392 -561 -5656 -4644 348 2259 2886 2942 -5085 -9580 -15193
8394 -15193 -8985 -5074 4391 14015 14172 16735 14761 10810 16725 15824 16845 9958 8970 15003 17144
8379 17144 13098 8633 9205 5945 3242 8875 7112 3651 3330 2779 1721 -1414 363 6517 6544 7065
8363 7065 8547 10165 12019 7793 6389 -653 -5002 -5697 -5188 -8021 -9498 -6917 3337 11629 10009
8348 10009 3869 -2070 826 98 -27 2093 -1326 3116 -4469 -1382 10221 8704 7935 6099 11581
8333 11581 11016 8381 7138 2511 -1722 -4535 -4219 3574 3052 -3624 -6075 345 3561 4582 2804
8318 2804 -1307 2899 2273 6403 164 -4561 -2586 4664 7881 5650 -3452 -5020 2505 5940 6448
8303 6448 -409 1673 8612 6081 -255 -3853 -6811 4903 12390 8446 5299 5411 10529 4671 -2716
8288 -2716 -559 5554 3523 90 -3198 -11076 -11154 -9315 -1364 4006 3877 8231 4549 2111 -1171 -2674
8272 -2674 -4673 -403 -1042 273 -3497 -2196 -742 -6735 -10213 -3662 6980 15322 8369 -3041 -5532
8257 -5532 -12774 -15914 -14831 -16019 -19733 -14015 -11452 -7921 -12016 -10832 -12744 -15830 -15159 -14897 -6449
8242 -6449 -6582 -7697 -11304 -8600 7493 11016 5625 -2129 545 -1340 2922 -1845 -10316 -13610 -6358
8227 -6358 -8042 -643 4555 5701 -2055 -9976 -10524 -7318 -9991 -4215 -135 -2288 -4086 -3590 -5623
8212 -5623 -8346 -9651 -10029 -10157 -10173 -9822 -1747 -749 1844 8833 11533 6982 3576 6152 6647 2205 3466
8195 3466 13509 18773 25071 28203 22523 14323 8650 323 -463 -2246 -64 7031 7825 11416 13676
8180 13676 18057 21558 21487 18341 18307 15251 18293 23618 23478 17065 15002 16411 20927 24335 24823 23090
8164 23090 25576 24094 24161 32084 34389 33668 29975 35514 42001 39233 35668 22345 19328 22436 31296
8149 31296 24577 18190 13938 20426 16180 15638 28540 31286 26250 21399 18321 20613 20436 18425 24493
8134 24493 26734 26603 28184 23412 27232 36287 39975 32776 36828 38461 40177 33033 30070 26753 24614
8119 24614 24066 26547 26918 28763 31710 32107 19540 17713 23315 29641 32480 20857 18064 28878 36324
8104 36324 36960 37222 40133 48179 46659 45145 41732 39969 46267 47559 41900 48185 49793 52976 58212
8089 58212 60280 73127 80803 83878 88785 86519 85533 84398 87492 87244 85253 88255 94456 87664 75661
8074 75661 77513 72677 74103 72071 73961 80749 91369 97194 100974 104429 108989 101072 94097 86961
8060 86961 86607 90005 103749 113115 107384 114379 124942 126016 134923 139415 138817 139001 146464 162287 179754
8045 179754 196192 216358 229685 235271 242843 247805 248962 251819 250598 244647 239320 242754 234888 236456
8031 236456 223995 206761 188503 185018 178843 171621 168071 161922 157675 160259 156742 149367 146501 154373
8017 154373 152349 147716 151539 154731 158161 159540 161651 167697 167438 176107 179602 179729 184798 196905 208035
8002 208035 224331 240809 251030 252261 253034 259570 256893 244478 237379 240823 231022 221817 215688 198568
7988 198568 180747 172488 166655 154453 145096 135168 127259 116514 115771 117819 127538 132511 129096 128042
$$ [...]
##END NTUPLES=NMR SPECTRUM
##END=
